##TITLE=Analysis number 312345
Compound Code cc 33846
Book Reference 416/198
Project Code adrs
Chemist Name stevep
##JCAMPDX= 6.0         $$ Bruker NMR JCAMP-DX V2.0
##DATA TYPE= NMR SPECTRUM
##DATA CLASS= NTUPLES
##ORIGIN= Bruker BioSpin GmbH
##OWNER= NMR
$$ XWIN-NMR		Version 3.5
$$ Tue Aug  2 11:40:06 2005 GMT Daylight Time (UT+1h)  MAYBRIDGE\NMR@NMR_250MHZ
##.OBSERVE FREQUENCY= 250.131544655141
##.OBSERVE NUCLEUS= ^1H
##.ACQUISITION MODE= SIMULTANEOUS (DQD)
##.ACQUISITION SCHEME= undefined
##.AVERAGES= 16
##.DIGITISER RES= 18
##SPECTROMETER/DATA SYSTEM= dpx250
##.PULSE SEQUENCE= zg30
##.SOLVENT NAME= CDCl3
##.SHIFT REFERENCE= (INTERNAL, CDCl3, 0, 16.522)
##AUDIT TRAIL= $$ (NUMBER, WHEN, WHO, WHERE, WHAT)
$$ ##TITLE= Audit trail, XWIN-NMR		Version 3.5
$$ ##JCAMPDX= 5.01
$$ ##ORIGIN= Bruker BioSpin GmbH
$$ ##OWNER= NMR
$$ C:\u/data/dgb/nmr/ADRS/7020/pdata/1/auditp.txt
$$ ##AUDIT TRAIL=  $$ (NUMBER, WHEN, WHO, WHERE, WHAT)
(   1,<2005-08-02 11:39:31.26 +100>,<MAYBRIDGE\NMR>,<NMR_250MHZ>,
      <created by zg, POWCHK disabled, PULCHK disabled
       configuration hash MD5:
       62 19 C7 07 E1 42 D1 B7 37 6C 3D D0 77 39 F9 E6
       data hash MD5: 64K
       BF 20 12 A9 35 CF 94 94 67 0F 85 A2 AD 4E A0 54>)
(   2,<2005-08-02 11:39:48.40 +100>,<MAYBRIDGE\NMR>,<NMR_250MHZ>,
      <Start of raw data processing
       ef LB = 0.3 FT_mod = 6 PKNL = 1 SI = 32K 
       data hash MD5: 32K
       49 40 09 7C 02 D2 50 C5 65 86 01 8A E3 2B 5A E5>)
(   3,<2005-08-02 11:39:51.65 +100>,<MAYBRIDGE\NMR>,<NMR_250MHZ>,
      <apk 
       data hash MD5: 32K
       43 1A FF 70 80 F6 1F 4A 54 73 97 55 EA FD 68 C7>)
(   4,<2005-08-02 11:39:53.12 +100>,<MAYBRIDGE\NMR>,<NMR_250MHZ>,
      <abs ABSG = 5 
       data hash MD5: 32K
       DA 04 AB A3 61 AA 0E 22 15 E8 55 F3 3A FB C2 39>)
$$ ##END=
$$ 
$$ hash MD5
$$ 34 75 84 A3 1F 81 AF 0D 42 F0 52 EF C3 74 E3 1B
##$RELAX= 
##$RELAX= 
##$RELAX= 
##$RELAX= 
##$RELAX= 
##$RELAX= 
##$RELAX= 
$$ Bruker specific parameters
$$ --------------------------
##$DU= <C:\u>
##$EXPNO= 7020
##$NAME= <ADRS>
##$PROCNO= 1
##$TYPE= <nmr>
##$USER= <dgb>
##$AMP= (0..31)
100 100 100 100 100 100 100 100 100 100 100 100 100 100 100 100 100 100 
100 100 100 100 100 100 100 100 100 100 100 100 100 100 
##$AQSEQ= 0
##$AQ_mod= 3
##$AUNM= <au_zg>
##$AUTOPOS= <17 >
##$BF1= 250.13
##$BF2= 250.13
##$BF3= 250.13
##$BF4= 250.13
##$BF5= 500.13
##$BF6= 500.13
##$BF7= 500.13
##$BF8= 500.13
##$BYTORDA= 1
##$CFDGTYP= 0
##$CFRGTYP= 5
##$CHEMSTR= <none>
##$CNST= (0..31)
1 1 145 1 1 1 1 1 1 1 1 1 1 1 1 1 1 1 1 1 1 1 1 1 1 1 1 1 1 1 1 1 
##$CPDPRG= <>
##$CPDPRG1= <>
##$CPDPRG2= <>
##$CPDPRG3= <>
##$CPDPRG4= <mlev>
##$CPDPRG5= <mlev>
##$CPDPRG6= <mlev>
##$CPDPRG7= <mlev>
##$CPDPRG8= <mlev>
##$CPDPRGB= <>
##$CPDPRGT= <>
##$D= (0..31)
0 1 0 0 0 0 0 0 0 0.06 0 0 0 0 0 0 0.0002 0 0 0 0 0 0 0 0 0 0 0 0 0 0 
0 
##$DATE= 1122979169
##$DBL= (0..7)
120 120 120 120 120 120 120 120 
##$DBP= (0..7)
150 150 150 150 150 150 150 150 
##$DBP07= 0
##$DBPNAM0= <>
##$DBPNAM1= <>
$$ [...]
##$SUBNAM7= <"">
##$SUBNAM8= <"">
##$SUBNAM9= <"">
##$SW= 20.6930455092707
##$SWIBOX= (0..15)
0 0 3 0 0 0 0 0 0 0 0 0 0 0 0 0 
##$SW_h= 5175.983436853
##$TD= 65536
##$TD0= 1
##$TE= 295.16
##$TE2= 300
##$TE3= 300
##$TEG= 300
##$TL= (0..7)
0 120 120 120 120 120 120 120 
##$TP= (0..7)
150 150 150 150 150 150 150 150 
##$TP07= 0
##$TPNAME0= <>
##$TPNAME1= <>
##$TPNAME2= <>
##$TPNAME3= <>
##$TPNAME4= <>
##$TPNAME5= <>
##$TPNAME6= <>
##$TPNAME7= <>
##$TPOAL= (0..7)
0.5 0.5 0.5 0.5 0.5 0.5 0.5 0.5 
##$TPOFFS= (0..7)
0 0 0 0 0 0 0 0 
##$TUNHIN= 0
##$TUNHOUT= 0
##$TUNXOUT= 0
##$USERA1= <user>
##$USERA2= <user>
##$USERA3= <user>
##$USERA4= <user>
##$USERA5= <user>
##$V9= 5
##$VALIST= <valist>
##$VCLIST= <CCCCCCCCCCCCCCC>
##$VD= 0
##$VDLIST= <DDDDDDDDDDDDDDD>
##$VPLIST= <PPPPPPPPPPPPPPP>
##$VTLIST= <TTTTTTTTTTTTTTT>
##$WBST= 1024
##$WBSW= 4
##$XGAIN= (0..3)
0 0 0 0 
##$XL= 0
##$YL= 0
##$YMAX_a= 388291
##$YMIN_a= -554727
##$ZGOPTNS= <>
##$ZL1= 120
##$ZL2= 120
##$ZL3= 120
##$ZL4= 120
##$ABSF1= 16.522
##$ABSF2= -4.171173
##$ABSG= 5
##$ABSL= 3
##$ALPHA= 0
##$AQORDER= 0
##$ASSFAC= 0
##$ASSFACI= 0
##$ASSFACX= 0
##$ASSWID= 0
##$AUNMP= <proc_1d>
##$AZFE= 0.1
##$AZFW= 0.1
##$BCFW= 0
##$BC_mod= 0
##$BYTORDP= 0
##$COROFFS= 0
##$CY= 12.5
##$DATMOD= 1
##$DC= 0
##$DFILT= <>
##$DTYPP= 0
##$F1P= 14.0000005364418
##$F2P= -0.99999901652339
##$FCOR= 0.5
##$FTSIZE= 32768
##$FT_mod= 6
##$GAMMA= 0
##$GB= 0
##$INTBC= 1
##$INTSCL= 1
##$ISEN= 128
##$LB= 0.3
##$LEV0= 0
##$LPBIN= 0
##$MAXI= 10000
##$MC2= 0
##$MEAN= 0
##$ME_mod= 0
##$MI= 0
##$NCOEF= 0
##$NC_proc= -4
##$NLEV= 6
##$NOISF1= 0
##$NOISF2= 0
##$NSP= 0
##$NTH_PI= 0
##$NZP= 0
##$OFFSET= 16.522
##$PC= 1
##$PHC0= -76.33282
##$PHC1= 1.459486
##$PH_mod= 1
##$PKNL= yes
##$PPARMOD= 0
##$PSCAL= 4
##$PSIGN= 0
##$REVERSE= no
##$SF= 250.13
##$SI= 32768
##$SIGF1= 0
##$SIGF2= 0
##$SINO= 400
##$SIOLD= 32768
##$SREGLST= <1H.CDCl3>
##$SSB= 0
##$STSI= 32768
##$STSR= 0
##$SW_p= 5175.98343685301
##$SYMM= 0
##$S_DEV= 0
##$TDeff= 65536
##$TDoff= 0
##$TI= <Analysis number 999999
Compound Code 99
Book Reference 9
Project Code 9>
##$TILT= no
##$TM1= 0
##$TM2= 0
##$TOPLEV= 0
##$USERP1= <user>
##$USERP2= <user>
##$USERP3= <user>
##$USERP4= <user>
##$USERP5= <user>
##$WDW= 1
##$XDIM= 32768
##$YMAX_p= 469817678
##$YMIN_p= -262316
$$ End of Bruker specific parameters
$$ ---------------------------------
##NTUPLES= NMR SPECTRUM
##VAR_NAME=  FREQUENCY,     SPECTRUM/REAL,   SPECTRUM/IMAG
##SYMBOL=    X,             R,               I
##VAR_TYPE=  INDEPENDENT,   DEPENDENT,       DEPENDENT
##VAR_FORM=  AFFN,          ASDF,            ASDF
##VAR_DIM=   32768,         32768,           32768
##UNITS=     HZ,            ARBITRARY UNITS, ARBITRARY UNITS
##FACTOR=    0.157963299565203, 1,           1
##FIRST=     4132.6476996994, 0,             0
##LAST=      -1043.33573715361, 0,           0
##MIN=       -1043.33573715361, -262316,     0
##MAX=       4132.6476996994, 469817678,     0
$$ Real data points
##PAGE= N=1
##DATA TABLE= (X++(R..R)), XYDATA
$$ [...]
20394 2198 -1018 -7880 -19864 -16592 -4371 7843 22706 28387 2473 -8327 27231 19905 -9763
20381 -9763 -9011 -25057 -17554 3899 6676 -34987 -72248 -52875 -54946 -39635 -40188 -10888 -2381
20368 -2381 -21439 -22264 2380 21301 22478 475 -20112 -34367 -10805 24411 19940 16054 -4010
20355 -4010 -30469 -33418 -34341 -35294 -11703 18538 25785 2430 -19369 -22099 -14412 12513 21718 22729
20341 22729 28185 29686 13456 -675 -11348 -44448 -65778 -75131 -54385 -26523 -25399 7408
20329 7408 17860 9753 -26633 -57858 -34430 1657 -11144 -16645 -20013 21362 50623 44868 20534
20316 20534 -3813 -14721 -27039 -9667 -8445 -37132 -28986 -36313 -40523 -24015 -9105 -13615 -28641
20303 -28641 -14988 -31 6800 13629 11530 5760 6971 8843 15522 -3805 6586 19107 31187
20290 31187 46626 48189 -1724 -7309 -8690 -22747 -34167 -11026 1958 -13735 -34984 -50413
20278 -50413 -41992 -44499 -39614 -29257 -17499 -16785 -9697 -1799 7509 12308 6629 -3977 -11458 705
20264 705 -3388 -314 -8625 -15066 19359 35887 38714 49125 47697 36414 21793 28741 13085
20251 13085 7000 4323 -5578 -3935 8606 22155 13784 9202 18423 30739 16876 -14734 5276
20238 5276 26729 12032 19075 18542 4615 -888 6641 -14142 -28247 -19644 -42339 -36684 -19530
20225 -19530 -18962 -39143 -51798 -52824 -46558 -37095 -50832 -69027 -36739 -28030 -27893 -39686 -22739
20212 -22739 11956 17864 -2148 -17637 -47177 -41395 -32585 -32294 -22613 -12749 -31206 -31500 -7221
20199 -7221 21137 10306 -8176 -9319 -8389 -38238 -22123 -16670 -2604 18117 22689 31959 15346
20186 15346 -17964 -26649 10897 13372 -26829 -62989 -49385 -32906 -35998 -25864 -18410 -26313 -33381
20173 -33381 -16606 5811 17391 6134 -6696 -14983 -24171 -15026 7719 -5949 -34751 -39846
20161 -39846 -11313 10582 29715 38272 7810 4389 9155 12235 7806 -26984 -13922 15309 9248
20148 9248 -32261 -18998 -29089 -59430 -43007 -27915 -12101 16260 8769 29170 45129 42907
20136 42907 14377 -37048 -30082 -22037 -22174 -56761 -76585 -85837 -49685 -11093 -23605 -21884 -20622
20123 -20622 1844 578 4691 -20940 -36594 -21296 -49128 -55882 -33429 -53285 -53547 -60546 -50747
20110 -50747 -45744 -45102 -53864 -63424 -59036 -38903 -8282 -14258 -34732 -53755 -48720 -35913 -50093
20097 -50093 -43102 -50996 -31759 -1145 30336 33976 29360 10887 -36509 -57906 -85637 -97071
20085 -97071 -99904 -86574 -48759 -45255 -33222 -41269 -66215 -55689 -34651 -29553 -41697 -47028 -42212
20072 -42212 -7574 -4225 3226 9624 -17275 -23078 -20363 -24094 -8310 -501 -27216 -42212 -34270
20059 -34270 -38440 -33028 -45323 -56506 -36627 7001 21725 8172 2657 -11945 -26005 -5613
20047 -5613 -970 19536 34759 -205 -29311 -43423 -22343 -7838 -42829 -56174 -50557 -45115
20035 -45115 -45989 -42240 -32613 -48016 -43712 -31771 -21310 -8308 -8163 -13899 24533 35208 21567
20022 21567 -15879 -20047 -10346 4005 27054 27835 18854 -3070 -11491 -26454 -50011 -30775 -15994
20009 -15994 15423 -3218 -29251 -45397 -50399 -44638 -46520 -32023 -20909 -45071 -51680 -34900
19997 -34900 -34491 -21298 5346 -15139 -42613 -56464 -69805 -56665 -53791 -30332 899 16748
19985 16748 798 22194 -778 6814 9420 15254 9066 2365 13171 17667 19151 5659 14143
19972 14143 28721 55650 75329 63437 23445 -22468 -29402 -38468 -52074 -35129 -1884 18206
19960 18206 12315 8697 12920 9747 -9141 -28806 -26608 -41255 -40153 -22515 10106 -543 -21710
19947 -21710 -25058 -3407 14200 -5582 -10109 -10039 -6748 103 19603 24980 20990 17229 9854 10397
19933 10397 2260 -31636 -30158 -11512 -18264 -29404 -21649 -5851 9838 19165 15904 6320 -18199
19920 -18199 -19592 -11933 -26524 -44246 -3321 7079 -38879 -55099 -49431 -39811 -25716 13486
19908 13486 25717 35658 23613 9763 -2856 8818 -3569 -10982 -16102 -39726 -33525 -22926
19896 -22926 -24458 -32401 -22416 -19562 -25629 -17028 -2987 20405 24304 7620 1319 -24772 -32206
19883 -32206 -12730 15134 24837 30767 11384 -13722 -18460 -11424 18681 4289 -7456 15793
19871 15793 20190 -10297 -29559 -21134 -37867 -35533 -3674 47603 42180 7790 -16421 -11445 18738
19858 18738 37022 20135 -8340 2918 1986 -7956 -38761 -63851 -45581 -30510 -22323 -30815 3969
19845 3969 9247 -1289 -14823 -24600 3022 13405 -2478 -14367 -22523 -20789 -13547 -3669 -7994
19832 -7994 -20919 -43926 -58790 -61480 -53184 -45666 -51603 -37417 -40843 -29796 -7003 -9343 -23672
19819 -23672 -8979 11810 26070 6892 -2826 -11417 -14510 -10055 10244 -473 -4111 -24374 -23616
19806 -23616 -17583 -502 9767 -11797 12657 46443 24889 -11676 2544 -10546 -26221 -5132
19794 -5132 9046 -7208 -12424 -9438 -4343 -10093 -14603 -26399 -25636 -25756 -49794 -26870 -14620 -8213
19780 -8213 -25264 -48987 -38842 -20982 -27894 19779 50169 40877 21671 3527 -2075 -434 15557
19767 15557 7061 -12720 -25165 -16690 -8142 -557 7224 -618 -5030 -2196 -22773 3596 14363
19754 14363 6585 -23697 -17867 14814 7305 -24618 -37245 -27448 -12230 -8697 21774 17851 2182
19741 2182 2846 9835 21188 13190 -24571 -19250 -20973 -48677 -33088 -31468 -38729 -28552 -31618 -37127
19727 -37127 -56211 -66870 -77402 -59060 -36221 -24566 -17972 -3450 -18960 -18232 -13766 -1057
19715 -1057 -30314 -31786 -32885 -25797 -10879 3707 -9320 -26090 -14430 -26164 -33944 -29756 -25824
19702 -25824 -32292 -60376 -56435 -42880 -43420 -30724 4068 517 -19652 -41112 -65134 -48001 -24821
19689 -24821 -6289 7112 -16338 -40298 -33352 -13408 5402 20264 15979 14355 404 -8576
19677 -8576 -17127 -37972 -65613 -82495 -62165 -47525 -23141 -23353 -18288 -2175 13965 21319 52188
19664 52188 48310 11203 -12283 -24998 -32234 -12944 6823 6799 -13651 -9008 -14830 -18790 2169
19651 2169 6158 -362 -19512 -24894 -4818 -21432 -25900 -13453 8601 5874 -5780 -7862 14005
19638 14005 1304 -18011 -22325 -533 18488 22201 16099 1359 -12126 -14115 6611 -10050
19626 -10050 22771 31029 -7941 -3664 7762 -1696 -8676 -55623 -63890 -44366 -19427 7114 -1153
19613 -1153 -11423 -15414 -2662 9414 2084 1450 900 21260 17426 -2814 -3390 -3736 -11049 -12223
19599 -12223 -7857 -6135 10083 15869 18708 13083 -16436 -36785 -33719 -35275 -30948 -9019 -7179
19586 -7179 -8849 10891 29165 37083 45372 23998 -8083 -21089 -11663 -15845 -35155 -23619 -20287
19573 -20287 -15200 -26024 -28361 -25301 -4762 12295 9383 -2498 -5536 -15672 -736 14454 6289
19560 6289 2128 -21827 -39824 -49921 -30392 -24304 -13365 -13975 -7204 -2163 -5955 19429 24370
19547 24370 18330 22548 731 -22795 -53075 -58820 -35513 -22330 -21868 -42778 -41050 -36679 -10045
19534 -10045 -223 -4398 29660 44498 45295 40292 28901 17300 34606 15100 3626 13449 3179
19521 3179 -8921 -15158 -18547 280 13948 19370 863 -18698 -5808 17335 26185 10239 -9604
19508 -9604 -7859 -10828 1514 30844 37374 48394 46369 25233 13588 32551 30732 12600 441
19495 441 -12019 -6115 -22341 -31999 -29958 -67518 -42277 -9832 -27671 -11822 22356 30475 -141
19482 -141 -24619 -15245 -7683 -18184 -23725 -6404 -3754 -3808 -11528 -10151 -11784 -10384 -11205 -28993 -51316
19467 -51316 -29372 -11562 -9770 4499 2803 -10877 11302 -6731 -20898 -25305 -30164 -28103 -26375
19454 -26375 -7006 13274 44544 8076 -31021 -19804 -29255 -33273 -40819 -48806 -63234 -58989 -62555
19441 -62555 -70440 -57642 -52841 -35646 -24563 -3040 -4765 -15166 -5282 -6645 1720 34501 34135
19428 34135 31726 23064 15664 4504 -22328 -17791 -17795 -11644 -16761 -47003 -55916 -23127 1882 8015
19414 8015 19308 -6888 -38180 -29335 -38250 -40565 -44766 -30370 -21504 -34664 -55752 -57211 -25637
19401 -25637 -17941 -22447 -19958 -1373 22991 37248 13277 -6319 -13888 -1957 9206 -14642
19389 -14642 -33800 -26071 -42302 -47951 -33575 -46076 -30169 -6781 -6029 -18227 -24726 -6392 -5931
19376 -5931 6531 1153 -13047 -12900 -22583 -19086 -37100 -59246 -52230 -32472 -25685 727 23355
19363 23355 3986 6469 25207 -4899 -28697 -38405 -48780 -25583 -830 2088 -16310 -10860
19351 -10860 -10419 -37926 -20982 6552 15431 9522 -1753 -7474 -11363 -42930 -36414 -22193 -18183
19338 -18183 -21753 -37054 -27400 -39116 -67132 -54675 -36792 -5138 17728 26776 11283 -311
19326 -311 -23082 -13702 2603 -12733 -12061 -36669 -42589 -38813 -19623 -10474 -6993 6949 30360
19313 30360 26391 -9028 -31982 -6582 -6942 -18405 -6472 -9349 -18681 -5170 9126 49181 40702
19300 40702 4333 -14700 -15206 -14171 -1262 -5405 -21400 -585 5657 23307 34807 48917 68626
19287 68626 56093 39253 10402 -1143 9842 21622 2498 -25417 -34858 -15741 -3382 8356
19275 8356 -8109 -15605 -16187 -17597 -31453 -28952 -6366 11942 -10675 -17322 -9686 17463 17002 27931
19261 27931 22850 -5822 -39512 -39375 -30860 -10267 -1422 -4928 8940 7976 6620 -27379 -41564
19248 -41564 -42252 -37439 -38013 -33244 -43690 -63582 -45428 -11529 -2339 -14596 -23439 -36992 -21280
19235 -21280 21434 70275 52510 39882 47370 44766 35459 37280 46196 15715 -12558 2050 20855
19222 20855 20363 8245 -14443 -6893 335 29672 58477 46864 21804 19168 39672 23954 1807
19209 1807 -29305 -26545 -21817 -9701 18725 35435 44249 31870 -5163 -5175 16508 14087 4049
19196 4049 17745 13843 -13045 -28977 -45738 -41596 -42055 -47116 -58663 -34963 -16648 -24465 -21069
19183 -21069 -16707 -2149 -4807 -24853 -44704 -79758 -97526 -49210 -22721 -2756 1165 -14316
19171 -14316 -2956 -13543 -30653 -20147 -14786 -7099 -8400 -10482 -9476 -16722 -6694 15718 30682
19158 30682 17827 -13019 -26681 -27327 -24425 -5322 -1834 886 -27390 -10458 -26668 -39345 -64631
19145 -64631 -32130 2778 2977 -8617 -10839 -9338 -34027 -72256 -70930 -39503 -14383 8989 6829
19132 6829 -6884 1543 15632 31773 34566 3416 7199 25880 8622 -29926 -22055 -7387 15886
19119 15886 3105 -13912 -14050 -31104 -47013 -44758 -13519 4566 37151 15710 18542 1712
19107 1712 -1097 -6522 -6189 -446 -13904 409 13083 28836 21299 -2955 -13022 -30031 -54277
19094 -54277 -58817 -59590 -51663 -35547 -22433 -12412 -5942 -14208 3519 -4220 -6535 -646 5984 419
19080 419 -11658 -29689 -45769 -2676 35039 34491 10880 -5433 30334 47210 38889 39013 32615
19067 32615 20941 42144 51212 59726 75450 64201 48579 44864 13850 -2408 6949 10176 25958
19054 25958 9413 -11650 -39895 -23221 4234 49887 62160 81355 70837 37732 19605 33961
19042 33961 18933 11549 -407 1831 21152 19350 -515 -2886 -14594 -8489 11980 15591 1663
19029 1663 -9115 12237 42272 20972 -27597 -43238 -45525 -27664 -15437 -13456 -32357 -43216
19017 -43216 -27157 -4006 33777 47223 34658 4315 -7153 6223 35141 22217 20247 21905
19005 21905 -10104 -5368 1278 34903 38994 22811 12612 22503 33543 9103 -13041 12915
18993 12915 26225 6680 -2742 15062 18874 38248 48990 37992 30576 26781 15546 6802 30237
18980 30237 32489 35591 31931 26371 -4881 -29901 -7848 -4287 -9478 -2841 -22488 -18975 -17631
18967 -17631 -19400 -1003 -4766 14336 30175 27791 52895 47620 14984 -3427 -9458 -22666 -34652
18954 -34652 -18951 -17017 -5850 1799 11479 7477 23851 31065 15130 -3041 37222 40984 4928
18941 4928 -14044 10647 27058 23354 5616 15260 4069 20948 53620 58712 43280 32485
18929 32485 21838 32341 14330 -9629 -11694 -30141 -36733 -43846 -33006 -20699 11872 -10695
18917 -10695 -47265 -53541 -34530 -2496 25401 12933 29614 36368 21190 -13462 -18285 22548
18905 22548 13295 -2904 556 -469 10527 7730 10480 15502 -21363 -18469 12143 -5648 -21112
18892 -21112 -20664 -16606 650 12825 26410 8197 -6263 -12239 -17457 13962 27930 19235 15010
18879 15010 -23456 -49517 -47335 -7333 -5019 -6026 9766 21314 13383 34077 30501 44960 37905
18866 37905 35070 18825 12790 10634 16018 50973 45521 48639 51090 70614 72751 65340 36750
18853 36750 21541 22336 41968 25207 9508 13095 27902 10476 -4351 -1270 3598 -8266 9737
18840 9737 5089 -15116 -24458 -22433 -7194 1522 -2907 -23277 -18295 3579 -27677 -51354 -40935
18827 -40935 -35130 -4202 6402 -10862 -33705 -32543 -36550 -43781 -52516 -40641 -5620 16341 23761
18814 23761 22628 2728 1295 -3377 -10319 -20182 -19114 -16396 -11376 11995 51511 66984 41120
18801 41120 51 280 -22039 -33263 -22571 2366 14031 -5529 -6934 -11870 -37729 -59993
18789 -59993 -67188 -40613 -14201 -18509 -23195 -2309 -1523 -26292 -8947 13514 -302 18617 38571
18776 38571 15139 37807 41283 44068 28933 50516 75583 117694 179072 232369 249172 235678
18764 235678 225431 192378 140178 84168 70833 69987 58844 71786 68466 52281 25031 -885
18752 -885 -23390 -13412 -15129 9867 40302 58907 37492 17977 16 -7609 -12192 7037 33564
18739 33564 19922 14736 5866 32343 55496 46742 38716 31987 18861 41385 28151 271 -18975
18726 -18975 651 22299 14909 13284 17028 46129 40204 -321 954 16607 9142 -27919 -27714
18713 -27714 -11463 -15847 -5384 21177 24384 12150 16587 3992 4662 -4074 -20011 -20281 587
18700 587 19948 31934 36434 56496 48502 34302 27604 31161 16638 15885 12124 6453 17586 7189
18686 7189 -13538 -22474 -11918 17708 26274 64587 49776 38861 36123 34945 32145 31012 28827
18673 28827 18203 6614 22347 53287 41213 17186 -2950 -459 10241 21128 16333 6762
18661 6762 -19572 -30597 -44664 -34404 -38049 -30442 -6405 -7558 6851 16753 4222 235 13178
18648 13178 43927 23754 -5905 -8219 4367 13346 12235 -13058 -18024 -455 29072 29393 15704
18635 15704 23647 47001 21909 10182 12595 -10662 -33961 -59077 -64833 -34535 21290 52600
18623 52600 43589 43188 35522 28522 35775 24997 24301 30769 67847 71817 75939 97586 131302 139726
18609 139726 137436 160888 155766 167790 184341 176926 138917 116996 84205 77061 63542 45253
18597 45253 28507 42095 21344 36442 48108 37142 -11622 -6565 -11278 -21252 -14741 -20292 -6570
18584 -6570 12708 19586 37631 46741 52647 57559 45800 46239 71273 67404 61595 69194 63054 45503
18570 45503 52758 66971 57850 78223 135255 169873 222877 279317 305405 368056 425116 419111
18558 419111 392945 365838 346542 305574 274538 254789 215226 187959 178034 139528 72264 64024
18546 64024 106156 98199 79948 86060 85909 82459 61858 54144 59470 60483 48349 40773 58609
18533 58609 42217 16468 12135 823 44696 80260 82117 68708 57292 43491 22948 19530
18521 19530 37980 58417 70407 90880 94887 100323 122876 158323 146122 157772 195870 208354
18509 208354 220217 259117 254732 206361 161394 141629 115331 83478 76255 50007 57962 64630
18497 64630 62037 49182 44801 16403 11522 48251 43401 32540 36397 -1005 -23632 -24032 11522
18484 11522 42596 61321 63959 56955 33235 41052 53974 60253 59584 41846 37312 30879 38596
18471 38596 28137 20474 -9374 -23386 -1661 -18099 4680 23970 36004 23814 27884 44348
18459 44348 60158 40190 28293 29785 32981 40163 23889 5542 22847 40291 63188 68242
18447 68242 41587 43487 43823 44624 48972 48106 52469 33675 33377 38164 31346 27464 64261 43092
18433 43092 30497 53565 50324 24596 27678 14587 10449 11117 9971 -7835 -17249 5090 1232
18420 1232 -507 4350 4609 6883 -1435 7285 28299 27203 34731 29954 33396 79063 69247 41959
18406 41959 24382 34759 20169 13162 10492 16820 44764 70413 47544 41566 32009 35922 63072
18393 63072 64574 54010 60248 74432 80033 73757 71117 43488 14482 34047 40764 46212 36110
18380 36110 25412 44731 40647 52625 46132 26334 40645 59845 79626 100377 88965 89855
18368 89855 96319 88649 53541 36164 43884 34153 42749 56638 80595 86677 79794 58648 53394
18355 53394 46304 67808 78083 92937 106585 116225 124951 109545 93174 93376 82406 77776 63102
18342 63102 44884 29422 25785 25481 14736 31638 45144 62429 68589 43698 48766 36595 28901
18329 28901 48275 57573 46499 70659 93793 114679 108518 126711 152429 150938 129640 121163
18317 121163 123103 129335 124966 111058 105259 116196 96608 71032 55511 67323 74529 83857 93312
18304 93312 128163 165253 146932 127483 140155 143057 139169 118932 79408 59909 51552 84244
18292 84244 87447 99367 102884 104431 87814 58265 26997 34061 58378 87358 79182 50248 32715
18279 32715 44144 41742 50586 33297 30634 83180 85300 70088 66814 51993 63929 59389 28884
18266 28884 18235 27825 86238 102399 86681 103494 151629 141240 138273 117753 88314 90071
18254 90071 101528 115065 128068 169359 179236 169358 160078 162177 149797 143008 142825 158265 178705
18241 178705 161867 156617 206037 241710 263089 267595 257416 259559 255230 217875 163442 168360
18229 168360 182151 173892 163344 146780 133570 116934 116952 126279 136027 141460 129407 103621 94551
18216 94551 82081 97135 103929 97824 107255 136154 158454 143551 125431 146757 139935 166164
18204 166164 173907 176692 172953 168520 186017 215838 224675 232342 238619 252421 282090 306146 307714
18191 307714 322135 331762 347775 344967 331053 323632 315664 296409 283555 271715 228151 210155
18179 210155 222488 246119 274275 292204 261335 240321 245447 260316 277231 278872 281657 286973
18167 286973 307264 310177 332325 341355 350650 359885 382186 406507 448200 451798 434989 429845 421231
18154 421231 435777 455987 481320 509370 539269 559573 600695 633229 628002 700220 806883
18143 806883 879809 908601 1024646 1134137 1188733 1231272 1268294 1286689 1306886 1341559 1392230
18132 1392230 1432025 1495317 1604116 1753954 1921797 2136216 2377808 2700653 3123269 3685516
18122 3685516 4412528 5407744 6801637 8783475 11662878 15814385 21296010 27741094
18114 27741094 34337528 40490493 46198250 52122517 59950641 67957145 67996484 61925280
18106 61925280 54398382 44470383 34128580 25676823 19646930 15522376 12415576 9829549
18098 9829549 7777889 6331497 5340392 4688544 4316527 4077898 3929613 3820494 3751815
18089 3751815 3692817 3611707 3538209 3489676 3435975 3353072 3304600 3318750 3373555 3466153 3666545
18078 3666545 3964917 4361354 4905919 5648268 6656602 8044621 10003447 12839170 17002149
18069 17002149 22932632 30699540 39767633 49197884 58081999 65186339 69342028 70361951
18061 70361951 68703266 64576497 58215090 50505609 42472193 34784826 27899018 22086057
18053 22086057 17438010 13867276 11142024 9022041 7398123 6176838 5303419 4695714
18045 4695714 4294091 4070485 3942949 3898204 3911817 3949151 3971791 3941780 3888525 3781210
18035 3781210 3671033 3572505 3489607 3405928 3341831 3305060 3370543 3490765 3693768 3948959
18025 3948959 4317346 4866937 5634773 6741872 8336429 10623568 13976520 18820296 25164534
18016 25164534 32392018 39281118 44730248 47756640 47539706 44257688 38971426 32778241
18008 32778241 26601575 21058225 16526675 12988063 10212950 8049360 6352441 5022597
18000 5022597 4045033 3327292 2784039 2393575 2105325 1921023 1777079 1651847 1553174 1509104
17990 1509104 1472196 1456933 1453284 1412873 1361530 1308085 1197495 1099779 1011938 923364 844830
17979 844830 784540 731119 675560 631280 583271 527426 475611 447221 429194 415843 434685
17968 434685 502810 524615 525973 544126 555425 542119 499545 445323 400265 381126 362040 349173
17956 349173 340647 317992 295091 303035 342349 383988 419747 433805 452490 476864 476818 488437
17944 488437 489166 500445 517084 525320 537392 511201 489642 496224 501855 451872 454204 437392 434471
17931 434471 430057 390591 346670 299589 250121 219758 207381 233407 256677 266235 294952 317477
17919 317477 321254 327189 361663 388569 375761 354941 341186 366688 397114 408184 407374 416226
17907 416226 422517 427274 436251 437893 466425 489203 494072 476653 465160 459712 463270 487011 452853
17894 452853 436512 436068 441848 433476 427780 411384 366312 335312 303785 269924 257685 252857 236115
17881 236115 236017 212059 160912 147403 151046 123235 80776 71005 77853 58699 80748 129029 152639
17868 152639 139645 191536 222636 234082 236316 245936 252253 248311 274460 279504 281402 251169 222860
17855 222860 204794 211348 196685 213878 235769 232367 225942 196028 191586 196501 183527 190148 207795
17842 207795 190634 175671 151366 148472 160418 151514 133290 136792 121147 97332 107418 105140
17830 105140 92824 104590 75990 65368 71324 62955 26120 24307 58833 75596 44190 40749
17818 40749 62500 108503 116667 114172 100331 97007 101957 130425 133504 130663 112079 138973 145340
17805 145340 129270 112272 141528 149681 162543 154662 157278 142842 161797 179031 171429 181314
17793 181314 180735 191364 182647 162107 163541 173395 161201 158769 165925 176221 177841 150641 124161
17780 124161 117690 115388 115211 120684 139387 143179 124306 125576 124053 90355 67275 57766 80349
17767 80349 80836 81236 74604 77950 99897 116879 102958 73398 64245 37119 59361 104561 82463
17754 82463 63956 61300 42270 52549 40964 47197 63743 67483 79742 113531 115874 102223
17742 102223 95915 112548 122494 99735 92788 103723 98103 99737 142839 133082 113840 107490 103356
17729 103356 121752 127587 137407 134132 131849 114547 139911 177834 169122 143442 118352 115896 130417
17716 130417 141726 142381 144469 141890 144946 143237 166589 163172 164515 143772 134471 143393 136138 162697
17702 162697 176778 168095 183905 214901 217293 211182 173686 201319 212515 210241 219885 224811 214588
17689 214588 190802 203008 238182 252849 255237 267799 272129 274727 287232 291850 284372 260193
17677 260193 235548 260127 298762 311657 292698 309668 333621 340133 327492 316649 327438 344156
17665 344156 331808 333634 322336 330589 336804 331870 335198 345030 378402 378329 360877 352437 339158
17652 339158 338114 334594 307206 276949 320478 335414 318228 309580 319354 309215 310956 325082
17640 325082 351788 353684 347180 330773 340411 351913 362450 390581 421400 426517 437544 434938
17628 434938 465490 492941 496610 479803 457287 466133 515401 547045 565893 587500 590767 611538
17616 611538 662718 681925 703347 697104 686098 702591 706779 723141 718516 713979 716431 717257 726124
17603 726124 745709 753481 772821 776935 782239 795978 814788 808019 817549 851079 868669 868703 883741
17590 883741 916448 952257 1001174 1063383 1108503 1134719 1200165 1253407 1341690 1486735 1632707
17579 1632707 1781772 1942385 2111412 2290104 2481062 2691716 2929539 3180629 3479458
17570 3479458 3829462 4263307 4800174 5445448 6246826 7323615 8757412 10636746 12984980
17561 12984980 15798955 19081085 22653775 26279826 29682779 32736350 35311197 37305107
17553 37305107 38850152 40182339 41594420 43296792 45433182 47990930 50816446 53699102
17545 53699102 56424568 58750484 60506119 61562943 61782795 61276708 60280750 58907798
17537 58907798 57307181 55826105 54715281 54088290 53901053 53898662 53732059 53128359 51797978
17528 51797978 49471220 46054398 41826813 37095781 32200070 27418158 23011793 19104058
17520 19104058 15817169 13124341 10960250 9247440 7895247 6809651 5929917 5228073
17512 5228073 4659533 4183439 3796166 3437878 3133096 2859493 2628983 2424941 2266213
17503 2266213 2150835 2046143 1912661 1797641 1711688 1652787 1605957 1545308 1511106 1483244
17493 1483244 1491086 1525314 1536664 1563801 1575630 1571969 1599815 1625058 1636227 1669377 1741764 1777687
17481 1777687 1820226 1865303 1907968 1952571 2018842 2113245 2217029 2257717 2341766 2450800 2578455
17470 2578455 2726809 2867742 3022087 3210085 3421862 3651357 3993345 4422239 4974540
17461 4974540 5712724 6733754 8193383 10051631 12245696 14773725 17772822 21179955
17453 21179955 24718813 28362152 32179840 35947167 39778696 43726504 46967408 48944229
17445 48944229 50207659 50845825 50493664 49339825 47981326 46553746 45154895 44045135
17437 44045135 42909734 41483382 40123382 39115044 38575682 38711255 39805378 41652940
17429 41652940 43716419 45400080 46245485 46204092 45369556 43964753 42283632 40434160 38353821
17420 38353821 36150855 33994123 32163188 31048809 30917224 31889119 33724846 36145150
17412 36145150 38673840 41012031 43023804 44695179 46270194 47998398 49598052 50600129
17404 50600129 51102034 51217847 50973617 50757864 50696802 50295490 49567764 48900187 48005085
17395 48005085 46432255 44538844 42630981 40598957 38667199 36822580 34691299 32233037
17387 32233037 29705468 27190063 24702914 22530758 21006968 20399889 20850498 22369748
17379 22369748 24716661 27526594 30246399 32366723 33687007 34249167 34256002 33897313 33198672
17370 33198672 32056368 30489058 28620890 26621403 24849995 23678633 23331161 23846377
17362 23846377 24964217 26302918 27436298 28088828 28249607 28004542 27429105 26600749 25439721
17353 25439721 23825899 21716172 19225819 16521210 13851597 11417782 9318169 7573591
17345 7573591 6221994 5130875 4282222 3625788 3142315 2762232 2444938 2270867 2126748
17336 2126748 1992887 1857577 1711612 1608815 1486315 1386820 1333976 1258006 1194310 1141229
17326 1141229 1094696 1046051 997626 944531 912378 899539 874698 843252 811744 789291 745372
17315 745372 692040 637423 614638 609983 582525 546654 518486 506995 488377 452778 406613 364149
17303 364149 347161 354382 342392 337281 345720 332153 318250 316639 290128 257572 258145 277070 271780
17290 271780 255481 239503 247869 241112 227959 243287 262502 233491 231204 218333 192657 163516
17278 163516 164345 194756 205788 208892 229544 235600 230995 249272 229034 207162 176191 168542 191495
17265 191495 180950 173535 167287 146054 139126 128594 124226 109631 101637 91786 94759 117136 89655
17252 89655 66304 93501 105545 121347 127310 135390 149949 151672 164769 148309 133252 135417
17240 135417 116358 115706 121709 93581 110930 120600 111246 104785 97322 120467 125557 89391 85377
17227 85377 74743 85162 103631 104275 61666 32656 33906 42115 42816 40718 30262 47321 52352
17214 52352 54120 58274 36343 30759 46848 61276 64801 60954 52834 33904 29563 45284 52156
17201 52156 49220 44854 19915 16219 46389 41748 36380 27148 19136 1159 -6570 -2682 22981
17188 22981 37659 39095 66029 83496 79192 61594 58190 62192 83727 109490 98756 75561
17176 75561 64063 47967 28242 17209 2653 5935 -11480 12347 15888 13479 29818 38244
17164 38244 56220 27539 -6723 -27954 -42990 -9062 42830 47960 38873 22472 12666 24208
17152 24208 14070 2411 11202 -4826 -1420 -20839 -6339 -3681 14599 21335 26142 -6811 -39216
17139 -39216 -29525 -13422 -18169 12748 26986 39613 24450 -11007 -13449 -8445 -22170 -39892
17127 -39892 -19923 -14047 -10371 -34628 -37740 -51252 -32888 -47507 -23669 -20230 -21200 -13211 6733
17114 6733 26287 5842 6287 5205 -8782 6415 25916 -7044 -28264 -26846 -45147 -34248 -18378
17101 -18378 -9160 -7939 -32052 -12269 948 6769 2319 -19083 -25172 -44693 -45073 -66539 -59829
17088 -59829 -67849 -50996 -18350 5000 3385 -4360 9205 11554 21630 13867 -2308 -24251 -24839
17075 -24839 -27679 -28968 13417 27058 44162 65404 91630 121907 131808 147586 191351 227652
17063 227652 245986 253429 254238 222925 216708 229389 242571 264808 284831 293340 297690 316654 332985
17050 332985 334986 305488 300897 286610 275954 263418 241825 228672 240856 241681 230007 213890
17038 213890 177330 142963 151136 166520 151395 99248 70580 56818 40095 30491 19587 -11413
17026 -11413 -6225 8491 -7189 -154 -13904 -12202 8753 20878 34992 29007 18516 12623 1996
17013 1996 -12962 -44372 -53695 -51591 -38185 -15637 -14456 -43447 -46602 -51919 -79403 -82206 -54280
17000 -54280 -38861 -41325 -65495 -46229 -20185 -9342 -7047 5462 -9170 -40982 -50918 -31275
16988 -31275 -14137 -27113 -12307 4691 -22187 -35542 -30812 -20304 9406 4524 -16377 -21929
16976 -21929 -19450 -6762 -5976 -21863 -25331 -18995 3201 12580 12259 17175 38281 33800 1510 -21293
16962 -21293 -31001 -40319 -26402 17346 25132 40934 24223 23499 18383 6181 11030 61641 97078
16949 97078 101534 111339 130556 171186 172924 176599 188898 191470 194971 211630 227827 204889 210161
16936 210161 225297 237846 242720 259614 273356 272334 272717 271016 256163 265250 272396 268953 256439
16923 256439 233677 203808 189712 175736 179442 157340 160744 152717 152458 146015 147702 170649 168933
16910 168933 173253 157237 140837 159628 165727 176279 176427 184054 180459 161907 134149 143045 148750
16897 148750 149815 171466 187183 208551 208520 210777 211009 215544 205006 179176 165527 165037 179613
16884 179613 193391 168279 167416 161145 163654 169232 168592 170142 148190 124932 139282 184443 187609
16871 187609 144791 111143 108463 132383 124897 141096 142417 141916 159684 166560 151085 136343 140115
16858 140115 138168 124531 123580 113607 93271 47436 44970 16013 11251 13162 -15113 -45834 -42065
16845 -42065 -29621 -41759 -34565 -34345 -6162 3311 483 -25764 -34525 -35027 -47199 -69299 -57863
16832 -57863 -51229 -40156 -23467 -30023 -46938 -37305 -621 11587 631 -4345 -13125 -16079 -51051
16819 -51051 -61044 -42372 -34748 -57254 -58394 -70053 -54239 -28778 -19395 -14834 -9615 -27218 -16361
16806 -16361 -19562 -25815 -35997 -24051 -20883 -33926 -24657 -27453 -15180 17259 46487 42593 26128
16793 26128 32893 5868 -36300 -67685 -58296 -58060 -60570 -33058 -25340 -34695 -28245 -41613 -55276
16780 -55276 -69295 -75842 -68682 -63331 -33920 -8125 -15607 -7942 9317 -7233 -16154 -1281 -24336
16767 -24336 -36452 -7016 10654 -16851 -23376 -21334 -10432 2304 -5420 -13707 -39425 -27118
16755 -27118 -21579 -26048 -39743 -29456 -23403 -3126 11696 -4593 -21842 -15230 -12068 -13386 -36851
16742 -36851 -46297 -67786 -69655 -33260 -26098 -33378 -11790 -15777 -27267 -41211 -40948 -3971 927
16729 927 -8510 -5423 4060 10647 16314 -20831 -40121 -15613 -12236 -29544 -26913 -18598 -22880 -13916
16715 -13916 -17155 -31542 -10175 12171 -9665 -32432 -27708 -19028 2968 10698 11251 -41188 -65683
16702 -65683 -74628 -33676 -11072 -29155 -12067 27483 12357 -11848 -33981 -37707 -56877 -44359
16690 -44359 -38954 -39376 -61520 -65927 -30780 -37957 -41735 -44903 -21837 -3259 2054 -12184 -32960
16677 -32960 -33344 -27884 -15879 8477 -14021 -51607 -22759 1754 701 -9629 -10983 -9322 14022
16664 14022 27970 55613 54371 9661 -22352 -21994 -35690 -49611 -37548 -36081 -37008 -50396 -59632
16651 -59632 -81700 -86675 -50417 -19153 -21222 -19290 -18598 -19288 -7404 26716 33963 4489 20141
16638 20141 27848 6249 -19429 -36217 -15522 -3841 -3204 -18687 -30789 -44688 -40850 -20731
16626 -20731 -41395 -77693 -85653 -81316 -65057 -61501 -40098 -3680 -2279 -11166 -1416 4435 18320
16613 18320 27080 9670 -2867 -2855 4664 -12702 -6878 15904 8712 -12639 -19767 -36575 -22533
16600 -22533 -7435 -5080 -9620 -31172 -64738 -70539 -62785 -62854 -55676 -54146 -37266 -53310 -66879
16587 -66879 -86622 -83982 -50665 -26899 -32224 -16776 -2105 -24977 -46366 -33835 -9980 615
16575 615 -10042 -7747 -24061 -20570 -18894 -16391 -39121 -43268 -28062 -53921 -69066 -56638 -48888
16562 -48888 -45867 -30998 -19522 -30070 -37899 -51581 -62245 -50788 -24542 -19011 -5494 2645
16550 2645 -4802 -9021 -20767 -21098 -21499 -2793 -12257 -14670 -15064 -31975 -55046 -50963 -20953 -22433
16536 -22433 -8547 -35434 -59967 -40923 -34156 -52417 -50224 -45320 -16375 -51080 -64827 -32340
16524 -32340 -4890 8422 1100 -14751 -10665 -23908 -33750 -43997 -57937 -63678 -40853 -27040
16512 -27040 -22723 -17847 -13600 -666 -9232 -25680 -32660 -22025 -25447 -14365 -32432 -48569 -56035
16499 -56035 -33003 -20830 -34945 -34252 -27888 -30109 -28140 -44075 -57820 -34481 -9178 -31382 -50618
16486 -50618 -31469 -24004 -48457 -36799 -17319 -19091 -9734 -8161 -35466 -51386 -42087 -38282 -44160
16473 -44160 -49139 -40574 -13092 3802 5368 -25704 -39479 -21160 -29725 -26591 -30590 -31546 -35642
16460 -35642 -33013 -44189 -51695 -50322 -75881 -68357 -36845 -21218 -9927 -28449 -43035 -57384
16448 -57384 -49746 -51494 -53744 -44928 -46053 -57528 -29466 -19938 -58137 -58294 -47302 -65271 -76746
16435 -76746 -39289 -7248 -9562 -2009 -17011 -31847 -21084 15130 492 -13201 -24487 -31157
16423 -31157 -30032 -30205 -34601 -40284 -19975 -15399 5683 11561 2173 -25941 -16345 -11763 -19264 -32979
16409 -32979 -61636 -55181 -40940 -36437 -36790 -22368 -23798 -3826 -6459 -8298 7327 3081 -14054
16396 -14054 -22483 -15208 4104 14459 -348 6022 17160 12677 -22668 -27324 -20215 -33714 -41571
16383 -41571 -33656 -32177 -1783 12244 -16116 -39908 -36001 -23471 -3364 10882 13520 36601
16371 36601 19416 -490 1116 -3459 -7055 -20019 -22923 -12449 18688 5638 17389 -26771
16359 -26771 -45631 -52784 -37125 -24378 -37670 -27477 -18734 -21981 -24787 -27598 -10829 2843 -6316
16346 -6316 -1673 -1387 -38654 -45555 -51190 -39925 -20713 -18363 -985 21602 3175 -25441 -19998
16333 -19998 -11247 6740 7942 2188 566 -7061 -7750 115 -18572 -32044 -18390 -7202 -16992
16320 -16992 -51004 -36462 -15597 -17192 -24237 -35049 -38961 -42674 -27056 -36079 -58009 -51196 -37733
16307 -37733 -51897 -52746 -61068 -78769 -93216 -104147 -84570 -77182 -55272 -25556 -9571 -14554 -24419
16294 -24419 -44841 -45463 -28768 -7086 476 -6433 -14922 -13200 -10620 -7713 -7051 -11394 -12436 -13481
16280 -13481 -10229 -8793 -927 41250 30213 24816 27234 9746 4547 -9231 -18669 -20647 -17712
16267 -17712 -3989 -31818 -32402 -9144 -16469 -47876 -64983 -74542 -42317 -19573 -47202 -46230 -49902
16254 -49902 -40532 -13098 -17090 -23429 -29866 -20689 -29078 -32957 -37163 -31422 -15927 -1589 -9103 -24586
16240 -24586 -42751 -32997 -11203 -12577 -14903 -24181 -27266 -30354 4090 -8723 -27891 -70669 -112289
16227 -112289 -86892 -61270 -40918 -37176 -54260 -71649 -64991 -40983 -21211 -8322 -15643 -12306
16215 -12306 -13178 -1589 -6931 -71431 -53268 -25796 -16683 473 441 -15684 -19973 -22442 -16313 -30771
16201 -30771 -46578 -27560 -11505 -6375 -17216 -32522 -45882 -54870 -36844 -27073 5260 14643
16189 14643 -3235 -3734 -7679 9854 21232 18029 6696 -4229 10766 13246 11065 13706 9253
16176 9253 3398 -42904 -65602 -53700 -44703 -44130 -35432 -48257 -48995 -21465 -9158 -4071 -18244
16163 -18244 -24409 -28469 -24240 -25365 -25447 -10896 9497 23975 17841 4862 -6994 -19008 -14218
16150 -14218 -30490 -62371 -53173 -43849 -38606 -7570 4633 -9669 -10183 -26385 -34572 -40769 -38836
16137 -38836 -22282 -8692 -21556 -29959 -36506 -48728 -35676 -29117 -42979 -33581 -30132 -10458 -16048
16124 -16048 7991 48075 24233 28354 22458 12468 10977 14098 -5236 4751 20 -17674 -33656
16111 -33656 -33556 -32194 -35347 -38988 -39442 -4233 3424 -14231 -37765 -42410 927 29266 39722
16098 39722 23351 -20277 -21253 -13549 -1721 -9925 -19802 -3976 12148 21902 14423 -1538 -14628
16085 -14628 -19824 -9847 19215 19404 -20021 -27378 -6635 -5164 -28556 -37394 -35483 -32909 -1498
16072 -1498 15142 28757 30288 33745 32261 26741 4244 -17186 -20564 -13438 4803 27449 11781
16059 11781 -17908 -13147 -6298 -8720 -21813 -28864 -41365 -34973 -22401 -21204 -10911 -25295 -43135
16046 -43135 -36179 -20345 -22964 -46689 -37783 -21284 -7302 -8203 -8606 14608 -3006 -992 -19092
16033 -19092 -55908 -39318 -13362 -24868 -26320 -4728 11939 16743 6780 -14222 -24426 -25795
16021 -25795 -6018 -10878 -19145 -21177 -15932 -2375 4285 -35947 -60745 -56140 -6137 -1742 -871
16008 -871 -5730 -24364 -41384 -20314 18073 22726 24813 29705 26750 18178 13191 15992 28570 36872
15994 36872 40060 28173 -3705 -1481 -12792 -3749 7588 20917 26018 11136 -5657 -26503
15982 -26503 -20140 -2400 1398 -12939 -12055 -1050 -10315 -38205 -28929 -5303 -6474 5202 2810
15969 2810 23289 4716 -18905 -8139 14182 4511 -26841 -33068 -46862 -29604 -157 -10587
15957 -10587 -56805 -65155 -35134 -39139 -22511 7098 20697 7354 19589 14064 6867 15139 2233
15944 2233 11953 8306 -7553 3253 25802 26057 -6701 -25452 -28333 -20920 -16530 632 6364
15931 6364 21614 20687 27325 35320 30587 7827 5793 -28243 -27160 -19601 -5979 798 -2481 -16164
15917 -16164 -12310 5634 -2917 -15536 -51292 -58456 -20704 4898 25213 28411 15959 22663 14251
15904 14251 999 -18030 -31234 -16582 6665 34432 13929 -28908 -29208 -29860 -30054 -20558 -27592
15891 -27592 -19992 -31667 -13566 -11997 -38666 -13299 9211 14569 21096 4974 609 -980 -36841
15878 -36841 -44681 -62566 -53230 -53483 -31041 -15672 -43638 -55262 -14936 11071 -1776 -27634
15866 -27634 -27142 -28556 -35185 -47638 -51753 -34592 -19294 12808 15164 27164 33194 33915 -11938
15853 -11938 1969 24435 26968 -483 -1764 -12231 -21859 -3164 3148 13741 848 11379
15841 11379 24013 9920 4592 21734 33413 -3127 -1072 -18717 -1682 10483 -6786 -18042
15829 -18042 -12257 -17801 -6115 11399 4600 15079 17486 -2339 -13465 -3955 -11316 -7478 6785
15816 6785 -2744 -20872 -23926 -17107 -52 -7451 -27910 -19974 -2220 22576 13512 -15812 -25917
15803 -25917 -22629 -21184 -21250 -43982 -35664 -60933 -62792 -62311 -48067 -19357 628 5284 -11123 -3090
15789 -3090 -26454 -34236 -47146 -37145 -7218 6200 -26127 -29810 -29890 -19184 -24131 -41384 -17703
15776 -17703 11321 9640 -12828 18032 51248 17965 -27884 -27297 -35533 -46411 -67743 -52146
15764 -52146 -48754 -44409 -53235 -47712 -46873 -32258 -21179 -8696 -15278 -29618 -18970 19881 26070
15751 26070 -8318 -40711 -33245 -25531 -36497 -20403 -23950 -18249 -19850 -25667 10068 24408 40612
15738 40612 23822 22586 16784 877 -16150 -10343 -23908 -38253 -3954 -4849 -14518 -22599 -42289
15725 -42289 -14564 5484 2598 -17517 -35524 -35970 -52327 -42185 -28036 -30694 -42225 -32261 -20360
15712 -20360 2904 21497 18915 10685 112 14921 45427 27074 23119 -14198 -46561 -38138
15700 -38138 -40414 -32810 -24521 1796 23171 26270 2762 -24711 -41364 -37081 -13431 -3586 0
15687 0 28468 40932 21871 46491 70332 49791 27455 22118 -1461 9640 25445 6021 554
15674 554 -1645 -20235 -27241 1839 18292 18260 12556 -2858 -16741 -4983 9178 -20801 -17660
15661 -17660 -28728 -23914 -1731 -2413 9943 9464 28 -4875 574 487 -1177 7859 -8012 -4052
15647 -4052 28718 25009 14269 -2812 -35943 -32090 -11288 20897 31846 11176 -14159 -19533
15635 -19533 -37580 -48093 -32406 -12366 -15416 -16270 -8023 32929 29332 18977 23864 17270 15002
15622 15002 17304 953 7153 9396 -3349 -2586 15540 22878 11889 -2043 -3911 1078 -7548
15609 -7548 7462 35827 30592 -14367 -21632 -2037 12344 26029 13767 14506 4416 12357 25846
15596 25846 54020 57722 40295 25837 25419 36874 32487 11992 18406 43907 54583 38123 39422
15583 39422 62777 46238 34615 24279 -3462 1030 -20320 -59681 -83969 -64791 -57361 -50891
15571 -50891 -19237 -1002 4789 24927 16636 399 -18373 -22499 -18549 -15312 -55767 -64103 -40495
15558 -40495 -14578 -8272 -10372 -13933 -27186 -34135 -41198 -29473 -6666 10858 45863 43687 1341
15545 1341 -29430 -28358 -4147 -13747 -35862 -45287 -18832 5254 20122 29763 35435 41979 20030
15532 20030 17032 42584 40488 1024 7965 13378 12741 18921 49813 46408 14615 -26195 -48920
15519 -48920 -20762 -713 28656 -6231 -22769 -1421 -3368 -1127 -9332 -17612 -536 21593
15507 21593 28828 36334 20618 5529 6853 -829 -14889 -1159 8309 15922 29155 38221 47558
15494 47558 36778 34944 39421 34745 49711 30205 9872 17444 26238 18436 2618 12723 25791
15481 25791 40848 27984 -5000 9156 32614 22989 18457 2840 12661 12832 38292 30243 11165
15468 11165 -518 7338 14415 -2836 -37267 -44514 -31693 -11219 2534 2923 16351 11470 23797
15455 23797 30789 20956 20102 9463 18133 56800 32991 26102 23738 24313 37754 9422 -7041
15442 -7041 -23031 -20118 9697 9713 9402 20122 21507 13549 20516 12963 31917 50979 59675 41983
15428 41983 31204 2576 21011 21252 -4344 -9519 21764 23456 12725 3678 7962 4145 16667
15415 16667 8854 -14478 -24335 -33942 -39000 -35488 -31405 12730 39204 21410 12996 39160 47476
15402 47476 -699 -12764 -887 9669 41880 35679 19398 -8410 -32937 -18187 -22529 -8521
15390 -8521 -464 -573 -12934 19406 40332 29956 15399 8881 7835 18493 17873 17340 7906 12257
15376 12257 28723 45613 46324 17752 -23683 -46264 -34057 9893 20227 4469 8928 12417
15364 12417 14318 47596 51049 57883 45537 15519 5952 19032 14743 -5575 -17705 -13100 -16090
15351 -16090 -23680 -33601 -43519 -45103 -31486 -7295 1884 6338 -3208 -14205 -30046 -15012 10367
15338 10367 2416 -18377 -16626 9417 11248 29897 32512 32454 -457 22244 30629 9606 -6929
15325 -6929 -2743 28101 40829 43272 46000 37612 15831 -4881 -5463 16257 15450 28129 32472 56427
15311 56427 63308 62015 29000 20780 26296 26883 27919 15504 21716 37494 15565 27247 42312
15298 42312 26817 24027 34418 45054 46084 40559 5819 1855 -12265 -22448 -13498 25697 33690
15285 33690 2510 -2401 -5168 -17864 8385 25944 6822 -4437 -2760 -33078 -36843 -21305
15273 -21305 7121 52124 60117 14874 -25107 -15203 -9734 6117 15093 3989 -10742 -17652 -43020
15260 -43020 -4518 27307 31323 13461 -11349 -9534 -32974 -22054 11927 -1595 -35131 -24743
15248 -24743 -8472 9112 12918 4220 -16075 -34966 -4936 27452 20099 17330 7582 -5987 -17073
15235 -17073 -9551 20301 7856 2305 3982 -1340 -549 4018 8923 9193 25835 17699 4076 24367
15221 24367 30925 41192 53035 35103 37197 14070 2114 -4021 -6618 -2002 13251 28553 22765
15208 22765 33039 31385 10185 -10452 -49442 -52119 -29932 -3056 -6285 -12405 -36082 -63871
15196 -63871 -70392 -33703 -26009 -28547 -16421 -1596 2636 22591 62232 82295 69376 37824
15184 37824 28101 20212 24815 19318 29460 20378 915 -15751 3261 3862 -14333 -11633 30316
15171 30316 36031 24873 10532 24701 38594 33222 10151 -8447 -4340 27206 20563 18497 13565
15158 13565 21173 15660 -15284 -4436 36821 44077 37090 32639 31472 33956 52168 56448 54841
15145 54841 60597 63259 68558 37167 8868 -13080 -454 -3913 14252 36588 51251 44940 60470
15132 60470 68121 33216 18839 29541 32720 26131 -10690 -19821 5924 22839 176 3425 10661
15119 10661 9826 -820 -10647 -6375 -16721 -40385 -33380 -18910 14662 27132 27877 23585 23091 25342
15105 25342 44785 37370 21573 -3884 -2129 -1676 2586 10129 -20873 3727 22937 15384 4894
15092 4894 -19381 -14934 -15961 7788 43940 55813 27095 8180 11228 -2406 -6390 -8005 -2300
15079 -2300 14983 22494 17483 32597 36045 -555 -16570 -10488 -12369 10207 20831 17871 40721
15066 40721 40324 38985 29057 6391 10783 28298 40566 29834 23610 31287 33764 22519 15980
15053 15980 36772 36589 10584 599 15719 19936 13806 8670 26680 28478 29645 44178 20237
15040 20237 16076 16025 27597 26963 19718 3391 14453 15052 18977 11430 18185 2529 -31353 -24097
15026 -24097 -19192 -13275 -28731 -6758 1511 1078 29534 7923 -4611 -12629 -15122 -13651 12638
15013 12638 16528 26917 36963 51098 30454 12236 29113 35417 41308 38871 27605 28279 6065
15000 6065 15955 14730 -13983 11737 55081 48077 13264 5763 27106 40310 45239 56230 62344
14987 62344 51386 20223 -7144 -9792 9623 45068 59189 66476 71351 42614 22114 133
14975 133 -10990 4274 11704 -1324 29773 36138 9825 8543 -7870 -18294 -25422 -19553 5888
14962 5888 -5705 -3643 1794 16574 23713 23919 12530 -30740 -51036 -34280 5038 19862 11528
14949 11528 8907 -4152 -9082 421 2385 15139 37688 41923 12670 -2240 -1668 -12729 -5619
14936 -5619 13118 12544 -797 27960 20412 5862 -1971 -8398 -7011 4482 36546 35981 40104 53150
14922 53150 74945 97294 81096 81625 94832 77127 31669 -9878 -8673 28904 54226 64702
14910 64702 57706 38052 46365 21508 28059 31981 30570 41494 29315 29220 10995 7338 -6084
14897 -6084 -7222 -4034 19400 41025 33979 12524 25150 45157 47669 51998 24580 18609 10102
14884 10102 -19562 -34836 -7615 54335 51621 46959 44433 23590 -10466 -8205 29729 7080
14872 7080 -7372 1356 -16228 -6814 6544 -7334 -11832 8267 16485 19825 16975 9280 5956
14859 5956 -12753 -15668 -15109 8076 13312 -14227 -25254 8914 21582 -388 11531 16352 -11647
14846 -11647 1799 29030 37043 32527 -6041 -19359 8655 -8425 -25729 -20957 -598 6028
14834 6028 14548 13621 47420 55117 53833 39256 33153 37561 46616 51595 29281 13926 21511 36400
14820 36400 41873 48526 33421 14000 1031 30128 40796 18232 17436 26913 8014 -1987 4653
14807 4653 6052 -801 -6175 -11654 -21593 -31725 -18118 12489 23214 18322 24352 17023 13850 1634
14793 1634 2373 24705 12061 -4221 5530 -3738 9629 27919 40976 45808 59156 62969 55827
14780 55827 59035 60628 12376 -18123 -8829 9155 12552 13733 33186 47201 34859 1494 -2362
14767 -2362 -1567 13954 21012 9338 -150 -13674 -33333 -33202 -25164 -10190 23609 12232 33045
14754 33045 23610 16186 1827 14266 14781 -13803 -11294 3898 3028 16835 41358 45741 34974
14741 34974 40270 37766 24836 16646 36382 56138 7052 8994 32417 39627 26843 3593 21101
14728 21101 51438 74833 89930 69947 60514 10251 21782 43130 35820 21669 22309 22054 15690
14715 15690 42642 45953 61527 58414 995 -3145 17246 16669 11938 5346 8308 -2231 -2686 50433
14701 50433 57025 43833 34145 38923 29352 10972 28380 27002 28906 24538 24711 44006 35688 22325
14687 22325 9796 18723 11196 358 19706 17497 6628 4918 22487 14509 36540 63868 85618
14674 85618 62203 65853 65327 59590 46969 33560 25377 1399 2298 27276 16249 -4240 -1246
14661 -1246 5291 20783 4970 -16220 -13724 -10145 1102 5777 17422 16833 8063 13656 34779
14648 34779 30687 6448 4828 8432 14109 40266 51461 51571 37583 22522 25490 62810 62909 36048
14634 36048 17715 26357 27117 21849 22633 43756 44000 33751 28445 8144 17736 18472 17785 1638
14620 1638 15550 50545 73274 48770 35663 29740 13174 31380 35332 27488 21970 10418 -8640
14607 -8640 -7561 -4983 -3583 29958 51221 24589 8477 -15583 -19744 -16267 -29704 -41562 -42184
14594 -42184 -9252 -2302 3249 10515 -7393 -28240 -12547 18690 34574 14820 17022 11065 17348
14581 17348 21936 35176 57642 53135 28655 12411 29631 64731 50315 42578 41451 41003 42798
14568 42798 44901 52361 57917 58257 58651 44322 22698 17898 40934 21201 -11180 -4165 23006
14555 23006 41296 14505 -3236 -8583 6703 -1217 -5035 17903 22371 36571 44747 39913 46739
14542 46739 31062 -5223 -10786 2407 12081 2221 -11702 -13744 7613 38196 39443 23351 11196
14529 11196 29741 17436 20903 22910 -2330 -9003 -9734 2045 38482 23649 -15050 -30119 -15909
14516 -15909 11366 27880 45893 15207 -22285 -38459 -22076 7115 5270 -28744 -25717 24744
14504 24744 51197 30488 19733 -5843 -12364 -26096 -11966 -6414 -38950 -34666 -28283 5608
14492 5608 20930 18883 36656 25633 24140 47932 47219 47688 63319 54443 49874 37713 47562 36910
14478 36910 27435 28683 48531 48784 35874 65510 83272 62700 55474 63465 63971 26898 10344
14465 10344 15296 29181 40751 92100 101618 68074 35991 21929 27797 59121 72018 69877
14453 69877 54913 60786 41422 25597 28026 42987 25290 841 17915 40177 41669 26821
14441 26821 36449 37644 55225 66497 38398 38327 38976 40671 35778 23230 29986 66949 55188 37765
14427 37765 27214 28662 60233 55283 2370 -9467 19825 28705 22495 31410 52577 66522 78125
14414 78125 65446 27420 24532 24993 45798 63652 46252 24677 8839 4698 12966 9983 16587
14401 16587 23563 34706 36929 40572 33275 30381 29214 36399 21119 38416 56911 45917 45849 48554
14387 48554 42118 35415 50139 43776 12475 18469 30227 38198 51351 54534 27686 -8002 -18658
14374 -18658 8317 29822 63385 61889 49678 35333 23390 29514 29635 5617 33028 42449 35721
14361 35721 24874 60178 49817 37389 27469 27238 45877 34902 30044 21070 29279 55586 49613
14348 49613 35497 42978 55185 49146 54402 56378 38014 33822 16168 13467 6500 13265 23368
14335 23368 24797 25107 23728 22174 37838 38217 26834 21735 20521 39709 45119 46970 56115 39952
14321 39952 28868 24851 45794 69391 63206 68274 72234 49716 26626 13381 8435 26037 70790
14308 70790 77366 35893 34830 44090 35860 5172 7403 42986 55800 67616 73460 69220 40591
14295 40591 23438 21382 21839 31780 41682 14233 28889 20253 11517 42489 57672 60481 46152
14282 46152 60687 66883 50287 46626 63249 68044 37495 48003 63949 62827 62231 55015 61941
14269 61941 88325 69907 44309 35549 68008 80624 78741 64380 46635 44811 43329 37347 6253
14256 6253 1729 32338 50295 58041 71103 83480 68188 47117 21346 42866 86986 95896
14244 95896 87923 85151 74877 77005 63575 80410 70783 57381 57155 67393 50728 30092 29870
14231 29870 58246 59375 54116 58177 61946 42571 33237 10711 23617 42014 26405 7120 27101
14218 27101 63304 62896 55128 55543 46354 35243 52451 30067 21829 26878 16276 15612 23771 43564
14204 43564 49006 66956 49586 40516 41553 70232 73231 76810 82963 90795 77200 71628 61909
14191 61909 41612 49256 70408 83074 78459 67962 61946 86064 80638 103676 91617 62976
14179 62976 53832 39912 43824 76991 92835 92056 67357 56061 83035 79094 99988 96412 71731
14166 71731 67063 85514 68563 53674 71997 106366 97889 80622 50540 31520 39387 45036
14154 45036 50597 50711 52232 51685 52635 40323 32342 36596 73646 69263 54350 30253 48921 87562
14140 87562 79442 76256 66448 65676 66373 58557 43704 25188 37733 44753 53495 44058 27545 10963
14126 10963 1256 3877 31563 45457 66948 79962 88903 52720 38778 43744 41586 61435 96827
14113 96827 100566 74918 61037 67297 66696 58011 76706 61189 50970 44090 26200 33641 60836
14100 60836 66613 43926 42675 41660 36444 29108 15956 20782 39759 25321 33558 48369 70840
14087 70840 94465 88236 78997 94078 67752 58943 31826 25734 38069 63670 51815 67785
14075 67785 57922 63388 79569 70238 69388 70054 54818 49969 47134 49494 42721 29114 24426 25256
14061 25256 32677 49519 55055 61480 76527 61793 59537 67672 47049 46036 41007 25080 43696
14048 43696 60655 50732 41726 40985 56620 46578 31517 40032 38530 54492 74089 81558 52922
14035 52922 26475 35049 33658 33522 39128 46143 90148 102039 103887 85238 85515 98832 79902
14022 79902 61354 36771 52235 68496 73360 73573 73592 63393 59871 62606 79007 78871 82572 56402
14008 56402 54001 81076 102976 90170 116574 123130 97274 66955 71412 62675 52743 53508 44312
13995 44312 67466 79770 85727 62182 62653 101642 96580 60276 38507 48884 51099 89186 90262
13982 90262 90203 85473 81650 93700 107575 84768 78669 65969 61105 66509 92285 116027 117004 107275
13968 107275 81531 64070 68692 75865 66463 68482 114736 138165 157887 152077 169452 174994 180681
13955 180681 194295 206946 201772 185200 173076 164111 159565 149861 130450 122053 117019 89484 90858
13942 90858 99686 70515 56813 55551 64482 61513 69152 80132 78529 68032 71864 99273 108149
13929 108149 88285 92917 73864 63098 73138 85955 70745 65501 83779 60223 34389 47382
13917 47382 49949 66833 65434 60893 53842 74901 63608 42917 46276 45266 59102 77438 71813
13904 71813 70780 55825 57357 72411 85872 76096 85848 76054 89387 99813 123357 107685 95579
13891 95579 111170 105286 88568 87741 94984 91967 83531 68048 41190 65539 103887 76561 74441
13878 74441 84053 92082 104164 111284 140269 147329 118887 107914 96226 91723 106018 110573 85945
13865 85945 54236 79862 83726 95215 81907 76750 78577 82764 90263 94745 74257 51724 78044
13852 78044 99338 116155 102858 86519 86735 80800 61133 54167 62898 71600 88038 98867 93632
13839 93632 106856 136902 145412 136732 118654 120921 107842 92747 77015 67491 50158 60974
13827 60974 82522 102232 84977 81326 91297 61975 42253 58074 65386 64401 43025 31202 45643
13814 45643 25077 52705 69545 115469 146336 136779 135534 141719 149044 154699 160571 146554 115827
13801 115827 133879 159151 174571 198123 208073 204957 238678 221532 180198 152332 157100 152594
13789 152594 150336 126945 99735 98149 109376 96744 103559 104865 108005 97635 82347 80383 98922
13776 98922 105652 98598 107317 106044 92541 93255 102127 109294 120600 111382 111086 97372 118510 139960
13762 139960 121540 107225 98578 127139 105462 61904 76079 102458 91368 81369 80790 94328
13750 94328 97930 84374 79947 75507 70025 88366 105212 121033 121429 101852 115151 134212 117645
13737 117645 108472 119849 130828 132136 115544 120620 123254 106363 105561 121127 145655 143116 147132
13724 147132 144402 150768 159643 172723 184164 207508 208617 197606 207846 207472 183027 140827 152509
13711 152509 166820 151201 156115 157509 162027 176548 182436 184466 159618 146639 158381 163763 174113
13698 174113 156915 139025 138690 147159 149014 118921 92843 103350 108056 127429 150686 137881
13686 137881 146855 177626 194525 162023 124840 105682 93192 113595 128647 117007 107558 128703
13674 128703 127341 135011 156860 181687 175732 164542 168664 150882 139759 171587 178301 171134 165664
13661 165664 178825 192614 186570 205624 210833 185674 176380 212605 225266 220859 199365 190834
13649 190834 222743 228941 212089 196810 198308 173014 166307 171938 182516 186346 178563 159452 144470
13636 144470 122874 131553 138613 130625 126041 129327 141487 139996 142303 141765 158370 160178 161346 157968
13622 157968 160676 171591 168757 153223 137834 149589 151096 150996 152685 133873 127074 122407 99426
13609 99426 97147 107124 119993 142777 132574 146531 154645 125437 144216 156672 157338 145152 143491
13596 143491 138945 123386 94320 85383 112882 126678 134550 144000 146290 123068 126667 105678 135896
13583 135896 164347 147744 128267 130121 113361 138484 153183 141209 115328 107315 105133 109679
13571 109679 98722 102511 106249 103297 82784 86161 107810 107214 136958 117641 80263 81747 74575
13558 74575 78442 106106 109226 100901 130806 152167 119439 110851 133236 169045 152973 137594
13546 137594 134582 114825 111087 127124 121913 112625 128564 130668 118538 118116 114925 104905 125486
13533 125486 133172 108064 94468 87653 85126 108044 124771 124431 117061 102078 96585 93971 108406
13520 108406 128146 129365 125541 102207 78549 77405 86526 99386 106699 139643 133220 118512 137359
13507 137359 151258 131659 102511 124362 155414 159127 138884 140586 149834 176454 172408 150218
13495 150218 130795 125953 98605 83444 95910 155605 173230 157612 146015 146751 130789 156352
13483 156352 149500 114866 115168 114939 106998 127236 156970 184959 182526 147769 121674 114489 117194
13470 117194 103069 125067 147533 140801 106506 92209 103371 148304 152335 148564 128573 113661
13458 113661 105432 124262 134259 143593 132412 136194 150617 142596 118733 103784 121710 129401 118619
13445 118619 107635 100347 145955 158496 161085 151621 168775 173566 166665 164378 155367 125367 117761
13432 117761 130873 144333 136298 147778 152969 171258 173749 140163 124883 130116 131533 118962
13420 118962 145697 143126 157235 182517 200296 186344 179755 160046 162545 144129 135620 149297
13408 149297 137160 126116 137358 143661 139648 147569 135817 125541 111221 115929 112894 120451 140891
13395 140891 146587 152003 151801 156726 173135 158778 170812 162606 173464 179129 182049 180956 158011
13382 158011 165498 179645 164158 127800 125905 154102 141216 130137 143505 141424 157955 129027
13370 129027 138340 166498 170200 182553 168227 152546 161790 186437 212979 206730 196936 210473
13358 210473 198839 198750 214511 186035 175278 163468 155882 138346 178815 200878 166830 154528
13346 154528 170269 155403 134584 145867 151000 184471 182679 153357 164489 193478 168731 151545
13334 151545 144064 168116 177664 185463 195434 223977 214186 170403 165508 188993 214240 202038 207830
13321 207830 211081 210871 207330 220844 195517 216035 248344 241800 196398 211566 218405 230003 251246
13308 251246 226510 214729 215268 206836 202683 193974 184169 171417 183441 176978 181039 182636 197366
13295 197366 227421 228668 221414 229056 229443 212729 207973 216634 183668 174382 199098 214927 201372
13282 201372 175004 174453 173392 202681 183467 179984 182624 207770 216381 232650 223235 218782 222907
13269 222907 215433 207846 209538 205450 176679 153219 142563 143866 170419 193878 206185 200755 203792
13256 203792 188647 205494 204852 171266 163742 171902 209229 204095 206655 194066 175127 171787 212334
13243 212334 212866 211951 224331 257125 241624 248786 267153 278265 248796 204292 188153 190820 184185
13230 184185 169538 178082 217835 232400 250720 269723 273818 277922 254761 224008 237412 251036
13218 251036 236551 236332 228741 231717 260086 269617 267158 280580 287942 291030 302142 297846 296164
13205 296164 324890 346489 354575 386444 440994 501490 618808 716931 806039 894662 963018
13194 963018 994860 1016879 988384 931783 835838 760928 727455 687952 638548 586300 566636
13183 566636 575305 560340 535704 546689 591601 639131 676521 684130 685740 699228 731583 747738
13171 747738 763556 775524 791247 841865 885681 943817 1013888 1064847 1091175 1077530 1049624
13160 1049624 1015932 982686 955280 952709 985574 1048021 1096800 1108559 1079098 1036324 967806
13149 967806 889408 851250 799072 755779 717290 675983 637676 605290 582207 599405 637844
13138 637844 666805 706818 787407 839858 927057 998470 1026694 1011438 944786 898722 829346
13127 829346 738810 653634 594506 563223 518369 467683 414975 391345 390841 401707 416925 396808
13115 396808 396556 405664 422727 481776 530446 561583 586083 618019 642565 614444 569822 522865
13103 522865 459576 402807 362645 356551 355209 335189 342938 337266 310219 318467 363299 359768 313066
13090 313066 292449 308902 304986 326083 336613 339037 343014 340197 344504 363497 380220 382239 360406
13077 360406 332028 310466 329054 366740 366155 370317 372145 394771 406604 418969 429028 430444
13065 430444 418182 419135 455120 484110 501512 487115 437346 405208 409267 419476 396558 400776
13053 400776 399177 392352 397025 397561 407796 398306 385072 373144 378036 376758 367922 352478 361133
13040 361133 368350 379412 358852 356723 374606 395296 399119 383520 380370 390503 379632 372593
13028 372593 394171 395852 388237 354863 376196 405809 405458 370366 359789 349706 347352 363296
13016 363296 377928 366010 370355 385342 380835 384147 386140 427928 428127 427032 432706 432160 431248 466546
13002 466546 482377 491952 477247 464767 481134 506620 520556 527245 512523 514142 503572 493873
12990 493873 486685 486401 474838 458710 482365 505398 515542 515757 523159 528502 503889 520046 529285
12977 529285 549116 556432 562246 572737 554283 536602 548191 545133 552744 541795 559390 573278
12965 573278 560761 552090 553192 561422 553632 546803 534963 537525 548462 557794 566241 568411 553839
12952 553839 530498 507925 503580 506913 519946 514713 517644 504834 488767 486773 524370 566820
12940 566820 577174 597696 603030 657570 689699 668231 657184 664891 659867 688682 701013 725715
12928 725715 736739 718086 714871 751493 779365 849111 928853 1023542 1132931 1248417 1369189
12917 1369189 1459345 1519909 1619173 1672948 1656697 1621147 1555938 1476742 1376823 1265807 1154138
12906 1154138 1058531 967598 907728 858561 808368 788638 754699 714096 708806 745302 740590 694991
12894 694991 686234 700040 701046 674382 663044 635580 631399 642374 648853 630461 628272 639750
12882 639750 648210 662647 670328 690121 759028 823152 872409 931877 1002882 1046319 1100808 1149977
12870 1149977 1204676 1238983 1258585 1270311 1263957 1242745 1259749 1261468 1222902 1201508 1176991 1116794
12858 1116794 1090981 1055717 1010865 1006608 1013343 1037573 1050040 1058704 1059499 1075259 1113629 1134558
12846 1134558 1168901 1215130 1250622 1280441 1298784 1288571 1303813 1336899 1353156 1359281 1381428
12835 1381428 1409256 1399462 1372945 1383565 1398382 1406707 1405872 1391499 1384438 1373660 1391340 1386574
12823 1386574 1351774 1344662 1364718 1385440 1408067 1449424 1482631 1483612 1502425 1556477 1634898 1681538
12811 1681538 1724565 1798416 1828352 1863649 1904526 1893174 1875257 1872189 1866882 1889347 1915054 1924203
12799 1924203 1909908 1950187 1974673 1988221 2011301 2076149 2126381 2158932 2188652 2224139 2285327
12788 2285327 2349867 2389739 2438648 2513235 2617287 2725556 2778802 2836695 2932151 3029171 3140288
12777 3140288 3286202 3443357 3594410 3754677 3930765 4129995 4330554 4603088 4889509
12768 4889509 5183023 5527517 5946463 6412657 6935326 7547039 8286596 9126648 10076729
12759 10076729 11133355 12362159 13797760 15541851 17778323 20642449 24398175 29386059
12751 29386059 36097364 45152766 57276587 72980500 92107538 112846277 130874630
12744 130874630 141726504 143984669 138430517 126879265 112111040 96966853 83378903
12737 83378903 72159835 63394996 56963642 52725896 50524841 50292599 51989991 55520828
12729 55520828 60721271 67166613 74314935 81432107 87807404 93016396 97066143 100426414
12721 100426414 103836919 108225066 114506114 123246666 134236056 146322810 157100814
12714 157100814 163722884 164654246 160209774 151652732 140870378 129892380 120221794 112570596
12706 112570596 107014642 103348372 101163379 99801214 98413549 96154562 92583607 87590481
12698 87590481 81489313 74917641 68519043 62872817 58352472 55298402 54003411 54769486
12690 54769486 58065850 64538403 74821672 89288142 107545887 127777822 146235382
12683 146235382 158084118 160274249 153255934 139288630 121237624 102133936 84359910
12676 84359910 69076427 56411150 46032761 37562031 30773748 25421279 21249146 18030046
12668 18030046 15503085 13496339 11854359 10480378 9326045 8364152 7532115 6756637
12660 6756637 6089180 5535801 5110879 4745268 4411937 4095178 3815638 3589657 3355916
12651 3355916 3165572 3001734 2836829 2735360 2622323 2502907 2413841 2364373 2385385 2421964
12641 2421964 2416743 2431449 2442568 2395381 2311136 2190849 2079405 1968420 1870429 1775000 1725388
12630 1725388 1676147 1631693 1601031 1577614 1559075 1584140 1590008 1597668 1617051 1619019 1600290 1566469
12618 1566469 1551604 1542941 1508781 1473053 1442126 1404886 1352706 1276033 1223009 1194382 1139936
12607 1139936 1100227 1089367 1081122 1084223 1098712 1079131 1053571 1046355 1019973 985480 978496 983490
12595 983490 984521 1010561 1000815 1004190 1053377 1085508 1113874 1156964 1224422 1260055 1278838 1279756
12583 1279756 1255765 1271173 1287491 1279039 1288444 1294432 1281304 1290048 1328337 1367970 1369772 1391315
12571 1391315 1416845 1485329 1541352 1610426 1662913 1700049 1758065 1810073 1838551 1839080 1830862 1866526
12559 1866526 1861652 1813782 1799768 1822047 1860423 1880071 1909333 1941334 2001815 2039662 2071082
12548 2071082 2134389 2214723 2262737 2352390 2443923 2520982 2604608 2713588 2805747 2880021 2963629
12537 2963629 3076367 3169548 3269360 3363811 3502740 3678924 3821746 3987323 4225893 4450990
12527 4450990 4719846 5049818 5402708 5788724 6227739 6722836 7276989 7934462 8686381
12518 8686381 9545476 10569452 11806099 13241424 14867132 16749313 18868316 21259332
12510 21259332 24022999 27227417 31050726 35712752 41607210 49215297 59189482 72093866
12502 72093866 88212699 107462620 129194083 152263516 175003189 195427990 211509120
12495 211509120 221582191 224630998 220497108 209762617 193705571 174002468 152453621
12488 152453621 130811696 110452072 92292124 76754262 63841975 53349482 44898245
12481 44898245 38128382 32638132 28120526 24418690 21292044 18596094 16301929 14333991
12473 14333991 12633570 11144782 9900136 8806199 7878781 7095750 6429270 5851143 5371070
12464 5371070 4942587 4571881 4214447 3883675 3602720 3355094 3107966 2899379 2740057
12455 2740057 2589236 2416330 2271468 2122383 1962084 1812367 1680577 1589285 1515413 1472042
12445 1472042 1428357 1364879 1280355 1221718 1153642 1104080 1052847 1017382 1012114 977107 922272
12434 922272 881083 829756 809258 796399 782246 782392 764776 747464 746370 750977 732497 703108
12422 703108 694201 700141 668184 638153 597366 555848 538768 538120 532286 512979 511318 490012 448933
12409 448933 435932 417339 388919 370067 346807 329217 321897 295059 289532 295936 311428 311235
12397 311235 295669 270396 274739 285135 271975 257593 273278 275191 251502 251428 255456 264858 273680
12384 273680 287723 292918 268309 287698 298078 308245 308049 282752 268899 271772 310796 354638
12372 354638 351790 360721 391112 414494 402221 394566 393438 419099 435107 394704 385635 383444 342238
12359 342238 307377 296389 273504 280536 299347 280760 254092 231215 233817 209888 149122 130966
12347 130966 163591 191514 214793 205908 188771 189272 185707 173152 183225 202766 179361 163733
12335 163733 189579 215506 196698 217314 239345 287303 311994 311082 314157 366769 421700 479450
12323 479450 550967 629368 740693 843755 901246 968977 1067881 1126481 1154981 1173023 1176364
12312 1176364 1141452 1097027 1013260 892344 779991 663677 573937 496412 438146 362911 334135
12301 334135 322938 340710 357428 361250 366145 384284 410310 462487 527698 583132 650386 708684
12289 708684 785304 846247 895504 905143 858114 764405 685194 599650 550375 519226 470637 428315
12277 428315 405803 406005 440836 429783 423450 425858 466376 516114 530664 552137 548493 533962
12265 533962 561283 606373 670822 712719 754847 806298 857667 886599 878307 831978 768972 693054
12253 693054 658491 641618 615159 578911 564133 526551 539886 521816 518431 527559 540198 516960
12241 516960 485142 465530 414271 399352 386277 367150 358331 377076 401980 440894 485900 556907
12229 556907 667087 765118 881004 958540 936345 868990 792043 703532 617286 528511 442500
12218 442500 367072 317613 273811 241515 203347 200651 166983 140879 121004 126264 137566 144924
12206 144924 122204 124635 129517 124413 102942 114584 99672 82190 64639 93102 120405 108917
12194 108917 102487 77620 74955 64792 53139 27264 30202 54586 80129 78804 79308 88137 95478
12181 95478 111209 112618 106804 102761 102424 93045 112961 132828 108500 59096 27121 12593 27915
12168 27915 28559 34306 35973 54048 66986 86074 59626 74174 75008 54505 46882 63936 60993
12155 60993 52397 71153 87738 89026 86088 63958 57206 62334 82706 100862 102138 92375 103448
12142 103448 122067 135141 147637 152687 176834 184102 166902 160971 168275 199871 216408 231930
12130 231930 247742 261877 291664 340608 382529 405594 447389 495124 562455 635215 688940
12119 688940 708927 756568 776949 757979 732204 695879 641682 588335 539030 502755 429734
12108 429734 368138 320064 278040 251614 253418 211683 197511 200839 216552 216910 243706 270892
12096 270892 282173 304867 316303 297821 309627 356628 433058 507300 567059 658653 731232
12085 731232 817207 914880 988752 1040560 1112244 1117292 1081039 1064546 1067177 1084616 1131072 1217339
12073 1217339 1302045 1425468 1536198 1626304 1700047 1740173 1754769 1732155 1692216 1605217 1518163
12062 1518163 1412602 1298673 1168817 1058913 991736 971299 994688 989985 1001598 1034179 1042123
12051 1042123 1040915 1060842 1046880 1003944 974544 943671 885670 821971 779045 750879 745714 702378
12039 702378 653062 604390 573180 535899 482331 456268 444498 435989 424920 423084 435384 452781
12027 452781 468214 509882 564081 617539 683423 730991 766128 772918 756379 708699 642827 572035
12015 572035 518393 478245 441309 394372 378815 340614 321587 306210 338426 347657 293582 273963
12003 273963 278688 282707 324569 337443 335184 333545 300892 256023 252100 251870 247131 242080 242501 225282
11989 225282 200978 191488 203716 203796 186362 174435 177275 198445 193505 206801 249059 279745 267124
11976 267124 248205 242261 260358 283385 293543 285324 307799 357002 389642 398006 423404 439701
11964 439701 483414 495025 515381 546527 543547 565816 591261 571280 524556 515462 532238 513887
11952 513887 499206 481966 452118 403625 361048 322899 280712 270145 277039 286367 260678 248956
11940 248956 243712 240155 233587 225419 224202 237419 269925 274069 275709 292554 267387 259204 261872
11927 261872 261078 251557 229686 229013 246762 253997 278744 296235 319812 330384 328741 343228 356891
11914 356891 365108 386067 416680 443322 464791 477091 472983 438886 420476 386555 361907 353144
11902 353144 358967 348404 336031 336502 357271 377907 398638 410715 398592 385364 366354 352046
11890 352046 359965 352360 349378 349219 343607 358773 375998 363753 378843 387212 373806 354703 354620
11877 354620 346119 323825 325986 327041 343263 349948 362885 380410 386488 350791 331629 341250 371603
11864 371603 367867 351146 327730 315417 339172 345007 325606 327301 341171 358813 401261 402557
11852 402557 419694 443613 458318 460264 459199 443146 403883 401735 386679 341680 335710 370879
11840 370879 387636 391239 362748 364649 360266 327463 295128 301445 302862 290451 314899 301149
11828 301149 296168 293225 304742 335324 342329 350462 383932 392759 423577 431165 408660 409712 443937
11815 443937 455475 462387 475668 458176 484513 506329 507594 505774 507712 514572 492661 486698 479911
11802 479911 474603 470509 450514 441616 446042 463135 489053 487607 526571 577889 597325 634715
11790 634715 686401 737037 786328 867619 957783 1012851 1045633 1074482 1098287 1097652 1121030 1170616
11778 1170616 1220223 1253556 1269589 1280215 1269643 1247417 1199630 1150516 1115570 1086724 1046907
11767 1046907 1037308 1056808 1061997 1043289 1054389 1036504 1008935 998370 1023903 1070805 1110562 1133969
11755 1133969 1156698 1185851 1220050 1252864 1245116 1229316 1222364 1203744 1230520 1256118 1257869 1255373
11743 1255373 1227598 1210575 1229143 1230900 1212880 1190941 1164093 1182025 1210589 1226942 1248908
11732 1248908 1275651 1287420 1287047 1350683 1417759 1475371 1544251 1606878 1644281 1683635 1719133 1727523
11720 1727523 1746020 1766554 1771049 1772586 1791266 1817603 1839638 1860263 1867702 1880232 1902865 1972179
11708 1972179 2021919 2067386 2095464 2148907 2168766 2200957 2298950 2398273 2452238 2496084 2573500
11697 2573500 2667674 2754044 2835206 2919437 3016813 3152109 3293683 3474970 3638919 3834867
11687 3834867 4037370 4241240 4458241 4721680 5019377 5354068 5720096 6154946 6644723
11678 6644723 7204336 7866386 8635500 9572927 10691436 11980166 13503671 15348790 17567438
11669 17567438 20300758 23798178 28375658 34508547 42706273 53659686 68006918 85980607
11661 85980607 106710297 127422691 144188406 153682236 154626490 147809098 135349928 119974605
11653 119974605 104255403 90028119 78208930 69058168 62474363 58387752 56749515
11646 56749515 57491880 60351511 64896887 70457458 76340867 82023466 87040573 90976338
11638 90976338 93594701 94922195 95372280 95782525 97359822 101311151 108494021 119136133
11630 119136133 132350980 146141614 157628466 164295156 164938203 159975009 151017391 140404506
11622 140404506 130260545 121851509 115437813 110608232 106632862 102835974 98709198 93924635
11614 93924635 88293010 81822612 74807383 67743267 61228904 55733419 51606311 49032210
11606 49032210 48232994 49416319 52838389 58904292 67973632 80313752 95563795 112125995
11598 112125995 126913807 136395908 138314271 132637008 121039715 105938185 89796032
11591 89796032 74561348 61259743 50159529 41075735 33672510 27732698 22973400 19188529
11583 19188529 16177943 13769787 11772196 10202602 8930498 7919966 7101321 6424221
11575 6424221 5868173 5387134 4977551 4585400 4252396 3932644 3624087 3333073 3103028
11566 3103028 2873111 2650046 2484962 2371093 2249452 2145777 2036705 1939832 1877112 1823644
11556 1823644 1744571 1673989 1640433 1587319 1511098 1466719 1429350 1449928 1451866 1422780 1446950
11545 1446950 1485622 1535834 1556429 1534910 1507462 1453939 1371738 1316359 1247818 1206230 1140369
11534 1140369 1125141 1129234 1071983 1021769 993283 971228 927858 903485 859814 816296 788102
11523 788102 730967 683566 674045 670176 692444 700499 745577 787578 829027 913234 983257 983994
11511 983994 953979 895645 849653 795545 697616 628144 598005 558545 489237 440650 425287
11500 425287 413711 407918 381238 335013 309308 282510 262711 258045 299395 314748 304099 277172
11488 277172 251173 245781 285685 312716 328463 362998 382014 370382 372287 398127 420842 427146
11476 427146 402073 345694 281224 230539 203349 169161 163323 167426 152717 123420 75082 68845
11464 68845 90827 104522 104948 91236 103066 111508 104619 91608 84682 77472 85644 60077 54213
11451 54213 31926 20844 16016 21634 55587 54667 58430 35577 24452 25696 42500 25237 -528
11438 -528 -13268 -33686 -42786 -14766 21981 36044 27317 9932 3025 18708 33612 17471 -8837
11425 -8837 -16159 5038 9545 3547 25147 25611 -5327 19687 39161 48647 33911 -6280 5331
11412 5331 541 8924 5944 -11157 -16755 -17510 -5742 15835 52333 67519 88642 101154 125463
11399 125463 181286 220773 273627 319492 408946 523684 610559 656629 681004 697606 677492
11388 677492 569721 486675 410547 350190 304679 248376 222630 199387 138779 75265 83680
11377 83680 87740 63545 51637 69685 51134 21193 -9228 -20210 -19369 -47326 -78670 -75053
11365 -75053 -57076 -59282 -57227 -54941 -66288 -70791 -72704 -81541 -95666 -137313 -148534 -120397 -105553
11352 -105553 -118099 -107074 -90389 -100324 -99807 -90785 -62734 -29512 -39202 -67593 -79023 -91441
11340 -91441 -108257 -87274 -63469 -69115 -74542 -91501 -78163 -87644 -70181 -77981 -103949 -88645
11328 -88645 -63724 -55931 -35564 -20682 -64068 -93497 -81124 -72610 -54056 -67726 -66942 -72845 -76398
11315 -76398 -61147 -68852 -81457 -93026 -120624 -134100 -121668 -108989 -84847 -70795 -79707 -88972
11303 -88972 -74390 -71472 -79225 -78180 -64500 -63839 -72052 -84306 -102073 -124337 -137045 -135324 -104518
11290 -104518 -110664 -121803 -77790 -24718 -31440 -28490 -33846 -55225 -86399 -86610 -50256 7706 20022
11277 20022 48400 78290 85495 106328 99907 63900 40816 1447 -12710 5260 14943 2058
11265 2058 -10269 -30850 -28368 -14424 -23677 -56270 -50174 -14006 -24563 -40366 -36108 -38230 -59607
11252 -59607 -71079 -64778 -30397 1058 12968 11647 -8787 -45732 -21287 -5112 43313 89258
11240 89258 61817 49892 78181 88171 112234 148039 201328 262629 315440 404127 490010 584518
11228 584518 668153 735182 798749 822124 802647 790948 748779 685851 638348 567627 481176
11217 481176 427709 393482 366353 344961 354958 379919 399620 423982 427908 451214 445691 472156
11205 472156 518915 542730 564500 578436 574993 591902 661237 706770 718804 750099 751341 717098
11193 717098 691938 658767 624917 585977 563987 559198 534766 523346 504668 477755 449314 395557
11181 395557 383530 365678 339372 306020 278125 254550 242915 264101 287961 329587 396364
11170 396364 472455 542006 647267 723158 731796 724407 700966 650069 592606 516989 460871 418923
11158 418923 363320 292450 219359 164512 146372 147633 149988 126364 124658 119744 123814 135328
11146 135328 123597 108127 86722 95323 100316 114221 116974 106537 114955 130671 125112 145162
11134 145162 148613 102394 101639 113492 117181 108479 98542 100032 112958 131941 139302 132311 130690
11121 130690 132322 130130 136633 177398 224580 270394 359618 442516 471256 528391 596157 652976
11109 652976 710095 734009 712506 647859 592615 542745 474381 430723 365480 303080 228515
11098 228515 188489 154869 123500 101287 58884 29170 18727 446 9860 27725 25955 -2128
11086 -2128 -30131 -16332 -27727 -22115 -31834 -49280 -27380 -16832 -19466 -10040 15268 29383 25223
11073 25223 17338 13994 -18106 -38914 -15237 -1216 -12811 9763 33087 23503 9550 12541
11061 12541 25791 20544 1973 -4704 249 23629 24570 22061 26335 13218 26674 30525 46897
11048 46897 77685 75807 55279 29487 6334 18733 24930 17212 4832 -28340 -15841 -7527
11036 -7527 18486 35129 11900 14960 30292 17368 3900 20091 37406 48841 57741 45519
11024 45519 22657 1507 8787 29941 63276 71562 48395 32119 27459 47742 50645 84729
11012 84729 62512 36031 32759 22607 20941 29276 8364 -1705 10445 4764 32492 33554 18742
10999 18742 41324 31663 24474 21254 20806 -7496 -3809 -3283 3714 5483 -15538 -18782 -15306 -32510
10985 -32510 -31996 -26682 -38351 -38800 -24869 -10626 19237 7944 20404 55368 73155 67510 46821
10972 46821 49825 97763 103781 96332 92673 68397 30644 20914 28536 45566 50446 57730 43392
10959 43392 40028 46884 76236 86070 92217 103883 118916 112646 121539 128173 95167 77124 79785
10946 79785 74463 76525 87150 100901 126809 141360 160071 183785 226569 234165 238715 268899
10934 268899 297571 359902 432688 506677 577655 688448 865596 1119231 1452259 1837949
10924 1837949 2210429 2405558 2432826 2326406 2083506 1781303 1463239 1203239 987930 814158
10914 814158 676736 560987 478190 420691 360219 297341 251959 237514 212551 193219 202385
10903 202385 203496 175291 144181 131962 126315 151722 155274 130609 140786 160051 147096 125952
10891 125952 129511 98185 66368 71724 92619 102520 63497 59696 89848 131223 130269 128310 143422
10878 143422 133829 126430 124312 128610 105770 92983 96520 79315 60181 83733 61285 34748
10866 34748 27953 43014 62093 73736 83281 69688 58950 59243 69283 90483 66682 47080
10854 47080 53388 90744 108590 117631 101477 107353 86010 87560 109667 124123 121742 132774 158683
10841 158683 156792 153674 172535 165072 156296 128196 125798 128667 113586 103766 99687 97837 122306
10828 122306 164759 176339 165732 182804 177936 199063 197245 158622 159389 141927 102047 74026
10816 74026 67093 84194 99477 100051 112570 163774 174862 177937 179481 167791 157161 146633 142033
10803 142033 160646 141943 122843 122098 107260 84964 103847 136033 128102 112791 93074 121392
10791 121392 188150 209682 204756 182905 167969 185424 208225 235818 237910 215239 179002 143679
10779 143679 139214 165514 178866 196780 212307 211846 212481 207529 230880 248705 252224 283795 301984
10766 301984 310667 323913 343001 331827 364339 434071 486420 532601 571402 576130 552545 499501
10754 499501 474461 455411 438899 464984 465838 429799 435649 420409 373620 352005 376514 382375
10742 382375 365191 361393 350044 358049 329611 299956 281579 259454 249202 227259 195295 173588
10730 173588 162924 147341 125770 117924 138613 121691 95544 80919 79618 85820 122052 153056
10718 153056 158237 148027 128056 150980 169473 159619 133028 107187 91299 92183 77158 57722
10706 57722 51853 61279 92333 142281 192889 229698 280236 347345 417218 474190 510333 548156
10694 548156 571666 598681 630430 645257 639769 661576 638070 621179 608138 592777 583232 553771
10682 553771 490603 434351 411606 421078 449486 436433 419549 409760 413228 422976 413972 371461
10670 371461 335729 334788 352452 357195 340495 327662 336286 351060 352607 375876 394500 429449
10658 429449 453028 438978 411766 441223 472774 514806 546362 533335 518417 500162 499529 510213
10646 510213 503050 504510 530135 574391 590164 591826 614246 666891 727141 804810 919703 1067517
10634 1067517 1227611 1393911 1535714 1624691 1661652 1611818 1528814 1458896 1350048 1287768
10624 1287768 1251269 1172632 1093403 1033823 990828 945299 914539 888823 885856 901784 911645 923421
10612 923421 916089 912931 914841 907496 922164 943533 954106 930879 931829 949173 964669 1007659 1065442
10599 1065442 1093709 1094299 1137038 1172346 1199256 1233650 1277179 1320227 1322623 1342330 1361106 1350747
10587 1350747 1345422 1352212 1340156 1323839 1311690 1354017 1398048 1428910 1443277 1459717 1457678 1484484
10575 1484484 1531431 1599216 1678917 1764807 1827264 1896436 1989379 2082318 2168782 2220561 2265971
10564 2265971 2330297 2398734 2442652 2491094 2526150 2598474 2690260 2804415 2923340 3030605 3156812
10553 3156812 3276621 3410906 3540737 3664049 3797223 3916829 4038085 4194445 4361125
10544 4361125 4518005 4661456 4806141 4998388 5247346 5539631 5849548 6162465 6518949
10535 6518949 6919379 7357649 7848077 8382049 9006612 9734888 10535201 11450634 12531101
10526 12531101 13802944 15257281 16988053 18954438 21065037 23277983 25691171 28466699
10518 28466699 31704999 35692835 40809535 47412021 56002403 67317788 82512603 103276117
10510 103276117 132192480 172852658 229263751 302032994 381137087 443508296 469817678
10503 469817678 459715132 421678409 365230577 302680768 244792738 196717393 158406334
10496 158406334 127567602 102319819 81861437 65762259 53378018 43957466 36861076
10489 36861076 31510246 27413466 24205964 21514731 19119164 16974739 15033837 13350784
10481 13350784 11886735 10683788 9649020 8769828 7989416 7306254 6685181 6154408 5679774
10472 5679774 5262128 4876720 4517874 4182737 3862551 3572146 3304980 3092543 2900925
10463 2900925 2714381 2549244 2392624 2198515 2024851 1877720 1758609 1668563 1588687 1498325
10453 1498325 1405003 1325603 1246730 1222227 1183298 1153451 1082499 1001391 959717 926854 871392
10442 871392 840135 867733 876520 852754 822697 796907 766677 741788 726313 729917 694210 630946
10430 630946 592802 582392 583085 577503 558678 542720 516762 492045 490743 454590 391817 338731
10418 338731 327732 345633 323203 292429 290015 294125 313949 295748 245947 216839 221218 208161
10406 208161 203710 184628 192317 188801 162396 148869 146706 156248 167078 184087 193441 177021 153620
10393 153620 137696 145707 125380 115315 122935 107843 83783 75626 73262 94238 123605 144973
10381 144973 180570 244860 310407 374284 448747 492620 456191 426181 417423 416960 403237 370993
10369 370993 346451 351340 320337 255835 216826 197756 174709 180607 173978 161561 125205 88001
10357 88001 72344 39251 17887 494 29295 59148 62353 60589 62436 64382 75999 85350 67557
10344 67557 71615 87484 83105 79583 48664 39014 28820 9831 -2370 34444 55130 42657
10332 42657 22398 3896 13142 6055 -31023 -54876 -63349 -54149 -91331 -112055 -118772 -128489 -139788
10319 -139788 -170040 -195706 -218743 -244998 -262316 -242145 -245736 -230076 -181953 -165684 -148575 -81328
10307 -81328 -35948 -5728 31991 93245 132210 132920 146495 167992 164393 121269 89490 63338
10295 63338 42708 42240 2756 -2887 -4094 16085 43406 42129 34942 47468 47562 61880 90581
10282 90581 100670 104598 96601 64153 49754 18908 -15263 -25103 -47761 -61079 -59984 -85582
10270 -85582 -160824 -187313 -185241 -207446 -229964 -227095 -198992 -181566 -177978 -177663 -145465 -156982 -134716
10257 -134716 -123560 -146509 -139672 -133300 -145533 -163396 -144971 -114471 -99119 -106368 -100918 -106292
10245 -106292 -127687 -110074 -90213 -73499 -94914 -106718 -84643 -58550 -81725 -84492 -87717 -89804
10233 -89804 -70722 -68892 -59592 -32915 -34191 -40358 -80932 -79791 -67419 -64590 -48556 -41602 -57831
10220 -57831 -73716 -109614 -136696 -127673 -109738 -107963 -79262 -51045 -56981 -61993 -41634 -49969 -49203
10207 -49203 -47076 -60261 -62253 -84038 -80332 -109708 -121026 -117747 -107762 -66724 -54215 -44088 -50012
10194 -50012 -77990 -114493 -115330 -100767 -91132 -80802 -57333 -54144 -60725 -64377 -39698 -28524 -19710
10181 -19710 -22399 -31107 -34964 -30650 -18160 -10274 482 16426 23812 15733 22158 63806 102151
10168 102151 105816 152236 229628 285590 329323 419888 537549 687027 904945 1186773 1504800
10157 1504800 1833233 2151744 2398965 2578929 2648047 2654810 2610168 2502355 2337423 2114662
10147 2114662 1812018 1518506 1257998 992425 773162 631028 507943 417023 343261 292210
10137 292210 226954 159541 128757 110152 84812 84812 95004 48723 35348 28248 -4858 -4118 4227
10124 4227 -11569 -24735 -12288 -29161 -40625 -27837 -5903 -15833 -36920 -22697 -615 10347
10112 10347 5312 16299 13727 16255 35231 27818 4792 18535 45065 89732 128215 155143
10100 155143 201115 218942 268148 341612 450868 558624 651270 737997 767557 797100 793477
10089 793477 801128 849644 898664 959543 1041466 1197241 1434702 1749852 2115232 2401068 2515001
10078 2515001 2448242 2223301 1929820 1636870 1335084 1082220 896657 719686 587631 485614
10068 485614 389179 300133 245617 200204 174457 136773 91169 94004 86160 84570 82816 70063
10056 70063 63411 63663 41967 24490 10599 -5736 -10621 -27022 -54473 -68312 -84961 -78358 -42603
10043 -42603 -19461 -26726 -59554 -50299 -30455 -45610 -56076 -58355 -65428 -41385 -27257 -49187
10031 -49187 -18336 5266 -11253 -36966 -50682 -48227 -26772 2588 8038 31259 47143 61480
10019 61480 57457 99268 163358 233452 303183 358343 403761 400859 386148 346235 280210 183097
10007 183097 120867 90707 78522 81438 55601 76234 93129 78021 80355 87897 102645 111951
9995 111951 92448 66864 44497 37552 20869 5911 -6438 -9411 4597 -7210 -44152 -55968
9983 -55968 -43043 -46146 -80855 -69809 -60321 -29571 -18664 -32798 -62345 -71939 -74870 -66541 -86637
9970 -86637 -143415 -144545 -109015 -79051 -56919 -76078 -71159 -76231 -83831 -89987 -92504 -76957 -68292
9957 -68292 -74171 -66974 -76676 -123668 -123226 -118393 -103351 -100144 -103509 -108990 -120547 -121584 -88341 -75330
9943 -75330 -88884 -94870 -95539 -115175 -109348 -117066 -120209 -112759 -87896 -56078 -35043 -54295 -83196
9930 -83196 -87464 -72567 -77198 -88646 -75149 -73724 -83739 -88158 -74137 -94071 -124145 -129979 -114622
9917 -114622 -107343 -76704 -40181 -55828 -79161 -84568 -75782 -98226 -84915 -74296 -68850 -63306 -62095
9904 -62095 -62653 -37197 -22326 -21011 -25181 -22524 -26388 -43650 -58836 -55871 -16486 6220 -8501
9891 -8501 -45319 -51278 -53823 -43128 -48295 -51009 -39247 -46402 -54630 -87258 -88821 -99650 -94660 -101937
9877 -101937 -99252 -97795 -91317 -78643 -43186 -23830 -47101 -76080 -70506 -59704 -49604 -45051 -48580
9864 -48580 -35655 -19860 229 -6164 7036 -12696 -8515 14260 23522 36282 91925 144940
9852 144940 200617 248290 311140 432769 635411 945002 1288414 1523876 1543202 1447093 1229052
9841 1229052 972301 716535 549496 414177 296098 236800 200602 136809 100515 75608
9831 75608 42693 9061 -8885 -25064 -32166 -9995 13020 5725 27643 44383 51259 48391 50964
9818 50964 24426 29514 18197 34715 52466 47918 -15430 -62722 -65969 -26339 -9328 23785
9806 23785 35446 44821 47311 20284 38877 55016 61366 51635 46925 21804 26359 48291 43382
9793 43382 55294 51050 44251 22314 -12426 -10984 -18403 -44252 -58647 -58042 -59765 -53155 -46645 -42926
9779 -42926 -32533 -67287 -64243 -66922 -59755 -60635 -54106 -31049 -40053 -53376 -32961 -26416 -6759
9766 -6759 -24407 -25138 -2776 -12092 -34294 -50280 -70227 -82623 -62901 -20054 -19567 9273 29632
9753 29632 28321 10262 -4962 3022 9413 18151 17277 -15032 -33757 -26725 603 -18837 -37891
9740 -37891 -17391 -21512 -29519 -8496 -11611 -21855 -7954 -29614 -34397 8699 7535 5228 -20334
9727 -20334 -2138 -3967 19866 48952 87185 163032 182762 196402 205971 203404 181851 181035 182109
9714 182109 179568 152664 135482 125597 92981 78936 73190 37126 1713 16904 35756 27370
9702 27370 26870 17126 14135 8485 -7085 -48547 -64025 -74157 -69997 -77916 -62083 -47774 -63225
9689 -63225 -98751 -76336 -68362 -77391 -80451 -86255 -73077 -63238 -49023 -40009 -27677 -7844 2863
9676 2863 -33823 -47134 -45723 -49990 -51292 -30273 -23156 -1848 495 14087 5159 2383 -21826
9663 -21826 -18958 -31886 -59973 -29086 -24245 -31450 -22816 -21182 -34233 -47581 -58006 -45754 -44009
9650 -44009 -34597 -20466 -1058 -5771 -21045 -46164 -60450 -63243 -57246 -42546 152 15829 -2123
9637 -2123 -27632 -29867 -32048 -46638 -65002 -59635 -23820 -35259 -62173 -54400 -36434 -50187 -76123
9624 -76123 -88256 -66649 -16362 -22814 -32930 -53566 -57718 -66088 -60895 -26347 -19960 -14802 -19277
9611 -19277 -34794 -43521 -38832 -18175 23276 19235 15177 -10278 -55750 -45213 -62845 -80780 -54885
9598 -54885 -27991 -41735 -56333 -53795 -50365 -41686 -45486 -57334 -63804 -51615 -53825 -35494 -23932
9585 -23932 -18709 4208 32396 36076 30276 -6744 -4334 -24419 -38839 -29874 -19809 -2757 -6521
9572 -6521 -31577 -17221 4013 -4043 -5310 7565 4747 13661 -1489 -20191 -9861 -13593 -25097
9559 -25097 -3612 7634 -9635 -26078 -37359 -28138 4678 17265 1212 9080 -18110 -38685
9547 -38685 -30030 -34402 -41940 -43013 -60592 -53395 -24079 11836 2469 -21706 -24333 -41000 -36352
9534 -36352 -40220 -38782 -10237 13773 -17326 -21903 -25113 -19757 13934 22699 14677 2896 -13390
9521 -13390 -10131 2239 -4196 -5875 -6222 -3176 -15711 -779 12729 21010 6835 -10931 -36257
9508 -36257 -22099 4991 -3293 -14853 -42495 -57102 -41730 -25582 -54922 -72122 -58509 -53205
9496 -53205 -47508 -23461 -16484 -13666 -33437 -29571 -48649 -47032 -50753 -67999 -50081 -12339 11422
9483 11422 34551 31433 268 -15429 -8017 43938 53738 2386 -30993 -22767 -6400 -8136 -15146
9470 -15146 -23305 -33873 -28865 -24382 -36062 -36265 -31575 -23752 -21015 -24006 -23447 -31143 -19308 -26111
9456 -26111 -12583 -24343 -33773 -32014 -5042 20436 24668 10511 7330 6889 1923 -4033 -9371 -38102
9442 -38102 -31459 -30115 -31073 -28301 -34623 -28097 -17409 -9814 1378 12378 18223 32299 31537 11035
9428 11035 -3905 4031 -742 8553 8223 -19527 8737 34327 21895 11181 18312 -4937 6837
9415 6837 33855 -1819 -34698 -19164 -21439 -8364 4695 10456 -9828 -56486 -72010 -12130
9403 -12130 5587 -23952 -37021 -30804 -3797 14400 7984 8400 -15413 -36463 -22015 -24884 -18150
9390 -18150 -22384 -30386 -8846 24226 19799 10980 14714 11146 12245 12113 -14052 -28698 -9555 20013
9376 20013 5453 -3196 9206 19337 11399 46469 77062 69919 25980 6330 9506 -7801 -320
9363 -320 17309 43272 40455 25814 3290 -7350 25476 58982 38592 44859 59516 58490 70928
9350 70928 65313 75905 75287 52201 42510 41897 38589 31958 18531 25516 44120 40545 23428 -2636
9336 -2636 -5387 -7781 35371 67823 20875 5078 -4332 -19597 -10514 -8796 3394 9402 17852
9323 17852 20274 6328 11805 37636 42884 43271 52090 44717 47041 44583 42240 35242 27975 54936
9309 54936 52754 49575 53587 51403 53190 69886 66375 73342 58745 59016 51001 70718 60705 45475
9295 45475 42488 56540 65643 68126 75460 89811 98511 94373 82277 74650 79033 62468 63947 71964
9281 71964 67200 63563 72836 89251 87824 80832 63437 44709 52508 70130 88824 79359 78043
9268 78043 83224 82009 83052 108663 129337 138998 126549 106882 95186 90270 80178 68617 56759
9255 56759 49088 37768 71255 86819 87019 82021 104687 122549 138948 141285 137156 115717 120330
9242 120330 98057 93996 90788 102867 140127 156239 160799 153335 160210 141190 107313 95590 94107
9229 94107 136953 131698 109550 109916 115927 112282 114774 101759 109436 121347 149559 173730 156735
9216 156735 124355 137336 152950 164833 153738 139953 135262 110517 113986 135565 159781 141299
9204 141299 119459 123879 106230 110621 122077 150018 159830 160404 143490 130331 135792 141001 144094
9191 144094 149981 117676 146286 167028 162977 163589 135357 125839 138286 150474 158658 198943 196486
9178 196486 179462 182501 180555 196755 207772 211133 229124 232259 245660 233060 248933 254027 245579
9165 245579 253094 247291 238041 222570 201247 203217 198739 220823 210978 213037 229594 245380 236191
9152 236191 239407 242138 226496 235499 233636 224368 228433 239490 230746 227398 216549 233081 239350
9139 239350 226245 231889 210787 200660 215161 223692 215843 196223 205486 228572 255263 268744
9127 268744 284591 304284 295729 266128 270119 291004 279397 289834 292244 281150 276912 277040 292773
9114 292773 321038 315593 311883 317204 332225 350860 355859 347337 338525 334775 367026 390485 379231
9101 379231 378779 375823 387451 402528 397811 403002 374561 382210 395274 377970 382137 417777 428642
9088 428642 441656 429695 419055 433018 467583 484914 501245 457782 446794 455251 442463 437133
9076 437133 461676 506179 538630 542477 520641 504419 530563 532285 517241 491553 479748 531538
9064 531538 566105 577490 582125 586575 576125 613396 635410 637031 662093 700431 693024 682266
9052 682266 693341 714609 739164 768739 787383 789887 794342 812400 850194 901079 900876 875940
9040 875940 883422 893465 894169 924516 950182 965039 937597 909042 927645 933420 940338 947360 954142
9027 954142 962521 967813 990806 1008952 1017864 1032487 1079893 1086647 1070334 1085449 1114695 1132314
9015 1132314 1173867 1203492 1195663 1199177 1233998 1251078 1277063 1338745 1378117 1387333 1390892 1423160
9003 1423160 1484520 1535473 1565237 1605744 1629434 1672454 1727532 1761399 1798517 1850757 1876730
8992 1876730 1887760 1910089 1925033 1955482 2025545 2088002 2156786 2243644 2312289 2367430 2411802
8981 2411802 2478983 2586315 2678936 2760539 2857259 2973724 3059963 3135436 3234358 3350920 3464320
8970 3464320 3590998 3717737 3836688 3971535 4081928 4204736 4397466 4603893 4828209 5032509
8960 5032509 5223864 5420372 5653084 5887202 6155260 6449586 6749650 7091125 7486570 7893211
8950 7893211 8321494 8785206 9276004 9784719 10354287 10974773 11633383 12414182 13229787 14117634
8940 14117634 15101436 16167896 17361997 18656100 20056224 21594687 23309445 25166937
8932 25166937 27235019 29481083 31902145 34483417 37209363 40101527 43129494 46178473
8924 46178473 49161641 52041291 54703402 57011639 58855863 60148289 60835774 60894608 60292733
8915 60292733 59045942 57248664 55000486 52346125 49450346 46445358 43385800 40339619
8907 40339619 37373289 34534033 31861461 29338988 27012885 24882571 22962875 21209195
8899 21209195 19592797 18106306 16764701 15566457 14478591 13471540 12590527 11777468
8891 11777468 11008127 10308771 9670761 9093352 8570263 8086529 7623445 7209929 6824320
8882 6824320 6459694 6142563 5829254 5535429 5241620 4954538 4733042 4530403 4324374 4125525
8872 4125525 3946017 3767484 3615472 3490864 3347237 3174605 3021772 2909522 2817438 2709686
8862 2709686 2596341 2501924 2444828 2389769 2301397 2221271 2142020 2067986 2003952 1969385 1923574
8851 1923574 1832925 1739908 1677490 1640646 1571031 1520274 1493822 1454643 1410939 1378731 1320701
8840 1320701 1260055 1209090 1191755 1156626 1146369 1142695 1105943 1077360 1029295 977216 961884 949352
8828 949352 922923 886586 869218 862785 865413 860191 837575 785586 768786 760219 733347 724686 708083
8815 708083 696883 683325 687147 695501 711157 700753 629942 568589 578377 583283 579145 572257 576381
8802 576381 573660 586091 558699 525470 492286 475694 470537 480015 492689 484424 476210 452883 413246
8789 413246 394623 414939 387313 391449 400341 400365 385580 367833 391334 391318 396169 389922 375519 371410
8775 371410 374411 340677 279239 259870 268625 272740 286119 306969 334642 328904 305808 305647 306541
8762 306541 291360 262467 266868 268950 281248 282882 278607 253250 236615 244558 240497 240286 246980
8749 246980 230874 193799 182169 201117 206366 188581 196539 192609 194250 189006 180462 171821 168045
8736 168045 160292 139095 139023 169559 171797 127358 102065 104086 100927 106491 109501 141573 137484 134787
8722 134787 163375 170333 165615 179497 180571 176874 184928 204350 209303 176220 157572 148520 166584
8709 166584 189423 193477 205776 196623 186178 185992 190358 185655 171064 158805 144629 149053 163084
8696 163084 150295 129301 115310 119665 121114 84502 57828 53034 44692 52998 69040 72615 81442
8683 81442 93984 88316 49801 37743 38369 52290 51947 55303 82809 93405 47762 24626 34637
8670 34637 65658 96418 98249 100070 79465 21562 1261 5588 24749 30861 45300 61082 72688
8657 72688 50859 16535 35964 50790 61613 78426 120974 132115 163234 193956 257818 381041
8645 381041 458516 468941 445654 378979 309248 243253 190619 162992 143454 117625 125350 138550
8633 138550 133634 113416 69805 57295 72222 85673 90072 87432 100602 112070 85597 86852
8621 86852 95760 101471 97360 67434 63074 92920 85599 76209 114025 126371 103666 120866 110738
8608 110738 129893 165407 179652 209301 282407 414573 576423 727478 861320 883924 857501
8597 857501 795777 647651 522862 435091 341117 295001 268795 218698 187874 145666 91248
8586 91248 75620 77858 79590 61245 39972 37799 11071 28602 42163 51572 50247 38335 52667
8573 52667 51483 22450 24429 12640 20320 27780 51381 62009 45074 51339 52511 51188 79303
8560 79303 111305 121803 128943 200916 283538 368688 393504 370788 318138 223966 171874 115629
8548 115629 60779 36449 7798 -13383 -32657 -35511 -6611 -17380 -38335 -43596 -47233 -23251
8536 -23251 -8539 -8738 -12265 -2912 -27914 -50513 -8438 -13614 -1044 27466 22708 -2591 4206
8523 4206 30418 52227 48445 38077 41012 66017 59287 50876 33622 32471 17801 16417 16352 3483
8509 3483 -2873 3007 -12793 -26872 -45283 -73128 -59958 -41356 -48228 -46058 -40393 -36501 -15324
8496 -15324 -22931 -38243 -31444 -31859 -31343 -25773 -22696 -19686 -17770 -28644 -50354 -55695 -57098 -38088
8482 -38088 -29477 -38508 -45617 -44100 -26319 -25238 -14230 -1592 -3053 -12054 -43165 -25276 -18271
8469 -18271 -21949 -38829 -44530 -40240 -36843 -16806 35592 35357 15053 10780 12195 6997 5951 12673
8455 12673 7613 -7813 24869 20810 46275 49653 41226 42496 42509 46984 42855 29835 41052 33632
8441 33632 18462 13076 24485 10626 14315 36041 31829 27821 10148 14401 24154 25234 33373
8428 33373 44371 52980 69182 44386 26417 10385 27071 68011 71077 76285 68222 63883 49766
8415 49766 33319 39245 67146 66880 55696 23902 6655 -11478 26013 67294 98879 67357
8403 67357 78579 71679 49669 25972 32337 34100 11849 2283 -9044 6215 6507 805 -4192
8390 -4192 -13481 -33519 -34926 -21558 13739 36283 43539 54586 44543 62349 85490 65378 28020
8377 28020 10156 24004 40654 46729 14799 8815 16733 -1562 -6698 -19851 -28381 -5651 8159
8364 8159 38950 14620 -11114 -18170 -18011 -3064 -25220 -56729 -69571 -77261 -60284 -40952 -29493
8351 -29493 -12586 -21004 -26378 -11799 -28374 -36197 -36194 -26612 -30197 -26410 -5227 -5541 -15321 21659
8337 21659 32867 24090 16598 -9029 -13988 -13195 -1352 -158 -20810 -4142 26641 41412 24476
8324 24476 31151 52548 12595 -20983 -39018 -81364 -81763 -41247 -36200 -50888 -65895 -84635 -97509
8311 -97509 -85029 -64174 -39509 -55169 -40962 -33538 -47597 -66518 -53426 -69656 -62033 -68955
8299 -68955 -62267 -47703 -39972 -12852 5420 244 -29680 -24867 -17661 -26403 -49451 -40674 -39531
8286 -39531 -19481 -9707 -23483 -30029 -45097 -54773 -37697 -48073 -50575 -31282 -12381 -29335 -90475
8273 -90475 -112411 -97210 -88502 -87635 -92023 -75603 -39072 -32798 -32791 -30964 -16958 -14904 -29067 -18418
8259 -18418 -16903 -34358 -55210 -50209 -43135 -46975 -50044 -70332 -44456 -38627 -63239 -53646 -27145
8246 -27145 -18356 -34372 -56974 -44863 -36568 -65177 -73024 -50341 -51842 -56926 -55078 -66062 -83838
8233 -83838 -87540 -67254 -43564 -31354 -28010 -18237 -7969 -17542 -41888 -52438 -63378 -32477 -5271
8220 -5271 -18385 -17855 -27747 -11815 10685 8728 4108 436 -5807 -12039 -12902 -22031 -50201 -59269
8206 -59269 -80463 -81358 -77512 -52862 -31230 -23031 -33015 -47383 -37001 16462 20106 22054 11571
8193 11571 -7300 -20730 -37384 -30098 -27287 -46971 -51686 -50873 -48203 -72029 -92313 -87498 -72964
8180 -72964 -59739 -48660 -55048 -44055 -34605 -48245 -74976 -78412 -68811 -65901 -42782 -21204 -20981
8167 -20981 -42141 -45625 -55432 -28458 -16246 6227 -9100 3637 -27850 -40769 -17089 -6654
8155 -6654 -10862 -4757 -7056 985 6574 -23518 -34129 -32046 -22341 -24665 -57855 -57844 -50384 -41726 -63963
8140 -63963 -69625 -59850 -41387 -47069 -68184 -46772 -18028 -24846 -50624 -29448 -17757 -5245 10298
8127 10298 -7253 -23931 -18020 -37982 -27233 -30142 -60190 -42197 -38306 -70966 -88766 -66314
8115 -66314 -72227 -90624 -80171 -90165 -69895 -70200 -99806 -103662 -82388 -70026 -53005 -14892 -9369
8102 -9369 -47330 -55049 -32750 -29240 -12106 15289 31381 11999 -11458 -4118 -16777 -64768 -56703
8089 -56703 -64238 -72466 -40318 -3433 -17909 -21196 -5448 -496 -16962 -45191 -67749 -68564 -65941
8076 -65941 -68213 -58105 -44411 -46845 -52200 -49259 -48578 -71040 -57356 -23531 -26962 -38989 -50310
8063 -50310 -62833 -70905 -81404 -97701 -66081 -57358 -69102 -59008 -49068 -38455 -30177 -44449 -55721
8050 -55721 -51568 -45681 -42685 -38638 -28241 -45485 -67281 -62774 -39746 -62745 -94642 -98580 -63079
8037 -63079 -17676 44 -603 15131 27460 36011 10900 1256 -1363 -20646 -23583 -4967 21202
8024 21202 56754 44641 16890 15076 39017 19306 19934 33733 15884 -4601 -17546 -28619
8012 -28619 -28868 -60355 -47496 -25061 -21168 207 16489 10484 -20064 -21599 -19048 -11066 9665
7999 9665 6461 33153 60741 50487 30913 -2516 -18373 -34330 -30702 -31344 -32936 -22947 -27509
7986 -27509 -52953 -36462 -35687 -42151 -28764 -24612 -14124 12660 23816 45886 46792 35328 39481
7973 39481 19119 -99 21654 34138 20655 20421 30991 23090 21337 25157 30455 41647 44766
7960 44766 46825 60328 43495 33931 17947 -4456 -17166 -12751 -5107 1526 -3283 9824 10388
7947 10388 47582 56234 28017 40538 42947 12843 -7004 -8459 -24664 -33079 -35806 -39359 -25273
7934 -25273 -29832 -15589 -22005 -24731 -9569 -16713 -29484 -14863 6603 12621 -8991 -22108 9763
7921 9763 40413 50236 43264 8696 648 -5147 5632 18783 6565 3697 26315 53713 38917
7908 38917 25502 4728 -3244 -18249 -27417 -50695 -47401 -46197 -21336 -16093 -10927 -14363 -12431
7895 -12431 -7063 17567 -2845 -31747 -39221 -23681 -18409 -27621 -18082 2364 -4842 -19784 -23240
7882 -23240 -16012 -12181 1798 3978 -17199 -28605 6939 22223 -924 -24358 -8020 -21118
7870 -21118 -15772 7243 10531 -670 -6383 -3593 19878 20116 -37103 -59387 -52117 -49826 -61469
7857 -61469 -78617 -71800 -59319 -52488 -41607 -27130 -52321 -36542 -28126 -32872 -32662 -28983 -34989
7844 -34989 -28468 -35100 -58589 -62442 -53079 -43484 -47167 -37864 -1276 58693 37806 6007 -9129
7831 -9129 -17411 -24814 -33406 -49901 -54608 -32411 -30532 -27142 -18033 -27483 -35962 -22538 -54000 -22304
7817 -22304 8052 15880 13369 4070 -20369 -40153 -15266 -16395 -27833 -16660 -34131 -56258 -54473
7804 -54473 -59892 -62924 -79502 -54143 -36879 -26658 -44366 -40123 -31871 -15608 -21161 -29121 -47817
7791 -47817 -34499 -6378 -4679 -8154 -245 -6783 -17516 -22111 -11130 27195 29622 27393 23047
7778 23047 -5743 -20408 -32520 -27091 -21801 -31360 -24024 -8336 -18615 -40172 -45281 -51320 -36083
7765 -36083 -28540 -43929 -48407 -28664 -39517 -36377 -23107 -18355 -36650 -46703 -25578 -31600 -41248
7752 -41248 -55332 -51650 -60235 -57755 -26154 -27708 -16702 -5321 -22945 -8168 -24397 -40697 -25765
7739 -25765 -32287 -49435 -45156 -42943 -51509 -46198 -37849 -45196 -61889 -55538 -55498 -55980 -57094 -72154 -62013
7724 -62013 -47773 -67462 -92758 -52553 -20983 -24106 -38764 -36058 -22925 -31683 -44324 -56379
7712 -56379 -55520 -55169 -67018 -55869 -16086 -16434 -7202 1816 -10611 -35194 -8095 8192 8260 -2439
7698 -2439 -20177 -37708 -69566 -56888 -48199 -70717 -62004 -55358 -33379 -16103 -46953 -55490 -55487 -51081
7684 -51081 -45007 -73103 -59732 -37579 -38849 -12711 -11 3112 -10839 -32728 -13328 -2529
7672 -2529 -9809 -26766 -50039 -61614 -70538 -84884 -96874 -97013 -72903 -71031 -46091 -45207 -54648 -60075
7658 -60075 -67226 -48360 -50265 -65946 -83630 -80649 -42534 -20993 -30031 -15582 -35984 -49862 -30433
7645 -30433 -28062 -12936 -17721 -25804 -44668 -53398 -49613 -66497 -36483 -21619 -30708 -53244 -83553
7632 -83553 -70680 -50444 -46846 -55779 -55616 -57475 -40619 -32393 -30452 -46209 -57139 -38241 -58532
7619 -58532 -64740 -60414 -46484 -45439 -38564 -38862 -56639 -59981 -35718 -2076 16712 1243 10215
7606 10215 -8111 4846 -9305 -6551 -9803 -11709 9602 7376 -10581 -16305 -14320 -22067 -20458
7593 -20458 -8177 11397 -13353 -27178 -45051 -51329 -39519 -23640 -42293 -58172 -73277 -70911
7581 -70911 -61494 -64577 -63837 -54182 -51738 -47782 -26501 -39152 -45735 -64759 -60714 -19514 -23087 -39234
7567 -39234 -49217 -63057 -57004 -38840 -49592 -76915 -67357 -55710 -68933 -66549 -40948 -13766 4363
7554 4363 -1718 -7570 -33076 -30752 -53489 -57301 -42122 -35108 -25998 -30167 -38283 -36173 -20698 -11605
7540 -11605 -4737 -17290 -22714 -30016 -30798 -36709 -29096 -14811 -33322 -40062 -36635 -46506 -74798 -56538
7526 -56538 -40757 -43645 -57472 -44381 -34020 -31724 -27191 -25379 -32946 -52535 -68055 -61858 -56795
7513 -56795 -39367 -30483 -17707 -21727 -64659 -74766 -80920 -72520 -61565 -57127 -36730 -30166 -29775
7500 -29775 -36775 -56434 -62242 -41698 -50538 -59533 -49030 -39594 -52166 -50683 -43014 -49224 -51754 -34763
7486 -34763 -46642 -68414 -66607 -60725 -38528 -28474 -32310 -38437 -48873 -60473 -54132 -45870 -37712
7473 -37712 -51574 -51974 -53092 -47945 -52069 -68961 -61895 -52394 -63076 -63925 -39364 -42326 -14277 -9266
7459 -9266 -26585 -35174 -58226 -71838 -58266 -38766 -40993 -38512 -50240 -33511 -31533 -30668 -31472 -36156
7445 -36156 -20985 -16480 -12898 -26833 -24672 -50137 -60593 -47529 -63589 -44045 -35869 -35222 -43491
7432 -43491 -36496 -15112 -16046 -702 7607 -9347 -26239 -9512 -8377 -53917 -74991 -59376 -58284
7419 -58284 -70221 -37943 -13419 -19855 -26421 -39386 -48685 -60673 -77821 -80370 -62095 -26700 -20966
7406 -20966 -15944 -38587 -42961 -43457 -65774 -41488 -17339 -12182 15854 -5468 -39261 -23675 -20504
7393 -20504 -23926 -39841 -35210 -48455 -46334 -37791 -29778 -4797 29026 4852 -25585 -40669 -15749
7380 -15749 1090 6368 16112 5444 13263 15070 2524 -11861 -28505 -32547 -34128 -23913 13267
7367 13267 -271 -44742 -55078 -48550 -27230 -20178 -19329 -42015 -59898 -81095 -82933 -53960 -40746
7354 -40746 -22356 -21954 -57642 -65976 -65323 -44704 -15943 -26981 -30215 -14532 -21575 -30141 -23619 -40992
7340 -40992 -51941 -33797 -19351 -40900 -36135 -31112 -42107 -25457 -11000 -8610 -10922 -20014 -34669
7327 -34669 -29974 -8785 -34329 -57218 -52503 -59191 -67806 -52070 -45809 -29086 -2327 -25679 -35563
7314 -35563 -1618 21468 12950 12392 11549 446 9381 30175 32931 14428 -13200 -25317 -39533
7301 -39533 -25717 -32484 -62502 -41032 -32039 -25905 -37481 -39513 -35200 -23191 -45797 -61563 -43721
7288 -43721 -14425 -6342 -2195 -24179 -36660 -75245 -62708 -24393 -520 18910 30130 25256
7276 25256 13867 -15718 -57892 -66936 -70600 -56778 -16840 21327 524 -17989 -37859 -44105
7264 -44105 -19741 -2321 4517 6164 -24265 -29050 -24721 -51155 -62734 -36042 -46576 -34195 -8067
7251 -8067 18374 6835 6865 -12858 -5810 17956 -17662 -49773 -32190 -33323 -38154 -57234 -63969
7238 -63969 -72089 -65611 -61259 -32105 -19332 -13276 -16221 -44835 -54332 -35592 -9253 -35376 -43282
7225 -43282 -46107 -30568 -25602 2184 35850 20610 5701 -1040 -12887 -19191 -7677 -31397 -37344
7212 -37344 -48571 -33485 -17213 -17067 -9093 -13456 -591 -4193 -4907 -1583 1339 2356 -29034 -12938
7198 -12938 13093 31026 13470 -37188 -53112 -69648 -57853 -44730 -59115 -66261 -45515 -34631
7186 -34631 -33373 -43520 -47766 -21933 -4005 -6570 -7960 -28007 -35937 -50090 -56348 -65464 -75035
7173 -75035 -49875 -24636 -21626 -6029 -12713 -5885 -12818 -45826 -44641 -50847 -37646 -32254 -40684
7160 -40684 -57836 -47989 -24030 -11576 -24633 -46488 -30556 -12038 -5599 -8979 -29764 -30253 -27471
7147 -27471 -16152 -12714 -30568 -16679 4408 -201 -19774 -53164 -62233 -44263 -34753 -26312 -38188
7134 -38188 -37355 -27685 -40476 -28657 -27828 -9349 -7138 -12947 -4946 -6196 -31442 -23842 -12399 -19114
7120 -19114 -38767 -43843 -36748 -21726 -36667 -41677 -35917 -17815 -6164 941 -16708 -45911 -64842
7107 -64842 -36835 11282 472 -16612 -27122 -31546 -55618 -82938 -89569 -84902 -79486 -55889 -38394
7094 -38394 -25791 -19596 -18543 761 -15254 -13997 -5546 -9093 -41436 -72951 -77415 -51733 -33167
7081 -33167 -15728 -19949 -13791 -20224 -7195 -16756 -37703 -38935 -23529 -31641 -18395 8327 3796
7068 3796 -28927 -37312 7528 14488 5088 797 -22213 -33653 -55406 -62458 -31691 -20112 -11795
7055 -11795 -793 -15722 -25170 -29817 -40224 -39402 -34360 -27843 -11561 -1984 14726 -1755 1250
7042 1250 -5704 -16251 -35170 -20092 -14661 -9724 744 -5507 -87 -7935 -27906 -41923 -55385
7029 -55385 -51135 -66118 -85387 -90441 -55476 -56625 -67264 -59410 -50634 -33704 -45817 -66230 -37647
7016 -37647 -31896 -37135 -25356 -19876 -22536 -31980 -44434 -66958 -46554 -41887 -46752 -61124 -93876
7003 -93876 -110656 -112927 -96377 -102225 -97983 -81674 -73400 -48156 -53048 -36470 -30320 -63795 -51070
6990 -51070 -44167 -54312 -20462 -27949 -20197 -37614 -34782 -31741 -34071 -25029 -9351 -17370 -55046
6977 -55046 -68612 -47709 -21865 -12429 8584 -7879 -17386 -14003 -5258 557 -4187 -1130 -11887
6964 -11887 -42860 -60860 -49605 -40347 -29315 -15455 15818 24222 15758 12759 -4128 -9736 -11515
6951 -11515 -7013 -4019 -4972 -30211 -47868 -30558 -36278 -40080 -31344 -20361 -19565 -30866 -28803 -19271
6937 -19271 -33321 -31054 -28076 -31912 -23010 -28442 -28708 -18997 -28716 -4150 29192 20391 -11985 -15683
6923 -15683 -8968 9374 -11863 -43427 -32061 -14106 -13563 -28729 -39676 -29583 -54027 -63586 -42444
6910 -42444 -31356 -30990 -22442 -25159 -39080 -45217 -55647 -62661 -40823 -17758 -9014 -14515 -14938 -19706
6896 -19706 -9968 1068 -3891 -13730 -37828 -54764 -65225 -68794 -56866 -54861 -29932 -15502 -5883
6883 -5883 -11711 -9446 12702 -18854 -27631 -4548 -9781 -4610 -20758 -8101 -12933 -21826 -36943
6870 -36943 -56091 -49344 -47422 -30046 -58875 -67091 -54942 -42606 -21764 -20835 -40916 -48949 -54556
6857 -54556 -34853 -21178 -34838 -4536 20979 33547 10631 -29654 -37591 -14162 -13631 -12454 -14225
6844 -14225 -15254 -33953 -19203 -18945 -9935 -8111 -10974 -26305 -10622 28917 31474 30050 -3308
6831 -3308 -16544 -43200 -30778 -38212 -55357 -56080 -33607 697 -18877 -16211 -9987 -1129 5334
6818 5334 -3111 -6332 -28632 -50928 -34179 -19800 -21146 -33000 -52300 -50193 -54064 -15663 22375
6805 22375 10859 -33159 -25125 -2876 -2989 -32266 -37708 -31827 -25962 -5828 -5448 -13682 -28726 -24429
6791 -24429 -17728 3359 22451 23130 19191 4622 -21754 -1574 20475 17389 24481 18958 9456
6778 9456 1686 -11085 -19506 -41079 -68530 -64487 -57634 -73527 -71553 -60914 -62317 -39397 -49278
6765 -49278 -62578 -59269 -27468 8945 -8685 -15158 -16940 -14885 -26856 -30531 -35729 -49392 -46826
6752 -46826 -48732 -51495 -53704 -53378 -46096 -13461 -22856 -10921 14391 17498 1332 -3617 -449 41927
6738 41927 37154 32109 48443 39412 4086 -26769 -47467 -44962 -22454 -4094 -418 -15215 1214
6725 1214 11462 25400 32048 41186 85066 95532 63705 55577 16697 13375 -18403 -35108 -31330
6712 -31330 -27188 -38552 -35200 -32919 -36009 -59731 -29710 -131 14252 -21894 -34612 -26702 -50631
6699 -50631 -47765 -34940 -22163 -38805 -43974 -21052 -16686 3053 4625 15075 12401 40473 30339
6686 30339 -5600 -15838 -17672 -17239 -9258 12671 20389 -4592 -11609 -20463 -13519 -11563 -11093 -12272
6672 -12272 -12928 -24586 -40913 -21021 -7062 -9904 -15634 -19217 -29028 -11827 9675 14044 14001 7192
6658 7192 -1982 -9670 -11324 8866 15789 30054 48282 46685 29546 15539 -8274 -31432 -38790
6645 -38790 -7925 -14 -6320 -11723 -20992 -35731 -22438 3207 -25621 -17697 -15255 -36656 -25555
6632 -25555 -45665 -57614 -28428 1428 -4933 11925 11424 3992 3065 4527 -3349 -6745 -16090 -46811
6618 -46811 -50717 -46732 -46199 -8716 28620 44754 34485 13704 -14046 -29430 -24362 -8383 4170
6605 4170 13137 41511 22240 -16433 -6870 -6624 -10713 -27420 -45055 -48619 -49472 -61934 -47497 -40598
6591 -40598 -37511 -19788 -7974 29075 41408 22066 -15270 -32519 -32412 -36915 -16293 -5847 -4418
6578 -4418 -28509 -48370 -58491 -53022 -34714 -1302 15410 16051 28420 35297 18496 11007 -18877
6565 -18877 -38328 -32905 -23216 -28741 -19855 -20628 -3654 18532 62 -29468 -44476 -55335 -53544
6552 -53544 -65305 -43558 -19794 -19263 -11529 -15913 -9834 -14361 -17055 -30199 -23292 -24694 -12048 -11441
6538 -11441 -18719 -25490 -3604 -5693 -16068 -13569 -13094 -21610 -26094 -54588 -75385 -33300 -17903
6525 -17903 -16628 -36467 -29326 -23621 -19713 -28682 -39464 -27599 -25187 -38642 -33795 -41840 -26771
6512 -26771 -30958 -28792 -31813 4527 25283 -12825 -21254 -30924 -21439 -25804 -21407 -13623 -4221 -13788
6498 -13788 -27195 -2517 8094 -2312 -18830 -5237 10586 15973 4060 -45362 -54860 -23619
6486 -23619 -30141 -44792 -49478 -28306 -19356 -36905 -14396 13703 8839 -33435 -56269 -26671 -15612
6473 -15612 -32875 -32695 -29187 -33947 -27438 -35278 -30399 -28705 -3110 -483 14725 5073 -11677 -15587
6459 -15587 -582 15902 12730 754 7552 21247 51643 66618 57814 46258 61637 44733
6447 44733 20882 -16316 -23731 2311 23480 30382 13979 16342 6028 10953 -3464 -10928 1137
6434 1137 13849 17328 16545 8632 -10560 -20503 -24773 -20990 -1547 -10297 -16687 -23088 -30657 -39609
6420 -39609 -41605 -46057 -41189 -33611 -43560 -53434 -49570 -65315 -35127 -49509 -52310 -35065 -17487
6407 -17487 -15803 -25516 -30777 -36438 -41284 -67371 -76767 -67354 -36333 -12125 -6578 195 8583 -14272
6393 -14272 -35874 -10335 -14618 -18372 -37749 -31447 -36370 -50764 -39221 -14797 -30537 -25453 1612
6380 1612 -1679 -1535 10996 27297 1124 -466 -8477 -22013 -22156 -18245 -14585 -15138 -43644 -53141
6366 -53141 -27004 30390 64166 67724 41899 39273 21406 -11951 -29586 -46360 -46853 -20419 -14737
6353 -14737 10377 -12350 -27556 -30618 -6884 11437 5165 4680 -3441 3080 9625 -10410 -28805
6340 -28805 -35780 -49990 -43202 -14304 1109 -7212 6004 -4265 -4815 -27065 -26273 -6203 -6274 10781
6326 10781 22002 8579 11156 15274 -30221 -31605 1669 32393 44185 44832 6508 -7273 -24063
6313 -24063 -7697 -2603 1079 638 8147 -18566 -23923 -6953 -16860 -22691 -28602 3265 33678 50394
6299 50394 40144 5387 -7094 -12036 -510 30938 45192 53910 52582 19885 12873 7295 -11532
6286 -11532 -48067 -59110 -49496 -14842 793 -14036 -53850 -80746 -70467 -31552 -17436 -42715
6274 -42715 -50989 -24841 -4451 -31049 -41314 -55815 -63555 -58841 -60386 -53121 -40500 -9489 -18281
6261 -18281 -33275 -45115 -55778 -76777 -86497 -50116 -13590 15933 1461 -14122 1362 6835
6249 6835 -12196 -15288 -17194 -7009 11564 16603 -16688 -20755 6128 180 756 8284 7863 -10746
6235 -10746 -1072 -11483 -24188 -38335 -54865 -49165 -2352 6095 -12093 21062 50384 44717 23844
6222 23844 15746 25 9557 14667 25246 20471 -9926 -10199 -13762 -31005 -25781 -18943 -4116 7126
6208 7126 -21512 -2459 1498 -4913 -11667 -22577 -27994 -21670 -27551 -38215 -38121 -25272 -15272 -22540
6194 -22540 -13490 -26344 -21609 -15216 -10854 -19367 -49157 -54416 -54062 -46668 -18772 -23962 -45757 -55152
6180 -55152 -70315 -69275 -20476 -20975 -30930 -37093 -35680 -25027 -35941 -57188 -31014 -273 -7062
6167 -7062 2213 9394 -13182 -2154 -8678 -17604 -24822 -20355 -40755 -41378 -42866 -6651 7498 6691
6153 6691 3275 10878 6525 15466 20005 -1464 -14981 -223 7789 -23468 -21780 1376 13275
6140 13275 -11694 -25636 -22283 -19544 -2699 22107 33331 31420 26487 36950 43337 23968 2479
6127 2479 -9521 -7574 11 -13528 -20506 -8978 -25991 -19325 -17582 -1187 4440 -754 -7307 -9672
6113 -9672 -11248 -24098 -24851 -62321 -76401 -60559 -39267 1767 25015 22271 17660 -11498 -21167
6100 -21167 -24579 -37178 -40188 -26333 -36660 -48154 -53877 -32687 -5960 -19089 -26973 -15895 -4880
6087 -4880 4844 36863 49839 23012 26722 35997 23785 8188 2142 21106 3802 -22059 -30354
6074 -30354 -28022 -36816 -46822 -45961 -38922 -48616 -61103 -62385 -25497 478 10964 9205 -1331
6061 -1331 -40624 -32156 -42548 -47576 -34880 -12600 -1178 -28790 -39081 -21122 -19121 -14240 -37844
6048 -37844 -68771 -83789 -31258 6714 11280 -7940 -28967 -45323 -57414 -62646 -57312 -18249
6036 -18249 12969 -15994 -36824 -50436 -23990 -7907 6985 27474 15168 -2780 1582 6469
6024 6469 -21362 -22647 -13748 16637 30846 29344 35085 55979 48747 4372 -1551 17523 6135
6011 6135 -14159 8153 34029 60637 70395 46580 34346 12712 25827 1681 -5633 2014 9113
5998 9113 1133 -25603 -36473 -51187 -57127 -31852 -26872 -6966 24676 43716 18331 -47914 -37808
5985 -37808 548 -577 -7484 -8219 -15075 -8380 -25860 -14922 -4823 -31931 -60371 -43521 -24405
5972 -24405 -2022 -8179 -23001 -18861 -26656 -16716 -7276 -13806 -23763 -17612 -15808 -18742 -8455 2761
5958 2761 -18366 -26110 -13259 -42044 -48245 -18574 -700 -2962 4229 8825 -7278 -17289 -25341
5945 -25341 -36443 -20764 -19365 -7983 236 -6624 -5583 3874 8405 -2844 -18202 5876 18810
5932 18810 16593 -2871 -25744 -8786 9604 21436 8376 6115 13864 12740 14117 6275 4137
5919 4137 -12500 -30817 -31435 -34359 -41595 -24767 -12513 -39106 -58478 -49580 -26339 3328 17093
5906 17093 27011 30913 19810 1963 20741 46376 42655 31834 -5773 -22273 -26846 -44463 -57926
5893 -57926 -51633 -27841 -23854 -44952 -43347 -13048 -15752 -6481 -314 -8909 -15739 4125 1866 -24137
5879 -24137 -20327 1871 -9427 13172 9132 -26795 -7484 -16682 -14490 -24696 -32631 -32855 -19303
5866 -19303 -9024 2159 5319 -17282 -47625 -62280 -56320 -61193 -63500 -83531 -71600 -53320 -36925
5853 -36925 -18350 -6198 -6044 11384 20908 6617 2542 20574 2389 -18109 -5832 2128 -3650
5840 -3650 -87 24372 42369 42753 14210 2848 -7648 -8146 -1874 -16313 -3230 -8438 -26330
5827 -26330 -28774 -33330 -31187 -18032 -3982 356 3856 -6194 -17396 -36419 -35647 -21049 -21859 -39482
5813 -39482 -41284 -8675 2784 -413 24385 16236 -2600 20701 22318 36056 31171 9098 3003
5800 3003 5608 20052 15737 672 22141 33716 34975 21970 11796 3439 -3202 -8848 5133
5787 5133 21883 9296 30166 30331 11692 4217 -23753 -29743 -33180 5603 28084 32261 -1054
5774 -1054 5257 23785 25262 39965 23649 24159 9950 -10959 -25374 2986 18781 -11923 -8836
5761 -8836 -7722 -54494 -45336 -15942 -7610 -7435 3075 3635 27731 29415 -4618 -25575 -11807 -12911
5747 -12911 -19978 -16463 -21489 11036 21758 8535 11689 22004 20372 16614 15982 23116 11008 43850
5733 43850 59990 44659 26073 8624 -2946 -24050 -35764 -42548 -15465 -9012 10752 23590
5721 23590 31160 45396 31728 23037 39586 36819 42410 10562 -4108 -13717 -6846 -6202 7091
5708 7091 13882 1897 -9028 -6901 -3953 -30685 -28363 -8380 1340 -32590 -45010 -36065 -26466
5695 -26466 -10976 -24972 -39171 -28513 -19023 -10594 8686 -8282 3139 -13019 -23125 -11137
5683 -11137 -12452 -9654 12480 31002 26228 25055 22358 36085 38824 27517 -310 -6952 -12327
5670 -12327 -24894 -29641 -13672 -23124 -34518 -46209 -57788 -29858 -16822 -21249 -25656 -24957 -15764
5657 -15764 -17644 -11286 -4418 3725 -7898 -12581 11783 19368 15145 -13583 -10784 -1860 26540 33505
5643 33505 27564 24385 25736 8650 -19872 7699 27957 6643 -1308 -21744 -47684 -20773 -9523
5630 -9523 -13062 7274 28234 25313 14176 13631 5950 9568 31191 29386 21112 6699 -4598 -45096
5616 -45096 -39738 -17444 -25569 -35127 -36344 -27949 -19521 -23842 -12117 888 -14911 -34371 -27055
5603 -27055 -32721 -24226 -13729 -23471 -27436 -10189 969 -35134 -42608 -29602 -7769 -5153 11486
5590 11486 -13506 -15773 -15995 -15492 -4608 14345 6968 -16485 -21439 -11502 -3711 2460 -12436 -30286
5576 -30286 -13994 213 4718 13982 7518 -891 -14437 -24123 -25726 -9035 7534 23395 18024
5563 18024 6443 3952 1111 6567 -15773 -28831 -43974 -69445 -61795 -31621 -22576 -29885 -7137
5550 -7137 2084 -394 3996 7368 14151 -20851 -21594 -5630 11394 6375 -8053 4637 16164 22869
5536 22869 8009 8245 20082 15140 -8465 8539 2799 3791 16150 -1471 -158 4119 11351 54
5522 54 -7208 -19438 -6832 -19967 -29716 -18774 2731 -23210 -43385 -61155 -56478 -36684 -15959
5509 -15959 27209 40269 25184 30286 24516 9517 -10644 8578 17030 10214 350 -20741 -17152
5496 -17152 2243 -2496 -6990 -12769 -13135 -22597 -39204 -22226 -1475 8246 18288 29215 4115
5483 4115 -16758 -24369 -48204 -40756 -41296 -8914 13838 -726 -21194 -12001 -28481 -61675 -34308
5470 -34308 -2929 14959 12545 -12514 -16944 695 3286 -4015 -10947 -19016 -15387 -10273 1689
5457 1689 6354 -6185 -8895 7717 32994 50288 39840 7660 -23610 -10204 994 15271
5445 15271 13001 5480 -2522 21430 34016 22209 22002 40735 59411 60730 31348 6204 11412
5432 11412 6468 -6829 -15422 -5240 19486 26418 10852 19510 30870 21875 14588 24170 25312
5419 25312 17022 26150 37040 10371 -28205 -21677 4230 30146 24915 -1860 -21176 -43656 -41318
5406 -41318 -24248 -25706 -12311 1633 -11846 -30936 -18701 10598 18213 25704 16857 21023 12312
5393 12312 -461 10170 30409 1556 -39463 -44199 -21524 9414 14434 -10997 -38354 -30732
5381 -30732 -4450 -11655 974 -20058 -14089 -2628 8475 -12157 -24582 -30545 -39590 -22546 -4082
5368 -4082 13677 -5584 -12031 5544 8846 -3893 20484 34507 19610 19629 41880 42564 16927
5355 16927 -13234 4228 11187 -13041 14198 27151 -5625 -19429 -27936 -29219 -29579 -11652 18760
5342 18760 42272 21875 -19047 -47148 -26225 -18997 -56671 -49802 -37470 -9728 -21924 -30478
5330 -30478 -19302 -7498 -26976 -36714 -14598 10196 -2782 -12027 -12269 14763 36841 35799 32651
5317 32651 25995 26463 21098 7908 -12997 -31466 -29913 -4021 9878 1830 -16136 -9081 -19835
5304 -19835 8150 27387 23537 38557 29666 1306 1988 32947 35504 38731 42579 31092 9647
5291 9647 -17626 -14900 -17133 -5658 9238 24032 50884 66683 41148 1590 -47181 -48954 -42302
5278 -42302 -19193 -11704 -468 18103 32506 25123 6749 -5105 -17392 -18713 11764 9609 5500
5265 5500 5993 -14610 -48733 -43761 -48294 -34082 -13634 -23773 -59204 -54551 -41191 -27847 -10113
5252 -10113 8959 5946 -568 13833 5160 16457 14762 -8142 -25040 -37490 -17490 18229 -2714
5239 -2714 482 41715 4710 -4893 32069 32057 15746 30767 23949 6538 17624 34943 16225
5226 16225 10892 11331 8732 31699 38640 34586 42494 26756 5817 -11524 -16030 -7462 5818 13089
5212 13089 -7752 -8179 -14372 -23702 15731 24268 -3698 -28090 -26915 -24659 -35822 -56528 -52236
5199 -52236 -36090 -9266 -3249 -10727 3339 17742 27983 28252 42289 42971 22256 21266 8230
5186 8230 -25802 -19286 8613 4598 -6733 12966 47399 23872 7661 3887 719 -1648 -28192
5173 -28192 -24776 -2605 -5054 2981 10313 -21214 -20954 -21057 1494 -2926 -11039 -13709 -19273 -23583
5159 -23583 -54202 -57709 -47538 -31666 5269 24882 38114 179 -31736 990 26003 8658
5147 8658 2404 23442 43771 47542 35487 42261 35912 34212 43248 56368 50942 56648 61029 32006
5133 32006 58098 63229 12402 43400 61489 35630 8761 6248 1653 -20355 -21718 704 -6904
5120 -6904 -18458 -8234 -11357 -46658 -48975 -31065 -50954 -64056 -40299 -22230 -22856 -31652 -18646
5107 -18646 570 27909 37520 13182 -10805 -31298 -41499 -30364 4877 20091 18549 -2754
5095 -2754 -14412 -14832 -10076 -23975 -28094 7849 -1852 -14746 -17307 17774 8446 -12829 -12994 1481
5081 1481 21910 20116 19524 17575 305 -7019 131 8796 19254 15432 -5825 -5911 17156 20656
5067 20656 8723 -22324 -18154 -18733 -31628 -51168 -54252 -39740 -15033 4020 -1715 9472 6021
5054 6021 5667 -6769 -33540 -45493 -43274 -24173 -8997 10115 8453 -15394 -19227 16118 35823
5041 35823 35139 28905 10362 1869 21684 9702 5084 8926 13693 14295 19316 8973 15211 43051
5027 43051 24592 10784 51352 62791 23373 27203 9730 -2666 7542 27330 44214 23430
5015 23430 -14279 -21115 -9200 1362 15700 47150 41860 25379 29937 50781 39510 44236 37486
5002 37486 16327 8820 13254 -5897 -22869 -7302 15434 14016 32084 22459 32473 23248 22329
4989 22329 50167 31837 20955 12812 -4794 -10669 -729 26885 22350 8157 -8588 -29312 -29227
4976 -29227 -38935 -26893 -3914 -15753 17187 15260 1501 11813 -1737 -13185 -30226 -49628
4964 -49628 -35441 -34250 -33588 -22030 -27681 -43734 -50220 -40666 -38200 -31432 -668 37268 15673
4951 15673 -2344 -5531 -11282 5602 3632 -5228 -5067 -5851 -10994 -1995 -13371 -11053 9286 11279
4937 11279 12512 -18880 -16067 28065 11279 23798 14651 -9215 5054 27269 23627 13995 12397
4924 12397 -28342 -44114 -24913 2053 40350 56654 21327 -1848 16007 36654 40604 24975
4912 24975 12923 28877 42125 40619 31789 42988 34780 7414 7306 14128 27929 65108 64048
4899 64048 51962 39668 14148 14248 32212 36996 20562 13954 15616 36634 55984 33220 22790
4886 22790 27881 28800 14872 -7195 -7713 165 20014 6356 11041 33080 6114 18302 25232
4873 25232 4091 -9055 4414 21150 17852 -16217 -28394 2982 35882 33747 17237 9808
4861 9808 13280 22178 26946 15707 -2181 13210 32620 4417 -17606 12834 43712 31050 16933
4848 16933 6129 -6519 7431 8363 9430 17043 34296 51635 53572 22740 1056 4798 -8157
4835 -8157 -20892 2907 18241 17712 22054 28372 27879 23993 31420 43360 45563 37211 38412 32209
4821 32209 32557 54680 60900 50789 27353 8111 3642 6206 11423 12886 -18491 -10621 21765
4808 21765 30401 18952 8808 20236 19534 18552 16659 15425 14883 17478 18115 19621 15333 48788 36073
4793 36073 6346 7678 7049 -16768 -6882 -4973 6387 3654 10658 14126 17204 -9520 -16491 -17592
4779 -17592 -27307 -8642 -4322 139 27878 23423 39616 21833 3867 -6616 1815 21773 17663
4766 17663 9075 9001 2706 24099 34937 27283 636 -20755 -16000 -3294 16236 9127 17241 36031
4752 36031 40041 40638 42674 33883 15045 7762 9944 18209 33212 9368 -11540 -6322 16115 24063
4738 24063 26740 7150 8781 17037 15336 10102 695 -4601 24441 42807 50123 16094 -21428
4725 -21428 -6268 12022 17319 5833 5377 10426 -9922 2296 -5416 -10931 -3653 18764 34468
4712 34468 41565 4884 -23594 -24529 -20835 -10836 -157 8822 18665 10510 24683 40881 56926
4699 56926 37461 22536 15914 23178 20339 13939 32843 8005 -3101 9417 28347 33168 4729
4686 4729 -3534 8275 38934 35993 31667 22537 6670 -17626 -9441 -6165 -7969 29926 38407 -6333
4672 -6333 -14260 -26048 -33322 -16303 -14650 -12654 6900 31902 39058 57636 41606 34344 23966
4659 23966 10853 4549 6613 28382 33208 12361 44433 59681 25458 -11029 -13875 18145 27681
4646 27681 40590 43611 23289 7032 10048 9630 18522 7909 -7516 -30304 -21426 18085 18101 6991
4632 6991 8085 13518 8164 3985 -2479 -7431 -12390 -8408 2713 -15270 -14190 -28684 -17618 -14721
4618 -14721 -12123 -4445 744 23345 48220 3435 -21427 864 2398 11906 4998 6561 -12281
4605 -12281 4724 16625 17301 20399 12627 18828 13676 14844 38450 51509 27534 17158 18936
4592 18936 8910 -15735 -16261 2480 5280 15087 6227 11418 53336 44767 12670 26030 20564
4579 20564 10153 18301 35664 46856 54835 49233 36768 38615 36351 29219 31378 38620 26503
4566 26503 31317 36460 30680 22118 30307 44221 26703 -15181 -14067 13690 43513 58925 18756
4553 18756 1807 -18880 -34997 2320 2587 -30592 -25047 -26969 -26255 -1593 11936 -5604 -9865
4540 -9865 -4747 20821 10039 9755 13132 -3883 511 34630 45675 24110 12484 -8771 -22781
4527 -22781 -21334 -13085 6492 1476 -25569 -25222 -15147 9284 15583 10475 7905 -2881 3733 13855
4513 13855 15815 10671 -6141 -43689 -31513 -15938 -31820 -31854 -32993 -28413 -2568 33956 53856
4500 53856 26571 -12571 -12927 3454 16919 9492 -2515 -27757 -24854 -3195 5955 26407 26860
4487 26860 17436 13497 -5014 -9240 14002 33072 23968 37047 23017 -4907 -4258 -2980 11042
4474 11042 -8147 -7520 19769 42818 39730 22564 38196 21071 3358 14458 33607 29682 -6899
4461 -6899 919 6664 -2809 -21251 -8804 13069 12447 6516 24558 30141 11962 33401 22957
4448 22957 23910 29353 28172 12124 -4628 -17726 -18230 1986 -1030 -5272 -8444 24344 31584 23387
4434 23387 46875 31026 14485 6250 11992 6832 3424 -7633 -1600 352 10728 3421 -7650
4421 -7650 2588 13694 3603 3885 -289 -433 -2343 20740 28476 25594 8552 -11254 -27499 -28661
4407 -28661 -8398 -8921 -43829 -24683 -18232 -2165 -5944 -22149 -21265 -56 10054 2717 11155
4394 11155 38657 40943 45784 12389 -6778 -18479 -26024 -21272 -25654 -36020 -45045 -39046 -17548
4381 -17548 11460 31949 21446 8396 31890 50048 60896 84520 69216 37503 52129 54549
4369 54549 12299 -1228 -5075 -16042 -21103 -17805 -23532 -26738 -15037 20644 38359 40149 39578
4356 39578 38033 28689 22987 -831 -16449 -1101 9927 23786 21126 33008 47944 63801 87437
4343 87437 83157 34398 17573 11187 8359 37547 31288 -3564 -42605 -50529 -22635 -15545 -15913
4330 -15913 -3691 -13826 -1536 -1903 -35100 -40245 -23654 4430 4368 331 8231 5968 15687 411
4316 411 13334 29407 8845 14514 13944 30706 45058 29095 35288 40103 45866 37824 13191 -9839
4302 -9839 -12191 -11084 4355 7770 13572 7185 -8152 16448 47688 69146 61499 67347 43636
4289 43636 -6815 13039 26623 22081 34881 51477 41065 4439 733 2549 -17015 -9793 8649
4276 8649 -4449 -10407 -526 10397 12575 46 -26430 -16916 -24371 -9083 9236 9973 33562
4263 33562 45955 13308 9362 34954 36474 20318 39521 32083 35658 20038 8132 -14723 -2102
4250 -2102 13078 9977 -5436 -14879 -12003 -28136 -25308 -7124 23929 6034 -8749 -31342 -39339
4237 -39339 -26476 -36548 -25098 -13739 9265 36623 67124 41814 -8242 -12757 -4098 2966
4225 2966 6433 -887 -2429 4529 1563 7909 22562 32623 33303 16747 12674 1654 19634 19545
4211 19545 18653 6008 2834 1910 -10188 -20144 -4571 2102 16619 10163 -13442 -25081 -6554
4198 -6554 -417 11651 -7455 -21927 -9331 20839 27992 21976 27725 25992 7040 -3555 -6023
4185 -6023 3003 752 15610 24654 10154 15295 20730 4260 -1133 -9102 -15174 -5049 2839 8509
4171 8509 17696 4129 -1102 -17206 -44476 -47428 -33870 -19636 -13311 -8743 15416 3798 -6326
4158 -6326 -19543 -28625 -38595 -52112 -22385 -17076 -18475 -11933 7053 8342 9237 -8993 -16567 -15906
4144 -15906 -19802 -22123 -37115 -39643 -13902 17451 3008 -7147 2349 12895 35807 42453 17645
4131 17645 16748 -16903 -32503 -34855 1845 18437 18660 29981 48977 36367 31679 31380 46349
4118 46349 29065 -14193 -28381 -71793 -86614 -62098 -62190 -40233 -19755 -6527 31404 40374 18757
4105 18757 20244 52828 63287 64805 46171 34244 20338 -7400 -4624 7154 13512 45915 57778
4092 57778 48038 46446 51961 56100 42934 22701 4719 -4776 -9131 2383 23819 8835 13660
4079 13660 9139 -6617 10492 14888 15121 -285 -6381 15485 39388 18327 12044 19792 2366
4066 2366 -22517 -14298 14183 19617 40985 25194 6796 -4530 14260 29094 26785 930 -21341
4053 -21341 10914 39583 22563 -25219 -50274 -38763 -39716 -41864 -31293 -15419 1344 22493
4041 22493 23134 51316 77758 63655 33528 11957 21106 27515 6708 11475 -1056 -12774 5058
4028 5058 -12881 -16930 1402 20427 18446 20436 28566 15983 20486 7531 18878 16080 -9688
4015 -9688 -2771 4344 7951 20373 11658 -94 -7654 8218 19271 25321 22244 8802 26086
4002 26086 14837 32653 29756 15740 3858 19674 13495 2020 13048 29943 33726 15561
3990 15561 -7721 -12035 22172 23796 24636 31102 19327 41240 50919 46594 33455 33466 8375 8916
3976 8916 23048 16774 -12775 -20355 -38053 18420 48436 20446 -16371 -7823 28912 11577 15089
3963 15089 20133 60239 40227 -14724 -28587 -18207 -8159 -6242 -14687 -15105 23114 23697 -3195
3950 -3195 -19644 -12592 39516 16165 19359 26711 28086 19739 23514 11359 8606 55412 63534 43724
3936 43724 33542 35317 22276 28456 31149 4655 -11138 7915 -4108 12146 48194 61714
3924 61714 30386 14115 19449 8547 15146 5710 25417 48814 50771 63796 68509 42429 -4480
3911 -4480 -21541 1005 25926 37247 29887 16540 -18562 257 18435 33353 25411 21097 623
3898 623 -15998 -580 1996 13255 43675 79187 72210 72542 76511 53186 52368 53429 63421 58426
3884 58426 42138 34961 36757 24685 13922 43794 41479 14290 20252 20458 5431 15663 19704
3871 19704 7759 -6673 28335 35383 14572 12121 33547 11390 13789 16612 30059 24774 21403
3858 21403 31306 25930 799 -10978 -11441 -2439 23994 24141 9652 -7177 -18357 -18841 -15713 -11368
3844 -11368 1502 45134 38955 8357 -19698 -39710 -33599 -2524 8772 -17056 -16534 3625 7852
3831 7852 24921 18551 38717 53969 37165 7496 -7843 28349 72643 67569 43445 26638
3819 26638 -5327 20598 34678 35850 5352 -26390 -42161 -43881 -27529 -741 15004 24884
3807 24884 6468 20843 28323 18928 17135 18326 42908 20667 -5881 -12126 6340 688 -7967
3794 -7967 -4896 -39613 -42574 -37850 -9694 -6213 -13349 -5277 2215 521 -14894 -2562 5200 12355
3780 12355 10119 11234 7477 -11478 -40593 -48599 -24589 18938 33260 46036 55553 53540 51057
3767 51057 69320 79901 42884 23748 44945 52815 47306 51280 37360 19666 51802 71476
3755 71476 71923 26457 17274 6428 27641 24412 26699 23869 17080 30906 46628 50555 42065 28732
3741 28732 21260 11592 8622 1 -4956 -661 23327 29434 35983 54278 34668 10598 9575 14992
3727 14992 30920 36565 8574 2891 -9852 -230 2776 -16057 -44659 -43601 -29978 1669 -9213
3714 -9213 -44838 -45038 -51920 -48864 -12326 17187 12131 25537 17444 15758 28329 6213 -2730 -21673
3700 -21673 -33273 -54507 -38972 -22300 -7897 -22963 -20718 -13179 -6382 -4910 -13474 -11554 10324
3687 10324 6073 -2429 25120 63779 45694 19011 12395 1356 5894 24441 21278 8849 5900
3674 5900 16177 986 -9407 2904 18930 25661 1884 19586 24122 5665 3511 288 23828
3661 23828 27292 23727 32666 16323 17083 17946 26316 -2066 -1193 3 -6767 -12602 2852 -2396 -32759
3646 -32759 -29746 5351 22874 3794 1523 8389 447 27297 37501 35184 45534 22757 20814
3633 20814 -13 -38816 -34201 -149 35574 37432 56353 52815 37525 30085 19973 7667 -18967
3620 -18967 -37672 -49665 -25773 15013 46689 50928 17948 10234 37409 48658 52195 54662 78985
3607 78985 83764 61164 37203 34495 45165 36687 17056 -14492 -35221 -17573 3171 -1368 2094
3594 2094 -7265 -1988 20552 44431 47297 49503 14768 -13116 9429 4931 9610 -4948 -6766
3581 -6766 26686 46311 21804 21043 27466 28049 23398 15347 -3888 10293 37337 52734 29103
3568 29103 32525 23354 3483 7724 26915 30408 21195 34000 31374 31464 30701 33403 31354 29863 39075
3553 39075 46623 46298 59673 44833 7424 11069 24286 17917 31544 24079 14416 20550 10459
3540 10459 -20481 -9412 1087 -822 8205 16668 22698 33368 53737 23464 18006 16629 805
3527 805 -144 16256 20183 13752 -9203 16940 3123 -15338 -26673 -25033 -13535 23333 26544
3514 26544 6377 202 -16415 -22054 -2644 32615 29624 3874 -9830 5250 39903 35077 24474
3501 24474 4323 16093 36566 38967 33889 21187 32409 20976 15859 17280 12896 27243 46905
3488 46905 75679 81049 64761 46564 36809 17538 12134 16163 36073 61863 54522 37060 23234
3475 23234 18563 36366 22481 36941 48081 21589 -12374 -9370 -4969 -11974 -14829 -15906 -44819
3462 -44819 -77350 -68222 -42936 -444 2896 28296 35556 26231 24537 14209 -1824 12401 12686
3449 12686 2166 27145 58373 46933 30338 26569 4822 -2653 10100 -7325 2452 -19360
3437 -19360 -10646 20280 30492 24284 36514 39001 27254 21163 46843 58446 39136 37013 47322
3424 47322 25110 16189 12873 -6605 10349 47206 49759 52999 32003 4489 -21713 -23857 -24390
3411 -24390 -12195 14840 16017 7999 13922 15272 22896 18182 10220 5312 2022 1641 26601 25518
3397 25518 11844 34649 48052 -12504 -29778 -23810 -14245 -11408 -7658 -11569 -14127 -9375 2988
3384 2988 18771 19361 -3002 -19257 -15703 -17655 -10690 -7305 9070 26856 24540 3518 -17253
3371 -17253 -8950 17273 17725 -968 -17781 -4108 12869 26238 14968 -5448 858 29526 31846
3358 31846 1590 -16882 -21431 18634 9932 -25740 -47609 -23654 -5766 1047 31284 29872 13471
3345 13471 -386 2773 21276 36525 45847 30835 34153 3086 -16210 -24482 -40900 -12881 2340
3332 2340 2433 21566 23687 -970 24464 34433 45598 38441 27513 20751 1520 -15608 -15751 -2638
3318 -2638 3395 -29305 -37525 -21589 -28636 -34021 -29093 -20903 -4858 -5023 -11028 -22008 -17965 -7180
3304 -7180 -5943 -17924 -23622 -3157 -636 7258 10721 9887 14328 10916 -6651 -3456 -5004 -11940
3290 -11940 19443 -4508 -27215 -28924 -24352 -14184 -11539 -42744 -17343 10835 27983 14608
3278 14608 17422 20644 10659 728 20085 16607 -4377 -19028 -21824 -11495 -29547 -33098 -10298
3265 -10298 15482 49750 27407 3169 -7100 19253 54919 62554 44120 34327 12166 13482
3253 13482 29261 51117 49192 61009 51967 45302 52439 50846 39956 51501 45089 30380 57787
3240 57787 55414 30467 11462 3418 86 -2207 15601 12670 -13830 -32317 -6451 -8283 -35335
3227 -35335 -47317 -43996 -36740 -19026 11846 29343 26591 11495 6111 5178 15370 3286 -9130
3214 -9130 -8760 19294 16452 -7692 17381 36243 27090 7275 470 -5627 9797 28257 31026
3201 31026 37314 42940 22732 21124 11296 -10296 -20967 -451 22254 -11692 -23610 5648 9635
3188 9635 -22087 -10036 7256 6115 17473 26337 38748 22966 9282 -20457 -11942 1078 3897
3175 3897 11871 10700 -11767 -35576 -32169 -28933 -13794 -17754 -30281 -32448 -12864 16550 11142
3162 11142 21619 1618 -4116 9360 23374 32771 40733 57058 35174 35291 58536 71055 61156
3149 61156 57655 41333 18815 18898 17459 24455 19967 23966 10823 2142 3949 15183 9023 26820
3135 26820 51566 48178 45390 39025 45335 59900 62099 73127 60987 83932 68071 38593 13643
3122 13643 27023 17876 35929 61154 61036 45389 37327 23884 10996 10870 -2847 -43362 -36041
3109 -36041 -3767 15610 48242 51284 59686 73795 50252 21638 24696 37317 16935 32327
3097 32327 41948 31195 10802 -18362 -25224 5368 24922 8454 14548 31421 28409 8389 4072
3084 4072 1560 21673 25892 32373 11070 -10077 -13707 -25623 -21437 -4216 -6628 -19722 -7656
3071 -7656 3947 4360 33713 28524 16757 37758 36299 14421 19067 37081 65947 55939 28937
3058 28937 21284 28770 118 -19731 -11459 4673 2752 19389 23799 6449 26643 50443 51690
3045 51690 27968 12460 -21604 -9548 29384 24671 37456 50667 27092 19306 1107 8913
3033 8913 35184 52051 34724 17293 5732 -3419 10489 9050 24288 40094 20592 -16907
3021 -16907 -17743 63 24176 30085 3551 6451 28536 14417 -590 1753 7207 28904 60719
3008 60719 25768 -3260 -21936 -28507 -48684 -34732 8077 307 13821 31554 50980 55344
2996 55344 39197 17986 23554 30144 26498 47877 35220 -3861 -20326 -293 1058 5444 33809
2983 33809 37053 16145 -5582 -9486 6734 -1619 -24530 -25878 -39937 -19444 11695 22093 -2370
2970 -2370 13156 1167 -26708 -39415 -27826 -911 -1761 -9414 -23119 -25976 -20395 -15554 -5518
2957 -5518 9486 3296 13225 33789 30397 11150 1398 -3708 13143 36693 28907 37402 49743
2944 49743 29362 27843 26302 38501 46093 41908 29713 30128 1254 16857 8957 -20571 -32312
2931 -32312 -36035 -56598 -31830 -6083 3377 -23681 -29417 494 15962 7796 4107 -13147 -18660
2918 -18660 -9446 -1020 24095 51703 34515 25630 -2474 3153 28257 22778 16491 20626 34735
2905 34735 56325 57418 32778 24785 40958 33826 21111 16507 27802 3146 -12464 -30724 -9325
2892 -9325 -956 -1472 15907 3400 -35808 -24416 -7339 3088 10252 16724 7924 17348 34045
2879 34045 59302 65114 40318 50184 49103 51037 32836 16400 18430 11977 30860 46593 37008
2866 37008 12826 17857 32600 12357 -36 4189 9525 21121 21338 26202 25652 9115 27516
2853 27516 16363 28980 19780 19177 959 -544 8868 -1025 -12311 -599 19048 10529 -12110
2840 -12110 -956 17909 48082 51431 54127 40260 35611 35250 9678 21777 24422 23717 24703 10648
2826 10648 12326 12200 34887 24435 2867 -7246 -14340 -18499 -39046 -51911 -39513 -33975 -45690
2813 -45690 -57045 -59341 -40600 -32388 -25981 -1902 5848 -22423 -13471 43134 9834 -109 15163
2800 15163 22980 38023 41481 29522 16004 -162 7163 21666 28074 6934 -12281 15023 51589
2787 51589 51332 10012 -605 19673 19934 2106 2377 10578 16668 -3113 -10743 12182 15033 12572
2773 12572 17139 22388 24754 22212 7551 -10962 10887 34041 34057 13011 13064 -1483 -10455 -21996
2759 -21996 -20536 -31084 -23149 -23018 -19388 12253 17439 6349 9252 6133 -11166 -21742 -40
2746 -40 6062 3657 -12477 -615 12319 19325 -4256 -4424 -6836 13585 8973 5430 18171 15421
2732 15421 -3170 -9927 -4796 26623 53232 57327 39753 48576 38165 15314 -8608 -13479 3101
2719 3101 6420 3740 -1931 26405 19090 1638 6005 5067 7300 -4809 -396 33869 56628 34240
2705 34240 -15509 -16330 24459 22184 4478 842 3445 -13657 18265 54502 48005 52264 53084 42968
2691 42968 24825 14195 12686 3658 21533 27297 20874 19973 15738 410 -3961 -12924 -20544 -12469
2677 -12469 20215 54249 67197 71339 79459 61662 56387 33291 29474 30408 35351 70372 78657
2664 78657 61802 51970 37171 52830 56547 52259 47003 50514 48590 19629 6859 23432 16620
2651 16620 9819 46654 46710 35622 22377 -37283 -37091 -815 9325 8554 38384 33500 42354 66492
2637 66492 67757 63193 65279 51384 45978 42240 20242 11364 15310 30847 22483 25818 12598 -4842
2623 -4842 -10906 -6429 -14539 -22695 602 31432 39146 1166 -7041 6135 -18644 -25953 -15857
2610 -15857 14309 31465 17506 20340 18890 12587 21150 34104 37280 15585 8223 -2094 -1196
2597 -1196 -1891 7002 33359 12367 10217 14982 -6061 -4454 12788 26679 7737 8850 11868 -4718
2583 -4718 11523 -1245 -26702 -14663 -16350 -11482 16344 27844 15274 15292 28631 33987 27492
2570 27492 23805 26310 25737 8246 -5491 -11811 -14142 16813 11000 -28958 -41002 -28192 -17776
2557 -17776 -10009 -7428 6013 35405 20616 32505 30965 22030 10223 38002 47952 62146 79198
2544 79198 75400 62544 30748 -11052 -7576 23101 41264 34986 40728 24534 7019 20844 26217
2531 26217 30623 58704 40840 33694 30939 2872 5852 3720 -10394 -10736 -20354 -7482 -16355 -12290
2517 -12290 -4882 -12662 -20560 -54762 -33112 -5541 -23909 -52879 -31924 -25200 -18408 -17551 -15216
2504 -15216 9770 14926 -15849 -41320 -19229 -16648 -13568 25095 24635 9281 -8035 -21495 -29421
2491 -29421 -39703 1245 15409 -1759 19607 50192 42179 22432 -9047 -17454 -22981 -44759
2479 -44759 -20162 -4118 -12799 -18249 -30252 -26932 -26001 -18586 -15380 -17992 -12207 -13980 7979 4103
2465 4103 21084 20359 29668 14373 16977 12423 14707 2636 6686 15305 28034 26374 14485 17807
2451 17807 29588 17458 18018 33147 26825 18620 5720 629 23286 24366 29236 37822 57892
2438 57892 33525 16961 43328 43977 62550 42638 25403 9967 13124 -20786 -26700 -14326 3604
2425 3604 14778 18862 14328 21866 46791 25688 18662 17771 -10286 -10513 -8338 10899 41536 51783
2411 51783 46608 39707 15352 -154 -399 -13776 -31396 -31724 -25657 -3669 5810 11279 25603 31641
2397 31641 22541 17701 7768 -2361 -21278 -9199 26567 14001 -106 963 -5999 -605 -6931
2384 -6931 22258 21856 9168 403 21062 40833 -6267 -22138 -9161 -13559 18136 19898 -1497
2371 -1497 2984 -24885 -44910 -46472 -51731 -25601 -10582 4571 26315 10877 -30063 -52124 -31851
2358 -31851 -8853 -11758 -15552 -27290 -7063 21204 27440 28344 22585 36406 42262 67718 73801
2345 73801 55002 52816 55462 36620 18721 9452 33152 48713 33204 33075 39432 20443 941
2332 941 -6265 -25409 -35129 -5786 25091 25424 8093 2980 3084 254 1983 -162 17274 9870
2318 9870 12751 12046 -17084 -21609 -17713 -9493 22470 27291 9634 7361 30854 29637 41829 33050
2304 33050 34323 17758 6208 21494 38862 48622 27956 13740 13070 17729 6140 -3620 4956
2291 4956 703 -9618 -3300 10732 15505 29647 17720 1744 -4481 -12250 10287 21989 16842
2278 16842 25686 55277 53625 27336 21774 20944 -9441 -6140 -4307 -11148 -16770 -12965 6461 -5595
2264 -5595 -4599 5498 8180 23339 35461 9168 -13535 -3474 2069 14483 15776 30812 15133
2251 15133 3194 -25353 -41222 -29572 9592 17599 15882 21768 22347 43975 53220 39791 13064
2238 13064 -10725 -3428 -2868 -23865 -6166 21446 11450 7686 851 -27804 -38068 -24897 -34773
2225 -34773 -18932 3773 26154 38172 22718 530 19260 23443 1239 -23291 4056 7645
2213 7645 8165 11776 -7273 -14183 -2829 -6596 -37522 -55735 -62792 -48141 -29334 -2775 17217
2200 17217 28032 22273 23294 33257 16579 -21529 -57191 -48816 -9110 11733 26119 22278 21823
2187 21823 15725 14391 32079 32190 21031 3873 -1971 -1033 -4360 13050 40063 43061 44383 45124
2173 45124 59930 38209 11691 8262 122 5806 16923 31496 15126 10964 30493 40908 16033
2160 16033 2142 23237 20526 10301 58216 61627 26923 -2069 -16664 1966 8421 26727
2148 26727 27752 15113 14269 12769 -5477 -2551 39466 53489 51248 43693 48496 36386 28596 17717
2134 17717 11118 6611 -8651 -4057 -17113 -29553 -16554 2854 30089 35263 14116 -13218 -4632
2121 -4632 -26717 -34818 206 -5208 -23466 14746 34845 29227 2509 -6791 -708 10160 16559
2108 16559 -1130 -19224 -11041 -30665 -14193 8473 19728 3497 24743 28393 7091 21288
2096 21288 23484 -2545 -16519 -10057 16692 43158 34699 4181 -24369 -9260 16139 13322 -2031
2083 -2031 5636 5212 13909 8631 -12995 -17021 10806 2537 1748 -37322 -43426 -17058 -16031 -46384
2069 -46384 -53563 -40692 -51272 -61219 -43666 -26202 -13252 20657 35273 16395 26243 39980
2057 39980 38434 37864 35374 22112 -3202 -13012 -558 -13805 -14703 -29397 -24520 -3400 15103
2044 15103 20629 2946 -7462 -19080 -19656 13452 31021 12641 -863 -35846 -45805 -44242 -28689
2031 -28689 -32502 -38341 -44941 -29762 -7297 -27656 -28183 -32208 -21187 -31847 -21285 -17227 -3271
2018 -3271 -6682 2535 11722 -4916 2457 3861 9986 1172 15585 -102 3549 -14324 -17277 -24347
2004 -24347 -3286 769 6613 4651 2513 -6923 5624 19446 23344 34266 10399 -7727 -19425
1991 -19425 -10352 9196 22383 2629 -10085 1422 -20999 -29189 -13473 -13109 -9513 2261 -28078
1978 -28078 -39111 -38710 -10784 -10112 -6994 -52442 -41596 -22642 -34598 -37512 -28856 -18937 15703
1965 15703 20866 20374 5050 -3761 7282 12034 532 -17566 -13864 14710 35829 39758 -3600
1952 -3600 -20669 -24301 -36755 -41464 -23088 9119 -3303 -16465 -24605 -46835 -49502 -43640 -27665
1939 -27665 -16488 -17171 -10009 -17200 -2881 -7873 -24707 -23180 -10221 -18815 -12167 -973 30668
1926 30668 25626 2201 -3709 9992 3261 10474 -6720 -34123 -38528 -37886 -22990 -31259 2582
1913 2582 19745 16850 5577 -11140 -12707 -19534 -11748 20007 34726 49576 74172 74692 50965
1900 50965 10074 -724 29509 32992 16706 -5945 -23050 -9462 12626 3940 14006 36726
1888 36726 19032 6821 1719 481 -4240 1356 -5016 -23871 -31936 -9966 273 16007 719
1875 719 -18527 3607 21848 28091 49230 33847 11649 2481 13073 -12776 -27892 7006 14205
1862 14205 8383 6095 28897 13560 1435 12359 -19770 -20110 -3321 6095 14126 8206 -11069
1849 -11069 -22971 -7687 -22398 -21089 -9863 -7918 -16105 -14268 20116 20218 27520 11726 8745
1836 8745 6491 12743 27979 13485 -19130 -18445 -24092 -9313 11143 35855 52124 12769 12856 34482
1822 34482 16094 2322 14333 8804 -19527 -49845 -44608 -12851 8397 -3154 -27839 -24236
1810 -24236 11868 20684 24198 31800 17729 -1181 -25657 -13641 -6299 9085 -10675 -30203 -28396
1797 -28396 -46981 -65754 -41244 -7062 12760 10283 16855 32961 35627 12456 28157 42693
1785 42693 41022 29278 20699 -5028 -17339 -2062 14608 45409 54503 42272 23260 -4534
1773 -4534 669 -7488 -19269 -15004 -9452 -27044 -21417 7161 34655 47521 43044 34989 27578 57801
1759 57801 62671 56887 42951 41935 26223 41590 50749 37859 46413 50727 34561 9021 -3367
1746 -3367 -12453 -16119 -16058 -8190 -17265 -32403 -38417 -16749 -9881 2990 5228 42301 35245 32331
1732 32331 36891 42806 53293 57870 46734 5865 -8074 -738 22448 28223 9234 31033 42615
1719 42615 37229 9165 -34166 -48617 -24906 423 3744 23643 13826 -17050 -28942 -27143 -7014
1706 -7014 -13238 -22062 -17424 -28526 -39925 -38885 -39482 -47417 -60226 -58072 -32619 -39423 -25540 -33271
1692 -33271 -42072 -34726 -6174 -6124 -2541 -12403 -20648 -25622 -15870 -1025 -13362 -25423 -8876 726
1678 726 3847 -940 -22816 -31558 -13867 -9556 -7691 635 5499 -22888 -33798 -21086 -4360 -27588
1664 -27588 -47035 -57108 -34686 4046 34216 15461 -2133 -646 -11415 -36120 -26995 -10137
1652 -10137 -19092 -15792 9901 16497 16526 1160 -543 4506 -9174 8807 37238 25897 1031
1639 1031 25271 18458 -6230 -23868 -20706 -23240 -9240 23556 14832 20475 16842 25654 34278 17150
1625 17150 19897 15194 34905 53411 62566 48641 21468 3787 -9373 9680 -4959 -24803
1613 -24803 -12935 -5409 -14615 -14930 -4869 5970 7589 5407 11417 11611 6407 -8778 -18477 -12627
1599 -12627 7853 13375 731 13542 29071 -9624 -42524 -25182 -521 -8129 -15152 1145
1587 1145 8334 -2001 2346 6512 -9217 -36150 -19113 -17970 -5681 11550 10866 -9996 -36760
1574 -36760 -29287 -12142 -16960 -15297 3901 -14354 -28786 247 -10687 -10810 -14285 -21887 973
1561 973 7225 2592 -2917 6110 23318 52854 -1773 -18372 13503 28533 5081 19704 20791
1548 20791 23198 32430 35992 38664 26651 14824 23611 23566 -3573 1121 -3271 -20944 -13394 -43548
1534 -43548 -44368 -25637 -7755 -28793 -41979 -35526 -13746 -16354 -30922 -34676 -35761 -21828 -16107
1521 -16107 -16334 19229 44000 41791 23798 -4537 -4690 3428 12950 10987 -2574 -2048 2451 -10308
1507 -10308 -782 21363 6884 18025 8524 9467 3325 11514 17847 6831 14356 -15364 -28127
1494 -28127 -25819 -32856 -29827 -25120 -13778 -6249 4291 6076 5187 -6362 -22054 -45175 -46970 -28300
1480 -28300 -9866 9759 8300 10967 24608 11907 -507 -5807 -2503 -16768 -11012 11782 17631
1467 17631 6910 20343 13133 -5985 -8324 -16219 -14332 -8929 14858 10938 8160 20863 26477
1454 26477 42526 59196 46013 5985 -18052 15843 23759 10690 25139 30243 -20657 -55322
1442 -55322 -64857 -27329 -5436 -9120 -16393 3163 2428 14269 28914 11608 -6 -30870 -47977
1429 -47977 -41905 -21763 -6980 -4546 -23358 -35080 -12847 -14890 -16393 -20063 -17981 -22329 -17096
1416 -17096 -16826 13662 37450 22757 -20702 -33193 -19614 -33780 -10625 4151 -6922 -41139
1404 -41139 -30371 -5741 17560 34536 13732 -8058 -21956 1959 25307 5616 4111 14543
1392 14543 10920 -1497 -8290 -7970 -556 16073 -4792 -12756 10030 9345 24513 5440 -2468 -18264
1378 -18264 -10167 -14129 13999 32373 7532 -23170 -62837 -39624 16738 38459 45661 15833
1366 15833 -12756 3201 -14958 -18003 -23093 -35205 -33043 -26168 -41318 -70339 -45100 -31742 -44386
1353 -44386 -74629 -59257 -21125 -44261 -74324 -57000 -47140 -39274 -28970 -394 15650 4427
1341 4427 -2094 -1200 -14516 -6742 11308 4731 -13304 -22957 -41448 -22117 -23965 -28061 -21093 -40837
1327 -40837 -9761 -16226 -12127 -15635 -5489 15254 53804 33317 -5826 -13739 -14342 -10029 -19121
1314 -19121 -41083 -52015 -47272 -16687 1059 16623 638 -12836 -11749 5047 7067 16569 10593
1301 10593 -8395 -21730 -33740 -40129 -58572 -43872 -43127 -38803 -646 30640 18697 19619 3279
1288 3279 -5464 2077 -5465 -32976 -55207 -36475 2268 14114 4488 2788 -22347 -20210 2470
1275 2470 -3754 -24074 -3117 16456 30143 38313 49514 51744 40068 -538 4650 -3012 11587
1262 11587 12999 -762 -8307 -21697 -25477 -32678 -39680 -34569 -9553 -1411 -4986 -1762 17397 5627
1248 5627 -29608 -25466 -30828 -35699 -50616 -64224 -49850 -28010 -19926 -15155 -14073 -34592 -30292
1235 -30292 -15541 -36490 -39294 -47319 -57209 -52439 -50381 -25301 -21369 -36130 -50127 -54508 -40372
1222 -40372 -50493 -44034 -27413 -25276 -14065 -18549 -39336 -34809 -26081 -39599 -28890 -42814 -65653
1209 -65653 -33799 -21996 -18749 -11952 7515 17128 16323 10877 28538 39738 20083 -2691 -52024
1196 -52024 -57224 -29267 -27705 -38310 -42277 -8643 14092 -20200 -39374 -53807 -22436 18047
1184 18047 8688 -18326 -24880 -17744 -14775 -25651 3571 -15149 -33709 -24899 -18626 -13650 -12696 -45734
1170 -45734 -55255 -30056 542 16419 -497 -18190 -13567 -6856 3171 21242 -596 -38744
1158 -38744 -58082 -55908 -29750 8989 12868 -22664 -24651 -10155 -22777 -30150 -31637 -30584 -21096
1145 -21096 -30959 -17257 -19979 -16607 -3522 18710 37452 29358 15548 12878 4228 -7931 14158
1132 14158 29769 18130 2954 21431 28893 1141 -18553 -10837 -20492 -27204 -4473 -11163 3166
1119 3166 -1584 17942 -3620 -26888 -17074 -22275 -19431 -11798 -25185 -29018 -41025 -30972 -15668
1106 -15668 -8825 -33255 -35364 -11244 7039 12747 -26969 -22242 343 9778 -27689 -17660 -29459
1093 -29459 -36558 -17998 -24956 -20907 -21881 -24114 -2921 9863 24256 24449 4093 -24919 -52921
1080 -52921 -50545 -86278 -92947 -78378 -74539 -69965 -81734 -62859 -35930 -19991 -39091 -32684 -24925
1067 -24925 -42003 -28069 -19075 -48450 -36346 -12915 -14099 -10103 27581 4765 -6312 7516
1055 7516 11902 7480 8994 -194 -19306 -21145 -19670 20433 22008 8826 -4672 -21702 -7866
1042 -7866 22229 28445 18547 6174 4943 21980 17239 13177 1415 1044 14189 -11623 -12057 -6373
1028 -6373 -18927 -14611 1859 1536 8144 -179 -10947 -11839 -24945 -12022 -9029 -10928 3775 4289
1014 4289 -22094 -41913 -45845 -66088 -69423 -56584 -39870 -37960 -36181 -6998 -5339 -33758 -26863
1001 -26863 -39123 -49447 -16439 7137 13561 -14521 -1257 19579 9869 -2794 11075 6347
989 6347 -2652 -10251 -4500 5466 -18979 -46240 -36421 -43044 -24408 -14079 -28612 -41869 -42989 -27510
975 -27510 -9511 -1576 20338 3547 -39466 -66837 -43251 -30583 -45511 -33540 -19106 -33635
963 -33635 -40666 -19054 7335 23471 29568 22729 32801 32360 -7539 -48248 -80941 -87533 -78481
950 -78481 -91113 -89387 -53347 -28930 -38617 -38348 -39738 -15120 -8309 13960 17648 22249 30193 16248
936 16248 20655 27304 23715 22665 28252 26696 24375 21485 9482 1799 12802 -2753 -18326 -6798
922 -6798 14528 17579 14164 32450 43569 47206 18488 25997 18185 -11440 -21177 -11092 -15575 -28394
908 -28394 -10016 -20049 -1633 -5370 -8291 -28212 -59585 -58492 -42368 -14567 8438 12788 -6299
895 -6299 -18509 -16977 -30624 -29055 -30400 -28512 -20105 -44054 -45368 -41116 -49819 -53506 -30667 -22726
881 -22726 -18982 -33281 -35474 -21537 23313 24773 10049 -3043 -15965 -23564 -4182 -5589 12661
868 12661 24734 12865 -14743 -27475 -26950 -23912 2584 4842 -14683 -30760 -41131 -45083 -48096
855 -48096 -57539 -44709 -20619 6474 -3 -417 -16325 -6186 -16855 -31623 -61164 -43428 -41151
842 -41151 -30844 -43789 -68363 -51453 -52946 -53143 -40633 -38139 -42852 -55411 -58092 -55471 -34619
829 -34619 -26468 -38155 -34089 -36110 -65959 -81083 -50461 -11454 -18651 -33848 -65964 -83923 -63354
816 -63354 -63355 -42231 -10970 10299 -9170 -29679 1630 29794 26747 15676 21977 8566 -1751
803 -1751 30051 38562 29444 40396 12124 -6807 -5249 -13578 -25087 -36057 -56739 -77455 -78411
790 -78411 -60474 -36054 -28678 -26220 -50880 -57770 -51080 -56441 -47752 -51071 -45912 -52067 -52594 -52399 -27731
775 -27731 -24199 -26960 -32742 -24888 -46768 -33525 -14385 -38436 -39335 -21811 14916 21393 -853
762 -853 -26229 -20106 1797 6917 -9151 -30524 -57665 -52435 -42589 -22354 -48098 -31500 -30211
749 -30211 -53823 -38911 -26765 -35723 -36078 -39838 -42850 -37093 -26109 -16156 -18562 -6364 -14114 17419
735 17419 10062 2577 -6189 7272 18665 -2568 -16260 -9988 -6453 3561 16875 23699 7492
722 7492 6380 -13759 -9819 -23576 -28767 -36277 -66378 -60680 -47744 -27530 -14511 -15692 -26221
709 -26221 -51673 -47485 -45817 -19134 8591 12184 7241 -4692 -37414 -38336 -43090 -32769 -24164 -21227
695 -21227 -10872 11357 -12076 -50780 -57916 -52807 -24246 -27814 -46806 -38158 -23369 -15632 -21790
682 -21790 -7450 -13399 -6989 -10428 -65679 -90673 -63030 -53143 -28499 -29980 -48519 -55896 -49032
669 -49032 -43257 -31478 -29923 -32428 -23195 -1765 -740 -7773 -36467 -46476 -52708 -37311 -42911 -41703
655 -41703 -27621 -27132 -41539 -44849 -40864 -53836 -34593 -49928 -55676 -50295 -34130 -33699 -48656 -67460
641 -67460 -57049 -54690 -66058 -48418 -62452 -56274 -14918 -7574 -12462 -21311 -27590 5132 18855
628 18855 35868 30238 45649 17320 7852 7321 -6733 -18555 -13325 1494 -19184 -27277 -25290
615 -25290 -23765 -12989 -45757 -72001 -71113 -44970 -3677 6449 10313 16681 14091 269 -4537
602 -4537 -40754 -44365 -38200 -58338 -64988 -63749 -47642 -37606 -18630 -21790 -37670 -65733 -83464
589 -83464 -71015 -74528 -46001 -33961 -41166 -64649 -69481 -96467 -59446 -47970 -37047 -41100 -48363
576 -48363 -61671 -60637 -54298 -45137 -51033 -45695 -41043 -43581 -19078 -33283 -53228 -46978 4675 31050
562 31050 1529 -1490 -4914 -347 2612 -17740 -30952 -23173 -5698 3102 -1339 -16223 -28629
549 -28629 -40181 -4929 32129 33298 38494 -19029 -52859 -43122 -53969 -43174 -2807 -21615 5411
536 5411 46105 39324 9676 7453 -3946 -23695 -18910 -13458 -2212 -26587 -32057 -22105 -6298
523 -6298 -16746 -36584 -6973 -4328 -20360 -48071 -47815 -32584 -9016 6940 3633 -3531 -35801
510 -35801 -72596 -63002 -49750 -48367 -41077 -14830 -11271 -30825 -18598 8651 31109 -7541 -14081
497 -14081 -17442 -35388 -63708 -73547 -55778 -50801 -63036 -57304 -21001 -27399 -54961 -51118 -27378
484 -27378 -15081 -2595 18213 26119 23664 18761 -8091 7782 20735 -24425 -64131 -102618 -87457
471 -87457 -49439 -60281 -58585 -51848 -56127 -64032 -66982 -56435 -23551 -30064 -54676 -47654 -38422 -33446
457 -33446 -49214 -57946 -38051 -42270 -39507 -4190 25743 11876 -19691 -35088 -18716 5189 -29933
444 -29933 -29290 -24105 -28140 -8032 3875 -1362 7189 3268 -16378 -32088 -7009 -23552 -22399 -31117
430 -31117 -32467 -25783 -33043 -58582 -77091 -45589 -31825 -41055 -53169 -94950 -74795 -70477 -72558
417 -72558 -88827 -80410 -65120 -81011 -81095 -72435 -71737 -73326 -69988 -42020 -27939 -49606 -67785 -72521
403 -72521 -80313 -54522 -24014 -46371 -57304 -70383 -64204 -42689 -43554 -55201 -55086 -66455 -41615
390 -41615 -19348 -12083 -15104 -21803 -43039 -20748 -12112 -1660 -5266 -19650 -18095 -21786 -33615
377 -33615 -32612 -38406 -22456 -4436 -6029 22091 18501 19172 6525 1008 14071 18297 5773 -23590
363 -23590 -33960 -33297 -59903 -54249 -39292 -11591 -9286 -32284 -33020 -31167 -38423 -37173 -47520 -56582
349 -56582 -58800 -45473 -27707 -12893 10719 28071 10855 -23883 -36397 -30240 -17330 -20770 -61716
336 -61716 -87137 -95284 -86452 -77089 -54699 -23972 -29155 -16378 -3958 -9818 1997 -4980 -20107
323 -20107 -35136 -39737 -32622 -26500 -15398 -21717 -44460 -57091 -60098 -45430 -31803 -36611 -32354
310 -32354 -25942 -22067 -31626 -28597 -32705 -37700 -50963 -75577 -59269 -37251 -42975 -49437 -67488 -75925
296 -75925 -63736 -54397 -59868 -85951 -92960 -76166 -45601 -32296 -24143 -16320 3906 -11572 -22764
283 -22764 -26083 -23383 -17098 3350 -4813 -22209 -47204 -43229 -37987 -41696 -59534 -53214 -31802 -29043
269 -29043 -39042 -45371 -28386 -25372 -39317 -43000 -34894 -31912 -55644 -71617 -57429 -41938 -51788
256 -51788 -51371 -50835 -59303 -49457 -64650 -80100 -77504 -55358 -45427 -47764 -52009 -44811 -25605 -37498
242 -37498 -42999 -34321 -45529 -46849 -32205 -34133 -47478 -48965 -32672 -43220 -45764 -35616 -27359
229 -27359 -28748 -36159 -34294 -18683 -15380 -10700 -13075 -38825 -34732 -33675 -34479 -21675 -34291 -35141
215 -35141 -30772 -17212 -12424 -12079 -9989 -10847 -14821 -41157 -49341 -51271 -45973 -41757 -44569 -52765 -63544
200 -63544 -70356 -59103 -23767 -26493 -22875 -16713 -43929 -50441 -40616 -52450 -65286 -51301 -31031
187 -31031 -8341 245 -26407 -29218 -29559 -39966 -56302 -66996 -50194 -22106 -9811 -21892 -46859
174 -46859 -45479 -38992 -62440 -57329 -55287 -61361 -51363 -48173 -46381 -54801 -58205 -34559 -40483 -41909
160 -41909 -36673 -26505 -37389 -43459 -29585 -21227 -35913 -52071 -53628 -46817 -46603 -43776 -41853 -33878
146 -33878 -39308 -55545 -80623 -75674 -72240 -65779 -44201 -51449 -50686 -36268 -37106 -50954 -62429 -62018
132 -62018 -48849 -48843 -39618 -43577 -54880 -40311 -11657 -324 -10879 -7243 -13386 -21470 -13191 762
118 762 -4071 -20805 -33471 -40842 -48807 -39595 -49493 -59310 -45452 -20229 -25467 -12806 4552 -7316
104 -7316 -39679 -52567 -36148 -32247 -25506 -13176 -13895 -17254 -11485 -23045 -31570 -31594 -29413 -44254
90 -44254 -51715 -31661 -12125 -1678 -4276 -14820 -15985 -30530 -46592 -43293 -13202 -6275 -21952
77 -21952 -25266 -26603 -37042 -45691 -49538 -35424 -40954 -49081 -42693 -57632 -67074 -46078 -38467 -43314
63 -43314 -66284 -59783 -34405 -41626 -61482 -71349 -63432 -62196 -66480 -62872 -54205 -67473 -97740 -101996
49 -101996 -64897 -66139 -69266 -63993 -57344 -43414 -40516 -56964 -67688 -67155 -67103 -73484 -75368 -68966 -68331
34 -68331 -49178 -40511 -33956 -41195 -47192 -47302 -36411 -46763 -50165 -64289 -56747 -38837 -53880 -45881
20 -45881 -25887 -36858 -37528 -28135 -15487 -9229 -7551 -26092 -31648 -51574 -39175 -25280 -44576
7 -44576 -66588 -51785 -29909 -23735 -23427 -29384 -45870
0 -45870
$$ Imaginary data points
##PAGE= N=2
##DATA TABLE= (X++(I..I)), XYDATA
32767 117206 111863 131260 139541 152665 147208 148612 143799 150915 171198 162286 144810 143602 138719
32754 138719 141492 172795 180222 175827 173460 166497 145430 153999 154695 145951 165862 180369 168414
$$ [...]
##END NTUPLES=NMR SPECTRUM
##END=
