##TITLE=Analysis number 313034
Compound Code cc 38514
Book Reference 449/14
Project Code adrs
Chemist Name davee
##JCAMPDX= 6.0         $$ Bruker NMR JCAMP-DX V2.0
##DATA TYPE= NMR SPECTRUM
##DATA CLASS= NTUPLES
##ORIGIN= Bruker BioSpin GmbH
##OWNER= NMR
$$ XWIN-NMR		Version 3.5
$$ Wed Aug 24 09:47:01 2005 GMT Daylight Time (UT+1h)  MAYBRIDGE\NMR@NMR_250MHZ
##.OBSERVE FREQUENCY= 250.131544655141
##.OBSERVE NUCLEUS= ^1H
##.ACQUISITION MODE= SIMULTANEOUS (DQD)
##.ACQUISITION SCHEME= undefined
##.AVERAGES= 16
##.DIGITISER RES= 18
##SPECTROMETER/DATA SYSTEM= dpx250
##.PULSE SEQUENCE= zg30
##.SOLVENT NAME= CDCl3
##.SHIFT REFERENCE= (INTERNAL, CDCl3, 0, 16.522)
##AUDIT TRAIL= $$ (NUMBER, WHEN, WHO, WHERE, WHAT)
$$ ##TITLE= Audit trail, XWIN-NMR		Version 3.5
$$ ##JCAMPDX= 5.01
$$ ##ORIGIN= Bruker BioSpin GmbH
$$ ##OWNER= NMR
$$ C:\u/data/dgb/nmr/ADRS/8430/pdata/1/auditp.txt
$$ ##AUDIT TRAIL=  $$ (NUMBER, WHEN, WHO, WHERE, WHAT)
(   1,<2005-08-24 09:46:24.86 +100>,<MAYBRIDGE\NMR>,<NMR_250MHZ>,
      <created by zg, POWCHK disabled, PULCHK disabled
       configuration hash MD5:
       62 19 C7 07 E1 42 D1 B7 37 6C 3D D0 77 39 F9 E6
       data hash MD5: 64K
       C7 C0 EA 7F FA 6F 35 66 04 4D B6 62 51 8D 69 FB>)
(   2,<2005-08-24 09:46:42.03 +100>,<MAYBRIDGE\NMR>,<NMR_250MHZ>,
      <Start of raw data processing
       ef LB = 0.3 FT_mod = 6 PKNL = 1 SI = 32K 
       data hash MD5: 32K
       23 1D 90 56 09 33 A6 D6 86 12 DC 41 93 C7 30 4B>)
(   3,<2005-08-24 09:46:47.78 +100>,<MAYBRIDGE\NMR>,<NMR_250MHZ>,
      <apk 
       data hash MD5: 32K
       67 DD C9 66 AE B5 A2 EA 4A 93 51 FD 37 09 56 B1>)
(   4,<2005-08-24 09:46:49.58 +100>,<MAYBRIDGE\NMR>,<NMR_250MHZ>,
      <abs ABSG = 5 
       data hash MD5: 32K
       BA 21 85 10 21 AB DA 31 6E 99 5A 4D C5 4F 17 0D>)
$$ ##END=
$$ 
$$ hash MD5
$$ BB 87 20 1F 5E 06 CE 18 3D A1 7E A9 EC AC F5 5A
##$RELAX= 
##$RELAX= 
##$RELAX= 
##$RELAX= 
##$RELAX= 
##$RELAX= 
##$RELAX= 
$$ Bruker specific parameters
$$ --------------------------
##$DU= <C:\u>
##$EXPNO= 8430
##$NAME= <ADRS>
##$PROCNO= 1
##$TYPE= <nmr>
##$USER= <dgb>
##$AMP= (0..31)
100 100 100 100 100 100 100 100 100 100 100 100 100 100 100 100 100 100 
100 100 100 100 100 100 100 100 100 100 100 100 100 100 
##$AQSEQ= 0
##$AQ_mod= 3
##$AUNM= <au_zg>
##$AUTOPOS= <6 >
##$BF1= 250.13
##$BF2= 250.13
##$BF3= 250.13
##$BF4= 250.13
##$BF5= 500.13
##$BF6= 500.13
##$BF7= 500.13
##$BF8= 500.13
##$BYTORDA= 1
##$CFDGTYP= 0
##$CFRGTYP= 5
##$CHEMSTR= <none>
##$CNST= (0..31)
1 1 145 1 1 1 1 1 1 1 1 1 1 1 1 1 1 1 1 1 1 1 1 1 1 1 1 1 1 1 1 1 
##$CPDPRG= <>
##$CPDPRG1= <>
##$CPDPRG2= <>
##$CPDPRG3= <>
##$CPDPRG4= <mlev>
##$CPDPRG5= <mlev>
##$CPDPRG6= <mlev>
##$CPDPRG7= <mlev>
##$CPDPRG8= <mlev>
##$CPDPRGB= <>
##$CPDPRGT= <>
##$D= (0..31)
0 1 0 0 0 0 0 0 0 0.06 0 0 0 0 0 0 0.0002 0 0 0 0 0 0 0 0 0 0 0 0 0 0 
0 
##$DATE= 1124873183
##$DBL= (0..7)
120 120 120 120 120 120 120 120 
##$DBP= (0..7)
150 150 150 150 150 150 150 150 
##$DBP07= 0
##$DBPNAM0= <>
##$DBPNAM1= <>
$$ [...]
##$SUBNAM7= <"">
##$SUBNAM8= <"">
##$SUBNAM9= <"">
##$SW= 20.6930455092707
##$SWIBOX= (0..15)
0 0 3 0 0 0 0 0 0 0 0 0 0 0 0 0 
##$SW_h= 5175.983436853
##$TD= 65536
##$TD0= 1
##$TE= 295.16
##$TE2= 300
##$TE3= 300
##$TEG= 300
##$TL= (0..7)
0 120 120 120 120 120 120 120 
##$TP= (0..7)
150 150 150 150 150 150 150 150 
##$TP07= 0
##$TPNAME0= <>
##$TPNAME1= <>
##$TPNAME2= <>
##$TPNAME3= <>
##$TPNAME4= <>
##$TPNAME5= <>
##$TPNAME6= <>
##$TPNAME7= <>
##$TPOAL= (0..7)
0.5 0.5 0.5 0.5 0.5 0.5 0.5 0.5 
##$TPOFFS= (0..7)
0 0 0 0 0 0 0 0 
##$TUNHIN= 0
##$TUNHOUT= 0
##$TUNXOUT= 0
##$USERA1= <user>
##$USERA2= <user>
##$USERA3= <user>
##$USERA4= <user>
##$USERA5= <user>
##$V9= 5
##$VALIST= <valist>
##$VCLIST= <CCCCCCCCCCCCCCC>
##$VD= 0
##$VDLIST= <DDDDDDDDDDDDDDD>
##$VPLIST= <PPPPPPPPPPPPPPP>
##$VTLIST= <TTTTTTTTTTTTTTT>
##$WBST= 1024
##$WBSW= 4
##$XGAIN= (0..3)
0 0 0 0 
##$XL= 0
##$YL= 0
##$YMAX_a= 435715
##$YMIN_a= -362165
##$ZGOPTNS= <>
##$ZL1= 120
##$ZL2= 120
##$ZL3= 120
##$ZL4= 120
##$ABSF1= 16.522
##$ABSF2= -4.171173
##$ABSG= 5
##$ABSL= 3
##$ALPHA= 0
##$AQORDER= 0
##$ASSFAC= 0
##$ASSFACI= 0
##$ASSFACX= 0
##$ASSWID= 0
##$AUNMP= <proc_1d>
##$AZFE= 0.1
##$AZFW= 0.1
##$BCFW= 0
##$BC_mod= 0
##$BYTORDP= 0
##$COROFFS= 0
##$CY= 12.5
##$DATMOD= 1
##$DC= 0
##$DFILT= <>
##$DTYPP= 0
##$F1P= 14.0000005364418
##$F2P= -0.99999901652339
##$FCOR= 0.5
##$FTSIZE= 32768
##$FT_mod= 6
##$GAMMA= 0
##$GB= 0
##$INTBC= 1
##$INTSCL= 1
##$ISEN= 128
##$LB= 0.3
##$LEV0= 0
##$LPBIN= 0
##$MAXI= 10000
##$MC2= 0
##$MEAN= 0
##$ME_mod= 0
##$MI= 0
##$NCOEF= 0
##$NC_proc= -5
##$NLEV= 6
##$NOISF1= 0
##$NOISF2= 0
##$NSP= 0
##$NTH_PI= 0
##$NZP= 0
##$OFFSET= 16.522
##$PC= 1
##$PHC0= 130.1757
##$PHC1= 6.700836
##$PH_mod= 1
##$PKNL= yes
##$PPARMOD= 0
##$PSCAL= 4
##$PSIGN= 0
##$REVERSE= no
##$SF= 250.13
##$SI= 32768
##$SIGF1= 0
##$SIGF2= 0
##$SINO= 400
##$SIOLD= 32768
##$SREGLST= <1H.CDCl3>
##$SSB= 0
##$STSI= 32768
##$STSR= 0
##$SW_p= 5175.98343685301
##$SYMM= 0
##$S_DEV= 0
##$TDeff= 65536
##$TDoff= 0
##$TI= <Analysis number 999999
Compound Code 99
Book Reference 9
Project Code 9>
##$TILT= no
##$TM1= 0
##$TM2= 0
##$TOPLEV= 0
##$USERP1= <user>
##$USERP2= <user>
##$USERP3= <user>
##$USERP4= <user>
##$USERP5= <user>
##$WDW= 1
##$XDIM= 32768
##$YMAX_p= 448495919
##$YMIN_p= -129331
$$ End of Bruker specific parameters
$$ ---------------------------------
##NTUPLES= NMR SPECTRUM
##VAR_NAME=  FREQUENCY,     SPECTRUM/REAL,   SPECTRUM/IMAG
##SYMBOL=    X,             R,               I
##VAR_TYPE=  INDEPENDENT,   DEPENDENT,       DEPENDENT
##VAR_FORM=  AFFN,          ASDF,            ASDF
##VAR_DIM=   32768,         32768,           32768
##UNITS=     HZ,            ARBITRARY UNITS, ARBITRARY UNITS
##FACTOR=    0.157963299565203, 1,           1
##FIRST=     4132.6476996994, 0,             0
##LAST=      -1043.33573715361, 0,           0
##MIN=       -1043.33573715361, -129331,     0
##MAX=       4132.6476996994, 448495919,     0
$$ Real data points
##PAGE= N=1
##DATA TABLE= (X++(R..R)), XYDATA
$$ [...]
15242e6683J591o772K636J4650J4520j7541J7652J8884j9737j6327J5343k841
15230c4625L728j1448J1122K6479n263j4197o954N61O690l2935n186K5382L7647
15217A001L3293K831n9256j8945J2196R533J4883j0718O832J1958k537k6012k8547
15204e3488O826j851M376K515j1932J4364K1532k5651j2070K477J4834n018n495
15191d8581Q087J4599J8389J7200N418q952l4216j6993M771L6299P815j0448j6186
15178b2798P503Q101L227k4865j7019j173j4433J7803K1750r018k4828n836j084
15165f2670J123L170J133j935l077j0549m154j7094J5558O886K0353J0555k8407
15152f9108J2652J7118K0599j6243j0594k076m17J1562J2097l3141j0281J332
$$ y = [-56683, -55092, -61864, -59228, -44578, -30058, -47599, -29947, -11063, -30800, -47127, -31784, -34625, -30897, -42345, -31223, -4744, -10007, -24204, -31158, -30597, -23907, -56842, -62028, -36646, 1001, 34294, 37125, -22131, -41076, -28880, -19347, -4464, -15182, -8350, 3608, 1071, -24941, -53488, -46662, -48513, -44137, -41622, -53554, -39190, -17658, -43309, -55379, -52902, -38068, -43086, -48581, -40494, -25895, -7506, 9694, 15112, 6160, -28056, -45049, -40278, -3979, 3836, -6612, -22798, -15295, -7194, -3967, -28832, -45851, -47024, -61457, -43654, -21904, -30922, -55750, -61586, -62670, -61547, -58377, -57244, -59179, -62256, -72805, -76959, -94053, -78495, -71609, -51256, -40701, -69108, -56456, -39338, -18739, -34982, -45576, -47652, -48069, -36507, -24410, -57551, -67832, -66500]
15140f6500K0787J8633r191j8316J1346L4521R661P624q120k8027j4269k9345
15128g1196o514j1301J0211N1896J6209m3674J8067J0281k7684q134J2434K7206
15116b2199J8650k120n911j2714n579M928j1900K719j4198J321L1885J1668O403
15103B953j1747l5950J5199J2101q261n011K4035K336k3479j4276k1568O950J1084
15090d5634J5903K3951J4319k8804k9981K5814m573p091O360J482k3377m26j6531
15077f8588j2615M899J7011Q252k4911J6059J1511j7930P778M8960J1341k6059
15065b4292J5390K839p295q451o026J1741Q463k9799j5144N089L3581m4k6711
15052d0659k3622R214L2412K1883j2K558J0731j558p335J9309m247k0273j1235
$$ y = [-66500, -45713, -27080, -36271, -54587, -43241, -8720, 941, 8565, 445, -27582, -41851, -71196, -77710, -89011, -78800, -26904, -10695, -54369, -36302, -26021, -53705, -61839, -49405, -22199, -3549, -5669, -11580, -24294, -29873, -24945, -36845, -34126, -48324, -47003, -15118, -3450, 2953, -8794, -44744, -29545, -17444, -25705, -30716, -6681, -4345, -27824, -42100, -63668, -56718, -45634, -29731, -5780, 8539, -20265, -50246, -24432, -29005, -36096, -29736, -28254, -51631, -52057, -68588, -81203, -76304, -59293, -51041, -75952, -59893, -48382, -66312, -58534, -9574, 1767, -24292, -8902, -6063, -13358, -21809, -27835, -16094, -7631, -37430, -52574, -47485, -13904, -13948, -40659, -64281, -55067, -22655, -772, -784, 1774, 12505, 10947, 3612, 22921, 18674, -1599, -12834]
15039a2834j5252j5183j6231m3601P867J5701M033L8583j3373m211R696j16q726
15026e3647K8938K4170k5203k883J6896j0052j1835l368P192q154O707j5174k1882
15013f8295o079o204j044J6291l628O896n199j3183k216Q206r465Q149K535k2356
14999i5592j694K1744p28Q799o819J0429J3812k0043r163m047J8842J0457J022
14986e2981m875J2714k3972J0943k942o229K970k3546L081J8979P906J3259k0656
14973f5349P7J2294q043K6154J1624K1484n634j4760j5747l865p841J1264K4348
14960a3994j4849J2235J5958j363p896J1695j2864j1172K5151j7201k5006k383
14948d1689J7809L0890r487k7494j647K1975j6312j3390J0345Q48L7055P812m5525
$$ y = [-12834, -28086, -43269, -59500, -103101, -95234, -79533, -75500, -36917, -50290, -54501, -44805, -44921, -53647, -24709, -539, -25742, -28625, -11729, -21781, -33616, -36984, -29792, -37946, -31239, -46413, -68295, -74374, -80578, -81622, -65331, -68959, -62063, -67262, -80445, -82661, -74455, -83920, -75771, -73236, -95592, -97286, -75542, -76270, -67471, -74290, -63861, -50049, -70092, -79255, -83302, -64460, -54003, -52981, -57856, -45142, -69114, -58171, -61113, -67342, -64372, -87918, -84837, -65858, -57952, -44693, -65349, -65272, -52978, -61021, -34867, -23243, -1759, -7393, -22153, -37900, -41765, -49606, -38342, -13994, -28843, -16608, -650, -2013, -9909, 1786, -11078, -22250, 2901, -14300, -39306, -41689, -23880, 7010, -2477, -29971, -31618, -9643, -25955, -39345, -29000, -28152, 8903, 16715, -28810]
14935b8810J009j1758l1621j840k786L2458Q465r749J3036M3359r427k0716m4315
14922f2695o938J6052K7538K7945J1018J5872j3297k9054L147L520R321r000j6477
14909b3048p580q512o456j350M146P332M591P888j5059J4860J0301M739K2995
14896A4847j7159l6555o902j2491m0249l0822K8320M0256L4120N409L184l0575
14884d8617l9j3229j1737p184k7485K9227R893l474J4462N440J4657j3487L21
14871e1252P679P880K0333j2389j7507K494K8383o426l4300j6371K3770k2722
14859g0428j7824K1863K5431j3911J4969K5685r515j0731J7866O588J7521J641
14847I155L605j2402P377j3440p73R199M262j2498o494J0967k5882l3138j0383
$$ y = [-28810, -27801, -39559, -71180, -73020, -75806, -43348, -34883, -44632, -31596, 11763, 2336, -18380, -62695, -69633, -53581, -26043, 1902, 12920, 28792, 15495, -13559, -10412, -6892, 2429, -6571, -23048, -30628, -39140, -45596, -46946, -42800, -35468, -30877, -22989, -38048, -23188, -12887, -8148, 14847, -2312, -38867, -45769, -58260, -98509, -129331, -101011, -60755, -26635, -21226, -18042, -48617, -48656, -61885, -73622, -80806, -108291, -79064, -69171, -72645, -58183, -52743, -38086, -51573, -51252, -43573, -35693, -15360, -27749, -45256, -42762, -14379, -20805, -55105, -71476, -47706, -70428, -88252, -66389, -40958, -54869, -39900, -14215, -23730, -34461, -16595, -10007, 7514, 9155, 12760, 358, 7735, -5705, -6478, 2721, 6983, -5515, -12009, -1042, -26924, -60062, -70445]
14834g0445q899m526K6620K7308r943p476Q990k5967j5943Q502o038J5537J5M587
14820e7678j5874p039K5926J3368M528j719l2704P364M7883k186o697J7517p449
14807a4760j3712K349M879j1480m346R654K5747N890r808k1320j5131J1297J4914
14794a5827K1106R28p421m174N032l5356k0649J4716p957J820j9234j6926K312
14781h1630l023K9325R629j1950r383L0068K0637R199k9801j4817J8712J9024
14769a4010J2412m703j90l5676p049J0932Q952J7977n334q383m213K167m766j18
14755c2002J6286K087q290j1148j1258l840j1499Q05K7394J3364J8330k8619j5206
14742d3596p145j207K0204J9558l9838j3634J8882J4226P523O561P251M19j6394
$$ y = [-70445, -79344, -83870, -57250, -29942, -39885, -47361, -38371, -64338, -80281, -71779, -77817, -62280, -62265, -57678, -73552, -80591, -54665, -41297, -36769, -38488, -71192, -63828, -15945, -18131, -24828, -7311, -14760, -28472, -26123, -21244, -32724, -37070, -27416, -1669, 4221, -5587, -26907, -42038, -30741, -15827, 5279, 6207, -1214, -5388, -356, -35712, -56361, -41645, -49602, -47782, -67016, -83942, -81630, -84653, -55328, -45699, -57649, -67032, -36964, -16327, -7128, -36929, -51746, -33034, -14010, -1598, -6301, -6491, -42167, -49216, -38284, -29332, -11355, -16689, -25072, -29285, -27118, -31884, -32002, -15716, -13629, -21919, -33067, -44325, -48165, -59664, -58859, -31465, -18101, 229, -28390, -43596, -50741, -51948, -31744, -12186, -52024, -65658, -46776, -32550, -25027, -18466, -11215, -10796, -27190]
14729b7190r050j3039k3417q981O969L4024J2635o471r42Q274r548k364J2820
14716b6280j6718j7570J2732L1692j4892K464l599l7531k6232p104q149l168J8097
14703i6258Q112N222L691L6599R073K0012j0759L127k912l4529J0588O146j0843
14690e2731n168k2941L32L2305M8121j2703l5351P414O989o69L153J7289M009
14677i951k612k7162O817Q269R33j366o150J7884J3301j0181P516J8734k979j0722
14663B331Q714j5277k951k8706l7798N793O413k534q598J5460j037J5937K849
14650c9404j4749K0586m146p899J2216j5700l1289K4007O066k2340j3075J2505
14638g3222m842R864K4324J3467Q612L5565J1011j3264J3053j7063j0849j4885
$$ y = [-27190, -36240, -49279, -72696, -81677, -74708, -40684, -28049, -34520, -35462, -27188, -36736, -39100, -26280, -42998, -60568, -47836, -16144, -31036, -28572, -32171, -69702, -95934, -103038, -111187, -114355, -96258, -88146, -82924, -79233, -42634, -33561, -13549, -24308, -21181, -24093, -58622, -48034, -41888, -52731, -57899, -80840, -80508, -48203, -82, -12785, -48136, -40722, -33733, -34402, -31249, -13960, -9951, -12563, -39725, -32908, -24639, -23706, -25072, -31222, -13338, -37, -10218, -2702, 16032, 13053, 2331, 11045, -4232, -7183, -35889, -73687, -67894, -61481, -64015, -72613, -57153, -58190, -42253, -39404, -54153, -33567, -37713, -45612, -33396, -49096, -80385, -56378, -50312, -72652, -85727, -73222, -78064, -68200, -43876, -30409, -21797, 13768, 24779, 11515, 24568, 7505, -3344, -18229]
14626a8229k2357Q675j930j2250j3259q410O024J128m8J0892K1061O339J0150
14613a2214j5149l71j3088n778K2327J7978r925O749n6k9993O5J3077j967k1148
14599d9493p389J9656j8271k7412K6527L7661N540j4481M007k3848j104J4686
14587c3921K736J3932k1772L694o058M777J5409o905n624O400p548l543p513k700
14573d8636R430J0384k226l1038J3854J9326Q099R826j5987j8774m374K6207K909
14560b1000J1269j8847L262l832k4848P739J6376j3461n665K1073J7108j381O031
14547f176K5221k3660j0964J966k0764l4365O857M4076p765j2681p829j4181l429
14534f3694k8161j1486K0682q726m208K6440J6022K1459R361N787r813k7320J0857
$$ y = [-18229, -40586, -31911, -33841, -46091, -59350, -67760, -61736, -60608, -60656, -49764, -28703, -22364, -12214, -27363, -27734, -40822, -46600, -24273, -6295, -16220, -9471, -9527, -39520, -39455, -26378, -28345, -49493, -56882, -37226, -55497, -82909, -56382, -18721, -13181, -27662, -23655, -47503, -48607, -33921, -31185, -17253, -39025, -35331, -41389, -36612, -21203, -28108, -33732, -27332, -34880, -38423, -45936, -48636, -39206, -28822, -31048, -62086, -48232, -28906, -20807, -10981, -26968, -45742, -50116, -23909, -21000, -9731, -28578, -25316, -29148, -53996, -46257, -29881, -43342, -49007, -27934, -10826, -12207, -6176, 19045, -4615, -15579, -13613, -34377, -68742, -61885, -17809, -25574, -38255, -46084, -60265, -63694, -91855, -103341, -82659, -91385, -95593, -69153, -53131, -31672, -22311, -16524, -26337, -53657, -42800]
14521d2800K730m752o046J1820R540K769m727K6669j1032j7911j702K5905k1439
14508c0976l3106K0285M7562j4344j2581L011K8530K857j0235R989J3749l0566
14496e825k2612J2019J48o567J4948n953k309j1879k7155J0919o751R805J6228
14483b4984J9917Q859j1181j6706O363R020o258j1959J9j0718m156k1464j618
14470f4866L4031K6334l8396j6533K4907J3513j5887k0772J5793j5268j557J0188
14458d8513j4168q539L2613L9287k8403m4265Q487q884l742K8077K2741L716J4110
14445g483K4724Q895P22j3753k1294J3460N930O478k9417k1987P07J1332J4876
14432f810K1667j2489J9623q293m9828k9300Q701L0454L0164J0603k1238j8436
$$ y = [-42800, -40070, -44822, -50868, -39048, -29508, -26739, -31466, -4797, -15829, -33740, -35442, -9537, -30976, -64082, -43797, 3765, -10579, -23160, -20149, 8381, 11238, 1003, 10992, 24741, -5825, -28437, -16418, -16270, -22837, -7889, -13842, -16151, -28030, -55185, -44266, -51017, -41212, -24984, -5067, 3792, -7389, -24095, -17732, -8712, -14970, -26929, -26910, -37628, -41784, -63248, -64866, -30835, -4501, -42897, -59430, -34523, -21010, -36897, -57669, -41876, -57144, -58701, -48513, -62681, -71220, -38607, 680, -27723, -71988, -63501, -72385, -76127, -48050, -25309, -21593, -7483, 17241, 26136, 26858, 13105, -8189, 5271, 11201, 17679, -11738, -33725, -33018, -21686, -6810, 14857, 2368, 21991, 13698, -36130, -65430, -56729, -26275, 3889, 14492, -6746, -25182]
14420b5182o845k5632K0668J8148M121k0866j323K622P694J8719o369l309j1079
14407b8633R816j1277j0825j4147j188J3654J973l2468K248L4448j386p579p363
14394e2727j5944k3156j1720O644L5298L7534p405l4731k1259j1404O600o569
14382i8839J2751J5283R793J8667l412p824q586m3377j2293K9083K224L2097K2190
14369c2243n150L001p970j0723K5823M4081j9537m5444j1461J4099Q349J2280
14357b4895j1558o973j910J234Q392j429k786k0749K6343J779j4796J2101j7480
14344e2727k4636R312j5037J1848K2352o80J728N949l057J4896r265J620o476
14331d4173j3640J2130J6468j0579n690J0206J4305J871k0419r121o173j4301
$$ y = [-25182, -32027, -57659, -36991, -18843, -14722, -35588, -36911, -34289, -26595, -7876, -14245, -17554, -28633, -18817, -30094, -40919, -55066, -56254, -42600, -40627, -73095, -70847, -36399, -37785, -45364, -52727, -68671, -91827, -103547, -96903, -61605, -24071, -31476, -66207, -87466, -98870, -92270, -98839, -86088, -70805, -61012, -42345, -45757, -53581, -62167, -105544, -117837, -88754, -86530, -54433, -32243, -37393, -34392, -42362, -53085, -27262, 16819, -2718, -48162, -59623, -45524, -37175, -24895, -36453, -43426, -45336, -44102, -35710, -37139, -39925, -60674, -34331, -32552, -47348, -35247, -52727, -77363, -68051, -83088, -71240, -48888, -49568, -47840, -41891, -44948, -30052, -39317, -37697, -44173, -57813, -45683, -29215, -39794, -45484, -35278, -20973, -19102, -39521, -48642, -54815, -69116]
14319f9116K4532L3304J6066Q951k275J777Q436k914j3343k3636j6991J137j4209
14306d8281K5138J4779n502p154l909R454l036k0984j5173Q022R382p343n343
14293d9950J9030n883K4236J5853r040k6840P58J1315l4120J2898R768p43K1962
14280a0756Q077m08J0065l9902k0784J121J6667L43l448l3620P886k903N103q321
14266g0880p60K3585k367L4560K0292K204M653j6113j2712j5971j3213j7304j4859
14253g8885K638j1189n408J8202L109J5530J4642q749K3550O338p241J0090p252
14240b4625O260n83j0721l0792l0411P339J8655O655J7374R978k491k9829q187
14227g1378K7362n545m2849J4424J6746q177m926L2264L9510p824j9992l5191
$$ y = [-69116, -44584, -11280, 4786, 13737, 11462, 13239, 21675, 18761, 5418, -18218, -35209, -34072, -48281, -23143, -8364, -13866, -21020, -24929, -15475, -18511, -39495, -54668, -46646, -37264, -44607, -49950, -30920, -36803, -12567, 3286, -5754, -32594, -31836, -20521, -54641, -41743, -31975, -32718, -10756, -2679, -3087, 6978, -32924, -53708, -52587, -35920, -35577, -39025, -72645, -64759, -67662, -62559, -70880, -71640, -48055, -50422, -15862, 4430, 6634, 11287, -4826, -17538, -33509, -46722, -64026, -78885, -76247, -87436, -92844, -74642, -71533, -56003, -41361, -50110, -26560, -20222, -27463, -17373, -24625, -18365, -18948, -29669, -60461, -90872, -83533, -64878, -58223, -40849, -30871, -33362, -63191, -71378, -44016, -49561, -92410, -77986, -61240, -69417, -74343, -42079, -2569, -10393, -30385, -65576]
14215f5576j6063K1887K0902K1699O343j065J5289q669J1289K2n518M007K6280
14202C0827O98k8956j9400P738P044J12P644k965j4439N513j1259k5295J3922
14189b8816O1633R748o961k142N240p111m8531l6049P865R169K2423j2552m383
14176c0467J3988K7608K0934k5572R48K9947J2953k989q010L1854Q181m0512j4508
14163B4355J6268L6103j5907j7929K8721J7787j1998j8581R777j3619J4583K3249
14151I2809J2178K3926j562j8526R726J41J796r370k2879j5520L8119j6364j0605
14138H3869L1289r40P701j9956l3858r370K0553k588p716J6698K3582l2858j9699
14125E6707j151Q857k3517l507L6361J0351j7744o915l383m538k2798k3923K475
$$ y = [-65576, -81639, -59752, -38850, -17151, -10808, -11873, 3416, -5253, 6036, 6058, 540, 4547, 30827, 31525, 2569, -16831, -9093, -2049, -1937, 5707, 2742, -11697, -6184, -17443, -42738, -28816, 32817, 42565, 35604, 33462, 38702, 31591, -16940, -52989, -45124, -35955, -13532, -26084, -30467, -16479, 11129, 32063, 6491, 7439, 37386, 50339, 47350, 39340, 71194, 79375, 38863, 24355, 40623, 76726, 60819, 42890, 71611, 89398, 77400, 58819, 68596, 54977, 69560, 92809, 104987, 128913, 127351, 108825, 118551, 118692, 120488, 111118, 88239, 72719, 110838, 94474, 83869, 115158, 114218, 121919, 101963, 68105, 58735, 79288, 76700, 68984, 85682, 109264, 76406, 56707, 55556, 64413, 40896, 37389, 73750, 84101, 66357, 59442, 56059, 51521, 28723, 4800, 7275]
14112G275j885J3342p189j4081L2671K8142l2892m2332j9467K3591P927K5914
14100B1016L011k0685k0074j9887J8204M0399p650l5305J0679p34J4227K5878
14088B9079Q246L377k2160j2456j3945k8694J6703J5559K5741N545r434k4355
14076f794j8278R999j949j7161K377l913J7877J3579J5344l1310k1026n155J8403
14063b8007J6430P48N538l9556J2748J2786M69J1372j5200J0935K9484R552l3459
14050f160m9029j6880L308K1302J4065k591q698O664Q723j4479J715Q472K6115
14037g473j792j5370k4778n663O272Q039j2763o180K9846q85J5453j0679J701
14024b4272K2032J8525L2493Q70k8037j2727j7101k713k7369m818o458O381Q164
$$ y = [7275, 5390, 18732, 11543, -2538, 30133, 58275, 25383, -16949, -36416, -12825, -4898, 21016, 24027, 3342, -16732, -36619, -18415, 21984, 14334, -20971, -10292, -11026, 3201, 29079, 37325, 40702, 18542, 6086, -7859, -36553, -19850, -4291, 21450, 26995, 17561, -6794, -25072, -15073, -17022, -34183, -31806, -35719, -17842, -4263, 11081, -20229, -41255, -46410, -28007, -11577, -10829, -5291, -44847, -32099, -19313, -18844, -7472, -22672, -11737, 17747, 27299, -6160, -55189, -72069, -68761, -47459, -33394, -35985, -44683, -38019, -29296, -43775, -42060, -33588, -7473, -9265, -24635, -49413, -55076, -48804, -40765, -53528, -59708, -29862, -30747, -15294, -25973, -24272, -2240, 16285, 48778, 49648, 21611, 8884, -8217, -10930, -38299, -43117, -49575, -43194, -35030]
14011c5030K0613Q371k655J5833k696j8548k6532k969L3513k3088R010K0306K1415
13998A7543J8340J8795J1587k7903l3912k6114N843l792j3603K790j2799r84L4019
13985a0190O0396N013j4427J7788j1608N365P740p330j2258m917J2666M972j2827
13972D0383j6625k5053l7753j2111L3554R815N993j6308R497r494j9233l0450
13960f7785j0139j992J4668K6026L5919J466J6466J5849Q89l9668q159J2424j6223
13947b0259k0227K589J6113J3296P523m623j5438J0958j1150j8247K0985l280
13935b1760j444j2196M435K7156j1043N939k449n222R961m014r114j3997q546
13922d2294K3042J2998Q954K6618m401l5531l1566j5738l5733m904L744J9517
$$ y = [-35030, -14417, -6046, -8701, 7132, 4436, -14112, -40644, -43613, -10100, -33188, -24178, -3872, 17543, 35883, 54678, 66265, 38362, 4450, -21664, -15821, -19613, -33216, -30426, -43225, -44209, -10190, 50206, 55219, 40792, 58580, 46972, 52337, 60077, 52747, 40489, 35572, 48238, 53210, 40383, 23758, -1295, -39048, -51159, -17605, -7790, -1797, -18105, -8608, -18102, -37335, -67785, -77924, -79916, -65248, -39222, -3303, -1837, 14629, 30478, 31367, -8301, -16460, -4036, -20259, -40486, -37897, -21784, -8488, -965, -5588, -21026, -10068, -21218, -39465, -18480, -21760, -23204, -35400, -30965, -3809, -14852, -8913, -11362, -16584, -6623, -10637, -19751, -33748, -42294, -19252, -6254, 2700, 29318, 24917, -10614, -42180, -57918, -93651, -98555, -94811, -75294]
13910g5294N278L7277J5143l7169p040K7998K2206l2269j173O691j1716J707J1946
13897c6415L0525O315J9670J3990j1846k812j4558O707o205l6514j8919O20M0520
13884h922J5418o012k8932N718j0666o488J6501J1922j6090m405J8378J2535j9541
13871b0584l1075j1013J5390J0077K102K098L700J2606J733K4005N356m713r86
13858H696p095j5051K8625K1707p965m966p000k9495j6099j9203K1712l998n356
13845c5488k666M885J9940L3484j0219j2583J2906k983o709q248j1367J696j9367
13832c6719o902m612K7420N3910K2028k6078j3455k7943j2939J4416K801q920
13820a6993K9104J9632Q504j5132J2068J2382l331l4010K285r14j0207O10J1855
$$ y = [-75294, -70016, -32739, -17596, -54765, -61805, -33807, -11601, -43870, -45043, -38352, -50068, -48361, -36415, -5890, 425, 20095, 34085, 22239, 19427, 4869, 11576, 5371, -31143, -50062, -49442, -8922, 6496, 484, -28448, -22730, -33396, -39884, -23383, -11461, -27551, -31956, -13578, -1043, -20584, -51659, -62672, -47282, -37205, -35103, -33005, -29305, -16699, -14966, 9039, 14395, 9682, 8696, 1601, -13450, 15175, 36882, 28917, 23951, 16951, -12544, -28643, -47846, -26134, -30132, -35488, -38154, -33269, -13329, 20155, 9936, -2647, 10259, 7276, 567, -7681, -19048, -17352, -36719, -43621, -48233, -20813, 33097, 55125, 29047, 15592, -12351, -25290, -10874, -8073, -16993, 12111, 31743, 40247, 25115, 37183, 49565, 46234, 12224, 14509, 13595, 3388, 3998, 15853]
13807A5853q574p548r224j5092q427K2472K7737M421j3129j124J2037l320j4357
13794A725J073j2824K1645J2824j0206p056q007j4077J1652K5233j2559k361J4284
13781B1346J2306J418j2479k70K1860R88J2386k5217j3074m913j7106j1348j1412
13768b5515l2536j4381J5047J7820Q694J0387N880k3752k1486k7222j3083L611
13756i6536L1199J9174j8671R027J2696j8119N146K3251m430k6333J8910K7325
13744a7361j4146k1533M763Q634k3504k4194q65J6573K1418L3011J5743j6184
13732a7645o41R596M543M51l188N054p89j6764n268m2020q792L3365J8689K0361
13718c048J5804p662k1318N543K7095K6450q979J2188K7134r082p431j5090m379
$$ y = [15853, 7279, -269, -9493, -24585, -33012, -10540, 17197, 21618, 8489, 7365, 19402, 16082, 1725, 2798, -10026, 11619, 24443, 14237, 7181, -826, -14903, -3251, 21982, 9423, 7062, 21346, 33652, 35070, 22591, 22321, 44181, 45169, 57555, 32338, 19264, 14351, -2755, -14103, -25515, -58051, -72432, -57385, -39565, -30871, -20484, -14604, -38356, -59842, -87064, -100147, -96536, -65337, -46163, -64834, -55807, -43111, -61230, -56084, -32833, -37263, -63596, -44686, -17361, -31507, -53040, -48277, -39643, -63147, -87341, -88206, -71633, -50215, -17204, -1461, -17645, -18286, -8690, -4147, -3696, -6884, -1830, -2619, -19383, -24651, -66671, -75463, -42098, -23409, -3048, 12756, 5094, -16224, -10681, 16414, 42864, 33885, 46073, 73207, 64125, 56694, 41604, 37225]
13705C7225N24n284r165K8829j0995k9063K385J0637k5578J5250K5235k1128j6539
13692B333J8388k473O336j7538j4450J8175M1374j3789j1248j8625R063O438K669
13679B6653j4275o416K9011J2252j3893o061R686L040k009K527r760l632k1287
13666E836Q325j590m0282j2118L7513Q163l170r78K837k619k6275j2367k5619
13653f2344J9083J8647K710j802m104j000J1363K8031Q230J9023L2232j3914m2004
13640A4151o573K4973j6333j7268J6016k399j8430K1668L095k2801p654L803j8742
13627b6494l9254k1132K0387K5511L2637q512J5666L1063k4351j3232K1729J3107
13615B7125j8353j8768r66R329K8807n059k9566j502K3095M7681j6499l2532k2407
$$ y = [37225, 37749, 32465, 23300, 52129, 41134, 12071, 14456, 25093, -485, 14765, 40000, 18872, 2333, 20721, 18248, 24584, 7046, -7404, 10771, 52145, 38356, 27108, 8483, 17546, 23984, 26653, 12378, 5962, 34973, 47225, 33332, 27271, 36957, 39997, 37988, 40515, 30755, 27123, 5836, 14161, 12571, -27711, -39829, -2316, 5847, 2677, 1699, 4536, 1917, -24358, -36725, -62344, -43261, -24614, -21904, -23706, -27810, -28810, -17447, 10584, 18814, 37837, 70069, 56155, 14151, 7578, 32551, 16218, -1050, 14966, 12567, -5863, 15805, 18900, -3901, -11555, -7752, -26494, -65748, -86880, -66493, -40982, -8345, -16857, -1191, 29872, 5521, -7711, 14018, 27125, 8772, -9996, -10962, -1633, 27174, 22115, -7451, -8953, 14142, 61823, 45324, 12792, -9615]
13602i615L84J7958k3737n521J384M058k1509J8575N0412K4215o835m1565n1988
13589d3784j8182K6632J3156J2260L2007k026p408j1866p952N536L2017J9555
13577D9945j8467j1240j3519k1672R045J8833J8077q009j3285P80R025o601O038
13564A8950j0046K8568J4584k7395j9178K0236j1149j2483o357J9675N958O205
13552B7568J294l621k4829J405j7094J0133N765m384J5983q313j1311J1629N417
13539I642J5294k3735j3215R825J7930m111M67J4282K9459k9113k258L813j0691
13526A7589N521N952J0607J861J0571N313k4073K622J5341o371p859n450J5071
13513D6695j3045J2218L545k2457p029q550L3854M6697m215j8422j9518O680K1273
$$ y = [-9615, -9231, 8727, -15010, -20531, -19147, -15089, -36598, -18023, 32389, 56604, 49769, 8204, -43784, -61966, -35334, -22178, -9918, 22089, 20063, 12655, 789, -7163, -1627, 30390, 49945, 31478, 20238, 6719, -14953, -5908, 12925, 31002, 22993, 9708, 10488, 19513, 12912, 18950, 8904, 37472, 52056, 24661, 5483, 25719, 14570, 2087, -4270, 15405, 21363, 27568, 28862, 25241, 412, 1817, -15277, -5144, 621, -3763, 12220, 3907, -7404, 4225, 9642, 24936, 1201, -12014, -2189, 15741, 11630, 12097, 26379, 55838, 26725, 24467, 28280, 17589, 23110, 29062, 39669, 41530, 52101, 57414, 33341, 35963, 51304, 44933, 37074, 31624, 46695, 33650, 45868, 49413, 26956, 19927, 11377, 45231, 91928, 87713, 69291, 49773, 56453, 77726]
13500G7726j1412l0550j4012P000p715j011o293j067K9203J0743O108l643l479
13487E1598j5776l2499K0404p811l535j2170p08Q127J3467j355K7439j6113l4883
13474c815J9185J4128J545N341j1522J332p85J9221o91k0796k2253K877P589L596
13460A4952P712O630j1634j1807M759K7194K0613r222j6889l3404j4878K2911
13448F937J3849J6186J0784J0346j341j5884o688j4654p188l241j371r417Q731
13435G049R676p810n464M342K5058K3631R627P9q512j4298o739J9080J7965j1540
13421F2144k5809j4590P793L0836j2750o236J5434J68l218Q79k355j7529k7234
13408G533j8078q393K0081J3664J1467k0292P736J6329q219o519L6489K0695k2769
$$ y = [77726, 66314, 35764, 21752, 28752, 21037, 20026, 13733, 12666, 41869, 52612, 58720, 55077, 51598, 35822, 3323, 23727, 15916, 12381, 211, -497, 7630, 21097, 19742, 47181, 31068, -3815, 15370, 29498, 31043, 36384, 24862, 26194, 25409, 44630, 43939, 23143, 890, 3767, 11356, 14952, 22664, 29294, 17660, 5853, 10612, 37806, 58419, 49197, 32308, -1096, -15974, 6937, 20786, 36972, 47756, 58102, 56761, 40877, 34189, 19535, 12347, 9106, 7735, -1682, 7049, 16725, 8915, 3451, 7793, 32851, 56482, 66109, 66188, 57676, 43378, 36639, 55719, 73684, 62144, 36335, 21745, 29538, 60374, 47624, 41388, 56822, 56990, 53772, 54651, 52296, 34767, 7533, -10545, -18938, 1143, 14807, 26274, 5982, 13718, 30047, 21828, 15309, 51798, 72493, 49724]
13395D9724j8022k0355k567K505N59J4149J9235J8985M693Q287j0800m072J7114
13382G9435p909j4809N110j5406J5061J0978j206j9098n801j2439J6811M725K276
13369E7728o481K0278p364k9803j6100K072J2345l342j7325J3308K3705L4699
13357H3720J3974r051j3389J5088o676k4514j6746R038p277J1364M806p662n51
13344E2124j1062j6769R164N535L5030P592l1090r508J4866j8283J7138j7877
13332C6860K2794o918p599Q460l985j3591j0196o532J8063j885j4635j2402K4910
13319C3344J6063J284N892K3330K9885j999o586J1613j3516r702j1535j6646Q356
13306F9783J0097j1267O673J2331q971j3548o705k562p798J3697M0864j91l3664
$$ y = [49724, 31702, 11347, 8780, 11285, 11844, 25993, 45228, 64213, 68906, 77193, 66393, 62321, 79435, 71526, 56717, 61827, 46421, 61482, 72460, 71254, 52156, 46355, 33916, 50727, 55452, 57728, 51247, 71525, 64161, 34358, 18258, 20330, 32675, 29333, 12008, 25316, 49021, 83720, 97694, 88643, 75254, 90342, 83666, 59152, 42406, 51444, 44167, 55531, 60337, 52675, 52124, 41062, 24293, 33457, 38992, 74022, 81614, 50524, 41016, 55882, 37599, 54737, 36860, 59654, 52736, 45137, 53597, 49612, 36021, 25825, 19293, 37356, 35471, 20836, 8434, 33344, 49407, 50691, 56583, 79913, 109798, 107799, 101213, 112826, 99310, 89608, 78073, 61427, 69783, 79880, 68613, 75286, 87617, 78646, 65098, 58393, 55831, 48033, 61730, 102594, 102403, 68739]
13293F8739o146o01O931J9371j4429K80j1016j4920P398J2476K6164L927l922
13280I4252N276j3815k7227m0180m738J4702M387R430M985l845k4258j057L3824
13267E1736J4354O93L0675K837k3170j2954J5171J7605l419J864J5303m942k9927
13254G5826K436J3588k547L5392m517J4562J8521j4297j9182O039j8050j0669
13242I7102l5204k6332j4322K1423J9592P224P200j4376m365M962P560n547m482
13229F0435J4140M7537J5316j9500r953k5316j5630K2992j989l809R739J3589
13217A07551J9894q643l890K5091k1856l3513n051K0964K8608M2820M0378P286
13205B19639K6860L055J5801J507m1798j3381j1134m3101m4072j8593J0371n751
$$ y = [68739, 62593, 61992, 68923, 88294, 73865, 74145, 63129, 48209, 55607, 68083, 94247, 98174, 94252, 99528, 85713, 58486, 18306, 13568, 28270, 32657, 42087, 47072, 43227, 18969, 17912, 51736, 66090, 66783, 97458, 100295, 77125, 64171, 79342, 96947, 93528, 95392, 110695, 105753, 75826, 78262, 91850, 89303, 124695, 120178, 134740, 153261, 138964, 119782, 125821, 107771, 97102, 61898, 35566, 21244, 42667, 62259, 69483, 76683, 62307, 57942, 62904, 70464, 64917, 60435, 74575, 122112, 137428, 117928, 107975, 82659, 67029, 90021, 88032, 84223, 93962, 107551, 127445, 118802, 114912, 140003, 118147, 84634, 79583, 100547, 129155, 171975, 212353, 219639, 246499, 249554, 265355, 266862, 225064, 211683, 200549, 157448, 113376, 94783, 105154, 99403]
13193I9403j4021r917J3589P980L43p497K2065J230j6242R397K8780n580J0880
13180A40410J2354R19j990P579J5762j1014K043J0192k5206j4540j0491J8356
13168A44374J1935K2769k1845n014L6062K8271q841j473J5333K4859J9229J0076
13156B75735j2566l5153l2705k9533N12R184j8673j6182Q931l022k3173n930k3595
13143I3830j3433J2467J0479L320R791q933N583N146j4335j423K2775j7040O597
13130A14824J4767J6368j6143j3454p60j049J3078J0142j2694J4825L5465O460
13118A81829k1829Q7L387J3062K7506J4391l2436k3665j4794j3114O1j4376J5236
13105A35345J9810r369r982o207L534J7379K4511K752j7758m1343n946j0065j214
$$ y = [99403, 85382, 75465, 89054, 97034, 97377, 89880, 111945, 113175, 96933, 106330, 135110, 129530, 140410, 152764, 153683, 151693, 159272, 175034, 164020, 166063, 176255, 151049, 136509, 126018, 144374, 156309, 179078, 157233, 152219, 188281, 216552, 207711, 206238, 221571, 246430, 265659, 275735, 263169, 228016, 195311, 165778, 166290, 175474, 156801, 140619, 149550, 146528, 123355, 117425, 93830, 80397, 92864, 103343, 106663, 116454, 107521, 113104, 118250, 103915, 102492, 125267, 108227, 114824, 129591, 145959, 129816, 116362, 115602, 114553, 127631, 137773, 125079, 139904, 175369, 181829, 160000, 160087, 163474, 176536, 204042, 218433, 185997, 162332, 147538, 134424, 134485, 120109, 135345, 155155, 145786, 135804, 129597, 133131, 150510, 175021, 177773, 160015, 118672, 112726, 102661, 101447]
13092A01447n065J0907K2072j1209j4526K8162j0563J3553L1113j0873o423j4477
13080A34118Q001L290J7012j6358k4636J2985M3q892j2964K8839L722m454J9119
13067A59825q71k1433l8131J5671K9875K3831L6650N051k8997j0641j4053n640
13055A51137L800M797j8404J719j330k0308N992K8580R234K971j0544J2440K4101
13042A94185l3310M944L0174N515j6005l0613p472O351K5917J1235r910m782j0716
13029A65513Q3L2329M51J170k3610o768R645J0580k4334J0703P874O03K202J2106
13015A98547M640k3550k0678L5432J80k38K442m451J0422M551O225j4903j8002
13002A80617j8594R330j2399K9722O127L1324J2139M716k3295k0105J5491j157
$$ y = [101447, 96382, 107289, 129361, 118152, 103626, 131788, 121225, 134778, 165891, 155018, 148595, 134118, 142119, 145409, 162421, 146063, 121427, 134412, 134455, 125563, 112599, 141438, 145160, 140706, 159825, 158954, 137521, 99390, 115061, 144936, 168767, 205417, 210468, 181471, 170830, 156777, 151137, 154937, 159734, 141330, 143049, 141719, 121411, 127403, 155983, 165217, 168188, 157644, 170084, 194185, 160875, 165819, 195993, 201508, 185503, 154890, 147418, 153769, 179686, 190921, 181011, 176229, 165513, 165596, 197925, 198376, 199546, 175936, 169168, 178813, 189393, 165059, 175762, 183636, 184239, 186441, 198547, 203187, 179637, 158959, 194391, 194571, 194333, 196775, 192324, 202746, 207297, 213522, 198619, 180617, 162023, 171353, 158954, 188676, 194803, 226127, 238266, 242982, 219687, 199582, 215073, 213916]
12990B13916K4227m495j7146M476P307N236k7859o801M024N690P231o086j9735
12977A89985l1911K1619L3186J3760m684o051J7922J861J2154k4252j6242Q748
12965B16095O425l2956j0802j4462k3176J0667L5245J0660J1546J9195J1821k780
12953B37478j4909m87K2353q370N289l865J919k930k2851p204J7120o662J2080
12940B28961K3737o636j3659J9457k914q368L3960J530m338R462m146m3141J264
12927B35169k077j0517K332J1226R75P839J0658Q392J6167K286k7687M815k5678
12914B33900l9051K3091N9570o062J3730M110J7533N550K487L98k9353k8070j1542
12901B46291J8219L4099Q807J7678k8177k3526R93j652j4824M3930L2950K775
$$ y = [213916, 238143, 233648, 216502, 220978, 228285, 233521, 205662, 198861, 202885, 208575, 215806, 209720, 189985, 158074, 179693, 212879, 226639, 221955, 215904, 233826, 235687, 247841, 223589, 207347, 216095, 222520, 189564, 178762, 164300, 141124, 151791, 187036, 197696, 209242, 228437, 240258, 237478, 222569, 222082, 244435, 236065, 241354, 237489, 239408, 236478, 213627, 206423, 223543, 216881, 228961, 252698, 246062, 232403, 251860, 248946, 240578, 274538, 276068, 271730, 281192, 277046, 233905, 235169, 233092, 222575, 224907, 236133, 237108, 244947, 255605, 263997, 280164, 282450, 254763, 259578, 233900, 194849, 217940, 277510, 271448, 285178, 289288, 306821, 312371, 314858, 315256, 285903, 257833, 246291, 264510, 298609, 307416, 325094, 296917, 273391, 274384, 272732, 257908, 301838, 334788, 337563]
12889C37563j6571J8106J5552K8329K2940J2847p511m1648k7673J7247k5245j5374
12877C18562K421R955L1901K3552n92j9852J2338J0637j4945M908L2248j1564
12865C99569j2155M611K8510j3031j812j0494j2798J5043L434j2253n14K2317
12853D10427N040j6812N07j5258p217J6437N262o284k695K9239K4774L3964J3471
12840D90855J2318J9703L9975N216o450j1318O377j3072j8470m214P167j9733
12828E08354k7565k1236l212j1762j736Q668J700J0931N761j6739P496R28k4388
12815D37200j0737J1930J347K9248j6165M723J4028N858n859P070J5125J1871
12803E05639R591J1991p163J8688j322J610K8992j968p353R632J6517K5295K9686
$$ y = [337563, 320992, 339098, 354650, 382979, 405919, 418766, 411255, 369607, 341934, 359181, 333936, 318562, 320983, 330938, 362839, 386391, 385799, 365947, 378285, 388922, 373977, 378885, 411133, 399569, 387414, 392025, 420535, 407504, 405692, 395198, 382400, 397443, 400877, 388624, 388110, 410427, 415467, 398655, 399162, 383904, 376687, 393124, 398386, 392102, 389407, 418646, 443420, 477384, 490855, 503173, 522876, 562851, 568067, 561617, 550299, 556676, 543604, 525134, 520920, 528087, 508354, 480789, 459553, 456341, 444579, 442843, 451511, 453211, 464142, 469903, 453164, 460660, 461588, 437200, 426463, 438393, 439740, 468988, 452823, 457546, 471574, 477432, 471573, 478643, 493768, 505639, 515230, 527221, 520058, 538746, 537424, 539034, 568026, 566058, 558705, 568337, 584854, 610149, 639835]
12790F39835j4080j5134j906K3436J8873r877l3139n472o467j5703l507j6713
12778E60146j7778j5155J1350J7840j4447j8266k6919j8801L930L2433O675J0698
12766E31706K0880J0056j8057l129k690k3580M67L7100j7333K910l526r009j2756
12753E13039K269Q256L2194L7954K5859k5598l1095m437J7617j950n483N570R251
12740E83446j5534l6158J3650M264M431J5907L2110j1793j3768N251j0387j8063
12728E53356O400O474L2327R542L449j1417q350J3988L0848r239q398l079J3263
12715F29164j0306R56K7954N669Q302k0854K9579J9511L667q507n307O834j9649
12702F67013M078p145o571J4764J2033k890R746J0379j2757N909K6604l476N401
$$ y = [639835, 625755, 610621, 608715, 632151, 651024, 641147, 608008, 602536, 596069, 580366, 576859, 560146, 542368, 527213, 538563, 556403, 541956, 523690, 496771, 477970, 481900, 514333, 521008, 531706, 552586, 562642, 544585, 541456, 538766, 515186, 515653, 552753, 535420, 538330, 534804, 525795, 513039, 515308, 523564, 555758, 593712, 619571, 593973, 562878, 558441, 576058, 574108, 568625, 574195, 583446, 567912, 531754, 545404, 549668, 554099, 570006, 602116, 590323, 576555, 581806, 571419, 553356, 559756, 566230, 598557, 608099, 611548, 600131, 591781, 605769, 636617, 627378, 618980, 615901, 629164, 618858, 619814, 647768, 653437, 661739, 640885, 670464, 689975, 693642, 685135, 679828, 686662, 667013, 671091, 663946, 657375, 672139, 684172, 681282, 691028, 701407, 688650, 694559, 721163, 717687, 723088]
12689G23088j998q193k6371j4441K1818K6124M2719k520J534O674L10Q190J678
12676G78612j818J9576j0586m35L9590M782l333J8346j5617L97J3189J6352O068
12663H65123n328K1591K3910J6358n952p363l405k674R837J3268N491l7706m4765
12650H48385L5037J2735K5403q75R303L3305O358k69K432l0377j1672k95L1015
12637I60485J5639p93o26J9526J8639L025j104J4740J5822L6526J1782M727k635
12624A095753j0078q750j1951J5524M1877J4225j6084l267J0281L5640L4538K7478
12612A225186K0909K3475j5344k7192J2058J9447J7806J6205K7465r244P88J7373
12600A328932K5434J413j5109p569K9481K9639J1987L3892K8357j4278k469J2831
$$ y = [723088, 721090, 712897, 686526, 672085, 693903, 720027, 762746, 760226, 761760, 768434, 768744, 776934, 778612, 776794, 796370, 785784, 785349, 824939, 829721, 826388, 844734, 829117, 829514, 842703, 859055, 865123, 859795, 881386, 905296, 921654, 915702, 908339, 904934, 902260, 912097, 925365, 930856, 893150, 848385, 883422, 896157, 921560, 920685, 929988, 963293, 969651, 969382, 971814, 941437, 929765, 929470, 960485, 976124, 975331, 974705, 994231, 1012870, 1015895, 1014791, 1029531, 1045353, 1081879, 1093661, 1098388, 1095753, 1085675, 1076925, 1064974, 1080498, 1122375, 1136600, 1120516, 1117249, 1127530, 1163170, 1197708, 1225186, 1246095, 1269570, 1254226, 1227034, 1239092, 1258539, 1276345, 1292550, 1320015, 1310771, 1311559, 1328932, 1354366, 1355779, 1340670, 1333101, 1362582, 1392221, 1404208, 1438100, 1466457, 1452179, 1449710, 1462541]
12588A462541L1764k177k913p703J4333o192j3418K7423O591J3678L758J9997
12576A547682M9479J2337R669L3243L0554J86R283J1668k4395J0105M1490J4007
12564A745308K7660K2281K1377J2751M6259O305j0738M228R319K3264J2756P618
12552A928388P122j2778Q80K8689L1222K6920J5592k0070p329K2470O087K3846
12540B051039L1280M919n434k356J9264r32K7805L9270j6435K660L3967P878k810
12527B190115J9000M1215M6904L3875M067o303M8922R085q590K7900N6804J6698
12515B479692J5975K8130J0961J4834L3834K0227K630K0579R734L4564J5301L8417
12503B724878K3862K2001K4777M6984J5539J3589J5057J8381M5522L5329K6041
$$ y = [1462541, 1494305, 1492128, 1489215, 1481512, 1495845, 1489653, 1476235, 1503658, 1510249, 1523927, 1527685, 1547682, 1597161, 1609498, 1619167, 1652410, 1682964, 1683150, 1692433, 1704101, 1679706, 1689811, 1731301, 1745308, 1772968, 1795249, 1816626, 1829377, 1875636, 1881941, 1871203, 1875431, 1884750, 1908014, 1920770, 1928388, 1935510, 1922732, 1923612, 1952301, 1983523, 2010443, 2026035, 2005965, 1998636, 2021106, 2027193, 2051039, 2082319, 2087238, 2081804, 2079448, 2098712, 2097780, 2125585, 2164855, 2148420, 2151080, 2185047, 2192925, 2190115, 2209115, 2250330, 2297234, 2331109, 2335176, 2328873, 2377795, 2386880, 2378290, 2406190, 2462994, 2479692, 2495667, 2523797, 2534758, 2549592, 2583426, 2603653, 2606283, 2626862, 2636596, 2671160, 2686461, 2724878, 2748740, 2770741, 2795518, 2842502, 2858041, 2871630, 2886687, 2905068, 2950590, 2985919, 3011960]
12492C011960L6813M1653M2203J3270J2852L9320N2310N1001L7524L0307L4436
12481C403649M2534M0309J6745M7718O4482N3818L8122L3888K4080R827M6910
12470C822082O4370N7766O1182L7900M5901M3619M6410L9659O1691P8573L6696
12459D395849J3015J9420K8946P3870P1573M3815N6112O8974M0237O0560Q4259
12448D956630M2073P6366N3133O2217P7677P4177N0744O5373N8331M8591L9434
12437E604746O0102R3541J12971R2446Q6929O5924M5494O7140Q5379R8344J15533
12426F528549Q2094N9477Q3691J24216R8261Q9885J15049J02603R3967J12788
12416G490580J31815J27635R5378J20732J05471R6917J61946J58985J29230J21571
$$ y = [3011960, 3048773, 3090426, 3132629, 3145899, 3158751, 3198071, 3250381, 3301382, 3338906, 3369213, 3403649, 3446183, 3486492, 3503237, 3550955, 3615437, 3669255, 3707377, 3741265, 3765345, 3775172, 3822082, 3886452, 3944218, 4005400, 4043300, 4089201, 4132820, 4179230, 4218889, 4280580, 4359153, 4395849, 4408864, 4428284, 4457230, 4531100, 4602673, 4646488, 4702600, 4771574, 4811811, 4872371, 4956630, 4998703, 5075069, 5128202, 5190419, 5268096, 5342273, 5393017, 5458390, 5516721, 5565312, 5604746, 5664848, 5758389, 5871360, 5963806, 6050735, 6116659, 6162153, 6229293, 6314672, 6413016, 6528549, 6610643, 6670120, 6753811, 6878027, 6976288, 7066173, 7181222, 7283825, 7377792, 7490580, 7622395, 7750030, 7845408, 7966140, 8071611, 8168528, 8330474, 8489459, 8618689, 8740260]
12406H740260J57160J36080J51116J59885J56191J78383J52098J28876J66152
12397A0126201J59220J57919K24986J97299J83283J95243K22705K02621J81307
12388A1850784K37104K43485K33334K51023K24314K25246K55717K91158K81507
12379A4093672K84465K90499L23761L14327L37419K98426L14234L64776L64824
12370A6986403L64644L43578L76010L99565L97012M02920M21449M48597M34492
12361B0574670M72772N31227N12378N24294N25688N44554N61828N79552N78739
12352B5405702O01907O42757O66028P02251P27931P34769P27210P66549Q05881
12343C1780985Q26489Q58121Q42413Q88839R08977R35283R88342R91892J044334
$$ y = [8740260, 8897420, 9033500, 9184616, 9344501, 9500692, 9679075, 9831173, 9960049, 10126201, 10285421, 10443340, 10668326, 10865625, 11048908, 11244151, 11466856, 11669477, 11850784, 12087888, 12331373, 12564707, 12815730, 13040044, 13265290, 13521007, 13812165, 14093672, 14378137, 14668636, 14992397, 15306724, 15644143, 15942569, 16256803, 16621579, 16986403, 17351047, 17694625, 18070635, 18470200, 18867212, 19270132, 19691581, 20140178, 20574670, 21047442, 21578669, 22091047, 22615341, 23141029, 23685583, 24247411, 24826963, 25405702, 26007609, 26650366, 27316394, 28018645, 28746576, 29481345, 30208555, 30975104, 31780985, 32607474, 33465595, 34308008, 35196847, 36105824, 37041107, 38029449, 39021341, 40065675]
12334D0065675J053078J084742J129991J156733J171395J186170J232676J235285
12326D9315745J251068J272562J301341J346477J374731J353185J355036J370087
12318E9940232J392887J369444J336497J349346J361148J303621J280739J287654
12310G0621568J228354J188437J147339J112979J032639R29400Q40974P70957
12302G8872647P06047O14211N33653M69470L47853K47997J56715M1542j05559
12293H1884576j84206k35995l24926m29285n40902o05212o53082p57023q17262
12284G7336683q52933r25964r79035j024097j058249j114403j129530j144925
12276F9107547j138430j172511j184424j179729j180753j178302j142274j116383
$$ y = [40065675, 41118753, 42203495, 43333486, 44490219, 45661614, 46847784, 48080460, 49315745, 50566813, 51839375, 53140716, 54487193, 55861924, 57215109, 58570145, 59940232, 61333119, 62702563, 64039060, 65388406, 66749554, 68053175, 69333914, 70621568, 71849922, 73038359, 74185698, 75298677, 76331316, 77260716, 78101690, 78872647, 79578694, 80192905, 80726558, 81196028, 81543881, 81791878, 81948593, 81990135, 81884576, 81700370, 81464375, 81139449, 80710164, 80169262, 79564050, 78910968, 78153945, 77336683, 76483750, 75557786, 74578751, 73554654, 72496405, 71382002, 70252472, 69107547, 67969117, 66796606, 65612182, 64432453, 63251700, 62073398, 60931124, 59814741]
12268E9814741j152058j214140j209930j214431j245080j241984j190880j164329
12260E0181909j142741j093905j050324j039918j045282j023141r91298r67447
12252D1827853r59478r45718r08495q82321q44615q13745p91792p87349p70573
12243C4123767p53177p39175p38310p00620o66494o64487o23478n81277n47725
12234B8109024n38946n04434m63024m06793l34672l02506l08848l45064l72492
12225B4532245m38806n42989o08346o53017o56994n76795n55081n28459m61867
12216A9509891m33910l86181l67187l44311l37446l27324l36100l28260l15922
12207A6333250k88646k94026k87329l00761k90749k98882k90834k62058k36968
$$ y = [59814741, 58662683, 57448543, 56238613, 55024182, 53779102, 52537118, 51346238, 50181909, 49039168, 47945263, 46894939, 45855021, 44809739, 43786598, 42795300, 41827853, 40868375, 39922657, 39014162, 38131841, 37287226, 36473481, 35681689, 34894340, 34123767, 33370590, 32631415, 31893105, 31192485, 30525991, 29861504, 29238026, 28656749, 28109024, 27570078, 27065644, 26602620, 26195827, 25861155, 25558649, 25249801, 24904737, 24532245, 24093439, 23550450, 22942104, 22289087, 21632093, 21055298, 20500217, 19971758, 19509891, 19075981, 18689800, 18322613, 17978302, 17640856, 17313532, 16977432, 16649172, 16333250, 16044604, 15750578, 15463249, 15162488, 14871739, 14572857, 14282023, 14019965, 13782997]
12198A3782997k42061k40714k02139k14499k21205k14604j85721j65497j51024
12189A1945533j51928j31005j36859j36013j32281j41647j96576k10819j94423
12180A0513982k40398k66647k50384j89898j64120j89595j88770j27826j39104
12171H757240j45499j41801j18218j21372j25235j36416j17464j02682j09905
12162G638648q9349r9983j05166j02255j11642j05456r3993q5284o8984q2335
12152F694201j00427r3427r8203q3246r6629o9554p0280p4398r0002q1506n0680
12141E785849n2162n5429o2751r2103o9548l8484o6835o0520k5085m6339m4550
12130E172043n9373o7511n1286l0636l6471m1996l5962m6538k7010q3509o7201
$$ y = [13782997, 13540936, 13300222, 13098083, 12883584, 12662379, 12447775, 12262054, 12096557, 11945533, 11793605, 11662600, 11525741, 11389728, 11257447, 11115800, 10919224, 10708405, 10513982, 10273584, 10006937, 9756553, 9566655, 9402535, 9212940, 9024170, 8896344, 8757240, 8611741, 8469940, 8351722, 8230350, 8105115, 7968699, 7851235, 7748553, 7638648, 7549299, 7449316, 7344150, 7241895, 7130253, 7024797, 6930804, 6845520, 6776536, 6694201, 6593774, 6500347, 6402144, 6318898, 6222269, 6152715, 6082435, 6008037, 5918035, 5836529, 5785849, 5733687, 5678258, 5615507, 5523404, 5453856, 5415372, 5348537, 5288017, 5262932, 5216593, 5172043, 5112670, 5045159, 4993873, 4963237, 4926766, 4884770, 4848808, 4802270, 4775260, 4691751, 4624550]
12119D624550m1223p362m3882n4347l7477k8954m8945L77j9413l9409l7511n1433
12107D214971n7440m1532l1946J2863J1255j6340r808K1515l951k1961l4729l5592
12095D007305p5396l5778j9413l2262n676m480k1453k3399j3247j5000k7224l0184
12083C703793k1244n5901l7851l2163m7284m0064j193k584k1470m2134l6627j4708
12071C350570k4259m1879k3368J217j2180k2777m1749J5664J1668k0680k5802
12060C166425m667k6637j9118M889K8832R450k441n0615m0244l2587l2068k115
12048B999104k1371j3434j551j4428J0385j0082l4329j7837k3693m6889m1300
12037B784575r844k8885m6282m0776l0116r529m4042m0791k0068j1812k0751l498
$$ y = [4624550, 4583327, 4575965, 4532083, 4477736, 4440259, 4411305, 4362360, 4362737, 4343324, 4303915, 4266404, 4214971, 4157531, 4115999, 4084053, 4096916, 4108171, 4091831, 4082023, 4103538, 4099587, 4077626, 4042897, 4007305, 3931909, 3896131, 3876718, 3844456, 3838780, 3834300, 3812847, 3789448, 3776201, 3761201, 3733977, 3703793, 3682549, 3626648, 3588797, 3556634, 3509350, 3469286, 3468093, 3465509, 3444039, 3401905, 3365278, 3350570, 3326311, 3284432, 3261064, 3262281, 3250101, 3227324, 3185575, 3201239, 3212907, 3192227, 3166425, 3161758, 3135121, 3116003, 3120892, 3149724, 3159174, 3156733, 3106118, 3065874, 3033287, 3001219, 2999104, 2977733, 2964299, 2962748, 2948320, 2958705, 2948623, 2914294, 2896457, 2872764, 2825875, 2784575, 2774731, 2745846, 2699564, 2658788, 2628672, 2619143, 2575101, 2534310, 2514242, 2502430, 2481679, 2478181]
12025B478181L868L08k1515J1279l9435l7492m809k0834l0609Q875K0424l484
12013B364757j9483O631O794p6J9631O150k2850j0712p262k9701R05j02K2305
12000B336987l107k0275j8127n67j4056j450P93N389J9795r069J706k372J7821
11987B313468L4241K1357k5123m3382K860J2754K3763l574J8798L5306K6903k5927
11975B391444N543o94j3116k3034r172O347O6361O0362Q463K5695M7004L9837
11963B605040K0207M4585N6080N7418J6981j1557k5810q115J9587J9026L7643
11952B831085M4114r16K0094P1000L7858M8713N1248J7160k6023k1217l0736p2897
11940B969483o7262l7202q422N561M3942N8420L9502N5706P1316O1564N1913N7035
$$ y = [2478181, 2482049, 2482357, 2460842, 2472121, 2432686, 2395194, 2390385, 2369551, 2338942, 2347817, 2368241, 2364757, 2345274, 2351905, 2358699, 2358623, 2378254, 2384404, 2361554, 2350842, 2343580, 2313879, 2314784, 2314682, 2336987, 2333880, 2313605, 2295478, 2294911, 2280855, 2279405, 2280198, 2285587, 2305382, 2296313, 2298019, 2295647, 2313468, 2347709, 2369066, 2343943, 2300561, 2303421, 2316175, 2339938, 2336364, 2355162, 2390468, 2417371, 2391444, 2396987, 2396293, 2383177, 2360143, 2350971, 2357318, 2423679, 2484041, 2492504, 2518199, 2565203, 2605040, 2625247, 2669832, 2725912, 2783330, 2800311, 2788754, 2762944, 2754829, 2774416, 2793442, 2831085, 2875199, 2874283, 2894377, 2965377, 3003235, 3051948, 3103196, 3120356, 3094333, 3073116, 3042380, 2969483, 2902221, 2865019, 2856597, 2862158, 2906100, 2964520, 3004022, 3059728, 3131044, 3192608, 3244521, 3301556]
11928C301556O8162L9376L3123N7818O0650O5151N7088O6759J14064J19762J14437
11917D097946Q9936O7896M9105O1973J01139J68919K08483K00776K20681K33231
11907E500085K10788K31429J70021J11987N8503n4969j07109j26365r3691l5749
11897E864930R620J5827N6871M5416O6399J09918J97341K25634J99927K25603
11887G017486J75426J36645P9230K015P873k7860j7267k1672j6181K7582L5189
11876G398466Q7284J20126J49011K17850L22597M31770M81101N45039O09047O93118
11866A1055409P23311P39464P13939P06973O93372O52749O69179P62522Q97380
11857A7614298J009728J133120J212400J250772J212871J117224J039454J003585
$$ y = [3301556, 3369718, 3409094, 3442217, 3500035, 3560685, 3625836, 3682924, 3749683, 3863747, 3983509, 4097946, 4187882, 4255778, 4304883, 4366856, 4467995, 4636914, 4845397, 5046173, 5266854, 5500085, 5710873, 5942302, 6112323, 6224310, 6282813, 6227844, 6120735, 5994370, 5900679, 5864930, 5874550, 5890377, 5947248, 5992664, 6059063, 6168981, 6366322, 6591956, 6791883, 7017486, 7192912, 7329557, 7408787, 7410802, 7418675, 7390815, 7373548, 7351876, 7335695, 7363277, 7398466, 7485750, 7605876, 7754887, 7972737, 8295334, 8727104, 9208205, 9753244, 10362291, 11055409, 11778720, 12518184, 13232123, 13939096, 14632468, 15285217, 15954396, 16716918, 17614298, 18624026, 19757146, 20969546, 22220318, 23433189, 24550413, 25589867, 26593452]
11849B6593452J003104J103138J267623J489829J820483K339615L034669L851621
11841D2503534M870722O116177P676013R564680J1702621J3869731J5710114J6615561
11833A28629153J5914134J3004519P638818K83618p363081j2911988j4609603
11826A30585570j2765937r095119n379202k421518k97120J274004K523787L599859
11818A08024324M356879M727555M523229L870522K886802K021347J764602K207306
11810A34382566L054855L995189M719087N155364N113701M478222L248031J905556
11802A66052571J100098J450709L067483N767835R175351J3172670J7606136K2473696
11794B39866549K7657216L2618686L6233558L6607091L1652959J9704210J239034
$$ y = [26593452, 27596556, 28699694, 29967317, 31457146, 33277629, 35617244, 38651913, 42503534, 47374256, 53490433, 61166446, 70731126, 82433747, 96303478, 112013592, 128629153, 144543287, 157547806, 165186624, 165470242, 158107161, 145195173, 130585570, 117819633, 108724514, 103345312, 100923794, 100626674, 101900678, 104424465, 108024324, 112381203, 117108758, 121631987, 125502509, 128389311, 130410658, 132175260, 134382566, 137437421, 141432610, 146151697, 151307061, 156420762, 160898984, 164147015, 166052571, 167152669, 168603378, 171670861, 177438696, 186614047, 199786717, 217392853, 239866549, 267523765, 300142451, 336376009, 372983100, 404636059, 424340269, 425579303]
11787D25579303j9706642l6550754m4166652m2086757l4311313k5401996j7676570
11780B05678619j1693099p212507l826282j398053K3787L51614m67380k084335
11772A79372364l925765n198958n450220m686017l369073k105937j248788r05538
11764A52482068j084026j800143k869321l877856m358229m042515k906609j250171
11756A30293198O14148K502790M354442O251620Q218747J0061517J1330500J1267644
11748A84894606Q765035L228712m812416j3294854j9575690k1940208k0598340
11741A16666845j7263236j3447690j0025013p243930n229809l893963k955207
11734E6607997k334291j953517j677356j438190j273717j166817j088555j121367
$$ y = [425579303, 405872661, 369321907, 325155255, 283068498, 248757185, 223355189, 205678619, 193985520, 186773013, 182946731, 181548678, 181572465, 181924079, 181456699, 179372364, 175446599, 170247641, 164797421, 160111404, 156742331, 154636394, 153387606, 152482068, 151398042, 149597899, 146728578, 142850722, 138492493, 134449978, 131543369, 130293198, 130907346, 133410136, 137764578, 144016198, 152234945, 162296462, 173626962, 184894606, 193659641, 196888353, 192075937, 178781083, 159205393, 137265185, 116666845, 99403609, 85955919, 75930906, 68686976, 63457167, 59563204, 56607997, 54273706, 52320189, 50642833, 49204643, 47930926, 46764109, 45675554, 44554187]
11726D4554187j206424j281522j413778j574213j726572j816650j778774j705355
11718C2050899j615996j444906j392556j335014j327388j318162j312533j307319
11710B0997025j236207j161127j050572r88180q79689p46112o07814n06541m41549
11701A3379234l84932l52829l17717k50975k43509k20935k15508k20083j97864
11692A0974882j95752k64458l36460l40297l78806l34141l11479k43787j50329
11683H419373j55869j21153j15236r9120n6523n0146l7709l1463o6759j20032
11673G565363k10203k72097l23266l57737l71985l49973l23876l00099l25405
11664D730722k64075k15384j48544r2468o0809k7499n2538k0605l1986o7830j06867
$$ y = [44554187, 43347763, 42066241, 40652463, 39078250, 37351678, 35535028, 33756254, 32050899, 30434903, 28989997, 27597441, 26262427, 24935039, 23616877, 22304344, 20997025, 19760818, 18599691, 17549119, 16560939, 15681250, 14935138, 14327324, 13820783, 13379234, 12994302, 12641473, 12323756, 12072781, 11829272, 11608337, 11392829, 11172746, 10974882, 10779130, 10514672, 10178212, 9837915, 9459109, 9124968, 8813489, 8569702, 8419373, 8263504, 8142351, 8027115, 7927995, 7871472, 7821326, 7783617, 7752154, 7685395, 7565363, 7355160, 7083063, 6759797, 6402060, 6030075, 5680102, 5356226, 5056127, 4730722, 4466647, 4251263, 4102719, 4010251, 3949442, 3921943, 3869405, 3848800, 3816814, 3748984, 3642117]
11653C642117j63002j36359j18776r5112q1071r2781q8429q9386q5587m9409n7823
11642B584382o8941o0374n6736k8120l6119o6310o0996r1021o6052q8524o1125
11631A900064k1346p070l083K9156p928m1439r029j0066l6997m1640k6167n0826
11619A673629l4905q169k459K7334j9810q301j9457o830J9719j1778n420K3467
11607A627020m375k4748j4191k8195P00j733r880l5337l9222k2434j7107K0232
11595A450730L382j3366k6841j0619O166j4599q017K2136J8788j470r999R940
11583A426231M540k8215j8158p988k2945k1660q472K3075j888j3491k984k6796
11571A301249j2517j7192r884O143J5311k1134q147q465j7039j7731j8502m162
$$ y = [3642117, 3479115, 3342756, 3223980, 3128868, 3047797, 2955016, 2866587, 2777201, 2691614, 2642205, 2584382, 2515441, 2455067, 2398331, 2370211, 2334092, 2267782, 2206786, 2115765, 2049713, 1961189, 1900064, 1878718, 1871648, 1868565, 1897721, 1889793, 1848354, 1839325, 1829259, 1792262, 1750622, 1724455, 1673629, 1638724, 1630555, 1628096, 1655430, 1635620, 1627319, 1607862, 1601032, 1620751, 1608973, 1603553, 1627020, 1622645, 1597897, 1583706, 1555511, 1556211, 1554478, 1544598, 1509261, 1470039, 1447605, 1430498, 1450730, 1454112, 1440746, 1413905, 1403286, 1409452, 1394853, 1386836, 1408972, 1427760, 1426290, 1416291, 1426231, 1430771, 1402556, 1384398, 1376410, 1353465, 1331805, 1323333, 1346408, 1344520, 1331029, 1328045, 1301249, 1288732, 1271540, 1261656, 1267799, 1283110, 1261976, 1253829, 1245364, 1228325, 1210594, 1192092, 1187930]
11559A187930P03k6484k9692j5985k061J2868o248j4511K422K1729k4559Q489
11547A114601J0110l157Q129J4919L9123p348k3050R52k8149k2451k1492k5085
11535A057102j1294j3955m8426l1587r337k3237k2274n1913l3840n1599m9815
11524G09825j2407j7113l676k2486l562j2437J03Q206L0051L4353K3536L698k2490
11511G15601k3873J6385k7604l021N330l101K1279J2765k580k7688m6847K67J1999
11498F48912M646M714r523j858O976K2964k196l0901m3725P181J9817J5293l0909
11485F11391k6146o459j3566l0865j3811j6635k5366j9742M910L3296K4135K5753
11473E46895L1473M702N926m933j3341J4090J0783j604O889j9574j1612L518k753
$$ y = [1187930, 1188633, 1162149, 1132457, 1116472, 1114411, 1127279, 1121031, 1106520, 1108942, 1130671, 1106112, 1114601, 1124711, 1121554, 1129683, 1144602, 1183725, 1176377, 1153327, 1154279, 1126130, 1103679, 1082187, 1057102, 1045808, 1031853, 983427, 951840, 942503, 919266, 896992, 845079, 811239, 759640, 709825, 697418, 680305, 676629, 654143, 650581, 638144, 638247, 646453, 676504, 710857, 734393, 738091, 715601, 691728, 708113, 680509, 677488, 682818, 679717, 700996, 713761, 711181, 683493, 636646, 636913, 648912, 653558, 658272, 648749, 646891, 653867, 676831, 674635, 643734, 600009, 607190, 627007, 642300, 611391, 585245, 578786, 565220, 534355, 520544, 503909, 478543, 458801, 463711, 497007, 521142, 546895, 578368, 583070, 588996, 584063, 570722, 584812, 595595, 593991, 600880, 581306, 569694, 573212, 570459]
11460E70459n997n996l817M311M3415K981j432l9419l3440J2782L6234q260k2783
11447E49038j6592j121J5547J0392p48K627j2623k3083j6666k6222j9810K6107
11435D86846P274K2338L5461k7736j3752J4048J3627O598k3410k569J409K3046
11423E43180K9033J2250j4562k0145j2402m7320k2659k326K7599L3888p535n883
11411E13118K2871k41J0889J4421K396J3438M4218j5887J3895J2549j3608K3996
11399F42055M5094K4182k993L3700L4820L5401M9958M9540Q8745R1811N6699N7847
11387A206859L4749L400n682l3738n8286n4765m8643k9178k64k0703m5190j7852
11375I30707L9302O348R334J8636K6600J3390L3701K4446L1981O4501N8590L9143
$$ y = [570459, 564462, 558466, 554649, 558960, 602375, 605356, 603924, 564505, 531065, 543847, 580081, 571821, 549038, 532446, 531325, 546872, 557264, 556516, 559143, 546520, 523437, 506771, 480549, 460739, 486846, 494120, 516458, 551919, 524183, 510431, 524479, 538106, 544704, 521294, 518725, 520134, 543180, 572213, 584463, 569901, 549756, 537354, 490034, 467375, 465049, 492648, 526536, 519001, 513118, 535989, 535748, 546637, 561058, 563454, 576892, 621110, 605223, 619118, 631667, 618059, 642055, 687149, 711331, 708338, 742038, 776858, 812259, 862217, 911757, 1000502, 1092313, 1149012, 1206859, 1241608, 1245008, 1239326, 1205588, 1147302, 1092537, 1043894, 1014716, 1014452, 993749, 948559, 930707, 970009, 976357, 985691, 1004327, 1030927, 1044317, 1078018, 1102464, 1134445, 1198946, 1257536, 1296679]
11363A296679K6574l366j5361K261K7684L1559L5149L8134K3046N2419J08025
11352A622803J01699J08906J27546J70043J74823J81155J56776J17733J5908p6565
11342B700827j62058k12418k29208k26755j66937j34792j44652o6000l4463l3394
11332A290150l4573j0071L240n36K96r877O879K8613J4846j320n126j9247p264
11319A256010j0245j5957J1949j888M024r637P822L3772K5780J8063K3856N5639
11307A399188Q3052O7042Q2401Q1378N0199N5972L6722K3634L9601r843l7335
11296A872011j04040j38762j41434j66391j77975j73475j11982l9030n7957k2128
11286G38837r754l9532k9595m6621l560j2493j8098R832j8139k9063j2905k2016
$$ y = [1296679, 1323253, 1319887, 1304526, 1306787, 1334471, 1366030, 1401179, 1439313, 1462359, 1514778, 1622803, 1724502, 1833408, 1960954, 2130997, 2305820, 2486975, 2643751, 2761484, 2777392, 2700827, 2538769, 2326351, 2097143, 1870388, 1703451, 1568659, 1424007, 1358007, 1323544, 1290150, 1255577, 1245506, 1248746, 1248210, 1248506, 1238629, 1245508, 1274121, 1288967, 1287647, 1282521, 1263274, 1256010, 1245765, 1229808, 1241757, 1239869, 1243893, 1234256, 1242078, 1275850, 1301630, 1319693, 1343549, 1399188, 1482240, 1549282, 1631683, 1713061, 1763260, 1819232, 1855954, 1879588, 1919189, 1909346, 1872011, 1767971, 1629209, 1487775, 1321384, 1143409, 969934, 857952, 818922, 760965, 738837, 729083, 689551, 659956, 613335, 609775, 597282, 579184, 589016, 570877, 541814, 528909, 506893]
11274E06893J5351J4920N359l3088k4076m8024l9368R15p333K9581O637l5719
11262C92048j2161L2183o383j4423j8034j3239l520J4931l9260n1647L005K7931
11250C11431j578P66M329k6211o582L2097K6891n800o429j7449k1336j62j358
11237B88609K7018O892l127l937O41l054p053k1636k8402N407K6634q961O917
11224B85948P799J5398j7315N500J6274N575K30K7619K9359L3948L5705L1420
11212D77460L7715O6984R9417J10028J19350J13459J00245K3912m2284k7677l3979
11201A044630j04657j40630j29114r3418o7156m5770m6465l9147j9803j3835j4369
11190C30266j9913R33R205P821m750n779j1936r974J710J4424O545j3678l179
$$ y = [506893, 522244, 537164, 542523, 509435, 485359, 437335, 397967, 398882, 391549, 421130, 427767, 392048, 379887, 412070, 405687, 391264, 373230, 359991, 356471, 371402, 332142, 280495, 283500, 311431, 309853, 310619, 314948, 288737, 282155, 314252, 341143, 335343, 328914, 311465, 290129, 289967, 288609, 315627, 322519, 319392, 315455, 316096, 313042, 305989, 284353, 255951, 261358, 287992, 279031, 285948, 293747, 309145, 291830, 297330, 313604, 319179, 319409, 347028, 376387, 410335, 446040, 477460, 515175, 582159, 681576, 791604, 910954, 1024413, 1124658, 1148570, 1106286, 1078609, 1044630, 939973, 799343, 670229, 576811, 509655, 463885, 417420, 378273, 358470, 344635, 330266, 310353, 311286, 320491, 328312, 323562, 317783, 305847, 295873, 297583, 312007, 318552, 304874, 301695]
11177C01695J7624p28k0048J1315k107k2995l9246j1533M4418J3990k4217k0759
11165B47409o215J5659j2752j2938Q498K1341j1707q143K1949K8348j2990r801
11153B68658N684k975Q994M253j8913j5672J3667l178N160j4059K1675m896j1385
11140B57013j722j9513J2270K5977j3012j1197l2514k4816O203J0583R101L111
11128B21484J3733J2033k7495l8084M844R369p164L820K0891K0182K6052J7186
11116B76851L773j4846l0966k0642n631L246o743J634k0119J4784J765k3477r793
11103A69836J629P235N655N2J2499K5296J204q341j299k4207j6737L448l593J8963
11089A91640N643k3378L787N821j6229j014K1141K6442l092l1927k8157o040n393
$$ y = [301695, 319319, 318591, 298543, 309858, 307751, 284756, 245510, 233977, 278395, 292385, 268168, 247409, 241194, 256853, 244101, 231163, 239661, 261002, 249295, 241152, 263101, 291449, 278459, 268658, 274342, 271367, 280361, 284614, 265701, 250029, 263696, 260518, 265678, 251619, 273294, 268398, 257013, 255291, 235778, 248048, 274025, 261013, 249816, 217302, 192486, 198689, 209272, 218373, 221484, 235217, 247250, 219755, 181671, 186515, 195884, 188720, 192540, 213431, 233613, 259665, 276851, 280624, 265778, 234812, 214170, 208539, 211785, 205042, 206676, 186557, 201341, 203106, 179629, 169836, 171465, 178700, 184355, 184407, 196906, 222202, 223406, 215065, 213766, 189559, 172822, 176270, 172677, 191640, 197283, 173905, 177692, 183513, 167284, 166270, 187411, 213853, 210761, 178834, 150677, 144637, 139244]
11076A39244p964P511j6131p425k1563K5157N0840L2317J37k372k979p886J5546
11063B04432j8942l4333j1056K565K9115J8841J2835j6260j4136O244J646j3795
11051A67156p782j0027L3786K5780k1626j5412q797k570N170r30k3605j8134J5239
11038A38248M911k255P209k6627J0475K257k2841L546K9275Q774M747K5065q099
11025A74685k5569k4122O727o710j0589J1723K9945J2468q421o481l9345n916
11013A08395k7844J1014L2479J6622N070l391k2385j8539k5483K0104L1542O247
11001A33831J3305r336J4101K2076m136k5123j9059j510M355m4261J9177L1533
10989A34953Q152J9645J9084j3113j9860l0610J5938L1340K1068m1L601k3218
$$ y = [139244, 131280, 138791, 122660, 115235, 93672, 118829, 169669, 201986, 202123, 199751, 196772, 188886, 204432, 185490, 151157, 140101, 142666, 171781, 190622, 203457, 187197, 173061, 179305, 180951, 167156, 159374, 149347, 183133, 208913, 187287, 171875, 163078, 160508, 165678, 164748, 141143, 123009, 138248, 143159, 140904, 148113, 121486, 131961, 134218, 111377, 114923, 144198, 152972, 157719, 182784, 174685, 149116, 124994, 131721, 125011, 114422, 126145, 156090, 168558, 160137, 153656, 114311, 108395, 80551, 91565, 124044, 140666, 145736, 142345, 119960, 101421, 75938, 96042, 127584, 133831, 147136, 137800, 151901, 173977, 169841, 144718, 125659, 124149, 128504, 84243, 103420, 134953, 143105, 162750, 181834, 168721, 148861, 118251, 134189, 165529, 186597, 186556, 190157, 166939]
10977A66939m0389j056J6595J3923l233j9307L937J0448K5687M316j6577Q870
10965A70153r852j0981o322K2221j1929L557K0747J1618k3099k2759P484L496
10953A54334j7464K4185k0181j0016j4186r490J1827J1130K3290P795k1737o444
10941A33043L5854K3061j3586j7023l1613k1154K4022K7564R00k8383J5730K6385
10929A74800J7595p341L900j4547j3843j3011j5898K287j9068K1116Q914j1394
10917A33510J455k6500N081K6661q790n155J8169n603N164J690J9112K0310J3601
10904A98705J1708l7620j564J1734J1185l5987k958j5530j8652j5148J4809J0655
10892A31337J0290K2083l816K936j5023q39P295j3330j8855L6J7913M1565R269
$$ y = [166939, 126550, 125494, 142089, 156012, 152779, 133472, 137409, 147857, 173544, 177860, 161283, 170153, 160301, 149320, 142998, 165219, 153290, 156847, 177594, 189212, 166113, 143354, 150838, 154334, 136870, 161055, 140874, 130858, 116672, 107182, 119009, 130139, 153429, 161224, 139487, 133043, 168897, 191958, 178372, 161349, 129736, 108582, 132604, 160168, 161068, 132685, 148415, 174800, 192395, 185054, 188954, 174407, 160564, 147553, 131655, 133942, 114874, 135990, 144904, 133510, 134965, 108465, 113546, 140207, 131417, 126262, 144431, 138828, 143992, 145682, 164794, 185104, 198705, 210413, 172793, 171229, 182963, 194148, 158161, 155203, 139673, 121021, 105873, 120682, 131337, 141627, 163710, 159894, 162830, 147807, 146968, 154263, 140933, 122078, 122114, 140027, 181592, 190861]
10879A90861N840k8351k8480j3261L635J4797K1232K3567j2846k4665m1914k8015
10867H2400k4175N848L1349L3296N068m674k219Q521k0584Q884J9349j3893k4375
10854A04795j6847J9064K3335J2747m775J656q424k4648k7439l485j6926J0330
10842F9383K1841K3800J0204J952N707j932q234J4174K4923l7268r232J6258q071
10829A23505R013L009p897P354m266L306J1599o381q518j3967p490K3990P954
10816A41211j4602k1850J8238J4785O323l339j3370p377j8139m508Q07J3933K0699
10803A32811N239j3818N851J1480j5073J3968k7047q70N42j0088J0009J2588L5529
10790A61121l589O232N860k4712k8092k1553j8500J0661L0312J3102k070K7436
$$ y = [190861, 196701, 168350, 139870, 126609, 130244, 145041, 166273, 189840, 176994, 152329, 110415, 82400, 58225, 64073, 95422, 128718, 133786, 129112, 126893, 135414, 114830, 123714, 143063, 129170, 104795, 87948, 107012, 130347, 143094, 138319, 139975, 131551, 106903, 79464, 75979, 59053, 69383, 91224, 115024, 125228, 127180, 132887, 130955, 122721, 136895, 161818, 124550, 115318, 131576, 123505, 132518, 135527, 127630, 134984, 130718, 134024, 145623, 139242, 130724, 116757, 109267, 133257, 141211, 126609, 104759, 122997, 137782, 144105, 140766, 127396, 120019, 101880, 97372, 98179, 112112, 132811, 138050, 124232, 130083, 141563, 126490, 140458, 113411, 112541, 113083, 102995, 113004, 125592, 161121, 157532, 163764, 169624, 144912, 116820, 95267, 76767, 87428, 117740, 130842, 128772, 156208]
10778A56208K128k3772j8601j3710M182O960K4910K5124k1230l0622k1254j198
10766H9125M0914J5734j6539J1498q162J0059K5472K30J3818j9483j9214O158
10754A49610p453l604L3529L1837r014L399l6842M813O465j4304k9571k4228J4996
10741A19633J6125K1253j6240k8618n430P808P748K4677j09O32k9254j0188K5301
10728A33338L690L9870r197j3048p457j640j4670j0591l1228J1056J9267J6558
10716A35948L089j7779m86K1655q477j0382l341j1567r815j587J8673r869r13
10703A05149K3261Q52J546O141r068k532J6339k861j3660j5473R829K2994k0385
10690A22132j4055L0150J2318j5063L002j1884q128k6655L627L3483J1137N745
$$ y = [156208, 158336, 134564, 115963, 102253, 106435, 113395, 138305, 163429, 142199, 111577, 90323, 89125, 130039, 145773, 129234, 140732, 132570, 142629, 168101, 168331, 182149, 162666, 143452, 149610, 142157, 138553, 172082, 203919, 194905, 198304, 161462, 166275, 172740, 158436, 128865, 104637, 119633, 135758, 157011, 140771, 112153, 106723, 114531, 122279, 146956, 146847, 147479, 118225, 108037, 133338, 137028, 176898, 167701, 154653, 147196, 145556, 130886, 120295, 89067, 100123, 119390, 135948, 139037, 121258, 120772, 142427, 133950, 123568, 120227, 108660, 98845, 97258, 115931, 106062, 105149, 128410, 129262, 130808, 136949, 127881, 125349, 141688, 138827, 125167, 109694, 119523, 142517, 122132, 108077, 138227, 150545, 135482, 138484, 126600, 118472, 91817, 95444, 128927, 140064, 145809]
10678A45809l835l8750k1475K3693K8168N736L113K3702j4790l0361j0825M857
10666A15042N155k6094r581Q090P451m745K9007J4426n253j673J8582M388Q411
10653A63206r436k0146j9576k1885J037n589o859J1822q447j8724l4034j22J9868
10640E1115m213K9535J1079J2981J9774K9213J4781K863j1427Q606j3529k1446
10628A29332K587k5526j8708QL7179K6383J0258J3710M017J3890J076L1075N5277
10615B80558K1009O014N984L456J494J1122m9466k7873r191r499j3765j3824k1996
10602A84023k7557k2338N742q853J6449J6737L6170m989l6380K46j5275o58n163
10589A38154k441Q636J3225N332j0616k1214k3790j3743K5614L0639K458n578
$$ y = [145809, 141974, 103224, 81749, 105442, 133610, 139346, 142459, 166161, 151371, 121010, 110185, 115042, 120197, 94103, 84522, 92612, 100063, 95318, 124325, 138751, 133498, 131825, 150407, 154795, 163206, 153770, 133624, 114048, 92163, 93200, 87611, 80752, 92574, 84127, 65403, 31369, 31247, 51115, 46902, 76437, 87516, 100497, 120271, 149484, 164265, 167128, 155701, 164307, 150778, 129332, 131919, 106393, 87685, 87693, 124872, 151255, 161513, 175223, 179240, 193130, 194206, 225281, 280558, 301567, 307581, 313565, 317021, 318515, 329637, 280171, 252298, 243107, 233608, 219843, 206019, 184023, 156466, 134128, 139870, 131017, 147466, 164203, 200373, 195384, 159004, 159250, 143975, 143317, 138154, 135713, 144349, 157574, 162906, 152290, 131076, 107286, 93543, 119157, 149796, 152254, 146676]
10577A46676M016L137j303j1597k378J1823P630j2160R327K370j1238j7608L938
10564A32633j230j9833k121k3096L91J3335J4296J4302J2936n526j3593P39J897
10551A25130j602j4099K7099L077K6275M613l0962M8o650j6430j4769j5743J4110
10538A00097L446r623j946K8771K5816R094j2673o586k7248R886p863J1088K1922
10525A44181j212J8781K8725K7486j3981p726n895j5012J0698q010l0913j8094
10513A29028P263J9950J1132k9778k2813J1120l180M703R136J3527M153P551Q857
10500A70649j8111p078J7629J5478K884k4169p75R148l909l8760k3282L4451M4222
10487A78377Q669k7501k8923j5386L5059L5553O435k6627J607j7067n0662J3597
$$ y = [146676, 150692, 153829, 152526, 140929, 138551, 150374, 158004, 145844, 155171, 157541, 146303, 128695, 132633, 131403, 111570, 109449, 86353, 86744, 100079, 114375, 128677, 141613, 136087, 122494, 123233, 125130, 123528, 109429, 136528, 139605, 165880, 170493, 139531, 139579, 132929, 116499, 101730, 85987, 100097, 103543, 93920, 91974, 120745, 146561, 155655, 142982, 136396, 109148, 119034, 111171, 122259, 144181, 142969, 161750, 190475, 217961, 203980, 196254, 190359, 175347, 186045, 178035, 147122, 129028, 136291, 156241, 167373, 137595, 114782, 125902, 122722, 127425, 136561, 150088, 154241, 161792, 170649, 152538, 145460, 163089, 178567, 181451, 157282, 156507, 165655, 161746, 122986, 99704, 134155, 178377, 187046, 159545, 130622, 115236, 150295, 185848, 192283, 165656, 167263, 150196, 99534, 113131]
10475A13131N0379j7304k138j5382J8109J7725r576P171O252j9303J4113O774
10463A69951J4144k5431l2228N679O933l277m854N792k6065p732J1861L5563K8593
10450A78929J9701p593k0119l4638l255j2661J0692K6727j2186n495J502L090
10438A44694k4219j2730J0565O467J9745L3342K438j4430J1081R123M881O229
10426A97186r597k6886n304j0325J6049k92j9889j350J6285j6325j1102l539J4397
10413A39308J7960p129J7938K0190R043j5095K024J1411P019r178R557j4099j696
10400A87253m136L791M910O990j5834j0844j4704q248J4617K8J0541K1098M247
10387A99709J1613p038j577j2664k5191p350l918q953O284J7788n532k3112N02
$$ y = [113131, 163510, 146206, 144068, 128686, 146795, 164520, 154944, 162115, 168367, 149064, 163177, 169951, 184095, 158664, 126436, 132115, 139048, 135771, 130917, 136709, 110644, 102912, 114773, 150336, 178929, 198630, 191037, 170918, 136280, 133025, 120364, 131056, 157783, 145597, 140102, 141604, 144694, 120475, 107745, 118310, 124777, 144522, 177864, 180302, 165872, 176953, 186076, 190957, 197186, 187589, 160703, 155399, 145074, 161123, 160831, 140942, 139592, 155877, 139552, 128450, 124911, 139308, 157268, 150139, 168077, 188267, 197310, 182215, 184239, 195650, 202669, 193491, 203048, 188949, 187253, 183117, 186908, 191818, 198808, 182974, 172130, 157426, 149178, 163795, 163823, 174364, 195462, 199709, 211322, 204284, 202707, 190043, 164852, 157502, 153584, 144631, 150915, 168703, 163171, 140059, 140561]
10374A40561K9070Q509J814k3300j4456P749J5821M893l0227j0611n214K5299
10362A49908M8993L1786l5828j1761j4037l7713l264L604M899J5301J4871K030
10350A68789Q359J0050J1669k9351m1057R79J0221O734K1782k1258N053j7327
10338A34643k3126j07N749L041J5246J6380j517J0443J3355n891p540m291J2821
10325A69206K8615r050K863k5923j184K0912R836K285l533K1488Q275k7195l1657
10312A64938k0630J0258k680l854K6237p433j1302k198j3019O283M2583J6565
10300B05748q431m729K617J8753n965o529l101L9101R273j4688l0520n032J9640
10287B16137r40J5728L7141K6932n050r418J4105O354l1735R908K7340l6708K2742
$$ y = [140561, 169631, 178140, 179954, 156654, 142198, 149947, 165768, 170661, 140434, 129823, 124609, 149908, 198901, 230687, 194859, 183098, 169061, 131348, 128084, 131688, 136587, 151888, 166759, 168789, 177148, 187198, 198867, 169516, 128459, 129438, 139659, 146393, 168175, 146917, 151970, 134643, 111517, 111410, 117159, 120200, 135446, 151826, 150309, 160752, 174107, 168216, 160676, 156385, 169206, 197821, 188771, 191634, 165711, 164527, 185439, 195275, 197560, 194027, 215515, 223790, 196595, 164938, 144308, 154566, 151886, 148032, 174269, 166836, 155534, 153336, 140317, 146600, 189183, 205748, 197317, 192588, 195205, 213958, 207993, 201464, 198363, 237464, 246737, 232049, 201529, 196497, 216137, 215197, 230925, 268066, 294998, 289948, 280530, 294635, 300989, 269254, 279162, 306502, 269794, 292536]
10274B92536J6075K1285N308J5575M7126N6694M3201M9117L6243j2259j8442m5122
10262E07337n311r856n0435m7069o827q971p921n2787m5162j4820N552j7111n981
10249B40638K4711m657k2074K799J1957j0397Q016K1609K0459P30r536K8690M7799
10236C60744L0180L3668L4210j289J0024N0254N1856N7092Q2159J30393J37967
10225I77258R4554J01859R4521M9473R083l180m6941p9897r6740j18185j25207
10214H56598j33419j21289p8202l2629k5229l1736l1572p930m672k4985j8535
10203C46400k0402J6163L0662M0963J6395L7424J2557K99J2241K702K4391K0110
10191E39905J3755O6943O2381N0937Q4588J38567J87466J68362J77859J67461
$$ y = [292536, 308611, 329896, 335204, 350779, 397905, 454599, 497800, 546917, 583160, 570901, 552459, 507337, 502026, 492170, 441735, 394666, 387839, 378868, 370947, 318160, 272998, 258178, 263730, 246619, 240638, 265349, 260692, 238618, 241417, 253374, 242977, 250993, 272602, 293061, 293791, 284255, 312945, 360744, 390924, 424592, 458802, 457513, 467537, 517791, 569647, 626739, 708898, 839291, 977258, 1071812, 1173671, 1268192, 1317665, 1326748, 1323568, 1276627, 1196730, 1099990, 981805, 856598, 723179, 601890, 523688, 491059, 465830, 434094, 402522, 394592, 389920, 364935, 346400, 325998, 342161, 372823, 413786, 430181, 467605, 480162, 480461, 492702, 495404, 519795, 539905, 553660, 620603, 682984, 733921, 818509, 957076, 1144542, 1312904, 1490763, 1658224]
10181A658224J69973J46926R4381O0649J4100m3749j04376j60312j82943j92409
10171A460464j92359j77801j38829j12610n0912m9401l1735k5057n4074l558J307
10160F25435k809k8910N288J4079m254R704J3133j7863O828J7494P268K9416L4354
10147G09163J4112J1275R345O1567N4430R7809J43516J61901J54965J08782J16215
10136A643080J34377P3390K1325l8830j13612j95365k27448j89807j42541j06824
10126H57745r7668o7400n775k9123l2864k4822j3600M646J3016J0062j7858j2605
10114E83754J2427j3503J4106J4549l323j2390j1110k0112j7401J2878J3577o896
10102E66556K6666K9094L9790N3455O7818O2092P3569R2152J12884J01827R1498
$$ y = [1658224, 1828197, 1975123, 2069504, 2130153, 2144253, 2100504, 1996128, 1835816, 1652873, 1460464, 1268105, 1090304, 951475, 838865, 787953, 738552, 706817, 681760, 627686, 624128, 625435, 622626, 593716, 599004, 613083, 608829, 618533, 631666, 613803, 620631, 638125, 645393, 674809, 709163, 723275, 734550, 743895, 805462, 859892, 957701, 1101217, 1263118, 1418083, 1526865, 1643080, 1777457, 1850847, 1872172, 1833342, 1719730, 1524365, 1296917, 1107110, 964569, 857745, 760077, 692677, 686902, 657779, 624915, 600093, 586493, 591139, 604155, 614217, 596359, 583754, 596181, 582678, 596784, 611333, 608010, 595620, 584510, 564398, 546997, 559875, 573452, 566556, 593222, 622316, 662106, 715561, 783379, 845471, 919040, 1011192, 1124076, 1225903, 1317401]
10091A317401O7718M0446J7595k5521q4630r4869q6177o2346l9145K9788P396
10080A087656r893k9491j07226r3536j6918P796j2973k2119j6943m0711k0911
10069G24731k8357k8190m677J5144J636j2595p176l575O485K6843K3259L1891
10057G45419o026q65J551J7372J1125l9226n5137l1196J5469K4163J4032J578
10045F98259J915O609J4451n245r280L3523l480K1405L4770k3530j2249j7631
10033G39517Q807L8995J5492K2448K3928o90j7670j1876J3276J9465j4410l4304
10021H02978k0710J2548K0940R889O481r196L363J9282p576k4328j5627k4894
10009G73150j3630k0102k0651k7834o181L3715J3999m761p871j6149M950L5926
$$ y = [1317401, 1385119, 1425565, 1443160, 1417639, 1333009, 1238140, 1151963, 1089617, 1050472, 1080260, 1087656, 1077763, 1048272, 941046, 847510, 830592, 838388, 825415, 803296, 786353, 745642, 724731, 696374, 668184, 663507, 678651, 680287, 667692, 660516, 656941, 663426, 690269, 713528, 745419, 739393, 738528, 740079, 757451, 768576, 729350, 674213, 643017, 658486, 682649, 696681, 698259, 700174, 706783, 721234, 715989, 706709, 740232, 736752, 758157, 792927, 769397, 757148, 739517, 748324, 787319, 802811, 825259, 849187, 848497, 830827, 818951, 832227, 851692, 837282, 802978, 782268, 794816, 815756, 825645, 832126, 822930, 826293, 845575, 837999, 813671, 798044, 773150, 759520, 739418, 718767, 690933, 684752, 718467, 732466, 727705, 719834, 703685, 708635, 744561]
9997G44561L2844K4317j6159k4212k6173j3745Q662l6462k5717M566K5527J4440
9985G12449K5826J8906K8316M584L569J4970o004J9424K6408J3204J7938Q813
9973H88403k1469j1830L4325K8469n793j1423j0971r03J8338M6913J4555J513
9961I70127L9286L8475J6349m8196j1930J9690N6476N5103O4439L6521L3430K4947
9949A294717k5534J121L0836J1914K8022N0332K0204L7071K2662J985L320O7746
9937A544396M8671N5575K4357K6219J5390O658O514l469o6j356M019M9995N2198
9924A829101K5057J3730O9610P6413M4013L9248j7798l5343l7233o1577n5901
9913A889320o062L8846M4075L3560L2463P1324P6788O1081N7837O4319O8130N7183
$$ y = [744561, 777405, 801722, 785563, 761351, 735178, 721433, 730095, 693633, 667916, 672482, 698009, 712449, 738275, 757181, 785497, 790081, 793650, 808620, 802616, 822040, 848448, 861652, 879590, 888403, 866934, 855104, 889429, 917898, 912105, 900682, 889711, 888808, 907146, 954059, 968614, 970127, 1009413, 1047888, 1064237, 1016041, 1004111, 1023801, 1080277, 1135380, 1199819, 1236340, 1269770, 1294717, 1269183, 1270304, 1301140, 1313054, 1341076, 1391408, 1411612, 1448683, 1471345, 1473330, 1476650, 1544396, 1593067, 1648642, 1672999, 1699218, 1714608, 1721266, 1727780, 1724311, 1724245, 1722889, 1726908, 1776903, 1829101, 1854158, 1867888, 1937498, 2013911, 2057924, 2097172, 2079374, 2044031, 2006798, 1945221, 1889320, 1883258, 1922104, 1966179, 1999739, 2032202, 2103526, 2180314, 2241395, 2299232, 2363551, 2431681, 2488864]
9901B488864O8935J18535J24865J17570J57384J97388K19461K12915J37806N7628
9891C901351n6530r0158n1462L1823Q2349J31105J82592K26432K42665K84281
9881D884448L12849K83124K78423K28519K27537K89081K96871K52318K44342K09963
9871G507475K13757J98951Q0043o1392j46298j45632j18041q1739p1914k0872
9861G354338J5181O1256J12374K13751L22037M62319N58766O67232P66900R06028
9851A1440182J079259J242263J306986J291870J094520O93006K18376j75129k85536
9842A7905797l23670m95323o95682q05070p43237n77890l78124k06320r9851j2796
9832A3567834L1868R4922K47832M26642O12765Q09570R96071J159894J336446
$$ y = [2488864, 2557799, 2676334, 2801199, 2918769, 3076153, 3273541, 3493002, 3705917, 3843723, 3901351, 3844821, 3754663, 3703201, 3735024, 3817373, 3948478, 4131070, 4357502, 4600167, 4884448, 5197297, 5480421, 5758844, 5987363, 6214900, 6503981, 6800852, 7053170, 7297512, 7507475, 7721232, 7920183, 8000226, 7938834, 7792536, 7646904, 7528863, 7447124, 7375210, 7354338, 7369519, 7430775, 7543149, 7756900, 8078937, 8541256, 9100022, 9767254, 10534154, 11440182, 12519441, 13761704, 15068690, 16360560, 17455080, 18148086, 18366462, 18191333, 17905797, 17582127, 17086804, 16391122, 15586052, 14842815, 14264925, 13886801, 13680481, 13580630, 13567834, 13599702, 13694624, 13942456, 14369098, 14981863, 15791433, 16787504, 17947398, 19283844]
9823A9283844J470828J634964J858738K141285K512796L036641L759099M675963
9815D0374158N842083P308116R106867J1215624J3511117J5720752J7540237J8334616
9807A38953570J7340407J3909034P675192j411076j2116282j9481721k0139822
9800A24729302j6645960j2115595p587115l467198M7635L109496N805356Q263453
9792A02139374J0396655J2047293J2995537J2947312J1639748R524532P163399
9785A78853850M548741J545710r45562k478702l296537l674462l880866l764033
9777A66908139l158547k089460n28022J666339M682024Q662142J3892239K0338439
9769B10373293K7510386L4711018M0751420M4099600M2284013L3057755J5708434
$$ y = [19283844, 20754672, 22389636, 24248374, 26389659, 28902455, 31939096, 35698195, 40374158, 46216241, 53524357, 62631224, 73846848, 87357965, 103078717, 120618954, 138953570, 156293977, 170203011, 177878203, 176467127, 164350845, 144869124, 124729302, 108083342, 95967747, 88380632, 84913434, 84961069, 88070565, 93875921, 102139374, 112536029, 124583322, 137578859, 150526171, 162165919, 171690451, 178853850, 183402591, 184948301, 184002739, 181524037, 178227500, 174553038, 170672172, 166908139, 163749592, 161660132, 161132110, 162798449, 167480473, 176142615, 190034854, 210373293, 237883679, 272594697, 313346117, 357445717, 399729730, 432787485, 448495919]
9762D48495919q784664l5798182n4031711n6114579m7514340l5509810k4053397
9755A86689236j4766908p751177k685706Q30505L023775M128249M401530M278620
9747A78148124M433697M989278N117521M242828K750209Q80356j472299m170606
9739A94919108o973059j0132563j2991996j4418438j4201097j2417149r377143
9732A14407663n990869k962421k33593K460244N219584P976636J0629222J2765357
9724A44271823J3955926J3400410J0244132M027801n002802j4869796k1196755
9717A44830739k1829565j9110957j5692088j2396880r490042p117180n402006
9710E3792021m158455l311161k761502k397340k096687j846030j681345j513392
$$ y = [448495919, 439711255, 403913073, 349881362, 293766783, 246252443, 210742633, 186689236, 171922328, 164171151, 161485445, 162315950, 165339725, 169467974, 173869504, 178148124, 182581821, 187571099, 192688620, 196931448, 199681657, 200562013, 199089714, 194919108, 187946049, 177813486, 164821490, 150403052, 136201955, 123784806, 114407663, 108416794, 105454373, 105220780, 107681024, 112900608, 120877244, 131506466, 144271823, 158227749, 171628159, 181872291, 185900092, 180897290, 166027494, 144830739, 123001174, 103890217, 88198129, 75801249, 66311207, 59194027, 53792021, 49633566, 46322405, 43560903, 41163563, 39066876, 37220846, 35539501, 34026109]
9702C4026109j304143j148405r79611q79959p93495p31853p11597o65884o20353
9693B6190809n84079n68873n02350m09532l19745j63144J6198J22730R7921k6381
9683B3853554k08488n07668q10645r52352j134253j364476j639250j649087j406490
9674A4180845j088805q56819o62614n55545m75120m38728l64641l09435j94228
9665I234910j11314o7938l1377j1270m820L2036M1542K9410l6087j09814j83387
9654H781891k75151l30401l63220l55942l18708l07040l12084l23672k66659k05914
9644E723100j95339k57562k88151k91510k51667k66090k36005k29698j55488j37045
9634C414545r6967n5643n9304l3847k4679r4556j21885p7243p1669o2211q3767
$$ y = [34026109, 32721966, 31573561, 30593950, 29713991, 28920496, 28188643, 27477046, 26811162, 26190809, 25606730, 25037857, 24535507, 24125975, 23806230, 23643086, 23659284, 23782014, 23879935, 23853554, 23645066, 23137398, 22326753, 21374401, 20240148, 18875672, 17236422, 15587335, 14180845, 13092040, 12235221, 11572607, 11017062, 10541942, 10103214, 9738573, 9429138, 9234910, 9123596, 9055658, 9024281, 9013011, 9008191, 9040227, 9081769, 9111179, 9075092, 8965278, 8781891, 8506740, 8176339, 7813119, 7457177, 7138469, 6831429, 6519345, 6195673, 5929014, 5723100, 5527761, 5270199, 4982048, 4690538, 4438871, 4172781, 3936776, 3707078, 3551590, 3414545, 3317578, 3261935, 3202631, 3168784, 3144105, 3049549, 2927664, 2850421, 2778752, 2716541, 2632774]
9623B632774r2928p0039o1845p0947n6315m7603m5531p6725m5789n5633n9659
9612A949760p1830p8832q6607r0065o4731m4123q637L0977K6007J1370R420K4256
9600A606965K9777P171j3240n0099k2748k4545l1474j8930k2659o088M868K4745
9588A483743j9009m2209j9379J5835K074j42K5196Q429l82N328j7154m328j7275
9575A420727k6517j3215O294P693J4985L4765M853k0766Q841J6658M6396O6539
9563A567253Q5933J25529Q1368M5376L9540n3732j11530j10098j23211o7023n7404
9552A422001m9006j6119k1644j6921l5901k4189n959m141r893j8807N485j1704
9540A213202j1249r401p427j2143J2663n027j0868k0687k1236p544k5033k4174
$$ y = [2632774, 2539846, 2469807, 2407962, 2337015, 2280700, 2233097, 2187566, 2110841, 2065052, 2009419, 1949760, 1877930, 1799098, 1712491, 1622426, 1557695, 1513572, 1504935, 1535912, 1561919, 1573289, 1582709, 1606965, 1636742, 1643913, 1630673, 1580574, 1557826, 1533281, 1501807, 1482877, 1460218, 1454130, 1458998, 1483743, 1464734, 1422525, 1403146, 1418981, 1421055, 1420913, 1446109, 1454538, 1454156, 1459484, 1442330, 1438002, 1420727, 1394210, 1380995, 1387289, 1394982, 1409967, 1444732, 1449585, 1428819, 1437660, 1454318, 1500714, 1567253, 1653186, 1778715, 1860083, 1905459, 1944999, 1891267, 1779737, 1669639, 1546428, 1479405, 1422001, 1372995, 1356876, 1335232, 1318311, 1282410, 1258221, 1252262, 1248121, 1238228, 1219421, 1224906, 1213202, 1201953, 1192552, 1185125, 1172982, 1185645, 1180618, 1169750, 1149063, 1127827, 1120283, 1095250, 1071076]
9528A071076m872N483J3345r941k5213m0606q019o945m2604j1932r069k2577M2796
9515I50922l539l6928q951J5972q332P534j510k2405l3874K979j0208k5749l0405
9502G95506m6596n6318k3410m0066j3743r4k813l1411l36J3537k265K4072K3966
9489F40029N176K19J7529n660n311K3711R156p189l1727j4807K3387N45m2383
9476F12675k8122n003J5239M130q372J5761J1259q84J1931P423J0032j245N304
9463F50128K81J804j6200j7295q820k6109j8454j0544J1798k9588q750p836N543
9450E25958L2605N1581N8897L5534Q785q649K4926M2079p778p965M0152J2769
9438H08894J2204p648n809K4029N2935N1679L5809K0487M2714K5278K807k0231
$$ y = [1071076, 1066204, 1071687, 1085032, 1075091, 1049878, 1009272, 1001253, 994308, 951704, 939772, 930703, 908126, 950922, 947383, 910455, 901504, 917476, 909144, 916678, 915168, 892763, 858889, 861868, 851660, 825911, 795506, 748910, 692592, 669182, 629116, 615373, 615279, 612466, 581055, 580719, 594256, 591991, 616063, 640029, 645205, 645424, 662953, 657293, 651982, 675693, 684849, 677660, 645933, 631126, 654513, 655058, 612675, 584553, 579550, 594789, 598919, 590547, 606308, 617567, 616683, 628614, 636037, 646069, 644824, 650128, 650409, 652213, 636013, 618718, 609898, 583789, 565335, 554791, 566589, 537001, 528251, 520415, 525958, 558563, 610144, 669041, 704575, 713360, 704711, 729637, 771716, 763938, 755973, 796125, 808894, 821098, 813450, 807641, 831670, 884605, 936284, 972093, 992580, 1035294, 1060572, 1063379, 1043148]
9426A043148l8472j7598k8259m3808l7505m0068l5888k8480l3384n276J703p734
9414G28379k6391O692j9718k4085K7960m183L003J0555O990M2407J1005j6010
9402G46604j1920K8509L6449M3684L407K1751M1468N7450Q7841R7255J13397J36365
9390A402260J60443J51245J57676J70347J16030m42j11942j58479j62594j54593
9380A569951j23993j39381j12211o7982p6103o0293m8371l8093l1410p909J4874
9369H79079J2710n078L248k801J266L8l982j281j4903n713J1957J4476K53L4093
9355I23362P0174L4894N1706J04534J17778J24512J11991J75420K04267K19769
9345B138407K18358J48349Q2451K4203k7830j13050j74450j61518k09406k02290
$$ y = [1043148, 1004676, 987078, 958819, 915011, 877506, 837438, 801550, 773070, 739686, 734410, 736113, 728379, 701988, 708680, 688962, 664877, 692837, 688654, 691657, 702212, 709202, 751609, 762614, 746604, 734684, 763193, 799642, 843326, 846733, 868484, 909952, 967402, 1055243, 1152498, 1265895, 1402260, 1562703, 1713948, 1871624, 2041971, 2158001, 2157559, 2045617, 1887138, 1724544, 1569951, 1445958, 1306577, 1194366, 1126384, 1050281, 989988, 941617, 903524, 872114, 864205, 879079, 891789, 886711, 889959, 887158, 888424, 888462, 884480, 883199, 868296, 862583, 874540, 889016, 889269, 923362, 993536, 1028430, 1080136, 1184670, 1302448, 1426960, 1538951, 1714371, 1918638, 2138407, 2356765, 2505114, 2587565, 2611768, 2583938, 2470888, 2296438, 2134920, 1925514, 1723224]
9335A723224j90587j70338j25102n1343m6262k6938m1739m1268l607k7390o068
9324I92582n538J4645L7516j215j1993j8057j0631O159j4765j5175j8033J8468
9312I73963L8716M3890M0759L4961M4430Q4546R0377Q7976Q1965J20528J00219
9301A742330P2616L5857r087k8982o5888j08085j08799q9679r6628j04528j23704
9290A115423j31107p5113k1534k4266m0126R94J944m745q32M069k1286l6694l779
9277G62948J9198M865J2513l8969l1637K8034Q069m2391m4212l2355j2072r653
9265F24338o64k708K9306N9705J721m828M1754N7090J7839j4749k1411l3321l0645
9252G23427k1417j5054k4165m0147l2405k3093Q293j4434l8402j9035P359j1964
$$ y = [1723224, 1532637, 1362299, 1237197, 1185854, 1139592, 1112654, 1070915, 1029647, 1026040, 998650, 992582, 987044, 1001689, 1039205, 1037990, 1025997, 1007940, 997309, 1003468, 988703, 973528, 955495, 973963, 1012679, 1056569, 1097328, 1132289, 1176719, 1261265, 1351642, 1439618, 1521583, 1642111, 1742330, 1814946, 1850803, 1841716, 1812734, 1746846, 1638761, 1529962, 1440283, 1343655, 1239127, 1115423, 984316, 909203, 887669, 863403, 823277, 824271, 826215, 821470, 820638, 824707, 803421, 766727, 762948, 782146, 787011, 799524, 760555, 728918, 756952, 765021, 722630, 678418, 646063, 633991, 624338, 623674, 620966, 650272, 709977, 711698, 706870, 748624, 805714, 823553, 808804, 787393, 754072, 723427, 702010, 686956, 662791, 622644, 590239, 567146, 575439, 561005, 522603, 503568, 510927, 498963]
9240D98963k7J2358M805p126k0839k9077j5782l2246j8043K6769L046n10n27N965
9226D27729j0346r913J6333q622K745o34j6164Q562N186K3994K869r83n804k406
9212D32546L535O568m405k1185k6145o645l888j6777R249J6538J9524J5043j3608
9199D10350J1069K2528J4047L2619J6976J2962j0255O659K8144L3577J2668j540
9187E89804l6560k8408j3013j4085l8798j4049Q724q74P976k0837l771j8585l2502
9174C85022o995J9211J1946j8402k2897O65J8825L5770O795J254j0829K8816L0551
9161D79732K3119L9121j029j9423K5712M0547J8894o081j3424M393L588L3504
9149F28653J8542K9196N9923P4988O9033P1679O3378J02132N3585K3634O1394
$$ y = [498963, 498936, 511294, 516099, 508973, 488134, 459057, 443275, 411029, 392986, 419755, 422801, 422291, 421764, 427729, 417383, 407470, 423803, 415181, 417926, 417292, 401128, 409690, 414876, 438870, 441739, 440756, 434952, 432546, 436081, 442649, 438244, 417059, 390914, 384269, 380381, 363604, 372853, 389391, 408915, 423958, 410350, 421419, 443947, 457994, 490613, 507589, 520551, 510296, 516955, 545099, 578676, 591344, 589804, 553244, 524836, 511823, 497738, 458940, 444891, 453615, 452741, 460717, 439880, 436109, 417524, 385022, 378027, 397238, 409184, 390782, 367885, 368550, 387375, 423145, 429940, 431194, 420365, 449181, 479732, 502851, 541972, 540943, 521520, 547232, 587779, 606673, 600592, 587168, 591561, 595149, 628653, 647195, 676391, 736314, 811302, 880335, 952014, 1015392, 1117524, 1171109, 1194743, 1256137]
9138A256137N0036k9410q6505q3908j22902q9526r5339p6994n0955k0215l9699
9127F10720l7394m0387R928R445J3782n664l0184j7604j6057k3759K772Q184R329
9114D93111Q925m720K97K1217P18L0282L8772K8200J435O206N8511M9402J8784
9101G51140M6012M7962O5539N5708P2917O7075O2601N8892N606j433o2243q1986
9089A087790r6605o8169p6836q5446p7408m4377l2915m1686m2016k3069k2410
9078D76853j1920L969j0973p768j7627j2108m7590k7185j0289L527J4670n490
9066C48069j6635l2875r972K8609J6431r442Q173o082k6368j2177J5416l667l2090
9053B67390L1824K0947j5449l4261r485Q487q141j9082k707r498k0090k2801L2282
$$ y = [1256137, 1306173, 1276763, 1190258, 1106350, 983448, 893922, 798583, 721589, 670634, 650419, 610720, 573326, 532939, 542867, 552312, 566094, 560430, 530246, 512642, 496585, 472826, 475598, 483782, 493111, 502036, 497316, 497613, 518830, 519548, 549830, 588602, 616802, 618237, 624443, 682954, 732356, 751140, 797152, 845114, 910653, 966361, 1039278, 1106353, 1168954, 1227846, 1233452, 1232019, 1169776, 1087790, 991185, 923016, 846180, 760734, 683326, 638949, 606034, 564348, 522332, 499263, 476853, 464933, 468902, 457929, 450161, 432534, 420426, 372836, 345651, 335362, 338889, 353559, 348069, 331434, 298559, 288587, 317196, 333627, 324185, 332358, 326276, 299908, 287731, 303147, 299480, 267390, 299214, 320161, 304712, 270451, 260966, 269453, 261312, 242230, 239523, 230025, 209935, 187134, 219416]
9040B19416J5457j8910l011J4183L1920j801j5493K5522J285m3002l8098J2027
9028A99495n099K0875M4561L530j7731j6535R775J6033j5127k6901k7065K7920
9016B13731J9123j95l8410m011J3036L489j6856J245J4302j3370r824j2893Q491
9003A77858L3567J8695q519j6476L601K2865L164j532k4179l9046K3047K5521
8991B18566Q464j9970O683J8742j7809k8867k7408j5834m981J537Q145J8856R626
8978A75750J090Q828N465o546Q800j6062j4983K5102N666N108K0232p569j9673
8965A91208k1046o96J398q74r298R239K6429j7350l0403j8542L764J5892J4905
8952A64626J5192R205n281L2527l458L828j5096k6565k9433k513R178L0422R930
$$ y = [219416, 234873, 215963, 212952, 227135, 259055, 257254, 241761, 267283, 268568, 225566, 187468, 199495, 194396, 215271, 259832, 263362, 245631, 229096, 238871, 254904, 239777, 212876, 185811, 213731, 232854, 232659, 194249, 190238, 203274, 206763, 189907, 191152, 205454, 192084, 182260, 169367, 177858, 211425, 230120, 221601, 205125, 208726, 231591, 234755, 233223, 209044, 169998, 193045, 218566, 227030, 207060, 213743, 232485, 214676, 185809, 158401, 142567, 137586, 139123, 147268, 166124, 175750, 176840, 185668, 191133, 184587, 193387, 177325, 162342, 187444, 193110, 198218, 218450, 210881, 191208, 170162, 169466, 170864, 169990, 160692, 169931, 196360, 179010, 148607, 130065, 133829, 149721, 164626, 179818, 189023, 183742, 216269, 212811, 216639, 201543, 174978, 145545, 143032, 152210, 182632, 192562]
8939A92562j3003l304q334j0837K4545J5071N116j8735P07R979j6844j4807R389
8926A71505L816r751q547J2755J1799K78j434M690k3626j6206k229j96L494L9128
8912A85476J7474j2899K3500j6357p71L75j1277K83J772j7911p084K61k1551R041
8898A50332J7014n03j7187J4036J6394j745K686J535p709j6838j3931k3893m445
8885A15746N769K0729M1060j4741P566J6453r210o063o65o547k3610k1220M8037
8872A73304J1219k0585M026m9L0124J7936k6378l7019J0211m973j0581j3893l490
8859A29852l803J6491J5829o554j0536J8502O737j138J5878k2434j5275o532M854
8846A41871j1035K6828J4194j8869N402k6742j8925m052J4134m394n04J1924r726
$$ y = [192562, 179559, 176255, 167921, 157084, 181629, 196700, 201816, 183081, 183788, 193767, 176923, 162116, 171505, 175321, 165570, 157023, 169778, 181577, 181855, 180421, 185111, 161485, 145279, 143050, 142854, 146348, 185476, 202950, 190051, 213551, 197194, 196423, 196798, 185521, 185804, 187576, 169665, 162581, 162842, 141291, 150332, 167346, 166843, 149656, 163692, 180086, 178341, 181027, 182562, 174853, 158015, 144084, 120191, 115746, 121515, 142244, 183304, 168563, 176129, 192582, 183372, 177309, 176644, 170097, 146487, 125267, 173304, 184523, 163938, 167964, 167915, 198039, 215975, 189597, 152578, 162789, 157816, 147235, 133342, 129852, 126049, 142540, 158369, 151815, 141279, 159781, 166518, 165380, 181258, 158824, 143549, 137017, 141871, 130836, 157664, 171858, 152989, 158391, 131649, 112724, 108672, 122806, 118412, 117908, 129832, 120106]
8833A20106J4245J7561K1360R698k6766j2173J1072j864L437j4269j0916Q943
8821A40434q800j1220J6885K2879j3219j965N013j1590j7303j5114j2176j0155
8809H3669K3579n89k1500J2231P618j9592j1419n237J6111M3716j6468k3772J8563
8796A06910J9935n941K8081K0692k0898k2392J2216J3057N5381R177R86J086m1107
8783A77183k5308J5375M854j9959n440l170R407Q924p168J2648P283J4366o409
8770A82586k8183K7681l085J5320O196r614m745j1493p374K2833j3731j6229j2770
8757A47392K8475M163j2244l322j2348j0169J0170K5948J3945j2239l4454J4204
8745A59521J3147J0296m944o280l7455r056M1499J9907l433J1739K2833R098j2798
$$ y = [120106, 134351, 151912, 173272, 182970, 156204, 144031, 155103, 153239, 156676, 142407, 131491, 140434, 131634, 120414, 137299, 160178, 146959, 144994, 150007, 138417, 121114, 106000, 93824, 83669, 107248, 106659, 85159, 97390, 105008, 85416, 73997, 68760, 84871, 128587, 112119, 88347, 106910, 126845, 120904, 148985, 169677, 148779, 126387, 138603, 151660, 207041, 216218, 217204, 218290, 177183, 151875, 167250, 172104, 152145, 146705, 143535, 152942, 161866, 154698, 167346, 174629, 188995, 182586, 154403, 182084, 178999, 194319, 200515, 190901, 186156, 174663, 167289, 190122, 176391, 160162, 147392, 175867, 180030, 167786, 164464, 152116, 141947, 152117, 178065, 192010, 179771, 145317, 159521, 172668, 182964, 178020, 171740, 134285, 125229, 166728, 186635, 183202, 194941, 217774, 226872, 214074]
8732B14074m2941l2383J3165K6211q167J5809J6434m189m717j3377J6702k2510
8720A74111k1774J3032k02Q310O264j2146P716L2008k44q227J3141m635j941j1633
8706A93780J7930L378o286L1570J9975J1179O385K0581K2492J8958K956M3561
8694C86459N3423m274l0075m5907l6052k7925m7940n122j4380j3791n693K4391
8682B33114J8974j16l1232m365O029N013K6471Q428k666M921j0156j8377J8985
8669B55023J9570J7434O760J8170j5483M158P406J816J9950K97K8210J8878J1748
8656C93937J4807L8292J8102M3596P4837Q5384O2649K9604L6331J4877r2801j10673
8644F08942r4993o3760n2007m7795o565k3641k8528j1710q829k0214p076J9632
$$ y = [214074, 171133, 138750, 151915, 178126, 169959, 185768, 202202, 198013, 193296, 179919, 196621, 174111, 152337, 165369, 165167, 173477, 179741, 167595, 175311, 207319, 207075, 198848, 211989, 207354, 205413, 193780, 211710, 215088, 208802, 240372, 260347, 271526, 277911, 298492, 320984, 339942, 342898, 386459, 439882, 435608, 405533, 359626, 323574, 295649, 247709, 242587, 228207, 214416, 208723, 233114, 252088, 251972, 220740, 216375, 222404, 227417, 253888, 262316, 259650, 264571, 254415, 236038, 255023, 274593, 292027, 298787, 316957, 301474, 305632, 313038, 314854, 334804, 335101, 363311, 382189, 393937, 408744, 447036, 465138, 508734, 583571, 668955, 731604, 761208, 797539, 812416, 719615, 608942, 513949, 450189, 398182, 350387, 343822, 320181, 291653, 279943, 271114, 250900, 243824, 263456]
8632B63456N805m0971k5304L020M109q448K2290j0408j2137k3042j7360k0257
8620A40753J616L5469J4346k463k0090J2738J0594L0345o153m044J8211J9773
8608B51095L2745j839J0250K3352M1237K8185O999l4354o3267l6487l3407l9473
8596A85036j5617N867K6125N679q654m3677k7494J2739J5636K540j433r815J4870
8583A61802J2317O856j2709j2637j3888j9053p897k746K291L224j8041m052j4941
8570H0526j6140n176J1833p674K697Q379K4253K7381K2457k7465o259P527L274
8557A25613k0313J3788l052j0978j9836j8092K1631K0050Q665j1470k0727o816
8545G8463o184M058L2211k711N47J70P426M513k614L713j390k3365n464J2710
$$ y = [263456, 269261, 228290, 202986, 206006, 210115, 201667, 223957, 213549, 201412, 178370, 161010, 140753, 142369, 177838, 192184, 189721, 169631, 182369, 192963, 223308, 217155, 213111, 231322, 251095, 283840, 282001, 292251, 315603, 356840, 385025, 392024, 357670, 294403, 257916, 224509, 185036, 169419, 175286, 201411, 207090, 198436, 154759, 127265, 140004, 155640, 158180, 156747, 146932, 161802, 174119, 180975, 168266, 155629, 141741, 122688, 114791, 112045, 114336, 117560, 99519, 95467, 80526, 64386, 59210, 71043, 63369, 66066, 74445, 98698, 126079, 148536, 121071, 114812, 122339, 125613, 105300, 119088, 116036, 105058, 85222, 67130, 88761, 108811, 117476, 106006, 85279, 78463, 72279, 76337, 108548, 105837, 106384, 106554, 113980, 118493, 115879, 119592, 118202, 94837, 89373, 102083]
8531A02083L3033j4281j0777p801j7604J5886j6860J5950R093k4864j8847K009
8519F7020L958k606k3904J0533K1421J3217M636j0693K4035K4119l1274l3573
8507F6889Q826Q551j1486k0450J3795L8986J0114p781j1488J1983K3066o495q866
8494A15644J112m627j6818k201j1431K3229K2149l429r355m188l1957J7397n106
8481I0419j087j5262O021R528J9507k5419j9018L136J2728j1443J6165K9131O711
8468A21117K740l876r339P078o830N848l275j2838k0285K7729K7671J061j1522
8455A25279J893r80k0450j8880k068L4471O527q757m07j8302m153m637R018K862
8441A01416j7539K1709L8861r984j0155m940M49l610P159j6393l1190R949J2984
$$ y = [102083, 135116, 120835, 110058, 102257, 84653, 100539, 83679, 99629, 108722, 83858, 65011, 67020, 70978, 68372, 44468, 55001, 76422, 89639, 94275, 83582, 107617, 131736, 100462, 66889, 75715, 84266, 72780, 52330, 66125, 105111, 115225, 107444, 95956, 107939, 131005, 124510, 115644, 116756, 112129, 95311, 93110, 81679, 104908, 127057, 123628, 114273, 110085, 78128, 95525, 90419, 89332, 74070, 80091, 89619, 109126, 83707, 64689, 67825, 80553, 69110, 85275, 114406, 121117, 123857, 119981, 110642, 117720, 110890, 116738, 113463, 100625, 80340, 108069, 135740, 136801, 125279, 127172, 126192, 105742, 86862, 84794, 119265, 125792, 117035, 116628, 98326, 94173, 89536, 98554, 101416, 83877, 105586, 144447, 134463, 124308, 119368, 119817, 116207, 123366, 106973, 75783, 85732, 98716]
8428I8716k6187j4365J819J7196K0981k9828l2971K750J0716O686k2837j005K1516
8415E3187L0695j2277k5985j4258j0368J4861J9385J3294L440R375O266k3351
8403F4264j1526J7440k0613j2658J4708M448l2099q551J5543J5315r206K3136
8391F0201J8913l1527k780K3272l132j8188L949J4647j972K4161j963j7482j5695
8378E2404K187q688k891J7604K2321j1472l6475j7340O17J0363L547J1653J9561
8365F3391j044R452l778K592j9312q042j005o989n487L6890L4592N965l0362K691
8351G9554Q752P417k2271k3050r195J0537M0562L5042p160m7270q488j6132m1584
8338F714J0882L1579q850J817N761O319m236K8364j183l844P817k0738l0825J231
$$ y = [98716, 72529, 58164, 59983, 77179, 98160, 68332, 35361, 38111, 48827, 55513, 32676, 31671, 53187, 83882, 71605, 45620, 31362, 20994, 35855, 55240, 68534, 71974, 81349, 87615, 64264, 52738, 70178, 49565, 36907, 51615, 56063, 23964, 15413, 30956, 46271, 37065, 60201, 79114, 47587, 44807, 68079, 64947, 46759, 50708, 65355, 63383, 87544, 85581, 68099, 52404, 54591, 45903, 43012, 60616, 82937, 71465, 34990, 17650, 18267, 28630, 32177, 43830, 63391, 62347, 71799, 68021, 70613, 51301, 43259, 42254, 35265, 29778, 66668, 101260, 107225, 76863, 79554, 88306, 95723, 73452, 50402, 41207, 51744, 92306, 127348, 120188, 72918, 64430, 48298, 6714, 17596, 49175, 40325, 42142, 47903, 54222, 49986, 78350, 77167, 73323, 81140, 60402, 29577, 30808]
8324C0808R055k45L3490n216j3024J2872J7006J4015J2353J931J170j0487R566
8311A13294r484m2498P033L3739M7211o754m4201l1974j7819K177l684R314m832
8298E1522j1683N832J2621k5921k2457K937K1210K2484n971J3562J5398l4794
8286D4740j861J8370O503J8608K2257j4274l2019k0246k4073k2192L5114K1756
8274E2683j6732L888M585m1374o959Q325K6588J4189q832m788o520J700Q983J3784
8260D9520L2428m148K840L617m862j3642j4177j5496K4958J5050k338K0928J1214
8247A05892N699j7738n1200k6024j0333K4316J3419K454M233L286R797K0106M207
8234H8114q09k4246j3229J2123l8662k5526R418J7442O14K573o20o029J6027k635
$$ y = [30808, 39863, 39618, 73108, 67892, 54868, 67740, 84746, 98761, 111114, 113045, 114215, 103728, 113294, 103810, 61312, 68345, 102084, 149295, 142541, 98340, 66366, 48547, 50724, 47040, 56354, 51522, 39839, 45671, 58292, 32371, 9914, 12851, 34061, 56545, 50574, 64136, 79534, 44740, 42879, 61249, 67752, 86360, 108617, 94343, 62324, 42078, 18005, -4187, 30927, 52683, 35951, 39839, 44424, 3050, -3909, 4416, 31004, 45193, 36361, 31573, 25053, 26753, 35736, 49520, 81948, 77800, 80640, 84257, 79395, 65753, 51576, 36080, 61038, 76088, 73750, 94678, 105892, 111591, 93853, 42653, 16629, 6296, 30612, 44031, 46485, 50718, 54004, 63801, 83907, 88114, 87305, 63059, 49830, 61953, 23291, -2235, 7183, 24625, 25239, 27812, 27192, 21163, 37190, 34555]
8220C4555P020o12k081K3006J113l648j960Q516J1795N896j5199q462K0522l103
8206G7358J9095r125k7320j5883l609N119K3385K1884l170K6081J0779j335k8223
8193I5036j2890P992Q146r693J7393J2425O298k5460n1701q256K1969J6471M765
8180H2495l974l983k909K2918K8990j1046l2105k382j9419n780n012j3809M010
8167C7994M835L1384J0242J7489J5507J0493q007j5179k5762p450J5412k8768
8155E8190K126K2509J1790k0160J652O389L323N837q706p679J2731J7949k0333
8142H5618J3379M335j0694O113J2142o839j184K08j5274m716J6976L517r646j1684
8128H2251r611l921j5651M027J3189L0962Q849N589j9530J2348M903K7452j6297
$$ y = [34555, 41575, 40963, 38882, 61888, 63001, 59353, 57393, 65909, 77704, 83600, 68401, 59939, 80461, 77358, 96453, 87328, 60008, 44125, 40516, 45635, 69020, 90904, 87734, 113815, 124594, 123259, 95036, 82146, 90138, 98284, 88591, 105984, 118409, 124707, 99247, 47546, 39290, 61259, 77730, 82495, 78521, 74538, 71629, 94547, 123537, 112491, 80386, 78004, 58585, 52805, 47793, 33984, 37994, 42829, 74213, 84455, 101944, 117451, 127944, 119937, 104758, 78996, 71546, 86958, 58190, 60316, 82825, 94615, 74455, 76107, 82496, 85819, 91656, 82950, 75271, 88002, 105951, 85618, 98997, 103332, 92638, 98751, 110893, 104054, 102870, 103078, 87804, 83088, 100064, 103581, 93935, 82251, 72640, 68719, 53068, 57095, 70284, 101246, 110095, 115684, 96154, 108502, 113405, 140857, 124560]
8115A24560k6189Q588M7303j5126Q443O281k0697l0758J2849J0443o298J742O589
8102A27730K2656L2141j539l3896n409J3802k335q863L416j6365l8795k0902P217
8089G8858J8809j922J4854J7883j3780j575m636O179K7391J3014K5176K2555j2684
8076A90122k4447o781j0552m083K1665j587r591K0318o663R845j7221k3058Q469
8063A46436P071N938j1308j4283j702l90N653J2483Q265J8620j2820J0141K6850
8050B00954o070k4022r602j8610l1933j6443K1695N987L6844N0007J0046l3516
8038A85337l4981J410J2586K2570K8522r470j1581J0828r37J898K123j679j2741
8025A93885j5798j6746p107K296l561J6364J6298J4077j3829j1578K2642k796
$$ y = [124560, 98371, 106959, 154262, 139136, 147579, 153860, 133163, 102405, 115254, 125697, 119399, 121141, 127730, 150386, 182527, 180988, 147092, 141683, 155485, 153150, 144287, 147703, 131338, 92543, 71641, 78858, 97667, 95745, 110599, 128482, 114702, 113127, 108491, 114670, 142061, 155075, 180251, 202806, 190122, 165675, 158894, 148342, 144259, 165924, 164337, 154746, 175064, 168401, 178246, 161025, 137967, 146436, 153507, 159445, 148137, 133854, 132152, 131762, 137415, 149898, 158163, 176783, 163963, 174104, 200954, 194884, 170862, 161260, 142650, 110717, 94274, 115969, 121956, 158800, 208807, 218853, 185337, 150356, 151766, 164352, 186922, 215444, 205974, 194393, 205221, 204284, 206182, 208305, 206626, 193885, 178087, 161341, 154234, 156530, 152969, 169333, 185631, 199708, 185879, 174301, 196943, 194147]
8013A94147j1325l28l5791m1876p483J9960J3527l579m115K262l01J328K1135
8000A47561j5845k4816J1328L9605M522J7656Q484q242m5986j6377l641j3772
7988A00477J1339q98p486K3637J0422j2324o080N182P941K4732Q7l5481m3287
7975G8261J4011J1475R313n111l22j1843j2909j0056R036j1003k002j642J7833
7962H5041L2353k507O438j3804k7219k5955Q592M090N733J6753m252j8617o62
7949F5984J1790O742j5897M173J0549K3670p431n986k1261k6291K155K4871J2170
7936H5238O248j4211j1928R915j2007P55o598j4939J5471j2150j106j0956k50
7923C3482J7679j3385k2849J6087L3920M84j9370k2099J4673K5559O664n987j0666
$$ y = [194147, 182822, 182494, 146703, 104827, 97344, 117304, 130831, 127252, 123137, 125399, 125098, 126426, 147561, 131716, 106900, 118228, 157833, 162355, 180011, 188495, 180253, 134267, 117890, 114249, 100477, 111816, 110918, 103432, 127069, 137491, 125167, 119087, 124269, 132210, 156942, 157029, 121548, 78261, 92272, 103747, 113060, 107949, 107627, 95784, 82875, 72819, 81855, 70852, 68850, 67208, 85041, 117394, 114887, 121325, 107521, 80302, 54347, 62939, 67029, 72762, 89515, 85263, 66646, 65984, 77774, 84516, 68619, 72792, 83341, 107011, 99580, 93594, 72333, 46042, 48197, 73068, 85238, 91486, 77275, 65347, 75262, 63255, 64010, 57412, 42473, 57944, 45794, 44688, 33732, 33482, 51161, 37776, 14927, 31014, 64934, 65418, 46048, 23949, 38622, 64181, 70845, 64858, 54192]
7910E4192M830J7305J5436k0353l7534m034p14p1j6262N095N074K0493J5555l3373
7896B5639j4651o274q265J0430L0930j5731o584L3959o358j1795j2598j0907K3586
7883C1381J8639L651k3077k4550j5227M666j5067N967M102K597J5495J0254M619
7870B3450m318J447J1476o328K9118O125m3636k8223j0788m777J1824J532q039
7857b1137J0505J9364p796j1301k362o385J6514J2338K3382L521q566J9863J8937
7844F6877j344n021J75j1649j2822k4625j310R411j21j375Q758Q376r685k0640
7830E005l2348l175Q150j160l118L435R159R440J1107J5663m46l8277l7122K4709
7816b8978L0773m750m841J8884J3198J5641K608j9708j0130q703j9491N41n078
$$ y = [54192, 59022, 76327, 91763, 71410, 33876, 29842, 29128, 29057, 12795, 17890, 22964, 43457, 59012, 25639, 10988, 4714, -3551, 6879, 37809, 22078, 15494, 49453, 43095, 31300, 18702, 7795, 31381, 50020, 53671, 30594, 6044, -9183, -4517, -19584, -13617, -9515, -6918, 8577, 18831, 23450, 19132, 20579, 32055, 25727, 54845, 60970, 17334, -10889, -21677, -26454, -14630, -13098, -21137, -10632, 8732, 936, -10365, -12727, -19112, -2598, 9740, 33122, 36643, 28077, 47940, 66877, 65533, 60512, 60687, 49038, 36216, 11591, 10281, 19692, 19571, 18196, 26954, 35330, 25645, 5005, -27343, -30518, -22368, -23528, -26646, -23211, -14052, -4612, 6495, 22158, 21712, -16565, -53687, -28978, 1795, -2955, -7796, 11088, 24286, 39927, 42535, 22827, 12697, 3994, -15497, -14956, -20034]
7803b0034L886P20k0850Q981J4009p916N802m750J1381P30L575Q530k5006p093
7789b8035L2049o87j7005k04K1817L3089J0705o410j7928o49J3150L991q532j9210
7775A6141R152P010k7235k5211j6773j2524L4834K6490j2635J4794K2803p410
7763B9436j6439J9979J9806q315n285m901j5826j4841K1202Q359l0323k732l6415
7750c6295j8007j560q590J7469K4013M4953J3859j420L3531J3471N451r35J0353
7737I6293k0263J5054m162j9117q682n813l8456k9717k4603R695J1904O79J4411
7724b777j074M573L8826n806m296J3207k4424R940P224J8427m82k6775j9824l6780
7710c0041J7541L1007M342m8241n76J3159J1299M614J8463k638k222L224M906
$$ y = [-20034, -16148, -15428, -36278, -27297, -13288, -21204, -15402, -20152, -8771, -8041, -4466, 4064, -20942, -28035, 4014, 3327, -13678, -13882, 7935, 41024, 51729, 45319, 27391, 26742, 39892, 43883, 35351, 16141, 25293, 32303, 5068, -20143, -36916, -49440, -14606, 11884, -751, 14043, 36846, 29436, 12997, 32976, 52782, 44467, 39182, 34281, 18455, 3614, 24816, 33175, 2852, 120, -36295, -54302, -55862, -64452, -46983, -22970, 21983, 35842, 34422, 67953, 81424, 86875, 85940, 96293, 76030, 91084, 86922, 67805, 59123, 53310, 14854, -14863, -39466, -29771, -17867, -17188, -2777, -3851, 722, 39548, 33742, 29446, 42653, 18229, 28169, 35393, 53820, 53338, 26563, 6739, -30041, -12500, 18507, 22849, -25392, -25968, -12809, -1510, 3104, 21567, 18929, 16707, 19931, 24837]
7697B4837K362j4666k8124l8561r12K7236K0493j9236k5191o955k6785k4422K1624
7684h8300J6548N8185L051k648k169N534J4896L983q585L0291O057j8693k3124
7671d974n699P154K6117P524N662p771k1971j7657j1739J2639K9844R96j078P58
7657A9805J9413j1308k5492j5878P665J5971j3075j7331j6502j0321J8371K1179
7645g503N078q714k3533O028J9985q405j5417P359Q685J3354J096k1680j2827
7632c6494K737J469J2861n322K7533k152k2233J702J4669K863n079Q82J2724J0583
7618A6743j3818o120J8269Q811j608j2734k1172l4570j8632J2997J3670k3139
7606f1303K8602L0488J2471K274K5243J2183M237j6159k3448l301L898J0616K5994
$$ y = [24837, 27199, 12533, -15591, -54152, -55064, -27828, -7335, -26571, -51762, -58717, -85502, -109924, -88300, -71752, -13567, -10516, -13164, -15333, -9799, 5097, 9080, 495, 30786, 36843, 18150, -4974, -10673, -3519, 22598, 30122, 35784, 28013, 6042, -11615, -23354, -10715, 19129, 20125, 19047, 19805, 39218, 27910, 2418, -13460, -5795, 10176, -2899, -20230, -36732, -47053, -28682, -7503, -2425, -11139, -34672, -28644, -8659, -17064, -32481, -25122, -16437, -3083, -1987, -23667, -36494, -33757, -32288, -19427, -24749, 2784, 632, -21601, -19899, -5230, -2367, -7446, -6564, 6160, 16743, 2925, -3195, 15074, 23885, 22277, 9543, -11629, -46199, -64831, -51834, -38164, -61303, -32701, -2213, 10258, 12532, 37775, 49958, 54195, 38036, 14588, 11287, 15185, 25801, 51795]
7593E1795j0057q654j2182k5254p371p174k666K9634l875q080Q315L969J7896
7580B6296L148m322l672J946Q336j279j2970o342k956R0p987j5533M398p995k8850
7565d7692m630K8017K0378j1311M110J1532R08J1501L688o377l694j4017q419
7552a6006r077k1443j961K6685l358N626M0761J615N669j2337j7717j4059o101
7539b1703Q135J4024M858P436r490k5311j0512J1454J697j6443q079J2515q70
7526c2289j628l561J3250J3983K1933j2412j5568k0810J879L7612j0302k9373
7514c7286L0206J4979k0414q862P110R439K374k7101m619k216l1743j515L3356
7501c6292J9368O621J2641l345J1486K3019l8977k8890j4649k1560M09K5319O401
$$ y = [51795, 41738, 33084, 20902, -4352, -11723, -18897, -21563, 8071, 4196, -3884, 4431, 8400, 26296, 29444, 25122, 21450, 23396, 31732, 30453, 17483, 11141, 8185, 8275, 288, -15245, -10847, -18842, -47692, -52322, -24305, -3927, -15238, -11128, 404, 1312, 12813, 16501, 10124, 6430, -7587, -16006, -25083, -46526, -48487, -21802, -25160, -19534, 21227, 22842, 28511, 16174, -1543, -15602, -21703, -13568, 456, 5314, 12750, 3260, -22051, -32563, -21109, -19412, -35855, -43934, -31419, -32289, -33917, -37478, -24228, -10245, 11688, -724, -16292, -37102, -35223, 2389, -7913, -37286, -7080, 7899, -12515, -21377, -14267, -4828, -2454, -29555, -34174, -36390, -68133, -69648, -36292, -16924, -10303, 2338, -1007, 10479, 33498, -5479, -34369, -49018, -70578, -70169, -44850, -38449]
7488c8449L959j050J5586J1922R762k1100J266L6007o410j4901j4999k1394K2627
7475a7174K6600J2468L295p497J1057j6279l6832K4817O422k9057k7297p788J7696
7462c9569J6280J1123J8997J8964n1814j8239M847J1807M996p830j8313j1379
7450f0130J5985L0415J257j7853k8111j437L6197L1622P943k1224J0645N324j6240
7437e607k4254j6047L7373J7817k3375m3671j4362K6310J5352j4312K1131J3895
7425i750l2494l3265Q861j1250K0603O805J6518k8056j879o298P477J3785m534
7412e3477K5440J2978m411K840L320K5996j6507l5557J3868j1668q142J0558j5469
7399e0231Q849jJ3310l567p242L1337M712j3584lm336J0181o458r984O265J4861
$$ y = [-38449, -34490, -35540, -19954, -8032, 1730, -19370, -18104, 17903, 11493, -3408, -18407, -39801, -17174, 9426, 21894, 25189, 17692, 28749, 12470, -24362, 455, 6877, -22180, -49477, -57265, -39569, -23289, -12166, 6831, 25795, -26019, -44258, -39411, -27604, -22608, -30438, -48751, -60130, -44145, -13730, -12473, -30326, -58437, -59874, -23677, 7945, 15888, -5336, 5309, 10633, -5607, -29861, -45908, -8535, 9282, -14093, -57764, -72126, -45816, -30464, -44776, -23645, -9750, -42244, -75509, -66648, -77898, -57295, -50490, -33972, -62028, -63907, -70205, -62728, -48943, -53477, -28037, -15059, -19470, -16630, -13310, 12686, -3821, -39378, -25510, -37178, -45320, -34762, -50231, -41382, -41383, -28073, -31640, -38882, -7545, -2833, -16417, -16420, -20756, -10575, -17033, -27017, -20752, -5891]
7384e891n793k3162j8039Q574O196j622j9821j5069N179K1021n582j4371J2257
7371e6123m582p299k408N9M0162J9808j774k593k4859J2791J0269L634j0442m318
7357b7675n905n491J237J7775p611J0711K7322o367J7314J2528l303M508l0568
7344D475l1895R647K0017R72j6138J0667j4969j4032k120J3323K6849l714Q696
7331A1778J1937o498Q662L74K300j4423l3226N169M636k9809j6546q849l867N778
7317f2584n823L783N711L01N101m564j779J2315L9317j910l5690p885R11P499
7303d5297K3369k4095l2234j2776L5028K1611O063J6160J1831k924j2575k1301
7291c7140k9031m293J3161M90J4665Q499k9742k0370J2562K2287N245Q776M715
$$ y = [-5891, -11684, -34846, -52885, -44311, -38115, -39737, -59558, -74627, -69448, -48427, -54009, -68380, -56123, -60705, -68004, -70412, -70353, -30191, -10383, -12157, -14750, -39609, -26818, -16549, -12915, -23357, -27675, -33580, -39071, -37834, -20059, -27670, -16959, 10363, 3996, 21310, 33838, 30535, 35043, 4475, -27420, -17773, 2244, 3216, -12922, -2255, -17224, -31256, -33376, -20053, 6796, 3082, 11778, 23715, 17217, 25879, 26253, 28553, 14130, -19096, -13927, -9291, -39100, -55646, -64495, -68362, -62584, -68407, -64624, -58913, -58612, -53511, -58075, -59854, -47539, -8222, -10132, -45822, -53707, -52796, -45297, -21928, -46023, -78257, -91033, -56005, -34394, -28331, -12171, -340, -3264, -15839, -37140, -66171, -70464, -57303, -56813, -42148, -33649, -63391, -83761, -71199, -48912, -43667, -34891, -30176]
7278c0176j0322o837M890K8605J3925j1947r713J4015K9895P103P101n649j9617
7265A1273O451K224J587J0921k1667n2676j2432K1973J5532R433K499j4189L7990
7252A8919L6860k2475o3928j5070o761J3986K6029j0220l6790J5255K2126K088
7240a9981P516q779p239K5793J505L2751j6310j6924N249j2273k5738K864K0244
7227a1322r664k9846J2659L782M402Q944L5767k6214j5094p680o734L3181n044
7214a2863J9277J8737j4919l2999m487J4196J7785K248J1190j4353J0103Q88j7764
7201b961J3090j3720j5246N925J6344O919J6832j185n90j0300k0908j2743o82
7188a9225j4969j8079j1223J9296K3538P608j1251J9547L2296n383l4825j5755
$$ y = [-30176, -40498, -47335, -42445, -13840, 85, -11862, -21575, -7560, 22335, 29438, 36539, 30890, 11273, 17724, 19948, 21535, 32456, 10789, -41887, -54319, -32346, -16814, -7381, -4882, -19071, 18919, 55779, 33304, -30624, -45694, -52455, -38469, -12440, -22660, -59450, -44195, -22069, -19981, -12465, -21244, -28483, -2690, -1185, 31566, 15256, -1668, 3581, -8692, -34430, -31566, -11322, -20986, -50832, -38173, -34391, -29989, -21045, 14722, -11492, -26586, -34266, -41000, -7819, -12863, 6414, 25151, 10232, -22767, -27254, -13058, 4727, 6975, 18165, 3812, 13915, 14803, -2961, 10129, -3591, -18837, -12912, 3432, 10351, 27183, 25998, 25408, 15108, -5800, -18543, -19225, -34194, -52273, -63496, -44200, -20662, -13054, -24305, -4758, 27538, 22155, -12670, -28425]
7176b8425j6728j5701J470N79K6277N681J6717j3833N767J1245l546j2042k9664
7163e2203K146K7483J2024M432r034n584l3104Q599q646k0897k2155L069J525
7150i2345J2168J4442O691J9973n977o6l684q280Q735J414R956j4547r2J7042
7136c4570L1785k1042k4588J5967R879R380j7066l799k7092j1493K1550L1646
7124a9443j3924n255L422L1067j3151r177L3825K6652j0518j5707n676j8334k530
7111a8749J3574K7453j130j6538j6435j3810N108J4831R027M379k5071m0384M632
7098e3113J7563n650M560L929j5859k4663K016P324L854L6818K9880N917k2100
7085i524k4694M358p019o550K3388L610J6222l557J860N912k5424k7409K2120
$$ y = [-28425, -45153, -60854, -59384, -58805, -32528, -26847, -10130, -23963, -18196, -6951, -10497, -22539, -52203, -50057, -22574, -10550, -6118, -15152, -20736, -53840, -45241, -53887, -74784, -96939, -93870, -92345, -80177, -65735, -59044, -39071, -45048, -45114, -48798, -57078, -48343, -46929, -36973, -51520, -51612, -34570, -2785, -23827, -48415, -32448, -22569, -13189, -30255, -34054, -61146, -72639, -51089, -19443, -33367, -38622, -35200, -4133, -17284, -26461, 7364, 34016, 23498, 7791, 2115, -16219, -18749, -5175, 22278, 21148, 4610, -11825, -25635, -20527, -5696, 3331, 7710, -17361, -57745, -53113, -35550, -41200, -36640, -32711, -48570, -73233, -71217, -63893, -60039, -23221, 6659, 12576, -9524, -34218, -29860, -36879, -43429, -20041, -16431, -209, -3766, -1906, 4006, -21418, -48827, -26707]
7072b6707P331k0131J468p72J850M104J6204J6371M519r144K743L178j0010k2889
7058c1885j3102n369m246J8531O189R818J0561J6049L1952k6992k1211q097J3438
7045d364L5153k830q146P63l234r034J2416j1669j6305k8838q700Q463n342K2781
7031a8886K457M519N962L302r357J096q913J0900o859k1208R4p736P904K0487
7017a6238j3271n290j937M978K3973l322n167K0123N040q524K318n884k2415j8059
7003d3675n771K9024N74k9146J3392K90J2829J9326j7335J2034J0617j8176k1899
6990c7916Q398M957R470Q320q38j4386j7217R237j339j0493K8132o151k1929l372
6976d5127k931K2040K2174J4354j1939k820M728j3352k3053M0169J7042j5947
$$ y = [-26707, -19376, -39507, -38039, -38811, -36961, -32857, -16653, -282, 4237, -4907, -2164, 1014, -8996, -31885, -44987, -50356, -54602, -36071, -29882, -20064, -9503, 6546, 38498, 11506, -9705, -17802, -4364, 30789, 27959, 19813, 20576, 17342, 8308, 20724, 9055, -7250, -36088, -44788, -36325, -41667, -18886, -16429, -11910, -5948, -2646, -12003, -10907, -19820, -8920, -15779, -36987, -36893, -44629, -36725, -16238, -29509, -34799, -36736, -31758, -7785, -11107, -16274, 3849, 8889, 365, 2683, -3201, -25616, -43675, -49446, -20422, -19848, -48994, -35602, -35312, -22483, -3157, -20492, -8458, 2159, -16017, -37916, -29518, -24561, -15091, -6771, -7609, -21995, -39212, -29975, -31314, -41807, -13675, -19826, -41755, -45127, -48058, -26018, -3844, 10510, -1429, -4249, 479, -12873, -35926, 4243, 21285, 5338]
6964E338j6493J5362R304r737n619k0938k8197K1266J687L042M827J2062N56Q962
6950A422j4965M715M833J2202j3023l2560l702P35J4571j1547k5803j4748k7514
6937a05384L089K1748J5285K4696j364k4863M653J3755J2423K7717m661K304j0149
6924b0751O730J0769J3145k603J2317M68m792q397N495J1237k0567K0953Q312
6911C2316j2293j6360N899Q56M419r183m394k9549l5344P366J7366r095L4l721
6897e1683o010j8567k1458J3591O416J5607K932J5951K6952Q22j7896k1332N38
6884e4137J9804k1186q131j1112J2232K9425J4187n159k8879L984J0057K3087
6872a5828o122L018j918L135J3087K546j8528o814k3824J959J3409m471N083M0239
$$ y = [5338, -11155, 4207, 13511, 3774, -1845, -22783, -50980, -29714, -28027, -24985, -20158, -8096, -7540, 1422, -13543, -8828, -3995, 8207, -4816, -37376, -41078, -40343, -25772, -37319, -63122, -77870, -105384, -102295, -80547, -65262, -40566, -41930, -66793, -62140, -48385, -35962, -8245, -12906, -10602, -20751, -14021, -3252, 9893, 7290, 19607, 20075, 15283, 6886, 12381, 23618, 3051, 24004, 32316, 20023, 3663, 9562, 10418, 14837, 5654, 1260, -28289, -63633, -56267, -38901, -47996, -47962, -51683, -57693, -76260, -97718, -84127, -77711, -62104, -59172, -43221, -16269, -15447, -33343, -54675, -54137, -34333, -55519, -63650, -74762, -62530, -33105, -18918, -24077, -52956, -48972, -38915, -15828, -21950, -18932, -20850, -17715, -4628, -2082, -20610, -27424, -51248, -49289, -35880, -40351, -35268, 4971]
6858D971j4563k0980k1477k4477K7307J4360N497k6462K8763K2450J3381L178
6846A1948j4912j1782j0020k7780k5027J4398J4443J9862q626j0341K0970K7491
6834F24m001j0495N404j770k629J218l472J8874J5611L689r892j57n611R7M002
6819A1492K19j0737J3471l09q42K7398j4752j5376j990L47M973k1574O717l336
6805d299p924K0307r694p171k0078O218K3552L1303m4104K784J6633J0090K4965
6792D2582n362k563j8075j1789K0280J4243O45J3032j1816n456K342l1536k550
6779C977j342J228J9528o927j2802j3092j7893J917L66Q344J6080j679k5333K845
6765b4783J5733K0450J8748N747K762j1427j3770K3426j4539l9276j6206k869
$$ y = [4971, -9592, -30572, -52049, -76526, -49219, -34859, -29362, -55824, -27061, -4611, 8770, 11948, -2964, -14746, -24766, -52546, -77573, -63175, -48732, -28870, -37496, -47837, -26867, 624, -3377, -13872, -8468, -10238, -12867, -11649, -15121, 3753, 19364, 23053, 13161, 13004, 7393, 7490, 11492, 11711, 974, 14445, 14136, 13294, 40692, 25940, 10564, 8574, 8921, 13894, -7680, -963, -4299, -12223, 8084, -1610, -8781, -28859, -22641, 911, 32214, -11890, -9106, 7527, 17617, 42582, 37220, 34657, 16582, 4793, 25073, 39316, 39961, 52993, 41177, 35721, 38063, 6527, 3977, 2635, 3863, 23391, 16464, 3662, -9430, -27323, -25406, -25040, -16696, -616, -2295, -27628, -24783, -9050, 11400, 30148, 35895, 38657, 27230, 13460, 36886, 22347, -16929, -33135, -36004]
6753c6004J4952k481l415J5081K179O887J9089K0267J3589l02M065j8063j4640
6740B1204j4839R959l503R949K0541l7160k1650L2486p516j907J2895j0772N263
6727A4950J7888k6925m984j777j2992J569n47j256n017J2729J1484m176j2154
6714a1208k4925K8969J1530o831L629J9087k2143l1496K3478L0090j4794n182
6702B04R58n598J020J143J1351j0229k6191j3764J8308K6132j4561k1773Q113
6689b4887P508l034k9055N459M2612J59k1074k0126J4504J0940K5630l199J0659
6676A6096J3171N548j1399k2870j9937J766K0766r137p760L026K5321j7632j4210
6663a7251Q517J9454J4378P602q816k9692k667p49L4865j4957n0262p584J2619
$$ y = [-36004, -21052, -23533, -26948, -11867, -9688, -2801, 16288, 36555, 50144, 49842, 53907, 35844, 21204, 6365, 16324, 12821, 22770, 43311, 6151, -15499, 16987, 9471, 7564, 20459, 9687, 14950, 32838, 5913, 929, -848, -13840, -12271, -12818, -14074, -19091, -6362, 5122, 946, -11208, -36133, -7164, 4366, -2465, 1164, 20251, -1892, -33388, -9910, 20180, 5386, 204, 1162, -4436, -3416, -2273, 9078, -1151, -27342, -41106, -22798, 3334, -11227, -33000, -24887, -17379, -20413, -49468, -44009, -1397, -1238, -22312, -42438, -27934, -16994, 8636, 5437, 16096, 29267, 34815, 23416, 546, -19391, -17625, 3141, -5996, -13756, -10730, 14591, -3041, -17251, -8734, 10720, 25098, 32700, 23884, -5808, -8475, -9224, 25641, 10684, -39578, -47162, -34543]
6650c4543l452j6416K392K066R171J8179Q218j0086L857m65R805M233J190J9646
6636A3795j296l580q033l0290j8164K4307O830j6299M660p686J2960K4684M869
6623F757K893j680j6675m857k2130J3492J1891P74R12L7729l036k5517n76q744
6609h767J1890K6514o301j8041j4828j6234k018J9820J2771M515j737j8405J4281
6596C460J7466k4722R355j0908j4504M7m675J8598K1304K1908O066k7437k9666
6583a3708r503K0048K6723K6577J7773o043l5343k9355k092K32J0382J82r612
6570c739j7078J0427J1886q291j7223q70l276r110M491o243j1321k044o919p175
6556f6485K715M733k765J0096K1904J9556p822k024R457Q888j8846l0500m169
$$ y = [-34543, -37995, -54411, -52019, -49953, -40782, -22603, -14385, -24471, -20614, -21079, -11274, -7041, -5851, 13795, 12499, 8919, 886, -29404, -47568, -23261, -16431, -32730, -28070, -35756, -22796, 1888, 6757, 9650, 7970, -8705, -13562, -35692, -22200, -10309, -9535, -8623, 29106, 26070, 553, -23, -8767, 3123, 29637, 23336, 5295, -9533, -25767, -27785, -7965, 4806, 9321, 7584, -10821, 3460, 20926, -3796, 5559, -5349, -19853, -19806, -24481, -5883, 15421, 37329, 43395, 15958, -13708, -23211, -3163, 23560, 50137, 67910, 61867, 26524, -2831, -4923, -4691, 5691, 5873, -3739, -20817, -10390, 1496, -6795, -24018, -24888, -28164, -37274, -32783, -39026, -50347, -52391, -59310, -66485, -63770, -59037, -61802, -51706, -29802, -10246, -18068, -20092, -10635, -1747, -20593, -51093, -55262]
6543e5262J3411P822J094k5029j5105P239K3686J6019N285l700J6408K0474p046
6530E296j7256j3939P324P732J473j4338r794J941k3433m883K6132N824k243J4722
6516a5442P391j5205J4363J6951L135j2140l4357j194k065j0826M129K3996O600
6503a4664m91n698j6892J4842K8737J2584l4515l1842j7638J0526M1710J2326
6491a015l78j2386K61J5684m692J5756L1404L854k2049k3776n561j614o061k5746
6477c6319K465l645J5016K3099j0710j5036m828J1061J9878j0739k2681j6292
6465d8731K4569j5537j4225j0755K4378M181J3926K6841m827o633k0063o126K3316
6452i686p388k6479m298L2855j2403K24K3089J1692M150l0460k3922p207j302
$$ y = [-55262, -41851, -34029, -32935, -57964, -73069, -65830, -42144, -26125, -20840, -24540, -8132, 12342, 5296, -11960, -25899, -18575, -10843, -9370, -23708, -33502, -31561, -54994, -59877, -33745, -27921, -30164, -15442, -8051, -23256, -8893, 8058, 11193, -947, -35304, -36498, -38563, -49389, -45260, -21264, -14664, -15155, -20853, -37745, -22903, 5834, 18418, -16097, -47939, -65577, -55051, -13341, -1015, -1393, -13779, -13518, 2166, -2526, 13230, 44634, 48488, 26439, 2663, -2898, -4512, -10573, -36319, -33854, -37499, -22483, 616, -10094, -25130, -29958, -18897, 981, -9758, -32439, -48731, -24162, -39699, -53924, -64679, -40301, -36120, -22194, 4647, -180, -6813, -26876, -33002, -9686, -17074, -43553, -47851, -14996, -27399, -27175, -4086, 7606, 11756, -18704, -42626, -49833, -51135]
6439e1135J3980K3966K1192K2575j6676k0158j8186O906O040j1212Q952M351J0034
6426F29J4699o035j9790J2318N774j4928k1201q79K8883K3389L534k5496j926
6413a029o807j8105J4126m789k4445J325J4730M992j786K7692L0899p133p896
6400B1774j7464O230k4887l4432R238O696n801n667J3382J3920J1359J4789O44
6387I781k4166L94K3123r514l593J0323j3291K453l912l20K0981k0304P529p210
6373g726j5691k6276N911K8604j5097o492k6065J7083K9390k328q446J0003J8883
6360A753r490M285Q859J124j3543p264k8163J8803K3178K4584M112j0408k6197
6347h367q851L98L3607Q726n236j1223q101n58k557R772M1j3384Q404k7700M209
$$ y = [-51135, -37155, -13189, 8003, 30578, 13902, -6256, -24442, -17536, -11496, -22708, -13756, -9405, 629, 15328, 9293, -10497, 1821, 7595, -7333, -28534, -29413, -530, 22859, 26393, 897, -1029, -7836, -25941, -11815, -16604, -41049, -39724, -24994, -20002, -21788, 5904, 36803, 29670, 21774, 4310, 10540, -14347, -48779, -39541, -32845, -38646, -44313, -30931, -17011, -5652, 9137, 9781, -14385, -13991, 9132, -382, -3975, 6348, -6943, -4490, -8402, -8722, 12259, -8045, -516, -7726, -23417, -49693, -43782, -15178, -30275, -36767, -62832, -45749, -16359, -18687, -27133, -17130, 1753, -7737, -3452, 5407, 6531, -7012, -14276, -42439, -23636, -458, 24126, 28238, 17830, -8367, -17218, -16820, 16787, 25513, 20277, 9054, 953, 395, -2162, 7610, 7651, -5733, 2671, -25029, -20820]
6332b0820m2968L520J9755o093p209K4310l367N77J2339Q118L2529j4569k5808
6319a9686p979K6571o132J1178O517O228k0621o83L821L715l1969p025R724K9872
6305C531R487j9032k1863p37J3618k4510j1685J9167L0120j363q859J0150N090
6292C114J339j8470o483o144J0804J8772N137n149O311J361l1386j2847m656k3723
6278f2020q82J338L1153M571N187j6594o241O670j2625k5225K2175J1224l496
6265d4765L7550J9437K300N618Q246p097q252k155k696j9605j8889K1139K5883
6252A6714k0960l2295j6452m837j372J1803L5776K5827q70j5375O256K1037M822
6239C0074l728J0024l0642Q774n045j6868J2825k0403R76l619K3776k437j8908
$$ y = [-20820, -63788, -60268, -40513, -46606, -53815, -29505, -32872, -32295, -19956, -11838, 20691, 6122, -19686, -27665, -1094, -7226, 3952, 10469, 16697, -3924, -4607, -786, 2929, -29040, -36065, -26341, 3531, 13018, -6014, -27877, -28614, -14996, -39506, -51191, -32024, -1904, -3267, -12126, -1976, 3114, 4453, -14017, -20500, -26644, -15840, 2932, 8069, 2920, 9231, 10592, -20794, -33641, -38297, -62020, -62902, -61564, -30411, -25840, -20653, -37247, -43488, -36818, -49443, -74668, -52493, -41269, -44765, -7215, 12222, 14522, 20140, 28386, 21289, 13037, 10882, 8186, -11419, -30308, -9169, 16714, -4246, -36541, -52993, -57830, -59202, -47399, -11623, 14204, 13334, -2041, 4215, 25252, 30074, 26346, 36370, 5728, 14502, 9457, -7411, 5414, -14989, -14013, -17632, 6144, 3707, -15201]
6226a5201j747j2938J7069Q295j7742j184K71K2362K2769p228r465l0848k8939
6213e4526l401M4330Q664l412k6522k2800L174K848j929p664K1721K7057Q084
6200d376j3966j8079K471j039N582o948K287K674J0967J7377J4908R366L04p714
6186A3814j8194j3018J4004o179j5042q822J2981J7498p841l4251j4083Q893J3360
6173c6880N781K67K965q556L927P091K719J9515j3491k5702j4988J1749J0329
6160c5274q05K6530L1161j147j5435l2504o407J4090J0960q789n21O68k4543K656
6146c9360K5590L9462P050k8289j8746n475J0954n932l41K2810Q196r396R08J438
6132H869r63K3779j8228J0878j2337k37j5087j1493o562k2392q131J4871J3065
$$ y = [-15201, -16948, -29886, -12817, -4522, -22264, -23448, -23177, -815, 21954, 14726, 5261, -25587, -54526, -57927, -13597, -4933, -8345, -34867, -57667, -54493, -51645, -53574, -61238, -39517, -12460, -4376, -18342, -36421, -33950, -34989, -29407, -36355, -34068, -31394, -20427, -3050, 11858, 21224, 21528, 13814, -4380, -17398, -3394, -9573, -24615, -33437, -20456, -2958, -10799, -45050, -59133, -50240, -36880, -31099, -30832, -27867, -36423, -32496, -25405, -22686, -3171, -16662, -42364, -57352, -45603, -35274, -36079, -9549, 21612, 20465, 5030, -27474, -33881, -19791, -8831, -17620, -18141, -17473, -42016, -39360, -13770, 25692, 32742, 4453, -14293, -19768, -8814, -14746, -15087, 7723, 15919, 6523, 7431, 8869, 7906, 31685, 13457, 24335, 11998, 11761, -3326, -14819, -21381, -43773, -51904, -37033, -23968]
6119b3968n662o066N874j384N322J2853J8443J0855L46q60J1281K0431j7705l4603
6105d843j3551M077J8599J3686J0586r45j1745l7125O211J0081l498q811K2640
6092E362J2014j2252j0109r885k723j1535K0603N802n854J0824J4558q497j9784
6079a1476R989J3700K1386j7650p942m496O7J5079j418q56j304k8955k5438k351
6065d1665J0799o046J9951J7937L0580K984J741M65j1829j6911j2793l5258k4036
6052f4081J0489J1070R201Q341N115J7944j7499j5865N338J8266q079J0120j0768
6039b0408Q442R353J1413J890q911k0668k4853k2880L913K0775L6241O669k6741
6026b5765j0184O721K6259R930k8096j498J354j7871K4527J961J3352q948j5001
$$ y = [-23968, -29630, -35696, -29822, -31206, -25884, -13031, 5412, 16267, 16613, 15753, 27034, 47465, 29760, -4843, -18394, -14317, 4282, 17968, 28554, 27609, 15864, -21261, -15050, -4969, -8467, -17278, 5362, 17376, 5124, -4985, -14870, -17593, -29128, -8525, -2723, -8577, 2247, 16805, 8308, -11476, -1487, 12213, 33599, 15949, 8007, 3511, 3578, 18657, 17239, 16383, 15079, -13876, -39314, -41665, -30866, -36912, -16961, 976, 31556, 34540, 36281, 36746, 24917, 8006, -4787, -40045, -64081, -53592, -42522, -33321, -24980, -19865, -1921, -19420, -35285, -29947, -11681, -19760, -9640, -20408, -11966, -2613, 8800, 10690, 1779, -18889, -43742, -66622, -62709, -41934, -5693, 976, -25765, -35949, -29228, -2969, 6961, -21135, -22633, -21279, -39150, -14623, -12662, 690, -8258, -23259]
6013b3259J4874J7927J1156k978k5017k4478r578j570J8979K0753j881k8534P636
6000b5970l7352j1694m476K0077K2391J9771P247k3714p431J2798N100K5557j1995
5987i691j4694J0324j1128k3748q948K732r717K4508L2284L9793J7294l6382l0798
5974a8171k0564J2231J2412K393P541Q987J9303R868j3120j1563j0582J5557P894
5961B2186p403l0430k0903J5060r236j8519J5038J3978M544r593N245Q748m160
5948a5445k4441j1005K5776J6870J2595P782n490q899k5611j626N34j147J8388
5935a1719L8768O81o612K723n759J5645k8118L3113O156j3967k1991k602J6530
5922B2848J2336J3701k2468q885J0552o683J1145m3702k6429L5131K6399n611
$$ y = [-23259, -8385, 9542, 20698, 17720, -7297, -31775, -41353, -42923, -23944, -3191, -5072, -33606, -25970, -63322, -75016, -79492, -59415, -37024, -17253, -10006, -33720, -41151, -28353, -23253, 2304, -9691, -24385, -14061, -25189, -48937, -57885, -55153, -64870, -40362, -8078, 31715, 49009, 12627, -18171, -38735, -26504, -14092, -11699, -4158, 4829, 24132, 34000, 20880, 9317, -1265, 14292, 22186, 14783, -15647, -36550, -21490, -30726, -49245, -34207, -20229, -15685, -25278, -20033, -11285, -15445, -39886, -50891, -25115, -8245, 4350, 12132, 6642, -2257, -27868, -29494, -28960, -30107, -11719, 27049, 27730, 21118, 23841, 18082, 33727, 5609, 38722, 44878, 30911, 8920, 6318, 22848, 35184, 48885, 26417, 17532, 28084, 21401, 32546, -11156, -37585, -2454, 23945, 18334]
5910A8334j7907K244M902k282K4658K234j6825l1859j3226N120K6535M077j6471
5897a0466J521p949R544O91j974j0759j695J3882j8614l5716j84J4773K9974J6368
5883f04j725Q016k2821K021K1783k46k0135l9023J89L7538l680M911m253J9671
5869A642J1853O689J486j87L91m4400O000N274J2351L5135j2975j5610J0599j6932
5855A316l3924j4638L9057R199k3650j3285J1502L4395J1789k9796n805J2554
5843a286j2038K0057Q356k0606J363Q796o072J1119j1249k6585r829J5144K3074
5830B44J3819J8906K787k5623k279J68K4198K193m733n85q130k9715m2339J1996
5816c9093K1146q048J4487K1503k0830j4552J4206r490j5087k5654L759J8385
$$ y = [18334, 427, 2671, 7573, 5291, 29949, 32183, 15358, -16501, -29727, -24607, 1928, 6005, -10466, -8945, -16894, -7350, -6659, -8633, -19392, -21087, -7205, -25819, -61535, -61719, -46946, -16972, -604, -2329, 5687, -17134, -15113, 6670, 6424, -13711, -52734, -52545, -15007, -18687, -13776, -18029, 1642, 13495, 20184, 21670, 21483, 21874, -22526, -16526, -11252, 1099, 36234, 23259, 7649, 18248, 1316, -32608, -47246, -8189, 1010, -22640, -35925, -24423, 9972, 21761, -8035, -13840, -1286, -13324, 6733, 15089, -5517, -4154, 4642, -1430, 9689, -1560, -28145, -37974, -22830, 244, 14063, 32969, 35756, 10133, 7854, 8022, 32220, 34413, 29680, 29095, 20965, -8750, -51089, -39093, -17947, -25995, -11508, 9995, -10835, -25387, -11181, -20671, -35758, -61412, -57653, -39268]
5804c9268J3842J7361j6000k4516L76k366J7225K5394j675J2199n109K4446K8931
5791E0840m28J0887j4974k4085k48p992k3112j8023j6025L703N594j522L107J9719
5777a2559J4043j2464j9649p178Q622p023J9908K8721p737j2378J6991J4106n555
5764A7848k8690k9875j0490j5039Q322J6197J7089L429r699q086j5149L36J3987
5751c9820L2269J9283j332N009o560k33l897j0003L1994J7345j0771o223N96j8772
5737H885N028p698j6353k6378O136K14K204J1341P526J1843k0615m389J3173J3721
5723D638L453J6075L300j9514k7559k4605j0973J7226L2578P461j7693j2173J6170
5710a1616K2388l518J3951k861k275o995n409L098N740L469j8020j8462O944J9877
$$ y = [-39268, -25426, -8065, -24065, -48581, -48205, -50571, -33346, -7952, -9627, 2572, -2537, 21909, 50840, 50412, 61299, 46325, 22240, 21992, 14000, -9112, -27135, -43160, -39457, -33863, -35385, -32278, -12559, 1484, -10980, -30629, -37807, -29185, -36208, -16300, 12421, 4684, -7694, 9297, 23403, 17848, -10842, -40717, -51207, -66246, -57924, -41727, -24638, -21209, -30908, -38994, -54143, -53807, -39820, -7551, 11732, 10400, 15409, 8849, 8616, 4719, -5284, 26710, 44055, 33284, 27061, 27657, 8885, 13913, 6215, -10138, -36516, -30380, -30166, -27962, -16621, -9095, 2748, -17867, -22256, -9083, 4638, 8091, 24166, 27466, 7952, -19607, -44212, -55185, -37959, -5381, 2080, -15613, -27786, -11616, 10772, 7254, 21205, 18344, 16069, 9074, 3665, 6763, 12503, 15972, -2048, -20510, -13566, 6311]
5696F311Q620p085l4373j2605J6100R149l2130K860R985j3086j1337k96M4056
5683a3831O652Q541K3680O985q295j1459J305j9217k4229j7393J4647J7141j1044
5670b6517k767M109J0115L0840Q572j0574p712L854q91M072R69j7697m200j1687
5656a9514L078J3368O49K592m30M772J4793o104n037J2984j6863l0952j1939L200
5642c5403N192J899N844M255k3896J1248K3162J3888J911j8018p245J5873K6206
5629B4916j1463j2084l2562P305K2043J3741j740N143j7924j3906j8591l263j3221
5616e1606L650K6169J3198r337k9496l3980K6129J6745k420J1k3528L709J8341
5603d2415J4327J5768P061p173k3550k8042k4433n830L9121J2830k3373K877K6581
$$ y = [6311, 14931, 7846, -26527, -39132, -23032, -13883, -46013, -43153, -33168, -46254, -57591, -57887, -13831, -7179, 1362, 25042, 32027, 23732, 12273, 13578, -5639, -29868, -47261, -32614, -15473, -26517, -29284, -25175, -15060, 15780, 24352, 13778, 6066, 9920, 9029, 13101, 14070, -3627, -7827, -19514, -16436, -3068, -2419, 173, -257, 4515, 19308, 13204, 8167, 21151, 4288, -26664, -38603, -35403, -30211, -28312, -22468, -18213, -42109, -30861, -7699, 6189, 8100, -9918, -17163, -1290, 24916, 13453, 1369, -31193, -23888, -1845, 11896, 10156, 15299, -2625, -16531, -35122, -38385, -51606, -47956, -21787, -8589, -17926, -47422, -81402, -55273, -38528, -40948, -40937, -64465, -60756, -42415, -28088, -12320, -5259, -12432, -35982, -64024, -88457, -94287, -55166, -42336, -65709, -62832, -36251]
5590c6251L681K773J9156P96J933l03R337Q010m402k416J6706J2410l5038j7398
5576b1006N752K8774K9304L830k6762q548l7233j9462L4132K6916n555n096l437
5563A609p924J5148K6555O939n648O425j1206j3717k0959Q370J7246k3909j0918
5550a1989K0001L8495J1337k7741k957N431j2914j0601l146k528m248J1660k906
5537G894j1871n817J2483J1115n705q141l687K4819M251p668J399j0273P273J0567
5523B6639M942j5285k2852J792P293p168L511k416p937M521p052N79J4104k1479
5509b0808k3231K0950j582L26P588j4026P083l558l8067M276J0684l92j6373L5916
5495c1214R765L445j268J7734q822k4645r467J6443J7861j723L48Q433J4301q578
$$ y = [-36251, -32570, -29797, -10641, -9845, -7912, -8215, 1122, 9132, 4730, 2314, 19020, 31430, -3608, -21006, -15254, 13520, 42824, 46654, 19892, 11344, -25889, -45351, -11219, 15697, 10142, 5046, 1609, -6315, 8833, 35388, 42327, 36679, 43104, 31898, 18181, -2778, 5592, 22838, -1071, -11989, 8012, 46507, 57844, 30103, 27146, 32577, 19663, 9062, 5916, 3388, -860, 10800, 7894, -3977, -9794, 2689, 13804, 8099, -42, -3729, 21090, 25341, 17673, 19072, 8799, 16072, 26639, 31581, 16296, -6556, -4764, 2529, -4639, -1128, -3544, -11481, -6960, -14012, -13433, 671, -20808, -44039, -23089, -24671, -24345, -16757, -30783, -23700, -27258, -65325, -61049, -50365, -50757, -67130, -31214, -21449, -18004, -19272, -1538, -10360, -35005, -44472, -28029, -10168, -11891, -11543, -3110, 11191, 2613]
5481B613p927j6301K0759J1554r982J8737L459o215k4686j0301M181K3366O46
5468I903j279N777M230n858k9818J1252K1973j962j7155k09N738J6677m060j412
5454A3797K779R478k4131p439P326J455j6379K2585K5428n215k0265n254k545
5441A620J6694K1673R046j8872p433p990j1810J6470l675k9885k1851j0204m99
5428d6716O558N915K255L650p843k752q35L3219M9079r436n413r356j6449m6430
5414d4554l012j0237l0316J8745K0344J3314K0428K238K7231P394j4638j6075
5402i138k5087o543J5557j2388p226L0515L3320L256k2146L59j0140l16N894P732
5388C649l167l5646j0554J4849K1793K9256q975k1107l1445m909K4662J4921M289
$$ y = [2613, -5314, -21615, -856, 10698, 716, 19453, 22912, 16697, -7989, -18290, -14109, 9257, 9903, 8624, 14401, 18631, 12773, -17045, -5793, 16180, 14218, -2937, -3146, 2592, 19269, 15209, 13797, 16576, 26054, 1923, -5516, 1810, 3265, -13114, 9471, 34899, 29684, 9419, 4165, 1620, 18314, 39987, 49033, 30161, 22728, 14738, 2928, 19398, 15723, -14162, -36013, -46217, -46716, -40158, -34243, -31988, -28338, -36181, -38933, -39768, -6549, 42530, 33094, 27681, 18325, 1876, -44554, -47566, -57803, -88119, -69374, -49030, -35716, -15288, -13050, 14181, 21575, 6937, -9138, -34225, -40768, -25211, -37599, -44825, -14310, 19010, 22266, 120, 479, -9661, -9977, -4083, 3649, 482, -35164, -45718, -30869, -9076, 20180, 11205, -9902, -41347, -46256, -21594, -6673, -2384]
5375b384j33J5279j791P913M473K0690j1459j3914N57J9897K1007j6220j9763
5362B4152k8693P298L3651K4928M689m422k6392k0817p520n234R630J4355m256
5349B1369l1172l6149k1239r051K7122K1888K9078P481j6381K2091k5634j4270
5337b4867k417K2533J5155L652j6500J279L7835L1443m0348l4063k1941L5055
5325F816K8003j829j8592o474O119J2836k557j5182j9872J6833N171k3754k3681
5312c6163J6610M5800L414k041L648q608j0363K127j5771j4509J020j197q114
5299b4147m166j431k253J2804j7781n284J0554p08m468L641L2405K9727J660l0152
5285D01Q064K4613j6151n687J4938j3454K55O23N46k6143m672j2764J6439K2680
$$ y = [-2384, -2517, 12762, 10971, 18884, 23357, 44047, 32588, 18674, 19231, 39128, 60135, 43915, 24152, -4541, 2757, 36408, 61336, 66025, 61603, 35211, 14394, 6874, 1640, 11270, 25625, 21369, -9803, -45952, -67191, -76242, -49120, -27232, 1846, 9327, -7054, 15037, -10597, -24867, -27284, -4751, 10404, 14056, -2444, -1165, 36670, 68113, 27765, -6298, -28239, 6816, 34819, 32990, 14398, 7924, 14043, 26879, 24322, 9140, -10732, 6101, 11272, -12482, -36163, -19553, 26247, 29661, 27620, 31268, 22660, 12297, 14424, -1347, -15856, -14836, -16033, -24147, -28313, -29744, -31997, -19193, -36974, -42258, -31704, -32412, -36880, -33239, -834, 28893, 30553, 401, 8465, 33078, 16927, 11240, 26178, 12724, 12979, 13602, 14148, -11995, -16667, -29431, -12992, 9688]
5271I688o125j4938o281J4031r512k317O156J0387j3631j495l796j9771J4748
5258b2856k336r734J7648o066k3819l396j914K4076L4424N205j0902n035q107
5245a2812p642J7042M676L966L294j7640p277J5346R80j9935j2478J4455J8398
5232C73k101p814j549Q144Q677R223P084l5419o092Q840R835m274j3048q634L873
5217b2882J2918j6760J452K6727J0350m8892j0021J8649K0188N650K789J900J1067
5204A3135k3501K3078n241j5282J2161J1355J4667J4505l3187j1488j3435k0994
5192c4227J7965q240k1906L832o488J59J2461N084m093K4409j9492j8258J7344
5179c1450J3829k2761k199n963J0908k0796l3700P795N0664J7984j1557j1209
$$ y = [9688, 3563, -11375, -17656, -3625, -13137, -15454, -9298, 1089, -12542, -14037, -17833, -37604, -22856, -25192, -34926, -17278, -23344, -47163, -50559, -52473, -28397, 6027, 11232, 330, -4705, -12812, -20454, -3412, 1264, 5230, 8524, -9116, -16393, -1047, -67, -20002, -32480, -18025, 373, -1728, -9542, -11091, -2947, 5730, 14953, 22037, -13382, -19474, -10634, -799, -5073, -18121, -26755, -22882, -9964, -26724, -25272, 1455, 11805, -37087, -47108, -28459, -8271, -2621, 168, 2068, 13135, -10366, 12712, 7471, -7811, 4350, 15705, 30372, 44877, 11690, 202, -13233, -34227, -16262, -24502, -46408, -42576, -49064, -48905, -36444, -31360, -35453, -11044, -30536, -48794, -31450, -17621, -40382, -42581, -48544, -37636, -58432, -92132, -84337, -33673, -15689, -27246, -38455]
5167c8455K294J4105K4831J7122k7403o728K4509j6854j6259L702R634j0848K1856
5154A506j4440J5820J1403K361K517j5906j7429K8n04r74M6059N055k7113k1391
5140a3008j2590k913J7241m830k3616j0077J4597K1113Q189k3995Q729P40m987
5127b5407j657K2632l655j2978K1596N986j0674J799j0171K503k965m060j8396
5114c5447L4205j1365j2411o285K1813J9720k863n122j0832J1227J0015O237L2618
5101E1510k851j6319M315o938K009k1886l644k6206L403Q728k4194J5016K8695
5088A1638o879l2197m666J2296K7138K4996j2343j6699j6070J8638J9216j6116
5076H952r246Q320K8700Q566l413K1474j6610n4381q381N369J169M115J2698K5578
$$ y = [-38455, -36161, -22056, 2775, 19897, -7506, -14234, 10275, -6579, -22838, -19136, -9502, -20350, 1506, -12934, 2886, 14289, 16650, 19167, 3261, -14168, -14140, -14644, -15618, 30441, 35496, 8383, -13008, -25598, -28511, -11270, -16100, -39716, -49793, -35196, -14083, -5894, -29889, -21160, -20420, -25407, -27064, -4432, -8087, -21065, 531, 6517, -4157, -2358, -12529, -10026, -12991, -17051, -35447, -1242, -12607, -25018, -31303, -9490, 10230, 7367, 2245, -8587, 2640, 12655, 18892, 51510, 48659, 32340, 36655, 29717, 31726, 9840, 6196, -20010, -16607, -7879, -32073, -17057, 11638, 4759, -27438, -32104, -19808, 7330, 32326, 19983, 3284, -12786, 5852, 25068, 8952, -294, 8026, 36726, 45292, 41879, 63353, 46743, -7638, -16019, -10650, -9481, -5366, 7332, 32910]
5062C2910J730J1955l7492p967l6282n653j7665Q332R704J3158K947L3310J0551
5049A9538N389j8667j8307k7859j5690j5798L541K9012M5441J4933l3514l4922
5037d6903m675K8749q640O293R341k6192J2336R129J0649N078J8329k4145Q061
5024b590M199J8727M631k4093K924K0222j3524p679J0427m858K915k2853l506
5011a5058m712p622M603l133J5456K3444p20K0121M896j7314J6785Q518m733j398
4997C9133j1509O916n363j9130J1759R662j3760L62j3960N511L1995j3548l2736
4984d668j8080P76J6k59J5118j8115Q802m865J6445l815k868K2521L033j0050
4970C991k561j0431o139N512k8273j2719L7469J9546M153k3364j354K7831P459
$$ y = [32910, 34640, 46595, 9103, 1136, -35146, -40799, -58464, -50132, -40428, -27270, -24323, 8987, 19538, 24927, 6260, -12047, -39906, -55596, -71394, -67853, -38841, 6600, 21533, -11981, -46903, -51578, -22829, -31469, -25176, -15835, -42027, -29691, -20562, -9913, -4835, 13494, -10651, -2590, 1609, 20336, 24967, 874, 3798, 24020, 10496, 2817, 13244, 8386, 11301, -11552, -15058, -19770, -27392, -22789, -25922, -10466, 12978, 12258, 32379, 37275, 19961, 36746, 45264, 40531, 39133, 27624, 34540, 29177, 10047, 21806, 31468, 17708, 18070, 4110, 9621, 41616, 28068, -4668, -22748, -21972, -21956, -22215, -7097, -25212, -16410, -21275, -4830, -8645, -11513, 11008, 14041, 3991, 1430, -9001, -15140, -9628, -37901, -50620, -13151, 6395, 10548, -12816, -14170, 13661, 21120]
4957B1120j7897j5188k0896r189L1227K3438p584p017K465K7732M442N668o838
4944C1483j638P840J9324j2742j8846K9580K2388l6014j3761j7461j5052R119
4932D220m165J1453r722J7426J5991j1049J413k1761k1265l967J5817K2591J5732
4919C2714m357k3003m361m498q196l3681k9118R83L0876K5491j1805J0471K2046
4906C562N700q369j6063k082O554p112N664J2144j5001j9837j2165J6331L3001
4893B327o371j5926Q367J9348J8880n509n67M624l3212j2714N738J2144j555k5780
4879c0206o6J5736L439l67J156L746J7683K4924m943j4668m4844l4058K1489L4800
4865f179J1593j859L264J1342n759k1311n795J4216L050P922n883n113r713k6026
$$ y = [21120, 3223, -11965, -32861, -42050, -10823, 12615, 5031, -1986, 479, 28211, 32653, 38321, 31483, 29845, 37685, 57009, 44267, 25421, 55001, 77389, 41375, 27614, 10153, -4899, 4220, 55, 11508, 1786, 19212, 35203, 24154, 25567, 3806, -17459, -21426, -5609, 16982, 32714, 28357, 5354, 993, -3505, -11701, -45382, -74500, -73517, -42641, -17150, -28955, -18484, 3562, 9262, 893, -15170, -17252, -10698, -17810, -12146, -2, -15003, -34840, -47005, -30674, 2327, -4044, -19970, -11603, 7745, 26625, 21116, 20549, 25173, -8039, -20753, -15015, -2871, -4426, -30206, -30272, -14536, -11097, -11464, -10308, -6562, 11121, 36045, 31102, 16434, -28410, -62468, -40979, -6179, 5414, 3555, 6819, 18161, 12402, -8909, -14704, -488, 2562, 10484, 4601, -512, -10225, -36251]
4851c6251n387J669K6899n108k6633k330j1586Q882K1684J8906j0645k1473J2972
4838b8401K8594J1169j2213k0992k8150nK1335K22j2570o226P213K2461J4537
4825c026k2289K8731Q872j9159L449J4000m587l459m259n321r470m47p056r77
4811b4998r660Q88J1916K4934R594L695j886j652K0969R281k9103K2700J338j641
4797C6375J0275m957K254r984j2687k155Q13k0374P389K7503k563j2753K641k5776
4783c999O290L1603j660r517j9403k1538K1062L1874k234m419j8323O174J3857
4770B9767Q822m625l6377L027K0810j0772K210J9079m788j1975j3411K851K045
4757F663J349L401M638l6912l9991N997J4290j0780K3128L5551J370k358o90K432
$$ y = [-36251, -41638, -39969, -13070, -18178, -44811, -47141, -58727, -49845, -28161, -9255, -19900, -41373, -28401, 193, 11362, -851, -21843, -49993, -49998, -28663, -28441, -41011, -47237, -40024, -17563, -3026, -25315, 3416, 12288, -6871, -3422, 10578, 5991, 2532, -1727, -7048, -16518, -16965, -24021, -24998, -34658, -33770, -21854, 3080, 12674, 16369, 14483, 12831, 33800, 43081, 13978, 36678, 38016, 36375, 46650, 41693, 43947, 33963, 21276, 19121, 19934, -440, 6949, 34452, 31889, 19136, 21777, -3999, 2291, 33894, 32234, 22717, 3314, -18224, 2838, 34712, 32478, 28059, 9736, 15910, 29767, 38589, 33964, -2413, 614, 21424, 10652, 12862, 31941, 27153, 15178, 1767, 4618, 6663, 8012, 11413, 16051, -20861, -60852, -54855, -40565, -51345, -28217, 7334, 8704, 6346, 5656, 8088]
4743H088O24j8933m737K8167k3192l4033J1854K1159J2693J4311l11j6891K987
4730A786K0794l3308k2154j8717j7503J0003J1075K1537L686K7296J34J1221P394
4717B3244l9267j3179k723j1553J0266L497K696K8422J886m926K1772q655Q100
4704A9580J6515J1097l3792j1393j6249j4448J1641J4861J5944K0488K340K7520
4692F4104j1869j8103k0760J4865N735J4527j2549l3144j8673l161q746J460O603
4679a9711k2754o662O343K0048J5406m637k1159K731K0363L3636q068k7267QR928
4665a795p212M842j656j03m642n096J4473J5411N090L386q14k0075P827k1302
4651a1666j9735L543P010J9410K9016j084j6109l3263j4426m282K6321K2029k2859
$$ y = [8088, 8712, -10221, -14958, 13209, -9983, -44016, -32162, -11003, 1690, 16001, 15690, -1201, 1786, 22580, -10728, -32882, -51599, -69102, -59099, -48024, -26487, -22801, 4495, 4629, 15850, 23244, -16023, -29202, -31925, -43478, -33212, -29715, -27019, 1403, 3289, -1637, 20135, 11480, 19580, 36095, 47192, 13400, 2007, -14242, -28690, -17049, -2188, 13756, 34244, 36584, 64104, 52235, 34132, 13372, 28237, 33972, 48499, 35950, 2806, -15867, -19028, -27774, -26314, -19711, -42465, -49127, -42784, -22736, -7330, -11967, -33126, -30395, -10032, 23604, 15536, -11731, -11723, -1795, -9007, -4165, -5821, -5924, -10566, -15662, -1189, 14222, 19312, 22698, 21884, 1809, 9636, -11666, -31401, -27858, -20848, -1438, 27578, 26494, 10385, -22878, -37304, -41586, -15265, 6764, -16095]
4638a6095j5658K1929L328l7139L872J1167n099j827j7423k7610J3747K9288L798
4625c3722R014L443K0353l7675j1729P624K0214J3969K0321J3380j7975j0988
4613c771J0122L634k5317j3307o624M357O667K1542q399k1134J5286L2403O671
4600B2130l554j7925j3588M047O287j672j6415K5343j9604j5427K4216N700j8825
4587a9287r303N358L316l139j0480J049m507l832J1539J677m149n112k6146J3028
4573d9988K2422J2473K1577q394j4992r49K4547r073k7412m834J5183L0933o593
4560D900k0982l63J6999L1213Q483l4676n7968K9625M8406J7178q521k2142k0016
4547g864J9863j6796j943L784P234N639l0528K186R703L5945J968l251K6799n2836
$$ y = [-16095, -31753, -9824, -6496, -43635, -39763, -28596, -33695, -35522, -52945, -80555, -66808, -37520, -33722, -24708, -21265, -912, -38587, -50316, -42692, -22478, -8509, 11812, 25192, 7217, -3771, 6351, 9985, -15332, -28639, -35263, -30906, -24239, -2697, -11096, -32230, -16944, 15459, 22130, 18576, 651, -12937, -8890, -2603, -4275, -20690, 4653, -14951, -30378, -6162, -462, -19287, -28590, -23232, -19916, -23055, -33535, -32486, -36993, -40825, -29286, -27609, -31758, -36870, -63016, -49988, -27566, -15093, 6484, -1910, -16902, -17851, 6696, -2377, -29789, -34623, -19440, 11493, 4900, -16082, -16445, 554, 31767, 40250, 5574, -52394, -22769, 25637, 42815, 34294, 12152, -7864, 11999, -4797, -6740, -2956, 4278, 9917, -20611, -18425, -8722, 27223, 29191, 25940, 52739, -97]
4533i7l5680O747m937K4520o04J1636m10J2227o820j2575J7219J4812k8521k1440
4519b3923p924K7174o697k3029J815K6769K1205j6463j340Q43j3347P593J9251
4506A1927K9590p686j4868k4061k1450K2877L5998o277n627n219o487N559j0802
4493C474K643k4818o33O304L310J6046m847m84K15O694l3728j627N604M545J0333
4478f969o599q288K2055L243P981K3028j0366J2464r073j6801m927j4109M625
4465c736q60m384L285n339P03K8328o837l7326n556K8958P830j3859R847J4508
4451A5562k2200J7889K926J5959J0595r060j5936p438l480J7057M346j8903j6750
4438i433k5745R133J211P988o842J7553p603j491O488L1112J6802m706n486J8620
$$ y = [-97, -35777, -29030, -33967, -9447, -10051, 1585, 1175, 13402, 6582, -5993, 11226, 26038, -2483, -23923, -31847, -4673, -11370, -34399, -32584, -5815, 15390, -1073, -2413, -1570, -14917, -7324, 11927, 41517, 33831, 18963, -5098, -26548, -3671, 32327, 26050, 20423, 15204, 8717, 14276, 3474, 6117, -18701, -19334, -13030, -9720, 6326, 1479, 995, 1210, 7904, -25824, -27451, -21847, -17302, -6969, -13568, -21856, 199, 3442, 11423, 34451, 24085, 36549, 27476, 10675, 5748, -8361, -3736, -4596, -8980, -5695, -11034, -10331, 17997, 11160, -26166, -31722, -2764, 5066, -8793, 1054, 15562, -6638, 11251, 14177, 30136, 40731, 31671, 15735, 8297, 4817, 21874, 26220, 7317, -9433, -35178, -26045, -24834, -16846, -23688, -6135, -13738, -15229, -8741, 22371, 39173, 34467, 28981, 47601]
4424D7601n649L364k3913j7348L340Q856J0376P322k490k1893k7068k8211j950
4411d7663J5568K6828j1384j100J4654j5750j0033j1484K9521J3267O858J0104
4399A9386r924K9667J5151k0401l7145R611J0706J3127k240k0377j3719K867Q90
4386b401l271o558N772p286O38j8739k2722K6679J0089J1973O105K4181K7473
4373E1933m485l3683M489J8018M588j1196m4349m289l971J3007j5622k6182Q078
4360d3664K5812O877L795L6578R008l5722J2532k1872j0711J2020L2796J1322
4348C8771k055o1568k0300L3526J3999J8689q765m522l3149k511J569R556J8049
4335A289k711K827q210J4895J7180k3520m1078j6472K0200J5432J876J1443p434
$$ y = [47601, 41952, 45316, 21403, 4055, 7395, 16251, 26627, 33949, 31459, 9566, -17502, -45713, -47663, -32095, -5267, -16651, -17751, -3097, -18847, -28880, -40364, -10843, 2424, 9282, 19386, 9462, 39129, 54280, 33879, -3266, 6345, 17051, 30178, 27938, 7561, -6158, -3291, -2401, -5672, -12230, -6458, -13744, -13106, -31845, -54567, -27888, -17799, -5826, 279, 24460, 51933, 47448, 13765, 18254, 36272, 40860, 29664, -14685, -18974, -22945, -9938, -25560, -51742, -43664, -17852, -10975, -7180, 29398, 38406, 2684, 15216, -6656, -17367, -5347, 27449, 38771, 36716, -24852, -45152, -11626, 2373, 21062, 12297, 7775, -25374, -27885, -26316, -16760, 1289, -1422, 1405, -6805, 8090, 25270, 1750, -39328, -55800, -35600, -20168, -18292, -6849, -14283]
4322a4283j035k1515Q684K8159J4711J4120J5586m383k7230k960j515l2305K2782
4309a184L1109j0700K742K817L099j2963l6830l7736K1953M5755J9786M721K848
4296C5417k2174J4430K4486l589l0644k9682J257L658q256L785J9638K771j8324
4283g227k8058J6566M451q902j2020K0025K5028r180O086j550O525J1491J168
4270B4403J886J010j0146r109j4575P872J0937P127j3156p611q342N032R361L845
4256H534k0705j084J501j2456J6040J6376K0952Q014j8203k0173J2974L3516r908
4243C5378m8192n820O762j69j5815j8652j1391K987J4632L4444P709J790M337
4230H000j118P325k612j2079l7340L888K9819J0010k1998K0504K0902l6253j4574
$$ y = [-14283, -15318, -36833, -28149, 10, 14721, 28841, 44427, 40044, 12814, 9854, 8339, -23966, -1184, 29925, 19225, 21967, 24784, 27883, 14920, -21910, -59646, -37693, 8062, 27848, 32569, 35417, 13243, 27673, 52159, 48570, 17926, -11756, -10499, -6841, -15097, -11312, 8326, 11097, -7227, -35285, -18719, -14268, -23170, -35190, -15165, 9863, 683, 6769, 5219, 11744, 23235, 24403, 26289, 27299, 17153, 8044, -6531, 1341, 12278, 19405, 6249, -1362, -9704, -4672, 4689, 8534, -12171, -13255, -11754, -24210, -8170, 8206, 29158, 37172, 18969, -1204, 11770, 45286, 35378, -12814, -18634, -11872, -12041, -27856, -46508, -57899, -54912, -40280, -5836, 1873, 3663, 8000, 6882, 14207, 11595, -484, -37824, -33936, -4117, 5893, -16105, 4399, 25301, -10952, -25526]
4217b5526K4555p036j9141M445R92N525K5046J69j0105k087j905K2805j2672n0047
4203d4982J5805L7987N483k2267l3358J0937j6183p559J6316L0486L621r310k804
4190a5828k6501m568K3045R896J9478n180L509J4586m485j082J0028j3162l8708
4177b8972k018N1385r628l639l2523k4426J9759J1076L1413N736L596J123j7858
4164E024j3233N315O503J0373j6107j6933j3783j3126K1461K0198P423o289r565
4151a2739j5712j2140N246J8831M7877q481k7964P45K5404k1128k426M175M96
4138B184k560L031j3771j561j962L554J663l5389j7569N295K6199m387K2418L1486
4124A8631j456j8808R862M251j4740l096k440K2232Q576j1817k9955J0235J3232
$$ y = [-25526, -971, -8007, -27148, -22703, -21711, -16186, 8860, 9029, -1076, -3163, -5068, 17737, 5065, -44982, -29177, 8810, 14293, -7974, -41332, -30395, -46578, -54137, -37821, -7335, -3714, -13024, -15828, -42329, -46897, -23852, -13956, 5522, 342, 3851, 18437, 13952, 12870, 22898, 9736, -28972, -30990, 20395, 10767, 7128, -25395, -49821, -30062, -18986, 12427, 18163, 21759, 22882, 5024, -8209, -2894, 3609, 13982, -2125, -19058, -32841, -45967, -24506, -4308, 3115, -3174, -12739, -28451, -40591, -35345, -16514, 31363, 22882, -5082, -4337, 21067, -61, -2487, 1688, 2184, -376, 2655, -11116, -12677, -14639, -11085, -9422, -44811, -62380, -57085, -30886, -35273, -12855, 18631, 17175, -1633, 8229, 12480, -2260, -5356, -7796, 14436, 23012, 11195, -18760, -8525, 4707]
4111D707L14M431M26n008j2525J7206K2087J668l081l109k2936J494J8317J8697
4097D2688j17l5473l919J3815M623K2606l612q922M559J8122j5024l9637p776
4084h067L1578K6828J2995j7084l9252k4175p688K884J4142K5801j2875j5722
4072a0635O699j6911M311J7124M634j5764O942n146J4704k59k2646j416K9431
4059A1068L6256k1106k1099l585L62k386j2588k4649j480L7066J0645k1105J4381
4046A780J4462P886k141k3556j6879J9770J0014j7153p437N191J0537L250j1379
4033e655Q480J5891j5628m176O098k7482k863L1762M481j3465J6892K9413M253
4020D8001p914m4256m0211M0799J5892K1376q040j2546l88m682r986J225l685
$$ y = [4707, 5021, 9452, 9878, 4870, -7655, 9551, 31638, 33306, 30225, 27116, 4180, 5674, 23991, 42688, 42571, 7098, 3179, 16994, 21617, 44223, 40611, 31689, 36248, 54370, 39346, -291, -8067, 23511, 50339, 63334, 46250, 6998, -17177, -24865, -21981, -7839, 17962, 5087, -10635, -3936, -20847, -16536, 588, 5222, -10542, -3600, -8746, 5958, 5699, -16947, -18363, 11068, 47324, 26218, 5119, 1534, 1896, -490, -13078, -37727, -39207, -2141, 8504, -12601, 1780, 16242, 24128, 21987, -1569, -18448, 1322, 11336, -5817, -13254, -8063, 2474, 5724, -5655, 2825, 18716, 3088, -1088, 5010, -22472, -25335, 6427, 10908, -2557, 14335, 43748, 48001, 40087, -4169, -44380, -3581, 12311, 33687, 25647, 13101, 12713, 8031, -1955, -730, -4415]
4007d415J9607l347k8643K993Q678J5408o747R382q280k403L451j9135j8608L0860
3993a199J2643j0682M209j6478k410l0282R262K5678n41J7357Q030M523J143J739
3979B2992l2127o258K0029j3054j1398K022J1294j1523j1132L690N171J1195K1545
3966A2446Q644J8304J1632p263l5601l066P787J3429N247j3747k2973L963L7106
3953C5908M185k9299m354j2739k6049r246K2556J8687j291j7549J8022M652q709
3940e226L260o427j9478l556J3431p588L846o850J6566K9241O044j6458k9794
3927b2989l0781r30J4804K0972L1918J0946P352J4797K183R886K076R344j3335
3914E6243m6753L030R380R358j9364n338n927k0136j427J082j2786P226P68L9420
$$ y = [-4415, 15192, 11845, -16798, -13805, -5127, 10281, 3534, 12916, 4636, 2233, 5684, -13451, -32059, -1199, 11444, 762, 4971, -11507, -13917, -44199, -34937, -9259, -9800, 7557, 15587, 20110, 21253, 22992, -9135, -15393, 4636, -8418, -19816, -17794, -6500, -18023, -29155, -25465, -20294, -9099, 12446, 21090, 39394, 51026, 43763, 8162, 5096, 12883, 26312, 31559, 17812, -5161, -1198, 35908, 40093, 10794, 6440, -6299, -32348, -41594, -19038, -351, -1642, -19191, -1169, 3483, -5226, -1966, -8393, -27871, -31427, -17996, -25584, -21738, -28588, -12022, 17219, 23263, 6805, -22989, -53770, -54700, -39896, -18924, 12994, 23940, 31292, 46089, 48272, 58158, 60234, 69578, 56243, 9490, 12520, 21900, 31258, 11894, 6556, 629, -19507, -20934, -19852, -32638, -25412, -24644, 14776]
3900A4776N983Q206k5646J7002J8072k0988l1068k179J9949J5383m94n5959P037
3887b9926M5017k156q816j4515j2740J944M936O958j9251J5531J667J6623j1142
3874e870n615K998j0807P552R898o699k410O825q873J294K978n287l0922l7073
3860h2011l480L2829J3218P078O5868M1546k8584n324n121k8428L912K4630O702
3847D2835n878O895J1648J780k3742j8681O531k4552p893L6695K0931j0550k7406
3834H613q736L303J0679K3094k4830j2894j693J312J4982k782Q816N996l656j6328
3820E876j584j1016J4415j0267r447J5233K712k6860j5694P222K7799J3220K4533
3807C6142J9842k390m762j9880R249j7672k0477J8817J949J608P645j8102j7117
$$ y = [14776, 20759, 28965, 3319, 20321, 38393, 17405, -13663, -15842, 4107, 19490, 18996, -36963, -29926, 15091, 12935, 4119, -10396, -23136, -21192, -16256, -9298, -28549, -13018, -11351, 5272, -5870, -11485, -8487, -19294, -11742, -1844, -8543, -10953, -4128, -13001, -11707, -8729, -14016, -44938, -82011, -85491, -52662, -39444, -32366, 33502, 75048, 46464, 41140, 36019, 7591, 11503, 36133, 42835, 36957, 43852, 55500, 57280, 33538, 14857, 21388, -3164, -11057, 25638, 46569, 36019, 8613, -123, 3180, 13859, 36953, 12123, -771, -2464, -1152, 13830, 11048, 19864, 25860, 22204, 5876, 4292, -6724, 7691, -2576, -12023, 3210, 5922, -20938, -36632, -29410, -1611, 11609, 36142, 55984, 53594, 48832, 28952, 38201, 20529, 52, 18869, 20818, 22426, 30071, 11969, -5148]
3794e148k922p124k6890J7495Q547j5351K0241J5119K188Q430J8127q636m640
3781A9436J3211J401r079K460k6521J4092l2429J681j704L156J3429j8534r017
$$ y = [-5148, -8070, -15194, -42084, -24589, -16042, -31393, -11152, 3967, 6155, 14585, 32712, 24076, 19436, 32647, 34048, 24969, 27429, 908, 15000, -17429, -15748, -17452, -14296, -867, -19401, -28418]
$$ [...]
##END NTUPLES=NMR SPECTRUM
##END=
