##TITLE=Analysis number 312891
Compound Code cc 40104
Book Reference 350/170/1
Project Code adrs
Chemist Name chrisr
##JCAMPDX= 6.0         $$ Bruker NMR JCAMP-DX V2.0
##DATA TYPE= NMR SPECTRUM
##DATA CLASS= NTUPLES
##ORIGIN= Bruker BioSpin GmbH
##OWNER= NMR
$$ XWIN-NMR		Version 3.5
$$ Wed Aug 17 12:21:20 2005 GMT Daylight Time (UT+1h)  MAYBRIDGE\NMR@NMR_250MHZ
##.OBSERVE FREQUENCY= 250.131544655141
##.OBSERVE NUCLEUS= ^1H
##.ACQUISITION MODE= SIMULTANEOUS (DQD)
##.ACQUISITION SCHEME= undefined
##.AVERAGES= 16
##.DIGITISER RES= 18
##SPECTROMETER/DATA SYSTEM= dpx250
##.PULSE SEQUENCE= zg30
##.SOLVENT NAME= CDCl3
##.SHIFT REFERENCE= (INTERNAL, CDCl3, 0, 16.522)
##AUDIT TRAIL= $$ (NUMBER, WHEN, WHO, WHERE, WHAT)
$$ ##TITLE= Audit trail, XWIN-NMR		Version 3.5
$$ ##JCAMPDX= 5.01
$$ ##ORIGIN= Bruker BioSpin GmbH
$$ ##OWNER= NMR
$$ C:\u/data/dgb/nmr/ADRS/8080/pdata/1/auditp.txt
$$ ##AUDIT TRAIL=  $$ (NUMBER, WHEN, WHO, WHERE, WHAT)
(   1,<2005-08-17 12:21:02.20 +100>,<MAYBRIDGE\NMR>,<NMR_250MHZ>,
      <created by zg, POWCHK disabled, PULCHK disabled
       configuration hash MD5:
       62 19 C7 07 E1 42 D1 B7 37 6C 3D D0 77 39 F9 E6
       data hash MD5: 64K
       52 3D 22 E6 D1 83 F0 63 BB 58 0E D8 DB C4 1A 5F>)
(   2,<2005-08-17 12:21:12.84 +100>,<MAYBRIDGE\NMR>,<NMR_250MHZ>,
      <Start of raw data processing
       ef LB = 0.3 FT_mod = 6 PKNL = 1 SI = 32K 
       data hash MD5: 32K
       ED B2 A4 F8 C0 5A A7 07 0A D8 87 EA 9F EF 0B 48>)
(   3,<2005-08-17 12:21:14.64 +100>,<MAYBRIDGE\NMR>,<NMR_250MHZ>,
      <apk 
       data hash MD5: 32K
       41 D4 0E 6A 4A BA 65 E7 E7 24 57 1B 9E 0B 1D AF>)
(   4,<2005-08-17 12:21:15.45 +100>,<MAYBRIDGE\NMR>,<NMR_250MHZ>,
      <abs ABSG = 5 
       data hash MD5: 32K
       DE 42 10 66 EB 8C D1 AA C4 FB E2 BA 91 31 67 C8>)
$$ ##END=
$$ 
$$ hash MD5
$$ 9B 71 2C E4 13 EA 70 24 2B 79 A2 49 70 9F E0 D6
##$RELAX= 
##$RELAX= 
##$RELAX= 
##$RELAX= 
##$RELAX= 
##$RELAX= 
##$RELAX= 
$$ Bruker specific parameters
$$ --------------------------
##$DU= <C:\u>
##$EXPNO= 8080
##$NAME= <ADRS>
##$PROCNO= 1
##$TYPE= <nmr>
##$USER= <dgb>
##$AMP= (0..31)
100 100 100 100 100 100 100 100 100 100 100 100 100 100 100 100 100 100 
100 100 100 100 100 100 100 100 100 100 100 100 100 100 
##$AQSEQ= 0
##$AQ_mod= 3
##$AUNM= <au_zg>
##$AUTOPOS= <21 >
##$BF1= 250.13
##$BF2= 250.13
##$BF3= 250.13
##$BF4= 250.13
##$BF5= 500.13
##$BF6= 500.13
##$BF7= 500.13
##$BF8= 500.13
##$BYTORDA= 1
##$CFDGTYP= 0
##$CFRGTYP= 5
##$CHEMSTR= <none>
##$CNST= (0..31)
1 1 145 1 1 1 1 1 1 1 1 1 1 1 1 1 1 1 1 1 1 1 1 1 1 1 1 1 1 1 1 1 
##$CPDPRG= <>
##$CPDPRG1= <>
##$CPDPRG2= <>
##$CPDPRG3= <>
##$CPDPRG4= <mlev>
##$CPDPRG5= <mlev>
##$CPDPRG6= <mlev>
##$CPDPRG7= <mlev>
##$CPDPRG8= <mlev>
##$CPDPRGB= <>
##$CPDPRGT= <>
##$D= (0..31)
0 1 0 0 0 0 0 0 0 0.06 0 0 0 0 0 0 0.0002 0 0 0 0 0 0 0 0 0 0 0 0 0 0 
0 
##$DATE= 1124277661
##$DBL= (0..7)
120 120 120 120 120 120 120 120 
##$DBP= (0..7)
150 150 150 150 150 150 150 150 
##$DBP07= 0
##$DBPNAM0= <>
##$DBPNAM1= <>
$$ [...]
##$SUBNAM7= <"">
##$SUBNAM8= <"">
##$SUBNAM9= <"">
##$SW= 20.6930455092707
##$SWIBOX= (0..15)
0 0 3 0 0 0 0 0 0 0 0 0 0 0 0 0 
##$SW_h= 5175.983436853
##$TD= 65536
##$TD0= 1
##$TE= 295.16
##$TE2= 300
##$TE3= 300
##$TEG= 300
##$TL= (0..7)
0 120 120 120 120 120 120 120 
##$TP= (0..7)
150 150 150 150 150 150 150 150 
##$TP07= 0
##$TPNAME0= <>
##$TPNAME1= <>
##$TPNAME2= <>
##$TPNAME3= <>
##$TPNAME4= <>
##$TPNAME5= <>
##$TPNAME6= <>
##$TPNAME7= <>
##$TPOAL= (0..7)
0.5 0.5 0.5 0.5 0.5 0.5 0.5 0.5 
##$TPOFFS= (0..7)
0 0 0 0 0 0 0 0 
##$TUNHIN= 0
##$TUNHOUT= 0
##$TUNXOUT= 0
##$USERA1= <user>
##$USERA2= <user>
##$USERA3= <user>
##$USERA4= <user>
##$USERA5= <user>
##$V9= 5
##$VALIST= <valist>
##$VCLIST= <CCCCCCCCCCCCCCC>
##$VD= 0
##$VDLIST= <DDDDDDDDDDDDDDD>
##$VPLIST= <PPPPPPPPPPPPPPP>
##$VTLIST= <TTTTTTTTTTTTTTT>
##$WBST= 1024
##$WBSW= 4
##$XGAIN= (0..3)
0 0 0 0 
##$XL= 0
##$YL= 0
##$YMAX_a= 467675
##$YMIN_a= -487871
##$ZGOPTNS= <>
##$ZL1= 120
##$ZL2= 120
##$ZL3= 120
##$ZL4= 120
##$ABSF1= 16.522
##$ABSF2= -4.171173
##$ABSG= 5
##$ABSL= 3
##$ALPHA= 0
##$AQORDER= 0
##$ASSFAC= 0
##$ASSFACI= 0
##$ASSFACX= 0
##$ASSWID= 0
##$AUNMP= <proc_1d>
##$AZFE= 0.1
##$AZFW= 0.1
##$BCFW= 0
##$BC_mod= 0
##$BYTORDP= 0
##$COROFFS= 0
##$CY= 12.5
##$DATMOD= 1
##$DC= 0
##$DFILT= <>
##$DTYPP= 0
##$F1P= 14.0000005364418
##$F2P= -0.99999901652339
##$FCOR= 0.5
##$FTSIZE= 32768
##$FT_mod= 6
##$GAMMA= 0
##$GB= 0
##$INTBC= 1
##$INTSCL= 1
##$ISEN= 128
##$LB= 0.3
##$LEV0= 0
##$LPBIN= 0
##$MAXI= 10000
##$MC2= 0
##$MEAN= 0
##$ME_mod= 0
##$MI= 0
##$NCOEF= 0
##$NC_proc= -4
##$NLEV= 6
##$NOISF1= 0
##$NOISF2= 0
##$NSP= 0
##$NTH_PI= 0
##$NZP= 0
##$OFFSET= 16.522
##$PC= 1
##$PHC0= -77.99971
##$PHC1= 5.414493
##$PH_mod= 1
##$PKNL= yes
##$PPARMOD= 0
##$PSCAL= 4
##$PSIGN= 0
##$REVERSE= no
##$SF= 250.13
##$SI= 32768
##$SIGF1= 0
##$SIGF2= 0
##$SINO= 400
##$SIOLD= 32768
##$SREGLST= <1H.CDCl3>
##$SSB= 0
##$STSI= 32768
##$STSR= 0
##$SW_p= 5175.98343685301
##$SYMM= 0
##$S_DEV= 0
##$TDeff= 65536
##$TDoff= 0
##$TI= <Analysis number 999999
Compound Code 99
Book Reference 9
Project Code 9>
##$TILT= no
##$TM1= 0
##$TM2= 0
##$TOPLEV= 0
##$USERP1= <user>
##$USERP2= <user>
##$USERP3= <user>
##$USERP4= <user>
##$USERP5= <user>
##$WDW= 1
##$XDIM= 32768
##$YMAX_p= 318340628
##$YMIN_p= -199925
$$ End of Bruker specific parameters
$$ ---------------------------------
##NTUPLES= NMR SPECTRUM
##VAR_NAME=  FREQUENCY,     SPECTRUM/REAL,   SPECTRUM/IMAG
##SYMBOL=    X,             R,               I
##VAR_TYPE=  INDEPENDENT,   DEPENDENT,       DEPENDENT
##VAR_FORM=  AFFN,          ASDF,            ASDF
##VAR_DIM=   32768,         32768,           32768
##UNITS=     HZ,            ARBITRARY UNITS, ARBITRARY UNITS
##FACTOR=    0.157963299565203, 1,           1
##FIRST=     4132.6476996994, 0,             0
##LAST=      -1043.33573715361, 0,           0
##MIN=       -1043.33573715361, -199925,     0
##MAX=       4132.6476996994, 318340628,     0
$$ Real data points
##PAGE= N=1
##DATA TABLE= (X++(R..R)), XYDATA
$$ [...]
17950A47068q0190m4650m5001l012J5297K9273O4083k3901j422N2191j4403n2774
$$ 147068 66878 22228 -22773 -25785 -10488 18785 82868 58967 57545 109736 95333 42559
17938D2559m0763R226J0381j1512m1507j4120m414L0547L195K3481r761p585J9586
$$ 42559 1796 11022 21403 9891 -31616 -45736 -50150 -19603 -16408 7073 -2688 -10273 9313
17925I313j2404J0065j3784J8128j977J7343N8072m883n7861K0538P330J6329
$$ 9313 -3091 6974 -6810 11318 9341 26684 84756 79873 22012 42550 49880 66209
17913F6209m659R872P4318m3652k3923O5192M7320K6677j2476l5885k0841m9060
$$ 66209 61550 71422 145740 102088 78165 143357 190677 217354 204878 168993 148152 99092
17901I9092m0935n4113k2445k4460J9767n515K1218j0140k4220L431L0137K8653
$$ 99092 58157 4044 -18401 -42861 -23094 -28609 -7391 -17531 -41751 -38320 -8183 20470
17889B0470O1088L7370k1346p5452j6366l8561r338j1561k2497J51j1339N725
$$ 20470 81558 118928 97582 22130 5764 -32797 -42135 -53696 -76193 -76042 -87381 -81656
17877h1656K1120N1891O169j0936J1020j3569P106J3970o357k8965L1925K9791
$$ -81656 -60536 -8645 -2476 -13412 -2392 -15961 -8855 5115 -1242 -30207 1718 31509
17865C1509j1048o9935K5272J3846k4130n5393n3499L9399P7643L4668J4795j1434
$$ 31509 20461 -49474 -24202 -10356 -34486 -89879 -143378 -103979 -26336 8332 23127 11693
17853A1693K7880O9119m0224j8844o2136j3616N1439L4787r434J1324k2983m7511
$$ 11693 39573 108692 68468 49624 -12512 -26128 25311 60098 50664 61988 39005 -8506
17841h506p805p893n0547K3280r016j3112O3050J5685L741j7280m1165k1913o743
$$ -8506 -16311 -24204 -74751 -51471 -60487 -73599 -10549 5136 8877 -8403 -49568 -71481 -78224
17828g8224N4017k276j8133J7210O0959N3923L912j5503o7463l3078R07o6500
$$ -78224 -24207 -26483 -44616 -27406 33553 87476 91388 75885 8422 -24656 -23749 -90249
17816i0249l6692L4491O1662J1215o4812L2289L8073K5438k549j1669J4095L0249
$$ -90249 -126941 -92450 -30788 -19573 -84385 -52096 -14023 11415 8866 -2803 11292 41541
17804D1541m8275m0501l2499j5153J0569l7674L9599K9857J2507Q188m2207r812
$$ 41541 -6734 -47235 -79734 -94887 -84318 -121992 -82393 -52536 -40029 -31841 -74048 -83860
17792h3860J2442K4665j5717l3992L6545j2905N049K8524j5782K2140j8874k4232
$$ -83860 -71418 -46753 -62470 -96462 -59917 -72822 -67773 -39249 -55031 -32891 -51765 -75997
17780g5997J4413K3605K2235Q524l1642j145M1453n0023k3580O137o790L9793
$$ -75997 -61584 -37979 -15744 -7220 -38862 -40007 1446 -48577 -72157 -66020 -72810 -33017
17768c3017K6971j7241J0893K0770J3899M3945l2603n5133M3501J6299K0109J0429
$$ -33017 -6046 -23287 -12394 8376 22275 66220 33617 -21516 21985 38284 58393 68822
17756F8822J2899l0439m4406l1377j895j019q8240j7609K1793j6119n804K8375
$$ 68822 81721 51282 6876 -24501 -26396 -27415 -115655 -133264 -111471 -127590 -133394 -105019
17744a05019J5582k7489L7803k2240j9382l260M1008P6515J1837j3044n317K2140
$$ -105019 -89437 -116926 -79123 -101363 -120745 -124005 -82997 -6482 5355 -7689 -13006 9134
17732I134k8073j0015J2939j0324o014k487O489P7834M224l0997l2812k6069M326
$$ 9134 -18939 -28954 -16015 -26339 -32353 -34840 -28351 49483 53707 22710 -10102 -36171 -31845
17719c1845J2846J4029K2334P473n8204o3520J571K3666P26r142n5967J2369J6008
$$ -31845 -18999 -4970 17364 24837 -33367 -96887 -95316 -71650 -70924 -80066 -136033 -123664 -107656
17706a07656R031j0245n916L3301N5761M1225L2250n6647m2077L4877K2261n3722
$$ -107656 -98625 -108870 -114786 -81485 -25724 15501 47751 -8896 -50973 -16096 6165 -47557
17694d7557o8949M1170K5876L4236J5721J9328K0894k30K2422K2621L3293l6377
$$ -47557 -116506 -75336 -49460 -15224 497 19825 40719 40489 62911 85532 118825 82448
17682H2448l1091N2322k8574o2081Q099j238k2128m6332L276J1221L8540J7213
$$ 82448 51357 103679 75105 13024 21123 19885 -2243 -48575 -45299 -34078 4462 21675
17670B1675n388o5306o3594L7287K1482p597J4045M5492j0693k1851O768L741
$$ 21675 16287 -49019 -112613 -75326 -53844 -61441 -47396 -1904 -12597 -34448 -27680 -23939
17658b3939j0824k2118j8292K0670k736K0176N240j820j5720L7291l4667j7841
$$ -23939 -34763 -56881 -75173 -54503 -57239 -37063 -31823 -33643 -49363 -12072 -46739 -64580
17646f4580m98P868K2784k3979M015M1102O0926K9704j1486k9783m7355r270j1671
$$ -64580 -65078 -57210 -34426 -58405 -54390 -13288 47638 77342 65856 36073 -11282 -20552 -32223
17633c2223j5751M365p205M439K7138j883k7438k0446J093K8350k0900j9096K8281
$$ -32223 -47974 -43609 -50814 -46375 -19237 -21120 -48558 -69004 -67911 -39561 -60461 -79557 -51276
17620e1276L3851j9019k8725N1883L0979K8341K0075J4148L161o195k4790k8032
$$ -51276 -17425 -36444 -65169 -13286 17693 46034 66109 80257 83418 77223 52433 24401
17608B4401n6101k1762K2396N213K2999k9367k5975M3891L1168K8887J3182k1882
$$ 24401 -31700 -53462 -31066 -25853 -2854 -32221 -58196 -14305 16863 45750 58932 37050
17596C7050m5809J0156j4502K1727k6424o3045k1768N3684L1231J2040N693K6892
$$ 37050 -8759 1397 -13105 8622 -17802 -80847 -102615 -48931 -17700 -5660 33 26925
17584B6925j1741l6953N051k3894N2292Q094l6505k2088J3303k7751J3904K2454
$$ 26925 15184 -21769 -16718 -40612 11680 19774 -16731 -38819 -25516 -53267 -39363 -16909
17572a6909K3614n339N762j5066k6205M930M411L4254J2811J1273K066K533l554
$$ -16909 6705 1366 7128 -7938 -34143 -29213 -24802 9452 22263 33536 35602 38135 34581
17559C4581n9316q0477k377K98o356K8107J9288L6671k7723O033L738J31J4840
$$ 34581 -24735 -105212 -107589 -107291 -113647 -85540 -66252 -29581 -57304 -51271 -47533 -47402 -32562
17546c2562M5122J9333k8031K046j3084n1852j0550k6523n0372L7524L5907l3312
$$ -32562 12560 31893 3862 5908 -7176 -59028 -69578 -96101 -146473 -108949 -73042 -106354
17534a06354j7330L4463M900N868N3009L873k6944j614N9809K7207k9958j9988
$$ -106354 -123684 -89221 -84321 -78453 -25444 -21571 -48515 -50129 9680 36887 6929 -13059
17522a3059k8168K929P927j211N8184j7125k0645L770K160k5895p068J5518M6697
$$ -13059 -41227 -38298 -30371 -31582 26602 9477 -11168 -7398 -5238 -31133 -38201 -22683 24014
17509B4014K0640J227l2849l8534N927K4895K6000m51m2937n3007n807Q49k1429
$$ 24014 44654 45881 13032 -25502 -19575 5320 31320 30869 -12068 -65075 -70882 -70033 -91462
17496i1462M1289N9857j4755k2928J9848n134r005K3588P2921j1998k9830L096
$$ -91462 -50173 9684 -5071 -27999 -8151 -13285 -22290 1298 74219 62221 32391 35487
17484C5487N968N557l3994K2007l6821m0998m3242k3440K4351O0912Q5395M7141
$$ 35487 41455 47012 13018 35025 -1796 -42794 -86036 -109476 -85125 -24213 61182 108323
17472A08323k2184l5778n3827j3421L293O632o957l2722L6921p21o8246m6563
$$ 108323 86139 50361 -3466 -16887 -13594 -6962 -13919 -46641 -9720 -10441 -78687 -125250
17460a25250J9581N8186P6381o332o1310k4918N6705M0878l2231k4503J9054j023
$$ -125250 -105669 -47483 28898 22566 -38744 -63662 -6957 33921 1690 -22813 -3759 -4782
17448d782L2947K4614K8750K0778k5933N4485J75300J59042Q4131j48325k28168
$$ -4782 28165 52779 81529 102307 76374 130859 306159 465201 549332 401007 172839
17437A72839j17558k6749l2835Q42k7350M839p4645j0521K7712M8787Q351M3296
$$ 172839 55281 28532 -4303 -3461 -30811 -25972 -100617 -111138 -83426 -34639 -26288 17008
17425A7008o680k887j2440k9129j119J7891J8n8383q843L0212j2828m6089K6038
$$ 17008 10328 7441 -4999 -34128 -35247 -17356 -17338 -75721 -84564 -54352 -67180 -113269 -87231
17412h7231L6693K322K9656N9454J6741m6534j5758o3146j9732K1325l9382j6390
$$ -87231 -50538 -48216 -18560 40894 57635 11101 -4657 -67803 -87535 -66210 -105592 -121982
17400a21982J8005J3940N4940N9619N1198j3352o6860P706o0845n51p628m0698
$$ -121982 -103977 -90037 -35097 24522 75720 62368 -4492 3214 -57631 -58182 -65810 -106508
17388a06508R4239O3693j4834L965l0726k517j1907m2033J3993L4751l7862Q743
$$ -106508 -12269 51424 36590 40555 9829 7312 -4595 -46628 -32635 2116 -35746 -27003
17376b7003P300K4965j2821r198n0586p218M1244K5478l4830N190R179q577j8542
$$ -27003 -19703 5262 -7559 -16757 -67343 -74561 -33317 -7839 -42669 -37479 -28300 -36877 -55419
17363e5419k5298K3527M3563M223j8250J834K7169l5338l1128O878k7476k4138
$$ -55419 -80717 -57190 -13627 -9404 -27654 -25820 1349 -33989 -65117 -58239 -85715 -109853
17351a09853O916J3420N5911O7037J021n0758P6O947k2995J5683k650k9100p11
$$ -109853 -102937 -89517 -33606 33431 34452 -16306 -16230 -9283 -32278 -16595 -19245 -48345 -49056
17338d9056J229k9532n8967K1952K0423j3723R24J5895M1765k3230p989J0055
$$ -49056 -47827 -77359 -136326 -114374 -93951 -107674 -106750 -90855 -49090 -72320 -80309 -70254
17326g0254K1195l199k0597J5734J8802J7687l8612l9545m3507J8235Q6952r699
$$ -70254 -49059 -52258 -72855 -57121 -38319 -20632 -59244 -98789 -142296 -124061 -37109 -46808
17314d6808p3429m59j6030L0919M8598J0654P927o8345Q442K722M1768K1933N45
$$ -46808 -120237 -120696 -136726 -105807 -57209 -46555 -38628 -106973 -98531 -95809 -54041 -32108 -31563
17301c1563j0267J4560L9888m1561K0976M0944J5061l4545j1687R843k1664k9024
$$ -31563 -41830 -27270 12618 -28943 -7967 32977 48038 13493 1806 11649 -10015 -39039
17289c9039j4542J5811o387J5446n201o148J6172j3476J871M7270k1730m1906
$$ -39039 -53581 -37770 -44157 -28711 -33912 -40060 -23888 -37364 -35493 11777 -9953 -51859
17277e1859K2629K2827m7623L1271n839k0739j7396L250J5204j5668r484L8964
$$ -51859 -29230 -6403 -54026 -22755 -28594 -49333 -66729 -63479 -48275 -63943 -73427 -34463
17265c4463O962P682l9501J7590L4723j1388M583M1456k5353l4419J595J1480
$$ -34463 -27501 -19819 -59320 -41730 -7007 -18395 -13812 27644 2291 -32128 -30533 -19053
17253a9053j6639J9680k1298l236J6755m5382n0293M1408j8768o070p855m518
$$ -19053 -35692 -16012 -37310 -40546 -23791 -69173 -119466 -78058 -96826 -102896 -110751 -115269
17241a15269M2829J0169j0142N3042N6422n0765m2319M2195K3573k6965m5232
$$ -115269 -72440 -62271 -72413 -19371 37051 -13714 -56033 -13838 9735 -17230 -62462
17230f2462r05M3055j464j7280j2407j3821K3146L2032K1691m709l8803l2705
$$ -62462 -63367 -20312 -21776 -39056 -51463 -65284 -42138 -10106 11585 6876 -31927 -64632
17218f4632m164j339K6871M7809l9558j5643K0787K3131J7515J6124k5391k369
$$ -64632 -68796 -70135 -43264 4545 -35013 -50656 -29869 -6738 10777 26901 1510 -859
17206h59J8623m846k398o311J5506p674k0959N006k0883K1421K0740J6609j3457
$$ -859 17764 12918 10520 4209 19715 12041 -8918 -3912 -24795 -3374 17366 33975 20518
17193B0518K1841p550J3996o0899j2634K1197J2128k0631K873k6821n2113N7604
$$ 20518 42359 34809 48805 -12094 -24728 -3531 8597 -12034 -9161 -35982 -88095 -30491
17181c0491J3101j1232l9095K2834J6430K1498K8840P856K6194k8402m1311m0719
$$ -30491 -17390 -28622 -67717 -44883 -28453 -6955 21885 29741 55935 27533 -13778 -54497
17169e4497k6091J9050P647p747k7817M6410J9309L055K9369l649j550J302n1756
$$ -54497 -80588 -61538 -53891 -61638 -89455 -43045 -23736 -20681 8688 5039 3489 4791 -46965
17156d6965k5522J4538O9211K1022p6189l1670m7966j6318L9800k947n692k7112
$$ -46965 -72487 -57949 11262 32284 -43905 -75575 -123541 -139859 -100059 -103006 -108698 -135810
17144a35810k175N8703K8450n2609j3191K5447N2M6827J8854l2536n991K0515
$$ -135810 -137985 -79282 -50832 -103441 -116632 -91185 -91133 -44306 -25452 -57988 -63979 -43464
17132d3464L2828L7686L6089k1571n5157k1292L2686N7708J382r764M5708j3750
$$ -43464 -10636 27050 63139 41568 -13589 -34881 -2195 55513 56895 47131 92839 79089
17120G9089q1167p1798K2971J3079O517J0398k4936r253L1830L5182L1314r945
$$ 79089 -2078 -73876 -50905 -37826 -31309 -20911 -45847 -55100 -23270 11912 43226 33281
17108C3281J9286L668k0086j4693l358M7782J9627j2917m756m4665o6639M0134
$$ 33281 52567 56235 36149 21456 18098 65880 85507 72590 67834 23169 -43470 -3336
17096c336J8799L5901P940n3292k4825o806M6727l7155o931k0163k1660l1413
$$ -3336 15463 51364 59304 6012 -18813 -25619 21108 -16047 -22978 -43141 -64801 -96214
17084i6214K2585O8946M4018o360j7915l4452N205q050o262J9810K1878K2961
$$ -96214 -73629 -4683 39335 32975 15060 -19392 -14187 -22237 -28499 -8689 13189 36150
17072C6150m6675j1669J0635p951n6381P19P2112M4813m9692l2937j4734k2963
$$ 36150 -10525 -22194 -11559 -19510 -75891 -75172 -3060 41753 -7939 -40876 -55610 -78573
17060g8573k6776J2369L9132k170L0164O5741K2134j5089k6645k4227l1141k6594
$$ -78573 -105349 -92980 -53848 -56018 -25854 39887 62021 46932 20287 -3940 -35081 -61675
17048f1675K8690N7378K204l8781l5510k1921k6570L9469K3854k1619k6758J019
$$ -61675 -32985 24393 26597 -12184 -47694 -69615 -96185 -56716 -32862 -54481 -81239 -80220
17036h0220j5547M5728Q1393j8009j109k1654j1543l137K706J1477O5293K6231
$$ -80220 -95767 -50039 31354 13345 12236 -9418 -20961 -24098 -21392 -9915 55378 81609
17024H1609n3048O14m0503k1115J9539j5198j5067j5909L5710L4445J3319J7940
$$ 81609 28561 29175 -11328 -32443 -12904 -28102 -43169 -59078 -23368 11077 24396 42336
17012D2336J0127p3847k1561L8512r387k1522K4138N3303L323m4646L921O527
$$ 42336 52463 -21384 -42945 -4433 -13820 -35342 -11204 42099 45422 776 4697 11224
17000A1224J9728k1779k1877j4910L1012k1224l4184O659N3376L9189m7653k9746
$$ 11224 30952 9173 -12704 -27614 3398 -17826 -52010 -45351 8025 47214 -439 -30185
16988c0185j4418k1682L5497J8140m8563J9223P1433k8411r0266k568P6256k261
$$ -30185 -44603 -66285 -30788 -12648 -61211 -41988 29445 1034 -89232 -91800 -15544 -17805
16976a7805m1435m4506j2314N2931P5193j4397j9307J2206m2127k2582k9137N46
$$ -17805 -59240 -103746 -116060 -63129 12064 -2333 -21640 -9434 -51561 -74143 -103280 -102734
16964a02734K9060J1273q604k2386J9479L7766K262k6185N962M5096L763k8420
$$ -102734 -73674 -62401 -71005 -93391 -73912 -36146 -33884 -60069 -54107 -9011 -5248 -33668
16952c3668J1250j503J3456K0470j9890J4122L9704n619q194n9331J4383P5416
$$ -33668 -22418 -23921 -10465 10005 -9885 4237 43941 38322 30128 -29203 -14820 60596
16940F0596J9071o8456L657O4541n6361p0972j001L68K6700r425J8689L0710M46
$$ 60596 79667 11211 14868 79409 23048 -47924 -48925 -48557 -21857 -31282 -12593 18117 18563
16927A8563l0171j6047m2217j7242K4225J3579L6477j0309n345k6253k9702k3811
$$ 18563 -11608 -27655 -69872 -87114 -62889 -49310 -12833 -23142 -28487 -54740 -84442 -108253
16915a08253K998j9625J4076k088J0533L0573Q3257k8710k6572N563L1718k6150
$$ -108253 -105255 -124880 -110804 -112892 -102359 -71786 11471 -17239 -43811 -38248 -6530 -32680
16903c2680P210O717l917n0132k1139j3225K2720K2712j3166p0936J9528J4414
$$ -32680 -25470 -18753 -22670 -72802 -93941 -107166 -84446 -61734 -74900 -145836 -126308 -111894
16891a11894n129J7544L4856L7179k031n2153L482k4258j092O4738K2564J2094
$$ -111894 -117023 -99479 -64623 -27444 -29475 -81628 -78146 -102404 -103496 -38758 -16194 -4100
16879d100M5076L4195K9971O69m9972m7249k7917K4749l3049J1879K6352J2049
$$ -4100 40976 75171 105142 105811 55839 8590 -19327 5422 -27627 -15748 10604 22653
16867B2653J2454m5986L8686K1229J2092m4757j8097m4511J0022N4378N4825k7031
$$ 22653 35107 -10879 27807 49036 61128 16371 -1726 -46237 -36215 18163 72988 45957
16855D5957l6931k5076l039K6455j3150o852p1344k0230k6588n880Q446K1268
$$ 45957 9026 -16050 -19089 7366 -5784 -12636 -83980 -104210 -130798 -136678 -128232 -106964
16843a06964J6019J3876L4165K5126J7681M2534L375q343o973l5741k9988M1083
$$ -106964 -90945 -77069 -42904 -17778 -97 42437 45812 37469 30496 -5245 -35233 5850
16831E850M616o9605n612K2302m5024j2316K1872L8350K0305p598o3404l5413
$$ 5850 10466 -59139 -64751 -42449 -87473 -99789 -77917 -39567 -19262 -26860 -90264 -125677
16819a25677K7315l2135k0987N8240l950k1485O3549K8730l1124L7461N3028k6407
$$ -125677 -98362 -130497 -151484 -93244 -97194 -118679 -55130 -26400 -57524 -20063 32965 6558
16807F558o2224m2955k997m727n605K9770J1757K868l135J7110L8245J9127o6323
$$ 6558 -55666 -98621 -101618 -106345 -111950 -82180 -70423 -67555 -70690 -53580 -15335 3792 -62531
16794f2531m2580K0983N5338J1764M685K8741K3593J7706j3235l3765k8633J570
$$ -62531 -105111 -84128 -28790 -17026 -12341 16400 39993 57699 44464 10699 -17934 -16364
16782a6364O0545K2280l9250r694n9733q867j9035K0349j9285L0996L760j4532
$$ -16364 44181 66461 27211 17517 -42216 -51083 -70118 -49769 -69054 -38058 -34298 -48830
16770d8830J718n7416k7726K6360K2496J2977K3609o258o082P493q685k1125N551
$$ -48830 -47112 -104528 -132254 -105894 -83398 -70421 -46812 -53070 -59152 -51659 -60344 -81469 -75918
16757g5918j7539j0130M31M6829J9875k4168j451o1336J330K9117K2198l562j9554
$$ -75918 -93457 -103587 -103156 -56327 -36452 -60620 -62071 -123407 -122077 -92960 -70762 -74324 -93878
16744i3878L494N8957K7099J1533l5832j7133r65k902k4096K2514M2466J5898
$$ -93878 -90384 -31427 -4328 7205 -28627 -45760 -46725 -49627 -73723 -51209 -8743 7155
16732G155m4242K4785L6103o4445l9841K1896L3270K6336k4868Q265M3863L0490
$$ 7155 -37087 -12302 23801 -40644 -80485 -58589 -25319 1017 -23851 -15586 28277 58767
16720E8767Q277r0154j0104M7468L2281n8484p1276l4190m789N277J1963M4406
$$ 58767 67044 -23110 -33214 14254 46535 -11949 -83225 -117415 -122204 -116927 -104964 -60558
16708f0558M8899m7560m9689m1710j0504L5533J5864J6549M5393K8072r2303k3091
$$ -60558 -11659 -59219 -108908 -150618 -161122 -125589 -109725 -93176 -47783 -19711 -112014 -135105
16696a35105K2328L0821L5956M776k1781L0158L0557K2746r97k5589l0202r552
$$ -135105 -112777 -81956 -46000 -41224 -63005 -32847 -2290 20456 19459 -6130 -36332 -45884
16684d5884l5829R150q732L4824O7905L2401k9892m6334k0077q082L0481J5979
$$ -45884 -81713 -72563 -81295 -46471 21434 53835 23943 -22391 -42468 -50550 -20069 -4090
16672d090N0104J4620k1395k8982K2289N871J2602l0394K8300J6088m588L0572
$$ -4090 46014 60634 39239 10257 32546 38417 51019 20625 48925 65013 60425 90997
16660I0997J911o7755J7888j172n3122l0034l1427J0019K5024k4466O192M2594
$$ 90997 92908 25153 43041 41869 -11253 -41287 -72714 -62695 -37671 -62137 -55945 -13351
16648a3351L1288L6127P400n0004n8514P228J1785j3053K7664n475K6082j0362
$$ -13351 17937 54064 61464 11460 -47054 -39826 -28041 -41094 -13430 -18905 7177 -3185
16636c185m9138k7860k3922K7163j6217K6966o67M4004M4570K2775J0757q523
$$ -3185 -52323 -80183 -104105 -76942 -93159 -66193 -66860 -22856 21714 44489 55246 46723
16624D6723j7187M9982l1792q9657l6554j962k1596P6672K9697n256j3183J2632
$$ 46723 29536 79518 47726 -41931 -78485 -80447 -102043 -25371 4326 -930 -14113 -1481
16612a481K4082n5526l2174J3243N8M6055M2151m8081j9586j0620k4525J9371
$$ -1481 22601 -32925 -65099 -51856 -51798 -5743 36408 -11673 -31259 -41879 -66404 -47033
16600d7033L6638L5318j5770n4638K6421L820o094o824J5946L8904L975k6248
$$ -47033 -10395 24923 9153 -45485 -19064 -15244 -21338 -28162 -12216 26688 30663 4415
16588D415p24j1221K6762o881m1756k8917l3698M9068K4076L3661k4817p019K4654
$$ 4415 3691 -7530 19232 12351 -29405 -58322 -92020 -42952 -18876 14785 -10032 -17051 7603
16575G603R781J1507J4803l4816o2399j3013N3845j1782J512J967J4458l0838
$$ 7603 17384 28891 43694 8878 -53521 -66534 -12689 -24471 -22959 -20992 -6534 -37372
16563c7372M009K4866p289l987L0228n225M7194J3159m4614k7600l8523L9674
$$ -37372 -33363 -8497 -15786 -19773 10455 5230 52424 65583 20969 -6631 -45154 -5480
16551e480O7730J6977k2351k0322m8828J3935K8200J2612r137n180l0219l618
$$ -5480 62250 79227 56876 36554 -12274 1661 29861 42473 33336 28156 -2063 -5681
16539e681N1451k3786o9337R687K0635J7134L224K7295q066k4881K2725M6781
$$ -5681 45770 21984 -47353 -37666 -17031 103 3327 30622 22556 -2325 20400 67181
16527F7181m9485O345j0605m9116j786L9058L1907j2274j7321k8435M42O3198
$$ 67181 17696 24041 13436 -35680 -37466 1592 33499 21225 3904 -24531 -24089 39109
16515C9109P584J3638l4510m3761J5661K7883n5981k3567j3520j8511K2024j4725
$$ 39109 46693 60331 25821 -17940 -2279 25604 -30377 -53944 -67464 -85975 -63951 -78676
16503g8676L2118k040j3415K5614N927J4070q640n3423L3753M6352l4744L6151
$$ -78676 -46558 -48598 -62013 -36399 -30472 -16402 -25042 -78465 -44712 1640 -33104 3047
16491C047r86l4494n033L8663L9519j6035k195n6384k9338k7131J556M2409j8533
$$ 3047 2061 -32433 -37466 1197 40716 24681 22486 -33898 -63236 -90367 -88811 -46402 -64935
16478f4935p812M625M2572q693P91J2507k3104m2963K7610N1504l396j4107K5626
$$ -64935 -72747 -68122 -25550 -34243 -33452 -20945 -44049 -87012 -59402 -7898 -11294 -25401 225
16465B25l988L4929k2953j7608k747M1751L8426K2953j8099r757j0389K3071l501
$$ 225 -3763 31166 8213 -9395 -12142 29609 68035 90988 72889 63132 52743 75814 72313
16452G2313q01n8212k7830q0315J1841K9276K1490L34Q777j8723k8601j9365P0431
$$ 72313 71512 13300 -14530 -94845 -83004 -53728 -32238 -31904 -23127 -41850 -70451 -89816 -19385
16439a9385j61M866M124m60J8087j0351L3970l0677j6257k4776K738k6234N7727
$$ -19385 -19546 -14680 -10556 -11016 7071 -3280 30690 13 -16244 -41020 -38282 -64516 -6789
16426f789P0418k9723J8495K0392k7585l2301M1833k3044l9881P947l2920L1009
$$ -6789 63629 33906 52401 72793 45208 12907 54740 31696 -8185 -238 -33158 -2149
16414b149K0475L6866J4012J7911r189O241j3977l2414o172N7016N536m5485l1449
$$ -2149 18326 55192 69204 87115 77926 84167 70190 37776 31604 88620 94156 48671 17222
16401A7222l0247n4901k3425L988r97M9469j8047r552O0641k6474L199o249L199
$$ 17222 -13025 -67926 -91351 -87363 -88360 -38891 -56938 -66490 -5849 -32323 -29124 -35373 -32174
16388c2174L7325J9367p796l2384K0679K3191m4259j6705O313R817K9082k0111
$$ -32174 5151 24518 16722 -15662 5017 28208 -16051 -32756 -26443 -16626 12456 -7655
16376g655j9010j9184K9123J5701L0603p92k6668J6011L7513J9791j2170p681
$$ -7655 -26665 -45849 -16726 -1025 29578 28786 2118 18129 55642 75433 63263 55582
16364E5582j1869j5692n8306J0223k0215m3702J3868J4719k8110J8111M81M3387
$$ 55582 43713 28021 -30285 -20062 -40277 -83979 -70111 -55392 -83502 -65391 -64910 -21523
16352b1523l6812l5896M4637M4200j9184q6537J9007N4912m120q265m156M3309
$$ -21523 -58335 -94231 -49594 -5394 -24578 -111115 -92108 -37196 -41316 -49581 -53737 -10428
16340a0428l6646j153p636j6706L2363K1490P337K1797J246j0758J9615j2366
$$ -10428 -47074 -48227 -55863 -72569 -40206 -18716 -11379 10418 11664 906 20521 8155
16328H155k7619n2086k4607K922K5832K3986O4972Q802l7655j3800J4748K3658
$$ 8155 -19464 -71550 -96157 -93235 -67403 -43417 21555 30357 -7298 -21098 -6350 17308
16316A7308k5321p4405K7988j650j3239P6136k927N1076O74m1623J9016K6964
$$ 17308 -8013 -82418 -54430 -56080 -69319 6817 3890 54966 55640 14017 33033 59997
16304E9997o2780j2517J7783J7571L357P886l3355r0735l6848M0598L2089l7278
$$ 59997 -2783 -15300 2483 20054 23411 31297 -2058 -92793 -129641 -89043 -56954 -94232
16292i4232j3184O7085L1596o213m3515o960K981J8727M4786L3678l866m5320
$$ -94232 -107416 -40331 -8735 -14948 -58463 -65423 -62442 -43715 1071 34749 30883 -14437
16280a4437m0987m7096J3633M9499n623K4770M7464K8886L5235o590p35J569j2161
$$ -14437 -55424 -102520 -88887 -39388 -45011 -20241 27223 56109 91344 84754 84019 85588 73427
16267G3427Q809j9791j2708m6129n6481l239Q432p726K732l295J4673k9308K197
$$ 73427 82236 62445 49737 3608 -52873 -56112 -47680 -55406 -52674 -55969 -41296 -70604 -68407
16254f8407M5398N1175R418M129j1931m1580J2052K2610M4568O3814J4546j04617
$$ -68407 -23009 28166 37584 41713 29782 -11798 254 22864 67432 131246 145792 41175
16242D1175q5543k849J6275n1500Q01M2810nO1559J3798l9159J9446m3415l1950
$$ 41175 -44368 -47217 -30942 -82442 -81641 -38831 -38836 22723 36521 -2638 16808 -26607 -58557
16229e8557r121J8388j1240M0593J1994j0507n3220J2395L4673J9494J9093L2734
$$ -58557 -67678 -49290 -60530 -19937 -7943 -18450 -71670 -59275 -24602 -5108 13985 46719
16217D6719K5758J4063n3521j4344k4102j7583r451l1648L8931Q0628r801J7225
$$ 46719 72477 86540 33019 18675 -5427 -23010 -32461 -64109 -25178 55450 45649 62874
16205F2874l4418p5203L4474O8990p288l9922J9099N552j1489j6855J1170q154
$$ 62874 28456 -46747 -12273 56717 49429 9507 28606 34158 22669 5814 16984 8830
16193H830K5487R079j0918J7024K2230k2183m5164n5921J1081R3417J9260K1904
$$ 8830 34317 43396 32478 49502 71732 49549 4385 -51536 -40455 52962 72222 94126
16181I4126M622j5863k6048N806j4195k7241n000k2754j4943N6836M9817L4990
$$ 94126 98748 82885 56837 62643 48448 21207 16207 -6547 -21490 35346 85163 120153
16169A20153m6394m4777p339P821j0684J1713j0536m2855n6291j1284Q961M1171
$$ 120153 73759 28982 21643 29464 18780 30493 19957 -22898 -79189 -90473 -81512 -40341
16157d0341K7009j554q512J3490J2685Q664k4042l3165k3098M2236K208J4359
$$ -40341 -13332 -14886 -23398 -9908 2777 11441 -12601 -45766 -68864 -26628 -24420 -10061
16145a0061R338K0185J6754J3409j5742k3323O6016q643p8658j2367r053n2564
$$ -10061 -723 19462 36216 49625 33883 10560 76576 67933 -10725 -23092 -32145 -84709
16133h4709P2016K6200O452l1110m1854M266L0487P346N5423j8918j555k2914
$$ -84709 -12693 13507 19959 -11151 -53005 -48739 -18252 -10906 44517 25599 24044 1130
16121A130J938K8840j3223l3939N0266m1994o5232j5704L2826J4149M1689Q357
$$ 1130 3068 31908 18685 -15254 35012 -6982 -72214 -87918 -55092 -40943 746 9103
16109I103K6177m1159k0836l267K7007J9197K2345j5567K7399J8575m5532o2810
$$ 9103 35280 -5879 -26715 -29982 -2975 16222 38567 23000 50399 68974 23442 -39368
16097c9368R50O2017N3914r55j4517k9792J4758M4998j3569k4217j6300m7364
$$ -39368 -38418 23599 77513 76558 62041 32249 47007 92005 78436 54219 37919 -9445
16085i445k6501J1683j8569j2201K837J2931l506J3687J9531N4877j1147n2679
$$ -9445 -35946 -24263 -42832 -55033 -52196 -39265 -42771 -29084 -9553 45324 34177 -18502
16073a8502J3144m9878j3697j2142J3439P1889K4806l3356m926R743j9827l2980
$$ -18502 -5358 -55236 -68933 -81075 -67636 4253 29059 -4297 -9223 520 -19307 -52287
16061e2287j4101K1131L2133j0723m000p98L0366R180l6366o935l2906j5204J7233
$$ -52287 -66388 -45257 -13124 -23847 -27847 -28645 1721 10901 -25465 -32400 -65306 -80510 -63277
16048f3277L4067K8034J2131l962J9941J4238o2319k604j1232M8192L5053m4071
$$ -63277 -29210 -1176 10955 6993 26934 41172 -21147 -23751 -34983 13209 48262 4191
16036D191N523l3211l615M6234n852K4426k3497L2020K1923J0749l5938J2340
$$ 4191 9714 -23497 -27112 19122 13270 37696 14199 46219 68142 78891 42953 55293
16024E5293L4837J5324k8213k4233n5814k2712L4980j5680l1538k6415J44J834
$$ 55293 90130 105454 77241 53008 -2806 -25518 9462 -6218 -37756 -64171 -64027 -62193
16012f2193P448k8538L2539J4405m0215j2438K3314M5599L6731J6502M5879n514
$$ -62193 -54745 -83283 -50744 -36339 -76554 -88992 -65678 -20079 16652 33154 79033 73519
16000G3519j5823p2726j8370K9930k0619J4107K3529M4442J4348J1838o1498j8959
$$ 73519 57696 -15030 -33400 -3470 -24089 -9982 13547 57989 72337 84175 22677 3718
15988C718j7926k6883M283j5621m1611M694P0577L2886m5207N116m5547J3442
$$ 3718 -14208 -41091 -36808 -52429 -94040 -89346 -18769 14117 -31090 -25974 -71521 -58079
15976e8079l152M4400O6217L6082P234j0844l0326n7750k525k8470m1269M7587
$$ -58079 -61231 -16831 49386 85468 92702 81858 51532 -6218 -8743 -37213 -78482 -30895
15964c0895L5434p347K5236M811l6592n7603K3864k858j1435R952Q096J383M2860
$$ -30895 4539 -2808 22428 27239 -9353 -66956 -43092 -45950 -57385 -47433 -39337 -37954 4906
15951D906L6486n181j979l0311j3900K0439j7638n4330K8060M5233L0579J6285
$$ 4906 41392 36211 34232 3921 -9979 10460 -7178 -61508 -33448 11785 42364 58649
15939E8649j5279j3827m990J15k0846L8647k9042k0010k5624r124K5211O2244
$$ 58649 43370 29543 24553 24668 3822 42469 13427 -6583 -32207 -41331 -16120 46124
15927D6124M3320K211J2609k6270k0181M3377l6098r1473j254N7971p3289k3270
$$ 46124 89444 91655 104264 77994 57813 101190 65092 -26381 -27635 30336 -42953 -66223
15915f6223L3863J065K5205L4296J9224l820j0822R949L1015l2738k2317m0899
$$ -66223 -32360 -31295 -6090 28206 47430 43610 32788 42737 73752 41014 18697 -22202
15903b2202j6751J554m7882M0310M8666K6991k722p8528j8188N031M308k3110
$$ -22202 -38953 -37399 -85281 -44971 3695 30686 27964 -50564 -68752 -63721 -59413 -82523
15891h2523M546r406M5983J4349o0453J4531L3970j8114N670M5761L6060j0076
$$ -82523 -77977 -87383 -41400 -27051 -87504 -72973 -39003 -57117 -51447 -5686 30374 20298
15879B0298J7880K215m2206k9503l3079k3165n9454L1477O0870J9165j9462o641
$$ 20298 38178 40393 -1813 -31316 -64395 -87560 -147014 -115537 -54667 -35502 -54964 -61605
15867f1605l3126R596J0112M3733J4107m760K4037j4636P019L2552K7999m4780
$$ -61605 -94731 -85135 -75023 -31290 -17183 -21943 2094 -12542 -5523 27029 55028 10248
15855A0248k3671K774q171j4020M4039K5689Q423j2623R801L044j7921L9205M4915
$$ 10248 -13423 -10649 -18820 -32840 11199 36888 45311 32688 42489 45533 27612 66817 111732
15842A11732j7106k7314p2420j654m4842k0093M427l6232j1237N8003K4270L600
$$ 111732 94626 67312 -5108 -6762 -51604 -71697 -67270 -103502 -114739 -56736 -32466 -28866
15830b8866k390j0900K3350M6931k8210l9325K3268K5599l6709l4386N2156Q094
$$ -28866 -31256 -42156 -18806 28125 -85 -39410 -16142 9457 -27252 -61638 -9482 -1388
15818a388j5988J1865j7316J2894j6536L6905J7774k6767j1636p727m705O795
$$ -1388 -17376 -5511 -22827 -9933 -26469 10436 28210 1443 -10193 -17920 -22625 -15830
15806a5830L3441J5097J7410k481N6078p909l2751K5470J6156n1220L0363K2953
$$ -15830 17611 32708 50118 47637 103715 95806 63055 88525 104681 53461 83824 106777
15794A06777j2558k9435O6091m1566k2530K4195J9606m2063l6048k3584n499k5897
$$ 106777 94219 64784 130875 89309 66779 90974 110580 68517 32469 8885 3386 -22511
15782b2511j2684j158J8062q615N277J4974m995q085l079j2468m639L2723J0669
$$ -22511 -35195 -36353 -18291 -26906 -21629 -6655 -11650 -19735 -22814 -35282 -39921 -7198 3471
15769C471j1486p696K3205k3706K9669J3364k9098m2488l5367N166J0630K1770
$$ 3471 -8015 -15711 7494 -16212 13457 26821 -2277 -44765 -80132 -74966 -64336 -42566
15757d2566k2914J8540L509k7657J9935J4538k6806K8096J8412r311K9339m435
$$ -42566 -65480 -46940 -43431 -71088 -51153 -36615 -63421 -35325 -16913 -26224 3115 -1320
15745a320J4438q441j6729J540J7822j1701m5312l1284L2925L8634N4240n454
$$ -1320 13118 4677 -12052 -10512 7310 -4391 -49703 -80987 -48062 -9428 44812 39358
15733C9358j4588j2978l7007J480k540n429J2943M8109o1281l7383J3054M1836
$$ 39358 24770 11792 -25215 -23735 -26275 -31704 -18761 29348 -31933 -69316 -56262 -14426
15721a4426k3242L297L977j2463J6381K8257J2146k0099J694P822r811k2240l6926
$$ -14426 -37668 -34371 -30394 -42857 -26476 1781 13927 -6172 -4478 3344 -6467 -28707 -65633
15708f5633k3653k7234o05O719O600M1006k430Q259L9277o486J2357J73k0734
$$ -65633 -89286 -116520 -117125 -110406 -103806 -62800 -65230 -56971 -17694 -24180 -11823 -11650 -32384
15695c2384q988L698j6594k4012M5948O9843k1216l5437K4051L683O8486l1169
$$ -32384 -41372 -37674 -54268 -78280 -32332 37511 16295 -19142 4909 8592 77078 45909
15683D5909k4479J6211j5339j9472j2271j4943l3572m7699m2818N5356j7694k0338
$$ 45909 21430 37641 22302 2830 -9441 -24384 -57956 -105655 -148473 -93117 -110811 -131149
15671a31149J7461J6487j9719l276J2227J22643J8697k2057n245M78r259M976
$$ -131149 -113688 -97201 -116920 -120196 -107969 14674 33371 11314 6069 6547 -2712 2264
15659B264l4536o1948M1390N9576p499j8401l1360K7576N0428k6246P867M4017
$$ 2264 -32272 -94220 -52830 6746 -753 -19154 -50514 -22938 27490 1244 9111 53128
15647E3128J7899n987j5012r130m6711l529J2935R265l636l7348j2826j0306K4093
$$ 53128 71027 65040 50028 40898 -5813 -9342 3593 12858 9222 -28126 -40952 -51258 -27165
15634b7165K296J2184k2745l7144J2037O145k243M3213L5718J3321k610j9210
$$ -27165 -24869 -12685 -35430 -72574 -60537 -54392 -56635 -13422 22296 35617 33007 13797
15622A3797o456l1406K1300j8494k8954L880O0158J5267l5684k2515p502J5301
$$ 13797 7341 -24065 -2765 -21259 -50213 -46333 13825 29092 -6592 -29107 -36609 -21308
15610b1308r452L8018M361k2273j248l251K0604j5169l610l4876n9720J7271R6620
$$ -21308 -30760 7258 11619 -10654 -11902 -15153 5451 -9718 -13328 -48204 -107924 -90653 5967
15597E967K203p7098L1995Q0348P649n7929O568L3257P177o4868n5381J1630J2646
$$ 5967 8170 -68928 -36933 43415 51064 -6865 -297 32960 40137 -24731 -80112 -68482 -55836
15584e5836K5466J7915m75k4254K0252k9316l9679j3319J177r84L5049M3794P49
$$ -55836 -30370 -12455 -12930 -37184 -16932 -46248 -85927 -99246 -98069 -99053 -64004 -20210 -19461
15571a9461k5307K2555k5130L8764J1110r907k5313n417Q492l798k9287o3714
$$ -19461 -44768 -22213 -47343 -8579 2531 -7376 -32689 -38106 -29614 -33412 -62699 -126413
15559a26413k2329P6075R6444M1732o6332l936j2492k1295J3431K5142Q995k6869
$$ -126413 -148742 -72667 23777 65509 -823 -4759 -17251 -38546 -25115 27 9022 -17847
15547a7847k9634N4559K5067l1142r84k5710l5210n288j1699j0611l0257K8961
$$ -17847 -47481 7078 32145 1003 19 -25691 -60901 -66189 -77888 -88499 -118756 -89795
15535h9795N8347M6375l328k3849l9715J8822k120k210n574J6898O6225l902J1622
$$ -89795 -31448 14927 11599 -12250 -51965 -33143 -35263 -37473 -43047 -26149 40076 36174 47796
15522D7796J4259n1725l5606l7535J2752j7621J6573L1266O4788l3689l6576K3955
$$ 47796 62055 10330 -25276 -62811 -50059 -67680 -51107 -19841 44947 11258 -25318 -1363
15510a363O950l7561l0429m296M343J2841K3992K3312L2170J3941o9477p0566
$$ -1363 5587 -31974 -62403 -66699 -62356 -49515 -25523 -2211 29959 43900 -25577 -96143
15498i6143K005J7856P0240K1938p318o3471K603p723J8277P3815J8735k8652
$$ -96143 -94138 -76282 -6042 15896 8578 -54893 -52290 -60013 -41736 32079 50814 22162
15486B2162m104m8288l2192m9389j1395j5285k1289N4679M7442N1630N4614j83
$$ 22162 18058 -30230 -62422 -111811 -123206 -138491 -159780 -105101 -57659 -6029 48585 48402
15474D8402n9647m2174l5422l4423P4132K5542p7932r798L7385O1368M5747M4031
$$ 48402 -11245 -53419 -88841 -123264 -49132 -23590 -101522 -111320 -73935 -12567 33180 77211
15462G7211l7371n987M9534o22o2073l7385K015N094L5941l363m9294L2517L6013
$$ 77211 39840 33853 83387 82765 20692 -16693 -14678 -9584 26357 22994 -26300 6217 42230
15449D2230q292k3997J3785n598k2081N868R143m1953K1823l561q620O2399o305
$$ 42230 33938 9941 23726 18128 -3953 1915 11058 -30895 -9072 -12633 -21253 41146 34841
15436C4841J8645K2450l468l6668n1126L2411L1871J6409m7480k1218P763J9275
$$ 34841 53486 75936 72468 35800 -15326 17085 48956 65365 17885 -3333 4430 23705
15424B3705N628j4829R051k940j8215N0420M4796m7406l2754K1459L3302R030
$$ 23705 29333 14504 23555 20615 2400 52820 97616 50210 17456 38915 72217 81247
15412H1247n8283l5536L1652O456p5L4395k1227J269Q302K4545j0798k1958j5738
$$ 81247 22964 -12572 19080 25536 25461 59856 38629 39898 48200 72745 61947 39989 24251
15399B4251j427k1486j2943j5042k9950k490l3376j8906M099n944l035N5714N7023
$$ 24251 22824 1338 -11605 -26647 -56597 -59087 -92463 -111369 -107270 -113214 -116249 -60535 -3512
15386c512M2417l8787k7807M1604K6258n3598m0388r659J8788L0813N602n826
$$ -3512 38905 118 -27689 13915 40173 -13425 -53813 -63472 -44684 -13871 -8269 -14095
15374a4095l3237q952N221L9182M7460k2548k628j3529K3986M263k0011j7921
$$ -14095 -47332 -56284 -51063 -11881 35579 13031 10403 -3126 20860 25123 5112 -12809
15362a2809m0627M2675K377j4935M825l7684n6104L3209Q7264L6827o1131L4327
$$ -12809 -53436 -10761 -8384 -23319 -18494 -56178 -112282 -79073 8191 45018 -16113 18214
15350A8214l967n9291k1099M6274M6440k4547p4624m5311Q901N6734K9908N0089
$$ 18214 14247 -45044 -66143 -19869 26571 2024 -72600 -117911 -109010 -52276 -22368 27721
15338B7721J427l1544L134m5883k1852R246K6431O9817L086n611J1186l7249n2624
$$ 27721 29148 -2396 738 -45145 -66997 -57751 -31320 38497 41583 35972 47158 9909 -42715
15325d2715L7019M9576l7962M4558M6412l2970l9906l8130o485J1705j5800O6140
$$ -42715 -5696 43880 5918 50476 96888 63918 24012 -14118 -20603 -8898 -24698 41442
15313D1442M7161l8123j7703M3358n163l5492m6755l1301j9424K1840j2094p368
$$ 41442 88603 50480 32777 76135 70972 35480 -11275 -42576 -62000 -40160 -52254 -59622
15301e9622L4799P0123j6738j3677J1895J2079q167k2026K7083N193P01J5183
$$ -59622 -24823 45300 28562 14885 26780 38859 30692 8666 35749 40942 41643 56826
15289E6826J7588n7637M586K1250K6705J6167J2702k2466J145n6083o3715j5384
$$ 56826 74414 16777 21363 42613 69318 85485 98187 75721 76866 20783 -42932 -58316
15277e8316K288Q639J3895O6729j6244l0381k915p871N778J4841j0633O45K3852
$$ -58316 -56028 -47389 -33494 33235 16991 -13390 -16305 -24176 -18398 -3557 -14190 -13545 10307
15264A0307j9720K5561j8568l3013K0917L086O2648J7266j3861J6227M3748J513
$$ 10307 -9413 16148 -2420 -35433 -14516 -11430 51218 68484 54623 70850 114598 116111
15252A16111r4780r188N489K7302J8208j0266M403L2108j6200j9900j6225l791
$$ 116111 21331 12143 17632 44934 63142 52876 57279 89387 73187 53287 37062 33271
15240C3271l909k600N714m3427k7774Q635l8272J1161K8817k3475Q372k418R867
$$ 33271 29362 26762 32476 -10951 -38725 -30090 -68362 -57201 -28384 -51859 -43487 -45905 -36038
15227c6038k0996j0125M3134K6293K871L4998J6912M3946m1560n9387K3094K8348
$$ -36038 -57034 -67159 -24025 2268 5139 40137 57049 100995 59435 48 23142 51490
15215E1490m3730l2462J68N8622J0020l9753j1904k2981N1796J031p963K1106
$$ 51490 7760 -24702 -24534 34088 44108 4355 -7549 -30530 21266 22297 14334 35440
15203C5440J379m590k076l709L2035l6139N767q294k3080K1962J2201J8503j5161
$$ 35440 36819 32229 30153 26444 58479 22340 28107 19813 -3267 18695 30896 49399 34238
15190C4238k3508k1404k9356J0527L8516L9881P280l0070k9195m118Q399k2680
$$ 34238 10730 -10674 -40030 -29503 9013 48894 56174 26104 -3091 -7209 1190 -21490
15178b1490J8352K4335M1925j8140k3893m0048l3099m4291j5097J4446N3895J39
$$ -21490 -3138 21197 63122 44982 21089 -18959 -52058 -96349 -111446 -97000 -43105 -42966
15166d2966L3345p196J0288J4109k3697l5282p91J3949L8472l2493k6685J5830
$$ -42966 -9621 -16817 -6529 7580 -16117 -51399 -52190 -38241 231 -32262 -58947 -43117
15154d3117O9948o486j6391J4103k9989k1019K7426l7359O6963N4519m7369o4428
$$ -43117 26831 20345 3954 18057 -11932 -32951 -5525 -42884 24079 78598 31229 -33199
15142c3199l5194j0682j5121L5462K8214K9550K2322O1104j4488o1041j9566k905
$$ -33199 -68393 -79075 -94196 -58734 -30520 -970 21352 82456 67968 6927 -12639 -15544
15130a5544n3637k0851J0772N0313N4246K0349m7176K0174k681j3863n553N0900
$$ -15544 -69181 -90032 -79260 -28947 25299 45648 -1528 18646 15965 2102 -3451 47449
15118D7449J0413m7883o3208Q301J5159q173l9326m436L6507J5276M5323P711
$$ 47449 57862 9979 -53229 -44928 -29769 -37942 -77268 -81704 -45197 -29921 15402 23113
15106B3113m4157L824L1315N489q918r408j6477N709M7248K1339j7782L633J1095
$$ 23113 -21044 -17220 14095 19584 10666 1258 -15219 -9510 37738 59077 41295 44928 56023
15093E6023l5045m6536J4319L7189J033l7363o7558k7184O5270N6957J6298O4559
$$ 56023 20978 -25558 -11239 25950 26983 -10380 -77938 -105122 -39852 17105 33403 97962
15081I7962J0169m3731k6892J1801m8304N8035L6513k0366K8515L0454l9850J3296
$$ 97962 108131 64400 37508 49309 1005 59040 95553 75187 103702 134156 94306 107602
15069A07602n2571m3751q441M2099j7365o8472k4168L3238K7646K0820N7281m2707
$$ 107602 55031 11280 2839 44938 27573 -40899 -65067 -31829 -4183 16637 73918 31211
15057C1211k3365l1659j6588L731k7886J3251K1871L6574N7349J5128k0518p8575
$$ 31211 7846 -23813 -40401 -36670 -64556 -51305 -29434 7140 64489 79617 59099 -19476
15045a9476j4853K4410j2361L0040L290r388J4976J4906j0380N5172P639n2963
$$ -19476 -34329 -9919 -22280 7760 11050 1662 16638 31544 21164 76336 83975 31012
15033C1012l26n584j686r661l3483J6934j203m2085J6605Q642R599L2722J9144
$$ 31012 30686 25102 23416 13755 -19728 -2794 -3997 -46082 -29477 -20835 -11236 21486 40630
15020D0630m847K5500l5007l1449k238k577k210K0074j3717j2229j2501J6374
$$ 40630 35783 61283 26276 -5173 -7411 -9988 -12198 7876 -5841 -18070 -30571 -14197
15008a4197K9206l0462K9678J2n0600j7567j4854J0817M4691K9588L6841L23M8435
$$ -14197 15009 -15453 14225 14237 -36363 -53930 -68784 -57967 -13276 16312 53153 53476 101911
14995A01911j7090k3159m7450L3417p080n3824l2143J1308N9165L7828n6879j0746
$$ 101911 84821 61662 14212 47629 40549 -13275 -45418 -34110 25055 62883 6004 -4742
14983d742M7945M7594m1556l6471l9490L3506O3354K5909J0464k9083m9046l7009
$$ -4742 43203 90797 49241 12770 -26720 6786 70140 96049 106513 77430 28384 -8625
14971h625k6509L3162q72J5914m5315m80M4121K3890m6863o4724R272J4353M48
$$ -8625 -35134 -1972 -2844 13070 -32245 -32725 11396 35286 -11577 -76301 -67029 -52676 -52228
14958e2228m425L1871m207j7190j4600k2j1544L485K0655L1243k1231r681n204
$$ -52228 -56653 -24782 -28989 -46179 -60779 -60801 -72345 -68860 -48205 -16962 -38193 -47874 -53078
14945e3078K235l2480J8882J6333L4618J3989J938M2174L3198k207l5530J5632
$$ -53078 -50843 -83323 -64441 -48108 -13490 499 2437 44611 77809 75602 40072 55704
14933E5704Q144N349K3013Q721o3004p187J1443J2171m4138k9704n092N8062J2258
$$ 55704 63848 69197 92210 100931 37927 30740 42183 54354 10216 -19488 -24580 33482 45740
14920D5740l1573O864j0741j547k3023L34l2252J3249N1134j0781L1198j7834
$$ 45740 14167 21031 10290 8743 -14280 -13946 -46198 -32949 18185 7404 38602 20768
14908B0768J3801K2549K651J3640l0074m6702l5330M7163J0066n1693k1110m927
$$ 20768 34569 57118 59769 73409 43335 -3367 -38697 8466 18532 -33161 -54271 -59198
14896e9198L0974m0073J5419R293K5652L863J3148J8033n776L7033N7714m7355
$$ -59198 -28224 -68297 -52878 -43585 -17933 -14070 -922 17111 11335 48368 106082 58727
14884E8727l6324J5839p237m2822J8874J1390j4364M0457N9135o3732q1072n2401
$$ 58727 22403 38242 31005 -11817 7057 18447 4083 44540 103675 39943 -41129 -93530
14872i3530O121K5141O6163J6387j1737n5576L1967J1958n4947m990O0065J4361
$$ -93530 -87409 -62268 3895 20282 8545 -47031 -15064 -3106 -58053 -63043 -2978 11383
14860A1383k3708L2270o014M8606J8264m4803k0055K9600j6302J637J9782L0721
$$ 11383 -12325 19945 13931 62537 80801 35998 15943 45543 29241 30878 50660 81381
14848H1381M761m2314p8399p0046Q501Q5028P997l9685j3784r628M7653m09J6461
$$ 81381 86142 43828 -34571 -104617 -96116 -11088 -3091 -42776 -56560 -66188 -18535 -18944 -2483
14835b483k7824m4501K4861J4365l7337n666L0899K1966m2730J9250K3713K566
$$ -2483 -30307 -74808 -49947 -35582 -72919 -78585 -47686 -25720 -68450 -49200 -25487 -22921
14823b2921K4690M1663L6869n207N779k0237j9849m0231k7069j8766J0367K1189
$$ -22921 1769 43432 80301 75094 80873 60636 40787 556 -26513 -45279 -34912 -13723
14811a3723j8361l5299M7992L8029j8835o3701M4530O8376j4804o2046L0618M4257
$$ -13723 -32084 -67383 -19391 18638 -197 -63898 -19368 49008 34204 -27842 2776 47033
14799D7033j4237k5546J2090k9379J1318m1088k3923J5816N4724k5739l6206J3333
$$ 47033 32796 7250 19340 -10039 1279 -39809 -63732 -47916 6808 -18931 -55137 -41804
14787d1804k5415K7807K3373k2717J5837J3568M207L7942j3274r566N94m0890
$$ -41804 -67219 -39412 -16039 -38756 -22919 -9351 -5144 32798 19524 9958 10552 -30338
14775c0338L16r23J2671L4763L4738j2618j7600k8684L4528K4488m0122o5868
$$ -30338 -30022 -30945 -18274 16489 51227 38609 21009 -7675 26853 51341 11219 -54649
14763e4649k6168O342M862l976K2046M0178K6338j5654k7610n2815j50k688L2664
$$ -54649 -80817 -74475 -69613 -73589 -51543 -11365 14973 -681 -28291 -81106 -81256 -83944 -51280
14750e1280j4850L1678J8533o3472k6589J7927k0510k0411J4103L9152m185l4781
$$ -51280 -66130 -34452 -15919 -79391 -105980 -88053 -108563 -128974 -114871 -75719 -79904 -114685
14738a14685L4362n127M2482O2428J9532J878k7977j2732L9006K5918n8714j8517
$$ -114685 -80323 -85450 -42968 19460 38992 40870 12893 161 39167 65085 6371 -12146
14726a2146O603p738k7700k1426M0855N6675m151p628k3684Q549P6404J6143l2988
$$ -12146 -5543 -13281 -40981 -62407 -21552 35123 30972 23344 -340 8209 84613 100756 67768
14713F7768j3628L503l5352l7608m1546J7345K8382m8216M2593N1311k780Q635
$$ 67768 54140 57643 22291 -15317 -56863 -39518 -11136 -59352 -16759 34552 31772 40407
14701D0407J2431L598j1429L9677j866K4903K2793o1308j05766J7939K7863L791
$$ 40407 52838 56436 45007 84684 82818 107721 130514 69206 -36560 -18621 9242 13033
14689A3033O2523N477l4645m0029o0916K039o823P8761Q8878j0934M5619L6124
$$ 13033 75556 81033 46388 6359 -54557 -52518 -59341 19420 108298 97364 142983 179107
14677A79107r802n6686M243L5720k4213k0210l4752m7040k7748q404L68K7531
$$ 179107 169305 112619 116862 152582 128369 108159 73407 26367 -1381 -9785 -9417 18114
14665A8114K3019L5496m3998k3733j425q238n1429l4011K2028M4904M92k0708
$$ 18114 41133 76629 32631 8898 7473 -765 -52194 -86205 -64177 -19273 -18781 -39489
14653c9489l9026Q244K300N3448L0679J504p7821L7350J1320l0369j1713J8813
$$ -39489 -78515 -70271 -67971 -14523 16156 17660 -60161 -22811 -11491 -41860 -53573 -34760
14641c4760L3791J3439K4474N239j7755n4173O493k035J5995r3861p468n627j5031
$$ -34760 -969 12470 36944 42183 24428 -29745 -23252 -25287 -9292 -103153 -110621 -116248 -131279
14628a31279N3693K1926O8396N5552l9273L184K7253L8759k3454l6649l1564Q772
$$ -131279 -77586 -55660 12736 68288 29015 32199 59452 98211 74757 38108 6544 15316
14616A5316m1960L7915M5232M1439O224p4854j1803K8497n2928J683k5119n6632
$$ 15316 -26644 11271 56503 97942 104166 29312 17509 46006 -6922 -5239 -30358 -86990
14604h6990P112k500j3099r639O044K4199k2517J9959L5667p071l9732l5988K0978
$$ -86990 -79878 -82378 -95477 -105116 -99072 -74873 -97390 -77431 -41764 -48835 -88567 -124555 -103577
14591a03577K6557N6068K8699K1837m6847K5019R839l4416M143R10M6340L0164
$$ -103577 -77020 -20952 7747 29584 -17263 7756 17595 -16821 -12678 -11768 34572 64736
14579F4736l534o6510k9796M4130M2259j5588o9619k4110K1684J8173q887l4840
$$ 64736 61202 -5308 -35104 9026 51285 35697 -33922 -58032 -36348 -18175 -27062 -61902
14567f1902m971O4231L9096M7839n7259k2321L2917K811L1885l6262q4575k7081
$$ -61902 -66873 -2642 36454 84293 27034 4713 37630 40441 72326 36064 -48511 -75592
14555g5592J9251M7264J5380l6720k5031P72L5535J4606o333k8081j8515J4212
$$ -75592 -56341 -9077 6303 -30417 -55448 -54676 -19141 -4535 -10868 -38949 -57464 -43252
14543d3252M979J053L0672Q700L5407r840j9112o9478m9405N4443J5849L505K4269
$$ -43252 -38273 -37220 -6548 2152 37559 27719 8607 -60871 -110276 -55833 -39984 -36479 -12210
14530a2210N3646K3568j2240o913M381K9132j4766l5920p6776l905N289N0307
$$ -12210 41436 65004 52764 45851 50232 79364 64598 28678 -48098 -52003 -46714 3593
14518C593O4576j2282n0136l8678L315R328l679L6437M704l1354p848p440L9969
$$ 3593 68169 55887 5751 -32927 -29612 -20284 -23963 12474 17178 -14176 -22024 -29464 10505
14505A0505M8771J5748k4020j11J979P436k8721n32k3769J9997k9211j4K226N9732
$$ 10505 59276 75024 51004 50893 52872 60308 31587 31055 7286 27283 -1928 -1942 284 60016
14491F0016N0503o6161l6294l3204j5666K8235M8902M308j6953j6051L2417k0591
$$ 60016 110519 44358 8064 -25140 -40806 -12571 36331 40639 23686 7635 40052 19461
14479A9461J3455N1128M639m7845k5499n818k493k2157J6564M9715L8105j2324
$$ 19461 32916 84044 88683 40838 15339 9521 7028 -15129 1435 51150 89255 76931
14467G6931m9225L1614j8106K8639n780m414l7892k9309J5932P9784N8579m1555
$$ 76931 27706 59320 41214 69853 64073 59659 21767 -7542 8390 88174 146753 105198
14455A05198o4738k1360N2049O53l3273M234o885l0490J2329j4419j5083j003
$$ 105198 40460 19100 71149 71802 38529 42763 35878 5388 17717 3298 -11785 -12788
14443a2788M3181M3372k7297p1757k9473L1843P085n0854M907P0629N9883N3488
$$ -12788 30393 73765 46468 -25289 -54762 -22919 -15834 -66688 -61781 8848 68731 122219
14431A22219p629n8922l9657l8545K0448J0147l9585k2304j3080J4663K1459M0407
$$ 122219 114590 55668 16011 -22534 -2086 8061 -31524 -53828 -66908 -52245 -30786 9621
14419I621J2793J862K3263M6041q283l6396n632J9393J5850J387m417L428l6146
$$ 9621 22414 24276 47539 93580 85297 48901 43269 62662 78512 79899 75482 78910 42764
14406D2764j1755m2321q374L0593O301m2843P775j638K9591K3673j1995J9086
$$ 42764 31009 -11312 -19686 10907 17208 -25635 -17860 -19498 10093 33766 21771 40857
14394D0857r903j8040K2288l7179j9379K6400O2752k7366l3931R918O6013p047
$$ 40857 30954 12914 35202 -1977 -21356 5044 67796 40430 6499 16417 82430 75383
14382G5383k5483m0371k7999N348K7657p757J8691J3868l0657l4395M3739J3551
$$ 75383 49900 9529 -18470 -13122 14535 6778 25469 39337 8680 -25715 18024 31575
14370C1575m4261L5513K9973j7132J5120N5194J143J1736K5797k5575j13294n3575
$$ 31575 -12686 22827 52800 35668 50788 105982 107125 118861 144658 119083 5789 -47786
14358d7786M160J8267R1384O6123L4604K0597M9087K01K7138P0585L4968l249
$$ -47786 -43626 -25359 66025 132148 166752 187349 236436 236637 263775 334360 369328 366079
14346C66079j1121j9473k2061m6156k5732m9544j6501J843l94p7032o7069J7767
$$ 366079 354958 335485 313424 267268 241536 191992 175491 177334 176940 99908 32839 50606
14334E0606J12522K0617m4224m8737l9719k2332N854k1649M863m9306n2399L8356
$$ 50606 163128 183745 139521 90784 51065 28733 34587 12938 17801 -31505 -83904 -45548
14322d5548K8711l965j5738J440N0703O2179K2342j1777m7762k612N6375N5229
$$ -45548 -16837 -20802 -36540 -35100 15603 77782 100124 88347 40585 37973 94348 149577
14310A49577O572m1188m5635k3714J1575L1536m8679r232k1097m8944j100K8875
$$ 149577 156149 114961 69326 45612 57187 88723 40044 30812 9715 -39229 -40329 -11454
14298a1454M3229J8731J696n7847m5104l646J5409k3118N028M4610L1447L9580
$$ -11454 31775 50506 52202 -5645 -50749 -54395 -38986 -62104 -57076 -12466 18981 58561
14286E8561l0609m1219M1480j0641m5713J5400j8173L942M1885j7090K8399l5811
$$ 58561 27952 -13267 28213 17572 -28141 -12741 -30914 -26972 14913 -2177 26222 -9589
14274i589m1754k8465p986N4293k5976P9762Q4199p5321j11660j6259M9778J5530
$$ -9589 -51343 -79808 -87794 -33501 -59477 20285 104484 29163 -82497 -98756 -48978 -33448
14262c3448J8867J2101K7918l839K1950K9064k4273O982J70N704n5330l5747j2191
$$ -33448 -14581 -2480 25438 21599 43549 72613 48340 55322 55492 61196 5866 -29881 -42072
14249d2072k0421K7283M3315j8150J4179m456r34o037K8640k0779M9700q475K737
$$ -42072 -62493 -35210 8105 -10045 4134 -322 -1256 -7293 21347 568 50268 41793 44530
14236D4530n346K098M1562J9434m1506p9100O1860N0406k0903o3243n9867p0219
$$ 44530 39184 41282 82844 102278 60772 -18328 43532 93938 73035 9792 -50075 -120294
14224a20294l0242R9482O5828l025m331j4194K6045J3299J6824r954m2666n5498
$$ -120294 -150536 -51054 14774 11749 7418 -6776 19269 32568 49392 39438 -3228 -58726
14212e8726K2066L2758J1759K5849k223n6322K842K4447j773k0185l4949L8653
$$ -58726 -36660 -3902 7857 33706 31483 -24839 -21997 2450 677 -19508 -54457 -15804
14200a5804K9931j5165J9008k1414m7214j544j472j3212j7498P2542L2489m5527
$$ -15804 14127 -1038 17970 -3444 -50658 -52202 -53674 -66886 -84384 -11842 20647 -24880
14188b4880m8027l5364J8792K4841R991N5026N9073m9619J0237o882O7010J1212
$$ -24880 -72907 -108271 -89479 -64638 -54647 379 59452 9833 20070 13188 80198 91410
14176I1410k0870J3660J0710j8727N379k2618J7969l2162k1338o8762j0556M7431
$$ 91410 70540 84200 94910 76183 81562 58944 76913 44751 23413 -45349 -55905 -8474
14164h474K9547n0704j0173K0985k364L0470L7872l4184n3026k1912K6513N3625
$$ -8474 21073 -29631 -39804 -18819 -21183 9287 47159 12975 -40051 -61963 -35450 18175
14152A8175J5320m0931j0277K1592K7312l3735k1878M4270O747L8041L198m9782
$$ 18175 33495 -7436 -17713 3879 31191 -2544 -24422 19848 26595 64636 67834 18052
14140A8052k3000K8690O8449N9947J605n6232k4247m1318l517K0038J3763l0400
$$ 18052 -4948 23742 92191 152138 153743 97511 73264 31946 28429 48467 62230 31830
14128C1830l2730j8554J4296R959r55J059K091J0197l023m045j1210K32o7964
$$ 31830 -900 -19454 -5158 4801 3846 4905 6996 17193 14170 10125 -1085 -853 -68817
14115f8817M4635J2783j0196J5777P461K4271L5152q709m6953r589j3778m6455
$$ -68817 -24182 -11399 -21595 -5818 1643 25914 61066 52357 5404 -4185 -17963 -64418
14103f4418K4332N0419O0109q956j9955K1768K243l3516M4399J0304j0121q3987
$$ -64418 -40086 10333 70442 61486 41531 63299 65542 32026 76425 86729 76608 -7379
14091g379l6527M0284l3743k683M9781K2734L243J9723J6404n18j910m0341l6191
$$ -7379 -43906 -3622 -37365 -40048 9733 32467 35710 55433 71837 71319 69409 29068 -7123
14078g123k9809j3389P346R2537M6326J534j4492l4416r108K688K6234J1987J724
$$ -7123 -36932 -50321 -42975 49562 95888 97422 82930 48514 39406 42094 68328 80315 82039
14065H2039m4551j7171N2485l6330k592n919m5681j7303L6674O7569K0229l8722
$$ 82039 37488 20317 72802 36472 33880 27961 -17720 -35023 1651 69220 89449 50727
14053E0727J8319K1702J6651M8727j2311k2247L2313J01119M7878M7372O2730
$$ 50727 69046 90748 107399 156126 143815 121568 153881 255000 302878 350250 412980
14042D12980P8846J36272J13696N7449J15484J29043J24993P7452O5045K8668
$$ 412980 491826 628098 741794 799243 914727 1043770 1168763 1246215 1311260 1339928
14032A339928j05667j30549o7565q1983q6998j46705j31158r1359p9109j6320
$$ 1339928 1234261 1103712 1036147 954164 867166 720461 589303 497944 418835 402515
14022D02515k4466o4715Q312Q900N5908R1597N9546J2584M9483R3460O1864J07058
$$ 402515 378049 313334 321646 330546 386454 478051 537597 550181 599664 693124 754988 862046
14010H62046R9691J3611L7136k0333r1071r4871o1498j10875j17456p7219j09508
$$ 862046 961737 975348 1012484 992151 901080 806209 744711 633836 516380 439161 329653
13999C29653r257q2035q0935l5880J8557l093p0794n742Q2938N192o255j8036
$$ 329653 320396 238361 157426 121546 140103 137010 66216 60474 143412 148604 142349 124313
13987A24313j0652o037l9156l7420l4846k2234J0231k6919M3833M6869J9508M2217
$$ 124313 113661 107624 68468 31048 -3798 -26032 -15801 -42720 1113 47982 67490 109707
13975A09707L5212l9221p8388k5705j8910K6154K187L4951J543J5937m2956l1053
$$ 109707 144919 105698 27310 1605 -17305 8849 11036 45987 47530 63467 20511 -10542
13963a0542k3381K7599j9141L0270L4890O744m1520m5077J157J634M1675K6479
$$ -10542 -33923 -6324 -25465 4805 39695 46439 4919 -40158 -39001 -37367 4308 30787
13951C0787j217j85P665o5918k872M7306k627m5376M6506K6217P369K9064J8385
$$ 30787 29570 29385 37050 -28868 -31740 15566 12939 -32437 14069 40286 47655 76719 95104
13938I5104k4483l0902m122L3107N3720n4675n6468N578M4977J4739p080K4046
$$ 95104 70621 39719 35597 68704 122424 67749 11281 16859 61836 76575 69495 93541
13926I3541o048J6273N6667j1721K4764N2607L0592L1846M8518J32030R1103R5873
$$ 93541 87493 103766 160433 148712 173476 226083 256675 288521 337039 469069 560172 656045
13914F56045J06194R0008J36462J51708J46844J13003l0674l8821j9458q6692
$$ 656045 762239 852247 988709 1140417 1287261 1400264 1369590 1330769 1311311 1224619
13904A224619j46430j43523j13013r1297j10608p2070k7821R387m1987j7194n0563
$$ 1224619 1078189 934666 821653 730356 619748 547678 519857 529244 487257 470063 419500
13893D19500j09000p2758L8743P57L6029j8836J2596R963p7533Q670P8997M8963
$$ 419500 310500 237742 276485 277242 313271 294435 307031 316994 239461 248131 327128 376091
13881C76091M0879K5361J38086J28579L8968K6624P3191K8163n9782p1244p1622
$$ 376091 416970 442331 580417 708996 747964 774588 847779 875942 816160 744916 673294
13870F73294r1373k9343l0400p0570o0801J4073l9935o9906J6069J50K2816J6772
$$ 673294 581921 552578 522178 451608 390807 404880 364945 295039 311108 311258 334074 350846
13858C50846k8331o6275p312M3366n213l6731n8840n6052j6746l2307R73J5567
$$ 350846 322515 256240 248928 292294 287081 250350 191510 135458 118712 86405 87378 102945
13846A02945k4383l2760n7372M2881L666m115N0398L2885l1067k8648M061J6056
$$ 102945 78562 45802 -11570 31311 34977 30862 81260 114145 83078 54430 58491 74547
13834G4547p690j9881l1665j1564O47O4222P7586M197m1708m2208Q484K7069K0845
$$ 74547 66857 46976 15311 3747 4394 68616 146202 150399 108691 66483 74967 102036 122881
13821A22881l0071m06k2251J67K454J6162J5036j7813O200O3932J2118p6150l0157
$$ 122881 92810 92404 70153 70320 72774 88936 103972 86159 92359 156291 168409 92259 62102
13808F2102L2596J1218j74L0683L479l7203K8382j887R242k7744n0595l4361K5853
$$ 62102 94698 105916 105742 136425 139904 102701 131083 129196 138438 110694 60099 25738 51591
13795E1591P142N0265N4440L1874q838j7905l9518l6123j1538N4249l5901l5698
$$ 51591 58733 108998 163438 195312 186474 168569 129051 92928 81390 135639 99738 64040
13783F4040O361J3544l2749o5915M8946K0422j0234M9493K1257l8367p0278m5557
$$ 64040 70401 83945 51196 -14719 34227 54649 44415 93908 115165 76798 6520 -39037
13771c9037N3615P002K5907K5745J641K5448k016p0163j4521J0622j4106L2725
$$ -39037 14578 21580 47487 73232 74873 100321 98305 28142 13621 24243 10137 42862
13759D2862r53J5835J8280m6730k6178k2147Q254J2084L7493J1538J0018K3910
$$ 42862 41909 57744 76024 29294 3116 -19031 -10777 1307 38800 50338 60356 84266
13747H4266J1582k4902j387n8277o8668k3234L7926P0M856K6921P767L722r362
$$ 84266 95848 70946 69559 11282 -57386 -80620 -42694 -42624 -37768 -10847 -3080 642 -8720
13734h720J990l9826L1731R477Q470J0511m7539k8523M8255N0044K5461m4824
$$ -8720 -6730 -46556 -14825 -5348 3122 13633 -33906 -62429 -14174 35870 61331 16507
13722A6507j9383j5352L4676K0061m0252k8578J3963J1788k4391j1496j9712L2287
$$ 16507 -2876 -18228 16448 36509 -3743 -32321 -18358 -6570 -30961 -42457 -62169 -29882
13710b9882K0879L8255R91p79K6790l1163K5703p95K1567L250K1959q127k1918
$$ -29882 -9003 29252 30243 29464 56254 25091 50794 49999 71566 74816 96775 88648 66730
13697F6730L5787m162n6026j2309l4853k7279J9389J7582k731J9707K5853N0583
$$ 66730 102517 98355 42329 30020 -4833 -32112 -12723 4859 2128 21835 47688 98271
13685I8271p086j7322k0813k6566K4576k8363k2973q479O443L203O3311o5146
$$ 98271 91185 73863 53050 26484 51060 22697 -276 -8755 -2312 891 64202 -944
13673i44M612Q2951J983j7767n4120k9957l143M0721K9210J9803M2426k448k9928
$$ -944 3668 86619 88602 70835 16715 -13242 -16385 24336 53546 73349 115775 113327 83399
13660H3399L8091L7075n980q7n1103p6612M1374L698l1204o454j3447P220J5018
$$ 83399 121490 158565 152585 152498 101395 24783 66157 69855 38651 32197 18750 25970 40988
13647D0988m66L0109j1037j2701o6679o8584o552K8673M9975K1775j4298l2052
$$ 40988 40522 70631 59594 46893 -19786 -88370 -94922 -66249 -16274 5501 -8797 -40849
13635d0849n6100l8147M6299L8046K3432P716k1361m2699q038L6289J3366L902
$$ -40849 -96949 -135096 -88797 -50751 -27319 -19603 -40964 -83663 -91701 -55412 -42046 -38144
13623c8144M0501J0373k9286J407J027N4762L0626J3122k0881n9373k2387M4304
$$ -38144 2357 12730 -16556 -15149 -14122 40640 71266 84388 63507 4134 -18253 26051
13611B6051m184n4236k4484r715J9528O1235j6498L1093q683l8671l3433K1964
$$ 26051 21867 -32369 -56853 -66568 -47040 14195 -2303 28790 20107 -18564 -51997 -30033
13599c0033M2046j900j6451p691k5969L4554K1809j9527L0857L1036m2349l1439
$$ -30033 12013 10113 -6338 -14029 -39998 -5444 16365 -3162 27695 58731 16382 -15057
13587a5057L385N325J2145k0506p026K5215j8447k7004L6187j3745m4814L8599
$$ -15057 -11672 -6347 5798 -14708 -21734 3481 -14966 -41970 -5783 -19528 -64342 -25743
13575b5743L6492L4348O8317m7967n1913o724K6041J7327K875j9469j853M5572
$$ -25743 10749 45097 113414 65447 13534 6810 32851 50178 53053 33584 31731 77303
13563G7303J9261m0019l5971J4810p060m6623j054J835J5876n5817j850j2909
$$ 77303 96564 56545 20574 35384 28324 -18299 -19353 -17518 -1642 -57459 -59309 -72218
13551g2218K483J3484L088j64p375N6198L1464J1534N194J4547l5892m5529l905
$$ -72218 -69735 -56251 -53163 -53327 -60702 -4504 26960 38494 43688 58235 22343 -23186 -27091
13538b7091L4144R379L215j5084q236K9215k4147J6405O8229K8526k7068l9092
$$ -27091 7053 16432 19647 4563 -3673 25542 1395 17800 86029 114555 87487 48395
13526D8395j4951N3192N1818K780o3676O158M5483M216J5742O659o2327R559Q0419
$$ 48395 33444 86636 138454 141234 77558 83716 129199 133415 149157 155816 93489 103048 183467
13513A83467r3603p4068M1786L3882O0796l3563k4952P132l1133j6942P894L0481
$$ 183467 89864 15796 57582 91464 152260 118697 93745 100877 69744 52802 60696 91177
13501I1177L2403P19k8492k217J24j5939l4465L426l3159J9244M463l8052N321
$$ 91177 123580 124299 95807 93590 93714 77775 43310 46736 13577 32821 37284 -768 4553
13488D553l2978q076j0659J9842P4621J6554k4533M0814J9573l0467j9918k1995
$$ 4553 -28425 -36501 -47160 -27318 47303 63857 39324 80138 99711 69244 49326 27331
13476B7331J1268M3031J6832j890r500j8536J670L2574Q590j00444n8079N4627
$$ 27331 38599 81630 98462 96572 87072 68536 70206 102780 111370 10926 -47153 7474
13464G474M865L5432l0686j5917l5364m3050N1333L3107k1588J2955L9873N0802
$$ 7474 12339 47771 17085 1168 -34196 -77246 -25913 7194 -14394 -1439 38434 89236
13452H9236p5855j2696j6949J4917L6052J5413Q419K9322M254J0762r166l1653
$$ 89236 13381 685 -16264 -1347 34705 50118 58537 87859 92113 102875 93709 62056
13440F2056R724P718j0719k1204L4268K6729K1099k7721J3875O0901M4302q340
$$ 62056 71780 79498 68779 47575 81843 108572 129671 101950 115825 176726 221028 212688
13428B12688k3789j8220m1613j3311J0606m169K3871k157k8282P616J9391j2121
$$ 212688 188899 170679 129066 115755 126361 122192 146063 143906 115624 123240 142631 130510
13416A30510m2514L651K3947j6242K7803k3447k6015k1099j2522L8462J6689j8330
$$ 130510 87996 91647 115594 99352 127155 103708 77693 56594 44072 82534 99223 80893
13404H0893M9694l641K9674J3517L1165O2146M2978K1693O7234O5012o459J0860
$$ 80893 130587 126946 156620 170137 201302 263448 306426 328119 395353 460365 453906 464766
13392D64766m1893j6095k6478r073q709j747p6985m0904P104J103o4655n9948
$$ 464766 422873 406778 380300 371227 362518 360771 283786 242882 249986 251089 186434 126486
13380A26486N695L1862K0627k6415K3680l5653l4871k9574J7673J2587j2761k4046
$$ 126486 132181 164043 184670 158255 181935 146282 111411 81837 99510 112097 99336 75290
13368G5290N7424J7034J835j0514k4168K0472K9223J9748k3556L9270Q0433K0807
$$ 75290 132714 149748 151583 141069 116901 137373 166596 186344 162788 202058 282491 303298
13356C03298k9335m8697k1293j4452k9167p0237l0013j1865J3001K6539L1658
$$ 303298 273963 225266 203973 189521 160354 90117 60104 48239 61240 87779 119437
13345A19437O104j3698o0m3248l3734J8033O3765P039o8010l2637P175k9159N7799
$$ 119437 125541 111843 111783 68535 34801 52834 116599 123638 55628 22991 30166 1007 58806
13332E8806R4982k1392o8388j5298J3467k2850J8583O4742L0185k2144n4579J3256
$$ 58806 153788 132396 64008 48710 62177 39327 57910 122652 152837 130693 76114 89370
13320H9370O0303k1935J3308O1630L6126M5550L3073J6758J1204q46O1699l7473
$$ 89370 149673 127738 141046 202676 238802 284352 317425 334183 345387 344541 406240 368767
13308C68767j7150l3577m1131m8706l5493j6635l8229j4488m6400j1562Q382M3717
$$ 368767 351617 318040 276909 228203 192710 176075 137846 123358 76958 65396 73778 117495
13296A17495N8919M3781K4218J2375M509k7037k7097l7858l478p688K1367N7183
$$ 117495 176414 220195 244413 256788 261297 234260 207163 169305 165827 158139 179506 236689
13284B36689M8647N1019M1378M9282P9109O2003K7455l7497n1562j9741q868m1387
$$ 236689 285336 336355 377733 427015 506124 568127 595582 558085 506523 486782 477914 436527
13272D36527q8770l1332l6084p1264m4142J7630J153K7842q734k5602l8080r101
$$ 436527 347757 316425 280341 209077 164935 182565 183718 211560 202826 177224 139144 130043
13260A30043k3597q606L8800J6801J9948R680j0681L5568L4398j3540K469J3217
$$ 130043 106446 97840 136640 153441 173389 183069 172388 207956 242354 228814 231283 244500
13248B44500M1997J6722j2856n186p864N1654M8314N79J1049q1406j13531p8806
$$ 244500 286497 303219 290363 285177 277313 328967 377281 377860 388909 307503 193972 115166
13236A15166l7254L2122M8821J7600K2608O081j3351n2881l4372m0436j5523K681
$$ 115166 77912 110034 158855 176455 199063 205144 191793 138912 104540 64104 48581 51262
13224E1262L8717n479K2077m586L5371K7899n1901m7259l2818J486O9061j0459
$$ 51262 89979 84500 106577 101991 137362 165261 113360 66101 33283 34769 103830 93371
13212I3371J0783m093j3279K9720L057j0804m2633q837P7229K0694l3176l8129
$$ 93371 104154 100061 86782 116502 119559 108755 66122 57285 134514 155208 122032 83903
13200H3903j5764J4910j8363o4932j5145N3131K2026j6568j7824L3136l6133p1704
$$ 83903 68139 83049 64686 -246 -15391 37740 59766 43198 25374 58510 22377 -49327
13188d9327J0980N9827M8677J4375Q280K9748j2527o993O280J9967k5483j5700
$$ -49327 -38347 21480 70157 84532 92812 122560 110033 103040 109320 129287 103804 88104
13176H8104J4196L503p082J664q887l0022o1391J0625J3423O2035O1062K7067
$$ 88104 102300 105803 98721 100385 91498 61476 85 10710 24133 86168 147230 174297
13164A74297n1233l5417m7692n950N5440N1516K6807k3714p266n2191j9494J6859
$$ 174297 123064 87647 39955 34005 89445 140961 167768 144054 136788 84597 65103 81962
13152H1962J4337k4372k9944K8429j3476J6495L234k1658N65K6568P5573j8083
$$ 81962 96299 71927 41983 70412 56936 73431 76665 55007 55572 82140 157713 139630
13140A39630K506k3951j4989l7720k7344O708N8987L5664J6975l220k4708q7484
$$ 139630 142136 118185 103196 65476 38132 44840 103827 139491 156466 153246 128538 41054
13128D1054n2714L5293M8302L0704M729k1358m1422J1132j9577K3040j6327k2090
$$ 41054 -11660 23633 71935 102639 107368 86010 44588 55720 36143 59183 42856 20766
13116B0766K9150K5376l7236J8817N3100J3571O749k9718K6621n335K7291m5329
$$ 20766 49916 75292 38056 56873 109973 123544 130293 100575 127196 121861 149152 103823
13104A03823o47J4344N204k5331m5291O2391O1375J296L660j975j6382n3899j0407
$$ 103823 103176 117520 122724 97393 52102 114493 175868 177164 180824 178849 162467 108568 98161
13091I8161j2863n5193K9241L3749J5386k9382n3881m7616L6557O7837J1028M8390
$$ 98161 85298 30105 59346 93095 108481 79099 25218 -22398 14159 81996 93024 141414
13079A41414L8331l4086o9456k3912l2570r813L2052M4548L7179N408l3222p643
$$ 141414 179745 145659 76203 52291 19721 9908 41960 86508 123687 129095 95873 88230
13067H8230R857O676j3815J3857J6812k1077J7948k4208M2339N1057R88l6307
$$ 88230 98087 104763 90948 104805 121617 100540 118488 94280 136619 187676 188664 152357
13055A52357K137l92k2575k7561L7363L5942k3443m2208n2020q206j4484M9260
$$ 152357 154494 154102 131527 103966 141329 177271 153828 111620 59600 51394 36910 86170
13043H6170P849N677K6077J528m4043m044J8393j5811N0076k9970m6925j191K1338
$$ 86170 94019 99696 125773 127301 83258 79214 97607 81796 131872 101902 54977 53786 75124
13030G5124J8028L1362l2229j6809m6683p116K6483J9940J8823o8095k0539J6451
$$ 75124 93152 124514 92285 75476 28793 21677 48160 68100 86923 18828 -1711 14740
13018A4740R800K2844K1875j4037j1228j1865M1043p656l2299L6773M2327J7573
$$ 14740 24540 47384 69259 55222 43994 32129 73172 65516 33217 69990 112317 129890
13006A29890k5117k1183K7141j24K2597J0869l6945m0999N660r592J4510J6837
$$ 129890 104773 83590 110731 110607 133204 144073 107128 66129 71789 62197 76707 93544
12994I3544k7354J8942j4126K095n3396J7067K7781N608n3283k7007K0773R9098
$$ 93544 66190 85132 71006 73101 19705 36772 64553 70161 16878 -10129 10644 109742
12982A09742J29603J5686J1404K4582j948o441J7165K6801N9450P6449J31713
$$ 109742 239345 255031 266435 291017 289069 282628 299793 326594 386044 462493 594206
12971E94206R0232O1360J40661N6974k0966q7255j43393j33312r2829n0581n2369
$$ 594206 684438 745798 886459 943433 922467 835212 691819 558507 465678 415097 362728
12960C62728k8007l1697O0072n2989J6452P2680K4130K7443M0418R5510R0263
$$ 362728 334721 303024 363096 310107 326559 399239 423369 450812 491230 586740 677003
12949F77003n036M7536L1906Q6762j571M2337K7931M9568N8585N837M7072N6388
$$ 677003 671967 719503 751409 838171 836600 878937 906868 956436 1015021 1020858 1067930 1124318
12937A124318Q125j9024p2955o6391q2964r8795n3185J3116k0700q4430q0639
$$ 1124318 1132443 1113419 1040464 974073 891109 792314 739129 752245 731545 647115 566476
12926E66476j7338o884O7078M6633j3660j3423r254o4247N2701K4216N881N3340
$$ 566476 549138 542254 609332 655965 642305 628882 619628 555381 608082 632298 638179 691519
12914F91519P0349J12660J04337R1541L7059M325k6465p0389j00612j15781j11766
$$ 691519 761868 874528 978865 1070406 1107465 1111790 1085325 1014936 914324 798543 686777
12903F86777r4532j37158j4576k3657m5380R043K8933k4260o7475p4338j532N6292
$$ 686777 592245 455087 440511 416854 371474 380517 409450 385190 317715 243377 241845 298137
12891B98137j8509j3985N1997l2869j9264l8653j5926j4089r047J2734j3176N2705
$$ 298137 279628 265643 317640 284771 265507 226854 210928 196839 187792 200526 187350 240055
12879B40055L5999m8111k8285j962N0148L2861k6338o3447k8346j0271L2345N4050
$$ 240055 276054 227943 199658 197696 247844 280705 254367 190920 162574 152303 184648 238698
12867B38698J3676p6374l3251J278j3340J7203M9603Q8195j6441k1217j7692K863
$$ 238698 252374 176000 142749 144027 130687 147890 197493 285688 269247 248030 230338 233201
12855B33201O628m181N8m0768j2126L9034N6038K9843k3553k9411o0085J7240
$$ 233201 239829 235648 235706 194938 182812 221846 277884 307727 284174 254763 194678 211918
12843B11918M1828r012J6866n834p737J0588j6661k7153P3553K6705k5227M6240
$$ 211918 253746 244734 261600 255766 248029 258617 241956 214803 288356 315061 289834 336074
12831C36074K353l9264K8653L9992N2971N6179j2835q9384k8162l4623k2017K3683
$$ 336074 338427 299163 327816 367808 420779 476958 464123 374739 346577 311954 289937 313620
12819C13620J651L2650m5585o351o358l6373K9756L312J8476Q060N6913J3079
$$ 313620 315271 347921 302336 295985 289627 253254 283010 286322 304798 312858 369771 382850
12807C82850m5381j6257M6410j8946l0645k4289Q119N7621J7803K9933m0204n4351
$$ 382850 337469 321212 367622 348676 318031 293742 301861 359482 377285 407218 367014 312663
12795C12663m0796K7287J8476r876n0438K2295K8392n0820m7126L4902P0172k2583
$$ 312663 271867 299154 317630 307754 257316 279611 308003 257183 210057 244959 315131 292548
12783B92548L0262M0138J9626P491p0181J8000L0368K2519J3391L7974l6768j1454
$$ 292548 322810 362948 382574 390065 319884 337884 368252 390771 404162 442136 405368 393914
12771C93914m2581m5998j6616M1007K5595l8428k6753K3237Q281n1592o864j6511
$$ 393914 351333 305335 288719 329726 355321 316893 290140 313377 321658 270066 263202 246691
12759B46691o7432m2302K6360R9072M2858j9570k9618j8467K2473J8988M5288
$$ 246691 179259 136957 163317 262389 305247 285677 256059 237592 260065 279053 324341
12748C24341K4093j4081j6728p198k8197J8343J5865m1862n1708K5071N227n205
$$ 324341 348434 334353 317625 310427 282230 300573 316438 274576 222868 247939 253166 247961
12736B47961l9977l1004O030j0306q294M1872J7172n6964m7121J1833J2949k337
$$ 247961 207984 176980 183010 172704 164410 206282 223454 166490 119369 131202 144151 141814
12724A41814k0580l8541K7745P0443P4059K0211J0046L3063r664J6536l412K4455
$$ 141814 121234 82693 110438 180881 254940 275151 285197 318260 308596 325132 321720 346175
12712C46175q4l8483o3512m007K5699L3321L8918p308m389L8217M3172O006j2237
$$ 346175 346091 307608 244096 240089 265788 299109 338027 330719 326330 364547 407719 413725 401488
12699D01488P926m086k2843N4067j3150N8548N9274K7268L6748M681o2012M289
$$ 401488 409414 405328 382485 436552 423402 481950 541224 568492 605240 609921 547909 552198
12687E52198l2191M6190J42118J35750M1637O2891J29502J65379J89979J82855
$$ 552198 520007 566197 708315 844065 885702 948593 1078095 1243474 1433453 1616308
12677A616308K07062Q9015J04045K4581p8678q6745j25277j63097j93085j58232
$$ 1616308 1823370 1912385 2016430 2041011 1962333 1875588 1750311 1587214 1394129 1235897
12667A235897j59732j35779o8859n6980o908o1949n9000M806R747n0931N067O8490
$$ 1235897 1076165 940386 871527 814547 807639 745690 686690 691496 701243 650312 655379 723869
12655G23869M9007l098l4210J3527K8073K8683L3263L7872L82P0031J05234J8579
$$ 723869 772876 769778 735568 749095 777168 805851 839114 876986 877368 947399 1052633 1071212
12643A071212k2389o9879L8033n310k1691J173k447K3660K8449L0080J3515J5496
$$ 1071212 1048823 978944 1016977 1011667 989976 991149 988702 1012362 1040811 1070891 1084406 1099902
12631A099902M8656j1325n1582q3748O2682P4612O4506J2019O5284K4400j4512
$$ 1099902 1148558 1137233 1085651 1001903 1064585 1139197 1203703 1215722 1281006 1305406 1290894
12620A290894o584k9044l4953j7271K0606j599O1018M4547K1266Q010l7497j4540
$$ 1290894 1284310 1255266 1220313 1203042 1223648 1222049 1283067 1327614 1348880 1356890 1319393 1304853
12608A304853K8907M3603j4811j9110o487j0148p2864l0748N8510L3292N5937
$$ 1304853 1333760 1377363 1362552 1343442 1336955 1326807 1253943 1223195 1281705 1314997 1370934
12597A370934l95O302M2536N5869K651L6618N0123R1612J8641M972O2683P8057
$$ 1370934 1370539 1376841 1419377 1475246 1477897 1514515 1564638 1656250 1674891 1679863 1742546 1820603
12585A820603Q6171N593l6488o1518o6195K1427J7309R8670R6720J288L3102Q6331
$$ 1820603 1906774 1912367 1875879 1814361 1748166 1769593 1786902 1885572 1982292 1983580 2016682 2103013
12573B103013K8098M297P9181P2411Q6824P4310R4319J23144R1743R2443K4920
$$ 2103013 2131111 2135408 2214589 2287000 2373824 2448134 2542453 2665597 2757340 2849783 2874703
12562B874703P7096J29061P2591R0184Q8653R7123J00953J64105K15696J65337
$$ 2874703 2951799 3080860 3153451 3243635 3332288 3429411 3530364 3694469 3910165 4075502
12552D075502K35875K05888J87934K76115K78060K94496L49080L53104M73347
$$ 4075502 4311377 4517265 4705199 4981314 5259374 5553870 5902950 6256054 6729401
12543F729401N19467N59106O95236P68734R10544J036706J261538J450818J673624
$$ 6729401 7248868 7807974 8503210 9271944 10182488 11219194 12480732 13931550 15605174
12534A5605174J843660K042348K337515K837320L446581M364793N591319P192104
$$ 15605174 17448834 19491182 21828697 24666017 28112598 32477391 38068710 45260814
12526D5260814R362948J2308296J6016354K0214258K4005187K5363702K1758274
$$ 45260814 54623762 66932058 82948412 103162670 127167857 152531559 174289833
12519A74289833J1815293k731542j5986828k3008320k3411812j9891037j5186396
$$ 174289833 186105126 183373584 167386756 144378436 120966624 101075587 85889191
12512H5889191j0713197o989888l971519j584121L77430K169300L774796N171384
$$ 85889191 75175994 68186106 64214587 62630466 63007896 65177196 68951992 74123376
12504G4123376O358711P333394Q010584Q311718Q436066Q496752Q596180Q731750
$$ 74123376 80482087 87815481 95826065 104137783 112573849 121070601 129666781 138398531
12496A38398531Q898867Q825190Q561332P882027O505753M552571K085763p34718
$$ 138398531 147297398 156122588 164683920 172565947 179071700 183624271 185710034 184975316
12488A84975316l507616n843555p469912q461636q868082q812180q443654p961685
$$ 184975316 181467700 175624145 168154233 159692597 150824515 142012335 133568681 125606996
12480A25606996p471466p150751o901094o744519o627542o313185n720828m798723
$$ 125606996 118135530 110984779 104083685 97339166 90711624 84398439 78677611 73878888
12472G3878888l683641k374961p64100J087064L295213N817970Q825020J2370803
$$ 73878888 70195247 67820286 67056186 68143250 71438463 77256433 86081453 98452256
12464I8452256J6368270J9967951K1562271J9170081J1388370j139404j4680584
$$ 98452256 114820526 134788477 156350748 175520829 186909199 185769795 171089211
12457A71089211k4153914k6924747k4609971k0140240j5563673j1787012q851443
$$ 171089211 146935297 120010550 95400579 75260339 59696666 47909654 39058211
12450C9058211o716945n138109l983559l141262k456395j976684j614421j367617
$$ 39058211 32341266 27203157 23219598 20078336 17621941 15645257 14030836 12663219
12442A2663219j147364q80491p21397o28883m93500m37796m38970m59793n60066
$$ 12663219 11515855 10635364 9913967 9285084 8791584 8353788 7914818 7455025 6894959
12433F894959n71969n72988m19286k90268k23893j50953j48726k50962k56243
$$ 6894959 6322990 5750002 5330716 5040448 4816555 4665602 4516876 4265914 4009671
12424D009671j68775q1802n8948r1301j38474p4240j03300r0877l5087j06713
$$ 4009671 3840896 3759094 3700146 3608845 3470371 3396131 3292831 3201954 3166867 3060154
12414C060154j6877j01834n2800j24385j46818j03332j34071q2594q2767n8265
$$ 3060154 3043277 2941443 2888643 2764258 2617440 2514108 2380037 2297443 2214676 2156411
12404B156411J6254m7145k9801l5725q1800r2153k9891k0859O0639L2790L3441
$$ 2156411 2172665 2125520 2095719 2059994 1978194 1886041 1856150 1835291 1895930 1928720 1962161
12393A962161M2249K6695O626K6503N4903J15985K03462J79990J37739K6116l6275
$$ 1962161 2004410 2031105 2037731 2064234 2119137 2235122 2438584 2618574 2756313 2782429 2746154
12382B746154N387r29j04514j50147j19514j60588j61475j57030j58757k08612
$$ 2746154 2751541 2750612 2646098 2495951 2376437 2215849 2054374 1897344 1738587 1529975
12372A529975j02572n1491n7745L620M2989J474O080q1142j01187n6404j3878
$$ 1529975 1427403 1375912 1318167 1321787 1364776 1366250 1372330 1291188 1190001 1133597 1119719
12361A119719l3295j5982O8704l9947k4783K0347m146q381r934M8208N6822O5851
$$ 1119719 1086424 1070442 1139146 1099199 1074416 1094763 1090617 1082236 1072302 1120510 1177332 1243183
12349A243183O592K315L177j7159m9279J3125O4618P416k508o432n0305m7664
$$ 1243183 1249775 1252090 1255267 1238108 1188829 1201954 1266572 1273988 1271480 1265048 1214743 1167079
12337A167079Q0448K4275l1059L7015k3670o8986j809K7586l3732j0640O5303
$$ 1167079 1247527 1271802 1240743 1277758 1254088 1185102 1183293 1210879 1177147 1166507 1231810
12326A231810J096k3603N0474J007R47L8634M1478R256M2228L5503R4716P7092
$$ 1231810 1232906 1209303 1259777 1260784 1261731 1300365 1341843 1351099 1393327 1428830 1523546 1600638
12314A600638P4263J22613J49640J60107J14732J13653K24811K80449J53422N9566
$$ 1600638 1674901 1797514 1947154 2107261 2221993 2335646 2560457 2840906 2994328 3053894
12304C053894J41245R0732P4796R1858M7323M3789O9931M4405J3459N9142Q3141
$$ 3053894 3195139 3285871 3360667 3452525 3499848 3543637 3613568 3657973 3671432 3730574 3813715
12293C813715J63046K22530K38937K62489L12780L60488M14845M47689N55025
$$ 3813715 3976761 4199291 4438228 4700717 5013497 5373985 5788830 6236519 6791544
12284F791544O59596P32603Q44212J067887J252246J507161J873700K227846K496085
$$ 6791544 7451140 8183743 9027955 10095842 11348088 12855249 14728949 16956795 19452880
12275A9452880K768486L089581L309447L643032L949963M509121N534565P209684
$$ 19452880 22221366 25310947 28620394 32263426 36213389 40722510 46257075 53466759
12267E3466759J0064536J4315235J9842057K6027366L1509749L4812407L6303917
$$ 53466759 63531295 77846530 97688587 123715953 155225702 190038109 226342026
12260B26342026L5134484K9630160J9648945P585013m787599j7167767k7958788
$$ 226342026 261476510 291106670 310755615 318340628 313553029 296385262 268426474
12253B68426474l5516004l8279363l7291912l3927919k9259853k2963845j6277067
$$ 268426474 232910470 194631107 157339195 123411276 94151423 71187578 54910511
12246E4910511j0905490p283188n070119l756826l072970k718666k502028k313020
$$ 54910511 44005021 36721833 31651714 27894888 24821918 22103252 19601224 17288204
12238A7288204k107606j888862j729319j581009j361995j169730q72074p09148
$$ 17288204 15180598 13291736 11562417 9981408 8619413 7449683 6577609 5868461
12230E868461n76206m34088l75059k70524k93556l15203k31303j75405j42796
$$ 5868461 5292255 4858167 4483108 4212584 3919028 3603825 3372522 3197117 3054321
12221C054321j33672j06499j27631j18380j50747j19515p0768p2812n2538j11985
$$ 3054321 2920649 2814150 2686519 2568139 2417392 2297877 2227109 2154297 2101759 1989774
12211A989774n7085o5228j18191p2748r2430j37077r4743p9363l4198k0420l8404
$$ 1989774 1932689 1867461 1749270 1676522 1584092 1447015 1352272 1272909 1238711 1218291 1179887
12200A179887p2073r5619k2446m9577l3470j5333N5782K9364j4483j9647q820
$$ 1179887 1107814 1012195 989749 940172 906702 891369 947151 976515 962032 942385 933565
12189I33565j7550l8403r085k8298p6422m9566J5433M5702k8474j8005m1760j212
$$ 933565 916015 877612 868527 840229 763807 714241 729674 775376 746902 728897 687137 685925
12177F85925O6228M4436K2907K0720k448q942p119J6782l5878o1645k5701o1077
$$ 685925 752153 796589 819496 840216 837768 828826 821707 838489 802611 740966 715265 654188
12165F54188n6046L7966N8703l0133l3258L7397M2474L1735j6304m4597j17812
$$ 654188 598142 636108 694811 664678 631420 668817 711291 743026 726722 682125 564313
12154E64313o4916r49k8171J243j4193l3273m8886J2836L8098J0493k7659K8588
$$ 564313 499397 498448 470277 471520 457327 424054 375168 388004 426102 436595 408936 437524
12142D37524r744n9614J2350l645k2952J7807R8862Q3109k1101P505K883l1409
$$ 437524 427780 368166 380516 376871 353919 371726 470588 553697 532596 540101 542984 511575
12130E11575j0427Q92R231K1394k5811N4311Q39R981P1445K3742n0440j8708m3270
$$ 511575 501148 502040 511271 532665 506854 561165 562004 571985 643430 667172 616732 598024 554754
12117E54754p1066o6556q6014o1004j2320k2005l1599J1095J7312k8678l8920
$$ 554754 483688 417132 331118 270114 257794 235789 204190 215285 232597 203919 164999
12106A64999n4064j4307J9071J3485K8667j3685n632j2456L6L5601J4147j6235
$$ 164999 110935 96628 115699 129184 157851 144166 138534 126078 126114 161715 175862 159627
12094A59627j8996L5556l4758n8463P8110M7378K1154K957r922m2623j6070k7186
$$ 159627 140631 176187 141429 82966 161076 208454 229608 232565 222643 180020 163950 136764
12082A36764J3592K1485q17K0792J00976P9521R0848M2198K6939N6592P8610J01656
$$ 136764 150356 171841 171024 191816 292792 372313 463161 505359 532298 588890 667500 769156
12070G69156J25862M9025M4611P2422L8069r02Q4974N176j8557j3477j13327j29155
$$ 769156 895018 944043 988654 1061076 1099145 1098243 1183217 1188393 1169836 1156359 1043032 913877
12058I13877j09993o3005n7670l5889r1438l0678K6417O3424L8377J2155K7636
$$ 913877 803884 740879 683209 647320 555882 525204 551621 615045 653422 665577 693213
12047F93213O9834O6956J7830J13284J32190J29822O5397J5561O6698J26037J32059
$$ 693213 763047 830003 847833 961117 1093307 1223129 1288526 1304087 1370785 1496822 1628881
12036A628881J56807O2525m8163r4964j64023j21102n2983j07973j9058J4004
$$ 1628881 1785688 1848213 1800050 1705086 1541063 1419961 1366978 1259005 1239947 1253951
12026A253951J05335J09980J18383J07372J18288P5918n0298j40206j51861j57511
$$ 1253951 1359286 1469266 1587649 1695021 1813309 1889227 1838929 1698723 1546862 1389351
12016A389351k41990j48531r5779l7329M9437L7817R4467O0965J15773J40015
$$ 1389351 1147361 998830 903051 865722 915159 952976 1047443 1108408 1224181 1364196
12006A364196J62028R7884J11157M2331r4673q6409j02830j43830j00259m6966
$$ 1364196 1526224 1624108 1735265 1777596 1682923 1596514 1493684 1349854 1249595 1202629
11996A202629p6588k7812N0926M9610J02857O0650N7614Q181n6747r2970r2033
$$ 1202629 1126041 1098229 1149155 1198765 1301622 1362272 1419886 1428067 1371320 1278350 1186317
11985A186317r2650j04074j38220j39521j10183n6576p2803r7317M6209K9613
$$ 1186317 1093667 989593 851373 711852 601669 545093 472290 374973 421182 450795
11975D50795j1657P2300n4135m6599l4981j1172j1911o286J9314Q3495R5040R0862
$$ 450795 439138 511438 457303 410704 375723 364551 352640 346354 365668 449163 544203 635065
11963F35065J01067J28011P4212P8078L3030q6472j35301j99605j67585j36677
$$ 635065 736132 864143 938355 1016433 1049463 962991 827690 628085 460500 323823
11953C23823m7698n0260p2463o17J4911K5002k3296Q332O9119J185K5454Q5487
$$ 323823 276125 225865 153402 152785 167696 192698 169402 177734 246853 248038 273492 358979
11941C58979M4998n4590k9510m4149k263l6688j07346o3490l1081K9332k9531
$$ 358979 403977 349387 319877 275728 273465 236777 129431 65941 34860 64192 34661
11930C4661p8435j1180N0249K1137J752O124O6014N0616m934j4438N5243J1702
$$ 34661 -43774 -54954 -4705 16432 18184 24308 90322 140938 136004 121566 176809 188511
11918A88511k9000L1375M5775R8685L1668J9229P5973N8292R6776Q20j3139K2148
$$ 188511 159511 190886 236661 335346 367014 386243 462216 520508 617284 618104 604965 627113
11906F27113m5086j09697j06210r9468p9682n1362n5199m1941L3153M4854k0841
$$ 627113 582027 472330 366120 266652 186970 135608 80409 38468 71621 116475 95634
11895I5634n6668l452J8651N8159L0929l7796k8448M3012k093m8406J01419N7486
$$ 95634 38966 35514 54165 112324 143253 105457 77009 120021 117928 69522 170941 228427
11883B28427J4483k9293k731P4508K2614N0753J8780k8058n4091j6722q1183o26
$$ 228427 242910 213617 210886 285394 308008 358761 377541 349483 295392 278670 197487 196861
11871A96861K9653k6920m7093m4743k2563k5130p3187p789O6021M2606l5585n6210
$$ 196861 226514 199594 152501 107758 85195 60065 -13122 -20911 45110 87716 52131 -4079
11859d079K7678P495k5948j9824O4251P309j1088j1735M6907L6167J9901K7114
$$ -4079 23599 31094 5146 -14678 49573 56882 45794 34059 80966 117133 137034 164148
11847A64148j2241Q9625P7166L6586O0394J08577J36745J12539N3669J59990K35912
$$ 164148 151907 241532 318698 355284 415678 524255 661000 773539 827208 987198 1223110
11836A223110J95849J22537M4819M5977n2626j06849j27694k06192k29887j75134
$$ 1223110 1418959 1541496 1586315 1632292 1579666 1472817 1345123 1138931 909044 733910
11826G33910j40613j00950j02730p3099p8202o0872m4047p5322p1571q816N6639
$$ 733910 593297 492347 389617 316518 238316 177444 133397 58075 -13496 -22312 34327
11815C4327k4270m1179j1199O041J5919K6043J50l928q730R079M3404n0308m7566
$$ 34327 10057 -31122 -42321 -36280 -20361 5682 5832 1904 -6826 2253 45657 -4651 -52217
11802e2217J9075N588K1030L6201Q855J1653M787O660L9410O0903L8042q739m2090
$$ -52217 -33142 -27554 -6524 29677 38532 50185 54972 61632 101042 161945 199987 191248 149158
11789A49158j2471k8741N0052J1077m007k7248J2832L3530L564n7030j9566n0968
$$ 149158 136687 107946 157998 169075 165068 137820 150652 184182 187746 130716 111150 60182
11777F0182k3060L9683J9815m3178q6649j5050K3287J9152L8975n9503j5202K9994
$$ 60182 37122 76805 96620 53442 -33207 -48257 -24970 -5818 33157 -26346 -41548 -11554
11765a1554J9674p467l6487m7082M2083L5231k9016o25R714K4500n355k4584K9955
$$ -11554 8120 653 -35834 -82916 -40833 -5602 -34618 -35243 -25529 -1029 -6384 -30968 -1013
11752a013M6838K0829L2265k0763j5180k2078l334R1510L4381n2742j6989m8293
$$ -1013 45825 66654 98919 78156 62976 40898 37564 129074 163455 110713 93724 45431
11740D5431m6904L7447L2528l075J1446k5482j0886j8196p852k1719j9784k0405
$$ 45431 -1473 35974 68502 65427 76873 51391 40505 22309 14457 -7262 -27046 -47451
11728d7451l472L0742M854L9050k5845j5284q596j9319K8736J0930n88j2904m0305
$$ -47451 -50923 -20181 -15327 23723 -2122 -17406 -26002 -45321 -16585 -5655 -6243 -19147 -59452
11715e9452M747J5236K8846K7542L3167J532m735l4650r723j6454J8552p708M191
$$ -59452 -54705 -39469 -10623 16919 50086 51618 46883 12233 2510 -13944 4608 -3100 1091
11702A091l2167p1925q3019N9670L3617r978K4702K0235M5083L025m561J1091
$$ 1091 -31076 -103001 -186020 -126350 -92733 -102711 -78009 -57774 -12691 -9666 -14227 -3136
11690c136j6459L1485K8611m7397l3738P5025k6391n6787r83J5173l6482N547
$$ -3136 -19595 11890 40501 -6896 -40634 34391 8000 -48787 -49770 -34597 -71079 -65532
11678f5532M1126J8103k0596L2663J2594l5022m7649k0524r859N9609L0001O0683
$$ -65532 -24406 -6303 -26899 5764 18358 -16664 -64313 -84837 -94696 -35087 -5086 55597
11666E5597J5444J6352j7726l8713j8100l7045l5769Q773n79J9712L8054L2140
$$ 55597 71041 87393 69667 30954 12854 -24191 -59960 -51187 -51766 -32054 6000 38140
11654C8140L615K3887k3585o3204m751L1862k7250P883j0842k2565j2770l3529
$$ 38140 41755 65642 42057 -21147 -25898 5964 -21286 -13403 -24245 -46810 -59580 -93109
11642i3109N6969N6850m961N39L4374k9950o5807m1451M5856M2242r456o093K3953
$$ -93109 -36140 20710 15749 16288 50662 20712 -45095 -86546 -40690 1552 -7904 -13997 9956
11629I956l2513n2062j7813J7098K2465j7458M144J6228J401J3291l7118j9894
$$ 9956 -22557 -74619 -92432 -75334 -52869 -70327 -66183 -49955 -48554 -35263 -72381 -92275
11617i2275J0700L6788M2640k0453j421p54r394J7116j075j2372L1664P863k3140
$$ -92275 -81575 -44787 -2147 -22600 -24021 -24775 -34169 -17053 -18128 -30500 1164 9027 -14113
11604a4113J9301K7476m961L000Q336k045L033j9517J1178k5267L855k8013k0233
$$ -14113 5188 32664 27703 30703 39039 36994 40027 20510 31688 6421 10276 -17737 -37970
11591c7970O3517K2062J862q859J2807K2536M412o7795k2592O7565Q563J415k498
$$ -37970 25547 47609 49471 40612 53419 75955 80367 12572 -10020 57545 66108 67523 65025
11578F5025L659l9530J9064J9316J8235M653l4012l9045l1525r775N8946K190
$$ 65025 68684 29154 48218 67534 85769 90422 56410 17365 -14160 -23935 35011 37201
11566C7201J2766J1480n6727l4231j5344K167N2437J0499K1400o302q752n7509
$$ 37201 49967 61447 4720 -29511 -44855 -42688 9749 20248 41648 35346 26594 -30915
11554c0915m2860M4451N4375o737M5590M472m5029n2163k2211R347J2265o510
$$ -30915 -73775 -29324 25051 18314 63904 68376 23347 -28816 -51027 -41680 -29415 -35925
11542c5925k3630j5051M5207K0695N0279L8980J3211n1881m5692J763J8934m8159
$$ -35925 -59555 -74606 -29399 -8704 41575 80555 93766 41885 -3807 -2044 16890 -31269
11530c1269L5080L1923o137Q557o931R672O696p730m8029k0412K6736l877L4917
$$ -31269 3811 35734 29597 38154 31223 40895 47591 39861 -8168 -28580 -1844 -5721 29196
11517B9196J38j1966j1629k1039q44J5811N2645M1459p942l1005m6810Q40p989
$$ 29196 29334 17368 5739 -15300 -16144 -333 52312 93771 85829 54824 8014 8854 865
11504H65J7265J0706K2828J1555k9103k4085r8968m8480m1652J1575K0653l019
$$ 865 18130 28836 51664 63219 34116 10031 -88937 -137417 -179069 -167494 -146841 -149860
11492a49860O3009O5465J3121k3079N8645J6167o646L5714L7248o7480N965p837
$$ -149860 -86851 -21386 -8265 -31344 27301 43468 36822 72536 109784 42304 48269 40432
11480D0432m0294K013Q331J6074o486j4758n2110L611M6701j1419m5275o2890
$$ 40432 138 2151 10482 26556 20070 5312 -46798 -43187 3514 -7905 -53180 -116070
11468a16070L1314J623O485k4093N85j2728J228L4412M1573N6111Q808m9084l231
$$ -116070 -84756 -83133 -76648 -100741 -100156 -112884 -111656 -77244 -35671 20440 29248 -19836 -23067
11455b3067K8229Q187n0984L0120R4522k7004l6360M3555m5332m6270k8244M6471
$$ -23067 5162 13349 -37635 -7515 87007 60003 23643 67198 21866 -24404 -52648 -6177
11443f177J132J6916j9254J9113J9885K795K153j3726k5138N0954o260J2320L4323
$$ -6177 -5045 11871 -7383 11730 31615 34410 36563 22837 -2301 48653 42393 54713 89036
11430H9036j7747N118L920K4056k3471m0544k2137Q400P7495j4352o5818j9754
$$ 89036 71289 76407 80327 104383 80912 40368 18231 26631 104126 89774 23956 4202
11418D202N562N986N0465q362q0881k4276J9036M8946K0704J0615K2758j23k3042
$$ 4202 9764 15750 66215 57853 -23028 -47304 -28268 20678 41382 51997 74755 74632 51590
11405E1590k5892k2745N7427M7716l750m7703m0425L655j866o598J4503l4884
$$ 51590 25698 2953 60380 108096 104346 56643 16218 19873 18007 11409 25912 -8972
11393h972p914q123k9989K4345N260J4579L8451L0128O750O465k173j7762l0024
$$ -8972 -16886 -25009 -54998 -30653 -25393 -10814 27637 57765 64515 70980 68807 51045 21021
11380B1021M000k3101k6348N6601K6801l0675j1604k0895n1498J3134N266P9510
$$ 21021 25021 1920 -24428 32173 58974 28299 16695 -4200 -55698 -42564 -37298 42212
11368D2212L6028m0322o3028K9454K0010j259j9378J6193p665l4815K3656K609
$$ 42212 78240 37918 -25110 4344 24354 23095 3717 19910 12245 -22570 1086 3695
11356C695l0481K6362J4254J9180j4205m4631K7371L1921L8784K6510k6659k2468
$$ 3695 -26786 -424 13830 33010 18805 -25826 1545 33466 72250 98760 72101 49633
11344D9633n183m916k9894N775j1570o198J2402l1695m2166P3805N9894K8303
$$ 49633 44450 39534 9640 15415 3845 -2353 10049 -21646 -63812 9993 69887 98190
11332I8190p8419m9023L2199J06529n890l5211k4663k4918L3802J5757k8286q996
$$ 98190 19771 -29252 2947 109476 103586 68375 43712 18794 52596 68353 40067 31071
11320C1071J6656j0759l969J433J1628Q91m5163l4567J7295J2168L8086Q222J4
$$ 31071 47727 36968 32999 34432 46060 46951 1788 -32779 -15484 -3316 34770 42992 43006
11307D3006K6035K4100P867n0131Q299Q724l3258m2101p0026L3699K1450J0945
$$ 43006 69041 93141 101008 50877 59176 67900 34642 -7459 -77485 -43786 -22336 -11391
11295a1391L1155j4048J4901N6838J8657l0966n184K7601P959k4399o985J9504
$$ -11391 19764 5716 20617 77455 96112 65146 59962 87563 95522 71123 64138 83642
11283H3642k5398k5087M7181K2402p430l2037n8008m309J953J2460j1779n547
$$ 83642 58244 33157 80338 102740 95310 63273 5265 956 2909 15369 3590 -1957
11271a957J4116l0948j9703k1409M9788K8148K679K0911M9200J4497j5275n1k8089
$$ -1957 12159 -18789 -38492 -59901 -10113 18035 20714 41625 90825 105322 90047 89996 61907
11258F1907r898L313k4655j9788k9150K9696L9327K4609k9054r627m3344K2531
$$ 61907 52009 55322 30667 10879 -18271 11425 50752 75361 46307 36680 -6664 15867
11246A5867J3132q957K6614J6726j4816m7563n4474M5194M7383L8288l0069l8096
$$ 15867 28999 20042 46656 63382 48566 1003 -53471 -8277 39106 77394 47325 9229
11234I229q216M4731K0640J2263L1054K8438l9908j6118n483K4963l8517n5211
$$ 9229 1013 45744 66384 78647 109701 138139 98231 82113 76630 101593 63076 7865
11222G865l7630O8139M1138J5572n2784k2859p561j8961K9466O558J1298P452
$$ 7865 -29765 38374 79512 95084 42300 19441 11880 -7081 22385 28943 40241 47693
11210D7693L1970K7647n6820R311J0161J1220J7470J8158k5543J8517K495l1496
$$ 47693 79663 107310 50490 59801 69962 81182 98652 116810 91267 109784 112279 80783
11198H0783m8835l0943o03Q752k0698o399r722r400N1091J9771O27j9377M36l5848
$$ 80783 31948 1005 402 9154 -11544 -17943 -27665 -37065 14026 33797 34424 15047 15483 -20365
11184b0365J8478M2846q854k3675J2400K7813k3874l8734M1709L231O881L3483
$$ -20365 -1887 40959 32105 8430 20830 48643 24769 -13965 27744 30975 37856 71339
11172G1339P9351O4667n457K487l4150j0602J4829Q222J2005m2450j5320j2959
$$ 71339 150690 215357 209900 212387 178237 167635 182464 190686 202691 160241 144921 131962
11160A31962K8049L3821N676n3547k483j2536k1835k3279N440j4846J5986k0634
$$ 131962 160011 193832 199508 145961 143478 130942 109107 85828 91268 76422 92408 71774
11148G1774k6892m004J6638j0498n5363k2104l4344K7427M3729Qj8110L1252K746
$$ 71774 44882 40878 57516 47018 -8345 -30449 -64793 -37366 6363 6371 -11739 19513 22259
11135B2259j6223J9171P5675J6446n9104r866J1481j0983L1344N9106J6039p2989
$$ 22259 6036 25207 100882 117328 58224 48358 59839 48856 80200 139306 155345 82356
11123H2356k730M705m520j639K929l4946m6114j0650N7031K8729m7251k8521O4485
$$ 82356 79626 84331 79811 78172 81101 46155 41 -10609 46422 75151 27900 -621 63864
11110F3864K6605o1776k4781M7550M3536J1074n2566l5379K1490j1073M3938K4256
$$ 63864 90469 28693 3912 51462 94998 106072 53506 18127 39617 28544 72482 96738
11098I6738l5872m6835j3595j332M0567N9692J8539m748J1492l3304n5099L4768
$$ 96738 60866 14031 436 -896 39671 99363 117902 113154 124646 91342 36243 71011
11086G1011p654L7362K417j4155n2753M474j528J9744j8006L799N7596O2132o2970
$$ 71011 63357 100719 103136 88981 36228 40702 39174 58918 40912 44711 102307 164439 101469
11073A01469o7152K3521L254Q347O441M8494k7325k5760K9922p960r805K5622
$$ 101469 34317 57838 61092 69439 75880 124374 97049 71289 101211 93251 83446 109068
11061A09068O721l8262k2843J1700l1084l733L2155k1848k1102J5085N2772k5895
$$ 109068 115789 77527 54684 66384 35300 31567 63722 41874 20772 35857 88629 62734
11049F2734o9893J8813J1661L8384l1740O130P444L2989K0211m0761J6876Q10
$$ 62734 -7159 11654 23315 61699 29959 36089 43533 76522 96733 55972 72848 73658
11037G3658J352m8795j5747K2328L0197K855K3258K4797r470k3631L7282r821
$$ 73658 75010 26215 10468 32796 62993 65848 89106 113903 104433 80802 118084 108263
11025A08263p993l1959J9768K6976M7966j9929k5837K1075j5655p845l0197j2737
$$ 108263 100270 68311 88079 115055 163021 143092 117255 138330 122675 114830 84633 71896
11013G1896O8495o029m4755J1049J9916n6357k1372L4142M1713K7282L0450l0077
$$ 71896 140391 134362 89607 100656 120572 64215 42843 76985 118698 145980 176430 146353
11001A46353l4240j0816m1750j02321m5073K3973Q9351N921p0432k4456J0685
$$ 146353 112113 101297 59547 -42774 -87847 -63874 25477 31398 -39034 -63490 -52805
10990e2805j3357O5684K8841l3801l0634L0910N7047k222J852J0158k8852J4274
$$ -52805 -66162 -478 28363 -5438 -36072 -5162 51885 49663 51515 61673 32821 47095
10978D7095o49m6649K5421N0932L8141K1497l160j3980J2108m689K1838j431j419
$$ 47095 46446 -203 25218 76150 114291 135788 132628 118648 130756 126067 147905 146474 145055
10965A45055k556k297K8285L13r987k237p127R096K5123K7760m638N7273J1977
$$ 145055 142499 140202 168487 168800 158813 156576 149449 158545 183668 211428 206790 264063 276040
10952B76040k262K9219J04213P2915k0904L6205R5582K5809O3924N1555O2308
$$ 276040 273778 302997 407210 480125 459221 495426 591008 616817 680741 732296 794604
10941G94604N2194M600l6280o7856k7431k6340n4043q9406j9149K5895P417J7713
$$ 794604 846798 851398 815118 747262 719831 693491 639448 550042 530893 556788 564205 581918
10929E81918r302j0954K5017M1936O2051J6192N5638J0594R107m068L14J11593
$$ 581918 572616 561662 586679 628615 690666 706858 762496 773090 782197 778129 778443 890036
10917H90036N3258n891k9534K5777J9653j0175R789K8244m2780J1554k7269n3798
$$ 890036 943294 937403 907869 933646 953299 943124 952913 981157 938377 949931 922662 868864
10905H68864m4909k3111K2097m7346k280m0653l4046K0795o90k2962j8178j1087
$$ 868864 823955 800844 822941 775595 773315 732662 698616 719411 718721 695759 677581 666494
10893F66494l0073k5013O744K5020O2002k452j993J5520l4786J812N7482K6402
$$ 666494 636421 611408 618152 643172 705174 702722 700729 716249 681463 683275 740757 767159
10881G67159P296m913N020o1238o6181o1696p3622l6081m3924l7258J9844K892
$$ 767159 774455 769542 774562 713324 647143 585447 511825 475744 431820 394562 414406 417298
10869D17298J678M586n0767m7883k0373r735p094l4453P2349K3921n8529j1382
$$ 417298 418976 423562 372795 324912 304539 294804 287710 253257 325606 349527 290998 279616
10857B79616K532O088J5792j7422o5360l3997l3974K6325O9311K5777L729r481
$$ 279616 282148 288236 304028 286606 221246 187249 153275 179600 248911 274688 278417 268936
10845B68936O1890L522k0126p575k3982k5010l8025m580L9227j7678J7538M7614
$$ 268936 330826 334348 314222 306647 282665 257655 219630 215050 254277 236599 254137 301751
10833C01751k8044l3943O4948m295J0623J4983n7570m8901r055k1605N3286J2523
$$ 301751 273707 239764 304712 300417 311040 326023 268453 219552 210497 188892 242178 254701
10821B54701n4060k6779J0944j203O6598N5454O8725o4159j01808K9021J5459
$$ 254701 200641 173862 184806 183603 250201 305655 374380 310221 208413 237434 252893
10810B52893N585r165K4195K4406N0058J1747J6553j8638l6987l5741o873K30
$$ 252893 258478 249313 273508 297914 347972 359719 376272 357634 320647 284906 278033 278263
10798B78263j016p839j1037o240J7244Q450K9790j3468r332j6937J5103l6807
$$ 278263 277247 269408 258371 252131 269375 277825 307615 294147 284815 267878 282981 246174
10786B46174n982O5395k4901j1288l122N2733M681N696N2746m29r259K5686K829
$$ 246174 240192 305587 280686 269398 266276 319009 323690 329386 382132 381703 372444 398130 400959
10773D00959O0617j808q6264l8588r886l9906k9713K6417p490j9605J7859J3432
$$ 400959 461576 459768 373504 334916 325030 285124 255411 281828 274338 254733 272592 286024
10761B86024J6244o189j6181J9804K3629n939m2005J324O6221N0495k76N946l1223
$$ 286024 302268 296079 279898 299702 323331 317392 275387 276711 342932 393427 393151 399097 367874
10748C67874N858j72l4301r955M881J9132k8622L172K7736o293m7543l6352K0427
$$ 367874 373732 373560 339259 329304 334185 353317 324695 327867 355603 349310 301767 265415 285842
10735B85842l864j9851P06K0770N1347P2497J3827o736J7776K7879q1757l2609
$$ 285842 281978 262127 262833 283603 334950 407447 421274 414538 432314 460193 378436 345827
10723C45827r511N1396J7919K1916q30k4291n847J0883K7846O6402m2115k2051
$$ 345827 336316 387712 405631 427547 426717 402426 396579 407462 435308 501710 459595 437544
10711D37544k0144j6551l6487M799M5316j0684j1134J3375L359J8212k5760l1196
$$ 437544 417400 400849 364362 369161 414477 403793 392659 406034 409393 427605 401845 370649
10699C70649m225N2148K6388k868m504K3819k6659j6159k1568J1427M1306j5374
$$ 370649 366424 418572 444960 442092 437588 461407 434748 418589 397021 408448 449754 434380
10687D34380k0207k3735K6480M2943l3404p0212k9102P7229O7378K6392Q2861
$$ 434380 414173 390438 416918 459861 426457 356245 327143 404372 471750 498142 581003
10676E81003J7096l6035m406O4014L0010m8236j3989M108K9003J7028K0629P686
$$ 581003 598099 562064 557658 621672 651682 603446 589457 593565 622568 639596 660225 667911
10664F67911O197N8854N8952M6031K7054N3789l2650l9208k700N4196N1777L1737
$$ 667911 674108 732962 791914 837945 864999 918788 886138 846930 844230 898426 950203 981940
10652I81940K9972K9044P3726M7690L6239N8016N4116r743q018m315n4960M7343
$$ 981940 1011912 1040956 1114682 1162372 1198611 1256627 1310743 1301000 1292982 1288667 1233707 1281050
10640A281050Q3154Q4241N7226L1234o562k0412l0901o3346J2985J8207M4958
$$ 1281050 1364204 1448445 1505671 1536905 1530343 1509931 1479030 1415684 1428669 1446876 1491834
10629A491834m767q1393m2077J4283P9382N2465Q912L4194j5259K4046l0875l9825
$$ 1491834 1487067 1405674 1363597 1377880 1457262 1509727 1518639 1552833 1537574 1561620 1530745 1490920
10617A490920r307J221K1886N307k2714O0827J4898m7483j3914j640M7703P2468
$$ 1490920 1481613 1482834 1504720 1510027 1487313 1548140 1563038 1515555 1501641 1500001 1547704 1620172
10605A620172N1421M221j4866O050K8482j704N4979N1497N7110L838K1162O5164
$$ 1620172 1671593 1675814 1660948 1666998 1695480 1693776 1748755 1800252 1857362 1861200 1882362 1947526
10593A947526O0191L6314M6666Q0038O5212M9045M1622O0996M4314L2365P6847
$$ 1947526 2007717 2044031 2090697 2170735 2235947 2284992 2326614 2387610 2431924 2464289 2541136
10582B541136Q0367L5631K7730l715L8293O4358P2151J73896J08384R4289Q0361
$$ 2541136 2621503 2657134 2684864 2681149 2719442 2783800 2855951 3029847 3138231 3232520 3312881
10571C312881P4998R0587J14415J46966J28029O2430J34805K43579K32212R9527
$$ 3312881 3387879 3478466 3592881 3739847 3867876 3930306 4065111 4308690 4540902 4640429
10561D640429J34235K29479K67460K83529K30659L16513L21958L73822M62239
$$ 4640429 4774664 5004143 5271603 5555132 5785791 6102304 6424262 6798084 7260323
10552G260323M72607M57724M95277N26549O70150P59038P94704R74340J114107
$$ 7260323 7732930 8190654 8685931 9212480 9882630 10641668 11436372 12410712 13524819
10543A3524819J248724J408114J586861J749457K057374K303379K670386L071746
$$ 13524819 14773543 16181657 17768518 19517975 21575349 23878728 26549114 29620860
10535B9620860L589621M298679N191033O346524P703866R295900J1094311J3014433
$$ 29620860 33210481 37509160 42700193 49046717 56750583 66046483 77140794 90155227
10527I0155227J4587751J5360671J4387423J1141236N636177r84813o934941j0933153
$$ 90155227 104742978 120103649 134491072 145632308 151268485 150283672 143348731 132415578
10519A32415578j2472386j2121231j0533829q395266o027997l640051j415325
$$ 132415578 119943192 107821961 97288132 88892866 82864869 79224818 77809493
10512G7809493O28141K512940M260944N667675O299961O247085N514676M178304
$$ 77809493 78437634 80950574 85211518 90879193 97179154 103426239 108940915 113119219
10504A13119219K493262J143377Q45706J604687L270404N401826P441578Q931939
$$ 113119219 115612481 116755858 117601564 119206251 122476655 127878481 135320059 144251998
10496A44251998R317200Q284264N637615J780052k718791o587407r213722j0081945
$$ 144251998 153569198 161853462 167491077 169271129 166552338 159964931 150751209 140669264
10488A40669264r409637p680983n480145l407229k024259j511983k028143l305581
$$ 140669264 131259627 123578644 118098499 114691270 112667011 111155028 109126885 105821304
10480A05821304m660621n625928n961612n522415m528638l117981j381172L08440
$$ 105821304 101160683 95534755 89573143 84050728 79522090 76404109 75022937 75331377
10472G5331377K096341L906515N698992P329713Q672800R289325Q876234O975731
$$ 75331377 77427718 81334233 87033225 94362938 103035738 112325063 121201297 128177028
10464A28177028L447206j263249o264536j0342187j2682539j3345025j2592132
$$ 128177028 131624234 130360985 124096449 113754262 101071723 87726698 75134566
10457G5134566j1087991r442784p875429o526194n335664m373876l686932l065575
$$ 75134566 64046575 54603791 46728362 40202168 34866504 30492628 26805696 23740121
10449B3740121k580846k147746j852010j612259j397961j218974j071411r45707
$$ 23740121 21159275 19011529 17159519 15547260 14149299 12930325 11858914 10913207
10441A0913207p76906p22037o17429n81394n43780m76567m06582m02431l38592
$$ 10913207 10136301 9414264 8796835 8215441 7671661 7195094 6788512 6386081 6047489
10432F047489k80515l06742k72192k24336k74125k01499j68844k10933k05681
$$ 6047489 5766974 5460232 5188040 4963704 4689579 4488080 4319236 4108303 3902622
10423C902622j78921j59166j67131j05602j03125j30466j69543j10182k0258r7902
$$ 3902622 3723701 3564535 3397404 3291802 3188677 3058211 2888668 2778486 2758228 2660326
10413B660326j16205p7767j12982r3929q0680m5582k8395j6894l032n4021k0574
$$ 2660326 2544121 2466354 2353372 2259443 2178763 2133181 2104786 2087892 2084860 2030839 2010265
10402B010265j5838o4588j01336k7196O5802m5959j34308p0615l817J2011n2636
$$ 2010265 1994427 1929839 1828503 1801307 1867109 1821150 1686842 1616227 1612410 1624421 1571785
10391A571785o1541p1592n6459n5604J2417j5166k1524n4411k6568l2874l6619
$$ 1571785 1510244 1438652 1382193 1326589 1339006 1323840 1302316 1247905 1221337 1188463 1151844
10380A151844M3115j9902m1048j8101m6571l8260P417j3713N027N3151o6551m3927
$$ 1151844 1194959 1175057 1134009 1115908 1069337 1031077 1038494 1024781 1029808 1082959 1016408 972481
10368I72481L7129M5449n2405j7111J4795o622M083j8820m5684n139q93k5664
$$ 972481 1009610 1055059 1002654 985543 1000338 993716 997799 978979 933295 928156 927263 901599
10356I01599k544O6837M4866L0712q79m6393n0406o1833J8023M4392j3912l7836
$$ 901599 899055 965892 1010758 1041470 1040591 994198 943792 881959 899982 944374 930462 892626
10344H92626k7361q8044r2247J3080j736N486L795l0886m7260l7600l8384n1206
$$ 892626 865265 777221 684974 698054 696318 701804 705599 674713 627453 589853 551469 500263
10332E00263j3569K0828J0911j9493o0946n7492K0352j8108j1582n546N6399K0680
$$ 500263 486694 507522 518433 498940 437994 380502 400854 382746 371164 365618 422017 442697
10320D42697R948k963l4966l6167j1034J2410m725l1909r890J173j3032N973o306
$$ 442697 452645 449682 414716 378549 367515 379925 375200 343291 333401 334574 321542 327515 321209
10307C21209M5227K4514M134r947o340R471J1256N7467n456m1692l0573m0692
$$ 321209 366436 390950 395084 385137 378797 388268 399524 456991 451535 409843 379270 338578
10295C38578j3201J1304J7636J154L9908R257q143k4056N892l9981L823j3319
$$ 338578 325377 336681 354317 355471 395379 404636 396493 372437 378329 338348 342171 328852
10283C28852q953J9033L2166k538L3590m971n8428k876M7n950O479j9314l1430
$$ 328852 319899 338932 371098 368560 402150 397179 338751 335875 335922 329972 336451 317137 285707
10270B85707l1632R535M2423m395m2604l2094J7045m1593j6398O592k1517K4910
$$ 285707 254075 263610 306033 301638 259034 226940 243985 202392 185994 192586 171069 195979
10258A95979Q6567M4817o3556o27l4233n137N1252l1474q381N024K6407O350L6654
$$ 195979 282546 327363 263807 263180 228947 223810 275062 243588 235207 240231 266638 272988 309642
10245C09642m2715m9325j5502o242r348O3670J9716m4282m6969L5151j2565K3220
$$ 309642 266927 217602 202100 195858 186510 250180 269896 225614 178645 213796 201231 224451
10233B24451M1227R328k483P967p4338J1576K5562j2177n499n6577k5224p718
$$ 224451 265678 275006 272523 280490 206152 217728 243290 231113 225614 169037 143813 136095
10221A36095j738k415k6960J3768m3629n680J0690n2148J02P2572P741N1227K7269
$$ 136095 134357 131942 104982 118750 75121 69441 80131 27983 28085 100657 108398 159625 186894
10208A86894k0479L6728L700q4541k9397N416J6833J7766p4216k3073K6167j9663
$$ 186894 166415 203143 206843 122302 92905 98321 115154 132920 58704 35631 61798 42135
10196D2135O9136Q4799m1432j9340L4218p6692j00057k8716r52n119K2104k3892
$$ 42135 111271 196070 154638 135298 169516 92824 -7233 -35949 -36901 -42020 -19916 -43808
10184d3808J7580L5024L7840J7158j2964m4422m9455N8825n568M809K8793k7362
$$ -43808 -26228 8796 46636 63794 50830 6408 -43047 15778 10210 15019 43812 16450
10172A6450M2003k1407m0286J4076M7653J3390n8283K7560J5005o3203n1851j9466
$$ 16450 58453 37046 -3240 10836 58489 71879 13596 41156 56161 -7042 -58893 -78359
10160g8359L8260K1550M914l5857N45L8050j8263M930K9253o77n1829j8791j734
$$ -78359 -40099 -18549 -13635 -49492 -48947 -10897 -29160 -24230 5023 4346 -47483 -66274 -68008
10147f8008N5061M8993p82p9249l758N2775m1505j1054l6531M2752M9726P700
$$ -68008 -12947 36046 35264 -43985 -47743 5032 -36473 -47527 -84058 -41306 8420 16120
10135A6120o784l6408K009J9632J2099j9060J6194K8935N9927J1204k5682m6051
$$ 16120 9336 -27072 -25063 -5431 6668 -12392 3802 32737 92664 103868 78186 32135
10123C2135n5674l2672k805K3594J3206P9469J6143O644J2104N9493K4105k0460
$$ 32135 -23539 -56211 -59016 -35422 -22216 57253 73396 80040 92144 151637 175742 155282
10111A55282J9826J514L1867O4237K6375K6995R2454R7603J09138Q2573L0815
$$ 155282 175108 176622 208489 272726 299101 326096 418550 516153 625291 707864 738679
10100G38679j3436p028K5120k1620m775n0856j01365j06959k4608r187L5490Q911
$$ 738679 725243 718215 743335 721715 716940 666084 564719 457760 433152 423965 459455 468366
10088D68366k1274j6624J0727O4935P1257P7580O483j9722r485j1709L9748N2615
$$ 468366 447092 430468 441195 506130 577387 654967 661450 641728 632243 620534 660282 712897
10076G12897N7740K2201L5652J3110J4129M6324K6507M0049k2018l1636q724p176
$$ 712897 770637 792838 828490 841600 855729 902053 928560 968609 946591 914955 906231 899055
10064H99055P306J0551J3379J36017R9868L9243L1977J5501M0366R4866J18179
$$ 899055 906361 916912 930291 1066308 1166176 1205419 1237396 1252897 1293263 1388129 1506308
10053A506308Q6475J44565J88625K77447M45456N92394R33338J546727K721090
$$ 1506308 1592783 1737348 1925973 2203420 2648876 3241270 4174608 5721335 8442425
10044H442425M150636M428526L340002k080368n915884m713960k681284j495262
$$ 8442425 12593061 17021587 20361589 18281221 12365337 7651377 4970093 3474831
10036C474831q58806n86380m02062k42738k32938j52639j62967j43924o6766q2126
$$ 3474831 2616025 2029645 1627583 1384845 1151907 999268 836301 692377 625611 543485
10026E43485p9782q803O89l1043k3458l0730l4981j0215p0291m9874J4175j8134
$$ 543485 463703 454900 455589 424546 401088 370358 335377 325162 254871 204997 219172 201038
10014B01038j6127M7115K4378n7403p446j7818l4466N6065O393o0463K5606K256
$$ 201038 184911 232026 256404 199001 191555 173737 139271 195336 201729 141266 166872 169128
10002A69128l6896J0436n1107k5170k5434O692O6302J7323k637m8679p5882Q543
$$ 169128 132232 142668 91561 66391 40957 47649 113951 131274 128637 79958 4076 12619
9990A2619P6133M7623L5931J1842l5229J9382m5693l5199J662P306j282j6796
$$ 12619 88752 136375 172306 184148 148919 168301 122608 87409 89071 96377 95095 78299
9978G8299k2496n1334N038K9261L3216N888J7432l0513n5476K4118J0142n4397
$$ 78299 55803 4469 9507 38768 71984 77872 95304 64791 9315 33433 43575 -10822
9966a0822K2589L2968O1666l805n0152j3975O250K4481J1326l5079n360J4268
$$ -10822 11767 44735 106401 102596 52444 38469 44719 69200 80526 45447 40087 54355
9954E4355j4617L1783k2305L2542N1722J0542J6785L9289J8268M9670N4923J3002
$$ 54355 39738 71521 49216 81758 133480 144022 160807 200096 218364 268034 322957 335959
9942C35959q9648j27992r0564k0658j6083N0309L3685l4023l3290N988M5701J5596
$$ 335959 246311 118319 27755 7097 -8986 41323 75008 40985 7695 13683 59384 74980
9930G4980M6963j4920o3671m0216l255K771J9728O863l0988l2020M6099P0625
$$ 74980 121943 107023 43352 3136 -119 2652 22380 29243 -1745 -33765 12334 82959
9918H2959J0987p856m813m1145K8496j5256l7620j1239j6697K7030J4859L9400
$$ 82959 93946 86090 81277 40132 68628 53372 15752 4513 -12184 14846 29705 69105
9906F9105n513n213n7172k9772N3309J6896L9817J9224l1335j5760n1551m603
$$ 69105 63592 58379 1207 -28565 24744 41640 81457 100681 69346 53586 2035 -2568
9894b568K7695M1818L4033K5275o102j3388m3237m7139J4850M1173K5557p3705
$$ -2568 25127 66945 100978 126253 120151 106763 63526 16387 31237 72410 97967 24262
9882B4262q1718n8358K3992L4395L5921L8094L6212N2360j8209Q412j5607o3418
$$ 24262 -57456 -115814 -91822 -57427 -21506 16588 52800 105160 86951 95363 79756 16338
9870A6338p0963J3586J303o201J4089j1373l3198K0837l480k6529N7409K0204
$$ 16338 -54625 -41039 -39736 -45937 -31848 -43221 -76419 -55582 -59062 -85591 -28182 -7978
9858g978o775K0773q440J882n2859L4986N6851M3250L988J5822N2185J6421n9873
$$ -7978 -14753 6020 -2420 -538 -53397 -18411 38440 81690 85678 101500 153685 170106 110233
9845A10233j12802k5398J2531O0601o872L959J5535r771m5715l4406K4175N177
$$ 110233 -2569 -27967 -15436 45165 38293 42252 57787 48016 2301 -32105 -7930 -2753
9833b753j2814j4041J908N0490O684m9866l1237J7098m201K3769L5238L5539Q250
$$ -2753 -15567 -29608 -27700 22790 29474 -20392 -51629 -34531 -38732 -14963 20275 55814 64064
9820F4064l7085n7193j8500L6949M7887k1782r5644o5427m496L1614J30078O6424
$$ 64064 26979 -30214 -48714 -11765 36122 14340 -81304 -146731 -151227 -119613 10465 76889
9808G6889o1384j5328O954j9889l0264k1901M3808O0853N1805n7518l3888j7244
$$ 76889 15505 177 7131 -12758 -43022 -64923 -21115 39738 91543 34025 137 -17107
9796a7107P3377k628k9684l3655k5379k854j2395l7768j633M7760j4723J96R238
$$ -17107 56270 53642 23958 -9697 -35076 -37930 -50325 -88093 -89726 -41966 -56689 -56493 -47255
9783d7255J3227k6422P331L0443J0142J2432m9137J5531j9990o2813L4393J3746
$$ -47255 -34028 -60450 -53119 -22676 -12534 -102 -49239 -33708 -53698 -116511 -82118 -68372
9771f8372j3265J1019J0109M8895K0601l4097m5044K4737L5508O9111K6336k4893
$$ -68372 -81637 -70618 -60509 -11614 8987 -25110 -70154 -45417 -9909 59202 85538 60645
9759F0645n1668k2902P385J09168n230p3403n721O1231j9721k7938k8940k1294
$$ 60645 8977 -13925 -6540 102628 97398 23995 18274 79505 59784 31846 2906 -18388
9747a8388k8112R387J5767o183Q116J2100M1163J4835k4691Q053m983j7638K710
$$ -18388 -46500 -37113 -21346 -27529 -19413 -7313 33850 48685 23994 32047 27064 9426 12136
9734A2136k7061j8763J1502K9390L3054j0514J1660K377l1837j5931K2235J8921
$$ 12136 -14925 -33688 -22186 7204 40258 29744 41404 43781 11944 -3987 18248 37169
9722C7169p364k173j3363K2236l6888j1397q453q296j5924J1754J0889l2798N5670
$$ 37169 29805 27632 14269 36505 -383 -11780 -20233 -28529 -44453 -32699 -21810 -54608 1062
9709A062K2524o8491K6091K5705j109M348J9409J3179o25p614o263l366l250m6482
$$ 1062 23586 -44905 -18814 6891 5782 10130 29539 42718 42093 34479 28216 24850 21600 -24882
9695b4882J1840O019l4485j8202M1883p56J3113k205K9460L8985l1964j1113l8315
$$ -24882 -13042 -7023 -41508 -59710 -17827 -18583 -5470 -7675 21785 60770 28806 17693 -20622
9682b0622k1947l625M2744J7896J2023m0538M8294K731k7992r954k0046p987J9866
$$ -20622 -42569 -46194 -3450 14446 26469 -14069 34225 36956 8964 -990 -21036 -29023 -9157
9669i157K5727P7666k917p5416l6999K8720J9690K12L1591l2584l4968K9607K8850
$$ -9157 16570 94236 91319 15903 -21096 7624 27314 27526 59117 26533 -8435 21172 50022
9656E0022L803j2320m7958k3036J7351J5803N17l6656J6988L7260L4163j5788
$$ 50022 53825 41505 -6453 -29489 -12138 3665 4182 -32474 -15486 21774 55937 40149
9644D0149J6874L6787k1589m2852Q4480j2492o8658o817M2311K9797n59j9077
$$ 40149 57023 93810 72221 29369 113849 101357 32699 25882 68193 97990 97431 78354
9632G8354M402n8111l4338m495O888K4750K2213M9715m1653l1637l4565j8959
$$ 78354 82756 24645 -9693 -14188 -7300 17450 39663 89378 47725 16088 -18477 -37436
9620c7436j7782j0719P6629P2929J955l8179k2024l643o563l0268L5369N1159
$$ -37436 -55218 -65937 10692 83621 85576 47397 25373 21730 15167 -15101 20268 71427
9608G1427K150n1098j7159K9322j283l4423k6082L2565K8384K5489j5863k1163
$$ 71427 73577 22479 5320 34642 33359 -1064 -27146 5419 33803 59292 43429 22266
9596B2266l4842j244p981K6031J5601J4043L463l6063j8493j3054J1422J8412
$$ 22266 -12576 -13820 -21801 4230 19831 33874 37337 1274 -17219 -30273 -18851 -439
9584d39L1061L5149j7786k0763K22k2395l9107j8950N1369O550l5238k1541j2602
$$ -439 30622 65771 47985 27222 27444 5049 -34058 -53008 -1639 4911 -30327 -51868 -64470
9571f4470K412L3329M3012M2548J5754n4084q5431r481M4141m931k9718j4273
$$ -64470 -62058 -28729 14283 56831 72585 18501 -66930 -76411 -32270 -37201 -66919 -81192
9559h1192J1038M3246K6547O332p98J1488O5073m7321m1219l0706j0248R6683
$$ -81192 -70154 -26908 -361 5971 5173 16661 81734 34413 -6806 -37512 -47760 48923
9547D8923M7555J5009j1093o7801l4077J0932N6144M995j6885m6973M9752J0255
$$ 48923 96478 111487 100394 32593 -1484 9448 65592 70587 53702 6729 56481 66736
9535F6736j0740l5060j9938J9875L9261J1458j2543l4221q403K6110K5375L792
$$ 66736 55996 20936 998 20873 60134 71592 59049 24828 16425 42535 67910 71702
9523G1702k4430L2802K8137m9207l6058K1515N5364p885j2407l905M5881J4368
$$ 71702 47272 80074 108211 59004 22946 44461 99825 91940 79533 75628 121509 135877
9511A35877o391o996M0401J7065N32k2133o394m6447n9110J9211K4610r174O262
$$ 135877 129486 122490 162891 179956 180488 158355 151961 105514 46404 65615 90225 81051 87313
9498H7313j1137j7734l924K3765m4297m603Q1288j3541n2378M9490N1391k8857
$$ 87313 76176 58442 54518 78283 33986 29383 110671 97130 44752 94242 145633 116776
9486A16776K4238l5437l2257q546M0823k7823j4174O827J8017P2678o241m4489
$$ 116776 141014 105577 73320 64774 105597 77774 63600 70427 88444 161122 154881 110392
9474A10392P739M207N6866O580J3292J9150Q356k3292m4727K3154M5971N793m7603
$$ 110392 118131 122338 179204 185784 199076 218226 226582 203290 158563 181717 227688 233481 185878
9461A85878O164K4600l4922m117j0292m9388J3159O844r823l955r924M2894L0597
$$ 185878 192042 216642 181720 177603 167311 117923 131082 137926 128103 124148 114224 157118 187715
9448A87715l5180k9888L131Q371j1208J6209N6975j3322P459m2422J9023K3658
$$ 187715 152535 122647 125778 134149 122941 139150 196125 182803 190262 147840 166863 190521
9436A90521K1673K5590j3559J5913o694k0552J757k1011k2722q00O4370n018K523
$$ 190521 212194 237784 224225 240138 233444 212892 214649 193638 170916 170116 234486 229468 231991
9423B31991Q617m6403L2186J2617p687k2383l470L954n336M2783N0781j0387l2584
$$ 231991 240608 194205 226391 239008 231321 208938 205468 209422 204086 246869 297650 287263 254679
9410B54679O9190K0761n8490k3126J6739p289J1172k7494j8128M8581K9886o399
$$ 254679 323869 344630 286140 263014 279753 272464 283636 256142 238014 286595 316481 310082
9398C10082l821L022j8316q680J1947J0583Q8106J7723l7080j9190K45M2762k656
$$ 310082 306261 309283 290967 282287 294234 304817 392923 410646 373566 354376 354621 397383 394727
9385C94727k5865K6977Q5002k1656l2357p629k3204M9812O4534M5041L2981J1039
$$ 394727 368862 395839 480841 459185 426828 419199 395995 445807 510341 555382 588363 599402
9373E99402k1505k3499J9897M8969K3309J1543L8517J5965J0480r935J6255L3567
$$ 599402 577897 554398 574295 623264 646573 658116 696633 712598 723078 713143 729398 762965
9361G62965O6851N7972Q6515n362l7199m1269K515P4779K1863K9345M3595K1485
$$ 762965 829816 887788 974303 968941 931742 890473 892988 967767 989630 1018975 1062570 1084055
9349A084055J032R1284P3350M3204P3680L2187N2979J05956M0408N6995L9435
$$ 1084055 1085087 1176371 1249721 1292925 1366605 1398792 1451771 1557727 1598135 1655130 1694565
9338A694565M0253Q3162R2515J24497J40865J19481J30618J16090N8032R4931
$$ 1694565 1734818 1817980 1910495 2034992 2175857 2295338 2425956 2542046 2600078 2695009
9328B695009J30708J99017J16665J18310J86327J79060K18584K34582K15769K28605
$$ 2695009 2825717 3024734 3141399 3259709 3446036 3625096 3843680 4078262 4294031 4522636
9318D522636K55572K62556K97832K72725L39386L27734L18770K83339L65125M33773
$$ 4522636 4778208 5040764 5338596 5611321 5950707 6278441 6597211 6880550 7245675 7679448
9308G679448L62919L40853L52457K78964K16665K13202J20868J25982O3257k0224
$$ 7679448 8042367 8383220 8735677 9014641 9231306 9444508 9565376 9691358 9754615 9734391
9298I734391k9123r4261j59911j83659k66158l23562k89637l28629l85256l68649
$$ 9734391 9705268 9611007 9451096 9267437 9001279 8677717 8388080 8059451 7674195 7305546
9288G305546l84025l53878l09222l74756l73760l03765k65308k86236k60656k40327
$$ 7305546 6921521 6567643 6258421 5883665 5509905 5206140 4940832 4654596 4393940 4153613
9278D153613k09513j75522k50537k75900k23065j67326j13290q0020j18217j97719
$$ 4153613 3944100 3768578 3518041 3242141 3019076 2851750 2738460 2658440 2540223 2342504
9268B342504j59109j12475p8131r6034j10833j00894o1382r1049m0603p6626j01780
$$ 2342504 2183395 2070920 1992789 1896755 1785922 1685028 1623646 1532597 1491994 1415368 1313588
9257A313588p6531K4269m8317m7557l6720l0739k2857r659m1727o5303r3219k3376
$$ 1313588 1237057 1261326 1213009 1165452 1128732 1097993 1075136 1065477 1023750 958447 865228 841852
9245H41852L6201k1865l697l8753m4025j19551m0230k327L6993j0667Q145l5174
$$ 841852 878053 856188 852491 813738 769713 650162 609932 607605 644598 633931 642076 606902
9233F06902m5619r266l8102l1330k567k4284K1031J2354l2164j0185M2609M6197
$$ 606902 561283 552017 513915 482585 480018 455734 476765 489119 456955 446770 489379 535576
9221E35576o0706r0723n3068J9003j871k2526J7020L328l3554j4907L1477K5720
$$ 535576 474870 384147 331079 350082 348211 325685 342705 346033 312479 297572 329049 354769
9209C54769q1741q690m1082l1521K8978k5421k2499M9533j0996l0966k4406J1214
$$ 354769 273028 264338 223256 191735 220713 195292 172793 222326 211330 180364 155958 167172
9197A67172R879M1126j1299L6078j1290J7160M0679j0167n8649j0255J5437R85
$$ 167172 177051 218177 206878 242956 231666 248826 289505 279338 220689 210434 225871 226856
9185B26856k4433K8916k9445p9372O1904N0962k3294n498n2925m9157J5731K6966
$$ 226856 202423 231339 201894 122522 184426 235388 212094 206596 153671 104514 120245 147211
9173A47211K0562M2505k9830n1408K8428J3451m8743j5831L32O9976L4770l7345
$$ 147211 167773 210278 180448 129040 157468 170919 122176 106345 106677 176653 211423 174078
9161A74078m0135O4079O9834k8174o3811l9062p8585m366M070K3692R067K5040
$$ 174078 133943 198022 267856 239682 175871 136809 58224 53858 57928 81620 90687 115727
9149A15727L0157K2063k1597L6417p534l20l4460j4406N0902q2861o1680L2597
$$ 115727 145884 167947 146350 182767 175233 174913 140453 126047 176949 94088 32408 65005
9137F5005K9592j6696j0607M9773j2224n8269m1950L336J4920M6603o2093l0558
$$ 65005 94597 77901 67294 117067 104843 46574 4624 7960 22880 69483 7390 -23168
9125b3168O9494J6734k5275o6819n4739L2154L3565p459p241k465j9175N4933
$$ -23168 46326 63060 37785 -29034 -83773 -51619 -18054 -25513 -32754 -35219 -54394 539
9113E39J3119j2365L1634J0841L2338k6276k6178m8987J935J0302m37O9457J2212
$$ 539 13658 1293 32927 43768 76106 49830 23652 -25335 -23400 -13098 -13535 55922 68134
9100F8134o0740j0166k8048j8851R298N7715P204n0874j1308K1082N4413K0039
$$ 68134 7394 -2772 -30820 -49671 -40373 17342 24546 -26328 -37636 -16554 37859 57898
9088E7898k2541m7706l0671n9802J9886L675P960L9912k3052l6835L9504Q7419
$$ 57898 35357 -12349 -43020 -102822 -82936 -79261 -71301 -31389 -54441 -91276 -51772 35647
9076C5647K3857M719k7030J2546j8590J0464m131r939R42r450l7430K3722K2704
$$ 35647 59504 64223 37193 49739 31149 41613 37482 27543 28485 19035 -18395 5327 28031
9063B8031j581K7126r198j4325J0944r718K719L7694N1527k4164l0830r966k5755
$$ 28031 26450 53576 44378 30053 40997 31279 33998 71692 123219 99055 68225 58259 32504
9050C2504k3438j7448l5938p794O2625K1124J7639l70j7713l3585m029J545j9145
$$ 32504 9066 -8382 -44320 -52114 10511 31635 49274 48904 31191 -2394 -6423 -4878 -24023
9037b4023M1585m0686l1211L950p8288P523N4326O338J06581j818n6730k2486
$$ -24023 17562 -23124 -54335 -50385 -128673 -121150 -66824 -60486 46095 44277 -12453 -34939
9025c4939L0716J0411O783N2813M8153J7996n5105l2119q622J0233J3989j5142
$$ -34939 -4223 6188 12971 65784 113937 131933 76828 44709 36087 46320 60309 45167
9013D5167l6580l4381M926L2230n557k7330K0781K4568k9086l3474K7603K7505
$$ 45167 8587 -25794 -20868 11362 5805 -21525 -744 23824 -5262 -38736 -11133 16372
9001A6372m5050m173J5647J0581N5745m2171k3559k619n6791j4799N3199M9134
$$ 16372 -28678 -32851 -17204 -6623 49122 6951 -16608 -19227 -76018 -90817 -37618 11516
8989A1516r948N78J5292l3544k5452P153K9393R701J0968K8668L2703m0727k0204
$$ 11516 1568 2146 17438 -16106 -41558 -34405 -5012 4689 15657 44325 77028 36301 16097
8976A6097n7422m4317K4655M5301K627m0379p805N2058O797o6484j0333K365J3270
$$ 16097 -41325 -85642 -60987 -15686 -13059 -53438 -61243 -9185 -2388 -68872 -79205 -76840 -63570
8963f3570M545L9111K4332j1749k6039n0819P914l1030J2210M9800N4722P8079
$$ -63570 -59025 -19914 4418 -7331 -33370 -84189 -76275 -107305 -95095 -45295 9427 87506
8951H7506l7409l7836r718j3579j5333q391M3442N8426J8641o378l7370M3049
$$ 87506 50097 12261 2543 -11036 -26369 -34760 8682 67108 85749 79371 42001 85050
8939H5050L1087n0902l3760m4680J5773N917k6111k4904K5448M7611j9527l0847
$$ 85050 116137 65235 31475 -13205 2568 8485 -17626 -42530 -17082 30529 11002 -19845
8927a9845J3183K1948o694m7924J6436N1317J9838k9383j4362J621j0744k7547
$$ -19845 -6662 15286 8592 -39332 -22896 28421 48259 18876 4514 6135 -4609 -32156
8915c2156k0608o5178n1870O9762L1476M9870O9883J4497q473K0290k0876m8344
$$ -32156 -52764 -117942 -169812 -100050 -68574 -18704 51179 65676 57203 77493 56617 8273
8903H273j6901j1065r314r592Q0966K0611M2865m6750o0085j7208N0018k79j4504
$$ 8273 -8628 -19693 -29007 -38599 42367 62978 105843 59093 -992 -18200 31818 31539 17035
8890A7035k257K8329J3294m5362m3478m5033r971K4156L4898O1747L7759j3789
$$ 17035 14778 43107 56401 11039 -32439 -77472 -87443 -63287 -28389 33358 71117 57328
8878E7328j4712K019j0434J142N2022p397n7166k556k3831J3992j4655M5503O4278
$$ 57328 42616 44635 34201 35343 87365 79968 22802 20246 -3585 10407 -4248 41255 105533
8865A05533L2332m914r1585j1520P363J5424l321M8344l0880p3497m1254K3586
$$ 105533 137865 132951 41366 29846 37209 52633 49312 97656 66776 -6721 -47975 -24389
8853b4389J0663j0508k9800j1164j1734K0459L338M8447l219J7534N292m8773
$$ -24389 -13726 -24234 -54034 -65198 -76932 -56473 -53135 -4688 -7907 9627 14919 -33854
8841c3854K7817K7383j6809l2778L6459N8908k3487R83o518J861j9544j2777N3662
$$ -33854 -6037 21346 4537 -28241 8218 67126 43639 44622 38104 39965 20421 7644 61306
8828F1306N9476j7059n9881J0534K7160l4344k7131n0208L1601M3633k3519r919
$$ 61306 120782 103723 43842 54376 81536 47192 20061 -30147 1454 45087 21568 11649
8816A1649l322L6791J8965r237J2566L6101R521j9984k6295n3800k2833K706m467
$$ 11649 8327 45118 64083 54846 67412 103513 113034 93050 66755 12955 -9878 -7172 -11639
8803a1639n4113K2258M4600K0846n6881l9586M6395L5606J6772K1464r8228j7628
$$ -11639 -65752 -43494 1106 21952 -34929 -74515 -28120 7486 24258 45722 -52506 -70134
8791g0134J1913M6634P3441r063k9437p3587r39k1255j5993K5219M5809Q133N4749
$$ -70134 -58221 -11587 61854 52791 23354 -50233 -51172 -72427 -88420 -63201 -17392 -9259 45490
8778D5490J8345o9655m5281R07J853K9563M7727P293k2281j1909p6619L448m423
$$ 45490 63835 -5820 -51101 -50194 -48341 -18778 28949 36242 13961 2052 -74567 -71119 -75542
8765g5542J4358R114L1829k750l4383j3729Q722Q7397p173o5204m0432L3575J1879
$$ -75542 -61184 -52070 -20241 -22991 -57374 -71103 -62381 25016 17843 -47361 -87793 -54218 -42339
8752d2339r918L025j6695Q6062j3721r9977j2890K2030O1443j953J2054j3687
$$ -42339 -52257 -49232 -65927 20135 6414 -93563 -106453 -84423 -22980 -24933 -12879 -26566
8740b6566Q717j9633J0468L3357l8331R600L2240m216k0452q945n213P029M1943
$$ -26566 -17849 -37482 -27014 6343 -31988 -22388 9852 5636 -14816 -23761 -28974 -21945 19998
8727A9998J1825j1060k2491j9236k7451k6811q018Q3169M7929j511k3126j546
$$ 19998 31823 20763 -1728 -20964 -48415 -75226 -83244 -75 47854 46343 23217 21671
8715B1671J175k6702m7402K5005K6032l6376k0589N41r615L1451P831L6820l3228
$$ 21671 22846 -3856 -51258 -26253 -221 -36597 -57186 -56645 -66260 -34809 -26978 9842 -23386
8702b3386L725j8559K4711J6706O914j5354m6103J5258p054J480j6711K981J0889
$$ -23386 -19661 -38220 -13509 3197 10111 -5243 -51346 -36088 -43142 -41662 -58373 -55392 -44503
8689d4503K6811m1370n4931J8907L8145O5798J6544k4746o529k1147j7942j9697
$$ -44503 -17692 -59062 -113993 -95086 -56941 8857 25401 655 -5874 -27021 -44963 -64660
8677f4660K5226K627k2845J0179K9996J5007j6731q317J5292j3694L2723K5199
$$ -64660 -39434 -36807 -59652 -49473 -19477 -4470 -21201 -29518 -14226 -27920 4803 30002
8665C0002j7992J5839q300o1747l1788N818l849K5066k360p567M1115N6510J9090
$$ 30002 12010 27849 19549 -42198 -73986 -68168 -72017 -46951 -49311 -56878 -15763 40747 59837
8652E9837q139n389p058m130j2927m177l1552r898k014j1671k2109J6713R518
$$ 59837 51698 46309 39251 35121 22194 18017 -13535 -23433 -25447 -37118 -59227 -42514 -32996
8639c2996K1512P2496m482l4564K7545k1090K9171K3879L689L6949L8154L2975
$$ -32996 -11484 61012 56530 21966 49511 28421 57592 81471 85160 122109 160263 193238
8627A93238J4913k1134k9048J1913k2261r519l6806l9629k0378J7989k2926l7163
$$ 193238 208151 187017 157969 169882 147621 138102 101296 61667 41289 59278 36352 -811
8615h11k2683j7018O528K3439K9792o916J3415j6090l714N1906K9405o629l247
$$ -811 -23494 -40512 -33984 -10545 19247 12331 25746 9656 5942 57848 87253 80624 77377
8602G7377n5251N045k0655J7486L7805j1073j2927J0249K9060P8865K7037k4057
$$ 77377 22126 27171 6516 24002 61807 50734 37807 48056 77116 155981 183018 158961
8590A58961j925J516o43J102n5766K3490o980n4777k0349k6730j4949o3578J725
$$ 158961 157036 158552 157909 159011 103245 126735 119755 64978 44629 17899 2950 -60628 -58903
8577e8903L6196l760L408M5685l112j2175q211M32m681Q0273O6021k6367m3207
$$ -58903 -22707 -26467 -23059 22626 19514 7339 -872 -440 -5121 75152 141173 114806 71599
8564G1599n6239Q834M0616J2842m0010p0952l7032M5838K7869K2297m1993m5217
$$ 71599 15360 24194 64810 77652 37642 -33310 -70342 -24504 3365 25662 -16331 -61548
8552f1548k7798N7645L0801n2253k903K9902M018K2662J1357l1378L8360M7774
$$ -61548 -89346 -31701 -900 -53153 -56056 -26154 -22136 526 11883 -19495 18865 66639
8540F6639K6444k2583l6246l9759P802K0485N3800L167n1926l0169l3975J5294
$$ 66639 93083 70500 34254 -5505 2297 22782 76582 79749 27823 -2346 -36321 -21027
8528b1027Q792l9165J3559L0598k0100M2242M0166J3278j4892L3653k780k9245
$$ -21027 -12235 -51400 -37841 -7243 -27343 14899 55065 68343 53451 87104 84324 55079
8516E5079m513k4945k6419K4455J6254m0539l0084J7924N017K4642N238k8769
$$ 55079 50566 25621 -798 23657 39911 -628 -30712 -12788 -7771 16871 22109 -6660
8504f660j9897J7479k671k5895J0009l2277L4761K9384M8936K2877P7l662l6714
$$ -6660 -26557 -9078 -11749 -37644 -27635 -59912 -25151 4233 53169 76046 76123 72461 35747
8491C5747m752K1266k8248q706P604k5851n61O9640K4916q772p178l7547N0104
$$ 35747 30995 52261 24013 15307 22911 -2940 -3501 66139 91055 82283 75105 37558 87662
8478H7662K1104n2834m8494L9446L2182K659L9937j99p4083m3499r722M4150o837
$$ 87662 108766 55932 7438 46884 79066 81725 121662 121463 47380 3881 -5841 38309 31472
8465C1472n0442p927K257k1074L407n262N6657N699K05N1292M1272m503n704m6095
$$ 31472 -18970 -26897 -24640 -45714 -42307 -47569 9088 14787 14992 66284 107556 103053 97349 51254
8451E1254j5125R471Q996Q468m4536j3166k3277M1052k807o4820j8849K9556m3741
$$ 51254 36129 45600 54596 63064 18528 5362 -17915 23137 20330 -44490 -63339 -33783 -77524
8438g7524j9484L2345J7159N0801O817j0232k2299K5725k7327l4701o557m3925
$$ -77524 -97008 -64663 -47504 3297 10114 -118 -22417 3308 -24019 -58720 -65277 -109202
8426a09202J7560L6766j0876k7491J1719J7300N9251P4028M641m6758j683l5467
$$ -109202 -91642 -54876 -65752 -93243 -81524 -64224 -4973 69055 73696 26938 25255 -10212
8414a0212n1870l3341l4059R984P1111j0508N527M3578J4017M643k3523j2705
$$ -10212 -62082 -95423 -129482 -119498 -48387 -58895 -53368 -9790 4227 8870 -14653 -27358
8402b7358j2530J6939K8161J6373n152P227q246k0961M183o334k9937K0907P554
$$ -27358 -39888 -22949 5212 21585 16433 23660 15414 -5547 -1364 -7698 -37635 -16728 -9174
8389i174K1070N185k9146j0544q521N1534J6873m294k4044J1985K485n1298l7310
$$ -9174 11896 17081 -12065 -22609 -31130 20404 37277 32983 8939 20924 23409 -27889 -65199
8376f5199J1412l4467j9450M1240M3029J8955J2177k0609j5121J3293L9869j9057
$$ -65199 -53787 -88254 -107704 -66464 -23435 -4480 7697 -12912 -28033 -14740 25129 6072
8364F072R136K5964J58j5991J0922m1517j1210R917j6088j2210K6498L137K9943
$$ 6072 15208 41172 41330 25339 36261 -5256 -16466 -6549 -22637 -34847 -8349 -5212 24731
8351B4731K5311K765N232l538m1905r755L1366K5919l5018M346J3060m1762j3867
$$ 24731 50042 52807 58039 54501 12596 2841 34207 60126 25108 29454 42514 752 -13115
8338a3115k0880N9731L0463j4626q796j429j7891q0597N641J068m062N195K3925
$$ -13115 -33995 25736 56199 41573 32777 31348 13457 -67140 -61499 -60431 -64493 -59298 -35373
8325c5373k8675L4521N4005K1705O1871m314m2152l4740l9735m773O643J1082
$$ -35373 -64048 -29527 24478 46183 108054 103740 61588 26848 -12887 -17660 -11017 65
8313F5k9330q5856k0853M0629M0373M5852N9071K7225o8207j6412k9234q804O977
$$ 65 -29265 -115121 -135974 -95345 -54972 -9120 49951 77176 8969 -7443 -36677 -45481 -38504
8300c8504M692k581m9386l463j1887J4093L8554L0713O3982j3650k9723m8313
$$ -38504 -33812 -36393 -85779 -89242 -101129 -87036 -48482 -17769 46213 32563 2840 -45473
8288d5473j9155L3801l9765l1247L7648K7060l9395L0122M9706l1753l4055J2502
$$ -45473 -64628 -30827 -70592 -101839 -64191 -37131 -76526 -46404 3302 -28451 -62506 -50004
8276e0004P837K9661R3465L5932J8172k7911m9918m3909o6431Q227J3885k1613
$$ -50004 -42167 -12506 80959 116891 135063 107152 57234 13325 -53106 -44879 -30994 -52607
8264e2607p226r307J3636l0519k2131M3566M6495O1885R845J0196m7818L8497
$$ -52607 -59833 -69140 -55504 -86023 -108154 -64588 -18093 43792 53637 63833 16015 54512
8252E4512J5191m7255l4356m750L9745j005o564l4779m8653Q273J3311L3624o667
$$ 54512 69703 22448 -11908 -16658 23087 22082 15518 -19261 -67914 -59641 -46330 -12706 -19373
8239a9373n659p115P542k3835l4506j8557M6335M5383p232l491J434k2292L9418
$$ -19373 -25032 -32147 -24605 -48440 -82946 -101503 -55168 -9785 -17017 -20508 -19074 -41366 -1948
8226a948M2275k531m0250l7073m1131l3137k918J5514l1236J5509M3834R3507
$$ -1948 40327 37796 -2454 -39527 -80658 -113795 -116713 -101199 -132435 -116926 -73092 20415
8214B0415L3147k1642k7322r266l0525j5719L3478N3949m431M2393k915m0107
$$ 20415 53562 31920 4598 -4668 -35193 -50912 -17434 36515 32084 74477 71562 31455
8202C1455K0598L0367N4632k9308l6217n8045J2160l73q012k9774Q298K2063K0938
$$ 31455 52053 82420 137052 107744 71527 13482 25642 25269 17257 -12517 -4219 17844 38782
8189C8782J6725L396J2885j7647m1519j4096K680L6795L783m798l9254L508R931
$$ 38782 55507 58903 71788 54141 12622 -1474 1206 38001 41784 36986 -2268 1240 11171
8176A1171n8402l4776L1246K8631J0334J003N7189L8068n9012l2438K2064L3427
$$ 11171 -47231 -82007 -50761 -22130 -11796 -10793 46396 84464 25452 -6986 15078 48505
8164D8505K0266j274J6419N92j6597m6032p4261J1174O0362K2836m200O1632K5543
$$ 48505 68771 67497 83916 84508 67911 21879 -52382 -41208 19154 41990 37790 99422 124965
8151A24965l7128k4135k2380J4042o6495j8665o868K6337O5357k7468n0242n4167
$$ 124965 87837 63702 41322 55364 -11131 -29796 -36664 -10327 55030 27562 -22680 -76847
8139g6847M9311L2419o5559K4239M610P5002L406L2130l1403n3784K3110j5283
$$ -76847 -27536 4883 -60676 -36437 -31827 43175 46581 78711 47308 -6476 16634 1351
8127A351J3052N3502j2942k7325J9929M3615K610m1095l8290m5120o471M9465
$$ 1351 14403 67905 54963 27638 47567 91182 93792 52697 14407 -30713 -37184 12281
8115A2281L2212j7913m0592M1938N7772l546K5847J5999k3655l6423J6542n4391
$$ 12281 44493 26580 -14012 27926 85698 82152 107999 123998 100343 63920 80462 26071
8103B6071l2457J2790L4551J3323m381L2103j8086K3290L6579J2637j1357j7685
$$ 26071 -6386 6404 40955 54278 49897 82000 63914 87204 123783 136420 125063 107378
8091A07378p682k2225k7322m0927P9332L4948k8252K542r641l5291n6586q5710
$$ 107378 99696 77471 50149 9222 88554 123502 95250 97792 88151 52860 -3726 -89436
8079h9436J6847M1151L8107n439l0276l2364Q472K2907J5683k4982k6519j9742
$$ -89436 -72589 -31438 6669 1230 -29046 -61410 -52938 -30031 -14348 -39330 -65849 -85591
8067h5591J3906M4278L8980M863l7176m803K5433J2898N4249l3321l0600n8191
$$ -85591 -71685 -27407 11573 16436 -20740 -25543 -110 12788 67037 33716 3116 -55075
8055e5075Q178K6331P036J5587L8068J7276l1129K2900l9337j0096K434K6335
$$ -55075 -46897 -20566 -13530 2057 40125 57401 26272 49172 9835 -261 2173 28508
8043B8508L4944J0454p390K2570M350J9713l2559o3780n2694P2622K8066o8532
$$ 28508 63452 73906 66516 89086 93436 113149 80590 16810 -35884 36738 64804 -3728
8031c728o9495l1856O6040L2915P366j2068o373Q149L6612K6194L6352J6374j6885
$$ -3728 -73223 -105079 -39039 -6124 1242 -10826 -17199 -9050 27562 53756 90108 106482 89597
8018H9597O594j1295L166K5006k4084k4272L3480L1552k8444l6628K813k1244
$$ 89597 96191 84896 88062 113068 88984 64712 98192 129744 101300 64672 67485 46241
8006D6241l1025J7813o813k2596k344L3934O4185J1780m0336k2369j3878N3J1503
$$ 46241 15216 33029 26216 3620 1276 35210 99395 111175 70839 48470 34592 34645 46148
7993D6148j5584j3017l987q730J7262J8344k3986l6665L3096K0965j8948l9473
$$ 46148 30564 17547 13560 4830 22092 40436 16450 -20215 12881 33846 14898 -24575
7981b4575k7112J4309k6345L6646M8764L547J5217O665j4283Q575M7294o397l5401
$$ -24575 -51687 -37378 -63723 -27077 21687 25234 40451 47116 32833 41408 88702 82305 46904
7968D6904R956N961m3599l7922L4769n5326k1444L3810N0627m551J3473J7944
$$ 46904 56860 62821 19222 -18700 16069 -39257 -60701 -26891 23736 19185 32658 50602
7956E0602j657J2110l8478k0072J5929l2286K2610p962R885L6247M7332k8662
$$ 50602 48945 61055 22577 2505 18434 -13852 8758 796 10681 46928 94260 65598
7944F5598n3611J475n631M0839J2149R457n1088k7991M146L056L4582J094l4369
$$ 65598 11987 13462 7831 48670 60819 70276 19188 -8803 -4657 -1601 32981 34075 -294
7931b94K9977k0198o541K7458j8704k5666L0651L4124j1792l3178j2270L4161
$$ -294 29683 9485 2944 30402 11698 -13968 16683 50807 39015 5837 -6433 27728
7919B7728L662K1812j5298k730J0993R328K990O1533L2066l474m7716m4195l5203
$$ 27728 31390 53202 37904 35174 46167 55495 58485 120018 152084 148610 100894 56699 21496
7906B1496j389J3316L3292K2514M0294O1593n9334m8257j599j4967p1165n1039
$$ 21496 20107 33423 66715 89229 129523 191116 131782 83525 81926 66959 -4206 -55245
7894e5245l9476K1117O8949J6712l2609R942J714M3012M7002m7588k9123n2751
$$ -55245 -94721 -73604 -4655 12057 -20552 -10610 -8896 34116 81118 33530 4407 -48344
7882d8344m0207J1164Q2775J6329l1295k4191K6151K385p4142r260j049N4903
$$ -48344 -88551 -77387 5388 21717 -9578 -33769 -7618 -5233 -79375 -88635 -89684 -34781
7870c4781N7241N8955l8332m1529n1130N0184j104J3393J4512J3289k3039q8m9783
$$ -34781 22460 81415 43083 1554 -49576 608 -496 12897 27409 40698 17659 17571 -32212
7857c2212J7961k7085l2274K3335K2138Q622J4846k000k3403m6215J0594L3090
$$ -32212 -14251 -41336 -73610 -50275 -28137 -19515 -4669 -6669 -30072 -76287 -65693 -32603
7845c2603K4994l7067K8507M26M3128m463j5897M3862l0093j1014j1553m508K516
$$ -32603 -7609 -44676 -16169 -15743 27385 22922 7025 50887 20794 9780 -1773 -6281 -3765
7832c765l2229l1127l2242q205P6984K1574l098j5365m0825L2802k2050j5160
$$ -3765 -35994 -67121 -99363 -107568 -30584 -9010 -12108 -27473 -68298 -35496 -57546 -72706
7820g2706L8744K4681M3246j5707j8441k9673k195N9407K1555l8829j9069n0731
$$ -72706 -33962 -9281 33965 18258 -183 -29856 -32051 27356 48911 10082 -8987 -59718
7808e9718l6326N5602J7283m6554L9362k381j8311N616j0279P338n792m4537K8610
$$ -59718 -96044 -40442 -23159 -69713 -30351 -32732 -51043 -45427 -55706 -48368 -54160 -98697 -70087
7795g0087N9478K9414L806j5969J0889p686j1094l9149p023K8027K1847K2062
$$ -70087 -10609 18805 22611 6642 17531 9845 -1249 -40398 -47421 -19394 2453 24515
7783B4515o380l7776J8697N5191L7002m4354n5163j1921L4181J6190m5349l0754
$$ 24515 18135 -19641 -944 54247 91249 46895 -8268 -20189 13992 30182 -15167 -45921
7771d5921L0220K8519L3019J2295m1278j7494n7903n5244m49J1599j9738O220
$$ -45921 -15701 12818 45837 58132 16854 -640 -58543 -113787 -114236 -102637 -122375 -116155
7759a16155L3526L6968Q418k569n540J414k1983j7466j1586M8059J1495n3572
$$ -116155 -82629 -45661 -37243 -39812 -45352 -43938 -65921 -83387 -94973 -46914 -35419 -88991
7747h8991M7227K4539N67k09N2403K4763O038n4814j9967L618k3389j4095M5519
$$ -88991 -41764 -17225 -16658 -16867 35536 60299 66337 11523 -8444 -4826 -28215 -42310 3209
7734C209L7J6950N986Q788j6317o1075o685P9116j6750l2899K1833M1077l620
$$ 3209 3246 20196 26182 34970 18653 -42422 -49107 30009 13259 -19640 2193 43270 39650
7721C9650o3820k722O9028L1841n0132k4336L8942K1297k7014n3077L9061M0579
$$ 39650 -24170 -26892 42136 73977 23845 -491 38451 59748 32734 -20343 18718 59297
7709E9297K1095K638Q197l6102n7848r366o7847L5889N5221J254K337j6452r301
$$ 59297 80392 83030 91227 55125 -2723 -12089 -79936 -44047 11174 12428 14765 -1687 -10988
7696a0988L2429L3815m7798k4445L420o6135M320P881L4483O8677J5409l5592
$$ -10988 21441 55256 7458 -16987 -13567 -79702 -75382 -67501 -33018 35659 51068 15476
7684A5476j8395l0832L255J5902J1217l709L8891N1245L9935m6792j7332J7828
$$ 15476 -2919 -33751 -30496 -14594 -3377 -7086 31805 83050 122985 76193 58861 76689
7672G6689n031m1761l0320k0007k2289L7458K1225n4386k1855R6245L3878j9850
$$ 76689 71658 29897 -423 -20430 -42719 -5261 15964 -38422 -60277 35968 69846 49996
7660D9996n0818n5815L6643L6238L5754j7232k5199J0866m1624m863j4813l4249
$$ 49996 -822 -56637 -19994 16244 51998 34766 9567 20433 -21191 -26054 -40867 -75116
7648g5116k0350R144m5261L977P8587j7505O6421P9405J4945k9564R728l1604
$$ -75116 -95466 -86322 -131583 -127606 -49019 -66524 -103 79302 94247 64683 74411 42807
7636D2807l7345j7586M9175k3484l4065K2924l6449K8910M7308j5187m9062n5547
$$ 42807 5462 -12124 37051 13567 -20498 2426 -34023 -5113 42195 27008 -22054 -77601
7624g7601k0201q86K0822R15k45K0345L9981K3090k9698J509N792J5392K8239
$$ -77601 -97802 -98688 -77866 -76951 -77196 -56851 -16870 6220 -23478 -21969 -16177 -785 27454
7611B7454l9261m4149M21l1075O2710P7240K160n1709k0020k0312j3181l2431
$$ 27454 -11807 -55956 -55535 -86610 -23900 53340 55500 3791 -16229 -36541 -49722 -82153
7599h2153Q23j8769j3670J9747M8359M7913j0079O361n119P293M6768r761n3377
$$ -82153 -81330 -100099 -113769 -94022 -45663 2250 -7829 -1468 -6587 706 47474 37713 -15664
7586a5664k7790J9555L1786j9054l2501K1276J8405L2051J5859J0390j2668q4638
$$ -15664 -43454 -23899 7887 -11167 -43668 -22392 -3987 28064 43923 54313 41645 -42993
7574d2993m259N7491L0859L4462j0225n3381l3446J1279m0725k1375K6581m251
$$ -42993 -47252 10239 41098 75560 65335 11954 -21492 -10213 -50938 -72313 -45732 -49983
7562d9983l8452m638L5177K4901j5813m1038j2211k4608K863j4783K6432L6908
$$ -49983 -88435 -93073 -57896 -32995 -48808 -89846 -102057 -126665 -123802 -138585 -112153 -75245
7550g5245N898K5537K4654N312M5397L2004J9365j5030k4917j715K7429k9002
$$ -75245 -69347 -43810 -19156 -13844 31553 63557 82922 67892 42975 41260 68689 39687
7538C9687p2593l9165J3219J8446k1800K583j7207J6750J7510M0617J7554q157
$$ 39687 -32906 -72071 -58852 -40406 -62206 -59623 -76830 -60080 -42570 -1953 15601 7444
7526G444m1454l1737J1142J934J0064J4812K9815J1734r624j869K9426Q882j6067
$$ 7444 -34010 -65747 -54605 -52671 -42607 -27795 2020 13754 4130 2261 31687 40569 24502
7513B4502n3270r702j9704m3802J6362K0280L5288K7963l1065M5866J2044o7279
$$ 24502 -28768 -38470 -58174 -101976 -85614 -65334 -30046 -2083 -33148 12718 24762 -42517
7501d2517p170k0851O798K1786L067l994l2653o2277L3614K9508j3257l3725L3389
$$ -42517 -49687 -70538 -63740 -41954 -38887 -42881 -75534 -137811 -104197 -74689 -87946 -121671 -88282
7488h8282K4182K7638K0044J1876m7700O194P8141O0086q553J037k9885n8213
$$ -88282 -64100 -36462 -16418 -4542 -52242 -46048 32093 92179 83626 84663 54778 -3435
7476c435J0225J3221o5221r515J8593K6444N2730N260l8265o4984M821J8268M7860
$$ -3435 6790 20011 -45210 -54725 -36132 -9688 43042 48302 10037 -54947 -50126 -31858 16002
7463A6002L9020j109m7098k816K191L2973M4191j7616l8374o4063j02985M8044
$$ 16002 55022 53913 6815 3999 6190 39163 83354 65738 27364 -36699 -139684 -91640
7451i1640N3386J1585L3785j6803k22O2508L6946r331m9581l1730m9562j1577
$$ -91640 -38254 -26669 7116 -9687 -9909 52599 89545 80214 30633 -1097 -50659 -62236
7439f2236K4206Q5141j4968n2695K9295Q4780Q458p2740n0583L8520K6695k7841
$$ -62236 -38030 47111 32143 -20552 8743 93523 101981 29241 -21342 17178 43873 16032
7427A6032q174j411k6315j8458J665K3831j4047j852P433q76n801N7475P123k4144
$$ 16032 7858 6447 -19868 -38326 -36661 -12830 -26877 -28729 -21296 -22172 -27973 29502 36625 12481
7413A2481K9471j1484k4000k3367J1762j168M992K5550K7305j7737k8346j272
$$ 12481 41952 30468 6468 -16899 -5137 -6305 -1313 24237 51542 33805 5459 4187
7401D187j7238Q298J4112K4942j9118m9781K9856M1063j1332l0155O5891J804
$$ 4187 -13051 -4753 9359 34301 15183 -34598 -4742 36321 24989 -5166 60725 62529
7389F2529J2628m4539L6514l0299o1030n9595n5490l397J4603N3255L4148l4494
$$ 62529 75157 30618 67132 36833 -24197 -83792 -139282 -142679 -128076 -74821 -40673 -75167
7377g5167L6745M5037Q319r619l9635j3534P335J7340K1481k331k0229l2831p444
$$ -75167 -38422 6615 14934 5315 -34320 -47854 -40519 -23179 -1698 -4029 -24258 -57089 -64533
7364f4533j2743K0484j9552j5807J5880K6223M9419j9091j8111R915j346L6746
$$ -64533 -77276 -56792 -76344 -92151 -76271 -50048 -629 -19720 -37831 -27916 -29262 7484
7352G484M0867q956k2887Q042J184k7097o24l8298l9588j7176M4852p058j7195
$$ 7484 48351 39395 16508 24550 25734 -1363 -1987 -40285 -79873 -97049 -52197 -59255 -76450
7339g6450j0229k8253N0158L1951J8876K8798J8463k727k1944j604k1273J6009
$$ -76450 -86679 -114932 -64774 -32823 -13947 14851 33314 30587 8643 7039 -14234 1775
7327A775l8544k1231J6208N743J4276k2388o5996K1028M9169O2471j1395o424
$$ 1775 -36769 -58000 -41792 -36049 -21773 -44161 -110157 -89129 -39960 22511 11116 4692
7315D692K1537l6530p195K6531L1631j0959L282q4884l0617Q7035K5864l0993
$$ 4692 26229 -10301 -17496 9035 40666 29707 32989 -51895 -82512 4523 30387 -606
7303f06l185J5331k0966n729J6617j4498n0259k8000p534J2784K1374Q4752P2923
$$ -606 -3791 11540 -9426 -15155 1462 -13036 -63295 -91295 -98829 -86045 -64671 20081 93004
7290I3004q508l6399M4038k8378m5744m7981o253K8841j5618j7460N16J2466M3372
$$ 93004 84496 48097 92135 63757 18013 -29968 -36221 -7380 -22998 -40458 -39942 -27476 15896
7277A5896J0787j4751m5095J7137j8381K6780N7563J4642m5238k4877k0922j6430
$$ 15896 26683 11932 -33163 -16026 -34407 -7627 49936 64578 19340 -5537 -26459 -42889
7265d2889m2070Q856k1088k3169l0266M5609R552J6187M4304m1368L494K3237
$$ -42889 -84959 -76103 -97191 -120360 -150626 -105017 -95465 -79278 -34974 -76342 -72848 -49611
7253d9611J1635p177n257m5154l4841R2646K6732K3792L2576l12j8987p61j7615
$$ -49611 -37976 -45153 -50410 -95564 -130405 -37759 -11027 12765 45341 45029 26042 25281 7666
7240G666j4142o1250n5497L9462O8051M4694p103L134L0466j3746n2323P994J3527
$$ 7666 -6476 -67726 -123223 -83761 -15710 28984 21881 25015 55481 41735 -10588 -2594 10933
7227A0933j1158N253k9076K811m6243K068L1442J7481J3263l8594k8322m3005
$$ 10933 -225 5028 -24048 -21237 -67480 -65412 -33970 -16489 -3226 -41820 -70142 -113147
7215a13147j2736L1191O2289K6167p306j2260K8410J1639R994L0443j9228j9388
$$ -113147 -125883 -94692 -32403 -6236 -13542 -25802 2608 14247 24241 54684 35456 16068
7203A6068l6416j203J8580K9597q697J606k0698K5047q059j9911J8543j0261M040
$$ 16068 -20348 -21551 -2971 26626 17929 19535 -1163 23884 15825 -4086 14457 4196 8236
7190H236J5025k3422j6891n586K3033K0513p702l1449L7780R646j0419K4208n4557
$$ 8236 23261 -161 -17052 -22638 395 20908 13206 -18243 19537 29183 18764 42972 -11585
7177a1585P953k6237p2811r877O9103K9769k1000K5203l7817j5571N7867O7551
$$ -11585 -3632 -29869 -102680 -112557 -43454 -13685 -34685 -9482 -47299 -62870 -5003 62548
7165F2548L8703r2822p4621m191P731L859N027k3589P2200J5423j1643J702l0914
$$ 62548 101251 8429 -66192 -70383 -62652 -58793 -53766 -77355 -5155 10268 -1375 327 -30587
7152c0587J5478l4532m1031M4141J221P396L1426l1129j4467J4995J4331P599
$$ -30587 -15109 -49641 -90672 -46531 -45310 -37914 -6488 -37617 -52084 -37089 -22758 -15159
7140a5159K3999l2065l0016N3091K6687l2329J7414P7809l7513q1710m2010K6973
$$ -15159 8840 -23225 -53241 -150 26537 -5792 11622 89431 51918 -29792 -71802 -44829
7128d4829K6180K1458L2157J0989l2546k2860l0719L3238J8489m3532N866L6496
$$ -44829 -18649 2809 34966 45955 13409 -9451 -40170 -6932 11557 -31975 -26109 10387
7116A0387j795j5080L7114k2847j4432n563j9237k2619N2417K2079K7737k5860
$$ 10387 8592 -6488 30626 7779 -6653 -12216 -31453 -54072 -1655 20424 48161 22301
7104B2301L7533J3457m3021k1624O1020k875o3691j11473j8601K1349L8349K3942
$$ 22301 59834 73291 30270 8646 69666 66791 3100 -108373 -126974 -105625 -67276 -43334
7092d3334K4403R70j2366j8203J9043J9287l208n2961m416P0231P2471j991l5773
$$ -43334 -18931 -17961 -30327 -48530 -29487 -10200 -13408 -66369 -70785 -554 71917 69926 34153
7079C4153J197j1509k0867K2866k8607m659j995l0385k6554L053J1744j6711l3189
$$ 34153 35350 23841 2974 25840 -2767 -7426 -9421 -39806 -66360 -63307 -51563 -68274 -101463
7066a01463k2287j7730M0406P8895R603J9226J7092K9557K211Q463J0686l5501
$$ -101463 -123750 -141480 -101074 -22179 -12576 6650 23742 53299 55510 63973 74659 39158
7054C9158n182l8021K3437l405m0727k7822j1147j4098m4974k7875R259L0531
$$ 39158 33976 -4045 19392 15987 -24740 -52562 -63709 -77807 -122781 -150656 -141397 -110866
7042a10866L2016J0410j1398k7687O2086L8047m706k003K0119J5194k0303J2964
$$ -110866 -78850 -68440 -79838 -107525 -45439 -7392 -12098 -14101 6018 21212 909 13873
7030A3873J1559P988J7715j4611n753l8040k7189Q716J3121O825l5772J7785l0976
$$ 13873 25432 33420 51135 36524 30771 -7269 -34458 -25742 -12621 -5796 -41568 -23783 -54759
7017e4759k9055J821L7439N4280m882J3132l1395J8579L3732p787m0210n7731
$$ -54759 -83814 -81993 -44554 9726 4844 17976 -13419 5160 38892 31105 -9105 -66836
7005f6836O462M004J0492N5674k282p9730J825K1065M713K0912k158L4928K0643
$$ -66836 -60374 -56370 -45878 9796 7514 -72216 -70391 -49326 -44613 -23701 -25859 9069 29712
6992B9712m7189j03661k2885N3177K8842J4600K2342k7432K0771r606M65J3139
$$ 29712 -17477 -121138 -144023 -90846 -62004 -47404 -25062 -52494 -31723 -41329 -40864 -27725
6980b7725L2588N513m3802R963m5020J7192M0530K8072m442j0018r44m6870M4300
$$ -27725 4863 10376 -33426 -23463 -68483 -51291 -10761 17311 12869 2851 1907 -44963 -663
6967f63j779o9029J8127p715M308J1362k0723k4311O078K1431J996N7512n4928
$$ -663 -2442 -71471 -53344 -61059 -56751 -45389 -66112 -90423 -84345 -62914 -60918 -3406 -58334
6954e8334l3083R4953l166J3466j2912J2297M667k031J1873K5966l2026j3966
$$ -58334 -91417 3536 370 13836 924 13221 17888 15857 27730 53696 21670 7704
6942G704L0003j7860k2961O3079l1790m0572J5549L995J5076m574j5613M795j7615
$$ 7704 37707 19847 -3114 59965 28175 -12397 3152 7147 22223 17649 2036 6831 -10784
6929a0784P027P744P878n7606o1220j9364O1152J8955J7348K1001j0394k5363
$$ -10784 -3757 3987 11865 -45741 -106961 -126325 -65173 -46218 -28870 -7869 -18263 -43626
6917d3626M5009j4692m3075K2888K7015L9841O3879J5408q5292n4692J5195j7896
$$ -43626 1383 -13309 -56384 -33496 -6481 33360 97239 112647 27355 -27337 -12142 -30038
6905c0038j4888M0188J9502L100M7545l7540k6340j206K7135J1552n141j7729
$$ -30038 -44926 -4738 14764 17864 65409 27869 1529 323 27458 39010 33869 16140
6893A6140m7960k2752K2174O0139L4498K149J2536o3303m5830J4720J2997m6049
$$ 16140 -31820 -54572 -32398 27741 62239 64388 76924 13621 -32209 -17489 -4492 -50541
6881e0541O92M4744j19L2144K1729l0404n201o175n1302O864l3446L6804J6572
$$ -50541 -49849 -5105 -5224 26920 48649 18245 13044 6869 -44433 -37569 -71015 -34211 -17639
6868a7639q65k4261n287N0232L2605J8737o006m0877k2935j5627J861k400r726
$$ -17639 -18504 -42765 -48052 2180 34785 53522 47516 6639 -16296 -31923 -30062 -32462 -42188
6855d2188Q288J9364K5247P9976o035k9538L0518M5939N443m3913k6056J257m9963
$$ -42188 -33900 -14536 10711 90687 84652 55114 85632 131571 137014 93101 67045 68302 18339
6842A8339p7354l0362K7722N3911O3980r196k9758o537L464p5k0929k4626J333
$$ 18339 -59015 -89377 -61655 -7744 56236 47040 17282 10745 14209 14134 -6795 -31421 -30088
6829c0088k2027K1887K6429q462k7678J5782L5651m1380k5743L969K4284m707
$$ -30088 -52115 -30228 -3799 -12261 -39939 -24157 11494 -29886 -55629 -51660 -27376 -32083
6817c2083k885l6436J1987O9885j1762n5417o175k738N2920L8568k1398n4776
$$ -32083 -34968 -71404 -59417 10468 -1294 -56711 -62886 -65624 -12704 25864 4466 -50310
6805e0310J5681P988K7361K2071j6335n4840j1834L4984M0069J0764l005p565
$$ -50310 -34629 -26641 720 22791 6456 -48384 -60218 -25234 14835 25599 22594 15029
6793A5029o207n6778n8395M521M6626O8630n4633p365M1968j1225k9105L2292
$$ 15029 8822 -47956 -106351 -101830 -55204 13426 -41207 -48572 -6604 -17829 -46934 -14642
6781a4642M2485n1904l4958K2974M4820J5777k7281P2746J5146k1595k8703m2847
$$ -14642 27843 -24061 -59019 -36045 8775 24552 -2729 70017 85163 63568 34865 -7982
6769g982O6013o774n2056n3983M6696M2251Q994m6172q055L3657l576m4037m9523
$$ -7982 58031 51257 -799 -54782 -8086 34165 43159 -3013 -11068 22589 19013 -25024 -74547
6756g4547m340k6587k2232O0130O7618k1797j162J7947K2095n2199m8514O5516
$$ -74547 -78887 -105474 -127706 -67576 42 -21755 -22917 -4970 17125 -35074 -83588 -18072
6744a8072Q2915j4762j9202j9029j9782k2585l7158k3741J3067l6914m2960K5984
$$ -18072 64843 50081 30879 11850 -7932 -30517 -67675 -91416 -78349 -115263 -158223 -132239
6732a32239N8976L023j8068Q726J5578K4226j5674N1874P4497o0545o8742j0334
$$ -132239 -73263 -70240 -88308 -79582 -64004 -39778 -55452 -3578 70919 10374 -58368 -68702
6720f8702J10921M7306m6821j0160R523M801p0352k998L6575P8489o710j2726
$$ -68702 42219 89525 42704 32544 42067 46868 -23484 -26482 10093 88582 81872 69146
6708F9146m6097j9397n134J8579k0403o8188m93K0113o65J0367R279p4772N515
$$ 69146 23049 3652 -1482 17097 -3306 -71494 -71987 -51874 -52539 -42172 -32893 -107665 -102150
6695a02150N2639k5321j1272P055k5245j5877L5346M2611N6681J0969L8904P617
$$ -102150 -49511 -74832 -86104 -79049 -104294 -120171 -84825 -42214 14467 25436 64340 71957
6683G1957m5537m1245p2300l3665O7624J428R641K9597P4029J5754q8063k4110
$$ 71957 26420 -14825 -87125 -120790 -53166 -51738 -42097 -12500 61529 77283 -10780 -34890
6671c4890M065K1886k5941L0962J3485L7113o0529l8715J5881o5166L6740M8529
$$ -34890 -30825 -8939 -34880 -3918 9567 46680 -13849 -52564 -36683 -101849 -65109 -16580
6659a6580j2739K3409o6899n8902J2297j2727L0234M8627M0918K2746L6345R638
$$ -16580 -29319 -5910 -72809 -131711 -119414 -132141 -101907 -53280 -12362 10384 46729 56367
6647E6367l1456M083L0900L2004j9384k0604l759j1112J2922l2546l8038n1918
$$ 56367 24911 28994 59894 91898 72514 51910 48151 37039 49961 17415 -20623 -72541
6635g2541J0614J5983J6381l961J6374K2408J277r692L3302K2014j8297Q416K1000
$$ -72541 -61927 -45944 -29563 -33524 -17150 5258 6535 -3157 30145 52159 33862 42278 63278
6622F3278K0295k2256n0325m8098q356J5630N0843J1262o8716l3966N2317O0830
$$ 63278 83573 61317 10992 -37106 -45462 -29832 21011 32273 -36443 -70409 -18092 42738
6610D2738K7191j5755l8963J4741N410N607k0501j3009Q1n5095m2775O7648M3806
$$ 42738 69929 54174 15211 29952 35362 40969 20468 7459 7540 -47555 -90330 -22682 21124
6597B1124J4758o7218J4784L7158O954j7355r489n257k5546J2915q51L3658j388
$$ 21124 35882 -31336 -16552 20606 27560 10205 716 -4541 -30087 -17172 -18023 15635 14247
6584A4247J3673k5809m4520N6041O2047j5832n9871K1514P845q566l2798R642
$$ 14247 27920 2111 -42409 13632 75679 59847 -24 21490 29335 20769 -12029 -2387
6572b387o089K2700M4338L2939l1918p0302l8694J2451L6520L498k7403l6162
$$ -2387 -8476 14224 58562 91501 59583 -10719 -49413 -36962 -442 3056 -24347 -60509
6560f0509J433L4175K3977l467j184j180J0740j9612l4610J2315M3279k2637K329
$$ -60509 -59076 -24901 -924 -4391 -5575 -6755 3985 -15627 -50237 -37922 5357 -17280 -14951
6547a4951j1089j5835l0119j4519L2624K8138N4130L309j8374K7367r5159m5786
$$ -14951 -26040 -41875 -71994 -86513 -53889 -25751 28379 31688 13314 40681 -54478 -100264
6535a00264L0020L7796J0986J1601k0576M403l496N2394K7983l0052J4066K2765
$$ -100264 -70244 -32448 -21462 -9861 -30437 -26034 -29530 22864 50847 20795 34861 57626
$$ [...]
##END NTUPLES=NMR SPECTRUM
##END=
