##TITLE=Analysis number 312987
Compound Code cc 40114
Book Reference 350/174/1
Project Code adrs
Chemist Name chrisr
##JCAMPDX= 6.0         $$ Bruker NMR JCAMP-DX V2.0
##DATA TYPE= NMR SPECTRUM
##DATA CLASS= NTUPLES
##ORIGIN= Bruker BioSpin GmbH
##OWNER= NMR
$$ XWIN-NMR		Version 3.5
$$ Mon Aug 22 14:49:18 2005 GMT Daylight Time (UT+1h)  MAYBRIDGE\NMR@NMR_250MHZ
##.OBSERVE FREQUENCY= 250.131544655141
##.OBSERVE NUCLEUS= ^1H
##.ACQUISITION MODE= SIMULTANEOUS (DQD)
##.ACQUISITION SCHEME= undefined
##.AVERAGES= 16
##.DIGITISER RES= 18
##SPECTROMETER/DATA SYSTEM= dpx250
##.PULSE SEQUENCE= zg30
##.SOLVENT NAME= CDCl3
##.SHIFT REFERENCE= (INTERNAL, CDCl3, 0, 16.522)
##AUDIT TRAIL= $$ (NUMBER, WHEN, WHO, WHERE, WHAT)
$$ ##TITLE= Audit trail, XWIN-NMR		Version 3.5
$$ ##JCAMPDX= 5.01
$$ ##ORIGIN= Bruker BioSpin GmbH
$$ ##OWNER= NMR
$$ C:\u/data/dgb/nmr/ADRS/8340/pdata/1/auditp.txt
$$ ##AUDIT TRAIL=  $$ (NUMBER, WHEN, WHO, WHERE, WHAT)
(   1,<2005-08-22 14:48:42.28 +100>,<MAYBRIDGE\NMR>,<NMR_250MHZ>,
      <created by zg, POWCHK disabled, PULCHK disabled
       configuration hash MD5:
       62 19 C7 07 E1 42 D1 B7 37 6C 3D D0 77 39 F9 E6
       data hash MD5: 64K
       CE CD E4 B4 37 45 62 30 2C 0E 7F 99 64 0D 08 DF>)
(   2,<2005-08-22 14:48:59.41 +100>,<MAYBRIDGE\NMR>,<NMR_250MHZ>,
      <Start of raw data processing
       ef LB = 0.3 FT_mod = 6 PKNL = 1 SI = 32K 
       data hash MD5: 32K
       76 FC A6 17 24 45 1D 70 D0 EA 16 C7 10 90 1A C2>)
(   3,<2005-08-22 14:49:04.31 +100>,<MAYBRIDGE\NMR>,<NMR_250MHZ>,
      <apk 
       data hash MD5: 32K
       80 3B F4 34 B8 64 8E 75 A4 EA 1C 2A 0E 54 1A FA>)
(   4,<2005-08-22 14:49:06.11 +100>,<MAYBRIDGE\NMR>,<NMR_250MHZ>,
      <abs ABSG = 5 
       data hash MD5: 32K
       E3 B0 52 C4 FB 1F 5E FD F5 12 7B DC 1D 11 3F FA>)
$$ ##END=
$$ 
$$ hash MD5
$$ F0 97 8D E4 D5 27 81 EE DA 18 75 91 3B 89 81 94
##$RELAX= 
##$RELAX= 
##$RELAX= 
##$RELAX= 
##$RELAX= 
##$RELAX= 
##$RELAX= 
$$ Bruker specific parameters
$$ --------------------------
##$DU= <C:\u>
##$EXPNO= 8340
##$NAME= <ADRS>
##$PROCNO= 1
##$TYPE= <nmr>
##$USER= <dgb>
##$AMP= (0..31)
100 100 100 100 100 100 100 100 100 100 100 100 100 100 100 100 100 100 
100 100 100 100 100 100 100 100 100 100 100 100 100 100 
##$AQSEQ= 0
##$AQ_mod= 3
##$AUNM= <au_zg>
##$AUTOPOS= <29 >
##$BF1= 250.13
##$BF2= 250.13
##$BF3= 250.13
##$BF4= 250.13
##$BF5= 500.13
##$BF6= 500.13
##$BF7= 500.13
##$BF8= 500.13
##$BYTORDA= 1
##$CFDGTYP= 0
##$CFRGTYP= 5
##$CHEMSTR= <none>
##$CNST= (0..31)
1 1 145 1 1 1 1 1 1 1 1 1 1 1 1 1 1 1 1 1 1 1 1 1 1 1 1 1 1 1 1 1 
##$CPDPRG= <>
##$CPDPRG1= <>
##$CPDPRG2= <>
##$CPDPRG3= <>
##$CPDPRG4= <mlev>
##$CPDPRG5= <mlev>
##$CPDPRG6= <mlev>
##$CPDPRG7= <mlev>
##$CPDPRG8= <mlev>
##$CPDPRGB= <>
##$CPDPRGT= <>
##$D= (0..31)
0 1 0 0 0 0 0 0 0 0.06 0 0 0 0 0 0 0.0002 0 0 0 0 0 0 0 0 0 0 0 0 0 0 
0 
##$DATE= 1124718521
##$DBL= (0..7)
120 120 120 120 120 120 120 120 
##$DBP= (0..7)
150 150 150 150 150 150 150 150 
##$DBP07= 0
##$DBPNAM0= <>
##$DBPNAM1= <>
$$ [...]
##$SUBNAM7= <"">
##$SUBNAM8= <"">
##$SUBNAM9= <"">
##$SW= 20.6930455092707
##$SWIBOX= (0..15)
0 0 3 0 0 0 0 0 0 0 0 0 0 0 0 0 
##$SW_h= 5175.983436853
##$TD= 65536
##$TD0= 1
##$TE= 295.16
##$TE2= 300
##$TE3= 300
##$TEG= 300
##$TL= (0..7)
0 120 120 120 120 120 120 120 
##$TP= (0..7)
150 150 150 150 150 150 150 150 
##$TP07= 0
##$TPNAME0= <>
##$TPNAME1= <>
##$TPNAME2= <>
##$TPNAME3= <>
##$TPNAME4= <>
##$TPNAME5= <>
##$TPNAME6= <>
##$TPNAME7= <>
##$TPOAL= (0..7)
0.5 0.5 0.5 0.5 0.5 0.5 0.5 0.5 
##$TPOFFS= (0..7)
0 0 0 0 0 0 0 0 
##$TUNHIN= 0
##$TUNHOUT= 0
##$TUNXOUT= 0
##$USERA1= <user>
##$USERA2= <user>
##$USERA3= <user>
##$USERA4= <user>
##$USERA5= <user>
##$V9= 5
##$VALIST= <valist>
##$VCLIST= <CCCCCCCCCCCCCCC>
##$VD= 0
##$VDLIST= <DDDDDDDDDDDDDDD>
##$VPLIST= <PPPPPPPPPPPPPPP>
##$VTLIST= <TTTTTTTTTTTTTTT>
##$WBST= 1024
##$WBSW= 4
##$XGAIN= (0..3)
0 0 0 0 
##$XL= 0
##$YL= 0
##$YMAX_a= 362269
##$YMIN_a= -529269
##$ZGOPTNS= <>
##$ZL1= 120
##$ZL2= 120
##$ZL3= 120
##$ZL4= 120
##$ABSF1= 16.522
##$ABSF2= -4.171173
##$ABSG= 5
##$ABSL= 3
##$ALPHA= 0
##$AQORDER= 0
##$ASSFAC= 0
##$ASSFACI= 0
##$ASSFACX= 0
##$ASSWID= 0
##$AUNMP= <proc_1d>
##$AZFE= 0.1
##$AZFW= 0.1
##$BCFW= 0
##$BC_mod= 0
##$BYTORDP= 0
##$COROFFS= 0
##$CY= 12.5
##$DATMOD= 1
##$DC= 0
##$DFILT= <>
##$DTYPP= 0
##$F1P= 14.0000005364418
##$F2P= -0.99999901652339
##$FCOR= 0.5
##$FTSIZE= 32768
##$FT_mod= 6
##$GAMMA= 0
##$GB= 0
##$INTBC= 1
##$INTSCL= 1
##$ISEN= 128
##$LB= 0.3
##$LEV0= 0
##$LPBIN= 0
##$MAXI= 10000
##$MC2= 0
##$MEAN= 0
##$ME_mod= 0
##$MI= 0
##$NCOEF= 0
##$NC_proc= -5
##$NLEV= 6
##$NOISF1= 0
##$NOISF2= 0
##$NSP= 0
##$NTH_PI= 0
##$NZP= 0
##$OFFSET= 16.522
##$PC= 1
##$PHC0= -78.07922
##$PHC1= 5.258152
##$PH_mod= 1
##$PKNL= yes
##$PPARMOD= 0
##$PSCAL= 4
##$PSIGN= 0
##$REVERSE= no
##$SF= 250.13
##$SI= 32768
##$SIGF1= 0
##$SIGF2= 0
##$SINO= 400
##$SIOLD= 32768
##$SREGLST= <1H.CDCl3>
##$SSB= 0
##$STSI= 32768
##$STSR= 0
##$SW_p= 5175.98343685301
##$SYMM= 0
##$S_DEV= 0
##$TDeff= 65536
##$TDoff= 0
##$TI= <Analysis number 999999
Compound Code 99
Book Reference 9
Project Code 9>
##$TILT= no
##$TM1= 0
##$TM2= 0
##$TOPLEV= 0
##$USERP1= <user>
##$USERP2= <user>
##$USERP3= <user>
##$USERP4= <user>
##$USERP5= <user>
##$WDW= 1
##$XDIM= 32768
##$YMAX_p= 439625585
##$YMIN_p= -474254
$$ End of Bruker specific parameters
$$ ---------------------------------
##NTUPLES= NMR SPECTRUM
##VAR_NAME=  FREQUENCY,     SPECTRUM/REAL,   SPECTRUM/IMAG
##SYMBOL=    X,             R,               I
##VAR_TYPE=  INDEPENDENT,   DEPENDENT,       DEPENDENT
##VAR_FORM=  AFFN,          ASDF,            ASDF
##VAR_DIM=   32768,         32768,           32768
##UNITS=     HZ,            ARBITRARY UNITS, ARBITRARY UNITS
##FACTOR=    0.157963299565203, 1,           1
##FIRST=     4132.6476996994, 0,             0
##LAST=      -1043.33573715361, 0,           0
##MIN=       -1043.33573715361, -474254,     0
##MAX=       4132.6476996994, 439625585,     0
$$ Real data points
##PAGE= N=1
##DATA TABLE= (X++(R..R)), XYDATA
$$ [...]
17176B6241673r13227q90262r26196q97198r32370q04856r79623j043127r92298
$$ 26241673 25328446 24438184 23511988 22614790 21682420 20877564 19897941 18854814 17862516
17167A7862516r02599r45973r13153q17547q39672o99671n87555n96812m75363
$$ 17862516 16959917 16013944 15100791 14283244 13443572 12743901 12156346 11559534 11084171
17158A1084171n06286m06398m92004m00566k40808k67889l00995n01378l83928
$$ 11084171 10577885 10171487 9679483 9278917 9038109 8770220 8469225 7967847 7583919
17149G583919k75278k93045k52489j29121l45951l03325k29833j68136j28997
$$ 7583919 7308641 7015596 6763107 6633986 6288035 5984710 5754877 5586741 5457744
17140E457744o3967j49925j48145j17122k39619k63859j68954K8482j44j61497
$$ 5457744 5393777 5243852 5095707 4978585 4738966 4475107 4306153 4334635 4334491 4172994
17130D172994q6151N31O9000j11107r9540q4375m3958J2569K7483j7183M952q3679
$$ 4172994 4086843 4087374 4156374 4045267 3945727 3861352 3817394 3829963 3857446 3840263 3845215 3761536
17118C761536N2604j9586j95493j96111q0632l9598q168J5608J4338l45m7216
$$ 3761536 3814140 3794554 3599061 3402950 3322318 3282720 3274552 3290160 3304498 3304153 3256937
17107C256937J09398o8545m7287L676P6439M0497o8155q7073L0179R030J28504
$$ 3256937 3366335 3297790 3250503 3254179 3330618 3371115 3302960 3215887 3246066 3255096 3383600
17096C383600K94288L55624K39895N4184K20263L77558M39987M68185O79424O88853
$$ 3383600 3677888 4033512 4273407 4327591 4547854 4925412 5365399 5833584 6513008 7201861
17086G201861O61770P91696R23189J198822J668652K052050K544153L341976M085994
$$ 7201861 7863631 8655327 9578516 10777338 12445990 14498040 17042193 20384169 24470163
17077B4470163N034227O071792O706994O784290O152678M620690K664872P85530
$$ 24470163 29504390 35576182 42283176 49067466 55220144 59840834 62505706 63291236
17069F3291236k06081l17415k17277l14286q99583j955403k889852k836892j808690
$$ 63291236 63085155 62767740 62550463 62236177 61336594 59381191 56491339 53654447 51845757
17060E1845757j79204J523239K141103J779598R39354n51844j380703j598854
$$ 51845757 51666553 53189792 55330895 57110493 58049847 57498003 56117300 54518446
17052E4518446j500229j619611k190853l470542m860958n401484n085132m552123
$$ 54518446 53018217 51398606 49207753 45737211 40876253 35474769 30389637 25837514
17044B5837514l482224k347310j514817r72789o22096l82653k10425q8317J85630
$$ 25837514 22355290 20007980 18493163 17520374 16898278 16515625 16305200 16216883 16402513
17035A6402513L58931N51879Q80040J117628J456807J949883K577455L306282
$$ 16402513 16761444 17313323 18193363 19310991 20767798 22717681 25295136 28601418
17027B8601418M210233M993697N579669N440094M406065K643168M41519j757164
$$ 28601418 32811651 37805348 43385017 48825111 53231176 55874344 56315863 54558699
17019E4558699k639538k023320o29059J123796K854984L547369L418154K399489
$$ 54558699 51919161 49895841 49266782 50390578 53245562 56792931 60211085 62610574
17011F2610574O55979j288069k965213m092563m463904l762409k585692j077581
$$ 62610574 63266553 61978484 59013271 54920708 50456804 46694395 44108703 43031122
17003D3031122K88310J036877P51279l23799j999143l886884n121559n291485
$$ 43031122 43319432 44356309 45107588 44783789 42784646 38897762 33776203 28484718
16995B8484718m702008l741041k710522j855476j339285r54653p05914n23140
$$ 28484718 23782710 20041669 17331147 15475671 14136386 13181733 12475819 11952679
16987A1952679m35268m80060m95444n82270o79433n13985l76781l93440l80005
$$ 11952679 11517411 11037351 10541907 9959637 9280204 8766219 8389438 7995998 7615993
16978G615993m14987l20987j50928k73523m25134m09463k38388j56590l25861
$$ 7615993 7201006 6880019 6729091 6455568 6030434 5620971 5382583 5225993 4900132
16969D900132l90581k69845j39479j64181j76333j53409j64747j37484k94699
$$ 4900132 4509551 4239706 4100227 3936046 3759713 3606304 3441557 3304073 3009374
16960C009374j98287j43672j17448j00471j33889o4438j17539p0930J5118J8k0251
$$ 3009374 2811087 2667415 2549967 2449496 2315607 2251169 2133630 2062700 2077818 2077836 2057585
16949B057585j08724o0396p1219j05793K2714l8066n8592n2617q6256o3972l8552
$$ 2057585 1948861 1888465 1817246 1711453 1734167 1696101 1637509 1584892 1498636 1434664 1396112
16938A396112j9353j51143q4744p9449j36102K3537J78230p1776j17224q9508
$$ 1396112 1376759 1225616 1140872 1061423 925321 948858 1127088 1055312 938088 848580
16928H48580o4345L1034P9068N5228J8369k4314n7381k6664P4763J10020o0497
$$ 848580 784235 815269 894337 949565 967934 943620 886239 859575 934338 1044358 983861
16917I83861N2162o4260j22580q6937M1133Q1170M1762o3454J4403L7488p121
$$ 983861 1036023 971763 849183 762246 803379 884549 926311 862857 877260 914748 907627
16906I07627K5468m8856o1916p1079K3144m2690m6953j01363p2266Q696l527J52801
$$ 907627 933095 884239 822323 751244 774388 731698 684745 583382 511116 519812 516285 669086
16894F69086J1472p6263o5940J63n165M5415J15546J735k11910k41238O0834J26709
$$ 669086 680558 604295 538355 538518 533353 578768 694314 696049 484139 242901 303735 430444
16882D30444m9624L728Q80K4362j7884l4075O7741O0745j44825j90729K4894Q3242
$$ 430444 380820 384548 385428 409790 391906 357831 425572 486317 341492 150763 175657 258899
16870B58899p8428q5478L4283m4309O9405N2154Q9676K8610Q1797l8876p7068
$$ 258899 180471 94993 129276 84967 154372 206526 296202 324812 406609 367733 290665
16859B90665j54160M540j0930m6850j12234J07604Q6409P4871O8627o6511j6562
$$ 290665 136505 141045 130115 83265 -28969 78635 165044 239915 308542 242031 225469
16848B25469r0264J21465J17666L8605p7904l1698k8217n8320J4365P8143l1469
$$ 225469 135205 256670 374336 412941 335037 303339 275122 216802 231167 309310 277841
16837B77841j00389k01116j06352J7636Q7556J69173L5088N445k6473J06186M3728
$$ 277841 177452 -23664 -130016 -112380 -24824 144349 179437 184882 158409 264595 308323
16826C08323n7315Q6623M1663m7931m5655l0983o7924J6818l7578k9754L1328
$$ 308323 251008 337631 379294 331363 285708 254725 186801 203619 166041 136287 167615
16815A67615l7341j41613M275L4660J78515L6367j47606l1137O5726K3706J8525
$$ 167615 130274 -11339 -7064 27596 206111 242478 94872 63735 129461 153167 171692
16804A71692k0224p9044r184m7842K0327Q4633P157J14411k4794k48961n9278
$$ 171692 151468 72424 63240 15398 35725 120358 127515 241926 217132 -31829 -91107
16793i1107J39865K6761k1042j09720r7790K2195J305P2339j3123M1674o971j01509
$$ -91107 48758 75519 54477 -55243 -153033 -130838 -129533 -57194 -70317 -28643 -35614 -137123
16781a37123n3867l9500J63254J27162L7762l5517k0664L5901J00701n1464l5300
$$ -137123 -190990 -230490 -67236 59926 97688 62171 41507 77408 178109 126645 91345
16770I1345K1857m587j36090K3143O0751p5808j20022M1179P4544R2595Q2567
$$ 91345 113202 108615 -27475 -4332 56419 -19389 -139411 -98232 -23688 68907 151474
16759A51474J8498n7760j3963L8352P3652P7999o1453J7938J38342j4863m0757
$$ 151474 169972 112212 98249 136601 210253 288252 226799 244737 383079 368216 327459
16748C27459q2462J08181Q1500q038J49534l1438j54426m2084L7762P3274N1060
$$ 327459 244997 353178 434678 426640 576174 544736 390310 348226 385988 459262 510322
16737E10322k4573n2144m0674K9676R5952j599J57490J86649N7886r4416j12378
$$ 510322 485749 433605 392931 422607 518559 516960 674450 861099 918985 824569 712191
16726G12191j16068o2540Q5486P510J027L4506l0866J6134J06647J7459k8405
$$ 712191 596123 533583 619069 626579 627606 662112 631246 647380 754027 771486 743081
16715G43081j23483p0342J0791M7375Q778P3905o3391L7314p4687K2329L9837
$$ 743081 619598 549256 560047 607422 616200 690105 626714 664028 589341 611670 651507
16704F51507J11281Q2158p1303l5162r095j5283J5200o5721n0342j14364k1866
$$ 651507 762788 844946 773643 738481 729386 714103 729303 663582 613240 498876 477010
16693D77010O6369l0906L9525O9936j0093n3091o2937n1046j4789m6808l5638
$$ 477010 543379 512473 551998 621934 611841 558750 495813 444767 429978 383170 347532
16682C47532o7686p0078J4659k0337j20780l7937j01242L6239K5336L9259P4062
$$ 347532 279846 209768 224427 204090 83310 45373 -55869 -19630 5706 44965 119027
16671A19027p7553Q332l3905j44202m5045p1092J11847Q6749J10261J13922K9939
$$ 119027 41474 49806 15901 -128301 -173346 -244438 -132591 -45842 64419 178341 208280
16660B08280m8520p1127q2778m8094J56782L7934j06005j1358P6308l314L6341
$$ 208280 159760 88633 5855 -42239 114543 152477 46472 35114 111422 108108 144449
16649A44449n2065q7496N482J4086J4149J5600m7235j137K9404M3818O5436m3954
$$ 144449 92384 4888 10370 24456 38605 54205 6970 5833 35237 79055 144491 100537
16637A00537j17927n4811q8973K776q3646R5013j0123n9392R9465K5602L3401
$$ 100537 -17390 -72201 -161174 -158398 -242044 -147031 -157154 -216546 -117081 -91479 -58078
16626e8078K1873l9247J6329L8610J991M3766R3542n1467M3665K4633n5289q1629
$$ -58078 -36205 -75452 -59123 -20513 -18522 25244 118786 67319 110984 135617 80328 -1301
16614a301l209j2862J0225p9829j8419q126q8314J1400P5129K6879p673M0912
$$ -1301 -4510 -17372 -7147 -86976 -105395 -113521 -201835 -190435 -115306 -88427 -96100 -55188
16602e5188J2175J09400o1499k9935J1031J6560n5172j09797L9387R4330J12136
$$ -55188 -43013 66387 4888 -25047 -14016 2544 -52628 -162425 -123038 -28708 83428
16591H3428L0312k6414k4985N2264R479l6710k6458R1427k2766N237j2329k8506
$$ 83428 113740 87326 62341 114605 124084 87374 60916 152343 129577 134814 122485 93979
16579I3979k9267j18987M0992O2035O4337N9517K6488J02852q663q7145M588o1932
$$ 93979 64712 -54275 -13283 48752 113089 172606 199094 301946 293283 206138 210726 148794
16567A48794m906J30213P1629J0723o2282Q834q4935P750K4521j61747m2302R0373
$$ 148794 143888 274101 345730 356453 294171 303005 218070 225820 250341 88594 46292 136665
16555A36665l816q6107p7562K09671J44314k3759o9174n2177j92939k821M1418
$$ 136665 132849 46742 -30820 178851 323165 299406 230232 178055 -14884 -17705 23713
16544B3713K34613m0447j47266j7221p4479j0297o8019r847J07783Q3771J41906
$$ 23713 258326 217879 70613 53392 -21087 -31384 -99403 -109250 -1467 82304 224210
16533B24210K3652o9176l5323l4609K1443R2145j9920k18120K4869R0501k439
$$ 224210 247862 178686 143363 108754 130197 222342 202422 -15698 9171 99672 97233
16522I7233k5079m3791R6735M20n630O935Q8235j6038L6785R432J4182r2910q1995
$$ 97233 72154 28363 125098 125518 119888 126823 215058 199020 235805 245237 259419 166509 84514
16509H4514k0507O6525J03896k6780k6432K2551j4543K1779K7026N398j67631
$$ 84514 64007 130532 234428 207648 181216 203767 189224 211003 238029 243427 75796
16498G5796j18132J73308J21935M7658K3269n7347p7154p7459p0010pR2575j0914
$$ 75796 -42336 130972 252907 300565 323834 266487 189333 111874 41864 41857 134432 123518
16486A23518l4430m9349k3449M1042m3667j5009N5273N7817p5132o4341K1193
$$ 123518 89088 39739 16290 57332 13665 -1344 53929 111746 36614 -27727 -6534
16475f534M6829q9177o4005J21602R308m5546k9976j1817Q5160M3338j2209r0306
$$ -6534 40295 -48882 -112887 8715 18023 -27523 -57499 -69316 15844 59182 46973 -43333
16463d3333r7741r030J49968K1570n1313p0223J0355N1554Q6551J1110M1905M6199
$$ -43333 -141074 -150104 -136 21434 -29879 -100102 -89747 -38193 48358 59468 101373 147572
16451A47572q9422j35180n1444P3386l2074j15374K0094J09639K5009j7748j5260
$$ 147572 58150 -77030 -128474 -55088 -87162 -202536 -182442 -72803 -47794 -65542 -80802
16440h0802m4952k3121l9582Q3883J37652O880j62820k8886N4986N2897M3222
$$ -80802 -125754 -148875 -188457 -104574 33078 39958 -122862 -151748 -96762 -43865 -643
16429f43k8335j3389K30K0757J0126J08061R1236Q2996o6582j22302p3490n8506
$$ -643 -28978 -42367 -42137 -21380 -11254 96807 188043 271039 204457 82155 8665 -49841
16417d9841Q9268J8176m1410L5866j590m1392N2729j2028m9264j05785k5813q5712
$$ -49841 39427 57603 16193 52059 50469 9077 61806 49778 514 -105271 -131084 -216796
16405b16796l8671J8942J32954M8907J7433N3247m9865j3615K1151k1496R2009
$$ -216796 -255467 -236525 -103571 -54664 -37231 16016 -33849 -47464 -26313 -47809 44200
16394D4200O9241N5875k0424m9886J111j2364j09425j02321j1601M6168L7037
$$ 44200 113441 169316 148892 99006 100117 87753 -21672 -123993 -135594 -89426 -52389
16383e2389N9730r3907n1225p392j6808r5821J7975L5371P8893J26496O327N33
$$ -52389 7341 -86566 -137791 -145183 -161991 -257812 -239837 -204466 -125573 923 7250 7783
16371G783P5796j4496k9691q1667n4012K3268l6443O8305J04173N8224r7643P3283
$$ 7783 83579 69083 39392 -42275 -96287 -73019 -109462 -41157 63016 121240 23597 96880
16359I6880O1209q6877j62751k9754k4955J8265J77641R2546o6632n7127j16806
$$ 96880 158089 71212 -91539 -121293 -146248 -127983 49658 142204 75572 18445 -98361
16348i8361K0151k597M675l7497j1279p2989N245m171l5456J10329N4814n0427
$$ -98361 -78210 -80807 -76132 -113629 -124908 -197897 -192652 -196823 -232279 -121950 -67136 -117563
16336a17563J9718L1598J5172o7342o8595O7851j3562l9578J1551Q1100J4234
$$ -117563 -97845 -66247 -51075 -118417 -187012 -119161 -132723 -172301 -160750 -79650 -65416
16325f5416R3130L1850p3738j20075J7366o923J02518M7193J1996n5980j4974
$$ -65416 27714 59564 -14174 -134249 -116883 -123806 -21288 25905 37901 -18079 -33053
16314c3053o3448P2951j1543l636J344N4390R0565M728r1576K5149N6407q6482
$$ -33053 -96501 -23550 -35093 -38729 -37385 17005 107570 112298 20722 45871 102278 15796
16302A5796P2154K0988o5321j9005K4526n3468q3346J90511j3414q0626l2540
$$ 15796 87950 108938 43617 24612 49138 -4330 -87676 102835 89421 8795 -23745
16291b3745n6305Q097q7239j7499M552N3361M9619m691J55821k3374j3729o1626
$$ -23745 -80050 -71953 -159192 -176691 -172139 -118778 -69159 -73850 81971 58597 44868 -16758
16279a6758n4782J20496r796n9849O0578J15057r1309k57308k942j5100q2038
$$ -16758 -71540 48956 39160 -20689 39889 154946 63637 -193671 -196613 -211713 -293751
16268b93751K0985O9093J6063q2569p4716M1828J91818k7392J03058R7155j33392
$$ -293751 -272766 -203673 -187610 -270179 -344895 -303067 -111249 -138641 -35583 61572 -71820
16257g1820k5264P7520K9828j8507n51j15784j18384O2446P1854J413N573J36206
$$ -71820 -97084 -19564 10264 -8243 -8794 -124578 -242962 -180516 -108662 -107249 -101676 34530
16245C4530P4072j2506m5403l4718N014n282n4997J9048p8864K3659l6152o9298
$$ 34530 108602 96096 50693 15975 20989 15707 -39290 -20242 -99106 -75447 -111599 -180897
16233a80897O6764j7034J6091P4386o2248k1789P4791q0132M8087P1468O1834
$$ -180897 -114133 -131167 -115076 -40690 -102938 -124727 -49936 -130068 -81981 -10513 51321
16222E1321m6526r7338r3027p2726P7142k8288j17518J7840L2355K2676N6645
$$ 51321 4795 -92543 -185570 -258296 -181154 -209442 -326960 -309120 -276765 -254089 -197444
16211a97444M1919k6642O645m2580R4633N9457R0360j33042m7660N7074K0992
$$ -197444 -155525 -182167 -175522 -218102 -123469 -64012 26348 -106694 -154354 -97280 -76288
16200g6288J3289L1017n2284n6678O9096J09303q673j7578j1802o0553k3514K785
$$ -76288 -62999 -31982 -84266 -140944 -71848 37455 28782 11204 -598 -61151 -84665 -81880
16188h1880o0287r7172n2903O638N5676j633J24479J14549J29547J8984q3069
$$ -81880 -142167 -239339 -292242 -285604 -229928 -231561 -107082 7467 137014 155998 72929
16177G2929j01215m0706J10021n1951J8823N5015j58617k00253m3504j2982l0344
$$ 72929 -28286 -68992 41029 -10922 7901 62916 -95701 -295954 -339458 -352440 -382784
16166c82784K7819L694N0850J37858J00301O9772o9510P289n9187m919O0799P8281
$$ -382784 -354965 -351271 -300421 -162563 -62262 7510 -62000 -54711 -113898 -118817 -58018 20263
16154B0263n5858K0774q512l9367k996Q3131M4054o1994l1935J0446l9872j56045
$$ 20263 -35595 -14821 -23333 -62700 -65696 17435 61489 -505 -32440 -21994 -61866 -217911
16142b17911M0898R7848L8737n1109K8493M4473m2002J5007j8723J8843m4408
$$ -217911 -177013 -79165 -40428 -91537 -63044 -18571 -60573 -45566 -64289 -45446 -89854
16131h9854p0925L0770L0924J2603L6920j5515p134L5647p9076p5326M975P3480
$$ -89854 -160779 -130009 -99085 -86482 -49562 -65077 -72211 -36564 -115640 -190966 -185991 -112511
16119a12511j7215m2737K8217J4588J0955O7955P8662J1094l5249K1415j05672
$$ -112511 -129726 -172463 -144246 -129658 -118703 -50748 27914 39008 3759 25174 -80498
16108h0498k9623L9346j02544j349J2705N9445Q9715K9353r0094K4470J01655
$$ -80498 -110121 -70775 -173319 -174668 -161963 -102518 -12803 16550 -73544 -49074 52581
16097E2581q5437m5137L9282L4833M1146m1953j11402p291j10969o9820J1375
$$ 52581 -32856 -77993 -38711 -3878 37268 -4685 -116087 -123378 -234347 -304167 -292792
16086b92792N1070O5905j2199J43882R006J8655J06602j20512j33745N20J14520
$$ -292792 -241722 -175817 -188016 -44134 -35128 -16473 90129 -30383 -164128 -163608 -49088
16075d9088O1384K7641j20817j4162O7206J9856p074j69305j8731N802l3828Q4785
$$ -49088 12296 39937 -80880 -95042 -27836 -7980 -15054 -184359 -203090 -197288 -231116 -146331
16063a46331N0103M5854N3380K3767L7580j5398p7051n3881M5248j5692n7147
$$ -146331 -96228 -50374 3006 26773 64353 48955 -28096 -81977 -36729 -52421 -109568
16052a09568L2749O6332Q245o0912J6353O1667K3923q6442q8166m2229Q5978R8160
$$ -109568 -76819 -10487 -2242 -63154 -46801 14866 38789 -47653 -135819 -178048 -92070 6090
16040F090K904N4606m1844L8109l2389N4974j05457m7399R9490M4o1889j34284
$$ 6090 8994 63600 21756 59865 27476 82450 -23007 -70406 29084 29128 -32761 -167045
16028a67045Q843K0803J13215j34801k8955N2569k5017m0687J39905J49390n0902
$$ -167045 -158202 -137399 -24184 -158985 -187940 -135371 -160388 -201075 -61170 88220 37318
16017C7318j13624L4839p6299k16100Q555L0581Q8549p822n2484J46231M9110
$$ 37318 -76306 -41467 -117766 -333866 -325311 -294730 -206181 -214003 -266487 -120256 -71146
16006g1146j26722l7124P1602J07367J613j3664j1498M8957o7019r2189Q0608
$$ -71146 -197868 -234992 -163390 -56023 -54410 -68074 -79572 -30615 -97634 -189823 -109215
15995a09215M4166J41379M0505k6441l8297q6992p3700P4649J18753J0650N1838
$$ -109215 -65049 76330 116835 90394 52097 -34895 -108595 -33946 84807 95457 147295
15984A47295n6638j85996q7510M2930p582P0015j2554m8375J44418Q1461p6211
$$ 147295 90657 -95339 -182849 -139919 -147501 -77486 -90040 -138415 6003 87464 11253
15973A1253n2954J37867O3140p5326k24596j36481J29206N2994p574j31594k0546
$$ 11253 -41701 96166 159306 83980 -140616 -277097 -147891 -94897 -102471 -234065 -254611
15962b54611J62432Q9389r4627j06619j8393l7089O6536P1746M7920J6039l060
$$ -254611 -92179 -2790 -97417 -204036 -222429 -259518 -192982 -121236 -73316 -57277 -60337
15951f0337k6725N8853l2493M284J8114J2089n1565l9779k5105K2825K798Q3163
$$ -60337 -87062 -28209 -60702 -56418 -38304 -26215 -77780 -117559 -142664 -119839 -117041 -33878
15939c3878o7451q5967o7513L9280M2210L0375j4581Q2739Q9324l6375Q7488m8036
$$ -33878 -101329 -187296 -254809 -215529 -173319 -142944 -157525 -74786 14538 -21837 65651 17615
15927A7615j16998o2284L6693Q546m3523R6577K3845k7748m2265L1487l6011J8609
$$ 17615 -99383 -161667 -124974 -116428 -159951 -63374 -39529 -67277 -109542 -78055 -114066 -95457
15915i5457K7629r2094m1166Q8183N2219J662q4453j20838j0207J16111L1788
$$ -95457 -67828 -159922 -201088 -112905 -60686 -59024 -143477 -264315 -274522 -158411 -126623
15904a26623p2721q8154J15437Q8688N679m1419K004k3885j56350N2070R0463
$$ -126623 -199344 -287498 -172061 -83373 -77694 -119113 -117109 -140994 -297344 -245274 -154811
15893a54811J1932j6102O2595J25389Q1863p1363j45025j01057O4750m1089p9527
$$ -154811 -142879 -158981 -96386 29003 110866 39503 -105522 -206579 -141829 -182918 -262445
15882b62445L9396J04067J81702K5793l0642J1310r5404k5695N0963N6069N0618
$$ -262445 -223049 -118982 62720 88513 57871 69181 -26223 -51918 -955 55114 105732
15871A05732P750m4780j2785j39539o889j9669k4278n3115N0876J81211n8561
$$ 105732 113482 68702 55917 -83622 -90511 -110180 -134458 -187573 -136697 44514 -14047
15860a4047m6871J2888l452j00298M8326K243m7228L8334r7137q0167N2891O7715
$$ -14047 -60918 -48030 -51482 -151780 -103454 -101211 -148439 -110105 -207242 -287409 -234518 -166803
15848a66803N0462M6997q9900j27854r3054j5822P1400K497J53969K8230r6310
$$ -166803 -116341 -69344 -159244 -287098 -380152 -395974 -324574 -322077 -168108 -139878 -236188
15837b36188l7369Q546O5232J30664p1730m5990J1940k417M9926J11242J1356
$$ -236188 -273557 -265011 -199779 -69115 -140845 -186835 -174895 -177312 -127386 -16144 -4788
15826d788k4109p416n5842l0904J23205Q9613l1045J1830m2720p4867k5268n9190
$$ -4788 -28897 -36313 -92155 -123059 146 89759 58714 70544 27824 -47043 -72311 -131501
15814a31501k3049n2722O6827J37528m6930j24251k6622j4588J47679N5127n095
$$ -131501 -154550 -207272 -140445 -2917 -49847 -174098 -200720 -215308 -67629 -12502 -17597
15803a7597J0818M7019m5046K7361R6564p0487j56667j6073j01066m606J01457
$$ -17597 -6779 40240 -4806 22555 119119 48632 -108035 -124108 -225174 -229780 -128323
15792a28323L2816l3933r3614L7054N1527n0400P7093L1145r4397j41405n4156
$$ -128323 -95507 -129440 -223054 -186000 -134473 -184873 -107780 -76635 -171032 -312437 -366593
15781c66593k5122N8523L8327K7921M6810J43525j2518p90O092n2594j9179J1535
$$ -366593 -391715 -333192 -294865 -266944 -220134 -76609 -89127 -89917 -83825 -136419 -155598 -144063
15769a44063P1755o3186Q7445k6112J3110P5122J4561K7536Q5505p8224m5189
$$ -144063 -72308 -135494 -48049 -74161 -61051 14071 28632 56168 141673 63449 18260
15758A8260q1285J31695n2402r6442j2212N3339N0497j3330l0354j01893K0016
$$ 18260 -63025 68670 16268 -80174 -92386 -39047 11450 -1880 -32234 -134127 -114111
15747a14111O7618K769j03820n9005M9506n1117R8828p5375r723M5015R6511L8343
$$ -114111 -46493 -43724 -147544 -206549 -157043 -208160 -109332 -184707 -194430 -149415 -52904 -14561
15735a4561k8927n8622J8168J14848P8926q9794P533M4556k6374o6890j46480
$$ -14561 -43488 -102110 -83942 30906 109832 20038 27571 72127 45753 -21137 -167617
15724a67617p1667Q9176P1799j1578O4660M9432n6516L8396L499J5290m8573m469
$$ -167617 -239284 -150108 -78309 -89887 -25227 24205 -32311 6085 9584 24874 -23699 -28168
15712b8168l7665N663n8197L5898l7722J04398L4405j59755L108Q3014m7634j03894
$$ -28168 -65833 -60170 -118367 -82469 -120191 -15793 18612 -141143 -138035 -55021 -102655 -206549
15700b06549m9684J33824K3052k8982r100J53871O178N0489j5684J7543n6814
$$ -206549 -256233 -122409 -99357 -128339 -137439 16432 22610 73099 57415 74958 18144
15689A8144N1423J59541M359m1722o8298p5020l3325N9679n6870j00083K6354
$$ 18144 69567 229108 233467 191745 123447 48427 15102 74781 17911 -82172 -55818
15678e5818p1235m71n1377M8457P7778M0666M3891Q8327j870j96185j88318J249
$$ -55818 -127053 -127524 -178901 -130444 -52666 -12000 31891 120218 118348 -77837 -266155 -264906
15666b64906J17645L3947n844L5168j03148O3620Q0106n6378o8852M9842J26349
$$ -264906 -147261 -113314 -119158 -83990 -187138 -123518 -43412 -99790 -168642 -118800 7549
15655G549J5708K2397k8785q0872n9386q5470m3254J2460L5122K0644L1338L2488
$$ 7549 23257 45654 16869 -64003 -123389 -208859 -252113 -239653 -204531 -183887 -152549 -120061
15643a20061O3870R6432J9805j4455j64744j10359J11977J10193o3354J1250J1312
$$ -120061 -56191 40241 60046 45591 -119153 -229512 -117535 -7342 -70696 -59446 -48134
15632d8134R9185o294j7359q377k8598k1433l7313l6520J1945J05467P4389Q235
$$ -48134 51051 44757 27398 19021 -9577 -31010 -68323 -104843 -92898 12569 86958 95193
15620I5193o8964n5040N154m5390n5724j6937N8352o4032M7936J25977N38n7955
$$ 95193 26229 -28811 -23657 -69047 -124771 -141708 -83356 -147388 -99452 26525 27063 -30892
15608c0892j0353j11797k5506O9793J08525q698R4705o1312p3638R5633J06162
$$ -30892 -41245 -153042 -178548 -108755 -230 -8928 85777 24465 -49173 46460 152622
15597A52622j9146j93097j1271l2804j0411o8383k2343p9922K7971J28186J62653
$$ 152622 133476 -59621 -70892 -103696 -114107 -182490 -204833 -284755 -256784 -128598 34055
15586C4055k2891l809j8166j9005Q8437J01796o7496r6284j00374p0317N842J04783
$$ 34055 11164 7355 -10811 -29816 58621 160417 92921 -3363 -103737 -174054 -168212 -63429
15574f3429m2501j62432j4121M642K3644k6392Q9655J88221M3717J3292J71633
$$ -63429 -105930 -268362 -282483 -277841 -254197 -280589 -190934 -2713 41004 54296 225929
15563B25929M2107j56303r4857n9836m9448P9238P2543j04789o3196j6541l1787
$$ 225929 268036 111733 16876 -42960 -92408 -13170 59373 -45416 -108612 -125153 -156940
15552a56940L331L5520P4959Q1499J03468p0548o8629m6430l4138M7734N3188
$$ -156940 -153609 -118089 -43130 38369 141837 71289 2660 -43770 -77908 -30174 23014
15541B3014j11500o1173r143q823k9318P440m7602O8794l6633J1479P6550M1633
$$ 23014 -88486 -149659 -158802 -167625 -196943 -189503 -237105 -168311 -204944 -193465 -116915 -75282
15529g5282k4481J38494J1839l2778L1218l2031j00520p8545j3761J17348M9463
$$ -75282 -99763 38731 50570 17792 49010 16979 -83541 -162086 -175847 -58499 -9036
15518i036j9296k1948L5857j1039k6988R0790J4535n4676k2391o1369J3594j37264
$$ -9036 -28332 -50280 -14423 -25462 -52450 38340 52875 -1801 -24192 -85561 -71967 -209231
15506b09231l3797N4309k4277N0329L8444N2927j17514m9840j29345j8981J9482
$$ -209231 -243028 -188719 -212996 -162667 -124223 -71296 -188810 -238650 -367995 -386976 -367494
15495c67494K1923R5608M7652N4201J00520l6682n8138N25J06586J4207k865o267
$$ -367494 -345571 -249963 -202311 -148110 -47590 -84272 -142410 -141885 -35299 -21092 -23957 -30224
15483c0224r539j34290J06172Q6780j5709o3221l7959m1874J24960p3806j2280
$$ -30224 -39763 -174053 -67881 18899 3190 -60031 -97990 -139864 -14904 -88710 -100990
15472a00990l2343O949K5858r4080O544N0052P6497O38p0555n9903r0687J5781
$$ -100990 -133333 -126384 -100526 -194606 -188062 -138010 -61513 -60875 -131430 -191333 -282020 -266239
15460b66239Q6092j02330q9796J59163Q7380L0774L6958L9089l3576j9424O1869
$$ -266239 -180147 -282477 -372273 -213110 -125730 -94956 -57998 -18909 -52485 -71909 -10040
15449a0040p8909o7837J6518K7280N7997m47j163j14946j0622j7377K1581m2309
$$ -10040 -88949 -156786 -140268 -112988 -54991 -55438 -56601 -171547 -182169 -199546 -177965 -220274
15437b20274K2786P2030J727L0825L324J9756p5372p6297j9913M7050K1155M6167
$$ -220274 -197488 -125458 -123731 -92906 -89582 -69826 -145198 -221495 -241408 -194358 -173203 -127036
15425a27036Q2740q20r2184j6428J1401M9105P1084j66713L8088L5671o7458M4895
$$ -127036 -44296 -45116 -137300 -153728 -142327 -93222 -22138 -188851 -150763 -115092 -182550 -137655
15413a37655J2883p7057j5495r1376O6742R9949N6918n2454m2707j0276j0484
$$ -137655 -124772 -201829 -217324 -308700 -241958 -142009 -85091 -137545 -180252 -190528 -201012
15402b01012J1434q0441Q2015J42517L768o2810P1424J64577K8417j92215j64265
$$ -201012 -189578 -270019 -188004 -45487 -41719 -104529 -33105 131472 159889 -32326 -196591
15391a96591N9965J41589J03799O4904n2653k07877o9278m7137j672J02207M4840
$$ -196591 -136626 4963 108762 173666 121013 -86864 -156142 -203279 -204951 -102744 -57904
15380e7904o3022l4121l3591q918J11238R1851l1592n128l2266q9171p8910L2705
$$ -57904 -120926 -155047 -188638 -197556 -86318 5533 -26059 -31187 -63453 -152624 -231534 -198829
15368a98829N8271J04949L9318K1045r9153L5980L4684N6773l5325L0211p9366
$$ -198829 -140558 -35609 3709 24754 -74399 -38419 -3735 53038 17713 47924 -31442
15357c1442j36367O421K6970p6071M3170J84056p0983p2895N7642l2297J191j6212
$$ -31442 -167809 -161388 -134418 -210489 -167319 16737 -54246 -127141 -69499 -101796 -100605 -116817
15345a16817M7521k252q0968r3559J39522L8452j00396m3570P4458M2587k5243
$$ -116817 -69296 -71548 -152516 -246075 -106553 -68101 -168497 -212067 -137609 -95022 -120265
15334a20265J41775l467l0755m9587n8861o0013M065j8846n6473m4924N9451L3852
$$ -120265 21510 18043 -12712 -62299 -121160 -181173 -177108 -195954 -252427 -297351 -237900 -204048
15322b04048M3383J19603O6070j02815o8994q0081j8261N1600j9184K8641l9023
$$ -204048 -160665 -41062 25008 -77807 -146801 -226882 -245143 -193543 -212727 -184086 -223109
15311b23109k1444m1991Q2683J78635J18056o5458j06983K3577J2812j17904l9716
$$ -223109 -244553 -286544 -203861 -25226 92830 27372 -79611 -56034 -43222 -161126 -200842
15300b00842J28809K0630p2761O5430n0518l2780o5298M4998J14152K4104O7072
$$ -200842 -72033 -51403 -124164 -58734 -109252 -142032 -207330 -162332 -48180 -24076 42996
15289D2996k1790j12203l5635O5096k6646J074M5620O6861R368n1391r5554O1793
$$ 42996 21206 -90997 -126632 -61536 -88182 -87108 -41488 25373 34741 -16650 -112204 -50411
15277e0411l8777K4028q17q0785j2583J38576N8411p6649j3564L522N4542K9232
$$ -50411 -89188 -65160 -65977 -146762 -159345 -20769 37642 -39007 -52571 -49049 5493 34725
15265C4725j65248q6347j2280L0759R2576J04512m626L5434P0859q7920j18084
$$ 34725 -130523 -216870 -229150 -198391 -105815 -1303 -5929 29505 100364 12444 -105640
15254a05640L2816J41609L7246Q677r5839r1068Q9003K6788k607P326q120q2854
$$ -105640 -72824 68785 106031 114708 18869 -72199 16804 43592 40985 48311 40191 -42663
15242d2663q6919k5272L8088J18143O7139l7662r0701j1154k7725Q4004L9868
$$ -42663 -129582 -154854 -116766 1377 68516 30854 -59847 -71001 -98726 -14722 25146
15231B5146j32618j4511M258J21311R6343j8095j30648m0162J19696K4253k8934
$$ 25146 -107472 -121983 -117725 3586 99929 81834 -48814 -88976 30720 54973 26039
15220B6039n4032J0582O9645Q5130j24492O5458l1925n5820j88171M1054P2371
$$ 26039 -27993 -17411 52234 137364 12872 78330 46405 -9415 -197586 -156532 -84161
15209h4161J170k3003P913J1937j041L7837Q76l2400J41053N9392j19656M085
$$ -84161 -82991 -105994 -98081 -86144 -87185 -49348 -48472 -80872 60181 119573 -83 4002
15197D002Q3401j8533k5663j28917j9835Q9921k0060J4157o7579P4556K1676j2134
$$ 4002 87403 68870 43207 -85710 -105545 -15624 -35684 -21527 -89106 -14550 7126 -5008
15185e008j06051p1700J5825M4555o6625M623J43792n599J17116J05968r6158
$$ -5008 -111059 -182759 -166934 -122379 -189004 -184381 -40589 -46188 70928 176896 80738
15174H0738j98234R451k7418P8473O5682J20755K6885p1477l8281K1507r5080
$$ 80738 -117496 -108045 -135463 -56990 8692 129447 156332 84855 46574 68081 -26999
15163b6999O7468J25695M7829o1839n9862j68224J3477K0529n8657r4418P1966
$$ -26999 40469 166164 213993 152154 92292 -75932 -62455 -41926 -100583 -195001 -123035
15152a23035J31393j333r6325n4431J01669l9453N6764k6983L2105P7269j90328
$$ -123035 8358 7025 -89300 -143731 -42062 -81515 -24751 -51734 -19629 57640 -132688
15141a32688j92563O208J69383J70871O1673j3987p9249p7139m1381O2019N6912
$$ -132688 -325251 -319043 -149660 21211 82884 68897 -10352 -87491 -128872 -66853 -9941
15130i941J30169j8078j24869N2760M9732j32135j06057O8242L2182O1192p7102
$$ -9941 120228 102150 -22719 30041 79773 -52362 -158419 -90177 -57995 3197 -73905
15119g3905k0605j1902J20726N5658j51710P164K03746O2571m4585p7171j63007
$$ -73905 -94510 -106412 14314 69972 -81738 -74574 129172 191743 147158 69987 -93020
15108i3020J5740m2685J1456j1405J2482N4861L5344r9108n1765J12132J15271
$$ -93020 -77280 -119965 -108509 -119914 -107432 -52571 -17227 -116335 -168100 -55968 59303
15097E9303N5805j323m3814m2880k30923q9750J98801M2320Q8051P0467K7183
$$ 59303 115108 113785 69971 27091 -203832 -293582 -94781 -52461 35590 106057 133240
15086A33240K5565j13374k55737n9411J40439R9834N5131j03872o4919M1988k5700
$$ 133240 158805 45431 -210306 -269717 -129278 -29444 25687 -78185 -143104 -101116 -126816
15075a26816j9466Q6769J36876K0575n8005L9918p8998j20551Q5833o874l2733
$$ -126816 -146282 -59513 77363 97938 39933 79851 853 -119698 -33865 -40739 -73472
15064g3472N6882j9427o2593O2306n4943k6564k4626o0643l2408o6939Q7793R4401
$$ -73472 -16590 -36017 -98610 -36304 -91247 -117811 -142437 -203080 -235488 -302427 -214634 -120233
15052a20233o5026n231J33951J53520L0417J3491j11115q8880Q4553o6907m6307
$$ -120233 -185259 -190490 -56539 96981 127398 140889 29774 -59106 25447 -41460 -87767
15041h7767P0580Q0716q2883j54759P5060J45441J18523o874k6294l7197j52107
$$ -87767 -17187 63529 -19354 -174113 -99053 46388 164911 158037 131743 94546 -57561
15030e7561o2437J03912P4360J62509m829j59122q445J36679p1274o9012j41951
$$ -57561 -119998 -16086 58274 220783 215954 56832 48387 185066 113792 44780 -97171
15019i7171j16195O1557J77027M4809O3931K7127J15604J64441J80247J19834
$$ -97171 -213366 -151809 25218 70027 133958 161085 276689 441130 621377 741211
15009G41211j053J72870L34395L15985L98237N98074P44218P30843Q36782O01481
$$ 741211 740158 913028 1247423 1563408 1961645 2559719 3303937 4034780 4871562 5473043
14999E473043J72714p66054j474973j268291p67306l81950j29612j04196k44124
$$ 5473043 5645757 4879703 3404730 2136439 1369133 987183 857571 753375 509251
14990E09251k17796m8204k9777O4667M6436L1573L1499o9439j4061m3215J23094
$$ 509251 291455 243251 213474 278141 324577 356150 387649 318210 304149 260934 384028
14979C84028J0872l1906m7556p0199J8472j1357J01597N9663n2576n5761K078
$$ 384028 394900 362994 315438 245239 263711 252354 353951 413614 361038 305277 307355
14968C07355J34256P0427L4151j09057j46437j44213r5963j7622o257R5145L184
$$ 307355 441611 512038 546189 437132 290695 146482 50519 32897 26640 121785 124969
14957A24969j17384J00565K3639m0038O597l4628p7827q6983K0175J5251J0982
$$ 124969 7585 108150 131789 91751 98348 63720 -14107 -101090 -80915 -65664 -54682
14946e4682N1039M6441M027O0261K9545p9396o5258j0670J7821n793j29358J5410
$$ -54682 -3643 42798 46825 107086 136631 57235 -8023 -18693 -872 -6665 -136023 -120613
14934a20613R3124J31393k5031k00391m9490J70415m0726j55866l482O1231J48985
$$ -120613 -27489 103904 78873 -121518 -171008 -593 -41319 -197185 -200667 -139436 9549
14923I549k3507o9430m3816P1688j742j5931J54634R1188r0065r5513k8433P697
$$ 9549 -13958 -83388 -127204 -55516 -57258 -73189 81445 172633 82568 -12945 -41378 -33681
14911c3681j17167j1789k7900l5960Q6454j2153O3820Q3666n6038M8243l720n1672
$$ -33681 -150848 -162637 -190537 -226497 -140043 -152196 -88376 -4710 -60748 -12505 -16225 -67897
14899f7897K6967l5519J0101K157m294K8642n5101j4800R8568J2760j23215j05933
$$ -67897 -40930 -76449 -66348 -64191 -68485 -39843 -94944 -109744 -11176 1584 -121631 -227564
14887b27564J6264P1124L4680N2581K4330M2332n1657p8954k5454K3569N2946
$$ -227564 -211300 -140176 -105496 -52915 -28585 13747 -37910 -116864 -142318 -118749 -65803
14876f5803L7013O6222K7670L043L3585p9513j19149K5772L469M0106q879O8013
$$ -65803 -28790 37432 65102 68145 101730 22217 -96932 -71160 -67691 -27585 -36464 31549
14864C1549j07040O4826Q1020o3713j0992M0570o0321L3961O3591K1365K7255
$$ 31549 -75491 -10665 70355 6642 -4350 36220 -24101 9860 73451 94816 122071
14853A22071m1894j57071m459Q8624M1405L748Q0859n756k08181j38143j2924
$$ 122071 80177 -76894 -81353 7271 48676 52424 133283 127527 -80654 -218797 -231721
14842b31721L3231n6146p2265m6167J6468J16507L6263O1824M0903j1412J4383
$$ -231721 -198490 -254636 -326901 -373068 -356600 -240093 -203830 -142006 -101103 -112515 -98132
14831i8132J80436M435o6684m2147j20359n8687l6590p4065K8255J38043P3395
$$ -98132 82304 86739 20055 -22092 -142451 -201138 -237728 -311793 -283538 -145495 -72100
14820g2100M2089J5133J5647p1391R0010j11492j33163J00229P418o013l7626
$$ -72100 -30011 -14878 769 -70622 19388 -92104 -225267 -125038 -117620 -123633 -161259
14809a61259K2512J34594J6228O812P2721N4537J5352p0647M4211K5497n4724
$$ -161259 -138747 -4153 12075 18887 91608 146145 161497 90850 135061 160558 105834
14798A05834n2661q5577q0942K9403l5952r832N3941j5970O3676l0831l7520k6209
$$ 105834 53173 -32404 -113346 -83943 -119895 -129727 -75786 -91756 -28080 -58911 -96431 -122640
14786a22640l9733J33117J36541L1731r0413p9805J44523N00j68074O0668J35732
$$ -122640 -162373 -29256 107285 139016 48603 -31202 113321 113821 -54253 6415 142147
14775A42147m7775l6607j2228j10247r0341M6188J6985O1981j8282M1394r1389
$$ 142147 94372 57765 45537 -64710 -155051 -108863 -91878 -29897 -48179 -6785 -98174
14764i8174j63138j3794M426J67255J53375J20478L1163j2590K8737l1629p564
$$ -98174 -261312 -275106 -270680 -103425 49950 170428 201591 189001 217738 186109 178545
14753A78545J2144J343p2695P348j04791j57667j23837n0778p632P3800J75343
$$ 178545 190689 192032 119337 126685 21894 -135773 -259610 -310388 -318020 -244220 -68877
14742f8877R000l1889J04760J19040P7859r8650k8000j126L3460j11773l6984
$$ -68877 -59877 -91766 12994 132034 209893 111243 83243 82117 115577 3804 -33180
14731c3180L64L6598M4239o5576j60277k0335q556M7264Q6941k3712j12891J45111
$$ -33180 -32816 3782 48021 -17555 -177832 -198167 -206723 -159459 -72518 -96230 -209121 -64010
14719f4010J03261K3733n0577r99N4528l2912l9634q537j47038m4916J42806K9828
$$ -64010 39251 62984 12407 11408 65936 33024 -6610 -15147 -162185 -207101 -64295 -34467
14707c4467J715Q1894J9448J7233J0852j32258L3925N5319J7020n247o339N1382
$$ -34467 -32752 49142 68590 85823 96675 -35583 -1658 53661 70681 65434 59095 110477
14695A10477l7728J17498M3913p3355r5531R057q666p2916O2448k0074p7367m2450
$$ 110477 72749 190247 234160 160805 65274 74331 65665 -7251 55197 35123 -42244 -84694
14683h4694N3275O1107j3196p619n8862j90305l4903N1900R9017J77569O9559
$$ -84694 -31419 29688 16492 8873 -49989 -240294 -275197 -223297 -124280 53289 122848
14672A22848m9898j61403q262O7012J10666k8403p2495p6983K6204N4961J13761
$$ 122848 72950 -88453 -96715 -29703 80963 52560 -19935 -96918 -70714 -15753 98008
14661I8008m4330j01805j9520M6588j34311l9407M0606J18491J09231n4424J5847
$$ 98008 53678 -48127 -67647 -21059 -155370 -194777 -154171 -35680 73551 19127 34974
14650C4974o2158K317N9055P1174P5691m7106o4383o9494m9890n0522L6302K7979
$$ 34974 -27184 -24867 34188 105362 181053 133947 69564 70 -49820 -100342 -64040 -36061
14638c6061M2300N6078j26016r5229L0518P0794L0301j9813L0659O3784p1585
$$ -36061 6239 62317 -63699 -158928 -128410 -57616 -27315 -47128 -16469 47315 -24270
14627b4270o3453J10895M9793K3351K2250o3116n3381m1125j2645O1595R864r9485
$$ -24270 -87723 23172 72965 96316 118566 55450 2069 -39056 -51701 9894 19758 -79727
14615g9727k9338L7576J38744P3185j6817j44166p8548O328M8496O0355Q115N2762
$$ -79727 -109065 -71489 67255 140440 123623 -20543 -99091 -92763 -44267 16088 24203 76965
14603G6965R8299p5823p9120j7636m1134l9172k1806j377Q8271P216k2611L1787
$$ 76965 175264 99441 20321 2685 -38449 -77621 -99427 -100804 -12533 -5317 -27928 3859
14591C859o9944n7951K6106N6047N5880R0214q969j10373n1896j39978R4771Q4133
$$ 3859 -66085 -124036 -97930 -41883 13997 104211 95242 -15131 -67027 -207005 -112234 -28101
14579b8101M5756O4514R2429Q6070r612o00r0687j75243j10266o7426L0662M0888
$$ -28101 17655 82169 174598 260668 251056 250456 159769 -15474 -125740 -193166 -162504 -121616
14567a21616k4885p7043Q8413J18308o1199r9143l9154j14125J36169J09388n9154
$$ -121616 -146501 -223544 -135131 -16823 -78022 -177165 -216319 -330444 -194275 -84887 -144041
14556a44041k8785K56J6701j4103j9875k3672j4648r4379K6071J49233J2558O9603
$$ -144041 -172826 -172570 -155869 -169972 -189847 -213519 -228167 -322546 -296475 -147242 -134684 -65081
14544f5081P4666m3278n6973n5540J5472K6674j18p4160o7114M2932K8683M9808
$$ -65081 9585 -33693 -90666 -146206 -130734 -104060 -104178 -178338 -245452 -202520 -173837 -124029
14532a24029J07193k0033L435j05104n0703M4634n4512j1029k2089j2438J64730
$$ -124029 -16836 -36869 -33434 -138538 -189241 -144607 -199119 -210148 -232237 -244675 -79945
14521g9945J17575M5461k5414j32457o818M3090N5292k2087n704K6579k3921J5192
$$ -79945 37630 83091 57677 -74780 -81598 -38508 16784 -5303 -11007 15572 -8349 6843
14509F843K765L6370O8362k5829N1231O079o8600l8629L8227J40886L1602j5810
$$ 6843 9608 45978 114340 88511 139742 145821 77221 38592 76819 217705 249307 233497
14497B33497j07064j75210q6111M3283k9647l1315N2507r1578p0324M6721J25319
$$ 233497 126433 -48777 -134888 -91605 -121252 -152567 -100060 -191638 -261962 -215241 -89922
14486h9922J59050k0798p2131m7842Q872n8361j2454n1333P1465m5840k2267M5723
$$ -89922 69128 48330 -23801 -71643 -62771 -121132 -133586 -184919 -113454 -159294 -181561 -135838
14474a35838J07618m2796j00960J32197J65035j7790j88131p6854P3021J02431
$$ -135838 -28220 -71016 -171976 -39779 125256 107466 -80665 -157519 -84498 17933
14464A7933o4234n4460o0736L7224L280r3171p4650N9465O4612k3694j08271j10770
$$ 17933 -46301 -100761 -161497 -124273 -120993 -214164 -288814 -229349 -164737 -188431 -296702 -407472
14452d07472o061R9052J31058M7744O1243J30674J6615p5111l695m363j14060
$$ -407472 -413533 -314481 -183423 -135679 -74436 56238 72853 -2258 -5953 -10316 -124376
14441a24376j00507n1159J1051L2982P9300m8518J72699R9275l4332N1464q4596
$$ -124376 -224883 -276042 -264991 -232009 -152709 -201227 -28528 70747 36415 87879 3283
14430C283n5963L7928N0138P2671Q9086p7496q0664N8030j64558j32994M7355
$$ 3283 -52680 -14752 35386 108057 197143 119647 38983 97013 -67545 -200539 -153184
14419a53184J57157J07991l9454Q518j17985m1928m6098k9857L6587p702k5544
$$ -153184 3973 111964 72510 81028 -36957 -78885 -124983 -154840 -118253 -125955 -151499
14408a51499J38416J34484k2175l8761k6050o8472p7841J895N081J21073J0250
$$ -151499 -13083 121401 99226 60465 34415 -34057 -111898 -110003 -104922 16151 26401
14397B6401n2504k05938O1080P8197n0670p3379k5169J47639j1055l7688O5043
$$ 26401 -26103 -232041 -170961 -92764 -143434 -216813 -241982 -94343 -105398 -143086 -78043
14386g8043J35478R9688o8915J5252n5680J4949k2106l0626M8784P1067n9561
$$ -78043 57435 157123 88208 103460 47780 62729 40623 9997 58781 129848 70287
14375G0287p1419m9861J38211m9024Q0150k9194P1767M7576n5532p7942p0230
$$ 70287 -1132 -50993 87218 38194 118344 89150 160917 208493 152961 75019 4789
14364D789o1483P2333j90811m2341O9408J21494N7290M844j5580K793l5940K6174
$$ 4789 -56694 15639 -175172 -217513 -148105 -26611 30679 35523 19943 22736 -13204 12970
14352A2970L5088Q2306O4425m4806n2485p8403Q2365N317p0206j0372n8433j8812
$$ 12970 48058 130364 194789 149983 97498 19095 101460 106777 36571 26199 -32234 -51046
14340e1046Q4647j4313j18435J8879L8850k6167m4060O0914O6471R4854L3450
$$ -51046 33601 19288 -99147 -80268 -41418 -67585 -111645 -50731 15740 110594 144044
14329A44044L3526n3910q2430j8493l4956J0697K8200L5918l5659l8650j89621
$$ 144044 177570 123660 41230 22737 -12219 -1522 26678 62596 26937 -11713 -201334
14318b01334J5444J96091L3162j66172j8983l2473P2002L1318J8040N9512k4112
$$ -201334 -185890 10201 43363 -122809 -141792 -174265 -102263 -70945 -52905 6607 -17505
14307a7505R8363O9759p9635r8041j5365k1743J2585R2513q2188n2515Q5409P6533
$$ -17505 80858 150617 70982 -27059 -42424 -64167 -51582 40931 -41257 -93772 -8363 68170
14295F8170j12316j9153J7103J07695j5116K7216P8868m2602j8990M2718j6990
$$ 68170 -44146 -63299 -46196 61499 46383 73599 152467 109865 90875 133593 116603
14284A16603o4978K4592L8369o7859j03449J1286J40514L7662p6665l8565J1100
$$ 116603 51625 76217 114586 46727 -56722 -45436 95078 132740 56075 17510 28610
14273B8610P4506M1195q7328k5413P3825N0734K7964n000q437L9562j45521m3263
$$ 28610 103116 144311 56983 31570 105395 156129 184093 179093 170656 210218 64697 21434
14261B1434L4779K7764N445M9966J02592N6742m1357O365n199l5577o5189j58505
$$ 21434 56213 83977 89422 139388 241980 298722 257365 263730 258531 222954 157765 -740
14249g40j07653O1053l6122n5097J61746J36212N2761q896J3744l5700k106j31600
$$ -740 -108393 -47340 -83462 -138559 23187 159399 212160 203264 217008 181308 179202 47602
14237D7602N7859O9978j33392p0442p6822j085P9406N4109j0438M6623J04413
$$ 47602 105461 175439 42047 -28395 -105217 -106302 -26896 27213 16775 63398 167811
14226A67811R0015O0690j04477J3758J07432m3386r5436n2477j89255j58389l4747
$$ 167811 257826 318516 214039 227797 335229 291843 196407 143930 -45325 -203714 -238461
14215b38461K8087j26728L1239J91331J84057J14769R239K1918k9668p0202K9719
$$ -238461 -210374 -337102 -305863 -114532 69525 184294 193533 215451 185783 115581 145300
14204A45300k8593j9689j9760l5026j5974J19651M5580j15755n0410N8777J39136
$$ 145300 116707 97018 77258 42232 26258 145909 191489 75734 25324 84101 223237
14193B23237k9002q7796m4592q0195o2243k2181J84945P7895l2270L4229K2532
$$ 223237 194235 106439 61847 -18348 -80591 -102772 82173 160068 127798 162027 184559
14182A84559M6969l6653j8750J19071j28125j23725k9015M0051o731L7964O1420
$$ 184559 231528 194875 176125 295196 167071 43346 14331 54382 47651 85615 147035
14171A47035p0028r6114J10885P5454K1763Q4254K5541k5258m9997q9138j522
$$ 147035 77007 -19107 91778 167232 188995 273249 298790 273532 223535 134397 132875
14160A32875O0599j4245q967r3440k1038K0695L1013p2468j71363j888M5942R1863
$$ 132875 193474 179229 170262 76822 55784 76479 107492 35024 -136339 -138227 -92285 -422
14148d22M1293j6947O0029j2999q5430j34019Q1071K0448k6184M1824M4267M1940
$$ -422 40871 23924 83953 70954 -14476 -148495 -67424 -46976 -73160 -31336 12931 54871
14136E4871J1636L692j0679l2850o0085Q9803R1227J7850r6582P3474R1846j10990
$$ 54871 66507 70199 59520 26670 -33415 56388 147615 165465 68883 142357 234203 123213
14124A23213q6532q372N9636o3126j4488N6286J04872M3878J1742l7968o6553
$$ 123213 36681 28309 87945 24819 10331 66617 171489 215367 227109 189141 122588
14113A22588j29667p6694O2689Q5285n1645l0409J1505K6332M5619O1956K7922
$$ 122588 -7079 -83773 -21084 64201 12556 -17853 -6348 19984 65603 127559 155481
14102A55481O1785N1520J5518j00379P081o1218l8314l9652O7651k3663k0541
$$ 155481 217266 268786 284304 183925 191006 129788 91474 51822 119473 95810 75269
14091G5269q1390j18848J34127L1226M8133j13189o9808O711R732M5401o517K8869
$$ 75269 -6121 -124969 9158 40384 88517 -24672 -94480 -87769 -78037 -32636 -39153 -10284
14079a0284Q2387L5729l3429l6525j9376P3981J06322J26037j10471j00175N1807
$$ -10284 72103 107832 74403 37878 18502 92483 198805 324842 214371 114196 166003
14068A66003M6462j059j21119L6591O105j7785Q471j4829q166L2802j983J50978
$$ 166003 212465 211406 90287 126878 132983 115198 123669 108840 100674 133476 131493 282471
14056B82471j031j21689q414o3783J4748R3047L4981o8819m7778n9438n78j0002
$$ 282471 281440 159751 151337 87554 102302 195349 230330 161511 113733 54295 53717 43715
14044D3715O8911Q8150J11434J07012n8213j47162j27178l5174M2738j2542j0196
$$ 43715 112626 200776 312210 419222 361009 213847 86669 51495 94233 81691 71495
14033G1495N2258l0235M249K6349j1016J247P0107j005o0035m8367N4199O4014
$$ 71495 123753 93518 97767 124116 113100 114347 184454 183449 123414 75047 129246 193260
14021A93260L2653l8334j28l3040Q19R3165J07042p0108j80495k44669J5339q1823
$$ 193260 225913 187579 187451 154411 155230 248395 355437 285329 104834 -139835 -124496 -206319
14009b06319P3041J39361K6269J8389n1967Q2924r6464J21277J7377j07925q2123
$$ -206319 -133278 6083 32352 50741 -1226 81698 -14766 106511 123888 15963 -66160
13998f6160J877K4375k006j4162J8484N5085M0260O2319p4595k67J17411J2699
$$ -66160 -64283 -39908 -41914 -56076 -37592 17493 57753 120072 45477 45210 162621 175320
13986A75320j16223n2708j1167J48661J65898n6542q2556J8669j08847n276M4506
$$ 175320 59097 6389 -4778 143883 309781 253239 170683 189352 80505 75229 119735
13975A19735J0859o2141l9669J1253n9866k7168r1934p4823O0350n9676Q4213
$$ 119735 130594 68453 28784 40037 -19829 -46997 -138931 -213754 -153404 -213080 -128867
13964a28867Q0501j2050n4723j3874k9541o5876L2216J61345M7296k9968j20629
$$ -128867 -48366 -60416 -115139 -129013 -158554 -224430 -192214 -30869 16427 -13541 -134170
13953a34170l355N7866M6818J2747M1958J7476k4291k35898k7683J76641J40886
$$ -134170 -137525 -79659 -32841 -20094 21864 39340 15049 -220849 -248532 -71891 68995
13942F8995N611L8059Q845n7777M3813L4778o1011p8810P6111Q5656p8120p3223
$$ 68995 74606 112665 121510 63733 107546 142324 81313 2503 78614 164270 86150 12927
13930A2927j24368p4146O6944R3122L6816L0980O7815l8163k5859M503l950J4986
$$ 12927 -111441 -185587 -118643 -25521 11295 42275 110090 71927 46068 50571 46621 61607
13918F1607N3836k4992K0912M8709r1136n2594O1737P7084j2045m8398j02114
$$ 61607 115443 90451 111363 160072 68936 16342 78079 155163 143118 94720 -7394
13907g394N827R1287N1593l0527p1151J0988l8704l7006k5652J47632K194R316
$$ -7394 -1567 89720 141313 110786 39635 50623 11919 -25087 -50739 96893 99087 108403
13895A08403j475N6625j07866j16464l6361o2441n4339K8756J12566J00842j21596
$$ 108403 106928 163553 55687 -60777 -97138 -159579 -213918 -185162 -72596 28246 -93350
13884i3350J3144j5420J18352P2399k5204Q0293Q4850q360m4002p1499j6872O4169
$$ -93350 -80206 -95626 22726 95125 69921 150214 235064 226704 182702 111203 94331 158500
13872A58500l9687j35723J0538M4913J3474j4612j13557l5558j5951L3881K2865
$$ 158500 118813 -16910 -6372 38541 52015 37403 -76154 -111712 -127663 -93782 -70917
13861g0917Q88N2959O8481L9663O9264j29874M859n3897n8872l975n5809N4525
$$ -70917 -70029 -17070 51411 91074 160338 30464 35323 -18574 -77446 -81421 -137230 -82705
13849h2705J53234R4179P9101M5374j0300j9011j04820j19102o4984n3457M1729
$$ -82705 70529 164708 243809 289183 278883 259872 155052 35950 -29034 -82491 -40762
13838d0762K1978O7923j6145j4897L2686R9111J41830J00546j45007k57881n7717
$$ -40762 -18784 49139 32994 18097 50783 149894 291724 392270 247263 -10618 -68335
13827f8335O1856M7084m48P6450O9229N3414m7234j770O4224K2431L3988n1934
$$ -68335 -6479 40605 40157 116607 185836 239250 192016 190246 254470 276901 310889 258955
13815B58955J36353q2009p4119K761p0325J25729J13026j05039J5079r0013M8892
$$ 258955 395308 313299 239180 241941 171616 297345 410371 305332 320411 230398 279290
13804B79290L8282N0698j400P9860J08898m3827j49787j14195p9767R1622O0504
$$ 279290 317572 368270 366870 446730 555628 511801 362014 247819 168052 259674 320178
13793C20178J0563k4584J8829K2857O6396K3735q584Q5113j00476k00782J8053
$$ 320178 330741 306157 324986 347843 414239 437974 429390 514503 414027 213245 231298
13782B31298J21147J01519m0037J1213l4643N4547m2654J6725P711k5478l2701
$$ 231298 352445 453964 413927 425140 390497 445044 402390 419115 426826 401348 368647
13771C68647j50127k667L3671J6504L1300Q6086J14320L1075l32p2487j22388
$$ 368647 218520 215853 249524 266028 297328 383414 497734 528809 528477 455990 333602
13760C33602j03160M1679J26998k7366k5574j02375n9734L0456O0893j3813r5823
$$ 333602 230442 272121 399119 371753 346179 243804 184070 214526 275419 261606 165783
13749A65783j9972P9031J8463j01834j06975p1143j4381m0522N0100K2707K7748
$$ 165783 145811 224842 243305 141471 34496 -36647 -51028 -91550 -41450 -18743 9005
13738I005q2853K8532o5111n5547O0424J50545J02211o7319p857O1769j29514
$$ 9005 -73848 -45316 -110427 -165974 -105550 44995 147206 79887 72030 133799 4285
13727D285j01192O9827L8821J91288j6364n4676r564j5963N9067P6711p1162o2058
$$ 4285 -96907 -27080 11741 203029 186665 131989 122425 106462 165529 242240 171078 109020
13715A09020M0552o5259j37483j2679K04814O5678j3976k8028k6477J6956N5821
$$ 109020 149572 84313 -53170 -65849 138965 204643 190667 162639 136162 153118 208939
13704B08939m9316k9393L9300J08363J1205j15434n3592j6961P3928j3515q5784
$$ 208939 159623 130230 169530 277893 289098 173664 120072 103111 177039 163524 77740
13693G7740N2103J26564J45555k5120q2893M3864M1392q7990k6934k4927N7910
$$ 77740 129843 256407 401962 376842 293949 337813 379205 291215 264281 239354 297264
13682B97264l9178J9155J17q0947m5898l1334j7646p1827m179J06426o3338N1098
$$ 297264 258086 277241 277358 196411 150513 119179 101533 29706 25527 131953 68615 119713
13670A19713r205K8906j9379r8595j08698L9620m4972J33338K8067o2839K6770
$$ 119713 110508 139414 120035 21440 -87258 -47638 -92610 40728 68795 5956 32726
13659C2726K3927n6882K089J08299j1393j68846n6466J86201J6848r7622m3123
$$ 32726 56653 -229 1860 110159 98766 -70080 -126546 59655 76503 -21119 -64242
13648f4242J4821o3964N6837P8378M65P1577J29341p5792r2351J3344J36135o6
$$ -64242 -49421 -113385 -56548 21830 22295 93872 223213 147421 55070 68414 204549 204483
13636B04483r8367l614J3408J40453M0076j08147j00971r158O2541J2718Q5998
$$ 204483 106116 102502 115910 256363 296439 188292 87321 78163 140704 153422 239420
13625B39420L1531j11380L2814M293k2883r080n2366N8338j6615j01177j9206
$$ 239420 270951 159571 192385 196678 173795 164715 112349 170687 154072 52895 33689
13614C3689M797M7919Q5114q3481j89181L2406K9922O0600k6797j16411k1801
$$ 33689 38486 86405 171519 88038 -101143 -68737 -38815 21785 -5012 -121423 -143224
13603a43224P7356J29734P2809P294j8512J8820P8540l8013n9474n0958l0674
$$ -143224 -65868 63866 136675 143969 125457 144277 222817 184804 125330 74372 43698
13592D3698O3976k1716m5932J24676K8349n421j68642j01451M694j4753M9991
$$ 43698 107674 85958 40026 164702 193051 187630 18988 -82463 -77769 -92522 -42531
13581d2531k7030K6219J01975Q3325l5650r549O6406J9932q3763l3037j1719k7153
$$ -42531 -69561 -43342 58633 141958 106308 96759 163165 183097 99334 66297 54578 27425
13569B7425Q3383j1566o8000L7466J29110P1374l2867L6947m9493j45353j2558
$$ 27425 110808 99242 31242 68708 197818 269192 236325 273272 223779 78426 65868
13558F5868q0894M4403O0433M8563k9787k1482N3124J83276n59k19689j19338
$$ 65868 -15026 29377 89810 138373 108586 87104 140228 323504 322945 103256 -16082
13547a6082p894Q5170M0940j1921O4234N2214N4534j0257J5562o7459R178q164
$$ -16082 -23976 61194 102134 90213 154447 206661 261195 250938 266500 199041 208219 200055
13535B00055l9352M5851P6490O024j55470k11636O2290O1726P1685l7112P829
$$ 200055 160703 206554 283044 289068 133598 -78038 -15748 45978 117663 80551 88380
13524H8380k0419J17473N3505K3127n2312j4988l9165m1149O0445K3553n405J07904
$$ 88380 67961 185434 238939 262066 209754 194766 155601 114452 174897 198450 193045 300949
13512C00949O5114o8947k9564o8494K2365m844l0567p0152j6247j02969m0537
$$ 300949 366063 297116 267552 199058 221423 216579 186012 115860 99613 -3356 -43893
13501d3893L9971N1043m5461o5466J1670N4959o3460M926P679K4321K9053N9917
$$ -43893 -3922 47121 1660 -63806 -52136 2823 -60637 -55711 -48032 -23711 5342 65259
13489F5259Q3840j7672n4360J07163Q0993N2379n1782j12536k7253n8424L400
$$ 65259 149099 131427 77067 184230 265223 317602 265820 153284 126031 67607 71007
13478G1007Q1283k3197m1925j44091P6964K03971M5376j46257j41013N1285q2435
$$ 71007 152290 129093 87168 -56923 20041 224012 269388 123131 -17882 33403 -49032
13467d9032q4983J35955n4072l6837J03202Q5776K14673L4097q2263k7699n089
$$ -49032 -134015 1940 -52132 -88969 14233 100009 314682 348779 266516 238817 233728
13456B33728k0163n5573N511N1202J3888k4091o654Q9106N2383q105j17728J7398
$$ 233728 213565 157992 163503 214705 228593 204502 197848 286954 339337 331232 213504 230902
13444B30902n4878j24847N626L4732O6376j8699Q6228L9851j03714L0859R380
$$ 230902 176024 51177 56803 91535 157911 139212 225440 265291 161577 192436 201816
13433B01816O7121J5487n1537p5498o9937r270N9699N5578L2674q0693K9879J30594
$$ 201816 268937 284424 232887 157389 87452 78182 137881 193459 226133 145440 175319 305913
13421C05913l0821j84089q4367O3608J6785J2133M6390M1738Q5564k7247o9604
$$ 305913 275092 91003 6636 70244 87029 99162 145552 187290 272854 245607 176003
13410A76003q9722O238J66608J1426j17181m0706J1578J795Q6526L2945J8887
$$ 176003 86281 92519 259127 270553 153372 112666 124244 126039 212565 245510 264397
13399B64397J07894n8079j24258K0834l1600r4343K1767N7247L7137p871K8574
$$ 264397 372291 314212 189954 210788 179188 84845 106612 163859 200996 193125 221699
13388B21699K9736n1636k0297M1801k4402j14243J5833L3961J8323P8948l5157
$$ 221699 251435 199799 179502 221303 196901 82658 98491 132452 150775 229723 194566
13377A94566k9910J9778J481m2081J008J09754N1834q4251o234j48197j19051
$$ 194566 164656 184434 185915 143834 144842 254596 306430 222179 215945 67748 -51303
13366e1303K8449L5160K8100R9184J47545l9299p0555r7271J3178R9189p941j06051
$$ -51303 -22854 12306 40406 139590 287135 247836 177281 80010 93188 192377 184436 78385
13354G8385K4235o7402j5877R6132J67816M6613j26872k1922L6462L3607r5942
$$ 78385 102620 35218 19341 115473 283289 329902 203030 181108 217570 251177 155235
13343A55235J06121K6679P047m0883R5567q1632p9153J40253R8050M2710j19786
$$ 155235 261356 288035 295082 254199 349766 268134 188981 329234 427284 469994 350208
13332C50208j15306j2894J2770R377M4509J1544L1233J22218J5322q5047n7946
$$ 350208 234902 222008 234778 244155 288664 300208 331441 453659 468981 383934 325988
13321C25988q520J626j5228q4967r1820m0188l3027j2574R9665J06357m6952P7130
$$ 325988 317468 319094 303866 218899 127079 86891 53864 41290 140955 247312 200360 277490
13309B77490L1428r726p9943J7961N2679l0364O9597m6561j19808l7097m6618
$$ 277490 308918 299192 219249 237210 289889 259525 329122 282561 162753 125656 79038
13298G9038O1987O4609N9851r0624o7536L2877J5274m1924k2365Q9923o4k0120
$$ 79038 141025 205634 265485 174861 107325 140202 155476 113552 91187 181110 181046 160926
13286A60926q9618j15797L3296Q6842J21296J11235o2769O116N6555M9434M122
$$ 160926 71308 -44489 -11193 75649 196945 308180 245411 251527 308082 357516 361638
13275C61638O3729p3464j72537j14930q5857O6810J4462M1346M4683P2105K5913
$$ 361638 425367 351903 179366 64436 -21421 45389 59851 101197 145880 217985 243898
13264B43898j07499M4027O5570j68304O1322J44437L980L2331J37451j08667m3213
$$ 243898 136399 180426 245996 77692 139014 283451 287431 319762 457213 348546 305333
13253C05333o795N0353o7672q7339j070n0729n0027M5448N9472K9344o557J5321
$$ 305333 298538 348891 281219 193880 192810 142081 92054 137502 196974 226318 219761 235082
13241B35082n0556o8643J10500q5003N817K5317O3673M571j8612n5465K0599M6536
$$ 235082 184526 115883 226383 141380 147197 172514 236187 240758 222146 166681 187280 233816
13229B33816j11322p3671K0511J4006J38735J89515P2934p1094p1566L0224p100
$$ 233816 122494 48823 69334 83340 222075 411590 484524 413430 341864 372088 364988
13218C64988k3036j23842o2561j2292n7526j6598M5379R735N6439M6477O4949
$$ 364988 341952 218110 155549 143257 85731 69133 114512 124247 180686 227163 292112
13207B92112K1628N1147o1574o07k2186J3736q854n7495P1182P3138k8189m7244
$$ 292112 313740 364887 303313 302706 280520 294256 285402 227907 299089 372227 344038 296794
13195B96794J0904k9124L9816m2034r3167j78606m1545M8039Q711Q7533Q3676
$$ 296794 307698 278574 318390 276356 183189 4583 -36962 11077 19788 107321 190997
13184A90997o2444o7324n115k6658O0971O362j3428O5920L3229o0657L8616J43354
$$ 190997 128553 61229 56114 29456 90427 96789 83361 149281 182510 121853 160469 303823
13172C03823K9712j14618L7601J756l2466j31413N6887J86297J46405p7387j41350
$$ 303823 333535 218917 256518 258274 225808 94395 151282 337579 483984 406597 265247
13161B65247L3610J04244m6518r9874j57565O8576Q206m2546Q181P6045P1321
$$ 265247 298857 403101 356583 256709 99144 167720 175926 133380 141561 217606 288927
13150B88927j8687m7110L8405r3757J7582J4988M9830n3809l1788N9534K0868
$$ 288927 270240 223130 261535 167778 185360 200348 250178 196369 164581 224115 244983
13139B44983r2373r205L4833L4432L4825J0322o1770j15174L7251J75585J06340
$$ 244983 152610 143405 178238 212670 247495 257817 196047 80873 118124 293709 400049
13128D00049k5521j54983o2174M9700o0511N404R9488J02750p4097m2209M4683
$$ 400049 374528 219545 157371 207071 146560 151964 251452 354202 280105 237896 282579
13117B82579o6414o57L9487r605o6456M4662N6632m244q974l9742P034J21860
$$ 282579 216165 215508 254995 245390 178934 223596 280228 275984 267010 227268 234302 356162
13105C56162p3079K3405j8725j02258n1078r034M2814J29756O7398m1398j15800
$$ 356162 283083 306488 287763 185505 134427 125393 168207 297963 365361 323963 208163
13094B08163P899O2740J25829j553m8468J02462O4452m5810J9597K9403k3289
$$ 208163 216062 278802 404631 403078 354610 457072 521524 475714 495311 524714 501425
13083E01425r3919q7813L907j0221j30874M5800N2021k5887K7051L5328K8536
$$ 501425 407506 319693 323600 313379 182505 228305 280326 254439 281490 316818 345354
13072C45354J21080K3306j10135l0630N3627L3609p7590R3600N8078p1349q8823
$$ 345354 466434 489740 379605 348975 402602 436211 358621 452221 510299 438950 350127
13061C50127p071k4042j3617J3505L5146m4564j36986N3123Q0021M984K4818l5391
$$ 350127 343056 319014 305397 318902 354048 309484 172498 225621 305642 310626 335444 300053
13049C00053L4103P1749p0507N252J98085K5826q3629K1285j39848j43225J3001
$$ 300053 334156 405905 335398 340650 538735 564561 480932 502217 362369 219144 232145
13038B32145M3580k7713m1747q8226j24604m3437N8524J43496K9362O9493j0119
$$ 232145 275725 248012 206265 118039 -6565 -50002 8522 152018 181380 250873 240754
13027B40754k2437Q0982J07503N6009p1277p7728J4867k1903O467m2796K0689
$$ 240754 218317 299299 406802 462811 391534 313806 328673 306770 313237 270441 291130
13016B91130M5489O6770o7187M9299r4656p2970P0620J14590k5542q8076k6452
$$ 291130 336619 403389 336202 385501 290845 217875 288495 403085 377543 289467 263015
13005B63015J4420l616M3215J97501q9561m8228J18810l0595j06842O351J849
$$ 263015 277435 273819 317034 514535 424974 376746 495556 464961 358119 364470 366319
12994C66319m8983k3120Q7463J12314l2557j34285O2242Q8543j7118j2577l8116
$$ 366319 317336 294216 381679 493993 461436 327151 389393 477936 460818 448241 410125
12983D10125j3095K4828L049L0361k5338p5777O1009J44243P485o2352J20237
$$ 410125 397030 421858 424907 455268 429930 354153 415162 559405 566890 504538 624775
12972F24775O9481R2019J7713Q2456J04045L594K0306J81484J14741J46574K75241
$$ 624775 694256 786275 803988 886444 990489 994083 1014389 1195873 1310614 1457188 1732429
12961A732429K3892n2j00898j05999p3013p5314j29444j25134j81013o1441N6355
$$ 1732429 1756321 1756269 1655371 1549372 1476359 1401045 1271601 1146467 965454 904013 960368
12950I60368J3599K07841M8365n6699l0125K9476J80463L4616J513m64Q9934J47487
$$ 960368 973967 1181808 1230173 1173474 1143349 1172825 1353288 1387904 1389417 1388953 1478887 1626374
12938A626374R5513J8691P7639m7100k3114J76076J91050o151j40375p5402l4202
$$ 1626374 1721887 1740578 1818217 1771117 1748003 1924079 2115129 2108978 1968603 1893201 1858999
12927A858999L5107q9621q7480j80100j05432K7170j21888j20371M4747l0709
$$ 1858999 1894106 1804485 1717005 1536905 1431473 1458643 1336755 1216384 1261131 1230422
12917A230422m1781J42532J128q6405L0448P1922N9676o0191p3509P5878J38873
$$ 1230422 1188641 1331173 1332301 1245896 1276344 1348266 1407942 1347751 1274242 1350120 1488993
12906A488993J65688N1989R5092P0544P4540J22014K0729j31941k39801j26526
$$ 1488993 1654681 1706670 1801762 1872306 1946846 2068860 2089589 1957648 1717847 1591321
12896A591321o6521j63392j38594j40691k9946l1940k5126L6548l747n7222m8173
$$ 1591321 1524800 1361408 1222814 1082123 1052177 1020237 995111 1031659 1027912 970690 922517
12885I22517N5196P785k0838n9587r0278n3952l1081P5426l5214Q712l9166p9486
$$ 922517 977713 985498 964660 905073 814795 760843 729762 805188 769974 778686 739520 660034
12873F60034m6854R5447j6783n5434m7495J2723J5703R6296M1971J01760k5930
$$ 660034 613180 708627 691844 636410 588915 601638 617341 713637 755608 857368 831438
12862H31438p5959l1401O0n021j07644q087J36136N9927P2774N959J5129l5382
$$ 831438 755479 724078 724138 719117 611473 603386 739522 799449 872223 878182 893311 857929
12850H57929O9123q0696j06330p58N7529m5938j4552l5435l6027M3470J34525
$$ 857929 927052 846356 740026 739268 796797 750859 736307 700872 664845 708315 842840
12839H42840o2817r7456o2081N5922K11659k3057Q7239r1858n1849o5220J3216
$$ 842840 780023 682567 620486 676408 888067 865010 952249 860391 808542 743322 756538
12828G56538J10392P4268p130N4221l0895Q4000j33532l9037n8204P5239Q1149
$$ 756538 866930 941198 934068 988289 957394 1041394 907862 868825 810621 885860 967009
12817I67009K2161M8478L0902r6220r1813J05434R5991K5837J15351R467M8906
$$ 967009 989170 1037648 1068550 972330 880517 985951 1081942 1107779 1223130 1232597 1281503
12806A281503j39851j48939n1000J57429P7554R7556R6715O4708l1207Q0201M7574
$$ 1281503 1141652 992713 941713 1099142 1176696 1274252 1370967 1435675 1404468 1484669 1532243
12795A532243j0323l3848o4671q1197m3710M6575j3841j14923k9936M2677p0377
$$ 1532243 1521920 1488072 1423401 1342204 1298494 1345069 1331228 1216305 1186369 1229046 1158669
12784A158669J0138Q9604N1678L5046m5385m6273l4663P8799N2479j1553n3812
$$ 1158669 1168807 1258411 1310089 1345135 1299750 1253477 1218814 1297613 1350092 1338539 1284727
12773A284727L816R0425P0244K03756J71305L8434L9655j15707j44120L1793J02080
$$ 1284727 1288543 1378968 1449212 1652968 1824273 1862707 1902362 1786655 1642535 1674328 1776408
12762A776408R5906o0112P8501L6322m9917j7602K7334R4977M9852J14192J31809
$$ 1776408 1872314 1812202 1890703 1927025 1877108 1859506 1886840 1981817 2031669 2145861 2277670
12751B277670K4826r3908K1655m8022j0345m6488j1911k0995M6393l0301n2542
$$ 2277670 2302496 2208588 2230243 2182221 2171876 2125388 2113477 2092482 2138875 2108574 2056032
12740B056032O2145K5894o5348Q85p1909k3801J48237l6144r2948l9949r4641
$$ 2056032 2118177 2144071 2078723 2079608 2007699 1983898 2132135 2095991 2003043 1963094 1868453
12729A868453p1141m3952J9966R5232k9105L8145Q3723n3228n9410m9864N0332
$$ 1868453 1797312 1753360 1773326 1868558 1839453 1877598 1961321 1908093 1848683 1798819 1849151
12718A849151m8352j9915j03501o7677L9217m5479N4879Q5057J13912m5652j60654
$$ 1849151 1800799 1780884 1677383 1609706 1648923 1603444 1658323 1743380 1857292 1811640 1650986
12707A650986r0860N7467k6044j97392j02044k5345L6795K14499J13184n7296
$$ 1650986 1560126 1617593 1591549 1394157 1292113 1266768 1303563 1518062 1631246 1573950
12697A573950j5962Q7202n6216m6318Q4970N9558p730l8379p6968M5874r0506
$$ 1573950 1557988 1645190 1588974 1542656 1627626 1687184 1679454 1641075 1564107 1609981 1519475
12686A519475N667P2334n9885q8313p3734j8665J13164R5272k8221l8765l7659
$$ 1519475 1525142 1597476 1537591 1449278 1375544 1356879 1470043 1565315 1537094 1498329 1460670
12675A460670J3805J06476J2040k3219J18556J93826l3072j5370J6614J52263
$$ 1460670 1474475 1580951 1592991 1569772 1688328 1882154 1849082 1833712 1850326 2002589
12665B002589Q3559j28363P2933N5960o5936j18688N8516N182J2787Q017J40503
$$ 2002589 2086148 1957785 2030718 2086678 2020742 1902054 1960570 1965752 1978539 1986556 2127059
12654B127059J606P23K0738J61572R9790O304R6477m000L2281M8901Q0679R2406
$$ 2127059 2128665 2129388 2150126 2311698 2411488 2417792 2514269 2510269 2542550 2591451 2672130 2764536
12642B764536J9597n311N8969q650j5781l1372P7650k1672R5287O5585K8701O4285
$$ 2764536 2784133 2778822 2837791 2829141 2813360 2781988 2859638 2837966 2933253 2998838 3027539 3091824
12630C091824J57902N9272K3069J08932R31j09581P2695K12511J58172L2050m6605
$$ 3091824 3249726 3308998 3332067 3440999 3441930 3332349 3405044 3617555 3775727 3807777 3761172
12619C761172j75426J9050J3323j64384R584J206K494J40129L6441J6262J21202
$$ 3761172 3585746 3604796 3618119 3453735 3463319 3464525 3467019 3607148 3643589 3659851 3781053
12608C781053K08804M7085o522K9120L7923R8833n2537l1920P2299M1298m8768
$$ 3781053 3989857 4036942 4030420 4059540 4097463 4196296 4143759 4111839 4184138 4225436 4176668
12597D176668N0663O8876l3043k9356P5928N1729M294M6510Q1088J43145J29691
$$ 4176668 4227331 4296207 4263164 4233808 4309736 4361465 4365759 4412269 4493357 4636502 4766193
12586D766193P959M4033J87595Q5274L0514J5920Q6383J16003J23996R820n000
$$ 4766193 4774152 4818185 5005780 5091054 5121568 5137488 5223871 5339874 5463870 5473690 5468690
12575E468690P9587K7940j5143R1526J90271J49538J13221J51777Q5059N1764
$$ 5468690 5548277 5576217 5561074 5652600 5842871 5992409 6105630 6257407 6342466 6394230
12565F394230R6638R9793J03634K27607J00632J44051K83809J10977K23436K48874
$$ 6394230 6490868 6590661 6694295 6921902 7022534 7166585 7450394 7561371 7784807 8033681
12555H033681L34635K14158K08921J94347K46267K42346K85340K36487J51423
$$ 8033681 8368316 8582474 8791395 8985742 9232009 9474355 9759695 9996182 10147605
12546A0147605M71200N85799M63951L78474M86913M61986M02831O34992Q21610
$$ 10147605 10618805 11204604 11668555 12047029 12533942 12995928 13398759 14033751 14855361
12537A4855361Q94320J061916J175819J268660J514798J848211J879915K294853
$$ 14855361 15749681 16811597 17987416 19256076 20770874 22619085 24499000 26793853
12529B6793853K795943L063937L669785M406202N200020O181085P145594Q761108
$$ 26793853 29589796 32653733 36323518 40729720 45929740 52110825 59256419 68017527
12521F8017527J0660693J2948849J5765896J9062075K2386657K4960099K6090283
$$ 68017527 78678220 91627069 107392965 126455040 148841697 173801796 199892079
12514A99892079K4359020J8839801Q870419m686810j7574951k5324299k6364135
$$ 199892079 224251099 243090900 251961319 247274509 229699558 204375259 178011124
12507A78011124k2750316j7152765j1778908p116988l319699k61116K126112M096697
$$ 178011124 155260808 138108043 126329135 119212147 115892448 115631332 117757444 121854141
12499A21854141O087390P761356R197931J0561151J1697437J2515489J3173387
$$ 121854141 127941531 135702887 144900818 155461969 167159406 179674895 192848282
12492A92848282J3721164J3974041J4182679J3978186J3463010J2082765J0217339
$$ 192848282 206569446 220543487 234726166 248704352 262167362 274250127 284467466
12485B84467466P794266M770071J512198j848500m973441p749254r863042j1332924
$$ 284467466 292261732 297031803 298544001 296695501 291722060 283972806 274109764 262776840
12477B62776840j2336719j2773615j2609586j2243328j1551506j0793043r929703
$$ 262776840 250440121 237666506 225056920 212813592 201262086 190469043 180539340
12470A80539340q983410p805980o525120n165834l674497j824897K44448K261663
$$ 180539340 171555930 163749950 157224830 152058996 148384499 146559602 146804050 149065713
12462A49065713M698683P405687J0359349J3805258J6881576J9607308K1076821
$$ 149065713 153764396 161170083 171529432 185334690 202216266 221823574 242900395
12455B42900395K0271112J6065326P658645m320830j7454050k7738547l2109896
$$ 242900395 263171507 279236833 286895478 282574648 265120598 237382051 205272155
12448B05272155l0431230k5636651k0248271j5455265j1707129q982030p014725
$$ 205272155 174840925 149204274 128956003 113500738 101793609 92811579 85796854
12441H5796854n514521m445002l615839l063128k486997k127068j928031j527375
$$ 85796854 80282333 75837331 72221492 69158364 66671367 64544299 62616268 61088893
12433F1088893j245498r90576p63054m81064l13558k07118m06224m12782l90588
$$ 61088893 59843395 58852819 58089765 57608701 57295143 57088025 56681801 56269019 55878431
12424E5878431m72024l57218j49894j72515k39658j55040j03973m8574J22647
$$ 55878431 55406407 55049189 54899295 54726780 54487122 54332082 54228109 54179535 54302182
12415E4302182J56225L38048J40394K15793L53741O49780Q95496J048299J010383
$$ 54302182 54458407 54796455 54936849 55152642 55506383 56156163 57051659 58099958 59110341
12406E9110341J066758J279477J362662J527225J434049J320242J544204J671470
$$ 59110341 60177099 61456576 62819238 64346463 65780512 67100754 68644958 70316428
12398G0316428J713644J600088J717605J800303J725948J542708J610186J592582
$$ 70316428 72030072 73630160 75347765 77148068 78874016 80416724 82026910 83619492
12390H3619492J443471J287940J267993J157150J068126Q75461Q87111O04828
$$ 83619492 85062963 86350903 87618896 88776046 89844172 90719633 91606744 92211572
12382I2211572K61322J47436O0012j84324k52229o68194r03851r31646r57221
$$ 92211572 92472894 92620330 92680342 92496018 92243789 91575595 90671744 89740098 88782877
12373H8782877j212398j319855j378140j468264j584545j625225j815702j786672
$$ 88782877 87570479 86250624 84872484 83404220 81819675 80194450 78378748 76592076
12365G6592076j745770j721842j853199j867382j807664j861659j783446j559889
$$ 76592076 74846306 73124464 71271265 69403883 67596219 65734560 63951114 62391225
12357F2391225j571003j771567j700099j533383j591709j659347j509628j416600
$$ 62391225 60820222 59048655 57348556 55815173 54223464 52564117 51054489 49637889
12349D9637889j356256j317932j337565j157338j255263j188082j244488j280848
$$ 49637889 48281633 46963701 45626136 44468798 43213535 42025453 40780965 39500117
12341C9500117j032904r70630j001525r53793j071035j083594q84893j020510
$$ 39500117 38467213 37496583 36495058 35541265 34470230 33386636 32501743 31481233
12333C1481233q75664p41632o85685p16103p06962p10799p56831p91532o80170
$$ 31481233 30605569 29863937 29178252 28462149 27755187 27044388 26287557 25496025 24815855
12324B4815855o24266m73361n30835n98856o55725o55245o29027n84424n36999
$$ 24815855 24191589 23718228 23187393 22588537 21932812 21277567 20648540 20064116 19527117
12315A9527117m41475n11820m30363n38268m56242m60798l41716k41264m52805
$$ 19527117 19085642 18573822 18143459 17605191 17148949 16688151 16346435 16105171 15652366
12306A5652366l90544l76282l48486l35499k92346l38206j98834j90985k55253
$$ 15652366 15261822 14885540 14537054 14201555 13909209 13571003 13372169 13181184 12925931
12297A2925931k01955l47600k67369k85015k60210j89655k06236j45120j65155
$$ 12925931 12723976 12376376 12109007 11823992 11563782 11374127 11167891 11022771 10857616
12288A0857616j98076k94079j17562k16506l46850j15606p4381j56923j54288
$$ 10857616 10659540 10365461 10247899 10031393 9684543 9568937 9494556 9337633 9183345
12279I183345k38795j27290m2348j41798j79108j52681j18993j85777k36211k7998
$$ 9183345 8944550 8817260 8774912 8633114 8454006 8301325 8182332 7996555 7760344 7732346
12269G732346l6066j33922j4250p9184l3173L1263j42733q5435j17731j35355
$$ 7732346 7696280 7562358 7548108 7468924 7435751 7467014 7324281 7238846 7121115 6985760
12259F985760k31643j12365j49838j17432j43903j03582j88538j69939j31610
$$ 6985760 6754117 6641752 6491914 6374482 6230579 6126997 5938459 5768520 5636910
12250E636910p5399o6751r3877r9062q708o2453k5316q0419r1946j60748j9008
$$ 5636910 5561511 5494760 5400883 5301821 5293113 5230660 5205344 5124925 5032979 4872231 4853223
12239D853223r0216M9506r544j5251o5484r733o8530p2001p0661k01586k9376
$$ 4853223 4763007 4812513 4802969 4787718 4722234 4712501 4643971 4571970 4501309 4299723 4270347
12228D270347r8994j71713j69113l6608k9887R026L3329n5052j8980K9773k9189
$$ 4270347 4171353 3999640 3830527 3793919 3764032 3773058 3806387 3751335 3732355 3762128 3732939
12217C732939j08306k2372k0168j1877J5593p3453l2695J95335m178l7466l3990
$$ 3732939 3624633 3602261 3582093 3570216 3585809 3512356 3479661 3674996 3670818 3633352 3599362
12206C599362J7475m8142j089k6922j04455O830J624l7070q6262k29843l2903
$$ 3599362 3616837 3568695 3567606 3540684 3436229 3443059 3444683 3407613 3321351 3091508 3058605
12195C058605L6704l4643m4795p4648j19396m2275Q4377J18683l6160q8353l2374
$$ 3058605 3095309 3060666 3015871 2941223 2821827 2779552 2863929 2982612 2946452 2858099 2825725
12184B825725L2517O8989M471O9624l3572l5020p0955l8240m2198j37298j6317
$$ 2825725 2858242 2927231 2931702 3001326 2967754 2932734 2861779 2823539 2781341 2644043 2627726
12173B627726R9138p4059m9546p0576m5304n9921R440N018J1513m2878m3024p5390
$$ 2627726 2726864 2652805 2603259 2532683 2487379 2427458 2436898 2441916 2453429 2410551 2367527 2292137
12161B292137j2141k498J26830J98269P3240Q2583q107j45922L8656M8180m1828
$$ 2292137 2279996 2277498 2404328 2602597 2675837 2758420 2750313 2604391 2643047 2691227 2649399
12150B649399n8345J03715R4958r374O0051l255k5071Q2089j1704P5537K2680
$$ 2649399 2591054 2694769 2789727 2780353 2840404 2837149 2812078 2894167 2882463 2958000 2980680
12139B980680j12251J01686R3875l2593M9224J23212L1824Q3356J7645m631j50837
$$ 2980680 2868429 2970115 3063990 3031397 3080621 3203833 3235657 3319013 3336658 3332027 3181190
12128C181190j27437k7321j59137k04542n4932k1873j63342k20765o6611L4569
$$ 3181190 3053753 3026432 2867295 2662753 2607821 2585948 2422606 2201841 2135230 2169799
12118B169799J00910K9284k2178n6329j13106N988o1712k3257J56762M1363N1492
$$ 2169799 2270709 2299993 2277815 2221486 2108380 2114368 2052656 2029399 2186161 2227524 2279016
12107B279016J9235Q0759k5359p7387r6592J6361J39799J82479K6233m0865k657
$$ 2279016 2298251 2379010 2353651 2276264 2179672 2196033 2335832 2518311 2544544 2503679 2501022
12096B501022K2581J20979Q4072o8224m0614j09991l8612K1298J08813N0095j1082
$$ 2501022 2523603 2644582 2728654 2660430 2619816 2509825 2471213 2492511 2601324 2651419 2640337
12085B640337J7851J49997J49659n0280q857J7375M9892K05585K3734n2346J03430
$$ 2640337 2658188 2808185 2957844 2907564 2898707 2916082 2965974 3171559 3195293 3142947 3246377
12074C246377J06185O0292L055L9881M4286J97182R7772M0213N7200R2753J15037
$$ 3246377 3352562 3412854 3415909 3455790 3500076 3697258 3795030 3835243 3892443 3985196 4100233
12063D100233J65157J87309L34774K97295J01180O4770K02944J44013R6440J20736
$$ 4100233 4265390 4452699 4787473 5084768 5185948 5250718 5453662 5597675 5694115 5814851
12053E814851J16063K9990K09748L17281L03008M36159M34642M70803N91679O58453
$$ 5814851 5930914 5960904 6170652 6487933 6790941 7227100 7661742 8132545 8724224 9382677
12043I382677N99735N21256M55489L19244L07167L00419K52435K10645K99343
$$ 9382677 9982412 10503668 10959157 11278401 11585568 11885987 12138422 12349067 12648410
12034A2648410L14620M70628N41537N38115P81589R87486J194393J359750J600338
$$ 12648410 12963030 13433658 13975195 14513310 15294899 16282385 17476778 18836528 20436866
12025B0436866K107303K628622L173863L848044M583434N092843N834436O735367
$$ 20436866 22544169 25172791 28346654 32194698 36778132 41870975 47705411 54440778
12017E4440778P705382Q943083J0548635J2847465J6222350K0848560K6276988
$$ 54440778 62146160 71089243 81637878 94485343 110707693 131556253 157833241
12010A57833241L2680893L8859424M3749212M5834583M3687708L7435435K7013557
$$ 157833241 190514134 229373558 273122770 318957353 362645061 400080496 427094053
12003D27094053J2531532m165117j9981519l3767829m3771129m8840394m8466835
$$ 427094053 439625585 435460468 415478949 381711120 337939991 289099597 240632762
11996B40632762m3937975l7444332k9890848k1923245j4871128j0119262o950817
$$ 240632762 196694787 159250455 129359607 107436362 92565234 82445972 75495155
11989G5495155n182922m325614l698092l440761l076952k877716k627032k354240
$$ 75495155 70312233 65986619 62288527 58847766 55770814 52893098 50266066 47911826
11981D7911826k087420j664543j508215j352848j203151j202571j268769j329263
$$ 47911826 45824406 44159863 42651648 41298800 40095649 38893078 37624309 36295046
11973C6295046j495490j599022j570024j578357j552029j528244j510424j508838
$$ 36295046 34799556 33200534 31630510 30052153 28500124 26971880 25461456 23952618
11965B3952618j469149j313417j121192j108721j130303j125836r58538r36089
$$ 23952618 22483469 21170052 20048860 18940139 17809836 16684000 15725462 14789373
11957A4789373p60377n87195o02433m90976m44763m66615n17290m56604l87231
$$ 14789373 14028996 13441801 12839368 12348392 11903629 11437014 10919724 10463120 10075889
11948A0075889k31554k67835l66898k55784l76630k90069k31775l71932m65513
$$ 10075889 9844335 9576500 9209602 8953818 8577188 8287119 8055344 7683412 7217899
11939G217899l95256l01946k58977l51316n12082l32449o8359j85578k03897k73320
$$ 7217899 6822643 6520697 6261720 5910404 5398322 5065873 4997514 4811936 4608039 4334719
11929D334719k62978k37155j32402j17159j04794j90000j93627q6206j77841m0703
$$ 4334719 4071741 3834586 3702184 3585025 3480231 3290231 3096604 3010398 2832557 2791854
11919B791854k2940j17656j46111o6890p2445q0918k28497j09100j4885K1422
$$ 2791854 2768914 2651258 2505147 2438257 2365812 2284894 2056397 1947297 1932412 1953834
11909A953834n7751j96348j27924l4935j9920n7790K4827j6042k6060n7269o1027
$$ 1953834 1896083 1699735 1571811 1536876 1516956 1459166 1483993 1467951 1441891 1384622 1323595
11898A323595n6670p1138J36308J8799l7564O0044j8675o4270j6807N1779J42348
$$ 1323595 1266925 1195787 1332095 1350894 1313330 1373374 1354699 1290429 1273622 1325401 1467749
11887A467749O6366j21838l7057k441O3088Q3967N1793R858j8064p843j46598
$$ 1467749 1534115 1412277 1375220 1372779 1435867 1519834 1571627 1581485 1563421 1555578 1408980
11876A408980m0285r7093j6902j29037j73415k817k8317j35214j05990j05768
$$ 1408980 1368695 1271602 1254700 1125663 952248 949431 921114 785900 679910 574142
11866E74142J06477M0094j2150k2848j17305l4179j9741J416n2914k6664K2597
$$ 574142 680619 720713 708563 685715 568410 534231 514490 515906 462992 436328 458925
11855D58925j217Q3772L4363K797j18114N4434R2501O9093O3382j8798J64419
$$ 458925 457708 541480 575843 578640 460526 514960 607461 676554 739936 721138 885557
11844H85557n392r3337N2466o9724j6121J68010J27843n4937k510m215L337j08464
$$ 885557 880165 786828 839294 769570 753449 921459 1049302 994365 991855 987640 990977 882513
11832H82513p8967K1980N21n8757q2269L9553M104k3426O0935p1538r6780m6008
$$ 882513 803546 825526 826047 767290 685021 724574 728678 705252 766187 694649 597869 551861
11820E51861J29237J11444j6928M8745r498o3041Q829L1058L8836O9387L1692
$$ 551861 681098 792542 775614 824359 814861 751820 760649 791707 830543 899930 931622
11809I31622r3391r3490o6651m3286J1523q8567p9734o5761k5078k4546P5927
$$ 931622 838231 744741 678090 634804 646327 557760 478026 412265 387187 362641 438568
11798D38568K9724n0067P5267L5219N073K969J3488P9663Q7786M4752j95749j89090
$$ 438568 468292 418225 493492 528711 533784 536753 550241 629904 717690 762442 566693 377603
11786C77603P1582N2308j01174o4970p7893L175K5374J00849Q2663l1582m3117
$$ 377603 449185 501493 400319 335349 257456 260631 286005 386854 469517 437935 394818
11775C94818j04874k1794O7366K903r2271L177P4009K9703K9712j10310l7627
$$ 394818 289944 268150 335516 338419 246148 249325 323334 353037 382749 272439 234812
11764B34812o617o3004M4236l2934k1083J02953K9298L6865j0269K2011k0143
$$ 234812 228195 165191 209427 176493 155410 258363 287661 324526 314257 336268 316125
11753C16125r4714k8078j8236L8561j2247J6339M710m4691j2777N7008l3142n0941
$$ 316125 221411 193333 175097 213658 201411 217750 222460 177769 164992 222000 188858 137917
11741A37917j920Q6010J85870M872o6876r765m843l597n5467o4233J2038l8099
$$ 137917 135997 222007 407877 412749 345873 336108 331265 327668 272201 207968 220006 181907
11729A81907q0640j53167J1293j9964O3179O698N4961P8128J68499M9265k0184
$$ 181907 101267 -51900 -40607 -60571 2608 9306 64267 142395 310894 360159 339975
11718C39975N3431R078Q8785K4070r4954q1803O381l9128q9204k9797n0106O4378
$$ 339975 393406 402484 491269 515339 420385 338582 344963 305835 216631 186834 136728 201106
11706B01106K5302J1475J2923M5744K5682j6825l9488O7282N9517J687n9961o5589
$$ 201106 226408 237883 250806 296550 322232 305407 265919 333201 392718 394405 334444 268855
11694B68855L2705K6896m6330j46615l5229L5662O2851j1504j0381r887j02220
$$ 268855 301560 328456 282126 135511 100282 135944 198795 187291 176910 167023 64803
11683F4803N2186K5461R0051O9363p1742j31254m34Q6237J99144L6915n1078j03463
$$ 64803 116989 142450 232501 301864 230122 98868 98434 184671 383815 420730 369652 266189
11671B66189n4522j1477K3367M9441M7854j06324r6723M3537J3850M0020J04480
$$ 266189 211667 200190 223557 272998 320852 214528 117805 161342 175192 215212 319692
11660C19692k8535p856N110o5840q5147k5961J8945J00046K6382o5373j19962
$$ 319692 291157 283301 288411 222571 137424 111463 130408 230454 256836 191463 71501
11649G1501R5912L9049M4968n9691l6084n6087J16596l1227N5032J05894p6694
$$ 71501 167413 206462 251430 191739 155655 99568 216164 184937 239969 345863 269169
11638B69169O5214M7790p2857j19568o6308J9198j38851J662J25861J7254j4604
$$ 269169 334383 382173 309316 189748 123440 142638 3787 5449 131310 148564 133960
11627A33960j12194l8571L4010J12497n3908n8043J30701L746J03513k7257o5379
$$ 133960 21766 -16805 17205 129702 75794 17751 148452 152198 255711 228454 163075
11616A63075o1646j0617j21834J4088K38421m7731m0585M7132J00320j2872j4417
$$ 163075 101429 90812 -31022 -16934 221487 173756 133171 180303 280623 267751 253334
11605B53334j8601l3692q3151m6618O5286J5295M2622j0517O681K26226J47926
$$ 253334 234733 201041 117890 71272 136558 151853 194475 183958 190639 416865 564791
11594E64791O5150j295N8424j7309J71481K33656J47153K02223K68481J34169
$$ 564791 629941 628646 687070 669761 841242 1074898 1222051 1424274 1692755 1826924
11584A826924J05582K72245J00190o459N7433K4307q7591k20054l30549l99346
$$ 1826924 1932506 2204751 2304941 2298482 2355915 2380222 2292631 2072577 1742028 1342682
11574A342682l20084j34989R116R98j58406j77565j4840o4721q8758j2210j7749
$$ 1342682 1022598 887609 896725 897723 739317 561752 546912 482191 393433 381223 363474
11563C63474m4381p12o4549L1002J6359k8038p3056j6626R9863l6266K2321J05749
$$ 363474 319093 318381 253832 284834 301193 273155 200099 183473 283336 247070 269391 375140
11551C75140r2814o0416r6708l6820J14338M7863m8866r0571Q948l9418m3419
$$ 375140 282326 221910 125202 88382 202720 250583 201717 111146 120094 80676 37257
11540C7257J81101R7308n890j01031M9265O3189j68607j57019j65999J68260K48575
$$ 37257 218358 315666 309776 208745 258010 321199 152592 -4427 -170426 -2166 246409
11529B46409J53761k9176j06301P8779l0951k1145M8116j49291j38777k2970L4821
$$ 246409 400170 370994 264693 343472 312521 291376 339492 190201 51424 28454 63275
11518F3275N4237Q2835J8191K4679J807o3020j33517L3113Q7866l0410n0244P0804
$$ 63275 117512 200347 218538 243217 245024 182004 48487 81600 169466 139056 88812 159616
11506A59616q5343j0498m4799n3585l237N8740K2812n538r7800J8101Q7451j2463
$$ 159616 74273 63775 18976 -34609 -37846 20894 43706 38168 -59632 -41531 45920 33457
11494C3457k7290l5024Q1195P3770l5270m1266L1492L0282m0030o70L1372N5409
$$ 33457 6167 -28857 52338 126108 90838 49572 81064 111346 71316 70646 102018 157427
11482A57427L3300q8386L5601P5588M6445r5422l6001j2622j3946N1601j124M142
$$ 157427 190727 102341 137942 213530 259975 164553 128552 115930 101984 153585 152461 156603
11470A56603K0350n5192j16543m2909M1004M3524n5588P280P1697Q7672L4612
$$ 156603 176953 121761 5218 -37691 3313 46837 -8751 -1471 70226 157898 192510
11459A92510J60008L8271j00175k9494j0730n7720j63396n3889k8522P0584j8975
$$ 192510 352518 390789 290614 261120 250390 192670 29274 -24615 -53137 17447 -1528
11448a528M5566L8184L313n8599R7121L9614q2793J3716J04029M7921k2742k07543
$$ -1528 44038 82222 85535 26936 124057 163671 80878 94594 198623 246544 223802 16259
11436A6259j28760K3723J76731K519k9530q3587r9803J38159R9172J4993K0856
$$ 16259 -112501 -88778 87953 90472 60942 -22645 -122448 15711 114883 129876 150732
11425A50732j7237K6383q6648j67427J05682J35951m8730k6315r416N8395N8918
$$ 150732 133495 159878 73230 -94197 11485 147436 98706 72391 62975 121370 180288
11414A80288M8547J2362M4823n3618k11367P976R6587j5065J8158P4209j6907
$$ 180288 228835 241197 286020 232402 21035 29011 125598 110533 128691 202900 185993
11403A85993P6327r5602j66620J5204K0585J49553J19582p4326p5532n2794j9240
$$ 185993 262320 166718 98 15302 35887 185440 305022 230696 155164 102370 83130
11392H3130J5836k0457o7341n579L3522N0234m8363R053P3074j2949n3663J3033
$$ 83130 98966 78509 11168 5589 39111 89345 40982 50035 123109 110160 56497 69530
11380F9530M6023M2134m2517m3277m4437q1195l1335n883N7816P3069K9384N9221
$$ 69530 115553 157687 115170 71893 27456 -53739 -85074 -90957 -33141 39928 69312 128533
11368A28533P136m0647L9896r4647q9875R7015J14178m9448j20943o4210j7595
$$ 128533 135669 95022 134918 40271 -49604 47411 161589 112141 -8802 -73012 -90607
11357i0607J64078J25919k3361j01678J2425J4763o8563J1787R7997J1184n6800
$$ -90607 73471 199390 176029 74351 86776 101539 32976 44763 142760 153944 97144
11346I7144m1139J5277j2369o9313j11545q550J40394M711R2267L0895J7623k04016
$$ 97144 56005 71282 58913 -10400 -121945 -130495 9899 14610 106877 137772 155395 -48621
11334d8621m748N9688O5030R140Q0936K7883o2772O2099O9836J74373n7256n6840
$$ -48621 -53369 6319 71349 80489 161425 189308 126536 188635 258471 432844 375588 318748
11322C18748q874n1548l0776m5329J1291p9148k1851O2530R9265K7035M4615J4156
$$ 318748 309874 258326 227550 182221 193512 114364 92513 155043 254308 281343 325958 340114
11310C40114q3384l4649J0008m6941l5904l3127j91882k806L2934L1776O3747
$$ 340114 256730 222081 232089 185148 149244 116117 -75765 -78571 -45637 -13861 49886
11299D9886K986j6766K5963m5713j33622K3257P9832j5373N3928L906L4839L2860
$$ 49886 52872 36106 62069 16356 -117266 -94009 -14177 -29550 24378 28284 63123 95983
11287I5983K1645O0359L8954K7653j1667l0975q4617J06K7302j5440o2372r1737
$$ 95983 117628 177987 216941 244594 232927 201952 117335 117441 144743 129303 66931 -24806
11275b4806m666J38831O3880p5792j1431Q0106M4669n9024l7661j1079q7079o5514
$$ -24806 -29472 109359 173239 97447 86016 166122 210791 151767 114106 103027 15948 -49566
11263d9566L3952j4425R9626r990J20286M5395P518k5700j35012j52991O7603
$$ -49566 -15614 -30039 69587 59597 179883 225278 232796 207096 72084 -80907 -13304
11252a3304J13384L3344k8030L9474K1125o5042K4954J052M8506Q1732p1007j25752
$$ -13304 100080 133424 105394 144868 165993 100951 125905 126957 175463 257195 186188 60436
11240F0436j9601J5736P9773l8493K2499R4437L419K922n3823N1859J3241k1584
$$ 60436 40835 56571 136344 97851 120350 214787 218206 221128 167305 219164 232405 210821
11228B10821j80708L1867O2298N4612j55587q7991J90416l3097l8404Q3598l8537
$$ 210821 30113 61980 124278 178890 23303 -64688 125728 92631 54227 137825 99288
11217I9288j36218l8750R1793J17224L2945k3704n6322j820m9583l8517J18416
$$ 99288 -36930 -75680 16113 133337 166282 142578 86256 84436 34853 -3664 114752
11206A14752M9599L587m1891j40147K8099Q3473N281j10505R600R8864L081J7923
$$ 114752 164351 167938 126047 -14100 13999 97472 102753 -7752 1848 100712 103793 121716
11194A21716L92j0999m9582N551R7198M7585Q5055o1395j77953j16109R947K7619
$$ 121716 122108 111109 61527 67078 164276 211861 296916 235521 57568 -58541 -48594 -20975
11182b0975l0655K729K6884j2120n1085J50654M3563o9582l8044j06512j0571
$$ -20975 -51630 -48901 -22017 -34137 -85222 65432 108995 39413 1369 -105143 -115714
11171a15714L8588q92P0799L6589M7874O1028N4706K13j6162n4287l0774R8058
$$ -115714 -77126 -78018 -7219 29370 77244 138272 192978 193191 177029 122742 91968 190026
11159A90026l1056o8814R8126M1494j1157o3256O2692l1582j31299N0341N4881
$$ 190026 158970 90156 188282 229776 218619 155363 218055 186473 55174 105515 160396
11148A60396K8356q9527m559O5006m2655L853n1941R0557L719l5273j14335k6419
$$ 160396 188752 99225 94666 159672 117017 120870 68929 159486 163205 127932 13597 -12822
11136a2822n5672l655R5872J4515p793n1623N3688l4499P5877n2943m259J02813
$$ -12822 -68494 -72149 23723 38238 30445 -21178 32510 -1989 73888 20945 16686 119499
11124A19499J9939o208o007j12188Q4286O8366l6436N3483l8133K6495K0716l1208
$$ 119499 139438 133230 127223 15035 99321 167687 131251 184734 146601 173096 193812 162604
11112A62604l7417N1702N6787p0350L391p499M3006J374l5817K5307r5200p3066
$$ 162604 125187 176889 233676 163326 166717 159218 202224 203598 167781 193088 97888 24822
11100B4822K6118P0922P9173p5631q0298P3941P5538l0954o5792m187l12r5318
$$ 24822 50940 121862 201035 125404 45106 119047 194585 163631 97839 93652 93340 -1978
11088a978r4262k7654J28292N4398j08278m5132P0185n2777o6501L2517K1648
$$ -1978 -96240 -123894 4398 58796 -49482 -94614 -24429 -77206 -143707 -111190 -89542
11077h9542L7818O1234L939l2690p9078J70914R8349j5010p1385q6827l8459K8631
$$ -89542 -51724 9510 13449 -19241 -98319 72595 170944 155934 84549 -2278 -40737 -12106
11065a2106J07637O7326M8545K6944j2704m3966L8214K0180l6498j6049m491n8994
$$ -12106 95531 162857 211402 238346 225642 181676 219890 240070 203572 187523 183032 124038
11053A24038L7844l2220l0051l1812j5668P9496k4347k8041M9317J54856K6447
$$ 124038 161882 129662 99611 67799 52131 131627 107280 79239 128556 283412 309859
11042C09859n5060r3753j7743P3506j18637o8839K8980j3461n0870N8254r0098
$$ 309859 254799 161046 143303 216809 98172 29333 58313 44852 -6018 52236 -37862
11031c7862p0057M7855P895P2224J13754R9016M4271j32577p3623M4610L0885
$$ -37862 -107919 -60064 -52169 20055 133809 232825 277096 144519 70896 115506 146391
11020A46391M4489K6724O198j50624N9931J13509O3114L3540j01337o6415p4969
$$ 146391 190880 217604 223802 73178 133109 246618 309732 343272 241935 175520 100551
11009A00551o6359J4329J0150M4622M1037P6345k2791k4685k338l8444L559l5025
$$ 100551 34192 48521 58671 103293 144330 220675 197884 173199 170861 132417 135976 100951
10997A00951l5143J1565m4931K9575J14711M9804K3480K4992j656m508O931j9051
$$ 100951 65808 77373 32442 62017 176728 226532 250012 275004 273348 268840 275771 256720
10985B56720j32583r0890k9815J5072O1026o2368q8158R805K03005L5335q8412
$$ 256720 124137 33247 3432 18504 79530 17162 -70996 -61191 141814 177149 88737
10974H8737N6422L8124P1025J29421p7481n6465O5193N563r9041L2740J51379
$$ 88737 145159 183283 254308 383729 306248 249783 314976 320539 221498 254238 405617
10963D05617J37098J12205J70049p2064n7364J13992J59043Q7704Q9406P2459
$$ 405617 542715 654920 824969 752905 695541 809533 968576 1056280 1145686 1218145
10953A218145P1296o98j99394j77614j96239o4107j77326J0963q235l1877j51261
$$ 1218145 1289441 1288743 1089349 911735 715496 651389 474063 485026 476791 444914 293653
10942B93653j9321P3917K5942j3234L8284q6344k8930N7503Q5453J25954J62549
$$ 293653 274332 348249 374191 360957 399241 312897 283967 341470 426923 552877 715426
10931G15426k6403o8609o6203j68196J56060J87210M6271l6371J58701K24817
$$ 715426 689023 620414 554211 386015 542075 729285 775556 739185 897886 1122703
10921A122703N2961o745p9981k9084Q8869N5245j6279m961o0526J9787R1002r0859
$$ 1122703 1175664 1168919 1088938 1059854 1148723 1203968 1187689 1182728 1122202 1141989 1232991 1142132
10909A142132m880j22634K6660L9098Q4448Q1611N6543P9120R5551k0722K4390
$$ 1142132 1137252 1014618 1041278 1080376 1164824 1246435 1302978 1382098 1477649 1456927 1481317
10898A481317m1516O0606K7961p0580j39555N8615M1060N6788Q9613J2164o623
$$ 1481317 1439801 1500407 1528368 1457788 1318233 1376848 1417908 1474696 1564309 1576473 1569850
10887A569850J951p1487K6389O4862q7288o4265l2429k6743l8942q012p438P3668
$$ 1569850 1571801 1500314 1526703 1591565 1504277 1440012 1407583 1380840 1341898 1333886 1326448 1400116
10875A400116j30141j53759M3429K8234j9422n9042p5597j7052L9896O8614j3160
$$ 1400116 1269975 1116216 1159645 1187879 1168457 1109415 1033818 1016766 1056662 1125276 1112116
10864A112116o838Q3636j8959q521J54411P0209L6397j0528K2100q7674r1176
$$ 1112116 1105278 1188914 1169955 1161434 1315845 1386054 1422451 1411923 1434023 1346349 1255173
10853A255173j37062m0422n9988j8526j90688J5649R2750n1759J9471L0707p3477
$$ 1255173 1118111 1077689 1017701 999175 808487 824136 916886 865127 884598 915305 841828
10842H41828j81341j32101m4939j2846O2500J3460J14758q053K6009J49269p9272
$$ 841828 660487 528386 483447 470601 533101 546561 661319 653266 679275 828544 749272
10831G49272j72116n1621m8768J3776N0956J69771P5718L0866r5408j4739p1211
$$ 749272 577156 525535 476767 490543 541499 711270 786988 817854 722446 707707 636496
10820F36496j28041j15587p9476p4832P8011J66047K7529j24039N0296k3499K1531
$$ 636496 508455 392868 313392 238560 316571 482618 510147 386108 436404 412905 434436
10809D34436J20644l3183k7832l9209l7742j2141N4270J5152p2147l5172J03717
$$ 434436 555080 521897 494065 454856 417114 404973 459243 474395 402248 367076 470793
10798D70793M5911K9861P8345r3380P242P2584P235J12316k3178r451p7082j23260
$$ 470793 516704 546565 624910 531530 538772 611356 618591 730907 707729 698278 621196 497936
10786D97936l6148q3935O6068N6585J7388K9254j5866j24933M967l277Q1473Q6586
$$ 497936 461788 377853 443921 500506 517894 547148 531282 406349 411316 408039 489512 576098
10774E76098m0997k4996n6132m1151O4943O2611O4361J6976q8808r5650m0925
$$ 576098 535101 510105 453973 412822 477765 540376 604737 621713 532905 437255 396330
10763C96330L5687P6065J01109M7110J941J65377P7427k1765k09018j11003J13006
$$ 396330 432017 508082 609191 656301 658242 823619 901046 879281 670263 559260 672266
10752F72266J52318R0409l7952M8858k8232o9340j47574m7545J29331O5083L2835
$$ 672266 824584 914993 877041 925899 897667 828327 680753 633208 762539 827622 860457
10741H60457N0341l3422m9078P1857L67J35948K7354k2967R348j3480j20804q9119
$$ 860457 910798 877376 828298 900155 900522 1036470 1063824 1040857 1050205 1036725 915921 826802
10729H26802p0675o3625J1910J56804R7411j28045M0215J06976j61266l2934Q5058
$$ 826802 756127 692502 704412 861216 958627 830582 870797 977773 816507 783573 868631
10718H68631J03651k3586P418j38382L2934M7604P0200p707j46640j32334J36787
$$ 868631 972282 948696 956114 817732 850666 898270 968470 960763 814123 681789 818576
10707H18576R6345J9078j0408n4990l795J34723J17357L9118n1637r1052k1246
$$ 818576 914921 933999 923591 868601 864806 999529 1116886 1156004 1104367 1013315 992069
10696I92069N7822P1856p5998o7369N0585j8024k3773l756m8413O6296N9911m975
$$ 992069 1049891 1121747 1045749 978380 1028965 1010941 987168 983412 934999 1001295 1061206 1056231
10684A056231P048K5975P2696o9330n3823m615O318K49n6799P4553O8105j08909
$$ 1056231 1063279 1089254 1161950 1092620 1038797 1034182 1040500 1040749 983950 1058503 1126608 1017699
10672A017699N7169J02523j3514J154o6166k4932k0049K6528o9109P1669j574
$$ 1017699 1074868 1177391 1163877 1165031 1098865 1073933 1053884 1080412 1011303 1082972 1081398
10661A081398M2795J407j68492N889R3855N0729Q6516J51950m1595L7350J8823
$$ 1081398 1124193 1125600 957108 962997 1056852 1107581 1194097 1346047 1304452 1341802 1360625
10650A360625K1630M6435j2038q455J9356N9172N0924p1753p9359K1273Q5097
$$ 1360625 1382255 1428690 1416652 1408197 1427553 1486725 1537649 1465896 1386537 1407810 1492907
10639A492907J6422M8575J0515P1193N8853O9906P1099R1847K7706R8340q8759
$$ 1492907 1509329 1557904 1568419 1639612 1698465 1768371 1839470 1931317 1959023 2057363 1968604
10628A968604k2477R836N4322Q7478k3305P8703J37597M678J47245N6596j620
$$ 1968604 1946127 1955963 2010285 2097763 2074458 2153161 2290758 2295436 2442681 2499277 2497657
10617B497657J1923N0035L5716o4978l1051J32391P5749l2512q1929O4699J15145
$$ 2497657 2509580 2559615 2595331 2530353 2499302 2631693 2707442 2674930 2593001 2657700 2772845
10606B772845J68048J27393k6844p9917n0088M8941J74009k4085N1503Q4110j37
$$ 2772845 2940893 3068286 3041442 2961525 2911437 2960378 3134387 3110302 3161805 3245915 3245778
10595C245778P3680O0523Q183k1206m2483O5139J21824L9174k3963k7496L7424
$$ 3245778 3319458 3379981 3388164 3366958 3324475 3389614 3511438 3550612 3526649 3499153 3536577
10584C536577j9030O0878J02568M8163Q9765R8803J58984J15502N1524J59572
$$ 3536577 3517547 3578425 3680993 3729156 3818921 3917724 4076708 4192210 4243734 4403306
10574D403306J91993J49006M0985N0203K07862J57090J05134J0600J3472J53071
$$ 4403306 4595299 4744305 4785290 4835493 5043355 5200445 5305579 5316179 5329651 5482722
10564E482722K09297P8828J13890L115L6329N6010J60094J48376K24715K06198
$$ 5482722 5692019 5770847 5884737 5887852 5924181 5980191 6140285 6288661 6513376 6719574
10554F719574J35809J13993J11264L14571K82431J97653K91476K84229K20227
$$ 6719574 6855383 6969376 7080640 7395211 7677642 7875295 8166771 8451000 8671227
10545H671227L05580K86537L32994M00461M40580N24465N39199M19899M93304
$$ 8671227 8976807 9263344 9596338 9996799 10437379 10961844 11501043 11920942 12414246
10536A2414246N05951N16549M87020M15871O49503P07554P35436O57663P66357
$$ 12414246 12920197 13436746 13923766 14339637 14989140 15696694 16432130 17089793 17856150
10527A7856150R77296R84927J124494J306825J318497J553152J823244K044883
$$ 17856150 18833446 19818373 20942867 22249692 23568189 25121341 26944585 28989468
10519B8989468K329749K696332K908980L240392L776123M294596M886775N650427
$$ 28989468 31319217 34015549 36924529 40164921 43941044 48235640 53122415 58772842
10511E8772842O491045P503588Q325929R413107J0804981J1947684J2985881J3770812
$$ 58772842 65263887 72767475 81093404 90506511 101311492 113259176 126245057 140015869
10503A40015869J3989985J3342789J1608784Q634860M700643L56117l659201o895215
$$ 140015869 154005854 167348643 178957427 187592287 192292930 192649047 188989846 182094631
10495A82094631q810472r201057q399363o820995m828586k631432n37964J283655
$$ 182094631 173284159 164083102 155683739 148862744 144034158 141402726 140864762 142148417
10487A42148417L099570M716308N763996O511722O770937O413198N751919M970004
$$ 142148417 145247987 149964295 155728291 162240013 169010950 175424148 181176067 186146071
10479A86146071M221699L866271M076940M939845O137537P067006P675685P299452
$$ 186146071 190367770 194234041 198310981 203250826 209388363 216455369 224131054 231430506
10471B31430506N944913L765800Q23507k268235n041462p253167q427099q280576
$$ 231430506 237375419 241141219 241964726 239696491 234655029 227401862 218974763 210694187
10463B10694187p595794o324509n043851l874075l273983l289922l924578m767191
$$ 210694187 203098393 196773884 191730033 187855958 184581975 181292053 177367475 172600284
10455A72600284n059200n225054m801540l788666k507806q44636O87413K227543
$$ 172600284 167541084 162316030 157514490 153725824 151218018 150373382 151060795 153288338
10447A53288338L759012N144861N946532O208093O043594N036729K961257M20501
$$ 153288338 157047350 162192211 168138743 174346836 180390430 185427159 188388416 188808917
10439A88808917k699319o332676r384786j1486443j2621114j2828663j2194281
$$ 188808917 186109598 179776922 170392136 158905693 146284579 133455916 121261635
10432A21261635j1196717r930898q721299p603050o662531n836454n002402m437894
$$ 121261635 110064918 100134020 91412721 83809671 77147140 71310686 66308284 61870390
10424F1870390l895418l440013l100204k780630k424019k214260k185473k008313
$$ 61870390 57974972 54534959 51434755 48654125 46230106 44015846 41830373 39822060
10416C9822060j820419j648814j532135j379464j405459j423969j406384j429846
$$ 39822060 38001641 36352827 34820692 33441228 32035769 30611800 29205416 27775570
10408B7775570j309084j219004j127357j242275j161610r80660q43971q64292
$$ 27775570 26466486 25247482 24120125 22877850 21716240 20735580 19891609 19027317
10400A9027317q61332p98128p98589p16966p01861o53869n91624m56248p05772
$$ 19027317 18165985 17367857 16569268 15852302 15150441 14496572 13904948 13448700 12742928
10391A2742928m60967m50858l86725m83218n17550k74168k30325l94178m60728
$$ 12742928 12281961 11831103 11444378 10961160 10443610 10169442 9939117 9544939 9084211
10382I084211l49016l31721l30787j30541k05348k63102l13410j90249k26433
$$ 9084211 8735195 8403474 8072687 7942146 7736798 7473696 7160286 6970037 6743604
10373F743604j42492k82243l07847j39179k54077k10095j38158j69777k4175j61533
$$ 6743604 6601112 6318869 6011022 5871843 5617766 5407671 5269513 5099736 5075561 4914028
10363D914028j34890j29923j31316l1700j54796l14369j82060p0600k2661l2401
$$ 4914028 4779138 4649215 4517899 4486199 4331403 4017034 3834974 3764374 3741713 3709312
10353C709312n0955j7334k3746L2358j09547n4390l4959M0173j63011j36933l7372
$$ 3709312 3658357 3641023 3617277 3649635 3540088 3485698 3450739 3490912 3327901 3190968 3153596
10342C153596K114k323m6558r936k1207p2264k09615l7413n1341n3331R1078l1779
$$ 3153596 3155710 3153387 3106829 3096893 3075686 3003422 2793807 2756394 2705053 2651722 2742800 2711021
10330B711021K6627M6734l9252j32681J3097O3771j586q0737n1323p8651o7224
$$ 2711021 2737648 2784382 2745130 2612449 2625546 2689317 2687731 2606994 2555671 2477020 2409796
10319B409796P8648n9197l1674J2267j16265o8579j37004M6270P6649l0913j90199
$$ 2409796 2488444 2429247 2397573 2409840 2293575 2224996 2087992 2134262 2210911 2179998 1989799
10308A989799k5602L3855M4871k8800j32521r579j6641j83089n7743J03096M8195
$$ 1989799 1964197 1998052 2042923 2014123 1881602 1872023 1855382 1672293 1614550 1717646 1765841
10297A765841R711j9200n784p0910j4858n7557o9711n862M0406J439p7846j1929
$$ 1765841 1775552 1756352 1750568 1679658 1664800 1607243 1537532 1531670 1572076 1573515 1495669 1483740
10285A483740J7516l006O8395l756q3836r880M0969L1032p1066j98931J489O6644
$$ 1483740 1501256 1498250 1566645 1562889 1479053 1469173 1510142 1541174 1470108 1271177 1272666 1339310
10273A339310Q225N3845K3242m2898r0665j84575k1416L0955r8070n3863P2237
$$ 1339310 1347535 1401380 1424622 1381724 1291059 1106484 1085068 1116023 1017953 964090 1036327
10262A036327k0657q8021J1580K8197N3660k5946R9505o3471J5774K4736K5810
$$ 1036327 1015670 927649 939229 967426 1021086 995140 1094645 1031174 1046948 1071684 1097494
10251A097494m7131j09910j04420j4150N8272L3873O7432j4543o1499R7602K8116
$$ 1097494 1050363 940453 836033 821883 880155 914028 981460 966917 905418 1003020 1031136
10240A031136r5388m9758K0406K6847j27278Q6928K5409k0976r3460J079K8366
$$ 1031136 935748 885990 906396 933243 805965 892893 918302 897326 803866 804945 833311
10229H33311r056J11378j306r7486l2036N3942p0708o9470o0498j1188m2906l0371
$$ 833311 824255 935633 934327 836841 804805 858747 788039 718569 658071 646883 603977 573606
10217E73606k3550o1652k3047P3581P2633o2943j01625K3638Q3851J16618m4058
$$ 573606 550056 488404 465357 538938 611571 548628 447003 470641 554492 671110 627052
10206F27052r1202J28234M879q4627R006J08248L5889p5300o5110q1502n7215
$$ 627052 535850 664084 668963 584336 593342 701590 737479 662179 597069 515567 458352
10195D58352O0236J4789L7018o4893m3538N2164k2758k6295K5258p8490N0912
$$ 458352 518588 533377 570395 505502 461964 514128 491370 465075 490333 411843 462755
10184D62755l6261M0023k0978n9730O393Q6826k6644k6061m36L0004P916p3008
$$ 462755 426494 466517 445539 385809 392202 479028 452384 426323 425887 455891 463807 390799
10172C90799k7884J48228K8974p0840j0580M239K7940L6057o2860m9677J7381
$$ 390799 362915 511143 540117 469277 458697 462936 490876 526933 464073 414396 431777
10161D31777j7920O5625l7466j5140o0211r5395R6793Q0669q2155n4140j34594
$$ 431777 413857 479482 442016 426876 366665 271270 368063 448732 366577 312437 177843
10150A77843p6857K9617R7339O0245p3798q1734K5697j5182K8726J19096Q2509
$$ 177843 100986 130603 227942 288187 214389 132655 158352 143170 171896 290992 373501
10139C73501M5758J8414p2065n3319q3906k6305j0162N9705l0106k7268M5271
$$ 373501 419259 437673 365608 312289 228383 202078 191916 251621 221515 194247 239518
10128B39518J04757n5075K2859J1326j09319j14P2863P3432p5734n5495l4343
$$ 239518 344275 289200 312059 323385 214066 213952 286815 360247 284513 229018 194675
10117A94675Q2485O4349R5084Q6312n4160p6953m9446r4815K2375J24016k8333
$$ 194675 277160 341509 436593 522905 468745 391792 342346 247531 269906 393922 365589
10106C65589l3098j367j81804J8265J25389J14565N919l4747J3448j0555L0765
$$ 365589 332491 331124 149320 167585 292974 407539 413458 378711 392159 381604 412369
10095D12369J31949R064o81n4768M4173k8480M7507R1644J38128N9112K8197J77340
$$ 412369 544318 553382 552701 497933 542106 513626 561133 652777 790905 850017 878214 1055554
10083A055554J44201K6927L700j2305j832m886K09589J30767r3855j09237K5917
$$ 1055554 1199755 1226682 1230382 1218077 1216245 1211359 1420948 1551715 1457860 1348623 1374540
10072A374540q844l2827o3304r2557n0233K6285j23957k1479k4939k1733J51583
$$ 1374540 1365696 1332869 1269565 1177008 1126775 1153060 1029103 1007624 982685 960952 1112535
10061A112535M6009L1170L3291L5328R290m7455q5060L853J21591N3057o7248
$$ 1112535 1158544 1189714 1223005 1258333 1267623 1220168 1135108 1138961 1260552 1313609 1246361
10050A246361Q245M4793m3790L7138P0162m370m853o1116j14461r0064K4892J1596
$$ 1246361 1254606 1299399 1255609 1292747 1362909 1358539 1353686 1292570 1178109 1088045 1112937 1124533
10038A124533l2224j3546L9961J465n3759K8763p3897o5809J03318N1261k6386
$$ 1124533 1092309 1078763 1118724 1120189 1066430 1095193 1021296 955487 1058805 1110066 1083680
10027A083680r2401q0002O6612N3075J7891K0669N9529J8157M6688J70257O6474
$$ 1083680 991279 911277 977889 1030964 1048855 1069524 1129053 1147210 1193898 1364155 1430629
10016A430629j45838k0984K1788j26695r1400O3653L8259p6257J4088p7845j32839
$$ 1430629 1284791 1263807 1285595 1158900 1067500 1131153 1169412 1093155 1107243 1029398 896559
10005H96559M1794n1186p7333j09166o9476k9484m6564Q7117Q2012P0157K5496
$$ 896559 938353 887167 809834 700668 631192 601708 555144 642261 724273 794430 819926
9994H19926j04010n4675n1959j15340m2451O3033P6756j9879m9426p1089n8756
$$ 819926 715916 661241 609282 493942 451491 514524 591280 571401 521975 450886 392130
9983C92130K580M2305P3637N3380p0693q9409O3275l7610K4439j4652O0035O0277
$$ 392130 394710 437015 510652 564032 493339 403930 467205 429595 454034 439382 499417 559694
9971E59694p9534j13158j24489j3445L0708j12551n2582Q7431Q6270J72518l0051
$$ 559694 480160 367002 242513 229068 259776 147225 94643 182074 268344 440862 410811
9960D10811n9744q5083r5003L1977J1986k3198j13870J564J17700J49407J2690
$$ 410811 351067 265984 170981 202958 214944 191746 77876 79440 197140 346547 359237
9949C59237q6843r1405J0255q8612m7590o7709l6422O2909J21264O3238m5055
$$ 359237 272394 180989 191244 102632 55042 -12667 -49089 13820 135084 198322 153267
9938A53267R3073q3867j39655n6772O4184J21123j5153r2677l4757J22665n0632
$$ 153267 246340 162473 22818 -33954 30230 151353 136200 43523 8766 131431 80799
9927H0799r3520L636M514j30243r1132J57586O0210q4519n493l1089L6097l1648
$$ 80799 -12721 -9085 -4571 -134814 -225946 -68360 -8150 -92669 -98162 -129251 -93154 -124802
9915a24802R7402L4106M2616N5469K2218o958n2991J4217r914M1958n5356j8298
$$ -124802 -27400 6706 49322 104791 127009 120051 67060 81277 71363 113321 57965 39667
9903C9667Q2425k5995k7898L9469K5931N0263R567J25540n4493q8588K3983N9071
$$ 39667 122092 96097 68199 107668 133599 183862 193429 318969 264476 175888 199871 258942
9891B58942n8096q1574P9877R1737J6304m666j3728q7673r0931P3661J5101j22024
$$ 258942 200846 119272 199149 290886 307190 302524 288796 201123 110192 183853 198954 76930
9879G6930k1116J0905o8314P7192J51118Q6148n5940o0442r0036n8430j08274
$$ 76930 55814 66719 -1595 75597 226715 312863 256923 196481 106445 48015 -60259
9868f0259k7873K3327J426q026K2345m9034m0726P8660O9321l9877J37153r01
$$ -60259 -88132 -64805 -63379 -71405 -49060 -98094 -138820 -60160 9161 -30716 106437 105536
9856A05536r5397m2316Q0540J09310j08526q2050J4513J3660N2969O9343q6816
$$ 105536 10139 -32177 48363 157673 49147 -32903 -18390 -4730 48239 117582 30766
9845C0766p3412P0901Q0116L0683k7028o9522m2358L7342M35j32584J5913J04941
$$ 30766 -42646 28255 108371 139054 112026 42504 146 37488 37923 -94661 -78748 26193
9833B6193l3723k109O8344l8215N0715K0575q8231j59842q1733J03334m307K8523
$$ 26193 -7530 -9639 58705 20490 71205 91780 3549 -156293 -238026 -134692 -138999 -110476
9821a10476O6400J2296l3821L4089K4461M1768n787r658N7908m5732n5631O1063
$$ -110476 -44076 -31780 -65601 -31512 -7051 34717 28930 19272 77180 31448 -24183 36880
9809C6880o0508k3279J0754L4231m9325p5469Q614Q0753m5195Q3776K2771N598
$$ 36880 -23628 -46907 -36153 -1922 -51247 -126716 -118102 -37349 -82544 1232 24003 29601
9797B9601J0372N9849l4186J29511m7328l0445J29659m7336k3773l9595p3255
$$ 29601 39973 99822 65636 195147 147819 117374 247033 199697 175924 136329 63074
9786F3074J99J58678O0555j36799p5047N4694N6249J6285n4694m4195j03548j58073
$$ 63074 63273 221951 282506 145707 70660 125354 181603 197888 143194 98999 -4549 -162622
9774a62622J53301Q6472K697p0776K783Q4424o2689n779j19506J22178J38409
$$ -162622 -9321 77151 79848 9072 11855 96279 33590 27811 -91695 30483 168892
9763A68892n6412o4078j69252o42K1151l045K8301L9396O9941L4293p6371r4590
$$ 168892 112480 48402 -120850 -121492 -100341 -103386 -75085 -35689 34252 68545 -7826 -102416
9751a02416P03J15136O3123M3521N06p1494n0888J6990L4134L7837J7387L174
$$ -102416 -101713 13423 76546 120067 120573 49079 -1809 15181 49315 87152 104539 107713
9739A07713o9162L4190N838r6431q9043M4851J46341R6946P2458j01992j04119
$$ 107713 38551 72741 78579 -17852 -106895 -62044 84297 181243 253701 151709 47590
9728D7590k03401p0642J39447Q1139p4251Q5637Q760m2590J0782k1477j3656L1723
$$ 47590 -155811 -226453 -87006 -5867 -80118 5519 14279 -28311 -17529 -39006 -52662 -20939
9716b0939l7676k6705k9890P6327J3032L4238M6863J1165j32798j7069J49867
$$ -20939 -58615 -85320 -115210 -38883 -25851 8387 55250 66415 -66383 -83452 66415
9705F6415l6212m8318L1110r373Q061K9060M746l1869o0526O3265o0797Q6156
$$ 66415 30203 -18115 12995 3622 11683 40743 45489 13620 -46906 16359 -44438 41718
9693D1718N7226o7157k6954q3628Q4138Q9253j0900j9578r0094j5957o7973o5829
$$ 41718 98944 31787 4833 -78795 5343 94596 83696 64118 -25976 -41933 -109906 -175735
9681a75735O1366O1394N789N8470J8129o9099M5474J0360n0162P189O9532L1392
$$ -175735 -114369 -52975 -47186 11284 29413 -39686 5788 16148 -34014 -26825 42707 74099
9669G4099M8271J18380o3461n7747R294j0790n6498k6946p990J5725J9474p5556
$$ 74099 122370 240750 177289 119542 128836 118046 61548 34602 26612 42337 61811 -13745
9657a3745j9974J00370k0243O127K2713M439m1882m1933n7409J33078N5040L2389
$$ -13745 -33719 66651 46408 52535 75248 79687 37805 -4128 -61537 71541 126581 158970
9645A58970j21673j71399P5627J29294M118K3313j3244j11692K8905M060O9836
$$ 158970 37297 -134102 -58475 70819 74937 98250 85006 -26686 2219 6279 76115
9634G6115O0998Q3405l948o1336j52653J45051M8375J0197K8807n9175k8027J05691
$$ 76115 137113 220518 216570 155234 2581 147632 196007 206204 235011 175836 147809 253500
9622B53500P71r2097j86674k1329N6042N8235Q6588Q3786p8237j31885m1486O5114
$$ 253500 254271 162174 -24500 -45829 10213 68448 155036 238822 160585 28700 -12786 52328
9610E2328j03726k8403J95779l2752m9799p2171Q7106J05931J73677j0694j53345
$$ 52328 -51398 -79801 115978 83226 33427 -38744 48362 154293 327970 317276 163931
9599A63931N6550m6673j87164m3972J11098K41813J48401k0255j63851j02334
$$ 163931 220481 173808 -13356 -57328 53770 295583 443984 423729 259878 157544
9589A57544L5350n9917j16243O5282n6580J4157J7470J9116P5828L3371n2401
$$ 157544 192894 132977 16734 82016 25436 39593 57063 76179 152007 185378 132977
9578A32977j11331j23950k371K671m0688l3807O3972J5676J03200k3346j68614
$$ 132977 21646 -102304 -104675 -102004 -142692 -176499 -112527 -96851 6349 -16997 -185611
9567a85611j5606O3749R4663M298K5274n488J5363l7151p3106J08405O3664J12195
$$ -185611 -201217 -137468 -42805 -38507 -13233 -18721 -3358 -40509 -113615 -5210 58454 170649
9555A70649J25225n9304l2743O8550P502r0346l1907o640M0521Q3105J19292R663
$$ 170649 295874 236570 203827 272377 279879 189533 157626 150986 191507 274612 393904 403567
9543D03567j28568k4134R9788K984l9391m4539n9266m9910N2845R794n0319r3927
$$ 403567 274999 250865 350653 353637 314246 269707 210441 160531 213376 223170 172851 78924
9531G8924m3962M0637o325n2554J0095Q7851j4073j6810l3227M4651j510j01682
$$ 78924 34962 75599 69274 16720 26815 114666 100593 83783 50556 95207 93697 -7985
9519g985L0029K5547o7074M7122Q6704j6420M3089L821p4569M9639Q1467p2976
$$ -7985 22044 47591 -19483 27639 114343 97923 141012 144833 70264 119903 201370 128394
9507A28394N0243N0504J07997o8278p9462o6283K3706J5311r927N5914J6785L1525
$$ 128394 178637 229141 337138 268860 189398 123115 146821 162132 152205 208119 224904 256429
9495B56429N2946J12061m9649M700r8197j08850n6855l6208l8950N7893Q5985
$$ 256429 309375 421436 371787 376487 278290 169440 112585 76377 37427 95320 181305
9484A81305K847o9970P0854J02799M4658o4807n5295o4045J4466m6052J71115
$$ 181305 184152 114182 185036 287835 332493 267686 212391 148346 162812 116760 287875
9473B87875J44468n7625j50755K6032J16296l2686r0618k1504M5730N9488j3051
$$ 287875 432343 374718 223963 249995 366291 333605 242987 221483 267213 326701 313650
9462C13650r634L0283O075n4292j41138P2886J28357o768J6417O6434l3359o3576
$$ 313650 304016 334299 340374 286082 144944 217830 346187 339419 355836 422270 388911 325335
9450C25335j25337R5516J17223j011l8306J18575O3834m6129q268J8244r86q3146
$$ 325335 199998 295514 412737 411726 373420 491995 555829 509700 501432 519676 518690 435544
9438D35544k2330N0487j1236j86971k4813P1691N4878K2584J6050k2316J6930
$$ 435544 413214 463701 452465 265494 240681 312372 367250 389834 405884 383568 400498
9427D00498Q4816l2719r9998j42988q5295M0481J39431J94950J09969K816j3292
$$ 400498 485314 452595 352597 209609 124314 164795 304226 499176 609145 611961 598669
9416E98669m3311n5952p9644Q9795J41256r433j04635q6107K805K0182N988q463
$$ 598669 555358 499406 419762 509557 650813 641380 536745 450638 453443 473625 479613 471150
9404D71150p926Q1857P9468L9525P4127M6406P3737m9619P322Q9620q9904j12788
$$ 471150 463224 545081 624549 664074 738201 784607 858344 808725 816047 905667 815763 702975
9392G02975M2710l5661p9298L9991L702O5515O1488P3089J00648K2386n5596L8026
$$ 702975 745685 710024 630726 670717 674419 739934 801422 874511 975159 997545 941949 979975
9380I79975j44852n5445m4567J13440J19232J9090N8085j56195R6664K04940M236
$$ 979975 835123 779678 735111 848551 967783 986873 1044958 888763 985427 1190367 1194603
9369A194603r1633J31548R0762n2839p2129L1411N5383J49181k6928l8108N4843
$$ 1194603 1102970 1234518 1325280 1272441 1200312 1231723 1287106 1436287 1409359 1371251 1426094
9358A426094P0130j2515O3251j26874r1931j0489R1705R0543J10183Q2116k6031
$$ 1426094 1496224 1483709 1546960 1420086 1328155 1317666 1409371 1499914 1610097 1692213 1666182
9347A666182R9621J72742J6543P8528M7353p385P5715R2587P0120K6153P8391
$$ 1666182 1765803 1938545 1955088 2033616 2080969 2073584 2149299 2241886 2312006 2338159 2416550
9336B416550Q0977N4504Q1995N3140O2552q0983K7237J54131K07936J78962R7654
$$ 2416550 2497527 2552031 2634026 2687166 2749718 2668735 2695972 2850103 3058039 3237001 3334655
9325C334655J27442P8484N7583P1639K7159J09141R8328K05152J96054J85852
$$ 3334655 3462097 3540581 3598164 3669803 3696962 3806103 3904431 4109583 4305637 4491489
9315D491489J40428J64908K12143J75930J04396J81223N3569J58166L23397K16964
$$ 4491489 4631917 4796825 5008968 5184898 5289294 5470517 5524086 5682252 6005649 6222613
9305F222613K53078L22432L69718K59940K37719K14485K53025L38858J31659K87125
$$ 6222613 6475691 6798123 7167841 7427781 7665500 7879985 8133010 8471868 8603527 8890652
9295H890652K56738K65175M03118K71533M23884M05556L73741L19101K54310K76512
$$ 8890652 9147390 9412565 9815683 10087216 10511100 10916656 11290397 11609498 11863808 12140320
9285A2140320J29711K47464K06404P7911J14478J97102J40522Q9141P078o703
$$ 12140320 12270031 12517495 12723899 12801810 12916288 13113390 13253912 13343053 13350131 13343428
9275A3343428P6275j69661j58762j42753j23752l15895k62871q7978j77396j81666
$$ 13343428 13419703 13250042 13091280 12948527 12824775 12508880 12246009 12158031 11980635 11798969
9265A1798969k60916j63926l29677l19691k22761k89604l44622l58571k20438
$$ 11798969 11538053 11374127 11044450 10724759 10501998 10212394 9867772 9509201 9288763
9256I288763l31306j99525q0424k68942m11933m19814k78274j07144j83367j38161
$$ 9288763 8957457 8757932 8677508 8408566 7996633 7576819 7298545 7191401 7008034 6869873
9246F869873p8432k77834l05186k67721j78921k26088j93590j29730n6610J4349
$$ 6869873 6791441 6513607 6208421 5940700 5761779 5535691 5342101 5212371 5155761 5170110
9236E170110j58813k19385j75030q6020k52549j16872j03102j25190n9903j05192
$$ 5170110 5011297 4791912 4616882 4530862 4278313 4161441 4058339 3933149 3873246 3768054
9226C768054r7587j29382r5826r1454j29450q2423j08548j64125p2004N7408M5577
$$ 3768054 3670467 3541085 3445259 3353805 3224355 3141932 3033384 2869259 2797255 2854663 2900240
9215B900240j59145j30383j1591o0470j63853q2459O7593m8617j06839j26658
$$ 2900240 2741095 2610712 2599121 2538651 2374798 2292339 2359932 2311315 2204476 2077818
9205B077818m3081j05739l5824m6791j47079j5620J01551O3959p2750k25220j31528
$$ 2077818 2034737 1928998 1893174 1846383 1699304 1683684 1785235 1849194 1776444 1551224 1419696
9194A419696J8194q7550P0055J17880J1436k0659N1139N0056j68365j51045n3731
$$ 1419696 1437890 1350340 1420395 1538275 1549711 1529052 1580191 1630247 1461882 1310837 1257106
9183A257106r2404j02734K0613P7948j5143r4952r2107J1219N0271L532m2891
$$ 1257106 1164702 1061968 1082581 1160529 1145386 1050434 958327 969546 1019817 1023349 980458
9172I80458O9384k0720j34418N4253P1350n1654j38606k9319L6668k2087L8868
$$ 980458 1049842 1029122 894704 948957 1020307 968653 830047 800728 837396 815309 854177
9161H54177P2038m5418l2095k4700m4040L9018P2660k207q4165j74964o2362L1645
$$ 854177 926215 880797 848702 824002 779962 818980 891640 889433 805268 630304 567942 599587
9149E99587J72834J04025j13103j18515j4063J12881R6151K0686l1449n2428l3844
$$ 599587 772421 876446 763343 644828 630765 743646 839797 860483 829034 776606 742762
9138G42762Q0553k7085o0567R7755k7276j02423q9520J8292J42803j592j98294
$$ 742762 823315 796230 735663 833418 806142 703719 614199 632491 775294 773702 575408
9127E75408j15380l2539L2952n8975Q643N2248p6770n1928p193n3270l0567l0663
$$ 575408 460028 427489 460441 401466 410109 462357 385587 333659 326466 273196 242629 211966
9115B11966k9264Q8727R6059p8924n5411J00275j2656K0192o9463r9000p2612
$$ 211966 182702 271429 367488 288564 233153 333428 320772 340964 271501 172501 99889
9104I9889J10017J63680o558L2361J6746m7531o3540N1809n09K1217j8699O1611
$$ 99889 209906 373586 367028 399389 416135 368604 305064 356873 356364 377581 358882 420493
9092D20493P5871N3162P5002N0223m8242K7566o3139j16914M4335l5590J3521
$$ 420493 496364 549526 624528 674751 626509 654075 590936 474022 518357 482767 496288
9081D96288P001k6807L629J06105o6977N360l0249n898o7505Q3783J64624K9195
$$ 496288 503289 476482 480111 586216 519239 524599 494350 488452 420947 504730 669354 698549
9069F98549J3627m7141J770j9614j01435K7081P3309k4720l8918J588r2543o5613
$$ 698549 712176 665035 666805 647191 545756 572837 646146 621426 582508 584096 491553 425940
9057D25940J0156r8607j14531J5694J12572N7198j1011l6347j30174P5024P6114
$$ 425940 436096 337489 222958 238652 351224 408422 397411 361064 230890 305914 382028
9046C82028J04689L9495j49801J9014M4414J3693k5491m450m236p0527o8069k2132
$$ 382028 486717 526212 376411 395425 439839 453532 428041 423591 419355 348828 280759 258627
9034B58627l6085n0501N121m8053L5339Q6239l8052n4499N6357r6881j30470j491
$$ 258627 222542 172041 177162 129109 164448 250687 212635 158136 214493 117612 -12858 -14349
9022a4349R9748K9179K6093k7886o3215R0003J59780Q1391K2203M5392q5888k6938
$$ -14349 85399 114578 140671 112785 49570 139573 299353 380744 402947 448339 362451 335513
9010C35513j2667l7416M276o5618m0559O6130j8084J30460J10101K0035K0270
$$ 335513 322846 285430 289706 224088 183529 249659 231575 362035 472136 492171 512441
8999E12441M3194l3654p5248J4935l3682J7548J11935O1684q453p8761j198p887
$$ 512441 555635 521981 446733 461668 427986 445534 557469 619153 610700 531939 530741 522854
8987E22854J2617k1192M8154J8182j35895j92029r8002r2618o8577N9368J98327
$$ 522854 535471 514279 562433 580615 444720 252691 154689 62071 -6506 52862 251189
8976B51189P1359r4580l026j23385k8322p937K0644j3775L9019p395J0397P2700
$$ 251189 322548 227968 224942 101557 73235 65298 85942 72167 111186 103791 114188 186888
8964A86888k5283j9529q1267L8460L8601m4976j1347k0963r281J13119K2501j2845
$$ 186888 161605 142076 60809 99269 137870 92894 81547 60584 51303 164422 186923 174078
8952A74078J4119L3907J22358O387q8013r1448j46123q138J23809m8967O8506
$$ 174078 188197 222104 344462 350849 262836 171388 25265 17127 140936 91969 160475
8941A60475R8531K0894J0513k1068O1633n5805J5762m0790j6592j9697L42q350
$$ 160475 259006 279900 290413 269345 330978 275173 290935 250145 233553 213856 214198 205848
8929B05848K862P6046p475l524o9218j60253m0847L1712J32991L0549J1003P954
$$ 205848 208710 284756 277281 273757 204539 44286 3439 35151 168142 198691 209694 217648
8917B17648P5734J76737P8175p2427p6819o8765l7832n8980L211L0269j393m9290
$$ 217648 293382 470119 548294 475867 399048 330283 292451 233471 236682 266951 265558 216268
8905B16268r5247j33431r4317J25202Q5220J67164K848r3615k3294O3674q0813
$$ 216268 121021 -12410 -106727 18475 103695 270859 273707 180092 156798 220472 139659
8894A39659o4467j8781j23737n4186J90536R2943p8376k8751M1562N3557k9415
$$ 139659 75192 56411 -67326 -121512 69024 161967 83591 54840 96402 149959 120544
8883A20544q5197M5521O2114o2759N4838J33134J4673j9542P5673q1649J51573
$$ 120544 35347 80868 142982 80223 135061 268195 282868 263326 338999 257350 408923
8872D08923J67108Q171j45561k2191N2581o0416R9959k6609L162j4612r3246q2876
$$ 408923 576031 584202 438641 416450 469031 408615 508574 481965 485127 470515 377269 294393
8860B94393q9549q1488P1923P810n4307L3522J18884n2804k6635K2432P75j14220
$$ 294393 204844 123356 195279 203089 148782 182304 301188 248384 221749 244181 244956 130736
8848A30736j2001N6444n792m1564p3561m6628o3223J5925Q9407N4074L3565k6427
$$ 130736 118735 175179 169387 127823 54262 7634 -55589 -39664 49743 103817 137382 110955
8836A10955L0663L4000j47653P2524q631L0630J852o7448l0848j05753j75445
$$ 110955 141618 175618 27965 100489 91858 122488 124340 56892 26044 -79709 -255154
8825b55154P0127Q7363j10198j1144Q9272K0836K8646M270J39095R0469K1968
$$ -255154 -185027 -97664 -207862 -219006 -129734 -108898 -80252 -75982 63113 153582 175550
8814A75550q9898j32285o1767q360p3653L1206q7561o2436J83455J36582J13183
$$ 175550 85652 -46633 -108400 -116760 -190413 -159207 -246768 -309204 -125749 10833 124016
8803A24016l2731j44822l3710o0986N5163R8175o3917o029J3217k6192P4292j268
$$ 124016 91285 -53537 -87247 -148233 -93070 5105 -58812 -64841 -51624 -77816 -3524 -4792
8791d792J33496J25285q4082j51551N3455J3883j17524k4744K1440j0520p565
$$ -4792 128704 253989 169907 18356 71811 85694 -31830 -56574 -35134 -45654 -53219
8780e3219R0965O6064M5009j0860O0907q29j06925j51614j6065m8484K1490N1651
$$ -53219 37746 103810 148819 137959 198866 198037 91112 -60502 -76567 -125051 -103561 -51910
8768e1910P6057J2308K713q4323k8503K8822m1638M0705k5615J3073M864P0993
$$ -51910 24147 36455 39168 -45155 -73658 -44836 -86474 -45769 -71384 -58311 -53447 17546
8756A7546o180k2621p8240j10821M2409J76306Q117K9936N6198j3314K1019l8432
$$ 17546 11366 -11255 -89495 -200316 -157907 18399 26516 56452 112650 99336 120355 81923
8744H1923L2725J10904M0904p1906L1566R7756k4187m9197K1632j17468j03479
$$ 81923 114648 225552 266456 194550 226116 323872 299685 250488 272120 154652 51173
8733E1173m2140l6828J06023J938p6825o6747J4201J10338L7646m7835J629P8920
$$ 51173 9033 -27795 78228 80166 3341 -63406 -49205 61133 98779 50944 52573 131493
8721A31493L7204m0441k4536j7042M2390J07752j53208j17954k3937l913J0058
$$ 131493 168697 128256 103720 86678 129068 236820 83612 -34342 -58279 -62192 -52134
8710e2134J57813J8077P268N8510J06268r7670j5307K5363k1486r8769J35901
$$ -52134 105679 123756 131024 189534 295802 198132 182825 208188 186702 87933 223834
8699B23834Q2278l2678q8990j09328l4435P7103j0049m746M1139j15842J30500
$$ 223834 306112 273434 184444 75116 40681 117784 107735 102989 144128 28286 158786
8688A58786Q8923n8427j12757m7226J15118J9066m965L7416O7453n2680Q687l6030
$$ 158786 247709 189282 76525 29299 144417 163483 158518 195934 263387 210707 219394 183364
8676A83364P9752P8257j16555L0958O6594j4234j68721j22771Q8371L1342K5642
$$ 183364 263116 341373 224818 255776 322370 308136 139415 16644 105015 136357 161999
8665A61999l7695J5642j2292J12777Q0522m8503j12447n5643R3494J15693J78345
$$ 161999 124304 139946 127654 240431 320953 272450 160003 104360 197854 313547 491892
8654D91892k1195n838k0163O9379j7146p6690O2520m1400p1202l2113p3848l4497
$$ 491892 470697 464859 444696 514075 496929 420239 482759 441359 370157 338044 264196 229699
8642B29699O0274L2352L3531k3976P9096O8647J4910j136j9729l5978k8899o0882
$$ 229699 289973 322325 355856 331880 410976 479623 494533 493397 473668 437690 408791 347909
8630C47909J01492N7604j5753L6047N3250j00133N3923J62233J99394k7220r9904
$$ 347909 449401 507005 491252 527299 580549 480416 534339 696572 895966 868746 768842
8619G68842j12780j458M5217J73512P696q0946J9601j9330l2435J1681l613M6390
$$ 768842 656062 654604 699821 873333 881029 800083 819684 800354 767919 779600 775987 822377
8607H22377m74J3940N5175j6259J02581J5583J777J80544J26763r109n0151m9729
$$ 822377 821903 835843 891018 874759 977340 992923 994700 1175244 1302007 1292898 1242747 1193018
8595A193018m8637k3529n422N8066J9390N703J06899K1768k422O424n6942j00880
$$ 1193018 1144381 1120852 1115430 1173496 1192886 1198589 1305488 1327256 1324834 1331258 1274316 1173436
8583A173436K3910J14683L5928j92354j63308o6446k1591j19128J916J68597J1413
$$ 1173436 1197346 1312029 1347957 1155603 992295 925849 904258 785130 787046 955643 967056
8572I67056l0612n449J23925K33383J26537J46541Q3859M1423L0497Q0475K27220
$$ 967056 936444 930995 1054920 1288303 1414840 1561381 1645240 1686663 1717160 1797635 2024855
8561B024855K93781L67114K61572J83271L6041J30496m469k0587j48800k34197
$$ 2024855 2318636 2685750 2947322 3130593 3166634 3297130 3292661 3272074 3123274 2889077
8551B889077j95527k52534k10318k40391j93525j20287l1377n3279Q2600m2616
$$ 2889077 2693550 2441016 2230698 1990307 1796782 1676495 1645118 1591839 1674439 1631823
8541A631823r9886n3734n8048M5326O1081K9323m6297j66901p8791M9624K2027
$$ 1631823 1531937 1478203 1420155 1465481 1526562 1555885 1509588 1342687 1263896 1313520 1335547
8530A335547J58880Q7980K5195J532k2676Q4885J88136K98120K61732K04813L01059
$$ 1335547 1494427 1582407 1607602 1609134 1586458 1671343 1859479 2157599 2419331 2624144 2925203
8519B925203Q5984J07524N3664q8046j02199j05962j45752k10810k46871l35980
$$ 2925203 3011187 3118711 3172375 3084329 2982130 2876168 2730416 2519606 2272735 1936755
8509A936755k29835j63772j91970p0587p1130j37562j32717K1405k260q390n2297
$$ 1936755 1706920 1543148 1351178 1280591 1209461 1071899 939182 960587 958327 949937 897640
8498H97640Q1887n0296j03727o9328k227l9155m8046j13901j27741m7098m3260
$$ 897640 979527 929231 825504 756176 753949 714794 666748 552847 425106 378008 334748
8487C34748k4365J01645l644m1087m3120k8261k5073M6887j0126r1572q9942o395
$$ 334748 310383 412028 408384 367297 324177 295916 270843 317730 307604 216032 126090 119695
8475A19695k8521j3401R7655j6779K5003J47176p9747q5821L4180J07491p3598
$$ 119695 91174 77773 175428 158649 183652 330828 251081 165260 199440 306931 233333
8464B33333m5367J3953p447o7123l7724l0236o0922k2235o2355j18697L4144K8491
$$ 233333 187966 201919 194472 127349 89625 59389 -1533 -23768 -86123 -204820 -170676 -142185
8452a42185Q7161L9344n3683J29483M9334n4992R4037J156N2091J8053m7260Q906
$$ -142185 -55024 -15680 -69363 60120 109454 54462 148499 149655 201746 219799 172539 181445
8440A81445K5261m370j4171o8890P5671J4222p6494p6487j958P2738j3130J7288
$$ 181445 206706 202336 188165 119275 194946 209168 132674 56187 54229 126967 113837 131125
8428A31125k4156j00645p4325J20650N6843N3486J05573K8467o3328q2335j02109
$$ 131125 106969 6324 -68001 52649 109492 162978 268551 297018 233690 151355 49246
8417D9246N7624J09769j4731m6905j8447K2851m8412M8791M2413j2592p0293j58911
$$ 49246 106870 216639 201908 155003 136556 159407 110995 159786 202199 189607 119314 -39597
8405c9597m6782N7187k4591L5932J04132J91623n218r7511k8349O1649J15279
$$ -39597 -86379 -29192 -53783 -17851 86281 277904 272686 175175 146826 208475 323754
8394C23754J6643l7598l3103p5150o0000k5043k1344k7009l658J45473n382j33039
$$ 323754 340397 302799 269696 194546 134546 109503 88159 61150 57492 202965 197583 64544
8382F4544O4640q8901o5581P4646J80142m0116n06n5120p0043r0974N3993j9571
$$ 64544 129184 40283 -25298 49348 229490 189374 188868 133748 63705 -27269 26724 7153
8370G153j73841l9379P7810N266J20155J23793j3504p5459M1472L5491m0018N5484
$$ 7153 -166688 -206067 -128257 -122991 -2836 120957 107453 31994 73466 108957 68939 124423
8358A24423m9313k2604q6307J8810L8521l2167J9147M610k7303M7845J6376N778
$$ 124423 75110 52506 -33801 -14991 23530 -8637 10510 15120 -12183 35662 52038 57816
8346E7816k4868j6047l5085K3575J9159r8754M0394J05241r5942k5232M2022O1409
$$ 57816 32948 16901 -18184 5391 24550 -74204 -33810 71431 -24511 -49743 -7721 53688
8334E3688j8151K4044l2419L0017n110O0208n9739P6787q645q8004k8919M9861
$$ 53688 35537 59581 27162 57179 52069 112277 52538 129325 120680 32676 3757 53618
8322E3618K0213q103L1509q996n2760J6883q7045o5313M4902J03584J47086L966
$$ 53618 73831 65728 97237 88241 35481 52364 -34681 -99994 -55092 48492 195578 199544
8310A99544n5226n43k9753j80103q5828m2149J11516J33329n4678j72502L6321
$$ 199544 144318 143775 114022 -66081 -151909 -194058 -82542 50787 -3891 -176393 -140072
8299a40072J45061L9681K1570J17094l8053l0360n0464n1709j34765R4004o0906
$$ -140072 4989 44670 66240 183334 145281 114921 64457 12748 -122017 -28013 -88919
8288h8919m4994l377J40365L6057j9168o6435K8184J34071K5264l203n6590p7966
$$ -88919 -133913 -137290 3075 39132 19964 -46471 -18287 115784 141048 137845 81255 3289
8276C289q3583j06208J39383K54510L2089j1596m2398q0851r4024l3426j04639
$$ 3289 -80294 -186502 -47119 207391 239480 227884 185486 104635 10611 -22815 -127454
8265a27454K9563Q7408M8223Q2980o3801O2661N0534n3185l2213r2235R7629P3459
$$ -127454 -97891 -10483 37740 120720 56919 119580 170114 116929 84716 -7519 90110 163569
8253A63569N2730M2218q1260q5551L8954M1413L1015m924p5989j12170q6560j11538
$$ 163569 216299 258517 177257 91706 130660 172073 203088 198164 122175 10005 -76555 -188093
8241a88093J58498J8986m6244r9880j8129J1084L1891J10888j4208j17889J05670
$$ -188093 -29595 -10609 -56853 -156733 -174862 -163778 -131887 -20999 -35207 -153096 -47426
8230d7426K7448J1622L0207k9748k509K3159p1292p184m5887m549J28884J3272
$$ -47426 -19978 -8356 21851 -7897 -10406 12753 -58539 -65723 -111610 -116159 12725 25997
8218B5997l4393n2865J6020q853Q3639J05714J0464o5055K2732J19857o814j23083
$$ 25997 -8396 -61261 -45241 -54094 29545 135259 145723 80668 103400 223257 216443 93360
8206I3360j34868j33658j4449N2559j1960N9579R4534K9232j77735O4965J15587
$$ 93360 -41508 -175166 -189615 -137056 -149016 -89437 5097 34329 -143406 -78441 37146
8195C7146M2904j240j24404j7043M7654j2844o4084J31414Q5501k3514j18172
$$ 37146 80050 78810 -45594 -62637 -14983 -27827 -91911 39503 125004 101490 -16682
8184a6682m2426K5826n2660o9539P9785k5087j19909o6509m635L459j5420O2029
$$ -16682 -59108 -33282 -85942 -155481 -75696 -100783 -220692 -287201 -291836 -288377 -303797 -241768
8172b41768J12737P8048O2089P8562J4597q6079p5133o0572J45984O6163K1366
$$ -241768 -129031 -50983 11106 89668 104265 18186 -56947 -117519 28465 94628 115994
8161A15994L0314O7237M2153m0595n2389o5930j00568j79165j10358M3451J31524
$$ 115994 146308 213545 255698 215103 162714 96784 -3784 -182949 -293307 -249856 -118332
8150a18332J37694n0648j07141P6288N2279j6412J0530q0692n5100R8502P6969
$$ -118332 19362 -31286 -138427 -62139 -9860 -26272 -15742 -96434 -151534 -53032 23937
8139B3937M388k477r7488l4984K183p3364j9052k5907J642k1015N2381J71050
$$ 23937 28325 25848 -71640 -106624 -104441 -177805 -196857 -222764 -221122 -242137 -189756 -18706
8127a8706k0179o1410J8722j3948j2338J2499Q383P7532K8814P0691j2225j17796
$$ -18706 -38885 -100295 -81573 -95521 -107859 -95360 -86977 -9445 19369 90060 77835 -39961
8115c9961N8973q136l0893o3627j6656Q9801o1462m7118J9108L6732K3325k2288
$$ -39961 19012 10876 -20017 -83644 -100300 -10499 -71961 -119079 -99971 -63239 -39914 -62202
8103f2202J23058J24472r0857j14516J12139Q9303J2064j9122j39292j269J28967
$$ -62202 60856 185328 94471 -20045 92094 181397 193461 174339 35047 33778 162745
8092A62745R6384o0735o9463j50612q9563M4799J08691j20069m7291M8320o0065
$$ 162745 259129 198394 128931 -21681 -111244 -66445 42246 -77823 -125114 -76794 -136859
8081a36859Q9003M1675J58908j7449n7433j3809J9767O3628K495j10256M6678
$$ -136859 -47856 -6181 152727 135278 77845 64036 83803 147431 149926 39670 86348
8070H6348r2630P3153M5128Q35J22125o0659k0894J58511k2853m9411p8355o3474
$$ 86348 -6282 66871 111999 112834 234959 174300 153406 311917 289064 239653 161298 97824
8058I7824l6263K1648L8175m7640p5631m0539m182R4735J17849M6022L7502J719
$$ 97824 61561 83209 121384 73744 -1887 -42426 -46608 48127 165976 211998 249500 251219
8046B51219L0848l357j15449L21o5555r790N3960N0126o0127o4832K7694J25251
$$ 251219 282067 278710 163261 163582 98027 88237 142197 192323 132196 67364 95058 220309
8034B20309J14169l0922j49777m7237P8779J22456k160l3832m3667J06130J00278
$$ 220309 334478 303556 153779 106542 185321 307777 305617 271785 228118 334248 434526
8023D34526j7548j25429j1098m7067l7579J23697L0534r2154p8671M8684O3978
$$ 434526 416978 291549 280451 233384 195805 319502 350036 257882 179211 227895 291873
8012B91873J33508J39131J7775K6656J04428J10993q4923j01233j65608r1694
$$ 291873 425381 564512 582287 608943 713371 824364 739441 638208 472600 380906
8002C80906L9990P2889M6988J5436l9660j71725j0079k1673j03162J7793M6021
$$ 380906 420896 493785 540773 556209 516549 344824 334745 313072 209910 227703 273724
7991B73724j1677p1851r9662j0580P0566q4302N4644J30453o0461k1867k6267
$$ 273724 262047 190196 90534 79954 150520 66218 120862 251315 190854 168987 142720
7980A42720K4892P4675r4811n628L8596k8355n7704K24771J62309J01782m0015
$$ 142720 167612 242287 147476 141848 180444 152089 94385 319156 481465 583247 543232
7969E43232m5681P412q3994J0826K9238L2698O9170k9869j33904r5840j25023
$$ 543232 497551 504963 420969 431795 461033 493731 562901 533032 399128 303288 178265
7958A78265R298M4645J43118P7863L6052J84132N6181j58317j88688P648l7023
$$ 178265 187563 232208 375326 453189 489241 673373 729554 571237 382549 390197 353174
7947C53174l7371r2928o6439q6052l5552m7769L3558O6746q2952P9383P9652P4204
$$ 353174 315803 222875 156436 70384 34832 -12937 20621 87367 4415 83798 163450 237654
7935B37654N5431n8355j31897m2532R0549J20764M7327m7545L0015M4087j02770
$$ 237654 293085 234730 102833 60301 150850 271614 318941 271396 301411 345498 242728
7924B42728n3746o8744j18188P9321J4659K0517J4697J403j2665M7712L5926Q347
$$ 242728 188982 120238 2050 81371 96030 116547 131244 132647 119982 167694 203620 211967
7912B11967q0867m3080j2525O0473j7120o5775J1067n6593J43516O7566k2557
$$ 211967 131100 88020 75495 135968 118848 53073 64140 7547 151063 218629 196072
7901A96072l5252O0461J09820P1262r4172k3001j188j25668O2303m4181j03602
$$ 196072 160820 221281 331101 402363 308191 285190 284002 158334 220637 176456 72854
7890G2854o8801l6970J37176P7500o5514k04887o7506j5970m1284Q7698R0841
$$ 72854 4053 -32917 104259 181759 116245 -88642 -156148 -172118 -213402 -125704 -34863
7879c4863J11468p8526N5334N4027o406J6651m6387K6180p6199K3903l4489o5245
$$ -34863 76605 -1921 53413 107440 101034 117685 71298 97478 21279 45182 10693 -54552
7867e4552p2622m4481O1614P2000M4273R6971M2647N1202J4707r4695j01143O1729
$$ -54552 -127174 -171655 -110041 -38041 6232 103203 145850 197052 211759 117064 15921 77650
7855G7650M0545j5556n4182j35541j13199J01746R6414R1683Q561q3464q8206
$$ 77650 118195 102639 48457 -87084 -200283 -98537 -2123 89560 98121 14657 -73549
7844g3549L5705Q2560r9184j1206r7307k6619J31466K9929k9221L9560R3464K9532
$$ -73549 -37844 44716 -54468 -65674 -162981 -189600 -58134 -28205 -57426 -17866 75598 105130
7832A05130m2457r3629k6291J4604q1494O5385r6952m0416J60765j2798K5258
$$ 105130 62673 -30956 -57247 -42643 -124137 -58752 -155704 -196120 -35355 -48153 -22895
7821b2895Q0060P7253j38229j0400m2327P1932P9194r6129j13259J21133O9795
$$ -22895 57165 134418 -3811 -14211 -56538 15394 94588 -1541 -114800 6333 76128
7810G6128j7432j05648m9916p025k4808N35J37033j23031l6379J1635m1044Q6581
$$ 76128 58696 -46952 -96868 -103893 -128701 -128166 8867 -114164 -150543 -138908 -179952 -93371
7798i3371N6768j3580O9156O5613J3018j3400j45697j12458m9189R8798J38944
$$ -93371 -36603 -50183 18973 84586 97604 84204 -61493 -173951 -223140 -124342 14602
7787A4602M6655j22012J1581L1875k511K5278M6664L05o0635n0573K1045J3334
$$ 14602 61257 -60755 -49174 -17299 -19810 5468 52132 52437 -8198 -58771 -37726 -24392
7775b4392j36430l2526Q6063j389o3159Q7531m675j8743N8430L0754J4795Q1847
$$ -24392 -160822 -193348 -107285 -108674 -171833 -84302 -88977 -107720 -49290 -18536 -3741 78106
7763G8106K0554N5033m3842j50168k1706J01663K7396M7119n3186n6975p2956
$$ 78106 98660 153693 109851 -40317 -62023 39640 67036 114155 60969 3994 -68962
7752f8962j14261J31131k4716P942L0504o3659K5872J3587Q941L1215k7402J5
$$ -68962 -183223 -52092 -76808 -68866 -38362 -102021 -76149 -62562 -53621 -22406 -49808 -49793
7740d9793M8671n4538n4552m9571q352N0477M3979p5768J09177R8542p4404j21388
$$ -49793 -1122 -55660 -110212 -159783 -168135 -117658 -73679 -149447 -40270 58272 -16132 -137520
7728a37520j40695J8458M4363j7099p4433N3938J07251J10074q8740j33905P3715
$$ -137520 -278215 -259757 -215394 -232493 -306926 -252988 -145737 -35663 -124403 -258308 -184593
7717a84593J3911n1524Q7682K1534O383l5706L3298O8080j0581n5552J35982M9015
$$ -184593 -170682 -222206 -134524 -112990 -106607 -142313 -109015 -40935 -51516 -107068 28914 77929
7705G7929j33515j48027L5276m3662Q1886N7783J92072M1384p0668P1266N6638
$$ 77929 -55586 -203613 -168337 -211999 -130113 -72330 119742 161126 90458 161724 218362
7694B18362j34266k29839L3969J44579L3786n5941n0178j4744m2646j310j29932
$$ 218362 84096 -145743 -111774 32805 66591 10650 -39528 -54272 -96918 -98228 -228160
7683b28160o2388J47487O5907o4331J4652J7635n018q9201K7978R4975o6465q2273
$$ -228160 -290548 -143061 -77154 -141485 -126833 -109198 -114216 -203417 -175439 -80464 -146929 -229202
7671b29202l4522K453R2470O3153L9027O6784P7784L1780n9329j77608j10902
$$ -229202 -263724 -261271 -168801 -105648 -66621 163 77947 109727 50398 -127210 -238112
7660b38112o1590N2058P9016J07780L1653j20313p021j06659J180J21643L5238
$$ -238112 -299702 -247644 -168628 -60848 -29195 -149508 -156529 -263188 -262008 -140365 -105127
7649a05127k0363M6104L6652l406J00256N8503r6796p3611j3707N2726K7958K4768
$$ -105127 -125490 -79386 -42734 -46140 54116 112619 15823 -57788 -71495 -18769 9189 33957
7637C3957j0775o763m5465K1100Q8108q6988p9824j19806Q1946P6603N8382N6868
$$ 33957 23182 16419 -29046 -7946 80162 -6826 -86650 -206456 -124510 -47907 10475 67343
7625F7343q0448m6483N3724l0655M0267J7388q5698m1236N0919k1212k7892J7323
$$ 67343 -13105 -59588 -5864 -36519 3748 21136 -64562 -105798 -54879 -76091 -103983 -86660
7613h6660K7127R797L5823n7460k3956M4983n2057n9111J3794O421P6795Q523
$$ -86660 -59533 -49736 -13913 -71373 -95329 -50346 -102403 -161514 -147720 -141299 -64504 -55981
7601e5981p6801q8002q9949Q9345P6089O2062K8406J65506n3659o3151o119P907
$$ -55981 -132782 -220784 -310733 -221388 -145299 -83237 -54831 110675 57016 -6135 -12254 -4347
7589d347q6643o1713j35270j5813L9872l0903M7661N2012j7077J9316L8210j06355
$$ -4347 -90990 -152703 -287973 -303786 -263914 -294817 -247156 -195144 -212221 -192905 -154695 -261050
7577b61050o1862M9380R6792k5116n847l263P5528n5233p2663Q7928J55812M8907
$$ -261050 -322912 -273532 -176740 -201856 -207703 -210966 -135438 -190671 -263334 -175406 -19594 29313
7565B9313n8333n0228K5148L8508o6158o4721m058J61270Q4455P9325m2248n7148
$$ 29313 -29020 -79248 -54100 -15592 -81750 -146471 -150529 10741 95196 174521 132273 75125
7553G5125o3619N1742j7620j40252j39821j2164m3248K1480P074J6503Q4992J8747
$$ 75125 11506 63248 45628 -94624 -234445 -246609 -289857 -268377 -261303 -244800 -159808 -141061
7541a41061k9750O7684J19567L6730j11096k02678O213J19813P611O6716p4032
$$ -141061 -170811 -103127 16440 53170 -57926 -260604 -254391 -134578 -126967 -60251 -134283
7530a34283n8693N1374O9056J17851L1995j09383K4726k021L2857O499q9852J00894
$$ -134283 -192976 -141602 -72546 45305 77300 -32083 -7357 -9378 23479 29978 -59874 41020
7518D1020N2227M3461n0770q3000K1021m8708r9482K3187L3596k0389n9224r2219
$$ 41020 93247 136708 85938 2938 23959 -24749 -124231 -101044 -67448 -87837 -147061 -239280
7506b39280O9391J02068Q5516k5753m16J990O256O8737O6807N2118n8144j53907
$$ -239280 -169889 -67821 17695 -8058 -8474 -6484 -228 68509 135316 187434 129290 -24617
7494b4617l3247K9367k6226k6738K0913m1822J1796L4576J7370O2954r2440j28745
$$ -24617 -57864 -28497 -54723 -81461 -60548 -102370 -90574 -55998 -38628 24326 -68114 -196859
7482a96859Q5939K5587O1150j2891j91761r9450J48735J76270J6976L5703L2967
$$ -196859 -110920 -85333 -24183 -37074 -228835 -328285 -179550 -3280 13696 49399 82366
7471H2366j01349M7490J60331m0280N582q1701P638j2386L5615K078J7218l1267
$$ 82366 -18983 28507 188838 148558 154140 72439 80077 67691 103306 105384 122602 91335
7459I1335j25081j10299n7458j7162J4094n4947m7010M8593Q9104k7355j16332
$$ 91335 -33746 -144045 -201503 -218665 -204571 -259518 -306528 -257935 -168831 -196186 -312518
7448c12518k8498k0350j07270J12084J13781n9486J31098J49290O1027m596l1477
$$ -312518 -341016 -361366 -468636 -356552 -242771 -302257 -171159 -21869 39158 34562 3085
7437C085o5919p4678k7660o9024j9901J02884j2903J11552P4364J678J13773l646
$$ 3085 -62834 -137512 -165172 -234196 -254097 -151213 -164116 -52564 21800 23478 137251 133605
7425A33605p5258n9443L9652L1504j08175o3745n7298Q8386j8124k3905P9633
$$ 133605 58347 -1096 38556 70060 -38115 -101860 -159158 -70772 -88896 -112801 -33168
7414c3168O6103L1344o6566p9093Q670k1318n4632K4465l0932N6553J02755N1130
$$ -33168 32935 64279 -2287 -81380 -72710 -94028 -148660 -124195 -155127 -98574 4181 55311
7402E5311p4079q9299M8547L7206n24n6352J1108J4837l6279o2515j4834J70488
$$ 55311 -18768 -108067 -59520 -22314 -22838 -79190 -68082 -53245 -89524 -152039 -166873 3615
7390C615R122m2721J6319q8202p0758K1027J1250k0455Q5278K3469m4479O9501
$$ 3615 12737 -29984 -13665 -101867 -172625 -151598 -140348 -160803 -75525 -52056 -96535 -27034
7378b7034L3645k6916O8599j29737N4686l6526p9861l1999r155R0995p199K2657
$$ -27034 6611 -20305 48294 -81443 -26757 -63283 -143144 -175143 -184298 -93303 -100502 -77845
7366g7845R4188k479n4994P8189k2024r3190k5801J04273p7400k4875K2628N8342
$$ -77845 16343 13864 -41130 37059 15035 -78155 -103956 317 -77083 -101958 -79330 -20988
7354b0988l0968Q1091J40243L4541l454j41780m1860K8237K5841q608r3535J9744
$$ -20988 -51956 29135 169378 203919 200465 58685 16825 45062 70903 62295 -31240 -11496
7342a1496R3504q407l389p9846K7740j5227r4941m2918K7872n4882k2414N0590
$$ -11496 82008 73601 70212 -9634 18106 2879 -92062 -134980 -107108 -161990 -184404 -133814
7330a33814O6383K6835L02j06468j1090O9461O7488j03296M9953N5605J7728K041
$$ -133814 -67431 -40596 -40294 -146762 -157852 -88391 -20903 -124199 -74246 -18641 -913 1128
7318A128K6275L7657j11443o5762K8186k6613j14071q4782j1996m4933Q7275J53181
$$ 1128 27403 65060 -46383 -112145 -83959 -110572 -224643 -309425 -321421 -366354 -279079 -125898
7306a25898P4849J13269M2602k17789r7059J73150k2965l3944l9853j5550L1721
$$ -125898 -51049 62220 104822 -112967 -210026 -36876 -59841 -93785 -133638 -149188 -117467
7295a17467M806R6401o4361n633k1132j11053J8469o4312o9086J7760J68952R5941
$$ -117467 -112661 -16260 -80621 -86254 -107386 -218439 -199970 -264282 -333368 -315608 -146656 -50715
7283e0715K5284j6131R0934r8742j06503j6164J13287J09422L6785J07838q3488
$$ -50715 -25431 -41562 49372 -49370 -155873 -172037 -58750 50672 87457 195295 111807
7272A11807M9302o8556q6140p2372k4756Q4670Q270j39445l1907K17878J36838
$$ 111807 161109 92553 6413 -65959 -90715 -6045 2225 -137220 -169127 48751 185589
7261A85589j58377j44633j0756J01818L436n5354N2984r5097r3791J2022K4726
$$ 185589 27212 -117421 -128177 -26359 -22923 -78277 -25293 -120390 -214181 -202159 -177433
7250a77433j0267p2931j9003Q4277J4718O9727n3577m1419N0691N1713M9280p6462
$$ -177433 -187700 -260631 -279634 -195357 -180639 -110912 -164489 -205908 -155217 -103504 -54224 -130686
7238a30686m3152N303j1096K3206J60648m1619j60795n2575P0518R953K5693j1382
$$ -130686 -173838 -168535 -179631 -156425 4223 -37396 -198191 -250766 -180248 -170295 -144602 -155984
7226a55984J15041l1904M2945J5893o0988k1855O3792P8744j3235j74221j00278
$$ -155984 -40943 -72847 -29902 -14009 -74997 -96852 -33060 45684 32449 -141772 -242050
7215b42050L6627n2078J2445j7596J0429Q06n1633P1683P3018M9097K9868j276
$$ -242050 -205423 -257501 -245056 -262652 -252223 -251417 -303050 -231367 -158349 -109252 -79384 -80660
7203h0660j21169K3063P0257j5231l7034j6888m6490P7501L2418K7817l6470L4249
$$ -80660 -201829 -178766 -108509 -123740 -160774 -177662 -224152 -146651 -114233 -86416 -122886 -88637
7191h8637Q9132l9568p4560m6493k9074J3333L1547p4595j27050K4936R9565m0043
$$ -88637 495 -39073 -113633 -160126 -189200 -175867 -144320 -218915 -345965 -321029 -221464 -261507
7179b61507J25443L2151p3175K680J8374M6238J8349O86M9448P280l9810n7327
$$ -261507 -136064 -103913 -177088 -174408 -156034 -109796 -91447 -90761 -41313 -34033 -73843 -131170
7167a31170m1005J01516n4425r1970o6120J08533J31533O240J5408q0897j31011
$$ -131170 -172175 -70659 -125084 -217054 -283174 -174641 -43108 -36868 -21460 -102357 -233368
7156b33368n6112J54117n349j2013J08781J3076L4579P9946Q393q0814m0715k7239
$$ -233368 -289480 -135363 -140712 -152725 -43944 -30868 3711 83657 92050 11236 -29479 -56718
7144e6718j0065r5595r5416l6296N6978J70433O7427k5176n4406j0483p4404K0718
$$ -56718 -66783 -162378 -257794 -294090 -237112 -66679 748 -24428 -78834 -89317 -163721 -143003
7132a43003m0056O5405R4522j9366j8432P2335N6040L5466k0532q0264J0076l1124
$$ -143003 -183059 -117654 -23132 -42498 -60930 11405 67445 102911 82379 2115 12191 -18933
7120a8933r1790N3649L3983m5750K3934N5582J3209N1366p4132q6945N8007p4129
$$ -18933 -110723 -57074 -23091 -68841 -44907 10675 23884 75250 1118 -85827 -27820 -101949
7108a01949j67185O3182K0935K7675J04555L0226N9377j32564j8067O4295P6392
$$ -101949 -269134 -205952 -185017 -157342 -52787 -22561 36816 -95748 -113815 -49520 26872
7097B6872l8952l9990j363K7363J9407n3215O4860J3965l3426r1518m8175j8242
$$ 26872 -12080 -52070 -53433 -26070 -6663 -59878 4982 18947 -14479 -105997 -154172 -172414
7085a72414P523J03228l3272L9803j7909q8668j0521j563n64J13897R9478j53300
$$ -172414 -164891 -61663 -94935 -55132 -73041 -161709 -172230 -173793 -174357 -60460 39018 -114282
7073a14282q5845Q8257n466M9608O1259O7422m7079j42907p9075N5707P0186l1268
$$ -114282 -200127 -111870 -117336 -67728 -6469 60953 13874 -129033 -208108 -152401 -82215 -113483
7061a13483K6379O6617J37488n3672j43242J4793K0028m3454k4134N4018m5562
$$ -113483 -87104 -20487 117001 63329 -79913 -65120 -45092 -88546 -112680 -58662 -104224
7050a04224j0954r8446m1050Q9406j0404L1903Q3324k8962q3727P3476K8911l0248
$$ -104224 -115178 -213624 -254674 -165268 -175672 -143769 -60445 -89407 -173134 -99658 -70747 -100995
7038a00995L2895O4842P1662K3600j13984J441N9764k2387j246o8977J21372P5215
$$ -100995 -68100 -3258 68404 92004 -21980 -20539 39225 16838 15592 -53385 67987 143202
7026A43202J03808k9308j27385j73936P4528M5420l2772j48267j08930P1848J49143
$$ 143202 247010 217702 90317 -83619 -9091 36329 3557 -144710 -253640 -181792 -32649
7015c2649J75127J24775q0830j11318n2995q26P7462n6723j54274J1744J25137
$$ -32649 142478 267253 186423 75105 22110 21284 98746 42023 -112251 -100507 24630
7004B4630O8026j17186Q9957J5298m4465J4083K9188l3310n4755r6257r0103L1865
$$ 24630 92656 -24530 65427 80725 36260 50343 79531 46221 -8534 -104791 -194894 -163029
6992a63029L1352J20604L5683J21586l5655k5984M7680j56744q3505k2100M1497
$$ -163029 -131677 -11073 24610 146196 110541 84557 132237 -24507 -108012 -130112 -88615
6981h8615j73919m5483p9938r57J60935J74710P0352K6243o180M0387l7130j19435
$$ -88615 -262534 -308017 -387955 -388912 -227977 -53267 17085 43328 37148 77535 40405 -79030
6969g9030n8718l101m0950j33352j0977J19605J22347N6867n0776o6522J647R5812
$$ -79030 -137748 -140849 -181799 -315151 -326128 -206523 -84176 -27309 -78085 -144607 -142960 -47148
6957d7148o809j4313j5507j2314J08718K8093N3305K126l4245o0006Q367J947
$$ -47148 -53957 -68270 -83777 -96091 12627 40720 94025 96151 61906 1900 10267 12214
6945A2214k5153n0228l271J5286P1459P4713J8080m1144j41251l3668m28K9795
$$ 12214 -12939 -63167 -66438 -51152 20307 95020 113100 71956 -69295 -102963 -103391 -73596
6933g3596J03509q4336j04755j5928N344j116l2689Q2407O0116o39n6001m9605
$$ -73596 29913 -54423 -159178 -175106 -169762 -170878 -203567 -121160 -61044 -61683 -117684 -167289
6921a67289M4346J22819N9829j3445j15816J3709o5488J6060P1514J5488Q9610
$$ -167289 -122943 -124 59705 46260 -69556 -55847 -121335 -105275 -33761 -18273 71337
6910G1337O496j7270q0281j862N5529M0088p8214k71252n7304R7939J23310J9912
$$ 71337 77833 60563 -19718 -21580 33949 74037 -4177 -275429 -332733 -234794 -111484 -91572
6898i1572m9459n4327M6598M1076J4963l1331J04643N7884M7999o2122j26663
$$ -91572 -141031 -195358 -148760 -107684 -92721 -124052 -19409 38475 86474 24352 -102311
6887a02311m7284o2095J60357p1179o8942p2867k1290J08758J0141J01402L8388
$$ -102311 -149595 -211690 -51333 -122512 -191454 -264321 -285611 -176853 -166712 -65310 -26922
6876b6922N0413M0822K0325O0115n5111q9264P5852L566R2268l6908j58872L52
$$ -26922 23491 64313 84638 144753 89642 378 76230 79796 172064 135156 -23716 -23364
6864b3364m5243o5738n2720j0809J64866m079L927O9176J6708m5969P5523o4865
$$ -23364 -68607 -134345 -187065 -197874 -33008 -37087 -33160 36016 52724 6755 82278 17413
6852A7413k4260k5763n9304j34983K4160p507q0539M4772O3250K0076K1175j5801
$$ 17413 -6847 -32610 -91914 -226897 -202737 -210244 -290783 -246011 -182761 -162685 -141510 -157311
6840a57311j09310p7800j27591Q400M6655K9907N3273M5139q1291O4644R2376
$$ -157311 -266621 -344421 -472012 -463612 -416957 -387050 -333777 -288638 -369929 -305285 -212909
6829b12909K4520J36249m1665K5475M8136k4814N2394q889k08505K7803l484R252
$$ -212909 -188389 -52140 -93805 -68330 -20194 -45008 7386 -1503 -210008 -182205 -185689 -176437
6817a76437J23112l8758m3344l2778P2877J84745P7414j16569k36838j81816R0982
$$ -176437 -53325 -92083 -135427 -168205 -95328 89417 166831 50262 -186576 -368392 -277410
6806b77410J77029j1421j7443R288r57J5210L9559J42732j1787J0161N2315J55629
$$ -277410 -100381 -111802 -129245 -119957 -120914 -105704 -66145 76587 64800 74961 127276 282905
6794B82905K0365j02969j20278j30479k8075J46798J68668j60667j65884K8931
$$ 282905 303270 200301 80023 -50456 -78531 68267 236935 76268 -89616 -60685
6784f0685P8919K0024p6645P5385n9259J91P8612J138k0046k2502o6025j12837
$$ -60685 18234 38258 -38387 36998 -22261 -22070 56542 57680 37634 15132 -50893 -163730
6772a63730j10180j0010R1010K961k4246N9260J05588J60746l4923n646J56495
$$ -163730 -273910 -283920 -192910 -189949 -214195 -154935 -49347 111399 76476 70830 227325
6761B27325r8090r3855n0605m7617n5243P3985p8258K7191J05804k5168p2899
$$ 227325 129235 35380 -15225 -62842 -118085 -44100 -122358 -95167 10637 -14531 -87430
6750h7430J84609R7266l9477p9417r9602j4773n0467K4129k215p9768o2470O899
$$ -87430 97179 194445 154968 75551 -24051 -38824 -89291 -65162 -67377 -147145 -209615 -202716
6738b02716J79536N3600r1270N6450O2615J38163m9445L9008j027j3043O6768
$$ -202716 -23180 30420 -60850 -4400 58215 196378 146933 185941 184914 171871 238639
6727B38639N7870J15049J07513j1499J1036K4906J0988m9729j9091n8680j24895
$$ 238639 296509 411558 519071 507572 518608 543514 554502 504773 485682 427002 302107
6716C02107r5361m1001n5002m2964M5245o9413N0438Q8516J9276p4282k05346
$$ 302107 206746 165745 110743 67779 113024 43611 94049 182565 201841 127559 -77787
6705g7787l1646J29698k2117j08249N900M4036J48736o838o5007m8290o2223j15048
$$ -77787 -109433 20265 -1852 -110101 -104201 -60165 88571 81733 16726 -31564 -93787 -208835
6693b08835M2353Q3420J52848l0846k6312r0016o889O7672J2476q5589K9764k7869
$$ -208835 -166482 -83062 69786 38940 12628 -77388 -84277 -16605 -4129 -89718 -59954 -87823
6681h7823m9708r8782p8270K4078O1626O9225N8333K0973J5727J22817p7464p9244
$$ -87823 -137531 -236313 -314583 -290505 -228879 -159654 -101321 -80348 -64621 58196 -19268 -98512
$$ [...]
##END NTUPLES=NMR SPECTRUM
##END=
