##TITLE=Analysis number 313231
Compound Code cc 40306
Book Reference 443/56
Project Code adrs
Chemist Name emmab
##JCAMPDX= 6.0         $$ Bruker NMR JCAMP-DX V2.0
##DATA TYPE= NMR SPECTRUM
##DATA CLASS= NTUPLES
##ORIGIN= Bruker BioSpin GmbH
##OWNER= NMR
$$ XWIN-NMR		Version 3.5
$$ Tue Aug 30 10:58:55 2005 GMT Daylight Time (UT+1h)  MAYBRIDGE\NMR@NMR_250MHZ
##.OBSERVE FREQUENCY= 250.131544655141
##.OBSERVE NUCLEUS= ^1H
##.ACQUISITION MODE= SIMULTANEOUS (DQD)
##.ACQUISITION SCHEME= undefined
##.AVERAGES= 16
##.DIGITISER RES= 18
##SPECTROMETER/DATA SYSTEM= dpx250
##.PULSE SEQUENCE= zg30
##.SOLVENT NAME= CDCl3
##.SHIFT REFERENCE= (INTERNAL, CDCl3, 0, 16.522)
##AUDIT TRAIL= $$ (NUMBER, WHEN, WHO, WHERE, WHAT)
$$ ##TITLE= Audit trail, XWIN-NMR		Version 3.5
$$ ##JCAMPDX= 5.01
$$ ##ORIGIN= Bruker BioSpin GmbH
$$ ##OWNER= NMR
$$ C:\u/data/dgb/nmr/ADRS/8720/pdata/1/auditp.txt
$$ ##AUDIT TRAIL=  $$ (NUMBER, WHEN, WHO, WHERE, WHAT)
(   1,<2005-08-30 10:58:17.56 +100>,<MAYBRIDGE\NMR>,<NMR_250MHZ>,
      <created by zg, POWCHK disabled, PULCHK disabled
       configuration hash MD5:
       62 19 C7 07 E1 42 D1 B7 37 6C 3D D0 77 39 F9 E6
       data hash MD5: 64K
       B5 92 E9 52 5C C7 4C 06 12 04 BD 58 FB F8 01 92>)
(   2,<2005-08-30 10:58:32.67 +100>,<MAYBRIDGE\NMR>,<NMR_250MHZ>,
      <Start of raw data processing
       ef LB = 0.3 FT_mod = 6 PKNL = 1 SI = 32K 
       data hash MD5: 32K
       FC CA FA F5 A4 8E 40 01 43 DD FB 66 E9 C6 2C 7C>)
(   3,<2005-08-30 10:58:34.80 +100>,<MAYBRIDGE\NMR>,<NMR_250MHZ>,
      <apk 
       data hash MD5: 32K
       B2 7C AC AB 0B A7 EF E9 8C 21 B8 F6 DE 60 D7 A2>)
(   4,<2005-08-30 10:58:35.56 +100>,<MAYBRIDGE\NMR>,<NMR_250MHZ>,
      <abs ABSG = 5 
       data hash MD5: 32K
       EA 55 54 4A 21 B8 0E 7D 9E 85 EF 77 6D FD 50 F6>)
$$ ##END=
$$ 
$$ hash MD5
$$ 60 1B 8C 32 67 3D D5 85 B1 64 75 6F E0 F2 00 19
##$RELAX= 
##$RELAX= 
##$RELAX= 
##$RELAX= 
##$RELAX= 
##$RELAX= 
##$RELAX= 
$$ Bruker specific parameters
$$ --------------------------
##$DU= <C:\u>
##$EXPNO= 8720
##$NAME= <ADRS>
##$PROCNO= 1
##$TYPE= <nmr>
##$USER= <dgb>
##$AMP= (0..31)
100 100 100 100 100 100 100 100 100 100 100 100 100 100 100 100 100 100 
100 100 100 100 100 100 100 100 100 100 100 100 100 100 
##$AQSEQ= 0
##$AQ_mod= 3
##$AUNM= <au_zg>
##$AUTOPOS= <10 >
##$BF1= 250.13
##$BF2= 250.13
##$BF3= 250.13
##$BF4= 250.13
##$BF5= 500.13
##$BF6= 500.13
##$BF7= 500.13
##$BF8= 500.13
##$BYTORDA= 1
##$CFDGTYP= 0
##$CFRGTYP= 5
##$CHEMSTR= <none>
##$CNST= (0..31)
1 1 145 1 1 1 1 1 1 1 1 1 1 1 1 1 1 1 1 1 1 1 1 1 1 1 1 1 1 1 1 1 
##$CPDPRG= <>
##$CPDPRG1= <>
##$CPDPRG2= <>
##$CPDPRG3= <>
##$CPDPRG4= <mlev>
##$CPDPRG5= <mlev>
##$CPDPRG6= <mlev>
##$CPDPRG7= <mlev>
##$CPDPRG8= <mlev>
##$CPDPRGB= <>
##$CPDPRGT= <>
##$D= (0..31)
0 1 0 0 0 0 0 0 0 0.06 0 0 0 0 0 0 0.0002 0 0 0 0 0 0 0 0 0 0 0 0 0 0 
0 
##$DATE= 1125395896
##$DBL= (0..7)
120 120 120 120 120 120 120 120 
##$DBP= (0..7)
150 150 150 150 150 150 150 150 
##$DBP07= 0
##$DBPNAM0= <>
##$DBPNAM1= <>
$$ [...]
##$SUBNAM7= <"">
##$SUBNAM8= <"">
##$SUBNAM9= <"">
##$SW= 20.6930455092707
##$SWIBOX= (0..15)
0 0 3 0 0 0 0 0 0 0 0 0 0 0 0 0 
##$SW_h= 5175.983436853
##$TD= 65536
##$TD0= 1
##$TE= 295.16
##$TE2= 300
##$TE3= 300
##$TEG= 300
##$TL= (0..7)
0 120 120 120 120 120 120 120 
##$TP= (0..7)
150 150 150 150 150 150 150 150 
##$TP07= 0
##$TPNAME0= <>
##$TPNAME1= <>
##$TPNAME2= <>
##$TPNAME3= <>
##$TPNAME4= <>
##$TPNAME5= <>
##$TPNAME6= <>
##$TPNAME7= <>
##$TPOAL= (0..7)
0.5 0.5 0.5 0.5 0.5 0.5 0.5 0.5 
##$TPOFFS= (0..7)
0 0 0 0 0 0 0 0 
##$TUNHIN= 0
##$TUNHOUT= 0
##$TUNXOUT= 0
##$USERA1= <user>
##$USERA2= <user>
##$USERA3= <user>
##$USERA4= <user>
##$USERA5= <user>
##$V9= 5
##$VALIST= <valist>
##$VCLIST= <CCCCCCCCCCCCCCC>
##$VD= 0
##$VDLIST= <DDDDDDDDDDDDDDD>
##$VPLIST= <PPPPPPPPPPPPPPP>
##$VTLIST= <TTTTTTTTTTTTTTT>
##$WBST= 1024
##$WBSW= 4
##$XGAIN= (0..3)
0 0 0 0 
##$XL= 0
##$YL= 0
##$YMAX_a= 429873
##$YMIN_a= -471807
##$ZGOPTNS= <>
##$ZL1= 120
##$ZL2= 120
##$ZL3= 120
##$ZL4= 120
##$ABSF1= 16.522
##$ABSF2= -4.171173
##$ABSG= 5
##$ABSL= 3
##$ALPHA= 0
##$AQORDER= 0
##$ASSFAC= 0
##$ASSFACI= 0
##$ASSFACX= 0
##$ASSWID= 0
##$AUNMP= <proc_1d>
##$AZFE= 0.1
##$AZFW= 0.1
##$BCFW= 0
##$BC_mod= 0
##$BYTORDP= 0
##$COROFFS= 0
##$CY= 12.5
##$DATMOD= 1
##$DC= 0
##$DFILT= <>
##$DTYPP= 0
##$F1P= 14.0000005364418
##$F2P= -0.99999901652339
##$FCOR= 0.5
##$FTSIZE= 32768
##$FT_mod= 6
##$GAMMA= 0
##$GB= 0
##$INTBC= 1
##$INTSCL= 1
##$ISEN= 128
##$LB= 0.3
##$LEV0= 0
##$LPBIN= 0
##$MAXI= 10000
##$MC2= 0
##$MEAN= 0
##$ME_mod= 0
##$MI= 0
##$NCOEF= 0
##$NC_proc= -2
##$NLEV= 6
##$NOISF1= 0
##$NOISF2= 0
##$NSP= 0
##$NTH_PI= 0
##$NZP= 0
##$OFFSET= 16.522
##$PC= 1
##$PHC0= -79.72733
##$PHC1= 6.944886
##$PH_mod= 1
##$PKNL= yes
##$PPARMOD= 0
##$PSCAL= 4
##$PSIGN= 0
##$REVERSE= no
##$SF= 250.13
##$SI= 32768
##$SIGF1= 0
##$SIGF2= 0
##$SINO= 400
##$SIOLD= 32768
##$SREGLST= <1H.CDCl3>
##$SSB= 0
##$STSI= 32768
##$STSR= 0
##$SW_p= 5175.98343685301
##$SYMM= 0
##$S_DEV= 0
##$TDeff= 65536
##$TDoff= 0
##$TI= <Analysis number 999999
Compound Code 99
Book Reference 9
Project Code 9>
##$TILT= no
##$TM1= 0
##$TM2= 0
##$TOPLEV= 0
##$USERP1= <user>
##$USERP2= <user>
##$USERP3= <user>
##$USERP4= <user>
##$USERP5= <user>
##$WDW= 1
##$XDIM= 32768
##$YMAX_p= 424251887
##$YMIN_p= -70468
$$ End of Bruker specific parameters
$$ ---------------------------------
##NTUPLES= NMR SPECTRUM
##VAR_NAME=  FREQUENCY,     SPECTRUM/REAL,   SPECTRUM/IMAG
##SYMBOL=    X,             R,               I
##VAR_TYPE=  INDEPENDENT,   DEPENDENT,       DEPENDENT
##VAR_FORM=  AFFN,          ASDF,            ASDF
##VAR_DIM=   32768,         32768,           32768
##UNITS=     HZ,            ARBITRARY UNITS, ARBITRARY UNITS
##FACTOR=    0.157963299565203, 1,           1
##FIRST=     4132.6476996994, 0,             0
##LAST=      -1043.33573715361, 0,           0
##MIN=       -1043.33573715361, -70468,      0
##MAX=       4132.6476996994, 424251887,     0
$$ Real data points
##PAGE= N=1
##DATA TABLE= (X++(R..R)), XYDATA
$$ [...]
17485A8354J0555j4405q134j693l238j1975p525m784J2642P375O616K0564Q083
17472C2435m490j4070j0895p178L062J341O051J1478n294k3485m490M317Q911
17459b307J1725J1814J0247n741o675o287O335J1593n661m916Q283J5697M665
17446D8772J2717Q748L699J6935L2142M0913j7060n3171k1299J50p035p691j718
17433E6102o84R81n342q519J6214L692K036N830P605P198n08j0049P94J472j000
17418G5822J913j2820o516J3250K5494J2412J5080K0163L7860O0100K2202l1168
17406B33792l6636Q100K8486K3679l640k9727k5489k365q349L3838L4331K5846
17394B81866K4549k5343o5176n2700l6046k5201k3732j977k87o677j0400n828
$$ y = [18354, 28909, 14504, 6370, 4677, 1439, -10536, -18061, -22845, -10203, -2828, 3788, 24352, 32435, 27945, 13875, 2980, -4198, -1136, 205, 6256, 17734, 12440, -11045, -15535, -11218, -2307, 9418, 21232, 31479, 25738, 19063, 12776, 19111, 30704, 25043, 20127, 28410, 44107, 48772, 61489, 70237, 73936, 90871, 123013, 163926, 146866, 93695, 72396, 72546, 65511, 57820, 56102, 55418, 56399, 51057, 42538, 58752, 62444, 64480, 70310, 77915, 85113, 84605, 74556, 75350, 76822, 75822, 77735, 64915, 58399, 71649, 97143, 109555, 124635, 144798, 182658, 242758, 264960, 233792, 197156, 205256, 233742, 257421, 253781, 224054, 198565, 196200, 187851, 221689, 256020, 281866, 306415, 281072, 215896, 163196, 127150, 101949, 78217, 76240, 75953, 69276, 58876, 53048]
17382E3048J780J568M494J2772j8060k3253J10j577q63R089K004l30M125p697
17368C7210j7497l389J4963Q512J6407J7012J4882J7957K4580K0677J3966N431
17356A70711K0366K9280L2448K0912r306n5188o5005l6035k4064j3050p152j550
17344F2367j967P186J0397J7447L8041N1477M6060P690j1857l7243l7681l3410
17332A18507k7211k6050j4348j6027j2512o269L581j082q213j4167N176J3930
17320A5315J0567j3469n00N916p473q045k1885o282K4595Q006n540o562J684q559
17306a2232l195l280M972N041M95l815j3194M136J145Q093j734q465l895k404
17292b8332J4223O839M281n760j0124J3479Q394J7146j1182n153L083R70J4182
$$ y = [53048, 54828, 56396, 60890, 73662, 55602, 32349, 32459, 30882, 30019, 39108, 41112, 40782, 44907, 37210, 19713, 16324, 31287, 39799, 56206, 73218, 88100, 106057, 130637, 151314, 165280, 170711, 191077, 220357, 252805, 273717, 264411, 209223, 144218, 108183, 84119, 71069, 63917, 62367, 60400, 67586, 77983, 95430, 133471, 184948, 231008, 238698, 226841, 189598, 151917, 118507, 91296, 65246, 50898, 34871, 22359, 16090, 19671, 18589, 10376, -3791, 1385, 15315, 25882, 12413, 11913, 17829, 10356, 2311, -19574, -25856, -1261, 6745, 1205, -5357, -3673, -12232, -15427, -18707, -13735, -8694, -8199, -12014, -25208, -21072, -19927, -11834, -13568, -22033, -25928, -28332, -14109, -7270, -2989, -8749, -18873, -5394, 3000, 20146, 8964, 3811, 6894, 7864, 22046]
17279B2046r711p509j3973j1811J2069Q188J4059J0381O200Q40m006J04j2705
17266A4172j4173O623m018n211R57Q239Q752J678Q26k713j0451Q445J0604q816
17252A4914M745M986j4014R2J427q737J899M71j2970j0747j250j3225J1366J3598
17238g445J901K976n500P513R634M518n585j1633j960J5321R388p067l276k71
17224H514N63n757O970m745m829M054j7802j5163J0726J8665p876k829O747K956
17210A94J725j9043j264l239J7229Q763J616l726O847p824k4360J1558J7255j3725
17196g994k1106P43J2722R528j0165O067L508R91N242q772p018J175j4820l716
17182c3615K003l556J3404L566o748J3880J5693R93l447L520q239J455J0711r790
$$ y = [22046, 12335, 4826, -9147, -20958, -8889, -701, 13358, 23739, 29939, 30779, 26773, 26877, 14172, -1, 6622, 2604, -2607, -1650, 6589, 15341, 17019, 17845, 15132, 4681, 13126, 23730, 14914, 19659, 24645, 10631, 10723, 12150, 3413, 5312, 5783, -7187, -17934, -19184, -32409, -21043, -7445, -5544, -2568, -8068, -555, 9079, 13597, 8012, -3621, -5581, 9740, 19128, 12061, 8785, 8514, 9077, 3320, 10290, 5545, 716, 4770, -13032, -28195, -17469, 1196, -6680, -9509, -2762, 194, 1919, -17124, -18388, -21627, -4398, 4365, 5981, 2255, 9102, 1278, -23082, -11524, 5731, -7994, -29100, -28357, -15635, -6107, -16272, -10205, -6697, -5706, -464, -9236, -16254, -15079, -29899, -33615, -31612, -35168, -21764, -18198, -24946, -11066, 4627, 5620, 2173, 5693, -2546, -1091, 9620, -170]
17168a70K276l417p837J02L013p631O905m080j4794r75K217O984O357Q388j560
17153d222o120M434Q392p523j1425N36J6006J0181M30K288o338K22j811j7288
17139a2238j6605J874J1758K0322J2716M222j9338p188l502K07J8592P636j2771
17126E685L36O154J704p781O242N796o799o564m904q312o703o324m361K68L393
17111b2170k072J1458O527N410q241K885R275m728J527N794J009j2771J226l835
17097h706p625n266k642m94O889L716Q648J490j2823p018N530J0261O616N941
17083D517q266r130L258J83m602r905j912J1665J945m063j598O546M525J3390
17069F553n220K008j4540l143Q870r083k689k049m179j85L815o014k0296j864
$$ y = [-170, 2106, -1311, -9148, -9046, -6033, -13664, -6759, -10839, -25633, -26608, -24391, -17407, -11050, -2662, -4222, -10342, -5908, 2484, -5039, -16464, -15928, 78, 10259, 10689, 12977, 6639, 6861, 5050, -12238, -28843, -26969, -15211, 5111, 17827, 22049, 2711, -4477, -7979, -7772, 10820, 18456, 5685, 6021, 12175, 13879, 6098, 12340, 18136, 11337, 4773, -131, -8443, -15146, -21470, -25831, -25563, -22170, -24242, -12784, -6257, -847, -9088, -6203, 3072, -1656, -129, 5665, 6674, -6097, -4871, -8706, -16331, -21597, -24239, -24733, -17844, -14128, -5480, -3990, -16813, -23831, -18301, -8040, -1424, 4517, -3749, -12879, -9621, -9438, -14040, -23945, -25857, -14192, -12247, -16310, -17908, -11362, -6837, 6553, 1333, 3341, -11199, -14342, -5472, -14555, -17244, -19293, -23472, -23657, -19842, -25856, -46152, -48016]
17055d8016J1797M733Q943m778k616J1273N635P813J0446q860j3418n594o83Q34
17041b2491J1991N629j9104o946J3106o165j8277L602J6651k912J1334J0844K648
17028i0n303m017N374j859r910J104N127p166M148j2937J84L989J803M69L287
17013a5797J0213R344J8515j7942k4510l290j2987N394J7267M963K529k191M618
17000c874j498N27O224m989q593M616J950L420r064J0554P594P95j3397j1145
16986a6880r56P117J4791j3552j1142j292L111J0864J352o14O866J1503L754j0809
16972D113j2919l914o198k222o371J194J3995L524N006J1101J0531J2140j4767
16959A5213j6101j1478M401l561j996Q699J0147Q295q224l733J2278o927K179
$$ y = [-48016, -36219, -31486, -22543, -27321, -29937, -18664, -13029, -5216, 5230, -3630, -17048, -22642, -23325, -22491, -10500, -4871, -23975, -30921, -17815, -23980, -42257, -38655, -22004, -24916, -13582, -2738, -90, -5393, -9410, -4036, -5895, -15805, -14701, -9574, -16740, -12592, -25529, -25345, -21356, -19553, -19084, -15797, -5584, 3760, 22275, 4333, -20177, -23467, -36454, -31060, -13793, -8830, -6301, -8492, -3874, -5372, -4845, 1379, -3610, -12203, -7587, -5637, -2217, -11281, -727, 6867, 7662, -5735, -16880, -17836, -10719, 4072, -9480, -20622, -21914, -18803, -7939, -6587, -7201, -335, 11168, 14922, 4113, -8806, -12720, -18918, -21140, -27511, -26317, -12322, -8798, -3792, 7309, 17840, 29980, 15213, -888, -12366, -7965, -11526, -13522, -4823, 5324, 13619, 5395, 1662, 13940, 7013, 9192]
16946I192J786o821j8863K624R589K465R982J439j3069N553P742r398m963l381
16932f123l825R07N882R911o534m989J949M97q853k219J3068P330j71p24K3656
16917B9762r792j8783J0403J6094j7254o746p377j2076J3250O325j1528p92N419
16904c095j0862M246m649o351K337J1458o411l413r305K411R674j927M614j7498
16890b8771r096J6380J3147P36o37K419O33j268P249Q169k432k0133M204J0689
16876A289j0490j854M948q70q307J0440q530q376Q914O829O036j148n94L876J4735
16861A6898J4318l14k1760m838P60n25l639N231j7485k804O522j396o762q859
16847b4653k924M787N101P93J612Q386l419L796L109j464m487R889j441J180k742
$$ y = [9192, 10978, 4157, -14706, -12082, -2493, -28, 9954, 11393, -1676, 3877, 11619, 2221, -2742, -6123, -9948, -9041, -3159, 6752, 218, -4771, -2822, -2325, -11178, -13397, -329, 7001, 6830, 6106, 29762, 19970, 1187, 11590, 27684, 10430, 3684, -3693, -15769, -2519, 3806, -7722, -8514, -3095, -13957, -9711, -14360, -20711, -18374, -6916, -13327, -16740, -26045, -23634, -13960, -15887, -11273, -28771, -37867, -21487, -8340, -7604, -8241, -5822, -5189, -6457, 792, 8961, 6529, -13604, -9400, 1289, -9201, -11055, -6107, -6977, -15284, -4844, -13374, -21750, -12836, -6007, 29, -1119, -1713, 2163, 16898, 31216, 30902, 9142, 4304, 5064, 4539, 900, 6131, -11354, -14158, -7636, -9032, -15794, -24653, -27577, -22790, -17689, -16896, -15284, -6898, -10317, -6521, -3412, -4876, -9363, 526, -915, 265, -2477]
16832b477j6193J600K333q130J532j507M690K6200J1127m288r670l997k99N068
16818E989p0J3560M439j7158j5341J943L76q097o88j7089n683J7042J0262m95
16804a1010J7965M675q841J872r176m379j4241k242n64J6117L756n658k815j1733
16790b6274J4526J4245J113j2139n73R079K624M800p236o544K916j269M812P42
16776H22L921J5492j0412j0747K542n210Q978J9227n930j2814M779O255j0710
16763F193j2624j1086K636n246M642K1690J310j729m718j0729L618R783J788k0592
16749a5064j9844J0900J6724K1572O637L968j2713o572R165p576j0727l465J6417
16736I422k570q343m79L735q265k0424L541K3895R885N83n855j7136M643p55k360
$$ y = [-2477, -18670, -17070, -14737, -22867, -21335, -22842, -18152, 8048, 19175, 14887, 5217, 1220, 921, 5989, 5919, 19479, 23918, 6760, -8581, -6638, -6262, -14359, -15047, -32136, -37819, -20777, -10515, -11010, 6955, 11630, 2789, 4661, -4515, -8894, -23135, -25377, -25941, -9824, -6068, -11726, -14541, -26274, -11748, 2497, 3610, -8529, -9102, -23, 2601, 7401, 165, -6379, -3463, -4732, 80, 822, 4743, 20235, 9823, -924, 1618, -3592, 5386, 24613, 18683, 5869, 10648, 16903, 6193, -6431, -17517, -14881, -20127, -15485, 6205, 7515, 5786, 1068, -9661, -6043, 3740, 5528, -15064, -34908, -24008, -7284, 14288, 20925, 24893, 12180, 5608, 14773, 7197, -3530, -6995, 9422, 6852, -1491, -1970, 1765, -6500, -26924, -23383, 512, 10397, 10980, 5125, -12011, -7368, -8123, -10483]
16721a0483Q972q687o525O007Q398n148r50j1473N511N162O658j1946R583J6716
16707A1795N07j3715L69j608O495J5057R38q969m093p692M57J047J2086N918p180
16692A1412k1979n319J0834J253o351l882N635J1820o604N400J420q391P140J1244
16678A3632j3977j0651P332K5418o767j4776N380J6568M432o642j6760M85J498
16665E172K69n183N560J11k802Q277k190L914R572j2024J1009j726o101J531M12
16650A5801j3512r747j5311K638N023Q496J6849O246L99k568j1531q739K764j3398
16636a6590p021J4709l659r324K966J0659N795J761R842J7719q570k6159k817
16623a0689L134n883K529O40L527J1476r102K441M4Q564O404j9717j2649m797
$$ y = [-10483, -1511, -10198, -16723, -10716, -2318, -7466, -8416, -19889, -14378, -9216, -2558, -14504, -4921, 11795, 12302, -1413, -1044, -2652, 3843, 18900, 19838, 10869, 6776, -916, -459, 588, 12674, 18592, 11412, -10567, -15886, -5052, -3799, -10150, -14032, -8397, 3423, -3181, 2219, 3639, -4752, 2388, 13632, -345, -10996, -3664, 21754, 14987, 211, 5591, 22159, 26591, 19949, 3189, 3674, 5172, 5441, 258, 5818, 5929, 3127, 11404, 9214, 13128, 22700, 10676, 21685, 19959, 13858, 15389, 15801, 2289, -7458, -22769, -20131, -15108, -6612, 10237, 16483, 16882, 14314, 2783, -5956, -3192, -16590, -23611, -8902, -12561, -21885, -18919, -8260, -2465, -704, 9138, 26857, 18287, -7872, -10689, -7555, -13438, -10909, -10269, -6742, 4734, -4368, -1927, -1883, 6681, 13085, -6632, -19281, -24078]
16609b4078L072O792K013j15L815R911q013l785k56L550L239k961O274q171m82
16594i195m10j6524o76L764J1927K603j5334j2946j327R506J4582J1447N446N31
16580C394K85L882J2984Q934j0095j7723m702r642m880O639K258J426Q463J485
16566B708p240r023p707L012R102m45Q778N836Q415J3517o728j985r67j3913l4169
16551c0809M331N508J5091n126k0N491m318J183J0318j068k896k337q667j2204
16537b5523O162P1Q270J6240l155n617J7629J936j0104K76m499N289o289k0701
16523b0015q450R146p269l727J4194J9366P06j5145P87O601J092M431J2782J3214
16509B7713Q373j4200j1590p608O020l248l347j1769L700J3435k803q140n168
$$ y = [-24078, -21006, -14214, -12201, -12316, -8501, 1410, -6603, -10388, -10644, -7094, -3855, -6816, -542, -8713, -9195, -9605, -26129, -26805, -23041, -11114, -8511, -23845, -36791, -38118, -28612, -14030, -2583, 2863, 3394, 3679, 7561, 20545, 29479, 19384, 1661, -3041, -12683, -17563, -10924, -8666, -7240, 1223, 2708, -4532, -13555, -21262, -18250, -9148, -9593, -815, 5021, 13436, 26953, 20225, 18240, 17273, 3360, -30809, -26478, -20970, -5879, -11005, -11025, -5534, -9852, -8669, 1649, 581, -2315, -4652, -13319, -25523, -19361, -19290, -11020, 5220, 2065, -3552, 14077, 16013, 5909, 6185, 1686, 6975, 686, -20015, -28465, -19319, -26588, -30315, -16121, 3245, 3951, -11194, -10407, -3806, -2714, 1717, 14499, 27713, 36086, 21886, 10296, 2688, 8708, 5460, 2113, -9656, -5956, 7479, 4676, -3464, -8632]
16496h632r76K659J0992M890J373Q627j866j3566j8985n849Q423K578J0294M286
16482D248Q9j0370j383n200J699J0833J4187J048j907q112k4496K621K0389J4927
16468A8573N601m426j3483j0437j5407j660K38O882K796J372K814M015K98j0247
16454a3071n731L481N142L339O968L862M644r499j0479K223J4234M20l287Q502
16440A0748K458N28l518R299m844j2816k2314n420q477J440J7657J7463J6415
16427A8619M557q538q325r700j5962j0413Q80m185J1652R068J371J1072K574p79
16413A891o00O538N268q384N700j887j0815N387k32K007Q114R269M619p019o278
16398A3578P108R52l18j1307k1461n500J4134Q088r422j7998J365J9020R183j2420
$$ y = [-8632, -9608, -6949, 4043, 8933, 10306, 18933, 17067, 3501, -15484, -21333, -12910, -10332, -38, 4248, 4337, -6033, -7416, -12616, -10917, -84, 14103, 15151, 13244, 5132, -19364, -16743, 3646, 18573, 24174, 19748, 6265, -4172, -19579, -21239, -21001, -14119, -11323, -9951, -7137, -3122, -2824, -13071, -18802, -15321, -10179, -6840, 128, 3990, 8634, -865, -11344, -9121, 5113, 5533, 2246, 10748, 13206, 13734, 10216, 19515, 14671, 1855, -20459, -25879, -34356, -32916, -15259, 2204, 18619, 23176, 14638, 6313, -3387, -19349, -29762, -28882, -33067, -21415, -12347, -10976, 96, 2670, 1891, 1291, 7829, 13097, 4713, 10413, 8526, -2289, 3098, 2866, 4873, 12987, 22256, 26875, 19856, 13578, 20686, 21638, 21320, 10013, -11448, -16948, -2814, 5274, -4148, -22146, -20781, -1761, 7422, -4998]
16384d998R71n998j2571J5851j0300P078j907J814m387O775M893r840K860J0893
16370A134R613l86R137j0597j8209N496J8026M009k357L096q227r347m20J5161
16356A6129m4j8239j543K376p475O383R32m650N868q188j9Q464N265O269l461
16341H067j2728L54j3294J1388j437m084L444K3430Q497L237R457j203q363o013
16327B0752j7648j5359n391J2603o208J356L14J7800Q943L75j3769j4219o520
16314a6971N879J1366O279j059j922J616K831k160k327j056j1779R295J5173j5399
16300b34q155J5492J1917J1431m013J739J4203j1445m698j0773n435j0249M02
16287A82n6q459j0713N366J5085r344k3705j2857O791J1135J5255P713M031l525
$$ y = [-4998, -4027, -10025, -22596, -6745, -17045, -9967, -11874, -10060, -14447, -7672, -2779, -12619, -9759, 1134, 10747, 10361, 19498, 8901, -9308, -3812, 14214, 18223, 15866, 18962, 10735, 1388, 968, 16129, 16085, -2154, -3697, -1321, -8796, -2413, -1481, -6131, -263, -8451, -8470, -6, 5259, 11528, 8067, -4661, -4307, -17601, -6213, -7650, -11734, -8290, 15140, 23637, 26874, 36331, 35128, 26765, 20752, 3104, -12255, -17646, -5043, -11251, -9895, -9581, 8219, 17162, 17537, 3768, -10451, -16971, -11092, 274, 6553, 5494, 3572, 5188, 8019, 5859, 3532, 2476, -9303, -8, 15165, -234, -8389, 7103, 19020, 30451, 26438, 28177, 42380, 30935, 26237, 15464, 10029, -220, 182, 126, -8333, -19046, -13680, 1405, -7939, -31644, -44501, -37710, -26575, -11320, -3607, 424, -3101]
16273c101m553q778J5912Q095k352q994l931n343O069M943L446n932K478M828
16259B787N614j2194j6239o276J4166J5135m147j8680j0547N833J5753M005j8590
16246b3380j4087N285L604L031L768L112j896O159J1085O180o669l480Q347o8
16232I91j3417j0052l312N81L582K13J3097K6936l094j3371j1576o286R141J1123
16218D556j1602Q19m901r42N957J453o878M755J7381R68J580l832j0489k2652
16204b3827N815K0392j0035L419J1152J0636j068j4186p471L566l515q92O009
16191en602j76M97j446L68q604j2828O349P258P405J1472o451n160J1694M922
16176I693p277j279J688J620k90P002M477r430n332m133j1162O978J0040J4401
$$ y = [-3101, -7654, -16432, -520, 7575, 5223, -3771, -7702, -13045, -6976, -2033, 1413, -4519, -2041, 2787, 8401, -3793, -20032, -26308, -12142, 2993, -1154, -19834, -30381, -24548, -8795, -4790, -23380, -37467, -32182, -28578, -25547, -21779, -18667, -20563, -14404, -3319, 2861, -3808, -7288, 1059, 991, -12426, -22478, -25790, -25209, -21627, -21414, -8317, 18619, 15525, 2154, -9422, -15708, -6567, 4556, -7046, -6227, -11128, -12070, -6113, -4660, -11538, -6783, 10598, 11566, 13146, 9314, -1175, -23827, -18012, 2380, -7655, -4236, 6916, 17552, 16484, 2298, -5173, -1607, -5122, -6014, -5, -5607, -5783, -5286, -6732, -6364, -14968, -27796, -21447, -14189, -6784, 4688, -1763, -6923, 4771, 9693, 2416, 1137, 2825, 4445, 4155, 11157, 15634, 6204, 872, -3261, -14423, -7445, 2595, 16996]
16162A6996L071n19l31J4638P612j6319n245J4275r071k4353M296J290j0357k4725
16148b8742J111J0313p704o158j247K338R220J3666n31K354Q324R574P449L06
16134B0273r802o089q616p500k497J0706N500j617R6N83q164o224j218O014J8212
16119I657Q224j0205q641q150p743r189L682P506l233o24L906J779P518J915n873
16104i471R382O476J522o119j5042k307j540j464J0653O279j0539l7k706J1285
16090c628K379j5711q576J6005K661k444n967k314J6767O3R640Q772n861j2486
16076g00M831K67N08L408J193L69m140j962o786j6916O716k690j5735j9905j190
16061e2732K5276J6404Q197K786k665j2272r740K675J540n931k153R595J3604
$$ y = [16996, 20067, 19548, 19217, 33855, 41467, 25148, 19903, 34178, 25107, 754, 5050, 6340, -4017, -28742, -27631, -17318, -25022, -31180, -32427, -30089, -20869, -7203, -7734, -5380, 2944, 12518, 19967, 20273, 10471, 4382, -4234, -11734, -14231, -3525, 1975, 358, 454, 1037, -7127, -13351, -14569, -8555, 9657, 17881, 7676, -965, -9115, -16858, -26047, -22365, -14859, -18092, -18716, -14810, -13031, -5513, -3598, -9471, -89, 6387, 7909, 1790, -13252, -15559, -17099, -18563, -7910, -1631, -12170, -12207, -14913, -3628, -1249, -16960, -25536, -9531, -6870, -9314, -15281, -17595, -828, -765, 8875, 17647, 11786, -700, 4131, 4398, 4906, 8314, 9507, 9876, 5736, 3774, -3012, -19928, -13212, -15902, -31637, -51542, -52732, -27456, -11052, -2855, -69, -2734, -15006, -24746, -22071, -20531, -26462, -28615, -19020, -5416]
16048e416J3037M519J2271n289q915K127Q898k1606o218l664J701O357O447j663
16034B586J921Q54J6940O118r469j1936r457l018M974J5636J9409o825k6601Q217
16020I349M285K231j3301j3601N23j131M448n853k054J0610j581p466K756N546
16006e239j655k04K017K902k710J0190k000j4753R059p702j2568M422J3877K259
15992b105N160p577P188K120M511n272p132j0199L192Q781M898R024J0718k575
15978B0732r354j2733o175J2335L862n292P917J6153q946j7337j0775k614j5784
15965b8011j344J0190J4668P323J6430R612j0749k6923M816K004j916l268r998
15952a7166p789m755J050J4196k676N837J144j1097O378N939J2555l830J411j732
$$ y = [-5416, 7621, 12140, 24411, 19122, 10207, 12334, 21232, -374, -6592, -10256, -8555, -2198, 4249, 2586, 4507, 5361, 22301, 28419, 18950, 7014, -2443, -5461, -487, 15149, 34558, 27733, 1132, 9349, 13634, 15865, 2564, -11037, -10514, -11645, -7197, -13050, -15104, -4494, -6075, -13541, -10785, -5239, -6894, -7098, -5081, -2179, -4889, 5301, 3301, -11452, -2393, -10095, -22663, -18241, -4364, -2105, 3055, -4522, 2666, 4786, 9297, 4025, -3107, -13306, -10114, -1333, 3565, 12589, 23307, 20732, 11378, -1355, -7530, 4805, 8667, 3375, 11292, 27445, 18499, 1162, -9613, -12227, -28011, -29355, -19165, -4497, 2826, 19256, 28868, 18119, -8804, -3988, -1984, -3900, -7168, -17166, -24955, -29710, -28660, -14464, -17140, -11303, -10159, -21256, -14878, -8939, 3616, -214, 1197, -535]
15938e35k944j38l656N139P818J398J6683O564l011j2509k5742L762J2128L410
15924H367p553K536R147J165o865p596j170m075L508J1062j740N28R903p443q149
15909A625j7023p649J1541r741k018Q11P613O577n470j4074K792P719m465L304
15895a8458m658P220O890J8962J4540N657J588K676J080p263j6378k171m871O944
15881A1758j998j0928p567J3409J9934J9000q123q294J713j3013k001J3173n764
15868B1299r735l659l398K661o14m035k991k263l065M294M091j0191j6606N133
15854a9079J8461O409P302J641j509l264J3328Q684N640r677j1628k1832m017
15841i541N370L678m591n610J7K676Q943r30p324P409p94J915l266k696l725j9405
$$ y = [-535, -3479, -3617, -7273, -2134, 5684, 7082, 23765, 30329, 27318, 14809, -10933, -7171, 4957, 8367, 814, 3350, 12497, 13662, 6797, -799, -1969, -6044, -2536, 8526, 6786, 7314, 17217, 9774, 1625, -15398, -23047, -11506, -21247, -23265, -22454, -14841, -8264, -13734, -27808, -25016, -17297, -21762, -18458, -23116, -15896, -9006, 9956, 24496, 30153, 31741, 34417, 35497, 28234, 11856, 9685, 4814, 11758, 9760, -1168, -8735, 4674, 24608, 43608, 35485, 27191, 28904, 15891, 13890, 27063, 21299, 11564, 7905, 4507, 7168, 6554, 2519, -472, -2735, -5800, -1506, 2585, -7606, -24212, -19079, -618, 5791, 13093, 14734, 13225, 9961, 23289, 31973, 37613, 27936, 16308, -5524, -9541, -4171, -493, -5084, -10694, -10677, -8001, 942, 12, -7312, 97, -697, 1218, -2048, -4744, -8469, -27874]
15825b7874j1318R755K2427P756k4420j3901O142Q260J5739K230l456Q020p286
15812g926N079J1029j2590q27m551L413n673N830P159j2111j0614K277M835l002
15798a7672k16J5584J4060J178k667p441j189J1377N224j0850l890J6724R991
15785C0213q729o733K390n683l320j4092l746L206l394N734N838o434j1136j0138
15771b6024P432J0105R747P152r558j1529N921M490m880q603j248J2291J0668
15758E964j96j5931j0699Q29J093p724N148J0092J5643J9237p287j5394J1579
15745A2354O560j226J4804J0019j8412k0994j1305m249J3481p531N232R719j472
15732F980N2j9535l779O367o41j6893O99J9833J7019o554m958n052J6L801k550
$$ y = [-27874, -39192, -29437, -7010, 746, -23674, -37575, -31433, -23173, -7434, -5204, -8660, -640, -7926, -2847, 8182, -4408, -5235, -9786, -6373, -12046, -6216, 943, -11168, -21782, -19505, -14670, -17672, -17888, -2304, 11756, 12934, 10267, 2826, 1637, 13014, 18238, 7388, 3498, 20222, 30213, 21484, 14751, 17141, 11458, 8138, -5954, -9700, -6494, -9888, -4154, 1684, -4750, -15886, -26024, -18592, -8487, 1260, 8412, -1146, -12675, -6754, -2264, -7144, -15747, -16995, -4704, 5964, 5768, -10163, -20862, -20033, -18940, -26664, -21516, -11424, 4219, 23456, 16169, 775, 12354, 18914, 17688, 32492, 42511, 24099, 3105, -8200, -12449, 1032, -6499, -1267, 8452, 6980, 7032, -12503, -16282, -9915, -10556, -27449, -26750, -6917, 10102, 3548, -1410, -6462, -6446, -2645, -5195]
15717e195q591n691J4198Q463K094N105l364j202l698n488n682L221m202p969
15703a8001L572K2324R607n820k174K17o312k050o636j5857j0312J2655J8039
15690g48k6J1773R854k501N429k269q901j0142J381m374J3904p270K421J151J022
15675A0704N615J1542N044j3432m489j4828k149m7K168k079J160J3162L039j205
15661A4205M504j4103Q668J627j3521K777o32k677J756J510j0213k2650Q423K8810
15647H484M579l495j0814j719L3N692O591l434l45L90k382m084L117k674N704
15632E643O547Q479L18r255n102J1080N018j0639j2189r897J2597J2585J3664
15619B8849L132j3225p65o016p734P460k656k685m281p92P155K871q39N97j3122
$$ y = [-5195, -13786, -19477, -5279, 3184, 5278, 10383, 7019, 5817, 2119, -3369, -9051, -5830, -10032, -18001, -14429, 7895, 17502, 11682, 9508, 9725, 3413, 1363, -5273, -21130, -31442, -18787, -748, -774, 10999, 20853, 18352, 23781, 21512, 12611, 2469, 3850, -524, 13380, 6110, 8531, 9682, 10704, 16319, 27861, 32905, 19473, 14984, 156, -1993, -2040, 128, -1951, -791, 12371, 15410, 14205, 18709, 4606, 13274, 14901, 1380, 4157, 3525, 848, 2604, 4114, -6099, -28749, -20326, 8484, 13063, 9568, -1246, -2965, -2932, 2760, 9351, 5917, 5572, 5962, 3580, -504, 2613, -61, 5643, 12190, 20669, 20987, 11732, 6630, 17710, 22728, 12089, -100, -9997, 2600, 15185, 28849, 31981, 18756, 17991, 11975, 4241, 11701, 9045, 6360, 2079, 1287, 8442, 11313, 10474, 11071, -2051]
15604b051o937m347o918R289j1724L711K0735J3700p823j3511j8445m993N938
15591b3376J2446R598k051n629j4889k484J6749J1035K432j1418p591N659N847
15578c672J1792k434l836l654j6277J174J9073O851l825k796K35j4L056l390J904
15563D187Q379l336j008Q95K326J7081P789p508j4531j6562k379m707K892J0440
15549C958O427P703j3161j9561O068Q476J25m4J3834R886M05j2749j2185N517
15535D699j2761O013M373o534n388j3558O481J0503K2929J2928q004k1705p350
15522g374J2422m632j4573N101J0389J8630j0580j4979p505j2197P768J4892k730
15509e368r30p377L84Q035o828K341l758m563M315O085p435M616J03j1953o420
$$ y = [-2051, -8988, -13335, -20253, -10964, -22688, -18977, 1758, 15458, 7635, -5876, -24321, -29314, -23376, -10930, -1332, -3383, -9012, -23901, -26385, -9636, 1399, 3831, -7587, -15178, -9519, -3672, 8120, 5686, 1850, -1804, -18081, -16907, 2166, 9017, 5192, 2396, 2631, 2617, 5673, 2283, 4187, 12566, 9230, 8222, 9117, 11443, 28524, 36313, 28805, 14274, -2288, -4667, -9374, -6482, 3958, 10385, 18088, 4927, -14634, -8566, -90, 35, -9, 13825, 23711, 24116, 11367, -818, 4699, -8062, -2049, 2324, -4210, -9598, -23156, -16675, -6172, 16757, 29685, 21681, -24, -7374, 5048, 416, -14157, -9056, 1333, 19963, 9383, -5596, -13101, -25298, -17530, -2638, -5368, -6298, -13675, -13291, -5256, -12084, -9743, -13501, -18064, -13749, -7664, -15099, -10483, -10380, -22333, -28753]
15494b8753J8577K3405P266P8j0809j0492Q576J5507j7697j0624N825L522k697
15481A684R14K362o470k542r13j0562K317J0765J9778r076n572r435j491k808
15467a1049r869j1305O104J3505l579j659K947n1p306L006J7260J0035M74n02
15453H011j0570m654l680N082Q814K181l323k905n752l743l680q22L190R981P116
15438E246n124q664l383O907J4036j778j1649r11J5885J5239o105p995p626r937
15424e859j7335o826K185P643K4220J0381q063j4429J109j1258j4283l242J9705
15411a6052K2143K371k1817L365J3716k269R274l673m677K736O117N115o747j792
15397G810n446R52n717J2851j231k1746N746K363Q568O365l255q275p562j5951
$$ y = [-28753, -10176, 13229, 20495, 20573, 9764, -728, 7848, 23355, 5658, -4966, 859, 4381, 1684, 2598, 4960, -1510, -4052, -4965, -15527, -13210, -2445, 17333, 8257, 2685, -6750, -8241, -11049, -20918, -32223, -26119, -12614, -16193, -17852, -14905, -14956, -22262, -19256, -1996, 8039, 8513, 8011, -2559, -7213, -10893, -5811, 3003, 5184, 1861, -1044, -6796, -10539, -14219, -15041, -11851, -1870, 5246, 122, -8542, -11925, -5018, 9018, 7240, -4409, -5320, 10565, 25804, 19699, 11704, 4078, -5859, -23194, -30020, -27835, -20192, 4028, 14409, 6346, -8083, -6974, -18232, -32515, -35757, -16052, 6091, 8462, -13355, -9990, 3726, 1457, 10731, 7058, 2381, 5117, 11234, 16349, 9602, 7810, 2364, 3316, -2401, 10450, 9219, -12527, -6781, -4418, 4150, 10515, 7260, -1015, -8577, -24528]
15383b4528k282k140j797K629Q163K806J7167Q883m175j8724n341j02M74J6880
15369b087j5785J0197J0532O068r129n815j5103Q391n17n615O339j1750j99k468
15355b6941N012J4435P742j3863j5123J2930L772p274J4618P146J4805p651j3923
15342d315j4696N613o402q719l44P859J2768J8592O694j0100p898n79j4291L913
15328a1905L587J267l015q390k862r536J4646J0611j1615q333O980M401N365J3398
15314D599R891L284r45j5625j8594l136O319J2895M086J0255J7393j680j1679
15301A7063k875l717K323p807j416N308m32q029n64p912N61l20N987k879L856
15286h53Q744r963j9294k432J1367J194n564N588k344J921p455R491K750J72o437
$$ y = [-24528, -26810, -28950, -30747, -28118, -19955, -17149, 18, 8901, 4726, -13998, -19339, -19441, -18967, -2087, -17872, -7675, 2857, 8925, -204, -6019, -21122, -12731, -13248, -18863, -12524, -24274, -24473, -26941, -21929, -7494, 248, -13615, -28738, -15808, -12036, -19310, -4692, 2454, 17259, 9608, -4315, -19011, -13398, -19800, -28519, -28863, -21004, -8236, 10356, 17050, 6950, -948, -1527, -15818, -11905, -8318, -7051, -10066, -18456, -21318, -30854, -16208, -5597, -17212, -25545, -18565, -14164, -8799, 4599, 14490, 17774, 16829, 1204, -17390, -20526, -14207, -1312, 2774, 13029, 30422, 28742, 17063, 14188, 10471, 12794, 4987, 3571, 8879, 8447, 418, -146, -8058, -7497, -7817, -1830, -4709, -853, 7891, -2072, -21366, -23798, -12431, -11237, -16801, -11213, -13557, -11636, -19091, -9600, -6850, -6678, -13115]
15271a3115L459K753Q93Q824K074r55j1692j439J4316K0259J959j1543r434n953
15257D06K36M510r099j5883q715J2692J428m264J3331k405r249J1917P788m482
15243a789n911j818J1688m993k0947R252Q11o037R863l918o24k04j0109J4775
15229i961K1538o356L331J982p964j7992l560P552L764M394j720p838M555J3585
15215E310K609o863j5932m848K118j418k775N478R785R091P84K083Q806R900K316
15200B6444j2029j2347j0145J1821J0408P698o33j3528p045J3295m895k750N324
15187A1618o854k6984j3921K0853Q747J368Q631J547j864P432k444l849n464J2698
15173A1514J397k1085M648L106P140j29l386L960O33Q741J485q795p484r936k42
$$ y = [-13115, -9656, -6903, -6010, 2814, 4888, 3933, -7759, -9198, 5118, 25377, 27336, 15793, 6359, 406, 642, 5152, -3947, -19830, -28545, -15853, -14425, -18689, -5358, -7763, -17012, -5095, 2693, -1789, -7700, -9518, 2170, -2823, -23770, -14518, -13707, -19744, -9881, -13799, -14423, -14627, -24736, -9961, 11577, 5221, 8552, 10534, 2570, -15422, -18982, -11430, -7666, -3272, -4992, -12830, -8275, 5310, 7919, 1056, -14876, -19724, -17606, -19024, -21799, -16321, -6536, 2555, 3339, 5422, 14228, 24128, 26444, 14415, 2068, -8077, 3744, 14152, 21850, 21217, 7689, 644, 13939, 9044, 6294, 11618, 4764, -22220, -36141, -15288, -6541, -5173, 3458, 5005, 3141, 10573, 8129, 4280, -1184, 11514, 12911, -8174, -3526, -420, 6720, 6591, 3205, 7165, 7798, 16539, 18024, 9229, 1745, -8191, -8433]
15158h433m778j1203R221J2359Q246M847j0656k428R730p45Q926l00j5291J1230
15144A0725Q503r719J829o810n322N81N459K833J1850n793j6325M920M284m464
15130B551L256L878L108N982M795p237j8711j5084q21K967J0690j008n506L709
15116g431J8433M48n255q693M426k383p597J0478O805O338K878l516M238o169
15102A3000M753p07l852j4239P183k0016j0984R224J3962J0084J5885L305K402
15089C0000o234k2377L624K870K944j055l940k049R093j2493m48K256m315o855
15075h979P346M541J46j240l734K408J055Q155j835p239O778J176r529r284r671
15060a9906P005P125p829Q83J0314L729p111J0589K849K37p002n289Q217l193
$$ y = [-8433, -13211, -24414, -15193, -2834, 5412, 10259, -397, -2825, 6905, 6160, 15086, 14786, -505, 10725, 19228, 9509, 11338, 4528, -794, -213, 5246, 8079, 19929, 14136, -2189, 2731, 7015, 2551, 5807, 9685, 12793, 18775, 23570, 16333, -2378, -17462, -18283, -15316, -4626, -5634, -11140, -7431, 11002, 11450, 6195, -2498, 1928, -455, -8052, 2426, 9231, 15569, 18447, 14931, 19169, 13000, 17753, 17046, 13194, -1045, 6138, -13878, -24862, -15638, -1676, 8408, 24293, 27598, 30000, 23766, 1389, 5013, 7883, 10827, 9772, 5832, 3783, 12876, 383, -65, 2191, -2124, -8979, -1633, 2908, 3054, 1814, -1920, 488, 1543, 9698, 7863, 624, 7402, 8578, -951, -10235, -19906, -12901, -5776, -13605, -12722, -2408, 1321, -5790, 4799, 7648, 7885, 883, -4406, 3811, 618]
15046F18K460N330O749j2890O74J0578Q116j3673j6249j057J4556J3058j3291
15033D979r646q036o859M815Q684M961q128J030q41l452n263j1840N299O337M520
15018a3440K379J0256j874m249O96M483j070Q964L663q415j0418R895k93J913
15004B490m684o063m644M907K390o557l504J1705l630K348P498m01j6547l752
14990a8444J614K1493m309k4049j7491Q563J7969J902J6426j2239q97J2586M942
14977H066K150m817p161J4883J1708J286j3176m802M407m452p829j0692L785M438
14963b206J2521Q859m292p695M946l536M016p081j5294o483l367K112M476j175
14949a4199j0504l704O121J6761l812r260r073J0292J2521p641J41j4655o477
$$ y = [618, 3078, 8408, 15157, 2267, 2941, 13519, 21635, 7962, -8287, -9344, 5212, 18270, 4979, -4667, -12703, -19562, -14747, -6063, -1102, -9230, -8200, -9041, -12493, -17756, -29596, -24297, -17960, -13440, -11061, -805, -2679, -6928, -6232, -1749, -2819, 6145, 9808, 1393, -9025, 870, 577, 2490, -2194, -8257, -12901, -7994, -5604, -12161, -15665, -3960, -7590, -5242, 2256, 1855, -14692, -18444, -16830, 4663, 354, -23695, -41186, -32623, -14654, -12752, 3674, -8565, -9462, 3124, 8066, 10216, 5399, -1762, 13121, 24829, 26115, 12939, 8137, 12544, 8092, 263, -10429, -6644, -2206, 10315, 19174, 14882, 7187, 12133, 8597, 12613, 5532, -9762, -16245, -19612, -17500, -13024, -14199, -24703, -28407, -22286, -5525, -9337, -18597, -27670, -17378, -4857, -12498, -12357, -27012, -33489]
14936c3489J6371L912J7021L707j0106j1846O449j291P867K330J2408Q694J737
14923B3764k810j4076k0173q94l433p732P134Q737P055J9274R988L20r488j5989
14909A677K043O708M695q611p1n238p673j097m661P261J726Q969Q260l081j631
14894I276J0397N796k0691j0486j071j160m557N160p192n094j015m356K4225K5889
14880B5121L180m682j3433j1878R77o069O972J4813o717l028J0083J0099p507
14867A7931q598q046l246m298p459J0678n083j7371M373O393J4466J0157N846
14854A5743n821m207q004o096N527J4002l19M939r879j539j41K311n854L777J413
14839E852M955l136r124j205n716j2036R122p090k695r900L226L306P759J1637
$$ y = [-33489, -17118, -13206, 3815, 7522, -2584, -14430, -7981, -9272, -1405, 925, 13333, 22027, 23764, 20954, 6878, -13295, -14189, -17622, -25354, -18220, -9483, -2428, 16846, 26834, 27154, 17666, 1677, 3720, 10428, 15123, 6512, 6441, 1203, -6470, -7567, -12228, -4967, -3241, 5728, 13988, 10907, 9276, 19673, 25469, 4778, -5708, -6779, -7939, -12496, -7336, -14528, -19622, -20637, -24993, -768, 25121, 28301, 23619, 10186, -1692, -715, -6784, 188, 15001, 8284, 5256, 15339, 25438, 17931, 9333, 1287, -1959, -6257, -13716, -3038, -8121, -25492, -21119, -14726, -260, 9897, 15743, 9922, 5715, -2289, -8385, -2858, 11144, 10825, 15764, 5885, 4346, 4205, 6516, 662, 4439, 5852, 10807, 7671, -1453, -2658, -8374, -20410, -11288, -18378, -21073, -30973, -27747, -24441, -16682, -5045]
14825e045k526m942n845q246Q683J4210K1530R70l211r372j2872o526L844J3015
14811C667r674l828J1235k391O272m295j2517l355J7265O923l423l20J5351O424
14797B7334M597M655R65m605j1298n810j3468p376Q969m977J2000N41p976j569
14783A982m354P281J3865M5n971L036j004p763R66L537n07j1391J853R605J7018
14768B8198Q030m063k1389q963k032p320j0849R600Q949M487r030k363j1353r634
14754b7732k259P633m842m273J0095j571J0305J0824j7365M133R108J5323P624
14741A7003j6586j120J5773M687k661k5235k4752l500J3825J3172n944N604p136
14728a6870j2602k925J2756K7804n083O03Q320K689J0438m593j1763j2132j1086
$$ y = [-5045, -7571, -12513, -18358, -26604, -17921, -3711, 17819, 18789, 15578, 6206, -6666, -13192, -9348, 3667, -6007, -9835, 1400, -991, 5281, 986, -11531, -14886, 2379, 9302, 5879, 5559, 20910, 27334, 31931, 36586, 37551, 32946, 21648, 15838, 2370, -5006, 3963, -1014, 10986, 11527, 3551, 1982, -2372, 4909, 18774, 18819, 12848, 15884, 14880, 7117, 8083, 11620, 11113, -278, 1575, 11180, 28198, 36228, 32165, 10776, 1813, -219, -7539, -18388, -8788, 161, 4648, -4382, -6745, -18098, -27732, -29991, -22358, -27200, -31473, -21378, -22949, -12644, -1820, -19185, -15052, -5944, 9379, 17003, 417, -703, 15070, 19757, 17096, -8139, -32891, -36391, -22566, -9394, -15338, -9734, -16870, -29472, -32397, -19641, 8163, 3080, 3683, 12003, 14692, 25130, 20537, 8774, -3358, -14444]
14715a4444o658J3991J2575j4971J084R404l455p49n912l772q537J5157N593J943
14701A249J0431o068r465n830N246O601j209J934m808j5277o287o908J1565R628
14687i198M840n148m069O871k358L328k20J0372k68L680j84q639J3420K292k1425
14672f706k0221J2949N364k018m097q762o55K184L789J3518j412J2712O819m238
14658I226K148Q494k502j7875j3406o708K1525J6171q547j2608j626M832k348
14645c224l690j1059j0106R185p273q843M298J2330J6750j102j3252j102o496
14632b3584O766j617p847M28q046Q615K0006J6943J0567P253p880q012j313p321
14618D958R56N727j0405K5603R732l16n702k0972k2516p938O167J0814P742m717
$$ y = [-14444, -21102, -7111, 5464, -9507, -8423, 981, -2474, -3223, -9135, -12907, -21444, -6287, -694, 1249, 11680, 5612, -3853, -9683, -4437, 2164, 955, 2889, -1919, -17196, -23483, -30391, -18826, -9198, -4358, -9506, -13575, -6704, -9062, -5734, -5954, 4418, 4150, 7830, 7646, -993, 12427, 14719, -6706, -26927, -13978, -8614, -10632, -14729, -23491, -24146, -21962, -18173, -4655, -6067, 6645, 13464, 9226, 11374, 19868, 17366, -509, -13915, -20623, 902, 17073, 8526, -4082, -5708, -876, -3224, -6914, -17973, -28079, -18894, -26167, -35010, -30712, -18382, -1632, -2734, -15986, -17088, -23584, -16818, -18435, -26282, -25854, -33900, -25285, -5279, 11664, 22231, 29484, 21604, 13592, 12279, 4958, 5914, 11641, 1236, 26839, 36571, 36255, 30553, 9581, -12935, -20873, -14706, -3892, 3850, -867]
14604h67Q474O79j1731J3684L564j9894j6559p13P537J1108O26o958Q465J241
14590a344R234j184o590O962j1324Q385K854L79q725j0959O171o908j3506m060
14576c0615K16P725R93N163N597l074o250P257j0532J27O988M071J4150O900M402
14561A3118J0124p050j6426k796J974l778M366n072j946L012L362j325q292o416
14547a7145R060M095O97K0183n852j580J0755k473j3285j0204L738R268P14j0401
14533b430j0392k717O155J5626l131j0829j5084k966Q693J2734J649l852J660
14520d884M42J631M614O401N622j0112j7788P483K0551K274n141q587l000j2182
14506a2676j4033l735L443L611O226J5511K673J390j782l327j7854P437N19P948
$$ y = [-867, 7607, 8286, -3445, 10239, 13803, -6091, -22650, -23363, -15826, -4718, -4092, -11050, -2585, -1344, 7890, 6706, 116, 7078, -4246, 4139, 6993, 7372, -1353, -12312, -6141, -13049, -26555, -30615, -30399, -22674, -21681, -16518, -10921, -13995, -20245, -12988, -23520, -23393, -16405, -12334, 1816, 8716, 13118, 23242, 16192, -234, -3030, -1056, -4834, -468, -5540, -7486, -4474, -1112, -2437, -10729, -17145, -8085, -3990, -3293, 16890, 11038, 9458, 20213, 17740, 4455, -5749, -2011, 7257, 7971, -2430, -12822, -15539, -9384, 6242, 3111, -7718, -22802, -25768, -17075, -4341, -2692, -6544, -4884, -4442, -2811, 1803, 8204, 13826, 3714, -14074, -6591, 13960, 16234, 11093, 2506, -494, -12676, -26709, -30444, -27001, -23390, -17164, -1653, 1020, 2410, 628, -2699, -20553, -13116, -12597, -4649]
14492d649Q564J541R33j3207Q379J4149O626J162r187P90K529R241k587n791j1250
14477G243M428M917P205k2719m842N721r379m476K691J7181J6211J1362j687q655
14463B5201j642p852p838k1162J1614M673J139O333L149j650m847j6051K840J2168
14449F075k0140j6593M236R733r616Q838J4161O215n567r464Q630J9325R862J130
14435B6825K771L906k168j6673j1207P632L25l267j0463j4408l40Q697M111P089
14421B830j3525l090J1192J0531O224j1791m275j1526k058M461L581P679o118
14408e885l480j161J8906N677q577j5052m510K4131q68j4971N449j624J2475L769
14394A4279j046k685o292K66j0817p198j013l258j2029P679K1204J0524q555q653
$$ y = [-4649, 3915, 5456, 6389, -6818, 1561, 15710, 22336, 23498, 14311, 15101, 17630, 26871, 24284, 18493, 7243, 11671, 16588, 23793, 1074, -3768, 1953, -7426, -11902, -9211, 7970, 24181, 35543, 33856, 25201, 23559, 15707, 7869, -13293, -1679, 2994, 4133, 10466, 13615, 11965, 7118, -8933, -6093, 6075, -14065, -30658, -26422, -16689, -26305, -17467, -3306, 2909, -2658, -12122, -3492, 15833, 25695, 26825, 29596, 33502, 31334, 14661, 3454, 11086, 11411, 8144, -2319, -16727, -17067, -8370, -4259, 2830, -10695, -13785, -2593, 7938, 14162, 2371, -1904, -13430, -15488, -11027, -7446, 233, -5885, -9365, -10526, 8380, 14057, 5480, -9572, -14082, 10049, 9181, -5790, -341, -1965, 10510, 14279, 13233, 10548, 4256, 4522, -6295, -13493, -14506, -17764, -29793, -22114, -910, 9614, 1059, -7594]
14380g594l062K546J1384j621Q651L947j1683M377L26j2387j3245M056J0305K498
14366a502J0296R237j0219j0227j1278K806J2364k0973j0082O744Q245J830M339
14353h420K6066J0054p09j0899k441o765p07j808l881N776J3026j108j6641j3181
14339a1638r957J0157P556j1664l970J5785R73p305O726L436J743K725J2058j872
14325A4753j659r429O65K108O24j257r317j3403N889m438q810J0930L317J7394
14311G367l180m922M973r313r810l830P752J3853J0926R51j4178j912J603L596
14297C876o64J534J3518P480p942j3495O52J0504l361k5674M304P437q219P210
14283b840Q422j183N087o088Q49k795J19j308m877J950N904o128k81l233J704
$$ y = [-7594, -10656, -8110, 3274, 1653, 10304, 14251, 2568, 6945, 7271, -5116, -18361, -14305, -4000, -1502, 8794, 18031, 7812, -2415, -13693, -10887, 1477, -19496, -29578, -22834, -14589, -12759, -8420, 17646, 27700, 26991, 16092, 13651, 6886, 6179, 4371, 490, 6266, 19292, 18184, 1543, -11638, -21595, -11438, -3882, -15546, -19516, -3731, -2758, -10063, -3337, 99, 1842, 4567, 16625, 14753, 13094, 3665, 4330, 6438, 7062, 5805, -3512, -16915, -11026, -15464, -24274, -13344, -10027, 7367, 4187, -735, 4238, -5075, -14885, -18715, -10963, 2890, 13816, 14767, 589, -1323, 280, 3876, 3212, 4746, 18264, 25744, 17802, 4307, 4959, 15463, 12102, -13572, -9268, -1831, -10050, -2840, 5582, 4399, 9486, 3398, 4247, 1452, 1571, 263, -4614, -2664, 3240, -2888, -3169, -6402, -4698]
14268d698P056J0364k606j0088r762J489J3049p040L521O183K2833Q093j3838
14255B4556k365K505l661j7200r902J180j284o212j1214M387l232j169N57M839
14241a8215P560J830r260j2957Q788J6612k764o097J9473R296j3633p180M370
14228b177J0966R714N264J0018l2j792k4048q62k587p162q878L294J4376P952
14214A4046r249j1712k247m040n431r503Q987Q939N053m372M973J4877Q845j0955
14200H211p473J0963j727j429q806k218P182j0614N674K0682Q582j5654j6121
14187b748o415j452J678J1690k490r220M923n056J0296R377k052m052P147O398
14173A8024m523l655J89Q86L813J0885o958j8411k3775j9504J0294J2009J1373
$$ y = [-4698, 2358, 12722, 10116, 28, -9734, -8245, 4804, -2236, 1285, 7468, 30301, 38394, 24556, 22191, 24696, 21035, 3835, -6067, -4887, -6171, -12383, -23597, -19210, -22442, -23611, -23054, -18215, -10655, -8825, -18085, -31042, -22254, -5642, -8406, -14503, 4970, 14266, 633, -6547, -2177, 8789, 18503, 23767, 33785, 33753, 31961, 7913, 7051, 4464, -2698, -11576, -8282, 6094, 14046, 4797, -6915, -9162, -13202, -18633, -28136, -19149, -10210, -5157, -9529, -4556, 10321, 19166, 8211, 738, 11701, 9974, 8545, -261, -2479, 4703, -5911, -237, 20445, 29027, 13373, -2748, -9163, -10615, -8937, 2753, 263, -8957, -4034, -9090, 1206, 10583, 8531, 4479, 11626, 18024, 13501, 9846, 10035, 10921, 14734, 25619, 18661, 250, -23525, -43029, -32735, -20726, -9353]
14160i353o52J068O441O848O611J2706O305Q751k941p901j5945j3944o067R880
14146A807m416j0368L557j2598K748R995Q952Q59O946J0940j4530k1864j022K2346
14132C352P267o805p21L783L762K090r920m015R976J0024p661j4456j1387J0424
14118d287J5401j4820j2618j1409K593M661Q330J358O73n599o344R565M905p97
14104h388K181L131j2368k36L955m704J167J6589J693J587J0257n372q860j230
14090e98J609j1288q125j1421k361O220O013J480J5912Q003j879O526j0736k202
14076b847P281Q697L159L305P246l199j1246p122q010R883o599R45q344M152j148
14061c847l947q661q578K257J5890J1158l545Q609P094j6431J336N672j0686j3363
$$ y = [-9353, -10005, -8937, -2496, 4352, 10963, 23669, 29974, 38725, 35784, 27883, 11938, -2006, -8073, 1807, -2609, -12977, -9420, -22018, -19270, -9275, -323, 536, 7482, 18422, 3892, -17972, -18994, 3352, 10619, 3814, 3093, 6876, 10638, 12728, 2808, -1207, 8769, 18793, 11132, -3324, -14711, -4287, 11114, -3706, -16324, -27733, -25140, -20479, -12149, -10791, -10118, -15717, -22061, -12496, -7591, -8388, -6207, -3076, -15444, -15680, -11725, -16429, -15262, 1327, 3020, 4607, 14864, 9492, 632, -598, 1011, -10277, -18402, -29823, -32184, -25964, -19951, -18471, -2559, 5444, 3565, 10091, -645, -2847, 4434, 13131, 16290, 19595, 26841, 23642, 12396, 5274, -2736, 7147, 548, 1493, -6851, -2699, -3847, -7794, -16455, -25033, -22776, -6886, 4272, 727, 9336, 16430, -1, 1335, 7007, -3679, -17042]
14047a7042j76M375N657J2479p45N77p407l656J8290P766P977L800n270q674n664
14032A2287M577k0208k059J4479R024O73M253l089k122j4723j595M861O868l449
14018I777k201M429m943p61j8301m440r822O265k797J0276p13m563O412o665J5139
14003b908O255K973O957r90p376q619j8754R579J0955L069mn468o401j170o814
13988a8716J0332J5978P482m166J099j3021m815j668P808J759M93Q073O842j0346
13974G134J273q64j9317J195M387j0602J508J0154P132J0496j547N830p67k4061
13960h049M775o042l139J7085L527K368l522o365j4233k03J9507N382p05J310
13946A1696P477q250j9265j0095M859L339P064m587j1137J5478J4670q657j0048
$$ y = [-17042, -17218, -12843, -7186, 5293, 4548, 5125, -2282, -5938, 12352, 20118, 28095, 31895, 26625, 17951, 12287, 16864, -3344, -5403, 9076, 18100, 18773, 23026, 19937, 17815, 3092, 1497, 6358, 13226, 9777, 7576, 12005, 7062, 6301, -12000, -16440, -26262, -19997, -22794, -12518, -13231, -17794, -11382, -18047, -2908, 3347, 6320, 13277, 12287, 4911, -3708, -22462, -12883, -1928, 1141, 1137, -4331, -10732, -11902, -18716, -8384, 7594, 15076, 10910, 12009, -1012, -5827, -7495, 313, 2072, 2565, 10638, 17480, 7134, 8407, 7543, -11774, -10579, -6192, -16794, -15286, -5132, 2000, 12496, 10949, 16779, 16012, -8049, -3274, -9316, -12455, 4630, 8157, 10525, 7003, 638, -13595, -13798, 5709, 11091, 10386, 11696, 19173, 10923, -8342, -18437, -13578, -10239, -3175, -7762, -18899, -3421, 11249, 2592, -7456]
13933g456J944J1681J090o723p108L198m532N35J2318L66k7711K296J8200N231
13919C329N748M955j158N530l320r52q606j3018P868O284j781N973p720K014L481
13904H627j2083l563J2664K876p41m469L568N760k148r80o798O707J6949J611
13890B7980j0396j1376o268j1928j97k324n443n302p590J209o261J6568Q251j154
13876a4231Q231J22k350Q509K425l877K082j610M30R483p706j4614M863Q565J103
13861A425K670O84p366j667q754p453P313N922K2629L170j8054o080J276j5250
13847a9535L385J436J1870p445j2291Q056M370O29P673J4209J358O913m156M70
13833A6942j6440j513k011P338P70M163J7121m192k3676m38l770o376L099o686
$$ y = [-7456, -5512, 6169, 7259, 536, -6572, -3374, -7906, -7371, 4947, 5313, -22398, -20102, -1902, 3329, 9077, 14032, 12874, 18404, 15084, 14132, 5526, -7492, 376, 6660, 4879, 10852, 3132, 5146, 8627, -3456, -7019, 5645, 8521, 7780, 3311, 6879, 12639, 10491, 9511, 2713, 9420, 26369, 27980, 17584, 6208, -60, -11988, -12185, -14509, -19952, -25254, -32844, -31635, -37896, -21328, -13077, -14231, -6000, -5878, -8228, 281, 2706, -1171, 911, -699, -269, 9214, 1508, -13106, -8243, 322, 1425, 4095, 4779, -2587, -4254, -13008, -20461, -13148, -7226, 15403, 18573, 519, -5561, -4285, -19535, -16150, -14714, -2844, -10289, -22580, -14524, -10154, -9525, -1852, 12357, 13715, 20628, 16472, 16942, 502, -1011, -3022, 4316, 5086, 9249, 26370, 22178, -1498, -1936, -5706, -12082, -8983, -15669]
13819a5669K2196o599J728m939j3009j5591k11Q775J157J8147J0486m440J168
13806C199O757n298q265J108q782J1096K4p606L361j3023k056r16m201O363J8469
13791B30N445M124l134m129m941Q036l736j0623P48p442K23j5872j0233L0721
13777a0583L6700M661j8785Q21q23j0082j0724J1055L819j0159J435n033m080
13764a1778o403N53K544p49o954J1965J3227m75m725m29q708J6578M526p839j0184
13749h851J3635O486j1586J587J1568o252K014p30j4713o972J3527o19j2958o872
13735b0736O062J2133l604j10j2451M099J1519J2597j180r579k710l441j8156
13722b5557m659K309J7510J5265j1701o995J232K0400J3510k470M060l250j6544
$$ y = [-15669, 6527, -72, 1656, -3283, -16292, -31883, -32094, -23319, -22162, -4015, 6471, 2031, 3199, 9956, 4658, -3607, -2499, -11281, -185, -161, -7767, -4406, -17429, -19485, -20401, -24602, -18239, 230, 5675, 9799, 6665, 2536, -2405, 5631, 1895, -8728, -7980, -15422, -15199, -31071, -41304, -10583, 26117, 30778, 11993, 12814, 11991, 1909, -8815, 2240, 6059, -4100, -2665, -7698, -11778, -18181, -17628, -15084, -15833, -22787, -10822, 2405, 1930, -2795, -3224, -11932, 4646, 9172, 1333, -8851, 4784, 11270, -316, 1271, 12839, 6587, 8601, 7871, -6842, -13814, -287, -906, -13864, -20736, -14674, -2541, -6145, -6255, -18706, -14607, -3088, 9509, 8329, -1250, -3960, -7401, -25557, -30216, -27907, -10397, 4868, -6833, -13828, -12596, 7804, 21314, 18844, 22904, 19654, 3110]
13709C110p441J0435J1492M30m963q723k469n390o012q91J1405J077K640k823
13695A877j652N134o770M572J2964N003k202j8109o07J2067L488p581j7668j3036
13681b2520k811L628M028J2064N901q2J2023m88r622j5716r456L765J5594P495
13667C803O631J411k6484p101J271J7614M203J087l582Q949M74J370j0164N112
13653D594j45L483O819r316j3046k64N458M348P922P547l883p458m624j512o63
13638g40P232J2476l176j4134j6108m199K769j583Q323J1599j7843j4934r394
13625c9712K4049L731m174j093J2263L82J2575M204q480j1262p236J5046L869
13612D162M955m81K877J3788P290l449j2378k6618r33J0711l877K724k956n068
$$ y = [3110, -4331, 6104, 17596, 18026, 13063, 4340, 1871, -3519, -9531, -10422, 983, 2060, 4700, 1877, 225, 5359, -1411, 3161, 16125, 21128, 18926, 817, 210, 12277, 15765, 8184, -9484, -22520, -25331, -21703, -17675, -5611, 290, 208, 12231, 11743, 2121, -13595, -23051, -19286, -3692, 3803, 10434, 11845, -14639, -21740, -20469, -2855, 1348, 2435, -1147, 7802, 8276, 9646, -518, 4594, 4449, 7932, 14751, 5435, -7611, -7875, -2417, 1931, 9853, 17400, 13517, 6059, 1435, -77, -740, 6492, 18968, 15792, 1658, -14450, -18649, -15880, -17463, -9140, 2459, -15384, -30318, -39712, -15663, -11932, -16106, -17199, -4936, -4554, 8021, 12225, 3745, -7517, -14753, 293, 4162, 9117, 8636, 11513, 25301, 32591, 29142, 16764, -9854, -10787, -76, -3953, -1229, -4185, -9253]
13598i253k1360m932J4609M785J2350J0005J1361r986K252J179l955n275j0115
13585h335k142K87M835J0085j054j4134j5154Q389J4438J6775M194r276r108n507
13571e707j148j0066m266M21J7755K1334j0025j2913n48n487j2608j1425o363
13558d1046J3100K2338J7708J1788N88q092k4095j1586J2306p23L182M569K564
13545B601o263J2167P655j797o143N04l075n790n882n63P193q919j0345n756j0870
13530c5283J1757J2149N1j78M498O253J4326J4029j833j955M166p184j9323j9511
13516a8038k004n181R622J6780L648j5551K007q241P254l693N676J2895m048j0331
13502i205Q298O492n211K775j330j3046j6947k227j356Q437J7405O478m063q65
$$ y = [-9253, -30613, -35545, -20936, -16151, -3801, 6204, 17565, 7579, 9831, 11010, 7055, 1780, -8335, -10477, -10190, -5355, 4730, 3676, -10458, -25612, -17223, -2785, 13990, 18184, 8908, -200, -5707, -6855, -16921, -21187, -20766, -3011, 18323, 8298, -4615, -5163, -10650, -23258, -34683, -41046, -27946, -5608, 12100, 23888, 24476, 16384, -7711, -19297, -6991, -7714, -4532, 37, 2601, -3662, 8505, 16160, 14363, 8220, 8724, 5649, -141, -6023, -6586, 607, -8312, -18657, -24413, -35283, -23526, -11377, -11326, -11504, -7006, -753, 13573, 27602, 25769, 23814, 27980, 20796, 1473, -18038, -20042, -25223, -15601, 1179, 4827, -10724, -8717, -16958, -9704, -13397, -7721, 5174, 1126, -9205, -907, 5585, 374, 3149, 1819, -11227, -28174, -30401, -31757, -23320, -5915, 563, -3500, -4365]
13488d365Q45n490P816r96L636K1818N045o769j1235n356r277l658n862K035l901
13473a5714l139j323J0193J0577j6179j0480N944J5027J8383L50l372j6653r826
13460a6212J3256J3225K372L157J4680o724j1099j4309l135J2232J4595j2650
13448I388j2126q075M839J2782m331j1947K282k214j1179J0369R541j5906J1979
13435d598R720m1R944L550l874k487j2310n065L371j713J0336k891K333j044m897
13420C34n667J4307J2190J787J1526q389k2781n041o305P3L109J53Q318N696m136
13405E174k1737j3532J1533J8278n149J5407n881j5581o0n679j915J0929J4393
13392F180Q560o322p083n746j1979N170J509J9123J2091o576k961j186j2066K505
$$ y = [-4365, -3520, -9010, -1194, -2190, 1446, 23264, 28309, 21540, 10305, 4949, -4328, -7986, -13848, -11813, -15714, -18853, -20176, -9983, 594, -15585, -26065, -20121, -5094, 13289, 13639, 10267, -6386, -16212, -2956, 10269, 12641, 15798, 30478, 23754, 12655, -1654, -4789, 7443, 22038, 9388, -2738, -10813, -5974, 6808, 2477, -9470, -7188, -9402, -20581, -10212, -671, -16577, -4598, 5122, 5081, 15025, 18575, 14701, 12214, -96, -5161, -1790, -3503, 6833, 3942, 6275, 5231, 334, -5333, 8974, 21164, 22951, 34477, 26088, 3307, -1734, -8039, -7966, -4857, -4704, 3614, 9310, 5174, -16563, -30095, -18562, -284, -5433, 9974, 4093, -11488, -11548, -17227, -19142, -8213, 6180, 14740, 8418, 1335, -4411, -16390, -11220, -9711, 9412, 21503, 14927, 11966, 10780, -1286, 1219]
13378A219P693L64n276J781P342Q475j7283r454o769J0371k944j1115l178O738
13364a2036M2o144J6049m38j2739p944P660N777N792J7446q140M940N241j407
13350A4099l089p149L048n586J294Q605N089R88M695R169j3021n820Q52j3596
13336d22o364Q598l926N80J2423N057j2647j0665n397m72J0085K661P356k849
13322D018j8121j395P122K667J5418L952Q66L176n619r86J0038r230n807J400
13308G499P323rm107j930q281m382J4028R647m265K825m993p59k1142j0251O920
13293a1877J0355O146o737N004O181k892j2829j1676K786J091j0526P437J4651
13280b886m493l234J9721J5333J191j0977j6919R677J2363j5226j008J6260K408
$$ y = [1219, 8912, 9276, 4000, 5781, 13123, 21598, 4315, -5139, -11908, -1537, -4481, -15596, -18774, -12036, -11994, -18138, -2089, -2527, -15266, -23210, -15550, -9773, -3981, 13465, 5325, 10265, 15506, 14099, 11010, 3861, 6909, 1323, 2617, 11222, 16311, 17299, 21994, 31163, 18142, 12322, 13174, -422, -6786, 1812, -2114, -1534, 10889, 15946, 3299, -7366, -12763, -13235, -3150, -489, 6867, 4018, -14103, -15498, -8376, -5709, 9709, 13661, 14527, 17703, 12084, 11098, 21136, 11906, 6099, 7499, 14822, 14813, 10706, 8776, 495, -3887, 10141, 19788, 15523, 18348, 13355, 12596, -8546, -18797, -11877, -1522, 4624, -2113, 2891, 9072, 6180, -6649, -18325, -15539, -14448, -24974, -17537, -2886, -7379, -10613, 9108, 24441, 25632, 14655, -2264, 7413, 19776, 4550, 3542, 19802, 22210]
13267B2210j631j527J1604n201j0533j0396l809j3862j3803n199J3683J7314J0515
13254I365j1239j6632l189Q054Q598J1649L922M023o481k874Q479J6933l975k3921
13240B712o019J2017r860j1290k956R785O976q442n50M457n347j0678n941q595
13226c3731J1271K1934R525n166l310q073l829J234O975n209J0194l904m619l099
13212i807J2893o92n057P69q165N319Q584J3101L215r563j5252o146J1615J3669
13198A4483l626n49l994j4194L246Q056o898o048K693n509k576j139J4353m37
13184b139k303p886k487Q474k403R045r802m343k0192L428K0741J2124O803k303
13170F757r050j042M972K419J1061p403L450J6735o444j8550n314J310N170J3299
$$ y = [22210, 20579, 19052, 30656, 25455, 14922, 4526, 717, -13145, -26948, -32147, -18464, -1150, 9365, -1874, -18506, -21695, -13641, -5043, 6606, 10528, 14551, 8070, 5196, 13675, 30608, 26633, 2712, -3307, 8710, -1150, -12440, -15396, -5611, 1365, -7077, -7627, -3170, -8517, -19195, -25136, -33731, -22460, -526, 8999, 3833, 523, -7550, -11379, -10145, -3170, -8379, 1815, -2089, -6708, -9807, 3086, 2394, -2663, -1894, -10059, -4740, 3844, 16945, 20160, 10597, -4655, -10801, 814, 14483, 10857, 10308, 6314, -7880, -4634, 3422, -3476, -9524, -6831, -12340, -14916, -16055, -1702, -2139, -4442, -12328, -14815, -6341, -8744, 301, -9501, -13844, -34036, -30608, -9867, 2257, 9060, 6757, -2293, -3335, 1637, 4056, 15117, 7714, 11164, 27899, 21455, 2905, -2409, -1099, 4071, 17370]
13156A7370Q26k3306j5199o838K0572J5981p787j2590j474k734P050R47M052J8185
13142A5055q818p288j0193l450J3285P149o090J3108M465Q272j2934j4489J3485
13129A1557L396l443J0430R87k4698k272k210m276L176J3006O768P491K448p364
13115A4996j8144r578o551j0602L25O378l469J5678Q310M178n710q916K486j1308
13101b1927K012J0688J2601n50n718l522k151R42P918Q54j3161p660j308J9365
13087a617J4745J1623K058j2010k4834j407R361p767j726j2648k618O733M087
13074a6020K200J0900J0045L946N455M227M623R982q548j2652r25P425K722j2275
13060A1105j196o490L148j2985k8888J3091J4224n722j082P567K4453L118O358
$$ y = [17370, 18196, -5110, -20309, -27147, -6575, 9406, 1619, -10971, -12445, -15179, -8129, -7182, -3130, 15055, 6237, -1051, -11244, -14694, -1409, 5740, -350, 12758, 17223, 25495, 12561, -1928, 11557, 14953, 11510, 21940, 22927, -1771, -4043, -6253, -10529, -7353, 5653, 12421, 19912, 22360, 14996, -3148, -12726, -19277, -29879, -29554, -23176, -26645, -10967, -2657, 1521, -4189, -13105, -10619, -21927, -19915, -9227, 3374, 2824, -2894, -6416, -8567, -7625, 293, 1147, -12014, -19674, -20982, -1617, 13128, 24751, 26809, 14799, -10035, -11442, -2081, -9848, -11574, -24222, -26840, -20107, -16020, -13820, -2920, 7125, 11071, 16526, 20753, 25376, 35358, 26810, 14158, 13233, 20658, 23380, 11105, 9909, 3419, 6567, -6418, -35306, -22215, -7991, -13713, -14795, -7228, 17225, 20343, 26701]
13047B6701J3981q629j1069J2083p22l031j264j4965r464q659J3339M058r182
13034C177o441j1260P45P035J2392j5626K377J1839N62m924n811n37j406o551
13020a4429K487j4073J1869J4343j277p087M001M416L794l356Q057J7364K238
13007B8347o215J867k476j051L12p838j0865o446N701L10m039j020N166o605j0534
12992a5386O299J8229k2159n641J3855N957o634N975R879N661j1448J961K430
12979H978k143m392o86q863m348K802j97j537M72P113K016o767N066j2306k418
12964a7210Q006O63k317k302J1338M336n637o619m230j1440O516K0712N576k0519
12950a3127j3451P245R247J5578J4132k929o45k0985M399p09n17J5199P524r010
$$ y = [26701, 40682, 32053, 20984, 33067, 32345, 29314, 28050, 13085, 3621, -5038, 8301, 12359, 3177, -3264, -14524, -13779, -6744, 5648, -9978, -7601, 4238, 4800, -124, -5935, -6472, -7878, -14429, -11942, -26015, -14146, 197, -1080, -8167, -4166, 250, 4044, 688, 8745, 26109, 28347, 22132, 23999, 21523, 20472, 20784, 12946, 2081, -4365, 1336, 1646, -2393, -3413, 1753, -4852, -15386, -9087, 9142, -13017, -18658, -4803, 1154, -5480, 495, 10374, 16035, 4587, 6548, 8978, 6835, 2443, 1757, -7106, -11454, -8652, -8849, -10386, -9914, -2801, -785, -7552, -2486, -14792, -17210, -9204, -8541, -10858, -13160, -1822, 2514, -3123, -9742, -13972, -25412, -18896, 1816, 7392, -13127, -26578, -19333, -10086, 5492, 19624, 16695, 16050, -4935, -536, -1245, -1762, 13437, 20961, 11951]
12936A1951j772M53M553L759j4543Q487J5584j6152j7996n187p61J3321J2854
12923A4551J7472k763j1334J818k053r442k869P038J963j3890n79j1548q669j282
12909b1587J8687J6300O777P04P701q605m912q456L24L903k758M19j1429J65J0846
12894H079Q842p924k2477M445L305l69k007R239Q433m272J071q783l782q737J0618
12879d319J3196R700k930n082j2818j3615K073M110k745j0000l144J0795m525
12866a9304N132J7887N340p434L187l64j169J5129L834j2013l419p058l111R50
12852b413l019l256j26M55J557K4833J1191n093o431Q740j420j1073r668M407
12838H684n226K327J1670k2117j7874m914k009p789j484J5758J9400j5630j2130
$$ y = [11951, 10179, 10632, 15185, 18944, 4401, 12888, 28472, 12320, -5676, -10863, -11624, 1697, 14551, 32023, 29260, 17926, 19744, 17691, 8249, 5380, 12418, 14381, 491, -88, -11636, -20305, -21587, -2900, 13400, 20177, 20881, 28582, 19977, 15065, 6609, 6933, 10836, 8078, 8497, -2932, -2767, 8079, 16921, 8997, -13480, -9035, -5730, -6099, -8106, 1133, 9566, 5294, 6365, -2418, -6200, -14937, -4319, 8877, 18577, 15647, 10565, -2253, -15868, -13795, -9685, -12430, -22430, -25574, -14779, -19304, -14172, 3715, 9055, 1621, 4808, 4444, 3275, 18404, 22238, 10225, 6806, -252, -3363, -2413, -5432, -8688, -8814, -8359, -6802, 18031, 29222, 24129, 17698, 26438, 25018, 13945, 4277, 8684, 3458, 5785, 17455, -4662, -22536, -27450, -29459, -37248, -38732, -22974, -3574, -19204, -31334]
12825c1334Q219O013J253J3981P699j6374j1343j1326O908K1817K005l903n707
12812a2092j0301N555K905k516l673n576J2015J1023N534m900R558J8403o577
12799A9358l367m195k502Q466q661j2746j295n107l590n596P916K0838j923p719
12785a23n552l090P283J259k783J2138Q023j1274j1547m062O024Q008n10l036
12771G58L726N017k506o675k013j582P903J8060N533k774j2429j8806j5786O025
12757a5549M224m481N942N597j987j94l617Q667J212n726j1634r158J2067J2973
12743a664j810K0069O357r139m780p297k784o771J744Q07L578J0000L483k358
12729I435r123Q091p312l280l285oJ2386K974n281J4638J4691m244K00k0393j9056
$$ y = [-31334, -23115, -17102, -15849, -1868, 5831, -10543, -21886, -33212, -26304, -4487, -2482, -6385, -12092, -22393, -16838, -13933, -16449, -20122, -25698, -13683, -2660, 2874, -2026, 7532, 25935, 19358, 15991, 11796, 9294, 17760, 9099, -3647, -4942, -10049, -13639, -19235, -11319, 9519, 7596, -123, -5675, -8765, -1482, -223, -3006, 9132, 17155, 5881, -5666, -9728, -3704, 4304, 3794, 758, 4484, 9501, 6995, 320, -1693, -3275, 4628, 22688, 28221, 25447, 13018, -5788, -21574, -15549, -11325, -15806, -9864, -4267, -6254, -6448, -10065, -1398, -186, -5912, -17546, -26704, -14637, -1664, -3474, 16595, 22952, 13813, 9033, 1736, -1048, -7819, -6075, -5268, -1690, 8310, 11793, 9435, 312, 8403, 1091, -2189, -5474, -5480, 6906, 9880, 4599, 19237, 33928, 29684, 29884, 9491, -9565]
12714i565j2453J2213K0514P316n237j0355n071L038K46Q6o14J925J1827j361
12700A2509J992j3658j1703P698l47K225m183N065M393J648M906n480m374O573
12686G264n771N62N254K6547J661j7905j553L959l659O604k145j567r755j5413
12672e917N686J3634J7926q477l312p059Q31o721K466R482O490j7262m332K483
12658E918M228r638k953L067L40J87k341J4576q818L294J12j4872j707L837n59
12643e329p7j90J938L971K287r03o03o364R834l964R473Q354Q350j6353k9379
12628a8955o080L033J6008R941J0267M338n559o253K777J0627j1928q309m227
12615d320N229R746o167j4353N637K247P87m579J2879R690o126J592q897Q777
$$ y = [-9565, -22018, -9805, 10709, 18025, 12788, 2433, -2638, 400, 646, 732, 118, 2043, 13870, 12509, 14501, 843, -10860, -3162, -3509, -1284, -5467, -402, 3991, 5639, 10545, 5065, 691, 7264, 1493, 2055, 7309, 33856, 35517, 17612, 16059, 20018, 16359, 22963, 20818, 19251, 9496, -5917, -231, 13403, 31329, 22852, 19540, 12481, 13312, 6591, 9057, 18539, 25029, 7767, 3435, 5918, 10146, 508, -2445, 622, 962, 1149, -1192, 13384, 4566, 7860, 7972, -6900, -8607, -4770, -5329, -5406, -5596, -3658, 313, 2600, 1697, 1094, -5270, 4564, 600, 10073, 18427, 26777, 10424, -18955, -25035, -22002, -5994, 3947, 14214, 18552, 12993, 6740, 9517, 20144, 8216, -93, -4320, 909, 10655, 4488, -9865, -4228, -1981, -1194, -5773, 7106, 16796, 10670, 12262, 3365, 12142]
12601A2142m168m583J712q796j218r597l669M606J3283M9J139O675N87j0864k183
12586d885j0779m233o754n664L912J3814k454o500j727p804P97k112K261Q188
12572b3940O343j948N021R920J7414R745j450J696q994p637K49r062M847o627
12558d423j5144R004P335N610j3455o115p440R269J3095j682o700j0336R168J664
12544a0150p452O221n924m342Q132LJ217P880R160L333J841q178J4394j509j3412
12529A214q564p148m764M861K3889J3144M34p073k132m760p1J112J0094j1359
12515H877j6733Q934j7j3867K274J1042K286O351J5474k1635j6915R826L710q420
12501h813o862P135K874P727k203j268J08Q31Q66o042o68N03J0634O780L13O541
$$ y = [12142, 7974, 3391, 5103, -3693, -4911, -14508, -18177, -13571, -288, -239, 900, 7575, 8162, -2702, -4885, -15664, -19897, -26651, -32315, -28403, -14589, -17043, -23543, -25270, -33074, -32277, -34389, -32128, -23940, -17597, -19545, -14524, -4604, 12810, 22555, 21105, 22801, 13807, 6170, 6419, -2643, 2204, -4423, -19567, -10563, -3228, 2382, -11073, -17188, -24628, -15359, -2264, -3946, -10646, -20982, -11814, -10150, -17602, -11381, -17305, -21647, -13515, -13512, -12295, -4415, 4745, 8078, 9919, 1741, 16135, 14626, 1214, -7350, -14498, -19262, -14401, 9488, 22632, 23066, 15993, 13861, 9101, 9030, 10142, 20236, 8877, -7856, 1078, 1061, -12806, -10532, 510, 2796, 9147, 24621, 2986, -13929, -4103, -393, -8813, -15675, -8540, -5666, 2061, -142, -1410, -1302, -471, 395, -5647, -6315, -5812, 4822, 11602, 11915, 18456]
12485A8456J2844N868l474q372m252m153j1909l972j6947j4111J5130J6366O109
12472G583j110j711J364J640j345K655J34l095K133O051P945q571n01r482J301
12457D991m672L503K209j3560p878j339J0067M010J1819l353j3950k766J745M398
12443d776p623j0284Q23L059p928l457R961r734k577J1306J3748P02N224R723
12429H167N79rJ504L121n984k281J0062l437q368j2566l372R935P254q402K544
12414a253p656k620N233N786J2509L832j1759P676P924k681R979O24j7046q866
12400A682j575j2601M884O277K396K460j8117j4860J3948O366k855R089O767N11
12386D372j7230j5072J7438M891P890k399k918K059j0031j3398K0474P247J599
$$ y = [18456, 31300, 37168, 33694, 25322, 21070, 16917, 5008, 1036, -15911, -30022, -14892, 1474, 7583, 6473, 4762, 6126, 7766, 6421, 9076, 9210, 6115, 8248, 14299, 22244, 13673, 13172, 3690, 4991, 319, 3822, 6031, -7529, -15407, -16746, -6679, -2669, 9150, 5797, -8153, -10919, -9174, -4776, -12399, -22683, -21860, -18801, -26729, -30186, -20225, -29959, -32536, -21230, -7482, -6780, -1556, 8167, 8746, 8737, 10241, 13362, 7378, 5097, 15159, 11722, 3354, -9212, -12584, -2649, 4605, -3797, -1253, -8909, -11529, -6296, -510, 11999, 15831, 4072, 11748, 19672, 16991, 26970, 27594, 10548, 1682, 107, -12494, -7610, -1333, 1063, 3523, -14594, -29454, -15506, -9140, -11995, -2906, 3861, 4372, -12858, -27930, -10492, -5601, 2289, -110, -3028, -969, -11000, -24398, -3924, 3323, 4922]
12373D922j7900q889O236J1666L937k515L717J381r447O217j587J0222j064j390
12359E506j0817j1936J9475Q795m104j9397l268K2359J5614j457n912l482O636
12346A8012r692K585l909n457m36N738q062n352l106n994J3025l063j4671l378
12332b3760o592J09N042J2960j835N428L664n123J2113N347j4472o726q142K382
12318a9605Q740J0600J284J843k36P242N554q305q740J2273N9k3531L008J4605
12304D791k660j1533M903j1323j3648l355J7300N540j1989K408j16N590Q499J7582
12290A1989J6199Q370j3444j6859r977j5064k279J0703Q162q61P320J828L685
12277I772j1080r271M04N207m260O441J4971L913q99M453j7234o503M441m158
$$ y = [4922, -12978, -21867, -15631, -3965, -28, -2543, 1174, 2555, -6892, -675, -2262, 7960, 6896, 5506, -5311, -17247, 2228, 11023, 6919, -12478, -15746, 6613, 22227, 20770, 14858, 11376, 18012, 8320, 10905, 6996, 1539, 1103, 6841, -1221, -6573, -9679, -15673, -2648, -5711, -20382, -23760, -30352, -30243, -25201, -12241, -14076, -8648, -4984, -10107, 2006, 7353, -7119, -13845, -21987, -19605, -10865, -265, 1019, 2862, 2626, 9868, 15422, 7117, -1623, 10650, 10709, -12822, -9814, 4791, 2131, -9402, -4499, -15822, -29470, -32825, -15525, -9985, -21974, -19566, -19682, -14092, -5593, 11989, 28188, 36558, 23114, 6255, -3722, -18786, -21065, -10362, -2200, -3061, 4259, 6087, 9772, -1308, -10579, -10175, -4968, -9228, -2787, 12184, 16097, 15198, 19651, 2417, -4086, 355, -3803]
12263c803J72J322L981P980k279M400N784p034j5247Q220J2636j885l129o237
12249D881j2829l917J0250M198j7697q720L901J009K197j5199M928J4384Q482
12236d132O48K685K0l593r05k621P805K10q35n664l485k619P537J0199r830k698
12220g278K144L721N713j456N520n650R707K78j2009r071l098o346j1935J2160
12206a7600R379R324l402j1521J898O899O243Q778J4098l765j0579L586M940j604
12192A6674l530J1974Q524j6422o400O81M618J0932P4k1102j8567j0648L68J2624
12178a0200k490j2309p56J889R178j628M369Q902L755j110J0675r370j1087k191
12164a2373o361J855k243J0642M52n816J259J7737J1793J810j8352l397q393Q271
$$ y = [-3803, -3631, -2309, 1672, 9652, 7373, 11773, 17557, 10523, -4724, 3496, 16132, 14247, 11118, 4881, -7948, -11865, -1615, 2583, -15114, -23834, -19933, -18924, -16727, -31926, -26998, -12614, -4132, -3484, -799, -779, -4372, -5277, -7898, -93, 117, -718, -6382, -9867, -12486, -4949, 5250, -4580, -7278, -5134, -1413, 4300, 2844, 8364, 2714, 12421, 12699, 690, -8381, -11479, -17825, -29760, -17600, -8221, 1103, -2299, -13820, -11922, -5023, 1220, 9998, 24096, 20331, 9752, 13338, 18278, 16674, 13144, 25118, 33642, 17220, 10820, 11501, 16119, 27051, 27125, 6023, -12544, -23192, -22824, -10200, -12690, -24999, -25755, -23866, -14688, -16316, -11947, -3045, 710, -400, 10275, 905, -10182, -12373, -18734, -16879, -19122, -8480, -8028, -13844, -12585, 5152, 16945, 18755, 403, -2994, -11387, -3116]
12150c116L808p736r343J086J1112l607J38J2435J8019K97k2365L010L606J869
12136I213N453p282j2469M597L64r366J216O502M82L289n962m557M544N69J2240
12121H833J3292Q86q45q245n108n166L934j600Q180j619o909l486k227O085j1770
12106e765o055N958J2816j0448M973J0415k992J903J0349p361j0374O515L089
12093A3023J3927L376j0106j1015l727k840j2058m673n547M27J6920J3629o25
12080A0711q118k615l047Q945K341j638j512P671j0151m04M147m12p856p43N068
12065B387k002l753P138k46n364m94O501L549J1974J4720p389k2197l589O880
12051H115q946J711L841l184J0392R605K953j0514q882J2384M566o814q012j6756
$$ y = [-3116, 692, -7044, -16387, -15301, -4189, -7796, -7658, 4777, 22796, 23093, 728, 3738, 7344, 9213, 14666, 7384, -5085, -488, -124, -9490, -8274, -1772, -1290, 1999, -3963, -8520, -3976, -3407, 8833, 22125, 23011, 22166, 13921, 8813, 3647, 7581, 5981, 14161, 12542, 5633, 2147, -80, 6005, -5765, -11820, -5862, 6954, -3494, 1479, 11894, 8902, 10805, 21154, 13793, 3419, 9934, 13023, 26950, 30326, 20220, 9205, 5478, 2638, -9420, -14093, -19640, -19213, -2293, 11336, 10711, 2593, -22, -3069, 5876, 8217, 6579, 5067, 12738, 2587, 2183, 6330, 5918, -1938, -2681, 2387, 385, -3368, 3770, 3524, -1840, -2334, 4167, 7716, 19690, 34410, 27021, 4824, 1235, 8115, -831, 880, 4721, 1537, 11929, 21534, 24487, 13973, 5091, 17475, 22041, 15227, 7215, -9541]
12037i541m323J3967J0955P283j1155k2110M225N304m945r611M305P85j2719K450
12023b5130l064N532P407j719j1398r751J0360J2819o596M136J044M519Q727Q245
12009E131o737p121K061q18r746q662M373J1559P189m500K688L204K80J182q13
11994g30M2J0210Q783N88l929l53q633j3058J7195R184j1241j9762M812R771M268
11979G147j2417r244J161j896p015J7730Q126k036l154j6191J1444Q329k268l196
11965c480n128O624N181K591N872N604j0325o315p52j875n036L360J1179P258
11951A4758m074q661j362j257K101r099j6213L477J7638N911M6J1391J319m839
11937A1136R030L647O129K067j329N219J827r849r623k0390j213N766M113L051
$$ y = [-9541, -13864, 103, 11058, 18341, 7186, -14924, -10699, -5395, -10340, -19951, -15646, -14861, -27580, -25130, -28194, -22662, -15255, -16974, -28372, -38123, -27763, -14944, -21540, -17404, -16360, -11841, -3114, 5131, -1606, -8727, -6666, -7484, -17230, -25892, -21519, -9960, -2771, -7271, -4583, -1379, -1099, 83, -730, -688, 9522, 18305, 18893, 14964, 14611, 5978, -7080, 10115, 19299, 8058, -11704, -6892, 2879, 7147, -5270, -14514, -13353, -15249, -22264, -4534, 3592, 1556, -1598, -17789, -6345, 1984, -284, -3480, -8608, -1984, 3197, 5788, 11660, 17264, 6939, 624, -128, -2003, -7039, -3679, 7500, 14758, 10684, 2023, 661, -596, 1505, -7594, -23807, -20330, -2692, 3219, 3265, 14656, 15975, 11136, 20166, 23813, 29942, 32009, 30680, 35899, 37726, 27877, 18254, -2136, -3349, 2417, 6530, 9581]
11923I581J876R35j2328m919N588J8315l478k958k905k262r470q06L549k496L16
11908a462P517n723l543j0722J780J5514Or154J0498P793o975n684L136o733k684
11893f436L498M099N61J3006J450r637J054K170L8K318J466m084R131r448n978
11878C208O434P474n757k677n571M822J3193j278l013r275n651L448q242M190
11864A305J338M806K387o264j1735J2K6628J567j5645J211m724j2001K745J2406
11850D036O422M730Q48m739P537K326l509p58J538j615p572n250M696m42l78J942
11834I812J1380K661j922m599l378N213N130p864p019J4155J4842j1149j7355
11821I907k304p52p755j813J3019K77j23j4582R099l575j08k966L819J6586N959
$$ y = [9581, 11457, 12392, 64, -4855, 733, 19048, 15570, 12612, 9707, 7445, -2025, -2831, 718, -1778, -1462, 6055, 332, -3211, -13933, -12153, 3361, 3367, -5787, 4711, 12504, 5529, -155, 2981, -3752, -6436, -2938, 1161, 1722, 14728, 16178, 6541, 7595, 9765, 9803, 12121, 13587, 9503, 18634, 9186, 3208, 9642, 17116, 11359, 8682, 3111, 7933, 21126, 19848, 16835, 7560, 1909, 5357, -2885, 1305, 2643, 7449, 9836, 3572, -8163, -8151, 18477, 20044, 4399, 5610, 886, -11115, -8370, 4036, 10458, 15188, 16036, 11297, 18834, 21160, 17651, 16893, 18431, 16816, 9244, 3994, 8690, 8248, 7870, 9812, 21192, 23853, 21931, 17332, 13954, 19167, 24297, 16433, 9414, 23569, 38411, 27262, 9907, 7603, 6851, -904, -2717, 10302, 10579, 10456, -4126, 4973, 1398, 1290, -1676, 2143, 18729, 24688]
11806B4688J503p943P07L563k2024o436L1M057O353p8p670p228L561J6032L968
11791A3084K697j2687p220o648J5377J3607j604k5771N993Q514j1306j2520J0921
11778g563R625M984n855k287l538j8441P271J7982M655P941j494j6653L798k363
11764a938k318J3551q98j0151k966N702j1112p799L570k168J8274J2836q866L712
11750I429R487l343r549k014n114p557J6958Q164m783j546K303j1722P100N773
11736A3586N823l911n982n441j739J9729K3579o94m513P23k0054k931k011j239
11722A4925m741K113R59p042N515J822L060K526N179N110Q08q922j6301o552P365
11707E824r391o629J9275P418o985j2759k488M002j0627J3968J0218J1152n286
$$ y = [24688, 26191, 18248, 18955, 22518, 494, -5942, -5911, -1854, 4499, 4421, -3249, -10477, -6916, 9116, 13084, 15781, 3094, -4126, -10774, 4603, 18210, 16606, -9165, -3172, 5342, -5964, -18484, -7563, 2062, 7046, 1191, -1096, -4634, -23075, -15804, 2178, 6833, 14774, 13280, -3373, 425, -1938, -4256, 9295, 8397, -1754, -4720, 982, -10130, -17929, -14359, -16527, 1747, 14583, 5717, 9429, 18916, 15573, 6024, 4010, -1104, -8661, 8297, 16461, 11678, 10132, 12435, 713, 7813, 13586, 19409, 15498, 9516, 4075, 2336, 22065, 45644, 44950, 40437, 41160, 21106, 18175, 16164, 14925, 10184, 12297, 13256, 6214, 11729, 13551, 16611, 19137, 24316, 29426, 30234, 21312, 5011, -1541, 5824, -3567, -10196, 9079, 16497, 9512, -3247, -5735, -1733, -12360, 1608, 11826, 22978, 17692]
11694A7692N109m006j1381K838j0518L240O603J692R36q641m647J107J0596Q697
11680A9317M499j6586j10Q597J5946n333r523J5n030k0713J207K079J894J093
11666b648n73J5847O382j2725j5844O452K2940l610l302k3701j2387J6817J2177
11653E825J1735R741j2473M706J5495l745k1519j3042r623O318K1409Q126j5664
11640G289O022K104P625P603Q728j7079k7394k1319L310J0934J8765O556r664
11627C480q553K969p908N76j4533o355j105K1621K3751q637j6319k137l471K2551
11613E930K3200n02p481q578m307Q189o455p683N379Q652J1342k651q839O66J816
11598A8678L307m699q762j0955j0196q390k405K3199J3521M549K990P970Q537
$$ y = [17692, 22801, 18795, 7414, 10252, -266, 2974, 9577, 11269, 12205, 3564, -1083, 24, 10620, 19317, 23816, 7230, 7120, 15717, 31663, 26330, 16807, 16822, 11792, -8921, -7714, -5635, -3741, -2648, -3221, 12626, 19008, 6283, -9561, -3109, 19831, 16221, 12919, -10782, -23169, -6352, 5825, 17560, 27301, 14828, 19534, 35029, 31284, 9765, -3277, -12900, -6582, 14827, 22953, 7289, 13311, 15415, 23040, 30643, 39371, 22292, -5102, -26421, -23111, -12177, 6588, 13144, 3480, -5073, -2104, -10012, -9436, -23969, -30324, -31429, -9808, 13943, 5306, -11013, -13150, -16621, 5930, 29130, 28628, 21147, 12569, 8262, 16451, 9996, 2313, 7692, 16344, 27686, 25035, 16196, 16862, 18678, 21985, 17286, 8524, -2431, -12627, -21017, -23422, -223, 13298, 17847, 20837, 28807, 37344]
11585C7344n344j3879r166j0060L784J604L06Q344K372j7757j3180n459J8165
11572b926K0664L971o267m636K053J579q706r985Q326R210P550M75o716l176j6569
11557e153L653N23M853P577K243L318m705l196R786L843J3316R186j6559j6055
11543A2630L068J0922o7l057r11k212m421Q339j0567l936M81M438P12n318L079
11528A3180J1686M72o616j0287M941J117J8047M859k6230r164l444J5051R262
11515B2874j0349O399n929j2816P430O140k3926L803M023j456N834j111l299J453
11501i30j938O131J1998J355K348r185j3694J0632J4664K831q631O660o39j0759
11487A0843j0583Q002k233Q662j41o541r686O042k494O096J812K60K77P954O476
$$ y = [37344, 32000, 18121, 8955, -1105, 2679, 4283, 4589, 12933, 15305, -2452, -15632, -21091, -2926, 17738, 21709, 15442, 10806, 12859, 14438, 5732, -4253, 4073, 13283, 20833, 21308, 14592, 11416, -5153, -1500, -977, 3876, 11453, 13696, 17014, 12309, 9113, 18899, 22742, 36058, 45244, 28685, 12630, 15698, 26620, 26553, 23496, 22585, 20373, 15952, 24291, 13724, 9788, 10269, 14707, 15419, 10101, 13180, 24866, 25338, 18722, 8435, 13376, 14493, 32540, 37399, 11169, 2005, -1439, 13612, 22874, 12525, 18924, 12995, 179, 7609, 13749, -10177, -6374, -2351, -3807, 2027, 916, -2383, -930, -2868, 3263, 15261, 16616, 18964, 9779, -3915, 6717, 21381, 24212, 15581, 22241, 21602, 10843, 260, 8262, 6029, 14691, 14550, 8009, -1677, 4365, 1871, 7967, 9779, 10039, 10316, 18270, 24746]
11472B4746k0183M674J3994M154j7773j0198J0237J4293K162j9671j0277N116
11460A274r18r44q269k0811l3206p047n47J2711O915K4882J0604J005R024N449
11446A22P702n114o626m76R055K685J5462J0315J1863P316l058J0039l91j9536
11432C9358k8205j241j7102J801J9210L72o986R219J7582m401J558R115J1643
11419E1923R269N308L987j5885r418J2236K0672P394O897j4914q698K1015L5340
11406A25126K6168L0099M6628O8894J11121J66516K85523M58006O15969M52059
11396B386109k70576o06618m50605k91986k02001j49628j02242n9005m2423l1922
11386A79103k3525j4362k0357j2914L001N53j4147J042j369q596j6082j6720n609
$$ y = [24746, 4563, 9237, 23231, 27385, 9612, -586, 9651, 23944, 26106, 6435, -3842, 1274, 356, -588, -8857, -29668, -62874, -69921, -70468, -57757, -50842, -25960, -15356, -14351, -5327, 122, 7824, 2710, -3916, -4392, 4663, 7348, 22810, 33125, 44988, 52304, 49246, 59285, 58894, 39358, 11153, 9912, -7190, -5389, 13821, 14193, 7207, 16426, 34008, 29607, 31165, 40280, 51923, 61192, 66500, 70487, 54602, 45184, 57420, 78092, 85486, 92383, 77469, 68771, 89786, 125126, 151294, 181393, 228021, 296915, 408036, 574552, 860075, 1318081, 1934050, 2386109, 2115533, 1508915, 1058310, 766324, 564323, 414695, 312453, 253448, 211025, 179103, 155578, 141216, 120859, 107945, 110946, 111499, 97352, 98394, 97025, 88429, 72347, 55627, 50018]
11373E0018l035K92m443j7369l392R750M645j160M784L084r3j1972j154l779j6502
11358I674L583Q572l607j8986R833J359j1935M328r65O096L616J1089K393q399
11344A6651j9051K0940J9713n789m701J3439K929j303j0576j6016l528Q351N479
11331B6538j2649n227P314M193p566j2536O931L94o609R666k201J005l124m606
11317A523R756R341l859n538O206k885j4586n429K457M431O505J285p5Q038P055
11302B4225j5886O234J8876O495k069K428L990j0255P085J233j0408N690L773
11289D1411L50M831K0129q71j3833K268O87J6850M657m297o439k2854k5985j8798
11275a894m653Q336K2550K9131q084j2594j7413m082J772m339J1441J7135N339
$$ y = [50018, 46983, 47275, 42832, 25463, 22071, 31821, 36466, 35306, 40090, 43174, 43081, 31109, 29955, 26176, 9674, 13257, 21829, 18222, -764, 9069, 10428, -1507, 2821, 1856, 7952, 11568, 22657, 25050, 16651, -2400, 18540, 38253, 32464, 27763, 41202, 44131, 42828, 32252, 16236, 12708, 21059, 26538, 13889, 8662, 15976, 20169, 12603, 67, 6998, 7392, 783, 10449, 8248, 9253, 6129, 1523, 11279, 20620, 16761, 11223, 17429, 14544, -42, -5471, -3014, 1417, 7922, 9207, 9132, 17170, 24225, 8339, 14573, 33449, 39944, 37875, 40303, 44293, 34038, 41123, 42356, 31948, 37638, 41411, 41761, 46592, 66721, 65850, 52017, 54285, 54972, 71822, 76479, 72182, 65743, 42889, 16904, -1894, -6547, 1789, 24339, 53470, 45386, 32792, 15379, 11297, 13069, 8730, 20171, 37306, 42645]
11262D2645J2053J9536J0487p115j1037n041m386j504j1484J22O988R450K6091
11249H6805K7759K9694N9054O5684P1720N6824L7844k7144j06385j20960p3518
11238A07377k2499n3986m2972j3802j29N361m227J1500K1338Q534K910J6063m773
11225C0695o958J2774P243K407N14J8884N768j0476j9624r540j3936l55O965J118
11211B5479j2413K0569J7367j001j1865j2158j0694k5606j1981R385N044K5635
11199A7761J2165J6639R047k6400k5681n015N622j9956o509n418J2558M4099J1317
11186D0229k1685j0198o490k2744j0078k299R979k3730j9862J4127L0731M9164
11174B7144J7666J0745J6706M2017J8043p649m754j6306r263M946j0306p397J1673
$$ y = [42645, 54698, 74234, 84721, 77606, 66569, 61528, 57142, 55638, 44154, 44276, 51264, 60714, 86805, 114564, 144258, 203312, 268996, 340716, 397540, 435384, 408240, 301855, 180895, 107377, 84878, 30892, -12080, -25882, -26011, -20650, -24877, -13377, 7961, 16495, 19405, 35468, 30695, 23737, 36511, 43754, 46161, 46675, 65559, 71327, 60851, 41227, 31687, 17751, 17396, 24361, 25479, 13066, 33635, 51002, 50001, 38136, 25978, 15284, -10322, -22303, -12918, -7874, 17761, 29926, 46565, 55612, 29212, 3531, -1484, 4138, -15818, -22327, -27745, -15187, 28912, 40229, 18544, 8346, 1856, -20888, -30966, -33265, -23286, -47016, -66878, -52751, -22020, 27144, 44810, 55555, 72261, 114278, 132321, 124672, 119918, 103612, 94349, 99295, 88989, 81592, 93265]
11161I3265Q871l918n756p245P532O095J3135L546N255K098N768K714N351M132
11147A40843j0994j7005j8341j5510K0681J0111k7483j6464K009k977k240J6748
11135G9378M2776L3414M530j0831j8801k4421j9273m148K1014n51L387J5516Q651
11122A30641P854J7536L5076N3366L8137k1268Q6010L36667L44201r29k26283
11111H01008k11142j53295r0254n5299n1092l4784k188j2677q321j1170l230n227
11099A62329L591J7632J2759l94K882j60k0886j5778J1419K1360O919l39k117
11086A99217r585j698r361j9429q631J3377J6282O75n62J3403K0164K909J150
11073B17911Q487J0236J9904K3930K1897J7773J5593O486O150J2743R775o01J2556
$$ y = [93265, 102136, 98218, 92462, 85217, 92749, 98844, 111979, 115525, 120780, 122878, 128646, 131360, 136711, 140843, 129849, 112844, 94503, 78993, 99674, 109785, 82302, 65838, 67847, 64870, 62630, 79378, 122154, 155568, 160098, 149267, 130466, 106045, 86772, 82624, 103638, 103087, 106474, 121990, 130641, 138495, 156031, 191107, 244473, 282610, 261342, 347352, 684019, 1028220, 1027291, 801008, 589866, 436571, 346317, 291018, 239926, 205142, 202954, 190277, 181956, 170786, 167556, 162329, 165920, 183552, 196311, 195917, 198799, 198639, 177753, 161975, 173394, 194754, 201673, 201334, 199217, 189632, 187934, 178573, 159144, 150513, 163890, 180172, 180847, 180285, 193688, 213852, 216761, 217911, 226398, 236634, 256538, 280468, 302365, 320138, 335731, 342217, 348367, 361110, 370885, 370284, 382840]
11060C82840K190r921l664O556N545J5289K2048L1670K8112K6091J9026N477l601
11047E27658j1754j5234J4624K5330J1299n891j3445K255N4375N1146L4925L2831
11035G08119J9985R726N5862R3360R6281P9776L3368L9563N6716Q214J1031O1676
11023A273677Q8284J08583R5538J23435J51068J75230J79091K50336L32673M61574
11013C239489O71398R09311P72362M9379k06692M4237K36356L99846O02010P47251
11003G464947R98511J345099J729389K317878L041093L933769N032270O941456
10995C2804412J0345745J6407487K7312364M5694013P4150900J08976752J08560214
10988D24251887m722401j11145551r6567326n9705841m0491943k8564169j9711771
$$ y = [382840, 385030, 375109, 371445, 378001, 383546, 398835, 420883, 452553, 480665, 506756, 525782, 531259, 527658, 515904, 500670, 515294, 540624, 551923, 546032, 532587, 534842, 589217, 640363, 675288, 708119, 728104, 737830, 793692, 887052, 983333, 1063109, 1096477, 1136040, 1192756, 1200970, 1212001, 1273677, 1361961, 1470544, 1566082, 1689517, 1840585, 2015815, 2194906, 2445242, 2777915, 3239489, 3910887, 4820198, 5592560, 5641939, 5435247, 5479484, 5715840, 6115686, 6717696, 7464947, 8463458, 9808557, 11537946, 13855824, 16896917, 20830686, 25862956, 32804412, 43150157, 59557644, 86870008, 132564021, 206714921, 315691673, 424251887, 419529486, 308383935, 211816609, 152110768, 111618825, 83054656, 63342885]
10981F3342885j3774871r967763p732673o114450m620527l601674k840786k136181
10973A2553960j706548j386413j134887r06959o60819l91858j37869J50715K80091
10964F659413j88284r02217q98762o20193m68681l67826k76820k25316j98997
10955B512317j79427j48719j17876j50986j74425j13501q1640q9452r3213q1451
10945A281627k8600k0611n7939p9518o2416l1978j7874j0300k4112m7392l4111
10934H66776l7512l7293k1236j7862n5773n4431n2727l8644k9647o182j3118j4122
10922D88229p256j3234l805j2777r682j9081l4754j4518k7301l1139r147J2614
10910C18149k680j0683R24j202J3999R904j117R95m134j3424n891l069j1666j4268
$$ y = [63342885, 49568014, 39600251, 31867578, 25753128, 21132601, 17530927, 14690141, 12553960, 10847412, 9460999, 8326112, 7419153, 6758334, 6366476, 6228607, 6379322, 6659413, 6471129, 5568912, 4670150, 4049957, 3581276, 3213450, 2936630, 2711314, 2512317, 2332890, 2184171, 2066295, 1915309, 1740884, 1627383, 1545743, 1456291, 1363078, 1281627, 1253027, 1232416, 1174477, 1094959, 1032543, 1000565, 982691, 972391, 948279, 900887, 866776, 829264, 791971, 770735, 752873, 697100, 642669, 589942, 551298, 521651, 515469, 502351, 488229, 480973, 467739, 463934, 451157, 441475, 422394, 387640, 373122, 345821, 314682, 305535, 318149, 315469, 304786, 305710, 304508, 318507, 328411, 327294, 328289, 324155, 310731, 304840, 301771, 290105, 275837]
10896B75837M128l906j1575r080j3584j5932j4581j0904k552R464M327p797k5560
10883A78285j4554r767n269K053m65L140P15L2268J6842j985k3349j4790M52J3591
10869A77167Q372J0708L5771O7729Q7573J29373O1635j41024j01226m4457n9464
10858B32157l8551k3247M910J8559P445M38K171j5468n698j7709r497j9162k9472
10845A06876k0289j2359J5064J7600L705J4713J4901R762j1999k1963j5407j4183
10833H6421k2242j1801p725j0722Q655J4951M155p987m142j556l273m083K323
10820D2974k082j565r348m815m862J4526N222o318j0474J863j538j6107j4468
10807f992J3216L7773L7870J0247O405K3346M5933L3346j8094n981M1135m982
$$ y = [275837, 279965, 276059, 264484, 255404, 241820, 225888, 211307, 200403, 197851, 207315, 211642, 203845, 178285, 163731, 153964, 148695, 150748, 150283, 153423, 154138, 186406, 203248, 201263, 177914, 163124, 163576, 177167, 185539, 196247, 232018, 299747, 387320, 516693, 578328, 437304, 336078, 291621, 232157, 193606, 170359, 175269, 193828, 201273, 201711, 203882, 188414, 182716, 165007, 155510, 136348, 106876, 86587, 74228, 89292, 106892, 110597, 125310, 140211, 149973, 137974, 116011, 100604, 86421, 64179, 52378, 44653, 33931, 42586, 57537, 61692, 53705, 49563, 48007, 44734, 40651, 42974, 40892, 39327, 29979, 25164, 20302, 34828, 40050, 33732, 23258, 25121, 23583, 7476, -6992, 6224, 43997, 81867, 92114, 98519, 121865, 167798, 201144, 183050, 177069, 218204, 213222]
10795B13222l3586l8752k7482k0762j3938R259N451J5295J8259j4814o893J7566
10783A22825oj4012k0402n289J9809J320j804l336j5423N464J619k596j0129o349
10769G1691J8161J6143M638q662j8302j0225m880K663k2345J48J044k022M901
10756E2953j2181j4060K777O520M277J0913J6083J6206N946O178P71K792j9198
10743G9977o603m723o898K0887K6885J5085j8578j1964r512l2247j5622n361L02
10730C1628m110n674k645p733L033J7152P650m843K0920J1624r499j6147r784
10717C1572L852J1023l630j2235j9124J6844J5526L697j2019J0188L061j9320
10705B9435j2306J1181P969M339M43k357j0223j4838k0809j1003m68J1863J4616
$$ y = [213222, 179636, 140884, 113402, 92640, 78702, 87961, 93412, 108707, 126966, 112152, 105259, 122825, 122819, 108807, 88405, 83116, 102925, 104245, 102441, 99105, 83682, 89146, 90765, 88169, 78040, 71691, 89852, 105995, 110633, 101971, 83669, 73444, 68564, 71227, 48882, 49030, 50074, 48052, 52953, 40772, 26712, 29489, 36009, 40286, 51199, 67282, 83488, 89434, 95612, 96383, 99175, 79977, 73374, 68651, 61753, 82640, 109525, 124610, 106032, 94068, 84556, 52309, 36687, 31326, 31628, 27518, 21844, 19199, 11466, 14499, 31651, 39301, 34458, 55378, 67002, 57503, 41356, 31572, 35424, 46447, 42817, 30582, 11458, 28302, 43828, 47525, 35506, 45694, 48755, 29435, 17129, 28310, 36279, 40618, 41061, 38704, 28481, 13643, -7166, -18169, -18637, -6774, 7842]
10692G842R94J0125P727j0026n630L528n250Q79K2821K3038Q243n997O096n12
10678F3878q68L828O132O395o373M359K49j8051J226l510K175j6486j2953j4762
10664A5239k1071M83J5162J3984Q889k645k911k110K272M399o792p901N874J0208
10650C3080j4766j5524k157R420K1421P073j2814o212R557N015k1027Q797k5K585
10636B4423k115L779M719R667P77n176m091q065K216n214q419j3760M755J2910
10622A6406j061N130p185k228Q096K175p402O519L210n98J523j4830o306J8907
10608B2356q602q272J3529R243Q155K1290n706j8370r987q634Q389J5751J8309
10595E7451M179j4394K789K353O12J479P563J1922J4195P045K0080J6549J9173
$$ y = [7842, 8836, 18961, 26688, 16662, 11032, 14560, 9310, 10189, 33010, 56048, 64291, 58294, 64390, 63878, 63010, 66838, 72970, 79365, 72992, 77351, 77600, 59549, 60775, 57265, 59440, 42954, 30001, 15239, -5832, -5349, 9813, 23797, 32686, 30041, 27130, 25020, 27292, 31691, 24899, 16998, 22872, 33080, 18314, 2790, 633, 10053, 31474, 38547, 25733, 19521, 29078, 34093, 13066, 21863, 21838, 24423, 22308, 26087, 30806, 40473, 41250, 36074, 31983, 23918, 26134, 20920, 12501, -1259, 3496, 16406, 15345, 20475, 13290, 11062, 19158, 21333, 13931, 20450, 23660, 23062, 24585, 9755, 3449, 22356, 13754, 5482, 19011, 28254, 36409, 57699, 51993, 33623, 23636, 15002, 23391, 39142, 57451, 61630, 47236, 50025, 52378, 52990, 54469, 62032, 73954, 88149, 95194, 115274, 131823, 150996]
10582A50996L8834M8371R8316J60387K45000M18264O00901N57139o7748n95052
10572A655408n03564l11107k22415j52071j08810p3393m8930m1815k8722k3556
10562A41025j3406k4158l4310r808J998j33j286r868r829K594K6828J3806l162
10549H0291M484j5768j2498j3870R960J0517j680j0395o242j6511j8728J4761
10537B4321J3156p624j1801L353J6774J8164m274j2334N942K238M62r188J4102
10524E3291J5547J8478J6158j0418j9400j9274j8960o20j2432k3595j2438J9427
10512E764P197L016J4960p838j452m775L667M700O197j1737j3302J1840k915j3418
10498A904R41J1283j6973j4319L230J5166R978J1235j04N109m568q182j4707p375
$$ y = [150996, 189830, 238201, 336517, 496904, 741904, 1160168, 1761069, 2318208, 2250460, 1655408, 1151844, 840737, 618322, 466251, 357441, 284048, 235118, 193303, 164581, 141025, 127619, 103461, 69151, 59343, 61341, 61208, 59922, 50054, 40225, 42819, 69647, 83453, 80291, 84775, 69007, 56509, 42639, 52599, 63116, 61436, 51041, 44799, 28288, 9560, 24321, 37477, 29853, 18052, 21405, 38179, 56343, 52069, 39735, 45677, 47915, 48377, 39189, 53291, 68838, 87316, 103474, 93056, 73656, 54382, 35422, 34802, 22370, -1225, -13663, 5764, 12961, 15977, 30937, 23099, 21647, 16872, 20539, 25239, 31436, 19699, 6397, 18237, 15322, 1904, 2845, 14128, -2845, -17164, -13934, 1232, 11210, 22445, 22341, 27450, 22882, 14700, -7, -7382]
10484g382K208K327J4438P473j6602j4319k354O482o167k434K0439N406n796o045
10470b326k787j6975m755J4841J4690N800M202p525j456J6175N577k4051M62K809
10456D681P38k001J6008N131r701k369J71p406l275J0756J5712J7414j3262k1451
10442A1146l112k0362M95J2653J7340j779J0970j4464q103N563j4282J1574o13
10429G026n772j099p563r271l045L859J6226P506p717l256p887n880j2826p884
10415c7583Q870L750L467R615M626J1461J1808P767n297O699J5538o608j3078
10402B1035l212P005j2860q453N84Q397J551K955q379o442p114L734N186j43O949
10387A0793Q449K136Q55p27l855j6955l286o759K461J0051j906j5931p934j283
$$ y = [-7382, -5174, -2847, 11591, 19064, 2462, -11857, -14211, -7729, -13896, -16330, 4109, 9515, 3719, -2326, -5113, -22088, -26843, -12002, 2688, 8488, 12690, 5165, 3709, 19884, 25461, 1410, 1872, 4681, 5419, 3418, 19426, 24557, 14856, 12487, 12658, 5252, 1977, 12733, 28445, 45859, 32597, 11146, 8034, -12328, -11833, 820, 18160, 16381, 27351, 12887, 4784, 10347, -3935, 7639, 7026, 1254, 155, -7408, -16679, -19724, -15865, 361, 7867, 150, -3106, -10993, -16873, -29699, -37583, -28713, -24963, -21496, -11881, -7255, 4206, 16014, 23781, 18484, 25183, 40721, 34113, 21035, 17823, 24828, 11968, 3515, 4099, 12496, 14047, 17002, 8623, 2181, -4933, -1199, 3987, 3844, 10793, 19242, 21378, 22233, 21506, 17651, 696, -2590, -9349, -6888, 3163, 1257, -14674, -22608, -23891]
10373b3891R774J5498O682p041j576j0033J023P410J2392j932j0720P512K865
10360G963r234r599K739j103m526K2019K4501n744r356p368r662M086P424M647
10346A6787j4365k975M329P984Q159k503r184j1646r786k654J4086J723N231l495
10332A691j1019j658j6296j106j305J8107N705n566n007m382J1673J4027j1604
10319f740j266O521J3342O906p780j7163k178O6J2059P32j655J549j1510q645
10305a5762J0607J260m417J2223j174q1K0087J3026q280k697j0848o349J2104
10292A9699n900j6460o707M536o431N289J6270k101k311k1841m325J9619J0622
10279I959M202m774J345l129k242J8349Q840l924r545p253n664L900Q433J047
$$ y = [-23891, -14117, 1381, 8063, 1022, -554, -10587, -9564, -2154, 10238, 8306, -2414, 5098, 7963, -1271, -10870, -8131, -9234, -13760, 8259, 32760, 27016, 17660, 10292, 630, 4716, 12140, 16787, 2422, -553, 3776, 11760, 19919, 17416, 8232, -3414, -13200, -15854, -1768, -45, 5186, 1691, -9328, -10986, -27282, -28388, -29693, -11586, -5881, -11447, -16454, -20836, -9163, 4864, -6740, -8006, -1485, 11857, 18763, 10983, -6180, -8358, -8292, 3767, 4499, 2844, 4393, -7117, -15762, -5155, -3895, -8312, 3911, 2737, 2656, 22743, 35769, 27489, 24792, 13944, 7595, 19699, 13799, -2661, -9368, -4832, -11263, -5974, 10296, 8195, 5884, -15957, -20282, -663, 9959, 14161, 9387, 10732, 7603, 5361, 23710, 32550, 28626, 19081, 11828, 6164, 10064, 18497, 19544]
10265A9544o187o771R37r039M858R183K2390P4o436j6318n032R374p054n82M14
10250I355o915K388j220r654j4545P636J5359r135r499Q662N041R761m241l588
10236e95J4057L460J321q278l666p154l459M282j5140J1893J070k2803p671J6522
10222a6161J4003J322j0063j6513l478J2575N46K0537R87m126N735j6005q11k969
10208a4421n118J355J3376L745n707J1078J249m210J2390J0319o380r754r510
10195a588M664Q116P890r153J191k935n809r360M093j1148l72o968P412K5264
10181A1297j4662J40J7238L132p697K290K762M660j3004j0261J2024l503j20j850
10167B446p200j2917o742j342J4638O092N780J0183M602n933n643L766o294p381
$$ y = [19544, 13357, 6586, 7523, -1516, 3342, 12525, 34915, 34989, 28553, 12235, 7203, 16577, 9523, 8941, 9355, 2440, 4828, 3608, -6046, -20591, -12955, 2404, -6731, -16230, -7568, -2527, 7234, 2993, -595, 13462, 16922, 18243, 9965, 6299, -855, -4314, -32, -15172, -3279, -2209, -25012, -32683, -16161, -2158, -836, -10899, -27412, -30890, -18315, -17769, 2768, 3755, -371, 5364, -10641, -11452, -14421, -19539, -18184, -4808, -1063, -6770, 4308, 5557, 1347, 13737, 24056, 17676, 7922, -1588, 3076, 11192, 19082, 9929, 11120, 8185, 2376, -6984, -2891, -14039, -14411, -21379, -13967, 11297, -3365, -3225, 14013, 17145, 9448, 11738, 14500, 19160, 6156, -4105, 7919, 4416, 4296, 2446, -4754, -17671, -24413, -25755, -11117, -5025, 755, 10938, 15540, 9607, 3964, 7730, 1436, -5945]
10153e945m395K919M463R082n30j3185J432O868K3762P613j1697o403q465J0065
10139A5584o320K563k034q579m629O748R708M616l376n400q149n250R518J3013
10125A8013p562q587p087j3708K39L864o136J2141J2058K329p380j5075N540J7588
10111F237P701j5594p096J865J613R09L17l530m343o401K502J0424j366P550p639
10096f851j4916j0063P114J0028P603p24m479j976N865n48M26Q711O500M52J986
10081I128m596o86O917J3712k1242j2230o694J1026P877j269j465R900j061j4888
10067e571j3157R510L7848J161k5159l442m770j0171K482J4074J3587o551j2520
10054b679j964J1340K816Q084o874j6987j871j306R027p956j180Q847Q873P68
$$ y = [-5945, -10340, -7421, -2958, 6124, 5594, -7591, -6159, 709, 24471, 32084, 20387, 13984, 5519, 15584, 9264, 11827, 9793, 1214, -3415, 3333, 13041, 17657, 14281, 8881, 732, -4518, 5000, 18013, 10451, 1864, -5223, -18931, -18692, -14828, -20964, -8823, 3235, 5564, -1816, -16891, -11351, 6237, 13938, -1656, -8752, -6887, -5274, -4365, -4048, -7578, -11921, -18322, -15820, -5396, -6762, 788, -6851, -21767, -31830, -24716, -14688, -7085, -7809, -12288, -14264, -8399, -8947, -8521, 190, 6690, 7142, 9128, 4532, 3846, 10763, 24475, 3233, -8997, -15691, -4665, 3212, 1943, 478, 10378, 9317, -5571, -18728, -9218, 28630, 29791, 4632, 1190, -3580, -13751, -11269, 2805, 16392, 9841, -2679, -4643, 6697, 9513, 17597, 10723, -6264, -8135, -9441, -414, -8370, -9550, -703, 8170, 8938]
10040H938k9271k1207J5971J3800O737K1850J3063q044j9889j5578Q482O814N889
10027G555N616K957j610N056L745K388j6232o688l571N17p25j327j1977o079k408
10012b2783J1678J1041R203r407j5319J543K2352j8736k1192J4280K1388J023
10000E071m425j878j3203j749K998J445N53N948J3647J5273m477j3593K067j4215
9986f538q877K95J1386k683L743r071k555J1627Q160J5307j4222j3488n866K644
9972a0138P503O035p415L653J6580J4104M32j3685p524r5j7351n005J3934J4701
9958A5729J7177K728j790j2916j6774j0192o274l673J306J1770J4614n487M607
9945A0825O600J757l950o819j1159j0317J796o640J1662O457K439L126j3725m461
$$ y = [8938, -20333, -41540, -25569, -11769, -5032, 16818, 29881, 21837, 1948, -13630, -5148, 1666, 7555, 13171, 16128, 14518, 19574, 23319, 25707, 9475, 2787, -784, -267, -992, -2319, -14296, -20375, -22783, -11105, -64, 9139, -268, -15587, -14044, 8308, -10428, -31620, -17340, 4048, 5071, 646, -1232, -14435, -16184, -13186, -11741, -11188, -5240, 8407, 23680, 19203, 5610, 7677, -6538, -15415, -15120, -3734, -6417, -2674, -11745, -14300, -2673, 5487, 20794, 6572, -6916, -12782, -10138, -2635, 3400, -4015, -362, 16218, 30322, 30754, 17069, 9545, 9450, -7901, -12906, 1028, 15729, 32906, 35634, 33844, 20928, 4154, -6038, -12312, -15985, -14679, -2909, 11705, 6218, 10825, 17425, 19182, 15232, 8413, -2746, -13063, -11267, -17907, -6245, 212, 2651, 5777, -7948, -12409]
9931a2409K1187n612j4302O906Q012M967j0522M820R374k332K546O026j9517k0733
9917b1589J834R224J3511J0283l952j5676K034K025q487q378j212J4007P283j931
9903a024M084j282j734N984J22m626o089O830p072P907J5047O27r670n261J085
9888D928J1731m033j8777l384O85o706Q072K3937O135k255j807o45r073K459j324
9873I943j8667r485J654L170M432j1468L267m287r811J0912Q709J7624M574J724
9859A2291r557j6122L317J7902Q242n992J3465K269o86j2126j1471q600L023J6567
9845A2522M369p542m987j3641J243j4236o181n071M420J3203n255j215K2889J2956
9831A3474j673p339o880j0879J4790P409O362N764n395m299j7079j3471Q780J5137
$$ y = [-12409, 8778, 3166, -11136, -4230, 3782, 8749, -1773, 3047, 12421, 10089, 12635, 18661, -856, -21589, -19755, -10531, 2980, 13263, 9311, -6365, -4331, -2306, -10793, -19171, -20383, -6376, 907, -1024, 3060, 1778, 44, 6028, 6150, 1524, -4565, 2265, -4807, 3100, 18147, 18774, 9104, 3843, 4928, 16659, 12626, -6151, -9535, -8850, -15556, -7484, 16453, 22588, 20333, 18526, 17881, 8808, 11267, 9943, -8724, -18209, -16555, -13385, -8953, -20421, -17154, -21441, -31252, -20340, -11631, 5993, 10567, 12291, 2734, -13388, -10071, 7831, 16073, 10081, 23546, 25815, 25129, 13003, 1532, -7068, -4045, 12522, 16891, 9349, 4362, -9279, -8036, -22272, -28453, -33524, -29104, -15901, -21156, -22371, 518, 13474, 11801, 4462, -2418, -13297, 1493, 8902, 15264, 21028, 15633, 11334, -5745, -19216, -10436, 4701]
9817D701k333k00k5K707j7391J975O938q818j917j1978M718K5496J0329j0545
9803C657m786j415o942q65Q773L728n257M347p638l136P041j3732o675Q030k412
9788a7282j3039J876Q105N399q977M334M617J5321J0563n970P90J6340j3635o225
9774B217n372j6057M993n025L511J4323J0992l413j6085j3915j430O442O257N975
9760f587N901l139K960N804J652l194j8729J5580J4837j53N134j2682r441q827
9746a0884M362Q348J5337l062j2680p469M30L684M583m879j2794j119n175J4009
9732g309J0649M616q532k343m953P49K59K800K052k781p805M24M8M392O431M306
9716C003J0035m879m746n257n748O932Q062L08m801Q397N536p534k789M088J6943
$$ y = [4701, 2368, 2168, 2143, 4850, -12541, -10566, -3628, -12446, -14363, -26341, -21623, 3873, 14202, 3657, -1129, -2544, -9486, -10351, -1578, 2150, -3107, 1240, -6398, -9534, -2493, -16225, -22900, -14870, -17282, -30321, -28445, -20340, -14941, -23918, -19584, -14967, 354, 10917, 4947, 5737, 22077, 8442, 2217, -3155, -19212, -14219, -19244, -15733, -1410, 9582, 6169, -9916, -23831, -25261, -18819, -12562, -6587, -686, -3825, -865, 4939, 6591, 3397, -15332, 248, 15085, 14932, 20066, 7384, -2057, -10884, -6522, 1826, 17163, 14101, 1421, -6048, -5618, -1934, 2649, -2230, -15024, -16143, -21318, -7309, 3340, 7956, -576, -2919, -7872, -7123, -6864, -4064, -2012, -4793, -12598, -12174, -12126, -7734, -1303, 3003, 13038, 8159, 3413, -1844, -7592, -660, 7402, 7710, 2909, 11306, 16842, 9308, 6519, 10607, 27550]
9701B7550K568j5030p63l133O348p503j8077J378m475l921O394M99M484o20j6766
9686b1067l707J9688J4942N441K035o982M689P744r345j4563j3511r035n882K1099
9672h454l462r580k776K132m781J3491J2142m579p653j1508J3682O744J241J9696
9658A6335J403n395l274j759M940m043Q292j543Q192q620o365l754j7957J327
9644a2221J3428M253J5210j14r214p141J154k76k443j2128q609l05q262o305P432
9629b5541O952J289J3153O387n908n060M739l99j1033n494L148N845P127o898
9615a1693J675n076j8275P944N388O158J985P480K0844L118r370n657j0217n694
9601a1390M871L989j53j140m357N011N731q08K1154O51j6152p059l160m423N119
$$ y = [27550, 30118, 15088, 14325, 11192, 17540, 10037, -8040, -6662, -11137, -15058, -8664, -8165, -3681, -4301, -21067, -24774, -5086, 9856, 15297, 17332, 10350, 15039, 22783, 13438, -1125, -14636, -23671, -29553, -8454, -11916, -21496, -24272, -22140, -26921, -13430, -1288, -5867, -13520, -25028, -11346, -4602, -3361, 16335, 17738, 12343, 9069, 7310, 12250, 8207, 16499, 14956, 23148, 14528, 8163, 4409, -13548, -12221, 1207, 5460, 20670, 20556, 11342, 4201, 5355, 5079, 2636, -9492, -18101, -18406, -26668, -32973, -25541, -18589, -17300, -4147, 2240, -3668, -8728, -3989, -4388, -15421, -20915, -17767, -11922, -4795, -11693, -10018, -15094, -33369, -25425, -20037, -13879, -11894, -4414, 16430, 19548, 10178, 4521, -5696, -11390, -6519, -2530, -2683, -3823, -8180, -3169, 2562, 1754, 22908, 23559, 7407, 348, -2812, -7235, -2116]
9586b116J4042L66n545O654l995k594K578m077M240p891Q15r21j4821L846P853
9571a566J5354J6619m588n66l019j2972o548k094O033O452N121o247j2744j0845
9557a1610P137M99R285O574l837j1227K76p965O145K0332l86l954n572N903l651
9542G949o143q365L906P036j586p485K160N661N038k145l57J0655j922j903q676
9527C823j7416j0271M874J8004J0983k314q185J0348J449j7800q128L90J1174
9514c069o099J19K38J0012Q806q142n477q883P398j0011j143q019J5815O813j1377
9499a3019j752l468m36J486N686o237J2801O369q608n502R457J5458j6495J187
9485c073l573L494J679O886N712L300j4398o233k658l740Q270J0384J0016P479
$$ y = [-2116, 11926, 12292, 6747, 13401, 9406, 6812, 9390, 5313, 9553, 1662, 2477, 1556, -13265, -9419, -1566, 13788, 30407, 25819, 25253, 22234, 9262, 2714, 620, 6653, 13105, 18226, 11979, -765, -11610, -4473, -3974, 5311, 11885, 8048, -3179, -2903, -10868, -4723, 15609, 15223, 11269, 5697, 11600, 7949, 1806, -6559, -2653, 4383, 2797, -4688, -2528, 3133, 8171, 6026, 5669, 16324, 14402, 12499, 3823, -13593, -23864, -18990, -986, 9997, 7683, -502, 9846, 11295, -6505, -14633, -14243, -3069, -9168, -9049, -8811, 1201, 10007, 1865, -3612, -12495, -5097, -15108, -16251, -24270, -8455, -1642, -13019, -14771, -18239, -18675, -17189, -11503, -17740, -4939, 1430, -7178, -12680, -3223, 12235, -4260, -3073, -6646, -3152, -1473, 5413, 11125, 14425, 27, -6206, -8864, -12604, -4334, 6050, 16066, 23545]
9471B3545r058p731m2L787n147j6817K254J3391j475j2824K659J1549L14j7199
9457a2794j7952k992J2360J0483M128k887K674L533O7o716R650R508k1287k3620
9443c5845o55R700J19p913l284j846O049J309J90Q490J1286O105N457Q580n597
9428B145O686P43K172L348j451O555J6984L159l0540j4620K140Q632N858M907
9414A6718l298q924l033N133J5385j0340l877r5l924j4510n711J97l027p698J3899
9399a3105K3874R363o034l146j275J02J4905j1759j3618N059l146J3040K1484
9386C5744j0908j0057N707k753J708J1210N537P114R13L499j6442j3649n757o140
9372E726p299p049l917N02J6265L840J336q445j786O253L341k505Q284M66Q879
$$ y = [23545, 14487, 6756, 6714, 10501, 5354, -11463, -9209, 4182, 2707, -10117, -7458, 4091, 4405, -12794, -30746, -33738, -21378, -10895, -6767, -9654, -6980, -3447, -3380, -10096, -446, 9062, -12225, -35845, -36500, -26800, -26681, -34594, -37878, -39724, -33675, -32366, -32176, -23686, -12400, -6295, -838, 7742, 2145, 8831, 9574, 11746, 15094, 13643, 20198, 37182, 40341, 9801, -4819, -2679, 5953, 11811, 16718, 13420, 4496, 1463, 6596, 21981, 11641, 7764, 7669, 3745, -10765, -16476, -16279, -19306, -27004, -13105, 10769, 20132, 14098, 10952, 9677, 9779, 24684, 12925, -693, 4366, 1220, 14260, 35744, 24836, 14779, 20486, 17733, 19441, 30651, 36188, 43302, 44215, 47714, 31272, 17623, 11866, 5726, -1573, -8622, -12539, -12037, 4228, 8068, 9404, 959, -827, 5426, 8767, 6262, 14546, 15012, 23891]
9357B3891l526j5934k0083J231k331J5136J1960k764j031j68k811k641K519P324
9343A0772n635j494j0018J3814N674J4574Q080q720Q77k203m396p066j633K463
9329A5089p215k685j472L785N970p512J4322K0915o275r570p904l92L878j6317
9315D617m39J2933n829o521N952J803l877M999N924P53k188P894J0754K1468p734
9300E0509k5868j3567K4179k436l263L468k197J721J0072L874j3414K397J3721
9287D9196K0232R02p486R504m474j2966R241J1444J1957N170J2390J5169J9616
9274A39895J3443J2917K8725K7613L1397L2781L3377M7479N5574Q1786J19587
9263F24574J33215J93361K75542M00230O14892J004436J576097K268342K457512
$$ y = [23891, 20365, 4431, -15652, -14421, -16752, -1616, 10344, 7580, 6549, 6381, 3570, 929, 3448, 10772, 5137, 3643, -6375, 7439, 13113, 27687, 35767, 27047, 27924, 25721, 21325, 14259, 12626, 15089, 7874, 5189, 3717, 7502, 13472, 5960, 20282, 41197, 34922, 25352, 17448, 17056, 20934, 4617, 4178, 17111, 11282, 4761, 10713, 12516, 8639, 13638, 19562, 20315, 18127, 26021, 36775, 58243, 50509, 24641, 11074, 35253, 32817, 29554, 33022, 30825, 32546, 42618, 46492, 33078, 35475, 49196, 69428, 70330, 62844, 72348, 67874, 54908, 64149, 75593, 87550, 92720, 105110, 120279, 139895, 153338, 166255, 194980, 222593, 253990, 286771, 320148, 367627, 423201, 504987, 624574, 757789, 951150, 1226692, 1626922, 2241814, 3246250, 4822347, 7090689, 9548201]
9254I548201Q87926j546325k282154j755846j208944q74910o44513m75947l37648
9245A309840k49619k00413j46844j08749r6858p7084n5791m1735l7049l7940k4183
9234B33575j9558j9785j7331m698j0379j5027j2295j6980r822j842q895q463n405
9221H3095P76J623l366j0536j0249r466k24K704k468j2080n424Q03j0368j099
9207B3721J1028Q060m515J952J3816k603j3250o643J571J0507k28j9521j8238
9194E657l401J1033N103j275J575J2496m141j5856L642K976r030q531m1J616M423
9179F246N646k579n23q900J0573R362J233j5749P698R930j4099n934J3894j363
9165A5435l080k375P914j57j4074N496O110j457K272k561o957J138R71J634O898
$$ y = [9548201, 10436127, 8889802, 6607648, 4851802, 3642858, 2767948, 2123435, 1647488, 1309840, 1060221, 859808, 712964, 604215, 507357, 430273, 374482, 332747, 295698, 257758, 233575, 214017, 194232, 176901, 172203, 161824, 146797, 134502, 117522, 107700, 105858, 96963, 88500, 83095, 83871, 85494, 82128, 71592, 61343, 51877, 51653, 54357, 51889, 39809, 34385, 35188, 24820, 23721, 34749, 42809, 38294, 40246, 54062, 51459, 38209, 31566, 33137, 43644, 43416, 23895, 5657, 2256, 13289, 18392, 17117, 18692, 31188, 27047, 11191, 14833, 17809, 8779, 248, 207, 1823, 6246, 11892, 9313, 8790, -110, 10463, 19825, 21058, 5309, 13007, 22937, 8838, 2904, 16798, 15435, 12355, 9980, 17894, 17737, 3663, 9159, 15269, 13812, 16084, 13523, 6566, 7704, 8675, 10309, 17207]
9150A7207l090j484J261M344J466k821j3186J1044k604J409j942k66Q641j946
9136A8033q721m206M359M538j0427N627j3537O424M713J050l767J515N962L668
9122A5231j439o28r081j0302j9817m878M935J5422K1908Q649j2229q869k303J0400
9108F999j6529K494O7k441K85J7131J3842O20M252p67M03k105k957r557r541j6685
9092a4489j0032K360J1815k052o767L270J3407M719K2841l802j5381r459j5583
9079a9153R464J105L244j296N202l171j5450r461J2509j0672m486J4205L558O670
9065g732Q407p461j3351N134J8162m066l781m39r831L956O408m676K484R479R162
9050A1855J4233j2134j3794r025k830q83J0279K7635L22r411r406K333k383j1320
$$ y = [17207, 14117, 12633, 13894, 18238, 19704, 16883, 3697, 14741, 12137, 13546, 11604, 11338, 19979, 18033, 9312, 5106, 9465, 14003, 3576, 9203, -4334, 2090, 6803, 7853, 4086, 5601, 11563, 15231, 13792, 13164, 4083, -6219, -26036, -30914, -25979, -10557, 11351, 20000, 7771, -1098, -3401, 6999, -9530, -7036, -6969, -9410, -9125, 8006, 21848, 22468, 26720, 25953, 26356, 24251, 21294, 11737, 2196, -14489, -24521, -22161, -10346, -12398, -19165, -15895, -2488, 2231, 25072, 21270, 5889, -3570, -19153, -9689, -8584, -5340, -6636, -1434, -4605, -20055, -29516, -17007, -27679, -32165, -17960, -14402, -7732, 675, -6786, -20137, -15003, 3159, -907, -4688, -5127, -14958, -11002, -4594, -9270, -6786, 2693, 11855, 26088, 13954, 160, -8865, -11695, -12578, -2299, 25336, 25658, 16247, 6841, 9174, 6791, -4529]
9036d529q856K271Q988N474M28k487J616N637n116J1764Q625r576l966Q902L789
9021B2964q696j0183K354J1170J3009q014o216j207j4783N582Q199N630K3333
9008D3142L466P674q544j4321j3890o419j1656q867j7294k675O285J5078k697
8995a0718Q227O952O171J2948L60Q554J1735r786r190j6447l0j2459N517J1610
8981A3444o93j4220j3241L473J1495O7r036r308J5626K208j5619K1258J2932M784
8967B3170m922n840p478k5848p554P115L262r81P097J0479M529J080J609n65q590
8952c437j639R366M311N06n471j1219j4958p833N691j261P022O779k682J1188
8938c637P341r399J263N127p536O487J6551J0528K08o99L922L097j6526j5918
$$ y = [-4529, -13385, -11114, -2126, 3348, 3776, 1289, 2905, 8542, 3426, 15190, 23815, 14239, 10273, 19175, 22964, 14268, 4085, 6439, 17609, 30618, 22604, 16388, 15181, 398, 5980, 14179, 19809, 43142, 46608, 54282, 45738, 31417, 17527, 11108, -548, -9415, -26709, -29384, -23099, -8021, -10718, -2491, 4461, 10632, 23580, 23940, 32494, 44229, 34443, 25253, 8806, 8776, -3683, 1834, 13444, 12751, -1469, -14710, -11237, 258, 325, -8711, -18019, -2393, -185, -15804, 5454, 18386, 23170, 18248, 12408, 4930, -20918, -28472, -21357, -18095, -19076, -11979, -1500, 3029, 4109, 5718, 5153, -3437, -5076, 4290, 8601, 9107, 3636, -7583, -22541, -30374, -24683, -25944, -18922, -12143, -14825, -3637, 3704, -5695, -4432, 695, -6841, -354, 16197, 26725, 26933, 26234, 30156, 33253, 16727, 809]
8924H09j4434J243J5308O631j4671J813N221j3636K958L129Q118J3098J3076j0802
8910A7861q031m488k018o504P680R097j4858j5215M029r085J0622J2017L585k2506
8896a7814j4522L239K0584j1088p871J3584J7829K488j875K640j0459k142J729
8883c678O946P155J0940r726j3847j275K545R953R856L419n870j6878k636O024
8869B928P149J3383Q875R618n599j0161j0566k061N946j4878p466r056J6064J6964
8855B1140q794k405O336j766l609p428l846n37q753j306N844K1339J3173o850
8841B2538p949j1288J52J9826Q660J441r786j2279r647j917M043J2705J1282J674
8827B9455r58J5674K984j5789k0579j0894l761q430J1653P502q721q738P134m057
$$ y = [809, -13625, -12382, 2926, 9557, -5114, -3301, 1920, -11716, -8758, -5629, 2489, 15587, 28663, 17861, 9830, 5342, 3324, -3180, 4500, 13597, -1261, -16476, -12447, -21532, -10910, 1107, 4692, -17814, -32336, -29097, -8513, -19601, -27472, -13888, 3941, 6429, 4554, 7194, -3265, -5407, -3678, 3268, 10423, 21363, 11637, -2210, -3485, -940, 9013, 18869, 22288, 16418, -460, -3096, 2928, 10077, 23460, 32335, 41953, 36354, 26193, 15627, 13566, 19512, 4634, -2832, -11888, 4176, 21140, 12346, 9941, 16277, 14511, 10902, 3474, -372, -909, -9662, -10968, -5124, 16215, 29388, 22538, 14589, 3301, 3453, 23279, 31939, 33380, 23594, 11315, 1668, -249, 3794, 16499, 27781, 29455, 28497, 44171, 47155, 31366, 10787, -107, -3868, -12298, -645, 6857, -1864, -10602, -3468, -7525]
8813g525M776p706j5674J3354J1028J0145R60j778M831j0792j92J5924O589l396
8799B0544j9494j6727q249L438J933J8644J5295N546Q010P115L151P477j2645
8786C4038j5680j0617o00k98K575p58n659K661P111L509j3162n967P139M959j2151
8771b900p951j483P678q293Q601P02n121K3143N507j5392o111J2541N73j3966
8757b472j6626q49L860Q380L784M047L8J2103P536Q1j1355j3180k811J2921O643
8742A2100J826n707l301R173L778m523n779O58J908k509J8837m262j6534N803
8728A1468R958J918L058L986j903j3715k976O431J2402k930P248l071K872O036
8714D0782r125o140l143j403R35J4985J949j0579n689r415O051M617n641p320
$$ y = [-7525, -2749, -10455, -26129, -12775, -1747, 8398, 9358, 7580, 12411, 1619, 1427, 17351, 23940, 20544, 1050, -15677, -23926, -20488, -18555, 89, 15384, 20930, 28940, 36055, 39206, 46683, 34038, 18358, 7741, 7141, 6843, 9418, 8660, 3001, 5662, 12773, 16282, 3120, -2847, 4292, 9251, -2900, -10851, -12334, -4656, -12949, -4348, -3646, -8767, 14376, 19883, 4491, -1620, 10921, 11494, -2472, -19098, -19947, -16087, -7707, -3923, 124, 162, 12265, 19801, 19882, 8527, -4653, -7464, 5457, 12100, 13926, 8219, 4918, 14091, 17869, 13346, 7567, 8225, 10133, 7624, 26461, 22199, 5665, 11468, 21426, 23344, 26402, 30388, 28485, 14770, 11794, 18225, 30627, 27697, 34945, 31874, 34746, 40782, 31657, 25517, 22374, 20971, 21906, 36891, 38840, 28261, 22572, 13157, 19208, 23825, 18184, 10864]
8700A0864O477Q778J2391L303j9910j0736Q405k015l507l508J3116j334l858k356
8686A6110n87l504j0752k744J7478J4474Q420r359n935q841r232N470J5623J913
8672B8534l076p785R65O324L813r350k1646j1601P151P864J4248n250N067J041
8658A6299j0339p822K892J1351j5320q974j2777R235J5060Q243N607J007J39N534
8644B0135J3966j7024j6602L985j9484o690J127Q443J5528Q892P658L835J816
8631B5585q080j8004p52k108P765Q697J3230J566j5469m394O339l950l594q920
8617b089J0567J4760K664o696M715n199j5336K043P698l921p922R062M872J3403
8603B8621L457O099R752O68o647j6590P150J1548J2503j6778j3980N647k037k3731
$$ y = [10864, 17341, 26119, 38510, 41813, 21903, 11167, 19572, 17557, 14050, 10542, 23658, 22324, 18466, 16110, 15523, 12019, 1267, -1477, 16001, 30475, 38895, 29536, 23601, 14760, 5528, 10998, 26621, 28534, 25458, 17673, 18638, 24962, 28775, 19425, -2221, -13822, -6671, 1193, 15441, 10191, 15258, 16299, 5960, -1862, 1030, 12381, -2939, -11913, -24690, -15455, -395, 7848, 13455, 14462, 14601, 20135, 34101, 17077, 475, 4460, -15024, -21714, -20587, -12144, 3384, 12276, 19934, 23769, 25585, 17505, -499, -1251, -3359, 4406, 13103, 26333, 27899, 12430, 8036, 14375, 10425, 6831, -2089, 8478, 23238, 25902, 19206, 23921, 18722, 3386, 5429, 13127, 9206, 1284, 10346, 15218, 28621, 32078, 38177, 47929, 48597, 41950, 25360, 32510, 44058, 56561, 39783, 25803, 31450, 29413, 5682]
8589E682q410J3642J0430K345Q588p049j1279n274n73j335m222o08l677r784J1306
8574b18J903j2280m895Q751O792N220J867m507M094Q580N599n400j1042J2372
8560A6836L215R54k884m627J951l607O578O901J602L538j9127j4526q874M764
8546g306N424k211K174n635J5515K29o631q429k2411k453J4655J4042j1825R865
8532d997J1545M806L430j3895n524M524p684R982J5562m674p535j0036P307k785
8518B6j3488j3954j934N298K208k509J4812Q471m854j362Q144j6410n763M265
8504a7050R904N722P490J40O42m013m604j0167j12J176L841J4951Q699o896j1861
8489b138m583l3J0269M221n953j0418K277N772j3841J213L027k167k811L278J2791
$$ y = [5682, -2728, 10914, 21344, 23689, 32277, 25228, 13949, 8675, 8102, 6767, 2545, 1937, -1740, -11524, -218, 1685, -10595, -15490, -6739, 53, 5273, 7140, 2633, 6727, 15307, 20906, 15506, 4464, 16836, 20051, 21005, 18121, 13494, 15445, 11838, 18416, 25317, 26919, 30457, 11330, -3196, -12070, -7306, -1882, -4093, -1919, -7554, 7961, 8190, 1559, -6870, -29281, -31734, -17079, -3037, -14862, -4997, 6548, 11354, 14784, 889, -4635, -111, -7795, 2187, 17749, 13075, 5540, -4496, 2811, 26, -13462, -27416, -29350, -24052, -21844, -24353, -9541, -1070, -5924, -7286, 858, -15552, -21315, -17050, -7146, -1424, 6066, 6206, 6848, 2835, -1769, -11936, -12048, -10872, -7031, 7920, 16619, 9723, -2138, -6721, -6754, 3515, 7736, 1783, -8635, -6358, -586, -14427, -13214, -10187, -12354, -15165, -11887, 904]
8474I04K4376K46j3123P090l767j6565O953L042R992M07r307J864r84o423q83
8459C822n483K467K553M910P749N509J0588o769p978o965p662j6991p565L141
8445a8674P059J1539p220l18L239L321j0176l558J3103p187l485R571P987L282
8431H483k0203r968L933R854R703r308j0911k040K0652Q028r529j0127P167k603
8417f869O460M18p246P760Q272J5556K58M893k843k2977m196K253r505k0205J2699
8402a5272Q023J5916k675j2346R166J2653n625j6997K361R905l923j1245j2434
8389b2493J3097N208O87K202q895m591L38j054J0138K077J2151M099R267L487
8375B5718M162j2086j6607J061K432l381o517M731J2199Q521m504j0101P17n979
$$ y = [904, 25280, 25526, 12403, 19493, 15726, -839, 6114, 9156, 19148, 19555, 10248, 12112, 11128, 4705, 3822, -1661, 806, 3359, 8269, 16018, 21527, 32115, 25346, 17368, 10403, 2741, -14250, -21815, -18674, -11615, -76, -7296, -7614, -4375, -1054, -11230, -14788, -1685, -8872, -12357, -2786, 5201, 8483, -11720, -21688, -17755, -7901, 1802, -7506, -18417, -20457, 195, 8223, -1306, -11433, -4266, -6869, -409, 9, -7237, 523, 8795, 24351, 24609, 29502, 26659, 3682, -514, 1739, -7766, -27971, -15272, -7249, 8667, 5992, -6354, 2812, 15465, 9840, -7157, -4796, 5109, 1186, -10059, -22493, -9396, -4188, -3501, -1299, -10194, -14785, -14447, -15501, -5363, -3286, 8865, 12964, 22231, 25718, 29880, 17794, 1187, 2248, 4680, 1299, -5218, -487, 11712, 20233, 15729, 5628, 6345, 366]
8361C66j3008J2588J4755j3765p139L061K929J7203j434j6513m036N490j1220
8348a0723l527Q579j322P726k635k19k1K99n428M585Q384l814O839L488M371k285
8332A4297k969M117P270L531J840m614p383p651J3650j2478j960N500n570j636
8318E944j73N432j0041k13M278N950r789l162L910j7404m472L953M861J7803k877
8303D000O30k670L399K974Q627m688j7758N471N525J297J0555L370K617j8192
8289E157m626J2769j546p878k355q73k893k355k756k165R440Q439p370q572J2030
8274D446P673k356J310j0447J0829K3818o959j9062r342k134J3128R071o104o404
8260G467l433P82n822J0112Q385j7538r150K1517j1787o136Q041k630Q447l281
$$ y = [366, -12642, -54, 14701, 936, -6203, -3142, -213, 16990, 15556, -957, -4993, 497, -10723, -14250, -5671, -6993, 733, -1902, -2121, -2142, -1843, -7271, -2686, 5698, 1884, 8723, 12211, 16582, 14297, 11328, 15445, 22715, 26246, 28086, 23472, 16089, 8438, 22088, 9610, 7650, 13150, 7580, 5944, 5771, 11203, 1162, 949, 5227, 11177, 1388, -1774, 2136, -15268, -19740, -15787, -10926, 6877, 4000, 4630, 1960, 5359, 8333, 16960, 12272, -5486, -15, 5510, 6807, 17362, 20732, 23349, 5157, 531, 13300, 11754, 3876, 1521, 648, -2245, -4600, -7356, -9521, -81, 8358, 988, -7584, 4446, 12119, 9763, 11073, 626, 11455, 35273, 28314, 9252, -90, -2224, 10904, 19975, 13871, 7467, 4034, 4816, -1006, 9106, 17491, -47, -9197, 12320, 533, -5603, 2438, -192, 8255, 4974]
8246D974j272j1661r374j705P609J6803J184O619Q034O642l246j1944l524j4055
8232d916j291j132o51M530P409K625o053m232l79j887L065j307m046M412j734
8217e587k000P252J937m491n129m606j1684k885l453J3032J6252O448M796m469
8203E413j1564O262m274r379p392J0128Q167o072K445k20j563R489N140Q341j5289
8188c68j2446R140J7348J2206L818j5590L744m129j138q02m946q086K825r709
8174h133j5702k156N814k075R590J1359J9249K040j1133K900p091j1947L305M230
8160B50m237j723L511J2969k379j3292N076K647J0305Q096j858o929K910j574
8146A3772O535p574k1053k683m717O818N483k85J438q18M056m911q641K168k363
$$ y = [4974, 3702, -7959, -17333, -19038, -11429, 5374, 6558, 13177, 21211, 27853, 24607, 12663, 9139, -4916, -6207, -7339, -7990, -3460, 3949, 6574, 521, -3711, -4090, -5977, -2912, -4219, -8265, -3853, -5587, -7587, -335, 1602, -2889, -8018, -12624, -24308, -27193, -30646, -17614, -1362, 5086, 9882, 5413, -6151, 111, -4163, -13542, -20934, -10806, -2639, -8711, -6266, -6486, -8049, 1440, 6580, 14921, -368, -12814, -3674, 13674, 25880, 29698, 14108, 17852, 13723, 12585, 11783, 6837, -1249, 1576, -8133, -23835, -25991, -20177, -22252, -12662, -1303, 17946, 19986, 8853, 11753, 4662, -7285, -3980, 250, -3987, -5710, -2199, 10770, 8391, -4901, 175, 2822, 13127, 21223, 19365, 12436, 15346, 13772, 20307, 12733, -8320, -11003, -15720, -8902, -3419, -3704, -2266, -3084, 972, -3939, -12580, -10412, -12775]
8131a2775J8343N659j0756o510P469k849K156K289N010M166J7976J0051m808l016
8117C2405j3785k156J0745K879l283o016l622j3533N790J419k328L007j3219j7905
8103a9602R502J2361N009q837M152m248K648j534R224P778r198p226N329j07n654
8088d03k688M658K303R34P345k586k01J782l017q832n048J983Q484o645O326O522
8072A0917M851k601n52O089L608J452J7275q47k2209j2392o902M772j0496j5706
8058b2741K719L006o82O005R019J0858j333M956k1456p621K2334R413j660j1820
8044I97j818l879k341p112O351j0909K136K9J2356J4498J1694j4033j2514K818
8030a727l76J0318O640p138l607J5575J0557k134p098j460J0189k603M851J566
$$ y = [-12775, 5568, 11227, 471, -6039, 1430, -1419, 737, 3026, 8036, 12202, 30178, 40229, 35421, 32405, 18620, 16464, 27209, 30088, 26805, 20789, 17167, 3634, 9424, 10843, 8515, 11522, -1697, -19602, -10100, 2261, 7270, -1567, 2585, -1663, 985, -549, 8675, 16453, 7255, 29, 5358, 5251, -403, -3091, 1567, 3870, 4804, 12149, 9563, 9362, 11144, 8127, -705, -5753, -3770, 4714, -1931, 4395, 10917, 15768, 13167, 12615, 18704, 22312, 23764, 41039, 40192, 17983, 5591, -1311, 3461, -7035, -22741, -20022, -17016, -17698, -11693, -2674, 8184, 6851, 11807, -9649, -17270, 5064, 14477, 12817, 997, -821, -4700, -7041, -14153, -7802, -18711, -16575, -16546, -4190, 10308, 22002, 7969, -4545, -1727, -2103, 8215, 14855, 7717, 4110, 19685, 30242, 28108, 21010, 19550, 29739, 27136, 31987, 33553]
8016C3553j6051j3779p183j1917Q123N100o277j235Q994J3808J274q672m819j97
8002G22O77o028O59l944m029L003L715J427P653J0758P469q580o044N324p792
7987D990L379j774r864J658Q819J300N639J3607L605m560r776r132J008Q926j5763
7972B062j779K6849N469j9940o548k134L244j54j650J034j7493j804l377J6179
7958d2L433R29O374l830O938L993l655n078j4167N786N96L573k99k589r248o88
7942g974J1041P65r914o367n120J3407l193K519K1183P502J0439L344k3430o293
7928G909k833Q480J5549j0225j2154Q055Q041n717j179j536K095M370N289j787
7914B4357P987L734j3347j0492q730o540N4J3097O102q239Q186N401q664q755
$$ y = [33553, 17502, 3723, -3460, -15377, -7254, -2154, -8431, -9666, -672, 13136, 14410, 5738, 919, 722, 1399, -4629, -3970, -7914, -11943, -8940, -5225, -3798, 3855, 14613, 22082, 13502, 7458, 12782, 4990, 8369, 6595, -3269, -1611, 7208, 8508, 14147, 27754, 31359, 26799, 17023, 7891, 8899, 17825, 2062, 283, 27132, 32601, 12661, 6113, 3979, 7223, 7069, 5419, 6453, -11040, -12844, -16221, -42, 3391, 4320, 10694, 6864, 13802, 17795, 14140, 9062, -5105, 681, 1277, 4850, 4551, 1962, -7286, -7974, 3067, 3832, -6082, -12449, -17569, -4162, -7355, -4836, 16347, 23849, 34288, 37632, 14202, 7909, 5076, 13556, 29105, 18880, 6726, 14781, 22822, 17105, 15926, 14390, 16485, 20855, 26144, 24357, 32344, 36078, 22731, 12239, 3509, -3031, -2977, 10120, 16222, 7983, 16169, 21570, 12906, 4151]
7900D151J2730j6813L639J2635O603k965L279l731j2220q022M800N569L725l09
7886A3071j189m156O161k188m816j0807m216K960O056n253k611j4902J2148P370
7872b372O594J2590j5167k4686l989J4058l293L886K381J5293J1613j8639r542
7859a1273P43p905Q161J6531j0687k018P009J0954j1573p820J168m648o985J3653
7845d690J087n893N696L680Q490k2240j79N628J3198K975n651L773q215K045Q123
7830G827M522q599j4513k0332o423J5107P314O113R596k650n931N335K465L29
7816A60L526l686k467Q559j498J814J563j3910j7420L870P320J301k847J4171
7802D56Q044j4411j2841m747k696N014J0799N966k962J4092Q164j1034J559o422
$$ y = [4151, 16881, 68, 3707, 16342, 22945, 19980, 23259, 19528, 7308, -714, 4086, 9655, 13380, 13071, 11882, 7726, 13887, 11699, 6883, -3924, -8140, -5180, 876, -4377, -6988, -21890, -9742, -2372, 4222, 16812, 1645, -23041, -27030, -12972, -16265, -12379, -9998, 5295, 16908, -1731, -11273, -10530, -18435, -10274, 6257, -4430, -6448, 561, 11515, -58, -7878, -6710, -11358, -18343, -4690, -3603, -9496, -3800, -120, 8370, -13870, -14049, -8421, 4777, 7752, 2101, 5874, -2341, -296, 7827, 12349, 3750, -10763, -31095, -37518, -22411, -15097, -8984, 612, -2038, -7969, -2634, -169, 160, 3686, 0, -2467, 6092, 4594, 6408, 7971, -5939, -23359, -19489, -12169, -10868, -13715, 456, 8500, -5911, -18752, -23499, -26195, -21181, -10382, -4416, -7378, 6714, 14878, 3844, 5403, -1019]
7788a019K483P968P937L939j0177j8241k2287l297J3939M192Q674k189M071J066
7774b941L078P631J780N41k835j3533K535M428m008r1R51k336r544r593K4050
7759A13Q783K661n884j2866m20p913m454L550J4940O625o304m267R664M456j7389
7744h705J0268R481o369J1707r695q392m309n01r406l61j1094K734N328L578P090
7729h646J258p133k138l375J6248N45j0697l397j797m635j369R387J1051j395
7715f093m254o740L912k474L906q777L047m578K681J2828J2601j212n425j5534
7701a6112r797J3480o753n979j70J276q528J9873J3297L098o533r985j103L727
7687a0209J884J0226P909j2186j7776q72J2151Q957M915j1782J760J5047l062
$$ y = [-1019, 1464, 9432, 17369, 21308, 11131, -7110, -29397, -32694, -18755, -14563, -5889, -8078, -4007, -2941, 137, 7768, 9548, 10089, 7254, -6279, -3744, 684, -3324, -3415, -2464, -4800, -14344, -23937, 113, 8896, 11557, 5673, -7193, -7613, -15526, -19980, -16430, -1490, 5135, -1169, -5436, 4228, 8684, -8705, 1563, 11044, 4675, 16382, 6687, -1705, -6014, -6515, -15921, -16282, -27376, -24642, -19314, -15736, -8646, -7388, -14521, -16659, -20034, -3786, -3241, -13938, -17335, -19132, -23767, -25136, -15749, -4698, -6093, -10347, -17087, -13175, -15649, -11743, -20520, -17473, -22051, -19370, -6542, 6059, 4847, -578, -16112, -25909, -12429, -19182, -25161, -25331, -24055, -32583, -12710, 587, 3685, -2848, -12833, -13936, -10209, -8325, 1901, 9810, -2376, -20152, -21024, -8873, 84, 4999, -6783, -5023, 10024, 6962]
7674F962m380q490j2258J6104J0377n825m520N695k190O369J436J4537j2234k5833
7660a4250n471N619J0309O51Q547q26p770M985M356R290Q161R74p652J060M821
7645B2804r441R026J248n078j9586j4335j6702k454Q685P361J6587P092j5685
7632a0478k090J4168j3095L514J1319J3958J741p861R679o151j3895q738j3488
7619b1417k568J2721P81M255R564j908M691J3503O846P09q393o677k237j3103
7605c233j6559l570M383J2719O522M249r845k042P818j923l169J107L55L743m833
7590d278j630K183K05O461Q658J052M096n677j1335K652j9288j0428l77K876J1143
7575a3687J348Q455j079J0438K248j9784p997R319R039O933Q0q820o019j043k027
$$ y = [6962, 2582, -5908, -18166, -2062, 8315, 2490, -2030, 3665, 1475, 7844, 9280, 23817, 11583, -14250, -19721, -14102, -3793, -3142, 5405, 4579, -3191, 1794, 6150, 15440, 23601, 24575, 16923, 17983, 22804, 13363, 22389, 23637, 18559, -1027, -15362, -32064, -34518, -25833, -18472, -1885, 5207, -10478, -12568, 1600, -11495, -7981, 3338, 17296, 19037, 11176, 20855, 14704, 809, -7929, -21417, -23985, -11264, -10483, -6228, 3336, 1428, 6119, 19622, 26468, 27177, 18784, 12107, 9870, -3233, -19792, -23362, -18979, -6260, 262, 4511, -5334, -7376, 442, -1481, -4650, -3543, -3188, 555, -4278, -5908, -3725, -3520, 2941, 11599, 12651, 16747, 11070, -265, 2387, -16901, -27329, -27706, -24830, -13687, -12339, -3884, -4963, 5475, 7723, -12061, -20058, -10739, -1700, 5233, 5313, -3507, -9526, -10569, -12596]
7560a2596L783J765j861J2343N732o851k0790r137R772J8575L748j1166n297K798
7546i182J790k780N909L025j4588k127P099R378J2589R665R174j4203q727j7049
7532a0027j131r15r643J4827J6057q46j2479o454j6762L424R993P009O328R944
7518I325m832p448J82k948o569J547k7m532k880O172R391n99K12j252l779l414
7502a1451Q253r64j878j99n357r54K5043j33n914K395l114j1665K32R957J4981
7487A9232K836K082K864k524j3733p664K221P288J139P836J2219j339j7246j8452
7473c241n29P890k95J270q33K825R940j753Q12r235p721K152l702k691J3437P457
7457A5783J282L10K357q524m850M121j5631m837J6131N253K08j0016j238O351
$$ y = [-12596, -8813, -7048, -8909, 3434, 9166, 2315, -18475, -27612, -17840, 735, 4483, -6683, -11980, -9182, -7392, -10172, -4263, -1238, -15826, -17953, -10854, -1476, 11113, 20778, 29952, 15749, 7022, -10027, -11158, -12073, -21716, -6889, 9168, 8322, -4157, -10611, -27373, -23949, -13956, -6947, -619, 9325, 4493, -2955, -2773, -5721, -12290, -10743, -10770, -15302, -18182, -12010, -2619, -3218, -3006, -4258, -8037, -11451, -3198, -4162, -6040, -6239, -11596, -12550, 12493, 12360, 6446, 8841, 5727, -5938, -5706, 4251, 19232, 22068, 24150, 27014, 24490, 10757, 3093, 5314, 12602, 13741, 21577, 33796, 32457, 15211, -3241, -3770, 4120, 3825, 5095, 4262, 7087, 17027, 15274, 16086, 6851, -870, 1282, -2420, -5111, 8326, 15783, 17065, 17375, 19732, 11208, 6358, 10479, -5152, -9989, 6142, 11395, 11603, 1587, 349, 6700]
7443F700r907j090r148k753n619Q613L1615J0230q271j3703j8580Q315K560M155
7429C117R610j0850q686Q528O80K167r331k129Q245M310J98K433K332j3053J88
7414b241n728o540N611J1258N769n801R764K92n195p52j5417j514K337K619J701
7399c837J127K032j152p014j928O084q723o614n89K476j967O391n602j0121R307
7384b0130J2210r768J925K6220j802j4566r957m561K066j4728P797K1790J8082
7371A4578j1494r059O31k225j0607o663l07o23J2996Q323J6746J4114o391j0625
7357I394Q948j38k4516j1446Q212K130O217K756o895q293K986O204j1742n630
7343b1813L185J487Q180J5267K3054J0608O3k6034j4219l595N688m363m675r170
$$ y = [6700, -3207, -4297, -13445, -16198, -21817, -13204, 18411, 28641, 20370, 6667, -11913, -3598, -1038, 3117, 12727, 1877, -6809, 1719, 2399, 4566, -4765, -6894, 1351, 5661, 5859, 8292, 10624, -2429, -2241, -7969, -14509, -8898, 2360, 8129, 2328, 12092, 12384, 7189, 6437, -8980, -10494, -8157, -5538, -3837, -2710, -678, -1830, -8844, -10772, -4688, -13411, -20025, -20614, -18138, -20105, -13714, -19316, -29437, -20130, -7920, -17688, -15763, 10457, 8655, -5911, -15868, -20429, -18363, -33091, -25294, -3504, 14578, 3084, -5975, -5344, -7569, -18176, -24839, -25146, -25769, -12773, -4450, 12296, 26410, 20019, 9394, 18342, 18204, -6312, -17758, -9546, -7416, -1199, 1557, -5338, -13631, -10645, -4441, -16183, -21813, -18628, -17141, -8961, 6306, 29360, 39968, 40031, 13997, -222, -3817, 1871, -2492, -7167, -16337]
7329a6337J1859J194O312r234q116M620Q329p535N6J801N163o576m686m465l550
7314b1165R62J3807M801k288r472N6K725p03P427m531O249J33O268r150j2825
7299a7706l603q410J123L951J786R78N983Q965P286N929j2432j2869N200m605
7285a8424J0342J0305j2281k425k226j365R792n767r445N008M354M130O362n422
7271g062j2292o46J0306M458M305j525M915J154r200j722r606K100J0485J1296
7257F966J5912j960j166l937j6507r892J418N37M179L145R986n658j1031p949
7243a5957j8055J182J5049N406N356K544k366q280k657r97m321J2738J2636L418
7229E696Q076K502n162j0785m587k725l168l842J0834J4090j244j1902O32J5795
$$ y = [-16337, -4478, -3284, 3028, -6206, -14322, -9702, -1373, -8908, -8852, -7051, -1888, -8464, -13150, -17615, -21165, -20203, -6396, -1595, -3883, -13355, -13299, -10574, -11277, -3850, -8381, -2132, -1999, 4269, -4881, -17706, -21309, -29719, -28596, -24645, -22859, -21881, -15898, -6933, 353, 6282, -6150, -19019, -13819, -18424, -8082, 2223, -10058, -12483, -14709, -16074, -6282, -12049, -21494, -16486, -12132, -8002, -1640, -7062, -19354, -20000, -9694, -5236, -931, -2456, 2459, 3613, -5587, -7309, -16915, -14815, -4330, 6966, 22878, 20918, 19752, 15815, -692, -10584, -9166, -8629, -4450, -1305, 8681, 3023, -8008, -15957, -34012, -32830, -17781, -12375, -7019, -4475, -6841, -15121, -17778, -18775, -23096, -10358, 2278, 5696, 13772, 16274, 11112, 327, -4260, -6985, -10153, -13995, -3161, 10929, 9685, -2217, -1585, 14210]
7215A4210J034p262o101k731q622N024P723K484M79l5N155j649o749j1727J013
7200g754K949o859N093J7184J180K849q987q250K983J1808q144j0141o817r37
7186a3843k709j1752J0936K0049k751j5053o223J1568L576k890N229r4j994m194
7172a0145o880j863J9007nj0334O132J2494L417n024j2846n631m345K067J1930
7158b026P577q390M892Q698p643k555M228P305l493k018J2196J2936N528r685
7144B7550j1519j0927n266M457j2425n840q725j361J8276O055J2748k536k302
7131H185q132m927p589O004Q718q275j3791j0400O453R759J6871M279k029r652
7117d526n879K299l795m904j409M039j629j2440K777J0239J4692L300o790J245
$$ y = [14210, 15244, 7982, 1881, -850, -9472, -4448, 3275, 5759, 6238, 6203, 11358, 9709, 2960, -8767, -7754, -4805, -11664, -6571, 10613, 11793, 14642, 5655, -2595, 388, 12196, 4052, -6089, -12906, -13843, -16552, -28304, -17368, 2681, -70, -15123, -21346, -9778, -6202, -9092, -3863, -3957, -5951, -10145, -17025, -18888, 119, 114, -10220, -4088, 8406, 11823, 6799, -6047, -11678, -16023, -13956, -2026, 5551, -2839, 2053, 10751, 3108, 553, 4781, 12086, 8593, 6575, 18771, 31707, 37235, 27550, 16031, 5104, -162, 4295, -8130, -13970, -22695, -24056, -5780, 275, 13023, 10487, 8185, 53, -4874, -12463, -6459, 2259, -6016, -19807, -30207, -23754, -13995, 2876, 7155, 5126, -4526, -10405, -8106, -11901, -16805, -18214, -14175, -15804, -28244, -25467, -15228, -536, 2764, -4026, -2781]
7103b781j0982j3032o022K1990R341m423N086L281n486q81Q76N703P558n734K661
7088G155J0435k855j2935k434N548q727j860o484K912J6434p455r173j632J4972
7074C901Q087m934j3955o60q989j3168O910J2247J1954P101j619p148j4301J70
7060a4404K416N558N097Q028O089j4816j1207j2528M758J581l019J0365J3142
7047A060M424j255l12o344q455N972J1293k605j1814P820P254R301O8j211m200
7032A0996j8088j1800N761j2999L430K636N513K978l520m75j04K103m09k583l733
7017b0294N695N810n813q163p109R486l106J232j183J1551K262J1477j741r975
7003i871n350K210j1023n510o12J0887n235J0518N833l873L05L550P992l119J692
$$ y = [-2781, -13763, -26795, -32817, -10827, -1486, -5909, -823, 2458, -3028, -3909, -3033, 2670, 10228, 4494, 7155, 17590, 14735, 1800, -634, 4914, -3813, -5673, -12157, -9245, 7189, -266, -9439, -11071, 3901, 11988, 7054, -6901, -7561, -16550, -29718, -22808, -10561, 1393, 8494, 6875, -273, -14574, -14404, -11988, -6430, -1333, 6695, 12784, -2032, -13239, -25767, -21009, -19428, -22447, -12082, 1060, 5484, 4229, 3917, -2427, -10882, -4910, 6383, 3778, -8036, -216, 7038, 16339, 16407, 15196, 10996, -7092, -18892, -13131, -26130, -22700, -20064, -14551, -11573, -15093, -15568, -15672, -13569, -13978, -16561, -20294, -14599, -8789, -14602, -22765, -29874, -20388, -23494, -22262, -23445, -11894, -9632, 1845, 104, -9871, -15221, -13011, -24034, -29544, -30156, -19269, -24504, -13986, -8153, -12026, -11721, -8171, -179, -3298, -1606]
6988a606L869j763J0075k600J012j3553j4771q57J7551r530q758Q500N591L117
6974c723j1770M409k669Q124n010p048M606J5644L699J744L213n751j489K364
6960F343K462L689l013r118j605k315o277Q478N641o966j4441l933k985J780J7259
6945e001m938k780J5233J2007p508m811lQ081p289K505K16p617o116j6461l876
6930b8358J4867M086k423j0657p014K3759J0484N143j0443Q372m539J375J4482
6917A9134j1772j234J7060k068p381p718M471Q191l909j0610q452M325N461L335
6903H833k239m277l855j1584j053O501J0189M817J99k1017L437L546P146p759
6889g116K180J3957l379K821p909j0818Q443J4419m689P035j0420o560J2915N441
$$ y = [-1606, 2263, 500, 10575, 7975, 8987, -4566, -19337, -20194, -2643, -12173, -20931, -12431, -6840, -3723, -15493, -11084, -13753, -5629, -10639, -17687, -13081, 2563, 6262, 8006, 11219, 5468, 3979, 6343, 8805, 12494, 9481, 363, -1242, -3557, -9834, -1356, 4285, -2681, -17122, -21055, -24040, -22260, -5001, -9939, -12719, 2514, 14521, 7013, 2202, 2199, 10280, 2991, 5496, 5712, -1905, -8021, -24482, -28358, -13491, -9405, -11828, -22485, -29499, -5740, 4744, 9887, -556, 7816, 3277, 4652, 19134, 7362, 6128, 23188, 21120, 13739, 6021, 10492, 18683, 14774, 4164, -4288, 37, 5498, 8833, 6594, 2317, -1538, -13122, -14175, -7674, 2515, 7332, 7531, -13486, -10049, -6503, 643, -7116, -4936, 9021, 5642, 8463, 554, -10264, -1821, 12598, 7909, 14944, 4524, -2036, 10879, 16320]
6875A6320j0941l008R448l484K736O795j3436l887L056P914o646j4922n277L033
6861a2299J1843O498o568q137l404n382J0103J4016Q656k781j4120k8726o249
6848c6550J2465J2489R757N622J437k233o540K369K996O780o39l821L721M885
6834A2738j68m087m873l709l338M545N75Q90Q215O61p111j4070p032J1173P945
6819B354K356m524r450m803J790J5869R987K291j0539k051Q983M828q729l654
6805D708n48m595m01J78M984O458j3667p261o513j5755L034J3407J0861Q132Q032
6790A1054q425M616o952k726j0141n675J6008P685j2088J8778k741k895K803q743
6776E58j4647j1107k140N448O255r00J337q93l87J8536J4451l109r586j5875L862
$$ y = [16320, 5379, 2371, 11819, 8335, 11071, 17866, 4430, 543, 3599, 11513, 4867, -10055, -15332, -12299, -456, 6042, -526, -8663, -12067, -17449, -7346, 6670, 15326, 12545, -1575, -30301, -36550, -24085, -11596, -1839, 3783, 5220, 2987, -3553, -1184, 1812, 8592, 7953, 4132, 7853, 12738, 12570, 8483, 3610, -99, -3437, 1108, 1683, 2573, 10788, 11449, 4338, -9732, -16764, -5591, 2354, 4710, 186, -9264, -14067, -12277, 3592, 13579, 15870, 5331, 3280, 12263, 17091, 8362, 4708, 4160, -435, -836, -658, 4326, 10784, -2883, -10144, -16657, -32412, -29378, -15971, -5110, 3022, 11054, 2629, 7245, 293, -2433, -12574, -18249, -2241, 5444, -6644, 12134, 9393, 6498, 9301, 558, -14089, -25196, -27336, -21888, -15633, -16533, -15196, -16089, -16476, 2060, 16511, 13402, 3816, -12059, -8197]
6761h197L539O441K628j281J058q565M949j478N883k481q792j3236j7200M299
6747c2433K4659J668j6045j1790L0458P392p303l250J039J0491K3879n470j6163
6734G132n573o946N701R49R814K254M003J0020p099j5230j5561j1108J0828Q747
6720b069J5184m991k8982J497j543m611P631Q092J1601J9820o788j6786l963o031
6706a1939q72J6891R404m188K026L816j0442m240J084M164n815N320o942Q633
6692F900m625j416L994J3976j4186j5526J326j0818J8884J0759j4902j2240L965
6679a3909L78Q895N29r041k742J104J6469R994k5894k557N933J2977K903j146
6665C893M280j0899j6663n859M717L184N015N208P362Q799j816l263j3477m80
$$ y = [-8197, -4658, 1783, 4411, 3130, 4188, -4377, 572, -906, 4977, 2496, -6296, -19532, -36732, -32433, -7774, -6106, -22151, -33941, -3483, 3909, -3394, -6644, -5605, 4886, 28765, 23295, 7132, 1559, -5387, 314, 1263, 11077, 13331, 17334, 27354, 20255, 5025, -10536, -21644, -10816, -2069, 13115, 8124, -20858, -19361, -20904, -25515, -17884, -9792, 1809, 21629, 14841, -1945, -5908, -11939, -12811, 4080, 13484, 9296, 11322, 15138, 4696, 456, 1540, 5704, -111, 5209, -1733, 6900, 2275, 859, 4853, 18829, 4643, -10883, -9557, -20375, -1491, 9268, -5634, -17874, -13909, -13531, -4636, -4107, -13148, -15890, -14786, 1683, 11677, -14217, -16774, -10841, 2136, 5039, 3893, 8173, -2726, -19389, -25248, -20531, -17347, -12332, -7124, 238, 9037, 7221, 3958, -9519, -9999]
6651i999O681K100j6828j3586P256O373k07N308J894N015L000o048q681J0729
6637f993J7104m667j3982j238L68J912J075M093L90Q874P030k468o194k936P999
6622A0367R817j2768p515k0317j0761J3312P488R04p149j2346M164J3944Q747
6609b113M700j770r936q524l24j3965L322J9552Q663P520o00l537L000j4872q200
6594a7084M47K2976J5172k184q435O504J17P943j1045q872o388p078P55j0854
6580a8026r888k787M948J1064J765l780J1059O986l110J4535o850j8235m357N918
6566a0758P248J2282P322m95J063j7721j1321J8103P360p455r793K469O908N107
6552A0319J46o172k393J2922O405o908L425P156o552j0065n550j5148L641J7693
$$ y = [-9999, -3318, -1218, -18046, -31632, -24376, -18003, -18210, -12902, -11008, -5993, -2993, -9041, -17722, -6993, 10111, 5444, -8538, -9776, -9408, -7496, -6421, -2328, -1938, 6936, 13966, 11498, 5304, 2368, 10367, 20184, 7416, -99, -20416, -31177, -17865, -10377, -9473, -16622, -28968, -24804, -10860, -2113, 2587, 817, -9119, -17643, -17967, -31932, -28610, -9058, -395, 7125, 6525, 2988, 5988, -8884, -17084, -16637, 6339, 21511, 19327, 10892, 17396, 17513, 25456, 14411, 5539, -849, -7927, -7172, -18026, -27914, -30701, -25753, -14689, -12924, -16704, -5645, 1341, -1769, 12766, 5916, -12319, -16676, -10758, -3510, 8772, 16094, 15599, 16662, -1059, -12380, 5723, 13083, 5628, -4165, -1696, 5212, 10319, 10465, 4293, 1900, 14822, 21227, 14319, 17744, 24900, 18348, 8283, 2733, -12415, -8774, 8919]
6538H919K631r501M48Q514j7023n106l00O047M902P612J827j2553M192n605j2864
6523a7860Q484O88l960k880K798P92J1545J5478n546k3467L66J0549J8257o4j3595
6508A585j333P005j020j4751q61J3960n037m68m138n959N202J3101M344j8062
6494f432j3916M443L741R297L597L099j4817L577N967p69K1220J1683j3319N985
6480B3356n066j9720N443J356j0802p971L179L973m301j4182P339J6050j163M064
6466A555J0295m356p16L180n360m380Q87o75J0j300J077J4476j670j2844J09O871
6450G159r493r2j2693M25j081j026J0077k399l706N801O997jl304R544Q354l389
6434A1173O883J682j1244q160O201M261j8272j0487j3051L612K988J941L331j3807
$$ y = [8919, 11550, 2049, 2497, 11011, -6012, -11118, -11418, -5371, -469, 7143, 8970, -3583, 609, -4996, -17860, -9376, -8688, -12648, -15528, -12730, -11938, -393, 15085, 9539, -13928, -13562, -3013, 15244, 15180, 1585, 252, 7257, 6237, -8514, -9375, 4585, -452, -920, -5058, -11017, -5815, 7286, 11630, -6432, -20348, -15905, -12164, -2867, 730, 3829, -10988, -7411, -1444, -2213, 19007, 30690, 17371, 23356, 18290, -1430, 4013, 5369, -5433, -13404, -10225, -6252, -10553, -24735, -17396, -1346, -2509, 1555, 11850, 7494, 6778, 9958, 4598, 218, 1105, 430, 440, -860, 217, 14693, 13023, 179, 288, 7159, -2334, -2426, -15119, -14694, -15775, -16801, -6724, -9123, -12829, -7028, -31, -32, -3336, 6208, 14562, 11173, 18056, 19738, 8494, 334, 6535, 10796, -7476, -17963, -31014, -27402, -24414, -22473, -19142, -32949]
6420c2949L786J9533R890Q04P974J152j0172j4681o216J5884Q475k473m659K763
6406h89j2497P1M652k790n02M528J4649o34L032j166o997n709j1384j5383J4419
6391a6600P526k681j9538j7535j930Q646K0590J2041R144n481j1580o339l117
6378b6854j7818O196J453K962L813K092Q078P944k457l321M159O682P269k871
6364b673Q591K348r252k580K312l673j0874k812j3923P776K1129P695o016l925
6350e877Q268j781k765r627M837j1761P087J0524m953p121l616P881J7670P859
6336A6625j0130j391j770O310j314O280o463q292m507j8014n487j7295l503K4269
6322b4682K7470J1158r628q844o149M919M010j2304lN087L686R823m134K728N934
$$ y = [-32949, -29163, -9630, 260, 1064, 9038, 10190, 18, -14663, -20879, -4995, 3480, 1007, -3652, -889, -13386, -13315, -8663, -11453, -11955, -7427, 7222, 6588, 9620, 8454, 1457, -4252, -15636, -31019, -16600, -9074, -11755, -31293, -48828, -50758, -42112, -21522, -9481, -337, -5818, -17398, -23737, -26854, -44672, -38476, -37023, -34061, -30248, -28156, -20078, -12134, -14591, -17912, -13753, -7071, 198, -2673, 5918, 8266, -986, -3566, -1254, -4927, -15801, -18613, -32536, -24760, -3631, 4064, -1952, -5877, 2391, 610, -2155, -11782, -6945, -18706, -11619, -1095, -6048, -13169, -16785, -8904, 8766, 16625, 6495, 5104, 3334, 9644, 8330, 14610, 8147, -145, -4652, -22666, -28153, -45448, -48951, -24682, 2788, 13946, 4318, -4526, -10675, -5756, -1746, -14050, -14053, -8966, -5280, 4543, 409, 3137, 9071]
6307I071n894o437l102K351J9861m249j1018R761k360Q48J927j8259r89o01m371
6292a3461J5956l556L816j818j102p54J0682q241m11M873q983M534O300n058M199
6277F976j403j4678n710j800K661J612J1016N145k774k062p352o514M176j670
6263a2377R584J4927O594j229L96j0058j8170o371L193q37O892L77K3783n413
6249A1291k0105N822J910p175r706K974K370j846J2849N196J115O797q841r056
6235f405r090k82M19N064J8486J0115j3084r178k301O776J0172J0475J982r800
6221A3349j3587p702L980k096j5148J0932j202q415N860J5432j1645j7381M457
6208b3166L2280N297m738L201k5212j2422L58N847J154M280J479J1575R103l248
$$ y = [9071, 3177, -3260, -6362, -4011, 15850, 11601, 583, 10344, 7984, 8832, 10759, -7500, -8489, -9090, -13461, 2495, -1061, 2755, 937, -165, -919, 9763, 1522, 1111, 5984, -2999, 1535, 7835, 2777, 6976, 5573, -9105, -14815, -16615, -13954, -12342, -1326, 3819, 1045, -1017, -8369, -14883, -10707, -12377, -2793, 12134, 18728, 17499, 17895, 7837, -10333, -16704, -13511, -14348, -7456, -7079, 16704, 11291, -8814, -2992, -1082, -8257, -17963, -14989, -12619, -14465, -1616, 3580, 4695, 11492, 2651, -6405, -15495, -15777, -15358, -10294, 8192, 18307, 5223, -3955, -6256, 520, 10692, 21167, 23149, 13349, -238, -7940, -3960, -6056, -21204, -10272, -11474, -19889, -14029, 1403, -10242, -27623, -23166, 9114, 14411, 9673, 12874, -12338, -24760, -24402, -18555, -17401, -13121, -11642, -67, 9036, 5788]
6194E788j004Q04k0753o397l499Q798k673N739J0335L424j67O556J9270n869k8285
6179g933j7621K0371J4636j3937n728K1374J0739k117j6275j4445r726K008J0875
6166g779J171n031m33J909L645K92l814L122M837J3065j2459l843o305q880k756
6151b3259M969J3049P061l032j0752N996j292N012Q587k279r230M24j560m866
6137a1172L395j0995P954M980q763L803j1774J053J9233m37q250M797Q496M341
6123F661K596j3610l928P790Q197k953J844J3279n45p602j0240L118J7828p975
6109A4460j137J091L274L102R126j1759M120j511K876o963q567j1330L738q921
6095h401j4107J4015P06O127q527j1406J0420M710l965l194J633R773R696m857
$$ y = [5788, 4784, 5588, -15165, -21562, -25061, -16263, -18936, -13197, -2862, 562, 395, 6951, 26221, 20352, -7933, -25554, -5183, 9453, -4484, -10212, 11162, 21901, 19784, 3509, -10936, -20662, -18654, -7779, -6608, -11639, -12072, -10163, -6518, -6226, -10040, -6918, -2081, 10984, -1475, -5318, -11623, -20503, -23259, -18290, -5241, 1820, -1212, -11964, -5968, -7260, -2248, 6339, 4060, -5170, -4746, -6306, -11172, -7777, -18772, -10818, -5838, -14601, -10798, -22572, -21519, -2286, -2723, -10973, -6176, 2320, 6661, 9257, -4353, -8281, -491, 7706, 4753, 6597, 19876, 19331, 11729, 1489, 4607, 22435, 14460, 13323, 14414, 17688, 20790, 29916, 18157, 22277, 20766, 23642, 16679, 8112, -3218, 520, -8401, -22508, -8493, -7787, -1660, -10187, -21593, -11173, -6463, -10428, -13622, -11989, -2216, 7480, 2623]
6081B623J1442M204r071q82l228m736N132M46Q336q79K938p3j2558j3814q822
6066a8942J0647O894m294J442L932M795J237l825n389j3984j0686O963n778J548
6052b5440J2446j06K204l562J6632J7750j923o506j4466j2423j096Q45l595J3077
6038f163q919j012Q319o867K006M760M434J3171P091q601p545P918q57J596k195
6023G136p013n298o059q590k1333O930R039J7867J3885n322j3464R13j1122L911
6009a8520J3676N031k484M037L113l700k610L477n146N617R466j5492o86j602
5995e823p586O99j745K795Q783j630l491R303l787o769p436r144R35J0105k880
5980a7671P672p501j2370J5470K4585J256o37J3918l19j282R546L381j7647m135
$$ y = [2623, 14065, 18269, 9198, 8316, 5088, 352, 5484, 5930, 14266, 13387, 16325, 16252, 3694, -10120, -18942, -8295, -1401, -5695, -4253, -321, 4474, 5711, 1886, -3503, -17487, -28173, -21210, -26988, -25440, -12994, -13100, -10896, -14458, 2174, 19924, 18001, 11495, -2971, -15394, -16490, -15645, -19240, -6163, -15082, -16094, -7775, -14642, -12636, -7876, -3442, 9729, 16820, 8219, 674, 8592, 7735, 9331, 7136, 123, -5175, -11234, -19824, -41157, -34227, -25188, -7321, 6564, 1242, -12222, -11309, -22431, -18520, -4844, 187, -2297, 1740, 4853, 1153, -1457, 2020, -3126, 2491, 11957, -3535, -4221, -5823, -13409, -12710, -14455, -11660, -2877, -4507, -7998, 1305, -2482, -9251, -16687, -25831, -24896, -14791, -17671, -9999, -17500, -29870, -14400, 10185, 11441, 10804, 24722, 24403, 23121, 32667, 36048, 18401, 14266]
5966A4266O588q018j6353K85J0874J781p28M897j968n124P349M288p314K967N758
5951A9548L70j0668r420J2517J160p835o034r696J3715K213N857J360O832j4208
5937E711r193l392o959J0230J6020p380l096p01L499j5409N485M180N750J0420
5923A5165j2388P05J3354n962j3091r596o206L069R654o949k289J875M001P594
5909a064K967L509P307J7036J2610j9424j9165j3002j1532j721J4719r825R63
5896a6622P533M943N39l55J4420J242j4568j0182r757N587N242N140J1050M610
5882H822P001n27r684o432n272o964R075J505L701J2833m725O826j110k2035p584
5867a4570k833M710l954J3229M513k971J265O562m311M238J2047p991R91R550
$$ y = [14266, 20854, 12836, -3517, -3232, 7642, 9423, 8695, 13592, 11624, 6500, 13849, 18137, 10823, 13790, 19548, 19918, 9250, -170, 12347, 13507, 5672, -362, -10058, 3657, 5870, 11727, 13087, 19919, 5711, -3482, -6874, -13833, -3603, 12417, 5037, 1941, 1240, 4739, -10670, -5185, -1005, 4745, 15165, 2777, 3482, 16836, 10874, -2217, -11813, -18019, -14950, -5296, -12245, -14534, -12659, -8658, -1064, 1903, 5412, 12719, 29755, 42365, 22941, 3776, -9226, -20758, -22479, -7760, -17585, -16622, -9089, -4146, -3607, -3962, 10458, 11700, -2868, -13050, -22807, -17220, -11978, -6838, 4212, 8822, 15823, 15296, 5612, -820, -6092, -13056, -3981, -2476, 1225, 14058, 9333, 16159, 15049, -6986, -14570, -17403, -12693, -16647, -3418, 1095, -1876, -611, 5951, 1640, 5878, 17925, 9934, 10925, 20475]
5853B0475r677j0382O639J0859l741j4400J509N279L285j7831K301Q164M645p505
5839c80j2384n579J248J478K334R037R728L646O158O815m674l717L512r647n397
5824B178J162j1528j869M076R777r215j543n035p158R627J917p147k01L86Q026
5809f547j0516P688m454p096P452J2552P093O6r938O249J4476P17o229j0519J3132
5794A4126m63m60j0037o84R484J9608j498k7043p130L221j84J776m476K907J6145
5779A5292P209q469j1730o572j41J0460j5431k546M634m699R793J2950M89j3000
5765a761P600k555K609j0064o429o288Q994M002O626J0431L646r679L221R92N10
5750A1855p96Q561k156l399N442k080r096l071k870k0113q232O887J6077k039
$$ y = [20475, 10798, 416, 7055, 17914, 14173, -227, 1282, 6561, 9846, -7985, -5684, 2480, 7125, -380, -12764, -18343, -17095, -15617, -13283, -4246, 5482, 9128, 15286, 22101, 17427, 13710, 17222, 7575, 2178, 3340, -8188, -10057, -5981, 3796, -5419, -6962, -11997, -19155, -9528, -7611, -14758, -14959, -14573, -6547, -17063, -9375, -13829, -20925, -13473, -921, 6172, 6238, -3700, 2549, 17025, 17742, 11513, 994, 14126, 13663, 13203, 3166, 2482, 11966, 31574, 30076, 3033, -4097, -876, -1060, 716, -3760, -853, 15292, 22501, 14032, 2302, -4270, -4411, 6049, -9382, -11928, -7294, -11993, -2200, 10750, 11239, -1761, 5839, 3284, 5893, -4171, -10600, -16888, -7894, -3892, 2734, 13165, 16811, 7132, 10353, 11345, 11855, 11059, 19620, 17464, 14065, 19507, 17427, 8331, 5260, 2390, -17723, -25955, -19068, -2991, -5030]
5736e030n534N834P682Q054J4746p449p859n877m704K44l549R51j0263N803J888
5721e063M042j1136n773J815J0294R364N040o762j0468p223M855n95L980J7970
5707A0340K913l574j94J101j965q210q191J6037j177j8773o715M237M96L149J4829
5692D303j025M844n776p524n282j0033M268J1944j0735m865K270J9788J514j0872
5678g181M084k925J2649r080k815l974O570J2900O492P472r545k5257N009K7341
5664B1740l819j2255j390J815Q599j3490o433p381o307O387N603O469r88o916
5650h366L28K5386L966j6903K329O071p910j4112k540o490j1633J0572O652j0286
5636b2936p622M097R735J762O448J0418J6592J1746k451j191k6435k5632N728
$$ y = [-5030, -10564, -4730, 2952, 11006, 25752, 18303, 10444, 4567, -137, 107, -3442, -2491, -12754, -6951, -5063, -1021, -12157, -17930, -16115, -5821, 3543, 8583, 1821, -8647, -15870, -11015, -11610, -7630, 10340, 13253, 9679, 9485, 10586, 8621, 411, -7780, 8257, 7080, -11693, -18408, -14171, -13675, -10526, 4303, 3278, 8122, 2346, -5178, -10460, -20493, -16225, -4281, -15016, -19881, -17611, 2177, 3691, -7181, -3097, -6022, 6627, -2453, -5268, -9242, -2672, 10228, 16720, 24192, 14647, -10610, -5601, 21740, 17921, 5666, 4276, 6091, 14690, 1200, -5233, -12614, -18921, -12534, -6931, -462, -1450, -8366, -8038, 17348, 21314, 4411, 6740, 12811, 4901, -9211, -11751, -18241, -29874, -19302, -12650, -22936, -30558, -26461, -16726, -14964, -8516, 1902, 18494, 30240, 27789, 26598, 163, -25469, -19741]
5623a9741M607J6314M925J337J1602o475j2767J0967j598L682R012J3602j4106
5610B1361j5008J634O08J5681r694q654p564M492J3974n219r304j995l799o631
5596a0118o89M553l649q48R851j1218p525J9771J5119L091J0970j1175m120k283
5582A1730j5560J299L03K782J2069p820q346j700o533N794Q68L644l12l293L610
5567a465n290o94L747q889j2455J0866M336q633M101P761J0458k621R26r404q990
5552a6246Q97J1477O447j036K89R347j75M052l063q881j3333j887j957P153O279
5537f37j5311N848J6343Q990l892k447J0501m326n283j0348l449N314J1027j1793
5523E37n274j5617k964M665J7412J2841l543M557j3292j5342q102Q155M019j108
$$ y = [-19741, -15134, 1180, 6105, 7442, 19044, 12569, -198, 10769, 9171, 12853, 21865, 35467, 21361, 6353, 7987, 8595, 24276, 14582, 5928, -1636, 2856, 16830, 11611, 2307, 312, -3487, -10118, -10807, -6254, -9903, -10751, -900, -12118, -19643, 128, 15247, 18338, 29308, 18133, 14013, 11730, -3830, -2531, -2228, 554, 12623, 4803, -3543, -5243, -11776, -5982, -5114, -1470, -1782, -5075, -1465, -6755, -7449, -3702, -12591, -25046, -14180, -9844, -18477, -14376, -6615, 3843, 1222, 2148, -7256, -16246, -15349, -3872, 2575, 1539, 1828, 11175, 11000, 15052, 11989, 3108, -10225, -12112, -14069, -6916, -637, -15948, -10100, 6243, 15233, 11341, 8894, 19395, 15069, 9786, -562, -4011, 1303, 12330, 537, -4737, -20354, -23318, -18653, -1241, 11600, 8057, 12614, -678, -16020, -24122, -15967, -11948, -13056]
5509a3056L777J487r641J0122o80k4999J098J8285K2834N712O456q388k466J1043
5495B1584j0522m12m311p446J1838N096p530j0733P40j795K694L996k433o319
5481e553j9381l795O365J0048J3167R285K845l033M138L619j3875n939J4107l684
5467H314j1976P429P835L505j4665j2629N84J432L040N250j9419J990J9145L666
5453C501J948Q886J4931L370j5033j1390J221J661O5k162l022p630q653k004l675
5438a7986R536L829n366k334q925l969l47O796J3059Q009J0088P448K77K873j9396
5423C592p299J74J79j2163k519J3531r507p698J2826M329Q363K918j1047p489
5409a1810M692p454k193O335O836M411p650r165L204M04J4677O449P872j913K641
$$ y = [-13056, -9279, -7792, -17433, -7311, -7991, -32990, -31892, -13607, 9227, 14939, 21395, 13007, 10541, 21584, 11062, 10650, 6339, -1107, 10731, 15827, 8297, -2436, -1696, -3491, -797, 3199, 766, -5553, -24934, -28729, -22364, -12316, 851, 10136, 12981, 9948, 14086, 17705, 3830, -2109, 11998, 8314, -3662, 3767, 11602, 15107, 442, -12187, -11603, -10171, -7131, -1881, -21300, -19310, -165, 3501, 5449, 14335, 29266, 32636, 17603, 6213, 7434, 9095, 9160, 6998, 3976, -3654, -12307, -14311, -17986, -8450, -4621, -9987, -12321, -21246, -25215, -25562, -18766, -5707, 2302, 12390, 19838, 20115, 22988, 3592, -3707, -3533, -3354, -15517, -18036, -4505, -14012, -21710, -8884, -4555, 3808, 6726, -4321, -11810, -7118, -14572, -16765, -10430, -3594, 817, -6833, -15998, -12794, -12390, 2287, 8736, 16608, 14695, 17336]
5394A7336O933j7819j3455k892J1569m448R108M899J1006k245O437p063j6672
5381B694j1702m397p8j15k25K1937n39L812O166k011k0184k4361P608J187K834
5366a7374K235J482n682o516K659R503j705j2062P818J8009N984P178Q194r828
5352I895k764j0478j3218M330M604J1742K808Q395L95k146j38o096o376L67J087
5337B407J804N379P41M986P872j9470m306O358N223p445N577L369k728q722k750
5322a705K139q997m636M593p545n018J3178P290m046j149p460K751J5713M200
5308I308O125L061n402p131J0200J7786M579j1122j5026J4K135Q995q024r248
5294F250l059J0019p264o340K336q891l140Q322J136j000P022J6629Q69q360O09
$$ y = [17336, 24269, 6450, -7005, -9897, 1672, -2776, 6332, 11231, 22237, 19992, 26429, 19366, 2694, -9008, -13405, -13483, -13598, -13823, 8114, 7575, 11387, 17553, 15542, -4642, -29003, -21395, -20208, -17374, -15139, -13657, -19339, -25855, -23196, -13693, -15398, -27460, -19642, -1633, 4351, 11529, 19723, 9895, 7131, -3347, -16565, -12235, -7631, 4111, 6919, 15314, 15709, 13563, 13425, 7329, 953, 1320, 2407, 4211, 9590, 10331, 15317, 23189, 3719, -587, 5771, 10994, 3549, 9126, 12495, 9767, 1045, -1705, 434, -8563, -13199, -8606, -16151, -21169, -7991, -701, -4747, -5896, -13356, -10605, 5108, 9308, 15433, 18494, 13092, 5961, 16161, 33947, 38526, 27404, 12378, 12392, 14527, 23522, 15498, 6250, 3191, 13210, 5946, -394, 1942, -6949, -10089, -1767, -631, -1631, 5391, 22020, 22889, 14529, 15138]
5279A5138l519J705n989J0320O236n215n4O377j3865k438O839p01Q116L01r308
5264A3943M75M767k51o688j4432L607J1556M490j2350k35O285o798l405L038k761
5249A241p880o885K448J3841J423l655M261m86J6304O188j413j032j0670j3467
5235B18m910L578Q596O661j196N938j2475k4790k672O460K345O241r039o208p726
5220b8979J2108J1967K1956Q441j1179q584M286l245j7868K1147L459l181J34
5207A0462q62L738J862K252N095L511O050k607q446r244j8552J885J2731Q171
5193A6046m76r391j6813j222L755o236K143J4487J0193J201M211j0241j3156q393
5179a3892n899m160O48Q634n30q880O96Q3J2431J6924n980L446j8527l71l43J3331
$$ y = [15138, 11619, 13324, 7335, 17655, 23891, 18676, 18622, 24999, 11134, 8696, 15535, 14834, 22950, 23251, 13943, 14418, 19185, 18934, 12246, -2186, 1421, 12977, 17467, 5117, 4882, 11167, 4369, 964, 4002, 1241, -6639, -13524, -11076, 2765, 4188, 533, 4794, 4308, 20612, 26800, 25387, 24355, 13685, 218, -4692, -1114, 7482, 14143, 12947, 18885, 6410, -18380, -21052, -14592, -12247, -6006, -15045, -21253, -28979, -16871, -4904, 17052, 25493, 14314, 5730, 10016, 6771, -11097, 10050, 13509, 10328, 10462, 9600, 13338, 15200, 17452, 22547, 26058, 32108, 29501, 21055, 11811, -6741, -4856, 7875, 16046, 15570, 6179, -10634, -11856, -8101, -14337, -12194, 2293, 12486, 13687, 17898, 7657, -5499, -13892, -19791, -23951, -23303, -14669, -15199, -24079, -23383, -23300, -10869, 6055, 75, 3521, -15006, -15377, -15720, -2389]
5163b389Q113m032l887j7438J0181J7255j5589n6J2k90k08P6k520J375L028r62
5147g331p170o175K081P841J0946R006J1063J999j1798j1408N508n319P68k475
5133b464M377o982j262M673J0847m318k235j3548o883J4450j36N067j881J365
5119A070q591m420Q159N524P851R151J935P578j219j5830j0165p006O248p139
5105f854o46N18R119J504Q295m800p929q529R398J4691M925k357o278r461j728
5090a32L520j438q774r188m852l368O515J0235J2327j0518r537j01J6452J5766
5076A6907j136j0400Q946K0328j2703k0639l202k076K037J1243Q59k7595p901
5063b5332k581J1487J1227J1348L18J010j2161k880K00N671R004J0506l102j4970
$$ y = [-2389, 5724, 1692, -2195, -19633, -9452, 7803, -7786, -7842, -7830, -8120, -8328, -8252, -10772, -9397, -6369, -7331, -14501, -20676, -18595, -10754, 192, 9198, 20261, 22260, 10462, -946, 4562, -757, 11, -2464, 1913, -5069, -6331, -1658, 9189, 4871, 2636, -10912, -17795, -3345, -3481, 1586, -295, 1070, -7521, -11941, -3782, 1742, 9593, 18744, 20679, 28257, 27038, 11208, 1043, -5963, 285, -6854, -7500, -6982, 2137, 3641, 11936, 7136, -793, -9322, 76, 14767, 19692, 17335, 11057, 1596, -132, 3388, 1950, -6824, -16012, -20864, -24232, -17717, -7482, 4845, -5673, -15210, -15311, 1141, 16907, 15771, 5371, 14317, 34645, 21942, 1303, -1899, -3975, -1938, 9305, 10164, -17431, -25332, -27913, -16426, -5199, 6149, 6467, 7477, -4684, -7564, -7364, -1693, 7311, 17817, 14715, -255]
5049b55J2651J86o354kO664m361K735j285k2267j0827k489K21J7787O908r543
5034a0231m430j064l532J5905K0900K121l25j0178r842O358P605o559j516L934
5020I146q251P491J6579o068n272L988P693m25K333j0320L700j7348k91m867N999
5005D087P226L914o657n409o046j1548R84J5655N563O185n684o397K303J387M548
4990A0111n871p417o644L712m836O150j0511m701k119L640P57J5754q175J919
4976h231J3099q149j7246l619J2506J106q007Q324L229l62J351M944M229Q159
4962A1333L416k245j2671l258N584o949l925j1834K989N936J945p93P106R344
4948E978J479J4398j396k0946j5492J3374p743M757O037o016j931m440k994k231
$$ y = [-255, 12396, 12582, 6228, 6226, 12890, 8529, 11264, 9979, -12288, -23115, -25604, -25383, -7596, -688, -10231, -14661, -15725, -19257, -3352, 17548, 19669, 19344, 9166, -676, 5682, 13287, 6728, 5212, 9146, 895, 8386, 24965, 18897, 13625, 17613, 25306, 24881, 27214, 16894, 20594, 3246, 2955, -1912, 4087, 11313, 15227, 8570, 3161, -2885, -14433, -13449, 2206, 7769, 13954, 8270, 1873, 4176, 5563, 10111, 4240, -3177, -9821, -6109, -10945, -4795, -15306, -20007, -22126, -18486, -17729, -1975, -10150, -8231, 4868, -3281, -20527, -24146, -11640, -10534, -18541, -10217, -6988, -7350, -5999, -1055, 3174, 11333, 14749, 12504, -167, -3425, 2159, -4790, -8715, -20549, -17560, -11624, -9679, -10472, -3366, 5978, 7457, 21855, 20459, -487, -15979, -2605, -10348, -5591, 446, -5570, -7501, -11941, -14935, -17166]
4934a7166N157l865k853M471J0882O048L77J0834Q098J0251k665j1862J63K150
4920B0020m374M75q581L923J5660j2276j2188j340p538q17J41k264o22p657J5132
4905b306K3525J115j1006j192r484M286k18M150N043p073o386J472K423o38j2854
4890i143J1890O024j8192l58M960l910J221P956r069n93J1611R987j0924j1041
4876i581k808N450N192J5573l566j1307l65K537r245j0766J376j2713J3456P601
4862i166O726M838O573O923J5804o127j5363q414p967J414J082n901r610L334
4848a5854R605Q764R01p989R720p6r913K201P691n515m593m597O617J7567m845
4833I684n440j2275n997j477L032J1010J5968r15q681L956Q143j7237q709J9050
$$ y = [-17166, -12009, -15874, -18727, -14256, -3374, 2674, 3051, 13885, 21983, 32234, 29569, 17707, 17870, 20020, 15646, 16121, 7540, 11463, 27123, 14847, 2659, 1319, -6219, -7036, -6895, -9159, -9781, -17438, -2306, 21219, 22334, 11328, 10136, 652, 4938, 4720, 8870, 13913, 6840, 454, 1926, 4349, 3711, -9143, 2747, 8771, -9421, -9779, -4819, -8729, -7508, 448, -8621, -9214, 2397, 12384, 1460, -9581, -12389, -6939, -1747, 13826, 10260, -1047, -1412, 1125, -8120, -18886, -17510, -30223, -16767, -9166, -2440, 2398, 8971, 15894, 31698, 25571, 10208, 1794, -6173, -4759, -3677, -9578, -19188, -15854, -6249, 2515, 3416, -4573, 5147, 5071, -4842, -2641, 5050, -465, -5058, -9655, -3038, 14529, 9684, 4244, -8031, -14028, -15505, -12473, -1463, 14505, 13590, 4909, 8865, 17008, -229, -8938, 10112]
4819A0112N265p007n093K217n817J009k906K523m489l213M299p80Q206Q079l60
4804A2045j4294o302R809j70j3128N488M67K342M337j5011m612r331J7611J3784
4790C035j0245k0058J4240J5984R64R496O259j0902K731O68o750k609r536N280
4776a443N912p580j3012R953Q932N811M253j5824l892J230J5700O721j3859o692
4762c790L079L455P606m453k7480j0876p463J7906K3249j4516m640K596M771K3475
4748A2919J894n32J047j8344q60J983L755J615j7256J179L397j842j2806m53L721
4733b0583N913O330J2994k706q551q58L565j863p025O984M187K872l447O118k070
4718A860p165m973j781O865J5393M444m826m781j4487j1443J0258Q81R516J4984
$$ y = [10112, 15377, 8370, 3277, 5494, -323, 686, -2220, 303, -4186, -7399, -3100, -3880, 4326, 12405, 12045, -2249, -8551, 1258, 1088, -12040, -6552, -6085, -3743, 594, -14417, -19029, -28360, -10749, 3035, -7210, -27268, -13028, 2956, 3920, 13416, 19675, 8773, 11504, 12172, 5422, 2813, -6723, -1443, 4469, -3111, -16123, -6170, 2762, 8573, 12826, -2998, -6890, -5660, 10040, 16761, 2902, -3790, -711, 2744, 10350, 5897, -21583, -32459, -39922, -22016, 1233, -13283, -17923, -15327, -10556, 12919, 14813, 14281, 15328, -3016, -3876, -1893, 1862, 3477, -13779, -12600, -9203, -11045, -23851, -24304, -20583, -14670, -8340, 4654, 1948, -6603, -7461, -3896, -5759, -12784, -5800, -1613, 1259, -2188, 3930, 1860, -5305, -10278, -12059, -5194, 10199, 14643, 9817, 5036, -9451, -20894, -10636, -9755, -239, 14745]
4704A4745R42o95j4475j0585q62M898L102p74J0105j308j8104J0299P945n471
4690b38l993J531j991j2351L528n393O386j225Q95r927M340J1130P138j776k120
4675d066l820o273o762n006J1907J0039p169P953J224O731L970j4632j7509N491
4661a7922J7499K969K678l660J2839K234l354j902p449j5702L683l07K986l932
4647i340j589m601M244R650P544L67M550k877k023j1334k766J8204J2119m696
4633A7452q244q826O220J832K691M346j1834j1446P558K230j4536j2075J671J2029
4619a0932K116k893R917n25j7981k706P925O991R580K1436O444p343k6021k0637
4605b4629P040M382K711o108L668P926J6426P76j269p353j0946r733j223J4316
$$ y = [14745, 15687, 14992, 517, -10068, -10930, -6032, -2930, -3704, 6401, 5093, -13011, -2712, 5233, -238, -4231, -2700, -4691, -17042, -13514, -18907, -12521, -13746, -12851, -22778, -18438, -7308, -170, -1946, -4066, -7886, -14159, -20921, -25927, -14020, -3981, -11150, -3197, -1973, 4758, 8728, -5904, -23413, -17922, -423, 2546, 5224, 1564, 14403, 16637, 13283, 11381, 3932, -11770, -8087, -8394, -5408, -9340, -10929, -15530, -11286, -1636, 5908, 6275, 10825, 7948, 5925, -5409, -8175, 10029, 22148, 17452, 9208, 382, 6602, 8434, 11125, 15471, 3637, -7809, -251, 1979, -12557, -24632, -22961, -10932, -8816, -11709, -1792, -2317, -20298, -23004, -15079, -8088, 1492, 22928, 29372, 22029, -3992, -24629, -17589, -13207, -10496, -16604, -12936, -5010, 11416, 12192, 10923, 3570, -7376, -17109, -18332, -4016]
4591d016J0314q154P56o611j3313j9492j418K0532M896J3533o537J432O808l444
4577d714j1171k146K450P646J2739R326J2251K046R195j7792p645k297j3866k00
4563d178N711O903R152q82j1806r635j566k910P79J6636N813m680r746p758Q355
4548A88l815p094J081m931K912K227P637J5439Q40M279j0289j3983k220o432K655
4533a1506J1082M721R153p543j0339J1616l694l039j2613J784P418P232q190M635
4519G17P243q726q259n338L100R680p88o959L474K089o89m085q93P71n272L115
4503a0820Q179l9P405J282p717n386j796J560Q108P374m625m436q76L92Q39r569
4487a0125R772J3264m244l062n055n266m609N481R400o66n808O58j6078p071J6990
$$ y = [-4016, 6298, -1856, -1100, -7711, -21024, -40516, -41934, -21402, -16506, -2973, -9510, -8078, -1270, -4714, -15885, -18031, -15581, -7935, 4804, 14130, 26381, 28427, 37622, 19830, 12185, 9888, -3978, -4178, 1533, 8436, 17588, 16706, 4900, -4735, -6301, -9211, -8432, 8204, 14017, 9337, -409, -8167, 188, -3627, -10721, -9640, -14571, -11659, -9432, -1795, 13644, 14484, 18763, 8474, -5509, -7729, -14161, -11506, -424, 4297, 13450, 5907, -4432, 7184, 3490, 451, -12162, -10378, -2960, 4272, -3918, 717, 7960, -766, -9025, -14363, -11263, -1583, -2371, -9330, -5856, -3767, -4456, -8541, -9434, -8663, -13935, -10820, -2641, -2680, 4725, 6007, -1710, -7096, -8892, -7332, 776, 8150, 3525, -911, -1787, -1395, -556, -10125, -353, 12911, 8667, 5605, 550, -4716, -9325, -3844, 5556, 4890, -918, -260, -16338, -23409, -6419]
4472f419K2720J0186p606J502j5667k830m372r878Q682m109l935Q150O719k620
4458E23k659r053o499k086J1025Q045n792j8415N219J889J4874L61L253q380n918
4443a3613P269k874P166J1931K030j3142p571K384J3432N789N117m995J34j5190
4429b133r178m558j215J050J4438J8090l843j590n520m397j4224P604Q943L174
4415F641Q022n582j835N328K36j2201M354J1622r971M8o65o740o227L906N95r525
4399a1994M114J4215J7233j490j320p355j7048q361j5192L436J5096K871l074
4386h869P826m600P072l112j8103j880l71J915m372J0570J7697P767K05O761j4912
$$ y = [-6419, 16301, 26487, 18881, 20383, 4716, 1886, -2486, -12364, -3682, -7791, -11726, -3576, 3143, 523, -2136, -11189, -17688, -19774, -8749, -704, -6496, -24911, -19692, -17803, -2929, -2568, 685, -7695, -13613, -6344, -9218, -2052, 9879, 11909, -1233, -8804, -6420, 7012, 12801, 17918, 12923, 13057, -2133, -11311, -15869, -17084, -16034, -1596, 16494, 12651, 11061, 5541, 1144, -13080, -5476, 3467, 6641, 14663, 9081, 7246, 12574, 12810, 609, 4963, 16585, 6614, 6662, 5997, -743, -6970, -3064, -2469, -11994, -7880, 6335, 23568, 22078, 20758, 13403, -3645, -12006, -27198, -23762, -8666, -5795, -8869, -1043, -5643, 1429, -1683, -19786, -21666, -22037, -20122, -24494, -13924, 3773, 11540, 11745, 18506, 3594]
$$ [...]
##END NTUPLES=NMR SPECTRUM
##END=
