##TITLE=Analysis number 313053
Compound Code cc 40308
Book Reference 382/102/1
Project Code adrs
Chemist Name simons
##JCAMPDX= 6.0         $$ Bruker NMR JCAMP-DX V2.0
##DATA TYPE= NMR SPECTRUM
##DATA CLASS= NTUPLES
##ORIGIN= Bruker BioSpin GmbH
##OWNER= NMR
$$ XWIN-NMR		Version 3.5
$$ Wed Aug 24 12:19:48 2005 GMT Daylight Time (UT+1h)  MAYBRIDGE\NMR@NMR_250MHZ
##.OBSERVE FREQUENCY= 250.131544655141
##.OBSERVE NUCLEUS= ^1H
##.ACQUISITION MODE= SIMULTANEOUS (DQD)
##.ACQUISITION SCHEME= undefined
##.AVERAGES= 16
##.DIGITISER RES= 18
##SPECTROMETER/DATA SYSTEM= dpx250
##.PULSE SEQUENCE= zg30
##.SOLVENT NAME= CDCl3
##.SHIFT REFERENCE= (INTERNAL, CDCl3, 0, 16.4461)
##AUDIT TRAIL= $$ (NUMBER, WHEN, WHO, WHERE, WHAT)
$$ ##TITLE= Audit trail, XWIN-NMR		Version 3.5
$$ ##JCAMPDX= 5.01
$$ ##ORIGIN= Bruker BioSpin GmbH
$$ ##OWNER= NMR
$$ C:\u/data/dgb/nmr/ADRS/8480/pdata/1/auditp.txt
$$ ##AUDIT TRAIL=  $$ (NUMBER, WHEN, WHO, WHERE, WHAT)
(   1,<2005-08-24 12:19:28.81 +100>,<MAYBRIDGE\NMR>,<NMR_250MHZ>,
      <created by zg, POWCHK disabled, PULCHK disabled
       configuration hash MD5:
       62 19 C7 07 E1 42 D1 B7 37 6C 3D D0 77 39 F9 E6
       data hash MD5: 64K
       B7 B1 C9 14 8E 29 2D 56 0A 2B 50 36 BF 63 24 DF>)
(   2,<2005-08-24 12:19:40.41 +100>,<MAYBRIDGE\NMR>,<NMR_250MHZ>,
      <Start of raw data processing
       ef LB = 0.3 FT_mod = 6 PKNL = 1 SI = 32K 
       data hash MD5: 32K
       0B 36 85 51 65 67 1C 16 BE 7F 66 14 BE 85 D7 B8>)
(   3,<2005-08-24 12:19:42.35 +100>,<MAYBRIDGE\NMR>,<NMR_250MHZ>,
      <apk 
       data hash MD5: 32K
       45 CE EC E9 43 D2 B3 C0 76 96 E3 E1 D2 13 2F 7A>)
(   4,<2005-08-24 12:19:43.03 +100>,<MAYBRIDGE\NMR>,<NMR_250MHZ>,
      <abs ABSG = 5 
       data hash MD5: 32K
       51 F8 27 1E 79 71 77 E0 4F 77 74 F2 22 A8 1B DA>)
$$ ##END=
$$ 
$$ hash MD5
$$ 93 0E EA 87 35 8A A4 DF 26 63 F5 09 69 04 E5 87
##$RELAX= 
##$RELAX= 
##$RELAX= 
##$RELAX= 
##$RELAX= 
##$RELAX= 
##$RELAX= 
$$ Bruker specific parameters
$$ --------------------------
##$DU= <C:\u>
##$EXPNO= 8480
##$NAME= <ADRS>
##$PROCNO= 1
##$TYPE= <nmr>
##$USER= <dgb>
##$AMP= (0..31)
100 100 100 100 100 100 100 100 100 100 100 100 100 100 100 100 100 100 
100 100 100 100 100 100 100 100 100 100 100 100 100 100 
##$AQSEQ= 0
##$AQ_mod= 3
##$AUNM= <au_zg>
##$AUTOPOS= <25 >
##$BF1= 250.13
##$BF2= 250.13
##$BF3= 250.13
##$BF4= 250.13
##$BF5= 500.13
##$BF6= 500.13
##$BF7= 500.13
##$BF8= 500.13
##$BYTORDA= 1
##$CFDGTYP= 0
##$CFRGTYP= 5
##$CHEMSTR= <none>
##$CNST= (0..31)
1 1 145 1 1 1 1 1 1 1 1 1 1 1 1 1 1 1 1 1 1 1 1 1 1 1 1 1 1 1 1 1 
##$CPDPRG= <>
##$CPDPRG1= <>
##$CPDPRG2= <>
##$CPDPRG3= <>
##$CPDPRG4= <mlev>
##$CPDPRG5= <mlev>
##$CPDPRG6= <mlev>
##$CPDPRG7= <mlev>
##$CPDPRG8= <mlev>
##$CPDPRGB= <>
##$CPDPRGT= <>
##$D= (0..31)
0 1 0 0 0 0 0 0 0 0.06 0 0 0 0 0 0 0.0002 0 0 0 0 0 0 0 0 0 0 0 0 0 0 
0 
##$DATE= 1124882367
##$DBL= (0..7)
120 120 120 120 120 120 120 120 
##$DBP= (0..7)
150 150 150 150 150 150 150 150 
##$DBP07= 0
##$DBPNAM0= <>
##$DBPNAM1= <>
$$ [...]
##$SUBNAM7= <"">
##$SUBNAM8= <"">
##$SUBNAM9= <"">
##$SW= 20.6930455092707
##$SWIBOX= (0..15)
0 0 3 0 0 0 0 0 0 0 0 0 0 0 0 0 
##$SW_h= 5175.983436853
##$TD= 65536
##$TD0= 1
##$TE= 295.16
##$TE2= 300
##$TE3= 300
##$TEG= 300
##$TL= (0..7)
0 120 120 120 120 120 120 120 
##$TP= (0..7)
150 150 150 150 150 150 150 150 
##$TP07= 0
##$TPNAME0= <>
##$TPNAME1= <>
##$TPNAME2= <>
##$TPNAME3= <>
##$TPNAME4= <>
##$TPNAME5= <>
##$TPNAME6= <>
##$TPNAME7= <>
##$TPOAL= (0..7)
0.5 0.5 0.5 0.5 0.5 0.5 0.5 0.5 
##$TPOFFS= (0..7)
0 0 0 0 0 0 0 0 
##$TUNHIN= 0
##$TUNHOUT= 0
##$TUNXOUT= 0
##$USERA1= <user>
##$USERA2= <user>
##$USERA3= <user>
##$USERA4= <user>
##$USERA5= <user>
##$V9= 5
##$VALIST= <valist>
##$VCLIST= <CCCCCCCCCCCCCCC>
##$VD= 0
##$VDLIST= <DDDDDDDDDDDDDDD>
##$VPLIST= <PPPPPPPPPPPPPPP>
##$VTLIST= <TTTTTTTTTTTTTTT>
##$WBST= 1024
##$WBSW= 4
##$XGAIN= (0..3)
0 0 0 0 
##$XL= 0
##$YL= 0
##$YMAX_a= 398060
##$YMIN_a= -463951
##$ZGOPTNS= <>
##$ZL1= 120
##$ZL2= 120
##$ZL3= 120
##$ZL4= 120
##$ABSF1= 16.44611
##$ABSF2= -4.247063
##$ABSG= 5
##$ABSL= 3
##$ALPHA= 0
##$AQORDER= 0
##$ASSFAC= 0
##$ASSFACI= 0
##$ASSFACX= 0
##$ASSWID= 0
##$AUNMP= <proc_1d>
##$AZFE= 0.1
##$AZFW= 0.1
##$BCFW= 0
##$BC_mod= 0
##$BYTORDP= 0
##$COROFFS= 0
##$CY= 12.5
##$DATMOD= 1
##$DC= 0
##$DFILT= <>
##$DTYPP= 0
##$F1P= 14.0000005364418
##$F2P= -0.99999901652339
##$FCOR= 0.5
##$FTSIZE= 32768
##$FT_mod= 6
##$GAMMA= 0
##$GB= 0
##$INTBC= 1
##$INTSCL= 1
##$ISEN= 128
##$LB= 0.3
##$LEV0= 0
##$LPBIN= 0
##$MAXI= 10000
##$MC2= 0
##$MEAN= 0
##$ME_mod= 0
##$MI= 0
##$NCOEF= 0
##$NC_proc= -3
##$NLEV= 6
##$NOISF1= 0
##$NOISF2= 0
##$NSP= 0
##$NTH_PI= 0
##$NZP= 0
##$OFFSET= 16.44611
##$PC= 1
##$PHC0= -75.99208
##$PHC1= 1.464186
##$PH_mod= 1
##$PKNL= yes
##$PPARMOD= 0
##$PSCAL= 4
##$PSIGN= 0
##$REVERSE= no
##$SF= 250.13001898159
##$SI= 32768
##$SIGF1= 0
##$SIGF2= 0
##$SINO= 400
##$SIOLD= 32768
##$SREGLST= <1H.CDCl3>
##$SSB= 0
##$STSI= 32768
##$STSR= 0
##$SW_p= 5175.98343685301
##$SYMM= 0
##$S_DEV= 0
##$TDeff= 65536
##$TDoff= 0
##$TI= <Analysis number 999999
Compound Code 99
Book Reference 9
Project Code 9>
##$TILT= no
##$TM1= 0
##$TM2= 0
##$TOPLEV= 0
##$USERP1= <user>
##$USERP2= <user>
##$USERP3= <user>
##$USERP4= <user>
##$USERP5= <user>
##$WDW= 1
##$XDIM= 32768
##$YMAX_p= 371722729
##$YMIN_p= -118345
$$ End of Bruker specific parameters
$$ ---------------------------------
##NTUPLES= NMR SPECTRUM
##VAR_NAME=  FREQUENCY,     SPECTRUM/REAL,   SPECTRUM/IMAG
##SYMBOL=    X,             R,               I
##VAR_TYPE=  INDEPENDENT,   DEPENDENT,       DEPENDENT
##VAR_FORM=  AFFN,          ASDF,            ASDF
##VAR_DIM=   32768,         32768,           32768
##UNITS=     HZ,            ARBITRARY UNITS, ARBITRARY UNITS
##FACTOR=    0.157963299565203, 1,           1
##FIRST=     4113.66574937577, 0,            0
##LAST=      -1062.31768747724, 0,           0
##MIN=       -1062.31768747724, -118345,     0
##MAX=       4113.66574937577, 371722729,    0
$$ Real data points
##PAGE= N=1
##DATA TABLE= (X++(R..R)), XYDATA
$$ [...]
21068 -6424 -12745 -20951 -22311 -13637 5357 3306 4308 4828 -14402 -47250 -40622 2757 28651 35307
21054 35307 30767 33544 8559 -1240 -2593 -13777 -27318 -14865 18034 8892 -5850 -19218 -27300
21041 -27300 -27134 -46051 -45964 -23016 -25995 -44681 -16851 7641 22305 18137 -25245 -39489 -22439
21028 -22439 1579 23034 19947 19616 -2247 9202 27763 36456 23465 1187 -10969 3648
21016 3648 15718 1300 2122 1880 -14537 -24760 -5181 -1755 -17361 -19625 -12373 -2497 -5492 -7923
21002 -7923 11434 464 -15285 -19685 -10725 -13957 492 14801 5749 -8161 -33169 -37917 -27479
20989 -27479 -12111 5504 26448 32440 10808 -7029 -8399 -1268 -597 1843 11716 14197 3574
20976 3574 -2850 -9647 -7320 -21497 -23945 -18546 -15202 -37388 -7889 16993 32610 27906 28652 -5820
20962 -5820 10035 17293 15877 6380 6185 -5498 -9759 -20748 -28373 -37210 -49497 -45371 -28483 -10936
20948 -10936 -17565 -6447 416 23386 37358 20383 14527 24613 16932 24858 25825 -10342 -1518
20935 -1518 3503 23698 39932 7116 -3249 -14919 -45164 -61448 -36798 -35010 -47411 -40673
20923 -40673 -36756 -21382 9284 19528 20881 5488 15228 10881 -17278 -28486 -18635 -28092 -29932
20910 -29932 -28953 -27694 -32098 -25313 -16997 -30429 -14908 11259 -3859 -11100 154 14881 22402
20897 22402 19862 13899 1292 12943 16599 7568 14895 15419 5221 -1675 -12720 -30344 -35022
20884 -35022 -12817 -5166 -6012 -26923 -26407 -32908 -29888 -32307 -32374 -11190 -14770 4756 8696 22906
20870 22906 15266 14171 16215 11525 9651 -10394 -5966 -22967 -53524 -32375 -21133 -19717 -22791
20857 -22791 -25469 -243 18353 -188 -20653 -26539 -8265 -13630 -38977 -70193 -68428 -40851
20845 -40851 -8793 25253 3637 -12644 -12555 -834 27345 15639 -19563 -17523 -11668 741 -20355
20832 -20355 -41030 -46627 -38759 -41066 -17732 1759 -3380 -31102 -29607 -2262 9947 -4282 3555
20819 3555 18841 44951 50642 38728 37429 12209 14501 15246 16553 19755 15398 -5811 -5204 -9813
20805 -9813 -10759 -23873 -8987 -3314 -7579 -6087 6972 22984 2201 -19264 -14958 -2167 2329
20792 2329 -27515 -53631 -48220 -25047 -35678 -33414 -28235 -21268 -5543 5150 10859 -264 -13157
20779 -13157 -12086 9593 -28544 -25232 -14537 -27447 -39367 -31180 -11365 -4335 -34056 -46631
20767 -46631 -15221 -1648 -6199 3500 -17185 -19093 -11743 -19248 -6504 9664 -13169 -33311 -30347
20754 -30347 -22022 -26219 -28895 -26410 7981 6407 -16932 -31184 -17648 -17754 -8864 -1258 -15481
20741 -15481 -16012 -4566 -539 -173 -11131 -10897 18946 21242 10381 1460 27332 25829 21085 10516
20727 10516 22843 28418 28589 25228 26593 14105 2137 -19136 -18006 -9077 10476 13751 12132
20714 12132 14055 16996 6216 -11159 3191 3715 -6870 -15205 20715 15531 4662 10087 -6708
20701 -6708 -1981 -20983 -23782 -28481 -42223 -41540 -44830 -36836 7828 24261 6984 -6142 -8031
20688 -8031 -7643 7292 1099 25044 26102 24224 -152 -3446 5044 -658 -15008 -17348 -13334 -11317
20674 -11317 -14123 -9356 24480 -8242 -32665 -15417 19525 8151 -8996 -2684 4327 -27003
20662 -27003 -27568 -17803 -17608 -26594 -38812 -23614 -9661 -6853 3333 10491 10932 -9626 -33437 -38798
20648 -38798 -30007 -5726 24755 16616 -6364 6496 14349 10312 1303 3383 5124 -7761 2751
20635 2751 -8344 -18782 -18631 4087 -4221 -27465 -30158 -8743 2781 -14245 -23608 -40722 -38026
20622 -38026 -54761 -48673 -30640 -22829 -19818 -5165 14211 17932 15334 4379 -12372 -3659 9571
20609 9571 2040 -10948 -20736 -24051 -12275 -7995 -4646 4471 6570 11440 7257 -5495 11520 20031
20595 20031 2173 -5115 6840 36436 31652 -12187 -16916 5797 708 -17332 -29230 -23703 -18960
20582 -18960 -16133 -20146 -31731 -9084 10213 -3936 -20500 -8389 -6152 -11606 7467 5317 10551
20569 10551 20554 2557 -29397 -20302 -23666 -25083 -54160 -79289 -70425 -41908 -32724 -24032 -13471
20556 -13471 -13745 -5401 -28509 -28564 -38152 -39993 -31982 -59360 -57162 -21446 3608 19329 25907 -2444
20542 -2444 9650 6659 -21986 -40630 -45595 -38063 -11531 -9218 -18718 -20948 -23934 -19088 -5494
20529 -5494 9572 -6727 -11043 -10049 -1995 17279 44768 19333 23410 29049 -6252 -36787 -41314
20516 -41314 -40007 -11437 -35948 -59854 -58171 -44806 -37310 -26891 -7979 -10781 -5615 -12728 -13181
20503 -13181 -5251 -9199 532 15011 633 -5353 9098 3808 -20649 -14233 -13594 -4889 12079
20490 12079 14524 3685 -2649 11525 28672 34814 40364 38994 42110 20176 4203 1377 -870
20477 -870 -9736 -1369 9552 -4949 -26763 -21818 4960 -375 10853 -1999 -12561 -15482 -6280
20464 -6280 -17181 -9235 13621 18182 12496 11304 10587 23215 -3429 -1907 11782 15027 -3990
20451 -3990 -3169 7365 10771 3715 -12173 2571 2412 1799 4330 18333 16640 5054 1975 11850
20437 11850 8023 -2745 -15291 -29978 -2340 20425 25343 40690 45382 43641 36574 588 -10938
20424 -10938 -13005 -21066 -14515 -7840 -17767 -28096 -35914 -39233 -32632 -13760 9814 5160 1606 26443
20410 26443 31633 22201 34744 35818 14535 5147 8255 -4194 -27023 -37961 -50632 -48051 -43271
20397 -43271 -35248 -33855 -23874 7174 14339 24191 28318 41662 46448 26340 7811 -5214 3408
20384 3408 15602 22915 13119 27199 16082 7931 16824 7743 -16769 -12506 -106 -6068 8678
20371 8678 32028 35631 14620 -2574 -5906 2020 -3166 -4788 -13626 -8890 12303 25328 3479
20358 3479 -1858 -4822 4535 14673 4650 -20646 1630 27353 11060 1079 -18544 -15699 -13485
20345 -13485 -11328 3879 20611 12712 11546 21360 4058 -7675 -5483 -14618 -16026 -22020 -33511
20332 -33511 -21868 -12761 16410 1920 -27559 -17461 7062 16077 3491 3748 1427 -2609 -3937
20319 -3937 18597 28439 20866 41365 45212 35529 26552 13565 -2591 -2073 -9184 -8263 2114 22218
20305 22218 11183 9543 18668 7295 9515 3164 689 4244 -20316 -6050 -14728 6128 22205
20292 22205 -7618 -11706 -17161 -25523 -4578 6625 15988 -1956 -37970 -60082 -45066 -40997 -37011
20279 -37011 -13943 28797 16878 -20236 -36456 -41299 -39791 -37081 -42861 -44854 -63583 -48999 -42049
20266 -42049 -23532 2176 7969 -11303 -15819 1203 26479 -4479 -207 17204 34220 42828
20254 42828 47684 10908 -2243 -5354 5075 8280 15990 -4906 17779 35170 28867 16113 -6733
20241 -6733 -21770 -34207 -37228 -19700 -10369 -9345 -18646 -44511 -36094 -31855 -22064 3002 18561
20228 18561 7910 7210 19206 18871 -4317 -7372 -6452 -1676 -5187 -812 3410 -17508 -34881 -31951
20214 -31951 -7896 -2481 -24352 -28508 -31450 -26843 -17605 -15847 -15481 -36759 -55001 -51851 -33411
20201 -33411 -19308 -29755 -17765 -16827 -34408 -38399 -56305 -44648 -58846 -47519 -36861 -15592
20189 -15592 -22058 -20505 -32192 -40598 -33296 -24975 -41415 -20857 -15574 -20269 -19399 -11234 2028 7496
20175 7496 9188 -6758 -486 12630 1706 -14625 -44039 -59810 -57431 -60724 -39386 -30184 -19269
20162 -19269 -13493 -8571 -6513 -11163 -20682 -30781 -5414 6603 10703 -5015 15155 7016 3811
20149 3811 -2936 -17371 -15320 2444 31170 27693 8620 17846 47962 45617 13333 -2268 -8947
20136 -8947 3528 -12408 -31653 -20683 5127 4268 -19895 -16496 -15108 -8354 -11417 -13974 -7832
20123 -7832 -15073 -11627 -14421 17080 22366 28607 37246 28748 4797 6117 5877 9073 -1731 -26441
20109 -26441 -30853 -14771 -538 9040 25229 4089 8500 -6923 -20337 -26360 -13659 -23076 -23486
20096 -23486 -15348 -2161 12539 7214 -1754 -5081 17942 38460 19113 -7704 -35000 -36938 -4836
20083 -4836 14482 7756 1788 -978 -13215 -1528 11418 2027 10742 13907 -5108 -7648 2795
20070 2795 13048 10108 227 -20896 -20455 -7287 1115 -681 6117 8176 -18865 -45929 -37400 -46569
20056 -46569 -48467 -25848 4085 13053 13590 17884 30530 19553 10452 21636 -729 3930 6110
20043 6110 -12904 -3472 -16550 -33723 -28404 -28691 -21650 274 2848 5452 6567 -14844 -30528
20030 -30528 -32221 -22529 -20705 -3667 14744 27917 26978 14358 7394 13012 21784 23954 525
20017 525 -9722 929 8570 -6306 -10483 -5124 -14245 -22996 -37703 -32750 -11462 -17461 -13205 -2662
20003 -2662 -20268 -11652 -4689 20959 47197 55002 36884 9912 -5583 -10361 3466 5265 -1660
19990 -1660 3482 -13310 -22684 -7079 -4074 -17966 -16696 -12065 -31032 -30319 -26013 -7438 -1501 7640
19976 7640 14529 -9208 -14663 -14057 -15299 15885 25327 10935 -14891 -21086 -34653 -56893 -50612
19963 -50612 -38499 -6862 -14883 -5848 2392 -11300 2309 10153 -4387 -11667 -3773 7945 10695
19950 10695 -2666 -23970 -5987 14667 43855 35680 41315 33924 13515 11158 328 18348
19938 18348 13085 -12330 -24818 -23818 -18337 -16133 -15859 20931 47212 39879 34871 18167 -534
19925 -534 -9973 -23888 -40252 -33121 -24439 -900 5600 25097 30448 27822 9820 -24532 -22274
19912 -22274 -9445 1187 -8678 -15450 -23543 10266 6523 -19071 -7021 5527 15368 14245 -3964
19899 -3964 -26523 -34618 -25716 -6605 12372 15446 6753 -1204 -17847 -36318 -26262 -999 -9179
19886 -9179 9477 24750 16482 -10938 6409 -7672 -18792 6047 15305 14229 -2726 -5416 -7177
19873 -7177 8667 9107 4527 17527 25124 5908 11944 21390 29279 35326 26921 44329 50911 21845
19859 21845 18581 42801 22329 -17432 -42828 -32384 -11304 10219 4210 7272 13008 1358
19847 1358 18693 14480 25715 22672 -12345 -13950 27893 56548 47295 55120 48963 21055 17783
19834 17783 16310 9197 8776 10374 -4537 2818 18780 17369 22999 7663 5818 15986 9433 24385
19820 24385 34333 14760 15849 9390 23600 27516 37140 47714 51829 32167 28795 18313 27214
19807 27214 23635 14163 5352 6188 -9398 -27621 -43112 -31601 -12231 -7814 -9274 -5864 -15392
19794 -15392 -9978 -21995 -11170 -6961 -629 1988 -5736 -3494 61 7570 -15101 -24408 -27699 -13126
19780 -13126 5584 -9187 -13588 11232 19441 12245 9557 20538 14166 -7426 -3197 -9842 -9441
19767 -9441 23856 -1099 4934 18721 20097 12476 4109 -19967 -41414 -37735 -6135 13027 24613
19754 24613 18929 7010 -2619 -22345 -18024 6053 15489 5204 11804 7838 20574 28573 28906
19741 28906 46969 57220 35539 15585 16122 40377 41760 10761 6538 10544 19329 42408 55733
19728 55733 56838 50577 26977 -3356 7356 21631 28110 23302 10741 13048 21650 9398 20413
19715 20413 34996 27332 18785 42281 66997 76810 79241 70996 43853 29922 27686 2160 -5711
19702 -5711 7351 34771 22628 -5123 -12166 -7819 2963 15284 11243 4834 7985 12913 8652
19689 8652 -3792 -31580 -33878 -17763 10370 38087 54560 57606 47536 46175 49688 46260 32240
19676 32240 27770 52661 44063 39855 36348 37850 39969 59738 62073 51627 50685 37317 32623 17255
19662 17255 22355 14743 6509 21643 35209 42782 42876 35041 17412 43303 52066 49215 53899 50545
19648 50545 24794 15382 16227 25995 40505 36641 24135 19535 16590 34525 25091 45126 55136
19635 55136 53322 58798 80690 69427 63502 62738 53829 41795 17899 14267 23114 27864 28042 9573
19621 9573 -7652 -10921 14870 28803 44916 52594 52834 36913 30649 27573 33547 35644 20290
19608 20290 1876 -1552 -8522 30985 47100 56828 67674 68012 72692 78433 67670 57443 38857
19595 38857 25566 47067 68296 68420 89195 123501 116115 94741 100169 113012 146927 188497
19583 188497 222012 252185 261844 267331 287051 283855 259613 254684 222308 204667 198140 210028
19571 210028 220988 253834 271687 284370 309231 302192 285415 273292 253064 235007 222135 211447
19559 211447 187894 203067 202227 171216 175998 172782 131843 127197 128778 141582 161147 182400 152567
19546 152567 133971 147630 179472 182607 186395 172957 191502 202929 186755 167210 177691 184379
19534 184379 184722 177369 181318 188257 204939 228925 255679 288133 332670 369015 373149 363295 344208
19521 344208 340986 339535 321452 304885 292022 297295 295637 295756 272395 259705 224947 180400 145860
19508 145860 144572 147382 133689 140468 126256 89770 77232 68109 83012 110680 121886 125261
19496 125261 144566 145166 130372 111165 81436 79778 99544 118141 109948 95188 97463 98930 88927
19483 88927 96973 100538 85577 74954 83549 83699 98905 89834 85183 103972 119671 128395 128472 108099
19469 108099 98144 97956 96665 82307 75838 69472 79237 93866 139362 125487 112656 102382 116325
19456 116325 124082 122755 123591 103417 106328 122906 142895 156555 155786 143342 139877 120918 120381
19443 120381 142179 167603 166287 155222 167881 160091 164127 164726 159089 149686 146070 133101 146847
19430 146847 150997 142406 121533 106577 112264 121712 141733 150012 142284 126799 147382 161687 169954
19417 169954 172392 152703 154870 166100 160528 166759 174670 172835 193571 181846 179102 199864 214199
19404 214199 210645 200927 245197 313511 348216 358636 367118 402881 426208 454940 507379 580186
19392 580186 644471 744922 851412 937115 1005949 1065897 1050794 990770 910051 842468 773699
19381 773699 693213 616481 574774 563930 548527 524698 486888 454987 429642 384207 349712
19370 349712 329600 325468 330718 311264 309005 329673 343228 335501 319438 327020 330943 336251 336021
19357 336021 329245 326464 337832 372642 406534 436967 453093 506971 537616 602076 642616 689705
19345 689705 687800 684132 719838 757157 813576 935922 1062765 1214296 1357216 1487846 1589713
19334 1589713 1662466 1617640 1440305 1244382 1053593 880553 779802 718489 658909 613886
19324 613886 586747 560081 544106 497382 456764 446354 438799 437032 411910 390078 380553 380261
19312 380261 385699 406760 402267 368229 346554 338107 339470 312360 314798 337871 369127 387209
19300 387209 389199 372190 376489 383481 377446 346771 322480 326812 325884 343147 352701 359546 385851
19287 385851 434217 443071 440609 444305 443792 432969 459030 464548 464782 470951 476626 481736 528696 546926
19273 546926 591268 618808 624158 611730 584964 565278 550622 518019 505881 497266 465959 441572
19261 441572 395360 370183 378812 374082 369274 384384 379238 389672 382748 370675 359800 379239
19249 379239 427055 455796 484865 499813 505914 527780 541930 549922 543250 535647 555461 574473
19237 574473 567197 570249 594168 647919 701428 741179 796424 850223 870236 881173 888051 859270
19225 859270 794784 740137 721109 704400 673225 658307 646285 596955 567177 576333 565296 573865
19213 573865 608865 632212 631246 619636 625685 616243 608013 623183 639110 666236 671872 676930 701918
19200 701918 732104 784641 822549 876013 922963 979420 1050830 1114630 1183709 1248488 1295952
19189 1295952 1381955 1515363 1729692 1989044 2257476 2472725 2551755 2475837 2268334 2013118
19179 2013118 1745083 1489263 1291677 1168800 1109740 1090834 1090382 1098980 1121482 1140622 1116184
19168 1116184 1067985 1001693 948101 911977 894827 904717 894562 878568 888781 909307 942102
19157 942102 980035 977432 972808 992724 1012376 1012769 990912 947526 966123 992735 1011282 1042535
19145 1042535 1091417 1128325 1184545 1262339 1309237 1305177 1309197 1306252 1334611 1405832 1511474 1636705
19133 1636705 1757961 1865206 1955369 2002163 2055767 2051948 1933248 1797777 1708060 1662181 1670246
19122 1670246 1697894 1763422 1837090 1927612 1997214 2062541 2103930 2181129 2308344 2479827 2714186
19111 2714186 2987719 3335050 3753646 4173202 4548357 4803583 4902888 4922927 4910472 4926991
19101 4926991 4992347 5199309 5566521 6091871 6791969 7653585 8572789 9389406 9983534 10317005
19091 10317005 10400631 10366724 10328927 10417357 10759800 11399531 12429858 13765675 15261964
19082 15261964 16623549 17607837 18193795 18621370 19416479 21034968 23753004 27765782 33279492
19073 33279492 40421509 49057822 58426227 66751005 71645470 71873479 67660368 60992811
19065 60992811 53387507 45795987 38987100 33872504 30862686 29897296 30408262 31555769
19057 31555769 32406801 32085159 30261686 27339130 24181261 21416102 19223469 17635146
19049 17635146 16565614 15968929 15783117 15956844 16431745 17094291 17825043 18478834 18959243
19040 18959243 19208410 19201874 19005050 18702900 18582632 18914553 19844920 21501476 23894033
19031 23894033 26930976 30342180 33578143 35902276 36813465 36526608 36034921 36488601 38738142
19022 38738142 43187897 49781796 58047812 67056517 75364447 81583270 84430129 82647876
19014 82647876 75732319 64475367 51518410 40060652 31592732 26207282 23131869 21521630
19006 21521630 20827204 20662567 20693918 20483846 19689671 18237484 16404457 14627995 13179797
18997 13179797 12106476 11329072 10775659 10383468 10033973 9728977 9447952 9127173 8768733
18988 8768733 8356073 7900056 7396758 6930952 6532446 6157559 5841838 5557389 5288976
18979 5288976 5045390 4846181 4655241 4475555 4265138 4063499 3870856 3701622 3565346
18970 3565346 3431197 3292730 3187254 3102648 3008662 2964535 2902170 2826425 2755427 2692856 2667309
18959 2667309 2628202 2577868 2522338 2461557 2404603 2365152 2290590 2211015 2163495 2129360 2101177
18948 2101177 2093940 2062161 2028473 2011476 1985154 1918489 1861040 1781816 1687229 1597164 1503900
18937 1503900 1447949 1398375 1340716 1292511 1242569 1211148 1168901 1148788 1124842 1094504 1063327
18926 1063327 1041126 1006949 987027 956158 960880 958604 933256 936368 958368 995738 1005253 1009808
18914 1009808 1030549 1036454 1053600 1102928 1158791 1178869 1182363 1196082 1179040 1162680 1158214 1167320
18902 1167320 1163370 1158516 1162123 1161872 1156128 1138130 1139208 1132028 1136533 1124724 1096191 1050164 1025266
18889 1025266 989538 957585 909099 837632 763896 740239 727105 725619 695669 682845 673205 671590
18877 671590 665866 670530 675385 671109 669549 636254 633751 648443 642789 640036 644682 656773 679444
18864 679444 699212 696983 670636 666517 678507 706239 735751 768132 813993 857544 884784 898725
18852 898725 903432 867247 829117 806102 792235 751921 712593 670771 679878 696221 685681 677616
18840 677616 676174 645404 601444 557558 530196 520690 511580 525311 542724 550559 537852 539683
18828 539683 515558 494250 490613 465806 475780 462778 443262 438746 434740 443774 464900 482790
18816 482790 503397 512996 534028 530814 555162 576526 558940 526648 542192 579740 615050 645507
18804 645507 682780 742099 809267 862541 897409 937783 1002446 1084272 1130363 1097699 967074
18793 967074 796950 659519 567820 499631 453121 437848 425322 412553 391901 381292 370874
18782 370874 345042 336683 346030 380704 406493 406947 413547 426189 426034 432846 426191 425236 426474 455946
18768 455946 453936 467767 523438 554615 539612 512100 464762 412689 382811 396515 396768 405889
18756 405889 409719 419455 394500 363709 376441 383406 387335 385359 360331 358100 371768 379587 410463
18743 410463 421906 406400 411470 407896 395188 395836 416484 454775 488794 492846 481979 442240
18731 442240 415114 408251 403898 410810 415779 392182 379749 381373 384315 364014 356853 373912 382970
18718 382970 375898 349086 325305 337258 348786 342018 328746 317560 331357 334005 326487 328216
18706 328216 340450 344531 356007 360503 380521 384685 406485 406975 406950 362594 351765 396283 424485
18693 424485 425876 416948 430716 444605 445388 486145 506981 524935 538333 526897 522446 543032
18681 543032 526453 508094 494408 476589 442037 406639 384177 374809 352429 332836 326115 323305
18669 323305 330517 336453 342298 335204 357335 372017 374254 365840 364017 372930 376938 356565 358928
18656 358928 384430 382599 368965 336022 325208 314940 318040 327981 314785 298544 279258 289438
18644 289438 293057 291486 296660 298369 282848 274057 285575 296122 299482 294516 284710 299384 310452
18631 310452 304462 287014 285895 263306 266789 298118 307201 297209 312636 328569 303140 287920
18619 287920 299484 288905 294455 336503 365975 366004 347447 350770 366561 348656 342120 328558 339437
18606 339437 366077 383660 374129 357288 356643 338881 320402 310277 321553 318248 322330 339166
18594 339166 350535 327187 308758 290420 292034 292790 300183 327531 327832 319596 306906 329057 337536
18581 337536 342164 338652 319189 318108 321721 346250 353558 363504 398989 425831 459051 503490 534467
18568 534467 538261 537509 523820 527915 531806 538547 577555 584954 573614 574988 576585 592991 586288
18555 586288 569605 549232 544220 563609 580816 610506 618362 612162 626857 620994 592129 571446
18543 571446 552229 566351 591880 589784 580040 564102 540053 528119 494937 498566 498759 505328 517500
18530 517500 544632 552333 545770 552087 551794 566650 594743 614031 647099 705151 720200 750627
18518 750627 795127 816568 823948 885936 924046 908530 891232 881183 865679 862720 882267 916579
18506 916579 970680 1058698 1150743 1234241 1312989 1371442 1390165 1389844 1353991 1324697 1313284 1307217
18494 1307217 1304852 1274689 1250000 1229148 1231252 1270479 1297417 1347880 1441631 1496803 1539591 1609844
18482 1609844 1728746 1902429 2125218 2381877 2708289 2991792 3050861 2818051 2395864 1980573
18472 1980573 1736036 1612421 1549320 1527632 1489657 1454524 1427911 1418242 1433807 1472489 1470346
18461 1470346 1443798 1439326 1440017 1459934 1469598 1493010 1509698 1543789 1598670 1634395 1663369 1691573
18449 1691573 1737989 1783783 1834386 1901573 1984355 2063323 2149043 2267452 2383062 2513380 2656881
18438 2656881 2813369 2980023 3178362 3402847 3634573 3903429 4179330 4466742 4791220
18429 4791220 5133589 5508666 5940885 6439900 7041555 7820801 8794674 9944155 11345160
18420 11345160 12939056 14593835 16173130 17556110 18773650 19875735 21129174 23045051
18412 23045051 25950378 30126255 35926906 43519466 52519582 61993688 70815134 77079393
18404 77079393 79625536 77727657 71952359 64380776 55817672 47304078 40530987 35818313
18396 35818313 32965846 31777617 31624057 31810793 31604929 30559598 28524678 25777374
18388 25777374 22983412 20503196 18509129 17140403 16297699 15756894 15385867 15175196 15077861
18379 15077861 14992669 14897237 14830092 14809277 14908734 15145867 15559742 16203833 17136956 18360526
18369 18360526 19976415 22116340 24755250 27729453 30808000 33642483 35862181 37348652
18361 37348652 38303106 39325879 41046162 43828157 47870032 53086602 58971750 64589885
18353 64589885 69002392 71335748 70926613 67516069 61170109 52316264 43264909 35354760
18345 35354760 28881841 24383413 21691126 20208638 19405270 18980199 18703756 18290732 17615396
18336 17615396 16638721 15449966 14277602 13238983 12427233 11845115 11383272 10991362 10650536
18327 10650536 10275855 9935096 9609648 9306716 9028226 8774523 8553097 8345839 8217407
18318 8217407 8097115 7981745 7894965 7854204 7861071 7915449 8012975 8211292 8456774 8672708
18308 8672708 8748261 8724962 8671829 8521380 8155395 7611938 6988657 6388916 5777017 5204700
18298 5204700 4728911 4372270 4089602 3872593 3695461 3546954 3390314 3225767 3084458
18289 3084458 2966311 2855528 2735254 2647586 2567775 2505481 2456116 2412276 2388815 2330599 2288120
18278 2288120 2266389 2218826 2148514 2084356 2028873 1982806 1950981 1924005 1896883 1872682 1856159
18267 1856159 1822888 1794647 1779394 1775246 1744111 1722102 1745393 1774964 1831921 1861460 1858235 1895855
18255 1895855 1914374 1946612 1996322 2026534 2060194 2099257 2089897 2097939 2122735 2162265 2209757 2276339
18243 2276339 2376317 2496089 2661757 2826620 2980645 3157882 3386747 3649920 3967235 4351380
18233 4351380 4804294 5327931 5854304 6343502 6841825 7390755 8014580 8706539 9479414
18224 9479414 10379501 11439262 12811664 14584024 16888834 19880194 23906301 29378120
18216 29378120 36695923 46285380 58528367 74017389 93646392 114512183 126523153
18209 126523153 120691900 96166289 66287917 44733273 32228465 25079885 20736012
18202 20736012 17934759 16046887 14716736 13749934 13067665 12639948 12450707 12510626 12815524
18193 12815524 13336037 14037520 14930840 16025109 17228700 18346048 19242761 19865504 19870185
18184 19870185 18650055 16186024 13376918 11121018 9574316 8547371 7796774 7192389
18176 7192389 6711177 6307727 5966076 5682335 5473492 5318579 5176190 5026683 4868870
18167 4868870 4687593 4507493 4318373 4108619 3877722 3701519 3584045 3456154 3291455
18158 3291455 3127716 2994244 2885126 2779460 2671931 2582425 2492405 2393902 2313961 2253204
18148 2253204 2179853 2131028 2108963 2104995 2073012 2074939 2110346 2131628 2176635 2188458 2175934 2131033
18136 2131033 2039432 1934560 1850826 1798457 1775776 1751031 1762322 1809238 1860844 1938331 2049812
18125 2049812 2159329 2257476 2342147 2492851 2737506 3031548 3375961 3808946 4375341 5093099
18115 5093099 6037823 7333671 9080314 11401578 14474073 18351999 23362561 29932540
18107 29932540 35453708 36211092 30572958 20668901 13250064 9166144 6938046 5635419
18099 5635419 4774986 4193241 3784000 3484039 3254932 3110386 2962022 2827395 2747570 2679342
18089 2679342 2625773 2564069 2545969 2543994 2507634 2447096 2423394 2395852 2338202 2233387 2096542
18078 2096542 1977956 1862907 1745695 1637022 1558412 1472417 1380032 1309370 1245490 1196747
18068 1196747 1154169 1135824 1093858 1055718 1024148 996723 965339 933932 922315 917799 907029
18057 907029 892830 874690 869178 818160 769348 740948 706131 672342 637305 646271 632871 578617
18045 578617 553105 542000 500974 476158 484010 497869 498793 492860 465496 433981 428113 440021
18033 440021 436959 429879 415959 419687 433424 441547 445986 430575 410441 382337 378495 384378 372742
18020 372742 345478 343058 318451 298808 285139 268003 279806 296338 282102 271874 270788 294856
18008 294856 292074 295494 274868 239122 251390 261068 242104 230651 243014 244005 237401 245351 260686
17995 260686 278018 260709 257500 277913 275616 267072 276823 279808 283231 289870 299781 296033 312850
17982 312850 315297 285574 286798 289317 279073 249433 233462 229316 247224 236977 189684 179021
17970 179021 200383 202900 186554 182596 192668 184257 165363 185898 191133 183598 186794 185722 201098
17957 201098 206490 189100 163119 149530 156183 166817 176205 185416 179238 131329 102803 134873
17945 134873 161228 172281 187663 181774 164320 150766 143186 162753 184629 174993 158174 139133
17933 139133 137269 157517 183234 187451 163975 135458 108830 78007 58586 45527 67739 111052
17921 111052 143244 167247 173814 162865 153343 163281 167013 169114 177303 200036 202242 204630 224591
17908 224591 232367 264128 321924 352938 364399 336392 351622 391192 401337 381234 348166 332959
17896 332959 354241 369052 371940 367427 352417 338435 322081 278828 219233 207368 198264 193686
17884 193686 201494 188295 203781 207124 187733 175721 197682 206285 189668 179319 172405 162052
17872 162052 155931 146598 136424 118710 131564 138914 139055 167616 182921 203136 221801 239971
17860 239971 254088 248056 265231 310408 347732 350056 341995 373199 391462 380324 334568 290354
17848 290354 266619 260977 257573 268286 259318 240734 252909 297424 339596 352697 352422 345554 333172
17835 333172 323063 285783 250035 208941 190616 186284 174861 176719 141864 112029 115753 127801
17823 127801 155154 146039 110586 128331 126943 114602 122380 120508 104439 88616 95927 100942 113096
17810 113096 105539 80067 53475 47221 85000 113540 114323 92021 78009 68153 81416 63428
17798 63428 69603 79702 88523 75956 75297 69356 62878 66857 66380 47121 51204 66426 71889 51919
17784 51919 56852 90023 96547 79899 67850 60353 61342 65675 77916 72565 58832 49753 63222
17771 63222 72431 88266 75852 75686 86008 102375 93602 68820 43064 44789 49335 35637 6464
17758 6464 -47 18074 8653 -1271 30274 32184 17100 14388 29021 35849 21235 14580 40234
17745 40234 51037 27708 16031 39143 51063 43798 27536 14023 22098 11611 17434 29581
17733 29581 31959 38029 30826 47824 43945 45792 59815 64046 45872 40544 37103 11058 11226 48417
17719 48417 60880 52418 42583 57701 58083 65286 74911 66359 54619 20174 -3531 -8506 6946
17706 6946 22741 28460 50740 42941 32810 15842 8475 -6872 -18973 -35707 -43790 -26657 2067
17693 2067 18042 31621 4479 14692 43985 66178 52155 44638 34807 36082 56296 63147 35968
17680 35968 32173 30581 37757 47406 47110 57624 65804 50819 63280 54514 75181 72143 54955
17667 54955 59205 55737 24586 20580 50233 66036 67571 51151 30957 38570 45601 52523 55343
17654 55343 48352 33646 34140 48576 78235 89056 72277 82630 91152 116170 108666 107723 83040
17641 83040 74623 88133 95685 97273 107250 134398 173009 171596 141103 150682 142768 133907 120784
17628 120784 124543 130971 178611 218051 251878 295977 341488 409956 476769 549975 644487 714489
17616 714489 720463 636923 499008 375255 281847 247852 211767 199234 186118 165489 156244
17605 156244 145214 161730 165133 145065 173071 193001 172014 159678 182202 202832 216550 245001
17593 245001 256172 263730 277774 275856 270261 250182 275388 297008 286721 262952 254460 260124
17581 260124 262765 243139 243117 274109 294546 275671 298320 318800 315272 299219 290917 294330 326004
17568 326004 370853 418177 443032 461862 482155 504133 561458 577470 596616 603218 582738 584810
17556 584810 579989 562703 551748 536964 541991 540647 545103 527345 507659 522991 550779 568605
17544 568605 570677 549448 534222 499465 467570 438945 430070 423883 412817 418053 432795 436571
17532 436571 448730 445068 429250 388430 371722 382191 408666 423351 406746 364637 348552 356204
17520 356204 354782 372090 390855 410857 436858 444723 448933 492713 534281 558679 561215 581380
17508 581380 593940 604767 623353 622698 598413 567438 559243 530148 490339 481797 466929 434206
17496 434206 446934 441216 444962 437400 428744 431660 417529 417190 417914 389832 326943 291520 287354
17483 287354 280234 253471 227870 213848 195901 188582 176210 147753 107564 94016 103966 117867
17471 117867 121365 115320 104709 94397 114528 96573 82761 87693 81487 83594 93773 96901 117204
17458 117204 126022 118264 114948 97932 83836 111024 117648 99293 101958 126076 136418 139016 163017
17445 163017 184200 189322 213433 245541 254521 253278 255246 209052 166030 120260 93335 65342
17433 65342 49864 50678 54185 62280 41944 40709 69721 71467 59801 41153 38645 27863 27820 48588
17419 48588 55677 34703 30364 39027 30640 44372 68232 65736 44568 29278 17918 15340 20178
17406 20178 31200 50200 56647 58452 60118 52802 57979 66390 68407 57152 46925 28365 41833
17393 41833 42282 36750 27590 32795 43144 46825 27230 21743 23611 32918 61785 63563 47896 38133
17379 38133 48259 51404 28958 -14586 -23418 -27776 -10147 -7678 6240 17855 28118 33458 33959
17366 33959 43798 57758 67403 83172 54633 56397 68559 47548 36144 22617 12571 13436 15294
17353 15294 -3259 -29870 -29995 -26117 -3902 2359 -6785 -5430 -12016 -14384 -6722 -10072 7090 22359
17339 22359 48995 43837 11571 -5775 -16308 -17069 3159 22116 35530 15927 7197 24126
17327 24126 40292 68832 82992 57940 20716 1081 16806 4044 -25568 -3823 -5268 -11724
17315 -11724 3727 1880 34427 43388 23141 17693 28408 25373 34445 42717 46966 22734 17112
17302 17112 -1394 -27343 -32371 -39407 -40280 -30400 -29213 -9327 30180 54829 31574 6515 -29553
17289 -29553 -26360 -27633 -17448 -8239 -2276 16195 34880 31697 22990 1924 -9225 -17836 -29582
17276 -29582 -39276 -19986 -8873 -13051 -14798 9907 24527 7006 -17881 -31145 -31199 -53288 -53254
17263 -53254 -41411 -30522 -52329 -54856 -23582 -18285 -17647 -34875 -38018 -33650 -23915 -18877 -20301
17250 -20301 -17808 -27530 -12331 -12139 -25370 -17737 -26057 -21964 -18314 -26901 -26840 -26122 -50169 -49841 -36623
17235 -36623 -28470 -38659 -46074 -54157 -58309 -37193 -40274 -65511 -50634 -46797 -35922 -27169 -32721
17222 -32721 -20021 -28477 -33342 -40052 -35835 -26656 -20373 -29351 -37555 -32886 -27790 -2971 -13873 -40633
17208 -40633 -39878 -23374 -8767 -19329 -26816 -31682 -37170 -28584 -18510 -16815 -26736 -39917 -52218
17195 -52218 -59088 -55672 -34677 -43119 -28134 21784 25793 9274 13133 14173 9455 20183 -11917
17182 -11917 -57954 -70544 -49880 -49342 -34451 -17021 -25773 -27509 12393 35222 32369 51076 22671
17169 22671 21491 24955 10574 5244 1634 -12773 -9463 -19314 -24493 -11338 -8707 -19966 -34995
17156 -34995 -49464 -36516 -29347 -35567 -40541 -34703 -26361 -16240 -6467 -19599 -36791 -18195 -12608
17143 -12608 -12628 -20179 -8934 -5004 -20040 -17201 6220 7142 4623 -406 -12802 -7551 2637 -1831
17129 -1831 3274 -5127 -21197 -12065 -29214 -31467 -34913 -32542 -30444 -27024 -24313 -39028 -39423 -24076
17115 -24076 -39396 -38385 -17353 -12495 -34011 -28352 -10821 -5480 -14597 9379 15619 -7867 5889
17102 5889 8085 -3870 -27779 -24110 -3860 17920 38839 28641 2289 -20579 -21501 -22220 -2605
17089 -2605 24198 27415 14733 -15661 -28296 -20756 -3904 -16149 -33525 -49587 -21359 -8965
17077 -8965 -9156 15909 50989 61697 37421 28923 24212 -7599 -8068 -6783 -3279 -7256 -16093 -21407
17063 -21407 -29282 -29979 -10037 15619 16339 4686 -616 -73 -2408 -2348 -8748 -36564 -53261 -51451
17049 -51451 -38905 -33815 -30090 -39955 -48300 -29607 7759 7269 -5028 -6843 -42568 -83855 -61760
17036 -61760 -34332 -30457 -9415 -3187 -7035 -2538 -16967 -14476 -13873 -7263 -8026 -9851 -15756 -9076
17022 -9076 -4045 -13691 -7732 4883 -3182 -4861 14189 3491 -5564 -3312 -20760 -20051 -21878 -14989
17008 -14989 -19421 -41845 -54607 -51281 -47595 -45262 7117 30330 28409 -483 6941 8157 11434
16995 11434 -23099 -26872 -42446 -28900 -17382 -37580 -29074 -162 11703 6185 5576 -22597 -36890
16982 -36890 -39939 -44358 -43649 -39035 -41720 -21395 -9347 -11963 -12517 -2853 -5109 -18933 -27724 -22460
16968 -22460 -4524 9432 916 -7943 1894 -11410 -37855 -50494 -38657 -4172 6272 -547
16956 -547 -3318 -27952 -39994 -42631 -30310 -13744 -10365 -10547 -866 -26120 -35350 -45022 -36990 -45432
16942 -45432 -29334 -8860 -26462 -33041 -15388 -838 -5986 -17323 -25152 -14662 13185 -68
16930 -68 -5615 -3801 -25430 -29893 -27149 -31924 -37597 -42537 -29271 -47293 -38376 -20734 7275 36407
16916 36407 41908 13287 1443 -15550 -42436 -42024 -31328 -7409 -18728 -20852 -36310 -28880 -32085
16903 -32085 -22633 -36460 -37624 -24905 -26156 -57715 -65777 -66983 -59862 -48212 -36860 -44648 -35082
16890 -35082 -19354 -36320 -25161 -15888 -9506 -16014 -30288 -41044 -52005 -59300 -46768 -48511 -26342
16877 -26342 -3146 2698 -346 12169 17454 13184 -9993 -28861 -55395 -57655 -44679 -33064 -43245
16864 -43245 -44852 -42085 -34710 -19083 -26992 -23430 -26717 -17213 -26428 -12511 1557 4644 -7118
16851 -7118 6047 -1196 -27189 -31759 -53601 -54355 -53182 -54489 -41425 -24631 -30626 -17963 -15048
16838 -15048 -17051 -27226 -25460 -29142 -25403 -31953 -24669 -27373 -49236 -64964 -56243 -33903 -29957
16825 -29957 -52199 -65708 -53625 -34619 -25459 -23714 -23244 -20407 -17351 -27116 -22892 -28264 -34100 -49130
16811 -49130 -74333 -81444 -64884 -48166 -52072 -57399 -49758 -44647 -21310 -4881 -16910 -20911 -5637
16798 -5637 -4361 -7834 7696 28345 29240 14795 1562 -14445 -17314 -14310 -40470 -40256 -30199
16785 -30199 -35170 -34431 -41519 -58268 -51323 -39086 -10139 31684 26379 -4246 -40766 -40534 -46896
16772 -46896 -21019 -12622 -24953 -18053 -3744 -14354 -14341 -13727 -21514 -34110 -62072 -49687 -41325
16759 -41325 -51840 -36217 -27175 -22259 -16211 -14642 -7605 -14089 -29025 -38137 -57497 -28323 -37822
16746 -37822 -41546 -18428 2648 8338 -678 -26934 -26855 -11506 5449 10931 -4953 -26899 -17916
16733 -17916 -11147 -23931 -58811 -74381 -86967 -87772 -61993 -40503 -29264 -34161 -53226 -54959 -37607
16720 -37607 -31601 -36761 -29714 -17574 -4724 -18015 -23325 -13547 -31260 -29972 -42060 -49350 -31105
16707 -31105 -4890 1103 11448 -5373 -22410 -20031 -22553 -25525 -32568 -31075 -23870 1571 -17059
16694 -17059 -32724 -33020 -29629 -30140 -17570 -2023 12752 -2716 -28317 -13281 -3344 -12440 -16957
16681 -16957 -11892 5141 7314 978 2163 -18981 -24093 -27527 -29910 -31044 -23417 -25347 -41067 -25044
16667 -25044 -29131 -34378 -22050 -24868 -33234 -33491 -24205 -5789 -22006 -15426 -12677 -34121 -44047 -44173
16653 -44173 -41525 -41663 -57676 -49064 -48106 -42500 -21992 -19043 -22034 -19942 -21619 -4086 5184 -14546
16639 -14546 -23266 -19864 -2513 16695 -2717 -7617 -33044 -23448 4115 -5298 -18512 -12464 17037
16626 17037 12968 8641 826 -11710 -23124 -35478 -57779 -58509 -14975 -1870 6603 20439 19597
16613 19597 11428 -9516 -16051 -4042 -16204 -12698 21406 15113 -1286 -2014 -10636 -5041 -347
16600 -347 -24044 -55023 -47514 -22349 -31581 -18021 -27047 -52074 -30042 -20439 -25626 -23891 -21397
16587 -21397 -27734 -17792 -20050 -37565 -32058 -15688 -9879 -243 -6775 -28949 -60994 -58856 -70676
16574 -70676 -82282 -86641 -72687 -49785 -35756 -40097 -44749 -23317 -6885 -15554 -29066 -27493 -45256
16561 -45256 -51652 -40594 -11639 -5021 -20688 -52190 -41807 -29091 -14634 1046 -427 -3186
16549 -3186 8031 9535 35576 31777 3098 -17767 862 11847 14588 37993 43380 16197 -2791
16536 -2791 -650 -25361 -31769 -20833 -15270 -21033 -28443 -19220 -2312 16520 -2314 -40167 -33384
16523 -33384 -15763 -11496 -14967 -17930 -18819 -28272 -32191 -20474 10471 -538 -18503 -35663 -34097
16510 -34097 -21238 -11652 -2174 -15014 687 777 -17767 -33639 -24171 -8024 -15949 -24907 -40312
16497 -40312 -56495 -45010 -44293 -50150 -44595 -19228 -46039 -67029 -62552 -43251 -31505 -38361 -46129
16484 -46129 -43474 -24695 -1138 1657 -22326 -34986 -43759 -46987 -67715 -65136 -57343 -42587 -16941
16471 -16941 -9344 -5282 -12215 -27065 -24844 11605 8667 11906 -2830 -3851 11778 34716 41933
16458 41933 15069 -1125 -3406 -2445 -4494 -7634 -26492 -31907 -24874 -36673 -35288 -28839 -14538
16445 -14538 -12827 -20881 -32061 -31570 -19058 601 8983 1704 5386 14924 6593 -5558 6350
16432 6350 11442 9005 7204 23816 38301 13660 -15720 -19728 2564 8595 578 -6406 -26017
16419 -26017 -30154 -21631 -35283 -51008 -35685 677 -3420 -21224 -24695 -39230 -28373 -10949
16407 -10949 -8463 -30074 -51547 -47219 -38053 -48206 -10804 20775 16396 15541 21354 37677 22434
16394 22434 27703 47601 33793 9931 -14375 -19623 -6242 15205 -12877 -27177 -16764 -3836
16382 -3836 -4451 -5507 812 -1360 -2232 6573 12967 6455 -11199 -12572 -32361 -24770 -30989 -37570 -15533
16367 -15533 -9873 4898 31742 15220 15174 25393 3925 -25003 -40553 -27515 -17442 -14528 -14862
16354 -14862 3575 -2003 -18554 6309 2120 2110 17638 23899 41014 57331 39140 17867 -16785
16341 -16785 -24787 -33244 -33711 -39599 -58237 -55044 -38508 -17380 -12640 -17087 -20554 -23381 -1460 15756
16327 15756 27192 18451 32355 34017 26732 9489 7167 -5698 -38664 -18598 -5975 4564
16315 4564 4084 -21926 -17367 -16400 -24302 -24714 -15130 -2058 -1900 -12438 -18686 -6000 -19414 -27678
16301 -27678 -27665 -24115 -17582 -19189 -1707 16848 7471 -10369 1004 7360 801 1960 -9169 -10763
16287 -10763 7790 25917 16210 4417 -10847 -38043 -50113 -25054 -16920 -20231 -24215 -33360 -11809
16274 -11809 625 -6181 -601 5204 -14265 -25078 -27170 -28661 -23275 -10181 -4849 14551 27958
16261 27958 43312 39229 36400 30261 4222 -30406 -28956 -32378 705 19512 14500 11376 -21890
16248 -21890 -40217 -21817 5559 19799 11797 4313 6340 3157 6979 409 -1026 -11105 -3183
16235 -3183 -1014 -1237 -25212 -28464 -28116 -52023 -56648 -51285 -47376 -27146 -25539 -4480 8896 3324
16221 3324 15142 24499 2661 -28066 -24235 -4137 -8765 -92 -3260 12835 26396 47012 32015
16208 32015 -1375 -28010 -40795 -57711 -72107 -71140 -75378 -42426 -16665 2331 17152 -12110
16196 -12110 -18992 -42151 -34496 -36295 -24687 -29195 -43007 -41710 -33867 -12579 -11192 -23812 -7025
16183 -7025 -32280 -46374 -46692 -35424 -27004 -25249 -29727 -45712 -34665 -20926 -23602 -43856 -76161
16170 -76161 -55401 -43020 -48071 -62625 -69690 -38190 -35412 -41821 -20621 -24607 -43331 -65854 -88813
16157 -88813 -70865 -43699 -19067 -4060 -10504 745 14033 20984 27203 23509 14343 -1769 -43837
16144 -43837 -43512 -25276 -7966 6029 3646 -17590 -35039 -5313 31383 29398 8967 14894 2247
16131 2247 -10622 -36000 -31094 -27068 -10331 -20213 -42029 -44702 -62081 -76531 -65385 -58731 -40447
16118 -40447 -35542 -34741 -44487 -49424 -18073 -5142 -14461 -24998 -24509 -8581 -4745 -23947 -13318
16105 -13318 2258 -924 -4764 -4745 -6962 -7250 4226 2238 -10921 6309 38796 40986 14645 11676
16091 11676 -3976 -34272 -4245 13700 -1730 -8060 9826 -13027 -29742 -38877 -42244 -28550
16079 -28550 -20234 -21613 -17728 -8273 -6302 4700 9148 -250 -23818 -49329 -51664 -42026 -33178 -33069
16065 -33069 -44781 -46785 -36508 -22749 -5072 -4377 1529 -9542 277 -6091 11429 14822 21113
16052 21113 2240 -4022 856 4775 5259 -16528 -32144 -3249 3809 -17507 -26025 -24672 3468
16039 3468 19269 45971 21789 -8300 -6942 -1817 7055 27084 8180 -35928 -31744 -25034 -17475
16026 -17475 -8211 -387 -7744 -3782 3133 -3914 -16016 -25545 -17789 -12194 -13722 -30593 -15541 -1896
16012 -1896 -11515 -20456 -17434 -1050 2291 18933 9955 -5736 -17730 -37995 -25931 14367 19203
15999 19203 25088 11621 10979 9673 -5377 -22932 -26597 -38790 -25508 12329 14640 12061 10206
15986 10206 1764 -923 -9332 9245 -3391 -26109 -20718 15093 10997 -12203 -23181 -1605 22247
15973 22247 15157 9693 -10450 -27114 -30661 -19940 12322 28151 30652 -1112 -5566 7686 13942
15960 13942 1752 6985 5992 1807 3798 4505 17730 13257 -4227 7154 27434 44682 48690
15947 48690 33121 1527 -7724 -22727 -19082 -1766 15131 -16866 -29907 -30928 -27120 -5292
15935 -5292 5283 -16090 -12578 -10125 -5197 -13857 -25633 -5038 -17194 -8856 -3944 3210 -8522
15922 -8522 -15517 -6537 -401 1552 6022 27818 40206 52112 43343 19978 1078 -19709 -17944
15909 -17944 -5538 12553 25628 25100 14157 13120 9847 9860 19818 19783 26055 40952 19477 -14793
15895 -14793 -13925 -23691 -12799 16908 24988 33776 32840 39820 23271 18617 28010 41145 34314 19200
15881 19200 24302 3012 5902 34334 45829 43626 40830 19256 13449 21218 18916 27980 27056 851
15867 851 -1197 6654 31416 62270 79710 68821 60549 68260 52982 -587 -15663 2052 26719
15854 26719 21223 -3225 -9688 21205 13127 -8347 -16625 -11715 -7968 15134 21119 -4018 -9652
15841 -9652 623 2358 17560 -13645 -47159 -34291 -16674 -2344 -4270 -11135 -852 -5919 3265
15828 3265 37721 45398 45474 14319 -11997 14414 19155 -4089 -4901 -5012 11997 11318 3632 27326
15814 27326 26546 6852 -7807 -28851 -27983 -8928 5221 13981 20868 30011 23593 10687 21407
15801 21407 -7065 -13974 4495 24026 41844 48925 32366 18975 23728 24001 8156 -7265 -1875
15788 -1875 3215 8240 13787 18661 26767 42469 44785 53680 48435 30039 23781 20944 37457 15331
15774 15331 2167 -11482 -11988 -23412 -7217 4439 -8643 1066 18293 10555 14628 13517 20346
15761 20346 29783 30021 23913 23692 37798 42024 36290 28505 22882 34242 24541 25612 43048 55084
15747 55084 74655 82021 65746 38770 38299 38944 54830 71042 54315 36957 20208 8756 -6519
15734 -6519 28040 28040 -7448 -10934 -7345 -7091 12002 22734 38364 42619 37720 23784 13126 22835
15720 22835 34573 19594 25522 57202 66802 73702 87721 72815 66809 90313 101847 98262 85428
15707 85428 100203 101840 87280 106071 122991 111887 92821 96236 105570 90992 110181 125606
15695 125606 135555 160802 183623 194219 187768 188953 234083 226104 205175 173795 179890 195949
15683 195949 222938 250919 269972 263616 264545 282322 297637 294028 272903 256594 306370 344423
15671 344423 335404 311274 269741 269834 284446 263428 269768 275869 267861 274541 286048 302266 288923
15658 288923 272209 305555 331552 370944 366965 362595 374300 411125 448503 465981 477974 500561
15646 500561 522380 550486 581841 616094 635523 652608 664185 686670 678098 668474 682449 694373
15634 694373 722541 713663 704175 697110 688302 698067 695958 705824 723625 740567 756015 732037 725964
15621 725964 722626 715772 707865 683878 680124 672818 642283 613802 599778 583050 540448 496620
15609 496620 467513 457692 440541 417235 411538 380912 387575 396583 374218 343266 328682 295622
15597 295622 261663 252834 227733 208881 225086 249706 272580 267835 243269 235038 215753 204941
15585 204941 186345 193203 193071 200016 221920 218236 175495 164418 149001 129761 115084 130575
15573 130575 162567 148952 151103 165032 146545 125157 114023 133654 117339 87853 71715 76703
15561 76703 72190 70041 92741 128774 107812 95627 123962 125568 102597 92000 84720 82178 85088
15548 85088 93777 98441 89829 86952 82318 62405 64752 82783 52747 38850 64722 94496 75479
15535 75479 66940 67749 58877 54739 41802 37061 38489 47230 60087 73454 63688 61947 37318 20694
15521 20694 21245 12166 22875 44260 53473 51660 30646 35075 42117 49749 41834 19464 22236 34782
15507 34782 37367 41793 33401 24542 21033 17017 21675 10476 24696 30466 30206 39813 42195 53805
15493 53805 35959 16316 24865 14718 39974 51677 64614 75441 63526 50566 70272 73922
15481 73922 51030 30127 34766 39844 45116 28920 22168 29777 37024 51802 60473 64776 35798
15468 35798 -10466 -17147 -33312 -30129 -36899 -14172 9474 21115 9535 3027 28957 23359 -964
15455 -964 -13112 -30815 -17475 3219 15137 12777 13759 11844 -759 -7316 4639 939 16761
15442 16761 11422 8826 -3231 -127 45921 31986 6235 120 -2327 27035 17611 8212 24084
15429 24084 8129 -9379 -4260 -6114 -3703 27549 29657 29604 7041 5705 5079 -11179 -8695 -1536
15415 -1536 10834 -17317 -11134 1731 3564 -8029 -13943 -5460 -16941 -16111 -15598 -34553 -9844
15402 -9844 12067 9291 -21390 -24971 -9278 -27529 -33634 2831 5976 -8254 -10154 -5159 -6536
15389 -6536 -12663 13762 26399 23186 35859 54300 44155 38169 22638 26537 31323 17511 -1532
15376 -1532 -18896 -16833 -5726 8496 3368 26538 42965 32851 18235 13735 15981 10847 16943
15363 16943 10558 12459 6623 -10296 -34150 -42706 -17553 -252 7555 28160 23116 1498 -13806
15350 -13806 -16367 -8568 -6591 2644 18718 44609 22610 -988 3287 2910 -1978 -2772 34926 51268
15336 51268 37408 29060 33408 23156 32372 32430 21234 8357 2534 -2177 5108 18405 46451
15323 46451 29263 3471 42044 60413 32928 35827 24211 15193 10011 928 -19534 -24669 -8241
15310 -8241 -3394 -28710 -19251 -16630 -52544 -52519 -24035 18465 44554 41266 38923 14134 -7299
15297 -7299 -29123 -20787 4359 19826 3871 8232 5797 -13651 -1451 15247 30994 60318
15285 60318 37117 17474 16456 26108 21997 1967 -20846 -43527 -33870 -4264 -762 9386 8749
15272 8749 15962 10216 -5407 -1627 20621 9858 -9645 -12040 -11122 -24697 -32021 -27867 310
15259 310 21333 14529 7874 18325 40642 43076 26452 7301 28613 19823 -1191 -7992 -23542
15246 -23542 -32757 -18571 -29132 -13981 5832 4263 474 2319 19636 19395 30442 7944 -24468
15233 -24468 -17548 -8400 -3805 -2215 19779 29858 21707 8402 1278 -2432 -11208 -1915 -14159
15220 -14159 -39100 -41455 -25545 -17118 -37326 -30676 -29179 -17909 -16626 -20734 11080 -6157 16912
15207 16912 46483 42776 46952 39316 22819 15847 26464 24988 11838 18219 40720 25219 2703
15194 2703 5227 -21709 -29766 -19864 -12968 -13844 14010 19457 4619 -17457 -18746 -8862 -18156 -31444
15180 -31444 -4414 27591 17946 4008 9125 27361 25764 6565 4036 720 1017 18715 39531
15167 39531 23407 38182 36171 29859 27570 24132 -1549 11709 42157 40595 44428 37519 26596
15154 26596 36196 31576 15255 13154 34182 47320 39615 18435 6991 21506 26023 25541 12259
15141 12259 9325 -1616 -7719 -27162 -25350 3633 11907 3202 -8227 9379 18017 5832 26368
15128 26368 39018 22189 16171 32938 39362 36696 15086 6869 25314 2153 -6720 -2055 174
15115 174 10696 3170 -17617 -17834 -5615 4435 -5377 -4874 10105 10633 16098 11760 -17732 4752
15101 4752 15859 20119 23351 29690 37901 32791 19487 -365 -2005 7283 -1833 -11171 -21498 -14952
15087 -14952 -7438 5907 22431 6039 -1624 33245 62401 64524 42539 19903 12961 33016
15075 33016 44884 46454 23295 7627 -1568 2104 3388 -8540 8149 9297 -83 -429 8882
15062 8882 5206 29231 29967 26766 11704 -7919 -25000 -13566 7751 9729 10414 18104 -23426
15049 -23426 -30452 -31593 -18387 -9157 1811 16674 17254 33554 26950 20845 27872 11721 11253 20544
15035 20544 11103 6627 28081 15650 6668 22283 22441 10711 18575 -2072 -13979 12404 43908
15022 43908 44921 35308 8612 5221 24773 10598 -8181 -16401 -18246 -2290 22643 29206 3381
15009 3381 -7038 -15158 -4307 -10401 -8045 293 9435 19474 7734 556 11555 1887 -11839
14996 -11839 -10481 7122 -9716 -22961 -9917 9758 15750 -789 -33119 -33786 8920 34153
14984 34153 28737 33254 28577 3182 4599 9358 9790 11597 6159 5633 5848 22824 24087 23920 43711
14969 43711 46051 39915 18033 21375 8705 -11662 -15040 -12870 -19946 -17025 -458 18761 17680
14956 17680 18355 25827 26112 22693 37771 53438 59465 30391 25454 27596 10803 -1398 12172
14943 12172 39507 26837 26459 29503 11178 7807 29615 29743 25526 28638 20266 4188 11273 15637
14929 15637 6674 7037 -8104 -4879 -5826 -354 18855 22259 18187 10352 14693 -8446 -11799 9580
14915 9580 3757 1691 -1652 -9115 288 6305 9517 1480 29457 34315 26950 23334 19244 25346
14901 25346 35379 31850 20973 17162 10926 9941 15797 9856 -148 -20775 -11653 -17846 -22342 18032
14887 18032 28589 24476 10326 -474 -9610 -14223 -3347 27262 31648 12000 13836 3484 -3031
14874 -3031 6554 8432 28102 32840 9131 14208 28471 30439 33972 20891 -4306 11077 31221
14861 31221 29261 34066 18711 -5918 -22196 -29299 -37989 -29101 -5801 11884 25445 35716 38540
14848 38540 27137 25449 17536 7840 -12025 3805 22248 45680 38953 11289 5360 -162 14462
14835 14462 36386 46052 18034 866 1474 19148 12356 16901 10767 -22720 -54095 -55076 -22922
14822 -22922 6242 34050 57285 53610 45007 48200 41738 35327 27965 12702 3136 -10094 3976
14809 3976 26424 22233 21099 11060 21041 27516 12666 1697 6725 4094 10499 33853 45739
14796 45739 50416 36878 15256 15975 20855 24638 21802 25673 23718 26998 38622 13611 8848 39091
14782 39091 49890 44337 37275 31370 22489 29299 -2070 4311 35826 22476 26227 14759 22322
14769 22322 49097 72218 66660 73140 87665 79901 56425 29439 16316 11283 24420 22960 26114
14756 26114 30283 24100 11787 10693 17235 21454 47546 74373 65586 62244 49787 55328 68992
14743 68992 43815 58602 90084 118778 117491 111433 118703 120886 122537 145654 154061 167989 198729
14730 198729 255665 307365 325432 312513 321894 314304 287732 263745 225562 188463 145375 109847
14718 109847 94632 85955 76102 60935 88979 79326 57883 87721 114780 117376 103327 89929
14706 89929 63863 47104 59434 61609 54813 41863 23740 32037 53429 66002 68224 58528 56476
14693 56476 67649 68993 61511 49585 61684 53712 52705 47551 30836 27053 56096 55566 74562
14680 74562 72464 52772 58401 60426 31068 21568 34790 42644 44261 30660 16733 -3446 -3902
14667 -3902 -1385 11898 29360 29537 26172 24935 6120 8291 20243 25080 23923 15252 19692 37720
14653 37720 43518 51470 43581 20330 24637 32016 36788 17109 -11279 4397 12612 15113 31540
14640 31540 35673 35582 -967 -11340 4297 23516 15235 16758 20407 12739 6857 6133 8437 26814
14626 26814 55758 42395 29107 27649 36142 40544 37434 53976 53696 55253 60334 59103 54078 46242
14612 46242 39310 55546 45307 46149 36016 9046 17064 28292 42053 49070 55082 59671 51578
14599 51578 47796 40910 37031 41743 29390 16444 27688 57587 48781 59456 68857 59480 48513
14586 48513 52716 35327 44229 53782 37788 41252 40923 53477 50122 42010 57903 75903 62569
14573 62569 71006 88056 56389 23561 10803 11373 22629 45714 45905 50274 22391 -3142 3695
14560 3695 38835 37225 28960 11543 19855 31503 37867 45379 46973 75609 62396 41403 48208
14547 48208 73629 85348 65272 54170 58766 57255 53990 68790 73865 63662 61424 72786 79049
14534 79049 67864 60600 89637 97187 98590 94516 83474 83872 85470 75258 71767 75671 82795 66786
14520 66786 73657 82510 64173 42562 25859 12533 15996 29426 39976 55058 72356 58712
14508 58712 68490 60763 61396 52458 38853 39586 46299 51117 44364 23881 30425 43118 52716 56726
14494 56726 47158 34229 38097 28486 19501 30115 53259 51596 66544 77734 72492 45619 33285
14481 33285 29229 11589 38557 28906 6104 21656 41507 40938 62344 63281 43275 39984 53911
14468 53911 63674 66431 48475 27680 13836 19811 19874 21250 24669 14412 9065 27280 44112
14455 44112 50216 56451 61916 51652 44142 56607 52370 42379 51941 42829 41195 38012 24810 38070
14441 38070 40438 39818 25223 33243 66679 86847 59413 30111 33642 60543 65956 55317 45071
14428 45071 61099 44901 30662 6443 6300 48274 35243 5280 17952 27318 19711 27946 31978
14415 31978 53443 67243 84588 71268 44242 56797 68878 65952 66530 62048 66105 58258 29788
14402 29788 8199 39132 70469 44885 52938 54517 47715 31557 26739 16971 27803 25172 28043
14389 28043 21053 32088 31070 55877 57074 41050 -3935 -2656 -3595 18116 23789 5221 13397
14376 13397 26829 31297 44482 69374 84189 62579 49036 48410 46024 55017 70960 67339 43217
14363 43217 32821 32266 9398 -17295 -10484 16610 45455 43388 39581 30998 28696 24345 39220
14350 39220 67246 44191 13121 22645 42877 64744 53971 58296 69439 73751 74859 64286
14338 64286 66904 72837 70697 69552 59866 71897 67367 75343 93770 104922 89375 82169 92347
14325 92347 103396 98548 82974 79099 72940 92289 98029 100480 98755 76703 62106 75233 63173
14312 63173 52414 36882 51622 63558 75394 73007 80638 63057 48900 61568 79370 72047
14300 72047 42619 38628 58759 66015 73958 91037 86042 91572 100342 85895 53803 46880 72658
14287 72658 83947 74441 69155 94360 82042 77567 117153 119484 111832 111334 126837 146352 163445
14274 163445 166243 175098 153337 124897 143145 185868 219659 234714 241031 254253 265115 267515
14262 267515 307636 376375 417629 479688 602058 739583 862070 958993 1032523 1027631 965378
14251 965378 877984 782777 658562 547147 435006 353391 292392 276863 269136 237137 222221
14240 222221 197544 179994 173485 178815 177961 160901 145414 106568 106058 111603 116125 106484 135241
14227 135241 125510 121099 105743 85497 114213 132807 135649 157042 152363 141263 138946 133489 135911
14214 135911 141376 129549 108683 104426 107603 121685 154876 147536 134499 112879 97847 104318
14202 104318 117989 126906 136720 92787 64827 56182 64514 70305 75666 78952 97877 116809 128528
14189 128528 128228 115017 90401 83842 75894 66874 94356 113996 109626 114823 118689 124727 129122
14176 129122 118284 132314 135260 137683 140394 152717 161515 155090 168209 162603 156703 164966 162860
14163 162860 170816 169137 183222 182534 180501 157093 147710 176752 199714 202075 202617 196891 194981 200596
14149 200596 197805 206134 208681 223784 239135 217900 206080 228165 244186 256705 248516 230609
14137 230609 251775 256781 262105 269293 285281 294546 304236 315839 314063 308913 302047 310704 309894 291959
14123 291959 288655 310318 366758 380925 379493 384139 406342 434057 438274 436179 440761 441328 444666
14110 444666 469499 517276 533262 575536 614944 669124 743414 818402 894146 975433 1077860
14099 1077860 1217457 1355303 1492463 1652874 1837968 2036608 2294873 2606420 2986656
14090 2986656 3457960 4016985 4674389 5454450 6380578 7463427 8646889 9804251 10898142
14081 10898142 11876947 12587273 12932809 12879553 12392407 11516501 10356492 9086720 7780332
14072 7780332 6528860 5418650 4465753 3703778 3148328 2769464 2487023 2267804 2120690
14063 2120690 1998135 1896561 1810207 1745820 1703333 1665444 1610840 1540397 1476511 1431090 1383157
14052 1383157 1317588 1279949 1233975 1172660 1105113 1055625 1027598 970750 928822 911718 869636
14041 869636 835075 786298 733959 708429 678667 652289 654703 669999 646547 651189 646310 640601
14029 640601 657844 674370 671132 637964 593331 558087 547585 538725 507908 492247 468188 408021
14017 408021 356200 343014 327394 320240 325313 317907 309219 307264 321956 310342 317547 327107 314161
14004 314161 276414 255385 249964 268437 274601 276324 284336 292927 288427 284370 289175 292395 291602 276394
13990 276394 277981 281308 265332 254331 241191 267239 268739 286135 293274 269336 238459 248257
13978 248257 269319 283303 265109 261923 265336 283555 291388 296653 298192 292815 298308 292856 296144
13965 296144 275928 276061 284182 288645 274609 253131 239645 241138 263745 265665 275116 298499 302993
13952 302993 297949 308221 334331 369119 340254 330666 332772 322000 334812 341699 371318 372093 353184
13939 353184 380963 408161 408249 403252 387235 384903 413057 380948 311595 276487 250206 268965
13927 268965 290935 305816 310714 317269 368875 424299 444591 472458 505871 529416 548388 592318
13915 592318 642855 684832 706408 728896 752468 800120 872149 927036 967201 990533 980606 959400
13903 959400 937244 902144 880140 841786 790657 739612 721313 706498 715588 742472 777776 869114
13891 869114 946502 1022984 1111818 1225783 1397547 1586349 1800349 2080828 2433642 2824775
13881 2824775 3230738 3660397 4083676 4431137 4657156 4788951 4782961 4642786 4399783 4047212
13871 4047212 3632340 3217679 2802630 2459951 2201421 1986443 1826715 1693248 1584025
13862 1584025 1524425 1480704 1431679 1416925 1388347 1327484 1262487 1262288 1283500 1256890 1240826 1245665
13850 1245665 1246463 1245592 1233475 1223230 1226263 1258671 1281278 1276262 1256914 1272706 1320447 1359917
13838 1359917 1383443 1401320 1402166 1405014 1415585 1414178 1417381 1448358 1486974 1529450 1595747 1658301
13826 1658301 1752447 1869640 1974797 2067202 2157455 2236207 2320264 2397348 2425401 2419467 2398771
13815 2398771 2387294 2393581 2407635 2443015 2480619 2543315 2678241 2837379 3001767 3146350 3342196
13804 3342196 3590391 3856819 4138616 4461019 4827082 5273230 5785387 6384489 7129223
13795 7129223 8001565 8953194 10058476 11327589 12715101 14220534 15861645 17707687
13787 17707687 19848639 22386862 25551832 29560900 34748087 41479390 50258601 61619808
13779 61619808 76192557 94359588 115780859 138983326 160906951 177925385 186213746
13772 186213746 183543789 170203372 148260925 122237177 96189576 73606465 56263043
13765 56263043 44052587 36045415 30888950 27434471 24990040 23205864 21842472 20731428
13757 20731428 19734373 18816834 17960136 17163393 16462793 15833785 15341612 14967459 14624001
13748 14624001 14287830 13876401 13391036 12807724 12179122 11501399 10779871 10067478 9399093
13739 9399093 8792779 8276107 7771580 7311176 6886806 6487471 6101690 5757069 5431562
13730 5431562 5134671 4840853 4565521 4324828 4089345 3866684 3661275 3480247 3330257
13721 3330257 3165939 3007720 2846297 2689408 2531576 2383707 2270657 2153606 2046384
13712 2046384 1960674 1890092 1808517 1730692 1634830 1539866 1489294 1438049 1417095 1387856 1355760
13701 1355760 1319117 1272486 1268985 1271633 1230693 1179972 1152548 1145115 1153000 1146136 1164413 1189356
13689 1189356 1217531 1275534 1344526 1408457 1456720 1476443 1476200 1438625 1398438 1353201 1292962 1226357
13677 1226357 1168713 1146808 1122343 1123669 1133208 1095923 1012949 944200 882970 803561 719981 653738
13665 653738 627321 627725 611858 596457 575693 546995 530017 533082 547694 561935 579701 595570
13653 595570 635050 677943 708375 715410 701093 684610 672093 653493 623466 566681 525295 490050
13641 490050 447149 406883 369121 336192 318021 303845 272629 270080 272039 289534 307186 319551
13629 319551 338682 353166 355899 374232 383202 396432 412214 407940 425185 465031 472305 450102
13617 450102 425301 426210 397663 334621 273943 244671 227791 229733 234599 238046 243223 245778 252270
13604 252270 233479 216707 206725 194992 183621 184454 180398 205939 225449 226225 246350 243690 232303
13591 232303 228725 223913 220576 209907 190430 199154 181139 165810 164585 164681 172773 170167 168847 146967
13577 146967 154791 165004 165685 162079 171666 177857 186563 182486 163221 147784 149839 124965 140822
13564 140822 111292 95409 81223 93123 117895 122837 109749 107053 69939 41421 39963 63780
13552 63780 54126 53122 50759 64491 75714 88521 73186 84766 91941 80542 88748 61275 75552
13539 75552 82061 81340 82568 77578 71466 71366 73835 71228 76716 90612 82890 55562 48152 37745
13525 37745 20177 28021 54473 60009 66324 58160 55191 38981 46141 46165 28684 46680 51451 48024
13511 48024 58003 60063 35049 33321 43934 34476 9756 14107 53308 78187 82743 104101 110251
13498 110251 63596 63001 81141 82293 68333 49526 42496 49421 60561 72095 55321 58202 87458
13485 87458 118219 130876 135463 123473 114052 142942 167972 209091 239208 292972 357873 420328
13473 420328 443585 467435 502433 535982 578833 567971 562558 556941 545430 505811 457318 418627
13461 418627 405358 368047 319096 277045 272277 296302 273435 243890 227566 216604 220203 213075
13449 213075 198613 186524 160274 161287 160852 138218 123426 111873 122789 134392 121541 137139
13437 137139 147034 135961 113276 99610 101094 114449 125674 136430 122649 109444 104878 95696
13425 95696 105082 119673 126606 124879 111023 112382 96596 80619 87684 91150 82116 116706 105027
13412 105027 73418 68605 63135 61830 55741 77927 110902 112824 99891 92803 95050 85580 98165
13399 98165 102071 96851 92669 78350 58164 38241 23994 58424 90940 61622 50017 38720
13387 38720 31281 46301 66343 56684 65229 79418 47351 54928 53945 29575 35523 24129 41443
13374 41443 55774 52621 54979 45160 44382 40541 31867 20931 23471 15502 17089 26819 34334 31632
13360 31632 24693 33960 41091 37501 38113 73109 85267 64663 44277 45522 60366 60821 69447 70253
13346 70253 61841 49900 40377 51407 63853 61298 45193 51859 45933 33209 33395 16381 20151
13333 20151 35285 36722 27596 34878 69489 77851 49793 41564 49585 70200 107949 118300 83858
13320 83858 80650 98759 88454 74934 82473 90368 103671 109108 101692 106550 114579 104317 112776
13307 112776 75637 81374 94151 118894 116651 129475 151478 162340 165846 163028 183031 215840
13295 215840 236223 281151 318210 368677 466786 571355 690014 782451 883795 954476 980508
13284 980508 959907 876297 767930 641815 509312 394730 309623 251615 203500 167116 156173
13273 156173 153199 128767 111945 122226 114308 118344 149681 147909 132021 140829 129633 109722
13261 109722 98877 102966 109267 110896 94835 87624 78959 87305 89925 105182 112108 108762 107280
13248 107280 116905 103253 94272 105296 103940 101915 78267 73496 57648 47052 65127 73543 49161
13235 49161 20920 9092 21729 20313 9902 394 24212 23027 9038 8529 32121 30131 18514
13222 18514 30278 38227 61864 74016 40957 34518 32066 11739 6096 -8110 12543 29354
13210 29354 47986 35378 21224 13761 9766 4114 36248 39717 27474 16610 21227 34933 31199
13197 31199 47112 80963 57769 40340 60561 70525 71447 89838 89566 77956 102906 121523 125404
13184 125404 100694 95565 83861 73807 64505 74485 66973 60124 76124 75163 68243 70678 64170
13171 64170 63805 33729 4585 17820 37223 44354 38434 54987 67332 79709 75988 66307 56564
13158 56564 62272 64590 68239 82737 94632 109371 89544 77889 79150 77620 89921 93854 78341
13145 78341 78515 77068 67395 66630 75269 93938 98285 102769 73640 49474 55455 66815 83873 87060
13131 87060 83845 80457 58864 56367 55535 55723 65177 76639 74783 53603 34752 40042 62963 81532
13117 81532 83386 56260 66418 88794 87384 101723 73191 58842 80306 82414 82203 68319 55793
13104 55793 40563 36655 50961 59857 75520 59524 53206 85261 104347 120025 131358 102022
13092 102022 76050 86598 96520 91091 95525 107248 93627 78404 100232 126828 129995 132465
13080 132465 107538 95696 94952 96185 96378 98313 94533 103010 99586 94636 72947 59891 67036 71802
13066 71802 80866 111265 112177 98421 110981 114269 120529 102345 94551 77027 61639 66760 82918
13053 82918 74071 30029 30007 60369 71834 50900 50242 42833 27575 35135 37810 26848 34471 47592
13039 47592 68410 70999 60106 33988 35584 34456 34079 33648 24357 11458 12159 36339 65661 80480
13025 80480 60380 26092 34154 46638 24867 41096 52142 51081 59957 66466 82875 61169
13013 61169 18812 -5828 -1785 17558 28307 40171 46222 51649 75373 89956 89519 64824 41185
13000 41185 25642 27397 34951 41347 45054 38935 55511 52250 49957 56531 59574 45371 26971
12987 26971 10633 12395 16675 27710 36516 26239 15961 35074 54825 60916 83716 94586
12975 94586 91491 75366 51088 34241 45526 44893 23507 37264 49057 62936 48012 30323
12963 30323 38777 45476 52919 47098 54008 42854 69283 91529 57974 39751 30104 29947 18747
12950 18747 3944 -4013 13029 27191 34416 54929 64176 15382 -25661 -13619 447 11268
12938 11268 15304 18913 -5040 -36637 -2974 15560 38419 52719 40988 33714 29964 20258 31079
12925 31079 25081 18319 29387 28370 30345 14538 -3727 9782 38821 69439 67356 52681 33119
12912 33119 29436 45327 34892 37440 58870 48308 41932 41652 52592 51130 43058 32288 12239
12899 12239 -4671 -4198 9175 23727 54267 60588 53656 60358 78253 66583 61671 75115 83292
12886 83292 90846 107141 113904 106156 84730 52465 48353 66754 70613 48440 64095 63954 58773
12873 58773 48576 43670 57659 66719 50014 37543 38983 46342 62528 58588 39029 39338 38588
12860 38588 41531 18386 14366 19504 40861 68059 38976 9961 20327 23249 36009 34590 38350
12847 38350 33605 27570 34406 32066 4320 -180 12477 17690 40689 53867 51869 57370 50242
12834 50242 50317 47117 56192 63513 61373 64176 74985 72600 50749 57533 52846 51473 51787 49223 60572
12819 60572 87458 89575 98912 85472 54521 19734 10590 23702 32022 38076 28944 28590 31164
12806 31164 42347 57171 43397 24981 24386 17915 11426 27984 42776 33772 54315 61800 71981
12793 71981 58869 50170 54885 67524 92361 94304 76801 69398 74270 50493 39819 53974 38820
12780 38820 24291 13058 10252 24933 34319 40416 53150 48436 31807 40597 45462 39339 36550
12767 36550 26332 18519 27050 41514 24733 6347 12036 33124 47926 13493 -23708 -18717
12755 -18717 -9486 -12946 6153 27495 24037 34270 24713 7 -255 22034 33132 30341 31036
12742 31036 27813 40569 33197 10885 13332 47729 45990 43166 49065 28834 6955 -12658 2476
12729 2476 23256 26517 3172 1718 3518 12323 11092 2170 -3446 17512 49208 21640 6423
12716 6423 4543 19437 45622 54521 36907 37909 32397 23567 28311 18415 14220 33565 34796 20791
12702 20791 24133 11507 13908 37474 63735 64356 66905 46086 61556 51581 34787 44381 39935
12689 39935 23451 -355 1826 104 -15985 -7406 -12999 -4527 -18837 -21247 -2613 7750 -6130
12676 -6130 -2288 -4795 -6930 790 1158 -6366 -29736 -9380 9372 -2801 5866 34985 34895 35884
12662 35884 42249 65851 73743 66042 54836 66112 48761 35391 43382 29101 15673 32155
12650 32155 40307 26604 19850 35692 51209 37239 47363 47067 49267 49395 50960 67043 61703
12637 61703 40209 21612 14596 8251 -12592 7936 10241 15120 19656 813 -4476 4821 9745
12624 9745 35096 44974 48617 23300 10122 16858 38874 45969 43093 33066 24625 19089 32844
12611 32844 30951 23675 15885 21723 16189 40032 70024 64927 53795 35980 29363 25430 27160
12598 27160 33072 23254 -701 -26711 -326 12052 6979 13476 30319 24191 38173 46568 39118
12585 39118 50027 35892 33122 33333 39674 36042 37555 32975 30138 12906 15561 27697 36613 31763
12571 31763 48015 41131 33381 16787 24311 50605 54476 52758 59304 56546 31384 31725 42822
12558 42822 47201 58978 50624 41170 59941 52798 36540 46592 60644 41990 36555 38365 38619
12545 38619 37039 61450 74137 63464 54477 31153 25243 42989 51332 72530 59196 45309
12533 45309 56238 57751 64733 85387 78499 73421 68562 62931 85206 92029 93115 105367 110143
12520 110143 114868 120805 121036 103897 88883 92530 93320 69971 65677 67827 55556 49934 44320 50003
12506 50003 42947 62799 83168 83432 72438 61358 66358 71942 59103 64774 46939 46504 44352
12493 44352 48145 62240 61712 48241 56502 68085 82584 75336 49046 26304 37158 95242 106533
12480 106533 95320 126173 136172 120281 114088 135853 156727 174294 194640 213852 227323 225995
12468 225995 211012 157797 133402 117702 107395 106274 97906 84479 76769 86335 93998 99284 85408
12455 85408 65095 66596 81986 80724 94236 84474 89851 85555 101686 104343 121862 117432 120900
12442 120900 105768 100029 95749 96190 108398 101657 93894 104182 96203 90248 116267 142384 142209
12429 142209 138388 137225 134945 131357 159778 167223 168344 170337 153104 140088 100955 102912 133214
12416 133214 157347 152631 150513 143209 150700 160044 148059 151654 162622 162730 168004 159889 161903 171504
12402 171504 166928 162843 175163 182395 177501 184375 196420 198851 207485 216502 219182 212570 227467
12389 227467 226109 218323 210674 211259 223380 240011 242409 248213 274738 266919 241867 228751 209467
12376 209467 219171 210755 213759 213699 216364 228663 234741 222703 222452 231963 228769 217932 199850 192162
12362 192162 199816 228927 255578 260410 255199 266780 236574 240865 250269 250470 255815 264666 301393
12349 301393 323853 329927 317280 300881 313021 326372 337240 367510 375987 388695 427518 483155
12337 483155 538361 569961 603562 648147 642548 616501 593501 570857 553632 524677 485141 431273
12325 431273 364470 341840 342648 339204 339523 350050 366328 355224 344304 335677 346542 371055 394261
12312 394261 394385 374921 355682 354791 367302 368142 372864 381319 384993 387405 376919 351566 355819 383032
12298 383032 386437 428999 415339 393650 388809 424767 436754 432329 422048 396004 377553 377975
12286 377975 386078 375777 364231 333788 309594 300433 291949 285569 279007 275317 278815 252385 251971
12273 251971 254849 231720 223860 215205 186608 183012 203565 185953 154086 132989 158842 172191
12261 172191 142116 156777 154047 161814 181777 173801 171474 173486 180630 177095 167586 164238 158929
12248 158929 146132 170902 163108 155049 147675 131749 120294 107540 102269 113223 95956 117971
12236 117971 147763 169267 146094 157300 143945 118667 107114 123846 157579 158146 158815 143557
12224 143557 149569 148290 139594 156403 163714 175125 189165 164707 166954 178604 197135 184598
12212 184598 189147 216152 219593 246517 235724 215273 196918 185372 176248 163401 166170 141857
12200 141857 123278 137276 148666 141027 136880 141196 145020 136105 139369 115553 98570 112437 131532
12187 131532 132639 119383 121359 127410 122015 164823 185343 174667 169136 185726 193211 176808 143991
12174 143991 124959 127065 139892 160987 171156 146741 130300 132214 156586 179927 169837 135589
12162 135589 127391 137160 151440 175321 185069 189193 161365 144467 131826 131297 119053 107737 119185
12149 119185 134305 129332 111988 128218 163022 153738 123347 114679 104933 89796 102945 128830
12137 128830 152466 155870 148411 138407 146212 149814 150262 162020 157547 136705 110042 101376 97881
12124 97881 97816 101354 94626 110390 130347 147744 145517 136926 143848 148530 142073 129304 133395 122838
12110 122838 124285 122437 120126 130250 124238 92829 102716 110587 99518 101441 109082 120727 108139
12097 108139 104729 114909 109186 115089 115359 131824 139490 138650 135369 129383 137571 136770 136454 134388 141703
12082 141703 148283 147895 149718 114307 89451 86345 93781 85850 80483 86379 109608 122467 139878
12069 139878 133413 124216 113434 92427 84626 91859 113505 116245 98478 97941 103504 91690 80735
12056 80735 67587 94855 122204 119703 110907 118896 103661 121741 134280 148510 111817 87181
12044 87181 85954 90675 87214 85892 92895 105629 108064 93434 89449 72410 92082 93729 94306 91502
12030 91502 81153 59379 47060 47129 94978 130420 129415 96791 92168 100691 102105 110164 106606
12017 106606 116172 134819 143174 127706 109649 90362 79654 87878 99383 90338 99604 111438
12005 111438 121204 121728 121424 107595 92734 94438 104464 105170 112211 105525 101808 88101 85818 101169
11991 101169 138928 146272 154048 127866 104979 92808 102101 128453 133068 133238 144038 108354 59654
11978 59654 47904 83800 102988 113217 116436 115638 105771 108502 128827 148399 137015 123071 133806
11965 133806 133996 125649 120490 120257 130015 122623 125252 137687 156255 167086 147010 135727 141825
11952 141825 120778 108078 95535 99505 105917 105662 102942 119059 136421 146671 150939 155409 166858
11939 166858 183878 164620 143077 142205 139965 128872 121265 122635 125991 138308 120607 116420 112593
11926 112593 127556 131495 115465 125834 141302 124306 114482 141189 169952 163389 141325 155770
11914 155770 146100 139009 173653 178825 168117 168738 153939 170654 176837 176867 146854 140054 150725
11901 150725 153185 164724 156736 151766 149157 153022 158045 171890 176499 181267 175072 169961 198403
11888 198403 205479 198960 213057 208218 199038 176690 172717 191024 190000 180650 181887 177525 183000
11875 183000 187942 187435 196101 174267 158131 167498 149105 131028 162419 185400 164895 191600
11863 191600 203280 210986 205645 194017 206663 209514 186433 161423 145496 140544 151236 156758
11851 156758 159817 167628 193805 197088 176759 188505 195518 204605 196706 181955 167533 165614 162716
11838 162716 152870 166145 196820 211728 189278 188999 200428 198528 191694 181216 191300 199672 198756
11825 198756 183873 196092 208629 212601 201969 197877 194566 207645 223438 233040 226387 237980
11813 237980 228782 234364 224645 216400 226570 232642 246410 244335 222629 201992 182769 205853 204442
11800 204442 209063 228582 223646 213038 222092 220507 210996 222947 217634 195949 195693 201296 213325
11787 213325 210681 202119 192568 182357 197103 201636 188879 160717 165028 185368 177662 188778 192285
11774 192285 210995 207213 201516 219074 220302 232154 211544 216491 210095 200898 201498 219439 244223
11761 244223 229279 208583 204385 218045 212650 184867 179496 189965 197922 187084 170457 155398
11749 155398 181850 210340 209185 203114 203611 190505 177791 188960 188930 218103 224134 199701 197365
11736 197365 191674 178027 186831 223664 231245 217401 198239 201349 201851 191132 203636 224250 202794
11723 202794 194720 174529 187567 216882 227532 220592 197062 175884 182895 186025 183777 186788 175548
11710 175548 185363 190329 199711 214411 251595 275980 257300 226287 210154 206143 200428 194794 182972
11697 182972 177901 203130 216622 211566 209876 205415 203448 191845 190315 170570 181293 193974 198189
11684 198189 211891 204416 213190 224595 211823 197744 201902 215813 203532 214356 233268 256569
11672 256569 252795 267036 256774 244733 241545 247539 228507 222028 241764 240636 246810 243065 214456
11659 214456 232009 233927 227894 210620 184278 183967 192894 173020 198794 218917 205389 207435 187134
11646 187134 195300 210516 204003 212750 214713 237721 256507 241523 238948 238950 213733 213194 212859 218617
11632 218617 240544 245285 250411 245076 235793 219943 230807 228155 222122 226688 232566 249093 242396
11619 242396 256181 249793 255005 259754 240992 240096 253004 270134 286322 285479 271021 249637 236084
11606 236084 245707 253033 251995 234879 224457 215002 223617 255833 260070 253134 240717 230664 217243
11593 217243 222818 256931 290379 284085 261109 248546 253199 260394 272057 275174 285220 286285 297637
11580 297637 322012 299799 268685 252703 279488 291161 294249 291521 284810 284640 282266 264973 258024
11567 258024 250791 260015 295431 310337 323766 328828 344201 356748 344353 355399 352259 340596
11555 340596 362066 377496 365830 367019 372980 398596 422741 429665 441862 448178 451732 483370
11543 483370 513260 509270 512858 527472 548153 563084 575999 577828 595990 596989 617193 646430
11531 646430 672810 687604 691275 728140 755075 785311 824364 859346 893215 949976 1009674 1077551
11519 1077551 1147851 1222035 1335027 1406038 1432805 1471401 1493543 1439209 1380860 1319580 1240702
11508 1240702 1181774 1160002 1134403 1120808 1109876 1087702 1059527 1045100 1018446 999161 962717
11497 962717 928831 902121 900688 894469 859795 843852 853085 859118 821390 795057 809733 834169
11485 834169 875085 909759 934003 969945 993276 1051204 1118160 1185055 1262765 1354521 1438357
11474 1438357 1502555 1560173 1623385 1659437 1683596 1646532 1604238 1549071 1441969 1320843 1237933
11463 1237933 1167974 1102303 1048620 1002539 947580 901928 864260 847267 813707 778786 760856
11452 760856 762903 738135 712143 699584 701742 718807 731579 739836 747624 758660 789576 812246
11440 812246 814174 830560 848390 885271 907287 946445 957568 938443 916681 875317 822871 787803
11428 787803 769382 785585 803768 835287 833042 838775 886349 933345 1005133 1111870 1254726
11417 1254726 1426723 1634388 1885263 2186897 2465961 2551563 2337958 1905887 1486030 1199548
11407 1199548 1038482 938895 856180 811958 773703 733698 731273 703401 687198 653114 642941
11396 642941 655842 675917 693484 700600 697834 702408 683051 661524 648432 636645 637921 624347
11384 624347 612913 601998 587707 592598 586903 577538 573189 575734 568557 553812 571372 559613 546431
11371 546431 536044 518218 509104 514210 519652 534145 531169 533449 529671 532253 529074 536252 535310 535300
11357 535300 524545 558261 568716 549230 553232 542632 528236 519098 496546 514634 534102 522899
11345 522899 493235 503661 514273 507583 505008 538790 559179 564565 560266 561835 566991 561709 557587
11332 557587 556400 540394 519997 528034 561525 577344 567439 558454 548120 540958 575242 582381 595689
11319 595689 594277 567387 549530 537222 516159 507644 502382 517762 549271 551561 559634 563768 569649
11306 569649 574253 589608 608021 619681 620982 594244 606594 619107 629239 647206 655461 655223
11294 655223 679164 696445 725595 764999 802137 823727 815197 790548 740789 683481 631338 626852
11282 626852 630335 629924 631074 656898 677380 686575 697528 694225 675420 679784 705092 699347 710520
11269 710520 743541 749359 753024 774668 803934 821022 834887 896710 939690 932190 939680 990898
11257 990898 1007143 993530 946330 910546 858532 814933 766957 740773 743068 727343 711793 702441
11245 702441 698785 700625 715709 702096 710124 724788 725473 703361 723858 735062 727551 721362 723158
11232 723158 745524 781241 771142 767733 770714 745689 743960 750490 781151 796390 802023 807487 809954
11219 809954 793689 772198 795502 804732 804653 808718 811076 840922 852164 830069 815016 841684 824022
11206 824022 837985 855270 851760 868395 897145 911694 936027 943341 944377 921352 898948 850602
11194 850602 812791 819224 831206 833643 853191 883040 913187 916436 926766 974319 1005015 983034
11182 983034 965374 965438 965582 972955 984832 980715 988443 1005217 1009242 1016116 1021518 1023519 1042291 1034839
11168 1034839 1023288 1012166 1014621 1008467 994786 964931 907294 859077 806949 745385 748158 832462
11156 832462 918458 967811 993422 1017295 1019772 1030879 1036456 1016856 1031664 1066072 1110604 1160508
11144 1160508 1203092 1214663 1233151 1283373 1344225 1381145 1400744 1410790 1409577 1385913 1356984
11133 1356984 1329913 1320466 1347250 1335194 1253491 1160020 1056633 1025217 1050727 1102688 1171285
11122 1171285 1234659 1253797 1272070 1304905 1363508 1411594 1420397 1420987 1457598 1472226 1531150 1602538
11110 1602538 1624000 1629718 1637304 1660204 1648327 1672240 1682014 1713314 1755331 1784419 1838167 1900403
11098 1900403 1944284 1989524 2038072 2060126 2089869 2132586 2162424 2188855 2200043 2187938 2205838
11087 2205838 2249647 2275637 2316002 2359069 2401094 2443842 2491985 2500568 2538494 2585167 2650964
11076 2650964 2699017 2744385 2783808 2839139 2936573 3036395 3108427 3173189 3226605 3291327 3376819
11065 3376819 3439690 3478637 3512750 3592519 3675868 3771294 3906245 4044789 4215171 4405579
11055 4405579 4584910 4793180 5019361 5277476 5547446 5852342 6200486 6533177 6846280
11046 6846280 7165621 7476660 7745554 8075393 8473470 8978459 9617807 10410819 11377238
11037 11377238 12560701 14034252 15851384 18061471 20839523 24303107 28601812 33901074
11029 33901074 39948825 46373950 52527125 56693497 57618108 54245864 48488930 43248852
11021 43248852 39604172 38115838 38549372 40440438 43479065 47583930 52894008 59770476
11013 59770476 68784480 80763521 96694539 117841495 145637179 181110600 224924880
11006 224924880 279165944 337845403 371722729 357249581 287741766 200539762 137995346
10999 137995346 100437893 77772146 63693449 54462370 48003560 43179970 39472547
10992 39472547 36683219 34568045 32915158 31713444 30906783 30361409 29901815 29384284 28679026
10983 28679026 27876238 27262914 27009135 26955611 26706123 25729612 24126248 22462097 20938400
10974 20938400 19561926 18327197 17175727 16074604 15036604 14088098 13187569 12338162
10966 12338162 11588179 10926904 10310539 9731338 9224534 8800570 8415517 8032248 7646926
10957 7646926 7225135 6822567 6483988 6188773 5920787 5654763 5406774 5171681 4929080
10948 4929080 4689331 4453598 4230417 4028579 3815273 3635093 3479458 3335194 3184441
10939 3184441 3024766 2911911 2808459 2705605 2653511 2606719 2533734 2445400 2365130 2299408
10929 2299408 2229693 2151518 2074522 1988896 1895648 1831866 1745995 1676514 1638337 1589030 1537686
10918 1537686 1467065 1391750 1335150 1289598 1257937 1231692 1219931 1218983 1231793 1216072 1192831 1186458
10906 1186458 1192229 1176728 1160227 1156825 1130191 1088160 1043207 1036308 1010830 987741 972283 970927
10894 970927 952860 931765 928100 949474 990550 1017116 1020849 1057607 1090632 1120436 1179649 1268040
10882 1268040 1356117 1433187 1491146 1502131 1429546 1321583 1225829 1132007 1059978 987094 930558
10871 930558 916652 920008 878126 837040 817605 814779 794951 781037 779197 796161 807641 817369
10859 817369 836904 838981 843664 845539 878602 912090 940025 987900 1051686 1109740 1137096 1097744
10847 1097744 998991 868442 780901 756365 743334 729835 716335 734097 751775 741582 750659
10836 750659 751425 747919 748576 728931 696222 680002 654824 656372 660357 654032 663220 648971 631135
10823 631135 646980 673554 670695 688917 696227 695613 705983 714994 695607 638620 588434 555742
10811 555742 530240 501014 499359 517593 534550 525905 517593 553146 577876 551480 525148 507948
10799 507948 503942 482444 456632 466319 469127 450389 450074 436200 397876 383014 385276 401202 389425
10786 389425 364235 340735 313668 320751 333904 349729 350936 351559 353472 390892 392510 397467 369464
10773 369464 340182 322832 298052 294746 328229 314302 302071 283215 268154 282318 292646 288577
10761 288577 299822 280335 262948 252698 256323 249211 252982 249482 249743 248770 274331 281633 259982
10748 259982 230179 209011 204692 187821 193364 216899 204422 192330 179901 154286 156812 150882
10736 150882 139888 143583 170809 201625 227257 228683 228676 213069 208392 193916 191680 177907 157968
10723 157968 129145 62434 -1815 -46113 -42552 19990 72225 107197 144655 170561 149308 149821
10711 149821 159482 151785 170948 175118 167381 173331 171545 162200 200771 189881 162844 192559 218014
10698 218014 246662 261001 250412 261996 271180 265525 243588 219163 201498 193603 183043 202836
10686 202836 206190 192370 168163 162037 174288 192861 195551 199090 191816 179807 175932 171163 183499
10673 183499 177011 167050 161507 172203 165327 162238 183739 207588 194158 181654 155231 129644
10661 129644 126350 133198 120900 123724 139115 140313 118275 140686 146521 150086 157425 148372 130126
10648 130126 119254 121756 118771 96267 85112 103597 124071 128108 128359 113904 117229 145105 134536
10635 134536 118402 117151 131778 142669 134412 124458 134709 148748 128524 152578 166787 158982
10623 158982 151855 144655 162877 150722 139861 160168 207606 255398 294299 314903 350552 388012
10611 388012 387787 366264 336356 316221 290567 270657 272576 279505 298135 330769 373987 406286
10599 406286 453367 527151 614378 723372 888744 1077853 1313293 1580306 1862475 2044464
10589 2044464 1972416 1629360 1192395 850302 650574 522179 430210 384355 364822 341128
10579 341128 302330 272096 265046 244224 226939 203429 202985 222729 240351 210464 153585 157956
10567 157956 195273 213280 205019 193644 203127 191748 204227 208998 181585 174790 182117 179469 174639
10554 174639 157361 137576 128943 150066 147199 139368 121040 103374 118157 131070 141054 124645
10542 124645 113806 103333 87139 71920 34816 43067 45979 56923 59017 67296 67273 79322 86560
10529 86560 90212 95695 87387 77311 80845 71973 63933 76499 66492 55582 48874 52097 48414
10516 48414 25879 11204 12866 29742 39128 47473 43688 29791 32343 44944 34691 24951 20630
10503 20630 11157 18061 30466 57305 55786 34442 12069 27611 -2710 -11276 9023 12022 26630
10490 26630 41663 31013 32541 50770 37379 36598 38872 34953 48262 44573 38893 14288 35453
10477 35453 38735 48519 56695 54147 60377 63518 57550 41983 24231 32317 69664 94620 68959
10464 68959 46284 38776 42090 53739 68190 88210 82032 59211 51172 49082 57979 60595 38726
10451 38726 9789 13405 16176 13767 25205 51062 50313 31816 13180 20831 26577 33598 45789
10438 45789 61477 55152 34854 30930 30899 21155 18328 38783 25160 16536 25456 40345 29404
10425 29404 16745 18914 15199 17852 21336 24748 23804 4745 4034 20743 37695 47886 51024 51620
10411 51620 44638 15413 21841 36610 51596 42940 25401 30184 -1713 -27736 -23934 5500 26764
10398 26764 19031 18759 23852 26084 53449 33601 32316 46227 53695 67750 64829 46583 29144
10385 29144 30485 22240 -7418 -15562 -18144 -16597 3608 -2303 30 19915 22530 35126 50327
10372 50327 33014 23611 24503 8165 -5429 -13034 -16077 -200 6958 -11456 -11323 -6745 13807
10359 13807 46464 34144 11399 14969 4075 32 8054 16151 32889 31451 29038 28499 31436
10346 31436 12336 -307 13544 39967 75058 68564 79525 89823 103279 117582 105973 98565
10334 98565 86290 82264 88971 72411 67223 44486 55011 34639 44003 60387 49933 53986 45281
10321 45281 42453 47266 45909 39091 42544 32361 12671 4217 33040 29619 28533 25235 41215
10308 41215 40943 48392 45610 52422 62592 70054 48487 25757 11283 10664 12370 24439 16519 26872
10294 26872 29322 31799 23551 14354 8181 23077 54851 43418 35198 32970 36163 45094 46924 54937
10280 54937 42800 76977 100746 100399 98190 96331 94533 106839 117112 115923 109716 83444 57410
10267 57410 62292 73148 73632 60444 75249 84419 65014 37841 22047 14700 7323 3489 17639
10254 17639 8725 9012 14402 29360 47749 42442 45760 36401 36871 26670 23562 27581 14680 -25184
10240 -25184 -22238 14291 26473 23021 20240 4985 -8867 8096 6091 -21714 -39634 -16323
10228 -16323 14120 36438 36066 31918 34334 20976 1336 33637 26974 7545 21325 43326 49762
10215 49762 32719 30287 34494 6479 -11386 -12908 -14581 968 13018 24381 3779 -6667
10203 -6667 -7510 5608 28845 30976 27159 18579 -790 -6565 -5445 -14568 -3324 6926 2905 9611
10189 9611 25167 43449 43616 41206 30757 54438 76432 45094 48084 49823 33257 22273 12631
10176 12631 11557 28274 53982 60182 66618 49135 35518 24425 46413 65664 86327 68226
10164 68226 41552 33773 31304 41807 69996 53455 54252 79916 69541 59815 52660 40393 33100
10151 33100 31642 11064 11505 25958 47830 39270 40395 32393 34568 77394 88509 50062 9928
10138 9928 5798 -1650 -21649 -21229 -7783 14390 5587 13209 23761 37626 28695 12590 9377
10125 9377 14453 20264 17307 11279 -13393 -23727 -6893 -13188 -4041 22547 49348 45061 40515
10112 40515 30132 19817 20345 19621 -2051 -4740 -7668 6478 25488 36207 16867 -1018 -7528
10099 -7528 -2078 5913 -15197 -39540 -12704 3342 2713 -22537 -32880 -22879 16255 44908 48103
10086 48103 50867 44271 15204 805 16136 17571 10921 21707 52413 47801 29320 29948 9299
10073 9299 -1151 -7776 4042 12377 31853 37352 45800 29853 32212 44072 48416 37678 17341
10060 17341 24111 70725 63277 60367 77514 89534 75420 73759 95046 106562 139505 204716
10048 204716 293517 378878 447637 548806 707740 920454 1208068 1385437 1325850 1031379
10038 1031379 645335 398879 266772 214769 209014 175064 160845 148148 102536 98755 101705
10027 101705 90562 91847 75095 22568 20835 35391 49050 45081 35897 64203 85109 93447
10015 93447 82187 78849 79768 61980 61474 68235 76987 76658 55857 40901 40066 50033 38400 15498
10001 15498 17104 39170 51615 23372 39992 51754 43446 48744 52156 38805 37897 32693 25518
9988 25518 2000 -13238 4600 -556 24824 43966 52082 46078 54492 83882 77417 80875 90586
9975 90586 86641 80132 70634 60787 68588 73815 97198 104768 116081 150047 200846 235443 304458
9962 304458 406321 517382 607393 683132 675976 559000 405319 271048 174678 125501 94222
9951 94222 97379 75974 61486 59221 75618 64600 43654 25408 39672 64413 79658 83757
9939 83757 63367 65535 63876 56335 54480 44148 49189 50686 38622 32505 42700 39903 46331 62913
9925 62913 71969 82979 74133 76161 68162 64404 94333 115540 141947 158146 147823 167697 210967
9912 210967 218837 231688 270430 297172 342542 418761 527167 645592 833380 1055729 1320404
9901 1320404 1619402 1773205 1696373 1374812 953846 670746 477873 352252 271196 260535
9891 260535 240338 208957 181922 172410 192943 178704 148462 134808 141107 134954 113193 103026
9879 103026 76297 62848 78302 79320 85026 108731 117700 99133 83713 48417 1324 12223
9867 12223 43803 44837 37369 23852 32078 9596 18221 17253 17592 12807 8155 9053 -6082 -3596
9853 -3596 15009 28779 27200 27119 43296 38966 25618 18920 32438 34031 28821 31485 29410 32818
9839 32818 22616 4315 2533 23444 40883 36862 28876 23101 19953 -5066 479 -6408 -1622
9826 -1622 4263 19254 14317 -5824 -23640 -46909 -39574 -34360 -53046 -53989 -40774 -34883 -30219 -28151
9812 -28151 -28761 -14511 -19004 -30632 -24586 -11994 -18170 -2553 -4475 -13386 -10945 -33874 -17615
9799 -17615 -2174 18550 7668 313 -6359 -13307 -15556 7605 23277 17211 5967 589 -1402
9786 -1402 2722 -13206 -16019 -11887 -25408 -32372 -11431 -15432 -12042 -2826 -8555 -3351 8608 29175
9772 29175 12944 -3309 -23951 -19649 -15158 -13519 -9921 -3472 -2752 4475 -25216 -31958 -12044 3949
9758 3949 12505 28532 20722 -758 -181 3151 -13839 -30328 -22172 -25129 -26813 -30721 -41719 -44167
9744 -44167 -39251 -29418 -28272 -31261 -19413 -17467 5293 1985 -15606 -39030 -48743 -32644 -8656
9731 -8656 -130 4754 5793 -13889 -13239 -29487 -44870 -35844 -39927 -19371 6985 23104 42926
9718 42926 48648 43401 30750 13960 23844 45574 33579 -15443 -25384 -462 11309 20807 10505
9705 10505 -5030 -11504 -23838 -43323 -44124 -44128 -48861 -48106 -26871 -14730 -14524 -24807 -20065 -35037
9691 -35037 -35695 -54598 -61124 -58677 -42589 -57080 -101513 -118345 -84557 -53786 -42984 -38054 -24934
9678 -24934 -15966 -34376 -25891 -15603 -11707 -31377 -44750 -46948 -56554 -56708 -36656 -29844 -43221
9665 -43221 -51116 -53262 -31919 -8476 21764 51221 48421 48921 44311 9605 -334 8325 -12108
9652 -12108 -22608 -34329 -36349 -35432 -29073 -48006 -29466 -3544 -2555 -5898 -20278 -28648 -46046
9639 -46046 -31670 -19087 -17259 -8267 -15446 -6443 -16207 -15199 -15346 -17153 -25636 -30671 -47173 -47907
9625 -47907 -56411 -57906 -43515 -48386 -42482 -19099 -31095 -38928 -25935 -9518 -40294 -51978 -53414
9612 -53414 -33307 -35958 -47263 -61692 -55414 -24219 -13826 -16942 -29472 -20610 -14381 -17679 -25581
9599 -25581 -5754 -8673 -15762 -21250 -20796 -15763 -31718 -19811 -7650 -10713 -6566 21337 41800
9586 41800 9418 -19437 -6944 -21453 -19766 -18503 -5137 -9712 -17588 -31876 -57290 -40750 -11682
9573 -11682 -19671 -19838 -14608 -43822 -65315 -81049 -82440 -72188 -40590 -33788 -51964 -50009 -41082
9560 -41082 -25249 -15382 -10915 -4585 -8067 -16566 -21522 -17175 -7318 -17276 -17563 -14956 582 4363
9546 4363 -12730 -6866 610 28124 27145 2517 -16245 -35365 -12760 -1216 8646 -9094 -18056
9533 -18056 -2245 26356 -3573 -31003 -53838 -53477 -44814 -66206 -59305 -43564 -27536 -28991 -42342
9520 -42342 -37696 -22981 -40976 -54091 -36598 -33144 -30969 -30062 -11020 -19501 -41229 -15552 15059
9507 15059 49343 42815 27351 17401 2247 -8404 -1044 -5393 -32458 -25948 -17735 -22447 -31435
9494 -31435 -20592 -41395 -40477 -21221 -6818 -20186 -14717 -20125 -26797 -30601 -31242 -49349 -41535 -39465
9480 -39465 -10444 15615 14977 -2107 -31726 -33904 -33670 -30052 -27629 -26186 -18884 -4585 -21251 -25087
9466 -25087 -26071 -26236 -17936 -9816 -16929 -26693 -36313 -31104 -15513 12386 5751 -4376 -1191 -4832
9452 -4832 7996 19559 -895 -6548 -3628 -19192 -2484 -16261 -28656 -13334 -25784 -33489 -5889
9439 -5889 -13228 -4965 -9491 -4795 -14460 -46617 -59461 -60550 -36285 -18133 -1860 -3517 10417
9426 10417 3027 6673 -696 -44434 -55863 -34710 1071 38195 21028 20724 25414 19930 -19557
9413 -19557 -53566 -67150 -36160 -16908 -6353 1769 -20779 -48049 -46154 -24870 -27978 -25999 -43914
9400 -43914 -46444 -21921 -26159 -22636 6217 22905 2758 -11018 9269 12718 -162 2299 -7602
9387 -7602 -2754 -4849 15397 26181 33628 -7891 -25357 -21159 -17873 -41721 -41389 -27648 -27120 -26478
9373 -26478 -34747 -41621 -37424 -27445 -21240 -12200 -23568 -23518 -20697 -638 -2137 -44392 -45538 -34605
9359 -34605 -27601 -27618 -7248 -19439 4297 40969 45319 6979 -14369 -13625 -18431 -18433 -27269 -31451 -33116
9344 -33116 -59430 -60498 -43827 -32546 -34604 -20551 1337 -1648 6347 17769 -7378 -17410 -10071
9331 -10071 -15532 -2727 -4287 -7752 -26000 -56944 -22544 118 12407 19082 5067 3545 3929
9318 3929 -14929 -27467 -12810 -7336 -6121 -10871 20260 40670 28870 -6490 -7206 -12683 7279
9305 7279 2748 -12018 -56211 -59427 -42398 -20768 7436 5547 26161 62040 69848 46838 25325
9292 25325 -6005 -27822 -39674 -29178 -19561 -5112 7264 383 -2131 -7633 -15693 -18072 -21450
9279 -21450 -5360 11373 5618 -11173 -11944 -8762 -23480 702 12810 11076 5403 -11184 -16717
9266 -16717 -22582 -932 9395 3275 9507 -2158 776 -139 -9624 -1536 13138 2862 23471
9253 23471 33813 26825 21942 11369 4027 10279 -17704 -36637 -45744 -37355 -876 11219 4261
9240 4261 9329 22195 -4695 -32397 -30401 -25163 -17089 -31950 -45536 -26188 9519 12031 11615
9227 11615 6554 2431 8206 -3347 -11263 -322 9268 6625 18653 14553 4166 -3186 -25908
9214 -25908 -42711 -43580 -26087 -19186 -11460 -17237 -10835 30882 19578 5710 -15343 -24847 -37166
9201 -37166 -31296 -27319 -31401 -59639 -75529 -60217 -21755 -28643 -25681 -4963 2624 3412 10603 20976
9187 20976 16757 2452 -10586 -36900 -15105 25023 22017 13744 -3769 -9574 -753 16206 -3214
9174 -3214 -1363 -12097 -17065 -8972 -32830 -58486 -55137 -17939 14371 25672 14934 6742 17484
9161 17484 18542 25990 1188 9818 626 -2076 4272 7306 -14459 -52786 -39595 -15531 -11694
9148 -11694 -6212 -9789 -9537 21394 24754 -3100 -2045 17627 10336 12312 17982 25325 18071 7452
9134 7452 9495 -11438 -22173 -30619 -42885 -11050 -4874 -4393 -10127 -6885 -18663 -14111 -30173 -21677
9120 -21677 -9508 -8974 -10235 -20031 -28744 -18619 -9570 -22849 -38861 -32550 -10046 10446 5681
9107 5681 -5047 -1957 4168 26906 36811 39405 54879 35035 15825 7970 13575 12723 -26721 -37667
9093 -37667 -29738 -22675 -24743 -19344 -20764 -17340 -1417 19167 2221 -9933 -5756 -9223 4157
9080 4157 -1293 -9586 6419 -2190 -13180 -11573 -6306 -17300 -24433 -6739 -936 9088 1100 2256
9066 2256 -5422 -23097 -9834 -11943 -6730 9805 10078 13208 7586 24140 20413 32481 39536 28291
9052 28291 32925 46823 29593 3277 18626 34089 26070 31062 24998 23041 18579 27309 14119
9039 14119 8338 9220 28596 45003 42659 29154 16173 12273 25362 18783 -12763 -29264 -23808
9026 -23808 -25392 -9874 2884 13631 10596 5296 -6177 -14291 -2256 8383 21186 21771 10428
9013 10428 2483 -6874 -18267 -20406 4615 15882 10385 28940 48487 39567 19468 13087 31596
9000 31596 39036 22383 16378 4149 -2475 26129 31712 50885 57044 64687 51566 37777 10511
8987 10511 8674 17122 27780 15224 -10682 28195 71569 71022 64763 56567 76641 77023 72437 82906
8973 82906 67551 66504 68354 77310 69356 66409 50131 37231 43340 51337 32111 42485 39754
8960 39754 31218 53230 72446 55317 50431 47542 12147 10636 34676 50923 71426 87838 117437
8947 117437 107602 75599 59602 60050 54709 59402 65957 71806 82791 87700 108780 114711 105011 113358
8933 113358 119303 129881 141432 122388 90011 79488 81951 98898 73805 61475 86530 86197
8921 86197 106529 105824 72128 70845 66980 70824 73741 75398 67047 76284 99328 115290 134738 138713
8907 138713 124443 86785 99990 91590 72310 94490 112948 131699 121524 121352 127995 144503
8895 144503 140121 150668 217797 218975 215008 203511 198517 186772 179212 192046 204454 211885 216505
8882 216505 200321 216539 231704 225527 260623 286794 294461 326296 370082 415064 440396 486353
8870 486353 540432 627391 736254 875486 1049592 1148669 1119260 957757 735453 561968
8860 561968 453663 406699 343646 320562 289434 280005 302110 296447 297627 306518 300665 276004
8848 276004 274152 288311 286707 270581 266260 253875 265801 282301 290591 293704 302414 333200 335591
8835 335591 338421 328269 335793 340098 343179 359099 367061 336561 333494 308642 308272 308728 318642 315568
8821 315568 299644 273824 230547 216099 237118 242713 234292 237904 257193 232463 224983 225902 209258
8808 209258 203720 206833 208291 207877 232443 270271 273479 278723 285337 275546 268800 298235 297071 270041
8794 270041 277693 292127 312418 333928 350379 377059 403422 438364 475075 493197 501940 512072
8782 512072 508019 486129 454333 433957 407420 373716 353162 344653 329710 319788 292074 269227
8770 269227 247928 244573 235336 235227 234423 219663 220255 231451 234154 250489 272757 261734 252415 265245
8756 265245 244124 213532 230369 233776 242289 240231 224316 206571 205153 224462 233962 232697 252856
8743 252856 272364 293333 286569 264837 285589 294280 275077 251084 252311 253455 240620 209459
8731 209459 200743 205971 206121 208099 201573 188185 210249 197098 156505 97287 113608 152423 145787
8718 145787 149350 148073 133447 116250 117961 114206 111272 98306 97618 96529 116398 127982 129976
8705 129976 137964 144480 121505 94138 77484 79339 84048 75856 50919 45425 56927 56636 57263 49876
8691 49876 32130 15635 13998 37446 58109 49410 52938 61348 56601 62911 74609 54716 54025
8678 54025 74386 60380 55293 86586 104715 74173 63801 73932 75113 63576 54572 79301
8666 79301 98548 104577 93202 90138 105058 115925 117582 133399 133018 115032 91176 80167 86378
8653 86378 78811 62342 52930 48393 39930 57398 53682 47900 40374 45133 51574 60902 73867 59178
8639 59178 54793 48897 33963 33958 28294 43204 53283 47763 52675 53021 56715 70575 76615 57017
8625 57017 41756 69989 86706 98742 125497 144815 136550 111059 121662 164955 189442 212429
8613 212429 227611 232929 218324 183920 140194 120921 105367 112777 129404 123966 112816 121905
8601 121905 155429 175075 184661 181293 196727 201533 198432 152828 114641 112846 121675 121713 126339 130010
8587 130010 130798 113821 93783 86777 74980 84784 91499 93166 65715 69048 82451 73793 88329
8574 88329 101476 101565 109349 97888 100846 129437 159525 159991 161582 161441 146766 116965 99642 69877
8560 69877 85188 78586 47649 34529 46265 55139 44116 27433 26280 24009 24763 47365 51010
8547 51010 27937 2250 -4623 -20547 -18620 -14211 -4728 7876 745 -3202 -3379 7270 5372 12792
8533 12792 26700 54858 44014 16522 19865 3731 6587 9484 -3431 16137 18363 23133 39004
8520 39004 31935 33944 51000 58185 57024 55454 49823 27265 10950 -5723 -415 6903 26539
8507 26539 40491 32685 33340 22546 19583 17502 38694 52681 41600 18489 -4022 -6441 -1294
8494 -1294 18007 21879 18695 18092 24261 37724 37678 6031 -7669 -5073 -2049 4031 20756 21697 40830
8479 40830 36291 21407 12629 7493 2028 -10930 -2419 -1201 -21480 -30456 -36771 -47544 -26439
8466 -26439 -14308 6229 20633 4342 -5164 -11640 -2887 -15232 -5575 1960 -12577 -16583 6426
8453 6426 9473 5677 -10240 -25681 -19785 -7250 8691 6146 -5443 5800 19377 20216 25571
8440 25571 18203 12538 28214 34627 14901 18663 14818 -2426 -12128 4179 6879 3111 9990 23695
8426 23695 19892 1767 6684 14557 -3697 -40267 -29514 -27334 -23076 -12542 -14247 -11325 -4771
8413 -4771 -5710 9148 8345 3132 7243 -2299 -4044 -13426 -19627 -33700 -23260 -1402 24553 28441
8399 28441 13292 8095 16043 18871 7312 -22699 -42986 -23002 -17468 -12127 10830 33214 35070
8386 35070 18777 4169 860 -1333 -15415 -12465 17757 34506 36405 12515 -13364 -4757 7732
8373 7732 12624 16073 -114 -12585 -12554 2554 -2331 -8764 -2091 -4535 -10376 -24587 -15353 252
8359 252 -4098 -22251 -10405 22514 36463 13536 14059 -4296 -15909 -14181 -14513 -1681 28189
8346 28189 20029 -14187 -19914 -4208 8988 -2434 -16270 -12233 -15569 -8597 7965 31499 47481
8333 47481 21406 18241 22126 13722 20075 11817 -12692 -20454 -30741 -10616 -10613 -23422 -31309 -18065
8319 -18065 4497 12942 2391 16880 44239 51986 68159 75027 49860 27124 17622 5754 -2514
8306 -2514 9912 8954 12651 17850 5127 -17747 -17787 -3024 16203 18658 27243 28655 5202 -27229
8292 -27229 -8197 -3762 -13331 -36014 -49500 -30420 -36760 -35707 -32559 -6415 11955 448 -5709
8279 -5709 -23628 352 9621 -2656 -12603 4039 35051 25348 10062 -260 -6208 8408 7737
8266 7737 -12051 -31242 -19994 -15945 -17981 -2814 -11461 -12858 -5682 -4113 7654 -8833 -20268
8253 -20268 8993 -10389 -18446 -12802 -4004 14823 15267 6504 12696 5040 4108 30735 9772 11634
8239 11634 6377 3488 10330 36459 43808 35437 29374 4686 -29455 -31893 -34235 -16176 -9688 6047
8225 6047 -1425 -15559 -18461 -6885 -7395 4887 19209 5107 -28350 -27116 11682 42003 13388
8212 13388 23956 17200 -6865 -9926 -7193 -6420 -8519 -21775 -27691 -21964 -22728 -8471 -29479 -45307
8198 -45307 -33017 801 2317 -18398 -29242 -22788 -8875 27086 39706 21038 -1702 -17891
8186 -17891 -27297 -31742 -49510 -43200 -31701 -30912 -45466 -58302 -47242 -26239 -21333 -26967 -19175
8173 -19175 -17686 -28963 -17425 -22055 372 41496 19101 -7813 -1732 13972 27173 29636 10249
8160 10249 -2329 -8437 -4617 -15840 -6055 8352 -2568 -13098 -14492 -20347 -31338 -34310 -24970
8147 -24970 2069 7344 -3910 -6088 -616 17971 16564 -1589 -14149 -5352 -4467 -34560 -34774 -41861
8133 -41861 -38612 -33923 -26502 -23766 -23585 -29649 -33317 -24001 -21884 -17864 -7626 -10382 -3471 21908
8119 21908 29236 3736 -14743 -26211 -25145 -16572 -5851 -12821 -33191 -58648 -25992 -15609 -25127
8106 -25127 -15420 -25289 -33832 -22819 -14324 42 -8544 -1726 16633 4751 -8229 -18695 -33415
8093 -33415 -19449 -7146 7261 30738 20066 -10041 -13236 -34372 -37301 -16686 -11666 -17409 -23959
8080 -23959 -16865 9411 25904 18477 -4201 -14597 -19304 -25806 -3296 7666 29185 32287 36712
8067 36712 22164 15167 26642 26114 25286 -3376 -1132 -14916 -26334 -35039 -21241 -7418 -12137
8054 -12137 -28952 -40636 -50105 -34950 -13302 -9924 -24881 -28839 -6085 -465 24575 15013 -1170
8041 -1170 5081 27214 37417 20766 14556 -2844 -21813 -26488 -22314 -7687 12721 43766 31420
8028 31420 10616 3454 17341 48313 58515 32269 18107 13422 31923 75386 71675 58622
8016 58622 62534 47560 47520 31023 16195 28380 49826 35230 15566 26663 50995 48487 47085
8003 47085 61641 63694 90808 68222 54438 56969 41640 38844 42055 22412 -2515 -23878 -45364
7990 -45364 -47706 -36013 -25783 2111 8755 9837 23253 19446 26406 52005 35368 5964 15277
7977 15277 11756 5505 10721 17441 40486 53800 44835 46527 56163 58191 65785 68613 63764 42971
7963 42971 28915 30483 40731 33146 37341 35511 28539 28014 46154 42071 22289 16754 -3369 -6582
7949 -6582 4529 -15526 -16693 9882 20867 15266 -362 -15936 -20577 -2455 36229 26950 21338
7936 21338 19235 10246 14498 29337 22311 30765 21595 1603 1007 819 20641 43346 41217 18313
7922 18313 10439 25412 31749 27703 32446 25881 11440 -2839 -16335 -6824 -13817 -51711 -59877
7909 -59877 -25930 -16371 -6714 -14013 -10445 2807 25950 24720 12552 17267 38618 27822 -4928
7896 -4928 -17103 -38199 -31745 -4980 15378 10585 29930 53750 40283 25698 8579 22951
7884 22951 18411 40221 40538 8179 5595 3858 2223 20147 20953 20051 940 -5231 -4369 -2312 -24209
7869 -24209 -32562 -43673 -35599 -13094 -28107 -33073 -17003 13398 60650 61767 26528 -3266 -4649
7856 -4649 18601 23374 3226 -24771 14407 29870 34565 22697 20751 20692 5997 -9291 -14861
7843 -14861 -11230 -7992 -12606 -12686 -23225 -28076 -24421 2171 2978 -9019 -14523 -13879 -16675 -19019 -35656
7828 -35656 -33846 -22595 87 3458 11962 8359 -18683 -1120 -4562 -14771 -20620 -3317 -7852
7815 -7852 -23698 -27574 -39974 -32416 -20665 -17241 -32498 -40122 -63193 -52523 -34361 -26212 -10680
7802 -10680 6663 16606 16056 7197 -37 -8401 -7630 -13563 -27511 -25138 -33404 -30332 -21441 -24580 -21036
7787 -21036 -3174 5971 -6304 -11743 -32355 -22800 -2172 10071 7723 -3489 1471 -2296 -6329
7774 -6329 -4591 -7566 -15581 -29516 -38149 -38692 -17062 -26143 -38758 -49871 -33353 -29327 -37068 -30972
7760 -30972 -15854 -13459 -22487 -18774 -20884 -16406 -4445 -4696 -24392 -13694 -7580 -7582 4256 29116
7746 29116 19644 -3725 -18612 -23017 -37087 -38264 -31434 -19449 -3074 -666 20542 26177 13100
7733 13100 8435 11971 -16549 -31309 -29569 -33772 -42357 -44567 -49398 -63636 -55625 -38087 -41542 -44299
7719 -44299 -50252 -44557 -58915 -61743 -33831 -23765 -24956 -13402 21225 27470 18295 -20552 -38853
7706 -38853 -24268 -38372 -47146 -41403 -32668 -20536 -26264 -33064 -40206 -46744 -46388 -31686 -4732 -10007
7692 -10007 -2635 -19261 -41668 -14622 8258 2042 -11656 -25428 -45791 -47256 -35331 -29039 -5903
7679 -5903 -8085 -11467 -11498 10610 20102 11401 -16120 -24239 -16827 -25764 -20321 -14498 -23628 -46309 -17291
7664 -17291 -2673 7335 5333 -15659 -15537 -14396 -29661 -21404 -7044 -5849 -16892 -31538 -35213
7651 -35213 -4883 5498 16567 9194 -5749 -8391 -61 -3851 -21246 -21552 -38758 -34236 -31608
7638 -31608 -9200 -19941 -38309 -52671 -35321 -33688 -53116 -21474 -16467 -16873 -13851 -9536 1265
7625 1265 11674 5021 2596 -5483 -23927 -20024 -26211 1382 -21248 -40354 -18663 -11181 -20757
7612 -20757 -19042 -13918 -18864 -30095 -40050 -34450 -26282 -40943 -56151 -45518 -29067 -22668 -21876 -13817
7598 -13817 -27518 -27423 -23009 -7002 -5928 -34775 -22012 -5968 9048 -4503 -33518 -48624 -56957
7585 -56957 -37999 -38142 -36902 -15495 -18174 -18593 -23230 -13119 3278 -19248 -34242 -31902 -27166 -19356
7571 -19356 -18473 -27406 -32812 -16762 -5789 1207 -15223 -5112 18936 41721 36115 44 -16332
7558 -16332 -4981 -4775 -6287 19184 15306 25248 33814 25124 19356 -5853 -5872 -12407 -19919 -27372 -7519
7543 -7519 13391 11572 8229 15549 5107 18214 33226 16805 11716 10166 -19442 -36140 -27231
7530 -27231 -15243 7326 20365 22172 -2330 -49295 -58709 -33970 -3210 -9063 -21471 -11725 1356
7517 1356 8241 6246 -10379 -26583 -29460 -10295 10955 26565 44153 24924 11204 -1917 -24960
7504 -24960 -39813 -30025 -14294 -16406 -16282 -19639 -28689 -27937 -28929 -20095 -7744 11792 21300 10505
7490 10505 3106 -2614 -11351 -16269 -14305 -5122 -3780 -15157 -10616 -18490 -19112 -30334 -30720 -3332
7476 -3332 -4311 -28951 -44072 -43652 -30776 -17349 -10054 -6165 -1257 -2866 488 -14042 -12265 -5786
7462 -5786 -9772 -5859 -15117 -6813 -21975 -45836 -44881 -49794 -19514 11939 -857 -19941 -3443
7449 -3443 -2400 -15348 12497 -3254 6121 -11062 -27993 -12896 -19692 -46499 -47800 -7652 -4769
7436 -4769 -24536 -8933 -3840 -10443 -14477 -6174 -17404 -46857 -66913 -62235 -73959 -71165 -47459
7423 -47459 -27625 -18336 -42202 -49866 -18137 -23861 -27272 -23761 -3396 -4906 -7885 430 1112 -24711
7409 -24711 1330 9388 -12375 -10308 -12764 -30223 -18696 -4987 2118 7101 2949 4214 4749 577
7395 577 -4672 -12874 -28213 -19526 4175 -13596 -38833 -37985 -26474 -14845 -19168 -24100 -22014 -35857
7381 -35857 -7292 3043 -8985 -32484 -38460 -14532 -15063 -10780 -1921 -25534 -26709 -17690 -17807 -8276
7367 -8276 -432 -2525 -7564 -16879 3035 -9729 -27911 -42549 -40019 -37452 -38636 -23119 -25921 -22642
7353 -22642 -7541 -5099 1276 -5175 -10104 -13684 -28825 -53759 -48083 -37024 -34361 -2345 -450
7340 -450 -23298 -20046 -16289 -6280 9123 -3223 -10649 -28032 -21473 -22335 -30404 -19595 5557 13593
7326 13593 -1633 -11509 -28323 -15770 5940 2012 -2488 -18734 -25275 -13539 -19659 -50621 -48419
7313 -48419 -25704 -47477 -27277 15059 14002 -1761 -27154 -45404 -33531 -21568 -27927 -24946
7301 -24946 -12471 297 -18758 -10917 3517 -1035 -8156 -3217 -14504 -10064 4039 -5876 -29775
7288 -29775 -31800 -29041 -22309 -7508 386 -11469 -9389 725 -4177 -7575 -19180 -24511 -15225 -17746
7274 -17746 -26820 -24157 -17209 3631 8628 -16019 -15011 -13704 -19806 -15741 -31059 -38415 -12899 -12980
7260 -12980 -28427 -38477 -33912 -11639 6986 27118 14971 -20473 -29755 -14250 -8539 -14178 -9078
7247 -9078 2846 -1070 -24873 -33848 -23041 -31522 -46480 -35867 -7801 3324 7625 32998 32665
7234 32665 7218 -25887 -38620 -24625 -12298 2115 -2508 9565 18895 9852 24958 33137 5477
7221 5477 8474 8800 -1641 -16370 -19461 -9329 -26338 -29648 -26111 -4959 -4558 -19872 -24932 -21226
7207 -21226 -12073 -2708 8902 20870 20451 18770 11718 7290 4924 -6325 7468 13158 17216 8965
7193 8965 -18289 -28745 -30869 -30821 -24545 -3627 -20200 -31974 -35461 -40914 -28120 2853 10942 -3341
7179 -3341 -14898 -22203 -26975 -50223 -40988 -14443 -22056 -30391 -45951 -25641 -33240 -41516 -39009 -38126
7165 -38126 -23366 -34244 -40342 -26965 -12045 1294 -26929 -50383 -48737 -23750 -29467 -46902
7153 -46902 -45885 -20454 -31178 -24529 -17862 -16348 -29861 -44147 -34429 -15447 -204 -9597 -24452
7140 -24452 -22527 -12349 -10120 4038 11360 9768 20148 13291 8896 -17985 -20939 -7691 1487
7127 1487 -24757 -44301 -25604 -9917 -21882 -14110 -8481 -19876 -24045 -47926 -45019 1048 15659
7114 15659 26250 27318 27263 22982 23326 25749 25071 11762 1855 -28109 -30454 -8418 -175 -14294
7100 -14294 -34769 -37409 -30315 -27033 -19181 -7739 -7295 4741 10592 347 7069 -11342 -8225 4394
7086 4394 24327 15487 -11564 -3298 -1026 -7791 -12002 -5591 -2088 15458 45891 32828 1332
7073 1332 -24802 -49047 -41911 -29429 -32397 -33916 -9262 20624 20805 12065 -5841 -34067 -52645
7060 -52645 -46392 -38092 -25369 -11185 -1449 -2276 -19583 -54326 -57014 -51928 -46230 -29936 -38803 -8491
7046 -8491 14161 10574 -13815 -28923 -35539 -20127 -12004 -21625 -21248 -28246 -48787 -64827 -50729
7033 -50729 -25112 -15925 6024 -7545 -17497 -29523 -24285 -8353 5963 -4782 -12768 -3051 -2373
7020 -2373 -22349 -40546 -37867 -32491 -23817 -24762 -14694 -31373 -36034 -10175 1384 2624 -18699
7007 -18699 -17810 -16200 2020 -3755 -27195 -27949 -19500 5843 15844 25167 37875 28144 19916 24504
6993 24504 -6634 -37536 -26906 -10388 -6686 5986 1077 4510 13338 8268 -20531 -22636 -26312
6980 -26312 -10156 22825 20249 -1405 -19394 -25486 -22180 -42997 -35699 -20339 -38270 -15732 19973
6967 19973 20777 -3615 10452 5084 -1466 -2503 10187 18251 3442 -36572 -65890 -65147 -59863 -74264
6953 -74264 -42799 1108 -10815 -20222 -17228 -7527 -4462 -13254 -7758 -9384 -21331 -39475 -34324
6940 -34324 -9232 -2390 -23046 -27432 -9687 14101 30472 12739 -7695 7216 6587 -2715 -1629
6927 -1629 2842 6263 -15447 -23822 -2377 -9905 -39534 -40747 -21234 -9978 -2279 3302 -15910
6914 -15910 -15936 -1877 5470 -9597 -6377 -8414 -29682 -27554 -47166 -57252 -53399 -41385 -61133
6901 -61133 -47719 -18847 -19951 -24750 -24013 -18156 -16710 -15052 9762 43792 23560 3727 11542
6888 11542 9961 22428 19351 6385 -24259 716 25714 16523 18887 14133 12449 15859 25807
6875 25807 37308 19290 8576 915 -4696 -16696 -28113 -21370 -7427 -15018 -12913 -20390 -50225
6862 -50225 -46545 -40891 -30556 -13137 10456 25680 26685 18691 -7837 -21912 -28636 -6237 -21457
6849 -21457 -33222 -22492 -15230 -14369 -19680 -25833 -36292 -28235 -21439 -40888 -67946 -55663 -55023 -60172
6835 -60172 -63304 -38841 -28878 -20732 -9031 -2091 14636 12151 13915 11055 19771 20752 28003 35266
6821 35266 44510 35429 30872 2827 -1030 -10954 -11086 19881 44691 50656 50461 52175 32996 14876
6807 14876 19757 17863 930 -16256 -10727 -1085 3480 -2268 12789 3915 -22800 -38757 -33169
6794 -33169 -40113 -70336 -70757 -37236 -37239 -43939 -34501 -25025 4433 9461 -12783 -53290 -39991 -23816
6780 -23816 -250 2469 -13726 -26181 -16479 -15668 -6910 -9648 18020 46970 31668 4951 -17747
6767 -17747 -23774 -15096 -29731 -21923 -5360 3140 -12804 -32208 -20248 -1286 8600 10121 16559
6754 16559 28648 57258 51141 42487 22381 15267 5543 -8487 -15802 -9867 12065 35839 34245
6741 34245 31526 42404 42362 45366 57850 69890 97848 114926 132332 157249 170288 194508 240008
6728 240008 281800 334860 402578 412501 372810 272824 193372 140093 102089 89902 72616 61117
6716 61117 64352 53653 37496 38514 44116 47665 19677 23780 34458 31436 17222 13209 23317
6703 23317 36331 31516 14205 12789 8780 5923 10724 10426 7132 30879 30088 33548 52007 38982
6689 38982 16286 13568 -3738 -28464 -7262 3341 19498 25883 -17658 -30062 -26928 -8058
6677 -8058 1091 -8587 -23694 -20623 -2888 -11162 -17160 -15840 -9154 -1017 -15292 -20478 -20581 -27061
6663 -27061 -19632 -14989 -17545 -20613 -7892 4168 8475 5781 -640 -7443 -34588 -67981 -42615
6650 -42615 -29799 -30587 -37000 -41058 -44780 -52091 -50295 -31522 -1111 31854 44645 17192 3676
6637 3676 -8357 -1414 -9717 1362 -1567 -24187 -27477 -18570 -33086 -29842 -8002 -3766 -23430
6624 -23430 -40122 -39381 -41998 -34273 -37680 -29037 -9045 -3770 10493 9243 15622 6831 -21610 -27835
6610 -27835 -20775 -24390 -22871 -23892 -34628 -35168 -35524 -17758 -9832 18200 20147 10236 -1640 24649
6596 24649 39192 43350 56510 52081 21392 -9129 12501 1521 -23404 -24175 -6674 21064 25385
6583 25385 19421 5249 -21521 -23370 -15656 -6619 -4982 -9662 -8025 -29417 -34798 -35577 -3873 23166
6569 23166 28069 43247 49644 61588 57895 30368 -5142 -18168 -17402 -9377 7014 -13496 -11542
6556 -11542 -12919 -17900 -19149 -28271 -12512 -13212 -17629 -2772 -34798 -25117 -3462 81 4029 4416
6542 4416 7906 -1014 -19906 1782 17502 14887 22942 17356 24282 25611 10587 -4023 -27523
6529 -27523 -15447 1712 -10875 -27825 -14318 -1932 13562 4575 -19323 -24817 2484 17067
6517 17067 8212 -4242 -14176 -5663 -8347 -11115 16692 23186 27912 41746 21582 13726 -15191
6504 -15191 -19748 -22082 -18609 -28581 -23151 -10348 -2917 -1015 -12814 -19780 -33028 -22945 -26730 -19099
6490 -19099 -9090 14088 32036 15756 1043 16774 7876 15858 -698 -12092 9240 -25035
6478 -25035 -47920 -46756 -27505 -24950 -12252 7932 8474 -24064 -52734 -37574 -17051 274 14252
6465 14252 6280 1318 23285 15193 9662 1403 -18822 -29824 -27088 -14883 -921 11903 19922
6452 19922 17850 11727 21160 19355 -6694 2400 7136 -1855 -28695 -14340 5606 14224 1756
6439 1756 2370 23458 35686 28167 24363 22335 7590 -12257 -7022 -1618 28184 51666 35705
6426 35705 2164 -23229 -37202 -32161 -31708 -36038 -30679 -19810 -13260 -19641 -22835 -20566 -13534 -23708
6412 -23708 -5588 6818 12297 -10553 -9134 -10816 5834 15235 4250 -5287 -10574 -16807 -1195
6399 -1195 -4167 -10682 -17238 -15376 -4907 16278 27696 25273 37144 44506 19361 17954 43311
6386 43311 23621 -19435 -29380 -37751 -41764 -43293 -26893 -9717 13625 9130 10492 465 18728
6373 18728 38544 36562 23379 15501 20166 8711 -27965 -33837 -43062 -23993 -22363 -16343 -12663
6360 -12663 -20497 -15446 -13727 -14621 -5186 12585 7498 1425 -3250 7119 -13121 -7582 7445 7822
6346 7822 -13462 -12364 22669 42003 13293 -98 -17756 -42938 -28906 -14250 5907 9666
6334 9666 934 -7463 -1248 23350 31845 54351 33459 10842 36101 26520 15960 14006 16949
6321 16949 5287 -26559 -17007 2877 -18663 -31252 -38007 -23989 -7811 -22469 -28468 -9173
6309 -9173 -7217 -20450 -27160 -45906 -36439 -7361 -5435 -8417 -25246 -25386 -9531 20333 37163
6296 37163 25498 8480 -2682 2808 1424 4399 -11772 -22928 6828 9028 -8299 -32767 -22586
6283 -22586 -13413 8098 -1060 -4662 -11057 -18352 -25788 -32495 -25126 -6273 2603 15020 50606 51061
6269 51061 30679 22948 -8178 -26774 -11780 -10805 -16282 -9472 -10189 -12672 398 -16906 -26866 -12922
6255 -12922 -20250 -30375 -21374 -18186 -25734 -16480 -20151 -40943 -31829 -20398 -5068 -13485 -23072 -26502
6241 -26502 -41172 -38929 -16543 -11979 -18153 -16803 2559 836 -16357 -21484 -8743 103 -13493
6228 -13493 -44240 -36558 -18064 -4938 4314 9380 1745 -28675 -45702 -57456 -56881 -56150 -49171 -35991
6214 -35991 -8898 15101 25372 4498 -39809 -46381 -20771 -11363 -13650 -597 -13479 -48632
6202 -48632 -49377 -26461 -21887 -13349 -10859 -12958 -10097 -22276 -17323 1623 -6146 -7684 -15994 -25358
6188 -25358 -6399 15589 13136 4984 1667 -1889 -3633 -6246 -18840 -5395 8577 4969 -5308
6175 -5308 -19476 -25223 -31000 -12162 3968 -6858 -28257 -28907 -21338 -13976 -13832 -8197 -35339 -35170
6161 -35170 -15218 -25630 -42562 -30463 -6056 -24846 -43753 -25167 27127 56824 48694 53425
6149 53425 55496 37802 1340 -16565 -37888 -38657 -16826 -22316 -37971 -26124 -4503 -5158 -15405
6136 -15405 6028 -5555 -36773 -45652 -25306 2763 4624 -7474 1473 6764 23638 34776 34227
6123 34227 38775 40454 32171 16995 41242 67331 50467 29375 5430 1662 12150 21197 37931
6110 37931 39585 31345 3770 -15620 -14479 -20996 -19043 -29496 -18994 -11644 -24542 -1224 4169
6097 4169 -25766 -34489 -27780 -19438 -7890 417 10338 -1491 -11366 -5342 -13324 -16462 887 12358
6083 12358 2849 -17465 -19260 1181 9482 182 -20912 -16539 -7720 -3896 2230 10960 289 1863
6069 1863 -11107 -2506 -14605 -28991 -52739 -56296 -47973 -19132 -30117 -29779 -16450 -30017 -38806
6056 -38806 -30300 -5861 -13165 -23096 5280 26748 16041 19474 -5270 -16662 -7333 5034 14341
6043 14341 14714 11491 16697 6944 -18510 -39202 -28311 -12602 -14200 -30580 -23353 -22024 -29676 -17613
6029 -17613 -9198 -11016 -14883 -11227 -12998 1713 9120 -3480 -9433 -10600 -3381 -11719 -15406 -17937
6015 -17937 -25441 -15982 -22653 -21315 546 21130 6349 -446 -1193 2077 14279 7058 -4295 -21444
6001 -21444 -23713 -12290 2170 -20180 -32067 -23975 -30109 -22754 3849 5159 -13014 -27088 -38030
5988 -38030 -16463 -3009 -9140 -26758 -33909 -24844 -12900 -21968 -15055 3991 2745 -23089 -54744
5975 -54744 -39963 -13227 589 -2018 -13094 -4412 -15078 -12136 11085 13418 -8853 -17120 11434
5962 11434 23223 23404 39898 35809 12884 -5796 -20474 -38863 -18901 17843 18923 19681 27293
5949 27293 24834 24093 53272 42984 21048 -9790 1190 7166 -17519 -15579 -7737 -6225 5254
5936 5254 9487 8738 -1055 3286 -7422 -27148 -32982 -18914 -5293 -10273 -8074 -4317 -10273 -12406
5922 -12406 -12065 -3670 19440 12654 6063 483 8889 -20771 -24483 -23261 -26505 -32946 -30301 -33658
5908 -33658 -32585 -10693 -3202 -10409 -5309 -16942 -42467 -58000 -44733 -13305 6264 -6855 -5525
5895 -5525 -5078 -15879 -4726 16219 7104 -18624 -37457 -38654 -35838 -25321 -13274 -14608 1299
5882 1299 -11495 294 -2323 -4803 -2943 8639 16322 2140 -14320 291 -2614 -2864 -3041 -9707
5868 -9707 -11146 -4572 -2981 -1399 5770 27641 33781 47915 39005 12249 -13028 -3771 8447 11638
5854 11638 15173 26612 15553 -20436 -27119 -40472 -27328 -19555 -34435 -17678 6070 9525 33018
5841 33018 38425 41458 24154 578 -28502 -38712 -12277 7180 9938 11951 -12213 5562 36909
5828 36909 39110 29449 25799 34210 40691 23167 6500 -5438 -16250 -12451 -12547 -17820 -17767 -16912 -25844
5813 -25844 -27670 -12371 -6361 5140 10568 549 2592 6420 -11844 -17673 -623 -3264 -17073
5800 -17073 -17629 -25707 -20311 -9585 4677 8459 21498 28322 13400 -11303 -7754 2696 19744
5787 19744 6824 -2664 -520 7878 4223 -12627 -35867 -43174 -24709 -22306 -27438 -9165 8516
5774 8516 263 -31114 -38094 -30832 -24204 -31012 -28319 -19365 20931 48582 25988 16440 7848 15038
5760 15038 8765 -3683 -5758 -16435 -16939 -861 -15059 -34350 -35465 -26827 -18163 1780 4648
5747 4648 -7439 -33457 -43189 -26504 -25513 6619 11927 -6073 -12876 3114 1067 -2105 10239
5734 10239 -2297 -31133 -21965 -15976 -47572 -44428 -5258 23150 6634 27727 43550 14356
5722 14356 -8786 15681 20785 -1800 -20515 -23639 -36671 -38119 -4113 21691 44760 54512 40617
5709 40617 14117 1015 -16689 -2283 8105 -17578 -10136 16875 24383 21659 12627 27163 22652
5696 22652 3660 -5873 -28646 -43073 -40210 -35052 -26133 -21318 -5546 9762 11083 18801 14261
5683 14261 28610 17204 4210 -22298 -30380 11258 23143 10733 -11410 -13145 -25489 -38646
5671 -38646 -38740 -17476 9511 -17013 -24326 1622 2188 3732 2494 16470 28625 25495 34578 47779
5657 47779 53630 16953 35709 41847 30982 33150 12532 -289 -7581 7680 5495 17100 1438
5644 1438 -9762 6909 30591 45086 29038 18660 2729 -5816 -16414 -31927 -45740 -53139
5632 -53139 -16988 5206 -19414 -43978 -35430 -779 11637 6088 -6392 -6635 8362 14726 -6224
5619 -6224 -21124 -6367 20860 12856 4777 9765 8204 -1090 -7295 -21073 -7063 16588 18924
5606 18924 -5067 -24474 -21887 -13673 -26197 -44978 -38517 -28058 -7878 24664 21371 -10769 -26782
5593 -26782 -30439 -21517 970 4050 8135 -8201 -2401 -3453 -20289 -32463 -28117 -9379 -9599 -12792
5579 -12792 -14640 -1012 9099 40170 41880 27683 20979 22429 -1637 -20000 -23224 -12503 -13505
5566 -13505 -11241 -9478 -11818 -16455 -25209 -24843 -25978 -39093 -21454 -10510 -4865 15523 13032 14532
5552 14532 30367 29039 -15054 -31854 -48431 -51180 -44526 -38004 -19845 -19427 640 -8446 -47258
5539 -47258 -43647 -37396 -12083 -712 -14414 -15281 -2835 -18368 838 6904 -6748 7964 7610
5526 7610 17694 17912 5041 -6745 3629 14079 -9062 -35186 -31822 -9458 -2004 5235 4604
5513 4604 21299 625 7609 14890 9249 1861 8230 24150 17284 -13514 -31035 -32905 -22481
5500 -22481 -14786 -470 -31900 -20055 -13326 -399 15288 8650 -21719 -10621 -4412 -23297 -44474
5487 -44474 -40306 -21651 -3486 -179 -4534 -6087 19264 26089 34732 24265 22061 30919 31497 26435
5473 26435 -7786 -30286 -27653 -10125 -2218 -11667 -28948 -22724 -29772 -28240 -22701 -19597 -1130
5460 -1130 -13832 -7375 16706 8430 1874 4951 -557 15952 25107 32431 29783 24982 39711 30301
5446 30301 2227 -2867 -9549 -16329 7477 15476 20767 4915 137 6797 -16653 -27432 -14416
5433 -14416 3602 4390 6716 -3281 3906 -3406 -11696 -5911 -14944 -25429 -32096 -10286 271 13067
5419 13067 17483 31411 12125 15843 6029 3347 22412 30674 44031 18920 -1850 11758 -5262
5406 -5262 -24201 -51998 -21051 3133 -5531 -2231 -5043 -1248 -6092 -14680 -15085 8967 -9913 -25123
5392 -25123 -26762 6200 6602 -1026 1664 -17677 -27100 -32964 -25525 -44583 -31690 -15389 22094
5379 22094 36680 44996 43275 1202 1121 9742 28843 42428 30866 38295 41437 46165 39861 12407
5365 12407 7623 26325 13990 -15171 -22044 -13529 -6441 -7176 -8146 6649 -2919 12153 7202 -12318
5351 -12318 -1017 -928 3527 5693 9917 20403 449 -10818 -6739 8354 11655 8462 5659 -10818
5337 -10818 -6740 1398 -24256 -15190 -2008 -18666 -42991 -50689 -42661 -43273 -24124 -10600 8611
5324 8611 11786 18780 21531 13054 24205 12960 15648 11047 -15616 -7386 5814 -1274 -7753 -7955
5310 -7955 14775 24836 25673 25948 22243 34812 44657 41580 14183 -9079 -3066 -10443 -4491 9671
5296 9671 12502 -8950 -12337 -22208 -20872 5282 -2307 -5252 -13377 -4266 -24268 -32761 -27871 -11702
5282 -11702 -3524 -3240 -3624 11341 35274 29091 35928 43864 23703 19217 18255 19206 11218 -20415 -30593
5267 -30593 -28083 -20838 -20962 3017 23604 30764 46232 41786 63166 59117 33786 16535 26827
5254 26827 26768 25839 21469 26642 43808 59106 47732 21213 7559 -5226 -21434 -42646 -36366
5241 -36366 -4142 7977 8830 16553 29290 27636 22655 19780 33433 27111 -15196 -21196 -20665 -23579
5227 -23579 -1064 -2007 11423 40768 32573 -95 -312 -5233 -740 -1415 8782 9728 25640 3844
5213 3844 -13605 -12122 -4831 -5493 -27109 -28049 -26491 -54971 -46710 -40133 -10541 6557 5110 -21662
5199 -21662 -37666 -27698 -28979 -28948 -8871 -24487 -23647 -5894 -5695 -1116 -13616 6347 38142 14776
5185 14776 -4959 9695 24130 27781 16239 24665 44698 47424 45729 52182 45230 39061 35166
5172 35166 20546 35571 34117 22855 -12946 -33786 -35183 -27516 -10663 330 -11276 -10311 -13533
5159 -13533 -33868 -35427 -9801 18515 28146 -7741 -16763 -3895 2034 3714 -8519 -12862 -16431
5146 -16431 7685 25184 17996 23939 38191 55991 57503 23641 10687 -6083 -24004 -2632
5134 -2632 4749 12799 13922 -8731 5103 3023 11528 12213 15806 12743 12112 5279 6870 24050 26824
5119 26824 6006 -4186 -16276 -19371 -22316 -32923 -40098 -39464 -30650 -8825 5446 28494 10254
5106 10254 -6720 -22241 -4555 -450 9700 -8934 -35588 -17942 3895 7629 -10789 -22442
5094 -22442 -43158 -19591 22916 22083 6833 -17275 -17849 -5344 -8996 -19207 -19057 1623 15617
5081 15617 6149 -11573 -8987 -1187 -2625 6698 -27851 -40818 -51787 -51588 -22618 -10151 -3666
5068 -3666 -5669 -17274 -29087 -23252 -8310 6310 9920 5826 -7469 -22380 -28385 -45418 -51527
5055 -51527 -20175 10634 5394 1748 5011 -10281 -6926 16052 9476 6235 3863 -9835 -14575
5042 -14575 -3266 17264 20798 10728 -25225 -50098 -23662 -6304 586 13052 18384 31875
5030 31875 19356 19573 12757 15188 10470 6977 -771 14886 5929 -8277 -16142 -13946 -20533 8872
5016 8872 17925 4318 -6474 -8438 -12007 -16544 -5340 15610 49829 35359 11762 18 -5057
5003 -5057 -31 22738 36722 33158 23342 17672 10258 -6541 -16934 -26614 -17374 10632 23339
4990 23339 26648 23559 30977 3232 9647 21661 12716 20499 28660 2761 -3640 -5636 -3285 258
4976 258 -4659 -7026 -7154 16685 34344 33358 24918 26714 27919 12758 -10275 -47827 -50085 -49367 -53591
4961 -53591 -47049 -30396 -24933 -24926 -4349 684 4567 -5776 -16922 -24717 -13394 -5351 3812 3727 11714
4946 11714 22158 43914 6003 -13609 -822 26197 29157 33911 37664 36022 17118 21725 47748
4933 47748 32959 22572 3368 -16669 -3314 13495 22653 26778 -1914 -18084 3985 10990
4921 10990 1625 -12182 -14437 889 21143 36163 33453 18069 10104 10866 2925 -27243 -48059
4908 -48059 -52454 -42970 -31048 -37823 -38376 -19213 -27508 -51850 -16378 1825 8091 18634 31750
4895 31750 26324 16027 36535 23547 -5119 -3062 4771 26220 8279 8877 20361 4013 -14827
4882 -14827 -23778 462 30375 22734 23209 20740 24576 29923 10876 -16462 -29726 -27002 -7047
4869 -7047 15276 23001 20266 25286 15911 12905 -7298 -17648 -1081 11258 8612 -17693 -11949
4856 -11949 398 21684 32679 25419 10099 10800 6951 8809 -788 -6200 -7153 -30092 -29768 -8503
4842 -8503 11430 16186 20004 22394 4844 16076 15225 -8636 -2842 10182 1019 -5284 5241 -9234
4828 -9234 -32794 -47199 -54071 -31640 -29555 -26735 -21727 -8089 -9922 -8073 7574 17985 15523
4815 15523 7466 5968 5399 3020 16037 11943 -21345 -20224 5775 -38 -10246 -13871 -22460 -18296
4801 -18296 -11214 -6840 2687 10728 36920 36268 32762 18357 3727 527 3932 17562 12800 21599
4787 21599 6741 -6157 -17243 -26803 -28510 -7311 5883 8223 1226 -19824 -37167 -18006 -12328
4774 -12328 -4725 -5652 -16991 -10455 -4882 -4304 6618 8032 29501 38144 41270 8490 -7041 -13931
4760 -13931 84 2532 -23235 -13840 9405 19885 8882 -5851 -9084 8716 4816 -3118 954
4747 954 2794 -18037 -42845 -31485 1785 24594 36353 15655 -28432 -25263 -17697 -21273 11017
4734 11017 18833 -1635 -16254 -33943 -39506 -21234 -28407 -34361 -26333 -21535 -37009 -18237 -15264
4721 -15264 -12507 5385 12751 31441 23533 -9098 -9539 8217 5055 -9076 -3509 -6068 -5894 -3408
4707 -3408 -16263 -5006 -11635 -27051 3064 2973 -23006 -7594 8468 9942 5173 11276 3561 13096
4693 13096 370 8189 14885 2824 -14524 -27848 -38580 -25213 -18845 -21343 -5658 -10744 -19108
4680 -19108 -10530 15160 7030 6968 -5294 -35597 -10616 -52 396 -15770 -373 25074 28467
4667 28467 21984 -10970 364 9293 -4259 11026 22756 8763 4269 11734 13251 5664 5381
4654 5381 3066 1418 -16631 -28094 -35450 -19063 -3346 8464 11649 -14933 -36885 -55725 -51629
4641 -51629 -40521 -39531 -23486 13150 36029 23762 25819 6351 -16537 2224 26081 17825 224
4628 224 -21286 -27201 -7586 27141 31906 6681 32356 41747 38075 40235 14605 25903 39128
4615 39128 35464 16810 23827 13880 -448 -14300 -15329 -7863 20513 21178 3395 26832 38951
4602 38951 20997 4081 16596 11930 -4845 -16579 -1318 11157 -4071 4557 17706 -6096
4590 -6096 -21145 -21056 -18170 -29004 -28193 -8506 23766 9703 8942 19165 6072 2607 15483 30893
4576 30893 25525 32144 19427 -2377 525 5555 -25097 -28080 -7238 -7594 -25127 -25109 -54189 -54307
4562 -54307 -27873 -7797 -2211 5960 -26231 -37517 -16424 13712 23013 8269 7762 17935 -6447
4549 -6447 -35712 -34158 -20176 -37547 -37702 -22569 -6348 1198 20759 17194 3010 14070 24034
4536 24034 15641 5650 -5905 2414 1219 9085 -5543 -21293 -3108 21426 31930 19830 17623
4523 17623 23239 16866 14980 5934 -10558 489 4588 -2486 -37936 -35650 -1336 24260 29601
4510 29601 13013 -4242 -20678 -18079 -34035 -25522 -17200 -17936 -5910 7528 31605 43179 24576
4497 24576 19121 8547 18952 25850 16360 19584 7582 19578 48184 15447 -6614 -12783 13242
4484 13242 2131 -9481 -32092 -35959 -10570 19030 12729 -20333 -28747 -7051 -15805 -9228 29253
4471 29253 35093 44266 30099 12166 1172 1773 14952 8295 -8595 -12231 -28548 -35523 -9834
4458 -9834 4523 9536 23052 8478 937 3262 2997 -5649 -25600 -35799 -22256 4290 23829
4445 23829 19510 15239 -1262 -5678 -24230 -14238 -8073 4491 -6465 -11617 -7134 -1049 -12045
4432 -12045 -15550 -15549 307 29556 8822 -9973 -11098 -5865 19364 29361 49391 42998 31392 21124
4418 21124 4549 -5625 -19362 -11495 -15157 -18553 -25643 3714 27945 11378 1343 -7 8568
4405 8568 -6032 -24025 -13897 12912 45379 69014 69402 53424 38018 49567 44119 20459 34758
4392 34758 19216 -6034 -37193 -39605 -1297 7009 10783 25839 7132 -4496 -1455 5624 9880
4379 9880 28393 41226 37300 43603 37901 41741 22439 20281 1627 -3950 -19138 -30647 -10274
4366 -10274 24773 28909 20724 34323 19496 30620 22586 -5175 -7008 6154 -13616 -29294 -24929
4353 -24929 -23328 -11419 5205 13329 1663 -27634 -11172 -3747 -79 -13152 -24894 -25917 -24758
4340 -24758 -26856 -17081 -3018 -15523 -27487 -29380 -36456 -32502 -27701 -17808 -10619 11442 13940 3322
4326 3322 2691 10598 12460 5400 29508 36278 32343 19882 11113 16349 17444 4217 2221 11083
4312 11083 4653 2275 -5500 3076 -4855 -34815 -20975 2389 15893 3854 -7707 -25760 -26794
4299 -26794 -20061 -10686 -24905 -2715 11997 -4109 -8235 -24933 -22632 -23680 -32140 -24086 -14204
4286 -14204 -8224 11269 12991 -2736 -28487 -43191 -35765 -6649 3251 -1493 -1557 7750 -5190 -26729
4272 -26729 -34502 -19086 24823 31527 24520 47663 49336 39387 33517 27321 29932 38475 27160 -3241
4258 -3241 -5405 13262 16149 10583 16059 -8041 -27396 -33810 -39089 -26962 -16085 -5812 6739
4245 6739 -11373 -9046 -12322 -6401 30981 32984 35539 43736 31912 8413 -34040 -52564 -35243
4232 -35243 -27550 -16299 18950 29030 22791 14378 45717 47909 26440 25087 27019 26995 31144 17477
4218 17477 8108 12050 15815 -2441 -23107 -15815 10647 7499 -6581 22036 30461 -6246 1779
4205 1779 15386 2490 -3576 5837 17181 19984 16318 5569 16617 -8000 -17255 -6022 3449
4192 3449 10862 15994 17446 6694 -665 17942 13697 21379 -4751 -30092 -49482 -44677 -26409
4179 -26409 10452 7867 -751 -16454 -27291 -29049 -26814 -20698 -19086 -33808 -42630 -28404 -7726
4166 -7726 -9932 -10951 24559 29406 40767 43474 38352 3228 -9483 -10596 -27524 -12518 5978
4153 5978 -8482 -16555 -9475 22324 23402 15015 14331 1475 2093 -7706 -29355 -23652 -14174 -20271
4139 -20271 -1545 -11484 -8914 6971 -1649 -15458 637 -20141 -35789 -591 7823 3766 5607
4126 5607 -2263 -1009 29271 9570 -10737 -5700 -21992 -37377 -41344 -31757 -21087 5766 28306
4113 28306 23205 7936 -904 26252 12620 -12093 -7908 692 18985 11905 3453 5203 4493 239
4099 239 -3609 864 -3363 -6978 2584 32800 48265 59775 47368 32951 19483 33541 45729
4086 45729 18626 10231 -7345 -22017 -37094 -22791 26748 30156 7513 -2986 17824 25379
4074 25379 20233 25123 26317 15407 -4510 -7655 -7497 -24579 -15863 -2807 -4866 5818 20603
4061 20603 43206 41814 13145 5331 -3707 -11085 21429 20993 -6566 -12858 -13588 -22425 -16652 17288
4047 17288 15222 14181 12327 -7460 -14287 -2852 10348 6453 11872 10924 -10235 -11247 -10030 -1274
4033 -1274 27356 19411 -9529 -33497 -44542 -34712 6745 29578 42684 45958 7199 -22036 -33071
4020 -33071 -35012 -21663 4231 12708 -3809 16720 38126 35101 18684 5150 7325 -23337 -40024
4007 -40024 -20067 -13815 -4587 -4147 -24582 -11151 4128 19514 39099 18932 4735 12232 28461
3994 28461 24160 3496 -10308 -1217 378 15152 20474 15312 42029 58121 44879 19668 26728
3981 26728 11179 26887 16765 -618 10397 28411 11611 2375 3036 3319 4457 3941 4047 -18208
3967 -18208 -5074 -20067 400 4892 3425 -13294 -8393 -2812 17387 9859 -10984 4412 19408
3954 19408 24096 19820 2423 -18872 8492 23755 23894 20991 35359 32744 23200 20226 38509
3941 38509 37005 39755 18648 -4935 11474 42377 32797 16795 18290 31713 30751 13214 -7383
3928 -7383 -9384 -11018 -5742 8425 14971 -5707 -928 20596 13023 -9457 -6140 4189 -5826
3915 -5826 -11860 -13968 -10712 -3576 -6002 -20821 -2403 18831 9959 13261 13711 369 -6358 9198
3901 9198 23152 598 3418 19260 -2018 -963 5985 -3255 2774 -2755 -23287 -26666 -32928 5720
3887 5720 27211 -7747 -24328 -25467 -28092 -4305 22593 41028 20692 437 -25437 -29962 -18327
3874 -18327 -7411 -2097 -9788 -1793 -15020 -16784 -19164 -3740 -7020 -4780 -14660 -11927 5498 12047
3860 12047 8390 11325 14552 23490 2572 -20069 -11808 -3284 -5702 -25544 -47827 -15561 -4312
3847 -4312 4417 -20 4012 -22202 -16502 -12155 358 2609 12577 21232 18257 1877 1188 5889
3833 5889 7088 11073 17581 5632 20890 32021 39608 21739 16046 22313 17576 14945 27009 12516
3819 12516 6910 21882 18499 10821 -2798 2638 5425 16800 -7389 -43652 -46396 -50731 -44542
3806 -44542 -20091 -17908 -27085 -28824 -16815 -7081 10507 47248 53370 43824 28105 -6292 -47669
3793 -47669 -41717 -5736 14499 14750 27022 22692 19203 21855 20002 6940 -14917 -10839 7005
3780 7005 19274 19556 25416 14578 10282 14077 -23496 -23372 3018 12521 27921 33707 23683 -20415
3766 -20415 -25794 -13932 18843 11457 -13090 -10544 -1622 21656 19496 -341 -8513 -12898 -14141
3753 -14141 -18433 -21445 -38974 -47943 -31715 -2136 -1793 75 6455 -9879 -14342 -611 7406 14866
3739 14866 6228 8707 26481 6814 -26344 -23692 -11499 11925 7275 12700 4905 -13438 -3930
3726 -3930 13646 8357 8283 -12144 -18039 -8952 -3813 -4588 -7664 3312 11972 8263 -13578 -36551
3712 -36551 -32122 -17315 8975 -2391 5870 13606 15164 6885 4103 32958 13869 22676 30686
3699 30686 28705 45483 53431 63590 48491 25494 18401 34471 25595 6762 402 -16545 -28298
3686 -28298 -905 4059 10269 21735 18234 28675 21317 1112 -2417 -6139 -7105 -3245 8138 1489
3672 1489 -24622 -27953 13848 18307 4028 2545 6541 17469 6946 11321 -2581 -3672 15979
3659 15979 43373 42896 62811 46137 31749 20416 21697 17150 13135 9547 3083 11844 18484 10557
3645 10557 12267 10777 1516 -11037 -27422 -28587 -1989 6527 30363 49903 46452 40817 27060
3632 27060 8147 65 5347 10472 -6967 -906 -4857 -27459 1962 35872 46425 31253 23790
3619 23790 24974 30411 23605 -17137 -17810 -24387 9867 30457 32072 -3376 -14107 4028 20262
3606 20262 29374 26457 27003 29545 24942 -944 3377 -13830 -25461 -29055 -14270 -524 6094 33201
3592 33201 24761 22782 30018 7510 2216 8545 2625 18637 45869 62865 36208 -1668 -19087
3579 -19087 -31340 -14156 -7645 -9358 15025 28535 31208 29530 22940 12175 1856 2191 -9278
3566 -9278 -34547 -29199 548 14627 25681 9614 20908 31614 25118 13159 23177 9491
3554 9491 -8597 -10317 -21374 -21720 -20097 -14806 2873 -11597 -44707 -27177 -12392 -2977 3235
3541 3235 4911 -6828 18215 37566 13475 -6799 -3640 1871 1487 6212 5774 11507 19119 14181
3527 14181 28349 31165 26648 23399 14373 24410 20472 27121 35565 42212 49523 34455 21568 19076
3513 19076 17908 9744 152 -17384 -21502 -33803 -31081 -30038 -19095 5307 10865 13309 17342 23960
3499 23960 38460 50012 25311 -6198 10219 32083 39938 55294 50030 28423 6250 15215
3487 15215 32489 4628 -3375 -6810 -5359 2455 26118 31255 8194 12254 16008 30292 30689 29797
3473 29797 20017 26669 25895 18499 18370 5806 10792 16806 21301 1229 -3568 -13324 -13184 -27126 -56484
3458 -56484 -39668 -23296 -28553 -27068 -8282 17711 31410 24290 18738 -14486 -26586 -30840 -21541
3445 -21541 -22231 -21861 -14968 -859 22285 2075 -1446 10772 -3518 -14831 6425 13891 14464 1593
3431 1593 13964 41581 70816 69804 56457 56598 39573 42906 28704 12040 12690 3593 22313
3418 22313 14671 9204 20247 19373 -4803 -29550 -29082 12477 17957 6731 963 8511 8354 1940
3404 1940 -16805 -26871 -33518 -32955 4515 33022 37138 25611 11662 8873 12711 -4317 5247
3391 5247 -4039 -23021 11858 34590 49431 72587 61339 36121 16516 -218 8255 5449 -7721
3378 -7721 -38824 -47986 -15853 -1129 -8132 -20780 16323 42485 25957 -8851 -15456 -5435 -4180
3365 -4180 2463 18244 2070 -1883 -8411 -11391 -1693 20881 39822 15721 6417 -3859 -1158
3352 -1158 -6069 -4947 4128 9622 22450 15311 23689 24659 14599 1034 -13496 -13311 -19396 -10057
3338 -10057 14131 14084 16595 10008 13674 15079 10216 14189 13760 12804 22336 39324 32846 28117 3770
3323 3770 -19534 -20921 -10117 5658 -5613 -3865 18138 27533 -4177 -16472 -6039 5250 2001
3310 2001 -567 -25153 -15594 8315 1406 -4859 2263 -5607 -20141 -22460 -9362 1212 16219
3297 16219 27826 34442 20925 31446 21321 11452 -507 6486 14944 26129 28553 11911 18783
3284 18783 27798 22065 1164 -25145 -19952 -8064 -8681 2454 3936 5462 6958 9209 6525 -6595
3270 -6595 -32416 -42422 -23477 2300 -1437 -17810 -12238 -15428 -21595 -21631 -31823 -29990 -19237 -7590
3256 -7590 -12972 -26289 -6127 -4655 -11635 5491 7396 -13313 -5452 90 -21200 -24330 11308
3243 11308 15586 4480 -865 23051 21237 7169 9298 21863 2852 -3375 12293 13803 5193
3230 5193 -3765 12963 20067 27130 -757 -16943 -1641 -1481 -17373 -23488 -10098 5531 -15306
3217 -15306 -34732 -10911 35964 36757 29160 29694 31245 27562 17475 4816 15681 22268 18478 17818
3203 17818 15726 22787 36920 43090 45148 20740 7860 17458 16457 33445 29556 1633 -18439
3190 -18439 -16952 25442 30871 32690 44227 46460 35262 26032 22474 10211 -1365 3017 8099
3177 8099 2664 13366 13770 14306 28187 22459 23555 27527 37633 27307 23706 27751 11252 -17463
3163 -17463 -10192 6846 6477 9279 23757 30097 33022 28245 19503 29 3347 13230 477 -1103
3149 -1103 -15383 -37996 -24177 -3701 6933 14232 21332 -1699 -208 14050 21290 21492 19376
3136 19376 4242 -2744 8407 6228 30998 19469 12357 25707 25071 26949 5628 32380 42766
3123 42766 12715 -767 5942 -21781 -15612 7923 22225 14366 -7987 4996 11314 24850 4104
3110 4104 -15871 5128 27077 36084 41649 27535 22676 20145 7013 1383 -23260 -36322 -39929
3097 -39929 -25494 10457 18248 10321 7789 8574 19905 34175 31641 12448 19958 11636 -276
3084 -276 9685 15275 26141 11672 11820 1846 -16457 -5314 -20013 -30826 -17864 -13823 -18774 -3203
3070 -3203 27204 28899 15300 1974 -11377 6442 27916 50897 63437 40276 34920 42595 41461
3057 41461 30669 36781 23478 -6154 -46636 -46739 -38578 -11858 -4806 5267 39536 32217 16803
3044 16803 38390 51961 55164 57472 27979 33156 42543 7793 -8848 1012 9073 4443 12471
3031 12471 8258 -4568 19535 16811 9789 14774 15448 23344 26538 26259 18787 639 -18528 -19103
3017 -19103 -18696 -7493 23059 32517 37298 47010 55123 4105 -33140 -39776 -57690 -44018 -10473
3004 -10473 -5672 -13246 -9216 7207 27774 27799 30127 18383 15018 -1997 -14416 -19573 1725 12056
2990 12056 -2912 -11677 -13097 -2811 3037 1757 -6084 8064 31617 25680 10089 26662 32654
2977 32654 39105 31481 42894 39751 2472 12781 18793 14751 18293 29501 375 2761 21588
2964 21588 29115 26680 20720 -1058 -7651 4245 2031 -17748 -12509 4436 12981 3286 -8847
2951 -8847 4280 7787 9552 -2282 7872 5528 -13371 -27280 -26647 4094 25009 16528 -1182
2938 -1182 -24340 -15519 -18219 -13903 2872 623 6629 36081 22382 17041 19369 11069 -11777 -12483
2924 -12483 -1354 6422 5176 -14931 -38170 -45077 -39301 -26073 -4501 -4864 -3257 20589 49911
2911 49911 32506 12837 76 -6368 2955 27032 47443 39121 49910 56977 40473 33595 38344
2898 38344 24331 21078 56325 43225 32871 41507 24258 -1842 7614 -13015 -36035 -17940
2886 -17940 3539 6491 2840 6677 -5715 -15151 -1221 21629 23784 19871 7629 1463 -11620
2873 -11620 -26647 -35341 -20375 -5717 -8789 -27076 -21840 -8512 127 9229 30290 42249 21597
2860 21597 6658 16964 18250 14078 18459 11849 -1017 1680 4741 -20509 -18527 -19932 -22263 -26715
2846 -26715 -25452 -27468 -18864 -22112 -7359 -25771 -26446 -27342 -28423 -36839 -33487 -10301 -10688 -6596 -10318
2831 -10318 -6775 -2069 -12439 -25267 -33879 -41513 -2599 13803 4412 -12417 -20607 -22954 -9157
2818 -9157 13624 5119 -10004 -30094 -15497 -8228 -9787 -2646 1730 12348 23887 30556 20198
2805 20198 13221 12929 14147 13488 -19007 -37186 -8564 -64 -398 -5910 -1317 14413 6789 12319
2791 12319 13448 15514 -9821 -31939 10932 22723 37439 34151 4747 -206 9664 15063 1220
2778 1220 -14918 6760 35744 14250 10164 9348 11775 17572 10607 -4730 -29468 -27199 -17185
2765 -17185 -15739 3052 17444 40373 30955 -3657 -19083 -1366 -1073 -15162 -28602 -5121 27830
2752 27830 31885 -4412 -28402 -32746 -31532 -33254 -36674 -24417 2221 6712 16104 13037 5234 7028
2738 7028 3168 -5361 -3862 -1783 -5323 -5584 -912 -11323 -16451 -11334 -16285 -23018 -32730 -31818 -21492
2723 -21492 -10403 5340 15509 30381 21705 17919 7899 6277 -3170 -1564 2389 3847 12756
2710 12756 5914 -2174 -18803 -12034 2863 9443 21875 19036 4895 -3154 -5159 3739 1640 -6568
2696 -6568 -8961 -33387 -18286 -5645 15712 28491 23454 23076 19971 18606 22790 10830 21792
2683 21792 6165 -5590 -16515 -22145 6124 19728 13268 7829 4130 -10341 -27490 -27994 -26127
2670 -26127 -36297 -43675 -19571 13527 30729 46070 26979 6847 -1589 -28564 -33139 -26806 -25856
2657 -25856 -26206 -21147 -14768 15577 29063 53795 39212 -4008 -7945 23212 30940 7853 -5534
2644 -5534 -19788 -6683 9324 14941 8061 -1171 -4560 -11417 3350 22547 25226 2341 -12792
2631 -12792 -22049 -10108 -18195 -21913 815 23920 35473 15443 10430 10160 -12856 -14791 -19096
2618 -19096 -16544 -15738 -1162 1511 -17480 -4056 9452 8346 4725 17840 6521 -3634 13243
2605 13243 9988 -6566 -18914 -8959 -7049 -1995 -6436 -24507 3941 -2734 -28011 -7599 12314
2592 12314 -2945 5369 17340 24967 6405 -10039 -14861 -25500 -12554 4626 3078 -3887 9820
2579 9820 -1395 -6914 3169 9664 28186 19706 19489 14727 8382 11711 -5788 -9629 15489 12040
2565 12040 5260 476 25092 34001 30057 7824 -14918 -33777 -20349 -9791 -13730 -37398 -33506
2552 -33506 -28819 -17944 8069 23271 20643 2083 -3009 -2495 -18664 -31437 -15274 -1412 -7650
2539 -7650 -11516 -18870 -12503 -5672 -4557 -19927 -11502 6016 -3536 -22740 -23461 12311 24788 2207
2525 2207 -24799 -21287 -11733 -13628 -11819 12975 24217 24033 18356 34045 48534 45988 36517 26627
2511 26627 26437 27570 25604 20048 22901 34386 18571 2110 7151 35042 34133 19830 19408 16151
2497 16151 11911 6093 18544 11696 16303 22696 3038 -17138 -28796 -16750 1113 -773 -23812
2484 -23812 -7152 14118 23373 1050 17668 13788 -5712 10609 21911 33392 32565 46217 65882
2471 65882 43684 52003 39747 16168 -3857 -18566 -29303 -21614 5552 8654 -5527 11769
2459 11769 37991 50442 45299 31367 5108 890 1907 19973 27153 22987 22807 16865 1594
2446 1594 -9776 16932 11541 -6273 4549 28601 25638 8982 4076 -19574 -31136 -29726 -33571
2433 -33571 -26289 -873 -4806 -17291 -20334 -5517 -2947 5146 4185 -12649 -16524 -18254 -3900 -3797
2419 -3797 10171 20788 25300 17206 9799 14017 3443 -6797 12638 -5409 -5779 18574 32356
2406 32356 37974 37795 33246 31692 12158 1306 24326 21042 13847 9697 21277 2376 -23794
2393 -23794 -14286 -8130 -9337 -8641 7277 -4476 -1664 13998 9304 -2204 -7655 -23500 -30264 -24819
2379 -24819 -20848 -17119 -14079 10638 7385 -24352 -25057 -21734 -11889 -5079 561 17624 195 -7161
2365 -7161 -11581 -3813 -17767 -57069 -38745 -20062 -11675 -113 16701 22556 12471 -18769 -7873
2352 -7873 -4580 2015 13228 17253 9139 -956 -3114 11241 3510 19011 33616 38658 30928 25541
2338 25541 15993 -13348 -12016 -12531 -10360 -27466 -9963 -11580 -11944 -4302 6355 8869 -17652 -44814
2324 -44814 -46145 -28584 -11005 12746 -90 4432 34139 30049 28788 25268 2833 -8071 6878
2311 6878 5827 4121 7266 22573 48841 43376 16036 8667 16075 15653 -1738 -1674 2363 -8382
2297 -8382 -16478 -33620 -6239 9544 23616 36602 26304 -4238 6645 -13924 -15614 -13672 -3057
2284 -3057 3003 14847 26796 36438 19479 16357 24322 10853 -4130 -16348 -31829 -29802 5892
2271 5892 14572 10818 28165 37795 6252 -20282 -799 28967 36286 45325 50067 19610 15107
2258 15107 21670 29388 7988 -7627 -18978 -42430 -26728 -20434 -17290 -8036 -20008 1190 3043
2245 3043 -20927 -14829 13608 19060 20201 25861 26538 49845 51336 32324 26977 23767 55 3335
2231 3335 -9656 -3476 12417 28933 30220 16673 17579 28342 25190 42567 38294 1754 -12512
2218 -12512 -2845 9058 12215 -9360 -5430 14352 11810 25196 42371 51110 46649 28350 8913
2205 8913 -14647 3896 -267 -6951 9081 18507 -8508 -25357 -38035 -20226 -12084 -26503 -41170
2192 -41170 -29535 -36754 -48742 -41592 -45160 -39813 -33847 -14471 14452 2668 7681 1193 -4385
2179 -4385 -1836 -11648 -454 10844 8302 6000 -12395 -34614 -35277 -31041 -26454 -7549 11433 -7151
2165 -7151 -18094 -14924 -896 14802 15284 48472 74218 49193 22820 6374 -4567 -3873 -8943
2152 -8943 -12997 -1495 3498 1103 5562 11777 19997 19229 -3252 -13599 -6998 -11475 8750 11995
2138 11995 2527 -20636 -26783 -13481 -13246 -11963 -7095 14770 12414 -12613 -9771 -8140 -4358 2596
2124 2596 -1073 -14200 -15161 -18770 273 7223 7569 28598 56481 56684 49961 22546 25004 12309
2110 12309 -15155 -27633 -29373 -26057 -21684 -24816 3446 15061 28473 26607 18318 25465 5445
2097 5445 48 139 -16374 -7691 6274 14032 -13678 11446 22944 23139 21022 34950 23096 8855
2083 8855 29282 28791 22364 7119 5405 6109 3668 -465 34852 29520 14342 20701 23099 33870
2069 33870 39112 15582 17324 32746 26707 15990 11812 34396 55290 38878 21803 22834 13076
2056 13076 849 -15406 -40531 -41572 -50544 -56627 -25600 -19150 7825 34747 55024 44527 35237
2043 35237 33066 26760 34753 8488 9160 16807 22106 18041 19119 5724 23804 32697 29771 28106
2029 28106 23424 34519 28394 6649 -10165 -6829 -12008 -19620 -17731 148 1672 681 -2611 -17737
2015 -17737 -23241 -13366 -24202 -16968 -10249 6466 6356 7314 19575 26100 16912 35 1461 15007
2001 15007 16209 19687 -3326 -16686 -34183 -37914 -14995 -12647 -12279 2473 16083 15599 26788
1988 26788 17217 2435 4933 -2846 1185 22049 21749 12817 22624 17625 29719 44124 36304 41621
1974 41621 44173 34841 40965 27131 26553 31351 31549 27043 7234 -6732 -7606 1285 5968 -5031
1960 -5031 -20513 -33861 -26215 9221 43676 35901 13558 -18755 -44153 -48093 -25192 4283 26932
1947 26932 36064 11675 -1725 -2692 9945 18798 7200 4010 21178 40485 25188 -6452 -21501
1934 -21501 -7377 -1683 -6314 -2100 9047 21612 29552 17778 -1740 12221 -7683 -20481 380
1921 380 32757 37155 30790 41159 36158 3236 -6829 10481 3987 24146 34847 12786 9925
1908 9925 12010 18352 14160 1399 27871 21604 -6887 -13652 -23083 -24997 -3746 10326 10974 11733
1894 11733 31814 23875 15390 9806 -3923 2400 1818 -1020 21759 29450 29288 27589 14787 19560
1880 19560 12575 -4472 11015 37471 18576 -10960 -17045 -28792 -45548 -35521 -9065 19738
1868 19738 14872 32842 27537 15176 24830 17867 13437 15179 7524 -2106 -633 -3097 18160 12637
1854 12637 2059 -1612 24766 26256 12517 19790 23781 28600 33511 37478 21352 2715 9700
1841 9700 22638 22295 -17626 -35304 -42187 -34765 -21976 -11651 9179 -2433 -29568 -69806 -50798
1828 -50798 -42405 -41252 -41332 -8190 1203 4562 -12531 -18453 152 41830 61397 30815 9128
1815 9128 15122 11711 -8152 -4323 4811 -4238 -5060 -17877 -16432 7998 16289 23963 47127 36885
1801 36885 -8263 -15938 -28976 -4470 16116 34822 30544 3851 5962 22756 -3778 -7057 8442
1788 8442 3932 9871 7057 -3598 -4142 -726 -6984 -27210 -23873 -9426 -20795 -9451 14793 22165
1774 22165 14662 8789 -8183 -26088 -22429 6284 16728 16649 -5355 -6846 -22120 -11847 -25391
1761 -25391 -27185 -11295 13553 29821 36444 19636 171 -12875 -32083 -25059 -1521 15702
1749 15702 2767 -1186 4209 -3118 -5658 7812 16086 21599 5219 563 3036 -10926 -21701
1736 -21701 -17708 -1635 9374 22735 20981 19721 11588 20300 38962 13896 -33313 -38578 3197
1723 3197 23811 32040 12524 19208 27002 16107 6438 3095 9337 11911 11945 7117 9869 11766 13485
1708 13485 -944 12942 1217 6016 28150 26880 27374 19695 22245 37685 48165 48436 35816
1695 35816 16003 15870 -4069 10371 15328 13844 944 -14234 -2846 8531 -472 -3172 17592
1682 17592 16985 12216 -3700 -11484 11279 19173 -291 8377 18923 2937 -9689 -29203 -26688
1669 -26688 -24032 -7042 10121 12817 15684 44229 39033 16518 9154 17007 17521 37981 34972 15863
1655 15863 3342 13030 9608 -20309 -5037 2228 387 -21583 -29291 -24399 -27800 -10131 -16737
1642 -16737 -26213 -7252 -1352 5066 -4524 -158 2308 18152 8173 5037 80 -12367 4641 18035
1628 18035 -3073 -5581 -10282 13693 28072 7237 -11019 -18116 -26535 -12878 -2353 -3435 1248
1615 1248 -14248 -9056 -12788 -25688 -17257 -2100 4986 12562 11642 -8431 -19012 -14316 -18497 -33486
1601 -33486 -26499 -11891 1359 -11241 -9600 -371 7475 10449 -7815 -5753 -20048 -31640 -26338
1588 -26338 -38510 -44654 -29655 -16223 3639 21503 17189 6975 9902 18831 16813 11450 -7687
1575 -7687 -5079 214 1360 -11439 -3715 -16813 -49 20618 31141 21615 21747 42193 30675
1562 30675 34151 33478 9313 9175 6480 8776 14513 12378 8493 -24416 -41760 -31046 -26529 -11033
1548 -11033 11928 23237 -2318 -22549 -30946 -23842 -177 -10219 -17 25981 31023 139
1536 139 -1144 23443 39258 66294 65684 54300 52176 34940 25432 25392 8020 11904 33352 2639
1522 2639 -5407 -7743 -18920 -2780 15794 18934 9709 19540 15316 9545 -5978 13287 27529
1509 27529 26032 25124 3288 -27751 -23113 18012 37314 24519 12529 25095 29382 19786 15014
1496 15014 12292 7341 12213 6012 7097 -8515 -20749 -14680 -4884 -4345 -1007 -1807 -311 12547
1482 12547 15684 -5913 -26484 -14451 -6042 6922 -1348 -6327 4000 -5137 -13462 -14744 -3332
1469 -3332 -21709 -32847 12573 41139 30876 3138 12302 32289 17456 1097 12804 21617
1457 21617 30636 -9762 -45268 -37253 -7390 -14706 -9512 -7917 -684 -14449 -2054 1492 -4297
1444 -4297 11795 6492 -4110 28260 42808 38100 18509 7794 -22687 -22488 5712 3204 1544
1431 1544 9818 25471 20438 5940 -7533 157 -10917 -26622 -2676 20516 16002 -10060 -14711
1418 -14711 2866 19948 21382 31784 20399 4985 -4383 -17731 -22710 -10106 -19724 -22200 -12271
1405 -12271 -18631 -3045 -11296 -26820 -26391 -13717 -2521 -19189 79 2472 -16623 -8219 -5170
1392 -5170 4229 -499 -26548 -51121 -57856 -58875 -44147 -24209 -8801 -9451 -21683 -19209 -12272 4883
1378 4883 1832 2844 -20070 -44143 -33229 -20770 -29024 -21233 -22055 -39484 -28189 -29187 -3408 9162
1364 9162 16507 9640 495 -21436 -36547 -39339 -40129 -49797 -38632 -34048 -27386 -13345 -5150 -7643
1350 -7643 -5377 -14436 -14725 -5975 168 4195 21634 27451 18014 6699 -2922 -1740 -34443 -46933
1336 -46933 -42658 -50359 -53394 -40802 -29352 -17310 776 15854 11270 -2437 -7313 -17562 -3700
1323 -3700 11893 40333 39321 11862 6302 1789 -17862 2185 40295 45556 42316 28454 -2022
1310 -2022 -11770 -14767 -17446 3210 550 -27221 -26406 -26436 1369 4718 -8641 -19858 -10766 -4122
1296 -4122 -10530 6068 27741 29895 13994 5914 35593 29506 18998 920 -11355 -20183 158
1283 158 -2558 -21115 -38804 -50390 -56042 -65662 -69463 -67718 -68205 -34570 -6850 -1377 -15249 -15544
1269 -15544 -10110 -10999 -19098 -20193 -4913 -5170 -3715 -3854 10050 -6922 -254 21773 13149 8744
1255 8744 11729 -14133 -22462 -20324 -18463 -21725 -20427 -26342 -41251 -43969 -39528 -33484 -8509 15419
1241 15419 10004 20511 15609 -16667 -18286 -7752 -10311 4101 12880 -16902 -18807 -30768 -34300
1228 -34300 -26223 -16523 -16088 -35207 -49805 -37720 -23422 7920 -202 -15227 -33347 -43472 -12254
1215 -12254 -4001 -33108 -36778 -24098 -14609 -1814 6464 4613 -9294 9088 1642 6952 3694
1202 3694 -7513 -14115 -4466 2852 22713 29301 23142 32585 29353 12815 -18266 -13464 -19550 -33672
1188 -33672 -20378 -16190 -11461 -4403 -12328 -40793 -38787 -40657 -14652 -10390 -24421 -12939 16539
1175 16539 -4503 -5087 -20262 -24956 -18643 -24424 -25246 -31849 -34174 -21684 652 21761 9743 9543
1161 9543 24311 13908 532 -7248 -2353 -3206 4 -9883 3696 19918 2854 -7784 16545
1148 16545 17050 6262 24450 21535 -3151 -34696 -35480 -15140 10850 -1317 -20738 -21359 -17627
1135 -17627 -16489 -3917 7520 12884 2174 13170 6987 -16602 -21952 -13564 14166 27961 21818
1122 21818 395 -9251 -10433 -27510 -45468 -20331 -3249 -1949 -19374 -32366 -8551 12670
1110 12670 20541 32847 13515 -2610 -11471 -33140 -25334 -32528 -24566 -3925 -1538 9577 3640
1097 3640 -3379 -9335 -15042 -5866 -10359 -32485 -29568 -28472 -33440 -51542 -53471 -41039 -38112 -15750
1083 -15750 -7281 -3306 6364 15439 -4295 219 2767 -11152 2188 918 16424 32688 24682
1070 24682 13523 10568 12903 11128 6943 -12914 -26428 -27539 -19663 -18574 -20673 -38828 -54694
1057 -54694 -54542 -50384 -55381 -30013 -11500 -4549 -1808 -12989 -11234 -34531 -39332 -49169 -39907 -36995
1043 -36995 -30772 -15905 -11558 1245 45349 47081 37982 27951 19974 -5149 -38002 -45121 -55969
1030 -55969 -59654 -57326 -33699 -12628 -14195 -8250 -3302 2562 -22282 -42903 -32362 -35423 -36086 -16676
1016 -16676 -14659 -10605 -18072 -16334 -25268 -24585 -15508 -35357 -28268 22094 28045 9381 5347 21618
1002 21618 35213 30501 24832 25549 14204 -1437 13426 16465 -13578 -18981 -12147 -5376 -3173 -15628
988 -15628 -18206 -19710 -24622 -14958 -16316 -12425 -25104 -13057 -14146 -24475 -24950 -21391 -13806 -15664
974 -15664 -19412 -13728 -21507 -7650 7356 18162 32428 29694 13177 -27004 -42769 -25274 7140
961 7140 17950 2542 -3085 -16950 -15736 -29376 -31710 -37540 -47275 -36321 -11786 -8227 -10549 -19276
947 -19276 -22029 -12598 -20207 -28594 -14640 -29858 -25448 -8276 9388 14063 -774 -26774 -39059
934 -39059 -50381 -21664 -24741 -29776 -16847 5072 -4770 -13034 -136 6414 12503 11678 9092 1775
920 1775 -4687 -17240 -14169 2893 20044 43362 30319 11570 34239 41537 53151 55668 30816
907 30816 15105 15182 9619 -2891 -6466 3189 12346 -1484 -9576 -12731 -17973 -10153 18068 7363
893 7363 6784 2081 1081 2259 10784 12183 -5551 -14183 -2310 -13236 -42509 -49238 -23786 -24942
879 -24942 -40777 -32139 -36107 -29434 -15437 -26675 -45148 -52351 -38392 -38956 -19589 -15825 -11029 984
865 984 2929 8996 5337 -1285 -26741 -16936 -8972 7890 2535 4574 22130 25514 3314 -16175
851 -16175 -6306 6845 -3518 -4042 18415 41233 31387 43744 49206 41079 36767 11182 -16360
838 -16360 -42337 -50892 -56313 -44803 -38248 -32558 -65223 -79996 -58088 -47134 -47496 -21585 -18052
825 -18052 -9107 -24427 -24128 -21892 -11094 -27471 -35299 -31609 -28363 -22565 -19693 -41680 -57128 -38262
811 -38262 -18999 -1283 -13987 -21121 -8718 -14317 -28319 -50854 -59103 -17751 -10273 -6870 5593
798 5593 6108 -25561 -36883 -24080 -21762 -9430 3356 -14974 -40648 -36994 -23936 -16407 -4666
785 -4666 4208 9866 9797 -347 -21763 -40126 -47419 -51761 -27088 -3798 -5318 6672 10073 -15225
771 -15225 -15319 5957 8053 -22675 -32880 -48176 -60031 -55240 -63420 -74700 -49625 -18679 -9952
758 -9952 -16209 -21998 -32288 -21260 -16550 -26541 -26440 -48868 -52097 -70563 -62947 -55439 -41479 -13188
744 -13188 6712 16548 -23577 -36988 -24104 -22081 -37596 -43853 -28338 -17303 8576 19909 12637
731 12637 12119 28103 26952 19333 -3424 -515 25080 26897 7890 -9414 -30369 -33224 -40063 -29164
717 -29164 4817 11076 -23376 -13890 -27528 -39444 -23528 -13349 -19946 -27748 -8787 11401 -8190
704 -8190 -27239 -31921 -42460 -28621 -30555 -41608 -46186 -54567 -45776 -28562 -5140 -12051 -43491
691 -43491 -44255 -43993 -46133 -43218 -34466 -47776 -43716 -34907 -22738 -20647 -11484 -21682 -35718 -56236
677 -56236 -57012 -48246 -53417 -63394 -46212 -41863 -9643 785 -9429 -18282 -24302 -26863 -8253 8902
663 8902 11037 8099 -26707 -47331 -48029 -57052 -40728 -31972 -43393 -44070 -36765 -34712 -49708 -47283
649 -47283 -49700 -55888 -61039 -49792 -58507 -58559 -63211 -41441 -2020 3624 -15750 -19448 -19208 -10358 -3580
634 -3580 1316 -5750 -23664 -20201 -23345 -33658 -48972 -68382 -53187 -35272 -30739 -15877 8254
621 8254 10118 1900 -2198 1483 12688 -7657 -13352 -29176 -23709 -11279 -22468 -33597 -21087
608 -21087 -19983 -26407 -30060 -3116 4029 -25114 -33236 -21070 -55777 -65156 -47028 -25193 -29913
595 -29913 -19266 -30455 -40868 -61451 -73517 -47432 -11128 -16520 -38194 -42000 -23969 -53322
583 -53322 -66785 -57605 -52954 -35675 -19913 -20059 -17942 -14434 -23149 -41385 -45573 -35080 -65839 -71946
569 -71946 -33023 -13789 -12012 -2913 -6253 -21232 -24801 -13774 -23923 -26212 -12698 -2363 245
556 245 19143 1620 -19397 -11343 11558 17496 12113 13631 -7648 -18752 -16892 -22553 -783 1332
542 1332 4066 -4813 -15168 -13266 -9878 -19463 -31566 -23083 -22413 -32621 -49603 -56787 -27346 -8689
528 -8689 1992 -7330 -21371 -19706 4230 -10266 -24449 -35528 -49658 -31710 -24116 -7038 -15561
515 -15561 -26663 -44634 -42760 -43282 -44316 -35857 -52507 -45218 -35364 -23175 -34857 -30037 -19356 -22531
501 -22531 -42916 -47314 -45678 -4892 -11955 -26272 -13686 -7816 -599 -23975 -17276 -14114 -24687
488 -24687 -42777 -48847 -53471 -46468 -35200 -12826 240 -15318 -14564 -19064 -47260 -37523 -16842
475 -16842 -11824 -18182 -21742 -43715 -49592 -57093 -64056 -41366 -28365 -17544 -23007 -49038 -60744
462 -60744 -64730 -49613 -26115 -22526 -43616 -33671 -53445 -53622 -53732 -43536 -28806 -16424 -27337
449 -27337 -21768 -44099 -22767 -8350 13323 7577 -14437 -17250 -15082 -13685 -24472 -16542 -33796
436 -33796 -29296 -3189 -1161 -12770 -2390 -2361 -16799 -26296 -19433 -21243 -41488 -43792 -39954 -30450
422 -30450 -31358 -16270 -1832 -16204 -42280 -35992 -34678 -40708 -25045 -27044 -26816 -31002 -39556 -24861
408 -24861 -31052 -34714 -19839 -18294 -30650 -22419 -20004 5506 12677 10233 -5716 -2012 8945 7823
394 7823 -14177 -18422 -20959 -33231 -30381 -25822 -49579 -49972 -18070 -27052 -41918 -14800 -8167 -12972
380 -12972 -11518 -15495 -14283 -22575 7483 10375 6961 -6202 -35235 -39612 -38231 -19194 -33496 -44260
366 -44260 -39574 -39187 -50972 -47912 -48806 -63904 -64497 -55426 -38162 -42815 -59145 -48998 -48236 -53202 -45406
351 -45406 -51058 -71187 -73971 -64274 -67759 -61271 -44704 -60049 -52312 -42219 -51108 -49423 -51311 -39476
337 -39476 -28227 -25968 -25405 -26563 -36567 -26284 -13149 -22424 -27519 -30286 -39054 -33779 -31482 -33488
323 -33488 -38789 -43310 -59757 -57628 -38257 -12457 -11293 -19649 -6678 -3233 -13432 -6815 -35929
310 -35929 -38579 -38201 -47553 -53855 -59165 -48848 -42692 -41751 -41513 -44357 -44664 -68517 -62052 -66440 -65923 -51879
294 -51879 -33860 -27095 -42506 -35310 -25996 -6918 -10595 -10279 -16588 1426 -10061 -29829 -40629
$$ [...]
##END NTUPLES=NMR SPECTRUM
##END=
