##TITLE=Analysis number 313189
Compound Code cc 41604
Book Reference 433/135/6
Project Code adrs
Chemist Name victoriam
##JCAMPDX= 6.0         $$ Bruker NMR JCAMP-DX V2.0
##DATA TYPE= NMR SPECTRUM
##DATA CLASS= NTUPLES
##ORIGIN= Bruker BioSpin GmbH
##OWNER= NMR
$$ XWIN-NMR		Version 3.5
$$ Fri Aug 26 08:20:19 2005 GMT Daylight Time (UT+1h)  MAYBRIDGE\NMR@NMR_250MHZ
##.OBSERVE FREQUENCY= 250.131544655141
##.OBSERVE NUCLEUS= ^1H
##.ACQUISITION MODE= SIMULTANEOUS (DQD)
##.ACQUISITION SCHEME= undefined
##.AVERAGES= 16
##.DIGITISER RES= 18
##SPECTROMETER/DATA SYSTEM= dpx250
##.PULSE SEQUENCE= zg30
##.SOLVENT NAME= CDCl3
##.SHIFT REFERENCE= (INTERNAL, CDCl3, 0, 16.522)
##AUDIT TRAIL= $$ (NUMBER, WHEN, WHO, WHERE, WHAT)
$$ ##TITLE= Audit trail, XWIN-NMR		Version 3.5
$$ ##JCAMPDX= 5.01
$$ ##ORIGIN= Bruker BioSpin GmbH
$$ ##OWNER= NMR
$$ C:\u/data/dgb/nmr/ADRS/8670/pdata/1/auditp.txt
$$ ##AUDIT TRAIL=  $$ (NUMBER, WHEN, WHO, WHERE, WHAT)
(   1,<2005-08-26 08:19:55.85 +100>,<MAYBRIDGE\NMR>,<NMR_250MHZ>,
      <created by zg, POWCHK disabled, PULCHK disabled
       configuration hash MD5:
       62 19 C7 07 E1 42 D1 B7 37 6C 3D D0 77 39 F9 E6
       data hash MD5: 64K
       9C C0 E7 8A 5F 2B FC 9D 44 D7 B9 32 F5 23 00 FE>)
(   2,<2005-08-26 08:20:10.47 +100>,<MAYBRIDGE\NMR>,<NMR_250MHZ>,
      <Start of raw data processing
       ef LB = 0.3 FT_mod = 6 PKNL = 1 SI = 32K 
       data hash MD5: 32K
       43 57 0E FE 93 DA 82 84 21 A2 D1 B1 EE 7A 59 BF>)
(   3,<2005-08-26 08:20:12.50 +100>,<MAYBRIDGE\NMR>,<NMR_250MHZ>,
      <apk 
       data hash MD5: 32K
       67 58 F9 F4 50 69 06 BC F9 86 73 75 F7 FF F2 16>)
(   4,<2005-08-26 08:20:13.22 +100>,<MAYBRIDGE\NMR>,<NMR_250MHZ>,
      <abs ABSG = 5 
       data hash MD5: 32K
       48 D9 80 AB 7B 36 6A F9 79 36 09 D8 D3 4D E0 21>)
$$ ##END=
$$ 
$$ hash MD5
$$ 63 3E 9E 02 B7 FC FA 92 E0 DA 4F D1 A1 9E A8 3F
##$RELAX= 
##$RELAX= 
##$RELAX= 
##$RELAX= 
##$RELAX= 
##$RELAX= 
##$RELAX= 
$$ Bruker specific parameters
$$ --------------------------
##$DU= <C:\u>
##$EXPNO= 8670
##$NAME= <ADRS>
##$PROCNO= 1
##$TYPE= <nmr>
##$USER= <dgb>
##$AMP= (0..31)
100 100 100 100 100 100 100 100 100 100 100 100 100 100 100 100 100 100 
100 100 100 100 100 100 100 100 100 100 100 100 100 100 
##$AQSEQ= 0
##$AQ_mod= 3
##$AUNM= <au_zg>
##$AUTOPOS= <1 >
##$BF1= 250.13
##$BF2= 250.13
##$BF3= 250.13
##$BF4= 250.13
##$BF5= 500.13
##$BF6= 500.13
##$BF7= 500.13
##$BF8= 500.13
##$BYTORDA= 1
##$CFDGTYP= 0
##$CFRGTYP= 5
##$CHEMSTR= <none>
##$CNST= (0..31)
1 1 145 1 1 1 1 1 1 1 1 1 1 1 1 1 1 1 1 1 1 1 1 1 1 1 1 1 1 1 1 1 
##$CPDPRG= <>
##$CPDPRG1= <>
##$CPDPRG2= <>
##$CPDPRG3= <>
##$CPDPRG4= <mlev>
##$CPDPRG5= <mlev>
##$CPDPRG6= <mlev>
##$CPDPRG7= <mlev>
##$CPDPRG8= <mlev>
##$CPDPRGB= <>
##$CPDPRGT= <>
##$D= (0..31)
0 1 0 0 0 0 0 0 0 0.06 0 0 0 0 0 0 0.0002 0 0 0 0 0 0 0 0 0 0 0 0 0 0 
0 
##$DATE= 1125040795
##$DBL= (0..7)
120 120 120 120 120 120 120 120 
##$DBP= (0..7)
150 150 150 150 150 150 150 150 
##$DBP07= 0
##$DBPNAM0= <>
##$DBPNAM1= <>
$$ [...]
##$SUBNAM7= <"">
##$SUBNAM8= <"">
##$SUBNAM9= <"">
##$SW= 20.6930455092707
##$SWIBOX= (0..15)
0 0 3 0 0 0 0 0 0 0 0 0 0 0 0 0 
##$SW_h= 5175.983436853
##$TD= 65536
##$TD0= 1
##$TE= 295.16
##$TE2= 300
##$TE3= 300
##$TEG= 300
##$TL= (0..7)
0 120 120 120 120 120 120 120 
##$TP= (0..7)
150 150 150 150 150 150 150 150 
##$TP07= 0
##$TPNAME0= <>
##$TPNAME1= <>
##$TPNAME2= <>
##$TPNAME3= <>
##$TPNAME4= <>
##$TPNAME5= <>
##$TPNAME6= <>
##$TPNAME7= <>
##$TPOAL= (0..7)
0.5 0.5 0.5 0.5 0.5 0.5 0.5 0.5 
##$TPOFFS= (0..7)
0 0 0 0 0 0 0 0 
##$TUNHIN= 0
##$TUNHOUT= 0
##$TUNXOUT= 0
##$USERA1= <user>
##$USERA2= <user>
##$USERA3= <user>
##$USERA4= <user>
##$USERA5= <user>
##$V9= 5
##$VALIST= <valist>
##$VCLIST= <CCCCCCCCCCCCCCC>
##$VD= 0
##$VDLIST= <DDDDDDDDDDDDDDD>
##$VPLIST= <PPPPPPPPPPPPPPP>
##$VTLIST= <TTTTTTTTTTTTTTT>
##$WBST= 1024
##$WBSW= 4
##$XGAIN= (0..3)
0 0 0 0 
##$XL= 0
##$YL= 0
##$YMAX_a= 608051
##$YMIN_a= -319983
##$ZGOPTNS= <>
##$ZL1= 120
##$ZL2= 120
##$ZL3= 120
##$ZL4= 120
##$ABSF1= 16.522
##$ABSF2= -4.171173
##$ABSG= 5
##$ABSL= 3
##$ALPHA= 0
##$AQORDER= 0
##$ASSFAC= 0
##$ASSFACI= 0
##$ASSFACX= 0
##$ASSWID= 0
##$AUNMP= <proc_1d>
##$AZFE= 0.1
##$AZFW= 0.1
##$BCFW= 0
##$BC_mod= 0
##$BYTORDP= 0
##$COROFFS= 0
##$CY= 12.5
##$DATMOD= 1
##$DC= 0
##$DFILT= <>
##$DTYPP= 0
##$F1P= 14.0000005364418
##$F2P= -0.99999901652339
##$FCOR= 0.5
##$FTSIZE= 32768
##$FT_mod= 6
##$GAMMA= 0
##$GB= 0
##$INTBC= 1
##$INTSCL= 1
##$ISEN= 128
##$LB= 0.3
##$LEV0= 0
##$LPBIN= 0
##$MAXI= 10000
##$MC2= 0
##$MEAN= 0
##$ME_mod= 0
##$MI= 0
##$NCOEF= 0
##$NC_proc= -4
##$NLEV= 6
##$NOISF1= 0
##$NOISF2= 0
##$NSP= 0
##$NTH_PI= 0
##$NZP= 0
##$OFFSET= 16.522
##$PC= 1
##$PHC0= -76.47318
##$PHC1= 5.75038
##$PH_mod= 1
##$PKNL= yes
##$PPARMOD= 0
##$PSCAL= 4
##$PSIGN= 0
##$REVERSE= no
##$SF= 250.13
##$SI= 32768
##$SIGF1= 0
##$SIGF2= 0
##$SINO= 400
##$SIOLD= 32768
##$SREGLST= <1H.CDCl3>
##$SSB= 0
##$STSI= 32768
##$STSR= 0
##$SW_p= 5175.98343685301
##$SYMM= 0
##$S_DEV= 0
##$TDeff= 65536
##$TDoff= 0
##$TI= <Analysis number 999999
Compound Code 99
Book Reference 9
Project Code 9>
##$TILT= no
##$TM1= 0
##$TM2= 0
##$TOPLEV= 0
##$USERP1= <user>
##$USERP2= <user>
##$USERP3= <user>
##$USERP4= <user>
##$USERP5= <user>
##$WDW= 1
##$XDIM= 32768
##$YMAX_p= 438762043
##$YMIN_p= -175959
$$ End of Bruker specific parameters
$$ ---------------------------------
##NTUPLES= NMR SPECTRUM
##VAR_NAME=  FREQUENCY,     SPECTRUM/REAL,   SPECTRUM/IMAG
##SYMBOL=    X,             R,               I
##VAR_TYPE=  INDEPENDENT,   DEPENDENT,       DEPENDENT
##VAR_FORM=  AFFN,          ASDF,            ASDF
##VAR_DIM=   32768,         32768,           32768
##UNITS=     HZ,            ARBITRARY UNITS, ARBITRARY UNITS
##FACTOR=    0.157963299565203, 1,           1
##FIRST=     4132.6476996994, 0,             0
##LAST=      -1043.33573715361, 0,           0
##MIN=       -1043.33573715361, -175959,     0
##MAX=       4132.6476996994, 438762043,     0
$$ Real data points
##PAGE= N=1
##DATA TABLE= (X++(R..R)), XYDATA
32767 9389 4627 -13609 -29190 -37251 -41979 -29085 -19147 -4210 3910 -9479 -30604 -16286 -3182
32754 -3182 -3102 -14588 -9034 -14640 -21984 -35175 -39986 -46194 -31652 -40520 -47289 -32479 -19752 -13580
32740 -13580 4657 8804 32438 16760 -3724 3467 -7947 -11129 -8827 -15967 -5702 9075 5324
32727 5324 -4722 -7795 -24027 -25299 -29964 -28708 -22175 -29360 -49780 -40623 -20523 -12512 -13468 -32075
32713 -32075 -36939 -23909 -26031 -19711 -2720 8437 -4128 -8803 -22545 -33354 -45906 -57609
32701 -57609 -35820 -9329 -13596 -19888 -24245 -31221 -44475 -33794 -30991 -39218 -40852 -26058 -39958
32688 -39958 -51467 -30502 1154 2913 -9721 -13914 -10977 -1919 -9496 -16839 -3914 21506 26240
32675 26240 9724 -12428 -10638 -1880 6527 5582 14459 3383 -15451 -28323 -18999 -16251 4822
32662 4822 12950 3419 13300 10978 -1579 -13648 -30923 -51153 -38799 -22279 -8679 -16668 -20814
32649 -20814 -20664 -14161 -1728 7254 2652 -15512 -29804 -32038 -32046 -26436 -29734 -27587 -18324 -13447 -21025
32634 -21025 -27857 -33852 -37456 -33449 -16589 -21157 -32360 -34333 -60746 -69592 -52623 -36166 -29340
32621 -29340 -37125 -49561 -71368 -64227 -44338 -37560 -23986 -26046 -35623 -26831 -40731 -44629 -38062
32608 -38062 -46254 -26535 11731 35342 -3133 -16729 -35174 -39242 -18345 -20951 -22582 -45472
32596 -45472 -61705 -29131 -26248 -9404 -10025 -25988 -10007 -848 11501 19621 11708 -16553 -22146
32583 -22146 -21535 -35738 -25514 -16202 389 -2567 -14074 55 13527 -8489 4864 9497 24788
32570 24788 31307 35235 28369 21556 -8198 -22286 -29418 -44115 -53527 -59785 -70713 -41245 -30741
32557 -30741 -26242 -26612 -2212 23660 11336 -6924 -5404 -11943 -14437 1068 14407 -2646 -31353
32544 -31353 -41404 -41803 -36518 -23183 -18645 4093 9030 39743 45415 15204 -22096 -11495 -5079
32531 -5079 -15777 -27764 -27581 -29809 -12017 -6876 -32247 -41326 -15456 -15364 -30111 -36691 -51553 -46254
32517 -46254 -12311 -7467 -22335 -20390 -39698 -36448 -41742 -38213 -13072 -2848 -2716 -3751 -17658
32504 -17658 -15917 -15413 -9428 -20983 -33246 -18972 5408 12223 23278 11519 13852 -15471 -18459
32491 -18459 -23213 -9673 -1892 -19709 -44675 -40152 -21890 -2625 1598 -23860 -27075 -24006 -10791
32478 -10791 -14776 -21837 -18636 -9782 3529 13758 -3627 -15708 -17954 -6960 7305 -5839 -9214
32465 -9214 -37599 -41508 -52612 -48329 -32622 -29945 -22419 -30847 -48951 -62078 -56556 -31176 -39098
32452 -39098 -31502 4047 14282 22790 -16164 -20140 -28482 -25660 -11309 6644 18656 20870 4023
32439 4023 -9419 -48037 -47514 -32424 -18318 -10922 -12571 -6398 8366 3277 -13212 -892 9742
32426 9742 14422 -1461 -27984 -7153 -1679 16052 10359 -15047 -34840 -51558 -50683 -36850 -10945
32413 -10945 -4337 -20572 -32264 -17316 -3741 87 -9808 -5354 -7109 -26643 -31607 -41768 -41375
32400 -41375 -31285 -12373 -8980 -22308 -32785 -30064 -30632 -17203 17541 30975 45078 51450 8856
32387 8856 12710 10946 5232 8618 21136 30821 23512 14735 7377 -19401 -6912 7913 22127
32374 22127 5867 -19388 -30907 -26487 -18982 -11126 -32741 -35060 -12996 4218 -23453 -40088
32362 -40088 -32153 -31900 -10404 -30193 -44248 -29450 -13671 -26472 -54959 -64796 -50146 -27787
32350 -27787 -23930 -15792 -1177 6331 6602 17055 25277 10154 -20765 -2160 -1359 -33116 -42074
32337 -42074 -31402 -29747 -35170 -12686 -9541 12497 18365 14248 8321 4416 22268 21196 16031
32324 16031 -8562 -20287 -63401 -57528 -30071 946 18903 -1487 10946 -509 -19582 -23172
32312 -23172 -15096 -5110 11419 22146 18434 4948 -3061 -7121 3474 -6801 -18883 -3351 -11082
32299 -11082 -21457 -26502 -37422 -33592 -45616 -22526 -30388 -31173 -29010 -25389 -22670 -26631 -47122
32286 -47122 -56469 -41013 -34209 -18917 6818 16428 -8445 -25708 -29275 -29259 -13020 -25493 -48415
32273 -48415 -53717 -37181 -23588 -39690 -47750 -35508 -34382 -36336 -26097 -9424 -17774 -26729 -19574
32260 -19574 6270 -2239 -24239 -14578 -24653 -41618 -49683 -66124 -55940 -14463 -12098 -28960
32248 -28960 -15211 -17448 -20123 -5951 23956 2118 -40479 -38241 -65944 -90737 -54627 -37646
32236 -37646 -28601 -12170 -11406 -7794 -20092 -36938 -20204 -2870 3931 2520 -827 661 12228
32223 12228 3176 17454 13832 17482 -10583 -37824 -25416 -12346 -30832 -30462 -38695 -18687 -2933
32210 -2933 -14020 -51526 -63375 -24226 5480 15270 6613 -15288 -30870 -43861 -60316 -76118
32198 -76118 -66715 -31511 -4597 11361 47 -658 876 -7804 -34232 -31120 5665 9185 -6451
32185 -6451 -52158 -89594 -68592 -76173 -84030 -35239 -35290 -49353 -41056 -48109 -32786 -28668 -36219 -16353
32171 -16353 -14705 6133 15951 13909 -1240 -6110 1889 -8425 4221 -10766 -3966 3508 -21173
32158 -21173 -43048 -36811 21 8722 15071 24269 -2023 -14317 -2484 2525 -1717 -4534 8677
32145 8677 6021 14312 10299 1115 150 20984 73955 44765 -22441 -41915 -46192 -48898 -32867
32132 -32867 -39476 -35471 -25449 -26540 -31626 -52086 -21568 11954 16001 38008 35548 7118 -8403
32119 -8403 -31449 -32902 -26128 -4308 22507 59941 47141 25156 6617 2806 17927 -897
32107 -897 -21615 -53602 -44037 -45989 -45579 -18089 -5578 -34976 -53312 -45876 -24144 -2584 -12678
32094 -12678 -33338 -16347 -7208 8406 5275 -25247 -30270 -16362 -10762 -7671 -21033 -47083 -37657
32081 -37657 -34077 -30686 -15773 13016 24011 15351 41791 41684 31353 6121 -8437 -27711 -9436
32068 -9436 -8800 -4967 5896 -14713 -27362 -21197 -15728 3394 9080 16310 -2244 -25857 -6518
32055 -6518 10240 12304 1206 3981 -552 9817 -7561 -21138 -26285 -7848 12109 15236 17575
32042 17575 1751 -20501 -12231 -16496 3142 25280 17181 -23022 -16022 -14846 -28000 -40911 -39413
32029 -39413 -30070 -34745 -39672 -45403 -18410 -11973 21659 27852 9824 -12616 -20674 -22857 -57759
32016 -57759 -63062 -49536 -32437 -8834 9117 -1839 -17359 -8226 -9828 -2832 -9673 -34488 -22291
32003 -22291 -16481 -916 -11391 -21512 -9581 1735 -334 4641 5365 -420 -5656 -8252 -25063
31990 -25063 -46664 -74088 -63077 -42785 -20117 4042 -4309 -2217 -25635 -55231 -55283 -36696 -39129
31977 -39129 -38407 -42946 -20929 -2660 -620 2661 5621 8490 -3385 -21407 -39857 -44337 -40939
31964 -40939 -22029 -21003 -35828 -34737 11956 6672 29865 8073 -9860 -4690 12441 -3126
31952 -3126 -11747 -13360 -4215 8692 -8670 -4945 5319 14044 20470 23460 22670 -1848 -6074 2504
31938 2504 -15958 -24881 -20250 -1815 3900 -16911 -44353 -34925 9831 33809 18934 -14983 19541
31925 19541 48697 29345 9161 -26668 -40177 -16296 565 17391 22815 -12376 -38975 -29445
31913 -29445 -3161 11411 971 -23293 -18436 -4426 -25467 -39231 -15623 704 -1260 -11408
31901 -11408 7324 37535 61630 61787 38628 30969 26988 13185 19216 25196 21025 -10277 -23640
31888 -23640 -8738 7117 -9230 -6751 -5113 -20947 -29994 -34528 -12591 -24064 -30447 -32549 -21912
31875 -21912 -6836 24978 35703 28707 10639 17546 -24189 -29640 -37506 -30741 -13614 -10375 -7229
31862 -7229 -5459 1432 13838 -2267 -4901 3875 -11452 -25099 -14915 -37335 -57452 -53540 -61432
31849 -61432 -56847 -43999 -40415 -34470 -22815 -25933 -24018 -15795 5602 -5279 -28867 -28685 -32874
31836 -32874 -23139 -10997 -2681 -1538 -28574 -30602 -15870 -40360 -37984 -19505 -12927 -33560 -43908
31823 -43908 -25745 -14114 -11757 8910 29869 35949 17999 36576 49265 48108 -8439 -3030
31811 -3030 15785 9206 13973 10805 -6272 -26474 -32011 -17812 -28051 -26588 4520 -22665 -64086
31798 -64086 -26586 -20261 -35149 -41116 -32261 -23619 21942 19721 -1312 -19257 -32193 -42748 -13783
31785 -13783 -22600 -6539 8652 -7942 -12828 -10475 -4737 -10670 -5728 -3274 -6761 -33593 -62774
31772 -62774 -53548 -77 43079 25501 -17334 -42059 -31743 -13832 12815 17221 15380 12112
31760 12112 -4171 -11849 -26688 -7039 17166 -8435 -13040 -8920 -30704 -49313 -65438 -50256
31748 -50256 -31905 -40161 -35665 -29567 -37789 -19872 6901 1912 -4417 3734 30649 16205 3560
31735 3560 4615 11980 21426 12713 19203 15005 -10722 -3609 -4733 27047 21597 15270 4608 -6494
31721 -6494 -11925 -14162 -24256 -832 5384 -16220 -4630 10642 16093 -3368 -31217 -37242 -371
31708 -371 2558 -16198 -1818 -7558 -23399 2699 -14041 15104 -4639 -18841 -5093 2098 12493
31695 12493 32669 38607 47462 41986 -4850 -21261 -13040 -15849 -24259 -29442 -4883 580 -17160
31682 -17160 -15074 -44926 -70238 -37559 6324 7998 -422 -1268 -714 1224 -22105 -34569 -48193
31669 -48193 -56003 -54359 -65999 -45636 -20531 -5253 -14812 -14595 -13502 -23240 -19041 -25800 -4732
31656 -4732 9869 9979 10114 -8020 -28010 -38293 -48934 -70455 -47049 -14691 -26253 -57693 -25717
31643 -25717 17696 32508 13956 -21577 -38062 -38994 -35412 -58828 -27545 1988 25732 16931
31631 16931 3395 8494 -2670 -11600 11640 18499 3197 -249 -2623 -25833 -15793 -17488 -24618
31618 -24618 -29729 -7987 -8555 -21109 -13094 14436 20007 14343 21941 -7609 -26561 -17306 2460
31605 2460 -12941 -15099 2309 -3156 -12216 -12415 -12518 -32770 -42357 -37873 -17111 -2222 -4226 -9173
31591 -9173 -394 -15840 -16128 -18239 -19017 -34174 -22973 -19634 -18584 -17384 -22581 -25171 -30809 -25775
31577 -25775 -9489 -11334 -36937 -742 40867 11127 -16092 2606 8944 -20242 -43768 -28655
31565 -28655 -22425 -23804 -13741 -653 39434 39808 8434 -554 3507 17423 1258 1802 11802
31552 11802 -6652 -5733 -9539 -13226 2349 -3292 19710 50607 48487 48793 9142 7784 5419 -8572
31538 -8572 -9674 -439 -349 -20358 -25738 9664 15172 -21690 -26816 -27644 -16849 18307 14479 18760
31524 18760 6263 26153 31023 8176 -14376 -22074 -18706 -47235 -30095 -11063 -18817 -25495 -11225
31511 -11225 -10774 -10375 6913 39230 31700 -14412 -10681 -9099 -14064 7787 -3213 6273 28616
31498 28616 38395 26647 6008 -17186 -3174 10845 2294 12879 12878 7932 12554 11635 16528 35492
31484 35492 36952 13602 15249 -2736 -28116 -34561 -34164 -30973 -17060 15125 30727 6429 7063
31471 7063 17895 44235 26578 -2847 -26088 -10716 -1862 -6962 -3350 -4314 -5848 21569 38406
31458 38406 18720 -9954 -5802 6493 17120 12262 16021 15528 -6214 -6978 -7764 -35518 -50866
31445 -50866 -29418 -7012 -1772 4650 -21172 -34878 -48822 -49541 -28343 -14092 -38645 -29850 -12522
31432 -12522 6173 27035 24786 27441 13091 898 11942 -12173 -28413 -41167 -44390 -24010
31420 -24010 450 -4379 -8332 2873 24554 14539 10944 21274 14544 7098 -25972 -16738 -13096
31407 -13096 11824 41552 36707 26137 30067 30418 16529 -6810 -21631 -26704 -6420 14828 -15737
31394 -15737 -10429 22548 51342 26574 16191 696 -23208 -17490 -12731 -10024 -14848 -4010 32131
31381 32131 36457 31635 45508 55591 52111 29101 40963 41724 14177 25335 2320 -4971 9640
31368 9640 6777 5738 -5494 -1833 17976 -867 -47350 -14166 26778 42000 41302 -2713 -24622
31355 -24622 -17555 13588 4354 -1618 -10175 -32818 -37098 -37264 -5255 30406 26377 -5410 -5412 16740
31341 16740 2995 -19402 -22376 -20038 -23556 -28218 -31821 -35518 -44751 -54835 -55354 -47912 -30339 -7083
31327 -7083 -29632 -26655 -1553 2328 6263 27775 21215 14677 1904 3046 12237 16249 6848 7087
31313 7087 -5124 -15437 -22313 -18414 -15380 1917 9792 13901 -4448 -14248 -3241 -760 -25913
31300 -25913 -13302 1720 -1236 -357 -11802 -24911 -47934 -31083 -33970 -19258 -6218 -16234
31288 -16234 936 5427 -13225 7025 22589 14525 8225 -9611 -30200 -15511 -3067 -59
31276 -59 7554 22220 40443 45779 44253 57388 64537 65184 59158 40776 20146 -8600 -35031 -55540
31262 -55540 -38730 -28283 -20429 -4505 20896 24653 -6694 -19709 148 24649 16551 18289
31250 18289 11389 -2467 -4432 179 26810 11411 3598 -25615 -62066 -49596 -53269 -57149 -35605
31237 -35605 -46965 -62321 -37238 -3826 -23010 -8553 -5251 -4527 -9546 -14119 -30241 -38251 -40784
31224 -40784 -24578 -22703 -18543 -14398 -6354 -2109 21795 31767 -5571 -28975 -27063 -18278 -4638
31211 -4638 -40523 -66145 -51251 -37222 -44418 -35439 -35570 -55667 -57080 -51398 -13328 3959 12293
31198 12293 -1625 -5219 -9091 12092 41852 24268 17697 -18020 -40090 -10952 16886 15113
31186 15113 5399 11218 22491 30869 8396 -30569 -38775 -33041 -31292 -34076 -10062 -275 9400
31173 9400 17049 24333 31983 25082 4807 -1579 -15209 -16708 -9342 -1795 -14299 6844 6327 -18554
31159 -18554 -31326 -4321 18249 32777 7503 -21188 -30774 -24179 -23457 -32066 -24289 -2623 15284
31146 15284 28063 25147 20537 15677 9461 -755 2990 22895 26281 34899 6506 -12179 -9975
31133 -9975 -958 6145 22405 21984 -1671 -21044 -16279 25803 36040 41528 52447 31993 -1616
31120 -1616 -6650 -4540 -14549 -15090 3641 14524 17872 5535 6509 39557 29246 7495 -19656
31107 -19656 -4058 36979 20967 -808 -4200 -29591 -15117 10077 25454 43259 36369 22486
31095 22486 27635 -1647 -23154 -44270 -28830 -30293 -23064 -23636 -31887 -38830 -35004 -15643 -5535
31082 -5535 7085 743 -11586 -15754 -20253 -23831 -13629 -8005 -7654 -16913 -21152 -11579 6329 -298
31068 -298 195 14029 16569 19403 17160 11879 7522 -2805 -103 18662 18819 -8066 -1160 17330
31054 17330 41405 12202 -4883 -5322 -362 9673 -23402 -61450 -44554 -11485 7050 11695
31042 11695 18179 26080 2279 -3218 10496 28782 47058 30359 16622 24750 27544 17590 -6883
31029 -6883 2332 11176 41430 63494 43791 28746 2919 16128 29316 32935 12698 6067 4402
31016 4402 7034 -2266 -883 17154 12379 -23042 -38119 -31038 -22427 -18590 12888 31352 19889
31003 19889 25157 33862 16723 9759 3635 20101 10795 15565 5733 -14599 2794 7910 8919
30990 8919 -4905 -13981 -18138 -11580 -7509 -11907 -36173 -23376 3328 24136 7561 -13988 -6001
30977 -6001 7703 86 7819 21022 40295 37729 36077 56014 75862 69733 38947 17944 -5279
30964 -5279 -10569 -10245 -25715 -44541 -63463 -41475 -8294 1497 906 -4143 -17918 -13013 -24375
30951 -24375 -21183 -3105 -3674 25717 22997 4269 11250 35183 61630 60610 42658 18681 40223
30938 40223 70525 26832 -5356 -19669 -18876 -33503 -24492 -21000 -30055 -7322 -15800 -32844 -42458
30925 -42458 -17000 23773 46029 40411 24352 46033 46688 36710 17174 -15457 -4193 740 4646
30912 4646 6350 -1737 -32564 -40508 -28620 -12573 -11830 3072 12029 30493 37440 21807 -8111
30899 -8111 -35696 -57979 -57347 -33816 137 1211 13283 2166 -17056 -27213 -37879 -13733
30887 -13733 14579 19305 35676 30613 46560 33610 -6549 -1609 8731 2335 -31058 -39180 -20297
30874 -20297 4177 9909 -2917 -10174 -2148 33911 17926 -12014 2669 -13295 -32712 -34499
30862 -34499 -29733 -16302 -26072 -16693 3832 -28226 -44012 1903 4178 -28527 4151 60718
30850 60718 72346 50261 40278 2391 3458 13375 -1089 -1083 -5822 -9719 -2194 -2210 -15733 -29153
30836 -29153 -4811 -335 -448 -8502 8001 20364 6418 -6601 -17171 4002 7287 12295 29471
30823 29471 50866 33655 15860 34120 39045 21450 338 -1782 264 17459 16365 12715 12313
30810 12313 41721 64838 59881 58681 41772 41574 52162 56343 29318 4496 -40026 -42403 -33749
30797 -33749 -11757 9174 20412 22573 18559 -3306 -421 34639 41471 23975 14767 -4017 -19047
30784 -19047 -6710 15009 17112 177 -18524 -14746 -3519 -23847 -26950 -12179 -2847 1617 9129
30771 9129 7859 3673 -2299 19822 33122 32390 26101 48659 20402 1678 -2935 -29119 -38901
30758 -38901 -43227 -5675 1114 -36406 -27186 2239 23567 40778 38903 29325 -2559 -7671 -6103
30745 -6103 -19452 -5448 12906 7573 -6277 -18214 5363 -301 -5477 7456 6050 -16806 -28546
30732 -28546 -1479 8342 -18014 -31176 -2905 20482 23720 40978 34522 35535 45400 63317 34766
30719 34766 264 -26271 -16295 -17877 -21161 -7494 -12009 -35351 -31737 29463 62545 68581 40231
30706 40231 23228 25342 28234 331 -26250 -42708 -31070 -10510 -1946 -1165 19837 38701 52934
30693 52934 63042 61521 29217 5191 4008 21465 12969 170 1606 8789 -15523 11794 37494
30680 37494 41103 35254 34599 18919 6410 -6197 -8137 -30986 -14388 -10773 -18880 -15317 6279
30667 6279 7721 -6127 -1110 20027 35123 26733 16583 7630 3640 -7537 -20409 -37062 -45900
30654 -45900 -45507 -8249 -6414 -46496 -42319 -40619 -22577 5337 20818 6463 -23219 -39022 -20481
30641 -20481 8375 9689 9087 -10666 -20775 -27100 -40994 -39992 -12358 -6663 -11628 -5917 1994
30628 1994 -3621 9625 29050 39765 31044 19387 33715 32944 7739 -631 1943 1339 937 -6283
30614 -6283 -35611 -26487 7279 18938 10777 19527 12114 8273 13131 -718 6370 27095 42726
30601 42726 53203 56963 47044 19991 12649 1840 -1116 -7395 -9461 12576 8109 -1603 2995
30588 2995 11070 28065 44016 20330 11463 9567 11715 8361 -933 13435 -1125 -25600 -38008
30575 -38008 -21449 -3076 10443 20861 31470 9963 5388 6830 -2684 -12074 -23708 -17398 -12244
30562 -12244 -38825 -25714 -19519 7288 18623 -1199 -15681 -14939 -7791 133 29767 48227 54357
30549 54357 58423 56074 74182 48483 45207 8054 9038 18496 20494 29537 73322 62132 19140
30536 19140 -3149 18253 44897 33438 13760 -21865 -37033 -61412 -47917 -66041 -45033 -22233
30524 -22233 -1408 43240 17575 -9819 5277 22465 21519 33913 26280 -624 -10112 -8183 -23148
30511 -23148 -10691 13437 37562 40021 34789 5239 -7750 3229 3528 -3977 -44165 -57476 -27700
30498 -27700 -3564 -8596 -16999 -20835 -18581 13721 15218 -9013 -31626 -15249 2225 -4713 -21346
30485 -21346 -6017 1141 -20474 -31463 -35335 -19598 -20563 -27999 -8108 -16207 -27963 -3900 10851
30472 10851 -9729 -13571 -2329 -13448 -36989 2025 -9231 -26136 -10731 -1252 -9582 -26786
30460 -26786 -256 -9232 -13338 -27558 -9024 12689 36031 36229 28419 24321 -1630 -36190 -36895
30447 -36895 -56007 -62794 -27327 -15808 -33553 -20205 -26275 -28715 -26483 -4766 6013 -10898
30435 -10898 -4309 -549 -6201 -5364 -11335 -26108 -5665 5001 -12665 -42703 -53025 -41476 -32081
30422 -32081 -38682 -55236 -57650 -54004 -37476 -18564 -83 -24890 -33658 -20386 -23571 -29146 -38635
30409 -38635 -36165 -47274 -62158 -47654 -13046 31832 18908 -6129 2567 5524 1034 15130
30397 15130 27057 11699 1972 8140 46263 34444 6135 -3897 9428 31090 20781 16464
30385 16464 18396 15902 -1563 -6566 11189 38525 21264 24045 13132 3789 4336 17719 17193
30372 17193 -5232 -4205 -11447 -33426 -22165 2197 -9233 -10552 -8943 -13891 19969 29774 22129
30359 22129 20459 22096 6595 -22862 -39642 -36246 -24345 -29864 -30186 -20259 -592 11327 3755
30346 3755 -24741 -38207 -40403 -52131 -39026 -25206 -7425 13740 29030 15961 15716 -1505
30334 -1505 -26704 -2168 11514 11165 28300 20509 15539 14875 21853 3109 -11854 -11917 -8391 8535
30320 8535 -1769 -3281 11857 34455 41217 26649 9423 15777 26534 45166 17056 -12387
30308 -12387 8707 46569 61755 59153 59730 47268 131 -30388 -30906 -4078 17677 42576 53725
30295 53725 35771 45506 32900 -2027 -382 23270 3791 -12584 -1098 19441 30322 8102
30283 8102 -404 -12180 -27946 -32244 -38609 -16814 5000 22477 14576 8809 18049 15878 5030
30270 5030 9117 6754 8944 25718 22453 14400 21006 39593 52574 46803 26099 1499 -5282
30257 -5282 3639 3274 -426 -2386 -6544 -6761 -19069 -16388 19823 26446 23094 5542 6924 19426
30243 19426 8477 22949 27798 12357 18917 26782 35382 62394 50127 35698 44696 52719 38071
30230 38071 33112 39069 19836 -21785 -28646 -5223 -17283 -34729 -28831 -27497 -20283 580 10935
30217 10935 3245 14747 -5256 -13970 -27932 -27373 -8919 -30691 -17794 10025 17847 17111 17486
30204 17486 14535 12412 27023 -7886 -31015 -15685 12668 30281 37523 25474 8772 28730
30192 28730 57530 50443 18467 7096 685 -32798 -16571 -9424 -6330 -15614 -13544 -46354 -29101
30179 -29101 3642 -18123 -57927 -71317 -58475 -27416 -10909 -19524 -34738 -31824 -53060 -46672
30167 -46672 -39722 -23751 -12131 -13825 -9279 -17507 -6620 7559 -23948 -41069 -21495 -53039
30155 -53039 -46337 23069 35120 27818 7145 -6923 -10185 8188 1102 -6046 14550 22784 5278
30142 5278 -3910 14044 18738 24534 36147 3558 5034 45208 55412 19565 17062 -7793 -10737
30129 -10737 6147 6150 19157 46058 56455 32989 16078 7485 -25383 -11110 -7569 -10763 -2867
30116 -2867 1591 -24171 -28424 -12007 16696 31750 2917 -24313 -27820 -28673 -31599 -15797 -8533
30103 -8533 -24754 -15703 -1437 -4909 -30818 -26506 -2377 16629 18736 11447 3036 -1278 -3942
30090 -3942 101 24838 42634 32050 5599 10620 22705 15162 -12106 -17882 -15694 -7078 -1190
30077 -1190 10159 5711 32036 53224 44708 25174 18984 37879 32078 -1150 -8791 -4800 -13025
30064 -13025 -24951 -9647 -5809 -7307 -4734 18344 39916 28767 13111 18347 13240 18104 24914
30051 24914 -5771 -33001 -53172 -37295 -11406 -5273 -3997 13123 31663 -2748 -11202 -11660 -4443
30038 -4443 4571 -5887 -15894 -31661 -25687 -15786 -17536 -14903 -459 -3247 5747 18833 16178
30025 16178 21502 19960 14411 453 -7721 -9327 -12949 -8112 -3532 -6648 -31611 -55203 -43367
30012 -43367 -12080 -2639 -1547 2160 32308 38756 39825 27776 712 7126 18165 21727 37661
29999 37661 27975 28053 47420 56445 52053 66499 67869 53263 24753 15054 16882 9757 3690 -5693
29985 -5693 -28221 -20911 -28036 -34193 -22235 -1104 -22453 -25988 -910 -5884 -19394 -9219 14947
29972 14947 10861 12992 14812 6836 5527 -18396 -10597 -12275 -21824 -23030 -18710 -12204 -20095 -7245
29958 -7245 4558 8269 23421 3637 -3549 -2902 4835 -302 4552 3501 4796 16166 9130 11646
29944 11646 7640 -11819 -23783 5605 34367 21719 -14415 -35580 -36854 -4062 23400 15023
29932 15023 -1434 -7803 -6997 -4946 -7778 -1977 -5265 1492 -24761 -26540 -23777 -9163 -531 10204
29918 10204 8650 -3726 -8551 1207 11673 32380 31079 32427 38351 62489 52028 59208 31178
29905 31178 14923 6396 19304 32237 33810 30332 -7633 -12714 -20171 4048 -2459 -8457 6209
29892 6209 1466 3799 17109 8812 27978 27956 2960 -5960 -21496 -19388 16778 34249 31907 21616
29878 21616 33728 38179 10715 -10255 -2828 -22742 -8945 14495 19360 7779 -11648 -8756
29866 -8756 -5051 -784 -39085 -30951 -16189 -11381 -10671 -13190 -24790 -2032 26419 37208 37080 38037
29852 38037 34522 18462 20097 32349 31486 14521 16185 22632 4441 -18203 -24228 17403 36807
29839 36807 28156 8400 19298 45145 40988 21363 39489 33742 15520 857 -4214 -42048
29827 -42048 -33974 -16331 13450 7765 5816 11910 24090 1618 -3184 11305 4489 -1356 9154
29814 9154 -5323 -15682 -21706 -28274 -24833 -23626 -20017 -26914 -33441 -18404 -9277 -21559 -9750
29801 -9750 8034 20229 14444 11519 5384 11987 7984 20096 19111 30018 45104 24731 19293
29788 19293 18335 9515 21347 13674 1832 19274 31644 4663 16457 35847 38127 40570 10656
29775 10656 -5090 -2286 -17358 -33330 -26615 -6919 -27258 -43934 -26704 -11502 -13008 -15269
29763 -15269 -20958 438 14632 6094 21382 21273 4843 7441 -7000 -10005 22174 35982 41456
29750 41456 18988 11607 12584 34903 38953 24483 21296 21420 16230 2201 12167 39665 14988
29737 14988 -118 8042 4295 -20160 -31701 -40852 -25426 15940 33702 26816 4207 -12345
29725 -12345 -36566 -12303 13492 27626 25835 4184 -4055 -17180 -11074 19853 39433 26343
29713 26343 23445 59312 36660 13164 -2540 7661 28245 22719 13521 -6056 178 12767
29701 12767 35601 43114 20444 -1031 -8098 -23251 -30470 -48994 -39860 710 17404 2285
29689 2285 -9874 -27450 -31428 -25957 -25306 -27764 -18263 -23299 -10222 7232 37185 37675 29473 -903
29675 -903 -7008 -5979 -11904 5537 -569 17399 35921 44354 21199 -3347 -22371 6410 27372
29662 27372 38599 51049 67857 49176 16193 15433 16387 16911 46881 45739 4482 -25194 -43244
29649 -43244 -44831 -40188 -16894 -9857 19534 42437 18639 -6977 26376 28482 14132 14972 15247
29636 15247 19911 22571 -20561 -31134 -23512 -5746 -54 -11363 6807 19799 -9101 -12735 29151
29623 29151 34596 7818 -14378 -29585 -17082 7421 -10902 -24942 -10459 7670 4438 13667
29611 13667 19505 -9481 -4926 8290 -8878 -7818 19184 22302 30054 35601 21984 21510 40324
29598 40324 62166 27378 51807 51279 8791 -32478 -26911 -5433 -19478 -24734 -32893 -2855 33401
29585 33401 39595 42336 47331 19646 17216 22079 26203 14877 -16206 5580 39444 26643 -2687
29572 -2687 -1336 2516 24292 45871 67493 55387 38347 622 -20110 -14830 -26109 -15029
29560 -15029 -13162 1915 11384 8259 7159 22852 27405 20725 24458 13019 24849 4775 -5339
29547 -5339 -6853 13342 20612 3839 -4076 -7117 -3556 -6741 -33057 -38951 -19792 -1206 -2280
29534 -2280 -14255 -16867 9821 16229 1400 -10233 -7591 -32789 -35950 -16110 1390 18860 25720
29521 25720 3910 -7783 12678 17861 10318 -22278 -32509 -31119 -51959 -48184 -38884 -26503 -23403
29508 -23403 -15677 -32069 -24984 8287 6870 18818 13671 -11411 -5211 26570 32381 8857 -24191
29495 -24191 -43341 -63220 -37024 -16897 -1675 -7896 -15470 -6625 -7679 -22330 -35005 -33269 -32230
29482 -32230 8017 33385 12594 386 -8184 7018 58648 74602 63498 39292 48007 59012
29470 59012 41786 31552 22560 24027 23057 14811 17419 19862 7962 11507 6252 7458 30510 20024
29456 20024 -9788 -31211 -6273 9008 -4152 -2754 9543 28937 46480 25136 6948 -3725
29444 -3725 3165 -34580 -36253 -17369 5607 18539 20512 14242 11790 8991 -15089 4772 30083
29431 30083 25376 5924 9003 16525 21346 -14113 -28248 -24145 -17820 -13722 1564 23609 15721
29418 15721 -2369 -19606 5148 25241 30790 34636 20206 -514 -22856 -16839 5811 7342
29406 7342 -7749 -27155 -37369 -44454 -25450 4743 14116 18852 8926 -2940 -10041 -17631 -25220
29393 -25220 -17065 -11395 1358 34203 57956 69167 42518 18084 -8012 -18741 -31964 -12710
29381 -12710 29010 41488 42860 31784 3323 2525 1158 -16782 -33656 -28663 -18072 -22736 -23503
29368 -23503 -7204 2390 -7884 -5278 -15199 -6968 -7329 -32200 -53293 -36333 -23871 -8760 -17119
29355 -17119 -39656 -55759 -38997 -16715 -18734 -10943 -763 4983 -15734 -31421 -15653 -4715
29343 -4715 -2619 -6746 3597 2929 15785 14888 -13516 -32693 -17329 -53157 -49268 1397 26955
29330 26955 14998 -17071 -3492 -9270 -4202 -1203 2535 -5185 -2429 -6831 13791 19826 31858
29317 31858 28638 14027 2711 6803 -1881 -19516 -33499 -40302 -20076 705 28175 39867
29305 39867 22474 16633 16805 -240 39211 85381 62125 29010 2321 -6487 -7903 -7118 -3632
29292 -3632 -7091 -6082 5790 -1250 -25008 -32403 -14162 17982 4636 -21679 -7512 12991 20201
29279 20201 15018 21862 25181 16479 7703 -20109 -5724 11422 22439 36988 24457 13952 -1563
29266 -1563 2702 21668 38923 35929 25639 32329 44662 6836 -17003 -35347 -32352 -21409 -1316
29253 -1316 28092 35372 32809 12731 16109 32383 39555 30894 13604 20790 44833 31552 17191
29240 17191 12081 14208 26283 16070 28309 -11786 15659 22718 19194 13526 -23475 -26419 16984
29227 16984 37468 16768 2584 14439 -2459 -27402 -21119 -4224 28275 31565 22586 -2238
29215 -2238 -4403 -1790 24678 37087 9666 -21440 -56688 -60101 -45739 -46957 -34696 -33712 -57246
29202 -57246 -36950 -9896 -228 -35536 -43798 -37965 -25242 -3889 8691 25115 42921 13536
29190 13536 -12643 -12143 7564 46550 43997 -10194 -11928 21619 22236 600 -28554 -43901 -24520
29177 -24520 3755 2270 -13034 -16425 6797 34531 40570 38126 24630 4014 12929 11711 -26468
29164 -26468 -35805 -25352 -6931 -26802 -42188 -42001 -37689 -27950 -12363 -243 992 8269 18398
29151 18398 4823 -2547 21583 33230 37311 48429 39767 47182 57187 50530 35593 15544 14039
29138 14039 22769 31809 40420 41930 24889 7525 14136 14094 -4590 -27922 -23655 -14859 18445 27478
29124 27478 10291 21559 29700 -7820 -29589 -17252 -2 15887 17387 -2950 -12368 -17505
29112 -17505 -1956 -2009 -26377 -35519 -25005 -5810 6391 9736 25768 23581 -2740 -6130 -18225
29099 -18225 -31728 -12835 -2598 14045 5877 7934 8137 5199 5594 -526 3545 19471 31885
29086 31885 23413 -1131 4843 -10155 5759 23571 -5841 6824 -717 1990 -7969 -30892 -33597
29073 -33597 -17626 998 29968 41884 22419 10074 35525 48710 42395 38274 1054 3826
29061 3826 17414 49468 64927 63245 55757 63962 64336 31538 -15900 -15567 22775 27890 24627 27159
29047 27159 18672 5430 19700 24957 25287 43398 35453 891 -19113 -18526 -10447 8809 19558
29034 19558 35109 45043 46697 47656 32761 15508 8552 12298 -5132 -19868 -17432 -14175 -8110
29021 -8110 -10438 101 26610 4648 -4476 18010 16000 -44 3846 16194 15419 1404 10995
29008 10995 5372 13504 35936 46579 64117 58488 24888 7852 9909 29620 37519 42904 35223
28995 35223 -17812 -31781 -2068 5424 -28303 -56477 -51394 -41224 -54100 -46563 -2924 4493
28983 4493 -21556 -17253 -5451 6621 25170 35162 50532 50575 34748 11739 20006 10634 -3275
28970 -3275 -15222 2861 9120 13528 15292 705 13061 19800 16729 36962 2765 -11531 -9876
28957 -9876 2 139 -2311 -8863 -15040 -9380 -2925 -2838 6529 7874 -1813 3188 -6282 -14883 1275
28942 1275 5708 -8789 -38120 -25968 -12575 -11255 -16628 -8311 2312 7145 -7905 -9833 -22338
28929 -22338 3035 27754 23814 33194 16750 21446 40726 22471 31379 13280 -14393 -15102 -32496
28916 -32496 -47597 -33089 -7044 18722 27205 21546 -3218 -14144 -14556 -6934 -908 8726 9004
28903 9004 11127 637 -35636 -28853 -17108 -41894 -53949 -12602 33017 34981 29096 28085 -1333
28890 -1333 -12176 -12009 -19660 -798 11175 2251 -17462 -35545 -37325 -27870 -7973 5818 8084
28877 8084 4934 9332 6911 5065 11966 12283 6552 4076 -12546 -29613 11051 31827 23366 12358
28863 12358 12921 4553 23099 16288 -628 8085 27726 47503 51265 50501 27814 5289 19832
28850 19832 26809 14529 12266 14521 27749 12514 -12158 -12255 -14538 -11886 -559 20059 20302 6314
28836 6314 -4731 -24882 -48062 -30500 -4407 11417 18814 15574 31636 25699 20180 31272 4231
28823 4231 -28707 -30462 -4174 17829 14935 3927 -14198 1969 15050 40295 23611 4294
28811 4294 -9485 9495 8600 -16530 -32550 -12816 1742 -19524 -27480 -5485 8167 -18815
28799 -18815 -24558 -32847 -31086 -7466 -9880 -56125 -63272 -41184 -23802 -12280 7581 9790 29639
28786 29639 12126 7950 19008 10037 8012 775 13447 8205 19419 8948 -1616 -14355 -29753
28773 -29753 -12183 -12940 379 -28193 -37057 -32409 -9913 -29231 -17939 -37630 -48784 -37902
28761 -37902 -23328 9546 41500 35087 -110 5760 10059 6107 3629 -16467 -28805 -1618 4340
28748 4340 -5559 -31537 -5149 -2016 2398 -13980 -11653 16695 36257 32490 21629 6911 -5134
28735 -5134 478 -2720 28045 43759 44707 55598 70640 34738 32897 22277 5083 -4649 -7212
28722 -7212 7705 7681 15235 34192 36900 43743 13072 1830 12896 24005 35040 31636 -11261
28709 -11261 -22479 -6971 -17796 -3982 -5733 -15042 -18347 -17171 14597 17006 5427 7038 10452
28696 10452 -17227 -36680 -35359 -4309 8369 27710 39959 39606 56345 54403 53493 39410 37839
28683 37839 45437 36532 11949 36526 35165 20344 14749 -10597 -41039 -36380 -24290 -16920 12633
28670 12633 33026 45143 42072 15820 -4408 -18627 -7187 -36463 -26177 -13095 -7570 -7121
28658 -7121 6150 14855 3384 -20581 -13499 -16617 -28203 -16108 -19425 -20079 -22593 5307 16892
28645 16892 28076 29413 30026 19641 37973 38037 14593 -9809 1544 29422 47884 68720 52578
28632 52578 41441 53526 31623 -3793 -20794 9833 27026 21462 23905 29927 42793 22951
28620 22951 -3050 -18790 -20320 -12848 -12426 -4627 8262 6636 5226 -5839 -5984 -23859 -15300 -1119
28606 -1119 -19690 -14943 -30033 -47276 -35902 -19625 4240 -2442 -10865 514 9069 5140 19083
28593 19083 24691 36963 40334 30516 -2455 -10981 -16227 -19647 -17894 15825 32127 2740 -22650
28580 -22650 -24270 -18664 6704 -19087 -38479 -21524 -28359 -25633 -3376 1696 -7502 -12422 -16206
28567 -16206 -24584 -20031 -12881 -20017 -28981 -23725 -23083 -6604 -18356 -47668 -40095 -9278 -8904 -5892
28553 -5892 3557 15174 24119 10709 -9758 4856 12896 10795 9817 4828 -4315 -26162 -17890 -7938
28539 -7938 3442 18796 21994 9906 -10068 -1511 -7126 -1514 1637 -13151 -26914 -27660 -22099
28526 -22099 -21430 -13169 -6595 -14947 1610 30944 56913 44377 32485 40431 40389 7223 -9565
28513 -9565 -4345 -1605 -20435 -10681 7769 24220 4612 8134 16476 33986 51695 11698 -4682
28500 -4682 13778 -6471 -6546 14541 10166 3852 165 3410 10471 1610 -7801 -7740 10990 1252 -18003
28485 -18003 -16746 14641 34727 17262 26486 4162 -17400 -23538 -18837 1219 5735 -4888 17035
28472 17035 18873 21912 24098 28554 36579 1171 -32054 -9113 9148 15983 10293 3463 -3144
28459 -3144 7270 3812 13760 5687 -29679 -41489 -40001 -34028 -18709 -1454 -6965 -14135 -18031
28446 -18031 -18288 -26832 -37458 -17161 -4023 18085 23290 18928 18220 55612 45908 33279 15455
28433 15455 3908 7992 2002 -7239 2232 14969 23252 19026 18925 14406 18249 -2241 1351 15162
28419 15162 25932 12698 31518 47392 24219 12887 24346 31270 32505 4347 -31167 -34426
28407 -34426 -26231 -16170 2110 20457 13756 1170 -2875 -8346 -830 -1296 -6959 -28399 -18053
28394 -18053 9109 1106 -1791 11599 11157 431 757 22176 -1273 -20559 -6256 12435 220
28381 220 -7511 147 -4886 5661 23026 10836 15539 23116 10191 9242 18304 20865 29257 7017
28367 7017 3385 17291 27456 9011 5759 5569 10954 -2034 11250 49279 43681 25570 -10391
28354 -10391 -18075 -19839 -4977 -23943 -45197 -49149 -26736 -32384 -46211 -39327 -17263 -9419 4724
28341 4724 -13907 -326 35974 51541 15367 8034 1897 -7727 7602 14861 18035 13448 -106
28328 -106 -1 3006 44114 42287 761 2572 21890 30366 12209 13335 11760 42387 33191 22009
28314 22009 20623 49255 45219 28127 7082 1997 -3378 12914 6648 2445 -25520 -24518 -1334
28301 -1334 -3095 -3963 -7012 -8293 3016 -6321 -10980 20586 23748 -740 -21968 -36153 -29618 -21627
28287 -21627 -11890 -2781 -27003 -29970 -9132 8044 11045 29045 28335 -15761 -31630 -33698 -22250
28274 -22250 183 -11235 -18050 6375 23192 38200 32064 7678 -18379 -10103 14973 24575
28262 24575 23391 31688 43129 25652 23835 23290 15441 -11226 -7671 20908 34805 34025 43048 51307
28248 51307 29955 22056 17683 16592 25848 20593 14294 1658 -20570 -31119 244 -6626 -21535
28235 -21535 -15810 -38054 -33917 -25075 3408 8627 8261 3892 18008 58109 60975 57103 64187 48914
28221 48914 39417 22847 -5111 -12105 4478 -3815 2276 -9604 -35612 -14895 14128 6908 3099
28208 3099 22481 14912 -2278 -7848 219 19348 22024 10545 12457 -10405 24178 23841 -13102
28195 -13102 -929 -5087 -6135 10508 25151 24823 29884 24147 11555 -8467 -18680 -23028 -39088
28182 -39088 -5630 11192 34241 20453 1175 -36440 -49093 -39316 -43954 -53231 -52587 -30693 -17073
28169 -17073 -1138 -4761 -11146 -4397 8584 14481 14068 4976 2145 -8130 -27685 -35826 -50084
28156 -50084 -49618 -50902 -48328 -18186 -19571 -33288 -31182 -20373 -26744 -7104 4436 -19276 -28228
28143 -28228 -27679 -10249 11396 2705 -15398 -7709 559 -10564 -4964 10500 27244 24419 4758
28130 4758 8960 2214 -347 -6885 21544 37961 26734 20447 31103 46295 28916 5516 -6826
28117 -6826 -2163 -14760 1058 -1670 15303 10611 -310 17556 458 16013 -11389 -21416
28105 -21416 -267 34677 35787 21307 14532 13135 29862 27420 3997 -14466 -7852 -4005 -8004
28092 -8004 -21009 -33322 -50988 -41329 -36350 -53490 -58665 -49916 -26406 -36486 -21768 -18111 -18666
28079 -18666 -22719 -21893 -6927 9453 10008 25005 34761 22395 10091 8870 12392 10978 20124 25314
28065 25314 22368 18948 36873 35000 30043 9572 -17900 -31226 -28539 -9401 37698 77096 61235
28052 61235 20889 -11844 -20510 -7433 -18658 -36174 -49122 -23683 -27351 -7892 -7418 -26594
28040 -26594 -14028 4209 -1298 -11099 -28930 -25284 -1380 -17603 -27939 -4640 11161 540
28028 540 532 21191 30115 26448 777 -19224 -19814 -23999 -23852 -9488 -17964 -8478 5024 -6168 -3597
28013 -3597 -13391 -12860 12163 10557 -2375 -11346 -9902 15428 856 -1197 -6537 1464 -2266 -19495
27999 -19495 -29543 -25936 -38396 -14809 -3281 -28655 -29760 -32318 -8268 7426 -10130 -4005
27987 -4005 -10592 -938 4355 -14200 -4649 5133 -6943 -14141 -15698 -6916 -26529 -35052 -10010 6824
27973 6824 -9572 -30481 -62676 -83624 -71075 -19117 -921 4612 -4074 -14300 -4600 24280
27961 24280 48706 43806 26490 13959 668 -5450 -26618 -29664 -33651 -16647 -248 16436
27949 16436 26751 -2701 -16625 -14867 8895 42289 61966 35869 20558 16980 19117 18317 27849
27936 27849 19574 21291 16120 5701 35812 32424 22723 -4034 -23936 -5124 15149 10198 -3954
27923 -3954 -11329 -47957 -51637 -25526 -9428 -11630 507 30122 8899 15459 19092 24932 27266
27910 27266 7321 -5503 -27393 -30291 -12488 23444 53250 56210 42144 45643 50983 61134
27898 61134 38880 -11154 -4316 17411 -9907 -28224 -17059 21145 22978 9399 -11529 -42381
27886 -42381 -6224 21870 34526 35397 15285 2700 -13864 -32027 -37912 -34599 -24164 -7152
27874 -7152 -8837 -18382 -9905 -2773 -2034 -13089 -33456 -40894 -25126 -6358 2118 -8113 -2613 -13405
27860 -13405 -15938 -20690 -33169 -35514 -23145 -21569 -24270 -29726 -64194 -83898 -54401 -63223 -87078
27847 -87078 -68720 -40286 -18803 -15897 -410 21355 -12623 -35295 -43757 -63782 -48228 -38375
27835 -38375 -44363 -44648 -8122 15933 20745 8329 15028 11738 21808 26151 16462 29786 17545
27822 17545 24364 41769 27512 3371 32804 22044 -7615 -11152 15 11086 25688 18420
27810 18420 4876 6930 13361 26706 29186 25671 12875 -15253 -8177 21118 11394 13969 17164
27797 17164 18631 24343 28276 21150 4548 24985 36181 41821 32608 41762 37904 25523 18484
27784 18484 13591 -4135 -11012 -22675 -35673 -17515 -6693 10961 2456 5454 -12307 -17868 -2326
27771 -2326 10464 -3720 -3912 3876 -5532 -9309 -8825 -18654 4176 26175 22484 10974 -3798 -12920
27757 -12920 -14021 -17540 -4507 -16749 3189 847 -6107 -16838 -26164 -15685 -23231 -34541 -42516
27744 -42516 -35864 -18280 4239 -12349 -17377 4466 15186 25043 14577 13426 -7202 -41290
27732 -41290 -20336 -27896 -33495 -35269 -13495 15095 7813 -15074 -17433 13238 20326 20284 20092 -83
27718 -83 -17361 -10510 -11658 -9044 -4093 30803 42484 14430 -11864 -35224 -30380 -57589 -37389
27705 -37389 -26881 -28567 -7215 24764 5503 -14936 -15283 -3571 2482 3906 -12108 -15213 -4610
27692 -4610 -9790 -20490 -20489 -4906 -146 10639 -4010 -45910 -31500 -3131 -11876 4745 -12881
27679 -12881 -34312 -27119 -36762 -44111 -29071 -11778 11026 12734 19486 43081 46057 27043 31873
27666 31873 4251 -10438 4411 16831 25284 22763 17527 -14740 -21560 -4537 24204 55026
27654 55026 31391 3628 20717 25468 37146 42160 38075 25905 37569 59887 54303 27696
27642 27696 41364 28624 12032 12270 16124 9389 6429 5940 -12544 -7228 -2468 22967 51196
27629 51196 30635 22828 18593 9615 9031 11902 -1406 -2364 -1240 8482 10412 8865 3958 -10984
27615 -10984 -4713 16507 33273 918 -5269 3950 -13007 -37999 -33942 -5852 3520 25608 30957
27602 30957 13519 19080 25773 49277 38701 13377 666 12713 23922 21502 9380 -9031
27590 -9031 174 -27918 -30016 -29043 -19660 -5069 -13823 -17424 4182 -8687 -66723 -91199 -88457
27577 -88457 -65899 -34094 -23845 -10966 -19890 -14683 -4064 3522 15895 18244 18524 9554 -22439
27564 -22439 -20476 -12609 12346 35132 30890 80 -10358 2627 -9291 -38512 -52673 -33181
27552 -33181 -25183 -9278 3979 -9247 -44389 -55607 -31390 -8596 12818 25216 7210 101
27540 101 9171 1876 -3496 11028 3317 6801 33769 32604 29067 -7663 -14498 -20763 -40630 -48171
27526 -48171 -40729 -39488 -9553 -3733 607 -2910 -12857 -14206 -11625 -10518 9352 16337 -14184 -33620
27512 -33620 -26868 -11144 -16743 -7606 -20016 -28050 -26964 -27354 -31042 -20985 -11036 -23018 -38726
27499 -38726 -19813 -3666 15638 20491 14832 24703 -721 -19333 6178 33521 24761 6447
27487 6447 19143 2873 -14086 -11387 3707 -8165 -27408 -11362 -10067 2980 15211 14616 12343
27474 12343 24164 29858 -3354 -21706 -17770 -20863 -782 2267 -22633 -22159 1554 2386 11633
27461 11633 -8240 -2897 7205 14589 3294 20839 30686 17603 -10942 -10782 12878 10732 17115
27448 17115 22567 19204 13448 19408 15680 10313 -5522 -29470 -22011 12103 19897 22585 7112
27435 7112 -10225 -5994 8135 -5876 11663 30314 22469 22524 33275 40636 27366 20380 30233
27422 30233 46953 49024 16078 21281 10619 7469 5071 15451 15870 7648 12064 32758 20399
27409 20399 9790 5312 -11553 -23564 -25411 3529 10981 27949 23358 18902 15453 17895 29324
27396 29324 43777 42025 19673 -5880 -8648 -2638 8603 29601 30236 22805 33782 46549 52873
27383 52873 19860 -11674 -12649 -11186 -25924 -16986 778 14006 -7106 -19627 -19486 -7453 -18547
27370 -18547 -17080 -2228 -2287 -13115 -20445 -5953 9846 22067 18844 11392 -9650 -35064 -20863
27357 -20863 -17513 973 -2245 -26822 -48878 -54564 -49814 -28636 -31714 -13252 -1358 -12532 -12914
27344 -12914 10201 39912 24660 24883 15841 8402 207 -8071 -33794 -40966 -8590 6125 10106
27331 10106 5412 -6644 6503 11263 -2007 -14524 -24940 -26811 -7078 -7 30607 22878 10387
27318 10387 18109 31773 30892 25161 28537 19734 18757 -265 -10498 3646 -4387 -12014 -5416 -11736
27304 -11736 -14028 -44585 -61751 -38272 -15842 -5029 -8329 -24358 -57052 -64451 -10272 20845
27292 20845 63048 50374 39152 23538 8610 -8146 -5035 -8111 11500 16415 15309 23615 30975
27279 30975 27071 11190 -12305 -24219 -14692 -25505 -33604 -2587 17314 24612 48290 65557
27267 65557 44671 31935 44749 49534 25434 7290 8749 9857 9490 9669 26901 57334 58387
27254 58387 29765 3534 -15667 -10909 -3380 3701 9212 28390 6047 -6426 5530 15258 13258
27241 13258 17170 48146 32486 192 -2036 9263 12326 31863 56415 44792 34483 12896
27229 12896 -3409 -12412 157 6802 13491 11037 8509 11267 -14123 -27574 -25440 -42012 -58639
27216 -58639 -61477 -27511 724 11597 4536 17409 -2546 3517 33630 12254 -29402 -60129
27204 -60129 -62197 -13039 -2724 -13897 6277 5557 -13442 -28455 -5765 38449 33587 10471
27192 10471 -4081 -11332 1381 11057 13995 -3165 -27829 -40717 -41443 -19738 -17256 -9731 -6799
27179 -6799 16720 33423 39385 10057 -19992 -3980 26215 32867 2882 -6155 -13627 -12322 7643
27166 7643 14189 13833 19840 41778 56650 58455 51798 45976 21175 15928 17486 21240 30129 36240
27152 36240 4970 -4867 8618 24000 38855 43501 13822 3207 -25144 -2872 38107 50011
27140 50011 32031 39249 16270 -17372 -39249 -31421 -6499 1096 1470 3541 34377 35004 23492
27127 23492 -11406 -41773 -38952 -12882 5476 -5305 7897 28575 30827 14891 9444 -2969
27115 -2969 -1237 2238 -9109 -23809 -33873 -24545 -5783 8992 -22232 -11284 1959 14809
27103 14809 23960 46881 37356 5475 11532 20674 15967 4999 5483 19063 34253 60245 52050
27090 52050 27552 23502 10949 18846 19343 3955 -3594 9447 19788 7150 5957 2832 -9443
27077 -9443 -29934 -18441 -20801 -5898 15493 5660 -19040 -24380 -14766 -6480 10890 21957 60364
27064 60364 60571 28013 12228 11943 7326 1679 -8143 -8292 -3062 68 22066 5402 21407 27880
27050 27880 7495 825 17199 11472 16871 34474 30409 -1975 -34214 -23509 13742 12994 4460
27037 4460 5004 47825 50796 56365 61062 51455 31449 24814 36659 51282 20542 29417 38610 15415
27023 15415 -11408 -16932 217 342 1141 1312 13526 21084 41787 65069 56350 33434 23995 31881
27009 31881 41442 47263 -7815 -44107 -31986 -6418 -9567 519 2358 7576 18540 -3613 -18773
26996 -18773 -4894 -35016 -32896 -8009 18082 30720 20638 -18168 -19627 -9278 -11369 3668
26984 3668 17580 29869 10800 21104 5568 20459 34438 7872 -11318 15627 17823 10844
26972 10844 9957 -5542 1761 -2349 -6518 -16794 7 24067 19582 4029 -13955 -24990 -22516
26959 -22516 16257 31597 15959 -5516 -13260 -14471 -20589 -1946 -1501 7990 -11537 -48902 -67664
26946 -67664 -50308 -62158 -71012 -92157 -70670 -53868 -56110 -35273 -32977 -25465 -25814 -13728 -1022
26933 -1022 -7971 -7049 -23311 -14641 -22795 -24114 -10074 22770 -2345 -26558 -16642 14095 -13739
26920 -13739 -32191 -43760 -22543 -20193 -42232 -30867 -15399 4547 38554 21473 -7945 -36263
26908 -36263 -15925 7273 21343 44899 64227 18340 -6072 -19110 -16289 -980 -7236 -15506
26896 -15506 -22104 -29527 -36683 -28530 -12617 -23699 -12813 -9091 -5988 24525 25731 10527 -23839
26883 -23839 -28876 21419 15062 3899 -10825 -20206 -6781 -4017 -22657 -24174 -35714 -27430 -29754
26870 -29754 -32347 -17817 20917 15279 18129 -17474 -38789 -69739 -72739 -53945 -19535 15293
26858 15293 17872 -18563 -24084 -7116 -8617 -3785 -31741 -40112 -59133 -56546 -34325 -8613 2653
26845 2653 -1959 437 9948 -5938 1979 23757 -6342 -51629 -74928 -65402 -47336 -64598 -67141
26832 -67141 -41278 -38316 -41319 -33050 -8934 -12811 -29368 -10575 23119 37848 26569 24734 34914
26819 34914 7514 -10072 7765 14943 18440 19470 -5977 -18493 -1832 -6189 -19433 -12973 -6278
26806 -6278 -21296 -23421 -12703 -14228 -13101 -4022 2740 9247 -16245 -16029 -6703 -17047 -15265 -27852
26792 -27852 -31040 -26074 -21742 -24030 -26309 -27410 -3744 1778 2964 10528 2138 14053 6072 9498
26778 9498 -6200 2246 21428 -2071 -37786 -38349 -40237 -53488 -51040 -45185 -13774 13073 2565
26765 2565 -8715 -16095 -24606 -22091 -3739 -20116 -25244 -779 15981 21723 18258 -321 14111
26752 14111 16084 18319 47044 60000 34037 29570 39914 25518 20402 19742 24884 28310 54577
26739 54577 44470 12260 2810 5157 -21635 -35520 -7025 22168 17582 23176 23443 11014 18585
26726 18585 1046 -11572 27140 38175 12886 16499 -31212 -64747 -27391 -25141 -28142 -28261 -22616
26713 -22616 -10615 -5995 -2051 1481 -11773 -21377 -17091 -27898 -24015 -11569 -7101 -8044 -15345 -17866
26699 -17866 -9456 8018 -31063 -23122 6393 19325 7085 8579 9392 17161 35723 24323 8279
26686 8279 13592 -1639 19683 21040 37758 43785 15033 6216 12140 23081 18929 10711 11376 28068
26672 28068 49185 45416 29198 36505 54717 41555 32473 24725 26798 28286 23044 15064 24146
26659 24146 28365 62364 61607 26050 14714 26478 41062 32815 -13768 -146 11654 -15948
26647 -15948 -11222 -2545 7608 11588 47664 66287 44267 39710 38387 30585 37064 36668 54127
26634 54127 45686 30150 8313 -15256 -21061 -13836 -456 -13803 -3552 8059 494 -5844 -21268
26621 -21268 -713 26465 43608 68158 42617 14319 14760 2776 -218 1404 -14846 -37932
26609 -37932 -49867 -44704 -42433 -45802 -45210 -46303 -16490 10986 15326 -25881 -66905 -67306 -41962
26596 -41962 -40853 -16157 -5366 1061 -5901 3512 -12393 -42709 -26856 -13500 -6102 9514 13773
26583 13773 -4517 -14597 -23072 -40701 -59077 -51410 -42044 -37400 -20023 -11207 19620 28540 33574
26570 33574 9453 9881 9418 3080 24549 5323 -9785 -19843 -22413 -28259 6988 29035 16103
26557 16103 14715 -6020 -14861 -4382 6470 13710 25938 24009 15488 7535 -20799 -26584 -15442
26544 -15442 -25114 -18820 -15620 -16187 -8187 4918 1561 -9129 15113 6777 1975 13969 6731 -10039
26530 -10039 -21861 -13408 -19671 -28026 -25219 2717 42684 50241 66934 35643 20918 29013 7997
26517 7997 2281 -3795 -8858 -23253 -36597 -23277 -15198 -10156 2410 1895 -22089 -57175 -48817
26504 -48817 -35966 -16864 4943 -2253 -28554 -44045 -58991 -58270 -60284 -60141 -53780 -24742 -11946
26491 -11946 -3172 998 -9725 8641 34297 18229 5522 15866 26510 12306 26415 69061
26479 69061 39989 13514 -12811 -8792 5946 42511 45679 22431 24760 29690 29740 42540 44881
26466 44881 29669 11847 12438 30494 14651 -21748 -9336 17617 36087 11323 -16280 -5748
26454 -5748 4750 -6600 -31935 -18389 -21886 -44522 -58118 -59062 -40633 -33157 -20382 23008 36611
26441 36611 26595 -2472 13107 10130 -6421 -4564 3647 -4290 -9329 9615 15856 7058 -20959
26428 -20959 -23323 -24996 -33933 -30466 -13986 -7214 8761 18547 35326 3188 -5278 38979 38703
26415 38703 21703 17177 28352 19003 -6722 -6841 5762 49351 37984 28325 31463 48052 36153
26402 36153 27305 28831 -1247 -16067 -13890 13781 39026 39821 9707 -19780 -47134 -15525 10380
26389 10380 -9975 -14075 -30398 -19776 -19743 -8563 -23685 -8701 11317 24236 -2758 -5302 -3653
26376 -3653 -28733 -19319 -25901 -45196 -37705 -17924 -17516 -14532 -7869 -9216 -21100 -27378 -52368 -54007
26362 -54007 -41942 -25204 -21384 -2467 -3518 11332 18179 28533 24758 31104 42442 57045 44078
26349 44078 12053 -3130 -9835 8931 6165 682 24428 -25300 -40460 -33544 -30627 -22593 -13719
26336 -13719 -24606 -44831 -33515 -7449 -4771 -32883 -66814 -41606 -6160 -10228 -30298 -37576
26324 -37576 -43935 -28449 -15756 -22663 -6772 8078 10211 -33435 -49160 -37386 -28129 -31861 -31170
26311 -31170 -25982 -26237 -29761 -36512 -31449 -29221 -15409 -8133 -39636 -19610 -5357 -22023 -32023
26298 -32023 -45759 -19779 6867 12292 9740 -8662 285 15986 20449 20890 27480 28997 8319
26285 8319 11759 17095 13251 12162 279 10683 1766 -13514 6358 4767 -15999 -44878 -55817
26272 -55817 -41018 -23130 -33809 -48215 -58457 -56527 -39699 -12446 12783 21689 9877 1471
26260 1471 10193 5638 -9797 -23176 -10853 14987 13661 16643 10635 18876 18425 18021 2951 -29442
26246 -29442 -46656 -52933 -38948 -23876 -8424 3118 -309 -4718 -16070 -36248 -34622 -45150
26234 -45150 -42746 -44367 -56913 -74699 -67028 -35546 -5172 -17052 -26287 -28872 -12950 2980 2738
26221 2738 -6649 13091 6264 6805 -15644 -14237 -4858 -3844 17777 30309 23905 44495 40673 6549
26207 6549 -7584 -23919 -30005 -27409 -12262 -9364 -11625 14867 24336 14855 12831 21523 3893
26194 3893 -25210 1781 25396 6687 -16355 -8066 8027 27958 30043 1898 10254 37333
26182 37333 -1403 -32003 -25006 5753 7541 -11905 -12914 7357 12556 11841 5540 -4059 -13600
26169 -13600 -28769 -36806 -11869 -10529 -16141 -11862 -7219 -14683 -25716 -3 32380 34429 2252
26156 2252 -31696 -24279 -19001 2009 20985 12238 -2677 -14664 -11715 -15130 -3238 -458 13568
26143 13568 2089 14189 12161 33083 37678 31887 35136 44707 -5667 -45009 -21401 2237 -32758
26130 -32758 -30471 -33880 -76780 -44026 198 14794 -4670 -20758 -35108 -34063 -39360 -36413 -25385
26117 -25385 -16586 -29221 -43059 -41216 -26181 -12846 -35727 -59212 -53161 -31669 -12920 -24783
26105 -24783 -35461 -20808 -8564 -28356 -27836 -5627 -7820 18582 6193 -2902 -18154 -30225
26093 -30225 -16196 7746 2910 2013 -11064 -2913 17788 34269 23468 301 -10900 316
26081 316 -3822 -12012 -26493 -4210 -16902 -21946 -23335 -15912 17530 10261 20241 13478 -5539 38
26067 38 -3045 -15503 -33668 -48761 -57231 -63574 -65471 -42522 -18916 1008 -6037 -10178 3137
26054 3137 22435 23437 8493 3457 29070 14345 -18583 -34848 -30069 -5375 -29269 -29745 -27882
26041 -27882 -14651 -8111 -26883 -37365 -37430 -23321 -6667 -12256 -7930 16300 15282 -22580 -26934
26028 -26934 -11618 -14617 -30152 -24069 -5471 -18750 -45532 -47391 -48391 -51617 -40145 -28040 -28501
26015 -28501 -13933 2584 13118 8087 20422 1402 2961 38125 43012 11376 8045 16341 -760
26002 -760 -21905 -42467 -47036 -41007 -32567 -22199 -1659 17783 -22322 -59485 -69541 -49847 -15076
25989 -15076 -9926 -35037 -17515 5931 5966 -9524 -8125 11466 18550 3487 -22922 -26792 -31005
25976 -31005 -51837 -69527 -53055 -31646 -12341 -13285 -14120 -2169 -20365 -42827 -54863 -52729 -48630
25963 -48630 -31168 -7865 -15126 -54401 -40859 -47402 -45330 -21405 -7247 -7886 -31539 -19781 -718
25950 -718 10716 19942 503 -23013 -30638 -15716 -8462 -742 -2690 22143 30223 16414 1876
25937 1876 -19651 52 24155 24195 5470 -7870 -18258 -41590 -43334 -35562 -51218 -48847 -31389
25924 -31389 -23042 -19381 -50858 -20850 -25484 -33530 -34653 -39629 -55379 -78297 -82646 -65785 -42442
25911 -42442 -35431 -20672 -22554 -11092 -9888 -16266 2980 1342 -7835 -1396 27193 25332 13741
25898 13741 18996 -201 3604 12672 -1646 3156 10223 -584 -20683 -37962 -15874 -18814 -13555
25885 -13555 -11226 8941 10474 -3432 -8647 -14162 -3076 -4125 252 14052 5561 8709 -1921
25872 -1921 -5390 -9410 -9884 3678 14318 2424 7588 14389 -4147 -29276 -62778 -64119 -29022
25859 -29022 -10497 -10083 -8227 -17507 -15782 -28796 -65379 -69918 -53500 -56472 -28871 -1910 29426
25846 29426 50695 22270 16672 23189 9818 12931 -14499 -25200 -20784 -22481 4901 15642 20052
25833 20052 13720 810 -13957 -25693 -28668 -23755 -28708 -36486 -50063 -51793 -61402 -34829 -573
25820 -573 13111 15989 2211 7109 8395 7780 27494 28796 -2385 -17000 -11474 -6937 -10014 21751
25806 21751 34691 23805 27359 27594 32521 29965 15048 21772 6099 -5365 5470 32522 20954
25793 20954 -7199 -33364 -29250 -23135 12123 39990 42915 35482 18556 -675 4002 14781 23312
25780 23312 15195 28436 24711 3699 3164 12803 12374 5542 31652 -5814 -28074 3447 5804
25767 5804 -12401 -48793 -44196 -37818 -31885 -28656 -32197 -12660 -9846 -4004 2044 -3127 646 22509
25753 22509 10450 6639 -7319 -15056 -22960 -33134 -51469 -35634 5168 -9742 -6667 941 -9201
25740 -9201 -17668 -21119 -28561 -32995 -16416 3803 -5779 -21461 -10595 -15704 -19130 -13304 20256
25727 20256 23594 987 -6677 -19669 -30108 -18200 5511 -6025 -11586 9446 13243 -3217
25715 -3217 -13571 -46070 -39692 -28759 -1147 24798 38405 26611 25971 14054 -5863 -19483
25703 -19483 -33104 -24040 -27002 4370 4838 -8443 7082 8083 1039 -20706 -45274 -46661 -27889
25690 -27889 -8184 -8789 -13559 -9176 -8069 20199 37293 5736 -12866 -4428 19632 28321 -971
25677 -971 -9448 -14154 -14685 -15894 -3904 12819 -5141 -10834 -6333 6563 5508 -2035 4105 1367
25663 1367 23003 13834 9748 10491 32262 31936 5003 -9705 1145 9119 -15257 -52812 -58924
25650 -58924 -29942 -19756 -28860 7540 24072 12116 9734 -20403 -11649 11257 19888 3576
25638 3576 -10465 -15074 -46638 -18493 20816 20193 6038 -3787 -18281 -49698 -48448 -23526 -3936
25625 -3936 -8325 -13525 -6419 6432 17181 -9221 -34185 -45773 -44898 -42464 -26476 -4473 -18249
25612 -18249 -45019 -34135 -31479 -24358 -624 -17330 -34625 -30571 -25219 -19499 11480 39976 29653
25599 29653 18621 28628 53679 34897 -1612 -18469 -20275 -20371 -15553 -10746 2093 7880 -4103
25586 -4103 -30068 -40906 -42457 -36104 -20935 -1388 9379 30496 20073 -8052 -12627 -24487
25574 -24487 -36582 -30927 -25037 -38825 -34526 -38728 -46304 -29459 -38494 -39648 -53412 -63204 -61573
25561 -61573 -65440 -73137 -34410 -15450 -33874 -54188 -37870 -18067 -24669 -34553 -31993 -14057 11584
25548 11584 1138 -39079 -49278 -27737 -5060 -8520 1998 -1930 3375 26348 6427 -11837
25536 -11837 -2001 17291 13923 3825 -471 -17339 -34683 -32486 -18920 11226 27444 32260 28862
25523 28862 -6188 6700 12483 -20152 -27744 -2267 27490 18569 -466 3549 9466 8291 15943
25510 15943 45510 38062 66301 41872 36905 20091 -17636 -11739 5947 23715 14572 -32999
25498 -32999 -29078 -19357 -3577 14819 1385 1700 8469 15818 -5261 -18271 -1205 28068 29873
25485 29873 18146 -21903 -27228 -15980 -13499 -3550 -11976 -18699 -15545 -21804 -21636 -20727 -40366 -13558
25471 -13558 3788 -21645 -36481 -29818 -47468 -19946 3262 -1379 6066 39786 25782 16
25459 16 -8832 -8855 -20924 -8466 -6516 5099 1518 -4128 -3466 -17092 -34443 -26884 -17465 -33741
25445 -33741 -58759 -77348 -67969 -49258 -20714 14619 13296 -6509 -12253 -2034 655 -3081 9390
25432 9390 9463 -22781 -46277 -22118 -14357 249 20048 1844 -8143 8622 -7489 -20875 -6130
25419 -6130 -12689 -13093 7526 29499 23500 -16867 -13874 -17428 -22205 -13097 -29534 -48913 -48616 -56525
25405 -56525 -31398 -14496 -30936 -21784 -24553 -11612 -13534 -15577 -21259 -33036 -31958 -14180 15372
25392 15372 7061 -15546 -17887 2789 -3500 -15490 -4607 -9712 -15476 -6296 -4659 -689 -11071
25379 -11071 -3462 -11304 -9646 -10930 -18472 -18648 -20320 -14161 5463 -3850 -24625 -22166 -5135 36154
25365 36154 51709 33900 22776 22528 3924 1178 -30870 -35806 -48578 -41827 -29758 5372 4834
25352 4834 -1906 139 16324 3047 26548 36056 13743 -801 -3395 -31634 -34970 -26785 -5830
25339 -5830 8910 -3365 -3851 -8261 -7049 -3663 2395 8797 15049 14714 13004 6899 -4048 -28588
25325 -28588 -53843 -46833 -58994 -44041 -45300 -34334 -36352 -31055 -24218 -22074 -16331 8071 -2563
25312 -2563 11019 21757 38461 48679 38869 21087 2246 28461 36956 7043 -28060 -36678
25300 -36678 -37804 -21140 -9932 -17808 -30983 -27739 -14282 -5869 -17306 -24238 -23678 -2759 4609
25287 4609 21467 30587 21009 31054 -4168 -29053 -19799 -20322 -26842 -40348 -48499 -51860 -41457
25274 -41457 -37969 -39713 -33371 -32100 -9658 12067 24065 20192 4323 1385 1070 -10772 867
25261 867 7395 6863 -16334 -33966 -49915 -34685 -7770 12660 624 -7822 -440 8087 -14284
25248 -14284 -23852 -53363 -48243 -5596 -13959 -36924 -34744 -36684 -42593 -37625 -43289 -63928 -60975
25235 -60975 -39907 -16611 -22999 -25849 -24622 -15308 7052 -2374 377 13111 -18148 -45081 -43693
25222 -43693 -46948 -45310 -52248 -31207 -31705 -10814 631 -7377 -12975 4590 14130 30029 14455
25209 14455 -1812 -2285 1930 11505 13817 31648 40725 40974 64460 38864 34206 49168 36350
25196 36350 17199 -11217 -8535 4406 2853 -25583 -53442 -52965 -33391 -27044 -15815 8267 -10389
25183 -10389 -19408 -20482 -7983 -23651 -42108 -21813 -15613 -11380 14705 29230 41423 31617 -17428
25170 -17428 -47004 -71586 -74688 -82308 -58318 -26463 -17340 -10084 23786 35959 -6793 -15624 -13091
25157 -13091 -12490 -639 -9870 -18130 -23344 -33022 -57484 -13394 27913 52604 43419 48342 47839 14575
25143 14575 -19081 -19299 7516 31088 48992 34659 5966 -14771 5872 3855 726 -2749 3230
25130 3230 1693 -19036 -9919 -1111 2604 -11741 -28872 -35991 -35424 -22708 -6417 1759 -31939
25117 -31939 -53922 -44197 -52462 -44265 -44737 -34114 -13119 -1057 35674 39309 38945 37858 18490
25104 18490 9445 5436 25594 39157 32298 16959 29070 12922 -6533 -21530 -38336 -46949
25092 -46949 -29811 -21074 -13536 -20928 5373 3041 -4266 -12405 -17289 -27508 -15503 7133 17523
25079 17523 14228 15642 12092 12377 -9022 -18647 6238 2414 9383 36058 24766 14294 -6730
25066 -6730 -17267 -18052 -24639 -36213 -27254 -11711 -6103 40 -815 -3149 -26118 -35306 -34262 -26891
25052 -26891 -12939 -20770 -7076 -3938 8628 -4772 -3074 12407 1478 -12382 9348 1943
25040 1943 -17653 -13650 20038 15748 -11781 -38058 -19782 -5900 300 8493 -9896 -18084 6315
25027 6315 9633 12023 -154 -21405 -35455 -53417 -38834 -21708 4598 2470 -39022 -43680 -16778
25014 -16778 17286 34396 33425 43729 -2994 -25812 -29525 -27228 -18932 -26828 -39907 -39758 -16391
25001 -16391 -8815 -13400 -10034 -8093 -541 9765 -18973 -40587 -21037 -26045 -14350 -10119 -9052
24988 -9052 -6396 -13036 -3900 24584 21775 -3429 -14128 18918 38554 28585 8575 4218 22268
24975 22268 25368 -7670 -18947 -19458 -6284 -33953 -20722 -3812 -12421 7381 19321 11262 -19604
24962 -19604 -16775 -13102 -9506 -8727 -5939 25794 42617 23139 -1564 -5635 -17747 -15702 -19807
24949 -19807 -16674 -24938 -51776 -64705 -65802 -50991 -26296 -3367 -287 242 11688 -11969 -18128
24936 -18128 6011 19040 2802 -2119 4884 2954 -842 -9029 -20906 -30339 -47980 -31268 -20805
24923 -20805 -16734 -45212 -49825 -40751 -21500 -12461 -5849 10330 21502 23719 4593 -6621 1866
24910 1866 18326 31270 44295 43842 26401 -1909 929 -8329 -26198 -9705 15267 27435 14382
24897 14382 18077 -9560 -22724 -9174 -3106 -13151 -26122 -19864 5836 -8753 -20582 -16100
24885 -16100 -16041 -29055 -37704 -47060 -42375 -36040 -22209 -12430 -11407 -8962 3597 524 -21359 -25591
24871 -25591 -22279 -14818 -20829 -29120 -8720 21774 -4443 -34426 -35682 -29089 -17145 -26637 -46529
24858 -46529 -35591 -21348 -21498 -20729 -21542 -25003 -23759 -6255 1216 -5874 -10207 -15948 -15456 -12981 -34479
24843 -34479 -42302 -25981 -38627 -39579 -15291 -317 -7357 3033 11262 9446 7114 11784 5239
24830 5239 -13921 -34801 -20253 -5558 -7439 -22680 -8558 6204 -1017 6527 -4801 -32499
24818 -32499 -37214 -49142 -51013 -54974 -27122 -10188 10954 21863 -9160 -23984 -7183 -5545
24806 -5545 -5908 8285 7515 20787 16294 4482 -13419 -601 -11464 -22437 -7588 19869 22704
24793 22704 4644 -8389 -4815 9690 29739 24716 7390 -5602 -13844 -21966 -30050 -29012 -47590
24780 -47590 -33581 -23923 -22327 -32470 -41395 -25869 -30694 -37233 -34203 -26776 -36073 -28411 -3695
24767 -3695 -30862 -43227 -14007 -8331 -13391 -26220 -25750 -7238 -25123 -60152 -58327 -35391 -35074
24754 -35074 -65674 -94940 -80810 -43473 -9564 -6471 -12436 -16846 -30072 -40192 -17398 -26538
24742 -26538 -33033 -35546 -11362 -14328 -7582 32308 32419 22741 6143 -30510 -10098 4333 10745
24729 10745 -4201 -47983 -36595 -26374 2510 28607 30943 16321 16555 26851 23607 -2106
24717 -2106 -3011 -21335 -23544 6723 9833 4942 3197 7098 11189 15949 10098 7094 -8859 -23465
24703 -23465 -39241 -29439 -32624 -55015 -28711 -26244 -14380 3798 -3080 -11619 -2535 391 17343
24690 17343 18877 -3752 -8664 -22793 -26194 15458 37337 21590 1749 -2966 -2426 26514 7962
24677 7962 -29647 -4910 11286 10735 28163 45026 27825 9247 29345 27126 14223 2474
24665 2474 -9599 -38098 -26372 5268 21947 9696 22945 28019 41760 12348 10421 -408
24653 -408 6706 23834 -6692 -17780 -8210 -23365 -26403 -26313 -26588 -29596 -14941 24000 42813 37958
24639 37958 41010 47054 16980 -15548 -37671 -56736 -47265 -47034 -4814 -6955 -27565 -14983 -2307
24626 -2307 -18872 -36396 -37409 -17481 18450 51984 51452 13399 -10172 -25758 -17097 7947 43743
24613 43743 34058 626 -20871 -24780 -21801 -3803 -3730 -21102 -11184 -11336 -12989 -12033 16286 32572
24599 32572 21589 -2201 247 -26709 -40178 -28246 -31095 -46249 -59954 -26192 -6476 2420
24587 2420 7165 -11903 -13870 -411 -8976 256 5796 -9187 -205 -5618 -21553 -25611 -12407
24574 -12407 5979 -16535 -13659 -11282 -8350 -28599 -51966 -46763 -27178 -33351 -30498 -14620 -8076
24561 -8076 4260 7894 3918 -28651 -31934 -8246 8261 7081 -1449 3424 12781 -291 22825
24548 22825 25551 7117 -1730 25805 31820 15169 4394 -18704 -19636 -17757 -26408 -23175 -12631
24535 -12631 -21620 -46789 -33416 -12581 -12484 -23697 -24180 -15393 -12952 -16987 -20941 -10960 -1791 -10390
24521 -10390 -14020 -22452 -26060 -6812 -27776 -45601 -41454 -21258 -22452 -25126 -39966 -21150 -23220
24508 -23220 -34498 2781 39222 46544 16011 -11301 3951 13119 22800 1682 -22273 -27178
24496 -27178 -18138 -8907 -596 8838 -11846 -36321 -24841 -19746 -25848 -38894 -24906 -5751 -6608
24483 -6608 -16596 -24915 -24730 -41529 -53577 -36186 -15737 -8687 -34277 -43607 -38077 -38698 -24975 -38027
24469 -38027 -34660 -12795 8208 -4851 7117 25311 10269 -8789 -10340 7306 -7999 -1695
24457 -1695 -1491 -12807 -21031 -19881 -30619 -72197 -62317 -43855 -20932 -13009 -19549 -605 26008
24444 26008 24615 -12331 -35840 -48516 -42767 -38777 -34794 -4594 -1925 -11916 -23976 -6293 17320
24431 17320 12076 -32348 -55068 -37261 -43303 -69751 -65043 -58263 -75509 -70967 -45688 -17736 -19323
24418 -19323 -14724 -33529 -32673 -15368 -21470 -13871 -21726 -8474 -23012 17491 14093 -21424 -37789
24405 -37789 -29690 -19835 -19438 -14846 11073 24037 14903 -21478 -40671 -54639 -75008 -58962 -41253
24392 -41253 -17828 -19818 -34941 -3033 23577 12251 9630 8038 -11567 -28447 -2674 -2605 -17635
24379 -17635 -23863 -30805 -22780 -29040 -21149 -20908 -15559 -23312 -10737 -933 -5409 -16814 -20692 -22716
24365 -22716 306 -25433 -31303 -32079 -17008 -3193 -19823 -14188 -9176 -29463 -17641 12386 -8610
24352 -8610 -23615 -9810 -1210 -17488 -28713 -31941 -23489 -20773 -29482 -22622 -24616 -22499 460
24339 460 2579 -14078 -45726 -21346 8912 10859 43841 41488 13237 13500 27023 17788 -5276
24326 -5276 -28281 -40181 -32639 -43540 -47140 -36109 -9506 25159 15918 2983 13166 -21262
24314 -21262 -20046 -5867 -11128 -24511 -26592 -23338 -6842 -5175 -27129 -31024 -36290 -30419 -28078
24301 -28078 -42697 -42409 -32179 -13920 -22881 -34849 -29887 -17882 -15463 -34137 -33587 -54106 -62945
24288 -62945 -33111 -34923 -7270 18857 19591 14689 -38289 -34995 -19450 -24892 -33038 -16224 523
24275 523 3213 25158 21277 10404 11562 1451 -3916 -12887 -28504 -10711 1964 -2921 1192
24262 1192 -6271 -29560 -50001 -51706 -49867 -23383 -3474 482 -6731 -8799 8731 4268 -25695
24249 -25695 -29282 -25694 -29264 -644 10129 697 -34412 -58609 -39480 -30328 -24413 -2178 16999
24236 16999 9748 -9184 -18602 -10101 -10872 -633 -7272 13670 35126 26095 10387 13695 9864
24223 9864 -9531 -14531 881 -23208 -43883 -10675 -19290 -39146 -54266 -25010 -2993 -4237
24211 -4237 -21762 -8809 32060 30794 523 -13801 -20189 1366 24975 6199 -15614 -41182
24199 -41182 -29835 -7761 9053 -6000 -11865 -18874 -26725 -39336 -34217 -37884 -49099 -33168 -27147
24186 -27147 -35327 -17547 -7961 13779 42941 47038 32894 29814 45134 45484 23178 15741 32553
24173 32553 10877 -24734 -40016 -46106 -30715 10564 19691 -16005 -43437 -49066 -28704 -11214
24161 -11214 -10099 -27097 -18843 8757 26061 13274 18439 17947 5661 -1743 -11031 -8016 3049
24148 3049 -12622 19674 7786 2140 16206 28631 7628 6803 2002 9808 18510 -18671 -9274
24135 -9274 14956 11906 -6326 -5422 16647 25782 -3286 -8994 15475 30108 44052 25051 -22414
24122 -22414 -30086 -12723 -1740 -30900 -27034 -16443 -23152 -45647 -21304 15731 20957 5676
24110 5676 -3171 -21677 -33826 -42706 -42503 -35235 -24779 -8154 12357 19772 -12136 -28776 3601
24097 3601 -1384 -18682 -49685 -31148 -22711 -34574 -32431 -21896 -9041 -11396 -13170 -22488 -21284
24084 -21284 -25190 9140 29958 -11783 -25104 -3105 9334 17476 40117 57133 39017 -10153
24072 -10153 -15041 -6327 -16252 -23058 -1484 14108 19191 -6615 1380 13287 9739 -9642 -12545
24059 -12545 -29566 -68511 -64480 -37514 -23382 -30855 -46870 -55469 -38201 -49592 -52615 -64298
24047 -64298 -56427 -26520 -1035 36113 7932 -1744 -3241 7713 25933 17209 2629 14146
24035 14146 10269 12945 2252 1357 -23027 -27521 -15448 -35701 -42645 -11138 23202 25804 -5120
24022 -5120 -27159 -38135 -33573 -31030 -740 -20269 -38459 -19440 -12620 -26067 -41923 -34128 -37784
24009 -37784 -55614 -27464 -14864 5448 2120 -4689 -5511 5910 8352 7095 17544 15090 -7137
23996 -7137 -11953 -14658 -3765 -3291 6161 11071 27584 29635 13288 9537 5213 -28850 -43345 -38701
23982 -38701 -36478 -22685 -10646 1870 31276 26348 -14505 -21488 -18750 -8169 -24115 -20575 23791
23969 23791 38481 37144 17147 -8228 -13597 3749 1787 -11097 -12062 -21926 -34683 -30448 -25733
23956 -25733 -11274 -18114 -54089 -52971 -17076 -18890 -17998 -4301 26974 27764 1782 -6995 -8737
23943 -8737 -15718 -40532 -64501 -37230 -5881 1676 -13661 -21883 -32524 -34831 -31698 -15320 -7875
23930 -7875 212 1678 2417 1578 -24848 -39294 -17464 -19859 -14859 15762 15343 10496 -20252 -70941
23916 -70941 -58354 -40412 -41859 -11897 -25797 -31417 -6066 -11513 -9984 -16996 -733 23917 35405
23903 35405 26195 18314 33647 26511 -3232 -27628 -54398 -64634 -36766 -4908 -23934 -20848
23891 -20848 -6107 -14160 1230 -7839 -15003 3247 11199 -382 -18885 -23170 -13951 -13684 27567
23878 27567 21081 10019 336 -32843 -38613 -22389 -20346 -9475 -24888 -8918 3298 833 3544
23865 3544 -3456 8695 6448 9000 2103 -1054 10393 21746 43298 35715 49166 59504 23293
23852 23293 -8848 -30801 -32962 -33828 1659 13311 13126 14922 15231 12497 27476 21573 11504 -6079
23838 -6079 -7720 -5729 -7348 -16874 1390 15106 691 -3018 -16436 -18361 -5197 -4254 -3368 14223
23824 14223 32014 21179 -278 -3206 -7646 -14030 -17223 -31535 -27468 -39684 -46215 -43195 -7616
23811 -7616 -16309 -21396 -13130 -2535 -11249 -7867 11745 6560 595 -10315 -8490 -7462 -22736 -30090
23797 -30090 -30261 -23623 7766 41659 48450 45529 18912 -3820 5545 6527 -22252 -48007 -70997
23784 -70997 -45721 -31906 -5561 1138 -14122 -16435 8052 -18058 -44100 -40206 -23109 -35965
23772 -35965 -33531 -16834 -5667 -32224 -29882 -34166 -66955 -60177 -51648 -54920 -48565 -30601 -38534
23759 -38534 -37087 -15741 1719 -7973 -898 -1842 -8108 2494 39882 50123 40736 38074 29137
23746 29137 19367 15366 -18608 -32582 -9685 32540 41304 43615 50874 39539 45125 49324 28086
23733 28086 -12898 -9166 18967 11024 4425 4685 -5012 13386 36148 22310 -5717 -11136 -14661
23720 -14661 715 21690 30031 18642 -9899 13632 24198 24404 13190 13758 6281 -842 -6690
23707 -6690 6924 20026 8466 240 4578 -1451 -24155 -13427 -14812 -20967 -19071 -13695 26559
23694 26559 19872 -18551 -46484 -46189 -32987 -4480 17903 37338 29360 15123 20978 16954 12322
23681 12322 16091 3456 -39005 -37088 -7714 -1809 655 -33068 -31834 -13384 -10467 -3833 4506
23668 4506 30076 34724 6676 -3491 3422 3920 9848 -7923 -18707 4638 33237 31858 10048
23655 10048 217 2101 -5471 2368 -7955 10210 20706 -9237 -23771 -675 7864 -1461 12093
23642 12093 -3244 1551 2691 23067 15678 1642 -7132 8586 20247 18364 -14941 -35404 -21282
23629 -21282 -19512 -13910 13266 41636 29066 8536 33875 46682 39990 8203 -1471 23183
23617 23183 31605 6686 11132 13001 19452 28881 2578 1408 -29514 -44097 -50112 -48654 -9842
23604 -9842 -5537 -2365 3824 -28656 -38208 -37126 -24133 -13918 -28455 -16955 -18377 8742 4458
23591 4458 -8946 -19115 -24402 -18174 -5736 13787 15917 -7824 -26766 -5742 5131 -12538
23579 -12538 6286 29041 1676 -12264 -13667 -12556 -9666 12434 5604 -4919 -10802 -9842 1217
23566 1217 12575 31847 -3364 -50279 -51526 -12549 -9929 -12341 -4377 -12687 -27732 -20361 133
23553 133 17079 48513 54608 30784 16481 -4351 -11511 1638 -4970 4314 6120 -19656 -18824
23540 -18824 -5767 9699 8763 9108 445 8018 27942 52556 43949 29280 4123 -9034 -40067
23527 -40067 -54077 -51995 -36010 -41273 -76292 -48440 -17580 30555 32132 9177 -9790 -10950
23515 -10950 -17067 -29971 -43987 -59981 -59849 -44995 -31909 -24202 -26200 -43695 -47422 -29343 -29660
23502 -29660 -29333 -16469 -31011 -27312 -27646 -38429 -8107 197 27637 49930 53707 59898 54273
23489 54273 53745 27210 -14166 -18259 -4224 5121 9306 -5021 3305 2201 -10870 -11283 -17983 -13024
23475 -13024 -18134 -15408 -2149 -6399 -2360 8502 2492 -11536 -22255 -3865 11083 29156 41975
23462 41975 37733 13297 -3604 -13583 -21551 -41842 -20788 10305 14498 -41286 -46751 -50056 -50920
23449 -50920 -49996 -47952 -22442 -19434 -14143 7014 1611 9832 9761 -5067 11770 -14301 -37374 -43857
23435 -43857 -67917 -70168 -61866 -68277 -33265 -30140 -16768 -10255 -8470 -27926 -26052 -13711 -9605
23422 -9605 14509 13088 2091 -1929 -2381 11102 27413 13612 -14812 -4986 7001 1279 -7413
23409 -7413 -15849 1480 21574 22321 -8764 -33091 -56716 -52045 -37155 -11794 -19278 -19146 -41085
23396 -41085 -50300 -43653 -68877 -80693 -57495 -9349 28178 38590 38348 27483 15310 995
23384 995 -5447 9556 22533 16997 2185 6819 23943 24744 33752 30759 29799 469 -14068 -10856
23370 -10856 -31018 -12981 -22647 -30221 -21585 -31759 -1528 22960 16061 -25503 -28314 -6515 10201
23357 10201 -13380 -19470 10344 34378 28238 13913 863 -17748 -9555 9664 4395 12540 7341
23344 7341 14450 6770 20178 32399 24792 19947 21993 24676 55797 65726 46485 15871 15290 -172
23330 -172 -30132 -6124 6727 -15769 -35863 -22506 6 16816 -2000 -10200 -4750 25483
23318 25483 35478 50039 62495 49854 7858 -24992 -42386 -37288 -34186 -46537 -62267 -54320
23306 -54320 -22647 -21101 -17507 11901 505 -7710 -12378 -8788 -24906 -22106 -26203 -58751 -33620
23293 -33620 -15763 -3555 -6015 2127 -13380 2531 13304 -1758 -11496 -4668 -27080 -27552 -31627
23280 -31627 -26771 16140 32755 54934 14194 -14104 -10519 6615 -10567 3583 24503 28849
23268 28849 4425 -862 5666 21518 4432 -1811 13858 9580 -542 -833 -4172 -1893 -5542
23255 -5542 -4186 -21181 -41049 -22872 -16009 -9484 -6154 -1643 -28714 -44927 -35902 -16290 1958
23242 1958 20107 13042 10151 -370 -14982 -21246 -11396 4010 15756 29056 46345 26102 34502
23229 34502 11956 21248 11201 -7919 -863 34926 34463 40654 65337 71565 82171 87932 49404
23216 49404 21179 16460 12624 10348 -735 1978 9120 -4658 -29280 -67039 -66017 -52254 -44409
23203 -44409 -27768 -28488 1278 35233 49126 32883 48295 38405 16723 15707 18578 -5935 -7304
23190 -7304 -3415 -5671 -15283 1342 28900 38098 19729 43723 57248 46086 47869 53954 60842
23177 60842 29881 -4549 -26639 -5322 17100 29449 36672 49233 63286 66799 85170 107058
23165 107058 77306 66157 98187 109849 152193 204243 293473 403023 567646 873635 1297648
23154 1297648 1753176 2117924 2321802 2274638 2012470 1621290 1171039 816886 593428 426782
23144 426782 355988 282400 207154 134971 99736 79273 62515 68613 97341 103785 104870 102106
23132 102106 97585 77062 80771 75506 44402 15217 30760 37919 42617 63458 64948 33594 34631
23119 34631 50023 35037 19782 24360 38227 21257 4435 14834 24109 32768 22858 35989
23107 35989 52279 67444 74168 58206 63545 58318 27247 -6686 4135 3607 2234 10279 3041
23094 3041 1557 23423 58366 60515 57064 37226 13813 11566 -6149 9073 21358 24604 12486
23081 12486 37076 50459 40124 36781 40226 45798 45509 20424 -242 4216 1846 -5828 -1506
23068 -1506 -14661 -30460 -34065 -32831 -31174 -20114 -39683 -5733 13116 -22628 -24553 -21242 -5666
23055 -5666 9835 -3576 -4017 3683 6750 -18161 -19942 -23464 12935 27734 31767 48241 33844
23042 33844 6088 -4233 23311 53883 40227 41373 52270 5436 -11036 13018 25845 37849
23030 37849 44209 44783 41174 43724 63697 82078 58487 71681 55282 49538 28336 1346 2944
23017 2944 22501 -417 -179 27813 26529 -499 9088 25963 -1372 -21582 -22123 -388 7000
23004 7000 23912 59315 67217 52165 28669 25841 51940 44877 37151 42548 33117 15548 16001
22991 16001 28526 48214 35448 21441 -4050 10463 49527 69378 78889 34955 -23820 -38744
22979 -38744 -35026 -19474 -15601 5525 30067 41726 36699 31966 34656 34274 33106 39759 60641
22966 60641 71696 65580 24121 22209 41883 53243 54198 36164 51444 41830 39920 41153 29905
22953 29905 20888 40361 32063 11905 18954 22711 39614 31729 40760 38138 27030 14270 -7661
22940 -7661 8839 1385 -3910 10341 47214 39228 27257 40200 32725 21854 -1770 19855 42028
22927 42028 50278 24703 18826 3079 -1474 38206 69356 82134 105104 100835 73486 54988
22915 54988 48377 26291 37770 48917 28720 27356 35492 33481 19089 6687 4782 2826 8545
22902 8545 1943 -409 -12302 -12333 -35466 -64301 -58224 -42299 -43203 -31603 -1656 -12410 -12268 -10041
22888 -10041 9296 25789 34173 19453 4774 13348 23666 32228 11986 7222 15249 20424 29035
22875 29035 57273 87592 64357 39929 29717 20793 28623 48779 57969 50222 51263 75922 99305
22862 99305 121821 134258 152867 187755 222091 242831 252615 254120 252249 242872 186866 141072
22850 141072 123235 126361 114637 77697 69155 44145 1130 1593 17902 41259 37101 -17511
22838 -17511 -49143 -32118 5329 2212 689 -16020 -28334 6524 27913 45321 94586 95447
22826 95447 82576 51937 55026 79528 55036 46075 35897 35914 6337 -12545 -14844 -10919 -15245
22813 -15245 -34007 -38357 -34409 -32901 -8805 -16033 -20890 5298 982 4415 -2277 -27735 -28489 -6853
22799 -6853 12783 45982 99473 167117 241772 308381 360795 374705 355202 307713 267328 239810
22787 239810 230101 183559 126144 130910 120226 116103 134456 132363 126283 122206 134099 144807 155054
22774 155054 177183 212642 212912 190686 170202 156994 147690 124267 102009 72953 74434 89760
22762 89760 63489 37180 6427 1178 -5711 2806 10182 51051 76930 89851 97688 102409 74013
22749 74013 48707 29721 48133 49777 58427 91213 112678 122152 131412 119721 104725 138200
22737 138200 181835 253463 360481 513027 718197 992888 1275949 1412691 1398360 1313156
22727 1313156 1131142 869524 636023 461353 367667 302958 272831 241643 231626 209415
22717 209415 185336 170470 177816 171730 171745 179298 179033 178011 171212 196647 206723 201331 202029 194673
22703 194673 191048 188271 176734 208113 240205 238851 256525 308993 379128 387266 378427 394397
22691 394397 424147 462509 516923 544561 594955 653782 742004 911285 1183415 1596552 2116061
22680 2116061 2547963 2798543 2834903 2627739 2237659 1753668 1349295 1107892 978120 907733
22670 907733 829888 758776 731343 704015 658191 636008 616344 603752 603139 607725 683295 759788
22658 759788 846798 929620 1004508 1016473 1041611 1093270 1128095 1138840 1140227 1140184 1164770 1194943
22646 1194943 1260577 1329940 1387320 1447728 1514887 1545911 1604648 1708055 1811339 1898024 2048619
22635 2048619 2249078 2446231 2641791 2867762 3126232 3390058 3619362 3862385 4124578
22626 4124578 4414113 4754739 5161335 5644517 6243461 6972195 7818185 8885850 10169247
22617 10169247 11787177 13966008 17010589 21183962 26750086 34169511 44440821 59875809
22609 59875809 85522701 131134044 206958919 300943925 380564397 429239176 438762043
22602 438762043 403340603 332445357 244442245 166441741 114176105 81767651 60249379
22595 60249379 45084789 34353466 26841265 21628078 17936143 15316874 13522724 12493701
22587 12493701 12041084 11732859 11283407 10422793 9154402 7708803 6335240 5250159 4475318
22578 4475318 3905207 3488050 3162677 2908722 2753944 2617340 2498149 2369421 2219158
22569 2219158 2044966 1910460 1819573 1730419 1626055 1557894 1480556 1411459 1322778 1297566 1262140
22558 1262140 1229338 1146801 1057880 982831 929290 844103 773934 754056 766392 805811 807589
22547 807589 816919 860051 888372 861039 808814 750080 718021 711476 679279 675085 689292 681904
22535 681904 705445 746300 817250 976375 1246565 1645880 2141166 2579029 2805040 2813987
22525 2813987 2535983 2066302 1563148 1157451 885058 705499 593626 543381 502709 452570
22515 452570 401622 389055 368111 348579 346312 356346 375384 394434 368079 351885 348539 325826
22503 325826 308491 325899 328881 339771 328396 321941 310384 303230 304096 296950 289048 297119 287500
22490 287500 282630 263341 255626 250377 255051 257821 279129 283468 314459 322314 359007 357752 362851
22477 362851 340434 272780 208739 166749 167402 151750 146701 120215 104753 105348 126781 162069
22465 162069 194758 204063 196476 195305 186308 202552 222355 217058 222282 229256 253421 263952 279039
22452 279039 275322 248295 253967 281102 265563 234537 187596 121927 105360 96313 105366 86305
22440 86305 89494 93468 103988 47793 22697 6773 -11187 -11461 283 17800 48443 69010
22428 69010 66748 52636 36743 24260 32062 2648 9767 16646 27638 -5530 -48274 -95828
22416 -95828 -135248 -175111 -175959 -138877 -71724 -18334 52608 89285 96666 102231 111444 102492 78804
22403 78804 63300 22864 17422 46552 74101 107699 144069 122785 115076 133964 129180 121602
22391 121602 145195 151968 117535 59547 32607 27684 27326 28470 31686 40549 64996 50032 16830
22378 16830 21437 24573 38917 34843 50280 75467 107384 112764 99856 84909 57833 40685
22366 40685 46604 55455 63556 63932 61938 83989 108645 82928 33245 34182 4956 2084 17066
22353 17066 7833 13147 31058 50441 55254 36546 11696 31067 35167 41770 71930 86670 107001
22340 107001 90256 63558 57459 31254 37644 50926 68255 75196 76348 92329 94112 72926
22328 72926 59526 32602 33946 19472 -11338 -14744 -5889 -10410 -26162 -12494 12465 11013 1910
22315 1910 21283 31150 -3512 -23943 -13894 -8989 3064 15664 11540 6889 7029 -7772 43065
22302 43065 66029 70337 83726 78737 55775 43978 40999 16637 9633 1795 -8020 -23969 3630
22289 3630 -9731 -34105 -62586 -77483 -58245 -34654 -40693 -70716 -68375 -67399 -29371 -10060 2859
22276 2859 28015 34522 23461 -261 -3511 1253 160 -12374 -20693 -28342 -23878 -31766 -17184
22263 -17184 -26639 -23123 -10802 -17285 -12697 -28361 -30124 -44603 -41902 -24234 -47179 -29793 11050
22250 11050 4759 -9841 -276 17519 21511 19591 -7527 -14875 -7918 11952 5690 30198 30530
22237 30530 10598 -4767 -1721 -8462 6054 11015 23475 27701 22693 -14238 -11882 1721 -5628
22224 -5628 -7833 -13238 -22205 -15676 -13048 -12134 21103 39374 65034 60035 40397 32901 33092 20055
22210 20055 310 22127 20036 19673 25267 11709 10989 -2199 776 5364 2349 10355 11338 9811
22196 9811 -2704 187 -45724 -67204 -48778 -35533 -29509 -12460 -315 16512 32592 30529
22184 30529 13714 16532 -10731 -47915 -40924 -33140 -34439 -37210 -21958 -12408 2886 11245 13692
22171 13692 -20908 -43833 -28579 -496 37901 28733 32106 60965 53789 71332 81378 38660
22159 38660 -1860 1036 20614 23351 17965 13931 17226 36485 63131 59319 23895 21087 17314
22146 17314 1061 4423 2967 -15624 2839 30667 59666 51308 45931 30165 26553 25593 20863
22133 20863 9201 -22758 -37162 -38653 -39536 -50295 -53906 -48162 -34944 -30479 -32150 -7506 20049
22120 20049 47172 61024 57715 28945 -21330 -45245 -41424 -27053 -5583 -7556 -9069 -15914 -6453
22107 -6453 -14825 -26542 -10833 -53804 -63819 -46237 -31917 -16785 -16918 -5415 6771 -6481
22095 -6481 -11935 -34806 -66298 -66381 -26195 -16105 -15294 12112 49770 24785 -26742 -42777 -48195
22082 -48195 -61878 -60383 -62963 -67538 -44482 -34108 -3857 -23989 -22746 -1727 14280 12991 8946
22069 8946 38733 42292 15129 -1864 -4415 18429 9036 5424 38195 65851 80909 84441 109721
22056 109721 115033 100076 127325 187306 292387 463155 733271 1155313 1635115 2031339
22046 2031339 2298157 2329233 2110986 1736557 1295595 905562 634178 487071 355033 287883
22036 287883 228375 164484 112509 81869 76897 69845 65997 46926 45271 38317 25310 36021
22024 36021 73451 48486 -203 3222 -4573 -21449 -10896 10224 5948 14140 31270 29550 17713
22011 17713 -8970 -37519 -17479 -10176 -19754 -4491 18117 14320 23276 10954 13169 15765 -20519
21998 -20519 -34111 -31031 -24265 -28998 -32762 -32989 -48702 -53690 -26892 -1462 -19880 -29066 -19864
21985 -19864 -35912 -47946 -44658 -48940 -51543 -47283 -34402 -27819 -39719 -43649 -45753 -31810 6301
21972 6301 16959 20138 32764 36869 28404 40196 35830 36527 45232 51088 67492 51104 43544 12384
21958 12384 255 16653 17746 16801 13313 -7421 -24235 -30826 -57184 -47416 -20289 -25494 -14296
21945 -14296 5214 25782 19711 27113 15481 296 -1089 -15902 -48364 -51980 -29637 -24327 -4945
21932 -4945 -12931 -26178 -21216 -15114 -10129 10096 24339 38703 3110 -36306 -17587 -10956 -16463
21919 -16463 -32444 -34838 -7657 3573 -9817 -8252 -3811 -21451 -9774 -9232 -2269 16705 4077
21906 4077 16479 40994 17376 7588 32667 7576 -16406 -20137 -25862 -37908 -23181 -37951
21894 -37951 -32550 -20588 -1916 5022 2221 13031 10536 -1497 -567 40040 38290 12900 14722
21881 14722 15229 4105 -14295 3843 15196 -2906 -15443 -11746 11971 -5373 -26472 -26171 -35489
21868 -35489 -46240 -17348 -6348 7829 14661 19351 -7814 -14905 -12202 -10875 9815 24938 26760
21855 26760 27451 25885 5541 2204 9599 -3832 16217 3185 -23016 -16037 -15095 24180 28378
21842 28378 19940 32096 27366 -2547 3002 17661 27012 17036 -12006 6044 26713 14446 -7257
21829 -7257 -23623 -31357 -44691 -48583 -36841 -3212 11829 23392 31515 1566 -3051 600 -6429
21816 -6429 -31614 -33696 -15207 -16914 -30911 -21160 4971 16720 16332 -1593 -22355 -36276 -37872
21803 -37872 -39837 -52991 -51305 -37005 201 -14060 -1174 19861 38892 36603 38381 40192 23346
21790 23346 5195 -4384 -15369 -8741 26178 30377 32565 31961 22157 5654 1573 4589 30901
21777 30901 32919 22360 47428 45677 29272 29815 30877 13974 -9661 -22952 -15165 187 -20942
21764 -20942 -30623 -23274 -24645 -32252 -10867 -42810 -62304 -49847 -14734 -13851 -35667 -50710 -36513
21751 -36513 -25429 -16106 -8780 -35891 -57143 -33361 -14315 -28629 -11387 13800 2234 -14376
21739 -14376 -29063 -67069 -58644 -39888 -25220 -47479 -43537 -39573 -62505 -52373 -50123 -35891
21727 -35891 -19563 -3713 -9041 -15332 -10911 -7368 16329 2154 -2179 11241 -69 -4582 6336
21714 6336 12387 -9244 -17061 -23059 -23871 -9282 -23280 -36666 -33374 -35358 -37211 -19881 -5195
21701 -5195 -6537 2290 33889 23994 9599 -12854 -23854 -56540 -36591 -22503 -15241 -25609 -38693
21688 -38693 -49703 -45642 -45891 -19202 -9599 -16136 -8185 -10517 -19589 -23987 -50412 -38398 -17380
21675 -17380 17154 41087 67124 36645 -10825 -30020 -31020 -47891 -42781 -43212 -22019 13689
21663 13689 26127 37553 44267 57381 69101 38621 40721 18685 8076 19553 28682 25039
21651 25039 9440 -8730 -10833 -24143 -36542 -38484 -10376 -4990 -9455 -15851 -8103 8938 27017
21638 27017 26421 -911 -7557 -22839 -21344 -4585 -4138 2612 -26815 -25423 -10348 4851 17182
21625 17182 21771 13624 -18557 -24755 -4692 16551 27694 19231 -31881 -46284 -16827 9550
21613 9550 13216 1209 -6217 -20783 -27149 -31496 -17711 1560 15723 24774 31511 9739 19596
21600 19596 31905 37763 40931 17259 9319 10362 -13195 -21040 -13596 -15157 -38294 -22599 16892
21587 16892 44218 27081 -703 -17464 -21762 -41206 -46513 -46973 -41212 -10617 743 -6803 -8445
21574 -8445 -13688 -4741 10362 11014 3917 -2296 -13684 -23052 -7327 -8240 -14878 -26379 -7412 -6892
21560 -6892 -12088 -2453 12169 -9549 -22976 -18243 -10662 6036 7745 20961 20529 17063 5678
21547 5678 -16987 -18117 28265 25426 -30260 -36208 -35021 -17270 -16915 -12729 33790 42931 20524
21534 20524 -15302 2594 33074 16195 12503 17325 27204 17312 11633 -5729 -40332 -37938 -1533
21521 -1533 -4582 -7664 -15246 -41665 -47137 -42769 -8421 -9333 -25496 -24052 11078 12064 22547 13508
21507 13508 7410 -25990 -62169 -81953 -74349 -61816 -38970 -18318 -30767 -26246 416 11527
21495 11527 -20142 -3300 7080 19410 12964 24835 28234 8881 11690 15198 -7291 1927 34882
21482 34882 12910 -17408 -30576 -7421 38577 58391 19146 3145 6612 3537 11189 9311
21470 9311 4121 832 -13232 12063 16036 8093 -9445 -10188 -29030 -13784 2308 30855 34852
21457 34852 30162 18404 6187 21493 10323 -5460 13395 19405 23423 9934 -21648 -47927
21445 -47927 -29630 -53456 -60264 -29802 7225 26740 30084 30349 14104 5900 -2056 739 3206
21432 3206 -1675 13743 31467 33270 28816 4562 3498 6670 6404 23140 -8087 -14285 -33046
21419 -33046 -43670 -6347 9681 28569 45409 21530 7983 622 24267 29076 9675 -18337
21407 -18337 -13984 590 19955 27368 6747 -9214 -10226 3211 -1758 9236 7970 19626 20801
21394 20801 21177 -4558 -23838 -33532 -34211 -12612 4603 -3374 -11432 22338 53891 49586 29804
21381 29804 17384 -5111 11010 18520 20908 18873 6729 20056 -996 -27012 -28301 -12485
21369 -12485 -13437 -8056 -14393 8562 18409 10906 10176 27515 -11813 -32787 -23726 -10459 4519
21356 4519 -7387 5500 7720 1429 4025 50 -7250 -6162 -1302 -18874 -10294 2230 -27934
21343 -27934 -70526 -78465 -49168 -17127 -21006 -58908 -39022 -33657 -24409 -36731 -24934 -1002
21331 -1002 -4590 -21099 11559 34819 32790 27208 -8164 -20816 -21441 -12696 28056 60415 64467
21318 64467 37078 32172 42701 61164 54160 37985 19711 -11381 -26738 -31864 -12756 -3321
21306 -3321 9319 17785 2534 803 22257 31992 22473 24172 12688 -2127 39 4875 7771
21293 7771 2835 21789 47652 28692 -5284 10983 -22038 -37004 -19148 -31917 -46122 -42420
21281 -42420 -37710 -34737 -16633 -4094 -13713 -40502 -36271 -14768 -6767 -10680 -9593 4137 6713
21268 6713 8243 -3470 -7052 3900 -47 -11026 -9972 463 5286 20379 -2108 -23940 4994
21255 4994 23704 20778 5329 -1892 -31410 -26787 -51066 -59910 -27158 8706 24036 3706 21043
21242 21043 -466 -16400 -7456 10995 -1441 -14489 30086 36249 55632 53211 21571 14043
21230 14043 20075 28717 37633 22369 16547 16758 1269 -11355 -18015 -7224 -7448 5018 38605
21217 38605 39526 833 -35785 -60289 -47587 -42284 -22688 -3816 14816 16546 29149 34855 34247
21204 34247 21889 8847 10959 17162 23754 40884 35971 55437 48599 25916 -2211 -12141 -15429
21191 -15429 -6943 7055 6666 -9112 -2540 21272 47925 31694 19518 27750 28711 2337 -6464
21178 -6464 7209 17304 30203 26485 9435 7056 4212 -2444 9737 41604 40846 12435 510
21165 510 17224 36579 30560 25695 30472 5671 -6642 6577 7425 7181 7693 20614 40657 43677
21151 43677 1429 -14575 -4462 11851 37393 30966 4328 23272 57911 73610 62904 62486
21139 62486 44142 26304 21352 30690 19414 26313 53690 80508 55899 32878 12539 -13431
21127 -13431 -5882 -16065 -19396 12445 31467 44355 39929 17514 6719 -9939 7902 2846
21115 2846 -11518 -28001 -14534 -1661 -3426 6572 -3151 -13117 -28125 -37997 -34542 -27414 -13460
21102 -13460 -2425 30628 33814 -3906 -12796 -20997 -14756 14776 46547 59483 76989 103327
21090 103327 105069 54217 23783 25327 60169 63138 35790 25713 26116 45434 49964 44765 12834
21077 12834 15206 21547 15462 -833 18314 63182 72755 83006 38241 29173 41364 37871 43490
21064 43490 28967 10577 -16683 -9406 14130 30153 57115 38395 231 -1835 23327 36916
21052 36916 33010 26034 11181 2129 12702 -224 5033 5696 4020 33729 49608 45404 19927
21039 19927 -13755 -30142 -5768 5720 13514 51483 74562 71603 54600 28815 37617 27574
21027 27574 -6640 -2931 44315 57891 48302 31935 38948 27602 35831 58859 64345 55895 57788
21014 57788 28128 2197 -24335 -20130 25862 25480 20400 32808 42506 49161 39084 41538 25469
21001 25469 26910 49868 69805 75751 92872 115359 107537 87213 100328 109451 110714 193872 289548
20988 289548 387829 423518 433296 400858 342463 315247 350202 404943 483856 533053 573237 608992
20976 608992 595089 525236 446770 390381 394085 414988 438580 429682 404931 343321 258976 204948
20964 204948 169011 154437 166310 209730 239925 257857 308873 375807 411621 387565 369350
20953 369350 351020 372831 416029 471198 580715 686755 709049 654619 527597 428067 354482
20942 354482 308260 302503 325863 386939 422239 360767 291381 240818 197506 115887 85832 90777
20930 90777 63410 23119 21226 52628 51000 27158 37190 74316 77740 58228 55716 50936 53691
20917 53691 49879 47161 38391 28398 5593 10268 27139 64473 64661 68819 66562 71960 87237 66760
20903 66760 32377 30484 71827 91438 77413 64826 29692 8549 17740 55065 62783 73518
20891 73518 41054 3989 8082 17185 16765 25062 33142 34578 20215 -459 34904 80228 71915
20878 71915 48448 42291 43704 54491 76190 81653 92232 97774 85137 44987 45968 49095 74908
20865 74908 70066 55785 54209 58046 45768 55150 65814 64002 45606 42031 36352 38676 43155
20852 43155 28988 20934 17966 38261 36361 40384 22246 31022 33698 22882 10510 2471 4017
20839 4017 21899 52791 54407 49631 59137 69058 60478 33481 31501 58596 85906 67113 49712
20826 49712 36150 51249 77130 84298 86509 74857 68878 66008 62087 21478 -13378 -2909 -1724
20813 -1724 20524 26426 27412 31014 56061 94751 88125 84647 74184 40878 36925 30824 46752
20800 46752 57463 54147 35529 38047 35502 34397 41848 51639 57868 78850 87951 47422 33736
20787 33736 38103 37800 57561 50498 49860 71975 81477 92419 101903 91358 68718 66269 62804 69093
20773 69093 74416 45541 46523 67622 77326 76421 73923 75943 61313 76548 93050 96453 97692 106086
20759 106086 79508 61259 65725 86588 90404 76282 60393 91802 87675 75015 89902 100636
20747 100636 103732 83140 85144 94993 83086 54799 67033 92510 100187 56241 31263 54970
20735 54970 64768 80582 83870 79779 82818 66485 51698 80832 107709 96935 71151 81531
20723 81531 85934 102532 95114 66159 57054 44385 52619 64846 69576 54087 48817 59953 74264
20710 74264 78203 66386 54796 33263 33042 38008 16119 45373 72178 89226 134266 155693
20698 155693 134391 109927 92211 98049 75551 40929 40727 68405 88019 79531 63648 55219
20686 55219 53755 68047 84804 98150 60852 58065 78373 77445 75534 82747 99910 110662 109401
20673 109401 123962 130563 135876 141693 138435 126613 127568 150287 140475 138027 156784 155146 144426
20660 144426 145194 149332 133267 109641 110564 88046 66832 66976 92463 95857 119981 132824 146770
20647 146770 146373 147583 142968 131928 127944 117789 110026 122844 136079 153106 151544 142254 127372
20634 127372 92880 88378 104635 103747 114307 136757 141232 118355 108633 112952 85125 85368 96637
20621 96637 98777 101389 94902 80625 101499 133976 109715 93309 75643 72868 73034 86732 124056
20608 124056 163281 187586 205689 178052 192922 199890 200725 194227 209212 212850 219749 209643 185817
20595 185817 166680 167722 177999 194761 196813 204875 229643 236801 223512 257502 297501 323719
20583 323719 365223 394031 433148 530290 637873 738447 791857 808368 799636 735287 671110
20572 671110 626351 662882 777766 954736 1104031 1194110 1257235 1276180 1205736 1086299 941382
20561 941382 825274 774273 742873 774242 834018 865663 871293 879179 857629 830153 755357 638051
20549 638051 536277 483422 465263 497047 527489 561894 589887 597746 557452 476728 395930
20538 395930 369637 399091 416645 442800 467791 464586 422253 359048 299737 285159 265667 263137
20526 263137 284837 305142 313973 342804 391853 423706 431998 404188 384295 388994 430186 497451
20514 497451 560618 601053 621900 594984 586455 559083 538728 514405 536194 560581 595197 587068
20502 587068 564473 523233 474398 458174 456787 447012 460918 462406 450648 441578 456735 464318
20490 464318 475892 478141 471013 501813 519033 513461 536418 575479 605774 631212 649668 679511
20478 679511 688058 713004 744067 765422 789046 776837 818552 881006 942077 992518 1047104 1067330
20466 1067330 1091328 1120139 1151709 1193594 1295947 1454013 1602895 1673733 1701165 1732135 1792321
20455 1792321 1903547 2084913 2316211 2574834 2840019 2992128 3038155 3047251 3113290 3262972
20445 3262972 3496856 3817101 4177787 4479894 4729760 4893189 5039604 5296429 5699472
20436 5699472 6308770 7191695 8314699 9756631 11684419 14409684 18488487 24854659
20428 24854659 34820867 48527213 61275856 66624827 63798049 56734886 52061247 53267794
20420 53267794 61364051 76862377 97100355 114392893 119243014 108864255 90023596
20413 90023596 71698005 60170145 56141209 59030293 66943014 73207955 71509939 61954928
20405 61954928 49034488 38562150 31940738 28144475 26478769 26903576 29953598 36511236
20397 36511236 47569040 61298559 70820270 71745394 65661804 58535201 56515626 61988394
20389 61988394 75335326 92758942 106593352 112949328 109260210 97696197 82735510
20382 82735510 68578189 59724301 57874008 62668497 70108051 72351820 65902165 52947303
20374 52947303 39353129 29263068 22409398 17599555 14134550 11595430 9778959 8439726
20366 8439726 7454917 6780452 6300698 5970075 5809287 5795990 5923986 5977554 5804633 5458423
20356 5458423 5121176 4930735 4906273 4898791 4827589 4697449 4606701 4579445 4481067 4238442 3911890
20345 3911890 3636431 3541727 3595215 3601319 3447394 3097366 2658956 2277896 2044098 1885887
20335 1885887 1802007 1804043 1846488 1961602 2186526 2473078 2708643 2780191 2694086 2559716
20325 2559716 2573814 2708435 2829578 2835159 2730888 2621422 2629323 2727751 2746363 2620797 2433792
20314 2433792 2335006 2360744 2455231 2413393 2224754 1915887 1583003 1343856 1167302 1037449
20304 1037449 952797 852747 772189 732577 686631 653284 628544 579090 562106 557636 549663
20293 549663 525986 519402 494320 464495 458027 444700 437737 446854 446231 441306 411005 408694 405470
20280 405470 387933 386865 371483 366582 349231 361175 376863 407180 407449 409010 412447 386276 350367
20267 350367 352332 369768 398169 450358 503533 593696 683513 711423 653423 595380 522442 541989
20255 541989 604840 683564 753173 796463 818446 824524 837376 829690 766747 674449 588197 564234
20243 564234 599426 645776 686870 692341 663246 573866 452460 400792 382047 358219 343050
20232 343050 330167 317578 279656 238727 211239 198766 200972 208056 241315 279245 296067 303086
20220 303086 310508 317067 298020 267123 283937 295856 332932 415932 513540 586549 599897 563180
20208 563180 498224 443440 453771 512566 589577 659232 730148 809362 879138 957032 942825
20197 942825 842960 780043 745721 740735 792079 856808 914204 961297 962035 965281 962522 963757 937638
20184 937638 881346 780967 682705 611458 583182 583086 622875 668788 700479 707183 663672 608936
20172 608936 565701 506424 453462 430187 405963 406354 417313 402702 384485 370167 379916 384235
20160 384235 387997 354324 320477 336425 363030 370872 369296 394712 416122 433118 466637 465347
20148 465347 480449 485864 476506 482326 500419 509917 526457 553057 552159 544673 541950 526382 538298
20135 538298 550334 567841 574501 579528 585699 599873 631922 657832 680785 726569 767458 766939
20123 766939 775322 773384 775280 773205 768264 788040 815551 870222 915709 961337 999125 1050358
20111 1050358 1108366 1127464 1148212 1193451 1234306 1344067 1437301 1503647 1554403 1647201 1758111
20100 1758111 1871526 2031775 2170800 2312076 2553428 2881311 3275655 3646455 4042161
20091 4042161 4429092 4775226 5140714 5510564 5901676 6412586 7083530 7936274 9012998
20082 9012998 10323186 11915477 13978640 16774906 20821061 27357736 38348867 55391935
20074 55391935 74922803 89580537 98211842 103672141 105884042 101827766 91918575 81876455
20066 81876455 80628545 92989519 117637655 147171205 173281421 189861894 196565122
20059 196565122 193644414 180016692 155428516 126333721 101446422 88211694 89203739
20052 89203739 100353335 110892731 114760319 113976825 110665775 102402014 86835598 66301478
20044 66301478 47666114 34864435 26599761 20995151 17023993 14147548 11998938 10362250
20036 10362250 9121263 8163063 7355821 6655944 6079729 5544149 5090623 4697876 4317077
20027 4317077 3948295 3541568 3140485 2800455 2518024 2284477 2106692 1952087 1824721
20018 1824721 1720506 1646267 1574284 1509069 1429331 1353659 1280936 1218130 1161669 1089756 1026816
20007 1026816 1015957 987485 973291 956065 968229 1006830 975473 921007 886624 868601 819627
19996 819627 792613 787685 781336 761017 704594 654324 667989 655423 640548 639856 604401 565263
19984 565263 567547 545671 527600 479558 424275 414297 451008 463815 493794 499235 498552 467288
19972 467288 448320 455975 423249 400341 401163 412253 410764 414669 427435 434553 420467 406302 409099
19959 409099 406863 424318 443153 468326 464413 453635 430052 444920 452990 461979 483114 494762
19947 494762 488052 479243 470071 468943 431845 437698 432586 454232 462790 485004 501957 498630 498781
19934 498781 468755 439180 443572 417901 395270 394663 406811 426370 461989 462496 461058 464246 466247
19921 466247 482368 485872 483596 527337 590707 653459 772430 951506 1268868 1679481 1951507
19910 1951507 2014875 1951774 1926808 2182313 2617982 3064861 3311211 3161369 2733821 2261846
19900 2261846 1985826 1990142 2090643 2081873 1860714 1474602 1111471 845827 671340 539011
19890 539011 475002 428567 413294 405196 409009 413185 427765 465224 507383 533337 538384 518651
19878 518651 488485 489211 507407 527410 547648 568661 572766 564575 559879 624827 705377 732741
19866 732741 776076 875125 1056617 1367878 1836790 2340622 2642320 2672106 2580685 2631340
19856 2631340 2980833 3515544 3973797 4090834 3805951 3322442 2962204 2869771 2999318 3065363
19846 3065363 2861607 2406012 1884215 1487511 1253206 1115361 1061045 1017565 962567 871618
19836 871618 775605 760136 768386 795739 840110 871427 892742 881710 919517 970743 1029442 1067544
19824 1067544 1078437 1100341 1131596 1168553 1209665 1294904 1300847 1208483 1142286 1109758 1100394 1068151
19812 1068151 1052160 1055033 1063179 1034767 1013375 965131 868663 763066 678716 648471 661483
19801 661483 653419 659469 667013 703223 758879 773563 780596 798514 808821 829659 868502 917963
19789 917963 921071 961505 1018260 1055071 1112417 1191197 1292710 1424331 1607747 1753721 1829729
19778 1829729 1939500 2065833 2216199 2381608 2535671 2694092 2896028 3121926 3407013
19769 3407013 3759346 4133672 4488829 4853287 5342632 5986058 6848276 8051297 9822379
19760 9822379 12487296 16650752 23486821 35144767 52308456 67366396 71346955 64689493
19752 64689493 53241378 46320733 47191996 56561190 72864621 85926634 89281292 86379755
19744 86379755 85277860 87246701 83555545 72261575 57504416 47495512 45188835 50856059
19736 50856059 62722716 71138987 68530916 56262727 40699015 29280519 22123013
19729 22123013 17270314 13827432 11468203 9899232 8903204 8294891 7907457 7605086 7368430
19720 7368430 7300058 7458154 7720714 8033916 8482365 9078715 9750416 10684585 12138463
19711 12138463 14526911 18441906 25016278 36440945 54339790 72361278 79319298 74046738
19703 74046738 61787420 52904320 52270431 60565846 76785896 91821407 97032607 94971218
19695 94971218 93587914 96408039 93964036 82749502 66274630 53856671 50022210 54790474
19687 54790474 66838834 77266990 76283264 64146850 46632328 32615850 23700522
19680 23700522 17839727 13763513 10963055 9067320 7830411 7011541 6374501 5715379
19672 5715379 5030696 4362475 3789390 3330921 3024065 2849576 2706486 2543570 2414995
19663 2414995 2285948 2176023 2041491 1906122 1763365 1587050 1441275 1355089 1267230 1227026
19653 1227026 1199686 1166266 1116337 1110541 1141661 1211163 1302748 1321962 1266233 1180640 1092585
19642 1092585 1049534 1070003 1143724 1207075 1244600 1257276 1226179 1145400 1045081 963159 878055
19631 878055 842202 866091 887248 885842 848526 807855 718083 663905 642067 607800 561204 537099
19619 537099 541856 520770 471643 433375 422134 411399 405236 405871 429336 441000 432095 374173
19607 374173 356622 379570 382626 375132 326973 326706 330539 324859 311272 334606 342426 335247 309340
19594 309340 300349 291267 328763 311505 329886 341968 329457 290108 248039 251685 274530 293610
19582 293610 299441 335206 339646 337918 326176 296827 298200 293419 274798 293751 315184 302265
19570 302265 284275 264725 256085 256220 307262 359829 428103 561102 721679 801902 809425 782836
19558 782836 730601 658845 598672 569749 596356 705793 851406 990058 1101821 1180837 1183646
19547 1183646 1141846 1055365 893909 737399 673883 697679 728876 766981 794172 762156 738087
19536 738087 686124 614717 558782 490408 392538 350396 320210 276021 221876 208028 216623 241458
19524 241458 227887 203930 210865 209654 188625 148274 152678 189108 195737 194625 201477 211997 246458
19511 246458 256697 235723 218846 208124 221624 230932 250886 307028 387433 456412 518987 565595
19499 565595 575587 520499 454320 412309 406932 419264 455627 525968 606654 706419 880315 1070295
19487 1070295 1224008 1294292 1316371 1334521 1356161 1396387 1375798 1339659 1369795 1486764 1699235
19476 1699235 1990410 2296490 2536441 2609827 2510921 2256123 1949092 1707125 1561127 1474928
19466 1474928 1452928 1480427 1495019 1474447 1409795 1335760 1240616 1115089 949559 792322 722729
19455 722729 704758 727063 787554 846820 867452 852548 816630 751352 662276 585299 544665
19444 544665 523203 538274 609269 689305 752310 804597 809405 748960 676305 598257 556047 574383
19432 574383 584732 653583 745066 792432 763296 747718 801691 880079 991176 1062333 1037968
19421 1037968 906456 765316 678220 650065 667357 665896 608169 518401 426602 347030 309605
19410 309605 281774 260323 258774 249591 285711 315566 356729 416565 515709 536985 474680 395236
19398 395236 357896 345651 326016 300947 290060 344615 434446 518149 576563 580245 502216 433330
19386 433330 362743 284478 252011 215935 216142 218201 236394 205974 190857 220892 250413 228537
19374 228537 220038 213221 196881 211453 230347 241867 240927 236481 257559 254855 280729 274073 255131
19361 255131 254090 227088 236187 257989 259237 221309 214079 208541 201907 204127 194658 196565 203081
19348 203081 194825 167495 157609 188007 207947 194129 177904 139309 110923 112371 115517 142156
19336 142156 176827 198762 191548 159044 128352 144195 191811 211371 218699 242497 241988 215571
19324 215571 196019 191469 184334 195968 228745 263318 272009 295605 313741 316388 342678 367887
19312 367887 419794 460777 460582 467769 467671 453999 460732 491269 550064 593684 613698 600788 528458
19299 528458 439762 416092 451908 446141 454812 474625 453043 422443 390621 351664 332263 321575
19287 321575 290051 286068 243667 255152 275113 297744 314656 307475 301459 318881 323966 310826
19275 310826 302196 326562 343177 335179 344745 363312 385184 390479 404749 474274 513087 560772
19263 560772 618648 631977 621457 624242 683277 740878 836081 948507 1025249 1062239 1051037
19252 1051037 1005219 889339 797302 783327 821852 881890 949585 1010033 1001285 960177 906574
19241 906574 859168 852053 864586 925734 1011577 1078880 1097047 1083052 1082506 1056127 1035376 1007787
19229 1007787 995467 1005302 1006052 1049683 1163356 1216602 1223857 1188980 1161191 1135507 1126852 1142133
19217 1142133 1207804 1288866 1382491 1508221 1672323 1920320 2204770 2478759 2692441 2911338
19207 2911338 3122310 3278221 3437435 3620480 3795207 3975593 4163675 4339133 4547320
19198 4547320 4789965 5145256 5703528 6432555 7318467 8462970 10029821 12398430 16188702
19189 16188702 22620878 33456551 48471196 61640484 66140527 61345295 52518535 46904866
19181 46904866 48395931 58113327 74419266 90879521 102076355 104755350 97571034 83620759
19173 83620759 67387450 54450490 48664479 50726064 59109689 67261262 67477789 58379754
19165 58379754 44615988 32641157 24802423 19753820 16091136 13335537 11375587 10070699
19157 10070699 9277933 8856024 8728690 8755583 8713593 8569600 8384643 8301239 8380538 8727628
19147 8727628 9359227 10346536 11746978 13634746 16276237 20348021 27158145 38976456
19139 38976456 56768599 74752359 83389385 79713140 68816062 59939608 59092090 67911106
19131 67911106 85369657 105280164 120893679 128055004 123195413 108017528 87931709
19124 87931709 69991934 60196747 59864482 67704197 77513334 79864565 71141791 55293105
19116 55293105 39899189 29161486 22194426 17418104 14009466 11567667 9755631 8377299
19108 8377299 7332067 6598859 6101907 5745291 5435390 5058870 4606024 4176197 3826195
19099 3826195 3546252 3345054 3202835 3063589 2896288 2732266 2561351 2488568 2502282 2613510
19089 2613510 2744117 2734398 2639283 2458007 2288084 2156827 2145900 2284401 2475340 2661930
19079 2661930 2767650 2726832 2577393 2439270 2432949 2573685 2687492 2664798 2578400 2376577
19069 2376577 2075894 1814594 1700854 1701845 1701201 1713417 1791753 1933519 1993852 1945312 1763118
19058 1763118 1607387 1571442 1647678 1745943 1772265 1725986 1686614 1655954 1668099 1719815 1715875
19047 1715875 1641581 1505286 1343192 1259417 1240888 1241224 1267003 1326722 1365721 1336082 1260378
19036 1260378 1202126 1178531 1157302 1120028 1102248 1094910 1090269 1120127 1132490 1131403 1147630 1217000
19024 1217000 1305609 1363361 1411430 1418523 1437785 1514725 1659730 1891695 2254868 2729140 3064224
19013 3064224 3092690 2875868 2641452 2617449 2819471 3347043 4194147 4971445 5308649 5239269
19003 5239269 4934053 4548351 4052026 3608096 3369059 3416779 3672003 3822787 3738468 3490521
18993 3490521 3263430 3150325 3186757 3321098 3482219 3663732 3893778 4142742 4519352 5089940
18983 5089940 5929754 7326406 9268267 10733664 11086481 10571414 9913341 9987628 11084760
18974 11084760 13428980 16276072 17832860 17662936 16328533 15255222 15313475 16249823 17652342
18965 17652342 19462555 21762286 24547297 28023267 32766071 40124013 52448108 73797280
18957 73797280 109440421 156926606 198840455 226358726 230714048 211347850 180828181
18950 180828181 150097159 135525033 145346761 183116302 237267976 270869866 259862601
18943 259862601 210972533 152866786 110283138 84505845 68365500 57843811 51445315
18936 51445315 48521242 48897594 53156782 63220297 82736245 114968251 150884210 170484082
18928 170484082 169932994 159713658 162163053 189079525 225915632 251745968 252135594 222482052
18920 222482052 180618107 140068920 113265835 102531189 106968271 125879075 146323545
18913 146323545 147907689 128305828 96144483 68458915 50630172 39309848 31792038
18906 31792038 26736898 23300539 20833864 18970469 17127384 15077723 12902765 10932588
18898 10932588 9611221 8904288 8695989 8731568 8550372 7955381 7092497 6212134 5584795
18889 5584795 5094922 4700786 4440098 4275941 4110612 3907358 3714443 3605210 3586479 3653518
18879 3653518 3837287 4131683 4616491 5444093 7012770 9159921 10387066 9985558 8331810
18870 8331810 6543166 5507463 5130740 5236683 5945113 7621583 10239124 12077373 11805383
18861 11805383 9751410 7112797 5255854 4160090 3442802 2903302 2492133 2210308 1986867
18852 1986867 1782974 1603950 1521212 1450534 1383058 1327613 1298872 1276412 1237526 1188646 1112251
18841 1112251 1028944 968519 948960 933549 915213 898974 920934 925765 909405 898877 927607
18830 927607 950811 974585 980107 951983 941992 940453 947487 959873 959220 977553 975182 956731 952107
18817 952107 995282 1028779 1117955 1212646 1293626 1371307 1428757 1417212 1361351 1274993 1156317
18806 1156317 1060390 1035321 1020292 1021792 1046039 1092216 1091148 1076818 1002020 920763 863787 774584
18794 774584 741330 757106 795352 843529 868761 896794 878206 823620 793702 762645 725989
18783 725989 738234 799425 813486 820604 824345 842937 875340 891959 935951 966922 980973 1027180
18771 1027180 1076647 1142556 1263358 1427025 1591744 1763583 1915632 2071135 2253803 2481756
18761 2481756 2760924 3033955 3258013 3371075 3351487 3249511 3206455 3267479 3434777 3764958
18751 3764958 4205930 4728944 5339993 5970081 6655417 7538621 8789135 10626495 13416741
18742 13416741 17809022 25029628 36665885 52379860 67840538 82377811 96295549
18735 96295549 105099015 105250923 97964619 86093215 72048992 56788947 41461168 29681914
18727 29681914 21995962 16916377 13346433 10789289 8975714 7696632 6767583 6137223
18719 6137223 5703079 5426458 5308798 5365170 5594405 5930911 6275740 6636283 6929267 7085847
18709 7085847 7090231 6983057 6806380 6679830 6656202 6759360 7037384 7559455 8264437 9149155
18699 9149155 10229958 11614300 13458697 16076694 19898813 25598216 34585129 49179069
18691 49179069 71191103 97746416 123559143 147975997 168991524 179492892 175986978
18684 175986978 161252214 139920794 115290916 88926317 64289665 45839279 33671388
18677 33671388 25569938 19937364 15955977 13162648 11146024 9615701 8487820 7682056
18669 7682056 7126655 6768322 6620133 6598371 6653011 6758080 6863301 6918208 6865517 6708718
18659 6708718 6456760 6078570 5679108 5399080 5296485 5367266 5610286 6073077 6630691 7155456
18649 7155456 7713647 8442430 9576775 11337307 14041279 18246406 25173782 35727180
18641 35727180 47541094 58338264 69052914 77609880 80234697 76523319 68489558 58220812
18633 58220812 47001611 35094018 24823370 17860020 13342255 10232788 8016506 6463411
18625 6463411 5350737 4539563 3976133 3558003 3261503 3048026 2864682 2727419 2645511
18616 2645511 2547312 2470742 2434359 2357073 2232853 2080857 1904852 1681357 1470092 1360825
18606 1360825 1287841 1244563 1261609 1277348 1283741 1225949 1142296 1023132 928732 856864 813421
18595 813421 771876 729814 718303 695585 657376 645548 663642 677192 657356 613805 618916 630148
18583 630148 612092 609658 586044 566624 529899 517137 515691 502174 491371 498466 488681 470747
18571 470747 444748 445401 458481 425001 409895 419799 410934 389579 386785 417009 447934 454263 448089
18558 448089 414663 402074 416277 395356 385276 398046 434707 426869 380876 334208 309633 287780
18546 287780 286015 283939 339000 393657 451338 498368 486700 471082 458757 429098 396807 399309
18534 399309 401797 418978 443939 462510 453715 460690 452219 437877 396738 351948 306669 297318
18522 297318 320317 310694 274007 257669 252782 247895 255877 255939 266582 287543 300979 282795 290819
18509 290819 322286 326871 351364 370517 380903 354103 314930 262043 225508 215251 249596 280382
18497 280382 329361 385626 394365 374385 363426 360417 376136 376967 386124 386648 421278 451125 476241
18484 476241 466509 412512 378039 345181 312276 297750 309285 307985 315002 311475 327884 340848
18472 340848 383377 421958 459584 495625 487896 455207 406593 397967 412838 415060 426715 486146
18460 486146 583848 703705 839759 975247 1072944 1080252 1018881 993397 1003512 1070567 1211829
18449 1211829 1272559 1240287 1114127 980850 875776 856045 888435 890353 836990 736866 646307
18438 646307 617186 579367 530341 488742 467595 493170 549092 547791 499097 450828 419519 439291
18426 439291 496948 552193 610119 705678 803305 855288 835186 784348 728903 678825 629298
18415 629298 606030 601683 608636 679273 800198 886757 944478 992255 1028900 1072991 1081593 1048966
18403 1048966 1014351 943789 928221 984940 1098713 1207725 1197678 1119179 1033961 950284 906933
18392 906933 873176 822424 751086 696328 656761 637253 614872 590655 584269 575134 503319 432969
18380 432969 374927 323463 326645 350976 358916 393343 443315 513780 605974 671023 635322 569866
18368 569866 475949 401958 374270 384656 415145 457549 549708 613018 703028 724317 644226
18357 644226 537882 470346 377673 308493 298267 312810 324918 328016 329142 321816 312161 316830
18345 316830 310890 283091 317768 360499 370379 323000 272279 271184 292648 314953 331304 352159
18333 352159 377491 369683 369404 330382 310854 270925 262343 285390 304404 329042 363751 371082
18321 371082 341910 340856 340173 335749 316015 288940 284406 288914 260381 217409 240449 234518 259716
18308 259716 276233 275253 263643 240862 242882 288313 342943 378723 397046 459300 523411 519918
18296 519918 485482 428072 390843 352095 299337 274403 290197 285331 261160 257517 290060 294238
18284 294238 324401 316646 305331 301005 327576 356699 362297 358496 391290 406053 431585 487684
18272 487684 569670 621394 640312 696418 722783 693572 633773 550583 516461 491275 474560
18261 474560 483744 503482 505849 501579 494362 493728 504504 547260 580481 611896 670843 714830 781304
18248 781304 865137 947658 1046173 1237056 1478345 1694573 1836087 1874733 1873562 1887168 1896876
18237 1896876 1900041 1892559 1831554 1784269 1831740 1923766 2035175 2159627 2300267 2378662 2541546
18226 2541546 2840969 3251532 3907973 4969347 6034941 6441401 6100783 5344441 4724500
18217 4724500 4413770 4376574 4502445 4664886 4808673 4951354 5246493 5819615 6546537 7280198
18207 7280198 7932176 8708921 9829806 11571517 14152142 17883721 23000426 28699763
18199 28699763 33805952 38104151 41498067 44488181 47340802 49876350 51414595 51517538
18191 51517538 50010876 47310542 44036399 40194354 36160571 32163195 28450098 25740735
18183 25740735 24341066 24510353 25819735 27644997 29545176 31210286 33182436 36525529
18175 36525529 43028554 55142953 72057123 84847102 86053706 76383570 61588840
18168 61588840 49052566 39866713 32982944 27909639 24146135 21420663 19682259 19023544
18160 19023544 19171207 19309285 19026308 18648587 18921329 20244805 22135854 24156490 26530720
18151 26530720 29830269 34985474 43797034 58959143 79748731 98736595 112673820
18144 112673820 123902688 134120731 139608775 131257100 109624741 83286876 60996539
18137 60996539 45820080 35678006 28663880 23946976 20827165 18692542 17135883 16083379
18129 16083379 15625055 15766361 16353459 17210656 18478198 20555617 24151302 30372864 41134473
18120 41134473 59689450 88120998 117524748 130341277 121472640 99176419 79469480
18113 79469480 71633783 74403908 81442665 85714237 86988010 89175387 86987264 76534171
18105 76534171 59528400 41531451 30106582 23386339 18886227 15612870 13350472 12032957
18097 12032957 11485548 11428292 11716526 12503828 14155817 17342788 22607421 29939110 39894305
18088 39894305 52983009 63751128 64861454 55728499 41192768 28702019 20532451
18081 20532451 15232862 11544131 8900512 7090048 5902117 5145775 4632953 4279253
18073 4279253 3969903 3652391 3342883 3045051 2867543 2793578 2761409 2753129 2796894 2934033
18063 2934033 3209968 3822308 5019996 6729371 8112335 8263711 7125149 5350447 3887604
18054 3887604 2923853 2344410 1942218 1651573 1456258 1296475 1173673 1062958 974345 907143
18044 907143 858555 841960 794872 750585 742968 707482 676551 657520 621614 587953 552628 533262
18032 533262 535636 536484 527582 495298 482712 460952 456313 418608 423287 446029 440007 422474 422451
18019 422451 425170 444491 453294 436170 400836 349358 320865 326487 331194 277864 253065 253718 259300
18006 259300 229415 222960 227832 265945 297214 283828 288454 271433 269052 265098 271447 282118 312406
17993 312406 318479 323052 317858 286516 255795 259310 264945 266011 238415 191286 173418 185989 195444
17980 195444 195720 204123 183589 180633 174645 161753 157140 167913 180228 175475 156754 163743 180744
17967 180744 143466 128500 147027 186980 215022 206176 160208 129539 124946 115405 95260 61526
17955 61526 40333 74575 61998 74033 93294 91791 105445 122100 144277 173388 165538 151004
17943 151004 148866 131751 130468 115979 108512 86089 90975 123909 145877 129187 116475 94029
17931 94029 73522 66128 55102 22927 -3298 12663 18229 29770 73834 89459 70621 70215
17919 70215 60701 45914 58076 78525 91333 116105 142670 146918 132417 85911 64739 74328
17907 74328 94428 92896 99895 83646 80594 87191 89687 97597 101373 77823 67172 58172 57782 80162
17893 80162 74129 51973 68238 67004 62606 104617 98496 90048 80760 86680 107664 120321 89453
17880 89453 69749 80427 77908 80673 103385 92965 90338 80873 72443 71617 84561 66417 45018
17867 45018 37595 60734 72969 66956 63969 83779 89463 73706 95237 96714 78741 92026 90212
17854 90212 73154 51444 22482 25512 56587 55791 45292 67454 101918 99994 79235 87774 69044
17841 69044 52010 32979 19465 32890 64698 78155 34349 10501 37656 47843 53090 41761
17829 41761 44527 43829 40242 20279 5606 -17605 1790 23390 18410 44613 29960 22124 53938
17816 53938 53847 30960 15682 21433 31811 33021 9788 4113 18870 18747 14018 2857 33122
17803 33122 41980 31313 3831 -5176 -3576 -2725 17532 8109 8392 24524 24923 16190 -5015 -8359
17789 -8359 -7328 18544 18926 -6411 29997 54586 54674 24849 19057 -25511 -2689 35234 20830
17776 20830 15648 -6617 -23576 -23371 -8609 -20508 -13018 24533 35454 14166 20637 13860 18499
17763 18499 42325 24815 45580 42578 21005 14074 -5693 40957 62765 75197 85049 61391
17751 61391 39425 21781 2354 14525 18612 36908 43984 39693 47186 52668 37097 48624 6839
17738 6839 -8359 6826 23229 28117 43407 64754 80668 78444 45536 21644 6633 -3202
17726 -3202 -2999 3759 -7297 2319 13352 19963 27052 25375 36400 50330 70069 81392 88120
17713 88120 81067 44034 18123 80 24798 50682 70961 70761 63872 79698 75339 57898 48946
17700 48946 38390 52535 59137 72094 74780 90928 96575 99369 85604 82297 87588 93772 47441
17687 47441 63763 104614 119254 83848 61334 65457 79072 91564 108804 137556 168572 174531
17675 174531 164679 128103 80174 77596 98625 113073 137380 112206 102697 98533 83802 67601
17663 67601 67513 76726 79620 83382 88511 110386 136420 159120 142489 139718 171151 206950 227974
17650 227974 295647 373927 423448 404715 378391 321181 230006 180480 142718 104476 77605
17639 77605 87600 89093 84364 100797 96974 114692 127932 123370 113670 129952 153443 209594 266365
17626 266365 333724 372725 366582 327363 312438 313857 350917 445007 545832 597865 603935 541328
17614 541328 449336 330516 227419 195788 183618 138944 120455 104027 95884 72596 62182
17603 62182 61490 78500 85162 99153 132172 147905 208881 301271 422809 546253 607552 612615
17591 612615 567105 491249 463233 462932 420199 352391 276728 220478 188749 167620 109407 84951
17579 84951 80958 89901 70902 61986 26370 15326 18041 4576 996 35698 58265 103157 136850
17566 136850 174649 220073 313133 340940 341154 305135 266401 221299 165136 145610 93854 47822
17554 47822 11804 14545 10928 9117 4615 6868 15250 44385 46037 11531 14416 19699 7507
17541 7507 15434 30836 10539 2332 -19603 -38253 -50114 -32516 -4829 -5195 -3897 -15136 -3282
17528 -3282 4569 4702 -18328 -28591 -9074 6633 2871 3453 8037 -488 -1988 13392 4217 -1582
17514 -1582 -10000 -12569 2364 11123 -3500 -12433 -37514 -35978 -24155 -8412 22506 48104 55025
17501 55025 50718 52976 38385 18305 -5188 -30568 -24883 -25296 -6412 14485 32949 26755 7041
17488 7041 20906 598 -11511 -6159 -1236 -18 10862 -13984 -25676 -24349 -26296 -25842 1466
17475 1466 10691 19684 6617 -14269 -20061 -3054 18297 6453 -4896 -31793 -38891 -45351 -50949
17462 -50949 -58758 -23461 -14737 -30754 -38325 -24019 -23079 -33308 -30790 -29139 -9993 -6205 -10657
17449 -10657 13507 23380 -3009 -8730 6896 14892 67581 117738 209458 277360 273155 208285
17437 208285 127267 85790 66706 49852 37548 20916 -147 -10805 10483 27738 34187 30172
17425 30172 642 -5906 -19633 -22451 -25253 -34760 -20347 -18250 -8402 -9178 -26931 -40549 -43308
17412 -43308 -42754 -37522 -27539 -11203 -16550 -30261 -36882 -25851 -7555 21121 19070 -3214 -3946
17399 -3946 6724 4654 11252 -5187 -514 19503 28555 13305 3887 -1244 16284 -2471 -23460
17386 -23460 -47643 -39535 -3548 15953 841 -33180 -19617 -9767 -4852 -18512 -40302 -19557
17374 -19557 11340 21795 10259 3030 -13642 -3778 895 1820 -20438 182 20569 370 5843
17361 5843 10944 -1255 -15650 -4751 2421 2763 6030 17639 39662 51536 46809 42077 11623
17348 11623 -7313 -21084 -14570 -30246 -39036 -49053 -65100 -65334 -54767 -42183 -23826 456
17336 456 -2979 -10540 27175 37521 3736 -2866 15142 5624 -20072 -34920 -67775 -92095 -78010
17323 -78010 -24247 3436 -4481 -22067 -8765 5485 3922 -24067 -24061 -24896 -15765 -28492 -32983 -21275
17309 -21275 -17952 -2941 10959 23389 18471 -10822 -50926 -58368 -33334 1597 6043 927 15813
17296 15813 31819 17985 8068 -10334 -16283 8409 18157 -3446 -8431 -21482 -13332 -20279 -7238
17283 -7238 20701 12941 -15546 -22001 -33380 -30698 -53516 -60559 -22453 9277 4663 1035 16736
17270 16736 12999 16232 -11521 -7677 5858 -20956 -61408 -72486 -63819 -45828 -18364 -20395 -46764
17257 -46764 -28789 3473 13486 16072 32538 27596 -3806 -5419 -18450 -16310 -18393 -48098 -40975
17244 -40975 -4764 5342 -4845 -14896 -45835 -53597 -70745 -73205 -60141 -44998 -54855 -63170
17232 -63170 -59927 -58893 -20974 -1406 -5413 -19259 -28487 -5975 -24256 -48066 -28590 8977
17220 8977 -713 -17616 -19315 -43625 -60098 -58604 -42012 -36707 -40394 -35197 -35547 -19194 -624
17207 -624 -9587 -3963 4130 -1249 -11095 4718 31102 49093 58931 53195 38906 9110 12354 33852
17193 33852 23078 34500 6748 31075 31773 13485 17496 11561 7891 -8124 -26765 -41864 -43841
17180 -43841 -26849 -31793 -29201 -46306 -32137 -14395 8910 20468 21879 -3151 -5138 11056
17168 11056 18621 20899 8652 -35562 -36794 -31777 -41948 -35797 -19456 -5026 -8411 -5222 -2743
17155 -2743 -8627 -9939 20736 36567 16275 3212 1588 -4627 -6962 7501 2162 -4861 11602
17142 11602 40897 24260 -3032 26868 46470 1774 -31634 -31811 -4655 1430 -6189 -9104 -18111
17129 -18111 -26326 -20775 -26556 -15549 -15768 -7843 -24701 -23251 -22733 6655 19059 3391 -9499
17116 -9499 -10352 9303 -5489 -12196 -238 20425 1499 1426 20130 50699 16304 -24223 -25414
17103 -25414 -29329 -41983 -47769 -39958 -21367 9329 24464 14879 7845 -546 -8100 -36023 -41600
17090 -41600 -37851 -7877 13024 17772 14946 5510 -575 12082 -5872 -23696 -13724 -4614 -483
17077 -483 -13696 -6970 -568 -14060 -24750 -19322 413 -5039 -16467 -8220 6163 33733 44557
17064 44557 30150 30335 40130 32093 49227 36363 -6061 -8558 11974 8998 19453 2570 -19178
17051 -19178 -33735 -33088 -11078 3000 -5457 -2825 14772 25549 36668 15651 12613 -13011 -43294
17038 -43294 -37524 -20600 -33789 -35844 -30120 -37099 -20478 -5894 -10986 -24005 -36187 -14948 -9010
17025 -9010 -32885 -27533 -15338 7512 21202 25173 33151 -114 17788 13481 12918 21082 35269
17012 35269 36969 15978 22039 21659 -7651 -4126 25783 26227 30345 41379 29261 9680 -10040
16999 -10040 -5107 23224 15654 -9622 7167 32493 27967 14483 -6967 -40333 -32552 -7860
16987 -7860 -13050 -57474 -64324 -69340 -47241 -8651 8651 4342 172 -11173 -21360 -31740 -8057
16974 -8057 -34684 -45825 -42938 -6359 -25018 -41745 -35757 -27818 -36024 -22521 -17461 -6549 8802
16961 8802 22935 36641 61587 57937 33579 29630 4209 -22122 -21374 6089 30 23767 34407
16948 34407 45581 51544 29017 -3202 2519 12641 18131 17318 5410 12800 4777 -17614 -40224
16935 -40224 -18628 8731 15296 10223 7475 -28211 -14284 3473 9723 42508 18290 3273
16923 3273 -14821 -38991 -7870 12265 -35395 -42140 -9804 -18035 -15422 16360 5845 932 -1909
16910 -1909 -32632 -40992 -29156 -37584 -51216 -42922 -30185 -11048 2173 7106 -17499 -16238 -33928
16897 -33928 -8754 -6017 -12019 5025 8899 2513 -14114 -27261 -14168 -1375 22759 4227
16885 4227 -21229 -33619 -14809 4619 27577 24565 23531 34072 30371 19106 -15211 -13715 -17233
16872 -17233 -44883 -29393 -23803 -23403 -918 7414 8052 2764 -13757 -139 -16010 -15721 -35096
16859 -35096 -60965 -48056 -41301 -423 -13445 -53370 -40947 -12306 -1323 -9147 6962 32920
16847 32920 49967 54623 52722 50990 64498 52856 48721 45610 42383 33636 19592 17753 30210
16834 30210 39687 -4303 -12689 -6912 -23124 -15977 33498 28771 -26574 -45510 -45683 -25070 -24142
16821 -24142 -1480 5569 -13759 -18706 -8827 -21602 -42193 -27123 -38053 -51624 -68769 -70277
16809 -70277 -53989 -46731 -57454 -64700 -53561 -34475 -19482 -31989 -54708 -70959 -43699 15433
16797 15433 35735 20350 5063 -5120 11915 37543 23342 18368 11052 24301 585 -12807
16785 -12807 -6045 9977 -872 -20649 -11899 -7862 10134 18140 -1635 -29508 -11798 12634
16773 12634 5865 -13946 -1656 15514 20844 22466 15563 22601 33849 11607 -8842 9798 17811
16760 17811 14303 -9429 -1002 1999 -34213 -40202 -22411 -15092 -13863 -14017 11115 -7645 -36265
16747 -36265 -36308 -48311 -53531 -51741 -32352 -2749 -61 -16917 -8174 872 14311 29491 25505
16734 25505 -21624 -37977 -58152 -45774 -35011 -5483 12820 8182 -12461 -17332 -12791 -8194
16722 -8194 -9440 -22291 -10480 3327 1408 3190 -9147 -13180 -14545 -26534 -15407 -30732 -39213
16709 -39213 -4299 2032 17966 29047 -5739 -8774 -720 -10958 3298 35030 40401 35140 31140
16696 31140 15376 5412 19419 22563 -11579 -28109 -17778 6225 4406 -6287 915 -8247 -1423
16683 -1423 3728 -6686 -28909 2441 32433 41424 41136 9028 -28450 -7257 18268 19880 7970
16670 7970 21916 36338 35085 31590 14856 18424 7392 21744 9453 14823 22391 12370 -18483
16657 -18483 -48973 10036 44177 36779 5809 -7448 9809 10365 -1164 26517 13454 12919 -5751
16644 -5751 15788 17855 3617 -8590 -23152 -33588 -37979 -3585 8658 3779 -4952 -28968 -18386
16631 -18386 -5608 -18688 -12578 468 -17044 -16844 -2109 -3257 28200 40588 -1073 -10730 3918
16618 3918 22646 25470 19318 12041 -3997 2970 -42276 -35940 -18565 -24500 -12704 -13635 -12008 -20608
16604 -20608 -3205 9815 -1901 13154 49513 31075 2846 -660 35921 29716 21890 14018
16592 14018 -14635 -32600 -31307 -33108 -15752 -13580 8897 33297 29734 24924 15006 24470 56667
16579 56667 47760 -14780 -17549 -21221 -15558 6224 8781 26285 6210 2567 -11896 -14051 -1200
16566 -1200 2863 -27998 -36121 -1192 23494 31634 59519 79973 107281 78687 37259 7694
16554 7694 10138 39373 44719 38742 31063 25764 5049 4018 257 -5862 16394 29444 7062
16541 7062 -5658 -18011 6748 20212 20842 14108 18456 21816 -7701 -33376 -47872 -33130 -28560
16528 -28560 12445 29420 14524 -273 5133 -16881 -20645 -14653 -25858 -37342 -29211 -11497
16516 -11497 -28146 -22341 1167 2149 -32425 -45792 -14758 9113 24412 11987 13242 -8253
16504 -8253 -4892 37742 50505 38494 54831 54601 18147 -21703 -40540 -37962 -28159 -34369 -26721
16491 -26721 -25801 -4352 -15179 -36970 -39394 -31415 -35720 -57838 -37806 -5844 4031 -257 -38096
16478 -38096 -41189 -8791 6923 -11301 -1069 939 -5611 -18841 -25139 -17486 18032 18264 -30670
16465 -30670 -48524 -43221 -32286 -22466 16877 18612 21935 38088 10736 7556 -8934 -29277 -14495
16452 -14495 -27123 -46403 -47973 -30028 -17868 -16538 1631 7485 -16292 -13964 -14312 -16316 -30472
16439 -30472 -54995 -49654 -35970 -24935 -33090 -16356 8026 3668 -18306 6103 39920 35421
16427 35421 19440 30189 9083 -15031 -39790 -21782 -2713 -24494 -34994 -62980 -30361 -11184
16415 -11184 -7466 13222 11244 20025 20025 13898 -3113 -3283 10460 939 3818 20759 30152 24265
16401 24265 9739 -17832 -44646 -26666 -15156 -3197 3614 -9021 -5718 -11510 4897 29174
16389 29174 43067 13677 -5729 5422 7764 -1841 9953 25896 33840 28915 -897 -15759
16377 -15759 -7452 -7745 -36127 -69585 -29166 5511 15092 17946 8655 -9942 -21520 -5332 16156
16364 16156 36918 17777 8318 6850 12694 10771 13724 5826 11553 -8572 -31218 -10647 -32930
16351 -32930 -46088 -60520 -47212 -39139 -23556 -16198 -29002 -26292 9298 14714 -12770 -33033
16339 -33033 -9728 -11166 -27921 -15083 -17283 -12014 6505 -3847 -130 17830 32540 18536
16327 18536 3371 3645 361 -12204 -16419 -3066 -5893 16947 18418 -12929 -30761 -8650 -8101
16314 -8101 -16502 -8658 -861 -14729 -33859 -5998 -2157 -11576 -32824 -24936 -269 2021 11765
16301 11765 18003 23706 15475 25616 28741 21273 -8656 -36828 -45648 -16490 -11353 -37030 -43766
16288 -43766 -22516 -27127 -45288 -38033 -51869 -78437 -63521 -27928 2719 2432 15271 32351
16276 32351 19277 10797 -629 -6394 -3162 14281 33015 34202 39432 33100 3502 6299 17116
16263 17116 32199 24283 -11572 -22230 -19108 -5688 6522 18271 11914 9665 18775 8827 -549
16250 -549 947 5277 -9936 -19842 -24429 -7303 7289 -4285 -3526 1698 -7909 -12065 -663 -21427
16236 -21427 -29005 6116 12986 2708 -6331 -10066 -27987 -17963 -3599 3186 15093 16174 32234
16223 32234 47899 37315 27499 12159 9828 27460 5531 -5900 -9973 -5912 -19356 -22736 -23578
16210 -23578 -12794 -4909 6078 -15313 -11640 -19695 -12112 3610 6931 -8272 3758 1162 7000
16197 7000 12682 619 -20836 -15368 29116 54184 56257 38901 38469 28154 44584 16431 -40473
16184 -40473 -34288 -12678 -12257 -1802 1497 2463 199 -1163 -14523 -37691 -37320 -44221 -56976 -46833
16170 -46833 -28187 -8257 -39224 -68171 -65785 -63171 -39777 -32848 -14151 232 22089 6068
16158 6068 -13291 -15304 2041 685 2643 -1094 -24849 -35113 -40791 -42957 -35661 -480 -1413 -10057
16144 -10057 -31097 -22199 6808 17783 6283 -25648 -31078 -35073 -31043 -22995 -16216 3818 23364
16131 23364 26966 9994 22195 9353 4126 -5273 -11748 2340 27377 27725 14755 -1068 -14779
16118 -14779 -10496 -29210 -21715 -14164 -14462 -32916 -29119 -6860 -4384 -28869 -33159 -12914 -975
16105 -975 3136 -19320 -29899 -33338 -29819 13078 39276 29163 47249 37704 42078 25607 -3124
16092 -3124 -20294 -8508 7581 -1934 -17569 -22831 -29054 -57873 -61775 -71176 -38444 -22141 2803
16079 2803 -9017 -19503 -6344 1862 -16277 -32214 -26305 6333 -7298 -12639 -4892 -34783 -52502
16066 -52502 -59618 -62857 -59626 -65803 -68317 -41361 -6975 -29780 -61073 -49836 -20686 -22273 -27420
16053 -27420 -27602 -31962 -41128 -22191 -21730 -17354 -15555 -15847 14070 38442 36417 10633 2422 18433
16039 18433 15075 11960 21135 30261 24309 11442 13415 12720 32562 21528 9048 11842 10995 35723
16025 35723 45098 19920 7156 -4957 9196 24609 14338 -8094 9960 26556 18219 13742
16013 13742 28494 52966 43418 20978 16389 -3222 -28193 -41347 -16026 -7420 3807 -13062
16001 -13062 -23564 -7295 28263 29591 23535 10343 -5474 -4082 -18462 -10404 13345 16117 -1582
15988 -1582 -38206 -39415 -6457 25673 17113 7977 27512 38945 21107 1588 -43184 -78018
15976 -78018 -53033 -8257 -4555 -5783 22920 7346 -23972 -21270 -5113 -832 -21578 -44806
15964 -44806 -57008 -59194 -31292 -3519 -12740 -18600 -25806 -33982 -29289 -32982 -14485 6537 -8442
15951 -8442 340 12722 6289 -7053 15339 -16696 -32309 -15169 -15267 -9505 -8885 -1185 5892 1735
15937 1735 13541 18099 -10463 -20697 -12089 10333 -16598 -12222 -8563 -15649 -7961 -13524 -11557
15924 -11557 16232 33299 30033 38509 43688 37897 15485 5638 -16467 7507 29277 32007 32283
15911 32283 53861 25929 -16429 -11403 -21048 -4281 -18343 -4337 8105 12918 7630 -2604
15899 -2604 -8162 -7832 6338 41060 29256 -13892 -38451 -39260 -3266 8612 23813 33560 16190
15886 16190 12385 29053 33493 57959 29752 5762 16338 21171 5096 -2933 -17097 -42345
15874 -42345 -27622 -42797 -45885 -39817 -25137 -2595 -27405 -25720 -15273 -14075 -25711 -56493
15862 -56493 -80759 -60321 -37030 -27062 -8223 15387 4193 7970 -6812 -18331 -30291 -29014
15850 -29014 -2583 -130 -22325 -35320 -56007 -44604 -20791 -22966 12369 52555 39994 17058
15838 17058 36569 46082 41541 35985 32986 15771 359 29556 45566 27547 -463 14940
15826 14940 21890 21321 13987 11636 -4462 -34529 -53447 -31940 11376 27418 9310 -3352 -34384
15813 -34384 -44462 -35367 32 17272 16420 -4886 13823 3848 -18908 3787 20260 23055 13734
15800 13734 -2356 -13351 -1997 -11570 -32079 -47803 -41530 -21259 -345 18900 32448 13663
15788 13663 24611 18547 -12446 -8646 -5638 -2230 1272 -7818 -19869 -29129 -52954 -26499 -27463
15775 -27463 -21010 -11913 -21363 -14627 -43687 -58534 -35246 -14223 12382 790 -2016 2732 -882
15762 -882 10908 28132 20329 -27960 -54545 -63664 -6273 -4953 4039 22615 25163 37059 40729
15749 40729 40841 -2877 -22464 -23451 -2948 -12871 -6061 -13613 -5280 -12083 -43954 -24845 11177
15736 11177 28471 38313 36997 -2650 -12170 7994 13810 -6075 -3984 20689 27196 13126 -4576
15723 -4576 -22688 -26523 -19358 -31635 -42284 -40984 -31649 17396 19474 9852 6513 1389 -40172
15710 -40172 -60990 -60360 -45149 -54204 -54557 -31530 -5517 -258 -1846 -7832 -7101 3103 -6723 8309
15696 8309 9324 4201 4992 1334 11350 24001 47614 36248 13477 4438 -6001 -7182 -9897
15683 -9897 -17114 -32924 -43127 -62377 -46417 -41021 -49981 -34206 -35971 -40396 -38229 -1171 25454
15670 25454 45322 54997 32581 -3478 738 6159 -32806 -29252 -24846 -38557 -36132 -11334 8859
15657 8859 16396 14485 -6778 -4810 9618 45884 60774 52830 54947 70672 69513 38598 16245
15644 16245 -12119 -8190 4608 -241 11065 32375 27963 -499 1979 10847 671 10034 -1618
15631 -1618 -16415 -24553 8507 38801 34874 97 -657 13035 11590 -12434 -49408 -50044 -50566 -41606
15617 -41606 -17665 -8810 30493 20074 6227 -14258 -12715 -4940 -23574 -29556 -51751 -37644
15605 -37644 -50075 -82136 -73615 -68311 -56397 -64717 -62225 -30382 -13965 -36 16011 36012
15593 36012 56995 47694 20685 25800 5464 13947 24224 14663 11983 5062 -2734 -17484 -22704
15580 -22704 -8996 -3964 4666 5636 19927 5506 26033 19575 6283 4026 17429 3330 -15837
15567 -15837 -7261 12865 16463 -9551 -15065 -10735 -24385 -13392 2402 3721 666 1081 -5788
15554 -5788 -24427 -46741 -49294 -16875 -19480 -36121 -8799 36579 48159 35149 9690 20672
15542 20672 29211 7640 16114 -12725 -31053 9647 38296 15785 -13811 -13822 -33073 -29897 5147
15529 5147 20345 39906 34420 19641 7741 11337 2648 -15915 -20677 10109 12876 29581 48169
15516 48169 30175 13492 11933 16502 5284 -1767 15825 28333 25222 14827 17056 5569 7809
15503 7809 11552 -472 -29669 -42997 -37061 -33879 -5963 3701 -10840 -35403 -23405 9882 23207
15490 23207 3026 17342 7390 -5498 1049 -7790 20619 42756 51638 27345 -25995 -41916
15478 -41916 -26281 -19910 -25024 -33420 -22286 -21520 -21157 -1699 5383 18543 21273 28390 25733 36498
15464 36498 49303 22235 15743 15622 36795 14167 -13825 -12441 -13395 -18547 -35949 -46776 -33965
15451 -33965 -36122 -28395 1209 13340 3085 -2941 -12751 -29525 -31083 -17505 84 3305 -6814
15438 -6814 -2087 6248 13033 7091 -1682 -5151 13503 44551 54474 44417 32507 44652 51443
15425 51443 20096 -6375 -2124 -5323 -6445 4469 8610 -3490 -19090 -26083 -19685 -2775 -12270
15412 -12270 -10623 -2793 -2847 -11622 -19151 -34787 -18922 -3308 -7878 -29662 -50079 -37565 -9328
15399 -9328 -19970 -48580 -37296 -33661 -26136 -1578 25259 14872 12642 9316 -1117 5823 -3946
15386 -3946 -1449 -25050 -42494 -38413 -16957 -9501 24321 27803 4307 -10937 -29522 -18953 -7780
15373 -7780 261 1518 -12575 -34128 -11315 4578 17656 3635 -8656 1941 24289 51670
15361 51670 46603 43693 25119 13243 -2494 -39666 -27831 -21803 -829 15992 4101 -9690
15349 -9690 5043 17735 13260 253 -32517 -38096 -12512 6836 35193 50066 44536 43619 24199
15336 24199 20214 -944 4624 67 -16026 -17119 -4424 -8611 -5896 -3329 3910 19901 29043
15323 29043 46731 24227 11163 2592 -16694 -13705 30615 53758 31117 -653 1275 -26017
15311 -26017 -36948 -43604 -15058 -3436 10276 19993 46598 52332 45686 1869 -20296 -38387
15299 -38387 -19584 -11203 -11478 -1962 5048 14356 18926 20551 15444 31114 44036 55941 41631
15286 41631 21456 12066 -6745 -12203 -7334 -9227 -15340 -4555 4000 6196 -1658 -11248 5151
15273 5151 4065 27639 53500 40807 -1645 -21263 10315 35695 62354 74010 80593 62148
15261 62148 51514 21163 5395 -8459 -23978 -46272 -36688 -22209 -29490 -25108 6685 14072
15249 14072 9965 10903 11714 16718 -3905 -25003 -52912 -44471 -16641 1873 2208 -24395 -52484
15236 -52484 -48248 -19305 -31806 -33842 -26093 -29991 -43370 -27798 -33366 -27202 -35999 -38725 -29490
15223 -29490 -7896 -8034 -28724 -35924 -30689 -1150 18670 37356 30753 36815 24351 11411 25615
15210 25615 27280 16207 9220 25011 34890 32013 19731 2580 -10977 -29157 -14079 -11317 -3695
15197 -3695 -23497 -32968 -23358 -32163 -20495 -31987 -37793 -10808 -1303 2379 3974 6111 13770 20636
15183 20636 -6525 -37770 -59360 -66511 -56539 -40024 -43822 -44049 -40906 -46716 -31096 8314 12564
15170 12564 3321 -2796 1551 4776 12365 -8167 -1888 -9535 -11809 -14428 -1827 5577 -9310 -40170
15156 -40170 -30959 4377 11023 31836 39340 17267 3281 3272 -2890 8144 42694 32167 35356
15143 35356 22111 -29450 -47254 -45217 -14254 -14686 -38021 -26398 -31190 -62072 -68910 -43812 5161
15130 5161 16349 6344 13767 -31963 -36759 -16838 661 6483 2155 -12557 -11962 -45778 -40205
15117 -40205 -30393 -21202 -10554 -22808 -32505 -20677 -8024 -13170 -30229 -12806 28251 47521
15105 47521 54069 44309 26850 27662 21142 -6527 -34452 -4255 -1517 -14740 13897 11714 305
15092 305 -16619 6688 1449 -23899 -25961 -23054 -29561 -7583 20287 14208 2277 11299 10311 14270
15078 14270 25526 2405 -17007 -35714 -21231 -14246 -31486 -22437 -19887 -16322 -11731 -12736 26256
15065 26256 71355 68920 57771 44009 35488 35860 35726 30197 4859 -22881 -2484 27566 30865
15052 30865 32332 14313 -3990 -1716 -12784 2815 -8161 -10594 8972 25612 16458 5936
15040 5936 25907 30201 12751 459 -15459 10423 14964 11215 21436 7834 4088 11820 -15409
15027 -15409 -38998 -51621 -35675 -24293 -17162 1381 11380 -1342 -28603 -51579 -79446 -81421
15015 -81421 -50410 -8179 40724 51713 51213 47230 55021 30806 19348 48761 46034 10025 -16181
15002 -16181 -31348 -12129 -5544 2404 8597 19832 39805 30858 -4187 -9197 10567 10555 7072
14989 7072 3062 6630 -3241 -10077 -14593 -56900 -76985 -36754 -19316 9252 25314 13195 33899
14976 33899 35649 39730 34499 -4957 -38569 -8970 -7621 4997 13507 1045 -6351 7499 4500
14963 4500 4069 1595 18608 43891 47464 64154 50855 52839 51341 43071 24514 -295 -41026
14950 -41026 -41486 -24275 -16356 -6293 -8893 -12365 188 31470 24029 -3665 3036 3128 6504 -24608
14936 -24608 -31439 -15498 -889 15496 1480 -17180 -2256 1635 -2345 -3565 8120 31312
14924 31312 25592 3523 -31828 -24722 -17029 -23764 -9261 9340 10645 -18558 -21411 -26625 -10431
14911 -10431 3372 17563 22891 4246 -14890 -11878 -13328 15976 12955 545 -7845 -12578 -3708
14898 -3708 6530 -7290 -17407 -22464 -36443 -44633 -59131 -69692 -81825 -80295 -58315 -27150
14886 -27150 -14527 6616 -1866 -7675 17787 16550 6737 4561 -1661 3855 -7011 -9351 9291
14873 9291 14532 13542 13254 6283 -2410 -12929 603 -26409 -41166 -21144 -11475 -6249 -9381 -8773
14859 -8773 -12937 -17711 -26135 -26593 -48189 -48161 -77525 -51481 -21359 -15426 20001 35474 47998 38803
14845 38803 5413 -28137 -32982 -17185 -2876 -10388 -7002 1789 -12132 -23985 -35021 -36870 -29605
14832 -29605 -16219 -10702 7203 20229 3101 -4997 -19048 -32103 -43072 -51860 -71053 -54748
14820 -54748 -37615 -9997 -13002 -17217 3222 14416 23081 32269 39498 15474 -23003 -34025 -32763
14807 -32763 -36699 -23831 -26811 -20546 -11821 -43440 -48518 -66430 -60860 -45752 -11234 -33307 -33319
14794 -33319 -12180 24572 31009 24483 9033 -4542 -17641 -27166 -20760 -7196 -6641 10930 17120
14781 17120 19965 30278 33272 45410 39774 36858 32238 11347 13165 46518 58426 59081 44479
14768 44479 22637 -8820 4500 -4566 2567 -981 4187 4905 -16670 -26531 -25012 1793 732
14755 732 -27848 -31626 -39242 -39095 -55218 -42335 -26214 -43196 -48529 -9594 35571 41108 15868
14742 15868 -1248 -29602 -23190 -2112 8820 12332 20450 15467 -7301 -42897 -34824 -30002 -33990
14729 -33990 -39618 -45230 -21993 -29364 -35331 -44304 -50049 -29797 -36459 -39091 -19878 2337 12232
14716 12232 -12780 -25930 -15942 -25644 -42850 -69885 -43835 -64541 -43113 1360 26693 12683
14704 12683 -5816 -24529 -34382 -18946 -15060 -4666 14443 17062 23879 29232 12254 -7257 -38406
14691 -38406 -83827 -75415 -62654 -64314 -42548 -30803 -23474 4152 13164 13345 -10836 -22782 -33244
14678 -33244 -43821 -54160 -34587 -21349 -11605 30390 50552 10529 -3354 -7104 -21313 7521
14666 7521 12732 13548 44266 37866 -2660 -17965 -28549 -34196 -18182 -30281 -30249 -10077 -3057 -29944
14652 -29944 -60907 -52105 -39442 -24321 -38291 -22825 -34513 -42676 -33852 -32324 -27271 -31563 -33569
14639 -33569 -48249 -55768 -41498 -42654 -44985 -54996 -30664 -8714 -12309 -5032 11279 10270 -16094
14626 -16094 -34569 -18876 5522 7257 -8559 -45552 -41128 -23696 3021 15684 14780 24007 30417
14613 30417 32032 131 3932 24673 28821 25567 28741 14543 -5303 -32023 -6412 9253 16475
14600 16475 17358 33519 25767 -1568 -30016 -30544 -13422 -3987 -13902 -19591 -10012 4774 25896
14587 25896 21973 -11859 -10451 -19841 -37596 -10059 14996 30510 45535 54767 43567 13558
14575 13558 129 12847 -772 -7385 173 -7389 -21017 -23007 -25459 -21582 -40493 -45543 -47515
14562 -47515 -32280 -22071 -20194 6238 33645 29628 1421 -9029 2743 3017 -7294 -2273 12051
14549 12051 19819 32646 47123 29335 22298 24412 12797 5831 22977 25958 30210 13090 26282
14536 26282 18852 -467 -3438 9204 4604 -18369 -28298 -14793 -40820 -53157 -49933 -50660 -42272
14523 -42272 -55319 -33722 -19685 -15988 -9444 2924 2465 -4033 -6615 -15570 -43758 -23455 3081
14510 3081 4561 -17803 -16686 -19051 -32549 -60249 -85741 -92426 -56336 -29886 -13785 23312 34956
14497 34956 8219 333 34086 54155 23220 -5114 20229 26249 19770 8292 -5481 7386
14485 7386 19825 2791 -5653 -37281 -47189 -35189 -18273 20 -6971 -23216 -21958 1969 -3943
14472 -3943 -19757 -29226 -38215 -25311 -22434 -2350 7104 -12949 -3555 18796 32232 45797 46552
14459 46552 41541 22277 5446 21815 18987 18874 8091 4321 16885 35954 22466 -3464 -6940
14446 -6940 -37383 -34737 -14034 -512 -8757 11254 6393 -4825 -8199 -8371 -2866 -26115 -33316
14433 -33316 -22278 -11615 -5131 -4556 -25104 -58629 -48155 -15740 -3314 4764 6628 13930 -2837
14420 -2837 9495 28702 19663 29440 -2783 -7694 18994 56560 56264 35675 22826 -2074 -2479
14407 -2479 -69 5394 10623 24398 22677 12629 -8757 -18141 -50508 -18129 -3402 14303 60427
14394 60427 60715 11472 20209 26879 3015 15021 65513 62826 56361 49081 16101 27841 31169
14381 31169 11266 1637 3689 -14739 -31192 -37870 -28880 -28113 -40281 -42133 -43501 -21245 27954
14368 27954 30075 11379 -19441 -20683 -791 13649 25877 19419 13777 12926 20564 12417 3664
14355 3664 -2723 25368 22945 -10277 -5788 20220 5159 25274 5815 13847 36907 20592 638
14342 638 -13522 -17802 -38624 -17049 4475 -4002 1466 10783 19939 6809 -14565 -17628 -28653
14329 -28653 -58410 -68725 -38644 -15091 -5776 6242 13917 27355 57959 46922 29555 29498 28609
14316 28609 41749 58784 59625 31574 -3889 -14505 -2079 -16736 -28511 -224 -14373 -24529
14304 -24529 -30029 -38247 -40501 -43397 -23266 -7172 -2112 -14276 -38069 -49828 -55565 -27857 -4584
14291 -4584 -3377 -22658 -33674 -36875 -22218 1634 6368 -4431 -23319 -14561 14373 -6563 -13013
14278 -13013 -5896 8367 6448 9657 33449 44101 44144 16158 8313 -89 -13959 -34133 -19142
14265 -19142 -6471 -1138 -14642 -19168 -23733 -16202 -1919 -1226 10802 14732 2540 -13769 -52460
14252 -52460 -59113 -25266 6284 15190 14915 42684 43470 37354 34207 26507 7149 -33584 -45320
14239 -45320 -16725 -4665 2855 26349 25820 3268 -10102 -18289 -11890 610 16365 1177 14202
14226 14202 23193 32102 24085 18325 -7607 -23999 -23470 -30059 -26647 -9971 -20276 -13739 -26355
14213 -26355 -14209 -25207 -6371 2083 -3056 4044 11542 21460 -4197 -29987 -31987 -14996 -2649
14200 -2649 26053 48718 24038 3615 -1451 20187 61053 58024 65143 70660 85007 76956 85981
14187 85981 86590 86107 53227 28942 21148 18435 4303 -10461 18298 30625 26758 16912 1822
14174 1822 1331 -5391 4332 6530 43871 40104 35059 40525 -1936 -25528 -15282 -20142 -16718 -9260
14160 -9260 -17423 -28566 -23049 -20211 3737 13174 9573 -10623 -1477 22429 8061 -11593 -12347
14147 -12347 -40051 -60487 -48211 -45916 -46941 -18473 -12563 -16465 -27540 -18405 11924 19253 -13308
14134 -13308 -31697 -35240 -30694 -22485 -19459 -26981 -22560 -31953 -30192 -35154 -39116 -22345 10238 -10896
14120 -10896 -30648 -12440 -5037 -6421 -11735 1692 12772 -8658 -31056 -17982 -24812 -8097
14108 -8097 -14649 29903 30623 -9276 -22055 -30396 -36286 -31069 -27992 -36022 -27041 2763 7444 44827
14094 44827 43535 18210 12624 33933 29631 16388 10601 4769 29353 14237 -24833 -29521 -27589
14081 -27589 -43353 -38355 -16752 -8581 -2883 6800 -2740 -6733 -23357 -34205 -31845 -19253 -4864
14068 -4864 6860 19515 24810 29928 31353 40533 66751 69016 41028 22822 29682 43412 35579
14055 35579 68808 82398 56567 29675 27586 51210 30973 19210 26097 15887 11462 13902
14043 13902 -2832 2034 13034 39000 59564 54424 37150 25153 7667 6560 4878 -1089 -15562
14030 -15562 -18477 20329 30867 16493 -686 -3252 5655 19743 22820 27856 28513 12726 -3193
14017 -3193 5624 28506 36611 15919 17766 32872 45073 36474 8396 -18858 -23382 3552 -14051
14004 -14051 -8657 -11089 -14852 -27202 -3104 -7712 -24463 -4478 28136 23629 -20637 -26237 2878
13991 2878 30502 7184 -13093 -20418 -41095 -50007 -32083 -35913 -15631 3929 -39981 -61820
13979 -61820 -58006 -45114 -39317 -32473 -35873 -16509 -2710 6203 -28819 -48658 -31700 -18556 -3680
13966 -3680 -5690 -23912 -5147 -12576 6491 18586 32026 13051 -25565 -46204 -34995 -3918
13954 -3918 -529 7051 22282 32569 11427 10900 20217 2952 16114 19324 34938 571 -18890
13941 -18890 -6407 -21972 -24285 -12572 -9658 -1947 -1989 -2476 -8524 -6226 18850 31650 429 5247
13927 5247 -7845 -25732 -39841 -20184 -32814 -35413 1904 15095 23803 33260 42083 36584 25544
13914 25544 4587 12735 7188 -16129 -15403 -15430 -20640 1098 12423 -13396 -34724 -17427 -85
13901 -85 -8082 -12050 -15282 -1094 -1969 -12524 -18715 -43200 -10295 -675 14344 17498 20095 12171
13887 12171 18179 -10673 -16812 -12356 6318 -7049 -4056 -20916 -26524 -38097 -27213 7185 11838
13874 11838 15801 2405 -2227 -22357 -22125 -21504 -25569 -15060 -18845 -17624 10905 43443 28132
13861 28132 22971 20952 1196 1501 -26333 -18077 -17037 -16015 -14375 11991 20379 -6420 -9347 14440
13847 14440 5419 -16557 6414 4652 8989 16484 43458 55378 47292 468 -13140 -17575 847
13834 847 8153 30269 13620 8357 23222 20965 -2377 -13534 -18446 -25890 -38500 -13221 4558
13821 4558 -3248 -17405 -9655 10819 -724 1239 6515 6333 -18746 -11567 21619 31102 19792
13808 19792 -11383 -12864 -16913 -18957 -25434 -24696 -47691 -43223 -7268 6119 1609 2298 -11174 -31978
13794 -31978 -14577 -8301 7286 14307 10290 -2167 13548 -478 -13221 -11689 -5325 -44743 -49326
13781 -49326 -37940 -16315 -24873 -21852 -25103 -20214 -26859 -36878 -26821 -16702 -7870 -7208 -3513
13768 -3513 5782 -10354 -4119 14939 3488 -2767 12461 30149 18865 806 -15004 -606
13756 -606 17287 10641 -21796 -39770 -22746 -20450 -13055 -12097 -16962 -28497 -22391 -45095 -50381 -25865
13742 -25865 -7256 35913 49255 35962 34847 41148 18039 -38525 -57683 -23228 -25678 -33215
13730 -33215 -36383 -16629 8309 -13556 -25853 1393 10011 14891 14865 10145 -4348 -31608 -29038
13717 -29038 -16738 -20279 -30784 -37452 -32176 -37254 -43186 -31292 -23945 -21525 4537 -1802 2094
13704 2094 19922 11332 5262 13844 22078 15807 20316 10529 12541 -9242 -21344 13381 29817
13691 29817 16279 -693 12283 29292 6611 -18148 -24100 -16235 -24519 -12019 4904 -9447
13679 -9447 -32447 -48373 -45228 -35716 -51741 -17650 4888 13078 -15343 -35906 -40674 -26591 1649
13666 1649 14340 -2456 -4860 -10783 -12046 -21127 -15491 7743 -13202 -20379 682 15013 15777
13653 15777 26109 32048 40227 35943 41153 22342 -4327 14875 13409 -1686 -1078 7322 -1658
13640 -1658 -2185 -6418 -14396 -165 -9069 1890 5093 -16004 -18205 -3901 -10658 -28245 -14848
13627 -14848 -19152 203 33067 20965 12414 12878 7804 -10445 -21886 -29963 -19747 -22079 -36300
13614 -36300 -33935 -25776 -6288 -749 -15912 7663 12716 -11249 -37003 -13614 -5578 -17146 -24924
13601 -24924 9221 3442 15103 13748 42 8447 19754 16317 24623 21883 24228 25957 24915
13588 24915 14037 4247 758 -12479 -7274 7079 10962 7221 -26626 -44363 -43033 -44069 -30121
13575 -30121 894 -5658 -26653 -32911 -26836 -17482 8490 -792 3016 23510 6091 -38046 -46778
13562 -46778 -34095 -41410 -39676 -28248 -3205 -9472 -36143 -29562 -34418 -33936 -30631 -23434 -4582
13549 -4582 -19839 -33273 -16110 6706 14810 25522 14391 -35134 -49310 -31686 -23113 -23223 -8304
13536 -8304 -5049 -16018 -13011 -27920 -34223 -28874 -26097 -34089 -13017 -27349 -53148 -49505 -22557
13523 -22557 -14834 -9494 7513 19490 5286 5465 1714 -573 2861 -11251 -26077 -30521 -23890
13510 -23890 -19330 -249 12925 -13811 -21703 -494 6489 -28180 -29511 -2995 17165 7163
13498 7163 -12617 -8216 -5574 -247 16615 -698 -5954 -5160 -35866 -20152 3966 -2917 -14712
13485 -14712 -18119 -26898 -14457 14010 17345 7958 9959 -13009 -40791 -31467 -19723 -37333 -24431
13472 -24431 -23574 -702 16693 -8511 -19893 -12925 -8331 18077 27391 -7310 -10354 1175 13886
13459 13886 24705 35242 14085 484 2492 -961 -6680 -45412 -37317 -27647 7279 15674 11219
13446 11219 10924 -13695 -15736 -16766 -6315 7695 -11707 -35115 -25730 -22108 -28351 -22386 -35640
13433 -35640 -30369 -20253 -11076 22551 20051 1018 8175 10808 -3174 6961 35488 44233 33742
13420 33742 22965 2356 4858 -10234 1526 14034 33700 19868 -13907 -55045 -41098 -8650
13408 -8650 12956 28511 38149 24625 39821 38557 5836 -32723 -42113 -43474 -27392 -1864 30748
13395 30748 53215 36773 14081 -20928 -28015 -16221 -23872 -13784 -17596 -11352 -31897 -63732
13383 -63732 -38202 -21333 7687 -924 10796 9057 210 -31345 -29594 -39871 -37739 -27502 -51275
13370 -51275 -46017 -51693 -28822 1152 -4453 -39826 -39297 -23542 -35822 -23967 7088 12697 6450
13357 6450 13431 42685 41421 19169 1729 13921 26075 17323 -6220 -5895 7987 6964 -1231
13344 -1231 -1178 28699 35174 48355 66154 42075 8610 -16358 -35243 -53758 -67165 -58281 -55822
13331 -55822 -45836 -6690 10858 18258 28372 23381 4695 1442 1861 187 -4853 -7637 -31268
13318 -31268 -39183 -39504 -19626 -20175 -18418 -22572 -17977 -14988 -25429 -16959 8556 51936 47118 42897
13304 42897 39774 24463 9030 19701 32652 35503 12201 1552 7755 22699 34248 65461
13292 65461 64688 28940 16005 10947 6085 12557 33883 13612 -16955 -10526 15528 23929 13039
13279 13039 -11944 -32796 -19141 -23479 -46295 -51629 -38836 -5085 -474 13793 29616 50834
13267 50834 40064 45008 68198 44914 15940 19298 13646 6706 13622 17320 17828 14998 7616 6983
13253 6983 12326 20779 20420 2575 -26467 -21808 -17947 -39895 -56125 -45415 -16278 -17950 -18490 -23966
13239 -23966 -18881 5140 -24152 -37245 -21051 -14845 -12636 -2370 3855 15867 28704 43012
13227 43012 36969 25195 24714 20445 5960 -415 1540 2426 -396 -2075 -3461 -2250 22696 10982
13213 10982 6065 13161 -13897 -11916 -6855 -21316 -12127 -12444 -7179 -7430 -29396 -24221 -18013 2994
13199 2994 19713 48963 67724 43899 13113 15197 19843 19998 867 -17689 -21815 -36938 -38360
13186 -38360 -24897 -2909 -12237 5667 3648 -5175 9143 -6853 -2239 9297 10461 65473 119103
13173 119103 138583 144035 157500 118058 74682 52936 38347 28815 30768 35313 22980 28039
13161 28039 2504 11893 14580 24904 30156 32614 16761 16708 9413 -6897 2196 11783 -3495 -9676
13147 -9676 -13244 -27450 -13204 -13545 -14774 -38173 -29685 -8412 13794 12955 1173 -618 -1391 -2526
13133 -2526 33209 61209 102440 144709 222970 312942 392170 418342 366105 291821 213048 159727
13121 159727 135918 88245 66069 32141 34978 34418 27153 14282 30175 51405 25291 17112
13109 17112 27247 23096 11663 20798 39575 26724 13723 8208 11990 15748 20432 17160 7539
13096 7539 9084 4774 -8848 2081 37142 49943 61092 66791 81850 79556 78671 138523 210798
13083 210798 307355 405300 442170 412542 341284 244737 165830 120530 90720 84600 85207 101459
13071 101459 70669 35340 5729 10100 35401 15377 24198 32399 35337 -1849 -12202 261
13059 261 -19005 -25216 -5965 -25947 -15050 6609 10653 1633 -642 4756 -24271 -51799 -64324
13046 -64324 -40648 -1820 9155 13501 11649 30557 38012 66679 128854 161619 153582 136741
13034 136741 108279 89896 44970 1478 -829 -35 -24860 -28955 15000 27347 5641 15330
13022 15330 30936 18755 -12390 -23443 793 1579 -23173 -21749 -31334 5598 51452 60777 30854
13009 30854 -12133 -26300 -19569 -20127 -20931 -34623 -26969 -19607 -39585 -43231 -28083 -6843 -13646
12996 -13646 -27458 -33772 -32116 -33757 -865 -9471 -12606 -13563 -11330 -17133 -4903 -136 -11724 -3106
12982 -3106 -26 -7521 -13114 -23483 -54856 -52763 -28081 19870 38307 42624 60485 54312 10057
12969 10057 -1497 -20053 -46604 -64627 -51176 -54059 -43262 -11306 10795 15812 13854 -16693
12957 -16693 -34087 -17477 -1035 12182 25906 26603 45735 40302 15582 7105 -10476 -8257 -4934
12944 -4934 22703 50736 51063 11342 -13218 -15710 -26310 2266 -3906 -23564 -37421 -41471 -41956
12931 -41956 -28205 -4644 7233 3472 -818 -7001 -3634 11801 -11937 -4911 11119 29338 45384
12918 45384 12562 -33893 -40246 -43910 -25363 -19618 -26055 -6761 -4955 -26804 -7212 1427 -2240
12905 -2240 -10192 -20198 -16415 -24064 2097 380 34 9396 506 -12218 -23855 -29919 -17396 16616
12891 16616 45972 34910 -9105 -38199 -64212 -65026 -41267 -19505 -22864 -34243 -38243 -23602
12879 -23602 -10836 -22 1828 -21973 -32787 -36826 -21126 -11696 2209 4903 39639 35574 -13459
12866 -13459 2568 16911 5769 13391 21765 28854 46901 11140 25881 44407 42768 44769 48417
12853 48417 18677 -35603 -38960 6272 -10434 -7174 6149 24517 -1126 7978 25363 41487
12841 41487 27597 1852 11093 -341 5069 -8016 -27786 9660 32517 -6062 -8354 -30810
12829 -30810 -29884 -16704 -19985 -2357 1773 -24229 -47540 -45906 -28181 -16481 -3400 14225 2046
12816 2046 -3492 711 6087 -9990 -19995 -41564 -45118 -30524 -22834 -26934 -33489 -18325 -23974
12803 -23974 -22857 -16767 -12379 -30222 -52117 -45167 -40817 -50627 -60430 -38288 10741 4022 -16908
12790 -16908 -14555 20361 33240 36454 32029 33990 31384 29839 35063 41102 45179 28948 27910 1544
12776 1544 9518 16186 28019 21174 9328 -14998 -28752 -2107 8786 -1732 8581 14742 19789
12763 19789 15331 26484 33464 38246 25123 38435 36423 15002 -24512 -25561 -8401 -17586 -34201
12750 -34201 -25306 -17652 -36657 -52801 -65941 -55383 -32625 2576 10121 12640 -5124 -8670 -462
12737 -462 3612 -5671 -17378 -30263 -29689 -8444 2382 -12966 -15066 -7821 7884 13518 19049 15260
12723 15260 6438 -14435 -43165 -25388 -20181 -15717 -3796 8010 -10310 -25091 -8696 20907
12711 20907 10169 12168 18525 45709 55199 63675 64207 64132 53645 68491 93698 122437 103181
12698 103181 63955 18842 26367 48543 61536 42739 8450 -12980 2100 15936 20131 29000
12686 29000 16836 3718 8117 33959 68891 71398 55012 44179 45234 60981 79010 144287
12674 144287 224082 251553 248908 206186 148439 112834 74811 52915 57657 30835 15752 14678
12662 14678 32859 44502 33673 23403 18220 18992 -8567 -31199 -39681 -22324 -8719 -2691 6133
12649 6133 26590 17289 -10396 -20524 -33316 -33929 -23155 -27753 -51355 -56306 -49724 -28887 -1166
12636 -1166 -5376 -3894 -10669 751 18695 10586 -31078 -39100 -24820 -32550 -25931 8754 712
12623 712 -9324 -6996 6284 18188 2223 -981 -20188 -36062 -48243 -52732 -20027 -8690 -10193
12610 -10193 -26495 -40128 -56448 -60844 -50494 -25542 -11044 -23860 -3750 10444 6822 3344
12598 3344 -8294 15256 67611 51836 38569 35246 51093 58895 51667 41234 25909 4649
12586 4649 -15384 -2619 7307 19590 8570 8193 38763 53321 22603 -1676 -15161 -12355 -19404
12573 -19404 -18413 -18213 -8528 11532 19722 14293 13853 36290 13236 3484 -5937 6531 -4607 -7923
12559 -7923 -4539 -15535 -22593 11346 43128 41893 3312 17088 4199 5676 9686 -19011 -16649
12546 -16649 -2202 2671 -4761 -2495 10989 9433 -7577 -16467 -8193 -9328 16582 23612 34638
12533 34638 14667 -28707 -50213 -63463 -38830 1708 691 -26949 -26951 -9195 -5556 -5608 -7955 1042
12519 1042 14469 9019 -10488 -12301 -29714 -12045 30750 52138 41323 28964 27936 25186 22357
12506 22357 34615 13700 10947 11813 13248 16364 6110 -11198 -4920 49701 64899 47412 37212
12493 37212 14734 18636 -4738 -1789 17919 13297 8893 16502 6785 -23483 -28385 4404 11090
12480 11090 25350 29784 10538 1036 -10094 -2819 -12023 2570 -22369 -29104 -24198 -24409 -10044
12467 -10044 30423 17080 8448 11108 19040 15695 36118 53056 25242 -14336 -7592 6332 -12014
12454 -12014 -12069 -514 -10762 -20299 -25851 -4832 7257 13229 7623 -13980 -14010 14442 41008 -4346
12440 -4346 -25809 -22453 -23825 -204 -859 2317 -3774 -11851 -15511 3039 14405 8954 16060 952
12426 952 -19490 -23020 -58044 -71011 -63780 -29286 -6857 -31222 -66195 -68349 -60101 -28007 -18000
12413 -18000 -18129 -28106 -2837 12861 21382 21211 24773 1644 5257 -2248 9637 29132 25327 25695
12399 25695 43719 44505 35025 21142 26501 10049 -16823 -14556 36097 38518 39303 20763 -20719
12386 -20719 -36417 -49212 -33590 7710 12395 -15901 -7458 17742 32603 28547 21821 22940 23710
12373 23710 12571 -10156 347 10262 13984 21315 11754 -960 8883 -7712 -6356 2732 12137
12360 12137 20540 3653 -13 -3501 -14829 -34584 -14727 22608 43238 39127 36327 26344 -4334
12347 -4334 -29965 -38171 -27263 -27140 -34501 -34623 -22427 -11737 10759 27884 20787 4517 13339
12334 13339 29557 17669 3536 -15882 -13075 20247 37496 30139 -4781 -32193 -23832 -23723 -18944
12321 -18944 -23120 -23813 -22240 -26763 -36930 -44959 -43052 -25713 -23336 -9573 -15861 -20396 -30341 -23131
12307 -23131 -18672 -10992 10522 16223 19857 13411 3637 5161 -17544 -33208 -37357 -42224 -19527
12294 -19527 18129 -3688 -14699 -2274 10956 7291 -16450 -11993 6837 12617 -25681 -50486
12282 -50486 -34426 -20465 -26396 -12194 15420 4825 -16570 -6136 -9496 -18507 -49677 -64376
12270 -64376 -32881 -16819 -36437 -39724 -15336 3495 -1646 -4320 -17355 -5579 -3853 -726 -16823
12257 -16823 -16104 -12693 -11337 -4716 -16923 -32152 1881 4926 11283 39793 36720 30059 24167 15866
12243 15866 -12481 1773 741 8918 17348 26343 1578 -29980 -30673 -17702 3941 743 12749
12230 12749 -10427 -19749 -2615 -4693 -5239 5951 27387 12999 12472 21447 17198 -8576 -24740
12217 -24740 -23639 -27495 -26636 -2768 6426 -6594 2515 1129 -13710 -18954 -24990 -7707 13636
12204 13636 1597 -2377 -17173 -10960 -1652 22514 19281 -7327 2316 -3781 11682 44266 66014
12191 66014 51567 39355 11603 -18726 -34766 -22551 -23660 -47624 -24872 -16014 -817 7352
12179 7352 -3916 -43406 -34694 -21637 -12942 -6125 -3427 -7049 8717 17711 28944 28496 6329
12166 6329 -32365 -55459 -20066 -15075 -26637 -13694 -6574 12844 21163 31010 18078 -9032 -35486
12153 -35486 -43227 -33757 -16434 -5530 -40347 -67332 -62889 -49985 -28046 -18419 -21494 -23312 -24648
12140 -24648 -23860 -21137 3339 11167 18628 21948 36453 30776 2827 -27878 5983 22391 17702
12127 17702 42485 35897 525 10983 -11820 -26280 -16946 -21759 -28541 -50398 -20224 -11852 563
12114 563 25260 39563 31053 5860 5506 7028 -3496 -17480 -11269 -19093 -26861 -22064 -25188 -15801
12100 -15801 -6975 -13063 -20937 14775 12870 10106 8954 9014 13143 18132 20567 -12987 -10701 -11072 21014
12085 21014 37810 32805 478 5335 13884 26476 18782 25769 20274 26643 15277 -8939 -36377
$$ [...]
##END NTUPLES=NMR SPECTRUM
##END=
