##TITLE=Analysis number 312249
Compound Code cc 41746
Book Reference 433/117/3
Project Code adrs
Chemist Name victoriam
##JCAMPDX= 6.0         $$ Bruker NMR JCAMP-DX V2.0
##DATA TYPE= NMR SPECTRUM
##DATA CLASS= NTUPLES
##ORIGIN= Bruker BioSpin GmbH
##OWNER= NMR
$$ XWIN-NMR		Version 3.5
$$ Fri Jul 29 11:41:03 2005 GMT Daylight Time (UT+1h)  MAYBRIDGE\NMR@NMR_250MHZ
##.OBSERVE FREQUENCY= 250.131544655141
##.OBSERVE NUCLEUS= ^1H
##.ACQUISITION MODE= SIMULTANEOUS (DQD)
##.ACQUISITION SCHEME= undefined
##.AVERAGES= 16
##.DIGITISER RES= 18
##SPECTROMETER/DATA SYSTEM= dpx250
##.PULSE SEQUENCE= zg30
##.SOLVENT NAME= CDCl3
##.SHIFT REFERENCE= (INTERNAL, CDCl3, 0, 16.522)
##AUDIT TRAIL= $$ (NUMBER, WHEN, WHO, WHERE, WHAT)
$$ ##TITLE= Audit trail, XWIN-NMR		Version 3.5
$$ ##JCAMPDX= 5.01
$$ ##ORIGIN= Bruker BioSpin GmbH
$$ ##OWNER= NMR
$$ C:\u/data/dgb/nmr/ADRS/6870/pdata/1/auditp.txt
$$ ##AUDIT TRAIL=  $$ (NUMBER, WHEN, WHO, WHERE, WHAT)
(   1,<2005-07-29 11:40:28.17 +100>,<MAYBRIDGE\NMR>,<NMR_250MHZ>,
      <created by zg, POWCHK disabled, PULCHK disabled
       configuration hash MD5:
       62 19 C7 07 E1 42 D1 B7 37 6C 3D D0 77 39 F9 E6
       data hash MD5: 64K
       7A F1 DE 3B 14 FC FC 46 5E AD 9B 6D 72 2B 56 A5>)
(   2,<2005-07-29 11:40:45.17 +100>,<MAYBRIDGE\NMR>,<NMR_250MHZ>,
      <Start of raw data processing
       ef LB = 0.3 FT_mod = 6 PKNL = 1 SI = 32K 
       data hash MD5: 32K
       FC 08 13 7E 58 FF DE B4 CF 28 CD A0 B7 A2 E2 87>)
(   3,<2005-07-29 11:40:49.46 +100>,<MAYBRIDGE\NMR>,<NMR_250MHZ>,
      <apk 
       data hash MD5: 32K
       8E 81 F6 50 10 3D DD 81 28 A2 BD 63 AE 14 71 43>)
(   4,<2005-07-29 11:40:50.51 +100>,<MAYBRIDGE\NMR>,<NMR_250MHZ>,
      <abs ABSG = 5 
       data hash MD5: 32K
       C7 2E 9D C9 1F 1B 58 18 D2 35 00 DF C9 5D 6F CA>)
$$ ##END=
$$ 
$$ hash MD5
$$ 1A B8 08 8D 18 12 41 01 F5 0E C1 04 E2 1D E2 5B
##$RELAX= 
##$RELAX= 
##$RELAX= 
##$RELAX= 
##$RELAX= 
##$RELAX= 
##$RELAX= 
$$ Bruker specific parameters
$$ --------------------------
##$DU= <C:\u>
##$EXPNO= 6870
##$NAME= <ADRS>
##$PROCNO= 1
##$TYPE= <nmr>
##$USER= <dgb>
##$AMP= (0..31)
100 100 100 100 100 100 100 100 100 100 100 100 100 100 100 100 100 100 
100 100 100 100 100 100 100 100 100 100 100 100 100 100 
##$AQSEQ= 0
##$AQ_mod= 3
##$AUNM= <au_zg>
##$AUTOPOS= <18 >
##$BF1= 250.13
##$BF2= 250.13
##$BF3= 250.13
##$BF4= 250.13
##$BF5= 500.13
##$BF6= 500.13
##$BF7= 500.13
##$BF8= 500.13
##$BYTORDA= 1
##$CFDGTYP= 0
##$CFRGTYP= 5
##$CHEMSTR= <none>
##$CNST= (0..31)
1 1 145 1 1 1 1 1 1 1 1 1 1 1 1 1 1 1 1 1 1 1 1 1 1 1 1 1 1 1 1 1 
##$CPDPRG= <>
##$CPDPRG1= <>
##$CPDPRG2= <>
##$CPDPRG3= <>
##$CPDPRG4= <mlev>
##$CPDPRG5= <mlev>
##$CPDPRG6= <mlev>
##$CPDPRG7= <mlev>
##$CPDPRG8= <mlev>
##$CPDPRGB= <>
##$CPDPRGT= <>
##$D= (0..31)
0 1 0 0 0 0 0 0 0 0.06 0 0 0 0 0 0 0.0002 0 0 0 0 0 0 0 0 0 0 0 0 0 0 
0 
##$DATE= 1122633627
##$DBL= (0..7)
120 120 120 120 120 120 120 120 
##$DBP= (0..7)
150 150 150 150 150 150 150 150 
##$DBP07= 0
##$DBPNAM0= <>
##$DBPNAM1= <>
$$ [...]
##$SUBNAM7= <"">
##$SUBNAM8= <"">
##$SUBNAM9= <"">
##$SW= 20.6930455092707
##$SWIBOX= (0..15)
0 0 3 0 0 0 0 0 0 0 0 0 0 0 0 0 
##$SW_h= 5175.983436853
##$TD= 65536
##$TD0= 1
##$TE= 295.16
##$TE2= 300
##$TE3= 300
##$TEG= 300
##$TL= (0..7)
0 120 120 120 120 120 120 120 
##$TP= (0..7)
150 150 150 150 150 150 150 150 
##$TP07= 0
##$TPNAME0= <>
##$TPNAME1= <>
##$TPNAME2= <>
##$TPNAME3= <>
##$TPNAME4= <>
##$TPNAME5= <>
##$TPNAME6= <>
##$TPNAME7= <>
##$TPOAL= (0..7)
0.5 0.5 0.5 0.5 0.5 0.5 0.5 0.5 
##$TPOFFS= (0..7)
0 0 0 0 0 0 0 0 
##$TUNHIN= 0
##$TUNHOUT= 0
##$TUNXOUT= 0
##$USERA1= <user>
##$USERA2= <user>
##$USERA3= <user>
##$USERA4= <user>
##$USERA5= <user>
##$V9= 5
##$VALIST= <valist>
##$VCLIST= <CCCCCCCCCCCCCCC>
##$VD= 0
##$VDLIST= <DDDDDDDDDDDDDDD>
##$VPLIST= <PPPPPPPPPPPPPPP>
##$VTLIST= <TTTTTTTTTTTTTTT>
##$WBST= 1024
##$WBSW= 4
##$XGAIN= (0..3)
0 0 0 0 
##$XL= 0
##$YL= 0
##$YMAX_a= 368211
##$YMIN_a= -431617
##$ZGOPTNS= <>
##$ZL1= 120
##$ZL2= 120
##$ZL3= 120
##$ZL4= 120
##$ABSF1= 16.522
##$ABSF2= -4.171173
##$ABSG= 5
##$ABSL= 3
##$ALPHA= 0
##$AQORDER= 0
##$ASSFAC= 0
##$ASSFACI= 0
##$ASSFACX= 0
##$ASSWID= 0
##$AUNMP= <proc_1d>
##$AZFE= 0.1
##$AZFW= 0.1
##$BCFW= 0
##$BC_mod= 0
##$BYTORDP= 0
##$COROFFS= 0
##$CY= 12.5
##$DATMOD= 1
##$DC= 0
##$DFILT= <>
##$DTYPP= 0
##$F1P= 14.0000005364418
##$F2P= -0.99999901652339
##$FCOR= 0.5
##$FTSIZE= 32768
##$FT_mod= 6
##$GAMMA= 0
##$GB= 0
##$INTBC= 1
##$INTSCL= 1
##$ISEN= 128
##$LB= 0.3
##$LEV0= 0
##$LPBIN= 0
##$MAXI= 10000
##$MC2= 0
##$MEAN= 0
##$ME_mod= 0
##$MI= 0
##$NCOEF= 0
##$NC_proc= -3
##$NLEV= 6
##$NOISF1= 0
##$NOISF2= 0
##$NSP= 0
##$NTH_PI= 0
##$NZP= 0
##$OFFSET= 16.522
##$PC= 1
##$PHC0= -83.38769
##$PHC1= 14.87683
##$PH_mod= 1
##$PKNL= yes
##$PPARMOD= 0
##$PSCAL= 4
##$PSIGN= 0
##$REVERSE= no
##$SF= 250.13
##$SI= 32768
##$SIGF1= 0
##$SIGF2= 0
##$SINO= 400
##$SIOLD= 32768
##$SREGLST= <1H.CDCl3>
##$SSB= 0
##$STSI= 32768
##$STSR= 0
##$SW_p= 5175.98343685301
##$SYMM= 0
##$S_DEV= 0
##$TDeff= 65536
##$TDoff= 0
##$TI= <Analysis number 999999
Compound Code 99
Book Reference 9
Project Code 9>
##$TILT= no
##$TM1= 0
##$TM2= 0
##$TOPLEV= 0
##$USERP1= <user>
##$USERP2= <user>
##$USERP3= <user>
##$USERP4= <user>
##$USERP5= <user>
##$WDW= 1
##$XDIM= 32768
##$YMAX_p= 299219011
##$YMIN_p= -285193
$$ End of Bruker specific parameters
$$ ---------------------------------
##NTUPLES= NMR SPECTRUM
##VAR_NAME=  FREQUENCY,     SPECTRUM/REAL,   SPECTRUM/IMAG
##SYMBOL=    X,             R,               I
##VAR_TYPE=  INDEPENDENT,   DEPENDENT,       DEPENDENT
##VAR_FORM=  AFFN,          ASDF,            ASDF
##VAR_DIM=   32768,         32768,           32768
##UNITS=     HZ,            ARBITRARY UNITS, ARBITRARY UNITS
##FACTOR=    0.157963299565203, 1,           1
##FIRST=     4132.6476996994, 0,             0
##LAST=      -1043.33573715361, 0,           0
##MIN=       -1043.33573715361, -285193,     0
##MAX=       4132.6476996994, 299219011,     0
$$ Real data points
##PAGE= N=1
##DATA TABLE= (X++(R..R)), XYDATA
$$ [...]
16561B9136k358j9056J344N677J8337Q072o797O72M769K657j1096M225P873n274
16547C8181j214j5803l852j674m035k278n245M728o137K93K123J0779R48M769
16533B1583J3539Q648p4J974K46q924q589j1762O464Q468J35J76J5999P142l435
16518E1590n931n108j1207m91M351J2203r85n061r257n577O940k157m139L249
16504B8420l630j192m198j360N058q400j0075O316M308K432J3133j1808J0434
16491B9438L688q92k4046P708J0686k746Q158J4187n255j4832L508N352k038p393
16477B5523k794M802Q10N132P938P345j1549j6251J283J0805N133J482J1227j1543
16463C9343j4799j3347P294J9164m581m334J127L643q471k74l632j122J291O854
$$ y = [29136, 26778, 7722, 9066, 14743, 33080, 41152, 34355, 35027, 39796, 42453, 31357, 35582, 43455, 38181, 36967, 21164, 17312, 15638, 11603, 9325, 4080, 8808, 2671, 2964, 5087, 15866, 16814, 21583, 35122, 43770, 43696, 45670, 45916, 36992, 28403, 16641, 23105, 31573, 31708, 31884, 47883, 55025, 51590, 45659, 40551, 29344, 28853, 33204, 45407, 44422, 39361, 30104, 24527, 31467, 29310, 25171, 28420, 24790, 23598, 19400, 18040, 23098, 14698, 4623, 10939, 15247, 17679, 30812, 19004, 29438, 33126, 32234, 8188, 15896, 26582, 23836, 31994, 46181, 40926, 26094, 29602, 34954, 32916, 25523, 22729, 27531, 28341, 33473, 41411, 48756, 37207, 20956, 22239, 33044, 38177, 39659, 50886, 39343, 24544, 11197, 18491, 37655, 33074, 28740, 29867, 33510, 25039, 24765, 21133, 20011, 21302, 28156]
16449B8156j365k554L009N335N353j1829j926N466l523m974j856P362L847L77
16435C0878L886K97j6256p100J3688P634n614j8172r982L023l484k053M180J2532
16421A3457Q751l84q81j0464j2191j146l95K412O5M213m730p078J1993M6k490
16406A178R834r446j2540L570Q938L551O449n067M947J898k3009K263R850R321
16392A1737k06r578m149n148J7461J0436j287k536o786j196J0081k477N289J6633
16378C8274o80j4382l286n837m177J6525O934j3837j5442j1602l530M618J8379
16365A1957P570j0224M852P210J21K494j0066P224Q365J4775j434k8506j3842
16352D96l239J948O730M768j858q455o58N297L536O077n580m892K385Q538P155
$$ y = [28156, 26791, 24237, 27246, 32581, 37934, 26105, 24179, 29645, 26122, 21148, 19292, 26654, 30501, 30878, 34764, 35061, 18805, 11705, 25393, 33027, 27413, 9241, -741, 2282, -1202, -3255, 925, 13457, 22208, 21824, 20943, 10479, -1712, -2858, -3253, -841, -776, 3437, -1293, -8371, 3622, 3668, 1178, 11012, 1566, -10974, -7404, 1534, 5085, 11534, 6467, 11414, 13312, -9697, -7434, 2416, 11737, 11531, 1953, -2196, -7344, 10117, 20553, 19266, 16730, 9944, 8748, 18829, 16352, 21641, 38274, 37594, 23212, 19926, 14089, 9912, 26437, 33371, 19534, 4092, -7510, -11040, -6422, 11957, 19527, 9303, 14155, 21365, 21486, 23980, 13914, 21138, 29503, 44278, 42844, 14338, 496, -2743, -795, 5935, 10703, 8845, 390, -268, 5029, 8565, 14642, 9062, 4170, 6555, 15093, 22248]
16337B2248m266J060M184m107n540q19q458j3467j0792N302P142N731J2466Q503
16323A9187M733j0236j4344M104J6428J4316M316j1355j6906K022k319j1486j830
16310c370K308l774J686k103J69j177N26o336J514p317K438k761o26O062J743
16295a1018l134m955J1242K162K494K692n116j7278q380J032J7629O241K158L22
16281c909j054J3954K1253J6244p447R610r18j3422J302k054j7327j2002K494
16268F724M265n947j3480j4371R796L357M572M145M5K646P98J379m039J927K519
16253D336l989q380K491P439J1844k758l400J0486K654q926q445o453L667k65
16239C01O343J2945J0085k501j3487J0303j2281r330J5102N198r589j4072m741
$$ y = [22248, 17982, 19042, 23226, 19119, 13579, 12760, 4302, -9165, -19957, -14655, -7513, -1782, 10684, 19187, 23920, 13684, -660, 3444, 19872, 34188, 38504, 27149, 10243, 12265, 9946, -1540, -3370, -1062, -4836, -3150, -5253, -5084, -6261, -5735, -12071, -10557, -17874, -15436, -18197, -18823, -12761, -11018, -14152, -19107, -7865, -5703, -3209, -517, -5633, -22911, -31291, -30259, -12630, -6389, -4231, -3909, -4963, 8991, 30244, 46488, 39041, 48651, 47733, 34311, 35613, 33559, 16232, 4230, 6724, 10989, 5042, -8438, -22809, -13013, -9656, -5084, -939, -894, 1752, 2550, 3929, -110, 1817, 4336, 347, -8033, -5542, 1897, 13741, 10983, 7583, 18069, 20723, 11797, 3352, -3101, 566, 301, 6644, 19589, 29674, 27173, 13686, 23989, 11708, 2378, 17480, 22678, 13089, -983, -5724]
16226e724M154J757p780n895q870R968J4520j0181R485K899l511N694L58j3027
16212f153R567R093o574k576Q386j6028j1415m698L629J0145P360P679J0474r984
16198H905r626o245O443m491r019K132J0068l060q86J3295p230n09Q414O958r893
16183E256k435M828M697o127k010j3260J483J0251M664r46q448k757L027n220
16169f997l450J7863J3855N420l878j0161k3965l963J5143J2230k425M973j4062
16156E83m429J5863N029J196J697p381q136j7902n752J909N46J6389k085L258
16142G85L31j804q479k696J3008R751o133K784k012n976m632q38J092n180L865
16127f134J0509l555M856k319l065m440m099M562M210L56J827j3394q004n180
$$ y = [-5724, -1570, 187, -7593, -13488, -22358, -12390, 2130, -8051, 1434, 4333, 822, 6516, 6874, -6153, 3414, 12507, 5933, 3357, 11743, -4285, -15700, -20398, -16769, -6624, 736, 8415, 18889, 8905, -721, -6966, -523, -5014, -14033, -11901, -1833, -4893, -5779, 7516, 286, -223, 8191, 15149, 5256, 2821, 7649, 12346, 6219, 4209, -9051, -7568, 2683, 7347, 6401, -2047, -4804, -1777, -6997, -10447, 7416, 21271, 26691, 22813, 12652, -11313, -15276, -133, 12097, 9672, 14645, 583, -3846, 12017, 17046, 18242, 19939, 12558, 4422, -13480, -19232, -17323, -16777, -388, -2473, 785, 1116, -688, -9167, -11863, 1145, 10896, 4763, 7547, 5535, -441, -5073, -5911, -4819, -9999, -6134, 4375, 820, 5676, 3357, 292, -4148, -8247, -3685, 525, 881, 2708, -10686, -18690, -23870]
16113b3870r674P160R933O405n43P176l637j298Q061L290L60j683j4038l537O688
16098i207R843J810p1M744J0371k818o971o587m19M245k939l681j3050l472R950
16083h252j007r197N117J414Q604L918j5817m609M545J636O288n234r692K457
16069a9829M535j7946J1275O132J1346J0000K827n796j357J7091K0102L58j5978
16056B2760r81p702L703n533m996P02J672K583M073K59N425q348j3783q467K059
16041f574O164L823J3139K809j367J18O966o61j2657k263m624K769m250q209j469
16026f286J1076J2406o700j7304j0154O436Q345n80N879N233r048R743O826j0428
16012E444q931q295j2205k125O020l783O454J3566L982P714R408O341M826n724
$$ y = [-23870, -33544, -26384, -16451, -10046, -10589, -3413, -7050, -8348, -287, 3003, 3363, 1680, -12358, -15895, -9207, 636, 2446, 2375, 7119, 17490, 14672, 7701, 1114, 695, 4940, 2001, -1680, -14730, -18202, -8252, -9259, -18456, -13339, -11925, -3321, 597, -15220, -19829, -15284, -13648, -7360, -12594, -22286, -19829, -15294, -33240, -21965, -15833, -4487, 5513, 8340, 2544, 1187, 18278, 38380, 38738, 22760, 21779, 14077, 17780, 12247, 7251, 7953, 9625, 12208, 16281, 16540, 21965, 13617, -166, -8633, -6574, -410, 3413, 16552, 19361, 17994, 18112, 25078, 24417, 11760, 9497, 4873, 7642, 3392, -4817, -6286, 4790, 17196, 10496, -6808, -16962, -10526, -2181, -2761, 3118, 8351, -697, 9046, 15872, 5444, -3487, -11782, -23987, -26112, -20092, -23875, -17421, -3855, 127, 7841, 17249, 23590, 28416, 22692]
15998B2692j7289o892P92R429M201q442J238p19J696M138R799J4058j3899j9021
15984A781n464N653J0359J2545m099j6939p739R188O522K101J894l862M911k027
15970A4824j6047j3794O1P483n90J072m013K12J0494M730n214n093m320n266L113
15955a2348K133j2828q479J1233K39J0515J3424J1358N787l957M733j4004j0016
15942b210m977Q961R13N109R247j698m31j4028j2622j1773k901J0535J8135q432
15928f172Q491l00m484r544J180L544K843Q730j1132j6146j2849Q550Q598K816
15914a5875R241P872Q194J1774r908j2020J512J0079j520r177j1817r409L372
15901a7682q699J340P943R094M375P96j12N88l384O6q372O431m313L262K987j0345
$$ y = [22692, 5403, -1489, -697, 8732, 12933, 4491, 5729, 5010, 6706, 10844, 20643, 34701, 20802, 1781, -3683, 1970, 12329, 24874, 20775, 3836, -3903, 5285, 11807, 13908, 15802, 11940, 16851, 14824, -1223, -15017, -14956, -7473, -8063, -6991, -11004, -10792, -298, 4432, -782, -5875, -10195, -15461, -12348, -10215, -23043, -31522, -20289, -20050, -9535, 3889, 15247, 21034, 17077, 21810, 7806, -2210, -7187, 1774, 2687, 7796, 17043, 15345, 14914, 886, -11736, -23509, -26410, -15875, 2260, -6172, 2319, 2019, -2465, -12009, -10829, -7285, -4442, 4288, -6844, -22990, -35839, -27289, -18691, -15875, -6634, 1238, 9432, 21206, 11298, -722, 790, 10869, 9349, 172, -11645, -21054, -17682, -26381, -25041, -17098, -8004, -3629, -2833, -2945, -2357, -5741, -5675, -14047, -7616, -11929, -8667, -5680, -16025]
15885a6025j5337j74J5182K7793L267l100M130K419N759o287j8232J77J5402O280
15871B1254p272k179q295j8190N412M195p134k536k025k781N337Q591R027j1222
15857g818n417n502j2167J737O409L810N006j710L501N926M286l925j372R209
15843A973l93j011K72m079n193r158J707M487m750k355r44K015O270P992j575
15828d742q713J2549J2179L380q608q045M054j040J20o607K757M755P507J020
15814A0566n714J873o52j7806k3392n598O106P836N298r374l553R594m221k903
15800c1940P764J9755K947j0453j0597o35N280p714K705P142j2292Q717N647Q96
15786a2778J7919Q451r234o071K329o736p675l688K137J695J0124L190M684L079
$$ y = [-16025, -31362, -31536, -16354, 11439, 14706, 11606, 15736, 18155, 23914, 17627, -605, -428, 14974, 21254, 13982, 11803, 3508, -14682, -9270, -5075, -12209, -14745, -16770, -19551, -14214, -5623, 3404, -7818, -13235, -18737, -30904, -29167, -22758, -18948, -13942, -15652, -12151, -6225, -1939, -5864, -7236, 1973, 1580, 569, 841, -3238, -8431, -17589, -15882, -11395, -16145, -18500, -19444, -17429, -11159, -3167, -4742, -13455, -906, 11273, 14653, 6045, -2000, 2054, 1014, 1134, -5473, -2716, 2039, 9546, 10566, 4852, 6725, 6073, -11733, -35125, -40723, -34617, -26781, -21483, -30857, -34410, -24816, -29037, -31940, -24176, -4421, -1474, -11927, -22524, -23159, -17879, -25593, -22888, -15746, -28038, -19321, -13674, -12778, 5141, 13592, 4358, -1713, 616, -6120, -13795, -17483, -15346, -13651, -3527, -337, 4347, 7426]
15772G426q323j1758l338K647k212n015l842O858J0620P938M416k2025l278R697
15758a0189N460p902o59J3598k800r213p875J956L017O875N390j3948N162Q547
15744b581N932r187j1783q091j2628M221M552J5532O065r12O211O273J851q046
15730b591k326n07l22k826J661R558P718K753O020k338j2945j4963r947K092L643
15715a5320L709l514l983M400n740j469J581p860K509R420N683R139j896p378
15701a0719K755K797k564K613J911Q1J0423K680q613k996l284O458j943j47M180
15686C632n526l700l417k94L276r70J1190K956q384m247J2743o073j7473j858
15672a8145N636J7205J826j0961j902k21J000J228q514j1425P518N164k797M762
$$ y = [7426, -897, -12655, -15993, -13346, -15558, -20573, -24415, -17557, -6937, 1001, 5417, -16608, -19886, -10189, -4729, -12631, -13290, 308, -2492, -11705, -19580, -17624, -14607, -7732, -2342, -16290, -11128, -2581, 3351, -5836, -17619, -25710, -38338, -34117, -29565, -14033, -7968, -8880, -2669, 3604, 5455, -2591, -4917, -5424, -5746, -8572, -6911, 2647, 10365, 13118, 19138, 16800, 3855, -11108, -21055, -18963, -15320, -11611, -15125, -19108, -14708, -20448, -21917, -20336, -28196, -25687, -16267, -10584, -1445, -3341, -10719, -7964, -5167, -7731, -5118, -3207, -3126, 7297, 9977, 1364, -1632, -4916, 1542, -401, -548, 3632, -1894, -5594, -9011, -9305, -6029, -6999, 4191, 7147, -1237, -5484, 7259, 1186, -16287, -18145, -12509, 4696, 6522, -4439, -6341, -6562, -5562, -4334, -12848, -24273, -16755, -11591, -14388, -9626]
15658i626K475N667O752p888n251J3553p542r058M011J6570P016n557J908K198
15644A5228R455K416j0097j1284l42k285m379o527l802k159N606J8826J5608j748
15630B4516j9704k7813L825J2109M113K23j500K272n018N615M588r610Q546j098
15616A064J1543j220K18Q818r019j36L619p603o257N549J6600q852r686j1534
15602f896q646P445K697k517R987N687P404O543L787j0937j0773k504L331R86
15588E594K6165J651j9260j6701j4114l197J5798R618K669n518K075N732J5186
15575B5698k213q317l911m872Q047M863n868J2912k096N520m41k3526q240J5479
15561A3035J2440o931j921M741j4236j7219N97m645L809n865m741J455R300P411
$$ y = [-9626, -7151, -1484, 5268, -2620, -7871, 5682, -1860, -10918, -6907, 9663, 16679, 11122, 13030, 15228, 24683, 27099, 17002, 5718, 5376, 3091, -1288, -7815, -11617, -13776, -8170, 10656, 26264, 24516, 4812, -23001, -19176, -7067, -2954, -2731, -4231, -1959, -6977, -1362, 3226, -6384, 2162, 1064, 12607, 11387, 11605, 20423, 11404, 11268, 14887, 7284, 1027, 6576, 23176, 14324, 4638, -6896, -15542, -8097, -5400, -7917, 2070, 7757, 15161, 21704, 25491, 14554, 3781, 1277, 4608, 5594, 31759, 33410, 14150, -2551, -16665, -19862, -4064, 5554, 8223, 2705, 4780, 10512, 25698, 23485, 15168, 11257, 6385, 14432, 19295, 13427, 26339, 24243, 29763, 29322, 5796, -2444, 13035, 25475, 18544, 16623, 21364, 7128, -10091, -9494, -14139, -10330, -16195, -20936, -19481, -10181, -2770]
15547b770Q12k2658o001P098K0255N143J0l565l943j1116L180p693N121J6157
15533C0N1j1L84P983M932m469p791o15k798J515j190R20N350o896P9k472M841
15516a57J466j1588j2461m70J6509J3756q34J1700Q386j87j0629q354p187J7478
15502A7428J518j7743j1484j0836J5670J8122j0694j4535m815O638J1857R666
15490A0792r570j3637k944J542J2862o695k0075n715K0460M089J023J1049L574
15477F755k574L452j646M37J07j1140j0071L407J5150J388j0963Q58Q91m948o339
15462a5236j2956j1541M072N325J801J72K054J3040K342M882O197J0052l978k1650
15448a5424o589J5o513P665J5178J255q256Q60o278j0146L806J3334m524k0918
$$ y = [-2770, -1958, -24616, -30617, -23519, -3264, 1879, 1889, -1676, -5619, -16735, -13555, -21248, -16127, 30, 81, 70, 454, 8437, 13369, 8900, 1109, 494, -2304, -789, -1979, -1059, 4291, -2605, -2526, -4998, -157, 1309, -10279, -22740, -23210, -6701, 7055, 6221, 17921, 26307, 26120, 15491, 7137, -50, 17428, 18946, 1203, -10281, -21117, -5447, 12675, 1981, -12554, -17369, -10731, 1126, 10792, 1222, -12415, -15359, -13817, -955, -7650, -27725, -33440, -12980, -8891, -7868, 3181, 6755, 4181, 7633, 5987, 6424, 6531, -4609, -14680, -11273, 3877, 5265, -5698, -4840, -3949, -8897, -15236, -28192, -39733, -35661, -30336, -28535, -28363, -26309, -13269, -10927, -6045, 152, 10204, 6226, -15424, -22013, -21998, -28511, -20846, -5668, -4413, -12669, -11809, -18087, -28233, -24427, -11093, -15617, -36535]
15434c6535O966J0809k79O482k425j6078J898K481N605O003L144J1780J852m057
15420b354j5642O765J4235P398L095J309l196l168o100O542J1454M713j2268j4205
15406a422M588J3145L312Q089n282M778K987o707j17N623K647l0770j1282J2269
15392A858O105Q436j3791r96R452r741m579O501r740J18R524P949q21k382m493
15377C400m433n506o095J3548J7657o527j1874o575j5254N207J0200R888R180
15364A2816q791r252Q118R885o990o98J554l138L955j6668q23Q235n465o18J6570
15349H690P710l653k1016l100J1383p536q56N015K747n184M254J6871M116l17
15335A9124j234J4807j246j3339j3759j4614L980M667j067j0114k805N588O750
$$ y = [-36535, -29569, -18760, -19039, -12557, -14982, -31060, -29162, -26681, -21076, -15073, -11929, -149, 1703, -2354, -17996, -11231, 3004, 10402, 13497, 14806, 11610, 8442, 2342, 8884, 20338, 25051, 12783, -1422, 3166, 16311, 19623, 27712, 22430, 27208, 30195, 23488, 23371, 28994, 31641, 871, -10411, 1858, 7963, 16399, 2608, 1612, 11064, 1323, -3256, 3245, -6495, -6377, 3147, 11096, 10275, 7893, 3400, -1033, -6539, -12634, 914, 18571, 12044, 170, -6405, -21659, -16452, -6252, 3636, 12816, 4025, -5227, 2891, 12776, 5786, 5088, 6642, 3504, 7459, -9209, -10032, -1797, -7262, -7880, 8690, 16400, 12747, -8269, -11369, 14, -7522, -8378, -3363, -616, -5800, -1546, 15325, 19441, 19124, 17890, 32697, 31451, 18112, 4353, -10261, -6281, -1614, -2681, -12795, -15600, -10012, -3262]
15322c262q774r345P66J7779R360j3122q878l188J0939J120r303j7431l535R524
15308b7350K3849j07l142l934n453K588N990L076O999N291n615p436R613m093
15294B76j611P197N993m034O902P536P13j1814q46K14p658j1603N296m855J460
15279f834P168j707L12J484N707p431p443k623K820K713l784l249m80M137P065
15264b145J1329J621j1434j3189Q975R017q910k425J4187L011j2432p788J650
15251h533J1580l365j2156j3222P542Q134N764O95j553r800k986L559j106m888
15237b0335J0309r466q427N698r33J2196j251j1702L417Q031L037p266m518L311
15223a7899N358O797M189n920K366p361j592N68L683k860K804O640n677N913J4358
$$ y = [-3262, -12036, -21381, -20615, -2836, 6524, -6598, -15476, -18664, -7725, -6605, -15908, -33339, -36874, -27350, -3501, -3608, -6750, -10684, -16137, -13549, -7559, -4483, 2516, 7807, 2192, -5244, 4369, 276, -1335, 5862, 11855, 7821, 14723, 22259, 22972, 11158, 10312, 10526, 2868, -8735, -3439, -8294, -6834, 334, -1373, -1061, 423, 6130, -1301, -8744, -11367, -8547, -5834, -9618, -12867, -13347, -9210, -2145, 9184, 10805, -629, -13818, -4843, 4174, -4736, -7161, 7026, 10037, -2395, -10183, -8533, 3047, -318, -12474, -25696, -18154, -10020, -4256, -3561, -5114, -14914, -17900, -14341, -15447, -20335, -10026, -19492, -27919, -22221, -23154, -10958, -12209, -23911, -20494, -12463, -9426, -16692, -21210, -17899, -12541, -5744, -1555, -7475, -5109, -12470, -14062, -13494, -9811, -12671, -9867, -3227, -8904, -2991, 11367]
15208A1367m234q383j4502p346O447J0550o587M687n596L963Q796N522r834j4656
15194a9806n183J5595R06j0758m360O504K3817J887j7742q496p923o690M825Q598
15180a8826J3313N626K775r808k36L769j2382K3J0033J4820L396j5860j2426l969
15166a9752R69Q929J3898m03M691j9277r165j1660k908O282j714N29j270L73M969
15151b5509M585K349J5333l87j227L773p860o425P876R324M992o108L910L644
15137H270p14O01J525k995p751Q864n71q474m860K526m636r87J780M083O522j35
15121C048j7232k847N100k768Q379L410j1422j9748n188K059J0852L555p436J5652
15107a4586O411j6550j557M494O435P808P736j4795q679Q28J1039R390l684j1279
$$ y = [11367, 7133, -1250, -15752, -23098, -16651, -6101, -12688, -8001, -13597, -9634, -838, 4684, -5150, -19806, -24989, -9394, -8488, -19246, -23606, -17102, 6715, 8602, -9140, -17636, -25559, -32249, -27424, -18826, -5513, 113, 2888, -6920, -7156, -3387, -15769, -15746, -5713, 9107, 12503, -3357, -15783, -19752, -18783, -9854, 4044, 3641, 8332, -10945, -20110, -31770, -34678, -28396, -30110, -29581, -30851, -30478, -25509, -20924, -18575, -3242, -3629, -4856, -1083, -8943, -15368, -7492, 1832, 6824, 716, 4626, 8270, 7556, 8157, 9682, 6687, -1064, 7800, 7229, -1245, -6105, -3579, -8215, -9202, -7422, -3339, 3183, 3048, -14184, -17031, -11931, -14699, -6320, -2910, -14332, -34080, -39268, -37209, -26357, -22802, -30238, -14586, -8175, -24725, -26282, -21788, -15353, -7545, 191, -14604, -23283, -22455, -11416, -2026, -5710, -16989]
15093a6989R255O811K221P085p880j1251j246J2130L692j9131j3129J1006K0155
15080B729k052p516L118L786q737j5033j302j0168j1140Q625J8756Q030j491m264
15066a6659l447K97L152m327o163K451J405N804k835j5397l425J5995Q246M06
15052a4497m699k9L787j317k1797k5295O649J7334J8164R839o394l653k835M065
15038b0678o149o72L952j7j007J3181O149j2571k0057l282o243O236Q265q114
15024d1007r119M55L42J2301K1218K872q531J91J4166J326o192l026J05J892r650
15009b2657n511P429Q543j5946k5471L86J5912J0401K0138K0613r935p793l856
14996g747l376q251M152j3386r387O516Q684n292J618J5860J3292k61j7142j0231
$$ y = [-16989, -7734, -923, 1298, 8383, 503, -10748, -11994, 136, 3828, -15303, -28432, -17426, 2729, 677, -6839, -3721, 65, -8672, -23705, -25007, -35175, -46315, -37690, -18934, -10904, -12395, -16659, -20106, -19809, -16657, -20984, -27147, -24696, -23291, -17487, -20322, -35719, -39144, -23149, -14903, -14497, -19196, -19225, -15438, -16755, -38552, -63847, -57198, -39864, -21700, -11861, -18255, -21908, -24743, -20678, -26827, -27499, -23547, -23564, -24571, -11390, -5241, -17812, -37869, -41151, -47394, -41158, -32893, -41007, -50126, -49671, -49329, -37028, -15810, -12938, -21469, -21278, -7112, -5786, -11978, -15004, -14899, -13007, -22657, -28168, -20739, -12196, -28142, -53613, -53227, -37315, -26914, -6776, 13837, 3902, -3891, -7747, -11123, -19374, -15222, -28608, -37995, -31479, -22795, -28087, -26469, -10609, 2683, 2422, -14720, -24951]
14982b4951n559N914R062K850R515J0603J7727K151J540J6293L0005L1610J7365
14969A24125P808K6076K1020N389J2511R005O312k5436k0845k2840k2601j0566
14957A09958j4756j7393r426n933j2978m505j6557J475J458j8679m775J456r937
14944e92j1783k353P724j008P918N549N72j6923r001l041n545P616K3028J3292
14930A5453J072j7542n460k328P698J0580j1444m629J0434j0996p697r940N086
14917a9713J6903q556n295J0035L515l414n940L156m42J3699J514m67N106Q167
14903A8268q756q672o772Q395K018n359m590J280l42k929K088M111J0544R409
14889A8693O841N386J172N895J9903J7517J7385R134J9836K4758K2608J1373P512
$$ y = [-24951, -30510, -24596, -15534, -12684, -3169, 7434, 25161, 27312, 28852, 45145, 75150, 106760, 124125, 131933, 158009, 179029, 184418, 196929, 205934, 212246, 186810, 165965, 143125, 120524, 109958, 95202, 77809, 68383, 62450, 49472, 44967, 28410, 29885, 31343, 12664, 7889, 9345, -592, -12375, -14728, -7004, -8012, -94, 5455, 6027, -10896, -19897, -22938, -28483, -20867, 2161, 15453, 16525, -1017, -6477, -8805, -1107, 9473, -1971, -6600, 3834, -7162, -14859, -24799, -19713, -2810, -11366, -16661, -6626, -3111, -6525, -12465, -9309, -9751, 3948, 5462, 4995, 10101, 18268, 9512, 840, -5932, 2463, 4481, -878, -5468, -4188, -4530, -7459, -5371, -1260, 9284, 18693, 25534, 30920, 32092, 37987, 57890, 75407, 92792, 101926, 121762, 146520, 169128, 180501, 188013]
14876A88013Q265j5014o325j6249q113k0911l3169j5094j8015p844j3326j8118
14864B4100j0944L053P625j104j4815j2102j0569J489J8776n96j1884K80K811
14851c880N070J4183n578O281J943p069J4463J4767k0531j9550K144J674M102
14838H019j365J801o92O408N733n893m114j2359M769K600j1189j8663J999M916
14824a8030m026N26P423J624j444j783j4349k829N511j391K842K062Q630j68n056
14809b0458J0963J098Q599J421m820K17P40j4236R655J3424R893P741n564k3079
14795d406n614o505J961q8N879k125L325R371M679l689J800j2706n509j345N686
14780i286m543O697R019Q71k183M212p957j7291k607J4458J3347p447j4486o57
$$ y = [188013, 196278, 181264, 174939, 158690, 150577, 129666, 96497, 81403, 63388, 55544, 42218, 24100, 13156, 16209, 23834, 22730, 7915, -4187, -14756, -13267, 5509, 4913, -6971, -6691, -3880, 1190, 15373, 9795, 16076, 18019, 10950, 25413, 40180, 19649, 99, 2243, 3917, 8019, 6654, 8455, 7763, 14171, 19904, 14011, 9897, -2462, 2307, 4907, -6282, -24945, -22946, -18030, -22056, -21530, -14107, -12483, -13927, -15710, -30059, -32888, -27377, -28768, -25926, -23864, -15234, -15402, -20458, -9495, -8397, 202, 1623, -3197, -2980, -2240, -16476, -6821, 6603, 16496, 24237, 18673, -4406, -10020, -16525, -14564, -14652, -8773, -10898, -7573, 1798, 6477, 2788, 4588, -8118, -13627, -14972, -9286, -13829, -7132, 1887, 2758, 575, 4787, -3170, -20461, -23068, -8610, 4737, -2710, -17196, -17853]
14766a7853L773J0726n46L30j2764K094R787m552j8327L968J7295L289o314o194
14752a5288N164j962j659r251q899P071J0329N332M104j4510L00p525J923J0389
14738a4482n03l526L29K388n336L859J6184J2479n294j0058J650P749k452p608
14724d621j5900j338R084J6455J4034j9057k7094J214J884j3508q898j313O650
14711d2408J6087J1079K2548P690j6699j4606N843k170K274l685q450O446R390
14698f661L670m811o873j0572m714J1519J2536K66j7077L06Q330R031j5992j6421
14684c7463J1581Q517n914J809K0854j780N942M347q089j1337n387l722L514K348
14670a4780r288k860J41j794m552m262M866R04j2738j647m347L092J2261J8598
$$ y = [-17853, -14080, -3354, -3900, -3570, -16334, -14240, -4453, -9005, -27332, -23364, -6069, -2780, -9094, -15288, -10124, -12086, -13745, -22996, -31895, -24824, -14495, -9163, -5059, -19569, -19269, -26794, -24871, -14482, -14985, -18511, -18182, -15794, -21130, -17271, -1087, 11392, 6098, -3960, -2310, 5439, 2987, -4621, -20521, -21859, -12775, 3680, 17714, -1343, -28437, -27223, -25339, -38847, -47745, -49058, -42408, -26321, -15242, 7306, 14996, -1703, -16309, -10466, -12636, -10362, -14047, -22497, -16051, -6661, -2991, -7802, -14675, -25247, -29961, -18442, -5906, -5640, -22717, -22411, -14081, -5050, -21042, -37463, -25882, -17365, -23279, -21470, -616, -2396, 3546, 7893, -196, -11533, -16920, -20642, -17128, -14780, -24068, -26928, -26787, -28581, -33133, -37395, -32529, -31625, -44363, -46010, -50357, -47265, -35004, -16406]
14656a6406N771J0256k541q206J936L777n356j3078n964O149J7493j1563j620
14643a9352l338J033M818j1101M992N707r973J819P570K692K862J176O168M264
14629f63o841o834p260j7281k198J5531J1613p243k934p033P8M740J233m809j3413
14614d3314r43J2998J4243J6423J0086O422Q889j304o728q084j0316o030J371
14601f287k241j5425J0357k195n739J980j451O301O86m554k249P690L071j1225
14587b1281M079J4491N3k645P175r201q863k937o1j0408j0666P729K830J2823
14573a6882J6746j6399m483K282M986l345o535m134M340j114m647p298n351P254
14559c4580l318p970N239J2527J6261J0407j059j0941L332J993m536M491Q669
$$ y = [-16406, -10635, -379, -2920, -11126, -9190, -5413, -10769, -23847, -29811, -23662, -6169, -17732, -19352, -22690, -21657, -16839, -27940, -22948, -17241, -27214, -25395, -17825, -15133, -12271, -11095, -4927, -663, -7504, -14338, -21598, -38879, -41077, -25546, -13933, -21176, -24110, -31143, -31065, -26325, -25092, -29901, -43314, -44257, -31259, -17016, -593, 9493, 15915, 24804, 23500, 16772, 8688, -1628, -7658, -6287, -8528, -23953, -13596, -15791, -21530, -19550, -21001, -14700, -14014, -18568, -20817, -13127, -10056, -21281, -17202, -2711, -2658, -5303, 1872, -7329, -16192, -19129, -19190, -29598, -40264, -32535, -29705, -16882, -136, -16535, -21018, -18736, -13750, -17095, -23630, -27764, -23424, -24538, -29185, -36483, -41834, -34580, -37898, -45868, -40629, -28102, -11841, -1434, -2493, -13434, -10102, -8109, -12645, -8154, 515]
14546E15p444j6469K306J4157N712j0813q395M586L641K620K82j916J0306M553
14532C641l991L527K410j1800o766K623Q039m176n029q203r772l840L47j687M298
14517c0379K2466J4207l44R71O41j5590M025N996j1125j7197j0010n671P227J7680
14503a7103J3887N303j0748j1180j1063p553R059J5420N219m163n400p917R031
14490a7208M426k0890O059J3946L688J8465K174o149L868J557k0350j4225p848
14477c2487k391N955J4265r743j0367K952J7704j178r692j0273N574J0943J318
14464a7420o73N279J466n997j65l960N72J859o641j301p009L116J0804P950k289
14449a4409n593k142P990n029J118J0206J0519P784p019L198o89l453j0222j2997
$$ y = [515, -6929, -23398, -21092, -6935, -1223, -12036, -20431, -15845, -12204, -9584, -9302, -11218, -912, 3641, -350, 3177, 5587, -6213, -12979, -10356, -2317, -6493, -11522, -19725, -29497, -33337, -32990, -34677, -30379, -7913, 6294, 5950, 6921, 7562, -8028, -4003, 1993, -9132, -26329, -36339, -42010, -34783, -17103, -3216, 2087, -8661, -19841, -30904, -38457, -29398, -13978, -8759, -12922, -18322, -26239, -17208, -12782, -33672, -27613, -13667, -9979, 8486, 10660, 4511, 8379, 9936, -10414, -24639, -32487, -34878, -28923, -14658, -24401, -34768, -31816, -14112, -15290, -24982, -35255, -29681, -18738, -17420, -18093, -12814, -11348, -17345, -17510, -21470, -20898, -19039, -25680, -26981, -33990, -30874, -20070, -12120, -14409, -20002, -22144, -14154, -19183, -18065, -7859, 2660, 10444, 3425, 6623, 5934, 2481, -7741, -20738]
14435b0738J1004R265L170o257j4703n939R041J283r42O59k834p222l205l713
14421c1131m286R045l035j0515m331J0841O650M773P407m306o196j1474J302J2190
14407b3066J389n393K930N348n761L314J1411j0660P12l093j705q548M384P902
14393b0836J4361L002P229J751p033j7894m860n788L785N996J2102L962n673q84
14379a0780l314j511K429J4556M988j3486j2699P74P878j936M306K445k675o243
14365a5268p190r564J4817o630j2479j566J4227Q442J098l683j150j276J0163
14352a0059L716l378P967R569k319j11j0672q459O513J2556M465l937J5091N348
14338B6290j4513k2753K483R706o313r431k869P961l466l501J0014N813m084m516
$$ y = [-20738, -9734, -469, 2701, -3556, -18259, -24198, -15157, -13874, -14816, -14157, -16991, -24213, -27418, -31131, -35417, -26372, -29407, -39922, -44253, -33412, -26762, -21989, -14582, -18888, -25084, -36558, -35256, -23066, -21677, -27070, -24140, -18792, -24553, -21239, -9828, -20488, -19776, -22869, -24574, -33122, -28738, -20836, -6475, -3473, 3756, 5507, -1526, -19420, -24280, -30068, -26283, -20287, -8185, -4223, -9896, -10780, -14094, -15605, -13176, 1380, 6368, -7118, -19817, -19043, -11165, -13101, -8795, -6350, -9025, -15268, -22458, -32022, -17205, -23835, -36314, -37880, -23653, -15211, -14113, -17796, -18946, -20222, -10059, -6343, -9721, -1754, 7815, 5496, 5385, -5287, -13746, -7233, 5323, 9788, 5851, 20942, 26290, 11777, -10976, -8493, 1213, -5100, -14531, -17400, -9439, -12905, -16406, -6392, -579, -4663, -9179]
14324i179Q663J0570J20j0356j5584o27K454J0454J9730k727q586j3597n457p861
14310b1983L588K0369J3050m233J384K795j3863q612Q218j581l411r57j94m637
14296a0067m395n410p024M938o508L557l807o159p83k226J6944L553J077P310
14282i000k259q794J5951J4837n962j7906q117M118J2807N386p713K797L57m976
14268h474j293q99r069R29L419m303k666J0670R015P959l843j0008l352K307P332
14253b276P323n240j5554L432k362j6386q632L510J0364J323J022L385M618j334
14239a6807K954j1468Q09L0352J1090R24j3825l06q144k487N265q803j4408J1967
14225a2887J4916j2368j9015o456J9377O697M820J828p675O287J3664q321M8O290
$$ y = [-9179, -516, 10054, 10174, -182, -15766, -16393, -13939, -3485, 16245, 13518, 4932, -8665, -14122, -21983, -18395, 1974, 15024, 10791, 12175, 14970, 1107, -7505, 713, -868, -4279, -5236, -5430, -10067, -14462, -19872, -26896, -21958, -28466, -24909, -28716, -34875, -35658, -37884, -20940, -17387, -16310, -9000, -11259, -20053, -4102, 10735, 4773, -13133, -21250, -17132, -4325, 1061, -6652, -3855, -3498, -8474, -9767, -10666, -19735, -18806, -15387, -19690, -22356, -11686, -2671, 5288, 1445, -8563, -11915, -9608, -2276, 5047, -193, -15747, -12315, -14677, -31063, -39695, -36185, -25821, -24498, -23476, -20091, -15473, -16807, -13853, -25321, -24512, 5840, 16930, 17854, 4029, 3723, -4421, -6908, -1643, -10446, -24854, -12887, 2029, -10339, -29354, -35810, -16433, -9736, -4916, -3088, -10763, -4476, 9188, 867, 915, 7205]
14211G205N19p195o848J4637J0228Q764r04j2499l355J758n689n47K5901o648
14197B5327q253K28l15J1808J2306R081J1353Q105o644o920Q68J6517J6046K0405
14183A09912K0237J2976L169J0855L2035K6034L2098L7808M3519O7186P2936R1541
14171E60306J28188J83177K60027L61487M57036N02528M88548M33713L78275L18788
14161D072073K00802J0131k05847l41513l87831m41068m62869m41217l96710l24789
14151A281162k56173j88759j48431j13665j06214q5877o0817l8592k5582k0515
14141B36537l2808l4480j0953o094l545j0964k3954r535m969M659O185n691j5208
14128H9180m686l470q314n639P537p17k84P096J618l18J331O208O04k838K352
$$ y = [7205, 7724, 529, -6319, 8318, 18546, 27310, 26406, 13907, 10552, 12310, 6621, 6074, 31975, 25327, 17074, 17302, 16987, 28795, 41101, 50182, 61535, 69640, 62996, 56076, 56944, 73461, 89507, 109912, 130149, 143125, 146294, 157149, 189184, 215218, 247316, 285124, 328643, 395829, 468765, 560306, 688494, 871671, 1131698, 1493185, 1950221, 2452749, 2941297, 3375010, 3753285, 4072073, 4272875, 4283006, 4077159, 3735646, 3347815, 2906747, 2443878, 2002661, 1605951, 1281162, 1024989, 836230, 687799, 574134, 467920, 382043, 321226, 282634, 257052, 236537, 203729, 169249, 158296, 152202, 148657, 137693, 113739, 104204, 99235, 103894, 110079, 104388, 89180, 84494, 81024, 72710, 67071, 74608, 73891, 73607, 80703, 82321, 82003, 83334, 89542, 90146, 87308, 89660]
14113H9660l879j447J33J138O627L686J2046J9904N269j7536N370J3715n847j2422
14099A16417o499N844q658j2938k0803j61L254q362p127m04L808q8l087k996J2043
14084G0243J0250P958l857j425n153j5798q760o09J285K609P50q482k577R457
14070E5891J2516k873j5889r322O944m388p43P209J158n893J433J9613J4806p174
14056G3288j392J179k273r544M676L854Q291p83L572l112j2769j308L508J0556
14042G7743J0925J3972j401j5202j2210J2501Q097M624j623J1449N800j1158q965
14029I4552J0868K298Q91J8218k796j0317M903J166K375J0685J984K597R336N024
14015A51784L873j0060j2707m105J0166N498Q475L248l479J3716J1657J5771K4557
$$ y = [89660, 85781, 84334, 84467, 85605, 92232, 95918, 107964, 127868, 133137, 115601, 120971, 134686, 128839, 116417, 109918, 115762, 107104, 94166, 73363, 73202, 76456, 68094, 60967, 60563, 64371, 64283, 61196, 58200, 70243, 80493, 88451, 84594, 83169, 78016, 62218, 53458, 52849, 54134, 56743, 57493, 49011, 46434, 55891, 68407, 65534, 49645, 40323, 47267, 42879, 42136, 49345, 50503, 44610, 46043, 65656, 80462, 73288, 71896, 73075, 70802, 61258, 65934, 69788, 78079, 77296, 80868, 77756, 64987, 63679, 67187, 77743, 88668, 102640, 101239, 86037, 73827, 86328, 94425, 99049, 97426, 108875, 114675, 103517, 94552, 105420, 107718, 108609, 126827, 124031, 113714, 118617, 119783, 122158, 132843, 134827, 137424, 146760, 151784, 155657, 145597, 132890, 128785, 138951, 144449, 152924, 156172, 152693, 166409, 178066, 193837, 218394]
14002B18394L0331M2830L4199K1996K5068K5404K9291J4659Q005j079M840k1991
13990D31947k0297l1461l4045k4443k4592k7566k2098j9732j6719p009l944n907
13978A94134k6215j1357J285R700o929q101j5020R32M077p023j2282M656J4378
13965A42235n601p700j4306j4021P36L268J2081l221j870k047l564m419P33K168
13951A04472P773K663Q786j767j2239m436j439j4068j735K947K44M739l998j1824
13937H0118n15P831L685n291R84P624n749j2252J3783J8879J5830m137M67n226
13923A16031j4453O296J6238J1643J0837M419K351n146K565K452m251J703m96
13910A50189j9137j1389K400l720r903l300r62Q036l105L521o372o248Q361J6357
$$ y = [218394, 248725, 291555, 325754, 347750, 372818, 398222, 427513, 442172, 450177, 449098, 453938, 431947, 411650, 380189, 346144, 321701, 297109, 269543, 247445, 227713, 210994, 203985, 200041, 194134, 167919, 156562, 157847, 167547, 160618, 152517, 137497, 138429, 142506, 135483, 123201, 127857, 142235, 136634, 128934, 114628, 100607, 101343, 104611, 116692, 113471, 111601, 109554, 105990, 101571, 102304, 104472, 112245, 114908, 123694, 121927, 109688, 105252, 103813, 89745, 88010, 90957, 91201, 95940, 91942, 80118, 79603, 87434, 91119, 85828, 86812, 94436, 88687, 76435, 90218, 109097, 124927, 120790, 121257, 116031, 101578, 107874, 124112, 135755, 146592, 151011, 153362, 148216, 150781, 153233, 148982, 150685, 150189, 131052, 119663, 122063, 118343, 108440, 105140, 104178, 112214, 109109, 112630, 106258, 100010, 108371, 124728]
13896A24728L2607K9099J8996J1667R865J4343K0069N734q044o042k5824k8737
13884A98461k4755q556j4383j9010j8123j3990j5657j4190J190J730q901l099
13872F0717l075l971q612r912Q347Q863N026j574j0060L523l019M730P657K782
13858F1422n540j6419j1458Q648K530L699O645k257k121J943K1124J1532J282
13845H1030j5182J656j978J5222m528o552j7500R242J3010K553m439j7849j0276
13832D4409J3755J5513j0101j6880J915K1057p73j703J2256N671j3172j1735J98
13819F0410N623n232j0469q155n444l909P086L040P478K328J2197Q91J642j8538
13805D8948l982N110K499R999l243j3386m594Q165n560L439J1631n001o617r37
$$ y = [124728, 157335, 186434, 205430, 217097, 226962, 241305, 261374, 267108, 259064, 253022, 227198, 198461, 173706, 165150, 150767, 131757, 113634, 99644, 83987, 69797, 70987, 72717, 63816, 60717, 57642, 53671, 45059, 35147, 43494, 52357, 57383, 55809, 45749, 49272, 46253, 50983, 58640, 61422, 55882, 39463, 28005, 36653, 39183, 42882, 49527, 47270, 45149, 47092, 68216, 79748, 81030, 65848, 67504, 65526, 80748, 76220, 69668, 52168, 61410, 74420, 76973, 72534, 54685, 44409, 58164, 73677, 63576, 46696, 48611, 69668, 68895, 67192, 79448, 85119, 71947, 60212, 60410, 66033, 60801, 50332, 42177, 36733, 32824, 39910, 42950, 50428, 52756, 64953, 65844, 67486, 48948, 44966, 50076, 52575, 62574, 59331, 45945, 41351, 49516, 43956, 47395, 59026, 54025, 47408, 46471]
13791D6471M437M907m344j281M298k078k746j1624j1551k993p114M822R908N630
13777C6742n700o941K278O40J901J0091P277K172J2812N671M398M674n708j607
13763F8700P876Q738pO599J1286J2867M152K583K187K6915J1644K4049K5801K4863
13749B38253J6120P881r07j2544P064n582k7304j7823o310r996K242k523r360
13736A79211n337L417K297k1376k6038j7540m680p4p597l27K870L613J0762J1637
13722A30838j1258j7420J64j461J294J4955J7757R521R729J5604R640K5499K9957
13709B34819L2996J9428J3098J3327N081j0494k7066o508j8695k0693q950j2101
13697B14242j8060l061k576j3447k1116j3047p808J849J792p812j8007r054K740
$$ y = [46471, 50908, 55815, 51471, 50190, 54488, 52410, 49664, 38040, 26489, 23496, 16382, 21204, 31112, 36742, 31042, 24101, 26379, 27019, 28920, 39011, 46288, 48460, 61272, 66943, 71341, 76015, 70307, 68700, 76576, 85314, 85307, 91906, 103192, 116059, 120211, 122794, 124981, 151896, 163540, 187589, 213390, 238253, 254373, 262254, 261347, 248803, 255867, 250285, 222981, 205158, 198848, 188852, 191094, 188571, 179211, 173874, 177291, 179588, 158212, 132174, 114634, 109954, 109880, 102283, 101956, 104826, 108439, 119201, 130838, 119580, 102160, 102324, 100863, 102157, 117112, 134869, 144390, 154119, 169723, 179363, 204862, 234819, 267815, 287243, 300341, 313668, 318749, 308255, 281189, 274681, 255986, 235293, 226343, 214242, 196182, 193121, 190545, 177098, 155982, 142935, 135127, 136976, 138768, 130956, 112949, 103895, 106635]
13684A06635j071j3516J2681J6461L192R715K4450O197J6735L511r62j650J8781
13671B01159J1898K8212R826J587J8051K9212K0205Q341J1838O352r450K865K928
13658C43024j9528j8263j0538j9512k2443l1061l0092j4248q370j8785j2713l260
13646A34211P523L815j2095P720N981q45J0455P129O288Q272L369k140o129j4233
13632A59321j3944j0901o507p603Q189m63J441m088N730J3320N381n051j1496
13619A33329n935j1218O898n370j4678R305O540j2722n993P265j1933j5459l894
13606G6135P171J0469Q252o74r160L679l097M264Q557o902o609j0433n146J97
13592G6703l091k0841J3492K0245K937p121n205l17M912l282n95N423j0150j0939
$$ y = [106635, 105564, 92048, 104729, 121190, 124382, 134097, 158547, 164744, 181479, 184990, 184028, 182378, 201159, 213057, 241269, 251095, 252682, 270733, 299945, 320150, 328491, 340329, 346681, 337231, 340096, 343024, 323496, 305233, 294695, 275183, 252740, 221679, 191587, 177339, 168969, 150184, 137471, 134211, 141734, 145549, 133454, 141174, 147155, 146310, 156765, 163894, 170182, 178454, 181823, 179683, 173554, 159321, 145377, 134476, 127969, 120366, 128555, 128092, 129533, 125445, 131175, 144495, 149876, 144825, 133329, 127394, 116176, 123074, 117704, 103026, 112331, 118871, 106149, 100156, 107421, 95488, 80029, 76135, 83306, 93775, 102027, 101353, 92193, 95872, 92775, 97039, 105596, 98694, 92085, 81652, 76506, 76703, 73612, 52771, 66263, 86508, 89445, 82324, 77119, 76802, 81714, 78432, 77837, 83260, 73110, 62171]
13578F2171j0112o8O909L957k714k234k42P089L546m042J0119O233j562r111n968
13563F3971K22m544n465M760J5916o840q733q109J404L822k836k288O835j1552
13549D6563n978k986J362J150J204L317J470r82J3665K1834k65j5384p03p907
13535E6360J5359L402l777p342j3646o945R400L568o915L151Q302J2354k994j5932
13521E4345L498L486j2888P310M567O179j640j2154P933J1613J5529p872j699
13508G8207J1813N340j990K222O472K1772J4160J4985K6525k999R757R715J8602
13495B14581L9969N3255O3538O4911P4165P9402O3106O2311N7351L4965r54m742
13483H01858k8465n0939m6084o1999p6043o1696o1111o1946m9365l8787l7467
$$ y = [62171, 52059, 51991, 58900, 62857, 60143, 57909, 57667, 64756, 68302, 64260, 74379, 80612, 79050, 69939, 63971, 64193, 59649, 54184, 58944, 74860, 68020, 59287, 51178, 52582, 56404, 53568, 51280, 58115, 46563, 40585, 37599, 38961, 40111, 41315, 44632, 46102, 45120, 58785, 80619, 80354, 64970, 64267, 56360, 71719, 75121, 71344, 64002, 50356, 43411, 52811, 56379, 49464, 52615, 60917, 73271, 70277, 54345, 57843, 61329, 48441, 55751, 60318, 66497, 64857, 52703, 60636, 72249, 87778, 79906, 78207, 90020, 95360, 93370, 95592, 102064, 123836, 137996, 152981, 179506, 176507, 186264, 195979, 214581, 254550, 307805, 371343, 436254, 510419, 589821, 652927, 715238, 772589, 807554, 806600, 801858, 773393, 722454, 676370, 614371, 538328, 476632, 415521, 353575, 304210, 265423, 227956]
13472B27956k9504l5259j8181l934j6282j5211m876o132p552j4060j3022j297
13460F2646q943Q045M982J702r101m726J1923J4424m08j8236j0796J408r425L398
13446D6893P831k243o789r002M295l950j690M829r95j916q871k276J7379N009
13432D8504l164j3018R949J6207j697l765o860o02J3917L30O495J293J0942Q117
13418H6648j081l618O897r458j0783J0148P882o501j0734j3757k070J3550R374
13405G6497j0901r410j0899j4191P180K5308L482k4856r605P616J0181l852j0533
13392C6017p483P687J915m033Q138P597k182L088r675j5971q706r783k127J7757
13378B2239J5476l453L857J122k0667j1214K2854J1554P627Q98K314R86J7920
$$ y = [227956, 198452, 163193, 145012, 141078, 124796, 109585, 104709, 98577, 91025, 76965, 63943, 62646, 53703, 61748, 66730, 68432, 59331, 54605, 66528, 80952, 80544, 62308, 51512, 52920, 43495, 46893, 54724, 52481, 45692, 36690, 40985, 37035, 35345, 40174, 39179, 37263, 28392, 26116, 43495, 48504, 45340, 32322, 42271, 58478, 56781, 53016, 46156, 45554, 59471, 59801, 66296, 67589, 78531, 86648, 85567, 81949, 88846, 79388, 68605, 78753, 86635, 80134, 69400, 55643, 53573, 67123, 76497, 65596, 56186, 45287, 31096, 38276, 63584, 67066, 42210, 32605, 40221, 50402, 46550, 36017, 28534, 36221, 38136, 34103, 42241, 49838, 47656, 50744, 41069, 25098, 16392, 6609, 4482, 22239, 37715, 34262, 38119, 39241, 18574, 7360, 30214, 41768, 49395, 50293, 52607, 53593, 71513]
13365G1513K460n435L062L049q655J588N912Q39J842J707N985P868K1110K7111
13351A39956J5621K157K154r374j1208p099J033j634j3932j3972k211q642j2530
13338H0319j1603j4309j030M583r32J1823k827j2957j4441J13J298j8j267R702
13324D8454k891j118J2924J1264k6140r649M863Q847P083J1126j5822q127L513
13311D4327j0101p292M47Q633j0038J1869J6237N48r094l457J837L932o401O037
13297D7484L411n201L750J2046k622J791Q93o254m063n259j933M539l877j1716
13283C2989K045J10j139o09J2249J0263L319k2602J884J2402J918N816r70l319
13269E4356m697J509j2425l589P643j1600J2923J2193J0090L294M325l799l089
$$ y = [71513, 73973, 68538, 71600, 74649, 65994, 67582, 73494, 74333, 76175, 77882, 83867, 91735, 112845, 139956, 155577, 157734, 159888, 150514, 139306, 132207, 133240, 131606, 117674, 103702, 101491, 92849, 80319, 68716, 54407, 53377, 57960, 57028, 68851, 66024, 53067, 38626, 38739, 40037, 40019, 38752, 48454, 45563, 44445, 57369, 68633, 42493, 32844, 37707, 46554, 53637, 64763, 48941, 40814, 44327, 34226, 26934, 27381, 36014, 25976, 37845, 54082, 54630, 45536, 42079, 43916, 47848, 41447, 47484, 50895, 45694, 49444, 61490, 58868, 60659, 61552, 55298, 51235, 45976, 44043, 48582, 44705, 32989, 35034, 35144, 34005, 33396, 45645, 55908, 59227, 36625, 38509, 50911, 52829, 58645, 57675, 54356, 49659, 51168, 38743, 35154, 42797, 31197, 44120, 56313, 66403, 69697, 74022, 70223, 67134]
13256F7134j0078j4445N52J836r231n706O357J6734N722J241j4698j824N871k132
13242D7333r145l106j2183J4528O286j0479n815p276q867R146O900m126n068q577
13228I551L161J2590k273j200K821l363N03j449Q919Q366m217M434n720p11L191
13213C4603J565m95j0147p892j1407q250J1361K399O274k384J2348k921M956O076
13199C6086J574J0296N727L81k660m142L629j448k981K961r961k632m383N849
13185C8296K581M413J5883j51l567P428J4566M663J1982J0018o662K981p247j8749
13171G6435P96j36l910K309L975l965l546n417J6471J922j037J3887N141J680
13157A04605J78o089p722n619Q155J989L064K305o921J136J6374O407o490o067
$$ y = [67134, 57056, 42611, 43163, 44999, 35768, 30062, 36419, 53153, 58875, 60116, 45418, 43594, 49465, 47333, 38188, 35082, 22899, 37427, 43713, 33234, 27419, 20143, 11276, 20422, 27322, 23196, 18128, 9551, 12712, 25302, 23029, 21829, 24650, 21287, 21790, 20341, 29260, 37626, 33409, 37843, 32123, 31412, 34603, 36168, 35673, 25526, 17634, 6227, -2023, 9338, 11737, 18011, 15627, 27975, 25054, 30010, 36086, 37660, 47956, 53683, 54064, 51404, 47262, 50891, 49443, 46462, 49423, 39462, 36830, 32447, 38296, 40877, 45290, 61173, 61022, 57455, 64883, 79449, 84112, 96094, 106112, 99450, 102431, 95184, 76435, 77231, 77095, 73185, 75494, 79469, 75504, 71958, 66541, 83012, 84934, 83897, 97784, 102925, 104605, 104783, 98694, 90972, 85353, 93508, 95497, 98561, 100866, 93945, 95081, 111455, 117862, 111372, 105305]
13143A05305N642j330m076r141L586k422M685J5525O699r921j0551J952k84N420
13129A11089O406L58J414k928o486j5897j3089j705O834n209J713o57P797N797
13115I5437l85P290J0852K5465J9484K6092L2490K2444r70J4002J1052Q620K53
13102B72126m698N649K1126J0773N0273P4736N7818Q7851Q9920Q0415O2774L1016
13090H39779K754j9362n7853o8471o7890p8756q5542p7363o9186n0590l3197m4642
13078A89681l1134j7277j0779r957j1689p31L007n471J249p12l378l035q993m150
13064H6631J2505m273M68o09J966R297j4059k56O541q605n436J2370R995j084
13050A05451m676q11O213O754j3656j2138m079P766M009j83j04O889j2684j7153
$$ y = [105305, 110947, 109617, 105541, 96400, 99986, 97564, 102249, 117774, 124473, 114552, 104001, 105953, 105669, 111089, 117495, 117853, 119267, 116339, 109853, 93956, 80867, 79162, 85996, 80787, 82500, 81843, 89640, 95437, 95052, 102342, 113194, 138659, 158143, 184235, 216725, 239169, 238199, 252201, 263253, 271873, 272126, 267428, 273077, 294203, 304976, 355249, 429985, 487803, 575654, 665574, 745989, 808763, 839779, 842533, 823171, 765318, 696847, 628957, 550201, 464659, 387296, 318110, 267520, 234323, 189681, 158547, 141270, 130491, 120534, 108845, 108114, 111121, 105650, 106899, 106187, 102809, 99774, 90781, 86631, 99136, 94863, 95331, 94722, 96688, 105985, 91926, 91670, 98211, 89606, 84170, 96540, 106535, 105451, 100775, 99964, 106177, 112931, 99275, 87137, 83058, 90824, 94833, 94650, 94546, 101435, 88751, 71598]
13036G1598l978J6329O029M66J2459j855Q733J1987l768K546P579r98J269L687
13022A32083j388J482j3804k6987k0528J916K003q648p778N710r243m498J3970
13009F4290J859o615M5k5551k0818L342J5039J6456J0279j934p833O852j3138
12996D2273p385j4510P823J8754R59J1168R107J151J1712J4637o40n968j4529
12983G4552n415N021J975j2220j3507K435J4818K1177l314m197n075K158J8979
12970I7387q615k5196k0328p65P557O814J0904l446j7519R88q017J393L145M37
12956D4739J3390Q184r145N597l042O112J2142J8493K0758J8027K4296J6221k404
12943A73368n093k020p919j8605q846j6031j2992n010m766K731L677P17k2688
$$ y = [71598, 67620, 83949, 89978, 90444, 102903, 101048, 109781, 121768, 118000, 120546, 128125, 127127, 128396, 132083, 130695, 132177, 118373, 91386, 70858, 72774, 74777, 66129, 58351, 64061, 54818, 50320, 64290, 66149, 59534, 59579, 34028, 13210, 16552, 31591, 48047, 58326, 56392, 48559, 55411, 42273, 34888, 20378, 28201, 46955, 47914, 59082, 68189, 69340, 81052, 95689, 95049, 89081, 74552, 69137, 74158, 76133, 63913, 50406, 52841, 67659, 88836, 85522, 81325, 76250, 78408, 97387, 88772, 63576, 43248, 42483, 50040, 56854, 67758, 64312, 46793, 47781, 39764, 41157, 44302, 44739, 58129, 66313, 57168, 62765, 59723, 65835, 77977, 96470, 117228, 135255, 159551, 175772, 173368, 168275, 166255, 158336, 139731, 130885, 114854, 101862, 96852, 92086, 94817, 98494, 99211, 76523]
12930G6523q534K724J4668J8859k018r769j0366j794L284R641q205N353J2406
12917A02772Q052N70j271J0935R426o749j0232R712j933O909l448k0604j8876
12904H5263j436j1515j7184r749O049J638M104m232l289J861M740O721J1272L955
12890G8198L445M682R448j1164m028J3650J7949m189j7457p713j2254n775K235
12877F7027L290O968l035j1805J988M574N69m047r064k0570k2825p600J9734l775
12863B1429j1869j0027J992P768k443k288K107M136K176j0032R335M541q728j4078
12849e981j4606P99J8104N871K702K342p286q33K780j545R830L152J586O347J2222
12834C5484K811J212M380p713l552m230P12M423k068P91K730l297k641k905M719
$$ y = [76523, 67989, 70713, 85381, 104240, 102222, 92453, 82087, 80293, 83577, 93218, 85013, 90366, 102772, 110824, 111394, 110123, 121058, 130484, 123735, 113503, 123215, 121282, 128191, 124743, 104139, 85263, 83827, 72312, 55128, 45379, 51428, 53066, 57170, 52938, 49649, 51510, 56250, 62971, 74243, 78198, 81643, 86325, 95773, 84609, 80581, 94231, 112180, 107991, 90534, 82821, 70567, 64792, 67027, 70317, 77285, 74250, 62445, 64433, 69007, 69576, 65529, 56465, 35895, 13070, 5470, 25204, 21429, 9560, -467, 1525, 9293, 6850, 4562, 6669, 10805, 12981, 2949, 12284, 16825, 8097, -5981, -20587, -19788, -1684, 4187, 6889, 9231, 1945, 1112, 3892, 2347, 12177, 15329, 16915, 23262, 35484, 38295, 39507, 43887, 36174, 32622, 28392, 29104, 33527, 31459, 32250, 34980, 31683, 29042, 26137, 30856]
12819C0856j0169j6192p466K515P804J6400J9139J1911r453j5791k980Q862j884
12806C3552R86j501n244K483J5129M573p520k0567K668r997j0406j7886k4140
12793c7870k4327M07K0553J1069O062L2286M9374L2580K7299K8296K6628J5396
12781A87753J840m887j8512q097j750M556Q738Q205r507k1194j1183j1413j0094
12768A14455L0466K1977Q127J0205J353k854p69k134q79M738k552P046q193K467
12754A83453J5756J7001p73o896o393l367k838M299Q128O603Q564k103P274K0775
12740B49483J9738K2285K0968K3984J8370J1316J888M418K3979J5060J6352K1421
12728D49262L5493L4681L8857L4903J6676N113J9325K7196J7236K1956L4440K9704
$$ y = [30856, 20687, 4495, -2971, -456, 7348, 23748, 42887, 54798, 45345, 29554, 26574, 35436, 33552, 34538, 33037, 27793, 30276, 45405, 49978, 42458, 21891, 24559, 14562, 4156, -13730, -37870, -62197, -61790, -41237, -30168, -24106, 8180, 57554, 90134, 117433, 145729, 172357, 187753, 189593, 184706, 166194, 158097, 156347, 160903, 169641, 177846, 168339, 147145, 135962, 124549, 114455, 144921, 166898, 175025, 185230, 186583, 183729, 182960, 180826, 179947, 184685, 182133, 189179, 180986, 183453, 199209, 216210, 215437, 208541, 202148, 198781, 195943, 200242, 208370, 214973, 223537, 221434, 228708, 249483, 269221, 291506, 312474, 336458, 354828, 366144, 368032, 372450, 396429, 411489, 427841, 449262, 484755, 519436, 558293, 593196, 609872, 614985, 634310, 661506, 678742, 700698, 735138, 764842]
12716G64842L6826L1785L8714K6098L7852K9517J9207L7197N4009O1988N7698
12705A195733N8842O9544R4688J20585J40062J68394K08426K35482K73514L23085
12695B888355M02234N00740N85148P37918Q52101R69139J061757J118049J187022
12686A0302463J244603J305202J433654J679200K108190K845440M039880N910006
12678C0868638Q733765J2344048J5523226J6822386J6557023J5757325J3957413
12671A30563824R936109L944583k307942p576800j1511967j4276611j5780913
12664I2990283j5698190j4291884j2201937r930027p811776n972317m476219l362047
12656A9245886k584341k062301j723347j461253j249015j104193r69204q38529
$$ y = [764842, 801668, 833453, 872167, 898265, 936117, 965634, 984841, 1022038, 1076047, 1138035, 1195733, 1254575, 1324119, 1418807, 1539392, 1679454, 1847848, 2056274, 2291756, 2565270, 2888355, 3290589, 3791329, 4376477, 5114395, 5966496, 6935635, 7997392, 9115441, 10302463, 11547066, 12852268, 14285922, 15965122, 18073312, 20918752, 24958632, 30868638, 39602403, 51946451, 67469677, 84292063, 100849086, 116606411, 130563824, 140499933, 144444516, 142136574, 134559774, 123047807, 108771196, 92990283, 77292093, 63000209, 50798272, 40868245, 33056469, 27084152, 22607933, 19245886, 16661545, 14599244, 12875897, 11414644, 10165629, 9061436, 8092232, 7253703]
12648G253703p15290o16017n23743m19103l41283k98632k80113k44660k13626
12639C601236j87245j80123j61098j38244j46064j24150j15017j05658r6875p6587
12629B270175p5254m3899j9657j4757J317J7892L2458O5045O6308O1625K8680
12618B389933J7445K1289j6098m2230j01263j19652j13537j12720j08221j07648
12608A707298r0482m8374m5891o6096o7996m0252k5042l1479l2760k1093k0757
12597A217076k2762k739p54P70l577n647r474m484L563l919j1399j58q565q102
12583A139829p895m755K0734R047O4J4977K5001K5029K2647K4948Q209n641j88
12570A272006J896r215O471P97j4837k726L261K1965K9176K8732K0965J7291L1522
$$ y = [7253703, 6538413, 5922396, 5398653, 4979550, 4638267, 4339635, 4059522, 3814862, 3601236, 3413991, 3233868, 3072770, 2934526, 2788462, 2664312, 2549295, 2443637, 2346762, 2270175, 2194921, 2151022, 2131365, 2116608, 2117925, 2135817, 2168275, 2233320, 2299628, 2361253, 2389933, 2407378, 2428667, 2412569, 2370339, 2269076, 2149424, 2035887, 1923167, 1814946, 1707298, 1616816, 1568442, 1522551, 1456455, 1388459, 1348207, 1323165, 1291686, 1258926, 1237833, 1217076, 1194314, 1191575, 1190821, 1191591, 1188014, 1182367, 1172893, 1168409, 1171972, 1168053, 1156654, 1156496, 1147931, 1139829, 1131934, 1127179, 1147913, 1156960, 1157024, 1172001, 1197002, 1222031, 1244678, 1269626, 1277835, 1272194, 1272006, 1273902, 1264687, 1271158, 1271955, 1257118, 1254392, 1257653, 1279618, 1308794, 1337526, 1358491, 1375782, 1407304]
12557A407304K2676L4447N3256M8867N3371P0399O7225O3289M5949N4239N1509
12546A972531L1466K9093J9086K3811K8730L4035L3720K5141M0821O4181O0226
12535B362841M9295N3655N5789L1536J8381K1418J6751Q670N257L880J0021J3707
12523B651201J1346p111o391q686J3676R799K6936M9808O3321Q2286R6872J48338
12511C131395J99690K57116L29423L73506M59441M92263N04722M75337M21839
12502F644732L37721K28490P1871n1859j70640k59700l30608l82795m01053l85833
12492E300326l46009l16485k83911k49193k22405k04145j77365j60668j45597
12483C194548j31534j20315j11329j08377q9801q3366n0649n3884l6872k6042
$$ y = [1407304, 1429980, 1464427, 1517683, 1566550, 1619921, 1690320, 1757545, 1820834, 1866783, 1921022, 1972531, 2003997, 2033090, 2052176, 2075987, 2104717, 2138752, 2172472, 2197613, 2238434, 2302615, 2362841, 2412136, 2465791, 2521580, 2553116, 2571497, 2592915, 2609666, 2618336, 2623593, 2627473, 2637494, 2651201, 2662547, 2655436, 2649045, 2640359, 2654035, 2663834, 2690770, 2740578, 2803899, 2886185, 2983057, 3131395, 3331085, 3588201, 3917624, 4291130, 4750571, 5242834, 5747556, 6222893, 6644732, 6982453, 7210943, 7282814, 7230955, 7060315, 6800615, 6470007, 6087212, 5686159, 5300326, 4954317, 4637832, 4353921, 4104728, 3882323, 3678178, 3500813, 3340145, 3194548, 3063014, 2942699, 2831370, 2722993, 2633192, 2549826, 2499177, 2445293, 2408421, 2382379]
12473B382379j8365l9332k5264l2994k9355j5875l6859m9387n2785n7202l0532
12462A994429k5873l2147k6753k7083k4903j2896j8128l5208l8330m2887j9598
12451A690623j8993k4956j3526j1745j0710n07j7486l9217l8504l4364l2072j4787
12439A433756k4716p195n748L017M084K5085K8740N7677Q1957R5164P7086O5524
12427A834431N0168M4018J6992j2963p2870r1076r8064j11901j14593r8122q4292
12416A261728p0674o4780m5035j4302j9797k9038k4769j5001p445j7330k0469
12405I33088m824N363O449J2497M782K108j869J1398K3062K1024K7041R089k858
12392A046350K727j5275k1055j8550k3890j9333k0113j4461j2046j1880j4633
$$ y = [2382379, 2364014, 2324682, 2299418, 2266424, 2237069, 2221194, 2184335, 2134948, 2082163, 2024961, 1994429, 1968556, 1936409, 1909656, 1882573, 1857670, 1844774, 1826646, 1791438, 1753108, 1710221, 1690623, 1671630, 1646674, 1633148, 1621403, 1610693, 1610186, 1592700, 1553483, 1514979, 1480615, 1448543, 1433756, 1409040, 1401845, 1396097, 1399114, 1403198, 1428283, 1457023, 1514700, 1596657, 1691821, 1768907, 1834431, 1884599, 1928617, 1945609, 1932646, 1859776, 1768700, 1670636, 1558735, 1444142, 1346020, 1261728, 1191054, 1126274, 1081239, 1066937, 1047140, 1018102, 993333, 978332, 970887, 953557, 933088, 928264, 933627, 940076, 952573, 957355, 959463, 957594, 968992, 992054, 1013078, 1040119, 1049208, 1046350, 1049077, 1033802, 1012747, 994197, 970307, 950974, 930861, 916400, 904354, 892474, 877841]
12381H77841j1693p296k865M12q922R407O398m561j502J3290P783j8216j1499
12368H48577q354j0143Q009K828j5323j4941k3773k4465j3094r640J1993R313
12356G60987R42q338m094j6938j6804r521q234m193k0312J211n243j5161q237
12343F46065Q483j02j0469j352Q056n620J4124J2754K0798K2898L5063L9846K4338
12330H14882J9829M608K805p508k7983k0050m287j7303m2953l0194j4975q715
12318F68156j9494p139o489j3139j0959j6773o23R293j6054j3993r117o387J1635
12305E68917J969o121J3324K981p233m661k296N491N974q161k1342o581J042L920
12291E47223p33j1342j188q100j225n652j4485n092j325O03P605M114p23J7897
$$ y = [877841, 866148, 858852, 855987, 856399, 847477, 856884, 863282, 858721, 857219, 870509, 878292, 860076, 848577, 840223, 830080, 838089, 840917, 825594, 810653, 786880, 762415, 749321, 739681, 751674, 760987, 761929, 753591, 749497, 732559, 715755, 706234, 698000, 693807, 673495, 674706, 669463, 654302, 646065, 654548, 654446, 643977, 642625, 650681, 645061, 659185, 671939, 692737, 715635, 750698, 790544, 814882, 834711, 839319, 842124, 834616, 806633, 786583, 782296, 764993, 722040, 691846, 676871, 668156, 648662, 641523, 635034, 621895, 610936, 594163, 593540, 602833, 586779, 572786, 563669, 557282, 568917, 570886, 564765, 578089, 581070, 573837, 569176, 566880, 572371, 578345, 570184, 548842, 542261, 543303, 547223, 546490, 535148, 533960, 525860, 524635, 518983, 504498, 499406, 498081, 498684, 506289, 510403, 509680, 527577]
12277E27577j911k68O247J62J083q401m380J3130L796o824j3482J981R263P483
12263E35456J408j722Q446Q839J1045J100l807J2007R783J1717J7397L3796M4591
12250F90056P2477Q0778P4426R6875P9257K9009K8717m622l3744o5676o8157p2611
12238I06785p9852p4223o2048o9759m3722m1606l9959l2189j7308L67j2343k2162
12226D11981j4441n29o677L827L725J030n9j434j0790q864n666k035k056q836
12212C59176J2395J2025P447r880j0312K992J3814J721q307r706o062L874n252
12199C63925J045M239l086r746j0192m939q841q68R489Q73O34n146n172L398k752
12184C32861p649m752N471J6011p043q345j554j3160R475K0842L174j4814P553
$$ y = [527577, 525666, 525398, 531645, 531807, 532890, 524489, 520109, 533239, 537035, 530211, 516729, 518710, 527973, 535456, 536864, 535142, 543588, 552427, 563472, 564572, 560765, 572772, 582555, 594272, 611669, 645465, 690056, 762533, 843311, 917737, 1014612, 1093869, 1122878, 1151595, 1146973, 1113229, 1047553, 979396, 906785, 826933, 752710, 690662, 620903, 577181, 535575, 495616, 463427, 446119, 446486, 434143, 411981, 397540, 397011, 390334, 394161, 397886, 398916, 398857, 397423, 386633, 377769, 372103, 370068, 368012, 359176, 371571, 383596, 391043, 381163, 370851, 373843, 387657, 389378, 381071, 371365, 365303, 369177, 363925, 364970, 369209, 366123, 356377, 346185, 341246, 332405, 331537, 341026, 341899, 342533, 337387, 332215, 335613, 332861, 325212, 320460, 325931, 341942, 334899, 326554, 325000, 311840, 321315, 342157, 345331, 330517, 338070]
12171C38070K72J4721K0804R462j4234j6376j5305j5930m425K649R44J4831L89
12158C35872r51J1524O821k729j0860k162M49j27K987O833p625m847N47j97J3775
12143C49310m689M044Q367O798L0284J8827K6632K6786O951N714K552p086k2002
12130D52488j0540k2453k2754j0427O00m546j7334k1431o546r322n373m179J0403
12117C28586J7087J1242J704j9554m34J9425o559L045P060j2203N603j979j2187
12104C40836O088N892j5919j3439o781O780J869r268l928q018j589J1731J4968
12091C29222L015l798R35K049j0954j5598j5016J5878Q054j974N410J0588P093
12078C34904p238q619J2355J8555m66R97n690k705P956O506n763j0263j0170j0944
$$ y = [338070, 338342, 353063, 373867, 383329, 369095, 352719, 337414, 321484, 317059, 319708, 320652, 335483, 335872, 334921, 346445, 353266, 350537, 339677, 337515, 337964, 337837, 340824, 347657, 340032, 335185, 335732, 335535, 349310, 344621, 348665, 357032, 363830, 394114, 412941, 439573, 466359, 473310, 479024, 481576, 474490, 452488, 441948, 419495, 396741, 386314, 386914, 382368, 365034, 343603, 337057, 327735, 322362, 318183, 328586, 345673, 356915, 358619, 339065, 338631, 358056, 351497, 354542, 361602, 349399, 355002, 353023, 340836, 346924, 352816, 336897, 323458, 316677, 323457, 325326, 316058, 312130, 304112, 302523, 314254, 329222, 332237, 328439, 329374, 331423, 320469, 304871, 289855, 305733, 313787, 311813, 317223, 327811, 334904, 327666, 319047, 331402, 349957, 349491, 350488, 344798, 342093, 350049, 356555, 350792, 340529, 330359, 319415]
12064C19415k25J1173J4594J117j6108o643M731L381q867o418l928j8548m300
12051B89374j530k605M928K116o530q81Q209Q571P468o323L714l808P045l979
12037C05769n262J0086O246R711j0228p1O379J928n204p759j1637j1206R174J9627
12023C17553p280j2177P700L075p436M507J345l442P385k077M249J5153J1800
12010C40355J3846J0659Q1l863J5743P34L622P492k428n519L377J1852P592Q472
11996D12015K5925M9554L1034K603j6280k6882j9979k3336l0422k1956j7701o439
11984C58136M958K0174j313j2403M347j0044r520k358J1387J46j5858j0888l901
11971C32863l836Q096j1252j6537K90L295J2636K716J9791K2058P511J0480m786
$$ y = [319415, 319190, 330363, 344957, 346074, 329966, 323323, 328054, 331435, 322568, 316150, 312222, 293674, 289374, 287844, 285239, 290167, 292283, 285753, 284872, 293081, 301652, 309120, 302797, 306511, 302703, 309748, 305769, 300507, 310593, 316839, 326550, 316322, 316251, 322630, 324558, 319354, 311595, 299958, 288752, 297926, 317553, 310273, 298096, 305796, 308871, 301435, 305942, 307287, 303845, 311230, 309153, 313402, 328555, 340355, 354201, 364860, 364941, 361078, 376821, 377555, 381177, 388669, 386241, 380722, 384099, 395951, 403543, 412015, 437940, 487494, 518528, 521131, 504851, 477969, 457990, 434654, 404232, 382276, 364575, 358136, 363094, 383268, 381955, 369552, 373899, 363855, 354335, 351977, 363364, 363510, 347652, 336764, 332863, 329027, 337123, 325871, 309334, 309624, 312919, 325555, 328271, 348062, 370120, 377631, 388111, 383325]
11958C83325j5102j1532k1001j655O087q980m618m109L021J2236J0597j107K679
11945C49841J5891M730n805o110j037P708j2069j1551J707r813j4543j0646j0829
11932B97474j2059M009J5683p446j982P611K31m261j1641j1594K192M551L668
11919B86436N038l868J0452Q672L159k814N578l052r783j3797l387m303n28k97
11905B77506O974O591j0148r843N195N992M330l815j484j669p886j5648J0143
11892B66238o464k897J603n908q857j4563K006J9497P887O570J6428R589L865
11879B94994K901N761n699J825P96K65q51n364J110J1609J707m300K928N469n979
11864C07172J5926O588m74p521j7261J706M887L277N33Q690k562r538m710l478
$$ y = [383325, 368223, 356691, 335690, 334035, 340122, 331142, 326524, 322415, 325436, 337672, 348269, 347162, 349841, 365732, 370462, 364657, 358547, 357510, 365218, 353149, 341598, 343305, 333492, 318949, 308303, 297474, 285415, 289424, 305107, 297661, 295679, 303290, 303521, 299260, 287619, 276025, 278217, 282768, 286436, 291474, 287606, 298058, 306730, 309889, 307075, 312653, 309601, 299818, 286021, 282634, 278331, 277803, 277506, 284480, 291071, 280923, 271080, 276275, 282267, 286597, 282782, 281298, 279629, 271743, 256095, 266238, 259774, 256877, 258480, 252572, 243715, 229152, 231158, 250655, 258542, 265112, 281540, 291129, 294994, 297895, 303656, 297957, 299782, 300578, 300843, 299992, 294628, 295738, 307347, 309054, 304754, 307682, 313151, 307172, 323098, 329686, 329212, 321691, 304430, 306136, 311023, 314300, 314833, 323523, 320961, 311423, 306713, 303235]
11850C03235j6363P154J0580K985L923Q237l669k3977j4043M77J825J0488J270
11837B92122p768j5317j252M042r906o296R699L169k1240k588O393j231k250J641
11823B49218Q800q656L503k035Q88J2745O142j314j5262l662J2260j217O724j1085
11809B57049j0053J504J362J522O497K089O028j4113j0789j020O781l110o306
11796B37441P019J1802J0112L917j556q45K0651J4428M770K011k040k582o023
11783B99105m317n348Q107q593K219J264R759P623J1874q922J395J9373J3125
11770C46664J4503M3638N9396L8649O936j0358k0716m2241n0015l5452k6037j7462
11758C07505j3487M027p728o407J6811p250k3415N770J9381O241j657m551R130
$$ y = [303235, 286872, 294026, 304606, 307591, 311514, 319751, 316082, 292105, 278062, 278539, 280364, 290852, 292122, 284354, 269037, 267785, 271827, 261921, 255625, 265324, 268493, 247253, 244665, 251058, 249827, 247577, 249218, 258018, 249362, 252865, 250830, 251718, 264463, 270605, 269291, 254029, 250367, 262627, 261410, 268134, 257049, 246996, 248500, 249862, 251384, 257881, 259970, 265998, 251885, 241096, 240076, 246857, 243747, 237441, 244460, 256262, 266374, 270291, 268735, 267890, 288541, 302969, 307739, 309750, 307710, 305128, 299105, 294788, 289440, 297547, 288954, 291173, 292437, 302196, 309819, 321693, 312771, 314166, 333539, 346664, 361167, 404805, 464201, 502850, 509786, 499428, 478712, 436471, 386456, 351004, 324967, 307505, 294018, 298045, 290317, 283910, 300721, 293471, 270056, 275826, 295207, 301448, 299791, 295240, 304370]
11745C04370K0595p7O925K120Q20N553n362j1133j7818J516J664q476j0732k111
11731B87854K43P603r122L441N752K623J4328j108j3711j5378o26j3160j2516
11718B56223j3048j1467J646J254Q439J3812P622P220j665m458j3331q922L741
11705B47066k654Q222N357p875k1418J561P287o170j1211K13M415J1736J774Q6
11691B38389l629J0075j6127J979J7846Q841j5160J0276R270J6883Q344J565J2151
11678C00703K7192J6008J1870L1990L6215N6010O8546O6070O9775N6078M8787
11667G89244K4287j0225k6939l1948m6991n7033l5587m7126n7380l8061j9443
11656D42798l0447k9764k1100j7174r991m072m230j0522r094p976L603M869j4554
$$ y = [304370, 324965, 324888, 331813, 333933, 334753, 340306, 334944, 323811, 305993, 307509, 309173, 300697, 289965, 287854, 288097, 295700, 286578, 290019, 295771, 298394, 312722, 311614, 297903, 282525, 281899, 268739, 256223, 243175, 231708, 233354, 234608, 243047, 256859, 264481, 271701, 270036, 265578, 252247, 243325, 247066, 244412, 252634, 257991, 250116, 228698, 230259, 237546, 231376, 220165, 220378, 224793, 236529, 238303, 238389, 234760, 244835, 228708, 230687, 248533, 257374, 242214, 252490, 261760, 278643, 286987, 288552, 300703, 327895, 343903, 355773, 387763, 423978, 479988, 548534, 614604, 684379, 740457, 789244, 813531, 803306, 776367, 744419, 697428, 640395, 604808, 557682, 500302, 462241, 442798, 412351, 382587, 361487, 344313, 334322, 330250, 326020, 315498, 306404, 298428, 302031, 306900, 292346]
11643B92346K778l68%k937j1086q27J4224J1247p678j6536j255L611M41q288j92
11628B75480r021k6385j4007J2965M921r340o824N352N739Q60K834r506J1611
11615B44679P076K218M606m258j5187Q849L193J0099R730n611j9931n148L489
11602B43804j49k601k4792o376J7959K6519N32J2201r042o216j89Q443j3000r053
11588B38040J3571J4133J5247L749J6204L9062J6011J1724L2087J2280L935L858
11576D19901P294L223N254l989j2861k2379k5378k2288p651j6229k0549k4198
11564B80150j0906J0118O996L525P566J6379L85o840k615K298l170k985k351j260
11550B97290r12R431J3786O395R199J4731N338J1477J8907K7315K8486L4812M1820
$$ y = [292346, 295124, 294756, 294756, 291819, 280733, 279906, 294130, 305377, 297699, 281163, 279908, 283519, 283960, 275672, 275480, 266459, 240074, 226067, 239032, 243953, 234613, 227789, 233141, 238880, 239740, 242574, 233068, 244679, 251755, 253973, 258579, 254321, 239134, 247983, 251176, 261275, 271005, 265394, 245463, 240315, 243804, 243655, 241054, 216262, 209886, 227845, 254364, 254896, 267097, 258055, 251839, 251650, 260093, 247093, 238040, 251611, 265744, 280991, 284740, 300944, 340006, 356017, 367741, 399828, 412108, 416043, 419901, 427195, 430418, 435672, 431683, 418822, 396443, 371065, 348777, 341126, 324897, 304348, 280150, 269244, 279362, 286358, 289883, 297449, 313828, 314213, 307373, 304758, 307056, 303886, 300901, 298550, 297290, 296378, 305809, 319595, 325990, 335189, 349920, 355258, 366735, 385642, 412957, 441443, 476255, 518075]
11537E18075L0689M5318M7499M6401P3308J00634J20777J59759K01924K65720
11527A610104L30194L90183M09373L55080K09994J6546j18883k46828l18693l30405
11517B306665l18399k80123k43449k04114j46453j22551j06973o8927o5210o8955
11507F81511n4369k7047l4924k7216l7283k8129j9497k813q379k791n036l958
11495D30069r901p168P314L019j104m990m716o63j6659j8982N70k340k281j7953
11481C54215q905J943k91j0873o23O142N916r198O033j5767k944l146j793k7j1913
11466C08769m569M704j0509j2853k649k675Q853J981m35J0227K041O403K4367
11453C33655L533q134p593R640J0789N154k514M067j0539L907J8084p33J2687
$$ y = [518075, 548764, 594082, 641581, 687982, 761290, 861924, 982701, 1142460, 1344384, 1610104, 1940298, 2330481, 2739854, 3094934, 3304928, 3321474, 3202591, 2955763, 2637070, 2306665, 1988266, 1708143, 1464694, 1260580, 1114127, 991576, 884603, 815676, 750466, 681511, 627142, 600095, 565171, 537955, 500672, 472543, 453046, 450233, 441854, 439063, 434027, 430069, 420168, 413000, 420314, 423333, 422229, 417239, 412523, 411860, 395201, 376219, 376789, 374449, 372168, 354215, 345310, 347253, 346962, 336089, 335466, 341608, 347524, 338326, 344359, 328592, 325648, 322502, 320709, 320682, 308769, 304200, 308904, 298395, 285542, 282893, 280218, 289071, 291052, 290617, 300844, 302885, 309288, 333655, 337188, 329054, 321461, 331101, 341890, 347044, 344530, 348597, 338058, 341965, 360049, 359316, 372003]
11440C72003o229J2136K808r710J829l937j2550r170l189O672J500j352r64k085
11426C47762n695k730J764Q027J8681O110J604R477N293m019k4044j2101j0415
11413C39714j4937j6630r172j1017j5928l077L57l407Q906M447j5174k0368n081
11400B38633j790k780k282R085m310p657j3048O795J6428k570j2924J4667R088
11387B47335q894j3796P604J1945J527j752o263J510Q006p428n035K696m458j1252
11373B21745n562j0146M736k336J038l75q206M691l87n092m14j1141l262N957
11359A91246N767J2770P818K4551J4313q258m678n334o854o441L408q28j2317
11346B15163r541q690r065r099J0024O548q012K952k460M629J5678Q249J0318
$$ y = [372003, 365774, 377910, 380718, 371008, 372837, 368900, 356350, 347180, 343991, 350663, 352163, 350811, 349847, 347762, 342067, 339337, 341101, 349128, 367809, 373919, 375523, 385000, 390293, 386274, 362230, 350129, 339714, 324777, 308147, 298975, 287958, 272030, 268953, 269310, 265903, 274809, 279256, 264082, 243714, 238633, 236843, 234063, 231781, 240866, 236556, 228899, 215851, 222646, 239074, 236504, 223580, 238247, 247335, 238441, 224645, 232249, 244194, 245721, 243969, 237706, 239216, 247222, 239794, 234759, 237455, 232997, 221745, 216183, 206037, 210773, 208437, 209475, 209100, 200894, 205585, 205198, 200106, 199692, 188551, 185289, 191246, 197013, 209783, 217601, 242152, 256465, 248207, 243529, 238195, 231341, 224900, 228308, 227480, 215163, 205622, 196932, 187867, 178768, 188792, 195340, 187328, 190280, 187820, 192449, 208127, 216376, 226694]
11333B26694n340j7195q830l425P409J2078J8112J0691R328R957P445m048r612
11320B53264k209j4540j6149k5116l839l693l608j566J41k511M558N008p21l475
11306A85544j2178q873J1996O002J6171N779J2207l583r106M858j5999L683j0750
11293A85751j2307p227Q978L639L009j0151k188p102j5312N831J8378m205k0218
11280A46876P656M401O987p380N340K228l271K073J0547j1588j428k957J0582
11267A70066J8348m7N171M192n747N721J793J979j174j1864J835J7646j0042p680
11253A90197J696r661r39n78k1280P685J1867J37o808K698Q545j1321m779K582
11239A70041r251m936l436q875p467j624J2149k92m975O143l967m330J5923J3612
$$ y = [226694, 221354, 204159, 195329, 191904, 199313, 211391, 229503, 240194, 249522, 259479, 266924, 262876, 253264, 251055, 236515, 220366, 195250, 191411, 187718, 184110, 182544, 182685, 180174, 184732, 189740, 189019, 185544, 173366, 164493, 176489, 182491, 198662, 204441, 216648, 213065, 203959, 208817, 192818, 196501, 185751, 173444, 166217, 175195, 178834, 181843, 171692, 169504, 162402, 147090, 152921, 171299, 167094, 146876, 154532, 158933, 165920, 158540, 163880, 166108, 162837, 164910, 175457, 163869, 162441, 159484, 170066, 188414, 188367, 193538, 197730, 191983, 197704, 199497, 201476, 200302, 188438, 190273, 207919, 197877, 190197, 191893, 182232, 181293, 180715, 159435, 167120, 178987, 179124, 172316, 175014, 183559, 172238, 167459, 170041, 160790, 155854, 152418, 143543, 136076, 134452, 146601, 146309, 141334, 147477, 143510, 139180, 155103, 168715]
11225A68715N159o780k029j937O349n45J3503r64n949O633K518J2803M043J6714
11211B18233J6372J8783L8213L4538L4832M2930N8623O9560O5620L7474J9049
11200F54227j4998n2551m5926l8677n6993n9918k8744k0217j9741k5308j0861
11189B80293r277j5926M72J8605L4902K1800j563J8558M9631M1933J5065p05r859
11176D43929l7356k3709l7900k4071k0788j2769j6100k1998m498O497J762j2617
11164B40382j2355J0520P476p878j7407P903J2819K159J1858P680J2247o526j1850
11151B57028j4237r664j3242L178J1945J987j1292L031p853n595N564J1344L881
11138B36075K7436K2940K0331K4714J448J7857o856k5767j7983r145j48k910j2887
$$ y = [168715, 173874, 167094, 165065, 163128, 169477, 168932, 182435, 181471, 175522, 182155, 184673, 197476, 201519, 218233, 234605, 253388, 291601, 326139, 360971, 403901, 462524, 532084, 597704, 635178, 654227, 639229, 586678, 540752, 502075, 445082, 385164, 356420, 336203, 316462, 291154, 280293, 271016, 255090, 255562, 274167, 309069, 330869, 329306, 347864, 397495, 439428, 454493, 453788, 443929, 406573, 382864, 344964, 320893, 300105, 287336, 271236, 249238, 244740, 251237, 252999, 240382, 228027, 238547, 246023, 238145, 220738, 228641, 241460, 243619, 255477, 263157, 275404, 268878, 257028, 242791, 233127, 219885, 223063, 235008, 236995, 225703, 228734, 220881, 215286, 220850, 232194, 236075, 263511, 286451, 306782, 331496, 332944, 350801, 343945, 318178, 300195, 291050, 290902, 287992, 275105]
11125B75105r933l309Q171Q907p956j3849q015J1462J0143p826j4569J007m38
11112B48900Q17k538k6892j4939N3Q756J4458N153n433K362M091j1254j0759J2088
11098B24863r049N83Q430O025p787j8930p39R863m23N98M205J2588J5355O703
11084B52285n437O013J9661J7273J2850J8973J9499K6098M2097O3775N7286L4380
11072E64753L1837J4883K700k1366m2461m9738m2751m0924m0326k5123l3262j3693
11060C04529P456N388O761R147K5492K8623K6663K4239R781L464q508j8786l7130
11047C87119m2720k5051j5515j7376j8992l0786k2597Q418j0119j0966J937O548
11035B09900J0068k337Q444P475q981n792O319L881j22O911m435J3700J8201n521
$$ y = [275105, 265172, 261863, 270034, 278941, 270985, 257136, 249121, 260583, 270726, 262900, 248331, 249338, 248900, 249717, 247179, 220287, 205348, 205401, 214157, 228615, 233768, 228335, 230697, 234788, 223534, 212775, 224863, 215814, 216397, 224827, 230852, 223065, 204135, 203396, 213259, 212836, 213434, 217639, 230227, 245582, 252285, 246848, 252861, 272522, 289795, 302645, 321618, 341117, 367215, 409312, 473087, 530373, 564753, 596590, 611473, 614173, 592807, 550346, 500608, 457857, 416933, 376607, 351484, 318222, 304529, 311985, 317373, 324134, 333281, 358773, 387396, 414059, 438298, 448079, 451543, 443035, 424249, 387119, 344399, 319348, 303833, 286457, 267465, 236679, 214082, 222500, 212381, 201415, 203352, 209900, 219968, 217631, 226075, 233550, 224569, 218777, 225096, 228977, 228855, 235766, 231331, 245031, 263232, 257711]
11021B57711J0031M111l830J1964j2698p624p430L19J0297J6998J1272K5047J5548
11008C31716J9939K2686J1473m23K8713L7913M7906M8528O7358Q7758J06681J87299
10996I97547K45040K53563K30772J56188O6816n1964j35979j61349j82801j77332
10986A240501j46811j29682r7979p0493m1575k8629l2849l0179k501M762M0876
10975G05441M5239M6328Q5803R5620J35968K03628K92406M20257N69640O53249
10965C253579N43798K44862o2200k54095l51015l64191l17984k14724l7050P1904
10955B512884L5490p3353j61349k27550k42479k47519k41608j97613j42923j12884
10945I01096q8058p1080p2624m1584l7122l5759k2884j3537k3991l1710j1754
$$ y = [257711, 267742, 271853, 268023, 279987, 267289, 259665, 252235, 252554, 262851, 279849, 291121, 316168, 331716, 351655, 374341, 385814, 385391, 414104, 452017, 499923, 548451, 615809, 703567, 810248, 997547, 1242587, 1496150, 1726922, 1883110, 1949926, 1897962, 1761983, 1600634, 1417833, 1240501, 1093690, 964008, 866029, 795536, 753961, 725332, 692483, 662304, 659803, 664565, 705441, 750680, 797008, 882811, 978431, 1114399, 1318027, 1610433, 2030690, 2600330, 3253579, 3797377, 4042239, 3980039, 3725944, 3374929, 3010738, 2692754, 2478030, 2440980, 2512884, 2548374, 2475021, 2313672, 2086122, 1843643, 1596124, 1354516, 1156903, 1013980, 901096, 813038, 741958, 669334, 627750, 590628, 554869, 531985, 518448, 494457, 462747, 450993]
10934D50993R83k1483l2534k7474j6676P62r454l571M215q25M301J2072J3444
10921C74753K48l331M372o768l438J737k015L886k623j1931j3211j1705J200L798
10907C34972R938q382j0408J4111J128Q234j5050j2013j1917L199O002j075j967
10894C16772N846j581o585M76P914J0141J0626r325j1866r687K215k428k401m184
10880C05933N99P742p046j6627j5383k0855j2686R87m14j2644j0747r787m105
10867B04967n658j217q36l247k837p078q09R228K257q148o685Q21O616l571k429
10852A81374r310Q010L612j1884j2416m675o741j0725L965N468m077J4393L455
10839A60449k3187j017J408k242L276J6833p450o853j3268p537j5070r229O37
$$ y = [450993, 451976, 430493, 397959, 370485, 353809, 354571, 345117, 341546, 345761, 344936, 349237, 361309, 374753, 375001, 371670, 376042, 369274, 365836, 367573, 365558, 369444, 366821, 354890, 341679, 329974, 331174, 334972, 344910, 336528, 326120, 340231, 341359, 349593, 334543, 322530, 310613, 313812, 319814, 318739, 316772, 322618, 321037, 314452, 314928, 322842, 332983, 343609, 334284, 322418, 312731, 314946, 312518, 310117, 305933, 306532, 314274, 307228, 290601, 275218, 254363, 241677, 242664, 242250, 229606, 218859, 209072, 204967, 199309, 198092, 197256, 194009, 191172, 184094, 183285, 192513, 194770, 186622, 179937, 180758, 187374, 183803, 181374, 172064, 180074, 183686, 171802, 159386, 154711, 147970, 137245, 141210, 146678, 142601, 156994, 160449, 137262, 136245, 137653, 135411, 138687, 155520, 148070, 141217, 127949, 120412, 105342, 96113, 96750]
10826I6750J3892j1597K817N917Q656O455k485M011j5881m832p047p708j3096
10813G5852p393n589J7010R203k436j1895p839Q136P857l343j3163N933J4489
10800H6822J2615M981j9499k521n80K281L203N816Q79Q999J355q521r923j6918
10786F8989O256k910m613J1321K8343J8587K030n487k238J0602K6850Q363n067
10773A61026m062j0236j5824l056m618k4269j2575q776J512J7524j3293k5250
10761E8103j0454n90J0670O047r614j9621P392L457o765j6648L450J1630Q732
10748D5789j4546P167m221j7708N377J5118J272k9299k8844K208j2639j3112J8633
10735b4805N460r049j844J8982J7229j0264k2501k5101q870L189J3788O278k541
$$ y = [96750, 110642, 99045, 101862, 107779, 116435, 122890, 120405, 124416, 108535, 103703, 96656, 88948, 75852, 68459, 62870, 79880, 89083, 86647, 74752, 66913, 75049, 82906, 79563, 66400, 72333, 86822, 99437, 104418, 84919, 82398, 81818, 84099, 87302, 93118, 93997, 102996, 104351, 95830, 85907, 68989, 75245, 72335, 67722, 79043, 107386, 125973, 128003, 122516, 120278, 130880, 157730, 166093, 161026, 156964, 146728, 130904, 127848, 123230, 98961, 86386, 77610, 79122, 96646, 83353, 58103, 47649, 47059, 57729, 63776, 54162, 34541, 41933, 45390, 38625, 21977, 25427, 37057, 45789, 31243, 38410, 34189, 16481, 21858, 36976, 38248, 8949, -19895, -17687, -30326, -43438, -24805, -19345, -28394, -30238, -11256, 5973, -4291, -26792, -51893, -60763, -57574, -43786, -37508, -40049]
10722d0049R522J5351p262l953l234N738K885j2063j3094M361J3426J8158J8379
10709H165p506K345L569j0685j4652j1979j820K788O965p295r548R008J6400k698
10695a6943l734k47Q015l551o2j6285j1220N46k84rP946L647K456k473K565Q475
10679b1158q445j9792J067n567M341k582O667P755N645j0625J06Q771J2579J7135
10665d103L1079J6228J6200k3805r2075j05216o5464l0877k7160K5916N2438N8654
10653a48185O9333P1383P4526M6762N149J3662J7518L490m991O715n976j6633
10641A32753J1301M54k5618k678j9639L105J3365k305j6816j7242l776J4500J7524
10628A04928J1232k267j1400r439j7390k1057q925l430l962j0729q292l676J443
$$ y = [-40049, -30527, -15176, -22438, -26391, -29625, -23887, -21002, -33065, -46159, -41798, -28372, -10214, 8165, 659, 3004, 6573, -4112, -18764, -30743, -32563, -29775, -22810, -30105, -39653, -30645, -14245, -16943, -20677, -20924, -12909, -16460, -16522, -32807, -44027, -43481, -43765, -43774, -35828, -32181, -29725, -32198, -29633, -21158, -29603, -49395, -48328, -53895, -49554, -52136, -45469, -37714, -32069, -42694, -42588, -33817, -21238, -4103, 26976, 43204, 59404, 35599, -56476, -161692, -227156, -258033, -285193, -259277, -206839, -148185, -78852, -7469, 67057, 113819, 118968, 132630, 150148, 153638, 148647, 155362, 149386, 132753, 144054, 144508, 118890, 116212, 96573, 99678, 113043, 110738, 93922, 76680, 72904, 87404, 104928, 116160, 113893, 102493, 93054, 75664, 54607, 45682, 42252, 38290, 27561, 19269, 15593, 17036]
10615A7036j920n360M503l128Q368K4361J1345K3914K5736N421M568N586J8803
10602A39233L1536K5136J2027J1696N516J3980P447N836J4230M0274K6054M336
10590C37301M808r085J2129J7378J7788L4690M5829N0710M5734M4225L9879L5451
10578F76837J1024L2576L9248L3513M0225N8830P3284P2477R3849R2901Q3855
10567A308619J13667J33604J70485K01411K17770K75816L35227L94018M62422
10558C613039N31985O58743Q19682R88381J102790J087465J036188J046057J185448
10549A2069778J449201J842740K403617L160674M134547N515485P631023J0905267
10541D9112332J6067239K4662227L8678427N6915641O4877232M2655659O250254
$$ y = [17036, 15116, 9756, 14259, 11131, 19499, 43860, 55205, 79119, 104855, 110276, 114844, 120430, 139233, 170769, 195905, 207932, 219628, 225144, 239124, 246571, 252407, 266637, 306911, 332965, 337301, 342109, 333024, 345153, 362531, 380319, 415009, 460838, 511548, 557282, 601507, 641386, 676837, 687861, 720437, 759685, 793198, 833423, 892253, 965537, 1038014, 1131863, 1224764, 1308619, 1422286, 1555890, 1726375, 1927786, 2145556, 2421372, 2756599, 3150617, 3613039, 4145024, 4803767, 5623449, 6611830, 7714620, 8802085, 9838273, 10884330, 12069778, 13518979, 15361719, 17765336, 20926010, 25060557, 30576042, 38207065, 49112332, 65179571, 89841798, 128520225, 185435866, 250313098, 292968757, 299219011]
10534B99219011j8982076l3127545l9485508l9797891l7094608l0787967k3244644
10527G6698772j6962498j2305654q953229o605335m954854l701911k687700j833236
10519A8694355j157376p58874p46454r12110j003574r94350r03148q10413o97831
10510A0710225n45710m14622l39637l20532l35620l26629l06243l18194l41260
10501G461778l41634k90811k58220k15819j37086n6624J2086k707r5823j56523
10491E918617j88985j72966r8242l2501J9420M0789M6866P6487J45126K02986
10481E957597K00972J56739J45869J53817J18402L3887K9580J03258J63796J95521
10471G259438J74884J70081R6531j17226l16579m29991m74324m57026m11957l63112
$$ y = [299219011, 280236935, 247109390, 207623882, 167825991, 130731383, 99943416, 76698772, 59736274, 47430620, 38477391, 31872056, 26917202, 23215291, 20527591, 18694355, 17536979, 16778105, 16031651, 15119541, 14115967, 13121617, 12218469, 11408056, 10710225, 10164515, 9749893, 9410256, 9089724, 8754104, 8427475, 8121232, 7803038, 7461778, 7120144, 6829333, 6571113, 6355294, 6218208, 6161584, 6173670, 6170963, 6075140, 5918617, 5729632, 5556666, 5458424, 5425923, 5445343, 5486132, 5532998, 5609485, 5754611, 5957597, 6158569, 6315308, 6461177, 6614994, 6733396, 6767283, 6796863, 6900121, 7063917, 7259438, 7434322, 7604403, 7700934, 7583708, 7267129, 6837138, 6362814, 5905788, 5493831, 5130719]
10461E130719l09015k28192j72917j49519j13487r7057p2294o5098n9570n2407
10451C811163m5479k1226k3174l0821R659M7778P2739K4813n8402j20755j54705
10440C511590j68890j57007j27423j10171j13771j05882r3587o9308o6054o3649
10430B435848l5819j5625l7443r111j4258k0153l5355m0533k9756j2683O223J6834
10418B208169N5415J01388Q5222O9891L2529j2576n0661p2588q4825o9891p5867
10407B186206o7774n5433n6537m8755l8283l977Q699J0440j109J7107M5942K8006
10395B024532N212k2066m3066n1142n4313o0019m2505k3594k6445l6795k9187
10384A640612l1982j1651j9920j7694p939n124L869J486q838K013M061k1182k2416
$$ y = [5130719, 4821704, 4593512, 4420595, 4271076, 4157589, 4060532, 3988238, 3923140, 3863570, 3811163, 3765684, 3744458, 3721284, 3690463, 3700122, 3747900, 3820639, 3845452, 3787050, 3666295, 3511590, 3342700, 3185693, 3058270, 2948099, 2834328, 2728446, 2634859, 2565551, 2499497, 2435848, 2400029, 2384404, 2346961, 2337850, 2323592, 2303439, 2268084, 2227551, 2197795, 2185112, 2191335, 2208169, 2263584, 2364972, 2450194, 2520085, 2552614, 2540038, 2489377, 2416789, 2331964, 2262073, 2186206, 2118432, 2062999, 2006462, 1957707, 1919424, 1915447, 1924146, 1934586, 1933477, 1950584, 1996526, 2024532, 2029744, 2007678, 1964612, 1913470, 1859157, 1799138, 1756633, 1733039, 1706594, 1669799, 1640612, 1608630, 1596979, 1577059, 1559365, 1551426, 1546302, 1550171, 1551657, 1542819, 1544832, 1548893, 1527711, 1505295]
10371A505295l2125k4867k7423l0320k1489j8072k1501k2231j2526J0957N145
10360A310843K9218L5014N2538N8822P0824P0926P6745O3876K5259k4566k8937
10349A740562n2814m5106k8063k687K5623J8515k1752o3907q8276o8939o8062
10338A345094n0242k9248k4373j9750j1346k3371j6915n854k297k2320m2524k7617
10326A069237j8685k8080k1131j8299o908j020k2613j0427l136r124j5598p065
10314I07151Q497j1794j4192o632k0835m850K1516O286j4900q656q005j150N849
10301H58285M548n806j229k099j7293j1347q574m029J3307J3002l835k1342j2584
10288H01004j8948j0079j3172j2702o496r688j0019l692J5685m734q0J2686L151
$$ y = [1505295, 1473170, 1448303, 1420880, 1390560, 1369071, 1350999, 1329498, 1307267, 1294741, 1305698, 1310843, 1340061, 1375075, 1427613, 1486435, 1557259, 1628185, 1704930, 1768806, 1794065, 1769499, 1740562, 1687748, 1642642, 1614579, 1611892, 1637515, 1656030, 1634278, 1570371, 1482095, 1413156, 1345094, 1294852, 1265604, 1241231, 1221481, 1210135, 1186764, 1169849, 1163995, 1161698, 1139378, 1096854, 1069237, 1050552, 1022472, 1001341, 983042, 976134, 975114, 952501, 942074, 938938, 929814, 914216, 907151, 915648, 903854, 889662, 883030, 862195, 857345, 878861, 885147, 870247, 861591, 853586, 852436, 858285, 862833, 857027, 855798, 853699, 836406, 825059, 816485, 812456, 825763, 838765, 834930, 813588, 801004, 782056, 771977, 758805, 746103, 739607, 729919, 719900, 716208, 731893, 727159, 727079, 739765, 742916]
10275G42916R786m940K2975L4547L5644M9461O0742L8754O32j4400k3415k5465
10263I27237l4691k9565k8985k8445k4062j8062r838r116k726J4609Q369M689
10251G69414m033J0379J4150r629K017P20m28J4623N867Q006K357R923p205m647
10237H11514K3091K6413L5237J6631L5563N0389N5268N9515P1394R2089J01275
10226A378379J10641J38850J73478K09532K36086L23441M29402N65076P46344
10217D311229R36104J160523J320825J285616J011299M97803n8915n51861q91465
10208I021158j058176j107107j050766r02590p61074o06715m74548l63238k81341
10199B415603k26596j86954j60074j10164r8089r0703n8699n0204k9926k6452
$$ y = [742916, 752702, 747762, 770737, 805284, 840928, 890389, 951131, 989885, 990517, 976117, 952702, 927237, 892546, 862981, 833996, 805551, 781489, 763427, 753589, 744473, 741747, 756356, 764725, 769414, 765381, 775760, 789910, 780281, 782298, 783018, 782590, 797213, 803080, 811086, 813443, 823366, 816161, 811514, 834605, 861018, 896255, 912886, 948449, 998838, 1054106, 1113621, 1185015, 1277104, 1378379, 1489020, 1627870, 1801348, 2010880, 2246966, 2570407, 2999809, 3564885, 4311229, 5247333, 6407856, 7728681, 9014297, 10025596, 10523399, 10464484, 9912623, 9021158, 7962982, 6855875, 5805109, 4902519, 4141445, 3534730, 3060182, 2696944, 2415603, 2189007, 2002053, 1841979, 1731815, 1633726, 1543023, 1484324, 1434120, 1404194, 1377742]
10189A377742M508J7683J2238k097k9771l2425k9806k7218l0143l0488k4013l1991
10177A174219j640j736j9381k1794l2790k8773k6106j5714j460M237m784P22j2062
10164A012938k0457r488J2055Q599P278O0J2450J8460m806j8054j6873r710k726
10151I89726r501j7726k7391r782j1363j3010q847j0598j1219M070l218j2839
10139H58302r618k953j1874N198J5831K8224J9283K1193J7631M6602M0834K629
10127A031282n713j4399k1148k9929k0600j0369N606K1157M3897P4889Q8068R1946
10115A254687J11822J48934K25160K88214K26889O2578r2023j62020k10440k24373
10105A629428k05759j84346j59028j09592r7704o6186m3769l0997k3412j8197
$$ y = [1377742, 1382250, 1399933, 1412171, 1410074, 1380303, 1347878, 1318072, 1290854, 1260711, 1230223, 1206210, 1174219, 1172579, 1170843, 1151462, 1129668, 1096878, 1068105, 1041999, 1026285, 1024825, 1029062, 1024278, 1025000, 1012938, 992481, 982993, 995048, 1003647, 1010925, 1010985, 1023435, 1041895, 1037089, 1019035, 1002162, 992452, 989726, 980225, 962499, 935108, 925326, 913963, 900953, 892106, 881508, 870289, 874359, 871141, 858302, 848684, 845731, 833857, 839055, 854886, 883110, 902393, 923586, 941217, 987819, 1028653, 1031282, 1025569, 1011170, 990022, 960093, 939493, 929124, 934730, 955887, 999784, 1074673, 1162741, 1254687, 1366509, 1515443, 1740603, 2028817, 2255706, 2318284, 2226261, 2064241, 1853801, 1629428, 1423669, 1239323, 1080295, 970703, 872999, 806813, 763044, 732047, 708635, 690438]
10095F90438j7379R806J3815m651j7379J1809r017o148M488k868j2106k5699k2506
10082F12603j6465r386r798P677n905J833l237k218j1880k270K0278O136N621
10069E92989j0562k0073k2812k57Q399j0842n372o025l900k2071k259O533J767
10056E05515j966Q977j060j8607l753J8313J1501L494L881p178m306R987l793
10043E21005N784N882L312M57j2099j0473l140J353J7808J209j2757j6156J6776
10030E18961R618o115k1461j0538q73Q045Q722J5741R808o817k623m197P362l751
10016E21882m709q898o548j0311P562L53o460j7079o631j752N350j3785k1474
10003D37500j2806k536P108J2495J432j0445j7510j427N238N218n68j5042j1020
$$ y = [690438, 673059, 682865, 696680, 692029, 674650, 686459, 677442, 671294, 675782, 672914, 660808, 635109, 612603, 596138, 586752, 576954, 584631, 578726, 580559, 577322, 575104, 563224, 560954, 581232, 587368, 592989, 582427, 562354, 539542, 539285, 547684, 536842, 531470, 525445, 521545, 499474, 497215, 503748, 505515, 503549, 512526, 511466, 492859, 489106, 507419, 518920, 522414, 526295, 519117, 514811, 524798, 521005, 526789, 532671, 535983, 536440, 524341, 513868, 510728, 512081, 529889, 531098, 518341, 502185, 518961, 528579, 522464, 501003, 490465, 489592, 497637, 506359, 522100, 531908, 525091, 522468, 518271, 525633, 521882, 517173, 508275, 501727, 491416, 498978, 499331, 492871, 475792, 469161, 467409, 472759, 458974, 437500, 424694, 422158, 429266, 441761, 443193, 432748, 415238, 413811, 419049, 424267, 423699, 408657, 397637]
9990C97637L050M191J2529J0866o042p630K483K876p25J0024k882r914K532P411
9976D26406J634p432n156K273j4m412J280q834j365n664J0676P844q369P08r053
9961D00522J026n531O081m35k267j8538j5283n599M258K832j5090M00j413j0154
9947C40809m730J0880L535K018M186j5524o659P955J4813n851j3597n477r95O849
9933C38212j009Q479o173N147M870p903j432K136L361J3726L619j7081r244J2909
9919C49617N04m096L80p445O823J219r540j2387j1544P895J382J790P957J675
9905C34230p369q287p492Q78K517M630J5052J406J2517R799O80r961j1687L610
9891C40523L167j3291J360k125j38K931m688k0003N557N962k762M6K272P831l633
$$ y = [397637, 400687, 404878, 417407, 428273, 422231, 414601, 417084, 419960, 419235, 429259, 426377, 416463, 418995, 426406, 428040, 420608, 415452, 417725, 417711, 413299, 414579, 405745, 404380, 398716, 409392, 417236, 408867, 409575, 400522, 401548, 396017, 402098, 401663, 399396, 380858, 365575, 359976, 364234, 367066, 351976, 352376, 350963, 340809, 336079, 346959, 350494, 352512, 356698, 341174, 334515, 342470, 357283, 351432, 337835, 332358, 331363, 338212, 337203, 345682, 339509, 344656, 349526, 341623, 340191, 342327, 345688, 359414, 363033, 345952, 336708, 349617, 350121, 346025, 346405, 338960, 345783, 347002, 337462, 325075, 313531, 321426, 322808, 324598, 332555, 334230, 326861, 318574, 311082, 311960, 314477, 319107, 334159, 335565, 348082, 357881, 358561, 348600, 336913, 340523, 343690, 330399, 331759, 329634, 329496, 332427, 327739, 307736, 313293, 319255, 316493, 316539, 318811, 326642, 323009]
9876C23009Q366k215r917r026n199P766K987j3162l996N799N023n565q131k0775
9862B74964j930K4255l980j0483J0151n398K609R537J7803J1397J0517K462m958
9849C36946j0210J89o288j4398p978l267L507N421R515N370j0348j739P309j592
9835C12437j1564m594J7126L143r496j9143Q598M721O057J5057j1571j873J409
9822C10307J0107m128j0134l742q569J1695k114m856j931K398L073o384o626J1073
9808C00169L309r481j2722K11J5855p52P65J4387K144k683p730p160N886N669
9794C07867L446p916p17J4910J61Q581k8L652k417K3K1968r517o634l366l818
9779C26195k041l802j1643k780N19J0429J3230k037l383j6060M493J8944o490
$$ y = [323009, 331375, 329160, 319243, 310217, 305018, 312784, 315771, 302609, 298613, 304412, 309435, 303870, 295739, 274964, 273034, 297289, 293309, 282826, 292977, 287579, 290188, 299725, 317528, 328925, 339442, 341904, 336946, 326736, 326925, 320637, 306239, 298261, 294994, 298501, 303922, 313437, 318807, 308459, 306720, 314029, 312437, 300873, 296279, 313405, 316548, 307052, 287909, 296507, 301228, 307285, 322342, 310771, 308898, 310307, 320414, 316286, 306152, 302410, 293841, 305536, 303422, 298566, 296635, 299033, 302106, 295722, 289096, 300169, 303478, 293997, 281275, 281486, 297341, 296589, 297354, 311741, 313885, 311202, 303472, 296312, 302198, 307867, 311313, 303397, 302680, 317590, 317751, 326332, 326304, 329956, 327539, 327562, 349530, 340013, 333379, 330013, 326195, 324154, 320352, 308709, 305929, 306448, 316877, 330107, 328070, 324687, 308627, 313120, 332064, 325574]
9766C25574j6360q782j1680M011J7196O949J332L154K764J548k45K394k877n504
9752C19474m33j600L144N112j1799r299p680K802j0391O69K1034m588L507o919
9738C03033m13J5750O151N217j3622j1355q379k66M638P603J0790J434j7802j4761
9724B88018N704J2185J23K701k150j602N357r787J4029J1446J1471M422o821j032
9710C34064O171J1677J1125n392J765r558j2882m608r853N56j986K434O054J034
9696C30601j1228J1606J2874m731r228o026J1267M66n594p868j8735q164P70J5908
9682C11918L628o677k344J0217O478O553L608j1884o673L159P860Q128m819L868
9668C33020J7568j4107j5898n642R825J3319J3484J0860j82n002o535p936J0594
$$ y = [325574, 309214, 300432, 288752, 292763, 309959, 316908, 318240, 321394, 324158, 325706, 325461, 327855, 324978, 319474, 319041, 317441, 320585, 325697, 313898, 304599, 296919, 299721, 289330, 289999, 311033, 306445, 309952, 303033, 302620, 318370, 324521, 329738, 316116, 304761, 296382, 296116, 300754, 308357, 319147, 320581, 302779, 288018, 293722, 305907, 306030, 308731, 306581, 304979, 310336, 300549, 314578, 326024, 337495, 341917, 335096, 334064, 340235, 351912, 363037, 357645, 359410, 349852, 336970, 332362, 322509, 323065, 321079, 323513, 329567, 330601, 319373, 330979, 343853, 339122, 329894, 323868, 335135, 335601, 330007, 322139, 303404, 295240, 296010, 311918, 315546, 308869, 306525, 316742, 323220, 329773, 333381, 321497, 314824, 317983, 325843, 333971, 329152, 333020, 350588, 336481, 320583, 314941, 324766, 338085, 351569, 362429, 362247, 357245, 350710, 342774, 353368]
9655C53368j705n963j4400J989P142o61J4298l779o917j67J9375J2503n069N17
9641C70531k592M972j642q312j577J2293R66o079J1918O88p708l510J2315R148
9627C91411m745j5876J583L958J565K677j105K136J2427l003l901j7442m492L11
9613C65504n60J0274J2586o215N927R469P604j7176k243M998N859J3959L707q066
9599D05627K003N480r03m271J5000K616n271K781p758P782M293o902j887l051
9585D15539Q28R286J781O224J5958K154o784o208J369l976J627J931J1884L714
9571D55327j848O156m187n09O911P179j9106n428J83Q710K0879O362o775N259
9557D79113L18J518Q975K825L381N367o987J633L431k697n595m609j92P157P713
$$ y = [353368, 351663, 345700, 331300, 333289, 340431, 339770, 354068, 350289, 343372, 343205, 362580, 375083, 370014, 370531, 367939, 372911, 371269, 362957, 361380, 373673, 374639, 368560, 380478, 381166, 373458, 369948, 382263, 391411, 386666, 370790, 372373, 376331, 377896, 380573, 379468, 381604, 394031, 391028, 387127, 369685, 365193, 365504, 364944, 375218, 387804, 381589, 387516, 396985, 404589, 387413, 385170, 390168, 396027, 409986, 413693, 405627, 407630, 413110, 412207, 407936, 422936, 425552, 420281, 423062, 415304, 423086, 427379, 420477, 418590, 415539, 416367, 425653, 427434, 433658, 449616, 451770, 444986, 438778, 440147, 436171, 437798, 439729, 451613, 455327, 453479, 459635, 455448, 454939, 461850, 469029, 449923, 444495, 444678, 453388, 474267, 480629, 473854, 479113, 479431, 480949, 489924, 492749, 496130, 501497, 494510, 496143, 499574, 496877, 491282, 486673, 486481, 493638, 501351]
9542E01351J5296J92q198j1609j423N928M716o088n780O249J3055M476j1066o373
9528E00726N927R284J2211p825J737J0837K224M938J1449l898K904M7q540R85
9514E43006P037L260O554N783N472R610J5662q36N3j3335j3106J8602J0285J0697
9500F08744P4k666K438j4644j082N240L524M825J0051N866J0355M245q248r961
9486F18761K54J4049J5954N15j0068P956J7596R820j707J94k608J2300Q788j472
9472F90332j1224q082R743Q407J1759K0856p553J4277Q074K476j681J0708N691
9459G53783j983l312j472O478R781l759Q072K868r656o485O316J1228J4207Q499
9445G94565P449J5921pN634j816l13M227J5645J8o254R158M021R253P792m760
$$ y = [501351, 516647, 516839, 508641, 497032, 495609, 501537, 506253, 500165, 494385, 500634, 513689, 518165, 507099, 500726, 506653, 515937, 528148, 520323, 522060, 532897, 535121, 540059, 551508, 547610, 550514, 550561, 542021, 543006, 550043, 553303, 559857, 565640, 571112, 580722, 596384, 595548, 595601, 582266, 569160, 587762, 598047, 608744, 608818, 606152, 608590, 593946, 592864, 598104, 601628, 606453, 616504, 622370, 632725, 636970, 628722, 618761, 619015, 633064, 649018, 649533, 639465, 647421, 665017, 674837, 673130, 673324, 670716, 683016, 691804, 690332, 679108, 671026, 680769, 689176, 700935, 721791, 714238, 728515, 736589, 739065, 737384, 748092, 753783, 751800, 748488, 747016, 753494, 763275, 759516, 767588, 770456, 760800, 754315, 760631, 771859, 786066, 794565, 802014, 817935, 817928, 823562, 821746, 821433, 825660, 841305, 841323, 835069, 844227, 848248, 857501, 865293, 860533]
9430H60533O355J3332L398J1399K0931J3190N443K087p39j021Q772J0644Q208
9417I62532n389P283N234M674P368Q886Q213o012N42J1617J0762P004J5818j557
9403A036975n237J4043r8P891J4767K2505J3995Q299Q711J969K549n135O360K2335
9389A149929J0891M518K803K1069J3243J1690j5317k685J7139P745p094M112K1955
9376A239998K1554K7892J7423J1736O62l806k297J587J1112J7835J6416J4538
9364A374650O86J5204J4702J2384J7000N667Q095J8134J0854J0547K739J2671
9352A503333O803N295R444K3055J6988P234J444P301J7184K0867K6281L194J4886
9339A663309J8450J5642R947J2457Q514J4174K4366J8357L208Q151J2000J6793
$$ y = [860533, 866888, 880220, 883618, 895017, 915948, 929138, 934581, 936668, 935929, 934908, 943680, 954324, 962532, 957143, 964426, 969660, 974334, 981702, 990588, 998801, 992789, 993331, 1004948, 1015710, 1022714, 1038532, 1036975, 1031738, 1045781, 1045683, 1053574, 1068341, 1090846, 1104841, 1113140, 1121851, 1123820, 1126369, 1121234, 1127594, 1149929, 1160820, 1165338, 1168141, 1189210, 1202453, 1214143, 1198826, 1196141, 1213280, 1221025, 1213931, 1218043, 1239998, 1261552, 1289444, 1306867, 1318603, 1319265, 1315459, 1313162, 1314749, 1325861, 1343696, 1360112, 1374650, 1375336, 1390540, 1405242, 1417626, 1434626, 1440293, 1448388, 1466522, 1477376, 1487923, 1490662, 1503333, 1510136, 1515431, 1524875, 1547930, 1564918, 1572152, 1573596, 1580897, 1598081, 1618948, 1645229, 1648423, 1663309, 1681759, 1697401, 1707348, 1719805, 1728319, 1742493, 1766859, 1785216, 1788424, 1796575, 1808575, 1825368]
9327A825368J3797K4867J5874Q935N903O44J3333K5480L4594K1364J6838J6242
9315B023239J2851J1510P429K3482L946J8920L0051L3719J3614Q641K4681K6122
9303B238205K4069N069J8120J6205J0488K1366K0964J4786J025J4546L2885L5298
9291B453026K4589J3910J9302J7717K5307K3174K3860K3882J9004K4638N959M073
9279B678441J9791K3798K7497J3786L543K2868L8392K2366K0809K7764K2261J0767
9267B932083J4781J2615J6160L9396K9118P668L5744K8113J2686J7503L6745L2760
9255C215372K8882J5584j290P866K3885L1881K4319K3195R325J7819J6230L1176
9243C444244K6645R361K2018K5159N543K8235K8097J5104J3755J6743J6677K2273
$$ y = [1825368, 1839165, 1864032, 1879906, 1888841, 1894744, 1895388, 1908721, 1934201, 1968795, 1990159, 2006997, 2023239, 2036090, 2047600, 2055029, 2078511, 2082457, 2101377, 2131428, 2165147, 2178761, 2187402, 2212083, 2238205, 2262274, 2267343, 2285463, 2301668, 2312156, 2333522, 2354486, 2369272, 2370297, 2384843, 2417728, 2453026, 2477615, 2491525, 2510827, 2528544, 2553851, 2577025, 2600885, 2624767, 2643771, 2668409, 2674368, 2678441, 2698232, 2722030, 2749527, 2763313, 2766856, 2789724, 2828116, 2850482, 2871291, 2899055, 2921316, 2932083, 2946864, 2959479, 2975639, 3015035, 3044153, 3051821, 3087565, 3115678, 3128364, 3145867, 3182612, 3215372, 3244254, 3259838, 3258548, 3266414, 3290299, 3322180, 3346499, 3369694, 3379019, 3396838, 3413068, 3444244, 3470889, 3480250, 3502268, 3527427, 3532970, 3561205, 3589302, 3604406, 3618161, 3634904, 3651581, 3673854]
9231C673854J5976J6740J3561J9767K6000K4860J2176J9261K6747J1797O2J7666
9219C878467N668P944O705K0842K5871J6786N458J7924P640J2904K3554K954J3135
9206D045852R280q789j0560P621K1113J4004q728o580M86J1915o557o97J6993
9193D085353K1319L41o640j4806j1979k88J1415l157L828P869j7257j1222j1298
9180D053478l08j031j0594j0610r192j4157j4850j0589l265n784j2878o904r62
9167C952354l674k2219j1154j9795j4564j2316j5906j3419k6509j5025j8281l376
9155C776116j5826j7709j1977j1564j9046k4543k0358j4676q678j5259k4219k4088
9143C568173j0543l5322k8505k4951q969j7175j4696r441k0675k9042l1187j2700
$$ y = [3673854, 3689830, 3706570, 3720131, 3739898, 3765898, 3790758, 3802934, 3822195, 3848942, 3860739, 3860801, 3878467, 3884135, 3892079, 3898784, 3919626, 3945497, 3962283, 3967741, 3985665, 3993305, 4006209, 4029763, 4032717, 4045852, 4055132, 4046343, 4035783, 4043404, 4064517, 4078521, 4069793, 4063213, 4063699, 4075614, 4069057, 4068360, 4085353, 4106672, 4107013, 4100373, 4085567, 4073588, 4073300, 4084715, 4081558, 4085386, 4093255, 4075998, 4064776, 4053478, 4053170, 4052139, 4041545, 4030935, 4021743, 4007586, 3992736, 3982147, 3978882, 3973098, 3960220, 3953316, 3952354, 3948680, 3926461, 3915307, 3895512, 3880948, 3868632, 3852726, 3839307, 3812798, 3797773, 3779492, 3776116, 3760290, 3742581, 3730604, 3719040, 3699994, 3675451, 3655093, 3640417, 3631739, 3616480, 3592261, 3568173, 3557630, 3522308, 3493803, 3468852, 3459883, 3442708, 3428012, 3418571, 3397896, 3368854, 3337667, 3324967]
9131C324967j5346j9431o647j0140k1198k5862j1615k6100j5067l4476l1797l3050
9119C074238k0654j5167k8569j7580j5645j6087l1772k0301j9748j9607r833l904
9107B855371k0999l2859k3798j6490j5188k0007j3171l3050j6444j9589k9710
9096B614066j3069j4084j9817j6660j2485k0269k6169k4846j7224q205j4288k7629
9084B399321j8302k3285k0986j7076k0414p675j2911j0562q570l8881k0755j5986
9072B183918m777l525k0809j2631k1575k0335r183j1025j5062k2841j4433j0016
9060B017706k9637j5901o829j0889k2126k0048j4327j6680r422n318j1402k4926
9048A830201j2944j7579j7500l07P003k3621l3031j9248L325m492j0827j4076
$$ y = [3324967, 3309621, 3290190, 3283543, 3273403, 3252205, 3226343, 3214728, 3188628, 3173561, 3139085, 3107288, 3074238, 3053584, 3038417, 3009848, 2992268, 2976623, 2960536, 2928764, 2908463, 2888715, 2869108, 2859275, 2855371, 2834372, 2801513, 2777715, 2761225, 2746037, 2726030, 2712859, 2679809, 2663365, 2643776, 2614066, 2600997, 2586913, 2567096, 2550436, 2537951, 2517682, 2491513, 2466667, 2449443, 2441238, 2426950, 2399321, 2381019, 2357734, 2336748, 2319672, 2299258, 2291583, 2278672, 2268110, 2259540, 2220659, 2199904, 2183918, 2179141, 2175616, 2154807, 2142176, 2120601, 2100266, 2091083, 2080058, 2064996, 2042155, 2027722, 2017706, 1988069, 1972168, 1965339, 1954450, 1932324, 1912276, 1897949, 1881269, 1871847, 1866529, 1855127, 1830201, 1817257, 1799678, 1782178, 1781871, 1788874, 1765253, 1732222, 1712974, 1716299, 1711807, 1700980, 1686904]
9036A686904j9264k3592j9681j1129Q532o326k2598k1295q218n464n975k1824
9024A530070k1906r099k081j5592l407o818k0813j4215j5158j2800l410l525j6025
9011A385221j5569j1105j9737k263K742K707j6385j9611q103j3627l48j6061m166
8998A263695l978n566r50j6072q34J3801j111k1090o685p746j1910j4848k0785
8985A165921n545l548p923j333j7515r968n420N544j316n40o850j4616j0790r539
8971A076562j2825j405p516j7317p323p251j0600k1618k821L472k005j3020J9052
8958I95385J3728l656j4433j0363q704k6572k2413M392n666p752Q151N223P458
8945I34778O680r477j3565j1461j3361j0179m709n334k2834k3318k114K050k91
$$ y = [1686904, 1667640, 1644048, 1624367, 1613238, 1621770, 1615444, 1592846, 1571551, 1563333, 1557869, 1551894, 1530070, 1508164, 1499065, 1496984, 1481392, 1477985, 1471167, 1450354, 1436139, 1420981, 1408181, 1404771, 1401246, 1385221, 1369652, 1358547, 1338810, 1336547, 1339289, 1341996, 1325611, 1306000, 1297897, 1284270, 1283922, 1267861, 1263695, 1259717, 1254151, 1253201, 1237129, 1236295, 1250096, 1248985, 1227895, 1221210, 1213464, 1201554, 1186706, 1165921, 1160376, 1156828, 1148905, 1147572, 1130057, 1120089, 1114669, 1120213, 1118897, 1118357, 1111507, 1096891, 1086101, 1076562, 1063737, 1062332, 1054816, 1037499, 1030176, 1022925, 1012325, 990707, 987886, 991358, 989353, 976333, 995385, 1009113, 1005457, 991024, 980661, 971957, 945385, 922972, 927364, 921698, 913946, 922097, 927320, 934778, 941458, 931981, 918416, 906955, 893594, 883415, 878706, 873372, 850538, 827220, 825106, 827156, 826865]
8932H26865J0083P652J0190j2570j6823m074M83q367j1770j0733j0591K054J1844
8919G94243Q667o9j672j1027r559j571J370j3765j4357q715N624Q50o690j2407
8905G30922j4282n227R269m200j0661o30l971r03J465k138j6103j0228p322r247
8891F56744J0511R130N505l26j2627j1263N567J7634R561j6463j8054j0191J791
8878F47519k996j5443k569L154l77j0397J0822O738P399k2569j7455n858J0475
8865F08443l659j592l560M36l710j6029j4172K260L408n815k071j4822O758P834
8851E63709o575K49P827j8852j1868K0585M684r202r01n906J533K638j6114p102
8837E24705P251l300M683N445o669o825q699j4079n905m062N263j066J194N976
$$ y = [826865, 836948, 844600, 854790, 842220, 825397, 821323, 821806, 813439, 801669, 790936, 780345, 782399, 794243, 802910, 802841, 801169, 790142, 780583, 779012, 780382, 766617, 752260, 743545, 749169, 750019, 743329, 730922, 716640, 711413, 720682, 716482, 705821, 705191, 701220, 700317, 701782, 699644, 683541, 673313, 665991, 656744, 667255, 676385, 681890, 681564, 668937, 657674, 663241, 680875, 690436, 673973, 655919, 645728, 647519, 644523, 629080, 626511, 629665, 629288, 618891, 629713, 636451, 643850, 621281, 603826, 597968, 608443, 604784, 603192, 599632, 600068, 596358, 580329, 566157, 568417, 571825, 566010, 563939, 549117, 555875, 563709, 557134, 557383, 565210, 546358, 534490, 555075, 559759, 550557, 549656, 543750, 545283, 547921, 531807, 524705, 531956, 528656, 533339, 538784, 532115, 525290, 516591, 502512, 496607, 492545, 497808, 496742, 497936, 503912]
8823E03912K246K455m417j0173j237L683o972k986j5129j0910L605J0929L321
8810D78327j0294o188p824l759Q124Q3n567j4100p152L391N355l801P521P803
8796D51919J0037o111j1000j4846p918J508r35N108k402j994N693k2816p565q709
8782C89969Q151J1613K028j0696p655R665j896n341M463j6309o000J593M213L942
8768C87740k14k501L423J7523m732j0894N646J5151L199p364r680J203j1132j2972
8754C74396q146j930q541K190N590K497j12j6951k277N229l836J3132p664j1032
8740C42545r02N781J0913P509m43n059p388M185j391j3426N215J1719l451j6402
8726C39405p423q83J2523M661r753N781J2148O156q680j1026j1868o80N812k151
$$ y = [503912, 506158, 508613, 504196, 494023, 492786, 496469, 489497, 486511, 471382, 460472, 464077, 475006, 478327, 468033, 461845, 454021, 450262, 458386, 458469, 452902, 438802, 431650, 435041, 440396, 436595, 444116, 451919, 461956, 455845, 444845, 429999, 422081, 423589, 422654, 427762, 425360, 423366, 429059, 406243, 398678, 389969, 398120, 409733, 411761, 401065, 393410, 403075, 401179, 395838, 400301, 383992, 377992, 379585, 383798, 387740, 387526, 385025, 388448, 405971, 401239, 390345, 395991, 411142, 414341, 406977, 397297, 398500, 387368, 374396, 366250, 364320, 355779, 357969, 363559, 366056, 365944, 348993, 346716, 351945, 348109, 361241, 353577, 342545, 341643, 347424, 358337, 365846, 365403, 360344, 352956, 357141, 355750, 342324, 347539, 359258, 355807, 339405, 331982, 331099, 343622, 348283, 338530, 344311, 356459, 362615, 353935, 342909, 331041, 330361, 336173, 334022]
8712C34022n835j1290M46n26l217Q775j3325j5532j621J3408J127n523J8161J3895
8698C32965M229M374r200p906o056k635J0146j0851j0280p562J357J2902P232
8685C18715M161o010o857n305n738J941N607l3r81j4326j3965N656M688l822R490
8670B93221p389j6317M901R891o372m788p356j665M816L81m534p441p672L870
8656B53546L635k293N79L339N874L497k024r126j3157Q873J1639L911j1036q522
8642B48735P945N132o720K19J9527J027j3947p500j934K967J044L746N617r60
8628B64898m651K281J292o206n366r761m986J1974p333m325L438K613K023J1216
8614B57107k872n490l082q636R618J2102k70j8202j6952j0426k213J880N503M03
$$ y = [334022, 328187, 316897, 317343, 316817, 313600, 322375, 309050, 293518, 291897, 305305, 306432, 300909, 319070, 332965, 337194, 341568, 332368, 324462, 318406, 315771, 325917, 315066, 304786, 297224, 298581, 311483, 318715, 322876, 316866, 310009, 304704, 298966, 300907, 306514, 306481, 305500, 291174, 277209, 282865, 287553, 283731, 293221, 285832, 269515, 274416, 284307, 277935, 273147, 265791, 264126, 268942, 269323, 264789, 257348, 249676, 253546, 257181, 254888, 255467, 258806, 264680, 268177, 266153, 257027, 243870, 252743, 264382, 268293, 257257, 248735, 256680, 261812, 255092, 255311, 274838, 275865, 261918, 254418, 252484, 255451, 256495, 260241, 265858, 264898, 260247, 262528, 263820, 257614, 252248, 242487, 237501, 249475, 242142, 237817, 241255, 243868, 245891, 257107, 254235, 248745, 245663, 237027, 246645, 258747, 258477, 240275, 223323, 212897, 210684, 212564, 218067, 218470]
8600B18470j645J9054O709M042Q482p167K449r844K78q251j2443J1661J0180p678
8586B34297p587R006K1171k783j0850L58Q961K970m143j0472r002k861M075J4234
8572B47374K176J0974J3462j9323j5339K621O489K021j3316p949N008N620O854
8559B46672q315m617j0643j0574K172L390K376o469M277L014O302p993p006q384
8545B04202m81l35Q380J0932j0351k32J833j0447J216O385J4718J2795O00p615
8531B31600p580p659p581J1133j624n475N931j2300n430K023m887j2833n065p8
8517A80175M980J2061n062l705m103L796j885J563J3941k715o203p69Q997M329
8503B05400j1839j5987K069J1616k723j0340l664J4339K174o524j0091j4214K873
$$ y = [218470, 216825, 235879, 242588, 246630, 255112, 247945, 250394, 240550, 240828, 232577, 220134, 231795, 241975, 234297, 226710, 235716, 256887, 254104, 243254, 243612, 252573, 255543, 251400, 240928, 231926, 229065, 233140, 247374, 249550, 260524, 273986, 254663, 239324, 241945, 248434, 250455, 237139, 229190, 234198, 239818, 246672, 238357, 233740, 223097, 212523, 214695, 218085, 220461, 213992, 218269, 221283, 227585, 219592, 212586, 204202, 203721, 203386, 211766, 222698, 212347, 212115, 213948, 203501, 204717, 211102, 225820, 238615, 239215, 231600, 224020, 216361, 208780, 219913, 218289, 212814, 218745, 206445, 201015, 203038, 198151, 185318, 180253, 180175, 185155, 197216, 192154, 188449, 184346, 188142, 186257, 187820, 201761, 199046, 192843, 192074, 201071, 205400, 193561, 177574, 179643, 191259, 188536, 178196, 174532, 188871, 191045, 184521, 174430, 160216, 163089]
8490A63089J0961Q968K48l058j1177N406J800n191j0882p115J0127J0877R481
8477A83534R115j683r430k573Q047M325m243j0302q786q947N226J9990K470j0115
8463A76628j3877q185K035j321P150N988j6073m325K772K0374j622q771Q558j3370
8449A55961n480l614J1435N40j4954m302k836O406M902K62K182j204k364j36p498
8434A39300j4162M239N115N805R736O737N167m902j3043p940R012M417j2576n989
8420A30916M907J1758k320L886j1440p704K09J935M541P616m332K839N801J3585
8406A62197J023l975l832L034P62Q158N512K65r963K925L260j1107j4915K312
8392A45656j0055k913n736k774J3298N798k720o453J3117J1563L189j4280q323
$$ y = [163089, 174050, 183018, 183266, 180208, 169031, 174437, 176237, 171046, 160164, 153049, 163176, 174053, 183534, 192649, 190966, 181536, 178963, 187010, 191335, 187092, 176790, 168004, 159057, 164283, 184273, 186743, 176628, 162751, 154566, 156601, 155280, 162430, 168418, 152345, 148020, 150792, 171166, 169544, 160773, 169331, 155961, 150481, 146867, 158302, 158842, 143888, 139586, 136750, 143156, 148058, 148320, 150502, 149298, 146934, 146798, 139300, 125138, 129377, 134492, 140297, 150033, 156770, 161937, 157035, 143992, 136052, 145064, 149481, 136905, 130916, 135823, 147581, 145261, 149147, 137707, 130003, 130212, 132147, 136688, 144304, 139972, 142811, 148612, 162197, 163220, 159245, 155413, 158447, 159209, 167367, 172879, 173144, 163181, 166106, 169366, 158259, 143344, 145656, 135601, 132688, 126952, 124178, 137476, 143274, 140554, 134101, 147218, 158781, 161970, 147690, 139367]
8379A39367l389j2848m551J0656N425K506J775Q846P824l310j3774m739J0594
8366A44382L251m821p984q949P765P072j567j6986p317O072N141K138R148J2889
8352A50234k28o414k0747o31l856k866P960R317M166k618N730J0934R827j2178
8338A48630k0907j5089l844N651R268N066n32j4821m597P920l587m984J603K326
8324A12103K53k428K063R988J1234m032L199M849j1685q653p614o581J3565J2750
8310A29011J611P319m165J990M02j0534k866P731K92j4562N298J5483k254j2343
8296A22413j0687N922r86m589J383J2589J2190N350n909j3751q682p316l735Q703
8282A12895J3419R904J1533o803l873j5241j4663r588q752K776J209M246R560
$$ y = [139367, 135978, 123130, 118579, 129235, 134660, 137166, 138941, 147787, 155611, 152301, 138527, 133788, 144382, 147633, 142812, 134828, 125879, 133644, 140716, 139149, 122163, 114846, 120918, 126059, 128197, 137345, 150234, 150006, 143592, 122845, 122214, 118358, 115492, 123452, 132769, 136935, 134317, 140047, 150981, 160808, 148630, 127723, 112634, 108790, 114441, 123709, 128775, 128243, 113422, 108825, 116745, 113158, 108174, 109777, 112103, 112356, 109928, 111991, 121979, 133213, 129181, 132380, 137229, 125544, 116891, 109277, 102696, 116261, 129011, 130622, 137941, 133776, 135766, 136168, 125634, 122768, 130499, 130791, 116229, 121527, 137010, 134756, 122413, 111726, 117648, 116662, 112073, 113456, 126045, 138235, 143585, 137676, 123925, 115243, 107927, 104192, 112895, 126314, 136218, 147751, 140948, 137075, 121834, 107171, 97583, 88831, 91607, 92816, 97062, 106622]
8269A06622l304L584K2399p605m082o929q37J418k792m702q714N335K1080R441
8255A30914k4057l774l28j472M931P58o332N611K338m216l528p886L465Q607M632
8240A09663j54J4940R785K866m697J145N541p489j8574J514j872m520l578N011
8226A09581J2923j189q621K559L51j0300l183j42L058K424n266k345j0823j4040
8212G4987k399L989j99m767m227O145J0644J101J37L942J7926l245j0230J559
8198I5363L596J004L554n838q77J1416O088N268n204j1523j439j2559r884P919
8184H6884J3166R69P52p98j2412j0265j3957M723J6015Q930L129Q950K998j8113
8170I0971n172O373o6L386K961k923j6939r98p263Q233M410J2195Q570j507j2198
$$ y = [106622, 103318, 106902, 129301, 121696, 117614, 110685, 109848, 111266, 108474, 103772, 95058, 100393, 121473, 130914, 106857, 103083, 102755, 101283, 106214, 106972, 100640, 106251, 108589, 104373, 100845, 92959, 96424, 105031, 109663, 109509, 124449, 134234, 137100, 132403, 133548, 139089, 131600, 113026, 114540, 112668, 108148, 104570, 109581, 122504, 121315, 112694, 115253, 115604, 105304, 102121, 101979, 105037, 107461, 102195, 99850, 89027, 74987, 72588, 76577, 76378, 71611, 67384, 73529, 84173, 85274, 85411, 89353, 107279, 104034, 93804, 95363, 98959, 99963, 103517, 97679, 96802, 108218, 114306, 119574, 114370, 102847, 101408, 88849, 78965, 86884, 100050, 101019, 101771, 100973, 88561, 78296, 64339, 69062, 85077, 94007, 97136, 106086, 109084, 90971, 85799, 92172, 92106, 95492, 98453, 95530, 78591, 77593, 70330, 78563, 82973, 95168, 103738, 102231, 90033]
8155I0033o235R499J2360M436P20n985o428j000M402j054M170l505r810m172k890
8140H4541J7969q89q637q000M402j695K168q415M304N261R218q26n092J261M724
8125A00294k0203k283J112n821K217Q726p91k443j130L2P147N594l873J319m307
8110H5590Q666P486k324k292J242j666J0655N994K365j4114j5749J5567O259K084
8096A09763J0538l535k953r34n544p369k073m384j2312o385J1818J6423K960p106
8082I8907l22q813n823L264j757L35P164J2897Q545j216r859j6509j89N951n555
8067H7020M962q325j5363r869J2675J100k756O340l409o833O770l696L613P454
8053G9683J025j931K761K37k596M414P955L779L813L367m196K904n370K785k773
$$ y = [90033, 83798, 93297, 105657, 110093, 110813, 104828, 98400, 97400, 101802, 100748, 104918, 101413, 91603, 87431, 84541, 102510, 101621, 92984, 84984, 89386, 87691, 89859, 81444, 85748, 91009, 100227, 99401, 94309, 95570, 100294, 80091, 77808, 78920, 73099, 75316, 84042, 83251, 80808, 79678, 79710, 86857, 92451, 88578, 89897, 85590, 94256, 101742, 99418, 97126, 98368, 96702, 107357, 113351, 115716, 101602, 85853, 101420, 107679, 109763, 120301, 116766, 113813, 112879, 107335, 99966, 97893, 93509, 81197, 74812, 86630, 103053, 106013, 98907, 98585, 89772, 83949, 87213, 85456, 85791, 92955, 105852, 114397, 113181, 103322, 86813, 86624, 92575, 87020, 91982, 83657, 68294, 58425, 71100, 72200, 69444, 75784, 72375, 65542, 72312, 68616, 72229, 79683, 80708, 78777, 81538, 81775, 79179, 83593, 91548, 95327, 99140, 102507, 98311, 101215, 95845, 98630, 95857]
8038I5857k5003q607J5904Q046n954p558J553l721K777P38k836j912J5065m978
8024G9371j1506m509k514o512J700P986m90k390j5304L272K44J0280N450p364
8010E7714j1757J4945J0602N953q255l450N821L303J3245m844j8238J0493j182
7997G4350k73J323J2558P906J475j3394j1231j4345K746J116q963K2213J5216
7984I0697R90J681l253K599L40p071J073K735L342K571l453j9101j5499q078N272
7969E4845Q350K3628O14j0439j139J670L47L965r83o699J1346P72J122K254p950
7954H1703k063o472R6P936o460j0074O173Q056O511n6n895N691P198j854K204
7939I2694k295L384n864j5754j7003l337J0273R429q290R726J7486L154p173P32
$$ y = [95857, 70854, 62247, 78151, 86197, 80243, 72685, 74238, 70517, 73294, 74032, 71196, 69284, 84349, 79371, 67865, 63356, 60842, 54330, 56030, 64016, 63526, 61136, 45832, 49104, 49348, 59628, 65078, 57714, 45957, 60902, 71504, 77457, 69202, 65752, 71573, 74876, 88121, 83277, 65039, 75532, 74350, 74077, 75400, 87958, 95864, 97339, 83945, 72714, 58369, 61115, 62231, 53268, 75481, 90697, 91687, 93368, 90115, 92714, 93054, 85983, 87056, 89791, 93133, 95704, 92251, 73150, 57651, 49573, 54845, 63195, 86823, 87437, 76998, 75859, 77529, 77876, 81841, 80858, 74159, 85505, 86277, 87399, 89653, 81703, 79640, 73168, 73264, 81200, 74740, 64666, 70839, 78895, 85406, 85350, 79455, 85146, 92344, 90490, 92694, 90399, 93783, 87919, 72165, 55162, 51825, 62098, 71527, 63237, 72963, 90449, 93603, 86430, 87162]
7925H7162p671j1223P781P84j549k902j876P530Q087n88N553j6565j4906k116
7911E7501n670J2098K0993K6p503N44L35L205o537r947n822j653j128l020p24
7896E2698J863o392O145K1333J7317R982q855M81M040j5762j1097r038p881K4234
7882G9068J3471L644j114k4324j3522J2279K0411J4707j2312m915o460o341M464
7869G9056N367k225m012l793o844m549Q11O34P82J0825K836m757j423k130j0882
7854E9696k4361j648K5848O414j08N191O637j651j0109J8345k543m562p112L841
7840G3878l783l477n876O176J4592k79j3773n720P118k326K727J965j678j840
7826F7704p61Pl091r242q695K000R585M114K177l74l064J579j387M482j3427r313
$$ y = [87162, 79491, 68268, 76049, 76833, 75284, 72382, 70506, 78036, 86123, 85535, 91088, 74523, 59617, 57501, 51831, 63929, 84922, 84948, 77445, 77989, 78324, 81529, 74992, 65045, 59223, 57570, 56442, 53422, 52698, 54561, 48169, 54314, 75647, 92964, 102946, 94091, 94572, 98612, 82850, 71753, 62715, 54834, 79068, 92539, 96183, 95069, 70745, 57223, 69502, 89913, 104620, 92308, 87393, 80933, 74592, 79056, 84423, 82198, 78186, 74393, 67549, 63000, 63811, 64445, 65227, 76052, 78888, 74131, 72708, 70578, 59696, 35335, 33687, 59535, 65949, 65841, 71032, 77669, 76018, 65909, 84254, 81711, 77149, 70037, 73878, 70095, 66618, 60742, 66918, 81510, 81231, 67458, 61738, 68856, 66530, 69257, 71222, 69544, 67704, 66943, 66950, 63859, 54617, 45922, 47922, 57507, 61621, 63798, 63424, 60360, 61939, 60552, 65034, 51607, 42294]
7810D2294M963J0517l903p072L45J0815J0372m676j2036m696N139J883q913m726
7796D0306M449M848J585p082r54J4827O739l297o577k526L670k270L988K383j0542
7781D9547O070n76o963j1418Q313K274J0123r591j6000L628J1202P27J9330M020
7767G0686j2435j2630K428J0537j0283j1168M802N676p585K059P084l159k0246
7754B5766j6832N624J8342K0232J1061r152k1336j963J0011J2683J291O546j7393
7741D4880o541Q583R021m313j0263r833N996k437q460L539L054Q301q23k93j215
7726C9196k525O626L408J698r44J698R633K65l729k909J405J11j2301j1521J159
7711C1270J2784J1590L902m561j3230l609Q008R658O049j0354j295O48L690J0386
$$ y = [42294, 47257, 57774, 53871, 46799, 47144, 57959, 68331, 63655, 51619, 46923, 52062, 53945, 45032, 40306, 44755, 49603, 51188, 44106, 43152, 57979, 64718, 61421, 54844, 52318, 55988, 53718, 57706, 60089, 49547, 55617, 55041, 48078, 36660, 44973, 47247, 57370, 47779, 31779, 35407, 46609, 47336, 66666, 70686, 58251, 45621, 48049, 58586, 48303, 37135, 41937, 47613, 40028, 42087, 49171, 46012, 25766, 8934, 14558, 32900, 53132, 64193, 55041, 33705, 31742, 41753, 54436, 55727, 62273, 44880, 38339, 46922, 55943, 51630, 41367, 31534, 37530, 35093, 26633, 30172, 33226, 41527, 40704, 40411, 39196, 36671, 43297, 46705, 48403, 47459, 49157, 58790, 59055, 55326, 52417, 53822, 53933, 41632, 30111, 31270, 44054, 55644, 59546, 54985, 41755, 38146, 46154, 55812, 61861, 51507, 50212, 50860, 54550, 64936]
7697F4936o930J3172L837o165k7170j1239M605J5282N365Q61P714L396L750J416
7683G2830l129j4248L006K290r961k141j7353p702J1197j4011K662K4400K595
7670E0435j1104K155M645j1957M555K417J9860M502l450k1595j2577N985J1292
7657D5163J2992j437O55r009L414Q397K618K124m435p110j2980n812M187J2221
7643E0988J204j1315l715K868J1242n710m118P285o717n744j3854n91K3453J4096
7629E9372J571q439q056P958K688M011k460j0828o057O896J406M309J0177j1739
7615E0809p289N346l410J309j5373j987J0641k783k339Q262N083J0504L446L836
7601F6055M448n258K054j5062k485M721n240k609N633m35p541p95j628k809k19
$$ y = [64936, 58006, 71178, 75015, 68850, 41680, 30441, 35046, 50328, 55693, 56554, 64268, 67664, 71414, 72830, 69701, 55453, 58459, 60749, 50788, 48647, 31294, 23592, 34789, 20778, 23440, 47840, 50435, 39331, 41486, 46131, 34174, 38729, 41146, 61006, 65508, 62058, 40463, 27886, 33871, 45163, 58155, 56718, 57373, 48364, 51778, 60175, 62793, 64917, 60482, 53372, 40392, 34580, 38767, 50988, 52192, 40877, 37162, 40030, 51272, 45562, 41444, 48729, 42012, 36268, 22414, 21823, 45276, 59372, 60943, 52504, 44448, 52406, 55094, 59105, 56645, 45817, 39760, 46656, 48062, 52371, 62548, 50809, 43520, 48866, 45456, 46765, 31392, 29405, 40046, 37263, 34924, 43186, 48269, 58773, 62219, 66055, 70503, 65245, 67299, 52237, 49752, 54473, 49233, 46624, 52257, 51822, 44281, 43486, 41858, 39049, 38830]
7586C8830M911M959m15J217j0268o388k115o566j239J3024R372q465j122o526
7572B9209l386J1210J1328O483J847l806M679j1656m568p339r055M142J640R44
7558C1672o373n214j7018Q451P112n103j204J5290M667Q266K442O18p41m527M302
7543D2640k288P980N994Q248n972r923j6086j11p958J1012K3032N685o303l084
7529E2866J044j2447q998n047P067Q721J9288O315p45o452q134j1736o130P465
7515D3077L347N714P172K826n687r31L653n676j6907r330J6953J0942J3479O801
7501G5433j0379j4363l696j0933K130Q373j0353m51J487k469j2302Q193l951j4371
7487A2348p730J5519J6254L481Q201J554k967l453r707J752k269J239o322K388
$$ y = [38830, 43741, 48700, 48285, 49502, 39234, 32846, 30731, 24165, 22926, 35950, 45322, 36857, 35735, 29209, 25823, 37033, 48361, 54844, 56691, 52885, 57564, 45908, 41340, 34001, 24946, 29088, 30728, 31672, 25299, 20085, 3067, 11518, 18630, 13527, 12323, 27613, 32280, 40546, 42988, 43606, 42865, 38338, 42640, 40352, 48332, 54326, 62574, 56602, 46679, 30593, 30482, 22524, 33536, 56568, 62253, 55950, 52866, 53910, 41463, 32465, 27418, 34485, 43206, 62494, 68809, 68064, 61612, 53478, 41742, 35612, 43077, 46424, 52138, 59310, 62136, 56449, 55518, 59171, 53495, 36588, 27258, 44211, 55153, 68632, 75433, 65054, 50691, 46995, 36062, 38192, 46565, 36212, 35761, 37248, 34779, 22477, 30670, 26719, 12348, 4618, 20137, 36391, 39872, 48073, 49627, 46660, 43207, 33500, 35252, 32983, 34222, 27900, 30288]
7473C0288l768K881j6458L454M763q47Q507L711p321p98k922k797J1177K424j0112
7458B2182L012J3964M573m669l563J617N869q81j921l553o966m237n825R273J6210
7443D5085m022j065j2914l167j100K893Q511J1142J428o92N592j889j45p048n2
7428D2557m476k514o643l776J4802P30q049q79j314n059j0011n360Q266R973J5088
7413D3335j4860r521j793J2976J450m478J4527K609O901K470p138j6190r779J8435
7399C8944N186P439J0729q904j2115L388Q787l848o920O661L374j3845l149m097
7385C1630Q906N783j1245m689M37j906K895R680P275m764j4925m114N254l512
7371B6705p091J0796K716K913o169k95j8177r691M331J0604J4259J2382J269p644
$$ y = [30288, 26520, 29401, 12943, 16397, 21160, 20313, 28820, 32531, 25210, 24412, 21490, 18693, 29870, 32294, 22182, 25194, 39158, 43731, 39062, 35499, 37116, 42985, 42104, 40183, 36630, 29664, 25427, 19602, 28875, 45085, 41063, 39998, 27084, 23917, 22817, 25710, 34221, 45363, 46791, 46099, 51691, 49802, 49657, 42609, 42557, 38081, 35567, 28924, 25148, 39950, 40680, 32631, 31752, 30438, 25379, 15368, 10008, 18274, 28247, 43335, 28475, 18954, 17161, 30137, 31587, 27109, 41636, 44245, 51146, 53616, 46478, 30288, 20509, 38944, 44130, 51569, 62298, 53394, 41279, 44667, 53454, 49606, 42686, 49347, 52721, 38876, 35727, 31630, 40536, 46319, 35074, 30385, 30822, 28916, 31811, 41491, 48766, 44002, 29077, 24963, 30217, 26705, 19614, 30410, 33126, 36039, 29870, 29575, 11398, 1707, 6038, 16642, 30901, 43283, 44552, 36908]
7357C6908m239j65l453r467p845m998J8105J2692o439j0161K441Q323L953L553
7343C9208l397j285O587J0908o460l949n506K028j554J833J0651r69m878k939
7329D0278r909J2961l236p884R60l770Q693m352M75k798q150o190J0188o37l858
7314B2771J3506P218q204j717N09J1826M797L754l193J1903j2689L300p112r19
7300D5750K667n335J859m68o616l897j640j27Q9j1574M77m977j2561n118R882
7285H411J6397R723N907l383m310j7030j8389k657Q808J2623K638p189Q496J4563
7271C4608L66q53L286j072n439j011l699k203n698Q63p963K015j08J4072N598
7256C2762O889J504j0664n128M376L375m699J047k2890J451J6108j919N974R653
$$ y = [36908, 32669, 32504, 29051, 19584, 11739, 6741, 24846, 37538, 31099, 20938, 23379, 31702, 35655, 39208, 35811, 34526, 41113, 52021, 45561, 41612, 36106, 38134, 36580, 38413, 49064, 48095, 43217, 40278, 30369, 43330, 40094, 32210, 33170, 29400, 38093, 33741, 34216, 31418, 23268, 17078, 27266, 26629, 22771, 36277, 43495, 35291, 33574, 34083, 45909, 50706, 54460, 51267, 63170, 50481, 53781, 46669, 45750, 48417, 43082, 44941, 44473, 37857, 33960, 32320, 32193, 32282, 20708, 21185, 16208, 3647, -1471, 8411, 24808, 34531, 40438, 37055, 32745, 15715, -2674, -5331, 3477, 16100, 18738, 11549, 20045, 34608, 34974, 34121, 37407, 36335, 30896, 29885, 26186, 23983, 18285, 19148, 11185, 13200, 13092, 27164, 32762, 39651, 41155, 30491, 25363, 29739, 33114, 28415, 29462, 6572, 8023, 24131, 22212, 28186, 37839]
7242C7839J508o745J465N067r316m683K193j281k954L396o929l867m361J7062
7228B8394K44k296k574J133O225Q228p337N403Q876Q89n302j669j191R437j369
7213D7091K220q389j1924q926Q047o285L171n609j3889l588J7103J1251J640L435
7199C5348J887P792m72r765r886p110o90o175O101P169k899j0123J885J6667P260
7184C6989j1163o717p088K433K688Q995J1173P212j5441j1746J7002O810p477
7171C3670m87l052q061M620J2554J1693m216k0542r237J3368j309o433M504O978
7157C4050m882p912n92R493J0801K930o027j2726O843L105j2986n05R315P320
7143C8227K725j1113j4691N43j971o562m03J556k562K395O697O831J6378N936
$$ y = [37839, 39347, 32602, 34067, 39134, 29818, 25135, 27328, 26047, 23093, 26489, 19560, 15693, 11332, 28394, 28638, 26342, 23768, 24901, 31126, 39354, 32017, 37420, 46296, 47185, 41883, 40214, 39023, 48460, 47091, 49311, 40922, 28998, 20072, 28119, 21834, 25005, 19396, 5507, 1919, 19022, 30273, 31913, 35348, 37235, 45027, 44555, 34790, 24904, 17794, 17104, 10929, 17030, 24199, 21300, 11177, 13062, 29729, 36989, 25826, 19109, 12021, 14454, 17142, 26137, 37310, 44522, 29081, 17335, 34337, 41147, 33670, 33183, 30131, 22070, 26690, 39244, 50937, 46721, 26179, 16942, 30310, 29001, 22568, 27072, 34050, 29168, 21256, 20664, 30157, 40958, 43888, 37861, 25135, 31978, 35083, 22097, 21592, 30907, 38227, 40952, 29839, 15148, 15691, 13720, 7158, 6755, 8311, 5749, 8144, 14841, 21672, 38050, 43986]
7129D3986r791p374N645J325j4540j4416k059L850L165k547j2730J665J0113k896
7115C396J726L261n88J2858M573j0008K172P769p31j1187N1O92O82o509M375R315
7099B1847j379k864j1306O872J0063r109p433j431J1246J2356l313m167k015j8415
7085I52M391J2336P370n67j6375p370J2546J2509J2k0222j481J1506J3824n434
7071B3997n252Q876L11q082j7003p040M024L491N387j772n41p90k115M367J8916
7056B6774L041n084l815M549M83m489l549Q375o505J5455O753j13k4345q614Q280
7041A7196P832L235o409k03J070J2617R516m549p207j2282k017K77L183l319j132
7026A7808O434o726k958N413l006j1415M644J1608J978j1483N377J7376K568j6378
$$ y = [43986, 34195, 26821, 32466, 33791, 19251, 4835, 2776, 6626, 9791, 7244, -5486, -3821, 6292, 3396, 5122, 8383, 7795, 20653, 25226, 15218, 17390, 25159, 24428, 13241, 13292, 13984, 14666, 8157, 12532, 21847, 20468, 17604, 6298, 13170, 23233, 14124, 6691, 5260, 16506, 28862, 25549, 21382, 19367, 952, 5343, 17679, 25049, 24482, 8107, 737, 13283, 25792, 25804, 5582, 4101, 15607, 29431, 23997, 18745, 27621, 27932, 19850, 2847, -4193, -169, 3322, 8709, 6937, 6396, 5606, 3491, 7858, 26774, 29815, 24731, 20916, 25465, 25948, 21459, 17910, 26285, 19780, 35235, 41988, 41875, 17530, 8916, 17196, 25028, 28263, 21854, 21651, 22721, 35338, 44854, 40305, 33098, 20816, 18799, 19076, 22259, 18940, 17808, 24242, 17516, 14558, 19971, 16965, 5550, 10194, 21802, 23780, 12297, 17674, 35050, 37618, 21240]
7012B1240k781J3201o403m619M653J0499n67l915o996j528m555j6118l2Q923J5171
6997B6173N569j0665Q909J9018O219n406j1479m693p223o729q490N65O831L764
6983B2363k88j253j0385M419J1663j2357n699L89K03J4400j544k2364j754J3511
6969A1304O480K911M628O53p498Q01P509m394N414J3116j5206m995l050J2190
6955B9863J284L44j861n622j5932j6861K021L712N974O477o7P366P179j4354o665
6940B858K560J5092J5934k667l064j811o818p900j4400K395O673J1043P596J693
6926B9184n961j4537L980N276K626J8375J7032o332j090q771j1770o782n742J322
6912A6810l400L013R003p941o627J8876q326j4617k789J2021J7253p921n869J0285
$$ y = [21240, 18459, 31660, 25257, 20638, 25291, 35790, 35223, 31308, 24312, 22784, 18229, 2111, 2079, 11002, 26173, 31742, 21077, 29986, 49004, 55223, 49817, 38338, 33645, 26422, 19693, 11203, 11768, 18599, 22363, 22075, 20822, 10437, 14856, 26519, 14162, 8463, 8852, 9055, 23455, 21911, -453, -2207, 11304, 17784, 20695, 25323, 25976, 18478, 19279, 26788, 22394, 27808, 40924, 25718, 20723, 17673, 29863, 31147, 31491, 29630, 24008, 8076, -8785, -6764, -3052, 2922, 9399, 9332, 16698, 23877, 9523, 2858, 5418, 20510, 36444, 33777, 30713, 28902, 22084, 14184, -216, 2179, 8852, 19895, 27491, 29184, 23223, 8686, 12666, 17942, 20568, 38943, 55975, 49643, 48553, 39782, 28012, 21230, 15488, 16810, 13410, 16423, 25426, 17485, 10858, 29734, 21408, 6791, 4002, 16023, 33276, 25355, 19486, 29771]
6898B9771o055k001k007K348M291q297Q633J8636J1153m271j7605j4613m795J6662
6884C1850M671r908M424J042O876j1370J177n102j6832o378n184J5173J0472q98
6870B0013o854j7069j0686m453M563J767Q868J3049J2619P100R745k332o92l803
6856C1835P217j2177j0114J0404K1720q79j5201r949j0479l189p489L800j024
6843D475J0240K2797o34l889l987q507N567m958J3760J4311o554j1013j5470p921
6829H217j553n519N715Q785K891N581O786J671N54p088k1994j3627J428K3557
6815A5404J4795L663j7225K64J2258J548l929o295j648j531m65O113O151J370
6801C0473K611k886q198q975J5464j028k117o574n937p714j442N051J5869Q32
$$ y = [29771, 23716, 21715, 19708, 22056, 26347, 18050, 26683, 45319, 56472, 52201, 34596, 19983, 15188, 31850, 36521, 26613, 31037, 32079, 38955, 27585, 28762, 23660, 6828, 450, -4734, 10439, 20911, 20013, 13159, -3910, -14596, -19049, -14486, -12719, -3851, 9198, 21817, 28917, 38662, 36330, 35638, 31835, 39052, 26875, 16761, 27165, 48885, 48006, 32805, 22856, 12377, 9188, 1699, 5499, 4475, 14715, 37512, 36878, 32989, 29002, 20495, 26062, 21104, 34864, 49175, 42621, 31608, 16138, 8217, 6664, 1145, 6860, 15645, 18536, 24117, 30903, 32574, 33128, 26040, 4046, -9581, -8153, 15404, 30199, 33862, 16637, 16901, 29159, 30707, 26778, 20483, 18835, 17304, 16839, 22952, 29103, 30473, 33084, 30198, 22000, 13025, 28489, 27461, 25344, 18770, 12833, 5119, 3677, 8728, 24597, 25429]
6787B5429O598O376K85j0574L535j021j2844l908j452J6098m242M37J0523j6845
6773A8395j4132P421O713l427q897N536J1789j3159p527J3156J0861O69j734k651
6759B3013q182j619l607l643P921J2758n864r198J5328J0980M222J018o913P248
6745D3462m459o142o585j565J1281l179n898N029L01o457k103q129j0754m159
6731F43J1965K195J3314j531n010j738O580m19p064P302Q040M154l728K969k0580
6716A7092j0705J4237K304Q09l795p191Q153r447l718J4971J1543K75L850k506
6702C5872m958J6981L784n553P527M98j6602r313P839m231n036j641j1832P485
6688B0820R803j3245j104k147j8212J2976R954L941m580m86j1904J730N462J8062
$$ y = [25429, 32027, 38403, 38688, 28114, 31649, 30628, 17784, 13876, 12424, 28522, 24280, 24717, 35240, 18395, 4263, 11684, 18397, 14970, 6073, 11609, 23398, 10239, 2712, 15868, 26729, 27398, 25664, 23013, 14831, 13212, 9605, 5962, 13883, 26641, 20777, 11579, 26907, 37887, 42109, 43127, 36214, 43462, 39003, 32861, 26276, 24711, 35992, 32813, 26915, 31944, 32245, 25788, 23685, 15556, 4802, 643, 12608, 14803, 28117, 26586, 21576, 19838, 26418, 25999, 18935, 26237, 34277, 38431, 34703, 37672, 17092, 6387, 20624, 22928, 23737, 19942, 12751, 20904, 11457, 7739, 22710, 34253, 34528, 38378, 35872, 30914, 47895, 51679, 46126, 53653, 54151, 37549, 28236, 36075, 31844, 26808, 25167, 13335, 20820, 30623, 17378, 16274, 14127, -4085, 8891, 18845, 22786, 18206, 17720, 5816, 7546, 13008, 31070]
6674C1070k641j600J005M252n341o402K693l115l159R033m216p382N01j6069O214
6659D843J1094O75J1825j608j4341j70M929j661L25L961n329O49M654J451K135
6644B3432j2413j1017L934O368p531M811J2631q64n917n387j1262K383Q642J1915
6630A9725r56L504N04P024J496p880j2368r211L891O827P086N740R378j190j6094
6615A7476j8030O488J4907K616P829L388N45p490L521j1676j6472l658j913J1206
6601H737Q709M282N155k753m264J704j5471j4114R731K4160O332L428o820p889
6587B0927l976n313J827r941n299o260l014P214J2994J2523r789o621M927L681
6573A3880P297r529k575P868r806j0942J7632J0295k1513j6011M023J2753J0936
$$ y = [31070, 28429, 26829, 27834, 32086, 26745, 20343, 23036, 19921, 16762, 25795, 21579, 14197, 14698, -1371, 4843, 15937, 16612, 28437, 26829, 12488, 12318, 17247, 15586, 15911, 19872, 14543, 15192, 19846, 21297, 23432, 11019, 2, 3936, 10304, 2773, 7584, 20215, 19351, 13434, 8047, -3215, -832, 7810, 19725, 18769, 22273, 22777, 29801, 31297, 23417, 11049, 1838, 5729, 12556, 19642, 25382, 34760, 33570, 17476, -554, 5934, 20841, 23457, 31286, 34674, 35219, 27729, 31250, 19574, 3102, -556, -2469, 8737, 17446, 21728, 26883, 24130, 19866, 21570, 6099, -8015, 1716, 25876, 32208, 35636, 28816, 20927, 16951, 11638, 13465, 3524, -1775, -8035, -11049, -3835, 9159, 21682, 11893, 5272, 10199, 13880, 21177, 11648, 9073, 16941, 7135, -3807, 13825, 24120, 2607, -13404, -9381, 3372, 14308]
6560A4308M521p588L21l860O58Q952K294j4076j3883p132J4205Q536J637m272
6546D621j761q132Q207N831O502R017l8o241p979K425j6157k0676j592R029O570
6531a0374M163N405l213R811Q568l330o496J5472J0178N99q325k0069j8135J6762
6517A016J1680j551k0715L506J9915J2552r37j5237j331L246J5894J2722K657
6504D3417p216j1943K265J494q993j0104m844M428L014M105K125J0988O797l336
6490C2197l363j2922q719p20R426R652N462o489j1261j505J0411m769m044r546
6476C810q362R512N150L276r629l053R229O250O812Q077J0895P07q562j6708j0452
6461F952n163n209M401P896r875l881N095J4462Q628p292J650N871J394k51M729
$$ y = [14308, 18829, 11241, 11562, 7702, 8360, 17312, 19606, 5530, -8353, -15485, -1280, 7256, 8893, 4621, 2860, -5272, 2935, 8766, 15268, 24285, 24247, 18006, 10027, 12452, -3705, -24381, -25973, -16944, -10374, -6211, -806, -4019, 5792, 14360, 11030, 4534, 20006, 30184, 30783, 22458, 2389, -15746, 1016, 12696, 11145, -9570, -6064, 13851, 26403, 25466, 10229, 8898, 12144, 28038, 40760, 43417, 36201, 24258, 26523, 28017, 19024, 8920, 4076, 8504, 11518, 15623, 17748, 28736, 35533, 32197, 28834, 15912, 7193, 6473, 15899, 25551, 31013, 24524, 13263, 11758, 22169, 17400, 13356, 3810, -4552, 4960, 10110, 13386, 3757, 704, 9933, 16183, 22995, 31072, 41967, 42674, 34112, 17404, 6952, 1789, -3420, 981, 8877, -998, -4879, 216, 14678, 23306, 16014, 17664, 23535, 24929, 24678, 29407]
6446B9407j0158o429j586m247j6063L915P392R266R437K493k95J259j1270k407
6432A0714j0987j6133Q863J0304L085K598j081r2p40N521R902J2901K753r686
6418B7922n249n808O509q05p763p142j172L579N814Q614Q859k221P70j3036j3463
6403E408J0821J0664p581m630n434L18J4038M410p959O892K618r710j928j2560
6389E367j4519j821J7088J1241j3687j5781j557l912Q075J6731j896K724J0566
6376A8619P13L088r463K521o203n622j1117J7681k96O521K068p119R963J9628
6362D0982j9552j4700J2387K188j1763p764o225p620J5802O348j1010j0779J0040
6349a666P816l157P225J6567m911j472J746j0876m972l862n441L047J3704j077
$$ y = [29407, 19249, 12820, 11234, 6987, -9076, -5161, 2231, 11497, 20934, 23427, 23132, 24391, 13121, 10714, -273, -16406, -7543, 2761, 5846, 8444, 7363, 7271, 6531, 12052, 21954, 34855, 37608, 27922, 22673, 16865, 23374, 22569, 14806, 7664, 6492, 10071, 15885, 24499, 33358, 31137, 31907, 18871, 5408, 16229, 26893, 19312, 14682, 9248, 9566, 23604, 28014, 20055, 26947, 29565, 19855, 17927, 5367, -9152, -10973, 6115, 17356, 3669, -12112, -13669, -17581, -9506, 7225, 5329, 8053, 18619, 19332, 22420, 12957, 15478, 9275, 3653, -7464, 10217, 9921, 16442, 18510, 11391, 21354, 40982, 21430, 6730, 19117, 21305, 9542, 1778, -4447, -12067, 3735, 10083, -927, -11706, -1666, 6150, 2993, 10218, 26785, 21874, 20402, 22148, 11272, 6300, 2438, -3003, 44, 13748, 12671]
6335A2671o189O189j924j0864m860j0878k188j211j855N972q18Q779J1409j520
6321B713J1312j1559k051J3921K009n847q127P708Q96q066O496N123Q25n77o993
6306G783l770j88k459O060Q317j3354p169M277l334p990P385m22j018k614O78
6291g818j976j2211j867J4384J3994L853L322K0204J2188l269j5444J215j5668
6278A0907n055R582K710Q757o352j0490r744P15N29J1591M534o580j0485N514
6264F133Q754J2333r896j0629k758m837L297P014R49r092j2437j640m438M745
6250a2502Q358O262o194k608m197K986M581o718O242K0451N586k855L859o407
6236A6844k0810r118N310N375p054l110K048M051R658J649M649l939j1127j3989
$$ y = [12671, 6482, 12671, 10747, -117, -4977, -15855, -18043, -19254, -21109, -15137, -15955, -7176, 4233, 2713, 14025, 2466, 415, 14336, 16345, 10498, 2371, 10079, 10975, 2909, 9405, 14528, 15353, 14776, 7783, 4013, 3825, 1366, 7426, 15743, 2389, -4780, -503, -3837, -11827, -4442, -4864, -5882, -8496, -7818, -9794, -22005, -23872, -9488, 4506, 8359, 11681, 31885, 44073, 40804, 25360, 26575, 10907, 5852, 15434, 18144, 26901, 20549, 10059, 315, 1030, 1559, 13150, 17684, 11104, 619, 6133, 14887, 27220, 17324, 6695, 3937, -900, 2397, 9411, 10360, 1268, -11169, -12809, -17247, -12502, -4144, 2118, -4076, -6684, -10881, -7895, -3314, -10032, -3790, 16661, 22247, 19392, 23251, 16844, -3966, -13084, -7774, -2399, -9453, -12563, -10515, -6464, 3194, 4843, 9492, 5553, -5574, -19563]
6222a9563n691J8184R755O739K192M246p013J646M993Q934o831n285l23p256l375
6207A352N329K680j3530Q53N588n541J119R8N024j196q095M75J43m841l42k554
6191a3438j739J7520K87o397j124K918m418j6316J236J1775J5054J1141p922j0047
6177a470M056l145J5177J808p608L203O511N391N825n830j1029q615J0303N548
6163B0125n617j3748r464M894J557n118J3217J2588R265p106j2319k831n10J462
6149F395J2492q331j3723L758N950R603r117K617J3717r39j0465r784L626O380
6135A2179R788K588N221N084P309m989m059O967r593j371j696j2786r719p839
6121b916j4313M871Q516N581p597j5233k472J6110N574n744J2066J1687l448j1544
$$ y = [-19563, -25254, -7070, 2685, 9424, 11616, 15862, 8849, 10495, 15488, 24422, 17591, 12306, 11983, 4727, 1352, 6681, 9361, -4169, -3316, 2272, -3269, -2150, -2052, 2972, 1776, -6319, -5844, -5701, -10542, -10884, -13438, -15177, 2343, 2630, -3767, -4891, -1973, -6391, -22707, -21471, -9696, 5358, 16499, 8577, -1470, 2586, -559, 14618, 16426, 8818, 12021, 18532, 23923, 29748, 23918, 12889, 4274, 14577, 20125, 14508, 760, -8704, -3810, -2253, -7371, 5846, 18434, 27699, 20593, 8274, 5443, 4933, 6395, 18887, 10556, -3167, 591, 6541, 16144, 7027, 9644, 23361, 22422, 11957, 2173, 5799, 12179, 21967, 24555, 29776, 34860, 42169, 37180, 33121, 40088, 30495, 29124, 27428, 14642, 4923, -2916, -17229, -12358, -3842, 1739, -5858, -21091, -23563, -7453, -1879, -7623, 4443, 16130, 12682, 1138]
6107A138j3234J6472J109O639P059q13j5841m926L077p838Q63l583J0187R740
6093A0049j321o754j2526o601J7589N171r47q39J0425r36j474q263o944J944R685
6078H258j3321j1702L871J8279O810n248j775J416K51n157j4896k405n481O989
6064a4111J4886N559p093n127L846J7636L840k536j6113J0056J0965p07j0480
6051A0621j4803L3o117K280O370m278K80L420O411n955q775M812L484M295L818
6036E896L621p574p458M916J5938J2512j0815j1605K4929M701p750q985j4228
6023D098P85L107m062o316o214K980L305O143N014j738j242O708l934m719K3568
6008B7483P016j3692j4738K156O29P34M160K420l655lJ0839p144j1852k619o804
$$ y = [1138, -12096, 4376, 5485, 12124, 19183, 18370, 2529, -2397, 680, -7158, -6295, -9878, 309, 10049, 8728, 1974, -10552, -17153, 436, 5607, 4660, 3821, 14246, 13310, 11836, 3573, -3371, -1427, 8258, -5063, -16765, -12894, 5385, 12195, 6947, 5172, 6588, 6839, 1682, -13214, -15619, -21100, -14111, 775, 6334, -759, -5886, -2040, 15596, 19436, 16900, 787, 10843, 21808, 21101, 10621, -4182, -4149, -10266, -7986, -1616, -5894, -5614, -2194, 4217, -1738, -10513, -5701, -2217, 2078, 5896, 9517, 1943, -5515, -599, 15339, 27851, 17036, 5431, 30360, 35061, 27311, 18326, 4098, 4883, 7990, 3928, -2388, -8602, -5622, -2317, 3826, 8840, 7102, 5860, 12568, 8634, 3915, 27483, 34499, 20807, 6069, 8225, 8854, 9588, 13748, 16168, 12513, 12510, 23349, 16205, 4353, 1734, -5070]
5993e070j527p303Q061o420K170J8956m92q579O72J493n947q178R111J628n41
5978a966M012L839M565j6853q142P215J6475P48k2407L904J3591k996k025P829
5964G789M938N143j431j3797L521m053n21N956O047r73q81j5366o439m233L598
5949a0702N128J9130j0007q361m468n771Q695k094N554n521J9091M860O166r056
5935A2644J017n703m898j0843J50K0126P62m569K180k996j68q6n745j2180j6674
5920b6983R791J1606O569L773l030k372L947N97q76R7J36K477r32O057J1490M052
5904B6399r43j0008o790J4200K49r56k657l277K902J065m124L562K311p397K394
5889A6930L225M419J252j8563p846j2498j687j308P622q010p032J8130J1517l562
$$ y = [-5070, -6597, -13900, -5839, -12259, -10089, 8867, 8375, -204, 468, 1961, -3986, -12164, -3053, -1425, -1966, 2046, 5885, 10450, -6403, -14545, -7330, 9145, 9893, -12514, -8610, 4981, 1985, -40, 7789, 12727, 17870, 16439, 2642, 6163, 2110, 1589, 7545, 13592, 12619, 11738, -3628, -10067, -14300, -10702, -5574, 13556, 3549, -4812, -9280, -15051, -6356, -8450, -2896, -8417, 10674, 15534, 21700, 12644, 13661, 7958, 3060, -7783, -7633, 12493, 13255, 8686, 10866, 7870, 7702, 7616, 1871, -10309, -26983, -17192, -5586, 983, 4756, 1726, -646, 3301, 3898, 3022, 3119, 3255, 5732, 4800, 10857, 22347, 26399, 25456, 15448, 8658, 22858, 23107, 22151, 19494, 16217, 19119, 20184, 16060, 19622, 21933, 14536, 16930, 20155, 24574, 25826, 7263, -583, -13081, -14768, -16076, -8454, -16464, -23496, -5366, 6151, 2589]
5875B589j897r474L199j968l994J277Q078l006J72J3169O072m185J3262j1539
5861A1755j2020k49J1228N313j5965J756N656P3r265J5470J5222k928K867N963
5847C4876p776p072Q32K140L100k881k494l849M020Q68l039l570P71j0001o710
5832g85j949K58N272P774J0333m01j5187j2212J1515j493O717J0819j0383p890
5818B388L93P173J5044P986n693q168p920N743O312l427n022p703P620O409L979
5803B5114l492n187n090o533p283Q779j446p25O830M462O644o718n301J2162J2412
5788C4628J537j8398q875M420q554j830j2198R217p795K987Q430m260R2L977k150
5773A228K879K487M825K15q548K986J0490j0103q085l38J090L733m125n530J2470
$$ y = [2589, 692, -8782, -5583, -7551, -11545, -10268, -2190, -5196, -5024, 8145, 14217, 10032, 23294, 11755, -265, -514, 10714, 16027, 62, 1818, 7474, 7547, -1718, 13752, 28974, 26046, 28913, 34876, 27100, 20028, 20860, 23000, 26100, 23219, 20725, 16876, 20896, 21764, 18725, 15155, 15926, 5925, -785, -2734, -2476, 2796, 10570, 20903, 20502, 5315, -6897, 4618, 3125, 9842, 20661, 10278, 2388, 2781, 9954, 24998, 32984, 27291, 19123, 11203, 16946, 23258, 19831, 14809, 7106, 14726, 21135, 25114, 21622, 16435, 11345, 4812, -2471, 6308, 4862, 4137, 10967, 15429, 22073, 15355, 10054, 22216, 34628, 36165, 17767, 8892, 13312, 4758, 2928, -9270, -53, -7848, -4861, 3569, -691, -599, 3378, 1228, 4107, 6594, 11419, 11634, 3086, 6072, 16562, 6459, -1626, -1964, -874, 2859, -1266, -6796, 5674]
5758E674K880J607m366k344l096j354j676N672J976l950K222J0P400k545q797
5743f87N018m11m758K348l194k358P517o48r129j4410J030O707P259J3116m42
5728F958n367r065j0623k968K794J716J923J7504M411j3446j110J1987J4258j2157
5714F815q938l450j2305J6225q541K703o019N113P585n914L763J2260K666O497
5700A8460q396q086J340J2982K630p431l014j2947n633j2906M199O632J0950m97
5686a717m281K911N456L445P186J2122M531r669o797l419N67o596n19L222M332
5671A0774o174j0108k869p13n105l82K864R441J10o81j665j803o932o507J1306
5656h444J1648p56r585Q16R641K137J120L444R14J913l255n818J551k385N970
$$ y = [5674, 8554, 10161, 5795, 3451, 355, -999, -2675, 2997, 4973, 1023, 3245, 3255, 10655, 8110, -687, 4331, 3920, -838, 1510, -1684, -4042, 3475, 2827, -6302, -20712, -19682, -12975, -5716, 7400, 6958, 1591, -7474, -18097, -21065, -18271, -16555, -14632, 2872, 7283, -6163, -7273, 4714, 18972, 6815, -2123, -5573, -17878, -1653, -10194, -7491, -13510, -8397, -812, -6726, -2963, 9297, 11963, 18460, 10064, 1978, 3318, 16300, 18930, 11499, 8485, -4462, -10095, -23001, -18802, -12170, -1220, -1717, -5998, -3087, 2369, 5814, 13000, 25122, 29653, 19984, 13187, 9768, 10335, 3739, 3220, 6442, 10774, 4600, -5508, -8377, -9090, -14195, -14577, -11713, -2272, -2162, -2843, -4508, -6311, -13243, -19750, -8444, 3204, 2448, -7137, -6321, 3320, 5457, 6577, 10021, 10935, 12848, 9593, 3775, 5326, 2941, 8911]
5641H911L642K604L981r766j8783o549J3702J5113l159J144J1094R011o716j7785
5627F444p029N945N865n080r014M805L565n162k893j0407J980q35j517L366P799
5612b168m42p555j1930Q111J6727P574n275k044J206K884k872J2050m11j1051
5598D804Q76M873n364k327j2352O445q221p11N93J5704l971M587R126l478o911
5583C673p269J2219Q488j0898j3495j5365r676O660K0842l90j1567K942J2856
5570i80K75Q970J391j672Q299j696n465p995j4988k1677P949K0216R101Q768j1934
5555a438j369P078j6452q057l396J0644P009R08L351J0542M596j3128p132P260
5541D16J5748K08r544J0718K150j758k550j0766j0688k614M298m684K17J2314
$$ y = [8911, 12553, 15157, 19138, 9372, -9411, -15960, -2258, 12855, 9696, 10840, 21934, 30945, 24229, 6444, -585, 5360, 11225, 6145, -2869, 1936, 5501, 339, -2554, -12961, -10981, -11816, -13333, -9967, -2168, -2610, -10165, -22095, -13984, 2743, 10317, 5042, 2998, 4204, 7088, 4216, 16266, 15855, 4804, 5680, 10553, 5189, 2862, -9490, -3045, -11266, -11977, -11384, 4320, 349, 4936, 14062, 10584, 3673, -3596, 8623, 17111, 6213, -7282, -22647, -32323, -25663, -4821, -5211, -16778, -13836, -980, -705, 8265, 9656, 7984, 16283, 14587, 9122, 1127, -13861, -35538, -27589, -7373, 1728, 10496, -1438, -2807, 4271, -12181, -20238, -23634, -12990, -5981, -5073, -1722, 8820, 13416, 288, -6844, 416, 16164, 16372, 6828, 17546, 19696, 17938, 15388, 4622, -6066, -8680, -4382, -9066, -8849, 3465]
5527C465j786j1390M858P882R128K467p039j4092j0045j0417m390O372K1459R108
5513E580J198J745n804q451L209k261R857J4180N343j5957o530L680o460N690
5499E019J053m037O060O685m886l221R563R032r791o781k898R013j4078k0051
5485a9318K149K058J0095M433l676m193P469M018o538M934j090j933J073J4727
5471A4208J915j4375N288k28J153J405J4454k118j1633j2976O890P127m066j863
5457E181n623o262j0637O44k847m697M478O34J5856J9249k565r305O684R090J9295
5442C9175q316k5840m085J0852J5879j3840p906P806q78o727r960k332L275K480
5428d17n580K185q458O407Q640k744K965J979Q61J600O339N215n190m702j24o466
$$ y = [3465, 1679, -9711, -4853, 3029, 12157, 14624, 7585, -6507, -16552, -26969, -31359, -24987, -3528, 5580, 6778, 8523, 2719, -5732, -2523, -4784, 5073, 19253, 24596, 8639, 2109, 5789, -671, 5019, 6072, 2035, 8095, 14780, 9894, 6673, 16236, 25268, 15477, 8696, 5798, 14811, 733, -19318, -17169, -15111, -5016, -583, -4259, -8452, -983, 3035, -3503, 1431, 341, -1592, -519, 14208, 16123, 1748, 7036, 6808, 7961, 9366, 23820, 21702, 10069, -2907, 3983, 11110, 7044, 5181, -442, -6704, -17341, -16697, -19544, -24241, -19763, -19129, -3273, 15976, 13411, 4106, 10790, 19880, 39175, 30859, 5019, 934, 11786, 27665, 13825, 5919, 13725, 12847, 6120, -3840, -6172, -2897, -417, -5997, -3812, -12270, -5863, 2777, 33, 2998, 4977, 5838, 7438, 13777, 18992, 13802, 9100, 8976, 2510]
5412B510r185J76O190R009J5378n335j1203j1007k869m992Q99j46Q040j037R38
5397b634r118J092N834n138J547K87J539N504n665P947O00o55n583K236L349K335
5381C477J1883L944q031j65J244k1937j6181J1761K89l008k691Q03K065m203m88
5366b1238R082R856Q96M650j3083o876N194Q86N562m039K2P264J3985n20O279
5351A7920k794k6393o652J2078P156p50j502N59J6212L1p911j3254J1497J1874
5337A8071j5404j7838j535N716l983p343O612Q511N706j3042J0019J3399Q87l20
5323I456N176m157k81J867q937Q548o220k616R934r319k3877r952J4387J9739
5309C748r304j3407O254L873q656j1603P834J1138R721o827j2723J274J0135J5551
$$ y = [2510, -6675, -6499, -309, 8700, 24078, 18743, 7540, -3467, -6336, -11328, -10429, -10575, -2535, -3572, -2634, -11752, -10660, -4826, -9964, -8417, -8130, -6591, -1087, -6752, 1195, 1795, 1140, -4443, -2207, 1142, 3477, 15360, 19304, 11273, 11108, 12352, -9585, -25766, -14005, -13716, -16724, -19415, -18612, -16547, -20750, -21238, -12156, -2300, -1404, 3246, -9837, -16713, -11519, -10633, -5071, -9110, -9088, -1824, 12161, 11641, 17920, 15126, -11267, -17919, -5841, 1315, 565, -937, -378, 15834, 15865, 7954, -5300, 6197, 18071, 2667, -15171, -16706, -10990, -14973, -22316, -15704, -7193, -1487, -14529, -4510, 8889, 9776, 9456, 14632, 10475, 10194, 12061, 3124, 11672, 5452, 2836, 12770, 3451, -20426, -30378, -15991, 3748, -5556, -18963, -12709, -8836, -17492, -29095, -21261, -10123, -402, -7229, -19952, -18678, -8543, 7008]
5295G008j393j3252Q137K214J412O850r39j4657n213K92k35k650j269o518k413
5280b2626O169O895k634j7598L970P450K019K279J353l632j174J382J892j266
5266a5521o297K836J1508J1643J0328k708q418J405o250m33Q221J255P790k854
5252A2505n983L932N68q78J3213j362r344q825J2624j0703k1934N537J2077n36
5238H91r114j202n755j809p972p352J8395J6699J703k685J2828k335Q86k80p003
5223E895j1989j2126O648J2007J4664K241o723j639N070L09N587j2162j2385j886
5209f489l931p522N552R191J4421N522j4689m023l338r678p462J3499L408r315
5195a4854R925l171r26p73j2172J366K638P252l572M470n60J705P603m79k1233
$$ y = [7008, 5615, -7637, 500, 2714, 4126, 10976, 10037, -4620, -9833, -9541, -9776, -12426, -13695, -20213, -22626, -16457, -9562, -12196, -29794, -25824, -18374, -16355, -14076, -12723, -16355, -17529, -16147, -14255, -15521, -21818, -18982, -7474, 4169, 14497, 11789, 3371, 4776, -1474, -1907, 6314, 7569, 15359, 12505, 6522, 10454, 11022, 10144, 23357, 21995, 12651, 3826, 16450, 5747, -16187, -10650, 1427, 891, -8223, -9425, -15180, -16989, -24961, -32313, -13918, 2781, 4484, 1799, 14627, 12292, 13178, 12898, 5895, -6094, -18220, -11572, 435, 15099, 17340, 10617, 8978, 14048, 14357, 19944, 7782, -4603, -6489, -10420, -17942, -12390, -3199, 11222, 16744, 2055, -1968, -5306, -14984, -22446, -8947, -5539, -14854, -4929, -8100, -9026, -9799, -21971, -20605, -17967, -10715, -14287, -9817, -10377, -8672, -1069, -1548, -22781]
5180b2781O342j06j0960O069o23P642N215J2690Q998n964K085r3o255Q465Q81
5165A1605m333j45j2885q103J1560q842n837J4294n806n976l89Q491J0521P989
5151A2144r111K83J4643j0358p003k433m07l669J448R271L732o058L22o388o185
5136i769P954J2466M649j0481k929j2421n771J68O573Q413n119o666M111Q803
5122a9L691n53q71j486j0072l814P368j3911o862N559J7237J0690N202K193p902
5107F450L094K12M632r640q466j1443Q128j819j6653M562N539R801j083l577j5
5092a0278J2527N196J113J3922p433j7808o749J0672K09q180J986j948o776p507
5078b1054L99L952J1438J1558Q692J997P281o267j5158Q17L398n286J584m860
$$ y = [-22781, -16439, -16545, -27505, -21436, -22059, -14417, -9202, 3488, 12486, 6522, 8607, 8514, 2259, 10724, 11605, 7272, 7127, -5758, -13861, -2301, -11143, -16980, -2686, -8492, -14468, -14857, -6366, 4155, 12144, 3033, 3316, 17959, 7601, 598, -1835, -2242, -5911, -4463, 4808, 8540, 2482, 2804, -3584, -9769, -1815, 10651, 15300, 4819, 1890, -10531, -16302, -16134, -9561, -1148, -6267, -12933, -8822, -19, 3672, 3119, 2248, 762, -9310, -13124, -5756, -19667, -26529, -20970, -3733, 6957, 12159, 14352, 6450, 9544, 9756, 14388, 4748, -3718, -15161, -7033, -8852, -25505, -20943, -15404, -5603, -6686, -10263, -10278, 2249, 7445, 8558, 22480, 15047, -2761, -9510, 1162, 1371, -6809, -4823, -6771, -13547, -21054, -20655, -16703, -5265, 6293, 14985, 16982, 24263, 17996, 2838, 3655, 7053, 1767, 3351, -1509]
5064a509m35M095k33L987L739J229j2862j9405L869J1691R803m81l477k331Q338
5049F018m084L73l661N023P572o275o651k823p412R508N254k13L884N92Q34j7856
5033i917j3395l521k776M511n887J0670K0964N422n118j1033n563M138q363K426
5019a7442J0746M072J082j602q874j0644P525N81Q122Q855j4522j2550j188J2584
5005a3255O997M972j625Q42J2080r595j980p428j1940K018J4320N610Q592o945
4991B663j7549m753k795j634P229P060J1503J3629R281l063L171j4794n674l489
4977G85r881p589P30J0999Q566q385R415m336l685j1161J094J3160N57P240p209
4962C00j7713L962N624j996Q178J823p419n527l755K982j429j914j643K962Q554
$$ y = [-1509, -1944, 2151, 1918, 5905, 9644, 10873, -1989, -21394, -17525, -5834, 3969, 3488, 11, -2320, 6018, 1934, 2307, -1354, 3669, 11241, 4966, -1685, -4508, -11920, -2412, 2842, 2629, 6513, 7105, 7939, -9917, -23312, -26833, -29609, -25098, -30985, -20315, 649, 6071, 953, -10080, -15643, -11505, -19868, -17442, -6696, -2624, -1542, -3144, -12018, -22662, -15137, -14556, -6434, 2421, -12101, -24651, -25839, -13255, -6258, -1286, -2911, -2069, 10011, 416, -1564, -8992, -20932, -18914, -4594, 1016, 9608, 2663, -14886, -19639, -22434, -24068, -16839, -9779, 1724, 15353, 24634, 21571, 24742, 9948, 4274, 785, -9096, -16685, -15955, -4956, 3610, -4775, 4640, 304, -3381, -14542, -13448, -288, 269, 7509, 300, -17413, -13451, -7827, -9823, -1645, 178, -7241, -12768, -16523, -13541, -14970, -16884, -18527, -15565, -7011]
4947g011M933o144o096o061k856k721J1148J3705j051J032N058j712L514l583
4933B155j580M317j62q61r270j6089N836J1047n075p821p32o180M875J8852J4941
4918A4253q550k0803q58K853R447J2143k34l051N641q256p139m961l758J057k099
4903a4315n471Q784J1624r146K624j954P209J1017P395J118J1493q343k0955p361
4889f281M480j45p085j47Q663R026j139r668o221k267N41j877R929k725p139J800
4873a0255K921r514l5J9311P552l165P307L042k611j038k0429k7849Q784J0298
4859a5681k453l059o012q736n840K0801J6261K888Q198j528n919j7681P235J1138
4845c88J4296N829j597l722m988Q28m508j0472j843M563m440j950M878M888P717
$$ y = [-7011, -2078, -8222, -14318, -20379, -23235, -25956, -14808, -1103, -2154, -1122, 3936, 2224, 5738, 2155, 575, 4892, 4730, 3869, -5401, -21490, -15654, -4607, -9682, -17503, -18235, -24415, -19540, -688, 14253, 5703, -15100, -15958, -13105, -3658, 8485, 8251, 5200, 10841, 2585, -4554, -9515, -13273, -12216, -14315, -19786, -11002, 622, -8524, -5900, -7854, -645, 10372, 17767, 18885, 30378, 22035, 1080, -6281, -1801, -1946, -9031, -9178, -515, 8511, 7372, -2296, -8517, -10784, -10243, -12120, -2191, -4916, -12055, -10255, -7334, -16848, -16883, 2428, 9980, 6815, 14122, 17164, 14553, 13515, -6914, -34763, -25979, -15681, -18134, -21193, -27205, -35941, -41781, -20980, -4719, -1831, 6367, 4839, -1080, -18761, -11526, -388, 13908, 19737, 18140, 14418, 9430, 10258, 5750, -4722, -6565, -2002, -6442, -8392, -3514, 1374, 9091]
4830I091Q643M336o771m45j0419r01Q202J4455l582m263o380n029n015k505K777
4815B194l933k87o327m834O560O910J0510K811j6901j187r452Q210L755L421N878
4800G328M928P045j2850N759K608j6547m864J0472P521l802M451J055O483p45
4786A8842j7500l490N583k486j7436q889O309J4989J3091k6231j0577J4694K5659
4773A2558J2404j7864j9467N139K150j2245l945Q97P011O219j366O360m919k060
4759i128k009k838m465P237K169o711J0803Q505O910q292j2822J0463L452L891
4745G165L79k462N15j725M340m277P836n51j7160k3844p504o62J4238J8973J0618
4730E879j793O183j274j0532q291m351J829l016J5167m095p382n515K283N115
$$ y = [9091, 17734, 22070, 15299, 14854, 4435, 3534, 11736, 26191, 22609, 18346, 11966, 6937, 1922, -583, 2194, -1739, -2026, -8353, -13187, -6627, 283, 10793, 13604, -3297, -4484, -13936, -5726, -1971, 1450, 7328, 12256, 19301, 6451, 12210, 14818, -1729, -6593, 3879, 11400, 7598, 12049, 13104, 19587, 18842, 1342, -2148, 3435, 949, -16487, -25376, -19067, -4078, 9013, -17218, -27795, -13101, 12558, 24962, 7098, -12369, -7230, -5080, -17325, -21270, -20373, -13362, -7143, -8509, -2149, -7068, -9128, -11137, -13975, -18440, -11203, -9034, -15745, -4942, 3563, 10473, 2181, -10641, -178, 3274, 7165, 7544, 5082, 5597, 3872, 8212, 3935, 11771, 11220, -5940, -29784, -37288, -37950, -23712, -4739, 5879, 4086, 10269, 8995, -1537, -9828, -14179, -12350, -15366, -199, -4294, -11676, -17191, -14908, -9793]
4716i793M622M12M60m171O419K792Q922L601M191J634r131q920L845J247j176
4701D954j315P072m93l441j1171j7474j2526l273J7105J1284P04K0690j324P76
4687A1568P3k847p427K739Q490n548K868p78M844p484o868j880k324j1914M924
4672a1564J7901J2405O68o113j5047J3215K785j0822L022p977k018K709N594J0090
4658A4848O396j1466j3283l623p532p747P643P933N551m510p717P785J5676O359
4644A6313r455q168o134j431j1588J82R13j78j6177k885P556K652n014k403J698
4629c4119J1121O391k547P55O638M28M011l226Q607J1262n908j1527K332n183
4615a0965K346J8705k201j4484K033j1585r896l326K951J6260M729M150K877l019
$$ y = [-9793, -5171, -4759, -4299, -8470, -2051, 741, 9663, 13264, 17455, 19089, 9958, 1038, 4883, 6130, 4954, 3639, 10711, 10218, 6777, -4394, -21868, -34394, -37667, -20562, -9278, -8574, 12116, 10792, 11568, 11641, 8794, 1367, 4106, 12596, 7048, 9916, 9138, 13982, 6498, -370, -2250, -4574, -16488, -11564, 6337, 18742, 19410, 13297, -1750, 11465, 14250, 3428, 6450, -1527, -3545, -836, 4758, 14848, 21244, 9778, -3505, -7128, -14660, -22407, -14764, -6831, -1280, -5790, -13507, -5722, 9954, 16313, 6858, -1310, -7444, -8875, -20463, -20281, -19368, -19546, -35723, -38608, -31052, -28400, -33414, -35817, -34119, -22998, -16607, -19154, -18399, -11761, -11333, -7322, -10548, -1941, 9321, 3413, -8114, -5782, -10965, -8619, 10086, 7885, -6599, -4566, -16151, -26047, -29373, -26422, -10162, -5433, -1283, 1594, -1425]
4601a425n42m485P311j0436l97O155l575Q706N937n063q491l188r051n114M239
4586a9419P096J487p01n135r214j84N154J8206l823q620L85O379R918J435J1173
4571A4137o610j5041K321m727k161n112K351R852J9575m422l752j2875o556j0329
4557b3349r54n13P40K953j52P609l016p66J3504O397j1353J205n15K909p984j5873
4541b9158N001J6255K242r31P132K464K015K522p694q227K988L465M772Q64N356
4526I066J7n751J0223l697j3317L747P048r09j453L32K233M816q435N602J391
4511A0913q429o509l334J1162k486n892l548m185N177l081r399Q484M394O719
4497a4r025J733O860J1654p808j0647O967m512j0261M945N084p255p488j861L216
$$ y = [-1425, -1967, -6452, 859, -9577, -9974, -3819, -7394, 1312, 7249, 2186, -6305, -9493, -18544, -23658, -19419, -12323, -10836, -11537, -16672, -25886, -26070, -20916, -2710, -6533, -15153, -14768, -8389, 1529, 2964, 14137, 7527, -7514, -5193, -9920, -12081, -17193, -14842, -4990, 14585, 10163, 6411, -6464, -13020, -23349, -24303, -24816, -24076, -21123, -21275, -13666, -16682, -17448, -3944, 2453, -8900, -7695, -8210, -5301, -13285, -29158, -24157, -7902, -5660, -6591, 541, 3005, 5020, 7542, -152, -8379, -5391, -1926, 2846, 3710, 9066, 9083, 3332, 13555, 9858, -3459, 288, 7336, 6427, 4974, 5306, 7539, 12355, 3920, 9522, 10913, 2484, -4025, -7359, 3803, 1317, -4575, -8123, -12308, -7131, -10212, -19611, -11127, -6733, -14, -9039, -7306, -446, 11208, 3400, -7247, -280, -4792, -15053, -10108, -5024, -12279, -19767, -21628, -18412]
4482a8412N514J349j792j5276r837o70J0830K0243Q347M530J058j1971l475j3287
4468b2849k1672p953J0662J8569J8098Q372j5591j3651M802K8189J1339o232j6066
4455c983N87L707J22n858k544J515M544j98k41R979J1258k397j3024j2080j0162
4440a8775R173M073K086P337j258k290k935j4359P340P723R122K618p688j1857
4426i690L464J555R821L232j0843l921o530n136J0634J1106R484N502O653m817
4412B0514q322j0737O544R10j4481n921k504J4087L821q965l751Q911m348K416
4398a826K561q935j015j9824j0124K237j16J0860P749L789O067j2167N883Q850
4384f011j1511j631j0735k131P750k634L64J659l645M620J6381Q752J128m473
$$ y = [-18412, -12898, -11549, -13341, -28617, -38454, -39124, -28294, -8051, 296, 4826, 5884, -6087, -9562, -22849, -44521, -52474, -41812, -23243, -5145, 3227, -12364, -26015, -21213, 6976, 18315, 12083, -3983, -3396, 311, 433, -5425, -7969, -6454, -1910, -2108, -2349, 7630, 18888, 16491, 3467, -8613, -18775, -9602, -5529, -3443, 3894, 2636, 346, -2589, -16948, -9608, -1885, 7237, 9855, 2167, -9690, -6226, -4671, 5150, 8382, -2461, -6382, -12912, -18048, -7414, 3692, 13176, 18678, 25331, 20514, 12192, 1455, 7999, 8909, -5572, -11493, -13997, 90, 3911, -5054, -8805, 106, -4242, -1826, 735, -8200, -9215, -29039, -39163, -36926, -37042, -26182, -18433, -14644, -8577, -20744, -14861, -6011, -17522, -19153, -29888, -32019, -24269, -26903, -26539, -24880, -28525, -23905, -7524, 1228, 2356, -2117]
4370b117j2312j016R83j343O317K80R219l768m715k378P026J676m507Q966Q226
4355A0537m23n911j4880K01p190p524J4603K3266j5668j4109K666J211L452Q864
4341i05M234m143j3484K21M404m04q929l714M749J4846p967p005O251N739l432
4326i539l062O702j3852p572k201J7181J4303m071p508r798P579K944N853r906
4312a2947L481J4693J8016k1271P516J1583J482j7721p050L207m512l961m160
4299a1644L854O192r04p471K720q515m867l795P087K646J948P167l256k035P902
4284b971k895J537j990n750K117J0156Q743m401p488j2771L427K14m859J0386
4270f545J3652L612m468o652p067M114J265m263J008j905m944j218O718M745J4788
$$ y = [-2117, -14429, -15445, -14462, -15805, -9488, -9208, 11, -3757, -8472, -10850, -3824, -2148, -6655, 2311, 10537, 10114, 4203, -10677, -10476, -17666, -25190, -10587, 12679, -2989, -17098, -14432, -13221, -9769, -905, 3329, -814, -14298, -14077, -9673, -10077, -19006, -22720, -17971, -3125, -11092, -18097, -11846, -6107, -9539, -12601, -5899, -19751, -27323, -29524, -12343, 1960, -2111, -9619, -19417, -11838, -8894, -3041, -12947, -9466, 5227, 23243, 1972, 9488, 21071, 22553, 4832, -2218, 989, -3523, -7484, -11644, -7790, -1598, -2502, -9973, -7253, -15768, -20635, -24430, -17343, -14697, -12749, -5582, -8838, -10873, -2971, -5866, -4329, -6319, -12069, -9952, 204, 8947, 4546, -2942, -15713, -12286, -12072, -16931, -6545, 7107, 10719, 6251, -401, -7468, -3354, -2089, -6352, -5344, -7249, -12193, -13411, -6693, -1948, 12840]
4255A2840P502K896J998j1667j6511k3J388k2022N651J0777j2023p566M068P623
$$ y = [12840, 20342, 23238, 25236, 13569, -2942, -2965, -1577, -23599, -17948, -7171, -19194, -26760, -22692, -15069]
$$ [...]
##END NTUPLES=NMR SPECTRUM
##END=
