##TITLE=Analysis number 313291
Compound Code cc 41801
Book Reference 414/120/2
Project Code qc-cat
Chemist Name mattw
##JCAMPDX= 6.0         $$ Bruker NMR JCAMP-DX V2.0
##DATA TYPE= NMR SPECTRUM
##DATA CLASS= NTUPLES
##ORIGIN= Bruker BioSpin GmbH
##OWNER= NMR
$$ XWIN-NMR		Version 3.5
$$ Thu Sep  1 10:18:34 2005 GMT Daylight Time (UT+1h)  MAYBRIDGE\NMR@NMR_250MHZ
##.OBSERVE FREQUENCY= 250.131544655141
##.OBSERVE NUCLEUS= ^1H
##.ACQUISITION MODE= SIMULTANEOUS (DQD)
##.ACQUISITION SCHEME= undefined
##.AVERAGES= 16
##.DIGITISER RES= 18
##SPECTROMETER/DATA SYSTEM= dpx250
##.PULSE SEQUENCE= zg30
##.SOLVENT NAME= DMSO
##.SHIFT REFERENCE= (INTERNAL, DMSO, 0, 16.522)
##AUDIT TRAIL= $$ (NUMBER, WHEN, WHO, WHERE, WHAT)
$$ ##TITLE= Audit trail, XWIN-NMR		Version 3.5
$$ ##JCAMPDX= 5.01
$$ ##ORIGIN= Bruker BioSpin GmbH
$$ ##OWNER= NMR
$$ C:\u/data/dgb/nmr/ADRS/8850/pdata/1/auditp.txt
$$ ##AUDIT TRAIL=  $$ (NUMBER, WHEN, WHO, WHERE, WHAT)
(   1,<2005-09-01 10:18:16.00 +100>,<MAYBRIDGE\NMR>,<NMR_250MHZ>,
      <created by zg, POWCHK disabled, PULCHK disabled
       configuration hash MD5:
       62 19 C7 07 E1 42 D1 B7 37 6C 3D D0 77 39 F9 E6
       data hash MD5: 64K
       D5 40 54 B8 45 15 A4 87 87 4A C3 52 59 5B D4 8A>)
(   2,<2005-09-01 10:18:27.21 +100>,<MAYBRIDGE\NMR>,<NMR_250MHZ>,
      <Start of raw data processing
       ef LB = 0.3 FT_mod = 6 PKNL = 1 SI = 32K 
       data hash MD5: 32K
       1B F3 CC C0 E1 F4 A4 2C 90 7B 70 B2 2F 11 00 7C>)
(   3,<2005-09-01 10:18:29.02 +100>,<MAYBRIDGE\NMR>,<NMR_250MHZ>,
      <apk 
       data hash MD5: 32K
       EF F0 A6 41 C0 41 F3 38 5F 96 F5 D1 0D BB 40 80>)
(   4,<2005-09-01 10:18:29.77 +100>,<MAYBRIDGE\NMR>,<NMR_250MHZ>,
      <abs ABSG = 5 
       data hash MD5: 32K
       CB 5B DC B7 DB ED 28 63 21 0C 43 1C 03 8B B7 64>)
$$ ##END=
$$ 
$$ hash MD5
$$ 34 E4 BA 74 10 EA 86 08 C9 EB 35 79 99 CD 1D 2A
##$RELAX= 
##$RELAX= 
##$RELAX= 
##$RELAX= 
##$RELAX= 
##$RELAX= 
##$RELAX= 
$$ Bruker specific parameters
$$ --------------------------
##$DU= <C:\u>
##$EXPNO= 8850
##$NAME= <ADRS>
##$PROCNO= 1
##$TYPE= <nmr>
##$USER= <dgb>
##$AMP= (0..31)
100 100 100 100 100 100 100 100 100 100 100 100 100 100 100 100 100 100 
100 100 100 100 100 100 100 100 100 100 100 100 100 100 
##$AQSEQ= 0
##$AQ_mod= 3
##$AUNM= <au_zg>
##$AUTOPOS= <2 >
##$BF1= 250.13
##$BF2= 250.13
##$BF3= 250.13
##$BF4= 250.13
##$BF5= 500.13
##$BF6= 500.13
##$BF7= 500.13
##$BF8= 500.13
##$BYTORDA= 1
##$CFDGTYP= 0
##$CFRGTYP= 5
##$CHEMSTR= <none>
##$CNST= (0..31)
1 1 145 1 1 1 1 1 1 1 1 1 1 1 1 1 1 1 1 1 1 1 1 1 1 1 1 1 1 1 1 1 
##$CPDPRG= <>
##$CPDPRG1= <>
##$CPDPRG2= <>
##$CPDPRG3= <>
##$CPDPRG4= <mlev>
##$CPDPRG5= <mlev>
##$CPDPRG6= <mlev>
##$CPDPRG7= <mlev>
##$CPDPRG8= <mlev>
##$CPDPRGB= <>
##$CPDPRGT= <>
##$D= (0..31)
0 1 0 0 0 0 0 0 0 0.06 0 0 0 0 0 0 0.0002 0 0 0 0 0 0 0 0 0 0 0 0 0 0 
0 
##$DATE= 1125566295
##$DBL= (0..7)
120 120 120 120 120 120 120 120 
##$DBP= (0..7)
150 150 150 150 150 150 150 150 
##$DBP07= 0
##$DBPNAM0= <>
##$DBPNAM1= <>
$$ [...]
##$SUBNAM7= <"">
##$SUBNAM8= <"">
##$SUBNAM9= <"">
##$SW= 20.6930455092707
##$SWIBOX= (0..15)
0 0 3 0 0 0 0 0 0 0 0 0 0 0 0 0 
##$SW_h= 5175.983436853
##$TD= 65536
##$TD0= 1
##$TE= 295.16
##$TE2= 300
##$TE3= 300
##$TEG= 300
##$TL= (0..7)
0 120 120 120 120 120 120 120 
##$TP= (0..7)
150 150 150 150 150 150 150 150 
##$TP07= 0
##$TPNAME0= <>
##$TPNAME1= <>
##$TPNAME2= <>
##$TPNAME3= <>
##$TPNAME4= <>
##$TPNAME5= <>
##$TPNAME6= <>
##$TPNAME7= <>
##$TPOAL= (0..7)
0.5 0.5 0.5 0.5 0.5 0.5 0.5 0.5 
##$TPOFFS= (0..7)
0 0 0 0 0 0 0 0 
##$TUNHIN= 0
##$TUNHOUT= 0
##$TUNXOUT= 0
##$USERA1= <user>
##$USERA2= <user>
##$USERA3= <user>
##$USERA4= <user>
##$USERA5= <user>
##$V9= 5
##$VALIST= <valist>
##$VCLIST= <CCCCCCCCCCCCCCC>
##$VD= 0
##$VDLIST= <DDDDDDDDDDDDDDD>
##$VPLIST= <PPPPPPPPPPPPPPP>
##$VTLIST= <TTTTTTTTTTTTTTT>
##$WBST= 1024
##$WBSW= 4
##$XGAIN= (0..3)
0 0 0 0 
##$XL= 0
##$YL= 0
##$YMAX_a= 419951
##$YMIN_a= -326341
##$ZGOPTNS= <>
##$ZL1= 120
##$ZL2= 120
##$ZL3= 120
##$ZL4= 120
##$ABSF1= 16.522
##$ABSF2= -4.171173
##$ABSG= 5
##$ABSL= 3
##$ALPHA= 0
##$AQORDER= 0
##$ASSFAC= 0
##$ASSFACI= 0
##$ASSFACX= 0
##$ASSWID= 0
##$AUNMP= <proc_1d>
##$AZFE= 0.1
##$AZFW= 0.1
##$BCFW= 0
##$BC_mod= 0
##$BYTORDP= 0
##$COROFFS= 0
##$CY= 12.5
##$DATMOD= 1
##$DC= 0
##$DFILT= <>
##$DTYPP= 0
##$F1P= 14.0000005364418
##$F2P= -0.99999901652339
##$FCOR= 0.5
##$FTSIZE= 32768
##$FT_mod= 6
##$GAMMA= 0
##$GB= 0
##$INTBC= 1
##$INTSCL= 1
##$ISEN= 128
##$LB= 0.3
##$LEV0= 0
##$LPBIN= 0
##$MAXI= 10000
##$MC2= 0
##$MEAN= 0
##$ME_mod= 0
##$MI= 0
##$NCOEF= 0
##$NC_proc= -5
##$NLEV= 6
##$NOISF1= 0
##$NOISF2= 0
##$NSP= 0
##$NTH_PI= 0
##$NZP= 0
##$OFFSET= 16.522
##$PC= 1
##$PHC0= -93.01505
##$PHC1= 13.32644
##$PH_mod= 1
##$PKNL= yes
##$PPARMOD= 0
##$PSCAL= 4
##$PSIGN= 0
##$REVERSE= no
##$SF= 250.13
##$SI= 32768
##$SIGF1= 0
##$SIGF2= 0
##$SINO= 400
##$SIOLD= 32768
##$SREGLST= <1H.DMSO>
##$SSB= 0
##$STSI= 32768
##$STSR= 0
##$SW_p= 5175.98343685301
##$SYMM= 0
##$S_DEV= 0
##$TDeff= 65536
##$TDoff= 0
##$TI= <Analysis number 999999
Compound Code 99
Book Reference 9
Project Code 9>
##$TILT= no
##$TM1= 0
##$TM2= 0
##$TOPLEV= 0
##$USERP1= <user>
##$USERP2= <user>
##$USERP3= <user>
##$USERP4= <user>
##$USERP5= <user>
##$WDW= 1
##$XDIM= 32768
##$YMAX_p= 339326718
##$YMIN_p= -415461
$$ End of Bruker specific parameters
$$ ---------------------------------
##NTUPLES= NMR SPECTRUM
##VAR_NAME=  FREQUENCY,     SPECTRUM/REAL,   SPECTRUM/IMAG
##SYMBOL=    X,             R,               I
##VAR_TYPE=  INDEPENDENT,   DEPENDENT,       DEPENDENT
##VAR_FORM=  AFFN,          ASDF,            ASDF
##VAR_DIM=   32768,         32768,           32768
##UNITS=     HZ,            ARBITRARY UNITS, ARBITRARY UNITS
##FACTOR=    0.157963299565203, 1,           1
##FIRST=     4132.6476996994, 0,             0
##LAST=      -1043.33573715361, 0,           0
##MIN=       -1043.33573715361, -415461,     0
##MAX=       4132.6476996994, 339326718,     0
$$ Real data points
##PAGE= N=1
##DATA TABLE= (X++(R..R)), XYDATA
$$ [...]
$$ plain form
23547 79484 25214 49020 45723 -27246 -85973 -118626 -80541 -157221 -123093 -47913 63544 105405
23535 105405 73974 69217 72823 -11212 -10458 17114 52688 23787 -56863 -183352 -228854 -137081
23523 -137081 -118825 -191491 -180753 -114243 -95412 58146 157249 233899 126172 -86947 -88644
23512 -88644 -69321 -189484 -160430 -104507 -87877 -71829 -14192 -2877 -60283 -15898 53599
23501 53599 171241 54349 -161652 -133299 -64513 -49048 -49578 -39885 -49673 -123095 -47786 -47063
23489 -47063 -71169 -73903 -89014 -211647 -243830 -218863 -139844 60176 100116 108061 75680 52999
23477 52999 2895 100781 182880 119394 28051 54685 -15467 -202904 -253855 -258002 -244801 -149860
23465 -149860 -209342 -210847 -129741 2323 -40568 -176092 -118500 11349 25600 99824 145561
$$ packed form
23547G9484n4270K3806l297p2969n8727l2653L8085p6680L4128P5180J11457M1861
23535A05405l1431m757L606q4035P54K7572L5574k8901q0650j26489m5502R1773
23523a37081J8256p2666J0738O6510J8831J53558R9103P6650j07727k13119j697
23512h8644J9323j20163K9054N5923J6630J6048N7637J1315n7406M4385O9497
23501E3599J17642j16892k16001K8353O8786J5465n30R693r788p3422P5309P23
23489d7063k4106k734j5111j22633l2183K4967P9019K00020L9940P945l2381k2681
23477E2999n0104R7886Q2099o3486r1343K6634p0152j87437n0951m147J3201R4941
23465a49860n9482j505Q1106J32064m2891j35524N7592J29849J4251P4224M5737
$$ plain form
23454 145561 92938 89788 25778 -14502 -22708 -84647 -35721 -65925 -136994 -151900 -156768 -229450
23442 -229450 -200194 -181893 -294756 -321904 -272615 -108734 -102108 -137825 -181374 -170627 -189140
23431 -189140 -247138 -155579 -95351 -68558 27135 43094 11625 -52664 -142157 -157410 -76743
23420 -76743 -53452 -83250 -52597 -43783 -97628 -140533 -187794 -100393 -7913 -109280 -116589 -43583
23408 -43583 20594 75195 -73377 -49998 20268 -19382 -39028 -74250 4528 39442 29088
23397 29088 -11441 -46780 -53973 28828 23657 76903 111573 128314 126511 -4607 -30513 -46073
23385 -46073 -78942 -35267 -35073 -40939 -51633 -88315 -183986 -126445 -77823 -164626 -177952 -144381
23373 -144381 -130630 -115722 -128443 -291157 -244890 -177863 -128370 -60483 -48095 -24051 -17549
$$ packed form
23454A45561n2623l150o4010m0280q206o1939M8926l0204p1069j4906m868p2682
23442b29450K9256J8301j12863k7148M9289J63881O626l5717m3549J0747j8513
23431a89140n7998R1559O0228K6793R5693J5959l1469o4289q9493j5253Q0667
23420g6743K3291k9798L0653Q814n3845m2905m7261Q7401R2480j01367p309P3006
23408d3583O4177N4601j48572K3379P0266l9650j9646l5222P8778L4914j0354
23397B9088m0529l5339p193Q2801n171N3246L4670J6741j803j31118k5906j5560
23385d6073l2869M3675J94n866j0694l6682r5671N7541M8622q6803j3326L3571
23373a44381J3751J4908j2721j62714M6267O7027M9493O7887J2388K4044O502
$$ plain form
23362 -17549 -45441 -169754 -227678 -282644 -186806 -155984 -131916 -109736 -123248 -102858 -70151
23351 -70151 -32691 -56160 -54282 -19556 -71777 -145669 -89009 -73009 -49869 -73985 -20180 22055
23339 22055 624 37455 39120 95965 78559 -35417 -98027 -126989 -179684 -225137 -211347 -248034
23327 -248034 -240744 -105725 -104572 -99525 -80272 -65157 -27245 -5469 -105370 -165374 -183956 -99205
23315 -99205 -86679 -95939 -17856 208598 116214 5575 31178 52090 -8109 -83782 -44950
23304 -44950 -207022 -316641 -381325 -324251 -279416 -218859 -88424 110414 198826 151236 85602
23293 85602 26020 -105896 -166388 -217809 -166157 -160295 -97963 -116339 -38646 4235 -37602 -21548
23281 -21548 -87465 -70765 87584 98016 18620 43154 87298 -45718 -63957 -35764 -47563
$$ packed form
23362a7549k7892j24313n7924n4966R5838L0822K4068K2180j3512K0390L2707
23351g0151L7460k3469J878L4726n2221p3892N6660J6000K3140k4116N3805M2235
23339B2055k1431L6831J665N6845j7406j13976o2610k8962n2695m5453J3790l6687
23327b48034P290J35019J153N047J9253J5115L7912K1776r9901o0004j8582Q4751
23315i9205J2526r260P8083K26454r2384j10639K5603K0912o0199p5673L8832
23304d4950j62072j09619o4684N7074M4835O0557J30435J98838Q8412m7590o5634
23293H5602n9582j31916o0492n1421N1652N862O2332j8376P7693M2881m1837J6054
23281b1548o5917J6700J58349J0432p9396K4534M4144j33016j8239K8193j1799
$$ plain form
23270 -47563 116880 156389 110629 47826 2997 -81571 -121260 -141684 -101327 -36354 -22508
23259 -22508 71591 64270 35748 26213 -96480 -64266 -74866 -25442 -76577 -85188 -61099 -33412
23247 -33412 27063 30662 -3488 -14952 -66195 -161592 -234094 -133696 16365 518 -68775
23236 -68775 -124473 -98927 -64559 -77974 -15624 -119807 -94022 -58606 -92096 -141601 -105044
23225 -105044 -83943 -143200 -113935 -34376 2028 -81537 -118048 -206423 -181398 -94518 -4128
23214 -4128 1917 -43467 -142359 -162005 -186965 -183303 -121645 -25708 -46091 -64078 -100313 -199761
23202 -199761 -128915 20608 32096 27166 -3174 -4386 -14710 -15585 -94916 -227238 -254450 -112751
23190 -112751 15796 8658 27023 73650 64481 46364 118937 103232 79012 48423 57582 10276
$$ packed form
23270d7563J64443L9509m5760o2803m4829q4568l9689k0424M0357O4973J3846
23259b2508R4099p321k8522r535j22693L2214j0600M9424n1135q611K4089K7687
23247c3412O0475L599l4150j1464n1243r5397p2502J00398J50061j5847o9293
23236f8775n5698K5546L4368j3415O2350j04183K5785L5416l3490m9505L6557
23225a05044K1101n9257K9265P9559L6404q3565l6511q8375K5025Q6880R0390
23214d128O045m5384r8892j9646k4960L662O1658R5937k0383j7987l6235r9448
23202a99761P0846J49523J1488m930l0340j212j0324q75p9331j32322k7212J41699
23190a12751J28547p138J8365M6627r169j8117P2573j5705k4220l0589R159m7306
$$ plain form
23178 10276 -115842 -104477 -87307 -133220 -126147 -106794 -90028 -132575 -106505 -53344 -74072 -140224
23166 -140224 -264205 -223146 -94554 -49555 -135084 -160129 -83952 -42905 -78506 -96864 -93342
23155 -93342 -117498 -232740 -354409 -359139 -324751 -247393 -74088 -52162 12181 120704 226767
23144 226767 225294 150322 91131 18183 -58272 14468 134506 190926 156655 41821 7503
23133 7503 -41268 -144545 -231026 -184330 -164201 -161226 -142539 -195436 -187002 -130229 -69561 -59206
23121 -59206 -46292 -21749 75166 96832 58752 -26043 -34095 -95883 -123082 -134473 -158911 -110967
23109 -110967 -108106 -110314 -81399 -94837 -91150 -80171 -134531 -32424 64372 114963 105203 33440
23097 33440 78403 27588 -14425 -14536 72295 105331 102376 24810 41166 86226 91908 40625
$$ packed form
23178A0276j26118J1365J7170m5913P073J9353J6766m2547K6070N3161k0728o6152
23166a40224j23981M1059J28592M4999q5529k5045P6177M1047l5601j8358L522
23155i3342k4156j15242j21669m730L4388P7358J73305K1926O4343J08523J06063
23144B26767j473p4972n9191p2948p6455P2740J20038N6420l4271j14834l4318
23133G503m8771j03277q6481M6696K0129K975J8687n2897Q434N6773O0668J0355
23121e9206J2914K4543R6915K1666l8080q4795q052o1788k7199j1391k4438M7944
23109a10967K861k208K8915j3438L687J0979n4360J02107R6796N0591r760p1763
23097C3440M4963n0815m2013j11Q6831L3036k955p7566J6356M5060N682n1283
$$ plain form
23085 40625 69510 65973 42936 -30010 -119271 -68314 -62399 -79043 -111586 -25951 74775 82440
23073 82440 60849 20553 41497 51412 10985 8923 -33453 -95648 1513 157444 136774 71519
23061 71519 39925 -9999 59602 63424 92374 -33096 -93964 -76062 -36585 -66258 -2602 -19251
23049 -19251 -13322 26412 -19385 -53524 -140738 -90026 -107625 -142925 -106566 -181423 -148473 -116452
23037 -116452 -240044 -180056 -114333 -52783 -28785 -11643 -4537 -21198 -61793 -45952 -5253
23026 -5253 -70194 -196468 -214969 -204145 -87337 -18484 -33418 -4921 -90684 -8204 6095
23015 6095 -36407 30586 81402 63985 28909 -89489 -126397 -98064 -108474 -173045 -167687 -126454
23003 -126454 -122664 -244979 -119207 -77628 -67015 -104175 -117393 -76752 -47815 -24535 17462
$$ packed form
23085D0625K8885l537k3037p2946q9261N0957N915j6644l2543Q5635J00726P665
23073H2440k1591m0296K0944R915m0427k062m2376o2195R7161J55931k0670o5255
23061G1519l1594m9924O9601L822K8950j25470o0868J7902L9477k9673O3656j6649
23049a9251N929L9734m5797l4139q7214N0712j7599l5300L6359p4857L2950L2021
23037a16452j23592N9988O5723O1550K3998J7142P106j6661m0595J5841M0699
23026e253o4941j26274j8501J0824J16808O8853j4934K8497q5763Q2480J4299
23015F095m2502O6993N0816j7417l5076j18398l6908K8333j0410o4571N358M1233
23003a26454L790j22315J25772M1579J0613l7160j3218M0641K8937K3280M1997
$$ plain form
22992 17462 -34974 -84604 -132447 -24342 33093 -57091 -56298 -14371 57433 -24722 -141182 -146008
22980 -146008 -72458 -80779 -25020 -85495 -39177 62374 61186 10406 -8608 20417 705 -70742
22968 -70742 -127825 -91497 -102261 -126494 1471 63586 29489 -40697 -9159 24467 34967
22957 34967 -2496 -84525 -123408 -109705 -33243 -24630 73474 31043 26067 -100509 -181807 -196479
22945 -196479 -168712 -40270 -35630 -55850 6604 -13361 88420 99429 11879 -17625 -34129
22934 -34129 -36172 18361 40372 -42707 -164520 -212941 -144947 -190038 -156772 -69686 -58318 -107631
22922 -107631 -192797 -250538 -201517 -101483 -35200 9966 37068 9012 -91652 -15067 10377
22911 10377 -43498 -85112 -64282 -28526 38384 90792 -43152 -17599 20501 -11904 -95278
$$ packed form
22992A7462n2436m9630m7843J08105N7435r0184P93M1927P1804q2155j16460m826
22980a46008P3550q321N5759o0475M6318J01551j188n0780j9014K9025j9712p1447
22968g0742n7083L6328j0764k4233J27965O2115l4097p0186L1538L3626J0500
22957C4967l7463q2029l8883J3703P6462Q613R8104m2431m976j26576q1298j4672
22945a96479K7767J28442M640k0220O2454j9965J01781J1009q7550k9504j6504
22934c4129k043N4533K2011q3079j21813m8421O7994m5091L3266Q7086J1368m9313
22922a07631q5166n7741M9021J00034O6283M5166K7102k8056j00664P6585K5444
22911A0377n3875m1614K0830L5756O6910N2408j33944K5553L8100l2405q3374
$$ plain form
22900 -95278 -181118 -104221 -128002 -67237 -127081 -174896 -161557 -78035 8643 -122762 -109344
22889 -109344 196 -88494 -139116 -135180 -45339 -24458 1192 5536 21245 -22640 -103043 -121501
22877 -121501 -126455 -113748 -134656 -155111 -32978 -65093 14048 -11550 -86669 -69927 -12469
22866 -12469 20570 -189553 -234024 -155774 -135976 -111717 -83273 -76488 -84892 -79798 -7411 -55826
22854 -55826 -128834 -149489 -168504 -109734 59230 151972 142147 201242 113609 57727 -12413 -39082
22842 -39082 -23935 -177250 -227966 -251328 -212217 -103545 -40066 3538 -38354 -75691 -55789
22831 -55789 -33945 -47976 8058 27730 -4942 19515 -48928 -113035 -74079 -177771 -140121
22820 -140121 17280 -5966 -11726 -25810 -18443 -85259 -46501 14968 682 66762 36287 -121148
$$ packed form
22900i5278q5840P6897k3781O0765n9844m7815J3339Q3522Q6678j31405J3418
22889a09344J09540q8690n0622L936Q9841K0881K5650M344J5709m3885q0403j8458
22877a21501m954J2707k0908k0455J22133l2115P9141k5598p5119J6742N7458
22866a2469L3039k10123m4471P8250J9798K4259K8444O785q404N094P2387m8415
22854e5826p3008k0655j9015N8770J68964R2742r825N9095q7633n5882p0140k6669
22842c9082J5147j53315n0716k3362L9111J08672O3479M3604m1892l7337J9902
22831e5789K1844j4031N6034J9672l2672K4457o8443o4107L8956j03692L7650
22820a40121J57401k3246n760j4084P367o6816L8758O1469j4286O6080l0475j57435
$$ plain form
22808 -121148 -164169 -145043 -177068 -186996 -63282 -7229 -24380 107336 65293 21574 -30616
22797 -30616 -97226 -14026 21963 -4711 -144636 -120046 -184021 -156042 -55184 -91976 -159948
22786 -159948 -194273 -128344 -38211 -35610 -92144 -33206 -78020 -163091 -145482 -8016 -22063
22775 -22063 -140953 -143353 -136637 -34364 147356 116196 69789 53519 98430 26130 -46107
22764 -46107 1613 36493 -8386 70731 120721 133611 84815 100910 125030 94531 161090 277969
22752 277969 191326 176308 221706 133691 -34586 -47879 -66455 -70176 -110169 -93015 -153804
22741 -153804 -169802 -184722 -237021 -177077 -119545 -46984 -917 53904 -6906 32047 100117
22730 100117 -82246 -160515 -183150 -114840 -35058 -63449 -69413 -41789 -88582 -55066 -121387
$$ packed form
22808a21148m3021J9126l2025r928J23714N6053j7151J31716m2043m3719n2190
22797c0616o6610Q3200L5989k6674j39925K4590o3975K7979J00858l6792o7972
22786a59948l4325O5929R0133K601n6534N8938m4814q5071J7609J37466j4047
22775b2063j18890k400O716J02273J81720l1160m6407j6270M4911p2300p2237
22764d6107M7720L4880m4879P9117M9990J2890m8796J6095K4120l0499O6559J16879
22752B77969q6643j5018M5398q8015j68277j3293j8576l721l9993J7154o0789
22741a53804j5998j4920n2299N9944N7532P2561M6067N4821o0810L8953O8070
22730A00117j82363p8269k2635O8310P9782k8391n964K7624m6793L3516o6321
$$ plain form
22719 -121387 -209635 -122172 -86 -30611 -27363 -39410 25584 -51363 11112 18476 -8764 -7365
22707 -7365 -53598 -12681 84569 122784 -30083 -117602 -153464 -129881 -172918 -153862 -43513
22696 -43513 -50994 -132766 -173395 -147004 -86763 -67284 -112975 -63046 -63372 -69868 -49116 -8546
22684 -8546 17825 -13930 -50192 -9998 -37695 66522 69980 -58329 -122117 -53211 -71594 -131616
22672 -131616 -124642 -95630 -127422 -146823 -167568 -83172 16180 35939 5064 8152 -49784 -137035
22660 -137035 -171439 -126803 -55297 36473 42462 19762 -51942 -34289 20158 13796 14032 94279
22648 94279 89989 36109 -21263 12591 -33216 -99826 -45723 -1066 -20598 83770 82666 3154
22636 3154 -51673 -62481 -129126 -101931 -46003 16975 -63668 -67092 -188245 -250492 -106319 -3328
$$ packed form
22719a21387q8248Q7463J22086l0525L248j2047O4994p6947O2475P364k7240J399
22707g365m6233M0917R7250L8215j52867q7519l5862K3583m3037J9056J10349
22696d3513p481q1772m0629K6391O0241J9479m5691M9929l26o496K0752M0570
22684h546K6371l1755l6262M0194k7697J04217L458j28309o3788O8906j8383o0022
22672a31616O974K9012l1792j9401k0745Q4396R9352J9759l0875L088n7936q7251
22660a37035l4404M4636P1506R1770N989k2700p1704J7653N4447o362K36Q0247
22648I4279m290n3880n7372L3854m5807o6610N4103M4657j9532J04368j104p9512
22636C154n4827j0808o6645K7195N5928O2978q0643l424j21153o2247J44173J02991
$$ plain form
22624 -3328 73562 -13572 -117521 -176381 -119112 -33373 -32057 -86243 -153132 -129762 -125417 -125411 -73485
22611 -73485 23321 -14513 12832 39718 59013 88179 153096 197008 169580 206947 115768 -36689
22599 -36689 -57574 -11419 -87277 -119447 -110070 -117483 -126794 -22670 54437 46867 -2465 -121252
22587 -121252 -115784 54433 133878 128422 61947 12781 14962 -37501 54722 81473 15412 18159
22575 18159 35987 96831 38349 -27410 -47067 44652 110023 201142 133686 88155 80440 5150
22563 5150 -50512 -41824 -50457 -6387 32615 25015 -8844 -35950 39013 57906 55805 65545 -11480
22550 -11480 -68274 12995 -60197 -46322 15154 -106153 -150920 -138523 -34225 -36969 -78432
22539 -78432 -48217 -40540 -75645 -118984 -65832 -83077 -146863 -163914 -148134 -65085 -8711 95683
$$ packed form
22624c328P6890q7134j03949n8860N7269Q5739J316n4186o6889K3370M345ON1926
22611g3485R6806l7834K7345K6886J9295K9166O4917M3912k7428L7367r1179j52457
22599c6689k0885M6155p5858l2170R377p413r311J04124P7107p570m9332j18787
22587a21252N468J70217P9445n456o6475m9166K181n2463R2223K6751o6061K747
22575A8159J7828O0844n8482o5759j9657R1719O5371R1119o7456m5531p715p5290
22563E150n5662Q688q633M4070L9002p600l3859k7106P4963J8893k101R740p7025
22550a1480n6794Q1269p3192J3875O1476j21307m4767J2397J04298k744m1463
22539g8432L0215P677l5105m3339N3152j7245o3786j7051J5780Q3049N6374J04394
$$ plain form
22527 95683 118089 89099 101177 100055 -58984 -186609 -171579 -53120 -33093 -129865 -38022
22516 -38022 -33847 2890 79069 27165 -72144 -70621 -28317 -29045 -11087 -9288 -40672 -41503 -15387
22503 -15387 42033 90271 24093 7360 -8306 1796 -4216 -17880 -76751 -82879 -29425 79828
22491 79828 167310 65433 19531 -30261 -62785 -30534 -18211 -54105 -104004 -131073 -48205
22480 -48205 24469 73594 -662 8695 -41449 -5810 -97238 -215207 -226614 -120081 -51447
22469 -51447 -21410 -79227 -195614 -257303 -171776 68029 135845 79293 -25590 -32584 54738
22458 54738 25805 145130 197915 113255 144737 174318 70084 100703 116741 -539 -156420
22447 -156420 -168388 -151199 -54195 -28478 -162935 -178168 -162269 -132790 -142903 -161857 -218092
$$ packed form
22527I5683K2406k8990J2078j122j59039j27625J5030J18459K0027r6772R1843
22516c8022M175L6737P6179n1904r9309J523M2304p28J7958J799l1384q31K6116
22503a5387N7420M8238o6178j6733j5666J0102o012j3664n8871o128N3454J09253
22491G9828Q7482j01877m5902m9792l2524L2251J2323l5894m9899k7069Q2868
22480d8205P2674M9125p4256R357n0144L5639r1428j17969j1407J06533O8634
22469e1447L0037n7817j16387o1689Q5527K39805O7816n6552j04883o994Q7322
22458E4738k8933J19325N2785q4660L1482K9581j04234L0619J6038j17280j55881
22447a56420j1968J7189R7004K5717j34457j5233J5899K9479j0113j8954n6235
$$ plain form
22436 -218092 -224636 -148403 -41780 -2438 38931 67807 109805 61738 50332 69859 -16139
22425 -16139 -85014 -44516 83134 46449 -56638 -23649 -41133 -117443 -116709 -175173 -140097 -79110
22413 -79110 -40116 -78332 -131471 -129115 -84461 -40739 -57398 -53548 -18903 -27495 -96340 -70320
22401 -70320 -21555 -89590 -59905 -87208 -224266 -277478 -236215 -154844 -104191 -148821 -182261
22390 -182261 -139512 -68872 -6726 49356 39071 101644 89694 53136 -25710 -90758 -32883
22379 -32883 -1201 -142104 -186403 -232339 -289757 -285896 -176027 -38227 -56299 -73386 -4337
22368 -4337 121050 9805 -20428 -3178 21967 -13041 -76232 -208724 -314039 -207091 -153841
22357 -153841 -253855 -211087 -192548 -152212 -16287 26176 -20965 -25277 -71882 -140426 -118245
$$ packed form
22436b18092o544P6233J06623L9342M1369K8876M1998m8067j1406J9527q5998
22425a6139o8875M0498J27650l6685j03087L2989j7484p6310P34n8464L5076O0987
22413g9110L8994l8216n3139K356M4654M3722j6659L850L4645q592o8845K6020
22401g0320M8765o8035K9685k7303j37058n3212M1263Q1371N0653m4630l3440
22390a82261M2749P0640O2146N6082j0285O2573j1950l6558p8846o5048N7875
22379c2883L1682j40903m4299m5936n7418L861J09869J37800j8072j7087O9049
22368d337J25387j11245l0233J7250K5145l5008o3191j32492j05315J06948N3250
22357a53841j00014M2768J8539M0336J35925M2463m7141m312m6605o8544K2181
$$ plain form
22346 -118245 -70686 -119176 -152996 -101075 -238798 -276871 -256489 -258228 -137833 -15344 -5989
22335 -5989 -104295 -136857 1921 114300 86869 -11233 -54892 -44106 -31404 -42165 9234
22324 9234 24276 15744 -36568 -102263 -86548 -144998 -152683 -191876 -165117 -142908 -118031 -129434
22312 -129434 -104619 -54687 23767 36222 164396 286869 182633 90298 30954 -4015 -18792
22301 -18792 30688 25334 -6365 25833 8240 47604 -52174 -70037 -95572 -101188 -74655 -34504
22289 -34504 113710 98051 38010 45870 52800 135438 279235 235539 169338 78907 -52592
22278 -52592 -99103 4386 -13282 -31955 -143164 -171337 -149588 -148740 -140132 -145326 -181014 -178866
22266 -178866 -186970 -227162 -240918 -183354 -271892 -212877 -23903 36216 -96828 -184955 -187814
$$ packed form
22346a18245M7559m8490l3820N1921j37723l8073K0382j739J20395J22489R355
22335e989r8306l2562J38778J12379k7431r8102m3659J0786J2702j0761N1399
22324I234J5042q532n2312o5695J5715n8450p685l9193K6759K2209K4877j1403
22312a29434K4815M9932P8454J2455J28174J22473j04236r2335n9344l4969j4777
22301a8792M9480n354l1699L2198j7593L9364r9778j7863k5535n616K6533M0151
22289c4504J48214j5659o0041P860O930Q2638J43797m3696o6201r0431j31499
22278e2592m6511J03489j7668j8673j11209k8173K1749Q48Q608n194l5688K148
22266a78866q104m0192j3756N7564q8538N9015J88974O0119j33044q8127k859
$$ plain form
22255 -187814 -77194 -73331 -87718 -112263 -92705 -175815 -293014 -254495 -203293 -201371 -22642
22244 -22642 32462 21269 14454 -32457 -38388 15993 -2574 -16698 -21815 -45577 -87285 17765
22232 17765 76772 95876 22811 -11286 -33240 -96370 -107632 -120024 -105347 -41341 -55250 1594
22220 1594 -17347 -118252 -90647 -74049 -59177 12595 -11629 30441 -30486 -45587 -26452 -44368
22208 -44368 28155 32262 -52401 -154865 -141303 68379 76287 75054 71836 -1228 -71733 -65148
22196 -65148 -119726 -160313 -14363 -821 -35545 -57927 -140209 -163300 -117658 -22512 -30854 18413
22184 18413 93538 93814 106460 118738 149449 150729 199065 122204 -46315 -150180 -112833 -55115
22172 -55115 -23250 -71746 12821 9773 -29043 -38779 -55257 -33189 12168 -6901 -23652 -88525
$$ packed form
22255a87814J10620L863j4387k4545J9558q3110j17199L8519N1202J922J78729
22244b2642N5104j1193o815m6911n931N4381j8567j4124n117k3762m1708J05050
22232A7765N9007J9104p3065l4097k1954o3130j1262j2392J4677O4006j3909N6844
22220A594j8941j00905K7605J6598J4872P1772k4224M2070o0927j5101J9135j7916
22208d4368P2523M107q4663j02464J3562K09682P908j233l218p3064p0505O585
22196f5148n4578m0587J45950J3542l4724k2382q2282k3091M5642R5146q342M9267
22184A8413P5125K76J2646J2278L0711J280M8336p6861j68519j03865L7347N7718
22172e5115L1865m8496Q4567l048l8816r736j6478K2068M5357j9069j6751o4873
$$ plain form
22160 -88525 -101252 -61288 32480 -14327 9858 82701 65054 -2773 -33049 -33499 -75258 -114168
22148 -114168 -117523 -67932 57480 57292 32272 7315 50176 31122 30515 -84514 -230080 -257255
22136 -257255 -294621 -207742 -43521 -143639 -254171 -233731 -155372 -223951 -289098 -240326 -263931
22125 -263931 -295330 -245476 -128390 -194706 -132722 -83274 -97544 -118995 -66341 -37975 5929
22114 5929 -4517 -18281 7253 -16820 -62530 -68475 -37485 -42585 -9553 62763 62594 81156 -7481
22101 -7481 -89748 -79510 -74078 -52982 -49591 -22430 -48188 -79469 -117912 -133965 -36896 -106
22089 -106 -64483 -150269 -106778 -75456 -111721 -73556 -188214 -268303 -202855 -89015 31719
22078 31719 69671 -70881 -190543 -187168 -83419 -3253 -34289 -55748 -17611 86618 61731
$$ packed form
22160h8525j2727L9964R3768m6807K4185P2843j7647o7827l0276m50m1759l8910
22148a14168l355M9591J25412j88k5020k4957M2861j9054o07j15029j45566k7175
22136b57255l7366Q6879J64221j00118j10532K0440P8359o8579o5147M8772k3605
22125b63931l1399M9854J17086o6316O1984M9448j4270k1451N2654K8366M3904
22114E929j0446j3764K5534k4073m5710n945L0990n100L3032P2316j69J8562q8637
22101g481q2267J0238N432K1096L391K7161k5758l1281l8443j6053R7069L6790
22089a06o4377q5786M3491L1322l6265L8165j14658q0089O5448J13840J20734
22078C1719L7952j40552j19662L375J03749Q0166l1036k1459L8137J04229k4887
$$ plain form
22067 61731 25790 1569 -11794 -14884 3801 -24709 35154 33248 -15374 -75873 -50550 -119247
22055 -119247 -226256 -210857 -112953 -160547 -224851 -208523 -178914 -165218 -177113 -110510 -89773
22044 -89773 -77860 -161588 -56170 -34336 -41307 -114991 -214848 -214019 -237090 -173627 -71069 30052
22032 30052 41184 -60107 -73482 -7202 -86058 -51424 -9342 60301 159475 121823 48189
22021 48189 60704 44848 70464 65105 41839 -83602 -170687 -138012 -88013 -86548 -148308 -107995
22009 -107995 -105612 -52968 -80718 -103866 -143630 -92738 -30976 53973 -31612 -111605 -141975 -180111
21997 -180111 -53160 24685 65611 -31343 -121582 -171039 -200969 -128135 -98008 -157211 -134073
21986 -134073 -86648 -102429 -233544 -201320 -90853 -116160 -196761 -120480 -26611 -64466 -78033
$$ packed form
22067F1731l5941k4221j3363l090J8685k8510N9863j906m8622o0499K5323o8697
22055a19247j07009J5399R7904m7594o4304J6328K9609J3696j1895O6603K0737
22044h9773J1913q3728J05418K1834o971p3684r9857Q29k3071O3463J02558J01121
22032C0052J1132j01291j3375O6280p8856L4634M2082O9643R9174l7652p3634
22021D8189J2515j5856K5616n359k3266j25441q7085L2675M9999J465o1760M0313
22009a07995K383N2644k7750k3148l9764N0892O1762Q4949q5585p9993l0370l8136
21997a80111J26951P7845M0926r6954r0239m9457k9930P2834L0127n9203K3138
21986a34073M7425j5781j31115L2224J10467k5307q0601P6281R3869l7855j3567
$$ plain form
21975 -78033 11165 18687 -11898 3096 7326 -43800 -60898 -38924 -122560 -166497 -117512 -118307
21963 -118307 -169497 -80435 -127087 -155864 -202399 -190973 -172732 -101614 -25706 -5605 -56435
21952 -56435 -73325 -57428 -50879 29427 16052 22598 -41597 -103566 2266 70953 58282 13328
21940 13328 3180 20940 -73231 -135110 -96801 -111054 -175263 -217625 -307675 -282473 -174013
21929 -174013 -115114 -152289 -79637 -108209 -189744 -194499 -148981 -170032 -198843 -133739 -115924 -81272
21917 -81272 -70245 -156426 -164838 -175024 -182981 -186346 -118020 -204650 -161108 -167876 -190399 -208690
21905 -208690 -215646 -232303 -171558 -36961 19349 -54385 14704 -34883 -191712 -304845 -304388
21894 -304388 -287351 -217820 -211580 -139766 -93953 6068 31745 -20933 -25483 -63814 -58269 -35900
$$ packed form
21975g8033Q9198P522l0585J4994M230n1126j7098K1974q3636m3937M8985p95
21963a18307n1190Q9062m6652k8777m6535J1426J8241P1118P5908K0101n0830
21952e6435j6890J5897O549Q0306j3375O546o4195o1969J05832O8687j2671m4954
21940A3328j0148J7760r4171o1879L8309j4253o4209m2362r0050K5202J08460
21929a74013N8899l7175P2652k8572q1535m755M5518k1051k8811O5104J7815L4652
21917h1272J1027q6181q412j0186p957l365O8326q6630M3542o768k2523j8291
21905b08690o956j6657O0745J34597N6310p3734O9089m9587j56829j13133M57
21894c04388J7037O9531O240P1814M5813J00021K5677n2678m550l8331N545K2369
$$ plain form
21882 -35900 -92809 -88582 -92843 -56760 -79460 -174205 -249169 -271081 -225543 -136845 -92415 -41620
21870 -41620 -23555 -17895 -79660 -94426 10584 24861 26805 -97116 -169145 -20728 136278
21859 136278 -8864 -91298 -80021 -74185 -127317 -130268 -107429 -15941 16646 -14661 23037 -36735
21847 -36735 45898 38218 -76341 -140123 -148617 -69874 -81352 31314 26988 -44449 -15751 8196
21835 8196 48712 3135 -126237 -133056 8424 96587 123312 167384 130902 79375 2418 -55949
21823 -55949 -67191 -35205 -9336 -66272 -89335 -70924 -103127 -78161 -55327 -46289 -171120 -133622
21811 -133622 -101700 -169847 -221319 -68759 41840 39501 -51775 -94950 -47517 -13482 7558
21800 7558 50850 56557 26301 46994 3384 -44334 -27323 -938 35806 38421 22121 -46474
$$ packed form
21882c5900n6909M227m261L6083k2700r4745p4964k1912M5538Q8698M4430N0795
21870d1620J8065N660o1765j4766J05010J4277J944j23921p2029J48417J57006
21859A36278j45142q2434J1277N836n3132k951K2839R1488L2587l1307L7698n9772
21847c6735Q2633p680j14559o3782q494P8743j1478J12666m326p1437K8698K3947
21835H196M0516m5577j29372o819J41480Q8163K6725M4072l6482n1527p6957n8367
21823e5949j1242L1986K5869n6936k3063J8411l2203K4966K2834R038j24831L7498
21811a33622L1922o8147n1472J52560J10599k339r1276m3175M7433L4035K1040
21800G558M3292N707l0256K0693m3610m7718J7011K6385L6744K615j6300o8595
$$ plain form
21788 -46474 -92663 -65890 -39409 16539 -33676 -122352 -101542 -108173 -165493 -185346 -176893 -174310
21776 -174310 -140428 -99680 -71387 -100153 -254123 -202591 -139899 -90891 -112199 -134162 -159693
21765 -159693 -194305 -231847 -205304 -13587 135918 203155 128328 143865 203334 133568 46105
21754 46105 8311 -25559 73219 90209 -18451 -36665 20376 49145 32484 44144 12060
21743 12060 -94422 4754 69815 91881 39338 41147 8786 -8696 -98283 -152281 -106226 -71222
21731 -71222 -61029 -47977 -178075 -225645 -275391 -196813 -49092 1251 42544 62267 -1522
21720 -1522 45672 96618 -58787 -137214 -79352 -20747 16728 -24727 -124434 -170136 -14556
21709 -14556 126538 105576 77053 1664 -83780 -137504 -109205 -61419 -4214 44747 49457 -79519
$$ packed form
21788d6474m6189K6773K6481N5948n0215q8676K0810o631n7320j9853Q453K583
21776a74310L3882M0748K8293k8766j53970N1532O2692M9008k1308k1963k5531
21765a59693l4612l7542K6543J91717J49505O7237p4827J5537N9469o9766q7463
21754D6105l7794l3870R8778J6990j08660j8214N7041K8769j6661J1660l2084
21743A2060j06482R9176O5061K2066n2543J809l2361j7482q9587n3998M6055L5004
21731g1222J0193J3052j30098m7570m9746P8578J47721N0343M1293J9723o3789
21720a522M7194N0946j55405p8427N7862N8605L7475m1455r9707m5702J55580
21709a4556J41094k0962k8523p5389q5444n3724K8299M7786N7205M8961M710j28976
$$ plain form
21697 -79519 -195647 -226777 -142043 -161946 -132484 -161338 -62619 91544 207952 148464 89005
21686 89005 53573 -14743 -46916 -95534 -178693 -155988 -105994 -36073 -18105 -83502 -91340 -70375
21674 -70375 -142415 -143864 -36348 29055 14013 -47087 2652 2366 66254 89298 40539 -114486
21662 -114486 -81817 -43951 29914 8596 -61858 -112147 -106186 -49320 -7012 63217 148453 142473
21650 142473 163818 124661 10608 -53188 -89273 -160665 -174505 -207974 -146031 -74438 -26548
21639 -26548 -20325 -7062 -77284 -76814 -53995 -63100 -39957 -90419 -173709 -188598 -248700 -212483
21627 -212483 -195834 -192385 -240333 -147109 -70758 -34 -35666 -9203 -10737 -137300 -124668 -61401
21615 -61401 -28502 -65822 -57770 -76177 -87502 -129058 -79647 -21946 -52383 -83384 -134423 -132925
$$ packed form
21697g9519j16128l1130Q4734j9903K9462k8854R8719J54163J16408n9488n9459
21686H9005l5432o8316l2173m8618q3159K2705M9994O9921J7968o5397p838K0965
21674g0375p2040j449J07516O5403j5042o1100M9739k86O3888K3044m8759j55025
21662a14486L2669L7866P3865k1318p0454n0289N961N6866M2308P0229Q5236n980
21650A42473K1345l9157j14053o3796l6085p1392j3840l3469O1943P1593M7890
21639b6548O223J3263p0222M70K2819r105K3143n0462q3290j4889o0102L6217
21627b12483J6649L449m7948R3224P6351P0724l5632K6463j534j26563J2632O3267
21615f1401L2899l7320Q052j8407j1325m1556M9411N7701l0437l1001n1039J498
$$ plain form
21603 -132925 -90593 -86214 -160075 -206268 -264434 -208733 -68024 -73261 -76126 -85884 -116412 -113535
21591 -113535 -177612 -204420 -170895 -149516 -13559 33146 5744 -3212 -184509 -269129 -241092
21580 -241092 -178014 -151916 -123875 -144708 -142448 -92461 -120992 -134038 -118403 -113619 -159892 -231161
21568 -231161 -148402 -56402 -66586 -79839 -73464 -123266 -113911 -9750 32210 -61090 -101718 -79383
21556 -79383 -122873 -159287 -23378 -13217 -71280 22830 -10659 -18920 -23584 -92107 -164659 -212164
21544 -212164 -218615 -130695 -85494 -150650 -70670 -73625 492 71995 152617 93441 69615 51899
21532 51899 -45307 -106746 -137129 -162920 -210009 -136004 -115181 -99329 -39979 -55174 -11221 49273
21520 49273 82830 29453 -118494 -103259 -114788 -51571 -66302 -101037 50279 113858 110778
$$ packed form
21603a32925M2332M379p3861m6193n8166N5701J40709n237k865r758l0528K877
21591a13535o4077k6808L3525K1379J35957M6705k7402q956j81297q4620K8037
21580b41092O3078K6098K8041k0833K260M9987k8531j3046J5635M784m6273p1269
21568b31161Q2759R2000j0184j3253O375m9802R355J04161M1960r3300m0628K2335
21556g9383m3490l6414J35909J0161n8063R4110l3489q261m664o8523p2552m7505
21544b12164o451Q7920M5201o5156P9980k955P4117P1503Q0622n9176k3826j7716
21532E1899r7206o1439l0383k5791m7089P4005K0823J5852N9350j5195M3953O0494
21520D9273L3557n3377j47947J5235j1529O3217j4731l4735J51316O3579l080
$$ plain form
21509 110778 13380 46605 95888 220477 146066 109504 68572 19238 -5147 -80339 -112099
21498 -112099 -42801 -62604 -124750 -84608 -5631 -6330 -62324 -89442 -23806 487 -64864 -106386
21486 -106386 -44558 -8917 -15935 -150767 -170645 -150623 -173552 -99303 10681 30338 -19888
21475 -19888 9889 13040 101305 185862 74495 -75945 -109630 -182752 -167980 -56552 -14346
21464 -14346 31800 -25698 -81725 61578 21718 -96355 -47889 52175 54189 31402 -29350
21453 -29350 -65945 101754 80654 -30524 -100579 -177178 -194732 -196028 -166278 -162075 -136540 -50659
21441 -50659 -40631 -47306 -28258 83915 134204 48446 -69387 -54588 -5972 22915 61186
21430 61186 -7076 -16931 94076 39533 3024 -12459 -34863 -40754 -95411 -67010 -60613 -44342
$$ packed form
21509A10778r7398L3225M9283J24589p4411l6562m0932m9334k4385p5192l1760
21498a12099O9298j9803o2146M0142P8977o99n5994k7118O5636K4293o5351m1522
21486a06386O1828L5641p018j34832j9878K0022k2929P4249J09984J9657n0226
21475a9888K9777L151Q8265Q4557j11367j50440l3685p3122J4772J11428M2206
21464a4346M6146n7498n6027J43303l9860j18073M8466J00064K014k2787o0752
21453b9350l6595J67699k1100j11178p0055p6599j7554j296K9750M203K5535Q5881
21441e0659J0028o675J9048J12173N0289q5758j17833J4799M8616K8887L8271
21430F1186o8262r855J11007n4543l6509j5483k2404n891n4657K8401O397J6271
$$ plain form
21418 -44342 13091 10725 11592 -2867 -74684 -90730 -157257 -179269 -139946 -83039 -25960 -54344
21406 -54344 -79470 -35223 113481 129111 32624 -54680 -23684 24969 -24185 -101272 -175767
21395 -175767 -59274 68784 84393 31563 1163 -148478 -199296 -185746 -233397 -248914 -263213
21384 -263213 -187393 -108269 -79373 -93018 -35222 -70072 -58923 -68990 -79759 -48712 -6793
21373 -6793 -105820 -174907 -156389 -126973 -63171 32736 28014 11907 -35986 -13310 42826 -47286
21361 -47286 -47794 18836 -13977 -62477 48515 132242 182922 73515 -97522 -143193 -164924
21350 -164924 -78561 13014 -59406 5169 57425 16406 -48574 -33453 -69742 -12611 27429
21339 27429 50273 -28750 -120579 -46488 -3490 -24895 49168 71216 -25201 -161717 -158201 -65792
$$ packed form
21418d4342N7433k366Q67j4459p1817j6046o6527k2012L9323N6907N7079k8384
21406e4344k5126M4247J48704J5630r6487q7304L0996M8653m9154p7087p4495
21395a75767J16493J28058J5609n2830l0400j49641n0818J3550m7651j5517j4299
21384b63213P5820P9124K8896j3645N7796l4850J1149j0067j0769L1047M1919
21373f793r9027o9087J8518K9416O3802R5907m722j6107m7893K2676N6136r0112
21361d7286n08O6630l2813m8500J10992Q3727N0680j09407j71037m5671k1731
21350a64924Q6363R1575p2420O4575N2256m1019o4980J5121l6289N7131M0040
21339B7429K2844p9023r1829P4091M2998k1405P4063K2048r6417j36516L516R2409
$$ plain form
21327 -65792 -41889 -67624 -17022 -46532 -68012 -35293 -76922 -63783 48809 210436 197131
21316 197131 151274 149367 -44045 -135114 -65216 -115500 -77781 -45906 -92352 -132299 -98084
21305 -98084 -92123 -142534 -82338 -22189 -122639 -139407 -223389 -113070 95555 165757 77282
21294 77282 33871 54599 11501 -139262 -215128 -215170 -153324 -73369 -67419 -7316 47741 27001
21282 27001 34090 19752 -11767 -52460 -36485 -84356 -96570 -131895 -192131 -150153 -133616 -291929
21270 -291929 -348112 -233766 -202803 -163767 -133350 -102103 -104940 -2874 2271 -57574 11306
21259 11306 -22943 -113078 -20386 36190 79086 62157 89312 156225 87021 -78317 -93816
21248 -93816 -29997 -52920 -44692 55675 1056 -19303 -28296 -5953 -63838 -169341 -253996 -270995
$$ packed form
21327f5792K3903k5735N0602k9510k1480L2719m1629J3139J12592J61627j3305
21316A97131m5857j907j93412r1069O9898n0284L7719L1875m6446l9947L4215
21305i8084N961n0411O0196O0149j00450j6768q3982J10319K08625P0202q8475
21294G7282m3411K0728m3098j50763p5866m2O1846P9955N950O0103N5057k0740
21282B7001P089j4338l1519m0693J5975m7871j2214l5325o0236M1978J6537j58313
21270b91929n6183J14346L0963L9036L0417L1247k837J02066N145n9845O8880
21259A1306l4249r0135R2692N6576M2896j6929K7155O6913o9204j65338j5499
21248i3816O3819k2923Q228J00367n4619k0359q993K2343n7885j05503q4655j6999
$$ plain form
21236 -270995 -212380 -236224 -172204 -162805 -122834 -9580 74715 86542 26576 -116438 -182677
21225 -182677 -146422 -61640 -30822 -72418 -49407 -41383 -55273 -32818 -19497 40115 133124 170054
21213 170054 61257 -21683 -46133 -52806 -84008 -154732 -217367 -222942 -184135 -158317 -226484 -186225
21201 -186225 -109324 -130085 -171966 -52013 99347 79628 -4160 -75109 -102433 -72521 -68088
21190 -68088 -106102 -222396 -106097 -50941 -105697 -19338 -55120 -133064 -43385 9272 129897
21179 129897 135157 112167 71884 30278 12181 26309 -7162 -86981 -105598 -97612 -99420 -45168
21167 -45168 -30931 -41401 -20664 -77670 -63479 -136147 -42010 -8142 5026 -13133 11288 67403
21155 67403 34395 12900 -86458 -106924 -141763 -182263 -208420 -20743 60093 43284 39695 -64351
$$ packed form
21236b70995N8615k3844O4020R399L9971J13254Q4295J1827n9966j43014o6239
21225a82677L6255Q4782L0818m1596K3011Q024j3890K2455J3321N9612R3009L6930
21213A70054j08797q2940k4450o673l1202p0724o2635n575L8807K5818o8167M0259
21201a86225P6901k0761m1881J19953J51360j9719q3788p0949k7324K9912M433
21190f8088l8014j16294J16299N5156n4756Q6359l5782p7944Q9679N2657J20625
21179A29897N260k2990m0283m1606j8097J4128l3471p9819j8617P986j808N4252
21167d5168J4237j0470K0737n7006J4191p2668R4137L3868J3168j8159K4421N6115
21155F7403l3008k1495r9358k0466l4839m0500k6157J87677Q0836j6809l589j04046
$$ plain form
21143 -64351 -139589 -205101 -179271 -75944 -31580 -53500 -15818 -33878 -47045 37181 12025
21132 12025 -38299 -45479 -62221 -77101 -43019 -37331 1287 49562 83141 48680 -16010 -65912
21120 -65912 -48550 105262 111625 -24542 -106089 -27743 23087 49675 11100 -121313 -135668
21109 -135668 -21820 230419 195117 17914 -28233 -55956 -58154 -58877 -133683 -50424 4573
21098 4573 36345 92433 54912 -7462 11349 29253 -48442 -124083 -116810 -102543 -91559 -104249
21086 -104249 -164378 5166 106260 125975 111490 96565 77755 29341 11065 10358 10365 23201
21074 23201 -39669 -73408 -76345 -82194 -138486 -164100 -145756 -149243 -161382 -160834 -164380 -142396 -75926
21061 -75926 -48839 -156772 -207173 -160371 -173380 -227096 -206242 -79753 -87590 -70868 -63412 -34669
$$ packed form
21143f4351p5238o5512K5830J03327M4364k1920L7682j8060j3167Q4226k5156
21132A2025n0324p180j6742j4880L4082N688L8618M8275L3579l4461o4690m9902
21120f5912J7362J53812O363j36167q1547P8346N0830K6588l8575j32413j4355
21109a35668J13848K52239l5302j77203m6147k7723k198p23p4806Q3259N4997
21098D573L1772N6088l7521o2374J8811J7904p7695p5641P273J4267J0984j2690
21086a04249o0129J69544J01094J9715j4485j4925j8810m8414j8276p07PJ2836
21074B3201o2870l3739k937n849n6292k5614J8344l487j2139N48l546K1984O6470
21061g5926K7087j07933n0401M6802j3009n3716K0854J26489p837J6722P456K8743
$$ plain form
21049 -34669 -62572 -125317 -158820 -82082 -71483 -14357 -53063 47229 63335 46745 87435
21038 87435 120511 110195 22088 31213 -16711 -132313 -185398 -85840 47231 49548 -55320
21027 -55320 -148883 -73535 -124719 -87469 -66785 -77632 -22158 104578 118344 145043 64382
21016 64382 119169 56056 -62987 -63471 -173392 -266343 -203365 -28925 1791 15213 53954
21005 53954 58536 -3569 -6069 -23419 -59699 -5025 -18232 -114720 -87412 -17834 10100 63293
20993 63293 4408 71573 73906 2954 -33521 -115808 -164705 -229866 -209321 -116570 395 88884
20981 88884 111403 14927 -83967 -118801 -127247 6688 4669 25282 -15922 -10006 25755 -18403
20969 -18403 -41268 -70053 -15652 3152 -55560 -147760 -29721 79603 29357 -35272 -56827
$$ packed form
21049c4669k7903o2745l3503P6738J0599N7126l8706J00292J6106j6590M0690
21038H7435L3076j0316q8107R125m7924j15602n3085R9558J33071K317j04868
21027e5320r3563P5348n1184L7250K0684j0847N5474J26736J3766K6699q0661
21016F4382N4787o3113j19043m84j09921r2951O2978J74440L0716J3422L8741
21005E3954M582o2105k500j7350l6280N4674j3207r6488K7308O9578K7934N3193
20993F3293n8885O7165K333p0952l6475q2287m8897o5161K0545R2751J16965Q8489
20981H8884K2519r6476r8894l4834q446J33935k019K0613m1204N916L5761m4158
20969a8403k2865k8785N4401J8804n8712r2200J18039J09324n0246o4629k1555
$$ plain form
20958 -56827 -95593 -176750 -109545 -128345 -194316 -119475 -84357 -154313 -251799 -177799 -148603 -96036
20946 -96036 -132453 -116213 -79966 -72453 -118643 -217819 -239282 -135642 -148941 -216340 -240551 -248804
20934 -248804 -165409 -43729 -36457 -88336 -155685 -257881 -286909 -236444 -211529 -205621 -168201
20923 -168201 -100352 -35778 -41295 -62823 -194064 -163872 -2336 72521 67847 -46431 -18893
20912 -18893 -21365 89418 127340 146198 222392 173041 182736 145672 153584 204737 152870 12487
20900 12487 -66438 -87191 -66672 -73027 -1315 25782 63422 50566 37803 50517 87992 108566
20888 108566 114715 85624 -809 -126662 -64910 -59073 -56097 -106071 -50041 -20664 12965 -22456
20876 -22456 -59555 -30281 -28334 -31095 79120 69535 156512 152641 95519 29893 112578 143059
$$ packed form
20958e6827l8766q1157O7205j8800o5971P4841L5118o9956r7486P4000K9196N2567
20946i6036l6417J6240L6247P513m6190r9176k1463J03640j3299o7399k4211q253
20934b48804Q3395J21680P272n1879o7349j02196k9028N0465K4915N908L7420
20923a68201O7849O4574n517k1528j31241L0192J61536P4857m674j14278K7538
20912a8893k472J10783L7922J8858P6194m9351R695l7064P912N1153n1867j40383
20900A2487p8925k0753K0519o355P1712K7097L7640j2856j2763J2714L7475K0574
20888A08566O149k9091q6433j25853O1752N837K976m9974N6030K9377L3629l5421
20876b2456l7099K9274J947k761J10215r585Q6977l871n7122o5626Q2685L0481
$$ plain form
20864 143059 109784 79683 150910 51429 57855 53038 -76695 -191786 -134583 -30655 -7713
20853 -7713 -49570 -41767 -74274 -183110 -109182 136510 227358 80577 -133101 -124390 -58647
20842 -58647 -45940 -124107 -245758 -185680 -139502 -73813 -10199 -12266 11403 101225 174500 235445
20830 235445 188606 12022 -61746 -83428 -103062 -176142 -179162 -27798 -28280 -17763 16632 20269
20818 20269 51819 29100 -6090 77440 163599 196123 226050 183723 141556 59856 51649 80413
20806 80413 30172 77731 49116 -20149 30438 12772 -38425 -22225 13834 9567 18996 98053
20794 98053 149698 135480 78333 23781 -9599 -94834 -10410 75913 131205 61033 -5850 10153
20782 10153 126326 192284 127439 57003 61572 83638 22818 37408 58091 53454 13384 30356
$$ packed form
20864A43059l3275l0101P1227r9481O426m817j29733j15091N7203J03928K2942
20853g713m1857P803l2507j08836P3928K45692R0848j46781k13678Q711O5743
20842e8647J2707p8167j21651O0078M6178O5689O3614k067K3669Q9822P3275O0945
20830B35445m6839j76584p3768k1682j9634p3080l020J51364m82J0517L4395L637
20818B0269L1550k2719l5190Q3530Q6159L2524K9927m2327m2167q1700q207K8764
20806H0413n0241M7559k8615o9265N0587j7666n1197J6200L6059m267R429P9057
20794I8053N1645j4218n7147n4552l3380q5235Q4424Q6323N5292p0172o6883J6003
20782A0153J16173O5958o4845p0436M569K2066o0820J4590K0683m637m0070J6972
$$ plain form
20770 30356 25475 126179 166658 177285 158080 103086 137734 154839 231937 263288 379069
20759 379069 541709 617086 638402 748652 749520 752290 774503 791663 751684 765163 702585 662981
20747 662981 716907 821675 891051 924483 864062 879461 732834 657046 610728 484057 271225
20736 271225 186383 129497 163144 191130 216073 262118 314206 395736 404050 441807 515208 655559
20724 655559 794557 846685 763343 770777 774514 725509 627076 729064 757888 851449 926432
20713 926432 955364 953455 946878 847965 686834 566970 517409 498846 427245 423894 314625
20702 314625 292818 290473 278002 213253 248765 177760 105955 69251 94920 108677 159540 281006
20690 281006 381503 362880 250660 241045 296713 251267 182611 261042 304687 241251 293609
$$ packed form
20770C0356m881J00704M0479J0627j9205n4994L4648J7105P7098L1351J15781
20759C79069J62640P5377K1316J10250Q68K770K2213J7160l9979J3479o2578l9604
20747F62981N3926J04768O9376L3432o0421J5399j46627p5788m6318j26671k12832
20736B71225q4842n6886L3647K7986K4943M6045N2088Q1530Q314L7757P3401J40351
20724F55559J38998N2128q3342P434L737m9005r8433J01988K8824R3561P4983
20713I26432K8932j909o577r8913j61131j19864m9561j8563p1601l351j09269
20702C14625k1807k345j2471o4749L5512p1005p1805l6704K5669J3757N0863J21466
20690B81006J00497j8623j12220r615N5668m5446o8656P8431M3645o3436N2358
$$ plain form
20679 293609 330289 493847 755322 913313 1046266 1180466 1226418 1271509 1341849 1318171
20669 1318171 1282431 1230085 1112217 1000729 1024545 1127540 1214560 1251705 1254685 1381221 1398771
20658 1398771 1225326 1114424 1171612 1191607 1157168 993896 793349 643345 633576 542903
20648 542903 293313 258537 283569 263772 287913 203500 166677 127302 13806 53173 106160
20637 106160 110543 106484 234641 214350 32626 -21144 42544 75826 121028 127910 158164 214676
20625 214676 289403 220042 227685 250893 118397 14645 102436 -12136 -3512 124583 160229
20614 160229 191201 101330 52243 191007 264960 222660 111704 57849 -40193 -243278 -176366
20603 -176366 -84649 -27508 -38191 -54830 -36950 -49590 -2256 53633 81960 87850 5318 -113368
$$ packed form
20679B93609L6680J63558K61475J57991J32953J34200M5952M5091P0340k3678
20669A318171l5740n2346j17868j11488K3816J02995Q7020L7145K980J26536J7550
20658A398771j73445j10902N7188J9995l4439j63272k00547j50004r769r0673
20648E42903k49590l4776K5032j9797K4141q4413l6823l9375j13496L9367N2987
20637A06160M383m059J28157k0291j81724n3770O3688L3282M5202O882L0254N6512
20625B14676P4727o9361P643K3208j32496j03752Q7791j14572Q624J28095L5646
20614A60229L0972q9871m9087J38764P3953m2300j10956n3855r8042k03085O6912
20603a76366R1717N7141j0683j6639J7880j2640M7334N5889K8327N890q2532j18686
$$ plain form
20591 -113368 -118027 -40554 61074 127122 130217 84435 14338 14938 -94623 -49598 54528 110957
20579 110957 96746 -43769 -75863 -848 101817 101796 49705 40920 44947 43818 38835 7609
20567 7609 42522 -2546 26757 111734 127444 116267 23383 -22642 -30207 -49996 -83575 -73492
20555 -73492 23552 45026 112258 27592 -93688 -80203 -146621 -56478 14992 -24570 -14477
20544 -14477 92887 81288 -37916 -24938 -15352 119731 75476 -45119 -35147 -14479 62442
20533 62442 98147 196866 66647 81874 192713 163307 77929 66251 48823 125282 172680
20522 172680 118339 -2847 52117 122964 143883 91556 94084 27264 -7796 2812 51447
20511 51447 -10102 -3672 44464 71972 110739 195228 177600 129848 47125 68069 58415 108855
$$ packed form
20591a13368m659P7473J01628O6048L095m5782p0097O00j09561M5025J04126N6429
20579A10957j4211j40515l2094P5015J02665k1n2091q785M027j129m983l1226
20567G609L4913m5068K9303Q4977J5710j1177r2884m6025p565j9789l3579J0083
20555g3492R7044K1474O7232q4666j21280J3485o6418R0143P1470l9562J0093
20544a4477J07364j1599j19204J2978R586J35083m4255j20595R972K0668P6921
20533F2442L5705R8719j30219J5227J10839k9406q5378j1678j7428P6459M7398
20522A72680n4341j21186N4964P0847K0919n2327K528o6820l5060J0608M8635
20511E1447o1549O430M8136K7508L8767Q4489j7628m7752q2723K0944r654N0440
$$ plain form
20499 108855 109810 270202 388374 262141 156847 80517 6376 29214 135435 123897 72502
20488 72502 46042 727 58624 78557 15293 -24984 10825 20301 75945 162430 116794 22003
20476 22003 15361 77194 68060 105891 162308 189622 219118 236541 238287 167876 26357 109394
20464 109394 109933 21175 68162 101406 122142 142057 148653 196678 231445 209963 164018 109180
20452 109180 99173 38984 30174 84309 87783 147177 188678 292416 348321 371883 363823 324042
20440 324042 194751 109685 106864 187638 281632 297831 295171 286916 312302 320818 186493 103845
20428 103845 142540 197670 125745 85186 83117 96643 156484 246613 282601 188997 237119 314052
20416 314052 233697 180642 278187 400034 394306 372553 394575 312786 191260 220815 183857
$$ packed form
20499A08855R55J60392J18172j26233j05294p6330p4141K2838J06221j1538n1395
20488G2502k6460m5315N7897J9933o3264m0277L5809R476N5644Q6485m5636r4791
20476B2003o642O1833r134L7831N6417K7314K9496J7423J746p0411j41519Q3037
20464A09394N39q8758M6987L3244K0736J9915O596M8025L4767k1482m5945n4838
20452A09180j0007o0189q810N4135L474N9394M1501J03738N5905K3562q060l9781
20440C24042j29291q5066k821Q0774R3994J6199k660q255K5386Q516j34325q2648
20428A03845L8695N5130p1925m0559k069J3526N9841R0129L5988r3604M8122P6933
20416C14052q0355n3055R7545J21847n728k1753K2022q1789j21526K9555l6958
$$ plain form
20405 183857 181313 285955 253292 333972 284271 279669 303065 333267 262579 221641 221424 154203
20393 154203 119605 153329 193812 131486 124843 273915 313028 350619 344037 398076 362355 309550
20381 309550 312986 361090 364778 400585 227944 151440 111880 212829 271687 283115 235381
20370 235381 175391 241316 383650 501536 558953 508074 409078 344131 303638 293270 292146
20359 292146 330432 334295 263487 300022 390680 383517 382701 324234 313299 324460 288274 253778
20347 253778 238989 234973 212862 144754 147748 260104 290361 382606 394041 463857 457853 420504
20335 420504 429205 403445 393175 336054 334607 273307 338438 411770 432493 489558 565169 524434
20323 524434 633392 726324 693174 650588 592079 503936 598364 775042 800129 630418 644592
$$ packed form
20405A83857k544J04642l2663Q0680m9701m602K3396L0202p0688m0938k17o7221
20393A54203l4598L3724M0483o2326o643J49072L9113L7591o582N4039l5721n2805
20381C09550L436M8104L688L5807j72641p6504l9560J00949N8858J1428m7734
20370B35381n9990O5925J42334J17886N7417n0879r8996o4947m0493j0368j124
20359B92146L8286L863p0808L6535R0658p163q16n8467j0935J1161l6186l4496
20347B53778j4789m016k2111o8108K994J12356L0257R2245J1435O9816o004l7349
20335D20504Q701k5760j0270n7121j447o1300O5131P3332K0723N7065P5611m0735
20323E24434J08958R2932l3150m2586n8509q8143R4428J76678K5087j69711J4174
$$ plain form
20312 644592 588439 558451 536171 590775 635305 634976 642856 595718 582867 515405 442177 486395
20300 486395 567572 626526 509235 437076 456297 551420 592365 620744 617817 628705 737814
20289 737814 778573 802002 834331 802409 775904 775001 737033 822409 766142 762345 802468 832850
20277 832850 852098 878441 888688 913376 926150 911006 902962 904645 940453 930585 932639 773863
20265 773863 611327 636043 715521 724990 697803 859322 1046363 1075370 1045152 1012622 951492
20254 951492 960138 919872 950474 1033547 1031617 1100267 1166148 1327674 1375408 1420416 1464936 1527901
20242 1527901 1637552 1814498 2021398 2128186 2121621 2106881 2093795 2064981 2108140 2224576
20232 2224576 2303094 2549565 2785632 2982934 3157380 3545547 3874619 4107593 4209235 4287242
$$ packed form
20312F44592n6153k9988k2280N4604M4530l29P880m7138j2851o7462p3228M4218
20300D86395Q1177N8954j17291p2159J9221R5123M0945K8379k927J0888J09109
20289G37814M0759K3429L2329l1922k6505r03l7968Q5376n6267l797M0123L0382
20277H32850J9248K6343J0247K4688J2774j5144q044J683L5808r868K054j58776
20265G73863j62536K4716P9478R469k7187J61519J87041K9007l0218l2530o1130
20254I51492Q646m0266L0602Q3073j930O8650O5881J61526M7734M5008M4520O2965
20242A527901J09651J76946K06900J06788o565j4740j3086k8814M3159J16436
20232B224576P8518K46471K36067J97302J74446L88167L29072K32974J01642P8007
$$ plain form
20222 4287242 4325384 4397639 4559482 4828876 5219106 5655322 6038914 6289006 6496646 6691515
20212 6691515 6776728 6919862 7285830 7754326 8271804 8797256 9402827 10292439 11452131
20203 11452131 12948769 14785548 17028923 19692645 23190024 27826809 34039881 42875465
20195 42875465 55753764 74640704 101852007 137248504 172637560 192932040 188152772
20188 188152772 163859047 135086006 113693826 103685050 105169782 118602097 144433601
20181 144433601 177766699 203480027 204692626 179001072 140458450 105027757 79250325
20174 79250325 62272678 51092555 44006100 39989427 37948101 37576329 38762884 41913324
20166 41913324 47622674 57104895 72028432 94929075 128028965 168126067 201257359
$$ packed form
20222D287242L8142P2255J61843K69394L90230M36216L83592K50092K07640J94869
20212F691515Q5213J43134L65968M68496N17478N25452O05571Q89612J159692
20203A1452131J496638J836779K243375K663722L497379M636785O213072Q835584
20195D2875465J2878299J8886940K7211303L5396497L5389056K0294480m779268
20188A88152772k4293725k8773041k1392180j0008776J484732J3432315K5831504
20181A44433601L3333098K5713328J212599k5691554l8542622l5430693k5777432
20174G9250325j6977647j1180123p086455m016673k041326l71772J186555L150440
20166D1913324N709350R482221J4923537K2900643L3099890M0097102L3131292
$$ plain form
20159 201257359 210542275 192442129 160498400 131412984 113874865 108931965 115873726
20152 115873726 134955175 164536219 195002648 209328481 196518008 162886129 124404534
20145 124404534 92748203 70223614 54717150 43857885 36063816 30470015 26644001
20138 26644001 24141593 22438868 21450434 20890692 20720505 20844689 21181400 21665152 22331544
20129 22331544 23059227 23904261 25239294 27036742 29511758 32968504 37822465 44262526
20121 44262526 53119221 65824880 84686772 112704606 151085932 193959511 227121851
20114 227121851 240148949 237530852 235037517 243123175 255618682 255712282 234123651 199243514
20106 199243514 167192266 148607834 146514953 161395347 191718143 228949073 255799521
$$ packed form
20159B01257359R284916j8100146l1943729k9085416j7538119m942900O941761
20152A15873726J9081449K9581044L0466429J4325833j2810473l3631879l8481595
20145A24404534l1656331k2524589j5506464j0859265p794069n593801l826014
20138B6644001k502408j702725r88434n59742j70187J24184L36711M83752O66392
20129B2331544P27683Q45034J335033J797448K475016L456746M853961O440061
20121D4262526Q856695J2705659J8861892K8017834L8381326M2873579L3162340
20114B27121851J3027098k618097k493335Q085658J2495507R3600k1588631l4880137
20106A99243514l2051248j8584432k092881J4880394L0322796L7230930K6850448
$$ plain form
20099 255799521 260221211 248210521 237323747 238346855 244002701 237086461 208499876
20092 208499876 166226903 124889491 92818917 70358710 54861531 43936813 35950911
20085 35950911 30082816 25541397 22029100 19443150 17584789 16238056 15107526 14229426
20077 14229426 13457437 12679687 11831113 11025974 10269923 9626929 8951355 8286407 7743217
20068 7743217 7358264 7042933 6837490 6729216 6646402 6452688 6156299 5819454 5526967 5182667
20058 5182667 4803232 4436763 4107775 3835871 3530064 3397149 3262040 2970966 2859041
20049 2859041 2779242 2662699 2537018 2427840 2307915 2327176 2331297 2155456 2034816 1979155
20039 1979155 1907210 1915135 1834363 1815371 1796758 1773846 1815121 1880905 1849438 1706609 1476722
$$ packed form
20099B55799521M421690j2010690j0886774J023108N655846o916240k8586585
20092B08499876m2272973m1337412l2070574k2460207j5497179j0924718p985902
20085C5950911n868095m541419l512297k585950j858361j346733j130530q78100
20077A4229426p71989p77750q48574q05139p56051o42994o75574o64948n43190
20068G743217l84953l15331k05443j08274q2814j93714k96389l36845k92487l44300
20058E182667l79435l66469l28988k71904l05807j32915j35109k91074j11925
20049B859041p9799j16543j25681j09178j19925J9261M121j75841j20640n5661
20039A979155p1945P925q0772j8992j8613k2912M1275O5784l1467j42829k29887
$$ plain form
20028 1476722 1347118 1401665 1404946 1252268 1243641 1323435 1345475 1293385 1106907 995383 1034056
20017 1034056 988554 969037 980197 816392 773001 902217 940136 814567 714653 761063 706231
20006 706231 733219 820270 766714 742457 653967 640656 653377 706398 822553 753836 772733
19995 772733 766528 816987 876076 878098 885039 950647 995221 1061083 1061214 954853 836129 886977
19983 886977 974476 994640 907805 847619 794433 728664 573748 528397 632384 781099 889768
19972 889768 946142 874114 934327 940377 934240 925174 785673 631543 589605 573567 414949
19961 414949 463453 529415 577853 625173 618735 445641 296077 299328 292269 291852 363301 398322
19949 398322 401925 397166 494284 432407 368608 300268 308005 204919 268232 347700 336739 289662
$$ packed form
20028A476722j29604N4547L281j52678q627P9794K2040n2090j86478j11524L8673
20017A034056m5502j9517J1160j63805m3391J29216L7919j25569r9914M6410n4832
20006G06231K6988Q7051n3556k4257q8490j3311J2721N3021J16155o8717J8897
19995G72733o205N0459N9089K022O941O5608M4574O5862J31j06361j18724N0848
19983H86977Q7499K0164q6835o0186n3186o5769j54916m5351J03987J48715J08669
19972H89768N6374p2028O0213O050o137r066j39501j54130m1938j6038j58618
19961D14949M8504O5962M8438M7320o438j73094j49564L251p059m17P1449L5021
19949C98322L603m759R7118o1877o3799o8340P737j03086O3313P9468j0961m7077
$$ plain form
19937 289662 257934 176933 204064 227650 204198 216359 264519 212170 223462 273615 270732 339612
19925 339612 380816 376007 295919 256052 233824 179012 121344 116940 196618 180069 197202 182385
19913 182385 187263 241827 192790 262736 232654 150299 121906 41097 -8581 116059 275267
19902 275267 172421 204819 282881 247930 249004 163933 137792 134034 141807 36191 142466
19891 142466 248933 174912 130845 162960 168191 179244 180739 137481 29121 71596 128730
19880 128730 159345 107679 38470 53103 8734 108921 104315 85843 61323 18608 -37590
19869 -37590 2616 91220 107107 31952 61142 15853 64517 125849 197310 261163 180697 16536
19857 16536 30670 143450 171097 89650 91564 83884 162135 167469 194261 225952 210210 346326
$$ packed form
19937B89662l1728q1001K7131K3586k3452J2161M8160n2349J1292N0153k883O8880
19925C39612M1204m809q0088l9867k2228n4812n7668m404P9678j6549J7133j4817
19913A82385M878N4564m9037O9946l0082q2355k8393q0809m9678J24640J59208
19902B75267j02846L2398P8062l4951J074q5071k6141l758P773j05616J06275
19891A42466J06467p4021m4067L2115N231J1053J495m3258j08360M2475N7134
19880A28730L0615n1666o9209J4633m4369J00187m606j8472k4520m2715n6198
19869c7590M0206Q8604J5887p5155K9190m5289M8664O1332P1461O3853q0466j64161
19857A6536J4134J12780K7647q1447J914p680P8251N334K6792L1691j5742J36116
$$ plain form
19845 346326 333620 184674 192887 117135 14928 91194 191697 251185 269774 204985 114975
19834 114975 189419 291913 368250 282545 127553 84307 29760 -108479 -114344 -90956 -49984
19823 -49984 62103 136466 87070 120451 108793 39118 -10734 5386 9563 107873 154412 156177
19811 156177 175665 230628 258996 163304 122624 96066 74895 94079 195707 256278 199028
19800 199028 53140 112708 78050 43843 79974 169107 159013 86014 -67273 -102711 -66819
19789 -66819 -8855 138127 200555 105972 -16776 -39316 -50195 3340 -40259 -68638 -47918
19778 -47918 9738 43007 182969 207241 154497 127795 142347 169728 177954 178426 183651 132879
19766 132879 -46862 -110843 -32869 44531 96416 85332 -11842 -27626 -35955 -25369 2049
$$ packed form
19845C46326j2706j48946Q213p5752j02207P6266J00503N9488J8589o4789r0010
19834A14975P4444J02494P6337q5705j54992m3246n4547j38239n865K3388M0972
19823d9984J12087P4363m9396L3381j1658o9675m9852J6120M177R8310M6539J765
19811A56177J9488N4963K8368r5692m0680k6558k1171J9184J01628O0571n7250
19800A99028j45888N9568l4658l4207L6131Q9133j0094p2999j53287l5438L5892
19789f6819N7964J46982O2428r4583j22748k2540j0879N3535m3599k8379K0720
19778d7918N7656L3269J39962K4272n2744k6702J4552K7381Q226M72N225n0772
19766A32879j79741o3981P7974P7400N1885j1084r7174j5784q329J0586K7418
$$ plain form
19755 2049 47153 68834 119385 70585 -7634 -89034 -113405 -154490 -156774 -89544 -6976 73032
19743 73032 61393 -31067 1229 -38696 -123680 -120705 59844 46677 -87309 -115556 -55079
19732 -55079 87691 171915 107888 41978 -23611 33324 172330 149136 59786 -33202 -117390
19721 -117390 -140740 -208861 -185568 -191071 -109873 68175 10451 -48522 19241 -59793 -55556 42576
19709 42576 -18693 -236 -44311 -93663 -110348 -180686 -166436 -141059 -151887 -68580 -94726 -99224
19697 -99224 -77774 -1952 52073 -49768 -96836 -180381 -204425 -160334 -167707 -126854 -119198 -153665
19685 -153665 -132540 -69272 -17686 141006 120105 141240 74585 -20846 -64665 -33281 14876
19674 14876 54119 70353 41703 139896 139824 12588 -47514 22242 117597 106034 47724 81349
$$ packed form
19755B049M5104K1681N0551m8800p8219q1400k4371m1085k284O7230Q2568Q0008
19743G3032j1639r2460L2296l9925q4984K975J80549j3167j33986k8247O0477
19732e5079J42770Q4224o4027o5910o5589N6935J39006k3194q9350r2988q4188
19721a17390k3350o8121K3293n503Q1198J78048n7724n8973O7763p9034M237R8132
19709D2576o1269J8457m4075m9352j6685p0338J4250K5377j0828Q3307k6146m498
19697i9224K1450P5822N4025j01841m7068q3545k4044M4091p373M0853P656l4467
19685a53665K1125O3268N1586J58692k0901K1135o6655r5431m3819L1384M8157
19674A4876L9243J6234k8650R8193p2j27236o0102O9756R5355j1563n8310L3625
$$ plain form
19662 81349 134327 93106 4960 -88137 -82009 -14484 93730 98614 61585 102899 121968 187990
19650 187990 279207 350855 222484 74755 61036 -28878 3233 117657 129112 51818 64782
19639 64782 155367 171178 186142 280894 271879 266722 256874 216785 151177 228799 156894 163153
19627 163153 265096 398108 516131 732894 876752 954118 1078962 1265329 1382762 1514569
19617 1514569 1558303 1628696 1509965 1378235 1367307 1426143 1541931 1643884 1581955 1460714
19607 1460714 1267917 1072645 1012490 814046 602985 551058 571299 485894 462145 555323
19597 555323 557863 557289 566381 674258 692646 720375 712066 745058 807356 918698 976737 948188
19585 948188 947016 855187 742189 831181 998755 1087388 1156411 1068738 1061349 1005217 1032887
$$ packed form
19662H1349N2978m1221q8146r3097O128O7525J08214M884l7029M1314J9069O6022
19650A87990R1217P1648j28371j47729j3719q9914L2111J14424J1455p7294J2964
19639F4782R0585J5811J4964R4752r015n157r848m0089o5608P7622p1905O259
19627A63153J01943J33012J18023K16763J43858P7366J24844J86367J17433J31807
19617A514569M3734P0393j18731j31730j0928N8836J15788J01953o1929j21241
19607A460714j92797j95272o0155j98444k11061n1927K0241q5405k3749R3178
19597E55323K540n74R092J07877J8388K7729q309L2992O2298J11342N8039k8549
19585I48188j172r1829j12998Q8992J67574Q8633O9023q7673p389n6132K7670
$$ plain form
19574 1032887 1056062 989932 988414 1100687 1176497 1165397 1032979 1025409 989838 913314 937488
19563 937488 1047346 1057093 1035986 1052887 1002547 890849 837439 810910 715125 740597 757477
19552 757477 842423 954318 951310 1124938 1242767 1325815 1353413 1489620 1468142 1436601 1371922
19541 1371922 1246790 1183658 1116970 1031713 1022935 1137161 1211925 1261395 1355141 1481977 1383063
19530 1383063 1259070 1062298 950997 1034087 1015937 1024945 949904 791550 697532 569136
19520 569136 480295 383474 355040 345885 408806 459337 442698 426768 239102 133830 135994
19509 135994 134664 38429 -12338 26706 98639 103241 112896 69474 87335 247296 254433 193030
19497 193030 204173 230572 207973 223027 236273 176301 187994 197024 144932 90193 76606 94248
$$ packed form
19574A032887K3175o6130j518J12273P5810j1100j32418p570l5571p6524K4174
19563I37488J09858R747k1107J6901n0340j11698n3410k6529r5785K5472J6880
19552G57477Q4946J11895l008J73628J17829Q3048K7598J36207k1478l1541o4679
19541A371922j25132o3132o6688q5257q778J14226P4764M9470R3746J26836r8914
19530A383063j23993j96772j11301Q3090j8150R008p5041j58354r4018j28396
19520E69136q8841r6821k8434r155O2921N0531j6639j5930j87666j05272K164
19509A35994j330r6235n0767L9044P1933M602R655m3422J7861J59961P137o1403
19497A93030J1143K6399k2599J5054J3246n9972J1693R030n2092n4739j3587J7642
$$ plain form
19485 94248 59117 51609 110107 143531 57455 29367 117416 145367 154743 157706 188737 175177
19473 175177 184139 171545 139155 12372 11602 45882 -41134 7473 17278 63830 151029 123873
19461 123873 111570 142748 95339 99692 187109 261882 208621 153168 201343 283789 219719 302754
19449 302754 446031 419168 374087 448990 434663 338770 384016 330184 351411 419587 473398
19438 473398 541907 648992 722796 711305 647553 668749 765377 696377 540716 441506 398835
19427 398835 366662 463159 543617 589274 614974 614301 524204 362255 353321 260138 168710 155507
19415 155507 218858 226033 221137 231381 209873 172843 151253 85265 26926 -27954 45888 127604
19403 127604 134994 273284 353749 431701 491282 622211 733753 618651 370273 366163 468638
$$ packed form
19485I4248l5131p508N8498L3424q6076k8088Q8049K7951R376K963L1031j3560
19473A75177Q962j2594l2390j26783p70L4280q7016M8607R805M6552Q7199k7156
19461A23873j2303L1178m7409M353Q7417P4773n3261n5453M8175Q2446o4070Q3035
19449C02754J43277k6863m5081P4903j4327r5893M5246n3832K1227O8176N3811
19438D73398O8509J07085P3804j1491o3752K1196R6628o9000j55661r9210m2671
19427C98835l2173R6497Q0458M5657K5700o73r0097j61949q934r3183r1428j3203
19415A55507O3351P175m896J0244k1508l7030k1590o5988n8339n4880P3842Q1716
19403A27604P390J38290Q0465P7952N9581J30929J11542j15102k48378m110J02475
$$ plain form
19392 468638 556468 581445 608449 706580 707258 678242 703639 662450 644295 711710 811237 820937
19380 820937 737225 710269 778434 733833 661627 654498 708093 668144 642940 627126 528986 336306
19368 336306 154221 211563 238314 228868 247087 277455 166403 96500 141986 130250 192999
19357 192999 192120 171341 183032 191590 115732 99667 51950 55426 89596 168379 222881 265620
19345 265620 206897 169819 252772 260182 252898 347702 383202 241744 85492 96611 23745
19334 23745 7590 -58056 -41908 -9667 -14233 -15279 20564 23977 46550 -4019 -87427 -516
19322 -516 142432 108064 117436 121517 54292 58295 165159 243858 164457 211392 279878 360024
19310 360024 383980 376669 329165 289061 305522 326893 297544 289436 284141 301526 321852 318106
$$ packed form
19392D68638Q7830K4977K7004R8131O78k9016K5397m1189j8155O7415R9527R700
19380H20937q3712k6956O8165m4601p2206p129N3595l9949k5204j5814r8140j92680
19368C36306j82085N7342K6751r446J8219L0368j11052o9903M5486j1736O2749
19357A92999q79k0779J1691Q558p5858j6065m7717L476L4170P8783N4502M2739
19345B65620n8723l7078Q2953P410p284R4804L5500j41458j56252J1119p2866
19334B3745j6155o5646J6148L2241m566j046L5843L413K2573n0569q3408Q6911
19322e16J42948l4368R372M081o7225M003J06864P8699p9401M6935O8486Q0146
19310C60024K3956p311m7504m0104J6461K1371k9349q108n295J7385K0326l746
$$ plain form
19298 318106 334460 214884 102877 182854 267973 260379 295659 203658 150515 172909 259061
19287 259061 203935 243444 375182 457943 473832 481502 445740 402784 539918 664428 658735
19276 658735 681759 672756 591196 563240 456486 424952 434072 409102 407037 358956 281879 202860
19264 202860 212931 247766 327191 367094 353418 295284 244654 139695 177686 289246 373340
19253 373340 432641 484523 491700 398546 305576 259628 261090 448817 507884 454212 501178 546463
19241 546463 669634 770233 786062 892019 1044060 1180325 1266376 1313201 1229798 1244278
19231 1244278 1205884 1231974 1343837 1393812 1400385 1336585 1269748 1175224 1144107 928625 755444
19220 755444 707314 695042 703434 627366 660729 691351 542302 314831 317396 324045 365183 416324
$$ packed form
19298C18106J6354j19576j12007P9977Q5119p594L5280r2001n3143K2394Q6152
19287B59061n5126L9509J31738Q2761J5889P670l5762m2956J37134J24510n693
19276F58735K3024r003q1560k7956j06754l1534R120k4970k065m8081p7077p9019
19264B02860J0071L4835P9425L9903j3676n8134n0630j04959L7991J11560Q4094
19253C73340N9301N1882P177r3154r2970m5948J462J87727N9067n3672M6966M5285
19241E46463J23171J00599J5829J05957J52041J36265Q6051M6825q3403J4480
19231A244278l8394K6090J11863M9975O573o3800o6837r4524l1117k15482j73181
19220G55444m8130j2272Q392p6068L3363L0622j49049k27471K565O649M1138N1141
$$ plain form
19208 416324 465421 458852 436986 519724 516974 486331 506161 540779 621121 587816 609811 584078
19196 584078 593815 533327 643421 666234 658476 676802 780690 985443 1116016 1171408 1218891
19185 1218891 1315605 1328054 1196935 1284409 1329944 1412270 1578389 1703425 1599457 1353011
19175 1353011 1205325 1184247 1166000 1172257 1072542 921191 837214 851420 846221 785119 812365
19164 812365 891520 967890 1054660 1037570 975949 941883 1022379 1070741 1160131 1229476 1174591
19153 1174591 1234402 1343698 1433920 1502547 1554741 1476379 1493966 1665019 1719320 1838504 1910196
19142 1910196 1964406 2092521 2188031 2361454 2599641 2854022 2988943 3068633 3279595 3723484
19132 3723484 4116066 4385605 4815129 5337218 5804311 6234846 6677909 7110099 7678079
$$ packed form
19208D16324M9097o569k1866Q2738k750l0643J9830L4618Q0342l3305K1995k5733
19196E84078R737o0488J10094K2813p758J8326J03888K04753J30573N5392M7483
19185A218891R6714J2449j31119Q7474M5535Q2326J66119J25036j03968k46446
19175A353011j47686k1078j8247O257r9715j51351q3977J4206n199o1102K7246
19164H12365P9155P6370Q6770j7090o1621l4066Q0496M8362Q9390O9345n4885
19153A174591N9811J09296R0222O8627N2194p8362J7587J71053N4301J19184P1692
19142A910196N4210J28115R5510J73423K38187K54381J34921P9690K10962M43889
19132C723484L92582K69539M29524N22089M67093M30535M43063M32190N67980
$$ plain form
19123 7678079 8386805 9151974 10091190 11164574 12439773 13930269 15788832 18244394 21615776
19114 21615776 26190817 32706277 42333636 56110721 75147694 98666676 121742498
19107 121742498 138572291 148426740 151711935 147131208 135928257 124707134 121132075
19100 121132075 128791768 143909175 156006175 158914246 155581641 149173295 136155857
19093 136155857 114600020 89599268 67973269 52188176 41312584 33776983 28526628
19086 28526628 24964454 22478702 20846286 19663809 18570684 17631456 16972989 16588677
19078 16588677 16308976 16028161 15886920 16117425 16550890 17102512 17878084 19057387 20470883
19069 20470883 22238934 24562119 27974465 32792952 39714804 49723610 64332966 85385012
$$ packed form
19123G678079P08726P65169R39216J073384J275199J490496J858563K455562L371382
19114B1615776M575041O515460R627359J3777085J9036973K3518982K3075822
19107A21742498J6829793R854449L285195m580727j1202951j1221123l575059
19100A21132075P659693J5117407J2097000K908071l332605o408346j3017438
19093A36155857k1555837k5000752k1625999j5785093j0875592p535601n250355
19086B8526628l562174k485752j632416j182477j093125r39228o58467l84312
19078A6588677k79701k80815j41241K30505M33465N51622P75572J179303J413496
19069B0470883J768051K323185L412346M818487O921852J0008806J4609356K1052046
$$ plain form
19061 85385012 113563758 145210055 172215464 189191815 194711414 187344618 170191222
19054 170191222 152086391 142764642 146881471 162394998 180147037 190241206 190645463
19047 190645463 182673794 165131046 138350332 108121761 81549796 61661807 47445950
19040 47445950 37407105 30490717 25434517 21830221 19049800 16857862 15164464 13553896
19032 13553896 12224183 11270798 10419180 9573124 8849362 8311070 7823872 7385663 6804406
19023 6804406 6144991 5627795 5070617 4743317 4515193 4250287 4114330 4012125 3852018
19014 3852018 3696840 3527978 3488070 3321458 3128213 3035099 2939708 2779711 2612935 2590634
19004 2590634 2549796 2546560 2638352 2607569 2587356 2558943 2555537 2590574 2435764 2205386 2096367
$$ packed form
19061H5385012K8178746L1646297K7005409J6976351N519599p366796j7153396
19054A70191222j8104831r321749M116829J5513527J7752039J0094169M04257
19047A90645463p971669j7542748k6780714l0228571k6571965j9887989j4215857
19040D7445950j0038845o916388n056200l604296k780421k191938j693398j610568
19032A3553896j329713r53385q51618q46056p23762n38292m87198m38209n81257
19023F804406o59415n17196n57178l27300k28124k64906j35957j02205j60107
19014C852018j55178j68862l9908j66612j93245r3114r5391j59997j66776k2301
19004B590634m0838l236R1792l0783k0213k8413l406L5037j54810k30378j09019
$$ plain form
18993 2096367 2029810 2097173 2100452 2058032 2021288 2007935 2056571 2062733 2057327 2194871 2208671 2172158
18981 2172158 2251590 2314069 2200296 2155318 2244281 2329694 2297596 2220943 2308598 2462521 2553234
18970 2553234 2589762 2584141 2673637 2770857 2826716 2833495 2942469 2990845 3073933 3257792 3458266
18959 3458266 3701273 3881471 4054588 4266996 4568422 4932073 5378900 5778202 6248793
18950 6248793 6757066 7371302 8207293 9176197 10259780 11581850 13283924 15563274 18670615
18941 18670615 23254600 30147243 40414468 55444593 74960578 93383563 100623110
18934 100623110 93594425 78860279 65432511 57473255 55308727 59001168 69139934
18927 69139934 86524619 108654925 126451305 132466067 130458836 129617222 130926856 126060894
$$ packed form
18993B096367o6557O7363L279m2420l6744j3353M8636O162n406J37544J3800l6513
18981B172158P9432O2479j13773m4978Q8963Q5413l2098p6653Q7655J53923R0713
18970B553234L6528n621Q9496R7220N5859O779J08974M8376Q3088J83859K00474
18959C458266K43007J80198J73117K12408L01426L63651M46827L99302M70591
18950F248793N08273O14236Q35991R68904J083583J322070J702074K279350L107341
18941A8670615M583985O892643J0267225J5030125J9515985J8422985P239547
18934A00623110p028685j4734146j3427768p959256k164528L692441J0138766
18927F9139934J7384685K2130306J7796380O014762k007231q41614J309634m865962
$$ plain form
18919 126060894 110804161 90490132 72953628 61864477 57007464 57892849 64718530
18912 64718530 77626947 93606405 103018169 98203501 81922976 63226310 48498374
18905 48498374 38512607 31811507 27211272 23894393 21587420 20206088 19468176 19398655
18897 19398655 19716911 20311344 21555044 23539376 26303271 30261807 36212849 45338982
18889 45338982 59337019 79670182 104663900 123880768 125645730 111237464 91583400
18882 91583400 76562308 69063416 68624100 75289273 89946643 112322505 136786623 152599197
18874 152599197 156211729 155500984 158669127 160512711 149647404 126155024 100127358 80609004
18866 80609004 69654311 66120392 69570838 80150655 97213850 114154757 119071411
$$ packed form
18919A26060894j5256733k0314029j7536504j1089151m857013Q85385O825681
18912F4718530J2908417J5979458R411764m814668j6280525j8696666j4727936
18905D8498374r985767o701100m600235l316879k306973j381332p37912o9521
18897A9398655L18256N94433J243700J984332K763895L958536N951042R126133
18889D5338982J3998037K0333163K4993718J9216868J764962j4408266j9654064
18882I1583400j5021092p498892m39316O665173J4657370K2375862K4464118J5812574
18874A52599197L612532p10745L168143J843584j0865307k3492380k6027666j9518354
18866H0609004j0954693l533919L450446J0579817J7063195J6940907M916654
$$ plain form
18859 119071411 107077688 85001642 63349810 47071600 35783783 28200454 22805394
18852 22805394 18945137 16143940 14022013 12487567 11138897 9933380 8923935 8206069
18844 8206069 7600011 7017058 6617728 6172518 5832081 5455282 5114793 4804566 4460326
18835 4460326 4079982 3975651 3772596 3533455 3420621 3259784 2999815 2853441 2908447 2867029
18825 2867029 2770045 2656473 2700779 2719971 2756765 2667404 2590413 2672384 2643529 2553004 2533457
18814 2533457 2524609 2655903 2725256 2758623 2811045 2840149 2905428 3006862 3002569 3067241 3185398
18803 3185398 3310636 3443047 3507792 3790929 3975520 4002744 4026542 4062831 4188090 4256627
18793 4256627 4468339 4704189 5027379 5351409 5626220 6005735 6499492 7122227 8096472
$$ packed form
18859A19071411j1993723k2076046k1651832j6278210j1287817p583329n395060
18852B2805394l860257k801197k121927j534446j348670j205517j009445p17866
18844H206069o06058n82953l99330m45210l40437l76799l40489l10227l44240
18835D460326l80344j04331k03055k39141j12834j60837k59969j46374N5006m1418
18825B867029r6984j13572M4306J9192L6794q9361p6991Q1971k8855r0525j9547
18814B533457q848J31294O9353L3367N2422K9104O5279J01434m293O4672J18157
18803C185398J25238J32411O4745K83137J84591K7224K3798L6289J25259O8537
18793D256627K11712K35850L23190L24030K74811L79515M93757O22735R74245
$$ plain form
18784 8096472 9442193 11233768 13704867 17283188 22494926 30162689 40694864 52877233
18776 52877233 62234009 64018507 58246459 49520610 42634070 39732202 41000797 46525496
18768 46525496 56039091 66529815 71237935 66232529 54316658 41389735 31284209
18761 31284209 24337334 19691847 16568316 14482591 12952514 11975727 11360742 11108869
18753 11108869 11036128 11024270 10967736 10715469 10616657 10758608 10973283 11410759 12144106 13021989
18743 13021989 14054815 14891272 15910186 17095896 18777489 21284075 24688132 29498620
18735 29498620 36326188 46058815 60212327 80738837 109265585 144379431 175852792
18728 175852792 188129413 176355780 150844006 126612691 112000138 108902204 117025883
$$ packed form
18784H096472J345721J791575K471099L578321N211738P667763J0532175J2182369
18776E2877233R356776J784498n772048q725849o886540k901868J268595N524699
18768D6525496R513595J0490724M708120n005406j1915871j2926923j0105526
18761C1284209o946875m645487l123531k085725j530077r76787o14985k51873
18753A1108869p2741j1858n6534k52267r8812J41951K14675M37476P33347Q77883
18743A3021989J032826Q36457J018914J185710J681593K506586L404057M810488
18735B9498620O827568R732627J4153512K0526510K8526748L5113846L1473361
18728A75852792J2276621j1773633k5511774k4231315j4612553l097934Q123679
$$ plain form
18721 117025883 135899758 161297589 181440775 181882896 160093983 126841484 95488926
18714 95488926 71770861 55236570 43657323 35590985 29822011 25561713 22494508 20333136
18706 20333136 18925557 17833762 16795006 15700785 14817430 14113225 13728812 13728507 13955847
18697 13955847 14508167 15202485 15816955 16411711 17119766 18111356 19589116 21825470 25082458
18688 25082458 29710640 36476987 46416329 61058755 82214925 110117883 139320828
18681 139320828 156868600 153431701 133462657 109854761 92631269 84383636 85101384
18674 85101384 94555618 111660620 130914663 140879436 133177949 111139810 85478322
18667 85478322 64085011 48491190 37420178 29624211 24122751 20130544 17312005 15091066
$$ packed form
18721A17025883J8873875K5397831K0143186M42121k1788913l3252499l1352558
18714I5488926k3718065j6534291j1579247q066338n768974m260298l067205k161372
18706B0333136j407579j091795j038756j094221q83355p04205l84413l05K27340
18697A3955847N52320O94318O14470N94756P08055R91590J477760K236354L256988
18688B5082458M628182O766347R939342J4642426K1156170K7902958K9202945
18681A39320828J7547772l436899j9969044k3607896j7223492q247633P17748
18674H5101384R454234J7105002J9254043R964773p701487k2038139k5661488
18667H5478322k1393311j5593821j1071012p795967n501460l992207k818539k220939
$$ plain form
18659 15091066 13341608 12075313 10893545 9847313 8876994 8127092 7601430 7147641 6851515
18650 6851515 6797937 6767636 6584975 6365511 6003838 5624042 5408792 5199304 4928174 4684967
18640 4684967 4472896 4314465 4185080 4186332 4305933 4395666 4410147 4355618 4383726 4521520
18630 4521520 4555311 4650258 4935663 5173035 5453150 5874495 6127502 6259968 6332151 6491594
18620 6491594 6732907 7083299 7572049 8188164 9005471 9882891 10762760 11683143 12755709
18611 12755709 14169741 16084265 18741428 22400296 27639720 34991399 45495477 60370792
18603 60370792 80507468 104204257 123915522 130366734 122265118 107331691 94973713
18596 94973713 90244684 94360544 107476658 128012763 148113570 154849052 142086576
$$ packed form
18659A5091066j749458j266295j181768j046232r70319p49902n25662m53789k96126
18650F851515n3578l0301j82661k19464l61673l79796k15250k09488k71130k43207
18640D684967k12071j58431j29385J252J19601Q9733J4481n4529K8108J37794
18630D521520L3791R4947K85405K37372K80115M21345K53007J32466P2183J59443
18620F491594K41313L50392M88750O16115Q17307Q77420Q79869R20383J072566
18611A2755709J414032J914524K657163L658868N239424P351679J0504078J4875315
18603F0370792K0136676K3696789J9711265O451212q101616j4933427j2357978
18596I4973713m729029M115860J3116114K0536105K0100807O735482j2762476
$$ plain form
18589 142086576 116210782 88698867 66549962 50689170 39518664 31794747 26370538
18582 26370538 22654034 20024719 18187318 17059555 16390800 16004253 15593561 15221363 14931557
18573 14931557 14763072 14724010 14953737 15645268 16531200 17636493 18622339 19471813 20332685
18564 20332685 21570832 23506890 26348057 30120176 35287414 42564063 53088510 68325340
18556 68325340 90211731 119373744 151418305 175191497 180708958 168122306 147673446
18549 147673446 130959037 124419047 129927125 147385703 172611163 193851040 195900657
18542 195900657 174584841 140036281 106081895 79735150 61051490 47889358 38544964
18535 38544964 31831072 26952541 23319251 20777775 18916368 17554380 16473228 15452865
$$ packed form
18589A42086576k5875794k7511915k2148905j5860792j1170506p723917n424209
18582B6370538l716504k629315j837401j127763o68755l86547m10692l72198k89806
18573A4931557j68485l9062K29727O91531Q85932J105293R85846Q49474Q60872
18564B0332685J238147J936058K841167L772119N167238P276649J0524447J5236830
18556F8325340K1886391K9162013L2044561K3773192N517461j2586652k0448860
18549A47673446j6714409o539990N508078J7458578K5225460K1239877K049617
18542A95900657k1315816l4548560l3954386k6346745j8683660j3162132r344394
18535C8544964o713892m878531l633290k541476j861407j361988j081152j020363
$$ plain form
18527 15452865 14392847 13508133 12773610 12286926 12035943 11860776 11793058 11721361 11589366
18518 11589366 11296650 11271587 11383108 11816271 12806031 14141502 15926949 18632448 22820642
18509 22820642 29037861 38089501 50526970 64843474 74829479 75139354 67046252 56698246
18501 56698246 49622111 47404074 49928176 56867355 65692275 70709126 67195280 56472692
18493 56472692 43696337 32875353 25006576 19641261 15999850 13424764 11501210 10059980
18485 10059980 8997718 8183899 7655401 7295071 7119493 6886519 6696774 6499170 6253227
18476 6253227 6084202 6048238 6067827 6121217 6087762 5957462 5904780 6047801 6307615 6520255
18466 6520255 6632563 6808270 7036096 7218856 7458362 7880778 8415595 9012552 9666839
$$ packed form
18527A5452865j060018q84714p34523m86684k50983j75167o7718p1697j31995
18518A1589366k92716k5063J11521M33163R89760J335471J785447K705499M188194
18509B2820642O217219R051640J2437469J4316504R986005L09875q093102j0348006
18501E6698246p076135k218037K524102O939179Q824920N016851l513846j0722588
18493E6472692j2776355j0820984p868777n365315l641411k575086j923554j441230
18485A0059980j062262q13819n28498l60330j75578k32974j89745j97604k45943
18476F253227j69025l5964J9589N3390l3455j30300n2682J43021K59814K12640
18466F520255J12308J75707K27826J82760K39506M22416N34817N96957O54287
$$ plain form
18457 9666839 10384965 11296560 12609440 14418895 16638844 19562620 23438800 29091425
18449 29091425 37345389 49412346 67159065 91710933 119117182 138117336 141419136
18442 141419136 134601344 130355250 135513627 143513755 140490927 122252876 96382245 73065812
18434 73065812 56452716 45471072 38167444 33485975 30629582 28953219 27975997 27717285
18426 27717285 28050604 28970118 30711568 33223332 36531105 41113775 47307209 56109997
18418 56109997 68722755 87009160 113070044 147320427 184009385 213876595 236823208
18411 236823208 261011043 291089674 321270917 339326718 335606576 309748452 272358469
18404 272358469 238841174 220559541 220009833 230617611 241369088 246059476 244759488
$$ packed form
18457I666839P18126R11595J312880J809455K219949K923776L876180N652625
18449B9091425Q253964J2066957J7746719K4551868K7406249J9000154L301800
18442A41419136o817792m246094N158377Q000128l022828j8238051k5870631k3316433
18434G3065812j6613096j0981644p303628m681469k856393j676363r77222k58712
18426B7717285L33319R19514J741450K511764L307773M582670O193434Q802788
18418E6109997J2612758J8286405K6060884L4250383L6688958K9867210K2946613
18411B36823208K4187835L0078631L0181243J8055801l720142k5858124l7389983
18404B72358469l3517295j8281633n49708J0607778J0751477M690388j299988
$$ plain form
18397 244759488 238690098 230232167 219862654 204099964 182704989 162191104 150841135
18390 150841135 149681428 149010034 138352971 117449489 93835219 74661823 61176713
18383 61176713 51834983 45146100 40489149 37177820 34874014 33480467 32799588 32702740
18375 32702740 33298432 34567546 36548289 39373669 43392345 49348534 58247294 71780239
18367 71780239 92115673 121595197 159772535 198752205 227364557 241019061 246940984
18360 246940984 256418482 267252186 263785203 240055002 208150201 185275557 176533843
18353 176533843 174410949 170431742 162480010 150496175 132897645 110263879 86772904
18346 86772904 67054774 52558767 42255462 34744111 29304336 25246883 22130705 19838917
$$ packed form
18397B44759488o069390q457931j0369513j5762690k1394975k0513885j1349969
18390A50841135j159707o71394j0657063k0903482k3614270j9173396j3485110
18383F1176713r341730o688883m656951l311329k303806j393547o80879r6848
18375C2702740N95692J269114J980743K825380M018676N956189Q898760J3532945
18367G1780239K0335434K9479524L8177338L8979670K8612352J3654504N921923
18360B46940984R477498J0833704l466983k3730201l1904801k2874644q741714
18353A76533843k122894l979207p951732j1983835j7598530k2633766k3490975
18346H6772904j9718130j4496007j0303305p511351n439775m057453l116178k291788
$$ plain form
18338 19838917 18096460 16641454 15163420 13807473 12735474 11766328 10968070 10244222
18330 10244222 9456660 8782909 8303793 7815358 7366192 6932847 6471790 6000048 5604440
18321 5604440 5401663 5233749 5130715 4922995 4673355 4506067 4368465 4190780 4066064
18312 4066064 3901332 3819251 3682552 3553757 3399417 3314465 3183720 3029192 2854594 2749782
18302 2749782 2839151 2838387 2789733 2759380 2777871 2626414 2487557 2469038 2448112 2527149 2534873
18291 2534873 2488951 2356079 2285851 2277441 2247856 2256173 2284650 2282951 2305571 2325217 2201600
18280 2201600 2109039 2063738 2027269 1922772 1835441 1859396 1926388 1903277 1847316 1748447 1700405
18269 1700405 1658486 1725454 1805341 1803028 1744238 1696330 1709184 1779387 1754864 1677389 1580202
$$ packed form
18338A9838917j742457j455006j478034j355947j071999r69146p98258p23848
18330A0244222p87562o73751m79116m88435m49166m33345m61057m71742l95608
18321E604440k02777j67914j03034k07720k49640j67288j37602j77685j24716
18312D066064j64732q2081j36699j28795j54340q4952j30745j54528j74598j04812
18302B749782Q9369p64m8654l0353J8491j51457j38857j8519k0926P9037P724
18291B534873m5922j32872p0228q410k9585Q317K8477j699K2620J9646j23617
18280B201600r2561m5301l6469j04497q7331K3955O6992k3111n5961r8869m8042
18269A700405m1919O6968P9887k313n8790m7908J2854P0203k4523p7475r7187
$$ plain form
18258 1580202 1616199 1679307 1655480 1599093 1582668 1659457 1747833 1857814 1947763 1878469 1883909
18247 1883909 1888448 1848903 1731498 1632809 1632613 1701607 1802095 1767799 1667230 1598596 1564347
18236 1564347 1679571 1685819 1558791 1267484 1277327 1370880 1310668 1281626 1315546 1312673 1323899
18225 1323899 1346937 1291034 1291656 1297901 1203289 1142849 1031299 919937 847198 787933 820947
18214 820947 862891 892851 890897 928165 940026 930549 973277 1111780 1246761 1312771 1364348
18203 1364348 1479845 1544727 1487237 1379758 1319067 1396289 1366286 1311621 1318966 1282741 1279429
18192 1279429 1217902 1090600 1019322 902010 875930 836183 848419 829621 695278 646559 765989
18181 765989 756425 720425 737782 682242 678395 706043 652769 626165 670898 617379 602970 498496
$$ packed form
18258A580202L5997O3108k3827n6387j6425P6789Q8376J09981Q9949o9294N440
18247A883909M539l9545j17405r8689j96O8994J00488l4296j00569o8634l4249
18236A564347J15224O248j27028k91307R843R3553o0212k9042L3920k873J1226
18225A323899K3038n5903O22O245r4612o0440j11550j11362p2739n9265L3014
18214H20947M1944K9960j954L7268J1861r477M2728J38503J34981O6010N1577
18203A364348J15497O4882n7490j07479o0691P7222l0003n4665P345l6225l312
18192A279429o1527j27302p1278j17312k6080l9747J2236j8798j34343m8719J19430
18181G65989r564l6000J7357n5540l847K7648n3274k6604M4733n3519j4409j04474
$$ plain form
18169 498496 566704 643466 670325 707658 693452 643437 794833 823904 717339 627433 528219
18158 528219 407651 558196 675371 694762 640152 697965 746178 695472 697055 598547 626701
18147 626701 764047 821532 727913 558941 497512 620216 623697 586169 532480 536549 368602
18136 368602 271477 325833 340238 289684 318688 329625 375961 326658 380270 468195 394722
18125 394722 253487 281756 324086 354579 337587 387151 393684 363153 214085 229660 254201
18114 254201 298181 372835 362844 356590 340284 210467 198205 273663 271111 278136 341310 407302
18102 407302 381571 437513 448954 423072 440741 507984 494873 467754 473758 478337 537866 546108
18090 546108 635607 734341 687356 660436 621436 622201 659442 688308 716588 764980 796348 774920
$$ packed form
18169D98496O8208P6762K6859L7333j4206n0015J51396K9071j06565q9906r9214
18158E28219j20568J50545J17175J9391n4610N7813M8213n0706J583r8508K8154
18147F26701J37346N7485r3619j68972o1429J22704L481l7528n3689M069j67947
18136C68602r7125N4356J4405n0554K9004J0937M6336m9303N3612Q7925p3473
18125C94722j41235K8269M2330L0493j6992M9564O533l0531j49068J5575K4541
18114B54201M3980P4654r991o254j6306j29817j2262P5458k552P025O3174O5992
18102D07302k5731N5942J1441k5882J7669O7243j3111k7119O004M579N9529Q242
18090E46108Q9499R8734m6985k6920l9000P65L7241K8866K8280M8392L1368k1428
$$ plain form
18078 774920 755142 741088 705006 715194 576489 476441 379686 345562 405053 393975 317062
18067 317062 312373 362406 414785 357288 338674 316622 291845 240095 159337 127307 265079
18056 265079 273971 234519 297126 315462 368449 360995 407881 428617 425253 448993 508751 448997
18044 448997 451032 513949 616803 716840 767871 876829 894419 1055409 1146190 1078669 935863
18033 935863 931551 1010383 979910 1053111 1063220 1078897 1056589 1119115 1042395 817616 676070
18022 676070 651534 545505 466745 484232 473509 425666 450738 400754 302238 265413 324420
18011 324420 321044 324143 238556 85524 74082 205139 301230 417505 390261 401386 323157
18000 323157 366914 466735 511899 483018 398177 321205 369442 449406 489643 489080 526363 572149
$$ packed form
18078G74920j9778j4054l6082J0188j38705j00048r6755l4124N9491j1078p6913
18067C17062m689N0033N2379n7497j8614k2052k4777n1750q0758l2030J37772
18056B65079Q892l9452O2607J8336N2987p454M6886K0736l364K3740N9758n9754
18044D48997K035O2917J02854J00037N1031J08958J7590J60990R0781o7521j42806
18033I35863m312P8832l0473P3201J0109J5677k2308O2526p6720k24779j41546
18022F76070k4536j06029p8760J7487j0723m7843K5072m9984r8516l6825N9007
18011C24420l376L099q5587j53032j1442J31057R6091J16275k7244J1125p8229
18000C23157M3757R9821M5164k8881q4841p6972M8237P9964M0237n63L7283M5786
$$ plain form
17988 572149 585938 611427 672306 644232 532643 442330 465885 545810 595273 622453 530843
17977 530843 486281 389683 244678 210665 158828 57504 31439 169109 217439 346972 346348
17966 346348 264515 282463 328529 269907 132299 153667 200848 181697 217373 274797 234385
17955 234385 152044 109567 82618 193380 217248 151576 207476 267777 200669 75852 150694
17944 150694 220508 320973 317532 227215 182372 242822 292649 304581 290689 245532 275813
17933 275813 204722 270942 328703 296627 285615 250721 342447 362424 306119 368490 401673
17922 401673 527403 683616 731130 663265 675064 729444 671781 597964 523558 576547 577853
17911 577853 569271 471344 493947 444477 356610 450621 486977 453643 464919 534202 674079
$$ packed form
17988E72149J3789K5489O0879k8074j11589r0313K3555P9925M9463K7180r1610
17977E30843m4562r6598j45005l4013n1837j01324k6065J37670M8330J29533o24
17966C46348q1833J7948M6066n8622j37608K1368M7181j9151L5676N7424m0412
17955B34385q2341m2477k6949J10762K3868o5672N5900O0301o7108j24817P4842
17944A50694O9814J00465l441r0317m4843O0450M9827J1932j3892m5157L0281
17933B75813p1091O6220N7761l2076j1012l4894R1726J9977n6305O2371L3183
17922D01673J25730J56213M7514o7865J1799N4380n7663p3817p4406N2989J306
17911E77853q582r7927K2603m9470q7867R4011L6356l3334J1276O9283J39877
$$ plain form
17900 674079 778121 898262 993742 1031628 1081859 1298543 1380293 1445769 1443488 1412770 1459523
17889 1459523 1643173 1747543 1685039 1572745 1599647 1533430 1321539 1068499 822907 576836
17879 576836 592078 619568 639188 688833 677002 762667 840960 867363 855984 881471 908042
17868 908042 903399 898346 864329 795225 794003 696944 679106 630829 537058 510434 531953 566947
17856 566947 581457 577883 562651 564135 668902 785709 913028 1020297 1009579 1111736 1101296
17845 1101296 1194895 1282946 1371562 1443406 1489286 1492806 1510221 1396298 1190591 1121829 1019278
17834 1019278 920496 827354 718697 573688 443781 324892 319425 310893 233824 275862 286199
17823 286199 237577 234622 267216 207015 177607 213354 201320 175055 5938 -72957 -94396
$$ packed form
17900F74079J04042J20141R5480L7886N0231K16684Q1750O5476k281l0718M6753
17889A459523J83650J04370o2504j12294K6902o6217k11891k53040k45592k46071
17879E76836J5242K7490J9620M9645j1831Q5665P8293K6403j1379K5487K6571
17868I08042m643n053l4017o9104j222r7059j7838m8277r3771k6624K1519L4994
17856E66947J4510l574j5232J484J04767J16807J27319J07269j0718J02157j0440
17845A101296R3599Q8051Q8616P1844M5880L520J7415j13923k05707o8762j02551
17834A019278r8782r3142j08657j45009j29907j18889n467q532p7069M2038J0337
17823B86199m8622k955L2594o0201k9408L5747j2034k6265j69117p8895k1439
$$ plain form
17812 -94396 -49035 -17296 -12773 53096 135368 113079 194996 193133 38844 -601 5192 12904
17800 12904 11612 100451 125926 109744 203132 167749 47186 15227 -22788 -15005 49230 -47669
17788 -47669 -106385 -86480 -71180 53621 62519 -18148 -65679 -10483 -4589 46758 45914 141900
17776 141900 148853 70933 117481 136721 108983 51654 6297 12221 34129 76033 29909 7279
17764 7279 89295 130672 121380 108452 173110 104376 -52125 -71811 616 31644 20389 74180
17752 74180 48342 85538 218072 275995 252824 150769 120930 178056 196128 162905 102243
17741 102243 68648 51576 -41741 -139397 -57760 122353 183574 196218 143880 6528 -21980
17730 -21980 32819 94642 15849 -35028 36686 29684 54462 167420 79807 4397 -25638 -3930
$$ packed form
17812i4396M5361L1739M523O5869Q2272k2289Q1917j863j54289l9445N793P712
17800A2904j292Q8839K5475j6182R3388l5383j20563l1959l8015P783O4235r6899
17788d7669n8716J9905J5300J24801Q898q0667m7531N5196N894N1347q44R5986
17776A41900O953p7920M6548J9240k7738n7329m5357N924K1908M1904m6124k2630
17764G279Q2016M1377r292j2928O4658o8734j56501j9686P2427L1028j1255N3791
17752G4180k5838L7196J32534N7923k3171j02055k9839N7126J8072l3223o0662
17741A02243l3595j7072r3317r7656Q1637J80113O1221J2644n2338j37352k8508
17730b1980N4799O1823p8793n0877P1714p002K4778J12958q7613p5410l0035K1708
$$ plain form
17718 -3930 -49901 -11146 14764 26113 -19792 60614 138661 54183 -35232 28874 175824 115133
17706 115133 8644 4360 -13443 19889 28558 42689 59432 2155 52872 88796 100907 134690
17694 134690 60837 83369 113959 114447 32744 94682 98212 93495 60301 33637 65068 11198
17682 11198 30364 106750 187681 198116 167820 92556 18375 47830 28167 40205 77752 7352
17670 7352 -87141 25322 80295 150420 221670 335208 307558 87004 35482 46111 62388
17659 62388 98940 110418 102504 118356 178469 132094 136595 176755 195421 265820 187766 144670
17647 144670 92135 35592 40322 10907 -85379 -25573 29675 -50951 -145558 -85194 36462
17636 36462 -42503 -135429 -70539 -42467 -40702 14240 145648 238475 210917 54235 -104118
$$ packed form
17718c930m5971L8755K5910J1349m5905Q0406P8047q4478q9415O4106J46950o0691
17706A15133j06489m284j7803L3332Q669J4131J6743n7277N0717L5924J2111L3783
17694A34690p3853K2532L0590M88q1703O1938L530m717l3194k6664L1431n3870
17682A1198J9166P6386Q0931J0435l0296p5264p4181K9455j9663J2038L7547p0400
17670G352r4493J12463N4973P0125P1250J13538k7650k20554n1522J0629J6277
17659F2388L6552J1478p914J5852O0113m6375M501M0160J8666P0399p8054m3096
17647A44670n2535n6543M730k9415r6286N9806N5248q0626r4607O0364J21656
17636C6462p8965r2926O4890K8072J765N4942J31408R2827k7558j56682j58353
$$ plain form
17625 -104118 -53613 -37685 -74810 -58832 -26274 34841 133475 138566 135327 18883 -132724
17614 -132724 -125639 -10448 25206 85765 150776 128250 -13185 49084 65821 -31774 -35818
17603 -35818 -94724 -73586 -72818 -71169 -8227 45440 150850 104842 88225 128773 105081 101950
17591 101950 142799 301423 267785 207532 120895 74063 4913 -15769 -75215 -71407 -50676
17580 -50676 -126746 -87563 11107 -52578 49242 200269 161797 120624 199088 276744 278634
17569 278634 199794 174395 75830 22934 90117 244410 197206 102410 84233 75834 60780
17558 60780 -24914 7881 211895 270577 207573 86797 26484 69521 29728 -25448 -43554
17547 -43554 -38881 17998 928 -11422 -2368 36722 108790 107802 198335 192672 123171 99803 79800
$$ packed form
17625a04118N0505J5928l7125J5978L2558O1115R8634N091l239j16444j51607
17614a32724P085J15191L5654O0559O5011k2526j41435O2269J6737r7595m044
17603c5818n8906K1138P68J649O2942N3667J05410m6008j6617M0548k3692l131
17591A01950M0849J58624l3638o0253q6637m6832o9150k0682n9446L808K0731
17580e0676p6070L9183R8670o3685J01820J51027l8472m1173P8464P7656J890
17569B78634p8840k5399r8565n2896O7183J54293m7204r4796j8177q399j5054
17558F0780q5694L2795K04014N8682o3004j20776o0313M3037l9793n5176j8106
17547d3554M673N6879j7070j2350R054L9090P2068r88R0533n663o9501k3368k0003
$$ plain form
17534 79800 -18434 -9087 27595 33976 56633 53476 34391 41785 76492 71992 58619 94929 132645
17521 132645 50493 68218 101284 11820 11785 65431 68652 71406 49712 86691 132314 114437
17509 114437 122494 172239 83251 38513 -3103 -27398 91079 97415 81150 47177 68639 53970
17497 53970 11239 140725 168587 107592 145324 157766 206514 241542 140368 103579 183121
17486 183121 204206 163777 161446 76815 84621 36333 -2469 91049 188960 180723 41861 -75670
17474 -75670 -61754 16936 -86064 -38485 162010 240318 201964 211619 168839 66675 47970
17463 47970 21905 20114 103594 35586 6491 60456 66894 58472 31712 7957 1299 -114771
17451 -114771 -113845 -12221 107899 197824 219573 218594 75529 8635 74543 69652 131748 160375
$$ packed form
17534G9800r8234R347L6682O381K2657l157j9085P394L4707m500j3373L6310L7716
17521A32645q2152J7725L3066q9464l5N3646L221K754k1694L6979M5623j7877
17509A14437Q057M9745q8988m4738m1616k4295J18477O336j6265l3973K1462j4669
17497E3970m2731J29486K7862o0995L7732J2442M8748L5028j01174l6789P9542
17486A83121K1085m0429k331q4631P806m8288l8802R3518R7911q237j38862j17531
17474g5670J3916P8690j03000M7579K00495P8308l8354R655m2780j02164j8705
17463D7970k6065j791Q3480o8008k9095N3965O438q422k6760k3755o658j16070
17451a14771R26J01624J20120Q9925K1749r79j43065o6894O5908m891O2096K8627
$$ plain form
17439 160375 50519 41381 72111 32495 -26558 -55795 16377 80511 79464 76900 142213 154639
17427 154639 136521 148752 97373 92006 64009 80288 84397 44464 87599 119131 2012 130360
17415 130360 227253 186342 144376 110293 186458 184323 130261 18692 -179218 -238991 -148624
17404 -148624 23915 13606 1599 11365 41121 13492 31440 52577 27289 83028 145390
17393 145390 152662 111432 68253 39788 58556 41911 47589 2188 2867 -25542 -81303 -162651
17381 -162651 -51040 -39687 -90250 -227027 -341652 -221509 -32056 -55366 -97624 -5304
17371 -5304 32580 8723 -61177 47837 203779 221828 175070 149859 134473 196931 172723
17360 172723 122227 62209 39309 -106613 -167149 -46152 -34284 -38967 13489 105274 59023
$$ packed form
17439A60375j09856r138L0730l9616n9053k9237P2172O4134j047k564O5313J2426
17427A54639j8118J2231n1379n367k7997J6279M109l9933M3135L1532j17119J28348
17415A30360R6893m0911m1966l4083P6165k135n4062j11569j97910n9773R0367
17404a48624J72539j0309j2007R766K9756k7629J7948K1137k5288N5739O2362
17393A45390P272m1230m3179k8465J8768j6645N678m5401O79k8409n5761q1348
17381a62651J11611J1353n0563j36777j14625J20143J89453k3310m2258R2320
17371e304L7884k3857o9900J09014J55942J8049m6758k5211j5386O2458k4208
17360A72723n0496o0018k2900j45922o0536J20997J1868m683N2456R1785m6251
$$ plain form
17349 59023 21084 38933 65366 -39853 -45177 -7303 -105984 -133124 -66452 125368 153740
17338 153740 4648 -58782 -37176 -23425 -76618 -75255 -91446 -150429 -56782 -59773 -123848 -185259
17326 -185259 -154066 -141742 -47708 -16637 -29114 -13309 -26304 42624 85283 34701 26074 24776
17314 24776 -5474 -47299 -1564 -93294 -176994 -67350 -45937 -58769 -40458 39765 30031 50199
17302 50199 33358 77246 162849 141781 150865 86627 80634 127899 195052 93423 58194 33503
17290 33503 60141 64314 51127 84043 84920 29603 27012 -38050 -84465 -71176 -8390 -26564
17278 -26564 -23062 71850 157181 46444 -57365 -56038 -30745 63171 66964 26660 -22009 -9655
17266 -9655 -104342 -91384 -17750 127709 115004 72129 117668 145145 85584 -10497 -37696 -52169
$$ packed form
17349E9023l7939J7849K6433j05219n324L7874r8681k7140O6672J91820K8372
17338A53740j49092o3430K1606J3751n3193J363j6191n8983R3647k991o4075o1411
17326a85259L1193J2324R4034L1071j2477J5805j2995O8928M2659n0582q627j298
17314B4776l0250m1825M5735r1730q3700J09644K1413j2832J8311Q0223r734K0168
17302E0199j6841M3888Q5603k1068R084o4238n993M7265O7153j01629l5229k4691
17290C3503K6638M173j3187L2916Q77n5317k591o5062m6415J3289O2786j8174
17278b6564L502R4912Q5331j10737j03809J327K5293R3916L793m0304m8669J2354
17266i655r4687J2958P3634J45459j2705m2875M5539K7477n9561r6081k7199j4473
$$ plain form
17254 -52169 57094 14113 -2728 75601 161430 205431 159239 97264 30979 -92487 -114824
17243 -114824 -94279 -8494 -87402 -149252 -74527 -62391 -133380 -32881 67457 -5655 3793
17232 3793 -91727 -93935 -140012 -181183 -121823 -172978 -209139 -117573 -34203 -37252 21113 -7515
17220 -7515 -47453 -66210 -76776 -26281 -90418 -213079 -233649 -145579 -54952 -151348 -231843 -168429
17208 -168429 -18917 -12299 93113 51132 -59913 -159024 -163561 -99896 -95967 -152093 -62779
17197 -62779 -83526 -39459 -4592 98202 191022 93887 58272 26939 38465 76178 116493
17186 116493 57611 78251 43919 -35633 -60465 6975 86466 89470 -26455 -79869 -16991
17175 -16991 38648 56328 24575 -3066 36736 -57042 -76642 -94566 18833 109733 51990
$$ packed form
17254e2169J09263m2981j6841P8329Q5829M4001m6192o1975o6285j23466k2337
17243a14824K0545Q5785p8908o1850P4725J2136p0989J00499J00338p3112R448
17232C793r5520k208m6077m1171N9360n1155l6161R1566Q3370l049N8365k8628
17220g515l9938j8757j0566N0495o4137j22661k0570Q8070R0627r6396q0495O3414
17208a68429J49512O618J05412m1981j11045r9111m537O3665L929n6126Q9314
17197f2779k0747M4067L4867J02794R2820r7135l5615l1333J1526L7713M0315
17186A16493n8882K0640l4332p9552k4832O7440P9491L004j15925n3414O2878
17175a6991N5639J7680l1753k7641L9802r3778j9600j7924J13399R0900n7743
$$ plain form
17164 51990 37264 95225 220252 301581 283696 127384 56989 18359 -815 70621 29624
17153 29624 -20709 -2697 15458 11676 31045 -30875 -38431 -94952 7461 38072 -74635 -77951
17141 -77951 -24865 -31767 -55951 33692 -5556 -101255 -54407 79689 177032 45679 -10224
17130 -10224 -19814 50717 61748 43620 11689 88631 99115 -47285 -54041 -20189 -12324 -58730
17118 -58730 -55542 -54029 -48831 -35651 13599 -12967 58595 86236 72744 91138 90448 82364 -16344
17105 -16344 13136 65141 54350 53551 -5718 56835 126039 132150 162814 136642 -492 -55640
17093 -55640 -134977 -99378 -105074 -28471 -43676 -115056 -59552 -42415 32681 32467 -31999 -96265
17081 -96265 -95293 -107048 -63590 35650 -29278 -24895 -21054 23330 67941 116327 148645 92588
$$ packed form
17164E1990j4726N7961J25027Q1329j7885j56312p0395l8630j9174P1436m0997
17153B9624n0333J8012J8155l782J9369o1920p556n6521J02413L0611j12707l316
17141g7951N3086o902k4184Q9643l9248r5699M6848J34096R7343j31353n5903
17130a0224r590P0531J1031j8128l1931P6942J0484j46400o756L3852P865m6406
17118e8730L188J513N198J3180M9250k6566P1562K7641j3492J8394o90q084r8708
17105a6344K9480N2005j0791p99n9269O2553O9204O111L0664k6172j37134n5148
17093e5640p9337L5599n696P6603j5205p1380N5504J7137P5096k14o4466o4266
17081i6265R72j1755M3458R9240o4928M383L841M4384M4611M8386L2318n6057
$$ plain form
17069 92588 -23976 4618 63433 20442 83060 67059 -9509 -67523 -80554 -30470 -145461
17058 -145461 -49316 133163 207196 237049 192965 76869 159025 229899 187261 116275 61625
17047 61625 -13495 -7000 70429 82999 49196 83925 135926 136412 138917 102098 -36100 -133188
17035 -133188 -218536 -242841 -122581 -20767 3618 -2983 30239 -34378 -74222 37397 106064
17024 106064 33975 38067 43786 81849 128632 127364 159539 139377 133276 55111 -36206 107471
17012 107471 87043 99409 102303 82783 82400 158220 222690 81812 83962 154249 41650 58178
17000 58178 -11118 -60522 -46907 41259 120395 51420 -39364 -68570 -157407 -228183 -245289 -275100
16988 -275100 -160786 -41596 -45694 -69723 -66028 -125559 -96345 -94832 -92313 73444 83264 13452
$$ packed form
17069I2588j16564K8594N8815m2991O2618j6001p6568n8014j3031N0084j14991
17058a45461R6145J82479P4033K9853m4084j16096Q2156P0874m2638p0986n4650
17047F1625p5120O495P7429J2570l3803L4729N2001M86K505l6819j38198r7088
17035a33188q5348k4305J20260J01814K4385o601L3222o4617l9844J11619O8667
17024A06064p2089M092N719L8063M6783j268L2175k0162o101p8165r1317J43677
17012A07471k0428J2366K894j9520l83P5820O4470j40878K150P0287j12599J6528
17000E8178o9296m9404J3615Q8166P9136o8975r0784k9206q8837p0776j7106k9811
16988b75100J14314J19190m098k4029L695n9531K9214J513K519J65757R820o9812
$$ plain form
16976 13452 -112819 -134529 -70583 11 -84427 -172189 -137801 -22450 19495 26414 13206
16965 13206 -21790 -33493 -173086 -145802 -24268 77505 52721 47543 -11630 -11722 27044 -22333
16953 -22333 -108343 -87302 21504 107245 64983 134969 129846 17630 -18661 11791 28226
16942 28226 -9015 -72046 -112299 -102795 -111348 -136296 -100007 -163884 -81402 23448 126470 91518
16930 91518 76020 115561 12074 -92756 -223847 -187131 -144230 -146231 -71365 -86959 18597
16919 18597 88566 -56511 -179150 -207728 -246789 -190505 -186697 -242705 -117909 15059 140821
16908 140821 12109 -44049 -60511 -100103 -126130 -98955 -60477 -33499 20022 38243 -31210
16897 -31210 18862 42240 69716 112979 73812 9946 42733 112441 70315 84471 100869 44990
$$ packed form
16976A3452j26271k1710O3946P0594q4438q7762L4388J15351M1945O919j3208
16965A3206l4996j1703j39593K7284J21534J01773k4784n178n9173r2L8766m9377
16953b2333q6010K1041J08806Q5741m2262O9986n123j12216l6291L0452J6435
16942B8226l7241o3031m0253R504q553k4948L6289o3877Q2482J04850J03022l4952
16930I1518j5498L9541j03487j04830j31091L6716M2901k001P4866j5594J05556
16919A8597O9969j45077j22639k8578l9061N6284L808n6008J24796J32968J25762
16908A40821j28712n6158j6462l9592k6027K7175L8478K6978N3521J8221o9453
16897c1210N0072K3378K7476M3263l9167o3866L2787O9708m2126J4156J6398n5879
$$ plain form
16885 44990 -33500 51384 131555 131864 107370 180013 208329 109763 2181 4247 -23796 -47504
16873 -47504 -203957 -280806 -151781 -31486 -40758 -115582 -161481 -225268 -155365 -35469 -58855
16862 -58855 -129461 -179161 -136834 -162793 -177783 -153278 -132007 -70650 -17441 51777 89572 27817
16850 27817 5661 86728 63749 44773 25157 25344 -22636 -11461 26210 50705 83841 46051
16838 46051 51636 81991 83444 75973 12116 3220 -7286 20984 -136672 -80051 93611 143019
16826 143019 59611 54065 30616 14966 7947 22631 8134 1046 -115588 -136049 -98536 -87825
16814 -87825 -73143 -98231 -96926 -84663 -145827 -155823 -96756 -25834 -13652 12248 -34156 10090
16802 10090 93225 99755 60759 8644 -52117 23092 116250 31601 -51991 -29339 -5769 -829
$$ packed form
16885D4990p8490Q4884Q0171L09k4494P2643K8316r8566j07582K066k8043k3708
16873d7504j56453p6849J29025J20295r272p4824m5899o3787O9903J19896k3386
16862e8855p0606m9700M2327k5959j4990K4505K1271O1357N3209O9218L7795o1755
16850B7817k2156Q1067k2979j8976j9616J87m7980J1175L7671K4495L3136l7790
16838D6051N585L0355J453p471o3857q896j0506K8270j57656N6621J73662M9408
16826A43019q3408n546k3449j5650p019J4684j4497p088j16634k0461L7513J0711
16814h7825J4682k5088J305J2263o1164r996N9067P0922J2182K5900m6404M4246
16802A0090Q3135O530l8996n2115o0761P5209R3158q4649q3592K2652K3570M940
$$ plain form
16790 -829 72717 -36473 -89886 -68987 -145429 -157788 -61034 -94927 -107263 -134763 -138233 -77756
16778 -77756 -160298 -162588 -72012 -9479 100553 109305 64753 -29982 -98115 -106269 -203301 -106110
16766 -106110 -51090 -88478 -63734 25609 133175 117873 26849 -62273 -101629 -59749 -50195
16755 -50195 -120837 -96697 18758 33212 48175 65558 10373 -79306 -95007 -111965 -180825
16744 -180825 -75705 18900 -78368 -142935 -121051 -32139 73377 28677 -109131 -148296 -85189
16733 -85189 -69288 -35233 -23600 -11807 -103183 -180061 -178749 -120228 -75277 104185 83134 -50297
16721 -50297 -63176 -58819 -16057 67133 1084 9235 125221 80284 -18617 29031 3589 -36933
16709 -36933 -91564 -69756 -94251 -31495 46051 102320 88145 124195 69604 -26386 -56262 13399
$$ packed form
16790h29P3546j09190n3413K0899p6442j2359R6754l3893j2336k7500l470O0477
16778g7756q2542k290R0576O2533J10032Q752m4552r4735o8133q154r7032R7191
16766a06110N5020l7388K4744Q9343J07566j5302r1024q9122l9356M1880R554
16755e0195p0642K4140J15455J4454J4963J7383n5185q9679j5701j6958o8860
16744a80825J05120R4605r7268o4567K1884Q8912J05516m4700j37808l9165O3107
16733h5189J5901L4055J1633J1793r1376p6878J312N8521M4951J79462k1051j33431
16721e0297j2879M357M2762Q3190o6049Q151J15986m4937r8901M7648k5442m0522
16709c6933n4631K1808k4495O2756P7546N6269j4175L6050n4591r5990k9876O9661
$$ plain form
16697 13399 -16504 -7648 10663 34097 83304 106339 132775 130699 163102 98878 64291 -16728
16685 -16728 -85055 -2180 31387 23278 -12400 -57776 23253 131603 180373 144177 176545 198743
16673 198743 64650 37293 11361 -50569 -60275 -66142 -7814 30581 72854 -71016 -120848
16662 -120848 -103745 -89609 -126817 -122995 -42054 76073 91607 76505 20713 -98943 -100076
16651 -100076 -32616 26760 55103 92550 135496 91883 -44201 -80098 -44913 -56150 -54734
16640 -54734 79974 91689 155142 300058 286214 175055 51222 -30891 -63050 -79770 -39493
16629 -39493 -83437 -182620 -162156 -82008 -69298 -42751 -61864 -114453 -125691 -82063 -70819 -214120
16617 -214120 -206832 -117993 -42927 11626 -37868 -90975 -1250 -7121 -117747 -58406 -95733 -191760
$$ packed form
16697A3399k9903Q856J8311K3434M9207K3035K6436k076L2403o4224l4587q1019
16685a6728o8327Q2875L3567q109l5678m5376Q1029J08350M8770l6196L2368K2198
16673A98743j34093k7357k5932o1930r706n867N8328L8395M2273j43870m9832
16662a20848J7103J4136l7208L822Q0941J18127J5534j5102n5792j19656j133
16651a00076O7460N9376K8343L7447M2946m3613j36084l5897L5185j1237J416
16640e4734J34708J1715O3453J44916j3844j11159j23833q2113l2159j6720M0277
16629c9493m3944r9183K0464Q0148J2710K6547j9113n2589j1238M3628J1244j43301
16617b14120P288Q8839P5066N4553m9494n3107Q9725n871j10626N9341l7327r6027
$$ plain form
16605 -191760 -216971 -112122 -81589 -148327 -56736 -34595 -58423 12579 -14315 -49033 -5972
16594 -5972 35013 -7788 -51250 18787 36203 15785 53304 82463 88755 -18099 21953 56867
16582 56867 46156 52469 114399 102578 66261 -12108 -19196 -1695 -22294 44019 45559 71652
16570 71652 56751 103046 127963 94737 49150 22194 35674 106447 74403 -65033 14943
16559 14943 121229 158333 159066 149627 7961 31247 104179 102410 121931 104377 96200 49623
16547 49623 98264 38782 21907 23954 85232 18279 10200 -25651 -29573 -10943 54218 14588
16535 14588 -18685 19996 -57884 -70817 -61073 847 145728 160647 102760 76892 60904 -17320
16523 -17320 -150166 -179430 -205346 -165875 -132551 -58455 -95918 -227890 -249142 -191681 -204125
$$ packed form
16605a91760k5211J04849L0533o6738R1591K2141k3828P1002k6894l4718M3061
16594e972M0985m2801m3462P0037J7416k0418L7519K9159O292j06854M0052L4914
16582E6867j0711O313O1930j1821l6317p8369p088J7501k0599O6313J540K6093
16570G1652j4901M6295K4917l3226m5587k6956J3480P0773l2044j39436P9976
16559A4943J06286L7104P33r439j41666K3286P2932j769J9521j7554q177m6577
16547D9623M8641n9482j6875K047O1278o6953q079l5851l922J8630O5161l9630
16535A4588l3273L8681p7880j2933R744O1920J44881J4919n7887k5868j5988p8224
16523a7320j32846k9264k5916L9471L3324P4096l7463j31972k1252N7461j2444
$$ plain form
16512 -204125 -171583 -140686 -37039 27572 -32836 -80500 -9414 -57300 -142893 -221057 -203317
16501 -203317 -101862 -49134 60291 41594 -35756 -2845 24111 19500 72459 36833 -1245
16490 -1245 38651 11651 40209 45534 32933 82569 85945 90391 -4845 -132314 -157797 -98868
16478 -98868 -2749 30152 24933 109043 53774 65936 25693 14709 -27538 -74466 -66587 -142569
16466 -142569 -149807 -157918 -145284 -123384 -43777 9592 15810 -142715 -175320 -135264 -122308 -147085
16454 -147085 -230110 -184658 -90679 -61845 -21674 -46668 -7814 13960 -18175 -34719 -24988 -105741
16442 -105741 -68283 35556 5878 -48554 -165421 -75674 42315 -26076 -46070 -46981 52187
16431 52187 55020 -25236 -54156 -181161 -150124 -177457 -218386 -195687 -94176 79395 131693
$$ packed form
16512b04125L2542L0897J03647O4611o0408m7664P1086m7886q5593p8164J7740
16501b03317J01455N2728J09425j8697p7350L2911K6956m611N2959l5626l8078
16490a245L9896k7000K8558N325j2601M9636L376M446r5236j27469k5483N8929
16478i8868R6119L2901n219Q4110n5269J2162m0243j0984m2247m6928P879p5982
16466a42569p238q111J2634K1900P9607N3369O218j58525l2605M0056J2956k4777
16454a47085q3025M5452R3979K8834M0171k4994L8854K1774l2135j6544R731q0753
16442a05741L7458J03839k9678n4432j16867Q9747J17989o8391j9994r11R9168
16431E2187K833q0256k8920j27005L1037k7333m0929K2699J01511J73571N2298
$$ plain form
16420 131693 52781 -42718 -106075 10221 149072 145035 14264 -58447 -113407 -152441 -127787
16409 -127787 -101332 -139961 -175105 -186054 -147411 -68235 -54963 24707 -13006 -3874 -36371 -42697
16397 -42697 -74361 -60489 49145 136051 144123 85181 82092 38617 -12045 -81810 5960 96841
16385 96841 -57562 -45834 4568 -2501 -70570 -56923 -5323 -14973 20311 -12175 68650 76898
16373 76898 -33314 -141748 -95633 15558 57239 39138 61677 45404 21123 37187 90337
16362 90337 141986 95466 -78971 -83710 -14758 -60299 -80986 -77506 -88562 -57767 -32151 -43792
16350 -43792 -19558 -3084 -43306 -46892 2440 57878 -20764 -125920 -95768 -25733 59805 85995
16338 85995 100457 89055 -30645 -102883 -82392 -18580 118412 82266 -22855 -75188 -89594
$$ packed form
16420A31693p8912r5499o3357J16296J38851m037j30771p2711n4960l9034K4654
16409a27787K6455l8629l5144j0949L8643P9176J3272P9670l7713R132l2497o326
16397d2697l1664J3872J09634Q6906Q072n8942l089m3475n0662o9765Q7770R0881
16385I6841j54403J1728N0402p069o8069J3647N1600r650L5284l2486Q0825Q248
16373G6898j10212j08434M6115J11191M1681j8101K2539j6273k4281J6064N3150
16362I0337N1649m6520j74437m739O8952m5541k0687L480j1056L0795K5616j1641
16350d3792K4234J6474m0222l586M9332N5438p8642j05156L0152P0035Q5538K6190
16338H5995J4462j1402j19700p2238K0491O3812J36992l6146j05121n2333j4406
$$ plain form
16327 -89594 -102940 -123285 -127119 -173127 -183182 -144652 -151636 -97928 -90278 -98730 -162789 -206743
16315 -206743 -247768 -178084 -176143 -171583 -38995 105165 81676 -2835 -55518 -16926 14871
16304 14871 7 40561 1787 -76196 -38190 -52174 -60708 -43942 -71185 20027 70261 44219
16292 44219 67807 41903 -57250 -51802 -77101 -80822 -142958 -177371 -258448 -363870 -337167 -198388
16280 -198388 -146057 -121247 -6920 -31318 -43651 25902 3815 -17813 -83937 -40699 -75209
16269 -75209 -81002 -96244 -136561 -216258 -175918 -132000 -193529 -156529 -95391 -113021 -1337 -30370
16257 -30370 -137019 -185803 -152844 -95657 26537 -9591 22760 -3252 -78190 -148504 -190652
16246 -190652 -149938 -129902 -117700 -51183 -14705 37892 48843 46979 62370 54869 137063 203126
$$ packed form
16327h9594j3346k0345l834m6008j0055L8530o984N3708P650q452o4059m3954
16315b06743m1025O9684J941M560J32588J44160k3489q4511n2683L8592L1797
16304A4871j4864M0554l8774p7983L8006j3984q534J6766k7243R1212N0234k6042
16292D4219K3588k5904r9153N448k5299l721o2136l4413q1077j05422K6703J38779
16280a98388N2331K4810J14327k4398j2333O9553k2087k1628o6124M3238l4510
16269g5209n793j5242m0317p9697M0340M3918o1529L7000O1138j7630J11684k9033
16257c0370j06649m8784L2959N7187J22194l6128L2351k6012p4938p0314m2148
16246a90652M0714K0036J2202O6517L6478N2597J0951j864J5391p501Q2194O6063
$$ plain form
16234 203126 91172 47579 76841 39126 -102649 -130939 -106042 -111697 -102598 -30562 4141
16223 4141 9674 -34691 -77430 -114067 -28371 19232 6024 -67575 -145853 -209088 -247331 -295953
16211 -295953 -236534 -158660 -175652 -165533 -162587 -80628 -60215 -159074 -86638 35881 12734
16200 12734 56789 88653 99496 -46379 -216730 -171861 -209 60513 23325 6525 -24355
16189 -24355 -77151 -163905 -99955 -98828 -138772 -170834 -109691 852 -13623 -36404 49434 25107
16177 25107 -74671 -167736 -198414 -162019 -70202 -7184 47203 48010 13527 -71163 18183 62394
16165 62394 28700 85134 137203 180068 167098 92967 -20157 -9500 24902 -3447 -74578
16154 -74578 -55716 -14669 -42893 -76196 -39873 -35278 -36749 18776 61488 109475 43457 651
$$ packed form
16234B03126j11954m3593K9262l7715j41775k8290K4897n655R099P2036L4703
16223D141N533m4365m2739l6637Q5696M7603j3208p3599p8278o3235l8243m8622
16211b95953N9419P7874j6992J0119K946Q1959K0413r8859P2436J22519k3147
16200A2734M4055L1864J0843j45875j70351M4869J71652O0722l7188j6800l0880
16189b4355n2796q6754O3950J127l9944l2062O1143J10543j4475k2781Q5838k4327
16177B5107r9778r3065l0678L6395R1817O3018N4387Q07l4483q4690Q9346M4211
16165F2394l3694N6434N2069M2865j2970p4131j13124J0657L4402k8349p1131
16154g4578J8862M1047k8224l3303L6323M595j471N5525M2712M7987o6018m2806
$$ plain form
16142 651 38152 68878 -6721 7805 13389 8858 -89843 -166915 -217683 -220132 -116409 -60387
16130 -60387 -34114 -31469 -96803 42822 136568 130195 167817 163645 246409 185490 110677 113895
16118 113895 164405 105059 91491 87709 80352 65583 29935 -12753 -64351 -98876 -131737 -209590
16106 -209590 -109348 -61732 -22278 -133881 -219183 -194378 -127733 -193408 -234491 -182500 -88934
16095 -88934 -54875 71859 34920 -65415 -29057 40196 117685 177428 74680 -26982 -22229
16084 -22229 -66828 -174389 -106517 -56935 7558 22055 -43499 -78140 -104210 -70904 62091
16073 62091 115545 172961 135397 144039 56966 -43499 -26833 -7681 -2520 -68466 -86860 -80271
16061 -80271 -112399 -108613 -55812 -1271 -12770 -44985 27776 18223 64529 30930 26659 -43770
$$ packed form
16142F51L7501L0726p5599J4526N584m531r8701p7072n0768k449J03723N6022
16130f0387K6273K645o5334J39625R3746o373L7622m172Q2764o0919p4813L218
16118A13895N0510n9346j3568l782p357j4769l5648m2688n1598l4525l2861p7853
16106b09590J00242M7616L9454j11603q5302K4805O6645o5675m1083N1991R3566
16095h8934L4059J26734l6939j00335L6358O9253P7489N9743j02748j01662M753
16084b2229m4599j07561O7872M9582O4493J4497o5554l4641k6070L3306J32995
16073F2091N3454N7416l7564Q642q7073j00465J6666J9152N161o5946j8394O589
16061h0271l2128L786N2801N4541j1499l2215P2761r553M6306l3599m271p0429
$$ plain form
16049 -43770 -114808 -70422 -84212 -71487 19481 -38206 18848 64268 95984 95138 97312 90088
16037 90088 16819 -62680 -43665 -114091 -149067 -142596 -64454 -62418 -5920 -6352 -41408 -71722
16025 -71722 -57024 -37001 -39381 -57245 -15359 -9953 36373 94363 99996 46936 11585 -86480
16013 -86480 -195857 -142197 -139465 -178409 -64180 11302 -13384 -4098 19702 -59324 -54921 18875
16001 18875 54229 50540 19387 17674 -43009 -120102 -93022 -32668 25901 5072 -57608 -149891
15989 -149891 -116141 5173 79205 62952 31977 50710 157443 188485 90347 10484 56387
15978 56387 -4954 -88841 -17227 5284 3912 104771 119052 22836 -14774 68298 145218 179909
15966 179909 169465 87505 -357 -22334 -13827 1161 -23549 -59216 7522 60947 1533 -12328
$$ packed form
16049d3770p1038M4386j3790J2725R0968n7687N7054M5420L1716q46K174p224
16037I0088p3269p9499J9015p0426l4976O471P8142K036N6498m32l5056l0314
16025g1722J4698K0023k380j7864M1886N406M6326N7990N633n3060l5351r8065
16013h6480j09377N3660K732l8944J14229P5482k4686R286K3800p9026M403P3796
16001A8875L5354l689l1153j713o0683p7093K7080O0354N8569k0829o2680r2283
15989a49891L3750J21314P4032j6253l0975J8733J06733L1042r8138p9863M5903
15978E6387o1341q3887P1614K2511j372J00859J4281r6216l7610Q3072P6920L4691
15966A79909j0444q1960q7862k1977Q507J4988k4710l5667O6738N3425n9414j3861
$$ plain form
15954 -12328 -2436 -51380 -59268 -169648 -232190 -171379 -121179 -138244 -58217 26546 58812 40365
15942 40365 -16332 20547 6631 -63852 -32738 7925 -20684 869 -22458 25267 97088 170124
15930 170124 93802 -62461 -71562 -24522 1801 37420 -16223 -47952 -66952 -101446 -94510 -136159
15918 -136159 -163024 -92240 41517 92223 16959 -46007 -7925 95102 139552 50380 59292
15907 59292 -80978 -191375 -76695 -60307 -20767 -38283 -96173 -92157 -55690 -84514 -22271
15896 -22271 37577 42971 11933 -21164 -10432 -95025 91927 173232 164721 72420 29995 4030
15884 4030 -121568 -59655 -12279 -47234 -37400 -40290 -3825 -40227 -19093 -74900 -48740 26461
15872 26461 30322 26615 -1625 -17544 39147 9872 -29990 17297 9758 -7529 3158 -28305
$$ packed form
15954a2328R892m8944p888j10380o2542O0811N0200j7065Q0027Q4763L2266j8447
15942D0365n6697L6879j3916p0483L1114M0663k8609K1553k3327M7725P1821P3036
15930A70124p6322j56263r101M7040K6323L5619n3643l1729j9000l4494O936m1649
15918a36159k6865P0784J33757N0706p5264o2966L8082J03027M4450q9172Q912
15907E9292j40270j10397J14680J6388L9540j7516n7890M016L6467k8824O2243
15896b2271N9848N394l1038l3097J0732q4593J86952Q1305q511r2301m2425k5965
15884D030j25598O1913M7376l4955R834k890L6465l6402K1134n5807K6160P5201
15872B6461L861l707k8240j5919N6691k9275l9862M7287p539j7287J0687l1463
$$ plain form
15860 -28305 -49422 -87201 -117196 -49051 -71377 -69965 -81044 -69683 -123700 -94930 -28501 -4402
15848 -4402 -4224 -12407 -63959 -22795 -63143 -81012 -169425 -200839 -215851 -197830 -138596 -143706 -143665
15835 -143665 -64371 67236 183874 146847 123447 112140 93295 86487 -9937 -101153 -177871
15824 -177871 -201570 -112669 -90867 -86615 35653 163325 138982 133713 119014 117222 169540 106041
15812 106041 110145 50391 -77173 -108167 -142073 -71945 -115623 -59620 -20101 -115370 -192097
15801 -192097 -198513 -152996 -179596 -169378 -92955 -103894 -61853 28259 107682 134854 20979
15790 20979 32065 -6616 27229 -22315 9553 15230 -52128 -144779 -150811 -65554 -28172 -5394
15778 -5394 70387 78547 66624 114890 160858 45100 46271 35927 -18485 -122299 -167044 -191948
$$ packed form
15860b8305k1117l7779k9995O8145k2326J412j1079J1361n4017K8770O6429K4099
15848d402J78q183n1552M1164m0348j7869q8413l1414j5012J8021N9234n110M1
15835a43665P9294J31607J16638l7027k3400j1307j8845o808r6424r1216p6718
15824a77871k3699Q8901K1802M252J22268J27672k4343n269j4699j792N2318o3499
15812A06041M104n9754j27564l0994l3906P0128m3678N6003L9519r5269p6727
15801a92097o416M5517k6600J0218P6423j0939M2041R0112P9423K7172j13875
15790B0979J1086l8681L3845m9544L1868N677o7358r2651o032Q5257L7382K2778
15778e394P5781Q160j1923M8266M5968j15758J171j0344n4412j03814m4745k4904
$$ plain form
15766 -191948 -239815 -191187 -190046 -135828 -41853 -54275 -43000 -166621 -194488 -215003 -244177
15755 -244177 -164608 -159143 -55715 -14938 11025 -320 1379 -24728 -14222 13803 -16412 -44582
15743 -44582 -129308 -66023 -125671 -211825 -274791 -241509 -160791 -22994 115851 116999 49106
15732 49106 21121 75267 97626 70133 -40398 -40365 -14828 -14209 -48244 -119842 -70157 61989
15720 61989 59345 -33187 -24566 -28933 -50001 -86816 -145504 -102810 -102089 33777 107308 143515
15708 143515 187513 99056 -14178 -6979 34560 35187 42986 -14139 -56452 -32947 -52528 17717
15696 17717 39922 92822 102128 55116 74676 73898 -431 25789 83556 63665 61865 67177 123070
15683 123070 123156 89913 149457 169011 118905 51701 -62036 7543 44224 42984 14150 28074
$$ packed form
15766a91948m7867M8628J141N4218R3975j2422J1275j23621k7867k0515k9174
15755b44177P9569N465J03428M0777K5963j1345J699k6107J0506K8025l0215k8170
15743d4582q4726O3285n9648q6154o2966L3282Q0718J37797J38845J148o7893
15732D9106k7985N4146K2359k7493j10531L3K5537O19l4035p1598M9685J32146
15720F1989k644r2532Q621m367k1068l6815n8688M2694P21J35866P3531L6207
15708A43515M3998q8457j13234P199M1539O27P799n7125m2313K3505j9581P0245
15696A7717K2205N2900R306m7012J9560p78p4329K6220N7767j9891j800N312N5893
15683A23070Q6l3243N9544J9554n0106o7204j13737O9579L6681j240k8834J3924
$$ plain form
15671 28074 40777 23039 14294 5856 -27757 -78333 -9884 89177 178842 81682 65922 55848
15659 55848 80674 129329 44581 32650 20554 27813 4636 74280 102639 82518 13132 -54489
15647 -54489 -6141 23576 29157 38864 65705 98700 79828 104185 75154 137313 137434 101076
15635 101076 83573 102979 57543 94430 19247 -10529 -81791 -82510 -100414 -90566 -39527 61022
15623 61022 53455 27246 76248 89523 138776 342989 405839 299897 280143 227735 92411
15612 92411 104465 137704 37355 -50889 -46758 -29628 -71576 -15458 -106567 -117232 -9379
15601 -9379 24295 -32929 -121367 -149050 -90300 20468 111797 39824 -37340 -64658 -82198 -87200
15589 -87200 -92811 -1441 88546 150018 161278 149036 95529 107226 -659 -94245 -109559 -150311
$$ packed form
15671B8074J2703j7738q745q438l3613n0576O8449R9061Q9665r7160j5760j0074
15659E5848K4826M8655q4748j1931j2096P259k3177O9644K8359k0121o9386o7621
15647e4489M8348K9717N581R707K6841L2995j8872K4357k9031O2159J21l6358
15635A01076j7503J9406m5436L6887p5183k9776p1262p19j7904R848N1039J00549
15623F1022p567k6209M9002J3275M9253K04213O2850j05942j9754n2408j35324
15612I2411J2054L3239j00349q8244M131J7130m1948N6118r1109j0665J07853
15601i379L3674n7224q8438k7683N8750J10768R1329p1973p7164k7318j7540n002
15589h7200n611R1370Q9987O1472J1260j2242n3507J1697j07885r3586j5314m0752
$$ plain form
15577 -150311 -145710 -100143 -75493 -27426 18061 15208 -6619 -126955 -119929 -128791 -191715 -227740
15565 -227740 -119786 -47821 34935 13856 -27467 43357 89975 30299 49768 18362 -12559
15554 -12559 24491 -5265 -37273 -75995 -9802 -67348 -198775 -139706 7880 55254 -105010
15543 -105010 -53262 30148 10140 -7261 -86587 -122078 -117343 -90045 -101884 -138690 -108526 -22056
15531 -22056 33549 -69465 -107839 -199931 -181505 -123508 -75371 -61169 -137068 -163618 -108582
15520 -108582 -76567 -50597 -15193 -75124 -94516 -34331 100335 103847 63180 70926 128127 158764
15508 158764 87600 -54872 -100466 18070 63060 121996 102656 59369 44450 -70266 -112443
15497 -112443 -123050 -38416 -29399 5613 -41221 -106582 -74911 -36520 -57269 -52257 -81873 -120011
$$ packed form
15577a50311M601M5567K4650M8067M5487k853k1827j20336P026q862o2924l6025
15565b27740J07954P1965Q2756k1079m1323P0824M6618n9676J9469l1406l0921
15554a2559L7050k9756l2008l8722O6193n7546j31427N9069J47586M7374j60264
15543a05010N1748Q3410k0008j7401p9326l5491M735K7298j1839l6806L0164Q6470
15531b2056N5605j03014l8374r2092J8426N7997M8137J4202p5899k6550N5036
15520a08582L2015K5970L5404n9931j9392O0185J34666L512m0667P746N7201L0637
15508A58764p1164j42472m5594J18536M4990N8936j9340m3287j4919j14716m2177
15497a12443j0607Q4634R017L5012m6834o5361L1671L8391k0749N012k9616l8138
$$ plain form
15485 -120011 -113585 -137046 -192289 -95160 -38142 -14917 7070 27166 112179 172323 154714 124357
15473 124357 126123 41197 89184 127164 153664 121216 158225 42694 -122666 -195207 -175335
15462 -175335 -101478 -76719 10570 -31109 19451 62773 -25112 -16821 -97272 -136500 -168469 -140032
15450 -140032 -30322 101504 106183 80491 176684 109864 4576 -12332 -54855 2676 66714
15439 66714 61516 83689 130834 97013 75411 42033 34378 -20093 -106323 -188209 -120900 -92116
15427 -92116 -25328 1182 81177 70026 56014 103903 117856 54582 -37454 -74903 -121097 -56947
15415 -56947 -65531 15627 62990 -73119 -135525 -8091 80881 157938 179456 150931 86249
15404 86249 212854 151651 28480 14451 -27843 -64140 -41451 -6211 59112 102845 161595
$$ packed form
15485a20011O426k3461n5243R7129N7018K3225K1987K0096Q5013O0144j7609l0357
15473A24357J766q4926M7987L7980K6500l2448L7009j15531j65360p2541J9872
15462a75335P3857K4759Q7289m1679N0560M3322q7885Q291q0451l9228l1969K8437
15450a40032J09710J31826M679k5692R6193o6820j05288j6908m2523N7531O4038
15439F6714n198K2173M7145l3821k1602l3378p655n4471q6230q1886O7309K8784
15427i2116O6788K6510P9995j1151j4012M7889J3953o3274r2036l7449m6194O4150
15415e6947q584Q1158M7363j36109o2406J27434Q8972P7057K1518k8525o4682
15404H6249J26605o1203j23171j4029m2294l6297K2689L5240O5323M3733N8750
$$ plain form
15393 161595 148380 44733 -8227 -12752 14105 -44586 -45993 -109570 -158512 -129999 -31349 18831
15381 18831 34667 -45694 -23554 17212 -82205 -126167 -123254 -126264 -76237 -122880 -80394 -70589
15369 -70589 -79183 -78701 -125885 -95231 -124217 -76342 -20780 62354 14503 -160206 -201127 -95317
15357 -95317 -105826 -37257 78449 65551 33442 40797 73071 110018 29357 -57795 -94553 -147158
15345 -147158 -124929 -3473 39167 4390 50413 54956 28625 -35764 -41517 -88143 -130494 -148692
15333 -148692 26979 78322 -52221 -159768 -145729 -6261 -78810 -75099 -77236 -43272 1636
15322 1636 8349 97829 72751 106105 223964 237919 133596 5717 31343 43197 -47677
15311 -47677 -10194 58971 79837 35473 11588 77050 6536 -84959 -60350 7475 27825 40183
$$ packed form
15393A61595j3215j03647n2960m525K6857n8691j407o3577m8942K8513R8650N0180
15381A8831J5836q0361K2140M0766r9417m3962K913l010N0027m6643M2486R805
15369g0589q594M82m7184L0654k8986M7875N5562Q3134m7851j74709m0921J05810
15357i5317j0509O8569J15706j2898l2109P355L2274L6947q0661q7152l6758n2605
15345a47158K2229J21456M2640l4777M6023M543k6331o4389n753m6626m2351j8198
15333a48692J75671N1343j30543j07547J4039J39468p2549L711k137L3964M4908
15322A636O713Q9480k5078L3354J17859J3955j04323j27879K5626J1854r0874
15311d7677L7483O9165K0866m4364k3885O5462p0514r1495K4609O7825K0350J2358
$$ plain form
15299 40183 -17886 -95965 -99085 -55845 -28172 -89931 -139313 -130560 16109 83674 81783 18909
15287 18909 -20655 -42265 -156626 -224596 -156907 36723 8806 -55122 -63289 -74082 -165184
15276 -165184 -167282 -49122 -123723 -177588 -157589 -81385 -119128 -51076 -21001 23019 -30582
15265 -30582 -184393 -186870 -146751 -159672 -244117 -240406 -185155 -140198 -15544 -55205 -120777 -99709
15253 -99709 -102708 -129820 10775 -1215 -55785 10655 87928 111482 81913 76934 -44562 -55670
15241 -55670 -38268 -49527 89425 285079 237312 119762 43882 -43174 -150795 -102043 -77972
15230 -77972 -49805 -25789 19538 24355 116471 80761 31609 -24581 30984 213578 209783 80842
15218 80842 -65169 -131208 -85305 -106631 -137547 -141922 -96038 -25001 42714 78100 203191
$$ packed form
15299D0183n8069p8079l120M3240K7673o1759m9382Q753J46669O7565j891o2874
15287A8909l9564k1610j14361o7970O7689J93630k7917o3928q167j0793r1102
15276a65184k098J18160p4601n3865J9999P6204l7743O8052L0075M4020n3601
15265c0582j53811k477M0119j2921q4445L711N5251M4957J24654l9661o5572K1068
15253i9709k999k7112J40595j1990n4570O6440P7273K3554k9569m979j21496j1108
15241e5670J7402j1259J38952J95654m7767j17550p5880q7056j07621M8752K4071
15230g7972K8167K4016M5327M817R2116l5710m9152n6190N5565J82594l795j28941
15218H0842j46011o6039M5903k1326l0916m375M5884P1037O7715L5386J25091
$$ plain form
15207 203191 223033 145076 89423 128758 99342 60989 12043 -32141 -53698 -59748 35186 70442
15195 70442 32250 -26912 -7085 -19296 -10786 -8740 -27643 -3351 -32230 31515 118930 22890
15183 22890 25192 5681 -104335 -136192 -60076 56159 108878 31757 10609 23030 -56861
15172 -56861 -83890 -154539 -98936 -45699 -90132 -185967 -199052 -101391 65061 8194 -3897
15161 -3897 14001 63458 -26032 -81202 -109032 -124118 -81466 33340 51646 -119216 -101198
15150 -101198 -47048 -55704 -121287 -149107 -87752 -62256 -72088 -76886 -32906 -13118 37109 123969
15138 123969 54962 -93125 -115793 -48524 12248 -2146 -27061 -28521 -32361 -38565 8592 -15892
15126 -15892 -20514 -30098 -145205 -104973 -150570 -99745 -82230 -109661 -100889 -58332 -11546 22791
$$ packed form
15207B03191J9842p7957n5653L9335k9416l8353m8946m4184k1557o050R4934L5256
15195G0442l8192n9162J9827j2211Q510K046j8903K4292k8879O3745Q7415r6040
15183B2890K302j9511j10016l1857P6116J16235N2719p7121k1148J2421p9891
15172e6861k7029p0649N5603N3237m4433r5835j3085R7661J66452n6867j2091
15161c897J7898M9457q9490n5170k7830j5086M2652J14806J8306j70862J8018
15150a01198N4150q656o5583k7820O1355K5496r832m798M3980J9788N0227Q6860
15138A23969o9007j48087k2668O7269O0772j4394k4915j460l840o204M7157k4484
15126a5892m622r584j15107M0232m5597N0825J7515k7431Q772M2557M6786L4337
$$ plain form
15114 22791 79646 121476 104055 54102 17791 -67947 -6367 -59208 -96826 -50452 -30047 -38825
15102 -38825 -47101 14563 122574 171488 63772 -103033 -74032 -17125 -12083 -94122 -4759
15091 -4759 75796 108875 120883 45819 -8123 14055 135359 62099 14661 89900 121555 29867
15079 29867 -101546 -199313 -206022 -146157 -76592 -87649 -44780 -14538 -5952 -17317 3628 -33851
15067 -33851 -219775 -192607 -146039 -68831 -94715 -140761 -20103 -543 14161 24156 -38273
15056 -38273 -95803 -35719 -11816 14773 -2991 -95391 -141744 -126512 8724 117872 59965
15045 59965 57886 74950 58438 48366 21336 55931 32782 -23481 -59860 -24454 76344 119341
15033 119341 111103 94882 96642 102049 -12665 -66704 -81739 35702 55972 109716 104958 165575
$$ packed form
15114B2791N6855M1830j7421m9953l6311q5738O1580n2841l7618M6374K0405q778
15102c8825q276O1664J08011M8914j07716j66805K9001N6907N042q2039Q9363
15091d759Q0555L3079J2008p5064n3942K2178J21304p3260m7438P5239L1655r1688
15079B9867j31413r7767o709N9865O9565j1057M2869L0242Q586j1365K0945l7479
15067c3851j85924K7168M6568P7208k5884m6046J20658J9560J4704R995o2429
15056c8273n7530O0084K3903K6589j7764r2400m6353J5232J35236J09148n7907
15045E9965k079J7064j6512j0072k7030L4595k3149n6263l6379L5406J00798M2997
15033A19341q238j6221J760N407j14714n4039j5035J17441K0270N3744m758O0617
$$ plain form
15021 165575 121118 -43078 -6230 64566 25533 57551 51903 28870 4845 -54778 49966
15010 49966 41130 -142196 -228321 -229056 -162684 -22480 119843 83000 20834 -32661 -60388 -35223
14998 -35223 33372 106171 97576 83488 121597 44901 -20037 -15103 16119 -11107 -2125 -25189
14986 -25189 -91354 -118126 -77396 -72729 -66884 -67975 -124386 -135009 -189710 -155256 -81252 -27502
14974 -27502 11740 10105 -75512 -81000 -64516 -77579 -110379 -71911 36384 -9932 -95511 -124263
14962 -124263 -155202 -70552 46754 8703 118185 77723 60526 86173 81723 18744 -52435
14951 -52435 -149207 -139896 -56322 -122035 -155804 -143867 -84246 -147769 -66711 -76269 -157713 -200983
14939 -200983 -187210 -136666 -22785 -83864 -146737 -158367 -161097 -86999 -119511 -16386 108958
$$ packed form
15021A65575m4457j64196L6848P0796l9033L2018n648k3033k4025n9623J04744
15010D9966q836j83326q6125p35O6372J40204J42323l6843o2166n3495k7727K5165
14998c5223O8595P2799q595j4088L8109p6696o4938M934L1222k7226Q982k3064
14986b5189o6165k6772M0730M667N845j091n6411j0623n4701L4454P4004N3750
14974b7502L9242j635q5617n488J6484j3063l2800L8468J08295m6316q5579k8752
14962a24263l0939Q4650J17306l8051J09482m0462j7197K5647m450o2979p1179
14951e2435r6772R311Q3574o5713l3769J1937N9621o3523Q1058r558q1444m3270
14939b00983J3773N0544J13881o1079o2873j1630k730P4098l2512J03125J25344
$$ plain form
14928 108958 86594 13304 -67120 17523 -28189 -109873 -141430 -89155 -17927 19729 49549
14917 49549 29651 -33440 -28255 -116404 -85115 488 17364 38884 -36912 -111487 -187188 -224386
14905 -224386 -150949 -116408 -75528 -67296 -113448 -170856 -185747 -276078 -232282 -61949 -38032
14894 -38032 -54899 -67246 -21808 75519 -7968 -84814 -185837 -222824 -89705 -11 -12456
14883 -12456 89640 22864 -8152 -5583 33744 37567 171517 171784 64310 -11090 -3626 -47195
14871 -47195 -54109 -73420 -27854 100864 154135 33787 52383 186377 116025 46460 12814
14860 12814 -20065 50750 155367 146222 139149 31072 32745 45076 21348 54655 -11751 -44729
14848 -44729 -32795 -71429 -65592 33070 -25292 -108331 -58716 -12636 -138986 -191007 -159736 -195107
$$ packed form
14928A08958k2364p3290q0424Q4643m5712q1684l1557N2275P1228L7656K9820
14917D9549j9898o3091N185q8149L1289Q5603J6876K1520p5796p4575p5701l7198
14905b24386P3437L4541M0880Q232m6152n7408j4891r0331M3796J70333K3917
14894c8032j6867j2347M5438R7327q3487p6846j01023l6987J33119Q9694j2445
14883a2456J02096o6776l1016K569L9327L823J33950K67j07474p5400P464m3569
14871d7195o914j9311M5566J28718N3271j20348J8596J33994p0352o9565l3646
14860A2814l2879P0815J04617r145p073j08077J673J2331k3728L3307o6406l2978
14848d4729J1934l8634N837R8662n8362q3039M9615M6080j26350n2021L1271l5371
$$ plain form
14836 -195107 -198625 -164532 -149572 -118662 -123809 -217321 -184866 -189989 -104922 -33953 -50426 -97612
14824 -97612 -129605 -104585 -80923 -91415 -129833 -160601 -159007 -121193 -57463 -51661 -58282 -191593
14812 -191593 -203271 -95794 -53142 -112527 -86216 23734 57899 -37870 -50693 -15079 18940
14801 18940 -5151 -89389 -186008 -136808 -101571 -87280 -68805 -20018 -9628 3994 -44072 -62737
14789 -62737 -107339 -129213 -138320 -101801 -66251 -2089 -23347 -22650 77672 57497 -125694 -152500
14777 -152500 67493 49817 -60090 -37157 -33710 -36322 -35271 -59794 -44581 -74889 -92465 -139027
14765 -139027 -125657 -141575 -130683 -110717 -178836 -246512 -227940 -274472 -137625 -82560 -111706
14754 -111706 -122649 -114645 -67600 -68940 -69811 9399 68724 69772 3807 -18270 26754 9701
$$ packed form
14836a95107l518L4093J4960L0910n147r3512L2455n123Q5067P0969j6473m7186
14824i7612l1993K5020K3662j0492l8418l0768J594L7814O3730N802o621j33311
14812a91593j1678J07477M2652n9385K6311J09950L4165r5769j2823L5614L4019
14801A8940k4091q4238r6619M9200L5237J4291J8475M8787J0390J3622m8066j8665
14789f2737m4602k1874r107L6519L5550O4162k1258O97J00322k0175j83191k6806
14777a52500K19993j7676j09907K2933L447k612J051k4523J5213l0308j7576m6562
14765a39027J3370j5918J0892J9966o8119o7676J8572m6532J36847N5065k9146
14754a11706j0943Q004M7045j340q71P9210N9325J048o5965k2077M5024j7053
$$ plain form
14742 9701 30141 16122 -60055 -147041 -120720 23972 178184 226678 168823 45254 -7165
14731 -7165 15916 48986 -108417 -132337 -91483 -186944 -168329 -143463 -66166 -25398 -82398 -2555
14719 -2555 -23732 -112239 -138310 -157874 -74843 -111894 -159501 -180135 -41701 38964 -72802
14708 -72802 -62275 2707 81612 55014 83600 3761 -61787 -10866 29338 57483 83968 78036
14696 78036 116883 157757 139779 144093 91746 47167 63300 150904 227539 201475 43036 -98305
14684 -98305 -115278 -147908 -86683 -11608 -143098 -107885 -85506 25627 99243 13495 -105264
14673 -105264 -30169 5094 -44877 -92871 -192211 -164970 -136721 -15624 78896 74198 49730
14662 49730 7253 -45760 -68390 8660 58239 8678 -35777 -113412 -58850 34477 64788 127379
$$ packed form
14742I701K0440j4019p6177q6986K6321J44692J54212M8494n7855j23569n2419
14731g165K3081L3070j57403k3920M0854r5461J8615K4866P7297M0768n7000P9843
14719b555k1177q8507k6071j9564Q3031l7051m7607k0634J38434Q0665j11766
14708g2802J0527O4982P8905k6598K8586p9839o5548N0921M0204K8145K6485n932
14696G8036L8847M0874j7978M314n2347m4579J6133Q7604P6635k6064j58439j41341
14684i8305j6973l2630O1225P5075j31490L5213K2379J11133P3616q5748j18759
14673a05264P5095L5263m9971m7994r9340K7241K8249J21097R4520m698k4468
14662D9730m2477n3013k2630P7050M9579m9561m4455p7635N4562R3327L0311O2591
$$ plain form
14650 127379 159693 66235 47659 102269 16157 -107701 -110776 -32047 58860 44067 135607
14639 135607 128235 104630 86629 42266 -24607 32170 51115 128748 144607 115301 65718 -66011
14627 -66011 -91428 -55652 47084 131829 182107 98237 -32206 -103010 -120649 -96570 -90355
14616 -90355 -34388 -36933 -51747 -86693 -67998 -53601 -35321 -46189 -52300 35761 10834 -85682
14604 -85682 -121646 -130476 -22939 23778 18683 41136 27918 -79729 -72786 17454 24834 -34130
14592 -34130 -4326 -91296 -217312 -140263 -140592 -119480 -95177 -16137 29507 39614 95716 71595
14580 71595 -44609 -79400 -126650 -200690 -150970 -68105 -78609 -122906 -164056 -194878 -112168
14569 -112168 -139045 -145806 3578 3588 7623 -34330 -34792 -18932 4754 -20966 -28676 -13435 -8095
$$ packed form
14650A27379L2314r3458j8576N4610q6112j23858l075P8729R0907j4793R1540
14639A35607p372k3605j8001m4363o6873N6777J8945P7633J5859k9306m9583j31729
14627f6011k5417L5776J02736Q4745N0278q3870j30443p0804j7639K4079O215
14616i0355N5967k545j4814l4946J8695J4397J8280j0868o111Q8061k4927r6516
14604h5682l5964q830J07537M6717n095K2453j3218j07647O943R0240P380n8964
14592c4130K9804q6970j26016P7049l29K1112K4303P9040M5644J0107N6102k4121
14580G1595j16204l4791m7250p4040M9720Q2865j0504m4297m1150l0822Q2710
14569a12168k6877o761J49384J0M035m1953m62J5860K3686k5720p710J5241N340
$$ plain form
14556 -8095 99929 124898 132381 -29192 -233832 -250525 -109277 -30260 -19961 30463 -12050
14545 -12050 -50048 19840 47443 72091 31388 22992 -52535 -29688 -77236 25331 146356
14534 146356 222994 145061 158439 276398 268185 205748 115372 127509 59045 36417 46759
14523 46759 158656 217300 267570 139046 30625 12553 -71183 -154972 -136421 -129217 -41295
14512 -41295 -54582 -184640 -198527 -156363 -140663 -125812 -30029 -34793 -117700 -124966 -122914 -18276
14500 -18276 150280 124575 81828 53227 -26261 -24206 -41460 -135706 -166571 -111019 -72057 -20947
14488 -20947 -3472 -8781 120089 119453 53910 105241 60721 -72668 -144770 -124325 -79846 35379
14476 35379 33852 -86781 -62222 10244 123484 185120 92085 -45781 37214 103958 51114
$$ packed form
14556h095J08024K4969P483j61573k04640j6693J41248P9017J0299N0424m2513
14545a2050l7998O9888K7603K4648m0703q396p5527K2847m7548J02567J21025
14534A46356P6638p7933J3378J17959q213o2437r0376J2137o8464k2628J0342
14523D6759J11897N8644N0270j28524j08421j8072q3736q3789J8551P204Q7922
14512d1295j3287j30058j3887M2164J5700J4851R5783m764q2907p266K052J04638
14500a8276J68556k5705m2747k8601p9488K055j7254r4246l0865N5552L8962N1110
14488b0947J7475n309J28870o36o5543N1331m4520j33389p2102K0445M4479J15225
14476C5379j527j20633K4559P2466J13240O1636r3035j37866Q2995O6744n2844
$$ plain form
14465 51114 21115 -73925 -55899 -117392 -75096 -60246 -83051 -23201 -66458 -16372 -11698 9314
14453 9314 -50859 -43211 -22920 -92391 -14285 37494 41555 27403 5797 12873 -19576 -69395
14441 -69395 -111563 -56088 71172 10231 41876 52510 -24459 -48627 30092 -20616 -59696
14430 -59696 44563 102478 150698 90953 -59437 -171392 -67316 -15784 21201 -34855 -58092
14419 -58092 -125922 -223356 -217590 -168027 -53511 46167 -26896 -28519 49519 59147 82358 70326
14407 70326 31549 26280 -104001 -133353 -75505 48600 65702 89794 146498 185543 138829
14396 138829 26508 -64502 -20830 694 -27565 58756 147125 121953 9551 -7664 3985
14385 3985 71604 -12560 30170 67875 1401 52872 154380 139703 78348 -10108 -127345
$$ packed form
14465E1114k9999r5040J8026o1493M2296J4850k2805N9850m3257N0086M674K1012
14453I314o0173P648K0291o9471P8106N1779M061j4152k1606P076l2449m9819
14441f9395m2168N5475J27260o0941L1645J0634p6969k4168P8719n0708l9080
14430e9696J04259N7915M8220n9745j50390j11955J04076N1532L6985n6056k3237
14419e8092o7830r7434N766M9563J14516R9678p3063j623P8038R628K3211j2032
14407G0326l8777n269j30281k9352N7848J24105J7102K4092N6704L9045m6714
14396A38829j12321r1010M3672K1524k8259Q6321Q8369k5172j12402j7215J1649
14385C985O7619q4164M2730L7705o6474N1471J01508j4677o1355q8456j17237
$$ plain form
14374 -127345 -116069 -51424 13907 97424 80671 -14531 -65260 -185262 -126601 -68708 -57503
14363 -57503 -107379 -107145 -36526 -28959 31527 19319 2915 -19867 -4697 57460 161594 126622
14351 126622 126985 57882 58386 -41511 -84395 -134910 -61855 -7113 -71347 -146299 -91891 -19201
14339 -19201 -114840 -154626 -127039 -125214 -34937 75822 83329 105277 75597 65607 29632 91128
14327 91128 142355 88340 45381 -23046 22587 63179 70196 107561 57283 84366 85646 105490
14315 105490 145122 208444 150919 -47712 -107717 -134053 -157021 -83223 -4877 -31921 78501
14304 78501 122078 110525 26385 -55155 91992 95517 94074 27247 -90260 -145263 -64938 -14628
14292 -14628 63763 188692 290583 245923 87041 -97974 14287 30836 46139 74022 75205
$$ packed form
14374a27345J1276O4645O5331Q3517j6753r5202n0729j20002N8661N7893J1205
14363e7503m9876K34P0619P567O0486j2208j6404k2782J5170O2157J04134l4972
14351A26622L63o9103N04r9897m2884n0515P3055N4742o4234p4952N4408P2690
14339a9201r5639l9786K7587J825R0277J10759P507K1948k9680r990l5975O1496
14327I1128N1227n4015m2959o8427M5633M0592P017L7365n0278K7083J280J9844
14315A05490L9632O3322n7525j98631o0005k6336k2968P3798P8346k7044J10422
14304G8501M3577j1553q4140q1540J47147L525j443o6827j17507n5003Q0325N0310
14292a4628P8391J24929J01891m4660j58882j85015J12261J6549J5303K7883J183
$$ plain form
14281 75205 107949 101414 17865 -46505 -106913 -50163 24757 86045 49241 -26663 -52026 23083
14269 23083 -57695 -68573 -41965 -12404 8126 -46602 -20130 100283 68490 27371 15761
14258 15761 -24016 -73255 -77018 -18238 8992 60410 92490 109464 166978 -36806 -93039 -73974
14246 -73974 -107625 26108 71398 58394 73438 76725 95643 121606 122205 109904 144784 49576
14234 49576 -18073 -56969 -134571 -190995 -102532 -5490 -43270 52208 62168 60536 -1832 -42522
14222 -42522 -67332 -21169 38787 -41911 -135213 -145030 -104196 -150486 -155122 -91857 -126110 -53775
14210 -53775 -6421 -28015 -101888 -79445 11474 -111869 -143445 -43874 1011 42083 7000
14199 7000 -331 -2131 -65275 -67115 -44452 -63919 -121501 -158374 -125953 -104386 -29439 -64837
$$ packed form
14281G5205L2744o535q3549o4370o0408N6750P4920O1288l6804p5904k5363P5109
14269B3083q0778j0878K6608K9561K0530n4728K6472J20413l1793m1119j1610
14258A5761l9777m9239l763N8780K7230N1418L2080J6974N7514k03784n6233J9065
14246g3974l3651J33733M5290j3004J5044L287J8918K5963N99j2301L4880r5208
14234D9576o7649l8896p7602n6424Q8463R7042l7780R5478R960j632o2368m0690
14222d2522k4810M6163N9956q0698r3302r817M0834m6290m636O3265l4253P2335
14210e3775M7354k1594p3873K2443R0919j23343l1576R9571M4885M1072l5083
14199G000p331j800o3144j840K2663j9467n7582l6873L2421K1567P4947l5398
$$ plain form
14187 -64837 -104739 -111877 -156541 -201492 -122531 -30409 -40285 -97044 -140374 -115080 43994 38561
14175 38561 -86243 -165400 -164937 -124225 -6462 32260 11585 -11204 59401 110919 203634 225385
14163 225385 186405 148702 47011 -64242 -98308 -13527 38085 17841 31678 -60744 36310
14152 36310 28567 34721 125680 47080 46668 89750 123872 -15880 3729 73555 152759 134659
14140 134659 41921 65962 85848 142815 165903 110375 67197 8388 -82787 -159271 -172234
14129 -172234 -111210 -153548 -118854 -40551 -86349 -269 14145 10052 18543 63700 135906 50989
14117 50989 -102566 -102908 53210 146713 40602 -35516 -97247 -104875 -114542 48115 139035 101764
14105 101764 17162 -25750 -14398 19457 110789 85449 32257 35892 71587 140406 31675
$$ packed form
14187f4837l9902p138m4664m4951P8961R2122r876n6759m3330K5294J59074n433
14175C8561j24804p9157M63M0712J17763L8722k0675k2789P0605N1518R2715K1751
14163B25385l8980l7703j01691j11253l4066Q4781N1612k0244J3837r2422R7054
14152C6310p743O154R0959p8600m12M3082L4122j39752J9609O9826P9204j8100
14140A34659r2738K4041J9886N6967K3088n5528m3178n8809r1175p6484j2963
14129a72234O1024m2338L4694P8303m5798Q6080J4414m093Q491M5157P2206q4917
14117E0989j53555l42J56118R3503j06111p6118o1731p628r667J62657R0920l7271
14105A01764q4602m2912J1352L3855R1332k5340n3192L635L5695O8819j08731
$$ plain form
14094 31675 -47069 -67698 20145 4611 17025 120331 145065 94729 161289 230060 160975
14083 160975 148158 111660 143512 81443 46776 66261 39152 61433 163826 213539 278880
14072 278880 108374 3873 -82402 76439 187128 92988 -32991 14638 76410 101853
14062 101853 84957 -13825 62360 27286 -65230 8412 13251 -46726 -29335 48428 76576 14685
14050 14685 10099 26274 17774 -37196 -2667 -19800 -107143 -128263 -105295 -131354 -111037 67161
14038 67161 96577 -3225 2299 65057 48238 106219 99076 30084 67040 30921 36049 -10932
14026 -10932 -100720 -107690 -96190 -96464 -92542 20088 101094 120270 -27651 -32299 100637 131445
14014 131445 95732 59370 8626 33758 35645 -109912 -85467 96745 88420 31177 24985 99322
$$ packed form
14094C1675p8744k0629Q7843j5534J2414J03306K4734n0336O6560O8771o9085
14083A60975j2817l6498L1852o2069l4667J9485k7109K2281J02393M9713O5341
14072B78880j70506j04501q6275J58841J10689r4140j25979M7629O1772K5443
14062A01853j6896r8782P6185l5074r2516P3642M839n9977J7391P7763K8148o1891
14050A4685m586J6175q500n4970L4529j7133q7343k1120K2968k6059K0317J78198
14038F7161K9416r9802N524O2758j6819N7981p143o8992L6956l6119N128m6981
14026a0932q9788o970J1500k74L922J12630Q1006J9176j47921m648J32936L0808
14014A31445l5713l6362n0744K5132J887j45557K4445J82212q325n7243o192P4337
$$ plain form
14002 99322 75404 93083 27428 -17918 -17374 -63127 -34591 20942 -104884 -103120 -39396 -48904
13990 -48904 -66206 -44918 -50 -68615 -66299 16395 49738 32956 5401 3423 110803 145228
13978 145228 111660 47683 5396 -22782 -54091 -22533 107719 164451 201147 183396 152973
13967 152973 109895 82569 -50942 -141853 -78656 -125723 -48972 -1326 -72782 7231 64768
13956 64768 95928 76524 89143 103547 121407 188340 217544 119188 84357 56803 9626 54313
13944 54313 50957 -58109 -10763 92164 163352 259292 228721 88787 -46638 -39307 -99925
13933 -99925 -104004 -122815 -110785 -122504 -175986 -123867 -109344 -31827 -8039 -9087 -31903 -6956
13921 -6956 -66904 -139787 -225587 -159903 -33894 71 -21864 -6922 75435 75716 69249 77995
$$ packed form
14002I9322k3918J7679o5655m5346N44m5753K8536N5533j25826J764O3724r508
13990d8904j7302K1288M4868o8565K316Q2694L3343j6782k7555j978J07380L4425
13978A45228l3568o3977m2287k8178l1309L1558J30252N6732L6696j7751l0423
13967A52973m3078k7326j33511r0911O3197m7067P6751M7646p1456Q0013N7537
13956F4768L1160j9404J2619J4404J7860O6933K9204r8356l4831k7554m7177M4687
13944E4313l356j09066M7346J02927P1188R5940l0571j39934j35425P331o0618
13933i9925m079j8811J2030j1719n3482N2119J4523P7517K3788j048k2816K4947
13921f956n9948p2883q5800O5684J26009L3965k1935J4942Q2357K81o467Q746
$$ plain form
13909 77995 85763 62326 -7302 12522 36748 -54011 -205743 -290104 -289673 -196253 -94292 41116
13897 41116 60952 297 -45175 -172718 -155131 -29946 39996 -14136 -114736 -81763 -33559
13886 -33559 -7841 28525 21190 -31072 -93721 -120307 -49089 -16639 73587 137122 111617 96763
13874 96763 63128 -7290 121926 225117 181653 60380 41594 -6857 -120412 -207557 -186504
13863 -186504 -71270 46969 66283 21563 40559 27674 -50057 12341 49971 -19732 -17104
13852 -17104 112789 67451 36005 86161 74837 103739 122972 52431 2144 -32078 -85707
13841 -85707 -149400 -76138 -44935 -11209 -69860 -100764 -62605 -21253 -47239 -157216 -187421
13830 -187421 -196112 -155712 -112479 -135860 -144225 18966 112697 199402 116940 2002 11039 74433
$$ packed form
13909G7995P768k3437o9628J9824K4226r0759j51732q4361M31R3420J01961J35408
13897D1116J9836o0655m5472j27543J7587J25185O9942n4132j00600L2973M8204
13886c3559K5718L6366p335n2262o2649k6586P1218L2450R0226O3535k5505j4854
13874I6763l3635p0418J29216J03191m3464j21273j8786m8451j13555q7145K1053
13863a86504J15234J18239J9314m4720J8996j2885p7731O2398L7630o9703K628
13852a7104J29893m5338l1446N0156j1324K8902J9233p0541n0287l4222n3629
13841h5707o3693P3262L1203L3726n8651l0904L8159M1352k5986j09977l0205
13830a87421q691M0400M3233k3381q365J63191R3731Q6705q2462j14938R037O3394
$$ plain form
13818 74433 155373 183300 178698 138137 202204 193431 153393 213097 159684 108576 173032 88225
13806 88225 -28323 -53153 -14741 27588 39585 -8513 -23287 -39336 75170 145778 136234
13795 136234 105478 123913 94146 153787 97892 -56285 -88695 661 -60660 -103867 -55891
13784 -55891 -44904 -76366 22407 -9217 -42257 -110700 14195 10264 -65221 -25521 -6088 663
13772 663 54543 21457 -33005 -18361 -10847 33263 47343 -16181 25060 8140 -28962 9082
13760 9082 131114 93017 -53558 -62409 -11760 94767 143121 170676 179004 153381 132802 177664
13748 177664 146352 140395 81211 48019 17610 5681 -67024 -161070 -168120 -86226 -81818 -156726
13736 -156726 -70654 -60769 -65231 -5319 -46108 -32472 65840 30481 -83137 -149708 -101580 25577
$$ packed form
13818G4433Q0940K7927m602m0561O4067q773m0038N9704n3413n1108O4456q4807
13806H8225j16548k4830L8412M2329J1997m8098j4774j6049J14506P0608r544
13795A36234l0756J8435k9767N9641n5895j54177l2410Q9356o1321m3207M7976
13784e5891J0987l1462R8773l1624l3040o8443J24895l931p5485L9700J9433O751
13772F63N3880l3086n4462J4644P514M4110J4080o3524M1241j6920l7102L8044
13760I082J22032l8097j46575q851N0649J06527M8354K7555Q328k5623k0579M4862
13748A77664l1312n957n9184l3192l0409j1929p2705r4046p050Q1894M408p4908
13736a56726Q6072R885m462N9912m0789J3636R8312l5359j13618o6571M8128J27157
$$ plain form
13724 25577 135683 131917 61474 14492 -34852 -72944 44729 97295 112727 27264 33175 139311
13712 139311 186753 170446 208153 148595 128429 64953 33244 55367 23705 -78147 -117375
13701 -117375 -4456 196815 212551 154975 14094 -36467 -90041 -63915 55302 157128
13691 157128 133384 98844 13130 39320 184932 119636 -10222 40731 150194 123476 80255
13680 80255 -48719 -53002 -57663 -108524 -58303 18059 112734 49384 -53048 -41225 48139 144124
13668 144124 115500 116114 74919 -7479 14648 101342 68333 -6166 -17956 16630 66716 120500
13656 120500 205717 279116 255291 186604 100084 82062 66302 209745 312315 206144 86464
13645 86464 150912 168902 163217 201999 263906 194231 114794 108980 94099 143734 224238 173885
$$ packed form
13724B5577J10106l766p0443m6982m9344l8092J17673N2566J5432q5463N911J06136
13712A39311M7442j6307L7707n9558k0166o3476l1709K2123l1662j01852l9228
13701a17375J12919K01271J5736n7576j40881n0561n3574K6126J19217J01826
13691A57128k3744l4540q5714K6190J45612o5296j29858N0953J09463k6718m3221
13680H0255j28974m283m661n0861N0221P6362R4675o3350j02432J1823Q9364R5985
13668A44124k8624O14m1195q2398K2127Q6694l3009p4499j1790L4586N0086N3784
13656A20500Q5217P3399k3825o8687q6520j8022j5760J43443J02570j06171j19680
13645H6464O4448J7990n685L8782O1907o9675p9437n814j4881M9635Q0504n0353
$$ plain form
13633 173885 109136 93748 -74337 -85918 -88765 -104353 -76564 -58035 -120955 -147605 28048
13622 28048 28933 63693 119219 146985 234697 115937 -10697 -69312 -19429 -1953 -52278 -91774
13610 -91774 -46325 -95771 -139085 -187509 -181977 -99565 -126266 -41999 119890 91817 -99935
13599 -99935 -129972 -27081 32928 52310 62061 75581 47127 61141 68916 39978 39326 35926
13587 35926 165152 216234 150791 103731 63874 51012 36416 -24178 -3323 55681 -44388
13576 -44388 568 76134 104561 84520 129399 140648 182274 60833 -23660 4443 100031
13565 100031 105517 93732 61625 32286 110926 109018 81420 42973 10966 -78570 24872 68341
13553 68341 131865 148526 224620 199874 134087 118697 59176 36574 107361 104275 -11754 -128241
$$ packed form
13633A73885o4749j5388j68085j1581k847j5588K7789J8529o2920k6650J75653
13622B8048Q85L4760N5526K7766Q7712j18760j26634n8615M9883J7476n0325l9496
13610i1774M5449m9446m3314m8424N532Q2412k6701Q4267J61889k8073j91752
13599i9935l0037J02891O0009J9382R751J3520k8454J4014P775k8938o52l400
13587C5926J29226N1082o5443m7060l9857j2862j4596o0594K0855N9004j00069
13576d4388M4956P5566K8427k0041M4879J1249M1626j21441q4493K8103R5588
13565A00031N486j1785l2107k9339P8640j908k7598l8447l2007q9536J03442M3469
13553F8341O3524J6661P6094k4746o5787j5390n9521k2602P0787l086j16029j16487
$$ plain form
13541 -128241 -150719 -73224 -137213 -201798 -145781 -137277 -42333 74806 48917 30801 2565
13530 2565 60193 104291 162141 235042 276470 237352 189637 165603 51370 -33237 -79995 -26977
13518 -26977 -59026 -127804 -76695 -49827 -59066 -59832 -59991 -92549 -23287 77079 57823 -114326
13506 -114326 -40789 11935 61015 45516 -10072 -22951 15359 -178 15086 27522 -9582
13495 -9582 94580 94891 220151 324121 277991 214895 123813 82138 142342 89238 21486 46771
13483 46771 154170 93234 64297 27871 44282 48690 64200 66260 4208 -58938 -24966 39121
13471 39121 48578 -5763 -89254 -35679 89075 97854 130574 97551 215225 134390 -76803
13460 -76803 -158844 -212793 -224309 -184351 -189111 -245075 -161260 -124817 -141181 -61082 25250 -16957
$$ packed form
13541a28241k2478P7495o3989o4585N6017Q504R4944J17139k5889j8116k8236
13530B565N7628M4098N7850P2901M1428l9118m7715k4034j14233q4607m6758N3018
13518b6977l2049o8778N1109K6868r239p66j59l2558O9262J00366j9256j72149
13506a14326P3537N2724M9080j5499n5588j2879L8310j5537J5264J2436l7104
13495i582J04162L11J25260J03970m6130o3096r1082m1675O0204n3104o7752K5285
13483D6771J07399o0936k8937l6426J6411M408J5510K060o2052o3146L3972O4087
13471C9121R457n4341q3491N3575J24754Q779L2720l3023J17674q0835k11193
13460g6803q2041n3949j1516L9958m760n5964Q3815L6443j6364Q0099Q6332m2207
$$ plain form
13448 -16957 -23453 82412 33467 61153 65886 75156 146842 86342 13403 58412 88514 -23125
13436 -23125 -61830 42766 112512 62931 136417 234283 204506 172954 191803 66474 -78691
13425 -78691 -56951 -62145 -49222 -16459 20088 80423 136431 151818 186283 187586 155444 81968
13413 81968 129186 220647 175611 128158 98501 106802 -14217 8538 54349 11218 -51221 -51965
13401 -51965 -116844 13393 110626 76898 34327 -61409 -14351 4294 54693 106214 115763 194424
13389 194424 153882 71654 139809 114922 89307 92273 27596 -23750 -4181 2374 51158 45215
13377 45215 41930 48274 89173 81519 75014 131891 217137 164341 135817 114839 169074 221312
13365 221312 120065 38377 97968 214333 286162 261382 304510 248267 203538 184452 135438
$$ packed form
13448a6957o496J05865m8945K7686M733R270P1686o0500p2939M5009L0102j11639
13436b3125l8705J04596O9746m9581P3486R7866k9777l1552J8849j25329j45165
13425g8691K1740n194J2923L2763L6547O0335N6008J5387L4465J303l2142p3476
13413H1968M7218R1461m5036m7453k9657Q301j21019K2755M5811m3131o2439p44
13401e1965o4879J30237R7233l3728m2571r5736M7058J8645N0399N1521R549P8661
13389A94424m0542q2228O8155k4887k5615K966o4677n1346J9569O555M8784n943
13377D5215l285O344M0899p654o505N6877Q5246n2796k8524k0978N4235N2238
13365B21312j01247q1688N9591J16365P1829k4780M3128n6243m4729j9086m9014
$$ plain form
13354 135438 155734 92099 -4998 -83778 -40057 -58001 -51054 49569 231222 330363 356193
13343 356193 327021 203830 -20412 -141946 -28276 117347 221727 199926 159303 216219
13333 216219 209493 229967 231663 152064 154116 218981 183058 112074 168565 156144 110776 62649
13321 62649 77653 176111 192080 157340 177818 223070 194786 92456 79705 98871 76299
13310 76299 36626 23937 36129 17597 87201 119680 14936 -30770 60263 179659 296879
13299 296879 373818 283466 150937 161703 96439 59001 80704 89286 118518 154243 205122
13288 205122 116242 70325 56541 120055 242820 339482 334348 287606 279548 67656 -87782
13277 -87782 -68676 -21849 9825 90019 116044 19530 24093 152488 175198 176700 177533 76689
$$ packed form
13354A35438K0296o3635r7097p8780M3721j7944O947J00623J81653R9141K5830
13343C56193k9172j23191k24242j21534J13670J45623J04380k1801m0623N6916
13333B16219o726K0474J696p9599K052O4865l5923p0984N6491j2421m5368m8127
13321F2649J5004R8458J5969l4740K0478M5252k8284j02330j2751J9166k2572
13310G6299l9673j2689J2192j8532O9604L2479j04744m5706R1033J19396J17220
13299B96879P6939r0352j32529J0766o5264l7438K1703Q582K9232L5725N0879
13288B05122q8880m5917j3784O3514J22765R6662n134m6742q058k11892j55438
13277h7782J9106M6827L1674Q0194K6025r6514M563J28395K2710J502Q33j00844
$$ plain form
13265 76689 76389 97326 122849 212025 170994 181550 235126 231113 140931 116211 59731 33326
13253 33326 91410 182296 104496 102700 27171 38001 249281 226247 150434 123379 158301 166144
13241 166144 133376 174818 207888 179874 194872 112574 96801 150687 190513 231335 206404
13230 206404 186303 295474 308400 273512 241692 221768 167844 162906 92986 66658 58373 151160
13218 151160 159554 128117 164263 251903 245455 220655 209953 215901 289236 185020 208560 297266
13206 297266 151848 93617 92517 133062 123414 133468 90791 120254 173940 164949 44567 1241
13194 1241 9538 46203 142376 220407 135195 162175 73520 64009 56221 26742 38466 -29337
13182 -29337 -37092 -51989 27625 144723 156953 85895 83130 128455 184693 232239 231395 191502
$$ packed form
13265G6689l00K0937K5523Q9176m1031J0556N3576m013r0182k4720n6480k6405
13253C3326N8084R0886p7800j796p5529J0830K11280k3034p5813k7055L4922P843
13241A66144l2768M1442L3070k8014J4998q2298j5773N3886L9826M0822k4931
13230B06404k0101J09171J2926l4888l1820j9924n3924m938o9920k6328q285R2787
13218A51160Q394l1437L6146Q7640o448k4800j0702N948P3335j04216K3540Q8706
13206B97266j45418n8231j100M0545r648J0054m2677K9463N3686q991j20382m3326
13194A241Q297L6665R6173P8031q5212K6980q8655r511p788k9479J1724o7803
13182b9337p755j4897P9614J17098J2230p1058k765M5325N6238M7546q44l9893
$$ plain form
13170 191502 235592 189762 244531 195074 72266 -11736 84190 187654 219468 140248 136463
13159 136463 109973 982 159612 346565 286161 183132 106607 196145 294750 349067 318857
13148 318857 325015 277271 234110 213428 264963 266452 286093 176786 55297 84659 64286
13137 64286 80986 43868 59937 139278 175734 174699 207553 215516 187443 147662 163307 103879
13125 103879 183927 204461 114052 198925 206540 103398 36442 126510 260787 281963 274422
13114 274422 289348 265107 203510 164089 222375 258605 246745 110275 80906 255384 327733
13103 327733 276503 214081 222728 188653 192471 239111 215144 144342 105521 59306 66109 15394
13091 15394 -5882 37500 169849 315427 267054 196403 1683 -7763 80858 180934 127306
$$ packed form
13170A91502M4090m5830N4769m9457j22808q4002R5926J03464L1814p9220l785
13159A36463k6490j08991J58630J86953o0404j03029p6525Q9538R8605N4317l0210
13148C18857O158m7744m3161k0682N1535J489J9641j09307j21489K9362k0373
13137F4286J6700l7118J6069P9341L6456j035L2854P963k8073l9781J5645n9428
13125A03879Q0048K0534r0409Q4873P615j03142o6956R0068J34277K1176p541
13114B74422J4926k4241o1597l9421N8286L6230j1860j36470k9369J74478P2349
13103C27733n1230o2422Q647l4075L818M6640k3967p0802l8821m6215O803n0715
13091A5394k1276M3382J32349J45578m8373p0651j94720r446Q8621J00076n3628
$$ plain form
13080 127306 93220 198449 199532 188540 180357 117386 113822 111848 135159 59328 38402 98395
13068 98395 187455 259131 259086 240790 167220 201495 229487 238959 260601 275881 146394 137437
13056 137437 303103 241346 163566 208897 231767 249586 300160 316983 326327 249807 212970
13045 212970 276274 257264 139570 228669 200378 228904 205081 272854 283456 157207 169561
13034 169561 191360 181394 182452 210404 229455 159239 127541 96944 130689 260781 320534 194279
13022 194279 164385 165285 214211 275827 254143 338767 442890 339760 290174 208901 124436
13011 124436 182371 287813 296910 274757 282586 251503 231922 280046 302748 259237 276177 253986
12999 253986 186255 180654 135001 129597 184581 249126 315571 312031 191402 114077 154500 132300
$$ packed form
13080A27306l4086J05229J083j0992q183o2971l564j974K3311p5831k0926N9993
13068I8395Q9060P1676m5j8296p3570L4275K7992R472K1642J5280j29487q957
13056A37437J65666o1757p7780M5331K2870J7819N0574J6823R344p6520l6837
13045B12970O3304j9010j17694Q9099k8291K8526k3823O7773J0602j26249J2354
13034A69561K1799r966J058K7952J9051p0216l1698l0597L3745J30092N9753j26255
13022A94279k9894R00M8926O1616k1684Q4624J04123j03130m9586q1273q4465
13011A24436N7935J05442R097k2153P829l1083j9581M8124K2702m3511J6940k2191
12999B53986o7731n601m5653n404N4984O4545O6445l540j20629p7325M0423k2200
$$ plain form
12987 132300 89636 87788 163227 201701 214066 304699 337362 216892 174470 197853 142355
12976 142355 174031 274159 427188 417212 381425 318992 281583 311193 279372 180893 153776
12965 153776 255071 289315 256905 200791 236806 362022 281538 171504 230189 292914 261554
12954 261554 248057 209644 118820 77548 180747 290714 217383 209248 227437 268149 362539
12943 362539 323772 264331 218739 223789 286503 307125 294349 278396 293458 323449 315371 253136
12931 253136 148340 107762 125827 130414 188476 166506 196997 231662 224655 218965 184223 295999
12919 295999 317397 244107 241477 206931 116812 161172 295956 377697 368054 310624 243678 246799
$$ packed form
12987A32300m2664j848P5439L8474J2365R0633L2663j20470m2422K3383n5498
12976A42355L1676J00128J53029r976l5787o2433l7409K9610l1821r8479k7117
12965A53776J01295L4244l2410n6114L6015J25216q0484j10034N8685O2725l1360
12954B61554j3497l8413r0824m1272J03199J09967p3331q135J8189M0712R4390
12943C62539l8767n9441m5592N050O2714K0622j2776j5953J5062K9991q078o2235
12931B53136j04796m0578J8065M587N8062k1970L0491L4665p007n690l4742J11776
12919B95999K1398p3290k630l4546r0119M4360J34784Q1741r643n7430o6946L121
$$ [...]
##END NTUPLES=NMR SPECTRUM
##END=
