##TITLE=Analysis number 312789
Compound Code cc 41846
Book Reference 414/108/5
Project Code adrs
Chemist Name mattw
##JCAMPDX= 6.0         $$ Bruker NMR JCAMP-DX V2.0
##DATA TYPE= NMR SPECTRUM
##DATA CLASS= NTUPLES
##ORIGIN= Bruker BioSpin GmbH
##OWNER= NMR
$$ XWIN-NMR		Version 3.5
$$ Fri Aug 12 15:19:38 2005 GMT Daylight Time (UT+1h)  MAYBRIDGE\NMR@NMR_250MHZ
##.OBSERVE FREQUENCY= 250.131544655141
##.OBSERVE NUCLEUS= ^1H
##.ACQUISITION MODE= SIMULTANEOUS (DQD)
##.ACQUISITION SCHEME= undefined
##.AVERAGES= 16
##.DIGITISER RES= 18
##SPECTROMETER/DATA SYSTEM= dpx250
##.PULSE SEQUENCE= zg30
##.SOLVENT NAME= CDCl3
##.SHIFT REFERENCE= (INTERNAL, CDCl3, 0, 16.4696)
##AUDIT TRAIL= $$ (NUMBER, WHEN, WHO, WHERE, WHAT)
$$ ##TITLE= Audit trail, XWIN-NMR		Version 3.5
$$ ##JCAMPDX= 5.01
$$ ##ORIGIN= Bruker BioSpin GmbH
$$ ##OWNER= NMR
$$ C:\u/data/dgb/nmr/ADRS/7870/pdata/1/auditp.txt
$$ ##AUDIT TRAIL=  $$ (NUMBER, WHEN, WHO, WHERE, WHAT)
(   1,<2005-08-12 15:19:19.37 +100>,<MAYBRIDGE\NMR>,<NMR_250MHZ>,
      <created by zg, POWCHK disabled, PULCHK disabled
       configuration hash MD5:
       62 19 C7 07 E1 42 D1 B7 37 6C 3D D0 77 39 F9 E6
       data hash MD5: 64K
       62 8E 89 0E 25 8E E7 73 14 F1 AD 4E AB 58 CA 4B>)
(   2,<2005-08-12 15:19:29.73 +100>,<MAYBRIDGE\NMR>,<NMR_250MHZ>,
      <Start of raw data processing
       ef LB = 0.3 FT_mod = 6 PKNL = 1 SI = 32K 
       data hash MD5: 32K
       6D 45 09 3C 74 EB 66 A5 88 37 A3 F4 72 B5 96 22>)
(   3,<2005-08-12 15:19:31.76 +100>,<MAYBRIDGE\NMR>,<NMR_250MHZ>,
      <apk 
       data hash MD5: 32K
       7E 51 5B 4E 51 8D 23 6B EC 4B 82 70 8E D0 AE 79>)
(   4,<2005-08-12 15:19:32.48 +100>,<MAYBRIDGE\NMR>,<NMR_250MHZ>,
      <abs ABSG = 5 
       data hash MD5: 32K
       D0 A0 FA 08 09 AE 5D 89 10 39 51 EE 63 59 09 9D>)
$$ ##END=
$$ 
$$ hash MD5
$$ 2B 66 17 E3 48 0A E3 44 D0 EF 09 3E D6 05 C8 40
##$RELAX= 
##$RELAX= 
##$RELAX= 
##$RELAX= 
##$RELAX= 
##$RELAX= 
##$RELAX= 
$$ Bruker specific parameters
$$ --------------------------
##$DU= <C:\u>
##$EXPNO= 7870
##$NAME= <ADRS>
##$PROCNO= 1
##$TYPE= <nmr>
##$USER= <dgb>
##$AMP= (0..31)
100 100 100 100 100 100 100 100 100 100 100 100 100 100 100 100 100 100 
100 100 100 100 100 100 100 100 100 100 100 100 100 100 
##$AQSEQ= 0
##$AQ_mod= 3
##$AUNM= <au_zg>
##$AUTOPOS= <40 >
##$BF1= 250.13
##$BF2= 250.13
##$BF3= 250.13
##$BF4= 250.13
##$BF5= 500.13
##$BF6= 500.13
##$BF7= 500.13
##$BF8= 500.13
##$BYTORDA= 1
##$CFDGTYP= 0
##$CFRGTYP= 5
##$CHEMSTR= <none>
##$CNST= (0..31)
1 1 145 1 1 1 1 1 1 1 1 1 1 1 1 1 1 1 1 1 1 1 1 1 1 1 1 1 1 1 1 1 
##$CPDPRG= <>
##$CPDPRG1= <>
##$CPDPRG2= <>
##$CPDPRG3= <>
##$CPDPRG4= <mlev>
##$CPDPRG5= <mlev>
##$CPDPRG6= <mlev>
##$CPDPRG7= <mlev>
##$CPDPRG8= <mlev>
##$CPDPRGB= <>
##$CPDPRGT= <>
##$D= (0..31)
0 1 0 0 0 0 0 0 0 0.06 0 0 0 0 0 0 0.0002 0 0 0 0 0 0 0 0 0 0 0 0 0 0 
0 
##$DATE= 1123856358
##$DBL= (0..7)
120 120 120 120 120 120 120 120 
##$DBP= (0..7)
150 150 150 150 150 150 150 150 
##$DBP07= 0
##$DBPNAM0= <>
##$DBPNAM1= <>
$$ [...]
##$SUBNAM7= <"">
##$SUBNAM8= <"">
##$SUBNAM9= <"">
##$SW= 20.6930455092707
##$SWIBOX= (0..15)
0 0 3 0 0 0 0 0 0 0 0 0 0 0 0 0 
##$SW_h= 5175.983436853
##$TD= 65536
##$TD0= 1
##$TE= 295.16
##$TE2= 300
##$TE3= 300
##$TEG= 300
##$TL= (0..7)
0 120 120 120 120 120 120 120 
##$TP= (0..7)
150 150 150 150 150 150 150 150 
##$TP07= 0
##$TPNAME0= <>
##$TPNAME1= <>
##$TPNAME2= <>
##$TPNAME3= <>
##$TPNAME4= <>
##$TPNAME5= <>
##$TPNAME6= <>
##$TPNAME7= <>
##$TPOAL= (0..7)
0.5 0.5 0.5 0.5 0.5 0.5 0.5 0.5 
##$TPOFFS= (0..7)
0 0 0 0 0 0 0 0 
##$TUNHIN= 0
##$TUNHOUT= 0
##$TUNXOUT= 0
##$USERA1= <user>
##$USERA2= <user>
##$USERA3= <user>
##$USERA4= <user>
##$USERA5= <user>
##$V9= 5
##$VALIST= <valist>
##$VCLIST= <CCCCCCCCCCCCCCC>
##$VD= 0
##$VDLIST= <DDDDDDDDDDDDDDD>
##$VPLIST= <PPPPPPPPPPPPPPP>
##$VTLIST= <TTTTTTTTTTTTTTT>
##$WBST= 1024
##$WBSW= 4
##$XGAIN= (0..3)
0 0 0 0 
##$XL= 0
##$YL= 0
##$YMAX_a= 377555
##$YMIN_a= -492929
##$ZGOPTNS= <>
##$ZL1= 120
##$ZL2= 120
##$ZL3= 120
##$ZL4= 120
##$ABSF1= 16.46961
##$ABSF2= -4.223562
##$ABSG= 5
##$ABSL= 3
##$ALPHA= 0
##$AQORDER= 0
##$ASSFAC= 0
##$ASSFACI= 0
##$ASSFACX= 0
##$ASSWID= 0
##$AUNMP= <proc_1d>
##$AZFE= 0.1
##$AZFW= 0.1
##$BCFW= 0
##$BC_mod= 0
##$BYTORDP= 0
##$COROFFS= 0
##$CY= 12.5
##$DATMOD= 1
##$DC= 0
##$DFILT= <>
##$DTYPP= 0
##$F1P= 14.0000005364418
##$F2P= -0.99999901652339
##$FCOR= 0.5
##$FTSIZE= 32768
##$FT_mod= 6
##$GAMMA= 0
##$GB= 0
##$INTBC= 1
##$INTSCL= 1
##$ISEN= 128
##$LB= 0.3
##$LEV0= 0
##$LPBIN= 0
##$MAXI= 10000
##$MC2= 0
##$MEAN= 0
##$ME_mod= 0
##$MI= 0
##$NCOEF= 0
##$NC_proc= -3
##$NLEV= 6
##$NOISF1= 0
##$NOISF2= 0
##$NSP= 0
##$NTH_PI= 0
##$NZP= 0
##$OFFSET= 16.46961
##$PC= 1
##$PHC0= 125.484
##$PHC1= 7.258676
##$PH_mod= 1
##$PKNL= yes
##$PPARMOD= 0
##$PSCAL= 4
##$PSIGN= 0
##$REVERSE= no
##$SF= 250.130013101956
##$SI= 32768
##$SIGF1= 0
##$SIGF2= 0
##$SINO= 400
##$SIOLD= 32768
##$SREGLST= <1H.CDCl3>
##$SSB= 0
##$STSI= 32768
##$STSR= 0
##$SW_p= 5175.98343685301
##$SYMM= 0
##$S_DEV= 0
##$TDeff= 65536
##$TDoff= 0
##$TI= <Analysis number 999999
Compound Code 99
Book Reference 9
Project Code 9>
##$TILT= no
##$TM1= 0
##$TM2= 0
##$TOPLEV= 0
##$USERP1= <user>
##$USERP2= <user>
##$USERP3= <user>
##$USERP4= <user>
##$USERP5= <user>
##$WDW= 1
##$XDIM= 32768
##$YMAX_p= 363741109
##$YMIN_p= -29015
$$ End of Bruker specific parameters
$$ ---------------------------------
##NTUPLES= NMR SPECTRUM
##VAR_NAME=  FREQUENCY,     SPECTRUM/REAL,   SPECTRUM/IMAG
##SYMBOL=    X,             R,               I
##VAR_TYPE=  INDEPENDENT,   DEPENDENT,       DEPENDENT
##VAR_FORM=  AFFN,          ASDF,            ASDF
##VAR_DIM=   32768,         32768,           32768
##UNITS=     HZ,            ARBITRARY UNITS, ARBITRARY UNITS
##FACTOR=    0.157963299565203, 1,           1
##FIRST=     4119.54381867031, 0,            0
##LAST=      -1056.4396181827, 0,            0
##MIN=       -1056.4396181827, -29015,       0
##MAX=       4119.54381867031, 363741109,    0
$$ Real data points
##PAGE= N=1
##DATA TABLE= (X++(R..R)), XYDATA
$$ [...]
$$ plain form
16857 -3568 -3052 -1406 -1145 2286 3948 1176 -3097 -8989 -9695 -7827 -4673 -933 1993 267 -2238
16842 -2238 -1175 -884 -899 4674 5467 4480 5163 3597 3750 2372 590 674 -753 274 2465 479 1674
16825 1674 -293 -2173 -623 -4232 -5555 -6765 -7719 -6713 -7372 -8289 -5876 -4058 -5698 -7203 -7708 -8244
16809 -8244 -10378 -7254 -3895 -3671 -204 -620 -1837 -3467 -2715 -3272 -5184 -7470 -5113 -1766 -2329 -2144
16793 -2144 -2188 -2872 -825 1448 265 -1521 -3062 -3162 -7039 -8874 -5483 -4644 -6021 -6239 -11417 -10588
16777 -10588 -5357 -4363 -6493 -5370 -3237 -2107 -2319 -3598 -229 141 -798 -2218 -584 40 -1735 -2780
16761 -2780 -3536 -798 2661 1411 -153 296 268 -1055 -3513 -5629 -3749 -2295 -2853 -4388 -4986 -4514
16745 -4514 -6563 -7722 -5573 -1717 -487 -1778 -3918 -5648 -4999 -2139 -2505 -1035 -322 674 -1292 -912
$$ packed form
16857c568N16J646K61L431J662k772m273n892p06J868L154L740K926j726k505
16842b238J063K91j5N573P93r87O83j566J53j378j782Q4j427J027K191j986J195
16825A674j967j880J550l609j323j210r54J006o59r17K413J818j640j505n05n36
16809h244k134L124L359K24L467m16j217j630P52n57j912k286K357L347n63J85
16793b144m4o84K047K273j183j786j541j00l877j835L391Q39j377k18n178Q29
16777a0588N231R94k130J123K133J130k12j279L369L70r39j420J634O24j775j045
16761b780p56K738L459j250j564M49k8j323k458k116J880J454n58j535n98M72
16745d514k049j159K149L856J230j291k140j730O49K860l66J470P13R96j966L80
$$ plain form
16729 -912 180 -1402 -4645 -4402 -4100 -262 1153 -321 -1055 -2128 -3732 -2770 1847 4694 2092 -1261
16713 -1261 -3656 -5687 -7866 -6577 -4963 -7021 -7506 -4410 -2122 331 -1722 -4714 -6069 -9003 -9159
16698 -9159 -11080 -10726 -7902 -8326 -9229 -6576 -5256 -9159 -12588 -10250 -8871 -6312 -4272 -5668 -8570
16683 -8570 -6996 -5495 -3124 -2621 -2608 -1521 -1722 -4893 -9231 -10816 -8432 -8407 -7504 -5268 -2805 -6345
16667 -6345 -9162 -8613 -8960 -10015 -9134 -5542 -5238 -5743 -7935 -8783 -9355 -5272 -1461 -2697 -4112 -4962 -8580
16650 -8580 -9972 -10627 -5163 -2157 -7205 -10262 -9159 -10320 -12266 -11236 -8998 -5967 -5787 -9351 -10533
16635 -10533 -10747 -10369 -8259 -6010 -6156 -5292 -7760 -8735 -7834 -6886 -8376 -6651 -4362 -6026 -7959 -10171
16619 -10171 -11386 -9506 -7121 -6885 -8631 -12920 -14016 -15714 -18908 -15971 -13436 -12623 -11357 -11472 -7944
$$ packed form
16729i12J092j582l243K43L02L838J415j474p34j073j604R62M617K847k602l353
16713a261k395k031k179J289J614k058m85L096K288K453k053k992j355k934j56
16698i159j921L54K824m24r03K653J320l903l429K338J379K559K040j396k902
16683h570J574J501K371N03J3J087k01l171m338j585K384K5R03K236K463l540
16667f345k817N49l47j055Q81L592L04n05k192q48n72M083L811j236j415q50l618
16650h580j392o55N464L006n048l057J103j161j946J030K238L031J80l564j182
16635a0533k14L78K110K249j46Q64k468r75R01R48j490J725K289j664j933k212
16619a0171j215J880K385K36j746m289j096j698l194K937K535Q13J266j15L528
$$ plain form
16604 -7944 -8061 -10214 -9972 -10208 -12249 -11970 -9872 -9927 -8227 -8502 -10318 -12749 -13889 -13595 -9590 -10399 -12569
16587 -12569 -10993 -13370 -11142 -10667 -10712 -11468 -15114 -17097 -17065 -16788 -13138 -13203 -11816 -8064 -10054 -12185 -12751
16570 -12751 -11780 -11804 -16806 -14110 -7485 -6434 -7885 -9139 -9268 -7335 -7777 -8955 -10102 -12515 -14997 -14910
16554 -14910 -12520 -15593 -16989 -17166 -18567 -17158 -13238 -10843 -10613 -9988 -11232 -12839 -14795 -17938 -14848
16539 -14848 -14522 -14576 -14893 -15461 -16308 -17890 -15120 -14112 -16279 -18316 -16933 -19766 -19842 -18545 -16832 -18296
16523 -18296 -17443 -13189 -11631 -11440 -12363 -12917 -12304 -12682 -11441 -10950 -10181 -12090 -14385 -13843 -11080 -14938 -17495
16506 -17495 -15139 -14079 -15108 -11967 -10881 -12690 -13540 -13397 -16012 -18387 -19131 -19513 -13340 -11554 -14228
16491 -14228 -13581 -12652 -10107 -9372 -14338 -16019 -15904 -17515 -16723 -17348 -16194 -12793 -11145 -15051 -19141 -19628
$$ packed form
16604g944j17k153K42k36k041K79K098n5J700k75j816k431j140K94M005q09k170
16587a2569J576k377K228M75m5p56l646j983L2K77L650o5J387L752j990k131n66
16570a2751R71k4n002K696O625J051j451j254j29J933m42j178j147k413k482Q7
16554a4910K390l073j396j77j401J409L920K395K30O25j244j607j956l143L090
16539a4848L26n4l17n68q47j582K770J008k167k037J383k833p6J297J713j464
16523a8296Q53M254J558J91r23n54O13l78J241M91P69j909k295N42K763l858k557
16506a7495K356J060j029L141J086j809q50J43k615k375p44l82O173J786k674
16491a4228O47R29K545P35m966j681J15j611P92o25J154L401J648l906m090m87
$$ plain form
16475 -19628 -18147 -18206 -18960 -18483 -13942 -12926 -16862 -18365 -19389 -15799 -13354 -14212 -18848 -20849 -20495 -17361
16459 -17361 -13174 -16164 -17607 -18269 -19494 -19571 -17896 -14753 -15443 -15921 -16827 -18307 -17794 -20348 -17270 -15531
16443 -15531 -16583 -16968 -16967 -16710 -16249 -15448 -15330 -19355 -19559 -18863 -17317 -16412 -18716 -18530 -15770 -13862 -12863 -9570
16425 -9570 -11405 -16402 -17972 -21201 -20523 -16851 -16436 -19119 -21524 -19723 -19877 -20490 -20519 -22199 -21702 -22019 -20743
16408 -20743 -19914 -19342 -18235 -15640 -19279 -18659 -16068 -13526 -14032 -14201 -12386 -12495 -12784 -12797 -7446 -3465 -1567
16391 -1567 -7506 -10736 -11109 -15698 -14695 -13721 -17227 -16931 -14093 -11656 -13148 -13207 -11273 -9751 -8155 -8356
16375 -8356 -11020 -14111 -15942 -13731 -8705 -6874 -9853 -10350 -7266 -8173 -9195 -8849 -11029 -8677 -15183
16360 -15183 -19034 -18906 -18286 -16342 -16051 -13911 -12409 -12836 -13043 -12245 -8962 -9034 -12032 -14447 -15583 -14137
$$ packed form
16475a9628J481n9p54M77M541J016l936j503j024L590K445q58m636k001L54L134
16459a7361M187k990j443o62j225p7J675L143o90m78r06j480N13k554L078J739
16443a5531j052l85JK57M61Q01J18m025k04O96J546R05k304J86K760J908R99L293
16425i570j835m997j570l229O78L672M15k683k405J801j54o13k9j680M97l17J276
16408b0743Q29N72J107K595l639O20K591K542n06j69J815j09k89j3N351L981J898
16391a567n939l230l73m589J003R74l506K96K838K437j492n9J934J522J596k01
16375h356k664l091j831K211N026J831k979m97L084r07j022L46k180K352o506
16360a5183l851J28O20J944K91K140J502m27k07P98L283p2k998k415j136J446
$$ plain form
16344 -14137 -11553 -10529 -8740 -10410 -12598 -12290 -13658 -12924 -15607 -14825 -12385 -12690 -13464 -17071 -17465 -14293
16328 -14293 -11289 -11738 -14326 -17433 -15880 -14424 -14922 -12809 -16639 -17349 -15091 -14569 -18996 -20255 -20395 -21759
16312 -21759 -20199 -17945 -16391 -16736 -16936 -14633 -12317 -13321 -13505 -16955 -18091 -17588 -15563 -14573 -10071 -10446
16296 -10446 -10217 -10486 -9453 -9951 -12939 -16455 -16440 -18923 -21216 -20020 -17376 -14507 -14601 -13340 -14136 -17489
16280 -17489 -17499 -14977 -15778 -16570 -16095 -19517 -16033 -9708 -5872 -10147 -15673 -17635 -16670 -16383 -14036 -12755
16264 -12755 -16429 -17368 -13967 -13543 -13346 -14071 -13735 -12525 -12487 -14038 -12650 -13584 -16738 -18828 -18871 -18858 -14786
16247 -14786 -13121 -12066 -15774 -20619 -21940 -22284 -20495 -14064 -11715 -14398 -15938 -14165 -13943 -12437 -13594
16232 -13594 -15658 -19776 -17126 -16367 -14478 -11807 -12498 -11796 -13447 -14505 -13626 -14857 -14515 -12047 -13846 -17910
$$ packed form
16344a4137K584J024J789j670k188L08j368P34k683P82K440l05p74l607l94L172
16328a4293L004m49k588l107J553J456m98K113l830p10K258N22m427j259j40j364
16312b1759J560K254J554l45k00K303K316j004j84l450j136N03K025R90M502l75
16296a0446K29k69J033m98k988l516J5k483k293J196K644K869r4J261p96l353
16280a7489j0K522q01p92M75l422L484O325L836m275n526j962R65K87K347J281
16264a2755l674r39L401M24J97p25L36J210L8j551J388r34l154k090m3J3M072
16247a4786J665J055l708m845j321l44J789O431K349k683j540J773K22J506j157
16232a3594k064m118K650P59J889K671o91P02j651j058Q79j231L42K468j799m064
$$ plain form
16216 -17910 -18807 -16929 -15769 -17430 -18475 -17752 -16079 -12269 -10793 -12628 -15205 -15379 -12863 -14239 -14664
16201 -14664 -16186 -17915 -17430 -15685 -11760 -10490 -11776 -13173 -14624 -17145 -18502 -18735 -18259 -14888 -13123
16186 -13123 -11632 -10006 -10790 -11810 -12031 -10594 -10919 -11572 -13339 -17644 -19827 -20727 -16590 -13546 -11398 -11425
16170 -11425 -10738 -9686 -13032 -15083 -14239 -14898 -16546 -14094 -14111 -14865 -15230 -15190 -13951 -16329 -18417 -17018 -13597
16153 -13597 -12487 -8912 -7956 -8525 -11565 -12030 -10717 -11422 -10847 -8996 -11546 -14097 -12872 -10560 -11581 -11624
16137 -11624 -10408 -7090 -9138 -14075 -16322 -15405 -14836 -14068 -11864 -9494 -10487 -11103 -12507 -13244 -13542 -12342
16121 -12342 -13627 -12121 -11096 -9238 -9114 -7640 -6351 -7365 -10452 -13178 -13965 -16184 -19028 -18612 -16571
16106 -16571 -12030 -13486 -13015 -13649 -18258 -18917 -17773 -17675 -16980 -13686 -14558 -16855 -20367 -18530 -16681 -15301
$$ packed form
16216a7910q97J878J160j661j045P23J673L810J476j835k577j74K516j376m25
16201a4664j522j729M85J745L925J270j286j397j451k521j357k33M76L371J765
16186a3123J491J626p84j020k21J437l25o53j767m305k183r00M137L044K148k7
16170a1425O87J052l346k051Q44o59j648K452j7p54l65M0J239k378k088J399L421
16153a3597J110L575R56n69l040m65J313p05N75J851k550k551J225K312j021m3
16137a1624J216L318k048m937k247R17N69P68K204K370r93o16j404p37k98J200
16121a2342j285J506J025J858J24J474J289j014l087k726p87k219k844M16K041
16106a6571M541j456M71o34m609o59J144R8O95L294q72k297l512J837J849J380
$$ plain form
16090 -15301 -15848 -15911 -13257 -12966 -13897 -14312 -14183 -15506 -17569 -15235 -10557 -8964 -8860 -10190 -10312 -7109 -1076
16073 -1076 -294 -3286 -111 -2067 -3993 -7893 -10404 -12283 -13407 -13245 -12599 -12138 -10860 -6629 -7131 -11082
16057 -11082 -10655 -14670 -19380 -16535 -16626 -19011 -20667 -19485 -17999 -12384 -9878 -9486 -11236 -9256 -11600
16042 -11600 -13921 -14046 -14738 -10598 -9371 -10891 -12233 -11826 -13194 -14041 -14358 -14005 -13266 -12741 -11863 -8410 -9097
16025 -9097 -7894 -8493 -8882 -13030 -14340 -15537 -17182 -15746 -15418 -14925 -14777 -16296 -17097 -16455 -15724 -15528 -17581
16008 -17581 -18234 -18174 -17928 -14745 -13887 -14594 -15077 -13014 -13750 -15749 -15644 -14297 -15143 -18175 -17697 -15930 -14794
15991 -14794 -14269 -11571 -11241 -11802 -6417 -4224 -9038 -10370 -11862 -11054 -9287 -8695 -11506 -16299 -18202 -14473
15975 -14473 -10157 -9901 -12261 -12370 -13418 -13048 -10478 -10580 -12415 -14334 -14008 -11422 -8817 -9129 -12520 -12018
$$ packed form
16090a5301n47o3K654K91r31m15J29j323k063K334M678J593J04j330j22L203O033
16073a076P82k992L175j956j926l900k511j879j124J62O46M61J278M231n02l951
16057a1082M27m015m710K845r1k385j656J182J486N615K506L92j750J980k344
16042a1600k321j25o92M140J227j520j342M07j368q47l17L53P39N25Q78L453o87
16025i097J203n99l89m148j310j197j645J436L28M93J48j519q01O42P31J96k053
16008a7581o53O0K46L183Q58p07m83K063p36j999J05J347q46l032M78J767J136
15991a4794N25K698L30n61N385K193m814j332j492Q08J767N92k811m793j903L729
15975a4473M316K56k360j09j048L70K570j02j835j919L26K586K605l12l391N02
$$ plain form
15959 -12018 -12001 -15907 -15948 -13824 -12581 -13011 -9693 -8960 -13457 -14172 -13855 -13253 -13245 -8774 -11310 -10570 -10569 -11682
15941 -11682 -12469 -9549 -5714 -9143 -10818 -8645 -8782 -7755 -7256 -7286 -8589 -8658 -9373 -14278 -11446 -11077 -11447
15924 -11447 -10804 -12570 -15926 -14992 -14347 -14573 -13927 -9585 -11219 -13111 -13973 -14982 -11674 -13310 -17260 -17352
15908 -17352 -14723 -15772 -14819 -10834 -9400 -9166 -8899 -7734 -10601 -8010 -8784 -7458 -4758 -5732 -12176 -16072
15892 -16072 -16273 -14936 -11197 -10870 -9909 -9137 -7766 -9066 -10755 -8645 -6810 -6929 -10564 -15917 -17474 -13489
15876 -13489 -11892 -12869 -14808 -12584 -11645 -12257 -11455 -14123 -14236 -17766 -17924 -15053 -13240 -13026 -13761 -17674
15860 -17674 -16553 -14280 -8806 -11260 -11260 -12251 -13116 -11061 -9203 -11043 -11743 -12190 -11069 -9794 -11500 -13028
15844 -13028 -14151 -13618 -15372 -17015 -15634 -11323 -11570 -13036 -14075 -14678 -13356 -13164 -11537 -12283 -13404 -17750
$$ packed form
15959a2018J7l906m1K124J243m30L318P33m497p15L17O02QM471k536P40Jj113
15941a1682p87K920L835l429j675K173j37J027M99l0j303o9p15m905K832L69l70
15924a1447O43j766l356R34O45k26O46M342j634j892q62j009L308j636l950r2
15908a7352K629j049R53L985J434K34K67J165k867K591p74J326K700r74o444l896
15892a6072k01J337L739L27R61P72J371j300j689K110J835j19l635n353j557L985
15876a3489J597r77j939K224R39o12Q02k668j13l530j58K871J813K14p35l913
15860a7674J121K273N474k454%r91q65K055J858j840p00m47J121J275j706j528
15844a3028j123N33j754j643J381M311k47j466j039o03J322J92J627p46j121m346
$$ plain form
15828 -17750 -16583 -14018 -11872 -9368 -7487 -11231 -9588 -9929 -11952 -10141 -11656 -11155 -13414 -15618 -13237
15813 -13237 -15123 -15139 -16091 -12821 -11778 -11723 -10832 -9049 -10348 -11767 -14498 -15478 -15017 -16600 -17608 -16964 -16501
15796 -16501 -14544 -13611 -13279 -12009 -12223 -14747 -15421 -13009 -11432 -13058 -13685 -11597 -11155 -12597 -12939 -11412
15780 -11412 -12307 -14789 -16642 -16920 -16918 -13491 -12470 -12913 -9440 -9028 -8956 -5797 -7541 -11327 -9721 -10053 -16251
15763 -16251 -17930 -15355 -12375 -11248 -10108 -10350 -12429 -13590 -13985 -14211 -16479 -17396 -15348 -13713 -12065
15748 -12065 -10872 -9087 -12121 -10609 -10084 -14199 -14511 -14017 -12837 -11084 -11065 -7326 -5446 -7271 -9579 -8205
15732 -8205 -7172 -13662 -16751 -15164 -16337 -18276 -16648 -13667 -15817 -14983 -13352 -11134 -7951 -10445 -13504
15717 -13504 -11227 -12034 -12694 -11602 -11947 -15931 -14392 -11458 -12229 -10019 -12378 -14137 -18143 -15847 -12755
$$ packed form
15828a7750J167K565K146K504J881l744J643l41k023J811j515N01k259k204K381
15813a3237j886j6r52L270J043N5Q91J783j299j419k731r80M61j583j008O44M63
15796a6501J957R33L32J270k14k524o74K412J577j626o27K088M42j442l42J527
15780a1412q95k482j853k78KL427J021m43L473M12P2L159j744l786J606l32o198
15763a6251j679K575K980J127J140k42k079j161l95k26k268r17K048J635J648
15748a2065J193J785l034J512N25m115l12M94J180J753J9L739J880j825k308J374
15732h205J033o490l089J587j173j939J628K981k150Q34J631K218L183k494l059
15717a3504K277q07o60J092l45l984J539K934p71K210k359j759m006K296L092
$$ plain form
15702 -12755 -12557 -9699 -12692 -13312 -15282 -14601 -13312 -14050 -16793 -18355 -15373 -11724 -14747 -14848 -13960 -13967 -14639
15685 -14639 -12998 -14885 -12537 -13848 -14163 -12861 -12398 -10254 -7971 -9091 -8344 -8823 -7408 -9105 -8754 -7510
15669 -7510 -6058 -8142 -11048 -11769 -14050 -19023 -20570 -19292 -19225 -17756 -17191 -17753 -16222 -17673 -16728 -16206
15653 -16206 -15516 -12238 -14313 -16767 -21011 -22107 -20292 -14626 -11732 -14225 -16477 -13709 -10317 -8576 -8794
15638 -8794 -11056 -11462 -10339 -11688 -14493 -17222 -19678 -18300 -16839 -15683 -16008 -15735 -12202 -12967 -15944 -15632
15622 -15632 -10490 -9315 -11920 -14861 -15028 -14996 -8227 -4738 -6812 -10924 -14729 -12897 -9725 -9551 -10449 -10721
15606 -10721 -9152 -8200 -10181 -11905 -10067 -7939 -9636 -9222 -11074 -11878 -10569 -10463 -12188 -12854 -13707 -14162
15590 -14162 -13027 -12804 -8892 -7248 -9359 -11677 -10838 -11981 -12874 -9879 -7476 -8342 -10012 -12466 -13971
$$ packed form
15702a2755J98K858k993o20j970O81J289p38k743j562K982L649l023j01Q88po72
15685a4639J641j887K348j311l15J302M63K144K283j120P47m79J415j697L51J244
15669g510J452k084k906p21k281m973j547J278O7J469N65n62J531j451R45N22
15653a6206O90L278k075k454m244j096J815N666K894k493k252K768L392J741k18
15638h794k262m06J123j349k805k729k456J378J461J156l25K73L533p65k977L12
15622a5632N142J175k605k941j67L2O769L489k074m112l805J832L172J74q98k72
15606a0721J569R52j981j724J838K128j697M14j852q04J309J06j725o66q53m55
15590a4162J135K23L912J644k111k318Q39j143q93K995K403q66j670k454j505
$$ plain form
15575 -13971 -13853 -13279 -14157 -12794 -12131 -11478 -10695 -10665 -10014 -9742 -10482 -14398 -12659 -10958 -12500 -10495 -11295
15558 -11295 -13826 -10404 -7335 -8698 -11327 -13970 -13108 -12605 -10838 -9761 -10546 -9624 -6443 -4811 -4175 -4260
15542 -4260 -7610 -7746 -5787 -7339 -9284 -9023 -8959 -8577 -8126 -10059 -7051 -5046 -9261 -7393 -5762 -6071
15526 -6071 -6786 -6873 -6777 -10837 -8299 -8791 -6537 -6755 -7040 -5893 -5164 -3835 -3149 -7986 -6410 -6302 -6528 -7638
15508 -7638 -10854 -10139 -5644 -3022 -3675 -5137 -7425 -7502 -7958 -8685 -9424 -9830 -9718 -11641 -14010 -11491 -9654
15491 -9654 -10142 -9187 -5664 -1136 -2217 -5764 -7106 -9671 -13372 -14375 -14408 -16924 -18025 -15558 -12181 -12640
15475 -12640 -13067 -13735 -12968 -13135 -13960 -13994 -12982 -10536 -10094 -9501 -8102 -8196 -8192 -8473 -6174 -5171 -6422 -10399
15457 -10399 -10083 -10292 -7396 -5227 -7081 -10446 -12815 -14154 -11095 -9268 -9132 -9114 -5618 -5338 -3728 -4829
$$ packed form
15575a3971J18N74q78J363O63O53P83L0O51K72p40l916J739J701j542K005q00
15558a1295k531L422L069j363k629k643Q62N03J767J077p85R22L181J632O36q5
15542d260l350j36J959j552j945K61O4L82M51j933L008K005m215J868J631l09
15526f071p15q7R6m060K538m92K254k18k85J147P29J329O86m837J576J08k26j110
15508g638l216P15M495K622o53j462k288p7m56p27p39m06J12j923k369K519J837
15491i654m88R55L523M528j081l547j342k565l701j003l3k516j101K467L377m59
15475a2640m27o68P67j67q25l4J012K446M42N93J399r4Mk81K299J003j251l977
15457a0399L16k09K896K169j854l365k369j339L059J827J36J8L496K80J610j101
$$ plain form
15441 -4829 -7899 -10310 -12065 -8073 -6708 -7174 -12240 -16893 -13672 -10145 -10908 -11816 -11845 -14500 -15332 -12797
15425 -12797 -9650 -9816 -9109 -7001 -8160 -9647 -12195 -13311 -13588 -12890 -11969 -10733 -11494 -10290 -8549 -12838
15409 -12838 -13524 -12075 -10902 -6669 -3588 -5427 -7521 -8133 -7616 -8178 -11286 -9226 -5781 -6309 -8076 -11296
15393 -11296 -11858 -13073 -12692 -13576 -12067 -8594 -8630 -9215 -12187 -13875 -14682 -14647 -14116 -11698 -11393 -10554 -12106
15376 -12106 -12998 -10538 -13682 -13732 -11519 -9071 -8913 -8853 -8548 -9784 -10246 -12082 -15853 -13520 -11669 -12528 -12811
15359 -12811 -12878 -17025 -18867 -16488 -12513 -10546 -9767 -10355 -10770 -12420 -11513 -10963 -9967 -11114 -13577 -15826
15343 -15826 -15582 -12263 -10524 -9730 -12411 -13562 -10045 -9859 -12015 -14474 -10169 -7061 -9748 -9937 -10454 -12902
15327 -12902 -15588 -17035 -14134 -12832 -11051 -10942 -13983 -12405 -12626 -14617 -14017 -14132 -14065 -12372 -10519 -10854
$$ packed form
15441d829l070k411j755L992J365m66n066m653L221L527p63r08k9k655q32K535
15425a2797L147j66P07K108j159j487k548j116k77O98R21J236p61J204J741m289
15409a2838o86J449J173M233L081j839k094o12N17n62l108K060L445n28j767l220
15393a1296n62j215L81q84J509L473l6n85k972j688q07L5N31K418L05Q39j552
15376a2106q92K460l144n0K213K448J58O0L05j236m62j836l771K333J851q59k83
15359a2811o7m147j842K379L975J967P79n88m15j650R07N50R96j147k463k249
15343a5826K44L319J739P94k681j151L517J86k156k459M305L108k687j89n17k448
15327a2902k686j447K901J302J781J09l041J578k21j991O00j15O7J693J853l35
$$ plain form
15311 -10854 -12194 -14572 -12724 -8505 -9001 -13181 -11823 -11732 -11368 -5463 -5538 -8450 -8913 -8483 -9751 -9760 -5586
15294 -5586 -6276 -8418 -7986 -8301 -9115 -8900 -10712 -12718 -13293 -14284 -14951 -14305 -13709 -9212 -7525 -11557 -14965
15277 -14965 -14085 -12408 -9542 -9587 -7959 -8328 -9573 -11675 -9795 -9909 -13778 -14402 -13597 -10598 -11885 -12272
15261 -12272 -12426 -12970 -16215 -14845 -11308 -12579 -16733 -16873 -13209 -11716 -14588 -14702 -14549 -11691 -12270 -8649
15245 -8649 -9529 -11021 -9846 -7296 -6032 -8183 -7520 -6349 -4648 -7874 -11602 -14068 -13852 -11522 -7732
15230 -7732 -9530 -13365 -16969 -16799 -17823 -14324 -13351 -15847 -16193 -12559 -13059 -13319 -10357 -13266 -10229 -8182
15214 -8182 -10227 -12049 -12083 -11755 -9937 -7733 -10583 -12385 -12857 -11615 -11470 -12253 -10186 -10114 -10028 -11608 -12034
15197 -12034 -11790 -11897 -11287 -11587 -12028 -10759 -12443 -14643 -12786 -11324 -11407 -10616 -9718 -11312 -8119 -6664 -6271
$$ packed form
15311a0854j340k378J848M219m96m180J358R1L64N905p5k912m63M30j268rM174
15294e586o90k142M32l15q14K15j812k006n75r91o67O46N96M497J687m032l408
15277a4965Q80J677K866m5J628l69j245k102J880j14l869o24Q05K999j287l87
15261a2272j54n44l245J370L537j271m154j40L664J493k872j14J53K858n79L621
15245h649q80j492J175K550J264k151O63J171J701l226l728k466K16K330L790
15230g732j798l835l604J70j024L499R73k496l46L634n00k60K962k909L037K047
15214h182k045j822l4L28J818K204k850j802m72J242J45p83K067P2Q6j580m26
15197a2034K44j07O10l00m41J269j684k200J857J462q3P91Q98j594L193J455L93
$$ plain form
15180 -6271 -4588 -6113 -6939 -4873 -3826 -6111 -4609 -2892 -5944 -8240 -9226 -8421 -8782 -10291 -10311 -11898
15164 -11898 -15164 -12882 -11953 -10785 -9311 -8404 -8128 -8513 -9952 -13446 -14419 -16336 -13739 -15200 -14281 -12273
15148 -12273 -13762 -14111 -11052 -7710 -7156 -5550 -7513 -9086 -7908 -7570 -6638 -5507 -6822 -5701 -5699 -4252
15132 -4252 -8327 -9131 -6635 -6738 -5009 -4822 -7544 -10068 -8305 -9736 -9231 -7997 -5507 -4262 -5527 -7225
15116 -7225 -8570 -5876 -6374 -5784 -3302 -3394 -4849 -7340 -8111 -9508 -9799 -8432 -8840 -11933 -9902 -7825
15100 -7825 -8650 -9186 -6278 -3362 -3286 -4971 -5761 -6354 -5133 -7863 -10737 -7584 -7215 -7883 -6282 -5765 -7187
15083 -7187 -6988 -2816 -1652 -4863 -5409 -7586 -6937 -3820 -6408 -10351 -10870 -6690 -6580 -7334 -8503 -9709
15067 -9709 -9361 -9727 -9842 -7531 -5311 -8207 -9407 -11120 -10023 -10516 -6259 -477 -2790 -4854 -7487 -8355
$$ packed form
15180f271J683j525q26K066J047k285J502J717l052k296r86Q05l61j509k0j587
15164a1898l266K282R29J168J474R07K76l85j439l494r73j917K597j461R19K008
15148a2273j489l49L059L342N54J606j963j573J178L38R32J131j315J121KJ447
15132d252m075q04K496j03J729J87k722k524J763j431N05J234K490J245j265j698
15116g225j345K694m98N90K482r2j455k491p71j397k91J367m08l093K031K077
15100g825q25n36K908K916P6j685p90n93J221k730k874L153L69o68J601N17j422
15083g187J99M172J164l211n46k177O49L117k588l943n19M180J10p54j169j206
15067i709L48l66j15K311K220k896j200j713J097m93M257N782k313k064k633q68
$$ plain form
15051 -8355 -7054 -7814 -3581 -981 -2703 -6726 -7580 -8995 -7269 -4425 -573 -413 -1781 -2267 -5336 -5152
15035 -5152 -1923 2267 2140 -828 1174 2206 1569 -2677 -6315 -6082 -4415 -1261 -2628 -3410 -1839 80
15019 80 -501 -728 -3199 -6784 -10362 -8811 -7674 -8701 -10572 -10001 -9248 -5976 -4429 -2958 -4278 -5093
15003 -5093 -4121 -1851 369 -2381 -2014 -829 -5367 -6390 -3755 -1559 -3079 -4750 -5453 -6174 -4337 -1219
14987 -1219 975 -928 -5038 -5574 -5415 -5467 -7055 -7464 -5896 -6600 -8710 -8502 -6597 -7763 -9755 -10654 -12020
14970 -12020 -9748 -7861 -8663 -6134 -4233 -6953 -9101 -12194 -13860 -12820 -9809 -8651 -8568 -10514 -9170
14955 -9170 -10151 -10257 -8574 -7875 -11032 -10578 -9563 -5093 -7098 -11119 -11111 -7864 -8290 -9795 -12230 -12710 -11937
14938 -11937 -9861 -8154 -7578 -5361 -5130 -8562 -9652 -6544 -4825 -4824 -6623 -11043 -12606 -10037 -11860 -13049
$$ packed form
15051h355J301p60M233K600j722m023q54j415J726K844L852J60j368m86l069J84
15035e152L229M190j27k968K002J032o37m246l638K33J667L154j367p82J571J919
15019H0n81k27k471l585l578J551J137j027j871N71P53L272J547J471j320q15
15003e093R72K270K220k750L67J185m538j023K635K196j520j671p03p21J837L118
14987a219K194j903m110n36J59n2j588m09J568p04k110K08J905j166j992q99j366
14970a2020K272J887q02K529J901k720k148l093j666J040L011J158Q3j946J344
14955i170r81j06J683O99l157M54J015M470k005m021QL247m26j505k435m80P73
14938a1937K076J707N76K217K31l432j090L108J719Jj799m420j563K569j823j189
$$ plain form
14922 -13049 -11587 -10905 -11477 -10941 -10518 -7092 -6522 -6378 -10139 -12872 -14102 -11074 -9185 -9752 -9465 -9041 -9604
14905 -9604 -9759 -10861 -13116 -13517 -12343 -14173 -13034 -13282 -14506 -15586 -13676 -9913 -12603 -16650 -14983
14890 -14983 -13431 -12675 -10408 -7807 -7089 -7695 -8180 -9621 -11575 -10447 -9502 -11410 -12352 -14482 -11777 -11296
14874 -11296 -13020 -13980 -12777 -13025 -11984 -10430 -10140 -8205 -10476 -11226 -10844 -12728 -12188 -11893 -11092 -7846
14858 -7846 -9285 -8868 -9589 -11161 -10700 -8750 -7796 -10243 -12838 -13876 -12796 -11743 -9844 -10462 -10338 -10231
14842 -10231 -12584 -13505 -7675 -7559 -10227 -11742 -10154 -6620 -7130 -8120 -8654 -6833 -3614 -3750 -6641 -8001
14826 -8001 -7599 -7303 -11331 -14372 -13066 -13488 -12023 -6868 -5298 -8373 -10095 -11632 -15698 -14274 -11487
14811 -11487 -12174 -12720 -11233 -7556 -7144 -12884 -13310 -14364 -12681 -10067 -10407 -11916 -12370 -11863 -14197 -12427
$$ packed form
14922a3049J462O82n72N36M23L426N70J44l761k733j230L028J889n67K87M24n63
14905i604j55j102k255m01J174j830J139k48j224j080J910L763k690m047J667
14890a4983J552P56K267K601P18o06m85j441j954J128R45j908r42k130K705M81
14874a1296j724r60J203k48J041J554K90J935k271p50L82j884N40K95Q01L246
14858g846j439M17p21j572M61J950R54k447k595j038J080J053J899o18J24J07
14842a0231k353r21N830J16k668j515J588L534n10r90n34J821L219j36k891j360
14826h001M02K96m028l041J306m22J465N155J570l075j722j537m066J424K787
14811a1487o87n46J487L677M12n740m26j054J683K614l40j509m54N07k334J770
$$ plain form
14795 -12427 -11515 -8951 -7327 -8218 -6601 -4516 -6793 -7160 -7352 -7300 -7865 -6562 -6251 -7404 -10042 -13035
14779 -13035 -8897 -5889 -6130 -4910 -3959 -5664 -11562 -13040 -8661 -8245 -10439 -9817 -10829 -12476 -14130
14764 -14130 -14116 -15922 -16735 -17431 -16653 -13984 -12252 -13755 -16555 -18428 -16238 -10434 -8540 -8675 -8222 -6272
14748 -6272 -7870 -8213 -5395 -5827 -6648 -2533 -2000 -4594 -6790 -6657 -8144 -9296 -7736 -7484 -8120 -10525
14732 -10525 -11783 -11816 -10382 -7934 -8242 -10362 -11843 -11592 -9657 -8143 -7670 -7503 -8361 -6260 -4233 -3614
14716 -3614 -2604 -6503 -8352 -4980 -5272 -7752 -12583 -10042 -8769 -6504 -3598 -2395 -1640 -2494 -6211
14701 -6211 -7765 -5930 -4778 -7349 -8062 -7412 -3542 -1815 -2293 -2848 -599 -3476 -6613 -9154 -5966 -3661
14685 -3661 -1944 -1874 -3331 -1763 -81 -1458 168 -733 -684 -1578 -2866 -4599 -6958 -9915 -9281 -8674 -9036
$$ packed form
14795a2427R12K564J624q91J617K085k277l67j92N2n65J303L11j153k638k993
14779a3035M138L008k41J220R51j705n898j478M379M16k194O22j012j647j654
14764a4130J4j806q13o96P78K669J732j503k800j873K190N804J894j35M53J950
14748f272j598l43K818m32q21M115N33k594k196J33j487j152J560K52o36k405
14732a0525j258l3J434K448l08k120j481K51J935J514M73J67q58K101K027O19
14716c614J010l899j849L372k92k480m831K541J273K265K906J203P55q54l717
14701f211j554J835J152k571p13O50L870J727m78n55K249k877l137k541L188K305
14685c661J717P0j457J568J682j377J626r01M9q94j288j733k359k957O34O07l62
$$ plain form
14668 -9036 -10904 -9546 -8394 -7899 -5784 -7943 -12450 -11538 -5657 -3508 -3344 -3294 -6476 -10772 -9976 -9220
14652 -9220 -8257 -7091 -6789 -6091 -5688 -2129 -1905 -6293 -5858 -7845 -9129 -7184 -3582 278 692 -2982
14636 -2982 -4607 -5257 -4027 -841 -1496 -5908 -6587 -7833 -5895 -2237 -2315 -3556 -5466 -7323 -5990 -4229
14620 -4229 -4580 -3868 -3570 -1813 -2732 -6388 -6777 -7640 -6626 -6938 -6343 -6672 -6915 -1936 -1184 -6520 -9749
14603 -9749 -6883 -4887 -4484 -7158 -5078 -3413 -2340 -2105 -3335 -5066 -8236 -8491 -4443 -4941 -6802 -6799
14587 -6799 -5033 -2087 -2758 -3379 -4235 -3557 -7566 -8785 -7413 -6901 -3483 -3696 -5435 -5276 -5505 -8337 -9792
14570 -9792 -10732 -10466 -8945 -9418 -11644 -11175 -8900 -7623 -8751 -9565 -9604 -10441 -8707 -5510 -4419 -6297 -9317
14553 -9317 -13081 -12205 -10503 -9694 -8111 -8591 -9586 -7142 -2145 -1828 -3152 -7285 -5566 -7074 -4621 -2187
$$ packed form
14668i036j868J358J152M95K115k159m507R12N881K149J64N0l182m296P96P56
14652i220R63J166L02O98M03L559K24m388M35j987j284J945L602L860M14l674
14636b982j625o50J230L186o55m412o79j246J938L658p8j241j910j857J333J761
14620d229l51P12K98J757r19l656l89q63J014l12N95l29k43M979P52n336l229
14603i749K866J996M03k674K080J665J073K35j230j731l170k55M048m98j861L
14587f799J766K946o71o21q56O78m009j219J372N12L418k13j739J59k29k832j455
14570i792r40K66J521m73k226M69K275J277j128q14l9q37J734L197J091j878l020
14553i317l764Q76J702Q09J583m80r95K444M997L17j324m133J719j508K453K434
$$ plain form
14537 -2187 -2916 -2839 -2111 -3050 -1233 272 2267 136 -1776 -2165 -1054 -2428 -3769 -4304 -6530 -9254
14521 -9254 -7806 -8153 -3489 -1806 -2568 -3132 -3480 -4227 -5479 -5924 -6798 -6537 -2852 -3815 -3687 -8529 -7494
14504 -7494 -7619 -5891 -5672 -6914 -9347 -10705 -9879 -6760 -4991 -4627 -3690 -5206 -8814 -9607 -5512 -5506 -6103
14487 -6103 -4950 -4294 -4376 -6261 -2587 -1925 -4519 -4974 -5281 -5200 -8370 -10624 -11685 -8364 -8597 -9744 -8908
14470 -8908 -9255 -6073 -4912 -10248 -12666 -8951 -6393 -3827 -3980 -6351 -6253 -6855 -7303 -10908 -10176 -6965
14454 -6965 -6370 -5922 -4584 -4792 -4235 -2149 -2943 -4468 -7533 -8378 -9985 -10343 -7144 -4736 -3017 -3895 -6504
14437 -6504 -7758 -8569 -10155 -9237 -8924 -8729 -9688 -12545 -13634 -11723 -9495 -7338 -7554 -6524 -6729 -5699
14421 -5699 -7922 -9816 -9923 -11057 -11825 -10549 -7893 -8681 -10886 -13218 -9720 -10303 -11843 -9437 -9751 -14084
$$ packed form
14537b187p29P7P28r39J817J505J995k131j912l89J111j374j341n35k226k724
14521i254J448l47M664J683p62n64l48p47j252m45q74K61L685r63J28m842J035
14504g494j25J728K19j242k433j358Q26L119J769L64R37j516l608p93M095On97
14487f103J153O56q2j885L674O62k594m55l07Q1l170k254j061L321k33j147Q36
14470h908l47L182J161n336k418L715K558K566j53k371R8o02m48l605P32L211
14454f965N95M48J338k08N57K086p94j525l065q45j607l58L199K408J719q78k609
14437f504j254q11j586R18L13J95r59k857j089J911K228K157k16J030k05J030
14421e699k223j894j07j134p68J276K656p88k205k332L498n83j540K406l14m333
$$ plain form
14405 -14084 -11257 -10175 -9165 -6451 -2878 -2714 -6121 -8274 -9233 -5149 -4217 -3578 -8666 -14281 -13200
14390 -13200 -12192 -12881 -13604 -11522 -8371 -5515 -3059 -2537 -3474 -2762 -5849 -8881 -10552 -9059 -7660 -7458
14374 -7458 -6046 -5922 -6377 -9317 -9347 -7934 -5728 -3697 -598 465 -2156 -3239 -3457 -4578 296 2891
14358 2891 4719 7597 11192 12933 11009 9419 11315 6839 -68 -2803 -3111 -3852 -2973 -5494 -6773
14343 -6773 -8717 -11407 -11052 -10967 -13023 -9452 -3968 -4956 -7526 -8153 -10789 -12691 -9537 -9188 -8802 -11306
14327 -11306 -9798 -10180 -13283 -15277 -10647 -9201 -9585 -12000 -14036 -13276 -12424 -9916 -5506 -1294 -708 -3833
14311 -3833 -2936 -2606 -6131 -5189 -6664 -5526 -6844 -7482 -4610 -3434 -6401 -11094 -11088 -7368 -5683 -6176 -6664
14294 -6664 -2289 -504 -427 -3853 -5499 -7723 -7620 -4261 -5559 -7773 -10056 -11433 -13823 -15864 -12242
$$ packed form
14405a4084K827J082J010K714L573J64l407k153r59M084R32O39n088n615J081
14390a3200J008o89p23K082L151K856K456N22r37P12l087l032j671J493J399K02
14374g458J412J24m55k940l0J413K206K031L099J063k621j083k18j121M874K595
14358B891J828K878L595J741j924j590J896m476o907k735l08p41Q79k521j279
14343f773j944k690L55Q5k056L571N484r88k570o27k636j902L154L49L86k504
14327a1306J508l82l103j994M630J446l84k415k036P60Q52K508M410M212N86l125
14311c833Q97L30l525R42j475J138j318o38K872J176k967m693OL720J685m93m88
14294f664M375J785P7l426j646k224J03L359j298k214k283j377k390k041L622
$$ plain form
14279 -12242 -9640 -9739 -10378 -9085 -5036 -1805 146 100 -4012 -5889 -7400 -9005 -7975 -10181 -10399 -9376
14263 -9376 -6772 -2220 -2917 -3712 -1765 -1173 -4346 -8366 -9692 -7826 -5918 -7342 -7789 -8043 -7580 -6378
14247 -6378 -4330 -6225 -9691 -9563 -9310 -5763 -2967 -5802 -8566 -9228 -6762 -6808 -9221 -7196 -5471 -7761
14231 -7761 -6732 -5440 -1988 -1476 -2058 -2533 -1165 -3263 -1916 3481 2703 823 1362 -1601 -2075 -3488
14215 -3488 -6548 -7447 -9216 -10388 -3896 655 -1781 -3520 -2895 -2311 -5499 -6636 -7558 -7847 -6654 -1788
14199 -1788 -1509 -3221 -4941 -5396 -7927 -7479 -3872 -3862 -1715 -1197 -3620 -3683 -576 2976 3760 5365 6269
14182 6269 5383 629 107 73 -2263 -818 536 488 2684 4203 3627 1413 -817 -2227 -4452 -2500
14166 -2500 1620 4349 5241 6324 7569 4818 2177 99 1401 2502 2039 1722 3471 2763 1660 -752
$$ packed form
14279a2242K602r9o39J293M049L231J951m6m112j877j511j605J030k206k18J023
14263i376K604M552o97p95J947N92l173m020j326J866J908j424m47k54M63J202
14247f378K048j895l466J28K53L547K796k835k764o62K466m6k413K025J725k290
14231g761J029J292L452N12n82m75J368k098J347N397p78j880N39k963m74j413
14215c488l060q99j769j172O492M551k436j739O25N84l188j137r22k89J193M866
14199a788K79j712j720m55k531M48L607J0K147N18k423o3L107L552P84J605R04
14182F269q86m754n22l4k336J445J354m8K196J519n76k214k230j410k225J952
14166b500M120K729Q92J083J245k751k641k078J302J101m63l17J749p08j103k412
$$ plain form
14150 -752 -5204 -4263 -3438 -1506 -332 -1648 -4097 -4402 -2985 -904 -1295 46 1264 201 -1698 -1278
14134 -1278 -847 1089 1042 117 -3094 -2830 1739 7154 6107 7191 10139 12020 12503 10110 9151 6765
14118 6765 3756 4277 4245 3960 3621 3543 1750 621 3301 2576 3423 4729 4035 4795 1201 -2659 -814
14101 -814 -626 2774 6819 4754 1289 367 -806 -5930 -9527 -8305 -9863 -7550 -4476 -808 1842
14086 1842 -1612 -1893 1534 3594 3404 -1425 -2273 218 1775 -1202 -3927 -4694 -2418 -1164 -2179 -2327
14070 -2327 -2346 -2150 -674 -1066 157 370 -3024 -3978 -5795 -2410 -3690 -2907 -4363 -6351 -6783 -6090 -1339
14053 -1339 2942 3642 4102 4253 5208 2646 3051 3608 96 -1324 -3234 -909 960 3182 474 1477
14037 1477 -1446 -4519 -7299 -8583 -5865 -3142 -2672 -1505 224 -794 -1577 -1033 -2477 -5592 -4602 -3314
$$ packed form
14150g52m452R41Q25J932J174j316k449l05J417K081l91J341J218j063j899M20
14134a278M31J936m7r25l211K64M569N415j047J084K948J881M83k393r59k386
14118F765l009N21l2k85l39p8j793j129K680p25Q47J306o94P60l594l860J845
14101h14J88L400M045k065l465r22j173n124l597J222j558K313L074L668K650
14086A842l454k81L427K060j90m829q48K491J557k977k725p67K276J254j015j48
14070b327j9J96J476l92J223K13l394r54j817L385j280P83j456j988m32O93M751
14053a339M281P00M60J51R55k562M05N57l512j420j910K325J869K222k708J003
14037A477k923l073k780j284K718K723M70J167J729j018p83N44j444l115R90J288
$$ plain form
14021 -3314 -3747 -2007 -2986 -4528 -6802 -8914 -9231 -7134 -7814 -10145 -8130 -10665 -16228 -14576 -10073 -7808
14005 -7808 -4442 -4614 -7750 -6149 -7894 -7976 -7646 -7653 -6507 -4602 -3334 -2143 1597 -574 -327 -1119 -708
13988 -708 -989 -2767 -2637 -1236 -763 -1828 -3684 -3167 -3308 -4423 -1897 556 -2517 -3069 -2163 -4096 -787
13971 -787 -2422 -5999 -4835 -553 2327 3613 4850 4194 2481 4340 5252 6064 4398 942 -1845 -2482
13955 -2482 -3777 -5225 -2996 -3572 -5207 -6060 -3903 631 -1508 -2279 -1279 -207 -770 1516 2114 -1514
13939 -1514 -2328 -2347 -2484 -2768 391 2361 3370 3818 -137 -6067 -7494 -4520 -4076 -2487 277 -2164
13923 -2164 -3833 -5512 -5846 -3932 -4134 -3489 -2043 -2268 -2770 3304 8031 5965 2855 -2097 -1996 -314
13907 -314 1768 1900 5216 4382 548 2363 2396 1404 384 529 757 277 3390 5393 2501 -1613 -1644
$$ packed form
14021c314m33J740r79j542k274k112l17K097o80k331K015k535n563J652M503K265
14005g808L366j72l136J601j745q2L30pJ146J905J268J191L740k171K47p92M11
13988g08k81j778J30J401M73j065j856N17j41j115K526K453l073n52R06j933L309
13971g87j635l577J164M282K880J286J237o56j713J859R12Q12j666l456k787o37
13955b482j295j448K229n76j635q53K157M534k139p71J000J072n63K286N98l628
13939a514q14j9j37k84L159J970J009M48l955n930j427K974M44J589K764k441
13923b164j669j679l34J914k02O45J446k25n02O074M727k066l110m952J01J682
13907c14K082J32L316q34l834J815L3r92j020J45K28m80L113K003k892m114l1
$$ plain form
13890 -1644 -1242 -37 -1318 -2444 -909 -1611 -1423 1268 1833 1167 718 -2024 -3208 -3278 -1555 245 -1495
13873 -1495 -578 1767 3647 8371 6667 6583 9112 11996 11642 11105 7049 4993 7371 9844 12955 17732
13857 17732 16514 13742 10441 9352 9712 11118 10904 9298 6226 9670 13752 11723 7692 6394 4568
13842 4568 320 1056 2774 768 1395 5442 9441 11557 14727 12436 12652 14013 16086 19571 20622
13827 20622 25510 31420 30323 33615 38472 43275 45220 40158 36517 33628 30109 31443 31635 34142 36654
13812 36654 36889 40632 46809 54682 64583 74085 85502 95512 104124 115770 125623 126615 124250 119036
13798 119036 109603 96022 82164 69057 56591 45952 38419 33641 29067 26331 25281 21447 15893
13785 15893 18459 15937 15534 14271 10435 10210 9057 8589 8521 7413 9880 14277 14670 13538 13853 14148
$$ packed form
13890a644M02J205j281j126J535p02J88K691N65o66m49k742j184p0J723J800j740
13873a495R17K345J880M724j704q4K529K884l54n37m056k056K378K473L111M777
13857A7732j218k772l301j089L60J406k14j606l072L444M082k029m031j298j826
13842D568m248P36J718k006O27M047L999K116L170k291K16J361K073L485J051
13827B0622M888N910j097L292M857M803J945n062l641k889l519J334J92K507K512
13812C6654K35L743O177P873R901R502J1417J0010Q612J1646R853R92k365n214
13798A19036r433j3581j3858j3107j2466j0639p533m778m574k736j050l834n554
13785A5893K566k522m03j263l836k25j153m68o8j108K467M397L93j132L15K95
$$ plain form
13769 14148 16882 16019 11160 9330 12159 14409 10387 10515 11556 10511 11549 17777 23986 19776 16967
13754 16967 16425 17665 17997 20086 22051 23084 25624 27423 30044 34571 40218 41496 42905 44288 46231
13739 46231 52644 62059 72688 82463 93401 108475 122930 138705 160778 189877 223480 260350
13727 260350 307791 375775 471256 599634 770391 977976 1192844 1379598 1511074 1575843
13717 1575843 1558538 1467681 1316742 1127679 922266 728826 563299 432918 333954 262868
13707 262868 215975 182248 158040 138683 118301 100134 87037 76269 66101 59254 53927 44449
13695 44449 38737 32929 33133 31583 31986 29513 26768 25136 27099 28536 31425 31821 31503 33891 36739
13680 36739 38513 37840 34558 32236 33123 31211 29577 29249 25780 22194 16565 13756 14997 14459 15042 15051
$$ packed form
13769A4148K734q63m859j830K829K250m022J28J041j045J038O228O209m210k809
13754A6967n42J240L32K089J965J033K540J799K621M527N647J278J409J383J943
13739D6231O413R415J0629R775J0938J5074J4455J5775K2073K9099L3603L6870
13727B60350M7441O7984R5481J28378J70757K07585K14868J86754J31476O4769
13717A575843j7305r0857j50939j89063k05413j93440j65527j30381r8964p1086
13707B62868m6893l3727k4208j9357k0382j8167j3097j0768j0168o847n327r478
13695D4449n712n808K04j550M03k473k745j632J963J437K889L96l18K388K848
13680C6739J774o73l282k322Q87j912j634l28l469l586n629k809J241n38N83R
$$ plain form
13664 15051 15155 12276 9164 6480 5526 8481 8999 8425 7318 10682 11080 7961 4382 3453 4270 3241
13648 3241 3318 5667 9962 10115 6784 2906 1239 3003 4281 4129 3973 4584 5868 6406 8036 7266 7223
13631 7223 8239 6953 7288 4706 3961 8539 8666 7588 7019 9269 12965 15105 18591 15894 14495 12843
13615 12843 13209 15805 17457 18381 17768 15370 14410 15670 17051 16880 18686 19874 18671 20263 22815 21150
13599 21150 22371 24394 30153 34117 36186 34649 36774 39929 40161 42033 42519 41378 45013 47388 46169
13584 46169 47260 48171 45119 41178 40359 39239 40686 44267 44569 45453 46093 44766 41056 40387 38818 37671
13568 37671 37520 35483 32721 30261 29908 27794 26456 26674 24192 22126 15958 14669 16542 18935 20109
13553 20109 20789 17420 13760 14269 13408 12965 11720 13436 12146 14087 18614 17688 17224 17631 19104 22967
$$ packed form
13664A5051J04k879l112k684r54K955N18n74j107L364L98l119l579r29Q17j029
13648C241P7K349M295J53l331l878j667J764J278j52j56O11J284N38J630p70m3
13631G223J016j286L35k582p45M578J27j078n69K250L696K140L486k697j399j652
13615A2843L66K596J652R24o13k398r60J260J381j71J806J188j203J592K552j665
13599B1150J221K023N759L964K069j537K125L155K32J872M86j141L635K375j219
13584D6169J091R11l052l941q19j120J447L581L02Q84O40j327l710o69j569j147
13568C7671j51k037k762k460l53k114j338K18k482k066o168j289J873K393J174
13553B0109O80l369l660N09q61m43j245J716j290J941M527r26m64M07J473L863
$$ plain form
13537 22967 21793 16531 17709 21242 22940 22803 27033 30070 35858 43951 52028 57619 63133 69372 77707
13522 77707 82691 81383 79445 76721 72257 62570 54697 50320 44733 38387 29743 24274 22001 19109
13508 19109 20168 21430 17482 12042 8083 6169 6327 7514 10342 8085 4564 4334 4591 2881 2214
13493 2214 2552 1083 2340 6026 7275 5281 3840 3497 5280 3981 4765 4453 2025 430 172 4292
13477 4292 5008 1646 420 2611 3519 4048 5914 4902 1573 -326 464 855 2108 4155 6462 7981
13461 7981 7515 6178 5711 6842 7323 8592 6982 6552 8484 12061 15557 19212 16602 19880 21514 21146
13445 21146 25171 33026 43775 56658 71153 86342 101106 110634 115677 110487 98687 83014 66271
13432 66271 53557 45597 36336 31579 29463 30727 32338 34105 38236 43043 46200 52632 61373 71433
$$ packed form
13537B2967j174n262J178L533J698j37M230L037N788Q093Q077N591N514O239Q335
13522G7707M984j308j938k724m464r687p873m377n587o346q644n469k273k892
13508A9109J059J262l948n440l959j914J58J187K828k257l521k30K57j710o67
13493B214L38j469J257L686J249j994j441l43J783j299P84l12k428j595k58M120
13477D292P16l362j226K191R08N29J866j012l329j899P90L91J253K047K307J519
13461G981m66j337m67J131M81J269j610m30J932L577L496L655k610L278J634l68
13445B1146M025P855J0749J2883J4495J5189J4764R528N043n190j1800j5673j6743
13432F6271j2714p960r261m757k116J264J611J767M131M807L157O432Q741J0060
$$ plain form
13418 71433 83488 100653 121610 139386 148042 148899 139658 123808 105073 84887 65153 49905
13406 49905 40136 30560 26129 21662 18098 16546 15019 11335 7968 8715 10439 9707 10914 13089 13762
13391 13762 12659 11424 9409 7548 9741 13759 13580 12663 13297 15102 12634 10413 8898 6639 4759
13376 4759 7999 10089 9641 7659 7450 6992 4961 2706 -486 -3136 -770 1538 1527 4468 6742 5966
13360 5966 5457 3358 2215 1371 2159 824 2653 1792 3662 2421 2899 5635 6465 8006 5948 4863
13344 4863 6064 4834 4340 2156 928 589 1975 3651 5191 5350 6660 7985 7890 9312 11603 15855
13328 15855 18741 21213 23046 21472 19700 20954 17999 17147 15453 13573 10633 8870 8525 9341 9936
13313 9936 10780 8708 7941 7494 10651 10747 14998 21606 22067 23114 20781 17665 14640 12297 9668 7670
$$ packed form
13418G1433J2055J7165K0957J7776Q656Q57r241j5850j8735k0186j9734j5248
13406D9905r769r576m431m467l564j552j527l684l367P47J724p32J207K175O73
13391A3762j103j235k015j861K193M018j79r17O34J805k468k221j515k259j880
13376D759L240K090m48j982k09m58k031k255l192k650K366K308j1K941K274p76
13360E966n09k099j143q44P88j335J829q61J870j241M78K736Q30J541k058j085
13344D863J201j230m94k184j228l39J386J676J540J59J310J325r5J422K291M252
13328A5855K886K472J833j574j772J254k955q52j694j880k940j763l45Q16N95
13313I936Q44k072p67m47L157R6M251O608M61J047k333l116l025k343k629j998
$$ plain form
13297 7670 9586 12786 12553 11272 7237 4833 689 -3463 208 5159 6848 4354 2903 5445 3517
13282 3517 1940 4824 6383 6917 7320 9255 6569 2046 4334 8237 11537 13001 14647 12918 13045
13267 13045 16106 19481 22439 20959 17626 14084 15919 15313 16116 16284 15801 18445 18314 16480 17950 22151
13251 22151 23459 24565 24940 24003 21322 20188 16818 18306 21852 24536 26841 34964 40144 39609 40249
13236 40249 42013 39682 39205 38226 33840 26418 24822 23975 21684 22878 23664 25005 25739 22480 22598 23760
13220 23760 24154 27930 31871 32240 36738 36061 35360 38344 36390 33373 33167 32725 26282 24279 21668 19641
13204 19641 20754 19721 18719 20780 23595 23161 21892 18368 15088 13918 14350 12742 14211 13439 12608
13189 12608 12038 10175 9869 7866 8852 11414 9369 6787 7749 8676 6460 4260 6675 9165 9694 10524
$$ packed form
13297G670J916L200k33j281m035k404m144m152L671M951J689k494j451K542j928
13282C517j577K884J559N34M03J935k686m523K288L903L300J464J646j729J27
13267A3045L061L375K958j480l333l542J835o06Q03J68m83K644j31j834J470M201
13251B2151J308J106L75r37k681j134l370J488L546K684K305Q123N180n35O40
13236D0249J764k331m77r79m386p422j596q47k291J194P86J341P34l259J18J162
13220B3760L94L776L941L69M498o77p01K984j954l017k06m42o443k003k611k027
13204A9641J113j033j002K061K815m34j269l524l280j170M32j608J469p72q31
13189A2608n70j863l06k003R86K562k045k582R62R27k216k200K415K490N29Q30
$$ plain form
13173 10524 10546 12252 12454 9061 8094 10406 12311 15624 12891 13960 13995 11580 11438 10551 8803 6439
13157 6439 3615 1346 3751 4227 3168 5812 8384 6703 5289 3622 3160 2001 2201 -316 -3543
13142 -3543 -342 2874 3724 6697 7896 6998 5882 7321 9592 8359 7158 10010 5796 73 1260
13127 1260 1755 5843 8585 7205 4381 2270 3452 5313 3873 4539 5824 4425 5654 4489 3747
13112 3747 4164 2574 2699 6333 9630 9659 7002 6886 6233 3531 2261 5668 6835 3425 7132 9923
13096 9923 11042 13434 14669 15494 13550 9801 6079 3271 5580 6889 5493 5257 6663 5549 7319
13081 7319 5322 5069 5671 8828 10309 11076 12792 13104 11927 9806 6980 7462 7518 7217 6630 8807 9498
13064 9498 10208 11351 11690 12747 11771 9667 10978 13586 13695 15803 21824 25733 27757 33202 38115 39064
$$ packed form
13173A0524K2J706K02l393r67K312J905L313k733J069L5k415j42q87j748k364
13157F439k824k269K405M76j059K644K572j681j414j667m62j159K00k517l227
13142c543L201L216Q50K973J199q98j116J439K271j233j201K852m214n723J187
13127A260M95M088K742j380k824k111J182J861j440O66J285j399J229j165p42
13112C747M17j590J25L634L297K9k657j16o53k702j270L407J167l410L707K791
13096I923J119K392J235Q25j944l749l722k808K309J309j396k36J406j114J770
13081G319j997k53O02L157J481P67J716L12j177k121k826M82N6l01n87K177O91
13064I498P10J143L39J057r76k104J311K608J09K108O021L909K024N445M913R49
$$ plain form
13048 39064 38107 33886 27729 22387 21517 18425 13653 12491 12824 12851 13607 15392 15925 18689 19104 15945
13032 15945 15111 16583 17600 19491 22909 20270 20537 21547 22114 20969 21909 23336 24163 23113 19036 16956
13016 16956 16624 16835 18800 22266 21538 18667 16390 19222 22029 24305 33389 39466 40506 39985 34961
13001 34961 30928 25440 19235 16710 18686 16157 13011 13930 15237 15183 13718 14481 13544 12555 11733 9762
12985 9762 9795 12392 14955 16437 15004 12206 14809 15579 12912 10953 8099 9188 11069 10391 12630 15117
12969 15117 17803 18044 18099 17974 18800 16810 17599 18106 18411 17592 21097 21288 18701 17916 15496 14296 12898
12952 12898 12524 16010 18287 15859 15555 14834 12226 10431 9675 6876 7183 4417 9197 14658 14862 13692
12936 13692 12211 12251 12494 11677 12246 10313 11468 10120 10400 14465 12501 9647 10056 11186 8954 7243
$$ packed form
13048C9064r57m221o157n342q70l092m772j162L33K7P56J785N33K764M15l159
13032A5945q34J472J017J891L418k639K67J010N67j145R40J427Q27j050m077k080
13016A6956l32K11J965L466p28k871k277K832K807K276R084O077J040n21n024
13001C4961m033n488o205k525J976k529l146R19J307n4j465P63r37r89q22j971
12985I762L3K597K563J482j433k798K603P70k667j959k854J089J881o78K239K487
12969A5117K686K41N5j25Q26j990P89N07L05q19L505J91k587p85k420j200j398
12952A2898l74L486K277k428l04p21k608j795p56k799L07k766M780N461K04j170
12936A3692j481M0K43q17N69j933J155j348K80M065j964k854M09J130k232j711
$$ plain form
12920 7243 10032 11872 13535 15969 14629 12028 15134 15219 11622 9988 10083 11513 12321 12732 14250 16795
12904 16795 18232 21604 20567 17642 15818 18627 18814 18354 14281 14263 16819 22021 23821 19508 18046
12889 18046 16484 15859 14845 13553 14100 13237 13949 17607 20549 19920 22421 23269 20984 18888 19565 19544 21838
12872 21838 22416 20728 20042 21315 21724 20750 20943 20124 24622 28348 28595 24301 26102 28951 30847 33101
12856 33101 35187 33429 29176 25829 26409 26582 26622 28276 28868 28916 29799 28515 25722 25568 24428 21927 20959
12839 20959 24011 23873 20077 21605 23910 26082 24890 25336 22321 21723 19067 18508 20308 21314 23469
12824 23469 25393 24117 23031 22984 22113 26172 27731 28640 32184 31739 32908 36938 37241 36596 36277 38390
12808 38390 41632 42924 45805 45792 44908 46535 47629 48657 48524 51389 51797 52232 49713 50573 48375 44353
$$ packed form
12920G243K789J840J663K434j340k601L106Q5l597j634R5J430Q08M11J518K545
12904A6795J437L372j037k925j824K809J87m60m073j8K556N202J800m313j462
12889A8046j562o25j014j292N47q63P12L658K942o29K501Q48k285k096O77k1K294
12872B1838N78j688o86J273M09r74J93q19M498L726K47m294J801K849J896K254
12856C3101K086j758m253l347N80J73M0J654N92M8Q83j284k793j54j140k501r68
12839B0959L052j38l796J528K305K172j192M46l015n98k656n59J800J006K155
12824B3469J924j276j086m7q71M059J559R09L544m45J169M030L03o45l19K113
12808C8390L242J292K881j3q84J627J094J028j33K865M08M35k519Q60k198m022
$$ plain form
12792 44353 45246 46003 44016 40387 37714 36693 32426 29143 28495 30825 31841 34920 39910 37013 34214
12777 34214 36194 35865 35532 34161 35363 35809 34946 39060 41817 41563 42316 44006 41368 38895 42212 44980
12761 44980 43900 43595 44469 49864 53336 53485 54301 57663 60320 60457 59158 60912 63014 65926 66960 66138
12745 66138 64102 65079 65881 69281 68732 69512 72752 74082 78644 85697 91365 97561 110972 123654 135291
12730 135291 147580 165026 181571 207162 238558 277029 334357 412192 511596 629938 761035
12719 761035 878860 970353 1018854 1019357 969407 879693 763850 638823 518969 413297 331635
12708 331635 269595 223143 191006 167882 149200 133802 123631 112208 105625 98583 90487 82831
12696 82831 78988 76909 74258 76333 74969 73342 69182 67075 65296 59588 57370 56803 53830 51042 51453
$$ packed form
12792D4353Q93P57j987l629k673j021m267l283o48K330J016L079M990k897k799
12777C4214J980l29l33j371J202M46q63M114K757k54P53J690k638k473L317K768
12761D4980j080l05Q74N395L472J49Q16L362K657J37j299J754K102K912J034q22
12745F6138k036R77Q02L400n49P80L240J330M562P053N668O196J3411J2682J1637
12730A35291J2289J7446J6545K5591L1396L8471N7328P7835R9404J18342J31097
12719G61035J17825R1493M8501N03m9950q9714j15843j25027j19854j05672q1662
12708C31635o2040m6452l2137k3124j8682j5398j0171j1423o583p042q096p656
12696H2831l843k079k651K075j364j627m160k107j779n708k218n67k973k788M11
$$ plain form
12681 51453 51261 46749 47507 50132 49090 48294 47730 48160 48060 49252 49205 49959 47838 45572 43425 40875 41226
12664 41226 42665 42700 43925 44672 47067 49035 52851 53340 53473 55679 54835 51662 49492 50291 51682 50613
12648 50613 50999 51350 49865 47573 49264 51254 55575 57857 59557 63341 62685 57168 57600 60682 61358 59698
12632 59698 61787 60178 61464 65575 62706 63299 61423 51671 42915 40778 37834 35221 29068 24702 21571
12617 21571 21348 24708 29322 29430 26916 29374 30663 32814 35204 37508 38515 41543 42162 43388 43243
12602 43243 39727 37897 38173 39360 40043 44470 45875 50767 51930 53307 54592 57836 57555 56075 53089
12587 53089 52335 54609 53274 54331 55439 56973 56441 57811 64640 65724 62284 63971 66981 69335 73272
12572 73272 78482 82943 81573 81907 86716 93096 100374 107409 110372 113938 121546 134424 151178 171347
$$ packed form
12681E1453j92m512P58K625j042p96n64M30j00J192m7P54k121k266k147k550L51
12664D1226J439L5J225P47K395J968L816M89J33K206q44l173k170P99J391j069
12648E0613L86L51j485k292J691J990M321K282J700L784o56n517M32L082O76j660
12632E9698K089j609J286M111k869N93j876r752q756k137k944k613o153m366l131
12617B1571k23L360M614J08k514K458J289K151K390K304J007L028O19J226j45
12602D3243l516j830K76J187O83M427J405M892J163J377J285L244k81j480k986
12587E3089p54K274j335J057J108J534n32J370O829J084l440J687L010K354L937
12572G3272N210M461j370L34M809O380P278P035K963L566P608J2878J6754K0169
$$ plain form
12558 171347 190219 214784 245337 276177 312750 360452 416324 484855 565957 643770 703916
12547 703916 721929 687933 613898 524767 444664 379899 333396 306330 287542 275997 260275
12536 260275 241342 216604 195808 186807 179843 170539 165781 167580 176165 187293 210082 242175 280718
12523 280718 314289 331508 330136 311626 286141 264977 252580 239858 229592 222174 209119 197433
12511 197433 189189 181075 169818 157537 147380 137573 129396 125713 121588 115943 110245 109257 106760 104147
12497 104147 99920 96214 92697 88837 88636 92029 100299 108553 116019 125068 133531 144338 152739 161564
12483 161564 177378 191687 204076 210855 219868 231931 233223 233386 224908 216035 207299 194603 184560
12470 184560 175993 167057 163104 164519 166095 167359 167305 170595 178043 185268 189366 192243 197234 201474 197804
$$ packed form
12558A71347J8872K4565L0553L0840L6573M7702N5872O8531Q1102P7813O0146
12547G03916J8013l3996p4035q9131q0103o4765m6503k7066j8788j1545j5722
12536B60275j8933k4738k0796r001o964r304m758J799Q585J1128K2789L2093L8543
12523B80718L3571J7219j372j8510k5485k1164j2397j2722j0266p418j3055j1686
12511A97433q244q114j1257j2281j0157r807q177l683m125n645n698r88k497k613
12497A04147m227l706l517l860k01L393Q270Q254P466R049Q463J0807Q401Q825
12483A61564J5814J4309J2389O779R013J2063J292J63q478q873q736j2696j0043
12470A84560q567q936l953J415J576J264n4L290P448P225M098K877M991M240l670
$$ plain form
12455 197804 189361 182766 180594 183611 191820 199358 213120 228497 240443 249625 257889 263579 268185
12442 268185 271905 270326 269294 269991 274834 275259 276325 280574 288017 298262 309195 324936 347269 378295
12428 378295 415131 456981 499578 532688 549648 549720 532873 503975 465504 423901 387216 358014
12416 358014 337812 330042 322526 313146 311499 311186 315024 314815 310609 311324 310837 312098 312169 310720 316384
12401 316384 322908 326349 334767 342329 345355 347606 345596 343096 339804 333026 331606 336267 344176 351538
12387 351538 355255 360982 370182 385035 399845 416401 437732 458054 479518 504222 526279 543528
12375 543528 556161 569073 582248 598333 615225 631408 650403 670102 687349 709012 728597
12364 728597 746888 764892 785277 805266 826663 858111 887957 916267 948013 971736 987476
$$ packed form
12455A97804q443o595k172L017Q209P538J3762J5377J1946R182Q264N690M606
12442B68185L720j579j032O97M843M25J066M249P443J0245J0933J5741K2333L1026
12428C78295L6836M1850M2597L3110J6960P2j6847k8898l8471m1603l6685k9202
12416C58014k0202p770p516r380j647l13L838k09m206P15m87J261P1j449N664
12401C16384O524L441Q418P562L026K251k010k500l292o778j420M661P909P362
12387C51538L717N727R200J4853J4810J6556K1331K0322K1464K4704K2057J7249
12375E43528J2633J2912J3175J6085J6892J6183J8995J9699J7247K1663J9585
12364G28597J8291J8004K0385J9989K1397L1448K9846K8310L1746K3723J5740
$$ plain form
12353 987476 1003913 1022221 1044944 1074169 1113713 1157523 1207017 1260799 1313454 1362901 1409504
12342 1409504 1461601 1516378 1570539 1632627 1701667 1780426 1868372 1975172 2092767 2223359 2363231
12331 2363231 2511470 2675886 2856936 3058197 3281785 3525684 3801083 4114371 4468468
12322 4468468 4866540 5311038 5809622 6379962 7036536 7811303 8732709 9836034 11161861
12313 11161861 12732714 14542243 16573455 18822978 21318730 24168059 27559125 31801405
12305 31801405 37369482 44957820 55523716 70163495 89605668 113235927 138421890
12298 138421890 161173442 177777718 185991855 185179430 175841396 159362007 137923871
12291 137923871 114319141 91390096 71366624 55362084 43406504 34855106 28826805
$$ packed form
12353I87476J6437J8308K2723K9225L9544M3810M9494N3782N2655M9447M6603
12342A409504N2097N4777N4161O2088O9040P8759Q7946J06800J17595J30592J39872
12331B363231J48239J64416J81050K01261K23588K43899K75399L13288L54097
12322D468468L98072M44498M98584N70340O56574P74767R21406J103325J325827
12313A1161861J570853J809529K031212K249523K495752K849329L391066M242280
12305C1801405N568077P588338J0565896J4639779J9442173K3630259K5185963
12298A38421890K2751552J6604276Q214137q12425r338034j6479389k1438136
12291A37923871k3604730k2929045k0023472j6004540j1955580q551398o028301
$$ plain form
12284 28826805 24518882 21319897 18806321 16695853 14823875 13102029 11505778 10040652
12276 10040652 8729910 7595058 6639133 5858180 5225607 4713154 4295677 3952817 3661297
12267 3661297 3414841 3199122 3000765 2819308 2650604 2500582 2366137 2243856 2136652
12258 2136652 2037837 1946406 1854540 1770802 1686266 1603945 1521541 1444992 1375270 1313260 1257917
12247 1257917 1208261 1164153 1129113 1105619 1079351 1052247 1028238 1004033 975652 946585 917820
12236 917820 886521 848478 814489 785429 751705 713699 684229 655473 628060 603047 582084
12225 582084 563057 548094 535815 523741 514796 508060 499907 487335 477123 468029 461082 457844 455836
12212 455836 454407 453346 453266 449150 450264 448976 443845 432941 422697 415172 406709 398178 388361 377130
$$ packed form
12284B8826805m307923l198985k513576k110468j871978j721846j596251j465126
12276A0040652j310742j134852r55925p80953o32573n12453m17477l42860k91520
12267C661297k46456k15719j98357j81457j68704j50022j34445j22281j07204
12258B136652r8815r1431r1866q3738q4536q2321q2404p6549o9722o2010n5343
12247A257917m9656m4108l5040k3494k6268k7104k4009k4205k8381k9067k8765
12236I17820l1299l8043l3989k9060l3724l8006k9470k8756k7413k5013k0963
12225E82084j9027j4963j2279j2074q945o736q153j2572j0212r094o947l238k008
12212D55836j429j061q0m116J114j288n131j0904j0244p525q463q531r817j1231
$$ plain form
12198 377130 365060 351976 341714 334720 331858 332253 335170 339449 343376 348546 353599 367759 389001
12185 389001 413070 436751 461466 482458 488677 483990 469643 446981 424750 412143 408342 408290 408985
12172 408985 408458 407696 404197 396321 383157 362412 339860 315656 291464 271047 252710 232607 215047
12159 215047 201628 190945 181975 172695 161042 154339 143838 133485 126065 117904 113066 108784 106058
12146 106058 107328 111531 116306 122298 132564 147211 160820 171012 178458 181324 181327 175466 169916 162860
12132 162860 157089 153905 152506 154509 156571 156964 161361 168639 176269 177069 174747 167947 158871 146324
12118 146324 132769 121595 112196 103497 93692 87603 86305 81311 78077 79261 76473 77216 82079 90135
12104 90135 96367 100112 104997 109448 114005 118240 119078 118504 115840 114529 113904 115379 119946 121098 121820
$$ packed form
12198C77130j2070j3084j0262o994k862L95K917M279L927N170N053J4160K1242
12185C89001K4069K3681K4715K0992O219m687j4347k2662k2231j2607l801n2O95
12172D08985n27p62l499p876j3164k0745k2552k4204k4192k0417j8337k0103j7560
12159B15047j3419j0683q970r280j1653o703j0501j0353p420q161m838m282k726
12146A06058J270M203M775N992J0266J4647J3609J0192P446K866Ln861n550p056
12132A62860n771l184j399K003K062L93M397P278P630Q00k322o800r076j2547
12118A46324j3555j1174r399q699r805o089j298m994l234J184k788P43M863Q056
12104I0135O232L745M885M451M557M235Q38n74k664j311o25J475M567J152P22
$$ plain form
12089 121820 122292 122695 119992 121376 117520 114731 112268 111448 110088 106346 100713 98378 95076 94065 98942
12074 98942 101864 106856 111737 118549 124977 129944 137254 146235 152387 153895 149984 144774 140445 138945
12060 138945 134895 133565 130074 121330 119557 122046 117135 108571 103631 98217 97845 95196 92206 88379
12046 88379 87472 89918 88971 87113 85034 80074 76561 74066 72647 71625 73113 71768 69927 68503 67529
12031 67529 65772 64898 65724 66231 67623 66292 66297 68015 69865 71977 72416 73182 72109 71008 69439 69474 70834
12014 70834 73802 71761 70434 69273 69546 71236 73413 77140 78627 77926 78390 77071 77061 77679 76756 78859
11998 78859 82851 86663 87655 84354 84692 89762 94194 91544 92428 93129 90104 86588 85995 86244 88318 89396
11982 89396 88721 91545 95227 97212 100034 103160 103875 107800 115757 115187 108461 104852 101886 99514 94192
$$ packed form
12089A21820M72M03k703J384l856k789k463q20j360l742n633k335l302j011M877
12074I8942K922M992M881O812O428M967P310Q981O152J508l911n210m329j500
12060A38945m050j330l491q744j773K489m911q564m940n414l72k649k990l827
12046H8379r07K446r47j858k079m960l513k495j419j022J488j345j841j424r74
12031F7529j757q74Q26N07J392j331NJ718J850K112M39P66j073j101j569L5J360
12014G0834K968k041j327j161K73J690K177L727J487p01M64j319j0O18r23K103
11998G8859L992L812R92l301L38N070M432k650Q84P01l025l516n93K49K074J078
11982H9396o75K824L682J985K822L126P15L925P957n70o726l609k966k372n322
$$ plain form
11967 94192 87866 84343 84094 83229 80186 82313 92322 98381 104286 115819 124060 129648 135414 143428
11953 143428 149978 158035 163670 167768 172822 177120 183161 196472 210568 227504 249472 268249 287069
11940 287069 309186 331227 354416 384711 424164 466944 510198 559034 619992 693866 776030
11929 776030 870783 987264 1129316 1303351 1522491 1790415 2118055 2509859 2955527 3427640
11919 3427640 3892752 4314702 4671016 4949989 5108037 5049037 4708516 4160279 3529015 2930770
11909 2930770 2419449 2001125 1663722 1394470 1181398 1009601 876343 767057 683486 616664
11899 616664 557546 509069 464735 427759 394135 366572 342804 322238 306937 298260 291668 286158
11887 286158 287704 293015 306803 334290 366223 409232 468908 546526 633409 708808 760244 789487
$$ packed form
11967I4192o326l523k49q65l043K127J0009O059N905J1533Q241N588N766Q014
11953A43428O550Q057N635M098N054M298O041J3311J4096J6936K1968J8777J8820
11940B87069K2117K2041K3189L0295L9453M2780M3254M8836O0958P3874Q2164
11929G76030R4753J16481J42052J74035K19140K67924L27640L91804M45668M72113
11919C427640M65112M21950L56314K78973J58048n9000l40521n48237o31264n98245
11909B930770n11321m18324l37403k69252k13072j71797j33258j09286q3571o6822
11899F16664n9118m8477m4334l6976l3624k7563k3768k0566j5301q677o592n510
11887B86158J546N311J3788K7487L1933M3009N9676P7618Q6883P5399N1436K9243
$$ plain form
11875 789487 802795 823874 865698 935087 1019492 1095108 1145559 1154736 1113426 1031520 922249
11864 922249 794540 669311 561490 475538 413235 371709 344474 326909 318850 309987 295201
11853 295201 277644 255036 230692 212664 198013 190433 185308 185271 189698 197902 207807 225024 252808
11840 252808 291967 341489 398102 463152 532209 597532 649942 682181 688369 677205 656739 630568
11828 630568 593563 544717 478899 408849 350514 296540 252224 222516 194430 167235 148608
11817 148608 134984 125146 117474 115070 115733 116574 121597 119858 112149 101349 90610 86421 81715 78252
11803 78252 79182 81943 83530 85161 88283 92754 99701 113586 128922 151209 182790 234207 297821
11790 297821 368877 435625 472129 473516 437306 369629 291644 218605 167189 130711 104524 85244
$$ packed form
11875G89487J3308K1079M1824O9389Q4405P5616N0451R177m1310q1906j09271
11864I22249j27709j25229j07821q5952o2303m1526k7235j7565q059q863j4786
11853B95201j7557k2608k4344j8028j4651p580n125l7M427Q204R905J7217K7784
11840B52808L9159M9522N6613O5050O9057O5323N2410L2239O188j1164k0466k6171
11828F30568l7005m8846o5818p0050n8335n3974m4316k9708k8086k7195j8627
11817A48608j3624r838p672k404O63Q41N023j739p709j0800j0739m189m706l463
11803G8252R30K761J587J631L122M471O947J3885J5336K2287L1581N1417O3614
11790B97821P1056O6748L6504J387l6210o7677p7985p3039n1416l6478k6187j9280
$$ plain form
11778 85244 74964 69897 63268 60445 58013 54814 49968 50958 55950 61267 71278 85916 99325 103274
11764 103274 91491 79800 68052 58280 53464 50578 51403 60896 77570 88560 92794 84904 70172
11751 70172 57727 54034 52364 46647 45013 41886 42568 41377 37496 37338 38816 42616 47105 52481 57748
11736 57748 69954 85587 97357 112132 126905 131647 135210 134998 128824 114253 99639 84335 68970
11723 68970 55275 48357 46667 43904 40111 37999 33937 32730 27782 21853 21478 24425 28064 28097 24887
11708 24887 27910 25725 21562 25431 23966 25063 26948 27497 25997 25558 23781 23740 24691 25099 25030 20241
11692 20241 19355 19986 22604 22375 21099 20077 18216 19869 21150 22015 18111 17827 16916 18505 17416 17224
11676 17224 15022 14523 14328 10857 8122 7568 7358 8863 12822 14180 16166 18373 17317 16728 16476 18261
$$ packed form
11778H5244j0280n067o629k823k432l199m846R90M992N317J0011J4638J3409L949
11764A03274j1783j1691j1748r772m816k886Q25R493J6674J0990M234p890j4732
11751G0172j2445l693j670n717j634l127O82j191l881j58J478L800M489N376N267
11736E7748J2206J5633J1770J4775J4773M742L563k12o174j4571j4614j5304j5365
11723F8970j3695o918j690k763l793k112m062j207m948n929l75K947L639L3l210
11708B4887L023k185m163L869j465J097J885N49j500m39j777m1R51M08o9m789
11692B0241q86O31K618k29j276j022j861J653J281Q65l904k84r11J589j089j92
11676A7224k202m99j95l471k735n54k10J505L959J358J986K207j056n89k52J785
$$ plain form
11660 18261 14624 13684 12589 12187 11984 16053 13274 10196 12481 15798 15230 9500 6503 8951 9733 9797
11644 9797 9813 13020 13655 11492 11192 13927 11604 16155 18642 17588 14746 12702 11569 10766 6553 5264
11628 5264 4184 6760 7251 8704 12469 15097 14257 11290 10751 12499 13058 10360 9429 7711 9415 9253
11612 9253 7930 5779 4650 4791 2283 2150 2796 6672 8194 9594 10249 9300 6985 6369 7491 6079
11596 6079 6754 6571 7325 5588 5480 6593 6379 6010 8669 7848 9901 9881 10147 9534 8988 7342 4767 4796
11578 4796 3907 1681 1709 539 -613 -597 -1470 -1224 -848 -27 -1610 -3531 -6694 -7474 -7781 -3595 1610
11561 1610 3151 2523 1674 -1386 -1616 1144 3031 3374 2724 3580 4346 2916 2230 3531 6330 6159 4927
11544 4927 3545 2302 2765 -1913 -3962 -1983 -740 585 5210 7189 4422 2312 1891 4773 7349
$$ packed form
11660A8261l637r40j095m02k03M069k779l078K285L317n68n730k997K448P82O4
11644I797J6L207O35k163l00K735k323M551K487j054k842k044j133q03m213j289
11628E264j080K576M91J453L765K628q40k967n39J748N59k698r31j718J704j62
11612I253j323k151j129J41k508j33O46L876J522J400O55r49k315o16J122j412
11596F079O75j83P54j737j08J113k14l69K659q21K053k0K66o13n46j646k575K9
11578D796q89k226K8j170j152J6q73K46L76Q21j583j921l163p80l07M186N205
11561A610J541o28q49l060k30K760J887L43o50Q56P66j430o86J301K799j71j232
11544D927j382j243M63m678k049J979J243J325M625J979k767k110m21K882K576
$$ plain form
11529 7349 5947 3565 2546 5368 5345 4211 3023 5413 10338 14657 17692 19037 18425 16476 14397
11514 14397 11538 12862 14524 12785 13021 15577 16679 20192 23458 21491 17768 15936 17250 13831 13729
11499 13729 16924 20265 20346 22213 24440 23140 23517 23580 23279 21637 18277 18895 21008 21721 20139 14977
11483 14977 13231 12873 10633 8030 12384 15521 14449 7653 3735 4981 6439 5854 7433 12500 14535
11468 14535 17289 15963 13449 10999 7838 3457 -223 -864 2795 4960 6894 6250 3645 380 1152
11453 1152 2447 2461 2838 4081 6773 9589 10161 6628 5411 4428 4174 3445 863 3346 4833 6686
11437 6686 13719 16294 17286 14168 17645 20672 20793 20748 24521 23000 23468 24334 23905 21262 19443 18754 13223
11420 13223 9787 11671 12753 13730 12580 9645 10468 9605 6665 6261 4622 6345 7722 8871 12649
$$ packed form
11529G349j402k382j019K822k3j134j188K390M925M319L035J345o12j949k079
11514A4397k859J324J662j739K36K556J102L513L266j967l723j832J314l419j02
11499A3729L195L341Q1J867K227j300L77O3l01j642l360O18K113P13j582n162
11483A4977j746l58k240k603M354L137j072o796l918J246J458n85J579N067K035
11468A4535K754j326k514k450l161m381l680o41L659K165J934o44k605l265P72
11453A152J295J4L77J243K692K816N72l533j217r83k54p29k582K483J487J853
11437F686P033K575R92l118L477L027J21m5L773j521M68Q66m29k643j819o89n531
11420A3223l436J884J082R77j150k935Q23q63k940m04j639J723J377J149L778
$$ plain form
11405 12649 9205 5510 1329 567 2989 6512 10594 10959 7150 7870 10391 8092 6849 9840 13386
11390 13386 11169 8535 8356 10317 13215 9542 7185 5051 5946 10167 10372 8791 11704 11347 9720
11375 9720 6937 7508 8407 7945 7807 11360 10473 8440 3876 577 64 1134 1551 5278 5904 3856 2314
11358 2314 2797 2710 3040 4752 4639 -2085 -3498 -704 2213 3514 3367 4459 3826 1368 5083 6407
11342 6407 5114 5184 6112 8785 10567 13419 15087 14960 15752 15447 13684 11010 11194 12964 14967 15673 15254
11325 15254 13267 11504 8899 9212 8383 8525 8559 7683 5600 5308 3723 3503 3225 5655 7405 9222 8301
11308 8301 8063 6427 8036 7134 7391 9289 5856 7787 11016 10991 9279 8509 7421 8679 8497 11370
11292 11370 12256 11471 14004 14097 14820 15316 12005 11684 10209 11284 8495 8113 10060 8811 7006 2813
$$ packed form
11405A2649l444l695m181p62K422L523M082L65l809P20K521k299j243K991L546
11390A3386k217k634j79J961K898l673k357k134Q95M221K05j581K913l57j627
11375I720k783N71Q99m62j38L553q87k033m564l299n13J070M17L727O26k048j542
11358B314M83q7L30J712j13o724j413K794K917J301j47J092o33k458L715J324
11342F407j293P0R28K673J782K852J668j27P92l05j763k674J84J770K003P06m19
11325A5254j987j763k605L13q29J42L4q76k083k92j585k20k78K430J750J817r21
11308H301k38j636J609r02K57J898l433J931L229k5j712p70j088J258j82K873
11292A1370Q86p85K533R3P23M96l311l21j475J075k789l82J947j249j805m193
$$ plain form
11276 2813 2265 6402 8363 8561 6748 5360 6086 2806 1134 4340 5237 4157 2547 -432 -1443 1045
11260 1045 5845 6172 10780 13475 14370 13415 13195 14295 11594 6506 6106 8786 8149 8944 7504 9338
11244 9338 12157 13181 10360 8353 8211 7750 9178 8973 6392 7694 7058 6435 5435 3626 4041 6791
11228 6791 9296 9932 11125 12383 12775 14437 13933 12110 8426 8383 10958 11657 11073 8651 7737 7653 7355
11211 7355 10583 13454 12942 12232 12786 12681 13743 15437 20250 20317 17396 14552 11936 9737 10524 11345 9716
11194 9716 9317 14321 16367 11378 9218 10323 14237 14300 15323 13459 12655 11945 11702 14304 13296 16538
11178 16538 16202 15713 19490 20439 18922 17012 14183 15534 16606 13108 12434 12471 11771 16791 19602 19284
11162 19284 19647 17307 15435 16962 21609 18975 17615 21873 26581 27468 27860 29346 28759 28247 26883 24541
$$ packed form
11276B813n48M137J961J98j813j388P26l280j672L206Q97j080j610k979j011K488
11260A045M800L27M608K695Q95r55k20J100k701n088m00K680o37P95j440J834
11244I338K819J024k821k007j42m61J428k05k581J302o36o23j000j809M15K750
11228F791K505O36J193J258L92J662n04j823l684m3K575O99n84k422r14q4k98
11211G355L228K871n12p10N54j05J062J694M813O7k921k844k616k199P87Q21j629
11194I716l99N004K046m989k160J105L914O3J023j864q04p10k43K602j008L242
11178A6538l36m89L777R49j517j910k829J351J072l498o74L7p00N020K811l18
11162A9284L63k340j872J527M647k634j360M258M708Q87L92J486n87n12j364k342
$$ plain form
11146 24541 23810 23684 23243 24694 24336 21434 17622 14907 14238 16525 16961 14406 14226 16029 18089 16871
11130 16871 13817 16427 15899 14196 14004 13884 16468 15780 15717 13937 13054 14763 16700 12529 13364 15911
11114 15911 21312 22491 19397 17160 13098 11389 13315 15765 13049 13367 14210 11086 10826 12976 13407
11099 13407 15971 17590 16360 14806 17789 20053 19438 13583 14342 14671 15908 18992 19259 19406 19764 18840
11083 18840 21127 25555 28704 29415 28863 24343 23422 23135 21501 21139 20217 18763 19585 19294 18624 21529 24573
11066 24573 26116 28161 28828 29655 29508 27393 28491 32481 35038 34247 35682 37724 37227 37118 39810 44127
11050 44127 47765 47709 47775 44427 44776 47797 50583 54640 57921 63079 71837 80555 90438 104279 118733
11035 118733 135283 155933 176633 189749 195367 192228 179005 166622 153035 140178 130460 122908
$$ packed form
11146B4541p31j26m41J451l58k902l812k715o69K287M36k555j80J803K060j218
11130A6871l054K610n28j703j92j20K584o88o3j780q83J709J937m171Q35K547
11114A5911N401J179l094k237m062j709J926K450k716L18Q43l124k60K150M31
11099A3407K564J619j230j554K983K264o15n855P59L29J237L084K67J47L58r24
11083A8840K287M428L149P11n52m520r21k87j634l62r22j454Q22k91o70K905L044
11066B4573J543K045O67Q27j47k115J098L990K557p91J435K042m97j09K692M317
11050D4127L638n6O6l348L49L021K786M057L281N158Q758Q718R883J3841J4454
11035A18733J6550K0650K0700J3116N618l139j3223j2383j3587j2857r718p552
$$ plain form
11023 122908 116752 113248 115239 118372 122804 129142 137141 148437 163721 188026 219841 250405 280788
11010 280788 304951 329519 354392 390197 447852 543193 697056 911283 1136224 1303521 1418960
10999 1418960 1553226 1762538 1969419 2028235 1901941 1692919 1515971 1397347 1261946 1071815
10989 1071815 860151 678092 550484 465844 403590 352916 311358 274472 244046 223804 208470
10978 208470 199508 199781 201369 204715 206653 210622 221357 236919 255773 279478 303521 331694 368867
10965 368867 411417 460055 515607 584464 670834 775254 904487 1070870 1280215 1534115
10955 1534115 1826392 2126760 2378976 2516263 2498480 2329851 2059266 1752621 1457252 1199400
10945 1199400 992089 829689 700148 593788 509565 443808 391298 349649 316022 282830
$$ packed form
11023A22908o156l504J991L133M432O338P999J1296J5284K4305L1815L0564L0383
11010B80788K4163K4568K4873L5805N7655R5341J53863K14227K24941J67297J15439
10999A418960J34266K09312K06881N8816j26294k09022j76948j18624j35401j90131
10989A071815k11664j82059j27608q4640o2254n0674m1558l6886l0426k0242j5334
10978B08470q962K73J588L346J938L969J0735J5562J8854K3705K4043K8173L7173
10965C68867M2550M8638N5552O8857Q6370J04420J29233J66383K09345K53900
10955A534115K92277L00368K52216J37287j7783j68629k70585l06645k95369k57852
10945A199400k07311j62400j29541j06360q4223o5757n2510m1649l3627l3192
$$ plain form
10935 282830 254433 232278 212070 192080 174909 161717 150269 143935 136901 132230 129525 126572
10923 126572 124240 120136 111716 106763 104198 99494 98171 100793 98714 96846 96293 100268 106629 119600
10909 119600 141599 168886 199747 232941 270959 303932 322511 329364 317507 286489 250349 213665
10897 213665 177712 146913 128753 116934 105001 95995 91350 86363 82491 78446 78414 81431 79730
10884 79730 82805 88839 92261 97743 108491 124749 149645 179721 214048 252777 286894 311734
10872 311734 322255 311264 287679 255113 214575 176496 148166 129974 118521 113414 107969 106052
10860 106052 107955 106066 109576 118489 129075 136857 144592 162016 186965 223755 272260 322890 366814
10847 366814 392348 384529 351364 307737 263633 221276 192623 172601 159111 146516 135523 129658
$$ packed form
10935B82830k8397k2155k0208j9990j7171j3192j1448o334p034m671k705k953
10923A26572k332m104q420m953k565m704j323K622k079j868n53L975O361J2971
10909A19600K1999K7287L0861L3194L8018L2973J8579O853j1857l1018l6140l6684
10897B13665l5953l0799j8160j1819j1933r006m645m987l872m045l2L017j701
10884G9730L075O034L422N482J0748J6258K4896L0076L4327L8729L4117K4840
10872C11734J0521j0991k3585l2566m0538l8079k8330j8192j1453n107n445j917
10860A06052J903j889L510Q913J0586P782P735J7424K4949L6790M8505N0630M3924
10847C66814K5534p819l3165m3627m4104m2357k8653k0022j3490j2595j0993n865
$$ plain form
10835 129658 122941 118606 116693 114502 109538 107111 103524 101980 100941 97901 91797 83926 78536 77684
10821 77684 76736 73688 72618 68272 63171 61673 63714 62201 56954 57089 58304 61762 62330 60091 59530
10806 59530 59085 60837 58144 57311 58030 58639 56579 56806 55716 52466 54743 59568 57668 52357 48591 48500
10790 48500 50163 52109 50716 50677 50194 46185 47007 47873 43766 42953 44206 44701 44423 45143 44950 42499 39306
10773 39306 43841 47289 44428 41303 39143 38866 42053 48601 51854 54318 57779 65489 75905 85840
10759 85840 97941 103684 105320 101134 89627 81098 73912 67105 62365 59981 57958 56620 57449 60392
10745 60392 58487 59795 62798 67988 68684 67577 67867 64602 62557 58152 53490 52117 50868 51710 51286
10730 51286 48214 45515 47952 47987 46365 46984 46621 45077 46076 46705 45848 45710 43833 42457 45914 47354
$$ packed form
10835A29658o717m335j913k191m964k427l587j544j039l040o104p871n390q52
10821G7684r48l048j070m346n101j498K041j513n247J35J215L458N68k239n61
10806E9530m45J752k693q33P19O09k060K27j090l250K277M825j900n311l766r1
10790D8500J663J946j393l9m83m009Q22Q66m107q13J253M95k78P20j93k451l193
10773C9306M535L448k861l125k160k77L187O548L253K464L461P710J0416R935
10759H5840J2101N743J636m186j1507q529p186o807m740k384k023j338Q29K943
10745F0392j905J308L003N190O96j107K90l265k045m405m662j373j249Q42m24
10730E1286l072k699K437L5j622O19l63j544R99O29q57j38j877j376L457J440
$$ plain form
10714 47354 49907 52697 59308 64468 70495 81722 86930 86877 82856 76453 68880 63356 60165 60230 67348
10699 67348 77130 84736 93055 106074 122644 136018 142928 146830 145811 138748 128732 112939 101308
10686 101308 93499 88760 87058 89919 93459 97640 99477 101414 105138 110135 122058 136557 143441 153096
10672 153096 164995 172656 181497 194058 212330 235067 267133 311015 372358 449239 559105 714240
10660 714240 941091 1256958 1643366 1984010 2118843 1981355 1653432 1272003 945448 702230
10650 702230 533717 419677 337342 280206 237188 205916 180233 162365 146193 135056 128130
10639 128130 122654 116557 114066 112637 109056 104917 104497 102839 98207 95706 95101 91986 86244 86614 85965
10624 85965 84367 83578 84153 80400 81393 83533 81172 79784 79168 79273 80249 78226 74691 71589 69214 66148
$$ packed form
10714D7354K553K790O611N160O027J1227N208n3m021o403p573n524l191O5P118
10699F7348R782P606Q319J3019J6570J3374O910L902j019p063j0016j5793j1631
10686A01308p809m739j702K861L540M181J837J937L724M997J1923J4499O884R655
10672A53096J1899P661Q841J2561J8272K2737L2066M3882O1343P6881J09866J55135
10660G14240K26851L15867L86408L40644J34833j37488l27923l81429l26555k43218
10650G02230j68513j14040q2335n7136m3018l1272k5683j7868j6172j1137o926
10639A28130n476o097k491j429l581m139m20j658m632k501o05l115n742L70o49
10624H5965j598p89N75l753R93K140k361j388o16J05R76k023l535l102k375l066
$$ plain form
10608 66148 65649 63551 60577 59527 63633 67009 67028 69227 71577 71567 69477 65501 63994 65280 66258 68975
10592 68975 71993 73663 71108 70137 75419 75631 76566 79578 80297 81964 80824 81975 84934 85002 85346 89245
10576 89245 87466 88979 92709 94768 95649 97657 98996 97199 96781 93637 86885 68352 49424 36357
10562 36357 30499 30260 34981 39412 43616 45048 46193 44188 46626 53701 60344 65825 73103 78829 77545
10547 77545 73948 73685 72438 68377 63878 58757 56858 59023 58386 61930 64004 66119 68747 71801 74042
10532 74042 76948 81866 83087 83199 86130 86721 87745 91471 101736 112782 119360 123357 126449 127690
10518 127690 129361 127894 124133 124173 128589 131803 132765 136458 134803 133348 132984 131421 130845 129945 129112 131810
10502 131810 136341 142785 153470 168352 190648 217185 236814 247017 263927 291200 311979 327620
$$ packed form
10608F6148m99k098k974j050M106L376J9K199K350j0k090l976j507J286R78K717
10592F8975L018J670k555r71N282K12R35L012P19J667j140J151K959O8L44L899
10576H9245j779J513L730K059Q81K008J339j797m18l144o752j8533j8928j3067
10562C6357n858k39M721M431M204J432J145k005K438P075O643N481P278N726j284
10547G7545l597k63j247m061m499n121j899K165o37L544K074K115K628L054K241
10532G4042K906M918J221J12K931N91J024L726J0265J1046O578L997L092J241
10518A27690J671j467l761M0M416L214R62L693j655j455l64j563n76r00q33K698
10502A31810M531O444J0685J4882K2296K6537J9629J0203J6910K7273K0779J5641
$$ plain form
10490 327620 335007 312824 276499 244161 214356 189573 167338 145321 131590 121926 116266 113468
10478 113468 109248 105274 103939 101182 98723 98792 102908 103819 101929 106329 112740 119423 125145 131668 135011
10463 135011 137150 142456 144134 143096 142772 144317 143345 142403 143170 138963 135489 133346 132161 131080 129650
10448 129650 133417 136905 139346 138152 135044 127842 118445 107932 104949 107186 107964 110308 111034 107509
10434 107509 100596 91930 94621 111987 140853 169391 189700 200784 208675 213865 218189 220025 224781
10421 224781 229199 225986 223731 222788 216913 210682 199800 193839 190811 193488 202048 206658 206732 204391 202030
10406 202030 202451 207098 206401 201067 195027 188747 183005 176808 170981 158616 151057 159693 181539 217528
10392 217528 262340 298961 324101 340679 353012 358467 360354 361258 358281 354948 353237 349938 349304
$$ packed form
10490C27620P387k2183l6325l2338k9805k4783k2235k2017j3731r664n660k798
10478A13468m220l974j335k757k459O9M116R11j890M400O411O683N722O523L343
10463A35011K139N306J678j038l24J545r72r42P67m207l474k143j185j081j430
10448A29650L767L488K441j194l108p202r397j0513k983K237P78K344P26l525
10434A07509o913q666K691J7366K8866K8538K0309J1084P891N190M324J836M756
10421B24781M418l213k255r43n875o231j0882n961l028K677Q560M610P4k341k361
10406B02030M21M647o97n334o040o280n742o197n827j2365p559Q636K1846L5989
10392B17528M4812L6621K5140J6578J2333N455J887R04k977l333j711l299o34
$$ plain form
10379 349304 349318 355176 366769 381439 400809 420088 439136 467027 503455 557123 639812 747409
10367 747409 865531 961579 995748 933408 801280 650306 530480 463797 435120 427351 424795
10356 424795 421303 411589 398347 389487 384570 385806 389821 394527 401764 409041 414794 423272 429883 437441
10342 437441 450625 464003 477609 490548 496964 498115 486712 469124 456912 451348 449914 453909
10330 453909 468258 488192 504251 513409 524313 541266 566279 598693 638761 684118 727523 763497
10318 763497 788194 801500 812339 829868 853691 886328 927438 968778 1009046 1046097 1078020
10307 1078020 1108573 1137446 1163588 1192621 1227259 1260401 1290896 1320601 1350197 1375955 1407562
10296 1407562 1443905 1484332 1527454 1574985 1633505 1703382 1775538 1845358 1914704 1980026 2047775
$$ packed form
10379C49304J4N858J1593J4670J9370J9279J9048K7891L6428N3668Q2689J07597
10367G47409J18122R6048L4169o2340j32128j50974j19826o6683k8677p769k556
10356D24795l492r714j3242q860m917J236M015M706P237P277N753Q478O611P558
10342D37441J3184J3378J3606J2939O416J151j1403j7588j2212n564j434L995
10330D53909J4349J9934J6059R158J0904J6953K5013L2414M0068M5357M3405L5974
10318G63497K4697J3306J0839J7529K3823L2637M1110M1340M0268L7051L1923
10307A078020L0553K8873K6142K9033L4638L3142L0495K9705K9596K5758L1607
10296A407562L6343M0427M3122M7531N8520O9877P2156O9820O9346O5322O7749
$$ plain form
10285 2047775 2116519 2184388 2256500 2329456 2397731 2477343 2574064 2695031 2845767 3022997 3225239
10274 3225239 3441823 3671351 3914269 4165849 4443638 4746349 5080989 5451817 5874165
10265 5874165 6366681 6940535 7601665 8341976 9166762 10095612 11167646 12426314 13873071
10256 13873071 15433663 17003723 18605738 20449424 22803248 25883595 29805397 34658840
10248 34658840 40636432 48106104 57705675 70413199 87698082 111898086 146487077
10241 146487077 195292801 258160851 322678870 363741109 363010758 324473480 264108278
10234 264108278 200697469 148156529 109822894 83074838 64445145 51259085 41676625
10227 41676625 34525408 29087073 24925438 21752121 19336101 17471241 15975873 14651198
$$ packed form
10285B047775O8744O7869P2112P2956O8275P9612R6721J20967J50736J77230K02242
10274C225239K16584K29528K42918K51580K77789L02711L34640L70828M22348
10265E874165M92516N73854O61130P40311Q24786R28850J072034J258668J446757
10256A3873071J560592J570060J602015J843686K353824L080347L921802M853443
10248C4658840N977592P469672R599571J2707524J7284883K4200004L4588991
10241A46487077M8805724O2868050O4518019M1062239p30351l8537278o0365202
10234B64108278o3410809n2540940l8333635k6748056j8629693j3186060r582460
10227D1676625p151217n438335m161635l173317k416020j864860j495368j324675
$$ plain form
10219 14651198 13323576 11937608 10564304 9315118 8264048 7417378 6746044 6216007
10211 6216007 5780750 5400447 5060102 4759023 4485449 4238721 4019604 3821914 3653766
10202 3653766 3506660 3381700 3274035 3179040 3085054 2984885 2875244 2753298 2620395 2486596
10192 2486596 2361311 2246676 2138394 2031711 1931901 1843104 1769795 1715467 1671534 1625000
10182 1625000 1578922 1534815 1488962 1438720 1386894 1328830 1274717 1222444 1175906 1132021 1087792
10171 1087792 1044095 997255 949645 905276 864817 834940 811851 790914 778248 772447 766029 748325
10159 748325 724106 697790 683921 680380 683061 693121 704094 713291 719448 719488 712267 701445 692136
10146 692136 682292 670850 663294 653724 639466 620410 595251 573685 555067 544316 543603 554868
$$ packed form
10219A4651198j327622j385968j373304j249186j051070q46670o71334n30037
10211F216007m35257l80303l40345l01079k73574k46728k19117j97690j68148
10202C653766j47106j24960j07665r4995r3986j00169j09641j21946j32903j33799
10192B486596j25285j14635j08282j06683r9810q8797p3309n4328m3933m6534
10182A625000m6078m4107m5853n0242n1826n8064n4113n2273m6538m3885m4229
10171A087792m3697m6840m7610m4369m0459k9877k3089k0937j2666n801o418j7704
10159G48325k4219k6316j3869l541K681J0060J0973R197O157M0p221j0822r309
10146F92136r844j1442p556r570j4258j9056k5159k1566j8618j0751p13J1265
$$ plain form
10134 554868 572810 595292 625718 669244 714266 763116 795021 802008 777748 734819 682636 632371
10122 632371 589403 553732 524774 508620 503152 517433 548083 585118 618962 641346 643466 633985
10110 633985 621637 589743 541000 489967 446305 410293 379663 354305 334818 318014 304641
10099 304641 294200 285249 274848 269079 261001 250171 242876 234302 226207 217420 208126 201461 200195
10086 200195 200860 205756 220201 243784 273902 302530 314992 317088 310254 293810 280836 268177
10074 268177 257079 244871 236272 227794 226575 226799 222426 222292 224764 227691 227270 224579 219295 209873
10060 209873 196710 182720 170464 162905 159893 158307 155981 154727 154424 152694 148306 142325 139786 144325
10046 144325 158816 178614 206293 232208 245986 246386 239778 232514 230451 230583 237191 244388 250103
$$ packed form
10134E54868J7942K2482L0426M3526M5022M8850L1905O987k4260m2929n2183n0265
10122F32371m2968l5671k8958j6154n468J4281L0650L7035L3844K2384K120r481
10110F33985j2348l1894m8743n1033m3662l6012l0630k5358j9487j6804j3373
10099C04641j0441q951j0401n769q078j0830p295q574q095q787r294o665j266
10086B00195O65M896J4445K3583L0118K8628J2462K096o834j6444j2974j2659
10074B68177j1098j2208q599q478j219K24m373j34K472K927m21k691n284r422
10060B09873j3163j3990j2256p559l012j586k326j254l03j730m388n981k539M539
10046A44325J4491J9798K7679K5915J3778M00o608p264k063J32O608P197N715
$$ plain form
10033 250103 257271 255715 253403 258719 273787 297228 336149 388147 459370 546324 640224 722329
10021 722329 761460 734428 653819 550351 452974 374118 317390 280173 252992 237777 232897
10010 232897 230942 229386 229169 233392 237394 242677 247776 253128 260442 271064 284155 302785 323483
9997 323483 344727 371343 403090 447454 507765 585578 694223 843190 1035087 1270846 1517070
9986 1517070 1707673 1787646 1743799 1607602 1425771 1221897 1022012 840628 689202 572852
9976 572852 485057 421793 371314 331680 298386 270266 249055 229184 210886 199186 190020 178564
9964 178564 169053 165312 161258 158305 161414 157828 155666 153154 154951 158090 165635 174353 183834 197109
9950 197109 212268 227159 235893 237898 235257 225152 210671 194542 182378 173176 163421 160699 156572
$$ packed form
10033B50103P168j556k312N316J5068K3441L8921N1998P1223Q6954R3900Q2105
10021G22329L9131k7032q0609j03468r7377p8856n6728l7217k7181j5215m880
10010B32897j955j556k17M223M002N283N099N352P314J0622J3091J8630K0698
9997C23483K1244K6616L1747M4364O0311P7813J08645J48967J91897K35759K46224
9986A517070J90603P9973m3847j36197j81831k03874j99885j81384j51426j16350
9976E72852q7795o3264n0479l9634l3294k8120k1211j9871j8298j1700r166j1456
9964A78564r511l741m054k953L109l586k162k512J797L139P545Q718R481J3275
9950A97109J5159J4891Q734K005k641j0105j4481j6129j2164r202r755k722m127
$$ plain form
9937 156572 151305 151154 148457 145596 147961 150162 151172 149391 141664 137146 137549 139501 147724 156631 164361
9922 164361 170175 176373 186869 193700 197270 203313 212714 226920 246124 264573 286515 308330 336734
9909 336734 387923 469139 562492 638853 666572 648670 606824 568044 550748 555455 570993 587167
9897 587167 595959 600835 604268 603155 584097 538493 472411 400451 336361 285545 244474 213069
9885 213069 189419 172651 160773 152191 145689 140363 134455 128773 123299 115135 109985 109551 109063 113012
9871 113012 116547 114316 110259 108679 109569 109991 107833 107606 111015 113660 117570 118334 118064 118980 117572 119311
9855 119311 125923 128243 130993 128293 124801 117084 109685 111126 109353 107726 108189 108788 114016 118123 120348
9840 120348 126083 139419 150311 162539 173576 179746 189006 202993 214850 229535 240965 250836
$$ packed form
9937A56572n267j51k697k861K365K201J010j781p727m518M03J952Q223Q907P730
9922A64361N814O198J0496O831L570O043R401J4206J9204J8449K1942K1815K8404
9909C36734N1189Q1216R3353P6361K7719j7902m1846l8780j7296M707J5538J6174
9897E87167Q792M876L433j113j9058m5604o6082p1960o4090n0816m1071l1405
9885B13069k3650j6768j1878q582o502n326n908n682n474q164n150m34m88L949
9871A13012L535k231m057j580Q90M22k158k27L409K645L910P64k70R16j408J739
9855A19311O612K320K750k700l492p717p399J441j773j627M63N99N228M107K225
9840A20348N735J3336J0892J2228J1037O170R260J3987J1857J4685J1430R871
$$ plain form
9828 250836 258873 268457 283691 304954 330141 365712 412140 467145 535543 628580 766305 966616
9816 966616 1252325 1629695 2046765 2354012 2398206 2164857 1776838 1377284 1053734 816975
9806 816975 650414 537231 464822 416654 385104 361922 344142 329749 314785 301684 292715
9795 292715 285123 277817 272673 271790 271880 272481 275318 279054 285246 296699 308658 322747 336685 351833
9781 351833 363438 369314 378922 392752 395026 383428 360854 334696 318061 307723 305262 306147 308023
9768 308023 304651 308038 320088 341956 364297 391488 424492 454728 478569 478540 449294 401428 355603
9755 355603 314912 284547 262969 250323 241405 232892 227713 230312 236699 239501 240489 241142 241079 242767
9741 242767 242369 243438 245920 250627 257730 266503 278121 289176 313417 351403 393940 430963 449677
$$ packed form
9828B50836Q037R584J5234K1263K5187L5571M6428N5005O8398R3037J37725K00311
9816I66616K85709L77370M17070L07247M4194k33349l88019l99554l23550k36759
9806H16975j66561j13183p2409m8168l1550k3182j7780j4393j4964j3101q969
9795B92715p592p306n144q83R0O01K837L736O192J1453J1959J4089J3938J5148
9781C51833J1605N876R608J3830K274j1598k2574k6158j6635j0338k461Q85J876
9768C08023l372L387J2050K1868K2341K7191L3004L0236K3841k9k9246m7866m5825
9755C55603m0691l0365k1578j2646q918q513n179K599O387K802R88O53o3J688
9741B42767l98J069K482M707P103Q773J1618J1055K4241L7986M2537L7023J8714
$$ plain form
9728 449677 455099 458172 465613 485587 509152 530512 540983 538688 517719 490614 469881 462562 470491
9715 470491 488033 501342 501981 484316 460143 441590 428142 425936 429711 434965 447964 463731 483515
9702 483515 500299 520209 538070 551974 569452 590909 616773 647019 679140 723643 774718 832925
9690 832925 901495 975406 1054055 1146943 1254678 1374876 1521851 1702214 1921889 2207131
9680 2207131 2570578 3033920 3618542 4354643 5254650 6301916 7399100 8355734 8922169
9671 8922169 8915954 8335807 7363775 6244838 5178849 4272391 3547912 2980811 2541279 2200813
9661 2200813 1926786 1713700 1550035 1422353 1324295 1246948 1179960 1121345 1073374 1035105 1002912
9650 1002912 972511 945432 909556 862834 813358 765717 727284 691490 662649 640898 617869
$$ packed form
9728D49677N422L073P441J9974K3565K1360J0471k295k0969k7105k0733p319P929
9715D70491J7542J3309O39j7665k4173j8553j3448k206L775N254J2999J5767J9784
9702D83515J6784J9910J7861J3904J7478K1457K5864L0246L2121M4503N1075N8207
9690H32925O8570P3911P8649R2888J07735J20198J46975J80363K19675K85242
9680B207131L63447M63342N84622P36101R00007J047266J097184R56634N66435
9671H922169o215n80147r72032j118937j065989r06458p24479n67101m39532l40466
9661B200813k74027k13086j63665j27682r8058p7347o6988n8615m7971l8269l2193
9650A002912l0401k7079l5876m6722m9476m7641l8433l5794k8841k1751k3029
$$ plain form
9639 617869 594918 575968 561369 549826 542125 542190 542151 536043 528970 521074 519297 534199 555246 573802
9625 573802 577226 562624 537432 510975 482049 445989 415971 402815 399922 399839 389053 373324 352660
9612 352660 330572 308710 290739 280239 271554 264273 261164 260650 259182 262232 265247 268859 282616
9599 282616 307321 335525 377253 440352 519801 593364 654707 693468 700271 670831 607946 525372
9587 525372 441456 365509 305648 264495 239504 221084 211149 208586 215013 221310 218043 212202 209574
9574 209574 210121 204827 198434 188132 175123 165942 155799 145906 142406 145463 149692 152731 152894 160627
9560 160627 165579 167028 167088 160647 152907 144658 135593 128694 119699 116632 115515 112265 110429 107641 103453
9545 103453 100674 101067 94155 90947 89554 89984 87300 81677 83377 84669 87008 87371 85878 85911 82813 82565
$$ packed form
9639F17869k2951j8950j4599j1543p701O5l9o108p073p896j777J4902K1047J8556
9625E73802L424j4602k5192k6457k8926l6060l0018j3156k893q3j0786j5729k0664
9612C52660k2088k1862j7971j0500q685p281l109n14j468L050L015L612J3757
9599B82616K4705K8204M1728O3099P9449P3563O1343L8761O803k9440o2885q2574
9587E25372q3916p5947n9861m1153k4991j8420r935k563O427O297l267n841k628
9574B09574N47n294o393j0302j3009r181j0143r893l500L057M229L039J63P733
9560A60627M952J449O0o441p740q249r065o899q995l067j117l250j836k788m188
9545A03453k779L93o912l208j393M30k684n623J700J292K339L63j493L3l098k48
$$ plain form
9529 82565 83274 82388 84313 84849 82648 77076 74294 73689 79032 80565 82512 78448 76209 76000 75011 72875
9513 72875 69803 67040 66127 64248 63369 62360 63467 70291 70456 69949 71903 71829 68688 68325 69897 68230
9497 68230 66060 66472 64117 61774 64218 65352 67489 68570 67396 67238 65631 62296 62128 64510 68369
9482 68369 71354 72766 72043 72136 73195 73637 77253 84004 84461 83729 88214 89720 93385 99814 105566 109005
9466 109005 110424 114716 115600 111856 107551 99490 90672 84840 77530 71825 69625 69722 69685 72365 71209 68361
9450 68361 69229 71146 67158 57661 55783 60890 61961 59737 61494 60557 60267 60405 61263 60220 60215 57118 56766
9433 56766 62724 64728 67015 65933 62929 64030 66711 64523 63680 63969 63919 60246 58374 59219 59231 58688 53958
9416 53958 55219 57891 58764 57418 55137 54671 55318 56582 57220 56025 53789 55701 57943 57433 55957 54780
$$ packed form
9529H2565P09q86J925N36k201n572k782o05N343J533J947m064k239k09r89k136
9513G2875l072k763r13j879q79j009J107O824J65n07J954p4l141l63J572j667
9497F8230k170M12k355k343K444J134K137J081j174j58j607l335j68K382L859
9482F8369K985J412p23R3J059M42L616O751M57p32M485J506L665O429N752L439
9466A09005J419M292Q84l744m305q061q818n832p310n705k200R7l7K680j156k848
9450F8361Q68J917l988r497j878N107J071k224J757r37k90J38Q58j043nl097l52
9433E6766N958K004K287j082l004J101K681k188q43K89n0l673j872Q45J2n43m730
9416E3958J261K672Q73j346k281m66O47J264O38j195k236J912K242n10j476j177
$$ plain form
9400 54780 53946 50256 49053 50836 50875 51716 52245 52751 54717 55761 55943 54277 57272 58313 58162 55754 56276
9383 56276 54909 52032 50777 49966 51127 51874 56210 54309 47010 43698 47460 50049 49864 52055 52175 48753
9367 48753 46259 46674 50469 54855 55721 53611 52280 55125 57118 55427 54114 56984 58445 60179 64118
9352 64118 60754 58289 57474 58552 58279 59153 60414 62437 60492 56272 56888 57758 58335 59664 61910 58442
9336 58442 59510 63041 61661 63501 64474 65594 66721 64374 64492 65592 64779 64557 63933 62883 64114 67509
9320 67509 68307 68185 67913 67008 65406 64564 64603 67033 70219 71616 72998 72820 71574 70400 69874 69072 71280
9303 71280 68360 66877 67812 70177 70880 71524 74347 73526 72707 75691 77667 76599 73678 74178 73622 73170 72519
9286 72519 72964 72080 71382 69081 69077 70347 70668 72225 75683 72629 70981 73344 77237 80963 83979 86946
$$ packed form
9400E4780q34l690j203J783L9Q41N29N06J966J044J82j666K995J041j51k408N22
9383E6276j367k877j255q11J161P47M336j901p299l312L762K589j85K191J20l422
9367D8753k494M15L795M386Q66k110j331K845J993j691j313K870J461J734L939
9352F4118l364k465q15J078k73Q74J261K023j945m220O16Q70N77J329K246l468
9336E8442J068L531j380J840R73J120J127k347J18J100q13k22o24j050J231L395
9320F7509P98j22k72r05j602q42L9K430L186J397J382j78j246j174n26q02K208
9303G1280k920j483R35K365P03O44K823q21q19K984J976j068k921N00n56m52o51
9286G2519M45q84o98k301mJ270L21J557L458l054j648K363L893L726L016K967
$$ plain form
9270 86946 87706 85979 81024 79150 81407 81703 81775 81367 83299 82354 84775 87514 87190 91454 97314 98971
9254 98971 100120 102414 106247 113458 121525 125458 129097 132100 131344 129640 127492 127101 125291 119271 115218
9239 115218 113094 112730 110696 110518 112231 113745 114715 116090 114923 113233 116340 119314 122395 124366 122164
9224 122164 126919 131122 132601 136961 140299 144630 154084 163268 166748 174663 181117 185190 191348 198671
9210 198671 201982 199257 196531 194363 191616 191144 189431 183121 180024 177108 176331 169684 161361 156444 155681
9195 155681 155643 153855 152198 149197 146023 141913 141312 141954 140530 142344 144443 145894 144948 141036 139622 140047
9179 140047 141802 143943 144276 143755 142686 142485 147922 150788 150568 150893 148642 149580 149265 145529 146015 148198
9163 148198 149006 148369 150675 151840 154480 152421 151352 154403 157184 162033 163092 162148 163785 169904 173365
$$ packed form
9270H6946P60j727m955j874K257K96P2m08J932r45K421K739l24M264N860J657
9254I8971J149K294L833P211Q067L933L639L003p56j704k148l91j810o020m053
9239A15218k124l64k034j78J713J514R70J375j167j690L107K974L081J971k202
9224A22164M755M203J479M360L338M331R454R184L480P915O454M073O158P323
9210A98671L311k725k726k168k747m72j713o310l097k916p77o647q323m917p63
9195A55681l8j788j657l001l174m110o01O42j424J814K099J451r46l912j414M25
9179A40047J755K141L33n21j069k01N437K866k20L25k251R38l15l736M86K183
9163A48198Q08o37K306J165K640k059j069L051K781M849J059r44J637O119L461
$$ plain form
9148 173365 176477 177437 179484 183136 186335 191788 195203 193626 193577 196728 197366 199015 198549 198749 200667 199848
9132 199848 202398 203462 204289 208967 212327 215035 215451 215232 216416 217137 221525 225331 226922 231751 236231
9117 236231 240687 243327 243385 248175 253230 257849 262849 266920 275658 281566 284721 290625 295652 304018 309029
9102 309029 312697 318292 324037 330409 339562 347759 354895 361400 371034 379854 386839 395540 407512 419323
9088 419323 427045 431619 434392 438642 440069 439806 439797 439617 439616 442008 444357 448271 453279 454065 456274 460653 460437
9071 460437 462155 465724 470995 476181 480411 485663 492759 496865 501372 510781 519574 526433 535437 542586
9057 542586 553491 564515 572932 577905 584548 595214 604751 618048 632824 644290 657096 670959
9045 670959 688206 704988 722258 740480 755846 774131 793600 809728 831553 854192 881916 904115
$$ packed form
9148A73365L112R60K047L652L199N453L415j577m9L151O38J649m66K00J918q19
9132A99848K550J064Q27M678L360K708M16k19J184P21M388L806J591M829M480
9117B36231M456K640N8M790N055M619N000M071Q738N908L155N904N027Q366N011
9102C09029L668N595N745O372R153Q197P136O505R634Q820O985Q701J1972J1811
9088D19323P722M574K773M250J427k63rj80jK392K349L914N008P86K209M379k16
9071D60437J718L569N271N186M230N252P096M106M507R409Q793O859R004P149
9057E42586J0905J1024Q417M973O643J0666R537J3297J4776J1466J2806J3863
9045F70959J7247J6782J7270J8222J5366J8285J9469J6128K1825K2639K7724K2199
$$ plain form
9033 904115 925072 946218 967620 994701 1023360 1047224 1077290 1108677 1138418 1170205 1199968 1230326
9021 1230326 1268922 1305366 1346457 1388487 1433542 1478989 1531184 1584105 1636518 1695279 1761437
9010 1761437 1827360 1895749 1973537 2049731 2130339 2216039 2305623 2407057 2517402 2626736 2743368
8999 2743368 2866377 3003736 3152815 3312238 3482008 3666141 3863880 4082551 4319222 4572752
8989 4572752 4850810 5150225 5479267 5834944 6220773 6648909 7122283 7643703 8217757 8851590
8979 8851590 9555968 10337430 11204872 12180931 13277924 14504332 15882171 17433560 19171200
8970 19171200 21111300 23281195 25686017 28327847 31195122 34248025 37417866 40587010
8962 40587010 43596280 46251219 48334978 49653606 50065881 49517303 48059003 45841867
$$ packed form
9033I04115K0957K1146K1402K7081K8659K3864L0066L1387K9741L1787K9763L0358
9021A230326L8596L6444M1091M2030M5055M5447N2195N2921N2413N8761O6158
9010A761437O5923O8389P7788P6194Q0608Q5700Q9584J01434J10345J09334J16632
8999B743368J23009J37359J49079J59423J69770J84133J97739K18671K36671K53530
8989D572752K78058K99415L29042L55677L85829M28136M73374N21420N74054O33833
8979H851590P04378P81462Q67442R76059J096993J226408J377839J551389J737640
8970A9171200J940100K169895K404822K641830K867275L052903L169841L169144
8962D0587010L009270K654939K083759J318628M12275n48578j458300k217136
$$ plain form
8954 45841867 43062421 39939107 36672182 33427394 30321741 27423993 24771597 22373404
8946 22373404 20227704 18315809 16615712 15109762 13781774 12598811 11544049 10603680
8938 10603680 9765414 9016038 8347082 7745717 7209223 6726543 6286819 5892732 5532680
8929 5532680 5201875 4901577 4630519 4379521 4144536 3930434 3734595 3550240 3382533 3228656
8919 3228656 3083370 2943867 2813759 2691931 2578597 2470117 2372924 2276655 2186054 2103440
8909 2103440 2028617 1954699 1885114 1822503 1759723 1700761 1644290 1588000 1538349 1492023 1447898
8898 1447898 1401624 1356034 1313525 1270933 1232180 1195561 1156924 1120900 1088145 1058059 1029261
8887 1029261 1003296 978952 954804 928394 904066 885233 866109 843208 822286 803731 786218
$$ packed form
8954D5841867k779446l123314l266925l244788l105653k897748k652396k398193
8946B2373404k145700j911895j700097j505950j327988j182963j054762r40369
8938A0603680q38266p49376o68956o01365n36494m82680m39724l94087l60052
8929E532680l30805l00298k71058k50998k34985k14102j95839j84355j67707j53877
8919C228656j45286j39503j30108j21828j13334j08480r7193r6269r0601q2614
8909B103440p4823p3918o9585o2611o2780n8962n6471n6290m9651m6326m4125
8898A447898m6274m5590m2509m2592l8753l6619l8637l6024l2755l0086k8798
8887A029261k5965k4344k4148k6410k4328j8833j9124k2901k0922j8555j7513
$$ plain form
8876 786218 771681 757650 743131 730635 718056 704187 692056 673081 657966 644806 635571 625294
8864 625294 614126 603976 591874 577656 565302 558078 550483 538173 526477 517556 508834 501881 494982
8851 494982 489570 483622 478642 472178 463958 457604 454184 447607 445071 443512 436426 427545 423182 420250
8837 420250 417951 417343 411610 407530 404641 401827 399892 393845 386030 376450 368667 366062 359909 352806 346362
8822 346362 343055 341892 337812 329907 321762 319078 309518 301393 294275 286301 282061 275541 271598 269125
8808 269125 269632 265082 263901 259829 256303 253728 254800 252609 252328 251825 249282 247748 244576 241370 241517
8793 241517 245660 248820 250507 246075 235694 230647 226490 222701 218910 217735 217523 218072 215301 211167 208817
8778 208817 207187 204311 202045 197457 193812 199820 202102 198989 195452 194791 197432 197455 194000 193724 193723 195566
$$ packed form
8876G86218j4537j4031j4519j2496j2579j3869j2131j8975j5115j3160r235j0277
8864F25294j1168j0150j2102j4218j2354p224p595j2310j1696q921q722o953o899
8851D94982n412n948m980o464q220o354l420o577k536j559p086q881m363k932
8837D20250k299o08n733m080k889k814j935o047p815r580p783k605o153p103o444
8822C46362l307j163m080p905q145k684r560q125p118p974m240o520l943k473
8808B69125N07m550j181m072l526k575J072k191k81n03k543j534l172l206J47
8793B41517M143L160J687m432j0381n047m157l789l791j175k12N49k771m134k350
8778B08817j630k876k266m588l645O008K282l113l537o61K641K3l455k76jJ843
$$ plain form
8762 195566 196866 199844 202579 206687 209429 211902 221588 231188 237232 240619 243013 234867 226120 218820
8748 218820 210760 201156 194171 190902 190355 187414 183400 181147 177017 172599 171428 169787 168059 164827 162004
8733 162004 162207 162638 164928 164890 164921 163838 165327 168702 168121 173312 181095 187681 198247 205834 212210 212685
8717 212685 204320 196726 189252 181209 173547 167575 162366 159355 154875 152198 154462 152232 154197 154050 151843
8702 151843 149331 148707 151630 152837 148641 142920 143789 143967 139888 137084 136217 136992 139705 141630 139382 136788
8686 136788 134620 133482 130805 125995 126024 130062 134438 136087 135571 132622 130643 132494 133400 133070 134633 137315
8670 137315 140170 139714 138948 140484 142509 143970 144182 143356 142348 140457 140090 140757 142014 142910 144239 141087
8654 141087 141938 144175 146703 149145 150632 152852 152881 152583 152913 151555 151916 151153 152683 157762 162072 163212
$$ packed form
8762A95566J300K978K735M108K742K473R686R600O044L387K394q146q747p300
8748B18820q060r604o985l269n47k941m014k253m130m418j171j641j728l232k823
8733A62004K03M31K290l8L1j083J489L375n81N191P783O586J0566P587O376M75
8717B12685q365p594p474q043p662n972n209l011m480k677K264k230J965j47k207
8702A51843k512o24K923J207m196n721Q69J78m079k804q67P75K713J925k248k594
8686A36788k168j138k677m810K9M038M376J649n16k949j979J851R06l30J563K682
8670A37315K855m56p66J536K025J461K12q26j008j891l67O67J257Q96J329l152
8654A41087Q51K237K528K442J487K220K9k98L30j358L61p63J530N079M310J140
$$ plain form
8638 163212 163341 165353 163450 163519 160385 159825 160204 155957 155409 155757 157611 158327 157422 156674 155664 153132 152721
8621 152721 150400 146690 148437 151254 155627 160785 166576 169615 167577 162923 164364 166939 165256 165195 168355
8606 168355 172010 175070 173768 175425 180724 183920 183966 182961 181179 180386 180827 180334 180910 179499 178652 180444
8590 180444 180512 182844 183871 181428 180107 178432 178584 180880 180585 182779 183759 182953 182398 185692 189388 189951
8574 189951 189185 192576 193016 192323 194248 197065 198011 202674 210558 216089 220067 222294 221907 224340 227730 229060
8558 229060 225463 222447 224510 229797 234714 235863 239493 246378 250598 254877 262435 270779 277425 286302
8544 286302 293505 298485 307363 324208 341712 361549 379564 390504 400555 410188 423374 442095
8532 442095 462392 489537 525417 563459 604391 650844 699989 744538 773263 775590 748226 698805
$$ packed form
8638A63212J29K012j903O9l134n60L79m247n48L48J854P16r05p48j010k532m11
8621A52721k321l710J747K817M373N158N791L039k038m654J441K575j683o1L160
8606A68355L655L060j302J657N299L196M6j005j782p93M41m93N76j411q47J792
8590A80444O8K332J027k443j321j675J52K296k95K194R80q06n55L294L696N63
8574A89951p66L391M40o93J925K817R46M663P884N531L978K227l87K433L390J330
8558B29060l597l016K063N287M917J149L630O885M220M279P558Q344O646Q877
8544B86302P203M980Q878J6845J7504J9837J8015J0940J0051R633J3186J8721
8532D42095K0297K7145L5880L8042M0932M6453M9145M4549K8725K327k7364m9421
$$ plain form
8520 698805 642443 585843 531263 482578 440398 403879 371966 341207 314753 301129 285419 267272
8508 267272 249855 236682 226777 218138 210345 201694 194179 188634 186535 181973 181816 181034 184367 194388
8494 194388 208616 224098 224868 209389 184310 162523 145280 142850 138697 134855 133435 130932 125969
8481 125969 119539 114207 109726 104947 105506 107893 105847 100392 96965 95854 96478 93293 87595 86727 88411
8466 88411 85436 84186 82604 80060 79967 81769 82527 82146 82675 80244 78396 79983 83706 85821 88656 92617
8450 92617 98637 108000 118758 125191 128446 122513 115348 111047 115804 123337 132331 147895 166126 187390
8436 187390 207778 221821 228053 221709 205803 187369 167656 147878 132441 120725 112924 107541
8424 107541 100813 93559 87836 83078 82363 78376 75076 74676 74125 72741 71654 72225 78090 82438 82801 83296
$$ packed form
8520F98805n6362n6600n4580m8685m2180l6519l1913l0759k6454j3624j5710j8147
8508B67272j7417j3173r905q639p793q651p515n545k099m562j57p82L333J0021
8494A94388J4228J5482P70j5479k5079k1787j7243k430m153l842j420k503m963
8481A25969o430n332m481m779N59K387k046n455l427j111O24l185n698q68J684
8466H8411k975j250j582k544r3J802P58l81N29k431j848J587L723K115K835L961
8450I2617O020R363J0758O433L255n933p165m301M757P533Q994J5564J8231K1264
8436A87390K0388J4043O232o344j5906j8434j9713j9778j5437j1716p801n383
8424A07541o728p254n723m758p15l987l300m00n51j384j087N71N865M348L63M95
$$ plain form
8408 83296 87347 92780 95844 102430 109672 118202 126201 146426 169500 191966 210829 219578 216790 204801
8394 204801 182302 156407 135736 122643 115514 107743 103553 100344 96609 94405 95127 92309 93103 92449
8380 92449 90567 88753 88771 87280 89948 90438 91879 89197 85325 83180 81562 80074 77236 77883 77972 75257
8364 75257 73873 73329 75411 76370 76105 76286 76924 75959 74134 73726 75036 75746 78189 86174 91362 91478 95788
8347 95788 106208 114844 118595 119273 122026 121514 124191 136131 147271 157261 162971 159784 153138 142736
8333 142736 132244 129259 128870 124781 119186 117203 114693 111732 103824 95559 92666 85288 81318 80225
8319 80225 80364 81571 81296 80733 76187 75253 75752 74813 76248 81571 87363 96833 105696 111715 112568 113350 114515
8302 114515 118477 124372 136643 148030 158558 163118 156981 145534 129884 114966 104547 96408 89207
$$ packed form
8408H3296M051N433L064O586P242Q530P999K0225K3074K2466J8863Q749k788j1989
8394B04801k2499k5895k0671j3093p129p771m190l209l735k204P22k818P94o54
8380I2449j882j814J8j491K668M90J441k682l872k145j618j488k838O47Q9k715
8364G5257j384n44K082R59k65J81O38r65j825m08J310P10K443P985N188J16M310
8347I5788J0420Q636L751O78K753n12K677J1940J1140R990N710l187o646j0402
8333A42736j0492k985l89m089n595j983k510k961p908q265k893p378l970j093
8319H0225J39J207k75n63m546r34M99r39J435N323N792R470Q863O019Q53P82J165
8302A14515L962N895J2271J1387J0528M560o137j1447j5650j4918j0419q139p201
$$ plain form
8289 89207 86751 85854 87121 88239 87438 90101 95101 97391 99209 92084 83639 75199 66519 62553 61123
8274 61123 62526 62723 61218 60190 58487 63154 68516 67688 69339 68553 66135 65568 67874 71996 75801 82648
8258 82648 81897 73160 66702 60483 55784 47591 42901 40351 40657 40815 41507 43533 43112 44991 47426 46859
8242 46859 43122 39433 36468 30867 31129 35923 37302 42023 47177 48830 44359 37832 32733 27600 24333
8227 24333 24276 25881 28499 27382 22942 22338 23148 27604 26789 24938 23959 25293 27900 28467 27892 26554 26220
8210 26220 23591 24822 29385 31544 33897 33523 33664 29853 26799 25293 25844 26217 28746 28117 27557 26503
8194 26503 23887 23388 22686 22409 22689 23746 25434 33161 35562 37015 44768 56840 71858 84286 93409
8179 93409 91078 84113 68684 50407 35281 22264 15387 11211 12934 15038 19408 23277 22871 24911
$$ packed form
8289H9207k456q97J267J118q01K663N000K290J818p125q445q440q680l966j430
8274F1123J403J97j505j028j703M667N362q28J651p86k418n67K306M122L805O847
8258H2648p51q737o458o219m699q193m690k550L06J58O92K026m21J879K435n67
8242D6859l737l689k965n601K62M794J379M721N154J653m471o527n099n133l267
8227B4333n7J605K618j117m440o04Q10M456q15j851r79J334K607N67n75j338l34
8210B6220k629J231M563K159K353l74J41l811l054j506N51L73K529o29n60j054
8194B6503k616m99p02k77K80J057J688P727K401J453P753J2072J5018J2428R123
8179I3409k331o965j5429j8277j5126j3017o877m176J723K104M370L869m06K040
$$ plain form
8165 24911 29491 31734 32615 30901 29082 26048 26063 25146 23526 22984 23740 25838 25716 26315 24222 21887 20755
8148 20755 23758 25781 24635 21927 23095 26591 26579 24503 20750 17800 18117 20147 22172 21615 23969 23027
8132 23027 23900 26060 27065 26546 24271 24518 28880 29719 28414 28253 23726 22316 21964 23285 24205 24264 26230
8115 26230 24211 22614 25083 27942 27342 27567 29692 31952 30463 30022 29812 28619 28219 27954 28717 30485
8099 30485 33342 31461 29460 30221 34351 37653 38018 35117 34805 36657 36026 32840 32753 33064 33111 35930 35862
8082 35862 34606 35989 36797 40646 42841 40684 38803 44630 51717 56237 62139 74398 87304 95706
8068 95706 96178 87893 76827 68322 63296 60524 56537 55000 55608 57113 56574 56191 52393 50912 49343
8053 49343 47221 46404 42333 39043 36726 38965 40045 40859 41202 43929 47460 53105 58182 64423 70615
$$ packed form
8165B4911M580K243Q81j714j819l034J5r17j620n42P56K098j22N99k093k335j132
8148B0755L003K023j146k708J168L496j2k076l753k950L17K030K025n57K354r42
8132B3027Q73K160J005n19k275K47M362Q39j305j61m527j410l52J321R20N9J966
8115B6230k019j597K469K859o00K25K125K260j489m41k10j193m00k65P63J768
8099C0485K857j881k001P61M130L302L65k901l12J852o31l186q7L11M7K819o8
8082C5862j256J383Q08L849K195k157j881N827P087M520N902J2259J2906Q402
8068I5706M72q285j1066q505n026k772l987j537O08J505n39l83l798j481j569
8053D9343k122q17m071l290k317K239J080Q14L43K727L531N645N077O241O192
$$ plain form
8038 70615 74247 72041 68957 67674 70636 68899 70123 72451 73683 75811 82118 92409 111908 132031
8024 132031 149840 156891 152167 134898 114819 95842 82185 75097 71809 69678 67779 62206 60646
8011 60646 60074 59321 59992 61885 59699 56690 54684 55896 54710 54298 55370 55616 57080 60229 64953 68240
7995 68240 73814 82569 95074 105596 109805 110325 105496 99765 96374 90128 87040 87070 89567 90143 94318
7980 94318 105841 115686 123077 124188 122433 116675 108661 103652 97392 97652 100624 105618 107839 112183 115566
7965 115566 122545 127632 128318 128519 123763 122360 123448 123570 125556 128879 131938 136273 137087 136191 136124 136214 136809
7948 136809 140034 143108 142138 139154 138634 136581 136819 134058 129929 125566 122244 121039 122358 124223 125630
7933 125630 129142 135100 134207 135988 142706 150850 159784 165162 168218 173510 176416 180342 184724 192742 202118
$$ packed form
8038G0615L632k206l084j283K962j737J224K328J232K128O307J0291J9499K0123
8024A32031J7809P051m724j7269k0079j8977j3657p088l288k131j899n573j560
8011F0646n72p53O71J893k186l009k006J212j186m12J072K46J464L149M724L287
7995F8240N574Q755J2505J0522M209N20m829n731l391o246l088L0K497N76M175
7980I4318J1523R845P391J111j755n758q014n009o260K60K972M994K221M344L383
7965A15566O979N087O86K01m756j403J088J22J986L323L059M335Q14q96o7R0N95
7948A36809L225L074r70k984n20k053K38k761m129m363l322j205J319J865J407
7933A25630L512N958q93J781O718Q144Q934N378L056N292K906L926M382Q018R376
$$ plain form
7918 202118 210908 213648 213926 213572 210225 209312 204823 195084 187329 177386 164704 151987 140297 131921
7904 131921 125467 123034 122053 119402 120823 122266 124960 124598 127032 129403 128923 127051 124569 121670 123261
7889 123261 119732 115624 112703 113532 118342 118516 122306 128834 133338 133094 129483 129500 131771 132447 133324 130112
7873 130112 126477 126776 125186 125682 119983 113789 109835 106963 102065 98821 94751 90995 89949 86127 87339
7858 87339 86974 84359 84524 87287 85667 81382 75825 74247 73078 72925 72913 73320 76778 80059 83732 82114
7842 82114 88081 98716 113672 130333 134580 126397 116297 100194 84508 75407 67339 60039 57748
7829 57748 53193 50266 47174 44146 45964 45759 42858 40987 41093 40804 42032 39562 38499 41223 40861 40279
7813 40279 42683 42464 40259 37472 37433 36484 35186 32837 31186 33250 36853 43142 48315 54952 67419
$$ packed form
7918B02118Q790K740K78l54l347r13m489r739p755r943j2682j2717j1690q376
7904A31921o454k433r81k651J421J443K694l62K434K371m80j872k482k899J591
7889A23261l529m108k921Q29M810J74L790O528M504k44l611J7K271O76Q77l212
7873A30112l635K99j590M96n699o194l954k872m898l244m070l756j046l822J212
7858H7339l65k615J65K763j620m285n557j578j169j53j2M07L458L281L673j618
7842H2114N967J0635J4956J6661M247q183j0100j6103j5686r101q068p300k291
7829E7748m555k927l092l028J818k05k901j871J06k89J228k470j063K724l62n82
7813D0279K404k19k205k787l9r49j298k349j651K064L603O289N173O637J2467
$$ plain form
7798 67419 80785 92132 95988 89425 74334 60254 51129 43785 36542 28263 23050 21627 24909 25662
7784 25662 23083 19526 15507 14334 16837 18690 20679 22433 25026 23065 22427 20972 23084 25549 24007
7769 24007 24810 26770 27261 25389 21307 22035 21485 17677 17032 21750 23740 25328 26396 23034 21988 24765
7753 24765 26633 27267 24158 18896 16977 15708 13503 13954 15080 16836 16467 15869 14831 14954 14990 13985
7737 13985 16816 16296 12049 7292 9753 12671 10504 11986 11105 10684 8481 8347 9566 10306 11121 16181
7721 16181 19639 17668 15661 15993 17740 16496 15307 17036 20062 19623 14772 12396 11740 10892 8652 10590
7705 10590 14314 16235 13396 11684 10056 12479 12655 12668 12682 10805 9115 11316 10815 9931 10121 11495 8730
7688 8730 7181 8136 8325 5292 5019 6673 7881 8013 5787 6566 8580 10973 13816 13003 12231 10191 10055
$$ packed form
7798F7419J3366J1347L856o563j5091j4080r125p344p243q279n213j423L282P53
7784B5662k579l557m019j173K503J853J989J754K593j961o38j455K112K465j542
7769B4007Q03J960M91j872m082P28n50l808o45M718J990J588J068l362j046K777
7753B4765J868O34l109n262j919j269k205M51J126J756l69n98j038J23L6j005
7737A3985K831n20m247m757K461K918k167J482q81m21k203j34J219P40Q15N060
7721A6181L458j971k007L32J747j244j189J729L026m39m851k376o56q48k240J938
7705A0590L724J921k839j712j628K423J76J3J4j877j690K201n01q84J90J374k765
7688H730j549R55J89l033k73J654J208J32k226P79K014K393K843q13p72k040j36
$$ plain form
7671 10055 7010 5257 3963 3444 7650 10935 10292 9599 8584 6232 6737 8707 7995 10001 11964 12880
7655 12880 11559 8977 4361 3899 9549 9428 6060 4350 2715 6860 9887 7586 5974 6078 3957
7640 3957 3958 7651 9215 9387 8051 8225 10938 12810 12746 11106 9621 6862 6949 6725 5829 1825 -1142 -1434
7622 -1434 -602 1197 1995 -603 257 2480 6863 4471 3292 1673 1485 1258 1693 3094 3466 4268 2175
7605 2175 2285 4976 8929 10912 7660 4967 4715 7132 11352 10006 4519 2455 5 3266 5470
7590 5470 2292 1262 1490 524 -588 -1166 3206 4660 4785 2174 -2895 -3699 -4740 -2065 1948 1893 -2198
7573 -2198 367 3483 8047 6006 2423 -283 1257 1661 -1924 -4258 -1767 1247 1129 2941 5489
7558 5489 4406 5633 6286 3741 1039 4271 5383 6033 4970 5566 4043 2766 1768 520 112 1544
$$ packed form
7671A0055l045j753j294n19M206L285o43o93j015k352N05J970p12K006J963R16
7655A2880j321k582m616m62N650j21l368j710j635M145L027k301j612J04k121
7640C957JL693J564J72j336J74K713J872o4j640j485k759Q7k24q96m004k967k92
7622a434Q32J799P98k598Q60K223M383k392j179j619j88k27M35J401L72Q02k093
7605B175J10K691L953J983l252k693k52K417M220j346n487k064k450L261K204
7590E470l178j030K28r66j112n78M372J454J25k611n069q04j041K675M013n5m091
7573b198K565L116M564k041l583k706J540M04l585k334K491L014j18J812K548
7558E489j083J227O53k545k702L232J112O50j063N96j523j277r98j248m08J432
$$ plain form
7542 1544 633 674 -2347 -2788 -2020 -1156 886 374 -466 1038 2418 2916 2844 879 -1313 -3467 -4167 -3179
7524 -3179 -3160 -1051 1879 297 -1167 -417 -752 334 298 -12 554 -363 -1329 -2732 -1484 2123 5468
7507 5468 5197 5935 7139 5990 3133 2310 3554 5265 4175 5319 3271 1675 187 2069 3549 2129
7491 2129 -1377 -909 -1164 -4950 -3147 -3801 -5720 -5299 -6727 -5788 -5236 -5956 -5943 231 2122 410 3953
7474 3953 1722 -2520 -3019 -514 2063 1283 1129 165 -1666 -7036 -9613 -7014 -4047 -1492 640 -1840
7458 -1840 -4315 -3467 -566 -251 -3483 -2097 630 849 -500 -895 219 837 1202 -487 887 272 -947
7441 -947 -2236 -2995 -5017 -4355 -2743 911 1353 5325 7993 6785 3671 -504 -117 -95 1842 4867 1313
7424 1313 -1782 -4361 -3304 -2374 -984 -1206 1070 4981 2919 1300 4321 3652 3588 4728 4582 3636 5540
$$ packed form
7542A544r11M1l021m41P68Q64K042n12q40J504J380M98p2j965k192k154p00R88
7524c179J9K109K930j582j464P50l35J086l6l10N66r17r66j403J248L607L345
7507E468k71P38J204j149k857q23J244J711j090J144k048j596j488J882J480j420
7491B129l506M68k55l786J803o54j919M21j428R39N52p20J3O174J891j712L543
7474C953k231m242m99K505K577p80j54r64j831n370k577K599K967K555K132k480
7458a840k475Q48K901L15l232J386K727K19j349l95J114O18L65j689J374o15j219
7441i47j289p59k022O62J612L654M42L972K668j208l114m175L87K2J937L025l554
7424A313l095k579J057R30J390k22K276L911k062j619L021o69o4J140j46r46J904
$$ plain form
7407 5540 4699 1471 1375 285 149 3567 3964 1436 1388 1850 2712 4491 2979 2582 1924 3533 6083 5801
7389 5801 1788 -556 1620 6896 8408 6259 1250 -1238 680 2147 2500 2341 -732 -1157 -1142 1724
7373 1724 3345 481 -1172 -2029 -1261 -2748 -812 -979 -31 -1269 -3376 -5995 -4860 -4966 -5692 -7390
7357 -7390 -8514 -7558 -8972 -7880 -5084 -5068 -6397 -7121 -3236 -1366 727 1755 3443 2573 -902 -321
7341 -321 1647 1904 1466 -653 -2892 -2938 -3640 -5122 -2645 -16 873 822 841 2424 1518 -860 -656 349
7323 349 454 1208 1107 -3403 -4333 -986 -1135 -3729 -2762 1525 2351 -564 -4139 -4736 -5330 -6259 -6870 -6093
7305 -6093 -5288 -5533 -3534 -2748 -3162 -2944 -1014 -2531 -3589 -1922 -1929 -4532 -3847 -3978 -803 715 948 -644
7287 -644 -3068 -2558 -3318 -1765 -1019 -1945 2034 2528 672 2075 792 -1389 1080 3917 2083 -2766
$$ packed form
7407E540q41l228r6j090j36L418L97k528m8M62Q62J779j512l97o58J609K550k82
7389E801m013k344K176N276J512k149n009k488J918J467L53j59l073m25J5K866
7373A724J621k864j653q57P68j487J936j67R48j238k107k619J135j06p26j698
7357g390j124R56j414J092K796J6j329p24L885J870K093J028J688q70l475N81
7341c21J968K57m38k119k239m6p02j482K477K629Q89n1J9J583r06k378K04J005
7323C49J05P54j01m510r30L347j49k594R67M287Q26k915l575n97n94r29o11P77
7305f093Q05k45J999P86m14K18J930j517j058J667pk603O85j31L175J518K33j592
7287f44k424N10p60J553P46r26L979M94j856J403j283k181K469K837j834m849
$$ plain form
7271 -2766 -1959 135 -2591 -3635 -4746 -6650 -4860 -1865 -2310 -2674 -2074 1683 4765 5985 6951 4978
7255 4978 597 1695 4462 3417 975 1483 1749 -1547 -1734 -204 577 -209 2048 3028 3379 84 -1930
7238 -1930 -2188 -4692 -6910 -9989 -10087 -5270 -1704 -1871 -3507 -2007 1360 2964 2057 4870 3999 475
7222 475 2284 -1407 -2677 -1058 -339 1456 -549 -3764 -3539 -2149 -1132 -411 420 2869 2833 370 1895
7205 1895 3148 3755 4300 3293 2492 735 -146 1013 1677 -819 213 -401 -3967 -4235 -1322 -3583 -2838
7188 -2838 -2579 -4880 -5017 -3774 -2165 -3764 -2575 332 1611 193 1354 1413 200 -2190 2342 2544
7172 2544 2968 5546 4443 1090 -1734 -5658 -6373 -2931 1208 -1870 -4544 -4407 -1063 2006 1311 -1320
7156 -1320 -4508 -5828 -4389 -1775 -2464 -4310 -1832 -570 1636 1162 -825 -1460 -731 4045 3716 -98
$$ packed form
7271b766Q07K094k726j044j111j904J790K995m45l64O00L757L082J220R66j973
7255D978m381J098K767j045k442N08K66l296j87J530P81p86K257R80L51l295k014
7238a930k58k504k218l079r8M817L566j67j636J500L367J604r07K813q71l524
7222D75J809l691j270J619P19J795k005l215K25J390J017P21Q31K449l6k463J525
7205A895J253O07N45j007q01j757q81J159O64k496J032o14l566k68K913k261P45
7188b838K59k301j37J243J609j599J189K907J279j418J161N9j213k390M532K02
7172B544M24K578j103l353k824l924p15L442M139l078k674J37L344L069o95k631
7156a320l188j320J439K614o89j846K478J262K206m74j987o35P29M776l29l814
$$ plain form
7140 -98 -5893 -4583 -790 -511 -3007 -2801 -2935 -4508 -7382 -8719 -9086 -7507 -3229 963 1439 -1020 -5621
7123 -5621 -5334 -2393 -1074 -2289 -1213 1553 531 -4009 -6570 -3287 -1875 -490 -2000 -5035 -6483
7108 -6483 -5896 -5067 -5316 24 2199 -64 -2504 -4341 -4477 -4108 -4637 -5239 -4356 -2474 269 55 -85
7091 -85 -2669 -5404 -8886 -8669 -6650 -4985 -3016 -1419 -2869 -190 1054 -1227 -3151 -4498 -4694 -3436
7075 -3436 -1962 289 -4 -1021 -2598 -2054 -627 -2393 -1698 -301 2376 1503 2297 2513 2681 -981 -258
7058 -258 471 649 -2319 -2804 1010 -205 -130 58 990 3211 4442 2011 714 -1877 -2770 -5399 -5159
7041 -5159 -2084 -358 -1659 -4171 -3085 -1726 2231 3646 2779 -591 -795 862 2062 2102 1577 1568 -2047
7024 -2047 -2981 -4690 -6625 -2678 -2201 -2974 -315 -994 -838 -200 -806 -2199 -4271 -4613 -3561 -3724 -4016
$$ packed form
7140i8n795J310L793K79k496K06j34j573k874j337l67J579M278M192M76k459m601
7123e621K87K941J319j215J076K766j022m540k561L283J412J385j510l035j448
7108f483N87Q29k49N340K175k263k440j837j36L69n29o02Q83J882K743k14j40
7091h5k584k735l482K17K019J665J969J597j450K679J244k281j924j347j96J258
7075c436J474K251k93j017j577N44J427j766O95J397K677q73P94K16J68l662P23
7058b58P29J78k968m85L814j215P5J88R32K221J231k431j297k591q93k629K40
7041e159L075J726j301k512J086J359L957J415q67l370k04J657J200M0n25rl615
7024b047r34j709j935L947M77p73K659o79J56O38o06j393k072l42J052j63k92
$$ plain form
7007 -4016 -3548 -1592 2352 -156 -3088 -4443 -684 -1860 -4841 -5685 -2803 131 3799 2808 31 -1506
6991 -1506 -2071 794 1054 -1901 -33 620 193 2171 2134 2816 2025 1071 1081 1603 3049 -745 -686 -1761
6973 -1761 -3909 -4087 -4953 -5865 -7133 -3469 847 989 -888 -757 640 3208 -620 -3246 511 2394
6957 2394 2163 1480 528 -1536 -2438 1475 2268 558 -1124 -331 366 -1493 -19 1054 3008 2681 -191
6940 -191 -4018 310 4984 6421 2972 -441 -1741 -996 -1565 -4606 -4143 456 1580 -1910 -4494 -6008
6924 -6008 -3118 1538 1840 4922 390 -1272 1090 -120 -3702 -3030 -831 100 -1240 319 3267 4589
6908 4589 2808 629 1380 3195 2942 3035 6510 7438 5823 6406 8166 5955 5003 4749 7606 9274 8353
6891 8353 8371 8786 8372 7586 6119 731 -2009 -2589 -683 -199 -2014 -1033 1831 726 1673 2015 -1376
$$ packed form
7007d016M68J956L944k508k932j355L759j176k981q44K882K934L668r91k777j537
6991a506n65K865K60k955J868O53m27J978l7O82p91r54J0N22J446l794N9j075
6973a761k148j78q66r12j268L664M316J42j877J31J397K568l828k626L757J883
6957B394k31o83r52k064r02L913P93j710j682P93O97j859J474J073J954l27k872
6940a91l827M328M674J437l449l413j300P45n69l041M63M599J124l490k584j514
6924f008K890M656L02L082m532j662K362j210l582O72K199R31j340J559K948J322
6908D589j781k179P51J815k53R3L475R28j615N83J760k211r52k54K857J668r21
6891H353J8M15m14p86j467n388k740n80J906M84j815R81K864j105R47L42l391
$$ plain form
6874 -1376 -3325 -3500 -5156 -6030 -7742 -7376 -6134 -6914 -8920 -9926 -7419 -5926 -6372 -4748 -4822 -5966 -5202
6857 -5202 -679 750 -2585 -5852 -6135 -6294 -6111 -924 -1978 -3662 -3635 -5619 -6229 -6985 -4609 -3477 -721
6840 -721 1273 461 -354 1820 1195 -365 940 3153 2610 3095 3205 1618 -3064 -2905 -2348 -1019 -3512
6823 -3512 -4859 -3483 -1827 -2511 -3428 -4755 -3716 -6087 -7168 -3508 -1154 1700 -892 -943 -575 -2349
6807 -2349 -2492 -2092 1172 2085 954 -413 1550 2988 2896 -545 -3365 -2235 -1724 -1459 -298 -3638 -5893
6790 -5893 -2428 600 -148 -4604 -5610 -6496 -8619 -8335 -9187 -7985 -6232 -6941 -5076 -2432 1728 -419
6774 -419 -2329 -5006 -5945 -2187 2870 4008 3812 1339 -807 -3530 -4812 -8388 -9912 -6415 -6055 -4045
6758 -4045 -3860 -7177 -7316 -6575 -2876 441 2856 2775 2592 -2330 -4384 -3451 -783 -4575 -7779 -5915 -1842
$$ packed form
6874a376j949j75j656q74j712L66J242p80k006j006K507J493m46J624p4j144P64
6857e202M523J429l335l267k83j59J83N187j054j684K7j984o10p56K376J132K756
6840g21J994q12q15K174o25j560J305K213n43M85J10j587m682J59N57J329k493
6823c512j347J376J656o84r17j327J039k371j081L660K354K854k592n1L68j774
6807b349j43M00L264R13j131j367J963J438r2l441k820J130N11K65J161l340k255
6790e893L465L028p48m456j006q86k123K84q52J202J753p09J865K644M160k147
6774d19j910k677r39L758N057J138j96k473k146k723j282l576j524L497L60K010
6758d045J85l317j39P41L699L317K415q1j83m922k054R33K668l792l204J864M073
$$ plain form
6741 -1842 602 -497 624 3539 6088 6789 3968 -888 -539 1296 5316 7266 9610 9690 6725 5635
6725 5635 8529 8277 6490 5270 7999 12884 14465 13471 12449 16490 19796 21670 26575 27902 30362
6710 30362 28216 26996 26124 27239 27311 29350 29819 29712 32268 37427 44860 52976 66598 83165 103848
6695 103848 133471 164194 200029 255786 345950 476148 591987 631664 577428 460440 331969
6684 331969 234088 171216 132792 112325 99766 82947 68398 54851 44340 38552 37056 33804
6672 33804 27750 23698 20975 20368 19664 18727 19864 23736 24933 21156 19134 17933 15657 15352 14177 12650
6656 12650 9505 9125 11458 12259 8219 3904 2284 262 -2225 -1791 1084 4334 3892 2273 1243 3448
6640 3448 8532 14154 17196 18705 17792 16917 13198 6659 3467 2569 1541 3155 2703 4472 5113 6225
$$ packed form
6741a842K444j099J121K915K549P01k821m856L49J835M020J950K344Q0k965j090
6725E635K894k52j787j220K729M885J581r94j022M041L306J874M905J327K460
6710C0362k146j220q72J115P2K039M69j07K556N159P433Q116J3622J6567K0683
6695A03848K9623L0723L5835N5757R0164J30198J15839L9677n4236j16988j28471
6684C31969r7881o2872l8424k0467j2559j6819j4549j3547j0511n788j496l252
6672C3804o054m052k723o07p04r37J137L872J197l777k022j201k276l05j175j527
6656A2650l145l80K333Q01m040m315j620k022k487M34K875L250m42j619j030K205
6640C448N084N622L042J509r13q75l719o539l192q98j028J614m52J769O41J112
$$ plain form
6624 6225 5397 2192 3835 3086 3327 2851 2273 2840 5525 4267 1978 929 417 613 -607 -547 -3554
6607 -3554 -6331 -7062 -5563 -2170 -2224 371 1093 -1141 -485 -2003 -6339 -7666 -5756 -4057 -6196 -9336
6591 -9336 -7534 -3748 495 -34 -3094 -4567 -3773 -2023 565 1788 -907 -4018 -239 1822 -444
6576 -444 -2736 -3329 -2679 -1584 -1140 -1371 -1783 250 1003 -640 -3044 366 1632 -762 -1366 615 641
6559 641 751 1946 4973 3439 1353 419 -1432 -3224 -3413 -4502 -2180 1299 1080 -1201 -1611 -1079 -900
6542 -900 -2684 -82 6207 9154 9256 6852 3588 5798 3541 4963 7009 4096 -79 -679 -616 -3118
6526 -3118 -4095 -3722 -887 -642 -1801 334 619 -2793 -2208 -418 905 3001 2219 -2255 -2254 -2871 -4215
6509 -4215 -4362 -1266 1865 2177 -908 -3472 -4545 -6056 -8968 -6874 -2851 -981 -1323 -3958 -3664 -5211
$$ packed form
6624F225q28l205J643p49K41m76n78N67K685j258k289j049n12J96j220O0l007
6607c554k777p31J499L393n4K595P22k234O56j518m336j327J910J699k139l140
6591i336J802L786M243n29l060j473P94J750K588J223k695l111L779K061k266
6576d44k292n93O50J095M44k31m12K033P53j643k404L410J266k394o04J981K6
6559F41J10J195L027j534k086r34j851j792j89j089K322L479k19k281m10N32J79
6542i00j784K602O289K947J02k404l264K210k257J422K046k913m175o00O3k502
6526c118r77L73K835K45j159K135K85l412N85J790J323K096p82m474Jo17j344
6509d215j47L096L131L12l085k564j073j511k912K094M023J870l42k635K94j547
$$ plain form
6493 -5211 -1367 -1791 -3707 945 2374 1049 -1267 -195 1355 -118 -1746 -2967 -5059 -3915 -616
6478 -616 -1452 -1683 30 -767 -2686 -1791 -1321 -1824 -2885 -3421 -3889 -4056 -5151 -4556 -3146 -598 2058 2561
6460 2561 2408 1015 -558 370 744 865 3463 6233 2007 1067 -257 -138 33 -949 903 727 -1882
6443 -1882 -5398 -9319 -9207 -6061 348 1054 -1961 4232 5392 -293 -3735 -1235 3081 4763 4564 1244
6427 1244 4260 5052 5460 3390 537 -139 -1716 -1645 1253 -1181 -4951 -3044 880 -934 -1392 -48
6411 -48 387 2423 2456 1841 2036 2541 1208 3192 974 -2481 -3655 -4297 -3950 -1260 -1876 -3536 -3708 -2552
6393 -2552 -1786 -2145 225 -653 8 -266 1887 2801 2677 1251 175 -500 -516 1666 1107 -62 1349 -1096
6375 -1096 -4969 -4983 -4524 -2140 -2648 -2419 740 -1084 -1934 968 321 251 1726 5513 5267 3297 496
$$ packed form
6493e211L844m24j916M652J429j325k316J072J550j473j628j221k092J144L299
6478f16q36k31J713p97j919Q95M70n03j061n36m68j67j095N95J410K548K656N03
6460B561j53j393j573R28L74J21K598K770m226r40j324J19J71r82J852j76k609
6443a882l516l921J12L146O409P06l015O193J160n685l442K500M316J682j99l320
6427A244L016P92M08k070k853o76j577P1K898k434l770J907L924j814m58J344
6411d8M35K036L3o15J95N05j333J984k218l455j174o42L47K690o16j660j72J156
6393b552P66l59K370q78O61k74K153R14j24j426j076o75j6K182n59j169J411k445
6375a096l873j4M59K384n08K29L159j824q50K902o47p0J475L787k46j970k801
$$ plain form
6358 496 -1429 -5402 -4364 -1711 -415 1637 1443 -2776 -4160 -3591 -2211 -450 -5114 -4056 665 91
6342 91 -2179 -2067 -3557 -5346 -5487 -6680 -1300 2357 2057 -1361 -4320 -1737 1687 2583 -1349 -3799
6326 -3799 -2662 1403 3153 3050 3148 2360 -1455 -2163 -2149 -1816 1249 5470 8874 8001 3742 4474 969
6309 969 -1620 1977 916 2761 3465 2329 647 563 1226 -2517 -2857 -1599 -1576 238 -1079 -996 615
6292 615 484 429 1653 1890 3188 1807 -2720 -949 1152 1006 -103 -639 -3445 -4568 -3136 -2737 -3449
6275 -3449 -1309 -1942 -167 -386 -1682 -3305 -2451 272 1434 -199 1225 1676 1798 2507 1385 1885 -842
6258 -842 -1676 -3330 -5279 -3067 -938 -963 -841 1199 3847 3963 788 -4253 -8326 -7415 -4799 -5044 -4535
6241 -4535 -6549 -10065 -7433 -5116 -4766 -2315 -3213 -4452 -2698 -5691 -4842 -4505 -5054 -4441 -5833 -5323 -4805
$$ packed form
6358D96j925l973J038K653J296K052j94m219j384N69J380J761m664J058M721n74
6342I1k270J12j490j789j41j193N380L657l00l418k959K583L424Q96l932k450
6326c799J137M065J750j03R8p88l815p08J4L33L065M221L404q73m259P32l505
6309I69k589L597j061J845P04j136j682q4O63l743l40J258K3J814j317Q3J611
6292F15j31n5J224K37J298j381m527J771K101j46j109n36k806j123J432L99p12
6275c449K140o33J775k19j296j623Q54K723J162j633J424M51J22P09j122N00k727
6258h42q34j654j949K212K129k5J22K040K648J16l175n041m073R11K616k45N09
6241d535k014l516K632K317L50K451q98j239J754k993Q49L37n49O13j392N10N18
$$ plain form
6224 -4805 -7864 -6763 -2387 -284 500 -2539 -4741 -4885 -6526 -5781 -5001 -5084 -5730 -2715 -268 -85 -2589
6207 -2589 -1136 -1279 -3379 -5637 -6019 -4245 -7148 -7593 -3858 -1805 -1331 -2148 -2570 -2022 -4193 -4426 -3922
6190 -3922 -6411 -4578 -5863 -4272 -4324 -5408 -4959 -4439 -3738 -4022 -5575 -5591 -3803 -4631 -3877 -1765 -1747 -1399
6172 -1399 62 -1935 -2315 -357 4082 4713 -497 -1035 1289 -946 -5707 -6207 -5735 -4068 -3883 -3369 -2615
6155 -2615 -4309 -2182 1 1542 2529 2131 1366 -260 -1937 -1387 -2807 -4903 -4454 -7276 -8265 -8646 -6693
6138 -6693 -10234 -8160 -7856 -5771 -2202 -887 -734 -3083 -2156 -91 -5454 -9166 -10715 -14702 -16371 -15762
6122 -15762 -23117 -29015 -24974 -16362 -12168 -9862 -6748 -1428 1695 6017 4938 -233 -743 -2442 -4619
6107 -4619 -1546 -111 -102 1701 4249 4063 4085 2004 -1244 23 1531 -1816 111 -1634 -2713 -2989 -3474
$$ packed form
6224d805l059J101M376K103P84l039k202j44j641P45P80q3o46L015K447J83k504
6207b589J453j43k100k258l82J774k903m45L735K053M74q17m22N48k171k33N04
6190c922k489J833j285J591n2j084M49N20P01k84j553j6J788q28P54K112J8L48
6172a399J461j997l80J958M439O31n210n38K324k235m761n00M72J667J85N14P54
6155b615j694K127K183J541R87l98p65j626j677N50j420k096M49k822r89l81J953
6138f693l541K074L04K085L569J315J53k349R27K065n363l712j549l987j669O09
6122a5762p355n898M041Q612M194K306L114N320L123M322j079n171n10j699k177
6107d619L073J435RJ803K548j86K2k081l248J267J508l347J927j745j079k76m85
$$ plain form
6090 -3474 1307 1542 -512 184 4952 3702 449 1267 2960 84 -3602 -1691 845 1485 2106 3317
6074 3317 6634 3625 -333 -2656 -3989 -4463 -5928 -6565 -4034 -6405 -4041 -3422 -4888 -5702 -5163 -4059
6058 -4059 -3300 -1029 -545 -1906 -3545 -4600 -3054 -3036 -1746 -832 925 1660 -424 -3774 -4264 -1714 -1044
6041 -1044 -3735 -6643 -8169 -7542 -4595 -1934 -1648 -2119 -1234 -354 933 2001 1341 818 2421 2256 -1768
6024 -1768 -1988 -3772 -3020 -2005 -2771 -3751 -6575 -8208 -2748 -3380 -4569 -4292 -4828 -3627 -5253 -6080 -2810
6007 -2810 -1734 702 -131 -3845 -3634 -3445 -4001 -3984 -745 3845 6803 3516 509 238 -1305 -2885 864
5990 864 1416 -2817 -6088 -6158 -2850 -991 -2072 -2420 -2444 -2748 -2245 303 7 -3931 -6031 -6293 -8996 -10027
5972 -10027 -8255 -8431 -6728 -6192 -8697 -8042 -4462 -2426 -2893 -3922 -6099 -9553 -8812 -6156 -4187 -4583
$$ packed form
6090c474M781K35k054O96M768j250l253Q18J693k876l686J911K536O40O21J211
6074C317L317l009l958k323j333m74j465o37K531k371K364O19j466q14N39J104
6058d059P59K271M84j361j639j055J546J8J290R14J757P35k084l350m90K550O70
6041a044k691k908j526O27K947K661K86m71Q85Q80J287J068o60n23J603j65m024
6024a768k20j784P52J015p66r80k824j633N460o32j189K77n36J201j626q27L270
6007b810J076K436q33l714K11J89n56J7L239M590K958l287l007k71j543j580L749
5990H64N52m233l271p0L308J859j081l48k4l04N03K548k96l938k100k62k703j031
5972a0027J772j76J703N36k505O55L580K036m67j029k177l454P41K656J969l96
$$ plain form
5956 -4583 -4986 -2928 -282 1158 659 1638 1581 643 4069 4187 2224 1868 -1087 -5040 -4921 -3954 -3222 -296
5938 -296 773 -488 -2279 -4017 -978 -1016 -1495 -139 -1161 -2098 2093 452 -1645 -1840 -3375 -4882
5922 -4882 -3929 -1563 1817 3999 2791 -1298 -3838 -2030 -1537 -1612 187 -2974 -4092 -2375 409 2239
5906 2239 2085 5234 6311 3774 3391 6258 6420 5046 402 -63 -205 -835 -901 -2936 -4970 -5717 -680
5889 -680 2795 -75 -2671 -2632 -428 -1607 -1227 172 -1819 -835 -2091 -4339 -2301 -150 -4671 -5756
5873 -5756 -1733 -2875 -2689 -5124 -6243 -3900 -1905 -3751 -5803 -6896 -8810 -7304 -6272 -3145 -820
5858 -820 1544 1297 -2610 -3511 311 2102 2523 3562 2732 3565 4272 5093 4426 -96 -3671 720 882
5841 882 -1486 -1461 -1058 -565 -262 182 -1839 -1640 -839 -1594 -2154 -3994 -2265 -2379 -1576 488 -929 -3282
$$ packed form
5956d583m03K058K646J440m99R79n7r38L426J18j963l56k955l953J19R67P32K926
5938b96J069j261j791j738L039l8m79J356j022r37M191j641k097j95j535j507
5922d882R53K366L380K182j208m089k540J808M93p5J799l161j118J717K784J830
5906B239j54L149J077k537l83K867J62j374m644m65j42o30o6k035k034p47N037
5889f80L475k870k596L9K204j179L80J399j991R84j256k248K038K151m521j085
5873e756M023j142J86k435j119K343J995j846k052j093j914J506J032L127K325
5858h20K364k47l907r01L822J791M21J039q30Q33P07Q21o67m522l575M391J62
5841H82k368K5M03M93L03M44k021J99Q01p55n60j840J729j14Q03K064j417k353
$$ plain form
5823 -3282 -2181 -2743 -5249 -6022 -6841 -3771 -2327 -5540 -7248 -6109 -5267 -6625 -5144 -3095 -2412 -1439
5807 -1439 -1120 1989 5476 3280 -922 -1146 -5534 -5876 822 2976 -1074 -4006 -4978 -4439 -5723 -4046
5791 -4046 -1005 -597 -329 -1539 -1003 849 -556 641 2322 314 -2544 -4820 -6267 -4144 -1449 -3047
5775 -3047 -3458 -3030 -4341 -4243 -3174 -4004 -4416 -5613 -4465 -2655 -1370 -923 -1026 -1092 -616 -1348 -4389 -5268
5757 -5268 -5572 -5532 -2863 -837 1087 1609 2242 1900 -2029 893 2637 783 2403 605 1021 3975 2169
5740 2169 -1209 1298 140 -1466 -978 1904 1306 434 -807 339 2831 3864 1256 -732 -3986 -3137
5724 -3137 -5665 -4979 -2213 -794 45 72 42 -442 -963 -2684 -3349 -5405 -4534 -6131 -10075 -8592 -4907
5707 -4907 -3453 -5951 -4914 -2663 -5657 -8360 -6120 -2600 -2171 -5885 -4710 -1432 -2919 -6222 -7533
$$ packed form
5823c282J101n62k506p73q19L070J444l213j708J139Q42j358J481K049O83R73
5807a439L19L109L487k196m202k24m388l42O698K154m050k932r72N39j284J677
5791d046L041M08K68j210N36J852j405J197J681k008k858k276j447K123K695j598
5775c047m11M28j311R8J069q30m12j197J148J810J285M47j03o6M76p32l041q79
5757e268l04M0K669K026J924N22O33l42l929K922J744j854J620j798M16K954j806
5740B169l378K507j158j606M88K882n98q72j241J146K492J033k608j988l254Q49
5724c137k528O86K766J419Q39K7l0m84n21j721o65k056Q71j597l944J483L685
5707d907J454k498J037K251k994k703K240L520M29l714J175L278j487l303j311
$$ plain form
5692 -7533 -6044 -4207 -5127 -8592 -10140 -5818 -3630 -6224 -7764 -5742 -2718 -4699 -6539 -5968 -3442
5677 -3442 -1360 2010 -1637 -4164 -3073 -2700 -5255 -8414 -8352 -7611 -7000 -4545 -1677 -3806 -4406 -3934 -607
5660 -607 308 727 898 1995 2551 3106 4859 6513 6707 4715 -323 -4031 -3494 -1341 51 -1756 -4308
5643 -4308 -1933 2106 6225 6766 3475 -2815 -5857 -7115 -5868 -4976 -5580 -5508 -4114 -3991 -2648 -1097
5627 -1097 3420 7410 6247 3858 2587 1137 436 -539 -552 3131 3275 408 -3619 -5249 -5981 -2467
5611 -2467 -324 -347 724 1372 -984 -1600 -1574 -970 963 -745 -2488 -1822 -802 -705 248 -688 -1141 3328
5593 3328 4476 -233 -716 1977 828 -2302 -1767 -767 1935 3981 2014 -1242 1305 3122 4238
5578 4238 3275 1633 45 1218 3538 2060 -2983 -691 299 817 609 3088 2527 -1879 -849 2259
$$ packed form
5692g533J489J837r20l465j548M322K188k594j540K022L024j981j840N71K526
5677c442K082L370l647k527J091L73k555l159O2P41O11K455K868k129o00M72L327
5660f07R15M19J71J097N56N55J753J654J94j992n038l708N37K153J392j807k552
5643d308K375M039M119N41l291o290l042j258J247Q92o04P2J394J23J343J551
5627a097M517L990j163k389j271j450p01r75j3L683J44k867m027j630p32L514
5611b467K143k3J071O48k356o16K6O04J933j708j743O66J020R7R53r36m53M469
5593C328J148m709m83K693j149l130N35J000K702K046j967l256K547J817J116
5578D238r63j642j588J173K320j478n043K292R90N18k08K479n61m406J030L108
$$ plain form
5562 2259 1997 -187 350 -872 -5025 -3537 -1121 -2796 -2211 488 -126 -972 -2110 -2969 -93 1720
5546 1720 1220 -1502 -2198 -1140 -3696 -2785 -754 -57 -773 -1179 1544 5533 6986 5508 2483 -1328
5530 -1328 -1147 167 -1251 2896 5495 6153 2888 144 747 966 -1357 -5666 -4638 707 3970 4133
5514 4133 3662 1283 2842 3873 372 -1135 -86 982 -125 -2934 -2910 -829 3598 6184 3805 1397
5498 1397 -3449 -6809 -6074 -4503 -4317 -4158 -1183 766 492 -596 -2598 -3358 -114 571 2500 3105 3234
5481 3234 2638 2337 168 -187 3629 1652 -2059 -2589 -2594 -3449 -2774 -2746 -2713 -2598 -2439 -4908 -5710 -6420 -7951
5462 -7951 -5681 -4422 -2298 1361 452 -344 -1020 -3066 -6974 -8853 -6456 -8070 -5340 -4263 -6956 -4820
5446 -4820 -1164 2236 5719 4632 5193 4728 140 -2737 -1449 1121 4322 3462 3172 1688 1367 3009
$$ packed form
5562B259k62k184N37j222m153J488K416j675N85K699o14q46j138q59K876J813
5546A720n00k722o96J058k556R11K031O97p16m06K723L989J453j478l025l811
5530a328J81J314j418M147K599O58l265k744O03K19k323m309J028N345L263J63
5514D133m71k379J559J031l501j507J049J068j107k809K4K081M427K586k379k408
5498A397m846l360P35J571J86J59K975J949k74j088k002p60L244O85J929O05J29
5481C234n96l01k169l55L816j977l711n30nq55O75K8L3J15J59k469q02p10j531
5462g951K270J259K124L659r09p96o76k046l908j879K397j614K730J077k693K136
5446d820L656L400L483j087N61m65m588k877J288K570L201q60k90j484l21J642
$$ plain form
5430 3009 2529 -915 -3233 -851 2509 2598 266 -1620 -138 -2075 -5470 -7664 -5344 -2976 -2375 -1308
5414 -1308 1133 2402 4003 2862 1220 2520 2850 2576 -392 -1299 -3123 -4205 -426 768 -4822 -7626
5398 -7626 -8019 -4482 -4698 -5475 -4905 -3936 -1060 768 446 -2966 -2748 -2217 -229 -1670 -3808 -5798 -8311
5381 -8311 -5323 -5588 -7683 -3647 -567 702 -263 -870 -4049 -5849 -4019 -2307 -2648 -2936 -2965 -3123 -1819
5364 -1819 -706 -1178 -153 -3833 -2996 -4610 -3461 1795 4062 955 1069 3194 1939 -232 -2423 -5060
5348 -5060 -5824 -2629 -1146 -233 -1896 -4072 -4833 -4368 -6947 -7531 -3743 449 700 318 363 -1081 -1976
5331 -1976 -3567 -4088 -3459 1294 2169 1185 112 925 2575 1933 -2369 -3245 -3257 -3635 -3230 -4131 -2737 301
5313 301 1861 659 592 2765 3907 3446 5374 4134 5016 7020 8419 5487 5038 6580 5013 4188 2348
$$ packed form
5430C009m80l444k318K382L360Q9k332j886J482j937l395k194K320K368O01J067
5414a308K441J269J601j141j642J300L30k74k968r07j824j082L779J194n590k804
5398g626l93L537k16p77N70R69K876J828l22l412K18N31J988j441k138j990k513
5381h311K988k65k095M036L080J269r65o07l179j800J830J712l41k88k9j58J304
5364a819J113m72J025l680Q37j614J149N256K267l107J14K125j255k171k191k637
5348e060p64L195J483R13j663k176p61M65k579n84L788M192K51l82M5j444q95
5331a976j591n21O29M753Q75r84j073Q13J650o42m302q76j2l78M05r01J394L038
5313C01J560j202o7K173J142m61J928j240Q82K004J399k932m49J542j567q25j840
$$ plain form
5296 2348 -1151 1992 6007 7478 6704 3101 2873 195 2484 2952 5347 7018 4510 980 296 2757
5280 2757 3082 472 -762 -3743 -5236 -2003 -557 -2461 -2022 1056 3003 2740 320 -2211 -2860 -7163
5264 -7163 -4766 -2092 -3541 -662 1492 -3416 -4843 -1115 -1655 -2506 -4426 -3393 -2419 -3919 -4965 -3314
5248 -3314 452 -857 1674 5124 7278 4885 4194 4201 3045 3462 1065 1604 1973 835 890 784 2404
5231 2404 -763 -1067 -360 -461 900 -393 -1112 -676 -561 453 794 -225 -2481 -2986 -1925 421 277
5214 277 -1623 -5380 -5959 -5229 -4464 -388 -92 -2414 -924 359 -1475 -4526 -4792 -248 -172 -1137 1722
5197 1722 671 -1289 -1370 -852 -699 -2726 -4945 -4196 -582 -540 -1268 -3903 -5604 -4266 -728 -134 125
5180 125 -1428 -3190 -1999 -1058 -831 1452 2438 -1200 -4509 -5961 -2522 -1926 -3868 -5087 -5102 -3635 -2385
$$ packed form
5296B348l499L143M015J471p74l603k28k678K289M68K395J671k508l530o84K461
5280B757L25k610j234k981j493L233J446j904M39L078J947k63k420k531o49m303
5264g163K397K674j449K879K154m908j427L728n40q51j920J033R74j500j046J651
5248c314L766j309K531L450K154k393o91Pj156M17k397N39L69j138N5j06J620
5231B404l167l04P07j01J361j293p19M36J15J014L41j019k256n05J061K346j44
5214B77j900l757n79P30P65M076K96k322J490J283j834l051k66M544P6r65K859
5197A722j051j960q1N18J53k027k219P49L614M2p28k635j701J338L538N94K59
5180A25j553j762J191R41K27K283R86l638l309j452L439N96j942j219j5J467J250
$$ plain form
5163 -2385 -3106 -5873 -5173 -1794 2429 -343 -3352 -4700 -2881 -1267 -1908 -2341 -1712 -206 -708 -2076
5147 -2076 -3849 -3494 -1279 -554 1999 1133 -884 -2622 -2934 227 -1872 -2804 -1783 -3186 633 1335
5131 1335 1840 1175 106 534 -939 341 3237 4976 2179 -727 -915 -1062 1430 1026 1089 495 1092
5114 1092 528 -106 2964 7000 7221 5712 5536 5183 2986 759 1358 2248 382 -720 -1264 -1073 -116
5097 -116 4643 5311 245 -875 82 300 -753 -1095 -1428 -887 775 1846 1776 -416 365 503 -242 774
5079 774 -2068 614 333 138 -1952 -4652 -3550 1281 -1343 -5065 -4206 -6258 -6819 -1440 -546 -2782
5063 -2782 -3657 -2216 -4037 -3794 -794 -1921 -1135 -11 -430 -3901 -2190 3881 3316 838 1330 -774
5047 -774 -2179 -1322 483 -1267 -4553 -4535 -3558 -166 -1959 -4438 -5937 -5491 -6079 -5935 -2295 1031 3562
$$ packed form
5163b385p21k767P00L379M223k772l009j348J819J614o41m33O29J506n02j368
5147b076j773L55K215P25K553q66k017j738l12L161k099r32J021j403L819P02
5131A335N05o65j069M28j473J280K896J739k797k906j88j47K492m04O3n94N97
5114A092n64o34L070M036K21j509j76l53k197k227N99Q90j866j102n44J91R57
5097a16M759O68n066j120R57K18j053l42l33N41J662J071p0k192P81J38p45J016
5079G74k842K682k81j95k090k700J102M831k624l722Q59k052n61N379Q94k236
5063b782q75J441j821K43L000j127P86J124m19l471J711O071n65k478M92k104
5047g74j405Q57J805j750l286J8R77L392j793k479j499M46n88J44L640L326K531
$$ plain form
5030 3562 4274 3968 2368 858 -1153 -2125 -4364 -3391 -4946 -4486 -4281 -1456 744 -1556 -2610 -666
5014 -666 1608 502 1739 819 4 -886 896 3919 6878 6276 6667 6855 3908 3 -886 -463 -589
4997 -589 -1146 -1499 -499 -407 -4065 -6997 -8862 -5517 -4154 -6830 -6624 -5621 -5798 -5899 -6789 -3173 -2533
4980 -2533 -2779 -3809 -5611 -5272 -4508 -835 1904 3167 3288 99 3349 5068 2336 2742 -68 139
4964 139 2252 1192 -544 1636 2119 2322 6006 5959 3991 4247 1129 -1621 -1878 821 1528 1406 -2182
4947 -2182 -4141 -3824 -319 1254 1959 1240 345 -611 -2753 -4021 -2798 -3352 -3682 -2058 -230 2705 643
4930 643 -2060 -4304 -4939 -5023 -5413 -2349 -1112 -2633 -4152 -4749 -4029 -1423 -852 -4178 -4231 -6627 -7472 -5847
4912 -5847 -4662 -1936 277 985 -599 1575 -2625 -3229 -760 -187 727 -841 -4700 -2920 -3529 -4516
$$ packed form
5030C562P12l06j600j510k011r72k239R73j555M60K05K825K200k300j054J944
5014f66K274j106J237r20q15q90J782L023K959o02L91J88k947l905q89M23j26
4997e89n57l53J000R2l658k932j865L345J363k676K06J003j77j01q90L616O40
4980b533k46j030j802L39P64L673K739J263J21l189L250J719k732M06k810K07
4964A39K113j060j736K180M83K03L684m7j968K56l118k750k57K699P07j22l588
4947b182j959L17L505J573P05p19q95r56k142j268J223n54l30J624J828K935k062
4930F43k703k244o35q4l90L064J237j521j519n97P20K606N71l326n3k396q45J625
4912e847J185K726K213P08j584K174m200o04K469N73R14j568l859J780o09r87
$$ plain form
4896 -4516 -4088 -4391 -1408 1441 2323 2217 3144 -2548 -4608 -3451 1443 1260 -1445 -2871 -456 2005
4880 2005 631 -305 -1765 -383 -2188 -4387 -3569 -2997 -1305 -2135 486 -2173 -7410 -6779 -6021 -1256
4864 -1256 1098 2146 4698 3589 1647 -3182 -6298 -6747 -6772 -5390 -5795 -5011 -4351 -6489 -6919 -2642 -3588
4847 -3588 -5221 -4130 -2503 -1469 3256 3277 -2345 -5302 -625 -367 -3200 -4006 -3607 -3586 -5821 -4383 -1515
4830 -1515 587 1559 3687 1875 -763 -1096 1120 99 -2386 -3152 -2965 -3221 -5347 -3841 -1606 -375
4814 -375 -72 63 -3587 -3663 -5640 -5111 -5533 -4933 -4792 -3675 -5054 -3333 270 741 -4925 -9482 -8020
4797 -8020 -6277 -4301 -2432 -664 -2336 -2902 -2859 -3699 -6525 -3419 -2135 -5084 -5835 -2600 546 445
4781 445 664 -1517 -1226 -1881 -3542 -6617 -6569 -5848 -5107 -4479 -608 1128 -1422 -4396 -6505 -8227 -5176
$$ packed form
4896d516M28l03K983K849Q82j06R27n692k060J157M894j83k705j426K415K461
4880B005j374r36j460J382j805k199Q18N72J692q30K621k659n237O31P58M765
4864a256K354J048K552j109j942m829l116m49k5J382m05P84O60k138m30M277r46
4847c588j633J091J627J034M725K1n622k957M677K58k833q06L99K1k235J438K868
4830a515K102R72K128j812k638l33K216j021k485p66J87k56k126J506K235J231
4814c75L03J35l650p6j977N29m22O00J41J117j379J721L603M71n666m557J462
4797h020J743J976J869J768j672n66M3q40k826L106J284k949p51L235L146j01
4781D45K19k181K91o55j661l075M8P21P41O28L871J736k550k974k109j722L051
$$ plain form
4764 -5176 -1594 -440 -249 -646 2438 7284 9683 10617 8713 5981 1700 -1035 -555 -742 587 -120
4748 -120 -2777 -2788 -2838 -2963 -4445 627 3575 1699 -258 -153 2515 -1325 -4001 -2748 -778 549 -1589
4731 -1589 -4772 -5348 -4759 -5355 -7565 -6941 -5181 -1946 -824 -3497 -4871 -2151 -2291 -1374 367 -2630
4715 -2630 -8008 -7019 -4821 -4950 -2933 -1187 618 -1926 -4425 -4598 -2633 -2816 -2408 -2166 -3916 -6360
4699 -6360 -8083 -5953 -2222 1511 1794 241 1519 2177 259 -3184 -4920 -4367 1033 1036 -2720 255
4683 255 2629 2968 4472 3401 1931 1148 1191 1578 2190 1200 -1080 181 -1019 331 4593 3582 2814
4666 2814 3650 1578 236 -1548 -2653 -2462 -3578 -3211 -3494 -4095 -2546 -5760 -5044 -2918 -1529 -1815 -2788
4649 -2788 -5028 -8154 -8262 -7863 -9719 -11291 -7532 -3311 -1975 -1233 -996 -1391 -2073 -594 -2363 -3936
$$ packed form
4764e176L582J154J91l97L084M846K399R34j904k732m281k735M80j87J329p07
4748a20k657j1n0j25j482N072K948j876j957J05K668l840k676J253J970J327k138
4731a589l183n76N89n96k210O24J760L235J122k673j374K720j40R17J741k997
4715b630n378R89K198j29K017J746J805k544k499j73J965j83M08K42j750k444
4699f360j723K130L731L733K83j553J278O58j918l443j736N53N400Ll756K975
4683B55K374L39J504j071j470p83M3L87O12r90k280J261j200J350M262j011p68
4666B814Q36k072j342j784j105J91j116L67k83o01J549l214P16K126J389k86r73
4649b788k240l126j08L99j856j572L759M221J336P42K37l95o82J479j769j573
$$ plain form
4633 -3936 -5503 -5540 -3210 -3328 -3463 -2722 -2832 -3841 164 2227 1845 838 2160 2230 1575 1924 2625 1554
4615 1554 1149 1386 1320 326 -2792 -5491 -4177 -5383 -873 -1132 -912 -1340 1268 847 -994 -2566 -3948
4598 -3948 -3921 -1496 -1475 -1645 -2205 -872 2062 5789 7700 6911 5301 4127 1711 -1380 -1936 -1510 2324
4581 2324 3445 4116 3045 1170 -3538 -1297 2217 1841 -2245 -923 334 -3135 -3522 778 1842 21
4565 21 -1096 -3204 -5416 -6111 -6761 -3289 1015 -1575 -120 1793 2160 -798 -651 1670 1533 -375 1259
4548 1259 6107 6682 5969 5344 7294 9057 7191 3090 -2856 345 1950 2847 3862 2288 3315 5534
4532 5534 7098 6166 5836 3355 1457 1350 2720 686 -3107 -1345 25 -1732 -426 -2605 -2507 -1113
4516 -1113 -2194 -5430 -5890 -4279 -645 4336 1178 -2302 -903 -3392 -5895 -6340 -2313 -819 -6556
$$ packed form
4633c936j567l7K330j18j35P41j10j009M005K063l82j007J322P0o55L49P01j071
4615A554m05K37o6r94l118k699J314j206M510k59K20m28K608m21j841j572j382
4598c948K7K425K1j70n60J333K934L727J911p89j610j174k416l091n56M26L834
4581B324J121O71j071j875m708K241L514l76m086J322J257l469l87M300J064j821
4565B1j117k108k212o95o50L472M304k590J455J913L67k958J47K321j37j908J634
4548A259M848N75p13o25J950J763j866m101n946L201J605Q97J015j574J027K219
4532E534J564r32l30k481j898j07J370k034l793J762J370j757J306k179R8J394
4516a113j081l236m60J611L634M981l158l480J399k489k503m45M027J494n737
$$ plain form
4501 -6556 -8489 -4299 -1528 -2042 -2833 -2885 -897 1531 -236 -1037 421 2017 363 -1436 -2688 -2788
4485 -2788 -4151 -2349 -2412 -3995 -3847 -2574 454 368 78 -2810 -5267 -2574 -1354 -2719 -6415 -8732
4469 -8732 -3218 3945 4843 217 -5128 -6231 -4550 -1549 -241 -1655 115 -96 -594 -2233 -1819 -928
4453 -928 -1069 -562 3039 3824 -178 -2626 -4295 -4223 -2460 -168 -150 -2367 -4774 -3600 -3283 -3342 -4715 -489
4435 -489 2944 2577 -586 -1964 155 3094 2925 1159 3772 5967 4479 2235 1000 -3432 -1556 1513
4419 1513 3485 7233 7524 5123 1759 -114 -1802 -1812 3197 6969 7037 3015 3373 4161 7069 6660 5003
4402 5003 4390 3066 -255 -39 -521 -1092 -964 33 -514 863 1122 -477 33 388 -175 918 3754 4547
4384 4547 3068 80 -1355 -3162 -1181 524 1465 422 -66 290 1279 2744 6710 9021 5039 3353
$$ packed form
4501f556j933M190K771n14p91n2J988K428j767q01J458J596j654j799j252j00
4485b788j363J802o3j583J48J273L028q6k90k888k457K693J220j365l696k317
4469h732N514P163Q98m626n345j103J681L001J308j414J770k11m98j639M14Q91
4453i28j41N07L601P85m002k448j669P2J763K292J8k217k407J174L17n9j373M226
4435d89L433l67l163j378K119K939j69j766K613K195j488k244j235m432J876L069
4419A513J972L748K91k401l364j873j688j0N009L772O8m022L58P88K908m09j657
4402E003o13j324l321K16m82n71J28R97n47J377K59j599N10L55n63J093K836P93
4384D547j479k988j435j807J981J705R41j043m88L56R89J465L966K311l982j686
$$ plain form
4368 3353 2597 2876 1477 443 -2727 -2281 -1442 -804 -3056 -4478 -4334 -3966 1386 5022 6084 4255 1706
4351 1706 -1277 1983 3089 5659 6170 1120 -493 297 -5151 -6168 -4147 -4781 -10553 -10734 -9586 -7656
4335 -7656 -3947 -4749 -7440 -5379 -2528 1783 2242 1806 2884 6024 7430 9890 11408 6905 1008 807
4319 807 -138 2438 3284 1719 -913 -3375 2538 6730 4881 2965 1797 731 1569 -3820 -6742 -7656
4303 -7656 -5348 -2135 -4935 -2679 -1390 -2748 -4677 -5703 -2423 703 1788 379 -3185 -3354 -3153
4288 -3153 -1037 -62 -408 -2592 -2985 984 -1353 -2037 -3456 -3312 -1980 1816 3804 -211 -3327 -4891
4272 -4891 -8911 -9148 -8195 -5041 -2199 -863 1153 1836 2454 3787 3447 3148 1198 -1335 -1747 1112 3199
4255 3199 436 -2104 263 -1475 -1721 -3050 -1678 2127 2859 2207 1738 -2406 -5538 -7029 -7018 -8418
$$ packed form
4368C353p56K79j399j034l170M46Q39O38k252j422J44L68N352L636J062j829k549
4351A706k983L260J106K570N11n050j613P90n448j017K021o34n772j81J148J930
4335g656L709q02k691K061K851M311M59m36J078L140J406K460J518m503n897k01
4319H07r45K576Q46j565k632k462N913M192j849j916j168j066Q38n389k922r14
4303g656K308L213k800K256J289j358j929j026L280L126J085j409l564j69K01
4288c153K116R75l46k184l93L969k337o84j419J44J332L796J988m015l116j564
4272d891m020k37R53L154K842J336K016O83O18J333l40k99j950k533m12K859K087
4255C199k763k540K367j738k46j329J372L805P32o52m69m144l132j491J1j400
$$ plain form
4239 -8418 -5973 -4330 -3760 -1136 -122 1692 2065 2891 5785 4649 -1772 -2478 -72 -1133 309 -159
4223 -159 -1148 -1334 -3178 1677 3930 2891 541 258 32 -1459 -713 -2594 -2473 -916 418 -134 482
4206 482 -124 1204 1214 1160 3679 795 -866 853 1280 -1573 -1762 -654 -1620 -5002 -7646 -8392 -6263
4189 -6263 -2143 -1257 855 -924 -2653 -1041 -2482 -3642 -4767 -5396 -1510 1601 2115 2576 3717 4527
4173 4527 3886 3592 1088 921 -418 -255 1394 43 -4189 -3343 -2505 1202 591 -3655 -4450 -4069 -1979
4156 -1979 432 2103 3715 5318 3835 4381 3686 498 -1385 958 453 -325 -1058 -1220 0 -718 154
4139 154 173 -1189 -2644 -331 -529 -2340 -3006 -1831 -2132 -3336 -4623 -4957 -2726 -2098 -3815 -4022 -5475
4122 -5475 -4190 -3483 -2110 -765 -2390 -2116 -1815 -4383 -8254 -8690 -8491 -8079 -5593 -2427 -1771 100 1482
$$ packed form
4239h418K445J643N70K624J014J814L73Q26K894j136o421p06K406j061J442m68
4223a59r89j86j844M855K253j039k350k83k26j491P46j881J21J557J334n52O16
4206D82o06J328J0n4K519k884j661J719M27k853j89J108r66l382k644p46K129
4189f263M120Q86K112j779j729J612j441j160j125o29L886L111N14M61J141Q10
4173D527o41k94k504j67j339J63J649j351m232Q46Q38L707o11m246p95L81K090
4156a979K411J671J612J603j483N46o95l188j883K343n05p78p33j62J220p18Q72
4139A54J9j362j455K313j98j811o66J175l01j204j287l34K231O28j717k07j453
4122e475J285P07J373J345j625K74L01k568l871m36J99M12K486L166O56J871J382
$$ plain form
4105 1482 2040 2393 2268 3641 5495 4892 1658 573 2640 3437 574 1219 5339 5463 -771 -4503 -5353
4088 -5353 -5493 -6575 -5129 -1653 4168 1551 -1522 -3149 -6657 -2924 -2327 -3543 -3560 -6392 -6835 -5206
4072 -5206 -3008 1876 3760 1144 532 4113 6389 10336 13394 10954 5414 1973 2660 476 -2007
4057 -2007 -3199 -1260 -3949 -3867 -1214 -1607 -3020 -772 -3009 -2537 -3458 -2046 -2623 -2055 -2414 -2677 -2351
4040 -2351 463 1280 2950 4802 4658 6561 6816 1893 -1525 -2813 -3383 -742 3349 4791 6058 4445
4024 4445 5089 5015 4068 617 903 2260 -1405 -3493 -3727 -3600 -1152 -799 -3430 -1926 2880 5038 9523
4007 9523 8468 8112 5887 671 -1063 -1014 -868 -1835 -4416 -748 3254 2112 -826 -1723 -1335 839 2201
3990 2201 1603 2366 5317 6759 2079 -1916 -4725 -6223 -6801 -3796 -3790 -3032 -4145 -3910 -1031 1389 3536
$$ packed form
4105A482N58L53j25J373J854o03l234j085K067P97k863O45M120J24o234l732q50
4088e353j40j082J446L476N821k617l073j627l508L733N97j216j7k832m43J629
4072e206K198M884J884k616o12L581K276L947L058k440n540l441O87k184k483
4057b007j192J939k689Q2K653l93j413K248k237M72r21J412n77N68l59k63L26
4040b351K814Q17J670J852j44J903K55m923l418j288n70K641M091J442J267j613
4024D445O44p4r47l451K86J357l665k088k34J27K448L53k631J504M806K158M485
4007I523j055l56k225n216j734M9J46r67k581L668M002j142k938q97L88K174J362
3990B201n98P63K951J442m680l995k809j498n78L005OP58j113K35K879K420K147
$$ plain form
3973 3536 2789 711 110 2845 1526 -1688 -2043 -2240 -611 -643 -3731 -4640 -4818 -6184 -6488 -1272 848
3956 848 -1757 -400 1284 2232 2937 1464 29 -183 2584 1328 367 -703 -1685 -404 -1989 -3964
3940 -3964 -5958 -3328 986 667 -1858 -3644 -2124 -1530 207 -144 -1509 -3007 -3088 420 2194 1496
3924 1496 103 1954 -717 -3554 -1469 1117 1220 -1061 1221 2902 2294 4056 5067 4516 2027 1119
3908 1119 3055 2410 1033 2719 2864 2111 5120 8727 5236 1686 3294 3545 1082 1368 241 -813
3892 -813 -1295 -2858 -3254 607 4960 5581 988 -3144 -6598 -6688 -3855 -1510 -4136 -5564 -7635 -4867
3876 -4867 -3200 -4091 -2084 1908 2506 233 1191 5389 5840 4214 750 -531 -1196 535 -3652 -3445
3860 -3445 -3316 -4133 1409 4729 5911 6769 5514 5961 4467 3219 5285 5221 1583 2727 4001 4965 4984
$$ packed form
3973C536p47k078o01K735j319l214l55j97J629l2l088r09j78j366l04N216K120
3956H48k605J357J684R48P05j473j435k12K767j256r61j070r82J281j585j975
3940c964j994K630M314l19k525j786J520N94J737l51j365j498q1L508J774o98
3924A496j393J851k671k837K085K586J03k281K282J681o08J762J011n51k489r08
3908A119J936o45j377J686J45p53L009L607l491l550J608K51k463K86j127j054
3892h13m82j563l96L861M353O21m593m132l454r0K833K345k626j428k071K768
3876d867J667q91K007L992N98k273R58M198M51j626l464j281o65J731m187K07
3860c445J29q17N542L320J182Q58j255M47j494j248K066o4l638J144J274R64J9
$$ plain form
3843 4984 4488 1682 95 2212 -266 -3839 120 -466 -59 1396 4224 6266 6566 5695 1818 735
3827 735 -1555 -1666 3262 5808 3828 1869 -828 -3215 -1464 -4100 -4931 -35 -739 -2698 -4683 -4736
3811 -4736 -3566 -1564 -1129 1816 2870 165 -3858 -4218 -2512 -2041 -3947 -4405 -2838 -2008 -1232 -2290
3795 -2290 -2826 -1929 368 -222 -4850 -5822 -3362 -3436 -1807 -271 -2122 -1540 -98 3106 4780 3149 3124
3778 3124 956 -2131 -2461 556 596 538 2377 -1466 -1232 2295 4281 1585 -357 1568 5594 6231 5419
3761 5419 3010 -2364 -4376 -1224 3145 3945 5608 3263 -1610 -6257 -6399 -2634 3298 -958 -3293
3746 -3293 -4392 -3421 -278 43 -1798 -1155 -786 -3115 -1957 -1952 -332 373 -1097 467 1793 2630 2794
3729 2794 2143 -1516 -1290 1081 -156 88 276 2433 5245 4504 1169 -1587 -3624 -3531 -1659 -1300 -2033
$$ packed form
3843D984m96k806j587K117k478l573L959n86M07J455K828K042L00q71l877j083
3827G35k290j11M928K546j980j959k697k387J751k636q31M896p04j959j985n3
3811d736J170K002M35K945J054k705m023l60J706M71j906m58J567Q30P76j058
3795b290n36Q97K297n90m628r72K460p4J629J536j851N82J442L204J674j631k5
3778C124k168l087l30L017M0n8J839l843K34L527J986k696j942J925M026O37q12
3761E419k409n374k012L152M369Q00J663k345m873m647j42L765N932m256k335
3746c293j099R71L143L21j841O43L69k329J158NJ620P05j470J564J326Q37J64
3729B794o51l659K26K371j237K44J88K157K812p41l335k756k037R3J872L59p33
$$ plain form
3712 -2033 -1428 2899 4499 4928 7438 10213 10396 7811 3098 665 1058 3845 3393 -419 -3458 -693
3696 -693 1601 730 -1110 -1200 -274 -991 -2029 -2080 -3639 -5156 -3206 -1510 912 -414 -483 -720 616 3779
3678 3779 5989 1658 -3920 -3118 -1472 2432 2292 243 416 1109 286 690 1048 -357 -1196 -170 4319
3661 4319 4039 1052 -527 848 2177 3829 1915 -163 -2461 -2655 -1667 -2638 -4208 -4613 -4034 -4901 -4594
3644 -4594 -4466 -1482 3314 6656 5015 1084 396 2555 3077 4622 3403 119 -1578 841 15 -1812
3628 -1812 -749 -5619 -7039 -7521 -5400 -2048 1473 2877 5943 5189 229 -2240 -2586 -1070 3433 3046
3612 3046 1078 -2299 -2759 1414 2189 -1285 -1355 2395 3218 1972 889 788 81 664 4693 5368 1758
3595 1758 1055 3082 2196 2724 1179 -547 2175 1467 1690 3377 3488 2856 3429 116 -872 1368 547
$$ packed form
3712b033O05M327J600M29K510K775J83k585m713k433L93K787m52l812l039K765
3696f93K294q71j840r0R26p17j038n1j559j517J950J696K422j326o9k37J336L163
3678C779K210m331n578Q02J646L904j40k049J73O93q23M04L58j405q39J026M489
3661D319k80k987j579J375J329J652j914k078k298j94R88r71j570m05N79q67L07
3644d594J28K984M796L342j641l931o88K159N22J545j219l284j697K419q26j827
3628a812J063m870j420m82K121L352L521J404L066p54m960k469l46J516M503l87
3612C046j968l377m60M173P75l474p0L750Q23j246j083j01p07N83M029O75l610
3595A758p03K027q86N28j545j726K722p08K23J687J11o32N73l313r88K240q21
$$ plain form
3578 547 -1572 -649 565 -1519 -2368 -3858 -3341 -2019 -2476 -476 2215 1553 4568 8696 11076 6438
3562 6438 -938 -4097 -4524 -6047 -5191 -1634 507 662 1883 347 -1821 -3713 485 3797 2140 3896
3546 3896 7460 7953 6809 602 -1746 -5000 -5166 -5220 -5199 -2694 593 -306 -109 1839 1847 2005 1973 3069
3528 3069 3207 -660 320 1454 -1 -2021 -2782 -4194 -1715 -2694 -1823 -1173 -3200 -7064 -7160 -1419 467
3511 467 1676 2338 4820 4064 3146 3941 6754 7904 8001 5504 -1027 -694 1673 2399 -278 224 4829
3494 4829 6914 4199 4192 1758 4140 5016 4290 4164 85 1988 4214 1994 2159 1937 -231 -1428 -4747
3477 -4747 -5561 -988 292 2537 458 -1517 -137 -978 2598 3683 -200 1752 3749 -360 1524
3462 1524 2749 451 343 -543 -2144 -1500 311 -1743 -1102 -4172 -3680 -2926 -1056 13 1559 4070
$$ packed form
3578E47k119R23J214k084q49j490N17J322m57K000K691o62L015M128K380m638
3562F438p376l159m27j523Q56L557K141J55J221j536k168j892M198L312j657J756
3546C896L564M93j144o207k348l254j66n4K1K505L287q99J97J948QJ58l2J096
3528C069J38l867R80J134j455k020p61j412K479r79Q71O50k027l864r6N741J886
3511D67J209O62K482p56r18P95K813J150R7k497o531L33K367P26k677N02M605
3494D829K085k715pk434K382Q76p26j26m079J903K226k220J65k22k168j197l319
3477d747q14M573J280K245k079j975J380q41L576J085l883J952J997m109J884
3462A524J225k298j08q86j601O44J811k054O41l070M92P54J870J069J546K511
$$ plain form
3446 4070 4724 4749 4882 5227 7463 4675 2547 3863 3447 1986 2993 4448 3640 1867 2376 4289 5321
3429 5321 4912 4591 1407 1053 1301 1373 1821 1098 1343 4639 4611 3359 2217 2951 3852 2853 -226 340 1038
3410 1038 3578 6443 5134 2744 867 -3902 -1713 225 2843 3995 6680 4984 2581 -1753 -1455
3395 -1455 4680 3615 2631 4585 2039 4602 5935 4912 3226 -393 898 -1083 -2545 -1428 1696
3380 1696 5229 2531 3172 3872 -1506 -2223 -3061 -4771 -4060 -6064 -6257 -4515 -4880 -2643 -3160 -3080 -1264
3363 -1264 2120 1604 -3539 -4947 -3531 -1927 -1351 -2244 -1037 -74 2226 696 -612 -4247 -5713 -3816
$$ packed form
3446D070O54K5J33L45K236k788k128J316m16j461J007J455q08j773N09J913J032
3429E321m09l21l184l54K48P2M48p23K45L296k8j252j142P34R01r99l079N66O98
3410A038K540K865j309k390j877m769K189J938K618J152K685j696k403m334K98
3395a455O135j065r84J954k546K563J333j023j686l619J291j981j462J117L124
3380A696L533k698O41P00n378p17q38j710P11k004j93J742l65K237n17Q0J816
3363a264L384n16n143j408J416J604N76q93J207R63K300j530j308l635j466J897
$$ [...]
##END NTUPLES=NMR SPECTRUM
##END=
