##TITLE=Analysis number 313339
Compound Code cc 41913
Book Reference 437/40
Project Code adrs
Chemist Name wendyb
##JCAMPDX= 6.0         $$ Bruker NMR JCAMP-DX V2.0
##DATA TYPE= NMR SPECTRUM
##DATA CLASS= NTUPLES
##ORIGIN= Bruker BioSpin GmbH
##OWNER= NMR
$$ XWIN-NMR		Version 3.5
$$ Tue Sep  6 09:01:57 2005 GMT Daylight Time (UT+1h)  MAYBRIDGE\NMR@NMR_250MHZ
##.OBSERVE FREQUENCY= 250.131544655141
##.OBSERVE NUCLEUS= ^1H
##.ACQUISITION MODE= SIMULTANEOUS (DQD)
##.ACQUISITION SCHEME= undefined
##.AVERAGES= 16
##.DIGITISER RES= 18
##SPECTROMETER/DATA SYSTEM= dpx250
##.PULSE SEQUENCE= zg30
##.SOLVENT NAME= CDCl3
##.SHIFT REFERENCE= (INTERNAL, CDCl3, 0, 16.522)
##AUDIT TRAIL= $$ (NUMBER, WHEN, WHO, WHERE, WHAT)
$$ ##TITLE= Audit trail, XWIN-NMR		Version 3.5
$$ ##JCAMPDX= 5.01
$$ ##ORIGIN= Bruker BioSpin GmbH
$$ ##OWNER= NMR
$$ C:\u/data/dgb/nmr/ADRS/9040/pdata/1/auditp.txt
$$ ##AUDIT TRAIL=  $$ (NUMBER, WHEN, WHO, WHERE, WHAT)
(   1,<2005-09-06 09:01:16.49 +100>,<MAYBRIDGE\NMR>,<NMR_250MHZ>,
      <created by zg, POWCHK disabled, PULCHK disabled
       configuration hash MD5:
       62 19 C7 07 E1 42 D1 B7 37 6C 3D D0 77 39 F9 E6
       data hash MD5: 64K
       41 2E 94 BF FA 20 41 18 E0 E6 4F A2 8B D2 87 12>)
(   2,<2005-09-06 09:01:33.60 +100>,<MAYBRIDGE\NMR>,<NMR_250MHZ>,
      <Start of raw data processing
       ef LB = 0.3 FT_mod = 6 PKNL = 1 SI = 32K 
       data hash MD5: 32K
       16 85 F4 79 07 09 3F 8F 60 69 BA 33 A1 C9 65 32>)
(   3,<2005-09-06 09:01:39.78 +100>,<MAYBRIDGE\NMR>,<NMR_250MHZ>,
      <apk 
       data hash MD5: 32K
       D4 65 06 3C 10 8A 8E 94 01 50 E7 D3 12 08 F2 2E>)
(   4,<2005-09-06 09:01:42.06 +100>,<MAYBRIDGE\NMR>,<NMR_250MHZ>,
      <abs ABSG = 5 
       data hash MD5: 32K
       4A 50 E5 E2 0D EC 8B 85 9F F3 5C 0D DA 0B 4E 89>)
$$ ##END=
$$ 
$$ hash MD5
$$ 58 7F 36 B4 F4 01 A2 CE B8 61 D3 19 D0 6E 2F E5
##$RELAX= 
##$RELAX= 
##$RELAX= 
##$RELAX= 
##$RELAX= 
##$RELAX= 
##$RELAX= 
$$ Bruker specific parameters
$$ --------------------------
##$DU= <C:\u>
##$EXPNO= 9040
##$NAME= <ADRS>
##$PROCNO= 1
##$TYPE= <nmr>
##$USER= <dgb>
##$AMP= (0..31)
100 100 100 100 100 100 100 100 100 100 100 100 100 100 100 100 100 100 
100 100 100 100 100 100 100 100 100 100 100 100 100 100 
##$AQSEQ= 0
##$AQ_mod= 3
##$AUNM= <au_zg>
##$AUTOPOS= <1 >
##$BF1= 250.13
##$BF2= 250.13
##$BF3= 250.13
##$BF4= 250.13
##$BF5= 500.13
##$BF6= 500.13
##$BF7= 500.13
##$BF8= 500.13
##$BYTORDA= 1
##$CFDGTYP= 0
##$CFRGTYP= 5
##$CHEMSTR= <none>
##$CNST= (0..31)
1 1 145 1 1 1 1 1 1 1 1 1 1 1 1 1 1 1 1 1 1 1 1 1 1 1 1 1 1 1 1 1 
##$CPDPRG= <>
##$CPDPRG1= <>
##$CPDPRG2= <>
##$CPDPRG3= <>
##$CPDPRG4= <mlev>
##$CPDPRG5= <mlev>
##$CPDPRG6= <mlev>
##$CPDPRG7= <mlev>
##$CPDPRG8= <mlev>
##$CPDPRGB= <>
##$CPDPRGT= <>
##$D= (0..31)
0 1 0 0 0 0 0 0 0 0.06 0 0 0 0 0 0 0.0002 0 0 0 0 0 0 0 0 0 0 0 0 0 0 
0 
##$DATE= 1125993675
##$DBL= (0..7)
120 120 120 120 120 120 120 120 
##$DBP= (0..7)
150 150 150 150 150 150 150 150 
##$DBP07= 0
##$DBPNAM0= <>
##$DBPNAM1= <>
$$ [...]
##$SUBNAM7= <"">
##$SUBNAM8= <"">
##$SUBNAM9= <"">
##$SW= 20.6930455092707
##$SWIBOX= (0..15)
0 0 3 0 0 0 0 0 0 0 0 0 0 0 0 0 
##$SW_h= 5175.983436853
##$TD= 65536
##$TD0= 1
##$TE= 295.16
##$TE2= 300
##$TE3= 300
##$TEG= 300
##$TL= (0..7)
0 120 120 120 120 120 120 120 
##$TP= (0..7)
150 150 150 150 150 150 150 150 
##$TP07= 0
##$TPNAME0= <>
##$TPNAME1= <>
##$TPNAME2= <>
##$TPNAME3= <>
##$TPNAME4= <>
##$TPNAME5= <>
##$TPNAME6= <>
##$TPNAME7= <>
##$TPOAL= (0..7)
0.5 0.5 0.5 0.5 0.5 0.5 0.5 0.5 
##$TPOFFS= (0..7)
0 0 0 0 0 0 0 0 
##$TUNHIN= 0
##$TUNHOUT= 0
##$TUNXOUT= 0
##$USERA1= <user>
##$USERA2= <user>
##$USERA3= <user>
##$USERA4= <user>
##$USERA5= <user>
##$V9= 5
##$VALIST= <valist>
##$VCLIST= <CCCCCCCCCCCCCCC>
##$VD= 0
##$VDLIST= <DDDDDDDDDDDDDDD>
##$VPLIST= <PPPPPPPPPPPPPPP>
##$VTLIST= <TTTTTTTTTTTTTTT>
##$WBST= 1024
##$WBSW= 4
##$XGAIN= (0..3)
0 0 0 0 
##$XL= 0
##$YL= 0
##$YMAX_a= 287548
##$YMIN_a= -535808
##$ZGOPTNS= <>
##$ZL1= 120
##$ZL2= 120
##$ZL3= 120
##$ZL4= 120
##$ABSF1= 16.522
##$ABSF2= -4.171173
##$ABSG= 5
##$ABSL= 3
##$ALPHA= 0
##$AQORDER= 0
##$ASSFAC= 0
##$ASSFACI= 0
##$ASSFACX= 0
##$ASSWID= 0
##$AUNMP= <proc_1d>
##$AZFE= 0.1
##$AZFW= 0.1
##$BCFW= 0
##$BC_mod= 0
##$BYTORDP= 0
##$COROFFS= 0
##$CY= 12.5
##$DATMOD= 1
##$DC= 0
##$DFILT= <>
##$DTYPP= 0
##$F1P= 14.0000005364418
##$F2P= -0.99999901652339
##$FCOR= 0.5
##$FTSIZE= 32768
##$FT_mod= 6
##$GAMMA= 0
##$GB= 0
##$INTBC= 1
##$INTSCL= 1
##$ISEN= 128
##$LB= 0.3
##$LEV0= 0
##$LPBIN= 0
##$MAXI= 10000
##$MC2= 0
##$MEAN= 0
##$ME_mod= 0
##$MI= 0
##$NCOEF= 0
##$NC_proc= -5
##$NLEV= 6
##$NOISF1= 0
##$NOISF2= 0
##$NSP= 0
##$NTH_PI= 0
##$NZP= 0
##$OFFSET= 16.522
##$PC= 1
##$PHC0= -80.48631
##$PHC1= 4.826966
##$PH_mod= 1
##$PKNL= yes
##$PPARMOD= 0
##$PSCAL= 4
##$PSIGN= 0
##$REVERSE= no
##$SF= 250.13
##$SI= 32768
##$SIGF1= 0
##$SIGF2= 0
##$SINO= 400
##$SIOLD= 32768
##$SREGLST= <1H.CDCl3>
##$SSB= 0
##$STSI= 32768
##$STSR= 0
##$SW_p= 5175.98343685301
##$SYMM= 0
##$S_DEV= 0
##$TDeff= 65536
##$TDoff= 0
##$TI= <Analysis number 999999
Compound Code 99
Book Reference 9
Project Code 9>
##$TILT= no
##$TM1= 0
##$TM2= 0
##$TOPLEV= 0
##$USERP1= <user>
##$USERP2= <user>
##$USERP3= <user>
##$USERP4= <user>
##$USERP5= <user>
##$WDW= 1
##$XDIM= 32768
##$YMAX_p= 489329604
##$YMIN_p= -215846
$$ End of Bruker specific parameters
$$ ---------------------------------
##NTUPLES= NMR SPECTRUM
##VAR_NAME=  FREQUENCY,     SPECTRUM/REAL,   SPECTRUM/IMAG
##SYMBOL=    X,             R,               I
##VAR_TYPE=  INDEPENDENT,   DEPENDENT,       DEPENDENT
##VAR_FORM=  AFFN,          ASDF,            ASDF
##VAR_DIM=   32768,         32768,           32768
##UNITS=     HZ,            ARBITRARY UNITS, ARBITRARY UNITS
##FACTOR=    0.157963299565203, 1,           1
##FIRST=     4132.6476996994, 0,             0
##LAST=      -1043.33573715361, 0,           0
##MIN=       -1043.33573715361, -215846,     0
##MAX=       4132.6476996994, 489329604,     0
$$ Real data points
##PAGE= N=1
##DATA TABLE= (X++(R..R)), XYDATA
$$ [...]
18062A3543909j437890q49016m58854j45403J94918L20622O17907J114834J626616
18053A4527643K395846L480910N000109O430139P197967P489696P813667P089397
18045F1425374M267133J192883j152798k444304j460062J342678N349284R429652
18037G7949840J2497130J4177598J3899289J0538295N382971K181587j41092j182858
18029A35302760k460979m738824o415939o857910o134483o521192q348086j0149005
18021H3676342j1027000r818978p530340n633397m797680m857482n284287n191499
18013B9535679m400875l336450k168891j166558l09773M38881J359022K537713
18005B2488748M062306N999766P628691Q574523R054140Q988657P295502L915050
$$ plain form
18062 13543909 12106019 11257003 10798149 10652746 10847664 11168286 11786193 12901027 14527643
18053 14527643 16923489 20404399 25404508 31834647 39032614 46522310 54335977 61425374
18045 61425374 65692507 66885390 65732592 63288288 61828226 63170904 68520188 77949840
18037 77949840 90446970 104624568 118523857 129062152 134445123 136626710 136485618 135302760
18029 135302760 132841781 128102957 121687018 114829108 108694625 102173433 93825347 83676342
18021 83676342 72649342 62830364 55300024 49666627 44868947 40011465 34727178 29535679
18013 29535679 25134804 21798354 19629463 18462905 18153132 18592013 19951035 22488748
18005 22488748 26551054 32550820 40179511 48754034 57808174 66796831 74092333 78007383
17997G8007383N46922j891147k643213j113158J625414M354488O966530R220701
17989I5073920R516981O740815K542175j810744m190943l627817j212367J220831
17981A04252851J941634q94893n989983j1195637j4898967j4970347j2732654
17974D5512004r377291n922573l062283j094992j02106j56869j112007k251539
17966B2432344l124480l311255k941482k401769j820052j275680r52096p93341
17958E812189o93808n53608l95226k88070k86156k47587k39894k30577j90640
17949B686623j36087p5023j29106j35569m6564j153p4813q4933p6697j20439j43370
17938A662869j19442p6743j05000r8372k2965m314m3900o4905m1599L937L7337
$$ plain form
17997 78007383 78554305 76663158 74019945 72906787 74532201 78886689 85853219 95073920
17989 95073920 104590901 111331716 113873891 112063147 107872204 104244387 103032020 104252851
17981 104252851 106194485 105299592 99309609 88113972 73215005 58244658 45512004
17974 45512004 36134713 30212140 27149857 26054865 25952759 25795890 24683883 22432344
17966 22432344 19307864 15996609 13055127 10653358 8833306 7557626 6605530 5812189
17958 5812189 5118381 4564773 4169547 3881477 3595321 3347734 3107840 2877263 2686623
17949 2686623 2550536 2475513 2346407 2210838 2164274 2163121 2088308 2003375 1926678 1806239 1662869
17938 1662869 1543427 1466684 1361684 1263312 1240347 1236033 1192133 1127228 1085629 1089566 1126903
17927A126903P169o2468m0855j7198O278N8912J9042N444N0802K1069m7692o4383
17915A063023o6728j00917m4173P1p6221K4242L0444N893J0109m0949j7576l3891
17903G53327n8196m3185m5187o9662l740j5711K7024j1943o1352l0738n2843L8919
17891D26713L5946l2743P023O6597l7751L0452q624L0836L2081M1448m617k6975
17879E60386k7162Q455M083j3678M2218n268J64J8171j5657m0620m0727J6554
17867E06919J2482m392n9077k1815M2041p260k8162j6504o948l8208l7657p033
17855C34386N7763l3138o4444L5918P5938l0879l0036o1295M263K1476J2315j6409
17843C05858O9915k3641o5228k851k7451n318l4882J1054J7403M2430o6395p6813
$$ plain form
17927 1126903 1134072 1071604 1030749 1013551 1019829 1078741 1097783 1103227 1154029 1175098 1127406 1063023
17915 1063023 996295 895378 851205 851276 775055 799297 829741 835634 845743 804794 787218 753327
17903 753327 695131 651946 606759 537097 533357 517646 544670 532727 471375 440637 387794 426713
17891 426713 462659 429916 436939 503536 465785 496237 487613 518449 550530 591978 587361 560386
17879 560386 533224 541679 545762 532084 574302 569034 569198 587369 571712 531092 490365 506919
17867 506919 519401 515009 455932 434117 476158 468898 440736 424232 417284 379076 341419 334386
17855 334386 392149 359011 294567 330485 406423 375544 345508 284213 288476 309952 322267 305858
17843 305858 375773 352132 286904 284053 256602 251284 216402 227456 244859 287289 220894 144081
17831A44081j3704L6831j7464l3945k5126J1941M6095J1280k6920m9404r997r87
17819G2681l1770k3906L9456M8936P5529L283K409L0375P015m5079J947R756L5935
17806B26567l8012k1806k6336m4670M8275O2092K0412J1314N564n5012l7184l3665
17794A17539k4274K7321K8669L2011j5902l1176J7034K3467p688l4114k9588o3597
17782C9702k2123M7353M8563j9377m25L2465J2923j8645n3072p536R459M7358
17770A16645j9856Q537N2258j1772k5522J8589K9656J1850J1738o8362j3575P9404
17758A89590N8196L5129j1852j3322n0712k7748l513p987n5128N211N7804l6624
17746A39044l6664L878M3046l9954k0257J2627L1314M7706N9562M702j8633J4711
$$ plain form
17831 144081 130377 167208 149744 115799 90673 102614 148709 159989 133069 83665 73668 72681
17819 72681 40911 17005 56461 105397 180926 184209 186618 216993 224008 178929 180876 190632 226567
17806 226567 188555 166749 140413 95743 144018 206110 226522 237836 243400 188388 151204 117539
17794 117539 93265 120586 149255 181266 165364 134188 151222 174689 167001 132887 103299 39702
17782 39702 17579 64932 113495 94118 93693 126158 139081 120436 67364 59828 69287 116645
17770 116645 96789 105326 157584 145812 120290 138879 168535 180385 192123 123761 110186 189590
17758 189590 247786 282915 271063 257741 207029 179281 175768 167781 112653 117864 175668 139044
17746 139044 102380 106258 149304 109350 89093 101720 133034 180740 240302 245004 226371 241082
17734B41082P5805J09850O3029J1542k0199k7788M6677o8965m1074N567J7975
17723D13501l8346n2782q47M5013j5602k6805J3377j6535p0671k4147J7708k4044
17711B19820J1643J2178j9692l0879l6938j3070K405K306J8083L0005M2257l617
17699B34501k7633L0684N1798j855n2583o088L0119M5467M4759L1187M8736L1565
17687D60657J4209J0211K2638L7928K2950O783O9991j3742m6308k2795o83K409
17675E64248l5089k3083k8933m0172l3653Q693N0583m9440o5042L2028L4114k5901
17663C88353L243J7527M5878N7059K0942J5513n3908J5323K4162K8100m9293L2234
17651E45133N6962L2343K3236L7389L124N3821P6807L7210j7442O3003Q5659L8628
$$ plain form
17734 241082 316887 426737 489766 501308 481109 453321 499998 431033 389959 395526 413501
17723 413501 375155 322373 321526 366539 350937 324132 337509 320974 250303 226156 243864 219820
17711 219820 231463 243641 223949 193070 156132 143062 145467 147773 165856 195861 238118 234501
17699 234501 206868 237552 289350 287495 234912 228824 258943 304410 349169 380356 429092 460657
17687 460657 474866 485077 507715 545643 568593 575376 645367 631625 585317 562522 561839 564248
17675 564248 529159 506076 477143 436971 403318 412011 462594 413154 348112 380140 414254 388353
17663 388353 391596 409123 455001 512060 533002 548515 494607 509930 534092 562192 512899 545133
17651 545133 602095 634438 657674 695063 698187 752008 828815 866025 848583 911586 997245 1035873
17639A035873K3959L7885O0085K4355L5030O5812J83270J62386J44974R3745J18579
17628A985953J19689J2857K2188L3982M0061J71569K45308J90794K31993K10939
17618C265333K70915L58942M59879O09532Q29235J073267J465302J933124K703060
17609A2968589L935369O031008Q700539J0830265J0310002O530740J487065k354457
17601E8439120k764819L74679M388796N523955K000588m010499r476974j2097443
17593D2377403j1264092q638388n906294l850588k488333j681534j150058p53959
17585F644157m60408k68445j92990j72495l0986J6837K9269K9473J17460J60084
17575E871956J76547K81676L55775M15548M65012N26294O63659R05312J247919
$$ plain form
17639 1035873 1059832 1097717 1157802 1182157 1217187 1282999 1466269 1628655 1773629 1867374 1985953
17628 1985953 2105642 2118499 2140687 2174669 2214730 2386299 2631607 2822401 3054394 3265333
17618 3265333 3536248 3895190 4355069 4964601 5793836 6867103 8332405 10265529 12968589
17609 12968589 16903958 22934966 31635505 42465770 52775772 59306512 60793577 58439120
17601 58439120 55674301 56048980 60437776 65961731 67962319 63951820 54474846 42377403
17593 42377403 31113311 22474923 16568629 12718041 10229708 8548174 7398116 6644157
17585 6644157 6183749 5915304 5722314 5549819 5518833 5535670 5564939 5594412 5711872 5871956
17575 5871956 6048503 6330179 6685954 7101502 7566514 8092808 8756467 9661779 10909698
17566A0909698J727723K310293L176669M632499O945308J0555878J4944697J7947373
17558G3150138J6674413J0541682L161859k050200l218162j901038j321987j970745
17550I3065960l516269n871146q682474j1252206j2712199j2307294j0095962
17543B8628410p233293m798818l153629k185755j497285j034473p00702m51308
17535G573147l90378k79114k19869j61362k17424k64006j74884j27002m2522R124
17525E705710J6867J08447K68552M59521N67429O67694Q29427J063609J405062
17516A1092318J933903K886761M459565O366302P614666O871810L697491R9927
17508D5022743k438990k233159M27879L044385L309223N76423l353225o656204
$$ plain form
17566 10909698 12637421 14947714 18124383 22756882 29702190 40258068 55202765 73150138
17558 73150138 89824551 100366233 103528092 101477892 98259730 96358692 95036705 93065960
17550 93065960 89549691 83678545 74996071 63743865 51031666 38724372 28628410
17543 28628410 21395117 16596299 13442670 11256915 9759630 8725157 8024455 7573147
17535 7573147 7182769 6903655 6683786 6522424 6305000 6040994 5866110 5739108 5696586 5705710
17525 5705710 5722577 5831024 6099576 6559097 7126526 7794220 8623647 9687256 11092318
17516 11092318 13026221 15912982 20372547 26738849 34353515 41225325 44922816 45022743
17508 45022743 42583753 40350594 40778473 43822858 47132081 47708504 44355279 37699075
17500C7699075p750967o674488m728697k895666j574667n46393K21587Q85017
17492A4634801J666000K691538M026806N892369Q413089J1445727J4086682J5211524
17484G8068536J4032028J0372032N391265J097530j667266k829354l557465m864985
17476I6042321p071068r684017j1539374j1903333j0786534q761152o455214m419772
17468B5421857l015888k111014j473288j173713q69594n25033j87335L9833J45776
17459A6251601J1200l34303o37231r44843j101091j094408q89580o20037k32184
17450A0409124K41048P63807J137195J289828J246391J154448J117075J141236
17442A8500152J235660J021912P15064M84054M78185J138162K449334M457005
$$ plain form
17500 37699075 29948108 23273620 18544923 15649257 14074590 13528197 13749784 14634801
17492 14634801 16300801 18992339 23019145 28911514 37324603 48770330 62857012 78068536
17484 78068536 92100564 102472596 107863861 108961391 107294125 104464771 100907306 96042321
17476 96042321 88971253 79287236 67747862 55844529 45057995 36296843 29841629 25421857
17468 25421857 22405969 20294955 18821667 17647954 16778360 16253327 16065992 16105825 16251601
17459 16251601 16262801 15928498 15291267 14346424 13245333 12150925 11261345 10641308 10409124
17450 10409124 10650172 11413979 12551174 13841002 15087393 16241841 17358916 18500152
17442 18500152 19735812 20757724 21472788 21956842 22435027 23573189 26022523 30479528
17434C0479528P068604R620553J1136844J0854347Q151203L741866q31431l903732
17426G6317782m411267k969726p62019M84151j93543k521127n637178q299331
17418E2007742r574930r286739p982593o106214m468116l133715k211256j609993
17410G634186j130274q34315o82161m92933m15213l79858l68613l13649k87996
17401B729174k57603j65977j98500j60419j13575k30522k05065j19418r4938j22216
17391A060941r1938l3810o559l9371n9223j4220p0706k5848l7136R745k9424p1613
17379E90838m4610M7850l9052l1367M3044K9576l6621k7888k2178l3405j1379
17368D64808K8503M2102J03895K6226l2221O491J2135N330l7838l9251O7296J545
$$ plain form
17434 30479528 37548132 47168685 58305529 69159876 77311079 81052945 80221514 76317782
17426 76317782 71906515 68936789 68174770 68658921 68465378 65944251 60307073 52007742
17418 52007742 42432812 33146073 25163480 19057266 14589150 11455435 9244179 7634186
17410 7634186 6503912 5669597 4987436 4494503 4079290 3699432 3330819 3017170 2729174
17401 2729174 2471571 2305594 2107094 1946675 1833100 1602578 1397513 1278095 1183157 1060941
17391 1060941 969003 935193 928634 889263 830040 815820 745114 719266 682130 691875 662451 590838
17379 590838 546228 594078 555026 523659 566703 596279 559658 531770 509592 476187 464808
17368 464808 493311 535413 639308 665534 633313 639804 651939 657269 619431 580180 647476 649021
17356F49021j2286n2058q7344k8494K1580j896p5887p4717k836k2104j7822n4043
17344B41114j8540m7795M694L2733n202l4435k4152K0871O536m2611k4325J0353
17332A19241N9395J4681r527J286N2131N3428L0594k6850k1140j4109l7285n510
17320B16335M8037L8082r8955p2164m2380k2677P5012j794k3358M2499N1703N3404
17308B63744n0263l0032j7182q573j1808J1759K2196K3482L2213M604L676q749
17296B35067k7246j0902J9695j1759o0849l5343m4341j6235J5013J4010J9748
17285I6858k8574L8717M5612L0104P8031k3838n8927o5917p1837j7545k3089l336
17273c741j650o11J2737j5457K3118j6348l3467L8054k7946o0429j7124K2772
$$ plain form
17356 649021 636735 584677 497333 468839 490419 488523 412636 337919 335083 312979 295157 241114
17344 241114 222574 174779 179473 212206 207004 172569 148417 169288 175824 133213 108888 119241
17332 119241 178636 193317 183790 185076 237207 290635 321229 294379 273239 259130 221845 216335
17320 216335 264372 302454 203499 131335 88955 66278 141290 139496 116138 158637 210340 263744
17308 263744 213481 183449 166267 157694 145886 157645 179841 203323 235536 240140 243816 235067
17296 235067 207821 196919 216614 204855 144006 108663 64322 48087 63100 77110 96858
17285 96858 68284 107001 152613 182717 260748 236910 177983 112066 40229 22684 -405 -3741
17273 -3741 -5391 -6002 6735 -8722 14396 -1952 -35419 2635 -25311 -85740 -102864 -80092
17261h0092K6413k3318q310K556o212j6239l0309J5712k2024p521O3640L5621
17249e0083l071j354J6761j9048k9721J0754l429J4209r023J2180M900P345j6583
17236f6163K6414L7320m2576m4765N5363P8840K2760p572l1448j2873l5457m9978
17224g0135J0977M8892l264K7625j3515k3476k0528k9787J0694l7541J2213N748
17212h2097J4379o544J8475J7734J451R8737K1023m3029k2414m1970O476J5856
17200a923j5470n1556L707L8544k1489p0080n1811N5637L9038k346k5595K2532
17188h0812K2175L033M856M3J0183j235o2064l6998N6493K2882K687m067J4709
17175d8115M7666l9118n8733k1779K1701l8738j2457Q381N0763J1208l9160k1016
$$ plain form
17261 -80092 -53679 -76997 -85307 -82751 -88963 -105202 -135511 -119799 -141823 -149344 -85704 -50083
17249 -50083 -53154 -54508 -37747 -56795 -86516 -75762 -79191 -64982 -74005 -61825 -56925 -49580 -66163
17236 -66163 -39749 -2429 -45005 -89770 -34407 44433 67193 59621 28173 15300 -20157 -70135
17224 -70135 -59158 -10266 -13530 14095 580 -22896 -43424 -73211 -62517 -100058 -87845 -82097
17212 -82097 -67718 -74262 -55787 -38053 -36602 62135 83158 40129 17715 -24255 -17779 -1923
17200 -1923 -17393 -68949 -65242 -26698 -48187 -118267 -170078 -114441 -75403 -77749 -103344 -80812
17188 -80812 -58637 -55604 -50748 -50705 -40522 -41757 -103821 -140819 -84326 -61444 -58757 -62824 -48115
17175 -48115 -449 -39567 -98300 -120079 -98378 -137116 -149573 -141192 -90429 -79221 -118381 -139397
17163a39397J3374N8754N920k9596L859l5776L3310L1639L890n624J4664K614
17151d2369J278j2633J4769K680r254K2736K6148k8707o2888n5480k6338K9316
17139a40742M0030M0601p3268m8081J9836M2844O0670K2252l5144o532K6704k4901
17127g5731k5189j5197J8439J776J6647M0540L5562N595o716M20l6912j567l704
17114d6037k8211o2409K7963N3340q136j9937j1324K9395M5719K5851L880J4424
17102B4518j8630J0607K1363J8386K1818J0489K4057N420K103R803J8867n5163
17090I3638l8289J4351N3358R3734M6372k9928n8338q865m3823k7644j9850m0059
17078C4657k6385k6961k9481K3277K4929l1956l0519l7776m569M1309L20m3205
$$ plain form
17163 -139397 -126023 -67269 -61349 -90945 -87086 -122862 -89552 -57913 -54023 -59647 -44983 -42369
17151 -42369 -41091 -53724 -38955 -36275 -45529 -22793 3355 -25352 -88240 -143720 -170058 -140742
17139 -140742 -100712 -60111 -133379 -181460 -161624 -118780 -58110 -35858 -71002 -77534 -50830 -75731
17127 -75731 -100920 -116117 -97678 -95902 -79255 -38715 -3153 2442 -4274 -3854 -40766 -42333 -46037
17114 -46037 -74248 -136657 -108694 -55354 -63490 -83427 -94751 -65356 -19637 6214 10094 24518
17102 24518 5888 16495 37858 56244 78062 88551 112608 118028 120131 129934 148801 93638
17090 93638 55349 69700 123058 216792 263164 233236 174898 166033 122210 94566 74716 34657
17078 34657 8272 -18689 -48170 -24893 36 -31920 -62439 -100215 -104784 -63475 -63155 -106360
17066a06360M2064N73k8906J2952M0609L4583k5074K1004K4475j8953n0374M426
17054d8981O8397O3678L3157P6456L2383R4628M8740J11096M5676j519j743p5010
17042D46958n9161O9059j4958n3268n9122j01676l1803k815l1884k6569k5473
17031A09288r911n4005j4911m5218p6872L1469j2848q559k4048K2137L5247J0882
17019c7349j4835K6446J8502l1721n089r561J6426Q492l7801n4205N0199K2439
17007d8057m7837K0651N4368L8758J2491N7057O7862N9276l5069l0333L7746N9606
16995B46519j9527k3906L55n0435L44M8037Q5256j0819j7527K9617O4437K5175
16983C77526R2548M3703L0987P257l9237k2390L477n1770r2018j04186m1871j0927
$$ plain form
17066 -106360 -64296 -63723 -92629 -79677 -39068 -4485 -29559 -8555 15920 -3033 -53407 -48981
17054 -48981 19416 83094 116251 192707 225090 319718 368458 479554 525230 523711 521968 446958
17042 446958 387797 456856 441898 388630 329508 227832 196029 193214 161330 134761 109288
17031 109288 99377 45372 30461 -14757 -91629 -60160 -73008 -81567 -105615 -83478 -48231 -37349
17019 -37349 -52184 -25738 -7236 -38957 -44046 -53607 -37181 -28689 -66490 -120695 -70496 -48057
17007 -48057 -95894 -75243 -20875 17883 30374 87431 155293 214569 179500 149167 186913 246519
16995 246519 226992 203086 203441 153006 153350 201387 286643 275824 258297 287914 352351 377526
16983 377526 470074 513777 544764 552021 512784 490394 493871 442101 350083 245897 204026 193099
16971A93099q197n5537p9040l9700L1419J4475N2303K8748q930P65j8984k9231
16959H1190n668j5084k032j1452l4464k5567N378J2397l6883m3266n23M7980L0652
16946B658K0392P3598M1059l1354m7948M379j3072k001J6707M9628L3520q464
16934A39102R649P6227R0269Q9078L9422p176j8968k0270k7328q140j9702L7255
16922C79418K2608l2346o4894r6397j9993n4469p8533m3285p787L5852m613j2080
16910B3481l969J747J502j9589L4497n529m9606J0976j5606K0689J5656k2323
16898h074K1605j9826l3550K0154j4063N49k3604o5910j8972L5353L1044n1881
16886a27175J3120K1594j1100R62N0986P7058K1035J278J0056k0785q1683j8818
$$ plain form
16971 193099 184902 129365 50325 10625 42044 56519 108822 137570 128640 129405 110421 81190
16959 81190 75522 60438 58406 46954 12490 -13077 -7699 4698 -32185 -75451 -75974 -27994 2658
16946 2658 23050 96648 137707 106353 58405 62784 49712 47711 64418 114046 147566 139102
16934 139102 148751 224978 315247 404325 443747 436571 417603 397333 370005 361865 342163 379418
16922 379418 402026 369680 304786 208389 188396 133927 55394 12109 4322 40174 35561 23481
16910 23481 19512 21259 22761 3172 37669 32140 -17466 -6490 -22096 -1407 14249 -8074
16898 -8074 13531 -6295 -39845 -19691 -33754 -33205 -56809 -122719 -141691 -106338 -75294 -127175
16886 -127175 -114055 -92461 -103561 -102599 -51613 25445 46480 47758 57814 37029 -44654 -63472
16874f3472L1904M0734j3380m5307m6667J5341J2654k3922l790m183r030j9831
16862a28949N4275N968J7607O105K7381p711k6380k2916m7368k0887j8943J1909
16850a49909j7213M422L9674K0682M2505L8545k304p5991k659O4215J3280N2998
16838B8245l1477o1728J8470k1044Q345m3760j0733L6533O2448J8671M581j619
16826F932m1441l8325P605L3561m0817m7187K6353M5650l690J1946j2497m7700
16814i9610n0902K3199Q5377J8036k1312K020m449O5533L3225l0506n5980k3975
16802e9344J294L423l817q421l7093L9289J4864j5245j4523K285K9282n281l5586
16789h8873k0823J1821M0126M155k0025L6605k8667k9920L7993L5239L746k626
$$ plain form
16874 -63472 -31568 9166 -4214 -49521 -96188 -80847 -68193 -92115 -95905 -100088 -109118 -128949
16862 -128949 -74674 -68706 -51099 -44994 -17613 -25324 -51704 -74620 -121988 -142875 -161818 -149909
16850 -149909 -167122 -162700 -123026 -102344 -59839 -21294 -23598 -99589 -102248 -38033 -24753 28245
16838 28245 -3232 -64960 -46490 -67534 -59189 -102949 -113682 -77149 -14701 3970 8551 6932
16826 6932 -34509 -72834 -65229 -31668 -72485 -119672 -93319 -47669 -51359 -39413 -51910 -99610
16814 -99610 -150512 -127313 -41936 -23900 -45212 -43192 -47641 17892 51117 20611 -35369 -59344
16802 -59344 -58050 -54627 -58444 -66865 -103958 -64669 -49805 -65050 -79573 -77288 -48006 -53287 -88873
16789 -88873 -109696 -97875 -57749 -53594 -73619 -37014 -65681 -95601 -57608 -22369 -18623 -21249
16777b1249N5541n6929r2314k3970k0883j8604O9371L5478P877J4662l8345l3817
16765a23182L5780K8833n6586M907M2880L0785k0904o911j9015j5072N7698j9171
16753e9958j3118N3767l2534l5695K5168j6657Q386n8916j0532J5073J4373N0517
16741f0126J7817j0132k1693J278O620M0303m0935m5383m2028K4285K0519L4496
16729g4979O669n5285o4766R309L0397N9469L9977L5786m0604l6568L1781L1338
16717b7476o689J9662m7591m2708j368l153k8939p087N762j4218M735K5773P325
16704a15972K2264K2352j0357J5055m354J4262j3185k0394M3252K1264O6694m0247
16692F34m6017R822N027p0909k3405O5924k8518m1968J220q632N3265O508j4496
$$ plain form
16777 -21249 34292 -22637 -114951 -138921 -159804 -178408 -109037 -73559 -65682 -51020 -89365 -123182
16765 -123182 -87402 -58569 -115155 -110248 -67368 -36583 -57487 -64398 -83413 -98485 -40787 -59958
16753 -59958 -73076 -19309 -51843 -87538 -62370 -79027 -70641 -129557 -140089 -125016 -110643 -60126
16741 -60126 -42309 -52441 -74134 -72856 -66236 -25933 -66868 -112251 -154279 -129994 -109475 -74979
16729 -74979 -68310 -123595 -188361 -179052 -148655 -89186 -49209 -13423 -54027 -90595 -58814 -27476
16717 -27476 -34165 -14503 -62094 -104802 -106170 -109323 -138262 -145349 -139587 -153805 -149070 -123297 -115972
16704 -115972 -93708 -71356 -81713 -66658 -71012 -56750 -69935 -90329 -47077 -25813 40881 634
16692 634 -45383 -35561 -30534 -101443 -124848 -58924 -87442 -129410 -128190 -136822 -83557 -77049 -91545
16679i1545N6353l125k0789N275J9410J3779K0554J6688l1099O9441o0962o4348
16667g0368l6967j8809k419L2405k3914K4310m9525p0559K1289O2859r06P3697
16655e8907J7155k1027J4833L1895K5671K2647q357n6098n7204j0152J2930J3676
16643g2938K1018M8889l777n744m3614k2324r124L1040J9440p654O85j7912N059
16630e6956L8718j3883j3625J5601r010m816m472m7196M990M4487L4282l9039
16618e0919K3731K9157J0155j4714O717m3618o2406k5724J5587M6959K0064j8648
16606f3659L849M754j2439P7823j4205p0447p9368q421L6314O5581N0370n394
16594a5242m572L124j132m6816J1554K8446L7353l1911n9602R672M5577r729j8194
$$ plain form
16679 -91545 -35192 -38317 -59106 -53831 -34421 -20642 -88 16600 -14499 54942 -6020 -70368
16667 -70368 -107335 -126144 -128563 -96158 -120072 -95762 -145287 -215846 -194557 -131698 -132604 -58907
16655 -58907 -41752 -62779 -47946 -16051 9620 32267 23910 -32188 -89392 -99544 -86614 -72938
16643 -72938 -51920 -3031 -6808 -12552 -56166 -78490 -87614 -56574 -37134 -44788 -44103 -62015 -56956
16630 -56956 -18238 -32121 -45746 -30145 -39155 -43971 -48443 -95639 -90649 -46162 -11880 -50919
16618 -50919 -27188 1969 12124 -2590 4127 -39491 -101897 -127621 -112034 -65075 -45011 -63659
16606 -63659 -59810 -55056 -67495 10328 -3877 -74324 -153692 -162113 -125799 -60218 -9848 -15242
16594 -15242 -19814 -16690 -17822 -64638 -53084 -24638 12715 -19196 -78798 -69126 -23549 -33278 -51472
16581e1472o023q575N8086P0058j5197m9369j754l8019J4768N761O009n629r9346
16568a20702o0500L7620N6471J7794N9613N458j1734r427L4816k9711j1911K4572
16556g641j4835l3135n4815k4712P832L1589j0324n6487o271J9630N3260J8484
16544g7425M3645M0601J0534k039j8077L0017J7218m2268k4442M5478k0408n9841
16532e7007K1917K5397p2386r684P013J722R973O8614Q6570k7842l415l7734l7221
16519b4083n933j8078M8539j1011n3342o242J7200N847m584K1352k5939l8763
16507i5037O330K803K0929K9319O0149K6932J4868j6218m7056k6413m2006q137
16495g3537K738l4661M1662Q009k3606k3666l2935n125J6810M8021N2273k963
$$ plain form
16581 -51472 -57495 -66070 -7984 62074 46877 -2492 -4246 -42265 -27497 -21736 -15727 -21356 -120702
16568 -120702 -181202 -143582 -87111 -69317 -9704 -4246 -15980 -25407 9409 -20302 -32213 -7641
16556 -7641 -22476 -55611 -110426 -135138 -127306 -95717 -106041 -162528 -168799 -149169 -95909 -77425
16544 -77425 -33780 6821 17355 15316 -2761 27256 44474 2206 -22236 23242 2834 -57007
16532 -57007 -35090 -9693 -82079 -91763 -84750 -83028 -73055 -4441 82129 54287 50872 13138 -24083
16519 -24083 -30016 -48094 445 -10566 -63908 -70150 -52950 -47103 -51687 -30335 -56274 -95037
16507 -95037 -88707 -85904 -64975 -35656 24493 51425 66293 50075 3019 -23394 -65400 -73537
16495 -73537 -70799 -105460 -63798 -55789 -79395 -103061 -135996 -141121 -124311 -76290 -24017 -26980
16483b6980l0673j2002J4829L6121l885o3062P031M2770P594j8902J9843j164
16471b8480l810m8626L3489L8600o227k798K672L3357K724k2255m1697L4101J3298
16458D348m7697l0625p487j2463Q610K6481N9705J9633m9628k5451J0028m674
16446d9220L7077p693m622j0364k9432o8745M1718P2330k419J8817m8414N617
16434d5350J3383m3512j1702m083j146J910k7887P368O9970R15p1938j4581L2246
16421i4407P1001l4802k557R7059j0094o7021j9844K7775K9796k6483m991K9468
16409e100J7287l6250o662j9811r640M0991q422L311K2513J7626M1974m2135l4875
16396a9193m8134K017L2258K5505n2222o637k9450k6523J617l6334L269J8078
$$ plain form
16483 -26980 -57653 -69655 -54826 -18705 -22590 -85652 -78621 -35851 -28257 -47159 -27316 -28480
16471 -28480 -32290 -80916 -47427 -8827 -15054 -17852 -15180 18177 20901 -1354 -43051 -8950 4348
16458 4348 -43349 -73974 -81461 -93924 -85314 -58833 872 20505 -29123 -54574 -44546 -49220
16446 -49220 -12143 -19836 -24458 -34822 -64254 -132999 -91281 -18951 -21370 -2553 -50967 -45350
16434 -45350 -31967 -75479 -87181 -91264 -92410 -90500 -118387 -111019 -41049 -40134 -112072 -126653 -94407
16421 -94407 -23406 -58208 -60765 36294 26200 -40821 -60665 -32890 -3094 -29577 -34568 -5100
16409 -5100 12187 -24063 -30725 -50536 -60176 -19185 -27607 -24296 -1783 15843 57817 15682 -19193
16396 -19193 -67327 -65310 -33052 -7547 -59769 -66406 -95856 -122379 -120762 -157096 -153827 -135749
16384a35749J6581M8454N8770L5874o476p221j2414J0367k9232n9810n7969k199
16372a41024Q3780O1112K8054l205j3718J3129q245j6563k8295o3658k7992J3082
16360a03543L1998K4082p299M4432p04O469k3456k3577R7933O2567m0177l7680
16348C1045l5539n3178k9185J5134M2079R270r350o8867n5099p956J2524O7735
16336h1387O772n050K7491M3986K0529j9889J2360j4443k5453j6685L8518L7277
16324B4026J772k9181j7485m6516L8591q87r578K905M2625k4842l8670L7187K3183
16311C130J3355m6985j6559q952n7296o152N3377P8376J0512m3124k3020P259
16299c6079J9734L6294j3915m3150k8900j6112K836L8098P6770L7994k5861o2322
$$ plain form
16384 -135749 -119168 -70714 -11944 23930 17454 10233 -2181 8186 -21046 -80856 -138825 -141024
16372 -141024 -57244 3868 31922 28717 14999 28128 19883 3320 -24975 -88633 -116625 -103543
16360 -103543 -71545 -47463 -54762 -10330 -11034 -4565 -28021 -51598 46335 108902 68725 31045
16348 31045 -4494 -57672 -86857 -71723 -29644 -20374 -29724 -98591 -153690 -161646 -149122 -81387
16336 -81387 -74615 -79665 -52174 -8188 12341 -7548 4812 -9631 -35084 -51769 -13251 24026
16324 24026 25798 -3383 -20868 -67384 -28793 -29680 -39258 -36353 6272 -18570 -57240 -20053 3130
16311 3130 16485 -30500 -47059 -56011 -113307 -119459 -66082 12294 22806 -20318 -43338 -36079
16299 -36079 -16345 19949 6034 -37116 -66016 -82128 -79292 -41194 35576 73570 47709 -14613
16287a4613o0512l2192l5162M3665P1128L4790l7903M8929J0741n8641l0708j8245
16275g8723J6980j5949m9854k3443P2042P7900J124P253j3577p124o4184m9037
16263a26592K4930L4872L0119R38k6860m101N6954N333o4837j7663k5281K857
16251a09331k6929O3266J3406n992j879K0841K3598l1157q631k2376L3693L9864
16239a1627J0238J8476j8163n6471k209K0590Q226J8225P341r871m1523k0568
16227g7336N0950K9212j4153l1358m2841k154L3347O6004j3401k3360P964j5312
16215c2438o7104J1523J4632Q190n209k0413J7610k9583j5011L2295L3679J6546
16203c5283j560n334L9594K471k2996K6922j3920k5786K073m221j8244K4072M7212
$$ plain form
16287 -14613 -75125 -107317 -142479 -98814 -27686 7104 -30799 18130 28871 -29770 -60478 -78723
16275 -78723 -61743 -77692 -127546 -150989 -78947 -1047 77 7330 -6247 -13371 -77555 -126592
16263 -126592 -101662 -66790 -36671 -35733 -62593 -66694 -9740 -4407 -69244 -86907 -112188 -109331
16251 -109331 -136260 -72994 -59588 -65580 -67459 -46618 -23020 -54177 -62808 -85184 -51491 -11627
16239 -11627 -1389 17087 -1076 -57547 -59756 -39166 -30940 -12715 -5374 -15245 -56768 -77336
16227 -77336 -26386 2826 -11327 -42685 -85526 -87680 -54333 11671 -1730 -25090 -17126 -32438
16215 -32438 -99542 -88019 -73387 -65197 -70406 -90819 -73209 -102792 -117803 -85508 -51829 -35283
16203 -35283 -36843 -42177 -2583 -112 -23108 3814 -10106 -35892 -33819 -38040 -56284 -32212 15000
16190A5000P167m6627j7162j8868l9257J4245P0831M6801m2172m4462j6836k3354
16178i4694k484K7481M7095L631m5162m4520N8434M4555K6676q4430m6981q885
16166a19284J4482k0236J1453J4510M2543L9840L2785K1274q6222l671P4047K2469
16154D3990j0366O057o064J6908N786j1397l4590k130k3095j5229M3673m2317
16142b8774k4853P036J7112M7939k653j9672k1600k0378k1698M599O4n271Q858
16129e9291R860K000k5675K3719L6569n169j3702N816J9919r098j5552n541j0448
16116d6593o712j4155L7139L308m5684p999L1983J4056o407J6055l4168K1974
16104c7203L0994o4875l0253J3553J1786L1775Q323j2046J8522J267k9438o52
$$ plain form
16190 15000 22167 -24460 -41622 -60490 -99747 -85502 -14671 32130 -10042 -54504 -71340 -94694
16178 -94694 -97178 -69697 -22602 -18971 -64133 -108653 -50219 -5664 21012 -63418 -110399 -119284
16166 -119284 -104802 -125038 -113585 -99075 -56532 -16692 16093 37367 -48855 -52526 21521 43990
16154 43990 33624 39681 33617 50525 56311 44914 10324 8194 -14901 -30130 13543 -28774
16142 -28774 -53627 -46591 -29479 18460 15807 -3865 -25465 -45843 -67541 -62942 -62878 -68149 -59291
16129 -59291 -49431 -47431 -73106 -49387 -12818 -17987 -31689 -25873 -5954 -15052 -30604 -36145 -46593
16116 -46593 -53305 -67460 -30321 -27013 -72697 -80696 -48713 -34657 -41064 -25009 -59177 -37203
16104 -37203 -6209 -71084 -101337 -87784 -75998 -44223 -35900 -47946 -29424 -28157 -57595 -58247
16092e8247k1777K1484o146n077L3563n284o4697l6584J2275P6260L5713j3560
16080c2077n731M3442L8618M985m9900k6357k3438K5782l929o9247M0560K0470
16068c6822j2731K51K8815j2987L6560L3812m0161o2016q22N354M1450j4883M696
16055b9484M5379m3725n7511k6280M0491R132J3357q666P424m1699o834J5358
16043h3058P7102k9657n8997l2473M4382K7144M7164j0640k4305p308N4014l9074
16031c5706r64L1154M928J8424L8436J9236K6206o3602j07533m9358m488K5051
16019i8216M1413O8400M0853N50o7316j8716k903J0851J1028j8469m1710J5651
16007e8584J2532M9831M5114R647k9506k9372L0266J550l8437p7065m9943K4894
$$ plain form
16092 -58247 -80024 -58540 -64686 -69763 -36200 -41484 -106181 -142765 -130490 -54230 -18517 -32077
16080 -32077 -37808 5634 44252 49237 -663 -27020 -50458 -24676 -28605 -97852 -57292 -36822
16068 -36822 -49553 -49302 -20487 -33474 3086 36898 -3263 -65279 -66101 -60747 -19297 -34180 -29484
16055 -29484 15895 -27830 -85341 -111621 -71130 -61998 -48641 -57307 -49883 -91582 -98416 -83058
16043 -83058 -5956 -35613 -94610 -127083 -82701 -55557 -8393 -19033 -43338 -50646 3368 -35706
16031 -35706 -36670 -5516 -588 17836 56272 75508 101714 38112 -69421 -118779 -123267 -98216
16019 -98216 -56803 11597 52450 53000 -14316 -33032 -35935 -25084 -14056 -32525 -74235 -58584
16007 -58584 -46052 3779 48893 58540 29034 -338 29928 31478 -6959 -84024 -133967 -109073
15995a09073j9832K8567L1329j9158L4215k4485k2184L6223K7309j6882n3964
15984a07935k5993L7120N5475K4050K1542l5371Q92l0370O176M2855l5248J3109
15972c3698L4292l9919l7769l984l9490L4719K4034L6424M6070Q233K3177l9202
15960A2887r9951o19N2171J8030j5081N1081J4234n7033P00k9718Q746K8035J8143
15947A625p999k6334j4574M3234K2359k8344k2582q173M7398Q281l4168L948Q443
15934f886K3788J5341L1430l5796m3497R74O792l2478j2631K8035L1878p658j9719
15921b0427l8119O8704M0679k8366N360j4900K3200O468p478J6157k0528K2065
15909E2815j8496J9776m9670k8295L7716Q804K7172J9120l4813o3546J6430r440
$$ plain form
15995 -109073 -128905 -100338 -69009 -88167 -53952 -78437 -100621 -64398 -37089 -53971 -107935
15984 -107935 -133928 -96808 -41333 -17283 4259 -31112 -30220 -60590 -54414 -11559 -46807 -33698
15972 -33698 594 -39325 -77094 -81078 -120568 -85849 -61815 -25391 20679 28912 52089 12887
15960 12887 -87064 -87683 -35512 -17482 -32563 18518 32752 -24281 -23581 -53299 -44553 -16518 1625
15947 1625 -6374 -32708 -47282 -4048 18311 -10033 -32615 -40788 6610 14891 -19277 -15329 -6886
15934 -6886 16902 32243 63673 27877 -15620 -14646 -7854 -40332 -52963 -24928 6950 -708 -20427
15921 -20427 -58546 10158 50837 22471 27831 12931 36131 42599 35121 51278 30750 52815
15909 52815 34319 54095 4425 -23870 13846 22650 49822 68942 34129 -29417 -12987 -22427
15897b2427l128J9930o9259q065K8019k5072k07Q499K8021J9324p790k3294J4185
15884d1264K2168K221l2187L6585K865k9956O731j5697K4577L0125N7814J2085
15872G6067q0981k0406K3035l6201k8191l5689n284P056L6864P07O226J2762K2409
15859b1626J6382m2884M9442L0921m060l6409m5625j3466J7761k1515j1871K1389
15847f1561k9251j6693O9170m819K653K1222j0889L1975J4844j45j5498k9216
15835b8208k4711k8983r501K6790K6338K7106j7477N739O939K4483L7082k7246
15823A8351k354j993p881M834R968m9160K270k3220k524P5949Q239m1994n4624
15810f4139m279L3481l0930o540K5516k1104m5311L5857O759p098L2170L215R429
$$ plain form
15897 -22427 -25555 -5625 -74884 -82949 -54930 -80002 -80209 -71710 -43689 -24365 -32155 -55449 -41264
15884 -41264 -19096 -16875 -49062 -12477 -9612 -39568 -32837 -48534 -23957 6168 63982 76067
15872 76067 -4914 -25320 -2285 -38486 -66677 -102366 -107650 -100594 -63730 -63023 -56797 -44035 -21626
15859 -21626 -5244 -48128 1314 32235 28175 -8234 -53859 -67325 -49564 -71079 -82950 -61561
15847 -61561 -90812 -107505 -38335 -43154 -40501 -19279 -30168 1807 16651 16506 1008 -28208
15835 -28208 -52919 -81902 -91403 -64613 -38275 -11169 -28646 -22907 -15968 8515 45597 18351
15823 18351 15997 14004 6123 10957 20925 -28235 -25965 -49185 -51709 24240 32479 -9515 -64139
15810 -64139 -68418 -34937 -65867 -72407 -46891 -67995 -113306 -77449 -70690 -77788 -45618 -42403 -32974
15797c2974l031K2139j2806k6636n604j8968k592M6052K3559O78m03R833L5928
15784C5175J4512M1470l0364o6807j4111N0493R470k7445J190J5656J3940m4325
15772a146j1719r51m1284p250p554L26K2068J4042J0569j7329j0813k7484n3603
15759a32128j3654K5016k4879k4407L7098Q9000O0657k8568q848k440m8505L2235
15747c9423o167q448K6941N5700l4078k0742K1321O496L9804k3163n4375j771
15735c7905j4528j0988N5577k5593l5172j1059K1391K3008l9691m0642O7952K7763
15723a9887J8254k3452k0006J7393N3817J8224J3547R45k5382q2033k9380J6144
15711f1816l646L8622L3104p114q7577J8791N3869L1887J21J9367j8725N16m2379
$$ plain form
15797 -32974 -36005 -13866 -26672 -53308 -58912 -77880 -80472 -34420 -10861 -10183 -10586 -753 35175
15784 35175 49687 91157 60793 -6014 -20125 30368 39838 12393 13583 29239 43179 -1146
15772 -1146 -12865 -13816 -55100 -62350 -69904 -69578 -47510 -33468 -22899 -40228 -51041 -78525 -132128
15759 -132128 -145782 -120766 -145645 -170052 -132954 -43954 16703 -11865 -20713 -23153 -71658 -39423
15747 -39423 -45590 -54038 -27097 28603 -5475 -26217 -4896 1600 41404 18241 -36134 -37905
15735 -37905 -52433 -63421 -7844 -33437 -68609 -79668 -58277 -35269 -74960 -115602 -47650 -19887
15723 -19887 -1633 -25085 -45091 -27698 26119 44343 57890 58835 33453 -48580 -77960 -61816
15711 -61816 -65462 -26840 6264 -850 -88427 -69636 -15767 16120 16241 35608 16883 17399 -24980
15698b4980k7611K9025l724k9044k8790n1097J8181N0708L300p913k2862r292
15686a04099M1213l1114j4767N2823L9553J2450k5443L889N2783J4662n509J7305
15674E3746o978m3074J9112K6592o4906m8433M2500j5029p717O622k7583K1791
15662d3357l1543k7509K2124N3323O9801k1219l4216M642L3359L7964l7356k1210
15650D803j1113P109k8281j74K4821l0512j5295M4361j3025j3873l8801l5539
15638a05519j840N7566M0548J0986O873J9785k7349q2l0415j6281P036q293r530
15625e6515K8029K3739K6518l5080j2488o023J4537K6479K2017O0469J8182l7462
15613G2402l6360r882j16039k4030N9069N1989K8146p202O291M802j9798N0121
$$ plain form
15698 -24980 -52591 -23566 -27290 -56334 -85124 -136221 -118040 -67332 -64032 -71945 -94807 -104099
15686 -104099 -62886 -94000 -108767 -55944 -16391 -3941 -29384 -25495 27288 41950 36441 53746
15674 53746 46768 3694 22806 49398 -15508 -63941 -21441 -36470 -44187 -37565 -65148 -43357
15662 -43357 -74900 -102409 -80285 -26962 42839 21620 -12596 -7954 25405 63369 26013 4803
15650 4803 -6310 799 -27482 -27656 -2835 -33347 -48642 -4281 -17306 -31179 -69980 -105519
15638 -105519 -107359 -49793 -9245 1741 8614 28399 1050 968 -29447 -45728 -38692 -46985 -56515
15625 -56515 -28486 -4747 21771 -13309 -25797 -31820 -17283 9196 31213 91682 109864 72402
15613 72402 36042 26160 -89879 -113909 -54840 -2851 25295 18093 24384 29186 9388 59509
15601E9509K4347o8129l6878M7168R404o365M1161j3282j5413k9356n4123m1158
15589h3115L1997L0100J5790l302J4900L564k3041n6636o2758L1863K2629l6070
15577a14079L4067O5989R127J7412O088j6955l0102k2666K9869P2748J228l8542
15565A4184k1573j8191P898m8354l2550J6947R1058N5337m4925l5574P01R367
15553e675P567k4768J1753P925l8093q919j9993K8803K2435l6421N368P1423j1515
15540I890m9103j5427K3638j9261k0198M3103K9469o615q374L9508K7811l4598
15528A9843l2335n1299K1519L8260K3858M594K9427m2697m9225J4343K7151J7829
15516B1268J373m3856r245l164m3236o859N3999k6669j5403q815n979N5917j0668
$$ plain form
15601 59509 83856 15727 -21151 26017 35421 29056 70217 56935 41522 12166 -41957 -83115
15589 -83115 -51118 -21018 -5228 -8530 6370 9934 -13107 -69743 -132501 -100638 -78009 -114079
15577 -114079 -80012 -14023 -4896 12516 18604 1649 -28453 -51119 -21250 51498 52726 14184
15565 14184 -7389 -25580 -17682 -66036 -98586 -81639 9419 64756 19831 -15743 -15042 -5675
15553 -5675 1892 -22876 -11123 -3198 -41291 -50210 -70203 -41400 -18965 -55386 -50018 21405 9890
15540 9890 -39213 -54640 -31002 -50263 -70461 -27358 2111 -4504 -12878 26630 54441 19843
15528 19843 -12492 -63791 -42272 -4012 19846 24440 53867 11170 -38055 -23712 3439 21268
15516 21268 22641 -21215 -30460 -33624 -76860 -83719 -29720 -56389 -71792 -80607 -86586 -30669 -41337
15503d1337p0306k0863N4801M4711K7122j3623m7880j2616N0445k6558m0850M8841
15491d8113K345K5972J4028m2868K674J0581R271j1503m2767K5716N2604j2028
15479a4088k4632L0189p727K253J8491j3231m8370j3399m794M5017r588K463m3528
15466h0944L4659L576J9504J2296n6772o737L7602N3625j3496j0572j0831K0472
15454B382k3778L0829L0112j0334K8191M823j1329m9611n854M6581L2035r0769
15442a6722k3361N8845P384n0867K829K2328k2304j8519q679O3802r844o1855
15430e6963m0416M1887N2918L0333n09L6503N400m5672j3366k3743m6584J3177
15418d7035M9864L8301k0370K9001k377M740m2517k4311J0517o2649K9753l450
$$ plain form
15503 -41337 -111643 -132506 -77705 -32994 -5872 -19495 -67375 -79991 -29546 -56104 -96954 -48113
15491 -48113 -45768 -19796 -5768 -48636 -45962 -35381 -26110 -37613 -80380 -54664 -2060 -14088
15479 -14088 -38720 -8531 -16258 -14005 4486 -8745 -57115 -70514 -75308 -30291 -39879 -37416 -80944
15466 -80944 -46285 -42709 -23205 -10909 -67681 -74418 -36816 16809 3313 -7259 -18090 2382
15454 2382 -21396 9433 39545 29211 57402 62225 50896 1285 -4569 42012 74047 -16722
15442 -16722 -40083 18762 26146 -24721 -21892 436 -21868 -40387 -49066 14736 4892 -56963
15430 -56963 -97379 -55492 -2574 27759 27250 63753 69153 23481 10115 -13628 -60212 -47035
15418 -47035 2829 41130 20760 49761 47384 52124 9607 -14704 -4187 -66836 -37083 -40533
15406d0533J1958L2309L7862q688k7379j3323n060k9094l552N7047K6211l0944
15394F814o5669K220K441L7829L1592m6350j5267R47L5999L0249n1779J1949O910
15381a2115k0991J8380k465J2305J045k6267J2932j0658r26p033j5205M4050N2201
15368D5253k1721k5762L936J0706O549L7997J87l9322j4318j79j254R447m1835
15355c0316k0219m2274q179k5547j1093K7527O3102O8021j2113k7209O732L6848
15343B5280K9571m9861k0734L6591M6328m708p225M6033j0097o1746n9854p664
15331c8086m1072L8518O4829k7099k7409M8791L3167k3072p64p882M724M9399
15319G4044J5127l7292j1593O42L7044j524o6592j2732K0628k0461N335J9445
$$ plain form
15406 -40533 -28575 3734 41596 32908 5529 -7794 -12854 -41948 -45500 11547 37758 6814
15394 6814 -58855 -56635 -54194 -16365 15227 -31123 -46390 -45443 -9444 20805 -30974 -19025 -12115
15381 -12115 -33106 -14726 -17191 -4886 -3841 -30108 -17176 -27834 -28760 -35793 -50998 -6948 45253
15368 45253 23532 -2230 1706 12412 18961 56958 57145 17823 3505 3326 2072 11519 -30316
15355 -30316 -50535 -92809 -100988 -126535 -137628 -110101 -46999 21022 8909 -18300 -11568 25280
15343 25280 54851 4990 -15744 20847 67175 62467 55242 101275 91178 29432 -30422 -38086
15331 -38086 -79158 -40640 24189 -2910 -30319 18472 51639 28567 27803 19921 24645 74044
15319 74044 89171 51879 40286 40928 77972 76448 9856 -2876 17752 -2709 2626 22071
15307B2071k3178l7825n0498J4067J5178j5006p641L4022K1238L0465K809j5759
15295a0057J2396J8324R602m7772P8059L8879q7591l5385K829j7216q375L1487
15283a4820N281Q877m6760m484J00413j7084l1664Q656k6384m8900j6863L5497
15271d8235k0959m065K2383L5853m0214J3917M8765o466k5872K2018l3305Q230
15259b7950N8951j7708m3902j491k0641j4556L5578p09P982k5514N81J5427L0797
15246c155N391m5310k6167N4452J5331K5035j5753l9733k7683M7939J7703L4132
15234D2182n8375K0102M2280m008n4329m8381l553L7342l438l6512q431L4629
15222d0492Q4621N0175k0336l4393l8181K8030j676p672l1842n700J6193L3358
$$ plain form
15307 22071 -1107 -38932 -89430 -75363 -60185 -75191 -82832 -48810 -27572 2893 5702 -10057
15295 -10057 2339 20663 30265 -17507 60552 99431 11840 -23545 -20716 -37932 -46307 -14820
15283 -14820 -9539 -662 -47422 -51906 48507 31423 -241 8415 -17969 -66869 -83732 -48235
15271 -48235 -69194 -73259 -50876 -15023 -55237 -41320 7445 979 -24893 -2875 -36180 -27950
15259 -27950 31001 13293 -30609 -32100 -52741 -67297 -31719 -32428 -24446 -49960 -49379 -33952 -3155
15246 -3155 2236 -43074 -69241 -14789 542 25577 9824 -29909 -57592 -9653 8050 42182
15234 42182 -16193 3909 46189 42181 -12148 -60529 -64082 -26740 -30178 -66690 -75121 -40492
15222 -40492 44129 94304 73968 39575 1394 29424 27748 20076 -11766 -17466 -1273 32085
15210C2085N6822m852q3821L2490M9012j2344L320L0562q410m9813r7428J3900
15198c8477L8509m015j8191o683N399L466k6220m4548k1642N3213K2779o0995
15186i7405l5703p615O6374L6313M423N888N1737M4674M2077l8601K8347J4987
15174A15496l3691l1756l9647L3503l6736m7709n7489M8361K6426j5652R334Q871
15162b0689L6504O749o62L1852j7585m1736o7384J1835K8766r375J6596K737M2831
15149B0439L7398q9265l5553L8764P4619J9107q834L7612n2866o6550m0811n3083
15137a19023l0727O0110L0117O1217P809k6632P4m6448K7105j3197k0253M9836
15125b0012L0236L71l7007O3515M6546j7045j4394m3930r423l9473k0888L4504
$$ plain form
15210 32085 88907 84055 234 32724 81736 69392 72712 103274 94864 45051 -52377 -38477
15198 -38477 32 -3983 -22174 -28857 -23458 -19992 -46212 -90760 -112402 -59189 -36410 -97405
15186 -97405 -133108 -140723 -74349 -38036 -33613 -27725 24012 68686 110763 72162 100509 115496
15174 115496 81805 50049 10402 43905 7169 -40540 -98029 -49668 -23242 -38894 -29560 -20689
15162 -20689 15815 22564 21902 53754 36169 -5567 -72951 -61116 -32350 -41725 -25129 -22392 20439
15149 20439 57837 -31428 -66981 -28217 46402 65509 56675 94287 41421 -25129 -65940 -119023
15137 -119023 -149750 -89640 -59523 1694 9503 -17129 -17055 -63503 -36398 -49595 -69848 -20012
15125 -20012 10224 10595 -26412 37103 83649 66604 52210 8280 -1143 -40616 -61504 -27000
15113b7000M843R462O0576l3407m3052n1716P211M4828P016k0352L419L0918L0123
15100B2869k8533J7983K3422L6560j7291o4961l8140O5674J210J1251j8250N4347
15088F6141O722k0992k1516n0101q745M2338l462J3930O4738J6906k1078l8532
15076D6349J6611M991n865l8728k8526L0472M2988P487n0394l8732L3738M9365
15064F9756n3740o340n5932k8112L7101J5814k7153j0286M672l1209Q185L9362
15052c7882L6376p315O800P1236K4137K747N482l6912p2276k7333r05J9510J3614
15039b721N1916P35m6562n5015m7521K1672J5958J4803K2750K3178j1221n4804
15027f6832n1668J2144M1092m833k0431j4638N0091O1459L4602j2625q159m3080
$$ plain form
15113 -27000 -22157 -12695 47881 14474 -28578 -80294 -73083 -28255 -21239 -41591 -38172 -7254 22869
15100 22869 -5664 12319 35741 72301 55010 -9951 -48091 17583 18793 30044 11794 66141
15088 66141 72863 51871 30355 -19746 -28491 13847 10385 24315 89053 105959 84881 46349
15076 46349 62960 67951 62086 23358 -5168 25304 68292 75779 25385 -13347 20391 69756
15064 69756 16016 9676 -46256 -74368 -37267 -21453 -48606 -58892 -54220 -85429 -77244 -37882
15052 -37882 -1506 -8821 -2021 69215 93352 96099 101581 64669 -7607 -34940 -35845 -16335 -2721
15039 -2721 49195 49930 3368 -51647 -99168 -77496 -61538 -46735 -23985 -807 -12028 -66832
15027 -66832 -118500 -106356 -65264 -70097 -90528 -105166 -55075 6384 40986 28361 20202 -22878
15015b2878M562K3994o5613j6257K0440K4599K6946N2098n6623J9705N5282k3461
15003D2794k55L991m1719l9360N929K1849P649J2195J9828l3573q652k5315l2308
14990f6947O8646L8437k5306j3194J5905L6229R7888k4691k3495m3776l6153l941
14978A9602p0887J240J9890N2343M1820k4860l8122L3928L2889l9045k8301k7713
14966b7216L9938N4266K4864j9925m5622K535j4275k6342J9369k3928k1287j9459
14954e7082K5271O9819M0040m5029k5849N0637K3848k7315j8154M6420J1350l1559
14942F2397l0583q1016l2946O8391M9912M0720L0462n0800l0591j8903J5386N005
14930B7434K8192j4713r90M3194J6522j5216J5356P538l8661p012m7001l9991
$$ plain form
15015 -22878 -18316 5678 -59935 -76192 -55752 -31153 -4207 47891 -8732 10973 66255 42794
15003 42794 42539 46530 4811 -34549 -28620 -6771 878 13073 32901 -672 -9324 -34639 -66947
14990 -66947 1699 40136 14830 1636 17541 53770 151658 126967 103472 59696 23543 19602
14978 19602 -51285 -50045 -30155 22188 64008 39148 1026 34954 67843 28798 497 -27216
14966 -27216 12722 66988 91852 71927 26305 28840 14565 -11777 7592 -16336 -37623 -57082
14954 -57082 -31811 38008 78048 33019 7170 57807 81655 54340 36186 82606 93956 62397
14942 62397 31814 -49202 -82148 -13757 36155 76875 107337 56537 25946 7043 22429 27434
14930 27434 55626 40913 39923 83117 99639 84423 99779 107317 68656 61644 14643 -25348
14918b5348m8113Q908K6297K1501J5947O4356l699K75n7216m3901N0561O795m5914
14905b9551J9274P1468J6601L039j3241p7737J3185J2589k797l1836j6576j9640
14893e5222q883m1947K8150L7807k2401L858P973N5043J1005L0884L0381K3980
14881A00628k9703m8865o3886N45M9706K8826j3302k8870k2536j2158N5332N599
14869B1316j7734K3055n4735J6115L7513k8230J2687O2136l4407n9617j8561L0152
14857a0310q120K4547K3258q800l1698N1981O5788L2775k0938p116j0098k9850
14845G1419m513J3846O177K2585K0587J2567k0978Q676n8970m8010k6356m1011
14833d3981J0773J5777M7107J691l0575m338N1360J527k5656L4192L1842j3154
$$ plain form
14918 -25348 -73461 -64553 -38256 -16755 -808 63548 59849 60124 2908 -40993 9568 16363 -29551
14905 -29551 -10277 61191 77792 80831 67590 -10147 3038 15627 12830 -19006 -35582 -55222
14893 -55222 -64105 -106052 -77902 -40095 -62496 -58638 -50665 4378 15383 46267 76648 100628
14881 100628 70925 22060 -41826 -41281 8425 37251 23949 -4921 -27457 -39615 15717 21316
14869 21316 3582 26637 -28098 -11983 25530 -2700 9987 72123 37716 -21901 -40462 -10310
14857 -10310 -18430 6117 29375 20575 -11123 40858 106646 139421 118483 111367 101269 71419
14845 71419 66906 80752 86929 109514 130101 142668 121690 130366 71396 23386 -2970 -43981
14833 -43981 -33208 -17431 29676 31367 792 -3546 47814 49341 23685 57877 89719 76565
14821G6565n7019n708N66N1824n851K7376k1740m7219r886J7167m4563k3267L7041
14808d714K2628K6461M6068k6893n3702n7001j0092J8117L0924k3691L6857L1221
14796C6183j6414n2118K5442k5575j8004L9611Q5240j2665o3253P109N707j6097
14784d834J0129K233J1326k1086j5257M7955N6823l0325j8460n860l6780O740
14772B604K7679O4101k477n4356j2214Q664k6418j822M5407K335j4733J2016K3369
14759G4155J3340K8785n1634o4316l5683p2846o876K4235K3094J0028j6898K2598
14747e2018M328K0161Q1238j4893k0712m0108l7284K0368k9200p5935j354N1499
14735i3910K7642Q666j9413O3496P3610L145j5235j0449J10858J12152l4176p8434
$$ plain form
14821 76565 19546 13838 14404 66228 60377 87753 66013 18794 8908 26075 -18488 -41755 -4714
14808 -4714 17914 44375 90443 63550 9848 -47153 -57245 -39128 -8204 -31895 4962 36183
14796 36183 19769 -32349 -6907 -32482 -50486 -10875 74365 61700 -1553 5556 11263 -4834
14784 -4834 5295 7528 18854 -2232 -17489 30466 87289 56964 38504 32644 -4136 2604
14772 2604 30283 94384 91907 37551 25337 34001 7583 5761 51168 53503 38770 50786 74155
14759 74155 87495 116280 64646 330 -35353 -108199 -115075 -90840 -67746 -57718 -74616 -52018
14747 -52018 -47690 -27529 53709 38816 18104 -22004 -59288 -38920 -68120 -144055 -145409 -93910
14735 -93910 -66268 -57602 -77015 -13519 60091 63236 48001 37552 148410 260562 226386 147952
14723A47952m220o043r1275o5645o4093k2571L7327M0398j8744k9958L6343K2226
14711a8303J4551N134L5780M7678J7200k1511N391J9987j1342m8410J091K816
14699E0062K7782l7m8750l1086K3604J4801K4486l9678l4978L1866O0967l380
14687G5659m1864R495k261m0460N2860O1467k8190l6259k4122q207M143K0527
14675D2788M6834J8847l1667l6243p968j5109j0452j8160J3309J9722l8908j2312
14663b9319M510k4656R323M0011N4l3846k145M225L6387J6681N1372k3689k2102
14650B6806J1937k0567m305k6658p9015K5186N7300K1924j9545k7333L4244k1283
14638b1309l2569L932L9331J8041K2037l8043N29K3248N5412o0012J9539j2797
$$ plain form
14723 147952 143732 137689 46414 -19231 -83324 -105895 -68568 -28170 -46914 -76872 -40529 -18303
14711 -18303 -3752 1382 37162 84840 102040 80529 85920 105907 94565 46155 47246 50062
14699 50062 77844 77807 29057 -2029 21575 36376 60862 21184 -13794 18072 79039 75659
14687 75659 33795 43290 41029 569 53429 114896 86706 50447 26325 18118 22261 42788
14675 42788 89622 108469 76802 40559 32591 17482 7030 -11130 2179 21901 -17007 -29319
14663 -29319 -24809 -49465 -40142 -131 -77 -33923 -36068 -31843 4544 21225 72597 48908 26806
14650 26806 38743 18176 13871 -12787 -91802 -66616 -9316 12608 -6937 -34270 -26 -21309
14638 -21309 -53878 -49946 -10615 7426 29463 -8580 -8051 15197 70609 10597 30136 17339
14626A7339m1102L3657j1199P803J9011M0043k5050N953p841L1o711l7073J1559
14613F420J3520m937l2068l0333J8160L9633M4021j1544l2404l8720K2447l646
14601i451K5364l439j4410j6396j8881j5152O6090J6818m6896K6047l131k0492
14589a3929L5929R809O2328L5186r0204l9337n321k5501o4848l387O5739M2991
14577I455P435L5857J1005K0221m7977k5818J7169k8641k0108N6588O177O9869
14565A11232P9955r714l019K2737j9138q424m2036m9632m6420l788K1439k0626
14553C2566p3511R157J1826M0958L6313O11j2421M7155R288l6378o585q176K5258
14540G6061L3888n0265p1616j255J4951m5620L1801N4668k3759J9874K5201m8141
$$ plain form
14626 17339 -23763 9894 -1305 6498 25509 65552 40502 46455 38614 38645 31934 -5139 6420
14613 6420 19940 15003 -17065 -47398 -29238 10395 54416 42872 10468 -28252 -5805 -9451
14601 -9451 15913 12474 -1936 -18332 -37213 -52365 13725 30543 -16353 9694 6563 -13929
14589 -13929 22000 31809 94137 129323 39119 -218 -5539 -31040 -95888 -99275 -33536 9455
14577 9455 16890 52747 63752 83973 35996 10178 27347 -1294 -21402 35186 41363 111232
14565 111232 191187 181473 178454 201191 182053 173629 131593 81961 35541 31753 53192 32566
14553 32566 -40945 -31788 -19962 20996 57309 57920 45499 92654 101942 65564 58979 50803 76061
14540 76061 109949 59684 -11932 -13187 1764 -43856 -12055 42613 18854 38728 63929 15788
14528A5788m6865l036M3520N0098L6334O691k9054K0001k3731l0160J7004L4252
14516I0842J7515j0791J6084p1718k2766K0779l7350J9711R2910j7141m9812j5218
14504C3045k835M2238N1803L4867K5631n1814l4257j9331n096K008k1404k5452
14492B9403o3831m4638K0837N3471K2310k2212k661J5434R026J7651o717n6547
14480b8474m3428j2390M7322N3953J234o2857N0292J4764M251K7231K1372k6149
14468D7121n5784m0683K2450L0231M4531K3166M3178k6808l2533Q774J2062q1001
14456e296o0866N2146J5819K5792K542M1305M5214j0132r9056l9345q973L1283
14444i567J5972J947J1639L9334N8768k8293p5239J2754l0393K5144N2914p096
$$ plain form
14528 15788 -31077 -34113 9407 59505 95839 102530 73476 93477 69746 39586 56590 90842
14516 90842 108357 97566 113650 41932 19166 39945 2595 22306 115216 98075 48263 33045
14504 33045 30210 72448 124251 159118 184749 132935 98678 79347 74251 76259 54855 29403
14492 29403 -34428 -79066 -58229 -4758 17552 -4660 -7321 8113 17139 34790 28073 -28474
14480 -28474 -71902 -84292 -36970 16983 18217 -44640 5652 20416 24667 51898 73270 47121
14468 47121 -8663 -49346 -26896 3335 47866 71032 114210 87402 54869 63643 75705 -5296
14456 -5296 -66162 -14016 1803 27595 30137 71442 116656 106524 7468 -31877 -40850 -9567
14444 -9567 6405 8352 19991 59325 118093 89800 14561 27315 -3078 22066 74980 67884
14432F7884m8241K3712K2792P790k6477j5259m835M0682l2151K4590K4016l4361
14420E0142j3200j2526N254J6776R180l9391J2490L6434K740m091m1146K5782
14408D8444L0954j9346J649j3464L6341j77l1189l5245r222j9489k0583M7043
14396A5716K297j217J489J6282J6473j7984m3697l8428M0969K4275j8814J5905
14384A3266r612k5066r554N601M8942j199M759m2732J7101K8708l739q2999M791
14371e1733K3268l800O6446P3364L6617k4711n1056K989M3446l6806o3533k5672
14359a1181M0639j9921L0781J9065k9450N4913n904l4295j2343k1104J0300j4588
14347F912J4531K8741k368o668K5734j1350J3099l5139n42K8778j0107k573K4949
$$ plain form
14432 67884 19643 43355 66147 73937 47460 32201 27366 68048 35897 60487 84503 50142
14420 50142 36942 24416 29670 46446 55626 16235 28725 65159 67899 63808 22662 48444
14408 48444 79398 60052 61701 48237 84578 84401 53212 17967 8745 -10744 -31327 15716
14396 15716 18013 16796 18285 34567 51040 33056 -10641 -49069 -8100 16175 -2639 13266
14384 13266 3654 -21412 -30966 -25365 23577 22378 27137 -15595 1506 30214 26475 -56524 -51733
14371 -51733 -28465 -32265 34181 107545 144162 119451 68395 71384 114830 78024 14491 -11181
14359 -11181 29458 9537 40318 59383 29933 84846 78942 44647 32304 11200 21500 6912
14347 6912 21443 50184 47816 41148 66882 55532 68631 33492 32950 61728 51621 49048 73997
14334G3997J9402k020J7033r088L1080n062r6341r599N2843R8260P840n7400k7319
14321I3626j5235J2180J8632J8604j6688k2560L791j5438O389j1820j1194m213
14309E6074L8401n0779l131p349j0638p34K9991j0746k8708K0108L5657l529J8827
14296H3444J256n1458J6579K1759m2773k1107K3806J3683J5800k7012m635J3173
14284D2515j4574K9493M3891L632J9102J2692j5263k2803j5649k067l5955L920
14272D8934m370J7409N4570m8772J9486J5951j0578o6820j5985N131k9627m088
14260a8759Q8322K4702n940J7069j3681m7357j6500M3949P960l2581k6495K3254
14248D3943K5565l126k4488l6199L2559L0242j923j1889J7370K4695J6383L878
$$ plain form
14334 73997 93399 91379 108412 99324 130404 125342 29001 19402 72245 170505 178345 120945 93626
14321 93626 78391 90571 109203 127807 111119 88559 92350 76912 83301 71481 60287 56074
14309 56074 94475 43696 40565 33216 22578 21844 51835 41089 12381 32489 68146 64617 83444
14296 83444 84700 33242 49821 71580 28807 7700 31506 45189 60989 33977 29342 42515
14284 42515 27941 57434 101325 104957 124059 136751 121488 98685 83036 80969 45014 48934
14272 48934 44564 61973 116543 67771 87257 103208 92630 25810 9825 14956 -14671 -18759
14260 -18759 69563 94265 88325 105394 91713 44356 27856 71805 79765 47184 20689 43943
14248 43943 69508 66382 41894 5695 38254 68496 66573 54684 72054 96749 113132 117010
14236A17010K9476N808j8948n488k0840J2756K2098o9334K0691M3431m2338J3570
14224A07892l0206l7586L5051J7274l3470n3790M855M7233N9299o39k3788r228
14212H2897j3994l8059L9174J1571N175K0953L9022l3444p6007M7494K2557K0436
14200A27775J2547l914M292J9936r160k3040l9936j4518k8143r836j726%j3743
14187B0534N2859K0332p027j4623R248j6670l6126M4455O0181q875m534l5064
14175H4690o3301n0749L420L9241L8609j039L317k6363m139L1389K3351J1561
14163H9987r1047k9933O5111p291P4044J7823j4522j1568n0460r026j4940N4977
14151G3155L5526L952K2313J5268l1046m739n0971J0151M2733j9285k5674n7631
$$ plain form
14236 117010 146486 152294 133346 127858 107018 119774 141872 72538 93229 136660 94322 107892
14224 107892 77686 40100 75151 92425 58955 5165 10020 57253 116552 115913 92125 82897
14212 82897 68903 30844 70018 81589 86764 107717 146739 113295 37288 84782 107339 127775
14200 127775 140322 136408 140700 160636 151476 128436 88500 73982 45839 36003 34277 34277 20534
14187 20534 73393 93725 86698 72075 81323 64653 28527 72982 133163 124288 119754 84690
14175 84690 21389 -29360 -25940 13301 51910 50871 54188 27825 23686 55075 78426 89987
14163 89987 -1060 -30993 34118 26827 100871 118694 104172 92604 42144 33118 18178 73155
14151 73155 108681 112633 134946 150214 119168 114429 63458 73609 116342 97057 71383 13752
14139A3752P086J0418j5060j8323J1729K4610K6208j1255K1287l5732m5857J5231
14127D094L8887O3437J4590m8334j4408R897L0806k4444o276j5427j0005l8417
14115D400R662K5480J3252M2025n92J4128L7788K1108o413p2388l5739L1445R1708
14102A75864O587j05931p1020m284P8147L3284n922k3101J3029J0798n3036j9816
14090C4599L493R224J9256q008P914L1861j2806l777J6928l5633k750O413J1626
14077G8340J5777k4199L745J0810L4751L0483J3100j4457l2763k5805k6730M6540
14065A09592J5828j7441q787o810K1098J3318J3107k6974K792M1038R0027O8611
14053C15399m7328n2381m4497r520m2065o304N4371J6859M1470q520j3622R587
$$ plain form
14139 13752 20838 31256 16196 -2127 9602 34212 60420 49165 70452 34720 -11137 4094
14127 4094 42981 106418 121008 72674 58266 68163 98969 74525 68249 52822 42817 4400
14115 4400 14062 39542 52794 94819 94227 108355 146143 167251 160838 88450 52711 84156 175864
14102 175864 182451 76520 5500 1216 79363 112647 106725 83624 96653 107451 54415 34599
14090 34599 38092 47316 66572 58564 66478 98339 85533 81756 98684 63051 60301 66714 78340
14077 78340 94117 69918 73663 84473 119224 149707 162807 148350 115587 89782 63052 109592
14065 109592 125420 107979 99192 92382 113480 126798 139905 112931 115723 156761 246788 315399
14053 315399 268071 215690 171193 161673 119608 113304 167675 184534 226004 217484 203862 213449
14041B13449j4128q4372m5094r916L4731O126L4171k9816m5064R878l3320J982
14029C8627M9134P2274m6279L1170O736l0487l5080l4984N4865O430K2720M9138
14017A84264l039j5400o3540O63O6433P779o8417n2646m0583k6722J7567L3315
14005C9674P4545K2284Q368k249K1264m8205m9852l214M0913j150l220N3025L8080
13992A90263M269k5902j6541l5635m0063j4413L0651M0319L2161l1296k46J0626
13980A44193K3773P173r853m5042k0109J8444M1602j9835k9027O3828L0169k7535
13968A77781k1986o7279j1901P876n728q00k7372M4617M4097K9306n0443o4912
13956E3256M0863O3254K7117j1496o431n6400m8071J7351j8386P321J5206O949
$$ plain form
14041 213449 199321 114949 69855 59939 94670 100796 134967 105151 60087 69965 36645 38627
14029 38627 87761 160035 113756 144926 151662 121175 86095 51111 105976 112406 135126 184264
14017 184264 181225 165825 102285 102948 169381 177160 108743 56097 15514 -11208 6359 39674
14005 39674 114219 136503 144871 142622 163886 115681 65829 62615 103528 102378 99158 152183 190263
13992 190263 194532 168630 152089 116454 76391 61978 92629 132948 165109 133813 133567 144193
13980 144193 167966 175139 165286 120244 100135 118579 160181 140346 111319 175147 205316 177781
13968 177781 155795 88516 76615 84491 78763 77963 50591 95208 139305 168611 118168 53256
13956 53256 94119 157373 184490 172994 166563 110163 62092 79443 61057 68378 83584 90533
13944I0533k2286J471O530L9934P047l0156J7034k3604J1211R881P192N5780K2469
13931A93036J6736k0069O640J0912k4176j6622n9359n4324O1605K2018m5115L6948
13919A28230j5710M350L0620k0752k974j6034o0573r330j3892L7135R357j7316
13907E3111m808j6345j3436l593N194P669J4669O725N9162j0086L1541M5747m3575
13894A31975m9470n8210m1588L6512N3819j1343j9204J6642O4872j251m6218j3605
13882F2931K8318L9482J1384o9120P457L0516K7685J8729J712P881J7077m3427
13870A40625m1915m2306j0863L8281N1370l9246k6620K3468M1125J2594k001R671
13858A54183o1599k4307n0687Q194R1636M6589N992k114j365n3951l9955M692
$$ plain form
13944 90533 68247 69718 76248 116182 123229 93073 110107 86503 97714 107595 114787 170567 193036
13931 193036 209772 189703 196343 207255 183079 166457 107098 52774 114379 136397 91282 128230
13919 128230 112520 116870 147490 126738 123764 107730 47157 37827 23935 61070 70427 53111
13907 53111 48303 31958 18522 14929 20123 27792 42461 49186 108348 98262 129803 175550 131975
13894 131975 82505 24295 -17293 19219 73038 61695 42491 59133 124005 122754 76536 62931
13882 62931 91249 130731 142115 72995 80452 110968 138653 157382 159094 166975 184052 140625
13870 140625 98710 56404 45541 83822 135192 95946 69326 92794 133919 146513 144512 154183
13858 154183 92584 68277 17590 25784 117420 164009 170001 167887 166522 112571 72616 77308
13846G7308K4514j7036P2879O3436m061j4713o859L684k7728J775p246K3023K7199
13833B16175O0739K5389J4521k2098M1005n0758n4089J2581K1759l0080m03Q963
13821B43704o0829l0743k2558j1067q132j1897j3271N4928L6485J7589j5627r0943
13809H7639k6711O1532Q2295K2218l5161J3034K2312j3568q7781n4787J12L3435
13797A04569L6666j6116N597L720q53m6414L5331o537k9303j3839J6124n831j7508
13784F5606O334j1144j374L2829J295N2679Q306j220l5053l277J4273K165j6148
13771A15271L6K2496l3545k5965L4301K7200k37j6555l8268n0592k5478j3987
13759e323L8681N7604j7453k3016M7460j694N4146O8234K3211l4036k1386m427
$$ plain form
13846 77308 101822 84786 157665 221101 217040 202327 195468 199152 171424 173199 165953 188976 216175
13833 216175 276914 302303 316824 294726 335731 284973 230884 243465 265224 235144 234741 243704
13821 243704 182875 152132 129574 118507 110375 98478 85207 140135 176620 194209 178582 87639
13809 87639 60928 122460 204755 226973 191812 204846 227158 213590 125809 71022 71134 104569
13797 104569 141235 125119 130716 134436 133583 87169 122500 115963 86660 72821 88945 83114 65606
13784 65606 71940 60796 59422 92251 93546 146225 154531 153311 118258 114981 129254 131419 115271
13771 115271 115307 137803 104258 78293 112594 139794 139557 123002 84734 34142 8664 -5323
13759 -5323 33358 90962 73509 50493 97953 96259 150405 218639 241850 207814 186428 182001
13747A82001k1967k132m9264n7038o425O1430J3917l2079k0318K6367l588m4891
13735D6013L0900l3752k5566N6112K3322j3511K1235M9307l0522J3968J4893j2537
13723A39862L078m119J8463K8015j7012k1674L7652m5137j9295M6074K8617m173
13711A90351j1066K9003N366M654l1744j8704J0083O545l1220J5526K5832l0374
13699A64252l6832M0572M3913J0146l879J7944J6964N3603L307p3596o0619K656
13687A78431k925K8854J0550l5126m2995l6363j2469N9653j222l3622j679O0276
13675A71363O1741k1887k3222J3107L087l5773k7960k0334j1776J8438L7937L4690
13663A99411P985j2654J8769P4387Q0917j4273J89j3186k6981M3619N7187P7732
$$ plain form
13747 182001 160034 157902 108638 51600 45175 106605 120522 88443 68125 94492 90904 46013
13735 46013 76913 43161 17595 73707 97029 83518 104753 154060 123538 137506 152399 139862
13723 139862 142940 138821 157284 185299 168287 146613 184265 139128 119833 165907 194524 190351
13711 190351 179285 208288 213654 218308 186564 167860 177943 184488 153268 168794 194626 164252
13699 164252 127420 167992 211905 222051 218172 236116 253080 306683 309990 236394 175775 178431
13687 178431 175506 204360 214910 179784 136789 100426 87957 147610 146388 112766 111087 171363
13675 171363 233104 211217 187995 201102 204189 168416 140456 120122 108346 126784 164721 199411
13663 199411 207396 194742 213511 287898 368815 354542 354731 341545 314564 358183 415370 493102
13651D93102L8452P3233M1719M710L6604M8527r033K3526J57131J03652O1613
13640A073236M4593p2238j09940q0376n4143q0414n4890r243k9184l1866j01969
13629D93566l0973o802K2467l3469k9269L2986J8251l3251o2059k156J7875L8781
13617D25947N672l403O8759M5422J02254K6129J02251J55755J68140K13073J20489
13606A430488Q0612n925l7566j03814j90981k02249j32420j13124j71117o9811
13596D84093J2279K0924o7273j52218o3798k3148K497P6782k5575l4744K3753
13585B53572N3215M9956K0097k3120m2720j9209M7755P1005K4552K6257M4213
13574E05573J15507P2394Q4869J26599N4275m8138j07043q3664j07114j29558
$$ plain form
13651 493102 531554 604787 646506 651216 687820 736347 727314 750840 907971 1011623 1073236
13640 1073236 1117829 1045591 935651 855275 801132 720718 665828 656585 627401 595535 493566
13629 493566 462593 455791 478258 444789 415520 448506 466757 433506 371447 369291 387166 425947
13617 425947 431619 428216 496975 542397 644651 670780 773031 928786 1096926 1309999 1430488
13606 1430488 1511100 1505175 1467609 1363795 1172814 970565 838145 725021 553904 484093
13596 484093 496372 517296 450023 297805 234007 210859 213356 290138 264563 229819 253572
13585 253572 306787 356743 376840 353720 311000 291791 339546 410551 435103 461360 505573
13574 505573 621080 693474 778343 904942 959217 911079 804036 720372 613258 483700
13564D83700o6361k9934o2612j8244j0014l1453r955m591k4479L4539J021m0174
13552B21443p7268J7383K2168j626K9650l4330m6534N344J2045J8487K9453L0550
13540B26765k1243m2132L9575J6904K3854m8831l4096L5788K7277J8954P711L8521
13528B89047O180m3713k1746k6893K6558N1659q398j9620K9360N8602k0108p792
13516C13136J2605j5426M2342m4894k8838L1002k8584k5414j589J4733M609j5315
13504B58367j8044J2855K2032l2709K7319j1997n9722j2341K2048J0052k850L5812
13492B50822K3543M438j477L4323L1525k997j1684J0705m956j0009k2402l3360
13480B68471l228J0536m042k8149Q018K5054L0153J9178l4721l8347M4895j0344
$$ plain form
13564 483700 417339 387405 324793 306549 296535 265082 255127 250536 226057 260596 261617 221443
13552 221443 144175 161558 183726 182100 211750 177420 130886 136230 148275 166762 196215 226765
13540 226765 205522 163390 202965 219869 243723 194892 160796 196584 223861 242815 250526 289047
13528 289047 295227 251514 229768 202875 229433 281092 272694 253074 282434 341036 320928 313136
13516 313136 325741 310315 352657 307763 278925 309927 281343 255929 254340 269073 273682 258367
13504 258367 240323 253178 275210 242501 269820 257823 198101 185760 207808 217860 215010 250822
13492 250822 274365 278803 277326 311649 343174 340177 328493 339198 334242 324233 301831 268471
13480 268471 265243 275779 271737 243588 251606 276660 306813 325991 291270 252923 297818 287474
13468B87474M1954K3223j2707m3681m6101N207q158L1923L6966J145L5237K3472
13456C75954l4790m0836n2084J4130L9034L3246o497J2443J8814L8465J7862K0402
13444D36143k2895O459J4397J2884P020m3305J1599o136p6074o8169O1035L5688
13432C68646j7033L2465L4897m266k9438o3035P479K8800K6849J2938l0017N516
13420C73801N0629K5504l3386j8200J6615M6828K8772L858M2976K9656N9649K968
13408F29670o8336m8806j7328n3468J3821J9708K6401m9350l4538P943L7470j3856
13396D49331j9832j6663m0016q214j1482J5171K1437p8822j8644L2488l5708K1718
13384C10764M1933J5304n987j971Q828K4736L0185J6855n103k2658N9001L6290
$$ plain form
13468 287474 329428 352651 339944 296263 250162 255369 247211 279134 316100 317245 352482 375954
13456 375954 341164 300328 248244 262374 301408 334654 328157 340600 359414 397879 415741 436143
13444 436143 413248 419707 434104 446988 454008 410703 422302 416166 340092 271923 332958 368646
13432 368646 351613 384078 418975 414709 385271 322236 329715 358515 385364 398302 368285 373801
13420 373801 424430 449934 416548 398348 414963 461791 490563 494421 537397 567053 626702 629670
13408 629670 561334 512528 495200 441732 455553 475261 501662 452312 417774 425717 463187 449331
13396 449331 429499 412836 372820 364606 353124 368295 389732 310910 292266 324754 289046 310764
13384 310764 352697 368001 362014 360043 368871 393607 423792 440647 435544 412886 471887 508177
13372E08177N6909o16o5806L936L1947n667q2162j7157N8695O5892n6182k8876
13360D69090k2056r417o006M8239Q9623j2124k8443J0308l8573m4076k4742q500
13348D23323k4391l9203n2177K5004o875K32j4696P9137O9867k4326r698j1987
13336D14210j5055N6131M3438p491j8390K3561N1701J9277j9274q793j4969Q0328
13324F04674O6440o158p109L5367P1498N6873L9437l362r106l7712q2542j07722
13312F20578n6611m8741m4399p6609K6253M1912O0649K0801J3063K6611Q98j2196
13300E72209k1089L0294N6790M2721k2868l0176K7272N4855M1528N7411k2841
13289G86106j9334R4239J13702J43634J34867L7582L6795l661n3469l5685r8879
$$ plain form
13372 508177 565086 564470 498664 502600 534547 528880 446718 429561 488256 554148 497966 469090
13360 469090 447034 437617 431611 479850 569473 557349 528906 539214 500641 456565 431823 423323
13348 423323 398932 359729 307552 332556 325681 325913 311217 390354 460221 435895 426197 414210
13336 414210 399155 455286 498724 491233 472843 496404 548105 567382 548108 539315 524346 604674
13324 604674 671114 664956 657847 693214 764712 821585 861022 857660 848554 810842 728300 620578
13312 620578 563967 515226 470827 394218 420471 462383 523032 543833 556896 583507 584405 572209
13300 572209 551120 581414 638204 680925 658057 627881 655153 710008 751536 808947 786106
13289 786106 766772 861011 974713 1118347 1253214 1290796 1327591 1323930 1270461 1234776 1135897
13278A135897j45772q2252n5514j2845j656j2248m3802M4136N517l8147O617K8208
13266H28139P857m9566L862M7548O658M5059P0674J00390P5865P581j562N0270
13254A192775k4606M0875Q3300J8338L5326J44162N1362Q821l8689m6750l8308
13243A426606N7324M1813l4686L0838M6513J03937R7823j7415N14K3555M4185
13232A821007J1978R3706O3007N0486N4605J09735L0817R5631J38694J44219J19504
13221B733389Q8395R9826K06134J60101K12843L06411K50583K95174L07176L56072
13211E016104M10485M08592N02864P05312Q15608R65683J169909J432856J786631
13202A3214044K328469K969738L674436M660750O169844Q488507J2214921J7257471
$$ plain form
13278 1135897 990125 907873 852359 839514 837858 825610 781808 825944 831461 793314 799931 828139
13266 828139 835996 786430 790292 837840 844498 889557 960231 1060621 1136486 1144067 1142505 1192775
13254 1192775 1168169 1209044 1292344 1310682 1346008 1490170 1541532 1550353 1511664 1464914 1426606
13243 1426606 1483930 1525743 1491057 1521895 1568408 1672345 1770168 1752753 1753267 1776822 1821007
13232 1821007 1832985 1926691 1989698 2040184 2094789 2204524 2235341 2330972 2469666 2613885 2733389
13221 2733389 2821784 2921610 3127744 3287845 3500688 3807099 4057682 4352856 4660032 5016104
13211 5016104 5426589 5835181 6338045 7043357 7858965 8824648 9994557 11427413 13214044
13202 13214044 15542513 18512251 22186687 26847437 33017281 41505788 53720709 70978180
13194G0978180K2266598K4105479K0179444J0333654l043517j4786275k1411284
13187A08622279k2407924j9152797j4467425j0210539o960806m697979l010973
13180B7713836j900714j301521r56479r29236j048932r23796o11462j10140M41835
13171B0373391R99441J507792K120335K943649L951720N125608O606659Q680884
13163E2309479J1568035J6109637K3251469L2831902M2149823M6166449M0781821
13156B65168615K4446748N84695k2333852l8923597m5249883m2314771l4599373
13149A06778582k5525244j7887790j2500252q953369o624313m971547l764416
13142B6551651k881788k070199j355725p88920k76103K41766Q67590J268704J460390
$$ plain form
13194 70978180 93244778 117350257 137529701 147863355 144819838 130033563 108622279
13187 108622279 86214355 67061558 52594133 42383594 35422788 30724809 27713836
13180 27713836 25813122 24511601 23555122 22625886 21576954 20653158 20041696 19931556 20373391
13171 20373391 21372832 22880624 25000959 27944608 31896328 37021936 43628595 52309479
13163 52309479 63877514 79987151 103238620 136070522 178220345 224386794 265168615
13156 265168615 289615363 290200058 267866206 228942609 183692726 141377955 106778582
13149 106778582 81253338 63365548 50865296 41911927 35287614 30316067 26551651
13142 26551651 23669863 21599664 20243939 19455019 19178916 19420682 20288272 21556976 23017366
13133B3017366J472604J422973J709902K286381L249205M664771O796588R908647
13125E4528437J4537751J9994590K4232313K3791347J6955522M439774r996585
13118A48483149k0778237k5301727k4072499j9403613j4153582j0037684p164160
13111B7571647n222700l926094l042435k428692j918041j582434j259553r72754
13103G218944p99279o14104n04330m39167m18496l36278l50024k84004j96021
13094C277241j95756j99096j89119j08574l4048o7963q3332q1129m0836o5494
13084B211894j29854j34768p4244k1162l0310r5634j17623m3686k0491j385K9665
13073A572402L1604J2327N3727P7000J00645J51781K68041K32962K94094L40215
$$ plain form
13133 23017366 24489970 25912943 27622845 29909226 33158431 37823202 44619790 54528437
13125 54528437 69066188 89060778 113293091 137084438 154039960 158479734 148483149
13118 148483149 127704912 102403185 78330686 58927073 44773491 34735807 27571647
13111 27571647 22348947 18422853 15380418 12951726 11033685 9451251 8191698 7218944
13103 7218944 6419665 5805561 5301231 4862064 4443568 4107290 3757266 3473262 3277241
13094 3277241 3081485 2882389 2693270 2584696 2550648 2482685 2399353 2318224 2277388 2211894
13084 2211894 2082040 1947272 1873028 1851866 1821556 1725922 1608299 1564613 1544122 1542737 1572402
13073 1572402 1604006 1616333 1670060 1747060 1847705 1999486 2267527 2500489 2794583 3134798
13063C134798K31952J01201m2561m9780j94197k90658l28869k98194k48219k55218
13053A760255k55633j31984j27363o2133n6659o0112j27602m3942k4775l0721
13043H39331k3364J0505L0203M3655m8641m6374l8018k042L9162J842l2180K394
13031G76473O9142L7357K6194n4213j6692l2076p3167p6312m4421P000k8659j3950
13019E76676J0142m9772n3476L6913P9609N8410P385m4183k7723K2690M1082N5080
13007G12833L2068M280N829M8705k2570l657p9460l4932p5709o021j9978K9323
12995E90711L7832M6258j6915n6523j4536n8892J079K4912l0443p441L389q332
12983E11099p1193o3049k597l477N7987P2489K7649M4757p676N0896m0477J2638
$$ plain form
13063 3134798 3366750 3467951 3425390 3375610 3181413 2890755 2561886 2263692 2015473 1760255
13053 1760255 1504622 1372638 1245275 1183142 1126483 1066371 938769 894827 870052 839331
13043 839331 815967 826472 856675 900330 851689 805315 767297 765255 804417 806259 774079 776473
13031 776473 845615 882972 909166 854953 838261 806185 733018 656706 612285 619285 590626 576676
13019 576676 586818 537046 483570 520483 600092 658502 665887 621704 593981 616671 657753 712833
13007 712833 744901 749181 755010 803715 781145 777488 698028 663096 587387 581366 561388 590711
12995 590711 628543 674801 657886 601363 586827 527935 529014 553926 523483 516042 519431 511099
12983 511099 439906 376857 374260 370783 428770 501259 528908 573665 565989 616885 576408 589046
12971E89046N4196Q6418O2355K3007J7482P9042L1691j6121N8950Q1931J64805
12960A232802K10520J84365O6836M3705o1622j40847j00601j55417j54091j45746
12950I79904Q012k279j5853n6177j7490J6825M6054K3262M8706R3944J9984m525
12938A140367K639K5832J12664J86057J02969q678N7775R3627J12872K1817n437
12927A842504m7316R935l1310q6576j13468j05379o7261j4308q7256j11838n6686
12916A131041l3759k0114j3090J5448J3069p7560j13636q0006k5832P956M8433
12905H51950J5385Q6001J88664J45056J45265J89280J82809L8141l237q5038j52361
12894A601915r3415r9648j24849j06838o5458K5585l1584l5088K1528m7475r7283
$$ plain form
12971 589046 643242 729660 792015 815022 832504 911546 943237 927116 986066 1067997 1232802
12960 1232802 1443322 1627687 1694523 1738228 1676606 1535759 1435158 1279741 1125650 979904
12950 979904 987916 985637 969784 913607 896117 912942 958996 982258 1030964 1124908 1144892 1140367
12938 1140367 1143006 1168838 1281502 1467559 1570528 1561850 1619625 1713252 1826124 1847941 1842504
12927 1842504 1795188 1805123 1773813 1687237 1573769 1468390 1401129 1386821 1299565 1187727 1131041
12916 1131041 1097282 1077168 1064078 1079526 1092595 1015035 901399 821393 795561 803517 851950
12905 851950 867335 953336 1142000 1287056 1432321 1621601 1804410 1842551 1839314 1754276 1601915
12894 1601915 1508500 1408852 1284003 1177165 1111707 1137292 1105708 1070620 1092148 1044673 947390
12883I47390m0274m1994n6214q5584l9087m4701k6522n585p5505j6211K2877L5097
12871E73687k3893K5314J7964O3647N753J5581p13k4596j4703j5536N254J1298
12859F39057J4865j5995k0790j3049j4657n943J2440Q51N603J7451n665j0691
12847F03477R190P255j1111j1805M950j5189m7478l1368l1185J6929K1752o301
12835E09116K2393J0825p538K1596K4025m673m8611m2373N775l8445q428l3206
12823D10456l5942J5439L2334O0793J0314R281K2354M8729O1365K9929J9959j3870
12811F71141K6328M156J2643k833j7794L6329K7814P8959l4437j3882K8111J2044
12799H28579o7347l8256j0618J2567O5572L9358j4426p7522j09151j4579L008
$$ plain form
12883 947390 907116 865122 808908 723324 684237 639536 613014 607429 531924 515713 538590 573687
12871 573687 549794 575108 593072 656719 662472 678053 677340 652744 638041 622505 627759 639057
12859 639057 653922 637927 617137 604088 589431 583488 595928 596779 602382 619833 614168 603477
12847 603477 612667 619922 608811 597006 601956 586767 539289 507921 476736 493665 515417 509116
12835 509116 531509 542334 534796 556392 580417 575744 527133 484760 490535 452090 443662 410456
12823 410456 374514 389953 422287 483080 493394 502675 525029 573758 635123 665052 685011 671141
12811 671141 697469 701625 714268 711435 693641 729970 757784 836743 802306 788424 816535 828579
12799 828579 761232 722976 712358 724925 790497 829855 815429 737907 628756 614177 617185
12788F17185j9946m4367n206j2253J8855q036M163O5510K0791O7727J03073J4312
12776H21808M4930M5022Q7967K7340N5485J0661n717J08683O6880J39043K01612
12765A603714J98674J97731J50112Q7712L2927J2521k7800j50063j60823j85157
12755A759548j24705j18590q6707k7879L181l4507k7374K9376Q5978J2394l4587
12744A436128M512l7670O0242J61915J45459K33708K77925K79426M03440L84296
12734C349381L83891L03742J10950n5258k32657k57945l16237l13801k87793k18944
12724B465329j60519q1704m4723k9749m2019q831L6236L4966K5758J1801q3868
12713B122677j4525J5780J9383j1828O0924P2275P8415J39952J32260Q2813J62669
$$ plain form
12788 617185 597239 552872 547666 535413 554268 546232 550395 615905 636696 704423 807496 821808
12776 821808 866738 911760 999727 1027067 1082552 1093213 1087496 1196179 1263059 1402102 1603714
12765 1603714 1802388 2000119 2150231 2237943 2270870 2283391 2255591 2105528 1944705 1759548
12755 1759548 1634843 1516253 1429546 1401667 1404848 1370341 1342967 1372343 1458321 1470715 1436128
12744 1436128 1440640 1402970 1463212 1625127 1770586 2004294 2282219 2561645 2965085 3349381
12734 3349381 3733272 4037014 4147964 4092706 3860049 3602104 3285867 2972066 2684273 2465329
12724 2465329 2304810 2223106 2178383 2148634 2106615 2097784 2134020 2168986 2194744 2206545 2122677
12713 2122677 2108152 2123932 2143315 2131487 2192411 2264686 2343101 2483053 2615313 2698126 2860795
12702B860795K40911K85074K20647J86314P5816P856l4916o1198j15680j47765
12692C517854r6421r7539l7500j1271M9499R4724P8340N0739J44827K53226Q5663
12681D032141R398P8137J09843J40718J60234J97531J75625J96338K71931L18307
12671E690203K86690K89363L22346M15285M32822N04656O19430N40731O04102
12662I705628O34470O49474P30337Q47596R73920J164010J454427J806629K141894
12653B0108385K426927K883668L400486L930073M536138N180631O055634P223354
12645E5745296Q885400J1498863J5321887K1130454K9495500L9896728N0599590
12638B32573718N9180820O2439151N8185949M6043596K7073064L833306k0459792
$$ plain form
12702 2860795 3101706 3386780 3607427 3793741 3869557 3877413 3842497 3781299 3665619 3517854
12692 3517854 3421433 3323894 3286394 3275123 3324622 3419346 3497686 3548425 3693252 3946478 4032141
12681 4032141 4041539 4119676 4229519 4370237 4530471 4728002 4903627 5099965 5371896 5690203
12671 5690203 5976893 6266256 6588602 7003887 7436709 7941365 8560795 9101526 9705628
12662 9705628 10340098 10989572 11719909 12567505 13541425 14705435 16159862 17966491 20108385
12653 20108385 22535312 25418980 28819466 32749539 37285677 42466308 48521942 55745296
12645 55745296 64630696 76129559 91451446 112581900 142077400 181974128 232573718
12638 232573718 291754538 354193689 412379638 458423234 485496298 489329604 468869812
12631D68869812m1754305n6876421o3632731o2107933n4418354m3826878l2921445
12624A13331745k3642982j6784836j2044479q964119o919927n650117m764995
12617C4560290m202480l726057l259593k794191k404929k067286j673272j350897
12609A3081585j078710q90943p31409o33338o33428n49185m51658l64996l47123
12600G400795l90894l39359k12329j44512j71198k21554k30606j85492k19070
12591E285781j65464j81212k06669k26908j17209o3198r6977n1932m0480j0567
12581D125165j7341L6913O1343O015q764O673j16783j42779j11077n3125m0058
12570C746182l9529n8304l9124p4492J8661P6968O8755K3415j7315M5609R8879
$$ plain form
12631 468869812 427115507 370239086 306606355 244498422 190080068 146253190 113331745
12624 113331745 89688763 72903927 60859448 51895329 44975402 39325285 34560290
12617 34560290 30357810 26631753 23372160 20577969 18173040 16105754 14432482 13081585
12609 13081585 12002875 11111932 10380523 9747185 9113757 8564572 8112914 7747918 7400795
12600 7400795 7009901 6670542 6458213 6313701 6142503 5920949 5690343 5504851 5285781
12591 5285781 5120317 4939105 4732436 4505528 4388319 4325121 4228144 4176212 4135732 4125165
12581 4125165 4107824 4144737 4206080 4212095 4203331 4210004 4093221 3950442 3839365 3786240 3746182
12570 3746182 3706653 3648349 3609225 3534733 3553394 3630362 3699117 3722532 3705217 3750826 3849705
12559C849705O7307M2205L7239J9022Q9812P4139R5277J09160R2686J03091R2317
12548D671960J37236J93226J50411J93858K60999K77324K59084K63506K89046
12539F696650L49593L69352M58795N15455N26419N65588O55002O99322P97962
12530A1634138R14159J105135J264318J398966J648847J820735K141861K511192
12522B4439351K916179L478070M205761M972972O203288P936135J0305972J3622376
12514G8080104J8298057K4472518L1666025L7768562L8775651L0637330J3708306
12507B73406553o476657k3552011l2685908l3511956k8933509k2390419j5972789
12500A09883304j0577132o091559k400285P18974L435082N888580Q184492J0024085
$$ plain form
12559 3849705 3917012 3959217 3996456 4015478 4105290 4179429 4274706 4383866 4476552 4579643 4671960
12548 4671960 4809196 5002422 5152833 5346691 5607690 5885014 6144098 6407604 6696650
12539 6696650 7046243 7415595 7874390 8389845 8916264 9481852 10136854 10836176 11634138
12530 11634138 12548297 13653432 14917750 16316716 17965563 19786298 21928159 24439351
12522 24439351 27355530 30833600 35039361 40012333 46215621 54151756 64457728 78080104
12514 78080104 96378161 120850679 152516704 190285266 229060917 259698247 273406553
12507 273406553 266929896 243377885 210691977 177180021 148246512 125856093 109883304
12500 109883304 99306172 93214613 90814328 91533302 94968384 100856964 109041456 119065541
12492A19065541J1305037J1895327J1834696J1506261J1241680J1173239J1548990
12485A99570771J2074629J2580501J2798315J2221509J0433859P521593L543298
12478B70744475j024137n444096r118829j1563710j2807676j2916996j2233713
12471B05635318j1273464j0245303r509840r225730r288854r531765r833343r808383
12463A26918636r237907q070342o504579m516092k107588O70817L860672P672530
12455A08686147J2558559J8578909K5356432L1485135L4141726K9788614J6713766
12448B77309288k380160k1069097l3999890l8772275l6315709l0459914k3939162
12441I0373081j8195551j3764963j0439367q018453o170125m773110l770759k989643
$$ plain form
12492 119065541 130370578 142265905 154100601 165606862 176848542 188021781 199570771
12485 199570771 211645400 224225901 237024216 249245725 259679584 267201177 270744475
12478 270744475 269720338 264276242 255157413 243593703 230786027 217869031 205635318
12471 205635318 194361854 184116551 174606711 165380981 156092127 146560362 136727019 126918636
12463 126918636 117680729 109610387 103105808 98589716 96482128 97152945 101013617 108686147
12455 108686147 121244706 139823615 165180047 196665182 230806908 260595522 277309288
12448 277309288 274929128 253860031 219860141 181087866 144772157 114312243 90373081
12441 90373081 72177530 58412567 47973200 39954747 33784622 29011512 25240753 22251110
12433B2251110k484285k148072j918627j674536j373320j200355j022701q94945
12425I534269q20998o95166n80854n03345m28259l15947l21370l42494l24751
12416E201085k42541j92305k23413k15291j74633j57069j56027j65570j68959
12407C505277j47168j52290j22146j20190j06143p2624j10535q115o7592j54010
12397B444464q7504k1671j3021l1752o2633p0940q6281m277j8282J0164k1177
12386B037090l1368J7765P5526M2693N478j9277L6234J30213J48399J57794J85363
12375B785910J48059L6021j31338k27477l04765k79717k05969j29889p3900r8180
12365A518755o5457r929K9877j887m8503J7205L6877J2070Q752M6132M1642N8698
$$ plain form
12433 22251110 19766825 17618753 15700126 14025590 12652270 11451915 10429214 9534269
12425 9534269 8713271 8018105 7437251 6933906 6505647 6189700 5868330 5525836 5201085
12416 5201085 4958544 4766239 4542826 4327535 4152902 3995833 3839806 3674236 3505277
12407 3505277 3358109 3205819 3083673 2963483 2857340 2784716 2674181 2666066 2598474 2444464
12397 2444464 2356960 2335289 2322268 2290516 2227883 2156943 2070662 2066385 2048103 2058267 2037090
12386 2037090 2005722 2023487 2099013 2141706 2147184 2127907 2164141 2294354 2442753 2600547 2785910
12375 2785910 2933969 2969990 2838652 2611175 2306410 2026693 1820724 1690835 1616935 1518755
12365 1518755 1453298 1443369 1473246 1471359 1422856 1440061 1476938 1489008 1497760 1543892 1585534 1644232
12353A644232n053m4003p2817r990j473K2174Q2235J16492J90741K45806K37493
12342B405837K82308K50748J23249q5156j86892j78113j51429j67468j69912j71911
12332A951261j89754j01112r1235q6839j1540m0092n8611o4148p5996l5382o8886
12321A127666n7442j5263n8947r5549o8993o2983p2645k3995j1478L0561K1340
12310G12272M9917J52873K11445K97284K26825O8082p2940k32390k67867j61264
12300I84237j38530q7459l5924j06771q5485l9930j9993l0488m4109n2790n6500
12289B86258K8473L58m7564n3028L181J2049J0272P3885Q4083k8867o6234K923
12277C05789m1296o7263n5030n0496j3586J5612n6279m3721Q316N0782L7097r753
$$ plain form
12353 1644232 1639179 1595176 1522359 1512369 1510896 1533070 1615305 1731797 1922538 2168344 2405837
12342 2405837 2688145 2938893 3062142 2976986 2790094 2611981 2460552 2293084 2123172 1951261
12332 1951261 1761507 1660395 1569160 1482321 1470781 1430689 1372078 1307930 1231934 1196552 1127666
12321 1127666 1070224 1054961 996014 900465 831472 768489 695844 671849 660371 690932 712272
12310 712272 762189 915062 1126507 1423791 1650616 1718698 1645758 1413368 1145501 984237
12300 984237 845707 758248 722324 615553 530068 490138 470145 439657 395548 342758 286258
12289 286258 314731 315089 267525 214497 217678 229727 239999 313884 397967 369100 302866 305789
12277 305789 264493 197230 142200 91704 78118 93730 37451 -6270 2046 52828 89925 80172
12265H0172k991J9794J8247J4842J1862P8891o544l8959j4976n5026o0669L4155
12253G8798J7695m7622k7303J7115j5260Q0395J2722p3248k028m0537Q566L2211
12241D1504m1408K8935R6322J8490J2340L7631j1024o0201p0273o6057k0154j569
12229c5464M8799k556J8408L0513O3797L226q984L7962O1449K8836M2221k9275
12217B58932n3695N5974O1903M986o457L2104O1475M8954M2299R5845K12539K25038
12205A039897K32577K91305L42184L03880K00409J02418q102j34765j90001k89534
12195A890268k79710k80000l55696k20529j15282j13634j24903o9317p6025n5441
12185A99731n5432l0126n068j1055l1310k3327l5762N2396N7426l8215n5393J2845
$$ plain form
12265 80172 77181 96975 115222 130064 141926 220817 214273 175314 160338 105312 44643 78798
12253 78798 96493 48871 21568 38683 23423 103818 116540 43292 41264 727 9293 41504
12241 41504 96 29031 125353 143843 156183 193814 182790 122589 52316 -13741 -33895 -35464
12229 -35464 13335 10779 29187 59700 123497 126723 117739 155701 217150 245986 288207 258932
12217 258932 205237 261211 323114 328100 321643 353747 415222 464176 506475 602320 814859 1039897
12205 1039897 1272474 1563779 1905963 2209843 2410252 2512670 2504568 2369803 2179802 1890268
12195 1890268 1610558 1330558 974862 754333 639051 525417 400514 331197 255172 199731
12185 199731 144299 114173 109105 98050 66740 43413 7651 60047 117473 79258 23865 36710
12173C6710J0832o3836m6553K7492N5381J531K989n4108j5408M4623k568j283
12161d198o8647j6236J1079J5772o17L7087O9958K259L656J3382J4334K6054J6629
12148A20512m6259p4327j3393q281j8799j08283m42M2250J1813O0374j9214m1707
12136i5756j1863L8646k0945K4673K5357k1140O070l9368J0553J5864Q0650j2335
12124D06n6562j7518L1558L7208j6991j436K6031K4562k3408j1226K9345J6395
12112C8364R268k2495m1253m4358M079L1234L8783J3408n657n5181k6917K7253
12100c3472n535M1339N3843J2059l4379j8114L4518J5280J5L5077J8975k954j4328
12087A02324l9754l1799L3408J9433k2354r099l5736L4016L8350k9344k9365l5121
$$ plain form
12173 36710 47542 -16294 -62847 -35355 20026 21557 24546 -29562 -44970 -347 -2915 -4198
12161 -4198 -72845 -89081 -78002 -62230 -62847 -25760 44198 46457 50113 63495 77829 103883 120512
12148 120512 74253 -74 -13467 -21748 -40547 -148830 -149272 -107022 -95209 -34835 -54049 -95756
12136 -95756 -107619 -68973 -89918 -65245 -39888 -61028 -54958 -94326 -83773 -67909 12741 406
12124 406 -56156 -73674 -42116 -4908 -21899 -23335 2696 27258 3850 -7376 21969 38364
12112 38364 47632 25137 -16116 -60474 -56395 -25161 13622 27030 21373 -33808 -60725 -33472
12100 -33472 -39007 2332 56175 68234 33855 15741 50259 65539 65554 100631 119606 116652 102324
12087 102324 62570 30771 64179 83612 61258 52159 16423 50439 88789 59445 30080 -5041
12075e041L1450R688m85K9409J02832N8706J6464J6825l2018l2592k1851J2281
12063A85668L4789L7975P5086P2807P3214R8101R7870J07934J43874J50051J27817
12052A205186J00678k2185j05372j05297j59962r8073r2139r6873n5719k2932
12042E47312m9951R996M0545p959L7220J9016L0142P8724Q0519N3610R5181M3446
12030I77801J4436R7753J15419P8555N8151q496j7150M737J0046k7884k2494j8126
12018A262748m2504l5699m7190k8000m3827k8035j06427n8301m7530m1526j3051
12007G70658l9971l1863q5950k1071J04491n6350L947j688M1582M0142J6409J22781
11995H63117K22010J93083J20317M0878n1203j64969k20267k13597j83397j03478
$$ plain form
12075 -5041 26409 36097 35612 65021 167853 226559 243023 259848 227830 195238 173387 185668
12063 185668 220457 258432 333518 406325 479539 577640 675510 783444 927318 1077369 1205186
12052 1205186 1305864 1283679 1178307 1073010 913048 814975 722836 625963 570244 547312
12042 547312 497361 507357 547902 539943 577163 596179 626321 705045 785564 839174 934355 977801
12030 977801 992237 1089990 1205409 1283964 1342115 1333619 1316469 1321206 1331252 1303368 1280874 1262748
12018 1262748 1220244 1184545 1137355 1109355 1065528 1037493 931066 872765 825235 783709 770658
12007 770658 730687 698824 612874 591803 696294 639944 643891 642203 683785 723927 740336 863117
11995 863117 1085127 1278210 1398527 1439405 1388202 1223233 1002966 789369 605972 502494
11985E02494q6911r4671l3208m6123n8053n1334K3250k723q872j1548k0721J7280
11973A28860m2003J2999K6732M84j3168m2977O1089P20n6569k6152r794l9066
11961A155k7778k2M5980J9181J9240m6166j1166L9147O5743j2641m6836j0029
11949C5808j8550j1712j541j713Q140J5626n266j3131k8548l955K8800j9629l3539
11936d9210L0003K6207L115j5990m451K2888k9606k930M1096K7352j8787L3961
11924F3648j344p3620n3311j3768K6689L1083K5400j3270n364k9735K0395J2771
11912a0426j7889n418k0579l273q728N168P175J2762j6219r848J4079K8852n397
11899b9741K154m38P2315o138j00957q1489L7034O1691n169k1323L3002j4669
$$ plain form
11985 502494 415583 320912 287704 241581 183528 132194 155444 152721 143849 132301 111580 128860
11973 128860 86857 99856 126588 127072 113904 70927 132016 132736 76167 50015 40221 1155
11961 1155 -26623 -26645 19335 38516 57756 11590 424 39571 105314 92673 45837 35808
11949 35808 17258 5546 4005 2292 10432 26058 20792 7661 -20887 -24842 3958 -15671 -49210
11936 -49210 -19207 7000 10115 -5875 -10326 12562 -17044 -19974 21122 48474 29687 63648
11924 63648 62304 -11316 -64627 -78395 -51706 -20623 4777 -8493 -13857 -43592 -23197 -10426
11912 -10426 -28315 -33733 -54312 -57585 -66313 -61145 -53970 -41208 -57427 -67275 -53196 -24344 -29741
11899 -29741 -27587 -28025 44290 38152 -62805 -144294 -107260 -45569 -50738 -72061 -39059 -53728
11887e3728j2303M1752N3792O885l7666l1252K2776J820m1862l5928J6275L6143
11875c3296M1798o9920k7317q77J7312L8639M6447O3873k0062m1266K1782k91
11863C6822l9056J000l1424P690M400l2634L8894M0650J7879N0754J3048l3505
11851G4518l7656l6044k7259J0302n155Q894J1241O7357K5422n7830n1940L0998
11839A2848l6896j5222n0575K749O2668R025J7880j543L2354K6277P838l5458
11827C1945r535J139L3573K708O963J6089M0183J9521K1696n6166j7923K1007
11815A11200o827n3920k0840k696L82l9454M6138L7626m493l8937K725N7435l638
11802H4701k9010m389l9475J1420L2734J2020o014m2245p1522J722J56025Q9807
$$ plain form
11887 -53728 -66031 -24279 29513 36398 -1268 -32520 -9744 -7924 -49786 -85714 -69439 -33296
11875 -33296 8502 -61418 -88735 -89612 -72300 -33661 12786 76659 56597 15331 37113 36822
11863 36822 -2234 -1234 -32658 -24968 -20568 -53202 -14308 26342 44221 94975 108023 74518
11851 74518 36862 818 -26441 -16139 -21294 -12400 -1159 66198 91620 33790 -18150 12848
11839 12848 -24048 -39270 -89845 -87096 -24428 -15403 2477 934 33288 59565 67403 31945
11827 31945 22410 23549 57122 59830 66793 82882 123065 142586 164282 108116 90193 111200
11815 111200 104373 50453 29613 26917 27299 -12155 33983 71609 67116 28179 30904 88339 84701
11802 84701 55691 51302 11827 23247 55981 68001 61987 19742 -51780 -50058 105967 195774
11790A95774J6053p7788k2575L3930j8936m5471l7952K5544k3424M313k1686n151
11778B2631J5583o629Q188J9976N243j8549k4809J8692m9889L6823j8661n6010
11766d7411o0440n0111n205R5460N7308L2040K7929n122r132k9699J4400j7387
11754B630K5478j663K2949J2554n9175l0213L1538j1120p198J10888j5232n7047
11742B4389q875K682m4473r208L7244M1325j1653k4591L410K7261k4149K2510
11730C5872n181n421k5343J575j8089m0377K2091M6692j5232k1381L2229M1716
11718D9151n3567l7782q326l240L3923O8478R510Q049L6622J7439l3828n8959
11706B7470o9987K8397r338l568M3388J8482K5460J4680K7142M776l9191r1178
$$ plain form
11790 195774 211827 134039 111464 145394 126458 80987 43035 68579 45155 49468 27782 22631
11778 22631 38214 31585 39773 59749 64992 46443 21634 40326 -9563 27260 8599 -47411
11766 -47411 -107851 -157962 -163167 -67707 -10399 21641 49570 44448 35316 5617 20017 2630
11754 2630 28108 26445 49394 61948 2773 -27440 4098 -7022 -14220 96668 81436 24389
11742 24389 15514 18196 -26277 -35485 1759 43084 31431 6840 10250 37511 13362 35872
11730 35872 30691 25270 -73 1502 -16587 -56964 -34873 11819 -3413 -24794 7435 49151
11718 49151 -4416 -42198 -50524 -53764 -19841 48637 58147 66196 102818 120257 86429 27470
11706 27470 -42517 -14120 -23458 -27026 16362 34844 60304 74984 102126 106902 67711 -23467
11694b3467m4463L9487N7982J4829J2812l565j1882L0068l4164m5866K6990N7855
11682G6616k6496j8284K1643r005P364m491K1426n2063k2127Q341n637R1275M9230
11669A37792M489j2419m1771l6109L6022p061m3593Q217L017K6927k1427j1052
11657D3032L1886P767k6782k6343l5068L7932l6720J3747M7291k244J6817k6017
11645D5298J5981O1249j8885p454N7945r911j0267p800m3390J0822J7241k9736
11633H1093j6889O837L5037k392K1337j2247n3477N69O3156K1854l362J6866J719
11620A60101k1501l1337k6396J7230l820m6752Q658j5446L2632M3499L3132q903
11608A41097M056K4769p0224p6899m4281j0641M1072M0965Q110k7244j082o8569
$$ plain form
11694 -23467 -67930 -28443 29539 44368 57180 53615 41733 71801 37637 -8229 18761 76616
11682 76616 50120 31836 53479 44474 51838 47347 68773 16710 -5417 2924 -2713 88562 137792
11669 137792 142281 129862 88091 51982 88004 80943 37350 45567 48584 75511 54084 43032
11657 43032 74918 82685 55903 29560 -5508 32424 -4296 9451 56742 54498 71315 45298
11645 45298 61279 122528 103643 96189 154134 144223 133956 126156 82766 93588 110829 81093
11633 81093 64204 71041 106078 103686 125023 112776 59299 59868 123024 144878 141516 158382 160101
11620 160101 138600 107263 80867 98097 94277 47525 56183 40737 73369 116868 150000 141097
11608 141097 145153 169922 99698 22799 -21482 -32123 8949 49914 58024 30780 29698 -38871
11596c8871k5522J6515O4963L9495J9062K4902L9112k5475l8880k4989l3280N5005
11584G2037K0717M038M5593j3425L2598J0459p0712r431K3856J7129m489K1436
11572A49806l2775k4293j2680n1744O4945L1772l9545j8720r03l0627j1052P028
11560C1212k2304o009N834K2392M1835K1746j6921j743L0626L2637L9478N34o946
11547A72371q161j5964j196j7520l6940j7220j6954k6731K0364L0818j8683J3538
11535G7722M475k284J07421L6726m783J9624M3296M4487l4773l2519N5582k9265
11523B85709L3495J02178J23122J37871K01357J18839L7956q3535p9720j34378
11513G42894j26195j21237r5781o8217o2391k6241j8573N52N640l7778L8969l900
$$ plain form
11596 -38871 -64393 -47878 17085 56580 75642 100544 139656 114181 75301 50312 17032 72037
11584 72037 92754 96792 142385 128960 161558 172017 101305 91874 115730 132859 128370 149806
11572 149806 117031 92738 80058 28314 93259 125031 85486 66766 65863 35236 24184 31212
11560 31212 8908 2899 8733 31125 72960 94706 77785 76042 106668 139305 178783 179317 172371
11547 172371 164210 148246 147050 129530 92590 75370 58416 31685 52049 82867 64184 77722
11535 77722 82197 79913 187334 224060 219277 238901 282197 326684 291911 259392 314974 285709
11523 285709 319204 421382 544504 682375 883732 1002571 1040527 956992 877272 742894
11513 742894 616699 495462 399681 331464 269073 242832 224259 224811 230451 192673 231642 227742
11501B27742k95M113k7580J7218M6235O488M7101K4334N2529O3729N6510P4685
11489E92809N1541Q0754K6401J41389J94174K01801K18012J55042n18j27316k06275
11478A327814k36843k29584j93635j65039p1448m8765m955L870n8652l4160O781
11467B95384K0496P029n7090k0351M9422J5603J4948l815p058K05L0763K5354
11455C70890k2047O3124R5343J0235L6080O4588O7481J32955Q2869J7153p2744
11444H45927j35014o9372j13638j12194q7694m8237N444k3581k3071O5175K0416
11433C24161n7735k8800n7658l1270L1349R841K3924P0637L3693n2565j5751J0949
11421B60775m6415l5639m7353L5262N5264O6066J2619q700n4506q3176l6461N0701
$$ plain form
11501 227742 227447 231560 203980 221198 267433 273921 321022 345356 397885 461614 518124 592809
11489 592809 644350 725104 751505 892894 1087068 1288869 1506881 1661923 1661405 1534089 1327814
11478 1327814 1090971 861387 667752 502713 431265 382500 377545 381415 322763 288603 295384
11467 295384 315880 322909 265819 245468 294890 310493 325441 321626 314568 314773 345536 370890
11455 370890 348843 411967 507310 517545 553625 618213 685694 818649 901518 918671 845927
11444 845927 710913 641541 527903 415709 328015 279778 285222 261641 238570 303745 324161
11433 324161 266426 237626 179968 148698 180047 189888 213812 284449 318142 265577 249826 260775
11421 260775 214360 178721 131368 166630 221894 287960 300579 291879 237373 154197 117736 168437
11409A68437P9767M1359J8782l0331k7897j514l2040j5552J3412K9816J8874K1703
11397B84816k7156M052k049J8130N2251J945J3015q746k5463l3339n3898l6494
11385A87064N0272K4960J6904m147K7856M2121J6964p030n4231K9545j378l8675
11373B90225n5962k3940N709m6743l2097J4889N0941J8423L3685K0607O383L9121
11361C21241k6516l1933J1888P4461M0779P763N086O1353q872l2350J8429k4832
11349D16497j8943j1224k417m4047o6640L1086P0412l051J6538l0301r4453j5056
11337B48401M3461K1615J9229L4718L2411n483k6211o2133J627r292M9777P27
11325C48847o236M8443L0355N2381L3950J1585j5890J0688K7243M498k8929j0397
$$ plain form
11409 168437 248204 289563 308345 278014 250117 248603 216563 201011 214423 244239 263113 284816
11397 284816 257660 261712 259663 277793 330044 331989 345004 336258 310795 277456 223558 187064
11385 187064 237336 262296 279200 275053 302909 345030 361994 354964 300733 330278 328900 290225
11373 290225 234263 210323 216032 169289 137192 152081 203022 221445 255130 275737 282120 321241
11361 321241 294725 262792 274680 349141 389920 397683 402769 464122 455250 422900 441329 416497
11349 416497 397554 386330 383913 339866 273226 304312 374724 371673 388211 357910 263457 248401
11337 248401 291862 313477 332706 367424 399835 394352 368141 306008 307635 298343 348120 348847
11325 348847 342611 391054 421409 473790 507740 519325 503435 514123 541366 545864 516935 506538
11313E06538J16n3382p1843o9310k3360M844O6777M9819j2683p6989P289O597
11301C34413j959Q960P1570m0329m8069J4456L8082M2965l3425l0991n6223m7874
11289B51576O6107J06518Q4890K9656K3015N8016l0032j09439k7430r735j4015
11278D29127R583j5513M2970M8521l8650l8090k6460m6277j0505O0263R096n2508
11266C71557L02J1774N6185n0702n362P9773J909p4041m6464j13431j2938J4691
11254B33253N618j0240N2347R9536K7962J0800K9594K6724J3889k2967k0500L8827
11242D84843n990l5379m17K6038J3406L3238K9739P4123L6075M6494J5994L4014
11230G52178P2425J09334N1598o719r8727r7949j03759o5049m2879o9501p3885
$$ plain form
11313 506538 506654 453272 381429 312119 288759 293603 360380 410199 397516 320527 327816 334413
11301 334413 332454 341414 412984 372655 324586 339042 377124 420089 386664 355673 299450 251576
11289 251576 317683 424201 509091 538747 561762 619778 589746 480307 452877 443142 429127
11278 429127 438710 423197 466167 514688 476038 437948 411488 365211 354706 414969 424065 371557
11266 371557 371859 383633 439818 389116 383754 463527 465436 391395 344931 231500 218562 233253
11254 233253 238871 228631 280978 380514 408476 419276 448870 475594 489483 466516 446016 484843
11242 484843 478853 443474 443057 469095 482501 515739 545478 619601 655676 702170 718164 752178
11230 752178 824603 933937 985535 978816 880089 782140 678381 613332 570453 500952 427067
11219D27067J1212K7961M0496N7504J06650P5302q141n0169l770m5736l6522j5594
11207E86260L7204L5024K4091p265m1214P5511N5718N3569R0912Q9962N1628J05776
11195A157176J09911R1815L8668n3470j09317k1196m5587j03790p6501q0812n4690
11184H52207P488P717j7273J3252j9073l0670K1285L8903N5594O1561k3285n5376
11172I12330q714o113J8139J14646P3302k9872N5662N4658O9821Q7465K4249P4878
11160A440451P5725O9790J5273j5226J1899P517m5076k7952N3696R1054p454M5320
11148A715017L4245L138M3196M8420J7627N4728Q0921J34948R2694L8435M8305
11137B311674J62230J67205J82925J70598J84386J55623J91984K22506K50348
$$ plain form
11219 427067 438279 466240 506736 564240 670890 746192 738051 687882 684112 638376 601854 586260
11207 586260 623464 658488 682579 675314 634100 709611 765329 818898 909810 999772 1051400 1157176
11195 1157176 1267087 1358902 1397570 1344100 1234783 1213587 1168000 1064210 987709 906897 852207
11184 852207 859695 867412 850139 863391 844318 813648 834933 873836 929430 990991 967706 912330
11172 912330 903616 897503 915642 1030288 1103590 1073718 1129380 1184038 1253859 1341324 1365573 1440451
11160 1440451 1516176 1585966 1601239 1586013 1597912 1605429 1560353 1532401 1586097 1677151 1669697 1715017
11148 1715017 1749262 1752400 1795596 1844016 1861643 1916371 1997292 2132240 2224934 2263369 2311674
11137 2311674 2473904 2641109 2824034 2994632 3179018 3334641 3526625 3749131 3999479
11128C999479L58062M51471M40786M13842L84761M63761M48764M24139N15284
11119G900349O79567Q81542J049553J072285J182345J315082J560756K097620
11111A7739099K774670L608210M590180O075946Q510674J2507991J8479297K5663200
11103I9949267L0270792K6286078J1972443o341645k1509037k8334555k6195460
11096H6097883k0205991j4161156r543603o302556m024251k338970j140164o74519
11088B7706673p25981r70154j240854j001545m42150J63141O94816J151343J393518
11079B6728807J686998K225687L055298M284110N832424P858243J0787779J5479172
11071G7938518K3083114L4027719M5613891N1432493M6501681K7658909k464737
$$ plain form
11128 3999479 4357541 4809012 5249798 5663640 6048401 6512162 6960926 7385065 7900349
11119 7900349 8579916 9461458 10511011 11583296 12765641 14080723 15641479 17739099
11111 17739099 20513769 24121979 28712159 34788105 43298779 55806770 74286067 99949267
11103 99949267 130220059 156506137 168478580 162136935 140627898 112293343 86097883
11096 86097883 65891892 51730736 42187133 35884577 31860326 29521356 28381192 27706673
11088 27706673 26980692 26010538 24769684 23768139 23325989 23489130 24183946 25335289 26728807
11079 26728807 28415805 30641492 33696790 37980900 43813324 51671567 62459346 77938518
11071 77938518 101021632 135049351 180663242 232095735 278597416 306256325 303791588
11064C03791588l0965413m8539743n2425333m4638775l2727363k2531308j5284034
11057E6679619j0434453p326006n241404l713432k629830j897886j433965j131100
11049B2871543p86623l03422K25526P79889J046555Q83433N54114L35703O39365
11040B6246083J488801K711864M111900O004461Q820232J3270306J9365682K5314842
11032A07334171K6585856J8456628K662096j3814034k4941521k7360182k3206835
11025F5716179j7065111j1847990q128156n692650m037768k942210k194511j687742
11017A2120041j331796j050668r37609q81600q25939p81184o51093n80795m71975
11008D607382m43964l22990l33510l00402j92529j52229j54493j48282j60061
$$ plain form
11064 303791588 272826175 224286432 171861099 127222324 94494961 71963653 56679619
11057 56679619 46245166 38919160 33677756 29964324 27334494 25436608 24002643 22871543
11049 22871543 22084920 21781498 22007024 22786913 23833468 24716901 25271015 25606718 26246083
11040 26246083 27734884 30446748 34558648 40563109 49383341 62653647 82019329 107334171
11032 107334171 133920027 152376655 155038751 141224717 116283196 88923014 65716179
11025 65716179 48651068 36803078 28674922 22982272 18944504 16002294 13807783 12120041
11017 12120041 10788245 9737577 8799968 7918368 7092429 6311245 5660152 5079357 4607382
11008 4607382 4163418 3840428 3506918 3206516 3013987 2861758 2707265 2558983 2398922
10999B398922j10336j10095n5263l7814m6046r0037j2441q0692j02571m7816m2991
10988A662820l3378n9026q0220r7852p33l4341m7180R225o957j095m0963J6097
10976A286397R2090j2283o1320p6030l9362N375q177j836k8574k8938p15Q962
10964A135589k4632j4644O4340M8525n414j2465R975p529j4255l4918l4443j6933
10952A093196K752L346K7561k3499j3636L2778L616j3463M4928O7935j2398j3201
10940A199915Q845N2407l3721o8672K876m9849k0646k6531M883j4917n5255K8821
10928A028156O4355j2986n9663l2021P253q183j5073K8925J01852P9048M6751
10917A228414K3404J1747N6002j602o764n3115m9530M2510n9820j15186o2609
$$ plain form
10999 2398922 2288586 2178491 2123228 2085414 2039368 1949331 1936890 1856198 1753627 1705811 1662820
10988 1662820 1629442 1570416 1490196 1392344 1391611 1357270 1310090 1319315 1312358 1311263 1270300 1286397
10976 1286397 1378487 1366204 1304884 1228854 1189492 1194867 1186690 1184854 1156280 1127342 1126627 1135589
10964 1135589 1110957 1096313 1160653 1209178 1203764 1191299 1201274 1193745 1179490 1144572 1110129 1093196
10952 1093196 1095948 1099294 1126855 1103356 1089720 1122498 1126114 1112651 1157579 1225514 1213116 1199915
10940 1199915 1208760 1261167 1227446 1158774 1161650 1111801 1091155 1064624 1069507 1054590 999335 1028156
10928 1028156 1092511 1079525 1019862 987841 995094 986911 971838 1000763 1102615 1181663 1228414
10917 1228414 1251818 1263565 1319567 1317965 1311201 1258086 1208556 1251066 1191246 1076060 1013451
10906A013451J6245R906k832j6958m8825l7411l8373j4730N849l4642o0766K5804
10894H16718M663q490l5737K0253N3437l4179k059k0514K74K9741N7828M9707
10882I31642M2787R5624L8888J3181n942L0380m5137r6596n1043Q943k6351j9424
10870I16952m3047k4543L3672l7633m1130j4894J969J1858L8600K3651k6428m3504
10858G95523l1298N969J8113M494O0842M8271J7642M0717K4272N4918J7517M0845
10846A097825N0999K2358N4718k0600M478K4554M7125O1700K909K9144J02200
10835A477410P9829J13055O7229J0521j5189k0166L66k0550j7707J4902N7166
10824A746866L4797K4113R6960N7102R6987R6520N973j02330m0825K3492L9613
$$ plain form
10906 1013451 1029696 1039602 1036770 1019812 970987 933576 895203 880473 886322 851680 790914 816718
10894 816718 821381 812891 777154 797407 850844 816665 814606 794092 794366 824107 881935 931642
10882 931642 974429 1070053 1108941 1122122 1116180 1146560 1101423 1004827 953784 962727 936376 916952
10870 916952 873905 849362 883034 845401 804271 789377 791346 803204 841804 865455 839027 795523
10858 795523 764225 770194 788307 792801 853643 901914 919556 960273 984545 1039463 1056980 1097825
10846 1097825 1148824 1171182 1225900 1205300 1209778 1234332 1281457 1343157 1346066 1375210 1477410
10835 1477410 1557239 1670294 1737523 1748044 1732855 1712689 1713055 1692505 1674798 1689700 1746866
10824 1746866 1781663 1805776 1902736 1959838 2056825 2153345 2159318 2056988 2016163 2039655 2079268
10813B079268j0485p3630n9464l6716M1996L9304M1409L1271P5530R7867M2368
10802B268718O569j6434j6743j2589q3860k5598J9927L727m2410j5518O0210M0445
10790B186444K6188N3870N2146l718K7698M2771M7860k8626L1508M1522K1383
10779B499046P5196R1411J10277R6639J00685R0141P9566R6758Q2804L5666M7503
10768C405692l029L9967M3477M4652O3022R6796N6322L2834Q6589Q1518J16002
10757D063842R7376R5395J31493J06271J59372J58603J23517J71474J73381K08718
10747E489442K35682J90466K00652K81699K37231K40694K80277L86111L90436
10738G932690L89415M28835M71304M90443N25726O68635P18369P67716Q28938
$$ plain form
10813 2079268 2068783 1995153 1935689 1898973 1940969 1980273 2021682 2052953 2128483 2226350 2268718
10802 2268718 2275287 2258853 2242110 2229521 2145661 2120063 2139990 2143717 2101307 2085789 2145999 2186444
10790 2186444 2212632 2266502 2318648 2314930 2342628 2385399 2433259 2404633 2436141 2477663 2499046
10779 2499046 2574242 2665653 2775930 2872569 2973254 3063395 3142961 3239719 3322523 3358189 3405692
10768 3405692 3402663 3442630 3486107 3530759 3593781 3690577 3746899 3779733 3866322 3947840 4063842
10757 4063842 4161218 4256613 4388106 4494377 4653749 4812352 4935869 5107343 5280724 5489442
10747 5489442 5725124 5915590 6116242 6397941 6635172 6875866 7156143 7542254 7932690
10738 7932690 8322105 8750940 9222244 9712687 10238413 10907048 11625417 12393133 13222071
10729A3222071Q67965R77007J144795J343664J503680J756383K027194K267079
10721B5109838K539143K881330L437322M173933M967651N913301P311887Q994291
10713F5328696J1114332J3729312J6946900K0655022K4165519K6221625K5227066
10706B03388472J9898583J0513579p59775j1097785j8184701k1180308k0718568
10699A61859497j8103764j4372140j0412003o550712k990164L90367L655997O547466
10691A20024544Q889649J0255493J0228574Q735808O096286L116827R24686L50166
10683A68622033J575265M418696Q183678J1981574J5035811J6417621J5344056
10676B41578734J1280526M739190k905360r863798j4715412j6594705j5787199
$$ plain form
10729 13222071 14090036 15067043 16211838 17555502 19059182 20815565 22842759 25109838
10721 25109838 27648981 30530311 33967633 38141566 43109217 49022518 56334405 65328696
10713 65328696 76443028 90172340 107119240 127774262 151939781 178161406 203388472
10706 203388472 223287055 233800634 233040859 221943074 203758373 182578065 161859497
10699 161859497 143755733 129383593 118971590 112420878 109430714 109821081 113477078 120024544
10691 120024544 128914193 139169686 149398260 158134068 164230354 167347181 168271867 168622033
10683 168622033 170197298 174615994 182799672 194781246 209817057 226234678 241578734
10676 241578734 252859260 257598450 254693090 244829292 230113880 213519175 197731976
10669A97731976j2995681r255984n557700k878006j818269k421792m326276o742573
10661A51735695q734091r777449r681929q344486o217747l544148p02782K366060
10653A07099123N442409Q665879J1898190J4797403J6863699J7182866J4743999
10646A96693568R074058P95817q313458j5978661k0738130k2280416k1253430
10639A17999348j8745600j5806389j3004165j0588682q522391o799757n509377
10632C9022987m479436l707189l117721k613954k282268j933017j581985j453752
10624A7853665j353702j198643j147579j113010r76256q86529q27131o69600n03718
10615I177497m37371m39190l12519j71674j40824j36985j05189p8099j40508k20059
$$ plain form
10669 197731976 184736295 175480311 169922611 167044605 165226336 162804544 158478268 151735695
10661 151735695 143001604 133224155 123542226 115197740 108979993 105435845 104733063 107099123
10653 107099123 112541532 121207411 133105601 147903004 164766703 181949569 196693568
10646 196693568 205767626 206563443 198249985 182271324 161533194 139252778 117999348
10639 117999348 99253748 83447359 70443194 59854512 51332121 44532364 39022987
10632 39022987 34543551 30836362 27718641 25104687 22822419 20889402 19307417 17853665
10624 17853665 16499963 15301320 14153741 13040731 12064475 11177946 10350815 9681215 9177497
10615 9177497 8740126 8300936 7988417 7816743 7675919 7538934 7433745 7355646 7215138 6995079
10605F995079j96923j53663r3304r0982j27165j93135k98558k48856j99900j52677
10595E239916p6696j3405M7831Q3631J7999k2443q8093k03168k22360k03598j50096
10584D409518j02537j40455j19302o0487K6287k3609p2400J0828M0327k371j9193
10573C946606K068M4090l4212j07237j03698j09276j74239j51601j22658n3108
10563C136735m709o6552l4980k0910n5943j00506j09204k3698q5356m9148p8618
10552B507111n8726J969J8512K4162R3357J06643J31352M7548M1271L5954j7329
10541B931824m0527j02450j39693j31944q8946r2535j31037j08020j27565p5336
10531A893771o3374n4713j25593r8262k6149m2722m6029m709M6962m9431n8660
$$ plain form
10605 6995079 6798156 6644493 6551189 6460207 6333042 6139907 5841349 5592493 5392593 5239916
10595 5239916 5163220 5149815 5197646 5281277 5299276 5276833 5188740 4985572 4763212 4559614 4409518
10584 4409518 4306981 4166526 4047224 3986737 4013024 3989415 3917015 3927843 3968170 3965799 3946606
10573 3946606 3948674 3992764 3958552 3851315 3747617 3638341 3464102 3312501 3189843 3136735
10563 3136735 3132026 3065474 3030494 3009584 2953641 2853135 2743931 2720233 2634877 2585729 2507111
10552 2507111 2448385 2450354 2468866 2493028 2586385 2693028 2824380 2871928 2913199 2949153 2931824
10541 2931824 2891297 2788847 2649154 2517210 2428264 2335729 2204692 2096672 1969107 1893771
10531 1893771 1830397 1775684 1650091 1551829 1525680 1482958 1436929 1432220 1479182 1429751 1371091
10520A371091K9038O197l4081j50291q0466q932m5544m8609j27316p3529k434
10509H35124k4937N0430q083k4807k7134l4544R004l5464r3321k3028l990M107
10497F23357J3564n732k7307l735J3809q145k4962m8787l2735J1898k5196l9779
10485D46250j0665M4448n1439q74J3467J0496k0877n1744M0858n676q94p0702
10473C42648j3167j993n8074m9790l2959k8698j6816l033O774p920N0819O45J5571
10460B04007N0548L8246K9296j3580p835o0819o0163j564P361L1744J4694k1145
10448B10790N412l6086k071Q29j9999j7959K2660K3650k7430j8413K4383n5769
10436A09997l1913J8538k751J6319P5423k8109k0345J8233l1746m259K7511l0623
$$ plain form
10520 1371091 1400129 1406326 1372245 1221954 1141488 1132556 1087012 1038403 911087 837558 835124
10509 835124 810187 860617 852534 827727 800593 766049 775053 739589 646268 623240 619250 623357
10497 623357 636921 631189 603882 600147 613956 605811 580849 532062 499327 511225 486029 446250
10485 446250 435585 480033 428594 427720 441187 451683 430806 379062 419920 414244 413350 342648
10473 342648 329481 327488 269414 219624 186665 157967 141151 138118 144892 136972 187791 188436 204007
10460 204007 254555 292801 322097 308517 300682 239863 179700 178136 185497 217241 231935 210790
10448 210790 216202 180116 178045 178874 158875 140916 163576 187226 159796 141383 165766 109997
10436 109997 78084 96622 93871 110190 185613 157504 137159 155392 123646 119387 146898 116275
10424A16275J3875M3877L0852m087l353j8118J3545j684K2657K2371L4363n0831
10412B19742m7854P9639R3313L1271P9199O4354P179l6643p8840p0467q4388n3903
10400B02602j4657j8458j9304J4071L7935k8158L3944l3969n7639r3523k6840
10389c996Q120O8518O126M502L8454K4497L0206n0008j6336j3679J7219K9332
10377A42955M3925k7010j5326j8858J0336l2721m2205J996N2318K3316k1984R796
10365A26538K3968m1468n4919n3186O082L6290M5324o63l7711n501K7586L4243
10353A06583K160k3869l2201k0562K5488o951M2873J5022K0198j3992l6363p595
10341G0791P097K3723n8562k4180J3121p405l4182j0149L1265q714J5290M598
$$ plain form
10424 116275 130150 174027 204879 200792 197439 179321 192866 191182 213839 236210 270573 219742
10412 219742 171888 251527 344840 376111 455310 519664 526843 490200 411360 340893 256505 202602
10400 202602 187945 169487 150183 164254 202189 174031 207975 174006 116367 22844 -3996
10389 -3996 4124 72642 78768 83270 121724 146221 176427 126419 110083 96404 113623 142955
10377 142955 186880 159870 144544 125686 136022 103301 61096 63092 115410 138726 116742 126538
10365 126538 150506 109038 54119 933 7015 43305 88629 87966 50255 44754 72340 106583
10353 106583 108743 84874 52673 32111 57599 50648 93521 108543 128741 114749 78386 70791
10341 70791 77888 101611 43049 18869 31990 24585 -9597 -19746 11519 2805 18095 22693
10329B2693J8961K25o99m4582N5849L7056o00m8750K0554K3079m8031L0879O6578
10316A33212n948j5597L8906n955L4180k0040p2568p369K8013m9839K120L4841
10304I3956K1872K9094N4565N8693Q3692l4780o0898p075J2518O8628L8370k6824
10292C31811M0565O6625k4309K2974Q9385J32166R3309Q3453Q6520J71216R2851
10281A186566M7555M6732l9309j35037q8604p2961m5132l3329n5623r5588O111
10270G21381n992r828J6779N475N0493P9025Q2887P685J7396l379l62J1299K4869
10257I97728J4733P1254N0778O3588M1597O7948O0317K7437O145q0753j11290
10246A209482p9661k6932j6597m9022k4769p3268p0847L8149L2171m6084n8986
$$ plain form
10329 22693 41654 41879 41180 -3402 52447 89503 88903 40153 60707 83786 35755 66634 133212
10316 133212 127264 111667 150573 144618 178798 158758 86190 78821 106834 56995 59115 93956
10304 93956 115828 144922 199487 258180 341872 307092 246194 239119 251637 320265 358635 331811
10292 331811 372376 439001 414692 437666 527051 659217 752526 835979 922499 1093715 1186566
10281 1186566 1234121 1280853 1241544 1106507 1017903 944942 899810 866481 810858 715270 721381
10270 721381 715389 705561 722340 727815 778308 857333 940220 947905 965301 961922 961560 972859 997728
10257 997728 1012461 1083715 1134493 1198081 1239678 1307626 1367943 1395380 1401525 1320772 1209482
10246 1209482 1129821 1102889 1086292 1037270 1012501 939233 868386 906535 938706 892622 833636
10235H33636p7865n4716P888L883j3959Q591N7526M8259M5793M9093J0850N2622
10223I71601N3450J3725J5337K813m8966q9303o5067o1526r3275j13155j3813
10212E71821m4101m5919l8577p0614j1198J991L74k3742M619K4010P1238l1478
10200D08424j3969R727o8195l1495k89K452O1841K7179L283l6510m9492o208L3128
10187C39876K3450r456p9014k6730q080j6147j0680N0369K4442j1527m2568q2074
10175A51861l2425L153M2886J3773n270r481k406p938P06J1362K1865k3166k5660
10162A39260r360M171J5890m5925J5799J27003M3830l2214k1941J4816L761l781
10150B51309m4723m4857j2000k0368M8615R308N0715j5236m7162r552q10M1674
$$ plain form
10235 833636 755771 701055 708943 712826 698867 707458 764984 813243 859036 908129 918979 971601
10223 971601 1025051 1038776 1054113 1056926 1007960 918657 853590 792064 698789 585634 571821
10212 571821 527720 481801 443224 372610 361412 363403 363777 340035 344654 368664 439902 408424
10200 408424 394455 404182 335987 304492 304203 306655 368496 395675 398958 362448 312956 306748 339876
10187 339876 363326 353870 274856 248126 240046 223899 213219 263588 288030 276503 233935 151861
10175 151861 119436 122589 165475 179248 173978 164497 162091 154153 154859 166221 188086 164920 139260
10162 139260 129900 134071 149961 104036 119835 246838 290668 258454 236513 251329 255090 251309
10150 251309 206586 161729 149729 129361 177976 187284 237999 222763 175601 166049 165239 206913
10138B06913k3679r115j3963Q234J3816k4663j1497k9774J0792L30l5436l286
10126H8672m5373L606J3971K9661L1706J9611J8114L1991R8977J18984O0202P1790
10114E41912R8986Q4638M3908J0767l7915m9521n7938l2014o2637r5038r8743
10103C46405p0228m895k5879m3935k6433k4770J0060j4896m5612k0847k7153j2484
10091C9333O1K9536M8210J0235k5659j3152L9842N6250O91r492K5334O109n93
10078B06705j6884k2132L165J774j872l8406K9536j8244r537J9391K8983Q118
10066A90597o7594P175j171q311r236j4343k3342l3255k0667J8433Q210k7247
10054A9249O0420L8181k5495m7519N4881M9062j3469n4526m1601K1378O901k1434
$$ plain form
10138 206913 183234 174119 160156 168390 182206 157543 146046 116272 127064 127394 91958 88672
10126 88672 43299 46905 60876 90537 122243 141854 159968 191959 290936 409920 470122 541912
10114 541912 640898 725536 769444 780211 742296 692775 634837 602823 540186 445148 346405
10103 346405 276177 271282 245403 201468 175035 150265 160325 145429 99817 78970 51817 39333
10091 39333 39394 68930 117140 127375 101716 88564 128406 184656 185347 175855 201189 207298 206705
10078 206705 189821 167689 170854 172628 170756 132350 161886 143642 134105 153496 182479 190597
10066 190597 123003 130178 129007 120696 111460 97117 73775 40520 19853 38286 46496 19249
10054 19249 79669 117850 92355 44836 99717 148779 135310 80784 39183 60561 67462 46028
10042D6028k3505n044J5364j4290J5849N9260K8567j0095k72m8074K0542L1054
10030A15384k22j9268n139K0641l6913j4971o095K9359K0830k0484J6894M4655
10018A44671J2694m5949j6301K1929N1187K4788j717J6372N094L1124k2888o1444
10006A59560p5345k0259M1744M0820K4423R908j5676j8033K6208m4068J1068P6658
9994B17008l5149j0338m6663k7420K3142P182n254K6738k61k7619J7785J7499
9982A56650n2577L630r160J9813J3290j9289J2011N5700m3388j2697K8022M1736
9970A93741O0439K565k2599J1904j7458k7069j0738j8510o0339m8828M5022K1518
9958A29648L7972M912l0566l3045R023o3440m8744M4809M6587M3018l1892k0862
$$ plain form
10042 46028 22523 17479 32843 18553 34402 93662 122229 112134 111862 63788 84330 115384
10030 115384 115162 95894 90755 111396 74483 59512 53417 82776 103606 83122 100016 144671
10018 144671 157365 111416 95115 117044 168231 193019 191302 207674 212768 243892 221004 159560
10006 159560 84215 63956 105700 146520 170943 180851 165175 147142 173350 129282 140350 217008
9994 217008 181859 171521 124858 97438 120580 127762 122508 149246 148985 121366 139151 156650
9982 156650 104073 107703 98543 118356 131646 112357 124368 180068 136680 123983 152005 193741
9970 193741 254180 256745 234146 246050 228592 201523 190785 172275 111936 63108 108130 129648
9958 129648 167620 172532 141966 108921 117944 54504 5760 50569 97156 140174 108282 87420
9946H7420N3477J3393k458O751K5103N47M2868k6834m8800l7249K5129L9002r192
9933A69157p329j1277K4164R9787Q7205L1018K7210P1248P8260L4549j9983k3853
9921E60156K2128M2887N4617J01433J06645P6864m2872q5356r8105j33969p8818
9910E25610l1163L2754J29541L3940j00502j41260j07620l2265L8339j5966m0886
9899B90522l493k9684j7970l2062j3212L0038n915j474L8264j6000q355q464K766
9886B24961K0225k3894J1354L8601j5041k7093J931L7743j4713j735M108k5306
9874B31141o0627o424r01j1637l9997j9915L4551M2779K7942K3419k8732l0135
9862A61464K623r280J6125L9478P460L03k7363M7721L0375J3347r510n3100O1147
$$ plain form
9946 87420 140897 154290 151832 158583 183686 184233 227101 200267 151467 114218 139347 178349 169157
9933 169157 161828 150551 174715 274502 361707 392725 419935 491183 569443 603992 584009 560156
9921 560156 582284 625171 679788 781221 887866 964730 921858 836502 738397 604428 525610
9910 525610 494447 527201 656742 690682 590180 448920 341300 309035 347374 331408 290522
9899 290522 287029 257345 239375 207313 194101 224139 218224 216750 255014 239014 230659 222195 224961
9886 224961 245186 221292 232646 271247 256206 229113 231044 268787 254074 252339 256447 231141
9874 231141 170514 164090 163189 151552 111555 91640 126191 168970 196912 220331 191599 161464
9862 161464 164087 154807 170932 210410 217870 218173 190810 238531 268906 282253 272743 219643 280790
9849B80790l5284k8343j3557M9947j7382j5340p147l8010j0768L1822M6833o104
9837B37457k6960M8087M3276J2664k6204k5520m7927l2099K0251l7660m8859K2059
9825A38565K813K6599M1940Q6153O1051J478n7253l9932J5228J689J4109n1715
9813B40725j2752J8833L9332J43j2773l7070L4703L1586j1419r437l156N7200
9801C35915J11602M7834m9408j1482O110j1295k3435J3702J7446N9094K1853q3723
9789D34213j13423n8135l4142K6621L6658K5345j5902j2588J0885J8627p788K5706
9777C36077N5802L8973K6061Q213L6564O6817j055Q010P344m9080n8052l504l1
9764D72139j143m980n0909j8287j0245O89P964m2752m8582K3570k324o761O8983
$$ plain form
9849 280790 245506 217163 203606 253553 236171 220831 213684 175674 164906 196728 243561 237457
9837 237457 210497 258584 301860 314524 288320 262800 214873 182774 203025 165365 116506 138565
9825 138565 141378 167977 209917 296070 357121 358599 301346 261414 276642 278331 292440 240725
9813 240725 227973 246806 286138 286281 273508 236438 271141 302727 291308 281871 278715 335915
9801 335915 447517 495351 445943 434461 440571 429276 405841 419543 436989 496083 517936 434213
9789 434213 320790 262655 228513 255134 291792 317137 301235 288647 299532 318159 310371 336077
9777 336077 391879 430852 456913 465126 501690 568507 567452 575462 582806 533726 475674 472170 472139
9764 472139 470996 466016 415107 396820 386575 387264 395228 352476 303894 327464 325140 318379 387362
9751C87362L9680L868K0996j0296k6160k2370n3837j9702K3503j4239Q119M7377
9739C84301k5004n0197J2944L3921p342K4986J4890j4202j0022j5288j2184J395
9727C38198Q5395M1934J0759m2872l2150R868O238L064j2553j0912O105J5854
9715D18928l6863j0104r052n6334j3760J445L8767o727o7106Q5483O9122K2835
9703D36634j4254l5745j755K2891o3087J7178j1665n2747j2235L4291J3624L904
9691C37034L0267O5331L5271l180J3063j6485k8167j9611K7464M7491O7496N1821
9679F07795R801k2645o9277K8446P1022m348M9574J22201J37544P9628J30369
9668A140110Q7224Q3029P9119N9150J6951j04741j00539r1467j09170j18883j53770
$$ plain form
9751 387362 427042 430910 451906 441610 415450 393080 339243 319541 343044 328805 336924 384301
9739 384301 359297 309100 322044 355965 348623 373609 388499 374297 364275 348987 336803 338198
9727 338198 423593 465527 476286 433414 401264 411132 417370 420434 407881 396969 403074 418928
9715 418928 382065 371961 362909 306575 292815 294260 333027 326300 259194 344677 413799 436634
9703 436634 422380 386635 384880 407771 344684 361862 350197 297450 285215 319506 333130 337034
9691 337034 367301 432632 467903 464723 477786 461301 433134 413523 440987 488478 555974 607795
9679 607795 617596 594951 525674 554120 625142 620794 670368 792569 930113 1009741 1140110
9668 1140110 1227334 1310363 1389482 1448632 1465583 1360842 1260303 1168836 1059666 940783 787013
9657G87013q1387l7085j5870K4325J7913m4286j398l8731l2514J9890K693N9563
9645F60126M1724o4987j01533j9919K6172J5041L0550j2053L4389J9002K8223
9634F56735m7612l9345J3837K2707K093K4046k557k4151L6542J995M327J7056
9622F65673J7248K7353J8879l3659J3078k2552l9948j57m3415P402J4344O6279
9610F90525j0474p2271N568J09690J3904j9656j6197N0069M0161k944l8018n6404
9598F93953n3370J2191P2520J7722K2542K5256m895J7814J5372k7880N2484M2933
9586H86642l2887k8548Q283k5143j4994k8665k7851J4301j0281M4033j9487J442
9574G66845l0958N3791P7536J13699L7167m8110o9577m2561q719J8382j0829L2269
$$ plain form
9657 787013 705626 668541 652671 676996 694909 650623 649225 610494 577980 597870 600563 660126
9645 660126 701850 636863 535330 515411 541583 556624 587174 575121 609510 628512 656735
9634 656735 609123 569778 583615 606322 608415 632461 629904 605753 642295 644290 648617 665673
9622 665673 682921 710274 729153 695494 708572 686020 646072 645915 602500 609902 624246 690525
9610 690525 680051 607780 613348 723038 736942 717286 701089 751158 791319 788375 750357 693953
9598 693953 640583 652774 725294 743016 765558 790814 785919 803733 819105 791225 843709 886642
9586 886642 853755 825207 833490 808347 793353 764688 736837 751138 740857 784890 765403 766845
9574 766845 735887 789678 867214 980913 1018080 969970 900393 857832 849113 867495 856666 888935
9562H88935J8919L0536j8637L495O0175J2907K1376o182j7313p131K6991N4137
9550A068208k708k2480k1660n650J9682m5043r314p249J8240j3789K7191K2899
9538A028327k1978l9182p265L7478M9569l5837j613M6756O8890p306J4087L0472
9526A162398j3988K676O1084J4171N8061l0492o0061j4091K849k0568M2303M0213
9514A244555L7272J59l3857K868O3057o720j5975J3440Q49k315q039J2062K1647
9501A329003K6250M651j8587M1986Q0532N4886j7572L1488j5343l1629q2737m9410
9489A353518N2454O3815L0065k2565N8164O7150k5458k6812K449N8434O2379k0842
9477A652751m5454j4996J0328N1960K0953j1339K1025J9018K2254K1509j5485
$$ plain form
9562 888935 907854 938390 919753 923248 983423 996330 1017706 1011524 994211 987080 1014071 1068208
9550 1068208 1065500 1043020 1021360 1015710 1035392 990349 981035 973786 992026 978237 1005428 1028327
9538 1028327 1006349 967167 959902 997380 1046949 1011112 1009499 1056255 1125145 1117839 1131926 1162398
9526 1162398 1148410 1151086 1212170 1226341 1284402 1253910 1193849 1179758 1182607 1162039 1204342 1244555
9514 1244555 1281827 1281986 1248129 1250997 1314054 1307334 1291359 1304799 1305648 1303333 1295294 1307356 1329003
9501 1329003 1355253 1359904 1341317 1383303 1463835 1518721 1501149 1532637 1517294 1485665 1402928 1353518
9489 1353518 1405972 1469787 1499852 1477287 1535451 1602601 1577143 1550331 1552780 1611214 1673593 1652751
9477 1652751 1607297 1592301 1602629 1654589 1675542 1664203 1685228 1704246 1726500 1748009 1732524
9466A732524j8757J2390Q3242L5202J4497J1697j1377R386j3665j998j7595N0249
9454A885795Q341k6855J5251O5491r279R318O0572R1519K2666j15J7801R594o6309
9441B083790J0341M5410M5471J0723k7499J4003R9875Q0591O6622j3578m5870
9430B369879L4459P6311J3989N66n0765l1639K012J4019j6760M4607P2939J3784
9418B543401M4066P839j997P0661M9939k4709L2957J5694J5469L2385J0239J9071
9406B815015O0723O227Q7760N0717J4462M53N31P4104J04127N3780m434L4313
9394C297778N0888N5266Q5725J2736l252L9844L3430M0826K7588M960Q2501K1630
9382C749920J5309M5954P9318P4713L3635l275O4353K7115N1200O7184N1485M9985
$$ plain form
9466 1732524 1713767 1726157 1809399 1844601 1859098 1870795 1859418 1868804 1855139 1853141 1835546 1885795
9454 1885795 1894136 1867281 1882532 1948023 1938744 1948062 2008634 2100153 2122819 2122704 2140505 2150099 2083790
9441 2083790 2094131 2139541 2185012 2195735 2168236 2182239 2282114 2362705 2429327 2415749 2369879
9430 2369879 2404338 2480649 2494638 2495204 2444439 2412800 2414812 2428831 2412071 2456678 2529617 2543401
9418 2543401 2587467 2595306 2593309 2663970 2713909 2689200 2722157 2737851 2753320 2785705 2795944 2815015
9406 2815015 2875738 2881965 2969725 3020442 3034904 3035357 3035888 3109992 3214119 3267899 3263465 3297778
9394 3297778 3348666 3403932 3489657 3502393 3499141 3538985 3572415 3613241 3640829 3645789 3728290 3749920
9382 3749920 3765229 3811183 3890501 3965214 3998849 3995574 4059927 4087042 4138242 4205426 4256911 4306896
9370D306896P7357O0475N9626P6022L853M1543P1382P6025O3024R4667M9305M8040
9358E028215R4686P0243N4389P5799P8549P0370J25678Q6286M3655L1770J12054
9347E871694Q6264K8235L5638R6275J29374P5774R1694R1328J27709P7807J13399
9336F825191J04416Q0970L9184Q9702R1205Q0487J70533K29003J15715J12314
9326G938720J34020J87422J65443J06593J98031K32602J01994O7577J48716J79965
9316I461083J65116J04347J24848J82199K03422K23231K43821J71072K27950K15709
9306A1322798J93183K85122K46484K30992K76930K38909K65750K40636K66251
9297A3567055L15459K73426K52817K50667L11003L08951L31728L73366L67584
$$ plain form
9370 4306896 4384253 4444728 4504354 4580376 4584229 4625772 4697154 4773179 4836203 4930870 4980175 5028215
9358 5028215 5122901 5193144 5247533 5323332 5401881 5472251 5597929 5684215 5727870 5759640 5871694
9347 5871694 5957958 5986193 6021831 6118106 6247480 6323254 6414948 6506276 6633985 6711792 6825191
9336 6825191 6929607 7010577 7049761 7139463 7230668 7311155 7481688 7710691 7826406 7938720
9326 7938720 8072740 8260162 8425605 8532198 8730229 8962831 9064825 9132402 9281118 9461083
9316 9461083 9626199 9730546 9855394 10037593 10241015 10464246 10708067 10879139 11107089 11322798
9306 11322798 11515981 11801103 12047587 12278579 12555509 12794418 13060168 13300804 13567055
9297 13567055 13882514 14155940 14408757 14659424 14970427 15279378 15611106 15984472 16352056
9288A6352056L70267M20215L91148L87909M05313L77171M23367M68756M90399
9279B0086601M91413N04642N73497N33028N01474N33429N89845N42354N90402
9270B4946685N82330N90332O52375O45933P14243P32275P45888Q20147Q14733
9261C1244941P94234Q24524Q56646Q76073Q23453Q44818Q97006R29538R73558
9252C9064791R44099R08758R78639R98150J007776J050978J046314J058160J094107
9243D8151772J105222J121724J150347J091220R67268R40180R18218Q53968P62733
9234E7062652P82035P85964P58754O92361O50338N94338N21726M85684L62074
9225F2695926K75005L35548J78106P813p3475j8518j51527k88300l50545m14938
$$ plain form
9288 16352056 16722323 17142538 17533686 17921595 18326908 18704079 19127446 19596202 20086601
9279 20086601 20578014 21082656 21656153 22189181 22690655 23224084 23813929 24356283 24946685
9270 24946685 25529015 26119347 26771722 27417655 28131898 28864173 29610061 30430208 31244941
9261 31244941 32039175 32863699 33720345 34596418 35419871 36264689 37161695 38091233 39064791
9252 39064791 40008890 40917648 41896287 42894437 43902213 44953191 45999505 47057665 48151772
9243 48151772 49256994 50378718 51529065 52620285 53587553 54527733 55445951 56299919 57062652
9234 57062652 57844687 58630651 59389405 60081766 60732104 61326442 61848168 62333852 62695926
9225 62695926 62970931 63306479 63484585 63492398 63418923 63400405 63248878 62960578 62610033 62195095
9215F2195095m41528n47522o37149p14735p41468p28744p89056q91872r59074
9206E5743947r58633r47595r82858j028796j055549j076275j022187j045071j109297
9197D6517686j077881j052347j090171j072774j026728j093137r51932r06632
9189C8246084r50237r53209q91747r28911r07672q30190q34032q51674p71277
9180C0327135p39269p72081p84432o79729o64742o70878o53976n87967n97638
9171B4176423o58695n66853n74183n92417n53948m87565m61409m57227n38679
9162A9285447m93569m36350l66078m37107m00358l72349l46633l24333l52710
9153A5755960l20921l60574l40547l26956l45875l34843l35266k99346k91814
$$ plain form
9215 62195095 61753567 61206045 60568896 59854161 59112693 58383949 57594893 56703021 55743947
9206 55743947 54785314 53837719 52854861 51826065 50770516 49694241 48672054 47626983 46517686
9197 46517686 45439805 44387458 43297287 42224513 41197785 40104648 39152716 38246084
9189 38246084 37295847 36342638 35450891 34521980 33614308 32784118 31950086 31098412 30327135
9180 30327135 29587866 28815785 28031353 27351624 26686882 26016004 25362028 24774061 24176423
9171 24176423 23517728 22950875 22376692 21784275 21230327 20742762 20281353 19824126 19285447
9162 19285447 18791878 18355528 17989450 17552343 17151985 16779636 16433003 16108670 15755960
9153 15755960 15435039 15074465 14733918 14406962 14061087 13726244 13390978 13091632 12799818
9144A2799818k73215k24903k50371k58856k03891k12441k00127k28229k01912
9135A0745873k11463j95640j89606k07580k55866k20079j22524j48912j35073
9126I059130j67508j65831j57561j41530j56250j32168j18019j23971j35406j30336
9116G630550j33544j35714j04257r6574j33148j12973r9489q3978r1350j51826
9106F487697j50442m4153j10429j38675r5983p9724p7687j26576q7390n8235q2260
9095E436143o0452k5576j01841j38488j31283n4895o5203n9940p9322p2067p8656
9084D568420m1815k3216r814p5436j10551k8850j5381k58j03135j10160m3562
9073D006242o0775o7759j9880p0989p1017m2063o2380j181n6262m7302o8682k3620
$$ plain form
9144 12799818 12526603 12301700 12051329 11792473 11588582 11376141 11176014 10947785 10745873
9135 10745873 10534410 10338770 10149164 9941584 9685718 9465639 9343115 9194203 9059130
9126 9059130 8891622 8725791 8568230 8426700 8270450 8138282 8020263 7896292 7760886 7630550
9116 7630550 7497006 7361292 7257035 7160461 7027313 6914340 6814851 6730873 6639523 6487697
9106 6487697 6337255 6293102 6182673 6043998 5948015 5868291 5790604 5664028 5576638 5518403 5436143
9095 5436143 5375691 5350115 5248274 5109786 4978503 4923608 4858405 4798465 4719143 4647076 4568420
9084 4568420 4526605 4503389 4493575 4418139 4307588 4278738 4263357 4263099 4159964 4049804 4006242
9073 4006242 3945467 3877708 3857828 3786839 3715822 3673759 3611379 3610198 3553936 3506634 3437952 3414332
9061C414332m7583o7969l4710k68m7997k6790l7020j8407j5536k2774r3173n9387
9049B942718l4498r3177l3541m5718P025J2940p252k0324j6896O489j5725k2737
9037B679304o2020j04294m6153k3777m8818m1547N584J561k1437l2924J3562l2840
9025B286201j280K046m9654q4952j26386j216n3770m8734j3219j9822j0914K5896
9013A904196k624l4130o951N006k8384k2283N1873j2010o8280l9289J2674Q430
9001A768228J14j8875p7054m1726K2440l3677q0639K214K9178Q79o2112l6768
8989A472202M6K9449N0281J9763j3642o2097m0956n0644l4392j874N9537Q4105
8977A511778j3817r5532j0140k9128p9509j4472L4341P950j5576j0564J8871k8511
$$ plain form
9061 3414332 3366749 3298780 3264070 3263802 3215805 3189015 3151995 3133588 3118052 3095278 3002105 2942718
9049 2942718 2908220 2815043 2781502 2735784 2742809 2755749 2748497 2728173 2711277 2717766 2702041 2679304
9037 2679304 2617284 2512990 2466837 2443060 2394242 2352695 2358279 2359840 2338403 2305479 2319041 2286201
9025 2286201 2284921 2286967 2237313 2152361 2025975 2024759 1970989 1922255 1909036 1889214 1878300 1904196
9013 1904196 1901572 1867442 1860491 1865497 1837113 1814830 1866703 1854693 1786413 1747124 1759798 1768228
9001 1768228 1768342 1749467 1672413 1630687 1653127 1619450 1538811 1541025 1570203 1571082 1508970 1472202
8989 1472202 1472248 1501697 1551978 1571741 1558099 1496002 1455046 1404402 1370010 1368136 1427673 1511778
8977 1511778 1497961 1402429 1392289 1363161 1283652 1269180 1303521 1311471 1295895 1285331 1304202 1275691
8965A275691q3672m1032K3610n487J9260K262n770o093k9676k7004r663l04J5286
8952A127408j1080m855k8584l5849o2851L3135L6462M9320j9902l59m2449n2110
8940I88286n2882N690J2726M027J1149K284j4593k8138m2566n488j8237M5125
8928I07383P087n3618m889J5788O1802l6409m1228m0644K5602j9040m2321k6903
8916G52610K4219p366K0193k158j5544k2209N157O6563J9399J3072q840M3628
8904H88724k0390r7502j07099J8909M6536N8073N318n8938k5586J8595L85P200
8892G34225m445n518L7848o483m0456m3986l9402o374j3690o07J4421l234m893
8879F17406K5419q60k1070N415P623j4599l7205l4134l1060M1644P5858N5767
$$ plain form
8965 1275691 1192019 1150987 1174597 1169110 1188370 1190632 1184862 1178769 1149093 1122089 1112426 1112122 1127408
8952 1127408 1116328 1111473 1082889 1047040 984189 1017324 1053786 1103106 1083204 1082845 1040396 988286
8940 988286 935404 941094 953820 957847 968996 971280 956687 928549 885983 880495 862258 907383
8928 907383 914470 860852 855963 871751 933553 897144 855916 815272 840874 821834 779513 752610
8916 752610 776829 769463 789656 787498 771954 749745 754902 821465 840864 853936 845096 888724
8904 888724 868334 770832 663733 682642 729178 787251 792569 733631 708045 726640 727025 734225
8892 734225 729780 724262 762110 755627 715171 671185 631783 625409 611719 611112 625533 622299 617406
8879 617406 642825 641965 620895 626310 633933 619334 582129 547995 516935 558579 634437 690204
8867F90204K0316L8162k5753J284k1659j8708L5138P1794M0363j3673Q983l2086
8855G94365n3774n4912p5108m0623n2133j2951j9169K7738K4432k2908l041M0538
8843E52454O7546m029k7927k8232l4714l9605N2908L9041o9681n3089N736Q3566
8831E43974M2157m3007k2360q743R046k5779J9056J5938J4425j6232N7308L841
8819E89624p30L2830M6323Q6888M0900J7871m3416r5835m5254j16880k1557L0963
8807E21727l5890l5710L1658j9182J8473k1981j4352N3861M1461l4246o0128l2752
8795D12939j4260N800k0017N3413K7031O3791P96n2560k8070k4638O374o3717
8783C66882n3581l1528O1901L2339p355K2777N2177m6230J5849K3759O026o9620
$$ plain form
8867 690204 710520 748682 722929 724213 702554 683846 718984 790778 831141 817468 826451 794365
8855 794365 740591 685679 610571 569948 517815 504864 485695 513433 537865 514957 511916 552454
8843 552454 620000 615971 588044 559812 525098 485493 538401 577442 507761 454672 460408 543974
8831 543974 586131 543124 520764 512021 521067 495288 514344 530282 544707 528475 585783 589624
8819 589624 588894 621724 668047 754935 795835 813706 770290 674455 629201 512321 490764 521727
8807 521727 485837 450127 481785 462603 481076 459095 444743 498604 540065 505819 445691 412939
8795 412939 398679 404479 384462 437875 464906 528697 529493 476933 448863 424225 430599 366882
8783 366882 313301 281773 343674 376013 368658 391435 443612 397382 413231 436990 443016 373396
8771C73396k7605K2111M477j0801m1329j3510K8733k251K4659j6716q008j6806
8759C16350m4369m0337M0049K8397j4256j4597j8277l7277P4056L5969L3985j4009
8747C45684J8961l5635q2743n5499L4454R1712N1039l9267n2189l7928j4918K6240
8735B49911J0811m7094m8553K575N1235O0673O8402l5721k4817K1295k3918j9159
8723B65640Q496j261O8968l2655M136J2380j4455J5602j3704J300k3239K4468
8711C15676r007n7955l2155j8984k4887k4598K3311O4761L9938L9804k7686l7941
8699B50277l6754j5752p072J1241K5044J7527j3068L035k8651k3339J0576K0663
8687B13727K70P837l1846j7741N060L8951N7148k7167k9836m2841q837R260J3822
$$ plain form
8771 373396 345791 367902 372379 361578 320249 306739 335472 333221 357880 341164 333156 316350
8759 316350 271981 231644 271693 300090 285834 271237 252960 215683 289739 325708 359693 345684
8747 345684 364645 329010 246267 190768 225222 316934 367973 328706 276517 238589 223671 249911
8735 249911 260722 213628 165075 167650 218885 279558 347960 312239 287422 308717 284799 265640
8723 265640 274136 272875 341843 309188 313324 325704 311249 326851 313147 314447 291208 315676
8711 315676 306669 248714 216559 197575 172688 148090 171401 236162 276100 315904 288218 250277
8699 250277 213523 197771 190699 201940 226984 244511 231443 234478 205827 182488 193064 213727
8687 213727 213997 221834 189988 172247 177307 216258 273406 246239 216403 173562 164725 173985 187807
8674A87807M4556j6562Q709q775j2191j981J0154l180J2458L7073P9596L062l9094
8661C01632l1810l6958r0119k3401R281R889q801N1060L21L7752J4967j1542l9547
8648A82724o5642J8009P0458M7340K2234J4732p9654j0623M9971r0843l2526P6030
8636B02210P3363j2924M3365K6727n54n3367n0126k5780o9134k0734N069m1501
8624G6614J9846M0500K6665n810O6878M5873J2005l6328m1319M1272o355m2229
8612A97612j9918l3727L9877L4297l4074k0287J0679L1517R662l9936N0227M5893
8600B71822J0955P5998j7023o4849K1775j8556l0005N9596N2617R430l0698K2946
8588C64008L6323m7171j5176k9827j2821k4359k1558l2814N326m1086l9640M1041
$$ plain form
8674 187807 232363 215801 224510 215735 203544 201563 211717 208537 220995 258068 337664 340726 301632
8661 301632 269822 232864 142745 119344 128625 138514 129713 180773 181094 218846 233813 222271 182724
8648 182724 117082 135091 205549 252889 275123 289855 210201 199578 249549 158706 126180 202210
8636 202210 275573 262649 306014 332741 332187 278820 228694 202914 133780 113046 118115 76614
8624 76614 96460 136960 163625 157815 224693 270566 282571 246243 204924 246196 239841 197612
8612 197612 177694 143967 183844 218141 184067 163780 174459 205976 215638 175702 225929 271822
8600 271822 282777 358775 341752 276903 298678 280122 250117 309713 362330 371760 341062 364008
8588 364008 400331 353160 337984 308157 295336 270977 249419 216605 221931 180845 141205 182246
8576A82246K0123M632l3820k9977K072K1687m5149J4739M5212j6272M7644N1148
8564B64285j6150k9441k5377J3871J0048K9186J8760l9997O958j6494m5787L2349
8552B02211K43q060k6517l6217l8229k1660k8087m251K6976N2087K4788m3344
8540I9940k9939m2909n788m521M0133K0223J0071j612L298M4082m4643K9896N0695
8527A68926m2301m4230k6714m022J1815K0375K3175Q184q927n1372N560L0532
8515I1001J3938P059j7312N917l2154O428o808k0669K5633L2074R562L694l3571
8502H4792j5165K6247J6755L1737j0747n8637o71k2345o826j4107k1765q675K5757
8489B6350j622O3223N8859o4654J5766L6963l1808j0053p903L1725K3538J3384
$$ plain form
8576 182246 202369 207001 173181 143204 145276 166963 121814 136553 181765 165493 213137 264285
8564 264285 248135 218694 193317 207188 217236 246422 265182 225185 232143 215649 169862 202211
8552 202211 202454 194394 167877 131660 93431 71771 43684 39433 66409 118496 143284 99940
8540 99940 70001 27092 21304 16783 56916 77139 87210 85598 88896 132978 88335 118231 168926
8527 168926 126625 82395 55681 51659 63474 83849 107024 115208 106281 54909 60469 91001
8515 91001 104939 111998 94686 100603 68449 74877 68069 47400 73033 105107 114669 118363 84792
8502 84792 69627 95874 112629 144366 133619 74982 74311 51966 45140 31033 9268 593 26350
8489 26350 24728 87951 146810 82156 97922 134885 103077 93024 85121 116846 140384 153768
8477A53768l5374k3186l5028J104N5143m049l249k2093K4077j0654k6714L4246
8465A07991J0267K15j9174p772o0273p730M1460P9471K8847l142K7647n4772o906
8452A36129k9135l0497L2000J5101k997J5307K5944n106j08215N213k114P714
8440E9344o9359n9474O49O2743O0506K5696j0752n8783J4845O3249N5069q001
8428A35732J8686m1176j5018M0888N9444Q109P6776l037K571L1479l3142j1881
8416B69431o0408p2758k205l8284l0432j4758L1216J0427J1375M642L5126m3913
8404I9459j7299J2054J0247K5860l5004n1274j5248j1348p952J9148J8329j248
8392D5724O2953K5582L705j4286m1669P899K7791n1103m8017N0624P5856j4374
$$ plain form
8477 153768 118394 95208 60180 61284 116427 112378 109129 87036 111113 100459 73745 107991
8465 107991 118258 118473 99299 91527 31254 23524 64984 144455 173302 170160 197807 143035 136129
8452 136129 106994 76497 108497 123598 120601 135908 161852 156746 48531 53744 51630 59344
8440 59344 -10015 -69489 -68840 -6097 54409 80105 69353 10570 25415 88664 143733 135732
8428 135732 154418 113242 98224 139112 198556 206665 283441 280404 282975 314454 281312 269431
8416 269431 209023 136265 134060 95776 65344 50586 81802 92229 103604 108246 143372 99459
8404 99459 82160 94214 104461 130321 95317 44043 28795 17447 9495 28643 46972 45724
8392 45724 108677 134259 137964 123678 82009 89908 117699 66596 18579 69203 145059 130685
8380A30685l8669Q793Q4287M9787P7225P1904J6876K161o5381q1952l6282k8018
8368A91416o7950o6821K8570O941l0880k4930J6548K4061r925k300j4891J9942
8356F9781J6467p970p285k5663Q493J1258j0135l6078j9288M526K8896Q077K4332
8343F5411j4747R607K8609L5568p577o441N4352P8019M7074O9518J11991R7850
8331E69234K0833n8895r7324m6688j10425j39643K9486J6831J1651n1274l8779
8320A05007N767J2460o856m7266N016K2464K4886N0205m436k9214k4931l550L48
8307A09900J2211r423j988k7486k2174j7576L6973K5135L9858L8010o7047N9691
8295A76084R8494J3978J7480J01836k3291q6044o4286n0964p2576m6579j008l6789
$$ plain form
8380 130685 92016 100809 185096 234883 312108 384012 400888 403049 337668 255716 219434 191416
8368 191416 123466 56645 85215 92156 61276 36346 52894 76955 67030 64730 49839 69781
8356 69781 86248 78278 70993 45330 53823 65081 54946 18868 -420 4106 33002 41079 65411
8343 65411 50664 60271 88880 124448 116871 110430 164782 242801 289875 359393 471384 569234
8331 569234 590067 531172 433848 387160 276735 137092 166578 183409 195060 143786 105007
8320 105007 110774 123234 116378 69112 74128 96592 121478 171683 167247 138033 113102 109552 109900
8307 109900 122111 112688 110700 83214 61040 43464 80437 105572 145430 183440 116393 176084
8295 176084 274578 288556 306036 407872 384581 298537 234251 183287 110711 64132 63124 26335
8283B6335q572M5820n893l5269k0635J3777k3563m3556K5938N6052K4479j5650
8271C9263j2413K1365K1957m6315n2193r854J7540J6719R195J1474l598p990q980
8258c830J7968J144j0545L8023K1020J1244k8202j2905r331l0365M684M6308k4439
8245B0774k5758N630L305K0936r859k2881J1533K9414M3114j9643k4813o5770
8233c4018l0455J9538L1065M505o9O698L0321j4152p0225J6914O837O8126J6076
8220E1161m2315j7242n1125J7032J7603l982L5933p343Q490J1781L316J8722l4985
8207G046k0538k7713o015k783J04484Q9091o510q9985p356j7350M05M4283o165
8194F0894M7209l6715Q156J8792l0501k8188q25k9904j8246L2352J9138l388j2637
$$ plain form
8283 26335 17763 63583 57690 22421 1786 15563 -8000 -51556 -25618 30434 54913 39263
8271 39263 26850 48215 70172 23857 -28336 -38190 -20650 -3931 5264 16738 13140 5150 -3830
8258 -3830 14138 15282 4737 42760 63780 75024 46822 33917 24586 -5779 -1095 45213 20774
8245 20774 -4984 646 3951 24887 15028 -7853 3680 33094 76208 56565 31752 -34018
8233 -34018 -64473 -44935 -13870 -9365 -9434 -2736 27585 13433 -56792 -39878 -33041 35085 51161
8220 51161 8846 -8396 -59521 -42489 -24886 -28868 7065 -278 8212 19993 23309 42031 7046
8207 7046 -13492 -41205 -47220 -50003 54481 143572 137062 47077 39721 22371 22776 67059 60894
8194 60894 108103 71388 79544 98336 67835 39647 38822 8918 -9328 23024 42162 38774 26137
8181B6137K3010m8362p5706k027Q027J8437L1120K3919j3653L4237J2352q9558
8169e2067M3434L1380j4195j3026M1527j1680n8884Q190n598q344l2855J10012
8157C7894R6266L1149p8434r6174l2752J6956K350J4630j7678k0398K747l1169
8145g4613j3124J09225K3614j8908m1958l4671l287l003j5156K0885n861J6081
8133d0776j3157m254P637J9811J642L4445q567l0633o363l5284L4932K2166J5906
8120b495Q364l539n358j1413K8554R794l9396l3091Q020O4817o861m7814J3938
8107a6480N8622k7731p4326p694O4857O2273j5783o58k7742j4087J0845m0684
8095b8588O3132k5800O885K582q862j2185L114k5818L6862k710j8849M6484M1516
$$ plain form
8181 26137 49147 785 -74921 -76948 -68921 -50484 -19364 4555 -9098 25139 37491 -52067
8169 -52067 -8633 22747 8552 -4474 37053 25373 -33511 -25321 -30919 -39263 -72118 37894
8157 37894 134160 165309 86875 -9299 -42051 -25095 -22745 -8115 -25793 -46191 -43444 -74613
8145 -74613 -87737 21488 45102 26194 -15764 -50435 -53722 -56725 -71881 -50996 -56857 -40776
8133 -40776 -53933 -58187 -50550 -30739 -29097 5348 -3219 -33852 -40215 -75499 -40567 -18401 -2495
8120 -2495 5869 2330 -3028 -14441 14113 23907 -15489 -48580 -40560 24257 17396 -30418 -16480
8107 -16480 42142 14411 -59915 -67609 -2752 59521 43738 43080 15338 1251 12096 -28588
8095 -28588 34544 8744 15629 18211 9349 -2836 278 -25540 11322 8612 -10237 36247 77763
8082G7763j3333l4777l6878m5989q959J7073O4357P741l0788P228J2494Q684J1524
8069C6140M9312O021m4837N899M844M5398K4446l8402j7393k0224k4456J6826
8057D3574m0433J4085p031l657k0536N216J4935Q37K5406l2676m4683J2752N2767
8044B0556L5985J0088O414m7836k7527l3340l45K2769l0931j8867K1426P9806
8032C8198j6586l0551K7307l8259n6630L8532J3776J5212L4242J0814k3700N427
8020A7782N0659l7846q987P6532q936k0098N941K6709m9574j5922M3524K6227
8008A06011m2476L9374L9909o6541m3369l672M7935K5310j6130J1994q20k1076
7996G6449j328j9584K5813K9450J8942m7106O162k1668P676r55n110M635m1856
$$ plain form
8082 77763 64430 29653 -7225 -53214 -62173 -45100 19257 26998 -3790 3438 15932 24616 36140
8069 36140 85452 91473 46636 52535 57379 102777 127223 88821 71428 51204 26748 43574
8057 43574 3141 17226 10195 6538 -13998 -8782 6153 6990 32396 -280 -44963 -32211 20556
8044 20556 56541 66629 73043 25207 -2320 -35660 -36005 -13236 -44167 -63034 -41608 38198
8032 38198 21612 -8939 18368 -19891 -76521 -37989 -24213 -9001 25241 36055 12355 17782
8020 17782 68441 30595 21608 98140 89204 69106 75047 101756 52182 36260 79784 106011
8008 106011 63535 102909 142818 76277 32908 29236 77171 102481 86351 98345 97525 76449
7996 76449 75121 55537 81350 110800 129742 82636 88798 67130 74806 73851 68741 73376 31520
7983C1520q931j8904M819l7404M275M3626M352k7637n915O5098k0053q6570k3484
7970g5208L1015K3947L817O4634q951j262k698m7757k8376o651L8222J0398M8600
7957D9730K0883l4191K2844j307p6294l2201l0760R261Q870N3124O0282O0247
7945A10488k3972l1152k4919K6351L5469p5943j2844J5192P911P1114J2661j3197
7933I7159M112l4146L9095L7591k7194k0192j3796k748K0844K7522n3070k029
7921G3148O2461k047n8812m818j0115K8306Q107J2891L5591l032J272q152n8346
7908G6454m9427o3254j6632j8077R918J6242LL6236N503L3610k330L7647j2754
7895E3139k9357n0523J2450O9843m9118j0884q154N671N2744Q086m0819k1161
$$ plain form
7983 31520 22589 3685 8504 -28900 -24625 19001 23353 -4284 -10199 54899 34846 -51724 -75208
7970 -75208 -44193 -20246 -16429 48205 39254 37992 35294 -12463 -40839 -47490 -9268 1130 49730
7957 49730 70613 36422 59266 57959 -18335 -50536 -81296 -72035 -63165 -10041 50241 110488
7945 110488 86516 55364 30445 56796 92265 16322 3478 18670 26581 97695 110356 97159
7933 97159 101271 67125 106220 143811 116617 96425 82629 79881 100725 128247 75177 73148
7921 73148 135609 133562 74750 69932 59817 88123 96230 109121 144712 141680 142952 134800 76454
7908 76454 27027 -36227 -52859 -70936 -61018 -44776 -44773 -8537 -3034 30576 28246 65893 53139
7895 53139 23782 -26741 -14291 55552 6434 -4450 -12604 -6933 45811 53897 13078 -8083
7883h083m1453J6418M9386J8272q272l4713l8888Q345l24j3331J0413P72R990
7870c1468K616J0066L2817j8977j6452O882O893k5356n547j647Q885K3676J1618
7857D006m1688M3797L3545j3533k3169L2582M8229J3842J6437K3901o8387k223
7845F7339n5403o2491r009n536P125K460j5990M6563J3149J8978J8317m8388l3866
7832e6752J1563K0381P903K7939J4080J248P797l0130K2264K1305r176l6090l0259
7819b7927l3030k5555j2326j817j9269m0439j4604N2041N0747p561O0592L3163
7807A4015k5813k9035k734O8054j2356l8154p187p6895l0696L131L8858l341J9428
7794h2725m2403M4632N3837J9059k4654j5968K0839J1524J5269r65P3129j4750
$$ plain form
7883 -8083 -49536 -33118 16268 34540 26268 -8445 -47333 -38988 -39312 -52643 -42230 -41458 -31468
7870 -31468 -28852 -18786 14031 -4946 -21398 -14516 -7623 -32979 -38526 -40173 -31288 -7612 4006
7857 4006 -37682 6115 39660 26127 2958 35540 83769 97611 114048 137949 69562 67339
7845 67339 11936 -50555 -59564 -65100 -57975 -55515 -71505 -24942 -11793 7185 25502 -22886 -56752
7832 -56752 -45189 -24808 -16905 11034 25114 26362 34159 4029 26293 47598 38422 2332 -27927
7819 -27927 -60957 -86512 -98838 -100655 -119924 -160363 -174967 -122926 -72179 -79740 -19148 14015
7807 14015 -11798 -40833 -43567 24487 12131 -26023 -33210 -110105 -140801 -137670 -98812 -102153 -82725
7794 -82725 -125128 -80496 -26659 -7600 -32254 -48222 -27383 -15859 -590 -1555 71574 56824
7782E6824o0625l6193R075K5625N240q599J2224n7768m3696o91O7951O6122K2628
7769E8117l9650l9864K9834L8054k6727N627j4317m8417l6956K8568K0776j3344
7757c8299j9869J2001p622k6534M5170J8604O63n7151n1389N0887P6346j3599
7745a0792J4886j3588j1518O3528M4958n3677m3759k3170M4899j711l2378j7596
7733c9918J220p479K103k0855M2593J5032J8400k1599k4326m2168j3748M8751
7721d1994Q0955k526j509R190l4151p925K0730J7001J4455L2513N391o9007m5114
7708b1991M9083o4569r3496p6625J4360O9414K4445Q910N6364M3417n5572J4920
7696c1340l8561k4032J8209J9801J3695J8871M036J4125P8833J0150j9289J26
$$ plain form
7782 56824 -3801 -39994 -30919 -5294 -54 -8653 3571 -54197 -97893 -98584 -30633 35489 58117
7769 58117 18467 -21397 8437 46491 19764 25391 11074 -37343 -74299 -45731 -24955 -38299
7757 -38299 -58168 -46167 -53789 -80323 -35153 -16549 -15886 -73037 -124426 -73539 2807 -10792
7745 -10792 4094 -9494 -21012 42516 87474 33797 -9962 -33132 11767 10056 -22322 -39918
7733 -39918 -38698 -46177 -44074 -64929 -22336 -7304 11096 -10503 -34829 -76997 -90745 -41994
7721 -41994 38961 36435 34926 44116 9965 2040 22770 39771 54226 86739 92130 23123 -21991
7708 -21991 27092 -37477 -130973 -207598 -193238 -123824 -99379 -90469 -34105 9312 -46260 -31340
7696 -31340 -69901 -93933 -75724 -55923 -42228 -23357 -19321 -5196 73637 83787 64498 64624
7684F4624n1487p1654J6779L2354J0976q517m120k7652q531j006N7390k9310k6496
7671d6650J8506j0801j3661K5683Q4405K8619l9324l8901j6108R159r807k2856
7659c1736O0014J6465j4717m3268M8191O8148n8474o078m1117o1850Q538L1619
7647b4265J2661j3528N4116M1818k1504q067l5656J427L610m2643k0820M8259
7635d592O7209j149q32m3289k2851n1369K3391M8864O077l2803k3636n8178j6650
7622a09808K3325K3602P3372K46j4893P408K2665o718o3865n3552j1848K6728
7610h3338K7985K1276J5907J3786j6588J1373L1934o0755n4616k4611k1559K8701
7598a10505N9129n882j9382r813L5673J2076k1841l0277r341J7739K6940K9790
$$ plain form
7684 64624 13137 -58517 -41738 -9384 1592 -6925 -11045 -38697 -47228 -48234 9156 -20154 -46650
7671 -46650 -28144 -38945 -52606 -26923 57482 86101 46777 7876 -8232 927 -8880 -31736
7659 -31736 28278 44743 30026 -13242 34949 103097 44623 38545 -2572 -64422 -55884 -24265
7647 -24265 -11604 -25132 28984 70802 49298 41231 5575 7002 10612 -32031 -52851 -4592
7635 -4592 62617 61468 60636 17347 -5504 -56873 -33482 15382 21459 -11344 -34980 -93158 -109808
7622 -109808 -86483 -62881 10491 10737 -4156 3252 25917 19199 -44666 -98218 -110066 -83338
7610 -83338 -55353 -34077 -18170 -4384 -20972 -9599 22335 -38420 -93036 -117647 -139206 -110505
7598 -110505 -51376 -57258 -76640 -86453 -50780 -38704 -60545 -90822 -100163 -82424 -55484 -25694
7586b5694l9131n1002J2133N4094J3829J5117l0785k8989j3819J5192N7736M7326
7574B6007p9608k6843R2437R2278l8686q1537k5632J4832j8209R574N385n2361
7562h2363M780K8159L9293n774m4876L7956K8948k1166Q75l5823k3602o611L4800
7549d5404J7243R045m4868K6687J2320j4213O488k3653Q116m5188J0593L3879
7537d8955o238K4290j6624l5554j443M6427N6666N9843p33l8262M6935l7979m5772
7524B601j7258J703m967k678K3550n534n0280J0071k4003m1976R478M6816P341
7511d5136k5597N099j9589K0500O2107J7251q6553k367j8105J3288K1533K8625
7499b8944n4923l630k4241o723k0861N5078k3589n566O2964l2431J0854M6332
$$ plain form
7586 -25694 -64825 -115827 -103694 -49600 -35771 -20654 -51439 -80428 -94247 -79055 -21319 26007
7574 26007 -53601 -80444 11993 104271 65585 -15952 -41584 -26752 -44961 -35387 -30002 -82363
7562 -82363 -77583 -49424 -10131 -15905 -60781 -22825 6123 -15043 -14168 -49991 -73593 -80204 -45404
7549 -45404 -28161 -19116 -63984 -37297 -24977 -39190 -32702 -56355 -48239 -93427 -82834 -48955
7537 -48955 -55193 -30903 -47527 -83081 -84524 -38097 18569 78412 77679 39417 86352 48373 2601
7524 2601 -14657 -12954 -17921 -20599 2951 -2583 -52863 -42792 -66795 -108771 -99293 -52477 -45136
7511 -45136 -70733 -65634 -85223 -64723 -2616 14635 -71918 -74285 -92390 -79102 -57569 -28944
7499 -28944 -83867 -87497 -111738 -118461 -139322 -84244 -107833 -113399 -50435 -82866 -72012 -25680
7487b5680k3969J1991j3718j3173K8906K9018M361J545n0728l0708K70L6034L9841
7474f010O99N513N3668J3133n901k6433k1799k2766P628j2192k4436J2502K866
7461b3528n7476l9167K4567M4623M0789m6179k930L8817O2686P6095Q736o2815
7449F4218m5441l1202O439K6491l2458m8428j2460J1541L7733N270k2905j5743
7437e6945J2267L4682J8053Q411M6967K9237p0821j13543m9104M8163N9828J6273
7425a6532k5416m2738k489J5958K3707L0340L5079l603J9587k1036o1956l9319
7413h8418N391P77m415R59L0646J7435J4774l3037j1252k8608L6722K3849K3896
7400a1281j6756M7672L4469j9360n5798k4809j5248J4474p964L6039j540K4638
$$ plain form
7487 -25680 -49649 -37658 -51376 -64549 -35643 -6625 -2264 -719 -51447 -82155 -81885 -45851 -6010
7474 -6010 -5311 202 53870 67003 61102 34669 12870 -9896 -2268 -14460 -38896 -26394 -23528
7461 -23528 -81004 -120171 -95604 -50981 -10192 -56371 -59301 -20484 42202 118297 127033 64218
7449 64218 18777 -12425 -5986 20505 -11953 -60381 -72841 -61300 -23567 -18297 -41202 -56945
7437 -56945 -44678 -9996 8057 16468 63435 92672 21851 -91692 -140796 -92633 -32805 -16532
7425 -16532 -41948 -84686 -87175 -71217 -47510 -17170 17909 14306 33893 12857 -49099 -88418
7413 -88418 -83027 -82250 -86665 -85706 -55060 -37625 -22851 -55888 -67140 -95748 -59026 -35177 -11281
7400 -11281 -28037 19635 54104 34744 -21054 -45863 -61111 -46637 -54601 -18562 -20102 4536
7388D536L5635J4159J2079n0590k7021N9266q806j2175l7341k2384O3229K5705
7376E6292L0174k0358M768j7665l0037l3210l3837L4391J0883K2079J5782j9079
7364B0183J6683k0009k231J9172P698n9719K9040M1153M53k3456k3073K4741j0182
7351B0453j0656P895l8608m4701O054M2085L9805l8723m913O9193k247n9531l2345
7338d6239o984K3013N244K0353n479M7322L8642n960M393j728l7653l2416Q380
7325A0888K7150L210k1866m8183n4872K0969J4693K4873j818L6670J3026o9187
7313d4447K0831k2663K1806M1013m1671o2424k2336L2950M4982q035R646J7958
7301a2390N8814k7711n8413p4539L2945Q1865K3981l1351o9410j4098O7238L6851
$$ plain form
7388 4536 40171 54330 66409 15819 -11202 48064 39258 27083 -10258 -32642 30587 56292
7376 56292 86466 66108 70876 53211 23174 -10036 -43873 -9482 1401 23480 39262 20183
7364 20183 36866 16857 14626 33798 41496 -18223 10817 51970 52423 28967 5894 30635 20453
7351 20453 9797 17692 -20916 -65617 -59563 -17478 22327 -16396 -21309 47884 45637 -13894 -46239
7338 -46239 -53223 -30210 -24966 -4613 -10092 37230 75872 69912 74305 72577 34924 2508 10888
7325 10888 38038 41248 19382 -28801 -83673 -62704 -48011 -23138 -24956 11714 24740 -44447
7313 -44447 -23616 -46279 -24473 16540 -25131 -87555 -109891 -76941 -31959 -39994 -30348 -12390
7301 -12390 46424 18713 -39700 -114239 -81294 571 24552 -6799 -76209 -90307 -23069 13782
7289A3782j6002J7454q233k9210m7200N3359M7464l8692J9410L0178J8776j208
7277E9878l9775o9574J549N8610k3789j7243m4429k9652K8194N2187l5212J6442
$$ plain form
7289 13782 -2220 15234 7001 -22209 -69409 -16050 31414 -7278 12132 42310 61086 59878
7277 59878 20103 -49471 -47922 10688 -13101 -30344 -74773 -104425 -76231 -24044 -59256 -42814
$$ [...]
##END NTUPLES=NMR SPECTRUM
##END=
