##TITLE=Analysis number 313242
Compound Code cc 42004
Book Reference 437/38
Project Code adrs
Chemist Name wendyb
##JCAMPDX= 6.0         $$ Bruker NMR JCAMP-DX V2.0
##DATA TYPE= NMR SPECTRUM
##DATA CLASS= NTUPLES
##ORIGIN= Bruker BioSpin GmbH
##OWNER= NMR
$$ XWIN-NMR		Version 3.5
$$ Tue Aug 30 13:20:58 2005 GMT Daylight Time (UT+1h)  MAYBRIDGE\NMR@NMR_250MHZ
##.OBSERVE FREQUENCY= 250.131544655141
##.OBSERVE NUCLEUS= ^1H
##.ACQUISITION MODE= SIMULTANEOUS (DQD)
##.ACQUISITION SCHEME= undefined
##.AVERAGES= 16
##.DIGITISER RES= 18
##SPECTROMETER/DATA SYSTEM= dpx250
##.PULSE SEQUENCE= zg30
##.SOLVENT NAME= CDCl3
##.SHIFT REFERENCE= (INTERNAL, CDCl3, 0, 16.522)
##AUDIT TRAIL= $$ (NUMBER, WHEN, WHO, WHERE, WHAT)
$$ ##TITLE= Audit trail, XWIN-NMR		Version 3.5
$$ ##JCAMPDX= 5.01
$$ ##ORIGIN= Bruker BioSpin GmbH
$$ ##OWNER= NMR
$$ C:\u/data/dgb/nmr/ADRS/8770/pdata/1/auditp.txt
$$ ##AUDIT TRAIL=  $$ (NUMBER, WHEN, WHO, WHERE, WHAT)
(   1,<2005-08-30 13:20:40.44 +100>,<MAYBRIDGE\NMR>,<NMR_250MHZ>,
      <created by zg, POWCHK disabled, PULCHK disabled
       configuration hash MD5:
       62 19 C7 07 E1 42 D1 B7 37 6C 3D D0 77 39 F9 E6
       data hash MD5: 64K
       3D 61 1A A0 59 5C F0 8C 01 11 A7 E2 A9 3E 59 A7>)
(   2,<2005-08-30 13:20:50.94 +100>,<MAYBRIDGE\NMR>,<NMR_250MHZ>,
      <Start of raw data processing
       ef LB = 0.3 FT_mod = 6 PKNL = 1 SI = 32K 
       data hash MD5: 32K
       39 A4 27 3C D5 B7 6E BF CF C8 4E 9B 03 A4 46 F8>)
(   3,<2005-08-30 13:20:52.71 +100>,<MAYBRIDGE\NMR>,<NMR_250MHZ>,
      <apk 
       data hash MD5: 32K
       F8 8D 44 AC 3E 33 31 31 75 BA 18 B6 5B 70 E6 FB>)
(   4,<2005-08-30 13:20:53.42 +100>,<MAYBRIDGE\NMR>,<NMR_250MHZ>,
      <abs ABSG = 5 
       data hash MD5: 32K
       48 E9 47 C8 99 9B F3 BD 55 C2 4F 35 D9 FA A3 18>)
$$ ##END=
$$ 
$$ hash MD5
$$ 69 AC C3 4C F6 C5 AC DD CD 54 7C AC 38 A4 12 40
##$RELAX= 
##$RELAX= 
##$RELAX= 
##$RELAX= 
##$RELAX= 
##$RELAX= 
##$RELAX= 
$$ Bruker specific parameters
$$ --------------------------
##$DU= <C:\u>
##$EXPNO= 8770
##$NAME= <ADRS>
##$PROCNO= 1
##$TYPE= <nmr>
##$USER= <dgb>
##$AMP= (0..31)
100 100 100 100 100 100 100 100 100 100 100 100 100 100 100 100 100 100 
100 100 100 100 100 100 100 100 100 100 100 100 100 100 
##$AQSEQ= 0
##$AQ_mod= 3
##$AUNM= <au_zg>
##$AUTOPOS= <28 >
##$BF1= 250.13
##$BF2= 250.13
##$BF3= 250.13
##$BF4= 250.13
##$BF5= 500.13
##$BF6= 500.13
##$BF7= 500.13
##$BF8= 500.13
##$BYTORDA= 1
##$CFDGTYP= 0
##$CFRGTYP= 5
##$CHEMSTR= <none>
##$CNST= (0..31)
1 1 145 1 1 1 1 1 1 1 1 1 1 1 1 1 1 1 1 1 1 1 1 1 1 1 1 1 1 1 1 1 
##$CPDPRG= <>
##$CPDPRG1= <>
##$CPDPRG2= <>
##$CPDPRG3= <>
##$CPDPRG4= <mlev>
##$CPDPRG5= <mlev>
##$CPDPRG6= <mlev>
##$CPDPRG7= <mlev>
##$CPDPRG8= <mlev>
##$CPDPRGB= <>
##$CPDPRGT= <>
##$D= (0..31)
0 1 0 0 0 0 0 0 0 0.06 0 0 0 0 0 0 0.0002 0 0 0 0 0 0 0 0 0 0 0 0 0 0 
0 
##$DATE= 1125404439
##$DBL= (0..7)
120 120 120 120 120 120 120 120 
##$DBP= (0..7)
150 150 150 150 150 150 150 150 
##$DBP07= 0
##$DBPNAM0= <>
##$DBPNAM1= <>
$$ [...]
##$SUBNAM7= <"">
##$SUBNAM8= <"">
##$SUBNAM9= <"">
##$SW= 20.6930455092707
##$SWIBOX= (0..15)
0 0 3 0 0 0 0 0 0 0 0 0 0 0 0 0 
##$SW_h= 5175.983436853
##$TD= 65536
##$TD0= 1
##$TE= 295.16
##$TE2= 300
##$TE3= 300
##$TEG= 300
##$TL= (0..7)
0 120 120 120 120 120 120 120 
##$TP= (0..7)
150 150 150 150 150 150 150 150 
##$TP07= 0
##$TPNAME0= <>
##$TPNAME1= <>
##$TPNAME2= <>
##$TPNAME3= <>
##$TPNAME4= <>
##$TPNAME5= <>
##$TPNAME6= <>
##$TPNAME7= <>
##$TPOAL= (0..7)
0.5 0.5 0.5 0.5 0.5 0.5 0.5 0.5 
##$TPOFFS= (0..7)
0 0 0 0 0 0 0 0 
##$TUNHIN= 0
##$TUNHOUT= 0
##$TUNXOUT= 0
##$USERA1= <user>
##$USERA2= <user>
##$USERA3= <user>
##$USERA4= <user>
##$USERA5= <user>
##$V9= 5
##$VALIST= <valist>
##$VCLIST= <CCCCCCCCCCCCCCC>
##$VD= 0
##$VDLIST= <DDDDDDDDDDDDDDD>
##$VPLIST= <PPPPPPPPPPPPPPP>
##$VTLIST= <TTTTTTTTTTTTTTT>
##$WBST= 1024
##$WBSW= 4
##$XGAIN= (0..3)
0 0 0 0 
##$XL= 0
##$YL= 0
##$YMAX_a= 421725
##$YMIN_a= -493525
##$ZGOPTNS= <>
##$ZL1= 120
##$ZL2= 120
##$ZL3= 120
##$ZL4= 120
##$ABSF1= 16.522
##$ABSF2= -4.171173
##$ABSG= 5
##$ABSL= 3
##$ALPHA= 0
##$AQORDER= 0
##$ASSFAC= 0
##$ASSFACI= 0
##$ASSFACX= 0
##$ASSWID= 0
##$AUNMP= <proc_1d>
##$AZFE= 0.1
##$AZFW= 0.1
##$BCFW= 0
##$BC_mod= 0
##$BYTORDP= 0
##$COROFFS= 0
##$CY= 12.5
##$DATMOD= 1
##$DC= 0
##$DFILT= <>
##$DTYPP= 0
##$F1P= 14.0000005364418
##$F2P= -0.99999901652339
##$FCOR= 0.5
##$FTSIZE= 32768
##$FT_mod= 6
##$GAMMA= 0
##$GB= 0
##$INTBC= 1
##$INTSCL= 1
##$ISEN= 128
##$LB= 0.3
##$LEV0= 0
##$LPBIN= 0
##$MAXI= 10000
##$MC2= 0
##$MEAN= 0
##$ME_mod= 0
##$MI= 0
##$NCOEF= 0
##$NC_proc= -5
##$NLEV= 6
##$NOISF1= 0
##$NOISF2= 0
##$NSP= 0
##$NTH_PI= 0
##$NZP= 0
##$OFFSET= 16.522
##$PC= 1
##$PHC0= -80.41541
##$PHC1= 5.042903
##$PH_mod= 1
##$PKNL= yes
##$PPARMOD= 0
##$PSCAL= 4
##$PSIGN= 0
##$REVERSE= no
##$SF= 250.13
##$SI= 32768
##$SIGF1= 0
##$SIGF2= 0
##$SINO= 400
##$SIOLD= 32768
##$SREGLST= <1H.CDCl3>
##$SSB= 0
##$STSI= 32768
##$STSR= 0
##$SW_p= 5175.98343685301
##$SYMM= 0
##$S_DEV= 0
##$TDeff= 65536
##$TDoff= 0
##$TI= <Analysis number 999999
Compound Code 99
Book Reference 9
Project Code 9>
##$TILT= no
##$TM1= 0
##$TM2= 0
##$TOPLEV= 0
##$USERP1= <user>
##$USERP2= <user>
##$USERP3= <user>
##$USERP4= <user>
##$USERP5= <user>
##$WDW= 1
##$XDIM= 32768
##$YMAX_p= 482356056
##$YMIN_p= -219846
$$ End of Bruker specific parameters
$$ ---------------------------------
##NTUPLES= NMR SPECTRUM
##VAR_NAME=  FREQUENCY,     SPECTRUM/REAL,   SPECTRUM/IMAG
##SYMBOL=    X,             R,               I
##VAR_TYPE=  INDEPENDENT,   DEPENDENT,       DEPENDENT
##VAR_FORM=  AFFN,          ASDF,            ASDF
##VAR_DIM=   32768,         32768,           32768
##UNITS=     HZ,            ARBITRARY UNITS, ARBITRARY UNITS
##FACTOR=    0.157963299565203, 1,           1
##FIRST=     4132.6476996994, 0,             0
##LAST=      -1043.33573715361, 0,           0
##MIN=       -1043.33573715361, -219846,     0
##MAX=       4132.6476996994, 482356056,     0
$$ Real data points
##PAGE= N=1
##DATA TABLE= (X++(R..R)), XYDATA
$$ [...]
22098 22199 -35651 -50273 -15602 13250 29305 -17788 2456 91488 40173 -11027 -28487 -32102
22086 -32102 -29327 -50056 -86183 -127161 -92399 4138 50857 9813 22216 84709 147234 117908
22074 117908 64993 61176 26120 49125 71064 70320 47554 1709 675 -2853 -4036 -20630 -8259
22061 -8259 -25829 -84264 -85542 -38737 -16432 30362 32997 34666 5426 -7975 -32812 -91733
22049 -91733 -122211 -141732 -106688 -127213 -134565 -122537 -95682 -78547 -56870 -24334 -1321 150
22037 150 29007 -9774 5310 72114 16108 -65115 -44135 -5710 -15325 -15977 -18372 26005 -4449
22024 -4449 -49725 -105225 -80696 -60878 -48523 -45734 -51867 -63971 -52569 -38901 -22780 -14356
22012 -14356 -17131 6344 35928 55981 64587 27936 43891 69105 42205 -15680 -56901 -60353
22000 -60353 -60943 -2763 18961 25695 56152 36447 -12518 -33449 -29194 -14289 7633 -20795
21988 -20795 -28759 -10065 18835 48206 59392 76223 122291 107722 79349 64720 31593 7568
21976 7568 -21716 -54117 -60491 5282 28417 -6677 7158 27902 15499 -4994 -34267 -39704
21964 -39704 -68396 -88994 -122212 -62655 -19900 -23880 -60646 -44949 -34696 -38041 -99519 -110800
21952 -110800 -77045 -40065 -45470 -63442 -76777 -107587 -113413 -81991 -73398 -56643 -20622 4475
21940 4475 -45158 -27968 -4205 57163 154784 196946 216550 195099 164576 143417 65050 48781
21928 48781 31851 943 -13765 -70561 -95943 -70564 -42608 -20251 14309 18013 -1853 6492
21916 6492 14832 18696 4913 7201 -61799 -47154 -47275 -26741 -26914 -16528 -83979 -71817 -54472
21903 -54472 -104424 -48604 -23927 -60133 -64135 -20574 -51173 -68863 -46407 -13725 -13066 10625
21891 10625 67779 117579 85795 67720 76947 49357 20849 -21426 -39394 -23171 27778 36373
21879 36373 8021 -45356 -89991 -75287 -23242 -72160 -107103 -36655 -23823 -108159 -135255 -78296
21867 -78296 15554 3449 -46202 -43151 -54825 10383 35986 7674 -23745 671 17674 -16836
21855 -16836 -27383 -24882 -63137 -63551 -59972 -27909 -36897 -59401 -28164 -12280 -8284 -15943 -39231
21842 -39231 -64968 -131633 -99251 -12021 62926 144948 193759 201968 213124 243071 256437 333860
21830 333860 540464 815913 1212488 1799411 2250143 2369014 2090267 1591846 1091053 717142
21820 717142 481556 340518 251492 172842 103636 79639 93919 35815 29283 31247 26148 -39341
21808 -39341 -57255 -16720 -13311 -13714 -28116 -4864 31542 49360 7064 -43636 13775 75777
21796 75777 6123 -55108 -62630 -69689 -78118 -75180 -70123 -38578 8388 -9951 -56210 -71959 -40276
21783 -40276 -86145 -100276 -47102 -75481 -32837 -39199 5196 41200 18495 -3710 19999 -15023
21771 -15023 -62359 -123924 -130961 -64746 6736 7022 -22200 7619 -42847 -101073 -85725 -93147
21759 -93147 -76604 -59971 -86953 -99582 -66923 -51869 -31564 5306 -22889 -45009 -33188 -54619
21747 -54619 -100040 -58896 41768 24586 -10635 -32847 -74652 -66433 -31769 1198 -8275 -43479
21735 -43479 -28620 -32723 -13277 -10055 -5130 29546 38130 27667 -17959 -59658 -92663 -77950
21723 -77950 -52925 -39826 -56249 -75519 -91004 -84404 -59966 -15990 -33568 -97013 -99078 -79429
21711 -79429 -13520 22667 26654 -31575 -27455 915 7459 -39145 -53673 1543 8893 -7036
21699 -7036 36227 46378 16031 21054 26802 66074 80843 71837 78691 75215 82680 55226 29939
21686 29939 -21795 9896 9805 -10625 -58745 -66074 -23591 11134 52112 -14593 -58879 -82573
21674 -82573 -39918 19052 39415 8282 406 4347 1823 18462 66532 21770 -26366 4796
21662 4796 17208 -19440 -10062 -10747 -26743 -31206 -32697 4377 38911 60515 52631 52676 23634 -26396
21648 -26396 7634 -10492 -56408 -54811 -35725 5097 7439 -11501 405 5581 -5874 11084
21636 11084 -7801 -46231 -66166 -57316 -57409 -85096 -79695 -68833 -57340 -75251 -85328 -68706 -15380
21623 -15380 39374 23980 7899 -1561 -49288 -53410 -43908 -46563 -8085 39818 -2375 -12886
21611 -12886 -25492 7187 -20785 -6093 -2152 20208 26188 -49019 -63864 -4061 20622 -33531
21599 -33531 -20859 7843 -12001 -42301 -19394 42577 14181 -7946 -87115 -128604 -88038 -19612
21587 -19612 -16834 -76603 -74177 -20613 -25793 -65383 -53980 -33371 -15614 -3171 -54063 -63485
21575 -63485 -33251 -60690 -100973 -55808 -47424 -20951 21650 31200 9602 4862 2626 -20773
21563 -20773 -58013 -52515 -20405 6180 13442 10633 -16277 -68233 -77657 -124795 -137712 -118403
21551 -118403 -37939 -24822 -19616 -6868 -46585 -63319 -75963 -42600 -1253 -25555 -28287 23913
21539 23913 86174 44313 -29077 -95686 -146849 -98759 -63069 -98902 -131119 -107647 -69754 -9351
21527 -9351 28224 52354 18627 23018 -26198 -72723 -23547 -6774 -13636 -59398 -60064 -50040 -20016
21514 -20016 -34989 -89912 -113214 -82980 -71199 -10100 936 5171 45394 23644 -38317 -17799
21502 -17799 -31359 -35256 -10035 2598 35640 53232 35829 13231 13319 -34111 -50556 -30288
21490 -30288 -1087 1266 -16316 -8882 13002 28766 32981 -71038 -105947 -121553 -111441 -48356
21478 -48356 -6428 -38093 -3958 39240 52709 36409 12520 13023 9695 -13935 -26729 4373
21466 4373 21691 -3689 57435 34081 24196 7069 -21117 -19157 -12019 -14263 -94630 -156537 -153212
21453 -153212 -88123 -92208 -52506 -72441 -76212 -81919 -58101 -13180 -32883 -49217 -101175 -25630
21441 -25630 28900 6841 -24610 -71002 -82705 -61602 -24262 -8012 46787 6486 -59823 -144789
21429 -144789 -110711 -70729 -87441 -65643 -42581 -10141 -14528 -98056 -58139 -24046 -3404 -27205
21417 -27205 -16912 10643 -1078 -46758 -68119 -63257 -61189 -87808 -69607 -71234 -50015 -5419
21405 -5419 40749 -6675 -36664 -49526 -63480 -41410 -4783 -2357 -18649 5491 -42599 -53866
21393 -53866 -77322 -90633 -67180 -28214 -22680 -55007 -93024 -45714 7434 -8562 -16222 -10024
21381 -10024 -40225 -78636 -83199 -79778 -38932 -277 4655 -32122 -35624 -72476 -71203 -41142 -52851
21368 -52851 -29698 -16635 -67797 -81381 -83927 -41050 -18280 2187 -865 -23323 -17041 -20907
21356 -20907 -22029 -29494 -29610 9777 -16612 -35159 -56799 -60601 -25487 -63010 -69646 -43734 -47280
21343 -47280 -1808 -41743 -71800 -89839 -89640 -91890 -65865 -46329 -92864 -96367 -63442 -101994
21331 -101994 -141241 -104583 -71244 -70342 -29090 16716 27607 5253 -48262 -81071 -140728 -143993
21319 -143993 -70673 -46995 -28837 -19816 -23797 -68495 -48877 -21117 -20351 -3211 -3630 -750 -8329
21306 -8329 -63867 -67989 -62247 -39962 -44968 -31732 -65508 -92275 -114706 -129978 -57697 -11524
21294 -11524 -5616 -27591 -77359 -32931 -49641 -62811 -9201 28616 -2959 24365 28868 -15965
21282 -15965 -8515 17045 27527 18028 35967 6162 -22058 -22388 -22500 9435 12027 58391 73790
21269 73790 63948 16607 -6298 -142 -31803 -80018 -90929 -24822 29868 63472 75011 52326
21257 52326 35117 20647 8262 -16745 -8651 28322 20297 -45581 -50221 -4948 62704 61455
21245 61455 36873 -2023 9271 45602 -37610 -147822 -157554 -132859 -68006 -34862 -43149 -75000
21233 -75000 -77328 -66812 -32243 -5177 -47812 -115304 -74531 1723 18001 -8248 -35829 -28301
21221 -28301 -46545 -46988 -47078 -64340 -88251 -95515 -83431 -87035 -42261 12368 -26957 -66702 -103348
21208 -103348 -54718 -50917 -24398 34285 16288 -20178 18742 -7490 -29296 1231 -57749 -117076
21196 -117076 -110118 -78257 -71255 -53307 -24066 12759 -24955 -47115 -44717 -46746 -103999 -117743
21184 -117743 -52790 -74812 -116419 -148721 -123986 -68255 -93330 -109714 -86795 -40579 -33989 -56178
21172 -56178 -66586 -34292 -19032 10320 17562 -24935 533 16398 -20971 -43884 -98091 -90892
21160 -90892 -51990 -91767 -89248 -43626 -42584 -34171 -63261 -72232 -56746 -29178 51787 80496
21148 80496 53808 -172 -41983 -61204 -54182 -47614 -30138 -35635 -37186 -11263 -32596 -23521 -38806
21135 -38806 -35724 3494 53310 50580 18089 6724 17842 36977 31224 -18531 -48564 -30328
21123 -30328 899 -14477 -89164 -141157 -127584 -75528 7487 -487 -23252 542 14318 13737
21111 13737 -46740 -60424 -6403 -6070 -49241 -3460 28038 11455 -38810 -37103 -9807 -28470
21099 -28470 -32948 6133 -17607 -50053 -75627 -97613 -48477 9355 13560 -24121 -64539 -25743
21087 -25743 -26231 -49227 -46513 -22802 -15209 2624 21605 26298 2499 -37371 -6195 29539 -14468
21074 -14468 -3758 40985 34993 20769 16715 -38895 -66398 -43721 -32818 13748 55914 52380
21062 52380 54451 15073 -10027 -31056 -44576 -80239 -112839 -36020 -3246 -31964 -23122 -2952
21050 -2952 8186 -25046 -39503 25449 16137 -19691 -4788 11850 30104 1806 -24585 -28031
21038 -28031 -6359 38801 64203 72659 43389 -4682 -71745 -71687 -134344 -148649 -106264 -77722
21026 -77722 -75407 -69265 35024 48746 -5250 -19129 -30239 -7052 11893 -7103 49433 37392
21014 37392 196 -81477 -111393 -130623 -45741 -11482 -59331 -90521 -51783 -44444 -79735 -131104
21002 -131104 -169803 -150060 -175557 -191187 -130592 -101199 -82733 -66744 -78392 -116285 -133300
20991 -133300 -51609 -33155 -48335 -57919 -153409 -145412 -62631 46 -35180 -125682 -172576 -184638
20979 -184638 -161467 -133121 -128316 -69763 -65095 -87475 -89835 -102444 -104946 -81461 -59670 -62530
20967 -62530 -41472 -51494 -79817 -81686 -68062 -47247 -68932 -82851 -88193 -132233 -147707 -153222
20955 -153222 -170415 -118809 -106255 -92659 -87645 -32898 -36300 -94849 -88983 -49468 -79 8424
20943 8424 -19255 -16009 -39737 -66883 20498 82017 86276 20660 -10378 -69415 -89386 2920
20931 2920 25303 12152 -4467 25099 52680 86287 66291 43703 -6545 -24956 -22725 -12381
20919 -12381 23118 -5894 -48123 -27764 12670 14378 10400 16622 31287 -9357 -14473 -18010 -46878
20906 -46878 -84176 -66146 -52296 -29701 8459 42050 97760 95772 92789 18920 -30301 -60218
20894 -60218 -52871 -44113 -57940 -65090 -50139 -8367 -6756 -6299 -53740 -53031 3256 9510 -88397
20881 -88397 -149525 -166752 -150690 -127836 -91069 -68362 -75417 -85300 -103714 -76925 -31730 -39192
20869 -39192 -20756 -52444 -87265 -101597 -89820 -75561 -34367 -565 -13796 -15868 -53227 -68461
20857 -68461 -39267 -48133 -26520 11311 25943 -27642 -86696 -124669 -76488 -31204 -2286 26825
20845 26825 30513 -138 -42026 -44931 -18059 -11613 3576 -281 23939 63043 39856 -20742
20833 -20742 -52090 -38445 -51998 -46868 21236 34185 10474 53182 70224 64295 6551 -25514
20821 -25514 -25688 20392 43953 59010 37785 32115 2233 -58795 -66395 -21869 -27736 -100059 -89596
20808 -89596 -39713 -14711 -52949 -72234 -37595 5779 24053 -9889 -36344 10762 24319 9326
20796 9326 825 43558 2992 -42961 -61539 -58558 -103787 -88405 -92226 -61906 -5663 20179
20784 20179 32700 7495 -16525 -7192 -2560 -39604 -24917 -38601 -46979 -14091 12923 9400
20772 9400 -47482 -78985 -47850 -52005 -49458 -15722 33262 43053 20927 23087 -12452 -14702 -71370
20759 -71370 -55294 -30632 -67894 -107788 -94748 -67379 -70082 -56018 -36834 -51821 -11068 31739
20747 31739 -10665 -58036 -59675 -56278 -43964 -49537 -42989 2871 6947 -9720 -33346 -16122 41507
20734 41507 104924 80594 27972 38291 13065 -6973 -19175 1504 5338 -39741 9352 28569
20722 28569 -39099 -92685 -68171 -92494 -87932 -61198 -37910 -55902 -57383 -39929 -52363 -57912
20710 -57912 16056 40082 -38741 -70060 -47629 -34870 -48328 -71713 -82922 -56009 -65505 -61184
20698 -61184 12287 70719 25458 -50489 -13941 -32338 -39884 -65024 -53950 -27843 -5770 23229
20686 23229 -8150 -54823 -66132 -43624 -34666 -15993 -1269 20436 27838 20105 -22329 -5758
20674 -5758 -20442 -61740 -17068 -4484 -7316 -19622 -28458 -10885 -49793 -34515 -3304 3500
20662 3500 -42087 -68735 -43585 -9136 13954 -2886 -21905 -943 -32842 -34000 -69386 -104697
20650 -104697 -77979 -63281 -69543 -24684 4601 -696 -32978 -69802 -73151 -79519 -96639 -108466
20638 -108466 -36137 -48788 -94981 -140926 -79207 24410 -72673 -129636 -87273 -52947 -56873
20627 -56873 -76750 -70907 -48518 -33798 -46588 -34636 19175 28888 9193 11321 5970 -23403
20615 -23403 -33412 -43970 -68946 -61897 -53534 -50133 -2085 8094 -57991 -31236 -14720 -5693
20603 -5693 13157 -54632 -79481 -69715 -40099 20571 -5550 -50330 -113725 -118099 -103788 -85352
20591 -85352 -25196 -26289 -27945 12373 14102 -10515 -13472 33625 -15976 -52054 -88844 -58215
20579 -58215 -75267 -63976 -39218 -14341 -33075 -50216 -36368 -9222 -8388 -47416 -59216 -38706
20567 -38706 -44141 -54808 -99148 -115599 -56693 1034 37270 32575 25433 10662 -2696 -7440
20555 -7440 -35241 -12350 473 -63012 -68821 -1544 34728 68380 71720 60081 33045 68045
20543 68045 6341 -77839 -90289 -45082 -4781 25448 13272 30904 57352 -11549 -76447 -105278
20531 -105278 -81207 -23527 6326 5780 -25810 -3720 15586 10685 -24875 -63958 -38296 -83603
20519 -83603 -82352 -41077 -21388 -5332 -12805 -66626 -103077 -80662 -130885 -144330 -161000 -86600
20507 -86600 -22410 -58473 -46625 14250 49574 48575 -2800 -31768 -75566 -108801 -126302 -80471
20495 -80471 -66427 -58067 -12862 12895 12426 58642 46171 47588 -11500 -82533 -119063 -88750
20483 -88750 -18724 2953 2539 -48383 -52094 -26525 -28355 757 21936 -12904 -14946 47347 45530
20470 45530 7322 14945 20096 22344 5205 -2706 -21931 -49615 -73624 -26852 1008 -31940
20458 -31940 -19867 32953 8517 -37210 -29757 -45266 -75378 -36168 -7421 37257 27741 27289
20446 27289 -2174 -64349 -81976 -66608 -57323 1526 16234 -36218 -49605 -39726 -24460 -48415
20434 -48415 -116487 -155835 -108749 -49371 -15198 -37188 -45311 -23409 -12830 -85931 -88771 -41868
20422 -41868 2453 -23340 -47568 -11772 -8608 -20059 20171 7754 -30279 10467 1194 13737
20410 13737 -420 62739 72627 37086 39009 69647 74033 45328 69412 123082 120448 80521
20398 80521 44813 3107 -27673 -17605 -23684 16328 -158 -15477 8722 3681 18894 5240
20386 5240 18169 24156 1882 9327 16079 1527 -21393 -43794 -20606 -53050 -104777 -69676
20374 -69676 -41433 -72265 -61301 -77418 -120939 -108723 -64297 -19949 -31423 -41060 -10808 47452
20362 47452 58492 53430 46401 -21940 -41580 -74914 -66798 -35546 -14571 5437 -7713 -32342
20350 -32342 -53901 -46398 -7138 -9278 -12135 -64470 -102461 -117344 -85944 -35655 -79987 -126785
20338 -126785 -100411 -42971 -57362 -37788 -72421 -62880 -3540 22554 6615 42744 31023 -19858
20326 -19858 -7462 -45544 -126795 -89736 13858 49925 55953 43705 38530 11820 -36707 -92333
20314 -92333 -136105 -192500 -166717 -124454 -53528 -7681 46394 39637 12872 -35196 -65684 -70334
20302 -70334 -98625 -74703 -32697 3556 71740 79964 85674 65798 27791 44799 71443 -1866
20290 -1866 46799 64381 4674 -36488 -29044 -2372 41399 47838 5811 24428 -7010 -35125
20278 -35125 6528 25097 49867 31788 19834 -28951 -74883 -86415 -61894 -19399 -7873 -39896
20266 -39896 -72342 -79966 -56055 -48392 -1098 35538 96887 93921 79083 33383 1857 -15658
20254 -15658 -40519 -10477 -6148 259 24682 24030 -6932 -49362 -112850 -101643 -19957 14559
20242 14559 39744 13507 -16717 -31827 -39210 -22449 1747 -30407 -31991 -61566 -21976 -48039
20230 -48039 -106978 -87464 -52792 33371 94782 50643 33831 99670 110662 57417 41046 16139
20218 16139 21530 -21229 -6636 54678 963 -56884 -50752 -34189 -11408 -783 -34094 -63784
20206 -63784 -60933 -27813 1513 -29394 -15871 47146 39508 14411 -11448 -32606 -37345 -10781
20194 -10781 29450 -14153 -95888 -74735 -35890 -65711 -61214 -26936 -37808 -64031 -107372 -74125
20182 -74125 -44301 -12934 -18928 19047 13359 -20074 -7138 -23452 -35709 -43529 8473 10263
20170 10263 -9771 9890 6607 -16528 -47448 -57515 -95763 -96464 -49528 1377 39693 22195
20158 22195 -19264 11390 68760 80022 52070 23304 -8645 -41292 -26842 11347 -3829 20408
20146 20408 13210 29208 52239 66829 47383 12979 -17467 -21697 30927 72432 53341 -242
20134 -242 -12387 13772 13847 16401 -21198 -36869 741 27769 39949 26465 6912 -53339 -115582
20121 -115582 -94051 3516 15972 109 -37896 -82374 -76922 -46606 8531 50337 26796 -6688
20109 -6688 -4844 -40544 -26427 -43205 -33139 4632 -8355 -86569 -67973 -19660 -17633 -1715
20097 -1715 -29852 -23956 10858 78261 139680 108863 99104 76770 38361 30914 -10907 1924
20085 1924 26028 13112 12400 -228 -13798 -23554 -17416 -8062 15077 26525 -8354 -46854 -38039
20072 -38039 -6117 -13978 -30973 -90173 -102794 -103621 -86265 -32316 -2205 -22144 -15282 2482
20060 2482 -29537 -72213 -59013 -80784 -87399 -50396 -95450 -86883 -86903 -83983 13049 12507 39694
20047 39694 46257 24859 -23097 -39750 -45186 -42017 -6908 -22587 -35552 -16405 -4791 -2264
20035 -2264 7117 40548 854 9156 41288 41593 -18683 -47784 -87783 -118461 -72712 27206 48803
20022 48803 10333 -64611 -37768 74920 82978 -4661 -53526 -36555 -28825 -49041 -67105 -112153
20010 -112153 -63706 -11802 -62720 -66120 -61597 -11039 31496 22774 3765 31869 45343 53640
19998 53640 52149 13344 8833 16514 -3174 1496 31798 51525 44640 63474 45831 37950 58915
19985 58915 70095 58396 71142 41488 -5279 -8354 9046 32915 51854 86237 87772 29171
19973 29171 23936 3949 13004 -3118 -32382 -46706 -47627 -87527 -67346 -26165 6316 48925
19961 48925 44695 35044 68031 38597 16988 -31905 -88242 -90305 -38544 32541 9512 7754
19949 7754 -4911 -13962 -8036 -252 57223 37985 6391 22415 51255 41170 22316 -38200
19937 -38200 -68258 -12421 32540 9217 -47923 -54148 -49216 -70178 -19030 23485 20556 123
19925 123 -27455 1703 -31363 -23438 50739 87254 78562 71235 104736 124154 43434 28447 81867
19912 81867 67046 22281 34421 41720 29791 57005 45966 21654 42130 -6976 19875 48291
19900 48291 32931 -12238 -44420 -27695 -12639 11288 15880 61876 52643 16387 -6318 -3896
19888 -3896 -11809 -39481 -17391 1670 40313 77950 28533 32693 15940 56125 51792 63222
19876 63222 69868 61848 21870 7679 -10424 48389 112398 103564 62521 71341 38931 46934 121166
19863 121166 84193 26310 -18434 4860 22005 24597 6784 -5733 2663 36975 59139 61079
19851 61079 65005 63584 103985 81321 74889 97763 152622 219702 246963 281742 314852 378300
19839 378300 410386 452423 476783 526378 601382 669578 795057 824028 739266 671982 639540
19828 639540 610470 536643 460607 392222 355038 315228 309301 285844 247314 199524 141760 137242
19816 137242 89169 46368 31933 26027 975 31167 111158 141626 110562 126869 120801 110870
19804 110870 73277 23291 40977 33002 36678 92563 69064 59337 98033 97526 126103 127960 144266
19791 144266 110761 70951 7453 3277 15138 10118 -14853 -1187 25710 113453 140212 93398
19779 93398 64506 48978 -6629 -53963 -70666 -62924 -80020 -67641 -18599 -1351 -58020 -76581
19767 -76581 14988 77593 41835 29327 83704 115884 69395 9823 -17247 -74394 -90680 -85979
19755 -85979 -79264 -28592 -17143 8015 17483 28185 70412 90324 94283 60120 35994 28304
19743 28304 -9914 -60044 -52492 35625 -26834 -101716 -57665 -7491 31088 25421 -5315 -26472
19731 -26472 -71096 -102367 -58006 -4867 20498 61112 137530 87405 -21133 -38638 -16898
19720 -16898 15318 21164 -6877 -6594 -23903 15642 49271 59663 16353 10731 11358 -623 17486
19707 17486 -21418 7195 4687 -26014 -16353 -28071 17618 42993 14011 14846 43920 37980 -32450
19694 -32450 -16390 13686 -20391 -68091 -53701 9449 20178 -11909 -11413 -28779 2195 -4279
19682 -4279 -20854 9867 29263 40951 19325 -11521 -23645 4521 75817 77843 87285 59915
19670 59915 10849 31940 29290 -2888 -43044 -47250 2808 38500 65675 105473 127608 136845
19658 136845 117815 161731 174220 149870 180912 225275 208849 216491 266454 375240 455872
19647 455872 438979 481756 569002 643292 679306 691145 732784 662634 563065 441021 327186
19636 327186 276396 198790 154231 143485 149935 173398 215299 143305 97312 134366 142446 105749
19624 105749 96168 79481 96618 104812 36152 4600 -34382 -5323 48168 108323 159414 101954
19612 101954 82582 84608 63217 108132 154672 167079 138809 70620 71633 107538 96168 97471
19600 97471 98994 83532 66751 66955 43226 15819 -8761 19363 44747 62480 77039 143883
19588 143883 113858 82679 73971 104881 67308 35776 25404 65972 85017 32420 33320 12829
19576 12829 -11681 46920 89543 98938 44565 -5025 -34291 -34392 -43420 -66650 -20507 58256
19564 58256 57168 100348 90881 39665 -10612 40101 53721 13107 -26302 -56067 -92825 -74149
19552 -74149 -51552 18537 51764 -6374 -6757 -21314 -54425 -101193 -132777 -60546 -8463 -3192
19540 -3192 2197 9531 17168 83017 102119 57805 -26640 -102558 -122702 -52870 11523 4073 -10758
19527 -10758 12391 61824 32648 33927 90776 115441 119807 169677 139440 127969 144144 188005
19515 188005 284705 344766 473440 611308 731674 769072 792249 788949 724211 668663 564644
19504 564644 428688 369307 307032 192407 119683 128068 89168 68632 54268 8858 61599
19493 61599 134328 135041 175868 232801 244139 239642 221256 166092 122956 70768 49430 37534
19481 37534 43762 47927 43208 53289 40886 23315 57260 71210 72656 17528 2523 16526
19469 16526 -10832 -16134 -5286 -12599 -17135 9373 -13636 42189 86295 106648 69912 108285
19457 108285 166021 119542 93429 173952 192153 158342 120845 74312 14395 11451 46070 56801
19445 56801 47436 68684 68040 34911 44641 3800 -37803 996 43978 70748 65417 51551 26135
19432 26135 36309 -11003 -34031 -27844 -37999 -42014 -15486 -20326 -27872 -52669 -53411 -79784 -39288
19419 -39288 -24368 20647 -15585 16950 56516 25607 4102 -16420 -19174 -13628 655 -50523
19407 -50523 -38903 16005 28706 23238 41409 119029 92068 -913 -48302 -27416 -18563 -3470
19395 -3470 -5736 -9405 -16702 4204 -32544 -1392 8085 2347 15461 29918 5907 -9462 9827
19382 9827 56766 94957 138992 140522 117271 109489 106961 138636 155173 157263 193827 268100 321385
19369 321385 359871 406912 387392 441288 519545 527030 569769 615522 615362 603961 621305 590247
19357 590247 558721 549641 493729 423842 332147 364049 301757 262560 242356 206620 150717 133647
19345 133647 174131 138020 93529 137274 133917 101281 88583 109910 85477 92954 104312 147420
19333 147420 163608 130241 85360 43584 14381 -23679 -42590 -17022 8227 6788 15731 86081
19321 86081 125353 114927 68554 59163 34981 80380 50964 -18608 -63593 -3276 60284 72219
19309 72219 122113 159138 115578 84411 48944 65528 36778 -13723 -26810 -26612 1514 23547
19297 23547 16791 40948 51642 -1818 21808 -9528 -48 66562 103892 137120 117194 129756
19285 129756 161728 132866 108184 102942 101670 109714 92898 124442 121343 52620 18831 74476
19273 74476 88448 78801 117167 152701 153600 82263 38798 11127 21421 24858 28184 83832 123677
19260 123677 106240 81899 60790 50146 61828 57692 50757 86370 124038 144593 88773 79800
19248 79800 60801 38668 2104 -55635 -45038 -34636 -28992 -29114 -10866 45633 96709 73232
19236 73232 71618 96521 70784 101570 143123 104420 20063 -376 16280 13521 38079 40148
19224 40148 53611 24256 39103 133279 143088 122417 101237 101988 99675 74078 89571 108813
19212 108813 86769 98324 83686 81585 137545 125674 87271 91727 111385 79651 71906 71047
19200 71047 79364 97651 89685 71299 67594 75162 49421 53342 45435 34384 -10395 -33976 27532
19187 27532 -10522 -20619 -13946 39550 39221 19913 59641 111329 110057 73980 29780 -19396
19175 -19396 -22939 41451 46862 70943 31813 30547 48557 43539 63872 90347 100662 121855
19163 121855 131357 135169 61997 57500 42752 890 38339 81764 48530 9813 -11571 55635
19151 55635 101750 89175 29366 66993 64609 107051 93458 67408 89555 114973 114196 88743
19139 88743 90237 62244 103604 140382 141341 158515 125625 113637 145630 143331 134184 136778 154591
19126 154591 195547 186295 130527 92289 38011 28362 33337 70342 78523 69508 101575 164927
19114 164927 162060 159367 161912 141590 163332 141597 108075 148248 132274 84968 58867 40945
19102 40945 15420 64500 119225 88684 83617 46117 47662 58582 61000 91530 95667 90211 123091
19089 123091 94980 81260 49771 -25392 -74942 -45880 -38753 7284 63718 112275 119109 96303
19077 96303 90509 141892 144150 126510 98340 89895 105377 87299 73226 135785 171917 132480
19065 132480 118689 115435 53624 22258 23256 46450 70897 130799 155892 158487 138758 76535
19053 76535 59104 16790 16246 40178 100892 79810 93488 131982 157246 106062 55778 90698
19041 90698 88925 53048 63067 21307 12272 47433 60714 21543 23722 84919 55517 59818
19029 59818 78648 100963 136976 193422 175249 135279 79319 72298 109522 94206 45306 49411
19017 49411 37439 38313 46892 29055 49667 129020 195979 194379 114272 91271 104960 76644
19005 76644 85439 82883 81895 91263 127419 163729 179957 178222 184172 177491 184237 173155 145751
18992 145751 78830 55358 82068 96002 81553 92085 71906 14165 -6067 8260 36331
18981 36331 55392 54970 49313 72145 102976 111082 98428 101046 96010 80746 60705 8662 41848
18968 41848 96510 138754 127206 108367 106776 171780 221574 262085 310453 366233 411979 450542
18956 450542 479425 420383 438501 491845 555050 686972 824008 901700 951728 963177 906326
18945 906326 744387 591172 527412 474576 470626 474708 480985 378424 327240 266939 205673
18934 205673 188813 173703 129017 68219 116051 152568 109755 98817 105427 138822 132779 136835
18922 136835 206201 237509 263012 310969 278903 263198 248219 220802 310853 400572 411275
18911 411275 481685 601529 666513 653836 677718 699500 725648 835092 1005131 1179389 1258535
18900 1258535 1274079 1246272 1223261 1206100 1101166 1018368 939537 876602 788192 664870 501357
18889 501357 410385 382342 352693 262404 220754 215525 176905 193118 163299 131804 157800 190109
18877 190109 221168 234545 218619 193453 187673 184097 210859 199529 187588 159602 107047 101344
18865 101344 132716 162946 197119 191125 255595 274652 302385 299590 283355 260920 283535 303563
18853 303563 290317 368657 462401 567689 627037 600927 576109 607284 558774 467520 461131
18842 461131 427822 353615 355936 398074 452225 459242 521241 593490 664530 686790 669970 650671
18830 650671 694664 739762 777015 770311 739177 751072 707423 658851 605848 613350 631901 657788
18818 657788 743947 821147 819260 822450 792785 736241 662442 667239 678854 744332 781561 735599
18806 735599 659336 635254 559050 463141 400469 386460 354709 324098 259618 235523 246153
18795 246153 250880 217179 239836 280293 326547 321157 287744 227624 208696 180061 134370 152058
18783 152058 147112 171102 186561 200950 260110 255468 239483 214289 136966 164934 237480 326948
18771 326948 394017 419982 411875 546257 712805 879700 928653 816178 584506 417201
18761 417201 314508 289808 281466 209615 181740 156597 184856 181649 180349 139947 129752 161896
18749 161896 191546 186074 181934 161623 200923 186223 130114 150211 122031 146788 204713 189158
18737 189158 196103 201490 168829 197926 206011 209031 241316 236784 223455 248864 285031 268703
18725 268703 188376 174534 199997 195298 191376 215633 235083 253011 229566 216350 200749 209545
18713 209545 260101 262303 223226 186761 207456 255516 249477 214925 208212 180458 186178 192973
18701 192973 235318 241970 292431 366414 309264 307888 345119 277762 250110 253699 213145 164356
18689 164356 156542 236373 244117 219407 229422 255643 270709 286041 282158 264286 299805 323776
18677 323776 332599 322619 335731 314910 305182 336270 359241 391382 432058 431343 438663 432955 432300
18664 432300 470531 460103 412882 394773 382727 369109 353586 299399 285194 348459 360547
18653 360547 409375 398118 402733 396549 389210 338564 377396 419940 429749 444031 430919 358858
18641 358858 353612 318642 358956 414001 408964 405866 391354 379695 406119 446929 435803 434816
18629 434816 473775 504038 471398 460654 456094 490333 496217 497243 552381 574027 513182 422488
18617 422488 429375 492724 494691 465137 452544 472392 510991 569639 586488 576729 573291 583156
18605 583156 523075 465835 424484 450042 554674 608733 584038 593938 591557 559447 567632 638802
18593 638802 650989 661489 634994 685391 630852 652466 666491 661520 660110 690892 715973 755640
18581 755640 787103 785674 854491 966750 980714 951710 928364 945850 1040562 1030288 1002680
18570 1002680 996771 981343 947914 936290 922463 934995 938048 976027 1009752 1021446 1073475 1038318
18558 1038318 963887 921458 866281 869721 929181 922422 869172 838636 831691 890137 889613 848288
18546 848288 942415 1030041 1058736 1095804 1092404 1132206 1209331 1266748 1286096 1266191 1176886 1043826
18534 1043826 987626 953114 920080 926011 962594 958059 996127 1041286 1065695 1091194 1118346 1178183
18522 1178183 1221964 1247893 1264208 1180317 1151129 1149732 1075396 989840 985669 1033786 1069347 1149584
18510 1149584 1167430 1258640 1308188 1340637 1407704 1458230 1482600 1491746 1463524 1439196 1447462 1473574
18498 1473574 1509746 1536432 1572954 1676000 1765063 1812386 1876859 1953921 1990986 1954674 1946596
18487 1946596 1948979 1979899 2062189 2146075 2231703 2285023 2367678 2522737 2647886 2794671 2908242
18476 2908242 2974695 2911677 2808810 2815284 2870562 2886173 2936033 3013908 3190266 3459271 3690406
18465 3690406 3904570 4099529 4233127 4344199 4446879 4586055 4756151 4940769 5230730
18456 5230730 5637645 6108226 6574552 7050461 7778159 9112712 11569127 15380946 19495896
18447 19495896 22016169 22226001 20403513 17951355 16819563 17731483 20581511 23983018
18439 23983018 25766306 25196295 22754574 19817733 17903515 17153544 17372419 18143984 19272892
18430 19272892 20707913 22683294 25315287 28734052 33072339 38852622 47219207 60141381
18422 60141381 81822553 118701707 170397041 217616085 238698509 234808645 217024757
18415 217024757 212298811 234186455 259197398 258278773 228812938 177607598 126862604
18408 126862604 92373741 72251012 61334623 56960060 58526511 67249596 84059798
18401 84059798 104149791 117084047 117479082 107138621 92422516 83538967 85903276 99785271
18393 99785271 118192788 127809780 122351485 104042098 79862192 60343326 48589046
18386 48589046 42539897 40294775 41142564 44994598 53149831 67880104 89534067 114089503
18378 114089503 135634219 150745407 159580241 161159105 153142563 134486592 107958028
18371 107958028 79868072 56649078 40680818 30421768 23740601 19184953 15968453
18364 15968453 13612918 11752850 10313130 9208621 8304863 7715973 7297770 7089682 7006451
18355 7006451 7029598 7128521 7214175 7341023 7408656 7397447 7549333 7745633 7847633 8017520
18345 8017520 8335561 8773942 9333530 10086173 11108008 12394809 14017074 16045541 18586377
18336 18586377 21838039 26484127 33651259 44547528 59236544 76261463 92645476
18329 92645476 104930230 111347878 113217200 114722351 119829787 127868112 133254978 131060374
18321 131060374 121268829 108423521 98816884 94813471 94010535 93761445 94184186 97184612
18313 97184612 103560194 110977475 116307358 118544431 118154072 116224421 113940653 112287489
18305 112287489 111117181 109428772 106242208 101271071 94588210 85936809 74978465 61827544
18297 61827544 47998863 35891786 26892707 20825068 16750918 13944319 11992582 10512278
18289 10512278 9289232 8265282 7409026 6705684 6100658 5548048 5129313 4729146 4388413
18280 4388413 4076414 3864020 3669979 3562339 3452683 3376284 3223918 3041170 3003769 3000580
18270 3000580 3034192 3061444 3035380 3006752 2817271 2643888 2473506 2273645 2078017 1941488
18260 1941488 1873927 1773814 1721204 1778147 1845637 1842854 1782145 1783139 1717144 1578240 1556420
18249 1556420 1498244 1371873 1298497 1198468 1108917 1073109 1064771 997936 965097 934222 904593
18238 904593 868570 866584 874939 879281 823500 759242 697522 624915 560910 531486 536732 561080
18226 561080 565281 555136 596100 640258 666072 669420 653578 607368 578772 629287 662932 669485
18214 669485 635617 637586 678289 674417 704601 755529 780103 855456 987491 1032681 1011441 1049895
18202 1049895 1026301 977514 900535 879304 910338 941073 910941 820886 749741 791952 820132
18191 820132 931481 973529 949550 949227 949488 958808 974583 998167 982059 978504 990099 1037322
18179 1037322 1067487 1086771 1035148 952947 996072 973891 843271 838546 900213 959232 906229
18168 906229 884052 899651 942504 1004405 1119964 1236293 1311168 1312751 1346343 1373669 1401987
18157 1401987 1365570 1263210 1166098 1141798 1122355 1055213 1056323 1053027 1051827 1066771 1129540 1279463
18145 1279463 1492439 1883729 2380105 2955949 3476629 3759566 3763762 3458893 2989795 2579572
18135 2579572 2320963 2220939 2253567 2334914 2498862 2672532 2739260 2792256 2871003 2918475
18125 2918475 3035223 3125529 3343810 3706523 4162008 4673586 5232504 6174202 7534462
18116 7534462 9290526 11411775 14005560 17351855 22404606 31471663 49554816 82774994
18108 82774994 121504271 140114450 133376315 105243966 68162874 42117478 27583766
18101 27583766 19200181 14220609 11083474 9038150 7668215 6635689 5938193 5537282
18093 5537282 5508583 5903818 6695583 7635602 8402686 8564858 8002883 6915896 5634622
18084 5634622 4394410 3412310 2749525 2372240 2151295 2076919 2008466 1962427 1910108 1925114
18074 1925114 1986015 2034930 2116933 2219771 2279880 2330734 2422312 2442943 2418026 2384765 2331059
18063 2331059 2218821 2235470 2342330 2499786 2726167 3006208 3368270 3831417 4517425 5693776
18053 5693776 7419311 9438847 10890019 11071301 10079021 8424503 6817011 5696469
18045 5696469 5079923 4813103 4939230 5337939 6029539 7042896 8179210 9192874 9957932
18036 9957932 10594853 11386111 12888370 14984433 16986510 18132560 18305095 18068277 18572039
18027 18572039 20969673 26451140 36389186 50612899 64140624 70237768 66874734 55808793
18019 55808793 42214086 31310224 24203026 20134726 18265450 17902375 18599240 20130635
18011 20130635 22715186 26998993 34276100 46745704 65807148 88379236 105971297
18004 105971297 110675890 100465656 80288494 58525312 41421696 30151357 23262419
17997 23262419 19143971 16775233 15584800 15187645 15477138 16304393 17800446 20254822
17989 20254822 24396672 31517786 42672066 56363334 68573790 76568971 79136681 75704447
17981 75704447 67664949 56867039 45158391 34799538 27436650 22848750 20322227 19411800
17973 19411800 19910416 21665277 25057428 30774591 39158390 49263478 59035021 67216967
17965 67216967 73273688 75536589 71889801 62742957 49817841 36713242 26678725 20093495
17957 20093495 16099338 13847416 12844123 12695163 13128428 14148223 16158977 20013030
17949 20013030 26762509 36093842 44515570 47457597 43833356 35156623 25266804 17648922
17941 17648922 12747841 9852311 8347885 7868514 8033473 8402646 8550778 8168235 7232809
17932 7232809 6067488 5010088 4320463 3928090 3673214 3554505 3575153 3737764 4067734
17923 4067734 4726620 5755957 6872990 7486622 7365086 6554558 5418674 4306164 3460256
17914 3460256 2994981 2648378 2369923 2205324 2085547 1942129 1754733 1499800 1261062
17905 1261062 1090693 963422 872339 810282 772674 776020 793232 755359 732774 735090 745456
17894 745456 702791 710636 712427 645651 630916 647376 621785 578019 589606 591927 658027 769182
17882 769182 817038 897621 961960 966721 904300 852776 780041 825776 926783 987227 1050449
17871 1050449 1095883 1137840 1126968 1138381 1135262 1076487 988991 966938 924540 854007 788249
17860 788249 744057 675480 625347 567941 520289 515561 465653 401606 364984 379001 509490
17849 509490 591733 642183 641701 640124 570855 518739 510508 526881 561641 544081 505319 425055
17837 425055 391950 427932 460910 532538 586539 660343 716588 696447 672915 608749 533205
17826 533205 494514 561109 644767 770506 842270 888893 931788 1027366 1148090 1237636 1170727
17815 1170727 1117972 1066337 996341 987088 941830 905120 821163 787055 821793 842469 911993
17804 911993 947864 982622 1011002 882688 800052 776684 738902 722511 746759 762257 804419
17793 804419 801428 818955 772431 707254 656404 567467 446753 304404 260692 237462 231837
17782 231837 212225 151078 124148 129128 116997 125586 220865 262155 258012 247767 154813 79534
17770 79534 68528 42740 42509 33450 18315 28051 21404 73983 61057 39369 5154 -9991 -1371
17757 -1371 -99 14587 -16394 -39120 -54265 -7731 25839 19955 43775 32486 22813 30568 25142
17744 25142 -3476 -110 -7352 3284 33427 77307 75236 82280 82738 106428 110233 36917 26696
17731 26696 21792 9398 3931 -6242 23251 31979 -7269 -40091 -19374 15065 -13845 60588
17719 60588 120439 70434 56744 95513 100174 92379 91595 94527 102508 80692 30906 16952 57874
17706 57874 94682 159401 141942 141772 125932 87104 95501 89322 101458 111132 133444 110447 71084
17693 71084 63021 42450 64556 108729 116421 65737 64114 40647 24242 61444 111937 130246
17681 130246 132550 102324 67274 110874 150885 192053 223208 205032 234367 246319 283167 258612
17669 258612 250162 262446 281016 323692 360139 335723 365473 391156 293745 230156 272555 322392
17657 322392 381469 402019 396210 396775 361670 304143 285570 276452 290443 347392 385808 364154
17645 364154 382095 406761 299835 243387 185110 177635 218815 230993 220394 250219 250556 195842
17633 195842 186821 235474 272095 290991 329517 334963 353223 402731 460308 544062 607707 585202
17621 585202 620818 650943 720420 867868 1032948 1200616 1375023 1594306 1753611 2037138
17611 2037138 2506348 3105774 3903133 4800096 5643951 6518020 7354420 8009654 8337966
17602 8337966 8378316 8171108 7849346 7646848 7435692 7111398 6804017 6607535 6450570 6325374
17592 6325374 6210487 6041801 5901665 5809843 5658881 5417903 5009531 4625354 4367750 4154831
17582 4154831 3993959 3803436 3676194 3648724 3698706 3651551 3413530 3061818 2770216 2493855
17572 2493855 2216906 1947170 1787050 1732164 1736649 1833887 2018940 2242099 2477519 2755095
17562 2755095 2972738 3112875 3188859 3307847 3480415 3565597 3544634 3496817 3389484 3304134
17552 3304134 3144855 2885713 2630200 2435578 2227040 2056908 1869831 1647990 1386731
17543 1386731 1200683 1064565 969861 869552 713715 610354 523726 478231 477117 399709
17533 399709 332718 304026 266070 252506 260492 280995 280741 244595 192461 166801 205153 232767
17521 232767 252740 267576 258654 237366 271905 304574 381309 440907 482788 476417 437887 441302
17509 441302 400222 324622 264001 229166 211516 216427 205353 142246 113610 141582 179416 253157
17497 253157 368090 429216 442704 418391 342421 304977 303336 287064 321113 328968 309598 308881
17485 308881 246565 203580 175271 146735 187145 222437 261866 240375 276424 307210 287063
17474 287063 287768 286669 276332 286826 386041 465739 473720 516818 576262 576091 551923 510277 446467
17461 446467 364074 360184 341932 354296 355651 372838 456872 487924 537903 620883 675685 711885
17449 711885 795950 964946 1256119 1619308 1991632 2397951 2782162 3124633 3363420 3401282
17439 3401282 3272672 3153448 3032584 2966505 2878306 2790206 2637541 2476869 2347530 2275536
17429 2275536 2298749 2346886 2353544 2276172 2155034 2097985 2049469 2036587 2068432 2081393 2022205
17418 2022205 1887630 1682855 1412582 1138649 907701 721663 563641 503735 483355 436951
17408 436951 397480 337768 297296 284358 268843 308277 319277 336586 401271 422715 493029
17397 493029 607315 764294 910846 1187881 1551429 1898398 2137456 2277998 2368156 2388154
17387 2388154 2383333 2327596 2297709 2283917 2198264 2046560 1904131 1744263 1572518 1550683 1645143
17376 1645143 1804043 1981125 2114917 2159203 2139795 2075113 2018024 1956963 1896209 1801011 1602301
17365 1602301 1368463 1087257 820371 654319 509334 371978 295001 264691 216971 203884
17355 203884 139057 80193 70653 108977 102997 89733 103745 136658 110779 117318 69503 79819
17343 79819 73028 133945 133323 35585 -16334 22545 41069 67766 62715 23502 30622 6376 -15239
17330 -15239 -19797 -17315 8773 38617 73233 87471 48080 13571 23156 41730 13924 -24101
17318 -24101 -53021 -61550 -44658 -5848 10210 2177 -22689 -34547 3478 -13852 -53824 -57644
17306 -57644 -18226 -26959 -49702 -77160 -65303 -13293 -9814 -11916 -14658 23843 41329 23409
17294 23409 18480 14868 -32625 26 13671 -16991 -42242 -36142 -77834 -63282 -63777 -75189 -54404
17281 -54404 -34162 -37866 -7131 63335 100008 68813 60615 25381 92892 144691 98174 68544
17269 68544 5386 -48423 -59270 -41670 -53464 -22926 -4978 -2219 19343 43885 32151 12942
17257 12942 26401 26683 -2855 -56064 -24028 -57441 -99662 -78255 -60260 -76770 -84433 -58725
17245 -58725 -50425 -20276 1768 1671 -15518 -21352 -25824 -33725 -51338 -47623 4904 71012 45120
17232 45120 -25303 -33329 -18383 7027 30367 36859 41829 94366 119804 59309 48699 63927
17220 63927 40249 77723 97201 31910 -1591 26453 10967 11212 16225 28166 20783 -46247
17208 -46247 -65498 -52007 -44996 -83138 -73789 -69474 -129316 -144818 -106621 -64894 -54001 -29917
17196 -29917 -454 33835 -20697 -51698 -11569 -34680 -65258 -124806 -155640 -136451 -88606 -39393
17184 -39393 -1765 10528 4767 -75268 -90589 -101359 -69219 -55229 -68747 -96347 -81430 -35774
17172 -35774 5460 -18872 8943 52772 89351 67294 5377 -47935 -92315 -100336 -99766 -113520
17160 -113520 -107985 -95666 -79923 -54265 -32245 -47343 -42854 -70776 -34651 -335 11390 33348
17148 33348 -19296 -63685 -10102 -9415 -37771 -70593 -54672 2622 14608 -26867 -45138 -44823
17136 -44823 -95360 -91331 -96094 -86131 -56101 -18343 -10177 -5761 14453 -17894 3710 13576 48965
17123 48965 70521 6697 -15601 10115 -30548 -65186 -45859 -21777 28061 47512 10854 -43304
17111 -43304 -35273 -51943 -91336 -141107 -193441 -195396 -141646 -102445 -80403 -90541 -60144 -52897
17099 -52897 -39099 7066 37145 34894 2427 7166 -38807 -41968 -18297 -37109 -46604 -59387
17087 -59387 -39373 -56525 -31475 -59382 -59135 -78407 -82017 -96939 -144308 -172275 -78050 -73494
17075 -73494 -72849 -40018 -4437 -19321 -37713 -58377 -54982 -31021 -5313 11435 -69416 -53707
17063 -53707 -47516 -36892 -8747 -10492 34025 37879 7950 978 16516 25880 48888 30986 -1658
17050 -1658 -41904 -28934 -24155 -4382 -4012 8783 -8280 -31054 -74770 -47356 -54553 -85702 -108340
17037 -108340 -123068 -122206 -118227 -88495 -24405 -23497 -58260 -83552 -91900 -84968 -92236 -96274 -56275
17024 -56275 -32366 -68288 -93552 -96927 -81956 -93067 -153245 -158267 -82925 -110023 -135046 -92962
17012 -92962 -84108 -59635 -58817 -58148 -39289 -36432 -73017 -97453 -85790 -58537 -36368 22924 14209
16999 14209 23069 56552 77407 -1167 -46896 -59602 -62552 -68117 -52356 -20803 -5250 -5802 -44864
16986 -44864 -70789 -88282 -133476 -181337 -163806 -51639 14393 158 -41083 -33154 -23743 -85622
16974 -85622 -119761 -69520 -70878 -58517 6331 1208 -38988 -92142 -101413 -82961 10907 26025
16962 26025 63025 64881 -6388 -38548 -9220 25401 17695 -33961 -42094 -29051 -29388 -62507 -64535
16949 -64535 -36489 -52698 -19761 -31526 -67130 -109826 -146020 -113869 -49832 -42064 -55848 -63464
16937 -63464 -91392 -114380 -101731 -33088 -47571 -68231 -64244 -115776 -111562 -28123 -51923 -54177
16925 -54177 -308 -943 -36363 -134404 -99083 -79282 -105254 -75396 -63397 -94466 -134925 -166385
16913 -166385 -184017 -159541 -154357 -127538 -174252 -171761 -155812 -97330 -55361 -34217 6379 28597
16901 28597 -6665 -61324 -105353 -133889 -125298 -96917 -25255 -51580 -113145 -77499 -29398 -63331
16889 -63331 -42775 -29182 -17208 -21039 -4064 24929 15296 -3493 9397 -14035 -10867 -44600
16877 -44600 -9770 24488 95296 116643 70734 8742 -38328 -22587 -59726 -103662 -62818 -22835
16865 -22835 -51838 -115816 -114113 -88021 -64647 -54910 -66315 -58051 -59158 -73539 -85151 -21108
16853 -21108 -20154 -58403 -62111 -27338 9426 -5121 -9328 -25479 -26048 -22957 -49462 -66451 -82511
16840 -82511 -77026 -76335 -92598 -68942 -68344 -98906 -80362 -5586 821 -1594 -18199 -37576 -24235
16827 -24235 -23327 -4709 -35908 -42311 -49934 -102821 -95691 -74993 -60558 -74371 -109107 -170535 -147226
16814 -147226 -68510 -25395 -45001 -68439 -49162 -36459 -39625 -90644 -96306 -59392 -33220 -62681
16802 -62681 -125977 -151067 -138665 -82985 -32287 1191 -14653 -62361 -59307 -43924 -45422 -16855
16790 -16855 -28386 -37487 -21028 -55385 -77325 -57097 -72025 -81875 -120873 -125574 -118007 -89901
16778 -89901 -150641 -212141 -165205 -95233 -55776 -89119 -71247 -21538 20835 17877 -41186 -33669
16766 -33669 -44738 -75629 -67888 -56611 -49393 -43983 -38141 -35853 -73444 -74904 -69497 -68622 -67689 -39071
16752 -39071 -37366 -56408 -69716 -68786 -16375 -49042 -69657 -65982 -30047 -41048 -106635 -133706
16740 -133706 -122452 -81666 -15289 -36151 -83280 -95289 -48480 -17610 -45364 -72780 -99949
16729 -99949 -89063 -53151 -50240 -80939 -33562 -15847 -16438 -14358 -7328 -21357 -81527 -91091 -88979
16716 -88979 -75654 -73550 -23449 -9117 -36990 -57448 -43341 -36647 -2228 39798 37985 15402
16704 15402 -6424 -7878 -17522 -51085 -103481 -28196 -7385 -75407 -94519 -84062 -112138 -144832
16692 -144832 -124993 -62683 24036 42554 6261 -33495 -15693 16011 40768 12221 17793 -46506
16680 -46506 -58245 -52086 -68189 -101319 -75633 -88023 -84209 -64946 -54682 -29597 -12237 -22022
16668 -22022 -75749 -82453 -69836 -60529 -81649 -77006 -70438 -88491 -63101 -125260 -171182 -110297
16656 -110297 -60626 -57488 -94066 -77792 -62704 -101690 -148409 -97925 -48764 -79261 -53438 -34720
16644 -34720 -29985 -14406 13265 -35642 -55860 -119437 -171558 -145930 -115526 -56862 -26939 -63972
16632 -63972 -99165 -113897 -134180 -110857 -87939 -43856 -52556 -42998 -40649 -943 7245 10262 -3983
16619 -3983 -66277 -41013 -11945 630 26290 33210 26474 -65652 -69278 -25326 -32126 -10488 -34881
16606 -34881 -66440 -106759 -121903 -97645 -71092 -56510 -78542 -117636 -92112 -42798 -90503 -139649
16594 -139649 -167101 -119646 -96615 -47961 -25307 -91221 -64134 -9318 -14029 -74932 -77047 -75259
16582 -75259 -89841 -45146 36487 50027 -25697 -115366 -148453 -98779 -32790 -11617 -34228 -49587
16570 -49587 -94694 -98616 -82258 -80954 -8161 40477 64200 72324 45647 25866 3864 7110
16558 7110 25731 18226 28600 19543 -11537 11593 -10207 -33185 -97584 -134691 -133952 -110438 -89604
16545 -89604 -103896 -100227 -61654 -60960 -77036 -19132 17001 -14231 -42788 -60924 -24508 -72358
16533 -72358 -107533 -118772 -70329 -56948 -79556 -99647 -82323 -38757 -45253 -103149 -113898 -112397
16521 -112397 -134417 -102515 -41562 -35635 -51125 -26348 -38238 -71098 -56787 -25086 -54533 -68149
16509 -68149 -81913 -57421 1598 -22026 -37564 -30189 -22039 5583 901 9108 48879 42640 52435
16496 52435 36712 -11763 5230 45815 1997 -15906 -74960 -131375 -162738 -114735 -107337 -32456
16484 -32456 -13954 -28548 -71011 -46832 -64729 -41041 -49699 -71673 -75443 -44411 -75911 -78351
16472 -78351 -54729 -67046 -93972 -69866 -56947 -24523 -29009 -61956 -134531 -114395 -86671 -96467
16460 -96467 -116093 -85468 -92118 -74273 -13643 -11716 -25709 -101805 -106854 -122782 -93529 -61808
16448 -61808 -70906 -17231 -347 -6527 -3111 42846 62954 48318 34202 37513 64579 31693
16436 31693 -25958 -73638 -107260 -54306 -37848 -69812 -79083 -53568 -47762 -20427 -64372 -83664
16424 -83664 -64376 -59250 -61350 -52461 -11003 -73131 -115814 -117505 -73259 -55192 -48698 -10420 -22190
16411 -22190 -80929 -170381 -150087 -101050 -113335 -124995 -61563 -8327 14446 -52730 -48823 -55104
16399 -55104 -96353 -129074 -121853 -101971 -31490 -38959 -100635 -91767 -105368 -113348 -79067 -25844
16387 -25844 -43768 -39052 -66950 -112477 -193318 -187036 -172275 -98787 -22374 -18014 -28885 -4595
16375 -4595 -49350 -61301 -103710 -92886 -7133 13429 16381 -20101 -47841 -36121 -14012 -37118
16363 -37118 -31504 -7419 -607 15059 -23628 -69488 -45620 -18622 -41553 -119562 -134542 -120188
16351 -120188 -80988 -80388 -87750 -113650 -97322 -96940 -71377 -27716 -5807 -14292 -17707 -10807 539
16338 539 13827 20021 -7533 -18821 -16216 -10319 -17174 -89754 -81500 -64957 -55763 -54802 -70531 -17860
16324 -17860 41571 8308 -9162 -26769 -57943 -51630 -51136 -60963 -50604 -6835 62394 73116
16312 73116 5017 4575 10135 -28525 -35238 -8196 -5777 -37291 -52951 -71979 -69371 -44542 -62207
16299 -62207 -88986 -99998 -130054 -133215 -165287 -152506 -161426 -75975 -12466 45533 22944 21827
16287 21827 -14372 7709 65765 14442 21962 12999 8387 31741 18754 7424 -7189 -44972
16275 -44972 -15692 -23984 -43848 -62939 -39822 39 4316 -13975 -11476 -53041 -84845 -110947
16263 -110947 -151451 -147884 -87850 -75558 -41665 -40572 -46775 -12973 71 32318 12005 -12608
16251 -12608 -20640 3933 44541 41487 13815 12095 8493 -19979 -86623 -118943 -86677 -86801 -52645
16238 -52645 -23923 -62017 -94531 -90733 -97124 -64388 576 12775 -53311 -112898 -106730 -87364
16226 -87364 -102589 -100036 -105558 -96310 -58377 -65747 -72078 -50617 -50247 -64911 -64497 -49514 -100062
16213 -100062 -108981 -57449 -54413 -102181 -42302 -39925 -81562 -93011 -79310 -21600 -44317 -12512
16201 -12512 40673 52333 32758 43457 82193 18820 -18205 -29193 -22189 -67904 -103054 -86072
16189 -86072 -54172 -36053 -42459 2302 16329 21683 15648 -13383 -45021 -47221 -35977 -17655
16177 -17655 -74325 -97572 -80915 -118337 -139646 -41299 52004 28098 -31894 -5130 29189 28081
16165 28081 73507 66423 42813 9766 -33830 -34243 30398 26765 2710 -13628 -57388 -65505 -55984
16152 -55984 -62341 -83180 -69521 -63317 -46230 -46879 -38356 -64955 -92130 -59268 -83353 -116388 -40783
16139 -40783 -41977 -107128 -132002 -89526 -93034 -36684 4432 -51468 -35718 -10088 -5960 -55921
16127 -55921 -87807 -73379 -60200 -129370 -163023 -171328 -146812 -85116 -57019 -58742 -62430 -65688
16115 -65688 -90694 -87974 -64753 -44320 -27649 13183 21009 51107 57486 67129 19492 -37409
16103 -37409 -67382 -57555 -43548 -45955 -84143 -119136 -84572 -46822 -15726 -9574 -23402 -49981
16091 -49981 -33942 -48820 -46974 -82123 -164876 -137719 -133703 -119922 -96343 -117472 -116639 -67502
16079 -67502 -86984 -55473 -67985 -83995 -94378 -133419 -105223 -67079 -60973 -60758 -55782 -54815 -29102
16066 -29102 -23521 -57438 -63337 -51970 -10835 -10660 -28537 -56032 -13275 28989 5494 -41724
16054 -41724 -66295 -25817 -31139 -96055 -167563 -138807 -59071 -52197 -59486 -88623 -69139 -61668
16042 -61668 10408 2765 -4340 -16186 -266 -18050 -26678 -22774 -34308 -49889 -15947 -31600
16030 -31600 -79886 -90780 -90401 -47977 39152 8788 -40857 -65405 -35985 37107 44264 28903
16018 28903 53586 52045 39548 26599 13606 -21963 -25449 -80188 -65175 9505 34625 -22411
16006 -22411 -76677 -87004 -94902 -103595 -72568 -12280 26981 916 8377 21758 -41785 -42333 -27486
15993 -27486 -12895 -8414 1898 12052 -6312 10093 9559 -29724 -30361 -57353 -127084 -87758 -42310
15980 -42310 -31118 -43270 -50630 -10345 14026 5056 -11278 7677 16915 24515 6242 -32259
15968 -32259 -29676 -14109 -53854 -120676 -119728 -33719 7651 46085 48497 38920 33976 -13640 -18481
15955 -18481 26345 57803 5850 14474 -37611 -11571 -45798 -83232 -106850 -67216 7428 34137
15943 34137 -11375 -73479 -58763 -37941 -66421 -128943 -135215 -105367 -62641 -80530 -125452 -141248
15931 -141248 -94214 -81433 -88617 -84622 -63834 -93920 -74367 -74411 -36365 -43268 -54377 8468 11309
15918 11309 22855 10576 -71103 -139436 -101179 -34882 -22645 -29560 -31233 -31158 -22399 -42293 -63381
15905 -63381 -91508 -101674 -26582 18712 76957 90204 111501 133186 77475 58309 37281 -8518
15893 -8518 -59802 -15330 -7367 -18157 -40478 -30200 -64676 -38402 -12765 -11291 -70494 -72168
15881 -72168 -28246 -11113 -1204 42883 12568 -1769 20731 55101 29128 10539 7517 -19212
15869 -19212 -33731 -59025 -75256 -97477 -64049 -62920 -73629 -36930 -1134 -31448 -20582 4674
15857 4674 18419 2075 6635 -18947 -26776 -23239 -19685 -19012 -12515 -11700 -15507 -29049 -50541 -70719
15843 -70719 -88156 -62894 -69386 -64030 -39251 33276 9454 -85446 -126105 -137750 -40111 20314
15831 20314 28553 19708 8878 -38742 -37511 -69761 -77552 -42752 -15045 3133 -66956 -39801
15819 -39801 -38938 -43377 -58591 -40506 2420 17907 -449 -25118 -14629 -66541 -104433 -149813
15807 -149813 -119620 -78871 -21003 60330 88052 42544 28951 31791 19633 9675 -4992 1152
15795 1152 -40315 -27195 -32388 -49764 -44600 -17485 6700 7457 -30538 -55556 -37719 -13315 -13669
15782 -13669 -3371 14937 52114 66802 39323 20759 9032 -39316 -77685 -38020 -1732 -40650
15770 -40650 -50252 -29656 -16763 48245 89081 61143 2836 -8115 29786 59245 95625 63399
15758 63399 -34581 -18742 2949 15178 -7047 -114061 -101679 -94798 -108932 -74431 -114025 -126936
15746 -126936 -47217 -48042 -72290 -68952 -7477 -47337 -98796 -92051 -124531 -140439 -104165 -79455
15734 -79455 -61526 -75908 -38363 -19896 -25626 -72482 -74445 -80930 -69195 -53966 -48493 -42803 -37476
15721 -37476 -46228 -103570 -109573 -83667 13305 61271 31705 10564 -23964 -26174 -5585 -32834
15709 -32834 -31675 -14291 -59268 -35349 -33630 -49845 -76246 -136073 -173321 -105252 -91174 -137310
15697 -137310 -53176 53659 38383 3342 -17999 -8300 -25827 -34979 -13483 1245 1805 42411
15685 42411 23725 11967 42494 -31602 -12047 3030 -6818 -72819 -110073 -117449 -136211 -117567
15673 -117567 -125036 -143964 -172749 -128266 -70470 -111203 -118845 -62500 -58860 -27488 4894 -26556
15661 -26556 -46208 13430 19124 6291 -30925 -80198 -103287 -115413 -141200 -84816 -65846 -91506
15649 -91506 -111179 -44040 -33495 -101918 -36254 36540 5688 -13165 -43011 -43697 -39207 -31984
15637 -31984 -34246 -115606 -140459 -124454 -82618 -81044 -145852 -175512 -136302 -24303 7865 36617
15625 36617 14832 -42538 -52846 17795 6696 -60130 -71008 -39966 -10932 -22263 -27941 -48896
15613 -48896 -63246 -129293 -136640 -84537 -43633 -4753 21697 -10535 -24184 -11620 -39746 -69480
15601 -69480 -23664 50363 68343 41746 16830 -6081 -6978 -64218 -75936 -61677 -61008 -81112
15589 -81112 -59966 -54999 -74921 -77373 -5412 22265 -1605 -41430 -57967 -77932 -128543 -105993
15577 -105993 -124502 -127347 -75080 -65830 -96048 -16754 27404 26033 19455 4214 -8957 33108
15565 33108 81597 66918 -10897 -27768 -10477 -4623 -18801 -47026 -7057 550 35829 31478
15553 31478 7541 6994 23718 33080 36181 29410 34613 69114 53862 36065 63544 108918 85015
15540 85015 -4698 -33537 -56582 -65867 -46024 34869 47771 53496 82565 57080 21138 -34071
15528 -34071 -40877 -1701 17332 14696 53815 60598 5565 13040 -33253 -72443 -26407 -34707 -51518
15515 -51518 -104085 -126478 -99060 -74420 -70577 -23142 20406 43461 41093 8790 -3703 -19513
15503 -19513 -69015 -56221 14697 56311 -12125 -46814 -22482 -5488 -11347 -31336 -14143 4301
15491 4301 31544 26404 -23957 -49989 -30351 -76166 -65044 19412 15953 48165 43004 28307
15479 28307 -24868 -9040 -938 -52368 -21509 -65924 -53919 15298 12566 -16889 -4351 2346
15467 2346 31993 42449 28220 -13133 69873 98535 80783 65411 26476 64522 99367 61810
15455 61810 72154 70934 58111 20511 9264 19395 15588 13921 18446 65790 79251 36269
15443 36269 -28286 -14417 25363 41919 28511 35051 31374 52894 18351 -53131 -101018 -91844
15431 -91844 -65424 -62202 -83817 -163902 -170634 -120348 -82957 -82594 -142138 -158301 -168080 -137003 -114866
15418 -114866 -146853 -112710 -83669 -103687 -141383 -142377 -119501 -47351 -94641 -90204 -39120 5018
15406 5018 2975 7494 -14060 -48676 -53291 -43858 -57066 -41365 -25216 36781 54882 31941 -9848
15393 -9848 -25428 -13033 6536 2501 1787 -44511 -96173 -139774 -128399 -56891 -18316 20831
15381 20831 15731 15014 7683 23005 6551 -54112 -70350 -61432 -8380 40117 40389 6798 -7305
15368 -7305 -49274 -124203 -133745 -84783 -76527 -45368 -29411 25 -26185 -68337 -50378 -59652
15356 -59652 -70721 -47542 -37464 -60919 -33391 -5698 -35711 -55590 -63868 -63596 -54674 -44301
15344 -44301 -70411 -101995 -74143 -36749 30245 41595 65146 53741 82000 60377 51052 -5206
15332 -5206 13682 32027 20564 9164 40093 50918 3316 -43084 -60607 -7877 23373 19854
15320 19854 21342 28077 39768 32951 -5486 34331 51097 22845 -24080 -10742 -11630 -8049 -17932
15307 -17932 -39188 -39709 -15046 -29248 -30578 5886 18305 8131 -34238 -22427 -25616 -24018 -11324
15294 -11324 -58266 -66488 -17762 23826 26819 10677 48234 45800 6603 -2002 -16417 9265
15282 9265 41955 -8099 -70321 -83573 -88569 -63693 -14396 52231 42284 -28707 -94610 -135030
15270 -135030 -146596 -114105 -37888 -4357 4999 -61032 -67545 -67493 -41570 -42411 -82814 -80078 -76847
15257 -76847 -65254 -77854 -98990 -70196 -75223 -20045 18703 -3004 -40144 -35693 -51362 -39808
15245 -39808 -64717 -108681 -81280 -37241 28558 -23184 -39667 -29457 13789 31877 16104 -16263
15233 -16263 -36680 -5740 55531 55297 -721 3560 52867 29383 13755 -26003 -18765 -39499
15221 -39499 -22384 -6476 -36855 -18719 6327 39795 41307 38658 7630 -13290 -19727 -48483
15209 -48483 231 -14172 -15094 -2645 7649 31730 43722 -46664 -32049 47280 74188 6008
15197 6008 -61927 -40897 -32681 -78972 -118585 -77816 -30827 -6354 -18434 -26215 1044 -30201
15185 -30201 -84096 -86703 -17795 10792 -67117 -71179 -16173 42473 58702 53661 76937 48208
15173 48208 21216 1838 -23874 -45493 -4226 39335 14368 3688 5919 -20989 2683 -23599
15161 -23599 -39428 -79426 -29484 -39513 -35473 -24896 4668 22997 34801 21771 35582 -5991
15149 -5991 -32509 -8311 28789 49464 -8914 -32660 -9056 -3673 -41602 -73849 258 32719
15137 32719 84920 102635 53183 24589 42089 28010 -5233 -10498 -42022 -52295 -72822 -31826
15125 -31826 1573 -12093 1311 -1760 33025 31145 42385 35072 34381 431 -77409 -87800 6553
15112 6553 15860 39054 3320 -11568 -23993 3344 2335 22930 55032 53303 21721 41395
15100 41395 53515 13681 -34696 -39290 -23844 -18894 4695 -25931 10682 12795 35901 40664
15088 40664 28420 3102 11137 49733 88627 71008 100389 66540 8593 19310 19960 -9607
15076 -9607 -20475 -27532 -25329 -29870 -27356 13912 -3274 -20241 5083 68493 76068 77230 48880
15063 48880 49492 48163 48104 14793 13986 8582 33425 55338 68115 27015 -36216 -70762 -99995
15050 -99995 -120531 -77881 -42261 -57897 -48182 -17807 -25918 -49367 -31318 -56806 -25572 -33456
15038 -33456 -96974 -75162 11739 15535 18922 35351 74037 115089 146820 131947 97628 79044
15026 79044 107942 144216 142091 98259 60983 70432 90133 79135 36056 -19033 -25958 -11007
15014 -11007 16538 21076 -21857 -14934 1324 -6466 -10495 13841 -20108 -15906 -3286 18098 9779
15001 9779 30816 48752 39627 19671 28155 75169 73730 11582 55837 84678 77481 85307 69224
14988 69224 71812 108501 88265 29469 10454 16469 -7299 -11341 40405 47806 42798 67915 78744
14975 78744 29701 5724 26694 32714 52667 42161 -4282 -54247 -58320 -11830 2343 -3712
14963 -3712 891 -39431 -45747 -39232 -14654 -25352 -23140 -7449 -2720 -13166 -56451 -66824 -69335
14950 -69335 -89567 -117250 -179884 -153217 -76770 -27186 -31622 14951 45144 16138 507 -48904
14938 -48904 -29872 -4556 837 -21823 -14865 5801 32504 2344 37034 49747 56425 105114
14926 105114 78722 26638 -24162 -18909 -29069 -30633 -27585 -51443 -54859 -42652 -43992 -39302 -33083
14913 -33083 -25302 -36196 14268 41811 6418 -15982 8993 10776 -33251 -33177 -4437 -14138 20214
14900 20214 -1977 6067 32077 91417 53115 15297 -4095 -3173 14892 -8816 -15335 5535
14888 5535 10695 -14851 -347 -12336 -18576 -2437 -22843 -71861 -59198 -67597 -63815 -60416 -69778
14875 -69778 -80464 -64879 -74199 -53639 -25770 16439 37344 -28449 -57316 -21331 -7829 -15515
14863 -15515 17213 62851 15745 2064 8808 -7684 21149 79738 77052 37503 -8137 -42196
14851 -42196 -18658 -22631 -43860 -18243 50052 55171 -10744 2161 1680 -30103 -34792 -32553 -10894
14838 -10894 -5216 241 -9479 18388 69515 19277 -5459 45584 48141 13633 9568 68642 85407
14825 85407 50455 83791 127573 127787 89329 62208 105315 85815 48815 35516 66899 59528
14813 59528 52864 -3738 13805 22300 -18722 -77253 -89168 -49955 41718 57451 24905 -8909
14801 -8909 -48652 -30111 -47873 -20266 23235 9977 -42224 5442 12951 -25458 -2859 79032
14789 79032 144737 110189 72245 51125 83370 165277 228764 223705 186477 191217 136575 77045
14777 77045 62298 80730 85085 95486 -9129 35932 45161 90255 98463 50041 68870 87419
14765 87419 75217 71365 56107 1656 -39927 -50015 -69881 -56923 -4122 2250 33329 45774
14753 45774 19702 -69550 -67849 -57701 -79588 -79420 -74153 -16643 2242 6539 54965 57565 25634
14740 25634 7462 16136 25846 77523 110034 61501 -21001 -51449 -51991 -42301 -45230 -13395 12627
14727 12627 68314 29035 -24115 -20457 -11104 -14560 -36199 -56295 -7023 36546 23706 28216
14715 28216 -15823 -29322 -21968 -33191 -13594 32505 4807 -25637 -23328 13341 -13146 -40587
14703 -40587 8416 25274 34456 2727 -28518 -45421 -26747 -14646 21529 40723 22809 30222
14691 30222 6361 56636 98882 18499 -17951 605 41445 81305 104352 82392 56285 -8569
14679 -8569 -57085 -51469 -76194 -57065 5402 78601 86064 94246 55142 29217 20741 13748 -4081
14666 -4081 -55192 -18469 11273 3338 47804 40256 42917 28717 -6328 17805 48238 54466 26982
14653 26982 32070 34666 -12744 -36750 -2323 41324 22107 50984 100137 104943 72955 68272
14641 68272 76168 46512 7379 17426 -1591 -63202 -65453 -5363 2672 12625 31930 35925 42154
14628 42154 42193 39994 32176 -23628 -58210 -33127 -35882 -24 39457 15880 71817 63911 29052
14615 29052 36631 90010 106885 135251 137475 151607 108126 131596 109881 56451 72447 82242
14603 82242 117945 129658 96682 54045 47012 54770 40233 22424 -18646 14689 37813 5759
14591 5759 -288 8487 491 21459 24482 57442 41220 60153 27056 -45622 -7286 59654 60769
14578 60769 103518 116807 109610 71108 33845 12366 -19016 -56185 -61751 -33192 24534 12032
14566 12032 24306 42386 66107 111928 107870 76843 90871 76425 41790 47698 56278 26475
14554 26475 15233 51632 23224 7729 -13864 -4367 49971 53926 58319 49282 32718 10597
14542 10597 -10015 39801 33945 18956 35626 -3575 -12313 -12818 -5947 -2227 2099 29124 -40726
14529 -40726 -30744 10965 9199 47151 58070 60860 46138 33292 39265 61573 87418 87259 50673
14516 50673 61462 70705 130657 94448 27335 -7267 -13694 42844 19879 55812 92388 102186
14504 102186 117876 85192 100619 105582 66064 34785 14056 25855 54382 71328 73437 70478
14492 70478 68032 98320 100517 90671 46100 6284 10855 32907 21904 6552 -27640 -24470 28630
14479 28630 30978 23317 67525 37365 -15867 27877 27291 97245 118648 101309 102501 53087 49170
14466 49170 98551 108204 78536 79257 73458 25661 23477 81536 108237 103921 45997 16715 43338
14453 43338 65848 91391 117371 138418 73985 22156 55409 67306 30618 47720 67186 37695
14441 37695 9404 62067 72580 79921 89403 140596 189813 213015 218010 210747 179977 151904
14429 151904 147579 67914 57239 54190 40147 26211 30999 79740 57225 28759 -2612 -33449
14417 -33449 3947 80771 90330 104721 109819 83672 -1098 -12845 17508 54219 51381 36663
14405 36663 33151 31354 8513 58760 120523 50277 -34032 -108100 -75777 -28857 -16148 -25147
14393 -25147 11041 59396 37017 36895 86293 85613 33772 32539 1504 -3933 28348 64423 19257
14380 19257 -23011 23823 70612 54706 24229 24842 32763 63842 63012 62102 55437 78276 73023
14367 73023 68506 37264 -13792 5842 75830 81513 60441 48775 62532 21634 17281 21061
14355 21061 48006 67725 81397 91251 66013 21695 40787 37553 53837 79209 101426 98119
14343 98119 100834 56814 106638 169237 243306 262343 231459 199678 134329 84253 57780 56755
14331 56755 114840 174396 186334 146358 87447 106347 93552 77565 141804 131827 62527 87054
14319 87054 172759 211069 205480 157898 142395 129297 151782 153027 147735 84877 60099 100688
14307 100688 112823 148102 192833 176064 101321 78025 95478 68071 78432 160590 224545
14296 224545 213526 133557 92339 77444 94898 81369 35872 41032 83460 98263 57179 48069
14284 48069 86111 77331 89401 98404 84324 74145 63030 51296 12615 -27636 -3410 34562
14272 34562 55568 48492 38458 54143 79330 65473 25327 18520 11239 -11916 -562 34449
14260 34449 78895 117543 104833 118438 121072 127937 129060 126954 112192 85336 92708 60112 76174
14247 76174 91079 85815 82554 114236 177486 188797 227652 184611 162609 171725 154815 77222
14235 77222 78666 87997 125715 158028 124179 91532 92565 101719 33033 -18429 20513 91796
14223 91796 102145 98618 39359 8371 4820 12560 51920 47476 108598 135399 93815 24191
14211 24191 68596 106799 97894 85233 83411 35306 29032 64 -91644 -29977 45191 74043
14199 74043 100021 83199 33645 -17908 -3810 47273 55376 40062 3269 -43900 -23833 42415
14187 42415 103209 95028 96871 105539 80764 76342 82816 53216 21157 47688 104819 125324 107710
14174 107710 81638 105318 74876 67771 125429 177160 192196 178481 76005 32645 43942
14163 43942 70107 64991 38529 29649 34855 44882 75492 84121 119619 112494 76439 82850 119244
14150 119244 129065 71586 39885 48949 68801 110625 65985 68562 109216 105076 109986 83673
14138 83673 46518 25219 55007 140241 162026 126952 130919 124696 85383 75431 113347 162088
14126 162088 155858 123984 104866 135139 177721 196375 226341 220881 191013 161384 151410 149854
14114 149854 162809 188888 175749 178545 142235 125111 129148 154081 153798 133140 90617 84842
14102 84842 133940 132783 177331 167510 115544 62779 41293 54415 76839 96340 127264 131407
14090 131407 81422 125737 147183 147353 187856 149724 95611 63869 71362 77137 33080 -18188
14078 -18188 2411 57225 70411 70121 80100 78426 49806 110283 182000 201088 145836 140617 120159
14065 120159 100496 152858 175675 157646 66339 17640 53319 87003 141261 179103 199826
14054 199826 187292 178920 166488 137029 130242 129671 126298 135722 137390 177943 246276 259061 204002
14041 204002 167084 148772 166194 222135 207699 217944 230673 248128 252449 266604 267467 219527
14029 219527 191720 217464 200567 186597 232060 246741 304829 338773 365497 349331 358004 389119
14017 389119 402629 411974 454460 491829 464623 502586 507582 542819 556180 572094 638861 736338
14005 736338 774138 849883 995487 1096508 1196666 1374031 1640199 1994776 2347843 2802835
13995 2802835 3410312 4267857 5501770 7178563 9222233 11498162 13877087 16234574
13987 16234574 18313014 19876851 20659198 20704237 19897593 18248187 16043445 13643836 11261567
13978 11261567 8990253 6957829 5251034 3972899 3134840 2503347 2062307 1744603 1430169
13969 1430169 1234202 1025724 897236 835035 759848 663933 630340 608972 532132 488657 445341
13958 445341 376390 285880 227714 283952 286542 234094 243526 277256 243079 220331 169566 129602
13946 129602 151311 178450 197077 167083 150005 119206 97187 84646 111067 141579 184312
13935 184312 189307 200226 238223 248515 180886 170421 164588 110420 105357 136839 170042 179137
13923 179137 138124 136904 154526 184441 208078 240484 208985 172943 217885 188121 154887 125652
13911 125652 144240 162754 140044 118534 121067 117005 81306 138188 136496 98210 116824 130416
13899 130416 134232 80107 48974 23085 66744 113443 139825 131437 38765 27834 34558 43114
13887 43114 45270 55469 37145 21475 23912 26695 35284 58981 40371 57007 113659 92193
13875 92193 68268 36441 47691 54720 24088 46152 77373 124096 175993 134079 149347 183580
13863 183580 196437 188304 135827 116538 109066 146733 199144 220063 230617 215682 215098 199053
13851 199053 207211 201005 198107 124750 129756 150559 174580 227909 286428 261403 220909 223373
13839 223373 188499 188370 208615 217748 210189 163442 110310 105606 115461 111725 170253 253178 273516
13826 273516 275570 294472 294112 247461 274193 279677 212220 168501 138745 116242 120345 154610
13814 154610 188688 154293 126535 144022 159572 166485 168092 148779 138294 130008 127427 108120
13802 108120 86106 120962 111120 135506 147218 111634 138225 198899 244486 252520 248431 270091
13790 270091 244243 191877 190692 178291 162938 196226 265655 265866 250721 184617 182147 176943
13778 176943 173272 202400 197853 242098 226131 236385 260757 200375 187818 159193 150817 194188
13766 194188 162076 151863 188531 235768 182805 105762 119791 136726 119462 138127 143860 156128
13754 156128 127432 89666 137259 195522 248908 322153 349393 269536 162744 166838 178430
13743 178430 189993 231142 217343 256731 228220 163782 152039 197071 216408 224458 241561 251158
13731 251158 198633 246796 224741 217395 225283 158705 135108 140156 178962 209999 198741 224977
13719 224977 220507 199947 187937 246864 274286 267927 255552 250083 269237 222270 213871 207595
13707 207595 228287 218280 258950 275164 255883 289303 329854 341207 352436 308648 268773
13696 268773 283289 310006 335888 351931 384755 508994 536507 635991 777685 906010 1008450
13685 1008450 1019393 935652 845011 775420 585642 471147 447913 414732 362083 298650 361880
13674 361880 403914 340835 294116 253749 234016 279793 262427 197152 182731 210646 262654
13663 262654 295474 341054 363774 372256 381767 490942 618046 678733 742143 861569 997355
13652 997355 1225876 1515247 1736409 1859412 1777127 1569316 1305520 1095518 880833 673351
13642 673351 503845 422499 408062 438262 462197 482923 434797 370100 313245 287925 316568
13631 316568 303951 272059 331644 423281 416515 424770 484247 475797 446634 490527 547429 574404
13619 574404 609209 644620 722874 805489 929378 1039161 1044340 982749 870057 732092 554597
13608 554597 469883 421542 372510 304538 317536 316569 311019 302518 251665 247677 278318 304028
13596 304028 315218 252800 208439 233293 217893 191135 221161 169700 154497 193611 210570
13585 210570 189301 205706 237651 223649 217600 238919 239819 222023 223389 196364 166519 170921
13573 170921 163801 192731 228861 203788 211538 217953 225517 255571 246141 284255 335450 363001
13561 363001 345476 340578 299304 280660 299483 274600 279002 282165 267050 260233 227255 167909
13549 167909 163331 201985 256467 299192 300183 267747 250768 247798 175299 167469 175075 206134 234633
13536 234633 270833 257048 257499 317847 400749 450048 448999 444866 432803 432359 413808 388105 347225
13523 347225 350448 310057 289397 283062 320678 354095 401090 343023 275208 249218 314680 337006
13511 337006 294211 264054 252355 265659 332456 343934 304819 273914 305160 350318 365739
13500 365739 344949 357039 387027 380313 353201 388877 385235 395791 412751 392513 384648 421185
13488 421185 467578 481767 482167 529452 534781 502501 480916 437991 444999 478543 418204 353450
13476 353450 330665 323171 304744 308342 323037 374522 444045 419676 422012 408102 369225 321598
13464 321598 339477 400842 441071 412048 389328 368131 387616 476329 535157 574676 563916
13453 563916 581037 558551 508222 547406 581559 577831 554100 510157 461087 464094 504163 504771
13441 504771 445428 439702 469182 485246 430716 375234 331355 355163 403606 395799 387839 397257
13429 397257 367007 388380 435479 428456 370457 304448 278591 301390 313324 388851 425824 490795
13417 490795 561255 610129 662378 642631 594121 539719 489150 492309 525243 557105 580120 608414
13405 608414 637064 676422 723188 751309 804731 811202 792928 714775 642005 629743 622072 604673
13393 604673 598498 561445 499354 479334 473169 444027 458376 469999 477490 497603 476123 497337
13381 497337 558952 629698 667107 676849 737462 754175 773688 853408 952262 1032639 1165124
13370 1165124 1251132 1308269 1373232 1347592 1272486 1243996 1214541 1176300 1100368 1027135 937220
13359 937220 853893 826607 845426 845523 798737 796015 750787 678444 628770 673786 718362 758573
13347 758573 760678 823611 895178 925667 944588 918026 904977 946229 1059027 1174817 1259603
13336 1259603 1313502 1327458 1298496 1234399 1227189 1249985 1274891 1283165 1330107 1384233 1378607 1395639
13324 1395639 1361348 1267599 1128342 1035543 993985 1012096 1013015 929768 869212 888518 955229
13313 955229 977790 1013522 1034871 1036672 1087861 1106282 1118569 1158371 1148194 1111477 1136453 1233417
13301 1233417 1275467 1306167 1328863 1308000 1333720 1386856 1425380 1497766 1560950 1619632 1664614
13290 1664614 1660617 1667065 1683355 1662771 1625604 1591551 1579417 1597577 1641835 1730545 1841043
13279 1841043 1932067 1975212 1965857 1961973 2059729 2103928 2196071 2317060 2409047 2489485 2580715
13268 2580715 2770315 2849915 2949717 3065220 3203222 3449182 3654494 3863274 4089858 4368624
13258 4368624 4639642 4939240 5381581 5755086 6153942 6671088 7347291 8181315 9142706
13249 9142706 10361512 11842725 13753113 16243530 19396634 23321530 28194994 34298607
13241 34298607 42445917 54040235 71185886 95606036 125678843 154556491 172440089
13234 172440089 172600953 155529153 128173732 99542809 75732889 58213549 46092151
13227 46092151 37845834 32283448 28573215 26167829 24696683 23754638 22836752 21886172
13219 21886172 20976307 20269179 19982585 20206821 20963943 22271473 24160901 26768547 30303955
13210 30303955 35097018 41300719 49126045 58937270 71549611 88753731 113756382 151045064
13202 151045064 203358437 265925256 323396407 356263080 351991852 312747077 253390174
13195 253390174 192231218 141438502 104492082 79270704 62278899 50597493 42284437
13188 42284437 36143823 31485638 27848775 25032354 22958998 21485338 20412536 19858263
13180 19858263 19725437 20090694 21128390 22538346 24097155 25722425 27587378 30046795
13172 30046795 33542229 38269373 44647852 53623523 66816804 86390345 113513340 145437121
13164 145437121 173678975 187890117 182337328 159473475 127976247 97211926 72641493
13157 72641493 55202382 43496962 35883489 30869482 27395819 24554336 21809611 19031461
13149 19031461 16395652 14043953 12078188 10516453 9230577 8233354 7350193 6596786
13141 6596786 6034061 5584177 5176771 4916539 4682143 4422768 4169902 3990508 3838765
13132 3838765 3668074 3559419 3613101 3739875 3826567 3986562 4171624 4447143 4778903 5231485
13122 5231485 5749773 6442536 7577868 9323098 11635943 14084037 15770229 15997407 14753032
13113 14753032 12600231 10165705 8115039 6545872 5351458 4522306 3993440 3570770
13105 3570770 3204211 2952138 2701912 2445089 2226599 2058915 1982154 1918872 1835963 1804146
13095 1804146 1816377 1813222 1805314 1829936 1821120 1823223 1947707 2123672 2337077 2635333 3056408
13084 3056408 3685194 4551478 5740678 6965164 7907498 8151492 7661121 6636625 5439083
13075 5439083 4409343 3610663 3002735 2552498 2216466 1866520 1590225 1399870 1288946
13066 1288946 1135639 1022503 962508 909154 859904 820670 755289 676061 600856 605060 651452
13055 651452 651302 637517 661978 686324 710449 729899 688145 656607 645630 674025 675635 676216
13043 676216 646697 625492 618434 612463 629547 698491 727639 727361 657901 595082 611879 641432
13031 641432 636939 671666 669560 712092 748386 751645 694665 702879 765701 756731 735768 757019
13019 757019 728538 693621 725989 683449 569333 541155 540006 573766 638050 687523 658375
13008 658375 669569 647123 631691 677907 747190 727509 740396 868107 1045638 1180657 1341222
12997 1341222 1548819 1756234 1978757 2068386 2065261 1897179 1738343 1610072 1462413 1360981
12987 1360981 1345497 1347797 1383371 1466767 1531693 1638546 1665237 1685882 1698663 1754024 1809586
12976 1809586 1912710 2008162 2064963 2122340 2151374 2159951 2149359 2146592 2120386 2093295 2117263
12965 2117263 2168653 2193428 2123758 2049846 1960378 1864082 1741496 1650717 1598155 1546653 1566078
12954 1566078 1503360 1455992 1455133 1400319 1326082 1270158 1186199 1150039 1144159 1134365 1175881 1209627
12942 1209627 1261396 1357144 1479612 1635180 1786978 1961113 2151293 2236075 2198586 2068956
12932 2068956 1859661 1689753 1507907 1293139 1127153 1009840 926688 859058 777940 666316
12922 666316 582433 628435 562356 501765 495567 469127 485213 495144 451579 434899 470504 516939
12910 516939 454966 444767 467145 492191 493172 494453 503609 464427 482410 453460 399651 373618
12898 373618 359877 312229 300162 281356 301195 322768 353918 370335 353886 294551 296381 278317
12886 278317 280393 319315 340355 369532 327869 344197 387667 397693 416265 421613 367982 319568
12874 319568 324614 336772 410512 425212 380195 347702 311380 309672 328093 286566 241158 285029
12862 285029 276066 265136 257609 241796 226840 224623 279051 268191 322114 362550 326674 304420
12850 304420 284281 300638 300897 323942 319792 344490 285374 267656 274790 336147 352481 323581
12838 323581 261669 270118 294202 281928 254203 252727 262908 231044 209676 224195 317911 373188
12826 373188 354490 373486 421279 390117 311657 259244 289273 321713 349953 365238 380982
12815 380982 411845 409396 452202 464019 441127 473110 504162 514323 477012 430195 440063 474993
12803 474993 482406 460749 489207 541816 551836 590680 687554 697127 652638 665665 644032 625210
12791 625210 550821 535570 628628 655409 711200 725915 733263 765209 803920 901745 999526 1082034
12779 1082034 1193521 1319933 1373525 1423228 1418418 1371068 1288878 1231639 1072226 976149 973629
12768 973629 979848 966759 885275 839808 830299 778575 760683 726675 703518 693678 669890 684593
12756 684593 673029 706647 732713 752482 859062 865992 898057 992811 1060876 1119519 1198462
12745 1198462 1332560 1570792 1872268 2159356 2344201 2420992 2333894 2082355 1800488 1583205
12735 1583205 1352569 1209850 1132525 1037961 927368 814989 776148 806877 785547 780648 807510
12724 807510 798324 821191 809038 778666 717706 735025 744564 731549 765616 780867 816498 878943
12712 878943 988537 1054754 1068563 1165477 1294937 1385961 1511405 1655593 1673442 1650314 1572285
12701 1572285 1431204 1286331 1191923 1114285 1072400 1054448 1084001 1075324 1162861 1266683 1395028
12690 1395028 1427657 1377738 1395740 1366603 1363563 1359850 1394677 1422649 1502218 1620430 1647669
12679 1647669 1728766 1791225 1802733 1849264 1842015 1866144 1838428 1821090 1824799 1781003 1804872 1838274
12667 1838274 1883320 1971262 2012420 2112477 2160513 2297588 2483787 2585591 2678110 2720556
12657 2720556 2652395 2618825 2578834 2601109 2646135 2673671 2685957 2734889 2714567 2730755 2678022
12646 2678022 2646301 2640474 2601164 2507766 2479860 2485493 2440788 2366871 2302928 2264145 2296717 2286134
12634 2286134 2339596 2340764 2369233 2411219 2450739 2536163 2620093 2699755 2791354 2840946 2857301
12623 2857301 2892236 2875414 2914025 2924818 2948031 3070910 3196483 3266184 3380957 3463158 3472708
12612 3472708 3441728 3413310 3419052 3325515 3197101 3210438 3164729 3086169 3091526 3095870 3139166 3205854
12600 3205854 3269771 3311983 3382178 3483061 3597193 3680349 3735808 3797630 3855931 4013259 4159850
12589 4159850 4309023 4424583 4560956 4762418 5006186 5247867 5546210 5895172 6232439
12580 6232439 6508223 6759893 7076712 7368008 7647297 7943496 8253913 8602833 8991050
12571 8991050 9491299 10020948 10665863 11428465 12244892 13268208 14478242 15840760 17468906
12562 17468906 19381831 21546054 24043073 26899057 30368166 34698799 40181577 47187547
12554 47187547 56128840 67596322 82656918 102786773 129817894 165494035 209494326
12547 209494326 256615342 295892866 315661043 310341198 283139820 243898417 203546453
12540 203546453 169089640 143046235 125274412 114512110 109357862 108369261 110290195
12533 110290195 114283836 120025188 127641914 137214648 148481049 160916836 173762939
12526 173762939 186536994 199063806 211537267 224348713 237796473 252037936 266841231
12519 266841231 281336284 294305409 304281271 309941417 310509121 305928785 296911117 284903540
12511 284903540 271300868 257369908 244244622 232177235 221193182 210923364 200848240
12504 200848240 190375820 179145349 167310128 155127445 143342808 132816454 124156805
12497 124156805 117984742 114596412 114291247 117417265 124723072 137196721 156207279 183240699
12489 183240699 218648118 259618620 298673993 324616205 328136283 307321075 268136292
12482 268136292 221344828 176966538 140314431 112264930 91732889 77228297 66999657
12475 66999657 59496678 53373751 47772983 42379717 37276636 32701814 28705066 25279968
12467 25279968 22307035 19774119 17628664 15810786 14279242 13028626 11980235 11155829
12459 11155829 10508419 9863746 9306725 8888104 8466011 8072856 7622201 7169630 6705523
12450 6705523 6376621 6122912 5787797 5546580 5316027 5081357 4889069 4690061 4533447
12441 4533447 4492848 4517186 4660719 4733280 4785444 4756081 4629616 4451618 4152743 3852026
12431 3852026 3631391 3473790 3347207 3229522 3181244 3211496 3271266 3304854 3295290 3236177 3096244
12420 3096244 2879201 2655294 2414274 2189527 2062088 1982891 1896741 1829387 1731486 1707159
12410 1707159 1674760 1698631 1729956 1780370 1819305 1849320 1864972 1933646 1985505 2047090 2053334
12399 2053334 2039150 1974355 1917935 1881858 1821486 1732296 1650307 1618628 1607058 1590183 1543612
12388 1543612 1501023 1482713 1459650 1400844 1327284 1314312 1314579 1337732 1356500 1447339 1533709 1554730
12376 1554730 1636249 1620607 1637174 1745832 1874491 1936326 2005386 1991193 1867186 1788444 1773999
12365 1773999 1739729 1676715 1566363 1475318 1424352 1310106 1207250 1129137 1018610 951174
12355 951174 865855 813564 714831 656045 618345 559680 511440 477580 515395 555517 472401
12344 472401 440683 478150 507440 535110 549900 507169 474936 507542 469363 432848 453275
12333 453275 447348 428327 477783 522246 526974 471307 432812 410665 465392 550592 595691 671460
12321 671460 721631 701223 610670 567318 567628 531655 546595 587517 539659 475853 402571 424121
12309 424121 482868 470999 431354 428102 418137 445439 464662 472079 507757 588257 547443 573803
12297 573803 644219 765782 824045 918764 946794 1072439 1183798 1210984 1230394 1245160 1243697
12286 1243697 1244435 1157700 1003437 901093 814599 676971 608677 561144 497191 452259 417182
12275 417182 354154 258829 262302 326035 276698 316772 407779 472432 480724 485747 503752 514952
12263 514952 464205 485983 519251 581346 606453 701909 742906 759112 751052 754070 727238 649215
12251 649215 590454 539149 478653 413291 396085 370126 336168 293610 228394 190447 182954 195507
12239 195507 196250 178497 142959 96676 85090 172595 199804 235503 229855 248150 314319 379639
12227 379639 380801 337175 298683 339441 442215 532582 566088 582409 562315 532500 519212
12216 519212 465511 312913 286867 268680 246938 246239 259232 228264 151459 120635 107963 117468
12204 117468 124387 190783 280572 257146 237372 292360 281864 295152 395460 414251 368754
12193 368754 403001 437900 484137 512269 525133 538218 573479 635303 732530 743730 712770
12182 712770 650569 568401 440028 355931 311633 291077 239830 191880 182208 211042 229390
12171 229390 213768 203048 197871 160446 191771 199372 192172 217977 235557 253786 273911 324196
12159 324196 377445 380596 395961 387225 419227 450574 411272 395908 355761 294602 284196 235427
12147 235427 224777 217946 191766 128357 57085 93222 122143 148200 188990 167686 165050 176165
12135 176165 219261 250319 250543 225353 138201 117763 119741 91419 41011 27586 19507 13725
12123 13725 24549 44483 20593 51273 90607 102446 87016 130095 128852 82597 114344 197568
12111 197568 208429 170974 103038 85883 149867 155246 184077 247432 255368 229981 244535 323372
12099 323372 394442 401127 449947 516922 560314 640521 820560 1086260 1336954 1537393 1626782
12088 1626782 1633717 1574971 1394193 1177946 1039675 903667 786307 719223 645499 719970
12078 719970 831485 897564 1033059 1137836 1236674 1302891 1316117 1390093 1419552 1494018 1543678
12067 1543678 1598891 1607026 1600308 1610582 1605773 1608065 1651141 1659697 1687517 1655724 1543487 1428552
12055 1428552 1407486 1297061 1240957 1208185 1144274 1071508 1010843 983693 967755 920194 797912
12044 797912 765205 720166 662682 637899 662174 671554 630413 676713 759127 835269 969956
12033 969956 1136485 1370269 1602262 1734149 1775152 1706376 1533396 1310255 1066661 837077
12023 837077 666482 541969 496055 405236 307290 306303 329988 327530 324067 314542 340078 446492
12011 446492 555517 664398 696870 679478 663041 622156 580759 531195 469864 445983 496256
12000 496256 497290 526165 543678 599402 665062 669525 703749 701990 680263 663161 620872 618334
11988 618334 553029 499512 503004 534389 571406 586214 556084 568467 612509 649846 709572 757588
11976 757588 822328 804240 746576 682706 640770 566551 493449 477625 471369 409526 356763 309679
11964 309679 312878 344944 380586 458294 495167 428662 439494 486062 554603 597800 721717
11953 721717 904335 1142330 1224816 1239402 1255815 1282156 1280233 1188613 1042996 939574 751947
11942 751947 573906 423485 312811 250886 208993 218937 227669 166121 128159 141978 148065
11931 148065 168278 145366 80461 63073 118016 191155 163374 47256 87802 102631 117799
11920 117799 93163 67437 95703 122392 117539 118434 201260 269306 294122 325839 362846 371855
11908 371855 442627 506937 531047 526613 425004 297706 281539 285943 238516 233415 229850 192645
11896 192645 155169 127987 85409 82790 168147 178786 118017 100453 55706 41208 33931 20132
11884 20132 -15145 -28681 24190 28966 71033 60360 98783 81237 61438 48270 61861 68026
11872 68026 33826 52703 -18445 -14880 -13134 -6832 -27690 10105 456 3353 10894 55682 58329
11859 58329 43384 36367 43669 45894 53756 40016 32604 51953 91309 54733 62492 67994 70127
11846 70127 39231 65322 173403 162847 137954 143070 125312 90536 16949 -8078 -5242 58811
11834 58811 110011 85528 33846 40801 61243 104506 110989 92662 53228 113760 161413 117342
11822 117342 90026 89363 141549 97386 94420 73724 67812 7338 93601 198840 149183 114729
11810 114729 151208 147124 113631 67584 10586 -2079 -36146 -61701 -74246 -18843 36160 29866
11798 29866 27598 75923 93257 56445 63792 58273 67019 65719 128910 137090 99998 88292 69665
11785 69665 20245 13144 10011 7591 24958 86713 85710 26628 -385 18074 -5444 -20011
11773 -20011 19695 97461 100181 78654 49628 68242 84465 106296 91063 46198 89091 92270
11761 92270 85177 73807 38608 31499 82224 118740 124724 68407 32756 4164 73438 53901
11749 53901 -31347 -61526 -51172 5347 51321 44895 52060 106332 141500 62605 31986 27146
11737 27146 72889 90798 168150 162895 94223 49703 32618 -12445 607 87462 137334 126296
11725 126296 119159 120954 74440 72840 56164 27954 46891 83365 64805 39357 61521 82980
11713 82980 21346 10849 62799 101493 150970 175618 198856 202424 135273 25190 -8682 23304
11701 23304 7538 -17699 27444 76995 141970 159460 178135 214644 205285 159571 170262 158116
11689 158116 109215 80577 34740 64666 107744 102510 71314 88871 103340 110442 154047 184886
11677 184886 186361 172281 187216 166473 160115 151292 152968 191985 174170 155821 153077 160763 172894
11664 172894 223725 224554 201746 202156 155748 162889 141658 98366 83736 60188 81812 76667 85636
11651 85636 85102 51241 24142 6686 13868 33183 40139 46183 11219 16588 87066 121198 88722
11638 88722 58272 71470 48050 72609 98011 87826 151219 160029 97782 71249 43140 51352
11626 51352 68678 108304 94092 111692 172648 179903 91620 61052 114202 83384 63132 90525
11614 90525 166908 178014 159564 175230 235920 252301 257404 180411 140888 148091 170922 172906
11602 172906 174431 155944 145176 156983 193019 185523 131038 103201 95870 106464 103307 127436
11590 127436 110384 136823 153001 165060 166360 145296 157440 150713 195638 216210 189440 158097
11578 158097 152696 174503 229225 238127 226824 160551 51309 49969 89717 112676 135080 207655
11566 207655 254887 276948 271767 260493 216693 201351 189278 188124 232842 243297 232070 231144
11554 231144 134927 90907 128126 168478 158728 183462 224066 301593 260937 202335 253302 260985
11542 260985 233665 215161 191001 224915 265345 220034 247127 298602 363033 409420 450656
11531 450656 545349 678477 789701 939594 1058601 1097573 1083551 1011750 901103 731343
11521 731343 568955 437556 335436 286232 301761 297644 309559 330832 322312 291115 343581
11510 343581 396094 405315 401609 376233 297496 316060 366988 425298 427136 398007 414041 489498
11498 489498 524984 565283 664145 856050 1083738 1305596 1647246 1916129 2012999 1991982
11488 1991982 1845677 1564880 1294238 1032234 800826 685339 572404 532594 452279 384174
11478 384174 353735 352960 385588 422304 393508 351249 371001 324704 303848 346587 358680 394727
11466 394727 382249 384235 366170 395466 423522 495301 552283 601005 717702 880900 1013795
11455 1013795 1133449 1173812 1102980 969597 789640 702644 606821 522198 451233 350109
11445 350109 292023 326094 357144 325694 314819 305333 283108 266550 241422 244213 253093 216004
11433 216004 168619 168308 172508 203267 222430 200740 174685 208379 201028 185147 179988 198809
11421 198809 228257 215409 219502 234151 230505 226052 261254 253334 263604 246707 210776 180885
11409 180885 209683 216736 180681 240255 293264 246441 175825 105129 150495 194358 197976 231494
11397 231494 178164 167610 190427 241313 262938 215934 243564 232674 278912 288282 253534 221814
11385 221814 220604 261645 250257 285376 228006 222198 267347 301472 358723 356913 389858 373592
11373 373592 332533 326444 341426 354074 377824 348056 360560 363812 407950 447020 455282 467552
11361 467552 428859 341558 337182 342399 302094 315311 360049 348645 348519 334244 305763 379548
11349 379548 434072 396645 370755 333546 386635 403445 378016 394788 386955 358119 337912 324765
11337 324765 289181 291688 320206 331538 303459 317495 364183 411223 528613 560180 564338 601407
11325 601407 667850 649795 546076 489275 468418 482747 498148 452432 397881 419005 369594
11314 369594 383745 418990 440174 420335 381418 337535 318767 326915 337661 347961 382286 425777
11302 425777 433817 444997 429349 421784 458533 482585 484145 485467 522830 503229 499948 514164
11290 514164 508715 470670 457679 463115 468422 444459 488798 447839 435813 479606 481529 456841
11278 456841 502701 563566 559539 497376 469836 454020 507172 527601 498489 492775 472241 462699
11266 462699 511446 549678 551669 545217 553450 597985 589936 534816 556326 653243 706632 720910
11254 720910 719847 666685 605640 610263 643544 689571 707278 647129 617953 710325 732250 715158
11242 715158 713708 748840 850816 902318 947243 920510 944202 890620 841974 822387 843253
11231 843253 837040 766691 755020 768009 742159 785382 771145 752474 800109 798742 861054 888009
11219 888009 858961 901600 934600 899898 909674 890902 889908 899353 961014 1007422 1027423 989069
11207 989069 1019115 1086321 1110102 1196824 1275280 1353944 1434082 1428904 1461207 1428257 1376904 1290558
11195 1290558 1216908 1160577 1107085 1062143 1085072 1121663 1137402 1135614 1120266 1100230 1163804
11184 1163804 1187035 1179017 1145028 1156653 1173182 1156554 1215766 1285190 1333945 1407151 1462372
11173 1462372 1450728 1449944 1481394 1547598 1621833 1671055 1693245 1728594 1779322 1872725 1919105 1969464
11161 1969464 1976982 1970309 1964239 2026703 2083310 2117478 2160629 2190838 2274061 2371901 2426141 2475868
11149 2475868 2538763 2685950 2867302 3027724 3185604 3360319 3593677 3852620 4146565 4443529
11139 4443529 4708541 4972864 5185666 5424611 5578223 5833299 6012948 6172288 6454913
11130 6454913 6933858 7434832 8073075 8905152 10008602 11221339 12587111 14006010 15575989
11121 15575989 17401118 19765560 22803901 26622596 31396413 37665615 46340660 59023551
11113 59023551 78181657 106058789 141125019 174153548 192011017 187759376 164015117
11106 164015117 130563916 98812420 74379022 57291128 45757268 38167788 33314400
11099 33314400 30365572 28718114 27874541 27151141 26360687 25381294 24386920 23778134 23769698
11090 23769698 24423142 25618058 27245528 29189285 31503572 34527649 38639844 44256566
11082 44256566 51527580 60907438 73359543 91002056 117775867 158651190 216264616
11075 216264616 283601427 341913879 368877946 353342774 303626110 238893944 178711504
11068 178711504 132798163 100493737 77914983 61955542 50641078 42683596 37122874
11061 37122874 33216577 30435955 28318084 26598236 25224845 24037527 23251455 23072208
11053 23072208 23638251 24589433 25451955 26197035 26938532 28112171 30158335 33331227 37747687
11044 37747687 43905066 52539844 65326665 84546971 111759164 144004533 171499311
11037 171499311 182959243 174163092 149614724 119624772 93455769 73882901 59239348
11030 59239348 47723942 38269677 30583402 24767968 20561335 17491383 15271682 13578933
11022 13578933 12157838 10797557 9538629 8476115 7574899 6822257 6198714 5711048 5337006
11013 5337006 5024236 4791159 4597488 4445607 4326436 4245159 4172988 4080897 3984110 4025744
11003 4025744 4108738 4184833 4424706 4903649 5620401 6701947 7978027 9054082 9468095
10994 9468095 8973534 7826257 6382586 5096137 4133808 3476645 3059577 2701674 2475363
10985 2475363 2350186 2263155 2139745 1975652 1834804 1754259 1628655 1538030 1491022 1450072
10975 1450072 1451781 1429214 1407020 1383073 1396529 1358175 1335169 1340210 1327650 1276147 1201543 1204262
10963 1204262 1221912 1194126 1175759 1191491 1218464 1239449 1176216 1149652 1171444 1156967 1178513
10952 1178513 1197047 1245939 1336825 1375774 1400195 1440794 1442055 1406551 1291850 1210006 1179801
10941 1179801 1112389 1073273 1101163 1123007 1065749 1037020 1064803 1004943 900133 908910 972791
10930 972791 976217 988812 1000300 1032186 982054 899371 842669 842054 825161 812847 897463 1017577
10918 1017577 1050917 1068959 1062463 1047412 1057884 1101333 1175559 1229426 1247415 1251468 1229783 1180420
10906 1180420 1147172 1059660 974799 933559 853273 859133 891391 927891 902136 871431 942797
10895 942797 1001042 1023785 975244 891497 895114 881182 876108 916296 917742 896576 969403 1069332
10883 1069332 1114031 1064646 991044 1002442 1017005 1001657 995805 1059085 1104149 1112183 1129965 1156875
10871 1156875 1212445 1213745 1232962 1272091 1287156 1279140 1249178 1238653 1282379 1282794 1316833 1372993
10859 1372993 1421098 1416993 1382686 1342002 1365398 1427264 1540437 1636533 1695471 1711578 1803194
10848 1803194 1904952 1910500 1931806 1966896 1997162 2030945 2065913 2097860 2094703 2137902 2231432
10837 2231432 2344915 2395038 2491719 2631451 2634660 2616789 2616208 2564777 2483285 2435280 2387702
10826 2387702 2331406 2341496 2394119 2417237 2435546 2500278 2546703 2583929 2600365 2695854 2733579
10815 2733579 2716910 2703617 2622973 2587780 2596178 2587914 2574771 2582610 2572224 2603859 2654059 2689212
10803 2689212 2734303 2785764 2805927 2814806 2839005 2866337 2868821 2871229 2900670 2940037 3055927 3121110
10791 3121110 3200793 3271494 3386229 3457183 3530818 3639048 3688878 3659591 3659465 3719688 3806866
10780 3806866 3827181 3910062 3998128 4104531 4183862 4303171 4418069 4452168 4510559 4648590
10770 4648590 4850229 4975161 5084628 5239679 5384785 5528861 5734391 5953414 6174536
10761 6174536 6326086 6514574 6807359 7115213 7412025 7669599 8025957 8416686 8773691
10752 8773691 9222215 9748569 10273706 10819944 11433343 12101049 12863501 13662675 14507686
10743 14507686 15419513 16531216 17835689 19277146 20880519 22788581 25049427 27543076
10735 27543076 30417173 33793609 37800365 42584096 48354523 55353615 63910761 74381918
10727 74381918 87279845 103243355 122868338 146661548 174525273 204642442 233159746
10720 233159746 254981038 265527367 262943816 248851852 227347446 203157561 180176075
10713 180176075 160827007 146022955 135947420 130388880 128974858 131334728 136915401
10706 136915401 145275382 155730062 167131057 178158287 187147819 192900307 195112912
10699 195112912 194728198 193670595 194301264 198494298 207310276 221006716 238766320 258677196
10691 258677196 277510623 291509220 297481295 293980458 281906178 264150435 244505164
10684 244505164 226268366 211811654 202272506 197374568 195742662 195296770 193776624 189437535
10676 189437535 181677850 171079364 158987279 147076425 136926146 129490296 125249867
10669 125249867 124485870 127179527 133387924 143166742 156474729 173099502 192092570 211508565
10661 211508565 228095512 238075364 238482370 228341193 209465166 185423757 160087413
10654 160087413 136446456 116091509 99350346 85956758 75282329 66672621 59519080
10647 59519080 53431959 48112329 43284420 38841687 34820499 31280090 28108167 25266535
10639 25266535 22790622 20610897 18701360 17010819 15596721 14312194 13223252 12299878
10631 12299878 11518969 10801064 10141048 9570600 9070180 8647755 8231503 7840341 7440842
10622 7440842 7060298 6761726 6501955 6380760 6225121 6113055 5986910 5846804 5724496
10613 5724496 5546279 5303232 5023557 4729025 4440400 4181320 3971998 3890215 3862964 3800706
10603 3800706 3728226 3653594 3561302 3435303 3366996 3335118 3363113 3345292 3309076 3310634 3348199
10592 3348199 3378393 3314166 3280703 3265503 3359322 3598568 4030159 4707880 5407343 5778679
10582 5778679 5638109 5063075 4236462 3546389 3160784 2905986 2711635 2564734 2480405 2410076
10572 2410076 2364867 2289631 2259073 2305333 2338139 2344457 2413224 2491347 2515511 2558004 2582212
10561 2582212 2586977 2611344 2566245 2543872 2543526 2447558 2344547 2289093 2256104 2146609 2102340
10550 2102340 2092280 2102923 2142705 2158819 2207433 2297801 2321039 2322058 2309861 2272747 2265881 2221126
10538 2221126 2152800 2099352 2089577 2038866 2048799 2132435 2150599 2142979 2084009 1993371 1902015 1829835
10526 1829835 1775197 1682301 1571083 1494193 1455214 1408127 1345022 1309446 1281832 1262430 1272184
10515 1272184 1246591 1213595 1207670 1118613 1057313 1075370 1129705 1102423 1073635 1119141 1228540
10504 1228540 1355178 1425118 1493686 1547368 1551976 1589177 1545990 1491137 1415243 1352517 1290721
10493 1290721 1175134 1135766 1127835 1080945 1082074 1026684 905069 863159 835411 861035 902518
10482 902518 920724 897254 941007 974792 1023446 1094270 1014795 935305 838046 804431 797090 797869
10470 797869 819261 828216 847360 803469 830964 896900 944529 959000 925974 912381 959290 958667
10458 958667 920218 870948 825484 791262 741424 785085 827572 846731 849642 805895 768095 706285
10446 706285 683155 675301 671517 656939 651438 610653 607325 638030 708267 806570 946815 1042992
10434 1042992 1062037 1079809 1086718 1097872 1014224 859643 759181 704729 591887 506932 475960
10423 475960 451991 396050 418299 486064 485329 435513 398350 367246 375677 418338 385709 302690
10411 302690 266439 264068 318978 340048 326416 316906 248126 249380 280322 306616 247672 249124
10399 249124 250832 272369 216929 209154 215051 223558 238319 249912 272580 330141 401931 517360
10387 517360 670202 749890 689893 553967 418774 319879 208093 185001 197499 193321 153178
10376 153178 170214 195931 169795 115789 175833 219215 190936 182306 169153 161203 151103 166778
10364 166778 159391 136652 90309 118062 122163 125607 140820 156589 155963 114818 89284 67414
10352 67414 94083 103774 82630 55476 78409 127981 120487 144201 183306 136725 164467 222700
10340 222700 270401 336338 319472 255269 210135 181532 196916 203319 180769 115458 111097 136634
10328 136634 165456 185870 144746 94545 120069 169491 144959 130614 192693 244903 232981
10317 232981 172901 155387 156925 165789 193156 176461 201258 211632 266247 327933 368808 394412
10305 394412 429070 478192 545070 586829 654898 779191 879630 1010308 1168360 1273084
10295 1273084 1326931 1357392 1365879 1325840 1201041 1050406 941442 889449 841741 837321 766706
10284 766706 737728 734404 802357 877050 921979 979817 1015060 1116502 1111898 1123019 1108580 1169599
10272 1169599 1220599 1233469 1285483 1405164 1451989 1521612 1543337 1535779 1558211 1580046 1505939
10261 1505939 1450200 1349102 1229454 1153408 1066125 1056613 1037509 1021951 1048273 1049488 976040
10250 976040 946254 954340 922599 853399 801572 734103 683069 690586 743686 800218 893878 952333
10238 952333 1074390 1209751 1268099 1295951 1242611 1147981 1046852 943932 886545 792562 746783
10227 746783 672833 597215 503029 443569 412936 410326 383523 323616 326025 356078 334237 299257
10215 299257 292461 252666 210457 224815 227444 205367 217181 233564 207906 199498 200155 205997 208217
10202 208217 198973 185446 133969 110609 96049 29999 -43485 -12279 30681 65551 85146 113928
10190 113928 102058 56145 61866 85144 142828 169538 156415 188098 239692 209594 151895 165381
10178 165381 192651 180739 161488 181200 213250 241075 236248 197859 214790 167679 107935 32391
10166 32391 32410 71828 95368 110687 157024 142861 140514 185962 207779 138487 126352 151456
10154 151456 141117 88164 82272 134718 161751 144410 167922 140744 162701 169852 124493 122560
10142 122560 122445 127392 102209 88196 125065 136523 140418 129327 96978 84832 101523 77745
10130 77745 90816 144969 173965 191470 242240 223907 201856 137307 90521 132049 96368 65543
10118 65543 102276 160046 181624 153111 128282 119858 194046 205560 191931 158306 121493 112267
10106 112267 157640 193821 229728 241939 242888 239770 223514 165925 169892 204711 215804 229123
10094 229123 245392 217333 169943 148461 178429 237824 275469 321257 337119 329067 310668 293296
10082 293296 282161 283933 262952 233607 220737 230125 336291 375761 355351 308929 283401 268402
10070 268402 286181 262054 263340 296002 296685 250256 199321 237226 256022 256047 263526 249591 246634
10057 246634 258400 299540 333720 337638 285005 240087 261183 300356 347307 370964 361180 429830
10045 429830 441936 426452 486111 557791 617024 669636 749645 823397 963545 1081447 1257585
10034 1257585 1704578 2595128 4292439 6352395 7430629 7171063 5740910 3778615 2424038
10025 2424038 1678149 1216733 932200 778147 675326 585522 529360 537234 538377 513314 485738
10014 485738 429506 436820 440015 442418 434065 451523 445594 371941 360774 355214 343359 383608 405155
10001 405155 406994 392718 386252 404094 404414 399351 398051 381552 381696 420318 373476 414525 396567
9988 396567 378177 332734 330095 373552 426575 392228 421322 473615 456484 417946 367978 411320
9976 411320 440750 433084 418321 439247 438605 425853 401253 422263 482997 507916 506056 493888
9964 493888 506758 541018 505276 512250 525124 517233 518568 544670 497496 483444 472045 489126
9952 489126 508596 528548 598932 616019 604385 569607 512124 467377 455384 461103 514904 552413
9940 552413 595473 581907 525047 551176 582234 586474 575324 560623 571645 580628 598232 623944
9928 623944 634851 660811 660222 645928 633669 638603 632263 640528 633998 666204 660033 636073 655483
9915 655483 636964 575399 566699 564159 646566 719440 698214 688283 725084 720753 741269 750543 725399
9902 725399 689920 652404 654000 706952 664022 635193 666226 688271 737411 803498 865917 890143
9890 890143 847429 804579 808990 768860 758698 789836 824765 824019 869715 865470 883035 901680
9878 901680 860664 878643 905752 935623 978210 993957 936150 902422 925552 927858 903390 923195
9866 923195 921841 933131 958201 997458 1051362 1066357 1067876 1055680 1058155 1028721 1021301 1038528
9854 1038528 996481 1013720 1033443 1063870 1067016 1088860 1102322 1098039 1033601 1064631 1103461 1069239
9842 1069239 1072270 1110897 1120289 1141402 1223371 1301091 1289850 1259663 1202167 1182758 1202819 1247148
9830 1247148 1251557 1240397 1233604 1231476 1255450 1237969 1202209 1233736 1260626 1262908 1262068 1285140 1241544
9817 1241544 1184783 1173513 1229805 1302465 1325624 1340014 1348521 1333185 1405078 1429530 1437814 1485376
9805 1485376 1510898 1576805 1545108 1473492 1426021 1443228 1530234 1528456 1507205 1480143 1501673 1602562
9793 1602562 1632246 1631209 1636144 1663459 1665025 1642283 1618164 1573546 1581306 1635830 1618446 1642389
9781 1642389 1615892 1643985 1672845 1616736 1571357 1567409 1598328 1651865 1653584 1625436 1612749 1640072
9769 1640072 1678040 1662223 1640274 1635212 1656202 1632851 1647847 1668336 1674781 1668459 1621590 1625332
9757 1625332 1683183 1684473 1697303 1698813 1700054 1691935 1744133 1765578 1705765 1636056 1619920 1701030
9745 1701030 1722147 1704041 1691289 1705859 1743373 1749703 1673449 1649363 1692908 1736323 1763191 1756203
9733 1756203 1745743 1717984 1713970 1709071 1702862 1720124 1706640 1742960 1811462 1809998 1783067 1762688
9721 1762688 1758930 1736654 1682806 1700568 1710079 1694200 1669441 1672936 1680045 1645194 1606762 1576707
9709 1576707 1618169 1670670 1647712 1629009 1632710 1613247 1612709 1600833 1584098 1554183 1602098 1650878
9697 1650878 1671635 1629032 1642983 1637827 1611717 1571284 1542732 1552500 1555822 1544626 1532563 1532135
9685 1532135 1522613 1528983 1505592 1527946 1544085 1496680 1493464 1465066 1485887 1514961 1519353 1476713
9673 1476713 1435742 1437870 1418102 1389874 1348245 1337936 1333015 1309204 1376616 1455278 1391335 1303378
9661 1303378 1309808 1336650 1358446 1338102 1276019 1252548 1303951 1325586 1359948 1337718 1316143 1325867
9649 1325867 1314518 1233614 1245302 1287963 1280147 1255625 1197109 1171410 1189865 1213059 1212308 1253549
9637 1253549 1247485 1217396 1180880 1162213 1183761 1155949 1119913 1118588 1135610 1142762 1143906 1150230
9625 1150230 1162954 1198551 1209154 1161798 1084409 1048740 1016845 992158 1011927 957769 912413
9614 912413 937089 922132 920787 972026 982663 1007560 970431 970988 974778 915700 842968 859727
9602 859727 899527 936414 961091 919514 900981 884270 860547 855771 845798 811620 805795 814664
9590 814664 832164 847962 842876 809442 772990 765344 775575 761716 698655 661916 678553 657102
9578 657102 632658 679210 683300 692222 714342 742789 734460 741940 733586 660677 593301 586780 632017
9565 632017 648297 636095 633853 606288 580150 617384 649796 670293 665879 659287 661507 645208
9553 645208 585802 577160 598708 608305 602981 616269 641944 615429 573643 568601 561408 564739 609826
9540 609826 635370 593617 558616 513140 508718 539001 544592 518085 525343 519023 540536 526549
9528 526549 492728 496264 536204 576511 534321 445288 405376 434293 417225 418534 372822 384193
9516 384193 380613 360225 436053 503867 537380 473716 443440 465823 462575 464373 438747 462095
9504 462095 468587 467484 458291 424476 440759 426848 391083 390601 375494 315437 328872 364962 389790
9491 389790 379053 352743 344826 383545 453032 438397 401772 372909 383499 324308 376334 365948
9479 365948 341162 315476 322454 306158 329838 381177 355927 314835 307909 335696 355424 308511
9467 308511 304668 334699 329957 315490 306699 315475 314730 394854 387081 362584 373798 307188 262533
9454 262533 287946 282446 271156 272715 297380 344205 329008 328875 331947 312595 293991 265612 293134
9441 293134 276642 258555 225411 222906 290889 285696 262135 257672 295947 315762 310935 274491
9429 274491 270055 268885 206518 189485 222845 239583 245750 286602 301262 276267 213806 238428
9417 238428 268233 324373 355494 335559 313741 269678 228807 209675 227383 238033 231296 245982
9405 245982 217953 189291 178934 153114 146761 145293 192758 197325 156996 110590 138926 186276
9393 186276 174657 181429 189793 172772 134250 141029 165372 183215 161106 156420 170226 203171
9381 203171 188628 143434 99945 120294 167512 134019 125468 125365 149791 120421 102876 118859
9369 118859 159017 115997 125418 140672 171468 185743 178756 142950 137053 165808 182850 165348
9357 165348 178437 154881 138328 164064 203357 190553 158689 136836 120746 89607 121249 139850
9345 139850 116500 160452 183019 114950 67278 113249 109857 85786 97777 118566 109733 56115
9333 56115 42298 18340 -1804 35293 72225 62403 80052 79327 78096 92622 78400 86909 71687
9320 71687 66748 80283 85148 127066 131051 40025 42910 121961 133914 87250 108042 177961 124807
9307 124807 125123 128941 162530 204446 200343 181473 199349 263408 238158 194546 157893 108220
9295 108220 105409 145745 111735 101740 124637 176179 184169 189414 180877 199062 200163 233427 283443
9282 283443 308758 248185 205438 193565 159407 183004 190050 133390 118774 148842 155955 198811
9270 198811 206749 175047 196460 204196 268313 384606 487676 547634 525584 473528 376729 333525
9258 333525 265739 205397 198143 169609 193134 186607 163004 123001 142634 153567 131887 178708
9246 178708 257997 294600 266914 246390 191095 152863 116180 119413 120387 114304 106515 127694 137850
9233 137850 116217 130688 94949 118553 208883 268892 269097 274570 248139 224665 202904 156334
9221 156334 114519 96750 128282 161595 118130 126845 111649 49485 19589 72688 61729 49991
9209 49991 9052 50195 15990 13676 73169 69764 9425 6605 19414 12281 18514 54513 97015
9196 97015 87716 46054 13861 -29465 -14357 75599 87580 36267 53427 37445 55516 76405
9184 76405 36593 -24204 104 63641 77027 43901 30947 29940 22917 9960 34310 13361
9172 13361 11568 -2498 3694 8598 -16898 -51026 -55309 -34674 -38310 -16597 7 -20209 -30227
9159 -30227 -10254 -16901 -3219 19286 3487 8424 22677 46876 -6891 -13870 45482 28521
9147 28521 2796 -5839 -39566 -45897 3602 41257 675 1127 -31836 -27660 -6522 5750 -3155
9134 -3155 -11753 1120 46598 55556 62478 114885 107314 48172 12726 914 -12095 -35225 7556
9121 7556 51343 119097 153796 122526 59447 34430 16216 -10822 6248 1967 14232 18556
9109 18556 26523 25054 67530 89850 83728 90865 107321 18810 1458 1587 13004 -17053 40864
9096 40864 31477 35146 21130 -1383 26782 55152 101139 81710 52884 49128 55425 46829 38645
9083 38645 42223 31433 -21454 -58099 -12488 19257 -7376 45305 51676 73788 53038 -11934
9071 -11934 -12687 36937 37743 44295 -401 -12456 64746 97538 98273 76794 74664 81607 49219 46063
9057 46063 109649 90335 36740 8905 7198 7217 -5491 -97557 -118798 -117198 -96483 15005 60743
9044 60743 121535 163911 102852 22854 32340 47465 -8732 -31423 -64712 -87786 -87976 -116855
9032 -116855 -94264 -65290 -34197 -42538 -52722 -68707 -77902 -85528 -89459 -110789 -79041 -29887
9020 -29887 6558 48661 -36834 -49991 -11101 55851 82743 78380 78107 82584 26081 -43928 -31747
9007 -31747 24794 34545 58469 28882 19483 35344 41684 1513 -38528 -110957 -113788 -76043 -30209
8994 -30209 24911 60739 52656 65623 38639 42989 23115 41987 26338 -19194 -20833 25768
8982 25768 19274 16405 -16849 -38212 -27249 5394 -34539 -50972 -31426 -32396 -71898 -71262 -45590
8969 -45590 -2186 5271 -33471 -28401 -1898 2053 -6629 13908 122990 141736 86510 69271
8957 69271 71806 61787 -14394 -75367 -50166 -29258 -43965 -55558 -39761 -32304 32478 64919
8945 64919 44362 54566 95366 73895 25090 -66177 -92561 -45475 -9979 18479 11738 -6710
8933 -6710 -35431 -23265 2731 -44535 -9803 28827 38160 23882 60603 77280 115912 83709
8921 83709 70515 39211 31011 -39313 -81115 -127652 -76196 -99955 -73750 -26045 -23987 -18742
8909 -18742 18162 6665 30112 96152 104167 67163 31878 16965 2942 -18454 -45485 -20184
8897 -20184 17894 31960 -6923 -67541 -89043 -88024 -91759 -15998 8398 2049 -11924 366
8885 366 -21116 -35256 -72621 -61534 -57754 -126384 -144869 -110667 -98227 -67737 -15910 29142
8873 29142 30557 -42768 -103454 -52554 -40740 -75710 -86899 -44767 -12933 40230 44856 35219
8861 35219 25654 19103 25663 17959 37892 56278 37427 -13176 2553 11995 50137 96643 93505
8848 93505 58804 17046 -26633 -56074 -55832 -22577 12665 -3079 -4489 45846 34309 -32480
8836 -32480 -83994 -39645 -27639 -48649 -64210 -73676 -119033 -48765 -14326 -24931 -23013 -46884
8824 -46884 -12958 -6887 -37654 -903 64120 32474 32832 86606 67984 62640 82030 98773 59202
8811 59202 -7508 -43623 -64415 -79684 -15666 -8530 -18292 -8235 -55488 -70296 -79516 -76967 -69161
8798 -69161 -46450 -48107 20467 75476 64255 45937 54336 53592 16363 -10818 -22844 -66153 -66472
8785 -66472 -33439 13165 50127 -11680 -3496 -22801 -37044 41086 75556 54700 78887 59439
8773 59439 73951 122028 122286 82258 79778 83595 50936 -15073 -1070 -18379 -18292 -11115 14725
8760 14725 33661 18954 19571 46787 18488 -2929 -19791 -34203 -50718 -40079 -53028 -36601
8748 -36601 -17632 -64740 -71702 -72761 -82543 31909 45410 37656 57035 57566 59798 66890 78389
8735 78389 25263 -59266 -82238 -69408 10208 47107 -5342 -38220 -53635 3105 62620 53512
8723 53512 71909 65847 48877 41858 11922 25187 84191 88281 111247 123340 92647 74233
8711 74233 78295 92132 56184 47770 127609 137199 10750 -6381 54150 99917 123809 190039
8699 190039 165949 94305 33974 30719 32059 31457 28450 72626 90499 89539 49494 7552 22907
8686 22907 64100 61023 76808 111765 147254 128331 90932 42445 37030 101258 155628 133955
8674 133955 113328 102613 77833 87789 80763 27017 -3235 -4509 28684 66763 35478 42114
8662 42114 61023 87855 128748 192376 195642 178758 130067 133050 136735 149913 132854 122000
8650 122000 182377 220758 251508 235814 215326 210284 183804 184175 185245 161497 157243 130738 159624
8637 159624 146768 125693 112172 109154 123407 107436 112529 163952 166467 142683 110882 120155
8625 120155 148068 174316 212234 215454 181833 146400 113163 164939 203046 189432 172231 158909
8613 158909 164192 171033 179293 138157 74049 84418 96030 123435 172419 211934 249807 259006
8601 259006 198853 212982 208390 180375 225544 265160 291633 271137 203533 153244 162227 173904
8589 173904 184712 225732 250504 261232 270132 284319 316380 359904 425145 460609 392534 440740
8577 440740 451506 436309 444247 399928 352027 335484 340693 319581 233803 204956 195144 194099
8565 194099 208969 220275 192434 190216 139055 33569 -14540 16909 57543 52666 63682 79122
8553 79122 168658 202198 144704 78965 96038 128174 80323 43517 77811 14580 -35222 -20355
8541 -20355 30799 51916 22309 74543 126792 140282 107694 104218 91023 80803 103895 92413
8529 92413 94805 155442 142523 58900 122227 155644 134542 137466 183469 211232 192860 138280
8517 138280 117110 109424 118150 62774 46882 91175 67671 32504 33492 48846 3445 -50307
8505 -50307 -45697 -39388 -56053 -11826 -35525 -79731 -91601 -60179 -49887 -88094 -69550 -29190
8493 -29190 -296 -9398 -7387 50448 49481 21961 3527 45593 44962 37964 28636 -5158 -52923
8480 -52923 -43586 -6886 -4098 5375 17923 27212 64500 99949 149609 125506 87518 31961 5368
8467 5368 17770 38453 18337 -4087 -64028 -93834 -51070 -25327 -17440 5991 -16033 -52867
8455 -52867 -75905 -14933 57428 49292 71956 71830 52452 16090 23433 70461 54192 5277 366
8442 366 48504 2272 -94752 -59376 -9668 -59171 -49702 -20897 -83316 -35281 41564 58153
8430 58153 57870 14897 -40420 3259 2600 -17601 1646 -3744 -78789 -37779 4481 -19651 9197
8417 9197 -52513 -60053 -25472 -3655 -22348 -24972 -18834 -2127 -39574 -16037 -35555 -30858 -11562
8404 -11562 6332 21514 -414 -16498 -10009 6696 44124 31852 26702 80134 124144 72775
8392 72775 -2095 -15252 8707 21025 17726 -8072 5097 732 13346 102166 105555 83592
8380 83592 79663 85189 103708 115537 82136 91914 85861 39671 64082 73436 95130 149550 144553
8367 144553 191288 220685 285305 419415 576175 627400 554622 431533 287553 220430 189295
8356 189295 140642 65127 -4959 36301 38514 40222 43864 9340 14263 32663 48514 83408
8344 83408 61848 24950 53208 74853 98707 115477 109358 85162 64272 10860 -242 -17302
8332 -17302 -25559 -8885 57586 76605 138086 124442 149095 152757 144705 189570 213401 263033
8320 263033 402037 601476 803308 992143 1035915 939665 743778 507229 344077 237173
8310 237173 153752 122794 99141 101520 65710 14481 11133 6879 19429 51688 -6615 -14942
8298 -14942 -7348 -17666 -44407 -30757 18943 12325 -558 54204 87108 26762 15278 9812
8286 9812 30148 62576 39885 71133 74745 53009 50778 58098 85839 124023 118325 189031 276570
8273 276570 326874 360887 448877 520089 487501 396358 267335 194366 143952 81217 30748
8262 30748 36871 75367 74523 52018 36675 29788 25741 12319 37484 29619 -5628 18718 67799
8249 67799 77594 35265 -10418 -24397 -37855 18793 6118 7037 -70 3006 19250 43639 16805
8236 16805 -76807 -110493 -116622 -144209 -139292 -100619 -98782 -107108 -51661 -75088 -96041 -23667 -24886
8223 -24886 -50686 -116067 -94672 -52528 -67656 -71439 -45971 -24799 -30450 24898 24993 -30690 11568
8210 11568 -27862 17626 15305 -77545 -80131 -60891 -4188 38221 2926 4383 49962 95101
8198 95101 131338 100111 32986 1267 -2974 32297 76493 33932 35630 46587 68417 65701
8186 65701 75198 39164 30987 19173 -759 8734 49811 3063 11504 60050 84864 121265 117804
8173 117804 56503 -20253 -33759 -55997 -67105 -49715 -5681 5954 -3657 -19166 -74805 -90380
8161 -90380 -67717 -33188 41234 5071 28999 47818 20794 11504 22006 4642 20228 50563
8149 50563 24417 930 -18731 -5603 -30260 -31958 -14356 530 -5138 19345 15163 12247 -7091
8136 -7091 -6062 -246 2297 -20060 -82408 -109980 -48480 -37374 -5896 5894 24030 64304 3583
8123 3583 -30044 -59040 -99825 -128877 -160911 -156830 -105590 -49613 -51158 -78818 -7807 16117
8111 16117 19187 47573 -1321 -28585 -52167 -58137 -50780 -55764 -18627 -9941 -33777 14545 8574
8098 8574 40896 105096 54249 -13398 -55631 -72259 -34108 6608 77952 114826 107019 52822
8086 52822 -21778 3550 81751 117322 126816 78678 35663 -32121 -98057 -85216 -58732 -53555
8074 -53555 -52182 -57610 -51924 -51240 -95921 -50441 9044 -3079 -17969 27235 65768 62651 34156
8061 34156 14183 21214 42574 50583 12421 -16795 2758 -14765 6980 17097 -8554 -47422
8049 -47422 84 70929 63605 91772 90723 112284 171022 176108 166569 179537 164007 126342 125668
8036 125668 107963 55507 11065 13446 52760 134054 104491 64998 82661 121896 151276 142534
8024 142534 112432 96709 73626 104162 149069 136215 149140 218252 243302 225162 199802 167545
8012 167545 139627 70214 94150 127131 127958 113830 121790 146030 200861 258316 274946 254658
8000 254658 216104 204899 254112 255812 258947 248344 221257 167871 146913 149480 180352 175573
7988 175573 196460 214615 213476 213113 242945 266321 270078 216216 190554 144255 133009 174532
7976 174532 171468 155796 145929 156716 150341 130841 61954 18323 71034 65851 116488 127691
7964 127691 119709 118981 140088 187327 210941 208707 218998 225856 197885 190857 214958 202306 194696
7951 194696 194103 184999 215718 269480 275082 286325 322103 327662 358370 345442 305903 279622 252709
7938 252709 273997 272115 165233 142877 157214 168548 187347 197003 172270 153747 163113 174846
7926 174846 122411 91578 79303 55676 36642 37882 107171 117898 126306 121840 97390 147648
7914 147648 169683 166051 120875 106880 119329 127390 74729 38358 82255 103447 115769 184925
7902 184925 227665 184100 147174 147394 165792 126237 113650 100867 39044 47917 22743 -1978
7890 -1978 15065 14723 59805 105598 84710 74661 77698 47102 157 24778 38764 81774 101372
7877 101372 92327 40554 10386 -5693 15817 17927 -34531 -34604 19093 83847 38488 42309 87666
7864 87666 101502 116645 89848 64489 69176 50525 26713 14443 7451 47306 61825 61724 7035
7851 7035 19035 101315 121230 52641 46560 54349 74965 79386 92470 101644 45346 20788 26712
7838 26712 57418 51975 -5378 -11865 -13094 -13268 -18794 9033 41988 36204 2058 2845 5349 -16220
7824 -16220 22067 4797 -12541 -2598 12716 -29824 -92772 -83954 -66448 -38475 -42620 -83059
7812 -83059 -56162 6970 34894 -35696 -81029 -70408 -90377 -43070 9655 -34951 -38423 -13204
7800 -13204 -13016 -13778 -24615 -3490 39743 20147 -48819 -51279 -68508 -27805 -13923 -29962 -38112
7787 -38112 -76277 -97165 -95629 -57178 1678 59415 5650 -90011 -72999 -51577 -23765 -17852
7775 -17852 -22338 21060 20849 -9281 10823 3620 -37493 -43625 17906 5917 -37271 -37045 -35048
7762 -35048 -29890 -56408 -34643 -64251 -33385 -47497 -81995 -55180 -82414 -112825 -76303 -50504
7750 -50504 -72890 -60331 -24977 -17357 -23681 -56407 -71534 -75934 -72556 -54924 -28256 -19687 1977
7737 1977 6887 33064 36772 18586 10678 2663 38713 12847 -20578 -34594 -68961 -75384 -98120
7724 -98120 -138454 -163476 -119009 -84768 -80417 -87878 -67051 -80346 -22874 -9478 -34434 -57665
7712 -57665 -84255 -53227 -19081 -59327 -36614 4653 -15808 -64476 -29524 -48637 -64473 -49047
7700 -49047 -90209 -119274 -93114 -89913 -98844 -84108 -54204 -22134 -1419 -36873 -96589 -89376
7688 -89376 -46648 -5329 -1248 1758 14381 31242 33872 32835 4631 -81197 -146897 -209745 -140457
7675 -140457 -116727 -133494 -148115 -121728 -78803 -61573 -41507 7705 36234 -6816 -113177
7664 -113177 -154035 -119073 -73045 -62721 -29395 -21032 -31728 -70952 -43031 -37984 -80677 -68608
7652 -68608 -33377 11480 7351 -16698 -61097 -115418 -138529 -88493 -66181 -20735 -4631 16335
7640 16335 21317 20071 3871 18529 12498 6837 -58703 -106185 -90173 -46947 44345 94999 44600
7627 44600 83 -2101 -2533 -30245 -15820 -24996 -33740 9420 -5769 -65090 -81221 -63683 -63674 -44995
7613 -44995 -29425 -55046 -44644 8532 14748 14828 -27170 3998 14694 30977 -14600 -67859 -73601
7600 -73601 -56594 -56538 -65202 -76045 -86562 -35237 1546 1040 -4040 -39058 -64790 -82151 -80363
7587 -80363 -80180 -64449 -46778 -48179 -67951 -52234 -10650 82810 95270 74409 34796 34586 2352
7574 2352 -35600 -35302 -10835 9147 -1380 9614 33589 2088 -62175 -133772 -134218 -152372 -198625
7561 -198625 -163667 -108489 -80114 -30034 -28297 -54181 -78208 -57899 -46983 -33946 -76414 -92997
7549 -92997 -53113 -27933 -31601 -31961 -13393 1794 -54669 -92169 -63825 -13416 7252 9520 75582
7536 75582 98385 756 -39123 -65751 -78162 -71328 -99172 -107990 -78451 -129638 -157564 -148389
7524 -148389 -116175 -114689 -127053 -94297 -99865 -132703 -155853 -120087 -65453 -31304 -64688 -118146
7512 -118146 -63084 -54979 -26557 -69981 -95157 -61124 -58734 -18654 21551 -21445 -18807 30016
7500 30016 17012 -22807 -32014 -54106 -35008 -37322 -58092 -68542 -85205 -99427 -112715 -103711
7488 -103711 -79132 -66304 -65190 -45525 -40993 -98455 -98844 -108898 -107846 -110104 -154148 -143295 -112446
7475 -112446 -140586 -172188 -143079 -96430 -28570 -21235 -77888 -98635 -97620 -49977 21819 57949
7463 57949 28140 -36730 -65316 -64775 -77427 -7702 37908 -10634 -16312 -11406 -49568 -55558 -86246
7450 -86246 -74576 -41882 -65484 -56219 17878 111651 122207 75310 -2443 -71027 -76161 -88662
7438 -88662 -108165 -153720 -170058 -126057 -102723 -99482 -85332 -85547 -67420 -105564 -103684 -104405 -116196
7425 -116196 -31872 -48884 -96024 -74932 -104649 -145326 -140910 -115466 -77277 -68390 -64454 -96140
7413 -96140 -57211 -20917 -32338 -96867 -126562 -168579 -169747 -173447 -133647 -103109 -60938 -33924
7401 -33924 -18685 -18601 -55744 -67167 -104632 -121609 -103100 -55664 -23536 -29596 -114297 -130130 -52488
7388 -52488 -35832 25635 37766 -8984 -24078 1383 -28002 -44106 -66830 -71148 -54670 2495
7376 2495 -3190 -53403 -109359 -129751 -104447 -107247 -104159 -50583 22074 73350 14719 5033 -2024
7363 -2024 -15179 -32883 2209 185 -18080 8788 -44138 -51927 -9260 20242 -4420 28769
7351 28769 -12690 -74823 -91474 -87507 -79832 -59719 -89858 -57158 -50258 -63331 -112286 -76563
7339 -76563 -57903 -59509 -104998 -137886 -87609 -44974 14924 -49026 -89278 -17212 2924 21363
7327 21363 19886 -377 11495 -49446 -126751 -122965 -93457 -121302 -151477 -129562 -57266 -16584
7315 -16584 -28739 -66808 -71939 -18778 -1924 38751 -4907 -17440 -11013 7303 57912 93198
7303 93198 74245 60500 12932 -27355 -34718 -52141 -41093 45002 48240 28683 -9407 -63214
7291 -63214 -96160 -114772 -112850 -76610 -57853 -96852 -74550 -23755 -19627 -74348 -94186 -43842
7279 -43842 -18811 29470 5118 -33702 3781 -18217 -68609 -51660 -26419 -12000 -27875 -37870
7267 -37870 4261 63412 109385 117533 75704 7456 -77562 -84750 -93473 -133390 -105986 -54852
7255 -54852 -25540 13315 34402 -580 -28852 -67871 -83947 -64343 -62399 -64825 -104440 -113408
7243 -113408 -89937 -59239 -7666 27448 38678 -12515 -61117 -66290 -82342 -97712 -57602 -69538
7231 -69538 -63446 -74936 -71889 -29829 -18919 9158 -18215 -133322 -175435 -180528 -184719 -184855 -118080
7218 -118080 -89276 -60297 -52976 -79358 -29317 27553 -24117 -84944 -123491 -89732 -46113 -30173
7206 -30173 -11477 20115 22493 32057 36100 -15512 -52680 -42614 1804 -55174 -59300 -28059 769
7193 769 9647 -25689 -52067 -95407 -75083 -112478 -150451 -126324 -50427 -23612 -77158 -55249
7181 -55249 -28888 -19190 -6266 -28761 -30713 -9216 -36967 -23045 -18779 30462 28780 7418 -11643
7168 -11643 -44514 -55417 -35079 -55927 -73405 -59083 -94244 -88491 -79535 -90697 -100937 -90596
7156 -90596 -39879 -48854 -59142 -16915 1729 24761 -8663 -53695 -77440 -44264 -67133 -42429
7144 -42429 -66762 -35954 -18944 -63922 -101621 -144909 -125787 -114644 -82511 -10468 -29149 -45924
7132 -45924 -55191 -75366 -137236 -185736 -193052 -162532 -114218 -82225 -19134 883 -7610 -32574
7120 -32574 -9116 3482 14326 21629 -1105 18430 40696 -24 4817 -21994 -24589 -35498
7108 -35498 2107 9605 18990 -13612 -28973 -30417 13685 22469 13037 -54436 -56688 -73097 -91420
7095 -91420 -74231 -77034 -105362 -58182 -39736 908 1250 -41857 -67620 -41090 -21407 -33430
7083 -33430 -37541 -69124 -4457 12309 -38179 -84821 -82505 -132133 -148360 -143602 -131241 -83669
7071 -83669 -35967 9997 25904 28599 10485 -46922 -99035 -126468 -157214 -121332 -57445 -20286
7059 -20286 -4165 -343 -28449 -64753 -33417 -17118 -63897 1763 71525 82505 85522 43781
7047 43781 40428 44030 32855 45881 12216 11476 8302 -25797 -11500 14205 18991 3049 -25823
7034 -25823 -47455 -72509 -124194 -91259 -40161 -42224 -94336 -90537 -40118 -18372 21145 44861
7022 44861 24292 33856 -38271 -42287 -40572 -24364 -37885 -22252 32578 47976 71141 64706 -2581
7009 -2581 -33924 -8729 3281 55773 54041 26343 29751 -12996 -34637 -64803 -59395 -59521 -65837
6996 -65837 -82120 -63024 -33037 -60230 -76150 -62550 -51444 -45417 8856 52053 20652 -20498
6984 -20498 1750 -1626 -18321 -49322 -76398 -76387 -69269 -98028 -36918 28070 17015 -47597 -49419
6971 -49419 -64761 -67114 -72996 -70402 -73187 -45338 -26483 -27532 -43120 -38127 -40235 -83010 -85253
6958 -85253 -55608 -79660 -114840 -157707 -168357 -141256 -114812 -61322 -41127 -35354 -3026 -21656
6946 -21656 -85212 -65320 -812 -14108 -43850 -99105 -128346 -91039 -60539 -97773 -154322 -107797
6934 -107797 -46944 -16468 20336 71572 100654 28716 -3226 38178 15508 24302 2849 -15208
6922 -15208 -35711 -115424 -130602 -131742 -92450 -53610 -53427 -101436 -114161 -96527 -85569 -74422
6910 -74422 -86572 -39363 12871 20219 12251 -48911 -28082 -7922 -20479 -64145 -84752 -76199
6898 -76199 -52733 -53138 -89140 -114379 -84399 -1239 -5226 2503 29460 -3165 -23046 -97949 -180190
6885 -180190 -169451 -95566 -69980 -77474 -102697 -88894 -84828 -121454 -97081 -90545 -90565 -129249 -134760
6872 -134760 -108779 -128778 -131163 -59816 -33037 13111 40393 43106 53828 62803 32972 31329
6860 31329 -4422 -54749 -86013 -78496 -75962 -45326 40415 46612 22027 28160 -43841 -79768 -57706
6847 -57706 21747 16508 -7391 -34702 -38894 -71124 -41715 -55529 -97201 -105464 -97415 -95781 -133473
6834 -133473 -116459 -113259 -57920 -55178 -71151 -126319 -54454 8383 -11915 -10646 -6011 -55245
6822 -55245 -92466 -85733 -86143 -75872 -56957 -30519 14243 805 724 -17284 -55355 -104469 -104758
6809 -104758 -68551 -50098 -32923 -44685 -79678 -110229 -88040 -29378 -23725 -45807 -72299 -77796
6797 -77796 -61112 10671 102188 58815 748 -39643 -48842 -17026 -21075 -70316 -94349 -99226
6785 -99226 -62938 -82992 -127144 -54249 -4824 -257 -7485 -6690 15075 13989 4204 29039 34251
6772 34251 6531 49822 24305 -35961 -48735 9180 37144 24380 -9513 -16058 -34799 -14763
6760 -14763 18180 -7950 -87909 -101203 -58303 5575 18486 8139 6589 -4250 -21858 -47145
6748 -47145 -36316 17047 57699 -13238 -33969 -20448 20889 30398 -22187 -37140 -19400 -58774
6736 -58774 -37550 -36936 -16268 -5680 12091 3859 -13230 -8687 494 -22163 -66268 -77284 -10295
6723 -10295 42969 37906 23442 -19541 -29213 -61697 -64188 -73593 -18903 123579 148334 72919
6711 72919 79623 87547 123679 120375 123712 149385 121130 65746 -9514 -41240 32506 23096 -30133
6698 -30133 -57222 -18973 7075 14984 17766 12993 12549 -6164 -45725 -61208 -67932 11995 17054
6685 17054 -41617 -46756 -27320 -31745 -50511 -34695 -39589 -10182 -37017 -92034 -58525 -60502 -70790
6672 -70790 -46424 -23542 -18979 -19093 3932 -17909 -15793 -23475 -23106 10731 46031 56444 11610
6659 11610 -66927 -42190 5765 30253 39643 48810 71556 13523 -34051 -51914 -66377 -69273
6647 -69273 -68192 -97699 -66168 -20832 6126 -7751 -65269 -68173 -13775 -19543 -43816 -16062
6635 -16062 -43318 -114508 -153403 -115464 -54343 -2158 35070 35244 -14287 -56820 -31128 14195
6623 14195 8022 4826 -38659 -3719 -15087 -18322 1452 15642 30791 -2485 -57602 -28329
6611 -28329 54861 37809 4413 -35255 -46546 -56753 14069 30944 31744 7297 16039 -5398
6599 -5398 -14381 -61477 -26962 41779 14697 -1792 -3637 -42731 -35041 -37008 -48388 -74170 -43602
6586 -43602 -26996 -49457 -14242 13168 7292 -7605 -19058 9174 39279 -7942 -630 994
6574 994 -10502 -36672 -40748 -61114 -94122 -97374 -89908 -65006 -43632 -7381 -9165 7063 27823
6561 27823 28529 18757 -15036 15934 78060 86727 93737 63955 40174 48810 20099 26986 -5888
6548 -5888 -13683 8448 3145 -25296 -25186 -14633 38358 60065 54535 33797 10844 -48458 -45395
6535 -45395 -8018 29839 68684 29690 19487 -13604 -22789 -53869 -14202 40328 -6261 -20229
6523 -20229 -43265 -5999 -4988 -3109 -3969 26950 6794 -55026 -126852 -102458 -33657 -26349 31065
6510 31065 48419 49675 87154 110443 105315 66008 20417 -15763 -36272 -11892 -35164 -10250
6498 -10250 34252 53180 34479 -1535 -69186 -74402 3821 11138 -6087 -46421 -41611 2128
6486 2128 11716 -15591 -55843 -48582 -41217 -91524 -120127 -121916 -77209 -85647 -46255 -56835 -72429
6473 -72429 -25858 6129 -10965 -43930 -13353 25377 55457 45637 -18668 22091 62865 64182
6461 64182 41754 -1005 -8776 -3830 -23399 -42586 -125011 -145126 -159160 -124636 -61851 -35778
6449 -35778 -44240 -39326 501 4525 -24622 -17575 17506 -36271 -74220 -61744 -16434 4323 -26460
6436 -26460 -113362 -60281 -15121 -48806 -92362 -72740 -24582 -71298 -72365 -55474 -17996 -6034
6424 -6034 -33740 -86614 -85955 -92976 -57045 -45508 -71962 -76327 -116095 -93024 -35369 -67361 -112497
6411 -112497 -83053 -42542 -23018 -40971 -53015 -52634 -52648 -9783 -18211 -45272 -58114 -86501 -87334
6398 -87334 -72957 -56328 -67004 -42510 -47807 -49746 -69505 -97517 -32293 -38734 -35819 -23899 -54101
6385 -54101 -54260 -71512 -56995 -39487 -51273 -98138 -121040 -106958 -65319 -38441 2379 -18543
6373 -18543 -22583 -10166 -4849 23469 53868 32697 13588 -4266 -39585 -75158 -102392 -37136
6361 -37136 870 28880 32699 -42061 -147994 -103055 -54442 -54644 -20878 4148 11598 -21284
6349 -21284 -21215 -37394 -29473 6314 30751 33939 44470 45590 8138 -21353 -37341 -38370 -44166
6336 -44166 -124836 -110852 -105845 -102101 -114830 -132834 -88666 -47492 -31003 3877 6442 38005
6324 38005 39529 47156 -34341 -74670 -55879 -1265 25702 35843 -3457 -1583 -648 -13544 -21282
6311 -21282 11687 66119 47076 -8153 -62611 -74947 -64545 29698 103953 49236 3949 8085
6299 8085 20741 4993 -21441 -98315 -108316 -100128 -51878 -32309 -60183 -44838 8245 10863
6287 10863 33380 -2885 -4602 -17191 28516 36685 -7785 10100 20947 -7158 -44276 -58127
6275 -58127 -77719 -145932 -156233 -66550 31970 22486 50097 77403 34996 13716 52110 41792
6263 41792 21168 26738 -3966 -51903 -57091 -106450 -92946 -100322 -77241 -29198 -28485 -2164 31464
6250 31464 -7269 14127 -18742 -59478 -72283 -73194 -130193 -168992 -219846 -186704 -149579 -128722
6238 -128722 -109413 -77816 -63000 -62763 -94731 -71635 -24883 -27002 -57101 -69490 -76843 -76876 -62534
6225 -62534 -74503 -69051 -93745 -122770 -126608 -160140 -138817 -72129 -44585 -29375 -44878 -56541
6213 -56541 -70743 -94435 -94295 -45224 -8329 -18364 -27178 -53237 -58285 -12497 -22308 -9612 -38802
6200 -38802 -50172 -53011 -69588 -45375 -469 -20490 -50781 -51203 -44956 -53226 -106167 -81680 -23047
6187 -23047 -16302 -50825 -72300 -30574 -13805 -53227 -59915 -14814 -31115 -48384 -34303 -29818
6175 -29818 17395 12889 37141 26614 344 38180 -1848 -34471 -23280 8683 23273 -8032
6163 -8032 -51348 -53574 -44390 -88664 -111882 -94314 -66070 -1984 68742 82221 55251 -3895
6151 -3895 -39018 -1523 11166 31906 38294 37206 35662 -38157 -57698 -128665 -158508 -126187 -79850
6138 -79850 -41955 -104641 -160486 -114141 -71388 -88200 -46274 1944 -31231 -18636 -37360 -80022
6126 -80022 -58545 -20475 -3919 23815 1097 -18000 -14426 -15627 16719 -13166 -20486 -35782
6114 -35782 -81549 -59988 -1774 28027 27744 15191 -42302 -56688 -57956 -47933 -31098 3146
6102 3146 16012 -49561 -42946 21613 -8214 -89208 -73592 -6563 15004 -624 -26107 -93851
6090 -93851 -52318 -9872 -5132 -1348 18139 78879 85753 881 6061 53468 1691 -15459 20521
6077 20521 54181 74990 32583 -43395 -42224 -31138 -60343 659 15136 -38633 -31274 -2019
6065 -2019 5080 1352 -25294 -20098 34980 37916 -1256 -31902 -28353 -53105 -51846 -59916 -104122
6052 -104122 -112110 -130160 -106131 -52313 -1550 4186 7317 -17077 -31916 -16409 -27652 1164
6040 1164 -19859 -3737 6661 -19904 12268 36171 34370 45642 -1151 -22553 -32850 -20849
6028 -20849 -27285 -24613 40772 -20428 -100224 -108279 -95992 -5155 31461 -12481 -86148 -71988
6016 -71988 -61566 -64126 -52785 -46919 -66386 -43295 -16123 -10234 -62184 -78786 -43944 17167
6004 17167 25179 -12027 -80903 -113304 -102630 -30676 -7425 -30941 -34560 18341 21816 -14565
5992 -14565 -37275 39374 113494 129549 114752 142304 136884 91971 72872 30360 22055 13229
5980 13229 63168 26200 -17548 -39794 -1672 9559 5485 -59489 -45262 9752 55276 102805
5968 102805 98437 101952 149897 138977 106660 76734 33655 23757 -22423 -58728 -62694 -37991
5956 -37991 43565 50116 40295 3241 -28574 -32342 -27872 15914 53248 18720 -18649 -24341 -44337
5943 -44337 -35986 5658 -5142 -2541 34093 80889 131263 145230 114693 107168 63531 63900 63330
5930 63330 21985 15244 19973 24240 -9000 -56028 -65874 -72049 -83663 -58254 -56431 -70685 -79398
5917 -79398 -80556 -66568 -74814 -91339 -120600 -123483 -79779 -50400 -36108 -62739 -122187 -106038
5905 -106038 -56145 -51451 -38481 -41771 -46618 797 14423 24103 42239 36820 52788 1097 -55772
5892 -55772 -52705 -64287 -52 26695 2690 6322 -29101 -28058 -36528 -85775 -74815 -71446 -68113
5879 -68113 -20068 -38930 -49731 -62922 -26901 1394 -15178 -5716 17030 32466 17952 -15214
5867 -15214 39468 50382 -34087 -53097 -39697 -7012 14427 28960 51544 76448 91762 82791
5855 82791 100295 88275 35068 -94417 -132296 -95669 -18427 10919 -38795 -9354 7505 -21249
5843 -21249 -42036 -34942 -49597 -103574 -52947 -23902 -27796 -45692 14441 8125 -42780 -25593
5831 -25593 -29442 -45255 -80722 -51070 -39351 -81419 -104946 -60491 -14690 -13512 14056 14244 -22573
5818 -22573 -8446 -8129 21567 31936 17518 -4421 11187 59221 15121 -18090 -1611 11433
5806 11433 -16608 -5966 36164 3803 -17128 -48165 -33082 3750 2126 -27081 -70024 -61662
5794 -61662 -51269 -43672 -38441 -65816 -15554 -1747 -31668 -48966 -137898 -167381 -93608 -74741
5782 -74741 -41831 -21372 -47565 -59494 -75100 -111377 -104565 -78984 -111122 -170858 -207858 -148600
5770 -148600 -59336 -41039 20037 64825 79207 54629 112596 156605 111546 75204 5069 -51434
5758 -51434 310 55686 69773 46740 6736 30578 16352 8685 37884 60681 46984 -5225
5746 -5225 14624 53101 30549 -9761 -35877 -44882 -34517 -15425 12334 4521 22728 -16558
5734 -16558 -27268 -33698 -19084 18528 34499 -14849 -23596 -26681 -30738 -39852 -25586 30755 37946
5721 37946 58638 30608 18116 28452 10787 -34942 -25055 -19513 35266 60849 53701 34619
5709 34619 -44537 -60961 -40025 -24622 7222 45547 45341 -823 17529 17105 -21762 -16990 -21472
5696 -21472 -27533 -12512 52392 70410 57160 65413 1234 -56375 -61731 -6781 21540 -14840
5684 -14840 -40853 -56130 -55388 -67247 -4261 92472 107257 75754 26565 -22885 -79261 -144159
5672 -144159 -103944 -70754 -80296 -94443 -77588 -36156 -34388 -30748 -12743 -32895 -23800 -25229 -45745
5659 -45745 -26217 -51592 -63581 -22098 20813 22969 1774 -42319 -52017 -57332 -13204 27390
5647 27390 52099 56072 40171 -43169 -56073 -41174 -44662 20124 28292 -23329 -56943 9500
5635 9500 44696 31888 6578 -54923 -77665 -76683 -117956 -127264 -128538 -115467 -56185 -21823 -11620
5622 -11620 5582 -4756 -31940 -20564 8760 -20000 -1448 35112 32667 -12043 -14606 -66508
5610 -66508 -73717 -25602 -17495 42039 10517 -43028 -16682 7599 18458 32787 44282 16691
5598 16691 -7486 52950 34026 -14136 -76061 -46508 -53869 -58289 -40397 -39979 -79493 -56023 970
5585 970 33704 7055 13123 45798 42518 8209 14804 34435 -6470 -14988 -25032 -20450 -60725
5572 -60725 -98737 -91990 -58850 -22810 -14771 -86470 -80219 -80499 -80575 -124982 -179297 -184297 -107592 -36630
5558 -36630 -4504 23816 -6347 -13530 10952 40603 30573 22584 25273 41354 38980 -18653 -37089
5545 -37089 -21776 -22420 -32789 -56482 -88202 -60269 -34228 19393 50792 2177 -51179 -77077
5533 -77077 -91108 -43417 -24049 -24751 -19651 -39494 -53808 -48552 -5954 -34393 -59904 -46058 5719
5520 5719 -5354 -41838 -43596 -25844 24078 -1577 4923 -14183 -13148 13666 49822 110219 141879
5507 141879 61502 33289 12381 30381 77155 112223 61449 8158 -52641 -96757 -67954 -43100
5495 -43100 -21185 8708 -13045 805 24224 18342 -24395 -44033 -11442 -68492 -56558 -37759
5483 -37759 -9671 2775 -1643 -15688 5284 -37845 -52814 -45244 16567 3577 6783 60063
5471 60063 14198 -4910 10355 29511 3889 -44429 -75763 -92981 -87934 -54262 -86655 -85497
5459 -85497 -15889 -26452 -51625 -71117 -74428 -122721 -126820 -36393 -68502 -121553 -86963 -60498
5447 -60498 -45802 -5524 93400 91584 15571 -37597 -52865 -14591 13751 41294 24528 13190
5435 13190 29981 51252 20264 -2750 19536 20668 30872 52204 95758 91461 7500 -4759
5423 -4759 4737 -17919 11272 9396 -49961 -84386 -29097 -27625 -39198 -75798 -69785 -38381 19814
5410 19814 -9140 16900 45173 40221 1849 -2779 -33181 -12296 -21837 -75204 -106829 -125175
5398 -125175 -71163 37372 93356 39009 -7132 -27302 29626 27542 -18236 -38763 -24918 -39188
5386 -39188 -64510 -32050 -33171 -31142 -4383 23352 79521 48301 39210 54774 23799 -42450
5374 -42450 -39683 -97624 -91812 -70610 -45688 -48775 -69077 -73879 -27532 -9840 3754 11535 -17782
5361 -17782 -53985 -48480 -21473 -16327 -55376 -57105 -52312 -74247 -115828 -94478 -48047 -38408 -13298
5348 -13298 49188 20952 -19695 1382 13981 12927 -1033 -6285 12054 -32995 -86003 -14695
5336 -14695 44995 83091 50171 -12958 -7603 45329 13716 -13894 -34843 -29236 -77136 -69766
5324 -69766 -14161 28299 14745 -32212 -42943 -29609 -36235 30293 38328 17435 -12403 45057
5312 45057 67102 35871 18715 44073 41285 19137 29341 41450 10047 -8220 13446 -45899
5300 -45899 -82758 -66956 -36878 -7445 1883 -63318 -93129 -102830 -70629 -9963 25362 19637
5288 19637 12585 -1494 -19899 1710 33499 27289 22975 -14980 -33868 -47477 -56551 -18948 -25037
5275 -25037 4761 33659 62023 37211 27730 13982 -15405 -10928 -65251 -20806 -5441 12778
5263 12778 -28474 -40095 -40324 -6826 25228 28640 2489 -13889 -17846 -41283 -52737 -12417 2999
5250 2999 12660 41835 28254 11578 31145 22367 24415 15225 49096 84156 121153 69447 42556
5237 42556 35995 45997 3847 -15564 -5479 -5655 -6433 35431 18201 7733 9275 -3763 -4139
5224 -4139 17031 31946 42530 65217 85319 19547 -57565 -90236 -43240 -28955 -50733 -50883
5212 -50883 -67501 -24592 4773 28264 -3907 5496 58507 30235 36614 31110 29261 56930 54646
5199 54646 92103 118627 113922 72834 34533 -6557 -22283 -48332 -9647 19009 -11622 -51481
5187 -51481 -56227 -48175 -16345 -12680 -2650 16954 15082 38489 105986 107863 81862 49240 -17253
5174 -17253 -30491 -34759 -42779 -7174 18401 7656 21044 61518 -11404 -52247 -38231 -27582
5162 -27582 7290 -10127 -44659 -91320 -60046 -60355 -53855 -58710 -37116 -4444 37905 34059 57821
5149 57821 30512 -11359 -9876 16619 28178 93647 75476 31068 74515 111892 80523 62851
5137 62851 44374 -23196 -77894 -42994 -32962 -3229 -12803 -15789 -45610 -46072 3301 40157 53718
5124 53718 8424 6787 33554 60446 43860 18160 -8842 6104 21548 18217 4633 4129 -30610
5111 -30610 -1535 11108 61377 86155 49373 -19422 -10003 30550 52661 106264 140474 117186
5099 117186 24007 -23784 -36159 -29467 -39566 -59203 -64877 -83691 -90871 -75454 -78061 -61323
5087 -61323 -60474 -79996 -43240 1948 -2694 18321 24407 -10032 -23615 21230 53984 2800 -22322
5074 -22322 -8486 19282 -5854 9937 -19318 -94784 -43123 -6823 -52600 -76335 -58017 -97610
5062 -97610 -113843 -152793 -146094 -151504 -97464 -24831 -3299 -9975 18501 42000 1169 -34557
5050 -34557 -78304 -92224 -100955 -50548 -80194 -64582 -4439 -1306 -3396 -384 3269 11309 33589
5037 33589 43828 28974 34820 34594 14814 -44325 -97461 -61065 -40732 21126 2943 -27400
5025 -27400 -67264 -65694 -16877 -54213 -9996 15232 4686 -13592 8564 28464 -10932 -18354
5013 -18354 -39610 -50119 -68762 -69414 -50632 -19044 -3740 -30266 -9578 14021 21655 -4463
5001 -4463 -70183 -31983 -22003 -28489 -30592 -41767 -45059 -15501 9515 45967 51876 31255 -13733
4988 -13733 -77543 -77695 -75864 -60387 -54547 -49115 -5267 -28058 -87728 -81750 -18484 -971 27494
4975 27494 -572 24322 27492 -17948 -34288 12555 -34958 -62406 -76532 -48842 4314 -8064
4963 -8064 -11131 -13583 -41222 -95065 -67871 -43355 -44924 -109764 -124653 -56412 -10120 -12904 -30378
4950 -30378 -1472 -37179 -46065 -13812 -19062 -14378 1515 -9054 -20798 -33721 -28426 2212 -19920
4937 -19920 13266 21744 -23334 -32445 -43434 -61562 -78406 -36308 14245 32244 15196 33579
4925 33579 19995 -4020 -28183 -21243 -9087 31130 17946 52710 26655 29330 -50361 -56776
4913 -56776 -18336 -11086 -3132 51907 76486 29617 -25621 -26024 -25646 -57973 -52348 -17736 -52703
4900 -52703 -24062 14584 -6175 2425 56322 77648 47701 43435 2918 -53572 -52948 -19401 44779
4887 44779 34404 49873 38738 5485 -27139 38821 38835 -3721 -54941 -49905 -6253 31713 54996
4874 54996 44660 59159 49212 40234 64026 97975 50452 -14836 -9525 -65417 -71464 -33172 -39864
4861 -39864 -54862 -32801 -12711 -14454 -41963 -21786 33897 41344 1351 -73822 -48964 -70965
4849 -70965 -111371 -90225 -21057 -10849 -5086 -21954 -4955 -3606 17727 60312 39995 17503
4837 17503 -3049 23004 34032 7372 -9610 -4054 29473 41066 -15630 -56523 -43375 -40383
4825 -40383 -61236 -91211 -103412 -96622 -27360 22812 15183 59871 66780 42300 39207 -19679 8148
4812 8148 56943 25552 25529 48078 5846 -29790 -23278 -6727 -9110 -15057 28973 -14623 6587
4799 6587 19792 2612 27817 -571 -40593 -55822 -119549 -117106 -30648 50903 34426 69019
4787 69019 56262 53383 76486 47863 7845 -55368 -32090 -48434 -45675 -35208 22999 32739
4775 32739 -11908 3236 13220 64188 38612 59080 105074 85101 58053 34569 21935 17253
4763 17253 16147 58851 51808 -23163 -13933 -4868 42521 67754 82254 84017 87070 97860 91884
4750 91884 28749 -33929 -16958 -24495 -51270 -33805 32070 38171 41932 51129 65796 56818 52792
4737 52792 52935 87504 115784 53337 -54164 -59439 -71099 -101941 -110546 -41856 -8791 502 14692
4724 14692 3848 -20479 -47833 -110845 -126859 -52001 11065 31891 23723 38913 35684 23690
4712 23690 14808 25614 5593 3649 -44594 -47710 -37939 -68893 -81782 -68742 -56110 -80301 -64338
4699 -64338 -31281 -5740 -78676 -44402 -30535 -45843 10433 39579 48873 52682 -46077 -61456
4687 -61456 1560 22229 46978 49618 10447 -16244 26093 61887 87711 45444 43038 78201
4675 78201 133205 100611 61138 20902 -6439 -63493 -16632 33790 -8958 -14431 9486 8794
4663 8794 33417 35892 26271 23212 -17089 -7330 14433 -34547 -8077 8433 4064 46270 114136
4650 114136 89926 -29005 -60554 -61681 -62281 -7081 -9283 12107 60100 29099 25454 8458
4638 8458 -44570 -73943 -59731 -70222 -77206 -70302 -36952 -61495 -31867 6738 12971 -4066 10938
4625 10938 33746 7410 -6729 -16935 -45741 -28213 -5303 60061 60406 103110 92716 125080
4613 125080 93761 12308 -11057 19486 22037 25240 57565 76346 78836 47750 25939 -24463
4601 -24463 -61923 -47643 -15028 9631 40676 87966 105779 2008 -72390 -42413 41419 75399
4589 75399 68593 47577 27786 40679 50070 55821 -9105 -61176 -36519 -59334 -33061 -16368
4577 -16368 7989 -24619 -2452 14383 -28403 -81635 -15191 67897 72264 39950 49638 66140
4565 66140 20789 -30246 -60272 -53572 -39842 -40868 -29158 12910 37669 33214 5312 9226 61989
4552 61989 52345 73642 36521 -12536 1638 4972 -21167 -12231 -30984 -96534 -117973 -82105
4540 -82105 -57923 -1761 16088 -9404 -21365 -24126 -29828 10008 41717 32298 -2916 -44554
4528 -44554 -3975 25118 36881 28937 -30505 -28383 -41370 8037 46446 -13681 -43569 -80596
4516 -80596 -34791 -5077 -37711 16657 68094 71368 80237 48500 -17298 15561 52462 57181
4504 57181 63164 56326 5690 40303 49057 19763 -15321 10866 54897 19841 -17279 -13524 -839
4491 -839 37832 63214 50916 20096 -66216 -100913 -107011 -68609 -16181 17945 17395 -13656 -104192
4478 -104192 -80340 -2857 7573 12878 -46977 -105404 -88121 -83180 -46973 -15906 -37933 -25203
4466 -25203 41753 -24330 -35471 -63082 -87470 -52026 -4132 21160 28464 7512 3395 -11846
4454 -11846 12278 -1694 28861 48411 10127 -21467 11754 41276 54914 37490 19601 -1335
4442 -1335 33061 74954 86359 78025 47852 69891 56850 8407 -21080 -35622 -24554 -20176
4430 -20176 -64659 -131921 -102675 -66186 -37850 9388 43054 54023 -12094 1264 712 5746
4418 5746 17046 -6973 25938 67809 75611 33027 22852 66000 25186 -3378 -29128 -40307
4406 -40307 -17207 -30580 -56250 -48053 -47143 -55261 -31507 -42729 -121659 -105139 -62611 -68696 -83703
4393 -83703 -58499 42974 14179 -15456 -13545 -25542 -42028 -5357 41031 22278 15900 71489
4381 71489 47160 5960 -24549 -22078 -45460 2214 -5384 12741 -316 19503 37497 67893
4369 67893 41721 6299 25670 20798 21741 57936 71165 60857 25534 8560 -9710 -24736
4357 -24736 4364 -22473 -43267 -83590 -105424 -91249 -73533 16786 21068 8044 38637 58941
4345 58941 61528 46799 30325 -46456 -8890 26647 48905 12951 -45548 -50753 21197 112338
4333 112338 82860 50166 61890 32095 14711 -7121 -34280 -146 4946 -15435 -5883 9640
4321 9640 19307 35743 55382 84740 84947 99996 55036 94544 118357 101085 49929 14501 -911
4308 -911 -49930 -31458 23608 49836 7183 -15440 -7428 -7977 -4799 -23426 -33235 15020 64699
4295 64699 15929 -8973 -18679 -66018 -37970 26307 31304 12935 -57662 -75770 -45155 -52405
4283 -52405 -34318 17697 -5023 4310 50654 50294 -27432 -71724 -89686 -76159 -42581 -45248 -43612
4270 -43612 -29828 -36153 -21007 -16337 -19576 -71913 -85256 -24327 -3545 -39195 -87753 -110063
4258 -110063 -78216 -42289 -15751 -22485 -62393 -39190 -28009 -79386 -114646 -162465 -114720 -55524
4246 -55524 158 16866 27391 -7692 -11564 -39537 -59921 -36951 -52785 -56142 -65591 -102230
4234 -102230 -93278 -60909 -20539 19707 16017 -16214 -96243 -96420 -5114 31339 -17674 -3661
4222 -3661 -8231 -43553 -39327 -41182 -12084 9581 39045 4120 -842 -2787 -15818 5633 -25159
4209 -25159 -13505 4453 17745 16805 18679 16339 20894 38015 20516 10510 -12816 -47967 -54568
4196 -54568 -19776 -3391 -18064 -15366 -70303 -98267 -89134 -71136 -50074 -62819 -45710 -1636
4184 -1636 -3973 -1834 -4572 -13262 -48028 -14796 19828 -4371 15287 9323 27685 -2554 -33312
4171 -33312 -67993 -41886 -65375 -39621 -19750 -16204 21322 55409 101490 70720 75767 81469
4159 81469 27330 -31739 -65808 -100344 -69520 1242 3018 -63476 -40901 9291 36394 87750
4147 87750 104632 84781 18236 -40770 -22494 -46617 -61685 -8749 -8225 -70139 -54007 -50425
4135 -50425 12860 25243 -12588 -28387 1899 103426 147695 102680 12567 -13368 35305 65324
4123 65324 68249 9931 -18181 -20260 31482 48822 34662 30864 49717 3888 -22499 -9918
4111 -9918 -4999 24576 10769 385 17305 15796 32445 75000 18178 -35119 -39761 -26999 -16304
4098 -16304 -41745 -36975 12674 15083 -38811 -91508 -119991 -106622 -81690 -79293 -92648 -101351 -95810
4085 -95810 -64199 -9043 17495 46756 47980 20059 15117 34026 14170 -17603 -24049 -14845 -47853
4072 -47853 -68100 -79573 -79376 -90658 -107890 -79200 -35101 -18112 -55755 -48929 -35526 -19460
4060 -19460 -12378 -21877 -43901 -40104 -61627 -100287 -123554 -42741 -10252 -16051 16468 28313 11384
4047 11384 -12086 -8026 19297 -11825 8818 18522 25711 -3177 -8345 -12828 448 -8770 -49620
4034 -49620 -46987 -13820 10012 3858 593 15146 16522 -1075 -4787 -25349 -42692 -10207 3841
4021 3841 17822 5388 16996 59440 59989 33254 45288 7772 -76 14021 21107 -17666 -8053
4008 -8053 -52789 -84031 -45455 20275 15169 5158 -17776 -66514 -55081 9220 -8522 -29777
3996 -29777 -54214 -82969 -121357 -89661 -99821 -70399 -56607 -37739 10191 47749 21187 23486
3984 23486 61655 99361 94104 74595 38632 2215 -58992 -58500 7431 47842 104466 85885
3972 85885 9005 -103368 -119755 -58979 -16675 9492 16295 13305 13153 6254 -16057 -21467 5065
3959 5065 14292 14711 23844 32465 24664 55774 64012 33616 33175 18630 -3153 -37384 -14123 -13008
3945 -13008 -45361 -38960 19653 46186 49786 36405 -8496 -51692 -14909 46843 21985 -29860
3933 -29860 -5837 -1104 -13961 24687 17760 -15081 -6777 -72816 -116469 -61657 -10574 30311
3921 30311 41421 48619 30975 -218 -32510 -38503 -13864 -10990 -32083 -22964 34221 85217 102039
3908 102039 91096 57152 31544 53202 57371 78435 78769 45532 30034 -5939 23705 64848
3896 64848 63293 52392 15 -3420 12746 6459 4574 -25003 7935 21388 -16372 -11017 -33550
3883 -33550 -4532 33015 44215 25834 4439 46602 27568 -1628 -81327 -51112 -22060 28095
3871 28095 43288 45718 27722 25466 -12102 -56480 -14001 -16796 -12662 59299 77687 44973 36434
3858 36434 -3882 52025 73738 52101 43117 65594 44188 1333 -527 32338 28622 9652
3846 9652 41904 68301 60538 23609 18954 7029 14526 20440 51472 22921 46833 85239 93340
3833 93340 74440 80574 67954 5333 27411 1797 -2449 -16472 -90979 -112698 -83183 -12292
3821 -12292 -232 26103 63440 -7592 -53908 -53023 -56076 -73161 -51340 -11287 10239 62962
3809 62962 83071 35856 -22305 -2334 21941 34234 9467 210 -47943 -16338 -3866 5483
3797 5483 -18826 -54985 -19612 25405 38170 -227 -61894 -111663 -148975 -113726 -31228 4415
3785 4415 -27654 5666 -42203 -56431 -32617 -5240 51232 78175 27615 837 -17432 -49965
3773 -49965 -88398 -87303 -98476 -30147 -35459 -70105 -38174 47318 46781 10157 9320 19486 38870
3760 38870 37115 9439 2776 -45163 -70135 -18636 2316 42688 52801 83688 73754 27438
3748 27438 -6843 -13501 -11700 -16777 -43374 -111254 -119397 -88909 -82064 -71626 26999 92419 81460
3735 81460 79509 33071 -22621 -2252 -11974 -58629 -38642 -16027 27490 45302 70684 86728
3723 86728 51910 76427 71471 100560 66802 70150 34690 410 15598 -472 -12185 16891
3711 16891 48619 36966 -6226 38625 91801 43205 25264 42433 74325 91078 80556 3426
3699 3426 -77277 -128096 -145437 -72729 11490 -8831 -53184 -74839 -54535 -68737 -43191 28285
3687 28285 45249 12630 -50523 -90938 -66567 4842 38127 26347 50115 22965 -12081 -60499
3675 -60499 -56906 -22786 14614 -7091 -104504 -113579 -24187 32695 2812 -29694 -58273 -40782
3663 -40782 4594 3816 14222 -18083 -7677 31369 -10249 -23018 -24463 -25298 -74553 -78612 -25492
3650 -25492 3393 -56989 -51713 26156 -2733 -710 -6478 33861 58016 41501 27943 -21103
3638 -21103 -32401 -111287 -135496 -147714 -122462 -77648 -33580 -56134 -52796 3067 -22441 -15403
3626 -15403 -2314 21706 26963 37351 62382 32363 -33009 9839 43434 67463 95035 15480
3614 15480 -24720 -30235 33178 -19518 -57077 -26314 -860 -14039 -15062 -42379 -68234 -60962
3602 -60962 -89090 -116843 -88420 -40514 2821 30450 65014 48020 754 -3999 63900 84846
3590 84846 74729 26284 -12138 22334 65080 67693 60721 54329 46451 11537 10689 687 34400
3577 34400 15039 -12898 18121 -1321 -76451 -6471 3613 -16956 16785 18900 34078 40338
3565 40338 35103 26185 12742 20497 -3859 12082 17969 21419 -37184 -85864 -80081 -14577 35039
3552 35039 -8875 -49750 -83421 -52442 -39607 -38681 -77999 -80210 -42626 -14519 36033 70253
3540 70253 82712 50178 49889 66213 63673 53645 27664 5656 -12064 -31072 24081 8532
3528 8532 -41271 -53066 -17012 56654 39577 15628 -8627 -36489 -10703 7384 -13348 -65110
3516 -65110 -111861 -70089 -30794 -38158 -69855 -54504 -53987 42372 82061 91977 70810 18628 16527
3503 16527 19082 20011 41595 21868 -18936 -7756 -2309 38154 76431 39483 -15267 -12720 -12965
3490 -12965 -33469 -21517 -3897 -16530 -35949 23396 25518 6100 24026 38672 35837 53727
3478 53727 104959 77427 65837 50482 17683 7934 -48450 -58157 -72730 -85199 -96876 -67408
3466 -67408 -51958 -5296 19949 39191 30409 18719 -21841 -28267 -35498 -65973 -81432 -72843 -69174
3453 -69174 -43168 -28415 17020 48717 111053 97992 57658 23017 -25676 1885 32273 -11076
3441 -11076 -47807 -530 64014 110779 131684 85284 38038 30106 -22112 -11777 2333 -4527
3429 -4527 25827 56369 52248 -6269 -47061 -59745 -9237 -10962 -4957 -7820 -7832 -2478 53287 64720
3415 64720 31361 8917 13385 -10956 -34588 -38811 -53387 -75050 -71348 -60004 -39541 -21900
3403 -21900 6151 92990 120906 68713 54671 70337 123324 110469 81973 58834 66983 51193
3391 51193 21488 551 -8406 -12095 -9238 -7921 -12910 24485 18617 75850 89014 44036 20882
3378 20882 -19484 -9477 29081 8466 4358 3877 -2521 2187 -2134 22196 -23217 -38198 -17601
3365 -17601 17891 51483 70403 88080 102270 66449 -34875 -41856 -72845 -79842 -121950 -92782
3353 -92782 -70399 -52821 18971 -15930 -55342 16636 51207 -34847 -35971 -17491 2182 -9708
3341 -9708 -67644 -46485 36085 51306 37909 45543 28208 -29594 4264 -26110 -34409 21136
3329 21136 52367 45034 47013 44800 60406 114181 86885 5168 12205 -25969 -82786 -62513 -31048
3316 -31048 58323 87112 71408 48914 11383 -53809 8709 36991 47301 72608 43561 46250
3304 46250 101056 105513 40745 -23505 -36327 -59651 -79306 -76445 -35820 -30274 -40171 -54163 -46275
3291 -46275 -44580 -23057 9193 42126 67459 25638 3969 -41389 -43791 -14930 59280 42707
3279 42707 -8455 -9144 15615 18914 35292 51902 36518 -35841 -100121 -73275 -40032 -2829
3267 -2829 69632 38321 -320 -27658 14785 10302 3547 -38219 -26458 17338 59142 67265 20297
3254 20297 -18545 -27937 -79981 -17634 49925 55634 9240 1351 -16601 34397 48343 44355 -4559
3241 -4559 -72635 -61365 -13279 -4775 13877 20822 21576 18206 9415 -14266 -21784 -47477 -33426
3228 -33426 4903 -25550 -29588 -2032 50731 19360 -3328 34327 87067 137710 113303 91444
3216 91444 74254 39900 -3558 -33191 -75738 -80824 -56582 -19296 -23963 -13372 -245 22753
3204 22753 33980 4455 -28786 -33863 -21828 -51679 5732 128407 133866 62081 -646 -16350
3192 -16350 14938 17401 -29758 -49253 -2622 12107 47376 53240 26040 -41517 -26944 26757
3180 26757 19775 3755 -56396 -97229 -25830 21097 -42165 -69691 -26335 67964 118109 66096
3168 66096 43027 40300 93878 98431 69945 59794 9151 10606 -5375 35335 35574 -17728 -4930
3155 -4930 -12947 -57243 -80489 -57731 -30322 -37573 -61123 -27592 -7194 13761 30788 13584
3143 13584 17148 9413 -12548 1426 10617 -44215 -38342 -34608 -16388 -52255 -81093 -38399 -17545
3130 -17545 -33646 -6348 -17234 -53876 -33535 -17845 -38086 -56664 -99095 -52747 58480 36947
3118 36947 -28120 -10391 -22709 -35939 -71797 -67591 -12363 -72885 -113033 -102876 -98458 -37818
3106 -37818 -32129 -30600 -13824 -28987 681 11667 -32245 -56118 -23728 5018 7343 -3693
3094 -3693 24835 28114 43170 28850 -8851 -29525 53577 107690 88000 72566 89190 48086
3082 48086 -1259 -10601 43447 41229 -11409 -27733 -29832 -24819 -12951 -33761 -28164 -36027 -7535
3069 -7535 48738 52203 55481 26922 17133 6879 11489 -11476 -6581 -33391 -20328 -13432 -8279
3056 -8279 28172 54642 95516 114980 130626 168349 154193 118232 112138 106474 163345 118917
3044 118917 63112 -8074 -59925 -49923 62094 70932 53648 39211 5233 -15702 -33783 -24649
3032 -24649 -26340 -61691 -59753 10627 44024 -17121 -64954 -22980 7571 12716 35095 27558 44014
3019 44014 18280 -25179 -1552 3449 12837 -1958 12522 48338 15929 26028 42813 84427
3007 84427 78211 53163 -19316 -50060 -52988 -60049 -32421 -34245 -59688 -62955 -55267 15054 -9182
2994 -9182 -69631 -16177 37574 44191 -29406 1166 -233 -16554 37739 43823 20039 -10303 3460
2981 3460 -45720 -16100 -34377 -52430 -54309 -27168 -50513 -25516 949 -6827 -46302 -60857
2969 -60857 1944 16920 18906 27790 30321 -5992 -16819 -26306 -26638 -8886 14748 20674 -26519
2956 -26519 -72799 -97445 -101230 -27234 22525 -14229 -51428 6697 45958 97952 68688 28629
2944 28629 23320 20366 44286 38689 52764 75516 9023 -39699 -31966 -18908 9170 42330 41176
2931 41176 6948 13874 1981 -37827 -67746 -52695 -23341 -17139 15983 54180 90022 57031
2919 57031 22956 15784 49938 4019 -81281 -131432 -145759 -159685 -149580 -60644 -39493 -35637
2907 -35637 -15519 -30153 -7835 17669 49420 55816 77636 113767 92726 52122 68883 51360
2895 51360 27872 -25569 -74289 -74567 -44976 1584 15384 16114 33450 56711 44746 -16352 -32960
2882 -32960 -26731 -64395 -39816 -20948 9902 25366 59780 94099 45246 5117 -299 -10940
2870 -10940 -53632 -39261 -6515 28751 18047 19794 77420 59692 57990 55444 41814 27976
2858 27976 -30188 -63287 7815 -10001 3487 25869 -36446 -73775 -24456 12794 1529 -50609
2846 -50609 -75307 -77575 -46197 9765 49202 56502 66374 19635 -34348 -65871 -74474 -91592 -13473
2833 -13473 -18542 -42122 -51310 -29819 -35748 -25735 1883 24950 64108 90293 31487 -29018
2821 -29018 -73935 -38612 -35446 -15802 -42261 -56674 -21412 -2456 -6251 11701 14876 8996 -23986
2808 -23986 -79220 -25483 780 -5733 1091 13039 16923 -66006 -62782 -9896 4034 -9951 5742
2795 5742 -26292 -10613 20996 22233 -3281 -43424 -79467 -84996 -50658 -26905 -12256 13175
2783 13175 18067 -21606 -40593 -36807 15137 -7165 14027 76284 101180 98194 84524 42814
2771 42814 56231 80203 89858 58948 57607 22525 25424 45910 20259 15145 -4802 -1075 -7614
2758 -7614 -62537 -31185 3182 -2298 -8154 15536 8450 25003 -14940 -19212 64682 48273 20641
2745 20641 66279 51937 38915 26688 24853 -19006 -20102 17419 -8651 -20953 29286 92946
2733 92946 76770 61631 68267 72151 84500 69760 25124 17431 66572 94797 63298 -1473
2721 -1473 -22851 -18729 -8860 14307 -13749 -32067 -8604 38685 8997 52532 52338 57957 10965
2708 10965 -28861 -43884 -26693 -84309 -110452 -70314 2492 -24308 -44227 18784 19022 42679
2696 42679 62186 42023 21936 -3886 15074 54097 42108 21004 14700 -35347 -21069 -37960
2684 -37960 -49522 -5218 -5523 -20228 21845 61695 99604 115713 124371 48180 31137 64747
2672 64747 66799 37743 38896 74218 -798 -80518 -5037 32424 -25109 -32562 24019 8987
2660 8987 -3941 17086 -59042 -21482 -9865 -27563 -34174 -66684 -127807 -102658 -78295 -23446
$$ [...]
##END NTUPLES=NMR SPECTRUM
##END=
