##TITLE=Analysis number 312979
Compound Code cc 42009
Book Reference 437/36
Project Code adrs
Chemist Name wendyb
##JCAMPDX= 6.0         $$ Bruker NMR JCAMP-DX V2.0
##DATA TYPE= NMR SPECTRUM
##DATA CLASS= NTUPLES
##ORIGIN= Bruker BioSpin GmbH
##OWNER= NMR
$$ XWIN-NMR		Version 3.5
$$ Mon Aug 22 13:03:13 2005 GMT Daylight Time (UT+1h)  MAYBRIDGE\NMR@NMR_250MHZ
##.OBSERVE FREQUENCY= 250.131544655141
##.OBSERVE NUCLEUS= ^1H
##.ACQUISITION MODE= SIMULTANEOUS (DQD)
##.ACQUISITION SCHEME= undefined
##.AVERAGES= 16
##.DIGITISER RES= 18
##SPECTROMETER/DATA SYSTEM= dpx250
##.PULSE SEQUENCE= zg30
##.SOLVENT NAME= CDCl3
##.SHIFT REFERENCE= (INTERNAL, CDCl3, 0, 16.522)
##AUDIT TRAIL= $$ (NUMBER, WHEN, WHO, WHERE, WHAT)
$$ ##TITLE= Audit trail, XWIN-NMR		Version 3.5
$$ ##JCAMPDX= 5.01
$$ ##ORIGIN= Bruker BioSpin GmbH
$$ ##OWNER= NMR
$$ C:\u/data/dgb/nmr/ADRS/8290/pdata/1/auditp.txt
$$ ##AUDIT TRAIL=  $$ (NUMBER, WHEN, WHO, WHERE, WHAT)
(   1,<2005-08-22 13:02:52.61 +100>,<MAYBRIDGE\NMR>,<NMR_250MHZ>,
      <created by zg, POWCHK disabled, PULCHK disabled
       configuration hash MD5:
       62 19 C7 07 E1 42 D1 B7 37 6C 3D D0 77 39 F9 E6
       data hash MD5: 64K
       92 13 A4 4A 84 09 14 87 DD 61 85 25 09 BC 4A DE>)
(   2,<2005-08-22 13:03:05.25 +100>,<MAYBRIDGE\NMR>,<NMR_250MHZ>,
      <Start of raw data processing
       ef LB = 0.3 FT_mod = 6 PKNL = 1 SI = 32K 
       data hash MD5: 32K
       F7 96 5B 53 46 B9 96 C9 CA 8A 16 56 D8 DF 94 E4>)
(   3,<2005-08-22 13:03:07.16 +100>,<MAYBRIDGE\NMR>,<NMR_250MHZ>,
      <apk 
       data hash MD5: 32K
       05 3F 1A A9 34 BD E6 A7 22 AF 22 40 B1 A4 AB 91>)
(   4,<2005-08-22 13:03:08.03 +100>,<MAYBRIDGE\NMR>,<NMR_250MHZ>,
      <abs ABSG = 5 
       data hash MD5: 32K
       D1 22 23 01 6C 65 27 FF D5 85 E6 5B 91 E3 C6 5F>)
$$ ##END=
$$ 
$$ hash MD5
$$ B1 CA F4 60 26 7C B1 8B FB 02 B3 9E D8 3E A6 6F
##$RELAX= 
##$RELAX= 
##$RELAX= 
##$RELAX= 
##$RELAX= 
##$RELAX= 
##$RELAX= 
$$ Bruker specific parameters
$$ --------------------------
##$DU= <C:\u>
##$EXPNO= 8290
##$NAME= <ADRS>
##$PROCNO= 1
##$TYPE= <nmr>
##$USER= <dgb>
##$AMP= (0..31)
100 100 100 100 100 100 100 100 100 100 100 100 100 100 100 100 100 100 
100 100 100 100 100 100 100 100 100 100 100 100 100 100 
##$AQSEQ= 0
##$AQ_mod= 3
##$AUNM= <au_zg>
##$AUTOPOS= <15 >
##$BF1= 250.13
##$BF2= 250.13
##$BF3= 250.13
##$BF4= 250.13
##$BF5= 500.13
##$BF6= 500.13
##$BF7= 500.13
##$BF8= 500.13
##$BYTORDA= 1
##$CFDGTYP= 0
##$CFRGTYP= 5
##$CHEMSTR= <none>
##$CNST= (0..31)
1 1 145 1 1 1 1 1 1 1 1 1 1 1 1 1 1 1 1 1 1 1 1 1 1 1 1 1 1 1 1 1 
##$CPDPRG= <>
##$CPDPRG1= <>
##$CPDPRG2= <>
##$CPDPRG3= <>
##$CPDPRG4= <mlev>
##$CPDPRG5= <mlev>
##$CPDPRG6= <mlev>
##$CPDPRG7= <mlev>
##$CPDPRG8= <mlev>
##$CPDPRGB= <>
##$CPDPRGT= <>
##$D= (0..31)
0 1 0 0 0 0 0 0 0 0.06 0 0 0 0 0 0 0.0002 0 0 0 0 0 0 0 0 0 0 0 0 0 0 
0 
##$DATE= 1124712171
##$DBL= (0..7)
120 120 120 120 120 120 120 120 
##$DBP= (0..7)
150 150 150 150 150 150 150 150 
##$DBP07= 0
##$DBPNAM0= <>
##$DBPNAM1= <>
$$ [...]
##$SUBNAM7= <"">
##$SUBNAM8= <"">
##$SUBNAM9= <"">
##$SW= 20.6930455092707
##$SWIBOX= (0..15)
0 0 3 0 0 0 0 0 0 0 0 0 0 0 0 0 
##$SW_h= 5175.983436853
##$TD= 65536
##$TD0= 1
##$TE= 295.16
##$TE2= 300
##$TE3= 300
##$TEG= 300
##$TL= (0..7)
0 120 120 120 120 120 120 120 
##$TP= (0..7)
150 150 150 150 150 150 150 150 
##$TP07= 0
##$TPNAME0= <>
##$TPNAME1= <>
##$TPNAME2= <>
##$TPNAME3= <>
##$TPNAME4= <>
##$TPNAME5= <>
##$TPNAME6= <>
##$TPNAME7= <>
##$TPOAL= (0..7)
0.5 0.5 0.5 0.5 0.5 0.5 0.5 0.5 
##$TPOFFS= (0..7)
0 0 0 0 0 0 0 0 
##$TUNHIN= 0
##$TUNHOUT= 0
##$TUNXOUT= 0
##$USERA1= <user>
##$USERA2= <user>
##$USERA3= <user>
##$USERA4= <user>
##$USERA5= <user>
##$V9= 5
##$VALIST= <valist>
##$VCLIST= <CCCCCCCCCCCCCCC>
##$VD= 0
##$VDLIST= <DDDDDDDDDDDDDDD>
##$VPLIST= <PPPPPPPPPPPPPPP>
##$VTLIST= <TTTTTTTTTTTTTTT>
##$WBST= 1024
##$WBSW= 4
##$XGAIN= (0..3)
0 0 0 0 
##$XL= 0
##$YL= 0
##$YMAX_a= 225309
##$YMIN_a= -419671
##$ZGOPTNS= <>
##$ZL1= 120
##$ZL2= 120
##$ZL3= 120
##$ZL4= 120
##$ABSF1= 16.522
##$ABSF2= -4.171173
##$ABSG= 5
##$ABSL= 3
##$ALPHA= 0
##$AQORDER= 0
##$ASSFAC= 0
##$ASSFACI= 0
##$ASSFACX= 0
##$ASSWID= 0
##$AUNMP= <proc_1d>
##$AZFE= 0.1
##$AZFW= 0.1
##$BCFW= 0
##$BC_mod= 0
##$BYTORDP= 0
##$COROFFS= 0
##$CY= 12.5
##$DATMOD= 1
##$DC= 0
##$DFILT= <>
##$DTYPP= 0
##$F1P= 14.0000005364418
##$F2P= -0.99999901652339
##$FCOR= 0.5
##$FTSIZE= 32768
##$FT_mod= 6
##$GAMMA= 0
##$GB= 0
##$INTBC= 1
##$INTSCL= 1
##$ISEN= 128
##$LB= 0.3
##$LEV0= 0
##$LPBIN= 0
##$MAXI= 10000
##$MC2= 0
##$MEAN= 0
##$ME_mod= 0
##$MI= 0
##$NCOEF= 0
##$NC_proc= -6
##$NLEV= 6
##$NOISF1= 0
##$NOISF2= 0
##$NSP= 0
##$NTH_PI= 0
##$NZP= 0
##$OFFSET= 16.522
##$PC= 1
##$PHC0= -75.9275
##$PHC1= 9.325448
##$PH_mod= 1
##$PKNL= yes
##$PPARMOD= 0
##$PSCAL= 4
##$PSIGN= 0
##$REVERSE= no
##$SF= 250.13
##$SI= 32768
##$SIGF1= 0
##$SIGF2= 0
##$SINO= 400
##$SIOLD= 32768
##$SREGLST= <1H.CDCl3>
##$SSB= 0
##$STSI= 32768
##$STSR= 0
##$SW_p= 5175.98343685301
##$SYMM= 0
##$S_DEV= 0
##$TDeff= 65536
##$TDoff= 0
##$TI= <Analysis number 999999
Compound Code 99
Book Reference 9
Project Code 9>
##$TILT= no
##$TM1= 0
##$TM2= 0
##$TOPLEV= 0
##$USERP1= <user>
##$USERP2= <user>
##$USERP3= <user>
##$USERP4= <user>
##$USERP5= <user>
##$WDW= 1
##$XDIM= 32768
##$YMAX_p= 501832176
##$YMIN_p= -1285923
$$ End of Bruker specific parameters
$$ ---------------------------------
##NTUPLES= NMR SPECTRUM
##VAR_NAME=  FREQUENCY,     SPECTRUM/REAL,   SPECTRUM/IMAG
##SYMBOL=    X,             R,               I
##VAR_TYPE=  INDEPENDENT,   DEPENDENT,       DEPENDENT
##VAR_FORM=  AFFN,          ASDF,            ASDF
##VAR_DIM=   32768,         32768,           32768
##UNITS=     HZ,            ARBITRARY UNITS, ARBITRARY UNITS
##FACTOR=    0.157963299565203, 1,           1
##FIRST=     4132.6476996994, 0,             0
##LAST=      -1043.33573715361, 0,           0
##MIN=       -1043.33573715361, -1285923,    0
##MAX=       4132.6476996994, 501832176,     0
$$ Real data points
##PAGE= N=1
##DATA TABLE= (X++(R..R)), XYDATA
$$ [...]
18852e41654K06707K88320L7822l52063j03205L10209M43365N40608J56001l79010
$$ -541654 -334947 -46627 -8805 -360868 -464073 -153864 289501 830109 986110 607100
18842F07100m62811l2898J23782J62380j45902k23792k95136j31544L42567M77912
$$ 607100 144289 111391 235173 397553 251651 27859 -267277 -398821 -56254 421658
18832D21658J2525k10398N8521j22779O3883j83061l3977L8227n5045m31870l16329
$$ 421658 434183 223785 282306 159527 223410 40349 6372 44599 -10446 -442316 -758645
18821g58645K95866K54801n9433k73562o9642N82005N17673K05309l36867m37099
$$ -758645 -462779 -207978 -267411 -540973 -610615 -28610 489063 694372 357505 -79594
18811g9594J64979l91491l41809j0950K69728Q7200p4660J96006k01590k40519
$$ -79594 85385 -306106 -647915 -658865 -389137 -301937 -376597 -180591 -382181 -622700
18801f22700K17163K45435K28302m90960k49840L81390P85791l6035j85337j56952
$$ -622700 -405537 -160102 68200 -422760 -672600 -291210 494581 458546 273209 116257
18791A16257K6021j69514M5048K93772J5354r3077O1389j91449o2146J92383O8256
$$ 116257 142278 -27236 17812 311584 326938 233861 295250 103801 41655 234038 302294
18780C02294J41254q3852N9438j22221r2758k6966K15893J26801K73169K54714
$$ 302294 443548 359696 419134 296913 204155 177189 393082 519883 793052 1047766
18770A047766L72117J50212j22740N11552O22279L58662k35158n22632n95135
$$ 1047766 1419883 1570095 1447355 1958907 2581186 2939848 2704690 2182058 1586923
18761A586923n71380n57305k16963p1208m30423J39530K07790q3690r536j38906
$$ 1586923 1015543 458238 241275 170067 -260356 -120826 86964 3274 -6262 -145168
18751a45168J8515L34189j12208j76515J96631K10924l25224J35666j11482k61634
$$ -145168 -126653 207536 95328 -81187 115444 326368 1144 136810 25328 -236306
18741b36306m634K45435L70588N3473P0373Q6291j27978m33440j41136p0111J83864
$$ -236306 -240940 4495 375083 428556 498929 585220 457242 23802 -117334 -187445 -3581
18730c581J50821j17378j20917j39401j26434j19955K94404L65939m5395k39560
$$ -3581 147240 29862 -91055 -230456 -356890 -476845 -182441 183498 138103 -101457
18720a01457l2232N5058P1664K5418M19015j00046k01713l27992K12261l4850
$$ -101457 -133689 -78631 -6967 18451 437466 337420 135707 -192285 19976 -14874
18710a4874k10610r7631r1718j60356J1326j40228J97990J55467J16170K18266
$$ -14874 -225484 -323115 -414833 -575189 -563863 -704091 -506101 -350634 -234464 -16198
18700a6198M87530K9794k61382n6779j52878L4908R6101j18768j04505k6530P5366
$$ -16198 471332 501126 239744 182965 30087 64995 161096 42328 -62177 -88707 -13341
18689a3341J55308K15224P0106n6995j41718j98991L3303J91750K52816m1079
$$ -13341 141967 357191 427297 370302 228584 29593 62896 254646 507462 466383
18679D66383J07253j24999l21409k3375P3217m25231o0643K58624L2674J87678
$$ 466383 573636 448637 127228 103853 177070 -248161 -308804 -50180 -17506 170172
18669A70172J38571j1199K02270p807r6448J58673j47968j79322j54077J59627
$$ 170172 308743 297544 499814 492007 395559 554232 406264 226942 72865 232492
18659B32492K04321q6913k550J08432j1590j58868k01591K04371r7751k72260
$$ 232492 436813 349900 347350 455782 444192 285324 83733 288104 190353 -81907
18649h1907o8636K91342j96565J66299k07103j93971n3384l03496J07645M39396
$$ -81907 -150543 140799 -55766 110533 -96570 -290541 -343925 -647421 -539776 -100380
18639a00380M00657J93513k14224J25228j1403K13370J82092j89751J00827K81705
$$ -100380 300277 493790 279566 404794 393391 606761 788853 599102 699929 981634
18629I81634j23052k86512o8208J30705j03644K88832L17841k10735r0556m56
$$ 981634 858582 572070 503862 634567 530923 819755 1137596 926861 836305 835849
18619H35849r0419j63416j49659K14573J4604j8387J49382k97158k55755Q146
$$ 835849 745430 582014 432355 646928 661532 643145 792527 495369 239614 247760
18609B47760K26107o8226M6559j60749N9022j05842n1561M0830l5220o1177K24902
$$ 247760 473867 405641 452200 291451 350473 244631 193070 233900 198680 137503 362405
18598C62405L76656k57173m47115r0971j05249K2511J06048L01938J0474L29847
$$ 362405 739061 481888 34773 -56198 -161447 -138936 -32888 269050 279524 609371
18588F09371o0878R654j47621j76036K16905N5964k05498o3071K43451K29871
$$ 609371 548493 558147 410526 234490 451395 507359 301861 238790 482241 712112
18578G12112o1308l1518k21779j3789J39786k19618j95286K41201L4114k52357
$$ 712112 650804 619286 397507 383718 523504 303886 108600 349801 383915 131558
18568A31558L035L49990n4983j73771J00444J57992L03691P0021P2306O4578l82769
$$ 131558 134593 484583 429600 255829 356273 514265 817956 887977 960283 1024861 642092
18557F42092k80659j06135M7530j42603r0094k18701j14746o3087K41210L17227
$$ 642092 361433 255298 302828 160225 70131 -148570 -263316 -326403 -85193 232034
18547B32034K35512K67745k25454n7525p0968j35056m16005m12216K49461N20694
$$ 232034 467546 735291 509837 452312 381344 246288 -169717 -581933 -332472 188222
18537A88222M57538R4696k22187k27087k71271n13299L27967L95806k34559k05782
$$ 188222 645760 740456 518269 291182 19911 -493388 -165421 230385 -4174 -209956
18527b09956k447j04237J51420K46591L29914J19513Q1773n12521l3020J50437
$$ -209956 -212403 -316640 -165220 81371 411285 530798 612571 100050 67030 217467
18517B17467L32855R3176m88455p0567J90424L62579r864j08931l35332Q2611
$$ 217467 550322 643498 155043 84476 274900 637479 627615 518684 183352 265963
18507B65963K75262q1140m864M19190P2042o1161m8304J47177k25510k75167K0081
$$ 265963 541225 460085 455221 874411 946453 885292 836988 984165 758655 483488 503569
18496E03569K8267J34808j39605l87911J51692R1519j01910O6567J4531k38713
$$ 503569 531836 666644 527039 139128 290820 382339 280429 346996 361527 122814
18486A22814p5238k8133j36438K84232m5423j12852j8959k82K72976j86106j10062
$$ 122814 47576 19443 -116995 167237 121814 8962 -9997 -10279 262697 76591 -33471
18475c3471l6271k2474l5774L124K31431M2021M8112k52023M4439J83113K13347
$$ -33471 -69742 -92216 -127990 -124866 106565 148586 196698 -55325 -10886 172227 385574
18464C85574J13855K6419k1979k66203o2165J57172k14129m7216m2153j67762
$$ 385574 499429 525848 503869 237666 175501 332673 118544 71328 29175 -138587
18454a38587K41243M3399k5932M6640J48492L82329J8604n4012R345k59352l21390
$$ -138587 102656 146055 120123 166763 315255 697584 716188 662176 671521 412169 90779
18443I0779r8471N2312k19241N6036p2756K90764r7434J10022O6747M2919j01949
$$ 90779 -7692 44620 -174621 -118585 -191341 99423 1989 112011 178758 221677 119728
18432A19728K88962N736l04165l6793J85334l7009q2150k26277J10015J38078
$$ 119728 408690 414426 110261 73468 258802 221793 139643 -86634 23381 161459
18422A61459r4733L51947L48105o8353k46798j75479p2233o7087j69480r8972
$$ 161459 66726 418673 766778 698425 451627 276148 203915 136828 -32652 -131624
18412a31624M43791J3353p2758N8730J68509L51201j59953o06040j23603m5572
$$ -131624 312167 325520 252762 311492 480001 831202 671249 65209 -58394 -103966
18402a03966J59214m241j03067k31683K79611L12266K8258j49886l54849L8912
$$ -103966 55248 51007 -52060 -283743 -4132 308134 336392 186506 -168343 -129431
18392a29431K54931N0802o7717L00348J81459K22066k33728k00827k26070N0869
$$ -129431 125500 176302 108585 408933 590392 812458 578730 377903 151833 202702
18382B02702J00543j80070o3472m7032Q3421K76422n9747m14169k20908K41640
$$ 202702 303245 123175 59703 12671 96092 372514 312767 -101402 -322310 -80670
18372h0670L92954J71016j51680J20116M72627J45929k21727p8975j25921K32845
$$ -80670 312284 483300 331620 451736 924363 1070292 848565 769590 643669 876514
18362H76514J34142Q5633J87777J0749o26051l70899k95201j89173J26059M57061
$$ 876514 1010656 1096289 1284066 1294815 668764 297865 2664 -186509 -60450 396611
18352C96611k13336q7575O1727K7118M1010J83870k97714R2791J50001m7945J72486
$$ 396611 183275 95700 157427 184545 225555 409425 111711 204502 354503 306558 479044
18341D79044R6456k74974o8359L76006o8449p3275j00854j00987K0579m379J75806
$$ 479044 575500 300526 232167 608173 539724 466449 365595 264608 285187 280808 456614
18330D56614K57490O6887m76888l66790j64616M51623L41535M6494p0195k0247
$$ 456614 714104 780991 304103 -62687 -227303 224320 565855 612349 542154 521907
18320E21907O1246K19488K20673j10432L66410j78577j18053p5920j11078k753
$$ 521907 583153 802641 1023314 912882 1279292 1100715 982662 906742 795664 792911
18310G92911J27603j54208p5977N3418j00878O8941K61931J91865k5215L1508
$$ 792911 920514 766306 690329 743747 642869 711810 973741 1165606 1140391 1171899
18300A171899j88326J13959j28010k59587K05316J25461M77759K24758n7547o4010
$$ 1171899 983573 1097532 969522 709935 915251 1040712 1518471 1743229 1685682 1621672
18290A621672k9773j03045k97076m77169k02417q9195K0456L86892n5318o1732
$$ 1621672 1591899 1488854 1191778 714609 512192 422997 443453 830345 775027 713295
18280G13295j01209m2393K33161K06021O718k09917o20125l2014N31805M6688
$$ 713295 612086 569693 802854 1008875 1015593 805676 185551 153537 685342 732030
18270G32030j01329J91100J81952J66648k84977R696J7988N441k83355j17563
$$ 732030 630701 821801 1003753 1170401 885424 895120 913108 918549 635194 517631
18260E17631L63370J70970R8061J52763K46103k01564j87806k56483J32686J70811
$$ 517631 881001 1051971 1150032 1302795 1548898 1347334 1159528 903045 1035731 1206542
18250A206542J56602J06438J04281J4662L03937M11915J29340k21205R1392R2071
$$ 1206542 1363144 1469582 1573863 1588525 1892462 2304377 2433717 2212512 2303904 2395975
18240B395975j7534m5550R2794J48020k19489O4239R600k70186m19465m4241k69212
$$ 2395975 2378441 2332891 2425685 2573705 2354216 2418455 2428055 2157869 1738404 1694163 1424951
18229A424951p77201m32285J27203L47305K50473k7934m75458p2997L57231L86559
$$ 1424951 647750 215465 342668 689973 940446 912512 437054 364057 721288 1107847
18219A107847L12502K76633J92601k97143k31481r6017J46306k92857J06415K21990
$$ 1107847 1420349 1696982 1889583 1592440 1360959 1264942 1411248 1118391 1224806 1446796
18209A446796J28957K78204K03427m2921j2261p1407o872L39895J60696j2512
$$ 1446796 1575753 1853957 2057384 2014463 2002202 1930795 1923923 2263818 2424514 2412002
18199B412002K18731L61203J82089J61788J17995P3043N3229L33047K14123j63320
$$ 2412002 2630733 2991936 3174025 3335813 3453808 3526851 3580080 3913127 4127250 3963930
18189C963930l43376l51972J32386N94898K13726N22173L65431K49081L74026
$$ 3963930 3620554 3268582 3400968 3995866 4209592 4731765 5097196 5346277 5720303
18180E720303K30717N17548J153014J441790J425041J814384K888312L994373
$$ 5720303 5951020 6468568 7621582 9063372 10488413 12302797 15191109 19185482
18172A9185482N229567O526404Q234837J0099705J1847248J0967823P182513R56967
$$ 19185482 24415049 30941453 39176290 49275995 61123243 72091066 79273579 80230546
18164H0230546o661444j2633428j3963191j1530738p592362m978537l209237j929051
$$ 80230546 73569102 60935674 46972483 35441745 27849383 22870846 19661609 17732558
18156A7732558r75013l84433K65184Q00990J186737J193214N12134j7041p07392
$$ 17732558 16757545 16373112 16638296 17439286 18626023 19819237 20331371 20314330 19606938
18147A9606938j051314j099834j186981o07215J73945J33939N17838O81415J87477
$$ 19606938 18555624 17455790 16268809 15661594 15835539 15969478 16487316 17168731 17356208
18138A7356208L28096O79046J116334J494066J939844K104874J974558Q71356
$$ 17356208 17684304 18363350 19479684 20973750 22913594 25018468 26993026 27864382
18130B7864382P65959J125509R41930J106645K794205M498057O274686Q462135
$$ 27864382 28630341 29755850 30697780 31804425 34598630 39096687 45371373 53833508
18122E3833508J1321906J4289728J8332065K3652364K8361112L2519761L2568402
$$ 53833508 65155414 79445142 97777207 121429571 149790683 182310444 214878846
18115B14878846K7946231J9653286J1148155R642973J9033537L7432093N9611214
$$ 214878846 242825077 262478363 273626518 283269491 302303028 339735121 399346335
18108C99346335O7384705L5101136j6424541q0199564j29639101r3071365m9422520
$$ 399346335 466731040 501832176 485407635 405208071 275568970 182497605 133075085
18101A33075085k7492918j7393952j1655225p918018n337536l622310j837079
$$ 133075085 105582167 88188215 76532990 68614972 63277436 59655126 57818047
18094E7818047p02385o6310N24624J097052Q78789L43831n67758k198267l469280
$$ 57818047 57115662 57049352 57573976 58671028 59549817 59893648 59325890 57127623 53658343
18085E3658343l667867l207534k378648j458738n76648j190391j865208j702605
$$ 53658343 49990476 46782942 44404294 42945556 42368908 41178517 39313309 37610704
18077C7610704j208310m38020J30362Q91377J881055K476092M133926N829565
$$ 37610704 36402394 35964374 36094736 36986113 38867168 41343260 45477186 51306751
18069E1306751Q590656J1031271J3420686J5254555J4364014Q581236j018674
$$ 51306751 59897407 70928678 84349364 99603919 113967933 122549169 121530495
18062A21530495j1239354j9105105k0193412j7029905j1805216p677830n244788
$$ 121530495 110291141 91186036 70992624 53962719 42157503 34479673 29234885
18055B9234885m133450k951129k109927j795090j457113j128104j080468r77269
$$ 29234885 25101435 22150306 20040379 18245289 16788176 15660072 14579604 13602335
18047A3602335n63967l06930m64686p30006l36834K94881M41268k43305l48928
$$ 13602335 13038368 12731438 12266752 11536746 11199912 11494793 11936061 11692756 11343828
18038A1343828l18471m00275k36988l53820m41263r21568o37993m90040m15278
$$ 11343828 11025357 10625082 10388094 10034274 9593011 8671443 8033450 7543410 7128132
18029G128132k67612m43545k14839k55141l95859l5793q4161m81298n15861P5082
$$ 7128132 6860520 6416975 6202136 5946995 5551136 5515343 5431182 4949884 4434023 4509105
18019D509105R346m90693j82349l2881k86307o96866K5447J79368k76190o6394
$$ 4509105 4518451 4027758 3845409 3812528 3526221 2829355 2854802 3034170 2757980 2691586
18009B691586M6187j3294j43774j18486j13729j91608j35093L30538K64347j97408
$$ 2691586 2737773 2724479 2580705 2462219 2348490 2156882 2021789 2352327 2616674 2419266
17999B419266l19854j30992l08383J58871K27722k0219j80719l3527J5639j31317
$$ 2419266 2099412 1968420 1660037 1818908 2046630 2026411 1845692 1812165 1827804 1696487
17989A696487l67038m9583K25282r1002L08620K36141j18657l02178k81077l17242
$$ 1696487 1329449 1279866 1505148 1414146 1722766 1958907 1840250 1538072 1256995 939753
17979I39753m88597J0705r4110M1582J07330K67842L11668n1069O4161j57624
$$ 939753 451156 461861 367751 409333 516663 784505 1096173 1045104 1109265 951641
17969I51641J11612l7482O1152j24936J92827M32654q4104p30467p83956j50666
$$ 951641 1063253 1025771 1086923 961987 1154814 1587468 1503364 772897 -11059 -161725
17959a61725O90960M30452J9653J95914L28590K14781K9995N0370l6797k13400
$$ -161725 529235 959687 979340 1175254 1503844 1718625 1748620 1798990 1762193 1548793
17949A548793l81867k56449J02821K63910J13927j19159k05159k0675R3084L9765
$$ 1548793 1166926 910477 1013298 1277208 1391135 1271976 1066817 1046142 1139226 1178991
17939A178991j61815k70155m70460L2402J3548J62749j03231k18229q7816L64176
$$ 1178991 1017176 747021 276561 308963 322511 485260 382029 163800 75984 440160
17929D40160M899q3579j73470k2075Q0934K09122K42466j26109K5557k32491J71085
$$ 440160 445059 361480 188010 165935 246869 455991 698457 572348 597905 365414 536499
17918E36499L25593M14928n7886k57386l91305J00273p3083P4844J5484L91588
$$ 536499 862092 1277020 1219134 961748 570443 670716 597633 672477 687961 1079549
17908A079549n2557p0708k44738p6645j4312J6674j10371K29217L9917L95820
$$ 1079549 1026992 956284 711546 634901 620589 637263 526892 756109 796026 1191846
17898A191846j43333j97118j35260L8521J49195m0248L324K55643M1334j36278
$$ 1191846 1048513 851395 716135 754656 903851 863603 866927 1122570 1163904 1027626
17888A027626n803m35183J7245M49594J62795l42290k30209j10830q7363k66449
$$ 1027626 1021823 586640 603885 1053479 1216274 873984 643775 532945 445582 179133
17878A79133o0725j2770J80168P5763J1953J33098J85982P7215J09132n9026o7969
$$ 179133 118408 105638 285806 361569 373522 506620 692602 769817 878949 819923 751954
17867G51954k71427j61204J49495m449r2430l48765l3419K30075K85244O1820
$$ 751954 480527 319323 468818 464369 371939 23174 -10245 219830 505074 566894
17857E66894M2370J51985J54995k68565L4930J1003o6955J33940j32324j72286
$$ 566894 609264 761249 916244 647679 682609 693612 626657 760597 628273 455987
17847D55987j91781k6930M0499L53585k877n09533K02788l4867k9347k48719N1989
$$ 455987 264206 237276 277775 631360 628483 118950 321738 286871 257524 8805 60794
17836F0794M73745p6961M186M09429K41024J9256k67490n20346l01018k05771
$$ 60794 534539 457578 461764 871193 1112217 1131473 863983 343637 42619 -163152
17826a63152N4753L61692J94853M51340m7343q1268q8475l5806L48996j23501
$$ -163152 -108399 253293 448146 899486 852143 770875 682400 646594 995590 872089
17816H72089l80509R7123j10794j84507J99911J94674Q8777m1242j19204j60405
$$ 872089 491580 588703 477909 293402 493313 687987 776764 735522 616318 455913
17806D55913m59879j05683K61421K18771L28701k0011j20200m1676R1271J00393
$$ 455913 -3966 -109649 151772 370543 699244 679233 559033 517357 608628 709021
17796G09021p3090J63096Q4987J86264R6567m9972j45586j8836J10983j17109
$$ 709021 635931 799027 884014 1070278 1166845 1116873 971287 952451 1063434 946325
17786I46325j77569k89624K20501K39444L2566l76638j39394k63169n8277q3257
$$ 946325 768756 479132 699633 939077 971643 595005 455611 192442 134165 50908
17776E0908Q6732K37880K59065J68869j1145k41130m15223J05869K62552j12459
$$ 50908 137640 375520 634585 803454 792309 551179 135956 241825 504377 391918
17766C91918K80402N79263k17609k96827K51939L14209j40551k43559R5063K24741
$$ 391918 672320 1251583 1033974 737147 989086 1303295 1162744 919185 1014248 1238989
17756A238989J55560m2724j86058R8969R6555k39426L7663J74211J8534L4953
$$ 1238989 1394549 1351825 1165767 1264736 1361291 1121865 1159528 1333739 1352273 1387226
17746A387226J50653O9236n6058n7876k60798l97612p7474l9795L86285K41831
$$ 1387226 1537879 1607115 1551057 1493181 1232383 834771 757297 717502 1103787 1345618
17736A345618K47181j43295m59418j71675L13597L65388M367l2609m6171m02471
$$ 1345618 1592799 1449504 990086 818411 1132008 1497396 1501763 1469154 1422983 1020512
17726A020512n08493j7032J77615J01932R3604J83488m1148O3514l8586K19729
$$ 1020512 512019 494987 672602 774534 868138 1051626 1010478 1073992 1035406 1255135
17716A255135K0126j12173k13928J58494K00568o7044k7495P41496L28056k58073
$$ 1255135 1275261 1163088 949160 1107654 1308222 1241178 1213683 1955179 2283235 2025162
17706B025162k03553P5550q3195l16949k1764j20620J09931P4735J13447J06292
$$ 2025162 1821609 1897159 1813964 1497015 1475251 1354631 1464562 1539297 1652744 1759036
17696A759036j62922l32387J05100M44862K73657j27553R6256m7155J28069r4434
$$ 1759036 1596114 1263727 1368827 1813689 2087346 1959793 2056049 2008894 2136963 2042529
17686B042529k4065r7204P647l63413j40020O22797L45609J27344K64636K20538
$$ 2042529 2018464 1921260 1928907 1565494 1425474 2048271 2393880 2521224 2785860 3006398
17676C006398J7887O880l5102q8511J3868J85209j09929P7450N4386K74669K7782
$$ 3006398 3024285 3031165 2996063 2907552 2921420 3106629 2996700 3074150 3128536 3403205 3430987
17665C430987L7767K85430K37957K67959J54821j25404K03900L08050j22645J72650
$$ 3430987 3468754 3754184 3992141 4260100 4414921 4289517 4493417 4801467 4678822 4851472
17655D851472M00664L26705j76196M0245N37298M19814N64122J026008N79571
$$ 4851472 5252136 5578841 5402645 5442890 5980188 6400002 6964124 7990132 8569703
17646H569703M81240O67935J186835N06128Q60651J610533J867320K416616K797333
$$ 8569703 9050943 9718878 10905713 11411841 12272492 13883025 15750345 18166961 20964294
17637B0964294L471790M030833M555548N036198N211384O250707P021672P856719
$$ 20964294 24436084 28466917 33022465 38058663 43270047 49520754 56542426 64399145
17629F4399145Q637551R706446J1240576J2034259J2911057J3086789J2747899
$$ 64399145 73036696 82743142 93983718 106017977 118929034 132015823 144763722
17622A44763722J2988687J3126706J2527787R807672O543452M631913L283890
$$ 144763722 157752409 170879115 183406902 193214574 199758026 204389939 207673829
17615B07673829j28765m882946r122229j1999669j0987164p541380n631402n090116
$$ 207673829 207545064 202662118 193539889 181540220 170553056 163011676 157380274 152290158
17607A52290158k223109J913217M516480M868960L700287K121503P96176K0913
$$ 152290158 150067049 151980266 156496746 161365706 165065993 167187496 167983672 168004585
17599A68004585j454512l725889n881862n665712l092059j039110n53234l95310
$$ 168004585 166550073 162824184 156942322 151276610 148184551 147145441 146592207 146196897
17591A46196897L04538J763459J368464l40968k521132m328234m179610l232972
$$ 146196897 146501435 148264894 149633358 149292390 146771258 142443024 138263414 135030442
17583A35030442k920436k454937j122178J02651O4901o31533m0108M37484o65985
$$ 135030442 132110006 129655069 128532891 128635542 128700443 128068910 128028802 128466286 127800301
17574A27800301k466703m299964o179226o559046o214924p254493q283109p571773
$$ 127800301 125333598 121033634 114854408 108295362 102080438 94825945 86542836 78971063
17566G8971063o265060n445995n444702n360707n230903m765606l765981m015194
$$ 78971063 72706003 67260008 61815306 56454599 51223696 46458090 42692109 38676915
17558C8676915l815494l279337k538414k009422j530526q71568j017484r31712
$$ 38676915 34861421 31582084 29043670 27034248 25503722 24632154 23614670 22682958
17550B2682958j163092q14645j129042j054641p38775o30829p87231j078587q71121
$$ 22682958 21519866 20705221 19576179 18521538 17782763 17151934 16364703 15286116 14414995
17541A4414995n72000p55734p69863l26682m37175n73660j32099n32770o66255
$$ 14414995 13842995 13087261 12317398 11990716 11553541 10979881 10847782 10315012 9648757
17532I648757p12241p93733l10465m71439l08266p5391m6829n62914m88544k17901
$$ 9648757 8936516 8142783 7832318 7360879 7052613 6977222 6930393 6367479 5878935 5661034
17522E661034k59497k02880r4685J37663r2485J26422j97089j60628M8464l84481
$$ 5661034 5401537 5198657 5103972 5241635 5149150 5275572 5078483 4917855 4966319 4581838
17512D581838l74916l53921m23855j21152J4819J18154K68804k53299l07972K04859
$$ 4581838 4206922 3853001 3429146 3307994 3322813 3440967 3709771 3456472 3148500 3353359
17502C353359N7727J07424l5672J28596L56249M03128J90876l02245J48158K01851
$$ 3353359 3411086 3518510 3482838 3611434 3967683 4370811 4561687 4259442 4407600 4609451
17492D609451K34060K46965l04712k25237J68214J96006N2297L77442J46503L54995
$$ 4609451 4843511 5090476 4785764 4560527 4728741 4924747 4977044 5354486 5500989 5855984
17482E855984L56780L07583R70936R97099J301871J911754K013037K398974K998136
$$ 5855984 6212764 6520347 7491283 8488382 9790253 11702007 13715044 16114018 19112154
17473A9112154L476283M901001O384953P920583Q659518Q991991Q266715O722722
$$ 19112154 22588437 27489438 33874391 41794974 50454492 59446483 67713198 74435920
17465G4435920M576656K204435Q99084j68293o0165o68193j375289j977938k870999
$$ 74435920 79012576 81217011 82116095 81947802 81887637 81219444 79844155 77866217 74995218
17456G4995218l999683l504366j729446M22922K085506K749125K422095J375250
$$ 74995218 70995535 67491169 65761723 66184645 68270151 71019276 73441371 74816621
17448G4816621N33142o29924j617258j616809j429006k116396l283332m854374
$$ 74816621 75349763 74719839 73102581 71485772 70056766 67940370 64657038 59802664
17440E9802664o184561o565229o779379n754776m672475l396899k235135j555438
$$ 59802664 53618103 47052874 40273495 34518719 29846244 26449345 24214210 22658772
17432B2658772r37043q42290p66636m38555o9637p8376J90312O27300J290395
$$ 22658772 21721729 20879439 20112803 19674248 19604611 19526235 19716547 20343847 21634242
17423B1634242J802896K180071L175090M227935M893427O196110O961590P008552
$$ 21634242 23437138 25617209 28792299 33020234 37913661 44109771 51071361 58079913
17415E8079913O591767M947676L407811J569585M27382m31078r62366j165624
$$ 58079913 64671680 69619356 73027167 74596752 75024134 74593056 73630690 72465066
17407G2465066j600550k472158k893705k830749k277396j100834M67457J916752
$$ 72465066 70864516 68392358 65498653 62667904 60390508 59289674 59757131 61673883
17399F1673883K531453K109883J111694J18288j075652j362607j380282k186700
$$ 61673883 64205336 66315219 67426913 67545201 66469549 65106942 63726660 61539960
17391F1539960k957519l826475m683027n663479o402561o163765m931724l685508
$$ 61539960 58582441 54755966 50072939 44409460 38006899 31843134 26911410 23225902
17383B3225902k485792k033810j894327j494845j031115r60790o97591k31591
$$ 23225902 20740110 18706300 16811973 15317128 14286013 13325223 12627632 12396041
17375A2396041k43601n84886m47790k34487m89607o12487m50270k77161m34673
$$ 12396041 12152440 11567554 11119764 10885277 10395670 9783183 9332913 9055752 8621079
17366H621079k94021l96493o25244n27841l29631r1369k31867j05691n76607m35821
$$ 8621079 8327058 7930565 7305321 6777480 6447849 6356480 6124613 6018922 5442315 5006494
17356E006494l57296k08251m35561k96445l62304J36858K68303n7354k65025k57312
$$ 5006494 4649198 4440947 4005386 3708941 3346637 3483495 3751798 3694444 3429419 3172107
17346C172107k11976m32856r2498l5270p4155M9773m25422l39081O1691j10628
$$ 3172107 2960131 2527275 2434777 2399507 2325352 2375125 1949703 1610622 1672313 1561685
17336A561685k27771j82837K23701M352l45747l70924N1622K93970j01573k28807
$$ 1561685 1333914 1151077 1374778 1379130 1033383 662459 714081 1008051 906478 677671
17326F77671j7975K04507J72920K84637J72630q9074l07859q9744L23157Q7458
$$ 677671 659696 864203 1037123 1321760 1494390 1405316 1097457 1007713 1330870 1418328
17316A418328l67697k54630m7021m22784j15465L1136j27848l1127R2343N758
$$ 1418328 1050631 796001 748980 326196 210731 241867 114019 82892 175235 180993
17306A80993J10006L58206J07101k59713k91718M2016K00864m1175N6128j29785
$$ 180993 290999 649205 756306 496593 204875 246891 447755 406580 462708 332923
17296C32923m5750N0869K08669J47986j99843L09114L00425k3672j39984l86019
$$ 332923 287173 338042 546711 694697 494854 803968 1104393 1080721 940737 554718
17286E54718k4541j7649K9473q1916l3502K80810n2501l97876M3612N3454j08648
$$ 554718 530177 512528 542001 460085 426583 707393 654892 257016 300628 354082 245434
17275B45434k09614R2669R7346p18j25496p7570J030J58773k61374J30732K27255
$$ 245434 35820 128489 225835 225117 99621 22051 23081 181854 -79520 51212 278467
17264B78467j4826J31152k53861j71158Q9924P5827j35713J53346q7890k84339
$$ 278467 263641 394793 140932 -30226 59698 135525 -188 153158 65268 -219071
17254b19071n0567L48004j03656j99726L47222J02265k15905r6394P1532q6171
$$ -219071 -269638 78366 -25290 -225016 122206 224471 8566 -87828 -16296 -102467
17244a02467k4129K54998k15009m6020K30530K0596o1042N9569k49330j42213
$$ -102467 -126596 128402 -86607 -132627 97903 118499 57457 117026 -132304 -274517
17234b74517L1613L95065j92740k08774L27503j64640o6788j4440j61742O4001
$$ -274517 -242904 152161 -40579 -249353 78150 -86490 -153278 -167718 -329460 -265459
17224b65459M8008r6839k36490p6559J63392L15965J47020k23455m17826M1065
$$ -265459 -217451 -314290 -550780 -627339 -463947 -147982 -962 -224417 -642243 -601178
17214f01178N43793K0512k47742J38439M04452K6100n7245K49810j8786m28998
$$ -601178 -57385 -36873 -284615 -146176 258276 284376 227131 476941 458155 29157
17204B9157K8073K9352k6724j29783m029J38550q3693l50579K9716J00259k38834
$$ 29157 57230 86582 59858 -69925 -73954 64596 -19097 -369676 -339960 -239701 -478535
17193d78535p3492K8991l43246K40352L16248k28076k73067K01393r0797j50505
$$ -478535 -552027 -523036 -866282 -625930 -309682 -537758 -810825 -609432 -700229 -850734
17183h50734l9826K62244K33820K83744J1216k54456r623J67242O2167L57476
$$ -850734 -890560 -628316 -394496 -110752 -99536 -353992 -363615 -196373 -134206 223270
17173B23270K81491j12393k39322k2194k45118J48075J56360K65862k08686k96995
$$ 223270 504761 392368 153046 130852 -114266 33809 190169 456031 247345 -49650
17163d9650k67268M7210J80910l36297p8832M82178P0755m80886J06368J03352
$$ -49650 -316918 -269708 -88798 -425095 -503927 -21749 49006 -431880 -325512 -222160
17153b22160M76253N7350j34285J46430k98645k2171P7388L59330l87306j37377
$$ -222160 254093 311443 177158 323588 24943 2772 80160 439490 52184 -85193
17143h5193l6774J47962j12377r8007K8897j79469J16109J42072J61415R0512
$$ -85193 -121967 25995 -86382 -184389 -155492 -334961 -218852 -76780 84635 175147
17133A75147k61038J72897l8170J10960K55261k01924J612L06515P002j82091
$$ 175147 -85891 87006 48836 159796 415057 213133 214745 521260 528262 346171
17123C46171J53631J13108p7555k08380O9882J61709O9142J00908k11331K95876
$$ 346171 499802 612910 535355 326975 396857 558566 627708 728616 517285 813161
17113H13161q162q2049p2911j63595m19038m16882r7766J76118K46098K64285
$$ 813161 804999 722950 650039 486444 67406 -349476 -447242 -271124 -25026 239259
17103B39259m4094J1173J79423p1109J33289j73886r4134N00603j03809k38039
$$ 239259 195165 206338 385761 314652 447941 274055 179921 680524 576715 338676
17093C38676k0497J16962J38711p5863j31807j16054l03057L6354O5902j44629
$$ 338676 318179 435141 573852 497989 366182 250128 -52929 -16575 49327 -95302
17083i5302M85510M28255j43566l36032j36061J83471L84644k84691l29817R160
$$ -95302 390208 818463 674897 338865 202804 386275 770919 486228 156411 165571
17073A65571q1843R1421J46086R6968L69047K41393o7195k27196k38636K39063
$$ 165571 83728 175149 321235 418203 787250 1028643 961448 734252 495616 734679
17063G34679j36156q8713p0981O3575o1706n3061j09779j68486Q2540K62398j3503
$$ 734679 598523 509810 438829 502404 440698 387637 277858 109372 191912 454310 440807
17052D40807n4117m55389O4929j19189K1735J0336J40751O0173J6134l02513j80939
$$ 440807 386690 -68699 -3770 -122959 -101224 -90888 49863 110036 126170 -176343 -357282
17041c57282J75171R3462R9920K86287k4508m99838O9617K20825n0496l0540j82240
$$ -357282 -182111 -88649 11271 297558 273050 -226788 -157171 63654 13158 -17382 -199622
17030a99622j82616k03747K18639K92831K4870J39792j33421k65441j49898o4092
$$ -199622 -382238 -585985 -367346 -74515 -49645 90147 -43274 -308715 -458613 -522705
17020e22705J00832M37072K47392m61480l43734n928O0442m5127N0132M64681
$$ -522705 -421873 15199 262591 -198889 -542623 -548551 -488109 -533236 -483104 -18423
17010a8423J40664L4489l62819k65113J55245K97998j6916J9469J76943P066L27369
$$ -18423 122241 156730 -206089 -471202 -315957 -17959 -34875 -15406 161537 168603 495972
16999D95972Q2368l69063j7461q0392j36906j64252k95148K99506J40317j75514
$$ 495972 578340 209277 191816 111424 -25482 -189734 -484882 -185376 -45059 -220573
16989b20573M09484M0980o5975n5109k02392k10963j51935L10548L69119l11083
$$ -220573 188911 229891 163916 108807 -93585 -304548 -456483 -145935 223184 -87899
16979h7899m9993J01682j21385J18610j40073k47920L20831N04220j7390k75500
$$ -87899 -137892 -36210 -157595 -38985 -179058 -426978 -106147 398073 380683 105183
16969A05183k14767R1440l99318p340J48193J35206j47429k60903J12997J73102
$$ 105183 -109584 -18144 -417462 -424802 -276609 -141403 -288832 -549735 -436738 -263636
16959b63636J70631N9515R2788K73076J32373J08381Q2449j22415K95073M7923
$$ -263636 -93005 -33490 59298 332374 464747 573128 655577 533162 828235 876158
16949H76158j05055n3442J14664j78770m2601k61081k42170l02704j2127J94543
$$ 876158 771103 717661 832325 653555 610954 349873 107703 -195001 -207128 -12585
16939a2585k1899J66441O084p1520L9121j51549j90194J02993Q2184m07084J70240
$$ -12585 -34484 131957 138041 66521 105642 -45907 -236101 -133108 -50924 -458008 -287768
16928b87768K91709Q4659L4914J9878k47935K0314j55008K13907m7277k23407
$$ -287768 3941 88600 123514 143392 -104543 -84229 -239237 -25330 -72607 -296014
16918b96014j67904J22839M2915J49641P9374j0323j24425m23986o0887L51253
$$ -296014 -463918 -341079 -298164 -148523 -69149 -79472 -203897 -627883 -688770 -337517
16908c37517J73136q1213J24979L16519J70401l79122k36906J2906n4809J19166
$$ -337517 -164381 -245594 -120615 195904 366305 -12817 -249723 -236817 -291626 -172460
16898a72460k7549p9215L4982O8256K63886K33143j20425K70655J30838k21949
$$ -172460 -200009 -279224 -244242 -175986 87900 321043 200618 471273 602111 380162
16888C80162L9547R258j11502J79220o8035l68912m710j87793K27606j63680j3815
$$ 380162 419709 428967 317465 496685 428650 59738 55028 -132765 94841 -68839 -82654
16877h2654k05223j21909l0524N9496N1022R4300J88040k8669k30996p8732L44706
$$ -82654 -287877 -409786 -440310 -380814 -329792 -235492 -47452 -76121 -307117 -385849 -41143
16866d1143J00372j26288j41603l854k40835J04628J6060J56457m3315j78195
$$ -41143 59229 -67059 -208662 -212516 -453351 -348723 -332663 -176206 -219521 -397716
16856c97716K2623M5553K125q1995N19423K53310o01118l13433r6802j07253J91633
$$ -397716 -375093 -329540 -327415 -409410 110013 363323 -237795 -551228 -648030 -755283 -563650
16845e63650K04745J85833l38741J46291L25740J69543J59871J10959k87389l96346
$$ -563650 -358905 -173072 -511813 -365522 -39782 129761 289632 400591 113202 -283144
16835b83144j84799L69869N09927j55355k08304m8722k06574P1078k30561m9045
$$ -283144 -467943 -98074 411853 256498 48194 -528 -207102 -136024 -366585 -415630
16825d15630K76766J40301j955K94140K20257k24316j80056K33923J04148j08969
$$ -415630 -138864 1437 -518 293622 513879 289563 109507 343430 447578 338609
16815C38609j02777J325r9734j93130J53607J21694J15815k26369n2674j32144
$$ 338609 235832 237157 137423 -55707 97900 219594 335409 109040 56366 -75778
16805g5778j93183Q4147j04840k39446k4364J12523l5426N1540L52523n3357J86920
$$ -75778 -268961 -184814 -289654 -529100 -553464 -440941 -476367 -424827 -72304 -125661 61259
16794F1259J14925R3105L403k67148m02553J5088N6914l181L32879K51816K05721
$$ 61259 176184 269289 272692 5544 -397009 -381921 -325007 -328188 4691 256507 462228
16783D62228n931m53815m21947n5180J15452J97856R0641R7626p5892l12885k38770
$$ 462228 456297 2482 -419465 -474645 -359193 -161337 -70696 26930 -48962 -361847 -600617
16772f00617l40519L05939N98802L64563l36088j59113l56961n6376J84316J76424
$$ -600617 -941136 -635197 -36395 328168 -7920 -167033 -523994 -580370 -396054 -219630
16762b19630K22937p060K34361J74856l71319k10095j94475J80134J00169k57561
$$ -219630 3307 -3753 230608 405464 34145 -175950 -370425 -190291 -90122 -347683
16752c47683j57295M49331l34710j55167O288j49319j18528j7710O184K6666M37587
$$ -347683 -504978 -55647 -390357 -545524 -539236 -688555 -807083 -824793 -818609 -791943 -354356
16741c54356K71329P9746j41410n1269J30039j5947J29027k16348k19743j36104
$$ -354356 -83027 -3281 -144691 -195960 -65921 -81868 47159 -169189 -388932 -525036
16731e25036k7873L58285K4599J44534k07320j32529J15154L04523K3003j41568
$$ -525036 -552909 -194624 -170025 -25491 -232811 -365340 -250186 54337 77340 -64228
16721f4228M0970j55882J35405J31473j19788J32227m57990n04153Q5678L15430
$$ -64228 -23258 -179140 -43735 87738 -32050 100177 -357813 -861966 -776288 -460858
16711d60858p376O540L98467L2545j06975j25433L31497o7065K37724K3572Q988
$$ -460858 -468234 -461694 -63227 -30682 -137657 -263090 68407 1342 239066 262638 271626
16700B71626J45093j12158j95374l00486J78215J24849l72784j33359R4176j52762
$$ 271626 416719 304561 109187 -191299 -13084 111765 -261019 -394378 -300202 -452964
16690d52964J76610L59728N16752j12041m67561k40562j86882j84771o7608M99101
$$ -452964 -276354 83374 600126 488085 20524 -220038 -406920 -591691 -659299 -160198
16680a60198L43154r0315j89342j57529k15377J35432J81251J82548j67265l2552
$$ -160198 182956 92641 -96701 -254230 -469607 -334175 -152924 29624 -137641 -170193
16670a70193L20296l74822j9698k09003j30059K37551K0428N844N1142p041j39916
$$ -170193 150103 -224719 -244417 -453420 -583479 -345928 -325500 -319656 -268514 -275555 -415471
16659d15471J82971j04119O1659K79998J22956j96037j30416j39612J49171N3018
$$ -415471 -232500 -336619 -274960 5038 127994 -68043 -198459 -338071 -188900 -135882
16649a35882J61517R5918l0363j93918l81830m18773N6699n408j51476J76611
$$ -135882 25635 121553 91190 -102728 -484558 -903331 -846632 -852040 -1003516 -826905
16639h26905M71564J23882k13446j2018K06870q0179k61978R0991k93316L8029
$$ -826905 -355341 -231459 -444905 -456923 -250053 -330232 -592210 -501219 -794535 -756506
16629g56506j648L64754K6814j6523o8767J38701L9046k1757l9443L05894N0431
$$ -756506 -758154 -393400 -366586 -383109 -451876 -313175 -274129 -295886 -335329 -29435 20996
16618B0996l15364L3573J57031j13862J29880p6469l12974j82082K93985J55140
$$ 20996 -294368 -260795 -103764 -217626 -87746 -164215 -477189 -659271 -365286 -210146
16608b10146J19183r8617l0307J32384K00778k7051j24593k5442j19493k88278
$$ -210146 -90963 -189580 -219887 -87503 113275 86224 -38369 -63811 -183304 -471582
16598d71582j01927n8165j4732N38977J91539k57191k71952j7191J39430p2221
$$ -471582 -573509 -631674 -646406 -107429 84110 -173081 -445033 -462224 -322794 -395015
16588c95015r4981j87931j00463L91641K68298j86267r9822j92946m7493R6944
$$ -395015 -489996 -677927 -778390 -386749 -118451 -304718 -404540 -597486 -644979 -548035
16578e48035P3342Q8629K7559M4937q333O364L2499J72311J4059j20752o7218
$$ -548035 -474693 -386064 -358505 -313568 -321901 -315537 -283038 -110727 -96668 -217420 -284638
16567b84638K38595j92608K6949j59840k39809p6230L64063L02959l8898p6402
$$ -284638 -46043 -238651 -211702 -371542 -611351 -687581 -323518 -20559 -59457 -135859
16557a35859J51339j53313N710J64571m3810J08382j67470j35449l36322J52909
$$ -135859 15480 -137833 -132123 32448 -11362 97020 -70450 -205899 -542221 -389312
16547c89312k70644l603K99008q2393K32704p7913L7831M6706J01040k66741j1958
$$ -389312 -659956 -663559 -364551 -446944 -214240 -292153 -254322 -207616 -106576 -373317 -385275
16536c85275L6816j1215R7067k23030J50552J02690l49853k52417J6774P3288
$$ -385275 -348459 -359674 -262607 -485637 -335085 -232395 -582248 -834665 -817891 -744603
16526g44603N1458O4869L2051J13273J42219r1259n3365m8140J27083j12912k66722
$$ -744603 -693145 -628276 -596225 -482952 -340733 -431992 -485357 -533497 -406414 -519326 -786048
16515g86048r1953K07823J11665M09490K22984k85324o6956P9508J86023k44830
$$ -786048 -878001 -670178 -558513 -149023 73961 -211363 -278319 -198811 -12788 -257618
16505b57618j3063J27009k5969J25983k29870j20890L34842J59925J7891L0764
$$ -257618 -270681 -143672 -169641 -43658 -273528 -394418 -59576 100349 118240 149004
16495A49004m30597r2396L27640N3957J77411P0471l40005k3019M9988J33769
$$ 149004 -281593 -373989 -46349 7608 185019 255490 -84515 -107534 -57546 76223
16485G6223J66837J84779j87473l10744l33972J48215J02054k47590r3256M65084
$$ 76223 243060 427839 240366 -70378 -404350 -256135 -154081 -401671 -494927 -29843
16475b9843m9063n2467K18487N1859K97619k0491l75056r5567k27213l1472O7875
$$ -29843 -78906 -131373 87114 138973 436592 416101 41045 -54522 -281735 -313207 -245332
16464b45332j15506M2787J50758R0517Q6031J0512j7804J41578J08848j27146
$$ -245332 -360838 -318051 -167293 -76776 9255 19767 1963 143541 252389 125243
16454A25243m45877O7414M06773P1469k12391n1577k54373l74870k6959j9505
$$ 125243 -320634 -253220 153553 225022 12631 -38946 -293319 -668189 -695148 -714653
16444g14653J53852J11739J13192o9277j82435J06580J19794J25984k22712j15932
$$ -714653 -560801 -449062 -335870 -405147 -587582 -481002 -361208 -235224 -457936 -573868
16434e73868L035j23107J00380O143j386L02526J58549k11400o2539J70687L9457
$$ -573868 -570833 -693940 -593560 -587417 -588803 -286277 -127728 -339128 -401667 -230980 -191523
16423a91523k03321q622L01160J97725j57459p6645r0575j59745l4719k47850
$$ -191523 -394844 -403466 -102306 95419 -62040 -138685 -229260 -389005 -423724 -671574
16413f71574o649J5901L70717J36432K78706P043N0588j89594k77783J9209K49985
$$ -671574 -678223 -662322 -291605 -155173 123533 130576 181164 -8430 -286213 -267004 -17019
16402a7019L2316j18630p3706Q8490m3161j03751M82878M8630n55501j06792j00576
$$ -17019 15297 -103333 -177039 -88549 -131710 -235461 247417 296047 -259454 -366246 -466822
16391d66822j36010K94307M26690l21771J75949l3441K5544L21588k2q5989K1158
$$ -466822 -602832 -308525 118165 -203606 -27657 -61098 -35554 286034 286012 200023 221181
16380B21181Q6319L8886J45942k72086j45982o4758m0131O4677j12336j64890
$$ 221181 307500 346386 492328 220242 74260 9502 -30629 34048 -78288 -243178
16370b43178n9596K0910J96324K21447l30490k55625r2187K19573J61063j47214
$$ -243178 -302774 -281864 -85540 135907 -194583 -450208 -542395 -322822 -161759 -308973
16360c08973O560K9596k38488l8122N1236m6504N39892j2772m51486j99684j19235
$$ -308973 -302413 -272817 -511305 -549427 -498191 -544695 -4803 -17575 -469061 -668745 -787980
16349g87980L48979N22638J47238M7378O5915k20270M1587j19682l12448O01q4614
$$ -787980 -439001 83637 230875 278253 344168 123898 165485 45803 -266645 -266044 -350658
16338c50658L5430r475j38715J1Q7212K25744J07451J80388M9029r780j92573
$$ -350658 -315228 -324703 -463418 -463407 -376195 -150451 -43000 137388 186417 176637 -15936
16327a5936l30158p2269N1007J65969K18835j87614j61961j79749l0892j39960
$$ -15936 -346094 -418363 -367356 -201387 17448 -170166 -332127 -511876 -542768 -682728
16317f82728Q1990L1394J31714L20260L18567O3587j55908J57683L32329P8887
$$ -682728 -600738 -569344 -437630 -117370 201197 264784 108876 266559 598888 677775
16307F77775k15742q9946k72865j36428j96457j93347k07033L29999K53969j72901
$$ 677775 462033 372087 99222 -37206 -233663 -427010 -634043 -304044 -50075 -222976
16297b22976J52172N1482P2284J4475p5342k45156j12331q0695L28548k52779
$$ -222976 -70804 -19322 52962 67437 -7905 -253061 -365392 -446087 -117539 -370318
16287c70318j52395Q3377J55897M7580M47830j90782k34442K27872J26418j33559
$$ -370318 -522713 -439336 -283439 -235859 211971 21189 -213253 14619 141037 7478
16277G478o6291q4873j00675J77201m012n20600k7227M78793j8285Q9863j76579
$$ 7478 -58813 -143686 -244361 -67160 -71172 -591772 -618999 -140206 -158491 -68628 -245207
16266b45207j54214J6304O1423K0996Q2171j36834N0741K87166k23327k99999
$$ -245207 -399421 -383117 -321694 -300698 -218527 -355361 -304620 -17454 -240781 -540780
16256e40780K96814K95890p1919r6709j01426j36865K5311j93318M3352j06259
$$ -540780 -243966 51924 -19995 -116704 -218130 -354995 -329684 -523002 -479650 -585909
16246e85909J2737J12224K97064M01981J40523k24467k32424l24515o0052q4247
$$ -585909 -573172 -460948 -163884 238097 378620 154153 -78271 -402786 -462838 -547085
16236e47085l0053K38924K66413O8590K14674k04046m38296J80319J56759K50253
$$ -547085 -577138 -338214 -71801 -3211 211463 7417 -430879 -250560 -93801 156452
16226A56452P1949j46210o1206l45572j83350L56944J94693l01443K4729j2678
$$ 156452 228401 82191 20985 -324587 -507937 -150993 43700 -257743 -233014 -245692
16216b45692K6995K13076L8298Q288k69490j82084j42054M5315k21153k35789
$$ -245692 -218697 -5621 32677 40965 -228525 -410609 -552663 -507348 -728501 -964290
16206i64290M145J39493J38644L81772K53148K43951j69636j82479J24205L04560
$$ -964290 -960145 -820652 -682008 -300236 -47088 196863 27227 -155252 -31047 273513
16196B73513k48312j84150R0500r7995q9371Q9735k51141k07936L82942R1295
$$ 273513 25201 -158949 -68449 -166444 -255815 -166080 -417221 -625157 -242215 -150920
16186a50920r5240q4242k05457K63992J22697J33400L46223n8389k57747M2253
$$ -150920 -246160 -330402 -535859 -271867 -149170 -15770 330453 272064 14317 56570
16176E6570l20023k7213o1220J45148J2352k9703J31783k46838k00547l26232
$$ 56570 -263453 -290666 -351886 -206738 -194386 -224089 -92306 -339144 -539691 -865923
16166h65923j14505K51174N81390L19012k32372o6189q594k54641K35148K12538
$$ -865923 -980428 -729254 -147864 171148 -61224 -127413 -136007 -390648 -155500 57038
16156E7038k952L7213J10912l24809m11858M04986M81089j82034n28123J3459
$$ 57038 54086 91299 202211 -122598 -534456 -129470 351619 169585 -358538 -345079
16146c45079L33480j69050n4007j95978l73169J20534J95052J94148K26076k29367
$$ -345079 -11599 -180649 -234656 -430634 -803803 -683269 -488217 -294069 -67993 -297360
16136b97360L3602O6008J01864j62227j10138J86983J20927K12726p0264j36653
$$ -297360 -263758 -197750 -95886 -258113 -368251 -181268 -60341 152385 82121 -54532
16126e4532l03659R929j47755J83522L55364K9789j43167j99124j62762K52148
$$ -54532 -358191 -348262 -496017 -312495 42869 72658 -70509 -269633 -432395 -180247
16116a80247M5274J82243M0338j42119K20782j2159k57355j8023k53320j68528
$$ -180247 -134973 47270 87608 -54511 166271 154112 -103243 -121266 -374586 -543114
16106e43114J05933K75392J12501J45002m7885k62557l66858n731N4927K25687
$$ -543114 -437181 -161789 -49288 95714 47829 -214728 -581586 -587317 -532390 -306703
16096c06703L77664L549J21665j81477J32635R4155J27521K8418j96780l05133
$$ -306703 70961 74510 196175 14698 147333 241488 369009 397427 200647 -104486
16086a04486j78312J6343J98691k4417p2176J2945K62666M9679n8461N7749j59225
$$ -104486 -282798 -266455 -67764 -92181 -164357 -151412 111254 160933 102472 160221 996
16075I96J47460j49085q2726l0956m32512r3527K60340l01291J04450K1353K89093
$$ 996 148456 -629 -83355 -114311 -546823 -640350 -380010 -681301 -576851 -555498 -266405
16064b66405K81794J53095l97597l26179K3953L94331J59762J53419L84857k8652
$$ -266405 15389 168484 -229113 -555292 -531339 -137008 22754 176173 561030 532378
16054E32378j34637k71167l2530R2696k8694j62505o6028j41002n5274j74955
$$ 532378 397741 126574 94044 186740 158046 -4459 -70487 -211489 -266763 -441718
16044d41718N6211J91916r6875K24875J87990q6866K30392l6470m73031n19953
$$ -441718 -385507 -193591 -290466 -65591 122399 35533 265925 229455 -243576 -763529
16034g63529J41205L16558R3025O9124l44536l5579L92508J0830j6088J2283m24524
$$ -763529 -622324 -305766 -212741 -143617 -488153 -523732 -131224 -120394 -136482 -124199 -548723
16023e48723n3712N71843K01871l7810K31896k5752k42285j79905J29894l8731
$$ -548723 -602435 -30592 171279 133469 365365 339613 97328 -82577 47317 8586
16013H586K54759q2363j89732N2933K89385K51294p20275l14083K00145L85672
$$ 8586 263345 180982 -8750 44183 333568 584862 -135413 -449496 -249351 136321
16003A36321N0980k8257K17450l09217j07904j65880K3309J34223j17317l82069
$$ 136321 187301 159044 376494 67277 -40627 -206507 -183198 -48975 -166292 -548361
15993e48361k65067k8970J17617J29867J12308J48144J42868l19605o2586o266
$$ -548361 -813428 -842398 -724781 -594914 -482606 -334462 -191594 -511199 -573785 -580051
15983e80051J14107L54702j6260j81314o0620j55851m01153k0928O64503J37910
$$ -580051 -465944 -111242 -127502 -308816 -369436 -525287 -926440 -947368 -282865 -144955
15973a44955m80567p623N5711L7571M01224K4548q2258j44544O0796o8460J11738
$$ -144955 -625522 -633145 -577434 -539863 -138639 -114091 -196349 -340893 -280097 -348557 -236819
15962b36819K01559J12204K0798k45676J4071k6642l05456L00192P5788Q8384
$$ -236819 -35260 76944 97742 -147934 -133863 -160505 -465961 -165769 -89981 -1597
15952a597O4103M9484k23912p6929J54479l09136r5980Q3007N3874J63161N5505
$$ -1597 62506 111990 -111922 -188851 -34372 -343508 -439488 -356481 -302607 -139446 -83941
15941h3941m9631k87777k76986r696k10451Q6061K43405J62169k02545J75227
$$ -83941 -133572 -421349 -698335 -708031 -918482 -832421 -589016 -426847 -629392 -454165
15931d54165Q3955M17246K72157l14748k89621j87728K11211j74023j22414j05970
$$ -454165 -370210 47036 319193 4445 -285176 -472904 -261693 -435716 -558130 -664100
15921f64100J14741K42957J42563K56639j15249j96925l45652p5068J26408K26051
$$ -664100 -549359 -306402 -163839 92800 -22449 -219374 -565026 -640094 -513686 -287635
15911b87635J54169j92164l06696K49907K24118J04562J72107m4810j86946j4107
$$ -287635 -133466 -325630 -632326 -382419 -158301 -53739 118368 73558 -113388 -127495
15901a27495K9003K8097n9014K01328J25254j82404p1371l6743r1961j85512l2093
$$ -127495 -98492 -70395 -129409 71919 197173 14769 -56602 -93345 -185306 -370818 -402911
15890d02911L2250K43752j7042q4535l3859M104j75520l59792L652N18061J61659
$$ -402911 -370661 -126909 -143951 -228486 -262345 -258241 -433761 -793553 -789901 -271840 -110181
15879a10181J59960o0493j5109k13324j13429l12616k22607J38956k18606K34228
$$ -110181 49779 -10714 -25823 -239147 -352576 -665192 -887799 -748843 -967449 -733221
15869g33221L32782k57580n26198L95779L34075K44405j38212k61929m10658j17833
$$ -733221 -400439 -658019 -1184217 -788438 -454363 -209958 -348170 -610099 -1020757 -1138590
15859a138590M13607J70880J66823q9570j14845k09306K58999J33000J3975K35236
$$ -1138590 -724983 -554103 -387280 -476850 -591695 -801001 -542002 -409002 -395027 -159791
15849a59791j95992j87278J95658k03917k55152J28392K6224K19514J24435j48965
$$ -159791 -355783 -543061 -347403 -551320 -806472 -678080 -651856 -432342 -307907 -456872
15839d56872K42833K58877N4628m82186j96916J44187o8710M8108L62362r1496
$$ -456872 -214039 44838 99466 -382720 -579636 -435449 -504159 -456051 -93689 -185185
15829a85185p2827J23223J60923K48883K21015k5594l89772Q8180P6618l64251
$$ -185185 -258012 -134789 26134 275017 496032 470438 80666 168846 245464 -118787
15819a18787l07289j00294J72239K0670K0809J09682O3500j09537K33912M8773
$$ -118787 -426076 -526370 -354131 -333461 -312652 -202970 -139470 -249007 -15095 33678
15809C3678J56831K28098l5042m85973l67361l82416j76782K26031J99355J60372
$$ 33678 190509 418607 383565 -102408 -469769 -852185 -1028967 -802936 -603581 -443209
15799d43209M09144N7609k02969J48524j48865r3897k19378q436J87710K17238
$$ -443209 -34065 23544 -179425 -30901 -179766 -273663 -493041 -501477 -313767 -96529
15789i6529L30099J43831n11877m04088j15902o8673L83623J88843J91504K60324
$$ -96529 233570 377401 -134476 -538564 -654466 -723139 -339516 -150673 40831 301155
15779C01155r3630k63874M5195J192J3766o3453j04552o190K9718l7179J40968
$$ 301155 207525 -56349 -11154 -9962 3804 -59649 -164201 -170391 -140673 -177852 -36884
15768c6884L00028j5504p2091k35750j47100J32818K08237k5617n02580p0105
$$ -36884 263144 247640 175549 -60201 -207301 -74483 133754 108137 -394443 -464548
15758d64548M60193O83543k77618Q6275j51195m24129m80563m5538P4611L01065
$$ -464548 -4355 679188 401570 487845 336650 -87479 -568042 -613580 -538969 -237904
15748b37904K05216K61585o7197k80806r8161j27300n8245j73840J34111r2269
$$ -237904 -32688 228897 161700 -119106 -217267 -344567 -402812 -576652 -442541 -534810
15738e34810j8512R3598k44088j44831K18571O8423k90744K07728J56222L7624
$$ -534810 -553322 -459724 -703812 -848643 -630072 -561649 -852393 -644665 -488443 -450819
15728d50819K8798J71455J42275m9991n2766K08991K79317l36955l04680O9290
$$ -450819 -422021 -250566 -108291 -158282 -211048 -2057 277260 -59695 -364375 -295085
15718b95085L2122O8298N7901K67893M2108R3433k41491J68942J43918k60058
$$ -295085 -262963 -194665 -136764 131129 173237 266670 25179 194121 338039 77981
15708G7981j49982J86327l911j16186j41862J81325k31545k40978j77160K36791
$$ 77981 -72001 114326 110415 -5771 -147633 33692 -197853 -438831 -615991 -379200
15698c79200J56090N7955J22804K10672q3869J0968k04571j35095L04202M16140
$$ -379200 -223110 -165155 -42351 168321 84452 95420 -109151 -244246 59956 476096
15688D76096j31449j52150j28782q682J81801J9592j29503q9731M03419K31231
$$ 476096 344647 192497 63715 55033 236834 256426 126923 37192 440611 671842
15678F71842k23309m70935n0724j1850k80232k24445J54440M96615O8305n5484
$$ 671842 448533 -22402 -73126 -84976 -365208 -589653 -435213 61402 129707 74223
15668G4223J85325j57649j09564p0193l1627K7926l3479j01064P789j1766L0912
$$ 74223 259548 101899 -7665 -77858 -109485 -81559 -115038 -216102 -208313 -220079 -189167
15657a89167j16087l688J81463M94050Q5826J42743M9547k32375m12588n1306
$$ -189167 -305254 -308942 -127479 366571 452397 595140 644687 412312 -276 -51582
15647e1582m3769k34177M03475K90570j67074j41002r0820J54002J87022q6678
$$ -51582 -95351 -329528 73947 364517 197443 56441 -34379 119623 306645 219967
15637B19967j71651j02526l23399l05969j8460K40108N44977J9216n47874n8240
$$ 219967 48316 -54210 -377609 -683578 -702038 -461930 83047 102263 -445611 -503851
15627e03851K86078j27863l17293L39075K30064j49329j29706l5780j0840L74351
$$ -503851 -217773 -345636 -662929 -323854 -93790 -243119 -372825 -408605 -419445 -45094
15617d5094o7228j68529J31367P7681J61185L0556k46905J87493J55729p9702
$$ -45094 -112322 -280851 -149484 -71803 89382 119938 -126967 60526 216255 136553
15607A36553L9083J13509N7047j95018j93770J5015J31462P4106K9539J07573
$$ 136553 175636 289145 346192 151174 -42596 -27581 103881 177987 207526 315099
15597C15099K42120l6288k43906M7176Q553m38252J7366J07039k30421M1620J10648
$$ 315099 557219 520931 277025 324201 332754 -105498 -88132 18907 -211514 -169894 -59246
15586e9246r3507l18573m452J05316K92398L34033j08153k51417k16161k993K33840
$$ -59246 -152753 -471326 -475778 -370462 -78064 255969 147816 -103601 -319762 -322755 -88915
15575h8915J75765P6715l93733j1029R3424K44930j28999p553j0850k64148K48495
$$ -88915 86850 163565 -230168 -241197 -147773 97157 -31842 -39395 -50245 -314393 -65898
15564f5898N756J58970l3383p0555j65537k97340M8397j08645J31553k21170K26836
$$ -65898 -60142 98828 65445 -5110 -170647 -467987 -419590 -528235 -396682 -617852 -391016
15553c91016O63760P3815O4935k41982j55450k42415K2992L35488Q4510m8385
$$ -391016 272744 346559 411494 169512 14062 -228353 -205361 130127 214637 166252
15543A66252j14544j81976p8394L08681J07645k43458r2166j04819j53116K17267
$$ 166252 51708 -130268 -208662 100019 207664 -35794 -127960 -232779 -385895 -168628
15533a68628J76288j63727j68167j12791P0267j4021K8667n7400M08259K31313
$$ -168628 7660 -156067 -324234 -437025 -366758 -380779 -352112 -409512 -1253 230060
15523B30060k37155r9551j45K45256K64273n0366l82808k67089K72544K7498j24427
$$ 230060 -7095 -106646 -106791 138465 402738 352372 -30436 -297525 -24981 2517 -121910
15512a21910Q3900k52437q1873j24650r4278K84024K8072J93346j52017J5290
$$ -121910 -38010 -290447 -372320 -496970 -591248 -307224 -279152 -85806 -237823 -222533
15502b22533r307J21226n221k07307j63034j82288J70504J33515o4141M83971
$$ -222533 -231840 -110614 -115835 -323142 -486176 -668464 -497960 -364445 -428586 55385
15492E5385J66037j56185l23655j60787o9587N7187R2578L19416N2231l25263
$$ 55385 221422 65237 -258418 -419205 -488792 -431605 -339027 -19611 32620 -292643
15482b92643j43206K86982J80912r8646O2361K25218j78546l28999P7230N74294
$$ -292643 -435849 -148867 32045 -66601 -4240 220978 42432 -286567 -209337 364957
15472C64957j50488j73796K123o6952j3829Q5383j72241l06455K60042L4521l75459
$$ 364957 214469 40673 42796 -24156 -37985 47398 -124843 -431298 -171256 -136735 -512194
15461e12194P7586J53317q5104L8591J30526j88854l68133J92969P8687N7413
$$ -512194 -434608 -281291 -366395 -327804 -197278 -386132 -754265 -561296 -482609 -425196
15451d25196R8775Q3930J36112n4591Q0400j81561Q0304k07103J06447J08009
$$ -425196 -326421 -242491 -106379 -160970 -80570 -262131 -181827 -388930 -282483 -174474
15441a74474J7576P5658j10892k51101J451K29998K11624k115M419l20965L0176
$$ -174474 -156898 -81240 -192132 -443233 -441782 -211784 -160 -2275 2144 -318821 -288645
15430b88645L00951j16103l60675M5286K28928J2802q7072j17488J37554j11953
$$ -288645 12306 -103797 -464472 -419186 -190258 -177456 -264528 -382016 -244462 -356415
15420c56415Q2997O1066j19416L6315r7494K92988J7906k13817m14302L27100
$$ -356415 -273418 -212352 -331768 -295453 -392947 -99959 -82053 -295870 -710172 -383072
15410c83072K35352k49463K47581J42304m11583j9146K99305J21649P9755J64965
$$ -383072 -147720 -397183 -149602 -7298 -418881 -438027 -138722 -17073 62682 227647
15400B27647l4585r119J16535J00598l84683k34423K34852J4557n29024o8653
$$ 227647 193062 183943 300478 401076 16393 -218030 16822 31379 -497645 -566298
15390e66298p8558Q0013O40817m245p7286p0934K10805p0234j56381M1014j61706
$$ -566298 -644856 -564843 75974 71729 -5557 -76491 134314 64080 -92301 -51287 -212993
15379b12993K21578k9123J2471N5720l5681J60781k04372P3681J74292Q1433r5062
$$ -212993 8585 -20538 -8067 47653 11972 172753 -31619 42062 216354 297787 202725
15368B02725j72841L699L41786Q0145k93587n81812K04921K61445J58300l39340
$$ 202725 29884 33583 375369 455514 161927 -419885 -214964 46481 204781 -134559
15358a34559k38503l5852K47520J73225k4530j65271k90392L44436L91047J63352
$$ -134559 -373062 -408914 -161394 11831 -12699 -177970 -468362 -123926 267121 430473
15348D30473l36677j67594k01133q4644k7750L64101K97447j74179J39251K64539
$$ 430473 93796 -73798 -274931 -359575 -387325 -23224 274223 100044 239295 503834
15338E03834L7949m10748j02270L1638j23433l25563O6215M80691J23666J80305
$$ 503834 541783 131035 28765 60403 -63030 -388593 -322378 158313 281979 462284
15328D62284M7784m942K2927j43942l9804K5383j28599q0451j16246J5141j04765
$$ 462284 510068 505126 528053 384111 344307 369690 241091 160640 44394 59535 -45230
15317d5230R9348k83380k39414J40439K16220K12571L08753r6384k28305k78326
$$ -45230 54118 -229262 -468676 -328237 -112017 100554 409307 312923 84618 -193708
15307a93708j51055K1722J55792K9800K93229K4859J9174j24329R9605j40467
$$ -193708 -344763 -323041 -167249 -137449 155780 180639 199813 75484 175089 34622
15297C4622j40066m51645n26238j28698L91508M23579K47959K30098K03184m116
$$ 34622 -105444 -557089 -1083327 -1212025 -820517 -396938 -148979 81119 284303 280187
15287B80187q9378p3979J6563K8362k44642l9901k06416q0851J64629J56975J88033
$$ 280187 190809 116830 133393 161755 -82887 -122788 -329204 -410055 -245426 -88451 99582
15276I9582L06090Q7870j10650n5236l821l0110j55391r7191j81713k4915K84848
$$ 99582 405672 493542 382892 327656 323835 293725 138334 41143 -140570 -165485 119363
15265A19363m10990m87480K59683M91179K25453P1020l32466p2500j51602L3104
$$ 119363 -291627 -779107 -519424 -28245 197208 268228 -64238 -136738 -288340 -255236
15255b55236J60706r8933k3754K56906N3983j41128n0556m8692j72244L6544J69043
$$ -255236 -94530 -193463 -217217 39689 93672 -47456 -98012 -146704 -318948 -282404 -113361
15244a13361k53020J05005J75060J16051j17191J00711J72601k5562j23831R6245
$$ -113361 -366381 -261376 -86316 29735 -87456 13255 185856 160294 36463 132708
15234A32708l8082m2581J66327k36497k41465j75341P1274R480J4932m6664M01296
$$ 132708 94626 52045 218372 -18125 -259590 -434931 -363657 -354177 -339245 -385909 15387
15223A5387J61979O2301j68855R461n0891k80316j60802k103m1933l1232J03628
$$ 15387 177366 239667 70812 80273 29382 -250934 -411736 -413839 -455772 -487004 -383376
15212c83376J43257j2078O5747J97268p6723L3842L38616J47521m9077J73630
$$ -383376 -240119 -252197 -186450 10818 -65905 -32063 306553 454074 404997 578627
15202E78627j11368k36896k08480j22404k61j38975Q0058Q590J66285k79484K0241
$$ 578627 467259 230363 21883 -100521 -100782 -239757 -159699 -151109 15176 -264308 -244067
15191b44067K06838R0242k02913K39060k24272j12745J16407K61048J43513L36
$$ -244067 -37229 53013 -149900 89160 -135112 -247857 -131450 129598 273111 273447
15181B73447j62104k19830j41720J55917J00423j74764j76232J92902K28578Q0541
$$ 273447 111343 -108487 -250207 -94290 6133 -168631 -344863 -151961 76617 157158
15171A57158k8046j31381J96433j66395J76010R7125m82501L5524J24832Q1971
$$ 157158 129112 -2269 194164 27769 203779 300904 -181597 -146073 -21241 60730
15161F0730L427l989J01298r3294m7634Q526l0408l31604l20740J89992N9945
$$ 60730 64157 60168 161466 68172 20538 29064 -1344 -332948 -653688 -463696 -403751
15150d03751K54203P8582o3995j84677q5751j49844L01993L77980q9232m11408
$$ -403751 -149548 -70966 -134961 -319638 -405389 -555233 -253240 124740 35508 -375900
15140c75900l35792k2580P5791J63141l13244J27832J12871J15342K85277K35049
$$ -375900 -711692 -734272 -658481 -495340 -808584 -680752 -567881 -452539 -167262 67787
15130F7787K42174K62864O7226j58919o762O0141j49853o14505l00602J99035
$$ 67787 309961 572825 640051 481132 474370 534511 384658 -229847 -530449 -331414
15120c31414J04448J96688k11009J24719p1469J5127L05896L28999J90135j35732
$$ -331414 -226966 -30278 -241287 -116568 -188037 -172910 132986 461985 652120 516388
15110E16388k81016k6961K8749p7557j8721J71697P4668k26909k83906j54423
$$ 516388 235372 208411 237160 159603 140882 312579 387247 160338 -123568 -277991
15100b77991m383R0111l9086N63794K95832k53072k44208K40544k57463j33339
$$ -277991 -282374 -192263 -231349 332445 628277 375205 130997 371541 114078 -19261
15090a9261Q9623J01520m7428J4548p9128J29162j56607l66061m6822p9566O7106
$$ -19261 70362 171882 124454 139002 59874 189036 32429 -333632 -380454 -460020 -392914
15079c92914k4295J99917J72115J38386Q6787j55161k33572L83789j42599j9644
$$ -392914 -417209 -217292 -45177 93209 179996 24835 -208737 175052 32453 12809
15069A2809j96441m2183m2637j33406P2207L8550Q9265K9059J13152J02078L0937
$$ 12809 -183632 -225815 -268452 -401858 -329651 -291101 -201836 -172777 -59625 42453 73390
15058G3390k5673J6124Q7518K73466k99692k00104j72070K15728p5885L8313k13125
$$ 73390 47717 63841 151359 424825 125133 -74971 -247041 -31313 -107198 -68885 -282010
15047b82010j87061L17216R0722j23295J10171K74327l47656m06581K88007L20114
$$ -282010 -469071 -151855 -61133 -184428 -74257 200070 -147586 -554167 -266160 53954
15037E3954O2030j88526P5761J47821J20716k58361o0411J54471J65457o9382
$$ 53954 115984 -72542 3219 151040 271756 13395 -47016 107455 272912 203530
15027B03530l24655m6988J12663K14540j29419J91591J69162m8820n00321q4789
$$ 203530 -121125 -168113 -55450 159090 29671 221262 390424 341604 -158717 -243506
15017b43506k5040N1662N989N1589L58021N4985j99081j1109J44055O6578o818
$$ -243506 -268546 -216884 -210895 -159306 198715 253700 54619 43510 187565 254143 247325
15006B47325j19153p1546Q9311J6413m5530J58984K5409m30211Q5204l601n685
$$ 247325 128172 56626 145937 162350 116820 275804 301213 -128998 -43794 -47395 -53080
14995e3080J75120J96045k0150l65518m2614J7012m5734L04386R105k59041k17081
$$ -53080 122040 318085 297935 -67583 -110197 -93185 -138919 165467 174572 -84469 -301550
14984c01550j892K66615l39K28863K06682o6181l07799J4663K07476K25682k36523
$$ -301550 -303442 -36827 -37166 191697 398379 332198 24399 39062 246538 472220 235697
14973B35697j10627l2113O6161j58903o7404J04068K10096n38547J84847K65764
$$ 235697 125070 92957 159118 215 -67189 36879 246975 -291572 -106725 159039
14963A59039r7983k78971K81777L43037l308l97483j89773R6183O237o5664M6875
$$ 159039 61056 -217915 63862 406899 403591 6108 -183665 -87482 -81245 -146909 -100034
14952a00034K684R8089l9712m27096L1424K777J36927K28383Q5871j07667j98401
$$ -100034 -97350 739 -38973 -466069 -434645 -431868 -294941 -66558 19313 -88354 -286755
14941b86755o7086K9092o7867j1642L93061L01644k47644l2404K86151J55030
$$ -286755 -353841 -324749 -392616 -404258 -11197 290447 42803 10399 296550 451580
14931D51580L40760j30818k91691k03641K50574J08414l2346j57062K9065P1267
$$ 451580 792340 661522 369831 166190 416764 525178 492832 335770 364835 436102
14921D36102r4811q5561l37224k958J2465R2219J34032l70552j11156Q9565N5393
$$ 436102 341291 255730 -81494 -84452 -71987 20232 154264 -216288 -327444 -237879 -182486
14910a82486K58999J47456L39712l5108k39620J49436k29051J7494n0251j1453
$$ -182486 76513 223969 563681 528573 288953 438389 209338 226832 176581 165128
14900A65128K9521J58325r3656j37733j37011L6803l36959J03111q2315P8566
$$ 165128 194649 352974 259318 121585 -15426 21377 -315582 -212471 -294786 -216220
14890b16220J65260J52030K0496j243L44682N2889k46467l21846k14393m9118
$$ -216220 -50960 101070 121566 120323 465005 517894 271427 -50419 -264812 -313930
14880c13930j22836j07410Q406q862J53983J14496k63340J9371K54956M69378
$$ -313930 -436766 -544176 -535770 -544632 -390649 -276153 -539493 -520122 -265166 204212
14870B04212L10473p9951q4882k07144m947m29091n8639M4129m0047k1380j06341
$$ 204212 514685 434734 349852 142708 137761 -291330 -349969 -305840 -345887 -367267 -473608
14859d73608k3857Q9513K56557j09520n9385O3321L98165p6284l59970m217R0666
$$ -473608 -497465 -407952 -151395 -260915 -320300 -256979 141186 64902 -295068 -299285 -208619
14848b08619r9872k77122j952j98018K28540J77300Q5073k25039o7971K74867
$$ -208619 -308491 -585613 -587565 -785583 -557043 -379743 -294670 -519709 -587680 -312813
14838c12813K05426j85542n1269K7382L6117P7318k04017N9494K07717J38368
$$ -312813 -107387 -292929 -344198 -316816 -280699 -203381 -407398 -347904 -140187 -1819
14828a819Q8432N6014j06695r017J22841j64617k6034j74063j92646J21285l7687
$$ -1819 86613 142627 35932 26915 149756 -14861 -40895 -214958 -407604 -286319 -324006
14817c24006K6869J32658K38222J00149K4601R3621J22469j2824J11136j36221
$$ -324006 -297137 -164479 73743 173892 198493 292114 414583 401759 512895 376674
14807C76674l53303r2507J16189j7983q5918Q4671j0601j21449J37771J62065
$$ 376674 23371 -69136 47053 29070 -56848 27823 17222 -104227 33544 195609
14797A95609J63196N9243j7825j81540k62948j71640P4056P8017Q4609K39857
$$ 195609 358805 418048 400223 218683 -44265 -215905 -141849 -63832 20777 260634
14787B60634N5445n06237k52625L0609k191J03535K52164J33321J32486J49541
$$ 260634 316079 -190158 -442783 -412174 -414365 -310830 -58666 74655 207141 356682
14777C56682l10625M865K8089O5253N1154m20307l03548K27928J99656Q8828J11645
$$ 356682 46057 50922 79011 144264 195418 -224889 -528437 -300509 -100853 -12025 99620
14766I9620l5639n1950j19649l77658o7745K87729L23204J61153O2681k33028
$$ 99620 63981 12031 -107618 -485276 -553021 -265292 57912 219065 281746 48718
14756D8718l00583J89217L92341J33235j44505k15376K77538k08071m25632k95834
$$ 48718 -251865 -62648 329693 462928 318423 103047 380585 172514 -253118 -548952
14746e48952P3014J14083L15112j75884Q2783J78273Q6461J60004j02449k34253
$$ -548952 -475938 -361855 -46743 -222627 -139844 38429 124890 284894 182445 -51808
14736e1808m14603j73535Q3949K06895K49172M20200J56506o6927p8160J90526
$$ -51808 -466411 -639946 -555997 -349102 -99930 320270 476776 409849 331689 522215
14726E22215k81950j31444k07817J5372P7183R1221P2401J14618J7636j55657
$$ 522215 240265 108821 -98996 -83624 -6441 84780 157181 271799 289435 133778
14716A33778k47994J22773L08939k82874q0454J67373O8895k95154n6187M36176
$$ 133778 -114216 8557 317496 34622 -45832 121541 190436 -104718 -160905 275271
14706B75271K59356J67085l51794j62022m2505m7565L35550j34917J05943m06842
$$ 275271 534627 701712 349918 187896 145391 97826 433376 298459 404402 -2440
14696b440k93742l7009k15926L53057K79985O6490j42945j2073J45064l86669
$$ -2440 -296182 -333191 -549117 -196060 83925 150415 7470 -4603 140461 -246208
14686b46208j09575M9152j45150J46224Q9141J51029o0496R0597N3335k09890
$$ -246208 -355783 -306631 -451781 -305557 -216416 -65387 -125883 -35286 18049 -191841
14676a91841O6654j20645J08604K43477j0165K49225N8789K12602j04055m25247
$$ -191841 -125187 -245832 -137228 106249 96084 345309 404098 616700 512645 87398
14666H7398k21529l8617k00724J22591N43784K56670j87730k45108j72000p2897
$$ 87398 -134131 -172748 -373472 -250881 292903 549573 361843 116735 -55265 -128162
14656a28162k68033Q1773J40313J8056K29089K27088L77391m06076m25902Q0224
$$ -128162 -396195 -314422 -174109 -156053 73036 300124 677515 271439 -154463 -74239
14646g4239r9878j19316j45347K14239J33475k98655Q8769p374L1411J48922J90738
$$ -74239 -174117 -293433 -438780 -224541 -91066 -389721 -300952 -308326 -276915 -127993 62745
14635F2745M8497j00711N2341q067j62070m4678j8686K38193K84312r2798k71257
$$ 62745 111242 10531 62872 54805 -107265 -151943 -170629 67564 351876 259078 -12179
14624a2179n6359j80177l0209L92813j19973j95022K11994P5548l21459N7144
$$ -12179 -68538 -248715 -278924 113889 -6084 -201106 10888 86436 -235023 -177879
14614a77879k9269k28430J14740k9981J22299J37919j66463l16472M17970J83770
$$ -177879 -207148 -435578 -320838 -350819 -228520 -90601 -257064 -573536 -155566 28204
14604B8204j85573k4967K55316K17811j23016L4850J571j26391l19802K77780
$$ 28204 -157369 -182336 72980 290791 167775 202625 204196 77805 -241997 35783
14594C5783K14086R2599J4031o7887n8009L6427j14831r833L71394k48779j06928
$$ 35783 249869 342468 356499 288612 230603 267030 152199 142366 513760 264981 158053
14583A58053J8220k33140O8942K25230n1407K07390l123j15657j79114O2166k28279
$$ 158053 176273 -56867 12075 237305 185898 393288 390165 274508 95394 157560 -70719
14572g0719l12202j36156j56647k06695M7880J76330J42528K32395J16492J22783
$$ -70719 -382921 -519077 -675724 -882419 -834539 -658209 -515681 -283286 -166794 -44011
14562d4011L38553J22419j79582N5268m82831l38796J01545N6510L48052J05667
$$ -44011 294542 416961 237379 292647 -190184 -528980 -427435 -370925 -22873 82794
14552H2794L1085k96678l39793K26529N63093N0957l47941j74849J99570J80237
$$ 82794 113879 -182799 -522592 -296063 267030 317987 -29954 -204803 -5233 175004
14542A75004j32787l01360L76081M85535j60787o2268j74481j79801P3541J62892
$$ 175004 42217 -259143 116938 602473 441686 379418 204937 25136 98677 261569
14532B61569r663k55760r3544P5603K16070J05881k20606P4262R0001k82458k71572
$$ 261569 251906 -3854 -97398 -21795 194275 300156 79550 153812 243813 -38645 -310217
14521c10217Q8902k8326J10545N7981k62325N7850L5344j39000J27535j18488
$$ -310217 -221315 -249641 -139096 -81115 -343440 -285590 -250246 -389246 -261711 -380199
14511c80199P8000J30604K94654o2310n2769J38881j38603m12559j60341K80202
$$ -380199 -302199 -171595 123059 60749 7980 146861 8258 -404301 -564642 -284440
14501b84440L07721m4033K92750L00069O1081k56542l12765p0624J33543j2682
$$ -284440 23281 -20752 271998 572067 633148 376606 63841 -6783 126760 114078
14491A14078n0969M07803j88981j00244k00643j29549J59302J66002j54555P4299
$$ 114078 63109 470912 281931 181687 -18956 -148505 10797 176799 22244 96543
14481I6543Q9148L5591M7093q5334m7936j67560R8558o7960k50418j43067J56273
$$ 96543 185691 221282 268375 183041 135105 -32455 66103 -1857 -252275 -395342 -239069
14470b39069K25582R1365l0250P7018J17117K38543M38059L23394J24058k3391
$$ -239069 -13487 77878 47628 124646 241763 480306 918365 1241759 1365817 1342426
14460A342426k04519K10528M99825L38271J55775j81403K21222K71885J19017
$$ 1342426 1137907 1348435 1848260 2186531 2342306 2160903 2382125 2654010 2773027
14451B773027j67379j64459k14932k92343l28108P3659J55553j35564k44883j54946
$$ 2773027 2605648 2441189 2226257 1933914 1605806 1679465 1835018 1699454 1454571 1299625
14441A299625N3834k10448k46317R7064M9340j39718k71783o2531P4330j55920
$$ 1299625 1353459 1143011 896694 993758 1043098 903380 631597 569066 643396 487476
14431D87476l93540k77753L5844K56563j82650l80789J47816J18168K51186L43608
$$ 487476 93936 -183817 -147973 108590 -74060 -454849 -307033 -188865 62321 405929
14421D05929m6731J64652k08684L04089J70540k63259J95384m2183j27518J34016
$$ 405929 359198 523850 315166 619255 789795 526536 721920 679737 552219 686235
14411F86235J11132M9782J37429K50641k2578j78290k20420R2380m8213k73654
$$ 686235 797367 847149 984578 1235219 1212641 1034351 813931 906311 858098 584444
14401E84444K8656k39843m02680Q3891K18527k08821p8106J66276L14371q817
$$ 584444 613100 373257 -29423 54468 272995 64174 -13932 152344 466715 457898
14391D57898n6042P3023J11251J42241J10954j11623k14176j87987j11130O5557
$$ 457898 401856 474879 586130 728371 839325 727702 513526 325539 214409 279966
14381B79966J01009j16522m2474P4269o2786k32804r1759J89114K62514N8385
$$ 279966 380975 264453 221979 296248 233462 658 -91101 98013 360527 418912
14371D18912k08051r5106Q9124K3594j88801l12352L36693L58090J1256J86431
$$ 418912 210861 115755 204879 228473 39672 -272680 64013 422103 433359 619790
14361F19790r1523l02076L9627m3154R6034O8599k15439j97087P5495N0805K01728
$$ 619790 528267 226191 265818 222664 318698 387297 171858 -25229 50266 101071 302799
14350C02799K4546k34448k48898L3120Q5180K13596J507j39699K02640J9780K91532
$$ 302799 327345 92897 -156001 -122881 -37701 175895 177402 37703 240343 260123 551655
14339E51655N0469j73664k99492m24903M2462J83660Q3430Q0583N976L93249l8685
$$ 551655 602124 428460 128968 -295935 -253473 -69813 13617 94200 100176 493425 454740
14328D54740k15872r3494k73464k86651l3167K9838R8270L10027K00546J61453
$$ 454740 238868 145374 -128090 -414741 -447908 -418070 -319800 -9773 190773 352226
14318C52226J39265p9532p9106j32929R8733K44331r5375j27324m4007O7110k91357
$$ 352226 491491 411959 332853 199924 298657 542988 447613 320289 276282 343392 52035
14307E2035m58318K840J44220J14851L09147M12861q6402J66112o1957P9873M5027
$$ 52035 -406283 -403443 -259223 -144372 164775 577636 491234 657346 595389 675262 720289
14296G20289l81730o1299J58764P1970n90563j20946O6475J49302r474j2874O551
$$ 720289 338559 277260 436024 507994 -82569 -203515 -137040 12262 2788 -10086 -3535
14285c535k6487M8514J82349Q4557J14994m6743m5244j84780k60844p3522J25846
$$ -3535 -30022 18492 200841 285398 400392 353649 308405 123625 -137219 -210741 -84895
14274h4895r693L56976K53896K86462O4112l42758P0914R0662J47998O6123K04980
$$ -84895 -94588 262388 516284 802746 866858 524100 595014 685676 833674 899797 1104777
14263A104777j8200l15069L3530n221j29565R9407M4053k71790J67615Q4673j52754
$$ 1104777 1086577 771508 805038 799817 670252 769659 813712 541922 709537 794210 641456
14252F41456l03681K84926L79154J23928j52648l24280j68026N9753k21357j11809
$$ 641456 337775 622701 1001855 1125783 973135 648855 480829 540582 319225 207416
14242B07416K43898L6593j41660R9844Q7247J93855k30550k33324j66347m9587
$$ 207416 451314 487907 346247 446091 533338 727193 496643 263319 96972 47385
14232D7385j76730j48091K48786L43196o8500o5156m06389j16315J49808J32194
$$ 47385 -129345 -277436 -28650 314546 246046 180890 -225499 -341814 -192006 -59812
14222e9812L45071K98845k65029k03175N2083R4962j06448o7863L16975K87236
$$ -59812 285259 584104 319075 115900 167983 262945 156497 88634 405609 692845
14212F92845J1250n74958j07606K62541k8546k02473J7542M45116J14933j59635
$$ 692845 704095 129137 21531 284072 255526 53053 70595 515711 630644 471009
14202D71009j54822r9133j26411j95886q0735J90424K42613O89q9344l3680j93225
$$ 471009 316187 217054 90643 -105243 -185978 4446 247059 247748 158404 124724 -68501
14191f8501O6416K44422K68473O6656r6333J42681N5514j46476k21209k11003
$$ -68501 -2085 242337 510810 577466 481133 623814 679328 532852 311643 100640
14181A00640P3080J64403K6473Q7078K54224J41941m1864m97674k62000J89996
$$ 100640 173720 338123 364596 451674 705898 847839 805975 308301 46301 236297
14171B36297J04517N8360J27542J37559M8671P1623o9999l42322p779j19660K8824
$$ 236297 340814 399174 526716 664275 712946 784569 714570 372248 364469 244809 273633
14160B73633j22645K59159J43589J30334L40280j2113J34047K16750K19622L3503
$$ 273633 150988 410147 553736 684070 1024350 1012237 1146284 1363034 1582656 1616159
14150A616159l57011j25310j74933k01163L59019L25150P7736M365J13136P9023
$$ 1616159 1259148 1133838 958905 757742 1116761 1441911 1519647 1524012 1637148 1716171
14140A716171k65936k5024J62291J27969J76310R7827K13374P0413J69568J94925
$$ 1716171 1450235 1425211 1587502 1715471 1891781 1989608 2202982 2273395 2442963 2637888
14130B637888j58070n32228k59489o7446k81586o1984J08122l32529m27547K17712
$$ 2637888 2479818 1947590 1688101 1620655 1339069 1277085 1385207 1052678 625131 842843
14120H42843J30702K65956j55083p8900J4047j01631l1749q8015j13630L42231
$$ 842843 973545 1239501 1084418 1005518 1019565 917934 886185 798170 684540 1026771
14110A026771L48506n1248O3201o4785J23106L02880j36951k14568j7619L45936
$$ 1026771 1375277 1324029 1387230 1322445 1445551 1748431 1611480 1396912 1379293 1725229
14100A725229K69261L51332j59366m15588l4925K15398J46101J84458M63029m0172
$$ 1725229 1994490 2345822 2186456 1770868 1735943 1951341 2097442 2281900 2744929 2704757
14090B704757j28020K3096K31742k68225J30126J35735N8786J1638m05009k45534
$$ 2704757 2576737 2599833 2831575 2563350 2693476 2829211 2887997 2899635 2494626 2249092
14080B249092J76598N37771K33966k49722j90004N2009J41194M05405L7140j27713
$$ 2249092 2425690 2963461 3197427 2947705 2757701 2809710 2950904 3356309 3393449 3265736
14070C265736L01939L40585K87214O3668K41655J21815P4719J98981K67369J48316
$$ 3265736 3567675 3908260 4195474 4259142 4500797 4622612 4697331 4896312 5163681 5311997
14060E311997Q1746K89319K50284L31737J04603K79995J61454J58168L37366k8083
$$ 5311997 5393743 5683062 5933346 6265083 6369686 6649681 6811135 6969303 7306669 7278586
14050G278586K29415L47595K09263K20941O91531Q47926L00946L08548P83924
$$ 7278586 7508001 7855596 8064859 8285800 8977331 9825257 10126203 10434751 11218675
14041A1218675P46216N18295O78440O89615O83940R68553J061948J087554J199496
$$ 11218675 11964891 12483186 13161626 13851241 14535181 15503734 16565682 17653236 18852732
14032A8852732J353506J912199J955791K216093K097713K435808L143395L985335
$$ 18852732 20206238 22118437 24074228 26290321 28388034 30823842 33967237 37952572
14024C7952572M193935M807986N613443O539840Q043440R379635J1111263J3158330
$$ 37952572 42146507 46954493 52567936 59107776 67151216 76530851 87642114 100800444
14016A00800444J5484635J7894107K1952642K5194463K8803162L2446855L4748124
$$ 100800444 116285079 134179186 156131828 181326291 210129453 242576308 277324432
14009B77324432L6068606L5423436L2925993K7482997J9461473J0039761K36769
$$ 277324432 313393038 348816474 381742467 409225464 428686937 438726698 438963467
14002D38963467r823323j9170320k6449998l2134934l4840662l5311917l4108583
$$ 438963467 429140144 409969824 383519826 351384892 316544230 281232313 247123730
13995B47123730l0960365k7020867k2645116j8759849j5328363j2656392j0218954
$$ 247123730 216163365 189142498 166497382 147737533 132409170 119752778 109533824
13988A09533824q387647p344078o654010n444522m349549l857855l510797k877245
$$ 109533824 101146177 93802099 87148089 81703567 77354018 73496163 69985366 67108121
13980F7108121k916662k897942k270270k323375k329121k051560k394832k366367
$$ 67108121 64191459 61293517 59023247 56699872 54370751 52319191 49924359 47557992
13972D7557992k123955j776902j945550k230377k423770k015963j804465j990787
$$ 47557992 45434037 43657135 41711585 39481208 37057438 35041475 33237010 31246223
13964C1246223j996163j623152j625698j332056j062306j052671r92593j201966
$$ 31246223 29250060 27626908 26001210 24669154 23606848 22554177 21561584 20359618
13956B0359618j088249p53032r97224r78487j070314q69280p56007l09005k47257
$$ 20359618 19271369 18518337 17521113 16542626 15472312 14603032 13847025 13538020 13290763
13947A3290763n48825n15863p53685p01891m73181m32872o20883k16669j0895
$$ 13290763 12741938 12226075 11472390 10770499 10297318 9864446 9243563 9026894 9015999
13938I015999m03603m66160p51985m85485Q2568k47998O4936J77619l10060j17324
$$ 9015999 8612396 8146236 7394251 6908766 6991334 6743336 6808272 6985891 6675831 6558507
13928F558507k73275k73050k91234k93600j83098k42247p13575j30628J49015
$$ 6558507 6285232 6012182 5720948 5427348 5244250 5002003 4288428 4157800 4306815
13919D306815n67772l24876L7460l09611Q5431r0105N9408J35075j23903k67871
$$ 4306815 3739043 3414167 3451627 3142016 3227447 3137342 3196750 3331825 3207922 2940051
13909B940051K2334O4467r530k32619o1051K0431k0415j20267n685p4250m2796
$$ 2940051 2962385 3026852 3017322 2784703 2723652 2744083 2723668 2603401 2597716 2523466 2480670
13898B480670j92305K01146j18337r1343K43292n2016K61912K27004k71196k63541
$$ 2480670 2288365 2489511 2371174 2279831 2523123 2471107 2733019 2960023 2688827 2425286
13888B425286j00039N3836o4682j31509j48865P949q9162r6374j10487o6654R2371
$$ 2425286 2325247 2379083 2314401 2182892 2034027 2041976 1952814 1856440 1745953 1679299 1771670
13877A771670j63464j43152q4547k32922l9514j74262J78300K18981q9965Q7936
$$ 1771670 1608206 1465054 1380507 1147585 1108071 933809 1112109 1331090 1241125 1329061
13867A329061J40477j53270j46931l32478j98123O3638j86825n735L47422Q6340
$$ 1329061 1469538 1316268 1169337 836859 638736 702374 515549 509814 857236 943576
13857I43576m5450k46892l09820J18301K22784R4051J15681N5336j75517K1954
$$ 943576 898126 651234 341414 459715 682499 776550 892231 947567 772050 794004
13847G94004l40724J27961J30092J50824L487k42573l46198R7134M3999j0639
$$ 794004 453280 581241 711333 862157 865644 623071 276873 374007 418006 407367
13837D07367p5164L77865N182j59428L52879r6295J32510k55842L727K57901m6288
$$ 407367 332203 710068 715250 555822 908701 812406 944916 689074 692801 950702 904414
13826I04414j10823K42771n9868p7695j59700l8205P7547l30530l83600L55171
$$ 904414 793591 1036362 976494 898799 739099 700894 778441 447911 64311 419482
13816D19482J11245J49218M5790J93738M3770k55343o6421J71061j82404J52663
$$ 419482 530727 679945 725735 919473 963243 707900 641479 812540 630136 782799
13806G82799K4417n5647o0658l15267j17748p2291j52066L2784L42298J64909
$$ 782799 807216 751569 690911 375644 257896 185605 33539 66323 408621 573530
13796E73530m5254J18304M95983j60797O6175k19493k49551j45800J06746K5744
$$ 573530 528276 646580 1142563 981766 1047941 828448 578897 433097 539843 565587
13786E65587k75540R4014J3651J51498j60868k44439k8454j08314p9828J3071
$$ 565587 290047 384061 397712 549210 388342 143903 115449 7135 -72693 -59622
13776e9622p3068K13613M19084K72056L2800l33997k54056K71869j53438j30530
$$ -59622 -132690 80923 500007 772063 804863 470866 216810 488679 335241 204711
13766B04711N3427o2756J42748L02569k4039K05805J63101j70879k92169k68754
$$ 204711 258138 195382 338130 640699 616660 822465 985566 814687 522518 253764
13756B53764J5565M0901L07676J95907o7986L9363K5904Q4468O7626k98587l89296
$$ 253764 269329 310230 617906 813813 745827 785190 811094 895562 963188 664601 275305
13745B75305l70378Q9550j53968K7905p0616k28715J33542r6577m3533L75904
$$ 275305 -95073 -5523 -159491 -131586 -202202 -430917 -297375 -393952 -437485 -61581
13735f1581M2890J58537j26198k64837n618P3882L39708M81444j06368J50186
$$ -61581 -18691 139846 13648 -251189 -256807 -182925 156783 638227 531859 682045
13725F82045K00378j02372j35365p3150j29354J232k37826k16578J62201K43228
$$ 682045 882423 780051 644686 571536 442182 443414 205588 -10990 151211 394439
13715C94439j25036J68247j36609k87336j34922J18006k53073J43159M66281L20097
$$ 394439 269403 437650 301041 13705 -121217 -3211 -256284 -113125 353156 673253
13705F73253K66370J62907J25928j04615k75426R4201k20017m7862k53248m0868
$$ 673253 939623 1102530 1228458 1123843 848417 942618 722601 674739 421491 380623
13695C80623J6480m21304l44245L93606J34275j86324n4412J86614O7402J06804
$$ 380623 397103 -24201 -368446 25160 159435 -26889 -81301 105313 172715 279519
13685B79519J68080k29595l26002m0783K49111J61626m17326j86500L99601L04419
$$ 279519 447599 218004 -107998 -148781 100330 261956 -155370 -341870 57731 362150
13675C62150K49830L6605O6953J42947O6756k73598k64285j66999K1875j95337
$$ 362150 611980 648585 715538 858485 925241 651643 387358 220359 242234 46897
13665D6897J0277Q8903j15625P1036L71721J84168K1984j37297j41422l87459
$$ 46897 57174 146077 30452 101488 473209 657377 679361 542064 400642 13183
13655A3183k72521k21919n7664L15042K72839J86059J49257K55720J30465J52381
$$ 13183 -259338 -481257 -538921 -223879 48960 235019 384276 639996 770461 922842
13645I22842l03225k0091p6492j84742k8079j23289M6511k78161R8316k11347
$$ 922842 619617 599526 523034 338292 310213 186924 233435 -44726 53590 -157757
13635a57757k67718K69165L22528K91720M3952j30051r0188K46940L3028Q5446
$$ -157757 -425475 -156310 166218 457938 501890 371839 281651 528591 561619 647065
13625F47065k1674m4485L79838K25275j34936m6403P8133j5034j12106K05873
$$ 647065 625391 580906 960744 1186019 1051083 1004680 1082813 1067779 955673 1161546
13615A161546J56089K71901k91437k05439j95334m29556n2345L18099K70772M5467
$$ 1161546 1317635 1589536 1298099 1092660 897326 467770 415425 733524 1004296 1049763
13605A049763l02399j74577k27716q3247J47065P9292J8062k53860r5634K4845
$$ 1049763 747364 572787 345071 261824 408889 488181 506243 252383 156749 181594
13595A81594O6370n9335J78355K05771p6969j69809J20182r7358K27960L67661
$$ 181594 247964 188629 366984 572755 495786 325977 446159 348801 576761 944422
13585I44422M58085L62102N71674J9012k26047k3470l47822m04962j01206l07312
$$ 944422 1402507 1764609 2336283 2355295 2129248 2105778 1757956 1352994 1251788 944476
13575I44476Q6726m936J05658m7790j80854J49473J3328k6056q1161o21865K12118
$$ 944476 1031202 1026266 1131924 1084134 903280 1052753 1066081 1040025 958864 336999 549117
13564E49117J36487L14588K71409p3685j57323K33937o545N68073M42289J70935
$$ 549117 685604 1000192 1271601 1197916 1040593 1274530 1267985 1836058 2278347 2449282
13554B449282q7976M59813M64113l42499k45579J09835K44795K69353K27176j58248
$$ 2449282 2361306 2821119 3285232 2942733 2697154 2806989 3051784 3321137 3548313 3390065
13544C390065m43839m03602m00952m15655j63074j85985N9063q2985j19569q8562
$$ 3390065 2946226 2542624 2141672 1726017 1562943 1376958 1436021 1353036 1233467 1144905
13534A144905o7429n053J01959k73690J89703J52528l37248n9750R259P0598l746
$$ 1144905 1077476 1072423 1174382 900692 1090395 1242923 905675 845925 855184 925782 922036
13523I22036k09405j53111j8741n7340K05225P7895m308j68366p4964J03588j21829
$$ 922036 712631 559520 540779 483439 688664 766559 762251 593885 518921 622509 500680
13512E00680j34735j15002k29295k50509K50308J76205j06538J08801j8011j29251
$$ 500680 365945 250943 21648 -228861 21447 197652 91114 199915 181904 52653
13502E2653J22850K2336k63930M8037J5359J4002L3831k29530K14197M53032J43903
$$ 52653 175503 197839 -66091 -18054 -2695 11307 45138 -184392 29805 482837 626740
13491F26740l08423m6419j41062l80577n7515o3267J65937J13563L34286p8565
$$ 626740 318317 271898 130836 -249741 -307256 -370523 -204586 -91023 243263 164698
13481A64698k1929j31241j29792K79008p7923N0258R1625K1349p3672L18471R2972
$$ 164698 142769 11528 -118264 160744 82821 133079 224704 246053 172381 490852 583824
13470E83824q7156r1487m6601J88849L6202k37762L0519K81027l10147l21112
$$ 583824 496668 405181 358580 547429 583631 345869 376388 657415 347268 26156
13460B6156l0951r6819j85764K88624K32328O1639O2151k09279j81809n359J63452
$$ 26156 -4795 -101614 -287378 1246 233574 295213 357364 148085 -33724 -39083 124369
13449A24369m9814n08140l11509K89743J50315J11197K55562k56629J58744L46047
$$ 124369 74555 -433585 -745094 -455351 -305036 -193839 61723 -194906 -36162 309885
13439C09885N45636N0235l2864m95459k83657p0664j26640r8857j17298M3480
$$ 309885 855521 905756 872892 377433 93776 23112 -103528 -202385 -319683 -276203
13429b76203L51756K74795Q7405j61278K11994K71545m8271m3568j59263k82945
$$ -276203 75553 350348 437753 276475 488469 760014 711743 668175 508912 225967
13419B25967l34526L4469R3504J43052J25494J40514k85309k82886j37643K36509
$$ 225967 -108559 -74090 19414 162466 287960 428474 143165 -139721 -277364 -40855
13409d0855M19274k31175J12433k42640k24617N7348K46912P5307k84969m7511
$$ -40855 378419 147244 259677 17037 -207580 -150232 96680 171987 -112982 -160493
13399a60493K03290K58697N72439j3809j39175m0518l24353N5582K64803Q8149
$$ -160493 42797 301494 873933 860124 720949 680431 356078 411660 676463 764612
13389G64612j42295k34219q8092J79171j38260l95249j1506K41926L90872O3174
$$ 764612 622317 388098 300006 479177 340917 -54332 -65838 176088 566960 630134
13379F30134J49674j48642p8690l72848l4781Q5243J89807M1200l2295o522j64120
$$ 630134 779808 631166 552476 179628 144847 230090 419897 461097 428802 422280 258160
13368B58160j80374R3385l2260j28997R0368j8320o484l3961j18710j89738o9755
$$ 258160 77786 171171 138911 9914 100282 81962 75478 41517 -77193 -266931 -336686
13357c36686K79434J58550J8481K69556K39505l47103k1950j42737j05818O2133
$$ -336686 -57252 101298 119779 389335 628840 281737 259787 117050 11232 73365
13347G3365J20729r0380L42127R3763k26258N0989O6437J31612k12267n35457
$$ 73365 194094 103714 445841 539604 313346 364335 430772 562384 350117 -185340
13337a85340N6557L15691J10374j62578Q4775J79667k1677k60814j29571n785
$$ -185340 -128783 186908 297282 134704 219479 399146 377469 116655 -12916 -18701
13327a8701J91949O3069j30600L17630m8708L3652p9694P6276J6101o0291q726
$$ -18701 173248 236317 105717 423347 374639 408291 328597 404873 420974 360683 351957
13316C51957Q1257J80986j93490K21838j554K19477n0286O2504r1783J35876j40863
$$ 351957 433214 614200 420710 642548 640994 860471 810185 872689 780906 916782 775919
13305G75919k28549o635M09697K65083j5237n53499k43653N5165L50095J69269
$$ 775919 547370 540735 950432 1215515 1200278 646779 403126 458291 808386 977655
13295I77655P7903J65636l45461j80568q8833n732j37293l29620m41887R5534
$$ 977655 1055558 1221194 875733 695165 606332 600600 463307 133687 -308200 -212666
13285b12666N78621M92787j64837r0009J3174M7836J95010L5120l2137r6041J28283
$$ -212666 365955 858742 693905 603896 617070 664906 859916 895036 862899 766858 895141
13274H95141L06843k57356m9568k10599J17713R9506j18761r1364J22142L79056
$$ 895141 1201984 944628 895060 684461 802174 901680 782919 691555 813697 1192753
13264A192753M8620M09873J23394K57899K97091k23012k94852k47965r1885j91668
$$ 1192753 1241373 1651246 1774640 2032539 2329630 2106618 1811766 1563801 1471916 1280248
13254A280248m9479n7559k18387m19623K0565O0766l4475L16851J33623o5432
$$ 1280248 1230769 1173210 954823 535200 555765 616531 582056 898907 1032530 967098
13244I67098k05385m7645Q5029L24650J65459n5318J04748r6075J34127L89636
$$ 967098 761713 714068 799097 1123747 1289206 1233888 1338636 1242561 1376688 1766324
13234A766324N3264m3021R6713J51688j51819j15903L63995L61287p8147k0623
$$ 1766324 1819588 1776567 1873280 2024968 1873149 1757246 2121241 2482528 2404381 2383758
13224B383758J9619k16205j23413K3872j81138o4738j0339J13288R0198m0256
$$ 2383758 2403377 2187172 2063759 2087631 1906493 1841755 1831416 1944704 2034902 1994646
13214A994646K61339J94464n63534k76229J52096L66309J961L86609L65190K3846
$$ 1994646 2255985 2450449 1886915 1610686 1762782 2129091 2131052 2517661 2882851 2906697
13204B906697j01748K00753J98230J22582J67920N14065N34965j6341J16846M62922
$$ 2906697 2804949 3005702 3203932 3326514 3494434 4008499 4543464 4527123 4643969 5106891
13194E106891L02235J16673L92579J98861M43108Q09582R50463R80182J059964
$$ 5106891 5409126 5525799 5918378 6117239 6560347 7369929 8320392 9300574 10360538
13185A0360538J055441J332598J719697K212868K613631L426338M490770N630515
$$ 10360538 11415979 12748577 14468274 16681142 19294773 22721111 27211881 32842396
13177C2842396P594526R048223J1479934J4237212J7745338K1195135K3483148
$$ 32842396 40436922 49485145 60965079 75202291 92947629 114142764 137625912
13170A37625912K2389134J6141895M425382r845536k2295266k7182701k4665283
$$ 137625912 160015046 176156941 180582323 170736787 148441521 121258820 96593537
13163I6593537j8788384j3339596q980222o395673m081581l327899k204951j229355
$$ 96593537 77805153 64465557 55485335 49089662 45008081 41680182 39475231 38245876
13155C8245876p68332p74245p87960m3550K08884O26267J189312J654246L108928
$$ 38245876 37477544 36703299 35915339 35871789 36080673 36706940 37896252 39550498 42659426
13146D2659426L763078N005507O477377Q276811J0540436J2918518J6529133K1614920
$$ 42659426 46422504 51428011 57905388 66182199 76722635 89641153 106170286 127785206
13138A27785206K7092877L4305472M2069490M7993378M7826187L6858969J4069499
$$ 127785206 154878083 189183555 231253045 279246423 327072610 363931579 378001078
13131C78001078j6557316m4400796n8852623n6371274m4697489l1267438k1481435
$$ 378001078 361443762 317042966 258190343 201819069 157121580 125854142 104372707
13124A04372707j5114224j0809741q120716o273151n045008m095766l132571k153894
$$ 104372707 89258483 78448742 70328026 64054875 59009867 54914101 51781530 49627636
13116D9627636j264101o17130l62237K14704J181706J728699J941193J986466
$$ 49627636 48363535 47746405 47384168 47598872 48780578 50509277 52450470 54436936
13108E4436936K419694L343516M222215N386719P360363R558895J2037697J5465727
$$ 54436936 56856630 60200146 64422361 69809080 77169443 86728338 98766035 114231762
13100A14231762J9770071K2572400K2916696J8235008P432622p089725k1627227
$$ 114231762 134001833 156574233 179490929 197725937 205158559 198068834 176441607
13093A76441607k9933974k9844984k4091335j7291367j2342678q988947o658147
$$ 176441607 146507633 116662649 92571314 75279947 62937269 53948322 47290175
13086D7290175m760843l932766l594881l008538k440904j739330j687442j769206
$$ 47290175 42529332 38596566 35001685 31993147 29552243 27812913 26125471 24356265
13078B4356265j251130r62397q80334o30499o45393n07098l00785k45257n37037
$$ 24356265 23105135 22142738 21262404 20631905 19986512 19479414 19178629 18933372 18396335
13069A8396335o63405p48568n79270m28534o76418q19641q79272j057263r16805
$$ 18396335 17732930 16984362 16405092 15976558 15300140 14480499 13601227 12543964 11627159
13060A1627159o24823m91832m08005n55829k72969m35399p55798m00369j85738
$$ 11627159 11002336 10510504 10102499 9546670 9273701 8838302 8082504 7682135 7496397
13051G496397n76875m76027m25715j92612j18957j20611j19256m25134n45693
$$ 7496397 6919522 6443495 6017780 5825168 5706211 5585600 5466344 5041210 4495517
13042D495517o27251j9674q4948J20353j06607k11641l34315l75610K5579Q5171
$$ 4495517 3868266 3848592 3763644 3883997 3777390 3565749 3231434 2855824 2881403 2966574
13032B966574j21302j08925l75317j45382J21217O4093K64854O2758j00251j20697
$$ 2966574 2845272 2736347 2361030 2215648 2336865 2400958 2665812 2728570 2628319 2507622
13022B507622J51314p6333k0580J80815P5030l357j4829J03840j9904L5699j99260
$$ 2507622 2658936 2582603 2562023 2742838 2817868 2814511 2799682 2903522 2883618 2919317 2720057
13011B720057m26015j65124Q9385r366k87949J45137j5390k77720n2502N40846
$$ 2720057 2294042 2128918 2218303 2208937 1920988 2066125 2050735 1773015 1720513 2261359
13001B261359M74179K38382m0581m79567n72646j31602j95169J23213J44438n8255
$$ 2261359 2735538 2973920 2933339 2453772 1881126 1749524 1554355 1677568 1822006 1763751
12991A763751O9628j37214k07129J34482Q1002n1420N52149n790k67889J83727
$$ 1763751 1833379 1696165 1489036 1623518 1704520 1653100 2205249 2199459 1931570 2115297
12981B115297L12856j00139k46363J81117O26158M97872M2916m1622j17848j73443
$$ 2115297 2428153 2328014 2081651 2262768 2888926 3386798 3429714 3388092 3270244 3096801
12971C096801K19794M3145j21293j23436m31705m2808j80445k68848J52728J18225
$$ 3096801 3316595 3359740 3238447 3115011 2683306 2640498 2460053 2191205 2343933 2462158
12961B462158m7531j50770k8075k97987j35341M12981L54620m01750l67457N3909
$$ 2462158 2414627 2263857 2235782 1937795 1802454 2215435 2570055 2168305 1800848 1854757
12951A854757j13623k10907R182K70408J74828j63398J44135M88212J85017K87292
$$ 1854757 1741134 1530227 1539409 1809817 1984645 1821247 1965382 2453594 2638611 2925903
12941B925903j20291k99469P3035o51363l63636Q7388J00960J82124l67177k49535
$$ 2925903 2805612 2506143 2579178 1927815 1564179 1651567 1752527 1934651 1567474 1317939
12931A317939l52711j79606K87836K09463j64956l07129J40665K10792J52951
$$ 1317939 965228 785622 1073458 1282921 1117965 810836 951501 1162293 1315244
12922A315244r9963o76958l55757K72844K53197K65546M0348Q5260j70549m25383
$$ 1315244 1215281 538323 182566 455410 708607 974153 1014501 1099761 929212 503829
12912E03829O632J57470K49473j7902k57755k83786O0894K77495k01822J66850
$$ 503829 510461 667931 917404 899502 641747 357961 418855 696350 494528 661378
12902F61378j05861k82375R7786J24929l71002k0496J00770L01921j02371Q9786
$$ 661378 555517 273142 370928 495857 124855 104359 205129 507050 404679 494465
12892D94465J96146L8856J38406O6607j93444O6859q0521k61177j36496j30145
$$ 494465 690611 729467 867873 934480 741036 807895 727374 466197 329701 199556
12882A99556K22151j16853j61672j0625q6703k65117J23701O14751K79861o5616
$$ 199556 421707 304854 143182 132557 45854 -219263 -95562 519189 799050 733434
12872G33434j01875q6657n71694j07886P1335L33244K40729l66770j68195K07402
$$ 733434 631559 544902 -26792 -134678 -63343 269901 510630 143860 -24335 183067
12862A83067p3014L77793J1108k88173j09281M12761J48104j38368k79515l98234
$$ 183067 110053 487846 498954 210781 101500 514261 662365 523997 244482 -153752
12852a53752j91097L42629L04061L58004K71474j01942j13589l8021k42701o5624
$$ -153752 -344849 -2220 301841 659845 931319 829377 715788 677767 435066 369442
12842C69442k76039j70117L23574o4195j95462j69173K05066P8374J45844j854
$$ 369442 93403 -76714 246860 182665 -12797 -181970 23096 101470 247314 245460
12832B45460k25008J04831j2033J66124J61707K51544R9347l31127j56195J42357
$$ 245460 20452 125283 113250 279374 441081 692625 791972 460845 304650 447007
12822D47007Q1544l94657k14320K23885m3427J7606K06921K0907o7979M0637L79695
$$ 447007 528551 133894 -80426 143459 100032 117638 324559 345466 277487 318124 697819
12811F97819p726Q5589K16655j7382K13855k4321m73535m64836j12247Q8195r3279
$$ 697819 690093 775682 992337 974955 1188810 1164489 690954 226118 113871 202066 108787
12800A08787j33916Q3362J51910K57427j80660j5233L82547L57493j97111J97009
$$ 108787 -25129 58233 210143 467570 286910 271677 654224 1011717 814606 1011615
12790A011615j33523k56514K3536k43826l9369J53325M2315P4853K29035L95556
$$ 1011615 878092 621578 645114 401288 361919 515244 557559 632412 861447 1257003
12780A257003R7828k97050j56614Q0571O8601j10743k82264J99082q8235L7650
$$ 1257003 1354831 1057781 901167 981738 1050339 939596 657332 856414 768179 805829
12770H05829J6459j17213j60369P4111L52535M75220k33931j31081k15970o9229
$$ 805829 822288 705075 544706 618817 971352 1446572 1212641 1081560 865590 796361
12760G96361N145N649P0511m5554J55363n1008m15054p4891L06761J33870P6680
$$ 796361 801506 807155 877666 832112 987475 936467 521413 446522 753283 887153 963833
12749I63833j51575k62155q7929p9482P7635J84087n7999k5369R7362j61388l3285
$$ 963833 812258 550103 462174 382692 460327 644414 586415 561046 658408 497020 463735
12738D63735l2337j53753K08275M9386K3608j90178P866L99290J40404m21406
$$ 463735 431398 277645 485920 535306 558914 368736 376602 775892 916296 494890
12728D94890k9849K89347J9233J51584j32070J69537K35804j60953J27834K44410
$$ 494890 465041 754388 773621 925205 793135 962672 1198476 1037523 1165357 1409767
12718A409767j42950j27077k20206J54621N67374j03961L9621M4979k78074J34249
$$ 1409767 1266817 1139740 919534 1074155 1641529 1537568 1577189 1622168 1344094 1478343
12708A478343K55540Q6226l46967l06001J29313Q7533K85516l5887r7959L28834
$$ 1478343 1733883 1820109 1473142 1167141 1296454 1383987 1669503 1633616 1535657 1864491
12698A864491j33330J88860K08221j4560N6616l96786J1155N7960J16048J47805
$$ 1864491 1731161 1920021 2128242 2113682 2170298 1773512 1784667 1842627 1958675 2106480
12688B106480K33488k64053l8172N9333K84833K72196M95992J83710o4651J40829
$$ 2106480 2339968 2075915 2037743 2097076 2381909 2654105 3150097 3333807 3269156 3409985
12678C409985L56380m7938j2163J03245j12643l75188j46716k12712k34786J12009
$$ 3409985 3766365 3718427 3706264 3809509 3696866 3321678 3174962 2962250 2727464 2839473
12668B839473j78145N0926O06947P949l79348k60811p4358P0399K82452J76383
$$ 2839473 2661328 2712254 3319201 3327150 2947802 2686991 2612633 2683032 2965484 3141867
12658C141867J7453j68374K0947K26077J36849n9579k00096k61837k71439k37219
$$ 3141867 3159320 2990946 3011893 3237970 3374819 3315240 3115144 2853307 2581868 2344649
12648B344649r8244J06038J06993K84543M10594Q7495j19785J20311J91845j72209
$$ 2344649 2246405 2352443 2459436 2743979 3154573 3242068 3122283 3242594 3434439 3262230
12638C262230j3275K2070J12003P2481k92419n70630l24584N0148j28558j87329
$$ 3262230 3248955 3271025 3383028 3455509 3163090 2592460 2267876 2318024 2189466 2002137
12628B002137K40434J97462N00023J34506N5729L36082J83281K13663J41033k3000
$$ 2002137 2242571 2440033 2940056 3074562 3130291 3466373 3649654 3863317 4004350 3981350
12618C981350o5982M9294k37863k93195m2189P224J70473L1342r8668r3591J31325
$$ 3981350 3915368 3964662 3726799 3433604 3391415 3398639 3569112 3600454 3501786 3408195 3539520
12607C539520k6712O852k4533J77641L49048P37137K12415L9582k3297r9467L4819
$$ 3539520 3512808 3519660 3495127 3672768 4021816 4758953 4971368 5010950 4987653 4888186 4923005
12596D923005K39729K01995J77637K13329o2061K65069N25415L12336J01458j15283
$$ 4923005 5162734 5364729 5542366 5755695 5693634 5958703 6484118 6796454 6897912 6782629
12586F782629L64490M81253M84364L83795L26667O58176N57843N40456P23852
$$ 6782629 7147119 7628372 8112736 8496531 8823198 9481374 10039217 10579673 11303525
12577A1303525R59199P25766M70160J198584J100071J389992J598192J961721
$$ 11303525 12262724 12988490 13458650 14657234 15757305 17147297 18745489 20707210
12569B0707210K433051L086636K998530L471196M541912N509157O598473Q079401
$$ 20707210 23140261 26226897 29225427 32696623 37238535 42747692 49346165 57425566
12561E7425566J0400005J3367723J7010880K0711499K5089351L0607578L5824389
$$ 57425566 67825571 81193294 98204174 118915673 144005024 174612602 210436991
12554B10436991L8892587L7819587L0607288J5689563l768654k2701625l5068475
$$ 210436991 249329578 287149165 317756453 333446016 329677362 306975737 271907262
12547B71907262l7494606l2957452k5225835j7291545j0893146n776709j843090
$$ 271907262 234412656 201455204 176229369 158937824 148044678 142267969 140424879
12540A40424879K284886N865203Q444865J0478490J2371864J4312650J5531503
$$ 140424879 142709765 148574968 157019833 167498323 179870187 194182837 209714340
12533B09714340J6348619J6240656J6263279J6340333J6585196J6507098J6098526
$$ 209714340 226062959 242303615 258566894 274907227 291492423 307999521 324098047
12526C24098047J5515747J4381390J1564191P854666L884391o43581n616091r851609
$$ 324098047 339613794 353995184 365559375 373414041 377298432 376654851 371038760 361187151
12518C61187151j1975898j3914296j4481831j4110927j3265439j2752442j2212879
$$ 361187151 349211253 335296957 320815126 306704199 293438760 280686318 268473439
12511B68473439j1907706j1807297j1594723j1634595j1260557j0481999q756837
$$ 268473439 256565733 244758436 233163713 221529118 210268561 199786562 191029725
12504A91029725o409981l752361l28579L315293P407067J2094349J7236068K2292424
$$ 191029725 184619744 180867383 180538804 183854097 191261164 203355513 220591581 242884005
12496B42884005K7628034L1988099L2846257K8330678J7661760O23700j9451610
$$ 242884005 270512039 302500138 335346395 363677073 381338833 381962533 362510923
12489C62510923l6484029m5303907m4783468l8639917l0570471k3702305j7860385
$$ 362510923 326026894 280722987 235939519 197299602 166729131 143026826 125166441
12482A25166441j3741299j1031023r267595o974025n725521m933724m278556l587164
$$ 125166441 111425142 100394119 91126524 84152499 78426978 73493254 69214698 65627534
12474F5627534l244090k880354k337096k094193j914051j541288j620204j240343
$$ 65627534 62383444 59503090 57165994 55071801 53157750 51616462 49996258 48755915
12466D8755915j273777j658695j896428k419852k499931k179530j614404j617114
$$ 48755915 47482138 45823443 43927015 41507163 39007232 36827702 35213298 33596184
12458C3596184j541072j674337j670403j531103j365902j337946j187424r87133
$$ 33596184 32055112 30380775 28710372 27179269 25813367 24475421 23287997 22300864
12450B2300864p12189j012068j404955j123028p56150o40044p48902p93638p76940
$$ 22300864 21588675 20576607 19171652 18048624 17292474 16652430 15903528 15109890 14332950
12441A4332950p61708m96689l65737o48351j67714Q4222l53110l90933n22003
$$ 14332950 13571242 13074553 12708816 12060465 11892751 11976973 11623863 11232930 10710927
12432A0710927k49671m06674l34967m52886l65099k96350m10334k43810l17676
$$ 10710927 10461256 10054582 9719615 9266729 8901630 8605280 8194946 7951136 7633460
12423G633460m12122l75890m21358J9474l25335m91711m8261m4459k93659j08565
$$ 7633460 7221338 6845448 6424090 6443564 6118229 5626518 5578257 5533798 5240139 5131574
12413E131574j17610L27511o8990l64535l02198J05230L22815K52118r4836k48548
$$ 5131574 5013964 5341475 5272485 4907950 4605752 4710982 5033797 5285915 5191079 4942531
12403D942531k22612j87199q4090k42925k80410r3728j23622p6749J1989j37885
$$ 4942531 4719919 4532720 4448630 4205705 3925295 3831567 3707945 3631196 3643185 3505300
12393C505300n3604Q5726j1533j12051P0116K70067q7536J56458K5251j09650
$$ 3505300 3451696 3537422 3525889 3413838 3483954 3754021 3666485 3822943 3848194 3738544
12383C738544K50867l5663l46760k43120J03300J5336k80510M4288M4434J98413
$$ 3738544 3989411 3953748 3606988 3363868 3467168 3482504 3201994 3246282 3290716 3489129
12373C489129J94358l66268m12567l10845J3885K09003O3002j06730k89218m55709
$$ 3489129 3683487 3317219 2904652 2593807 2607692 2816695 2879697 2772967 2483749 2028040
12363B028040j67764l7887M2049Q7304L33402Q7066r6337r6589Q7291k8234k81819
$$ 2028040 1860276 1822389 1864438 1951742 2285144 2372210 2275873 2179284 2266575 2238341 1956522
12352A956522N0080J30448J82305L39275J7815J3393j53762J17854j47060K0841
$$ 1956522 2006602 2137050 2319355 2658630 2676445 2689838 2536076 2653930 2506870 2527711
12342B527711K0882j81625m49341l59234o2740K03877K90350R8871J05319k97763
$$ 2527711 2548593 2366968 1917627 1558393 1495653 1699530 1989880 2088751 2194070 1896307
12332A896307k93674o0915K0849K06917j19424j64611p0853j37562P2146L99425
$$ 1896307 1602633 1541718 1562567 1769484 1650060 1485449 1414596 1277034 1349180 1748605
12322A748605N5568j17877L33362j13478n46041L08915Q6952j46991j67931M3589
$$ 1748605 1804173 1686296 2019658 1906180 1360139 1669054 1756006 1609015 1441084 1484673
12312A484673O6693O9991k54004j46940L44934J32445l15323j76104n4661P4390
$$ 1484673 1551366 1621357 1367353 1220413 1565347 1697792 1382469 1206365 1151704 1226094
12302A226094k18460l753K87493l21070l21292K30619K63973k98013J49300M4554
$$ 1226094 1007634 1003881 1291374 970304 649012 879631 1143604 845591 994891 1039445
12292A039445O2566j23331l01808Q4496J33962J74958K44207l05436l46258p7016
$$ 1039445 1102011 978680 676872 761368 895330 1070288 1314495 1009059 662801 585785
12282E85785j00653L32431J66253r020L9412p5316Q6038j39595N9534j65120j29909
$$ 585785 485132 817563 983816 974796 1014208 938892 1024930 885335 944869 779749 649840
12271F49840k86505j19813j07007P5092J42473o7684n32403j57572L47104M54360
$$ 649840 363335 243522 136515 211607 354080 286396 -246007 -403579 -56475 397885
12261C97885L13807K93005M4154m12729k39374k51443m2521L08543P2962J03336
$$ 397885 711692 1004697 1048851 636122 396748 145305 102784 411327 484289 587625
12251E87625r9010r6867k7298J95298N462k46418l82996J05939M96584J06657
$$ 587625 488615 391748 364450 559748 565210 318792 -64204 41735 538319 644976
12241F44976J4123J46835k01133j3549n2311k31891l8063m2939j9886k58450J55244
$$ 644976 659099 805934 604801 591252 538941 307050 268987 226048 206162 -52288 102956
12230A02956J25257P709r2180k86403K45171L81912p6302q253L1664K03489M56731
$$ 102956 228213 235922 143742 -142661 102510 484422 408120 399867 431531 635020 1091751
12219A091751k26648l72803r7939j69615K65000J75478J47336k86513k02718o0293
$$ 1091751 865103 492300 394361 224746 489746 665224 812560 526047 323329 263036
12209B63036j00694K36554J05642O150j40181N4029L37775J20459l13937j10057
$$ 263036 162342 398896 504538 510688 370507 424536 762311 882770 568833 458776
12199D58776l276n264j11780M2606K09388j31113k70613j20821J11867K48090
$$ 458776 455500 450236 338456 381062 590450 459337 188724 67903 179770 427860
12189D27860j78181j64158q157L48031m2846K03380J65467q9961j16537l36751
$$ 427860 249679 85521 77364 425395 382549 585929 751396 661435 544898 208147
12179B08147J17713K1031J49369J46015R7363L32851j77985l59820l73032k42534
$$ 208147 325860 346891 496260 642275 739638 1072489 894504 534684 161652 -80882
12169h0882l8224N7780J11949L55085L82368K172N8661j51161m17594l15475M2066
$$ -80882 -119106 -61326 50623 405708 788076 790248 848909 697748 280154 -35321 6745
12158F745l8837O6434l5352J37696j24439j4033J20951J56731J55478L33041l9912
$$ 6745 -32092 34342 -1010 136686 12247 -1786 119165 275896 431374 764415 724503
12147G24503l82362l35032L23743J42250O1641j76179j48523J63248R4763j01157
$$ 724503 342141 7109 330852 473102 534743 358564 210041 373289 468052 366895
12137C66895p7994j67982k55393O4195k9616L577K0055j02141M7668J7301N0668
$$ 366895 288901 120919 -134474 -70279 -99895 -96318 -76263 -178404 -130736 -113435 -62767
12126f2767J49691o1862q4504J13978J54366r8242J77954J33744j02970j63546
$$ -62767 86924 25062 -59442 54536 208902 110660 288614 422358 319388 155842
12116A55842L0022O9160j92307J1996j04849J52100K04137J24843K639K46745
$$ 155842 185864 255024 62717 74713 -30136 121964 326101 450944 453583 700328
12106G00328L47175J97713l38996r8794L6906J3895L84820K81153K08357q3050
$$ 700328 1047503 1245216 906220 807426 844332 858227 1243047 1524200 1732557 1649507
12096A649507J65167j12254K92556j03627Q5102J12355l37898l43258l64046k3293
$$ 1649507 1814674 1702420 1994976 1891349 1976451 2088806 1750908 1407650 1043604 1020311
12086A020311j25892P0782J15754L3481k64394r4272N19373K15603q8322j00810
$$ 1020311 894419 965201 1080955 1114436 850042 755770 1275143 1490746 1402424 1301614
12076A301614k28432J76601Q6690j28947N5912K93311K1899j79612K23137L84485
$$ 1301614 1073182 1249783 1336473 1207526 1263438 1556749 1578648 1399036 1622173 2006658
12066B006658K04948R447k31706j52041k58290j17106j22301p0181N576J05902
$$ 2006658 2211606 2221053 1989347 1837306 1579016 1461910 1339609 1269428 1275004 1380906
12056A380906l75198j42639K25330j54344J09241j01443j76782J4784j49913L9359
$$ 1380906 1005708 863069 1088399 934055 1043296 941853 765071 779855 629942 669301
12046F69301K54363j6677R908J46632r7266K33334J21946K18562K44874J1448
$$ 669301 923664 906987 916895 1063527 966261 1199595 1321541 1540103 1784977 1796425
12036A796425J19039L56662Q385k17142l64996l40001m90526k25381k96388j02844
$$ 1796425 1915464 2272126 2280511 2063369 1698373 1358372 867846 642465 346077 243233
12026B43233K13031L44652J88333j20536k51821l45941q3156K32320j55255J3661
$$ 243233 456264 800916 989249 868713 616892 270951 187795 420115 264860 278521
12016B78521N6826k90512k3970k4721Q7305K42899o3617k59863j29757j81074
$$ 278521 335347 44835 20865 -3856 83449 326348 262731 2868 -126889 -307963
12006c07963j02043M85631k3231L5018R4411M7433o8442j58486l74261J39185
$$ -307963 -410006 75625 52394 87412 181823 229256 160814 2328 -371933 -232748
11996b32748J99461P4371J11121j60184j0438J20736L29217j45122k80463j99373
$$ -232748 -33287 41084 152205 -7979 -18417 102319 431536 286414 5951 -193422
11986a93422l65182J22986K79687l39595r2519M22649L1241j76011k60179j79731
$$ -193422 -558604 -435618 -155931 -495526 -588045 -165396 -134155 -310166 -570345 -750076
11976g50076L2285J79191J68547N5403R3398K74534k08599k88828j00015J25549
$$ -750076 -717791 -538600 -370053 -314650 -221252 53282 -155317 -444145 -544160 -418611
11966d18611L06653K3660o7017r9039L10354j40502K2060j13133k70931p5047
$$ -418611 -111958 -88298 -155315 -254354 56000 -84502 -62442 -175575 -446506 -521553
11956e21553o2898Q4806M80946K32330j83328l28184l60033L15123O22906n0683
$$ -521553 -584451 -499645 -18699 213631 30303 -297881 -657914 -342791 280115 229432
11946B29432k43502j85692J89276j11946j54690j24155q2896J89202Q3003K28286
$$ 229432 -14070 -199762 -10486 -122432 -277122 -401277 -484173 -294971 -211968 16318
11936A6318j05027j37501r796J30479L34538R82k31586o0752M2650Q7386n6547
$$ 16318 -88709 -226210 -236006 -105527 229011 229993 -1593 -62345 -19695 67691 11144
11925A1144k93269J12506K08070j65997K12922L2506k53158J23962q8561k03213
$$ 11144 -282125 -169619 38451 -127546 85376 117882 -135276 -11314 -99875 -303088
11915c03088J30371j06623K17342L1834J40916K05123k25456r0256J07274o3360
$$ -303088 -172717 -279340 -61998 -30164 110752 315875 90419 163 107437 44077
11905D4077L527Q3465J26007J66421R9737k24717j26379l60007j67803N29431
$$ 44077 47604 131069 257076 423497 523234 298517 172138 -187869 -355672 173759
11895A73759r7442l76842r811k83084O1348J49633o607J92018k046J68317L5396
$$ 173759 76317 -300525 -310336 -593420 -532072 -382439 -389046 -197028 -199074 -30757 4639
11884D639k04654m3628j5389k63302j4281L4990q1353J24962L6818Q1119j5353
$$ 4639 -200015 -243643 -259032 -522334 -536615 -501625 -582978 -458016 -421198 -340079 -355432
11873c55432L31175K15462j56581L3333l6329j20028k44970k3082L10256m6691
$$ -355432 -24257 191205 34624 67957 31628 -88400 -333370 -356452 -46196 -92887
11863i2887m27760j11741N6710K03951K54845j31849l77740j52344L36715K09985
$$ -92887 -520647 -632388 -575678 -371727 -116882 -248731 -626471 -778815 -442100 -232115
11853b32115N3369j06386j4389M6702Q256K15765n0897K16223N0625P9874J58781
$$ -232115 -178746 -285132 -299521 -252819 -244563 -28798 -79695 136528 187153 267027 425808
11842D25808J03862m25612j14870K68716J40477K19334l54565l33310p9040m9028
$$ 425808 529670 104058 -10812 257904 398381 617715 263150 -70160 -149200 -198228
11832a98228O8187k8274J37090L80419J24961j47908l57607j65079K17526l7895
$$ -198228 -130041 -158315 -21225 359194 484155 336247 -21360 -186439 31087 -6808
11822f808k08667j89494n7733J79273J55883K47479k9465M16255L13038l04047
$$ -6808 -215475 -404969 -462702 -283429 -127546 119933 90468 506723 819761 515714
11812E15714m40946n5781j72130L49021K32826j87411r1800r4054l02643J49696
$$ 515714 74768 18987 -153143 195878 428704 241293 149493 55439 -247204 -97508
11802i7508K74691k10256j88651M6453L97686r2743l19766l7191K09947K61548
$$ -97508 177183 -33073 -221724 -175271 222415 129672 -190094 -227285 -17338 244210
11792B44210j72236K68353J71502j48277o8109n0822k2343J06147k04384j92922
$$ 244210 71974 340327 511829 363552 295443 244621 222278 328425 124041 -68881
11782f8881J76871l78618P6995j20004j31042K17027J63762R6233L96695J80126
$$ -68881 107990 -270628 -193633 -313637 -444679 -227652 -63890 32343 429038 609164
11772F09164k00744k63107k91603q7779k726K60738K04517k48469K20975K47659
$$ 609164 408420 145313 -146290 -234069 -236795 23943 228460 -20009 200966 448625
11762D48625n0381j22959L2883r205K40945N9127l09533k05538o4748K9536n12919
$$ 448625 398244 275285 308168 298963 539908 599035 289502 83964 19216 48752 -464167
11751d64167k03953M60628J06371j07044K62687j73216j13345J47630l488J16059
$$ -464167 -668120 -207492 -101121 -208165 54522 -118694 -232039 -84409 -87897 28162
11741B8162j5008J26517K88741K30537R8714r4589j44852m79931K27374J14707
$$ 28162 13154 139671 428412 658949 757663 663074 518222 38291 265665 380372
11731C80372j93127k74643j06619n1749L68422q6415m27103Q2530L97437j01633
$$ 380372 187245 -87398 -194017 -245766 122656 36241 -390862 -308332 89105 -12528
11721a2528J29117J08652j11334R1358L3503R778l15070j82581r5622K95344L56283
$$ -12528 116589 225241 113907 205265 238768 248546 -66524 -249105 -344727 -49383 306900
11710C06900o0279r3461K58930K94814l71957j81286p932J11570L0824l44655
$$ 306900 246621 153160 412090 706904 334947 153661 145729 257299 288123 -56532
11700e6532j69122j06885K4205q7419o5382J89534J65832O2343J01943J00249
$$ -56532 -225654 -332539 -308334 -395753 -461135 -271601 -105769 -43426 58517 158766
11690A58766J42789j18218m2286l08287p7874M147j6119P7653J98289L4376l0538
$$ 158766 301555 183337 141051 -167236 -245110 -240963 -257082 -179429 18860 53236 22698
11679B2698n9024L4215n9826j13837K63630K57968q6402m7302j22096p6332l0660
$$ 22698 -36326 -2111 -61937 -175774 87856 345824 259422 212120 90024 13692 -16968
11668a6968q9219J52980K501j24096p4912k5159K27131k6013M7572R7644k08251
$$ -16968 -106187 46793 49294 -74802 -149714 -174873 52258 26245 73817 171461 -36790
11657c6790n27893j99096M67971J00343J81299R3149k21128j09468K66047j02794
$$ -36790 -564683 -763779 -295808 -195465 -14166 78983 -142145 -251613 14434 -88360
11647h8360j06506M8830j41957J13673J24332j83504J1763L64963R5635k18850
$$ -88360 -194866 -146036 -287993 -174320 -49988 -233492 -221729 143234 238869 20019
11637B0019q830n8975j58310K30031O2319k46174j80078J29689J72272j40617
$$ 20019 11189 -47786 -206096 23935 86254 -159920 -339998 -210309 -38037 -178654
11627a78654L37560K26092k02657p9425Q7759q9479j9955K4078k96621j12289
$$ -178654 158906 384998 182341 102916 190675 101196 81241 105319 -191302 -303591
11617c03591J98050K40085O634k46121k09681K12060k7280k07561j26541J1384
$$ -303591 -105541 134544 141178 -104943 -314624 -102564 -129844 -337405 -463946 -452562
11607d52562r9705L39971p4058n2490J708J96625K44311m1182P0306j08059J15239
$$ -452562 -552267 -212296 -286354 -338844 -337136 -140511 103800 62618 132924 24865 140104
11596A40104M0257O07L25330Q6730j11770j04562Q0394k24070l38825q166K9496
$$ 140104 180361 180968 506298 593028 481258 376696 457090 233020 -105805 -113971 -84475
11585h4475j30103m0991L6552L35719j64582j83839j21404Q6216L36199L68233
$$ -84475 -214578 -255569 -219017 116702 -47880 -231719 -353123 -266907 69292 437525
11575D37525k1828o43768k36996K42411k23414K25354J49324j09262j03508K23190
$$ 437525 415697 -228071 -465067 -222656 -446070 -220716 -71392 -180654 -284162 -60972
11565f0972M30743m8603k59461k53761j67399m1380m0731J8742j30814J90188
$$ -60972 369771 321168 61707 -192054 -359453 -400833 -441564 -422822 -553636 -363448
11555c63448L77957j20557q521m861j49185L0379L08061J28319n8606j91152k89759
$$ -363448 14509 -106048 -114569 -119430 -268615 -238236 69825 198144 139538 -51614 -341373
11544c41373j77023K03113K67584p9315N13876J45830O4862l65959j95209J51936
$$ -341373 -518396 -315283 -47699 -127014 386862 532692 597554 231595 36386 188322
11534A88322K43899J76895J17259o0914k2221n47932k90987J44745L79933L75835
$$ 188322 432221 609116 726375 665461 643240 95308 -195679 -50934 328999 704834
11524G04834k16626j71579L15468j19485l24266R3857L13888n5323k63575j57184
$$ 704834 488208 316629 632097 512612 188346 282203 596091 540768 277193 120009
11514A20009l88416K34J03212N2305J51588j43143K88441L10482L712P9831J10170
$$ 120009 -268407 -268173 -164961 -112656 38932 -104211 184230 494712 498424 578255 688425
11503F88425J98844K32502r0912K74654N8781q2222P9706k37169l67257n2687
$$ 688425 887269 1119771 1028859 1303513 1362294 1280072 1359778 1122609 755352 702665
11493G02665l3541j91597j93425l5386L08012J32551j43203j13584l05937j92647
$$ 702665 669124 477527 284102 248716 556728 689279 546076 432492 126555 -66092
11483f6092K56171L70140j12029j29060K18814K85046O8821k63854o7630q4485
$$ -66092 190079 560219 448190 319130 537944 822990 891811 627957 560327 475842
11473D75842Q8736N8244J01129L75840J50000R5711K55316j73941J23221K74302
$$ 475842 564578 622822 723951 1099791 1249791 1345502 1600818 1426877 1550098 1824400
11463A824400m6540k13563j96033n20040l43002R6161n2021L7688J27062k79249
$$ 1824400 1777860 1564297 1368264 848224 505222 601383 549362 587050 714112 434863
11453D34863q8282J01938L84354R6122l17750k61375J42656M1823l3699k54185
$$ 434863 346581 448519 832873 928995 611245 349870 492526 534349 500650 246465
11443B46465l75858M63585J51946K1032j30266M6867o9668J15377J44847l3598
$$ 246465 -129393 334192 486138 507170 376904 423771 354103 469480 614327 580729
11433E80729j18465p7030j59609J60576K47822j30874K49941M7649j23938l44951
$$ 580729 462264 385234 225625 386201 634023 503149 753090 800739 676801 331850
11423C31850q0993J97602j35907l8236K38981j43284k83284j91760k25708P6990
$$ 331850 250857 448459 312552 274316 513297 370013 86729 -105031 -330739 -253749
11413b53749L8920r8081J98977J68529J58186l12123j59078j28882O9022Q3225
$$ -253749 -214829 -312910 -113933 54596 212782 -99341 -258419 -387301 -318279 -235054
11403b35054J4930J71818J52419k98837k75367j01417L71685N1107o9915P3605
$$ -235054 -220124 -48306 104113 -194724 -470091 -571508 -199823 -148716 -218631 -145026
11393a45026J50155J85917k2003J39753K48013j70844M0268J93647q8289j72545
$$ -145026 5129 191046 169043 308796 556809 385965 426233 619880 531591 359046
11383C59046k82102j34256Q4606l2132K70418k13161O9872J16673L5162L3163
$$ 359046 76944 -57312 27294 -4838 265580 52419 122291 238964 274126 307289
11373C07289j55678o2756n2405N17758l1228o6676j21421J31863K1182p7619n1433
$$ 307289 151611 88855 36450 554208 522980 456304 334883 466746 487928 410309 358876
11362C58876j32989k32104p2617P274k10972K07415L69307L10783j882R731J7469
$$ 358876 225887 -6217 -78834 -71560 -282532 -75117 294190 604973 603091 612822 630291
11351F30291L8449k22843k43759J07135P1596P0262M3779P5101j11183J22745
$$ 630291 668740 445897 202138 309273 380869 451131 494910 570011 458828 581573
11341E81573k02660Q4197J20361J40349k9193l13101n34101M4535J57215L48442
$$ 581573 378913 463110 583471 723820 694627 381526 -152575 -108040 49175 397617
11331C97617K15031o11186k12640J67301J94230L48633L7718J95969k18741j74196
$$ 397617 612648 1462 -211178 -43877 150353 498986 536704 732673 513932 339736
11321C39736M24181K89002j56607l70623l23641k30617r865K07716L9619K6427
$$ 339736 763917 1052919 896312 525689 202048 -28569 -38434 169282 208901 235328
11311B35328J02214M384K22678m2644r7649j15015l3974K9695L7698k18160p4984
$$ 235328 337542 341926 564604 521960 424311 309296 275322 305017 342715 124555 49571
11300D9571J17273J99530k8251l2071J19210j37052j23356J57226L98282j65579
$$ 49571 166844 366374 338123 306052 425262 288210 164854 322080 720362 554783
11290E54783N1173K25321P9916R0893j92937k0978J11892m8138m4234J27697r3359
$$ 554783 605956 831277 911193 1002086 809149 788171 900063 851925 807691 935388 842029
11279H42029k61553l15295j43451J02556J60761K08114k41740m3272k70936k47383
$$ 842029 580476 265181 121730 224286 385047 593161 351421 308149 37213 -210170
11269b10170J47427R1203L9049J97645k30654n2412J34177r3427j48853K9369
$$ -210170 -62743 28460 67509 265154 34500 -17912 116265 22838 -126015 -96646
11259i6646M52423L31896R511k6113k31517o653k7322k13744L7521K92052J69200
$$ -96646 355777 687673 697184 671071 439554 432901 405579 191835 229356 521408 690608
11248F90608q9603N3962j06315j24065J60172K3062k05962P6421J11800j53904
$$ 690608 601005 654967 548652 424587 584759 607821 401859 478280 590080 436176
11238D36176N8840j67225Q9482R7676J14766m46478l1969J42434L0943J60690
$$ 436176 495016 327791 417273 514949 629715 183237 151268 293702 324645 485335
11228D85335K32754K45713o9891M2051q6325J05541J44763j17009k4308R9380
$$ 485335 718089 963802 893911 935962 849637 955178 1099941 982932 958624 1058004
11218A058004K89939l4869L43166J31292n20547k98731r788p423Q7968J25371
$$ 1058004 1347943 1313074 1656240 1787532 1266985 968254 958466 951043 1039011 1164382
11208A164382k38030j35846j74820j73499M9068m6445J03117l3621m7594K03471
$$ 1164382 926352 790506 615686 442187 491255 444810 547927 514306 466712 670183
11198F70183K02986K12057k02434l61474j67276K00254J03647Q8053J51161j35043
$$ 670183 873169 1085226 882792 521318 354042 554296 657943 745996 897157 762114
11188G62114J88061L29743k2605j42449J16098J74148L40676L68225J1119K43239
$$ 762114 950175 1279918 1257313 1114864 1230962 1405110 1745786 2114011 2125130 2368369
11178B368369j08218K250j01454J4440l15517l99616k39764N6458J2526K52948
$$ 2368369 2260151 2262401 2160947 2175387 1859870 1460254 1220490 1276948 1289474 1542422
11168A542422r4088q3479l15312O4230M07950K70990k73027R3905J25149N63291
$$ 1542422 1448334 1364855 1049543 1113773 1521723 1792713 1519686 1613591 1738740 2302031
11158B302031L81361n16599J17245K59381K8063O5450q118J83030L33133p5800
$$ 2302031 2683392 2166793 2284038 2543419 2571482 2636932 2628814 2811844 3144977 3069177
11148C069177k43545J7146K25623O22499K67854j22180q4437k24652j08011m4652
$$ 3069177 2825632 2842778 3068401 3690900 3958754 3836574 3752137 3527485 3419474 3374822
11138C374822N488k16599r6326j82378j52228L76538L7150j90839M16964J78684
$$ 3374822 3380310 3163711 3067385 2885007 2732779 3109317 3146467 2955628 3372592 3551276
11128C551276J64659L65220m3839K22408Q48996L56396j59562j31276j65852J62101
$$ 3551276 3715935 4081155 4037316 4259724 5108720 5465116 5305554 5174278 5008426 5170527
11118E170527K78120K96794n8803J7544L62026M16614O5050K20050L03264J57413
$$ 5170527 5448647 5745441 5686638 5704182 6066208 6482822 6547872 6767922 7071186 7228599
11108G228599M40006M80870Q43555N25644P13922P20125O78532J181340J445997
$$ 7228599 7668605 8149475 8993030 9518674 10232596 10952721 11631253 12812593 14258590
11099A4258590J715034K139117K058879K372797L364460M582462N655299O990930
$$ 14258590 15973624 18112741 20171620 22544417 25908877 30491339 36146638 43137568
11091D3137568Q917280J1686365J5066866J8582706K2854063K6128768K5670800
$$ 43137568 52054848 63741213 78808079 97390785 120244848 146373616 172044416
11084A72044416J8896592N644950j1465428k5866351l1228167k7122202j9672573
$$ 172044416 190941008 196585958 185120530 159254179 128026012 100903810 81231237
11077H1231237j3640792r108995o416903m748695k954607j770356q60733m97398
$$ 81231237 67590445 58481450 52064547 47315852 44361245 42590889 41730156 41232758
11069D1232758k11871l07243k72244Q4904N42938J240414J969892K870991L473159
$$ 41232758 41020887 40713644 40441400 40526304 41069242 42309656 44279548 47150539 50623698
11060E0623698M332849N358455O804161Q962813J1925770J5899725K0675547K6802596
$$ 50623698 54956547 60315002 67119163 76081976 88007746 103907471 124583018 151385614
11052A51385614L4595390M3600717N0169268N0238721L8827554J3756271j9350913
$$ 151385614 185981004 229581721 279750989 329989710 368817264 382573535 363222622
11045C63222622m8745149o2397375n7585571m2957994k9018897j9990995j4125994
$$ 363222622 314477473 252080098 194494527 151536533 122517636 102526641 88400647
11038H8400647j0007161p405950n549658m338981l209870k075206k141434j589639
$$ 88400647 78393486 70987536 65437878 61098897 57889027 55813821 53672387 52082748
11030E2082748j188042k04084j59366N64440Q17736J164909J668636J811874K220041
$$ 52082748 50894706 50690622 50531256 51095696 51913432 53078341 54746977 56558851 58778892
11021E8778892L371527M527425O454403Q258469J0590436J4102694J8471157K1145795
$$ 58778892 62150419 66677844 73132247 81390716 91981152 106083846 124555003 145700798
11013A45700798K2063667J8492857Q309681o217912k1005847k9791137k9059576
$$ 145700798 167764465 186257322 194567003 188349091 167343244 137552107 108492531
11006A08492531k2523369j5870205j1227839q474626n866257m435041l495510
$$ 108492531 85969162 70098957 58871118 50396492 44530235 40095194 36599684
10999C6599684k523129j894940k180042j985331j842860j457025r41549j193410
$$ 36599684 34076555 32181615 30001573 28016242 26173382 24716357 23774808 22581398
10991B2581398j336621p18536m58026l50647l49714m75575n62311p89708q30516
$$ 22581398 21244777 20526241 20068215 19717568 19367854 18892279 18329968 17540260 16709744
10982A6709744o24811n24212r34085r69627q98099p68217r77359o68308j15073
$$ 16709744 16084933 15560721 14626636 13657009 12758910 11990693 11013334 10345026 10229953
10973A0229953l60893m58228n61703l22237k53490q0959l55884n58499Q590k9273
$$ 10229953 9869060 9410832 8849129 8526892 8273402 8192443 7836559 7278060 7286650 7257377
10963G257377k85528j75153j91227n95460l92349k72180m3692j93853j40713l39881
$$ 7257377 6971849 6796696 6605469 6010009 5617660 5345480 5301788 5107935 4967222 4627341
10953D627341k67330R940J02041j82088m26269j37509l19149j69849m38261J14389
$$ 4627341 4360011 4369951 4471992 4289904 3863635 3726126 3406977 3237128 2798867 2913256
10943B913256L213k17353j0199m4753M2537M37256k5084J18636J20756j72310
$$ 2913256 2916469 2699116 2688917 2644164 2686701 3123957 3098873 3217509 3338265 3165955
10933C165955J83589o4412j17764q4595L5965j71213q5662L18383J27625o7260
$$ 3165955 3349544 3285132 3167368 3082773 3118738 2947525 2861863 3180246 3307871 3240611
10923C240611j38178k20195l14476J38873p6617k84063l78033m83977m39044J00979
$$ 3240611 3102433 2882238 2567762 2706635 2630018 2345955 1967922 1483945 1044901 1145880
10913A145880M64785L67124M28970L489k03711l92587l36300L9487j48634O3382
$$ 1145880 1610665 1977789 2406759 2410248 2206537 1813950 1477650 1517137 1368503 1431885
10903A431885N37107N8309j13848K92091J2392j53325J24438R2886K01299j75365
$$ 1431885 1968992 2027301 1913453 2205544 2217936 2064611 2189049 2281935 2483234 2307869
10893B307869Q0934K88492j3429l88915j11271J14805O6855l7874L3682l0131
$$ 2307869 2388803 2677295 2663866 2274951 2163680 2278485 2345340 2307466 2341148 2311017
10883B311017j34034n8551j07061K40038q5788j55463k83886k44027J91524L12997
$$ 2311017 2176983 2118432 2011371 2251409 2165621 2010158 1726272 1482245 1673769 1986766
10873A986766p3510L27825J77018j29032k9956m0118j10260K30127k13229n6031
$$ 1986766 1913256 2241081 2418099 2289067 2259111 2218993 2108733 2338860 2125631 2069600
10863B069600j92188J39340M92200J4591l64921L18340J87581K83923K70183K40642
$$ 2069600 1877412 2016752 2508952 2523543 2158622 2476962 2664543 2948466 3218649 3459291
10853C459291O2795k30169l2465J40534q6144N9427n0034j0746m52950k28716
$$ 3459291 3522086 3291917 3259452 3399986 3313842 3373269 3323235 3312489 2859539 2630823
10843B630823o0403L43110K67373P6035M4859J58458j67011j16671J70715p8898
$$ 2630823 2570420 2913530 3180903 3256938 3301797 3460255 3293244 3176573 3347288 3268390
10833C268390r0813J13649L1266r3045K28648m18J20999L21469M4565P8717K3109
$$ 3268390 3177577 3291226 3322492 3229447 3458095 3457677 3578676 3900145 3944710 4023427 4046536
10822D046536J48575q795k11802k56744k30243k012o4046l33181j08K00575J6562
$$ 4046536 4195111 4186316 3974514 3717770 3487527 3485515 3421469 3088288 3088180 3288755 3305317
10811C305317Q4817J01689j6401j22154k26653J44016R2957Q6981J21066j35469
$$ 3305317 3390134 3491823 3475422 3353268 3126615 3270631 3363588 3450569 3571635 3436166
10801C436166j33313j20324L56621M41827N7375K5478j89677K53079L02957K93383
$$ 3436166 3302853 3182529 3539150 3980977 4038352 4063830 3874153 4127232 4430189 4723572
10791D723572L08708K97469r6770j37023j22334j53481M2320j69260j86847J84479
$$ 4723572 5032280 5329749 5232979 5095956 4973622 4820141 4862461 4693201 4506354 4690833
10781D690833J20221M66272O95993M1825q174k2229K79769L77578K92952L73330
$$ 4690833 4811054 5277326 5973319 6015144 6006970 5984741 6264510 6642088 6935040 7308370
10771G308370J30923K40422j70964K64183P5069j0179K40007J65202L80497P76581
$$ 7308370 7439293 7679715 7508751 7772934 7848003 7837824 8077831 8243033 8623530 9400111
10761I400111L24115M14519L75989K86838P83554N61830M63446O35822O81513
$$ 9400111 9724226 10138745 10514734 10801572 11585126 12146956 12610402 13246224 13927737
10752A3927737P08573P68806P40495J250958J411937J438986J723222J696350
$$ 13927737 14636310 15405116 16145611 17396569 18808506 20247492 21970714 23667064
10744B3667064J851795J997409K487704L089464L312265L952621M409457N186762
$$ 23667064 25518859 27516268 30003972 33093436 36405701 40358322 44767779 49954541
10736D9954541O682886Q088549R282280J0865784J3009979J5560216J8800455
$$ 49954541 56637427 64725976 74008256 84874040 97884019 113444235 132244690
10729A32244690K1557974K4320523K6616332K7065373K4784003J9222582J0850906
$$ 132244690 153802664 178123187 204739519 231804892 256588895 275811477 286662383
10722B86662383Q13457r670603j7471152k0859573k0476317j8117417j4559642
$$ 286662383 287475840 277805237 260334085 239474512 218998195 200880778 186321136
10715A86321136r534910n209181j754534J821157N024742P837382J0165117J1778012
$$ 186321136 176786226 171577045 169822511 171643668 176668410 184505792 194670909 206448921
10707B06448921J1740017J0625755Q173475O171457M683864L603674M206051O972119
$$ 206448921 218188938 228814693 236988168 243159625 247843489 251447163 255653214 262625333
10699B62625333R977159J3346402J6056486J6824305J5399567J1652648N515279
$$ 262625333 272602492 285948894 302005380 318829685 334229252 345881900 351397179
10692C51397179k072751r296774j4378684j6809143j6765629j4042579j0597839
$$ 351397179 349324428 340027654 325648970 308839827 292074198 278031619 267433780
10685B67433780p039722m438383l149702l361408m988136p325429r342156j0163300
$$ 267433780 260394058 255955675 252805973 249444565 244456429 237131000 227788844 217625544
10677B17625544r486687q323791o077856l215000K83015L551615O739627R646426
$$ 217625544 208138857 199815066 193737210 190522210 190805225 194356840 201096467 210742893
10669B10742893J2592501J4923941J6317018J5898729J2848619P486993J43872
$$ 210742893 223335394 238259335 254576353 270475082 283323701 290810694 290954566
10662B90954566q561069j6450894k2020478k4563162k4655062k2632281j9284942
$$ 290954566 282393497 265942603 243922125 219358963 194703901 172071620 152786678
10655A52786678j6279986j3556817j1482344r615312q235388o589595o213998
$$ 152786678 136506692 122949875 111467531 101852219 93616831 87027236 80813238
10648H0813238n569790m587697l913830l298970k663091k535887k388760k081998
$$ 80813238 75243448 70655751 66741921 63442951 60779860 58243973 55855213 53773215
10640E3773215k088506k023192j688392j763460j992175k002595j809648k044659
$$ 53773215 51684709 49661517 47973125 46209665 44217490 42214895 40405247 38360588
10632C8360588j911559j639946j532621j328572j461735p49260p69359j037251
$$ 38360588 36449029 34809083 33276462 31947890 30486155 29736895 28967536 27930285
10624B7930285j436515j243498j008241j339928r96128n45146q33497o87284o32937
$$ 27930285 26493770 25250272 24242031 22902103 21905975 21360829 20527332 19840048 19207111
10615A9207111m52413o9612k97915o44262r90673n00311l46573m56552l98716
$$ 19207111 18754698 18685086 18387171 17742909 16752236 16251925 15905352 15448800 15050084
10606A5050084m87841o47074n41215n65182k43250J08821j15906j47184k84441
$$ 15050084 14562243 13915169 13373954 12808772 12565522 12674343 12558437 12411253 12126812
10597A2126812l19547R2575O6967K22623k43797n31729m74626m54093k35335o7977
$$ 12126812 11807265 11899840 11966807 12189430 11945633 11413904 10939278 10485185 10249850 10181873
10587A0181873r9835q0367m01505j28953q8740l54098m77122n92011k11043j42977
$$ 10181873 10082038 10001671 9600166 9471213 9382473 9028375 8551253 7959242 7748199 7605222
10577G605222j09198k0570j88094k37028j56983L38311K12958l21957m54826q9287
$$ 7605222 7496024 7475454 7287360 7050332 6893349 7231660 7444618 7122661 6667835 6578548
10567F578548o7957O0209l98456n1595k26668k44089j09050N2948j23094O6805
$$ 6578548 6510591 6570800 6172344 6120749 5894081 5649992 5540942 5593890 5470796 5537601
10557E537601K85187k89686r3077L33601J12103l20997j50143m8153J09841J82155
$$ 5537601 5822788 5533102 5440025 5773626 5885729 5564732 5414589 5366436 5476277 5658432
10547E658432k89937k82116J4596J49264j90831j26205k66636l97072K5067K36558
$$ 5658432 5368495 5086379 5100975 5250239 5059408 4933203 4666567 4269495 4294562 4531120
10537D531120j48677k45353l08523j44460k17166l37089Q0124Q8879k20439m17250
$$ 4531120 4382443 4137090 3828567 3684107 3466941 3129852 3209976 3298855 3078416 2661166
10527B661166K7356K60043j4792o3894j08045L83226K62382j05293l95772j08046
$$ 2661166 2688522 2948565 2933773 2869879 2761834 3145060 3407442 3302149 2906377 2798331
10517B798331K14469N776J68582k30909k07033K56913K37813k68709r4153J04932
$$ 2798331 3012800 3018576 3187158 2956249 2749216 3006129 3243942 2975233 2881080 2986012
10507B986012j80876l82614j99493j20833J82869J83212m2816j2355K58358J57489
$$ 2986012 2805136 2422522 2223029 2102196 2285065 2468277 2425461 2413106 2671464 2828953
10497B828953l21112J10443J82107J26394p2820l73343k26994j85617m4698j041
$$ 2828953 2507841 2618284 2800391 2926785 2853965 2480622 2253628 2068011 2023313 2022272
10487B022272j48423k5783R9682o743O7795o5854j39954J73815K10911j05584
$$ 2022272 1873849 1848066 1947748 1941005 2008800 1942946 1802992 1976807 2187718 2082134
10477B082134n9358o7338M8173n1546n0677j40075J16142j5317k59607l07035
$$ 2082134 2022776 1955438 2003611 1952065 1901388 1761313 1877455 1862138 1602531 1295496
10467A295496j29908M7058L36719K60691l0228k0626J0542j61133o4759k72280
$$ 1295496 1165588 1212646 1549365 1810056 1779828 1759202 1769744 1608611 1543852 1271572
10457A271572J52009j40850K85956L55164J95780L3133K12986J71265k02864r9561
$$ 1271572 1423581 1282731 1568687 1923851 2119631 2152764 2365750 2537015 2334151 2234590
10447B234590j35406j86364K2074k60666l21098k11180r9393K7788Q0390Q6441
$$ 2234590 2099184 1912820 1934894 1674228 1353130 1141950 1042557 1070345 1150735 1237176
10437A237176l65001j04989M13042R9482L1123k15051m735j06686l325J56686
$$ 1237176 872175 767186 1180228 1279710 1310833 1095782 1091047 984361 981036 1137722
10427A137722j74737k05668k19833j55095N08192J77663j16788l9280J48095j21596
$$ 1137722 962985 757317 537484 382389 890581 1068244 951456 912176 1060271 938675
10417I38675k09188K61653j77118j12498L16824o6051j66643M6701j35418K12303
$$ 938675 729487 991140 814022 701524 1018348 952297 785654 832355 696937 909240
10407I09240Q8733R0807K5564p6719J14931L18168N8072m14872o2015P9901j1686
$$ 909240 997973 1088780 1114344 1037625 1152556 1470724 1528796 1113924 1051909 1131810 1120124
10396A120124l22386m11378J6087L19751L23239n2082J55490m3853k54406o5280
$$ 1120124 797738 386360 402447 722198 1045437 993355 1148845 1104992 850586 785306
10386G85306J33439K25416M7594r4222m53656m83074P1486K52700J95843J49241
$$ 785306 918745 1144161 1191755 1097533 643877 160803 232289 484989 680832 830073
10376H30073M666l21072L1679j0654k57355P8958m4197K0904K07828l49172J70451
$$ 830073 834739 513667 545346 534692 277337 356295 312098 333002 540830 191658 362109
10365C62109K52381k87958M9139N8498M3476k31808k3024r7943J77535M22820
$$ 362109 614490 326532 375671 434169 477645 245837 222813 124870 302405 725225
10355G25225J55110k60425O4277l8247n9373p0010k23094j38398J48785j90231
$$ 725225 880335 619910 684187 645940 586567 516557 293463 155065 303850 113619
10345A13619k33972R2921K40033l2252n1884R8044j3021p1312K91363p983l05746
$$ 113619 -120353 -27432 212601 180349 128465 226509 213488 142176 433539 425556 119810
10334A19810k4195M6926L4555L785j43240k48285J29855L23099J66682k32350
$$ 119810 95615 142541 177096 180881 37641 -210644 -80789 242310 408992 176642
10324A76642N2579L93815M2018L9465k37802k33400l13764P7759J97743P4957
$$ 176642 229221 623036 665054 704519 466717 233317 -80447 -2688 195055 270012
10314B70012K73346J2101L8402k8272O2414k16483m9350J89938L03748J5711j45949
$$ 270012 543358 555459 593861 565589 628003 411520 362170 552108 855856 871567 725618
10303G25618j02790M05194L33336K70626J21064R0677n6160q733l10025k45572
$$ 725618 622828 1028022 1361358 1631984 1753048 1843725 1787565 1778832 1468807 1223235
10293A223235k0946M1717j48132K9461j4357o760K53518j14061j51017K2844L34725
$$ 1223235 1202289 1244006 1095874 1125335 1110978 1104218 1357736 1243675 1092658 1115502 1450227
10282A450227R8037n138j66292k09741j24674k42517K61185M14796J17176J03126
$$ 1450227 1548264 1543126 1376834 1167093 1042419 799902 1061087 1475883 1593059 1696185
10272A696185K9782J05370N82840L06121l62963j78238q4797j60667k40818j45964
$$ 1696185 1725967 1831337 2414177 2720298 2357335 2179097 2094300 1933633 1692815 1546851
10262A546851j57620j30428q0419J35699L20392Q4373K5793j17204l02972k69323
$$ 1546851 1389231 1258803 1178384 1314083 1634475 1718848 1744641 1627437 1324465 1055142
10252A055142j77530Q6962n4582O3336K72809M12519J2767j15577j5367J77362
$$ 1055142 877612 964574 909992 973328 1246137 1658656 1671423 1555846 1540479 1717841
10242A717841J18364r1725L2783L41044j32573l24411p5842j97693n1679k26966
$$ 1717841 1836205 1744480 1777263 2118307 1985734 1661323 1585481 1387788 1336109 1109143
10232A109143n00093j25429n0929P7250K35881J52333k15121j18710R721K18766
$$ 1109143 609050 483621 432692 509942 745823 898156 683035 564325 574046 792812
10222G92812n9424l69921k55638j91649j92601r6932J16163J7967J82898J49082
$$ 792812 733388 363467 107829 -83820 -276421 -373353 -257190 -239223 -56325 92757
10212I2757L16679L74097l0725j72192k96021K46198j91698k40061j4834q4328
$$ 92757 409436 783533 752808 580616 284595 530793 339095 99034 84200 -128
10202a28M7177j29427m0265K94652k10718R7685J24473M5230j52837J22515j07200
$$ -128 47049 -82378 -122643 172009 -38709 58976 183449 228679 75842 198357 91157
10191I1157j35008N647J26244j68250J57477n4949P3303J78308J1522j13438n0996
$$ 91157 -43851 -38204 88040 -80210 77267 22318 95621 273929 285451 172013 121017
10180A21017j00207J45879N3020j38111r8454J23768K53663L3666m9783j68444
$$ 121017 20810 166689 219709 81598 -16856 106912 360575 394241 344458 176014
10170A76014j94993K053K29556J23574j62099J47768j02578N3586J07457l45877
$$ 176014 -18979 -16926 212630 336204 174105 321873 219295 272881 380338 34461
10160C4461p5645J56042J48071K74770J74761j65945k8362P6941j61658j57614
$$ 34461 -41184 114858 262929 537699 712460 546515 518153 595094 433436 275822
10150B75822Q5103k7539l47179m4647K19665K58131Q2116n0223r9783k10751j56085
$$ 275822 360925 333386 -13793 -58440 161225 419356 501472 451249 351466 140715 -15370
10139a5370M0220J74347j9841l48248j6737M63928L7919J194m1868j88280Q476
$$ -15370 24850 199197 179356 -168892 -185629 278299 316218 317412 275544 87264 95740
10128I5740J87704n03029r4054J20780q701K4941K88232k08258K3338l34534J42237
$$ 95740 283444 -219585 -313639 -192859 -201560 -176619 111613 -96645 -73307 -407841 -265604
10117b65604O90588J44873m12111n43170J42844J58136L7250m1205l11766J23603
$$ -265604 424984 569857 157746 -385424 -242580 -84444 -47194 -88399 -400165 -276562
10107b76562J53334L35347J00738L37643j91651l18431n9206n753k12529O4787
$$ -276562 -123228 212119 312857 650500 458849 140418 81212 75459 -137070 -72283
10097g2283p5330l40633K91655L42371l3234j84642m04827j88341J26946L60800
$$ -72283 -147613 -488246 -196591 145780 112546 -72096 -476923 -665264 -538318 -177518
10087a77518J10902J25256j31610r8681K40051l6039P4937L5752L12031K2764
$$ -177518 -66616 58640 -72970 -171651 68400 32361 107298 143050 455081 477845
10077D77845k0806n9408O9445k69053l17590N4373J54766J75967l0101r891J91710
$$ 477845 457039 397631 467076 198023 -119567 -65194 89572 265539 235438 225547 417257
10066D17257J79660k06499m72147R3336N3570j26231j90828J34009K06701k33610
$$ 417257 596917 390418 -81729 11607 65177 -61054 -251882 -117873 88828 -144782
10056a44782J11025J05370j66049R2053K04504L9743J90153K38639l38516l24577
$$ -144782 -33757 71613 -94436 -2383 202121 241864 432017 670656 332140 7563
10046G563j10261l00017j35524K57111l6937K2215N5728M1181j73495L28262J01046
$$ 7563 -102698 -402715 -538239 -281128 -318065 -295850 -240122 -198941 -372436 -44174 56872
10035E6872M0068Q5181j8851j62292l5702J01933p7170Q5103J57647k90956j9452
$$ 56872 96940 182121 163270 978 -34724 67209 -9961 75142 232789 -58167 -77619
10024g7619K84052K12347k6141k06062l07962m8668M7011L81335R7775o0550k34730
$$ -77619 206433 418780 392639 186577 -121385 -170053 -123042 258293 356068 295518 60788
10013F0788l2451P7255l28122q0968j44504K18750K00789j74023j20537J64709
$$ 60788 28337 105592 -222530 -303498 -448002 -229252 -28463 -202486 -323023 -158314
10003a58314K3369J79740J27553l23082j09315k56578q5148M86423M19255J91056
$$ -158314 -134945 44795 172348 -150734 -260049 -516627 -601775 -115352 303903 494959
9993D94959j94629j88607N8161r8474N3917l64707p3706L83261L15525P4272j25107
$$ 494959 300330 111723 169884 71410 125327 -239380 -313086 70175 385700 459972 334865
9982C34865k34333o8295m55208m4774L91309l8403j19665Q1579L24560M4530Q8356
$$ 334865 100532 32237 -422971 -467745 -76436 -114839 -234504 -152925 171635 216165 304521
9971C04521j18897J8431j7869O509k81589j6287j58322R0149N13995K88957o0121
$$ 304521 185624 204055 186186 192695 -88894 -105181 -263503 -173354 340641 629598 569477
9960E69477m77359k44758p050l22731J98790p8653L42748K64678j13108J41451
$$ 569477 92118 -152640 -159690 -482421 -283631 -362284 -19536 245142 132034 273485
9950B73485k8892m80972j25397J20220J45765N9587J3947k4473K49720j01904
$$ 273485 244593 -236379 -361776 -241556 -95791 -36204 -22257 -46730 202990 101086
9940A01086j81874K15885L52548q3268k04100M4703n7030J96656j41675j88301
$$ 101086 -80788 135097 487645 404377 200277 244980 187950 384606 242931 54630
9930E4630j3109J6448K36243j16058k35765l4375k48K79492L63264n3876k65876
$$ 54630 41521 57969 294212 178154 -57611 -91986 -92234 187258 550522 496646 230770
9919B30770k87476j5021o0329r4026k18580Q3952l4599M27953K3476j64183j45423
$$ 230770 -56706 -71727 -132056 -226082 -444662 -360710 -395309 32644 56120 -108063 -253486
9908b53486j4648j17634K16727M38388J5689J79804Q0510j37749O203l8929K43234
$$ -253486 -268134 -385768 -169041 269347 285036 464840 545350 407601 413804 374875 618109
9897F18109k49596k4062J83894J14723J74117l54594k0411K16285k75560j56917
$$ 618109 368513 344451 528345 643068 817185 462591 442180 658465 382905 225988
9887B25988Q7940K97029j877k68930K0375j89045J34869q1002J7506J76089P0301
$$ 225988 313928 610957 609080 340150 360525 171480 306349 225347 242853 418942 489243
9876D89243m44155k69152K36990J82543J46803j50845P5630j03663j87903j00196
$$ 489243 45088 -224064 12926 195469 342272 191427 267057 163394 -24509 -124705
9866a24705n7139K97617L08349j19503j17950L5829K8324j23210k01307j30794
$$ -124705 -181844 115773 424122 304619 186669 222498 250822 127612 -73695 -204489
9856b04489J85290L18661L2572r8207M7695J97325L45185j43175j3325q5328j65219
$$ -204489 -19199 299462 332034 233827 281522 478847 824032 680857 667532 582204 416985
9845D16985k48320j89631L1881N9457K59094J95502J14311l6477l6380k88205
$$ 416985 168665 -20966 10915 70372 329466 524968 639279 602802 566422 278217
9835B78217k46386K6341o0964k5871j39421p2553Q6088K90713J10186R589O4932
$$ 278217 31831 58172 -2792 -28663 -168084 -240637 -154549 136164 246350 255939 320871
9824C20871j6035k04942L4152J23064l4298J31753n2737j26477j69145p5436k87972
$$ 320871 304836 99894 134046 257110 222812 354565 301828 175351 6206 -69230 -357202
9813c57202N2217L7907L47079J68274P2641p2895J17407m2658j63039J26763n0126
$$ -357202 -304985 -267078 80001 248275 320916 248021 365428 322770 159731 286494 236368
9802B36368J4943k95550J67189K7964j30240K31989n1671O1174j71691j1210J04364
$$ 236368 251311 -44239 122950 150914 20674 252663 200992 262166 90475 79265 183629
9791A83629J2675P7138l2390m702r8014J68931l4821j9669k75058O7581J47059
$$ 183629 196304 273442 241052 236350 138336 307267 272446 252777 -22281 45300 192359
9780A92359k00717j9326K24018N27867J28209q496j46931m29349m53553J88890
$$ 192359 -8358 -27684 196334 724201 852410 843914 696983 267634 -185919 2971
9770B971M27960K33587n4197Q7981j32261k77858K5425J54272K29295M8719l58457
$$ 2971 430931 664518 610321 698302 566041 288183 313608 467880 697175 745894 387437
9759C87437m03418q9972l294J62151m291k06113K15990M60036K50308J23113j36691
$$ 387437 -15981 -105953 -109247 52904 48613 -157500 58490 518526 768834 891947 755256
9748G55256M04684k38039j17087o6304J7555P2522l573k24993M4513l7677J3422
$$ 755256 1159940 921901 804814 738510 756065 828587 825014 600021 644534 606857 620279
9737F20279P7685L09142l0272l20284j27823m6529j20682n7761o1807j90190Q9730
$$ 620279 697964 1007106 976834 656550 528727 482198 361516 303755 241948 51758 141488
9726A41488J81429K28781q023k22961l35662L98526L57369j7725O7605k10729
$$ 141488 322917 551698 543675 320714 -14948 383578 740947 723222 790827 580098
9716E80098L20878P7929j38227j27549K40714l2929J66636J64124j48247j90455
$$ 580098 900976 978905 840678 713129 953843 920914 1087550 1251674 1103427 912972
9706I12972l72541k04960K55379J50941M18504O1434O581P3264m23549J27673
$$ 912972 540431 335471 590850 741791 1160295 1221729 1228310 1301574 878025 1005698
9696A005698J31736l12674j07013P2234p4769P0784M3495J48082J02363p13J27927
$$ 1005698 1137434 824760 717747 789981 715212 785996 829491 977573 1079936 1079223 1207150
9685A207150k54337j60584l8768l1442J70139J54529r8215l75508r9052L37929
$$ 1207150 952813 792229 753461 722019 892158 1046687 948472 572964 473912 811841
9675H11841K40206Q7901j20163j30722K12081K67649j53890L7484Q4795K35081
$$ 811841 1052047 1139948 1019785 889063 1101144 1368793 1214903 1252387 1337182 1572263
9665A572263M55862K81502m31122k40911m37054n4984J97927J05165j02198l08426
$$ 1572263 2028125 2309627 1878505 1637594 1200540 1145556 1343483 1448648 1346450 1038024
9655A038024P5409K66117K9618K18365p2692N5884K57356K75801j48108j69857
$$ 1038024 1113433 1379550 1409168 1627533 1554841 1610725 1868081 2143882 1995774 1825917
9645A825917K51244j41590J96018N4940k40090K08787l5757j21874q5768Q8879
$$ 1825917 2077161 1935571 2131589 2186529 1946439 2155226 2119469 1997595 1911827 2000706
9635B000706L00131q4955J13722j1301N8877j39767j74469J82048K01740J58802
$$ 2000706 2300837 2215882 2329604 2318303 2377180 2237413 2062944 2244992 2446732 2605534
9625B605534j94605j36217k48958o6364J04196K98755K28091N479j65973L16861
$$ 2605534 2410929 2274712 2025754 1959390 2063586 2362341 2590432 2595911 2429938 2746799
9615B746799P0080M4021k78668o7933R5312k0371L04437L05230L88855l8502k65061
$$ 2746799 2816879 2860900 2582232 2514299 2609611 2589240 2893677 3198907 3587762 3549260 3284199
9604C284199m8501K696k4090j30985p2107L45058L77498L24159J09044k09990
$$ 3284199 3235698 3238394 3214304 3083319 3011212 3356270 3733768 4057927 4166971 3956981
9594C956981P2885k4696O3300j39306O8953J41988K0592m18421K1675K96693J65002
$$ 3956981 4029866 4005170 4068470 3929164 3998117 4140105 4160697 3742276 3763951 4060644 4225646
9583D225646k7551j69248K85610L83968J59173J53402J4054J35543K59708j73431
$$ 4225646 4198095 4028847 4314457 4698425 4857598 5011000 5025054 5160597 5420305 5246874
9573E246874k1255M67606L3637J3874J22363M6152o909L53449N43023j1132j63160
$$ 5246874 5225619 5693225 5726862 5740736 5863099 5909251 5902342 6255791 6798814 6787682 6624522
9562F624522j03283j22295P846J2338J77516K68651K70697N08221L95418K12689
$$ 6624522 6521239 6398944 6406790 6419128 6596644 6865295 7135992 7644213 8039631 8252320
9552H252320K03365k46531R4368J51776P01022M21186K85074O5177l3628J75715
$$ 8252320 8455685 8209154 8303522 8455298 9156320 9577506 9862580 9927757 9894129 10069844
9542A0069844N02440j83417p4598K95000J16145Q0736O06596K26915K48562J09933
$$ 10069844 10572284 10388867 10314269 10609269 10725414 10806150 11412746 11639661 11888223 11998156
9532A1998156M26421M55877L79676J59888J28728m8804O333M41079P27720P46712
$$ 11998156 12424577 12880454 13260130 13420018 13548746 13499942 13506275 13947354 14675074 15421786
9522A5421786K84605r4511K52401N15132J81313j03866N60016O18918K01758L14437
$$ 15421786 15706391 15611880 15864281 16379413 16560726 16456860 17016876 17635794 17837552 18151989
9512A8151989N32382L48079L63811M28731P32063O81370O22874J69460k702L15285
$$ 18151989 18684371 19032450 19396261 19824992 20557055 21238425 21861299 22030759 22028057 22343342
9502B2343342M45042M59176L45828M44002M50038M98260O02139O34619J91028
$$ 22343342 22788384 23247560 23593388 24037390 24487428 24985688 25587827 26222446 26413474
9493B6413474L56712N77745L81874K46629M08468M88558K63886K18886O62863
$$ 26413474 26770186 27347931 27729805 27976434 28384902 28873460 29137346 29356232 30019095
9484C0019095N97598M92837M71290M57440K61026K72917O3602J4536M70211J21632
$$ 30019095 30616693 31109530 31580820 32038260 32299286 32572203 32635805 32650341 33120552 33242184
9474C3242184N15470K24858N88453N18856K50844L44313J02818j95718k59064
$$ 33242184 33757654 33982512 34570965 35089821 35340665 35684978 35787796 35592078 35333014
9465C5333014J00696n5780O8138J10319M74772Q5184j89196j01751J2408J05870
$$ 35333014 35433710 35377930 35446068 35556387 36031159 36116343 35927147 35825396 35837804 35943674
9455C5943674J14449J62653K49541o1145l32521r029l44137k3958m4757q4257
$$ 35943674 36058123 36220776 36470317 36409172 36076651 36067622 35723485 35699527 35654770 35570513
9445C5570513j32830n28753l99751k13669l14578l4575J57834j04818j27455n5136
$$ 35570513 35437683 34908930 34509179 34295510 33980932 33946357 34104191 33999373 33871918 33816782
9435C3816782l91690l93504k08084j51574j80782j35771k52934m69525k92077
$$ 33816782 33425092 33031588 32823504 32671930 32491148 32355377 32102443 31632918 31340841
9426C1340841l26550n48806n66582m50012r3090l4019j38029l35K66542N1708
$$ 31340841 31014291 30465485 29898903 29448891 29355801 29321782 29183753 29183418 29449960 29501668
9416B9501668k99917m51479n03486p12529n83019q0543k62544M6129K1269k67871
$$ 29501668 29201751 28750272 28246786 27534257 26951238 26870695 26608151 26654280 26675549 26407678
9406B6407678l73490o51088k29693Q2547M5565r6991k56046k81369k40251k14486
$$ 26407678 26034188 25383100 25153407 25235954 25281519 25184528 24928482 24647113 24406862 24192376
9396B4192376n7740n41405l75529j25185J5015k63872p19167J0065Q5714l36774
$$ 24192376 24134636 23593231 23217702 23092517 23107532 22843660 22124493 22134558 22220272 21883498
9386B1883498j42242j22073p8794M242K40134k14829l78170j91542k89281j40464
$$ 21883498 21741256 21619183 21540389 21544631 21784765 21569936 21191766 21000224 20710943 20570479
9376B0570479j13027K01283J95514l6946m50533m35336l18202L6630K26739j78287
$$ 20570479 20457452 20658735 20854249 20817303 20366770 19931434 19613232 19649862 19876601 19698314
9366A9698314J2496j97899k21366J77921j80072p4653j71600n37636k64338l24747
$$ 19698314 19710810 19512911 19291545 19469466 19289394 19214741 19043141 18505505 18241167 17916420
9356A7916420j94042p1583Q0858K38422J48178M7084k02247k09327J33281J0871
$$ 17916420 17722378 17650795 17731653 17970075 18118253 18165337 17963090 17753763 17887044 17897915
9346A7897915o5838K04417o9264j93112j96049j1681L13116j29603l25036k05014
$$ 17897915 17832077 18036494 17967230 17774118 17578069 17566388 17879504 17749901 17424865 17219851
9336A7219851K91863L09886j38123K4008j61466k17820l04736j77471J38526L21944
$$ 17219851 17511714 17821600 17683477 17707485 17546019 17328199 17023463 16845992 16984518 17306462
9326A7306462m3712L4067J40684l2244J0240o9092j58051J3464K36658J74047
$$ 17306462 17262750 17296817 17437501 17405257 17415497 17346405 17188354 17201818 17438476 17612523
9316A7612523K10450Q1026j6262L1317q0825m5851O4335j02094k1087j89550J63213
$$ 17612523 17822973 17903999 17887737 17919054 17838229 17792378 17856713 17754619 17733532 17543982 17707195
9305A7707195K75465K98087k28988n9053n0964O4303J61513o2077R2508k32016
$$ 17707195 17982660 18280747 18051759 17992706 17941742 18006045 18167558 18105481 18197989 17965973
9295A7965973j9594r1478K00903M07815k86337k76121K5819J6080M33864L15761
$$ 17965973 17946379 17854901 18055804 18463619 18177282 17901161 17926980 17943060 18376924 18692685
9285A8692685k21611J88706J81777L44803K83019K44290l3176K7357J65010j32423
$$ 18692685 18471074 18659780 18841557 19186360 19469379 19713669 19680493 19707850 19872860 19740437
9275A9740437J6800m63094k88724l715j44163m47360J77589N03084R1105J26064
$$ 19740437 19757237 19294143 19005419 19001704 18857541 18410181 18587770 19090854 19181959 19308023
9265A9308023j3209K54740m02493l49997J99752J1074J43867k0812j76113j61341
$$ 19308023 19294814 19549554 19147061 18797064 18996816 19007890 19151757 19130945 18954832 18793491
9255A8793491k22031j40101M44529K25528J59885J52052j00632j56591L0853j93586
$$ 18793491 18571460 18431359 18875888 19101416 19261301 19413353 19312721 19156130 19186983 18993397
9245A8993397l2610K41755K7475l499k46508R0668J97819l33417o01321l88929
$$ 18993397 18960787 19202542 19230017 19226518 18980010 19070678 19268497 18935080 18333759 17944830
$$ [...]
##END NTUPLES=NMR SPECTRUM
##END=
