##TITLE=Analysis number 326499
Compound Code cc 53609
Book Reference 518/67
Project Code adrs
Chemist Name colinb
##JCAMPDX= 6.0         $$ Bruker NMR JCAMP-DX V2.0
##DATA TYPE= NMR SPECTRUM
##DATA CLASS= NTUPLES
##ORIGIN= Bruker BioSpin GmbH
##OWNER= nmr
$$ XWIN-NMR		Version 3.5
$$ Thu Feb  8 14:16:47 2007 GMT Standard Time (UT+0h)  MAYBRIDGE\nmr@NMR_250MHZ
##.OBSERVE FREQUENCY= 250.131544655141
##.OBSERVE NUCLEUS= ^1H
##.ACQUISITION MODE= SIMULTANEOUS (DQD)
##.ACQUISITION SCHEME= undefined
##.AVERAGES= 16
##.DIGITISER RES= 18
##SPECTROMETER/DATA SYSTEM= dpx250
##.PULSE SEQUENCE= zg30
##.SOLVENT NAME= CDCl3
##.SHIFT REFERENCE= (INTERNAL, CDCl3, 0, 16.522)
##AUDIT TRAIL= $$ (NUMBER, WHEN, WHO, WHERE, WHAT)
$$ ##TITLE= Audit trail, XWIN-NMR		Version 3.5
$$ ##JCAMPDX= 5.01
$$ ##ORIGIN= Bruker BioSpin GmbH
$$ ##OWNER= nmr
$$ C:\u/data/dgb/nmr/ADRS/530/pdata/1/auditp.txt
$$ ##AUDIT TRAIL=  $$ (NUMBER, WHEN, WHO, WHERE, WHAT)
(   1,<2007-02-08 14:16:11.64 +000>,<MAYBRIDGE\nmr>,<NMR_250MHZ>,
      <created by zg, POWCHK disabled, PULCHK disabled
       configuration hash MD5:
       49 4B E0 1D 92 C2 6B 37 9F E6 65 BC 52 41 86 1D
       data hash MD5: 64K
       02 91 BB 18 20 7A BC 9D E4 A2 82 4A 56 08 84 FF>)
(   2,<2007-02-08 14:16:35.37 +000>,<MAYBRIDGE\nmr>,<NMR_250MHZ>,
      <Start of raw data processing
       ef LB = 0.3 FT_mod = 6 PKNL = 1 SI = 32K 
       data hash MD5: 32K
       1E 15 81 8D CE E2 20 E1 FF C8 9F D6 2F CB A1 74>)
(   3,<2007-02-08 14:16:38.93 +000>,<MAYBRIDGE\nmr>,<NMR_250MHZ>,
      <apk 
       data hash MD5: 32K
       30 18 3E 6E A8 E2 44 F2 6A FC E6 21 DC 45 50 04>)
(   4,<2007-02-08 14:16:40.26 +000>,<MAYBRIDGE\nmr>,<NMR_250MHZ>,
      <abs ABSG = 5 
       data hash MD5: 32K
       30 E7 76 07 7A E1 3A 1B 7B 51 E6 AB 35 E7 BE F6>)
$$ ##END=
$$ 
$$ hash MD5
$$ 5C AD C5 DB 1C A7 DF 6F 7A 7A 97 C0 0D D8 C5 6C
##$RELAX= 
##$RELAX= 
##$RELAX= 
##$RELAX= 
##$RELAX= 
##$RELAX= 
##$RELAX= 
$$ Bruker specific parameters
$$ --------------------------
##$DU= <C:\u>
##$EXPNO= 530
##$NAME= <ADRS>
##$PROCNO= 1
##$TYPE= <nmr>
##$USER= <dgb>
##$AMP= (0..31)
100 100 100 100 100 100 100 100 100 100 100 100 100 100 100 100 100 100 
100 100 100 100 100 100 100 100 100 100 100 100 100 100 
##$AQSEQ= 0
##$AQ_mod= 3
##$AUNM= <au_zg>
##$AUTOPOS= <32 >
##$BF1= 250.13
##$BF2= 250.13
##$BF3= 250.13
##$BF4= 250.13
##$BF5= 500.13
##$BF6= 500.13
##$BF7= 500.13
##$BF8= 500.13
##$BYTORDA= 1
##$CFDGTYP= 0
##$CFRGTYP= 5
##$CHEMSTR= <none>
##$CNST= (0..31)
1 1 145 1 1 1 1 1 1 1 1 1 1 1 1 1 1 1 1 1 1 1 1 1 1 1 1 1 1 1 1 1 
##$CPDPRG= <>
##$CPDPRG1= <>
##$CPDPRG2= <>
##$CPDPRG3= <>
##$CPDPRG4= <mlev>
##$CPDPRG5= <mlev>
##$CPDPRG6= <mlev>
##$CPDPRG7= <mlev>
##$CPDPRG8= <mlev>
##$CPDPRGB= <>
##$CPDPRGT= <>
##$D= (0..31)
0 1 0 0 0 0 0 0 0 0.06 0 0 0 0 0 0 0.0002 0 0 0 0 0 0 0 0 0 0 0 0 0 0 
0 
##$DATE= 1170944170
##$DBL= (0..7)
120 120 120 120 120 120 120 120 
##$DBP= (0..7)
150 150 150 150 150 150 150 150 
##$DBP07= 0
##$DBPNAM0= <>
##$DBPNAM1= <>
$$ [...]
##$SUBNAM7= <"">
##$SUBNAM8= <"">
##$SUBNAM9= <"">
##$SW= 20.6930455092707
##$SWIBOX= (0..15)
0 0 3 0 0 0 0 0 0 0 0 0 0 0 0 0 
##$SW_h= 5175.983436853
##$TD= 65536
##$TD0= 1
##$TE= 294.16
##$TE2= 300
##$TE3= 300
##$TEG= 300
##$TL= (0..7)
0 120 120 120 120 120 120 120 
##$TP= (0..7)
150 150 150 150 150 150 150 150 
##$TP07= 0
##$TPNAME0= <>
##$TPNAME1= <>
##$TPNAME2= <>
##$TPNAME3= <>
##$TPNAME4= <>
##$TPNAME5= <>
##$TPNAME6= <>
##$TPNAME7= <>
##$TPOAL= (0..7)
0.5 0.5 0.5 0.5 0.5 0.5 0.5 0.5 
##$TPOFFS= (0..7)
0 0 0 0 0 0 0 0 
##$TUNHIN= 0
##$TUNHOUT= 0
##$TUNXOUT= 0
##$USERA1= <user>
##$USERA2= <user>
##$USERA3= <user>
##$USERA4= <user>
##$USERA5= <user>
##$V9= 5
##$VALIST= <valist>
##$VCLIST= <CCCCCCCCCCCCCCC>
##$VD= 0
##$VDLIST= <DDDDDDDDDDDDDDD>
##$VPLIST= <PPPPPPPPPPPPPPP>
##$VTLIST= <TTTTTTTTTTTTTTT>
##$WBST= 1024
##$WBSW= 4
##$XGAIN= (0..3)
0 0 0 0 
##$XL= 0
##$YL= 0
##$YMAX_a= 231555
##$YMIN_a= -332468
##$ZGOPTNS= <>
##$ZL1= 120
##$ZL2= 120
##$ZL3= 120
##$ZL4= 120
##$ABSF1= 16.522
##$ABSF2= -4.171173
##$ABSG= 5
##$ABSL= 3
##$ALPHA= 0
##$AQORDER= 0
##$ASSFAC= 0
##$ASSFACI= 0
##$ASSFACX= 0
##$ASSWID= 0
##$AUNMP= <proc_1d>
##$AZFE= 0.1
##$AZFW= 0.1
##$BCFW= 0
##$BC_mod= 0
##$BYTORDP= 0
##$COROFFS= 0
##$CY= 12.5
##$DATMOD= 1
##$DC= 0
##$DFILT= <>
##$DTYPP= 0
##$F1P= 14.0000005364418
##$F2P= -0.99999901652339
##$FCOR= 0.5
##$FTSIZE= 32768
##$FT_mod= 6
##$GAMMA= 0
##$GB= 0
##$INTBC= 1
##$INTSCL= 1
##$ISEN= 128
##$LB= 0.3
##$LEV0= 0
##$LPBIN= 0
##$MAXI= 10000
##$MC2= 0
##$MEAN= 0
##$ME_mod= 0
##$MI= 0
##$NCOEF= 0
##$NC_proc= -4
##$NLEV= 6
##$NOISF1= 0
##$NOISF2= 0
##$NSP= 0
##$NTH_PI= 0
##$NZP= 0
##$OFFSET= 16.522
##$PC= 1
##$PHC0= 235.2334
##$PHC1= 9.316793
##$PH_mod= 1
##$PKNL= yes
##$PPARMOD= 0
##$PSCAL= 4
##$PSIGN= 0
##$REVERSE= no
##$SF= 250.13
##$SI= 32768
##$SIGF1= 0
##$SIGF2= 0
##$SINO= 400
##$SIOLD= 32768
##$SREGLST= <1H.CDCl3>
##$SSB= 0
##$STSI= 32768
##$STSR= 0
##$SW_p= 5175.98343685301
##$SYMM= 0
##$S_DEV= 0
##$TDeff= 65536
##$TDoff= 0
##$TI= <Analysis number 999999
Compound Code 99
Book Reference 9
Project Code 9>
##$TILT= no
##$TM1= 0
##$TM2= 0
##$TOPLEV= 0
##$USERP1= <user>
##$USERP2= <user>
##$USERP3= <user>
##$USERP4= <user>
##$USERP5= <user>
##$WDW= 1
##$XDIM= 32768
##$YMAX_p= 307545839
##$YMIN_p= -452461
$$ End of Bruker specific parameters
$$ ---------------------------------
##NTUPLES= NMR SPECTRUM
##VAR_NAME=  FREQUENCY,     SPECTRUM/REAL,   SPECTRUM/IMAG
##SYMBOL=    X,             R,               I
##VAR_TYPE=  INDEPENDENT,   DEPENDENT,       DEPENDENT
##VAR_FORM=  AFFN,          ASDF,            ASDF
##VAR_DIM=   32768,         32768,           32768
##UNITS=     HZ,            ARBITRARY UNITS, ARBITRARY UNITS
##FACTOR=    0.157963299565203, 1,           1
##FIRST=     4132.6476996994, 0,             0
##LAST=      -1043.33573715361, 0,           0
##MIN=       -1043.33573715361, -452461,     0
##MAX=       4132.6476996994, 307545839,     0
$$ Real data points
##PAGE= N=1
##DATA TABLE= (X++(R..R)), XYDATA
$$ [...]
23516A76418j03413q6015P5687K9264L0771N6039n2026j4771p4561j04940o1992
$$ 176418 73005 -13010 62677 91941 122712 178751 126725 111954 37393 -67547 -129539
23505a29539k0069J39939R6745J07345l8660j94090j29033k4924L2716J05391
$$ -129539 -149608 -9669 87076 194421 155761 -38329 -167362 -192286 -159570 -54179
23495e4179j0390j43764j19978K03782J21348P9010J1167l7705O7037J35947K1591
$$ -54179 -64569 -208333 -328311 -124529 -3181 75829 86996 49291 116328 252275 273866
23484B73866j05175j99930K7007q7290j27091M4720N7480M1689l667k8944L4894
$$ 273866 168691 -31239 -4232 -91522 -218613 -173893 -116413 -74724 -78391 -107335 -72441
23473g2441R1779J14054J0558j24060j02750o2310N9431N6221l457R0817k0912
$$ -72441 19338 133392 143950 19890 -82860 -145170 -85739 -29518 -32975 57842 36930
23462C6930J7874p6049O8388R335j566K6412n557K4491n5878L5199L9410j21130
$$ 36930 54804 -21245 47143 56478 54912 81324 75767 100258 44380 79579 118989 -2141
23450b141J1496P2430J10472p509K6056m952q5046j67891j48785q8872K3641J14468
$$ -2141 9355 81785 192257 184748 210804 205852 120806 -47085 -195870 -284742 -261101 -146633
23438a46633o9032K4425O0569R0525J12637o9444r5827m4175j02455J6980L5807
$$ -146633 -215665 -191240 -130671 -40146 72491 3047 -92780 -136955 -239410 -222430 -186623
23427a86623N5801l6060l7783L4855N5007J82350M4953r3193j09193n0923K4090
$$ -186623 -130822 -166882 -204665 -169810 -114803 67547 112500 19307 -89886 -140809 -116719
23416a16719L262n364q297j3160M5977l5856N4772M1995L6899P5472m5636m2484
$$ -116719 -113457 -118821 -127118 -140278 -94301 -130157 -75385 -33390 3509 78981 33345 -9139
23404i139l6315p4067K0439J61700q8038m4507O9547q8133P1260P654p4948L0398
$$ -9139 -45454 -119521 -99082 62618 -25420 -69927 -380 -88513 -17253 -9599 -84547 -54149
23392e4149k3983k1666Q8956j2683j10539n5428J30667J33366k2796O0946l0145
$$ -54149 -78132 -99798 -10842 -23525 -134064 -189492 -58825 74541 51745 112691 82546
23381H2546j36070o6483l063n216M8038n4377k2530P2462j308J7799N1408O1001
$$ 82546 -53524 -120007 -123070 -128286 -80248 -134625 -157155 -84693 -86001 -68202 -16794 44207
23369D4207J723j44157q8199k7005n989l0089J01512J59854q8462J3968L9735
$$ 44207 45930 -98227 -186426 -213431 -219420 -249509 -147997 11857 -76605 -62637 -22902
23358b2902j09409p2080M1388K9808M7286J0793N2307R3880Q266j31122o8722
$$ -22902 -132311 -204391 -163003 -133195 -85909 -75116 -22809 71071 79337 -51785 -120507
23347a20507L0972j3192L834J18877O8289j15308p6392P2499n7718j31004O5561
$$ -120507 -89535 -102727 -98893 19984 88273 -27035 -103427 -30928 -88646 -219650 -154089
23336a54089K22861K153l2393m3523p8704j09724m8697M1394L0336J11021M5111
$$ -154089 68772 70925 38532 -4991 -83695 -193419 -242116 -200722 -170386 -59365 -14254
23325a4254l0141j7846J4979j535K6231j42359p6688L01J33727K2938o2691q2728
$$ -14254 -44395 -62241 -47262 -48797 -22566 -164925 -241613 -241312 -107585 -84647 -147338 -230066
23313b30066K5153Q9726O0540j7366l462J1692Q069j32325J3556j6208K7734J8458
$$ -230066 -204913 -115187 -54647 -72013 -75475 -63783 -55714 -188039 -174483 -190691 -162957 -144499
23301a44499r8888M3888J14631N5652n4910J06848N0360q4504k6084J34649K06
$$ -144499 -243387 -199499 -84868 -29216 -84126 22722 73082 -11422 -37506 97143 97349
23290I7349j9231p1386j06978L6004L5186j2881L0414J09063k8897n9268q1723
$$ 97349 78118 6732 -100246 -64242 -29056 -41937 -11523 97540 68643 9375 -72348
23279g2348p1923M6280O6892Q6958q233N2492P988L0071l6730K1550p0716M2578
$$ -72348 -144271 -97991 -31099 55859 47626 100118 108106 138177 101447 122997 52281 94859
23267I4859K683l3409n9865j08362o3528m1574J03524O1146k472k8063Q6382P3301
$$ 94859 97542 64133 4268 -104094 -167622 -209196 -105672 -44526 -46998 -75061 11321 84622
23255H4622N9314J1283J3699j931l1128j8853j00509k7938N9368J57522R2915
$$ 84622 143936 155219 168918 166987 135859 117006 16497 -11441 47927 205449 298364
23244B98364j17886q6431j37687j00047M743R0930R0326q3604j63347M392J5858
$$ 298364 180478 94047 -43640 -143687 -138944 -48014 42312 -41292 -204639 -200247 -184389
23233a84389J2540R9586o708j6999J88709J3464m7906n494j1646n2947N4823k374
$$ -184389 -171849 -72263 -78971 -95970 92739 106203 58297 52803 41157 -11790 43033 40659
23221D0659O932m2550M3542j12559j19076M953M654J45707J6799o3044j09426
$$ 40659 47591 5041 48583 -63976 -183052 -178099 -173445 -27738 -10939 -73983 -183409
23210a83409N7467J38853K560o8701k0020O6854N1074J9130j38178q1682R465
$$ -183409 -125942 12911 15471 -53230 -73250 -6396 44678 63808 -74370 -156052 -146587
23199a46587o1656L2575K8695O4171L7741Q8364j7309o4203j8307n6996O707o250
$$ -146587 -208243 -175668 -146973 -82802 -45061 43303 25994 -38209 -56516 -113512 -106805 -113055
23187a13055M0525N8274J00131o8560r9014P3997J5842K1219o0215J09103J2602
$$ -113055 -72530 -14256 85875 17315 -81699 -7702 8140 29359 -30856 78247 90849
23176I0849o8031K3115R0376J5502j61946l5806J14231J38468k9011j23280q1369
$$ 90849 22818 45933 136309 151811 -10135 -45941 68290 206758 177747 54467 -26902
23165b6902j6498j25912j9519p9405m1309Q6774M3506P8659J78067n506N1119
$$ -26902 -43400 -169312 -188831 -268236 -309545 -222771 -179265 -100606 77461 71955 123074
23154A23074r4375j6247K1947r9796l1020Q5298M1772r168l0053O3932j3268j21492
$$ 123074 28699 12452 34399 -65397 -96417 -11119 30653 21485 -8568 55364 42096 -79396
23142g9396N5599J20616j02494J3122J22554K8168r5996q4040r971p1003l7464
$$ -79396 -23797 96819 -5675 7447 130001 158169 62173 -21867 -31838 -102841 -140305
23131a40305J11245J10167j18747J3967Q9409J20254J14836j09352q7049M3827
$$ -140305 -29060 81107 -37640 -23673 65736 185990 300826 191474 104425 148252
23121A48252J7294o9237j52601r9594K9859O5661O9063L3824Q5507k2481j03058
$$ 148252 165546 96309 -56292 -155886 -126027 -60366 8697 42521 128028 105547 2489
23110B489L9985k3332N0910J69530L3323j38627j64746N7999r8673m9061N2522
$$ 2489 42474 19142 70052 239582 272905 134278 -30468 27531 -71142 -120203 -67681
23099f7681P6683M7171p7871j49883o3513L2274R7453O0406o5384r3221J6812
$$ -67681 9002 56173 -21698 -171581 -235094 -202820 -105367 -44961 -110345 -203566 -186754
23088a86754L7765R1337N8359J57413l0046l1034K6789n503l7161Q6532J05909
$$ -186754 -148989 -57652 707 158120 128074 97040 123829 118326 81165 167697 273606
23077B73606L108j45386m5786L6562n6990j57552k15701n0880J27562R4356P5474
$$ 273606 276714 131328 85542 122104 65114 -92438 -308139 -359019 -231457 -137101 -61627
23066f1627N3227m040m8491r8219K9658L6397j03307j3824P5943O8874M2940J21162
$$ -61627 -8400 -12440 -60931 -159150 -129492 -93095 -196402 -210226 -134283 -65409 -22469 98693
23054I8693N3945m7420j24276R8098K51267l8870j05765m0316j02453j5648j90173
$$ 98693 152638 105218 -19058 79040 330307 291437 185672 145356 42903 27255 -162918
23043a62918o9348J90953J7679r0611M93J1088L2924Q7210K1992k1345l7628k3969
$$ -162918 -232266 -41313 -23634 -114245 -113752 -102664 -69740 17470 39462 18117 -19511 -43480
23031d3480M3175L0969P9492j63048j08762J38400R7454r1890n42o7482k16006
$$ -43480 -305 30664 110156 -52892 -161654 -23254 74200 -17690 -18232 -85714 -301720
23020c01720J03205Q8242p1808l04R9520J0916o5691J20341P4667K5603n7393
$$ -301720 -198515 -110273 -182081 -182385 -82865 -71949 -137640 -17299 57368 82971 25578
23009B5578k3191L0309j9939k092M0837p1310j44956j3988P5539Q0537Q6157J06190
$$ 25578 2387 32696 12757 10665 51502 -19808 -164764 -178752 -103213 -22676 63481 169671
22997A69671j14052o1517L4828l4430j48871o8971J8051L8589J19887Q5484M882
$$ 169671 55619 -5898 28930 -5500 -154371 -223342 -205291 -166702 -46815 38669 43551
22986D3551K9152m4921J3921k4407p578L1214K957M1492Q5214o7118p1420l2420
$$ 43551 72703 27782 41703 17296 9718 40932 43889 85381 170595 103477 32057 -363
22974c63k1461j8444K5819N8813L8840p6635p453N584j52418j52358J5657J57712
$$ -363 -21824 -40268 -14449 44364 83204 6569 -884 4700 -147718 -300076 -284419 -126707
22962a26707J54945M3135R3354N8115m0080j23463J4747j2189K9928j00242m6796
$$ -126707 28238 71373 164727 222842 182762 59299 74046 61857 91785 -8457 -55253
22951e5253L7276J5884n6205j14679M5960O1673K471L6117o6377o4297R3001J1510
$$ -55253 -17977 -2093 -58298 -172977 -127017 -65344 -62873 -26756 -93133 -157430 -64429 -52919
22939e2919n5958o3793p9J09334K7813N1484R5254o2313j35524l0690R5843J09078
$$ -52919 -108877 -172670 -172749 -63415 -35602 15882 111136 48823 -86701 -117391 -21548 87530
22927H7530j75143j48555O6328r1009l642Q1487R5482j3224L667J64526N4289
$$ 87530 -87613 -236168 -169840 -260849 -264491 -183004 -87522 -100746 -97079 67447 121736
22916A21736k8578j56855j2473N1094J169j24350n04K7410L2153p8799l9859Q3687
$$ 121736 93158 -63697 -76170 -25076 -23907 -148257 -148761 -121351 -89198 -167997 -207856 -124169
22904a24169R446M4608N2680J1664q122j61791M4098J32916m4424O490J7609K8609
$$ -124169 -114723 -70115 -17435 -5771 -13893 -175684 -131586 1330 -43094 -36604 -18995 9614
22892I614M4356K5977j4830j9664j31414j6857O0920P0509l918n1108L9443R0223
$$ 9614 53970 79947 65117 45453 -85961 -102818 -41898 28611 24693 -26415 13028 103251
22880A03251P000n1187k6216J1245o3201j88975j55281P2502P8247L5886k0123
$$ 103251 110251 59064 32848 44093 -19108 -208083 -363364 -290862 -212615 -176729 -196852
22869a96852N3121J16004r2695K9852J28170K593p4310m6806R4337J25047m0130
$$ -196852 -143731 -27727 -120422 -90570 37600 40193 -34117 -80923 13414 138461 98331
22858I8331M1829J6202j16561r0397j9195L361N511k0107k1799K2594m1421j04145
$$ 98331 140160 156362 39801 -50596 -69791 -66430 -60919 -81026 -102825 -80231 -121652 -225797
22846b25797J15537O2377O311j9858o5780O1891J17586J01123j18491n7342l5196
$$ -225797 -110260 -47883 -41572 -61430 -127210 -65319 52267 153390 34899 -22443 -57639
22835e7639o9541j8724J715M3590N0782L9364N3282J3229L8694r0407q2074l634
$$ -57639 -127180 -145904 -144189 -100599 -49817 -10453 42829 56058 94752 4345 -77729 -81363
22823h1363M9441l517M0243J05915n3524m1914M1499l9224l7711Q6791j5111K3420
$$ -81363 -31922 -35439 4804 110719 57195 15281 56780 17556 -20155 66636 51525 74945
22811G4945O6918p1858j5961o9739n1951L2089J18555K3532m9661j1164j909J2809
$$ 74945 141863 70005 54044 -15695 -67646 -35557 82998 106530 56869 45705 43796 56605
22799E6605M991m536k0592p1674N6050N2305O0987L6543K1397m158j24296j5326
$$ 56605 61596 57060 36468 -35206 20844 73149 134136 170679 192076 187918 63622 48296
22787D8296J29749m7355j13111j10091J10024Q5463n1272k5158K069k3735m7304
$$ 48296 178045 130690 17579 -92512 17512 102975 51703 26545 28614 4879 -42425
22776d2425o0147J17636J8666k9030o8699J4028J19120K905J2402l4439P8982
$$ -42425 -102572 15064 33730 4700 -63999 -49971 69149 72054 84456 50017 128999
22765A28999M6958q9772r2325P1985m3109j14597N9950n5041j54043o5935R2936
$$ 128999 175957 86185 -6140 65845 22736 -91861 -31911 -86952 -240995 -306930 -213994
22754b13994J30075K5722n023J18489l7649l4964q4616o6743M6641l3226J00823
$$ -213994 -83919 -58197 -63220 55269 17620 -17344 -101960 -168703 -122062 -155288 -54465
22743e4465J61173n4296P873l9748r0912M8544M3814L0897O0935k9404j14834
$$ -54465 106708 52412 60285 20537 -70375 -21831 21983 52880 113815 84411 -30423
22732c0423K8584p351p7963j5768j6465m1117R6567N9809k9001j3795m288l8230
$$ -30423 -1839 -9190 -87153 -102921 -119386 -160503 -63936 -4127 -33128 -46923 -51211 -89441
22720h9441J0515j2457J8955M3906j0606l6410o2727J0728J02561n1703N0007
$$ -89441 -78926 -91383 -72428 -28522 -39128 -75538 -138265 -127537 -24976 -76679 -26672
22709b6672Q9692J9698L2065l1918j62539m4824N3041J1655l8483k7608L4550
$$ -26672 63020 82718 114783 82865 -79674 -124498 -71457 -59802 -98285 -125893 -91343
22698i1343J03414o1179k9477j7265k2601M5043J20277Q9826K0829m5650q8521
$$ -91343 12071 -49108 -78585 -95850 -118451 -73408 46869 136695 157524 111874 23353
22687B3353k9700j9358k9895K3751k9214o695J3130K5504j9428M1811m6526J25409
$$ 23353 -6347 -25705 -55600 -31849 -61063 -67758 -54628 -29124 -48552 -6741 -53267 72142
22675G2142N5685l8803j5417j680j9525j22165l9844P9375J80682J03982r850
$$ 72142 127827 89024 73607 71927 52402 -69763 -109607 -30232 150450 254432 244582
22664B44582m0874q411K9105j56208j18229j61P7913k9769o6873L9840K5901J1108
$$ 244582 203708 195297 224402 68194 -50035 -50196 27717 -2052 -68925 -29085 -3184 7924
22652G924M7911O5033l2093k4596R8487l915j37303M3483M1573J4197r2820j38261
$$ 7924 55835 120868 88775 64179 162666 158751 21448 64931 106504 120701 27881 -110380
22640a10380L8284K7379L5394J21381o0347j37036l4268L4833J4355N2676J47507
$$ -110380 -72096 -44717 -9323 112058 51711 -85325 -119593 -84760 -70405 -17729 129778
22629A29778J2387j55949q3189Q644M7147O8958P108n0579k2526j8008J42262
$$ 129778 142165 -13784 -96973 -88329 -41182 27776 34884 -15695 -38221 -56229 86033
22618H6033M7671N0257r3319r7506j777R2310j3525K1153M1256O2373N5599j17996
$$ 86033 133704 183961 90642 -6864 -8641 83669 70144 91297 132553 194926 250525 132529
22606A32529r6841J6502k7872k9267j24144O845J08629J02691R34m260m0099N2996
$$ 132529 35688 52190 24318 -4949 -129093 -122248 -13619 89072 90006 85746 45647 98643
22594I8643l1698m4464n6563O0377m0330k7406L7607Q2117J079P0304q796L4136
$$ 98643 66945 22481 -34082 26295 -14035 -41441 -3834 78283 79362 149666 140870 175006
22582A75006r8052m2003p9347n3872n2666r5954N3783R5550J55786m4014o9379
$$ 175006 76954 34951 -44396 -98268 -150934 -246888 -193105 -97555 58231 14217 -55162
22571e5162n504K849O2886k3462M892O8741J37698K3016q3851j35647n5068J44477
$$ -55162 -60666 -57817 5069 -18393 -13501 55240 192938 215954 132103 -3544 -58612 85865
22559H5865O5535L1437J1462j06769j16613J2260M2055l6289m2476n1406J6663
$$ 85865 151400 182837 194299 87530 -29083 -16823 25232 -11057 -53533 -104939 -88276
22548h8276N7991n51N2411k1116o1859M5804J4464P5814M3476q1206j12015O0675
$$ -88276 -30285 -30836 21575 459 -61400 -15596 -1132 74682 118158 36952 -75063 -14388
22536a4388k369j63283o3106J1359K750P5614Q6779q7611k8939J34029M3808L6752
$$ -14388 -16757 -180040 -243146 -231787 -229037 -153423 -66644 -154255 -183194 -49165 -5357 31395
22524C1395q4538M4138J04981N5438k4099j08358j00417K0983P4886R7j02837
$$ 31395 -53143 -9005 95976 151414 127315 18957 -81460 -60477 14409 14506 -88331
22513h8331O8154k562q5138m5205N4592j01546l3203O9690J83185J17725k1922
$$ -88331 -20177 -22739 -107877 -153082 -98490 -200036 -233239 -163549 19636 137361 115439
22502A15439j30364m0675m2004J14170o6193J7089k9729j6394R5101k2342p5835
$$ 115439 -14925 -55600 -97604 16566 -49627 -32538 -62267 -78661 16440 -5902 -81737
22491h1737K100J2787N8089M492j50152k926O1437n3975P2112R991O5105J24942
$$ -81737 -79637 -66850 -8761 -4269 -154421 -157347 -95910 -149885 -77773 -67782 -2677 122265
22479A22265n7344j67147p4416k2327j10864M4083O5067m7788O0504O6360M5835
$$ 122265 64921 -102226 -176642 -198969 -309833 -265750 -200683 -248471 -187967 -121607 -75772
22468g5772k4075N8048Q6897J14480P328k6992N328j37720R7639Q832j29446L8491
$$ -75772 -99847 -41799 45098 159578 166906 139914 145242 7522 105161 113993 -15453 23038
22456B3038J05580L2848m8264j00107L0668M9086m4993r3206R9489P9213r0507
$$ 23038 128618 161466 113202 13095 43763 92849 47856 -45350 54139 133352 42845
22445D2845k4690k1362k245m6263q6160K2234J6305O5644N7726Q3192M6237j8954
$$ 42845 18155 -3207 -5452 -51715 -137875 -115641 -99336 -33692 24034 107226 153463 134509
22433A34509l2177j49363r7889M5624k9404P3351o7954l9778P2573O6304N2967
$$ 134509 102332 -47031 -144920 -99296 -128700 -55349 -123303 -163081 -90508 -24204 28763
22422B8763M613K1307l244K7143L3787L3453j22722j26906J3269J45737q809j10329
$$ 28763 33376 54683 51439 78582 112369 145822 23100 -103806 -90537 55200 46391 -63938
22410f3938k1404o5203l8338J39423J32919J0140J8341M7029o2203R688M130j2259
$$ -63938 -85342 -150545 -188883 -49460 83459 93599 111940 158969 96766 106454 110584 98325
22398I8325j0462j02566n7871l964K051L3549M8872P5002j23817n3830M1147M0718
$$ 98325 87863 -14703 -72574 -76538 -74487 -40938 7934 82936 -40881 -94711 -53564 -12846
22386a2846N6614Q4643K1761L8764L1433m3707j77086j0681M4655R1620r1133
$$ -12846 43768 128411 150172 188936 220369 176662 -424 -11105 33550 125170 34037
22375C4037K6415K8326K9685m2220p1233p1857m249R6146k0584k7800L152M3438
$$ 34037 60452 88778 118463 76243 5010 -66847 -71096 25050 4466 -23334 -20182 23256
22363B3256J07800l5202m8961r1559m3179j545N1748j93487p9409N2431L5691
$$ 23256 131056 95854 46893 -44666 -87845 -89390 -37642 -231129 -310538 -258107 -222416
22352b22416P195L3757k6797J49777P4567p7287M962K4037Q4676P3379J0339j28685
$$ -222416 -215221 -181464 -208261 -58484 16083 -61204 -56242 -32205 52471 125850 136189 7504
22340G504L9837M5449l1650p2545M4164R6670n6944j6554l5905j73703p7472J13342
$$ 7504 47341 92790 61140 -11405 32759 129429 72485 55931 20026 -153677 -231149 -117807
22328a17807J90813Q9348j07599r8801R4810J09635j8608j28477k0499o0592p6283
$$ -117807 73006 162354 54755 -44046 50764 160399 141791 13314 -7185 -67777 -144060
22317a44060o0393O454r4122k2971N0795R0326M4306M531k1614p6119J0807J11748
$$ -144060 -204453 -197999 -292121 -315092 -264297 -173971 -129665 -125134 -146748 -222867 -212060 -100312
22305a00312M692j6893p7986J72859Q9054j2359J539R868l1961l4136l8481n987
$$ -100312 -95620 -112513 -190499 -17640 71414 59055 60594 70462 38501 4365 -34116 -40103
22293d0103Q0947J12313J1228J9314n3385n2951n1511m2806O7897j02767m1928
$$ -40103 40844 153157 164385 183699 130314 77363 25852 -16954 50943 -51824 -93752
22282i3752P5168J16307j79n1247k3372n4725j16233P178O8745J2870o1706j30314
$$ -93752 -18584 97723 97544 46297 22925 -31800 -148033 -140855 -72110 -59240 -120946 -251260
22270b51260N6187J7787l8034J7570r457M5139Q3722J23027m8718J7400o7637
$$ -251260 -195073 -177286 -215320 -197750 -207207 -162068 -78346 44681 -4037 13363 -54274
22259e4274q991P6722j22691j1564J01205l2017N8129Q2775N5122q0280n8091
$$ -54274 -63265 13457 -109234 -120798 -19593 -51610 6519 89294 144416 64136 6045
22248F045l4431J15010N7650q7483k6901N0003N8421j90305L8911L5317m0317
$$ 6045 -28386 86624 144274 56791 29890 79893 138314 -51991 -13080 22237 -18080
22237a8080k3839p0573p9251Q0791N3061k5932M1655J6389m541k2528M880k09915
$$ -18080 -41919 -112492 -191743 -110952 -57891 -83823 -42168 -25779 -30320 -52848 -47968 -257883
22225b57883j47238J38818J15939o042K9432n4790L7857J82163P0240P9432K3254
$$ -257883 -405121 -266303 -150364 -156406 -126974 -181764 -143907 38256 108496 187928 211182
22214B11182p3506n9290m4162m8910j10763n4158J37830K3388J8995o1569O762
$$ 211182 137676 78386 34224 -14686 -125449 -179607 -41777 -18389 606 -60963 -54201
22203e4201M5180n613m9616J3617P7335o0159p4988o6843O5316k2330O7469J67779
$$ -54201 -9021 -14634 -64250 -50633 26702 -33457 -108445 -175288 -109972 -132302 -64833 102946
22191A02946o4301q8334j18966J72084L5949p6585m670n360Q1863k27874p6202
$$ 102946 38645 -49689 -168655 3429 39378 -37207 -41877 -47237 34626 -193248 -269450
22180b69450J4507L3026J88933O7669J02207l6549j64651j90823k0865J2866J41021
$$ -269450 -254943 -221917 -32984 34685 136892 100343 -64308 -255131 -275996 -263130 -122109
22169a22109J48760J19098p0800n7133m754J510O9287M3680j28447k5974n2404
$$ -122109 26651 145749 74949 17816 13062 14572 83859 127539 -908 -26882 -79286
22158g9286n0627K4860n2463k3580j5060N9449L9519J02661R8381k8934q4572
$$ -79286 -129913 -105053 -157516 -181096 -196156 -136707 -97188 5473 103854 74920 -9652
22147i652n7488q827o3368O0707j89944K923J93924M9192M977P133n8404p6873
$$ -9652 -67140 -75967 -139335 -78628 -268572 -265649 -71725 -22533 -17556 -10423 -68827 -145700
22135a45700l3261N2763R4454P2771L6595j17865M510N2790J5908K5174j26744
$$ -145700 -178961 -126198 -31744 41027 77622 -40243 -35733 17057 32965 58139 -68605
22124f8605j59675N6750J40410j1423J203p5J29712J29528j29482o8166r084k0174
$$ -68605 -228280 -171530 -31120 -42543 -41340 -41415 88297 217825 88343 20177 11093 -9081
22112i081r2582j22378q9881J19699J54702J47289J01183M7845M4874k7769n6487
$$ -9081 -101663 -224041 -313922 -194223 -39521 107768 208951 256796 301670 273901 217414
22101B17414j74376n7222m7211R921L6686R2583Q413P1470l2966J2861p4050r9540
$$ 217414 43038 -14184 -61395 -51474 -14788 77795 86208 157678 124712 137573 63523 -36017
22089c6017l9264L9721M3931M9605p918n7459J6946M8263n2064j33402k1344K0370
$$ -36017 -75281 -35560 8371 57976 50058 -7401 9545 57808 5744 -127658 -149002 -128632
22077a28632R3089m5786m8818J1997K8034r7554r5829R304J5203M8441R1475R2513
$$ -128632 -35543 -81329 -130147 -118150 -90116 -187670 -283499 -274195 -258992 -210551 -119076 -26563
22065b6563k0649k13864J28759J14134r431n6661q8982Q0754J6655k6970j1615
$$ -26563 -47212 -261076 -132317 -18183 -27614 -84275 -173257 -92503 -75848 -102818 -114433
22054a14433M4479L8989k5451p823J51859j870k12315J4242J45896N4362r2049
$$ -114433 -69954 -30965 -56416 -64239 87620 85750 -126565 -112323 33573 87935 -4114
22043d114r2807k1477J35501N6965j1767j12105M7982m8229q9428p445O3119J8076
$$ -4114 -96921 -118398 17103 74068 62301 -49804 -1822 -50051 -139479 -146924 -83805 -65729
22031f5729Q4344p6788j22364l5360J4171P7018Q4714j8117j3888J0557j5995
$$ -65729 18615 -58173 -180537 -215897 -201726 -124708 -39994 -58111 -71999 -61442 -77437
22020g7437O5678P3454R612j11433j6667j16728K093N8187O2329l1192j30764
$$ -77437 -11759 61695 71307 -40126 -56793 -173521 -171428 -113241 -50912 -82104 -212868
22009b12868P7256P7497Q9210k0154j7319m979j6701l5016K6077J5803r190Q0246
$$ -212868 -135612 -58115 31095 10941 -6378 -11357 -28058 -63074 -36997 -21194 -30384 49862
21997D9862N141k4036k5049P3033K7710l6236j16791o5278M2562K0913l5696J43681
$$ 49862 55003 30967 5918 78951 106661 70425 -46366 -111644 -69082 -48169 -83865 59816
21985E9816L2158j5863K1533o9359m0074O7289l530J11J05537j15100q8375k8339
$$ 59816 91974 76111 97644 28285 -11789 55500 51970 52081 157618 42518 -45857 -74196
21973g4196N4392M4771N8088q9555o8933k7999j19897M0885Q1167Q3858Q51q4274
$$ -74196 -19804 24967 83055 -6500 -75433 -103432 -223329 -182444 -101277 -17419 -16568 -100842
21961a00842K8738k4805o8429l3125J0272J28631M4984J72597R7195j7905n9461
$$ -100842 -72104 -96909 -165338 -198463 -188191 -59560 -14576 158021 255216 237311 177850
21950A77850k4911j42420q1768o9789K8024N4261J136l6241L4816J06678m5532
$$ 177850 152939 10519 -71249 -141038 -113014 -58753 -57617 -93858 -59042 47636 2104
21939B104k18J07304l1868m5550P7913p158k8975r5195M6006J08417J5152j62056
$$ 2104 1886 109190 77322 31772 109685 102527 73552 -21643 24363 132780 147932 -14124
21927a4124m7565j7487L2907R5865l76M1207j5831j69578J2183M2202Q0505K465
$$ -14124 -61689 -79176 -46269 49596 49220 90427 74596 -94982 -82799 -40597 39908 42373
21915D2373k11137k2325L0330P5925M2300l6834L3774J1880j999r709L441o3200
$$ 42373 -168764 -191089 -160759 -84834 -42534 -79368 -45594 -33714 -35713 -45422 -41981 -105181
21903a05181k6649K9528K3898P8117J8013K7407k537q0277r0997N7988J39330
$$ -105181 -131830 -102302 -78404 -287 17726 45133 42596 -37681 -128678 -70690 68640
21892F8640J1753r239n9307k6894M6813k0009l0454o7854l2865Q0993r539M2618
$$ 68640 80393 71154 11847 -15047 31766 11757 -18697 -86551 -119416 -38423 -47962 -5344
21880e344N1061J0633J6139o0526m2920J0736o0889j8087J60518J75743l9994
$$ -5344 45717 56350 72489 11963 -30957 -20221 -81110 -99197 61321 237064 197070
21869A97070k22935j00403M7747M7422l376K6593J4940l0748k1464J3402k9360
$$ 197070 -25865 -126268 -78521 -31099 -34475 -7882 7058 -23690 -45154 -31752 -61112
21858f1112r0518J6642J29771K1375k3577R975J9729Q3078J6473j67834r5028
$$ -61112 -151630 -134988 -5217 16158 -7419 2556 22285 105363 121836 -45998 -141026
21847a41026J64845M5812O1211K5105M7235n0297n2531l8736j12565m7873Q807
$$ -141026 23819 69631 130842 155947 203182 152885 100354 61618 -50947 -98820 -90013
21836i0013J3371M7092R0105L8086L6999k5339J3939J16015R1826j23258j73012
$$ -90013 -76642 -29550 60555 98641 135640 110301 124240 240255 332081 208823 35811
21825C5811j34066p4185O3112J54235L961n4969l8465R54J15152N6336n6832p4659
$$ 35811 -98255 -172440 -109328 44907 48868 -6101 -44566 -43612 71540 127876 71044 -3615
21813c615M4321M5949J3637r2569l0370K8895j0077j5836K7157q2566r0883M7536
$$ -3615 40706 86655 100292 7723 -22647 6248 -3829 -19665 7492 -75074 -165957 -118421
21801a18421M8711J5010o7833P8795J6911r346m8224K0017Q8693K4854j47431
$$ -118421 -69710 -54700 -122533 -43738 -26827 -36173 -84397 -64380 24313 49167 -98264
21790i8264p5983n1332q1150n0230K9269Q6712J0981M7888P9601K32352M9792
$$ -98264 -174247 -225579 -306729 -356959 -327690 -240978 -229997 -182109 -102508 129844 179636
21779A79636j36832j9837l7267j2908K3499J41817N4208n9108k0843l7795l3274
$$ 179636 42804 22967 -14300 -27208 -3709 138108 192316 133208 112365 74570 41296
21768D1296P3337L9944n7689j44841m3391l3220O0288J60133o7987n5534J15123
$$ 41296 114633 154577 96888 -47953 -91344 -124564 -64276 95857 27870 -27664 87459
21757H7459O3864l5241j56610J6936O0694P5533k899L0629J3265o3178o3775J5263
$$ 87459 151323 116082 -40528 -23592 37102 112635 109736 140365 153630 90452 26677 41940
21745D1940Q779m4586p8746p5964n0989Q6872J15731N5118O4545K0331n4480p0840
$$ 41940 50719 6133 -72613 -148577 -199566 -112694 3037 58155 122700 143031 88551 17711
21733A7711J0190l3733L9433N226l0221O787L0415O1813r1950m4805p523O2526
$$ 17711 27901 -5832 33601 38827 8606 15393 45808 107621 15671 -29134 -36657 25869
21721B5869K2950L0778j69653K7781Q0063j382L5973j0770r3402K3654J61985
$$ 25869 48819 79597 -90056 -62275 17788 16406 52379 41609 -51793 -28139 133846
21710A33846j4219n4245j4858J2447n4244k33325j73550O7391J00027O8869j4739
$$ 133846 119627 65382 50524 62971 8727 -224598 -398148 -330757 -230730 -161861 -176600
21699a76600M9846O8842L1136j01636p5107J1063J36756R0320p72R1318l6181
$$ -176600 -126754 -57912 -26776 -128412 -203519 -192456 -55700 34620 33848 125166 88985
21688H8985j24911M6331J41087l0320n62j2429k4398q6008J4019j7775r7499M3555
$$ 88985 -35926 10405 151492 121172 120610 108181 83783 -2225 11794 -5981 -103480 -59925
21676e9925N3862j33724j63360O9517J69992O0105K9616j0140o8830P4717Q6205
$$ -59925 -6063 -139787 -303147 -233630 -63638 -3533 26083 15943 -52887 21830 108035
21665A08035J6898n3039j06875k1489J62131J05792j31216n4848k013l8121j27950
$$ 108035 124933 71894 -34981 -56470 105661 211453 80237 25389 23376 -14745 -142695
21654a42695K3511R9793P5737j01970p9916k2471M7799J05755M1691N9592J4462
$$ -142695 -119184 -19391 56346 -45624 -125540 -148011 -100212 5543 47234 106826 121288
21643A21288K1837k5480J8048N0197J1464j17546m9968j19113R1267N1133k6254
$$ 121288 143125 117645 135693 185890 197354 79808 29840 -89273 1994 53127 26873
21632B6873o795N751M6849j31604o5075P3030M5988o6965r466n2194l820k8034
$$ 26873 20078 25829 72678 -58926 -124001 -50971 -4983 -71948 -81414 -133608 -137428 -165462
21620a65462r3594R696R4668p2779M1169J45382P9678k4136L3600R8111J0019
$$ -165462 -259056 -249360 -154692 -227471 -186302 -40920 38758 14622 48222 146333 156352
21609A56352j19173j77673l8843J30050k0049n1349O616Q552r781K3761L2180
$$ 156352 37179 -140494 -179337 -49287 -69336 -120685 -114069 -105517 -115298 -91537 -59357
21598e9357N2969R715L907r0692M355M5057M9731Q5163J0880o7502L9160k475
$$ -59357 -6388 3327 7234 -83458 -79103 -34046 15685 100848 111728 44226 83386 80911
21586H0911o6886P8772j7842n7856o8455m683j09822l976K10J14487r7226o9060
$$ 80911 14025 92797 74955 17099 -51356 -56039 -165861 -169837 -169627 -55140 -152366 -221426
21574b21426R0188R586M1351L2529l1053j6804J45764m3524o0265R978l2048l6432
$$ -221426 -131238 -121652 -80301 -47772 -78825 -95629 50135 6611 -53654 -43676 -75724 -112156
21562a12156o6042p7984o0698J7035J91445N2136k4854j31651J39589J37143l3086
$$ -112156 -178198 -256182 -316880 -299845 -108400 -56264 -81118 -212769 -73180 63963 30877
21551C0877j48903r85r5043M1886J07872o4q500K13487l3026p0785p3211q8115
$$ 30877 -118026 -119011 -214054 -172168 -64296 -64360 -72860 140627 107601 36816 -36395 -124510
21539a24510q3766j6853J16710p064K9551J31923o5849o125q3830J193J28918
$$ -124510 -208276 -225129 -108419 -115483 -85932 45991 -19858 -25983 -109813 -108620 20298
21528B0298j52675j53039Q7092J7200L9334M6202M9587J6844j36922o0791J5598
$$ 20298 -132377 -285416 -198324 -181124 -141790 -95588 -46001 -29157 -166079 -226870 -211272
21517b11272O5699K2415O8403j1903p0746j12068m5897J5757J21627J70240P6163
$$ -211272 -145573 -123158 -54755 -66658 -137404 -249472 -295369 -279612 -157985 12255 88418
21506H8418j03332j46363o4773P6404J52214l4920j8193m9622J6569K19422L9361
$$ 88418 -14914 -161277 -226050 -149646 2568 -32352 -50545 -100167 -83598 135824 175185
21495A75185p4690q5780j01917j02069k6471j12810k9733J90938J17389k5460
$$ 175185 100495 14715 -87202 -189271 -215742 -328552 -358285 -167347 -49958 -75418
21485g5418R2170K8132n0089p779J0680k9985k0406q5570j6745Q2397l8926L9805
$$ -75418 16752 44884 -5205 -12984 -2304 -32289 -52695 -138265 -155010 -72613 -111539 -71734
21473g1734L1921l7257Q3529r0942r3521M0434P5341k1317q1625N4982J2568J02953
$$ -71734 -39813 -77070 6459 -84483 -178004 -137570 -62229 -83546 -165171 -110189 -97621 5332
21461E332R227L3290K5549q3730q4641Q2200j1993j20738o1251j5727J24446K3827
$$ 5332 14559 47849 73398 -10332 -94973 -12773 -24766 -145504 -206755 -222482 -98036 -74209
21449g4209p6930Q9678R2169J5940m9843o1760K4621J02993J05397L7805j8113
$$ -74209 -151139 -61461 30708 46648 -3195 -64955 -40334 62659 168056 205861 187748
21438A87748j35283j39462p0113J35570J24875k9252N2246J3426p0345M693k5150
$$ 187748 52465 -86997 -157110 -21540 103335 74083 126329 139755 69410 74103 48953
21427D8953n7519M0164m7181p9138j05354l4766L7732N8022N5325n2043j0441
$$ 48953 -8566 31598 -15583 -94721 -200075 -234841 -197109 -139087 -83762 -135805 -146246
21416a46246j863q886K3141q0438k748L7148J00927k8628l8266j2605J09733O9375
$$ -146246 -148109 -156995 -133854 -214292 -217040 -179892 -78965 -107593 -145859 -158464 -48731 20644
21404B0644n7882K027J8700j630J58471J7547O248m6769J30714j5238J8149k8595
$$ 20644 -37238 -35211 -16511 -18141 140330 157877 164125 117356 248070 232832 250981 222386
21392B22386l5827l401M7338n9517o0123Q4814k8193M9833p3124o1796J4717k1763
$$ 222386 186559 183158 230496 170979 110856 195670 167477 217310 144186 82390 97107 75344
21380G5344j21941j5158P430J553l5722l5723m034j11744j11230J22553J13645
$$ 75344 -46597 -61755 -54325 -52772 -88494 -124217 -128251 -239995 -351225 -228672 -115027
21369a15027O286L9444j7537p1567q3112q0359L8741O4577K01142J15584O3797
$$ -115027 -108741 -69297 -86834 -158401 -241513 -321872 -283131 -218554 -17412 98172 161969
21358A61969j14449j69541m2185Q8001r5696R000k8184J69757J00829r5297j7120
$$ 161969 47520 -122021 -164206 -76205 -171901 -162901 -191085 -21328 79501 -15796 -32916
21347c2916N5802J0642j2098o5210L5853o768J8278o6215k7087l3244n2364J19927
$$ -32916 22886 33528 21430 -43780 -7927 -14695 3583 -62632 -89719 -122963 -175327 -55400
21335e5400K4983n0684l1262m1926j24745J12045J84954M1750j6717n2385p7323
$$ -55400 -30417 -81101 -112363 -154289 -279034 -166989 17965 59715 42998 -9387 -86710
21324h6710P9369L8437j63319O662P6428Q0305K3701n4213j33614J4129q292L2474
$$ -86710 -7341 31096 -132223 -125561 -49133 31172 54873 660 -132954 -118825 -127117 -94643
21312i4643m8525J6890K1785n2232N0160L0533J03185J25377j77567j88285Q5444
$$ -94643 -143168 -126278 -104493 -156725 -106565 -76032 27153 152530 -25037 -213322 -127878
21301a27878N2217J5722R3517Q7811k7854k8165k9719p2063q9287j20361o5866
$$ -127878 -75661 -59939 33578 121389 93535 65370 35651 -36412 -125699 -246060 -311926
21290c11926J31735J17940k7023K1169O7497K8459J0277L7670l5698l4697L7935
$$ -311926 -180191 -62251 -89274 -68105 -608 27851 38128 75798 40100 5403 43338
21279D3338p1636j44023m1382j23588M3032J32929Q8515J20100J63279k4404l6615
$$ 43338 -28298 -172321 -213703 -337291 -294259 -161330 -72815 47285 210564 186160 149545
21268A49545j150q2684j07276J1747K33k471K1589k3711j81511K3071J76588J44430
$$ 149545 148395 65711 -41565 -29818 -29585 -32056 -10467 -34178 -215689 -192618 -16030 128400
21256A28400p3204p5698L4117K2831n382n7802P95N5065n005q6212o0603J21073
$$ 128400 55196 -20502 13615 36446 31064 -26738 -25943 29122 24117 -62095 -122698 -1625
21244a625j5670P9251Q3988k0671L3873r7040r7549K2415r5835l7958N0786Q2415
$$ -1625 -17295 61956 145944 125273 159146 62106 -35443 -13028 -108863 -146821 -96035 -13620
21232a3620j7770j6439n3097N0784N4577o434M9593k8949p7742P0685l5749k2276
$$ -13620 -31390 -47829 -100926 -50142 4435 -1999 47594 18645 -59097 11588 -24161 -46437
21220d6437p7975L741j2720p1971n930k8823J14182L6889J07432p1561k8972N6431
$$ -46437 -124412 -120671 -133391 -205362 -211292 -240115 -125933 -89044 18388 -53173 -82145 -25714
21208b5714m4762l8243L3673J08860P0299m8481q6815N3866r1960r442q392k6470
$$ -25714 -70476 -108719 -75046 33814 104113 55632 -31183 22683 -69277 -78719 -87111 -113581
21196a13581N3303p263J2984j0702M5886k1999k0367J13106K8400K9666K3541
$$ -113581 -60278 -67541 -54557 -65259 -19373 -41372 -61739 51367 79767 109433 132974
21185A32974n0084n1769J18928k3697L5031q9576j46476q6360Q434L6118J17997
$$ 132974 82890 31121 150049 126352 161383 71807 -74669 -161029 -152595 -116477 1520
21174A520J08384K1482o4005q3574j00517r1964R9124J69088q3505o2007P0219
$$ 1520 109904 131386 67381 -16193 -116710 -208674 -109550 59538 -23967 -85974 -15755
21163a5755n0470o013k269O8975J4647o5965K0760Q45m7257M4728l2112m4599
$$ -15755 -66225 -72238 -74507 -5532 9115 -56850 -36090 -35245 -82502 -37774 -69886 -114485
21151a14485P600K4621R727N4931N5379K6407j86q0472K2345J40506k1001j2915
$$ -114485 -106885 -82264 -72537 -17606 37773 64180 63994 -16478 5867 146373 125372 112457
21139A12457r1520j49705K9416J31676J00571j46415j12480J10519N4979L4885
$$ 112457 20937 -128768 -99352 32324 132895 -13520 -126000 -15481 39498 74383
21129G4383m5930j09523j9197J54510J24717K3813R4076j02697j52065N5900m5831
$$ 74383 28453 -81070 -100267 54243 178960 202773 296849 194152 42087 97987 52156
21118E2156j34746L1683J0324K396o747l321J4969j43297o7031J14742n8331L2022
$$ 52156 -82590 -50907 -40583 -38187 -44934 -48255 -33286 -176583 -243614 -128872 -187203 -155181
21106a55181Q6394o7565m6583R0932J66617K3390j54017o7624m08J48027O1350
$$ -155181 -68787 -136352 -182935 -92003 74614 98004 -56013 -123637 -124045 23982 85332
21095H5332K2285l8997m3371J2060k78J2682N5442L7610j16709K3579R9148K6621
$$ 85332 107617 68620 25249 37309 37031 49713 105155 142765 26056 49635 148783 175404
21083A75404k7114M4727j23415j16536O4059j1664r1500Q4833J42152N21j27880
$$ 175404 148290 193017 69602 -46934 17125 5461 -86039 -1206 140946 141467 13587
21072A3587J2070q7113j60919N5250N8249J9734o8770j07919j2598Q8563R2267
$$ 13587 25657 -61456 -222375 -167125 -108876 -89142 -157912 -265831 -278429 -189866 -97599
21061i7599P6686Q3524k417j17590Q0048L5966r6851n3293M763J33529N5924l7047
$$ -97599 -20913 62611 60194 -57396 22652 58618 -38233 -91526 -86763 46766 102690 65643
21049F5643K5487K6789j9096m6264k5873O6389M277M2945r5260n9904l7790m8501
$$ 65643 91130 117919 98823 52559 26686 93075 97352 140297 45037 -14867 -52657 -101158
21037a01158l6592K7124m1288J00316L4436q04j9489m6162M2472K3134k6821L3162
$$ -101158 -137750 -110626 -151914 -51598 -17162 -17966 -37455 -83617 -41145 -18011 -44832 -11670
21025a1670M8273j30639m3157J91759n0353k3969l4341o829M3795K9920p8970
$$ -11670 36603 -94036 -137193 54566 4213 -19756 -54097 -60926 -17131 12789 -66181
21014f6181J5132m609n591L7305o1262J8812k9976k0927j0628N0110l0925P1141
$$ -66181 -51049 -55658 -61249 -23944 -85206 -66394 -96370 -117297 -127925 -77815 -108740 -37599
21002c7599J16239M369q4508R6215j4362R135o1901l6467j3487l7647j2884J07772
$$ -37599 78640 83009 -1499 94716 80354 89489 27588 -8879 -22366 -60013 -72897 34875
20990C4875J9760P241m090N0489Q3531m378P030N9704n2545p5159j67546n2771
$$ 34875 54635 61876 57786 108275 191806 187428 194458 254162 201617 126458 -41088 -93859
20978i3859M2970J241j85868O2763R5049M7867j41430J6604R3922K1143j3386
$$ -93859 -50889 -49648 -235516 -172753 -77704 -29837 -171267 -154663 -60741 -39598 -52984
20967e2984p2362k1170l4897p1982q171O8086J2016K2463O1160R4185J3103j1113
$$ -52984 -125346 -146516 -181413 -253395 -261566 -193480 -181464 -159001 -97841 -3656 9447 -1666
20955a666o85j51244n139Q0656m0580Q503Q6963p9912L5809K37646M7299q7630
$$ -1666 -2351 -153595 -158734 -78078 -118658 -110155 -23192 -103104 -67295 170351 217650 130020
20943A30020j46844o9671j2948r549J1717M9299J06725R1188q0061p1481M1168
$$ 130020 -16824 -86495 -99443 -108992 -97275 -47976 58749 149937 69876 -1605 39563
20932C9563N7162q2031K780L6384K883m9266j7328j9978N6410j5131r7269Q6675
$$ 39563 96725 14694 17474 53858 56741 7475 -9853 -29831 26579 11448 -85821 854
20920H54l1097j755Q5509n6905L3528Q98j2361N5235k4330j14672J6310N4110
$$ 854 -30243 -31998 53511 -3394 30134 31032 18671 73906 49576 -65096 -48786 5324
20908E324L6607o7767m4789m0065r3077j3266K9515J2879j5857N262l2901R0158
$$ 5324 41931 -25836 -70625 -110690 -203767 -217033 -187518 -174639 -190496 -185234 -218135 -127977
20896a27977K11721J11617M2942O164j43765j01966p5984o440J18067R60Q7512
$$ -127977 83744 195361 238303 244467 100702 -1264 -77248 -83688 34379 35339 122851
20885A22851N9721j75021j11654J32611k0826k3933m4978j28145j0895K7351k9163
$$ 122851 182572 7551 -104103 28508 7682 -16251 -61229 -189374 -200269 -172918 -202081
20874b02081K1735n6084R9438P4072r3769M2229J12663q71j28686q0363j2167
$$ -202081 -180346 -236430 -136992 -62920 -156689 -114460 -1797 -2668 -131354 -211717 -223884
20863b23884j0868J6390L8984M2102J0823P07p5252j13025O2893Q9531P4616M7206
$$ -223884 -234752 -218362 -179378 -137276 -126453 -125746 -200998 -314023 -251130 -161599 -86983 -39777
20851c9777L6030m471m2233q5715R0666j896n6505J49562P125j29334j07536J23560
$$ -39777 -3747 -8218 -50451 -136166 -45500 -47396 -103901 45661 52786 -76548 -184084 -60524
20839f0524L0193j1506J5757K7906N2663j54747j41293r7680o335J62287J40178
$$ -60524 -30331 -41837 -26080 1826 54489 -100258 -241551 -339231 -345566 -183279 -43101
20828d3101J25354r2677j17334q8674j6291n3805l2778J30866J29339l6963j2232
$$ -43101 82253 -10424 -127758 -216432 -232723 -286528 -319306 -188440 -59101 -96064 -108296
20817a08296k9812P266N7823k9115k5957k2883K4510R973j9385l0248j0955O5612
$$ -108296 -138108 -130842 -73019 -102134 -128091 -150974 -126464 -116491 -135876 -166124 -177079 -111467
20805a11467K9525M1683r0805j54205K1502P6015N0234Q8102p7057o279N0440
$$ -111467 -81942 -40259 -131064 -285269 -263767 -187752 -137518 -49416 -126473 -132752 -82312
20794h2312l2124j8026j06753q266L8910O8642o2618k334O5253J06476M2606J00203
$$ -82312 -114436 -132462 -239215 -247481 -208571 -139929 -202547 -204881 -139628 -33152 9454 109657
20782A09657N3149M4120j35600j35470L574k0179O7313K03881l4890l0930n750
$$ 109657 162806 206926 71326 -64144 -60570 -80749 -13436 190445 155555 124625 118875
20771A18875O265n1108n2351L0278q8063q8346J23594j6963p6478j3440K525j1896
$$ 118875 125140 74032 21681 51959 -36104 -124450 -856 -17819 -94297 -107737 -105212 -117108
20759a17108J12576o8250j37516L4327J50763J18878L1811m6967q9028o0903K1570
$$ -117108 -4532 -72782 -210298 -175971 -25208 93670 125481 78514 -10514 -71417 -49847
20748d9847n1937j05054J9952Q8596P6289P7716q7444P6698J57383j4555j13163
$$ -49847 -101784 -206838 -186886 -98290 -22001 55715 -31729 44969 202352 187797 74634
20737G4634j19000J8836p1495j40413J17229R9283j24348j6641J1233o2462J7890
$$ 74634 -44366 -25530 -97025 -237438 -120209 -20926 -145274 -161915 -150682 -213144 -195254
20726a95254J28822M2549k3859J0424P0180N5258J4194j94875j35209L1370k1702
$$ -195254 -66432 -23883 -47742 -37318 32862 88120 102314 -92561 -227770 -196400 -218102
20715b18102J9681L4911R2580k3254r5981P4583J27291P7513J13347K2123j63887
$$ -218102 -198421 -163510 -70930 -94184 -190165 -115582 11709 89222 202569 224692 60805
20704F0805q4815l9912q2371P7606J01010M5827k7422O8863L5237o6804r2994
$$ 60805 -24010 -63922 -146293 -68687 32323 78150 50728 119591 154828 88024 -4970
20693d970K7434l578R5359o2605j13208q0130k4162R0605q0949P187Q8618J38045
$$ -4970 22464 18886 114245 51640 -61568 -141698 -165860 -75255 -156204 -149017 -60399 77646
20681G7646Q8492l2015q0843l061p9091n1552j6644L4339L3324J16201l3729k8416
$$ 77646 166138 134123 53280 50219 -28872 -80424 -97068 -62729 -29405 86796 53067 24651
20669B4651J23954J1016r1179o7529k4428N1299n4733o2644k4911P649N5326Q9679
$$ 24651 148605 159621 68442 913 -23515 27784 -26949 -89593 -114504 -106855 -51529 38150
20657C8150P9420K4890O5970L5051r1122p4189m7726p4498k6703L4420j0358j39516
$$ 38150 117570 142460 208430 243481 152359 78170 30444 -44054 -70757 -36337 -46695 -186211
20645a86211j5538R1553L9489j8385P3631j0302j18505O6303J47824q252m8776
$$ -186211 -201749 -110196 -70707 -89092 -15461 -25763 -144268 -77965 69859 61607 12831
20634A2831l7658Q5454j0520P0175N8387R3407j1849o4376r3880n7127j38550
$$ 12831 -24827 60627 50107 120282 178669 272076 260227 195851 101971 44844 -93706
20623i3706L2184J00816j4753l3538k0180k6973l101n5951l8381K4072K7946L9165
$$ -93706 -61522 39294 24541 -8997 -29177 -56150 -59251 -115202 -153583 -129511 -101565 -62400
20611f2400O2487k5474l714n8000J82383N3064J9902n6402r0257o6595k9289k7198
$$ -62400 87 -25387 -29101 -87101 95282 148346 168248 111846 21589 -45006 -74295 -101493
20599a01493n7295M8345J50761K9257n044M1352N075k8809P9684l6813j90209
$$ -101493 -158788 -110443 40318 69575 64531 105883 110958 82149 161833 125020 -65189
20588f5189j8157L1679Q93M9155q9186o0386L4085p4874Q6228M1483L895j9931
$$ -65189 -83346 -51667 -50774 -1619 -90805 -151191 -117106 -191980 -105752 -64269 -60374 -80305
20576h0305o0932J24506n459l0941M7093R7955J08999o0085j22764j00744Q2447
$$ -80305 -141237 -16731 -22190 -53131 -6038 91917 200916 140831 18067 -82677 -230
20565b30K2804p1618l6617Q4621Q3740j15536O764K0602N0909r8862r0509J26559
$$ -230 22574 -49044 -85661 -1040 82700 -32836 -26072 -5470 45439 -53423 -143932 -17373
20553a7373J03050L0841m778j32233q5308O6399J25060J13088p2973m1824q988
$$ -17373 85677 116518 111740 -20493 -105801 -39402 85658 198746 125773 83949 74961
20542G4961j05467j50863K0080J97915J62651k7663j02456j07578r1570K8215
$$ 74961 -30506 -181369 -161289 36626 199277 171614 69158 -38420 -129990 -101775
20532a01775N4956m373m925j58514l3461J30083M4472M551K6660O0917k2127Q6780
$$ -101775 -46819 -51192 -56117 -214631 -248092 -118009 -73537 -68986 -42326 18591 -3536 83244
20520H3244m430j35643l9315K4979K4411O0364J11327j7501j6345P0472M7303
$$ 83244 78814 -56829 -96144 -71165 -46754 13610 124937 107436 91091 161563 208866
20509B08866r1440j26726p4502k292J5783R0045n8417o6165k2141M6351K283m1580
$$ 208866 117426 -9300 -83802 -86094 -70311 19734 -38683 -104848 -126989 -80638 -78355 -119935
20497a19935j09893p0294P5409J30296J12946Q4214J2608n9836p5429K5523Q037
$$ -119935 -229828 -300122 -224713 -94417 18529 102743 115351 55515 -19914 5609 13646
20486A3646Q0282N5663l6592J0578j2293K4406j12749k5497q8738j24572r6132
$$ 13646 93928 149591 112999 123577 111284 135690 22941 -2556 -91294 -215866 -311998
20475c11998J6640J08679L05952J13991k6830l3003O4886J21296k4666j12780
$$ -311998 -295358 -186679 119273 233264 206434 173431 238317 359613 334947 222167
20465B22167j03125j33569m1430L4751n5930j33863O7597J35468K7479L0412n8968
$$ 222167 119042 -14527 -55957 -21206 -77136 -210999 -143402 -7934 19545 49957 -9011
20454i011q6816K5075r8403L6739J57743L4801l3959J21154P7256j6497m7593
$$ -9011 -95827 -70752 -169155 -132416 25327 60128 26169 147323 224579 208082 160489
20443A60489o2102l5894k9624j6835r8607j14046J5324k5680O8106K977L7264
$$ 160489 98387 62493 32869 16034 -82573 -196619 -181295 -206975 -138869 -135892 -98628
20432i8628j14906O0868r6620p455J26697L6204L5268k7282L8950N0668p4059
$$ -98628 -213534 -152666 -249286 -256741 -130044 -93840 -58572 -85854 -46904 3764 -70295
20421g0295m2044L5372Q0030m954P9023R0828j8294n3911j29168K8870L3094j2614
$$ -70295 -112339 -76967 3063 -1891 77132 167960 149666 95755 -33413 -4543 28551 15937
20409A5937M0215O7052N9882J12889R5911K4553O0273n5962P6300R0106P6726
$$ 15937 56152 123204 183086 295975 391886 416439 476712 420750 497050 587156 663882
20398F63882p1452j99044j32253o8848j29688j33980N7778M4541o9875Q595K6676
$$ 663882 592430 393386 261133 192285 62597 -71383 -13605 30936 -38939 -30344 -3668
20387c668N3984O7234n8767p0999o9932P4079N8191N9031k3077L1169J33002M8865
$$ -3668 50316 117550 58783 -12216 -82148 -8069 50122 109153 86076 117245 250247 299112
20375B99112K7852j0147P4134J54858Q0641m576l0369l8194j192j70719r6372
$$ 299112 326964 316817 390951 545809 626450 621874 591505 553311 552119 381400 285028
20364B85028n0089j48754r6198j17363J1072O8385k2201J11592J49837m1642q0316
$$ 285028 234939 86185 -10013 -127376 -116304 -47919 -70120 41472 191309 149667 69351
20353F9351M1810j0111k0326j8959m2911n9541o451O2528L3658j21463j09134
$$ 69351 111161 101050 80724 61765 18854 -40687 -47138 15390 49048 -72415 -181549
20342a81549k2248P7887J30324M7464L9456Q2289j12286j32889L5645J88014J4145
$$ -181549 -203797 -125910 4414 51878 91334 173623 61337 -71552 -35907 152107 166252
20331A66252J0522m4993n7207K3090M5536o8176O778n9011o6287O9947J38691
$$ 166252 176774 131781 74574 97664 143200 75024 81802 22791 -43496 26451 165142
20320A65142J9408j4892p9221P858l7976R2696J20791J7552m5307m9123l6894
$$ 165142 184550 169658 90437 98295 60319 153015 273806 291358 246051 196928 160034
20309A60034m5680l6295Q1920m3014k4725r180l9789k3439O2061N3004J867p5011
$$ 160034 114354 78059 159979 116965 92240 83060 43271 19832 81893 134897 136764 61753
20297F1753r6415n8972n0647m3165Q6276K02617k2951q2215n6091l9073J17782
$$ 61753 -34662 -93634 -144281 -187446 -101170 101447 78496 -3719 -59810 -98883 18899
20286A8899j5842q3442j15484l3020J58037R6142J43649n7439K5060p444p0279
$$ 18899 3057 -80385 -195869 -228889 -70852 25290 168939 111500 136560 129116 58837
20275E8837k3219L1522J6341O8453J39279r3585j04917n1030m4880Q3361K0189
$$ 58837 35618 67140 83481 151934 291213 197628 92711 41681 -3199 80162 100351
20264A00351o818j7331m2487j06066q1920q8290m3829K14047K21445j4018p6886
$$ 100351 93533 76202 33715 -72351 -154271 -242561 -286390 -72343 149102 135084 58198
20253E8198j7814r0767r7868j440J3850M3283j2876N954P1310J34803K7246P653
$$ 58198 40384 -50383 -148251 -149691 -135841 -92558 -105434 -99480 -28170 106633 133879 141532
20241A41532J3968m0221m8380P0801j10657O396m0825K4621m3199n7275j6931
$$ 141532 155500 115279 66899 137700 27043 33439 -7386 17235 -25964 -83239 -100170
20230a00170P987P2423Q8238l9584j16225j9332Q9664l6195l5587O9474p9046
$$ -100170 -92183 -19760 68478 28894 -87331 -106663 -16999 -53194 -88781 -19307 -98353
20219i8353k2397O8181J07352k7592j80O7839j09085P3545O9079K7206q7267m4881
$$ -98353 -120750 -52569 54783 27191 27011 94850 -14235 59310 128389 155595 68328 23447
20207B3447o1697k638J97886K1234R630p0292n7978N6081L3582R061o1255r6101
$$ 23447 -38250 -40888 156998 178232 187862 117570 59592 115673 149255 158316 97061 960
20195I60O0288P4221p0018j6477k9327l7387M483P8299m067j3074m2987Q690j3110
$$ 960 61248 135469 65451 48974 19647 -17740 -13257 65042 60975 47901 4914 13604 494
20182D94O4638Q6150R517q4471L3429j68201J1050J10736P7943m191l443m5291
$$ 494 65132 151282 160799 76328 109757 -58444 -47394 63342 141285 137094 133651 88360
20170H8360j518j0465k8323L1030K6950j4359J09624M5069L7070P7633j03214
$$ 88360 86842 76377 48054 79084 106034 91675 201299 246368 283438 361071 257857
20159B57857q3849j6744m878L4255j13074l7194R119O5348R3252j32199p8846
$$ 257857 174008 157264 152386 186641 73567 36373 45492 110840 204092 71893 -6953
20148f953R4529Q6256N8153o1061o3445O683J7530K4121r3529l4528O8324J29211
$$ -6953 87576 173832 231985 170924 107479 114162 131692 155813 62284 27756 96080 225291
20136B25291k551K4871r3955j83533k4216p581L4051K1620r937j10047n7486n484
$$ 225291 222740 247611 153656 -29877 -54093 -61674 -27623 -6003 -15940 -125987 -183473 -188957
20124a88957o619M8477Q0010J34066K2541j0211j5837Q148J449Q5871N2482N453
$$ -188957 -195576 -147099 -67089 66977 89518 79307 63470 71618 73067 158938 211420 216873
20112B16873r1393L088J07545O0555M4996N990j65911M1406j1249j37574L992
$$ 216873 125480 128568 236113 296668 341664 347654 181743 223149 211900 74326 78318
20101G8318L7374M372q1356K9316L0805n1223o8779j2613l398O1019p6729j3741
$$ 78318 115692 120064 38708 68024 98829 47606 -21173 -33786 -37184 23835 -52894 -66635
20089f6635J8594J1876R042q2440j7719Q9666O3518R7972l8578j02048J16108
$$ -66635 -48041 -36165 -27123 -109563 -127282 -37616 25902 123874 85296 -16752 99356
20078I9356R5516j10137J7866O6936r0031n6451l6923M480l3973L0576K4564M1441
$$ 99356 194872 84735 102601 169537 79506 23055 -13868 -9388 -43361 -12785 11779 53220
20066E3220M5006L0093l6645q7092m7803k5650o3635O629Q8590L4974l7103O5492
$$ 53220 98226 128319 91674 4582 -43221 -68871 -132506 -125877 -37287 -2313 -39416 26076
20054B6076J4174k0626m2856J3849L5972O0316K24353l9481m3782o9447j24415
$$ 26076 40250 19624 -23232 -9383 26589 86905 311258 271777 227995 158548 34133
20043C4133n1897M1736P2517R517P530R264k523P6936j4056o5108j32587m3513
$$ 34133 -17764 23972 96489 106006 113536 122800 120277 197213 183157 118049 -14538 -58051
20031e8051R3920j3412J51606J61716l4634K3746j8358m8811j48267n4901m7889
$$ -58051 35869 22457 174063 335779 301145 324891 306533 257722 109455 54554 6665
20020F665R0800k3262m0028o230K5955l6007J1123M972n811p5818K4221J73844
$$ 6665 97465 74203 34175 27945 53900 17893 29016 33988 28177 -47641 -23420 150424
20008A50424M4720N4103P5619n5874p2658l0667j0307j2059k963m5675j07772
$$ 150424 195144 249247 324866 268992 196334 165667 155360 143301 140338 94663 -13109
19997a3109L4758J11511J32765j2698k8773m7254l9908N0156Q7612q2687j04173
$$ -13109 21649 133160 265925 253227 224454 177200 137292 187448 275060 192373 88200
19986H8200j85299r1168L7803J49071M1242k55163M6474O2515J8541O0579L7775
$$ 88200 -97099 -188267 -150464 -1393 39849 -215314 -168840 -106325 -87784 -27205 10570
19975A0570M8597N2683q9621l7244R2843N4962J0689M8840K4409j22864Q965K9549
$$ 10570 59167 111850 22229 -15015 77828 132790 143479 192319 216728 93864 102829 132378
19963A32378P778j1555M5503N2867K5208j2181j18203K5219N8027M9729L3411
$$ 132378 140156 128601 174104 226971 252179 239998 121795 147014 205041 254770 288181
19952B88181r602J7609q2705k2066P521n97o2291L3708k277K285m4664n5201M8938
$$ 288181 278579 296188 213483 191417 198938 198341 136050 169758 167481 169766 125102 69901 118839
19939A18839J14997k0169j43724j2234Q6540M349P6153L873O742K0660O3818J02140
$$ 118839 233836 213667 69943 57709 144249 148598 224751 228624 235366 256026 319844 421984
19927D21984N8715P0896k7385j30369o5386r2407O5872M5306j3552j4828M9599
$$ 421984 480699 551595 524210 393841 328455 236048 301920 347226 333674 318846 368445
19916C68445o8970o097j09572p8004R5226J16548l4007L3663K0724N1542r2118
$$ 368445 299475 293378 183806 105802 201028 317576 283569 317232 337956 389498 297380
19905B97380M4322P1378o6300n9815N0802L9156N0100N9023Q1862j13668l4743
$$ 297380 341702 413080 346780 286965 337767 376923 427023 486046 567908 454240 419497
19894D19497O0891n252P0190J24770n5715o4105j9557K1845R6197N7265o0771
$$ 419497 480388 475136 545326 670096 614381 550276 530719 552564 648761 706026 645255
19883F45255J7110N2093N7294j4152J5781K8185J50312K25062O7616P4093O9834
$$ 645255 662365 714458 771752 757600 773381 801566 951878 1176940 1244556 1318649 1388483
19872A388483R7505J37626J34121O1174p9601q0147J02225N8790l3116M4683J20681
$$ 1388483 1485988 1623614 1757735 1818909 1739308 1659161 1761386 1820176 1787060 1831743 1952424
19861A952424K7100L3074Q0960K72168K24496J31354K70953K50360L01312J59671
$$ 1952424 1979524 2012598 2093558 2365726 2590222 2721576 2992529 3242889 3544201 3703872
19851C703872P2312K20092L39702L07375L32414L08381M19586O72860P43201J065265
$$ 3703872 3776184 3996276 4335978 4643353 4975767 5284148 5703734 6376594 7119795 8185060
19841H185060J247714J493997J785042K612978L700442N066995P519513J0917045
$$ 8185060 9432774 10926771 12711813 15324791 19025233 24092228 31611741 42528786
19833D2528786J4912437J7429781J5506597R130533K849881M14956m77075m046346
$$ 42528786 57441223 74871004 90377601 99508134 102358015 102772971 102295896 98249550
19825I8249550j0861351j6047652j7120459j3949559r849226o568253m457730
$$ 98249550 87388199 71340547 54220088 40270529 30421303 23853050 19395320
19818A9395320k970039j996379j540099j075337o81635m05696j51162J28336M75809
$$ 19395320 16425281 14428902 12888803 11813466 11131831 10726135 10574973 10703309 11179118
19809A1179118Q17716J072976J424545K247611L196830M446582O459106R494148
$$ 11179118 11996834 13069810 14494355 16741966 19938796 24385378 30844484 40338632
19801D0338632J3554421J7278719J7379193J2276657M910491P65956l29917k253760
$$ 40338632 53893053 71171772 88550965 100827622 105738113 106504069 106174152 103920392
19793A03920392q436472j5328253j8306104j6436688j2160501q236435n592632
$$ 103920392 95483920 80155667 61849563 45412875 33252374 25015939 19423307
19786A9423307m025650k775139k014927j632680j247248r04818p69702o83193
$$ 19423307 15397657 12622518 10607591 8974911 7727663 6822845 6053143 5369950
19778E369950m84670m19446k73365k88494l2924r5650k34002j84111l71454k40299
$$ 5369950 4885280 4465834 4192469 3903975 3871051 3775401 3541399 3357288 2985834 2745535
19768B745535n1942o5182j30465j58143k12883j99307j37072j13100j65529n5538
$$ 2745535 2693593 2628411 2497946 2339803 2126920 1927613 1790541 1677441 1511912 1456374
19758A456374j38382p5170J08550J10078L4445J03527j07643j83980j08633j05668
$$ 1456374 1317992 1242822 1351372 1461450 1495895 1599422 1491779 1307799 1199166 1093498
19748A093498j35826l6994O701o1021P5989Q014j96247j32155p6304K2511J9728
$$ 1093498 957672 920678 927379 866358 942347 950361 754114 621959 545655 568166 587894
19737E87894M1669k0545j08316k962J80938j20572j70704j14374j16390J01204
$$ 587894 629563 609018 500702 497740 678678 558106 387402 273028 156638 257842
19727B57842J39348m339j0009m310O9184m9809j2375J02300l3916Q104J375j8761
$$ 257842 397190 392851 382842 378532 447716 397907 385532 487832 453916 462020 463395 444634
19715D44634j59399j9380J14814j41197o3881o4536k7925L7005j0718Q8723O7061
$$ 444634 285235 265855 380669 239472 175591 111055 83130 120135 109417 198140 265201
19704B65201J10479K1987l9527p8509p4854l3469l4651N0781j1125p5634j83704
$$ 265201 375680 397667 358140 279631 204777 171308 136657 187438 176313 100679 -83025
19693h3025m3800J48298J48371K064j41020P2543J58062J38556k27045q0327L9035
$$ -83025 -126825 21473 169844 171908 30888 103431 261493 400049 173004 92677 131712
19682A31712k9301J5839N0603j38698k4739L5531N7683j08955Q4553N9203N2873
$$ 131712 102411 118250 168853 30155 5416 40947 98630 -10325 74228 133431 186304
19671A86304k0574j26242j0052J04583P0645R013K4418o5130o5152k193m7262
$$ 186304 165730 39488 29436 134019 204664 213677 238095 172965 107813 105620 58358
19660E8358r5047L5512L0141J41512N8257k6419P0365N3914p9141J167r5557l8047
$$ 58358 -36689 -1177 28964 170476 228733 202314 272679 326593 247452 248619 153062 115015
19648A15015p2333p7784q552m6381Q3878L0848j06854J28839q1367L2151N8197
$$ 115015 42682 -35102 -43654 -90035 -6157 24691 -82163 46676 -34691 -2540 55657
19637E5657k641J02469P928j21305m8001J6222Q0833L2068l5022r0095J8890n6509
$$ 55657 53016 155485 163413 42108 -5893 10329 91162 123230 88208 -1887 17003 -39506
19625c9506m0673m6178R739N6307n2565R7086P8289M629K5487l0598M4519R6949
$$ -39506 -80179 -126357 -116618 -60311 -112876 -15790 62499 67128 92615 62017 106536 203485
19613B03485J0666m6468j30862j04160O5101O8566J9791j12186N6898j05894J41833
$$ 203485 214151 167683 36821 -67339 -2238 66328 86119 -26067 30831 -75063 66770
19602F6770J42791j9682j50780K6530l9091j55252O856J43946q1218p3509q315
$$ 66770 209561 189879 39099 65629 26538 -128714 -121858 22088 -59130 -132639 -140954
19591a40954O0222o422Q9779M0693J6828n0300o1607J0927o3986P5786L6342p7858
$$ -140954 -80732 -87154 2625 43318 60146 9846 -51761 -40834 -104820 -29034 7308 -70550
19579g0550L5961L5313l2365R6797R2847m4085N6967O7783P988p6453J5140k9578
$$ -70550 -34589 724 -31641 65156 158003 113918 170885 238668 246656 170203 185343 155765
19567A55765j00988O0934J5656j13489n8123L4572n8806k5567J30949k573n1041
$$ 155765 54777 115711 131367 17878 -40245 -5673 -64479 -90046 40903 38330 -12711
19556a2711O3270O9774q8708J2097O962p6970N0580Q3980J5220L3552l1925r2186
$$ -12711 50559 120333 31625 43722 50684 -26286 24294 108274 123494 157046 125121 32935
19544C2935l5004n9917N293J3900K5656k9655O4947L1281j28999o0409N5031k8795
$$ 32935 -2069 -61986 -56693 -42793 -17137 -46792 18155 49436 -79563 -139972 -84941 -113736
19532a13736R2199R2960l3570q8319P3179L3458O3174n744O1854O7198q1406m0932
$$ -113736 -21537 71423 37853 -50466 22713 56171 119345 113601 175455 242653 161247 120315
19520A20315j65768r6717K5165J10116L702K5549p569O90r7357R158O4447L2712
$$ 120315 -45453 -142170 -117005 -6889 -3187 22362 14793 15483 -81874 -72716 -8269 24443
19508B4443k2239j33523J3313P9131M2499l5932j4642o3893r4869M880J32735
$$ 24443 2204 -131319 -118006 -38875 3624 -32308 -46950 -110843 -205712 -200832 -68097
19497f8097R2492J8718k5137m4338l2717K9557L2118J7994o9640j3254J3955N0552
$$ -68097 24395 43113 17976 -26362 -59079 -29522 2596 20590 -49050 -62304 -48349 2203
19485B203j29126j69748Q834J31784P9146J2745K0402p3121K4647N62J987j05794
$$ 2203 -126923 -296671 -287837 -156053 -76907 -64162 -43760 -116881 -92234 -91672 -89685 -195479
19473a95479L8820K9941L7697K866Q7460M7810j07311j5573Q8802l9692M1410
$$ -195479 -156659 -126718 -89021 -86155 1305 49115 -58196 -73769 15033 -24659 16751
19462A6751j5467L28K1532J4917j8106L9224n9352k5254q0716L5446j05825O2633
$$ 16751 1284 1612 23144 38061 19955 59179 -173 -25427 -106143 -70697 -176522 -113889
19450a13889O4301j85492L1972j17209m832N1113J48273R5587m7911N649N5416
$$ -113889 -49588 -235080 -203108 -320317 -325149 -274036 -125763 -30176 -78087 -72438 -17022
19439a7022r6567M3983K5137m0547O5464P415R3072L8102M280l2370l2423J2479
$$ -17022 -113589 -69606 -44469 -85016 -19552 -12137 80935 119037 123317 90947 58524 71003
19427G1003Q704k467l435j24403J7915J22593q4711l1120m115l7962N6933j02453
$$ 71003 79707 77240 73805 -50598 -32683 89910 5199 -25921 -30036 -67998 -11065 -113518
19415a13518o4173M8156J13957M5264j894j7319r718R3455K2341p8799k6035r4012
$$ -113518 -177691 -129535 -15578 29686 27792 10473 755 94210 116551 37752 11717 -82295
19403h2295K1633P7461J10317O0324m0307j34960q581j7395o7663j8599J20202
$$ -82295 -60662 16799 127116 187440 147133 12173 3592 -13803 -81466 -100065 20137
19392B0137J5424K8966o2195L8569J24914k3689j46282J1414M2390j2557j15399
$$ 20137 35561 64527 2332 40901 165815 142126 -4156 7258 49648 37091 -78308
19381g8308L9709O6867l6172m1228M581J62316N2329M68k936r8176j77938m9328
$$ -78308 -38599 28268 -7904 -49132 -44551 117765 170094 170562 167626 69450 -108488 -157816
19369a57816J35440J28604p6412j05476p4094M9938Q5379p4362K0306L0027n5816
$$ -157816 -22376 106228 29816 -75660 -149754 -99816 -14437 -88799 -68493 -38466 -94282
19358i4282o2716r8850k3064J16375J58680R903p0680J18250l042N1949k6465
$$ -94282 -156998 -255848 -278912 -162537 -3857 6046 -64634 53616 50574 102523 76058
19347G6058l9728j98531j04230O7294J22245P6764R017J33722k6808n9970j1442
$$ 76058 36330 -162201 -266431 -199137 -76892 -128 8889 142611 115803 55833 44391
19336D4391P342O9908l8079K6466p0016r2838o2157L6647O8372k0714O3455j8568
$$ 44391 51733 121641 83562 110028 40012 -52826 -114983 -78336 -9964 -30678 32777 14209
19324A4209j12331L2538n360K2535k045R712L4048O8241m8865K1356J706K4707
$$ 14209 -98122 -65584 -70944 -48409 -50454 -40742 -6694 61547 12682 34038 35744 60451
19312F0451l2191j6288r2105k9218l0227R9359P9198n2626k4870m073P5197O7544
$$ 60451 28260 11972 -80133 -109351 -139578 -40219 38979 -13647 -38517 -42590 32607 100151
19300A00151N9371j02404l9938n2109L3203J27543J46801j644p2947k9484J1074
$$ 100151 159522 57118 17180 -34929 -1726 125817 272618 270974 198027 168543 179617
19289A79617o8783n7732l6451M2256l8172J0727L5643k2926n1626P3171P4548
$$ 179617 110834 53102 16651 58907 20735 31462 67105 44179 -7447 65724 140272
19278A40272p7480l7919J09250M2468L2369k2919o2883J70678Q9552j78974j44882
$$ 140272 62792 24873 134123 176591 208960 186041 123158 293836 383388 204414 59532
19267E9532O473J4327L0240Q379J9848n52j5254P2742K216Q1547J11107M4714
$$ 59532 66005 80332 110572 118951 138799 138247 122993 195735 197951 279498 390605 435319
19255D35319n8233l7723J5706J4186O8488Q1505J25868K0476j08122r4342j12124
$$ 435319 377086 339363 355069 369255 437743 519248 645116 665592 557470 463128 351004
19244C51004j09212p5462K5559O723m8601k0662n5229j5084m4526j5092Q2083
$$ 351004 241792 166330 191889 198612 150011 129349 74120 59036 14510 -582 81501
19233H1501L0501j6029p8234o1607O5230Q2289L060M4351q7734r3477k5400Q9010
$$ 81501 112002 95973 17739 -43868 21362 103651 106711 151062 63328 -30149 -55549 33461
19221C3461J56818K50026J35346P9299n6767k1332N7149r485j09977n2520m3188
$$ 33461 190279 440305 575651 654950 598183 576851 634000 624515 514538 462018 418830
19210D18830k17679k08980n3037j6026M1934Q1164J10566j23288L548n3366o5004
$$ 418830 201151 -7829 -60866 -76892 -34958 46206 156772 33484 37032 -16334 -81338
19199h1338K8263P187l0835N3985J38994m1714p2448o1683N109K3451P0794o0090
$$ -81338 -53075 -45888 -76723 -22738 116256 74542 2094 -59589 -54480 -31029 39765 -20325
19187b0325r1198q9475r6809P2607K9993J28449k9835n2798J29827l6317j6714
$$ -20325 -111523 -200998 -297807 -225200 -195207 -66758 -96593 -149391 -19564 -55881 -72595
19176g2595l2553l6975L5089m5081n4571K11M8858m125N8158o8023Q661L3479
$$ -72595 -105148 -142123 -107034 -152115 -206686 -206475 -157617 -161742 -103584 -171607 -162946 -129467
19164a29467N1720K8460l8536n7380O8970N9436o6433o3272n847m5922N1657J38561
$$ -129467 -77747 -49287 -87823 -145203 -76233 -16797 -83230 -146502 -152349 -198271 -146614 -8053
19152h053j8235p1556L2702K4525k3987R6893j1088M6100P5348R22o6757l3567
$$ -8053 -26288 -97844 -65142 -40617 -64604 32289 21201 67301 142649 143571 76814 43247
19140D3247l0102L6847k0515Q684l1081j11919j09672O0781Q8695K7940M8428
$$ 43247 13145 49992 29477 38161 7080 -104839 -214511 -153730 -65035 -37095 11333
19129A1333K730N3424j2206j4573J05061m6839j34333j36063Q0499L9921Q0580
$$ 11333 14063 67487 55281 40708 145769 98930 -35403 -171466 -90967 -51046 29534
19118B9534Q1987J0548k0307n488k0100O5644J8649o1182k3811p3265j27659M8023
$$ 29534 111521 122069 101762 96274 76174 141818 160467 99285 75474 2209 -125450 -77427
19106g7427J02154P9020K8707p1597r1606K375J291J4897J4881P8670n8293m7729
$$ -77427 24727 103747 132454 60857 -30749 -28374 -27083 -12186 2695 81365 23072 -24657
19094b4657J00319L4098L7516R4951k5545m0683k1721l8239l0560J20051L3867
$$ -24657 75662 109760 147276 242227 216682 175999 154278 116039 85479 205530 239397
19083B39397k04117o7712l0317M1273R2289J07835N1825K816j10814p1058p6031
$$ 239397 35280 -32432 -62749 -21476 70813 178648 230473 233289 122475 51417 -24614
19072b4614k9818R322Q7776j31244r3247l0281j6879N560m5660M7347m8332Q3554
$$ -24614 -54432 -45110 42666 -88578 -181825 -212106 -228985 -223425 -269085 -221738 -270070 -186516
19060a86516J028P2531R3120Q005J71048L669j38802p2049k6531j18134K5002
$$ -186516 -185488 -112957 -19837 -11832 159216 162885 24083 -47966 -74497 -192631 -167629
19049a67629J149J33433P1220J1585K8600P4084m8466j14298K3767M8620o0034
$$ -167629 -166480 -33047 38173 49758 78358 152442 103976 -10322 13445 62065 2031
19038B031j2768n861k2378l7565J20404o810K4163K4289m0433O689q6763J9871
$$ 2031 -10737 -16598 -38976 -76541 43863 37053 61216 85505 45072 51761 -35002 -15131
19026a5131M0306j18006j42249J62170R0632J9427r4960N0213J51116j0444o5823
$$ -15131 25175 -92831 -235080 -72910 17722 37149 -57811 -7598 143518 133074 67251
19015F7251K3765P428n9991n9184l2416R275N7933J17164J16313K983j11776O21
$$ 67251 91016 98444 38453 -20731 -53147 -43872 14061 131225 247538 250521 138745 139366
19003A39366p3471J6539K6916n06r169O634J67268k2235j27351j30054n9905o8284
$$ 139366 65895 82434 109350 108844 99675 106309 273577 251342 123991 -6063 -65968 -134252
18991a34252M0996J23457M9203M363L8683O4555m8769p0605o4223j46826j04110
$$ -134252 -93256 30201 79404 83767 122450 187005 138236 67631 3408 -143418 -247528
18980b47528N6818l0070q0841k9319L4852J13196J14221J59764R3844k7125L6113
$$ -247528 -190710 -220780 -301621 -330940 -296088 -182892 -68671 91093 184937 157812 193925
18969A93925l9520n0168j883N0445o7728l2917K6169M0625O5685l377l1310j25991
$$ 193925 154405 104237 102354 152799 85071 52154 78323 118948 184633 181256 149946 23955
18957B3955J9844j6287K19J9701P4002J7847j31793N9132n0305n8728O9991P9198
$$ 23955 43799 27512 27731 47432 121434 139281 7488 66620 16315 -42413 27578 106776
18945A06776j52959j1727J13268p2172L2742N4082J315n1045l7760J8159r0617
$$ 106776 -46183 -57910 55358 -16814 15928 70010 71325 20280 -17480 679 -89938
18934h9938k9678p2197P0538L9771R4742M5369K458j1053J7922k8211N0801O8759
$$ -89938 -119616 -191813 -121275 -81504 13238 58607 61065 50012 67934 39723 90524 159283
18922A59283J133j0863o769Q7901j1390r5860n879j1454J4812p929j84077k10367
$$ 159283 160416 149553 142784 230685 219295 123435 117556 106102 120914 112985 -71092 -281459
18910b81459K1107J79703P8032K388L604N3959L7991m2449j26554M7180M5664
$$ -281459 -260352 -80649 -2617 -229 3375 57334 95325 52876 -73678 -26498 19166
18899A9166j0346Q7903m6000N7211o4745k0626N6186J5921j00024p9055J96831
$$ 19166 8820 96723 50723 107934 43189 22563 78749 94670 -5354 -84409 112422
18888A12422P1268j34165j44886Q5342Q5970O3120J8395P4276j18595r1184l7426
$$ 112422 183690 49525 -95361 -10019 75951 139071 157466 231742 113147 21963 -15463
18877a5463K5111O763k1736n9475j19580k8529m750J19159L6770L738k3395Q115
$$ -15463 9648 16411 -5325 -64800 -184380 -212909 -217659 -98500 -61730 -57992 -81387 -73272
18865g3272N4817m0314N9728l4864j24928j6658m6737M5134l7874J45212O7972
$$ -73272 -18455 -58769 959 -33905 -158833 -175491 -222228 -177094 -214968 -69756 -1784
18854a784M948J03582O6844l2642j12365R548k8966j40146p5081L8469O7940N0593
$$ -1784 3164 106746 173590 140948 28583 38131 9165 -130981 -206062 -167593 -99653 -49060
18842d9060N668K748P4429m1122j44347M2941M9440K5172o5337K1265N2214o7235
$$ -49060 -43392 -40644 33785 -7337 -151684 -108743 -59303 -34131 -99468 -78203 -25989 -93224
18830i3224n2680J2690J15971M6323J9447P2287J15624J03994J05873j7107r2955
$$ -93224 -145904 -133214 -17243 29080 48527 120814 236438 340432 446305 429198 336243
18819C36243o6213J21480J05968j8937l3646K43203K58570N9151n9852j35574
$$ 336243 270030 391510 497478 478541 444895 688098 946668 1005819 945967 810393
18809H10393q9378K5964P024q5259J01573k4336j2060k9098n1400q5440j89722
$$ 810393 721015 746979 754003 668744 770317 745981 733921 704823 653423 567983 378261
18798C78261k21239m8599R0808l3221j54078q5771P664Q894l1725J2062J74002
$$ 378261 157022 108423 199231 166010 11932 -73839 -66175 -57281 -89006 -76944 97058
18787I7058O1251p4444J6467P7530j453m2973n6251l5065Q1913J0285o0992N3211
$$ 97058 158309 83865 100332 177862 176409 133436 77185 42120 124033 134318 73326 126537
18775A26537m614k3137m9923j28455P4960L40946J59831K21089M19022K69557
$$ 126537 121923 98786 48863 -79592 -4632 336314 496145 717234 1136256 1405813
18765A405813l30781m61851k15795k16169j91365m9606p9801L5141P3789m424
$$ 1405813 1075032 613181 397386 181217 -10148 -59754 -139555 -104414 -30625 -35049
18755c5049J9536M015K2751K656L3222r45J17931R6854q952j71302j66518N114
$$ -35049 -15513 -11498 11253 13909 47131 46186 164117 260971 252019 80717 -85801 -80687
18743h0687Q4024L7478Q6174P464j38515j56391L4580M5347k5050L6565Q3375
$$ -80687 3337 40815 126989 134453 -4062 -160453 -125873 -80526 -105576 -69011 14364
18732A4364J07088O2383N6005k8022q8774o7457o2530O9514l0480q9792n7493
$$ 14364 121452 183835 239840 211818 123044 55587 -6943 62571 32091 -57701 -115194
18721a15194R7599K1164k9626n7126Q1686L4626p9143q5730j3651o072J06647
$$ -115194 -17595 3569 -26057 -83183 -1497 33129 -46014 -131744 -145395 -151467 -44820
18710d4820l4259J2416J11929p5264Q6160R2443j60122j72599J5414J83072o8791
$$ -44820 -79079 -66663 45266 -29998 56162 148605 -11517 -184116 -168702 14370 -54421
18699e4421m0824O158J30998n751j32929r0180Q663o3900o1915Q8329J05291o1031
$$ -54421 -95245 -89087 41911 36160 -96769 -186949 -178286 -242186 -304101 -215772 -110481 -171512
18687a71512N2911J34507p5366K1486J18203L7530l4913K6087K7013K9963L5683
$$ -171512 -118601 15906 -59460 -37974 80229 117759 82846 108933 135946 165909 201592
18676B01592n6081j37339r4120N0761L166j48484k2869K56782J30660n3366q6839
$$ 201592 145511 8172 -85948 -35187 -32021 -180505 -203374 53408 184068 130702 43863
18665D3863k7396j8820N7751l2627m9087K3083k9193l3113O9426O9954R159k853
$$ 43863 16467 -2353 55398 22771 -26316 -3233 -32426 -65539 3887 73841 83000 80147
18653H0147K1811n5568p3472Q6218J36286l6475n064P5812n6650j12682p754r0115
$$ 80147 101958 46390 -27082 59136 195422 158947 153883 229695 173045 60363 52609 -37506
18641c7506k9131L4717N868Q4072Q9790j34954l9314J07916r8935J8678O4660
$$ -37506 -66637 -31920 -26052 58020 147810 12856 -26458 81458 -17477 1201 65861
18630F5861o5179m8741N0496O3260J47421L5682o6489k6168O3241n0904j04856
$$ 65861 682 -48059 2437 65697 213118 248800 182311 156143 219384 168480 63624
18619F3624M1131O5848J620J06637k8243K6521j20653n5823l380o8858P1384J5180
$$ 63624 104755 170603 172223 278860 250617 277138 156485 100662 97282 28424 99808 114988
18607A14988q0113n8851P9033L6495O9165k562k5508n062j8428L7332J11988n3993
$$ 114988 34875 -23976 55057 91552 160717 158155 132647 127585 109157 146489 258477 204484
18595B04484p05J00105K6969k3169p0874J02656j6172l4537j49049M4262l6513
$$ 204484 203779 303884 330853 307684 236810 339466 323294 288757 139708 183970 147457
18584A47457l1673k4303J75066M9967p8777j64766N9862M7514J7276Q377J03083
$$ 147457 115784 91481 266547 316514 237737 72971 132833 180347 197623 206000 309083
18573C09083n032r3741l8360j72857m4559J08515J52411n426p1060q666Q5604
$$ 309083 304051 210310 171950 -907 -45466 63049 215460 210034 138974 130308 215912
18562B15912J28532o415M0099j8181J07617M653N2710p8365j39046l4422O2062
$$ 215912 344444 338029 378128 359947 467564 472217 524927 446562 307516 273094 335156
18551C35156N5553Q0806j13j62253l0648L4550J9928l5519r5811K669R7766l5737
$$ 335156 390709 471515 471402 309149 278501 313051 332979 297460 201649 204318 302084 266347
18539B66347j03945l1281m5967J16851J68631Q7258J27546j68208j30155R7683
$$ 266347 162402 131121 85154 202005 370636 457894 585440 417232 287077 384760
18529C84760J40693J3864k0053k656m4786o7951n4087m7657n9401j14769L7875
$$ 384760 525453 539317 519264 516608 471822 403871 349784 302127 242726 127957 165832
18518A65832J01750J7866p5942m0743K9473J25200J46J4870n0555m5171l3005
$$ 165832 267582 285448 209506 168763 198236 323436 323582 338452 287897 242726 209721
18507B09721k9964J7857j27468j28629j30587J21598J48006N7140o5382j5113
$$ 209721 179757 197614 70146 -58483 -189070 -67472 80534 137674 72292 57179
18497E7179L2436L2615r9346j36851j0288J63769J42374M1254k9052k4566j6400
$$ 57179 89615 122230 22884 -113967 -124255 39514 181888 223142 194090 169524 153124
18486A53124m0539P0580o0587l7294J2721O6121r3940P713N7554r5490K9580K4518
$$ 153124 112585 183165 122578 85284 98005 164126 70186 77899 135453 39963 69543 94061
18474I4061l6087j4078L4609k355q6621k41420k9723N7760J43021K10478k5285
$$ 94061 57974 43896 78505 76150 -10471 -251891 -281614 -223854 -80833 129645 104360
18463A04360N0787k3589m6629j22996l1372N5046N7648k2415k107N7568J1888
$$ 104360 155147 131558 84929 -38067 -69439 -14393 43255 20840 18733 76301 88189
18452H8189m4771K6786j06144M0097J23677K8146r3968l6179K5590R6861J279
$$ 88189 43418 70204 -35940 4157 127834 155980 62012 25833 51423 148284 149563
18441A49563k9602o5135N3574L4843o6230m2107l05k2745q0274j4517k297L9976
$$ 149563 119961 54826 108400 143243 77013 34906 34601 11856 -68418 -82935 -85232 -45256
18429d5256j3357L5813K8985P9216l540p321j0356N4928K957p9291N9521J9360
$$ -45256 -58613 -22800 6185 85401 81861 74540 64184 119112 122069 42778 102299 121659
18417A21659k4791l2459p3940P7185J25716k0170J22726k8585j02813p6913O9676
$$ 121659 96868 64409 -9531 67654 193370 173200 295926 267341 164528 87615 157291
18406A57291Q7058R1026J9219o1269J4207P2258p5557m7971j00765J27460J7641
$$ 157291 244349 335375 354594 293325 307532 379790 304233 256262 155497 282957 300598
18395C00598o18q9564n9944p0096r0539q9785J13391M8517O2840J32953p8847
$$ 300598 299980 210416 150472 80376 -10163 -99948 13443 61960 124800 257753 178906
18384A78906o0065m7710M9990O983J7624Q0677K0530r8699l3874R9074R3927J4949
$$ 178906 118841 71131 121121 128104 145728 226405 246935 148236 114362 213436 307363 322312
18372C22312j0545o4818j66089K9485J15150L8848P0645O3415k8434K3874l0953
$$ 322312 311767 246949 80860 110345 225495 264343 334988 398403 369969 393843 362890
18361C62890L5409Q1396j1847O1356R4501o6629j01686o010M9067p3206q022J06910
$$ 362890 398299 479695 467848 529204 623705 557076 455390 449380 498447 425241 417219 524129
18349E24129J36546p1032n2258J53955o1687M2315l4773m7595R43l0102l5860
$$ 524129 660675 589643 537385 691340 629653 671968 637195 589600 590543 560441 524581
18338E24581L2206J19353Q5593p7094J9485J06121Q7807l4716p4179M8925N3611
$$ 524581 556787 676140 761733 684639 704124 810245 898052 863336 789157 838082 891693
18327H91693Q747Q7948k9146J05865R3661O6566K8050l9294L1172J55748J14477
$$ 891693 900440 988388 959242 1065107 1158768 1225334 1253384 1214090 1245262 1401010 1515487
18316A515487N5120R8926R8610j2822J58628J76964j7346N9287J54248L32263
$$ 1515487 1570607 1669533 1768143 1755321 1913949 2090913 2073567 2132854 2287102 2619365
18306B619365K58719J84456L25711M01599L78142M00199M16632O36437Q87094
$$ 2619365 2878084 3062540 3388251 3789850 4167992 4568191 4984823 5621260 6508354
18297F508354J060369J168412J391052J906020K593357L936709O144334Q868395
$$ 6508354 7568723 8737135 10128187 12034207 14627564 18564273 24708607 33577002
18289C3577002Q733000M282068L298244Q435008J6287463J8307343Q480584k142562
$$ 33577002 42310002 46592070 49890314 58325322 74612785 92920128 101400712 99258150
18281I9258150K073338J2688754J4241675K955823n909474j312818P069888L659260
$$ 99258150 101331488 114020242 128261917 131217740 125308266 123995448 131065336 134724596
18273A34724596j0057446j5464807o989807L358549j653799j5120849j9431538
$$ 134724596 124667150 109202343 102212536 105571085 103917286 88796437 69364899
18266F9364899j3744418n698269k926569p243662r756312p941236n281878l452367
$$ 69364899 55620481 49922212 46995643 39751981 29995669 22054433 16772555 13320188
18258A3320188k404948j644702j202382r90959q70694o52576n64213n13949m07164
$$ 13320188 10915240 9270538 8068156 7077197 6206503 5553927 4989714 4475765 4068601
18249D068601l62890l51782k46090j62016j85486j37930j07162j59216k00906
$$ 4068601 3705711 3353929 3107839 2945823 2760337 2622407 2515245 2356029 2155123
18240B155123j13419p3500j21178o303k6910K52r0188r1550j37645j83832j35946
$$ 2155123 2041704 1968204 1847026 1840723 1813813 1814065 1723877 1632327 1494682 1310850 1174904
18229A174904k874o6739R7929j3977j58463j13812o0488m7433J8573M7542K1105
$$ 1174904 1172030 1105291 1203220 1189243 1030780 916968 856480 809047 827620 875162 896267
18218H96267K7883n3204p9183j00619M8876r40M4250k0239j22323j49042n3288
$$ 896267 924150 870946 791763 691144 740020 739080 783330 763091 640768 491726 438438
18207D38438J2646O7882K38367J39642j29493j04525L7092m3119J3974n5451q8875
$$ 438438 451084 518966 757333 896975 767482 662957 700049 656930 670904 615453 526578
18196E26578K6575J36032k6846N044J8195M0004J33570j43322q5669k9341K1130
$$ 526578 553153 689185 662339 667383 685578 725582 859152 715830 630161 600820 621950
18185F21950J4860m229L9123j7922q746N9633J16017j2544r1920o2434j6569n7556
$$ 621950 636810 632581 671704 653782 645036 704669 820686 808142 716222 653788 637219 579663
18173E79663o0072N0417m1040l3834O9281L1727J9365M1384J86466K7210j17917
$$ 579663 519591 570008 528968 495134 564415 596142 615507 656891 843357 870567 752650
18162G52650p3470r585j6543j0746J5365O9218J13791J16670q358j4629L1278
$$ 752650 679180 669595 653052 642306 657671 726889 840680 957350 948992 934363 965641
18151I65641J11699P8789L1671J30456J59039J18605P6164J28918L1064j11546
$$ 965641 1077340 1156129 1187800 1318256 1477295 1595900 1672064 1800982 1832046 1720500
18141A720500j35582O3089J04144M5295J9474N0775K00703J24346K02096K78856
$$ 1720500 1584918 1648007 1752151 1797446 1816920 1867695 2068398 2192744 2394840 2673696
18131B673696J26515J80420K91416J89737K86303M55979M75314N28989P69063
$$ 2673696 2800211 2980631 3272047 3461784 3748087 4204066 4679380 5208369 5977432
18122E977432O82366Q61793J150888J489437K015466K588832L417795M666210
$$ 5977432 6659798 7521591 8672479 10161916 12177382 14766214 18184009 22850219
18114B2850219P141916J0968605J7364376L0262290N6234895R4102617O8620921
$$ 22850219 29992135 40960740 58325116 88587406 144822301 238924918 307545839
18107C07545839m7917011r1865945o7203849l7319608k0382579j2010308p586748
$$ 307545839 259628828 167762883 100559034 63239426 42856847 30846539 23259791
18100B3259791m905278l301976k616454j914326j441015j192875r91265r09466
$$ 23259791 18354513 15052537 12436083 10521757 9080742 7887867 6896602 5987136
18092E987136o68303m74736n16610l30143k60747k29851k78948k14142j40491
$$ 5987136 5318833 4844097 4327487 3997344 3736597 3506746 3227798 3013656 2873165
18083B873165J43033N9338j61889j43311j38948r0612r3885l1001J0536O2380
$$ 2873165 3016198 3075536 2913647 2770336 2631388 2540776 2446891 2415890 2426426 2488806
18073B488806p3030P96K4305J52045J45121P8496J00604J52411L52290L13206
$$ 2488806 2415776 2416572 2440877 2592922 2738043 2816539 2917143 3069554 3421844 3735050
18063C735050K96029J14930K62172M42871O72636P63236P81532R52298J422196
$$ 3735050 4031079 4146009 4408181 4851052 5523688 6286924 7068456 8020754 9442950
18054I442950J982435K613978M168506O779963R332173O900923J101475J087460
$$ 9442950 11425385 14039363 18207869 24987832 34320005 41220928 42322403 43409863
18046D3409863P305529J3802528Q865077m109670n391312K198466O323602P0456
$$ 43409863 50715392 64517920 73382997 69273327 63882015 66080481 72404083 72474539
18038G2474539o612147l596146M519555L810440q030172j2180449p312117j403432
$$ 72474539 65862392 62266246 66785801 70596241 62566069 50385620 43073503 41670071
18030D1670071p17005n786510p919716o089193l754042k062614r19745q9998P61484
$$ 41670071 40953066 35166556 27246840 21157647 17403605 15340991 14421246 14331248 15092732
18021A5092732J421399K711901M872448P719225P942674K771617q2410L924292
$$ 15092732 16514131 19226032 24098480 31817705 39760379 42531996 42449586 46373878
18013D6373878J0842687J2206288P06347o419879j502483N344311L411822m738383
$$ 46373878 57216565 69422853 70129200 63709321 62206838 67551149 70962971 66224588
18005F6224588o068644R22969N675336k993812j1902955r895022l589691k45216
$$ 66224588 60155944 61078913 66754249 63760437 51857482 41962460 38372769 38127553
17997C8127553l672886p931678p356974n073478l235237j927074j264603j032110
$$ 38127553 34454667 26522989 19166015 14092537 10857300 8930226 7665623 6633513
17989F633513p68240n79272n14418m24479l39383k73859l12174m76983m50868
$$ 6633513 5865273 5286001 4771583 4347104 4007721 3733862 3421688 2944705 2493837
17980B493837k77193p9349l3150j12298p1934j58268j03692j56871k03142J9753
$$ 2493837 2216644 2137295 2104145 1991847 1919913 1761645 1657953 1501082 1297940 1317693
17970A317693K0515j91304J864q7820o1562o2057p9893n8862j37652j9863l3634
$$ 1317693 1338208 1146904 1148768 1060948 999386 937329 857436 798574 660922 641059 607425
17959F07425K689J51984q067m9595p206K0397N9428O0492J723k5262N6514m4303
$$ 607425 610114 762098 754031 704436 697230 717627 777055 837547 839270 814008 870522 826219
17947H26219k688j22227j34886R232J05499p4418l1438j3855M8150R2453L409
$$ 826219 823531 701304 566418 575650 681149 606731 575293 561438 609588 702041 705450
17936G05450K3983J6788n4911j81443o8878r2540R997P656l0623r4008o6054O0406
$$ 705450 729433 746221 691310 509867 440989 348449 358446 366102 335479 241471 175417 235823
17924B35823Q7186j09097r5593R7521J60747J1819n9119r558Q0655N1994j2915
$$ 235823 323009 213912 118319 215840 376587 388406 329287 319729 400384 452378 439463
17913D39463l9289j21113O6310M3158j41439p2778k7748M2191P8388r3410j53959
$$ 439463 400174 279061 345371 388529 247090 174312 146564 188755 267143 173733 19774
17902A9774L5021J09391J5301K4072l9374o6253J16717J98323J08979j59984j27754
$$ 19774 54795 164186 179487 203559 164185 97932 214649 412972 521951 361967 234213
17891B34213j4921n720O0257M0163M2239n9292K8067j30886n6860K3930r0869
$$ 234213 219292 213572 273829 313992 356231 296939 325006 194120 137260 161190 70321
17880G0321k1820o4595Q2489O9825o7366L359Q0476l4660n1082R5198K0606R593
$$ 70321 48501 -16094 66395 136220 68854 72213 152689 118029 66947 162145 182751 192344
17868A92344j18306j43698K5889M2067K1821K774m9097K1961k0494M5748O1650
$$ 192344 74038 -69660 -43771 -1704 20117 22891 -26206 -4245 -24739 21009 82659
17857H2659J1290l6162R0890k0921O3796K1519p1105j41909L3667R713O0159M4203
$$ 82659 93949 57787 148677 127756 191552 213071 141966 57 33724 43437 103596 147799
17845A47799p8826q641M2785j2963j4604q0832R5355j0584n2206J2313L1711K1485
$$ 147799 68973 60332 103117 90154 75550 -5282 90073 79489 27283 39596 71307 92792
17833I2792j13422r1604k937j5402J6310J02412J53367J07602p1072q8185M7240
$$ 92792 -20630 -112234 -115171 -130573 -114263 -11851 141516 249118 178046 89861 137101
17822A37101P8117j33326o4808j2157l0181N9530M0783o0839p2644J02474J3149
$$ 137101 215218 81892 17084 4927 -25254 34276 75059 14220 -58424 44050 57199
17811E7199K5461j7887J2809m2159o4688j58864O9998N5230P5239K3507K1386
$$ 57199 82660 64773 77582 35423 -29265 -188129 -118131 -62901 12338 35845 57231
17800E7231l2787m8593L7675J0874p2828o6982O8389m2371p5818m0388N7661K5390
$$ 57231 24444 -24149 13526 24400 -48428 -115410 -47021 -89392 -165210 -205598 -147937 -122547
17788a22547N9049Q7970K5043L9568j05814p3739J04930l3688J46918Q4631K2016
$$ -122547 -63498 24472 49515 89083 -16731 -90470 14460 -19228 127690 212321 234337
17777B34337M8048j59890j37820p0914K6638O0263r6068j6256J54306R285J12260
$$ 234337 282385 122495 -15325 -86239 -59601 662 -95406 -111662 42644 51929 164189
17766A64189J20793m7855j29671r4998J9451m5955M3720J8508j4190R3263N1165
$$ 164189 284982 237127 107456 12458 31909 -14046 29674 48182 33992 127255 178420
17755A78420r8182j11650K0076J89379N6531M8514j9991K9496K6466P0142K231
$$ 178420 80238 -31412 -11336 178043 234574 283088 263097 292593 319059 389201 391432
17744C91432J527J07632R6308q220k6840J9650N0693L257Q2266J30060k8550j09776
$$ 391432 392959 500591 596899 588679 561839 581489 632182 635439 717705 847765 819215 709439
17732G09439k46971o3011P3264l0648j63204m5165m598q6915k6321k24762n7509
$$ 709439 462468 399457 472721 442073 278869 233704 229106 142191 115870 -108892 -166401
17721a66401J67140J21243j2172k7933J69218K6990p1124o4776j1629p9043q7696
$$ -166401 739 121982 109810 81877 251095 278085 206961 142185 130556 51513 -36183
17710c6183N3702k6271o5056M1246J01875j8390l4778O5869o014P2355J53J2425
$$ -36183 17519 -8752 -73808 -32562 69313 50923 16145 82014 76000 148355 148508 160933
17698A60933k9957J4013J47242p6635j60460r2023M4175K6448r7653q4267k1685
$$ 160933 130976 144989 292231 215596 55136 -36887 7288 33736 -63917 -148184 -169869
17687a69869Q0487J0406r517N5620J01484N5089k9841l8596k7742j7263o2643
$$ -169869 -89382 -78976 -88493 -32873 68611 123700 93859 55263 27521 10258 -52385
17676e2385j09802q1199P686J29887J46402r5878j6477k1665J28221J14237o1626
$$ -52385 -162187 -243386 -235700 -105813 40589 -55289 -71766 -93431 34790 149027 87401
17665H7401j42717j15322J01416M1397J2461J70037j7224p4249n3118p6462o4904
$$ 87401 -55316 -170638 -69222 -27825 -15364 154673 137449 63200 10082 -66380 -131284
17654a31284J21878k5813j0844M6785o4593k8744l4793j827J46673m933l3332
$$ -131284 -9406 -35219 -46063 722 -63871 -92615 -127408 -129235 17438 12505 -20827
17643b0827K7313M081R7268J8839R0686n9181p4210j34990j51623K2377J00417
$$ -20827 6486 10567 107835 126674 217360 158179 83969 -51021 -202644 -180267 -79850
17632g9850l4833n1133L8622J65322M1000n0558j4756n7071K9081O6296M7473
$$ -79850 -114683 -165816 -127194 38128 79128 28570 13814 -43257 -14176 52120 99593
17621I9593P1344M4604K4864m7714j18267l5622P2769r2709q0088J0609n8903
$$ 99593 170937 215541 240405 192691 74424 38802 111571 18862 -61226 -50617 -109520
17610a09520M7988L626j15915o6632R8737n4885M3832Q6716O2942j4224l5178
$$ -109520 -61532 -57906 -173821 -240453 -141716 -196601 -152769 -66053 -3111 -17335 -52513
17599e2513M997M9046L6185o4332l3660j67215o844R8514L1869J19649J34638
$$ -52513 -47516 1530 37715 -26617 -60277 -227492 -234336 -135822 -103953 15696 150334
17588A50334j19473k9461l8857K9031M4116m1311J731P7560K06903m5316J1760
$$ 150334 30861 1400 -37457 -8426 35690 -5621 -3890 73670 280573 235257 247017
17577B47017o2795r3658j00779m2477p8669R7028N5569N1231R721n6869k8936
$$ 247017 184222 90564 -10215 -52692 -131361 -34333 21236 72467 82188 25319 -3617
17566c617p4217k6225q3738l3367k2196J99817N042m573L8515p3585J05106N6013
$$ -3617 -77834 -104059 -187797 -221164 -243360 -43543 -38501 -43074 -4559 -78144 26962 82975
17554H2975j71302j51580n7148o9623J78079M4210q5199M5192N7036K6190O759
$$ 82975 -88327 -239907 -297055 -366678 -188599 -144389 -229588 -184396 -127360 -101170 -94411
17543i4411K3902J7563n4894o3709j5637J2709L8853n7421q9542o8886J08556
$$ -94411 -70509 -52946 -107840 -171549 -187186 -174477 -135624 -193045 -282587 -351473 -242917
17532b42917K29958J27047L633M5178J914l6994r9813M900J44402M9969j09634
$$ -242917 -12959 114088 117721 162899 164813 127819 28006 32906 177308 227277 117643
17521A17643l6956J23484J91582K959k8095k3745j09032j00648L0897Q0496j0213
$$ 117643 80687 204171 395753 398712 370617 346872 237840 137192 168089 248585 238372
17510B38372K7323o8548L8942M4214P4612j73994j30273k9531K181q1218r8586
$$ 238372 265695 197147 236089 280303 354915 180921 50648 21117 23298 -57920 -156506
17499a56506M4827J00200P9050R8920o3142r209O0044J7550J21492L8012n130
$$ -156506 -111679 -11479 67571 166491 103349 94140 154184 171734 293226 331238 326108
17488C26108m2499j11517q6441P7502R0454J79134L1863n2949q4832J71547N0627
$$ 326108 283609 172092 85651 163153 253607 432741 464604 411655 326823 498370 548997
17477E48997j28760J2181n996n2909k17518q6219K5251j17739m5300K6193L1939
$$ 548997 420237 432418 426422 373513 155995 69776 95027 -22712 -68012 -41819 -9880
17466i880o7998m1940j3668L2350M179l9073l8903M3233Q1088O7033j9565m2113
$$ -9880 -77878 -119818 -133486 -101136 -96957 -136030 -174933 -131700 -50612 16421 -3144 -45257
17454d5257P391M5860j15350J0955J31913O9651J52037Q5828N6970K18790K27613
$$ -45257 -37866 7994 -107356 -96401 35512 105163 257200 343028 399998 618788 846401
17443H46401M08744M27280n8421l87316l77599l49996k89244j21200O241m6107
$$ 846401 1255145 1682425 1624004 1236688 859089 509093 219849 98649 104890 58783
17433E8783n7403P0400J9512m8484p1567N4902K2352l4653r2019K8434L9140Q1410
$$ 58783 1380 71780 91292 42808 -28759 26143 48495 13842 -78177 -49743 -10603 70807
17421G0807L4873J1080k3154j2883j0998j0923j7639o7138M1852p878J0948M8406
$$ 70807 105680 116760 93606 80723 69725 58802 41163 -25975 15877 7999 18947 67353
17409F7353k05520N6623R1369j5924n6376O0740j8757r5221Q5164L1881Q7396
$$ 67353 -138167 -81544 9825 -6099 -62475 -1735 -20492 -115713 -30549 1332 88728
17398H8728j51522R4643J03336n095k498r697m8225j14350J7702O4858L8066K6913
$$ 88728 -62794 31849 135185 130090 127592 117895 69670 -44680 -26978 37880 75946 102859
17386A02859O3916N71j05342j85572K6028O8082p3659R9285O1828o9836j06140
$$ 102859 166775 167346 62004 -123568 -97540 -29458 -103117 -3832 57996 -11840 -117980
17375a17980m3352N6491P6219k5785o2675J8711K06940J52023l7806p9748m463
$$ -117980 -161332 -104841 -28622 -54407 -117082 -98371 108569 260592 222786 143038 138575
17364A38575j9430j01315j45588l4807J74225k0412l6996L8274R630l7600l7362
$$ 138575 119145 17830 -127758 -162565 11660 -8752 -45748 -7474 2156 -35444 -72806
17353g2806N2209J1587j02053l3928J47415J10688r7050r1946K9524l3941l1P0688
$$ -72806 -20597 -9010 -111063 -144991 2424 113112 16062 -75884 -46360 -80301 -80332 -9644
17341i644K2306L2949J07245p2612o6339J18232Q2118k8697q0045m3400p1095
$$ -9644 12662 45611 152856 80244 13905 132137 214255 185558 105513 62113 -8982
17330h982j9569n9022j06495Q5633O0879J6241J71185P9289L9762M660j46242
$$ -8982 -28551 -87573 -194068 -108435 -47556 -31315 139870 219159 258921 263581 117339
17319A17339l1394L5207j98365p6646P3750q2493l9093J09146J71204M9463n3087
$$ 117339 85945 121152 -77213 -153859 -80109 -162602 -201695 -92549 78655 128118 75031
17308G5031j14492r9339K5160M4649J48906O2867l9158p8847Q176l3231J7398
$$ 75031 -39461 -138800 -113640 -68991 79915 142782 103624 24777 32953 -278 17120
17297A7120N121M207J26114J9695k0718n0845N0915J33301l5089q0790K0083j09938
$$ 17120 22241 26448 152562 172257 151539 100694 151609 284910 249821 169031 189114 79176
17285G9176r8409p2160P9300J32977N8649n4259o4125q5327j09116R2785J25641
$$ 79176 -19233 -91393 -12093 120884 179533 125274 61149 -24178 -133294 -40509 85132
17274H5132M0865p3815p0093J5045K2555m4116k2192P5052K6408k9653j7327r7025
$$ 85132 125997 52182 -17911 -2866 19689 -24427 -46619 28433 54841 25188 7861 -89164
17262h9164K251N3813L3618n2528L3844l34L5327n4306j01798q208J42314L7112
$$ -89164 -86913 -33100 518 -52010 -18166 -18500 16827 -37479 -139277 -147485 -5171 31941
17250C1941J5830M3835n876j12284j32j7967l1367J2606o4814o0974j9151K4166
$$ 31941 47771 91606 85730 -26554 -26686 -44653 -76020 -63414 -128228 -189202 -208353 -184187
17238a84187q3866o1963N7521Q3682K2380M7081L5914L7591N2143J3552L4872
$$ -184187 -268053 -330016 -272495 -188813 -166433 -119352 -83438 -45847 6296 19848 54720
17227E4720K19144l0233o5601q8316L5622P0650l5823r1689k0713N3847M759r385
$$ 54720 273864 243631 178030 89714 125336 195986 160163 68474 47761 101608 106367 96982
17215I6982j7769r3780K516L1069j13720j8462K5622r414n5307k5232J546o6593
$$ 96982 79213 -14567 -12051 19018 -94702 -113164 -87542 -96956 -152263 -177495 -175949 -242542
17203b42542R1434P4933N0941K1245Q9699j24627j36635Q832K6575J00522j2819
$$ -242542 -151108 -76175 -25234 -3989 85710 -38917 -175552 -166720 -140145 -39623 -52442
17192e2442l2782m267N323J661J6862n7314n111M2525K3914j3836q743l5464o1042
$$ -52442 -85224 -89491 -84168 -82507 -65645 -122959 -128070 -85545 -61631 -75467 -84210 -119674 -180716
17179a80716n3111j8697Q7363M2725p195j0649R7331J53539O7120r2264k8624
$$ -180716 -233827 -252524 -165161 -122436 -129631 -140280 -42949 110590 177710 85446 56822
17168E6822o8376m787O1106j50179o9733O8733L3864r630O991k431K393j5018
$$ 56822 -11554 -16341 44765 -105414 -175147 -106414 -72550 -82180 -75189 -77620 -75227 -90245
17156i0245k8259Q7358j69010l6750M4976j4599j3951M6380O6375J29582p4907
$$ -90245 -118504 -31146 -200156 -236906 -191930 -206529 -220480 -174100 -107725 21857 -53050
17145e3050r720R24m3175M9971M4064j4563k1986k9566O256o4954o5113j9250
$$ -53050 -62770 -61846 -105021 -55050 -10986 -25549 -47535 -77101 -70845 -135799 -200912 -220162
17133b20162J5422J27160N0113o222P6602P0895O7338j45o5821j31055K9792j8013
$$ -220162 -204740 -77580 -27467 -33689 42913 113808 181146 181001 115180 -15875 13917 -4096
17121d096k4966L6261j4100j4086n9685Q692j8922N0679p5246M6076P3097n1539
$$ -4096 -29062 7199 -6901 -20987 -80672 -71980 -90902 -40223 -115469 -69393 3704 -47835
17109d7835Q2840J48146Q2986q1951j40937o3533J4287j09154N5907k9444o4056
$$ -47835 35005 183151 266137 184186 43249 -20284 -5997 -115151 -59244 -88688 -152744
17098a52744P252J14412p94k266j74717r4198O0220J46142o8560L8450O7566k5077
$$ -152744 -145492 -31080 -31874 -34140 -208857 -303055 -242835 -96693 -165253 -126803 -59237 -84314
17086h4314k7875p8148m2789J23635m2616J0214J07251M6863l0400l8998l2515
$$ -84314 -112189 -190337 -233126 -109491 -152107 -141893 -34642 12221 -18179 -57177 -89692
17075h9692N2286o0901p871O6715K003q9730K2246J22085m9053q3344N5153J07419
$$ -89692 -37406 -98307 -106178 -39463 -37460 -127190 -104944 17141 -31912 -115256 -60103 47316
17063D7316q6073m5167l8284J3865o2096M2346J12520n72q6269N87j39233r518
$$ 47316 -38757 -83924 -122208 -108343 -170439 -128093 -15573 -16145 -102414 -101827 -241060 -250578
17051b50578K10445J24261O8351n5006q8897K2261j3196j07045K7857k198j2984
$$ -250578 -40133 84128 152479 97473 8576 30837 17641 -89404 -61547 -63745 -76729
17040g6729M9564Q6162R516m2075N7086l0355O2924l8355p2360p8742N1507P0595
$$ -76729 -27165 58997 68513 26438 83524 53169 116093 77738 5378 -73364 -21857 48738
17028D8738j15999j27381K5183R3500K2678L9300j09742L447L28Q4492J46425
$$ 48738 -67261 -194642 -169459 -75959 -53281 -13981 -123723 -120276 -119948 -35456 110969
17017A10969K5007J9912L7775m3337o4441j13672L6308J93097j8806j79757R4457
$$ 110969 135976 155888 193663 150326 85885 -27787 8521 201618 182812 3055 97512
17006I7512J11215o7352m1825l2094J87609j169j14545J0488k677m2145j19369
$$ 97512 208727 141375 99550 67456 255065 253896 139351 149839 147162 105017 -14352
16995a4352q1043o269m551o9147O8624m9308m6806L6680N0575J00723J04029J08598
$$ -14352 -95395 -101664 -106215 -175362 -106738 -156046 -202852 -166172 -115597 -14874 89155 197753
16983A97753k2674m7141L2489n4287p3823K6452j03206l9067K9644k2781O5641
$$ 197753 175079 127938 160427 106140 32317 58769 -44437 -83504 -53860 -76641 -11000
16972a1000K1597k7021m3040J8390Q291r984p2365K6895J76166P4264p2747m340
$$ -11000 10597 -16424 -59464 -41074 -32783 -42767 -115132 -88237 87929 162193 89446 85106
16960H5106K5956j23977o4804k3002M2727K6297j432l3498J7958J05202K9504
$$ 85106 111062 -12915 -77719 -100721 -57994 -31697 -33129 -66627 -48669 56533 86037
16949H6037o6307N7864o5606j53252J1788P1282R2420j6247k6674l0400N8471
$$ 86037 19730 77594 11988 -141264 -129476 -58194 34226 17979 -8695 -39095 19376
16938A9376N4539R482N795P6227j10083o543K7597j9726M2327j6063M3086R1404
$$ 19376 73915 83397 89192 165419 55336 48793 76390 56664 98991 82928 126014 217418
16926B17418P6785o304q7607j34409m3821M5758L8167J07183q3593j14024J7829
$$ 217418 294203 287899 200292 65883 22062 67820 105987 213170 129577 15553 33382
16915C3382o3396j15359k4470K8823j29397R9738J61317l5177j88958k0740J37570
$$ 33382 -30014 -145373 -169843 -141020 -270417 -170679 -9362 -44539 -233497 -254237 -116667
16904a16667R4837J12875N4667M0889j7035J3717p7828j642j7102o5877N1926
$$ -116667 -21830 91045 145712 186601 169566 183283 105455 103813 86711 20834 72760
16893G2760Q0184j4939J9369j24320o4088N301J52520R758l2422L5053n3910m5109
$$ 72760 152944 138005 157374 33054 -31034 -25733 126787 136545 104123 139176 85266 40157
16881D0157p0991M0909R9817j0034l5298j15562j08225J8215q729m2079q572N7616
$$ 40157 -30834 10075 109892 99858 64560 -51002 -159227 -141012 -149741 -191820 -200392 -142776
16869a42776J13935J7791j0979j18114J57606P959k0221r1180k8330k7113o6308
$$ -142776 -28841 -11050 -22029 -140143 17463 25422 5201 -85979 -114309 -141422 -207730
16858b07730J09377R3770O1428o2267m4841L2837N9972j30391m1227J34066K3904
$$ -207730 -98353 -4583 56845 -5422 -50263 -17426 42546 -87845 -129072 4994 28898
16847B8898l5926o0239K1587L9984j125p8439J07497L7752k9781n8138n2579M4242
$$ 28898 -7028 -67267 -45680 -5696 -6821 -85260 22237 59989 30208 -27930 -80509 -36267
16835c6267J12461m8034j73303L4785O0521j528k7607j6871O9016L2316j3218
$$ -36267 76194 28160 -145143 -110358 -49837 -51365 -78972 -95843 -26827 5489 -7729
16824g729j27704O6105J325L7374j33350o0562J13359L9460Q5020l0831O025J07709
$$ -7729 -135433 -69328 -68003 -30629 -163979 -224541 -111182 -71722 13298 -17533 -11508 96201
16812I6201Q8668K2338n2650j27136l3338o0740K0813J2504M7676J7186K1053
$$ 96201 184869 207207 154557 27421 -5917 -66657 -45844 -33340 14336 31522 52575
16801E2575q5253L1910O2618N110q373j37471O1830J31533j9356n9115N3536n6795
$$ 52575 -32678 -768 61850 66960 58587 -78884 -17054 114479 95123 36008 89544 32749
16789C2749j16843o3715K9651o7453q832J10899p3559N5133j971k0192P9793R2189
$$ 32749 -84094 -147809 -118158 -185611 -194443 -83544 -157103 -101970 -103941 -124133 -44340 47849
16777D7849n5428o5879J3104J8197o139k6268n9596n953P529K9267m7871J93145
$$ 47849 -7579 -73458 -60354 -42157 -48296 -74564 -134160 -140113 -132584 -103317 -151188 41957
16765D1957K29546m2915k70820j33824k6205r423J47722j8657J22362L5189m6391
$$ 41957 271503 228588 -42232 -176056 -202261 -211684 -63962 -82619 39743 74932 28541
16754B8541N6989R364q8104M5717l4916m1772O5973L9272p5128j17803j2751J29633
$$ 28541 85530 94894 6790 52507 17591 -24181 41792 81064 5936 -111867 -124618 5015
16742E015Q7094l5901R1596Q0902j13292o9566K7576j02860m2537M7666J20771
$$ 5015 92109 56208 147804 228706 115414 45848 73424 -29436 -71973 -24307 96464
16731I6464m7511o2867J36641n7748n4411j5099Q9906p3130r6947p6100p0393
$$ 96464 48953 -13914 122727 64979 10568 -4531 85375 12245 -84702 -160802 -231195
16720b31195J48366M7133q6375O6859J7533r8334M8454K01171J53383M2321r6223
$$ -231195 -82829 -35696 -122071 -55212 -37679 -136013 -87559 113612 266995 309316 213093
16709B13093j03005L7504K2230k5143k3160r572o6923j35821p2505L3878P2671
$$ 213093 110088 147592 169822 144679 121519 111947 45024 -90797 -163302 -129424 -56753
16698e6753P9784O4140p6508L8511R352p9030j6921l1172j7915k8205P8081L7905
$$ -56753 23031 87171 10663 49174 58526 -20504 -37425 -68597 -86512 -114717 -36636 1269
16686A269j5535r4541M0239K03321P7866l1956k4062m9844m7246J4363r8279j57700
$$ 1269 -14266 -108807 -68568 134753 212619 180663 156601 106757 59511 73874 -24405 -182105
16674a82105j33701J12254N8928m8777J8397J61058M8290j64660j45148N8949
$$ -182105 -315806 -203552 -144624 -193401 -175004 -13946 34344 -130316 -275464 -216515
16664b16515R2885L6840O719M4558j8775l5609k3214Q4802J9310Q760j9632o1486
$$ -216515 -123630 -86790 -80071 -35513 -54288 -89897 -113111 -28309 -8999 -239 -19871 -81357
16652h1357N5251M2265P9152P1516p5678M8520l4366o5172j75894j15012K8198
$$ -81357 -26106 16159 95311 166827 91149 139669 105303 40131 -135763 -250775 -222577
16641b22577K05540J35450O294j2956j14471N3233l1360n9664p5680K0913j6418
$$ -222577 -17037 118413 124707 111751 -2720 50513 19153 -40511 -116191 -95278 -111696
16630a11696P5493P1760j34650J737K41470m2377j31684M997n0467k4359L1661
$$ -111696 -36203 35557 -99093 -97356 144114 101737 -29947 -24950 -75417 -99776 -68115
16619f8115j7457m8188K0476J07399p6794l6742N2945K3361P0655l0546N8286
$$ -68115 -85572 -133760 -113284 -5885 -82679 -119421 -66476 -43115 27540 -3006 55280
16608E5280R541o1277K710p3889j39479m8269j4331O0979P1236J58381J29590
$$ 55280 64821 3544 6254 -67635 -207114 -255383 -269714 -208735 -137499 20882 150472
16597A50472L4197l1489L3065J2330q7459k7097o189j64213j22145K0623O6188
$$ 150472 184669 153180 186245 198575 111116 84019 77830 -86383 -208528 -187905 -121717
16586a21717n5542k961K2366j7343l1590J06164K08353P3249r6921l7088j47843
$$ -121717 -177259 -180220 -157854 -175197 -206787 -100623 107730 180979 84058 46970 -100873
16575a00873r148j09559J7802P2178L9246R3560l0596r422j07735j5357Q8455
$$ -100873 -110021 -219580 -201778 -129600 -90354 3206 -27390 -36812 -144547 -159904 -71449
16564g1449R4947o9449l9898J1924J01046J3948l7392Q8694l9129n0170J02759
$$ -71449 23498 -45951 -85849 -73925 27121 41069 3677 92371 53242 3072 105831
16553A05831k7962r3493L6036J1j17038N7150J08902n0084p734Q0816R5350r0550
$$ 105831 77869 -15624 20412 20423 -96615 -39465 69437 19353 11619 92435 187785 97235
16541I7235j18395j1072J12N5132l251m4539j0636O0891J00037j7047J62235Q208
$$ 97235 -21160 -32232 -32120 23012 19761 -24778 -35414 25477 125514 108467 270702 278910
16529B78910j66800J5146o8916l8355q336M89k7210j40098j0135O8400L4382k6384
$$ 278910 112110 127256 58340 19985 11649 12138 -15072 -155170 -165305 -96905 -62523 -88907
16517h8907J10675Q9m3351m5728r575O1879J18345J14295r750k2672r7365l9659
$$ -88907 21768 21857 -21494 -67222 -76797 -14918 103427 217722 207972 185300 87935 48276
16505D8276m1318Q074M7607k4554r365N6544q4888o7385J16959O5086J6717j15807
$$ 48276 6958 15032 62639 38085 28720 85264 376 -67009 49950 115036 131753 15946
16493A5946p9081P9227L3040M898m3018M1273Q7400O1992j56321m4008j45328
$$ 15946 -63135 16092 49132 54030 11012 52285 139685 201677 45356 1348 -143980
16482a43980o7136O7487k984p1547K1668J14671n01k34298l3297N1392O2675Q3155
$$ -143980 -211116 -143629 -146613 -218160 -196492 -81821 -82322 -316620 -349917 -298525 -235850 -152695
16470a52695K484J9293j4182o6088L6299J04376M2240N273N9872p03j17259j29262
$$ -152695 -150211 -130918 -145100 -211188 -174889 -70513 -28273 -23000 36872 36169 -81090 -210352
16458b10352M0719L0572P7802J2580k3265m993n7435m0947K0424r657m555K2980
$$ -210352 -169633 -139061 -61259 -48679 -71944 -76937 -134372 -175319 -154895 -164552 -169107 -146127
16446a46127p0115O5080j4591q1102j45359J71515J45696N8656J1252m7445k7479
$$ -146127 -216242 -151162 -165753 -246855 -392214 -220699 -75003 -16347 -5095 -52540 -80019
16435h0019P1090l8001j09606J0347P4483K9266j1112L1648Q508J3599K5343L7209
$$ -80019 -8929 -46930 -156536 -146189 -71706 -42440 -53552 -21904 -13396 203 25546 62755
16423F2755M6706K5805N6600R944l8146l3908m3981n3845L4195L95j4675k0382
$$ 62755 109461 135266 191866 201810 163664 129756 85775 31930 66125 66520 51845 31463
16411C1463J7275l5958J1228k8747o110r2884R1582P3371N9433Q331j1480N1166
$$ 31463 48738 12780 24008 -4739 -10849 -103733 -12151 61220 120653 128984 117504 168670
16399A68670n262j12136n2693m851R218P043M5884N4044L8744l0574j36654j76995
$$ 168670 163408 51272 -1421 -6272 2946 9989 55873 109917 148661 118087 -18567 -195562
16387a95562J807J05500Q3573M4508m1420M2473Q907Q287q8059R753O7066J16763
$$ -195562 -193755 -88255 -4682 39826 -1594 40879 49786 58073 -29986 -20233 46833 163596
16375A63596j35922j33657q756J12659P168J7958k5184M0948j6114m0959o6680
$$ 163596 27674 -105983 -114739 -2080 5088 23046 -2138 38810 22696 -18263 -84943
16364h4943m1331l2769R7833L8584R6083N0103k0459m1457p6343J03203K8665
$$ -84943 -126274 -159043 -61210 -22626 73457 123560 103101 61644 -14699 88504 117169
16353A17169o5820j44105q918P6882R1897J90700P4242j41919j29484K7430P175
$$ 117169 51349 -92756 -101674 -24792 67105 257805 332047 190128 60644 88074 95249
16342I5249M4180Q4542j5930o2778q9562n4646p9687j36850M568J70530L8318
$$ 95249 139429 223971 208041 145263 55701 1055 -78632 -215482 -210914 -40384 -2066
16331b066k6442r2414L5761J1454m3159l3711L144j1804o4123K06J9871J50631
$$ -2066 -28508 -120922 -85161 -73707 -116866 -150577 -147433 -159237 -223360 -223154 -203283 -52652
16319e2652l3453m2121J16451K1688k0230K2972N9995L8282o2760k9289m2028
$$ -52652 -86105 -128226 -11775 9913 -10317 12655 72650 110932 48172 18883 -23145
16308b3145k3320K6886O7055L405j30608k5500L2810P2323K458m4414L5561J4678
$$ -23145 -46465 -19579 47476 50881 -79727 -105227 -72417 -94 2364 -42050 -6489 8189
16296H189n198L4410M2091L1868n9118j13640O6733q946k2546k6483o5242k0138
$$ 8189 2991 37401 79492 111360 52242 -61398 5335 -3611 -26157 -52640 -117882 -138020
16284a38020Q1323o2762k8937J17377Q0422L8265J2529j00272j2834r4833K2849
$$ -138020 -56697 -119459 -148396 -31019 49403 87668 100197 -75 -12909 -107742 -84893
16273h4893k567n877q8966o2102L9335R6787M1379N620M032M5046Q4598P6380
$$ -84893 -87460 -93337 -182303 -244405 -205070 -108283 -66904 -61284 -57252 -12206 72392 148772
16261A48772L8490n71p5473r4627j3067j4549l5240j18375O6268J21537j31588
$$ 148772 187262 186691 111218 16591 3524 -11025 -46265 -164640 -98372 23165 -108423
16250a08423j03592K4033R5952N5813j278o3871Q27O7197l5283P2071j1484k808
$$ -108423 -212015 -187982 -92030 -36217 -37495 -101366 -100539 -33342 -68625 3446 -8038 -10846
16238a0846p6130L4481L5884l3312J866q7302N6894J47432j38640q6589N8072
$$ -10846 -86976 -52495 -16611 -49923 -48057 -135359 -78465 68967 -69673 -156262 -98190
16227i8190n7367M8492J43571r501N8683Q1143p1223r9923J19914J8582q284J8061
$$ -98190 -155557 -107065 36506 27005 85688 166831 95608 -4315 115599 134181 125897 143958
16215A43958r6696l4444M9756r9016Q6582k9397m5660p1416j6344N5672Q8701
$$ 143958 47262 12818 62574 -36442 50140 20743 -24917 -96333 -112677 -57005 31696
16204C1696j2902L2829N0325j8559o4522M4558J06072k2969p5710o274Q8420p1805
$$ 31696 18794 51623 101948 83389 18867 63425 169497 146528 70818 64544 152964 81159
16192H1159N065K2885n1522N3295R8604j2749M0555j16317j63673L8543J03911
$$ 81159 86224 109109 57587 110882 209486 196737 237292 120975 -42698 -4155 99756
16181I9756q3870R4750p4707j50124M7499M9485K0930k2289l9840o5891L7238
$$ 99756 15886 110636 35929 -114195 -66696 -17211 3719 -18570 -58410 -124301 -87063
16170h7063J8672J0871J37970K518M6899p7802j36087m7713N8949O109q7103L3229
$$ -87063 -68391 -57520 80450 82968 129867 52065 -84022 -131735 -72786 -66677 -153780 -120551
16158a20551N4988N7636j5124J915M6793k0510o1682J3773p9653p2618L3365N378
$$ -120551 -65563 -7927 -23051 -21136 25657 5147 -56535 -42762 -122415 -195033 -161668 -156290
16146a56290O6407J392p7898L3012j2614J9122k503K5579J11246N7198n2039o0066
$$ -156290 -89883 -88491 -166389 -133377 -145991 -126869 -129372 -103793 7453 64651 12612 -47454
16134d7454r2218n078n1968L9170j6413m1172L6051J07643L2304n4130p3252q3724
$$ -47454 -139672 -144750 -196718 -157548 -173961 -215133 -179082 -71439 -39135 -93265 -166517 -250241
16122b50241O7249R0376R915N44L4749N1318j00100n2053k5545P1765N6164O7298
$$ -250241 -182992 -92616 -82701 -82157 -47408 3910 -96190 -148243 -173788 -102023 -45859 21439
16110B1439q0096k1704J99442k3387j39949O1689j3798K2470n0920K0475N0688
$$ 21439 -58657 -80361 119081 95694 -44255 17434 3636 26106 -24814 -4339 46349
16099D6349n1640p4900Q7701J00992k3519M9463L6829p8352J28780O4395j73287
$$ 46349 -5291 -80191 7510 108502 84983 134446 171275 92923 221703 286098 112811
16088A12811j27728R8241J38480j5034o6448j6648J0357n6633N662j8263L6765
$$ 112811 -14917 83324 221804 206770 140322 123674 134031 77398 83060 64797 101562
16077A01562J4846j39534p3462P3920j493P3867o5157m9395j15118M1632q0254
$$ 101562 116408 -23126 -96588 -22668 -24161 49706 -15451 -64846 -179964 -138332 -218586
16066b18586o6563J13918j9648R8164J21199P7048o4684m7653R5946m2747k2344
$$ -218586 -285149 -171231 -190879 -92715 28484 105532 40848 -6805 89141 46394 24050
16055B4050J1374Q4344K0567j4900k1859j03892m137j3163L1430k9422L4564N4479
$$ 24050 35424 119768 140335 125435 103576 -316 -4453 -17616 13814 -15608 18956 73435
16043G3435M7389j4885j52836K9428O5640M1651K9562N1194p5584N2308j5139
$$ 73435 120824 105939 -46897 -17469 48171 89822 119384 170578 94994 147302 132163
16032A32163p6456r8054p2893j9719j03333L5297K14308P0392M9844j1606r6592
$$ 132163 55707 -42347 -115240 -134959 -238292 -202995 11313 81705 131549 119943 23351
16021B3351m1275O6835q7227n0989Q1957J20979L1312M1103j05684j27381l959
$$ 23351 -17924 48911 -38316 -89305 -7348 113631 144943 186046 80362 -47019 -50978
16010e0978j3583m4765j45200l0486K6131J67927N2486J04931j00475Q1458J18502
$$ -50978 -64561 -109326 -254526 -285012 -258881 -90954 -38468 66463 -34012 47446 165948
15999A65948L929j43233m0917L3389K1728R3023N7144J2019m5986j03300o652
$$ 165948 169877 26644 -14273 19116 40844 133867 191011 203030 157044 53744 47092
15988D7092m2011k3154O587L3004Q9260k2426J9343l8841m738l1934j28901m2539
$$ 47092 5081 -18073 -11486 21518 110778 88352 107695 68854 64116 32182 -96719 -139258
15976a39258n3249L9203N5124p4530p349r1643J06378J31869M6973p5751m722
$$ -139258 -192507 -153304 -98180 -172710 -180059 -271702 -165324 -33455 13518 -62233 -66955
15965f6955J8439M8873Q3369j24898K9860M2116m0563j41664L6133L4339k21374
$$ -66955 -48516 357 83726 -41172 -11312 30804 -9759 -151423 -115290 -80951 -302325
15954c02325P9877K06660j9816K352L4737L9567R6822j36730j49092J0255N4652
$$ -302325 -222448 -15788 -35604 -33252 1485 41052 137874 1144 -147948 -137693 -83041
15943h3041L4680R5110Q3701J5026o3699r0838L135J52386o9631P672j2768n0984
$$ -83041 -48361 46749 130450 145476 81777 -9061 -5926 146460 76829 84501 71733 20749
15931B0749p3645l3657q39M6930J2327j6474J47355l4479m1450o4668p4820r4173
$$ 20749 -52896 -86553 -87392 -40462 -28135 -44609 102746 68267 26817 -37851 -112671 -206844
15919b06844n4595j33099k839O0034l652J40020R9781J11364K2111m928p1013
$$ -206844 -261439 -394538 -397377 -337343 -340995 -200975 -101194 10170 32281 27353 -43660
15908d3660o6199J7493R3585m8564N5553l108o4809K0550J9575q1110m1950J06782
$$ -43660 -109859 -92366 1219 -47345 8208 5100 -59709 -39159 -19584 -100694 -142644 -35862
15896c5862R5673M9684M6114n2941j38097L4699J7162r6034j5275M6272M2950
$$ -35862 59811 109495 155609 102668 -35429 -730 16432 -79602 -94877 -48605 -5655
15885e655J1433K777P2720k7667q5771K5750L6566J00126J2314k951k2532p7286
$$ -5655 5778 8555 81275 53608 -32163 -6413 30153 130279 142593 139642 117110 39824
15873C9824q930R436M6436M15q2400j2547J844J5435J995j24904j40535k8762
$$ 39824 30894 40330 86766 87181 4781 -7766 -5922 9513 11508 -113396 -253931 -282693
15861b82693R3994O3489L8326Q0924J95204N3850j06443j13178p865j23728J306
$$ -282693 -188699 -125210 -86884 -5960 189244 243094 136651 23473 15608 -108120 -106814
15850a06814K5033j1166L1298N5402m7024j57592l225K7323O1094K2577J11229
$$ -106814 -81781 -92947 -61649 -6247 -53271 -210863 -214088 -186765 -125671 -103094 8135
15839H135L0257p3549k8418J36614q1012m4104O7114o9530k2866M277N5299M3497
$$ 8135 38392 -35157 -63575 73039 -7973 -52077 15037 -54493 -77359 -73082 -17783 25714
15827B5714k03811J4735L5164p1953R5514K2626j47685O951J03203j5112Q6904
$$ 25714 -178097 -163362 -128198 -200151 -104637 -82011 -229696 -222745 -119542 -134654 -47750
15816d7750R2707j2160n2083m5273L7392k6776r5089L5874j8899l6184O3332P7207
$$ -47750 44957 32797 -19286 -64559 -27167 -53943 -149032 -113158 -132057 -168241 -104909 -27702
15804b7702O9229M1742P326r9816o4849M344J108O243j09032Q4439N4002O3065
$$ -27702 41527 83269 90595 -9221 -74070 -69726 -68618 -62375 -171407 -86968 -32966 30099
15792C0099L3096L4973J7879L2424M143j19030K9994q2529Q3064j6301q3679q0921
$$ 30099 63195 98168 116047 148471 152614 33584 63578 -18951 64113 47812 -35867 -116788
15780a16788j49504K1989k5030J06518J25954R4707Q0677p795p2900p0415q4381
$$ -116788 -266292 -244303 -269333 -162815 -36861 57846 138523 130728 57828 -12587 -96968
15769i6968k2565o0105k4526J03656P7011M3153L0876J9926M486M8174Q0890m1301
$$ -96968 -119533 -179638 -204164 -100508 -23497 19656 50532 70458 74944 123118 204008 162707
15757A62707n362r2415j35647L2177J09176j00568j18111P7005J32659M5591L9405
$$ 162707 157345 64930 -70717 -38540 70636 -29932 -148043 -71038 61621 107212 146617
15746A46617j15607j14629K3093R5808K565q1491p9672R9372J9398p2451n2398
$$ 146617 31010 -83619 -60526 35282 37847 -43644 -123316 -23944 -4546 -76997 -129395
15735a29395l3681P7621M0948J18695P263L0571O1399j18049k6718J6895j07816
$$ -129395 -163076 -85455 -44507 74188 81451 112022 173421 55372 28654 45549 -62267
15724f2267p3497N2479M7676k3780K0828N1570n0603q6197R1106Q9850M8909m263
$$ -62267 -135764 -83285 -35609 -59389 -38561 13009 -37594 -123791 -32685 57165 106074 101811
15712A01811N9893l946k12801J7005N8886J63668J0137m5955k2632r192K8380
$$ 101811 161704 157758 -55043 -38038 20848 184516 194653 148698 126066 116874 145254
15701A45254o3068p9135j38955N4259l5296k5278J0274k2087Q2697n9513M4975
$$ 145254 82186 3051 -135904 -81645 -116941 -142219 -131945 -154032 -71335 -130848 -85873
15690h5873N5489N1566N1213m289q0218J7650O6840J9042J5147j08904o1362L7819
$$ -85873 -30384 21182 72395 68106 -12112 5538 72378 91420 106567 -2337 -63699 -25880
15678b5880P6986M7367j7681j2493J8711p5357p599M9721M1539o1782o5019O8187
$$ -25880 51106 98473 80792 68299 87010 11653 4054 53775 95314 33532 -31487 36700
15666C6700j12404j13342K1849J51039J1150k4685l8747Q1804J6304j3586m9889
$$ 36700 -75704 -189046 -167197 -16158 -5008 -29693 -68440 13364 29668 16082 -33807
15655c3807K679q8600k4574p183L2864O215J0208j09464p2540O4110M4356J2427
$$ -33807 -31128 -119728 -144302 -151485 -118621 -112406 -102198 -211662 -284202 -220092 -175736 -163309
15643a63309J9096J25016L0703L7364J3071J3152j1961m1733Q07M611j36378k6109
$$ -163309 -144213 -19197 11506 48870 61941 75093 63132 21399 22206 26817 -109561 -135670
15631a35670N2147j6287P0174J32674n5758r3761j08709k2109Q1839J2539O3722
$$ -135670 -83523 -99810 -29636 103038 47280 -46481 -155190 -177299 -95460 -82921 -19199
15620a9199J136O367l5721q1020k2104l261O7440K4329n4789j43909L5662P7260
$$ -19199 -18063 -11696 -47417 -128437 -150541 -153802 -86362 -62033 -116822 -260731 -225069 -147809
15608a47809N8577M9073J26946K0959j66680j53474j5911R9986M886j8466J54467
$$ -147809 -89232 -40159 86787 107746 -58934 -212408 -228319 -128333 -123447 -141913 12554
15597A2554P202O750L3084M7856R0673j7530n8969p5824o7904m861k5829o785
$$ 12554 19756 26506 59590 107446 198119 180589 121620 45796 -22108 -26969 -52798 -59583
15585e9583q345N4285J51919O4743K8299k9532r7410j11152P0154J40437n8719
$$ -59583 -67928 -13643 138276 203019 231318 201786 104376 -6776 63378 203815 145096
15574A45096J2664m6513q7059l1241n8725l1837J3667J05436J4468j17748J6935
$$ 145096 157760 111247 24188 -7053 -65778 -97615 -83948 21488 35956 -81792 -64857
15563f4857J4924Q4795O5977j5681l6485r947j46894p591L7249J94928M2116o4505
$$ -64857 -49933 34862 100839 85158 48673 38726 -108168 -115759 -78510 116418 158534 94029
15551I4029j18567j27923k699J08828J01300m7593p1565L990K5624L399K8173
$$ 94029 -24538 -152461 -155160 -46332 54968 7375 -64190 -60200 -34576 -31177 -3004
15540c004j41337o045M0188r2744r3808P5532J65502N0195l5869N5340Q5152Q667
$$ -3004 -144341 -150386 -110198 -202942 -296750 -221218 -55716 -5521 -41390 13950 99102 107769
15528A07769j16852r3450j00792L9114R9837J34528M7060p3326j10770O4691M9493
$$ 107769 -9083 -102533 -203325 -164211 -64374 70154 117214 43888 -66882 -2191 47302
15517D7302J006L8010k4457j06228j14305Q5796J68063J7417L6667l0299j06333
$$ 47302 48308 86318 61861 -44367 -158672 -72876 95187 112604 149271 118972 12639
15506A2639k37237j30235p6144J07278J77790Q8770Q8567N5602J19027j44619
$$ 12639 -224598 -354833 -430977 -323699 -145909 -57139 31428 87030 206057 61438
15496F1438j28134k7601J14210O4799n4427n547j5216p0123J08845J08124q376
$$ 61438 -66696 -94297 19913 84712 30285 24738 9522 -60601 48244 156368 147992
15485A47992j26293o4000n7378R6543j4660m8065o8769R7596Q9058o12P374j18476
$$ 147992 21699 -42301 -99679 -3136 -17796 -65861 -134630 -37034 52024 51412 58786 -59690
15473e9690J24351p002q1578L8199j13669o7911J51036K5208l4045o8843n7825
$$ -59690 64661 57659 -23919 14280 -99389 -167300 -16264 8944 -25101 -93944 -151769
15462a51769j2422J56788K4663J0304o9511o3059o736L420J2534M4995k4435P1445
$$ -151769 -164191 -7403 17260 27564 -41947 -105006 -111742 -108322 -95788 -50793 -75228 -3783
15450c783J38191l0571K2181k3544o7170N8702J2213k0912J06345j27148r0402
$$ -3783 134408 103837 126018 102474 35304 94006 106219 85307 191652 64504 -25898
15439b5898k0307K5659o5839k7475L7228M4411j1388n5180L2948K4315Q2339n2714
$$ -25898 -46205 -20546 -86385 -113860 -76632 -32221 -43609 -98789 -65841 -41526 40813 -11901
15427a1901l4667j08808j00428J5463K04267J2144j8537k1316j18786R6022O137
$$ -11901 -46568 -155376 -255804 -240341 -36074 -23930 -42467 -63783 -182569 -86547 -80410
15416h0410n5542O5540M5411J0981N2346m2503q042l322K4888N5448m9572M459
$$ -80410 -135952 -70412 -25001 -14020 38326 -4177 -12219 -15541 9347 64795 15223 19682
15404A9682K5660P539p7816k0021j0858j6715J20698O6101l7555r573o0089q7891
$$ 19682 45342 52881 -24935 -44956 -55814 -72529 48169 114270 76715 67142 7053 -80838
15392h0838K8491Q0729j43197j36313O8325Q0536J0462p5314l9773M5541k0860
$$ -80838 -52347 28382 -114815 -251128 -182803 -102267 -91805 -167119 -206892 -161351 -182211
15381a82211J3517O9067P1552Q1135m6573o930m1710o8436l5817J09673O1687
$$ -182211 -168694 -99627 -28075 53060 6487 -443 -42153 -110589 -146406 -36733 24954
15370B4954O4300o381j3497p82m5023q0340M0744J4447l8007j776O4850M3361
$$ 24954 89254 82873 69376 68594 23571 -56769 -16025 -1578 -39585 -41361 23489 66850
15358F6850j17803N6906L5014n4711k7032K8922K9670L0940j33824j08915N1545
$$ 66850 -50953 5953 40967 -13744 -40776 -11854 17816 48756 -85068 -193983 -142438
15347a42438K06060L1210o5103J9013O3498L6741J36559J15580j53752k12609
$$ -142438 63622 94832 29729 48742 112240 148981 285540 401120 247368 34759
15337C4759N9654L9430m2939N0349M5341p0647J9646L4620j10817k4958m5859
$$ 34759 94413 133843 90904 141253 186594 115947 135593 170213 59396 34438 -11421
15326a1421J1441o142K6672j20709R0273O8434j6371L3508j3851m5986J8129J8715
$$ -11421 20 -6122 20550 -100159 -9886 58548 42177 75685 61834 15848 33977 52692
15314E2692j9736j77613P8491J29827m892j2464k2046m9202j08951O7726k4793
$$ 52692 32956 -144657 -66166 63661 58769 46305 24259 -24943 -133894 -66168 -90961
15303i0961M98O1218J00705N7531O4067k5689o8969l2826J27613q2567L7170K4998
$$ -90961 -90463 -29245 71460 128991 193058 167369 98400 65574 193187 110620 147790 172788
15291A72788j11398J09965Q0707O7052j49428j19986l68j90611p7495J15518J06221
$$ 172788 61390 171355 252062 319114 169686 49700 49332 -141279 -218774 -103256 2965
15280B965K8437n806j11924p7261p98J46291P1375L6794L9006p5944j39601K5001
$$ 2965 31402 25596 -86328 -163589 -164387 -18096 53279 90073 129079 53135 -86466 -61465
15268f1465K4161M4072P5752K8010R7362m1876n3774r2937m2720J2911K7088j07589
$$ -61465 -37304 6768 82520 110530 207892 166016 112242 19305 -23415 -10504 16584 -91005
15256i1005l5435R6909J44824P4774j27112o1587J92780O4276r5893m5589p2389
$$ -91005 -126440 -29531 115293 190067 62955 1368 194148 258424 162531 116942 44553
15245D4553J3551k5650l7161O9425k8061N7188j5843q078Q554R54J00750K495
$$ 44553 58104 32454 -4707 64718 36657 93845 78002 69924 78478 79432 180182 182677
15233A82677j00605n3901P0858m2745j37986k3305J9772J9744j32697L546Q4802
$$ 182677 82072 28171 99029 56284 -81702 -105007 -85235 -65491 -198188 -194642 -109840
15222a09840K02664J01301J09795k18554k03641P537R7264P9796j41308o7245
$$ -109840 92824 194125 303920 85366 -118275 -110738 -13474 66322 -74986 -142231
15212a42231k7770J633j5946o7023l236K821O2189J04502J48479m0851m7229R2789
$$ -142231 -170001 -168368 -184314 -251337 -254573 -251752 -189563 -85061 63418 22567 -24662 68127
15200F8127L1385k590j69404k373K35549M5769l9878q8580n2876r6414L2065J31034
$$ 68127 99512 96922 -72482 -74855 160694 206463 166585 78005 25129 -71285 -39220 91814
15188I1814j8678j63469N2979J8915j06086l105Q7122R0849O5673Q7247Q324J8288
$$ 91814 73136 -90333 -37354 -18439 -124525 -127630 -40508 50341 116014 203261 211585 229873
15176B29873o0182o621l8443j6498k9043J3006o3103m9878K5727K8434j9457J4338
$$ 229873 169691 163070 124627 108129 79086 92092 28989 -20889 4838 33272 13815 28153
15164B8153j15916k8482n1381k4485J18682m497j05738N7409P1827J42064l6210
$$ 28153 -87763 -116245 -167626 -192111 -73429 -77926 -183664 -126255 -54428 87636 51426
15153E1426j22068P0159j7108N3008l594j29781M8671J8591L3376n4289M8272
$$ 51426 -70642 -483 -17591 35417 31823 -97958 -49287 -30696 2680 -51609 -3337
15142c337J08419l6458j8181p292q9759o3211O5180k1860N5253J2320o7871p0043
$$ -3337 105082 68624 50443 43151 -46608 -109819 -44639 -66499 -11246 1074 -66797 -136840
15130a36840J25587J35985P5572J18911J007p2768j59175p861J1496m7363O4119
$$ -136840 -11253 124732 200304 319215 320222 247454 88279 80418 91914 44551 108670
15119A08670O2212m9037o256j3227q2972r5965M837j3276r3272Q6926J17501m7338
$$ 108670 170882 121845 115589 102362 19390 -76575 -71738 -85014 -178286 -91360 26141 -21197
15107b1197L3113J12700J19313o1988j32586k53529K377J75570J49960P9092j21958
$$ -21197 11916 124616 243929 181941 49355 -204174 -201797 -26227 123733 202825 80867
15096H0867j62518p4916j12266j4806J76870Q3461M7553P9034q6662J59610K1757
$$ 80867 -81651 -156567 -268833 -283639 -106769 -23308 24245 103279 16617 176227 197984
15085A97984k8019p901j05586p675J22593m4941o2827k0507Q2699o3441j26889
$$ 197984 169965 162064 56478 48803 171396 126455 63628 43121 125820 62379 -64510
15074f4510j11079K3888n0916o1538J3133P9465N8070o9279l3943Q9480K3679
$$ -64510 -175589 -151701 -202617 -264155 -251022 -171557 -113487 -182766 -216709 -127229 -103550
15063a03550L070j4573l9797M8763l4865l5133P2474J21913J12622l9868j36813
$$ -103550 -100480 -115053 -154850 -106087 -140952 -176085 -103611 18302 130924 91056 -45757
15052d5757l1938Q2364J18353L3444m7765j21772m4369L9282N710k05907j46831
$$ -45757 -77695 4669 123022 156466 108701 -13071 -57440 -18158 -12448 -218355 -365186
15041c65186J51481J57034j56351j41165Q8269K11380k7143o3876j4585R3854
$$ -365186 -213705 -56671 -213022 -354187 -265918 -54538 -81681 -145557 -160142 -66288
15031f6288Q1320J51210o0339m2995M738N9825Q1388r2369j81424o1636k4948
$$ -66288 15032 166242 105903 62908 67646 127471 208859 116490 -64934 -126570 -151518
15020a51518k1704J37796M3021r304L4903k1623P4942m6130k8898o75q7925L7845
$$ -151518 -173222 -35426 7595 -1709 33194 11571 86513 40383 11485 10810 -77115 -39270
15008c9270N1774k5847O5214K7659j01176o9036J2374L0486Q0487O0957m7640
$$ -39270 12504 -13343 51871 79530 -21646 -90682 -78308 -47822 32665 93622 45982
14997D5982q4575n5127o1315O6319M843r7994R7179P4529O296O3913L83j02866
$$ 45982 -38593 -93720 -155035 -88716 -83873 -181867 -84688 -10159 -3863 60050 60433 -42433
14985d2433L0213j6539J7081O0249P0148o6168j58153k5652J68093P861j77044
$$ -42433 -12220 -28759 -11678 48571 118719 52551 -105602 -131254 36839 44700 -132344
14974a32344J2747N9527k493J5442K6358j7175k4865j3531M716n0537Q3827M3859
$$ -132344 -119597 -60070 -62563 -47121 -20763 -37938 -62803 -76334 -71618 -122155 -38328 5531
14962E531R3563N2221P1325j07268J09789Q2938p9856j08316j07737p3312J72991
$$ 5531 99094 151315 222640 115372 225161 308099 228243 119927 12190 -61122 111869
14951A11869l2955N804M4954m0638q9831L3018J61413j2397j02241j30612j04143
$$ 111869 78914 84718 129672 89034 -797 32221 193634 181237 78996 -51616 -155759
14940a55759q3814N6911M3285n2006O6031M2124K2831R0095K1635o6279p8697
$$ -155759 -239573 -182662 -139377 -191383 -125352 -83228 -60397 29698 51333 -14946 -93643
14929i3643L5489L3258N8457p360n4311j8648J58019Q1092n0608j14944j75737
$$ -93643 -58154 -24896 33561 26201 -28110 -46758 111261 192353 141745 26801 -148936
14918a48936o1802R5068J25541n7659O0412O8513Q0925J1002j10656m0645m7604
$$ -148936 -210738 -115670 9871 -47788 12624 81137 162062 173064 62408 21763 -25841
14907b5841Q3051J23416J45729K5743q7480q3231r4325k8377j9821q3752O1400
$$ -25841 57210 180626 326355 352098 264618 181387 87062 58685 38864 -44888 16512
14896A6512J00984L0705p6330p8728K9849n9218L268L8279M50q4172k6472q4936
$$ 16512 117496 148201 71871 -6857 22992 -36226 -32958 5321 5771 -78401 -104873 -189809
14884a89809p5388J05157L8937O8014K868J40699J13816n3308M643k1857j41522
$$ -189809 -265197 -160040 -121103 -53089 -50221 90478 204294 150986 155629 133772 -7750
14873g750j14108o4460N1158J84219J51348n0216O0484k3622r6920r0655M2068
$$ -7750 -121858 -186318 -135160 49059 200407 150191 210675 187053 90133 -522 41546
14862D1546M7421k6016j07612r417K3968j4914K2767O5877O2582L7793O689l8907
$$ 41546 88967 62951 -44661 -54078 -30110 -45024 -22257 43620 106202 143995 150684 111777
14850A11777N5431o297j08497k0185R2380n9654j42208j39717J23390J30700n4763
$$ 111777 167208 160911 52414 32229 124609 64955 -77253 -216970 -93580 37120 -17643
14839a7643l8466L04j3355P9211O3636J04443q5572o030k1875p7164j62162J5890
$$ -17643 -56109 -55805 -69160 10051 73687 178130 92558 86528 64653 -12511 -174673 -158783
14827a58783J45149J20602m6402m1013J8696M1433j85161k1791J05989N5094j6360
$$ -158783 -13634 106968 60566 19553 38249 79682 -105479 -127270 -21281 33813 17453
14816A7453o875j7952k2913M0134n5937O0003P0435J00048j35609r4111P4683
$$ 17453 10578 -7374 -30287 9847 -46090 13913 84348 184396 48787 -45324 29359
14805B9359j6507o0882R526j01742O9362P7572o3201r4457L8917J22208J1474
$$ 29359 12852 -48030 -38504 -140246 -70884 6688 -56513 -150970 -112053 10155 21629
14794B1629j844o4666k2378N8535J01067r0632j103k2445p5969J9128K14948O4029
$$ 21629 19785 -44881 -67259 -8724 92343 1711 608 -21837 -97806 -78678 136270 200299
14782B00299j03237l7748m4799l2294o5203j8104J40104Q3750J5896j47973m2374
$$ 200299 97062 59314 14515 -17779 -82982 -101086 39018 122768 138664 -9309 -51683
14771e1683R5856P2639J6350j20101M6719J7488m0107P1355k1710m6405O284q1611
$$ -51683 44173 116812 133162 13061 59780 77268 37161 108516 86806 40401 46685 -34926
14759c4926l5791L4082K0992j8819J34432N5849L0901L7230j23833j29468n4184
$$ -34926 -70717 -36635 -15643 -34462 99970 155819 186720 223950 100117 -29351 -83535
14748h3535l7902Q653N738k414p7139n631k2424q921K4006K7668J14355J18653
$$ -83535 -121437 -112784 -107046 -109460 -186599 -192230 -214654 -223575 -199569 -171901 -57546 61107
14736F1107P5184q8594k284k1050M3364p6084j07252K7188k0464j9369J5424j6386
$$ 61107 136291 47697 45413 24363 67727 -8357 -115609 -88421 -108885 -128254 -112830 -129216
14724a29216K1885L5935J05080J5138L1290O5376j6237M5090N5264j13029j07102
$$ -129216 -107331 -71396 33684 48822 80112 145488 129251 174341 229605 116576 9474
14713I474R5557R2197m1869k2980P897k00131j15120m3028J0888J09623M5372
$$ 9474 105031 197228 155359 132379 140276 -59855 -174975 -218003 -207115 -97492 -52120
14702e2120N7473j4398k5915J387j1959L9464J57205n0021j93568J6445J241M465
$$ -52120 5353 -9045 -34960 -33573 -45532 -6068 151137 101116 -92452 -76007 -74766 -70301
14690g0301J39170p5233n4113J97028Q9758l6076j22875k5329L3905J7370k0663
$$ -70301 68869 -6364 -60477 136551 226309 190233 67358 42029 75934 93304 72641
14679G2641j27629q2063N2865n530J00955O6094K9670O4640l1114j86039p0096
$$ 72641 -54988 -137051 -84186 -89716 11239 77333 107003 171643 140529 -45510 -115606
14668a15606P5316j9795m6415n0727J6651N1117K0150N8014Q7596K3094m2393
$$ -115606 -40290 -60085 -106500 -157227 -140576 -89459 -69309 -11295 76301 99395 57002
14657E7002M7696J6164N3006j41302j07314l2252K3180R6176J04203M6202n8202
$$ 57002 104698 120862 173868 32566 -74748 -107000 -83820 12356 116559 162761 104559
14646A04559r6803k3620Q4778R0444L2365m6018j19771J6455N7670o2636j35132
$$ 104559 7756 -15864 68914 159358 191723 145705 25934 42389 100059 37423 -97709
14635i7709q3995M0485J68575R4614m5923L5730P0030j03571J1039n4343k4730
$$ -97709 -181704 -141219 27356 121970 76047 111777 181807 78236 89275 34932 10202
14624A0202K9605N0638N7023J31274J05391Q0664j2005J14979Q7896P4674K91054
$$ 10202 39807 90445 147468 278742 384133 464797 452792 567771 655667 730341 1021395
14613A021395O8129o1659p9833J1396m9997M319M4319k31393r5083j27316r5943
$$ 1021395 1089524 1027865 948032 959428 909431 913750 958069 726676 631593 504277 408334
14602D08334k00214j15549P719O905o4351P8897k7803r4716m7201L5593l4657
$$ 408334 208120 92571 100290 107195 42844 121741 93938 -778 -47979 -12386 -47043
14591d7043K0599M9533Q0623R2061Q0119P1273K6713m4194J16683J38330J40170
$$ -47043 -26444 23089 103712 195773 275892 347165 373878 329684 446367 584697 724867
14580G24867J02074Q5164O784J42584J16413m9218o4223j41769j75213J59469
$$ 724867 826941 912105 918889 1061473 1177886 1128668 1064445 922676 747463 906932
14570I06932N4456j31054j69560k91580j31479q8634m5201m3738m2756O4444R0837
$$ 906932 961388 830334 660774 369194 237715 149081 103880 60142 17386 81830 172667
14559A72667j9488m9626q2292l1894J33157J39877l75j10517p62O831j6886R9939
$$ 172667 153179 103553 21261 -10633 122524 262401 262026 151509 150747 157578 140692 240631
14547B40631l4001l5133Q9900r5764p784J7192q0260n7411j29979J7667J09583
$$ 240631 206630 171497 261397 165633 157849 175041 94781 37370 -92609 -74942 34641
14536C4641J05557O7503O9191l5736j38393j58529M4978O4480r3001J7741L2120
$$ 34641 140198 207701 276892 241156 102763 -55766 -10788 53692 -39309 -21568 10552
14525A0552n4623K5859J31656Q9359K8836l8015r5755o1359m7044J1804K7609
$$ 10552 -44071 -18212 113444 202803 231639 193624 97869 36510 -10534 1270 28879
14514B8879o5013j22005p665l6311j9929J13481L1769J54799J39820l7565p0562
$$ 28879 -36134 -158139 -165804 -202115 -222044 -108563 -76794 78005 217825 180260 109698
14503A09698m7591J9694l9406n7637M4363k8284K918L2322m2688j7794J64727
$$ 109698 62107 81801 42395 -15242 29121 837 3755 36077 -6611 -24405 140322
14492A40322j2775r2858M5379l9009j39269K7381J8031o98m5871J63313O7653
$$ 140322 127547 34689 80068 41059 -98210 -70829 -52798 -53496 -99367 63946 131599
14481A31599l6429N4372m4565J8061P7401j445p5544q4595j7491M6265j1245q9638
$$ 131599 95170 149542 104977 123038 200439 198994 123450 38855 21364 67629 56384 -33254
14469c3254J15655J08323L777l4220j39009O0790O8333K2229L0659O1377J8723
$$ -33254 82401 190724 194501 160281 21272 82062 150395 172624 203283 264660 283383
14458B83383o1489p2105k041r3335j13664O3877L4958K7314Q0717j1016Q436J5737
$$ 283383 221894 149789 147748 54413 -59251 4626 39584 66898 147615 136599 145035 160772
14446A60772l3487k2796O4642n9568j19135L5469R5208J2117q6292P9976L6739
$$ 160772 127285 104489 169131 109563 -9572 25897 121105 133222 46930 126906 163645
14435A63645j0121p2766P6271J7788Q1856M1580j89641l4646L1716k9890J0585
$$ 163645 153524 80758 157029 174817 256673 298253 108612 73966 105682 75792 86377
14424H6377J13266J5624o2738q505j4336J00101N5510L7935n5838j51125j9473
$$ 86377 199643 215267 152529 144024 129688 229789 285299 323234 267396 116271 96798
14413I6798J5283o7802m006O5473N4667R703k9932K9861N4371r0046p4353J14212
$$ 96798 112081 44279 40273 105746 160413 170116 140184 170045 224416 134370 60017 174229
14401A74229O0343m2562K0694J29084o5580j4553L403o3630O3333J17934K6693
$$ 174229 234572 192010 212704 341788 276208 261655 265058 201428 264761 382695 409388
14390D09388q2324j23107j01370n3236m9381m2109Q0009J45186j383L1403N8528
$$ 409388 327064 203957 102587 49351 -30 -42139 37870 183056 181673 213076 271604
14379B71604J01548j86428j12257m9020J55999L9938j40758m4068J25363r105
$$ 271604 373152 186724 74467 25447 181446 221384 80626 36558 161921 152816
14369A52816p7899n4712R8575O1014j29437P0608l7240k5303O1745J9222m460
$$ 152816 74917 20205 118780 179794 50357 120965 83725 58422 120167 139389 134929
14358A34929J62967R2199j43808j14363K0285K9311L8958o9470p6403p9223l0201
$$ 134929 297896 390095 246287 131924 152209 181520 220478 151008 74605 -4618 -34819
14347c4819Q1904Q9737j8843J02448m1802l2598j1799j15134K0721N0815j1685
$$ -34819 47085 136822 117979 220427 178625 146027 134228 19094 39815 90630 78945
14336G8945L1989n6579R213Q3180J02436m8292j2617q4803q6351K1317p6113J5874
$$ 78945 110934 54355 63568 146748 249184 200892 188275 103472 17121 38438 -37675 -21801
14324b1801J26077n1488L0865L3159j03875l0698O5426L2379j1618N4497K9074
$$ -21801 104276 52788 83653 116812 12937 -17761 47665 80044 68426 122923 151997
14313A51997J00640Q8335O9399L0406k8988j05548j3240o4340j08669k3472L3012
$$ 151997 252637 340972 410371 440777 411789 306241 293001 228661 119992 96520 129532
14302A29532L3429k0492P2946N138J17603P0550m9615P79j74838Q6716J43292
$$ 129532 162961 142469 215415 220553 338156 408706 359091 359870 185032 271748 415040
14291D15040R1779k2468q8822j29777j88359l5009J99857N4223q730o7534j5217
$$ 415040 506819 484351 395529 265752 77393 42384 242241 296464 287734 220200 204983
14280B04983m0529l1512K5756P7719J44077k3601j3730q6457o3648p9763o1229
$$ 204983 164454 132942 158698 236417 380494 356893 343163 256706 193058 113295 52066
14269E2066O2488K03875l418j77258n9966l096J17939J39261J16034K27n4051
$$ 52066 114554 318429 315011 137753 77787 74691 192630 331891 447925 448152 394101
14258C94101J04329J64710j4970n7757J7798L2786m0360p8014j15444k0784M943
$$ 394101 498430 663140 648170 590413 608211 640997 600637 522623 407179 386395 391338
14247C91338J1187n394l772K4766J2977r0867O8622M6941J20444l0151o8500J1581
$$ 391338 402525 397131 393359 418125 431102 340235 408857 455798 576242 546091 477591 489172
14235D89172k9749L9412j6923p0737r31n765K1631J08020J40561q9106K0161R8523
$$ 489172 459423 498835 481912 411175 410244 404479 426110 534130 674691 585585 605746 704269
14223G04269p9501J2207Q6329J383l1990M1053P1043j08140L4618R9396l373R5412
$$ 704269 624768 636975 723304 724687 692697 733750 804793 696653 731271 830667 827294 922706
14211I22706J09171r04R1413j8262o4898O4812l2671J0473K65303J54787j4035
$$ 922706 1031877 1030973 1122386 1104124 1039226 1104038 1071367 1081840 1347143 1501930 1487895
14200A487895j5090R6359K0820K07222K09574J40256J53328O4800J39817K55569
$$ 1487895 1472805 1569164 1589984 1797206 2006780 2147036 2300364 2365164 2504981 2760550
14190B760550J92738K69050J28751K87262N46752M99114L72227N87111P72366
$$ 2760550 2953288 3222338 3351089 3638351 4185103 4684217 5056444 5643555 6415921
14181F415921R52770J162567J351430J570264J842029K262830K812775L648147
$$ 6415921 7368691 8531258 9882688 11452952 13294981 15557811 18370586 22018733
14173B2018733N136532P136548J0244162J5608715K1595942K3216238J7194550
$$ 22018733 27155265 34291813 44535975 60144690 81740632 104956870 122151420
14166A22151420R317992P607420J5988596K3515883J6408510k582016j9326136
$$ 122151420 131469412 139076832 155065428 178581311 194989821 192407805 173081669
14159A73081669k1211407j2115165o846655j0813129j8893318k2706970j9316868
$$ 173081669 151870262 139755097 132908442 122095313 103201995 80495025 61178157
14152F1178157j3488124r084454o073228m231613k956910k141470j500346q03045
$$ 61178157 47690033 38605579 32532351 28300738 25343828 23202358 21702012 20898967
14144B0898967n26712j67061M01738O09506J099693J712055K432151L425922N027160
$$ 20898967 20372255 20205194 20606932 21216438 22316131 24028186 26460337 29886259 34913419
14135C4913419O963342J0128135J5274399K1446024K3327738J7342155Q928588
$$ 34913419 41876761 52004896 67279295 88725319 112053057 129395212 138323800
14128A38323800O723748J4807635K3027786J6543300k886661k0745544k3170176
$$ 138323800 145047548 159855183 182882969 199426269 196539608 175794064 152623888
14121A52623888j3410898p252469j1295529j9571535k3606775k0224618j4467425
$$ 152623888 139212990 131960521 120664992 101093457 77486682 57262064 42794639
14114D2794639r610060o441694m657194l387926k642997k216671j726584j441812
$$ 42794639 33184579 26742885 22085691 18697765 16054768 13838097 12111513 10669701
14106A0669701j299377j027914r61139p03149p13968n53206l91686l57496l32722
$$ 10669701 9370324 8342410 7381271 6678122 5964154 5410948 5019262 4661766 4329044
14097D329044l48514k40438o2120j70580k88307j70903j37984j67600K5479K1854
$$ 4329044 3980530 3740092 3677972 3507392 3219085 3048182 2910198 2742598 2768077 2789931
14087B789931k35812k06658j05454j67191j81330j17140Q280n7232j3694n1350
$$ 2789931 2554119 2347461 2242007 2074816 1893486 1776346 1784626 1727394 1713700 1662350
14077A662350q6006J5232J19255j28070n9489o2979O9168l035j16492j80942o5365
$$ 1662350 1576344 1591576 1710831 1582761 1523272 1460293 1529461 1526426 1409934 1228992 1163627
14066A163627j7110j12042l3380J26392O6195O2196m2801j35191l6592Q075m7954
$$ 1163627 1146517 1034475 1001095 1127487 1193682 1255878 1213077 1077886 1041294 1049369 1001415
14055A001415J0874l0836r9948J0951o468j33752J6754L8486r4104L4835L3535
$$ 1001415 1012289 981453 881505 892456 885988 752236 768990 807476 713372 748207 781742
14044G81742p8727p2110j603n2561l8909M1115P693j23439p606K5390J16261J02025
$$ 781742 703015 630905 629302 576741 537832 578947 586640 463201 455595 480985 597246 699271
14032F99271N2783j10962j21654l9752K2084M5835K1684J07832k4576o3450l8408
$$ 699271 752054 641092 519438 479686 501770 547605 569289 677121 652545 589095 550687
14021E50687L3219K3365q6963j10246K5347m631P6144j2590o3100K4029l659o2819
$$ 550687 583906 607271 520308 410062 435409 430778 506922 494332 431232 455261 451602 388783
14009C88783l103q274K6774K33452J15814k0575m6983p8062j8320r610o5149p4888
$$ 388783 385680 377406 404180 637632 753446 732871 685888 607826 589506 579896 514747 439859
13997D39859m8354p1427K6716l4296j35691N169m5405q0997K0522J33084N7763
$$ 439859 391505 320078 346794 312498 176807 181976 136571 55574 76096 209180 266943
13986B66943q7638K313J14375r7099p6389J08238M9500j28772q3108R3281J27502
$$ 266943 179305 181618 295993 198894 122505 230743 280243 151471 68363 161644 289146
13975B89146P9919k9751R54m6849j01180j03794Q000O167J03608l8192l7420P4876
$$ 289146 369065 339314 340268 293419 192239 88445 96445 102612 206220 168028 130608 205484
13963B05484O2361o1302J82215l4281k5928K0283q5206P9131K09493k8722j47587
$$ 205484 267845 206543 388758 354477 328549 348832 263626 342757 552250 523528 375941
13952C75941p0331o8459J0728P69K8338M3162M5915q8757j07993O3717Q6348k6879
$$ 375941 305610 237151 247879 248648 276986 320148 366063 277306 169313 233030 319378 292499
13940B92499m7841K0836k7352j01840N0625n0351j01428P3044K5171p4495M5036
$$ 292499 244658 265494 238142 136302 186927 136576 35148 108192 133363 58868 103904
13929A03904J00354m3857J2436o3492j20495n8558K5092J64202K13302N8714L6499
$$ 103904 204258 160401 172837 109345 -11150 -69708 -44616 119586 332888 391602 428101
13918D28101m0562m5880m0135j26311n716K03856R6156q8016m4651J03885j6577
$$ 428101 387539 341659 301524 175213 169497 373353 469509 381493 336842 440727 424150
13907D24150k2434O7019j60612j94409j3030m3169Q4272J14196J5879j04553j46667
$$ 424150 401716 468735 308123 113714 100684 57515 141787 255983 271862 167309 20642
13896B0642J3424J12029J32074k0066J1985r4842k1300J800M9857K0458Q287M410
$$ 20642 34066 146095 278169 258103 270088 175246 153946 155746 205603 226061 234348 238758
13884B38758O2845J9613N2503n7230j08254O9359M5725o9390l4442n8438p6308
$$ 238758 301603 321216 373719 316489 208235 277594 323319 253929 219487 161049 84741
13873H4741L1393L5786m0771j20419L9438l1065J7376q689l9271J7216l0710N9926
$$ 84741 116134 151920 111149 -9270 30168 -897 16479 7790 -31481 -14265 -44975 14951
13861A4951K6952J26572O086p0168j8329K2901m5960m7734m2600J03924j2347
$$ 14951 41903 168475 174561 104393 86064 108965 63005 15271 -27329 76595 64248
13850F4248l2534Q8183r872q9920p7479j0455J6828o7854P4293L9415o6036K9943
$$ 64248 31714 119897 110025 20105 -57374 -67829 -51001 -118855 -44562 -5147 -71183 -41240
13838d1240J65190L5278n0454n6260L1031K3556k4960j0456k390n2281j61392
$$ -41240 123950 159228 108774 52514 83545 107101 82141 71685 69295 17014 -144378
13827a44378m034J61803N7562r300J4843k1745M5146L5562P3426k9932j7417j126
$$ -144378 -148412 13391 70953 61653 76496 54751 99897 135459 208885 178953 161536 160410
13815A60410k5745n0869n4325J1672j8845j06064N7878J04377Q2997J1611l4809
$$ 160410 134665 83796 29471 41143 22298 -83766 -25888 78489 161486 173097 138288
13804A38288j7518j77354l3957O2480N760j28719Q4944Q9414L7530N7343j3833
$$ 138288 120770 -56584 -90541 -28061 -22301 -151020 -66076 23338 60868 118211 104378
13793A04378k3226q8315L0811J3699o8356n1878K4068P671q9631M9450J19073
$$ 104378 81152 -7163 23648 37347 -31009 -82887 -58819 -51148 -140779 -91329 27744
13782B7744K3751O314o78q4586K6719O1992R1592j11967l6628O5305l3582r4199
$$ 27744 51495 57809 57131 -27455 -736 61256 152848 40881 4253 69558 35976 -58223
13770e8223j28390N1643j1251J02810K9481k0218P7325k0822l2440k1619p110
$$ -58223 -186613 -134970 -146221 -43411 -13930 -34148 43177 22355 -10085 -31704 -38814
13759c8814N542J44356N881p3478r5381M7202J90726j13100j58054l4762R8059
$$ -38814 -33272 111084 116965 43487 -51894 -4692 186034 72934 -85120 -119882 -21823
13748b1823j6517n068R0594Q3928p0542J4762K8433L2713R5017k6884L8474J5102
$$ -21823 -38340 -43408 47186 131114 60572 75334 103767 136480 231497 204613 243087 258189
13736B58189j53286p0888j21476q109K3216N6755J8256q6416Q0228R2911O2625
$$ 258189 104903 34015 -87461 -95570 -72354 -15599 2657 -83759 -3531 89380 152005
13725A52005n1027m9164q8982J04864J42877j5217r2814P4586J93079P3181m4485
$$ 152005 100978 51814 -37168 67696 210573 195356 102542 177128 370207 443388 398903
13714C98903q6267M9503J44667K4937K2553Q4528J25806J65267J53811R6566M9204
$$ 398903 312636 362139 506806 531743 554296 638824 764630 929897 1083708 1180274 1229478
13703A229478j00706j55135q2799m2025J9228j85611j96440r0075j55112q9035
$$ 1229478 1128772 973637 890838 848813 868041 682430 485990 395915 240803 151768
13693A51768n0959J22947j9947m3593j59447p0430M2740K20496Q2928j32092J10023
$$ 151768 100809 223756 203809 160216 769 -69661 -26921 193575 276503 144411 254434
13682B54434J08740K4602r1738q7330n0454R5794J84216J83522J33041o7858K16
$$ 254434 363174 387776 296038 208708 158254 254048 438264 621786 754827 686969 687185
13671F87185K5387J34667J26436J16455P0950j01580j63167M6014j91j63137j62048
$$ 687185 712572 847239 973675 1090130 1161080 1059500 896333 942347 942156 779019 616971
13660F16971j09707j10146r3520p0928J1685j5159o5551k5173o4335N349O8879
$$ 616971 507264 397118 303598 232670 244355 229196 163645 138472 74137 79486 148365
13649A48365l1892P8591j13413r6777J14599k5274j76604O4458L4237l0030m7464
$$ 148365 116473 195064 81651 -15126 99473 74199 -102405 -37947 -3710 -33740 -81204
13638h1204M381j03564k4296K0186Q2375M7020j6519K3244L8038J09619M64j0022
$$ -81204 -76823 -180387 -204683 -184497 -102122 -55102 -71621 -48377 -10339 99280 99744 89722
13626H9722M7190j1369r6449p6176j7593L808n4434J21019j0153r0134k7176K5119
$$ 89722 136912 125543 29094 -47082 -64675 -60867 -115301 5718 -4435 -94569 -121745 -96626
13614i6626m2299j66721L5804M6198J25496J1383k475q9738k4682K2826O4222
$$ -96626 -138925 -305646 -269842 -223644 -98148 -86765 -89240 -178978 -203660 -180834 -116612
13603a16612K6352J05020J14762j1709j35889j6190L0576j0011j8756o1305K869
$$ -116612 -90260 14760 129522 117813 -18076 -34266 -3690 -13701 -32457 -93762 -90893
13592i0893n060Q3869L8684P9266j2201K5271R9371l8866l4456L1336L0554p0819
$$ -90893 -95953 -12084 26600 105866 93665 118936 218307 179441 144985 176321 206875 136056
13580A36056p1448J05608m0443j23177J45718K20303p0340k76962j46883O6638
$$ 136056 64608 170216 129773 6596 152314 372617 302277 25315 -121568 -54930
13570e4930J14153n4827K4237O2310n0432q4978o6388N2700k5265O4212M8884
$$ -54930 59223 4396 28633 90943 40511 -44467 -110855 -58155 -83420 -19208 29676
13559B9676k5024R4735J02690R7245j5547j31045m6541N0615N5881l1449k1852
$$ 29676 4652 99387 202077 299322 283775 152730 106189 156804 212685 181236 159384
13548A59384k7492j13046o5046N8769l3996p0796L1290O8277J13095N3252L2260
$$ 159384 131892 18846 -46200 12569 -21427 -92223 -60933 7344 120439 173691 205951
13537B05951p7201j2447l1764k6973K9967P922j6538J24001L19l6168l9382N1969
$$ 205951 128750 116303 84539 57566 87533 95455 78917 202918 203237 167069 127687 179656
13525A79656n8707J0647L1323l0546K3653q299j25426j8740j76234k1130L3432
$$ 179656 120949 131596 162919 132373 156026 147727 22301 3561 -172673 -193803 -160371
13514a60371J76070M3513L1032N4614q4906L8787O6659n5857j07104k1050O3459
$$ -160371 15699 59212 90244 144858 59952 98739 165398 109541 2437 -18613 44846
13503D4846n9332m1739M7364M0583l2878q6372m9691L7365Q8498k5018m6485K8925
$$ 44846 -14486 -56225 -8861 31722 -1156 -87528 -137219 -99854 -11356 -36374 -82859 -53934
13491e3934o2571q3662J08555J15137J06903O843o4662m571m994k3439r361L5751
$$ -53934 -116505 -200167 -91612 23525 130428 137271 72609 68038 63044 39605 30244 65995
13479F5995R8130R6772o7263m0080j46400k8848J30507L0943k7299n5073O3132
$$ 65995 164125 260897 193634 153554 7154 -21694 108813 139756 112457 57384 120516
13468A20516k9341J6305J15978p1367o2792j90295r1209K4644O0017m295P3667
$$ 120516 91175 107480 223458 152091 89299 -100996 -192205 -167561 -107544 -111839 -38172
13457c8172J10258M6977k5586k7552k9864j11795p6318j165K03567J29141J31666
$$ -38172 72086 119063 93477 65925 36061 -75734 -152052 -153217 50350 179491 311157
13446C11157j7460j79835j16615P6259L1693N3061N7799L8750o7056r4186N8170
$$ 311157 293697 113862 -2753 73506 105199 158260 216059 254809 187753 93567 151737
13435A51737L6465j52095j14656N5928O1482k7845j03692m9568L2861J8394M3082
$$ 151737 188202 36107 -78549 -22621 38861 11016 -92676 -142244 -109383 -90989 -47907
13424d7907L4346O9532k5247J9885R0329n6733P2436M5404o6135l4751l4520O9995
$$ -47907 -13561 55971 30724 50609 140938 84205 156641 202045 135910 101159 66639 136634
13412A36634O7184m6758R7364j1144j06367j65274P0008R4124q8882r1683J7340
$$ 136634 203818 157060 254424 243280 136913 -28361 41647 135771 46889 -44794 -27454
13401b7454P9706R6742o201r9417q778P3682J02979M9909n3556j20162j04538
$$ -27454 52252 148994 142793 43376 34598 108280 211259 261168 207612 87450 -17088
13390a7088l4988m523k2707N2783L0260p7554j5702J04474P1895j27390R3891
$$ -17088 -52076 -56599 -79306 -26523 3737 -73817 -89519 14955 86850 -40540 53351
13379E3351N4050m1906j04778r0480q3805P5689N5597O3729K6549o787J6593k0308
$$ 53351 107401 65495 -39283 -129763 -213568 -137879 -82282 -18553 7996 1209 17802 -2506
13367b506k629q1149l1380P903L6522Q9466J5083n24O3338O451J02106J78630
$$ -2506 -5135 -86284 -117664 -109761 -73239 16227 31310 30786 94124 100575 202681 381311
13355C81311q8347k34772k2845n6401Q726K14642M2490k07805j03188O855P5182
$$ 381311 292964 58192 35347 -21054 -12328 202314 244804 36999 -66189 -59334 15848
13344A5848K884l5557L402r396J7660L2630K3133K6440J00639m6161L2051K8299
$$ 15848 18732 -16825 -13423 -22819 -5159 27471 50604 77044 177683 131522 163573 191872
13332A91872p3127j48040q435j3168M8746L1632q2955N7472O4160o980R2820p4159
$$ 191872 118745 -29295 -37730 -50898 -2152 29480 -53475 3997 68157 61177 153997 79838
13320G9838j10909r9704L0270N6135M539j21943l1497Q969m4405K6364O4216O8317
$$ 79838 -31071 -130775 -100505 -44370 -39831 -161774 -193271 -184302 -228707 -202343 -138127 -69810
13308f9810R3573L8583N941o4861k4854Q7846p8544J2556R9491o873j38593Q3986
$$ -69810 23763 62346 68287 3426 -21428 66418 -12126 430 99921 93048 -45545 38441
13296C8441Q2589N0675n1393l7074k8776O0967R0707j06839n0163j3437J9014
$$ 38441 121030 171705 120312 83238 54462 115429 206136 99297 49134 35697 54711
13285E4711J34861r1934j29601r7125k8371M2907l0194p8476J8355n5583J03516
$$ 54711 189572 97638 -31963 -129088 -157459 -114552 -144746 -223222 -204867 -260450 -156934
13274a56934J97601Q9438N4261j2632n4764j3548m2418j41884r4056L4018M4466
$$ -156934 40667 130105 184366 171734 116970 103422 61004 -80880 -174936 -140918 -96452
13263i6452P0522k6015q7649O9759k8826L7867Q2092l4997j9565L8690K3795O777
$$ -96452 -25930 -51945 -139594 -69835 -98661 -60794 21298 -13699 -33264 5426 29221 35998
13251C5998J28772r131j07769Q3982J5211l5868k0277K1319j96728o1028O5549
$$ 35998 164770 155639 47870 131852 147063 111195 90918 112237 -84491 -145519 -79970
13240g9970L9362o5192n4048K1247M9106J49276k4125p2844J2580O6107o734p5783
$$ -79970 -40608 -105800 -159848 -138601 -89495 59781 35656 -37188 -24608 41499 34765 -41018
13228d1018j11651l1775l0926K1345Q9801l8439N279N3894J63222J50725p2965
$$ -41018 -152669 -184444 -215370 -194025 -104224 -142663 -137384 -83490 79732 230457 157492
13217A57492j12365p6473l9719O8097J5752k3079m6947k9198P9442J2401M014
$$ 157492 45127 -31346 -71065 -2968 12784 -10295 -57242 -86440 -6998 5403 9417
13206I417O8603j4849m0921O4887p8516q3080n8290k1035N1748P6715Q7112q0737
$$ 9417 78020 63171 22250 87137 8621 -74459 -132749 -153784 -102036 -25321 61791 -18946
13194a8946P0859N9400l1273o925M3070J24311m4727j28857k1880J6779O1632
$$ -18946 51913 111313 80040 73115 116185 240496 195769 66912 45032 61811 123443
13183A23443m5803K2295j38298q3895P3762n8128k0299M2655L1834L8983L6786
$$ 123443 77640 99935 -38363 -122258 -48496 -106624 -126923 -84268 -52434 -13451 23335
13172B3335o6462M0644p2428o9500P5878J0148K7397J27494J30385p6277r3513
$$ 23335 -43127 -2483 -74911 -144411 -68533 -58385 -30988 96506 226891 150614 57101
13161E7101j12942k3252J15872N2852q7348P0739M055k8900j1674P1279p464k05081
$$ 57101 -55841 -79093 36779 89631 2283 73022 77077 48177 36503 107782 100318 -104763
13149a04763O9182P8538L4257n4550R6358r849p2945K8592Q724J8857J00928o8108
$$ -104763 -35581 42957 77214 22664 119022 109173 36228 64820 73544 92401 193329 125221
13137A25221j6443O8247q9094j04848l3615n2263j01251P4271J32961n4330l2053
$$ 125221 108778 177025 87931 -16917 -50532 -102795 -204046 -129775 3186 -51144 -83197
13126h3197J8953O9150J42968r7419L0782J00005M0417l1366m0017m7932O281
$$ -83197 -64244 4906 147874 50455 81237 181242 221659 190293 150276 102344 108625
13115A08625P0163J5793k5996j12347p4727n146j40963P916o1441J36799J47257
$$ 108625 178788 194581 168585 56238 -18489 -23635 -164598 -156682 -218123 -81324 65933
13104F5933J10448J4338L2753L3894j75366o2510L6492r0146q6444L7015J5543
$$ 65933 176381 190719 223472 257366 82000 19490 55982 -34164 -120608 -83593 -68050
13093f8050k9429P9168O9983J00232L0075n5132j16658J1884M8715O5936j02134
$$ -68050 -97479 -18311 51672 151904 181979 126847 10189 22073 70788 136724 34590
13082C4590j13108n8147j2604j6016k9631J38729L2061m6796N0885n5625j22322
$$ 34590 -78518 -136665 -149269 -165285 -194916 -56187 -24126 -70922 -20037 -75662 -197984
13071a97984L5201J43549K9351R3745J470j13028l64L617p8772j01982m8147L3142
$$ -197984 -162783 -19234 10117 103862 105332 -7696 -8060 -4443 -83215 -185197 -233344 -200202
13059b00202P6264k5236R4807O6133k0835o8098j17726k481O0833l1911N7872
$$ -200202 -123938 -149174 -54367 11766 -9069 -77167 -194893 -197374 -136541 -168452 -110580
13048a10580q7491M3846J03821R670n738R2923j8908j82544N0500J7192n4713
$$ -110580 -198071 -154225 -50404 -40734 -46472 46451 27543 -155001 -104501 -87309 -142022
13037a42022l1609Q0556K33623J09685k7112J9889n140p4974o7029r0153l7180
$$ -142022 -173631 -93075 140548 250233 223121 243010 237870 162896 95867 5714 -31466
13026c1466q7474j3910J25401J10887l193o3542L3353N794J0802m8726k3937j3350
$$ -31466 -118940 -132850 -7449 103438 100245 36703 70056 75850 86652 37926 13989 639
13014F39r1537n0290r1408J00277J87212K5591K083P4650M6452j86477n9715O3900
$$ 639 -90898 -141188 -232596 -132319 54893 80484 82567 157217 203669 17192 -42523 21377
13002B1377M399j9601n2578N18k062J25272L0130n6690L1663J87639J01749j89295
$$ 21377 25776 6175 -46403 -45885 -47947 77325 107455 50765 82428 270067 371816 182521
12990A82521r8055n1531q9100l3737J2407L9744L9201q9500j6955J11439K129
$$ 182521 84466 32935 -56165 -89902 -77495 -37751 1450 -88050 -105005 6434 8563
12979H563N5109m0160n893j0724j9811o9660P4807L8935o3268j560K4879k2967
$$ 8563 63672 23512 17619 6895 -12916 -82576 -7769 31166 -32102 -33662 -8783 -31750
12967c1750J4741Q0284j5370n5675q585O2040m7308o7411J32169j1467Q164l0910
$$ -31750 -17009 63275 47905 -7770 -16355 45685 -1623 -69034 63135 51668 59832 28922
12955B8922j1448N4889L8694J7833p2830K7604l9117P320M953j00582L9732k2791
$$ 28922 17474 72363 111057 128890 56060 83664 44547 51867 56820 -43762 -4030 -26821
12943b6821l3342o3037M3068N0797J5784O5449j200q8749J11402P6419n3534n7414
$$ -26821 -60163 -123200 -80132 -29335 -13551 51898 50698 -38051 73351 149770 96236 38822
12931C8822m3856R2377Q507k7336m9384j23135q6700l366p302r189J01211Q5077
$$ 38822 -5034 87343 95850 68514 19130 -104005 -190705 -194071 -201373 -210562 -109351 -24274
12919b4274K4528M6073O9138M5194M783p7928j40348R0755k6897o5433J0591O401
$$ -24274 254 46327 115465 160659 165442 87514 -52834 37921 11024 -54409 -43818 -37417
12907c7417J8142l8810j16505N0618K7214J8926k7149J5621l4085r3321k0224
$$ -37417 -19275 -58085 -174590 -123972 -96758 -77832 -104981 -89360 -123445 -216766 -236990
12896b36990R0455J49396J0085P1269l2375m8495J05014L2830R150n0159m3440
$$ -236990 -146535 2861 12946 84215 51840 3345 108359 141189 150339 100180 56740
12885E6740M7906n2623j28095J9484k1996r0906J2546P1083N0563N395K8229l272
$$ 56740 104646 52023 -76072 -56588 -78584 -169490 -156944 -85861 -35298 -29903 -1674 -4946
12873d946J0059J88236k7206p8373q7547j21857p5340M6175P6745P6396k4191
$$ -4946 5113 193349 166143 87770 223 -121634 -196974 -150799 -74054 2342 -21849
12862b1849l2169J461n942J01961N5426j61295J08235J04964q255j34464l6874
$$ -21849 -54018 -52557 -58499 43462 98888 -62407 45828 150792 142537 8073 -28801
12851b8801k9339q9206N4713M9357O7321N3798K4725j51831m5064J02620J2058
$$ -28801 -58140 -147346 -92633 -43276 24045 77843 102568 -49263 -94327 8293 20351
12840B0351L674j37956k6133Q7314J5987l9452j41157n4674k2436K41923K45122
$$ 20351 24025 -113931 -140064 -52750 -36763 -76215 -217372 -272046 -294482 -52559 192563
12829A92563M5563j11493k17793j13651l835J1365n2923j0409R4106m1755m9455
$$ 192563 238126 126633 -91160 -204811 -208646 -197281 -250204 -260613 -166507 -208262 -257717
12818b57717J0251J9995J8318R3507j0315J9288j2693R3533P9450J07549o8931
$$ -257717 -247466 -227471 -209153 -115646 -125961 -106673 -119366 -25833 53617 161166 92235
12807I2235m04n7684J0986J39307K7285P89m6212j38927j94262O1885J10102K5580
$$ 92235 91831 34147 45133 184440 211725 212514 166302 27375 -166887 -105002 5100 30680
12795C0680P8858K2537j28098j20976p9020K0530J9483O1262K363o8090J89399
$$ 30680 109538 132075 3977 -116999 -196019 -175489 -156006 -94744 -92381 -160471 28928
12784B8928J20652J5625K4912l8060n3450m6626J5460n506r1575K2653M1668M7976
$$ 28928 149580 165205 190117 152057 98607 51981 67441 61935 -29640 -6987 34681 82657
12772H2657Q694j43401j6012r8438m3315Q1491R7593k7973q3577j7034M3641O9769
$$ 82657 91351 -52050 -68062 -166500 -209815 -128324 -30731 -58704 -142281 -159315 -115674 -45905
12760d5905m7933J6805l3096O3656K59J10426O7085n2147m6706o3970j06966J27923
$$ -45905 -93838 -77033 -110129 -46473 -46214 64212 131297 79150 32444 -31526 -138492 -10569
12748a0569O1751P349M0351Q25R368N7182o8943p8165l6018Q343k73l5878J22040
$$ -10569 51182 58531 98882 99707 109075 166257 97314 19149 -16869 -8526 -8799 -44677 77363
12735G7363J59381O4966m1213k15101q5343J09423m6987m0552P7616J18593R1662
$$ 77363 236744 301710 260497 45396 -39947 69476 22489 -18063 59553 178146 269808
12724B69808O610j40955n974M6931j1533j40927n1933p2922p2907q4417R0397
$$ 269808 276418 135463 129489 176420 164887 23960 -27973 -100895 -173802 -258219 -167822
$$ [...]
##END NTUPLES=NMR SPECTRUM
##END=
