##TITLE=Analysis number 326678
Compound Code cc 53628
Book Reference 518/71
Project Code adrs
Chemist Name colinb
##JCAMPDX= 6.0         $$ Bruker NMR JCAMP-DX V2.0
##DATA TYPE= NMR SPECTRUM
##DATA CLASS= NTUPLES
##ORIGIN= Bruker BioSpin GmbH
##OWNER= nmr
$$ XWIN-NMR		Version 3.5
$$ Fri Feb 16 13:25:22 2007 GMT Standard Time (UT+0h)  MAYBRIDGE\nmr@NMR_250MHZ
##.OBSERVE FREQUENCY= 250.131544655141
##.OBSERVE NUCLEUS= ^1H
##.ACQUISITION MODE= SIMULTANEOUS (DQD)
##.ACQUISITION SCHEME= undefined
##.AVERAGES= 16
##.DIGITISER RES= 18
##SPECTROMETER/DATA SYSTEM= dpx250
##.PULSE SEQUENCE= zg30
##.SOLVENT NAME= CDCl3
##.SHIFT REFERENCE= (INTERNAL, CDCl3, 0, 16.522)
##AUDIT TRAIL= $$ (NUMBER, WHEN, WHO, WHERE, WHAT)
$$ ##TITLE= Audit trail, XWIN-NMR		Version 3.5
$$ ##JCAMPDX= 5.01
$$ ##ORIGIN= Bruker BioSpin GmbH
$$ ##OWNER= nmr
$$ C:\u/data/dgb/nmr/ADRS/1110/pdata/1/auditp.txt
$$ ##AUDIT TRAIL=  $$ (NUMBER, WHEN, WHO, WHERE, WHAT)
(   1,<2007-02-16 13:25:00.02 +000>,<MAYBRIDGE\nmr>,<NMR_250MHZ>,
      <created by zg, POWCHK disabled, PULCHK disabled
       configuration hash MD5:
       49 4B E0 1D 92 C2 6B 37 9F E6 65 BC 52 41 86 1D
       data hash MD5: 64K
       E1 4E 33 90 15 09 46 FA 48 F3 D2 4A 7F A9 38 95>)
(   2,<2007-02-16 13:25:12.75 +000>,<MAYBRIDGE\nmr>,<NMR_250MHZ>,
      <Start of raw data processing
       ef LB = 0.3 FT_mod = 6 PKNL = 1 SI = 32K 
       data hash MD5: 32K
       0C 1C 1A F2 DE 4C EF 8E CB 94 90 33 32 98 94 D0>)
(   3,<2007-02-16 13:25:14.41 +000>,<MAYBRIDGE\nmr>,<NMR_250MHZ>,
      <apk 
       data hash MD5: 32K
       A7 49 72 A5 EE 6D E4 68 8B E5 F9 B6 F5 AC FA 7F>)
(   4,<2007-02-16 13:25:15.18 +000>,<MAYBRIDGE\nmr>,<NMR_250MHZ>,
      <abs ABSG = 5 
       data hash MD5: 32K
       62 DF F0 55 67 7B 81 F5 3F C7 1C 4D 82 25 A4 F0>)
$$ ##END=
$$ 
$$ hash MD5
$$ 94 48 1E FC 87 D2 36 AC 6C AB 1C 6D 72 B1 2A FA
##$RELAX= 
##$RELAX= 
##$RELAX= 
##$RELAX= 
##$RELAX= 
##$RELAX= 
##$RELAX= 
$$ Bruker specific parameters
$$ --------------------------
##$DU= <C:\u>
##$EXPNO= 1110
##$NAME= <ADRS>
##$PROCNO= 1
##$TYPE= <nmr>
##$USER= <dgb>
##$AMP= (0..31)
100 100 100 100 100 100 100 100 100 100 100 100 100 100 100 100 100 100 
100 100 100 100 100 100 100 100 100 100 100 100 100 100 
##$AQSEQ= 0
##$AQ_mod= 3
##$AUNM= <au_zg>
##$AUTOPOS= <4 >
##$BF1= 250.13
##$BF2= 250.13
##$BF3= 250.13
##$BF4= 250.13
##$BF5= 500.13
##$BF6= 500.13
##$BF7= 500.13
##$BF8= 500.13
##$BYTORDA= 1
##$CFDGTYP= 0
##$CFRGTYP= 5
##$CHEMSTR= <none>
##$CNST= (0..31)
1 1 145 1 1 1 1 1 1 1 1 1 1 1 1 1 1 1 1 1 1 1 1 1 1 1 1 1 1 1 1 1 
##$CPDPRG= <>
##$CPDPRG1= <>
##$CPDPRG2= <>
##$CPDPRG3= <>
##$CPDPRG4= <mlev>
##$CPDPRG5= <mlev>
##$CPDPRG6= <mlev>
##$CPDPRG7= <mlev>
##$CPDPRG8= <mlev>
##$CPDPRGB= <>
##$CPDPRGT= <>
##$D= (0..31)
0 1 0 0 0 0 0 0 0 0.06 0 0 0 0 0 0 0.0002 0 0 0 0 0 0 0 0 0 0 0 0 0 0 
0 
##$DATE= 1171632298
##$DBL= (0..7)
120 120 120 120 120 120 120 120 
##$DBP= (0..7)
150 150 150 150 150 150 150 150 
##$DBP07= 0
##$DBPNAM0= <>
##$DBPNAM1= <>
$$ [...]
##$SUBNAM7= <"">
##$SUBNAM8= <"">
##$SUBNAM9= <"">
##$SW= 20.6930455092707
##$SWIBOX= (0..15)
0 0 3 0 0 0 0 0 0 0 0 0 0 0 0 0 
##$SW_h= 5175.983436853
##$TD= 65536
##$TD0= 1
##$TE= 295.16
##$TE2= 300
##$TE3= 300
##$TEG= 300
##$TL= (0..7)
0 120 120 120 120 120 120 120 
##$TP= (0..7)
150 150 150 150 150 150 150 150 
##$TP07= 0
##$TPNAME0= <>
##$TPNAME1= <>
##$TPNAME2= <>
##$TPNAME3= <>
##$TPNAME4= <>
##$TPNAME5= <>
##$TPNAME6= <>
##$TPNAME7= <>
##$TPOAL= (0..7)
0.5 0.5 0.5 0.5 0.5 0.5 0.5 0.5 
##$TPOFFS= (0..7)
0 0 0 0 0 0 0 0 
##$TUNHIN= 0
##$TUNHOUT= 0
##$TUNXOUT= 0
##$USERA1= <user>
##$USERA2= <user>
##$USERA3= <user>
##$USERA4= <user>
##$USERA5= <user>
##$V9= 5
##$VALIST= <valist>
##$VCLIST= <CCCCCCCCCCCCCCC>
##$VD= 0
##$VDLIST= <DDDDDDDDDDDDDDD>
##$VPLIST= <PPPPPPPPPPPPPPP>
##$VTLIST= <TTTTTTTTTTTTTTT>
##$WBST= 1024
##$WBSW= 4
##$XGAIN= (0..3)
0 0 0 0 
##$XL= 0
##$YL= 0
##$YMAX_a= 272757
##$YMIN_a= -290749
##$ZGOPTNS= <>
##$ZL1= 120
##$ZL2= 120
##$ZL3= 120
##$ZL4= 120
##$ABSF1= 16.522
##$ABSF2= -4.171173
##$ABSG= 5
##$ABSL= 3
##$ALPHA= 0
##$AQORDER= 0
##$ASSFAC= 0
##$ASSFACI= 0
##$ASSFACX= 0
##$ASSWID= 0
##$AUNMP= <proc_1d>
##$AZFE= 0.1
##$AZFW= 0.1
##$BCFW= 0
##$BC_mod= 0
##$BYTORDP= 0
##$COROFFS= 0
##$CY= 12.5
##$DATMOD= 1
##$DC= 0
##$DFILT= <>
##$DTYPP= 0
##$F1P= 14.0000005364418
##$F2P= -0.99999901652339
##$FCOR= 0.5
##$FTSIZE= 32768
##$FT_mod= 6
##$GAMMA= 0
##$GB= 0
##$INTBC= 1
##$INTSCL= 1
##$ISEN= 128
##$LB= 0.3
##$LEV0= 0
##$LPBIN= 0
##$MAXI= 10000
##$MC2= 0
##$MEAN= 0
##$ME_mod= 0
##$MI= 0
##$NCOEF= 0
##$NC_proc= -2
##$NLEV= 6
##$NOISF1= 0
##$NOISF2= 0
##$NSP= 0
##$NTH_PI= 0
##$NZP= 0
##$OFFSET= 16.522
##$PC= 1
##$PHC0= 232.4295
##$PHC1= 5.078215
##$PH_mod= 1
##$PKNL= yes
##$PPARMOD= 0
##$PSCAL= 4
##$PSIGN= 0
##$REVERSE= no
##$SF= 250.13
##$SI= 32768
##$SIGF1= 0
##$SIGF2= 0
##$SINO= 400
##$SIOLD= 32768
##$SREGLST= <1H.CDCl3>
##$SSB= 0
##$STSI= 32768
##$STSR= 0
##$SW_p= 5175.98343685301
##$SYMM= 0
##$S_DEV= 0
##$TDeff= 65536
##$TDoff= 0
##$TI= <Analysis number 999999
Compound Code 99
Book Reference 9
Project Code 9>
##$TILT= no
##$TM1= 0
##$TM2= 0
##$TOPLEV= 0
##$USERP1= <user>
##$USERP2= <user>
##$USERP3= <user>
##$USERP4= <user>
##$USERP5= <user>
##$WDW= 1
##$XDIM= 32768
##$YMAX_p= 380000964
##$YMIN_p= -249725
$$ End of Bruker specific parameters
$$ ---------------------------------
##NTUPLES= NMR SPECTRUM
##VAR_NAME=  FREQUENCY,     SPECTRUM/REAL,   SPECTRUM/IMAG
##SYMBOL=    X,             R,               I
##VAR_TYPE=  INDEPENDENT,   DEPENDENT,       DEPENDENT
##VAR_FORM=  AFFN,          ASDF,            ASDF
##VAR_DIM=   32768,         32768,           32768
##UNITS=     HZ,            ARBITRARY UNITS, ARBITRARY UNITS
##FACTOR=    0.157963299565203, 1,           1
##FIRST=     4132.6476996994, 0,             0
##LAST=      -1043.33573715361, 0,           0
##MIN=       -1043.33573715361, -249725,     0
##MAX=       4132.6476996994, 380000964,     0
$$ Real data points
##PAGE= N=1
##DATA TABLE= (X++(R..R)), XYDATA
$$ [...]
17059B835J0383J2513j711k2798p244R259P34j0847k3188j1299j3614J3827J101
17046d0049q445K9589K7092Q489J231q700o852q069r971K653o599K952p131j9038
17032d2848J6170M0946J4510n812p438J295P768K9736n43j5001r610k2033j337
17019E803j1331j2719J932J7307O649L204k0860j446J2002M54j4137M546K4968
17006A6372r234j9684L1218J668j993m136q835k7788k909J0305K4641J0165j6564
16993C226O157j1365j4315j5966Q126J0708p651l611O274J3617J8398p389k8891
16980b2682J4728L4275P020r779j2928K5140r982j6930N542L310j9255j9821M071
16967a7291n84k2498j013L669n287P243J0932m405K3882N004R109J0952j0875
$$ y = [2835, 13218, 25731, 24020, 1222, -6022, 3237, 3971, -6876, -30064, -41363, -54977, -41150, -40049, -48494, -18905, 8187, 16676, 17907, 9207, 2355, -5714, -15685, -13032, -19631, -16679, -23810, -42848, -26678, 14268, 28778, 22966, 15528, 16823, 24591, 54327, 53784, 38783, 29173, 7140, 5803, -5528, -18247, -16315, 992, 7641, 10845, -10015, -11461, 541, 995, -13142, -8596, 16372, 7138, -12546, 18672, 20340, 18347, 14211, 5376, -22412, -25321, -15016, 9625, 19790, 3226, 9383, -1982, -16297, -32263, -24137, -13429, -21080, -24691, -18417, -4800, 13598, 6209, -22682, -7954, 26321, 33341, 23562, 10634, 35774, 25792, 8862, 14404, 17714, -1541, -21362, -17291, -17875, -40373, -41386, -37717, -43004, -35761, -24829, -29234, -5352, -348, 8761, 19713, 8838]
16954H838j583j069P358l807P19o453l2712j1920L997J7526K3423K8433J9293
16941E2043k0400q112k8134j0051P92J3260k834j2806K3610M751J1613j7287j4253
16928g808N729K678R995r361n49j1666O948J7203Q105q683l0451l7438M20K9938
16914b4940K4611R281j917R549K1972j6039r538j0029j7684Q783J5048Q298Q828
16901B6223k633k2929L533K5803j4096l2513j1258l188m766n083j882K1013J3071
16888h705q652R627L378l571K5766J6399k784r927k5729j9833L119J9131J4693
16875A2912j2934k2694j2368J0674j6093j5139J3085J1859R939j603L647Q740
16863i975k831j7113K879k87p8L8786J8835k2428L362l076J0935j0126p94K1976
$$ y = [8838, 7255, 6186, 13544, 9737, 10456, 4003, -28709, -40629, -36632, -19106, 4317, 32750, 52043, 31643, 23531, -4603, -14654, -13862, -602, -3436, -16242, 7368, 12119, 23732, 6445, -7808, -2079, 599, 10594, 1233, 684, -10982, -4034, 13169, 21274, 12591, -17860, -55298, -54878, -24940, -329, 8952, 7035, 16584, 38556, 22517, 12979, 2950, -14734, -5951, 9097, 17395, 26223, 23590, 661, 4194, 29997, 15901, -16612, -27870, -31058, -35824, -40907, -42789, -21776, -8705, -17357, -7730, -4352, -7923, 17843, 34242, 31458, 21531, -4198, -24031, -20912, -1781, 12912, -22, -22716, -35084, -24410, -40503, -55642, -42557, -30698, -20759, -22362, -18715, -9975, -12806, -29919, -27040, -27327, -27405, 11381, 30216, 7788, 11150, 8074, 19009, 8883, 8089, 30065]
16849C0065J3137k1384r047o270o325k588k6200m885K712R446J1878J233L711
16836d517J8121M100MP147j263n156q774p949O410l279K952N618o63k096m977
16821E678m498l418N824k28k4892l9595o725J5484K3513J6948K2497N148K670
16808A8406k2894K23M091j8248j7233J8078J1751R983J3941K0053q633j0530j215
16795A7773k398J2621k1404k987N569q082L676K2104J2675k2424l9292j150P995
16782a5324P130P206P611K670j3694j9981L482J11n149L546M741J3746N056j8099
16768a6948J91K4813J1973q302j2558j912r002Q802J5078n592n585L845k516n837
16754c550K187N343R943j1496j3798j0877M171R671K0952q733j3336J0295J335
$$ y = [30065, 43202, 21818, 12771, 6501, 176, -2412, -28612, -33497, -30785, -21339, -9461, -8228, -4517, 13604, 17704, 17708, 24855, 23592, 18436, 9662, 1713, 8123, 4844, 7796, 13414, 12751, 10655, 5678, 1180, -2238, 3586, 3358, -21534, -61129, -67854, -52370, -28857, -11909, 10588, 15736, 18406, -4488, -4265, -174, -18422, -35655, -17577, -5826, 4157, 18098, 38151, 29518, 18988, 17773, 15375, 27996, 6592, 3605, 9174, 1092, 4768, 26872, 39547, 17123, -22169, -23319, -15324, -8194, -988, 6623, 9293, -4401, -24382, -20900, -20789, -25938, -22392, -17651, -3905, 1151, -16948, -16757, 8056, 20029, 11727, -831, -2743, -11745, -2943, 12135, 6543, 958, 4803, 2287, -3550, -1363, 3980, 13923, 2427, -11371, -22248, -18077, -8406, 12546, 3813, -9523, 772, 2107]
16741B107L784J4540O77J9726j9240j0238q324k3152J4450J8648j7604k413N961
16728a078R19Q060n262l905Q680q663J1369r124M502Q449k2519k2949j0746K0013
16714b2254K0955J1402j1341k2221Q680K4351L478j3623N892k462j3565n911n214
16701b1833N152L245p548P868J1680MO124l422o523o971o465K042j539P46j803
16686a9243J5764p992l856R876J756n823P364L104m228j662N990j526P022l972
16672B574J5350Q62j75k3151k5675P230K3880R309P835J5986L887k8048j3426
16659c562Q969j2752Q660j4880j2154J5047J3515k671R528O497O458j1160o503
16646D992j7663J3100M051K059j2545Q699J8036L940k8401j2108j2184j9475K0103
$$ y = [2107, 5891, 20431, 21108, 40834, 21594, 11356, 3032, -20120, -5670, 12978, -4626, -7039, -1078, -159, 7901, 2639, -1266, 7414, -1249, 10120, 996, 5498, 13947, -8572, -31521, -42267, -22254, -1299, 10103, -1238, -23459, -14779, 9572, 13050, -573, 5319, 2857, -10708, -16619, -21833, -16681, -13436, -20984, -13116, -1436, -1432, 4692, 1270, -5253, -12224, -18689, -16647, -18186, -17440, -19243, -3479, -11471, -15327, -5451, -3695, -9518, -2154, 950, -3278, -4940, 1050, -476, 6546, 2574, 17924, 18786, 18611, -4540, -30215, -22985, 895, 10204, 18039, 34025, 37912, 9864, -3562, 5407, -7345, 1315, -13565, -25719, -10672, 2843, 172, 9700, 16197, 22655, 11495, 4992, -12671, 429, 4480, 6539, -6006, 2693, 20729, 24669, -3732, -15840, -28024, -47499, -27396]
16633b7396O274J0761J3489J5882p992j6416L710J3188m016m2098k1419K9035
16621b6998O224K6490j5638L461O170j4996q842L382J5482J1147n140J3394N336
16608A9472k0639k3354r913P537J9464k572R598L113j1476j0022J7258R703J6879
16595B5048q31j1863r527j3500N39q167K768J8743J7955O069r751l2105L277K4064
16581A2719J1618j88k4187j6210J3475r757j0078J6139K3211L794q440q228j9467
16568a5599j3312p273L928J7439J1945L138K2289j4117j3323M869j2465j0370
16556b2851j4422R932o844Q196O933o298k0329J1139J1548J1680L456K8999K4799
16543D5938k8966o073k0032o855J7257J9896J3250r872j6697j122k0358k971R206
$$ y = [-27396, -21122, -10361, 3128, 19010, 11018, -5398, -1688, 11500, 7484, -34614, -56033, -26998, -20774, 5716, -9922, -6461, -291, -15287, -24129, -20747, -5265, 5882, 742, 14136, 19472, -1167, -24521, -34434, -26897, -7433, -10005, -407, 2706, -8770, -18792, -1534, 8169, 25048, 24217, 12354, 2827, -10673, -10134, -18301, -15533, 3210, 21165, 27234, 17483, -14622, -11345, 12719, 24337, 24149, -38, -16248, -2773, -12530, -22608, -6469, 16742, 20536, 12096, 3868, -15599, -28911, -36184, -32256, -14817, -2872, 266, 22555, 8438, -4885, -16, -12481, -22851, -37273, -27341, -34185, -25989, -19056, -25354, -45683, -34544, -22996, -11316, -7860, 21139, 45938, 16972, 10899, -9133, -15988, 1269, 21165, 34415, 24543, 7846, 6724, -13634, -16605, -7399]
16530g399R238l419l402j0069L818R176k684Q657o492p38J867N038o789k9912
16516c3110l667J0239J6001J787n496k914j53J1384J1906l075q88K4191O176o937
16502B5444k7875p670O933j0968j1547J3738J2383j5770J1950R056J3316l831
16490A5159j3673q738N322Q802o948r225j539K478r459L879K6720k3Q148r935
16476A0968j9638O15J1460N916j9843P046J8714o133j9596J5003J8690R530k6576
16463F156j3849l580O90N333K58J4968j662P354q67o787l775m548J2684R41j9379
16448f063j3038L717O941j3727j629Q02j3808l861Q931J3822P173J8467k593J2740
16434A7874L800m779J9530J5660j0528l0686p855k3646j3901K1915J1566r444
$$ y = [-7399, 1839, -1580, -4982, -15051, -11233, -2057, -4741, 3916, -2576, -3314, -1447, 3591, -3198, -33110, -36777, -26538, -10537, -8750, -14246, -17160, -17313, -5929, 5977, 2902, 2014, 26205, 32381, 25444, -2431, -10101, -3168, -14136, -25683, -11945, 438, -15332, -3382, 5674, 18990, 15159, 1486, -7252, -1930, 6872, -76, -9301, -10840, -8362, -17821, -13942, 12778, 12755, 20903, 10968, -8670, -8055, 3405, 9321, -10522, -3476, 15238, 9105, -10491, 4512, 23202, 32732, 6156, -7693, -11273, -10583, -5250, -4992, 9976, 8314, 15668, 14801, 8014, 4239, -309, 12375, 13316, -6063, -19101, -15384, -8443, -22170, -23799, -22997, -36805, -40666, -31735, -17913, -10740, 7727, 5134, 17874, 21674, 16895, 36425, 52085, 41557, 10871, 3016, -20630, -34531, -12616, -1050, -10494]
16422a0494q149j3813m685J3923L0752R478j0606N866j0673j1764m949M971j1988
16409b2131o685J3868J6966l8j7646j8145Q300l153q287O286L579J1205P295K18
16395h368j730l471Q498q297j0157j1220K291R868J4328J4402j716j459j0895
16382g926r124J3232J3404O802j2418j1300n525O703J4934m750Q600j7615L986
16369i97J8328o013J0625k371n508J1820J293m476j3202j1060j9458J2849J0793
16356B623J9285J4900J1325n544l127J1687j4974l3117k221m955j5202J9158J4544
16343A4382J7512J6980N67j8546l4697k3659M950r538L195K7212j59q466j9113
16330b9380J6718J2633k0291j7086J5307L841j3220O843J1400J064N840p212K982
$$ y = [-10494, -18643, -32456, -37141, -23218, 7534, 17012, 6406, 12272, 1599, -10165, -15114, -10143, -22131, -28816, -14948, 2018, 1980, -15666, -33811, -25511, -28664, -36951, -30665, -27086, -15881, -8586, -8368, -10098, -13569, -5071, -13368, -23525, -34745, -32454, -22586, -8258, 6144, 4428, 2969, -7926, -17050, -3818, 9586, 16388, 3970, -7330, -12855, -6152, 8782, 4032, 12632, -4983, -997, 17331, 11318, 21943, 19572, 14064, 25884, 27177, 22701, 9499, -1561, -21019, -8170, 2623, 21908, 36808, 48133, 42589, 39462, 51149, 36175, 3058, 837, -4118, -19320, -162, 14382, 31894, 48874, 49441, 30895, -3802, -27461, -22511, -32049, -28854, -1642, -1801, -10267, -29380, -12662, -29, -20320, -37406, -22099, -18258, -31478, -24635, -13235, -12171, -6331, -13543, -10561]
16317a0561Q498o66j576N996J8482k7658o579O733k2204R059J31q652K2118q500
16303a5379J757K3463j6604q100J4876l382n94L716j0191m868l176J2338n780
16290a1924O06k906n438j487J0437J0751j9304J030J4502K3134j8576j9619Q946
16277i848K042L518m019K545J1262n072j2134M031l280K909j1396J1109J6731
16264H398J2808j1699q505L543j2813j732L606P939L4922j4002j2567j9544j5987
16251b5633K1402P578j005L34N272j7615j082P81j1672J87o574j1089J5709k087
16237b5494K253R161J679l368L312J3799J1134j888n804j8876j7897j1331q411
16224e1731J8942K1389M454M784P1m074j5027L839J8536q966N982q090L669N1
$$ y = [-10561, -2063, -2729, -4305, 1691, 20173, -7485, -14064, -7331, -29535, -20476, -20345, -28997, -6879, -15379, -13622, 9841, -6763, -14863, 13, -3369, -3963, -247, -10438, -15306, -18482, -6144, -11924, -11318, -14224, -19662, -21149, -10712, 39, -19265, -18235, -3733, 19401, 825, -18794, -9848, -7806, -4288, -8307, -5762, 5500, 428, -11706, -7675, -10955, -8046, -19442, -8333, 8398, 21206, 9507, 1002, 4545, -8268, -10000, -6394, 1545, 36467, 22465, 9898, -9646, -25633, -4231, 3347, 2342, 2676, 7948, -9667, -10749, -9968, -21640, -21453, -28027, -39116, -23407, -25494, -23241, -14080, -12401, -15769, -12457, 1342, 12476, 10588, 4784, -14092, -31989, -43320, -51731, -32789, -11400, -6946, -2162, -2091, -6165, -21192, -17353, 1183, -7783, -1801, -9891, -6222, -6171]
16210f171L031l300J2349L548q683j5077l791M507O619J5911o636j4620n695J5551
16196b457M599l626l477k6422J82J2925q709j3701Q588J0068J3923k74j0584j5086
16182c4051q576o04J6613R710j9093N642J9997J7995o400o83R613K036N82k0133
16168g352N179Q234J6790J7724n13j3464Q97n586k739p956k5367j4028j040J6336
16154a2885J7392J453J124P120J0908k418N523j7234P872J798j8916k1424K727
16141a6960J3115j2187j1836J4202j396j727J2906j8829J1285J0994o430N298
16129a565O511j2954r792P662L60J7646Q860N549l258K5056k097r57j1558j7001
16115A2462o970j3213j0859J5717L574J776J3749O339L465l517k1681k0307N116
$$ y = [-6171, -3140, -6440, 5909, 9457, 774, -14303, -18094, -13587, -6968, 8943, 2307, -12313, -18008, -2457, 2142, -1484, -4961, -31383, -31201, -18276, -26985, -40686, -32098, -22030, -8107, -8381, -18965, -34051, -42627, -43231, -26618, -16908, -36001, -30359, -10362, 7633, 1233, 550, 10163, 12199, 12781, -7352, -2173, 6061, 22851, 40575, 40062, 26598, 27495, 21909, 19170, 11214, -14153, -28181, -29221, -12885, 4507, 5960, 7084, 14204, 25112, 22694, 28217, 10983, 18855, 20653, 1737, -19687, -16960, -3845, -16032, -27868, -13666, -15062, -16789, -3883, -22712, -11427, -433, -6863, -1565, 4946, -8008, -17800, -10138, -9778, 7868, 16728, 22277, 19019, 44075, 41978, 41021, 29463, 12462, 5492, -7721, -18580, -2863, 711, 2487, 16236, 22575, 26040, 22523, 842, -19465, -14349]
16102a4349N241r99j6153O419R142J6496J1256j4770K902q233j102P341J6589
16089A9780R480P044l119P645j2487j7389n663j0949N135P459J140Q795K3531
16076D0402P853J405o923j9579p994n52m0708q430K1934j277k558P254j140r193
16062a9506j0040J0246M1832M361q107O841O401N376p622J016R876p145m669k6342
16048B518m249L28j3416N578J333K113j1230K1250N002k0360J2479J3445M646
16035A9437r969k422P467L508j3696J1148j0560l588J436k328K1061R462j4455
16022A6501j0210R591J030j1110r620m602Q961O854K370J0323o932j3573m12J3003
16008A2174R243j6820l7980o958L8386K7776j6157k5552q457O578o658L266O692
$$ y = [-14349, -9108, -10107, -26260, -19841, -10699, 5797, 17053, 2283, 5185, -3048, -4150, 3191, 19780, 29260, 36304, 33185, 40830, 28343, 10954, 5291, -5658, -523, 6936, 8076, 16871, 40402, 48255, 49660, 42737, 23158, 15164, 14612, -26096, -34526, -12592, -13869, -16427, -9173, -10313, -19506, -29546, -19300, 22532, 26893, 18786, 25627, 32028, 37404, 29782, 30798, 40674, 33529, 28860, 2518, -1731, -1403, -14819, -9241, -7908, -5795, -17025, 4225, 9227, -11133, 1346, 14791, 19437, 9468, 7046, 14513, 18021, 4325, 15473, 4913, 1325, 2761, 433, 21494, 30956, 16501, 6291, 15882, 16912, 5802, -3818, -8420, 541, 7395, 9765, 20088, 13156, -417, -829, 12174, 21417, 4597, -33383, -40341, -1955, 25821, 9664, -15888, -24345, -17767, -24425, -21159, -14467]
15995a4467O784J3581j0193N731N249n883l73K256J3686K3583q517K420j092j3753
15981A9012l001N389R120k2265J3226L021q995M179K378k2007p799L845O272j5577
15967a3202Q124L062O21M88J4181r365q330j4642L798M250K6942K064k487R135
15953B4639q376j2023J1855J415k4456j3926J4287K367K9129k057j4659k1404
15941a3209P805P566l258r500j639j29J165J8546K4665J573k3358l4979k288L900
15927b3140J1786J8815K034M965k313j1631l384O975j8685r273K154K198n145
15914b4644O9Q70J6925K5288J970O958L1j7498k2134k189J263P493j3795j4727
15900c4120N804K1818j4417j3449n741o99L1758L489j6147j5404Q241P063q251
$$ y = [-14467, -7683, 5898, -4295, 1436, 6685, 802, 429, 2685, 16371, 39954, 31437, 33857, 32765, 19012, 16011, 21400, 30520, 8255, 21481, 24502, 15507, 19686, 22064, 57, -7742, -3897, 2375, -13202, -5078, -2016, -1395, -907, 13274, 3909, -4421, -19063, -15265, -11015, 15927, 17991, 15504, 24639, 16263, 4240, 16095, 17510, -6946, -20872, -6585, -4218, 24911, 22854, 8195, -13209, -5404, 2162, -1096, -10596, -12235, -12364, -11199, 7347, 32012, 33585, 10227, -24752, -27040, -23140, -11354, 7461, 9495, 14460, 12147, 516, -2868, 4107, -14578, -23851, -21697, -19499, -24644, -24575, -23705, -6780, 18508, 20478, 27436, 27467, 9969, -12165, -14354, -13091, -5598, -19393, -34120, -28316, -6498, -20915, -34364, -40105, -40804, -9046, -5557, -21704, -37108, -28867, -21804, -30055]
15887c0055K7806M229J170k558k808J5111J0457j2746n074j204r369j0483k612
15874a8136J1118J3900P957J6415p747j8412q190p793J1582J1783n84k2384k4748
15861c5239J7490K2997J6344P301k806j2046j4094m332j388J0428J1169K690l66
15848A8148k1378j7393k4865J7435K4503Q562O958k4965j164m616p061j680k754
15835c0270p433J084L5764J1571O021k906J0399j7142j8538R883K9115K239j0785
15822A9002j7041p62L00J5064l572q308k4479j6663O60J946j7086O637K0736n740
15808b9306J1396J0467k0235N643J3925N137Q703r032J233j7200p265J435J0747
15795a4352K4964o743j5423j1076r313p268P892J6646K1914m574l163M989j1001
$$ y = [-30055, -2249, 1980, 3150, 592, -2216, 12895, 23352, 10606, 5532, 4328, -5041, -15524, -18136, -7018, 6882, 14839, 31254, 23507, 5095, -3095, -10888, 694, 12477, 11893, -10491, -35239, -17749, 5248, 21592, 28893, 26087, 14041, -53, -4385, -5773, 4655, 15824, 18514, 18148, -3230, -20623, -45488, -28053, -3550, 5012, 11970, -12995, -14159, -18775, -25836, -27516, -30270, -37703, -36619, -855, 10716, 16737, 13831, 24230, 7088, -11450, -1567, 27548, 29787, 19002, 1961, 1199, 1499, 16563, 12991, 4683, -19796, -36459, -35799, -33853, -50939, -44302, -23566, -29306, -17910, -7443, -27678, -22035, -8110, -2973, 5730, -3302, -2069, -19269, -26534, -25099, -14352, 10612, 3869, -11554, -22630, -31943, -39211, -31319, -14673, 7241, 2667, -496, 4493, -6508]
15782f508M72n151J0752Q621n74j0529k458j1730j3530q055j8049o440J6711L2395
15768a4073J2973p002J1501j046o276K445J954J8713J6842k1383k4661R697P159
15755F843J1800K900k96j7412j3503j4632P556O287l955J5356P390m240j504Q580
15741A1170N363J353J5956J0058n55J719j3516q642k2247k6350N820J5912K703
15728a256J1510N629k1900N406O914R934M501J1307P814J992l6375r075M162n170
15714d607o729P565k829M44J8656P195q148k8909J0508J5652k256j6128j1897
15701b1483l916J9550J9970r361N850J8841n990j2059j402J9158k5022k7555k384
15688b5803J3448R417L862j4701p019J6285q539n080J3573O301k239K3913m642
$$ y = [-6508, -6036, -11187, -435, 8186, 7612, -2917, -5375, -17105, -30635, -38690, -56739, -63179, -46468, -14073, -1100, -8102, 3399, 2353, -3923, -1478, 476, 19189, 36031, 14648, -10013, -316, 6843, 18643, 21543, 21247, 3835, -9668, -24300, -16744, -10457, -14412, 944, 8334, 4094, 2590, 11170, 16533, 17886, 33842, 43900, 43345, 45064, 31548, 22906, 659, -25691, -19871, -3959, -1256, 10254, 15883, -6017, -611, 6303, 16237, 20738, 32045, 39859, 41851, 5476, -3599, 563, -4607, -11336, -3771, -6600, -6156, 12500, 19695, 11547, -17362, -6854, 8798, 6542, -9586, -21483, -25399, -5849, 14121, 4760, 10610, 29451, 23461, 11402, 10000, 29158, 4136, -23419, -25803, -12355, -2938, 924, -13777, -20796, -4511, -13050, -18130, -4557, 1744, -495, 23418, 18776]
15675A8776j1105M423M586p000j5826l863q100q996l941J084K0806M423R593R953
15661A4813L465j574k0763m162p216l782L708K99R211k591J1796p452j3695q14
15647a8757J9698K2564K3958j115m3630P218O18Q599K1058j9977j9942q353K5604
15634A7543K7584N881j4925j0163m0348j3116J6624J7890J571J972r40L504k1000
15621g923k444K1054K2333J1846k7937k3120O45m280j5523J3614J146m441M57
15608a4573J3034O123j3663k790M337j0810j5448J2317J0615j0967L353O568L972
15595g932J9544O823j082p419L178j7369j2512n657J7837Q651J1336J3780J2628
15582D1806j6725l4569j3702K8769J287l874J1419J6950q187j9032k994Q138l027
$$ y = [18776, 7671, 12094, 16680, 9680, -6146, -10009, -18109, -27105, -31046, -29962, -9156, -4733, 4860, 14813, 18278, 16704, -4059, -8221, -15437, -19219, -15511, -15212, -6001, -8592, 3204, -4248, -17943, -18757, 941, 23505, 47463, 46348, 2718, 9936, 10554, 19153, 40211, 20234, 292, -8061, 17543, 45127, 51008, 36083, 25920, -14428, -27544, -10920, 6970, 8541, 10513, 9573, 13077, -7923, -10367, 10687, 33020, 44866, 16929, -6191, -5546, -9826, -25349, -11735, -10589, -15030, -14573, -1539, 4584, -9079, -11869, -7532, -18342, -33790, -21473, -10858, -21825, -18472, -11904, -7932, 11612, 18435, 17353, 9934, 13112, -4257, -16769, -22426, -4589, 4062, 15398, 29178, 41806, 25081, -9488, -23190, 5579, 6866, 2992, 14411, 31361, 23174, 4142, 1148, 9286, 6259]
15569F259n542L456N203j576n4j1690L553K377q457L406O501K610k945j3761J5768
15554E108J32l7860L290N913L136L487K0417R411O12J2455J698K31j9697j6837
15540h504j5226K429K7324j789L697Q800l180O827M54j3439k023N928p526l646
15526A26O583l317Q285L9803J4082j4729j5538l920l3686n065k417o010P889l280
15512a1194J1407N172q435J3676J6003J975n582j3983J4747J3102k9251r842J5142
15499A2937j162m791j1617j2274J2815J0887r052j3263o259L763J738j0310Q373
15486a8215O690P823K370k742n951J1959R874m097L117J3342j0768k5311m551
15473a6460q922k1105O545K3704L0147Q051j0159m179J7797Q060j1763k0429k8
$$ y = [6259, 717, 4173, 9376, 7800, 7746, -3944, -391, 1986, -6471, -3065, 3436, 6046, 3101, -10660, 5108, 5240, -32620, -29330, -23417, -20281, -16794, 3623, 13034, 13646, 26101, 27799, 28030, 8333, -8504, -23730, -21301, 6023, 4234, 7931, 16731, 13551, 20378, 20832, 7393, 5370, 11298, 3772, 126, 6709, 3392, 11677, 51480, 65562, 50833, 35295, 31375, -2311, -7376, -9793, -15803, -7914, -11194, 213, 5385, -3050, 10626, 26629, 28604, 23022, 9039, 23786, 36888, 7637, -2205, 12937, 11775, 6984, -4633, -16907, -4092, 6795, -2257, -15520, -21779, -18016, -16278, -26588, -18215, -11525, -3702, -1332, -4074, -10025, 1934, 11808, 7711, 10828, 24170, 13402, -11909, -16460, -25382, -46487, -39942, -16238, 13909, 21960, 11801, 7622, 25419, 33479, 21716, 1287, 1259]
15460A259o459N120R520L589P011J544R042J1184j8717j4512Q625k1418k3093
15447b7305J5364K660j2904O252J3565K8200k49j3125k378K5030L49k5990q849
15434F20j4142K875K3889o64j2047j584n536r014O052J2213K234j7012M436Q289
15420F09j7981j5916Q489o550j36M124n543J0765K9041l13j7138L176J3174L241
15406I042K9072M824k9702k4316n30O231L0R358j916l1m644J4643L991k2845k55
15391g048L053j2128l536o856R976r09J3932K7057l307j1256K8257j321j6483
15378A9431j2925J4583J1097m38l6941j4400P074j003M789K662m93m781R546k2652
15364b4451j3028K1765K0728J4657j9803P738l323j873r012r424K1808P48j6612
$$ y = [1259, -5200, -80, 9440, 13029, 20040, 21584, 30626, 41810, 23093, 8581, 17206, -4212, -27305, -11941, -9281, -22185, -15933, -2368, 25832, 25583, 12458, 10080, 35110, 35459, 9469, 620, -13522, -10647, 13242, 12578, 531, -1053, -6589, -15603, -9551, 2662, 4896, -12116, -7680, 609, -17372, -33288, -24799, -31349, -31485, -27361, -32904, -22139, 6902, 6589, -10549, -7373, 5801, 9042, 38114, 42938, 13236, -11080, -11610, -5379, -5349, 4009, 2093, 2062, -2582, 12061, 16052, -6793, -7048, -3995, -16123, -19659, -26515, -16539, -17448, -3516, 23541, 20234, 8978, 37235, 35914, 19431, 6506, 21089, 32186, 31748, -5193, -19593, -12519, -13522, -8733, -6071, -6564, -11345, -1799, -24451, -37479, -15714, 5014, 19671, -132, 7606, 4283, 2410, -6602, -16026, 5782, 6530, -10082]
15351a0082k0187M165J0842R513n185k9570N172J5802J1759N434o670J0159J1173
15338A2325m356k3975m904l568j366J8858L0437j162j062K1362j3790P815j2473
15325B4141m934k0313j4269k701R694K7909J0829L699L679o464j2106j2820n337
15312A007K2525K0012j6158j5182m79j629j3117r016P93J5348M361l055M020l483
15298E947l1678l891o875J5628Q061j1111J2284J4296L787J3483K943k2102o554
15285e782m475J4439k637j1396J8179l738J4707J4296n959j4372j3384j430j565
15272c117L842P400o753k088p115J2339k133j958j387q017P186J2253R913j2640
15258G725j0358K0481J5961j6304j7380P41j714J2985K186P717M154r822j192
$$ y = [-10082, -30269, -26104, -15262, -5749, -10934, -40504, -35332, -19530, -7771, -2337, -9007, 1152, 12325, 7969, -16006, -20910, -24478, -25844, -6986, 23451, 22289, 21227, 42589, 28799, 36614, 24141, 19207, -1106, -15375, -18076, -8382, 19527, 30356, 34055, 37734, 31270, 19164, 6344, 1007, 23532, 43544, 27386, 12204, 11725, 10096, -3021, -12037, -11244, 4104, 8465, 5410, 9430, 5947, -25731, -29622, -36497, -20869, -12808, -23919, -11635, 2661, 6448, 19931, 22874, 772, -5782, -10257, 4182, 1545, -9851, 8328, 4590, 19297, 33593, 27634, 13262, -122, -1552, -3117, 725, 8125, 1372, -716, -7831, 4508, 2375, 417, -970, -8987, -1801, 10452, 20365, 7725, -2633, 17848, 33809, 17505, 125, 866, -848, 12137, 14323, 22040, 26194, 16372, 15180]
15245A5180q395l395K987P151k1848j8810N418Q919n419j336Q668Q822j6413p906
15231b6377P028J1417N707Q357o667j2825K2285J3406j6219m139j614J3419m93
15218A3285J729L842m380k2257k4674j683N331K329r255J0709K1239Q965q676
15205c496p915k432j2227l335K8076K6200j2310n342j3271p094R361N017k364
15192a132l166P505J6480l354K72m919o323q010j307j4384j1569M3862J4939R91
15178B9885j7322n249K3292R967j6040k9925j6050j982N837K7555N966R939N867
15165C1740j7608P019J1159k104k4924k0882j5654J3866M038J5771M361N38J0281
15152A7601L608q347p060J571p449j750j258O899o272j847J9392j4891q35N874
$$ y = [15180, 6785, 3390, 6377, 13528, -8320, -27130, -21712, -12793, -18212, -19548, -10880, -2058, -18471, -26377, -19349, -7932, -2225, 6132, -535, -13360, 8925, 22331, 6112, 1973, 359, 13778, 13285, 15014, 18856, 14476, -7781, -32455, -34138, -28807, -26478, -35733, -25024, -3785, 5180, -3496, -11411, -13843, -26070, -29405, -1329, 24871, 12561, 7219, -6052, -13146, -3785, 1232, -1132, -4298, 3207, 19687, 16333, 16605, 11686, 5363, -2647, -3954, -18338, -29907, 13955, 28894, 29885, 12563, 7314, 30606, 40573, 24533, -5392, -21442, -23424, -17587, 9968, 15934, 25873, 31740, 14132, 21151, 32310, 30206, 5282, -15600, -31254, -17388, -13350, 2421, 6782, 7320, 17601, 21209, 12862, 5802, 7373, -76, -1826, -3084, 3815, -2457, -4304, 15088, 197, -638, 5236]
15138E236J2970P449j1709L033o21o649r726l98K687J6804N615o87J1144n468
15124B9680j108j4956j7787q196r481J2576J7912p998n586j858K071J5990J1272
15111B2531j2431J3381K5173j1190k9729k7624j1041p41J6283J2683k5492J780
15099b6417K8779J6665n099p941k907K6543K8j9951o742r765m735o04N691p170
15085a3625j5687N60J0224J9609K2581N051p277m919r18M856j204J189N790J6496
15071D2726r592p784j1323j4935j2806J2605N3l374k709L67o310R872J3438J844
15057A2072r496q81M629r706p629P619J9531r194J7080j4638r950p203J1346O956
15043A0536j1336n891R93n071n778j081p058J2161J3159N080j5948j5376J625
$$ y = [5236, 18206, 25655, 13946, 16979, 16358, 9709, -17, -415, 2272, 19076, 24691, 24004, 35148, 29680, 28572, 13616, -4171, -12367, -21848, -9272, 8640, 642, -4944, -6802, -4731, 11259, 22531, 10100, 23481, 48654, 37464, 7735, -19889, -30930, -31671, -15388, -2705, -28197, -26417, 2362, 19027, 13928, 5987, 3080, 29623, 29651, 9700, 2958, -6807, -11542, -12146, -6455, -13625, -29312, -28752, -18528, 1081, 23662, 28713, 21436, 16517, 15599, 20455, 19251, 20440, 26230, 42726, 33134, 25350, 14027, -908, -13714, -1109, -1056, -4430, -7139, -6772, -13082, -3210, 10228, 12072, 2576, 1695, 6324, -3382, -11011, -3392, 16139, 6945, 24025, 9387, -563, -7766, 3580, 10536, -800, -6691, -5698, -10769, -16547, -17628, -24686, -12525, 634, 5714, -10234, -25610, -23985]
15030b3985j6756O128J2375O480N992j0016J515R013J6400J3763q05j5921o433
15017b250j539M219M399L151j0857j2564q806K814K4702l388k2231J203j060l291
15003b5498K156L795J8351k76L740l351j5208O956J3329P665q668j215l188J114
14989b98j3785j3497J9077J6696K320O042J0121R036j4102J2031K583k493j1816
14976B1915j2060M637J0408r617m337m947j7755j136l565j0594J0001J432R01
14963a4717j4520m805M972J3731J486k948M630J3108J0679M157m206k317l273
14950E977p77q766q677j2086J2426j6322J7828J2214K944J3986J5778k7306j8838
14937a1619o381R377j1712m232L720J6401Q568j2866j5135m676M938J0166K211
$$ y = [-23985, -40741, -34613, -22238, -15758, -9766, -19782, -18267, -9254, 7146, 20909, 20104, 4183, -2250, -3789, 430, 4829, 7980, -2877, -15441, -24247, -21433, 3269, -119, -22350, -21147, -22207, -25498, -23342, -19547, -1196, -1472, 2268, -1083, -16291, -9335, 3994, 11659, 2991, 1776, -1412, -298, -14083, -27580, -8503, 8193, 10513, 16555, 26676, 35712, 21610, 33641, 36224, 33731, 21915, 9855, 14492, 24900, 15283, 10946, 5999, -11756, -12892, -16457, -27051, -17050, -15618, -14717, -29237, -34042, -29070, -15339, -13853, -16801, -12171, 937, 11616, 15773, 11567, 9250, 5977, 5200, -3566, -12243, -24329, -11903, -28225, -10397, 1817, 4761, 18747, 34525, 7219, -11619, -18000, -8623, -20335, -24567, -20847, -4446, 4122, -8744, -23879, -28555, -23617, -13451, -11240]
14924a1240k389P880K078K2875L502j6236l2682R908J1496k7509j331K0146J7406
14911C904N212j5976n507J7303O081L026N013r534q755l089j5365R0J7908J7379
14897A7690K9166l16L765k1316j5515J188J0076j942j0875k4625j1337J3626J6157
14884E742r809j2291J5331J1382J301M536j1850j0138P572J5896O183p379J1095
14871B7571L51r071m985o81O289r658J9125L805M999j7019j4699r226k297k367
14857g863J5967k992o020K5756K3820L461k1989k4238N343K2635p785j2511K12
14844A3796J1561r498j5868N16k0520j373J2120J2470J625k5880J2212P795L085
14831B041O084J7502Q94j9778p219j3536j4925J6560O609J75m77J6990j5369k0400
$$ y = [-11240, -13629, -5749, -3671, 19204, 22706, 6470, -26212, -16304, -4808, -32317, -33648, -13502, 3904, 9116, -6860, -12367, 4936, 11017, 14043, 19056, 9522, 767, -2322, -17687, -17597, 311, 17690, 46856, 46540, 50305, 28989, 13474, 14662, 24738, 22796, 11921, -12704, -24041, -10415, 5742, -4067, -16358, -1027, 10355, 11656, 16192, 4342, -5796, 1776, 17672, 23855, 16476, 27571, 27922, 18851, 13866, 13185, 19474, 9816, 28941, 32746, 37745, 20726, 6027, -3199, -5496, -7863, 8104, 5112, -908, 24848, 48668, 52129, 30140, 5902, 11245, 33880, 26095, 13584, 13796, 25357, 15859, -9, 507, -20013, -21386, -9266, 3204, 4829, -21051, -8839, -1044, 2041, 8125, 25627, 26521, 6743, -476, -14012, -28937, -12377, -5768, -5593, -6070, 10920, -4449, -24849]
14817b4849l013M136p146M128N457r50j1738n955J1691N783j5242Q943k132O971
14803b3916Q647q791J6232q836k5790m84M535l066J640K1083R678j5223m795K7493
14789a593J9177J1796k5774k3952n741P605J5817K4494J6005n449k1138p802k5612
14776b2167j0064K3031j1036j787J9400j012n239M490J2404j1180q923r212o56
14763b1951J8827J6620K1565J1008j3448j2482P698M182j7766j1124K214R204
14751A4547o529o210O94n661J281K74n563J7502J013r009j9874k1578L0P470J0897
14736b0716M395j2638L979Q199L986R888M574K895J0227J7916p90n977m022j7833
14722D083l254p448J7860J3533j6239n408K9266j952j8203k0431K111P570J6306
$$ y = [-24849, -27862, -23726, -30872, -26744, -21287, -22237, -33975, -39930, -28239, -22456, -37698, -28755, -30887, -23916, -15269, -24060, -7828, -16664, -42454, -42938, -38403, -41469, -39829, -18746, -9068, -24291, -29086, -1593, 17584, 29380, 3606, -20346, -26087, -18482, -2665, 21829, 37834, 32385, 11247, 3445, -22167, -32231, -9200, -20236, -22023, -2623, -3635, -8874, -4384, 8020, -3160, -12083, -21295, -21951, -3124, 13496, 35061, 46069, 32621, 20139, 27837, 32019, 14253, 3129, 5343, 14547, 8018, 1808, 2502, -3159, -1878, -1604, -7167, 10335, 11348, 2339, -17535, -39113, -39083, -31613, -20716, -16321, -28959, -24980, -16781, -12795, -2907, 1667, 4562, 14789, 32705, 31915, 25938, 21916, 4083, 829, -6619, 11241, 24774, 8535, 3127, 32393, 30441, 12238, -8193, -6082, 1488, 17794]
14709A7794m817r594r07k617M479J0460k0367n067m279N160Q662j4957M545o166
14695a7671j2647q412K2939K5098q015j803j176J3380o74o173J1486j4581k0033
14682a8282l388K8594N104k5783P019L3137K0170m30k7223k4008J5475J3254J917
14669B5556o464j2798L385K5207M016q539j1279l257J3930P337j2606m331K3916
14656D4073k1942k5657j4811k075J530j261j299J5864Q069j4306j2027J1424J1277
14643a141J6782K7154j7972j6634J021J0637j7049k5751P690J279r152J9129J3302
14630I295M888j3782J4035k086j2477P069K680m519J4908J6117Q979q998k240
14617C3869j013o355j242j4717p810j1694R09R197M473K0357L542j5877j5858
$$ y = [17794, 12977, 3383, 2476, -141, 4338, 14798, -5569, -10636, -14915, -9755, -1093, -16050, -11505, -17671, -30318, -38730, -15791, 9307, 1292, -511, -1687, 11693, 11019, 4846, 16332, 1751, -18282, -21670, 6924, 12028, -13755, -6736, 26401, 46571, 46141, 18918, -5090, 10385, 23639, 25556, 19092, 6294, 9679, 34886, 38902, 30363, 19084, 15827, 29757, 37094, 24488, 20157, 44073, 22131, -3526, -18337, -20412, -18882, -20143, -21442, -5578, 2491, -11815, -23842, -12418, -1141, 15641, 42795, 24823, 8189, 9210, 19847, 2798, -22953, -15263, -13984, -23136, -4007, 9295, 14183, 401, 14436, 12350, -127, 6942, 9622, 5103, 20011, 36128, 45107, 36109, 33869, 32856, 26501, 25259, 10542, 2732, -8962, -8053, 1144, 5617, 25974, 29516, 13639, -2219]
14604b219n017r863Q575K1565P528j3745J62j9133j3738j0775O811J4750j5908
14591c1007O414K3484J6618m487o124j1098N339p073J780J5554L905m470k0452
14578a1617J5126L385k1945k7956L405J4740n851J9029J4358N934j037R874Q079
14565B5524J49J878j2288k2743P958j362j4802j3141K021J7071l333K4975L1317
14552D3224Q165m459j3480l5366j9299J965M133q111P521Q413J3565Q202J2140
14539B6613J0008j2350j5786Q284N744r293M936j0288j2038K5277O639m92j6053
14526A1201m752L2094j4703k8767j396J7057j6424J8039K3592o775j5927r043
14514D196J858n263q537j3017j0263J639J8221J7326P077n92p35O413j2591j4321
$$ y = [-2219, -7236, -17099, -8524, 13041, 20569, 6824, 6986, -12147, -25885, -36660, -29849, -15099, -31007, -24593, -1109, 15509, 11022, 4898, -6200, -861, -7934, -6154, 9400, 13305, 8835, -11617, 3509, 6894, -15051, -43007, -39602, -24862, -30713, -11684, 2674, 8608, 7571, 17445, 25524, 25673, 27551, 15263, -7480, 478, -884, -15686, -28827, -26806, -9735, -13068, 11907, 43224, 51389, 46930, 33450, -1916, -21215, -19250, -15117, -23228, -15707, -7294, 6271, 14473, 26613, 36621, 24271, 8485, 16769, 22513, 13220, 18156, 7868, -4170, 21107, 27746, 27254, 11201, 6449, 38543, 23840, -4927, -6323, 10734, -5690, 12349, 35941, 29166, 13239, 4196, 6054, 791, -7746, -20763, -31026, -29387, -11166, 6160, 13237, 12645, 11910, 18323, 5732, -8589]
14500h589Q414L3934K2657q704k8247k5443j54L181m062K655L967k883J6870j0455
14486C141j7159J2854Q5l061P763m222K262m230p90J2218j0061n949n532q72j1108
14471b4661o13J5125J4593O768M1063j393k1281j6397O741J3275Q658J6103n071
14458E2910k7105k8965j6602k4942j562k5749L1566L5808o662q628J9602p356
14446g685J8189J0944j2672N331N459J8117m860k3281j4909j545J3524j0425j0883
14433a4696n896M641j9090m00L2726L0344j2071k109O639j4722j2068L0252J985
14420B5535j2042j6642L74J1617k769R83o027K133J7676J979p023j5256n028L853
14406f37J78j86l53K0693J8382l928j2737j7414J4234r91r349R428J8200j1035
$$ y = [-8589, -175, 33759, 56416, 47712, 19465, -5978, -6132, -2951, -7013, -4358, -391, -3274, 13596, 3141, -14018, -1164, -1079, -4140, 3623, -599, 1663, -2567, -3357, 8861, -1200, -7149, -12681, -13553, -24661, -25274, -10149, 4444, 11212, 52275, 50882, 29601, 13204, 19945, 33220, 41878, 57981, 52910, 25805, -3160, -19762, -44704, -46266, -72015, -40449, -4641, -11303, -19931, -329, -7685, 10504, 21448, 8776, 14107, 19566, 37683, 32823, 9542, -5367, -6912, 6612, -3813, -14696, -20592, -15951, -35041, -35441, -2715, 27629, 15558, 13449, 20088, 5366, -6702, 23550, 25535, 13493, -3149, -2775, 8842, 6073, 7056, 1029, 3162, 20838, 22817, 15794, 538, -4490, -637, -459, -645, -998, 19695, 38077, 34149, 21412, 3998, 18232, 17241, 7892, 17320, 35520, 24485]
14392B4485k1878p270j877J7494k3051r973q400L248l228O10J5946j0026j756
14379b5676M340j955J8258j413R007K9225J675n10j3620j2110R908J3955o959
14366B4125r870J6831o20j870R287n931j4473k4315j2142j1467j211K1188K0718
14353A0250J0494k9889j0485J1284l407K25J2686O230K368j6734q950P088N96
14340h244j482J1926j4701j306Q956L644j3405R358M048J6425p399l0871o436
14327b9487K6836Q300k4611m182j1482m329Q896K368L505q219J7842n861M10l946
14313b3960M951M059n369J5335j148J263m008N598O234n188q563K1238j3380j1713
14299a4651o415j615K23L582o615L251r17O32R569J2809J0770j2193k2479J8260
$$ y = [24485, 2607, -4663, -6540, 10954, -12097, -22070, -30470, -27222, -30450, -29840, -13894, -23920, -25676, -21336, -23291, -5033, -6446, 2561, 31786, 33461, 32951, 19331, 7221, 17129, 31084, 24125, 14255, 31086, 30466, 28596, 37883, 31952, 17479, -6836, -18978, -30445, -31656, -10468, 10250, 20744, -9145, -19630, -8346, -11753, -11528, 1158, 7388, 9756, -6978, -15928, -8840, -8244, -9726, 2200, -12501, -13807, -4851, -1207, -14612, -5254, -1206, 15219, 7820, -23051, -29487, -2651, 5649, -18962, -23144, -34626, -38955, -30059, -27691, -24186, -32405, -14563, -20424, -20014, -23960, -19009, -14950, -20319, -4984, -6132, -4869, -8877, -3279, 2955, -2233, -10796, 10442, -2938, -14651, -21066, -22681, -22458, -18876, -25491, -22240, -23157, -22525, -12956, -147, 10623, -1570, -24049, -5789]
14285e789K6068o536j6963L67m852J0137J2553R759j120P43j1267L757J2405k007
14271B7255j8962j496r842j0719K323j2705j3671J0822J0944J1407J3242K3115
14259C1713J4117J2711q443k6373l6547j6460n463J1159J9972r161j7872R728
14247b0919q69J6073J2480r036q390M157R860O625j0101j5260Q114k42j814m061
14233a3383q611p411L813m794O979K6828K1686q790q378K287J4028j1728j6003
14220c477j0273Q575Q843q620M376J7769J631j6652O932L0965n425k1371k6428
14207a3155j3600J0297J1034q749J1263Q962J546k583Q596J6271J927j2782j7314
14194A713L264J13M674J2373n996J384J2476k5356n629L785k4074R872J112J3234
$$ y = [-5789, 20279, 13743, -3220, -2853, -7705, 2432, 14985, 24744, 23624, 24367, 13100, 16857, 29262, 27255, 8293, 6797, -3045, -13764, -11441, -24146, -37817, -26995, -16051, -4644, 8598, 31713, 45830, 58541, 50098, 23725, -12822, -29282, -34745, -23586, -3614, -12775, -30647, -20919, -21788, -5715, 6765, -2271, -10661, -6504, 3356, 9981, -120, -15380, -7266, -7508, -9322, -13383, -21994, -29405, -25592, -30386, -23407, 3421, 25107, 16317, 7939, 10226, 24254, 12526, -3477, -13750, -5175, 3668, -4952, -576, 17193, 18824, 2172, 9104, 40069, 34644, 13273, -13155, -26755, -16458, -5424, -14173, -2910, 6052, 7598, 5015, 13611, 29882, 31809, 19027, 1713, 4977, 5090, 9764, 22137, 16141, 17525, 30001, 4645, -984, 2801, -21273, -11401, -10289, 2945]
14180B945J2840K771k4630p013L229j1649k6397P972J4791J4950J5688j763n636
14167a902n028n571q199L988K081J6700M56J2265J221J193k6285k2045j2005J1566
14153c1565J6090l992P638q548L976k57j2705K189K1480K3840p150j5210p842
14140a2056J154j0722Q975P139O360j4257J3449J2081k0857l339K878j6416r583
14127c5194N182j635p899j2153J4935J397J3141K13J0415K4469J4000P805l4577
14114I9k0355J4948M627r247j4349j4005J6637p218n214L6431N516o242j6584
14101a4956k5155o783N641J6501R686k286P351l685j4137N605l325J1028K1410
14088F895j0422N665J7621o513j3679j4413p62J2880J801j3210j7510J8376J7996
$$ y = [2945, 15785, 18556, -6074, -13087, -9858, -21507, -47904, -39932, -25141, -10191, 5497, 3734, -1902, -6930, -12501, -20700, -16712, -14631, 2069, 2525, 14790, 16011, 17204, -9081, -31126, -43131, -31565, -15475, -19467, -11829, -20377, -16401, -16658, -29363, -27174, -5694, 18146, 10996, -4214, -12056, -10902, -21624, -12649, -5510, 850, -13407, 42, 12123, -8734, -12073, -9195, -25611, -35194, -30012, -31647, -39546, -51699, -36764, -35367, -22226, -22013, -11598, 12871, 26871, 34676, 99, -20256, -5308, -681, -9928, -24277, -38282, -21645, -28863, -34077, 2354, 7870, 1628, -14956, -40111, -46894, -41253, -24752, -15066, -17352, -10001, -13686, -27823, -22218, -25543, -14515, 6895, -3527, 2138, 19759, 13246, -433, -14846, -15608, -2728, -927, -14137, -31647, -13271, 4725]
14075D725j0200M760J0620J3147j1260j3025N659J2365K933j0166j0036q513j1491
14062b0482P907J0272N740n935M61K954p902j3835J0595l688J8667M7412r235
14049D2931k5447k5667N663K4417q461j3706L293r847J276j069R184K1143M659
14036B8369o775j8967j4404r116J9535J2882j9817r546L580K7940K6303K0311
14024F0295J0839k5434k4901J4198K0286r760j5991j6200k0358K841k616M898
14012a903J5830p825j2833K532K3439n799l375P276p566J88j6597q976J0032Q590
13998C013j9050J654K5660J0755j6348O747J5282K941R026k1075k2436j2274M042
13985a2063N028j1028K9429J6921R96j3317r580j0352k6172J7167K4882J4440
$$ y = [4725, -5475, -715, 9905, 23052, 11792, -1233, 4426, 16791, 19724, 9558, -478, -8991, -20482, -12575, -2303, 3437, -2498, -2037, 917, -6985, -20820, -10225, -13913, 4754, 52166, 42931, 17484, -8183, -2520, 21897, 13436, -270, 3023, -6824, -5548, -6617, 2567, 23710, 28369, 21594, 2627, -11777, -20893, -1358, 11524, -8293, -17839, -14259, 13681, 39984, 60295, 71134, 45700, 20799, 34997, 55283, 45523, 29532, 13332, -7026, -4185, -6801, -1903, 13927, 6102, -6731, -4199, 19240, 13441, 10066, 17342, 9776, 9964, -6633, -15609, -5577, 3013, -16037, -14383, 11277, 22032, 5684, 12431, 27713, 30654, 39680, 18605, -3831, -16105, -12063, -7035, -18063, 11366, 28287, 29283, 15966, 6386, -3966, -30138, -12971, 11911, 26351]
13973B6351l877k7834p115j3674R9J758P873K3498L046k445j0984j755L316P043
13959E300l874R855L2930J1549k5600l7116k8507J5403K4837p199K271j448j6775
13946a8374m472l814R030K739L531l265k6260Q922K587r887J3807K7230p119k3067
13932b8412r084K854Q917L9186j484k2452Q413K1084m505q407R780Q646k637k6096
13918d197k4055n664J1218P925N354j841j972r307p234K5379l749p090K4281M905
13904A3953j3505j4731l268K3900m961j3527m913J3858R388k0525r682q522N634
13891b6901M978J696k107J0178J2731L0768j2036k7468J0054K5078M042r632k0867
13878E14o272J9380j774j8887Q899n39L463J2095n02O049J231k4027k5681j5857
$$ y = [26351, 22474, -5360, -12475, -26149, -26050, -24292, -16419, 7079, 10125, 7680, -3304, -5059, -1743, 5300, 1426, 11281, 44211, 55760, 30160, -6956, -35463, -20060, 4777, -2422, -151, -1599, -18374, -22846, -26660, -17630, -14891, -11360, -14625, -40885, -31963, -29376, -39263, -25456, 1774, -5345, -28412, -37496, -34642, -25725, 13461, 11977, -10475, -2062, 19022, 14517, 6110, 15890, 24536, 21899, -4197, -28252, -33916, -22698, -14773, -9419, -11260, -13232, -22539, -29773, -4394, -8143, -15233, 9048, 13953, 448, -14283, -17551, 6349, 1388, -12139, -17052, -3194, 6194, -14331, -24013, -32535, -26901, -21923, -20227, -22334, -12156, 575, 31343, 19307, -8161, 1893, 26971, 31013, 21381, 514, -5758, 13622, 11848, -7039, 1860, 1321, 4784, 16879, 16377, 22426, 23657, -370, -26051, -41908]
13864d1908J2226J1388J7801p790k6730j639K425J8654P323J0462j0086L388J7397
13851A2911J2702j1612j0408K219J3996Q040j3992j3587L679K3441n699j7032
13839D658n877R523m58k9530o020J7171o371j465K6858J3888j5365o043K2352
13826B3321j914Q550r8j9068k9312J4313N217o702J2182J3334O148r55r834j4656
13812E26o347N449L281m378k759l707j7774J8379j4436j350J2289R757J0876r295
13798E11j4632j3824n601J7275p828j0114J2349J6993J2235j9529K1211J3491
13786B2537J119k986j0848j0435N120m730L831k4223r828Q818K9850J1929J223
13773B1377j0638r55J876n133k12Q233N821N815m359j9202m857P243K6316K8740
$$ y = [-41908, -29682, -18294, -493, -8283, -35013, -36652, -34227, -15573, -8250, 2212, -7874, -4486, 12911, 25613, 14001, 3593, 5812, 19808, 27848, 13856, 269, 3948, 27389, 21690, 4658, -1219, 8304, 7846, -21684, -27704, -10533, -16904, -18369, 8489, 22377, 7012, 969, 23321, 21407, 29957, 29859, 10791, -18521, -4208, 1009, -5693, 6489, 19823, 25971, 25016, 15182, 526, -5821, -372, 2909, -1469, -4228, -7935, -25709, -7330, -21766, -23116, -10827, -1070, 9806, 511, -14121, -27945, -33546, -16271, -24099, -34213, -21864, -4871, 7364, -12165, 9046, 22537, 23656, 20670, 9822, -613, 4507, -223, 3608, -20615, -30443, -21625, 8225, 20154, 21377, 10739, 9784, 11660, 6527, 6315, 14548, 20369, 26184, 21825, 2623, -2234, 5009, 31325, 60065]
13759F0065j1534L396m612j9997j3785j4517j5013j3999O808K0402J1399Q387
13747A7000J7432K1490l3109m3086N736J1024m75Q67R329n173j3312j2833L296
13734b1814J8658P799p437l4046J5395L0853j3213p212j4225j13O522J1393J01
13721g339k980k3651j986J3791o118j1184J2022m814J4957K449j6159o781O441
13708c1352K0081n522j1655m400P407J964J0065n493L321j5132j0688K5021K5748
13695I365J8802o589j427R968j5851J024J0621J4197j141k5098j1770K67M12Q203
13681A0983P138j4387Q160J1127J66j3964j3698q859p795L65K7117J9321j2113
13668A3561k0159L99J4528J9926J936j6706j6789q608n527J8138M124q029n102
$$ y = [60065, 48531, 51927, 47315, 27318, 13533, -984, -15997, -29996, -23188, -2786, 8613, 17000, 34432, 55922, 22813, -20273, -14537, -3513, -3988, -3121, 6208, 1035, -12277, -25110, -21814, -3156, 4643, -2794, -36840, -21445, 9408, -3805, -11017, -25242, -25355, -18833, -7440, -7339, -10319, -33970, -35956, -22165, -28283, -39467, -27445, -32259, -17302, -14853, -31012, -37793, -31352, -11271, -16793, -28448, -32848, -25441, -23477, -13412, -18905, -15584, -30716, -41404, -16383, 9365, 28167, 21578, 20151, 30119, 14268, 15292, 25913, 40110, 38969, 13871, 2101, 2368, 2780, 10983, 18121, 3734, 11894, 23021, 23187, 9223, -4475, -13334, -21129, -20764, 6353, 25674, 13561, -6598, -6199, 8329, 28255, 30191, 13485, -3304, -11912, -17439, 699, 4823, -3206, -8308]
13655h308J3814m386J8200O404p761J2134J6480j6409j2802K860J1798k2435n05
13642I084L231l875j7935p576J8523n433P869J5023o104m653N490j4164k3497
13629b4017m787J4042K5126p387n937J4758k157l590M24k1325j5933K1148K8481
13616A8846k366j3526k888l711Q156Q870k1340r079K2380P262n269j7992Q048
13603b609m285n104M530Q262n085M179k452n846m322j8095j4361K2344J9939N707
13589B802K5803R479n097p641J2814L626k986j3774q754o926j1101k0142q903
13576c0800K7Q173J8013P205j7852j1218R790L0806J3594q498Q381q332J681k7785
13562f815l6605r325J3138K8066J6532p290k1829K0953n571j5330j2430J1922
$$ y = [-8308, 5506, 1120, 19320, 25724, 17963, 30097, 46577, 30168, 17366, 20226, 32024, 9589, 9084, 12315, 8440, -9495, -17071, 1452, -3981, 3888, 18911, 12807, 8154, 13644, -520, -24017, -28804, -14762, 10364, 2977, -2960, 11798, 9641, 6051, 6475, -14850, -30783, -9635, 18846, 16480, 2954, 66, -3645, 4511, 13381, -7959, -17038, 5342, 12604, 7335, -10657, -2609, -6894, -11998, -7468, 794, -4291, -112, -2564, -8410, -12732, -30827, -45188, -22844, -2905, 2802, 28605, 38084, 32987, 25346, 38160, 41786, 38800, 25026, 16272, 9346, -1755, -21897, -30800, -30773, -22600, -4587, 2618, -15234, -26452, -16662, 14144, 27738, 19240, 27621, 19289, 20970, -6815, -43420, -52745, -39607, -11541, 4991, -2299, -24128, -3175, -8746, -24076, -36506, -24584]
13550b4584M594J5206J4338p572j0035k1781p326J3788J6349J0733R652R133k0288
13537B207P137N759j0516l071J2226q391o876r172J1904J2502n801p249L0M237
13523D926l837j5136r102O669N537M600K3057o043r805j4595K014O713J3170J9766
13509B7934J4146p905k4056l758M162j2124p266r179o783K160O593J6790K139
13496B853J549j050O759L4955k1173q765J4614J1390n759P169K03j1246j1094
13483B0405l517J7916j7699j9735Q402J3352k2028N719l2J1141j796m3764l795
13470c5431J9812O39K5173m535j798L3469l427m552j1010l657J121k7024l452
13457a4672P666J1792J09k56J5246J7771l290k5513k5036r254J0786J978q87L242
$$ y = [-24584, -19990, -4784, 9554, 1982, -8053, -29834, -37160, -23372, -7023, 3710, 13362, 22495, 2207, 9344, 15103, 4587, 1516, 13742, 5351, -1525, -10697, 1207, 13709, 7908, 659, 689, 4926, 1089, -14047, -23149, -16480, -10943, -6343, 16714, 10671, 866, -13729, -11715, -5002, 8168, 27934, 42080, 34175, 10119, 6361, 10523, -1601, -8867, -18046, -24829, -22669, -16076, 714, 2853, 4402, 3352, 10111, 45066, 23893, 15128, 29742, 41132, 35373, 42542, 42745, 31499, 20405, 16888, 34804, 17105, -2630, 5772, 19124, -2904, 2815, 2783, 13924, 12128, -31636, -35431, -15619, -14980, 10193, 5658, 3860, 37329, 33902, 29350, 18340, 14683, 15804, -11220, -14672, -7006, 4786, 4895, 4639, 19885, 37656, 34366, 8853, -16183, -25437, -14651, -12673, -13560, -10318]
13443a0318j06j0398K1958K989K040k403l1080L764J2943K581J389R21N172j1510
13429a2058l4004k619L9272K7708O54L073n605j3749K515o975P301J5698J3885
13416C5096j0609q798n395j786J8160N170k4152r250J2233K0360j7902j7590j8399
13403b2862K8483J9564n486n085k1005n312j1996k195j920J9085K6438j4340n417
13390b048L194k133L57P798K1151K492M412J0198p364k1918j2975L021O711K882
13376A5778p113J241r035o034q352J4104n507k7406l090k068J6202K797m479K2111
13362h51K117j8308j9304K5696J3460P3K766j0550j7318P493P205k1483Q354J2508
13348h142P065m66J9087n500j8758q047L626J6148l994n370O022K888j7355R965
$$ y = [-10318, -10424, -20822, 1136, 4125, 6165, 3762, -27318, -23554, -10611, -8030, -6641, -5720, -548, -12058, -46062, -48681, -9409, 18299, 18953, 22026, 16421, 2672, 5187, -1788, 5513, 21211, 35096, 24487, 15689, 10294, 8508, 26668, 31838, 7686, -1564, 10669, 31029, 13127, -4463, -22862, 5621, 25185, 19699, 14614, -6391, -11703, -23699, -25894, -27814, -8729, 17709, 3369, -2048, 1146, -987, -630, 7168, 28319, 30811, 35223, 45421, 38057, 16139, 3164, 6185, 12896, 15778, 8665, 9906, 871, -5163, -13515, 589, -4918, -32324, -35414, -37482, -21280, -18483, -22962, -851, 1266, -17042, -36346, -10650, 2810, 2883, 5649, -4901, -22219, -14726, -7521, -29004, -20650, -8142, -1077, -1543, 17544, 12044, -6714, -14761, -11135, 5013, 1019, -4351, 1671, 4559, -12796, -2831]
13334b831Q856q701n694p639O224J2194L757K4990J1550j2046m063k8241o753
13321h397o127j622J4020N473J8683K4503j6647k2182k2057p704P106J9296J2332
13308A6677J6283l066j6876J0801j1265k2123M103J7734K1731n047j50L059j1264
13295B0597P649J6225n726k8623k2001m329j356O700K2188J8415k5070j2189R771
13282B251R903J405K077K05Q062J501k951J8228J356k5821j1138j1187k428m17
13268h954N58k515P716k1880J406J308n465O734J2710J1093J2303L906k1195k8554
13254c0829r616J311J9476K7827j2187j9905m940O654K251l081K774J2275J8081
13241A0091j3525J2720j1151j6405K761K303N614K469O518k3918J3655l700N396
$$ y = [-2831, 6025, -2676, -8370, -16009, -9785, 2409, 6166, 31156, 42706, 30660, 26597, -1644, -8397, -14524, -16146, -2126, 3347, 22030, 46533, 29886, 7704, -14353, -22057, -14951, 4345, 16677, 32960, 29894, 13018, 23819, 12554, -9569, -5466, 12268, 33999, 28952, 28802, 31861, 20597, 28246, 44471, 38745, 10122, -11879, -16208, -17564, -10864, 11324, 29739, 4669, -7520, 2251, 12154, 13559, 15636, 15841, 23903, 25404, 22453, 40681, 42037, 16216, 5078, -6109, -8537, -8954, -8396, -10911, -3195, -25075, -23669, -22361, -27826, -21092, -8382, 2711, 15014, 18920, -2275, -30829, -40445, -39134, -19658, 8169, -4018, -23923, -28863, -22209, -19958, -23039, -20265, -7990, 10091, -3434, 9286, -1865, -18270, -15509, -13206, -7592, -5123, 1395, -22523, -8868, -12568, -7172]
13228g172R058J286j0503j2529r33K2018j8758k682J7849J371Q711K391j5353
13215e246J70k35M432J3915J8123k180q686m539k4125P308J5410p554k2751P24
13201a5234J9073J3262n125J7136J4330r946k9327o114O885J5023j2915j8773
13189a1725J961J3500j586r860j5408l042Q145J3368J3296L04n497q052m052o297
13175a4945Q553J9685k2369q563P566p639R159K0199O730n607l905J2884j4280
13162G468k2864R960j309L983J625J0923k1062j3859P572P669k3136k3301J3164
13149d3167J7086q75Q076k0661n596K0522J6916p593P349l105L041j0393O836
13136a1564m355m834m220J5833J4941j848k5467K447J0989J9428J0398n161j6190
$$ y = [-7172, 1886, 3172, -7331, -19860, -20793, 1225, -17533, -20215, -2366, -995, 7716, 10107, -5246, -5076, -5311, -879, 13036, 31159, 28979, 20293, 15754, -8371, -1063, 14347, 6793, -15958, -15234, 3839, 17101, 11976, 29112, 43442, 33496, 4169, -1945, 4940, 19963, 7048, -11725, -9764, 3736, 2150, -7710, -23118, -26160, -18015, -4647, 8649, 8953, 3456, -4596, -8648, -14945, -6392, 13293, -9076, -17639, -10073, -17712, -8553, 11646, 18376, 12769, 8864, 21748, 7468, -15396, -5436, -6745, -2762, -1137, 9786, -11276, -25135, -17563, -9894, -33030, -56331, -43167, -26081, -26956, -18880, -39541, -45137, -24615, -7699, -15292, -7943, -11048, -8007, -18400, -11564, -15919, -20753, -24973, -9140, 5801, 3953, -21514, -19067, -8078, 11350, 21748, 16587, 397]
13123C97j917Q307J0877j8225r693J6116J5383J1288R933k4396k1083j7516O319
13110a4210J9814J5335L744p788l364r87J0529j9990k0773P343R447O705K746
13097H551q696K2787l18j5139k7677n658P036K2232P118j6549j3892j642L1316
13084I469J4120j6392p325Q32n0K2049j2328j6829r650J228m126J6204J2468j6896
13070g226O508J6429J2585k2436j69P961n110j5032l660J5821R174j7174j6465
13057a8794K584j5285j4584O619R366J827R165R844M316j0160j1169l889L093
13044b7067J9051L87o024r099K0486j0729J5519K4316m657o259N303M08p01r551
13030A1383o632P966n808K580j5531j0550q389J0826O961j5113k168J1031J7280
$$ y = [397, -1520, 6787, 17664, -561, -10254, 5862, 21245, 32533, 42466, 18070, -3013, -20529, -14210, 5604, 20939, 24683, 16895, 13531, 12544, 23073, 3083, -17690, -10347, -900, 5805, 8551, -145, 22642, 22324, 7185, -20492, -26150, -19114, 3118, 10236, -6313, -20205, -21847, 9469, 23589, 7197, -128, 704, 654, 22703, 10375, -6454, -16104, -14876, -19002, -2798, 9670, -7226, -718, 15711, 28296, 5860, 5691, 13652, 8542, -6490, -10150, 5671, 14845, -2329, -18794, -16210, -31495, -46079, -39460, -30094, -28267, -19102, -9258, -4942, -15102, -26271, -30160, -27067, -8016, -7629, -13653, -22752, -2266, -12995, 2524, 26840, 22183, 15924, 21227, 21635, 20934, 11383, 4751, 12717, 6909, 9489, -6042, -16592, -24981, -14155, -7194, -22307, -24475, -13444, 3836]
13017C836J1664j4105k651R434k503l863J1263k514j3652p542K694k5397K335
13004c1001J3256m097R688K1886j6832Q768K07j5620r295Q665P57j9658J0902
12991b2374R539j7492J893k639k282K6580J8436J068j5151l105K849J0409m683
12978C048m313l648k257r024j1391J8571n587J3472k105q376J6283j33L520N419
12964A3479q78r928P446l802J619M079j74M165L097j068l302j0340j5998k3963
12950c5568P649J2335J8089L486o598n680j5267K081j020K060P516Q231N860J7145
12936B0319J6462j2890p226p279j2899R436k2942J9843P322m611O895k8280r428
12923b5278K896J400O959K246o075M188K9170K6398j7015k0537J4284J9160j0276
$$ y = [3836, 15500, 1395, -1256, 8178, 5675, 1812, 13075, 10561, -3091, -10633, -7939, -33336, -31001, -17745, -21842, -12154, 9732, -7100, 1668, 1875, -13745, -23040, -14375, -13618, -33276, -22374, -12835, -30327, -28434, -31073, -33355, -6775, 11661, 12729, -2422, -5527, -2678, 7731, 3048, -1265, -4913, -7170, -16194, -27585, -9014, -14601, -1129, -3234, -11610, 4673, 4540, 8060, 13479, 12601, 2673, 10119, 6317, 7936, 12015, 11841, 16006, 19103, 18035, 14733, 4393, -11605, -35568, -27919, -15584, 2505, 5991, -607, -6287, -21554, -19473, -20493, -18433, -10917, -2686, 3174, 20319, 36781, 23891, 16665, 9386, -3513, 5923, -17019, 2824, 10146, 5535, 12430, -15850, -25278, -22382, -20982, -14023, -11777, -17852, -13664, 15506, 41904, 24889, 4352, 18636, 37796, 27520]
12910B7520j0603j4799P301Q445l556p416p92o116j3364j0261p290l995J5665
12897a9261J9997R423J5132J4966j8320k9107r551j0022m415J3142o819M064p975
12884b8746k696N537j721J795J3068K858J5730J517n408R594j572l208L505q619
12870A634j7419j1741j1814K741p903J0211K9374J769J0423J2458l1817j2713
12858b4797J3952J8294j0388q093M062p533J0819J5506L246N517M687j445K427
12845B6254r411j7624L79j1727J9935K0709L855N549j7098l3695N631j417r145
12832a7805K215O158O361O497K76j5477J151J2458M85O435N014j4657j9349j7506
12818c7744Q598L5424K2417n522j7895n952l189q747j8063R581m361O582J8235
$$ y = [27520, 16917, 2118, 9419, 17864, 14308, 6892, 6100, -16, -13380, -23641, -30931, -34926, -19261, 736, 10159, 25291, 40257, 21937, -7170, -16721, -26743, -31158, -18016, -24835, -20771, -28746, -31442, -25905, -27626, -25831, -12763, -9905, 5825, 7342, 1934, 11528, 9956, 6748, 10253, 1634, -15785, -27526, -39340, -36599, -44502, -34291, -4917, -3148, 7275, 19733, -12084, -24797, -10845, 7449, -2939, -11032, -6970, -14503, -3684, 11822, 15068, 20585, 25272, 23827, 26254, 16843, -781, -402, -12129, 7806, 28515, 32370, 37919, 20821, -12874, -7243, -8660, -17805, -15590, -9432, -3071, 3426, 3702, -11775, -10624, 1834, 2319, 8754, 13768, -889, -20238, -37744, -29146, 6278, 28695, 23173, 5278, -674, -3863, -12610, -30673, -21092, -25453, -18871, -636]
12805f36L123l71k7462P161O864O385J5525J7612Q86J605O94j6969o997k0320
12791a2900J1966K878j2303R28Q597K077j5420j8593k951R259J4098J0923J3805
12778A2364J4896k2117j4464j5028K170K5897l61J2201J44J3197M904r398j7386
12765G019K714J2879P596J2923p188j5727m319l715L604N498j0302q255m002l425
12751d700j13M128K236p527l648n48K4118J969j733K158K72o497j6645j7411M425
12736a9516m760R686m413O667j707K959J0376l39j9486J633J6459q073j124m65
12722a2103J7627J2498j2788J3325J6559k6879j8410M762J2790P93j9237k215
12710a3278J2355j1504j636j0652K2282J7978j2466k1421R261K8165L0686Q077
$$ y = [-636, 2487, 2116, -25346, -18185, -11321, -4936, 10589, 28201, 29087, 30692, 31386, 14417, 7420, -12900, -934, 1944, -10359, -9431, -834, 1243, -14177, -32770, -35721, -26462, -12364, -1441, 12364, 27260, 5143, -9321, -24349, -22179, 3718, 3357, 15558, 15702, 28899, 33803, 24405, 7019, 9733, 22612, 30208, 43131, 35943, 20216, 15897, 12182, 15786, 21284, 10982, 2727, -1275, -4700, -4813, -685, 1551, -5976, -9624, -10172, 13946, 15915, 14182, 16340, 16612, 10115, -6530, -23941, -19516, -24276, -14590, -19003, -12336, -14043, -11084, -708, -1047, -20533, -18900, -2441, -10514, -11638, -12103, 5524, 18022, 5234, 18559, 35118, 8239, -10171, -5409, 7381, 8174, -11063, -13278, -923, -12427, -14063, -24715, -2433, 15545, 3079, -18342, -9081, 19084, 49770, 57847]
12698E7847l2645j3094j0608N12J3029j1133j6107m95K6062J4347Q350N323j0630
12685C0758j2067n673O187j0372l142J1055l796p83K197k737j7299k90J2538l035
12671C541m56K79J3867j6273j7290J486J6181J1667o524K522o101r922n030r354
12657b1407p006p235p489j4597J3794J6389P523k066r159J9134k769k7412Q012
12644c4288J3596K0219O903r124n794q604P539K9724j0311R607l752k7697j0530
12631b2512J0992j610l394L4126J7748L074j2252J259j1041j4689K138P127J9775
12618C0741j1353r251k2068L260k859r091Q508J189j6219j0088J0300k561L815
12605b5677J9318K4605L91j0599N250J4255Q601K382j2678k5786j0369J600J5241
$$ y = [57847, 25202, 12108, 1500, 2012, 15041, 3908, -12199, -12694, 13368, 27715, 36065, 41388, 30758, 18691, 13018, 19205, 8833, 5691, 16746, 12950, 12167, 14364, 11627, -5672, -5962, 6576, 3541, 3085, 3364, 17231, 958, -16332, -14846, 1335, 13002, 6478, 9000, 2899, -7023, -12053, -21407, -28413, -35648, -43137, -57734, -43940, -27551, -20028, -22094, -31253, -12119, -14888, -42300, -34288, -20692, -473, 6430, -2694, -8488, -17092, -9553, 20171, 9860, 19467, 15715, -11982, -22512, -11520, -13130, -16524, 17602, 35350, 38424, 26172, 27431, 16390, 1701, 3839, 10966, 30741, 19388, 10137, -11931, -8671, -11530, -20621, -12113, -10924, -27143, -37231, -26931, -29492, -25677, -6359, 18246, 18637, 8038, 13288, 27543, 36144, 38526, 25848, 62, -10307, -8707, 6534]
12592F534O60j984N499j1030K930n741k1653K0755J7933j2690q193j0393j4039
12579c1412j657J8070k059j4820Q578R550M827J7181j0979j4824p321P372m300
12566b1794J3432N197J2831M767j008j4084l117L769j1826R24k103L728K2040
12553A2756L635R24j1824o576M166l527k4116J647L2369L773P191j708o897J3485
12539B5298j6397O606j1172k5319J0826J1491P145J9895M072j5302K695K166j5591
12526F413j0294J6470j192L504o566J015J0360K648k7998r839K1130j2933L677
12513c605J7479M934O232L551Q701j6309j4737r580q367P628K0174j4452P765
12500I414L2933k1023l2664o81J4952n20l975J0983K41j6627j1051k424M125L870
$$ y = [6534, 7194, 5210, 10709, -321, 2609, -3132, -24785, -4030, 13903, 1213, -6980, -17373, -31412, -33069, -14999, -17058, -31878, -23300, -13750, -8923, 8258, -2721, -17545, -24866, -17494, -21794, -8362, -3165, 9666, 14433, 13425, -659, -3776, -7, -11833, -10909, -13012, -9284, 12756, 16391, 17315, 5491, -1085, 3081, -446, -24562, -22915, 9454, 13227, 20418, 18710, 11813, 25298, 8901, 15507, 4335, -20984, -10158, 1333, 8478, 28373, 32445, 17143, 19838, 22004, 6413, -3881, 12589, 11397, 14901, 8335, 9350, 19710, 22358, -5640, -15479, 5651, -7282, -3605, 13874, 18808, 25040, 28591, 37292, 20983, 6246, -3334, -11701, -4073, 16101, 1649, 9414, 42347, 21324, -11340, -12021, 2931, 2411, -1564, 9419, 9660, -6967, -18018, -20442, -16317, -12447]
12486a2447J1648Q881j148K34n644j3095K340K0328J3830k241J332j4799l109
12473F110P467j117k3998j413M581J4356m256J1014O046M19j1931j5303J9686
12460A1661J7272j9043r363o661J0273N200k4057q447R941J8698P178J2620j0006
12447A5266J452p33o579J2981J5307j7987j5985m460m132P835J8836P007p020
12434B1788J1437r903l650p171j6639J0364j4923K141P681j021K000l325K0832
12421A9611j0654K169k1972k1988O751J1773j3159j2047m620N562N48J7540L0811
12408A0325J7113m869R57k1637j4032o599l635J1221j350l949k5855j4765J0974
12395d6101K5373K9404M110L86j5301j6476k4890L557L831J1240m692J186O463
$$ y = [-12447, -799, 8082, 6934, 7168, 1524, -11571, -9231, 11097, 24927, 22686, 24018, 9219, 6110, 13577, 12460, -11538, -12951, -8370, 5986, 1730, 12744, 18790, 19209, 7278, -8025, 11661, 28933, 9890, 527, -6134, 4139, 9339, -14718, -23165, -13224, 5474, 12652, 25272, 15266, 16718, 15985, 9406, 22387, 37694, 19707, 3722, -738, -4870, 2965, 21801, 28808, 21788, 33225, 23322, 19672, 12501, -4138, 6226, -8697, -6556, 1125, 104, 2104, -1221, 19611, 8957, 11126, -10846, -32834, -26083, -14310, -27469, -39516, -44136, -38574, -38026, -20486, 10325, 27438, 22569, 23526, 1889, -12143, -18742, -22377, -11156, -12506, -16455, -42310, -57075, -46101, -20728, 8676, 12786, 13172, -2129, -18605, -43495, -39938, -36107, -24867, -29559, -28373, -21910]
12382b1910J8231j58J1703j0295o304K1536J1145o578r868R706N565j4732j4668
12369f627j4010J1456K5608l813j5580Q27K0413J2110N39m580K14j7175j3833
12356d451j334m343R729q041j7084k491J2068P790K3418K590j4953k1153N763
12343a2492J8622J8749j8608l736j0143n639n227j2769K3262J1120k250j3869
12331a2980m605j282K3047J6142l218j2761m572J6232J5408j2186k1751M966J6579
12318A9019j8296j3623P916J8012M883k602m706k2704k5514k609L1054J0491k630
12305a309q264J639K169j6163P927J1967J3318J198j1013q07m46q749j2415k443
12291b3391J6960j1076K1500K2773k383j1640J951k237k894r436R452K8616m98
$$ y = [-21910, -3679, -3837, 7866, -2429, -8733, 12803, 23948, 17370, 7502, 17208, 22773, 8041, -6627, -20637, -9181, 16427, 12614, -2966, -2139, 18274, 30384, 30923, 26343, 26557, 9382, -4451, -5785, -10128, -399, -8440, -25524, -28015, -15947, -8157, 15261, 17851, 2898, -18255, -12492, 6130, 24879, 6271, 2535, -7608, -13247, -18474, -31243, -7981, 3139, 889, -12980, -17585, -18867, 4180, 20322, 17104, 4343, -229, 16003, 31411, 19225, -2526, 2440, 19019, 723, -12900, -4984, 13028, 17911, 15309, 10603, -12101, -37615, -40224, -9170, 1321, -1309, -9573, -7934, -5765, -21928, -14001, -2034, 11284, 12482, 1469, 662, 216, -8533, -20948, -23391, -6431, -17507, 3993, 26766, 24383, 12743, 14694, 12457, 9563, 127, 9579, 38195, 37697]
12278C7697k5310p513J2781p402j2033J1769k3067j2145N293K7660Q089j091P644
12265B2372j869P082O669j9014k4907J0015R240L631K257M254j6955k977j296
12252a498N462q642m1304J760L3728M212J107K580R443o92L778J1196J3570n614
12238B9086j6140m647q590k3373j0288k0246M947L8096M7993K871K032k8906j9271
12225f436J7462P477j5816j083Q911r471q557J1984K2776J1889l4383j4510J1065
12212A308r811J3947J4034j2464J4378j1658j9331K986P138N858R072o348p472
12199A637j8580N571N241J2243M908P181K135K154J4473L047k0481k6814k4790
12186c2075j4717J6165J2435O70q1o53j615J333R266j2481q017K28M196J6722
$$ y = [37697, 12387, 4874, 17655, 10253, -1780, 9989, -13078, -25223, -19930, 7730, 15819, 14728, 22372, 20503, 27585, 34254, 15240, -9667, 348, 9588, 13219, 15476, 19730, 2775, -202, -1498, 3964, -4678, -45982, -44222, -10494, -6282, -5175, -2595, 6848, 6156, 9934, 21130, 34700, 29086, 12946, 8299, -291, -23664, -33952, -54198, -49251, -11155, 36838, 39709, 41741, 12835, -6436, 11026, 18503, 2687, 1604, 10515, 1044, -7513, 4471, 27247, 39136, 4753, -9757, 1308, -8503, 5444, 19478, 7014, 21392, 9734, -9597, -6611, 527, 6385, 15457, 9109, 1637, -16943, -11372, -6131, 6112, 11020, 18201, 20336, 22490, 36963, 40010, 19529, -7285, -32075, -46792, -30627, -18192, -17522, -17603, -18256, -19871, -18538, -9272, -21753, -29770, -29542, -25346, -8624]
12172h624Q335k11j241k4238q374K390m386j3456j3021K2006J4637Q114K0832
12159B763J5232k7968o74J5361j2794M91L628k1215q27Q762N296L0394j330j561
12145A5558m138k769N573J364j8172j1537Q9j0392j0192j1193R961J3117Q436
12132a4295M879j1396K161J8004J8421j0305J8293J6184k4660j6367k474j4566
12120a6121r345M701J4880j3397k288P580J1842n596N674J1642j4510K764P351
12107E177p852K624r682O419L114k911P455p741J065j158j2583J3695K4662L2320
12093E4604m573o54n133k2575k3605Q449O353k6647K3154J8724M09k5246j5969
12080a2709k371J2202J0922q676P348J1502K617q771p90j847J3480M440n036J3819
$$ y = [-8624, -289, -500, -1741, -25979, -34353, -31963, -36349, -49805, -62826, -40820, -26183, -18069, 2763, 17995, -9973, -10647, 4714, -8080, -7589, -3961, -25176, -26003, -17241, -11945, 18449, 17119, 15558, 11420, 8651, 14224, 15588, -2584, -14121, -14032, -24424, -34616, -45809, -35848, -22731, -14295, -9416, -20812, -18651, -647, 17774, 7469, 25762, 41946, 17286, 919, -1555, -16121, -25466, -20765, -5885, -19282, -21570, -13990, -2148, -7744, -2070, 9572, -4938, -2174, 5177, -2675, -51, -9733, -3314, -200, -3111, 4344, -3397, -2332, -3490, -16073, -2378, 22284, 54604, 50031, 49377, 44244, 21669, -1936, 6513, 12866, -13781, 9373, 28097, 28506, 3260, -12709, -15080, -2878, 8044, -632, 6716, 18218, 20835, 12064, 11274, 9427, 22907, 27347, 22311, 36130]
12066C6130k1454j8579l509Q385k96L124M80j3583k0894j515J7801j083R728J5780
12052A0515j1955j297O096M51L858j6576M809K855k3057k1033Q103J3912J1705
12039a1614J5069L5136N825j6888j7442r350O824N966j6270n387N940J3449j0153
12026A105j9437P249P717p790M237J8220K4384J236m695j5494L077j2334j238
12013F237j68J709k8826k6845p05q761m253K0673L0279k389k143L163O952m142
11999i219k539Q034J4397M067j6254O434O525j7446J558K600J4648p223k173O445
11985I854M626K1529j1486l2282r899Q722o730O751O107n453J8324p570j6682
11972a4189j3826L39J744K84K4146K966J451nj3371j5860O722J5763J4354J8428
$$ y = [36130, 14676, -3903, -7412, 973, 677, 3801, 4281, -9302, -30196, -31711, -13910, -14993, -5265, 10515, -1440, -2737, 3359, 3810, 7668, -8908, -4099, -1244, -24301, -45334, -37231, -23319, -11614, 3455, 38591, 44416, 27528, 10086, 736, 7560, 13526, -2744, -8131, -2191, 11258, 1105, -18332, -11083, -3366, -11156, -6919, 11301, 35685, 36921, 32226, 16732, 19809, 7475, 6237, 6069, 7778, -21048, -47893, -48598, -57359, -61612, -40939, -10660, -13049, -15192, -12029, -5077, -9219, -11758, -3724, 10673, 14740, -1514, 4920, 11445, -6001, -4443, -1843, 12805, 5582, 3409, 9854, 14480, 36009, 24523, -7759, -17658, -8936, -15666, -8915, -2808, -8261, 10063, 2493, -14189, -28015, -27676, -25932, -25648, -1502, 1464, 2915, 2910, -10461, -26321, -19599, -3836, 10518, 28946]
11958B8946J8612J4274q753l0263O720j1772k1196P790J2945k0550p783K267j6113
11945b4876R212K8967j2170j6451Q743K0391O369p782j3644j7464J766K7012J0736
11932B0809J7179j2185k7916j0073J2907J8578j5398j5321j3947J6917K3976J4165
11920B9691o960j1288k0295j2716k071L887K3290r010j0853J3509L726N964M33
11907G307M424j8806j2658J3014P880J6995k5012j2839J1414J5655J1429k0172
11895a369L470J5387M641J9132o025j3082N589M960P330k0978j8693k170J5883
11882A4075K912m998k0286q824n288k4569k094J9840K4091J1472J479n204P329
11869I935K0951m87j2060N865K431k2026n796k67j3896O074j5098j2576J8548
$$ y = [28946, 47558, 61832, 53079, 22816, 29536, 17764, -3432, 4358, 17303, -3247, -11030, -8763, -24876, -15664, 13303, 1133, -15318, -6575, 13816, 20185, 12403, -1241, -18705, -16939, 10073, 20809, 37988, 25803, -2113, -12186, 721, 19299, 3901, -11420, -25367, -8450, 15526, 29691, 22731, 11443, -8852, -21568, -23639, -19752, 3538, -5472, -16325, -2816, 910, 6874, 7307, 11731, -7075, -19733, -6719, 1161, 18156, -6856, -19695, -8281, 7374, 18803, -1369, 2101, 17488, 22129, 41261, 35236, 22154, 27743, 32703, 40033, 19055, 362, -1808, 14075, 16987, 11989, -8297, -17121, -22409, -46978, -49072, -29232, -5141, 6331, 7810, 2606, 9935, 30886, 30399, 18339, 24204, 26635, 4609, -1187, -1454, -15350, -9276, -24374, -36950, -18402]
11856a8402K1245k66q39N778j7760l289K516J4902j968l87r463k4906m610o665
11842d4114j1366O051K3495J6663l480P686O741j4200M35Q339j0649j6968P071
11829b4296J1663m626O74K410N694m810R614Q048n683r21J7149J0283j7308l8474
11815c0583Q656J6641k436K1206J4554J0807k5323j4006m585o434L746j3092j6484
11802c7333j4296J124K5083j576m556J0277j588M627j4990k915O289J7304r329
11789b1879m53o665j1776R34K0764r914L770n061l715K2163L3758J679q9K2461
11775D5977j3006k7433j3157m041J1428L771p764M427R707J0350M114o356p708
11762A0309n449j5656o519r271q142J511J4431o78J4485J920j3324J6873J3659
$$ y = [-18402, 2843, 2577, 1738, 7516, -10244, -13533, -11017, 3885, 1917, 1530, -7933, -32839, -37449, -44114, -55480, -49429, -25934, -9271, -12751, -5065, 1676, -12524, -12089, -3750, -14399, -31367, -24296, -12633, -17259, -16585, -14175, -8481, -13291, -3677, 4371, -1312, -2233, 14916, 25199, 7891, -30583, -21927, -5286, -7722, 13484, 28038, 38845, 13522, -484, -5069, -11503, -7757, -20849, -37333, -51629, -50505, -25422, -26998, -31554, -21277, -22865, -18238, -33228, -36143, -29854, -12550, -21879, -22332, -28997, -40773, -39839, -19075, -28989, -25219, -30280, -33995, -11832, 21926, 23605, 23516, 45977, 32971, 5538, -7619, -11660, -232, 3539, -4225, 202, 9909, 20259, 24373, 18017, 10309, 4860, -10796, -17315, -26586, -34728, -33217, -18786, -19464, -4979, -3059, -16383, 490, 14149]
11749A4149k432J543J980J3596J9177O999K947j4627j7689k2863j899J0145k1784
11736a0758j5727m678J540K318K242L540j2131q851o515J3270K2696k663p754
11723b3471M215M399N681J6347J136O529J4765M930j1013l551l418j2330l4907
11710c0688o596J5674J7838J249l2765J1017K8066K163n62j1308N695k47m65k091
11696c020o605K1144J7701N133k790j488k6760k1113K4701J4840K658J1873k5954
11683A0320K150J8075m659j8916l464O80K748j0693k78K1498N002q613j3443J5998
11669A6405j1961p454J1881K0444J5099j4477k2774q160m819R604q338l816j232
11656i598J995j4408J0913q489K487J406P370P154m273j8805N775j0733R950P67
$$ y = [14149, 11717, 13260, 15240, 28836, 48013, 55012, 57959, 43332, 25643, 2780, 881, 11026, -10758, -26485, -31163, -29623, -27305, -25063, -21523, -33654, -42505, -49020, -35750, -13054, -15717, -23471, -19256, -14857, -9176, 7171, 8307, 14836, 29601, 34531, 23518, 19967, 16549, 4219, -30688, -37284, -21610, -3772, -2523, -35288, -24271, 3795, 5958, 5396, -5912, -217, -464, -929, -3020, -9625, 11519, 29220, 34353, 31563, 30075, 3315, -17798, 6903, 21743, 24401, 36274, 10320, 12470, 30545, 25886, 6970, 3506, 4186, 6934, -3759, -4037, 17461, 22463, 13850, 407, 16405, 4444, -3010, 8871, 29315, 44414, 29937, 7163, -997, -5816, 3788, -4550, -8366, -9598, -7603, -22011, -11098, -19587, -17100, -15694, -8324, -1170, -5443, -24248, -18473, -29206, -19256, -18489]
11642a8489l503J9983N974l1430n314J1261p235q506L2078J9703L332j831j0461
11629E562J229J7416j4262j14R033j1147k2278K483p28O767m04k41k3056P56Q486
11614b0498J117n078L162O310j3241N108R645K41R183p83k294J0131J1673j0820
11600C856n039j096k2836k983J4942J4014K3610k1030k1934k80k167k636o55j3548
11586c7782J0394r005N514M62j0479O299P402J4660O732k416p21l263J4387l50
11572A834O730m865J0711n222p759J1832m929L61J21q675l265j674j566K784j2556
11557a6138J5838J0957J5462k809L730N535j897n468n627J1254m117K969m723
11544B4966j2918O953K234m891j2493Q062O70j4824K143J2166o470j384J2040
$$ y = [-18489, -21992, -2009, 3965, -27465, -32779, -21518, -28753, -37259, -5181, 14522, 17854, 16023, 5562, 6791, 24207, 9945, 9831, 18864, 7717, -14561, -12078, -12806, -6039, -6443, -6684, -29740, -28984, -20498, -19381, -24459, -21297, -14987, -28228, -23120, -13475, -13234, -4051, -4834, -7128, 3003, 14676, 3856, -1183, -2279, -25115, -28098, -13156, 858, 24468, 3438, -18496, -18776, -20943, -23579, -24234, -37782, -27388, -36393, -30879, -30417, -40896, -34597, -27195, -12535, -5803, -8219, -8940, -12203, 2184, 1834, 8564, 3699, 14410, 9188, 1429, 13261, 8332, 8693, 8814, 139, -3126, -4800, -6366, -3582, -16138, -300, 10657, 26119, 23310, 27040, 32575, 30678, 25210, 19583, 30837, 26720, 29689, 24966, 12048, 19001, 21235, 16344, 3851, 11913, 12583, -2241, -98, 12068, 5598, 4214, 16254]
11531A6254j1601k4309J6406Q951k0465j6260N427M04J803P222j7894J7304J7820
11518A062l773J525Q597n042J2391j2976n423k9314K980R988O43J6306r406k5896
11504c8338J0434J9242O70r050R254O577o083n828q352N708O929J131j3078o400
11490b7184j518l381O762J9462R894qK1953J712j9525j711J8801j5802j8847Q405
11476i87n062J716p144j0583O407LJ3626k765J0457O611j0831l054k79j0006j2039
11461b3930J6030J5185L396k2248K692Q356j0226j3763M687r582N098j8777L162
11448c9920J0690K52J0794K2707q344J914j2158p147J6l825P322m00J5660k2296
11434b4735j7084N745k4666o405K3502M5713K738p710r072n320K075J3486j887
$$ y = [16254, 4653, -19656, -3250, 5701, -14764, -31024, -25597, -25193, -23390, -16168, -34062, -16758, 1062, -2711, -1186, 7411, 2369, 14760, 1784, -3639, -32953, -29973, -19985, -19342, -3036, -12442, -38338, -27904, -8662, -7992, -17042, -7788, -1211, -7294, -13122, -21474, -15766, -8837, -7706, -20784, -27184, -28702, -32083, -25321, -5859, 4035, 4027, 25980, 27692, 8167, 6456, 25257, 9455, -9392, -987, -6049, -4333, -11477, -22060, -15653, -15650, -2024, -4789, 5668, 12279, 1448, -1606, -1885, -11891, -23930, -7900, 7285, 10681, -11567, -8875, -519, -10745, -24508, -19821, -29403, -24305, -43082, -39920, -29230, -28978, -18184, 4523, -3821, -1907, -14065, -21212, -21196, -25021, -17699, -18099, -2439, -24735, -41819, -36074, -60740, -67145, -43643, 2070, 4808, -2902, -11974, -17294, -15219, -1733, -3620]
11421c620r440r434K0724K3925J3989k0288k0840O150Q988k11J5045q742m792
11408A1454K0115K4181k5758k9386k9435l776J0356J0498N371j7730Q878Q701
11396f531j4103q018J4123K8034K178j3146j7132O94K1682R756m659o948j5798
11383i868n133j0520q398J0529L0N214j1817L698J1098K5049N16j2471J113o275
11369g235p368j3611m556J8174K8072K0457p207k0169M381R476r104K138M390
11356A7838j9678p80K4027R073q020k6888j3008J0059r367J0959K008J3280j0967
11343a464O684O075l360P820j2278L267K0609K803r431j0268m943j6742j093L2892
11329B0571l48O48k4297k1842L935K8213J822r00K888j6400R797K740m324R34
$$ y = [-3620, -13060, -22494, -1770, 22155, 36144, 15856, -4984, 1166, 10154, 9943, 24988, 16246, 11454, 31569, 55750, 29992, 606, -28829, -32605, -22249, -11751, -6380, -24110, -15232, -6531, -20634, -28652, -14529, 13505, 15683, 2537, -14595, -13901, 7781, 17537, 12878, 5930, -9868, -15001, -25521, -33919, -23390, -23360, -18146, -29963, -26265, -15167, 9882, 10398, -2073, -960, -7235, -14603, -28214, -32770, -14596, 13476, 33933, 26726, 6557, 10938, 20414, 11310, 13448, 17838, -1840, -2620, 21407, 30480, 22460, -4428, -17436, -7377, -16744, -5785, -3777, 9503, -1464, 5220, 11295, 7935, 15755, 3477, 6744, 27353, 30156, 20725, 10457, 5514, -11228, -12321, 20571, 20223, 20871, -3426, -25268, -21333, 6880, 8702, 7802, 10690, -5710, 4087, 6827, 2503, 3437]
11315C437l359j1232r345k084j4198J4813K6998N621j4040k12K375J810J553p089
11301d952k662k708L057J6077r754k9735J19K2026J3214j2785q638J1089J5786
11288A0134M641j1764q638M653j3109R922J5015j8700j715R990P194J7543O696
11275C1862j789r747o435Q536r765j3553N918J1687j7530Q780P835R285m93K192
11261B6783n514o641J6313r790L415R940J0117l3361p302J5200k0421j9276k544
11248b3081j2059P393M520K184m021K2717J8454j9857r940j1381J6240J7500R803
11235A8472j1083K221k689j4810j5441J6186K0599O880j3075q067M681K5120P012
11222C6006j3956J0003j1479k9320J1340J341p525J2484K1461R574k8106o533
$$ y = [3437, 78, -11154, -20499, -22583, -36781, -21968, 5030, 10651, -3389, -3601, -1226, 584, 2137, -4952, -7614, -10322, -7265, 8812, -942, -30677, -30558, -8532, 4682, -8103, -16741, -5652, 10134, 14775, 3011, -5627, -974, -14083, -4161, 10854, -7846, -9561, 429, 7623, 25166, 31862, 30073, 20326, 13891, 22427, 12662, -891, 5027, 16714, -816, 7964, 15799, 25084, 24591, 26783, 21269, 14628, 30941, 21151, 24566, 34506, 44623, 11262, 3960, 19160, -1261, -20537, -23081, -35140, -27747, -23227, -21043, -25064, -2347, 16107, -3750, -13690, -25071, -8831, 8669, 18472, 7389, 9610, 6921, -7889, -23330, -7144, 13455, 20335, 7260, -807, 3874, 28994, 36006, 22050, 32053, 20574, -8746, 2594, 3935, -3590, 8894, 30355, 39929, 11823, 5290]
11210E290K3495l00K881Q658p015k1322J038M991K373J1038q466q709m497J4238
11196B3693N302o478j9876l827J2825m786O426R643p849Q50K5328N300R395m562
11182E1384K0733M6635M4682M1175O9027J52582K83831M74178N75687J66742m42541
11171A484115n70471l63098j85435r7507p9985m8861k3085l1674k7242K1P813
11160F4591N523j4280J1791J1125q446j7876l374j186j8273j2500k3433k8946
11148c5284k275J1278L7079J2696O069O696l912j2827O175Q470j766p14l713j2577
11134A5395k014J094J1090K1221j047n560k9954l7067K2042l210j6097K392R389
11121a2326r751R504L8409K1264k397j2352j7667j5807m025o687q452M47J7724
$$ y = [5290, 28785, 28485, 31366, 40024, 33009, 11687, 12725, 17716, 20089, 31127, 22661, 13952, 9455, 23693, 28995, 22517, 2641, -1186, 11639, 6853, 13279, 22922, 15073, 15923, 41251, 46551, 55946, 51384, 72117, 118752, 163434, 204609, 273636, 426218, 710049, 1184227, 1759914, 1926656, 1484115, 913644, 550546, 365111, 267604, 187619, 138758, 115673, 83999, 56757, 56778, 64591, 70114, 55834, 67625, 78750, 70304, 52428, 49054, 47868, 29595, 17095, -6338, -35284, -37559, -26281, 10798, 23494, 29563, 36259, 32347, 19520, 25695, 34165, 32399, 31685, 27972, 15395, 13381, 14475, 25565, 46786, 45739, 40179, 10225, -26842, -4800, -8010, -24107, -21715, -12326, -22077, -12573, 25836, 47100, 44703, 32351, 14684, -1123, -5148, -11835, -20287, -19840, -2116]
11108b116J702J4894n09K589m884M038P70j017j2947M536j2845K664J1100O751
11094A4726j3231J3807J1526n614j9001O822J7554J8025P362j1276j1294j7759
11082A1647j5530K2288R313m433r476J0581L907j0119J8931r195j0372Q274K221
11069B8037m728m0495Q67J2176j1370n575K2527O496J5639l786j6692k8465r364
11056c4733J7190J1880r4m172j5036o532P33R261J8113N27j6593J252J0997J2228
11042E021p403k3584j69J471K6903j1504j20J4331N196J2845J0704J4576L5633
11029H3900K9591O478q521K8583L1615K9324K3117j6313j6223l4365m5291m1087
11017G0808m1539k7594J4840K0483R85Q249Q50o485l364J3985k47j9657K1593
$$ y = [-2116, -414, 14480, 13971, 16560, 11676, 15714, 16484, 15467, 2520, 7056, -5789, -3125, 7975, 14726, 1495, 15302, 26828, 21214, 2213, 9035, 26589, 44614, 51976, 40700, 29406, 11647, -3883, 18405, 27718, 23285, 13809, 24390, 28297, 18178, 37109, 27914, 17542, 25816, 28037, 23309, -17186, -16319, -4143, -15513, -21088, 1439, 7935, 23574, 19788, 3096, -25369, -34733, -17543, -5663, -5757, -9929, -24965, -31497, -30764, -21503, -3390, -2863, -19456, -18204, -7207, 5021, -2382, -25966, -26135, -24664, 2239, -9265, -9385, 4946, 10142, 22987, 33691, 48267, 83900, 113491, 119969, 111448, 140031, 171646, 200970, 224087, 207774, 191551, 157186, 111895, 70808, 29269, 1675, 16515, 36998, 37983, 46232, 47082, 40597, 37233, 51218, 50971, 31314, 52907]
11004E2907L6783p819l9633k747k9558k6694m260P785K1057K9195J8687r493k6309
10991A9901k4971q74j5174k9011K4264J8307J4496j1282j0758q003l6548M770
10979e4883N1370M1068K1801j6785n0490m3576J7827J2153J4348J6521K3245K1018
10967E3617M895k2396l0656k201K8378L3195K7576L7891M65k7566J0628m791j7108
10954I1927k867J0573J3692J4132M104k1684k1443j3967N29p325L128l6267k2720
10941A1812J1680J9139J4101l749N22j0111j0648r981J9350L6566l909k15J0263
10928H4820J0649J6045m866R94m5735j7428J1641k4405j7973M062M1990L3525
10916I3319n298q126j0717q432r256k1357j9184J0693K8972P688Q649q688r20
$$ y = [52907, 89690, 81871, 42238, 39491, 9933, -16761, -21021, -13236, 7821, 37016, 55703, 46210, 19901, -5070, -5944, -21118, -50129, -25865, -7558, 6938, -4344, -15102, -23105, -59653, -54883, -3513, 37555, 59356, 42571, -7919, -51495, -33668, -21515, -7167, 9354, 32599, 53617, 58512, 36116, 5460, 3259, 31637, 64832, 92408, 130299, 130764, 103198, 113826, 109035, 91927, 89060, 99633, 113325, 127457, 131561, 109877, 88434, 74467, 74996, 67671, 70799, 34532, 11812, 23492, 42631, 56732, 52983, 53505, 43394, 32746, 22765, 42115, 78681, 74772, 74557, 84820, 95469, 111514, 106648, 107642, 61907, 44479, 56120, 31715, 13742, 17804, 59794, 93319, 88021, 79895, 69178, 60746, 51490, 30133, 10949, 21642, 50614, 58302, 66951, 58263, 57343]
10903E7343j571L0052J6295k4489q4063j52983r0309K4253J55705N2566J5303
10892a898J0990Q326J2763J019m261o859R218J7067j2245j4818O568M1760L2895
10879A00525K2144j9122k6871o93R200j349l2508l738M0675J6669k2163n943J4994
10866I1820j4505J5495j2726l755N856m100j955K4422J3888r511j1163O185n993
10853I3958L422K4087J8562p68l689L994j3456K7602K7251K2241K0010k1899l0083
10840A71232k9726p292K3579K1933L109k0262P367L8091N668J501K6419J8910
10828B60529r006l2176r131J9886M5779K9017P185K4618M3719M9119K2504N536
10816D57579L466K3364K4110J2645K3336K2889L4528M4212K8160L6468O7850Q3714
$$ y = [57343, 55772, 85824, 102119, 77630, -6433, -159416, -249725, -225472, -69767, -17201, -1898, 9092, 17418, 30181, 31200, 26939, 20080, 29298, 46365, 34120, 19302, 25870, 67630, 100525, 122669, 103547, 76676, 75983, 85183, 83834, 51326, 47588, 88263, 104932, 82769, 76826, 91820, 77315, 92810, 80084, 76329, 82185, 78085, 76130, 100552, 114440, 104929, 93766, 99951, 93958, 97380, 121467, 140029, 139261, 135572, 139566, 126110, 153712, 180963, 203204, 223214, 201315, 171232, 141506, 134214, 157793, 179726, 182835, 162573, 169940, 208031, 213699, 215200, 241619, 260529, 251523, 219347, 210216, 230102, 275881, 304898, 312083, 336701, 380420, 429539, 452043, 457579, 461045, 484409, 508519, 521164, 544500, 567389, 601917, 646129, 674289, 710757, 778607, 862321]
10804H62321J06642Q7531Q5016O0476L8601K5149O2265J03697J49908J78329K04026
10793A963961K48233M02503O07274R09865R03445K19829k12673L3832M26392P11065
10783F213726R21703J047818J299835J782976K399578L320728N067222Q060358
10775C0113944J3040580K1960557L9409535P3181209J15747414Q6547725m1171422
10768C38829542j16562257q9163979m8524133k6934628j6159094j0294830p081328
10761B4109293n101933l704597k682417k036506j616142j139959p75456n80030
10753F472253m21146k51197L7841J93030k75063q53616q90876o24325m54724l04289
10743B627888k25114j97230j94266k04154j86220j45969o7529m2574l4367l4918
$$ y = [862321, 968963, 1056494, 1141510, 1201986, 1240587, 1265736, 1328001, 1431698, 1581606, 1759935, 1963961, 2212194, 2614697, 3221971, 4131836, 5035281, 5255110, 5042437, 5076269, 5502661, 6213726, 7135429, 8183247, 9483082, 11266058, 13665636, 16986364, 22053586, 30113944, 43154524, 65115081, 104524616, 177705825, 293453239, 380000964, 338829542, 222267285, 133103306, 84579173, 57644545, 41485451, 31190621, 24109293, 19007360, 15302763, 12620346, 10583840, 8967698, 7827739, 7052283, 6472253, 6051107, 5799910, 5837751, 6030781, 5755718, 4902102, 4011226, 3386901, 2932177, 2627888, 2402774, 2205544, 2011278, 1807124, 1620904, 1474935, 1407406, 1364832, 1330465, 1295547]
10733A295547m8932o1532p8146o8697o7638n8241l2644l3460n9102n7961n5912
10722F73282l3873j8071o700J0247O810r177j3794j2061l3138n4776j8785j6661
10710D73303l0178j8110j7583j5618K0259K0180j1333l8565k3690O349p031k0820
10698C37163k9686j7256j9423J5774K0204O95n318L487j5840r207O208j6990o039
10685B63772J0969P859k6839j7284Q172K3407p158j3490m251J016M38r639k0215
10672B16757k5329l5139k099K3912L0386m37l0216r046j560P959k4360j9796j5052
10659A15980M222K2744o958n248r27J417K1997K8270J3633k6479j9327M5498N3577
10646B48399M0381J13149J42673O4002q4398j08830r6230q7755l5672j8964j7611
$$ y = [1295547, 1246615, 1185083, 1106937, 1038240, 970602, 912361, 879717, 846257, 787155, 729194, 673282, 639409, 621338, 614638, 624885, 631695, 622518, 608724, 596663, 563525, 508749, 489964, 473303, 443125, 425015, 407432, 391814, 412073, 432253, 420920, 382355, 358665, 365014, 357983, 337163, 307477, 290221, 270798, 286572, 306776, 307471, 302153, 305640, 289800, 280593, 286801, 269811, 263772, 274741, 282600, 255761, 238477, 246649, 270056, 262898, 249408, 245157, 246173, 246611, 236972, 216757, 191428, 156289, 154190, 178102, 208488, 208051, 177835, 168789, 167229, 175188, 150828, 131032, 115980, 120202, 142946, 135988, 130740, 129813, 131230, 153227, 181497, 195130, 168651, 149324, 194822, 248399, 288780, 401929, 544602, 608604, 524206, 415376, 319146, 231391, 195719, 176755, 159144]
10635A59144k5366q566k0779P870Q671l091J1193j953j247r538l2132j5559K001
10622G0648O727m113r325p717M043J2343n83o00j1291p797K776J1013J773p54
10608F7143O750J2518K1346O939j757j9762R431J5498r101J890j3644O581k35
10595A03597j1839k0217k7404k6608k7926p973J4980j1045p270m37L297m031n374
10582b8250j5784p493n971J9046M4704K8838J9359j3247n79j6239K984L4148M5900
10569A07416m225j2488L037r143Q567j9203l1083M001K9351M8232K3963K84k1910
10556A26799k3328k8136n013K0188J7780K3514l685o306k3565k6082m7692r697
10544A4777J0786J5814O466J1290k089r981k7518j0962L682j9950N879J9029K326
$$ y = [159144, 133778, 125212, 104433, 112303, 120974, 117883, 129076, 127123, 125876, 116338, 84206, 68647, 70648, 77375, 73262, 63937, 56220, 60263, 72606, 72023, 71423, 60132, 52335, 55111, 66124, 67897, 67143, 73893, 86411, 107757, 114696, 112939, 93177, 102608, 118106, 109005, 110895, 97251, 103832, 103597, 91758, 71541, 44137, 17529, -10397, -18370, -3390, -14435, -21705, -22142, -18845, -22876, -28250, -44034, -51527, -57498, -38452, 6252, 35090, 54449, 41202, 40623, 24384, 27368, 61516, 107416, 103191, 90703, 93740, 84597, 93164, 73961, 42878, 46879, 76230, 124462, 148425, 148709, 126799, 103471, 75335, 70322, 90510, 108290, 131804, 128119, 121813, 98248, 72166, 24474, 14777, 25563, 41377, 47843, 59133, 57044, 47063, 19545, 8583, 12265, -7685, -1806, 17223, 19549]
10531A9549L667J2001K5669k278M188j1007j2397j1391K922o118J6281N073J4291
10518F0450k2431l0848J6557Q678O459r203l2988m813J3493J0132P484q625j680
10505A2665j215P019J3162K8562J0131k609q904j0239K624J5353J2217M527j7184
10492F6109Q422j403l548N406j5218k7160j5136k192J1742L2837o532j0420J214
10479D4121k771k0475Q846J8417P695p745j4832M881J590q490k354j2827m270
10466A1786q19l1815j5693j0645K1465K8716J0932L272j4620q644J50K8253J9411
10453D1749J4671p393j7723n622p719j1696Q319M857R480J4279k424j0273j3688
10440A6817K107K1109N50j838j1N66j3538k6927K448J4380K1210l0584k9352N845
$$ y = [19549, 23216, 35217, 60886, 58608, 62796, 51789, 39392, 28001, 30923, 24805, 41086, 46159, 60450, 38019, 7171, 23728, 32406, 38865, 29662, -3326, -8139, 5354, 15486, 22970, 14345, 12665, 11450, 18469, 31631, 60193, 70324, 67715, 58811, 48572, 51196, 66549, 78766, 83293, 66109, 74531, 73128, 69580, 74986, 59768, 32608, 17472, 15280, 27022, 59859, 53327, 42907, 44121, 41350, 20875, 29721, 48138, 55833, 48088, 33256, 38137, 39727, 31237, 28883, 16056, 11786, 10967, -20848, -36541, -47186, -25721, 2995, 13927, 17199, 2579, -6065, -5915, 22338, 41749, 56420, 49027, 31304, 25682, 17963, 6267, 14586, 19443, 28923, 43202, 40778, 30505, 16817, 18924, 40033, 40583, 38745, 38734, 39300, 25762, -1165, 1283, 15663, 36873, 6289, -23063, -17218]
10426a7218K7080J6783K302r547J0453R09l085j9937r029J3124N511K6332r264
10413C4414k1236j1420o193p652J3638M4995J4958k1033J258j3492j3725p863
10401F649k411j0690j137N824P549K1195R540r462J3069n126n729k348J3474J2964
10387E3361J746j7654p078j228k04o769j8716J155M345K004J2489J2358L2633
10374F8442J7908j0877P861Q365N296L8126L8363N9427O9526J15106K58389M19177
10362A095109O01339K77898l64858n93217l84436k21695j35189o0411n0215l0401
10352A33924k3882j3979j4566j1653o618j5450q077Q341K1911J9225J6096j3731
10340I1541n4317k2413J7877K1152Q437k2372J8358J6437j7746L304L1330J1914
$$ y = [-17218, 9862, 26645, 28947, 19400, 29853, 30762, 27677, 7740, -1289, 11835, 17346, 43678, 34414, 13178, 1758, -4435, -12087, 1551, 46546, 61504, 40471, 41729, 28237, 14512, 6649, 4238, -6452, -7589, -1765, 5784, 26979, 36519, 27057, 40126, 35000, 29271, 26923, 40397, 53361, 55107, 37453, 30375, 29147, 28943, 22174, 3458, 4613, 8958, 10962, 23451, 35809, 68442, 86350, 75473, 83334, 91699, 96995, 135121, 173484, 232911, 302437, 417543, 675932, 1095109, 1696448, 1974346, 1609488, 1016271, 631835, 410140, 274951, 214540, 164325, 133924, 110042, 96063, 81497, 69844, 63226, 47776, 39699, 48040, 69951, 89176, 105272, 91541, 37224, 14811, 32688, 53840, 62277, 39905, 58263, 74700, 56954, 60258, 91588, 103502]
10328A03502j8056j3480j8724k7974J1865l723J694l193J9833j1288k0874J0846
10316C0428K7380n972j2127p687j7145j1492n157K2607J4802J3996k1273k5391
10304B969j709m251K3678O602j1920j7130r790J2896O582J1486P214j0044j6761
10291a78j1558q218m871K832K5906J7314j5624j1966l2178P047J9364J1458l513
10278d185m436J580Q515q12r025J7293K0070J289o097j148j2891r921J5278O660
10264B2170j1276n431j3868Q21K1924n516J6616k522n532J5486n812m128j1008
10251A1924m562O453J8572m755q939j1261j1100r86N730K154k0200J2454J1381
10238F865J017Q315j1673l481L328r786k364K632J24J3690J3302O849m180q56
$$ y = [103502, 85446, 71966, 53242, 25268, 37133, 33410, 35104, 31911, 51744, 40456, 19582, 30428, 57808, 51836, 39709, 32022, 14877, 3385, -1772, 20835, 35637, 49633, 28360, 2969, 1260, -2991, 20687, 27289, 15369, -1761, -11551, 1345, 7927, 19413, 26627, 16583, -178, -11736, -19954, -24825, -21993, 3913, 21227, 5603, -6363, -38541, -31494, -12130, -672, -4185, -8621, -7041, 1474, 662, -8363, 8930, 29000, 30289, 24192, 23044, 10153, 232, 15510, 22170, 10894, 5463, -8405, -7584, 14340, 8824, 25440, 22918, 17386, 32872, 27060, 22932, 11924, 7362, 13815, 32387, 27632, 18693, 7432, -3668, -4654, 1076, 3230, -16970, -4516, 6865, 7882, 16197, 4524, 1043, 4371, -5415, -7779, -5147, -5023, 8667, 21969, 28818, 24638, 23782]
10224B3782J5846J340j6891l748M325j896n367r668J4947J2724J9617L572J127
10211E9710m404k4129k660j5140j1423J2n223n688L697J0413O586K5918J0744
10198D8413j2481q723j7097j1584k032Q251J017J9887O517j6091j719L329j8880
10185a193o031J4445l856k2925r56K5330K6168j0810k1480q629j6341N746J7987
10172b545M917K0352J1861J2006K6188J4951P381k0886m2402k0222j0008n270
10160c677k825l0343J127J9689J2724k25r153J5309J3910n812J1693j0736M00
10147A2081k5620j1786J4766J7542J4309r048j7444n65J2134J1955J8108r202
10135B7230m832J5623m017m674k051j2231l089j6849j0717J3454J0933l0362n781
$$ y = [23782, 39628, 40968, 24077, 20329, 24654, 22758, 17391, 7723, 22670, 35394, 55011, 58583, 59710, 55306, 31177, 28517, 13377, 1954, 1966, -3257, -8945, -5248, 5165, 11751, 37669, 48413, 35932, 27209, 10112, -1472, -3504, 4747, 5764, 25651, 32168, 16077, 14358, 17687, -1193, -7224, 7221, 3365, -19560, -20516, 4814, 30982, 20172, -1308, -9937, -26278, -20532, -2545, 2372, 22724, 34585, 46591, 72779, 87730, 95111, 74225, 31823, 11601, 1593, -3677, -6502, -36845, -35718, -16029, -3305, -3530, -12683, 2626, 16536, 10724, 22417, 11681, 12081, -13539, -25325, -10559, 6983, 21292, 12244, -5200, -5765, 6369, 18324, 36432, 27230, 22398, 38021, 34004, 29330, 27279, 15048, 11959, -4890, -15607, -2153, 8780, -21582, -27363]
10122b7363k554K3132K3746K0940Q486j1348j7115N244K866k9509j0856k085K2618
10109F202R462j6029j8074K642O443r218N878P372O178j8925p116J5158K8664
10096A8637J1375p836k88L453N407n735m428M262Q342j63j9457j9061n767j568
10082a2827j5953j1341m92l532J2375K0104K4553k0988o581j857O012K0195j348
10069H320k2431J5536R034l5040j5899j201J7975M303J6891J0007j0006J798K527
10056A814J3949q139J1818P175j4771K8897N4880K6050K6748Q6363J84141K42299
10044F61224O5735j98092k09144j39821n6732j0657k7739k8373j2889k1566j580
10033B0366j0610o284J1078n346J4343L115n108J3663k516k3932r983O526Q797
$$ y = [-27363, -29917, -6785, 16961, 37901, 46387, 35039, 17924, 23168, 26034, -3475, -14331, -16416, 6202, 15664, -365, -18439, -15797, -9354, -18572, -12694, -5322, 856, -18069, -25185, -10027, 18637, 30012, 22176, 21888, 25341, 30748, 25013, 20585, 24847, 33189, 33026, 13569, -5492, -11259, -12827, -28780, -40121, -40613, -44145, -31770, -11666, 12887, -8101, -14682, -16539, -10527, 9668, 8320, -14111, 1425, 10459, -24581, -40480, -41681, -23706, -19403, -2512, 7495, -2511, -713, 1814, 15763, 7624, 19442, 26617, 11846, 40743, 95623, 121673, 148421, 234784, 418925, 661224, 726959, 528867, 319723, 179902, 123170, 112513, 84774, 56401, 43512, 21946, 20366, 9756, 3472, 14550, 9204, 23547, 26662, 21554, 35217, 32701, 8769, -1214, 5312, 14109]
10020A4109R406j4431J4120J7061j2675j6130l993j587n529J0990J3251J2665
10008C7257n397k6339q498n532K6816j0561j7917J7917J0202j4022j2105m626
9996a2805j1431L467k271p143j1969M632K1486N777m477K010j8634p165N568J6272
9982a6683J1600j7801p822p54R994J4094p243l84J0013J247j2424K794R089j1698
9968a5978J668K3994K347j6089K699Q854O640J6047N785j4819l0152j1942O987
9955a3959j0988Q407q102j578Q532J4399J1470p130j2822QK3829r048j0580Q997
9941A435r36K41P685r686K006Q46m449J925q503k018L3052O177j1697k2281j2773
9926a8976K468K93J0215J2572K4309L956l4832j1336M607k4486k8623J393K0254
$$ y = [14109, 23515, 9084, 23204, 40265, 27590, 11460, 7467, 5880, 351, 11341, 24592, 37257, 31860, 5521, -2977, -8509, 18307, 7746, -10171, 7746, 17948, 3926, -8179, -12805, -24236, -20769, -23040, -30183, -42152, -37520, -16034, -10257, -14734, -12724, -31358, -38523, -32955, -16683, -5083, -22884, -30706, -31460, -21466, -7372, -14615, -14999, -4986, -3739, -16163, -13369, -4280, -15978, -14310, 9684, 12031, -4058, -1359, 7495, 14135, 30182, 35967, 21148, -9004, -20946, -13959, -24947, -16540, -24642, -26220, -17688, -3289, 8181, 1051, -11771, -11763, 12066, 3018, -7562, 1435, 499, 740, 8425, -1261, 745, 1591, -2858, -933, -9436, -11454, 21598, 27775, 16078, -6203, -18976, -16508, -16215, -6000, 6572, 30881, 34837, 5, -11331, -6724, -31210, -59833, -58440, -38186]
9913c8186K1591m768L291OK2125k7524k9359L240O403J2299Q595K1540J4677p28
9899A3202k290k13m645j736P381r652J5715K787m244R070L888k2790j4968l909
9885a2404L597L0099O055o650n907l2429j7780J6990N354R397K0347O606n733
9872A7542J1995J0745j7422k7299k7363O60P730n147k158J6247K4316n34j1202
9859a890j0832p239J8583R807j355k5564j2883q814Q810K6291J1546K076N691
9846A4227N92J950J888l1821m6578N333K6847K6747k844l587J717O347J5650j1258
9832E210j9368l108K2611j385j6992J5562o813l050O97J0499q106r923O660l806
9818a1312q719j7236K0089J3422j3468O032M1286n564q101Q942J618j1875k2497
$$ y = [-38186, -16595, -21363, -18072, -18066, 4059, -23465, -52824, -49584, -43181, -30882, -22287, -747, 13930, 13202, 10912, 10699, 6054, 4318, 11699, 2047, 17762, 20549, 16305, 25375, 29263, 6473, -8495, -12404, -8807, 21292, 27347, 20697, 14790, -17639, -35419, -18429, -13075, -3678, 16669, 23275, 17542, 29537, 40282, 22860, -4439, -31802, -31142, -23412, -28559, -30717, -14470, 9846, 9312, -1890, -12722, -19961, -1378, 8429, 7074, -18490, -31373, -40187, -31377, -5086, 6460, 8536, 14227, 14819, 16769, 18657, -13164, -59742, -54409, -27562, -815, -3659, -7246, -5529, 818, 16468, 5210, -14158, -17266, 5345, 3960, -13032, 2530, -4283, -7333, -6636, 3863, -4243, -14166, -7506, -11312, -20031, -37267, -17178, -3756, -17224, -11192, 30094, 24530, 16429, 25371, 26989, 15114, -7383]
9805g383j0096J5526J6962j7688m447m150l695K2633J3112j1469J690J4553K920
9792B8468J665j8329o153J531j1317j4592J3687K9773p591l007j0737j9397k140
9779a8139J0178j2650j4959q754Q863J743O57J3709J6509j851J766r78J0018M833
9765A0945M396j2366R454K1861k5276k0049J8210m499L26J363r977l982O933J5768
9751A3107J3421k2355j2931k391p315J8574N25J0009k7j6752J53l28K987m295
9737g618Q64K883J1608j323n38o534m433K5943l337j9519P052P469Q684k2246
9723a045p599n417l318J2658L700J624J9743l805j6054r396J5577Q996N970J0065
9709C1699j013J046K996p864m413k2193k4701K6409p379M375O076J9310r80K742
$$ y = [-7383, -17479, -1953, 15009, -2679, -7126, -11276, -14971, 7662, 20774, 9305, 10995, 25548, 28468, 30133, 11804, 5651, 7182, -4135, -18727, -5040, 24733, 17142, 14135, 3398, -15999, -18139, -7961, -20611, -35570, -44324, -35461, -33718, -33061, -19352, -2843, -4694, -2928, -3906, 6112, 10945, 15341, 2975, 12429, 34290, 9014, -11035, 7175, 2676, 3002, 4365, -5612, -9594, -2661, 13107, 26528, 4173, -8758, -11149, -18464, 110, 635, 10644, 10617, -6135, -5982, -6310, -3323, -7618, -6754, -3871, 7737, 6414, 5876, -658, -5091, 20852, 17515, -2004, 5048, 12517, 21201, -1045, -8644, -14061, -17379, -4721, -1021, 603, 20346, 16541, 487, -8909, 6668, 15664, 21634, 31699, 30686, 31732, 34728, 26864, 22451, 258, -24443, 1966, -5413, -1038, 5038, 24348, 23368, 26110]
9695B6110j3422j667Q743j7325j1424R844j3919k679o673M94R635J5903L3035
9682C6655K3782p129k0722j2628k232J1841j6292R889L4224L1151J5042o656q281
9669H8644j9735k9937j5316n152J277J3453K6560m930q619q84n061j9729N64J8451
9655C9586l5941j2782R048j20L284n120k1054M280K0360j5021j9886K49K6197
9642f920J3681L529k679N675m195j236K966n741J14o51N92K340j6255R510r2k0954
9626b0316O138N382J6189J4381J2277j9300q178j6100j2431r668m883K7501J5285
9613F277L936J2047j6310k1231n009J9062p875j3105J0426p98J2192m765k4043
9600b9196l0833L9633K8057J1167J0225j5974j2563j152M122p62n418J2446J1429
$$ y = [26110, 12688, 11021, 19764, 2439, -8985, 859, -13060, -15739, -22412, -21918, -12283, 3620, 36655, 60437, 53308, 32586, 19958, 17726, 29567, 13275, 23164, 57388, 88539, 103581, 96925, 88644, 68909, 38972, 23656, 18504, 19781, 33234, 59794, 54864, 46245, 45361, 40300, 20571, 21135, 39586, 3645, -9137, -89, -209, 3075, -2045, -23099, -18819, 1541, -13480, -33366, -33117, -6920, 6761, 10290, 7611, 13286, 9091, 7855, 10821, 5080, 5194, 4543, 5135, 7475, -8780, 730, 638, -20316, -14178, -8796, 7393, 21774, 34051, 14751, 6573, -9527, -21958, -31626, -36509, -9008, 6277, 10213, 22260, 5950, -15281, -20290, -1228, -9103, -22208, -11782, -12580, -388, -5153, -29196, -60029, -20396, 7661, 18828, 29053, 13079, 516, -636, 3486, 2724, -2694, 9752, 21181]
9587B1181o108j7j9475n461n048j6925m84J7809J0460o732J748J2588k3149o18
9573b0231J0316j5937Q332J0408K4539R86p953r231q452r535J75r474M85k392
9559b7964m707K2846K6737J267k3796l097J6920k561k25l150R154j8621Q162K040
9545C005l783M905Q805J9575l056k0872J3852Q275k2308o123R798N077j7804q389
9531i043R117j2114k5265J4441Q684P211K2361k924K75K239j2424k621j2510n899
9517a8472M9928J2740j6860k0925l213J2434J9017M371j5302m600p077o053P61
9504F749J6971J5259K305j5234j3392j9793p183j4731J1801K0179J1491k265K095
9491A4252q666k177k4446K916m259j8055L454L0625Q606l275K0560Q587M044N061
$$ y = [21181, 15073, 15056, -4419, -9880, -14928, -31853, -32337, -14528, -4068, -10800, -9052, 3536, -19613, -20231, -9915, -25852, -17520, -7112, 17427, 18413, 10460, 1229, -7223, -16758, -16583, -26057, -25572, -27964, -32671, -9825, 16912, 18179, -5617, -8714, 8206, 5645, 5420, 2270, 11424, -7197, 965, 3005, -778, 4127, 12932, 32507, 29451, 8579, 22431, 30706, 8398, 2275, 12073, 17150, -654, -9043, 74, -12040, -37305, -22864, -14180, -6969, 15392, 12468, 12743, 14982, 2558, -63, -12573, -18472, 31456, 44196, 27336, 6411, 3198, 15632, 34649, 39020, 23718, 19118, 12041, 5988, 6749, 23720, 38979, 41284, 26050, 12658, -7135, -14318, -29049, -17248, 2931, 14422, 12157, 14252, 5586, 3409, -21037, -18121, -22380, -40435, -36981, -6356, 2250, -1025, 19535, 28122, 32166, 37227]
9477C7227j9448M223j1283j3319k583o692R729N181p170R48O426N56J5954L058
9463B2807p05j0461j4503p301N859q698r52O119J9514o992k108Q087n447K022
9449G241J1335K2055q006j2506j2528o819q37n438k27j2503J3190K5978J0062
9436C0997j3016o271J5466K690j2375j9060J4157O252j2589j023j8044J4724R251
9423A1159n816n808j1151q470J0373J2441K91n58j0489K681L062J9417m035K026
9409A5123j6642k0053J3112J2364K7957N109k2983j3067n472k692p01J1786J0296
9396A4137K026R578q911q509j3376j4617K3311J1323j090J0713J4039K8751K6193
9383I3568j1581j3507k501k2862o53R849j5260j2688J490L238q332j0899Q514
$$ y = [37227, 17779, 22002, 10719, -2600, -5183, -11875, -2146, 3035, -4135, -3187, 3239, 3795, 19749, 22807, 22102, 11641, -2862, -10163, -4304, -13002, -13954, -7835, 11679, 4687, 2579, 10666, 5219, 7241, 18576, 40631, 32625, 20119, 7591, 772, -65, -5503, -5730, -18233, -5043, 20935, 30997, 17981, 11710, 27176, 29866, 17491, -1569, 12588, 18840, 6251, 5228, -12816, 1908, 11159, 5343, -465, -11616, -20086, -9713, 2728, 3019, 2461, -8028, -5347, -2285, 17132, 13097, 15123, -1519, -21572, -8460, 3904, 31861, 36970, 13987, 920, -4552, -7244, -7945, 3841, 14137, 16163, 25741, 16830, 8321, -5055, -19672, 3639, 14962, 13872, 24585, 38624, 67375, 93568, 81987, 68480, 65979, 43117, 42464, 52313, 37053, 24365, 25855, 29093, 20761, 9862, 18376]
9370A8376l221k9173P997J8756o449K914J0863r637k3843k0362J3488J0690m787
9357a4388J0053N468j175R53k168k916J4498K740o068j956j245N547m165O115
9343A1293j395j2346l203k383J2496J3935R245n194k1283k0711m98Q595j119j5243
9329b7811J2288O576P913l756k164J980j2853P894J0525J4358j0485j4176o937
9316a6648k020J0095J8878n205j2787q506J461J204q664K2338K4147J7327k5683
9303A5937j4887L34L805q995P741M095O198J0074j9504K701k746j1731m721O31
9289a1068j4865J1634K2963j5930p548J0841p72k0659J935J8408J8812N873j154
9276A8470j0912m442K679l95J0294J8054r634k4977R214J4711n179n9k4000j2589
$$ y = [18376, 15155, -14018, -6021, 12735, 6286, 9200, 20063, 10426, -13417, -33779, -20291, -9601, -14388, -4335, 1133, -42, 911, -1257, -4173, 10325, 13065, 6997, 5041, 3796, 9343, 5178, 11293, 9898, -2448, -5651, -8034, 4462, 18397, 27642, 22448, 1165, -19546, -20044, -11449, -12568, -27811, -15523, -8947, -1034, -4790, -6954, -4974, -17827, -9933, 592, 14950, 4465, -9711, -16648, -18668, -8573, 10305, 5100, -7687, -16193, -14732, -13528, -22192, 146, 24293, 41620, 15937, 1050, 1384, 5189, -3806, 3935, 8030, 14228, 24302, 4798, 7499, 4753, -6978, -11699, -11068, -25933, -14299, 8664, -7266, -14814, -3973, -4745, -25404, -23469, -5061, 13751, 19624, 18470, 7558, 3116, 5795, 5400, 15694, 33748, 24114, -863, 8351, 23062, 17883, 17824, -6176, -18765]
9262a8765K1100N976k412K2384K8868R805l2432l2266n520R16n381J500j0554
9249a6781J9311J2552L073M331j9723k8371J655l380J2762J8061J6563q961j3214
9236b122j3433k621r908L1037L976j0241j2443o172J2125J1778K2540K6944l6384
9223A5076k7006L594J6201J1156l12k031k356J9014J6108j2311k6167k780q451
9210b65O767J9353J2782l983j6170N944Q72o568L692J9400k9l353o573J0449O179
9195D8497L023j3006j805o648J47j0832j2080M461R391j3905q598K8236M322J665
9181C2868J8589O906k876L751j7459M357J9986J1129o045p35Q899J4817o958M885
9167I2114K8441J922K5704J7648J2000Q864J2498K5243L3628J8772L957N13P214
$$ y = [-18765, 2335, 8311, 5899, 28283, 57151, 66956, 34524, 2258, -3262, -2346, -7727, -6227, -16781, 2530, 15082, 18155, 22486, 2763, -25608, -23953, -27333, -14571, 3490, 20053, 11092, -2122, -15555, -18176, -28084, 2953, 6929, -3312, -15755, -21927, -9802, 1976, 24516, 51460, 15076, -11930, -8336, 7865, 19021, 18709, 16678, 14322, 33336, 49444, 37133, 10966, 8186, -265, 6502, 25855, 38637, 34654, 18484, 24428, 25300, 18732, 22424, 41824, 41795, 38442, 31869, 42318, 48497, 51520, 38514, 36709, 30061, 30208, 19376, 7296, 11757, 21148, 7243, -1355, 26881, 31203, 32868, 51457, 58363, 55487, 59238, 41779, 46136, 66122, 77251, 71206, 70471, 79370, 94187, 87229, 92114, 120555, 122477, 148181, 165829, 177829, 186693, 199191, 224434, 258062, 276834, 280791, 281304, 288518]
9154B88518L7554M4774K5242M2068Q1200R2541Q8008R4174J28956K01918K83562
9143A408515L87181N64538P87992J192835J670502K093850K020762Q60168q59544
9134A0126799j925463j996944j584257j148978p93267n72112m09553l22456k39938
9125A133831k04136j45131j04450p8915o2408o9049m0938k3494l5735m3261l6725
9114B89589q468k1637l1285j9193k6872l0314k0006q680J4368J0134k2633j5621
9102A09382l330n084n610J7931O942k7431j6271K2304J7729j7248j1869L223J723
9089I2391j1733j6215j3498p547l993o022N953r862L056r92r389N799K8033M196
9075F0177j7045k715kJ1687j1309j2731m828R94j4396J0168j485J997n975R533
$$ y = [288518, 326072, 370846, 396088, 438156, 519356, 611897, 699905, 794079, 923035, 1124953, 1408515, 1795696, 2360234, 3148226, 4341061, 6011563, 8105413, 10126175, 10986343, 10126799, 8201336, 6204392, 4620135, 3471157, 2677890, 2105778, 1696225, 1373769, 1133831, 929695, 784564, 680114, 601199, 538791, 469742, 428804, 405310, 369575, 326314, 289589, 281121, 259484, 228199, 209006, 182134, 151820, 131814, 123134, 137502, 147636, 125003, 109382, 106052, 100968, 95358, 113289, 120231, 92800, 76529, 98833, 116562, 99314, 87445, 90668, 92391, 80658, 64443, 50945, 43398, 39405, 33383, 39336, 29474, 32530, 31538, 22149, 27948, 55981, 60177, 43132, 40417, 40415, 52102, 40793, 28062, 23234, 24228, 9832, 20000, 18515, 20512, 14537, 24070]
9061B4070J8581K604j7212k0994o823R938K2792K985j1939k309N10k085J3844
9048C3962m550j3438k260J4735L2028N472J0810j1225j8929k1532j0546j1399
9036C128J0110L476R785l616j0051j2485R723J5546r260j7697K3006O981k5347
9023C299n217J7546l294r82J1472J0999R286j3767k1858k3821K885K279J0099
9010a074J0241J035L651K068k996N429J3595j0210M798K2293k4842q897J7167
8997C2258R798q905k3641o487J3241k0597j3564P091Q306K2440O265r293j9874
8984b962P749p66j3624Q456n628M752j5106J2033L4988Q0M319N804o256R594J1083
8969E4516k3023q407j0230k3844N053J8886J6348k0393L807l285j7973J346n451
$$ y = [24070, 42651, 45255, 28043, 7049, 226, 10164, 32956, 35941, 24002, 21693, 22203, 20118, 33962, 29412, 15974, 13714, 28449, 60477, 65949, 76759, 65534, 46605, 25073, 14527, 3128, 13238, 16714, 26499, 22883, 12832, 347, 10070, 25616, 16356, -1341, 21665, 28646, 3299, -1918, 15628, 12334, 11352, 22824, 33823, 43109, 29342, 7484, -16337, -13452, -11173, -1074, 9167, 10202, 13853, 15921, 12925, 18354, 31949, 21739, 26537, 48830, 23988, 15091, 32258, 42056, 33151, 9510, 3023, 16264, -4333, -17897, -10806, -2500, 19940, 26205, 16912, -2962, 4787, 4021, -9603, -1147, -6775, -2023, -17129, -5096, 29892, 29972, 34291, 40095, 33839, 43433, 54516, 31493, 23086, 12856, -10988, -5935, 12951, 29299, 8906, 12713, 9428, -8545, -7199, -12650]
8956a2650k2111n417P087K5386j3341r596j6819K8600J778Q395l657P128J6058
8943A0841K0683M413j3225K865n193K240Q13n067n846L921m685p870K0364J2755
8929C7009R04p052j1250k816J0609j3503j0856m374r181K4731Q470r884j8065
8916e258J624N583Q664J1548J0133J7671k9638J458M911j5548n614Q746L5709
8903D9989K6271n460k6864j7126r723p92O035o709Q059m2776M194L1576K0057
8890C6731p211j8884l983m553K1696r679O854J4082j5802K5266J2233j4310l889
8877C8551j483k693K977n536R89j195n696m07J219K4491m561o569l405n336j6496
8862A4850j4580J9816L640L199K75j6586q148q860n784J6143L805n710q989O669
$$ y = [-12650, -34761, -40178, -33091, -7705, -21046, -30642, -47461, -18861, -17083, -8688, -12345, -5217, 10841, 31524, 35937, 22712, 25577, 20384, 22624, 23437, 18370, 12524, 16445, 11760, 3890, 24254, 37009, 37913, 30861, 19611, 16795, 27404, 13901, 3045, -1329, -10510, 14221, 22691, 12807, -5258, -3634, 1949, 10613, 22161, 32294, 49965, 20327, 21785, 26696, 11148, 5534, 14280, 49989, 76260, 70800, 43936, 26810, 17087, 16295, 22330, 15621, 23680, -19096, -14902, 16674, 36731, 29520, 10636, 6653, 2100, 23796, 14117, 20971, 35053, 19251, 44517, 56750, 42440, 38551, 37068, 34375, 37352, 31816, 32805, 31610, 25914, 25507, 26726, 51217, 46656, 40087, 36682, 31346, 14850, 270, 20086, 23726, 26925, 27200, 10614, 2466, -6394, -12178, 3965, 7770, 2060, -6929, -260]
8848b60p47o636k2017o946L2388L6209O100k4438l5517q964J5677J677K0954k445
8834E035L131l385j3669J0085J1583q973o27J2931k2230j1612J0254Q022K3777
8821B4322l365L558N583r875M375O074J4277k0792j886Q35j2891n002J797J4062
8807B1072K206j105j1477l384r306q696j7990O30L1470m241L353J572J5241J6069
8793C5414j0856j9540J0487j289j4172Q073P664k489j309J1368L628M101M023
8780C5103j2472L188l372n917N396k375m878k46l442r259j0229j0117M915J0188
8766c517K879J3404k28j7344j8671Q342K4941J1069j1596K0604j885j1675r357
8753F966M984J9026O839j7991k3653J038j8582j568J644R991J5551j0769k1807
$$ y = [-260, -1007, -7643, -29660, -36606, -4218, 31991, 38091, 13653, -21864, -30828, -15151, -13474, 7480, 5035, 8166, 4781, -8888, 1197, 12780, 3807, 3180, 16111, -6119, -17731, -7477, 545, 24322, 20957, 24515, 30098, 20223, 24598, 30672, 44949, 24157, 22271, 23106, 10215, 5213, 7010, 21072, 23278, 22173, 10696, 7312, -1994, -10690, -28680, -28050, 3420, -821, 2532, 4104, 19345, 35414, 24558, 5018, 15505, 14216, 44, 8117, 15781, 13292, 11983, 23351, 26979, 31080, 35103, 22631, 25819, 22447, 16530, 21926, 19551, 14673, 14427, 10985, 1726, -8503, -18620, -13705, -3517, -638, 12766, 12538, -4806, -23477, -15135, 9806, 20875, 9279, 29883, 27998, 16323, 6966, 11950, 30976, 37815, 19824, -3829, -2791, -21373, -22941, -21297, -11306, 4245, -6524, -28331]
8740b8331J5327j259j4245p335J3094J0376J0727q89J3672K2744k2254j6757R389
8727D259j1190j1457L085J8877K2176J3938j3818j1063m775L41J0159K9659J3792
8714F3983J531K888J0370j9496k8353j099p734j0666j9484N536J8487K0020j1197
8701B4786o289m262j5805m330o287l594M257K091J858j1756K1012o766l0417N867
8687b9635L866J7024P548n412k399J7248K259j6376O005J1364L47J596L997O629
8673B4061K942j2882m407k5940M982J3148K3058j003r687p012p465q029J257j675
8659h652J2622o801R106J1993K1982n55k9931j8534J0938O571m546j889K732Q876
8645A3912L446N960Q474L444R111M876j588m903j1793q368p276K506O035j17o897
$$ y = [-28331, -13004, -14263, -28508, -35843, -22749, -12373, -1646, -2535, 11137, 33881, 11627, -5130, 4259, -6931, -18388, -15303, 3574, 25750, 39688, 25870, 14807, 10032, 10373, 20532, 50191, 63983, 65514, 68402, 78772, 59276, 30923, 29824, 22090, 11424, -8060, -2524, 15963, 35983, 24786, 18497, 14235, -1570, -5900, -12187, -15781, -11524, -9433, -7575, -19331, 1681, -5085, -35502, -29635, -25769, -8745, -1197, -6609, -9008, 8240, 10499, -5877, 128, 11492, 11839, 13435, 17432, 24061, 27003, 14121, 9714, -16226, -11244, 1904, 24962, 23959, 14272, 7260, -205, -8234, -6977, -8652, 3970, -2831, 6275, 18268, 40250, 39695, 9764, -8770, 2168, 8739, 4193, 2304, 5036, 13912, 17358, 23318, 31792, 35236, 44347, 49223, 47635, 42732, 30939, 22571, 15295, 17801, 23836, 23719, 16822]
8630A6822l433J6571P553j123J351j7159P326j3456L088K5775j1667k9559j6039
8617a3950J3661J1831j53o669r543j0471J418Q545M322P382j2284N183J6437K2376
8603C8085J6953L932l667j751j4548J901o122m8202n026J3275J3427J1466N768
8590B5491q515O56R782K4369R891j0856o822O614n086q048k7201r605J011j70
8576A511o433L430O64Q120J0925J911l064l239l741Q324J4498k540q392o848L683
8561A8809j210j6659J147N250L95j6038j7119j1486J9259J1981Q505J1768O992
8548B1594r889j6526j444K5924m964k2259j9419O371J4958m268O77J531M850K7222
8534B4358J645j2499Q496j07k6630q965M729K509J552R144J0095n274j4393j7450
$$ y = [16822, 13389, 29960, 37513, 36390, 37741, 20582, 27908, 14452, 17540, 43315, 31648, 2089, -13950, -289, 11542, 11389, 4720, -4823, -15294, -13876, -5331, -1009, 6373, -5911, -728, 15709, 38085, 55038, 58970, 55303, 53552, 39004, 40905, 34783, -13419, -18445, -5170, 8257, 19723, 25491, 16976, 17632, 27414, 51783, 61674, 50818, 43996, 50610, 45524, 37476, 10275, 670, 1681, 1511, -4922, -1492, -828, 7292, 18217, 20128, 17064, 13825, 10084, 18408, 32906, 30366, 21974, 15126, 18809, 17599, 940, 2087, 7337, 7732, -8306, -25425, -36911, -17652, -5671, 2834, 14602, 21594, 11705, -4821, -6265, 19659, 14695, -7564, -26983, -20612, -5654, -9922, -9245, -7714, -2864, 24358, 26003, 13504, 22000, 21893, -4737, -13702, -8973, -6464, -4912, 4232, 14327, 9053, -5340, -22790]
8520b2790J7081l67P996j4778q522J9371K4421k220k3565r350J9390P351J720
8507A5738j8912j6184K5974J8423j1227k3593l437J6299j5609k1786L1750L2559
8495B9995J3251j2662o148m986o406l932k977J2192J4080j1708k9379j1586J3717
8482f549J7815j1531K940J1853R39N203q316k7797L0J2281J7455J4251o265k3422
8468a113j0852n231Q60m292J9100J056j986m702P233j0784j6092O523K0187K5940
8454B5847j0461j608J7853k3073k3572L4K605J4005K5703j6733l3246q721K9403
8441a964K460j315J1030l631K411k9205k2612J5288R644Q908P279n175M162k627
8427e347r12j1789j5725Q785J3905m674j118p00k219J7754j548q650k52m496k062
$$ y = [-22790, -5709, -6076, 1920, -12858, -21380, -2009, 22412, 20192, -3373, -12723, 6667, 14018, 15738, -3174, -19358, 6616, 25039, 13812, -9781, -13218, 3081, -12528, -34314, -2564, 29995, 43246, 30584, 24436, 19450, 13044, 9112, 6135, 18327, 32407, 20699, -8680, -20266, -6549, 11266, -265, 2675, 14528, 15467, 20670, 12354, -15443, -15413, -3132, 14323, 28574, 22309, -1113, -11965, -17196, -16336, -20628, -1528, -472, -2458, -7160, 73, -10711, -26803, -20280, -93, 25847, 15386, 13778, 31631, 8558, -15014, -14980, -12375, 1630, 27333, 10600, -22646, -31367, -1964, 496, -819, 10211, 6580, 8991, -20214, -42826, -27538, -17894, -8986, -1707, -6882, -2720, -5347, -6259, -18048, -33773, -24988, -11083, -15757, -16875, -17575, -19794, -2040, -3588, -12238, -12490, -16986, -19048]
8412a9048R729K864j0908J8198R815j2577j3992m219p791J2596o278L265j0533
8399b8879K3851K2165l062k1411K413J0391Q849J0386M608j2264q530O034M48
8386A4999k386m166m207R200J4051J6567n264r848o775r704J3229J2686J228j2849
8372B6761M211j1837j9269j2359j1127j4885J014J0356K049N536j1209Q732M247
8359a7780J2876M886L035j6096O520K9895k191l717j600N90m33k1322m349J5210
8345E524J099k1212K0431R561K875K4822p968j9367j6565j3009J1373N714q584
8332e306j7930M324R893j0149J1164K509k0062n529j235q856J2384L5161K0650
8319B7018k2723j5117N905L558N044J2743M45k0970q454K2541M174j9265j0534
$$ y = [-19048, -9319, -6455, -17363, 835, 10650, -1927, -15919, -20138, -27929, -15333, -21611, -18346, -28879, -5028, 17137, 14075, -7336, -4923, 5468, 14317, 24703, 29311, 17047, 8517, 14551, 14999, 12613, 8447, 4240, 13440, 27491, 44058, 38794, 28946, 22171, 12467, 25696, 38382, 39610, 26761, 30972, 19135, -134, -12493, -23620, -38505, -37491, -27135, -25086, -19550, -30759, -22027, -17780, -4904, -18, 3017, -13079, -6559, 23336, 21145, 17428, 15828, 16418, 15985, -5337, -9686, 5524, 6623, -14589, 5842, 15403, 18278, 43100, 35132, 15765, -800, -13809, -2436, 3278, -5306, -23236, -18912, -9019, -19168, -8004, -5495, -25557, -31086, -32321, -41177, -28793, 6368, 27018, 4295, -10822, -4917, -1359, 3685, 16428, 16873, -4097, -12551, 9990, 14164, -5101, -15635]
8306a5635k443R565J0833n386r668P232J3151q15n106k427M347R756J3284K415
8292B9103j3480j0015p135j5865M598N611k97k8283n981L2312K2233j343l1429
8279a9971p235p996O711J60j6844q427Q686J5879L7815J2410p893k9247k3136
8266c9088o033K9712J8350j0200K496J0071k244l20J681J1938q181j6816j3015
8253b1649l728J4324K72l257N024k570L165K3787K7068J231o315j8140j1316N609
8239A3505O011j848R81o959q088J4932j4469p518j92j4240R14J2095j1482K3808
8225G450J4891p172l977n301J120m565j594l2676j4525L5713P354k1489k7301
8212e2072J4309K1580J3409O532J4775n726j1360l542J729K4289J8484k1782l8358
$$ y = [-15635, -18078, -8513, 2320, -3066, -12734, -5502, 7649, 6834, 1728, -699, 3648, 13404, 26688, 29103, 15623, 5608, -1527, -17392, -12794, -7183, -7480, -35763, -41744, -9432, 12801, 11458, -19971, -27206, -35202, -28491, -28331, -45175, -53602, -44916, -29037, 8778, 21188, 13295, -15952, -39088, -45121, -15409, 2941, -7259, -4763, 5308, 3064, 2744, 4425, 16363, 8182, -8634, -21649, -25377, -11053, -10781, -14038, -9014, -11584, -8419, 15368, 42436, 43667, 37352, 19212, 7896, 13505, 19516, 17668, 18649, 11690, 3602, 18534, 4065, -3453, -3645, -17885, -16971, -4876, -16358, 7450, 22341, 15169, 11192, 5891, 7011, 2446, 852, -31824, -46349, -10636, -3282, -24771, -52072, -37763, -16183, -2774, 3758, 18533, 12807, 1447, -2095, -366, 23923, 42407, 20625, -17733]
8199a7733l497K1859N343j6146o217r814L766l428L479j921L805J7769J826J98
8185g11r755n039j4204j2975o462K1894K1445K0255j2912j5767J7921j3540M761
8172e089r50j8040J1817K2935k842L565P098j4174N858J1715j1052J5805J5602
8159D2248O837l114n4286q738J4741j3492j8707j520J2296K7653L537q309J1611
8146A0757J6764N339j3732k1942J3535R757J3763j4751o082p698J6754m721j9064
8133a321m492m952n608M393N720O822J4679J9316l538o175j0799l3621O252N852
8119g472J0508o635J2849J3164J692j0921l862l427j5960k0896J795K0188O551
8106b426n838J4758L750m274p730J6383k9971k5464O547K2674J8249q744j8024
$$ y = [-17733, -21230, 629, 5972, -10174, -16391, -26205, -22439, -25867, -22388, -24309, -20504, -2735, -909, -711, -10466, -15505, -29709, -42684, -49146, -27252, -5807, 14448, 1536, -14231, 3690, -9850, -5089, -6039, -24079, -12262, 10673, 7831, 11396, 18494, 4320, 10178, 21893, 10841, 26646, 42248, 49085, 45971, -8315, -17053, -2312, -15804, -34511, -36031, -23735, 3918, 7455, -854, 10757, 27521, 32860, 19128, -2814, 10721, 20478, 34241, 19490, 13408, 5710, 22464, 17743, -1321, -5813, -10765, -16373, -11980, -6260, 562, 15241, 34557, 31019, 24844, 14045, -19576, -13324, -7472, 3036, -3599, 9250, 22414, 24106, 13185, 9323, 5896, -10064, -30960, -29165, -8977, -2426, -8264, 6494, 10244, 5970, -1760, 14623, -15348, -40812, -34265, -11591, 6658, -2086, -20110]
8093b0110L436J742m147m799Q695N065R528K4736q93j2971n116r306j3044J3101
8079d083r05O795o832j8498l591J3022J9166L596k1757N716J5652j626n58r171
8065c074n564J4510J4497K837j7019j407J5419N609k5510k7473L7213J6192j2
8052B6218O305j1517j2141j5729K1107M912j3737n823J7963J0908j6621m305O071
8039A3611n574j1016j6943J6103L3341J058j2618k2646J0699J9334J2383j3583
8027B4149j9534l0727J0831L4957j1303R790k737j373j1006j937K344n977j822
8014d345J0j1010k840K6489L1388r703j4857o324J458N75J130m562j810Q784J3373
7999B7756Q614R471j7496j1640r070N060j715p475J299J2026N375k4221J4912
$$ y = [-20110, -16674, -14932, -19079, -23878, -15183, -10118, -590, 24146, 23253, 10282, 5166, -4140, -17184, -4083, -4988, 1807, -5025, -23523, -27114, -14092, 5074, 8670, -13087, -7371, 8281, 6655, 6097, -3074, -8638, 5872, 20369, 23206, 6187, 4780, 20199, 25808, 298, -27175, 10038, 26230, 26218, 32523, 21006, 8865, -6864, 14243, 19155, 5418, -405, 17558, 28466, 11845, 7540, 13611, 8037, -2979, -19922, -3819, 29522, 30580, 17962, -4684, 6015, 25349, 37732, 24149, 4615, -26112, -15281, 19676, 8373, 18163, 15426, 14053, 3047, 1110, 3454, -2523, -4345, -4335, -15345, -18185, 8304, 39692, 29989, 15132, 8808, 10266, 10841, 11971, 7409, 5599, 14383, 27756, 36370, 45841, 28345, 16705, 7635, 12695, 10980, 3505, 4804, 16830, 22205, -2016, 12896]
7986A2896K3902R318k1519j9726j7808j9456J2996k026l557O179m202j5530J0753
7973b7780R198J0736j2607K803N477j8744k950J8403q838l491K9075J9759l1497
7960a0456j5867j1749k816L2280J3555j3165J2118J88J5788K4176k1856k8557
7948f361J923K0341J8778l239j1161J2617K3923j0522r564J91j6514j6788j2306
7935h682j6880j6303J735J7124R865j7758K0172J0411j4501P740J7453L0931J0244
7922E1551k2071k2123L891N886j2017q396J7985n268n596l666K499j8495j5207
7909c1027O682M039P749J4682O961J7132P391k3688J3143J3158k0277n902j3660
7896c617j1575J385J2714L403p541K2638N373j9317j2800K1824M051j7076k7311
$$ y = [12896, 36798, 46116, 24597, 4871, -12937, -32393, -19397, -21423, -24980, -18801, -23003, -38533, -27780, -18582, -7846, -20453, -17650, -12173, -30917, -33867, -15464, -24302, -27793, 1282, 21041, -10456, -26323, -38072, -40888, -8608, 4947, -8218, 3900, 4088, 19876, 44052, 22196, -6361, -4438, 15903, 34681, 31442, 20281, 32898, 56821, 46299, 36735, 36926, 20412, 3624, -8682, -25562, -41865, -40130, -23006, -13141, -30899, -10727, -316, -14817, -7077, 10376, 41307, 51551, 29480, 7357, 11248, 17134, 5117, -3279, 14706, 9438, 3842, 176, 2675, -15820, -31027, -24345, -20306, -12557, 2125, 9086, 26218, 33609, 9921, 23064, 36222, 15945, 10043, -3617, -15192, -13807, -1093, 2310, -5231, 17407, 22780, 3463, -9337, 12487, 16538, -538, -27849]
7883b7849K252J2741j5016l703J4190J0157J1766j8645o723J6897P130M414j462
7870F149L081o616k1443j012O635K569j0169n293O347n866m442K2866J3177J61
7856F144k705n999O22R285j076j0037n98j736J1743J368J6839k377R143j1936
7842A8680j0305j1006L454Q816m464j9589j46K9412O345k810j498m043J793J2840
7828B7479j136m639J0283j4406j7038j5663L232J9390O459j2409k4101P213J1711
7815c625O919L261J1695M930j2349K505L425j0882N484K276j2517L465j7603o158
7801a9174K452K0094Q692j4754P229M798j1579p578r370j2812K6543O769J5245
7788A6555j4910R101J7366r164r248k2225l86J5903q655j5176j9656Q863K5672
$$ y = [-27849, -25597, -12856, -27872, -31575, -17385, -7228, 4538, -14107, -20830, -3933, 3197, 7611, 6149, 9230, 2614, -18829, -19841, -13206, -10637, -20806, -26099, -19752, -25618, -30060, -7194, 5983, 6144, 3439, -2560, -1938, 7347, 6271, -3766, -4364, -6100, 5643, 7011, 23850, 21473, 30616, 18680, 8375, -2631, 823, 9639, 5175, -14414, -14560, 14852, 21197, 18387, 16889, 12846, 14639, 27479, 26343, 21704, 31987, 17581, 543, -15120, -11888, 7502, 13961, 1552, -22549, -15336, -3625, 3294, 6555, 18250, 23180, 10831, 13336, 16761, 5879, 11363, 13639, 1122, 4587, -13016, -19174, -16722, 3372, 12064, -2690, 4539, 9337, -2242, -9820, -19190, -32002, -5459, 1310, 16555, 1645, 10746, 28112, 18948, 9700, -12525, -12911, 2992, -5663, -20839, -40495, -31632, -5960]
7775e960J5422K314j4950q222K2093R156O101n524K578k7718q266J7459K6905
7762C1388j2772k7254j4603p518J7221J3589R724M091o005j6193j4201k224O06
7749b4151J1228M738j4960K74K076J9981P350l523q005j5619J5070J3636q806
7736g11p065N419q7L379k3681R216O529o617j0907k7260j6835k624L6589R890
7722b4765n63n706N351J8293K6174q821K374j4677Q865J5267J1954O663Q792q852
7708D0349j2643k603q321k8887j6534J683M750P504k743m755K860o87L391k824
7694a9460k777Q53L778j687j8219o818j0259R567J7648m580K3144K3971J3274
7681B8435r791l0150r472N718j7810Q115K226j757Q303R958J1139r806r324n744
$$ y = [-5960, 9462, 11776, -3174, -11396, 10697, 19853, 25954, 20430, 23008, -4710, -12976, 4483, 31388, 18616, -8638, -23241, -30759, -13538, 51, 9775, 13866, 7861, -8332, -22533, -24757, -24151, -12923, -8185, -23145, -22871, -20795, -814, 6536, 3013, -4992, -20611, -5541, 8095, -711, -7776, -2357, -2444, 935, -22746, -13530, -7001, -13618, -24525, -51785, -68620, -71244, -34655, -24765, -25328, -31034, -25683, -7390, 18784, 9963, 12337, -2340, 6525, 21792, 33746, 40409, 49201, 40349, 27706, 25103, 16782, -12105, -28639, -26956, -22206, -14702, -17445, -22200, -19340, -20027, -16636, -19460, -22237, -21384, -17606, -19293, -37512, -44330, -54589, -45022, -27374, -31954, -8810, 15161, 28435, 18644, -11506, -20978, -15260, -33070, -24955, -22729, -24486, -16183, -6225, 4914, -4892, -14216, -19960]
7667a9960n166l720k3952j531K4036K8228J0581q693j7427k038J4467J3718l714
7654D829j3552P515K5757j6727j7867p099k0339K0538l375J4099K4942J0372J8402
7641D7495K480j3204k8716k7018M863M818J0985J9796k2481O44l959k5370p427
7628c7094L5562K409R213l256j3421q154L462q026J6685L1730O801n537r119N888
7614B7143k7495q688j1118j2512l101J2429J6965O240J22j7431k166J5455N523
7601A366l0022l8623K6554L0933k686R62l5215n427J2523J9451K2784M053J9271
7588B5924J6409j829j4337j8640j840L722P740J2134K2238k97k3372q967l6529
7575a7644l100r812L385K3307J4115M419J6434j5572l4245r615J191J977K6306
$$ y = [-19960, -25126, -28846, -52798, -54329, -30293, -2065, 8516, -177, -17604, -19642, -5175, 8543, 4829, -8723, -1208, 24549, 7822, -10045, -17144, -37483, -16945, -20320, -6221, 18721, 29093, 47495, 49975, 36771, 8055, -18963, -14100, -9282, 1703, 21499, -982, -338, -4297, -29667, -37094, -1532, 877, 10090, 6834, -6587, -14741, -11279, -19305, -2620, 29110, 35911, 30374, 21255, 27143, -352, -9040, -20158, -32670, -35771, -23342, -6377, -137, -15, -17446, -19612, -4157, 1366, -28656, -67279, -40725, -9792, -12478, -11516, -46731, -52158, -39635, -20184, 2600, 6653, 25924, 42333, 40504, 26167, 7527, 5687, 9409, 17149, 29283, 51521, 51224, 27852, 18885, -17644, -20744, -30556, -27171, -3864, 10251, 14670, 31104, 15532, -18713, -28328, -27137, -25160, 1146]
7562A146J1593j4252O498P074k3995p228O997j1379N757J3397K1235j5028l8059
7549c6244l972J9526J3964L735R115n032k4231k5179J4067J7752P923K0131j8098
7536f543j8323J0807O15j8918Q958R839L704P749J595m124M650r804k9024l170
7522d1989J7753L637O983m941j764L236M806l535P077J3603M175j135J4898k2857
7508e3k6061P270r466P708K465q04j7656R461J6171J2944J693k0285n73r940O169
7493b0957Q483Q807R478N302l206k1234O538J7524l941L920K944n731m883L966
7479G010l389j7056o394P212j777j0999J80P086j1167N135Q46K1527J6679N249
7465B0142r997m838J4588J383q158m519k0854K348R948J13M840j1723N141k095
$$ y = [1146, 12739, -1513, 4985, 12059, -11936, -19164, -12167, -23546, -17789, -4392, 16843, 1815, -36244, -40216, -20690, -6726, -2991, 6124, 1092, -23139, -48318, -34251, -16499, -8576, 11555, -6543, -24866, -14059, -13444, -32362, -23404, -13565, -9861, -2112, -517, -4641, 9, -9795, -38819, -41989, -24236, -20599, -13616, -18557, -20321, -17085, -12279, -15814, -8737, 4866, 9041, 7906, 22804, -53, -26114, -18844, -28310, -20602, -18137, -18941, -36597, -27136, -10965, 1979, 3672, -16613, -17186, -27126, -20957, -12474, -3667, 5811, 11113, 7907, -13327, -6789, 10735, 6794, 10714, 13658, 7927, 3044, 7010, 3621, -13435, -19829, -12617, -14394, -25393, -25213, -18127, -29294, -24159, -23313, -1786, 14893, 20142, 10145, 5307, 19895, 21278, 13120, 8601, -12253, -9905, 43, 156, 4996, -6727, -1586, -3681]
7451c681J468L239K32j2215o061K9611M961k0115l569p094P914M631K0161J5040
7437C4522m074L889j7276m42l8947M440J311n997K1039J5666J0892k1648P130
7424A0505Q555J1791O650R255r678j5650P647k803l1017p857J8556r591J2353
7411H716P510l1382j3045J7840J1723Q52Q256P836q45M211m329k142j3051k3958
7397b1808p593l925j1780K7416K8248J3416j6792m383n401L243J2071J2506J1374
7384C6592l6880j2788J6042j8081j0773J7883K4853J170k0966o487j886L635j6295
7371b3981j5045J6634K0867L24m110J2532j866k6995k1619J6189J8710N424M151
7358A215j4530q014K1672K2902K5052q788j3703K303k0615k4257j9592J5183L6741
$$ y = [-3681, -2213, 1026, 1258, -10957, -17018, 12593, 17554, -2561, -6130, -13224, -5310, -679, 19482, 34522, 30448, 34337, 17061, 16619, -22328, -17888, -16577, -22574, -1535, 14131, 25023, 3375, 10505, 19060, 30851, 37501, 46756, 37078, 21428, 29075, 26272, -4745, -12602, 5954, -3637, 8716, 16226, -15156, -28201, -10361, 1362, 2214, 10470, 18306, 17461, 21672, 17343, 15201, 2150, -21808, -29401, -33326, -45106, -17690, 10558, 23974, 7182, 2799, -2602, 641, 12712, 25218, 36592, -288, -13076, 2966, -15115, -25888, -8005, 16848, 18018, -2948, -9435, -11321, -7686, -23981, -39026, -22392, -1525, -1201, -5311, 7221, 5355, -21640, -43259, -27070, -8360, -2936, 1215, -13315, -21329, 343, 23245, 48297, 39509, 25806, 28109, 7494, -16763, -36355, -21172, 15569]
7345A5569M205l354j747j4741j3443m737j072J1652J2301n810K569j6820k4302
7332c9730j2381R572M232Q77q036n655J5473K0627K1331l345J825j900q817J2092
7318F165K382o410j2102k508J8139L811J428M627o509q962J7465j6288r292J1641
7304C587k2000J3245k431j2325J102N147J4340J3166n914Q94K840j0818j8357
7291a7524M879J521l366J237k0886K912J0429j482N147J0475J1653q986j8915
7278b2906J0133j1930o825P324k6635J0731J4581j1986K1978J3526Q558j7163
7266a0614q810O897j0147r543k5066R204O551L3126P159k755J506K0802o573j6980
7252e243L649R595j0971J1094O796k0404k5716r139l824M337p947O512J3344P291
$$ y = [15569, 19774, 16420, 14673, -68, -13511, -18248, -19320, -7668, 4633, -1177, 1392, -15428, -39730, -52111, -42539, -38307, -37430, -45466, -51121, -35648, -15021, 6310, 2965, 4790, 2890, -5927, 6165, 8547, 2137, -9965, -12473, 5666, 9477, 10905, 15532, 9023, 61, 17526, 1238, -8054, 3587, -18413, -5168, -7599, -19924, -18822, -13675, 665, 13831, 7917, 8811, 11651, 833, -17524, -12645, -11124, -14490, -13253, -34139, -31227, -20798, -22280, -17133, -6658, 4995, -3991, -22906, -12773, -24703, -31528, -24204, -50839, -40108, -25527, -37513, -15535, -2009, 6549, -10614, -19424, -12527, -22674, -32217, -57283, -48079, -41528, -8402, -1243, -3998, -2492, 18310, 11737, -5243, -1594, 8001, -2970, 8124, 14920, -5484, -31200, -40339, -44163, -39826, -47773, -41261, -27917, -20626]
7238b0626K4896Q61k5646k171K2414l814j9362m192j1700K216J1843J4664L657
7225f960N70Q13m962l372P631J0459L978k792q843l948k4384L768J0004j1405
7211b9443j6495N007K7653J9252O506j0314j5398j954J2924m717j0235j9080n917
7198d2211K4610J5152j0855j9580L516j5584M194K9295R554q370p567J0914Q83
7185f049j9673L359K4551P830l4237p146J5905J158N498j2271L903J7625l855
7172c402k0952j7391l652K555p818P409Q830P880P088j099O975R024P198J1465
7158A4110j7137j9856j1382K597J34K4465J1631o924k2147k8360J4504K9068J8535
7145I238P494k322m773j4166j5322J250J1427k853j3457J6629O365n342O021J127
$$ y = [-20626, 4270, 5131, -20515, -22686, -272, -4086, -23448, -27640, -39340, -37124, -25281, -10617, -6960, -6390, -5577, -10539, -13911, -6280, 4179, 8157, 5365, -3478, -7426, -31810, -28042, -18038, -29443, -45938, -40931, -13278, 5974, 12480, 2166, -13232, -15186, -2262, -6979, -17214, -36294, -42211, -17601, -2449, -13304, -32884, -29368, -44952, -40758, -11463, -1909, -10279, -17846, -6932, -6049, -25722, -22363, 2188, 10018, -24219, -31365, -15460, -14302, -8804, -21075, -17172, 453, -3402, -24354, -41745, -45397, -42842, -50660, -43251, -34421, -26541, -19453, -20552, -13577, -4553, 2645, 14110, -3027, -22883, -34265, -31668, -31534, -7069, 4562, -2362, -24509, -52869, -38365, -9297, 9238, 16732, 14410, 9637, -4529, -19851, -18601, -7174, -10027, -23484, -6855, -490, -5832, 189, 1316]
7131A316l19j0536j3014j0247M957K2239q061j2599k406j1623N791K2771K2203
7118A0472j7526J076J783Q620r768J833n970O832J5198J3893m326j3742j5496
7105g121O162J5042j1421j3534J470J7434j0647k2137j3911J1705K426J9062J9808
7092A4338R998R292l1928j8175K9474J1972k0967j8608L572J1184o667O430L950
7079C865J9296K328o014j3191j0528j8148l485J7767K3299O468l283j9970k7710
7066b9306p300J0244P304J0233K0614j168J3391k73K0210J725k1094j5900R681
7053A8361q696k6412m785O952J7342m356k6279j3490N944K5178r582l21J2325
7040g819O901O705O246K929r643r259J2804L993O262k565O61j2445J3614K3212
$$ y = [1316, 997, -9539, -22553, -32800, -27843, -5604, -13665, -26264, -28670, -40293, -34502, -11731, 10472, -7054, -5978, -4195, 4425, -5343, -3510, -9480, -2648, 12550, 26443, 22117, 8375, -7121, -959, 14083, 2662, -10872, -9402, 8032, -2615, -24752, -38663, -26958, -24532, -5470, 14338, 24336, 33628, 1700, -16475, 12999, 24971, 4004, -14604, -11032, 152, -6515, -85, 3865, 23161, 25489, 19475, 6284, -4244, -22392, -25877, -8110, 15189, 21657, 18374, -1596, -29306, -36606, -26362, -19058, -8825, 11789, 10621, 24012, 23739, 43949, 45674, 24580, 8680, 18361, 9665, -16747, -21532, -14580, 2762, -1594, -27873, -41363, -35419, -10241, -19823, -20144, -7819, -918, 5787, 12033, 14962, 5319, -3940, 8864, 12857, 19119, 16554, 17215, 4770, 18384, 41596]
7026D1596j9554j3587l885K259j0768j096j1524q373j1376K1929p586K12J7201
7013d552l08m900m290J752l695l669K491q420Q498r866j2660K3037J9298Q579
6999A1295K9674J227r167l004k264P388j4211j149k077P306k3723M672J0274J6313
6985C2554r503j3561j8857j578m401P962Q985j0555P921J00M489N131o003j0484
6971g800K2624j5557l036J9830M160J3279J8127R012l054l9289l0286J1605J6211
6958A5826N962j7271l178P298K8042j0845j5962j2471J1639K4757Q535k4999l3769
6945a6436k2338m424N24P762j0820J9011K2117J1616J3128j2560q365o804K996
6932d593J1836l365r965m923n879L713j7304P967J4624n58J2824j512k7153j3729
$$ y = [41596, 22042, 8455, 4570, 6829, -3939, -5035, -16559, -24932, -36308, -14379, -21965, -21753, -4552, -4860, -9760, -14050, -12298, -15993, -19662, -17171, -25591, -17093, -26959, -39619, -16582, 2716, 11295, 40969, 42196, 33029, 30025, 27761, 35149, 20938, 19789, 17712, 25018, 1295, 5967, 16241, 32554, 23051, 9490, -9367, -10945, -15346, -7384, 1601, -8954, -1033, -933, 3556, 8687, 2684, -7800, 14824, -733, -3769, 16061, 20221, 33500, 51627, 60639, 57585, 18296, -11990, -385, 15826, 21788, 4517, 1339, 8637, 36679, 25834, 9872, -2599, 9040, 33797, 42332, 17333, -16436, -38774, -43198, -42674, -34912, -45732, -26721, -4604, 7012, 20140, 7580, -785, -7589, -4593, 7243, 3878, -6087, -11010, -16889, -13176, -30480, -22513, -7889, -8447, 4377, 2865, -24288, -38017]
6918c8017j531J2178K7415R99l150M607j1864k0354j961Q149J4083J5832j6578
6905a0192k0868O161N259J6957K4209j5049j4571j6331P628J8626P848j7912p197
6892a5432L28O928J2836O331L781m364J6499J385p329j6178j6981l407j3686p66
6878c0055P884l798J6926J1344k3391m395J5586J0041P202J873m566M120R985
6865A8756r822k2322L004J1612O993j0422n726J4279j3815j4467R473k110m924
6852a9491J4818J8394l377N932j323K10j8910j2334J5966K5126j1464j0117K410
6839E840L58R716N624j4823j0359k3737k124N36J6707J5196p321j0455m796J2534
6825g104P817J5304R257J3396P85k2124j8723l663j224R827O230j0025P908o395
$$ y = [-38017, -39548, -27370, 45, 1044, -2106, 2501, -9363, -29717, -31678, -23529, -9446, 6386, -10192, -31060, -24899, -19640, -2683, 21526, 6477, -8094, -24425, -16797, 1829, 9677, -8235, -15432, -15104, -8176, 4660, 10991, 14772, 10408, 26907, 28292, 20963, 4785, -12196, -15603, -29289, -30055, -22171, -25969, -9043, 2301, -21090, -25485, -9899, 142, 7344, 9217, 4651, 8771, 18756, 8934, -13388, -10384, 1228, 8221, -2201, -7927, 6352, -7463, -21930, -12457, -14567, -19491, -4673, 13721, 10344, 16276, 14953, 15163, -3747, -16081, -115, 25011, 13547, 3430, 5840, 6198, 15914, 21538, 6715, -3644, -27381, -29505, -28969, -12262, 2934, -4387, -14842, -19638, -7104, 713, 16017, 25274, 38670, 39455, 17331, -1392, -5055, -6279, 3548, 9778, -247, 7661, 1266]
6811A266j6859J6699J5415K1930o322l097l1911p515L848J680J2166J0442j979
6798A5763l1980k5929m663M238L1413R032M70p33j5633k5192r955l613J251K609
6784e2922j5056N595J1903K0347l694o052J0812Q717j5665K9105J3063k1622M468
6771a1001m732j5705n708J742J2638K0416P093o946j8640J7597Q126j3480L94
6758h206j500j7040j7641j91K8409J1753J520p599l936J6943k859Q281L381j3751
6744b436p392j1190N243J5433J7632p575l372j5339K32l376J0723R360j6981j2047
6730b1085L079j1015M742P348j1449o974K8807K7422l736n510j373J6008J6340
6717D2604n124J1619M282K5870J6152L874j884k9991k6472j7273l088Q521r671
$$ y = [1266, -15593, 1106, 16521, 38451, 32129, 29032, -2879, -10394, -6546, -4866, 7300, 17742, 15763, -16217, -42146, -46809, -42571, -11158, -2126, -1656, -2389, -18022, -43214, -53169, -56782, -55531, -52922, -67978, -62383, -50480, -30133, -33827, -39879, -29067, -20350, -36015, -6910, 6153, -15469, -11001, -15733, -31438, -37146, -35404, -22766, -2350, 4743, -2203, -20843, -3246, 4880, -8600, -8206, -9706, -26746, -44387, -44578, -16169, -4416, -2896, -10495, -14431, 2512, -347, 7934, 11315, -2436, -9828, -21018, -15775, -342, 17290, 9715, 6343, -8996, -8764, -12140, -1417, 7943, -9038, -21085, -18006, -29021, -24279, -16931, -28380, -35354, -6547, 20875, 17139, 11629, 10256, 26264, 42604, 37480, 49099, 53381, 79251, 95403, 99277, 97393, 67402, 40930, 23657, 20569, 29090, 19419]
6704A9419j3069j8583L992j837N743Q644Q369k629m856O601j8766L11m26j5409
6690b2496k348Q726P202j3189l548R242K259j8070l722J1696J2049K3455L1420
6677D2676o402j6428j6210o803J662M563j5352j1357R886J8032q789O73L995j3956
6663a3810r613p636j9424o775R428J4339J5350j775J2633J3635j8892j6662k697
6650c1899Q414J1505J5145l378J2788m43k4306J4767J7347l0036j0648q631j121
6637c0496K1406K3303O042p512n560q747o34l66p458J5996J6888p989p175J1263
6623A8961j2652k0648j0109q986l53K4740J665l541J069J4230J9904n096r522
6610I662q151L034N850p887k113J744R330J9287j6931m555J2784J3924M24r821
$$ y = [19419, 6350, -12233, -8241, -10078, -4335, 4309, 12678, 10049, 5193, 11794, -6972, -6661, -7087, -22496, -24844, -16118, -8916, -22105, -25653, -16411, -14152, -32222, -35944, -24248, -12199, 11256, 42676, 36274, 19846, 3636, -3167, -1505, 3058, -12294, -23651, -13765, 4267, -4522, -3849, 146, -13810, -23423, -31059, -50483, -57258, -47830, -33491, -18141, -19916, -7283, 6352, -12540, -29202, -31899, -23485, -11980, 3165, -213, 12575, 12132, -12174, 2593, 19940, -10096, -20744, -29375, -30496, -9090, 14213, 20255, 12743, 7183, -1564, -2198, -2564, -10022, 5974, 22862, 14873, 7698, 18961, 6309, -14339, -24448, -33434, -33787, -9047, -7382, -10923, -9854, 4376, 24280, 19184, 9662, 1511, 4545, 10395, 2508, 395, 2139, 11469, 30756, 13825, 9270, 22054, 35978, 36402, 26581]
6596B6581k5973p530r525J871J0404J2454M649p49O581r700j046M712L944O731
6582B3404J7820J5170j9813l1320j0723n49m421j6142o012J9192Q240j5156L20
6569a9990J9007R199j0052q693m691Q866K326j808J0571J0170o050r067R217R713
6555A8718K571r339k7957M856K8032P097j7137J304J241k2236K611j9832q733
6542c8804J4958j0775k368k818Q220K2591j3562j3895J2100L1336M91n801p76
6529H97N873k271O784K576j7882L994Q925k907r372O829q813L1259J6880j8105
6515B4667r976q660J1120J754k4462K668Q356l997j4213r065q874Q903J4388k9124
6501c6515O698J0842J4433m841J658N725J1100P296P650o427n997P329p208p293
$$ y = [26581, 608, -6922, -16447, -14576, -4172, 8282, 12931, 12182, 18763, 9063, 8017, 12729, 16673, 23404, 41224, 56394, 36581, 5261, -5462, -6011, -10432, -26574, -32586, -13394, -5154, -20310, -19990, -983, 8216, -1836, -10529, -15220, -6354, -4028, -5836, 4735, 14905, 8855, -212, 9005, 18718, 21289, 11950, -16007, -11151, 16881, 23978, 6841, 8145, 9386, -12850, -10239, -30071, -38804, -23846, -34621, -36989, -39807, -31587, -8996, -22558, -36453, -24353, 6983, 7474, 1673, 897, 6770, 4499, 11283, 13859, -4023, -29, 8896, 5989, -3383, 3446, -5367, 25892, 42772, 24667, 14691, 6031, 17151, 18905, -5557, -2889, 5467, 1470, -12743, -21808, -30682, -21779, -7391, -36515, -29817, -18975, -4542, -9383, -7725, -2000, 9100, 16396, 24046, 17619, 11622, 18951, 11743, 4450]
6487D450R816J0456j1224j2890j9132j1016M406N799K366j0309J9284J3013R391
6474A4410N536p820j5467M687L516J652n807m67k029j3494k82q588N511N286k1708
6459c5064l163K0812K2129K8365j0968N107J3481r895R288j8413l554J140K976
6446B2241Q24k787J546j993j6466j6918K7356P69j9641j4991j1230Q93N038J2845
6432a2514K700l1245k248Q298L3269K2124J3589k1197m250o810Q429m516o025
6419c96K509m040J417r704j5758r449J5713J5388J0078M015j4295K033N671J864
6405E046j961l383j4919n133M823Q468J1779J5931M15n047j4527J439j1164q864
6391a7097J1704j0265J961J7545K1905M240r432n064N100J2343q384j4868k147
$$ y = [4450, 14266, 24722, 13498, 608, -18524, -29540, -25134, -19335, -16969, -27278, -7994, 5019, 14410, 19946, 12126, -3341, 1346, 4862, 6514, 707, 240, -1789, -15283, -15565, -24153, -18642, -13356, -35064, -38227, -17415, 4714, 33079, 22111, 27218, 40699, 30804, 40092, 21679, 18125, 19265, 22241, 23065, 20278, 21824, 19831, 3365, -13553, 13803, 14572, -5069, -20060, -31290, -30397, -25359, -12514, -9814, -41059, -43307, -35009, -1740, 20384, 33973, 12776, 8526, 1716, 10145, 5629, -396, 2113, -1927, -510, -10214, -25972, -35421, -19708, -4320, 5758, 9773, -4522, -2489, 3182, 5046, 3085, -298, -15217, -20350, -15527, -7059, 4720, 20651, 21066, 16019, 1492, 2931, -8233, -17097, -5393, -15658, -13697, 3848, 25753, 29993, 20561, 15497, 20597, 32940, 24556, 9688, 7541]
6378G541K909J2212j374j781p290j4054j5556P111L2037J7490l161n250j5593
6365A5241J9948L145j1861J917L861j8831j688j06j4041j4953J756J0436k199
6352g375k274P288J447j5258r218M24J559P222k329K3945J4602N651K110j9628
6338H166p029R781J9041J906l3355L549M949J4193P007k1436k5517P391R961q042
6324i435j5895J0947n593k992J4798m802k0918j4515j684P439J1970k397j0634
6311d3711l830N567J5458m09R163L0023l593l3176q972j4917J6621J242n55N413
6297b5676O752J1451r90j1777j3387n127O863J2173j578J9228K0657L764k7146
6284d793K519J309N592K998L022J5173l638j1134k262j1436K990j2887m759l232
$$ y = [7541, 10450, 22662, 21288, 19507, 12217, -1837, -17393, -10282, 21755, 39245, 36084, 30834, 15241, 35189, 38334, 26473, 28390, 32251, 13420, 11732, 11626, -2415, -17368, -15612, -5176, -7375, -9649, -2361, -914, -16172, -25390, -24966, -23407, -16185, -18514, 5431, 20033, 25684, 27794, 8166, 1137, 10918, 29959, 31865, -1490, 2059, 7008, 21201, 28208, 6772, -18745, -11354, -1393, -9435, -25330, -14383, -19976, -22968, -8170, -12972, -33890, -48405, -50089, -42650, -30680, -33077, -43711, -47541, -41974, -26516, -26925, -17762, 12261, 8668, -24508, -33480, -48397, -31776, -30534, -31089, -25676, -18924, -7473, -8463, -20240, -33627, -38754, -31891, -19718, -21296, -2068, 18589, 22353, -4793, -2274, -965, 4627, 7625, 10647, 25820, 22182, 11048, 8786, -2650, 340, -12547, -17306, -20538]
6270b0538P372J5262K398m973n470j3842J3010M7958J5006k4657j2142j0046Q659
6257A7997q39j4039k5786m685K4280J0730j1639o456q282N151J7689l319J2708
6244A3510o85j4744l619l524l478J3494j5946k8783J1126J5896K0849o71p397
6231c972N181J6257j5290p583j079K1121J4383Q712k277r38j2773k2420P024R950
6217A6296j2353J4810J1960k815k3607K3991N050k1254j7603O046J1313Q505j9251
6204A088k4251R235O190M76o185n612P876n460K6q186L24J3390Q25m199Q915J7751
6188A2203j3430j2227J8229p427k2436j5325j0920O307N307j0232J4048K0265
6176a5638O027R362p704q322R893J8931N71l663K2799Q220j6905l271j4192k8375
$$ y = [-20538, -13166, 2096, 4494, -479, -5949, -19791, -6781, 41177, 56183, 31526, 19384, 9338, 17997, 17158, 3119, -22667, -27352, -3072, 7658, -3981, -10437, -18719, -13568, 4121, 802, 13510, 12825, -1919, -5538, -9062, -12540, 954, -14992, -43775, -32649, -16753, 4096, 3425, -3972, 1209, 17466, 2176, -5407, -6486, 14635, 29018, 37730, 35453, 34515, 21742, -678, 6346, 16296, 3943, 18753, 30713, 27898, 4291, 28282, 33332, 12078, -5525, 521, 11834, 20339, 1088, -23163, -13928, -7738, -7262, -13447, -19059, -11183, -16643, -16617, -24803, -24479, -11089, -10264, -14463, -5548, 12203, -1227, -13454, 4775, -2652, -25088, -40413, -51333, -45026, -39719, -49951, -35903, -15638, -9611, -249, -7953, -16275, -6382, 12549, 13120, 9457, 32256, 40476, 23571, 20300, 6108, -22267]
6162b2267J0474K4961l600j0808J7887q739j7037m401K055k40j725l27J565K817
6148i385J2396K0864J856k7027j8469l080L365K3480N459O986m66O088n796L227
6134A9498J2603N488p469J415m902L046j1004j1521J494Q328J3418j9676j3877
6121c159p811P383P817J0770o706n814j7188P747J6924n370R764K904K222o128
6107A3355K879Q719l393j3890K36J0761K232j7898l741r291o532J014P634O13
6093g302q061J4219l4J0099n645J196J1964q748p881j1710o834N199J460J3683
6079A605L606J1974j0831J4914p500J148k799j711N898J042K741J1579n359n138
6065B1169j3928m687R742K348q776q596j1180q46J7964l92q449j5284J1870K8103
$$ y = [-22267, -11793, 13168, 9568, -1240, 16647, 7908, -9129, -13530, -11475, -11715, -13440, -13767, -12202, -9385, 3011, 23875, 25731, -1296, -19765, -22845, -19480, 4000, 9459, 16445, 15979, 22067, 16271, 19498, 32101, 37589, 30120, 31535, 26633, 29679, 18675, 7154, 8648, 16976, 30394, 10718, -3159, -10970, -3587, 4230, 15000, 8294, 2480, -14708, -6961, 9963, 4593, 14357, 17261, 19483, 13355, 16234, 24953, 21560, 7670, 7906, 18667, 20899, 3001, -740, -10031, -16563, -15549, -7915, -7302, -15363, -1144, -1178, 8921, 3276, 4472, 16436, 7688, -193, -11903, -18737, -13538, -12078, 1605, 5211, 17185, 6354, 21268, 13768, 14916, 12117, 10406, 16304, 17346, 20087, 31666, 26307, 21169, 7241, 2554, 12296, 14644, 5868, -2728, -13908, -14754, 3210, 2818, -5631, -20915, -9045, 19058]
6051A9058l2293J7163J2063k608J5157L125o832j2483n256J137o677j1954N707
6038d693k5650J8494K1746o21j2518L590k321J1411N636R214J6376l339j4888
6025B2437m025j007k0407n185L934j0376j4836Q035J4674l573j6973M881q719
6012c1140J2928J7260j9331r082R089J5858r495J9541N790p282q213n920K5760
5999A5763N932N99o937j3996j2963r382j9332M935K3614Q099m828J9046J2724
5986B3274j6054j7546K3137J0239q816k9125j1565R137M490M525O74j8688j2024
5973c8342K0105J3880K017L384n57l908j0522k7236J7382K6225K742j2621Q239
5960G88J1239P367o769j1717j3530K579J3464l22o511J1857j3278j338J9608m905
$$ y = [19058, -13235, 3928, 15991, 13383, 28540, 31665, 24833, 12350, 7094, 8231, 1554, -10400, -4693, -30343, -11849, 9897, 9276, -3242, 348, -1973, 9438, 15074, 24288, 40664, 37325, 22437, 18412, 17405, -3002, -8187, -4253, -14629, -29465, -21430, -6756, -10329, -27302, -22421, -31140, -18212, -952, -20283, -29365, -20276, -4418, -13913, 5628, 11418, 4136, -4077, -9997, 15763, 21695, 22294, 15357, 1361, -11602, -20984, -40316, -35381, -11767, -3668, -8496, 10550, 23274, 7220, -10326, 12811, 23050, 14234, -14891, -26456, -17319, -12829, -8304, -7630, -26318, -38342, -18237, -4357, -2340, 1044, 487, -3421, -13943, -41179, -23797, 2428, 5170, -7451, 788, 12027, 19394, 12625, 908, -12622, -10043, 3421, 3099, -3412, 8445, -4833, -6171, 13437, 8532]
5946H532o992j1140j2081P586j71j2122K0677P389R768K859j8457j1063M260p36
5932a1691J5712L052j775J4714j1539k669R498k0988L615K3371k504k7895m223
5919a3322K266J0472J2107J2510R326M326o970j3945n472N244l699K671j3135
5906B379j2286r97Q709K18O056J9275l805l1391k389J5372m863J7281K763p810
5892H512J4953J9187l0444k6157K952J9236n967J0996J8568r548j5258k6388o45
5879b0003j3913q936O566L78o047Q460Q191l40n813J2766R065P164j649l396o4
5864g571r151n196K8686J4966j9026o904J5746j8524m642M1j6417J1768L0889
5851A4665l726j064M2214M468o395m113j8135J140j1182k6881k0167P913J4880
$$ y = [8532, 1540, -9600, -21681, -14095, -14266, -26388, -5711, 1678, 11446, 14305, -4152, -15215, -10955, -11691, 4021, 7073, 5298, 20012, 8473, 5804, 15302, -5686, -2071, 21300, 18796, -9099, -13322, -11056, -584, 11523, 24033, 33359, 37685, 30715, 16770, 11298, 16542, 12843, 15514, 2379, -9907, -10904, -2195, -1977, 4079, 23354, 19549, -11842, -14231, 1141, -3722, 13559, 16322, 8512, 23465, 42652, 12208, -13949, -10997, 8239, 2272, 13268, 31836, 22288, 7030, -19358, -20003, -33916, -42852, -36286, -35908, -41955, -33495, -25304, -25644, -31457, -18691, -9626, -2462, -4111, -7507, -7571, -16722, -21918, 6768, 21734, 2708, -4196, 11550, -6974, -11616, -11575, -27992, -16224, 14665, 10939, 9875, 52089, 56557, 50162, 46049, 27914, 29054, 17872, -9009, -29176, -21263, -6383]
5838f383J9518K7630m219j6435k0399j8341j336K2011J6554k722j4568k9693j2213
5825d0596k582J2559K1557P024K864K29j8054P052J4020J2617m5434p762J6669
5812a9837K4207Q190o756k645k075L593P324K541p150J7396O36q763k2890j2521
5798a8750J7227k2841l4331K2807J9869j3014n689L438p777J2602L1611J9808
5786B4960j8137l9098n791K9448N747k738k4908m734K0081K5283J3333k0646M363
5773G163J4338P158P909N013k9119j1857j8842r610j2141M388J671J600O217J0493
5759a5619j4879Q206J8317Q051J2652P04j6418k3069O170k962N916R578J5557
5746A2204k209j8475l716l70J660l376j4077O70K7645L3394o818p192Q115J5303
$$ y = [-6383, 13135, 40765, 36546, 20111, -288, -18629, -19965, 2046, 18600, 15878, 1310, -28383, -40596, -43178, -30619, -9062, -2038, 826, 1055, -16999, -9947, 4073, 16690, -28744, -36506, -19837, 4370, 12560, 5804, 3159, 1084, 4677, 12001, 14542, 7392, 24788, 25424, 16661, -6229, -18750, -1523, -24364, -58695, -35888, -16019, -29033, -34722, -31284, -39061, -26459, 5152, 24960, 6823, -32275, -38066, -8618, -2871, -5609, -30517, -35251, -15170, 10113, 23446, 2800, 7163, 21501, 28659, 36568, 41581, 12462, 605, -18237, -27847, -39988, -35600, -33929, -32329, -26112, -15619, -30498, -22292, -3975, 4076, 16728, 17432, 1014, -22055, -15885, -18847, -12931, -3353, 12204, 9995, -8480, -12196, -12566, -10906, -14282, -28359, -27689, -44, 33350, 26532, 19340, 27455, 42758]
5732D2758j5067j3060j2690q07j1206o271j511j3886J1091L1334J4810j095o416
5719A7984k0903j0985l1614j7099J2820K8239J6719j0174K582J3514K433Q352
5707A1868J0241k367k0268r85J4767l497j2742j0609k165Q057J979N337N161o476
5693a699l747j7194j0680J6727J9635J426J782l754q891L186J5690M629O619R553
5679C3282p869j7121j194J5190q747o126q654j6163j8166K6118O307p151o146
5666a6440R848J8103L875l9356l1265J2076K4452P414k494k0912J4672J6342N634
5653A949r628j8737L52L113P975j4620J0446J9543P354j4522r082r474K955K6937
5639D561Q815J747Q937j0730j0769k083j195J159m488J8664L726m409r001r376
$$ y = [42758, 27691, 14631, 1941, 1134, -10072, -16343, -17854, -31740, -20649, 10685, 25495, 24400, 17984, -2919, -13904, -45518, -62617, -49797, -21558, -4839, -15013, -12431, 1083, 3516, 11868, 22109, 19742, -526, -1511, 13256, 9759, -2983, -13592, -15757, -7700, -5721, -384, 4777, -1699, -5446, -22640, -33320, -16593, 3042, 4468, 6250, 2496, -6395, -3209, 12481, 17110, 23729, 33282, 25413, 8292, 7098, 22288, 13541, 7415, -1239, -17402, -35568, -9450, -3143, -10294, -16440, -6592, 11511, 15386, -23970, -55235, -43159, -18707, -11293, -13787, -34699, -20027, -3685, 1949, -7679, -26416, -26064, -22951, -14976, -29596, -19150, 393, 7747, -6775, -15857, -25331, -22376, 4561, 13376, 15123, 24060, 13330, 2561, 478, -717, 442, -4046, 14618, 18344, 13935, 4934, -4442]
5625d442k672P793j288K140L78M781Q611K764j1969n507p208j9868j060R030q164
5610b6681R884K1901J8860J2290K525o517j4291j9185j2038O873j155J519J7745
5597A1730l982J9609N358j1633O136K128j8620k6682j7303p669J9722N083k1680
5584c7803J0980K7111o402j2297o72k216K3316J2343k141j6658n702j1748j1840
5571c3729K491k332J6252P825J2317m861n988K1570J958J660r472M699L91k0041
5557g260j3915J0849P606j2860P968l444J2967j1766K733K8378J8478j2636j3242
5544A3856k185L87l103k5991j3119k655k332N511j16q433K7259J9341N682O308
5530B0410m463k6413l294M421j3609K1099O323j6752m694j2553m706Q025R172
$$ y = [-4442, -7114, 679, -609, 1531, 1909, 6690, 15301, 18065, 6096, 589, -6619, -26487, -27547, -18517, -26681, -16797, 5104, 23964, 36254, 38779, 32262, 17971, -1214, -13252, -6379, -7534, -6015, 11730, 7748, 27357, 32715, 21082, 27218, 29346, 10726, -15956, -33259, -40928, -21206, -16123, -37803, -26823, 288, -6114, -18411, -19083, -21299, 2017, 14360, 12219, -4439, -10141, -21889, -33729, -31238, -33570, -17318, -9493, 2824, -2037, -8025, 13545, 15503, 17163, 7691, 12390, 12781, -7260, -21175, -10326, -2720, -15580, -7612, -11056, 1911, -9855, -7122, 21256, 39734, 27098, 13856, 11671, 12058, 8955, -17036, -30155, -32810, -35142, -29631, -29747, -38180, -10921, 8420, 14102, 20410, 15947, -10466, -13760, -9339, -22948, -1849, 4474, -12278, -16972, -29525, -34231, -26206, -17034]
5517a7034r221K848R919Q100L068n191K1359K1759o34l1219j1057O234Q610k754
5503D787j3117j2317j9873J2106J1599r95J4172J4004Q111J770K143j3787k685
5490E918R030J6010r253j9759j7441j7526r83M228K0684K7771R4j3245p864L927
5476A591K5534J2414Q32j4244k0836k2335m630Q093K526J2726J2452r397J588
5463F314K3768k7405k6284K4607j5210j0383J9120R243j4369k4180Q424K1060
5451e295M757k5629K376J0642N10k0319M499L7605J8547n588j0393k6713l148
5438a8149J7633L669j4224L860P860j985K119o140N349j86j5433j1414L0671J3400
5424A7030j5874j128J8135J3272l370j5087m071J871j1287K53j3389o503K604
$$ y = [-17034, -26255, -23407, -13488, -5388, -2320, -7511, 13848, 35607, 34973, 3754, -7303, -1069, 7541, 4787, -8330, -20647, -40520, -28414, -16815, -17810, -3638, 10366, 18477, 20247, 22390, 8603, 5918, 14948, 30958, 21705, 1946, -15495, -33021, -34004, -29776, -9092, 18679, 18773, 5528, -2336, 1591, 27125, 39539, 40371, 26127, 5291, -17044, -21674, -13581, -11055, 1671, 14123, 4726, 6314, 30082, 2677, -23607, 1000, -14210, -24593, -5473, 3770, -10599, -34779, -26355, -5295, -538, -26167, -23791, -13149, -12639, -32958, -28459, 9146, 27693, 22105, 11712, -15001, -18149, -516, 3153, -11071, -7211, 649, -1336, 783, -5357, -8, -194, -15627, -27041, 3630, 17030, 1156, 28, 18163, 31435, 28065, 12978, 8907, 10778, -509, -256, -13645, -20148, -17544]
5411a7544O994J1156j414Q719m089r389j0132j4536r296o548j5743o461j079J9543
5397d9819K0784J9010l194j7649K674o213k458n064J3620O971P649J5142O374
5384G827q214k7351p650P136K5817J8562Q825k3330k0668p898K0773j104j0771
5371a8046r202j4464J1744J9540J0053P33r94Q87k2007k9395p578K2036J3764
5358b2929q25l365j0438R809J6181M507q214J8489m066L102J2847j9061r225n823
5344a9011O797r664j2188J7394J1575r203J6049J380j2107j2931j507J2222K9593
5331A8399l67n200j3809m977j459J8900K057j0431j0237k2947q238K7211K1162
5318A0064n064o757r881N69R979q007l812l676P629K592N888J564j7114o650m042
$$ y = [-17544, -10550, 606, -808, 7911, 3822, -5567, -15699, -30235, -39531, -46079, -61822, -68283, -69362, -49819, -29035, -10025, -13219, -30868, -28194, -34407, -36865, -41929, -28309, -21338, -13689, 1453, 7827, -387, -27738, -35388, -28252, -2435, 16127, 24952, 1622, -19046, -26944, -6171, -7275, -18046, -27248, -41712, -29968, -10428, -375, 358, -636, 251, -21756, -51151, -58729, -36693, -22929, -23754, -27119, -37557, -27748, -11567, -7060, -15274, 3215, -851, 2251, 15098, -3963, -13188, -19011, -12214, -21878, -34066, -16672, -5097, -14300, 1749, 3129, -8978, -21909, -23416, -11194, 18399, 18032, 12832, -977, -5954, -7413, 11487, 13544, 3113, -7124, -30071, -38309, -11098, 10064, 5000, -1757, -11638, -11069, -1090, -9097, -12909, -16585, -8956, -6364, -476, 1088, -16026, -22676, -26718]
5303b6718J4376P302j8100j0963k256K847Q632j3093j705r550j597N814L386M080
5289c7545J5860m682K106k37n124Q44N57l97p836K2202K1682Q584m265l485p066
5274A198j6043k591N495Q650N721q415j2844q343J907j0189p872K3971J5457K870
5260a028J221K851J5158K0258N1Q889j3994k3260l499j5852K1996K5432K981k9697
5246A1507j7554K180O4J7399Q047m748m263M75l3399K531L90J8942J6600K317
5232B0488j1888j0409n696J1173l832j5136j1340J3211J9124J6537J155j8855
5220D532j3458q663R160N808N090L137l608m799j0573M442Q680r706L582q878
5206a5254N515j4211J2126J8551Q290j1341j0289R209k4239m444K5243L501k303
$$ y = [-26718, -12342, -5040, -23140, -34103, -36359, -33512, -24880, -37973, -39678, -49228, -50825, -45011, -41625, -37545, -21685, -26367, -24261, -24498, -29622, -28778, -28221, -28618, -36454, -14252, 7430, 16014, 11749, 8264, 1198, -14845, -17436, -11941, -3291, 2430, -5985, -18829, -27172, -25265, -35454, -43326, -19355, -3898, -1028, 193, 3044, 18202, 38460, 38511, 47400, 33406, 10146, 6647, -9205, 12791, 38223, 41204, 11507, -6047, -3867, -3803, 13596, 21643, 16895, 12632, 13107, -20292, -17761, -17371, 1571, 18171, 20488, 8600, -1809, -7505, 3668, -164, -15300, -26640, -13429, 5695, 22232, 23387, 4532, -8926, -17589, -8429, -2621, 2469, 5606, 1998, -2801, -13374, -8932, -252, -9958, -6376, -15254, -9739, -23950, -11824, 6727, 15017, 3676, -6613, 2596, -21643, -26087, -844, 2657, 354]
5193C54j848L843k8876Q956K6009n250K116p83j7809K609k690o950P445L614r029
5178a8289K285K2915l214r382O65O800p411j2738Q781J3432O411k355J6769Q670
5164C3339m084J673J1621m526k2576j0933O922j4771l493m565p443J4849P607
5151C620k3802j8026N113J6611Q353p158j6525J4600J7981l810j9202R000k2735
5138c5980m980J5845M464M031P458M056J4519P683o216K855O095j4337j6094j7117
5124b7718o738m968R858J4435J5697M48N295M908k0120K122m340j0453O853l580
5110a8301J0578n176j9988l853J1185m921j0731J7030J3191J0684P839r09L041
5097I669Q410J1601j0123k3125R393m390j1390l632K91j3526j2613K8494J8893
$$ y = [354, -1494, 2349, -26527, -17571, 8438, 3188, 5304, 4521, -13288, -10679, -13369, -20319, -12874, -9260, -18289, -16004, 6911, 3697, -5685, -5020, 1780, -5631, -18369, -9588, 3844, 10255, 7900, 24669, 33339, 29255, 30928, 42549, 38023, 15447, 4514, 11436, -3335, -6828, -11393, -18836, -3987, 3620, -20182, -38208, -33095, -16484, -8131, -15289, -31814, -17214, 767, -3043, -22245, -13245, -35980, -40960, -25115, -20651, -16620, -9162, -5106, 9413, 17096, 10880, 13735, 19830, 5493, -10601, -27718, -34456, -39424, -29566, -15131, 566, 1014, 6309, 11217, -8903, -6781, -11121, -21574, -14721, -18301, -7723, -12899, -32887, -36740, -25555, -30476, -41207, -24177, -10986, -302, 7537, 6628, 9669, 18079, 29680, 19557, -3568, 5825, 1435, -9955, -13587, -13296, -26822, -39435, -10941, 7952]
5084G952l317k06m09J4569k1680j5888P845R086n973j9764k2610J6505K9945k65
5070d210o152q458k839r269Q637R450j0695m598j4283n752J1812J4082j3249j695
5056c7219R990P477l14O061P24P348j647J921J4652k502j7234n795k025R924M153
5041d486m530K866L875j0547L6787J3568j9176j798j8135k4584j2319J2058J6309
5028a0112L173p021K1440N09J2257P754L1674k1117j3705K1863m185j3896L477
5015C2111l7642q974J4415Q106n333p817m035j247P006J0666M009l4141q773j0911
5001d2560n372R100J8887J0085K0202P304j0565M983L1535p670r820j4748j9831
4988h470Q00K3465K099L36j4711k9241K6469J7767L305j9041j0055J3343J1064
$$ y = [7952, 4635, 4429, 4020, 18589, -3091, -18979, -11134, -2048, -8021, -27785, -50395, -33890, -3945, -4210, -10362, -18820, -21659, -30928, -22291, -12841, -23536, -28134, -42417, -48169, -36357, -22275, -35524, -37219, -27229, -19752, -20066, -14005, -13281, -5933, -7580, -5659, 8993, 6491, -10743, -16538, -18563, -8639, -4486, -9016, -6150, -2275, -12822, 23965, 37533, 18357, 16559, -1576, -26160, -38479, -26421, -10112, -6939, -13960, 7480, 7989, 20246, 28000, 59674, 38557, 24852, 46715, 42530, 28634, 32111, -5531, -14505, -90, 8016, 2683, -5134, -9169, -10416, -3410, 7256, 11265, -22876, -31649, -42560, -47932, -38832, -19945, -9860, 10342, 17646, 7081, 12064, 43599, 35929, 26109, 11361, -8470, -7670, 15795, 17894, 18230, 3519, -25722, 747, 18514, 21819, 2778, -7277, 6066, 17130]
4975A7130L884j853r241j1149k910p08L765l645j4222r908j3691l1140K679L4993
4961c6016r88R751K3488R725J2713R33j9575j2591N26J851n557K089m316J2801
4947e166J601n807K18J4386J1075k0074L96K783q766k1093j4449M14J5870Q145
4933b0467P728J521J4535L178j0087k6548K5681K0945p012n484L132J5670j967
4920B0825m677K140o392p051o021O668j0927j0133j1082J431K5588J8425n774
4907A3020k4413p348M067m811L062K7874l188q90K1108l57j6732l237R019l278
4893A3896j3402n073l453J0922K072J1568j72m335R454O535j7971k0133J4575
4880D483J5936j767o87K6820Q155j2505k6745k0642j3578J5223J1284K188j3188
$$ y = [17130, 21014, 19161, 9920, -1229, -4139, -4847, -1082, -4727, -18949, -28857, -42548, -73688, -71009, -36016, -37004, -27253, -3765, 5960, 18673, 19606, 31, -12560, -12034, -10183, -15740, -13651, -17967, -5166, -3565, -9372, -9154, 5232, 16307, -3767, -3371, -588, -9354, -30447, -44896, -44482, -28612, -20467, -12739, -11218, 3317, 6495, -3592, -30140, -4459, 16486, 9474, 3990, 7122, 22792, 20825, 16148, 18288, 11896, 4845, -1176, 5492, -5435, -15568, -26650, -25219, 369, 18794, 13020, -11393, -18741, -14674, -19485, -16423, 11451, 8263, 7373, 28481, 28124, 11392, 8155, 17174, 13896, 494, -4579, -8032, 2890, 4962, 16530, 16358, 12023, 21477, 28012, 10041, -10092, 4483, 20419, 18652, 17965, 44785, 52940, 40435, 13690, -6952, -20530, -5307, 5977, 8165, -5023]
4867e023k1228q039q337k053K3652J5285J45n607J0099r055j1432l832J3656J1266
4853e03P215n910r667l865R028j3978j705L230Q782r459K667K1387J115j7125
4839h788o034o874q676J7982J8920N786p583K893n679j1212J6033J3520j2017
4826H271j7619j1083J779J1840J0026L239q574R420K9909j930k2634k8803q930
4813b5089K6169m101j4768p591P077K4063J5264j1655j0316J4810J5074n655j5484
4800G798j3501J3660o335J206K1579l139l124j7658P437K718k3926r647k961K2344
4786c549J8032K685J033K716k6605k3182O966n563j3734J744K6979L7825j5869
4773I478k3686K54j847M498J6413J2144k9577p863K2496R133l014N216j884J1890
$$ y = [-5023, -26251, -34290, -42627, -44680, -21028, -5743, -5598, -11205, -1106, -10161, -21593, -25425, -11769, -503, 6712, 802, -8865, -12730, -3702, -17680, -19385, -16155, -7373, -16832, -14165, 7222, 8337, -8788, -14822, -21696, -30372, -12390, 6530, 12316, 4733, 7626, 1947, -9265, 6768, 20288, 8271, -9348, -20431, -18652, -6812, 3214, 6453, -2121, 7299, 37208, 35278, 12644, -16159, -25089, 1080, -3021, -17789, -25380, -18303, 5760, 21024, 9369, -947, 13863, 28937, 23282, 7798, -5703, 7957, 1622, 2828, 24407, 21268, 18144, 486, 7923, 10641, -13285, -22932, -25893, -3549, 14483, 17168, 18201, 20917, -5688, -28870, -21904, -27467, -41201, -39457, -12478, 25347, 9478, -14208, -13954, -15801, -11303, 5110, 17254, -12323, -20186, 2310, 11443, 8429, 13645, 11761, 23651]
4759B3651K407q311j7761l869J6914j0210O330J9624k8737j5035J7980O81k3672
4746b0008q090K408J0801J373k68O339J1603J0495k1061J1823J2662p878J825
4733A2024r814o694M807n021l119o625J2405Q227j802N181J7751N474l283M01
4719B9912l807j0290j4329j964j9877k312j797R553J4619N161J7145M058k1584
4706D488k968p73Q6j055j9048J2859O800o379Q515K840k076N125J4615r69P579
4691B9639Q113J859J706k4945j3717R972J1762r626r455m570k958k497N051K142
4677B476j8683k1310J150L2298J5421Q613q869k3091j1569R908k220J7996J4397
4664A6517R869q214k8029m497J5346K7358k167j2424K42k0042P307l863o806j684
$$ y = [23651, 26058, 17747, -14, -3883, 13031, 2821, 9151, 28775, 38, -14997, 2983, 3664, -20008, -28098, -25690, -14889, -13516, -13784, -7445, 4158, 14653, -6408, 5415, 18077, 10199, 12024, 2210, -4484, 323, -4698, -7817, -14442, -2037, 6190, 4388, 9569, 27320, 32794, 29511, 29912, 26105, 15815, 1486, -478, -20355, -22667, -24464, -14911, -292, 4869, 22014, 26072, 4488, 1520, 747, 833, -222, -19270, -6411, 389, -5990, 2525, 5365, 3289, 8414, 23029, 22060, 29639, 37752, 39611, 41317, 16372, 2655, 12627, 24389, 14763, 5308, 738, -2220, -4717, 334, 2476, -16207, -37517, -36367, -4069, 11352, 19965, 11096, -11995, -23564, -13656, -15876, 2120, 16517, 26386, 18172, -9857, -14354, 992, 28350, 26183, 13759, 14001, -6041, 1266, -2597, -9403, -11087]
4650a1087k5091P141L9484K3948j1875k376n468l47J1986l815j9349j0459o565
4637a3873j966p093J0223K3523J898R872o487o556n790j4882j7828L15j2151J684
4623c9111K3092J2155m196j919j4595O709K3917j279k8842J255J9867L4381l241
4610B8193m980p736l500j068K1315p315k1677K3893L275o066M091J3679j1214
4597C0890O657k4113j9750K870j5287K8563K4024R048j1960j0346k1265j0858
4585a1527O615p847J294J9778J150n610j0035K5103J6032L622p098p938o641n864
4571A1034J2927k4857k2614J1344J9981N013M029l952L192j2345j8031j2361K785
4558b3855J0277J7953P512k1969j0023J4094K1842q813k7627O004K6488j4004
$$ y = [-11087, -36178, -29037, 10447, 34395, 22520, 20144, 14676, 14329, 26315, 22500, 3151, -7308, -13873, -15839, -22932, -12709, 10814, 12712, 22584, 16097, 9541, 3751, -11131, -28959, -28644, -40795, -39111, -16019, -3864, -8060, -9979, -24574, -17865, 6052, 4773, -24069, -22814, -2947, 31434, 28193, 23213, 15477, 11977, 10909, 32224, 24909, 3232, 27125, 30400, 24334, 28425, 42104, 30890, 37547, 13434, -6316, -3446, -18733, 9830, 33854, 42902, 30942, 20596, -669, -11527, -4912, -12759, -11465, 8313, 9463, 3853, -6182, 18921, 34953, 38575, 31477, 23539, 16898, 11034, 23961, -896, -23510, -12166, 7815, 12828, 16857, 12905, 16097, 3752, -14279, -26640, -23855, -13578, 4375, 11887, -10082, -20105, -6011, 15831, 7018, -20609, -14605, 11883, -2121]
4546b121j2337k1585P081L3023K6172j7140l510N368N190J7536n46o072o770j1442
4532A2847p549J1535j8331j5583l464K5532j7974j6205k054j743J3488K1311j3168
4519a1358j1629L033J7119N563q263j8183j313R992n939p719Q099k598l549m151
4505c0896k055J0606J1636L179J4093Q669K999m270j1641k58j0203r959J3318
4492d782K4232J7548N301k7069r451R839j1276k191J7890n433M770m247O095M444
4478B5670O460q74Q681M562j7110M616j1990r6J3337k3176Q10J0248n370q468
4464G300k1266O625M242J8766j0662l453J2305P675L419j1609j342k4179j4999
4451b7178P632J8637J1376p840j8475J9989J4638j19p550J074j3766l0772o288
$$ y = [-2121, -14458, -36043, -28962, 4061, 30233, 13093, 9583, 14951, 20141, 37677, 37131, 31059, 24289, 12847, 5298, 16833, -1498, -17081, -20545, 4987, -12987, -29192, -31246, -32989, -19501, 1810, -11358, -22987, -19954, -2835, 2728, -5535, -23718, -25031, -15039, -20978, -28697, -20598, -23196, -26745, -30896, -32951, -22345, -10709, -7530, 6563, 15232, 18231, 13961, 2320, 2062, -8141, -18100, -4782, 19450, 36998, 42299, 15230, 5779, 15618, 4342, 2151, 20041, 14608, 19378, 15131, 21226, 25670, 32130, 31256, 39937, 44499, 27389, 32005, 20015, 19919, 33256, 10080, 10890, 21138, 15768, 7300, -13966, -7341, -3099, 15667, 5005, 1552, 13857, 21532, 24951, 13342, 12000, -12179, -27178, -19546, -909, 10467, 2627, -15848, 4141, 18779, 18660, 11110, 12184, -1582, -32354, -38642]
4438c8642J9000K4592L93k3401L886o532J3675L83J7315K0818l4190m0682R598
$$ y = [-38642, -19642, 4950, 5343, -18058, -14172, -20704, -7029, -6646, 10669, 31487, -2703, -43385, -33787]
$$ [...]
##END NTUPLES=NMR SPECTRUM
##END=
