##TITLE=Analysis number 326363
Compound Code cc 56201
Book Reference 513/27/37
Project Code adrs
Chemist Name ronp
##JCAMPDX= 6.0         $$ Bruker NMR JCAMP-DX V2.0
##DATA TYPE= NMR SPECTRUM
##DATA CLASS= NTUPLES
##ORIGIN= Bruker BioSpin GmbH
##OWNER= nmr
$$ XWIN-NMR		Version 3.5
$$ Mon Feb  5 12:30:43 2007 GMT Standard Time (UT+0h)  MAYBRIDGE\nmr@NMR_250MHZ
##.OBSERVE FREQUENCY= 250.131544655141
##.OBSERVE NUCLEUS= ^1H
##.ACQUISITION MODE= SIMULTANEOUS (DQD)
##.ACQUISITION SCHEME= undefined
##.AVERAGES= 16
##.DIGITISER RES= 18
##SPECTROMETER/DATA SYSTEM= dpx250
##.PULSE SEQUENCE= zg30
##.SOLVENT NAME= DMSO
##.SHIFT REFERENCE= (INTERNAL, DMSO, 0, 16.522)
##AUDIT TRAIL= $$ (NUMBER, WHEN, WHO, WHERE, WHAT)
$$ ##TITLE= Audit trail, XWIN-NMR		Version 3.5
$$ ##JCAMPDX= 5.01
$$ ##ORIGIN= Bruker BioSpin GmbH
$$ ##OWNER= nmr
$$ C:\u/data/dgb/nmr/ADRS/310/pdata/1/auditp.txt
$$ ##AUDIT TRAIL=  $$ (NUMBER, WHEN, WHO, WHERE, WHAT)
(   1,<2007-02-05 12:30:22.08 +000>,<MAYBRIDGE\nmr>,<NMR_250MHZ>,
      <created by zg, POWCHK disabled, PULCHK disabled
       configuration hash MD5:
       49 4B E0 1D 92 C2 6B 37 9F E6 65 BC 52 41 86 1D
       data hash MD5: 64K
       1F 84 60 88 7E 4E 1D 23 95 1B E4 DD F5 18 45 CF>)
(   2,<2007-02-05 12:30:33.92 +000>,<MAYBRIDGE\nmr>,<NMR_250MHZ>,
      <Start of raw data processing
       ef LB = 0.3 FT_mod = 6 PKNL = 1 SI = 32K 
       data hash MD5: 32K
       E6 EA A9 4C 83 60 2E ED B7 28 55 41 AF B8 B7 6F>)
(   3,<2007-02-05 12:30:35.56 +000>,<MAYBRIDGE\nmr>,<NMR_250MHZ>,
      <apk 
       data hash MD5: 32K
       94 38 84 A6 0F 02 88 91 54 2E B7 DB 68 0B A0 32>)
(   4,<2007-02-05 12:30:36.27 +000>,<MAYBRIDGE\nmr>,<NMR_250MHZ>,
      <abs ABSG = 5 
       data hash MD5: 32K
       76 CE 35 6A 82 DD C0 14 F1 3A 93 C5 BF 45 98 A2>)
$$ ##END=
$$ 
$$ hash MD5
$$ AB 4F BF 2E A4 98 51 39 55 B6 8C 75 8A FB 04 2D
##$RELAX= 
##$RELAX= 
##$RELAX= 
##$RELAX= 
##$RELAX= 
##$RELAX= 
##$RELAX= 
$$ Bruker specific parameters
$$ --------------------------
##$DU= <C:\u>
##$EXPNO= 310
##$NAME= <ADRS>
##$PROCNO= 1
##$TYPE= <nmr>
##$USER= <dgb>
##$AMP= (0..31)
100 100 100 100 100 100 100 100 100 100 100 100 100 100 100 100 100 100 
100 100 100 100 100 100 100 100 100 100 100 100 100 100 
##$AQSEQ= 0
##$AQ_mod= 3
##$AUNM= <au_zg>
##$AUTOPOS= <42 >
##$BF1= 250.13
##$BF2= 250.13
##$BF3= 250.13
##$BF4= 250.13
##$BF5= 500.13
##$BF6= 500.13
##$BF7= 500.13
##$BF8= 500.13
##$BYTORDA= 1
##$CFDGTYP= 0
##$CFRGTYP= 5
##$CHEMSTR= <none>
##$CNST= (0..31)
1 1 145 1 1 1 1 1 1 1 1 1 1 1 1 1 1 1 1 1 1 1 1 1 1 1 1 1 1 1 1 1 
##$CPDPRG= <>
##$CPDPRG1= <>
##$CPDPRG2= <>
##$CPDPRG3= <>
##$CPDPRG4= <mlev>
##$CPDPRG5= <mlev>
##$CPDPRG6= <mlev>
##$CPDPRG7= <mlev>
##$CPDPRG8= <mlev>
##$CPDPRGB= <>
##$CPDPRGT= <>
##$D= (0..31)
0 1 0 0 0 0 0 0 0 0.06 0 0 0 0 0 0 0.0002 0 0 0 0 0 0 0 0 0 0 0 0 0 0 
0 
##$DATE= 1170678621
##$DBL= (0..7)
120 120 120 120 120 120 120 120 
##$DBP= (0..7)
150 150 150 150 150 150 150 150 
##$DBP07= 0
##$DBPNAM0= <>
##$DBPNAM1= <>
$$ [...]
##$SUBNAM7= <"">
##$SUBNAM8= <"">
##$SUBNAM9= <"">
##$SW= 20.6930455092707
##$SWIBOX= (0..15)
0 0 3 0 0 0 0 0 0 0 0 0 0 0 0 0 
##$SW_h= 5175.983436853
##$TD= 65536
##$TD0= 1
##$TE= 294.16
##$TE2= 300
##$TE3= 300
##$TEG= 300
##$TL= (0..7)
0 120 120 120 120 120 120 120 
##$TP= (0..7)
150 150 150 150 150 150 150 150 
##$TP07= 0
##$TPNAME0= <>
##$TPNAME1= <>
##$TPNAME2= <>
##$TPNAME3= <>
##$TPNAME4= <>
##$TPNAME5= <>
##$TPNAME6= <>
##$TPNAME7= <>
##$TPOAL= (0..7)
0.5 0.5 0.5 0.5 0.5 0.5 0.5 0.5 
##$TPOFFS= (0..7)
0 0 0 0 0 0 0 0 
##$TUNHIN= 0
##$TUNHOUT= 0
##$TUNXOUT= 0
##$USERA1= <user>
##$USERA2= <user>
##$USERA3= <user>
##$USERA4= <user>
##$USERA5= <user>
##$V9= 5
##$VALIST= <valist>
##$VCLIST= <CCCCCCCCCCCCCCC>
##$VD= 0
##$VDLIST= <DDDDDDDDDDDDDDD>
##$VPLIST= <PPPPPPPPPPPPPPP>
##$VTLIST= <TTTTTTTTTTTTTTT>
##$WBST= 1024
##$WBSW= 4
##$XGAIN= (0..3)
0 0 0 0 
##$XL= 0
##$YL= 0
##$YMAX_a= 263563
##$YMIN_a= -239509
##$ZGOPTNS= <>
##$ZL1= 120
##$ZL2= 120
##$ZL3= 120
##$ZL4= 120
##$ABSF1= 16.522
##$ABSF2= -4.171173
##$ABSG= 5
##$ABSL= 3
##$ALPHA= 0
##$AQORDER= 0
##$ASSFAC= 0
##$ASSFACI= 0
##$ASSFACX= 0
##$ASSWID= 0
##$AUNMP= <proc_1d>
##$AZFE= 0.1
##$AZFW= 0.1
##$BCFW= 0
##$BC_mod= 0
##$BYTORDP= 0
##$COROFFS= 0
##$CY= 12.5
##$DATMOD= 1
##$DC= 0
##$DFILT= <>
##$DTYPP= 0
##$F1P= 14.0000005364418
##$F2P= -0.99999901652339
##$FCOR= 0.5
##$FTSIZE= 32768
##$FT_mod= 6
##$GAMMA= 0
##$GB= 0
##$INTBC= 1
##$INTSCL= 1
##$ISEN= 128
##$LB= 0.3
##$LEV0= 0
##$LPBIN= 0
##$MAXI= 10000
##$MC2= 0
##$MEAN= 0
##$ME_mod= 0
##$MI= 0
##$NCOEF= 0
##$NC_proc= -4
##$NLEV= 6
##$NOISF1= 0
##$NOISF2= 0
##$NSP= 0
##$NTH_PI= 0
##$NZP= 0
##$OFFSET= 16.522
##$PC= 1
##$PHC0= 221.7351
##$PHC1= 8.641635
##$PH_mod= 1
##$PKNL= yes
##$PPARMOD= 0
##$PSCAL= 4
##$PSIGN= 0
##$REVERSE= no
##$SF= 250.13
##$SI= 32768
##$SIGF1= 0
##$SIGF2= 0
##$SINO= 400
##$SIOLD= 32768
##$SREGLST= <1H.DMSO>
##$SSB= 0
##$STSI= 32768
##$STSR= 0
##$SW_p= 5175.98343685301
##$SYMM= 0
##$S_DEV= 0
##$TDeff= 65536
##$TDoff= 0
##$TI= <Analysis number 999999
Compound Code 99
Book Reference 9
Project Code 9>
##$TILT= no
##$TM1= 0
##$TM2= 0
##$TOPLEV= 0
##$USERP1= <user>
##$USERP2= <user>
##$USERP3= <user>
##$USERP4= <user>
##$USERP5= <user>
##$WDW= 1
##$XDIM= 32768
##$YMAX_p= 326064912
##$YMIN_p= -331811
$$ End of Bruker specific parameters
$$ ---------------------------------
##NTUPLES= NMR SPECTRUM
##VAR_NAME=  FREQUENCY,     SPECTRUM/REAL,   SPECTRUM/IMAG
##SYMBOL=    X,             R,               I
##VAR_TYPE=  INDEPENDENT,   DEPENDENT,       DEPENDENT
##VAR_FORM=  AFFN,          ASDF,            ASDF
##VAR_DIM=   32768,         32768,           32768
##UNITS=     HZ,            ARBITRARY UNITS, ARBITRARY UNITS
##FACTOR=    0.157963299565203, 1,           1
##FIRST=     4132.6476996994, 0,             0
##LAST=      -1043.33573715361, 0,           0
##MIN=       -1043.33573715361, -331811,     0
##MAX=       4132.6476996994, 326064912,     0
$$ Real data points
##PAGE= N=1
##DATA TABLE= (X++(R..R)), XYDATA
$$ [...]
21716 -195896 -192271 -109822 -89142 -10226 -16861 1560 37786 1993 -16095 69416 98961 64007
21704 64007 6334 -63281 -121937 -124364 -66990 9003 19318 14937 30589 35905 -24371 -28925
21692 -28925 8103 -64897 -203585 -174871 -129862 -158934 -162941 -76068 -100110 -73619 -93404 -50048
21680 -50048 -41447 -15575 12759 1558 -43477 -30965 -34129 -63236 -105397 -27822 -23219 -27642
21668 -27642 -18556 75131 76320 31513 42343 59593 -31449 -17148 -97995 63669 152734 115719
21656 115719 37629 15473 58305 38801 -97040 -183355 -95979 -7011 15974 -55667 -161748
21645 -161748 -124895 -44225 -43810 -151973 -208704 -129698 -48048 -74160 -115604 -22411 23636 1166
21633 1166 -85475 -29406 34451 -74875 -98542 -119455 -41287 -78014 -146072 -136663 -122342 -92884
21621 -92884 -34863 -23364 29630 125208 79138 32228 -26346 -102637 -45818 8053 24448 -23411
21609 -23411 -51026 -14701 -16484 2299 9050 -51256 -75996 -22763 -53344 -109826 -112081 -124096
21597 -124096 -96219 -22942 -76816 -118264 -54861 16742 45185 -49645 -95493 -130113 -8998
21586 -8998 -27411 -15901 -71035 -55621 -88989 -85758 -129150 -118497 -76333 -119078 -74648 13105
21574 13105 48191 104061 144366 124038 122897 86501 87816 86610 -21550 -20634 -62473 -119468
21562 -119468 -91692 -100897 -94311 -36516 -37648 -7241 4325 -6405 -10323 -10271 37281 69233 64687
21549 64687 35748 21076 42081 34815 25042 63270 100008 64374 85835 25890 -45889 7871
21537 7871 -37667 -58769 -5079 43820 8911 7625 29388 -44512 -98502 -96529 -44143 -19738
21525 -19738 -1312 -50140 -92648 -99622 -122251 -44688 21511 60723 65312 -24823 -56180 -74632
21513 -74632 18600 68117 32207 79233 151448 132226 130842 127364 93530 23817 -57146 -41526
21501 -41526 -5975 -35605 -19316 -38268 -50041 -17354 -35025 19739 46173 58155 73631 43460
21489 43460 52145 -8562 47471 37307 49431 -28593 -39453 56513 79530 138337 154211 75176
21477 75176 43147 -24992 -93147 -121448 -127432 -142544 -196298 -145065 -22101 41847 38828 -72143
21465 -72143 -110022 -110170 -99373 -3793 13772 17049 -39221 -90339 -124505 -72765 70561 78805
21453 78805 8275 57872 50439 22421 -62415 -88207 -51376 -14594 -6788 22023 56384 47325
21441 47325 -5460 -33290 -69662 -83007 -64809 -80897 -27321 37197 79624 134008 160007 199083
21429 199083 191743 103937 154610 199735 188636 250578 92256 -2762 61734 108365 127007
21418 127007 113928 73494 144986 133550 134276 148193 216926 176802 174538 222475 137191 -17378
21406 -17378 -27928 9076 124173 161642 160597 157652 117658 113784 165804 203030 192421 158968
21394 158968 158934 166034 138211 136703 134596 213978 223642 212225 141193 115842 132252 168064 163475
21381 163475 152759 125526 24638 49101 74884 23648 -20771 -54194 -33021 9382 23068
21370 23068 -29193 -63178 -42184 -27180 -10093 8522 30661 481 -3129 -23252 -50211 -43808
21358 -43808 -111652 -60154 -23839 -45394 -78991 -20877 -14286 39411 52720 28536 6360 57918
21346 57918 42857 5580 -7322 -49254 -69648 -76147 -26396 36155 48178 -19068 -62754 -11828
21334 -11828 -28030 -35116 -84019 -7788 24199 17585 -13895 -20671 27314 35587 -19134 -41134
21322 -41134 -34769 -100299 -120764 45670 56668 -79703 -67020 -55087 -74161 -81153 -144782 -137657
21310 -137657 -74472 -81308 -63382 -13022 97581 115874 114880 168558 97085 19719 983 4797
21298 4797 10025 -12877 -25134 3124 -46150 -46206 -64684 -79706 -126157 -102118 -104408 -61214 -100283
21285 -100283 -9501 19257 49392 60850 46973 52787 49554 40610 30547 -34046 -91468 -154389
21273 -154389 -131655 -64629 6931 -43628 -96302 -60674 -90006 -97849 -35999 831 34430 102738
21261 102738 84548 114430 141503 104155 89240 104394 35924 -971 32837 9617 -78072
21250 -78072 -5169 7625 23128 21653 30734 38497 -11277 -13758 44837 58477 77449 49656
21238 49656 -26714 -63178 -39103 3993 44854 66457 96887 143870 116993 98420 83474 66783
21226 66783 24953 -44498 -957 124702 184106 129706 72145 82899 91736 74247 70810 1673
21214 1673 -125188 -147308 -74918 -81297 -26691 -17116 -8611 53824 92057 67969 -20851 -46454
21202 -46454 -23640 -14710 -11013 -103660 -118768 -73687 -64229 -8175 16082 69381 -5661 -64018
21190 -64018 15517 71110 18236 -14043 -2251 44772 -1802 -58275 27050 44446 -64328
21179 -64328 -97371 -84890 -45341 -57059 -18520 76793 102237 113841 153596 86185 72644 8660
21167 8660 52262 91086 42067 22916 56537 58016 23347 -11423 -27465 -57343 -94131 -96261
21155 -96261 -27887 62123 47828 -39747 -46923 -50825 -27651 -36190 14951 71532 5165 -12066
21143 -12066 -16001 -56081 -84488 -27940 16989 -23469 6227 -29617 -91012 -93371 -42252 13650
21131 13650 1872 -13923 -14630 8548 91079 101725 57460 16709 -85280 -93174 -33491 24303
21119 24303 77933 19534 37730 47884 24367 -26281 -41006 23529 31594 58765 39798 16324
21107 16324 -14729 -23077 -26960 6794 77477 189593 294387 192135 166152 218327 142158
21096 142158 92884 67338 26304 12556 76499 61357 53480 97484 109722 80641 110027 55509
21084 55509 19921 -51136 -66003 -28420 123201 185684 161494 169044 183687 161356 195020 204225
21072 204225 196998 117175 81422 135728 180520 126077 107284 115470 69711 1557 -40065 -17223
21060 -17223 -49579 -38215 -99722 -118728 -43488 40155 107858 155262 102758 73088 111388 72708
21048 72708 40998 53070 53443 68240 111662 177543 172296 44739 53333 2329 3949 58466
21036 58466 24719 -5633 99734 216227 210309 76590 63797 28901 -40861 -112163 8630
21025 8630 101747 107894 93438 114535 159957 105391 39537 28885 61383 42087 -10507 -28778
21013 -28778 6727 39870 72081 98499 46959 -33512 -65669 -41803 -5877 94185 61104
21002 61104 -5326 18398 20086 -2487 -13003 -27129 -8375 37797 13646 39155 -40102 -52903
20990 -52903 -9692 -4390 -12836 38209 47275 87744 8706 -99837 -66830 -112516 -160243 -211753
20978 -211753 -145237 -92758 6226 7498 -23760 -24469 -66465 -61395 31736 107511 71718 28464
20966 28464 28774 37622 63930 110220 15985 14874 79673 60072 69893 102728 122175 106889 51750
20953 51750 -3840 -28019 19462 86196 112667 61465 89003 91843 62823 44911 18692 -56758
20941 -56758 -34218 -108802 -97872 -59211 -53017 -8620 -2730 70009 111265 9204 -37989 23126
20929 23126 82374 106086 83226 113833 78384 40340 -19094 53329 118442 155425 161466 135751
20917 135751 126900 197111 192646 108588 139583 173158 185771 255265 253604 226547 180727 126572
20905 126572 71495 74159 133703 211725 239376 203686 188068 230897 207391 215399 244927 266884
20893 266884 229488 190245 174536 168130 287144 385747 411274 338881 370194 404123 500426
20882 500426 499231 608299 556777 610420 813689 958066 977286 901972 908553 874593 889264
20871 889264 942965 1043481 1157560 1217290 1233031 1257701 1243784 1306136 1302293 1460369 1647898
20860 1647898 1770974 1942432 2298337 2661258 3029949 3508755 4135471 4911075 6084923
20851 6084923 7811029 10448034 14628906 21952610 34720576 54525619 76901314 86107937
20843 86107937 66995538 41519990 26059797 17649894 12907579 10006998 8084791 6688893
20835 6688893 5643728 4842588 4184455 3754315 3520158 3401194 3279045 3307126 3472938
20826 3472938 3737983 4049170 4470814 5079186 6029441 7383066 9284158 12042301 16518440
20817 16518440 24513259 38687549 60109198 82400465 87183219 63909359 38935364
20810 38935364 24396431 16458147 11737669 8772552 6826101 5521391 4634917 3944946
20802 3944946 3318516 2787276 2412934 2047071 1720299 1538619 1385752 1314518 1244397 1250729
20792 1250729 1207302 1206143 1206678 1097512 964471 939282 878104 833473 824158 934309 971581
20781 971581 986553 937792 736831 509922 421598 382049 454805 433506 352413 214031 122108
20770 122108 200102 289973 278723 286709 274456 270507 272950 248936 202592 199656 259870 329791
20758 329791 299909 215428 97248 108802 160717 190145 72056 11236 90045 132308 96690
20747 96690 92913 74878 21905 -12139 -50966 -17669 87363 158592 70294 39115 -1727 -12412
20735 -12412 -27072 1763 144745 187155 188693 167290 118188 104447 -9696 23554 37253
20724 37253 8132 -10069 -6823 2150 29881 59139 139395 136331 93750 74957 28562 45600
20712 45600 83231 67892 33450 110580 124471 121400 71274 9949 -32598 -7110 107446 123932
20700 123932 120884 125132 116270 77608 17381 -64232 -65172 -70382 -37208 -40929 -50733 -79277 28769
20687 28769 122436 256873 248913 198186 76632 75731 120261 169621 173922 114196 7055 -7016
20675 -7016 56827 44616 -16592 -47006 -18735 64948 85195 65954 62296 94837 62814 60533
20663 60533 -2161 -23483 76140 110664 77883 96386 84909 -1541 52597 94132 133308 95048
20651 95048 35986 12327 23677 89089 161081 89451 73173 42180 77544 93045 124312 112571
20639 112571 43022 45837 64970 27364 51315 173914 203439 116818 -63121 -95559 -11613
20628 -11613 88867 25980 34001 38600 -26899 -116579 -32642 92702 70169 81393 108782 77884
20616 77884 38504 -55130 -45836 -31698 6738 62936 86979 92643 24206 -13575 -22496 -50833
20604 -50833 -42877 -887 38403 -22563 -59345 -79295 -130868 -44171 -11233 51842 139702 118630
20592 118630 133487 109849 101617 138774 106863 52642 109592 206710 201418 106075 -22625 -3459
20580 -3459 42078 65956 119173 110013 95899 73414 -5365 -53282 -59988 -26341 7397 47962
20568 47962 64065 135619 90416 92158 25435 26514 4619 -69552 -25640 14839 -33013 -26731
20556 -26731 27520 15076 -10109 27069 11958 -38904 -74116 -92861 -96637 -723 26241 -29379
20544 -29379 -65728 -87325 -63232 -10661 31886 7976 -32634 -93865 -60805 -5352 -28236 139
20532 139 19176 8061 44891 44408 -88170 -57753 -31765 -71758 -39243 -21652 51818 119988
20520 119988 186632 128953 73665 961 -37724 -61408 -34777 -100598 -97013 -87838 -88855 -112833
20508 -112833 -195000 -244945 -214497 -106795 -38018 -40676 -27152 12356 33211 36104 46906 102705
20496 102705 58389 -11337 -35366 -24417 -20219 -10565 21864 -63875 -47029 11725 -2236 -27105
20484 -27105 -30124 -64760 -86832 -19061 57491 88243 69412 10195 -10514 -23947 19764 4545
20472 4545 -7691 69432 110016 128549 89383 159646 150968 32078 6553 -60789 -125249 -107563
20460 -107563 -132756 -165528 -149196 -106282 -68366 -99735 -72046 -47045 11278 49153 82253
20449 82253 118835 115905 9821 -2241 49048 86119 65719 44737 60173 9085 8037 30354
20437 30354 82282 33079 -35824 -101098 -29541 -34395 -89603 -92724 -18036 -23326 -76670 67608
20425 67608 75904 25045 28352 56654 122083 101139 78624 71587 63888 -23663 -88992 12805
20413 12805 47852 2050 -1976 -4663 40027 26161 31825 51206 36740 15687 63595 80725
20401 80725 33551 -38647 -27904 -20199 -32704 65314 107279 124504 118053 98887 61535 55062
20389 55062 115977 145612 121932 104096 68647 33421 -12883 -34135 38605 94264 8709 -41600
20377 -41600 41414 36085 -57514 -94144 -65364 -26015 -65196 -72539 23688 93259 99250 42122
20365 42122 80658 119402 98679 137809 147988 126461 1385 -66101 -48065 -35475 -33986 7607
20353 7607 -29744 -1257 67038 149161 154556 140102 99014 62457 3316 23726 51815 36539
20341 36539 -23682 -114790 -93267 -17539 1949 -28361 -50025 15158 -11606 -12646 -5083 12172
20329 12172 1345 41422 31553 -1042 25847 14759 -26593 -54865 -31538 -28209 37599 45119
20317 45119 123490 102843 36227 42098 33156 -11001 26331 51562 39722 52779 54256 29129
20305 29129 -11029 8873 16999 50525 52602 28432 -22063 -30700 31403 22708 -17087 -38887
20293 -38887 9973 92167 237873 199426 145371 163294 216694 174049 126310 98490 168133
20282 168133 205690 206577 128809 118722 100955 162352 141318 119488 116495 128780 193119 225754
20270 225754 194566 132757 152950 141172 40383 58410 132862 139720 94401 35698 -7341
20259 -7341 -94104 -91079 -35099 77081 71628 13995 94823 122780 81967 86337 97406 130134
20247 130134 120347 -30172 -42648 77290 131261 162218 273591 245817 189256 225810 291375
20236 291375 301711 271182 243232 257746 223471 275621 254863 301011 308440 247172 297733 360471
20224 360471 370014 327277 373500 351324 310338 280543 118848 -8207 -48179 30295 67265
20213 67265 26774 14964 2287 1081 117333 277068 251651 251512 244490 122576 107366 83322
20201 83322 68906 -55061 19533 131699 64708 -51620 34232 137463 93460 84957 145393
20190 145393 192604 105830 48420 165764 196686 201644 164520 71854 26072 101500 171961
20179 171961 175325 188701 202669 162217 140833 127253 173390 98465 75301 19599 67974 197655
20167 197655 165339 174726 265392 281095 274580 335830 473830 469815 354352 302409 355600 403572
20155 403572 378533 381447 549753 637860 612837 736786 914213 1103262 1117366 1042001 1108558
20144 1108558 1198416 1360095 1435362 1512199 1721090 2166286 2699122 3468757 4450608 5703394
20134 5703394 6768211 7198789 6949959 6652581 6789026 7546559 9086324 11868751 16522546
20125 16522546 23499785 32346862 39861184 41064129 36937535 33628921 31206311 26147418
20117 26147418 19574690 14887252 12415680 11543622 11880457 13012657 14082736 13916836
20109 13916836 12082198 9486705 7211048 5598185 4437725 3741479 3272971 2880314
20101 2880314 2624871 2482721 2421704 2443394 2378732 2289357 2353742 2456237 2445028 2496899 2599363
20090 2599363 2650731 2761465 3000539 3463435 4077171 5088882 6356922 8211919 10666109
20081 10666109 13352229 15086119 14926113 13622814 12582151 12373531 13380102 16052795
20073 16052795 21006962 28203110 36013857 41466944 44765860 48431385 48592202 40204573
20065 40204573 28372098 19653129 14212241 11032650 9274405 8398504 8329634 8762892
20057 8762892 8974403 8307645 6712069 5090796 3873655 2999747 2428581 2064156 1769190
20048 1769190 1698062 1538130 1403039 1313906 1259772 1120620 993924 929157 814824 713747
20038 713747 614911 580514 527360 495852 514454 523696 484951 364318 278485 265999 308447
20027 308447 379103 318112 214931 236822 341491 373207 258292 218506 249132 238148 170884
20016 170884 188846 95136 65016 95190 100499 10179 -67708 -92439 -60316 30528 86969 178518
20004 178518 166484 155252 174103 139579 120140 133867 129353 164360 187534 217837 133964 84485
19992 84485 140078 215327 224103 245272 244398 229908 252082 274761 261408 220112 132098 158608
19980 158608 184481 94966 111829 226303 269046 329180 248869 186712 178092 215449 171216
19969 171216 105400 93671 72916 69832 76354 109821 113816 136513 124250 55057 -22838 12663
19957 12663 117595 174709 149538 126235 73316 -3990 -46543 -31807 18643 42588 -23959
19946 -23959 -12981 -1537 82581 156942 157658 111855 37269 28301 -1038 22622 45448 55262
19934 55262 68179 138653 161286 198725 166323 192323 195517 180336 131020 133121 104495 120675
19922 120675 43148 71875 150591 129770 79498 176874 113421 88882 54071 109307 107020 114805
19910 114805 148503 67312 -25735 -42364 -41227 1442 -41011 4728 -65910 -83829 2562 17206
19898 17206 7260 82475 55288 69478 113061 84889 61319 107772 102692 172503 125743 54935
19886 54935 1175 51375 97707 6517 -15610 18395 -87738 -159472 -100308 -61041 -46225
19875 -46225 17366 -59507 -5753 46563 64485 34903 41747 34209 44312 45063 16832 44162
19863 44162 71090 71309 94433 106558 72043 -1180 -34655 -43850 -101108 -106145 -58734 -24630
19851 -24630 -20736 -75519 -106981 -3234 96043 56299 -5924 -81799 -108779 21293 54574
19840 54574 -49793 -66912 7114 -2197 -48616 -53266 45751 99930 87322 61643 102987 134152
19828 134152 55525 51868 28293 75536 65132 32076 41258 39874 -50593 -49184 38883 -52209
19816 -52209 -97683 -10233 29659 -36288 -87612 -146789 -199380 -131863 -20718 102285 123383
19805 123383 44328 -10937 74494 83419 98551 84920 -8109 -99878 -112179 -88550 -19265 -64951
19793 -64951 -115590 -84850 -144921 -139220 -79843 -48693 -13748 -22462 22762 54503 7891 75041
19781 75041 96204 40608 3605 -2698 -17703 76401 168796 182221 102144 -32823 10225 33369
19769 33369 -56678 -50381 -57332 -73403 -18552 -24409 -8176 -32828 -4917 21041 40283 62468
19757 62468 135282 68156 -19172 -81695 -48090 40582 70122 41664 -18786 32868 192432
19746 192432 120512 16136 73396 64146 89017 140166 2578 -19613 14162 -32580 -35181
19735 -35181 -53542 -66834 -14746 43422 72500 69136 5651 22827 108708 112830 115871 81828
19723 81828 92839 126376 160452 86275 -19122 -26728 12853 -29806 -27874 -9452 26235 17602
19711 17602 -110618 -155220 -65096 66238 95872 49863 -28687 -64876 -37949 -15760 -48848
19700 -48848 -24792 -62990 -41959 90100 64876 -49446 -34847 4219 11700 -3013 43939
19689 43939 49720 -38005 -87890 8238 9262 -14606 -24212 -33845 -61679 -120813 -230139 -197390
19677 -197390 -125519 -56969 -27760 -15999 -23765 -15161 8979 -12814 -30349 1778 61334 82996
19665 82996 85746 133324 157454 68024 -44835 -49438 -33169 -16168 -24445 35687 26497 37365
19653 37365 76561 76422 39778 -46226 -26374 19421 4912 -4469 13122 109371 76993 5381
19641 5381 -44685 -10399 38550 37025 56592 97726 163749 196997 127471 18087 -83280 -132377
19629 -132377 -171350 -95330 -27458 -23611 -49195 -66099 -57612 -6697 90943 110872 107038 58277
19617 58277 38700 28413 -35041 -94148 -52952 -5888 67314 99252 78622 129344 236054
19606 236054 241186 165828 68987 85661 89541 127388 121619 167631 174041 132794 71468 80503
19594 80503 69755 18988 72110 157726 148302 95321 119519 103439 21393 -27724 -77770 -135007
19582 -135007 -151955 -129427 -88837 21408 142737 178242 79377 91725 130104 110153 144154
19571 144154 102449 154849 232161 209427 138296 145480 192210 174186 249576 299107 285360 235183
19559 235183 102478 23607 7048 128639 266578 282891 173642 152222 212488 256126 241644
19548 241644 167559 140538 168862 170803 205274 299247 258034 214845 243332 193447 153325 140743
19536 140743 226250 250984 268968 305577 269265 237264 253106 238700 155400 155199 195321 286062
19524 286062 244458 216006 187747 198397 302072 346255 308831 237384 173814 249523 351408
19513 351408 404562 326231 266810 352612 451053 434108 466950 492521 418718 386549 480408
19502 480408 582723 663971 797301 818862 774914 768529 832918 944976 1110708 1269364 1433115
19491 1433115 1546389 1635114 1582301 1650511 1888532 2189765 2691242 3436284 4247520 5365604
19481 5365604 6813700 8158203 8716104 8421213 8103922 8270424 9246133 11342344 14970860
19472 14970860 20744812 29504233 40268701 48473329 48719797 43833047 39782742 34982059
19464 34982059 27325428 20199964 15734439 13323253 12415780 12819871 14041234 15327673
19456 15327673 15449366 13533786 10604231 8108749 6328557 5075172 4236230 3506522
19448 3506522 3043435 2808681 2667663 2609285 2558346 2463589 2334989 2254968 2314754 2277340
19438 2277340 2274525 2316796 2305800 2378145 2576856 2995493 3521618 4239731 5382866 7035553
19428 7035553 9377059 11956012 13770821 13809092 12528358 11356679 11137105 12238576 15178450
19419 15178450 20158161 26488939 32088288 34763006 37354648 41048027 40560520 32397447
19411 32397447 22507139 15647896 11413056 8974589 7642855 7001360 6884912 7187497
19403 7187497 7429923 6970887 5730882 4311089 3240173 2606922 2160014 1890993 1644470
19394 1644470 1494152 1458051 1427288 1314199 1182588 1006404 869112 751536 603799 610588
19384 610588 549892 508691 489035 495522 422337 395947 395458 326534 244258 141317 98276 105172
19372 105172 126573 82385 86467 172972 220926 210330 244687 264133 307156 321619 342039 355597
19360 355597 300481 247841 235618 263315 339224 447755 480215 516008 579881 629874 662183
19349 662183 570478 373118 294857 226783 133977 105457 151066 302526 297350 268699 202710
19338 202710 206978 192151 159050 189567 184216 129857 117675 136018 132539 124041 166842 256376
19326 256376 183842 86085 -25506 -21078 34284 36229 16324 28852 31202 62953 37996 3702
19314 3702 50444 82321 31370 -38794 -79727 -86866 8197 44250 28047 54560 10888 62793
19302 62793 175470 170394 155368 195808 124816 112905 86539 91894 106997 114865 32556 55791
19290 55791 70075 22775 14576 23101 73796 152173 108845 46879 20566 -33877 -14194 30827
19278 30827 92176 53914 44692 2849 9415 -32364 -74323 -62215 -104511 -14224 70757 71819
19266 71819 108376 180348 199758 107546 9087 -17978 -93256 -29606 -43648 -50649 -39443 -38043
19254 -38043 -42464 -66202 -40602 36022 31829 -12174 -170997 -195464 -96844 -3851 -64748 -70900
19242 -70900 -27782 -42036 -14506 6356 -8470 11449 -64691 -64896 -745 31258 3950 -32460
19230 -32460 -35224 -35512 -85224 -135650 -91507 7106 87486 95946 25012 -10473 38417 92221
19218 92221 84318 36722 47201 1210 -66706 -45175 8402 -26104 -3134 33983 1036 -45766
19206 -45766 -46808 -72643 -139506 -189437 -82374 -16628 8730 82777 87025 44185 53962 -20943
19194 -20943 -57093 -98626 -53496 19094 126943 201343 205932 52192 -23111 -28176 -44428 -13477
19182 -13477 9031 -7655 -35888 -49 19231 38611 57757 52323 11313 -15734 -15943 -11200
19170 -11200 -9803 -4593 -10623 -45801 -31212 5914 -9231 -42769 -6327 -14933 38143 102756
19158 102756 109637 78163 31767 15151 26220 2268 24597 76612 81023 94105 52805 75582
19146 75582 81585 66239 45737 84688 35603 5067 73640 86273 46374 92625 74273 76191
19134 76191 134199 189268 189966 205890 107961 174588 232412 236399 247885 261214 259861 238522
19122 238522 288558 394253 410764 402219 337739 309542 296012 200337 170617 113895 104898 199916
19110 199916 267995 243874 181775 189398 200812 186818 201324 184481 85615 2183 -6250 -17104
19098 -17104 51965 36081 -69528 -83529 -17294 23362 78405 58502 29748 -9417 12864
19087 12864 73624 104243 43429 8916 26969 138406 125454 68636 57210 118554 140378
19076 140378 115175 65812 128306 112442 220975 344496 397592 398031 387136 402420 413169
19065 413169 315419 264694 221733 177989 185458 239455 178927 125535 102322 127294 150169 145090
19053 145090 95016 -1721 6691 18985 59914 13597 84993 40888 58208 23144 -10603 -33095
19041 -33095 -24226 -47311 -135824 -66495 -3649 19442 25141 31268 44246 82419 91439 83632 74591
19028 74591 7807 -39668 -19786 -2780 -18019 -69406 -102436 -79564 -62393 -2417 25323 82416
19016 82416 36693 -23122 -80530 -24186 18070 25293 48727 74816 149742 176149 140474 94310
19004 94310 79619 49074 -11973 -28322 -33157 -72981 -9934 28822 46961 50945 112688 77955
18992 77955 -39801 -134463 -229355 -275901 -196867 -131549 -1314 37678 -21591 -75501 -107235
18981 -107235 -56037 35713 11571 42976 65172 81097 65456 35821 -37459 -22804 -47624
18970 -47624 -77569 24035 -7259 -73950 -41472 14075 -12720 13516 -35932 673 48487
18959 48487 44790 6978 -30762 -64598 -29803 10119 50221 41791 28016 84256 101668 157974
18947 157974 151597 142730 81839 28628 19434 -28530 -40905 -27014 30810 -17023 -23821 30565
18935 30565 62273 -46979 -22000 37475 40615 125232 206218 222951 122615 99065 108153 126015
18923 126015 62741 -29995 -47030 -83258 -175606 -186605 -54918 -85384 -102850 -30208 40789
18912 40789 -52748 -83748 4359 13456 -61418 -38918 -26924 53184 87300 66488 84648 128784
18900 128784 64717 55122 63271 65485 115472 99358 116998 132164 168205 147613 121758 100626
18888 100626 169029 157632 66548 24944 -44349 -9434 97524 119096 113350 97297 -39860
18877 -39860 -137855 -145482 -117074 -105006 -67992 -47585 -7739 40275 40725 36560 -24292 -109510
18865 -109510 -155512 -85363 -50791 -78607 -128410 -123846 -35998 -49353 -87814 -62583 28769 113691
18853 113691 88890 82135 107864 74490 -22864 -94860 -41023 -67211 -63127 -47297 13259 -4464
18841 -4464 -79268 -96231 -94219 -60027 -5447 10896 -76780 -82958 -67334 -83317 -86482 -28412
18829 -28412 -17577 -70309 -93490 -49055 -21903 -38611 9942 46854 33218 -14384 -33496 -134507
18817 -134507 -145289 -66872 -53294 26563 27273 -317 -58369 -50182 -63898 42779 98635 67400
18805 67400 2881 -86608 -70534 -89999 -54778 -18032 1669 -44777 -151774 -142088 -138303 -75899
18793 -75899 54124 114346 80586 13004 -20930 32964 109371 47986 16214 83736 70201
18782 70201 27691 -34461 -39491 -53642 -127167 -109422 -19714 47900 127930 84123 127714 25699
18770 25699 -64429 16620 31629 11210 6776 -53174 -106304 8084 66809 109940 67655 -37889
18758 -37889 -81136 -26686 27807 6807 -28885 -34173 -7896 31223 94807 5833 -49002 -94108
18746 -94108 -98177 2714 109815 55609 60058 85150 53668 16768 10171 -13867 12812 75537
18734 75537 -39992 14862 72454 31327 53690 107001 82844 40557 1325 29677 22907 -22565
18722 -22565 -32466 -4817 -82041 -78203 -72750 -119579 -123396 -24781 -65946 -146142 -120154 -105354
18710 -105354 -101357 -103743 -103490 -99294 -55010 -102904 -70349 -53165 4033 49493 -4439 5750
18698 5750 30554 -66218 -83592 -32259 78397 144194 124130 -436 -16029 -21779 15700 -63387
18686 -63387 -66587 -1810 9993 -92264 -78810 -113443 -81879 -89720 -126726 -191433 -109683 -3153
18674 -3153 4759 -51506 -112380 -69329 29122 48713 56766 99141 71688 48247 178052 216549
18662 216549 144693 113957 137176 98822 88196 56571 60258 107346 186868 192037 166881 160168
18650 160168 97586 98650 137721 176494 183188 92850 57307 112699 99708 60167 84311 115662
18638 115662 95046 49425 55294 -24136 4514 64620 94706 62527 64814 191 -28865 -50620
18626 -50620 -39529 -33520 -49349 -42955 -6003 -57426 -70871 -33726 9386 -19765 8479 64078
18614 64078 109429 147918 114611 75645 71517 105943 160678 101665 111390 68177 9365 68822
18602 68822 221322 245413 202308 173936 155700 202245 326916 321682 277472 264390 365817
18591 365817 421352 409996 469902 529050 608662 722854 827772 899008 931835 1134124 1439863
18580 1439863 1721147 2131268 2638440 3583743 5184107 8052891 12822912 18989423 23328504
18571 23328504 20547805 13410639 8352324 5634336 4132010 3098661 2370792 1987982
18563 1987982 1825618 1752917 1641198 1581347 1540817 1479214 1404576 1395997 1467671 1564011 1785399
18552 1785399 2065159 2397385 2870457 3514933 4351350 5643829 7667784 11099101 17154214
18543 17154214 26720318 37897189 43797014 36674147 23794486 14877986 9917504 7093764
18535 7093764 5280860 4147820 3369987 2879511 2611842 2409076 2080316 1800305 1541018
18526 1541018 1378057 1247856 1210406 1225934 1250757 1368745 1577405 1748050 2003133 2325827
18516 2325827 2954643 3951094 5814918 8993615 14105114 19879730 22213386 17291806
18508 17291806 10712672 6591007 4346813 3126046 2312208 1781317 1417501 1209940 1137725
18499 1137725 1018353 862360 768975 662239 537309 400749 315400 280862 306210 263062
18489 263062 187522 153844 224678 244142 276232 230467 197328 156745 137566 216583 264492
18478 264492 250187 120064 17966 33237 119452 103863 36907 -22871 -23795 32225 76024
18467 76024 141255 124966 16270 -10253 18975 -15094 26954 35483 35334 -15870 -54218 28839
18455 28839 130280 160988 199447 153196 96963 23642 -25338 -50506 -67481 -48675 -61899
18444 -61899 -15449 -8431 -50144 -102654 -80909 -61223 -77435 -57798 93939 162292 215145 136696
18432 136696 83322 44365 85370 65474 49277 14028 21297 47915 -12001 -15207 36223 -21332
18420 -21332 -31115 47755 106040 81104 35836 91803 153634 71632 39878 96026 70753 -408
18408 -408 -69164 -121651 -103414 -38201 6058 46449 37046 -11254 -14103 21308 -62497 -66782 -66036
18395 -66036 -57637 -44774 -4304 32698 -4670 -39698 35112 66604 36247 -21827 -18936 39624
18383 39624 87062 57624 -19853 -66850 -89545 -112069 -90000 -42342 -70096 -79992 -105064 -172614
18371 -172614 -179083 -145909 -144602 -123563 -55939 -69627 -96112 -95755 -58386 -92441 -123791 -87040
18359 -87040 13397 -1083 16397 -65346 -134287 -230394 -124905 36792 66642 -2080 -19358
18348 -19358 -131990 -125228 -80128 -100005 -118411 -127559 -144055 -105367 -107606 -96499 -164464 -170092
18336 -170092 -170510 -190485 -186293 -163503 -137349 -143034 -105455 -60459 -36224 -30109 -86078 -55469
18324 -55469 8166 59929 38692 -9882 49635 44619 47117 176545 191627 87365 87231 23298
18312 23298 -43996 -83541 -101721 -55709 -41937 -85540 -99159 -131311 -99813 -16096 -67832 -97129
18300 -97129 -69765 -28583 55631 81161 35401 41948 6849 31920 33541 -38782 42854 14552
18288 14552 -59374 -83910 35354 64750 25517 -15828 -59963 -60685 -58972 -37629 -8561 -28583
18276 -28583 -49080 -9846 1562 32778 70998 24352 31863 8817 13061 -20188 -18944 -1883
18264 -1883 96047 22452 8202 40407 24146 35964 48243 94052 38199 -10670 78081 104192
18252 104192 56309 -27330 -90200 -126704 -96538 -68644 -97120 -33279 -79482 27988 70322
18241 70322 -45446 -129185 -68076 -19611 8264 -32364 -35705 61447 68902 -11889 -83396 -95981
18229 -95981 7450 -42382 -101018 -134083 -143024 -65357 -62445 -43530 -29557 8913 38347 44932
18217 44932 80018 65727 12633 -38393 -68458 -7180 -62942 -182804 -256932 -278253 -266102
18206 -266102 -173601 -91981 -49610 -74094 -110883 -122302 -183474 -87516 -43865 -223567 -196160
18195 -196160 -125500 -48931 -32824 -29957 -37627 -52443 -109986 -44362 -72739 -81856 -58622 -44064
18183 -44064 -68718 -37255 -19673 50353 -16639 -101435 -151169 -127287 -85410 -102320 -75480 -51982
18171 -51982 -103914 -86644 -91057 -106669 -145500 -106930 -72648 -126439 -64789 -55371 -32071 -68679
18159 -68679 -134149 -182337 -132331 -66227 -21570 15222 -44892 -58780 -25225 12424 -2604 -11853
18147 -11853 -25740 -51406 -124111 -180358 -169001 -218190 -205473 -113253 -117053 -121857 -4262 34804
18135 34804 37988 -41196 -52469 -44245 -86092 -165403 -120458 -77617 -96178 -121383 -61618 -78005
18123 -78005 -163727 -208010 -198534 -154219 -43595 12701 51233 18623 -49403 -15911 10709 7888
18111 7888 40947 -13576 -68455 -55399 -68190 11598 106701 44017 11392 -45318 -93569 -149327
18099 -149327 -171486 -158685 -165466 -169020 -132162 -100220 -130550 -163075 -148479 -152714 -197568 -93645
18087 -93645 -23091 -27965 -30688 53593 13103 -76672 -41249 -11879 2052 46590 -41866 -145337
18075 -145337 -76883 -31321 23348 -36464 561 -48403 -112851 -74127 -52486 -115635 -60304
18064 -60304 91689 111004 150516 71317 -65416 -67234 -14232 -21757 -99506 -38098 -35627 -113171
18052 -113171 -205706 -213024 -154882 -19463 54012 13936 -89127 -150653 -87792 6485 31982
18041 31982 10652 68758 37778 10006 65771 68882 -19460 -102728 -102329 -118171 -52366 -22731
18029 -22731 21704 23942 60844 33815 69185 65853 37897 4381 57735 61339 71658 37413
18017 37413 35996 -40580 -89059 -15755 76449 66436 6480 -36093 -993 101217 137646 93849
18005 93849 94698 50988 17609 -19869 -38954 -88259 14746 131057 96603 19857 72003 148903
17993 148903 50301 -6642 -53641 -93570 -96955 -15894 -81718 -149343 -116983 -118957 -106830 -95823
17981 -95823 -14596 85377 99904 135885 152879 85586 16739 -77154 -104394 -132449 -106896 -22617
17969 -22617 93109 133749 100818 78282 49546 67178 75547 58174 6289 -57854 -108138 -91432
17957 -91432 -70683 -75681 -52549 -19053 36254 19530 -27169 -29307 -91877 -40302 -23692 -1676
17945 -1676 -23095 -73194 -133451 -115762 -150199 -77571 15963 74636 77690 -2490 -93503 -81467
17933 -81467 -18688 5598 71644 3676 -87435 -104851 -153536 -87889 13422 -35830 -34821 4691
17921 4691 34930 41387 50129 129433 122982 88426 -14218 -32839 15376 33200 15255 -40857
17909 -40857 -73529 11067 13394 -66039 -89357 -20427 42498 60938 33667 -53101 -48187 -45604
17897 -45604 22362 11327 -77607 -96613 4205 37954 37387 9526 -42030 28662 45141 -21418
17885 -21418 -42719 -107797 -85975 -86465 -79639 -107862 -92848 -92588 -39563 -12551 -51370 -33221 -12310
17872 -12310 39250 108562 58668 -6960 -12006 15532 38629 -7300 8839 74030 51594 28399
17860 28399 39791 -13651 -38873 -72046 -22461 1697 96078 97733 -23618 -91622 -59826 -70787
17848 -70787 -62599 -76442 -112569 -92382 -80519 -135092 -143672 -51246 -20397 -75 14934 70879
17836 70879 21834 -95686 -85736 4358 30178 38816 7726 -47490 -76848 -70241 -25782 -8988
17824 -8988 -45656 8895 -41432 -22291 18758 48115 52857 64348 109079 132906 63251 21870
17812 21870 97830 13981 -37145 -114052 -82940 -72885 -105915 -48693 -48864 -61541 -65916 -147547
17800 -147547 -200752 -162397 -96491 -56770 -78361 -60634 -88602 -44520 -50836 -137936 -172624 -144157
17788 -144157 -29810 41174 -71467 -143004 -132896 11973 116048 121485 63434 20349 -30991
17777 -30991 -41661 -47849 -14616 -61839 -113656 -76662 -48405 -44484 14814 27203 -11276 11796
17765 11796 -2501 14127 -51585 -36937 -49124 -69598 -72223 -24230 48408 -27736 -66982 -119949
17753 -119949 -7539 51087 -14079 -66488 -129049 -99280 -80368 -62290 -87675 -146793 -103845
17742 -103845 9771 31262 -29267 -70405 -50016 -87443 -30497 -16225 -30371 -5834 32777
17731 32777 25868 -38470 -88298 -57418 -41891 -19253 19786 -88602 -112521 -123471 -168770 -155348
17719 -155348 -141833 -197823 -287187 -272490 -173142 -88490 -57390 -64476 -98358 -154201 -144063 -121499
17707 -121499 -143015 -168021 -167367 -169212 -101981 -18928 36440 -13758 -64451 -26304 -40606 -120166
17695 -120166 -115937 -127791 -68156 -7947 28485 91502 -17135 -27694 81733 90682 47162
17684 47162 14664 -50371 -143848 -111967 -9879 6079 47618 79173 84366 -22896 5742
17673 5742 -19545 -101239 -115440 -187215 -132854 -95185 -63444 -131851 -186116 -229501 -178312 -55015
17661 -55015 -39907 15735 30989 85196 96440 22887 29917 43591 56056 35495 -15849 -70166
17649 -70166 -79460 -11880 10894 69739 41672 -17795 63982 59594 -38977 -25337 -59930 -79082
17637 -79082 -17117 9620 12422 -19390 10688 24247 -16604 -39180 -20000 -38504 -55564 -18706
17625 -18706 36254 22130 23797 57672 -33650 -114057 -176668 -151893 -103738 -51361 17521 18384
17613 18384 13196 15161 -4562 -85411 -35794 -42823 -9103 40513 -2233 -45159 -54808 -11538
17601 -11538 -52047 -75885 17286 -55044 -116054 -87658 -37746 -102887 -123766 -136088 -167978 -141524
17589 -141524 -82946 -125889 -181003 -128363 -75652 -25588 36040 95936 127625 119436 73069 135220
17577 135220 102069 88433 78984 102003 84307 29715 28115 58598 81317 143283 132196 107249
17565 107249 126336 141398 121128 82206 60219 9274 -23561 -49350 -149884 -200819 -142998
17554 -142998 -67202 24819 91711 126076 88101 23972 -64611 13066 74067 63651 52308
17543 52308 96764 44024 -44479 -27317 18839 56687 116074 4625 -91365 -14228 -18916 2743
17531 2743 -30668 -92402 -93075 -107917 -110508 -63655 -67243 -24361 24143 1918 -92813 -140476 -125925
17518 -125925 -131540 -124045 -169120 -110110 -92924 -122883 -100323 -118743 -81766 -5880 -43139 -84987
17506 -84987 -57457 -15811 -22410 -5660 -81879 -177223 -227989 -209924 -157648 -102794 -68413 -105157
17494 -105157 -131551 -123884 -41705 -6486 -22755 -42596 -103977 -109482 -175645 -196290 -160671 -90141
17482 -90141 -142922 -168319 -75296 -9930 -1165 -67171 -33865 21007 58256 33960 45106 -54518
17470 -54518 -154680 -160036 -84913 -38942 -33022 34519 77336 89223 58868 52992 -47013 -70510
17458 -70510 -9287 34945 -75034 -81253 -85474 -112698 -116767 -51678 -95979 -137691 -82971 -37695
17446 -37695 -39021 23058 -69521 -77257 -35106 -35375 -81676 -62864 -114352 -170196 -156074 -108828
17434 -108828 -81191 -89538 -85196 -83620 31125 28434 43797 54185 120535 257706 182684 49967
17422 49967 -104894 -64389 -135377 -199266 -100436 -30912 -2143 -72596 -28163 -10071 -5388 -99645
17410 -99645 -150519 -188528 -109697 -33980 -28577 34641 37777 -55995 -148992 -196205 -272272 -211236
17398 -211236 -91861 26724 68132 11474 47313 142750 107114 -20894 -81213 -73678 -96534
17387 -96534 -111842 -112568 -70833 -85240 -105516 -71124 -16276 -80926 -151846 -155607 -162118 -136943
17375 -136943 -79481 -53861 -16323 67211 89002 94148 75902 61324 -38268 -173197 -125068
17364 -125068 -73174 -105766 -115666 -82223 -72157 -110721 -110470 -101315 -93543 -101833 -113132 -51217 -67153
17351 -67153 -91964 -40367 -39884 -15060 3563 -19918 -20768 -31307 16526 1371 -8784 -7764 25368
17338 25368 53824 105827 105903 -10271 -71414 -7718 -17949 -70750 -59797 -69818 -117795 -72601
17326 -72601 7731 -5225 -133053 -170101 -143280 -105603 -90739 -114050 -30803 -17478 -95392
17315 -95392 -136473 -105745 -7623 9261 -8451 -79620 -103746 -102440 -87838 46329 42619 41279
17303 41279 -65781 -121405 -161080 -159528 -181626 -88253 25289 44551 20344 -16410 85097
17292 85097 81610 67717 58601 -30400 -71324 -65491 -53449 -63220 -71866 -97122 -118781 -120261 -117311
17279 -117311 -64009 -60894 -76943 -67371 -71740 -48952 -16541 -39063 -46757 9774 -22650 -36308
17267 -36308 -31328 34922 -63942 -79703 -59467 -103779 -105780 16278 -25862 -20729 -30875 -65786
17255 -65786 -94187 -94014 -60051 66298 51567 -48517 -27353 20552 -6385 -74410 -42880 -33518
17243 -33518 52166 120117 106779 19483 13885 -5248 -82937 -108412 -61800 -8202 29095 -49178
17231 -49178 -158829 -184892 -133092 -20081 22015 -5554 27011 -51575 -104680 -110786 -118347 -116197
17219 -116197 -74819 -93403 -130749 -125619 -94379 -56329 -7203 -36367 -64167 -51566 -46764 -99982
17207 -99982 -100441 -83513 -62612 -69383 -104355 -140798 -125132 -46730 1841 33171 45913 42263
17195 42263 -25808 5506 10154 7771 -32333 -64382 -72045 -73149 2939 44142 153871 95714
17183 95714 -57086 21630 138524 218212 138600 60663 22803 -30094 -59699 -13701 -15233
17172 -15233 -84983 -74956 -85621 -135775 -71076 13363 63669 44162 68889 45986 -45074 -70807
17160 -70807 -157279 -179068 -88997 21578 69913 84900 51347 18658 12499 16342 8377 46490
17148 46490 14835 -25619 -68695 -77558 -12793 -42978 -85762 -94812 -23413 17876 6681 -28364
17136 -28364 -98475 -103474 -198646 -171751 -131417 -66478 -49252 -54617 -102955 -126419 -159910 -108951
17124 -108951 -126942 -103979 -24500 1180 -24655 -46860 -30606 3903 -41945 -117774 -38150
17113 -38150 -7409 -57538 -150701 -134672 22789 15497 3305 7421 42126 69891 13239 -36331
17101 -36331 -9582 -18564 -34643 -58748 -39269 -33934 11797 91183 88363 61661 67813 1126
17089 1126 -56709 -39695 -57726 -4008 49679 36427 11375 -13134 -59736 -37366 153 12755
17077 12755 -34595 -99537 -33095 25121 -8779 -21707 -13350 -33586 -60531 -52959 -48896 -97590
17065 -97590 -87089 -31405 6102 17776 -27191 -106731 -113016 -92646 -125601 -91889 -53700 -47522
17053 -47522 -53353 -104403 -53897 -51006 45610 98751 20449 -42580 -43019 -27669 57035 58308 29701
17040 29701 35535 25007 -35180 -45567 -17230 -50191 -48469 -31573 -16841 31127 90635 51893
17028 51893 11763 6484 -26794 -48201 -73830 -48440 7912 93462 105453 153248 105530 97852
17016 97852 164077 77665 -32299 -73036 -54907 -27375 -22238 -116264 -140072 -43237 -49260 -9641
17004 -9641 13329 25527 4367 -21852 -29417 -58138 -47940 -51533 -50834 -66169 -95017 -69561 6678
16991 6678 24453 -23276 5956 20630 70188 8439 -66102 -12003 -7951 1187 -42866 -65604
16979 -65604 -37956 -44569 -80936 -80380 -1309 74179 46157 35411 54343 49410 104549 131340
16967 131340 152317 166491 44922 -48945 -48125 47075 -28528 -1849 19895 -8935 70185 43675
16955 43675 9001 29897 14667 -18473 23968 58047 59246 -47741 -117834 -90688 -33650 62617
16943 62617 10437 -51871 46990 72341 56432 139576 140574 40621 -4815 5433 76852 59562
16931 59562 -22650 5408 124427 159353 148388 661 -55399 25894 57148 7165 -39041
16920 -39041 -36055 25228 79700 77684 35468 47615 72462 -17826 -14947 -37348 -68121 -76919
16908 -76919 -59266 -7495 31648 18926 -33339 -107486 -101558 -123072 -99315 -10964 49227 18488
16896 18488 -63349 -128548 -54094 3530 -3302 -48015 18689 93703 84531 47314 -8489 -72600
16884 -72600 -66156 -16652 21856 57742 56561 62350 23044 61899 80103 33711 11788 -75294
16872 -75294 -58945 -81465 -74725 -39842 -50930 -26586 -11530 -109524 -82359 -23104 36386 59493
16860 59493 64183 37735 2895 28799 17382 8385 33062 21376 13476 -10236 -61995 24689
16848 24689 73046 74673 37978 -22832 -23333 -18772 14676 55175 -2374 -22359 3772 -10 4317
16835 4317 -52500 -117720 -53490 -6329 31549 46739 16006 -108926 -154380 -74974 -51521 -35055
16823 -35055 -51053 21286 52965 66690 31662 -79664 -136276 -94035 -62206 35691 125127
16812 125127 137436 97165 52798 41593 -59968 -36020 37075 -7519 14139 73118 110447
16801 110447 98038 12604 -65434 -106770 -64973 -110714 -143126 -61216 -8118 -920 32593 39636
16789 39636 1113 43659 33757 -22062 15958 -34683 -1570 50571 30647 10885 45864 32335
16777 32335 10133 65436 81677 69671 71520 121323 128541 51378 -43603 -74509 -50888 -26372
16765 -26372 -75133 -146392 -178701 -57311 14740 36694 29028 -16273 9148 -28698 -56911 -43763
16753 -43763 21844 -11191 -114840 -74473 -2057 -18031 -29868 -40292 -68132 -33611 71559
16742 71559 81228 22163 -4327 10762 18460 -6951 -11508 82475 42296 66078 29616 20025
16730 20025 17083 27144 51683 118230 157363 158159 113626 35580 -2413 24469 52598 29918
16718 29918 62264 44873 17295 83394 74870 2317 6838 52787 64040 44295 50003 95885
16706 95885 89250 -20182 -66456 -52451 12751 28201 94421 27444 18553 25977 13703 -338
16694 -338 -17477 63361 120501 14162 -56188 -52605 -80415 -50017 -87045 -68685 -44005 -47087
16682 -47087 -81225 -108925 -133870 -103248 -71234 -30169 -11590 -11615 52156 83964 13472 -37141
16670 -37141 -51316 -84064 -104182 -117687 -132817 -144303 -50778 -27541 -26915 -65355 -79378 -54015
16658 -54015 -16086 31735 18266 40427 7230 -52956 -91614 -22839 -6793 10985 -69068 -45519
16646 -45519 27506 30917 33460 25269 -29798 23457 84457 59992 -16158 -32679 -13353 -54041
16634 -54041 -21998 -44423 -88850 -151705 -169524 -113716 -36836 25242 65740 38139 58723 23302
16622 23302 3431 33751 13054 -21907 23805 42392 11855 3113 9973 16251 -83440 -123019
16610 -123019 -99214 -59397 61482 49301 89629 62965 42526 41781 14115 -119372 -103639
16599 -103639 -100912 -35974 -737 -48282 -51144 -54846 -44354 -38889 -11091 25678 58729 97122
16587 97122 48045 79193 136745 167074 103208 39116 -8419 -4867 -24558 -62726 -72272 -45252
16575 -45252 -39443 -43819 -21588 -14918 -48768 -5787 12745 -10251 49106 39667 -2938 -15313
16563 -15313 -1249 52856 44550 36763 64148 60648 7504 -137063 -163022 -91995 -86334 -120530
16551 -120530 -41253 31567 140249 55134 1931 14735 -28298 -93460 -62170 11215 66158
16540 66158 79441 21750 -2485 -29197 -51779 -32135 -34850 -19985 -46377 -27085 -30260 -45004
16528 -45004 -35081 -112635 -118588 5564 81159 91341 78244 49258 75851 68304 107445 57209
16516 57209 17380 81606 45677 34371 20683 -59051 -113281 -227005 -250949 -151511 -18025
16505 -18025 37291 70388 116906 156112 183728 136118 27241 36765 61572 119196 122179 122785
16493 122785 118947 82846 15594 57028 57049 -756 -26852 -45851 7957 15234 66711 58369 -764
16480 -764 -9673 -84722 -61150 -35788 30638 -24891 -124646 -115581 -70647 -24282 -50736 -113840
16468 -113840 -119948 -140213 -123764 -100842 -79309 -49842 -99139 -64857 -23500 35270 2808 -37153
16456 -37153 -50302 -50873 -56575 -28417 -51403 -95392 -90080 -92569 -68949 -153581 -273555 -259826
16444 -259826 -110001 -15796 -42085 -135479 -119005 -52172 -27424 -63881 -104299 -129098 -71239
16433 -71239 42910 32908 57199 111201 141888 21595 -31253 2210 -19133 -108205 -66418
16422 -66418 -4606 -42131 -129550 -121975 -77998 -99182 -66495 -64870 -81738 -86460 -66892 -93895
16410 -93895 -64538 -39448 -51825 -38027 12782 -15753 -13187 -1019 -17046 29026 109748 30628
16398 30628 -33222 -51167 6763 39147 -3879 -27071 1442 -25685 -143921 -171786 -119188
16387 -119188 -163573 -173683 -131058 -78986 26501 70929 48453 -2535 -151781 -152301 -36983
16376 -36983 -73098 -67360 -72633 -89944 -183088 -144108 -21360 -6934 -39564 -90073 -61646 -142656
16364 -142656 -156920 -80700 -83629 -65007 -121028 -77402 38763 1681 27119 78928 90970
16353 90970 138456 55915 -95384 -80604 -592 8268 -1821 -39191 -27819 -64746 -29457 -14707
16341 -14707 -4125 34386 74944 104863 181706 128047 44865 77156 37332 -18662 -7616 -26247
16329 -26247 -153569 -141834 -48996 56250 35658 44748 51418 18464 -45917 -99775 -18523 15097
16317 15097 -38796 -90127 -45475 -4640 -28414 48245 59982 -41588 -69171 21634 5180
16306 5180 -83266 -170901 -79889 -21081 109584 71104 -56489 -197893 -207581 -109071 -79774
16295 -79774 -66654 -41443 -36371 -16649 -7768 -24330 17400 19631 -85622 -124140 -116966 -64097
16283 -64097 -34969 375 -1787 -71976 -162369 -108353 12993 48502 -22954 -15841 -24889 14017
16271 14017 -40544 -135865 -111816 -10048 70144 10192 -85776 -176751 -98406 -16301 -67508
16260 -67508 18603 126241 29861 -4743 30970 40180 71306 32771 -7192 -76040 -86101 35089
16248 35089 -18032 -23968 -55146 -56246 43228 -796 -61936 -51285 -33499 -18261 46075 19813
16236 19813 -18958 88486 134281 68820 -39785 -21951 -4716 13270 -17317 -68364 -66833
16225 -66833 -15221 -22193 -4575 89415 107393 43437 40100 17060 38139 19639 1950 8651
16213 8651 -27771 12521 4518 24345 -22502 18980 19443 -110199 -184631 -93107 -109915 -34854
16201 -34854 -65784 2795 30346 -4354 -3790 77536 80719 -6064 3235 -95788 -201448 -156732
16189 -156732 -47714 36042 125874 152349 36192 -27199 -73283 -100734 -42682 -71215 -131780
16178 -131780 -137424 -100255 -75141 -64314 -75856 -77710 -35980 41851 67103 -5119 -26397 -21504
16166 -21504 1757 -67149 -160229 -84733 -72563 -82237 -29676 -21788 -66317 -40061 -47898 -53877
16154 -53877 60256 185150 249289 118017 52376 -49478 -63278 -103556 -107763 -11541 33618
16143 33618 -3158 -109462 -36837 89072 74820 -20502 -53334 -69172 -44892 -8281 -79929
16132 -79929 -208344 -176939 -138717 -164904 -106438 -17000 -59801 -75398 -20051 -17957 65828 91100
16120 91100 1221 39296 125321 146961 204932 119058 20500 10966 77948 36230 25826 18754
16108 18754 70900 85003 117711 -4593 15986 28963 -5017 -22955 -39912 -174244 -207316
16097 -207316 -241237 -196091 -161522 -78337 -12446 8661 4646 1272 29270 35977 -14268 -74544
16085 -74544 -77851 -53282 -3729 31806 66465 28315 77918 46218 -26219 4581 -1031 -51170
16073 -51170 -56410 -7616 -30258 -3439 -7496 -25685 -39988 16507 148541 195229 136500 91100
16061 91100 149832 156328 158622 109514 120115 93211 23482 109021 160884 195079 210566 102087
16049 102087 36184 32838 -11339 -36505 -65871 -29632 65587 126816 65710 99443 147847 23118
16037 23118 -26291 2156 24435 -38650 31943 79632 101037 157476 97612 -77458 -133884
16026 -133884 -95000 240 -27516 -44952 -40761 -15000 25051 22140 56181 64934 77305 135159
16014 135159 68693 -70077 -97426 -14622 17297 45105 17283 37919 45628 87155 95275 76559
16002 76559 45253 88714 154480 147446 184050 170964 8152 -100513 -72978 -110206 -120031 -130787
15990 -130787 -96369 2887 19200 -74014 -27941 8297 -12116 -65894 -63954 11703 27170 47677
15978 47677 -18688 -139390 -148830 -92337 -106315 -144793 -117177 -13421 39376 94070 147381
15967 147381 30061 -3220 2312 6557 26771 -9951 -73889 -124400 -75011 -51928 -62043 -149710
15955 -149710 -73249 -1396 -29220 -105013 -77653 -22405 -20726 -55964 -39469 -67631 10065 131240
15943 131240 135443 63666 29942 -14546 -58390 37220 49534 43689 15299 -67412 -152239 -177935
15931 -177935 -109735 -30083 -15528 88398 60372 -77366 -54809 61309 64042 79550 48559
15920 48559 -35752 -66275 -48538 -67096 -55784 -31262 -51568 12317 228 -966 2159 16139
15908 16139 67850 -3162 -73219 -49952 2363 38072 -24975 -25804 10408 -6044 -27250 -116723
15896 -116723 -126231 -72453 -20152 -15177 -2168 -12884 -8358 -88186 -110242 -62403 -54902 -31596
15884 -31596 34219 102555 99205 35209 25885 28048 3452 -2174 -26393 -54452 -73152 -5841
15872 -5841 62026 45412 92681 82160 87070 59063 10515 33475 33854 44229 -69870 -94242
15860 -94242 -157283 -156973 -145313 -111094 -112213 -62813 -22246 704 7090 56873 102374 33403
15848 33403 -74090 -82692 -8465 47167 87593 5571 -18497 -18839 36948 110431 156226 163988
15836 163988 132841 73725 37822 -18526 -26348 2784 -22688 -34857 -46699 -59670 -127440 -151134
15824 -151134 -107904 -1506 26471 -53956 -75619 -79739 -76048 -25579 -21400 -34062 -58507 -100447
15812 -100447 -129647 -103607 -10288 16101 -19232 62225 41782 51157 -52255 -185754 -94630
15801 -94630 -642 -9272 -69633 -79446 -99694 -124253 -147363 -166139 -69097 5281 13809 -6300
15789 -6300 -83722 -78068 -123549 -165277 -76659 -40374 72185 76021 52965 25955 -2503 47279
15777 47279 38722 103390 117486 84975 92901 11577 -46521 -91913 -152679 -105205 -50196 -37196
15765 -37196 -109533 -86225 -62840 -44479 -104208 -99569 -81320 -128840 -56157 -256 12033 4208
15753 4208 -19952 -80221 -44507 -78328 -105737 -85124 -50966 3333 -9747 -43693 -60191 -108473
15741 -108473 -118964 -79820 -31052 -35861 -28778 -135209 -211068 -150522 -83571 -108979 -83472 10452
15729 10452 23007 -27173 -111869 -122162 -64467 -6856 118423 60747 21804 78669 57341
15718 57341 -20435 -34429 -22690 3101 -5697 29247 -84850 -143431 -19269 17573 -15737
15707 -15737 6625 56991 -22488 -112601 -131095 -96905 -98914 -13571 -10615 -55047 -1518 25446
15695 25446 39139 9384 -84034 -99856 -102485 -108537 -64251 -21960 -36883 -52571 -54784 37831
15683 37831 98540 59972 72594 71854 42837 106995 131362 104543 99984 149024 210692 145286
15671 145286 24198 -38280 -1762 40794 33221 9367 -11029 -25888 17134 17531 97657 25002
15659 25002 -32324 -56802 -75000 -51806 -74343 -58449 -13566 43206 47161 46911 31001 57067
15647 57067 177582 157764 91890 -389 -7090 47714 17890 37315 13404 21563 76240 85375
15635 85375 60243 113815 107517 42362 88192 118583 44306 20551 -57524 -42208 38766 147668
15623 147668 196598 171753 117107 38236 -106288 -161431 -175149 -104814 -36858 -67208 -84965
15612 -84965 -46121 -36610 -992 34754 41655 153579 -23132 -48264 -13415 -66165 -62849 -34261
15600 -34261 -129721 -107078 -30354 9073 -59619 -64960 -43355 -80495 -53837 -49818 -88838 -173777
15588 -173777 -195429 -143961 -154023 -75140 -19575 -6425 -101001 -115680 -46419 -27617 -91002
15577 -91002 -91153 -40657 -7233 -79922 -132498 -162960 -127331 -116687 -118467 -52414 -16960 -43178
15565 -43178 -108025 -145037 -148353 -54185 8092 -38496 33921 111395 92585 84997 42207 13153
15553 13153 -72792 -92475 8472 73902 63833 1302 -69795 -78922 -55360 -105856 -105394 -66038
15541 -66038 -110358 -92242 -29432 41414 -9788 8492 52293 59795 20994 -91873 -103770 -40147
15529 -40147 -47693 -66018 -145591 -187126 -146906 -137946 -124595 -153210 -174041 -163414 -119255 -97026
15517 -97026 -38888 -63991 -31943 82463 57955 -14523 -39830 -13447 15908 -3685 -5699 -10678
15505 -10678 17979 105803 63863 79537 121880 46787 42147 14664 -2918 13769 58779 79170
15493 79170 53157 -4780 -67581 -78946 -97219 -64144 -72580 -32742 16583 38389 -20719 -52272
15481 -52272 -73151 -162233 -85252 -78099 -68891 40823 89298 1648 -50349 -306 -44 53240
15469 53240 191254 119090 -8736 -46135 -18125 50261 41647 79244 111552 121541 -25138
15458 -25138 -79829 -22722 41082 14946 -47766 -139264 -106914 -58175 -70714 -68553 -66918 -43264
15446 -43264 -64076 -87885 -115434 -86091 -29499 -51331 -130500 -149566 -163671 -53783 4816
15435 4816 -25239 -126617 -158268 -62834 3210 3146 35502 90056 61776 30292 -23920 -28859
15423 -28859 40835 -6250 -64789 -37056 -47281 57478 174192 152306 150465 146822 94446 50716
15411 50716 20348 45252 78692 124120 123152 59217 11427 7102 -48568 12729 11858 -25607 13810
15398 13810 56555 9786 -74874 -3827 -20296 -159007 -182050 -183996 -150405 -105545 -65660 -61169
15386 -61169 -23120 56557 95539 26614 18267 12535 -92577 -145977 -58030 8005 -31061 -46014
15374 -46014 -80422 -36143 -16327 -67468 -112128 -87968 -21831 18434 7389 3327 -29103 -116327
15362 -116327 -72527 -33072 28295 -16663 -56400 8022 -40519 -24240 -81724 -48091 -23141
15351 -23141 -155 -17121 -21572 -11731 -5618 -93363 -154698 -85204 26117 52902 126277 47638
15339 47638 65551 51672 2139 41881 46979 -922 -58938 -154800 -186616 -72405 22561 31109
15327 31109 1857 7139 -9000 12271 35774 80215 50777 -4443 -63060 -78140 -77024 -15236
15315 -15236 -36439 -52779 -77669 -144924 -90400 -24746 -44462 -44706 23682 66164 64018 82242
15303 82242 74183 42454 5913 -52046 -47747 -32381 79493 63650 -18962 -87996 -118401 -118001
15291 -118001 -150522 -97280 -65449 -34043 -16367 -34027 63995 75350 104368 -6116 -74935
15280 -74935 -64409 -54932 -58741 -63692 -77317 -186612 -233162 -194902 -71043 -105089 -118809 -112789
15268 -112789 -127643 -64217 5284 45864 108480 43779 27431 64750 95514 -21112 -116364
15257 -116364 -93382 -84075 -48032 -5216 29184 59601 70941 -15887 -52240 -77354 -33081 -75457
15245 -75457 -86916 -163546 -149702 -171335 -105920 -89431 -84928 -133116 -26922 34861 45317 2391
15233 2391 32282 75047 59692 66001 73885 87407 -1832 4661 -28802 -103529 -137269 -157514
15221 -157514 -80483 3498 -2039 -62582 -92195 -88188 3142 47809 41220 -35012 48726 -21813
15209 -21813 -64794 -68634 -88652 -81384 -54264 -70130 -51141 -21304 -65221 -79686 -50326 -76110
15197 -76110 -136239 -107373 -25339 47494 25121 -5231 -13987 32245 130711 89355 21239 68810
15185 68810 34592 -54971 -4304 -18354 -44153 35735 186686 161204 100367 58238 -10927
15174 -10927 -39016 -1927 38789 89472 48874 15059 22467 31493 -15999 -90536 -31952 -12753
15162 -12753 -76410 -65431 31059 29101 22573 -6054 30299 39093 -41005 -110260 -111445 -137757
15150 -137757 -186516 -202835 -116971 -62096 -10353 -29987 -16370 -29759 -60238 -152474 -139723
15139 -139723 -60357 45071 120775 89901 27173 -29597 -61351 13980 94849 58340 18492
15128 18492 -23002 -21042 9552 4903 26594 56790 64909 -15089 -76489 -72585 -57304 -2508
15116 -2508 6389 35205 -31897 -108202 -104887 -100762 -90024 -55372 -111062 -167676 -50994 -37945
15104 -37945 -97738 -70359 -21678 -89964 -196992 -131667 -79830 -188906 -160034 -137939 -37850
15093 -37850 -44496 -7972 -64713 -59948 -112600 -152401 -219074 -183799 -98763 13372 92424 66815
15081 66815 11440 -6880 -11793 -11029 11016 -34058 1733 43903 69251 111094 71624 -32185
15069 -32185 -82915 -67323 -44721 -31729 -38528 -9855 -70722 -9068 11712 26852 35102 -8547
15057 -8547 -15486 -16190 -65788 -126739 -66670 -73405 -56811 -59948 -55360 -29429 -34038 -63380 -110460
15044 -110460 -75762 -8926 -35822 -43546 -34457 -30495 -93897 -115763 -70690 -145438 -156633 -140952
15032 -140952 -60666 30003 22463 27028 -7833 -24097 -43740 -117482 -91581 -89668 -48456 82697
15020 82697 78658 30809 50470 57242 -89731 -104608 -110583 -86241 33890 26061 -11412 64603
15008 64603 213130 193530 118789 73100 77771 50042 -7805 -25511 -40696 8460 -28564 -58181
14996 -58181 -73571 -82740 -89234 -60461 -42392 59380 221992 208464 112372 19760 -31316 -41347
14984 -41347 29651 36546 -36208 -62595 -50001 -70137 -26150 -14551 -31946 596 55813 -17858
14972 -17858 -33891 8844 68456 70742 53681 24433 17605 8849 -28565 -6266 537 -45386
14960 -45386 -79337 -68423 -2240 93824 126208 58257 60389 35740 34433 43822 84391 78176
14948 78176 101868 98138 26077 -2796 54443 72198 -8166 -69723 -109282 -124048 -83440 -3335
14936 -3335 -54509 -66854 -16596 -52434 -30656 18114 144486 241259 207397 111187 57003 64419
14924 64419 94106 62252 12294 10692 -78734 -115463 -100653 -24754 43940 87496 26938 62952
14912 62952 109171 100440 124277 110991 97917 127738 123272 29046 -66877 -69407 -3570 -16038
14900 -16038 -4650 3379 -78504 -140620 -29531 30163 -68214 -72181 -86935 -53694 -39215 -1144
14888 -1144 -3369 -30082 -26160 -63658 -3685 6901 86839 114456 44104 41545 60120 -8962
14876 -8962 -68776 -39045 -32747 -45825 -35016 -40645 -59056 -74254 -86190 -123686 -166597 -170363
14864 -170363 -89641 -37757 -75874 -129281 -149565 -134700 -89864 -38210 8808 18528 -29401 -121132
14852 -121132 -134062 -155639 -135382 -121069 -127264 -94721 -28617 -15406 -54937 -84892 -64117 3974
14840 3974 67238 16411 -4016 -35789 -79533 -16917 -6055 -60475 -154587 -113155 -89550 -8263
14828 -8263 103977 71479 48567 57846 24749 12929 -15442 -1370 40819 76740 55529 43018
14816 43018 73079 152219 110450 -58704 -126219 -72407 -27644 28313 42844 -9862 -71189
14805 -71189 -27222 -4888 -6406 -47008 -23282 -51128 -148539 -170051 -78163 10405 8551 4912
14793 4912 411 48164 76963 23950 -31221 -91576 -155822 -138325 -186652 -228185 -199451 -145653
14781 -145653 -81926 -14047 56888 94247 130366 67156 41495 37544 37069 44517 -2300 -30544
14769 -30544 -20079 -64837 -100894 -48801 -45390 -66427 -13421 50382 37977 -22062 -113987 -145162
14757 -145162 -70776 22948 33832 -28620 -56773 -39049 96190 31621 12145 29485 51810
14746 51810 42496 20281 -43013 -47027 -25119 -46766 -81846 -49003 -16948 -50422 -66064 29182
14734 29182 146326 128741 61519 -44198 -120185 -78217 -30004 -14939 -58658 -15459 -26046
14723 -26046 -78505 -33086 -72336 -11487 -7836 -43543 -109039 -123136 -138410 -160378 -72483 -92133
14711 -92133 -75595 -35039 31181 110056 115620 95841 16166 10036 54619 45808 22885 36370
14699 36370 -14804 -18724 -62040 -86889 -96710 -56129 -31571 -39390 -93027 -19117 27251 84758
14687 84758 131921 39696 -8278 14685 -4816 -30117 -43829 -70709 -73633 -89882 -56224 -29402
14675 -29402 -84545 -20249 115037 100952 -16708 -122568 -142551 -140985 -171481 -44050 46811
14664 46811 106387 94326 82621 -16186 20102 100280 75146 58202 46039 -44191 -146400
14653 -146400 -188214 -178251 -120744 -69386 -81264 -31717 26743 32087 -3255 -49537 31092 68372
14641 68372 73407 99974 -10100 -93069 -70762 -116467 -141037 -109955 -87329 -58455 -81407 -63769
14629 -63769 -85044 -130235 -99805 -86711 -59823 -24594 -48467 -24370 17773 -32716 -105214 -148859
14617 -148859 -91889 -6601 32023 -19723 25430 78026 47199 -8760 -54930 -47737 -55622 -103001
14605 -103001 -129503 -167939 -137364 -25664 -12185 63091 67510 15601 -12364 23766 106688
14594 106688 63067 -123324 -211444 -178129 -156501 -102707 -111217 -108586 13837 49241 18793
14583 18793 -27441 -76313 -60827 -63417 -10028 -16454 -63796 -74378 -85646 -86499 -34864 33569
14571 33569 94799 155519 163355 95227 98391 -6141 -21531 54147 9417 -15042 -120156 -108827
14559 -108827 -37973 28004 15029 -45868 -37307 931 49489 -41977 -138579 -135342 -142946 -112383
14547 -112383 -31046 20316 6431 -27119 -47579 7961 -13920 -48177 -79693 -116433 -86608
14536 -86608 -90248 -84630 -28039 23707 32051 9704 -26161 -36215 -17573 -17582 -12260 -6587 -98661
14523 -98661 -91577 -102272 -86370 -8781 63300 75703 155659 166842 113664 85846 20627 -44741
14511 -44741 -114854 -190500 -230718 -120520 -74115 -81177 -62318 -64194 -58503 -81295 -49383 43002
14499 43002 104186 58192 -13437 -58791 -12704 -62404 -16765 -62597 -119275 -39524 -52207 -53135
14487 -53135 -23446 37807 126343 35160 4309 44357 38060 45890 32964 52426 27952 -34586
14475 -34586 -42571 -80420 7630 -7497 -94197 -112204 30441 -24835 -96915 -26456 46673 59545
14463 59545 77537 36030 15629 83193 84617 96528 54002 68118 105349 104290 153892 133390
14451 133390 79466 -33389 -48127 -54585 -98537 -120538 -91807 -15427 9951 13320 75202 127222
14439 127222 87637 -32966 -11793 41653 -3865 -6059 50496 60301 38582 60910 20753 114724
14427 114724 148495 98576 85935 31226 18064 55546 130447 157021 97416 81445 106056
14416 106056 21007 -48243 -54331 -12884 17791 48136 39626 111585 131218 161686 106678 36047
14404 36047 44807 -10845 -64633 -93162 -53687 -54337 42065 61712 5075 -2040 -83295 -107988
14392 -107988 -30621 6244 2453 -36052 -19244 -34015 -81271 -102692 -66125 50484 29902
14381 29902 -28938 17120 20373 -55499 -86827 -131201 -66720 -67923 -134919 -151621 -159151 -146119
14369 -146119 -81505 -64732 -45204 -69920 -135060 -152566 -144008 -218428 -164887 -70345 -30205 -106900
14357 -106900 -117743 -52682 15682 51866 67324 52301 28346 -41391 -40950 6826 -76769 -107135
14345 -107135 -1163 77572 41138 -28665 -132041 -77864 1688 48529 117662 114433 32016
14334 32016 -12062 55972 180622 165954 54019 27702 998 -63546 -113828 -104970 43566
14323 43566 46030 -28353 -67072 -73130 -68968 -125690 -80221 74760 142159 56934 -2388 -38255
14311 -38255 -7138 43999 70668 60625 77345 87548 27955 62275 50678 34562 4912 -61493
14299 -61493 -15256 91991 9384 -87967 -208226 -153110 -55939 20702 67280 58847 41809
14288 41809 -4815 -129086 -190827 -187770 -221363 -166187 -64905 -3660 46737 -13381 -65822
14277 -65822 -77440 -65637 17828 53250 -34721 -37783 -8543 -1037 30646 80685 70000 75810
14265 75810 98412 31250 -48119 -97697 -76228 -53251 -42222 -60204 -39832 -21073 20312 64443
14253 64443 61359 74795 3472 -81125 -27641 -9203 -47466 46734 108776 62292 53070 3057
14241 3057 -64570 -44365 -78931 -112111 -158480 -90162 -43114 -66638 -102737 -81263 -39991 -95867
14229 -95867 -31033 12356 -12715 -110333 -116456 -9941 14509 -42094 -1420 -60454 -37090 58463
14217 58463 97600 164097 128179 53238 169 -41436 -48768 -40661 -28555 -88884 -215980 -238667
14205 -238667 -169659 -117638 -83855 -25226 53304 61959 25231 -122550 -152428 -159190 -88157 -70397
14193 -70397 -170635 -178055 -146206 -103022 -91979 -114977 -106153 -109134 -169461 -157781 -120519 -109031
14181 -109031 -59923 29348 89153 67504 63269 -12213 -55694 -48911 -2352 4342 75545 54431
14169 54431 59865 47964 52046 -5463 1695 -28195 40291 106899 132832 136782 116926 67058
14157 67058 30382 52168 80618 54311 9172 -60589 -102480 1941 84449 67097 96634
14146 96634 68554 93067 91522 70628 46952 90127 16686 36804 20795 -31823 1440 54162
14134 54162 109722 78488 37927 34286 -16715 -10190 -28580 -37651 26266 60920 82494 98851
14122 98851 62482 -43917 -110377 -70975 -127353 -189621 -131598 -103778 -102343 -112558 -88319 -77359
14110 -77359 -36025 65946 167936 138714 84198 73509 107100 116700 123266 137984 138476 30084
14098 30084 -52627 -63631 -22320 37220 89344 131317 50097 -48131 -5575 38335 92098 70342
14086 70342 -1017 -78967 32249 191369 192578 53795 -9832 -21768 -27573 39150 70213
14075 70213 35511 73142 78505 52279 170389 173070 71917 95239 104140 36069 -81071 -149417
14063 -149417 -114088 -59393 -60120 -25233 43065 -4840 13889 22351 -28887 -49391 -55773 -10446
14051 -10446 -17446 -26341 79206 89785 35605 10212 58117 72869 35047 67341 94926 109625
14039 109625 154313 140023 81751 37293 -41671 -49188 -76186 -57426 -87415 -62537 39954
14028 39954 83638 48539 -73231 -15042 55013 142929 74894 59454 -25655 -25189 -17867 -30244
14016 -30244 -39917 -55575 -19904 32100 64560 147368 108838 95076 111007 106542 -15614 -124371
14004 -124371 -104451 -53891 -20938 31726 -12872 -5805 23538 71202 85705 63952 42939 77342
13992 77342 46104 54828 54431 7128 -100414 -96112 -73013 5283 104989 143470 39916 -23117
13980 -23117 19391 58946 7137 3227 21174 -49383 -101007 -77882 260 -25011 -79294 -53498
13968 -53498 -85942 -9757 -16633 -57387 17126 43199 81398 47111 4889 -13592 -5183 33933
13956 33933 62712 20997 79055 158425 77820 42865 -26721 -54601 -126232 -201593 -168541 -41105
13944 -41105 31161 12574 -31785 -104505 -93315 -180776 -158581 -205193 -238958 -162663 -44544
13933 -44544 -30531 33132 40596 4071 33458 52051 27517 22797 69871 42504 17069 96434
13921 96434 128209 110108 61341 174 27881 57060 26048 79109 130216 101380 23590 -12771
13909 -12771 6741 103169 218006 146045 3265 7605 111766 60092 -47099 -52841 -33522
13898 -33522 -21656 -27939 -38873 -19103 -88664 -147597 -51162 70583 83583 141643 90861 55668
13886 55668 3306 -10208 -27434 -52924 -114626 -126106 -120901 -36408 7161 25028 104668 148282
13874 148282 107468 15034 -22276 -35974 -37364 10290 34191 15242 -14251 -69745 8414 14684
13862 14684 -12740 17743 17034 -117729 -143299 -47453 -62076 -63592 -21060 -6167 -76270 -96925
13850 -96925 -103114 -140115 -122911 -139176 -137686 -157075 -148515 -105236 -46421 -42115 -71714 -50719
13838 -50719 -96297 -68096 -86639 -145413 -84862 -57445 -27134 -71781 -162236 -140949 -90405 53096
13826 53096 70530 -4401 28150 25952 -44947 29568 86530 3081 11612 60153 64785 -7577
13814 -7577 -63626 -38819 30660 18007 35406 119254 218486 122011 -34068 -96816 -20694 12806
13802 12806 -32845 -120968 -181703 -102398 -136348 -82107 -74725 -46874 11867 9262 -6481 -13204
13790 -13204 9691 5516 42209 99076 43827 -5234 41597 120087 60586 -23862 -80831 -65353
13778 -65353 -44092 -1975 47256 71362 105723 82199 87300 62659 11977 -51162 -79710 -80838
13766 -80838 -82415 -88115 -133490 -84708 17579 -37013 -171 9166 54217 76172 58897 53747
13754 53747 49741 30163 60262 131090 6465 -104195 -41999 -48013 -95742 -32570 21944 24244
13742 24244 -39435 -83016 2310 75069 28041 -38745 -93475 -72096 -42326 -88090 -112135 -146622
13730 -146622 -44118 37787 14559 -8289 -89861 -101579 -22541 -8596 -123222 -170176 -165568
13719 -165568 -153669 -168758 -99281 105125 103853 -61531 -112907 -37885 39122 46007 -16507
13708 -16507 -20420 28510 82665 130884 110144 48801 34026 -7429 -47486 -27203 -11989 -7159
13696 -7159 -19030 -54985 3292 33620 72211 115759 104969 88735 30874 93160 57390 10549
13684 10549 55275 117572 158772 196473 240541 240821 179669 159261 129794 84683 56377 -15392
13672 -15392 -42405 -45459 -17847 33953 37865 48884 83704 111363 37968 55603 161881 184040
13660 184040 112817 145809 102531 96151 77045 32802 28918 -963 -77558 -60939 -96753 -124415
13648 -124415 -19494 85934 137413 112145 76863 11317 -89673 -90963 -67703 9366 99077
13637 99077 61373 52040 69953 -22484 -139806 -135340 -80313 -88098 -47378 47731 62157 34253
13625 34253 -30244 -13734 49114 105148 124293 69515 44312 25190 56391 32635 87448 107271
13613 107271 108492 100549 118833 151590 155365 117294 91214 107940 67881 -35246 -67862 -98285
13601 -98285 -126984 -53753 76581 -24607 -100391 -109562 -73364 -81822 -71179 -66556 -44506 27808
13589 27808 56683 16294 -66821 -32136 96808 114013 24131 -47476 -81247 -13021 69872
13578 69872 102941 126845 151892 162886 68027 24905 50245 108114 87245 72695 85395 49873
13566 49873 18254 -14047 -16804 -21327 33902 77894 19099 11870 78373 -10452 -27760 40017
13554 40017 -43933 -95028 -47462 38343 84310 153427 131834 69408 -7690 -17235 41533 45234
13542 45234 43062 53867 46017 19604 60212 102925 61692 -30094 6309 -12200 -52036 -39799
13530 -39799 -123419 -141162 -159703 -166710 -124247 -89547 -77678 -29088 -29187 27400 44535 31762
13518 31762 66430 72950 74037 118536 118891 123004 134872 140753 125470 81261 45633 5096 5116
13505 5116 27339 3544 -10060 13473 63940 34756 22104 -86133 -84015 6307 56719 55577
13493 55577 71395 1452 -16875 70641 62144 106429 59152 -1555 13361 10933 -43155 15989
13481 15989 19885 -23042 -47009 20313 74352 86076 -49670 -90583 23553 9055 22710
13470 22710 33088 44648 49446 83725 131269 134300 126267 132430 72350 -38806 -57872 -35323
13458 -35323 57869 -27419 -97208 -90466 -85225 58403 126223 51798 59283 52038 83723 88643
13446 88643 86018 12690 -25036 39228 173570 214145 180330 51904 -2760 29958 16825
13435 16825 6550 -78403 -47278 -9477 -78455 -144826 -121421 -26179 -37662 7493 58269 67854
13423 67854 99427 56420 77802 82408 95271 87152 -5641 -66004 -128471 -49933 -75970 -61639
13411 -61639 82943 90176 93013 133277 126479 107409 16171 8442 6184 -1354 -51760 -45278 130092
13398 130092 230308 169916 103655 58776 -26696 9611 10083 32662 37890 42462 52014 32585
13386 32585 38825 -34879 -48999 51675 59655 4444 -51129 -88428 -45844 -24918 33487 94328
13374 94328 -40601 -162094 -180261 -135516 -51500 -11813 -15424 -27465 -898 45705 -7740
13363 -7740 -34229 -36864 13722 95946 102600 -13565 -23959 26849 94826 160186 190569 185821
13351 185821 83614 78845 63969 18803 73580 166455 110944 44419 -13315 -75112 -97000
13340 -97000 -52265 52312 79296 84695 159043 140913 128114 92732 17210 -24554 -12876 73724
13328 73724 27288 -53415 -42755 5834 -31730 -49447 -95100 -71842 -46808 -70400 -74615 -19650
13316 -19650 -33 -32829 24649 75798 106373 92466 -8079 -66979 76956 123385 81502
13305 81502 -3944 -76779 -118314 -181434 -182775 -103273 -69773 -61488 -96291 -39301 -38450 -9701
13293 -9701 -18515 -69894 -33920 17959 18187 -74116 -148966 -129551 -48180 -107534 -91935 24844
13281 24844 65483 54062 142362 152990 78016 12264 -40600 -6683 114726 157293 48874
13270 48874 -37928 14796 68295 76659 57420 90097 78780 45364 40772 12285 62680 70140
13258 70140 70780 45433 -13155 74973 76564 -14824 -7345 110547 91594 47027 58972 94713
13246 94713 21993 -32716 18844 12612 -19830 89482 130425 106298 117086 62791 43516 -31376
13234 -31376 4636 53485 48135 -5342 -84567 -115305 -43726 94734 103762 -11367 49027 24377
13222 24377 -49498 -82000 -63495 -49949 5361 -38819 -145587 -93689 -72150 -89925 -48082
13211 -48082 -46872 1289 13129 -37013 -104629 -47645 9121 38777 97881 57303 27943 71168
13199 71168 82597 30261 -20684 -23717 -70945 -6414 109606 32388 -70230 45084 111755
13188 111755 130152 88141 -26888 -99801 -64842 -164 38180 12939 -69257 -156291 -131952
13177 -131952 -98165 -154605 -71643 33844 103412 43341 15266 -22898 -91547 -96694 8211
13166 8211 -6953 -81922 -137587 -82895 -26172 68600 83626 55235 43494 55208 153252 176978
13154 176978 120235 69969 144758 130828 101596 83873 22421 51140 107676 83238 92762 68799
13142 68799 -29882 -21458 31361 42241 27347 52973 85661 69790 33869 1603 -74619 2216
13130 2216 98077 59259 48760 47325 47700 49213 107387 128714 216710 205227 154439 78915 65618
13117 65618 114893 70447 7726 -236 17890 51016 82279 163995 187640 253475 272968 211021
13105 211021 156250 88853 105175 43229 48136 -82886 -100505 -31369 5520 -1597 71334 74882
13093 74882 1582 -8194 -36295 26828 92353 104418 29009 -33299 -126 16240 33272 -20273
13081 -20273 -27492 -50616 -81251 -89622 -37109 16469 49750 77382 109988 134822 66019 77890
13069 77890 102378 37411 55096 140298 138562 82839 70592 17894 28111 80411 81734 116989
13057 116989 108490 49483 -6223 -38917 -20354 31720 107841 64906 -6214 5164 -8814 30952
13045 30952 60268 75338 57552 16728 -74112 -62485 18411 8575 53863 108236 69006 50228
13033 50228 71647 83230 139948 193898 219108 146363 98942 137854 188304 186380 230001 139524
13021 139524 42661 -6640 -64049 -122498 -52508 -59223 -82034 23450 47789 51778 51667 94761
13009 94761 87167 85809 53471 -8483 -43062 22403 52945 58718 -17045 685 100595 136411
12997 136411 111008 81992 109037 183166 163244 101550 -18908 -76695 -48662 14393 35280
12986 35280 94279 89069 37948 37162 49520 51900 22266 36590 23602 14442 40356 148502
12974 148502 131515 -10871 8643 20405 35676 78023 139190 155763 120332 105722 -11626
12963 -11626 -47143 -11823 -79875 -100812 -23898 47589 70125 36521 -6864 17814 42854 125373
12951 125373 89754 300 -63081 -53831 80176 165527 113295 91475 65014 30972 84782
12940 84782 78350 24841 -10816 -27663 11174 -18288 -8895 -3715 20765 58084 63576 -16890
12928 -16890 -16384 -45092 25754 59148 46697 73574 62126 203964 232312 192090 87639 70948
12916 70948 69699 129003 154145 55682 4033 -3017 -26655 10707 45833 65523 103675 124363
12904 124363 113055 44834 -24632 32177 -2776 -65134 -42922 56906 97575 26543 48170
12893 48170 44244 -62762 -17004 145305 168705 128713 177742 165463 85863 104202 114973
12882 114973 68761 131184 185517 126476 77165 31146 -25436 -57274 20753 68544 54140
12871 54140 32093 50269 50837 45519 44416 28572 77498 37043 -76137 -38083 19979 -23651
12859 -23651 -113331 -108606 -151097 -158863 -76149 -25328 -5985 -12658 -19725 34658 33012 -60621 21152
12846 21152 -30827 -74332 -31333 -43756 -6893 -85 5532 -7403 10366 -68562 -85635 -111416
12834 -111416 -141374 -193063 -200703 -163563 -100855 -25306 -74073 -104057 -100930 -64129 -28380 -54083
12822 -54083 65239 112206 58519 73109 53101 13511 -18912 -19305 -31477 -16479 -38291 52382
12810 52382 45666 -1779 -20310 63387 20090 -45546 -51150 -24663 -6970 -48053 8249 61030
12798 61030 128660 134975 182081 140603 -12908 -25729 -4822 53555 59619 27338 34774 49022
12786 49022 162969 157758 86795 1689 -28835 38289 80071 130717 73752 -1916 -3968 -58602
12774 -58602 -20605 -34164 15010 62151 57883 131860 205339 227016 178279 57836 -36126 58919
12762 58919 159693 188250 148129 111764 132995 89720 -18043 -58405 7462 19833 21596
12751 21596 -21501 -30364 -55155 -4895 -9651 10117 41534 28581 25293 73714 90419 93217
12739 93217 119871 143152 128051 62983 64320 2286 -93215 -130793 -55395 11414 8818 69011
12727 69011 118833 119531 182551 176516 136673 91306 120085 73504 20680 47939 45691 135843
12715 135843 107821 59911 104316 160383 182513 134890 237656 247731 164990 85607 40161
12704 40161 109577 118874 18455 -5822 6883 1396 -76356 -67725 -68241 -100716 1364 28828
12692 28828 38918 18147 -25416 -9274 67898 129094 230813 262091 137766 77272 87249
12681 87249 86013 109109 92558 91976 52585 -19 -9615 -6192 53331 41355 30271 85895 124371
12668 124371 84301 64999 -15955 -83670 -47554 -3836 56989 61862 75630 -4024 -4370 66250
12656 66250 100596 148547 155427 103866 91602 47801 -4442 44987 48007 22313 58280 30359
12644 30359 72809 46769 -17002 -100804 -71766 -32533 -54491 -18553 44964 51108 42325 77254
12632 77254 24250 48917 45125 26849 -3375 -17777 29292 56924 28158 -23336 -97964 -57853
12620 -57853 34965 64089 73260 104307 136546 97214 84607 85265 59512 -30397 -23135 13708
12608 13708 67149 113911 65079 114469 111957 68701 96149 125969 150847 204384 163024 101005
12596 101005 33364 14966 53878 82384 58132 28734 47228 124527 141172 128714 86986
12585 86986 66925 35719 58642 62470 56308 113891 118283 65565 109674 93447 105158 104473 25551
12572 25551 47399 64051 67885 62452 28369 -16594 77988 88583 36813 40138 118118 166442
12560 166442 114853 134321 105637 110336 38838 5729 33692 136934 57164 7531 -69005
12549 -69005 -64673 -2595 -537 64689 82355 103682 184300 143345 139502 143898 68356 19968
12537 19968 4943 118633 137441 87045 87712 88037 32001 74052 167643 203239 121801 49348
12525 49348 22652 51345 84737 78097 90837 75912 95855 170932 296483 187515 86488
12514 86488 41680 -36655 30154 107644 73598 21657 -4126 -9001 -46423 -38443 -72828 -5451
12502 -5451 35193 26447 -77460 -93780 -62260 -26720 96310 210343 125865 59140 12270
12491 12270 -6259 62785 83958 134446 147988 217580 270424 214191 146938 148627 146310 171894
12479 171894 218254 212801 160502 98745 114705 113226 119734 90390 79715 84889 81157 115854
12467 115854 121855 124404 9865 -12436 29670 46493 92242 83602 79457 67096 102336 130775
12455 130775 119347 126726 114162 128617 59780 20242 49857 112500 92169 71542 132592 161368
12443 161368 117010 108161 109992 94725 43274 72146 130078 221241 187187 36758 -11766 25258
12431 25258 17517 32114 815 34379 115620 148729 115051 185013 145917 52198 22223 69220
12419 69220 82248 115829 115322 174180 307716 316372 259820 170684 51745 10622 70357 115188
12407 115188 167968 210333 177093 130643 155897 89064 138262 193676 231685 171533 169284 151435
12395 151435 168781 196620 109867 4048 39822 105264 82196 -7344 -34837 -41234 -95977
12384 -95977 -7543 21413 27564 90837 129939 166117 125471 108725 108674 105296 3810 -80687
12372 -80687 -51454 -13789 31019 111237 151892 175592 141838 99639 117613 168708 58278
12361 58278 93214 199234 235015 205573 153378 132874 128785 118833 113496 126440 207231 192969
12349 192969 171245 163118 178032 163873 193038 237915 219787 234114 208725 116844 70967 56920
12337 56920 16463 55932 20457 19431 79971 140656 144306 93946 22527 16827 98772 159443
12325 159443 121182 102906 57093 -8219 35533 125258 130603 113129 85094 104453 135073 197754
12313 197754 211702 102597 104437 71905 87014 132659 224488 221132 206187 166544 219369 211333
12301 211333 177653 78299 136049 165951 157757 139706 125311 111710 114931 192251 178597 45414
12289 45414 23754 100549 156350 308612 357551 275588 255341 262698 177754 154451 139443 135038
12277 135038 164579 228995 167666 220019 202134 152513 236919 296110 268607 238007 182606
12266 182606 149326 113880 137765 135414 275156 333741 253330 224351 216210 277922 307870 257287
12254 257287 292162 407123 345206 314956 333713 293738 322784 270494 197012 223297 232468
12243 232468 283426 307046 365210 411128 354484 292626 256505 186769 175443 234466 206936
12232 206936 181509 264490 331574 374505 297126 349783 438009 452279 451243 341210 260614
12221 260614 214461 207115 260313 346253 420877 359193 362809 321701 339848 370640 382414 378435
12209 378435 343543 296506 275273 316658 308667 343461 370915 276453 322201 404746 440139 425467
12197 425467 371163 393349 465594 527531 544799 478187 493728 571492 580206 533153 478381 494088
12185 494088 575981 622397 543089 494269 496653 595029 718002 733822 676052 714963 713750 710313
12173 710313 730902 683535 615141 547698 532219 543410 603968 626158 606126 635909 574533
12162 574533 527621 465017 497191 543210 430249 359637 403873 425028 478833 529704 548436
12151 548436 513911 514980 582509 557997 481753 334305 343648 400058 391379 437708 520322 497913
12139 497913 457773 475529 546859 585526 635751 562840 594179 673837 695587 715173 736972
12128 736972 763920 697595 655875 678426 793547 755700 734526 748637 714812 710371 755290
12117 755290 805321 781282 783182 850388 881377 862992 779420 773700 740653 807463 851401 816138
12105 816138 853533 903177 960925 966022 1047110 988351 933967 926309 958599 1002869 1065803 1151713
12093 1151713 1198641 1176527 1150500 1101178 1094592 1142671 1149412 1039179 1110235 1132787 1044202
12082 1044202 1090615 1140115 1229368 1163884 1056134 1039907 1047276 1081427 1088723 1093731 1045444 1010839
12070 1010839 954782 949929 1048552 1110588 1061214 991591 980963 1011949 913608 899303 1052343
12059 1052343 1207817 1244184 1189271 1159427 1242627 1268281 1298456 1376090 1422999 1558743 1683616
12048 1683616 1702064 1756727 1851407 1833847 1947034 2080941 2030562 1982682 2069029 2199696 2324796
12037 2324796 2408581 2456049 2459460 2481559 2513982 2632447 2620480 2636700 2606957 2668855 2741748
12026 2741748 2727141 2732085 2848527 2864938 2823330 2890500 2989489 3137450 3219918 3218318 3293039
12015 3293039 3461953 3560751 3622591 3740609 3839952 3918207 3985931 4079464 4127399 4189418 4325488
12004 4325488 4499189 4513914 4532478 4669038 4854112 5039363 5200146 5459363 5711536 5916383
11994 5916383 6071552 6227933 6441123 6595934 6805714 6956770 7085982 7245902 7559788
11985 7559788 7817915 8107941 8509027 8835329 9160331 9494089 9665164 9975026 10409814
11976 10409814 10896753 11321725 11815676 12312604 12889971 13486464 14060936 14748937 15475908
11967 15475908 16175759 16977757 17894459 18891567 19877227 20954467 22031680 23252057 24583872
11958 24583872 26037894 27638419 29433391 31331384 33411772 35695482 38145131 40932871
11950 40932871 44044885 47440352 51322706 55707381 60605521 66090821 72172572 78992266
11942 78992266 86746848 95605317 105638651 116981250 129807438 144456313 160887681
11935 160887681 179135940 199162127 220694867 243257472 265792147 287016466 305197933
11928 305197933 318718592 325990399 326064912 318929681 305521876 287518816 266658140 244414317
11920 244414317 222280105 201095988 181413630 163470900 147236200 132800682 119984855
11913 119984855 108507723 98393462 89504315 81767644 74857964 68618650 63053656 58236161
11905 58236161 53910318 50012620 46516411 43341213 40486443 37839779 35462179 33291573
11897 33291573 31193047 29440448 27844136 26310888 24923422 23702191 22451584 21189427
11889 21189427 20184333 19198619 18284544 17412466 16691780 16045248 15440635 14772502 14118438
11880 14118438 13555233 13023364 12552580 12055323 11625490 11250384 10893984 10561252 10160685
11871 10160685 9766381 9481780 9288413 8967811 8547148 8220463 7980716 7752907 7388568
11862 7388568 7141460 7066542 6816022 6589031 6456581 6204178 6020157 5843134 5657586 5559807
11852 5559807 5503098 5373604 5238784 5148372 5047636 4902886 4754769 4624467 4422320 4325631
11842 4325631 4273510 4168538 4078029 3965067 3935440 3887006 3776564 3670783 3608447 3472362
11832 3472362 3305236 3338611 3289689 3199739 3131036 3071228 3013883 2922458 2808173 2806408 2861041
11821 2861041 2811626 2854284 2807656 2750256 2583224 2574790 2532068 2469860 2371472 2308477 2254766
11810 2254766 2198964 2211832 2213825 2245444 2359194 2417863 2438769 2418479 2351655 2308041 2337996
11799 2337996 2470054 2526344 2546124 2506558 2451569 2405936 2428050 2439195 2404962 2377745 2374553
11788 2374553 2331650 2158789 2060514 2041136 2062458 2098104 2102472 2019660 1989686 1989467 1879696
11777 1879696 1780230 1777355 1678605 1564953 1469248 1370442 1395438 1368679 1367397 1321672 1334721
11766 1334721 1380967 1331605 1316707 1252484 1181428 1147955 1189850 1209789 1144988 1081064 1037639
11755 1037639 998034 965606 948563 975689 1053877 1080161 1051129 1001913 961293 957240 948504 955045
11743 955045 945430 982238 964957 1000873 982583 918738 930828 962821 915937 923926 987060 959611
11731 959611 924611 943064 930457 954766 921766 964886 984061 951987 947691 894698 836801 842270
11719 842270 877137 903449 913676 917646 877608 816121 867227 797521 781011 759176 731432 718395
11707 718395 773430 806316 748925 701610 697953 697309 711709 769691 816402 888662 808409 763435
11695 763435 779185 775845 809584 808216 753588 793721 789992 748174 736941 701658 613941 619556
11683 619556 528410 483920 596337 674747 602078 558494 637318 677613 657681 750908 675559
11672 675559 594165 652486 685754 642996 668213 662966 682773 644857 556092 602794 581586 610349
11660 610349 674726 819927 801206 644162 526498 453563 503116 523073 671703 603909 630094
11649 630094 631788 546075 558635 578826 514917 540658 613415 671875 606376 565550 562046 526191
11637 526191 544795 501862 523200 549024 496602 503699 547317 590690 569870 573199 585184 515543
11625 515543 465476 446506 549032 532894 480641 376067 281994 237140 278643 363825 487805
11614 487805 436415 379461 360605 381385 383589 419144 434347 367520 364890 400335 350368 248377
11602 248377 307754 336788 313661 294055 329610 328964 323845 305913 307689 386362 441851 455739
11590 455739 492903 453332 408061 419484 516467 539070 469474 380224 268773 331622 376493
11579 376493 303324 231846 180684 224550 282384 270012 207135 163883 314864 396967 413849
11568 413849 377014 302990 335564 376440 417303 415753 390003 393844 368424 361538 371340 311784
11556 311784 333271 321882 254342 242706 233292 207005 266851 340873 296081 265548 332557 306749
11544 306749 243981 183988 200988 220108 122691 168431 197678 168281 233564 319672 331797
11533 331797 336620 325918 246960 267517 206523 150360 250855 274498 280251 245850 220432 249598
11521 249598 244346 191468 205603 268774 273790 279993 306238 255776 197424 147305 143524 84181
11509 84181 103315 170137 215684 104888 103170 146830 237158 200404 274219 330679 286172 280444
11497 280444 172172 237183 230330 273711 224604 157829 171370 166623 136143 133540 224341 243347
11485 243347 217995 230734 61782 110434 180133 129890 187451 249582 140806 16191 -16220
11474 -16220 65470 189593 178891 122556 169119 232559 188282 184988 184257 183938 219925 196512
11462 196512 181507 140688 85374 182893 202715 124727 116317 253362 298766 209728 112979
11451 112979 149066 123212 69702 66729 59490 98055 148677 174162 208747 207483 109327 88464
11439 88464 108769 94216 103777 124116 190475 178461 201137 205792 157336 106660 112872 135219
11427 135219 117891 71797 41560 210856 284901 135249 79211 140869 147780 43584 18974
11416 18974 77331 53624 86592 80034 85032 122389 31850 -74784 -28590 26750 -69285 -57702
11404 -57702 9020 92450 170138 189536 210444 191418 124549 114184 86628 79063 94610 60047
11392 60047 88591 132674 138691 144628 156399 154527 75319 129010 137822 128991 138687 97469 47450
11379 47450 67949 162825 139574 242107 305375 334414 293357 196461 164004 175099 178397 115540
11367 115540 74393 74937 107704 100434 85317 93504 102449 95722 85766 150489 225928 254034 202889
11354 202889 166591 196171 221619 165683 126896 69606 79988 60449 15492 42548 41626 36826
11342 36826 67419 67791 41747 89257 123561 152591 180150 173585 138881 90021 46205 101121
11330 101121 103714 87025 52444 7309 4818 71372 151355 195664 130878 83004 95812 71328
11318 71328 39279 -27574 8171 8795 36086 68417 128018 87787 94872 125469 113103 51790
11306 51790 55728 53991 22771 32298 44128 44520 38022 58339 15908 -56975 -75961 -60463 -78714
11293 -78714 -10769 64815 71262 74142 86753 68083 167844 161447 116679 13490 -30430 -27990
11281 -27990 -3330 -42717 -5397 26265 23689 78325 171088 147977 135676 164143 226289 250028
11269 250028 98302 961 -33990 79000 110084 115672 78659 120965 105810 54397 59305
11258 59305 92481 86451 28117 1234 42911 122110 217454 212127 199295 196780 74562 27354
11246 27354 54379 92367 78456 106159 65879 136320 150956 60373 15881 58708 64274 91231
11234 91231 48647 67978 172402 235207 144737 91148 48404 1088 -47810 -105680 -113140 -88353
11222 -88353 12074 158893 150708 93274 51500 91806 39584 -1549 -33229 -27013 27323 72487
11210 72487 49691 34405 11207 7119 69085 33189 6048 53150 46870 38850 107520 164759
11198 164759 114220 42962 90323 114503 127284 75454 -23703 -28253 -12418 14583 77426 60090
11186 60090 66536 52657 39092 112975 139145 90619 10141 1585 78034 83869 54085 53872 -15101
11173 -15101 -28483 -36720 -53382 -9525 28179 14464 32906 101297 85905 8244 27315 142746
11161 142746 179435 173246 164453 201479 169514 130926 110553 84289 11216 -32381 -49963 -46869
11149 -46869 9698 118536 82086 56533 123623 56954 57401 93209 52460 49322 51633 85899
11137 85899 123525 89278 73850 86752 80837 110676 39807 -87567 -89761 -94037 -39992 -6868
11125 -6868 16564 78420 83544 -13925 6990 34247 64432 55427 -23889 -25684 27128 111733
11113 111733 94682 7165 -11889 40845 91924 64837 -33132 -113663 -114704 9770 67855
11102 67855 37586 27982 41680 7506 36626 65106 2844 -86496 -134535 -60477 85972 194959
11090 194959 216580 163934 169867 100313 56024 62275 74347 21818 28192 77804 62034 84898
11078 84898 69487 25752 59447 185724 178180 112763 86556 72939 78660 35850 33344 11371
11066 11371 12218 71835 70546 50814 82737 122568 125226 70020 69314 36592 93781 128168 82610
11053 82610 122111 196732 163981 82694 112457 207273 239456 326827 390247 474698 507520 530201
11041 530201 499431 467890 451855 457415 485005 488736 612490 723552 862381 933601 864644
11030 864644 738334 681564 629356 548278 600904 627180 716081 943106 1162145 1327132 1388064
11019 1388064 1244661 1033484 856417 738373 600445 592571 589832 633894 791782 898520
11009 898520 928291 951851 854047 787748 723249 616070 579030 473872 372453 309456 282598
10998 282598 304401 330035 271950 180378 108610 71640 110331 109199 149071 99367 68783 62232
10986 62232 64536 44639 54658 50442 80391 96395 40267 34878 -34384 -26051 10720 47191
10974 47191 48271 86433 151099 179473 136050 104888 15236 -89652 -86112 -11348 54448 56838
10962 56838 83870 117466 68243 -855 30011 52958 18572 -48043 -30351 -18848 -56926 -87878
10950 -87878 -81116 -103053 -37116 53735 85582 35402 4213 30548 47457 6323 -21011 5875
10938 5875 -23361 -10817 -8959 -29613 -38623 -42359 -4321 33506 57176 36964 20706 -47530
10926 -47530 -49912 6744 -71699 -97653 -34934 -11172 -26551 -71749 -115733 -95247 -64582 -28128
10914 -28128 -19498 51759 -20677 -75754 4567 3743 -28974 -52837 -116412 -125238 -74190 -12883
10902 -12883 47352 29321 48508 22807 22104 49854 39716 4614 26366 11869 -48505 -43196
10890 -43196 -48560 -53596 -62347 -85775 -40668 -38030 -41357 -25918 72917 32562 23263 5633 -28551
10877 -28551 3137 45289 36296 59771 162968 155497 67875 -2220 -5099 53228 30906 24531
10865 24531 18302 48565 102020 114497 57559 30393 105506 117250 110742 125266 106636 94744
10853 94744 145046 95998 35119 -5268 71333 181395 136998 -10611 -67733 -9459 77817
10842 77817 79904 14619 86927 140502 123338 154721 80875 -50679 -92306 -95562 -6417 21082
10830 21082 33644 56570 125955 138772 100160 80341 90370 161092 148577 85088 109296 94660
10818 94660 166472 118708 41258 39967 -13086 -6232 98035 144624 39745 15220 -14152 -51423
10806 -51423 -12600 -75415 -5407 106595 77004 -32639 -37475 38751 100855 72223 51992
10795 51992 60268 108530 120831 216236 234058 215414 159155 146880 182364 213881 145740 51833
10783 51833 70505 97852 125485 128087 147908 79987 80730 106280 53440 38185 74881 70911
10771 70911 12355 -74116 -4728 54480 106766 162300 101256 84693 96973 117423 105321 85554
10759 85554 91383 48013 19592 86145 95404 117731 109386 80590 96715 100534 147524 118797
10747 118797 93510 60297 123133 187460 85772 -9579 -111493 -55595 -46445 -11408 28700
10736 28700 45327 26028 -34958 -11461 -56267 -118095 -254461 -189702 -35593 -759 21186
10725 21186 3774 -60528 -6445 82405 67002 -73746 -102923 -122026 -119027 -161598 -52797
10714 -52797 13585 66761 86604 75087 22165 53826 16441 17564 47444 72633 215544 356764
10702 356764 364260 376121 376115 333684 293675 234190 93199 14367 43347 122674 251301 246070
10690 246070 220002 245204 317594 384618 415219 454015 505259 453667 343518 254721 262577
10679 262577 289124 291034 313921 363829 414071 430438 389205 387572 338633 350877 375718 379575
10667 379575 449685 467643 537202 549345 538889 455458 527689 576611 582359 586934 559715 651663
10655 651663 709832 776522 863900 952123 1019022 1079463 1196684 1288099 1333675 1341416 1340137 1362396
10643 1362396 1368826 1473000 1658661 1755907 1836307 2008733 2176169 2389427 2603583 3039544
10633 3039544 3506640 4090896 4627128 5001597 5359834 5726636 6230244 6825669 7617332
10624 7617332 8802743 10274688 12365081 15353810 19368250 24736125 31662991 40633600
10616 40633600 51325506 61831598 69014356 70809831 68118909 64052556 61242935 61111647
10608 61111647 64287141 71601590 83916760 101705737 123565263 144272988 155614960
10601 155614960 152602407 139134090 123848145 112682011 107530585 108986929 117527283
10594 117527283 133636690 157255284 185194654 209147736 217544165 204501712 177690416
10587 177690416 150177612 128906090 115330084 109134406 109837615 117011386 129548821
10580 129548821 144423787 155438169 155030712 140664882 118485014 97101303 80799149
10573 80799149 70123113 64270241 62322014 63489937 66736025 70445667 72013733 68824241
10565 68824241 60477690 49573455 39073350 30439631 24007821 19248551 15700072 13191925
10557 13191925 11292811 9790339 8575100 7657942 6854914 6136356 5502498 5050561 4637118
10548 4637118 4295231 3910981 3651896 3439264 3296327 3068067 2789938 2599332 2455263
10539 2455263 2322652 2236528 2162471 2006717 1895775 1825174 1783670 1767937 1677526 1550993
10529 1550993 1531367 1570937 1578369 1504762 1396228 1297054 1259878 1179542 1248084 1220444 1122772
10518 1122772 1074565 1057950 952901 946646 883234 940560 1012293 972281 934100 909456 849199
10507 849199 768997 687686 714978 735412 639488 605314 595961 637427 578306 576554 553951 506502
10495 506502 509271 523674 515167 481198 437970 406604 482353 494214 539602 466743 415117 465273
10483 465273 499422 404399 425567 479743 441673 466372 448308 527386 607005 703126 625402
10472 625402 527929 495173 472174 428725 435090 486128 521934 658006 801828 883622 867225
10461 867225 824679 785710 680199 604200 612255 661168 644411 640115 719066 799772 785340 798583
10449 798583 726230 652011 696694 730190 707386 617475 554941 478705 438127 422212 439707
10438 439707 441263 369285 345940 344300 315447 232265 227008 226686 268119 293576 348552 449257
10426 449257 419583 302591 267434 307894 220299 238493 291872 300184 243747 193815 219309
10415 219309 237068 225673 213398 226756 147928 84518 77490 114394 161072 188691 281953 244211
10403 244211 278214 259438 201742 163332 227818 292695 321238 315948 283274 262364 230259 270428
10391 270428 353709 236664 164940 202099 176193 172250 264048 328863 374940 447952 487488
10380 487488 482095 375324 348826 301972 270382 281800 265357 228041 215147 231417 306400
10369 306400 201105 135105 151303 157328 151779 128134 99075 143688 208943 306770 285976 173957
10357 173957 127337 122405 157533 137508 161697 274752 267556 108589 116278 198895 169777 127801
10345 127801 172667 151444 166737 226336 177681 119399 34410 37484 102991 148030 137688 66421
10333 66421 122748 173177 148548 142087 200239 169004 77780 175179 244227 282968 284011 262402
10321 262402 181706 259495 344347 315301 262439 160140 85922 116841 167087 159712 111855
10310 111855 104424 121812 116342 114454 145114 109504 119948 126312 99438 86874 183547 240535
10298 240535 201656 191630 197761 239554 218220 187661 156903 138282 170843 184457 166742 141900
10286 141900 121812 115307 99945 144301 138211 83403 53429 41093 31623 -1451 58519 127146
10274 127146 114936 80666 92268 196343 276119 322936 327284 206414 110347 85527 128033
10263 128033 63462 -6687 16556 44682 67058 45264 34403 150394 205468 156116 184333
10252 184333 172762 97287 122072 121194 79496 113673 123671 154313 112092 139808 91876 32298
10240 32298 -6402 89825 36339 63535 60363 37871 100402 159079 147119 148347 129587 80220
10228 80220 112154 229071 215348 160146 98583 163968 125897 151891 106055 73589 93666
10217 93666 96905 40131 24858 -42140 -2141 96947 136839 170737 182045 168527 77237 89114
10205 89114 112883 133972 80758 47677 107066 137255 91184 53800 89995 123416 125352 71719
10193 71719 91254 80718 67229 119616 218948 226127 112797 75431 213425 265212 229664
10182 229664 245370 275472 290534 360616 386763 359511 352494 379414 479901 468747 395376
10171 395376 403709 521351 667658 812262 834139 894808 867391 792119 701945 614206 585199
10160 585199 588242 602637 692408 735138 904906 1053777 1214911 1226393 1053975 915861 823582
10149 823582 729368 648153 635598 679572 706955 795240 957188 1011585 941510 764373 629058
10138 629058 553071 493075 441261 448790 430102 458947 533729 540545 462151 378667 444897 473078
10126 473078 352879 241625 201230 174033 180319 169857 106495 105783 134921 235062 259438
10115 259438 200847 70007 30298 -39921 -45943 57086 143557 125528 144867 219925 121622
10104 121622 121399 150161 100557 49734 58704 80530 21190 -50448 -44261 21903 84901 63907
10092 63907 14950 39535 83377 87952 105917 98834 -952 -33779 2883 101519 59389 35832
10080 35832 86904 61504 85254 113467 125446 119152 78855 41917 -14834 -27966 -14210 -53056
10068 -53056 -86379 -39857 -14801 -4 15153 59723 106186 134259 97795 32840 103033 187877
10056 187877 203046 149924 183747 204908 193378 124888 153753 180724 113857 -29898 -130617
10045 -130617 -106596 -80261 -91577 10798 116436 51478 -39975 -62884 -56432 8728 13170
10034 13170 -48021 -56473 -71813 -62246 11341 36481 -9792 -66934 -17123 58864 83239 64964
10022 64964 -5404 -49453 -79214 -27610 47851 18140 -70511 -95312 -18221 37042 52852 29602
10010 29602 20443 15168 29145 11159 -22939 -34948 -25074 -16068 57797 55995 -27554 -75277 2398
9997 2398 64202 74607 69949 33971 12392 -68098 -35400 36834 -1100 -47505 -51012 -65923
9985 -65923 -5189 -26888 -87005 -75563 -111386 -138189 -17493 13339 23534 7918 -19205 65056
9973 65056 97722 81073 40336 -10428 -62334 3158 -12525 -27805 -72263 -12206 82156 12657
9961 12657 -31162 -28446 131164 104889 45639 -34901 -32353 4089 61752 70177 60692 74281
9949 74281 62786 49510 65374 -31464 -32086 61310 72052 -11522 -2220 66470 51656 1841
9937 1841 46459 128625 204568 215133 207956 146910 93696 92505 141425 168841 83209 -12167
9925 -12167 -20106 18746 41478 68820 46807 13848 1332 27830 54516 76146 38229 31922
9913 31922 76831 139335 119219 36625 23050 85142 5128 -72141 -2264 26984 72284 13996
9901 13996 -7677 130643 78846 10279 -14576 17840 -12466 25802 70877 30683 26560 47487
9889 47487 80733 43474 86288 157666 93120 28540 -28606 -112248 -103233 -73979 38884 102455
9877 102455 80196 102159 53341 8390 -15357 -17693 -37190 -78640 -30972 92843 104009 87681
9865 87681 66464 17215 30721 119615 180176 128144 151502 240855 205407 197040 170082 80792
9853 80792 55668 29798 11967 110716 150860 175552 149487 132039 109064 127878 14710 5060
9841 5060 40669 19048 12476 9463 1142 -109276 -129175 -66383 -56706 4204 63197 30563 -32573
9828 -32573 -33390 7504 8985 -63578 -102024 -130997 -142980 -116158 -87437 -70321 -64806 34620 38134
9815 38134 5364 -85941 -976 -24502 -58365 7555 42926 39756 -83150 -99806 11943 71328
9803 71328 47367 1110 -31627 -65448 -124179 -126624 -25128 55357 120123 164271 166489 191205
9791 191205 207315 171892 198144 134712 50539 -3213 48820 -35175 -82748 -27421 -75703 -51007
9779 -51007 -17261 -33788 -51684 -37783 79172 99915 98842 150259 100813 77182 102324 118473
9767 118473 6481 -28777 -30824 62110 50746 16263 32013 78293 61868 -20836 32158 51814
9755 51814 90122 104574 65490 72706 154644 128944 15703 124241 131574 52358 85273 43563
9743 43563 116939 128587 54552 25775 7109 -25737 -11798 -9709 25681 75179 65932 -12288
9731 -12288 -25356 14408 84809 38743 -12440 8538 -21152 -16533 17039 5672 77661 85522
9719 85522 51398 54957 5221 13271 9405 51555 138375 90545 91804 48437 54826 33143 30359
9706 30359 74359 118327 118368 135611 111201 47135 49435 15801 -9108 15231 26103 52995 21791
9693 21791 14843 31099 50099 75565 34722 -1942 -59197 -64048 -44204 26010 24168 14858 1337
9680 1337 5776 -15692 -78543 11907 36771 70188 141583 92669 42863 29701 69046 8583
9668 8583 -22824 54633 160459 149923 166850 42063 28222 77625 159282 131107 144944 207995
9656 207995 193850 156903 140462 128147 175078 289957 366977 266988 195475 129596 165567
9645 165567 119828 85556 -4996 -2603 -30250 31413 34914 11657 36707 59956 33645 29788
9633 29788 8441 13588 19939 65418 26474 48156 59135 89595 116814 100823 44023 -54084
9621 -54084 -34658 12070 17385 4758 -71476 -101755 -152109 -127417 -24189 40205 -34917 -50114
9609 -50114 -15675 10810 -46708 -96756 -100600 -69513 -65807 -59665 -8 18606 91851 84866 16089
9596 16089 50230 -22955 -36084 -4425 85805 34048 7630 17029 30060 84324 -9374 -89263
9584 -89263 -81228 -61213 -43212 26561 24880 87449 178937 238646 217299 163754 148136 41967
9572 41967 15685 49475 39525 8934 -11176 24954 123759 186814 180500 121715 119335 111555 92724
9559 92724 142930 203536 118919 26717 -8029 -27499 -33358 -10098 855 4369 -31375 -92606
9547 -92606 -56548 -33884 13672 -20368 15749 32433 21722 -11000 -36964 -74806 -46078 14353
9535 14353 -25679 -134341 -151689 -123717 -121442 -34598 -38874 -20738 23678 -1757 -26173 -48044
9523 -48044 -44033 28253 54852 134414 76276 43005 10254 42111 5724 -36911 -81196 -50947
9511 -50947 -72665 -152575 -103096 39104 109963 93279 74155 148019 219359 257643 144974
9500 144974 62085 74420 79496 31982 -74825 -116909 -121981 -21072 -40889 -48162 41525 22751
9488 22751 34890 21859 14702 -47888 -38342 -53851 -16048 64520 89222 -17790 -99520 13560
9476 13560 17319 -8534 -22205 67756 82558 -39013 -53836 -36550 39869 98826 139105 111343
9464 111343 -38158 -145410 -198961 -184874 -135521 -47841 26760 -54416 -156071 -118438 -74995
9453 -74995 -28796 -8024 -42339 6273 35636 30376 -4560 -13896 -6598 43926 34849 9565 -3910
9440 -3910 39666 -229 -23721 33257 67767 79653 105236 118780 88217 72748 101628 120394
9428 120394 120552 78776 48977 63454 -21456 -68616 -46592 -25537 -12718 -39106 -13706 15026
9416 15026 -21037 5420 -96654 -195335 -199132 -73747 10381 19839 26876 69315 21259 91181
9404 91181 123137 142942 175678 270974 179345 169044 127927 85710 16606 -7418 -48148 -30246
9392 -30246 10343 12328 10146 58132 55992 47181 85654 93477 -44941 -105666 -26950 -40178 -1682
9379 -1682 30308 40693 27450 86202 59122 23027 -35128 -68800 -47004 32422 60324 58024
9367 58024 49704 9627 -19385 -20238 35645 47288 115521 150852 91490 51340 54247 -39541 -82751
9354 -82751 7012 88048 109750 147353 190504 135716 41637 -15979 -41447 12438 51246 6243
9342 6243 -53232 -61630 -61993 -14100 8865 -23378 -4046 -7995 95204 229803 203748 144033
9330 144033 107608 111513 48538 -82946 -92968 -9311 48984 16725 -66364 -26853 50412 59811
9318 59811 -11330 -106532 -116590 42192 63344 73203 110654 72047 42735 16616 6960 45760
9306 45760 61672 -41609 -102751 -76711 -87226 -97218 -127179 -91010 -16006 -64790 -97232 -34040
9294 -34040 -66467 -97941 -54505 -73322 -23302 17056 74788 61173 82048 42905 -27518 -29021
9282 -29021 -47277 16013 42448 -4512 -35497 26219 -22840 -70467 -155801 -155176 -40331 14667
9270 14667 1051 52906 92326 13218 46893 68662 57332 16077 65107 112613 139394 93912
9258 93912 57770 81602 50900 6721 35655 116563 17965 -91252 -108612 -43989 -26682 78864
9246 78864 158463 136608 122463 26907 -28958 1847 -3634 -8737 -619 -34214 -53269 -24156
9234 -24156 -21691 25059 59180 44112 37059 46293 94295 139892 153448 145919 55321 -18351 -118015
9221 -118015 -159960 -137036 -135906 -78322 4896 27188 28056 19148 -22967 -98904 -90682 -13200 22207
9208 22207 53898 24164 30241 60254 98776 22360 -92817 -92103 -59047 -53694 -57908 -46712 -119755
9195 -119755 -179078 -182450 -256502 -174459 -118964 -77087 -15441 68979 53591 26038 30269 2713
9183 2713 15930 -10930 -71213 -70425 -92346 -47282 32357 21341 -39894 -62653 -70233 -24822 5914
9170 5914 -58199 -90959 -81947 -32089 -118781 -153859 -139772 -47105 -67348 -131734 -87580 -88613
9158 -88613 -75701 32257 31180 5172 32144 1884 -6057 -34494 2578 86692 120502 76939
9146 76939 20969 -7581 -27438 -36346 27099 64075 67264 10170 98350 142371 179792 272863
9134 272863 276909 82927 17809 41448 -42179 -158861 -122584 -31936 10522 -19397 60776
9123 60776 97667 79920 58643 21236 29381 -18231 -100398 -91281 1873 8191 -47121 -34558
9111 -34558 -47178 -35363 24305 75646 74391 4088 -54093 -39202 -35713 -11523 41190 27679
9099 27679 91476 202657 127879 96507 131394 155702 125278 122367 162643 120420 135968 123508
9087 123508 64598 71547 120742 86859 29276 8987 46557 80277 35159 -6198 -82943 -83297
9075 -83297 -28663 -53714 -76349 -101062 -62748 -69436 -42194 -18305 -3696 11619 -59733 -66086
9063 -66086 -44054 -42878 -38501 -60715 -67717 -72439 -79899 -135394 -70354 12469 -5315 -94263 -81244
9050 -81244 -99427 -111526 -44270 -68910 -83999 -119242 -118004 -60587 25328 31788 11290 -44474
9038 -44474 -49552 -85437 -43313 13471 57046 87599 38324 43831 53914 52215 -28078 -44187
9026 -44187 19321 2433 -90084 -17541 9571 78347 181360 103445 59199 34784 -36044 -90169
9014 -90169 -90532 -31548 70486 113150 113462 36415 -77205 -109048 -65397 -59898 -106729 -119572
9002 -119572 -85767 -65577 -99807 -97122 -103363 3903 38878 23782 -41208 -31873 46878 54630
8990 54630 105455 94669 75616 39658 15925 -19837 -23380 30040 43543 9845 -78918 -106072
8978 -106072 -71507 -55233 21119 49971 69708 84870 36500 10685 17764 -65818 -33763 -5342
8966 -5342 -10710 21404 13518 -45891 -73163 -117663 -30685 -23372 41169 120438 145199 189332 61137
8953 61137 -51485 -127871 -116162 -88651 -16228 -19915 -32102 -15670 -18964 51529 46062 -4930
8941 -4930 42689 112050 -2150 -56847 -90383 -138061 -132779 -137504 -86654 -51184 -24273 -47236
8929 -47236 -26199 -98908 -102397 -77057 -123471 -79145 -19235 -9417 20534 -8957 -73406 -29417
8917 -29417 -3600 -11625 19545 -38309 -54382 37206 49713 101512 61554 32355 28657 47774
8905 47774 40877 40016 56564 87071 81476 86425 45693 74231 149834 116578 63018 78505 17954
8892 17954 -2508 -35043 19691 78724 57964 -8803 -81214 -78029 -60657 -92230 -95027 -5250
8880 -5250 7960 -73789 -115360 -53519 -6981 -2241 -70719 -166624 -190001 -66360 -34962 -57082
8868 -57082 -21875 -69421 -110965 -69793 -82515 -52780 42437 102758 158516 22399 -23121 -9282
8856 -9282 -47684 4817 70088 55343 86705 26300 50353 102749 58512 67382 -4373 -52322
8844 -52322 -54323 51951 54344 34708 34901 -2610 -11013 -81746 -119782 -55783 46478 115260
8832 115260 100422 132254 43477 39632 -28060 -144668 -47054 -158473 -185693 -13455 -13377 -6772
8820 -6772 75274 69980 34206 2037 -47447 -50570 -50108 7281 -30249 -10689 16233 37259 100708
8807 100708 60319 30660 57411 -28547 -71893 -97528 -117851 -149320 -88123 -131429 -146778 -53619
8795 -53619 -25812 -20273 37010 7043 -9865 51108 17727 -4873 -25059 758 -24723 -3854
8783 -3854 49372 52948 -29169 -76300 -40188 37736 49365 -40426 -139205 -139671 -77449 -51260 -41462
8770 -41462 -9987 28452 26998 48981 36245 -29078 -1090 -7061 -4762 36435 104410 89948
8758 89948 106770 107423 68359 41490 24083 50079 111395 139033 116277 187984 171641 82266
8746 82266 62091 64577 45333 -6984 10343 31965 43685 65686 79522 113302 83785 -29026
8734 -29026 7364 66975 16515 -8756 20222 42515 71951 63907 63611 17625 -27598 -66625
8722 -66625 -51512 -93567 -70787 9456 117733 136282 11780 -66912 -50727 29653 -17197
8711 -17197 6906 56129 31415 33150 -35455 -98233 -37488 -9216 90417 112829 15780 -127666
8699 -127666 -148200 -37904 -9540 -43394 1315 21362 40785 124332 65381 27083 -13571
8688 -13571 -35189 -45713 -80264 -160451 -132985 -95277 34017 92997 107904 21414 -12838 5064
8676 5064 29107 154268 170984 58749 53159 48976 -26636 -74086 -51630 -48403 -138816 -141047
8664 -141047 4337 93097 144901 114470 114664 161054 111154 64228 90084 132204 109702 12373
8652 12373 7032 82661 100890 95883 126026 184779 180018 125575 95901 30634 -62286 -64548 47522
8639 47522 59709 33122 -10566 -68574 -129384 -98103 -29566 -26091 -23209 -11486 -37176 -400
8627 -400 3129 -68498 -96409 -64826 -28281 42396 86247 7793 -10690 33281 54343 -22519
8615 -22519 -86565 -116331 -134393 -110068 -27875 66967 167285 150179 153281 54095 35349 40099
8603 40099 24190 1792 -21754 -39965 -26464 -37261 21387 19014 7479 -7719 -32191 73408
8591 73408 149590 39499 24929 -72702 -36333 50516 8333 -37408 -74425 -47840 65086
8580 65086 107465 23425 -35171 30619 101562 88439 66967 14239 -8022 19910 -18776 -7146
8568 -7146 50343 97589 114418 107658 23151 -23054 -94347 -130115 -116098 -103865 -44242 -65733
8556 -65733 -108102 -19374 32031 30542 31540 47925 -2031 -19794 -131003 -120611 35793 12603
8544 12603 -3942 2745 -81678 -65288 -14407 -74369 -97264 -9867 33113 -26002 -49557 -117821
8532 -117821 -90810 -86183 -92869 -7403 49754 9882 -59906 -62316 -25617 19643 -14761 -21828
8520 -21828 -93261 -30572 62188 66428 45044 51972 79574 92738 18079 42171 77819 39775
8508 39775 -3080 -15666 -16853 -7974 43333 134370 106482 10187 6171 33328 166 -12458
8496 -12458 14256 11687 -15061 -51374 -16719 7583 22119 -8204 -16071 14005 47867 52821
8484 52821 57019 89495 100981 179719 157195 153423 156433 128674 233275 183221 132911 82932
8472 82932 23828 117537 220308 246097 151857 71204 103375 94929 131698 135695 18851 56990
8460 56990 46097 112741 191764 98459 59464 11949 20494 36956 -16051 -70388 -44943 -42168
8448 -42168 -11719 44879 54474 95842 113661 97213 100080 117106 76326 18412 14564 -6064
8436 -6064 -3686 17261 9738 84858 136869 80220 37112 21657 59688 117271 80561 -53496
8424 -53496 -99737 -8970 53491 -12066 -78198 -62946 -62249 -22795 -25884 -21082 -29650 -53253 -30329
8411 -30329 -85436 -87545 -197542 -241070 -106561 -27750 -22678 -73315 -36591 -28075 -27057 21673
8399 21673 2255 -42566 -34156 -14307 -40263 17291 27790 29501 -37148 -52434 -21935 12945
8387 12945 30317 43345 40320 52044 118738 173668 132964 97768 53720 -40869 -77375 -117148
8375 -117148 -28453 83501 62821 52110 43746 -19519 -87500 -89182 -60513 -150448 -137839 15574
8363 15574 116325 20093 45048 110985 58945 15605 1059 -55504 -81394 -95525 -45188 27052
8351 27052 -29016 -2590 33604 21424 262 -25438 -25158 -28218 -30508 40109 61736 109722 115452
8338 115452 85749 96790 -11741 -36668 -52448 -82109 -1196 56355 69390 32257 102054
8327 102054 77091 69116 53200 60374 -61170 -90575 -3238 13430 48314 107028 157884 172291
8315 172291 117347 37598 16330 -12291 30769 97993 135159 109140 -29201 -93367 -15361
8304 -15361 26323 52353 41507 42399 6982 31777 13195 -77519 -14581 39014 59197 -19832
8292 -19832 -94841 -38861 -27028 -12280 -55597 -116124 -112368 -16487 -30531 -110905 -147150 -140405
8280 -140405 -90163 -65258 -62827 -103720 -78545 -165464 -188796 -140533 -129720 -140976 -216623 -192535
8268 -192535 -176092 -173514 -88235 -10426 36478 14959 22110 -26807 -40259 -69920 -95761 -100816
8256 -100816 -44194 54671 110822 93333 14427 6952 107051 99198 -22542 -41944 -19409 -11636
8244 -11636 -4988 -24519 7431 -40293 -90369 -85331 -60715 -138864 -156496 -142369 -96201 -23823
8232 -23823 51156 6710 12757 -7360 77525 60458 2354 -34558 43137 -33625 16783 127948
8220 127948 167436 103690 37256 46140 75782 71906 84364 91348 21109 -26151 -110504 -142925
8208 -142925 -116510 -25110 68848 47616 -52122 -43328 -53393 20191 97248 54727 126841 133192
8196 133192 103095 66023 96567 64333 12540 -38438 -9773 8676 65332 22255 20815 -11856
8184 -11856 30603 85608 49998 34710 -9244 -6966 14236 62246 -2489 -6032 -37445 -43900
8172 -43900 -18094 -819 -43559 -69728 -48624 -21988 -4177 -5538 26640 -24566 -390 56144
8160 56144 112906 165982 153762 105963 52906 -18584 -76302 -109549 -136851 -114739 -88237 -49921
8148 -49921 -33802 7437 -65799 -116939 -39711 -4538 106128 99948 55406 92783 121701 48270
8136 48270 52370 72740 99371 77048 72817 95374 75206 147786 40862 6763 -3560 17733
8124 17733 11291 80734 84237 127766 152454 12500 -102926 -83558 -46819 -43382 11401 46874
8112 46874 -29874 -73964 -47449 -94456 -97118 -4457 17193 11842 15867 16312 -30038 -41339 -79609
8099 -79609 -113455 -120634 -142193 -104675 -82424 -59344 -11777 57226 17089 -48287 -28149 -52742
8087 -52742 -158669 -151807 -92663 6148 53571 49508 -7194 -10977 -60754 -78805 -75859 -71468 -42700
8074 -42700 -11916 -135293 -137702 -107692 -104923 -29624 14756 71888 126687 52764 24458 -11001
8062 -11001 -107105 -151247 -71453 -51364 -112976 -137512 -186303 -144185 -103952 -38396 37253 -9348
8050 -9348 1288 27311 41589 33886 -666 -23886 -97832 -86235 -68016 19459 39065 39520 8595
8037 8595 10489 15253 6894 -64055 -68339 -50168 -52945 14597 117246 198961 180849 86384 75037
8024 75037 63045 8582 -7216 -29756 -7054 37574 82946 73379 64954 51233 -35490 -59604
8012 -59604 -88633 -72716 -34016 -24138 -36698 -40488 4187 8280 47933 -48079 -129516 -124590 -42503
7999 -42503 3594 -5439 -1622 -21074 -41598 2833 3379 -24302 50590 12554 -125627 -136826
7987 -136826 -98908 -53186 -4255 -2942 862 -39358 -15717 -13317 -6723 38025 65028 14863
7975 14863 -22390 -36559 16955 -8816 -67842 -49772 -515 -26739 -42668 -68405 -23198 90064
7963 90064 125707 136713 85982 42443 -23799 -12523 -27993 -43652 -15674 -31196 34723 47648
7951 47648 34025 75037 57269 -23438 -39496 -21799 -96830 -112548 -134092 -93448 -106073 -107913
7939 -107913 -145048 -100375 -20418 22664 -13519 -41062 -43029 9395 76340 134195 100020 23746
7927 23746 59745 58563 41990 96916 147371 96068 -18648 -87646 -94938 41245 56370 10746
7915 10746 69501 143176 138537 82899 12034 -11052 -84001 -35469 -371 -8346 -34233 -116557
7903 -116557 -100048 -67659 -45606 -25992 29342 53983 117269 106445 148777 112047 24868 93973
7891 93973 171607 198585 137227 92405 40048 -11349 -91095 -163252 -236953 -162013 -133153 -162562
7879 -162562 -42292 -35811 -103386 -141804 -137351 -76849 -62614 -69652 -123424 -194537 -174176 -91964
7867 -91964 -70933 -42129 -81435 -110828 -89102 -36747 29578 64926 -46140 -50869 -2938 504
7855 504 -29773 -79662 -138475 -83101 31228 -2061 -93566 -51279 -24992 -103266 -162023 -105128
7843 -105128 -103344 -111547 -65343 -18819 -854 -30527 -50408 -58725 -38271 7492 -6638 -36823
7831 -36823 -68341 -69540 -18057 -1127 3415 -47370 -114404 -86402 -2199 64350 50700 13516
7819 13516 41 -67498 -35964 -10174 -39554 -47539 -50029 -10125 -11069 -67008 -5646 57349 55743
7806 55743 -10016 -12843 -17656 -30676 -19287 45357 46188 116311 56838 26017 76710 56049 15995
7793 15995 -54378 -112833 -141986 -155984 -136864 -53726 -20616 -45887 -51991 -25183 63524 119831
7781 119831 172574 151267 159824 109844 78535 67671 -66000 -83504 4760 48950 10211 2797
7769 2797 -9302 -50677 -51020 -12798 -13022 -39335 -17762 -13418 -34117 -6995 31909 -23175 -38034
7756 -38034 -33708 -31493 24627 34872 112494 162170 148216 180343 126846 44523 47411 47142 -58940
7743 -58940 -151806 -171002 -174089 -125359 -103152 -12631 -18544 391 37765 -12481 -5937 67706
7731 67706 24334 24258 71835 70072 -19608 -95446 -54482 -38570 -40761 -35682 3203 49134 -10422
7718 -10422 -134923 -206249 -187157 -151167 -149245 -134058 -79393 -379 37491 -67568 -68196 -53838
7706 -53838 -97225 -175632 -113954 -91941 -70483 -45027 -36743 3919 -5931 80019 92828 30875
7694 30875 -89059 -15775 54400 70520 17489 -47293 -10721 32907 31135 73803 95775 78447
7682 78447 92698 11899 -65821 -28761 10746 37172 64331 -45002 -167002 -223322 -192661
7671 -192661 -163245 -116944 -120208 -157484 -78093 -77533 -108802 -79511 -27853 -14029 -32136 -17626
7659 -17626 -19053 51398 36158 -46042 -23242 48454 76597 80848 98444 58500 -14854 -46352
7647 -46352 -164977 -104773 -66361 -92711 -99036 -59305 9172 39010 6536 -25605 -64763 -28253
7635 -28253 -16376 -17630 -3154 26541 31086 53774 58018 5644 -10318 -32027 -48898 -89875
7623 -89875 -95744 -106957 -63205 -51272 -64674 -45433 -16985 -115772 -91587 -53303 -104044 -142573
7611 -142573 -35824 -33033 -61789 -33894 -67985 -125135 -67950 51373 16910 -66788 -79434
7600 -79434 -71257 25589 29379 7249 -22707 -99262 -162671 -143744 -31683 11929 23879 31565
7588 31565 -49660 -69942 -37813 -21021 54907 100185 147576 109989 108078 50245 89910 53645
7576 53645 -1266 47902 72624 103779 124537 102721 18090 8798 47495 28928 -58895 -73654
7564 -73654 -80510 -48579 40068 98012 152699 190256 150172 139579 106907 132026 62423 13458
7552 13458 -50547 -40913 -33986 -79149 -148148 -226019 -179934 -135770 -86378 -64341 -31979 -56349
7540 -56349 -119818 -147311 -111511 -121136 -40503 -24502 -29910 -90310 -100177 -112836 -35212 -20428
7528 -20428 -114895 -125066 -103488 -80178 -38625 14719 26152 6892 -43104 -37407 -57554 -43770
7516 -43770 -43870 -83649 -39667 -40488 -7200 -26914 -73343 -105463 -78948 -69710 -153959 -146136 -94635
7503 -94635 -120326 -95124 -62492 -28305 -26035 -8004 -22681 13643 51591 13769 -30862 -17097
7491 -17097 21982 33766 -40019 -54307 2630 32004 11252 -62352 -99235 -47519 -119449 -131900
7479 -131900 -98884 -85591 -92466 -29788 -78403 -125703 -166396 -146713 -118126 -119945 -75029 5914
7467 5914 32479 59234 24550 -59607 -6796 101229 125887 23077 -57576 -28861 -65888 -98490
7455 -98490 -10036 -3387 13453 -1617 15826 -2589 45923 47564 18147 -25689 -17073 -70286
7443 -70286 -73411 -8617 56191 70547 42823 10345 38575 5178 -19870 -24456 10088 -5859
7431 -5859 13551 -31276 -105868 -104058 -70297 -92637 -131546 -118996 -19256 -69618 31885 58787
7419 58787 -4405 -54321 -61467 -28884 -90348 -115415 -163672 -159307 -189943 -186164 -43430 -34010
7407 -34010 -159241 -74238 -57634 -28208 -42457 -38111 10016 20708 -8729 -92903 -64372 -27854
7395 -27854 -29906 -11830 -47487 -16408 19322 -15223 1542 14291 10246 -36073 -86496 -87763
7383 -87763 14005 20596 -13747 32917 -5639 -65343 -55101 51 -14633 17184 36016 1848
7371 1848 10345 -3298 85556 133105 136259 140189 140427 100783 124128 99127 130492 30163 36115
7358 36115 101856 108865 93920 46957 30454 -22442 -65833 -28200 52415 73477 16425 -24193
7346 -24193 -40562 -21029 -56596 -153583 -82817 -36961 -68012 -55721 -79602 -106495 -27529 -22302
7334 -22302 33907 77211 -2240 29263 32896 34696 36394 -17329 22501 93074 106393 6631
7322 6631 -47145 -325 35571 16052 -20371 -39378 -8105 57887 40514 40288 -6328 -63652
7310 -63652 -80859 -34829 51862 68136 79925 150503 181605 176017 181429 200625 189723 161808
7298 161808 87277 -20082 -29861 -10499 -2115 -54685 -110914 -224830 -238308 -85919 36609
7287 36609 80311 44053 24701 -17646 -38335 -51971 -50019 -23312 -44702 -99199 -157576 -141417
7275 -141417 -118950 -151064 -186109 -159507 -163914 -159690 -92004 -11793 -41807 -54263 -52660 52582
7263 52582 182381 187734 186428 177025 100415 26545 -8947 44252 77831 31507 -60795 -63790
7251 -63790 21645 84001 84454 151919 98967 -56768 -96468 -14128 -37994 -48165 -84599 -108940
7239 -108940 -155919 -208257 -170999 -135135 -159158 -66457 91999 151183 45060 21367 64945
7228 64945 20112 -35214 32746 24642 37464 -22422 -56968 25362 -68259 -216161 -221060 -64746
7216 -64746 33831 86571 95451 97734 68402 24309 -75414 -87298 -8513 62923 -21917 -112786
7204 -112786 -132277 -54727 81576 82088 56719 19152 42108 40913 2504 -30373 -68118 -22600
7192 -22600 110657 130312 44119 -69843 -83437 -103429 -159840 -216190 -182499 -107508 -28189
7181 -28189 -38089 -54526 -60515 -72264 -4992 91255 131910 99936 13967 60951 4664 -14464
7169 -14464 -44375 34575 61826 58646 28441 -7723 39932 74578 57211 13514 13010 -34880
7157 -34880 -42504 16796 73256 103057 54137 27936 1955 -72625 -51500 -8092 104876 67026
7145 67026 41717 41296 81167 24701 -66021 -110144 -53930 -18992 12725 62884 66075 102455
7133 102455 67087 48179 32976 1056 15944 -27507 -119288 -157315 -77536 -29186 -22393 -84123
7121 -84123 -49113 50877 79865 -58305 45539 102940 112082 94631 79932 107798 92379 968
7109 968 -134686 -139399 -10078 22166 -64968 -7852 133889 151276 43461 43257 -47145 33634
7097 33634 49769 -4075 -66192 -84394 -25904 -94850 -154552 -164346 -56721 -33715 10868 59910
7085 59910 79140 56349 7499 -47126 -68011 -51386 -80105 -69252 -51421 -10900 27933 -67370
7073 -67370 -97936 -47789 -42427 -80986 -155771 -284482 -266605 -175343 -109432 -93923 -15971 69638
7061 69638 63140 35904 -6694 -76392 -115530 -98429 14915 -4228 -62969 -39699 16614 69639
7049 69639 72919 52487 51091 -13463 -31416 -14475 -9836 55952 147299 191254 131185 45027
7037 45027 -29515 -108966 -57485 78635 55599 -102396 -71662 -27205 -13410 52493 163882
7026 163882 189847 172819 115568 11565 25470 -44344 -26752 -6797 -92975 -70941 -83057
7015 -83057 -93154 -183070 -246344 -153607 -61648 48016 -24006 -92386 -88521 -51035 56508 123904
7003 123904 127789 111972 140381 142368 57009 50516 -25482 -40594 5914 -49578 -63672 -35395
6991 -35395 -87649 -68117 7165 69576 101851 9577 -136423 -111707 -27824 -95365 -129021 -93289
6979 -93289 -24340 870 -34871 21248 25813 -48135 46882 27006 -39786 -74175 -56370 -68575
6967 -68575 -44877 -14221 -7540 -52352 6427 104956 -34230 -102280 10635 25396 -84665
6956 -84665 -169418 -205091 -155382 -79194 -9570 -74338 -142476 -116431 -85243 -99231 -177605 -191008
6944 -191008 -223704 -176249 -163965 -221650 -222313 -246630 -135390 14764 145601 162883 3872
6933 3872 -66661 42773 -34093 -54034 -32464 -104768 -115750 -116626 -110724 -160359 -217027 -183425
6921 -183425 -172420 -141918 -101630 -107987 -106924 -100592 -22422 42573 -8353 -66965 -57867 -78125
6909 -78125 -50675 -13601 -46998 -14054 -41605 -100241 -115689 -42101 45391 23736 29717 -30205
6897 -30205 -115582 -98708 -42168 -44056 12491 68767 36916 103320 131921 9628 -28464 55709
6885 55709 86364 33258 -46175 -33833 -107493 -181237 -149963 -164225 -69639 -465 -52239 5966
6873 5966 -54845 -54882 -38428 -89893 -137409 -154383 -36727 -8552 -16283 -3188 -17761 -12764 -59752
6860 -59752 -151641 -197475 -215346 -75021 -11946 -18213 -22449 -2957 23022 -1089 9296 47728
6848 47728 85233 -47954 -104285 -91275 -47844 -14027 27635 29864 -9874 -159973 -150090 -95044
6836 -95044 -117649 -74175 -44169 -15228 -11449 -1858 132613 64125 -4212 19988 -70654 -76043
6824 -76043 2373 88465 125754 108244 80004 99587 55391 -40957 -3775 27431 24563 54958
6812 54958 44532 15560 112491 60689 3723 -32726 28260 100526 82623 31038 66210 69358
6800 69358 76369 40435 24783 20177 -29501 -62548 -198 -48824 -60538 -89500 -115279 -158646
6788 -158646 -145149 -133026 -141539 -91013 -857 -9339 23562 53671 34088 -27946 33141 83062
6776 83062 164269 176071 54184 29934 35438 10939 50431 89656 119437 105163 15025 -75125
6764 -75125 -47013 -25897 -25639 68834 123877 76763 97260 49557 19119 -8473 -62525 49804
6752 49804 168451 41145 -16952 -17659 18550 14926 60901 147226 199550 180229 133988 67508
6740 67508 -9008 99626 161104 169393 117773 7088 -25375 -35982 -90536 -135810 -95630 10702
6728 10702 4667 -113773 -99014 -46163 -51735 -166662 -281666 -285569 -173182 -110541 -62141 -28283
6716 -28283 -47812 -137060 -162743 -110144 -96152 -150335 -201518 -253908 -258474 -173823 -144246 -121846
6704 -121846 -45129 -17380 -63822 -133296 -74031 -16769 38166 140390 162986 117906 73197
6693 73197 16097 -14394 20199 7552 -7955 1665 -33326 -32668 8086 44442 17813 -77305
6681 -77305 -51700 -18326 -24755 -96995 -163815 -145645 -97866 -28623 -105369 -72901 -41310 -44393
6669 -44393 -92247 -107724 -111364 -93638 -93903 -79433 10773 26302 -11401 -32128 -69376 -68685 28365
6656 28365 123910 103679 31847 -22326 -78840 -103299 -81269 39160 75182 57431 61908 36616
6644 36616 -23765 -48943 -73258 -39161 20720 -13848 -23384 12515 3700 74415 70162 32171
6632 32171 149126 230403 124796 11755 -43866 -57951 7079 78884 39026 -35415 36854
6621 36854 85990 11917 -62571 -100763 -77973 -38090 -90444 -127538 -149010 -66083 27403 43092
6609 43092 49046 -26138 -86647 -60840 -12614 49045 49708 -49893 -67351 -753 18050 -1043
6597 -1043 14856 67522 -18452 -114598 -160556 -101652 -37193 -30307 -18488 -10924 -60700 -75378
6585 -75378 -98885 -66098 -69274 -122289 -147713 -136244 -16877 93463 134219 96161 -529 -39335
6573 -39335 -47123 -75864 -75301 -107647 -118102 -96939 39953 64653 40993 79375 95134 15840
6561 15840 14194 -18070 -128788 -111554 -100754 -41802 -61687 -62906 -48574 -24782 -17136 10284
6549 10284 -45602 -125125 -190217 -101773 -76629 -85068 -8513 -22262 -94375 -137463 -89652 -80019
6537 -80019 -2791 41857 53970 76633 44768 -28244 -40531 -15259 92848 116151 39206 -18837
6525 -18837 75661 70330 48640 -13181 1132 81076 69901 59286 116610 127099 63731 -14245
6513 -14245 -52138 -67625 7740 27529 40252 14515 33956 3508 -16898 2607 -64551 -140795
6501 -140795 -82786 -22154 33477 -75203 -102977 -44576 1519 -13851 89658 102994 131490
6490 131490 145790 123691 92606 12950 -59537 -28352 -21446 -19733 39928 62392 59375 48833
6478 48833 53741 61694 136863 142704 25103 -61473 26141 34070 70092 110909 10379 -78308
6466 -78308 -79084 -91756 -147211 -94685 -693 41013 82431 64446 135707 234190 256300 201580
6454 201580 143851 138021 34480 -47435 -86330 -56612 -56161 -53267 -93222 -122448 -96052 -47913
6442 -47913 1352 -52276 -112041 -59776 12922 34581 39226 36948 54582 89868 110499 6038
6430 6038 -26617 4477 32629 70421 3108 -56199 -144420 -142450 -104854 -74260 -24742 -56981
6418 -56981 -69556 -26968 -62468 -37410 -49518 -11423 926 3085 41036 32035 3545 -24149
6406 -24149 -27400 8626 43665 34083 4666 46018 -69537 -144859 -63655 -25736 -94120 -81018
6394 -81018 -64179 -24931 -23924 -72330 -172462 -207268 -139392 -153010 -195506 -178937 -77510 -58401
6382 -58401 -43078 -87079 -142527 -85369 -53105 -79816 -92844 -40435 -111447 -47945 -60121 -50063
6370 -50063 -82886 -132323 -68171 53270 113146 56497 46478 89127 -23994 -170609 -143606
6359 -143606 -114738 -140781 -124473 -59824 -52575 -95403 -117705 -88093 -180854 -198224 -169843 -150267
6347 -150267 -185151 -160896 -106313 -1315 16244 -33974 -53211 37939 110187 40743 -45590
6336 -45590 -18562 14688 -11003 -29139 -27027 -96384 -90343 -259 -7351 -66496 -5593 40475
6324 40475 49851 -19717 -8660 61544 78763 -42687 -53231 -3651 -1129 -38926 -35533 -38433
6312 -38433 -101299 -48953 59222 96647 72800 -12275 21832 -10667 -2475 -44476 -69093 -31246
6300 -31246 -31557 -106750 -86081 -22319 -34166 -43339 -28820 -74800 -103054 -45362 22456 12863 4980
6287 4980 16996 62856 40408 36993 -19073 -68466 -30999 -22789 -62807 -57942 -1814 9021 2182
6274 2182 7644 -14499 -37206 -123848 -77173 -24351 -34479 -38384 -2880 18961 -37002 -146973
6262 -146973 -154321 -102287 -17300 -1115 -29261 22286 8040 -90420 -141361 -166207 -134992 -108558
6250 -108558 -114293 -23738 95400 36526 -16876 -61309 -72335 -4572 -688 -82623 -60064 -130756
6238 -130756 -150126 -54785 -51781 -78936 9862 -44949 -76590 -39198 5680 36728 -21183 -33220
6226 -33220 -53788 3580 63984 26255 -34232 -72418 -83574 -95705 -118466 -193658 -255918 -261381
6214 -261381 -200248 -128749 -82808 -139403 -187452 -85985 -2752 -36297 -18195 2244 -1703 -57730
6202 -57730 -98404 -71959 -70628 -148141 -168286 -149027 -182631 -124246 -152720 -115002 -87694 -88837
6190 -88837 -128599 -126912 -97507 -123771 -127037 -74164 -10941 68216 74672 7644 77671 39658
6178 39658 17839 -65474 -91757 -24779 -50506 -32228 -7158 20641 131331 175235 105379 26844
6166 26844 -6418 -51599 -12463 21831 -11847 -98821 -134332 22836 119537 63667 -46251
6155 -46251 -20577 -19882 -1276 14184 -22421 -70050 -75639 -54465 -95500 -56780 -65884 -58566 -75925
6142 -75925 -111183 -44709 -18385 -27899 -89402 -80874 -20243 -23592 -21774 -99416 -168265 -125454 -77699
6129 -77699 -142118 -93114 -82434 -28014 -65224 -88212 65269 76379 -18773 -109102 -161515 -141209
6117 -141209 -72560 7581 24073 -36889 -135032 -158485 -147220 -45510 53308 17870 -25794
6106 -25794 -123852 -145808 -61729 27702 39776 67265 73750 -25123 -139463 -170141 -130866 -75811
6094 -75811 -39133 -51094 -27985 -17727 52546 159385 146268 87068 85425 102540 120796 111327
6082 111327 -882 -38394 -15448 -2033 -12140 -15893 -21216 -65200 -67338 -31152 -5034 60311
6070 60311 73058 53408 60837 3948 -23072 -37000 -38089 -90030 -163584 -217282 -110133 8856
6058 8856 32299 8832 36183 5660 28071 101509 158433 111158 -33674 -126175 -138181 -79637
6046 -79637 27575 156412 195959 85133 49173 -10136 -53869 -19946 -107351 -162601 -189794
6035 -189794 -224358 -198337 -182951 -216369 -274010 -222012 -133495 -145553 -187198 -88511 -48452 37083
6023 37083 34551 -94360 -148816 -108897 -31626 -80280 -62251 -37766 -28933 -23808 -24078 -66668 -156218
6010 -156218 -89208 -32240 -143100 -181221 -127013 -136596 -93593 -35266 -39070 17065 96071 111422
5998 111422 66215 54708 -10358 -57443 -17587 52544 -876 -110246 -95561 -28797 -65579
5987 -65579 -26090 -43776 -75920 -90863 -67880 -11669 52199 78032 92144 -33917 -59105 -60511
5975 -60511 -38273 62270 105297 -10026 -64040 -79604 -61148 -175588 -205916 -149958 -95209
5964 -95209 13928 93242 105756 31094 -43313 -52364 27291 83720 8870 -2987 -5514 -65297
5952 -65297 -97511 -98614 -103339 -100013 -163980 -102328 -3217 -12203 -45625 -18917 -59263 -35103 10845
5939 10845 4566 43361 78619 26361 -98539 -161085 -130925 -58524 -43959 -115960 -81306 -37454
5927 -37454 -64473 -98804 -68026 -12738 3831 -53224 -112078 -97996 -51546 -23169 23276 9289
5915 9289 27669 42595 55398 114236 53879 39510 38665 -31523 -109260 -41714 23827 58210
5903 58210 40628 24483 -38488 -10952 -22628 -56626 7981 85467 146099 136896 133157 105396
5891 105396 82859 64320 74465 32713 57696 -19006 -53559 2747 -16692 51698 142100 41214
5879 41214 -9482 12966 11960 28940 119401 -11765 54 10421 39347 14350 -42184 -28621
5867 -28621 23838 24988 -78136 -50327 45772 -3299 -53644 -62956 -25347 -86849 -77462 10978
5855 10978 44942 -46136 -23420 37305 -9671 7065 39900 73134 75499 61942 35065 -6174
5843 -6174 -141553 -161338 -172491 -190703 -77111 18930 33136 7781 5333 18711 -1097 19836
5831 19836 -61673 -112985 -73488 -6965 70004 103667 115270 102355 89185 59304 40872 -10517
5819 -10517 39925 55361 45679 109799 44135 44450 30210 23942 -32596 8586 24541 62894 53550
5806 53550 67071 105808 78650 50088 -20443 13404 15940 -45167 -153360 5666 80948 125299
5794 125299 31242 -14605 -2507 -35037 -35244 3754 62480 14632 49239 49783 -36774 -51969
5782 -51969 -39004 -34475 -80890 -14748 -52879 -36490 -85776 -125828 -65119 -89045 -67255 -44520
5770 -44520 -91277 -50589 81170 80017 -26698 -69016 18086 155691 170737 87165 42119
5759 42119 58967 60026 20331 -31317 18963 37457 -49049 -71889 -11814 90252 119251 18012
5747 18012 -847 44383 3693 -79170 -162557 -185457 -148462 -89984 -65970 -68745 -50765 -96917
5735 -96917 -93070 -27214 -42228 -108371 -108374 -122225 -83557 -53511 -41206 -130236 -134584 -81305 -55342
5722 -55342 -98314 -59676 -63397 -59703 -20521 31165 -30200 -83403 -143974 -172226 -183889 -187758
5710 -187758 -205461 -210833 -165477 -156382 -163058 -58558 -51875 1789 -37472 -42826 -61670 -71423 -19237
5697 -19237 -78692 -170964 -166500 -58421 -1615 -3395 62918 133453 58710 -12845 6456 59862
5685 59862 97510 90040 11009 -99315 -42107 -29603 -18428 -23346 -85562 -132739 -127354 -68633
5673 -68633 -9374 -6895 -13366 -57143 -118838 -22496 126672 75163 -6074 -67346 -50892 -4404
5661 -4404 -52847 -110531 -111702 -37849 -51087 11306 48378 21582 6508 -4015 -3282 -20642 2007
5648 2007 -23710 -53297 -27490 4311 61074 104526 94906 42683 41056 87078 124926 52426
5636 52426 -81295 -124059 -39413 99046 107564 91965 31238 41174 23303 -8528 35778 1194
5624 1194 23729 17904 2081 -30000 -94676 -59148 -62395 -29997 -42223 -61083 -102713 -68599
5612 -68599 -55132 764 30484 85033 51929 -2169 -107107 -83612 -24356 -28201 -13803 -92693
5600 -92693 -113020 -91586 -84997 -61578 -91827 -92407 -41025 -16426 -57355 -5541 62614 22285
5588 22285 -82167 -193491 -276010 -289095 -144812 -24288 140262 199022 181626 150894 75642
5577 75642 19709 1640 39199 43793 -12702 33348 -1619 -18476 -43399 -4972 -21900 -59135
5565 -59135 -133638 -142165 -125465 -95150 -33052 -62033 29824 -3330 43465 96945 -39852 -10370
5553 -10370 -7721 -67385 -60608 -87317 -43685 27217 -8826 -114847 -119331 -141551 -87700 -4393
5541 -4393 -6507 46229 19517 -33886 -74024 -108137 -44796 -63846 -40273 12952 -10814 -105433
5529 -105433 -113344 -106011 -74466 -29474 -36215 -14187 -72348 -180179 -149003 -104854 -31824 -77025
5517 -77025 -180643 -133034 8141 13685 -47837 -16213 -33055 -72128 -82240 -37976 -34257 55006
5505 55006 84081 77100 96773 55325 53401 44868 -33302 -35348 -3031 34122 -36554 -10275 38729
5492 38729 35699 43748 17391 33292 31072 48556 -37401 -79916 -26264 71966 38911 -42885
5480 -42885 -128084 -184025 -184456 -143246 -100617 -73212 -77846 -52841 -43534 -25181 -71447 -137915 -143294
5467 -143294 -142888 -53419 -134827 -110913 -154168 -161523 -149965 -138749 -220272 -191828 -197963 -158592
5455 -158592 -156001 -132846 -176874 -304242 -191886 -88954 -48594 -71646 -138426 -111241 -84557
5444 -84557 22846 1270 -62657 -99578 -114851 -66532 -63257 -160848 -136089 -29285 -30472 6479
5432 6479 22449 36641 -13963 -44256 -41881 -5272 -60336 -82880 36987 120431 114277 63125
5420 63125 -13163 6841 -17398 -79344 -84546 -31586 10331 -17996 -16344 8979 -62502 -96234
5408 -96234 -105287 -111733 -89958 -48787 -30270 44868 137161 190181 47538 -44203 -77999 -110733
5396 -110733 -167794 -136444 -41372 -18340 -102038 -123741 -58503 -63530 -140793 -45506 -72611 -105386
5384 -105386 -122273 -120890 -142076 -167203 -107038 -44144 -6186 -52332 6175 70399 68514 -32534
5372 -32534 -28889 4424 30938 -48936 -127017 -73479 -53081 34114 109013 90511 72013 27105
5360 27105 -36597 -8212 -21008 16789 -77755 -128848 -28618 -40934 43725 89364 153140 217781
5348 217781 104910 50346 43368 49521 15731 18725 26239 5892 5583 57071 72709 6997 -15892
5335 -15892 -33436 -46974 -124301 -191458 -108648 -79280 -36670 8995 10839 9178 -46315 -121713
5323 -121713 -154323 -196408 -126728 -35114 654 47493 -14035 -19410 35378 35038 -51404 -52640
5311 -52640 -61438 -45341 -9337 47413 -52741 -137954 -111693 -54740 -121277 -123805 -108228 -1261
5299 -1261 32749 -19833 -15587 39558 1348 -22499 -96353 -165906 -122756 -76437 -55918 -91248
5287 -91248 -115024 -179384 -92666 -55418 25329 20449 -21525 18558 23998 -23639 -16519 -32024
5275 -32024 20690 58012 64843 65996 44428 6077 -62705 -54233 -148628 -230339 -198791 -174336
5263 -174336 -118705 -53147 -5729 12521 24117 67102 109297 64679 -74159 -110550 -62396
5252 -62396 44650 -43039 -110747 -98336 -65730 -64973 799 54023 27458 45 -24532 40299
5240 40299 119904 107947 90402 -17461 -77505 -24356 -33266 -18143 32472 20649 37224 -74296
5228 -74296 -143282 -164592 -155639 -120382 -76191 -44176 107974 130940 18815 31407 66649 48935
5216 48935 56035 -16760 -28721 -102340 -47376 44186 47808 -72709 -59254 -59655 -34755 -19711
5204 -19711 44488 4736 -13044 -19500 -13874 1387 -41994 -36744 -55448 -3320 10934 22727
5192 22727 -63854 -132620 -125583 -77216 -157906 -120288 -24045 49631 92042 116765 109350 40814
5180 40814 28136 49297 -36844 -147124 -139782 -140294 -132044 -76428 -49882 -58766 -72054 -87616 -50575
5167 -50575 -39935 -77234 -122787 -119631 -56693 8252 64489 10702 -89855 -134153 -91978 -150488
5155 -150488 -110491 -87906 -117187 -98637 -37407 -51270 -46760 63807 108935 20353 -2158 -75351
5143 -75351 -58002 -60446 -30707 -49142 -134205 -194859 -96561 22034 20507 39488 127592 150288
5131 150288 97088 -54299 -148277 -161812 -75891 -31953 -34666 125508 147744 137524 175653
5120 175653 75477 61194 136520 135760 90889 21987 -47175 -27840 41972 -36568 -77854 -2228
5108 -2228 72397 50191 78433 39283 -1231 -39556 -48839 -114619 -186228 -137011 -44736 -56479
5096 -56479 -116596 -152170 -90866 -19234 -16159 -8822 83101 110125 105524 119216 68276 28768
5084 28768 -9440 -30307 -52137 50969 92469 -2574 -76857 -55318 19169 29092 40479 1854
5072 1854 -9300 -60310 -63238 3526 -47110 -63001 12701 54169 132543 221328 156787 79414
5060 79414 47265 40495 34042 13074 -53816 -53352 -53228 -45046 28107 31444 36123 41327 2467 21915
5046 21915 115741 158905 150823 71817 18718 49226 93290 48056 26332 3175 -23199 21059
5034 21059 23661 -73034 25820 25023 -19013 -123583 -172813 -139468 -19653 80135 116689 145451
5022 145451 73526 100525 122648 110024 156424 156059 94011 8436 -89905 -86507 -38601 -23887
5010 -23887 -44913 -65004 -48126 -35074 -7982 -12683 -15276 -56721 -102569 -127999 -65739 -3828
4998 -3828 18738 -54896 -61252 -48998 -46754 -79879 -48875 -58558 -80936 -83942 -49871 60641 146887
4985 146887 183757 135449 71456 -4668 19748 78278 28666 -66526 -96982 -85565 -160705 -227175
4973 -227175 -155626 -69750 -38517 -65773 -96253 24746 71178 27964 52277 38127 -8396
4962 -8396 -37457 -114620 -38628 59392 75343 756 -61943 -66744 -11514 -18795 -6645 13469
4950 13469 82469 107587 108654 23786 -74436 -77235 -7808 59984 38617 -70514 -91067 -77085
4938 -77085 33093 33988 -14962 25447 36384 28377 52394 78763 26587 -32984 -2655 36342
4926 36342 11093 21332 36792 52305 9575 41567 43865 -6411 -57431 -79390 -121249 -109291
4914 -109291 -89153 -46483 28868 30617 47626 116188 129293 26398 20172 96352 136255 52985
4902 52985 33223 120605 90756 90449 87561 54686 -69246 -111061 -118871 -151339 -104025 -41564
4890 -41564 -84046 -85639 -66115 -19282 100669 116665 73229 -15718 18054 -28941 -121682 -193537
4878 -193537 -133370 -17471 78704 78915 39066 42027 73020 43124 4621 -17634 -47142 -44627
4866 -44627 -41014 15725 57603 86866 130165 119266 73643 -22133 -62031 -85368 -71196 -58840
4854 -58840 -66399 -124524 -88471 -62127 35307 142948 128476 117369 76019 5005 -55882 -47014
4842 -47014 -47260 -18198 67603 38964 -49153 24920 -3935 -59500 1849 -7510 -50778 17091
4830 17091 38108 -32075 72449 68471 51382 11172 43418 92840 83985 138343 209437 98365
4818 98365 -17948 -19995 7743 14283 4944 17040 52597 36274 -5507 -48045 42180 -6330
4806 -6330 -117721 -107836 23960 54844 -19166 -48126 -160685 -185243 -170418 -137178 -104357 -65926
4794 -65926 -64305 -157176 -175601 -114683 -56636 -79950 -31155 69110 133882 137664 115838 137339
4782 137339 73344 -10119 -12499 -34155 -85131 -65770 -52091 -7836 -4884 -9770 -30836 59498
4770 59498 65057 96198 106416 105255 10133 -39848 -202 -52829 -72448 -24892 9045 18225
4758 18225 -26780 -6912 -15612 64471 119565 107811 42440 -11637 -634 -287 -75615 -201617
4746 -201617 -201741 -142511 -87066 -68731 48427 59208 9431 48748 23001 50102 -32659 -93447
4734 -93447 -144160 -133214 -53132 -20556 -50985 -81409 -85449 -48414 -4102 -2995 62137 73623
4722 73623 25030 6980 -24969 -54876 -99057 -121458 -28949 50093 -38610 -26757 36760 24693
4710 24693 -9255 6793 14463 -49775 -45339 36414 49605 -52698 -40726 -7779 55907 72677
4698 72677 15885 29260 16913 -76188 -138152 -162675 -145515 -65497 10698 137088 166633 5753
4686 5753 -14202 -15728 -48622 -114507 -146454 -96796 -46801 -19483 -3066 -35030 -7337 31639
4674 31639 -27248 -79788 -39909 -8537 59237 39438 34313 45434 48147 37325 -238 -29113
4662 -29113 4821 -23122 -51491 -70690 -48654 -8991 -37116 -21495 93880 105176 81820 71568
4650 71568 59423 52205 2332 -66305 -99380 -107600 -103023 -11369 -24097 -67987 -127420 -132097 -144151
4637 -144151 -146532 -72245 -81876 -130191 -101852 -49402 -49324 -23268 -68021 -124305 -95737 -83765 -70851
4624 -70851 -72680 -76220 -135026 -118860 -130362 -40953 77800 164407 184569 209380 183139 252301
4612 252301 114775 58608 74980 23388 -2277 45748 32225 24056 58066 73352 57224 5239
4600 5239 -84866 -68736 12161 46830 43606 33430 23921 -54265 -149502 -157900 -123623 -99896 -148588
4587 -148588 -128075 -41475 38372 19072 92461 142588 55712 -78761 -133723 -33555 -65138
4576 -65138 -44843 -8379 -42739 -27555 -60518 -127720 -105523 -137554 -180127 -91610 -91535 -45723
4564 -45723 -32342 -2203 20853 51212 61855 154318 83082 20505 37558 -53464 -78464 -94426
4552 -94426 -108850 -13915 10960 -21011 -23833 18614 -72 -41020 31420 -7293 -25484 -15798
4540 -15798 13475 -98539 -170453 -104968 -56378 -867 36191 110659 131261 114414 102122 97300
4528 97300 95013 92456 98611 184414 181158 124390 172131 177471 142018 55774 -21943 -32508 3924
4515 3924 41259 -1611 45736 23273 23893 2931 -9636 10702 33023 18231 -26362 -31539 -33147
4502 -33147 -74602 -50723 -10241 70382 55685 61777 -16674 -66031 -13597 14615 13887 -8791
4490 -8791 86057 85958 43960 -5155 18739 15541 53069 -8165 -62062 -115132 -145496 -167566 -85480
4477 -85480 3974 21547 -61892 -48604 -60365 -70690 -96242 -85780 -48465 -60798 -12033 79857
4465 79857 106578 95406 63234 72525 73446 36842 -11870 -3232 75169 33999 101197 69968 2588
4452 2588 -22722 30779 94543 106946 154304 179387 115874 93416 115692 51396 44218 8789
4440 8789 29963 -1697 -47866 -88983 -40678 -82293 -94012 -19796 -13927 -43106 -69725 -89306
4428 -89306 -113827 -141372 -133225 -62943 -40276 14514 74048 8479 -41230 -47973 -2933 -51433
4416 -51433 -93656 -38845 -5375 9322 -7396 15157 -4342 -53832 -37247 -49224 -48171 7430
4404 7430 107209 52263 -15954 -22235 98352 141630 24864 3246 55570 23285 32977 21595
4392 21595 5680 -21499 -48040 -50211 65249 12934 -153260 -185761 -201247 -66221 48724
4381 48724 83366 -9196 -67927 -63095 22573 75286 3225 -19487 35655 -46018 -71814 -112631
4369 -112631 -99544 -82352 -45138 -88024 -136984 -109288 -25662 41678 73582 63949 66049 141066
4357 141066 145326 186987 203604 112679 151254 161867 88876 62498 78957 42921 -95369 -169504
4345 -169504 -198635 -192377 -27056 84161 97481 86641 60941 25323 52568 36817 41844 26005
4333 26005 13429 -2960 -26432 -59819 -144952 -115200 -18953 -35330 -66651 1469 97612 116925
4321 116925 93633 84885 133603 123519 55807 99191 54521 -14238 11346 9571 -57088 -58873
4309 -58873 -107568 -123773 -132297 -128890 -120717 -73648 -35616 20538 25446 -10173 -4728 32532 60964
4296 60964 -6090 70942 59716 -13676 -97615 -43506 -38688 -49353 -9170 -8991 -60981 237
4284 237 65874 38387 -11215 -37053 7006 -50619 -66084 -89988 -82317 -67613 3073 -13593
4272 -13593 -84667 -40295 8564 -3245 -199 -48384 -36491 -15899 -30263 6721 35202 2134
4260 2134 -22700 -22642 -35352 -54287 -19363 24466 3801 22883 35797 12068 -26287 5918 -38776
4247 -38776 19908 150175 106996 37417 -45471 -81088 -80946 -30415 92786 137120 126796 85519
4235 85519 1700 -44454 30327 38298 -51883 -67641 -5488 -14122 -29303 -8181 11329 17515
4223 17515 92 -10593 -56560 -47657 -51246 -111111 -1922 -6216 -38783 -53501 22124 64691
4211 64691 55877 59317 67545 36917 37938 51281 82861 87405 14377 34060 35599 37128 40939
4198 40939 59410 50263 67742 84339 130817 161590 135989 130236 187925 185349 139858 26313
4186 26313 -22892 9137 65016 62868 -16554 -68145 -149562 -147632 -213743 -311261 -259597 -167942
4174 -167942 -126861 -63399 -101657 -99811 -97226 -112173 -143229 -85005 27168 56363 66040 44866
4162 44866 9369 34978 49285 46245 40563 39519 26881 27252 13259 -62419 -62745 -16279 11419
4149 11419 -4645 12191 60301 -217 -5802 -39615 -32974 -20517 29814 83821 51926 72846
4137 72846 51196 32000 37913 69399 169090 168192 97735 8485 -20867 -43154 -28694 7608
4125 7608 26243 -13498 10574 32901 92195 116506 69881 90569 49615 75607 135687 167626
4113 167626 115962 62272 86885 75900 55133 83853 89263 98593 97084 61611 15143 82371
4101 82371 101728 109720 82285 66457 106443 104512 63396 61235 49882 70602 59461 -82621
4089 -82621 -83499 -19394 110939 88471 -24945 -132574 -141510 -149358 -88299 -28117 -38014 -122445
4077 -122445 -79804 -28736 29505 7962 -13149 47947 69712 55592 32475 114474 165724 106002
4065 106002 110166 105488 57188 2809 22648 34941 -30482 -30682 -1144 40052 75910 78444 78599
4052 78599 48593 9062 18167 -17665 -86350 -89317 -111431 -137181 -184692 -70616 19088 11606
4040 11606 -98716 -144478 -185031 -37059 11449 137116 180238 110684 19906 -65927 -74358
4029 -74358 -87353 -82823 -27555 -1539 51848 30291 -44959 -40360 -22578 2754 -7203 -32313
4017 -32313 -75224 -65072 10310 56420 105433 129823 49469 10052 -51715 -52150 -23315 33313
4005 33313 54372 36360 11525 -47961 -26798 -33298 10298 42681 45347 7458 -5961 -140999
3993 -140999 -238322 -331811 -238799 -133576 -131383 -89244 -10241 85911 42836 -2376 -7351 18257
3981 18257 -10739 -81451 -49128 -13553 -3456 -66908 -38584 -70764 -48824 -31261 -31973 -43511
3969 -43511 -74490 -107874 -128536 -124639 -90533 -21054 -11126 -5664 -52973 -58352 -12376 57302 53706
3956 53706 66875 -14387 -15118 -19951 -32408 12630 135121 261562 167453 73508 22941 16556
3944 16556 -31152 -57229 35921 127495 68285 17189 30680 79298 45445 632 -64271 -104572
3932 -104572 -137395 -103999 -87508 -51070 -54130 31181 104598 24110 26232 52536 23496 -56531
3920 -56531 -85888 -21800 47102 39902 -18155 23076 -23194 -10931 -19119 -37336 -25563 -45136
3908 -45136 -16980 -64259 -65865 41690 2488 7331 38604 29170 -58910 -16177 53822 69593
3896 69593 43452 44391 5111 -17976 47829 77216 53178 53225 74872 45723 49109 77697 97756
3883 97756 65997 -17306 -56329 -14598 62149 732 -72730 -24720 -60194 -64809 -53150 -143757
3871 -143757 -163358 -134215 -83331 -99564 -51508 -1092 25826 -36768 -10988 -14698 -61560 -107624
3859 -107624 -94587 -77469 20641 76474 107161 96560 45693 7272 -22395 -25113 57243 101521
3847 101521 40004 39918 38544 53400 80318 58560 -14261 -1826 5338 -101108 -201434 -189514
3835 -189514 -130978 -76780 -74876 13567 21902 -21172 -64655 -82854 -7345 4951 5801 29893
3823 29893 -65360 -122256 -104674 -15654 59056 76831 107811 104354 55906 14427 45330 66339
3811 66339 35638 -2836 24478 59426 80906 -9143 -30402 12766 -15693 3440 -54010 -63782
3799 -63782 -62490 -65392 -50897 14462 74977 25114 -23497 -203 -45336 -87280 -95146 -46319
3787 -46319 -22152 54813 73545 34631 4548 7096 -4988 -32607 -38104 -24894 -14130 8077
3775 8077 88623 65008 -34791 -108971 -127763 -118372 -140814 -84624 -47720 -74328 -68969 -23706
3763 -23706 -46731 -64391 -10383 68937 90551 114244 62438 69228 71940 5769 9966 65079
3751 65079 32665 -37055 -41020 48966 -20536 -61500 -23714 -4426 44360 36062 105701 61709
3739 61709 44682 67756 51849 47742 49936 72657 25124 29077 41817 70499 -11017 -91721
3727 -91721 -63720 -46460 -50882 24968 106912 53199 18672 70880 69252 79425 51724 -54029
3715 -54029 -122427 -56097 -55356 -76870 -64776 -102557 -86912 -63396 -61609 -18233 23067 29850 19381
3702 19381 28448 67495 89897 66087 -16928 -49880 9078 -82601 -122601 -111614 -103904 -51212
3690 -51212 11620 44611 3180 -44058 -42442 29223 128161 113398 84985 122337 31418 -43677
3678 -43677 -8190 -35431 -113800 -148728 -129911 -52853 -10599 -13692 -16049 -38767 -93646 -85395
3666 -85395 -84166 -174605 -186929 -145210 -81950 -62891 -43146 16751 -21008 -63829 -137262 -171481
3654 -171481 -161753 -74401 -60837 -46615 9383 38143 52718 155043 110651 8946 38427
3643 38427 82249 115319 103485 111380 144482 78313 5090 -20923 2918 -9417 38979 3552
3631 3552 -34445 11883 -2639 23207 67686 28331 -71365 -76280 -29609 15349 35165 11438
3619 11438 -85799 -139063 -75240 48171 23894 -1846 24068 -18767 -45041 -104622 -134757 -154802
3607 -154802 -127094 -104496 -54028 -24657 -70902 -97914 -22624 10033 22793 23174 19153 -23910
3595 -23910 -4663 51421 -33326 -25064 15618 19701 11317 -44433 -81575 -171829 -239558 -182134
3583 -182134 -66210 61007 162836 147713 129735 75805 63321 48419 33383 -62935 -171825
3572 -171825 -125689 -94515 -132198 -105682 -126288 -66930 -40993 -2727 -19061 -56752 -85079 -48742
3560 -48742 3365 35434 -81 31782 59722 56339 59411 4177 -66599 -98674 -85238 -51298
3548 -51298 105684 149543 98632 94677 72496 67852 40649 27808 -11208 -35097 -37751 569
3536 569 24603 -34330 -47415 -22993 -4489 -64214 -73772 -36002 -1251 -51505 -7639 -21327
3524 -21327 -49527 -60085 -122405 -148915 -57898 -51848 -71989 -102075 -131062 -140310 -100978 19243
3512 19243 40731 -86753 -122303 -50928 -109632 -188226 -191780 -16206 36295 -24510 -126278
3501 -126278 -159660 -148165 -184217 -231588 -134889 -78846 -100363 -43406 -18526 7101 32765 -4193
3489 -4193 -41707 -81010 -63594 76509 -10373 -17073 -41929 -77468 -138674 -77245 -14135 4528
3477 4528 -17467 -63252 -96490 -56202 -26321 -25474 -81139 -41192 29489 37159 12294 12093 23869
3464 23869 37092 -9529 -13071 15446 68189 85187 81715 100687 54478 29889 -73851 -8042
3452 -8042 44824 93784 113789 119139 68420 -1291 -65988 -38750 58269 76308 12564 -46280
3440 -46280 29541 -1060 -37576 5177 -8600 -36458 -73621 -69682 -74633 -64532 -8106 82629
3428 82629 115047 124137 94423 29258 10075 59455 85630 49076 45660 72629 23346 46530
3416 46530 67652 -55018 -33121 -46990 -54938 4739 31247 -9438 -62488 -50449 -30569 -32180
3404 -32180 -84403 -29649 49819 74619 100761 114471 102841 53041 57404 85922 75552 95807
3392 95807 112223 97007 58466 -3230 20821 82529 106939 114300 44554 19666 -1300 -85125
3380 -85125 -36607 46768 25113 13814 6117 -2440 -51861 -78285 -77401 -27527 -34232 -421 21804
3367 21804 -23432 -25033 22240 2851 -10435 -79039 -73010 -135267 -146776 -40542 -43605 -40365
3355 -40365 11355 19669 8204 -53037 24758 152494 137213 70823 64582 133801 187418 132444
3343 132444 69854 59777 72505 88315 56642 45343 94243 56357 115474 147977 146401 80019
3331 80019 11123 -24987 -20573 -47564 -81605 -64297 -27935 87428 117122 181491 228955 187959
3319 187959 116051 65225 51180 30174 3729 -58727 -35891 86918 152500 98014 72774
3308 72774 17828 -54520 -26604 55819 19675 -13897 18209 -29861 -109045 -96960 -38371 -28622
3296 -28622 -55687 1027 69147 -5580 -103668 -143157 -44624 100570 118801 98865 54741 33199
3284 33199 23518 56514 56448 22275 -8925 39040 -6850 4750 46100 83155 80066 24960 -31174
3271 -31174 -71716 -78455 -87214 -35284 -44238 -75345 -62112 -169 -33891 -153902 -149666 -66381
3259 -66381 -21089 2846 -20978 -94118 -209379 -197711 -114418 -40894 70116 54495 -47289
3248 -47289 -14586 27134 67125 131809 151191 94278 30154 -20519 1271 10000 -72314 -52024
3236 -52024 -70829 -85590 -51852 -26410 -11293 -92788 -42081 43585 107458 42661 6505 8523
3224 8523 2165 -50552 24567 90064 72343 20598 -22936 -9727 -34760 -32553 -7676 -10826 -21253
3211 -21253 13467 -2573 88482 115087 27086 6574 6626 -833 42815 -8270 44887 42946 47995
3198 47995 92622 32635 -55849 -132949 -138691 -114292 -77528 -7133 -16568 27780 -19834 -84481
3186 -84481 -56645 -2669 39153 34527 42479 593 -48813 -80152 -39163 -40780 -127299 -142845
3174 -142845 -85287 36244 133981 141697 180787 167190 122606 -49782 -71185 -95490 -182196
3163 -182196 -123267 49850 69661 57623 37651 24906 35880 154972 185225 146343 101866
3152 101866 92110 164603 106923 6293 11783 -12599 -115008 -121228 -66184 -91855 -70915 -24938
3140 -24938 -16503 -51421 -84292 -22417 -34959 -30891 -53520 -49510 -4316 40314 18954 -4362
3128 -4362 49909 124653 116736 106103 120339 35723 59382 109342 125922 198817 147114 86999
3116 86999 97445 156159 101786 70387 86102 109319 -22030 -103456 -77237 -83687 -56922 -43001
3104 -43001 -53103 27548 112017 90284 137996 133279 101896 41297 -19908 -31975 -36715 33741
3092 33741 120834 140587 86321 72455 82426 121130 95814 103821 43536 13907 21887 28778 91715
3079 91715 114544 63448 39257 47550 30420 -25354 17273 2712 23089 47730 9995 29359
3067 29359 89616 107623 27329 65197 141304 95671 28228 21196 59917 56429 45638 -6563
3055 -6563 -93847 -78395 -12611 17828 20860 -72269 -75963 -3379 -440 38334 56657 87385 41302
3042 41302 -18323 25690 8976 -14952 -35949 -87298 -94563 -40187 52054 -2534 -59706 1622
3030 1622 21704 40300 -14265 94 1277 -21569 70239 184484 157376 110723 97507 127682
3018 127682 105388 75106 23616 86503 59453 45489 99642 133642 142122 63761 49533 116898
3006 116898 165219 75336 8873 29677 63149 47306 18955 -16677 -12286 57513 75165 42605
2994 42605 14360 -8348 15553 -35698 -23902 -14217 -5381 98692 211534 127981 -11729 -60604
2982 -60604 -86964 -51349 22942 20674 5883 39638 6312 -37513 -101238 -96135 -26534 15598
2970 15598 15606 -280 36426 -1265 -48295 13760 57744 40953 71843 -32431 -217775 -171729
2958 -171729 -170522 -179481 -141351 -129901 -146600 -112270 -116997 -99453 -95623 4012 3429 -53492 -52823
2945 -52823 -19874 -19287 20820 76856 73744 17891 -27368 -37903 -49989 15965 85597 68699
2933 68699 19584 78692 72510 1665 37222 -37542 -130138 -205082 -152078 -98967 -116449 -184139
2921 -184139 -125922 -38510 -2349 -75207 -109065 11326 60721 41624 -76544 -60185 -25961
2910 -25961 -7190 8683 60824 46900 74642 87512 22847 -56218 -23394 52185 149003 93564
2898 93564 -17609 -87270 -45547 61870 110303 45237 -28777 -106772 -5556 14140 33772
2887 33772 1843 21120 -5481 -15876 -100841 -12002 76098 96193 108741 77885 34338 122502
2875 122502 99472 -12321 -57347 -49454 -33963 -28522 -9973 23844 48076 -17644 -49914 -78102
2863 -78102 -54512 -72026 -80147 -73138 -44762 25780 80220 65932 20663 -57172 6638 25451
2851 25451 -14811 -28889 -57760 -46949 -52933 -95407 -31653 59891 70267 41910 68396 -29545
2839 -29545 -96818 -99773 -63103 -11821 -1766 -8269 51535 55759 -4200 -24895 42401 39251 21920
2826 21920 -13229 1032 -50509 -54404 -43871 -25418 16985 -12739 -23279 -14376 58665 98374
2814 98374 97700 131480 117694 125609 67900 66611 61872 30306 69478 103696 88737 69086 47449
2801 47449 479 -11078 -34418 53545 64524 112531 85762 -41760 -41061 -15428 -19780 -104856
2789 -104856 -7502 5647 39636 -13769 -5700 -21377 -63050 -100934 -83127 -44636 7875 41160
2777 41160 14577 -20505 -25036 -88834 -136543 -118097 -28590 19979 -30412 29938 98162 62954
2765 62954 51252 42351 33560 51249 139825 166444 86427 31075 3604 11537 21003 43769 82944
2752 82944 7346 -14377 -26958 323 -7359 7936 9783 17107 -15668 -5929 -43935 -66034 -54730
2739 -54730 -53984 10905 37932 -1327 -48142 2304 -31916 42483 30453 112459 160134 42020
2727 42020 -55128 -19654 16218 -34391 -104604 -108813 -71052 4242 45564 70174 129386 116612
2715 116612 80952 41982 -13901 -30690 -1283 455 58527 108996 94470 18020 -9452 -4830
2703 -4830 68044 -4766 -84804 -103219 -138236 -207788 -70721 -82321 -76117 -71600 -110314 -66021
2691 -66021 -77188 -6264 -4974 -12157 20820 100999 33562 40774 67418 41646 -37978 -50
2679 -50 51092 30653 -30537 76434 125739 88299 -4217 -109185 -57884 71969 100701 57629
2667 57629 -29134 -100684 -157905 -131556 -28874 83663 157336 123227 84555 41267 -21171
2656 -21171 -68089 -20034 -42341 -32621 3562 -27062 -20943 45777 85744 88211 4647 -103098
2644 -103098 -118757 -57613 51872 92907 168029 207029 176342 117971 5147 -54270 -44197
2633 -44197 -84003 -93812 -144325 -77357 -35111 13580 -43484 -57780 -36158 50435 28768 -57423
2621 -57423 -7556 67797 48886 28437 31770 54123 27651 -15293 32126 121309 112384 82203
2609 82203 19706 14463 72441 12735 -78 29661 89840 125335 140642 104723 55905 110909
2597 110909 136466 99792 36803 -13568 -16705 1424 -7739 -14311 -127717 -154161 -78514 -65758
2585 -65758 -63782 -20248 34723 60131 78721 51082 32492 115115 161654 92594 20920 -11017
2573 -11017 -71032 -41828 -94038 -94055 -46343 -27553 -23556 -62183 -17127 5836 18988 -20098 -57696
2560 -57696 -43788 -10218 1541 -66891 -64519 -525 60999 56311 33508 43101 151488 109911
2548 109911 76603 49992 -4131 -86494 -137544 -102877 -91658 -107020 -165753 -142123 -127625 -41668
2536 -41668 71661 142864 158101 121826 38566 99210 92299 72475 68908 -18081 -88470 -69768
2524 -69768 -12545 -105458 -114512 -49833 43557 45822 -703 -28070 -104217 -8479 138273 218127
2512 218127 167783 122047 63841 115381 72438 38131 113462 138883 67212 76146 22860 64507
2500 64507 152958 94748 45464 58432 80993 77226 71667 -4829 -76373 -22262 22304 -18590
2488 -18590 -53057 14637 9917 80645 91050 131225 69276 -2049 25047 15775 -4587 16853
2476 16853 28513 -67407 -13431 35186 76367 62612 95160 102597 120358 140834 114127 76962
2464 76962 9098 -33212 -96813 -83576 -63342 -31854 71907 120719 92888 61540 48277 45521
2452 45521 51567 34450 45144 -49676 -108931 -30617 -40959 -53586 4656 140725 138752 83500
2440 83500 142108 123785 125825 183003 72784 64342 64798 7980 18903 45513 58366 97616
2428 97616 52668 21841 72217 129104 78663 -11384 -3684 32346 33489 29031 84165 128297
2416 128297 139796 145354 61141 15369 -54756 -28741 -20387 7184 7328 -73198 -57026 71395
2404 71395 97064 59501 51380 34387 17658 -21455 -3744 63491 86926 -41977 -53036 49193
2392 49193 89173 30921 10978 13680 -44150 19189 87306 63537 42469 -11446 -64554 -23330
2380 -23330 -26001 -70902 -95254 -196559 -182800 -93305 17293 66823 186219 145199 41164
2369 41164 10518 82769 189272 171297 123170 128847 195101 142083 112907 62336 88359 63052
2357 63052 218 18225 49250 47032 46477 -14177 -10054 58781 80469 89092 75743 138223 175776
2344 175776 161711 103752 99003 169890 128544 101368 124135 116699 119611 77487 36941 44691
2332 44691 91150 -49406 -148368 -143331 -14725 -40801 -55546 -60014 -39836 62737 112507 105649
2320 105649 111685 22892 2659 -78825 -152065 -96684 -60615 -61935 -36763 -57456 -61293 -34408
2308 -34408 2847 32135 31920 -47991 -51539 -97589 -130852 -30706 4871 8113 -44703 -19490
2296 -19490 92597 93872 113303 119134 70707 60646 21469 -26796 -117956 -189691 -173519 -158316
2284 -158316 -126762 -106452 -112390 -70650 7185 -13204 18891 6714 4445 10058 76873 71371
2272 71371 -43379 -68041 -29628 -93436 -140593 -116675 -67685 -75436 -15267 13429 -19727 531
2260 531 16028 43161 9315 48978 36579 -40606 -134598 -178891 -204555 -79036 -64401 -93587
2248 -93587 -12156 101002 53449 3539 33629 -17177 -11075 -19829 17091 71209 25823 8850
2236 8850 16748 -61047 -78476 -108032 -116061 -97144 -8563 -45568 -57825 -82441 -82834 -75060 -116391
2223 -116391 -37268 57005 88324 135261 157632 107488 100336 142255 130581 121591 22855 91681
2211 91681 92783 67458 71121 139983 246376 156856 96577 62775 28955 -3814 -51962 -2997
2199 -2997 -3961 -105891 -72501 -61105 25325 57038 -11292 -25076 -45753 7701 55700 18246
2187 18246 54406 85477 62685 81129 62133 -12715 -1270 6852 -30103 -77670 -56511 -34428
2175 -34428 -18635 -99139 -109887 -126506 -107507 -81239 -94216 -76694 -12153 -12221 -28193 6210
2163 6210 -11862 -1844 66790 78544 85651 143854 147444 78638 5969 -95773 -117798 -60962
2151 -60962 -49761 -106845 -76010 -85258 -88271 -154349 -149198 -60725 1261 24135 65145 70222 27809
2138 27809 11870 -2873 35220 43432 9444 -50423 45051 85114 39668 -8409 44429 112404
2126 112404 19597 -16926 -30221 21807 37618 -15767 11724 56163 63568 80140 89961 103597
2114 103597 49898 29107 74187 119138 97571 129331 24849 -86113 -56962 -25193 -27462
2103 -27462 -74876 46220 118360 158504 136152 30354 63530 55008 9750 -30641 59343 55658
2091 55658 -39821 -99390 -40658 -6985 260 33601 94487 54068 -54145 13657 60972 82497
2079 82497 88574 7703 -84668 -54443 -48429 -64369 -5698 9465 35454 98270 109404 123899
2067 123899 130394 40950 24605 58679 103997 118929 133294 34577 -62322 -25782 18770 48742
2055 48742 38563 6330 35820 66417 66624 27134 111174 207361 149689 22952 2997 15858
2043 15858 26769 17481 63124 118407 148321 37604 -18398 -1143 23160 4981 22600 39926
2031 39926 76928 52747 25665 34354 62691 8988 8863 58536 46784 47671 65335 37219 -45871
2018 -45871 -56425 50633 67704 69298 66882 141526 95215 14113 -55945 -39590 -14932 40440
2006 40440 5253 17214 78855 30439 -32432 -19724 16262 47655 -503 -1399 -17049 -19165
1994 -19165 -60179 -80333 -125266 -76134 58048 -25652 -21042 -54587 3944 156321 186050 98278
1982 98278 105623 57393 -49576 -194183 -150871 -127827 -99062 -107500 -92456 -69621 -50783 78004
1970 78004 83111 -24840 -60247 60929 109283 12850 70151 106856 56793 27820 7674 13686
1958 13686 -27611 -48258 -59839 -47405 -21358 -60633 -85024 -53735 -62805 -77604 -44772 19929
1946 19929 -30023 -111028 -153008 -104167 -58711 -5058 28006 -37373 -38271 -13308 -38876 -22863
1934 -22863 -326 11208 -40934 -41792 -24852 2945 32628 53552 89335 124382 108526 13402
1922 13402 18544 -28156 -91264 -30249 11229 14061 49787 85792 75990 8086 -40622 -14887
1910 -14887 5920 18918 -47849 -96702 -77896 48593 93247 110119 10639 -37533 3108 -34116
$$ [...]
##END NTUPLES=NMR SPECTRUM
##END=
