##TITLE=Analysis number 325986
Compound Code cc 56302
Book Reference 513/33/30
Project Code adrs
Chemist Name ronp
##JCAMPDX= 6.0         $$ Bruker NMR JCAMP-DX V2.0
##DATA TYPE= NMR SPECTRUM
##DATA CLASS= NTUPLES
##ORIGIN= Bruker BioSpin GmbH
##OWNER= nmr
$$ XWIN-NMR		Version 3.5
$$ Tue Jan 23 09:48:17 2007 GMT Standard Time (UT+0h)  MAYBRIDGE\nmr@NMR_250MHZ
##.OBSERVE FREQUENCY= 250.131544655141
##.OBSERVE NUCLEUS= ^1H
##.ACQUISITION MODE= SIMULTANEOUS (DQD)
##.ACQUISITION SCHEME= undefined
##.AVERAGES= 16
##.DIGITISER RES= 18
##SPECTROMETER/DATA SYSTEM= dpx250
##.PULSE SEQUENCE= zg30
##.SOLVENT NAME= CDCl3
##.SHIFT REFERENCE= (INTERNAL, CDCl3, 0, 16.522)
##AUDIT TRAIL= $$ (NUMBER, WHEN, WHO, WHERE, WHAT)
$$ ##TITLE= Audit trail, XWIN-NMR		Version 3.5
$$ ##JCAMPDX= 5.01
$$ ##ORIGIN= Bruker BioSpin GmbH
$$ ##OWNER= nmr
$$ C:\u/data/dgb/nmr/ADRS/1580/pdata/1/auditp.txt
$$ ##AUDIT TRAIL=  $$ (NUMBER, WHEN, WHO, WHERE, WHAT)
(   1,<2007-01-23 09:47:51.18 +000>,<MAYBRIDGE\nmr>,<NMR_250MHZ>,
      <created by zg, POWCHK disabled, PULCHK disabled
       configuration hash MD5:
       49 4B E0 1D 92 C2 6B 37 9F E6 65 BC 52 41 86 1D
       data hash MD5: 64K
       FB B1 6E 0A A9 72 41 E0 5C 61 A2 85 30 9E C5 21>)
(   2,<2007-01-23 09:48:06.47 +000>,<MAYBRIDGE\nmr>,<NMR_250MHZ>,
      <Start of raw data processing
       ef LB = 0.3 FT_mod = 6 PKNL = 1 SI = 32K 
       data hash MD5: 32K
       3E 3E 59 63 81 D3 1D 8D BD F4 F1 59 D2 6D B9 E8>)
(   3,<2007-01-23 09:48:08.27 +000>,<MAYBRIDGE\nmr>,<NMR_250MHZ>,
      <apk 
       data hash MD5: 32K
       9F C5 F1 F6 9D BA 6E 40 AE 13 7B 4B CF F7 03 02>)
(   4,<2007-01-23 09:48:08.99 +000>,<MAYBRIDGE\nmr>,<NMR_250MHZ>,
      <abs ABSG = 5 
       data hash MD5: 32K
       BA 37 5C E9 17 E1 F3 C6 76 AB 9F 11 00 74 F0 48>)
$$ ##END=
$$ 
$$ hash MD5
$$ EF 00 10 BD 67 4B 8A 8D EE C6 19 71 2F F7 D5 F1
##$RELAX= 
##$RELAX= 
##$RELAX= 
##$RELAX= 
##$RELAX= 
##$RELAX= 
##$RELAX= 
$$ Bruker specific parameters
$$ --------------------------
##$DU= <C:\u>
##$EXPNO= 1580
##$NAME= <ADRS>
##$PROCNO= 1
##$TYPE= <nmr>
##$USER= <dgb>
##$AMP= (0..31)
100 100 100 100 100 100 100 100 100 100 100 100 100 100 100 100 100 100 
100 100 100 100 100 100 100 100 100 100 100 100 100 100 
##$AQSEQ= 0
##$AQ_mod= 3
##$AUNM= <au_zg>
##$AUTOPOS= <26 >
##$BF1= 250.13
##$BF2= 250.13
##$BF3= 250.13
##$BF4= 250.13
##$BF5= 500.13
##$BF6= 500.13
##$BF7= 500.13
##$BF8= 500.13
##$BYTORDA= 1
##$CFDGTYP= 0
##$CFRGTYP= 5
##$CHEMSTR= <none>
##$CNST= (0..31)
1 1 145 1 1 1 1 1 1 1 1 1 1 1 1 1 1 1 1 1 1 1 1 1 1 1 1 1 1 1 1 1 
##$CPDPRG= <>
##$CPDPRG1= <>
##$CPDPRG2= <>
##$CPDPRG3= <>
##$CPDPRG4= <mlev>
##$CPDPRG5= <mlev>
##$CPDPRG6= <mlev>
##$CPDPRG7= <mlev>
##$CPDPRG8= <mlev>
##$CPDPRGB= <>
##$CPDPRGT= <>
##$D= (0..31)
0 1 0 0 0 0 0 0 0 0.06 0 0 0 0 0 0 0.0002 0 0 0 0 0 0 0 0 0 0 0 0 0 0 
0 
##$DATE= 1169545669
##$DBL= (0..7)
120 120 120 120 120 120 120 120 
##$DBP= (0..7)
150 150 150 150 150 150 150 150 
##$DBP07= 0
##$DBPNAM0= <>
##$DBPNAM1= <>
$$ [...]
##$SUBNAM7= <"">
##$SUBNAM8= <"">
##$SUBNAM9= <"">
##$SW= 20.6930455092707
##$SWIBOX= (0..15)
0 0 3 0 0 0 0 0 0 0 0 0 0 0 0 0 
##$SW_h= 5175.983436853
##$TD= 65536
##$TD0= 1
##$TE= 294.16
##$TE2= 300
##$TE3= 300
##$TEG= 300
##$TL= (0..7)
0 120 120 120 120 120 120 120 
##$TP= (0..7)
150 150 150 150 150 150 150 150 
##$TP07= 0
##$TPNAME0= <>
##$TPNAME1= <>
##$TPNAME2= <>
##$TPNAME3= <>
##$TPNAME4= <>
##$TPNAME5= <>
##$TPNAME6= <>
##$TPNAME7= <>
##$TPOAL= (0..7)
0.5 0.5 0.5 0.5 0.5 0.5 0.5 0.5 
##$TPOFFS= (0..7)
0 0 0 0 0 0 0 0 
##$TUNHIN= 0
##$TUNHOUT= 0
##$TUNXOUT= 0
##$USERA1= <user>
##$USERA2= <user>
##$USERA3= <user>
##$USERA4= <user>
##$USERA5= <user>
##$V9= 5
##$VALIST= <valist>
##$VCLIST= <CCCCCCCCCCCCCCC>
##$VD= 0
##$VDLIST= <DDDDDDDDDDDDDDD>
##$VPLIST= <PPPPPPPPPPPPPPP>
##$VTLIST= <TTTTTTTTTTTTTTT>
##$WBST= 1024
##$WBSW= 4
##$XGAIN= (0..3)
0 0 0 0 
##$XL= 0
##$YL= 0
##$YMAX_a= 394210
##$YMIN_a= -455576
##$ZGOPTNS= <>
##$ZL1= 120
##$ZL2= 120
##$ZL3= 120
##$ZL4= 120
##$ABSF1= 16.522
##$ABSF2= -4.171173
##$ABSG= 5
##$ABSL= 3
##$ALPHA= 0
##$AQORDER= 0
##$ASSFAC= 0
##$ASSFACI= 0
##$ASSFACX= 0
##$ASSWID= 0
##$AUNMP= <proc_1d>
##$AZFE= 0.1
##$AZFW= 0.1
##$BCFW= 0
##$BC_mod= 0
##$BYTORDP= 0
##$COROFFS= 0
##$CY= 12.5
##$DATMOD= 1
##$DC= 0
##$DFILT= <>
##$DTYPP= 0
##$F1P= 14.0000005364418
##$F2P= -0.99999901652339
##$FCOR= 0.5
##$FTSIZE= 32768
##$FT_mod= 6
##$GAMMA= 0
##$GB= 0
##$INTBC= 1
##$INTSCL= 1
##$ISEN= 128
##$LB= 0.3
##$LEV0= 0
##$LPBIN= 0
##$MAXI= 10000
##$MC2= 0
##$MEAN= 0
##$ME_mod= 0
##$MI= 0
##$NCOEF= 0
##$NC_proc= -4
##$NLEV= 6
##$NOISF1= 0
##$NOISF2= 0
##$NSP= 0
##$NTH_PI= 0
##$NZP= 0
##$OFFSET= 16.522
##$PC= 1
##$PHC0= 228.1114
##$PHC1= 24.46024
##$PH_mod= 1
##$PKNL= yes
##$PPARMOD= 0
##$PSCAL= 4
##$PSIGN= 0
##$REVERSE= no
##$SF= 250.13
##$SI= 32768
##$SIGF1= 0
##$SIGF2= 0
##$SINO= 400
##$SIOLD= 32768
##$SREGLST= <1H.CDCl3>
##$SSB= 0
##$STSI= 32768
##$STSR= 0
##$SW_p= 5175.98343685301
##$SYMM= 0
##$S_DEV= 0
##$TDeff= 65536
##$TDoff= 0
##$TI= <Analysis number 999999
Compound Code 99
Book Reference 9
Project Code 9>
##$TILT= no
##$TM1= 0
##$TM2= 0
##$TOPLEV= 0
##$USERP1= <user>
##$USERP2= <user>
##$USERP3= <user>
##$USERP4= <user>
##$USERP5= <user>
##$WDW= 1
##$XDIM= 32768
##$YMAX_p= 488636672
##$YMIN_p= -325780
$$ End of Bruker specific parameters
$$ ---------------------------------
##NTUPLES= NMR SPECTRUM
##VAR_NAME=  FREQUENCY,     SPECTRUM/REAL,   SPECTRUM/IMAG
##SYMBOL=    X,             R,               I
##VAR_TYPE=  INDEPENDENT,   DEPENDENT,       DEPENDENT
##VAR_FORM=  AFFN,          ASDF,            ASDF
##VAR_DIM=   32768,         32768,           32768
##UNITS=     HZ,            ARBITRARY UNITS, ARBITRARY UNITS
##FACTOR=    0.157963299565203, 1,           1
##FIRST=     4132.6476996994, 0,             0
##LAST=      -1043.33573715361, 0,           0
##MIN=       -1043.33573715361, -325780,     0
##MAX=       4132.6476996994, 488636672,     0
$$ Real data points
##PAGE= N=1
##DATA TABLE= (X++(R..R)), XYDATA
$$ [...]
26243A27315m7920m2307j7054L506m4938n9080J6382L164O154k1315L7785J20034
26231H1726Q78l6476n8018q677K7171m090l06L40j290q0666M2999M2302k7891
26218b1998n4707J4730k0773m9987m9805Q4233Q4778N3943R136n6882p8245K7472
26206e8105N4125m220k6284k3598k0930o5946k2199K6639J36292O1103k8287o2553
26194c3963M1218R9974n9780n122P7108L2972j1163o3160l1276J4989k5361L395
26182C9831m7438L2864L2981j5575m9769L5451J9713l151j9488j22956l0796K3931
26170a04402L9554j1847o138J7779r9640k9453P3398K7253L9494m9926k1984J16799
26158i113J00431L2998p8806j07309j5042L2141L3087K633Q8043j32591r0134
$$ y = [127315, 79395, 37088, 20034, 23540, -21398, -80478, -64096, -60932, -54778, -76093, -38308, 81726, 82604, 46128, -11890, -20567, 6604, 2514, 2208, 2548, 1258, -79408, -36409, 5893, -21998, -76705, -61975, -82748, -132735, -182540, -98307, -13529, 40414, 49550, -7332, -85577, -58105, -3980, -8200, -34484, -58082, -79012, -144958, -167157, -140518, -4226, 56877, 28590, -33963, 7255, 107229, 47449, 42327, 119435, 152407, 141244, 78084, 46808, 61797, 36436, 39831, -7607, 25257, 58238, 42663, -7106, 28345, 48058, 44907, 25419, -97537, -128333, -104402, -64848, -76695, -82833, -65054, -164694, -194147, -120749, -93496, -54002, -103928, -125912, -9113, 91318, 124316, 45510, -61799, -76841, -44700, -11613, -8980, 79063, -53528, -143662]
26147a43662L7984N4674O0187O2464O2526J0700n2957o2406o1247l0250P6398
26136A4411K1339P0809q8691m5425N1400K9616j8872L9968l6301l6059n5237J709
26124e1333R0332P0464l7876r1980m1856L2107j9813O3619O5944N1111K7243q9971
26112F7991l2712O599m6487n4762M4351J1483N586L2798p882l3924n7030l4396
26100i8385Q7357O2403M5302J5773J2603o3514l2907M2875N1661M1005l2221q8055
26088D3897N614q733L178J5389m8153j10146r3956L7508J78219O6330J6210o9153
26076C6204j7037P4683j3575o6207k6445N7440P2165m0612l7397P162J1122l4481
26064B3022l3270k9687N0432N4534k8045p6340p023j3024K2970k6365K232k6579
$$ y = [-143662, -105678, -51004, 9183, 71647, 134173, 144873, 91916, 29510, -31737, -61987, 14411, 35750, 106559, 17868, -27557, 23843, 53459, 34587, 74555, 38254, 2195, -53042, -51333, 38999, 109463, 71587, -20393, -62249, -30142, -49955, 13664, 79608, 130719, 157962, 67991, 35279, 41878, -4609, -59371, -15020, -3537, 2049, 34847, 26965, -6959, -63989, -98385, -11028, 51375, 96677, 112450, 125053, 61539, 28632, 71507, 123168, 164173, 131952, 43897, 49511, 40778, 43956, 59345, 11192, -98954, -192910, -155402, 22817, 89147, 105357, 36204, 19167, 93850, 80275, 14068, -12377, 45063, 117228, 76616, 39219, 46381, 57503, 23022, -10248, -39935, 10497, 65031, 36986, -39354, -46377, -59401, -36431, -62796, -60564, -87143]
26052h7143m1274p640O4155j1720j5584m496K2810K102L4522L9528j7774q4238
26040a06752J7039N0786j5436R875j0045k239N6433Q4681K1719j7617q6272k752
26028e80p3821R285R3132L8679P304r8032r1878Q0259K2665o863p2770n5062J37822
26015i860K7852M1052m1675o949q222L7476m6708Q936j9004L9871P864N3382k5476
26002E8539K2027J356r3542P40O9783m734l9793k0331N6037M9813l406q6992N2296
25989F1793L8415M419j5747m5690N0201M959K7084p915J6515l3424p4056n8589
25977c2035J7928N7811j6861p4812L3395r455p7293M5780M571O2217l9553K7462
25965h45J18599k8565p6711J6345l809n9722p3953P5673J44322R9518j9794K6255
$$ y = [-87143, -128417, -136057, -71902, -83622, -99206, -103702, -80892, -78790, -44268, -4740, -22514, -106752, -89713, -38927, -54363, -44488, -54533, -56772, -339, 84342, 106061, 88444, 2172, -580, -74401, -65116, 28016, 66695, 73999, -24033, -115911, -35652, -12987, -19850, -92620, -147682, -9860, 17992, 59044, 17369, 10420, 2198, 39674, -7034, 1902, -17102, 22769, 30633, 84015, 58539, 80566, 81922, -11620, -10880, 58903, 54169, 14376, -5955, 50082, 99895, 96489, 9497, 61793, 100208, 104627, 88880, 43190, 93391, 98350, 125434, 117519, 134034, 100610, 26554, -32035, -14107, 43704, 26843, -47969, -14574, -24029, -101322, -55542, -50971, 11246, -28307, -845, 117754, 89189, 12478, 28823, 25014, -34708, -108661, -32988, 111334, 210852, 191058, 217313]
25953B17313m7669j31140n8216o4404J9237P9451K7440M0917P9356n4561j35984
25942b8260n7996J3808P0161r2230k3781K5738l9647p6768O101J01942Q6500l5685
25930e0117k1604N1981o2327O9652r409r3086j13021J00951Q8758P0793J15784
25919A48355K40r9301m2052J73163k3377p2876J1995M2691k5180n4919j7457L396
25907D4678j6526k7232P610P6692P4o7296o8393L7736k5068q0520O1265K8716
25895b8264q2614n4428j6769K9739J10798R7370Q0055N1253j12629j08695k2369
25884e6553Q8754L5914p9249q8519O3303k95l4513R2725j1162j4973O7411P3902
25872A36745N17m1599q6093j3814j4993M993M5950K2007o1137J0480k0655M2202
$$ y = [217313, 169644, 38504, -19712, -84116, -64879, 14572, 42012, 82929, 162285, 107724, -28260, -86256, -72448, -2287, -94517, -118298, -92560, -132207, -208975, -202874, -100932, -14432, -50117, -71721, -19740, -82067, -12415, -21824, -114910, -227931, -126980, -38222, 32571, 148355, 148595, 49294, 7242, 180405, 157028, 84152, 96147, 138838, 113658, 58739, 41282, 44678, 28152, 920, 8530, 85222, 85296, 18000, -50393, -12657, -37725, -118245, -56980, -28264, -110878, -165306, -182075, -152336, -41538, 55832, 135887, 187140, 74511, -34184, -56553, 32201, 68115, -11134, -99653, -36350, -36645, -71158, 21567, 10405, -4568, 62843, 136745, 137262, 95663, 9570, -4244, -19237, -14244, 31706, 53713, -7424, 3056, -17599, 24603]
25860B4603m0336n1228Q6679L1362l1752l8198m0881j15641m9910k5068J77961
25849g2409Q6590J37476k5012l1871k4996L7984j33353r0288k603M9124N0017
25838a9341m9887l6113O6190M8954P331M1348n0247o7615o092Q7189J20430K5867
25826A68014l9874q0895o9954P223J1719k4921l9578p6254r754J24302O4962J8088
25814E3078o1964J3014j671Q381M9565r064j09117l8615N6800K7178J2628L261
25802C474j13092n1857J71160Q4171m4038n8593l5269J5596O2722J6319q5041
25791c4448q5532k6049n5043M0604R3495J03373m6691l0009o916j8995J00300
25780C4089J02914L2297J8855n9149m0395l8389m3556J98L3576O0124l7770r1643
$$ y = [24603, -15733, -66961, 19718, 51080, 19328, -18870, -59751, -175392, -225302, -250370, -72409, 14181, 151657, 126645, 94774, 69778, 107762, -25591, -115879, -118482, -69358, -19341, -69228, -105341, -39151, 9803, 17134, 58482, 8235, -59380, -65472, 21717, 142147, 168014, 128140, 47245, -22709, -15486, -3767, -28688, -68266, -144520, -154274, -29972, 34990, 53078, -8886, 4128, 2457, 10838, 60403, 51339, -57778, -96393, -39593, -12415, 213, 3474, -109618, -161475, 9685, 93856, 49818, -8775, -44044, -28448, 34274, 50593, -34448, -119980, -146029, -201072, -160468, -66973, 36400, -10291, -40300, -47216, -66211, 34089, 137003, 169300, 188155, 129006, 88611, 50222, 6666, 6864, 40440, 100564, 62794, -28849]
25768b8849K0712p647N5570N3682j6483J7915K5105j01485j10255N6598P6080
25757D0943M662r022N4976R950K1899j6523J6991J5999K570n5238K1535m1006
25745F7736k2565j5799O261L091J9897l4121N9117l8045n7963p6649O1118Q4910
25733E6988J3954o0027j19093m9093p2845N9580J7755J8661O1126J33991j2328
25722D8669j02021j3164j1950k7931k2120K9247O3047K3814o460p9724n2252l5774
25710a86619r8462J8187J9430J34436N5253k1694L994J3858j8025j6953N6011
25699d0584J06050J3545m8063N7849j972m7169L3942L6842k217p8729p2751k1242
25687f4499P220o1401K4270Q7389m792n3640Q5416M6965k8225m280j0875M977
$$ y = [-28849, -8137, -15784, 39786, 93468, 76985, 94900, 120005, 18520, -91735, -35137, 40943, 45605, 36583, 91559, 101509, 123408, 106885, 123876, 139875, 142445, 87207, 108742, 67736, 45171, 29372, 35633, 38724, 58621, 24500, 83617, 45572, -12391, -89040, -27922, 56988, 70942, 10915, -108178, -157271, -230116, -170536, -152781, -134120, -72994, 60997, 48669, -53352, -66516, -78466, -106397, -128517, -99270, -36223, -12409, -18869, -98593, -150845, -186619, -285081, -266894, -247464, -113028, -57775, -79469, -75475, -61617, -79642, -96595, -40584, 65466, 79011, 30948, 88797, 86825, 39656, 73598, 110440, 108223, 29494, -43257, -64499, -57279, -118680, -94410, -7021, -11813, -65453, 19963, 66928, 38703, 34423, 23548, 28525]
25675B8525p925k3490j9073L8829j9143k0756q4992o3582M7242L4607K8755R8088
25663C7085k1021L4145k0670p2512m6824n3288l7622J56198O6100n149l2195M9726
25651E3973K3900j446J9192k6804n2404n9668O781M5935K1535n1366l2733j14579
25639a67684Q624J17676L1810k2713k4464r249P4195j4922j20068L0512J17149
25628B0866P116p0068K5174k7046j2189P3353M5658l9899l8221k7136K507N3314
25616A3429J7246o0538o2940J9232Q863m6046J18748n1086l1745P4309R8341j1902
25604H5911j7392o673K3440p671L4328n8235j27533j9190N6652M2164j6759o8147
25592g9105j6995L6604n161j8271K0336N562m6849l4861J14012K3208L6167k2033
$$ y = [28525, 20600, -2890, -21963, 16866, -2277, -23033, -108025, -171607, -124365, -89758, -61003, 37085, 16064, 50209, 29539, -42973, -89797, -143085, -180707, -24509, 41591, 36442, 4247, 53973, 77873, 76427, 95619, 68815, 16411, -43257, -36476, 9459, 30994, -20372, -53105, -167684, -159060, -41384, -9574, -32287, -56751, -66000, 8195, -6727, -126795, -96283, 20866, 27982, -42086, -16912, -43958, -56147, 17206, 62864, 22965, -15256, -42392, -39885, 13429, 30675, -29863, -92803, -73571, -64708, -110754, 7994, -43092, -74837, -528, 97813, 85911, 68519, 61846, 85286, 77615, 111943, 53708, -73825, -93015, -36363, 5801, -10958, -79105, -96100, -59496, -64657, -82928, -62592, -57030, -103879, -138740, -24728, -1520, 34647, 12614]
25580A2614j1579K6522l7206Q3897l094q1721L059J4494K2887p3484N5928K7985
25568D0302K3522J6267J2831j1138l4364l3915K7560P4681J5462R0075j4492n3919
25556A52872l3507k3026r569L0321R045L4124j5662q9178j57028j2987J7197O9644
25544b7754J06636O7282n407n529O2802q0265j41642K0572l6385j8434j9855P6081
25532a898P3043l0065k0307J4226K5655L6560L5676M5715J4695r3600n9790L4757
25520G4667j0660j06756J7727J7386O6814k7988j1033M0046j26817m4721p0134
25509a81469J8813K8842K9446L6868J07624K3935o4247l3187J4720j9033J8136
25498a9552r171L4591M648L1128j10685L89P6504K6024K5216k5865l9489o9005
$$ y = [12614, 1035, 27557, -9649, 74248, 71154, -10567, -7508, 6986, 29873, -43611, 12317, 40302, 63824, 80091, 92922, 81784, 47420, 13505, 41065, 115746, 131208, 221283, 206791, 152872, 119365, 96339, 86770, 117091, 126136, 160260, 144598, 55420, -101608, -114595, -97398, -27754, 78882, 146164, 140757, 135228, 198030, 117765, -23877, -3305, -39690, -58124, -77979, -1898, 71145, 41080, 20773, 34999, 60654, 97214, 132890, 178605, 193300, 99700, 39910, 74667, 64007, -42749, -25022, -7636, 59178, 31190, 20157, 60203, -66614, -111335, -181469, -162656, -133814, -104368, -67500, 40124, 64059, -188, -33375, -18655, -37688, -19552, -28723, 5868, 10516, 41644, -69041, -68652, 7852, 33876, 59092, 33227, -6262, -75267]
25486g5267n4225O807J4732J6054J5123m6856m5186Q4273K6501j1821K0206l3537
25474h3196j01643J3806Q3501K3271K9654j8049o253N9339K8953m7668n0433j4085
25462h2803k8456l8200J25147L0402K7987k239L2424L9358m0122j4074n7418n6301
25450f4295M6880Q3426l9093j06104l3400J17140K2308o2369k6715K0373Q1811
25439C9962j1085o0871o5187Q9526N8236n76N6193j4268J0423r8469l6671P108
25427b5679K2171k2912n8981Q9300N620j12507k9112M3054k7889j14500O0802
25416a70633Q6908M5900k855J0313N6177j1799K5238N6970O5427q8029q9189O691
25404h881j3468n6416l8546M0615K3167N129Q3899j7264j02186m0641N1529N5546
$$ y = [-75267, -129492, -122685, -107953, -91899, -76776, -123632, -168818, -84545, -58044, -69865, -49659, -83196, -184839, -171033, -87532, -64261, -34607, -52656, -58909, 430, 29383, -18285, -68718, -82803, -111259, -149459, -24312, 6090, 34077, 31838, 64262, 103620, 63498, 49424, -7994, -64295, -17415, 66011, 26918, -79186, -112586, 4554, 26862, -35507, -62222, -41849, 39962, 28877, -31994, -97181, -7655, 50581, 50005, 106198, 91930, 102353, 3884, -32787, -25679, -3508, -26420, -85401, 3899, 9519, -102988, -132100, -89046, -116935, -231435, -170633, -83725, -37825, -40680, -30367, 25810, 14011, 39249, 96219, 161646, 73617, -15572, -8881, -22349, -78765, -117311, -76696, -53529, -48400, 35499, 18235, -83951, -124592, -73063, -17517]
25392a7517J002j25975j0332J04461K3683l2272m517O5774k9170q8298l3176n2957
25380a99294K3722J1995J4903J4584k0461O6812Q3451M8613N2700m0198p2278
25369a5451o7788L0109Q088j4203J8881P4990K6449M0296L7551n0318p5155k1733
25357h284L522M657p6045r6508L0744N6540M4496n0757k586K8749N8204L5651
25345B8383j7937q0596n1397M9476R2384j8439m853l9936j2959m6471n0579N2436
25333a00488J33184k8009m9887m693j1561M8702j3818J3171p2615k382J1782j8611
25321i5225L5816J3406K4777J2460R9196k0409K2698P4549J724R262j01937j33945
25309e7628M2842M9029j15431Q771L8061O5093N0539m3470J0032m4686m937p1408
$$ y = [-17517, -16515, -142490, -152822, -48361, -24678, -56950, -61467, 4307, -24863, -113161, -146337, -199294, -175572, -163577, -148674, -134090, -154551, -87739, -4288, 44325, 97025, 56827, -15451, -83239, -53130, -45042, -59245, -40364, 34626, 61075, 101371, 138922, 88604, 13449, -8284, -4762, -105, -76150, -172658, -141914, -85374, -40878, -91635, -94221, -65472, -7268, 28383, 10446, -70150, -121547, -72071, 20313, 1874, -2979, -42915, -55874, -102345, -152924, -100488, 32696, 4687, -45200, -49893, -61454, -12752, -26570, -13399, -86014, -88396, -76614, -95225, -59409, -46003, -21226, -8766, 90430, 70021, 92719, 167268, 168992, 178254, 76317, -57628, -14786, 34243, -81188, -72417, -34356, 30737, 81276, 37806, 47838, 3152, -1785, -73193]
25297g3193k5489P3771Q0563J8435j3444M2952k8029J8509K5412m1854k5295j6639
25285C5699j1496l7812J2510J6178l2952k7477l6578Q357N3949k3806l8954O4306
25273a8076q769L094j024M1299N7111K1691m4298N85J3992J0522J9118R1538O5018
25260B51801l4900n786k5455n3430m1044j49320o270N4721l07l7142R7958K3138
25248G3964m3018j7047L1117m6374o5267P9492k6937k9838L5941k654j8363J01912
25236G2928o0740m0259P3677o0584m8865M3188j3997K2545R6687k4665p4635j9911
25224c4631j4364k8233J0394k9117J26812K7140n4877o731j6515m7875q513l2169
25212a08679J6332K7063j7514K4531J17013M6201l1899o9784k4241Q8262R5965
$$ y = [-73193, -98682, -24911, 55652, 74087, 60643, 103595, 75566, 94075, 119487, 77633, 52338, 35699, 24203, -13609, -1099, 15079, -17873, -45350, -81928, -73571, -19622, -43428, -82382, -18076, -26845, -23751, -24775, 16524, 73635, 95326, 51028, 51613, 65605, 76127, 95245, 186783, 251801, 216901, 211115, 185660, 132230, 91186, -58134, -64404, -9683, -9990, -47132, 50826, 73964, 30946, 13899, 45016, -1358, -66625, 12867, -14070, -43908, -7967, -10621, -28984, 72928, 12188, -28071, 45606, -14978, -63843, -20655, -34652, -12107, 84580, 59915, -14720, -34631, -48995, -77228, -66834, -95951, 30861, 58001, 3124, -3607, -20122, -67997, -76510, -108679, -92347, -65284, -82798, -58267, 58746, 104947, 73048, 3264, -20977, 67285, 163250]
25201A63250k5984q6763j031N858m7203q4512q7729Q8620L211r3666J8448O4269
25189h3232L5742M9663K4284J15l7220n6168n8448m7060J04990J26891O1963n0154
25177G1366N7127O6376k6304n5318j0930o8709K151J3314J8127q080k6876j0370
25165B1874m4884J0202K4347q531m0863k5180k1509O8760J0931j9574K8371k4830
25153b0886m4531k985P7276L7891m3101m076L4312k6223j6281j8458J326K8160
25141B424r2815p0582J8192P6332J5879l8180k2474L8056M6729n5018q8607L9379
25129a30685J628P767k9640P2104L7265r920q218K6375P994R216k0099m6045m2885
25116a25143K2106l6346M9238L4497m1107n4778L9435O0862J8789O260K4355l291
$$ y = [163250, 137266, 50503, 49472, 55330, 8127, -76385, -164114, -75494, -72283, -165949, -147501, -83232, -47490, 2173, 26457, 26572, -10648, -66816, -125264, -172324, -67334, 59557, 121520, 71366, 128493, 194869, 168565, 113247, 102317, 33608, 35759, 49073, 67200, 59120, 32244, 21874, -23010, -12808, 11539, 3008, -37855, -63035, -84544, -15784, -4853, -24427, 3944, -20886, -65417, -68402, 8874, 46765, 3664, -412, 33900, 7677, -8604, -27062, -25736, 2424, -90391, -160973, -142781, -66449, -50570, -88750, -111224, -73168, -26439, -81457, -170064, -130685, -129057, -121290, -150930, -78826, -41561, -51481, -59699, -33324, -25330, -16114, -36213, -82258, -125143, -103037, -139383, -90145, -55648, -96755, -151533, -112098, -51236, -32447, -26187, -1832, -5123]
25104e123L45J9178p9080m5077J1683L2469j9680p7555j538N0302K2540L15j2162
25091a03383k1497J9210O8320K8858O5287J3804P577l7639j14825r2612M5161
25080a21739L1189J8866K5818q512l3076j1873P6406K1834m2338J4163M1048k7615
25068a5829j3811O9801L648L2261R4010m3416j37860k1870j44898M633O065O6249
25056a01017J89465J5613n3620o6401m5451Q738J6018m752o1376j0681M6986p741
25044g4219p3622L4473m5304k1998R9059N3671n1033k7075J4092o1601p3370J2437
25032b14490J7239N2411O2995n83J9985N3860Q0177L0239J6355n5422j06349P3671
25020C0088M4310j0756L6508n554n3421n0423j9279k7648l558L3221J34229p2668
$$ y = [-5123, -4778, 14400, -64680, -109757, -98074, -65605, -85285, -162840, -164378, -114076, -91536, -91221, -103383, -124880, -105670, -37350, -8492, 56795, 70599, 78176, 40537, -74288, -166900, -121739, -90550, -71684, -45866, -54378, -87454, -99327, -22921, -1087, -43425, -29262, 11786, -15829, -29640, 40161, 43809, 76070, 170080, 126664, -11196, -33066, -177964, -173331, -167266, -101017, 88448, 104061, 50441, -15960, -61411, -52673, -36655, -41407, -102783, -113464, -66478, -74219, -147841, -113368, -158672, -180670, -81611, -27940, -78973, -106048, -91956, -153557, -226927, -214490, -197251, -144840, -81845, -82428, -62443, -8583, 71594, 101833, 118188, 62766, -43583, 30088, 74398, 63642, 100150, 94596, 41175, -9248, -28527, -56175, -59733, -26512, 107717, 35049]
25008C5049j35550j7493K1942j1490K6881L9552J8401N7987n5110r6942M8028
24997f8745O3272M2703N9148n3452k7353L3539q0194O486K3120l8719k8720o255
24985g5170M3257M5948o699r3657n8212J31539N196o3228N8666P2288l7911q8180
24973f6163j24487N8842L5423K2511k1960m6097O464j2996P7853O644K4276N735
24961c3955l7789Q104M9966O9111q259j12808l2234K5337j783J39M8424p6291
24949a02038R1771N1685j8940O2864K9567q0878k9342l4454l2929l0130j6374
24938a09198R001L211l9196Q4316L2670K2916K7660K6263o9375j1524K2004n3011
24926e4263n120M335k1897O4967l4762p3021k6904J2112N1369L3434J0159j1250
$$ y = [35049, -100501, -117994, -96052, -107542, -80661, -41109, -22708, 35279, -19831, -116773, -68745, -5473, 37230, 96378, 42926, 15573, 49112, -31082, -24596, -1476, -40195, -68915, -75170, -31913, 14035, 7336, -86321, -144533, -12994, -7798, -71026, -12360, 59928, 22017, -66163, -190650, -131808, -96385, -73874, -95834, -141931, -135467, -148463, -70610, -63966, -39690, -33955, -71744, -63640, -13674, 55437, 47178, -65630, -97864, -72527, -74310, -74171, -25747, -102038, -10267, 41418, 22478, 85342, 114909, 34031, 4689, -29765, -62694, -92824, -109198, -100197, -96986, -136182, -51866, -19196, 3720, 31380, 57643, -11732, -23256, -1252, -54263, -59383, -55048, -76945, -11978, -46740, -119761, -146665, -134553, -83184, -49750, -39591, -50841]
24914e0841M376k6597M496k8191o2788M5228K9388Q6303O0936p1416j5499J6105
24902h500K4562O9617L3978q4402j10680m3388P186P8873k0216k7233K9039N6757
24890E593O7574k2627J4267J5630o6071n0276n2714l2459N629k9850O3084n0489
24878a32709l4954M0271P5851j2806R0090J16562l4425k1576r4660r6871O524
24867i8703O6079m929q5473j19060Q1804P7787K3103N733L8188m9113M0658J774
24855b2152o3506m3212K547N613P5810P7769L6090L5656l4409j1806k6861L8776
24843G0315L1649L3329M660m7526N0666n9236p7256n0618k2777r855k7514L9628
24831f4535N8684j9899K6900k015j18574q6395K8621P4782O4714J05686l993M6521
$$ y = [-50841, -46465, -73062, -68566, -96757, -159545, -114317, -84929, 1374, 62310, -9106, -24605, -8500, 16062, 85679, 119657, 35255, -75425, -118813, -111627, -32754, -52970, -80203, -51164, 5593, 73167, 50540, 64807, 80437, 14366, -35910, -88624, -121083, -115454, -145304, -82220, -132709, -167663, -127392, -51541, -64347, 25743, 142305, 107880, 86304, -8356, -105227, -98703, -32624, -37553, -123026, -242086, -160282, -82495, -59392, -53659, -15471, -64584, -23926, -22152, -85658, -128870, -126323, -120710, -44900, 32869, 68959, 104615, 70206, 58400, 31539, 70315, 101964, 135293, 139953, 92427, 143093, 83857, 6601, -44017, -66794, -76649, -104163, -64535, -5851, -25750, 1150, -865, -119439, -205834, -177213, -102431, -37717, 67969, 63976, 110497]
24819A10497K9816O9911o3637j6194M6283p5683p7188n6924J9725M5512n4777
24808b2659K919J028n5715m2504m6045P3803J07039o446p535k5699J9013J6580
24796A3779m7454J3884o733M7026m6483J7005j04088J7276J50662L4023q4766
24785D131j40242n9270P4292M149L0165R760N6954l311o6063K0158j1618l1407
24773a12302O0215O3576K6970K3931o6029l7584K4629K3328k0903n7666k8217
24762a00052R3015k8081P426o984R392k9676o6082l4128k3837K3700J1586M0953
24750a02768R6655N1294O0024L6737j26344q2152K8315M1786M8295J7583n0542
24739A8883j11881p5161N0441J17103P752L2000J8841p0630o2717Q805L5584L6372
$$ y = [110497, 140313, 210224, 146587, 130393, 176676, 100993, 23805, -33119, -13394, 32118, -22659, -19740, -18712, -74427, -116931, -162976, -89173, 17866, 11420, 3885, -21814, -2801, 13779, -33675, -19791, -26524, 20502, -25981, -8976, -113064, -95788, 54874, 88897, 4131, -136111, -195381, -121089, -116940, -86775, -77015, -20061, -23372, -89435, -69277, -80895, -112302, -52087, 11489, 38459, 62390, -3639, -41223, -16594, 6734, -14169, -71835, -100052, -7037, -35118, -27692, -34676, -25284, -54960, -121042, -155170, -179007, -155307, -143721, -102768, -6113, 45181, 105205, 141942, 15598, -66554, -38239, 3547, 51842, 69425, 18883, -92998, -168159, -117718, -615, 7137, 39137, 57978, -12652, -75369, -66564, -30980, 5392]
24727E392n2828l4798O2431O5717m7671p4250j8877P5996l9187M2794L895o2793
24715g4179n9389K8649O3445M8898O6366j3632m9699K59m5409m0146Q1973j7791
24703a0655o0878k9646k3728J38975P8807o4445q735N105N4330j01219j02559
24692a24648l1144p2465O2802J59317K4649K2919K4135n9744K3959Q4770L7048
24681A51598q0752K3154m0793j13975j0427k6214J4813P3253J9186k48N154Q4531
24669I9280O728j7774M021K1153q8763q5353K250O8067j1613m4365N7739J1781
24657B3151n5333J7472R7461K5514q4720M4170N4094m932o2544o6106k8256L605
24645c6424L9353J5816k7468L0774r7022k4160N4087m4920M6915J5531k1175L8854
$$ y = [5392, -47436, -82234, -19803, 45914, -1757, -76007, -94884, -18888, -58075, -15281, -11386, -74179, -133568, -104919, -41474, 7424, 73790, 60158, 10459, 10718, -34691, -74837, 7136, -10655, -71533, -101179, -124907, 14068, 92875, 28430, 19695, 24800, 79130, -22089, -124648, -155792, -228257, -165455, -6138, 18511, 41430, 65565, 5821, 29780, 114550, 151598, 70846, 94000, 53207, -60768, -71195, -97409, -82596, -9343, 9843, 9595, 14749, 99280, 106008, 88234, 92255, 113408, 24645, -60708, -58458, 9609, -2004, -46369, 11370, 23151, -32182, -14710, 82751, 108265, 23545, 67715, 121809, 116877, 54333, -11773, -40029, -36424, 2929, 18745, -8723, 22051, -74971, -99131, -45044, -89964, -43049, -27518, -48693, -9839]
24633i839P5004N0038L1213n1328o416N3349l15p3980J8543m5193j06412l504
24621f8840J25808j1794l0541Q4944P5058r460r3412k2947j1034J9282j140r5955
24609d0031P334K6368N338k058k4052l5334M0868j3676j0071L7315J552q191l9979
24596e4617P0737O7882m0155n9768n0051r5056J1656J2776Q666j615M2613M8156
24584c8776M5711K6207O093P8966r808k0841L5735P920o2045m8634L2085k631
24572D9982n6686R907R194m8495M2782L2192n4121q5319K0399p219j8615P9989
24560b6010M1842m0407m6479O7144P4071L3879O7172K5356p1630j22126j4940
24549a2128R9734m8554m9924N8324P0922j1811P696k6843r2962j1546O2833J4047
$$ y = [-9839, 65165, 115203, 146416, 95088, 88672, 142021, 141706, 67726, 86269, 41076, -65336, -68840, 56968, 45174, 14633, 99577, 174635, 165175, 71763, 48816, 37782, 57064, 55924, -40031, -32697, -6329, -991, -3049, -27101, -62435, -21567, -35243, -45314, -7999, -6447, -14638, -54617, 16120, 84002, 43847, -15921, -65972, -161028, -149372, -136596, -127930, -129545, -86932, -38776, 6935, 33142, 39235, 118201, 108393, 87552, 123287, 131207, 69162, 20528, 52613, 49982, -6704, 3203, 12397, -36098, 6684, 38876, -15245, -100564, -80165, -87384, -105999, -26010, 15832, -24575, -71054, -3910, 70161, 104040, 171212, 196568, 124938, 2812, -12128, 87606, 39052, -10872, 47452, 118374, 106563, 114259, 87416, -5546, -17092, 45741, 59788]
24537E9788N1365K3718M551K0512p8847p8593K5592K5498k6168K9105k1623l4218
24525F80K8306N0511J6632M2204n8445n0283M5542M7312M1477q447n5150j16078
24513a5739K069K6431N2471M6443L260j22459l9183N3812N3600L3752p5105r5230
24501g5878n531M9J4372K7030p648J1037J8203O6408J8028k2927o3088l2413m0982
24488i3340j5070l511n2487J9182J7581l309m827J07693J03876k1132k2307N8147
24476I0496K6290j03441j00051L3087k5137l5263K1207L1526N5469N3034L2112
24465G9329n2672j00709n5750L8000P7581J242m3810L4881L4439n3320m0233p249
24453h8271P9155J14021L0641m360n4187m7529l17L7758P789n5600j7889O3619
$$ y = [59788, 111153, 134871, 139422, 159934, 81087, 2494, 28086, 53584, 27416, 56521, 34898, 680, 28986, 79497, 96129, 138333, 79888, 29605, 75147, 122459, 163936, 155489, 100339, -15739, -13670, 12761, 65232, 111675, 114935, -7524, -46707, 7105, 60705, 94457, 19352, -75878, -81409, -81360, -66988, -39958, -47606, -36569, -18366, 48042, 66070, 43143, -19945, -52358, -93340, -108410, -111921, -164408, -145226, -127645, -130954, -135781, -28088, 75788, 54656, 32349, 90496, 116786, 13345, -86706, -53619, -78756, -114019, -92812, -61286, -5817, 47217, 79329, 26657, -74052, -129802, -91802, -14221, -12979, -56789, -21908, 12531, -40789, -81022, -88271, -9116, 104905, 135546, 131186, 76999, 29470, 29153, 66911, 74700, 19100, 1211, 64830]
24441F4830M7750n3355m3438P778L1006O9248p2882o2976m749j8863l2690k567
24429g0908L7178J26419R305M772r200R11j01154o8565j4821P621M9118O602N5904
24416C3182o4429r9108M0944O3411p869l5237M177Q9404j0139L4556M413k2219
24404C1086n8611k7797k2041Q0872M6317l6399j1132j9071p319O9704k4257m151
24392A7201L4246j2704p7015M0798M7664m5955o0039k7154k4774p903r1462N7166
24380a49931R8125N3869J0967J35667L6475r6439j25203m2311M1728o8471j8330
24369a23854K4591P5622k3485R3892k4385j10184O8934K8317o7427j190Q0610
24358B1441N3681K1868o9455n1290j9462O1898N7338j710o1582M4774L3493j0284
$$ y = [64830, 112580, 59225, 15787, 23565, 54571, 123819, 50937, -12039, -16788, -35651, -68341, -70908, -33730, 92689, 101994, 106766, 97566, 98477, -2677, -71242, -86063, -78442, -29324, -22722, 33182, -31247, -130355, -89411, -26000, -33869, -69106, -64929, 24475, 14336, 48892, 53305, 31086, -27525, -55322, -77363, 3509, 49826, 13427, 2295, -16776, -24095, 45609, 21352, 17201, 51447, 38743, -38272, 2526, 50190, 4235, -55804, -82958, -107732, -115635, -207097, -149931, -51806, 2063, 13030, 148697, 185172, 88733, -36470, -78781, -37053, -105524, -123854, -99263, -23641, -47126, 46766, 22381, -87803, -18869, 9448, -57979, -59169, 21441, 75122, 96990, 27535, -23755, -43217, 18681, 76019, 74309, 12727, 57501, 90994, 80710]
24346H0710k893M6787q8884n0171q339J8418P6204j1240m0159j4187L9958j0095
24334C6109m0728m177o9173J7169N2164K0774L3955K4241m222K0611k9389k4893
24322C2441j8724p163O122p298j2627O435R419k5423r2731q0341L7378O2834K4892
24309f4786n6945M2994P9895m2247n7346P8270k5114j43665j9478N8062j0387
24298a60747j0006L8379J14608N7095J9136m1237j1717j9641n6784l0930O7180
24287c4664O437K4664O0596p5178M1495O4514l7218m8562j7873J01705O7682j14235
24275C9363q6747K1306l268l1748K500P499K486J8923j4472j7274J068J8507N1233
24262I376N9799m039q6425r2417J3458J0479L0540L1105k8885K8454k948K048
$$ y = [80710, 77817, 124604, 35720, -14451, -22790, -4372, 71832, 60592, 20433, 6246, 46204, 36109, -4619, -8796, -77969, -60800, -8636, 12138, 46093, 70334, 66112, 86723, 57334, 32441, 13717, 6554, 12676, 5378, -7249, -814, 8605, -16818, -109549, -189890, -152512, -89678, -64786, -121731, -78737, 1158, -41089, -98435, -20165, -45279, -188944, -208422, -150360, -160747, -170753, -132374, -17766, 39329, 58465, 17228, 5511, -14130, -70914, -101844, -34664, -28227, -3563, 57033, -18145, 23350, 87864, 50646, 2084, -15789, 85916, 153598, 39363, -47384, -26078, -29346, -61094, -58594, -51095, -48609, -29686, -44158, -61432, -60364, -41857, 9376, 69175, 65136, -21289, -113706, -100248, -89769, -59229, -28124, -57009, -28555, -31503, -29455]
24250b9455M969l0906O4211O6431K2311j5671o4229n5133r7664n3490P4901J26626
24238A2901P7961m5655j32189p9315J9871K8935P6051m446m3318J2029j0157N8207
24226b9125o1797N1944j7782j14714L7577M9814M2648P4315O7822k410m6930p5503
24214b4141l9141l969J2218M7668Q626k5170N609J08966L7719o3615j09706o842
24202e1778J9952O5446m9173m2710J7247N1089n5460m8278K4225J09562M1983
24191H2105q742n3020m0853p212N1645N0615o5604j9755O1726m3186j37342m1874
24179a71497L343K5584Q1093J4538K622j8165p0759J21186J33921l8046j4993
24168F8827M275L1178J219J4066l8242m488q0315j2726K639j7894M9091n4296
$$ y = [-29455, -24486, -55392, 8819, 75250, 97561, 81890, 17661, -37472, -135136, -188626, -113725, 12901, 90862, 45207, -86982, -166297, -146426, -117491, -41440, -45886, -89204, -77175, -87332, -29125, -90922, -38978, -56760, -171474, -133897, -84083, -41435, 32880, 100702, 98292, 51362, -24141, -63282, -67251, -55033, -7365, 1261, -23909, -18300, 90666, 128385, 64770, -44936, -51778, -31826, 33620, -15553, -58263, -41016, 10073, -45387, -93665, -69440, 40122, 82105, 73363, 20343, -20510, -27722, 23923, 74538, 8934, -10821, 50905, 7719, -129623, -171497, -168154, -142570, -61477, -46939, -44317, -62482, -133241, -12055, 121866, 83820, 68827, 73102, 104280, 105499, 119565, 81323, 76835, -3480, -16206, -13567, -31461, 17630, -36666]
24156c6666l1815K8970L702J637n9639m1104L4778L5698J1586Q8559K8913o7110
24144b491k572P030j7701l267Q721q731m6989Q2968O1859L1807k1935J854q6575
24131C978q1024L9205O6098M4498L3472l5340j26702M2338O9553j5814q3296j7478
24119f0512N9015k6630P381N2945J9257m6162N49O8294N5326r0017j21681J17
24107h2118N9373K8075J5755L3639J9364k1385P979L5078k1782p5139q6334l9894
24095a27389L7107J9778J7327L3692M3501q028J1404m2778L8191j2006N0143K361
24083F3303n2362m0140p361Q797l3135l8K2200l2905J3060K0307M2498k1869J3659
24070c986J2281O18K5743N788l4783j52296j3053L6980J12697o3109p6033N4371
$$ y = [-36666, -68481, -39511, -35809, -34172, -93811, -134915, -100137, -64439, -52853, 35706, 64619, -2491, -5063, 1967, -15734, -19001, -10280, -19011, -66000, 16968, 78827, 110634, 88699, 90553, 3978, -77046, -37841, 28257, 72755, 106227, 70887, -55815, -13477, 56076, 40262, -43034, -60512, -1497, -28127, -20746, 32199, 51456, 5294, 5843, 74137, 129463, 39446, -82235, -82118, -22745, 5330, 21085, 54724, 74088, 52703, 60682, 95760, 73978, -1161, -87495, -127389, -90282, -70504, -53177, -19485, 24016, 15988, 27392, -15386, 22805, 10799, 60942, 63303, 10941, -29199, -36560, -27763, -60898, -60936, -38736, -71641, -58581, -38274, 4224, -17645, -3986, 8295, 8913, 34656, 40444, 5661, -146635, -159688, -122708, -10011, -73120, -149153, -94782]
24058i4782N8979O8053P8991O1029o6690j71166n265n450J3467J4499l7072P6154
24046i253Q6077m2836m2009N9L1046n7657l9614J0536K3092K1831j7528q7988
24034a24244P425R7280L1527L3505k2150O3335l0421m4345O2164J079k5761r4165
24022d4771p1813l8341J31783o511l7879j487K0403O6103M1386k2345M7807J3077
24010I7412j06265J7302P591j7519n3566m9328l0288M4028J05197O3587J6009
23999I4160q4895m3003J8687k715K5187l8833o6803L046L3289J29068L3140m71
23987I9857J7909j8358N4956O8513o9228r9800N0215N3597J732p3700k2000k5931
23975C7762l4411k1350M1879j8241J8517j6293m0215K5244P6369L6854L2264M2939
$$ y = [-94782, -35803, 32250, 111241, 172270, 105580, -65586, -70851, -76301, -62834, -48335, -85407, -9253, 76824, 33988, -8021, -7962, 23084, -34573, -74187, -63651, -40559, -18728, -36256, -124244, -116819, -19539, 11988, 45493, 23343, 86678, 56257, 11912, 74076, 75155, 49394, -44771, -116584, -154925, -23142, -29653, -67532, -69019, -48616, 17487, 58873, 36528, 84335, 97412, -8853, 8449, 16040, -1479, -55045, -104373, -134661, -90633, 14564, 78151, 94160, 9265, -33738, -15051, -17766, 7421, -31412, -98215, -95169, -61880, 67188, 100328, 99857, 117766, 99408, 154364, 222877, 153649, 53849, 104064, 157661, 159393, 85693, 63693, 37762, 3351, -17999, 23880, 5639, 24156, 7863, -32352, -7108, 69261, 106115, 138379, 181318]
23963A81318l4527o3143p7396m9423j2581n9300K0265L4357J4443k2701r5083
23952a63771L1520J0020j3619J4946M2999O4332L1440q8951M4195N3354n7527
23941c1062J0751L7839o3303K1769K5803L7953l2882j6974J2056n5263m4239N244
23929i2308K7908r1932k3639R797n73M8817N6402O5912K6551o6592J74N6089M3420
23916F0026L9777j9122p4166o538p828J0654p3173j3203j8600K8184P7337k1733
23904a8385l2198m231j5765L5367K2576M9866N782n4016N3858L0186K2348n3922
23892D1466m7353k0577m164p6310M2650P1109J04171N071q3519m8168R9995R7961
23880A82332p984m0859j31472K926N0550m9671m1306K5352J03809k5804j00621
$$ y = [181318, 146791, 83648, 6252, -43171, -55752, -115052, -94787, -60430, -45987, -68688, -163771, -132251, -122231, -135850, -120904, -77905, -13573, 17867, -71084, -26889, 26465, -31062, -20311, 17528, -45775, -24006, 1797, 39750, 6868, -10106, 1950, -53313, -97552, -92308, -64400, -156332, -179971, -170174, -170747, -121930, -65528, 384, 26935, -39657, -39483, 16606, 60026, 99803, 80681, 6515, -23, -7851, 2803, -70370, -83573, -102173, -73989, 3348, -18385, -50583, -54814, -70579, -35212, -12636, 37230, 43012, -11004, 42854, 73040, 95388, 41466, -5887, -26464, -30628, -106938, -64288, 6821, 110992, 116063, 32544, -15624, 84371, 182332, 174348, 133489, 2017, 4943, 55493, 5822, -35484, -10132, 93677, 67873, -32748]
23869c2748K568N26L8314j1411J4053O3826p265O053l2383k2240N8746J801l6374
23856D3466q5851j04997L33P4889R0139J22441k1788o4277j06022o7437m8438
23845a67542k4939Q2189J56871P0861J3677J9279m7888n886M6298k1312j8383
23834A03225q536k6343j6739j7672O4166N164k4546o1506j7618K4836r0416n8350
23822a24335j6023q8K2185M9424O9035P9619L8948j4785r5501n7298R898L7576
23810a345J5369n9561m2291j2565O3864L3171n2355p5765k0636K387P1135M1717
23798c6875K8179m0151O4192M8634j10876p7328k3942l6042l2466N7642Q7038
23787g1995J9062L1804q3785J658L0644o5395M3680R3640R2055J5808m5134q6906
$$ y = [-32748, -30180, -29654, 8660, -2751, 11302, 75128, 67863, 73916, 41533, 19293, 78039, 79840, 43466, -42385, -147382, -147049, -72160, 17979, 140420, 118632, 54355, -51667, -119104, -167542, -192481, -110292, 46579, 117440, 131117, 150396, 102508, 96622, 142920, 121608, 103225, 94689, 68346, 51607, 33935, 98101, 103265, 78719, 17213, -405, 24431, -65985, -124335, -140358, -140446, -118261, -68837, 198, 79817, 118765, 103980, 8479, -48819, -38921, -1345, 14024, -45537, -87828, -100393, -36529, -3358, -55713, -131478, -152114, -149727, -78592, -36875, -8696, -48847, 15345, 63979, -46897, -124225, -148167, -184209, -216675, -159033, -71995, -52933, -21129, -104914, -103256, -72612, -138007, -94327, -687, 91368, 107176, 62042, -24864]
23775b4864l6880k0332J700O6237p736m4692j0147L48K630j1062P9009N6572J6632
23762F7415j21264l2191P4363M8241j5364m6475N7759O3715J8740p2357j6830
23751B5752l628K5283N1445k8322K7161l9504q2841J938k2905J00567O5795n2568
23739F8173R899j424J7452n0393R600n6609j8566R2078K1487l3000n9280j8712
23727a9295j6038n207O9349O7355N533l2314k4564K4262m3354n3076n537J3879
23715a9007M8097L6799N4733o1231q9726j05232o5024J07122J51807l0842p2758
23704d5262k5418r103L8553J1969m6299Q270P9443J3565L5872m2936m4645M0619
23692A4628O7397o003r2427J1452O2464l5500m1455Q4283J4114k4931J2270O3822
$$ y = [-24864, -61744, -82076, -80376, -14139, -21875, -66567, -76714, -76366, -73736, -84798, -5789, 50783, 67415, -53849, -86040, -11677, 36564, 21200, -25275, 32484, 96199, 114939, 42582, 25752, 22124, 47407, 98852, 70530, 97691, 58187, -24654, -22716, -45621, 54946, 120741, 68173, 78072, 76648, 94100, 43707, 53307, -3302, -21868, 70210, 91697, 58697, -583, -19295, -35333, -40540, 28809, 96164, 101697, 69383, 44819, 69081, 25727, -27349, -32886, -19007, 29090, 65889, 120622, 59391, -30335, -135567, -200591, -93469, 58338, 27496, -45262, -70680, -79783, -41230, -29261, -75560, -67290, 12153, 25718, 61590, 18654, -25991, 14628, 82025, 76022, -16405, -4953, 57511, 22011, -19444, 64839, 78953, 54022, 66292, 130114]
23680A30114j0090r1626k1629L7410M8936m4708n2683l1693R725K3171M4472O9684
23668A11083j3957o7483K1797Q127n4440k9896j1701L5220J0167P5908n7972N2460
23656G9313M578j45299m769L8266O6137M1776N532L4787j4642j5816q0990n3724
23644d4851O4433K1606l1834p2615J0537N2022j6174j08017J2062K334P0308P8041
23632C7852O3700J4390L5630l3359j37249n0596M0535M8268L135J7147m6802m3002
23620e0351M3602K9548J6066o1245j3641Q3784l393Q2173m0617j0152n9745o443
23608I586o244p5055m4724l2615J3969J8180k6728J04999Q1053J3670r9426p4917
23596a18252R883k3629O5118k8239M8434j545K6463j19577l6343j313P7559Q0597
$$ y = [130114, 120024, 28398, 6769, 44179, 93115, 48407, -4276, -35969, -26244, -3073, 41399, 111083, 97126, 29643, 51440, 59567, 5127, -24769, -36470, -1250, 8917, 84825, 26853, 79313, 83891, -61408, -66177, -27911, 38226, 80002, 85534, 120321, 105679, 89863, 8873, -44851, 19582, 41188, 9354, -63261, -52724, -702, -16876, -124893, -112831, -110497, -40189, 37852, 101552, 115942, 151572, 118213, -19036, -69632, -29097, 19171, 22306, 39453, -7349, -50351, -6749, 22799, 38865, -22380, -36021, 47763, 44370, 126543, 85926, 75774, 16029, 9586, 3342, -71713, -116437, -149052, -135083, -116903, -143631, -38632, 42421, 56091, -43335, -118252, -108369, -131998, -66880, -95119, -46685, -48230, -21767, -141344, -177687, -179000, -101441, -20844]
23584b0844J0276l7985k1076l4420P4355j02715r2782J7145K7479R0990P5778
23573a3799j7156l767P4817j6347J7398J25139j7516m3225r22m702J5680j16309
23561g09k758O9157j07822j2792J25504K9014r440j2645q8384M481L7962o9759
23549c8191L0702L3081M3655J1886n8361l0620P828j8961k8752k6339R5931K2023
23537D3882K106L8033L186j20368j16857K3835O1211K5907P3403l8955l6744k2818
23525f4179Q4511l2010p7548P7779N1095j5149m2649n3378N3849J2732K1771N019
23513B1843n9462q377M2123M1881K8500n092j2162q910n2029O8275o200p6493
23501b6103l9001q7157p3372O2630J01796J41366j7266q2141L6389N6161L7162
$$ y = [-20844, -10568, -48553, -69629, -104049, -29694, -132409, -225191, -208046, -180567, -89577, -13799, -30955, -34722, 40095, 23748, 41146, 166285, 148769, 105544, 104622, 99920, 115600, -709, -3467, 65690, -42132, -54924, 70580, 99594, 90154, 77509, -10875, -6394, 31568, -38191, -7489, 25592, 69247, 81133, 22772, -7848, -20, -18981, -47733, -74072, 21859, 43882, 45988, 84021, 87207, -33161, -150018, -126183, -64972, -39065, 34338, -4617, -41361, -64179, 20332, -11678, -89226, -11447, 39648, 24499, -18150, -71528, -17679, -4947, 16824, 21843, -37619, -45996, -3873, 38008, 66508, 61416, 49254, 40344, -11685, 56590, 50390, -26103, -65104, -152261, -225633, -163003, -61207, 80159, 62893, -19248, 17141, 73302, 110464]
23490A10464J5355o2264k4012M6207M0664L4509j8945K8009p4902q3921o0692
23479d9528l7012L2230m489M8754j2091N132L1167O0321R171l4610L3365M0144
23467A22554p0452j09806M5617p635n6161m6167n404N0946J3663P1672M5476O6563
23455A20866J2139J5772l2704n6753l9253j1509N319J174p5617k6398L9946O2140
23443A5122M312l3001Q4168O255r0523O8589M040k5063R6782k5966k6842O0620
23431A38493M4808j29885j22088m2842J4782K9674o820P29J8052L2627P2997N1651
23419A02178L168r068N7623q3314m0286M509p85J1426M6947J4623p7421j14981
23407h5381M7700J13039r434j846n8456j09347K0326O7113O5002M7279k6046j4826
$$ y = [110464, 125819, 63555, 39543, 85750, 126414, 160923, 141978, 169987, 95085, 11164, -49528, -86540, -54310, -58799, -10045, -22136, -17004, 14163, 74484, 83655, 49045, 82410, 122554, 52102, -57704, -12087, -19722, -75883, -122050, -127454, -76508, -62845, 8827, 54303, 120866, 133005, 148777, 116073, 59320, 20067, 8558, 13877, 15051, -60566, -86964, -47018, 15122, 19434, -13567, 70601, 76856, -13667, 54922, 58962, 33899, 130681, 104715, 77873, 138493, 183301, 53416, -68672, -111514, -96732, -67058, -73878, -73149, -55097, -22470, 50527, 102178, 105346, 96278, 153901, 70587, 30301, 34810, 34025, 45451, 92398, 107021, 29600, -85381, -37681, 75358, 65924, 64078, 5622, -103725, -83399, -16286, 48716, 95995, 69949, 55123]
23395E5123O4119J6073L464l2893p3246m955L8179n1371q831p495N837o5558P264
23382e4290L3325O0637m3657k5849Q0093J6260k9244R8088n5304p8262R7545K3388
23370A22730m0980j5188p4925j43466L5021R2416n2207p1008k8579Q9067P8800
23359h319o8647o5289J17314N9573p974J3049r388J0373k722m3424P573k936l8754
23346c9571o0341k1132P4714Q5238Q7370M7015j15324j44175N669Q909O3662R6904
23334H8938k3738n7489q615J4202R3081o7741q5977K9713M3760j8439N3368L375
23322F4438k6308q749J1265L1382J937L8737L9855L5043j156k1509M615O707n629
23309A70628j10880m0613l7639J07197J31706K2816o5250j74203j26409J11162
$$ y = [55123, 119242, 135315, 138779, 105886, 32640, 27685, 65864, 14493, 5662, -1833, 4004, -61554, -54290, -20965, 39672, -3985, -29834, 50259, 66519, 37275, 135363, 80059, 1797, 99342, 122730, 81750, 66562, -8363, -151829, -116808, -24392, -76599, -147607, -176186, -87119, -8319, -76966, -142255, -24941, 34632, 26658, 39707, 30319, 40692, 37970, -5454, 2119, -817, -39571, -99912, -121044, -46330, 38908, 126278, 173293, 57969, -86206, -80537, -71628, -7966, 88938, 65200, 7711, -904, 13298, 106379, 38638, -47339, -17626, 26134, 7695, 61063, 64438, 38130, 29381, 40646, 72028, 73965, 112702, 152557, 187600, 186444, 164935, 169550, 176257, 170628, 59748, 19135, -18504, 88693, 220399, 243215, 177965, 3762, -122647, -11485]
23299a1485L4409k1354m9166m5863L9426n184p772M7915k6555j6084J790j7828
23287g7751l2147J7476N6589N7211K6562o4152o4566o1600R256Q0361L7588L2191
23275A7018Q7627n9307l7202j2195l9139q3980k4356N0183K7613M9168K2154m4431
23263d6847j8489N2872K7737O6428J9690j10217J8123L8717J3625l8714j12965
23252i0040M7701K3107o2435L3349j0112O4266k2520O1544n9603l5813M8267K1855
23240A9566l8518N4567J8497N0236L5431n4841N1492L9854n9017j05418J1157
23229B3006L1927L2352k8597M6380J308j4684l6073l0489M6672K4549P3908k5624
23217A44635n7338j05944o6973O4899Q6431o057o6680j1128m4853J7287P1759
$$ y = [-11485, 22924, 1570, -47596, -93459, -54033, -59217, -66989, -19074, -45629, -61713, -59923, -77751, -109898, -92422, -35833, 21378, 47940, -16212, -80778, -142378, -133122, -52761, -15173, 17018, 104645, 45338, 8136, -4059, -43198, -127178, -151534, -101351, -73738, -24570, -2416, -46847, -65336, -12464, 15273, 81701, 101391, -8826, 9297, 48014, 61639, 22925, -90040, -42339, -19232, -81667, -48318, -58430, 5836, -16684, 44860, -14743, -50556, -2289, 19566, -18952, 35615, 54112, 104348, 139779, 84938, 136430, 176284, 117267, 11849, 23006, 54933, 87285, 58688, 105068, 106376, 91692, 55619, 25130, 71802, 96351, 170259, 144635, 87297, -18647, -85620, -20721, 65710, 59653, -7027, -18155, -63008, -45721, 26038]
23206B6038J0436p6743p932R3543k5367k0399P670L4913K9618k2048l3955J4626
23194C0400L7116R546r511N530n6010k9378k0840P5657Q7929l6875k8700m8589
23182A6275J5462L4596M3533l4565J1581l337o5198m8408K7076n8739l5708L8531
23170e8901K4054K3265J5726J0701K7856r6577J9055R1879k0589p2306O9311J6493
23158D9967r8378Q6452K7788k6039k5029j2936r005K382K8422l6465o1624K1191
23146e3274L1857M299J288k3532Q9167O6834j2222O1081j4287m9508L2384j208
23134A32879o6665p1940n2034J7676l0097L0489N3441p400L6346p8925m3769P1165
23122h834N4424N041k4789P2417Q510m5038l6655K5636R6769k1145L8276M613
$$ y = [26038, 36474, -40269, -48201, 45342, 19975, -424, 7246, 42159, 71777, 49729, 15774, 30400, 67516, 77062, 67551, 73081, 17071, -12307, -33147, 42510, 130439, 93564, 64864, 16275, 31737, 66333, 109866, 75301, 86882, 83545, 18347, -30061, -2985, -61724, -97432, -58901, -34847, -11582, 4144, 14845, 42701, -53876, -34821, 57058, 36469, -35837, 33474, 49967, -48411, 38041, 65829, 39790, 14761, 1825, -7180, -4798, 23624, -12841, -74465, -53274, -21417, -17118, -15830, -39362, 49805, 116639, 104417, 165498, 151211, 101703, 134087, 132879, 66214, -5726, -57760, -40084, -70181, -39692, 13749, 6349, 42695, -36230, -79999, -8834, 45590, 50631, 25842, 98259, 106769, 61731, 25076, 50712, 147481, 126336, 164612, 169225]
23110A69225l8933j55024j09642M0677L697j6797M1121R9437Q8905n9457r717
23099E3492N476q6454J3822N9928L9429K8761m8391r5M2784j23837r0284J5073
23087i0296M9536R5778O1883K8977j05312Q369r647m8851j6358M7677L7531o7832
23075h545j52189J119o674J5513Q4946O8154Q7060N5788l3260j8504k4272o2021
23063G115N7335K3387m1860o3972J4992K3355q4470p144m9600L717J28175R5376
23051A06406j7052q4846m0800M353K0969P5841K4163n6886J7561l9438o4576J9573
23039c4732o3440O4744J17213n0888Q6459J4840j27128q9831p4803j6791R4418
23028g9939l3371K2481M8112m8698J3865K2952j8718K7786J06061j2461J9376
$$ y = [169225, 130292, -24732, -134374, -93697, -90000, -106797, -65676, 33761, 122666, 63209, 53492, 58968, -27486, -13664, 46264, 85693, 114454, 66063, 65968, 108752, -15085, -105369, -90296, -40760, 55018, 116901, 145878, 40566, 48935, 39288, -9563, -25921, 21756, 59287, -8545, -160734, -159615, -166289, -150776, -65830, 2324, 89384, 145172, 111912, 93408, 69136, 7115, 64450, 87837, 45977, -17995, -3003, 20352, -64118, -71262, -120862, -117145, 11030, 106406, 89354, 4508, -36292, -31939, -10970, 64871, 89034, 32148, 49709, 10271, -54305, -34732, -98172, -33428, 83785, 32897, 119356, 134196, 7068, -82763, -157566, -174357, -79939, -113310, -90829, -42717, -91415, -77550, -54598, -73316, -45530, 60531, 48070, 67446]
23017F7446J0293L6790K7578r1069j03807O1835J3874l4847L7301o357M1486o3209
23005b686j2283l6553N9005O090p7469J0839o1726m5357J36703Q4434k6370q8168
22993e3541l6504K9120R9444M8425l2892r0632J4987K8527L4744K1894m2822m6868
22981b6118n2332Q666L3024Q2707O9559j0639q8239r2224K9607l5733N7379Q51
22969b3492l8835l708L7727L6146o0688k1236M4454m9625O4013M5045p5372n9906
22957a05477N7910m844O0473J43424P4442K3600K1403j06050R378o8496j01539
22946D224k4381K8669k2635K1374M9624M3603q0260j6757O4764l5674O1332k15
22934I3668R012q981o830J9669j41534q3225P5957Q8678O8071j7895O943m1273
$$ y = [67446, 77739, 114529, 142107, 51038, -52769, 9066, 22940, -11907, 25394, 19037, 60523, -2686, -14969, -51522, 7483, 13573, -63896, -53057, -114783, -160140, -23437, 60997, 34627, -53541, -90045, -60925, 38519, 86944, 54052, -36580, -21593, 6934, 41678, 63572, 20750, -26118, -78450, -69784, -36760, 45947, 115506, 104867, 16628, -75596, -45989, -81722, -24343, -23492, -62327, -66035, -28308, 7838, -52850, -74086, -29632, -79257, -15244, 29801, -45571, -105477, -47567, -52411, 8062, 151486, 225928, 249528, 270931, 164881, 174259, 105763, 4224, -20157, 8512, -14123, 7251, 56875, 100478, 20218, 3461, 68225, 32551, 93883, 93668, 102680, 93699, 86869, 106538, -34996, -118221, -42264, 46414, 114485, 96590, 103533, 62260]
22922F2260p570J8851l3001n4560N5448K2093k566p9907O49j5151K5038K9162
22910B0746M796K648Q409M0761m4285m9449O4384L2923J9292j02453K7944P0655
22898I6371P3103J579r3349o1849k4795J0187j6818n4033k1721L1228L9530N7307
22886C6740O3633j3431l723K5258j4300l1814P6316M0379k180p2050l6994N5359
22874A23193K6336j21083k4969J6197l2354L6828J6664o1635J1658j924O289J5699
22862A0899N6621M2309j2386P686O0200j6519k2829M797p806j1113j7686m4318
22850D9855j7420m7084j4105m988k3713K9540M9887Q821n2175n3287O3669P6885
22838F5885L8199m2779K6902M6987l9931l9692r3516J3765K6636K7987L6322J4003
$$ y = [62260, 54690, 73541, 40540, -14020, 41428, 63521, 60955, -18952, -18303, -33454, -8416, 20746, 25542, 28190, 36599, 77360, 33075, -16374, 48010, 80933, 100225, -2228, 25716, 96371, 169474, 171053, 77704, 15855, -8940, 1247, -15571, -69604, -91325, -60097, -20567, 36740, 100373, 86942, 83219, 108477, 94177, 62363, 138679, 179058, 176878, 104828, 67834, 123193, 149529, 28446, 3477, 19674, -12680, 24148, 40812, -20823, -9165, -11089, -4800, 10899, 67520, 109829, 97443, 105129, 165329, 148810, 125981, 130778, 122972, 111859, 94173, 49855, 32435, -14649, -28754, -33742, -57455, -27915, 21972, 30793, -21382, -74669, -11000, 65885, 104084, 61305, 88207, 135194, 95263, 55571, -37945, -24180, 2456, 30443, 66765, 80768]
22826H0768k267L0239p1981p5974m2176O3883l3457k1224n244J12112R6858o8968
22814F2569o3930p494k6888k7441Q4232L19J5866K089k6900m4829m4313N8465
22802a8255M3140l6911K0519j6413M2522M6770m1300j7932k7377K7754o8009m693
22790e0185J3325N762O0947k8132K07k4687J29381R999l8514j2371n2036o1393
22778d7697K8058P9106l5675n7893O0907n6205l3928k5269O1439J8018r406L8283
22766A9738o1344J6647j1273k0536K6678O1424m682J0623p778j12429q757J48874
22754E7185R0013j0410Q6550l2730j08536j7213q04M0360N6437n6992q1753p9476
22742e7369O8487M719M340J3027l667m358j8939M1025k8375n5983q9850n4973
$$ y = [80768, 78501, 108740, 36759, -39215, -81391, -17508, -50965, -72189, -77433, 34679, 131537, 62569, -1361, -8855, -35743, -63184, 21048, 21367, 37233, 39322, 12422, -32407, -76720, -18255, 24885, -12026, 8493, -7920, 34602, 81372, 40072, 22140, -5237, 22517, -45492, -50185, -36860, -31098, 29849, 1717, 1924, -22763, 106618, 116617, 78103, 65732, 13696, -47697, -19639, 59467, 23792, -34101, 26806, -29399, -63327, -88596, -27157, -9139, -18545, 19738, -41606, -24959, -36232, -56768, -30090, 31334, 26652, 37275, 29497, -82932, -91689, 57185, 147198, 136788, 223338, 190608, 82072, 64859, 64055, 104415, 160852, 103860, 22107, -57369, 11118, 15837, 20177, 33204, 29537, 25179, 6240, 47265, 18890, -37093, -126943, -181916]
22730a81916J5853Q0199K9981q0586R755R3954N2043j8585j1054k96j1377m4029
22718f6058q5429J18641J52100j0374j5146j19172o5564m804Q3026P31N130N3201
22706D6282n0792m8410M1533Q2366L6788n9244k2728m5040L4697k1762j2965O392
22694a2883L9618J9879l913q3105k897N2979K945n3301o2801J4881O9261O5416
22682D6079n0210n0085N7343Q7011q5051o4057M8361L7699M7781L8022n0071l8776
22670B4046J8775l8514j14001p1168J07577J10940k1959j7550l6172j6454J4322
22659d0158L4830r345N297M3558k3313k0208l1814l7798Q167J0673Q2409J4554
22647C6852p3791M8607J10080R5564l6239j32044l115p2116m6465O3724Q0465
$$ y = [-181916, -166063, -85864, -55883, -136469, -126714, -32760, 19283, 698, -10356, -10652, -22029, -66058, -151487, -32846, 119254, 108880, 93734, -25438, -91002, -95806, -12780, -12049, -6919, 46282, -4510, -52920, -11387, 70979, 107767, 48523, 25795, -19245, 15452, -6310, -19275, -12883, 26735, 46614, 42701, -40404, -43301, 9678, 12623, -40678, -103479, -88598, -19337, 46079, -4131, -54216, 3127, 90138, 5087, -58970, -10609, 27090, 74871, 112893, 62822, 24046, 42821, 4307, -109694, -180862, -73285, 37655, 15696, -1854, -38026, -54480, -40158, -5328, -14673, -9376, 34182, 10869, -9339, -41153, -78951, -70784, -60111, 22298, 36852, -36939, 11668, 121748, 217312, 181073, 49029, 45914, -26202, -72667, -8943, 71522]
22636G1522J12487k0979p0929k4832n6860m5102O7150K6327N116N6602N767j74684
22624d8415q322Q1207k6611o2170L188J00093j6466M8393K8147k5162n5804o6841
22612d8763L4780L1961l9575M1929O0670n8798j2034k0086Q2584L0101r5429J6819
22600B4159l6231J0425K670M1049L9969l9164k9833J8843l1331j5140P8382M0923
22588A04721M5140K2713q8985n0706q1389N962Q6296L1378r2214p2190N1456O2819
22576B5001M6798M8163J7188l0921m2503k6372j2009q864n371q95Q2301J9820
22564A12336N5293Q714o3549o2614j47302j6628J07027n002K1214Q1511j6165
22553G4835l4800m517J10530K8850q1522o8483j8415M2980L4347k0300m7225o7576
$$ y = [71522, 184009, 163030, 92101, 67269, 10409, -34693, 32457, 58784, 63900, 120502, 126269, -48415, -56737, 24470, -2141, -64311, -61123, 38970, 22504, 70897, 99044, 73882, 18078, -48763, -13983, 17978, -21597, 20332, 81002, 22204, 10170, -9916, 72668, 102769, 7340, 24159, -12072, -1647, 1023, 42072, 82041, 42877, 13044, 31887, 556, -14584, 63798, 104721, 149861, 172574, 83589, 32883, -48506, -42544, 43752, 75130, -17084, -89274, -37818, 25001, 71799, 119962, 137150, 106229, 63726, 37354, 25345, 16481, 11110, 10215, 92516, 112336, 167629, 176343, 112794, 50180, -97122, -113750, -6723, -11725, 9489, 91000, 74835, 40035, 35518, 146048, 174898, 93376, 24893, 6478, 49458, 83805, 63505, 16280, -51296]
22541e1296K9766O5041J2835r916M4428q287p1985n7810N8327R0810k1198l0701
22529E0014k2678K7301j0771J1858q2725P3408J32512k3800K732o2158J8264k557
22517A11400L6058J5564n9786j02038m5794K353Q8910N133J6085j06681o6361
22506a05157O2308M2731J1879K5496k6012o7211q8185J1275N8267O2850l2820
22495d4579o5868N118J8922l5789N383R1235l7712r3626k438J03320P3081Q4875
22483A01922N8689o9011m980R180L0457J1795L8018n3183p1796k7202q0494J7974
22471c8631L0100J3425L7357N6611m6864n2032O4898K8868L0699k2560K1904j7785
22459A05990j04482m7585Q9937j2082Q540p1302o7580m9362O6462L2300O6293
$$ y = [-51296, -21530, 43511, 56346, 46430, 90858, 82571, 10586, -47224, 11103, 101913, 80715, 50014, 27336, 54637, 43866, 55724, -27001, 46407, 178919, 155119, 157851, 95693, 113957, 111400, 147458, 163022, 103236, 1198, -44596, -42243, 46667, 51800, 67885, -38796, -105157, -42849, -118, 11761, 37257, 11245, -55966, -144151, -132876, -74609, -11759, -44579, -110447, -105329, -86407, -122196, -116813, -25578, -63290, -156916, -159354, -56034, 17047, 101922, 160611, 91600, 86620, 95800, 126257, 138052, 176070, 122887, 51091, 23889, -56605, -38631, -8531, 4894, 42251, 98862, 51998, -34, 64864, 93732, 124431, 101871, 123775, 105990, 1508, -46077, 43860, 31778, 40318, -30984, -98564, -147926, -81464, -49164, 17129]
22448A7129J2498R099K6047j6235M5183k7453m3474Q3278n68q9602r000N2547
22436E9449k7186m7136j3280p955j5001l1482J9393K6354M3986M0542m965k1741
22424B0978m0011L5866J9135m6519k1426n8533o5578J8623J00175O4457K2508
22413D9675l6268J552M1072j4415n6069k3902J4535l489J4600l727O3306j2031
22401C4839k1077n890K4810n9468l4506K9061O3491N5102j0427k889K1223q623
22389H5646J3598k5924J3203J4587M3464k211j1868k4953l7247K7206j2663k0054
22377F2784K0302L0143j1818j2156k2737n8967j3553K108N5794J9587J644l4706
22365C8425o1118m050R6956R3785M853q832K8431n2558n7749M9268K5161n5594
$$ y = [17129, 29627, 38726, 64773, 48538, 93721, 66268, 22794, 106072, 105504, 15902, 6902, 59449, 32263, -14873, -28153, -36108, -51109, -82591, -63198, -36844, 7142, 47684, 42719, 20978, -19033, 16833, 35968, -10551, -31977, -90510, -156088, -137465, -37290, 27167, 49675, 13407, 14959, 56031, 41616, -14453, -38355, -23820, -27309, -12709, -16436, 46870, 34839, 13762, 7872, 32682, -26786, -61292, -32231, 31260, 86362, 75935, 73046, 94269, 85646, 99244, 73320, 86523, 101110, 144574, 142363, 130495, 105542, 68295, 95501, 82838, 62784, 83086, 113229, 101411, 89255, 66518, 7551, -6002, -3894, 51900, 71487, 73131, 38425, -22693, -26743, 70213, 163998, 168851, 160019, 188450, 135892, 78143, 127411, 152572, 96978]
22353I6978p9092j38044o5656J10621Q7010R0963P2235k9868q4936n2421m1541
22342c3751l9508J9654P5442J6065k0982Q184j3769o7950k8485J0261L2377J16966
22330G4504N2621N526p3140k7181m5553j13731M1665J63061N0227l1363n7170
22319C9466N08j7510l5044j2266k7543L830Q6037J14864M8350l2345m4988O215
22307A29574l7568j345q172m5336m7616M3502J4129M2213L3068L1339j19600r0758
22295e6570k0110M0470J27282L9965k2850k0672p2112R213P4061p986k5133j9726
22283D5832j8794L0289k5664m2296K9030J3031o0596m5869J9283R4918M8078l2324
22271E4918K950l0666l0117m9177m842Q8462Q4954j9183l4164J9429L6913j961
$$ y = [96978, 17886, -120158, -185814, -75193, 11817, 102780, 175015, 145147, 60211, 7790, -33751, -73259, -53605, 21837, 37902, 16920, 25104, 11335, -56615, -85100, -74839, -42462, 74504, 127125, 132651, 59511, 32330, -13223, -126954, -85289, 77772, 127999, 96636, 39466, 39974, 22464, -12580, -24846, -52389, -48559, 37478, 152342, 200692, 168347, 123359, 129574, 92006, 90661, 82489, 37153, -10463, 33039, 47168, 89381, 122449, 153788, 34188, -56570, -76680, -36210, 91072, 131037, 108187, 87515, 15403, 24616, 98677, 90691, 65558, 45832, 27038, 57327, 31663, -10633, 18397, 31428, -29168, -75037, -55754, 39164, 87242, 54918, 57868, 27202, -2915, -52092, -56934, 31528, 116482, 97299, 63135, 82564, 119477, 117516]
22259A17516L8834p5429j46150N5190L0991j6303l4147l249N7662l1440m6281
22248e2806m3761j7127O5446Q1275L4422R129k0552j5797R5027M231m2227p4764
22236B2496M608N4871J7088o7037q5366l9335O0320m558j6128O3904J12919J0964
22224A34746K4961k6755J1891j71711q6924J18176J02919L0634L2490N505K3354
22213A99286k9099k4752r660j6326j4817P4984R185r2272P982L4675j16324p0699
22201d7837N9325P912j1341l7889p0342m6835K3308N4881m9046j156P2313R6342
22189D9635K6016j1750M5189L918n437m0060n1033L1195p4612o4831j03220k5029
22177b20019J17761k1494j6483R4533K8305J07930Q3280L8064j12083k3613m000
$$ y = [117516, 156350, 80921, -65229, -10039, 20952, 4649, -29498, -32747, 24915, -6525, -52806, -96567, -113694, -48248, 33027, 67449, 76578, 56026, 40229, 135256, 139487, 97260, 22496, 27104, 81975, 99063, 32026, -53340, -92675, -32355, -36913, -53041, 10863, 123782, 134746, 159707, 132952, 144843, -26868, -113792, 4384, 107303, 137937, 170427, 175932, 199286, 170187, 145435, 135775, 119449, 104632, 179616, 188801, 96529, 104511, 139186, 22862, -47837, 11488, 19400, 8059, -29830, -100172, -147007, -123699, -68818, -117864, -119020, -46707, 49635, 75651, 63901, 109090, 113008, 107571, 67511, 16478, 47673, -26939, -91770, -194990, -220019, -102258, -123752, -140235, -45702, -17397, 90533, 173813, 211877, 99794, 76181, 72181]
22166G2181J727K7881L984P726l2131j7626m9023L8341M8552J1460m2914O145
22154G6303r0488o5451Q9262M7534N1497j5205r7190j0609Q4369k9009j17904
22143g6891N563K6189O6675R0619J1546r9352P3243J3040o8450k7909q2372m9003
22131a17102P4256M3491J2776K7738k9145r753J7402j7143R47n6259M7322o450
22119a1920k8633j19093O4879O2964j9979J9455M6009M9687K1905K4381L1120
22108A40775P7195l0036p2073n9138k6431K1873O7403P9288p2750r848m500m2313
22096F9445n0062O3396N4015n2586k8110N946N8445L0744m2052o5621j41319l4559
22084a32318Q6621n271k7187n286P7873L7233l2101K3286P8391O0138O0314P6739
$$ y = [72181, 73908, 101789, 105773, 113499, 81368, 63742, 14719, 53060, 101612, 113072, 70158, 76303, -14185, -79636, 9626, 57160, 108657, 93452, -3738, -14347, 70022, 41013, -76891, -71328, -45139, 21536, 112155, 123701, 24349, 97592, 110632, 42182, 14273, -68099, -117102, -42846, 645, 13421, 41159, 12014, 2261, 19663, 2520, 3467, -52792, -5470, -11920, -40553, -159646, -94767, -31803, -51782, -32327, 13682, 63369, 85274, 109655, 140775, 217970, 187934, 115861, 56723, 30292, 52165, 119568, 198856, 126106, 116258, 111758, 69445, 19383, 82779, 136794, 84208, 56098, 62044, 120489, 151233, 109181, 43560, -97759, -132318, -45697, -50968, -78155, -83441, -5568, 31665, -436, 22850, 101241, 161379, 221693, 298432]
22072B98432K3175n5605r2379q9868q3848M7949j6790l3292P5285N1165l4382
22061H9842q8359N1410O8938N840o0243j33651o7003l9218L0481J07341L5943
22050A321P1370l590k5498L4508n7113L9008L3122M4092n7321m3104k7736n6097
22038d7038K2357R7332j0664m7475J23593j093m0584j6757R263O5551M6716K5169
22026B26370M8102q6438j22880J5679J3968l7722N0561l5388o3679p3476J354
22015f3549L9365M0387P4153o3308m5620O557L9675P337J1453m8772K0784J14514
22003A32976K4428r6910j210K8610M1211N404p8592L6516j1404m9951N1281L3173
21991A15532l3625j7714Q201k6724L5593R690l4425j8245O060q6600K3793K3394
$$ y = [298432, 321607, 266002, 173623, 83755, -93, 47856, 31066, -2226, 73059, 124224, 89842, 1483, 52893, 121831, 127671, 67428, -66223, -133226, -172444, -141963, -34622, 1321, 72691, 69101, 43603, 78111, 20998, 60006, 93128, 137220, 79899, 36795, 9059, -47038, -24681, 72651, 61987, 14512, 138105, 137012, 96428, 79671, 88934, 154485, 201201, 226370, 274472, 188034, 65154, 80833, 94801, 57079, 107640, 72252, 8573, -64903, -63549, -24184, 16203, 90356, 27048, -18572, -12015, 27660, 34997, 46450, -2322, 18462, 132976, 157404, 60494, 59284, 87894, 129105, 134509, 55917, 92433, 81029, 31078, 82359, 115532, 81907, 64193, 72394, 45670, 81263, 90953, 56528, 38283, 44343, -42257, -18464, 4930]
21979D930K1857J0242K3492J9768M6318L2011q379o2455l9511K9023P0438J5856
21967A63590L3594n0605k4398k6196J00384r602k7357j1838K500k2755N5876P7167
21955B60360l4454P8580l4282n9201p9266R900N0306j5644K4913j2260O5716M8115
21943C02783m9807q8303j4537k5328k0606Q53J1096k7454o8529m3849K7157M1154
21931D4630l0906o0073K7078J9415L0140P4321m4215j2704j9704M583j6308m1931
21919b5674J4398L0414K1001K2103L2707r69m1516k2169j3602K5070j9854n0397
21907b8488j9868K9821J11646m5385j14101M5525L8535p011O1954O2711K7101
21896A62440R944J0709o9409m954M8407J1254J5984J3055m3052m916n5447M681
$$ y = [4930, 26787, 37029, 60521, 80289, 126607, 158618, 150239, 87784, 48273, 77296, 147734, 163590, 197184, 146579, 122181, 95985, 196369, 186767, 159410, 147572, 150072, 127317, 183193, 260360, 225906, 304486, 270204, 211003, 131737, 141637, 191943, 176299, 201212, 188952, 254668, 302783, 252976, 164673, 150136, 124808, 104202, 105055, 116151, 88697, 20168, -23681, 3476, 44630, 13724, -46349, -19271, 144, 30284, 104605, 60390, 47686, 27982, 32565, 16257, -25674, -11276, 19138, 40139, 62242, 94949, 93980, 52464, 30295, 16693, 41763, 21909, -28488, -48356, -18535, 93111, 47726, -66375, -20850, 17685, 10674, 72628, 135339, 162440, 172384, 183093, 113684, 108730, 157137, 168391, 184375, 197430, 154378, 149462, 94015, 98696]
21884I8696r6605o1048N8882P9689K3984o0901J5311J829K521K3784r574j2743
21872F3825P5631M5233j18877m7350J3068R6695K8688p0547q4077J301J5836j412
21860A8014J5896O3132J29674r6629o6071K1394L8954l864L3385r167m8195O847
21848A03370k9330J0181P2940J3454j33881m4555O9712J6614R323N8055O7219
21837B13102n7667m6456o2390J0071M4707j3708L3099N8566n4017N4798M98o0431
21825A20172J25290K3716j48605n3498j6943j2721n8156O473J3264O4828R9377
21814A63197n3278M046L7870p6763m0142k2791k7358N1633M7153j9964R442K1040
21802I4085J7161L5943M0962j0989n7433m8959O3884O2977K0985j4291m9525j8810
$$ y = [98696, 2091, -58957, -75, 79614, 103598, 42697, 58008, 59837, 62358, 86142, 76568, 63825, 139456, 184689, 65812, 18462, 31530, 128225, 156913, 86366, 2289, 3590, 19426, 18014, 33910, 97042, 226716, 130087, 64016, 85410, 124364, 120500, 153885, 144718, 96523, 103370, 74040, 84221, 157161, 170615, 36734, -7821, 61891, 78505, 87828, 145883, 213102, 155435, 108979, 46589, 56660, 101367, 87659, 120758, 179324, 125307, 180105, 180603, 120172, 245462, 269178, 120573, 67075, 50132, 37411, -20745, -14272, -1008, 63820, 163197, 109919, 113965, 151835, 75072, 34930, 12139, -15219, 36414, 83567, 63603, 73045, 94085, 111246, 147189, 188151, 177162, 119729, 70770, 134654, 197631, 218616, 204325, 154800, 135990]
21790A35990K6949l3585P3146k9824l5614L936Q0836l8646m8245N4584J4077m2178
21778A61426P635R7137j5213m3135q6105k1456N2813L6403J05061L4593J3302
21767C42461l1776j886N3698R4774J92030Q2779P5767m814p9346j19013q4686
21756E19988K5942r1810J21127J24314J17568J87197P8806R88k2778j12419j41221
21745H07702j21340q1507o0836J1498l674J02115Q4672R650o8906K2888r3011
21734F09251j40371j58802j20451m2055Q556L3158k2251p2726k7551k2963j8063
21723B5732k3646L571o6628L252J25692l6606p0746J4034O4072K8398K0484J19377
21711B06986J3218n8751k2394j3413M1995N0728R0272K3956l1686j11458j02914
$$ y = [135990, 162939, 129354, 202500, 172676, 137062, 140998, 221834, 183188, 134943, 189527, 203604, 161426, 169061, 266198, 250985, 207850, 121745, 100289, 153102, 189505, 294566, 329159, 342461, 310685, 308799, 362497, 457271, 649301, 732080, 807847, 803033, 723687, 604674, 519988, 545930, 454120, 575247, 699561, 817129, 1004326, 1083132, 1084120, 1061342, 948923, 807702, 686362, 604855, 544019, 555517, 551843, 653958, 738630, 748280, 679374, 702262, 609251, 468880, 310078, 189627, 147572, 156128, 189286, 167035, 94309, 66758, 43795, 25732, 2086, 5657, -60971, -57719, 67973, 31367, -39379, -25345, 38727, 67125, 87609, 206986, 220204, 161453, 139059, 125646, 167641, 218369, 308641, 332597, 300911, 189453, 86539]
21700H6539l0693J6012L338K1622L0972L1279m4950N2920P5373q9971l5275n4613
21688F2553P4422O7958p232n6029p8738O2188L0756m0374k0980O932k6251P1630
21676A46835k8180n9126j8359o7396j6603N6019k3942K3031L4826J26571K35n0742
21664A23169l3916N317l2372o0307k8674O8786K3398r8800n1593R5897L8247j6409
21652C2743k2651O8354K0858j20579n3326R0219Q5158Q3745o1812l4770p4366
21641A3573j646O5849K6437K2943m7943j3334J0670o7271m6546J30084L9072n6565
21629G5323j3616J3363m1417L7976J23679O8862K0411p5842m6278k3977j4181
21618A24303L4617o0536p5174J5510N1291r2690p5837J20848J92270M3646n0413
$$ y = [86539, 55846, 71858, 75196, 96818, 127790, 159069, 114119, 167039, 242412, 152441, 117166, 62553, 136975, 204933, 197701, 141672, 62934, 125122, 155878, 115504, 94524, 101456, 75205, 146835, 118655, 59529, 41170, -26226, -42829, 13190, -10752, 12279, 47105, 173676, 173911, 123169, 89253, 94570, 62198, 1891, -26783, 42003, 65401, -33399, -84992, 10905, 49152, 32743, 10092, 78446, 99304, -21275, -74601, 15618, 100776, 184521, 122709, 87939, 13573, 11927, 77776, 104213, 127156, 79213, 65879, 76549, 9278, -37268, 92816, 131888, 75323, 61707, 75070, 33653, 71629, 195308, 264170, 284581, 208739, 162461, 138484, 124303, 158920, 98384, 23210, 38720, 90011, -2679, -78516, 42332, 234602, 278248, 227835]
21607B27835n9792j2833j5211O6142J119p2179L135p1454k1916N2189J03716O017
21595B06768R178j4340j9044K3254k5373p6923j54700l9139N3889Q6221J45169
21584A94960K4349n4968R2080R033p094k3425k3803l7310m6285O4394M9694j6071
21572B25554m5314j2614N4005k8935q54k3556j00472r904Q5487L0734Q6868R683
21560B70682n1405j3910N7777l5156o133r521J6997P5353L1160m9807j48100R516
21548A47453K5855k8836L8788M1296O2270n911l8986m0718m7905n7523O820L1036
21536A33639M1485o4871p267P0429M3950j1554n7490n3573l0611J03435N9695
21525B27267O562n6956O06m351K4175J2983K2430j674L0305K4538o0519m3931
$$ y = [227835, 168043, 155210, 139999, 206141, 207260, 135081, 138216, 66762, 44846, 97035, 200751, 206768, 215946, 201606, 182562, 205816, 180443, 103520, -51180, -90319, -36430, 49791, 194960, 219309, 164341, 256421, 265454, 258360, 234935, 211132, 173822, 127537, 191931, 241625, 225554, 180240, 167626, 221631, 192696, 191842, 168286, 67814, 57910, 143397, 174131, 260999, 270682, 219277, 205367, 263144, 227988, 221855, 212334, 229331, 304684, 335844, 286037, 137937, 147453, 173308, 144472, 183260, 224556, 286826, 280915, 241929, 201211, 153306, 95783, 102603, 133639, 175124, 110253, 102986, 173415, 217365, 205811, 148321, 94748, 64137, 167572, 227267, 233829, 176873, 177479, 173128, 197303, 210286, 232716, 231042, 261347, 285885, 225366, 181435]
21513A81435k0570P2756L6365r334L3362M8209k7870P07K9654j2509K601M3973
21501C78779p5550r3638m5273J9983R0615m7566M2064L1642n9660P572n1758N9536
21489B56746J13889j4499L846n6428k377m8325N81L2909n9755o8205R0046N0269
21477B98697l6131k6536J7380K6426N3981Q464o4560j7388L8731K7019M5047j7148
21465C53982m2910r007L3671j9079l1362L9j4251J8469Q5417r593p9262m2803
21453B43311m3552Q3967O275o3730n0440J07608m3949k4691m8153N0866P085o3832
21441A60765j8276Q1657R128L3671J830l6230j691m0822L8082k7487p0439L4206
21429A64394j8542o9539J2529M4079O3044j0895N1773J507n0142L8537R722N7181
$$ y = [181435, 160865, 233621, 269986, 260652, 294014, 342223, 314353, 315060, 344714, 332205, 334806, 378779, 303229, 209591, 164318, 184301, 274916, 227350, 269414, 301056, 241396, 248968, 197210, 256746, 370635, 356136, 359982, 303554, 301177, 252852, 253433, 286342, 226587, 158382, 248428, 298697, 262566, 236030, 253410, 279836, 333817, 342281, 277721, 260333, 299064, 326083, 371130, 353982, 311072, 302065, 335736, 316657, 285295, 285334, 271083, 289552, 374969, 365376, 286114, 243311, 199759, 283726, 290001, 226271, 175831, 283439, 239490, 214799, 166646, 217512, 224597, 160765, 142489, 224146, 233274, 266945, 268775, 232545, 230854, 190032, 228114, 200627, 130188, 164394, 145852, 76313, 88842, 132921, 195965, 185070, 236843, 238350, 188208, 226745, 236467, 293648]
21417B93648R833J1935J2644K0516J6722l6124K4695J200j04413q513J2352q8656
21405A65839l3321M7232P4543J5438m628m2952O2177O4875J21637N3944n6838
21394D67946n1363q7597k2548M5676K2732L6533o3061m1108N2080Q762N2416M317
21382D24785m3838J1737Q0397q0957k2171J24048o1026m9347M6547R2571m8351
21371D74395k7361L5519j7280n6447l0243N6029Q6949n0944l1135N6165L6468
21360E32115k4239K7740J0656r0010k6700Q5879J24569K3789N868m2715j70817
21349D56135p0288R4330J09394N5028m0238p2269k8903j9380l7867K6250O8442
21338E40634K9185l6774p8866N0951j404L0002k3842m6856M3987N8288M0100J25280
$$ y = [293648, 303481, 315416, 328060, 348576, 365298, 329174, 353869, 355069, 250656, 242143, 254495, 165839, 132518, 179750, 254293, 269731, 265103, 222151, 284328, 349203, 470840, 524784, 467946, 416583, 328986, 306438, 352114, 374846, 411379, 348318, 307210, 359290, 368052, 420468, 424785, 380947, 392684, 473081, 392124, 369953, 494001, 432975, 383628, 430175, 522746, 474395, 447034, 482553, 465273, 408826, 378583, 434612, 521561, 470617, 439482, 495647, 532115, 507876, 535616, 546272, 456262, 429562, 515441, 640010, 663799, 669667, 626952, 456135, 385847, 480177, 589571, 644599, 604361, 532092, 503189, 483809, 445942, 472192, 540634, 569819, 533045, 454179, 505130, 503726, 533728, 509886, 463030, 507017, 565305, 605405, 730685]
21326G30685n939m9511R664o3802m7523p87P9612l6737l0407Q4171j0595j08875
21314E49956q4980j3589P6306M5610q2265j6949M6744J44593O7259j00776K1284
21303F53193Q5237R0426J0239J0256M6584r1063J8478O1885K9053M7744O1621
21292A023653k927K9172M1845p8577q7509J0431L5988l7430j5283J08171N9660
21281A087194k2802P4119J29937M8151J5551k8379P3519N1871j6598L8000O8358
21270A518921N2668K9972K3204N9189R6498J63902J38904L2999J30902K27537
21260B474696K08680J92995L52014M13013M95979L96932K93118L53147K84163
21251E464737K49789K97013M70370O71751J016013J257552J585428J978275K558807
$$ y = [730685, 724746, 675235, 684899, 621097, 573574, 572787, 652399, 615662, 585255, 669426, 658831, 549956, 464976, 451387, 527693, 573303, 491038, 474089, 520833, 665426, 732685, 631909, 653193, 738430, 828856, 839095, 849351, 895935, 804872, 823350, 885235, 914288, 962032, 1023653, 1020726, 1049898, 1091743, 1013166, 925657, 936088, 972076, 934646, 919363, 1027534, 1087194, 1064392, 1138511, 1268448, 1316599, 1332150, 1303771, 1377290, 1429161, 1412563, 1450563, 1518921, 1571589, 1601561, 1624765, 1683954, 1780452, 1944354, 2083258, 2116257, 2247159, 2474696, 2683376, 2876371, 3228385, 3641398, 4137377, 4534309, 4827427, 5180574, 5464737, 5714526, 6011539, 6481909, 7153660, 8169673, 9427225, 11012653, 12990928, 15549735]
21242A5549735L531790N445573Q834724J4150952J9644560K0048723R640612K268479
21234I9115148M481199k297318j5664999j4172583n188368M765438J6467456K8616538
21226A16122511L4906555K6046795J1323942J331884o060158k1042436l3244934
21219A29384159l1428062j9412481q079579K500308J1872175J6089162P953745
21212A08879427m184495k617574m755098j8052307k2032431j5995101j0607367
21205C0635054o903264m664345l353157k590525k151447j832718j591528j076743
21197F471327o12229l53286l03151m51475l08627k88880m19046n47238l58916
21188B828479p5772m1459o53j767j85654l06926k64530k08923j84104k22765p9048
$$ y = [15549735, 19081525, 24527098, 33361822, 47512774, 67157334, 87206057, 96846669, 99115148, 103596347, 101299029, 85634030, 71461447, 66273079, 71038517, 87505973, 116122511, 151029066, 177075861, 188399803, 189731687, 183671529, 162629093, 129384159, 97956097, 78543616, 70464037, 72964345, 84836520, 100925682, 108879427, 104694932, 102077358, 97322260, 79269953, 57237522, 41242421, 30635054, 23731790, 19067445, 15714288, 13123763, 10972316, 9139598, 7548070, 6471327, 5859098, 5505812, 5202661, 4751186, 4442559, 4153679, 3734633, 3187395, 2828479, 2752707, 2711248, 2710595, 2708828, 2523174, 2216248, 1951718, 1742795, 1558691, 1335926, 1256878]
21177A256878n8106j35294j21605Q7258Q04l6066M472K5624o87n2837m6535l9036
21165H84870q3333n1910j01880p8999J8092N1315R3416o028M9215N0843J3156
21154H38757n3100j13555j09368r2493n5467J11181l251n5295O3856J9812l8184
21143E12893J2039k3291q9866j46750n1071Q0165J26429O7199k5381m4300q1450
21132C36616M4216L4863K265l7985p8727k1709j22035m380n7942j8668l7746M0407
21120G9175L1802m9770M847N3429N3777K776J3913n4696k8609N070j3345N1975
21108A50344l8898j32056n5696N6861R1029O3463p580n1809M2476l6175j8953
21097F3006L4255j7704K0050O90L703O4162l9950K4429o653j00093j357K4887
$$ y = [1256878, 1198772, 1063478, 941873, 1029131, 1029935, 993869, 998341, 1023965, 1023278, 970441, 923906, 884870, 801537, 749627, 647747, 568748, 586840, 638155, 731571, 725543, 774758, 825601, 838757, 785657, 672102, 562734, 470241, 414774, 525955, 522704, 467409, 531265, 551077, 512893, 524932, 501641, 411775, 265025, 213954, 294119, 420548, 487747, 462366, 418066, 336616, 380832, 415695, 417960, 379975, 301248, 279539, 157504, 153124, 95182, 76514, 38768, 79175, 110977, 61207, 66054, 119483, 173260, 176036, 189949, 135253, 106644, 111714, 98369, 150344, 111446, -20610, -76306, -19445, 71584, 135047, 127467, 75658, 118134, 81959, 63006, 97261, 79557, 99607, 100297, 104000, 168162, 128212, 152641, 145988, 45895, 44538, 69425]
21085F9425L0426j174l8329o7250M5928L2479r0453j0415J14841P1391J3804N631
21073A76304N3195P591j9799R137j7147K8086L0733Q5889J03992l2604m6009j15427
21061B63941l4961Q0898R2076P8537O0492k9350m9422L0841L3948q5956j38984
21050C02060m9094K9692Q4151R7733J01538r4354o8383j5996k9945r6083p9824
21039A81495l4240m309J3232m840M9101L0279m3994R877J2070j07934m9368o341
21027D5028L7424k1060Q6792O0043P2721M8399q4300P625M687J1428J15814N9961
21015D44562P1379N1703q5650n2776k5931N3789N74O4658M5872K7286j4389Q1020
21003F62097O6118o0266p4892j22677n3482m8556j652L8913J8264j27291q045
$$ y = [69425, 99851, 98677, 60348, -6902, 39026, 71505, -18948, -29363, 85478, 156869, 170673, 176304, 229499, 237090, 217291, 226428, 209281, 237367, 268100, 353989, 457981, 425377, 379368, 263941, 228980, 309878, 401954, 480491, 540983, 511633, 462211, 493052, 527000, 441044, 302060, 252966, 282658, 366809, 464542, 566080, 471726, 403343, 387347, 357402, 261319, 181495, 147255, 142946, 156178, 151338, 200439, 230718, 186724, 196601, 208671, 100737, 51369, 45028, 82452, 61392, 148184, 208227, 280948, 329347, 245047, 252672, 257359, 268787, 384601, 444562, 515941, 567644, 481994, 429218, 403287, 457076, 457650, 522308, 568180, 595466, 581077, 662097, 728215, 667949, 593057, 470380, 416898, 368342, 366690, 405603, 423867, 296576, 288531]
20992B88531Q7007K6134l4160o6507j6746N3376J2179N609l7770M4175r371p5429
20980B77028p7293k7988L6551j1356k4938k0519J40506J4352p8884n8333n1481
20969A17645M5616J9474Q8570m1006q3657l0509j2901m0348M5291Q8528P0957
20958B67660J6300j02681n3970m1650m0598P2462M6893o06N012N2622N0392L2882
20946C04718K3447j12794M8955P2848L0876p3046j13004n8423m0203O5399L0340
20935A79113l7139L1778K2414N9085o2146O4718M2425Q1763j1646q5229j08438
20924A76698N0064J6274L3938N2439P2785k4948j08005q276J4970J163j0082n5694
20912B11326R9800R8115L5134P322o875o5891R168R8041j656l6842p1422l350
$$ y = [288531, 375538, 401672, 367512, 301005, 284259, 337635, 349814, 355423, 317653, 361828, 352457, 277028, 199735, 171747, 208298, 196942, 172004, 151485, 291991, 306343, 227459, 169126, 117645, 163261, 182735, 271305, 230299, 146642, 116133, 103232, 62884, 108175, 196703, 267660, 283960, 181279, 127309, 85659, 45061, 117523, 164416, 163810, 168822, 221444, 271836, 304718, 328165, 215371, 264326, 337174, 368050, 295004, 182000, 123577, 83374, 148773, 179113, 141974, 173752, 196166, 255251, 193105, 257823, 300248, 382011, 370365, 285136, 176698, 226762, 243036, 276974, 329413, 402198, 377250, 269245, 260969, 275939, 277102, 267020, 211326, 311126, 409241, 444375, 451697, 444822, 378931, 388099, 486140, 484484, 447642, 376220, 372870]
20900C72870K9186M3503k8204j03451k080M6262P319o4501m6029J6364P8102l3143
20888C16198M849J18856k8036k4563j1780n4943L5920P1983M0286m8404k1382
20877C98984K4272n2358L4588Q3484P2682O554m4365n3566n4646J9495l856p6852
20865C54416k3781Q9383r5914j09659J3008J07424N2182l0992M0080L5355l6856
20854C94646K2098p5268m5797O8589O3048j00829p2719J9869l8219n1731O6425
20843B50112R7252R828p2264m8927J5934R5043R1887K6745p6334M993K043q6160
20831C10152j2708J10943Q2529L3019l9415l7556J9314m5809o1468L390O9837
20820D32228R3874N6514n6108m4841J4123J73013J6858m9563q808L7570K1951
$$ y = [372870, 402056, 445559, 417355, 313904, 311824, 358086, 365405, 300904, 254875, 271239, 349341, 316198, 321047, 439903, 411867, 387304, 375524, 320581, 356501, 428484, 468770, 420366, 398984, 423256, 370898, 405486, 488970, 561652, 568206, 523841, 470275, 415629, 435124, 431268, 354416, 330635, 420018, 324104, 214445, 227453, 334877, 387059, 356067, 396147, 431502, 394646, 416744, 341476, 295679, 364268, 427316, 326487, 253768, 273637, 235418, 183687, 250112, 347364, 357192, 284928, 236001, 251935, 346978, 438865, 465610, 389276, 394269, 396312, 310152, 297444, 408387, 490916, 523935, 484520, 446964, 466278, 420469, 359001, 362391, 432228, 526102, 582616, 526508, 481667, 495790, 668803, 685661, 636098, 627290, 664860, 686811]
20809F86811j4561l0029J8190N8271j7967j41547q3060O2095Q9317R7259k2354
20798G02425k4240P2464M9881l8065Q8823J02529M592M4394J42853R9266M7151
20787A292073Q06J67502J84252R3909L09R6047Q0496l9099M7449K5407m8757o9366
20775A831028r9925p0426r4890j68358m6869q740L0322M4832m451L4417j33300
20764A313640r2036l9754n9448o0963q3648m3678l3679k695l7659M00J01483J08609
20752A070572L9051M0684L3398Q5865l7422r8174l4224J50592o9518m5938p7599
20741A057287l5280m4100N1353N3607J5420J33237Q3446j4994j08434k472m488
20730A184582m3639J983j4984L0200R6779n1627Q7598N2675O4841N2717Q6661
$$ y = [686811, 672250, 642221, 660411, 718682, 700715, 559168, 476108, 538203, 627520, 724779, 702425, 678185, 750649, 800530, 762465, 851288, 953817, 958409, 1002803, 1145656, 1244922, 1292073, 1292879, 1460381, 1644633, 1738542, 1738851, 1834898, 1915394, 1876295, 1923744, 1949151, 1900394, 1831028, 1731103, 1660677, 1565787, 1397429, 1350560, 1341820, 1372142, 1416974, 1412523, 1446940, 1313640, 1221604, 1181850, 1122402, 1061439, 977791, 934113, 900434, 897739, 860080, 860480, 961963, 1070572, 1109623, 1150307, 1183705, 1269570, 1232148, 1133974, 1099750, 1250342, 1180824, 1134886, 1057287, 1022007, 977907, 1029260, 1082867, 1098287, 1231524, 1314970, 1299976, 1191542, 1189070, 1184582, 1140943, 1142926, 1127942, 1158142, 1254921, 1203294, 1290892, 1343567, 1408408, 1461125, 1547786]
20719A547786L1437k9488l6231J7262n7968R987N6757O2490P2525J43358Q7439
20708A905354J30031K61087K25852P6637L8k9580M3856J8269K8649J27114K23775
20697C011082K73540K33618J92909J55993K31222K77378K28151K08538L14676
20688E127107O04078O94287O50438K15412j40768m1353Q3829L33017N90608O18779
20678H735434N80599N11457L51519O7376r8822o3708J58678L90469O25541R40441
20668A2198984J242294J769465K061576K558640L200624M114973N426220P123852
20660C9696628R703265J3941515K1578534L5130145N7981196Q9380679J12392004
20653C79803966Q8413609j2991979j01801485j00083957p1485902m7852381l1986458
$$ y = [1547786, 1579223, 1549735, 1513504, 1530766, 1472798, 1482785, 1539542, 1602032, 1674557, 1817915, 1905354, 2035385, 2296472, 2522324, 2598961, 2598999, 2569419, 2613275, 2631544, 2660193, 2787307, 3011082, 3284622, 3518240, 3711149, 3867142, 4098364, 4375742, 4603893, 4812431, 5127107, 5731185, 6425472, 7075910, 7291322, 7150554, 7109201, 7193030, 7526047, 8116655, 8735434, 9316033, 9827490, 10179009, 10246385, 10147563, 10083855, 10242533, 10633002, 11258543, 12198984, 13441278, 15210743, 17272319, 19830959, 23031583, 27146556, 32572776, 39696628, 49399893, 63341408, 84919942, 120050087, 178031283, 267411962, 379803966, 468217575, 455225596, 353424111, 253340154, 181854252, 134001871, 102015413]
20646A02015413k2179482j5672364j1421811q658148o512703m755116l299114
20639B9516675k164937j338397n69761K39102J036270J826057K860463M076515
20631C5481987N757633P771819J1059238J6060846K4253498L9333802O5043177
20624B04762000R7790635J14627531P1456506m3564120j12096163r7468393o8415475
20617A67092521m5774921l0911670k1620371j5332321j0994939q245615o254244
20610B7958440m673108l631123k859802k088199j660242j488538j067767q06066
20602I683595o92171m17602j91254J64523K43042L2520m21011p66314n18012l24516
20592F792800j77540p7456n0554k32233o16124r06661o60757m37922l30836k70512
$$ y = [102015413, 79835931, 64163567, 52741756, 44083608, 37570905, 32815789, 29516675, 27351738, 26013341, 25443580, 25682682, 26718952, 28545009, 31405472, 35481987, 41239620, 49011439, 60070677, 76131523, 100385021, 139718823, 204762000, 302552635, 417180166, 488636672, 445072552, 332976389, 235507996, 167092521, 121317600, 90405930, 68785559, 53453238, 42458299, 34212684, 27958440, 23285332, 19654209, 16794407, 14706208, 13045966, 11557428, 10489661, 9683595, 8991424, 8573822, 8382568, 8547091, 8790133, 8822653, 8401642, 7635328, 7117316, 6792800, 6615260, 6537804, 6487250, 6255017, 5638893, 4732232, 4071475, 3633553, 3302717, 3032205]
20582C032205n3293n4195m3592o5483l3320O6832J18254j4069o3051Q0063R1357
20571C061708o5125J4795J56697K49646K63393K18843K9757J22087K61998K55065
20561D568864L37728M36733M10382M21733O66498R87454J266107J865474K866358
20552A3827331M634290P848357J2637578J6918493J4795387K54857j2168367r461367
20544D9286559k834514M485678J2541760J8220688J4984181J516437j699687J63971
20536I6665073r988284j8410047j3594914o311691J144471Q432570J2035897N260412
20528G5233487j1859919j7412342j2788303q379339n414442l783988k604944j839612
20520A1150598j337120q91078m92434k90706l13510l13633j77411O8928J54341
$$ y = [3032205, 2978912, 2924717, 2881125, 2815642, 2782322, 2849154, 2967408, 2953339, 2890288, 2970351, 3061708, 2996583, 3011378, 3168075, 3417721, 3681114, 3899957, 3929714, 4051801, 4313799, 4568864, 4906592, 5343325, 5753707, 6175440, 6841938, 7829392, 9095499, 10960973, 13827331, 18461621, 26309978, 38947556, 55866049, 70661436, 70916293, 58747926, 49286559, 46452045, 50937723, 63479483, 81700171, 96684352, 98200789, 96501102, 96665073, 86676789, 68266742, 54671828, 48360137, 49504608, 57937178, 69973075, 75233487, 63373568, 45961226, 33172923, 24793584, 19379142, 15595154, 12990210, 11150598, 9813478, 8922400, 8429966, 8139260, 7825750, 7512117, 7334706, 7403634, 7557975]
20511G557975K39038J98391K01402L12839P01721R66504J518250K336735L477108
20502A7509963N739015R896434J5349548J8234893J1123116p031912j3271730
20495E7549327p391429M99P973681J5713990J8675247J0262131j087575O17950
20487A02313821k281395j6386244j9044831j1561854l628499M232282J0892565
20480F4535845J1202649j614472j7036338j6665082j1547991p815182n193760
20473A5865669l538500k500646j827621j392195j018986o57295m22307n21663
20465C986456m99925l87943l71365k05671j97770j05742k01819k81746k42888
20456A491587j25093j24654o5580j02628j45754j03122j25926n0804l0923o3426
$$ y = [7557975, 7797013, 7995404, 8196806, 8509645, 9211366, 10177870, 11696120, 14032855, 17509963, 23248978, 33145412, 48494960, 66729853, 77852969, 70821057, 57549327, 50157898, 50158397, 58132078, 73846068, 92521315, 102783446, 101695871, 102313821, 100032426, 83646182, 64601351, 53039497, 49410998, 53643280, 64535845, 75738494, 74124022, 57087684, 40422602, 28874611, 21059429, 15865669, 12327169, 9826523, 7998902, 6606707, 5587721, 4930426, 4508119, 3986456, 3486531, 3098588, 2727223, 2521552, 2323782, 2218040, 2016221, 1734475, 1491587, 1366494, 1241840, 1176260, 1073632, 927878, 824756, 698830, 648026, 617103, 553677]
20446E53677m0817m5029j39696j46221q704K0842L6633k7570m3475Q5918P750
20435B53308o7322k10482K9250J38544R364n6049O7934N714n2857j8670j6626
20424H2108K9563K2179O0465j9673N6056l3488j3614n2170o2126p4442o8128L776
20412f9494L808P242m5209m3426R0206l0377L6960L3993n1201K2370L4855Q9292
20400G9019k2115k2746N6312J7676j6337j504n4199M3317N1751n7691N5685L8170
20388A67338J2276l2214L4612J9904K299J9115n3124r3939j9285j731L5482l7603
20376E3130j07896o4879o5210n448J27768N8796p0726q4156K9439o2068K6667
20365a64583L6105K9272N9454q061p1876n0396K0393M7005L0679o3325M3739Q3177
$$ y = [553677, 512860, 467831, 328135, 181914, 173210, 194052, 230685, 203115, 159640, 245558, 253308, 185986, -24496, 4754, 143298, 152662, 96613, 164547, 170261, 117404, 98734, 82108, 111671, 133850, 194315, 174642, 230698, 197210, 183596, 131426, 69300, -5142, -73270, -69494, -65686, -58444, -103653, -147079, -56873, -87250, -50290, -16297, -67498, -45128, -10273, 79019, 56904, 34158, 90470, 108146, 91809, 90305, 36106, 79423, 131174, 73483, 129168, 167338, 179614, 147400, 182012, 201916, 204215, 223330, 170206, 76267, 56982, 55251, 90733, 53130, -54766, -119645, -184855, -190303, -62535, -3739, -74465, -158621, -129182, -191250, -164583, -128478, -99206, -39752, -47813, -119689, -170085, -149692, -102687, -72008, -135333, -91594, -8417]
20353h417k6487Q866O7402N9016j0800l6974L3657J2274l7207L6745Q602p4989
20341C1688q960M9790P9361L895K8357J0095n7965n8210J6772K5357m0837k9374
20329D9969M6291Q2886q2693j17784q0647K8016l6521M962N6955P7551r372j8584
20317A029K2934K1611L4747m5581j7660k8900L4038K2412n293K2463j1021r0130
20305c9351o0492l0108M1738M2469J2546j489l3911J4799R170n3534o1032J8114
20293a41081l1043J4779Q014P7262L3621M2656J799o4668J9738N1165M5483o4090
20281f365m6920o038p9174k5938L1193r9498q29J5501J43677N2140P2628o631
20269D3746k3246K924o0994p438m2036J3232L5535J3529o5634r8173N5800J01566
$$ y = [-8417, -34904, -26038, 41364, 100380, 89580, 52606, 86263, 98537, 61330, 98075, 106677, 31688, 22728, 72518, 151879, 155774, 184131, 194226, 136261, 78051, 94823, 120180, 79343, 49969, 96260, 179146, 96453, -21331, -101978, -73962, -110483, -105521, -48566, 28985, 19613, 1029, 23963, 45574, 80321, 34740, 17080, -11820, 22218, 44630, 39337, 61800, 50779, -39351, -99843, -129951, -88213, -45744, -33198, -34687, -68598, -53799, -44629, -98163, -159195, -141081, -172124, -157345, -149331, -72069, -38448, 4208, 6007, -58661, -38923, 12242, 57725, -6365, -53285, -59323, -138497, -164435, -133242, -232740, -233569, -218068, -74391, -22251, 50377, 43746, 20500, 23424, -37570, -45008, -87044, -73812, -38277, -24748, -90382, -188555, -132755, -31189]
20257c1189k7169p3575k3501M6456N1636j2904j54230o5367L2608J05518P5887
20246g5830l3737L8503K1254n2799j6335m1552J0686k6808J5273K2995L7788M4721
20234e5841J5683p262r3740o003L1199L8614n7931n2672l3345J1024Q7463K9237
20222i3574J9289K9577p1011q7580l2287j4229K208K4649J9430N1562J32311j3471
20210c3126J3619K0885j4515L9359L8618j10032m5520L6429M0007M9575k9452
20199E847n5405O236o6858O389O9007K5456J9919J22812J23461O2442k5243o6588
20187B27475q3252l0369n6142j5009Q2640J26164R1808j3283L689O0887k4562
20176C70046j20137q1786o5985o0637J06826P9543K8055O9870k2587j23220n6875
$$ y = [-31189, -58358, -131933, -155434, -108978, -57342, -70246, -224476, -289843, -257235, -151717, -75830, -109567, -71064, -49810, -102609, -118944, -160496, -149810, -176618, -161345, -138350, -100562, -55841, -40158, -47420, -141160, -147163, -115964, -77350, -135281, -187953, -221298, -210274, -122811, -93574, -74285, -44708, -115719, -203299, -235586, -249815, -247607, -222958, -203528, -151966, -19655, -33126, -19507, 1378, -13137, 26222, 64840, -45192, -90712, -54283, -14276, 35299, 5847, -49558, -43322, -110180, -103791, -34784, -9328, 10591, 133403, 256864, 319306, 294063, 227475, 144223, 113854, 57712, 42703, 125343, 251507, 343315, 330032, 333721, 394608, 370046, 249909, 168123, 102138, 41501, 148327, 227870, 255925, 325795, 303208, 179988, 123113]
20165A23113l9974K752O7430O6564Q862K5414K7798l4808N0481R6187n107q470
20153C80242M7603j643j21688o7764L0701N2253n0259j3837N9723l1281N819J09105
20141C98974Q2236P5142j07874q3759M698Q770M824l8938J8973M3115M9491l1253
20129D24399n2331L0847J7683J2678n4479P127r5120k902J39379L6745K913K3987
20117D90926O2078j386o9571j8683J084o1885k7250J03710J04225J33712l5910
20106F81050j08746n6667P91K2137p180k0288J6588l3265j06229p5395p7350r2775
20094A42671O298l0828M2160o908O508Q396n1629Q1614J99897J70688J95151J82670
20082I46688K15771K9669j59999k24955k41412j26260o7982j282m6405j22610
$$ y = [123113, 83139, 85891, 153321, 219885, 228747, 254161, 281959, 247151, 297632, 393819, 388712, 380242, 427845, 426202, 304514, 236750, 267451, 319704, 269445, 255608, 315331, 284050, 289869, 398974, 481210, 556352, 448478, 364719, 369417, 378187, 383011, 344073, 363046, 406161, 455652, 424399, 372068, 402915, 420598, 433276, 378797, 385924, 290804, 287902, 427281, 464026, 466939, 490926, 553004, 551618, 482047, 463364, 464448, 402563, 375313, 479023, 583248, 716960, 681050, 572304, 515637, 516428, 538565, 531385, 511097, 527685, 494420, 388191, 312796, 235446, 142671, 148969, 118141, 160301, 153393, 159901, 168297, 116668, 198282, 398179, 568867, 764018, 946688, 1162459, 1192128, 1032129, 807174, 565762, 439502, 371520, 370238, 323833, 201223]
20072B01223M4326k4126j5851J49452K85254K06004K24935J35368j56153k47170
20062H03262k08073j46241j08809j60068J6516R9476R1514L0908J33703K76522
20052H28710L47787J79118p8491k87103k41145j76489j04068J6503o8588j50716
20042B65518o7358K5895O1731J74522J72334J51272K62329K64411K2434k36918
20032A096170l01300k18195o4576L635r987K1760J9778n5547p9113n169J2428
20021D19884M8830N9990N5783M9855P2453N2702n4746m0663m6514j03587k8761
20010D85226l9508J0465M1180O6837n8769q3164l3166q7470p591L3294l7155J3122
19998C03301o0696q2314o31o4335j25978K7293P550L0888k7674l5290R0086J8026
$$ y = [201223, 245549, 221423, 205572, 355024, 640278, 846282, 1071217, 1206585, 1050432, 803262, 595189, 448948, 340139, 180071, 196587, 296063, 387577, 418485, 552188, 828710, 1176497, 1355615, 1277124, 990021, 748876, 572387, 468319, 484822, 416234, 265518, 198160, 224055, 285786, 460308, 632642, 783914, 1046243, 1310654, 1333088, 1096170, 794870, 576675, 512099, 515734, 505747, 527507, 547285, 491738, 412625, 407456, 419884, 468714, 528704, 584487, 634342, 706795, 759497, 704751, 664088, 617574, 513987, 485226, 445718, 456183, 497363, 564200, 505431, 422267, 389101, 301631, 294040, 327334, 290179, 303301, 242605, 160291, 159660, 95325, -30653, -3360, 4190, 35078, 7404, -27886, 62200, 80226]
19986H0226j3180n5981J4459N3839L1980l4906M3924K5609K5562J34832M0479
19975C46843q1256p4454l3080R0665J37129K0131n2826J33383J33406k2992o5362
19964E31587n2750K2549r6743l8483J5287l0746K3252P8746J9672j22001j20278
19953B30092k1791o3257p8650p4609j5959L4784J87j7263n6714j69001L5197O6691
19941a30293Q6002l7127M4095K2365k2409L5019j7927m1577J3265J3659L773P3061
19929D1906Q8773N0780k1089P460N5442l987J13702P2536O4298J0281p7498P600
19917D10204P2459J39431K7823R382J04730P2906j8009L3201j21070p2238n2788
19906F06031k0612J04691N4864O815J8660r366l9190l3506l9294n9770J7865l7455
$$ y = [80226, 67046, 11065, 25524, 79363, 111343, 76437, 120361, 145970, 171532, 306364, 346843, 265587, 191133, 158053, 248718, 385847, 405978, 353152, 486535, 619941, 596949, 531587, 478837, 501386, 404643, 366160, 381447, 350701, 373953, 452699, 472371, 350370, 230092, 208301, 145044, 66394, -8215, -24174, 10610, 10797, -6466, -63180, -232181, -196984, -130293, -44291, -81418, -37323, -14958, -37367, -2348, -20275, -61852, -48587, -34928, -31155, 41906, 130679, 181459, 160370, 167830, 223272, 219285, 332987, 405523, 469821, 480102, 402604, 410204, 482663, 622094, 649917, 659299, 764029, 836935, 818926, 852127, 731057, 658819, 606031, 585419, 690110, 744974, 751789, 770449, 761083, 721893, 688387, 649093, 589323, 607188, 569733]
19894E69733q4122o5588o065j4002k4976r6781K0523N3636O1004R9386m4475o9969
19882C98304k07733J5333j8164r983L4309J34366K1813l1465O9463K932N866j4448
19870D00593k9766O305N3911J50065M7230M9697N4994m4293j3961R8053L1097
19859H03925o1986l7643j02423n4348K8175O3953O0805J6273m7763o8375N162
19848F05755Q5589n9914J4677q4252o8587q1683k8060P8885J23077o5977p2702
19837D46808q10L577j01581m5196L4877j15496p6727j4303m9314K6138J4935r9294
19825B3614L0191N5116P0138L1274J38121n296l5646L1767j2118j8646J4694P1338
19813C94547P4639O9923P989m95N2575K397L7536J3111r0780n6468J1029k9955
$$ y = [569733, 485611, 420023, 413958, 399956, 374980, 278199, 298722, 352358, 413362, 512748, 468273, 398304, 190571, 205904, 187740, 177757, 212066, 346432, 368245, 336780, 406243, 409175, 415041, 400593, 370827, 377132, 431043, 581108, 628338, 678035, 733029, 688736, 674775, 772828, 803925, 741939, 704296, 601873, 547525, 575700, 639653, 700458, 716731, 668968, 600593, 605755, 691344, 631430, 646107, 561855, 493268, 411585, 383525, 462410, 585487, 519510, 446808, 445998, 449575, 347994, 302798, 337675, 222179, 145452, 131149, 81835, 107973, 122908, 23614, 53805, 108921, 179059, 210333, 348454, 343158, 307512, 339279, 327161, 308515, 323209, 394547, 469186, 539109, 547098, 546603, 599178, 601575, 639111, 652222, 561442, 504974, 516003, 486048]
19801D86048J4270M8126M1578R5573Q5853m287l2217m779m2226q1419l4974o9810
19789E01736m6583J237M4698P0974o4289n3015j835n7012K1684L7128l8133j33755
19777B82835o9846L3959M9921R8785j3361m9165j6223n6278N1736J3271m8012
19766B77622O8100P710j437r6453L3351J55105L4451q4466m5265L3367Q7660L804
19754D73549R7224L3417K9214l4361n9273l9062m1243n8781L4299M9983j0149
19743D74817k5581L3270L3295R191K4043o570p1924J5330k1270j56466l9067M3083
19731C12151R42j4103Q0654L3239l2292o3807j1028J8288L1937p049q420M2473
19719C82985K9907K0682r596Q4711L7602n4290m0667l0331M2243N8512K7646n9430
$$ y = [486048, 500318, 548444, 590022, 685595, 771448, 767161, 734944, 730165, 687939, 606520, 571546, 501736, 455153, 456390, 501088, 572062, 507773, 454758, 452923, 395911, 417595, 454723, 416590, 282835, 212989, 246948, 296869, 395654, 382293, 333128, 316905, 260627, 312363, 325634, 277622, 345722, 353432, 351995, 255542, 288893, 443998, 478449, 393983, 348718, 382085, 469745, 473549, 570773, 604190, 633404, 599043, 539770, 500708, 459465, 400684, 434983, 484966, 474817, 449236, 482506, 515801, 524992, 549035, 542465, 470541, 485871, 464601, 308135, 269068, 312151, 313093, 298990, 379644, 412883, 380591, 316784, 305756, 324044, 355981, 348932, 340512, 382985, 412892, 433574, 423978, 508689, 546291, 492001, 451334, 421003, 463246, 521758, 549404, 489974]
19707D89974l5116K9278P9363O8222q9809k0889J32471P2527N9817J25595J07332
19696A018765K05380K11973O9981O8313J23046J92779K20086L30632K41313K06997
19686B889265J60963J39473K46110L21829L88176M15763O86823R54106J218306
19677G420814J636346K377964L894197O538444J0809973J5447510J5814849M920819
19669F8860916r671355j0778194n006357J469406Q706820J4404157J2611740k31061
19661H0366072p403213k89108O545523L139167j0236411j4990798r685673l033004
19653D4412555L941443J0084648J0854331Q6172j4354551j5405692j0696067p118377
19645B1804462m737722l254304k399323j705051j060046o71793l90412j94189
$$ y = [489974, 454858, 484136, 563499, 631721, 541912, 521023, 653494, 726021, 785838, 911433, 1018765, 1224145, 1436118, 1506099, 1574412, 1697458, 1890237, 2110323, 2440955, 2682268, 2889265, 3050228, 3189701, 3435811, 3757640, 4145816, 4561579, 5248402, 6202508, 7420814, 9057160, 11435124, 15329321, 21867765, 32677738, 48125248, 63940097, 68860916, 59189561, 48411367, 43405010, 44874416, 53581236, 67985393, 80597133, 80366072, 72962859, 72673751, 79219274, 82358441, 72122030, 57131232, 47445559, 44412555, 48353998, 58438646, 69292977, 69379149, 55024598, 39618906, 28922839, 21804462, 17066740, 13812436, 11413113, 9708062, 8648016, 7976223, 7585811, 7391622]
19637G391622j80935j41115p9093P0168P3020J59353K45566M95527P31956J301843
19627A0067912K142159K899023M585783P986665J3112501J8100755J6652647J958591
19619G7506036j2760128j1520408m625386K903358J0655774J5738431J1569241
19612H9466918k487809o653953K188894Q298362J486360j4136566j6734844r842261
19604E1585101k250920N460745J1563236J0366313l411585j6894532j6143859
19597D0274499j1107161p439982n176308l578972k481686j811528j370742r42022
19589F366098p40254o02430m55853l14076k51254l27797k43425k86813l14635
19580B829561k54042k23766k07712k28320q9647j23794j33752j04045q2695j11057
$$ y = [7391622, 7210687, 7069572, 6990479, 7060647, 7133667, 7293020, 7538586, 8034113, 8766069, 10067912, 12210071, 15109094, 19694877, 27681542, 40794043, 58894798, 75547445, 77506036, 64745908, 53225500, 48600114, 51503472, 62159246, 77897677, 89466918, 86979109, 80325156, 82514050, 90812412, 92298772, 78162206, 61427362, 51585101, 49334181, 54794926, 66358162, 76724475, 73312890, 56418358, 40274499, 29167338, 21727356, 16551048, 12972076, 10490390, 8678862, 7308120, 6366098, 5625844, 5023414, 4567561, 4253485, 4002231, 3674434, 3431009, 3144196, 2829561, 2575519, 2351753, 2144041, 1915721, 1826074, 1702280, 1568528, 1464483, 1381788, 1270731]
19570A270731p3720l6592j16830j64945n7432J18740k6374j30117L6948P7p5636
19559G44850j19311l1827j0499M5552J9963j8243N3374l3446K4431m0308j44158
19548D90378m0082N7250R2066O6496O3185l8352k7713j12599j00069o9878K0473
19537D01155N8967L3896o7829m6486L7094o2512n1612j07803j22138L9629P407
19526A19768Q7248M1733M0266N6143r3773j1432j6735r6432k5741k5691K258L3925
19514A11537N9076L792j206P532J1458n7032j5139J20354Q874j40520o0139K5300
19502G3887L1202n4210k3389l9179L6775O4349l8964M2646J0986j10350m9186
19491e5433R2799P2731o811k2566m4419L8617J0446q972K6892o5026k3485J6653
$$ y = [1270731, 1197011, 1160419, 1043589, 878644, 821212, 939952, 913578, 783461, 820409, 820486, 744850, 625539, 593712, 583213, 628765, 648728, 630485, 683859, 650413, 674844, 634536, 490378, 450296, 507546, 599612, 666108, 729293, 690941, 663228, 550629, 450560, 380682, 401155, 460122, 494018, 426189, 379703, 416797, 354285, 302673, 194870, 72732, 112361, 119768, 207016, 248749, 289015, 345158, 251385, 239953, 223218, 126786, 101045, 75354, 77612, 111537, 170613, 174405, 173199, 180731, 192189, 135157, 120018, 240372, 249246, 108726, 48587, 73887, 105089, 50879, 27490, -11689, 25086, 89435, 50471, 93117, 104103, -6247, -55433, 37366, 110097, 103286, 80720, 36301, 74918, 85364, 76392, 103284, 38258, 14773, 31426]
19479C1426o9706J0778K5596O471L4483J6991k3484k8235K090L3146P742p4694
19467b7396l0381J3046M4497l3094r2763q781L6461k842Q5252K3946K6828O0841
19455I5614n8879j33407r8219R7518J45242O5296L2544p9861j31394j5565J3243
19444f7868R3609M1311R510k929j0980K2925N0033k5471q722k2440N1492n7284
19432G3186l9384m9344k326Q8774M6891O7691j2742r4892j0522o0155K9081Q8880
19420A25138Q51k9314n3911o786l2823K1747L7367J36454O2424j08130m7619L5947
19408A41345O1576O560j05462j00716q8897l4657P9816R791O2217J03873O054
19397A41500j8957P2655J247J6008M844r4863l0011k0923P8994O3078j0750M811
$$ y = [31426, -38280, -27502, -1906, 4565, 39048, 56039, 32555, 4320, 6410, 39556, 47298, -27396, -57777, -44731, -234, -33328, -126091, -134872, -98411, -101253, -16001, 7945, 34773, 95614, 36735, -96672, -194891, -97373, 47869, 113165, 145709, 65848, -65546, -81111, -67868, 25741, 67052, 76562, 73633, 62653, 85578, 135611, 110140, 101418, 78978, 130470, 73186, 33802, -15542, -17868, 70906, 117797, 185488, 172746, 77854, 67332, 7177, 36258, 125138, 125989, 96675, 42764, 35978, 3155, 24902, 62269, 198723, 261147, 153017, 105398, 141345, 202921, 209481, 104019, 3303, -85594, -120251, -40435, -30644, 31573, 135446, 141500, 122543, 195198, 196445, 212453, 217297, 122434, 92423, 71500, 150494, 213572, 202822, 207633]
19385B07633m6923l0157J3709j4710n1468j3824j9589R986j7123n115N2932M0965
19373A26316n8408J685j343k4918n7329j6942O0398K6721J6700k5791q4790l4841
19361g2542J11162J19755M0503j02586n4327n6078L7612j6136M421p7060J9864
19350d5412O2930J2427j7405l4752l8369p6485j8412J04935P1396l0894l2885
19339d2926n8211N4277J479L836Q1020M9706k8756j11589n7348M0312j2616K0993
19327e9823m5762m7620R4458K6554L1070J7203l4050q7817l3672J27917R6418
19316H4876m5953k0906J7387m3688r2587j1918R1235P6450j3193J9625j9626o4000
19304b2298l1279P221K3169K092n4127k0033L886m4903O1636J21092M7773N1898
$$ y = [207633, 160710, 130553, 144262, 129552, 78084, 64260, 44671, 54657, 37534, 32419, 85351, 126316, 67908, 69593, 68250, 43332, -13997, -30939, 29459, 56180, 72880, 47089, -37701, -72542, 38620, 158375, 198878, 96292, 41965, -14113, 23499, 7363, 11784, -65276, -45412, 17518, 29945, 12540, -22212, -60581, -137066, -155478, -50543, 20853, -10041, -42926, -101137, -46860, -45381, -41545, 39475, 89181, 60425, -51164, -108512, -68200, -80816, -59823, -105585, -153205, -58747, -32193, -1123, 16080, -17970, -105787, -139459, -11542, 84876, 38923, 18017, 35404, -8284, -100871, -112789, -21554, 54896, 41703, 61328, 41702, -22298, -53577, -46356, -23187, -21095, -75222, -95255, -91369, -136272, -74636, 46456, 94229, 146127]
19292A46127m5866M4890J86494J83942L5040j6893j1245L6356r3296n6168r1478
19281C17903l4990l2552n1951j10529p3369N0508l929n591o6561o0408k4055J06341
19269A0817n8022n1597J12579M9200k9919k5314l6872l3353m1736O8400J2185
19258b3632l0511O307M2653l0493L1856M6892K3930l0832m9546l7782M189k4620
19246g1589R6037Q4030j8567O0825J29063K52155J99413J17883J46952M6556p6155
19235I66603j30627k58104j80160j30978j55359j7635l5281j704m3123q821P2694
19224G7505O8568p7935J4124J611k3993q5623p0774j11164K5984J26024m2086
19213i7759K7834q74N0908N0345K3705k3077k839o5554K0336l1840j6535J14774
$$ y = [146127, 100261, 145151, 331645, 515587, 550627, 533734, 522489, 558845, 465549, 409381, 317903, 282913, 250361, 198410, 87881, 14512, 65020, 61091, 55500, -11061, -71469, -95524, 10817, -47205, -98802, 13777, 62977, 33058, 7744, -29128, -62481, -104217, -35817, -23632, -54143, -47836, -5183, -35676, -3820, 43072, 67002, 36170, -13376, -51158, -46969, -71589, 24448, 108478, 89911, 150736, 279799, 531954, 731367, 849250, 996202, 1042758, 966603, 835976, 577872, 397712, 266734, 111375, 93740, 58459, 56755, 13632, 4811, 77505, 146073, 68138, 82262, 83873, 59880, -25743, -96517, -207681, -181697, -55673, -97759, -69925, -70799, -19891, 30454, 54159, 31082, 28243, -37311, -16975, -48815, -65350, 49424]
19201D9424J15988o9693n4347l2959k1790L4177M8415K5868k1330R8730K13056
19190C85539P8554L4058j1226p0737j16028l7181m3477r6757P2495L8101j29304
19179A04037m9647j7912j9632N0696m7595m1429j4820k7038l0746M268N5887M3178
19167I247k4668k1388J5232m2115j6826P192L5576M8938N0283J1106m4860o0147
19155c2430m0944K1882J40152L3199K6716R2170P5721P1465Q7139N5432j8037
19144E12465r3563P145L4840k6049j172R6509j2629L4592o9779K0455K1720o0249
19132D64285j02469j40310m303N1122J71345J03610l7930p8577q0592k00840o7238
19121G8103Q0156M250j29075j10780m5217m347j9698L0031q837Q3472j5039q28
$$ y = [49424, 165412, 95719, 41372, 8413, -13377, 20800, 69215, 95083, 73753, 172483, 385539, 464093, 498151, 486925, 416188, 300160, 262979, 219502, 122745, 195240, 233341, 104037, 54390, 36478, 16846, 67542, 19947, -21482, -36302, -63340, -94086, -89818, -33931, 9247, -15421, -36809, -21577, -63692, -80518, -73326, -37750, 11188, 61471, 72577, 27717, -32430, -73374, -51492, 88660, 121859, 148575, 240745, 316466, 387931, 475070, 530502, 512465, 418902, 426047, 460887, 434838, 433666, 530175, 517546, 552138, 482359, 502814, 524534, 464285, 361816, 221506, 217203, 268325, 439670, 543280, 505350, 426773, 346181, 145341, 78103, 158259, 162509, 33434, -77346, -122563, -126910, -146608, -116577, -125414, -41942, -56981, -57809]
19109e7809M7774L9843p804j4867m0951J2661J4317L2717k2046L7764K4059j959
19097F3699R5548J71071L8904k8901J0780R7150j3344K2768M2821Q1465m1599
19086E40362j9879o4463l3036O3938o4800j28313j15568L4625K355L4630J25034
19075C74885O3766o3954j88152j06933k2501K2629O5093J5518L899k2095o7888
19064G4267j01880m140K3544K0854o569M9158P2378K3093l369l9119q2798m7147
19052b1728M0116l3884m1439j3240N9410N7123k3233m6761K139K9267P667j1826
19040C611J4008k2929J2139Q0487L5243n1082j34100o0612M0429M2348J1644n027
19028c3841M971j1767J4499M4401J5405q83j9778m1448m6532L7898R70K3761Q96
$$ y = [-57809, -10035, 29808, 22004, 7137, -33814, -21153, -6836, 25881, 3835, 41599, 65658, 63699, 159247, 330318, 369222, 340321, 351101, 448251, 434907, 457675, 500496, 581961, 540362, 520483, 456020, 422984, 486922, 422122, 293809, 178241, 212866, 215221, 249851, 374885, 438651, 374697, 186545, 79612, 57111, 79740, 144833, 160351, 164250, 142155, 74267, -27613, -31753, -8209, 12645, 6076, 55234, 127612, 150705, 147336, 108217, 25419, -21728, 18388, -15496, -56935, -70175, -10765, 46358, 23125, -23636, -21497, 7770, 15437, 3611, 17619, -5310, 6829, 87316, 122559, 71477, -62623, -123235, -82806, -40458, -28814, -33841, -28870, -40637, -26138, 18263, 33668, 32785, 13007, -28441, -74973, -37075, -36105, -12344, -11448]
19015a1448K1033M4192N5534L6946K5808p8955q1170n1977o435n8125R9966J21276
19003A16645k2439Q73K8755P8352O1k4906j4479N3476j3221j8632N640o9661m967
18990A15497K436n3310l4839n5522L7932K2836r3952L6794P7879n7024l2619N6618
18978B2726O9692n8309j2408m5577j268Q1856p5864n4515M7841K9270K9830J1892
18966D5166p9996o8877m2919q208M1855Q4939j3763n9001R5670Q6680N3429L0924
18954A65899n3065n3899K475M0599K2390p0348m4340j0006k0756m1388l9129r293
18942a10861M5579P4070L7907Q9054q679j59938l1315P2256j3423K9346L3249
18931E7245P131j6725O5343M8623k5377l9695R003L3426j31387l2870M4341K606
$$ y = [-11448, 9585, 53777, 109311, 146257, 172065, 93110, 11940, -40037, -46472, -104597, -4631, 116645, 94206, 95079, 123834, 202186, 202247, 177341, 162862, 216338, 203117, 184485, 190125, 120464, 115497, 117933, 64623, 29784, -25738, 12194, 35030, -58922, -22128, 55751, -1273, -33892, 22726, 92418, 34109, 21701, -23876, -25144, 56712, -19152, -73667, -25826, 3444, 33274, 45166, -34830, -103707, -146626, -154834, -112979, -28040, -41803, -100804, -5134, 81546, 134975, 165899, 112834, 58935, 61410, 102009, 124399, 54051, 9711, -295, -21051, -62439, -101568, -110861, -65282, 8788, 46695, 135749, 127070, -32868, -64183, 8073, -5350, 23996, 57245, 64376, 47651, 112994, 161617, 136240, 96545, 105548, 138974, 7587, -25283, 19058, 21664]
18919B1664l6975j0600L6245m4908k0698m8839L9422J00692N4550L544n1824m1575
18907F98k1019J03369M3800M7530P2795R783n3810M1346M4123m4058k9277k2427
18895A92853k5428m8930J6715Q2570P1628N7917N6084K330J22308Q1536L4731
18884F44314l0808m303l7204m5803n0312q8173r7848m4279k3230l4893m8100K0190
18872A59551K4299N1775k9527O612l8542n8072r13J4076K6169M5695j0742j03868
18860H6513o1810k9083J08052N1027M5783Q8367Q6488n6203p4716k3249N7452
18849B78621M2512r836Q4487N998l5347J7532K05232J04393O8579K8907J02856
18838H93934J00810M5578j05569p9954R107p9609m6305j5036o6060m1152q3581
$$ y = [21664, -15311, -25911, 10334, -34574, -55272, -104111, -64689, 36003, 90553, 94097, 42273, 698, -20321, 83048, 126848, 174378, 247173, 256956, 203146, 244492, 288615, 244557, 215280, 192853, 167425, 118495, 135210, 217780, 289408, 347325, 403409, 405739, 528047, 609583, 644314, 613506, 609203, 571999, 526196, 475884, 387711, 289863, 245584, 222354, 187461, 139361, 159551, 183850, 235625, 206098, 212710, 174168, 116096, 115183, 129259, 155428, 201123, 190381, 86513, 24703, -4380, 103672, 154699, 200482, 288849, 375337, 319134, 244418, 221169, 278621, 321133, 311297, 395784, 401782, 366435, 383967, 589199, 693592, 762171, 791078, 893934, 994744, 1040322, 934753, 854799, 863906, 784297, 737992, 722956, 656896, 615744, 532163]
18827E32163j20023k2923K5620Q429N8158j6769n6915k0413m4546K9891r0937
18816B81735j7282J5940j9874l3251p0129N9568J04908M6026Q2672O7124J9490
18805E36927Q1273J27189J90932K30522L63876K95952J97776J78870Q9247P9569
18795B372133M7431n7107o4136j05145R0891J35710J63492K18719L87366M52240
18785C641594N95261P35983R69398J200775J761912K729367M051530O081890R936177
18776C1703887J6167630K2278547K1554154P699212o63528K307803n909002k1343776
18768G3794927k1018041j4418181r575120o919125m954258l495623k504013j931886
18760H978680j463875j055605q21071n32068l29027k78619j25461L5410J81679
$$ y = [532163, 412140, 389217, 414837, 423266, 481424, 464655, 407740, 387327, 342781, 372672, 281735, 264453, 280393, 260519, 227268, 157139, 216707, 321615, 367641, 450313, 517437, 536927, 618200, 745389, 936321, 1166843, 1530719, 1826671, 2024447, 2203317, 2292564, 2372133, 2419564, 2362457, 2298321, 2193176, 2284067, 2419777, 2583269, 2801988, 3189354, 3641594, 4236855, 4972838, 5942236, 7143011, 8904923, 11634290, 15685820, 21767710, 31703887, 47871517, 70150064, 91704218, 99403430, 98739902, 101047705, 95138703, 73794927, 52776886, 38358705, 28783585, 21864460, 16910202, 13414579, 10910566, 8978680, 7514805, 6459200, 5638129, 5106061, 4777034, 4498415, 4372954, 4408364, 4590043]
18751D590043M34691N80296L53687K20549p7887j30208k18657m50632l81896j92936
18741D727050q633J77179L11282L72465N91908P49035J045248J480435J956097
18732A1402066K732423L855356N559604Q210134J2869916K1354293L3468945M2505878
18724A41958615L3946630O135828o5044K933323k0370428m2732698l5747034k4074873
18716F1984319j5990623j0906710p630513n559248m167816l259392k415021j773444
18708A0281552j402416r74942o15696n01924n01158k92266m3780K17678L03138
18699F470186J76741K17976m046l45271o60307o12383n61903m19156k50794j37971
18689C873072r0084N0574J95006L21800M82054P09280R38858J358412K056235
$$ y = [4590043, 5024734, 5605030, 5958717, 6179266, 6101379, 5971171, 5752514, 5301882, 4919986, 4727050, 4718417, 4895596, 5206878, 5579343, 6171251, 6920286, 7965534, 9445969, 11402066, 14134489, 17989845, 23549449, 31759583, 44629499, 65983792, 99452737, 141958615, 175905245, 182041073, 181976029, 184909352, 164538924, 121806226, 86059192, 61984319, 45993696, 35086986, 27456473, 21897225, 17729409, 14470017, 12054996, 10281552, 8879136, 7904194, 7288498, 6786574, 6285416, 5993150, 5949370, 6167048, 6470186, 6646927, 6864903, 6860857, 6515586, 5855279, 5242896, 4680993, 4261837, 4011043, 3873072, 3782988, 3833562, 4028568, 4350368, 4832422, 5541702, 6480560, 7838972, 9895207]
18680I895207K829915M141594O784384J1403021J7113303J9874252J2493656K46765
18672H4782097J007524j82391j3868809j9861913j4656588r665864o483187m605935
18664A6464934l425820k537380j955941j533434j290449r70903o43991m68198
18656C638818l17423k74925j92200j11452j20524k4773n9955l5428n1357j31104
18646B319677j05207j33114k42515k78274j49238j5156n5134p6166j7657M6600
18636A293816J61962O68j47776j51966j74552j43508n2917l9017J9946M4865K7329
18625H38850r941q4646j54278j01944K6838L2443k7823L6126K2522k594m6471
18614E29082l3311l266P5537l0633L2848L4617n0398o3630p2700n2713M961K376
$$ y = [9895207, 12725122, 16866716, 23651100, 35054121, 52167424, 72041676, 84535332, 84782097, 85789621, 85607230, 71738421, 51876508, 37219920, 27554056, 21070869, 16464934, 13039114, 10501734, 8545793, 7012359, 5721910, 4751007, 4107016, 3638818, 3321395, 3046470, 2854270, 2742818, 2622294, 2597521, 2537566, 2502138, 2450781, 2319677, 2214470, 2081356, 1838841, 1560567, 1411329, 1396173, 1341039, 1264873, 1247216, 1293816, 1455778, 1456446, 1308670, 1156704, 982152, 838644, 785727, 746710, 766656, 811521, 838850, 828909, 744263, 589985, 488041, 514879, 547322, 519499, 555625, 578147, 575553, 529082, 495771, 492505, 568042, 537409, 570257, 604874, 554476, 490846, 418146, 365433, 370394, 372770]
18602C72770j1965N4717k2034M5657P0009k4566m5818j02765p7715O3667O2821
18591C84778r8867p5807j7910P8177Q59R397j0536m7821R8275J9845Q101m2451
18579C06040q2094O0249K3618k4796M4583m9412l5378n1021o1540L3179L5338
18568A98766J7510j6767K2536j2299m9522N7346k119Q8334N9775o3716L7889K6347
18556C64080p127q8566R0147Q48k0177o6470J1405Q6044q2290q2933l9426L964
18544A69499J02486j5603L3883J8066n1838k6891m5864n3146k7754l4808n6971
18533A1059o155n1024P2957M5291j26874m3557L5772k720J00Q9627J4518N5773
18521I4767P2665K5867J0296K8147l1404m9059m101l7999n4839N294P0201N1998
$$ y = [372770, 360805, 415522, 393488, 439145, 509154, 484588, 438770, 336005, 258290, 321957, 384778, 285911, 210104, 192194, 270371, 271230, 280627, 270091, 222270, 320545, 340390, 348491, 306040, 223946, 284195, 307813, 283017, 327600, 278188, 242810, 191789, 130249, 163428, 198766, 216276, 199509, 222045, 209746, 160224, 217570, 215451, 303785, 363560, 299844, 337733, 364080, 356953, 268387, 358534, 359382, 339205, 272735, 284140, 370184, 287894, 204961, 165535, 169499, 271985, 256382, 290265, 308331, 256493, 229602, 183738, 130592, 102838, 68030, 11059, 4904, -46120, 26837, 72128, -54746, -98303, -62531, -65251, -65151, 24476, 38994, 94767, 167432, 193299, 203595, 231742, 200338, 151279, 147178, 109179, 54340, 59634, 129835, 181833]
18509A81833P9976q6328r6990k3397O98l3396M5558k938k7363J05812N6965q4894
18497A15536o9365l0573m3748J8033J15584j2028j31327P3862Q9666N2007O9907
18486B47554j10706o8241n7587R103n2819o2540N2159K6206L7731J2439K2034
18475E5333M9836K7938k6855m5922q6498m5268q447L0971L9087l1004M5866l6498
18463c1461o3404m5028L1061J3206J07035j0028L4361j1092N6565j1587n2681
18452A6947n6036j4032O3750L7362k6115j40817k719J14238O5731o0366q4631
18441h6688J3385q8363N94J23013N2207J8803J4324n411l6040J2332N1475q0766
18429a1135p8584O1077M9883m072K3296J18090l2614k3035L0704k0254J8583L7131
$$ y = [181833, 261809, 175481, 78491, 55094, 55792, 22396, 67954, 65016, 37653, 143465, 200430, 115536, 46171, 15598, -28150, -10117, 105467, 93439, -37888, 35974, 125640, 177647, 247554, 136848, 68607, 11020, 20123, -32696, -95236, -43077, -16871, 20860, 33299, 55333, 105169, 133107, 106252, 60330, -26168, -71436, -79883, -48912, -9825, -40829, 5037, -31461, -94865, -139893, -108832, -95626, 11409, 1381, 35742, 24650, 81215, 69628, 16947, -39089, -53121, 10629, 47991, 21876, -118941, -121660, -7422, 58309, -2057, -86688, -73303, -161666, -161072, -38059, 14148, 32951, 47275, 41864, 5824, 18156, 69631, -11135, -89719, -28642, 21241, 17169, 40465, 158555, 125941, 102906, 133610, 113356, 131939, 169070]
18417A69070q3295l0186J1055J9604K3748l0713k9239J4084m0004J3432o7766
18406c0210M0190L9103M5561L4842j08930j4371l6256l3131m0264Q9058J21069
18395A06661N7453l4224j6723J7235M0007M6945L1359q2210l8561j2150L1756
18384A47548J3061J6858j7240k1935p8147k3046M8023j3866j13952K1220M4498
18373B3022m8757o9388O4391J2351j2618j4229o9009R4418M3297M3687k2911L6898
18361H1152J38036K1585p1613n6503o9748L0714L1063k3951m8519o9188M058j2614
18349d5528l0647j7161K0097N0558K5708L1731N8217k4291k3701k6396k9669m2293
18337e3375k834j9785k4880M797P6728J1406p0826J5166L9796M2519n0435j2014
$$ y = [169070, 85775, 55589, 66644, 86248, 109996, 79283, 50044, 64128, 24124, 37556, -30210, 9980, 49083, 94644, 129486, 20556, 6185, -30071, -63202, -103466, -14408, 106661, 164114, 129890, 113167, 130402, 170409, 217354, 248713, 166503, 127942, 115792, 147548, 160609, 177467, 160227, 138292, 60145, 37099, 85122, 71256, -42696, -21476, 23022, -25735, -95123, -30732, -18381, -30999, -45228, -114237, -19819, 23478, 67165, 44254, 81152, 219188, 240773, 169160, 112657, 42909, 73623, 104686, 80735, 32216, -36972, -32914, -45528, -76175, -93336, -73239, -22681, 3027, 34758, 92975, 68684, 44983, 18587, -11082, -53375, -56209, -75994, -100874, -96077, -19349, -7943, -78769, -63603, -23807, 18712, -31723, -43737]
18325d3737j1789J5931K6030k8002Q7824M078J6809m6829m2375J4832o8770R4616
18313A8618K7380l7293O3390O3154k7774m4839k3476m8610p3754l1087K1372O0093
18301c2826M7043O7979L6984j3657P4402N1784l0223R348k6884q5268n7276J9702
18289F1108l448J8711J2158K7425r1592n9126P1399R2188m4003J3817l1119j2407
18277E5111M2160k7132o4687L9644l013l9675J8265N5163R9927P5079M4509L5400
18265C30751j9357J4578J0004p8990k9204N311m9912p7625R297R0174j7105K1862
18253B09784J00919J15991P6332o272M3096n0837p2270m4985j2527n6724j9015
18242B83492k4423J8569K1289r2339r2609n4912J22920Q1237o9581O010N4063
$$ y = [-43737, -55526, -39595, -13565, -41567, 46257, 50335, 67144, 20315, -22060, -7228, -75998, 18618, 45998, 8705, 72095, 135249, 107475, 62636, 39160, -9450, -83204, -114291, -92919, -32826, 14217, 82196, 119180, 105523, 179925, 231709, 201486, 210834, 183950, 98682, 41406, 61108, 57660, 76371, 88529, 115954, 24362, -34764, 36635, 128823, 84820, 98637, 67518, 55111, 97271, 70139, 5452, 45096, 42083, 2408, 20673, 75836, 175763, 250842, 295351, 330751, 311394, 325972, 335976, 256986, 227782, 233093, 183181, 105556, 114853, 205027, 187922, 209784, 310703, 426694, 503026, 496754, 539850, 489013, 416743, 371758, 359231, 302507, 283492, 259069, 277638, 298927, 206588, 113979, 59067, 181987, 263224, 193643, 199653, 253716]
18231B53716l5804q8677M8683k6424J46j2680j32348J0509J83951K8276k7782
18220B01566k9107n1279R4417Q0062O534K6815L1148n5482M842j982l7502L9190
18208C09222K2609M0817M2900K16491K86913K60538K34173Q9544M3255R595k17961
18197A338096l31439k16107J1315L7276J37978J42001J52481p280j07539k1160
18187A135622J45724K25631K31184P1413O4881K35028L80920M70289N74329P62079
18177D297100R36785J156845J732964K226866K819717M014479O434331J1109507
18169C4728594J8854504K8661684L3329416J8423972j5010857l1447183k6001350
18162F1538780j7662553j1666128p814459n134916l382043k163056j327645r56487
$$ y = [253716, 217912, 129235, 177918, 151494, 151640, 138960, 6612, 17121, 201072, 229348, 201566, 172459, 121180, 215597, 295659, 302193, 329008, 360156, 304674, 309516, 307534, 270032, 309222, 331831, 372648, 415548, 632039, 918952, 1179490, 1413663, 1503207, 1546462, 1556057, 1338096, 1006657, 790550, 801865, 839141, 977119, 1119120, 1271601, 1264321, 1156782, 1135622, 1281346, 1506977, 1738161, 1809574, 1874455, 2109483, 2490403, 2960692, 3535021, 4297100, 5233885, 6390730, 8123694, 10350560, 13170277, 17184756, 23619087, 34728594, 53583098, 82244782, 115574198, 133998170, 118987313, 87540130, 61538780, 43876227, 32210099, 24395640, 19260724, 15878681, 13715625, 12387980, 11431493]
18154A1431493q24972o81669m60280j71906J82332M68586P01608J181884J671023
18145A3498099K342388L320642M259907N532143Q588802J4658594K5080081M1194534
18137A18475190N9106571O0553275J9642815m1918958o0331716m6398336l1202290
18130G7926551k0708594j3756120r107031o118174m029907k813377k272977j993415
18122A7126956j683045j040344m25150J65922O92987J374613K381614L634873
18114B2228426N615461R292515J6288552K9570659M9819622O5465819M7232572
18107B45513626j6738515k5454668q716918k0443467m0226374l8590846k7283209
18100F8059629j8119469j2140101q370603n818103l969697k711831k099082j929006
$$ y = [11431493, 10606521, 9924852, 9464572, 9292666, 9474998, 9943584, 10645192, 11827076, 13498099, 15840487, 19161129, 23421036, 28953179, 37541981, 52200575, 77280656, 118475190, 177581761, 238135036, 257777851, 215858893, 155527177, 109128841, 77926551, 57217957, 43461837, 34354806, 28236632, 24206725, 21393348, 19120371, 17126956, 15443911, 14403567, 13978417, 14144339, 14837326, 16211939, 18593553, 22228426, 27843887, 37136402, 53424954, 82995613, 132815235, 198281054, 245513626, 228775111, 203320443, 194603525, 174160058, 133933684, 95342838, 68059629, 49940160, 37800059, 29429456, 23611353, 19641656, 16929825, 14830743, 12901737]
18092A2901737j708617j454256j262751j140936q87605p31100o26561n91331m63553
18083D035027l41567l37639k12142j21954j42864k12482p5478n1056n6963j23387
18073B359495j54066m5390n1127j25247r5525k0774p3015j5096n4118m3992j3445
18062A667700M2245J33716J88120K27481J81151J94015J35486j01515j64648j31856
18052B371895r1303P4309p6815j87578k14124k51672j02013l5347j33466j85408
18042A168478j27054l2520n1285m3668p7074p8690l1418j0583m8091p8231M4099
18031F33963M1977n2583j13391L7508M5370K8954R711l7018Q925L8425q4192j12467
18019D45182M0031N2446L2524K3839j8484n028K5246o7255q9570p3328j4574m68
$$ y = [12901737, 11193120, 9738864, 8476113, 7335177, 6447572, 5716472, 5089911, 4498580, 4035027, 3693460, 3355821, 3143679, 3021725, 2878861, 2666379, 2590901, 2539845, 2482882, 2359495, 2205429, 2160039, 2108912, 1983665, 1888140, 1867366, 1794351, 1779255, 1725137, 1681145, 1667700, 1709945, 1843661, 2031781, 2259262, 2440413, 2634428, 2769914, 2668399, 2503751, 2371895, 2280592, 2354901, 2278086, 2090508, 1876384, 1624712, 1522699, 1487352, 1353886, 1168478, 1041424, 1008904, 957619, 913951, 836877, 758187, 726769, 716186, 668095, 589864, 633963, 675940, 623357, 509966, 547474, 592844, 621798, 631509, 594491, 603416, 641841, 557649, 445182, 485213, 537659, 570183, 594022, 575538, 570510, 595756, 528501, 438931, 365603, 351029, 350561]
18007C50561K3023J00467k0110k2817J15382K32151P0669j2421J68833J44800
17997A150538J82117J19144J90341K56480J93053J70622J24091K35164Q6301P91
17987B708642O1499J17421O1045k9630q3278k36855k74437k59111l19153l18651
17977A427492k01010j06940o7289j17003n3907k873q6014j20752m4222J3133N490
17966F46105J7807l2813o8620p5539m4291P315j2961Q2258O4397l6504j02974
17955D44180M1147J46836J04296M1743N7826P7601O1014L2171P5786J07255N7327
17944A247182k0325J08050J56898J07285k8128r7003l5287j954R5634L7570l0504
17933A539418j23690k14082j99440l26837j17664M4957j7389p1915p3034o0093
$$ y = [350561, 373584, 474051, 453941, 431124, 546506, 778657, 849326, 836905, 1005738, 1150538, 1332655, 1451799, 1642140, 1898620, 2091673, 2262295, 2386386, 2621550, 2707851, 2708642, 2770141, 2887562, 2948607, 2918977, 2835699, 2598844, 2324407, 2065296, 1746143, 1427492, 1226482, 1119542, 1052253, 935250, 881343, 878470, 792456, 671704, 627482, 640615, 646105, 663912, 631099, 562479, 486940, 442649, 449964, 437003, 519261, 583658, 547154, 444180, 485327, 632163, 736459, 778202, 836028, 913629, 974643, 1006814, 1082600, 1189855, 1247182, 1226857, 1334907, 1491805, 1599090, 1570962, 1473959, 1438672, 1436718, 1532352, 1569922, 1539418, 1415728, 1201646, 1002206, 675369, 557705, 602662, 585273, 513358, 440324, 380231]
17923C80231K3729q5415M239l0951k7429J3627m0665l2248l9533O9676L0340l7839
17911B27762n1938K3554Q0364l4579j3725M5975j3892n2083m178p9306o2779R6799
17899A61974Q1110M416k7659j19057L4562N5446O0257j707j5118K4525K512m6902
17887B14359o0236J1579J03305N5321p1501L797p044k4825q0818q9837n3659J27661
17875A28102M2579o450l6851L748j0326k2237M063k6897l7226k5823M4959l5781
17863B1860P4902n849o504L0448n850k6856K1888j9990o561l5100J7336M5720
17851A05444j6472j863m3425m0053l0367q1598K7547P9842J6494j02808p1866
17840a59125l1461O9567L194j09867K1229R7879J01847L8020l4110l5516n2278
$$ y = [380231, 403960, 318545, 322784, 291833, 264404, 278031, 237366, 205118, 165585, 235261, 265601, 227762, 175824, 199378, 279742, 245163, 231438, 277413, 263521, 211438, 207260, 127954, 65175, 161974, 243084, 247500, 219841, 100784, 135346, 190792, 251049, 249342, 234224, 258749, 261261, 214359, 154123, 165702, 269007, 324328, 252827, 256624, 249580, 224755, 143937, 54100, 441, 128102, 170681, 164231, 127380, 131128, 120802, 98565, 102628, 75731, 38505, 12682, 57641, 21860, 96762, 90913, 84409, 114857, 109007, 82151, 104039, 84049, 77488, 42388, 59724, 105444, 88972, 87109, 43684, 3631, -26736, -108334, -80787, -945, 15549, -87259, -159125, -190586, -121019, -117825, -227692, -206463, -108584, -6737, 31283, -2827, -38343, -90621]
17829i0621l6928R1396P1629Q8954j2908j1706j6037o1184k8472n33J21144P6781
17817A91515k1862j12710l5926L2377l3132N5161k197r171N024l9464j4676K9453
17805D4392L1744P954m651k2409j6054M6155q3L7412j11294o0000O6744j1758
17793H152o6230O2114J18742n9804n1111M410J0941K3453q5231p3046J5273Q1948
17781a0389K9927n4804n1675N1695P1067Q2492K5216r1765j36587L0878J29728
17770G5783k1928q6880P341P0513J4500o796j2346n4998O1931L6884Q011j09853
17758a7838l4729K3293p7416l2092R3059m2995p4370J13528J11922j3034o7209
17747a7881p146j9851j6102j17685L6024P2242K7516P6067J1926k2836J7806J4833
$$ y = [-90621, -127549, -36153, 35476, 124430, 111522, 99816, 83779, 22595, -5877, -6410, 114734, 191515, 169653, 56943, 21017, 53394, 20262, 75423, 73226, 64055, 69079, 29615, 14939, 44392, 76136, 84090, 79439, 57030, 40976, 87131, 87048, 124460, 13166, -46834, 19910, 8152, -58078, 4036, 122778, 62974, 11863, 16273, 27214, 50667, -34564, -107610, -92337, -10389, 19538, -35266, -86941, -35246, 35821, 118313, 143529, 51764, -84823, -53945, 75783, 53855, -33025, -25684, 44829, 59329, 52533, 40187, -14811, 47120, 84004, 92015, -17838, -52567, -29274, -106690, -138782, -45723, -88718, -163088, -49560, 62362, 49328, -17881, -25027, -44878, -60980, -178665, -142641, -70399, -42883, 33184, 45110, 22274, 40080, 54913]
17735E4913n7180p0802k5482m1842M1189N0841L2605Q7785r1657n1285L1137O0176
17723B0398k0521l4219n8813j8426K6873J902r476k4773R2363Q684o982J166m1556
17710f3380q1210P3781L7366N1304o0324M73K7653J4775n6670L711L5691P6372
17698E9542n1235j9985l8333K942k7455R7728K1928q3118j04717j0526P471j185
17686a46943N5127O7573L4653M449M0400j7078L0072P5044m4462o1541o8873p6320
17674a07899j6949o895O4917O6817O5919l7923n0982J29768l1542j38573j30731
17663a94073K1508Q5335M7303j4816n675o4188j2959j179n9082m2316o3716J20760
17651a83098Q2332m3200K2845P6586O1644J11186l3325r1768l888M3896L5731
$$ y = [54913, -2267, -73069, -98551, -140393, -99204, -48363, -15758, 72027, -19630, -70915, -39778, 20398, -123, -34342, -93155, -111581, -84708, -82806, -92282, -117055, -24692, -16008, -22990, -21824, -63380, -144590, -70809, -33443, 17861, -42463, -41990, -14337, 438, -56232, -52521, -16830, 59542, 8307, -11678, -50011, -47069, -74524, 23204, 45132, -37986, -142703, -153229, -145758, -146943, -91816, -24243, 10410, 14859, 55259, 38181, 68253, 143297, 98835, 37294, -31579, -107899, -124848, -131743, -66826, -9, 65910, 27987, -22995, 106773, 75231, -63342, -194073, -172565, -87230, -39927, -54743, -60418, -124606, -137565, -138744, -197826, -240142, -303858, -183098, -100766, -143966, -121121, -44535, 17109, 128295, 94970, 3202, -686, 43210, 78941]
17640G8941k5379n2645n3273k5614N6352L0678K4488N1898M4143J23266J11653
17629C64508J42697J38978M039j82473j40300r0635j17763r5672m3827J9246o568
17618g770j7681k8543p1884M1455O0992K9989R827O7960P3012q5584L5985J2859
17606A20617n0835l9833J6686R4366O2957K9475K14760K85271J85948J94090P056
17595A120558k00897k72690j58906j43733j48685l0989N3584J1506j05540o0486
17585F3722m3286k6450P6195J6340l3593l8657K6707K8115m060L2964k4551m0359
17573C3087J2430j3638K5347J07490J99398K06494J34423k8712j76064j63874
17563C36381j66029r8661n2033j7669l6146K2258O5202K5929k4969N3049k631
$$ y = [78941, 53562, 917, -52356, -77970, -21618, 9060, 33548, 85446, 129589, 252855, 364508, 507205, 646183, 650222, 467749, 327449, 236814, 119051, 23379, -20448, -1202, -7770, -25451, -53994, -125878, -84423, -23431, 6558, 16385, 84345, 157357, 71773, 107758, 120617, 69782, 29949, 46635, 141001, 203958, 233433, 448193, 733464, 919412, 1113502, 1120558, 919661, 646971, 488065, 344332, 195647, 164658, 218242, 229748, 124208, 63722, 20436, -6014, 70181, 86521, 52928, 14271, 40978, 69093, 65033, 97997, 73446, 33087, 45517, 31879, 57226, 164716, 364114, 570608, 705031, 676319, 500255, 336381, 170352, 71691, 19658, 1989, -34157, -11899, 53303, 79232, 54263, 107312, 104681]
17552A04681P142p8763o5059l8785p356l5224P374N1944J7056L5545J2048M5208
17540E5811k5747p7687p6906n3490J11525P0848l0645n8851L4102k6500j02627
17529a80167l5822Q481L5857N0557K0680K5659O0970J30895R454J6349n0150q4699
17517H064o5045j0752J6130l9791P117j8825O9929N7696L9876m737r6445o3140
17505i9923O1293J02868l2133n1140p8467n7859O8153L1171m5052R047J55l6132
17493a28019K532M745J04479J5529m5474L0627q184j27327n7936j0791Q1647J0019
17481a28153k4397J08186j7730l8152j7537J8390K4723m7045L6410K7377o320
17470f4248L350j2507R2574n0537l5497K3211L0461O3590L0773J3683m896k1887
$$ y = [104681, 111823, 33060, -31999, -70784, -78140, -113364, -105990, -54046, -36990, -1445, 10603, 55811, 30064, -47623, -124529, -178019, -66494, 4354, -26291, -85142, -51040, -77540, -180167, -215989, -207508, -171651, -121094, -100414, -74755, -13785, 117110, 126564, 142913, 92763, 8064, -56981, -67733, -51603, -91394, -84277, -103102, -33173, 24523, 64399, 59662, -36783, -99923, -38630, 64238, 32105, -19035, -97502, -155361, -87208, -56037, -101089, -92042, -91887, -128019, -125487, -120742, -16263, -734, -46208, -15581, -23765, -151092, -209028, -219819, -138172, -128153, -152550, -44364, -62094, -100246, -117783, -99393, -74670, -121715, -85305, -57928, -64248, -60898, -73405, 19169, -31368, -66865, -43654, -13193, 50397, 81170, 94853, 89957, 68070]
17458F8070n8650l6490k5787q997K2391r942o4571n7760j9556P5434J35831P5954
17446I5927J29164K00346J78789K50126K60127j27165l52760k49135r2104K1074
17436C14389q9700j25036r5250n9190L3909O0753m7521l5602m4028p77R1370P5988
17424G9305q4070n5854N5030l2497n4995L1000K9483L1137L1013q6208Q460l8030
17412h6226J8089j7505m958N8559J7179j4834r970L5363N5418O3009j33289p7138
17400i6303L1644J1683o312O5065j0501p3959O7150P0189K8906L797j12756p3681
17388i5078M6231J0207O84j08631J1236O5658j6192j3168N1934K9377l7121m7858
17376a02721M9988M091N1149K5389l333m5447M9791N440o2570L4755J5017l8083
$$ y = [68070, 9420, -27070, -52857, -61854, -39463, -49405, -113976, -171736, -191292, -115858, 19973, 95927, 225091, 425437, 604226, 854352, 1114479, 987314, 634554, 385419, 293315, 314389, 224689, 99653, 4403, -54787, -20878, 39875, -7646, -43248, -87276, -88053, 3317, 79305, -4765, -60619, -5589, -38086, -93081, -62081, -32598, -1461, 29552, -56656, -48196, -86226, -68137, -85642, -90600, -32041, -14862, -29696, -39666, -4303, 51115, 114124, -19165, -96303, -64659, -52976, -59288, 5777, -4724, -78683, -11533, 58656, 87562, 91359, -21397, -95078, -48847, -38640, -37956, -146587, -135351, -69693, -85885, -99053, -47119, -17742, -54863, -102721, -52733, -48642, 2507, 27896, 24563, -20884, 28907, 34347, -28223, 6532, 21549, -16534]
17364a6534j3803J5385L1770l2872o6039r756j4206N3984Q0358J5341K3585k7306
17352C9907N0571j3877r144j8497q9056m2134j4636j998K5829k8623k9270p134
17340a38062L2351K5611q8440k6929L133m3233K3764O4644M8601j2110J17493
17329F823J13226o1013n4329n5542J4059R7803j3824L3761K0056k3433M9478q3786
17317D3279p715N9360l9480R849N9405r2393M6470N1380j07852K1606K2377J8358
17305H4644l4518m9663o727K9695l9N1776m7357k4654O4399M5127k5409j46468
17293e9194n5909K1837R222J2699o2496M161L679k795Q1950J0306m3556L8837
17281d1259K0313n783M9014k9521p897P3025L4559m2888p1462n8314k2539M6313
$$ y = [-16534, -30337, -14952, 16818, -16054, -82093, -91849, -106055, -52071, 28287, 43628, 67213, 39907, 90478, 76601, 67457, 48960, -40096, -82230, -96866, -98864, -73035, -101658, -130928, -138062, -105711, -80100, -168540, -195469, -192336, -235569, -211805, -147161, -98560, -110670, 6823, 120049, 59036, 4707, -50835, -36776, 61027, 47203, 80964, 101020, 77587, 127065, 43279, 35564, 94924, 55444, 65293, 124698, 32305, 78775, 130155, 22303, 43909, 66286, 84644, 50126, 463, -6264, 23431, 23392, 75168, 27811, 3157, 67556, 112683, 87274, -59194, -115103, -93266, -84044, -71345, -133841, -129680, -126001, -128796, -46846, -36540, -80096, -41259, -20946, -26729, 22285, -7236, -15133, 57892, 92451, 49563, -21899, -80213, -102752, -56439]
17269e6439k3135m9314J05591K0370j4401O322m8399k6222j8015n8630n1508K4995
17257a88785M2642J20775j7381m1901K537M6423J5665n1885k5476l5998q970M045
17245a38309P5984N0492K0575k5690J8173n6085p3839r715l7307m4429J1923P8823
17233a29404j2404Q5806Q6451O1207k5230j55725j2378P1268L7261K0380l4595
17222g363p520k2905J3944l6759k4768J5417q325q2383l3775R8546P1075k0085
17210d4901j9073M0609l860M528P9559N7932r3517o8495P0785n5999l4543k6365
17198i3340q813O3560P0863R7499m6285j41204q0495M32N1698O7868o4056k3479
17186a05752j7099r890m7919j395l4779m3473J36197M2711k4640O148Q7200M962
$$ y = [-56439, -79574, -128888, -23297, -2927, -17328, -11006, -59405, -85627, -103642, -162272, -213780, -188785, -146143, -25368, -42749, -84650, -82113, -35690, -20025, -71910, -97386, -133384, -142354, -138309, -62325, -11833, 8742, -16948, 1225, -54860, -128699, -138414, -175721, -220150, -208227, -129404, -141808, -56002, 30449, 91656, 66426, -89299, -101677, -30409, 6852, 27232, -7363, -14883, -37788, -23844, -60603, -85371, -69954, -78279, -160662, -194437, -95891, -24816, -44901, -63974, -23365, -27225, -22697, 56862, 114794, 21277, -47218, 23567, -32432, -66975, -93340, -102153, -38593, 32270, 129769, 83484, -57720, -138215, -137783, -86085, -18217, -82273, -105752, -122851, -132741, -180660, -182055, -216834, -260307, -124110, -81399, -106039, -99891, -12691, -7729]
17174g729L8834q512j0448p1178o1581j10332M8555K0797J21492Q7875j22134
17163g4361m0629L8722L464L7410N6419j013M3328K4379J4975l5971m3118j4316
17151I289K2203m9891n622J9011k0029m3149r2552N9832M2372o378L3306O2201
17139C0593K8870n8922j43472l9424Q0673O4086q1486K0135P1504J8171m5010
17128e4282l4236K0398J5530n8443L6493Q5891L3168p6176K0891K0886j0541j56
17116e77j11853j0841j1757j414L7562L6760J7207n1659J8544O7186M7283m2977
17104f536l7880K1844l3243k0779O5610J944K0580k5193P7399K9770K577k0741
17092G5352q5779q346O84j1781O4659P6192j1917m9450l7933j9453l0770n2462
$$ y = [-7729, 31105, 22593, 12145, -59033, -120614, -230946, -182391, -161594, -40102, 47773, -74361, -114990, -76268, -72804, -35394, 21025, 20012, 63340, 87719, 102694, 66723, 23605, 9289, 31492, -18399, -24021, -5010, -25039, -68188, -160740, -100908, -58536, -64914, -31608, 30593, 59463, 541, -142931, -182355, -101682, -37596, -119082, -98947, -27443, -9272, -54282, -88518, -68120, -52590, -111033, -74540, 11351, 44519, -31657, -10766, 10120, -421, -577, -112430, -123271, -135028, -136442, -98880, -62120, -44913, -96572, -78028, -10842, 36441, -6536, -44416, -22572, -55815, -76594, -10984, -9040, 11540, -13653, 63746, 93516, 96093, 75352, -10427, -18773, -18089, -29870, 34789, 110981, 99064, 49614, 11681, -7772, -38542, -91004]
17080i1004k1335m6159j3771K0071l002K3815J04979K9320j7011k5659K7811K1658
17068I713M0883l8277k9979q0197k0348O1323Q6505R6829j5638j68067o0584r607
17056a27444M1159j7220M8202O8263k6857r7441q4609l0675J01674K1183o2152
17045a65917P4731J11834P442n1160J9199M6778L3284O342l289q0839N7924Q435
17033F4764k9962m0854j34567n4016l0559R1916P7359J30993J40877r2042j37568
17022a3659P2468O880l5414K9180R4095l2446r9042o4846K4093p470j9157J5654
17010b9664o152j7348R305R603j159m9665m5649j0085L1666N0566J3531l2964
16998g8015l1670m1392O4533k2408o6586r579L9517K8183p9106L5337K3113K190
$$ y = [-91004, -112339, -158498, -172269, -152198, -155200, -131385, -26406, 2914, -14097, -39756, -11945, 9713, 50596, 12319, -17660, -97857, -118205, -56882, 29623, 126452, 110814, -57253, -117837, -127444, -86285, -103505, -55303, 12960, -13897, -111338, -195947, -226622, -124948, -103765, -165917, -91186, 20648, 28090, -23070, -3871, 42907, 76191, 82533, 79244, -1595, 56329, 64764, 34802, -6052, -140619, -194635, -225194, -133278, -55919, 75074, 215951, 123909, -13659, 58809, 65689, 30275, 59455, 153550, 121104, 22062, -42784, -18691, -26161, -45318, -29664, -35816, -53164, -43859, -34256, -35415, -85080, -130729, -140814, -109148, -58582, -45051, -78015, -109685, -151077, -86544, -108952, -175538, -185117, -145600, -117417, -196523, -161186, -138073, -135883]
16986a35883o415n479L2187P3151q0481L3998L8597J6479J2450o8451l1285O9672
16974e1460l3441o2347k3488M6058R4687N5160m6705n6029m1259L096k042L1575
16962h6195k2187K815J8003l9125P1273O7782N4423k0430q4236r3328l7690L8146
16950a30749K2054k0059K1065N5100n2894l8834M9025k4492l2788m8641Q087J1924
16938a81202j5214M3140P4830L6654K8902L5904K3012M3493J602l8178o5094J2086
16926f5J5088J8040k8318O627P2842m512m0009m0053j47828l9306Q4554m522n7237
16913a64699j2383M7124J4543P3545o1725O989R3794m5444L4861J2891l2823N2713
16901A9386N1291p4679p3041n3466M8352j246j26252m1073M7955R1583l724K0950
$$ y = [-135883, -142298, -147777, -115590, -42439, -122920, -88922, -50325, -33846, -21396, -89847, -121132, -51460, -84901, -147248, -170736, -124678, -29991, 25169, -21536, -77565, -118824, -115728, -117770, -86195, -108382, -105567, -87564, -126689, -55416, 12366, 66789, 46359, -37877, -131205, -168895, -130749, -108695, -128754, -107689, -52589, -105483, -144317, -95292, -119784, -152572, -201213, -193126, -181202, -196416, -153276, -78446, -41792, -12890, 23014, 46026, 89519, 91121, 52943, -12151, -65, 15023, 33063, 4745, 11372, 84214, 79702, 39693, -360, -148188, -187494, -102940, -107462, -164699, -177082, -129958, -115415, -41870, -103595, -96606, -2812, -48256, -13395, -504, -33327, 19386, 70677, -4002, -77043, -130509, -82157, -83403, -209655, -250728, -202773, -111190, -114914, -93964]
16889i3964N4018R1818Q5486N7961p0852L3979j6818o1706o2902P7201M0424o1902
16877G2743r6874l0105l6897J289P144k4059k0430q039O1913J15443m9573k0798
16865b8243j7138n0845l143l646m2557K1117K360q610M9610k4153J4902J35257
16853D4911R45J1177m2787m9299q7089o8864O4638l5414K5572O1811k4618N0991
16841d8026j7962M445N0266L8260J1542j27142j0107Q0015o1318o0423N7874P6893
16829e683K4020l8840k0071k3887M1913M208o7453M6184M0754O807K4900n5751
16817b2899K2286L7420p376L1293l1061K0726l541q4031l3166o3676k6948L7781
16805a23192M1518J4593k410L1254j2807P9584k626J4029l8568k3357M2229n1105
$$ y = [-93964, -39946, 51872, 137358, 195319, 124467, 158446, 141628, 79922, 17020, 94221, 134645, 72743, -24131, -54236, -91133, -89844, -82700, -106759, -127189, -135228, -73315, 42128, -7445, -28243, -45381, -96226, -99369, -103015, -145572, -124455, -122095, -130705, -81095, -105248, -90346, 44911, 45856, 57033, 14246, -35053, -122142, -191006, -126368, -161782, -136210, -74399, -99017, -48026, -65988, -61543, -11277, 26983, 38525, -88617, -98724, -18709, -80027, -140450, -82576, -5683, 18337, -20503, -40574, -64461, -22548, -18340, -85793, -39609, 1145, 7952, 32852, -22899, -613, 36807, 29431, 60724, 29663, 50389, 46848, -37183, -70349, -134025, -160973, -123192, -81674, -67081, -69491, -38237, -51044, 28540, 25914, 39943, 1375, -21982, 20247, -30858]
16793c0858l216K7642l3413l435j3236Q908m1901L3749O9233J00604r475n5287
16781D9315M1029J9859k8013J1286m5421K7843L1710m2283M111m1354j2307N0739
16769F6514K931k0225N3800o9568q108o7633o6187n3172m7688l8757R1147O3862
16757i3084j0037j1288M555q6228p3572J13444P4404N3356L6463q2907k9659l1553
16745a36106O479O1530L51o5281k8226Q472K7290L8903r2688n9743Q8275J9106
16733a31638J01080L0631n8611K5491O0682j2206L6894Q945m8183m4718J4525
16722a7108o2855j06220N4605K4093M0748o8311k9483O101L9653K8932L0765M4694
16710a4386O964J5430L1877j5731L4533q9822j05252N0117l2526j6383M9877N0534
$$ y = [-30858, -34074, -6432, -39845, -43280, -56516, -47608, -89509, -55760, 13473, 114077, 104602, 49315, 90344, 110203, 82190, 93476, 48055, 75898, 107608, 65325, 69436, 28082, 15775, 66514, 69445, 49220, 103020, 33452, 25344, -42289, -108476, -161648, -209336, -248093, -156946, -93084, -103121, -114409, -109854, -196082, -269654, -156210, -81806, -28450, 8013, -74894, -104553, -136106, -129627, -68097, -67746, -133027, -161253, -152781, -125491, -86588, -179276, -239019, -150744, -131638, -30558, 73, -58538, -33047, 27635, 15429, 52323, 61268, 13085, -31633, -17108, -79963, -186183, -131578, -107485, -66737, -135048, -164531, -158430, -118777, -89845, -59080, -14386, -7422, 8008, 39885, 24154, 58687, -31135, -136387, -86270, -118796, -135179, -85302, -34768]
16698c4768n2719L6543N9684k1730L7539R675o1652O545o991L6054L0380L9852
16686G8412k8209K2731j2341q4648j05594L7323j4236j9629l0160P2015L7405
16675d6931l8240j1997R3897P4123O0133R136N525o7739k4110j3218K7728p6901
16663h594p4744N299j2623O5038O5067m6832p7992r288M0366R1151k6604l1667
16651b1423O8766K4916P696o2404q9519l98J5683m3295K3064J01428L3581N7925
16639A16020J2536n6226q4350l5933M5011l1242j1995n4968L3273O801O230K1017
16627c3826k6473O0109L8919O4896m1531L3875n970m3681j52061o2154J2973l7878
16615a92802L9083J11303N8804M3572n8188m9297p1499J00996m6884O2290J5781
$$ y = [-34768, -87487, -50944, 8740, -12990, 24549, 34224, -27428, -20883, -27874, 8180, 38560, 78412, 50203, 72934, 60593, -24055, -129649, -92326, -106562, -126191, -156351, -84336, -46931, -85171, -97168, -3271, 70852, 130985, 140121, 145646, 77907, 53797, 40579, 68307, -8594, -83338, -78039, -90662, -25624, 39443, -7389, -85381, -94669, -54303, 36848, 10244, -21423, 47343, 72259, 79955, 17551, -71968, -72366, -56683, -99978, -76914, 24514, 58095, 116020, 128556, 72330, -12020, -47953, -2942, -34184, -46179, -101147, -67874, -61073, -54843, -33826, -60299, -190, 38729, 103625, 62094, 95969, 89999, 46318, -105743, -167897, -154924, -192802, -153719, -42416, 16388, 59960, 1772, -47525, -119024, -18028, -64912, -2622, 13159]
16604A3159j1610j6573O257j4998q1617K7773J09105J4185k4601k4371m0609k4979
16592f8879L4192J7301m3846j09384l1078J09042N6172O1253Q2218L9721J5506
16581A62218o4425l8176n7026o977k1716j4793l9178m9053K5446k2530n4039M6715
16569a33534R1371J4203r9479P6291m305n1474n873L9910j9574j4136k2839O4205
16557f5234L5770k1567O862P1746k4461J7974n5753o4076q2103k0420L8487L6900
16545a25875K4127J6637M7741P3726o9914Q259N4968l4334j1295L0632p2846N3753
16533d421L8644P523q8158n4121k4336o452J4657J4504P2105N3028l3823R694
16521a156N5307K4183o5082l9861K6485L7430K2439m6277j06365M4321m7985M4408
$$ y = [13159, 1549, -15024, -8767, -23765, -105382, -77609, 31496, 45681, 21080, -3291, -43900, -68879, -34687, -17386, -61232, -170616, -201694, -92652, -36480, 24773, 106991, 146712, 162218, 97793, 59617, 2591, -4386, -26102, -40895, -80073, -129126, -103680, -126210, -180249, -133534, -42163, -27960, -127439, -51148, -55453, -106927, -112800, -72890, -92464, -106600, -129439, -65234, -29464, -51031, -44169, 27577, 3116, 21090, -34663, -98739, -180842, -201262, -162775, -125875, -101748, -85111, -37370, 36356, -33558, -25299, 29669, -4665, -15960, 14672, -58174, -4421, 34223, 41746, -46412, -100533, -124869, -131321, -116664, -102160, -30055, 22973, -10850, -1156, 54151, 78334, 13252, -26609, -124, 37306, 59745, 13468, -92897, -48576, -96561, -52153]
16509e2153K9082n0094j6463k1280O2094M9194k4272J01461J4477j16588N8629
16498C4087J0104j16160l0178p16o6336k6338M0090M6584P5281j810N5259M8511
16486F8378J1430O635L5966N183J2833M3693n6924n4361m4968m5540r058K3356
16474c377J18623j5944q6162n2102m8295K6113m0987O1322R7235j3355j14739
16463g1668N8349m0588j6140P1409n0675q4290O2173Q4787j1669j09490m6342
16452a54144P1691j2218m0164O4468L8420L4819m4869o0677o1806N2095R0088
16441b2297L5271p662P011l0004k4662k4796k8906L6124J18880K2955l0680j1955
16429C9279L6788m6300q3350O81J7941k1441l6749n419m5543N4030L2067P257
$$ y = [-52153, -23071, -73165, -89628, -110908, -48814, 380, -23892, 77569, 92046, -24542, 34087, 44191, -71969, -102147, -102863, -169199, -195537, -155447, -108863, -33582, -35392, 19867, 68378, 79808, 86443, 122409, 127592, 140425, 184118, 127194, 72833, 27865, -17675, -26733, -3377, 115246, 99302, 13140, -38962, -87257, -61144, -102131, -40809, 56426, 43071, -71668, -13319, -53907, -70047, 1362, -49313, -133603, -71430, 13357, 1688, -107802, -154144, -82453, -94671, -134835, -70367, -31947, 2872, -41997, -102674, -164480, -112385, -22297, 12974, 5312, 12323, -17681, -42343, -67139, -96045, -59921, 58959, 81914, 51234, 39279, 76067, 29767, -53583, -52902, -34961, -56402, -93151, -98570, -144113, -90083, -58016, -50759]
16417e0759k3028j7315j030J0830m1284j6954J032J9438L6800j0540L1414k223
16405f3619R3128R4361k6260j59348p6000P5915K342L3304L1514l0923j453K0095
16393f944J07448l9149j14115k1398O612j6100K3243p659j3405O4394N4096m6333
16381i310j5106N2062J7908P793o4705k8919j5037J5505O8937P0679o5230o852
16369B7725M6825N8627m6354L0966q286q7178o1305n7165m294j7291M0586K6127
16357e1017O3056l1519m3534J228J4114r503n497J6770j7190n5448l315M7323
16345g4532K6997O7166J8451K0923p9641k5726l5947M990J6495M42N391m7016
16333a02007Q314J18519j6178o9348m6497L0267L8719K5288j7030J7356J5764
$$ y = [-50759, -73787, -91102, -92132, -81302, -122586, -139540, -138508, -119070, -82270, -92810, -61396, -63619, 29509, 123870, 97610, -61738, -137738, -61823, -59481, -26177, 5337, -25586, -27039, -6944, 100504, 61355, -52760, -74158, -67546, -83646, -60403, -68062, -81467, -17073, 37023, -9310, -24416, 27646, 45554, 53347, -11358, -40277, -55314, -39809, 29128, 99807, 34577, 27725, 74550, 133177, 86823, 117789, 109503, 22325, -38980, -96145, -100439, -117730, -77144, -51017, 12039, -19480, -63014, -61786, -47672, -57175, -62672, -45902, -63092, -118540, -121855, -74532, -47535, 19631, 38082, 59005, -20636, -46362, -82309, -77319, -60824, -60382, -54991, -102007, -93693, 24826, 8648, -60700, -107197, -76930, -38211, -12923, -29953, -12597, 3167]
16322C167j1545J4286M814k254k2375p1336j5628k8917J4033O932k6744L6100
16310i9467k5457q229m450k050p8401O1241J08478M6668j7921M0563o5188k4564
16298f8777k5211J4990q225j3038L1469R210j0439o0833J9359J1105J4912k0148
16286a05626O2403O6107M450L4649J9348O8709k8982o6984n3481l3527p777j872
16274d2583P7306N1465l748j1578o7079K9198J12231K1756m9011R10r1023o3370
16262c5526Q6688N7289o9775p5979j31921J3309R3048K7676k0885L8608k0707
16251c8175k1153L6707o3808j8795L2038L6271N2016J06j6426o7343m0266P349
16239a01479J6250P6990L2347N9650R538m0572m2850Q6596N9637j00054p5684
$$ y = [3167, -8378, 5908, 10722, 8468, -13907, -85243, -100871, -129788, -115755, -108823, -135567, -99467, -124924, -133153, -137603, -139653, -218054, -156813, -48335, -1667, -19588, 20975, -44213, -68777, -93988, -78998, -87223, -100261, -68792, -59582, -70021, -130854, -111495, -100390, -85478, -105626, -43223, 22884, 27334, 61983, 81331, 150040, 121058, 54074, 593, -32934, -40711, -42583, 34723, 86188, 82440, 70862, 3783, 32981, 145212, 166968, 117957, 118867, 27844, -35526, 51162, 108451, 38676, -37303, -169224, -155915, -62867, -35191, -56076, -17468, -38175, -59328, -22621, -86429, -105224, -73186, -36915, 15101, 15207, -1219, -68562, -108828, -101479, -85229, -8239, 24108, 83758, 93296, 52724, 9874, 96470, 156107, 56053, -19631]
16228a9631l1808r0661J2986N6537L0386k9696l6263K4013N7913p3201m7055Q45
16216a45635O2342O7289P7829J6487j5725K1307r1113l1507k5385P6564J20669
16205A33122k7631m1709J5496K6869q4403r123j6952N0712p3644l165L3315L0003
16193C2890p761p773k4266r038n149L7966L646N3282O4933l2930j03572n0437
16181d8209j136k746O3784N3169m7656j2727p7275l1650K3409M1793L1614o2160
16169f9790k5J12068k5496n4602J02460K5667J5179j8887M9884j1908k5842m0689
16157E8019o2801m2979l6514R9038j9115n8441Q187j6250m5857k6730r050J5743
16145a36750N6529o3237Q2809K1800l6741k2929m8969l4846P3258N6013J9806
$$ y = [-19631, -51439, -142100, -129114, -72577, -42191, -71887, -108150, -84137, -26224, -99425, -146480, -145635, -83293, -16004, 61825, 78312, 62587, 83894, -7219, -38726, -64111, 12453, 133122, 105491, 63782, 79278, 106147, 21744, 12621, -4331, 46381, -27263, -30428, 2887, 32890, 25129, 17356, -6910, -15948, -21097, 16869, 20515, 73797, 138730, 105800, 2228, -48209, -49345, -52091, 11693, 64862, 17206, 4479, -72796, -104446, -81037, -39244, -7630, -69790, -69815, 42253, 16757, -37845, 64615, 90282, 105461, 86574, 136458, 124550, 98708, 58019, -4782, -47761, -84275, 14763, -4352, -62793, -54606, -70856, -116713, -143443, -152493, -136750, -80221, -143458, -60649, -38849, -75590, -98519, -147488, -182334, -109076, -53063, -33257]
16134c3257K9741m2643M507L0782L06j7090n0868L014J4277P4213j4195j3613
16122a4826j189n37j2477p067K9633N8345r807j299N536j3819l2298j5924J07490
16109I1761M0188N3226Q5785l0101j75934j20512J56k0439M0009K1142M5278J03772
16097A34331l1370q4875j2011N2429M9021p9975O9o8312j04840r722K4508P1899
16085e8848L6380m6490M3948K4000j2192r0097K8567P5594L7309o9285n171P6956
16073D0671m2893k1634l0366M6536K9827k9329n1009l044k9939k4430J5741P3090
16061b6779K3329p856K1318M6799m4893j2663R1881L7705n7115m4641l2850n6010
16049f1775l2193j5807J1515J4598j1353J5411M5880M6201Q5494N2520p1418p7320
$$ y = [-33257, -3516, -46159, -41652, -10870, -10564, -27654, -78522, -75508, -61231, 12982, -1213, -14826, -16015, -16552, -29029, -36096, -6463, 51882, 42075, 40776, 46312, 32493, 195, -15729, 91761, 131949, 185175, 270960, 240859, 64925, -55587, -55431, -75870, -35861, -14719, 30559, 134331, 102961, 18086, 6075, 58504, 107525, 27550, 27619, -40693, -145533, -155255, -130747, -58848, -22468, -68958, -25010, -1010, -13202, -103299, -74732, 862, 38171, -31114, -36285, 40671, -2222, -23856, -54222, -7686, 22141, -7188, -58197, -61241, -91180, -115610, -99869, -26779, -3450, -11306, 10012, 56811, 11918, -745, 91136, 128841, 71726, 27085, -5765, -61775, -93968, -109775, -98260, -83662, -95015, -79604, -33724, 12477, 97971, 150491, 79073, 1753]
16037A753J1128J8321q1703R337Q5368L375j9830j8656N3802Q2494k3506m1442
16025H0441l3638m7281k1117R1830J6459q2258k9217O2294q66q1711o2700J0629
16013i7135M4981j1456n1967m7257O3574P406m9084o134J28173R825K5928o8601
16001e1747o5043P9451M9518Q9k1451q055k2410k1378j21036k9629k1626J02573
15989a30744J2074J00263J9004p7249m0946J5533Q3275l8712l806J6094P0005
15978B4791M1610J2928J7518K2284K3243j3892L3941k3806L415l1132j7677j06400
15966a3177n8501q2077L5206J00432M1774k8708k7390j3849L4988O102r09M9126
15954D3017k9897K3776n4025l2448l3037r0426J4345O9767Q1597J37742N3753
$$ y = [1753, 12881, 31202, -50501, -41164, 44204, 47579, 27749, 9093, 62895, 145389, 121883, 80441, 46803, -478, -21595, 70235, 86694, 4436, -24781, 37513, 36647, -45064, -107764, -97135, -52154, -63610, -115577, -162834, -99260, -91854, -140938, -147072, -18899, -9074, 16854, -51747, -116790, -37339, 12179, 12268, -9183, -17238, -39648, -61026, -182062, -211691, -233317, -130744, -118670, -18407, 597, -76652, -117598, -102065, -18790, -57502, -61308, -45214, 24791, 66401, 79329, 96847, 119131, 142374, 128482, 162423, 138617, 142032, 110900, 93223, -13177, -71678, -153755, -118549, -18117, 23657, -5051, -32441, -46290, -11302, -5200, -6109, 43017, 13120, 36896, -17129, -49577, -82614, -173040, -158695, -88928, -7331, 130411, 184164]
15943A84164J14j7141q0905l3159K1034m6138j3373r0657L8115Q8399K047o2449
15931i949m1096K9898l6445J8151N8930L9383N5086m5582M1552J756n4558r9435
15919d2309l2101Q0253O7263Q757J9239K4667j9593k5281n0513L8913J22201j654
15907A89842o2121q8332p7315M2111K4760l494R9447J8262q573k9525p6617O48
15895B9093J03182n4191q8977J7519K7719n532k9914o3647q817N9780P3226O7766
15883A27207n8175l6530J0856p751r9839J5662Q8581O3954q143j12141m4123j02385
15871a62827k9480N8222K5610j2058k4923q296j8116n9539J01990M2748N3069
15860c3600O1267K2889k1087j13256q5016p968J4720j0507q9856P1489K7506P7639
$$ y = [184164, 184278, 167137, 86232, 53073, 74107, 27969, 14596, -76061, -37946, 50453, 52500, -9949, -51045, -21147, -57592, -39441, 19489, 58872, 113958, 68376, 109928, 111684, 57126, -42309, -74410, 5843, 73106, 81863, 101102, 125769, 106176, 80895, 30382, 69295, 191496, 189842, 127721, 39389, -37926, 4185, 28945, 25451, 124898, 143160, 134587, 105062, 28445, 29093, 132275, 78084, -10893, 6626, 34345, 28813, -1101, -64748, -73565, -13785, 59441, 127207, 69032, 32502, 43358, 35607, -64232, -48570, 40011, 103965, 95822, -16319, -60442, -162827, -192307, -134085, -108475, -120533, -145456, -153752, -171868, -231407, -129417, -86669, -33600, 27667, 50556, 29469, -83787, -168803, -176771, -162051, -172558, -262414, -190925, -163419, -85780]
15848h5780j3673L2717L5235O3132K9258k9929j9748j1578r1755N2535N4854r5076
15836g9808l9576K831j2305K5363P6346R344l3830L545J9834N7019k3735j4156
15824i128N6479R2797q997j4270k762p0834k5340K4925m5434J6531j5614n250
15812f897K2028p5668r3209K2236O8457K4524P2617O1528k3697q9867M0334K4461
15800D6847M6141j6532n7285m9813O591m3764q9260J7447Q1957l3600M156R7713
15788A0598P9846l9661q6516m7161N6337L2094K4677o7093k5730L0942j7160J09752
15776F0925k6415l8198M7233J4407L378l2335m8772J8918k710J9665K2510R441
15764D8047j6053M9072L7410L0100m8243o7837R6417K1467o8201j01090m0883
$$ y = [-85780, -99453, -66736, -31501, 31631, 60889, 30960, 11212, -366, -92121, -39586, 15268, -79808, -119384, -116553, -128858, -103495, -27149, -17805, -51635, -48090, -28256, 28763, 5028, -9128, 47351, 140148, 131151, 116881, 114119, 43285, 17945, 42870, -2564, 13967, -1647, -6897, 15131, -60537, -153746, -131510, -63053, -38529, 34088, 95616, 71919, -17948, 22386, 46847, 92988, 76456, 19171, -30642, -24051, -67815, -157075, -139628, -57671, -91271, -87115, 10598, 90444, 50783, -35733, -82894, -26557, 5537, 30214, -36879, -62609, -31667, -48827, 60925, 34510, -3688, 43545, 57952, 61330, 28995, -19777, -859, -3569, 16096, 38606, 48047, 31994, 81066, 118476, 148576, 100333, 32496, 128913, 150380, 82179, -18911, -59794]
15753e9794K0082R478l0678L2524J389l1378N196R4303l2626l7763N5879L0035
15741E6647l3896j2456M3646J08122n0825j16855l3847l8679L7738n395l7898
15730h3698k2246l5133P3970n358l2433l7944o4186N7591J00430O0550l0573K739
15718a6291J26191O298m6142j03557m1342j2873J18375K2363Q803L5019J3825
15707A10669n7959j22642n686P7473P0403J7946o657J6534M6153j4318k9228m5126
15695E7562N921L537j14042n8765l0990Q2222J49849m7696r0564p0360P9056N136
15683b9134o7123K0215p1989m4688P6966N862n2126n7483L3796O0628M4210K1904
15671e8962m3781j56525j8120J50253O8094K7827j4485j7318K0947L1457j3776
$$ y = [-59794, -39712, -30234, -60912, -28388, -26999, -58377, -53181, 41122, 8496, -29267, 26612, 56647, 22751, 10295, 53941, 162063, 111238, -5617, -39464, -78143, -40405, -45800, -83698, -105944, -141077, -67107, -72465, -104898, -142842, -207028, -149437, -49007, 11543, -19030, -16291, 109900, 116198, 70056, -33501, -74843, -87716, 30659, 53022, 61825, 96844, 110669, 52710, -69932, -75618, 1855, 72258, 90204, 83547, 100081, 146234, 131916, 102688, 57562, 63483, 67020, -47022, -105787, -136777, -54555, 95294, 47598, -42966, -113326, -34270, -29134, -96257, -76042, -148031, -192719, -115753, -109891, -162017, -219500, -185704, -125076, -80866, -58962, -102743, -259268, -277388, -127135, -59041, -31214, -45699, -63017, -42070, -10613, -24389]
15660b4389j7064J220q79K5166K6317Q760M1226J8092j9748m9027p2122k4233
15648h6681K4672R2596k3221n962J8783K5933l6431M8478J6771j4190k8634n037
15636B7077o2241j4551l5249K0101O04N8241L0436j2471o5090M313m4614Q079
15624h5365N7339N6802K7259N0972l1634m1775q0443l4498O4101p1759K2034P3411
15612F444Q370n2733K7888J07007k4976j63127J1195O5655Q2285J6521p7522j05565
15600i8558l9773N3728N4402P67q5329Q7922O0672L3791q381j56273k7828R2922
15588c1938O5940M3729K2510q3447j00560K5166J4796J4197k1045k7038L4201
15577d3489L8327N2774L3437q3224k9131L0501L835J3639M0232J3835l3269m2674
$$ y = [-24389, -41453, -40233, -41112, -15946, 10371, 19131, 60357, 78449, 58701, 9674, -62448, -86681, -62009, 30587, 7366, 1404, 20187, 46120, 9689, 58167, 74938, 60748, 32114, 27077, -35164, -49715, -84964, -64863, -64259, -6018, 24418, 11947, -53143, -48830, -93444, -85365, -28026, 28776, 56035, 107007, 75373, 33598, -46845, -81343, -17242, -89001, -66967, 6444, 14814, -37919, -10031, 96976, 72000, -91127, -79932, -14277, 68008, 84529, 7007, -98558, -138331, -84603, -30201, -29434, -114763, -26841, 33831, 67622, 59241, -97032, -124860, -31938, 34002, 77731, 100241, 16794, -83766, -58600, -43804, -29607, -50652, -77690, -43489, -5162, 47612, 81049, -2175, -31306, -805, 3030, 16669, 56901, 70736, 37467, -5207]
15565e207q9402J8601q007L3563r964n2378N7029Q011o3982J9947N7966L273p1344
15552a01894j6433P4280M1477P9291p510l2083o5754p4777Q3157K511k0551j2978
15540e1264J6387K6240K7576q5613P4739k4383r628K2563O518P552o1891j5552
15528f6756n3092J04698J4752l4810K8233K3772M0518l4210j4454L63p710O1437
15516F2741M4079n9205j6300l7821j6639M0633P84P392Q685J9760k5877j13265
15504h5033p1633N9233M9129p360L6783N3589N4057K5983p3477o8364P4995j1749
15492C6153r4557M3831N0553o6983o1056L6886l2505K3154J11290q285o5259p7116
15480a03894L5188o6303J3854K4708O4975p3259N8429j5931j6669K8191M4526
$$ y = [-5207, -94609, -76008, -84015, -50452, -60416, -112794, -55765, -47754, -111736, -91789, -33823, -30550, -101894, -118327, -44047, -2570, 76721, 69211, 37128, -28626, -103403, -20246, -17735, -38286, -51264, -34877, -8637, 18939, -66674, 8065, -16318, -25946, -3383, 3135, 10687, -51204, -66756, -119848, -15150, -398, -35208, -6975, 16797, 57315, 23105, 8651, 9014, 1304, 62741, 106820, 47615, 31315, -6506, -23145, 17488, 18272, 25664, 34349, 54109, 28232, -85033, -156666, -97433, -48304, -55664, -18881, 34708, 88765, 114748, 41271, -27093, 47902, 36153, -58404, -14573, 35980, -31003, -92059, -55173, -87678, -64524, 46766, 38481, -26778, -103894, -68706, -135009, -121155, -96447, -31472, -104731, -46302, -62233, -78902, -50711, -6185]
15469f185N5017m1118l3948K5122M5056k5094j749Q39n7682N831N9377J1945l5327
15456B084P1575k8786K6246l3471k0556o4239M5256N1067n357O4666o039l4600
15444F7846k1308l342J04609K0110j24600k9843l7743j089L6143m8778L6688M2387
15432D1080l726l8386n795q625Q0604n2899n0457m1427L8792M0497N3334j0790
15420D2202r2239j6438K1144L161N2956N1146J4193l9058j258r1349n2204O2171
15408d5573N7553j6081J7279n4777o1049m9564J2442k8782L901J17471N5511k4158
15396a5827K0758J03717l281k5004j8112r179r4748j6731j0163K2998N643p575
15384d7504j8182j8506N620J18377N2523p9609p5026J9578P0231o2001j38478
$$ y = [-6185, 48832, 7714, -26234, -1112, 43944, 18850, 17101, 17940, -39742, -33911, 25466, 37411, 2084, 73659, 44873, 71119, 37648, 17092, -47147, -1891, 49176, 43819, 108485, 102446, 67846, 46538, 43196, 147805, 167915, 43315, 13472, -24271, -25360, 10783, -37995, -1307, 41080, 37354, -1032, -6827, -15452, 65152, 12253, -38204, -79631, -40839, -342, 52992, 42202, -50037, -66475, -45331, -42170, 10786, 61932, 76125, 37067, 35809, -55540, -107744, -45573, 11980, -4101, 13178, -41599, -102648, -152212, -139770, -168552, -164651, -47180, 8331, -15827, 4931, 108648, 105367, 80363, 62251, 53072, -41676, -58407, -68570, -45572, -39929, -47504, -65686, -84192, -78572, 39805, 92328, 12719, -62307, -42729, 27502, -34499, -172977]
15373a72977k8537k4336K0362P0242N7983L1783L7116N2005n5432k9913M6773
15362E069N2839j1831o2104l8089M7594L4800N1324L1263j22087j17707J09509
15351a9420J15694L6361p876q3636n447J15732p671J7915m283q5225j27283n2262
15339a07401j5680J42426q868m292N7973Q6518Q6087L8310j01704L618l3977j57020
15327a4010K0086L8339O7860K4509j6681r3903k257P6557k2924p8700k6314l994
15315c1432M4870k7212l2566o015N2267M279P307k6467k829m2460L584L1254j1388
15302c6808J9643O4613M3834o1281k7869j5809n1222k978J328n784l389L848J46539
15289G4665L7224K7030M5643n5578j00599n9601L1392n4967o2034O1151J5032
$$ y = [-172977, -201514, -225850, -205488, -135246, -77263, -45480, -8364, 43641, -11791, -41704, 5069, 57908, 46077, -16027, -54116, -6522, 28278, 79602, 110865, -11222, -128929, -19420, 96274, 132635, 124759, 41123, 35676, 151408, 143737, 161652, 157369, 72144, -55139, -107401, -123081, 19345, 10477, 6185, 64158, 150676, 236763, 275073, 173369, 176987, 143010, -14010, 6076, 44415, 112275, 136784, 120103, 26200, 23943, 100500, 77576, -1124, -27438, -31432, 13438, -13774, -46340, -52355, -88, 4191, 11498, -14969, -17798, -60258, -56674, -25420, -36808, -17165, 47448, 91282, 30001, 2132, -13677, -64899, -67877, -66549, -72333, -75722, -71874, 74665, 111889, 138919, 184562, 128984, 28385, -31216, 176, -54791, -116825, -55674, -40642]
$$ [...]
##END NTUPLES=NMR SPECTRUM
##END=
