##TITLE=Analysis number 326091
Compound Code cc 58539
Book Reference 470/152/1
Project Code adrs
Chemist Name mikem
##JCAMPDX= 6.0         $$ Bruker NMR JCAMP-DX V2.0
##DATA TYPE= NMR SPECTRUM
##DATA CLASS= NTUPLES
##ORIGIN= Bruker BioSpin GmbH
##OWNER= nmr
$$ XWIN-NMR		Version 3.5
$$ Wed Jan 24 14:13:20 2007 GMT Standard Time (UT+0h)  MAYBRIDGE\nmr@NMR_250MHZ
##.OBSERVE FREQUENCY= 250.131544655141
##.OBSERVE NUCLEUS= ^1H
##.ACQUISITION MODE= SIMULTANEOUS (DQD)
##.ACQUISITION SCHEME= undefined
##.AVERAGES= 16
##.DIGITISER RES= 18
##SPECTROMETER/DATA SYSTEM= dpx250
##.PULSE SEQUENCE= zg30
##.SOLVENT NAME= CDCl3
##.SHIFT REFERENCE= (INTERNAL, CDCl3, 0, 16.418)
##AUDIT TRAIL= $$ (NUMBER, WHEN, WHO, WHERE, WHAT)
$$ ##TITLE= Audit trail, XWIN-NMR		Version 3.5
$$ ##JCAMPDX= 5.01
$$ ##ORIGIN= Bruker BioSpin GmbH
$$ ##OWNER= nmr
$$ C:\u/data/dgb/nmr/ADRS/1740/pdata/1/auditp.txt
$$ ##AUDIT TRAIL=  $$ (NUMBER, WHEN, WHO, WHERE, WHAT)
(   1,<2007-01-24 14:12:54.20 +000>,<MAYBRIDGE\nmr>,<NMR_250MHZ>,
      <created by zg, POWCHK disabled, PULCHK disabled
       configuration hash MD5:
       49 4B E0 1D 92 C2 6B 37 9F E6 65 BC 52 41 86 1D
       data hash MD5: 64K
       C4 C5 66 75 5F 83 EE EA 9B 0E E8 F8 8E 81 14 46>)
(   2,<2007-01-24 14:13:09.37 +000>,<MAYBRIDGE\nmr>,<NMR_250MHZ>,
      <Start of raw data processing
       ef LB = 0.3 FT_mod = 6 PKNL = 1 SI = 32K 
       data hash MD5: 32K
       EF 8F 31 6D CC 10 AF ED 91 17 07 58 73 8F 23 AA>)
(   3,<2007-01-24 14:13:11.34 +000>,<MAYBRIDGE\nmr>,<NMR_250MHZ>,
      <apk 
       data hash MD5: 32K
       20 EC 13 96 AD D8 3C D3 7E B5 54 89 48 FD 30 51>)
(   4,<2007-01-24 14:13:12.22 +000>,<MAYBRIDGE\nmr>,<NMR_250MHZ>,
      <abs ABSG = 5 
       data hash MD5: 32K
       99 25 B5 88 A2 53 38 3B 58 01 91 44 68 D3 A2 A5>)
$$ ##END=
$$ 
$$ hash MD5
$$ 93 2D 29 E1 C4 EF FA 45 5A 61 C1 54 E2 29 BF 43
##$RELAX= 
##$RELAX= 
##$RELAX= 
##$RELAX= 
##$RELAX= 
##$RELAX= 
##$RELAX= 
$$ Bruker specific parameters
$$ --------------------------
##$DU= <C:\u>
##$EXPNO= 1740
##$NAME= <ADRS>
##$PROCNO= 1
##$TYPE= <nmr>
##$USER= <dgb>
##$AMP= (0..31)
100 100 100 100 100 100 100 100 100 100 100 100 100 100 100 100 100 100 
100 100 100 100 100 100 100 100 100 100 100 100 100 100 
##$AQSEQ= 0
##$AQ_mod= 3
##$AUNM= <au_zg>
##$AUTOPOS= <31 >
##$BF1= 250.13
##$BF2= 250.13
##$BF3= 250.13
##$BF4= 250.13
##$BF5= 500.13
##$BF6= 500.13
##$BF7= 500.13
##$BF8= 500.13
##$BYTORDA= 1
##$CFDGTYP= 0
##$CFRGTYP= 5
##$CHEMSTR= <none>
##$CNST= (0..31)
1 1 145 1 1 1 1 1 1 1 1 1 1 1 1 1 1 1 1 1 1 1 1 1 1 1 1 1 1 1 1 1 
##$CPDPRG= <>
##$CPDPRG1= <>
##$CPDPRG2= <>
##$CPDPRG3= <>
##$CPDPRG4= <mlev>
##$CPDPRG5= <mlev>
##$CPDPRG6= <mlev>
##$CPDPRG7= <mlev>
##$CPDPRG8= <mlev>
##$CPDPRGB= <>
##$CPDPRGT= <>
##$D= (0..31)
0 1 0 0 0 0 0 0 0 0.06 0 0 0 0 0 0 0.0002 0 0 0 0 0 0 0 0 0 0 0 0 0 0 
0 
##$DATE= 1169647972
##$DBL= (0..7)
120 120 120 120 120 120 120 120 
##$DBP= (0..7)
150 150 150 150 150 150 150 150 
##$DBP07= 0
##$DBPNAM0= <>
##$DBPNAM1= <>
$$ [...]
##$SUBNAM7= <"">
##$SUBNAM8= <"">
##$SUBNAM9= <"">
##$SW= 20.6930455092707
##$SWIBOX= (0..15)
0 0 3 0 0 0 0 0 0 0 0 0 0 0 0 0 
##$SW_h= 5175.983436853
##$TD= 65536
##$TD0= 1
##$TE= 294.16
##$TE2= 300
##$TE3= 300
##$TEG= 300
##$TL= (0..7)
0 120 120 120 120 120 120 120 
##$TP= (0..7)
150 150 150 150 150 150 150 150 
##$TP07= 0
##$TPNAME0= <>
##$TPNAME1= <>
##$TPNAME2= <>
##$TPNAME3= <>
##$TPNAME4= <>
##$TPNAME5= <>
##$TPNAME6= <>
##$TPNAME7= <>
##$TPOAL= (0..7)
0.5 0.5 0.5 0.5 0.5 0.5 0.5 0.5 
##$TPOFFS= (0..7)
0 0 0 0 0 0 0 0 
##$TUNHIN= 0
##$TUNHOUT= 0
##$TUNXOUT= 0
##$USERA1= <user>
##$USERA2= <user>
##$USERA3= <user>
##$USERA4= <user>
##$USERA5= <user>
##$V9= 5
##$VALIST= <valist>
##$VCLIST= <CCCCCCCCCCCCCCC>
##$VD= 0
##$VDLIST= <DDDDDDDDDDDDDDD>
##$VPLIST= <PPPPPPPPPPPPPPP>
##$VTLIST= <TTTTTTTTTTTTTTT>
##$WBST= 1024
##$WBSW= 4
##$XGAIN= (0..3)
0 0 0 0 
##$XL= 0
##$YL= 0
##$YMAX_a= 484186
##$YMIN_a= -457095
##$ZGOPTNS= <>
##$ZL1= 120
##$ZL2= 120
##$ZL3= 120
##$ZL4= 120
##$ABSF1= 16.41796
##$ABSF2= -4.275211
##$ABSG= 5
##$ABSL= 3
##$ALPHA= 0
##$AQORDER= 0
##$ASSFAC= 0
##$ASSFACI= 0
##$ASSFACX= 0
##$ASSWID= 0
##$AUNMP= <proc_1d>
##$AZFE= 0.1
##$AZFW= 0.1
##$BCFW= 0
##$BC_mod= 0
##$BYTORDP= 0
##$COROFFS= 0
##$CY= 12.5
##$DATMOD= 1
##$DC= 0
##$DFILT= <>
##$DTYPP= 0
##$F1P= 14.0000005364418
##$F2P= -0.99999901652339
##$FCOR= 0.5
##$FTSIZE= 32768
##$FT_mod= 6
##$GAMMA= 0
##$GB= 0
##$INTBC= 1
##$INTSCL= 1
##$ISEN= 128
##$LB= 0.3
##$LEV0= 0
##$LPBIN= 0
##$MAXI= 10000
##$MC2= 0
##$MEAN= 0
##$ME_mod= 0
##$MI= 0
##$NCOEF= 0
##$NC_proc= -2
##$NLEV= 6
##$NOISF1= 0
##$NOISF2= 0
##$NSP= 0
##$NTH_PI= 0
##$NZP= 0
##$OFFSET= 16.41796
##$PC= 1
##$PHC0= 79.31535
##$PHC1= 5.950362
##$PH_mod= 1
##$PKNL= yes
##$PPARMOD= 0
##$PSCAL= 4
##$PSIGN= 0
##$REVERSE= no
##$SF= 250.130026020615
##$SI= 32768
##$SIGF1= 0
##$SIGF2= 0
##$SINO= 400
##$SIOLD= 32768
##$SREGLST= <1H.CDCl3>
##$SSB= 0
##$STSI= 32768
##$STSR= 0
##$SW_p= 5175.98343685301
##$SYMM= 0
##$S_DEV= 0
##$TDeff= 65536
##$TDoff= 0
##$TI= <Analysis number 999999
Compound Code 99
Book Reference 9
Project Code 9>
##$TILT= no
##$TM1= 0
##$TM2= 0
##$TOPLEV= 0
##$USERP1= <user>
##$USERP2= <user>
##$USERP3= <user>
##$USERP4= <user>
##$USERP5= <user>
##$WDW= 1
##$XDIM= 32768
##$YMAX_p= 474432129
##$YMIN_p= -42242
$$ End of Bruker specific parameters
$$ ---------------------------------
##NTUPLES= NMR SPECTRUM
##VAR_NAME=  FREQUENCY,     SPECTRUM/REAL,   SPECTRUM/IMAG
##SYMBOL=    X,             R,               I
##VAR_TYPE=  INDEPENDENT,   DEPENDENT,       DEPENDENT
##VAR_FORM=  AFFN,          ASDF,            ASDF
##VAR_DIM=   32768,         32768,           32768
##UNITS=     HZ,            ARBITRARY UNITS, ARBITRARY UNITS
##FACTOR=    0.157963299565203, 1,           1
##FIRST=     4106.62456521733, 0,            0
##LAST=      -1069.35887163568, 0,           0
##MIN=       -1069.35887163568, -42242,      0
##MAX=       4106.62456521733, 474432129,    0
$$ Real data points
##PAGE= N=1
##DATA TABLE= (X++(R..R)), XYDATA
$$ [...]
15789D72m912j599K958m189k244M276J163k670N934K028j585l820J271L85j533
15774d065R15J477r28k997L463L581L774K441j898O37J099K594l730k682J264
15759D945k546o38j579J960K627l695l776j377Q97J863M306O19k785J966J130
15744C917p2j91n94J917m858l160L95J59Q69K666k0J535K554O12k078R38J858
15727F447k355l919l519N239J427K190J162n82K47r88k795k64L418n13n776R83
15711D02m34k10Q06k126M158l079l6L363Q82N65j776L898M113k720k016j274L72
15694D888L50m537m34M35J334p9k019m5K054L041P4M002l846p272l936J615O667
15677B292L939k719l663j052L98K618k051q25K752o10j52j1j597l549J112N104
$$ plain form
15789 472 -4440 -6039 -3081 -7270 -9514 -5238 -4075 -6745 -811 1217 -368 -4188 -2917 -2532 -4065
15774 -4065 -3150 -1673 -2601 -5598 -2135 1446 5220 7661 5763 6400 7499 10093 6363 3681 4945
15759 4945 2399 1761 182 2142 4769 1074 -2702 -4079 -3182 -1319 2987 3606 821 2787 3917
15744 3917 3845 3654 3060 4977 119 -3041 -2646 -2487 -1618 1048 1028 2563 5117 5729 3651 4589 6447
15727 6447 4092 173 -3346 1893 3320 5510 6672 6090 6337 5349 2554 2290 5708 5195 -581 402
15711 402 -32 -242 564 -1562 2596 -483 -519 2844 3726 4291 2515 6413 10526 7806 5790 4516 4888
15694 4888 5238 701 267 702 2036 1957 -62 -107 1947 4988 5062 9064 5218 -2054 -5990 -4375 2292
15677 2292 6231 3512 -151 -1203 -805 1813 -238 -1063 1689 1079 927 916 -681 -4230 -3118 1986
15661A986R4K03j884O52J617K610J741r56j581k824j262K481N62o28j434j629
15645b52J14k004M419M754K073K3j098j787J187P69m710r3K763K470k435J122
15629G315r40j191O53N073k372K51Q71j390K82m510J809n32j293J062Q18J048
15613F954J168l731k570l052M910O058L466K789Q70m084m261m308M55j008K925
15598F581O165K889R94L751J226K301N917M116M697P891P250Q910J3743K4081
15584A00512L0427K9966L1757L7741L1523K5075J3934m359j4687k4669l0294l4836
15572A92090l4049l1140k7679k2896j6556n818r175j1678l683k683j026M57m879
15559B1285k791l930J826q40J167R62l811l387L231L699j960K040J776j570K092
$$ plain form
15661 1986 2080 2283 399 1051 2668 5278 7019 6063 4482 1658 396 2877 3439 2811 1377 -252
15645 -252 -138 -2142 2277 7031 9104 9127 8029 6242 7429 8198 3488 3395 6158 8628 6193 7315
15629 7315 6375 5184 5837 10910 8538 8789 9660 8270 8552 4042 5851 5319 4026 5088 5906 6954
15613 6954 8122 4391 1821 -1231 3679 9737 13203 15992 16862 12778 8517 4209 4664 3656 6581
15598 6581 12746 15635 16629 20380 21606 23907 29824 33940 38637 46528 53778 62688 76431 100512
15584 100512 130939 160905 192662 230403 261926 287001 300935 296576 281889 257220 226926 192090
15572 192090 158041 126901 99222 76326 59770 53952 44777 33099 29416 26733 25707 26164 21285
15559 21285 18494 14564 16390 15550 16717 17679 13868 10481 13712 17411 15451 17491 19267 17697 19789
15544A9789j243p67K238m667L90K574m505l468K162k02k315k385p70N31L371J194
15528A1927P1j837k362Q27m233K19j706J285K173j276q36l841l402J69J492l62
15512a692J358R13n33J720K236l60K69M484l241l664o02L290K211o55L00l991
15496B043m052L12K812L124L520o8j611j102J375j234M460L196N905k292l438
15481A2950j557l28M383j632m494n285o81j741k058K048K428J904L344M57O30
15466A0368k889p44r16p9j749L758L098Q90m07J04N51L97O69M221K440j840l441
15449A4431r55j431j452j669k668J188J088l254j089j633L285K839k428l932J036
15434C356n6k230J849p06j308Q00K870J225l309o341l283m26J409J255M013N970
$$ plain form
15544 19789 18546 17779 20017 15350 15740 18314 13809 10341 12503 12301 9986 7601 6831 7362 10733 11927
15528 11927 11998 10161 7799 8626 4393 4612 2906 4191 6364 5088 4252 411 -2991 -2822 -1330 -1692
15512 -1692 -334 579 46 1766 4002 3642 3911 8395 5154 1490 888 4178 6389 5734 6034 2043
15496 2043 -2009 -1697 1115 4239 7759 7691 6080 4978 6353 5119 9579 12775 18680 16388 12950
15481 12950 11393 11065 15448 13816 9322 4037 3356 1615 -443 1605 4033 5937 9281 9738 10368
15466 10368 7479 6735 5819 5740 3991 7749 10847 11737 11330 11434 11985 12382 13051 17272 19712 17872 14431
15449 14431 13476 12045 10593 8924 6256 7444 8532 5278 4189 2556 5841 8680 6252 2320 3356
15434 3356 3300 1070 2919 2213 905 1705 4575 5800 2491 -3850 -7133 -7559 -6150 -4895 -882 5088
15418E088O302k165k896Q81j228M085L4l665j892l871q16j02p02j673J333J766
15402D79L62K526J53O514J361j829P77j869j36L422K218N88L285R20J810M382
15386B4963K634j442l345K210O135k813K612P018Q731R260N995k18L471j107n325
15371E8779o066o835k130k661k514p10m048o099j404j951l602k151J606n640m105
15356A0469r72L42l415J669O016J166m421o865r55L366M973L552p28K840K411
15341A9448j909n100N97k0j575L499K577j120K61R52R59k236k332L081J766L72
15325A9220k346m432j269l03k58N10l293k698P163j40J519J853J149O424M162
15310B7261M460K115K428n67J839j611k172M04k893n25r14J444l481J63j291L772
$$ plain form
15418 5088 11390 9225 6329 7210 5982 10067 10101 6436 4544 673 -143 -245 -947 -2620 -1287 479
15402 479 841 3367 3520 10034 11395 9566 10343 8474 8338 11760 13978 14566 17851 18771 20581 24963
15386 24963 27597 26155 22810 25020 31155 28342 30954 37972 46703 55963 61958 61740 65211 64104 58779
15371 58779 52713 45878 43748 41087 38573 37863 33815 27716 26312 24361 20759 18608 20214 14574 10469
15356 10469 9497 9839 6424 8093 14109 15275 10854 3989 3034 6400 11373 14925 14197 17037 19448
15341 19448 17539 12439 13036 13016 11441 14940 17517 16397 16658 17610 18569 16333 14001 17082 18848 19220
15325 19220 16874 12442 11173 10870 10612 11122 7829 5131 12294 12154 13673 15526 16675 23099 27261
15310 27261 31721 33836 36264 35697 37536 35925 33753 34157 31264 30739 29825 31269 27788 27951 26660 30432
15294C0432j572r99K265J647j777j725n253P85p00M295M601L769j899m114J03
15279B9858L404K629K045Q21M058N901K430M224M290l929k046L643L576J249k672
15264E9481m716k823j928N997j405k670M679M476O225J0417Q204M419J4502J9965
15250A24823J5728R199L548j077o27j0384j3617j3449j2348j2775j0235n600q606
15237F4580j402k349k863m018j143O67J448k520m83L791O669L323J83K992L47
15222F9222K500M847M081O72l233L51j112m745k803O956L980k002K397L292j015
15207H3388j719J575J803O922N497J474M954J675J902N561M179l78K216j699L266
15192A20616J35L36M754K662P25j145J785J441J979N018K752P275Q058J4035J1857
$$ plain form
15294 30432 28860 27861 30126 31773 29996 28271 23018 23803 23103 27398 31999 35768 33869 29755 29858
15279 29858 33262 35891 37936 38757 42815 48716 51146 55370 59660 55731 53685 57328 60904 62153 59481
15264 59481 54765 51942 50014 56011 54606 51936 56615 61091 67316 77733 85937 90356 104858 124823
15250 124823 140551 149750 153298 152221 151594 141210 127593 114144 101796 89021 78786 73186 64580
15237 64580 63178 60829 57966 53948 52805 53472 54920 52400 51917 55708 62377 65700 65883 68875 69222
15222 69222 71722 76569 80650 81322 78089 78440 77328 72583 69780 76736 80716 78714 81111 84403 83388
15207 83388 81669 83244 85047 91969 97466 98940 103894 105569 107471 113032 117211 116833 119049 117350 120616
15192 120616 120751 121087 125841 128503 129228 128083 129868 131309 133288 138306 141058 148333 156391 170426 182283
15177A82283Q393J2582J3939J4104J1718J2612J6579J1857R256R029J2677J7564
15165C32593J3977J4142J1237J4276J9370J9930J4545K3542K2191K2531K5869
15154E34203K8339L1833L7990M1327N5136O3126O5674P5782Q4242R7704J13687
15143A229043J31813J56140J91415K33725K79866L33523M00228M67449N52744
15134C975946O54639P91137J009226J350643J908718K776751M012263N458655
15126B1937978O752331P508814P528560O756707N202313K939650K23808k544124
15118E6306037m937454o666815p545836p532285o748716n454341m024410k812949
15110A0583231j955375j411289j068158q53771p15017o12066n25301m54079l95022
$$ plain form
15177 182283 190676 203258 217197 231301 243019 255631 272210 284067 293323 302352 315029 332593
15165 332593 346570 360712 371949 386225 405595 425525 440070 463612 485803 508334 534203
15154 534203 562542 594375 632365 673692 728828 791954 857628 933410 1017652 1115356 1229043
15143 1229043 1360856 1516996 1708411 1942136 2222002 2555525 2955753 3423202 3975946
15134 3975946 4630585 5421722 6430948 7781591 9690309 12467060 16479323 21937978
15126 21937978 28690309 36199123 43727683 50484390 55686703 58626353 58850161 56306037
15118 56306037 51368583 44701768 37155932 29623647 22874931 17420590 13396180 10583231
15110 10583231 8627856 7216567 6148409 5294638 4579621 3967555 3442254 2988175 2593153
15101B593153l36259k79030k27566j88817j58295j29133j08496r7180q5405p7261
15091I05711o5872n7174n5605n4057l9429l8617l7497l3704l1806k7126l1882
15080D32942k9523k4351k0485k3801k0872j7673j6356j5784o210p387o193n996
15068B38311p242l389k719o74r475o554n782Q67M990k745j0471p291k285l977
15054A81564r164r392o502j2488j1777j0513j1081n781k165p01k493j415j255
15041I6837K716k498j975Q88j870L042N22k261j192k765p136k620k644p469l992
15026F7583k998l930j514l1j830m743j587J595J264k832M981m23O58O00K29j791
15010E5231k132k301m111m179k88J620K633j512k798j511n822j0455r122l370
$$ plain form
15101 2593153 2256894 1977864 1750298 1561481 1403186 1274053 1165557 1068377 982972 905711
15091 905711 839839 782665 727060 673003 633574 594957 557460 523756 491950 464824 432942
15080 432942 403419 379068 358583 334782 313910 296237 279881 264097 257887 250500 244307 238311
15068 238311 231069 227680 224961 224287 214812 208258 202476 203343 208333 205588 195117 187826 185541 181564
15054 181564 172400 163008 156506 144018 132241 121728 110647 104866 102701 102000 99507 98092 96837
15041 96837 99553 97055 95080 95968 94098 97140 97662 95401 94209 91444 84308 81688 79044 71575 67583
15026 67583 64585 60655 59141 59110 57280 52537 50950 52545 53809 50977 55958 55535 56193 56793 57022 55231
15010 55231 53099 50798 46687 42508 42220 43840 46473 44961 42163 40652 34830 24375 15253 11883
14996A1883j302n877j684k600j167L023J596J346M947Q220r47L46L172J660n405
14981A7211n726J630K084l079p780j118l875n134k416J726n436q50Q145O982N846
14966H210L148K502K390M269K266j064l841j483m533j721M813J629K114L355l659
14951A8395j116N528P49J8m79J660l053l218R68l4K751q82l261p442m711l967
14935A906m24j511k22O27K953J795J824L360M823o77p80J324Q00L113Q3Q92l227
14918A6659P16k282p41L161O65M640l787j043J007L073m95p923l207N836J101
14903A7380k54k986o04m843k155p52J273j103L362O513L377j762k951l437N92
14888A1650K65k316P72K542J274j891j481M43J286j912l240j622J832M692k380
$$ plain form
14996 11883 10581 4704 3020 420 -747 2276 3872 5218 10165 18385 17438 17784 20956 22616 17211
14981 17211 11485 13115 15199 12120 4340 3222 -653 -5787 -8203 -6477 -11913 -12763 -4618 2364 8210
14966 8210 11358 13860 16250 20519 22785 21721 17880 16397 11864 10143 14956 16585 18699 22054 18395
14951 18395 17279 22807 23556 23574 23095 24755 21702 18484 19452 19418 22169 21287 18026 10584 5873 1906
14935 1906 1482 -29 -251 376 3329 5124 6948 10308 15131 14454 13674 14998 15798 18911 18994 19886 16659
14918 16659 17375 15093 14352 17513 18178 22818 19031 17988 18995 22068 21573 13650 10443 16279 17380
14903 17380 17126 14140 13536 8693 6538 5786 7059 5956 9318 15831 19208 17446 14495 11058 11650
14888 11650 11915 9599 10371 12913 14187 12296 10815 11258 12544 10632 7392 5770 7602 12294 9914
14873I914l267M51M585N808M82j683k833o73J530N72l617l739j419k073k1l36
14857C681Q19j08l606J282L368j765l345K460L095M229m55J064k699k26L455p24
14841A0525j663P79k382K489J536j582k217j005P90k09j746J813P76K20j20M44
14825H448k640l528RK504j047R72L48Q30L433m59Q54J719K911n09j638O74j19
14808A2762p501m812J082L825o77l745J247Q61N190j178k831j070l134L367N654
14793I040k337m243n07M574J693L834k863J897K842m01j802k120k82M128O01k714
14777A1340l508j10o99m639q71K483p5m23j478l88M048m58M07m3l148o449K674
14760a337O351o61K888k355j67k695k201m66j003j896K472P178J586n902k5N25
$$ plain form
14873 9914 6647 7098 11683 17491 17973 16290 13457 12784 14314 14886 11269 7530 6111 4038 4017 3681
14857 3681 4500 4392 786 2068 5436 3671 326 2786 5881 10110 9655 10719 8020 7794 11249 10525
14841 10525 8862 9641 7259 9748 11284 9702 7485 6480 7270 7061 5315 7128 7904 8124 8004 8448
14825 8448 5808 2280 2289 4793 3746 4718 5066 5896 9329 8870 9724 11443 14354 13845 12207 12881 12762
14808 12762 5261 449 1531 5356 4679 934 2181 3042 8232 7054 4223 3153 19 3386 9040
14793 9040 6703 2460 1953 6527 8220 12054 9191 11088 13930 13529 11727 9607 9325 13453 14054 11340
14777 11340 7832 7722 7023 2384 1513 3996 3921 3498 2020 1632 5680 5222 5629 5586 2438 -4011 -1337
14760 -1337 5014 4353 7241 4886 4719 2024 -177 -643 -1646 -3542 -1070 6108 7694 1792 1767 2292
14744B292L512J56Q23L950j939k342K189k615n265j147R83L963J474K382o02r89
14728F825J275l259j50J977k63p80l546j46k306L65j958L400L902M01l262o299
14712c824k796M335M571L646K430m17j628j366J119J572j866k274m559P61J037
14697G41l11K513L717J775J513l085j166k646J075N24J145P80j011q41M19n96
14681D546k276j049J142K088P282N309J663J564j582L869O013M941L632N926J872
14666D4940P392J4315J7256J8135L0107L8043L6993L7037K8596J8732O321r656
14654B88211j9801k7522l0917l5683l8073l1116j9203j5158j0856j0109p340o237
14642C6196m525m973k329l872j36k351p894l379k023k671K10R9J873K039L985
$$ plain form
14744 2292 5804 5960 6783 10733 8794 6452 8641 6026 761 -386 597 4560 6034 8416 7814 6825
14728 6825 8100 4841 4691 6668 6405 5625 2079 1933 -373 -8 -1966 1434 5336 5737 2475 -3824
14712 -3824 -6620 -2285 2286 5932 8362 7945 6317 4951 6070 7642 5776 3502 -1057 -296 741
14697 741 430 2943 6660 8435 9948 6863 5697 3051 4126 4650 5795 6575 5564 4723 5142 4546
14681 4546 2270 1221 2363 4451 11733 17042 18705 20269 18687 22556 28569 33510 37142 43068 44940
14666 44940 52332 66647 83903 102038 132145 170188 207181 244218 272814 291546 297867 288211
14654 288211 268410 240888 209971 174288 136215 105099 85896 70738 59882 49773 42433 36196
14642 36196 31671 26698 24369 20497 20361 18010 10116 6737 4714 2043 2253 2352 4225 6264 10249
14627A0249o325m956J283L204M72m440K095l572J427K900k958j17K039M68K63
14612B032q09k736j805K329R59j666J905J098J571J461k330j570L86K729N41j480
14596B615l288l158N06L694K341J510k531K269l161o495J023J544M22j08j063
14581c880j802n1K178k505l119j359J528M512L661J944K251J610l552m816J608
14566a792J287K753Q9K482j402o664q32M588j766J62j420M65N771O13l506l501
14550b673J267M13k658j80M765K140m686j927P892K128k070n677n271k073N117
14535c493L573J238K55L89k591m357k02N472K068j139K77q8J469j104n244K978
14519d99N66m488n634o29M217M818N2j197J517J548l177l25K250K62k028L201
$$ plain form
14627 10249 3924 -1032 251 3455 3927 -513 1582 -1990 -563 2337 -621 -738 1301 1769 2032
14612 2032 1223 -1513 -3318 -989 -30 -1696 209 1307 2878 4339 2009 439 825 3554 4095 2615
14596 2615 -673 -3831 -3325 369 2710 4220 1689 3958 797 -5698 -4675 -3131 -2709 -2817 -3880
14581 -3880 -5682 -5733 -3555 -6060 -9179 -10538 -9010 -4498 -837 1107 3358 4968 1416 -3400 -1792
14566 -1792 -505 2248 2337 4819 3417 -3247 -4079 509 -1257 -1095 -2515 -2050 3721 4334 828 -2673
14550 -2673 -1406 -993 -3651 -3831 934 3074 -1612 -3539 4353 6481 4411 -1266 -6537 -8610 -3493
14535 -3493 80 1318 1573 1962 -629 -4986 -5188 284 2352 1213 1490 1402 2871 1767 -3477 -499
14519 -499 67 -4421 -10055 -10684 -6467 -1649 -1597 -2794 -1277 271 -2906 -3231 -981 -719 -2747 454
14503D54k671M915M697j031k38j912k457j367n714j516O52K313M349k09j790J843
14487C18K698K914m572k490P74l913o54N52o99L971J679P67j678j618N94M244
14471B887k076m26r97R00R24k115J424j015n8k82k885k826n319l672N634P033
14455b869m5r37K498j23m37k010K700L144%K504L284l039n356k736j702j186l147
14438i457K210J333J474M471J818k626O351j177n225l823l25M208m71k092j128
14423d459K376k051o33K498J381l349q30N687J616k097P364J184l193r96k005
14408B493l71k326k870j947j29J130K443k743n62J916J674J782j668J044n34j752
14392b420n86L202J638j850j155m171l56L54o31k16j458J194K527K680L738j159
$$ plain form
14503 454 -2217 2698 7395 6364 6126 4214 1757 390 -5324 -6840 -6188 -3875 474 265 -1525 318
14487 318 3016 5930 1358 -1132 -358 -4271 -4925 -4373 -5072 -1101 578 1345 -333 -1951 -1357 2887
14471 2887 811 385 -612 288 1212 -903 521 -494 -552 -834 -3719 -6545 -11864 -15536 -9902 -2869
14455 -2869 -2914 -3851 -1353 -1476 -1913 -3923 -1223 1921 1921 4425 7709 4670 -686 -3422 -5124 -6310 -9457
14438 -9457 -7247 -5914 -4440 31 1849 -777 5574 4397 -828 -4651 -4976 -768 -1239 -3331 -4459
14423 -4459 -2083 -4134 -4767 -2269 -888 -4237 -5067 620 2236 139 7503 8687 5494 4498 2493
14408 2493 2122 -204 -3074 -5021 -5150 -4020 -1577 -4320 -4882 -2966 -1292 490 -1178 -134 -668 -2420
14392 -2420 -3006 196 1834 -16 -1171 -5342 -5698 -5344 -5975 -6191 -7649 -6455 -3928 -1248 2490 1331
14376A331j21l033N05P86j253p36J783j211j053k26J004n75M44l647L197j139
14360c944j623J017n81Q84K399r88m570P2L549O85j555L627K875K955O2J42m100
14343I06l376K381M241m44m743o362J406l653K829J935K478K009k280j877j864
14328f414M51Jj108J36R34M553M03k426M9Q05k473J996L413j558o215k847K659
14311g641L780J83j510j294J225K60P21N27n355K061J013P08L466J833L193L349
14295F519l931k70M178l880l982L68j851K7L53J277J5r07K818J010m224j374K817
14278a037J876q84l06o787M4M220j653Q80k532j753j529j074M809M701N96k517
14262b946l622j967L335K348j75J229K707k829lL74j985O83k171k026L063K109
$$ plain form
14376 1331 1210 -1823 -1318 -532 -1785 -2521 -738 -1949 -3002 -3228 -2224 -2799 -2355 -6002 -2805 -3944
14360 -3944 -5567 -4550 -5131 -4247 -1848 -2836 -7406 -7334 -3785 -3100 -4655 -1028 1847 4802 4864 5006 906
14343 906 -2470 -89 4152 3708 -1035 -7397 -5991 -9644 -6815 -4880 -2402 -393 -2673 -4550 -6414
14328 -6414 -5963 -5962 -7070 -6934 -6000 -1447 -1044 -3470 -3421 -2616 -5089 -3093 320 -1238 -7453 -10300 -7641
14311 -7641 -3861 -3678 -5188 -6482 -5257 -4997 -4276 -3749 -9104 -7043 -6030 -5322 -1856 -23 3170 6519
14295 6519 2588 2318 6496 2616 -1366 -998 -2849 -2822 -2469 -1192 -1177 -2084 734 1744 -2480 -3854 -1037
14278 -1037 839 -45 -351 -7138 -7094 -2874 -4527 -3647 -6179 -7932 -9461 -10535 -5726 -1025 -429 -2946
14262 -2946 -6568 -8535 -5200 -2852 -3027 -1798 909 -1920 -1923 -1549 -3534 -2851 -5022 -7048 -3985 -1876
14246a876P49j351K6j50N73j691K691K87K452L679O109N65m840k493j439l508
14230b17k780K76P55N759J707k443O84n609l865j424O54J79K051M458j84Q52L329
14213D182j446n419k970J819M170j124J780r60r1j932k898k018J384p6K861J578
14197a160n07j756k020K685J298j835L95K66J17O94L396K48k433l175J967K613
14181G93Q12L295m684l692K149N18l808j084L661J648j812k788k186J394J918
14166c866k671J78J547J359K478N23J484k927j515O21K256J976l324m212J448
14151d645J436N286K051m450p480K326O055J371j316k682m818j835L552L414m84
14136b219k273J3J687j190Q05j368m731p03J750K812j519j36j49J09M543L0m249
$$ plain form
14246 -1876 -1127 -2478 -2452 -2602 -2029 -3720 -1029 -742 1710 5389 11498 12063 7223 4730 3291 -217
14230 -217 -2997 -2721 -1966 3793 5500 3057 3741 -1868 -5733 -7157 -6503 -6324 -4273 185 1 853 4182
14213 4182 2736 -2683 -5653 -3834 336 -788 992 32 -59 -1991 -4889 -6907 -5523 -5599 -2738 -1160
14197 -1160 -1667 -3423 -5443 -2758 -1460 -3295 -2900 -2634 -2517 -1823 1573 1821 -612 -3787 -1820 793
14181 793 1605 4900 216 -3476 -1327 -809 -4617 -5701 -2040 -392 -2204 -4992 -7178 -5784 -3866
14166 -3866 -6537 -6359 -4812 -3453 -975 -452 1032 -1895 -3410 -2789 -533 1443 -1881 -6093 -4645
14151 -4645 -3209 2077 4128 -322 -7802 -5476 579 1950 634 -2048 -6866 -8701 -5149 -1735 -2219
14136 -2219 -4492 -4479 -2792 -3982 -3177 -4545 -9276 -9979 -8229 -5417 -6936 -7072 -7221 -7112 -2569 -2539 -6788
14119f788k130M911J475m552l215J672L56L046L595J341J960k700j599o08l12
14104c548R00J816J745K085k141m03p80l289j484j617J220L123l88K346j223O86
14088i52j04k125k2Q97K68l075j566l279j091O614P371Q68p114m020N566J956
14072A92n635l572Q68J704J591O261o85J190R75j718m702j218K22K305N15R81
14056g26J503j729J43R30L099L206k091j33J972m734k187n783O03M464L249K65
14040B051n78K66m142k487K678L091K28R66j861J142m194Q20Q15j102K495l002
14024b814n51nJ173K325o16j269N40L265J661j275l75k455j573o269J28N408p87
14007c489j035M90L693J76m189q06N17N941J129q112j768K101K263K144K29R66
$$ plain form
14119 -6788 -8918 -4007 -2532 -7084 -10299 -8627 -8271 -5225 -1630 -289 1671 -1029 -2628 -3236 -3548
14104 -3548 -2648 -832 913 2998 857 454 -326 -3615 -5099 -6716 -5496 -2373 -2761 -415 -1638 -952
14088 -952 -1056 -3181 -3203 -2306 -2038 -5113 -6679 -9958 -11049 -4435 2936 3804 -3310 -7330 -1764 192
14072 192 -5443 -9015 -8147 -6443 -4852 1409 724 1914 2889 1171 -3531 -4749 -4527 -2222 -1707 -726
14056 -726 777 -952 -809 121 3220 6426 4335 4202 6174 1440 -747 -6530 -5927 -1463 1786 2051
14040 2051 1473 1739 -2403 -4890 -2212 879 1107 2073 212 1354 -2840 -2020 -1205 -2307 188 -2814
14024 -2814 -3365 -3370 -2197 128 -488 -1757 -1217 2048 3709 2434 2059 -396 -1969 -8238 -8110 -2702 -3489
14007 -3489 -4524 -4034 -341 -165 -4354 -5160 -4643 1298 2427 -5685 -7453 -5352 -3089 -945 -716 250
13991B50N77l610l789O21J244J776M604L500k049l764n182j346L162O550j379
13976A165k268j324L534l772k970l840r39L450L98J823K026k16p6K489K693j533
13960F40j784k559J00P95j813k145K527k63q98K024L169j000r98j78Q56k522l508
13943g557J225O147J484j440J326k53k319M271m034l369K650J848l525J231J079
13928a236J82L991n187m98J399J691K66m480l13j412K343L335J000k511L26L521
13912B417k100j041j970j865p15J095J784j584J496m2j169L441l05K317J667J099
13896D525J924j054j734N83o21j489k693p68n20j421R42j402l214j79K169M29
13880d523J406J087l268j797J916J465R43J016L867l043p412J300J679j381k46
$$ plain form
13991 250 827 -2783 -6572 -5951 -4707 -2931 1673 5173 3124 -640 -5822 -7168 -4006 2544 1165
13976 1165 -1103 -2427 1107 -2665 -5635 -9475 -10414 -6964 -6566 -4743 -2717 -2933 -3009 -520 2173 640
13960 640 -1144 -3703 -3603 -2808 -4621 -6766 -4239 -4502 -5400 -3376 -207 -1207 -2205 -2383 -1527 -4049 -7557
13943 -7557 -6332 -185 1299 -141 1185 932 -1387 2884 -1150 -4519 -1869 -21 -3546 -2315 -1236
13928 -1236 -1054 2937 -2250 -2748 -1349 342 608 -3872 -4185 -5597 -3254 81 1081 -1430 -1104 2417
13912 2417 317 -724 -2694 -4559 -5274 -4179 -2395 -3979 -2483 -2525 -3694 -253 -558 1759 3426 4525
13896 4525 6449 5395 3661 4244 3623 2134 -559 -1327 -1847 -3268 -2326 -3728 -6942 -7121 -4952 -4523
13880 -4523 -3117 -2030 -5298 -7095 -5179 -3714 -2771 -1755 2112 -931 -8343 -7043 -5364 -6745 -6991
13865f991k80R57r51r23L518R04j385l469K787J415l081J071J313K198K915j871
13849a873k861k391j072K423P603L112K48p147m852n190K529K605k969M494O233
13834H92j662l464j976L887L759L68l641l169q33L306J594l6L023l059m260k979
13818h250M363R39K241j279j689j475j87k886k891M277J294J114J576J37L540
13803H24M57k141M17K29k0J009j400l173q05L930J646R63j247K060K312K418N373
13786A2852j309j1999m359K73Q58L154k30L31J181l594k794J070j175L892O491
13771D642L02m069j307j171Jl337J624M65j058K335j66m923J438L10P30o74R37
13754c921K837L161m63k364n97k199j818P19K309K709j618j914q6J216j76K723
$$ plain form
13865 -6991 -7271 -6314 -7265 -8188 -4670 -3766 -5151 -8620 -5833 -4418 -7499 -6428 -5115 -2917 -2 -1873
13849 -1873 -4734 -7125 -8197 -5774 1829 4941 5189 -1958 -6810 -12000 -9471 -6866 -9835 -5341 892
13834 892 -770 -4234 -6210 -2323 1436 1804 -1837 -5006 -5839 -2533 -939 -975 2048 -1011 -5271 -8250
13818 -8250 -3887 -2948 -707 -1986 -3675 -5150 -5337 -8223 -11114 -6837 -5543 -4429 -2853 -2716 824
13803 824 1281 -860 -443 -214 -234 775 -625 -3798 -4603 -673 973 1936 689 2749 5061 7479 12852
13786 12852 11543 -456 -4815 -4542 -3684 -530 -760 -429 752 -2842 -5636 -4566 -5741 -1849 4642
13771 4642 4944 875 -432 -1603 -1602 -4939 -3315 -2850 -3908 -1573 -1739 -6662 -5224 -4914 -4184 -4858 -3921
13754 -3921 -1084 2077 1614 -750 -1347 -3546 -5364 -4645 -2336 373 -1245 -3159 -3245 -2029 -2205 518
13738E18M93j582p51m145j479K61M265O20r00l709J579K724J74j292l819j97L687
13721c553K037r0J888L781o22m62J048R49M6m408l826j895L543R81K135K370m18
13704C504m598q49J779j343r35M08j906j16J298m410L403J922j228m630J493N378
13688h30J211m07j534Q86j451l379j792q39k733J334M127K774M50K332j267J356
13672B38K455P22J392j116k980j726j122n08P74L680L421j241j716m332k176K174
13656b061J266K188M26k78q75J638J60J074l76k801k841j406n69J468K039J103
13640A55j320l052p72L235L540Q26k629k072P86M604L152l817m047J673Q9j397
13624a046L655m124k133j894k43j373j878j702Q61N489q99K878L84J03M247Q62
$$ plain form
13738 518 1011 -571 -1322 -5467 -6946 -6685 -2420 -1800 -2700 -6409 -4830 -2106 -1932 -3224 -7043 -7240 -3553
13721 -3553 -1516 -1606 282 4063 3441 2979 4027 4976 5022 614 -3212 -5107 -1564 -583 1552 3922 3504
13704 3504 -1094 -1943 -164 -1507 -2442 -2034 -3940 -4056 -2758 -7168 -3765 -1843 -3071 -7701 -6208 -830
13688 -830 381 -26 -1560 -674 -2125 -5504 -7296 -8135 -10868 -9534 -5407 -2633 -2183 149 -1118 238
13672 238 2693 3415 4807 3691 711 -1015 -2137 -2645 -1871 1809 5230 3989 2273 -2059 -4235 -2061
13656 -2061 -795 1393 1819 1541 666 2304 2464 3538 3162 361 -2480 -3886 -4455 -2987 -948 155
13640 155 -1165 -4217 -4989 -1754 1786 2612 -17 -2089 -1303 3301 6453 2636 -1411 262 351 -1046
13624 -1046 2609 -1515 -3648 -5542 -5785 -7158 -9036 -10738 -9877 -4388 -5287 -2409 -2025 -1922 2325 3187
13608C187R88L558k727o322k755m62j591j54K319L717q62m781j615O65J052K145
13592c638r53l254K873l641J905O81M228M316K172l659k411O91P2k091J345L371
13576B007K673j901m561L60K627n096k346J464J965J218L057O563J158l189l002
13561B997j318m497J634p1N31K897M89k826J811m72p21Q6j072j303M321M24j730
13544A180j417L2l23l073K36M228l2N2L86j607K618R96m777n304P98O04Q78K420
13526b105L455j0M98K69L862j841m69J6L86L92k542n80j445l913l533l696K70
13509a0986L79K930K215K841K135O601J118m270l580l81L089J98k378j511J543
13494e7l687k982k358J398j007L155J537R34L187L31k001N251P49j192K522q25
$$ plain form
13608 3187 4175 7733 5006 -1316 -4071 -4533 -6124 -6278 -3959 -242 -1104 -5885 -7500 -6835 -5783 -3638
13592 -3638 -4591 -7845 -4972 -8613 -6708 -6027 -1799 2517 4689 1030 -1381 -690 -618 -2709 -1364 2007
13576 2007 4680 2779 -1782 -1422 1205 -3891 -6237 -4773 -2808 -1590 1467 8030 9188 5999 2997
13561 2997 1679 -2818 -1184 -1255 -724 2173 2662 -164 1647 1175 454 540 -532 -1835 2486 2910 1180
13544 1180 -237 -205 -528 -3601 -3365 863 831 883 1269 -338 2280 3276 -1501 -6805 -6007 -5403 -4525 -2105
13526 -2105 1350 1340 1838 2107 5969 4128 3659 3675 4061 4453 1911 1331 -114 -4027 -7560 -11256 -10986
13509 -10986 -10607 -7677 -5462 -2621 -486 6115 7233 2963 -617 -998 2091 2289 -89 -1600 -57
13494 -57 -3744 -6726 -9084 -7686 -8693 -5538 -4001 -3067 120 451 -1550 3701 4450 3258 5780 4955
13478D955l458K044M070j302o83J09k033k136K146O75j397k678l597q36j218j098
13462f437k530o62K946N259k67O6O064k39J682j111n824j536K505L084L898L221
13446A0119O9j679p330m853K024k08r84j592k206J587K711n11K163M530K011j825
13430D026k179K172l827j729J223j551m477L022j933k982N346K417Q80k097o88
13415b377L076o13r33L985L261k691m686l594K289J265k380K552j01J398J11j855
13399a293J051l479l73K016K359P88k80N67q34J082K9L002K710K384l194q40l11
13382E384j214j943K021M034J230j820K71j221l137K85j386k298j261m352k032
13367g439N330J856l922n566K20J106L367L631m28k429O884J773m984k240k922
$$ plain form
13478 4955 1497 3541 7611 6309 5626 5735 3702 1566 3712 4387 2990 312 -3285 -4121 -5339 -6437
13462 -6437 -8967 -9629 -6683 -1424 -1691 -1625 4439 4200 5882 4771 -1053 -2589 -84 3000 6898 10119
13446 10119 10188 8509 1179 -3674 -1650 -1858 -2842 -4434 -6640 -5053 -2342 -2853 -690 3840 5851 4026
13430 4026 1847 4019 192 -1537 -314 -1865 -6342 -3320 -5253 -8235 -2889 -472 408 -1689 -2377
13415 -2377 699 86 -847 3138 6399 3708 -978 -4572 -2283 -1018 -3398 -846 -947 451 562 -1293
13399 -1293 -242 -3721 -4094 -2078 281 1069 789 1356 522 1604 1633 4635 7345 9729 6535 5695 5384
13382 5384 4170 2227 4248 8282 9512 7692 7963 6742 3605 3890 2504 206 -1055 -5407 -7439
13367 -7439 -2109 -253 -4175 -9741 -9521 -8415 -5048 -1417 -1845 -4274 2610 4383 -601 -2841 -5763
13352e763k090L909J294K50n59L55J587j430N133L009k361k404n39K080J14K69
13336B854k218j667j734q5j899J462k199k353K205O789L91K16K501k995l122l16
13320b170m591p5K185L557r97J233K73m448k14Q24p62l49M991J169J843j632l806
13303b969k97Q04J131K192l98l100j499M696J30j2k98o292m162Q80P310M176k24
13286B068m382l827J683K32l27J496J173J262r15j682M749j77k187k939n466J25
13270i114O532J538J799j109q68J756P83L950m61l374l451o13K844J548m021n6
13254b317m09K816J517J753j418n666k390O37j421K955L251m200n146J115J240
13239g683M8j261L866J383k27j739L922O08m4o64l234J745K873k804l122l366
$$ plain form
13352 -5763 -7853 -3944 -2650 -2400 -2959 -2604 -1017 -2447 2686 5695 3334 930 391 2471 2585 2854
13336 2854 636 -1031 -2765 -2850 -4749 -3287 -5486 -7839 -5634 1155 1546 1762 4263 1268 -1854 -2170
13320 -2170 -6761 -6836 -4651 -1094 -2091 -858 -585 -5033 -5247 -4423 -5185 -5534 -543 626 2469 837 -2969
13303 -2969 -3266 -2462 -1331 861 463 -2637 -4136 560 690 678 380 -5912 -10074 -9194 -1884 2292 2068
13286 2068 -2314 -6141 -4458 -4226 -4553 -3057 -1884 -622 -1537 -3219 1530 1353 -834 -3773 -9239 -9114
13270 -9114 -2582 -1044 755 -354 -1222 534 1317 5267 4806 1432 -2019 -2632 212 1760 -2261 -2317
13254 -2317 -2726 90 1607 3360 1942 -3724 -6114 -5477 -6898 -3943 -692 -4892 -10038 -8923 -7683
13239 -7683 -7635 -8896 -5030 -3647 -3874 -5613 -1691 -1083 -1127 -1791 -5025 -3280 -407 -3211 -6333 -9699
13223i699L115j56K72R47R13j060J552N9K758K519K647Q99k668l498j817J140
13207b077L871r71k122J76K740J282k673l858R97N254O93n231q070m447O116K13
13191h107N185J190k24k111K01k369m524j779L27J735L217N481J275M237J881
13176E615l638j15n689j910L705L321j130k029K486L861J907L667N39O37k482
13161H745m57l882k81J278j926K9j091l695j233M077K899J998l949j404j992j839
13145b723m77J095K276k99j813j157J68J029L18K804q04j326j796j955J769j653
13129d544j122l58o61n40N008P812l963n5l143m395q62L456j529J374L144j302
13113a680J613k030N07M218J407K36J922K907r77m999o161j772K524K672j348
$$ plain form
13223 -9699 -6584 -6740 -6468 -5521 -4608 -5668 -4116 -4057 -1299 1220 3867 4766 2098 -1400 -3217 -2077
13207 -2077 1794 823 -1299 -1123 1617 2899 226 -3632 -2635 2619 3312 -1919 -9989 -14436 -8320 -8107
13191 -8107 -2922 -1732 -1956 -4067 -3866 -6235 -10759 -12538 -12211 -10476 -7259 -1778 -503 3734 5615
13176 5615 1977 1862 -3827 -5737 -2032 1289 159 -1870 616 4477 6384 10051 10590 11227 8745
13161 8745 8288 4406 4125 5403 3477 3506 2415 -1280 -2513 1564 4463 6461 2512 1108 -884 -2723
13145 -2723 -3200 -2105 171 -128 -1941 -3098 -2930 -1901 -1583 1221 417 -909 -2705 -4660 -2891 -4544
13129 -4544 -5666 -6024 -6685 -7225 -2217 5595 1632 1577 -1566 -5961 -6823 -3367 -4896 -3522 -378 -1680
13113 -1680 -67 -2097 -1590 2628 4035 4271 6193 9100 8123 3124 -3037 -4809 -2285 387 -961
13098i61l001l370J345M631J564m087Q48Q92m667J454L85J264J821k165l632M785
13082b894Q91K426J630q80l04p25j446N95J260R09O98q34j994R90j838l721m322
13065i559j67L974P435J313k433j727r15N425M228L21n629J453K668j67k16j276
13049D728k859j54k858m70L204K792r94m144j529K063K64p28Q5p02j993LJ74k420
13031e538j00o65j446L646K379k802J496k554J870K59K53K838J438k563m36k253
13015d178o495m090J826K175L937M577L64j083r88o28K894K855K925J074j801
13000C364l57l745n723o00m336M46N753j670J286L744j249n00J212j595n99k698
12984g267k620j385L400L020K098l980n762J538O307j770o40J283o61r88q93j451
$$ plain form
13098 -961 -3962 -7332 -5987 -1356 208 -3879 -3031 -2139 -6806 -5352 -4967 -3703 -1882 -4047 -7679 -2894
13082 -2894 -2003 423 2053 1173 869 144 -1302 -707 553 1462 2160 1326 -668 322 -1516 -5237 -9559
13065 -9559 -9726 -5752 1683 2996 563 -1164 -2079 3346 7574 7895 2266 3719 6387 6220 6004 4728
13049 4728 1869 1715 -1143 -1613 1591 4383 3389 -755 -2284 -221 43 -685 -600 -1302 -3295 -3292 -3118 -5538
13031 -5538 -5638 -6303 -7749 -4103 -1724 -4526 -3030 -5584 -3714 -3455 -3202 -364 1074 -1489 -1925 -4178
13015 -4178 -10673 -14763 -12937 -10762 -6825 -2248 -1884 -2967 -3955 -4583 -1689 1166 4091 5165 3364
13000 3364 3007 -738 -6461 -7061 -11397 -10951 -5198 -6868 -5582 -1838 -3087 -3587 -2375 -3970 -4569 -7267
12984 -7267 -9887 -11272 -7872 -4852 -2754 -6734 -12496 -10958 -4651 -6421 -7061 -5778 -6439 -7427 -8320 -9771
12968i771K873K849j745P90Q94J355j550K371L052K020R26j744L83n31l070k727
12952c625o33L560K187m12k954J110L0L989j611K210J609j751m479m409J401K714
12936a064K24k622k139j569K789l582j379L613L951q19j142n70K814J3Q08L016
12920B342L863j057q325l693J515J681R32j529N55K207p76l574K732J035J84L35
12904a573j076l50K054J011n644k710K970m59k783J238O13Q5K768L575q3l319
12888c683l408n15k81J579M317n9l668O05K590M451L425K360m049q062k701O327
12872g72l37n118J253rq23J261J542k468j554j254O758L772M892K015k265j580
12856E313m392k167n468J213J116J2K222j104j058k997j372N508M193L758n578
$$ plain form
12968 -9771 -6898 -4049 -5794 -5004 -4110 -2755 -4305 -1934 1118 3138 4064 2320 2703 2172 -898 -3625
12952 -3625 -4258 -698 1489 1077 -1877 -767 -737 3252 1641 3851 5460 3709 -770 -5179 -3778 -1064
12936 -1064 -840 -3462 -5601 -7170 -4381 -7963 -9342 -5729 -1778 -2597 -3739 -4309 -1495 -1482 -674 2342
12920 2342 6205 5148 -3177 -6870 -5355 -3674 -2742 -4271 -3716 -1509 -2285 -5859 -3127 -2092 -1908 -1573
12904 -1573 -2649 -2999 -945 66 -5578 -8288 -5318 -5777 -8560 -7322 -6709 -6624 -3856 -281 -364 -3683
12888 -3683 -7091 -7606 -7887 -6308 -1991 -2050 -5718 -5113 -2523 1928 5353 7713 3664 -4398 -7099 -772
12872 -772 -1109 -6227 -4974 -4983 -5806 -4545 -3003 -5471 -7025 -8279 -1521 2251 7143 9158 6893 5313
12856 5313 921 -1246 -6714 -5501 -4385 -4373 -2151 -3255 -4313 -7310 -8682 -3174 1019 4777 -801
12841h01L021R72Q12l299j869j68K96l045K686L04l370j306J057J995n52r90L220
12824a037k07m018n186K989J666L457O969p28m462l312K200K910K391j276k244
12809A12L25j412k045Q96M174j49l415l004P75p97M194M037k293m391L086m02
12793c09Q27L069J252n544m156j607M462J132K7j86L504n77k874j218P05r05k09
12776b607J990n353J15M906K986M69P05N01l972j428l057O728L189n819k736M39
12760b944J993k253j472M94n465J704M823K686k70K02J633k337l28R89K050m961
12744c456n22K636J061n18m168R9K394l8K66j9j165j242K660O88J012j521q14
12727b647P34l58%J648j45l511q79l037k152J550m504K487P611L078L520n61o784
$$ plain form
12841 -801 2220 3192 4004 705 -1164 -1332 -1036 -4081 -1395 -1091 -4461 -5767 -4710 -2715 -3267 -4257 -1037
12824 -1037 -1244 -5262 -10448 -7459 -5793 -2336 4633 3905 -557 -3869 -1669 1241 3632 2356 112
12809 112 437 -975 -3020 -2124 2050 1901 -1514 -4518 -3743 -4540 -346 3691 1398 -2993 93 -309
12793 -309 518 3587 4839 -705 -4861 -6468 -2006 -874 -847 -1033 2471 1894 -980 -2198 -1493 -2398 -2607
12776 -2607 -617 -5970 -5855 -949 2037 2506 3211 3712 -260 -1688 -4745 1983 5172 -647 -3383 -2944
12760 -2944 -951 -3204 -4676 -4182 -9647 -7943 -3120 -434 -704 -502 1131 -1206 -1534 -545 1505 -3456
12744 -3456 -3978 -1342 -281 -799 -4967 -4868 -2474 -2512 -2246 -2265 -3430 -4672 -2012 -1324 -312 -1833 -2647
12727 -2647 -1913 -2271 -2271 -623 -768 -4279 -5158 -8195 -10347 -8797 -13301 -10814 -3203 -125 3395 2834 -3950
12710c950j580j961k857Q83J484M245K306J302J054j018k415l050K428m4k259
12695e432L383M571k648M64J087Q23m49l335l31J199K213J788k796n210l439J566
12679f546L050J718M386j759q24l536l084p60J773o5l041M563M806l152p38K260
12663i49J453m11K017k440J23n906J071J818J486k198p46n54l93P47R23K147L595
12646A783n16k026j04l475J461J023L622P05K22R93K31k210K580J685K1P49o56
12629F088j103n510l681l9K5l728L660K045n877K416M896L491n441j912k21j816
12613f707L156K822m40j463p8J352M8P31O878N854J233J048R866P887m61q329
12597B3397q554n107k758j377k501m663m721j468M674N906L012l860K110M462
$$ plain form
12710 -3950 -5530 -7491 -10348 -9465 -7981 -3736 -1430 -128 926 -92 -2507 -5557 -3129 -3173 -5432
12695 -5432 -2049 2522 -126 338 1425 2248 1799 -1536 -1867 -668 1545 3333 537 -4673 -8112 -6546
12679 -6546 -3496 -1778 2608 849 25 -3511 -6595 -7355 -5582 -5647 -8688 -4125 681 -2471 -3209 -949
12663 -949 504 93 2110 -330 -207 -6113 -5042 -3224 -1738 -3936 -4682 -5236 -5629 -4882 -3959 -1812 1783
12646 1783 1267 -759 -863 -4338 -2877 -1854 1768 2473 2695 3688 3919 1709 4289 5974 5995 6744 6088
12629 6088 4985 -525 -4206 -4245 -4220 -7948 -4288 -2243 -8120 -5704 -808 2683 -2758 -4670 -4891 -6707
12613 -6707 -3551 -729 -1169 -2632 -2710 -1358 -1310 -579 6299 12153 13386 14434 24300 32187 31726 23397
12597 23397 14843 9736 6978 5601 3100 -1563 -6284 -7752 -3078 2828 5840 1980 4090 8552
12583H552K120k401l568n92K372j274l848J37J317L431O42K404M31M484L787N285
12567B3279P842J437l279l866p760l503l79M044R430J0659K4717K7325J3787j0809
12553I2924k6582k0673j1337r741o429l391N53k275R15l031m575J149L199K172
12539A2878j476k893k204r87k325L093R13K619J468NJ094K213K009P563J2039
12524C6009J7587K9529K4136n702k5237k3924r081r207n949j173P714J5787K4822
12511G5311K3105K099j5648k4797j9274j0871q239j124J144k03l390k280k480
12498A3353l003l460N022K148k452m777j960k295k139K831J196P79J965k127J993
12483G074O235O039J2312J8021K3038K5583N490k0034k8600j9612q287q349o296
$$ plain form
12583 8552 10672 8271 4703 4111 6483 5209 1361 1498 2815 6246 6888 9292 9723 14207 17994 23279
12567 23279 31121 32558 29279 25413 17653 14150 13771 17815 27245 37904 62621 89946 103733 92924
12553 92924 66342 45669 34332 24591 18162 14771 15324 13049 13964 10933 6358 7507 10706 12878
12539 12878 11402 8509 6305 5318 2993 6086 6999 9618 11086 11091 12185 14398 16407 23970 36009
12524 36009 53596 83125 107261 101559 76322 52398 43317 34110 28161 26988 34702 50489 75311
12511 75311 98416 100515 84867 60070 40796 29925 21686 20562 21706 21503 18113 15833 13353
12498 13353 10350 6890 11912 14060 11608 6831 4871 2576 437 3268 4464 5243 7208 5081 7074
12483 7074 13309 19348 31660 49681 72719 98302 103792 83758 55158 35546 27259 18910 12614
12470A2614P42J689M867Q680P887m225q240j491m171o201n682k616k616n129j787
12455e679j63J017K506L51j715k281L92O351N318l18m524m211J089J045k69L269
12439B178k530K958M405J0021Q794J831J320l223q401p50q128n825j175K521J194
12424E190n518k903k121Q31N145N36j489Q9r89K198m89k156j555m101L714M750
12408A132J557j688M501N05p711n905p66K440K156K241J802j105L477L019n68
12393E087k070p809k03M294J900J151O98J123P34m47n454n175j40J760K265j057
12377c343K290K513J025K793J203j043J022L435m186j396j421J200k457l87J621
12362B869r36j219j391j166J042K416k979n81l526J747J693k081k579m03K075
$$ plain form
12470 12614 13356 15045 19912 28592 36479 32254 24014 22523 18352 12151 6469 3853 1237 -3892 -5679
12455 -5679 -5842 -4825 -2319 -1968 -3683 -5964 -5572 779 6097 5779 1255 -2956 -1867 -822 -1091 2178
12439 2178 -352 2606 7011 17032 25826 27657 28977 25754 17353 16603 8475 2650 1475 3996 5190
12424 5190 -328 -3231 -5352 -4521 624 1160 -329 -240 -1229 969 480 -1676 -3231 -7332 -3618 1132
12408 1132 2689 1001 5502 6007 -1704 -7609 -8375 -5935 -3779 -1538 264 -841 2636 5655 5087
12393 5087 3017 -4792 -4995 -701 1199 2350 3048 4171 4905 4458 -996 -6171 -6311 -4551 -2286 -3343
12377 -3343 -1053 1460 2485 5278 6481 5438 6460 9895 5709 4313 2892 4092 1635 1248 2869
12362 2869 1933 714 -677 -1843 -801 1615 -1364 -1945 -5471 -3724 -2031 -4112 -6691 -7094 -5019
12347e019K594j405j884k963k14O90J121J206L808K36r17r39r34m4K549J462J284
12330F31r20j872N52j000J988n359l226M262K985R46k214l232J326L321j168l038
12314f018r54M62k4J509O3j598K695J506J541l07l098K659m6l683k188j524K708
12297f297j495J643L214r28k468Q85M000l03k147r36K261M758J486j650l532L338
12281A829j505k475k52j468J827P5K964l266m575l661J641M679K643k151l557
12266g252j252K291M820K39l221o89K679L177l384K665J082k438M83j024j292
12251c116m00j503L793L556l981J910L531J346j340k942j588o85K21j248p95j079
12235d320m08j367l01K38L190M56j832j533o73K134K232J233P63M16K396J96k845
$$ plain form
12347 -5019 -2425 -3830 -5714 -8677 -8891 -8201 -7080 -5874 -2066 -1830 -2747 -3686 -4620 -4664 -2115 -653 631
12330 631 -289 -2161 -1609 -2609 -621 -5980 -9206 -4944 -1959 -1013 -3227 -6459 -5133 -1812 -2980 -6018
12314 -6018 -6972 -6510 -6534 -5025 -4962 -6560 -3865 -2359 -818 -1125 -4223 -1564 -1610 -5293 -7481 -9005 -6297
12297 -6297 -7792 -6149 -2935 -3863 -6331 -5446 -1446 -1749 -3896 -4832 -2571 2187 3673 2023 -1509 1829
12281 1829 324 -2151 -2403 -3871 -2044 -1969 995 -2271 -6846 -10507 -8866 -4187 -1544 -3695 -7252
12266 -7252 -8504 -6213 -1393 -1154 -4375 -5064 -2385 792 -2592 73 1155 -1283 -800 -1824 -3116
12251 -3116 -3516 -5019 -1226 2330 -1651 259 3790 5136 3796 854 -734 -1419 -1198 -2446 -3241 -4320
12235 -4320 -4728 -6095 -6396 -6158 -2968 -2512 -4344 -5877 -6550 -4416 -2184 -951 -188 228 2624 2820 -25
12218b5l804q81P06J437p47Q02L083M499k887k626l132J137K869m247j497K688
12202b625J049j684k102o87K867M338k873m52j028j953N31j377L034O713J530
12187E281m267J956J72n730k199J752j181o3K987j702k030k031J372L767j606
12172c522N72j616l420j570J847O874P3j365j084n56J71O668O983K439o793m672
12156A029O91p02K54r04l88m249K590Q223j316n733k624M453P070J526n965o612
12140b657o837o62K652N493R06Q5l421j134k226K172K963k65J22M74L020L15K880
12123C880M070q67k186k413N70K04K29K663q52m433n718k439K95L86L235J06J111
12106b159L578K657Q76m489q05P26r10k931K257j082j069K285k079l75K488K541
$$ plain form
12218 -25 -3829 -4710 -4004 -2567 -3314 -2512 571 5070 2183 -443 -3575 -2438 431 -3816 -5313 -2625
12202 -2625 -1576 -3260 -5362 -6049 -3182 1156 -1717 -2169 -3197 -5150 -4619 -5996 -2962 3751 5281
12187 5281 1014 2970 3142 -2588 -4787 -3035 -4216 -4279 -1292 -2994 -5024 -7055 -5683 -1916 -3522
12172 -3522 -2950 -4566 -7986 -9556 -7709 -835 -762 -2127 -3211 -3767 -3596 3072 10055 12494 5701 1029
12156 1029 1720 1018 1272 368 -20 -4269 -1679 6544 5228 -505 -3129 1324 8394 9920 3955 -2657
12140 -2657 -9494 -10156 -7504 -2011 -1105 -1020 -4441 -5575 -7801 -5629 -2666 -2931 -2809 -2335 685 1000 3880
12123 3880 7950 7083 4897 2484 3054 3258 3487 6150 5298 865 -4853 -7292 -6997 -6611 -3376 -3270 -2159
12106 -2159 1419 4076 4952 463 -342 384 -526 -3457 -1200 -2282 -3351 -1066 -3145 -3520 -1032 1509
12090A509J691p51k812l564m498j164L75L09M592P13m18K447N79K850ok410j42
12073g00n662k898J031K193L107K403j213j401M543L021m057J423K792l426l290
12058b134r37m517l112K192N790R5K010K1N43O05m003k424J21J710N187J945l603
12041e11k260L089K497j644k285j079m806n709n37O920N032M023l621o752m36
12026h079N773k71N228J630r3j184l939K343j200l455J921K778J021l542j208
12011b277k804M581J267J02P48J171j497k212J935M450R67l319j307m825m086
11996g106K818M314j681m348j797O306K542q209m840M762j950K843K799J963L480
11981A896L547q12l108n066j883M372kj097K490J956L43J206n800m200J52N563
$$ plain form
12090 1509 3200 2449 -363 -3927 -8425 -9589 -9214 -8905 -4313 -3600 -4018 -1571 -992 1858 1852 -558 -700
12073 -700 -6362 -9260 -8229 -6036 -2929 -526 -1739 -3140 1403 4424 367 1790 4582 1156 -2134
12058 -2134 -3071 -7588 -10700 -8508 -2718 -2623 -613 -592 -49 556 -3447 -5871 -5750 -4040 1147 3092 -511
12041 -511 -2771 318 2815 1171 -1114 -2193 -6999 -12708 -13245 -6325 -1293 2730 -891 -7643 -8079
12026 -8079 -2306 -2577 2651 4281 4188 3004 -935 1408 208 -3247 -1326 1452 2473 -1069 -2277
12011 -2277 -5081 -500 767 869 1617 2788 1291 -921 1014 5464 6431 3112 1805 -3020 -7106
11996 -7106 -4288 26 -1655 -6003 -7800 -1494 1048 -7161 -12001 -7239 -9189 -6346 -3547 -1584 1896
11981 1896 5443 4631 1523 -3543 -5426 -1054 -1056 -2153 337 2293 2636 3842 -1958 -6158 -6006 -443
11965d43K96l894N504J864K532J073Q30L92n82K035o003k151K861k435L23K345
11949D547n275n574j65L564j766m93K172K828P79m144k776J23J256J946j152j71
11933d301J642j495j262o24M020L004k509K0j241j218m047K749J361j006r70m73
11917f350m823L201J98k071N617P373k310n584m78j95L248L447j974n907K0J845
11901d743j792L174K393j159l38j37P02J524J750o19J574M178Q5k492q88j318
11885A894l07L769k076m646m225J349J609M101J393k185j359J13K73m98K707J140
11869C052m281k780K574J561q99n84k413l848K106J595j999l42K266K913o89r92
11853b760J248k051l412K954K633j783K311j1J53k535m722L20j43r13k411L074
$$ plain form
11965 -443 -147 -4041 1463 3327 5859 6932 7762 8154 7572 9607 3604 1453 4314 1879 2202 4547
11949 4547 -728 -6302 -6467 -2903 -4669 -5162 -2990 -162 617 -3527 -6303 -6180 -4924 -2978 -4130 -4301
11933 -4301 -2659 -4154 -5416 -6040 -2020 984 -1525 -1505 -2746 -3964 -8011 -5262 -3901 -4907 -5877 -6350
11917 -6350 -11173 -7972 -7774 -9845 -4228 3145 835 -4749 -5227 -5422 -2174 1273 -701 -6608 -6588 -4743
11901 -4743 -6535 -3361 -968 -2127 -2465 -2602 -1900 -376 1374 755 2329 6507 6592 4100 3212 1894
11885 1894 1587 5356 3280 -1366 -5591 -4242 -2633 1468 2861 676 -683 -570 -297 -795 1912 3052
11869 3052 -1229 -4009 -1435 126 -773 -1357 -3770 -7618 -5512 -3917 -5916 -6258 -3992 -1079 -1768 -2760
11853 -2760 -1512 -3563 -6975 -4021 -1388 -3171 -860 -871 -718 -3253 -7975 -7655 -7798 -8711 -11122 -8048
11837h048N970J446k471j037J808j895J898M161j784n821k282k498L300N070r88
11822c171j027M56P76l443k174K060r40J162P001J398J143R48m16k256k085L163
11806B595J731m757k920j705M705M69q21k351Q63o083j705k332P4K188N032K638
11790b379j724n446N018N077M133M56J60m715l114o58R04R66k658n80J381L053
11774a26Q63k54q24p2j67j067o316j155o51M253N695j722k16j527n236l41O628
11757b235K649k080J926K70n47o50J000L607K066m510j912J206l475j122J426
11742b381N33o94k787p82n71J379Q3l879o61N681K396k692n025J441K779K09J240
11725c731k836L376m7l725o1J763j417j605K243L634L563j116n136j689O238j09
$$ plain form
11837 -8048 -2078 -632 -3103 -4140 -2332 -4227 -2329 1832 48 -5773 -8055 -10553 -7253 -2183 -3171
11822 -3171 -4198 -3742 -2966 -6409 -8583 -6523 -7463 -6301 700 2098 3241 4189 3773 1517 -568 2595
11806 2595 4326 -431 -3351 -5056 -351 118 -703 -3054 -2191 -8274 -9979 -12311 -12237 -10049 -5017 -2379
11790 -2379 -4103 -9549 -4531 546 4679 5135 5295 580 -2534 -3192 -2288 -1322 -3980 -4560 -3179 -126
11774 -126 737 483 -341 -413 -580 -1647 -7963 -9118 -9769 -5516 179 -1543 -1759 -3286 -8522 -8863 -2235
11757 -2235 414 -1666 260 530 -17 -667 333 3940 6006 1496 -416 790 -2685 -3807 -2381
11742 -2381 -1848 -2542 -5329 -6111 -6682 -5303 -5220 -9099 -9760 -4079 -1683 -4375 -9400 -7959 -5180 -4971 -3731
11725 -3731 -6567 -3191 -3238 -6963 -7024 -5261 -6678 -8283 -6040 -2406 1157 41 -5095 -6784 -546 -655
11709f55k836J75K259j876J615R46K769J380j700k007m713l47J475L153k653l113
11693f128O579K356n24k185j482M099r43r75l030J884L233j136k416L948K652
11678E932m087m056J850J642J668k670J628k885n378n719j682P385L363J680Q38
11663d91l283j136k425k95N354N716R4M36k321o966k18K513R72Q98J91k630O99
11646b892L235K93n42QL848j669J395k545o43j81k803N15j345m483N81L406K977
11629h45p69l000L81J916M349k131m016K135J214k51k931n36p91R86K648j525
11613c166p98J796J400j503j040o19j665O0j757o46l997R65L21J541R86K243J703
11596d176M714m661l120K929r10K668R70K16n62K446K492K679j071n659l470M73
$$ plain form
11709 -655 -3491 -3316 -1057 -2933 -1318 -372 2397 3777 2077 70 -4643 -4990 -3515 -362 -3015 -6128
11693 -6128 451 2807 2283 98 -1384 2715 1772 797 -2233 -349 2884 1748 -668 3280 5932
11678 5932 1845 -2211 -361 1281 2949 279 1907 -978 -6356 -12075 -13757 -6372 -3009 -1329 -491
11663 -491 -3774 -4910 -7335 -7630 -2276 3440 3534 3970 1649 -5317 -5535 -3022 -2050 -1152 -961 -3591 -2892
11646 -2892 343 636 94 102 3950 2281 3676 1131 488 307 -2496 -1981 -3326 -7809 -7228 -3822 -845
11629 -845 -1614 -4614 -4233 -2317 2032 -99 -4115 -1980 -766 -1017 -3948 -4484 -5275 -4289 -1641 -3166
11613 -3166 -3964 -2168 -768 -2271 -3311 -3930 -5595 -5535 -7292 -7938 -11935 -10970 -10649 -9108 -8122 -5879 -4176
11596 -4176 538 -4123 -7243 -4314 -5224 -2556 -1586 -1370 -1932 514 3006 5685 4614 -1045 -4515 -4042
11580d042N696J576q23l906J423r1L100K086P65L78j610n202m382l638K66n97
11564i001j10L721k920J336J296N26J181j132M558N619O133k703q595k720n90
11549c401ON15P279j456l114j140k659o98l24J198O30k862J850L222k089j368
11533d411J688n72K448l00j697l75M489J089j900l874k494J428k927r0M052j882
11517e328N83k988j099L866Q03J066k03l370q59N93L314K44l626Q39O265n87K159
11500A672j037j228j962P17Q64N741o66n66m95J909j570J68k849k401k467M784
11484F14R13J307q38j594j26p6j541J80j404j486K587L106L971m338p044J396
11468d373M982K236p81o57l366m469MK594N24m16k553J55K127J298P45K602j061
$$ plain form
11580 -4042 1654 3230 2407 -1499 -76 -167 2933 5019 5784 6162 4552 -650 -5032 -8670 -8404 -9001
11564 -9001 -9111 -5390 -8310 -6974 -5678 -5152 -3971 -5103 -545 5074 11207 8504 -91 -2811 -3401
11549 -3401 -3395 -2880 4399 2943 -171 -1311 -3970 -4668 -4992 -3794 -3164 -6026 -4176 -954 -3043 -4411
11533 -4411 -2723 -3295 -847 -1147 -2844 -3219 1270 2359 459 -3415 -5909 -4481 -7408 -7498 -3446 -5328
11517 -5328 -4745 -7733 -8832 -4966 -4163 -3097 -3300 -6670 -7529 -6936 -3622 -3378 -7004 -6165 100 -487 1672
11500 1672 635 -593 -2555 -1838 -974 4767 4101 3535 3040 4949 3379 3547 698 -1703 -4170 614
11484 614 1527 2834 1996 402 276 200 -1341 -1161 -2565 -4051 -1464 1642 5613 1275 -5769 -4373
11468 -4373 609 2845 2064 1407 -1959 -6428 -6424 -3830 -3306 -3722 -6275 -6120 -3993 -2695 -1950 652 -409
11451d09l123k218K575M705K045l353o68K525J988j302k693l715K782R27K234
11436B300K295k865K356o06n428l885j443J480o04R71M9J345k028l714l49k05
11420a0331j863L415L247M90L841p82k588l02N32O661M073n438p5k38P81K617
11404D040J556k382Q99O74q06l62m968k534k695N42q62j048o26J389K065R47J271
11387b900J583L174K54q675p188L182R23J553O130K931M168L466P94j342m835
11372C218m006j378P70k778j044Q44M659J515P94j705l553j394r50j037J266Q42
11356c937k28O51j837l909L641Q574m105l535K058r0j949J107j284K369K326P94
11340F46J08l04n242j558K99j108O467j43K516r56k702J058k751l500m051j373
$$ plain form
11451 -409 -3532 -5750 -3175 1530 3575 222 -446 2079 4067 2765 72 -3643 -861 66 2300
11436 2300 4595 1730 4086 3480 -1948 -5833 -7276 -5796 -6400 -5429 -5380 -4035 -6063 -9777 -10126 -10331
11420 -10331 -12194 -8779 -5532 -5042 -1201 -1983 -4571 -4873 -4341 2320 6393 955 880 642 1423 4040
11404 4040 5596 3214 4113 4787 3981 3619 -1349 -3883 -6578 -6036 -6898 -7946 -8572 -7183 -5118 -4171 -2900
11387 -2900 -1317 1857 2111 -6564 -13752 -10570 -9647 -8094 -1964 967 5135 8601 9395 8053 3218
11372 3218 -788 -2166 -1396 -4174 -5218 -4374 285 1800 2594 889 -2664 -4058 -5008 -6045 -4779 -3937
11356 -3937 -4165 -3514 -5351 -9260 -5619 2955 -1150 -4685 -2627 -2717 -4666 -3559 -4843 -2474 -148 646
11340 646 754 450 -4792 -6350 -6051 -7159 -692 -835 1681 725 -1977 -919 -3670 -7170 -11221 -12594
11324a2594P307J140P69m591J820K515k447J980j286Q63K283J144j875j274L32
11309c914L323J291m29j342m654n107J572M976j50J103L825j898J420r53J977
11294A040M232j940r18K778j38p381j285K871M028l83n352k718Q71Q49J245K769
11278E68J631j453l68J401m90J99j132l869j975K268J823K565m56Q82J25N563
11262G282J496l758o619k638j850K315N040R64l625K119M724k1o067R08M407J421
11246F098J019k358m474j003o041k524R50R13L472r17O37L350l0L67j384K174
11230B49L047R23m158m759m384m832J217M468J782P150N657j56n425R15J32j468
11214C58j893l407p73J333k53j117L345K263L59j258R88lM049J433r06p69n38
$$ plain form
11324 -12594 -5287 -4147 -3378 -7969 -6149 -3634 -6081 -4101 -5387 -4524 -2241 -1097 -2972 -4246 -3914
11309 -3914 -591 700 271 -1071 -5725 -10832 -9260 -4284 -4434 -3331 494 -1404 16 -937 1040
11294 1040 5272 3332 2414 5192 5054 -2327 -3612 -741 3287 2904 -2448 -5166 -4295 -3446 -2201 568
11278 568 2199 746 378 1779 1289 1488 356 -3513 -5488 -3220 -1397 1168 712 1594 1719 7282
11262 7282 8778 5020 -1599 -4237 -6087 -3772 1268 2232 -1393 726 5450 5429 -638 270 4677 6098
11246 6098 7117 4759 285 -718 -6759 -9283 -8333 -7420 -3948 -4865 -4228 -878 -908 -541 -1925 249
11230 249 3296 4219 61 -4698 -9082 -13914 -12697 -8229 -6447 703 6360 6204 779 1694 1826 358
11214 358 -1535 -4942 -5715 -4382 -4635 -5752 -2407 -144 215 -1043 -55 -58 3991 5424 4518 3749 3211
11197C211n003o551M287N126k3j059O93n62j238k425m59J626j493j448l5J0625
11181E272K450j715j586l492M59m80K738j148k159l047K621L487l940m830j055
11166f425L15J064M72L14k648M91J047K181K031O75m611l42M87O315J594n33n153
11149b726j822K789K36j356j771O98J170l2m520l735J710N092K666k51o6R10K5
11132i83k866k02N021k048j890J849j600j014K035p97M20J591m054j03R4K506
11116b041J917K203k415l773K794O26j21K288m78J742K133p17k797m945n074K33
11100h425L433Q69m93O83k028m03M84n77l481Q88r66L001O515j57K94J15k088
11083b336n26j859L613J505l781J484K677n96K472q50q6n89k120o33L752K490
$$ plain form
11197 3211 -1792 -8343 -4056 1070 1047 -12 681 119 -1119 -3544 -4003 -2377 -3870 -5318 -5353 5272
11181 5272 7722 6007 4421 929 1388 908 3646 2498 339 -2708 -87 3400 -540 -5370 -6425
11166 -6425 -6110 -5046 -4574 -4260 -6908 -6417 -5370 -3189 -1158 -483 -5094 -5436 -4949 1366 2960 2427 -2726
11149 -2726 -4548 -1759 -1523 -2879 -4650 -3952 -2782 -2814 -7334 -11069 -9359 -4267 -1601 -1852 -1918 -1008 -983
11132 -983 -3849 -4051 970 -1078 -2968 -1119 -2719 -3733 -1698 -2495 -2075 -484 -4538 -4641 -4547 -2041
11116 -2041 -124 2079 -336 -4109 -1315 -689 -810 1478 1000 2742 4875 4158 1361 -3584 -8658 -8425
11100 -8425 -4992 -4123 -4616 -3933 -5961 -6364 -5880 -6457 -9938 -9050 -10016 -7015 -500 -657 -363 -248 -2336
11083 -2336 -2862 -4721 -1108 397 -3384 -1900 777 181 2653 1803 1717 1128 -992 -1625 2127 4617
11067D617K517K2n359m737k402J238K344J803J516m97o002o609M176K165L99j19
11051d928K451Q86P03k842o75M182K351Q49l2K695J743J272j366o656m499n93
11035d459M388K557J839o38j311N06J38O12p01m91k634O09j866l856K36J528l821
11018g364K524N638L669K836K482K393m338q60r63k719k224k239l89M870J080
11003D396p171M24M994L197j40l296j988L73k879j753k320L271J199j440L984
10988H51m30n23j922J220Q43j736K522K999J645j739q78r89p72k829j512J662
10972a588J878N646K385l306l07n193k412j517O397K088K907l840k859n74J515
10957A220q68L645J180k739j970k344J233K109j133k401M8r18L245J133J980j758
$$ plain form
11067 4617 7134 7156 1797 -2940 -5342 -4104 -1760 43 1559 1062 -4940 -11549 -7373 -5208 -4809 -4928
11051 -4928 -2477 -1591 -888 -3730 -4405 -223 2128 2977 2945 5640 7383 8655 7289 633 -3866 -4459
11035 -4459 -71 2486 4325 3687 2376 2882 3020 3632 2931 2440 -194 415 -1451 -5307 -5071 -3543 -7364
11018 -7364 -4840 798 4467 7303 9785 12178 7840 6980 6017 3298 1074 -1165 -1554 3316 4396
11003 4396 -2775 -2351 2643 5840 5700 2404 416 789 -2090 -3843 -6163 -2892 -1693 -3133 851
10988 851 421 -102 -2024 -804 39 -1697 825 3824 5469 3730 2852 1863 1091 -1738 -3250 -1588
10972 -1588 290 5936 8321 5015 4708 -485 -2897 -4414 1983 4071 6978 3138 279 -295 1220
10957 1220 352 3997 5177 2438 468 -1876 -643 1466 333 -2068 -2020 -2938 307 1440 3420 1662
10941A662k286l202K394J578l411K217K652j335p49n65J516j62j807l804k64K36
10925e330O22L047J239k805j26R28J616j055n335K594K316J837N96k542K592j55
10909C9j686j511j144L565J915J292J974l015p195r6j251N149o52R67k039M368
10893F80O321o57O91M38n661j396K500o205K44K262K382O94L470j711o15Q66j130
10876C173j05l094l84K218j877l210k341J777N885J031m030l431k412r63K510
10861e253K643K91J292l556K729Q68n180N72k435J475Q49M827L402K682k335j968
10845I03j143QK417J279j451l71p10l117N81N936K892l944k058m39L383L03K533
10828G002P63j996n600k29J601J300m20p72J019j18R19k470k896J866l36K408
$$ plain form
10941 1662 -624 -3826 -1432 146 -3265 -1048 1604 269 -480 -1045 471 309 -1498 -5302 -5566 -5330
10925 -5330 -4708 -1661 -422 -3227 -3353 -2425 -809 -1864 -7199 -4605 -2289 -452 144 -2398 194 39
10909 39 -1647 -3158 -4302 -737 1178 2470 4444 1429 -5766 -5862 -7113 -1964 -2616 -1649 -3688 680
10893 680 7001 6344 7035 7473 1812 416 2916 -3289 -3045 -783 1599 2293 5763 4052 3437 4303 3173
10876 3173 3068 -26 -410 1808 -69 -3279 -5620 -3843 2042 3073 -957 -4388 -6800 -7763 -5253
10861 -5253 -2610 -2319 -1027 -4583 -1854 -986 -6166 -5594 -8029 -6554 -5705 -878 2524 5206 2871 903
10845 903 -240 -232 2185 3464 2013 1642 932 -2185 -1604 4332 7224 3280 1222 783 4166 4469 7002
10828 7002 7765 5769 169 -60 1541 2841 2421 1649 2668 2550 3469 999 -1897 -31 -367 2041
10812B041K490j216J980M789J300k240n337l479K770p07n121L138N162Q92q55
10797E607l763k798L069r68m760J104M013M180nj886j316K29M35J323L674N98
10781H736l017j432l989k373j036M41L156k416k769j777J370K827k802j251L435
10766b897K662J118J030j380J576L572J136L31j221P42r57k607K413o12N17k34
10750E189k063m594k161O265k419l430K84n37k677O88J370k585J860M575J786
10735A551L466L455k258n521k700K160p98j40J304K171J024m198n349J920J588
10720b325M47J274l549j493K0j796J701K930N8p96J400N030k136n015K624J403
10704b23K242J964k102R11J694L9o733k132J184o36k244J810J481m7l10j300J687
$$ plain form
10812 2041 4531 3315 5295 10084 11384 9144 3807 328 3098 2391 -2730 408 5570 6462 5607
10797 5607 1844 -954 2115 1147 -3613 -2509 1504 5684 5679 3793 2477 2706 3141 4464 8138 8736
10781 8736 5719 4287 298 -2075 -3111 -2670 486 -1930 -4699 -6476 -5106 -2279 -5081 -6332 -2897
10766 -2897 -235 883 1913 533 2109 5681 6817 7148 5927 6669 5712 3105 5518 4906 5423 5189
10750 5189 3126 -1468 -3629 2636 217 -3213 -2929 -3466 -6143 -5455 -4085 -6670 -4810 -235 1551
10735 1551 5017 8472 6214 693 -2007 153 -645 -785 519 2690 3714 -484 -5833 -3913 -2325
10720 -2325 -1878 -604 -4153 -5646 -5626 -7422 -5721 -2791 -2733 -3529 -2129 2901 765 -4250 -1626 -223
10704 -223 2019 3983 1881 2792 4486 4525 -2208 -4340 -3156 -3792 -6036 -4226 -2745 -2792 -3102 -4402 -2715
10687b715J434k231k76N139j264K50L559j60l318j841m386J267N21L392L576L998
10671F945K256n281m530l062k736m7N987K187m075M98L49r66J493K357J427m703
10655a901n17j118j558M437O796m794j313q65N137M736j010l308M04j644O19J038
10639E139m586N69l80J414J941p7j207m439L563j856l341J467l746N20L148l14
10623b185K22J671L57J335P17K631o42j789n02o29N57J763m30K003j433k380N70
10606A836K743L232k007m540J662N148K781j156l057l893k810m272k405j743P39
10591g742K385O054Q322L148n332k452j795M325R60K753j574o163l881J323L139
10576C470J526J254n8k360p12j853m09K249k383l490K954N985j232k510m594M4
$$ plain form
10687 -2715 -1281 -3512 -3788 1351 87 337 3896 3736 418 -1423 -5809 -4542 -4021 -629 2947 6945
10671 6945 9201 3920 -610 -3672 -6408 -6455 -468 1719 -2356 -1858 -1509 -2475 -982 1375 2802 -1901
10655 -1901 -2418 -3536 -5094 -657 6139 1345 32 -833 4304 9040 8030 4722 5126 3482 4101 5139
10639 5139 553 1122 742 2156 4097 4020 2813 -1626 1937 81 -3260 -1793 -5539 -5019 -1871 -2185
10623 -2185 -1963 -292 65 1400 2117 4748 4106 2317 1815 1186 1743 3506 3076 5079 3646 1266 1836
10606 1836 4579 7811 5804 1264 2926 8074 10855 9699 6642 2749 -61 -4333 -6738 -8481 -7742
10591 -7742 -5357 697 9019 12167 6835 4383 2588 6913 7873 10626 9052 2889 -992 331 3470
10576 3470 4996 6250 6192 3832 3120 1267 858 3107 724 -2766 188 6173 4941 2431 -2163 -2119
10560b119M032M727K302k350l583j131k739O46l332J020K592Q45L826P04j743
10545C697j549L876l53j20m41k504J281Q29l890r80q41K129M549l85k113j893
10529A292n303j193j124M30P954M990j628m610j193k189K132P972k93m760k50
10514B227j921K394K126J72l974j250N196k406k849o88M3J659l22j020K753M658
10498F798r38m88m098k274j629J650N852k409l818M587J368k633k216J127j514
10483f35n295j206P330J562O07K967K020l741k893L40O147J479q33q01K143J025
10467A0216k354k143m827q35M61O266l94l899k35j616J669L124N88k201k106j84
10451A530K71k467m152J54M435O290j785n190K431l110l052J90L297l817N55M753
$$ plain form
10560 -2119 1913 6640 8942 6592 3009 1878 -861 -215 -3547 -2527 65 910 4736 5440 3697
10545 3697 2148 6024 5671 5551 5110 2606 3887 4716 826 -154 -995 1134 5683 5298 3185 1292
10529 1292 -4011 -5204 -6328 -5898 2056 7046 5418 808 -385 -2574 -442 7530 7237 2477 2227
10514 2227 306 2700 4826 4998 1024 -226 4970 2564 -285 -973 -930 729 407 -613 2140 6798
10498 6798 5860 5372 1274 -1000 -2629 -979 4873 2464 -1354 3233 4601 1968 -248 879 -635
10483 -635 -5930 -7136 194 1756 2363 5330 7350 3609 716 1056 7203 8682 7849 7048 9191 10216
10467 10216 7862 5719 892 57 518 6784 6390 2491 2256 640 2309 5433 6021 3820 1714 1530
10451 1530 1801 -666 -4818 -4664 -229 6061 4276 -914 1517 -1593 -4645 -4455 -1158 -4975 -4420 333
10435C33K695n695l624L680K81M672J545J312K433m30j286K380J586m295l091
10420B496L341M169k846j186j576K636M109L118l331k893l11n424n447O81k216
10405d680m05M181j678N91M876M755l53j463K835p28m613m77j798l010k31J937
10389b61L097n765k218K932K842j040l357l161K550L072P39L724L961J744l066
10374E793l80n480k970J131K611O66R04n77k060o159m12Q770M762J809j231k928
10358D249l60J259k328k387K60L057l371J485M202M66m15q676r31P11K642J281
10342A144n868J212M331M838L946j508n449k255K286n08j323P24K832k403l925
10327a926p12L235K077N34K953K72l508k350m99J911J811K841k858k714O64m47
$$ plain form
10435 333 3028 -2667 -6291 -2611 -2330 2342 3887 5199 7632 7202 5916 8296 9882 5587 2496
10420 2496 5837 10006 7160 5974 4398 7034 11143 14261 10930 8037 7726 2302 -3145 -2464 -4680
10405 -4680 -5085 -904 -2582 -1991 2885 7640 7287 5824 8659 7931 3318 2841 1043 -1967 -2198 -261
10389 -261 2836 -2929 -5147 -2215 627 -413 -3770 -6931 -4381 -1309 -570 3154 7115 8859 5793
10374 5793 5413 -67 -3037 -1906 705 1371 2275 1698 -362 -6521 -6933 1837 6599 8408 7177 4249
10358 4249 3889 5148 2820 433 693 3750 379 1864 6066 6532 6117 -2559 -3490 -2779 -137 1144
10342 1144 -4724 -3512 819 5657 9603 8095 2646 391 2677 2169 846 1570 4402 1999 -1926
10327 -1926 -2638 597 2674 3208 6161 6433 2925 575 76 1987 3798 6639 3781 1067 1731 1284
10311A284L27K315l720o81K243q98J582O71J508L1o942N625O06O82N94J405k520
10294D112J111m447l369KP380r88m730k302n85J422L578J242J27M853M908l732
10278H582k078k99J020Q25J316Q96j845k036l927O32j93j369K76P15R33m770l204
10261d526J240K728r82j707L858J005j601P9J756J302l46K563q29m077l758L56
10245b939O934L774j698J508n14k230J35j389k245R40L932j321l258j298K966
10230C297N24nO69M71l724j398K041r96O20LM041k371l416k95k143L048n43k227
10212b404l722p50q99J478L623J583N1r8l241K706J712k786K990O175K327r07
10196G838j925o92K609K829j349o470J83J858R14l03l807j452M093M916j490q344
$$ plain form
10311 1284 1611 3926 206 -475 1768 870 2452 3123 4631 4662 -2280 3345 3951 4633 5227 6632 4112
10294 4112 5223 776 -2593 -2591 4789 3801 -929 -3231 -3816 -2394 1184 2426 2553 7406 12314 8582
10278 8582 6504 6205 7225 8050 9366 10262 8417 6381 2454 3086 2893 1524 1800 2515 3448 -1322 -4526
10261 -4526 -3286 -558 -1540 -3247 611 1616 15 94 1850 3152 2806 5369 4540 463 -3295 -2939
10245 -2939 3995 7769 6071 7579 7065 4835 4970 3581 1336 2276 6208 4887 1629 331 3297
10230 3297 3821 3816 4485 4956 1232 -166 1875 879 1499 1502 5543 3172 -244 -539 -2682 366 -177 -2404
10212 -2404 -6126 -6876 -7775 -6297 -2674 -1091 -1040 -1138 -4379 -1673 39 -2747 243 6418 8745 7838
10196 7838 5913 5221 7830 10659 9310 2840 3023 4881 5795 5492 1685 233 4326 9242 7752 -592
10180e92k69L93l96J513K504L284k453j445j602M204r54k354k535j990K122o47
10164a217J022l07R7j298L892K429k478j786K332P34O99L236l06k283l367n744
10148d345m164M252L691O0J011K735O163K466l377m383j442K37J926K980j276
10133F534k485k788n80l525m869j2K269Q69M024J389J332q41o77J605r18j07l8
10116A182k560J498j339J658r77l37K842n94J242K905k179k761k420L394K578
10101D132m954J409J690j261J666K466J347M617p91n164K96K107j21r12k991P6
10085C612l018k377Q13O092M209j909P61L223m783m437K129M111L283j041m165
10070F503M68l123p07J002R01J705j690K5Q05O66j11j571n732k033M24K373K99
$$ plain form
10180 -592 -861 -468 -864 649 3153 6437 3984 2539 937 5141 4187 1833 -702 -2692 -570 -1217
10164 -1217 -195 -502 -405 -1703 2189 4618 2140 354 2686 3420 4119 7355 7049 4766 1399 -4345
10148 -4345 -8509 -4257 -566 -506 505 3240 9403 11869 8492 4109 2667 2904 4830 7810 6534
10133 6534 4049 1261 681 -2844 -7713 -7725 -5456 -4587 -563 826 2158 1317 640 2245 1327 1220 1182
10116 1182 -1378 120 -1219 439 -538 -875 1967 1373 2615 5520 3341 580 -1840 1554 4132
10101 4132 -822 587 2277 1016 2682 5148 6495 11112 10321 5157 5453 7560 7439 6527 3536 3612
10085 3612 594 -1783 -970 5122 9331 7422 8183 11406 6623 2186 4315 8426 11709 10668 6503
10070 6503 6971 3848 3141 4143 5044 6749 5059 5084 5889 6555 6444 4873 -859 -2892 -2468 -95 204
10053B04P60J508N299O216L461n943l789j305J32o62O13k295q55J783O54k735
10037C046L319N72l355j455P57K301k338L31N54N65j720k087l417l354p3L055
10021c299K297K868J448j539j367L545J14J974k279M95l952n01N22O08K120m216
10005a162p5J167j238M76J339K03M38J648mL135L988K467m244m495m30N86K177
9988E976M041j65l285k461J338J002k114p473j25J130M708O533k275l235j471
9973B124k300j490k134k95P315L615j93L372N53j653l433K387n137l932K391N438
9957F628J131j656m07K766M328r8K357j011m032J140j096k756k15k960k479k813
9941a173K376J68J868J004L025k949L28J996K040r67m22l626J060r94P00M495
$$ plain form
10053 204 964 2472 7771 13987 17448 11505 7716 6411 6543 5881 6494 4199 3344 5127 5781 3046
10037 3046 6365 6937 3582 2127 2884 5185 2847 3178 3732 4297 2577 490 -2927 -6281 -6354 -3299
10021 -3299 -1002 1866 3314 1775 408 3953 4067 6041 3762 4257 305 -196 326 934 3054 -1162
10005 -1162 -1237 -70 -1308 -832 507 710 1148 2796 2792 5927 9915 12382 8138 3643 3213 3799 5976
9988 5976 10017 9852 6567 4106 5444 6446 4332 -3141 -3266 -2136 2572 9105 6830 3595 2124
9973 2124 -176 -1666 -3800 -4095 3220 6835 6642 10014 10567 8914 5481 7868 2731 -1201 1190 6628
9957 6628 7759 6103 5696 8462 12790 12692 15049 14038 10006 11146 10050 7294 7079 4119 1640 -1173
9941 -1173 1203 1371 3239 4243 7268 4319 4647 6643 8683 7716 7294 3668 4728 3734 4434 8929
9925H929p28k591j638o12j296L5M652k93k821J224K594M55j855l359m009k863
9909d176K558J41K728K634L023J746j713k002K72N098Q29j519K802k770J026K754
9893A3431l31q59Q46m068k506j773l544K347n9O83K910J564m299K396L782L683
9877A4203l098p966J115M646O719k84j558k196nK64k818j791q16Q60J813K085
9861A1173l407k324K550L322q8k67m953J596J219o30J805N81j980m296m439M733
9845D595M371k827Q53N585R37j590Q86L120n263j240M819k062j514l0J940l355
9829I225m394M146K590K649n68L30K783j288l395l544L887j075k549q42J537M646
9813A4138k722l264k471m649R31K351J976o855O05N553J007k38K124O62J312k827
$$ plain form
9925 8929 8201 5610 3972 3360 2064 2099 6751 6458 3637 4861 7455 7910 6055 2696 -1313 -4176
9909 -4176 -1618 -1477 1251 3885 6908 8654 6941 4939 5211 10309 11138 9619 12421 9651 10677 13431
9893 13431 13100 12241 13087 9019 6513 4740 1196 3543 3484 4167 7077 8641 4342 6738 10520 14203
9877 14203 11105 3139 4254 8900 15619 15335 13777 11581 11576 11840 9022 7231 6415 7275 9088 11173
9861 11173 7766 5442 7992 11314 11226 10959 6006 7602 8821 8191 9996 10577 8597 4301 -138 4595
9845 4595 8966 6139 6992 12577 13514 11924 12810 15930 10667 9427 14246 12184 10670 10640 12580 9225
9829 9225 4831 8977 11567 14216 13648 13978 16761 15473 12078 8534 12421 11346 8797 7955 9492 14138
9813 14138 11416 8152 5681 1032 1963 4314 6290 -565 40 5593 6600 6362 8486 9148 10460 7633
9797G633o53j715k327l021L157K314P79J684J989l068k498M75N679K205M80k095
9781A1018m169J443J362K299J625n343l138M370L769r62l895l32O71M524K79m492
9765I029l789q61J083M784M849m162j680L909k999m885l732J318O48k792K939
9750C659J616R21K253L640p88j383m256J218J783K613K591N77L29k150m89J438
9734A3572J006j93J940K687J297l477m488o847L062L189K253K196l75k583k335
9719A0904N335l069n636l498M563J130J27l112o17L16m25N36j61l114P20J243
9703E242M05K419R58q32M876J779j068j510m73R06P2p06K80J365k198k393L050
9686A2172J421K877m580n357k149n75P90J164j738P2O20J360L240k533l192L396
$$ plain form
9797 7633 6980 5265 2938 -83 3074 5388 6167 7851 9840 6772 4274 4749 10428 12633 13113 11018
9781 11018 6849 8292 9654 11953 13578 8235 5097 9467 13236 12274 8379 8047 8718 13242 13521 9029
9765 9029 5240 4379 5462 10246 15095 10933 9253 13162 10163 5278 1546 2864 3512 720 3659
9750 3659 5275 6196 8449 12089 11301 9918 5662 6880 8663 11276 13867 14444 14773 12623 12134 13572
9734 13572 14578 14385 16325 19012 20309 16832 12344 5497 8559 11748 14001 16197 15822 13239 10904
9719 10904 16239 13170 7534 4036 8599 9729 9856 6744 6127 6443 6018 6554 6393 3279 3999 5242
9703 5242 5647 8066 9024 8192 13068 14847 13779 12269 11796 12702 12774 12068 12348 13713 11515 9122 12172
9686 12172 13593 16470 11890 6533 4384 3809 4599 5763 4025 4097 4717 6077 9317 6784 3592 6988
9670F988J566L7R91L444O42N641J975o554k231K7r22k952m097O08L461n88L224
9653A1260J136L178L928m228k28J490l461k205j460K945n82n02j715K698K978
9638A5232K369k506l355J758L849n57k989j28j363j723J507m233J161J930M10
9623A1362k390k232J403J577j406j804M072K022K72k188M263K359J751m847n320
9608H894J224M652K990n431j356J264o64L548L81m926l054l659m6L727R10J407
9592I861j58P01j404J84O771M800j761k928k280J401k126j510R72J402j735K045
9576A4235N050J315m301r37L53K623l961m752k110K221O7K57o875o57O472L690
9560A2690l073j048L416M155J540L00n504j168j58M51L194m4j897j410L039l981
$$ plain form
9670 6988 8554 8591 9582 13026 13668 19309 21284 14730 12499 12526 11604 8652 4555 5163 8624 8036 11260
9653 11260 12396 15574 19502 15274 15046 16536 13075 10870 9410 12355 11773 11271 9556 12254 15232
9638 15232 17601 15095 11740 13498 17347 16790 13801 13673 12310 10587 12094 7861 9022 10952 11362
9623 11362 8972 6740 8143 9720 8314 6510 10582 12604 12876 10688 14951 17310 19061 14214 8894
9608 8894 10118 14770 17760 12329 10973 12237 11573 15121 15502 10576 7522 3863 3817 7544 8454 9861
9592 9861 9703 10404 9000 9184 15955 20755 18994 16066 13786 15187 13061 11551 12523 13925 12190 14235
9576 14235 19285 20600 16299 15362 15715 18338 14377 9625 7515 9736 9803 10060 3185 2528 9000 12690
9560 12690 9617 8569 11985 16140 17680 17980 12476 11308 11150 11601 14795 14751 12854 11444 14483 10502
9544A0502j736J657M135L050j6j005r83l97j003Q74K145j122k372K161Q45J284
9528A8019k131l76q81j280k248r17O822J303k581r210J860L42L611L960M3o112
9512A0224p46N177O72l109l699N085M727K004o36L36m79k387m8K278P28R43J231
9495B2301l368k01K876o71R66q53k344r2k170k384m330j096j10m50R18K790L043
9478A4825m39q59M54O060P63p03M362J427j921j853l571J136L50L467m52k691
9462B0355k227k584l316j23K350L124N332j145L801N41n75l0m414j970j401o97
9446A7021K74lK918J110j234k756l220n41j764J288M90L041M449l925l367r07
9430A2874L371J589q11J349M094m41j634j571k269j769k837l099J187M612k127
$$ plain form
9544 10502 8766 10423 14558 17608 17592 16587 15604 15207 14204 15078 17223 16101 13729 15890 16735 18019
9528 18019 15888 15512 14631 13351 11103 10186 17008 18311 15730 6520 8380 8722 12333 16293 16336 10224
9512 10224 9478 14655 15327 12218 8519 13604 18331 20335 19699 20035 19556 17169 17121 19399 20127 21070 22301
9495 22301 18933 18732 21608 20937 21903 21050 18706 18614 16444 14060 9730 8634 8524 8074 8992 11782 14825
9478 14825 14386 13527 13981 20041 20804 20101 24463 25890 23969 22116 18545 19681 20031 23498 23046 20355
9462 20355 18128 15544 12228 12105 14455 17579 22911 21766 25567 26108 25533 25503 21089 19119 17718 17021
9446 17021 17295 17292 20210 21320 20086 17330 14110 13569 11805 13093 13583 16624 21073 17148 13781 12874
9430 12874 16245 17834 17023 18372 22466 22025 20391 18820 16551 14782 11945 8846 10033 14645 12518
9415A2518J505O792M302K80K81l504j721m51j500j141K731J794R57J912j322k114
9399B1319Q49J196m580m887J899P27K791K68n536l352j153M047K192L330M797
9384B3907q97m677m616J684j482o86L18N049K279k036l09N610J186l462l802j81
9368A7885j816K20K42O142k01k954k164n679J561L208j200l23k020K341J86k940
9352A2488L159K81l636k538K169o25j013J868J256J933J823J193j065L336O206
9337B6835J939L00P48j165J176j8J554J518n619N03j598j138j004J603R67J929
9321B8530n023l696K521L311R58r63l898k472j685o6L22L16R84N305J287k769
9305B2962J710R89K845m64m112q05m900j758J323M5n82L374L048O88M918K677
$$ plain form
9415 12518 14023 20815 25117 25397 25678 22174 20453 20002 18502 17361 20092 21886 22843 24755 23433 21319
9399 21319 22168 23364 18784 13897 15796 16523 19314 19582 14046 10694 9541 13588 15780 19110 23907
9384 23907 23010 18333 13717 15401 13919 13233 13551 18600 20879 18843 18534 24144 25330 21868 18066 17885
9368 17885 16069 16289 16531 22673 22472 19518 17354 11675 13236 16444 15244 14921 12901 15242 15428 12488
9352 12488 15647 15928 12292 9754 11923 11298 10285 12153 13409 15342 17165 18358 17293 20629 26835
9337 26835 28774 29074 29822 28657 29833 29815 31369 32887 27268 27771 26173 25035 24031 25634 26601 28530
9321 28530 23507 19811 22332 25643 26601 25638 21740 19268 17583 17517 17839 18155 19139 24444 25731 22962
9305 22962 24672 25661 28506 28042 23930 23125 18225 16467 17790 17835 17253 20627 23675 24363 29281 31958
9289C1958l178o219j033K792k652l911R7j972J609J758N103l549l64K7J116Q23
9273B2405J878k137l92L228N77K812M164Q4o80N159m050o84j654m83K73o22K523
9256C2401K413K61m931p946Q8l052K625N420M756k85m684n118K848O610n97J53
9240C0962P64j956K06K442L822k066k371k714k240k6N132K395J998K99o7K758
9224C9338J490l519n404m134l603L797K317q98k47K332O95L340L416P07k281l025
9208C4321p436L710J0187N364M47k482J337k497n95m906k256J09j32j555K87k07
9192C3696K965O810L247O56N032M978K219o57n437l888o68m443j767o93J262J296
9176D4608l323l356k755J052P291L195j707k26j420J547j559L93K529j268J096
$$ plain form
9289 31958 28780 22561 21528 24320 21668 17757 17854 15882 17491 19249 24352 20803 20439 20466 21582 22405
9273 22405 24283 22146 21754 24982 25559 28371 32535 32619 31939 37098 33048 32364 30710 30227 30500 29878 32401
9256 32401 34814 35075 30144 22198 22286 19234 21859 27279 32035 31750 27066 21948 24796 31406 30809 30962
9240 30962 31726 29770 29976 32418 36240 34174 31803 29089 26849 26823 31955 34350 36348 36647 36580 39338
9224 39338 40828 37309 31905 27771 24168 27965 30282 29384 29137 31469 32164 35504 38920 39627 37346 34321
9208 34321 26885 30595 40782 46146 46593 44111 45448 42951 42356 37450 35194 35303 35171 33616 33903 33696
9192 33696 36661 43471 46718 47374 52406 57384 59603 58946 53509 49621 48953 44510 42743 42050 43312 44608
9176 44608 41285 37929 35174 36226 43517 46712 45005 44779 43359 44906 43347 43740 46269 45001 46097
9161D6097j030k216M574L994k996k031J290j39O81L266L351r61r93L39j367m190
9145D7669J944R685O550J1047K1678J3892n511j5520j6281j3713k920J191K976
9132F2687M616M128L11M127N662Q249J0646K1783K7841L0495M2410N5957Q8273
9119C67185J59063K82037M88388O70401L14223m48187o38349m41065k46664j32777
9109C74255p3330m9129l4178j9340j4092r234o063m51J33j893o804j3961l941
9096A41972L079Q943J2560J3963J5190K3736K2181K8535L4456M6077N8734Q5541
9084D94967J11359J38725J72361J95076K07350J98390J51497Q0471O927o6532
9074A690591j42548j95308k10426j94857j70794j42699j16718r1047o3737m7841
$$ plain form
9161 46097 45067 42851 47425 51419 48423 46392 47682 47543 48224 51490 54841 53880 52887 53226 51859 47669
9145 47669 49613 59298 65848 76895 98573 112465 106954 91434 75153 61440 58520 59711 62687
9132 62687 67303 71431 71742 75869 81531 89780 100426 122209 150050 180545 222955 278912 367185
9119 367185 526248 808285 1296673 1967074 2281297 1833110 1194761 753696 507032 374255
9109 374255 300925 251796 217618 198278 184186 174952 168889 168438 168571 166678 159874 145913 141972
9096 141972 145051 153994 166554 180517 195707 219443 241624 270159 304615 350692 409426 494967
9084 494967 606326 745051 917412 1112488 1319838 1518228 1669725 1750196 1757123 1690591
9074 1690591 1548043 1352735 1142309 947452 776658 633959 517241 426194 362457 314616
9064C14616l4674l3980k7606j8854j8575j7476j4850r758p410j0000r452o011
9052A05970n193l948m457r227m594l577k132j974J121M198M375K265l358q97p92
9037G7780k443q07l828p318k391l301m425k94N710N14k114J218M045L600j26L630
9021F9450J179J481L449J088J416m883k850J353L716R342L362j387M197j031n744
9006H4138O95K569j82k486k838J105M620k216M27P998J605m50O64m267n340j856
8990H4186L326M066p660j4871k4398l4685l4759j7447M537K6686L3409J7040J0270
8977D9700P154J526l601R27K625J0303O224K726M110N57k704l086j250K687K602
8962H0500J230k692l743k31K238K963M575M738M043K053j765R74j455L614Q985
$$ plain form
9064 314616 279942 245962 218356 199502 180927 163451 148601 138843 131433 121433 111981 105970
9052 105970 100777 96829 92372 83145 78551 74974 72842 70868 71989 76187 80562 82827 79469 78572 77780
9037 77780 75337 74530 70702 63384 60993 57692 53267 52973 58683 59197 57083 58301 62346 65946 65820 69450
9021 69450 70629 72110 75559 76647 78063 73180 70330 71683 75399 84741 88103 86716 90913 89882 84138
9006 84138 84833 87402 87220 84734 81896 83001 87621 85405 85832 93830 95435 94985 95649 91382 86042 84186
8990 84186 87512 91578 83918 69047 44649 9964 -24795 -42242 -37705 -11019 22390 39430 49700
8977 49700 56854 58380 54779 55706 58331 68634 74858 77584 81694 82251 79547 76461 75211 77898 80500
8962 80500 81730 79038 75295 75064 77302 80265 84840 89578 93621 95674 93909 94883 93428 97042 106027
8947A06027J2188R582J1761Q742O713P035J0649Q641J7975K0781L0265M1598N0317
8934C42274N9192M8689K6581j2961n1519o8641n5660l5696k4243j3961j3068j0301
8922A90686q543o475p995j0702j1759j0970j3970j4256r405l013n657J256K229
8909I1426k766l406n863K583J0023M264m61P342J0863J0217J1053O671M413j714
8895A44645j4162j2654l527j600k7l159L703J0508R897Q640L124j239p506j4886
8881A21757j0051n276l531o881j2032q526O284J7308K3204K1684J4913J0377J8786
8868A88016K6310K2366J1736J446N543L052o522k2764k6871k3376j2355j500j423
8855A63658k115j397M291M553Q509J0003J1811R406J3782J3101J2839O696n220
$$ plain form
8947 106027 118215 127797 139558 148300 155013 162048 172697 181338 199313 220094 250359 291957 342274
8934 342274 401466 450155 476736 463775 412256 343615 287955 252259 228016 214055 200987 190686
8922 190686 182143 175668 167673 156971 145212 134242 120272 106016 96611 93598 87941 89197 91426
8909 91426 88660 85254 79391 81974 91997 96261 95800 103142 114005 124222 135275 141946 146359 144645
8895 144645 130483 117829 114302 112702 112675 109516 113219 123727 133624 142264 145388 144149 136643 121757
8881 121757 111706 106430 102899 96018 83986 75460 81744 99052 122256 143940 158853 169230 188016
8868 188016 214326 236692 248428 249874 255417 258469 251947 229183 202312 178936 166581 165081 163658
8855 163658 161543 160146 164437 168990 177499 187502 199313 208719 222501 235602 248441 255137 249917
8842B49917j0557q294p183q324l99J0262K1135K9332J2300Q95K7848O0175P1393
8829D48500L7026r836k5614k0384j6835j4518j2506q241K554R726O414P673J3344
8816D17303J4440J5935J7662K2724K8921N5484Q8517J16993J62980J89219J19940
8805A250118j8609j51083j97861j55971r5012n2316l6388k1547j9933j7552q475
8794D75371k788r93j909r164q933l670q37L481P343J5331K6158K5505K4427R877
8780E59199M818N028j097J531J0672J2718J2613M511K099n114j776o53m096q130
8766E92323j944O362J2733K7570M2223M2648L4691L0327K8806L1670L3940L3792
8754I15141L2509J8872Q638J1508M281j654P46J515l660M279q02N729K0885L1034
$$ plain form
8842 249917 239360 231066 223883 215559 215160 225422 246557 275889 288189 289084 316932 377107 448500
8829 448500 485526 475690 450076 429692 412857 398339 385833 377592 380146 389872 396286 403959 417303
8816 417303 431743 447678 465340 488064 516985 572469 660986 777979 940959 1130178 1250118
8805 1250118 1231509 1080426 882565 726594 631582 579266 542878 521331 501398 483846 475371
8794 475371 472583 471590 469681 460517 451584 447914 447077 450558 457901 473232 499390 524895 549322 559199
8780 559199 564017 569045 567948 569479 580151 592869 605482 609993 612092 606978 605202 604549 600453 592323
8766 592323 590379 596741 609474 637044 679267 721915 756606 786933 815739 847409 881349 915141
8754 915141 947650 966522 975160 986668 990949 989295 990041 991556 987896 992175 991373 997102 1017987 1049021
8740A049021M7340O7655R2956J03529R8405Q6263P3990P5179P6410P5032Q7200
8729A932980R6364J12630J16846J05931R1448Q8622R9474J08586J06049J09964
8719B968894J18381J26425J42885J68210J95935K11754K13929K09776K23324K52702
8709D832215K93416L53864M36056N21489N80263O19800O62038P32328Q55907J014668
8699A0902044J202407J429154J668666J953504K337363K858481L504305M166497
8691C0022421M673168N036922N624818O921115R462746J3602410J9908111K9414683
8683A24666394M3621042O3522899Q5788311R4858246O1975237j3192517p6192007
8676C85047605r3465873p8120160n5414162l7611065k5767515j8042668j2825124
$$ plain form
8740 1049021 1096361 1164016 1256972 1360501 1458906 1545169 1619159 1694338 1770748 1845780 1932980
8729 1932980 2029344 2141974 2258820 2364751 2456199 2544821 2644295 2752881 2858930 2968894
8719 2968894 3087275 3213700 3356585 3524795 3720730 3932484 4146413 4356189 4579513 4832215
8709 4832215 5125631 5479495 5915551 6437040 7017303 7637103 8299141 9031469 9887376 10902044
8699 10902044 12104451 13533605 15202271 17155775 19493138 22351619 25855924 30022421
8691 30022421 34695589 39732511 45357329 52278444 61741190 75343600 95251711 124666394
8683 124666394 168287436 231810335 317598646 412456892 474432129 461239612 385047605
8676 385047605 291581732 213461572 158047410 120436345 94668830 76626162 63801038
8669F3801038r273385p071667n809861m847393m038066l645008l555657l337110
8661B2222891k891475k367985j907446j578169j340868j157567j009658q69144
8653I100579p29248n88725m92449m45030m35554m24879l98522l56422l11231k63632
8643D654887k64764k95504k89905k64028k30322k04930j88527j73735j53269j43908
8633B445995j34939j15661r2124p0858n2068n3176o0826o8669o3076n2955l8966
8622A642677k0861k703J2827J7069l634l8903o4294o2062n5854o2901p1448p4173
8610A215740o7567n8686n2067n1544m0248k9225p771J9029N4711J02409J45688
8599A230469R3533p5325j50949j19023o4310k6639k6527l5003l1880k7004k2937
$$ plain form
8669 63801038 54527653 47455986 41646125 36798732 32760666 29115658 25560001 22222891
8661 22222891 19331416 16963431 15055985 13477816 12136948 10979381 9969723 9100579
8653 9100579 8371331 7782606 7290157 6845127 6409573 5984694 5586172 5229750 4918519 4654887
8643 4654887 4390123 4094619 3804714 3540686 3310364 3105434 2916907 2743172 2589903 2445995
8633 2445995 2311056 2195395 2103271 2032413 1980345 1927169 1866343 1797674 1734598 1681643 1642677
8622 1642677 1621816 1619113 1631940 1649009 1645375 1606472 1542178 1480116 1424262 1361361 1289913 1215740
8610 1215740 1148173 1089487 1037420 985876 945628 916403 908632 927661 982372 1084781 1230469
8599 1230469 1324002 1248677 1097728 978705 914395 887756 861229 826226 794346 767342 744405
8588G44405j5402m816O719j3434m5283n3281l8164k6667l1768k5407j8707j7700
8576D60495j3811n942N577J1050J1250K539j937j2284j8888j5487j1283n267l459
8563D02553j0338j6415j0636j0393p277K863J3617K7394L1126l4955j05216r1242
8551A91081l6468M321J5407J0247M736K054j0957j4376n641J738l161n09J732
8538A60204N273k800r737j1599j3639j4632k3648l0328l3309k7638k480L7264
8526C2931O3987N1026R964q448P039K6191K5017L232j4174j3823j5556j2130j0948
8513A44308o101L659J2367J1681P380N734J539L609L115K0J585k981J193n75j1752
8498A74781j7257k0425l2035l1737j5246l843K034L058J1464K0148J9725J9060
$$ plain form
8588 744405 729003 724187 730906 717472 672189 618908 580744 554077 522309 496902 478195 460495
8576 460495 446684 440742 446319 457369 468619 471158 469221 456937 438049 422562 411279 406012 402553
8563 402553 392215 375800 365164 354771 347494 350357 363974 391368 422494 387539 282323 191081
8551 191081 154613 158934 174341 184588 189324 191378 180421 166045 160404 162142 158981 158472 160204
8538 160204 165477 162677 152940 141341 127702 113070 89422 59094 25785 -1853 -4333 32931
8526 32931 96918 147944 157908 149460 156499 182690 207707 210939 196765 182942 167386 155256 144308
8513 144308 138207 141866 154233 165914 173294 179028 180567 184176 187291 187311 188896 185915 187108 186533 174781
8498 174781 157524 137099 105064 73327 58081 54238 56272 59330 70794 90942 110667 129727
8486A29727J0230J4537J8087J5916J1870j461r716p323j1490j1953j2558j2748
8474A33118j1174k327l61N934P190Q414N282N392J114l259j0658j2955j4602j0732
8460A00376m399J499N679O986P745L893L058L421J494p14J126n81Q94K713n032
8445A28158m979J896l308j0792j4122j1549j0570j0781o587m11m819k603p13J632
8431E0452j923K922P676Q329J0654J3953Q848k80k787j2366n815n794r721j0827
8417E3321k143K705m88K809L310L506N020O231L888j185j107r51K228j951L274
8402G8467N011L699L034O73n377m734m113m587k726R68m80L18L268J920k219m221
8386F8901J089J295R46m49K016L945K170K157J5250K7224L0210J8668m425k8661
$$ plain form
8486 129727 139957 154494 172581 188497 200367 198906 189190 181867 170377 158424 145866 133118
8474 133118 121944 119617 119256 125190 132380 140794 146076 151468 152582 149323 138665 125710 111108 100376
8460 100376 95977 97476 103155 110141 117886 121779 124837 128258 129752 129038 130164 129583 130477 133190 128158
8445 128158 123179 125075 121767 110975 96853 85304 74734 63953 57366 56955 52136 49533 48820 50452
8431 50452 48529 51451 59127 67456 78110 92063 100911 100631 97844 85478 79663 73869 64148 53321
8417 53321 51178 53883 53395 56204 59514 63020 68040 74271 78159 76974 75867 74916 77144 75193 78467
8402 78467 83478 87177 90211 90884 85507 80773 76660 72073 69347 70315 69835 70153 73421 75341 73122 68901
8386 68901 69990 71285 72231 71782 73798 77743 79913 82070 97320 124544 154754 173422 168997 140336
8372A40336l4351l2458k0962q603j544K80K22J642j293n116Lj652k442j037O619
8357C9644P542J23l875L439p99o414k953k189K077J473L63K497M690M364J441
8342E1423J877j245k186K503o136k339N796M139L149J723J980Q25L521j801j065
8327F2164j584l907o622l109L56R15m37k045l01j402J412N19N618J765L340O300
8311F2982K663P61K676K033J357j290L43J82k37L134Q535O792O101N417N68J432
8295A03449P330R806J1666J7241J9698J8171K6875K9394L5956M1059N0004P2561
8283D43210J00674J30908J63748J91311K05047K02644J75226J08632L3601l9296
8273A715705j18928j79569k06231k05172j81961j53588j23865r8306p1977n0888
$$ plain form
8372 140336 105985 73527 52565 43962 42418 42698 42920 44562 43269 38153 38156 36504 34062 33025 39644
8357 39644 47186 47309 43434 46873 46074 39660 36707 34518 36595 38068 38431 40928 45618 49982 51423
8342 51423 53300 52055 49869 52372 46236 43897 49693 53832 56981 58704 60684 61509 65030 63229 62164
8327 62164 60580 56673 50051 46942 47298 48213 47776 45731 45430 44028 45440 45959 51577 53342 56682 62982
8311 62982 65645 66406 69082 71115 72472 71182 71525 71707 71470 74604 83139 89931 96032 101449 102017 103449
8295 103449 110779 120585 132251 149492 169190 187361 214236 243630 279586 320645 370649 443210
8283 443210 543884 674792 838540 1029851 1234898 1437542 1612768 1721400 1755001 1715705
8273 1715705 1596777 1417208 1210977 1005805 823844 670256 546391 448085 376108 325220
8263C25220m3054l7593l1305k7456k8985k2771j6006j7785j1218p389R18k779
8251G9797p788r37j354L389O56l053l225l971m876j443l270k429r8n910o703k408
8235C6377l739N283K659M370J674p7K823k708j446M127J650n746l151l632j1858
8220B6606k0465k2363r120O929J3297J0026J0183O937l35k413j064m95n04K987
8206B0206J282k230k302K314K15o32L433J555j28k692M571J108k14j638m024j261
8190A9563j98J042k985n503j646M056M13J867K751l02l173l289k007J005J390
8175A2984j638n685k212l214p01M416N212N226j624n81R78K339j489n964k591
8160E456J640l13P78K842Q45L962J074J656R87r24J068l712k858Q96J302K736
$$ plain form
8263 325220 282166 244573 213268 185812 156827 134056 118050 100265 89047 81658 82576 79797
8251 79797 72009 71072 69718 73107 73763 70710 67485 63514 58638 57195 53925 51496 51398 45488 38785 36377
8235 36377 32638 37921 40580 44950 46624 46547 49370 46662 45216 49343 50993 45247 42096 38464 26606
8220 26606 6141 -16222 -25342 -18413 -5116 4910 15093 22030 21695 19282 18218 17723 17219 20206
8206 20206 21488 19258 16956 19270 19485 18853 22286 23841 23713 21021 25592 26700 26486 24848 20824 19563
8190 19563 19365 20407 17422 11919 10273 14329 14742 16609 19360 19058 15885 12596 10589 11594 12984
8175 12984 11346 5661 3449 235 -466 3950 9162 14388 12764 12183 13161 15500 14011 8047 5456
8160 5456 7096 6783 7561 10403 11248 15210 16284 17940 18927 18003 19071 15359 12501 13397 14699 17435
8144A7435N02J408J249j185j866q64n184k234N193j046J826N411L108k772m371
8129A6610j063m430n040j361J802M212J237j626k265J249M118j563J666j106p96
8114A1644k54K614k51l210j844k0Q54L070K336k164p8k406n772k242N428M253
8098A1958K19k040p297j371M536P66M639j698r99J652k161r42K881O053n43p129
8082H524l6K818k103P80K634L338K860l328j266j348p77l275j732l986L62K208
8066E673K024j521P92O53K843j781j769j440k793j300n169K579k328J203J683
8051f51P99J789N4K590k052k198N356M158j210l021K552K708j805l22l56k449
8035E942j631L252K641m334k405M48O646J002j086J930k646l063K6l93o33M657
$$ plain form
8144 17435 17937 19345 20594 19409 17543 16679 11495 9261 14454 13408 15234 20645 23753 20981 16610
8129 16610 15547 11117 6077 4716 6518 10730 11967 10341 8076 9325 13443 11880 13546 12440 11644
8114 11644 11390 14004 13753 10543 8699 8679 9533 12603 14939 12775 12697 10291 4519 2277 7705 11958
8098 11958 12177 10137 2840 1469 6005 6771 11410 9712 8713 10365 8204 7262 10143 16196 15653 8524
8082 8524 8488 11306 9203 9983 12617 15955 18815 15487 14221 12873 12096 8821 7089 3103 3465 5673
8066 5673 7697 6176 6968 7621 10464 8683 6914 5474 2681 1381 -3788 -1209 -3537 -2334 -651
8051 -651 148 1937 1991 4581 2529 331 5687 9845 8635 5614 8166 10874 9069 8747 8391 5942
8035 5942 4311 7563 10204 5870 3465 3913 10559 11561 10475 12405 9759 6696 6722 6329 5696 10353
8019A0353M690P9j826K395n08l11j474l38L45P32k121o21j789k236j190j901O328
8002A0607M495k590k221R86Q11j386J899j091k948j133J061J860k526o07k557
7987D660k280J807m0L150J570k438M86J901K813k578j847j963k545J379Q55M067
7971H997M119m593l67L7m383J792K788j432k294q26K809k838J242J138J638P8
7955G905k611o13q01L278L833m619l832J322p9n396L925k31j640K541M258o82
7939F558K398k043k907Q02K363l307l522J832L637j841k819J834j237Q26j345
7924A229M65K241J340j706k975k754M166L266m49k765M191L454k297J619j422
7909G603q92k740k350j92j185k800j148p24J239M508M758L290j789q85m36N4L969
$$ plain form
8019 10353 15043 15122 13296 15691 15183 14872 13398 13060 13405 14137 12016 11395 9606 7370 6180 4279 10607
8002 10607 15102 12512 10291 11277 12088 10702 12601 11510 8562 7429 8490 10350 7824 7217 4660
7987 4660 2380 4187 4147 7297 8867 6429 6915 8816 11629 9051 7204 5241 2696 4075 4930 8997
7971 8997 13116 8523 8156 8193 3810 5602 8390 6958 4664 3838 6647 3809 5051 6189 7827 7905
7955 7905 5294 4681 3880 7158 10991 6372 2540 3862 3783 -1613 2312 2081 441 2982 7240 6558
7939 6558 8956 6913 4006 4808 7171 3864 342 2174 5811 3970 1151 2985 1748 2574 1229
7924 1229 1694 3935 5275 3569 594 -2160 2006 5272 4823 2058 6249 9703 7406 9025 7603
7909 7603 6711 3971 1621 1429 244 -2556 -3704 -4428 -3189 1319 6077 9367 7578 6693 6257 6311 10280
7892A0280P69L7j138k473n983n281P42N594N10j201l072K380P63L055Ln475M39
7875e1k118K169N194k686k653j146J865O17R06k689l062m50l700k12J760M232
7859b024O62J847L46n48K542J330K66K593J49o006j880j347L400J883L478J09
7843F800j26r51J140K075J979J901q52o15k845m248R48J867J264n057l969m866
7827e555J305N405K081P6o58k540Q13J527K464K000l483N69m628k999M290M601
7811E268k093j952l524N23K554k516P63M106J243K43j677j58j407J57n98j737
7795h05K601Q48K826m70l974l301m512j596M954J164L375L54j423J180J490k871
7779a60j587M558j111K769L384j72l817k101L62n591J286J844j16M955J527J255
$$ plain form
7892 10280 11049 11086 9948 7475 1492 -3789 -3047 2547 3057 1856 -1216 1164 1927 4982 4985 -490 -51
7875 -51 -2169 0 5194 2508 -145 -1291 574 1191 2097 -592 -3654 -4104 -7804 -8016 -6256 -2024
7859 -2024 -1362 485 831 283 2825 4155 4421 7014 7163 1157 -723 -2070 1330 3213 6691 6800
7843 6800 6674 5723 6863 8938 10917 12818 11966 11351 8506 4258 5206 7073 8337 3280 -689 -5555
7827 -5555 -4250 1155 3236 3312 2654 114 927 2454 4918 6918 3435 4004 -624 -3623 667 5268
7811 5268 3175 1223 -2301 -1778 776 -1740 -977 3129 4372 4615 2938 2780 1373 1530 932 -805
7795 -805 1796 2644 5470 5000 1026 -2275 -6787 -8383 -3429 -2265 1110 1464 41 1221 2711 -160
7779 -160 -1747 2811 1700 4469 7853 7681 3864 1763 2125 -3466 -2180 -336 -452 4503 6030 7285
7763G285J185P28K675n500o702r76K827J636Q66j067p23O56l16N31k703k12K701
7746B891L777r1m887j291k759j069q12P05M788q58j771k635L15K466M534l011
7730B92l316L11L496M261j177n025l621j734k271J587K840J840K200l65j996k633
7714e311r33J332K474k122q05L598l37J184j045m596k97J661O031M313j684l124
7698C39j590l284K518L606j456q52N90R92J206k530o81k370k50j741K596M388
7682A481j336m820J44k227q50N73K155L796N40j628J398P62j549j363j561O3K350
7665b072M220O08J473J390L61m309k087M365L999k966o60K00l584K07l304K040
7649a19L004j425N50L318n788l252N059K498k335j248k207k654j731j845K548
$$ plain form
7763 7285 8470 9198 11873 6373 -329 -1305 1522 3158 4024 2957 2234 2890 2574 3105 402 190 2891
7746 2891 6668 6577 1690 399 -2360 -3429 -4241 -3536 1252 394 -1377 -4012 -3697 -1231 3303 292
7730 292 -3024 -2713 783 5044 3867 -1158 -4779 -6513 -8784 -7197 -4357 -2517 -317 -682 -2678 -5311
7714 -5311 -6244 -4912 -2438 -4560 -5365 -1767 -2104 -920 -1965 -6561 -6858 -5197 834 5147 3463 339
7698 339 -1251 -4535 -2017 1589 133 -719 -129 863 2069 -461 -1142 -3512 -3762 -5503 -2907 1481
7682 1481 145 -4675 -4531 -6758 -7608 -7035 -4880 -1084 -544 -2172 -774 -12 -1561 -2924 -4485 -4422 -2072
7665 -2072 2148 2756 4229 5619 5980 1671 -416 3949 7948 4982 4322 4522 938 1145 -2159 -119
7649 -119 2885 1460 2010 5328 -460 -3712 1347 3845 1510 262 -1945 -4599 -6330 -8175 -5627
7634e627r0K201K931K10r57p2K769j786k087P86j190L241K333j424j434O68N04
7617I76q21p397M093O514j754l553k999M724j899l043J815L388j96R44m876k688
7601f772L356L671j100k806j500k543J455M380J681k400K30J872j820K15M966
7586B885k800l800L000K530k595j082l82j367J95j140o15L216J416o6m44p46L906
7569B111J812l279j395P14l560J689L100J535J308J449j640j578j746k368l63
7554b211R3N62k147Q79P72j125l761LL586J760j028J577K207l102L142m1m292
7537c126M41q66j800o4k28k69Q37J694k569j304M39R76K221M860M333l042m284
7520a751l588K101M814j724j497k049n53K098K774O50j957K822o7j605n4J526
$$ plain form
7634 -5627 -5717 -3516 -585 -375 -1332 -1404 1365 -421 -2508 -1722 -2912 329 2662 1238 -196 472 976
7617 976 155 -7242 -3149 3365 1611 -1942 -4941 -217 -2116 -5159 -3344 44 -152 792 -4084 -6772
7601 -6772 -3416 255 -845 -3651 -5151 -7694 -6239 -1859 -178 -2578 -2348 -476 -2296 -2081 2885
7586 2885 85 -3715 -715 1815 -780 -1862 -2244 -3611 -3416 -4556 -5171 -1955 -539 -605 -1049 -1795 2111
7569 2111 3923 644 -751 -37 -3597 -1908 1192 2727 4035 5484 3844 2266 520 -1848 -2211
7554 -2211 -2118 -1556 -3703 -2824 -2052 -3177 -6938 -6935 -3349 -1589 -2617 -1040 1167 -1935 1207 1166 -3126
7537 -3126 -2685 -3551 -5351 -5415 -5643 -5912 -5075 -3381 -5950 -7254 -6815 -5839 -3618 1242 5575 2533 -1751
7520 -1751 -5339 -3238 1576 -148 -1645 -3694 -4247 -2149 625 1275 -682 2140 2073 468 414 1940
7504A940k997q20l6L184J680l374J024J526l527n668L373K927r38l2k516J60K306
7487a788K157k37K804l385j388K65K136j395l467J931L777j534m839J122K411
7472a430R70j918K574K17R31o0k816l072j32K314L822M019l517J406l511k231
7456b434J995k236j911P491N158J704k267j022j736j816Q09k194j381j331M970
7441C799N65j929k142j43N30j198j129r68j682K748J524k243j599R57L738K059
7425B887l456n684K158L541J388l77l009j041K377J071o24k694J403J73j234J074
7409b047k607k268L136L988L923J30j261l102n23N38j479L433L58m336k973J361
7393c729O691K185m712o517K10J064J894K52m178j267k417k5m612M223O559K969
$$ plain form
7504 1940 -1057 -1877 -1913 1271 2951 -423 601 2127 -1400 -7068 -3695 -768 -1706 -1738 -4254 -4094 -1788
7487 -1788 369 132 2936 -449 -1837 -1572 564 -831 -4298 -2367 1410 -124 -4963 -3841 -1430
7472 -1430 -460 -2378 196 413 1344 1284 -1532 -4604 -4736 -2422 1400 5419 1902 3308 -203 -2434
7456 -2434 -439 -2675 -4586 2905 8063 9767 7500 6478 4742 2926 3735 1541 160 -1171 3799
7441 3799 4364 2435 293 150 680 -518 -1647 -2615 -4297 -1549 -25 -2268 -3867 -2910 828 2887
7425 2887 -569 -6253 -4095 -554 834 457 -2552 -3593 -1216 -145 -769 -3463 -2060 -1887 -3121 -2047
7409 -2047 -4654 -6922 -3786 202 4125 4255 2994 -108 -631 -93 -1572 1861 2219 -2117 -5090 -3729
7393 -3729 2962 5147 435 -6082 -5872 -4808 -2914 -2662 -6840 -8107 -10524 -10549 -15161 -10938 -4379 -1410
7377a410K555O58j327O9j481K662j141l184M83J422l279J304K033P72K763J716
7361D615K148K754r08k542l645k333k355L092l18j03J125J330r56o463K460K094
7345ej058M729q07j802q33l024L649k58m303j556J067K530j752L85k163J52M58
7328d591Q66j227j685Q17O270L783q89j04O97m19k89r8n68j754o23O38m726J454
7310b448K844k52N68P42N364o7l302J352m26K93l302k290j211L506j830j256J375
7293c40K873r72k969M081j268o303l08j16K795L684L58j652j188K12k836N04L407
7276c8K477M68L648J196k794j792k321j951j75K713M325k074m746r27K408L186
7260C603j144k484M42j525l513J636M149k72n071J282J654j4k558p57j261J571
$$ plain form
7377 -1410 1145 1803 476 545 -936 1726 585 -2599 -2116 -694 -3973 -2669 -636 136 2899 4615
7361 4615 6763 9517 8609 6067 2422 89 -2266 826 508 405 1530 2860 1904 -4559 -2099 -5
7345 -5 -1063 3666 2859 1057 224 -2800 849 591 -3712 -5268 -4201 -1671 -3423 -3038 -5201 -5049 -4591
7328 -4591 -3725 -4952 -6637 -5820 450 4233 3344 3240 3937 3518 3229 3131 2563 809 186 824 -3902 -2448
7310 -2448 396 144 712 1454 6818 6751 3449 4801 4375 4668 1366 -924 -2135 1371 -459 -1715 -340
7293 -340 2533 1561 -1408 2673 1405 -4898 -5206 -5322 -2527 1157 1515 -137 -1325 -1113 -3949 -3445 -38
7276 -38 2439 2907 6555 7751 4957 3165 844 -1107 -1282 1431 5756 3682 -1064 -1991 417 3603
7260 3603 2459 -25 417 -1108 -4621 -2985 1164 892 -4179 -2897 -1243 -1257 -3815 -4572 -5833 -4262
7244d262k81QJ478k430J046r94k257N46K873M155K308J589k618m382M66l20K295
7227g80K223J70O89m281n93m975k224K345j32J956Q8j831N008Q24j96j06k122
7210c937j670j501o27l14K300R05Q10O90R72M357L96r24j084m21j485j354J016
7193a871k77m687l127K493m53j766R22K640k973l27N358J777k700m086m81j604
7177a1162R44J205J78M615M994j080J53O35m110n66K348J723j715n054K369M081
7161d42L79j524q79J135J843q67L76k332o077J110Q39j556J017Q178J068k300
7145c2k167j517K451M294M061n05l827J242j356O63J999L595n006m560l90R09
7129a46k168K823J710j386j608J231J799j990j570q22P69k019J547J839L607n076
$$ plain form
7244 -4262 -4543 -4535 -3057 -5487 -4441 -5435 -7692 -7146 -4273 -118 2190 3779 1161 -3221 -2755 -3075 -780
7227 -780 1443 1613 2302 -1979 -2572 -7547 -9771 -7426 -7558 -5602 -5514 -7345 -2337 -1513 -1709 -1815 -3937
7210 -3937 -5607 -7108 -7735 -8049 -5749 -4844 -4034 -3344 -2372 1985 2381 1457 373 -48 -1533 -2887 -1871
7193 -1871 -2148 -6835 -9962 -7469 -7922 -9688 -8766 -6126 -9099 -9426 -4068 -2291 -4991 -9077 -9558 -11162
7177 -11162 -10218 -9013 -8835 -4220 774 -306 -153 482 -3628 -4194 -1846 -123 -1838 -6892 -4523 -442
7161 -442 -63 -1587 -2466 -1331 512 -355 21 -2311 -8388 -7278 -6439 -7995 -6978 1200 2268 -32
7145 -32 -2199 -3716 -1265 3029 7090 6585 2758 4000 2644 3307 5306 8901 3895 -665 -1055 -146
7129 -146 -2314 509 2219 833 -775 456 2255 265 -1305 -2127 -1358 -3377 -1830 9 3616 -1460
7113a460o107J304K208J13j222K294K049l325q05L257J95O140N674j242l335J058
7097F796j992k520L15j970o3M285j307J98Q8J760m938K6N697j381m548n103N72
7080d085m70J993K266j800K662K793k605k220k946m372k596J160P003N497J260
7065C540j016n622p16J431J637j304j235M723O4J180k87O02k5p95K024J061k51
7048E011j267O75j38k643L556L739m402J738j306l125l580J613j464k792P97j575
7032e163K393L205j355j822m650j214m06K02O015K209J068o37j47L276L256k879
7016C351l558J925M57l367m492n15J298L044J097o44Q7K175o63M35j236k143M93
6999b256j963j773k964Q69l73j78J756m41j726p51M286J553r12L198k2J824%l656
$$ plain form
7113 -1460 -7567 -6263 -4055 -3942 -5164 -2870 -821 -4146 -4951 -1694 -1499 4641 10315 9073 5738 6796
7097 6796 4804 2284 2599 629 566 4851 3544 3742 3830 5590 652 678 6375 4994 446 -4657 -4085
7080 -4085 -4555 -2562 -296 -2096 566 3359 754 -1466 -4412 -8784 -11380 -10220 -3217 2280 3540
7065 3540 2524 -3098 -3814 -2383 -746 -2050 -3285 1438 1502 2682 2395 2997 2972 2177 4201 5262 5011
7048 5011 3744 4419 4281 1638 5194 8933 4531 6269 4963 1838 -1742 -129 -1593 -4385 -3588 -5163
7032 -5163 -2770 435 -920 -2742 -7392 -8606 -9012 -8810 -2795 -586 482 -155 -302 2974 6230 3351
7016 3351 -207 1718 2175 -1192 -5684 -6199 -4901 -1857 -760 -1404 -1317 858 195 630 -606 -2749 -2256
6999 -2256 -4219 -5992 -8956 -8087 -8460 -8638 -6882 -7323 -9049 -9800 -5514 -3961 -4873 -1675 -1697 127 127 -3529
6981c529M509L02J556K339k848k801j200j031k124j1L722k385J994J057K592N55
6965B697m088k350R72O778M85k541n369J589M498K356j78o487n55J372k683K87
6949c217J57r80J804M275n42J445k069j563p55j415K272L376j111K098j319j611
6933H45o174q71M708K574m97l334P102J327k321k927j335k640K317Q26k61K926
6917B265l73J464m591o699j040O908M454rJ582L78k543k995l278K498J35J85K766
6900A107j74J805j2J059o045k425J469J009K596M661L836J922O60k650l354k439
6884C025m281N76L247k246j522j824n325J453L133J931J732J798r25M14j446J65
6868i5O012p16l764j948M25M935o01n328K17M25Q34P7p78k629o664L800J020J000
$$ plain form
6981 -3529 980 1282 2838 5177 2329 -472 -1672 -2703 -4827 -4838 -1116 -3501 -1507 -450 2142 2697
6965 2697 -1391 -3741 -2769 4009 4494 1953 -3416 -1827 2671 5027 4849 -1638 -2193 -821 -3504 -3217
6949 -3217 -3060 -4040 -2236 2039 1497 2942 873 -690 -1445 -2860 -588 2788 1677 3775 2456 845
6933 845 -5329 -6200 -1492 1082 585 -2749 4353 5680 3359 432 -903 -3543 -1226 -400 -661 2265
6917 2265 1892 3356 -1235 -7934 -8974 -2066 2388 2379 3961 4339 1796 -1199 -4477 -1979 -1844 -1659 1107
6900 1107 933 2738 2726 3785 -2260 -4685 -3216 -2207 389 5050 8886 10808 11468 8818 5464 3025
6884 3025 -1256 -680 2567 321 -1201 -3025 -8350 -6897 -3764 -1833 -101 1697 772 1186 -260 -95
6868 -95 5917 5201 1437 -511 -86 4849 4248 -1080 -863 -438 396 473 -305 -2934 -9598 -5798 -4778 -3778
6850c778j445N8K949J035l500m71k224q93L836N025M04K607L265l825l526j83
6834f66j754R30J620J551j457J285K434j783R21Q93L501n26l580j553k64j294
6818B58M575j400l275J576L680R4l22l661o267m26O81K874L582j070j022L309
6802C186p31K615J801l838j026P217J1145O815O697N303n090p716m944k914j165
6787A7355J74M18L712O109L166N535j47N493J2982J6716J6223K8071M1494O6097
6773B23398J10594J72078K18072J45879q3541k13795j90964j24173p1606m8179
6763A37763l5709k4218j8207j2452o571l562k721k149o472j0293l620j540K611
6750A2860K889M149L942K769K734l365l523j993n048l064j509j978o42o09m143
$$ plain form
6850 -3778 -5223 -5165 -2216 -1181 -4681 -5152 -7376 -8269 -4433 592 996 3603 6868 3043 -483 -666
6834 -666 -2420 -1490 130 1681 224 1509 3943 2160 3081 3974 7475 6949 3369 1816 1552 258
6818 258 4833 3433 158 1734 5414 5508 5186 1525 -4742 -5168 -4487 -1613 1969 899 -123 3186
6802 3186 2455 5070 6871 3033 2007 9224 20369 27184 33881 39184 34094 26378 21434 18520 17355
6787 17355 17529 17947 21659 27768 30934 36469 36322 41815 54797 71513 87736 115807 157301 223398
6773 223398 333992 506070 724142 870021 786480 572685 381721 257548 185942 137763
6763 137763 102054 77836 59629 47177 40606 37044 34323 32174 25702 15409 11789 10249 12860
6750 12860 15749 19898 23840 26609 29343 25978 22455 20462 15414 12350 10841 8863 8221 7612 3469
6735C469k920M724K392k73m040J18k770K473j202n494o78j555o57M471J082k86
6719a146R93L20k802j160O36L503j876k038k526J866N834J191r43Q80j214m716
6703c198J174j740K733P465n88m102m239K312K385J147k753k715j273J20J169
6688b103J321J74J050K601m228J329j609m253m381N234P330n3K151j501o50k39
6672B173M91M46m20r61J081J163m018M77N110j792l166k372r01J049J295K67J460
6655A382Q05P37l049j383L870o78m170K880M513k253p14j635J262L635j163n608
6639a569Q66K174k205n98J081J158m909k126O465n267k471K829J940j600j862
6624f094j31K604J035J035p42J658P00k89J065k297j038j702P87L674r28J481
$$ plain form
6735 3469 549 5273 7665 7392 3352 3470 700 3173 1971 -3523 -4201 -5756 -6413 -1942 -860 -1146
6719 -1146 -153 167 -2635 -3795 -3159 344 -1532 -3570 -6096 -4230 1604 2795 1852 2732 1518 -3198
6703 -3198 -2024 -3764 -1031 6434 5846 1744 -2495 -183 2202 3349 596 -2119 -3392 -3272 -2103
6688 -2103 -782 -608 442 3043 -1185 144 -1465 -5718 -10099 -4865 2465 2412 4563 3062 2412 2173
6672 2173 2664 3110 2690 1729 2810 3973 -45 432 5542 3750 584 -1788 -2689 -1640 -345 -78 1382
6655 1382 2187 2924 -125 -1508 2362 1684 -2486 394 4907 2654 1940 305 1567 5202 4039 -1569
6639 -1569 -703 1471 -734 -1332 -251 907 -4002 -6128 337 -4930 -7401 -4572 -2632 -4232 -6094
6624 -6094 -6225 -3621 -2586 -1551 -2293 -635 65 -224 841 -1456 -2494 -4196 -3409 265 -663 818
6608H18J034j55j113l000k893l23L027O6l044j689J999N113m652P25L576j731
6592b242K36K83r68n315k70M625J505k59j224o26O27J613J51L742l324j165j98
6575b809K276q94j336k330K487M917L178l249m70k941J466l659k169M78r30J113
6559d872L517q39j620j02j405K84M87j037j624M145J217K549k449p73J03N88j98
6542b029L098J03k520r92m2O83m63j077L18l147k894L638O629l67K515N091l726
6525D818N54O46L82L31j032k464J506j249n460l064k830R14L260o4J906j940k354
6508f140L80j149k452Q68K276L636K208K950l371n062K377L563M14P92N606k290
6492D606m394l434M72L287J527j51r88l137L483j558j312J330k566m379J717J962
$$ plain form
6608 818 1852 1697 584 -2416 -5309 -5632 -2605 -2539 -5583 -7272 -5273 -160 -4812 -4087 -511 -2242
6592 -2242 -2006 -1723 -2691 -8006 -8276 -3651 -2146 -2405 -3629 -4255 -3628 -2015 -1864 1878 -1446 -2611 -2809
6575 -2809 -533 -1427 -2763 -5093 -2606 2311 5489 2240 1770 -1171 295 -3364 -5533 -5055 -5985 -4872
6559 -4872 -1355 -2194 -3814 -3916 -5321 -5037 -4550 -5587 -7211 -3066 -1849 700 -1749 -2522 -2419 -1831 -2029
6542 -2029 1069 1172 -1348 -2340 -2382 -1699 -2162 -3239 -2921 -6068 -8962 -5324 1305 938 3453 8544 4818
6525 4818 5372 6018 6400 6731 5699 3235 4741 3492 -1968 -5032 -7862 -6948 -3688 -3752 -1846 -3786 -6140
6508 -6140 -5760 -6909 -9361 -8493 -6217 -2581 -373 2577 -794 -5856 -3479 84 498 1290 6896 4606
6492 4606 212 -3222 -2750 537 2064 1913 925 -2212 1271 -287 -1599 -269 -2835 -7214 -5497 -3535
6476c535J482K470j54M96K436O54k197l212p30M350P03Q1J889k872j876j279l997
6459e291m108L69P06J731n92M591L574j4R8m349l240M872O482j34r40m752k209
6442c206P11J187K898L003r28k274K096p82J152q55l495q40j39p59L10J439n99
6425a081R36l023Q59n58J482k349R81j491o87K911Q27M24K564J661j070m86j918
6408a8l973p93L524K74K853L195j029m516J534K622J415k353j038k099l804J895
6392b311K992l021J06K748j162m783q81L934L087n18m023j430N774K643j518j969
6376c32k30K75K984J357m546k524l127k582M487J383k059J809k78K77k36j46k038
6359e526J237M550K128k705j595N525K579m215j282Q93o11j210j852l598j147
$$ plain form
6476 -3535 -2053 417 263 759 3195 3849 1652 -1560 -2290 2060 2763 2844 4733 1861 -15 -1294 -5291
6459 -5291 -9399 -9030 -8324 -6593 -7185 -2594 980 966 1064 -3285 -6525 -1653 4829 4695 3755 -997 -3206
6442 -3206 -2495 -1308 1590 4593 3665 1391 3487 2705 3857 3002 -493 -1333 -1472 -2231 -1921 -482 -1081
6425 -1081 -145 -3168 -2309 -2867 -1385 -3734 -2753 -4244 -4931 -2020 -1193 -769 1795 3456 2386 1900 -18
6408 -18 -3991 -4784 -1260 -986 1867 5062 4033 -483 1051 3673 5088 2735 1697 -402 -4206 -2311
6392 -2311 681 -2340 -2234 514 -648 -5431 -6312 -2378 709 191 -3832 -5262 512 3155 1637 -332
6376 -332 -562 -287 2697 4054 -492 -3016 -6143 -8725 -4238 -2855 -4914 -3105 -3383 -3106 -3342 -3488 -5526
6359 -5526 -4289 261 2389 -316 -1911 3614 6193 1978 696 1589 978 -232 -2084 -5682 -6829
6344f829O80K038J729K46N07j074m30K90O47l567j771O47K633n256K262q94j280
6327i422K6P329J97n034j109o13k795O263K974J764j254k181R36m74O84j467M90
6310c686K153j581M13j71n91n9K227j41l772j679J103N27k051k538K922J34q59
6293g649R1J459N378j756K20L25J749n27k489k267K230k218Q60J03j991q87O256
6276a113O490n638l469K271l92k770j502L578P72J126m956j531l32K157N576l570
6260c303k760L341N60o15j143J159O02k658O68J182L865l046l383K247K97o95
6244c682M177q01J722K998m78O51L86k095K520mm37m523k734J465K460M555j325
6227D855l968Q39L4o1n11O37N495J144m274n056L60J96k056k199k11M311K022
$$ plain form
6344 -6829 -6149 -4111 -2382 -2136 -1629 -2703 -3133 -2843 -2196 -5763 -7534 -6887 -4254 -9510 -7248 -8142 -9422
6327 -9422 -9396 -2067 -1870 -6904 -8013 -8626 -11421 -5158 -2184 -420 -1674 -3855 -2919 -3393 -2709 -4176 -3686
6310 -3686 -1533 -3114 -2701 -2872 -3463 -3522 -1295 -1436 -5208 -6887 -5784 -5257 -7308 -9846 -6924 -6790 -7649
6293 -7649 -7558 -6099 -721 -2477 -2257 -1932 -183 -710 -3199 -5466 -3236 -5454 -4594 -4491 -6482 -7369 -1113
6276 -1113 5377 -261 -3730 -1459 -1851 -4621 -6123 -2545 -1773 -647 -5603 -7134 -7466 -5309 267 -3303
6260 -3303 -6063 -2722 -2162 -2777 -3920 -2761 -2159 -4817 -4149 -2967 898 -2148 -5531 -3284 -2987 -3682
6244 -3682 495 -306 1416 4414 3936 4587 4973 2878 5398 5394 4957 434 -2300 -835 1625 6180 4855
6227 4855 887 1726 1760 1699 1188 1825 7320 8464 4190 -866 -506 -310 -2366 -4565 -4776 -465 1557
6210A557O716M64l331N36k700n927J799q24l150p65O268L86l612j839J534n31
6194c419J20K387K808l554r28J584R64q04J838N82k745k97r39q18j994j358R7
6177f476N00M000K225j859p19k30q77k689K251n62R90K083n30j372K823K926l302
6160h18P44L009K133o026L92J374j92q89r4K155K045jM90p26j498j555r43J118
6142G18M53J298l079n65q02J352J924n37j552k347k409j260J090K687j223l33
6126d585O80J68M431J840n81n16K045l492n002K112P41L34K796L785m35r77N32
6109C876L27j432n408k644n684K14J344J633J520K378J954J138M621k413k385
6094i61m691J141L809M501m176k247K455K407K848j592k625j447K069j061O95
$$ plain form
6210 1557 8273 8737 5406 5942 3242 -2685 -886 -1710 -4860 -5625 643 1029 -2583 -4422 -2888 -3419
6194 -3419 -3299 -912 1896 -1658 -2586 -1002 -38 -842 996 1578 -1167 -1464 -2403 -3221 -5215 -6573 -6476
6177 -6476 -5976 -1976 249 -1610 -2329 -2559 -3436 -6125 -3874 -4436 -3446 -1363 -1893 -3265 -442 2484 -818
6160 -818 -74 2935 5068 -958 -566 808 616 -273 -367 1788 3833 3832 4322 3596 2098 543 -400 718
6142 718 1171 2469 -610 -1175 -1977 -625 1299 762 -790 -3137 -5546 -6806 -5716 -3029 -4252 -4585
6126 -4585 -3905 -3737 694 2534 1953 1437 3482 -10 -5012 -2900 -2159 -1825 971 4756 4321 3344 3876
6109 3876 4203 2771 -2637 -5281 -10965 -10751 -9407 -7774 -6254 -3876 -1922 -784 3837 1424 -961
6094 -961 -5652 -4511 -702 3799 -377 -2624 -169 2238 5086 3494 869 -578 1491 430 1125
6079A125k261K256j918j532K172q58k612l529K46j196N497k003R04k02k393k315
6063h619M447M151L00j535m30n5J473J461p99L58K900k653m838m903J351J152
6047f239M49j2N943M707k860k161J058K11J101L812k39q16j83K134q56n643J62
6030E68j949J030l14K920L441j638l746m70K981k005k864M095l15l045m052l789
6014i152O442N460Q3k327J005j210k429L70J941J028N040k803l647j867L658L82
5998A974k676l981K16R44K097K467J426K061j764l940m754r72o27J925L708j251
5982c147j385j761R32M647k162m715J04L272o93L083n19J504N12O06M008P318
5966A1604m127n029j681l631l406J076K358j17l690K815N432L757j604n055l608
$$ plain form
6079 1125 -1136 1120 -798 -2330 -158 -1016 -3628 -7157 -6911 -8107 -2610 -4613 -3709 -3911 -6304 -8619
6063 -8619 -4172 -21 279 -1256 -1686 -1741 -268 1193 394 752 3652 999 -3839 -8742 -7391 -6239
6047 -6239 -5790 -5802 141 4848 1988 -173 885 1096 2197 6009 5770 4954 4771 6905 6049 406 568
6030 568 -1381 -351 -665 2255 5696 4058 312 -158 2823 818 -2046 2049 1734 -1311 -5363 -9152
6014 -9152 -2710 2750 2833 506 1511 301 -2128 -1758 183 1211 6251 3448 -199 -2066 1592 1974
5998 1974 -702 -4683 -4467 -3523 -1426 1041 2467 4528 2764 -1176 -5930 -6902 -7529 -5604 -1896 -3147
5982 -3147 -4532 -6293 -5361 -714 -2876 -7591 -7487 -4215 -4908 -1825 -2344 -840 -328 278 4286 11604
5966 11604 7477 2448 767 -2864 -6270 -5194 -2836 -2953 -6643 -3828 1604 5361 3757 -1298 -4906
5951d906L598J136j675q42k616J252K92K366K433o23J270K673j893j614m53P4
5935D72J643l127J297O301q71o407l306n87K31M43J877N93K03k412J396M929o09
5918B066q51k449J055k588k997J116N177q42l00j5K37k043K053L2j519L303N951
5901G386j023m902n94M230q12j987r53j380K665l57j791k138k510l727K341K587
5885b965J591L478k269k111l458L02k462L783L654L84K196j6k353M37o36j061
5869a506J388L58L363j966m049J716L3p66J836J155k79m063K708K733j566k25
5853H70O3K17j757q2J39j689J542j029L810J15j583k797j301K285R21j010K653
5836A367J202k311l216r7K883P134L068J695o01r81j059k058k198k845l346K176
$$ plain form
5951 -4906 -1308 -172 -1847 -2689 -5305 -4053 -3761 -1395 1038 415 1685 4358 2465 851 398 472
5935 472 2115 -1012 285 6586 5715 -692 -3998 -4585 -4354 -3911 -2034 -1441 -1238 -3650 -2254 2675 2066
5918 2066 1215 -1234 -179 -2767 -5764 -4648 529 -313 -613 -628 -391 -2434 -381 -349 -1868 1435 7386
5901 7386 6363 1461 867 5097 4285 2298 1345 -35 2630 2273 482 -1656 -4166 -7893 -5552 -2965
5885 -2965 -1374 2104 -165 -2276 -5734 -5432 -7894 -4111 -457 -73 2123 2107 -246 191 -445 -1506
5869 -1506 -118 240 3603 1637 -2412 -696 -663 -1429 407 1562 1283 -2780 -72 2661 1095 870
5853 870 933 1150 -607 -689 -550 -2239 -697 -1726 2084 2199 616 -2181 -3482 -1197 -276 -1286 1367
5836 1367 2569 258 -2958 -3055 -172 6962 10030 11725 11124 10143 9084 7026 4828 1983 -1363 813
5820H13k580k634j177L753K375K58L48q54L701j619l275o78K026M73p69k446L159
5803H74J870k389j73J871M766p91k402R67K174m144n985J886M709R32M062o50
5787G577j744p280N54m044r27L334K111M91j48j392O06j478p97j178J070O649
5771C404k31l671k744Q36R45J090l8O9K443k565j390j304k298K153M162L257J105
5754E223m28k392J264k563l91M38l97j950j319R07j490k488L385M718J524K248
5738F289q55L5j436j509j789J404J142J980j869k244k877n68J637m039K225k758
5722e232Q58J821l99n558l663j284o54L846M703O94j672L299N158K102m615o136
5706f732J045L194M332J074m439l568l23j014J603J469L729K566M16K408j597
$$ plain form
5820 813 -1767 -4401 -5578 -1825 550 808 1156 302 4003 2384 -891 -1569 457 930 161 -2285 874
5803 874 2744 355 182 2053 6819 6028 3626 4593 6767 2623 -3362 -1476 3233 4165 8227 7577
5787 7577 5833 -1447 -893 -4937 -5864 -2530 -419 72 -76 -1468 -862 -2340 -3137 -4315 -3245 3404
5771 3404 3173 -498 -3242 -2406 -1461 -371 -409 -340 2103 -462 -1852 -3156 -5454 -3301 861 4118 5223
5754 5223 4795 2403 3667 1104 713 1151 754 -1196 -2515 -1608 -3098 -5586 -2201 2517 4041 6289
5738 6289 5434 5469 4033 2524 735 2139 3281 5261 3392 1148 -1729 -2297 -660 -4699 -2474 -5232
5722 -5232 -4374 -2553 -2952 -8510 -12173 -13457 -14111 -10265 -5562 -4868 -6540 -3241 1917 4019 -596 -6732
5706 -6732 -5687 -2493 1839 2913 -1526 -5094 -5417 -6431 -4828 -3359 370 2936 3352 5760 4163
5691D163m137P67l55J195J734J937r99O23k577k251J425l98K055J632k26J598
5675F186m279l981Q39k841Q80q72N583L851j985o760k187L553L110K545n59j349
5659A734J280j76k11J17N38k931J031N51K239j186J428M357k536p121N15Q63l08
5642A84K769P93J433k486k975J125j648j088J595k471m086N51l217J336l595K438
5626i342L212L386K751k796p56k354K038J578J062n04l637nK333r59M514M914
5610E435J061q125n360L507Q299Q13o431J193J226j891M470q80m432j633j136
5595c884n9j105m7l09Q28q5J006j152M722O79j589k139k753J91o59K472M095K423
5577B635N61m66k813o892L209L164l64J615k232n19K717L062l115l662l58p46
$$ plain form
5691 4163 26 793 438 1633 3367 5304 4305 4928 2351 100 1525 1127 3182 4814 4588 6186
5675 6186 1907 -2074 -1235 -4076 -3196 -4068 1515 5366 3381 -3379 -5566 -2013 1097 3642 3083 1734
5659 1734 3014 2838 2627 2744 3282 351 1382 1933 4172 2986 4414 8771 6235 -886 -371 492 184
5642 184 2953 3746 5179 2693 -282 843 -805 -1893 -298 -2769 -6855 -6304 -9521 -8185 -11780 -9342
5626 -9342 -6130 -2744 7 -2789 -3545 -5899 -3861 -2283 -1221 -1725 -5362 -5367 -3034 -3993 521 5435
5610 5435 6496 -1629 -6989 -3482 4817 5630 -801 392 1618 -273 4197 3317 -1115 -2748 -3884
5595 -3884 -3943 -5048 -5095 -5404 -4576 -4661 -3655 -4807 -85 594 -995 -3134 -5887 -5696 -6355 -3883 212 2635
5577 2635 3196 2730 -83 -6975 -3766 -602 -966 649 -1583 -2102 615 3677 562 -3100 -3458 -4204
5561d204q22L461j649j24P335j287k568k185p21l565j224N559J926m086m289L673
5545d770J446J922k415k897k433M067l75J623J829J19l599L547J449m532n78m55
5529f052j532P57R60L748L153r06K15j590k301j64K662J666J055K426m822l508
5513d233K188L895P19k925l184n83j882k408K303k574j015M622M385J685J376
5498B369j448k892R08J82k469K328J83l331m70N598L271K217k01q151l224j535
5482f665j779K794L861K375L312j409n055J542O58n189J023L182L488q47j121
5467A70m413J261J707j08p02J730J852l425j247R09k456k6L016K479L336j606
5451B477p111o20j73k047K688M128J768j05M025J480k79q17k810J70O07k517l230
$$ plain form
5561 -4204 -5026 -1565 -3214 -3338 3997 2710 142 -2043 -2764 -6329 -7553 -1994 -68 -4154 -8443 -4770
5545 -4770 -3324 -1402 -3817 -6714 -9147 -5080 -5455 -3832 -2003 -1884 -5483 -1936 -487 -5019 -5597 -6052
5529 -6052 -7584 -6827 -5867 -2119 1034 128 343 -1247 -3548 -3712 -1050 616 1671 4097 -725 -4233
5513 -4233 -2045 1850 2569 -356 -3540 -4123 -6005 -8413 -6110 -8684 -9699 -5077 -692 993 2369
5498 2369 921 -1971 -1063 -881 -3350 -1022 -839 -4170 -4640 958 4229 6446 6245 -1906 -5130 -6665
5482 -6665 -8444 -5650 -1789 586 3898 2489 -2566 -1024 -366 -5555 -4532 -1350 2138 1291 170
5467 170 -4243 -2982 -1275 -1383 -2085 -355 1497 -1928 -3175 -2266 -4722 -4748 -1732 747 4083 2477
5451 2477 -4634 -5254 -5427 -7474 -4786 -658 1110 1005 5030 6510 6231 5414 2604 2774 3381 864 -2366
5434b366p21L797L480K4j47k292L361L57k608O28n978k171L537j101k522L491
5418a231k026k633j411L792J628L495J189J484r0M91l109o667j860m31n354k184
5402a4917L01M415K869l13L62L106L982M065k017l593K793R31j505m02k441l040
5386e404K23K406L381J729K107m275K038o59j877q40M79o51J109M10K337m60l129
5369a076m132L072O297O302n427o350m780n08J880p14j431K189j524J988K445
5354a769L974k116Q2K213K558m081j824k413K335K162q76k074M95N48n33K059
5338G40J233m019J376J515N91j705k795K420M93r66L634k39l511M27L74J128J712
5321B408p73Q90k27l325l998L58N842J086l867J769K617J66L48J450n859K731
$$ plain form
5434 -2366 -3087 710 4190 4214 4067 1775 5136 5493 2885 3513 -2465 -4636 -1099 -2200 -4722 -1231
5418 -1231 -3257 -5890 -7301 -3509 -1881 1614 2803 4287 4197 4688 1579 -5088 -6948 -7379 -12733 -14917
5402 -14917 -14616 -10201 -7332 -7645 -7283 -4177 -195 3870 1853 -1740 1053 1984 479 77 -2364 -5404
5386 -5404 -5181 -2775 606 2335 4442 167 2205 1546 -331 -1171 -692 -1343 -234 176 2513 2053 -1076
5369 -1076 -5208 -2136 4161 10463 5036 -1314 -6094 -6602 -4722 -5436 -6867 -4678 -6202 -4214 -1769
5354 -1769 2205 89 171 2384 4942 861 -963 -3376 -1041 1121 245 -1829 -1334 -786 -1319 740
5338 740 1973 -2046 -670 845 1436 -269 -3064 -644 -151 -1117 2517 2278 -1233 -806 -432 696 2408
5321 2408 1635 2525 2298 -1027 -5025 -4667 1175 2261 -1606 163 2780 2946 3294 4744 -1115 1616
5305A616N595j873k191K655p95Q97j819k310j884J628J658j162k410m193K238
5290b350Q02k512l43j98K815j683r00j90P7l438q05r2j903M993O274l157k052
5273d662L182J592P71L905L654n75k216p38L36L769k041q88n470j528k302r32
5257d143J174L120K167J006k279l320J877k064m154K438L866L395L978p70r04
5242E387k70m25j048r2n885j235M69j599K473R86Q94K977K75P24j15K321M48k874
5224C411l033L13l60J701N06m887j45k097P86J574k444p67J099k996q38J260N12
5207f405q85K065k885r11N801K393m2J170k905l098K00k53L71j188J796N122O10
5190I56J188k010n228j77L725L297m94k947j059K691j552k684r99n03Q09O49j526
$$ plain form
5305 1616 7211 5338 3147 5802 5007 5904 4085 1775 -109 1519 3177 2015 -395 -4588 -2350
5290 -2350 -1548 -4060 -4403 -4601 -1786 -3469 -4369 -4559 -4482 -7920 -8725 -8817 -10720 -5727 547 -2610 -4662
5273 -4662 -1480 112 883 4788 8442 7867 5651 4913 5249 9018 6977 6089 619 -909 -3211 -4143
5257 -4143 -2969 151 2318 3324 1045 -2275 -398 -2462 -6616 -4178 -312 3083 7061 6291 5387
5242 5387 5117 4692 3644 3552 -2333 -3568 -3099 -4698 -2225 -1239 -345 2632 2907 3631 3516 5837 6285 3411
5224 3411 378 691 331 2032 2538 -2349 -2494 -4591 -3805 -2231 -4675 -5442 -4343 -7339 -8177 -6917 -6405
5207 -6405 -7290 -5225 -8110 -9021 -3220 -827 -869 301 -2604 -5702 -5502 -5755 -5384 -6572 -4776 346 956
5190 956 2144 134 -5094 -5271 -1546 1751 1257 -1690 -2749 -58 -1610 -4294 -5293 -5796 -4987 -4338 -5864
5173e864k552Q22M102L752j954L021o86N40O26m509l235l137L73P355J612J776
5157B042k035J447K952Q30j152n93q77J019l822k165P22K057j50j764L182P79
5141B472k04n086k81J095K175K153j794o59L099J014r96k100r31j014q24K659
5125G78K20n251j378L589K921J053R53M350J101k371k690l834m947J591J179q40
5109c576M324K880j685J94k102j84K79k590J778L6j315J476K31j48j194K176K253
5092B833r8k643r07k756j722k431k252J871N783L65R72j293K19q81j483l241J396
5075f268J996k51j21Q7K716L246M596l298k731j673k493J397J275K23J84K74J277
5058D36P15n483n4J307k687m825K550M521j479J630L105M179P0j450K225n809
$$ plain form
5173 -5864 -8416 -7594 -3492 260 -1694 1327 641 1181 1807 -2702 -5937 -9074 -8701 -1346 266 2042
5157 2042 7 1454 4406 5236 4084 3491 2614 3633 -189 -2354 -1632 425 275 -1489 1693 2472
5141 2472 2268 -2818 -3099 -2004 171 2324 530 -129 2970 3984 2988 888 -43 -1057 -1881 778
5125 778 998 -4253 -5631 -2042 879 1932 2885 7235 8336 5965 3275 -559 -5506 -3915 -2736 -3576
5109 -3576 748 3628 1943 2137 35 -149 130 -2460 -682 -646 -1961 -485 -254 -402 -1596 580 2833
5092 2833 2735 92 -815 -3571 -5293 -7724 -9976 -8105 -2322 -1957 -985 -2278 -2059 -2940 -4423 -7664 -6268
5075 -6268 -4272 -4523 -4644 -4557 -1841 1405 6001 2703 -28 -1701 -4194 -2797 -1522 -1299 -1115 -841 436
5058 436 1151 -4332 -4386 -3079 -5766 -10591 -8041 -3520 -4999 -3369 -264 3915 3985 2535 4760 -1049
5042a049j434L278K264k171J068J741l4R58p06l213N77l352k20l54n32N283L098
5025E202j231j351p27r67N810L446m000o29n123K39j28N23k373k007J668J846
5009A98R96j101Q37l691l213l83K691L394L63J817K2M59j545l434j704K341L466
4992A513p13l199j701o88m149J93L375L568L724q66k9j131m427j622L413L361
4976F22J930j293J022L732o46n356l758M172N005J973k87l183j011K080k111m514
4960a623m777O17L196M276k793k841K796L175J26R25K816k435l228l732l602L624
4944c480J579J535k414M922K184m244k879J34m94L090J941J860l75j027m05n352
4928c425l812j686R8L881M533M449N14l277m264K251j836m292K326L623N68k654
$$ plain form
5042 -1049 -2483 795 3059 888 1956 3697 3663 4621 3915 702 1279 -2073 -2293 -2647 -3179 2104 5202
5025 5202 3971 2620 1893 926 6736 10182 6182 5553 430 669 541 1064 -1309 -3316 -1648 198
5009 198 1194 93 930 -2761 -5974 -6357 -3666 -272 91 1908 1930 2389 844 -2590 -4294 -1953 1513
4992 1513 800 -2399 -4100 -4788 -8937 -8744 -5369 -1801 1923 1057 1028 -103 -4530 -6152 -2739 622
4976 622 2552 1259 2281 6013 5367 11 -3747 425 5430 7403 7116 3933 2922 5002 2891 -1623
4960 -1623 -6400 -5783 -2587 1689 -1104 -3945 -1149 2026 2152 3077 5893 3458 230 -3502 -7104 -3480
4944 -3480 -1901 -366 -2780 2142 4326 82 -2797 -2663 -3157 -67 1874 3734 3359 2332 1927 -3425
4928 -3425 -7237 -8923 -8825 -4944 -411 4038 4552 1275 -2989 -738 -2574 -6866 -4540 -917 -349 -3003
4912c003P25N51q78K754o96k914L17j735j49N16L705R11l559K617R43J311K327
4895C743L631k030m438m009o58K440n34n481k611N370J433o00M833J784o14O10
4879B869l598q77l752J26j386K97L359M32M192o46k168k391L9K46L434k014k706
4862d544K121K293o37L307L111J278Q29j026O2j362k164J871k961K107o48l68
4846C269k958j624R40l501j81K117L930o83k172J737P8m909M84L264O408j284
4830D915k698j71j723j490J190L29L062oj070k583l02J365j320J743K699o03m376
4813a039L062r68m499J454N12p4J309K518K691L359k670M84j806n42j907k498
4797f14k695M98m537L362L495k363m076L99M138J113K529m229l553O21N198J756
$$ plain form
4912 -3003 -2278 -1727 -2605 149 -547 -3461 -3144 -4879 -5028 -4512 -807 104 -3455 -838 105 1416 3743
4895 3743 7374 5344 906 -3103 -3761 -1321 -1855 -7336 -9947 -4577 -3144 -3744 1089 2873 2259 2869
4879 2869 -729 -1606 -5358 -5232 -6618 -6321 -2962 -2530 1662 1016 -1152 -3543 -3504 -3258 176 -1838 -4544
4862 -4544 -2423 -130 -767 2540 5651 6929 7758 6732 6794 5432 3268 5139 2178 4285 3637 3269
4846 3269 311 -1313 -373 -3874 -4055 -1938 1992 1309 -863 874 952 -3957 -3473 -209 6199 4915
4830 4915 2217 2046 323 -1167 23 352 3414 3408 2338 -245 -547 818 -502 1241 3940 3337 -1039
4813 -1039 2023 1055 -3444 -1990 -1478 -1552 -243 2275 4966 8325 5655 6139 4333 3791 1884 -614
4797 -614 -3309 -2811 -7348 -3986 -491 -2854 -6930 -6531 -2393 -1280 1249 -2980 -6533 -5912 -714 1042
4781A042R66J709l09j746J903M300K721n271j038M32j178K048K111K105j945l18
4765G532j111k601j39j758j193O06n94q27K002j984L194L779l247l145m19J194
4749A289N221l58J189n30m802k534k743K191K776k747j994k332k910l846j819
4734a3949J770M521L958M147L405L156J435k313l501qJ775l556j767J199l151
4719b879p92L474k178j749J295k59J812Q61J006m68j159L075Q1l372r05O4k790
4702d883J433K685J508J356J419j975l088k388l507L770K950K990l670j905j793
4687e098R10M264L498J957n062J936j337j258k775k309j480L48j777j699K817
4672g065N415q58j4K790l009J338K427l245J221N640J580m080k592k529N105M546
$$ plain form
4781 1042 2008 3717 3408 1662 3565 7865 10586 5315 4277 4709 3531 5579 7690 9795 7850 7532
4765 7532 6421 3820 3681 1923 730 1336 742 -85 1917 -67 3127 6906 3659 514 95 1289
4749 1289 6510 6152 7341 6811 2009 -525 -3268 -1077 1699 -1048 -3042 -5374 -8284 -12130 -13949
4734 -13949 -12179 -7658 -3700 447 3852 7008 8443 6130 2629 2621 4396 840 -927 272 -2879
4719 -2879 -3671 -197 -2375 -4124 -2829 -3088 -1276 -415 591 123 -1036 2039 2120 -1252 -2157 -2093 -4883
4702 -4883 -3450 -765 743 2099 3518 1543 -1545 -3933 -7440 -3670 -720 2270 -1400 -3305 -5098
4687 -5098 -4188 76 3574 5531 469 2405 1068 -190 -2965 -5274 -6754 -6406 -8183 -9882 -7065
4672 -7065 -1650 -2508 -2522 268 -2741 -1403 1024 -2221 -1000 4640 6220 2140 -452 -2981 2124 6670
4656F670k664m706k137L10K920M826J984l285n740K41n5N10l520l038P30M6q67
4639g775K442L014J543q5r14K155O02o0J33J022N715k20o627L00K844j332m693
4622a936K379K758l610l920j880j344P98L817M727k120k579K28J280j903J139
4607b166j381K952o57l350j842J16P770M316k518m744l01J627L567N55k328k848
4591a232J836k18k950P27J333L296k14R82r93j83l933k819M028N464J285j576
4575D833l026j880m45J564Q24j944k423k806j061L542Q24J082L353P87J341J64
4559D729L313r81j982q34L400j594m346n26Jk925m60K116J813l426L8L15j945
4542c294N420Q095j752N05p52l694j670j69k640J05R80j826n81J332m1k983k397
$$ plain form
4656 6670 4006 -700 -2837 -2527 393 5219 7203 3918 -1822 -1581 -1636 -1126 -4646 -7684 -6954 -6908 -7775
4639 -7775 -5333 -2319 -776 -861 -1775 380 982 922 1055 2077 7792 7572 945 1245 4089 2757 -1936
4622 -1936 443 3201 -409 -4329 -6209 -7553 -6755 -2938 1789 -331 -2910 -2682 -1402 -3305 -2166
4607 -2166 -3547 -595 -1252 -4602 -6444 -6328 1442 5758 3240 -1504 -1805 -178 3389 3944 1616 -1232
4591 -1232 604 386 -2564 -1837 -504 2792 2578 3560 2567 2384 -1549 -4368 -340 5124 6409 4833
4575 4833 1807 -73 -518 1046 1870 -74 -2497 -5303 -6364 -2822 -1998 -916 2437 3224 4565 4729
4559 4729 8042 7061 5079 4245 7645 6051 1705 1179 1180 -1745 -2205 -89 1724 -1702 -1664 -1349 -3294
4542 -3294 2126 10221 8469 8974 8222 4528 2858 2689 49 154 1134 -692 -1273 59 18 -2965 -5362
4525e362K077Q78K904k795r87L98O64J146n31j262k651j219N533J784J256L697
4509E530O5P93P75j547j987l508l230N01j23J980q93J102k41J098K98J943J868
4492D424l384j267k81M431K544K20l653k683L033L237l624j166N5P87o8J564%
4475D169k714j880j970K06m587l528P718N107k295j920q91L70l661m516Q16k51
4459i827J501Q44k70K106J535m42L466J956j418k625L18N96j424j735K424l098
4443f093K062l486J82L898l152L744M828K291K582L572k624l539N35j991m696
4428a887P52J41L317Q44j698k29r24Qj750n622K401L524J138m52p09j055j489
4411c690m10N981J744k327N23N20n021l072J171P022M893j93j511l158j819j852
$$ plain form
4525 -5362 -3285 -2407 497 -2298 -3285 -2887 -2223 -1077 -1608 -2870 -5521 -6740 -1207 577 1833 5530
4509 5530 5595 6388 7163 5616 3629 121 -3109 -2608 -2731 -751 -1644 -542 -783 315 613 2556 4424
4492 4424 1040 -227 -508 3923 6467 6687 3034 351 3384 6621 2997 1831 1886 2673 2605 4169 4169
4475 4169 1455 -425 -2395 -2189 -6776 -10304 -2586 2521 226 -1694 -2585 -2215 -5876 -10392 -9576 -9827
4459 -9827 -8326 -7482 -7752 -5646 -4111 -4553 -1087 869 -549 -3174 -2856 -2260 -3684 -5419 -2995 -6093
4443 -6093 -4031 -7517 -7335 -3437 -6589 -2845 1983 4274 6856 10428 7804 4265 4800 2809 -1887
4428 -1887 -1135 -994 2323 3167 1469 1240 316 324 -1426 -7048 -4647 -1123 15 -437 -1146 -2201 -3690
4411 -3690 -4100 1881 3625 1298 1821 2341 -2680 -5752 -4581 2441 7334 7141 5630 2472 653 -1199
4395a199J686J90K869j215o319l843J407K68l557M427M696k272R84J445j342k453
4379d228n87L84J506J856K217N217o44m0l923l04L916J543m81j647q77j055n111
4362b258R81K088j611K949O586l32p918k550J254K5o89K308J054J962N31k392
4346A988Q62L51l80O15q87k293l227K798j335J10P7O92J809N28K64j644K254K024
4328D606K628q13k729l035k879p35N085Q09k05l262J000K349n75l443R18L695
4312C414k457J357j273n403j014J707J415l638J295M652K743K36j05l414J117
4297F32Q18L595r86k708j73R94L147j768m425k915L13M84p74J104N424M289m378
4280B673l235l998m129k719o40M968L807J45j700k458K726m89M60j180J500j01
$$ plain form
4395 -1199 487 677 3546 2331 -3988 -7831 -6424 -6156 -9713 -5286 -590 -2862 -1878 -433 -1775 -4228
4379 -4228 -4815 -4431 -2925 -1069 1148 6365 5721 5681 1758 1454 5370 6913 6432 4785 3908 2853 -2258
4362 -2258 -1277 811 -800 2149 8735 8403 485 -2065 -811 -786 -1475 833 1887 3849 4380 1988
4346 1988 2850 3201 2821 3436 2549 256 -2971 -173 -1508 -1398 -1321 -629 1180 1708 1972 328 2582 4606
4328 4606 7234 6421 3692 657 -2222 -2957 2128 2937 2732 -530 470 2819 2244 -1199 -281 3414
4312 3414 957 2314 1041 -4362 -5376 -3669 -2254 -5892 -4597 55 2798 3034 2929 -485 632
4297 632 1450 5045 4059 1351 1178 2172 5319 3551 -874 -3789 -3476 -2992 -3766 -2662 2762 7051 2673
4280 2673 -562 -4560 -8689 -11408 -12048 -7080 -3273 -3128 -4828 -7286 -4560 -5049 -4589 -5769 -4269 -4370
4264d370k543J672M26J641l38O15R24PJ652Q64n790l677R22J93J081K880j129
4247d970L704K480j881l300k526l143J69L396M594K487k277l607J827K029R3O92
4231b33l984j279O140J043l262j421J735K852O02J828M309l146m315n990n15M109
4215a527j302m804j69M144O090k716j573O49j645k73K078J61p16l182n99M247
4199a137J633K516m284k232j110J973k136j886k048K086N818j557q86K088O090
4184D928L973k616m698o521r28L897L737m065N75O222l123o403lj68p52j830M877
4167b898J465M548M329j939k291l089k558P63k407J212M22l112J35K585k61o45
4151c741j805l269k323J737P89L225M641M73j042j353N03K324N17J838r23J394
$$ plain form
4264 -4370 -6913 -5241 -4815 -3174 -3512 -2897 -1973 -1966 -314 550 -5240 -8917 -7995 -7802 -6721 -3841 -4970
4247 -4970 -1266 1214 -667 -3967 -6493 -9636 -9467 -6071 -1477 1010 -1267 -4874 -3047 -1018 -925 -233
4231 -233 -4217 -5496 644 1687 -1575 -2996 -1261 1591 2193 4021 8330 5184 869 -5121 -5636 -1527
4215 -1527 -2829 -7633 -7802 -3658 2432 -284 -1857 -1208 -2853 -3126 -1048 -887 -1603 -4785 -5384 -1137
4199 -1137 496 3012 -1272 -3504 -4614 -2641 -4777 -6663 -8711 -6625 -807 -2364 -3250 -1162 4928
4184 4928 8901 6285 1587 -4934 -5862 -1965 1772 -2293 -1718 4504 1381 -5022 -5025 -5193 -5945 -7775 -2898
4167 -2898 -1433 3115 7444 5505 3214 125 -2433 -1670 -4077 -2865 -2443 -5555 -5420 -2835 -3096 -3741
4151 -3741 -5546 -8815 -11138 -9401 -8612 -5387 -746 -273 -1315 -2668 -2165 159 676 2514 1591 2985
4135B985L595Q97n18m072m276n612M842N683J227j630k465N34m26L48l324J96
4119b016P06J434P87K392l767o108j656K984M723J629J372r50j319K399j197J224
4103B637l46k599k007k048J670k309N53L227J054J876J773j787M54K428j605K322
4087E293J355J462m725m918j666j169M244M87n862l417K919M019L713J523k526
4072G32l62N40O86k820l536j661O99J408P83L431L127N40n1k385J580J04j90j361
4054A264J678o03l432J02N817j625l625k261r28L444K25M723K275p130N74O42
4038A140k39P69l023j213K148J137J165M391L26l70k441k110o0Rk911j511O50
4021b143j072K237L177p6J413k097L820J775m851J098m179m72K052l91M80K353
$$ plain form
4135 2985 6580 7477 6959 2887 -1389 -7001 -2159 3524 4751 3121 656 1190 764 1112 -2212 -2016
4119 -2016 -1310 124 911 3303 -464 -6572 -8228 -5244 -521 1108 2480 1530 211 2610 1413 2637
4103 2637 2291 -308 -2315 -4363 -2693 -5002 -4449 -1222 -168 1708 3481 1694 2148 4576 2971 5293
4087 5293 6648 8110 3385 -1533 -3199 -4368 -124 363 -5499 -8916 -5997 -1978 1735 3258 732
4072 732 370 910 1596 -1224 -4760 -6421 -5722 -4314 -3531 -100 3027 3567 3516 1131 2711 2815 2625 1264
4054 1264 2942 2339 -1093 -991 4826 3201 -424 -2685 -3613 -169 56 4779 7054 -76 498 1140
4038 1140 901 1670 -1353 -2566 -418 719 1884 6275 6601 6231 3790 1680 1620 1629 -1282 -2793 -2143
4021 -2143 -3215 -978 2199 2123 3536 1439 5259 7034 2183 3281 -898 -1370 682 291 771 3124
4005C124q51j099j21J934L42j838j504m07l39k85K810M944m255n575j620O906
3989B166M586l373k555K784J1k197K827j660N26k019k353K08J819J393l490J549
3973B22J611q87p690j344J972J977j166j062M202M763k635m75M046P87m299j50
3957a28j277l757m003j490M480K349K746r72O82K066J102P11o37n286m304K352
3941e366l351Q24P550O1J93J49N94j070J647r1k435j962J661K144n373n84m01
3924e810j566L609J186p74N92J831k688k658J229L916N081k39j800k19l33j079
3908B78j292N261K245l99l80m246j328j356M5J412J765j278k695l254Q95K643
3892a684J777j694k431L005M362k018r50q90k159R6m31p019K278P330L654K4K165
$$ plain form
4005 3124 2273 1174 1053 2987 3329 1491 -13 -420 -759 -1044 1766 6710 2455 -3120 -4740 2166
3989 2166 6752 3379 824 3608 3619 1422 4249 2589 3115 1096 -1257 -1049 770 2163 -1327 222
3973 222 1833 946 -6744 -8088 -6116 -4139 -5305 -6367 -2165 2598 -37 -512 3534 4321 22 -128
3957 -128 -1405 -5162 -9165 -10655 -6175 -3826 -1080 -2052 -1370 696 1798 2509 1872 -3414 -7718 -5366
3941 -5366 -8717 -7893 -343 -282 -89 60 654 -416 1231 1140 -1295 -3257 -1596 548 -4825 -5409 -5810
3924 -5810 -7376 -3767 -2581 -3355 -2763 -932 -3620 -6278 -5049 -1133 3948 3709 1909 1690 1357 278
3908 278 -1014 4247 6492 6093 5713 1467 139 -1217 -1172 240 2005 727 -1968 -5222 -4327 -1684
3892 -1684 93 -1601 -4032 -1027 3335 1317 367 -523 -2682 -2586 -3017 -10036 -7758 -428 3226 3250 5415
3875E415n146j725j456K551N301J0r58j848P83J479j878O12l103m310K36J813
3859b224J781K393j52K472j577M371k481k632k90N08l621n844R13m0p27K538m252
3842h864J690K827J013K093j754k45J464J36K306j87n5k79j094J945J206o42j334
3825B26j011K566q75l38N690k875l792n642J305N049J083J813K900J312n689m841
3809c119k186J311J503M13J085N44K93j069k668J168L003Q97N52K7m376J44L383
3792I05j281R12q96Q34L505n445n361Q47p2L195o44k295o49J937M146K120m803
3775c045K57K832P787J519l982l388j465K217M798l336m081k97M50l72K416K119
3759D429j791K538J128j807K418l202l066l276n970n88J323k038N59J046M781
$$ plain form
3875 5415 269 -1456 -2912 -361 4940 4950 3992 2144 2927 4406 2528 3140 37 -4273 -4037 -2224
3859 -2224 -443 1950 1798 4270 2693 7064 4583 1951 1661 2169 -1452 -7296 -6383 -6423 -7150 -4612 -8864
3842 -8864 -7174 -4347 -3334 -1241 -2995 -3240 -1776 -1640 666 479 424 145 -949 996 2202 1560 226
3825 226 -785 1781 906 568 6258 3383 -409 -6051 -4746 303 1386 3199 6099 7411 1722 -3119
3809 -3119 -5305 -3994 -2491 -2078 -993 -449 -156 -1225 -3893 -2725 278 1175 1727 1754 -2622 -2478 905
3792 905 -376 536 -360 474 3979 -1466 -6827 -5980 -6052 -2857 -3501 -5796 -6445 -4508 -362 1758 -3045
3775 -3045 -2788 44 7831 9350 5368 1980 515 2732 7530 4194 113 -184 266 -106 2310 4429
3759 4429 2638 5176 6304 4497 6915 3713 647 -2629 -8599 -9187 -7864 -9902 -9343 -8297 -3516
3744c516N32J432K432k731j817j287M253L078l114L86k397J397p1J343L786j489
3728B217m498K17K94P29J753J526j375J91J59m963l865J95J998L346K967P59j942
3711b92J246j90k036j928k42P5J59J29q95K352j557k500M49o30J60j060J051p44
3693f453J569K301M133M31m13k342p05J945j271k249k212K02J361M152n3O68K347
3676C411j118K032J571J463k597N75j172k995n54K66J269K277J957j893l262m562
3660c332p14L188K605r28J328j591j288L326L430n046q98K773r77R23Q01j377
3644B223J236K186j97k994k586j607K30M414k41O35p72j918Q93j447j796K247
3628E06k213N09J516l86K181J277l117L15M14j848k579l856J345K891M081O038
$$ plain form
3744 -3516 -2984 -1552 880 -1851 -3668 -4955 -702 2376 -738 -352 -2749 -1352 -1423 -80 3706 2217
3728 2217 -2281 -2064 -1770 -1041 712 2238 863 1054 1213 -3750 -7615 -7420 -5422 -2076 891 1650 -292
3711 -292 954 764 -1272 -3200 -3442 -3367 -3208 -3079 -3974 -1622 -3179 -5679 -5230 -5860 -5700 -6760 -5709 -6453
3693 -6453 -4884 -2583 1550 1981 1568 -774 -1479 466 -805 -3054 -5266 -5064 -3703 449 396 1064 3411
3676 3411 2293 4325 5896 7359 4762 5337 4165 1170 616 882 2151 4428 6385 4492 1230 -3332
3660 -3332 -4046 -858 1747 819 2147 556 -732 2594 6024 978 80 2853 1876 2799 3600 2223
3644 2223 3459 5645 5448 2454 -132 -1739 -1509 2905 2664 3299 2527 609 1502 55 -1741 506
3628 506 -1707 -1198 318 -68 2113 3390 273 588 1002 -846 -3425 -7281 -5936 -3045 1036 7074
3612G074j98k102J581l346k862l97p16j449j181N55K946L271PJ767q99k387J396
3595C060L65K579J013o591m362j251r78n93K361J777M070J83J314m446J360K611
3579B472p18N02L20R77l186j650J012m546R28N595q66m464n066K535M980N56k656
3562c275k376K370r00l261M514N733M269j493j864k837j018r67p98j813J399L958
3546A641k260K68j450l08N18J775K417j221L177K65n841m434K387M428k600k530
3530c768L350N267Q17j467J777l864o327K45O7P65K362m89K160N856L505j047
3514I209l302l595k281m42R38J05l261q31K125L415L851J751j088j260k367j135
3498A832K267K823O67l739o028M90M009K340m46n67L19N074J483m606m405m117
$$ plain form
3612 7074 6876 4774 6355 3009 147 -250 -966 -2415 -3596 -3041 -95 3176 3183 4950 4051 1664 3060
3595 3060 3425 6004 7017 426 -3936 -5187 -6165 -6758 -4397 -2620 1450 1633 2947 -1499 -139 2472
3579 2472 1754 2256 2576 3553 367 -1283 -271 -4817 -3889 1706 840 -3624 -8690 -6155 -1175 -619 -3275
3562 -3275 -5651 -3281 -4181 -7442 -2928 2805 7074 5581 3717 880 -138 -1105 -1903 -3716 -2317 1641
3546 1641 -619 -351 -1801 -2109 -1591 184 2601 1380 4557 4822 -1019 -5453 -3066 1362 -1238 -3768
3530 -3768 -418 4849 5666 4199 5976 2112 -4215 -3970 -3903 -3138 -776 -1265 895 6751 10256 9209
3514 9209 5907 2312 31 -411 527 632 -2629 -3460 -1335 2080 5931 7682 6594 5334 2967 1832
3498 1832 4099 6922 7589 3850 -2178 -1688 2321 4661 4215 3648 3967 9041 10524 5918 1513 -2604
3482b604k750K039L863j134K68O52q44o2n99K019N828K781n190l796j153K33l605
3465d054n4K284M26N53p79p84Q8r17j556J805K597P08o61O3M59j112l211M555
3447D10L533q94j175m197l766j373k98N441L930K521j717j607lK947J918J006
3431F676l160n482q8K573p99n84M492j408q01m75j400K472k277n573J986J353
3415b495L323J193j387l6J540K323J421J509k114k495m455l350J040J523P68K605
3399I13m578m59K433j028n58K434k110j926j346l222J057K982j13Q73J517j451
3383d582l489l235R21L089j134Q9K109O221K584K603J797J046l186k018L550J283
3367G648J5j365m747j123L22K528k303k433J258R17j765j038J136J004n26m6Q66
$$ plain form
3482 -2604 -5354 -3315 548 -586 -318 334 -510 -572 -1171 848 6676 9457 4267 471 -682 -449 -4054
3465 -4054 -4108 -1824 -1398 -845 -1624 -2408 -2320 -3237 -4793 -2988 -391 317 -344 -281 178 -934 -4145 410
3447 410 3943 3049 1874 -2323 -6089 -7462 -7760 -2319 1611 4132 2415 808 805 3752 5670 6676
3431 6676 3516 -1966 -2054 519 -280 -864 3628 2220 1419 944 -456 2016 -261 -5834 -3848 -2495
3415 -2495 828 2021 634 598 2138 4461 5882 7391 5277 2782 -1673 -5023 -3983 -2460 -1692 913
3399 913 -3665 -4124 -1691 -2719 -3277 -843 -2953 -4879 -6225 -9447 -8390 -5408 -5521 -4648 -3131 -4582
3383 -4582 -8071 -11306 -10385 -7296 -8430 -8341 -6232 -11 2573 5176 6973 8019 4833 2815 6365 7648
3367 7648 7663 6298 1551 428 750 3278 975 -1458 -200 717 -1048 -2086 -950 54 -472 -518 348
3350C48J05l51l5M385k594O79K32k526K47j105j38k202K229l87R76O77o415J8
3332e857K734M216j023l971L222K354j856p03M810l03o023l73K877Q98k410L159
3316A751k378m737j821J015J422N354p61J389J990j639k542k806K074k038l030
3301f757q38L427K237j009o07k096R54N555J806N51k300k694l025M55Q181K512
3285F352k903l484K099k581l811J888J794M781K070m373m941J817K822m2K059
3270C547j99n240l000J286L019K448l035K060K772l81j03o262j738K031L496j941
3254a240k832m368N91K331K261J955J098j167K561p54O12K197q21l680r17N943
3238C770O99j411K731n75K006j703k904m115J396K93K832l608m177j227K461n01
$$ plain form
3350 348 453 102 67 4452 1858 2537 2769 243 490 -615 -753 -2955 -726 -1113 -137 540 -5875 -5857
3332 -5857 -3123 1093 70 -3901 -679 1675 -181 -884 3926 3623 -2400 -2773 104 1002 -1408 1751
3316 1751 -627 -5364 -7185 -6170 -4748 606 -155 1234 3224 1585 -957 -3763 -1689 -3727 -6757
3301 -6757 -7595 -4168 -1931 -2940 -3547 -5643 -4689 866 2672 3223 923 -1771 -4796 -4341 3840 6352
3285 6352 3449 -35 2064 -517 -4328 -2440 -646 4135 6205 1832 -3109 -1292 1530 1488 3547
3270 3547 3348 -1892 -4892 -3606 -587 1861 -1174 886 3658 3277 3174 -3088 -4826 -2795 701 -1240
3254 -1240 -4072 -8440 -7849 -5518 -3257 -1302 -204 -1371 1190 436 1048 3245 2424 -1256 -2173 3770
3238 3770 4469 3058 5789 5214 7220 5517 2613 -1502 -106 187 3019 -589 -4766 -5993 -3532 -4033
3222d033k917K675O353K55j990J009O62J923J842l66m50k2K895m042q405k385
3206f996j663L522M178K447R78m29J462L70k403K286j266Q15k75L00n88k381L716
3189D073K305j563m936n494J226K344K430q1R45q04M45k901J205M566J893m82
3173E171j599k512J158K462J40k338m24j532M532L54n647L19N384j03k927j150
3157A288P95J945K420l559K26l257l975L207N53j287j602J997R58o73J221K926
3141C183L719r19k428M30k06j643j022l27j98J232m492j278K819j096k994J761
3125c459M367q10r021m680L973N817K909j272n26O39k49n68J671L885J545q97
3109C324l754j564L780L569l144K284K594k262j052l71R66j559m445j093M920
$$ plain form
3222 -4033 -6950 -4275 2078 2333 343 1352 2014 3937 5779 5413 4963 4941 7836 3794 -4611 -6996
3206 -6996 -8659 -5137 -959 1488 2466 2037 3499 3869 1466 3752 2486 3301 3026 3326 2738 357 4073
3189 4073 6378 4815 -121 -5615 -4389 -2045 385 304 1249 445 890 -2011 -806 3760 5653 5171
3173 5171 3572 1060 2218 4680 4820 2482 2058 526 5058 5412 -235 84 5468 5365 2438 1288
3157 1288 2083 4028 6448 2889 3115 -142 -4117 -910 -357 -1644 -3246 -1249 -291 -964 257 3183
3141 3183 6902 5983 3555 3985 3779 2136 1114 787 589 1821 -2671 -3949 -1130 -2226 -5220 -3459
3125 -3459 908 98 -8923 -13603 -9630 -3813 -904 -2176 -2702 -2063 -2312 -2880 -1209 2676 4221 3324
3109 3324 -430 -1994 1786 5355 2211 4495 7089 4827 3775 3404 4370 2811 -1634 -2727 2193
3094B193L083m178n29n8J818k220K627N063J019k260j161J538l209m359j265L921
3078B023L442l374k14R7l319q4j37m572l027J396J622J074K017K101N80m98M057
3061C184j500K247l479m492R87M61K20J78M809K404J184pk959j310k871l040M84
3044c500l969j158J840K932l135j740O7L854K715j476J443N123L93m177k675p77
3028d240R95J247K870k260Q46m047k461Q16L891L8j346K83J500L553K464J60n587
3011a278k684k254R2O221J969j663l75l404K640M89l326l850m730L763P254j543
2995b679L612M99l65J85k813l021J481N055J499K195l525p173k778M766P26K211
2979a25J155p61k347K339K571j611l426j761p20J10R69K417K023L671k431j609
$$ plain form
3094 2193 5276 1098 569 511 2329 109 2736 7799 8818 6558 5397 6935 3726 -633 -1898 2023
3078 2023 5465 2091 1877 1974 -1345 -1429 -1566 -6138 -9165 -7769 -6147 -5073 -3056 -955 -375 -873 3184
3061 3184 1684 3931 452 -4040 -3053 -2592 -2372 -2194 2615 5019 6203 6196 3237 1927 -944 -3984 -3500
3044 -3500 -7469 -8627 -6787 -3855 -6990 -8730 -8663 -4809 -2094 -3570 -2127 2996 3389 -788 -3463 -4240
3028 -4240 -3245 -1998 872 -1388 -542 -4589 -7050 -6234 -2343 -2305 -3651 -3368 -1868 1685 4149 4309 -1278
3011 -1278 -3962 -6216 -6124 97 2066 403 28 -3376 -736 -247 -3573 -7423 -12153 -8390 -1136 -2679
2995 -2679 933 1432 1067 1252 -1561 -4582 -3101 1954 3453 5648 2123 -5050 -7828 -3062 -2336 -125
2979 -125 1030 269 -2078 261 2832 1221 -2205 -3966 -4686 -4576 -3607 -1190 833 4504 2073 464
2963D64j55j848k71j513Q24l252K900N698N660M036n77j677l300n909k3n04l276
2946b723k196M23O602J565n03m192o396K683N642J104r60l590j80L637K517k044
2930A389r01l497J900J6j042j531J307j179k862K516L79K64J137J64J846O9j852
2913a877k77L509J679m5l843l1K759J253k783k213J245k232j331J682Mo32M75
2896b658m32j203J015N761J121l622l118K082L035m72J533j200m593j443p48l58
2880e300J498J141L308J636K486P70k970K45M92j171J130J796o015n63M39L685
2864B607L210q43j191m668l417M79j727m099qK39K554q0k06O98J269J464L738
2847A9J288J917J163L980o5l490k806o20o67N212o26q1k058q12J170o07Q81l458
$$ plain form
2963 464 309 -1539 -1810 -3323 -2499 -5751 -2851 2847 8507 12543 11966 10289 6989 1080 1057 553 -2723
2946 -2723 -4919 -4496 2106 3671 3168 -1024 -7420 -4737 905 2009 1049 -2541 -2721 916 3433 1389
2930 1389 488 -3009 -1109 -1093 -2135 -3666 -2359 -3538 -6400 -3884 -3505 -3241 -2104 -1940 -94 -25 -1877
2913 -1877 -2154 1355 3034 2989 -854 -885 1874 3127 344 -1869 -624 -2856 -4187 -2505 -2501 -3133 -2658
2896 -2658 -3090 -4293 -3278 2483 3604 -18 -3136 -1054 1981 1509 3042 1842 -2751 -4194 -4942 -5300
2880 -5300 -3802 -2661 647 2283 4769 5539 2569 2814 3306 2135 3265 5061 -954 -1517 -1078 2607
2864 2607 5817 4974 3783 -885 -4302 -3823 -5550 -9649 -9657 -9418 -6864 -6944 -7150 -6452 -5183 -3719 19
2847 19 1307 3224 4387 8367 8302 4812 2006 1386 719 5931 5305 5224 3166 2354 3524 2917 3798 340
2829C40k878O69M737K596Q28j425P15K134N36J383k386l323M651L331l099l268
2813E541l252K101j390j06M409j551M1k485j606J274j240K129J445k851k607M362
2797D214L105r18l069j887R76n7L171L723L87l609j558m780r39K637m70j421k042
2780b537k522M91M228k98j411K541M059K293K404j272k392j099l12O43n24l124
2764A168m93l454N192J646j257k124r16J024j291j236M784M603j979j427l458
2749G82l126J808m48k248j895J427o00J840k046j91K106J162n77j95k929K093
2733c037j61j052K280l88j78L702Q77q18o33k696J004p59M17J554j669J080L59
2716a18N418O063r69m374k236j181p74K310M195M75J61n801k640j540k639K395
$$ plain form
2829 340 -2538 -1869 2868 5464 6292 4867 5582 7716 8252 9635 7249 3926 8577 11908 8809 5541
2813 5541 2289 4390 3000 2894 7303 5752 5793 3308 1702 2976 1736 3865 5310 2459 -148 4214
2797 4214 7319 6401 3332 1445 2421 2364 5535 9258 9645 6036 4478 -302 -1241 1396 926 -495 -2537
2780 -2537 -5059 -4568 -340 -638 -2049 492 4551 6844 9248 7976 5584 4485 4173 4816 4292 1168
2764 1168 675 -2779 2413 4059 2802 678 -238 786 -505 -1741 3043 7646 5667 4240 782
2749 782 -2344 -536 -984 -3232 -5127 -3700 -4300 -2460 -4506 -4697 -2591 -1429 -2006 -2201 -5130 -3037
2733 -3037 -3198 -4250 -1970 -2358 -2536 1166 2043 1225 592 -2104 -1100 -1859 -1442 112 -1557 -477 -118
2716 -118 5300 11363 10394 6020 3784 2603 1829 4139 8334 8809 8970 3169 529 -1011 -3650 -1255
2700a255N209K585K812m329n535P51K28j067K336K952k858n473N0J727K004k67
2684a30L345J449r59J074m92j611J041J823o530m660J514J10Q03K638K442Q11
2668B668j423r05k830M501L003P6O92j20l784J339J086k998j835r7O1J65l20l337
2650d058K651n81L530K105m472J603J337L95N78k765J747O117q9n548k034O78
2634A194j194l626L23K354M230M19n015Q95N084k097n12P47j408o05K523j001
2618B311n16l97m37K502K80J965J504k8j330K18n03n369j734N59R33j842r91L516
2600F41J268L25l49j2j191J86j158r77M16M683N909K194j805j171J117o585n426
2583a935k202J542L651J502k10m056k273L010M389K693m437k273k40j099K85J828
$$ plain form
2700 -1255 3954 6539 9351 5022 -513 238 466 -601 1735 4687 1829 -3644 -3594 -1867 137 -130
2684 -130 3215 4664 3705 4779 4287 2676 3717 5540 -990 -5650 -4136 -4026 -3223 -585 1857 2668
2668 2668 1245 340 -2490 2011 5014 5090 5782 5662 1878 3217 4303 1305 -530 -627 -566 -401 -721 -4058
2650 -4058 -1407 -1988 1542 3647 -825 778 2115 2510 3088 323 2070 8187 8098 2550 516 1194
2634 1194 0 -3626 -3303 -949 3281 3700 -1315 -420 4664 2567 2055 2802 1394 789 3312 2311
2618 2311 1795 1398 961 3463 3743 5708 7212 7184 5854 6072 5569 200 -1534 -975 -42 -1884 -2875 641
2600 641 1909 2234 1885 1873 682 868 -290 -1267 -851 3832 9741 11935 10130 8959 10076 3491 -1935
2583 -1935 -4137 -2595 1056 2558 2348 -1708 -3981 -971 3418 6111 1674 -599 -839 -1938 -1653 175
2567A75J961J29L631k800j090M442j211k441J02o32k540j655q81L340q33J811
2551A508L442n816J892M039m370j234J913J650K973J482j621l978m991K84J959
2536h68Q57q04L71J824o07j608L965m113k277p63M942L613j844J641o80q6j510
2519B053o71M748J154m14J244j066k225j178J89L175K729n92j425m043J62n293
2503a453O594M401J55k590o015k221o64k977K85K784n82n58J810r4k517J887Q814
2486G059M729m476j736m156Q02r61L24K447J632n724j33L170L268k242k787l837
2470b621m170K816L563M15o57o17K352J999j51P65k164j11p72l206L27K748J85
2453G01n198l843J639J935Q6P405J141m987k546K434M677J048l033m592k684R79
$$ plain form
2567 175 2136 2265 5896 3096 2006 6448 5237 2796 2898 2266 -274 -1929 -2810 530 -303 1508
2551 1508 4950 -866 1026 5065 695 -539 1374 3024 5997 7479 5858 1880 -3111 -2827 -868
2536 -868 -11 -815 -444 1380 773 -835 3130 -983 -3260 -4023 919 4532 2688 4329 3649 3563 2053
2519 2053 1382 6130 7284 6870 8114 7048 4823 3645 3834 7009 9738 9146 7721 3678 3840 -1453
2503 -1453 5141 9542 9697 7107 1092 -1129 -1793 -4770 -4485 -1701 -2283 -2841 -1031 -1125 -3642 -1755 7059
2486 7059 11788 7312 5576 1420 2222 1261 1585 4032 5664 -60 -193 2977 6245 4003 1216 -2621
2470 -2621 -6791 -3975 -412 3 -654 -1271 1081 3080 2929 3694 1530 1419 647 -2559 -2232 516 701
2453 701 -4497 -8340 -6701 -4766 -4680 2725 3866 -1121 -3667 -1233 3444 4492 1459 -3133 -5817 -4838
2437d838M431o95J314J297K089Q49k86l5j249l601j267j240J233L081M726K842
2421H651M26l739l028K088j162n181n886l99J835P147M224k055j858N366J289
2406G718J525J954n98n948Q12K558P16o122J619k932k10j141p9Q7J192l85J818
2389B584J139j341m553l066l62j196N536n62j30l582j595M599K8K573N39L585
2373D196m324N72L989k5K290J615m743n369r63P38M286m70j474m992L16j042J524
2356c876K536l94Q04O434K115o840n187M432n63k489K396J537K22J179m536q62
2340c092j267J081L036k365L13n34L55j09K71L710J168j983k249q176j171M486
2324f526J906p12O596M006n357l163j95J481P762K259p37K80R51o560k085K188
$$ plain form
2437 -4838 -407 -1102 212 1509 3598 4447 4161 4126 2877 -724 -1991 -3231 -1998 1083 5809 8651
2421 8651 9077 5338 2310 4398 3236 -1945 -7831 -8230 -6395 752 4976 2921 1063 6429 7718
2406 7718 9243 11197 10599 4651 5463 8021 8737 2615 4234 1302 1092 -49 -128 -41 1151 766 2584
2389 2584 3723 2382 -2171 -5237 -5599 -6795 -1259 -1821 -1951 -5533 -7128 -2529 -2501 72 611 4196
2373 4196 -128 444 4433 4408 6698 8313 3570 -1799 -2762 -2024 2262 1792 318 -4674 -4358 -5400 -3876
2356 -3876 -1340 -1734 -930 5504 7619 779 -4408 24 -539 -3028 -632 905 1127 2306 -2230 -3092
2340 -3092 -4359 -3278 -242 -2607 -2294 -2828 -2473 -2582 -2311 1399 2567 584 -1665 -9841 -11012 -6526
2324 -6526 -4620 -5332 1264 5270 -87 -3250 -3445 -1964 5798 8057 7320 7600 8551 1991 -94 2094
2308B094k902m54J457K802L82p6r43j512O15j574L75k426k051N37Q79m384N23
2291f658pJ96j062J995K432k377O94K668J504K013J060j96m311k715J887L255
2275C78n52o75j44j646q93m57q06j201J495P573M129J040k025j063m78r56n581
2258a862j514j706r82q01Q88N80N221k524k383N525K788J107n779j792M37P95
2242b002N200J643j374J047K449L282j825o513j171j733l64k356j719J81J103
2227d152L555k44j26J050k255l34m656j655M942K971K160j770j344K247J218j042
2211E65M40L657l33j546J668k033j539M553m05l126j078o19J505L631M1j442m278
2194c39q17J535r17j66J259o73k516k290J972J853j319o90L227L017K45m023L3
$$ plain form
2308 2094 -808 -1262 195 2997 3379 3303 2360 848 1463 -111 264 -2162 -4213 -3676 -2797 -7181 -6658
2291 -6658 -6665 -6469 -7531 -5536 -3104 -5481 -4787 -2119 -615 1398 2458 2262 -2049 -4764 -2877 378
2275 378 -174 -849 -993 -2639 -3532 -3989 -4795 -5996 -4501 3072 7201 8241 6216 5153 4675 3719 -1862
2258 -1862 -3376 -5082 -6064 -6865 -5977 -5397 -176 -2700 -5083 442 3230 4337 -1442 -3234 -2797 -2002
2242 -2002 3198 4841 3467 4514 6963 10245 8420 1907 736 -997 -1361 -3717 -5436 -5255 -4152
2227 -4152 -597 -841 -967 83 -2172 -2506 -7162 -8817 -3875 -904 1256 -514 -1858 389 1607 565
2211 565 1005 4662 4329 2783 4451 2418 879 5432 5027 1901 823 204 1709 5340 5381 3939 -339
2194 -339 -1156 379 -538 -704 555 -118 -2634 -4924 -2952 -1099 -2418 -3108 119 3136 3381 -642 -609
2177f09R28p77K760k052p69N992J205j851p76K027J804o531l669k684K834N440
2161C272L494m432k173j315p92k473O83N079L58k555R39j848J023k09l1q18L781
2144A983K285m695m995L825M931M330j714N78J513l675k290l753l187j684J982
2129d566p91k173l178j701L501N586K782L77J557j680l926L451n34j003J625j482
2113b155j772q11K786j81j185K800R0l76R81J536n08l609J949J617k008J75k559
2096c230m167j125k61O273n60J036j11K997J808J920M91j526K224M029k886l540
2080C372J512R77n90k944N36K586J145j587r12o97J84p79J53L19L212j150k247
2063C090l448m157j909L833K402q54N30j8O10k598J110L028j693l292N510K108
$$ plain form
2177 -609 319 -458 2302 250 -519 5473 6678 4827 4051 6078 7882 1351 -2318 -5002 -2168 3272
2161 3272 6766 2334 161 -1154 -1946 -4419 -3736 1343 1701 -854 85 -1763 -740 -949 -980 -1798 1983
2144 1983 4268 -427 -5422 -1597 3334 7664 5950 6528 8041 4366 2076 -1677 -4864 -6548 -4566
2129 -4566 -5357 -7530 -10708 -12409 -8908 -3322 -540 -163 1394 -286 -4212 -761 -1295 -2298 -673 -2155
2113 -2155 -3927 -4738 -1952 -2133 -3318 -518 -428 -804 177 1713 1205 -2404 -455 1162 -846 -671 -3230
2096 -3230 -7397 -8522 -8783 -2510 -3070 -2034 -2145 852 2660 4580 5071 3545 5769 9798 6912 3372
2080 3372 4884 5861 5271 2327 2863 5449 6594 5007 4095 3398 3582 2803 2956 3275 6487 5337 3090
2063 3090 -358 -4515 -6424 -2591 -189 -1043 -513 -531 79 -2519 -1409 1619 -74 -3366 2144 4252
2047D252Q57J844l172n294k264J306M58L364M54N3L748j647k820l390o17m59N568
2030B241n878M82J666O08J26K648p47R78J850j39J26m125o121Q85j25J621L701
2013b03N99k488O53j119J622P19J830L142m68k693k18j168n80N512K330o229o782
1996e541j483J509J251J74L056M34k51n98J967K66K653Q59J722J294l655k350
1980A307n8J57J336J424K147O37k450o188J390K487l473J134M465J441k949K777
1964E584L356J801J299k420l534k203m669Q73j63m900J604M147j646K952L519
1949E600J328n48l115j257j597k809L93J941M29j584K310j639k678l68M261L512
1933D179o6m817p389L158M812J119o90k977J695J511O493O656m451n466l846K718
$$ plain form
2047 4252 5109 6953 3781 -1513 -3777 -2471 -2013 1351 1805 1858 5606 3959 1139 -2251 -2868 -3327 2241
2030 2241 -3637 -3155 -1489 -881 -755 1893 1146 2124 3974 3835 3961 -164 -6285 -5400 -5525 -3904 -203
2013 -203 396 -2092 -1439 -2558 -936 -217 1613 4755 4287 1594 1376 208 -372 5140 7470 1241 -5541
1996 -5541 -7024 -5515 -4264 -4090 -1034 -600 -851 -1449 518 784 3437 4296 6018 7312 3657 1307
1980 1307 1249 1406 2742 4166 6313 6950 4500 -1688 -298 2189 -1284 -150 4315 5756 2807 5584
1964 5584 8940 10741 12040 9620 6086 3883 -786 87 -76 -4976 -3372 775 -871 2081 5600
1949 5600 6928 6380 3265 2008 411 -2398 -2005 -64 365 -1219 1091 -548 -3226 -3594 667 4179
1933 4179 4113 -704 -8093 -4935 -123 996 306 -2671 -976 535 7028 13684 9233 3767 -79 2639
1917B639L139j137j76J32L880m495n537K172mj634r57K143K328J741n533l037
1901d336M390K335j295k458l620q93j579K965J543l899J067J736R8J73K460p5
1885a388O74J650L29J752L337q79o90l70J457j68k587j865k572l47l56l165K280
1868b908P587L198k658j093L245K836j141l033o540q38Q25l2k98j701M80J159
1852i12J89J366R91R06Q71k868J234N744K001l433l365l901J253n45k874n06O01
1835c248j407k063Q32N556M55j45j626o98K227J491K214k715j035J370O41j232
1819F17L44k712q59K125l94j462P12M067n123k640K621n85o65M836J808p26K875
1802D839o99l35m712J463K9q52Q37K75L476l17r20Q31j337l263n079O23J636o78
$$ plain form
1917 2639 5778 4641 4465 4597 8477 3982 -1555 617 613 -1021 -1978 165 2493 4234 -1299 -4336
1901 -4336 54 2389 1094 -1364 -4984 -5877 -7456 -4491 -2948 -6847 -5780 -4044 -3946 -3773 -1313 -1388
1885 -1388 -714 936 1265 3017 6354 5475 4785 4415 5872 5704 3117 1252 -1320 -1667 -2023 -5188 -2908
1868 -2908 4679 7877 5219 4126 7371 10207 9066 6033 -507 -1345 -520 -552 -850 -2551 -2071 -912
1852 -912 -723 643 1634 2540 3411 543 1777 7521 9522 6089 2724 -1177 76 -469 -3343 -3849 -3248
1835 -3248 -4655 -6718 -5886 -330 125 -20 -1646 -2344 -117 1374 3588 873 -162 1208 1849 617
1819 617 961 -1751 -2610 -485 -879 -2341 -1629 2438 -2685 -5325 -2704 -3289 -3954 882 2690 1964 4839
1802 4839 4140 3805 -907 556 585 -267 570 845 4321 4004 3084 3915 2578 -685 -5764 -5141 -3505 -4183
1784d183J085j323j357Q60k661k35l27r92K779n259K50O350K088k331j560k4J564
1767e276R29J076J538m4m513K262P747j341n947K353L958K346p45J874k852J543
1751D908r79l331J615R14j039j188j774j455K711N61R85J376j232m437n53M238
1735A320l366o2R25j369m890L74O219J408k535K582J92l05L010j360P52l289m074
1718d468R67P94p94R95p39J240K300m37J011L085k23m055l66N250P84k40J216
1701F320o51k012k650k109M18k038O66k081j457L063P02M28N02r75k741p8m079
1684h772N094J068j995J781q61k743q45J938N440m70j608j093K371K19J988L628
1668E140j508l003j004m633P20O120k750l639k12J349L717j079j721j242k490
$$ plain form
1784 -4183 -3098 -4421 -5778 -4918 -7579 -7814 -8141 -9133 -6354 -11613 -11363 -5013 -2925 -5256 -6816 -6840 -5276
1767 -5276 -4347 -3271 -1733 -1777 -6290 -4028 3719 2378 -3569 -1216 2742 5088 4343 6217 3365 4908
1751 4908 3929 598 2213 3127 2088 900 -874 -2329 382 943 1928 3304 2072 -2365 -2918 1320
1735 1320 -2046 -2108 -1183 -2552 -7442 -7068 -849 559 -1976 606 798 493 3503 2143 2895 -394 -4468
1718 -4468 -3501 -2707 -3501 -2506 -3245 -2005 295 -142 869 3954 3731 -324 -690 4560 5344 5104 6320
1701 6320 5669 3657 1007 -1102 -684 -2722 -2056 -4137 -5594 -2531 -1829 -1401 -899 -1874 -4615 -4693 -8772
1684 -8772 -3678 -2610 -4605 -2824 -3685 -6428 -7273 -5335 105 -365 -1973 -3066 -695 -476 1512 5140
1668 5140 3632 629 -375 -5008 -4288 1832 -918 -4557 -4769 -3420 297 -782 -2503 -3745 -6235
1653f235K037J756J408J908L484l21j855j584r83j798m684K94N796L347k061k967
1637b458q8l871N69K715j460p35M17M656M201j909Q4j482K3J301j863m634J837
1620b697K655n40o460l448L431Q514L551l601K115j53j026J04o71j854j338n48
1604a966M170k48k918l1k647K105K174k34K178J821K875j76m234k138J103j320
1588E14j225k206M7L183K905j21M406K764m819m221j787k694J464J946k115k09
1572b168r78J761J493K358J810l300m542K31N09Q16M326P7J459R7j802K840k538
1555B449j388j453l076n35N73N477M023J393l342k941L30K379k230J084K951R60
1539F654l351p115j377M499M93M344Q07j255j717k369j814K364j591l901p79L123
$$ plain form
1653 -6235 -4198 -2442 -1034 874 4358 4037 2182 598 -385 -2183 -6867 -6573 -777 2570 509 -2458
1637 -2458 -2546 -6417 -5848 -3133 -4593 -5328 -4911 -255 3946 2037 2121 639 662 1963 100 -4534 -2697
1620 -2697 -42 -582 -7042 -10490 -7059 1455 5006 1405 3520 3367 2341 2445 1774 -80 -1418 -1966
1604 -1966 2204 1956 -962 -993 -3640 -1535 639 405 2583 4404 7279 7103 2869 731 1834 514
1588 514 -711 -2917 -2870 313 3218 3097 7503 10267 5448 1227 -560 -3254 -1790 156 -1959 -2168
1572 -2168 -3146 -1385 108 2466 4276 976 -3566 -3335 -2826 -2010 2316 2393 3852 3949 2147 4987 2449
1555 2449 1061 -392 -3468 -4003 -3430 2047 6070 7463 4121 1180 1510 3889 1659 2743 5694 6654
1539 6654 3303 -3812 -5189 -690 -197 4147 4954 3699 1982 -387 -2201 163 -1428 -5329 -6108 -2985
1523b985P16L42N513L826k548j492L238j041l252K875K974l305k196K136K211
1508G012l762j357j357N34J475m87j421k509J53l862k260K191O042o52J602k63
1492A079J522j364o97n81l766R31L669J386o68j819k792j203O03N897J746j105
1476B838l784j924k089M330K285k134L252K147k284m04J078l18m056m24M715K017
1460E245k266m281n35j318j3L159K07j35k000k902J635M398k077j392K166J248
1444A139p31k127l4K553J931l05k870L837K666j925K081K948J210j737p64r04
1428F968j236j721J42m05j333q3L381k462m76K446K215l013l713M76Q60k960o13
1411a527L183K832J290q93J980j986l372j152J65K816J44l184j603N8j990k960
$$ plain form
1523 -2985 -2269 -1927 3586 7412 4864 3372 6610 5569 2317 5192 8166 4861 2665 4801 7012
1508 7012 3250 1893 536 1070 2545 2058 637 -1872 -1719 -5581 -7841 -5650 392 -260 1342 1079
1492 1079 2601 1237 540 -41 -3807 -2876 793 2179 1511 -308 -3100 -4303 -3700 2197 3943 2838
1476 2838 -946 -2870 -4959 -629 1656 -478 2774 4921 2637 2233 3311 2993 -1063 -1487 3228 5245
1460 5245 2979 -1302 -1837 -3155 -3168 -9 198 63 -1937 -4839 -3204 1194 -883 -2275 -109 1139
1444 1139 408 -1719 -1753 800 2731 2426 -444 3393 6059 4134 6215 9163 10373 8636 7872 6968
1428 6968 5732 4011 4153 3748 2415 2332 5713 3251 2775 5221 7436 4423 710 1186 2046 -914 -1527
1411 -1527 1656 4488 5778 4885 6865 4879 1507 355 520 3336 3480 296 -1307 -1249 -3239 -6199
1395f199k272N079N854J963Q90M45j316k768l183P90N22L219k693j448M064L90
1379C337J307k016k230j615J773P84J284r41l89l527j437P51M261P435l001l120
1363B656J27L00j645k6q77L6k319j495K377K982j757N48k20j843L37m15l719j362
1345f315K370M90k464o87M25k79j639N89J406L343N262J408k701n61l354k631
1329e338J246K48K185J099k492j158J256R19j051q61L983L891K354J078j056k112
1313D191j819k954k951l049N266J464j823j355j183m73K870J531K95k128M11L148
1297A441K741n82k942j827K147K433J513k974m20k74n643p21L324l96L039j306
1281d47O715J765o151l225l287o08j689J569N124k106m119L774J257O60J597J46
$$ plain form
1395 -6199 -8471 -3392 2462 4425 5315 5760 4444 1676 -1507 -717 -195 3024 331 -1117 2947 3337
1379 3337 4644 2628 398 -1217 556 1340 2624 1683 1294 -2233 -3670 -2919 1342 8777 5776 2656
1363 2656 2783 3083 1438 1412 535 571 -1748 -3243 -866 2116 359 907 687 -1156 -819 -1234 -4953 -6315
1345 -6315 -3945 -3455 -5919 -6606 -6181 -6460 -8099 -7510 -6104 -2761 2501 3909 1208 647 -2707 -5338
1329 -5338 -4092 -3844 -1659 -560 -3052 -4210 -2954 -2035 -3086 -3947 36 3927 6281 7359 6303 4191
1313 4191 2372 -582 -3533 -6582 -1316 148 -1675 -3030 -4213 -4686 -1816 -285 10 -2118 -1707 1441
1297 1441 4182 3600 658 -1169 978 3411 4924 1950 1530 1256 -4387 -5108 -1784 -2180 859 -447
1281 -447 6268 8033 1882 -1343 -4630 -5238 -6927 -5358 -234 -2340 -6459 -2685 -1428 -768 829 975
$$ [...]
##END NTUPLES=NMR SPECTRUM
##END=
