##TITLE=Analysis number 325999
Compound Code cc 59416
Book Reference 494/110
Project Code adrs
Chemist Name craigr
##JCAMPDX= 6.0         $$ Bruker NMR JCAMP-DX V2.0
##DATA TYPE= NMR SPECTRUM
##DATA CLASS= NTUPLES
##ORIGIN= Bruker BioSpin GmbH
##OWNER= nmr
$$ XWIN-NMR		Version 3.5
$$ Tue Jan 23 10:58:29 2007 GMT Standard Time (UT+0h)  MAYBRIDGE\nmr@NMR_250MHZ
##.OBSERVE FREQUENCY= 250.131544655141
##.OBSERVE NUCLEUS= ^1H
##.ACQUISITION MODE= SIMULTANEOUS (DQD)
##.ACQUISITION SCHEME= undefined
##.AVERAGES= 16
##.DIGITISER RES= 18
##SPECTROMETER/DATA SYSTEM= dpx250
##.PULSE SEQUENCE= zg30
##.SOLVENT NAME= CDCl3
##.SHIFT REFERENCE= (INTERNAL, CDCl3, 0, 16.522)
##AUDIT TRAIL= $$ (NUMBER, WHEN, WHO, WHERE, WHAT)
$$ ##TITLE= Audit trail, XWIN-NMR		Version 3.5
$$ ##JCAMPDX= 5.01
$$ ##ORIGIN= Bruker BioSpin GmbH
$$ ##OWNER= nmr
$$ C:\u/data/dgb/nmr/ADRS/1650/pdata/1/auditp.txt
$$ ##AUDIT TRAIL=  $$ (NUMBER, WHEN, WHO, WHERE, WHAT)
(   1,<2007-01-23 10:58:07.71 +000>,<MAYBRIDGE\nmr>,<NMR_250MHZ>,
      <created by zg, POWCHK disabled, PULCHK disabled
       configuration hash MD5:
       49 4B E0 1D 92 C2 6B 37 9F E6 65 BC 52 41 86 1D
       data hash MD5: 64K
       EE 89 50 EE CC A5 1E 9B B5 F8 42 F1 7C 06 B8 90>)
(   2,<2007-01-23 10:58:20.21 +000>,<MAYBRIDGE\nmr>,<NMR_250MHZ>,
      <Start of raw data processing
       ef LB = 0.3 FT_mod = 6 PKNL = 1 SI = 32K 
       data hash MD5: 32K
       EF 28 AE 8A 2F E4 1D 0C 6D DB 4A CF DE 57 86 75>)
(   3,<2007-01-23 10:58:21.82 +000>,<MAYBRIDGE\nmr>,<NMR_250MHZ>,
      <apk 
       data hash MD5: 32K
       34 53 2A EA FE 1F 03 E0 58 FB 13 46 72 1A 53 4E>)
(   4,<2007-01-23 10:58:22.55 +000>,<MAYBRIDGE\nmr>,<NMR_250MHZ>,
      <abs ABSG = 5 
       data hash MD5: 32K
       7D 29 DB 2C 25 35 78 75 23 8F FC FB 66 57 41 25>)
$$ ##END=
$$ 
$$ hash MD5
$$ 82 5F 61 8B 9A C6 52 79 3E 84 E2 25 3A 8B 4B 8A
##$RELAX= 
##$RELAX= 
##$RELAX= 
##$RELAX= 
##$RELAX= 
##$RELAX= 
##$RELAX= 
$$ Bruker specific parameters
$$ --------------------------
##$DU= <C:\u>
##$EXPNO= 1650
##$NAME= <ADRS>
##$PROCNO= 1
##$TYPE= <nmr>
##$USER= <dgb>
##$AMP= (0..31)
100 100 100 100 100 100 100 100 100 100 100 100 100 100 100 100 100 100 
100 100 100 100 100 100 100 100 100 100 100 100 100 100 
##$AQSEQ= 0
##$AQ_mod= 3
##$AUNM= <au_zg>
##$AUTOPOS= <35 >
##$BF1= 250.13
##$BF2= 250.13
##$BF3= 250.13
##$BF4= 250.13
##$BF5= 500.13
##$BF6= 500.13
##$BF7= 500.13
##$BF8= 500.13
##$BYTORDA= 1
##$CFDGTYP= 0
##$CFRGTYP= 5
##$CHEMSTR= <none>
##$CNST= (0..31)
1 1 145 1 1 1 1 1 1 1 1 1 1 1 1 1 1 1 1 1 1 1 1 1 1 1 1 1 1 1 1 1 
##$CPDPRG= <>
##$CPDPRG1= <>
##$CPDPRG2= <>
##$CPDPRG3= <>
##$CPDPRG4= <mlev>
##$CPDPRG5= <mlev>
##$CPDPRG6= <mlev>
##$CPDPRG7= <mlev>
##$CPDPRG8= <mlev>
##$CPDPRGB= <>
##$CPDPRGT= <>
##$D= (0..31)
0 1 0 0 0 0 0 0 0 0.06 0 0 0 0 0 0 0.0002 0 0 0 0 0 0 0 0 0 0 0 0 0 0 
0 
##$DATE= 1169549886
##$DBL= (0..7)
120 120 120 120 120 120 120 120 
##$DBP= (0..7)
150 150 150 150 150 150 150 150 
##$DBP07= 0
##$DBPNAM0= <>
##$DBPNAM1= <>
$$ [...]
##$SUBNAM7= <"">
##$SUBNAM8= <"">
##$SUBNAM9= <"">
##$SW= 20.6930455092707
##$SWIBOX= (0..15)
0 0 3 0 0 0 0 0 0 0 0 0 0 0 0 0 
##$SW_h= 5175.983436853
##$TD= 65536
##$TD0= 1
##$TE= 294.16
##$TE2= 300
##$TE3= 300
##$TEG= 300
##$TL= (0..7)
0 120 120 120 120 120 120 120 
##$TP= (0..7)
150 150 150 150 150 150 150 150 
##$TP07= 0
##$TPNAME0= <>
##$TPNAME1= <>
##$TPNAME2= <>
##$TPNAME3= <>
##$TPNAME4= <>
##$TPNAME5= <>
##$TPNAME6= <>
##$TPNAME7= <>
##$TPOAL= (0..7)
0.5 0.5 0.5 0.5 0.5 0.5 0.5 0.5 
##$TPOFFS= (0..7)
0 0 0 0 0 0 0 0 
##$TUNHIN= 0
##$TUNHOUT= 0
##$TUNXOUT= 0
##$USERA1= <user>
##$USERA2= <user>
##$USERA3= <user>
##$USERA4= <user>
##$USERA5= <user>
##$V9= 5
##$VALIST= <valist>
##$VCLIST= <CCCCCCCCCCCCCCC>
##$VD= 0
##$VDLIST= <DDDDDDDDDDDDDDD>
##$VPLIST= <PPPPPPPPPPPPPPP>
##$VTLIST= <TTTTTTTTTTTTTTT>
##$WBST= 1024
##$WBSW= 4
##$XGAIN= (0..3)
0 0 0 0 
##$XL= 0
##$YL= 0
##$YMAX_a= 434951
##$YMIN_a= -420574
##$ZGOPTNS= <>
##$ZL1= 120
##$ZL2= 120
##$ZL3= 120
##$ZL4= 120
##$ABSF1= 16.522
##$ABSF2= -4.171173
##$ABSG= 5
##$ABSL= 3
##$ALPHA= 0
##$AQORDER= 0
##$ASSFAC= 0
##$ASSFACI= 0
##$ASSFACX= 0
##$ASSWID= 0
##$AUNMP= <proc_1d>
##$AZFE= 0.1
##$AZFW= 0.1
##$BCFW= 0
##$BC_mod= 0
##$BYTORDP= 0
##$COROFFS= 0
##$CY= 12.5
##$DATMOD= 1
##$DC= 0
##$DFILT= <>
##$DTYPP= 0
##$F1P= 14.0000005364418
##$F2P= -0.99999901652339
##$FCOR= 0.5
##$FTSIZE= 32768
##$FT_mod= 6
##$GAMMA= 0
##$GB= 0
##$INTBC= 1
##$INTSCL= 1
##$ISEN= 128
##$LB= 0.3
##$LEV0= 0
##$LPBIN= 0
##$MAXI= 10000
##$MC2= 0
##$MEAN= 0
##$ME_mod= 0
##$MI= 0
##$NCOEF= 0
##$NC_proc= -2
##$NLEV= 6
##$NOISF1= 0
##$NOISF2= 0
##$NSP= 0
##$NTH_PI= 0
##$NZP= 0
##$OFFSET= 16.522
##$PC= 1
##$PHC0= 230.5085
##$PHC1= 6.512727
##$PH_mod= 1
##$PKNL= yes
##$PPARMOD= 0
##$PSCAL= 4
##$PSIGN= 0
##$REVERSE= no
##$SF= 250.13
##$SI= 32768
##$SIGF1= 0
##$SIGF2= 0
##$SINO= 400
##$SIOLD= 32768
##$SREGLST= <1H.CDCl3>
##$SSB= 0
##$STSI= 32768
##$STSR= 0
##$SW_p= 5175.98343685301
##$SYMM= 0
##$S_DEV= 0
##$TDeff= 65536
##$TDoff= 0
##$TI= <Analysis number 999999
Compound Code 99
Book Reference 9
Project Code 9>
##$TILT= no
##$TM1= 0
##$TM2= 0
##$TOPLEV= 0
##$USERP1= <user>
##$USERP2= <user>
##$USERP3= <user>
##$USERP4= <user>
##$USERP5= <user>
##$WDW= 1
##$XDIM= 32768
##$YMAX_p= 351968894
##$YMIN_p= -37470
$$ End of Bruker specific parameters
$$ ---------------------------------
##NTUPLES= NMR SPECTRUM
##VAR_NAME=  FREQUENCY,     SPECTRUM/REAL,   SPECTRUM/IMAG
##SYMBOL=    X,             R,               I
##VAR_TYPE=  INDEPENDENT,   DEPENDENT,       DEPENDENT
##VAR_FORM=  AFFN,          ASDF,            ASDF
##VAR_DIM=   32768,         32768,           32768
##UNITS=     HZ,            ARBITRARY UNITS, ARBITRARY UNITS
##FACTOR=    0.157963299565203, 1,           1
##FIRST=     4132.6476996994, 0,             0
##LAST=      -1043.33573715361, 0,           0
##MIN=       -1043.33573715361, -37470,      0
##MAX=       4132.6476996994, 351968894,     0
$$ Real data points
##PAGE= N=1
##DATA TABLE= (X++(R..R)), XYDATA
$$ [...]
21258 7210 -2357 -5166 -2533 -8963 -11810 -11633 -9694 -9587 -15974 -16591 -4948 -4544 -3885 2824 -816 -11027
21242 -11027 304 6999 1811 -4210 -3302 4975 4926 3526 10881 11585 5439 -4042 -5410 6790 10435
21227 10435 -301 -1297 4582 7150 5081 669 -358 -835 -8126 -7917 -2115 41 263 -6472 -9938
21212 -9938 -17105 -18869 -12361 -10067 -4457 6776 13378 14099 1623 -407 -7498 -16670 -14059 -8921
21198 -8921 -2424 51 1527 3076 -1113 3902 5588 11050 5879 1418 -4845 6010 13728 6147
21184 6147 934 688 1259 1761 979 4527 6202 4824 -8235 -14953 -17051 -10306 -8789 -15201 -13488
21169 -13488 -9517 -9596 -7669 -1319 5205 3079 2209 10372 13854 6289 12597 21580 9385 -1382 -3303
21154 -3303 -3028 -4286 -7339 1305 13205 17827 9963 -3837 -11142 -799 -59 4657 -3618 -6137
21140 -6137 -2091 -6204 -7832 -6886 -4087 -14761 -12017 4221 7498 10454 13516 12380 12783 18717 18101
21125 18101 12589 840 -12720 -11587 -3414 -4328 -5049 196 5372 -113 -6428 -2143 6438 2521
21111 2521 -1023 2418 -328 -524 3408 4451 3380 897 -4332 -5496 -11053 -10991 -696 3715 -9297
21096 -9297 -1018 2872 -7266 -2808 -502 -2238 -908 3481 9189 -5405 -6826 -3840 -3589 -3001 344
21081 344 1975 2131 2376 5629 6535 189 8955 12225 6569 12524 19037 9208 -6203 -7188 -2838 1015
21065 1015 9725 16899 8210 3001 -1193 7855 13026 10235 -561 -8346 -10568 -10078 1837 4348
21051 4348 249 7138 2107 1509 9132 7871 4031 1749 2553 2776 -2929 -9236 -1742 8608 4710
21036 4710 4877 2750 2490 6917 8148 8992 4100 3507 5803 2961 2435 4371 11199 15065 9320 13246
21020 13246 6717 4524 59 -532 -2339 -5251 -8277 -2537 148 -3156 -14918 -13193 -6126 1077
21006 1077 4476 8023 10544 11214 19548 16976 11306 4567 4196 5612 1385 -6339 -3409 3422 3182
20991 3182 -10196 -14609 -10152 -5844 -609 6302 9364 12243 6368 -61 1196 4929 9685 5427
20977 5427 1949 -1989 -11108 -7070 -2046 -4608 -1032 2805 6791 5106 -1013 -1145 3242 3981 2993
20962 2993 5201 214 -7709 -5895 -3828 -3355 -1922 -2628 -1448 -8257 -15707 -18181 -20887 -9622 2201
20947 2201 1542 -3630 3409 2803 -6998 -7059 -4696 5650 283 2499 8488 1963 -7611 -7742 -8449 -7891
20931 -7891 -5177 -3559 1141 740 10773 15035 11086 2826 3939 1906 2944 11294 14425 13738 11479
20916 11479 2889 622 -4365 -9902 -8239 443 13034 10637 -4463 -11035 -8630 -6308 -7269 -10880
20902 -10880 -5590 -5544 -4566 -8605 -21046 -22256 -19666 -12964 -5759 -1339 8782 4821 5753 1774 -4408
20887 -4408 -5809 -3230 -5432 -8297 1649 -3959 309 536 -1905 132 -1007 -12720 -3023 4751 1520
20872 1520 124 -3692 -11360 -21854 -22047 -26000 -28247 -23398 -18355 -15832 -13491 -18768 -10055 8026
20858 8026 4503 1546 9931 9504 -2012 -4806 756 9174 15817 20128 25107 19383 7854 4376
20844 4376 6466 12674 11338 9498 12578 11910 5640 3580 -2031 -1826 4727 -1152 -10623 -5429 -7890
20829 -7890 -16026 -9254 -12499 -8141 -3758 -3560 -7287 1078 609 -3316 -6523 -4746 -2030 -9130 -5965
20814 -5965 -5168 -11209 -14112 -11789 -2805 -9966 -16222 -16435 -12546 -2408 -2734 -9581 -2453 298 -5364
20799 -5364 -6487 -1225 9575 13335 473 -5635 4372 12103 12065 9509 2246 5208 2745 9899
20785 9899 13260 5311 -3112 -293 -4596 2427 7619 11786 11241 6484 -1180 -6604 -10947 -8893 -4987
20770 -4987 -11729 -21571 -19512 -15292 -9472 -5113 -1525 1983 -5334 -5663 -1279 -4650 2429 8171 15194
20755 15194 16260 4399 -2105 -3347 1952 8030 14786 12089 13370 9391 7342 6347 6055 -42 -5001
20740 -5001 -10647 -11108 -1884 10720 13162 15513 16986 1869 -10639 -15108 -8572 -2951 -7441 -11565
20726 -11565 -4472 2729 -886 -8867 -11142 -10520 -9735 -3373 3556 7911 -3825 -5166 1181 -3847 -8265
20711 -8265 -9471 -6891 -5356 -5994 -14368 -7676 -406 3024 1079 -4226 -1393 -9218 -11950 -2819 4614
20696 4614 2996 -935 -9763 -14926 -358 8360 7611 -1195 5322 21224 17293 16861 11890 12312 21316
20681 21316 14542 5716 -1309 -7260 -9523 -9891 -6285 -1838 -4393 12 1318 6675 560 573 11252
20666 11252 18927 21379 22074 17858 19860 15167 9793 3286 -1562 -3283 -147 461 -1915 -10423 -14599
20651 -14599 -11853 -10860 -11627 -11595 -10363 -6961 -4380 -8163 -8715 -9379 -3013 -4792 -2156 3317 9536 1050
20635 1050 -9536 -7404 -1219 -4789 -1604 -469 -4226 -1593 4120 9758 8361 2875 -2772 -4060
20621 -4060 -2015 1244 1035 3483 6142 4685 6428 12462 11595 68 -7718 -13307 -18461 -18752 -8015
20606 -8015 -7046 2037 1870 5040 7108 4360 2304 6767 5165 2498 -553 6388 6617 10608 9917 12552
20590 12552 16492 6087 -744 -2716 6221 11802 13001 17065 18712 16912 11215 14789 17910 13648
20576 13648 12888 12181 7463 1924 7365 12194 539 -494 705 4468 5796 8531 9680 13011 10482
20561 10482 470 -8807 -11958 -11117 -4412 -1333 -7572 -18246 -17736 -8108 520 4757 10249 9049
20547 9049 12386 6798 -4838 -2467 9123 2333 -792 -3523 -3152 597 -1878 -9461 -11083 -8794
20533 -8794 -7575 -2969 -52 -10360 -16799 -7996 -4591 -2700 -5756 -6534 -3437 -8684 -15473 -10422 -3196
20518 -3196 3468 7293 15882 12396 12777 18483 18455 16880 14230 11559 8197 5715 39 -7069 -11669
20503 -11669 -18214 -18995 -6625 -5909 -11285 -9084 -2351 -3834 -7304 -4333 -2683 -35 -9259 -10193 -8819
20488 -8819 -8467 -5708 -3721 -5418 -6745 -1774 -2682 -10072 -7406 -8307 -11192 -11567 -8724 -681 -3069 -1899
20472 -1899 -1770 -743 1151 -4288 -10154 -5321 -1352 6685 9133 -538 -7688 -4698 -2202 -2544 -16497
20457 -16497 -23677 -14527 -4112 459 -1561 -4828 -8349 2609 15039 13519 12259 12792 18343 11332
20443 11332 10167 10828 18304 18784 12932 11358 14551 5730 -3187 -10986 -5626 -2832 -5436 -253 -6585
20428 -6585 -4128 1146 -370 -267 6241 -3155 -8830 -9093 -15456 -16254 -9464 -3407 1955 -5764 -15768
20413 -15768 -19563 -21539 -9343 -6945 -9229 -8053 -6589 -10655 -12961 -10758 -5039 -922 -5853 -9826
20399 -9826 -15667 -24689 -29606 -22587 -17275 -8318 -10666 -11948 -9233 153 -5289 -20583 -26022 -25882 -23640
20384 -23640 -18730 -14309 -7799 -9863 -15396 -17090 -9457 135 -1329 3894 5971 9212 6372 -6438
20370 -6438 -10186 -4049 -6677 -5684 3819 -3194 -1339 407 1 -6486 -10081 -15750 -14170 -8370 1319
20355 1319 -3112 -8112 -15920 -15251 -15853 -15083 -3751 -9872 -15071 -18664 -17112 -14869 -16060 -16425 -5916
20340 -5916 -1251 -638 -8773 -23670 -23679 -7925 3611 3038 1745 427 -4721 -11316 -8176 -6407 -1818
20325 -1818 -5920 -10888 -2751 4709 -4361 -8012 -2296 19 7540 14561 3507 -7448 -8185 -6513
20311 -6513 -6147 -10839 -13553 -5234 -8760 -17153 -20232 -16104 -7406 -5159 -14014 -14445 -7766 -4957 -8729
20296 -8729 -11153 -9082 -10906 -5720 2569 474 -10119 -14089 -5550 -3260 -10664 -11806 -3448 -11374
20282 -11374 -16727 -13442 -13104 -19039 -21551 -16647 -24394 -25329 -21697 -23481 -20497 -17241 -16984 -6043 2136
20267 2136 -1936 4331 9799 3260 -6087 -11833 -5980 13395 20050 9555 1970 4242 12708 10901
20253 10901 7805 11400 13614 8073 -3544 -47 14473 23365 22542 17925 14598 15815 12295 14527
20239 14527 10386 2855 -489 399 8028 1791 -13404 -17024 -11738 -14111 -12342 -5230 -7301 -10486
20225 -10486 -3884 -3917 -7052 -6445 -5045 -784 -576 3281 -8055 -14151 -15377 -7737 2397 -5148 -8824
20210 -8824 -1807 -4053 -7245 -4194 -2239 -12295 -10716 -8243 -4126 -6493 -7645 -7150 -12957 -17404 -15702
20195 -15702 -9225 4958 5328 821 2847 -1128 -11511 -10481 -5713 801 4018 -4142 -10923 -13526
20181 -13526 -10379 -7369 -11004 -8668 -10057 -10197 -9506 -9850 -8310 -6476 -1634 -4814 -3242 -1996 -3379
20166 -3379 -15307 -7768 -2702 -6563 -1734 66 3575 2032 -5503 -10463 -15231 -12557 -8628 -2811
20152 -2811 -7039 -9226 -8367 -5432 -4982 -5974 6822 8365 4933 7504 6896 1482 -4388 -742 -2931
20137 -2931 -7271 -13571 -10121 -3806 -4477 -6747 -1974 8226 17826 17003 1792 -2548 -1482 -340 3068
20122 3068 909 8078 13966 11625 14368 4640 -4923 739 1833 240 -2908 -9352 -11877 -10358 624
20107 624 -310 -1332 -8139 -12487 -14097 -12475 -6964 -6568 -6957 -7902 -6995 -15392 -17338 -440 -551 -3207
20091 -3207 1681 8306 7682 10783 6476 -3209 -11094 -6051 -4895 -1789 -9689 -12002 -14686 -1764 271
20076 271 1033 2876 3359 -2126 -4665 -5012 -2734 -69 -4311 -11163 -3443 2054 2168 -5364 4779 7916
20060 7916 -3522 -6396 6139 5383 -1260 685 1179 -9701 -21654 -19843 -10870 -2379 5636 840
20046 840 -696 -1563 -1910 -1503 -14668 -13437 -12601 -17216 -7326 810 -6972 -15884 -10207 -8351 -12976 -7753
20030 -7753 -6685 -1630 -3620 -3902 3933 4572 4750 -2622 -6997 -3629 3575 1769 -258 -1454 -6004
20015 -6004 -12974 -2868 9751 916 -2263 -1700 -3976 -12258 -14609 -20438 -18243 -18705 -5423 -1324
20001 -1324 -591 567 -1100 1231 9585 10762 7399 -1546 -7237 -1119 -3563 -6727 -4910 5783 11022
19986 11022 2890 -12608 -15206 -6705 -1492 -208 207 -6142 -6902 4541 21745 14855 6805 5025
19972 5025 -4858 -3754 -3201 -4693 -4981 -1251 12142 20501 19782 10823 9699 9068 -1880 -8352 -14034
19957 -14034 -8908 -7806 -10859 -10002 -6353 -8595 -8733 938 3664 2810 1406 -267 -6854 -10295 -14979
19942 -14979 -13109 -12564 -1259 6958 8604 3873 742 7235 6832 -2936 -7748 80 4307 9 -12290
19927 -12290 -5276 3582 6413 3745 -4097 -4342 -5692 -4519 -6478 -3436 1521 471 -5693 -12325 -14323
19912 -14323 -8251 -3293 -5833 -3012 2634 -5129 -2780 -7611 -13518 -9911 -15886 -11732 -4678 -7541
19898 -7541 -4455 -202 -1967 -6703 -11752 -15300 -14537 -11062 -2641 11330 14195 6128 2018 -2229 -7806
19883 -7806 -14192 -17690 -16241 -9491 -3731 -5278 -9943 -17668 -12037 -5686 5519 9877 10896 6510
19869 6510 10056 2126 -6155 -2352 -4803 -5263 -4566 1687 6594 7466 202 -4096 -7860 -5196 1955
19854 1955 -2247 -6853 -5287 -14248 -11939 -5042 -2547 -2657 4557 -2656 -5027 133 -5374 -11150 -10227
19839 -10227 -7564 -396 1800 2692 952 -8634 -6627 6055 14435 10184 2734 -4095 -12950 -10750
19825 -10750 -8445 -2284 308 6515 10402 6870 -1446 -11456 -18557 -19540 -18581 -18716 -13316 -7893 -13361
19810 -13361 -20448 -14690 -10610 -12766 -10728 -10185 -5330 -6700 -5110 4916 8422 10003 4070 -4870
19796 -4870 -4503 -377 7372 4865 12265 8615 4640 4605 4986 10102 9435 -1579 -6476 -12409 -17901 -5581
19780 -5581 5674 -1143 -1689 -2216 -8928 -4901 -5421 -3142 -4028 -9680 -8897 -5208 -9073 -9477 -10807 -3259
19764 -3259 3338 -1523 -3467 -4430 -2072 1841 8296 13504 16101 6035 -4403 -5331 -13811 -13222 -874
19749 -874 -3985 -7697 -4108 2332 2403 8661 12197 16203 14047 11105 12808 15979 8256 8338 8872 5438
19733 5438 8214 11836 6134 -7173 -14531 -9964 -5530 -7302 -11772 -19711 -17437 -5646 -3227 -13599
19719 -13599 -22394 -13971 -8559 -8621 -5851 -12887 -19189 -17881 -11154 -13740 -7630 -7663 -12788 -14939 -10221
19704 -10221 -10615 -18936 -24437 -17859 -18904 -15150 -16745 -10183 -4380 -1422 -182 1081 -46 -2895 -4331
19689 -4331 -3872 -10754 -2619 347 -4301 -8756 -12490 -11547 -9709 -8140 1800 9487 8676 4875 4067 6065
19673 6065 3431 -3859 502 -2470 -13944 -15437 -7156 -8482 -19431 -23285 -20480 -9632 -4408 5159
19659 5159 12080 6140 7362 8214 -375 -3360 -9373 -21746 -33935 -37470 -25578 -10921 -9776 -7820
19645 -7820 -4336 -1620 8216 9975 16265 10378 -2289 -7984 -9827 -8056 -5015 -6531 -11503 -9927
19631 -9927 -9391 -788 5003 5015 10243 -3367 -5270 5710 10460 4087 -6798 -13523 -11223 -973
19617 -973 1779 3397 -258 -1794 744 882 -1810 -4305 -5257 987 6356 10967 12153 14589 7151
19602 7151 -1517 -3898 -17692 -18649 -16679 -9438 -5094 -10872 -18013 -17582 -14806 -7726 497 2256 1229
19587 1229 -2927 3313 -1545 -4292 -6498 -3214 2552 4620 6602 -3890 -10342 -10378 -11359 -16642 -15950
19572 -15950 -6610 182 4111 2554 3387 2185 4122 4633 2863 -351 6707 6204 8330 1622 -7158
19557 -7158 -12844 -17827 -4263 7670 7492 18356 19238 9785 5469 3645 2309 -4168 -2135 4049
19543 4049 -1651 8309 10989 13547 12160 -3159 -5022 -10490 -7882 3541 310 -1564 -2096 3
19529 3 297 -4471 -161 7768 7530 12221 7916 -5260 -15104 -14512 -366 -1463 285 7269 13675 7560
19513 7560 694 -4279 5955 14078 13890 6929 9069 11122 6511 1928 2215 -1422 -12205 -16079 -10174
19498 -10174 -7841 -1204 -3283 -14097 -20716 -23853 -12316 -2633 -658 755 -3573 -6175 -1797 -843
19484 -843 5962 15051 20316 12648 12736 7844 3453 -6692 -8576 -5539 3843 11266 13006 8857 7777
19469 7777 4543 1584 6904 13756 20215 9870 6887 3583 70 1655 11309 15899 17917 18773 16031
19454 16031 16638 10194 2599 2436 5812 4755 5576 2860 4543 -5533 -14762 -2473 1543 3822 4962
19439 4962 5982 4876 9705 16120 14304 6346 -1892 7654 7487 -1475 4274 10584 9878 272 -7991
19424 -7991 -8890 -806 4233 6457 8722 1616 -1285 -5210 -7204 -5934 -763 -2922 -4484 923 -886
19409 -886 -2690 -1413 -9305 -2876 4835 3592 3381 3069 1070 2110 36 665 15230 26024 23512
19394 23512 16749 11143 11019 10643 4639 3479 3711 5952 18432 12319 -2967 -2916 7134 6589 -3375
19379 -3375 -3484 749 -730 -1877 739 234 6892 6155 -1191 413 6580 7045 6778 6099 -954 -6410
19363 -6410 -2248 5737 8254 -2461 -5888 -4122 -2950 -843 -1666 -9831 -3548 993 -2063 -1594 1817
19348 1817 2195 -4103 -3270 2805 8183 8167 5929 8769 14106 18129 15651 12812 8137 9751 4341 -1023
19332 -1023 2733 -1180 4032 12330 24348 29953 20971 26263 28861 29366 30597 29150 32674 39817 41160
19317 41160 50052 56013 64967 69710 68815 80963 101560 121850 132104 155971 167524 183192 202481
19304 202481 223004 246443 254737 258942 276358 282142 273017 267006 254284 241283 222263 211998
19292 211998 209224 196637 177010 168202 148564 121206 102205 85598 74363 71423 70155 67716
19280 67716 62953 48612 52247 50840 35490 20513 19120 21823 23077 34871 36358 21621 10310
19267 10310 8347 18273 23049 22704 21123 16911 11406 6115 5586 -209 -3201 -11494 -5336 -1720 -127
19252 -127 6510 3429 -3030 -8968 -11468 -19791 -11419 -6234 -7918 -14282 -8042 3311 7712 7355 7604
19237 7604 17253 20096 12877 5603 4993 12802 -598 -9088 -2722 8610 19040 21558 11854 3040
19223 3040 -1222 -836 -770 -6526 -10059 392 1176 1108 -6399 -3237 6805 20898 21099 12568 8668 3278
19207 3278 421 -4111 -3420 1766 6143 12018 12069 11363 16549 22564 20706 15408 20070 16178 84
19192 84 -6937 -10635 -9278 -5576 -13232 -14962 -8592 -4874 -2370 -14612 -15473 -12652 -1044 -3130 -6418
19177 -6418 -10893 -12825 -3583 -5139 -10834 1546 310 -4863 4329 9123 2883 3190 12516 5399 -5878
19162 -5878 -4897 107 6505 -1195 -2818 2472 -5320 -1793 7557 11593 15668 13260 11615 6449 10803
19147 10803 4320 410 2148 2856 6248 13133 10063 12116 14600 5447 862 735 -4150 -15795 -20152
19132 -20152 -7803 2331 -1044 -9063 -5994 -7443 -11255 -14292 -10017 -4704 1922 9746 7722 5565
19118 5565 1980 2965 6981 8218 14477 7213 -3953 -10512 1894 -3246 -662 -309 -3328 1862 2892
19103 2892 4971 3151 4068 3190 -3680 -926 2610 3053 3852 3773 6375 8995 4564 435 -355 -9420
19087 -9420 -18694 -17585 -7049 391 7171 8997 8090 8620 7252 9437 13404 20686 19829 16232 7189
19072 7189 2748 2725 -1066 2353 16595 25930 17696 5403 669 -4454 -10218 -6618 1280 1944 2142
19057 2142 -1742 -5511 -5336 -7161 3260 11469 12965 6564 5740 3207 -1762 -5246 6157 13986 5084
19042 5084 1610 4847 8532 9329 -1138 -1548 1887 2641 -4773 1050 7744 8287 12269 13073 23276
19027 23276 32484 23357 16070 7990 6797 7496 15382 10464 9680 6846 3071 1991 -2401 -1520 3107
19012 3107 4340 6837 11025 7616 2354 5305 3910 -2823 -11157 -7968 -9681 -9241 -5341 -1380 -3457
18997 -3457 -7815 -7067 6160 5566 2070 2572 12684 15406 26734 25077 12706 11790 5134 -467 -2784
18982 -2784 2521 14820 22345 20041 18838 17879 17767 7829 10931 15725 18513 14099 13538 22927 20862
18967 20862 21796 26907 28950 34184 26041 18217 14760 1611 -9423 -24 -8672 -19912 -13693 -7507
18953 -7507 -12396 -11866 -5019 -1148 -4672 -6121 -11176 -19699 -9820 -4469 -3622 -3155 -6851 -9294 -8338 -7416
18937 -7416 -6324 -7673 -109 2724 9605 13560 3495 187 -3372 -3192 248 5881 158 -863 -1069
18922 -1069 -3177 -6324 -4251 4303 5290 -2548 2914 20474 18993 15313 4680 3975 10588 18492 3979
18907 3979 2681 -2983 2262 -1910 -4060 5494 12606 11334 7052 -1320 1534 7271 9183 8050 7298
18892 7298 15016 18768 16984 8363 7724 4747 3430 -3222 -17979 -15226 -7360 -10879 -7970 -6446 -8973
18877 -8973 1562 12175 14238 6762 561 851 3526 9728 6703 -2023 3782 3917 5743 9572 13609
18862 13609 7148 321 -4991 -4015 -2456 3300 495 -1715 -1644 -3740 -2260 -3521 -6766 -7523 -6273
18847 -6273 -7057 -4680 325 -3950 684 12103 -353 -9113 -9205 -8611 -5061 6016 7779 11271 8187
18832 8187 10594 13497 13183 11931 13669 14484 15345 19116 15055 -519 -2329 4791 6455 6606 9539
18817 9539 8794 14170 21095 23501 34472 39656 47947 54304 44744 37637 46062 57576 70914 66767
18803 66767 51015 30607 24601 20714 18992 17538 18410 14355 19882 21765 23520 19236 20075 18625
18789 18625 11786 13773 16544 27368 29445 28275 30660 22321 16452 17061 16032 17644 22665 29071
18775 29071 36430 35886 44117 32458 28741 42368 62507 104068 147220 146988 124676 114485 110059
18762 110059 107118 105476 99157 83626 81504 88496 97557 102412 98115 81616 65175 46592 28503
18749 28503 18053 33943 37783 29308 29614 27314 19446 16775 19302 19734 16649 26686 20903 13615
18735 13615 3801 -3675 -755 5652 11562 16564 10014 -2504 -4658 2241 13033 7870 6777 4144
18721 4144 6312 19798 22984 17611 14055 10925 33148 40905 49941 58205 52324 37791 42459 56300
18707 56300 61061 57990 56361 51927 48764 37264 34532 35823 29579 26784 24523 27685 23919 18048
18693 18048 8946 13706 27389 18374 9217 8844 7935 10588 9912 8465 3596 14833 17432 12443 12764
18678 12764 10803 13676 4354 1976 1037 5378 5087 -82 7190 21156 23230 13888 7119 3203 4702
18663 4702 7567 18221 27545 29679 21658 10601 6293 3093 6078 10067 7707 3430 -4937 -224
18649 -224 1262 4352 1404 634 13038 13489 10222 1003 4449 9712 9548 19080 26354 27304 40038
18634 40038 28937 19978 7920 7741 13017 17314 15123 15789 16065 7314 1841 -6183 -6049 941 4317
18619 4317 -142 -9484 -6744 2070 573 138 -9155 -14480 -8486 12077 17377 15992 19608 18046 20692
18604 20692 21357 27741 33368 38918 46284 50495 47549 47972 48751 53970 64980 77168 84373 76406 63829
18589 63829 55378 60212 60461 64011 69536 72964 66527 46395 39150 38218 40532 34575 20824 17805
18575 17805 21962 9062 11108 18160 15908 15089 23906 22477 17927 29949 42092 41703 33590 31247
18561 31247 34065 35609 39734 39417 42717 46029 47815 62042 68236 63435 52366 55939 54259 62713
18547 62713 74673 84256 97169 96832 81959 65442 63249 68625 74605 81982 81650 61486 36553
18534 36553 27340 37360 34043 26988 31083 18083 15462 5325 2255 -579 -3204 -276 8601 13527
18520 13527 20611 22417 23093 18260 2741 9982 14541 16970 22949 22841 20939 24381 27662 27260 19309
18505 19309 32788 43381 37182 31569 24359 26340 35291 34363 25024 18463 16603 17017 17206 18864 13443
18490 13443 6750 2672 8859 12009 14234 12904 10472 10541 11080 12875 17080 9445 10017 10650 15332 18182
18474 18182 20349 21902 26355 27236 16445 17066 21094 28334 32605 31725 40159 44508 44195 38171 36404
18459 36404 42647 54602 75106 85600 80789 77475 79951 86593 91219 84681 87614 97495 100909 106792
18445 106792 114168 119941 123345 132878 133478 122378 118162 115395 109000 108078 109298 109089 113048 112716 118819
18430 118819 123656 128299 126898 117852 115160 108871 91426 77310 66989 63426 71451 72369 60367
18417 60367 58329 57470 50445 45949 38498 35523 34361 23408 16130 20305 31815 31437 28480 23241
18403 23241 36201 41962 45601 50728 56570 62881 59512 59818 57382 55390 45745 52695 64760 70946
18389 70946 85311 88827 86786 80331 68720 72527 87659 106328 105795 100083 98865 85972 76506
18376 76506 78721 94652 117823 130767 116008 89362 73812 79948 96323 101635 113035 120825
18364 120825 118346 105174 97473 88958 78393 61197 42779 44256 48110 44752 52212 47969 41030
18351 41030 45333 45813 48087 59522 70816 78543 81235 92964 87417 82517 82632 74780 72233 80105
18337 80105 92015 106139 110536 125101 144846 156136 171321 173932 164623 171485 176107 192136 216928
18324 216928 226274 223103 215727 236585 283580 349568 465737 623021 764252 777525 682686
18313 682686 593790 545164 536942 567337 618963 721405 891501 1143771 1526787 2154089 3222868
18302 3222868 4832002 6383688 6457998 5482457 4806794 4774651 5442342 6435452 6455720 5176495
18292 5176495 3826316 2812454 2095578 1620611 1300304 1082141 940040 850877 794921
18283 794921 730783 679805 636678 606270 591492 586415 600731 600731 593362 585998 594246 631733 678468
18270 678468 769035 917043 1146715 1438146 1666752 1648743 1504732 1423137 1426575 1526853
18260 1526853 1725852 2051402 2573285 3401290 4736572 6958372 10289903 13852066 15549002
18251 15549002 15229997 13843511 12900173 13523422 15541483 17120914 16466837 13638080 10189034
18242 10189034 7484758 5567535 4237132 3318683 2697333 2278422 1974374 1753666 1604006
18233 1604006 1525834 1534586 1624005 1704069 1620334 1419464 1227909 1070308 954287 879712 835733
18222 835733 816350 809110 806378 799354 815029 832640 845962 878231 931856 1011440 1108181 1272337
18210 1272337 1512436 1886126 2494592 3475937 5058417 7452546 10278495 11684223 10774705
18201 10774705 9520522 9204689 10237715 12544232 14389458 13074587 9965938 7346797
18193 7346797 5459313 4133887 3222516 2615269 2211155 1974492 1879302 1937786 2140857
18184 2140857 2338511 2221817 1833057 1445499 1151216 937852 784054 679973 606090 566846
18174 566846 537563 519718 488768 467679 453154 435631 419862 406800 375639 345422 314139
18163 314139 270982 239725 217624 196621 190486 181762 179308 176899 171542 170256 179103 180675 173666
18150 173666 169233 168423 167293 170855 166376 156814 161418 167483 175788 181271 184533 180316 175495 170324
18136 170324 164022 180262 183727 201117 218636 228695 227168 238554 264123 287260 310337 333224
18124 333224 366854 408797 470919 548330 629092 727648 865163 1040466 1306767 1704146 2300537
18113 2300537 3295973 5058009 8316635 14137551 21771198 23413379 17233414 11656598
18105 11656598 7951120 5491762 3925534 2899838 2219164 1775667 1461324 1238292 1080320
18096 1080320 967170 894528 841110 802323 766560 748540 735861 728375 738048 768576 798271
18085 798271 811728 827775 859535 906158 966408 1045173 1151706 1300897 1494216 1752978 2171860
18074 2171860 2840925 3938693 5746924 8324488 10478602 10414457 9193337 8482123 8712009
18065 8712009 10185459 13217719 17307774 20335817 20531892 17801158 14229135 11700780
18057 11700780 10534777 10804120 12504522 14566312 14231796 11295507 8362399 6205894
18049 6205894 4673197 3612624 2903357 2425882 2078427 1811829 1615122 1472662 1359656
18040 1359656 1288736 1249240 1207712 1159816 1106541 1069501 1051555 1056348 1081179 1115576 1185687
18029 1185687 1289204 1441478 1685777 2133048 2895773 4182503 6018700 7440950 7146030
18020 7146030 6138063 5568970 5652702 6533959 8355078 10743168 12530235 13090920 11702447
18011 11702447 9294254 7508313 6608396 6626538 7539555 8682179 8392116 6599845 4864122
18002 4864122 3601799 2712613 2108082 1698842 1414420 1208008 1047327 927467 836846
17993 836846 760665 700343 644758 606017 578269 549121 512515 482032 456602 422178 396676
17982 396676 376847 362245 359755 350497 335770 325886 318044 296939 281442 283404 285524 290467 306400
17969 306400 308544 315482 329674 346148 354711 358098 371966 406317 445884 477219 513806 547383
17957 547383 580367 624327 688924 745317 792504 860100 947276 1052323 1191987 1402951 1685640
17946 1685640 2061245 2540030 3092798 3556031 3892903 4336241 5176522 6580185 8333710
17937 8333710 9662833 9835479 9224378 8577142 8292334 8688833 10072965 12823008 17146376
17928 17146376 22429915 26840276 28730801 28948624 30061941 33177593 36687076 38181443
17920 38181443 37696340 36785775 36336939 35792068 34979523 33940639 31506549 27840362 24418474
17911 24418474 21160064 17473192 13895057 11165837 9421664 8357448 7439558 6392852
17903 6392852 5401336 4655142 4188941 4001770 3999370 3954944 3625577 3114965 2656023 2284735
17893 2284735 2000600 1782941 1617587 1489202 1381747 1291309 1223137 1171456 1150322 1156549
17883 1156549 1194180 1271324 1386142 1536394 1750922 2076189 2609575 3483159 4924641 7071568
17873 7071568 9410501 10513603 9730194 8289974 7326361 7238678 8102969 9559954 10416868
17864 10416868 9623243 7854599 6219726 5077017 4456734 4391371 4896719 5883204 6816896
17855 6816896 6817589 5938874 5042046 4583268 4676032 5264702 5957570 5950198 5027113 3868401
17845 3868401 2908342 2195322 1699735 1359958 1120373 950197 816142 701411 612387 551575
17835 551575 513467 465408 418448 385412 360918 335544 316925 294920 276599 267260 257165 248947
17823 248947 232716 210005 192756 185825 178165 170936 167847 163128 155462 148654 145210 138066 134374
17810 134374 145280 150592 139562 128077 126925 119359 111447 104876 101836 101996 105053 111293 111168 118009
17796 118009 132389 147035 139414 126838 123931 121729 117936 115952 107883 98476 89999 76110 78555
17783 78555 92863 105324 100707 86947 82211 76375 78867 85215 78299 79872 95817 115375 129042
17770 129042 133238 124270 110029 96829 91614 99733 118608 118256 110515 92412 73271 66393 58289
17757 58289 55609 52780 59328 58983 50374 45138 47828 57068 54819 56089 46317 44386 42743 44747 49435
17742 49435 51989 52764 51061 49262 40745 42262 55049 56133 52778 50170 47600 47344 42206 37805 42858
17727 42858 53697 63822 73425 86650 108608 115494 117138 123156 124641 124472 109652 102305 113692
17714 113692 113885 106491 88330 74033 58440 50304 53384 49486 45718 48648 58358 50155 36769
17701 36769 30534 25917 26152 18736 8668 17541 23608 19228 14802 19039 23320 25571 28146 27414 29112
17686 29112 22532 25623 31006 39954 39943 40802 30528 22581 29644 43924 46582 48409 52288 64960
17672 64960 61155 51580 47658 49497 55896 64184 57851 49122 39862 40002 34588 25585 15066 22762
17658 22762 34554 38722 31460 24052 31651 34735 35173 38377 30348 22830 17300 14361 23613 32735
17644 32735 28292 13959 8686 11121 -2781 -1333 1965 5259 2186 13520 27741 18770 5040
17631 5040 2270 3344 7045 13550 12433 3116 5414 6445 7813 5664 6629 23500 31316 29013 28319
17616 28319 25261 3125 -10217 -5192 2857 12169 5495 4937 10033 8007 2771 4140 -2959 -12703
17602 -12703 -13009 2551 -5295 -11005 -3235 -6558 -2467 6887 10492 13231 19916 14149 11450 10143
17588 10143 18217 28016 36030 25290 8740 11087 20142 19390 23312 22421 22879 17108 12434 7948 7930
17573 7930 13936 19897 24280 22292 13959 10108 15256 16958 12354 3858 3610 8644 6646 7557 16614
17558 16614 21946 14894 3357 -5399 -14175 -8899 -405 5659 8280 16187 17116 11320 7250 15896
17544 15896 26178 36324 39248 41018 47172 56655 56750 62077 55077 53752 65783 77558 84180 87698
17530 87698 81323 79495 76052 59949 51516 58226 62920 70238 69527 61001 46559 32451 26778 24782
17516 24782 27212 23469 19814 23949 26753 24505 19143 10814 11661 10886 13878 17158 23119 28513 21796
17501 21796 6868 574 1297 2571 10825 21905 19046 24146 43197 58284 55501 65952 63383
17488 63383 50338 54894 58477 75137 81341 78655 71626 62763 41500 32196 29017 35994 40861 37788
17474 37788 30314 22681 15359 7629 13334 16216 18972 20971 17364 8300 788 3805 6320 2573
17460 2573 1256 9320 11196 -5231 -8808 -14674 -12252 -395 6644 9650 5366 6812 10715 9983
17446 9983 17952 35408 53961 86746 113786 97014 73497 56292 44535 33511 19042 10092
17434 10092 11840 10695 7281 3284 9247 3892 -4985 -10765 -5818 921 2335 10934 24724 38102
17420 38102 52752 62745 69784 79960 98448 117058 139423 144695 127397 116509 97714 89155
17408 89155 105313 123992 130647 128904 128843 122426 129858 139402 141025 139984 146704 147789 145363 131643
17394 131643 121947 113380 112246 120608 130865 123691 105030 86893 70100 60403 57942 46292 39215
17381 39215 33978 20726 14951 11914 9689 5036 12806 17543 15111 17384 14120 10721 8955 3205
17367 3205 128 2474 13537 13710 21965 26496 29261 28950 32702 31766 24222 29323 30381 31344 33728
17352 33728 33145 33181 31961 32179 27741 26104 37726 47852 39009 38228 45527 44453 35231 35651 42292
17337 42292 40515 38124 36399 29217 26748 27907 14148 9026 8000 1216 -1107 548 3063 5798
17323 5798 302 -9629 -16473 -12507 -7219 -9080 -8762 -4801 -1037 -10593 -11908 -5870 1979 6567 5194
17308 5194 548 943 -5456 -10357 -5970 5629 8133 -660 -1715 -6700 -8616 -1506 6417 12617 11253
17293 11253 13787 7509 -6223 -15470 -8702 -14180 -18405 -15791 -13893 -19155 -21551 -8485 -2489 -1149
17279 -1149 5486 522 -3292 -2818 -5807 -8938 -7360 -8972 -10507 -9867 -6319 465 9025 3657 -6807
17264 -6807 -11161 -597 4552 -1857 -439 -566 -3088 -11866 -11289 -2392 5679 8583 11626 15709 7130
17249 7130 528 1165 9111 -938 10319 9494 973 -118 -5865 -7015 -3488 -6503 -3914 -940 829
17234 829 -703 3205 2890 -1151 -2006 -1990 -2562 9780 10161 8167 4837 -1770 -5486 2240 5026 4570
17218 4570 2967 7289 8629 12406 15007 8773 -4915 -19788 -23245 -11158 365 6451 1691 -815
17204 -815 -3784 -3225 9201 14868 17680 11933 15116 8294 1275 5384 -3077 -7446 3904 1693 -5290
17189 -5290 -5648 -8118 -5172 -7296 -10199 -16063 -11740 -8167 -9515 -7372 -2408 1387 -991 -2978 -11510
17174 -11510 -11497 497 3102 17426 22104 10661 4152 -12419 -18281 -9763 -8415 -12095 -16344 -17799
17160 -17799 -21055 -18382 -15447 -6671 -6453 -11728 -13168 -11085 -11451 -19212 -3317 2164 3749 -4477 -23562
17145 -23562 -34395 -29604 -20716 -11172 -7863 -3514 -7316 -4984 -1728 -3652 -5424 -4833 -5569 -4071 -9006
17130 -9006 -9057 716 571 -5441 -11313 -10394 -13241 -11762 -9686 -9561 -7518 -1408 4183 9174 -1426 -5367
17114 -5367 2512 -487 -11480 -16377 -11067 1600 2016 3160 2282 8814 3378 -5945 374 -4652 -7858
17099 -7858 6320 15483 19041 2737 -7287 -8472 -3451 -7784 -8214 -4072 -701 -260 -1864 -64
17085 -64 2934 7298 14182 10850 10710 6012 -1848 -6273 -7783 -4722 -5874 -14816 -12431 1323 9028
17070 9028 10905 15017 16138 10751 -2918 -12590 -4626 -1084 -3082 -8030 -7496 -5085 -2531 -4226 -5849
17055 -5849 -3933 22 12050 17309 10920 -272 1053 408 -1523 -1024 4505 2836 -6337 1802 6069
17040 6069 4318 7808 3668 -2236 -2941 1931 -1675 -7319 841 9066 10990 9822 8899 6516 2531
17025 2531 -1000 227 359 2722 14071 18075 15201 1760 228 2322 6114 -153 839 14187
17011 14187 17134 14240 9769 -2311 -2568 207 2875 -9150 -11452 -8632 -10261 -18843 -22642 -23469
16997 -23469 -15974 -10638 -1148 3796 1863 4427 72 -6359 -14834 -4050 2427 352 -6075 -7460
16983 -7460 4851 6684 5905 6633 -11 -5570 -3577 -7416 -3046 -4159 2522 4519 6920 7990 9990
16968 9990 18927 16413 13332 405 1674 15967 17816 11578 10609 15228 14387 23481 18706 15433 8292
16953 8292 4431 4939 2175 681 -471 1328 5175 1464 4091 14562 11921 3324 -1308 -3959 1730
16938 1730 13152 5570 1510 3589 3550 9371 11045 9814 9323 6735 351 -3872 3249 8073 10636
16923 10636 5485 -692 -5446 -19201 -23526 -11574 -10223 -6147 4316 -4017 -8763 -5481 -5087 -3636
16909 -3636 5677 6507 8280 1670 -6249 -15408 -8556 -7161 -9179 -7626 -3096 4393 5067 -2344 -631
16894 -631 -2318 -3116 -6334 -10411 -3796 -3064 -8543 -5647 -662 -3838 -6999 -2849 3419 3299 4567 10877
16878 10877 4134 2325 3016 4752 3666 4171 -2718 -7846 667 5957 5212 16933 13482 10828 8264
16863 8264 9019 5262 2514 2443 -3548 -5134 -8153 4185 10437 8043 -2784 -7595 1172 7051 4078
16848 4078 9044 2171 159 1496 5298 5157 7337 12523 9287 1721 -67 -5509 -9067 -848 -1256
16833 -1256 -9672 -13409 -9455 -1370 6394 8681 1521 2054 -2698 -3385 4518 4421 1755 5941 4442 -45
16817 -45 1240 147 -7172 -9254 -5265 684 10239 551 -12097 -12263 1666 6623 10035 10546 14009
16802 14009 9080 1358 -5547 -4276 -3314 1333 2257 -6605 -16671 -16562 -8850 2170 8351 -759 -6040
16787 -6040 -10448 -9719 -757 -11576 -21178 -15839 -18014 -14337 -13902 -6775 -8620 -12053 -10569 -5362 -13399
16772 -13399 -16291 -10110 -8136 -6485 -8361 -15075 -13947 -13380 -3549 -807 -2386 -3390 -2642 -945 -8354
16757 -8354 -10875 -16238 -18254 -15771 -11999 -10635 -4399 9 -2143 -8956 -18613 -14203 -12412 -3408 -1013
16742 -1013 -4813 -3977 -227 1274 122 4194 -5186 -10416 -4466 1686 5619 5122 8022 2680 -2305
16727 -2305 3213 5469 2020 245 314 8935 2031 -9562 -12920 -4649 -2321 -5561 -12218 -5075 -2146
16712 -2146 -10939 -15997 -16574 -11223 1903 -1267 -6307 -1074 -4644 -14302 -18322 -22914 -23704 -15490 -5690
16697 -5690 -655 5486 4511 6460 -4783 -13725 -12816 -10583 -4525 -4402 -1977 1279 4514 5734 -235
16682 -235 -2748 -3538 -11666 -12694 -14769 -22641 -20621 -8287 -8047 2622 12762 18538 10394 3571 -864
16667 -864 -2858 -6159 4553 11294 12484 12423 18188 18157 9839 9730 11278 3074 -723 3773 2835 4786
16651 4786 6622 8702 4063 -3192 -11077 -10420 -8400 -2103 -1349 -2098 2388 3480 -7850 -16703 -8916
16636 -8916 -7066 -10988 -6478 8805 9643 -1764 -2790 1941 732 -8815 -14265 -11900 -9363 -5815
16622 -5815 -12561 -17148 -11409 -520 54 -12076 -5118 -9430 -7556 -11366 -7318 -2656 -7681 -13018
16608 -13018 -11515 -9504 -6103 -2231 -399 5845 9856 10650 8621 2277 6060 4295 -4305 -11725 -5311
16593 -5311 -4592 5380 2126 -1665 -13189 -10761 -17602 -14092 -1637 9823 10141 1354 -1854 -5334
16579 -5334 -3934 -1306 -828 -1391 3921 9204 1553 -2265 -3247 -1071 2751 -5852 -17028 -17366 -19450
16564 -19450 -15978 -5981 2959 4684 3264 -5887 1100 3186 3559 -1914 1364 9440 6819 1047 3821
16549 3821 6280 -3975 -2854 -6706 -13936 -2791 712 -8325 -12852 -16284 -20239 -10009 -1202 -11971
16535 -11971 -11621 -2932 -2918 -11994 -16483 -9992 -3466 -12247 -12771 -9859 -10198 3435 3928 -6863 -10813
16520 -10813 -4161 4570 -12386 -26070 -22919 -18296 -6377 -10153 -16577 -8013 -3092 -4417 -11725 -12031
16506 -12031 -12300 -15976 -15069 -10737 -3233 -3774 -5371 -1879 5727 -2063 -13938 -4512 -26 4988 4462
16491 4462 -2341 -2455 -9840 -10315 -3691 863 -4300 -8140 -6690 7385 3319 -5153 -6760 -6203 -307
16476 -307 89 -7369 -9902 3160 6203 -5822 -12885 -8175 -11183 -5180 -3943 -3330 -8212 -4450 4656
16461 4656 4413 -41 5206 11578 -3579 -7511 -449 14737 13991 11883 8783 9090 7781 2538 -4619
16446 -4619 -2525 1242 -407 -10280 -17738 -18919 -13716 -2114 1793 -6675 -10536 -9214 -12495 -2999
16432 -2999 723 -2514 -7512 2756 6134 -2656 -5608 1233 -4072 -10179 -10960 -14748 -14388 -16591 -11929
16417 -11929 -5747 -5255 -10561 -11241 -12796 -11884 -5931 -2364 1244 -4878 -8168 -4876 -12258 -18260 -14415
16402 -14415 -8211 -4466 -7220 -10275 -13334 -14968 -8146 -4044 3088 6052 614 -7588 -16101 -22848
16388 -22848 -22461 -9255 -534 -1303 3369 2035 -4817 -5727 -3485 5543 4821 -126 -7035 -12706 -11405
16373 -11405 -12440 -1953 4343 -1671 -16133 -16371 -10667 -7889 -12371 -4761 6524 6176 9920 11517
16359 11517 9064 5157 1527 3490 4229 619 1794 2231 -187 -1400 -1934 -1372 -4211 -7814 -14913
16344 -14913 -21213 -13060 -12943 -18342 -16906 -19412 -21253 -17565 -10551 -4306 -6895 -8278 -8036 1749 -2753
16329 -2753 -12497 -12531 -14000 -16136 -16325 -5765 6531 4663 -4041 -4945 1732 -4079 -6047 -7707 2742
16314 2742 12166 9174 17127 15337 13698 12566 8202 -3934 -11329 -12770 -11027 -8785 -8470 -14689 -11740
16299 -11740 -6392 -247 4407 658 -6742 -17318 -16734 -4408 5057 761 -8171 -2154 2067 8886
16285 8886 18696 14653 1678 -10928 -9283 -13498 -11310 69 4907 6536 5731 -2589 -11036 -11024 -11227
16270 -11227 -4275 826 5272 11303 6775 310 2254 -12878 -22705 -12917 -6212 -5534 -7198 -6876 -4189
16255 -4189 -6137 -5270 -2831 -3205 -7912 -2268 373 -2941 206 744 -2017 -1192 11757 22528 19057
16240 19057 7376 3488 1077 -5978 -7639 -13584 -10161 -8552 -7974 -8695 -6628 -3891 -609 -5078 -12813
16225 -12813 -12201 -6151 -10076 -11108 -8273 -7140 -7146 -6309 -1810 -16062 -20755 -10832 -8805 -13017 -5350
16210 -5350 -12087 -7960 -11305 -16510 -12124 -9589 -6637 -16247 -12455 -5580 1616 10610 17059 18065 10869
16195 10869 285 685 -2732 -5274 10734 16368 7737 580 2479 4400 633 -9680 -11628 -11939
16181 -11939 -9130 -1577 -5370 -3253 489 -4569 465 12829 14247 5800 -5047 -4803 -8204 -12990
16167 -12990 -17349 -22068 -19357 -11858 -4888 -5741 -606 6648 4465 8466 6138 8282 10318 6743 7215
16152 7215 3241 -2220 -3689 9678 15046 9940 10840 11155 6124 -911 4716 -1039 3616 12265 6856
16137 6856 2888 2283 -3518 3512 5190 8853 11617 6933 6101 9585 1858 -15500 -23840 -19565 -18137
16122 -18137 -15615 -20035 -18924 -8282 -4074 -7741 -13156 -14972 -10262 -17196 -18990 -8908 -2104 -8768
16108 -8768 -11698 -15179 -515 2708 -2492 -3234 -1485 672 5620 -4529 -13941 -6106 1460 1887 -3726
16093 -3726 -18611 -22335 -18933 -17166 -17018 -13746 -2896 -3165 -8596 -2387 6338 6769 2119 10651 6372
16078 6372 16 -3244 -7708 -8771 763 3962 -7050 -228 6210 9424 3683 -2566 3852 2392
16064 2392 -4073 -8920 -4149 7149 1373 -3135 -3379 -5005 5965 9274 9021 12660 16993 13695 14684
16049 14684 19312 14753 5834 1991 3772 -30 -4722 -5021 797 3027 -5519 -6977 -11486 -11009 -410
16034 -410 -816 -2536 959 1420 2898 360 -419 4310 2660 2420 12818 12266 6777 319 1382 6526
16018 6526 5011 -6213 -5148 1690 -5490 -21001 -15378 -4070 5348 6478 -299 -2524 7544 8768
16004 8768 -1059 -6189 -9764 -5751 5284 5138 -1933 -5590 -4104 -466 1466 872 3114 86 -10948
15989 -10948 -7332 1515 -1220 -9818 -14796 -26089 -19626 -14458 -13404 -9821 -4669 2470 12835 8253
15975 8253 -2271 -4821 -1628 2731 -1591 -10011 -14534 -20170 -14948 -16210 -8249 3895 8838 5566
15961 5566 2782 3899 2318 6343 5937 4639 -864 -9466 -20165 -18236 -10796 -4552 -4184 -7921 -9273
15946 -9273 -16902 -17537 -16794 -7981 1411 -6393 -14596 -5425 3159 7733 11714 11573 3558 9115 12291
15931 12291 11165 7098 846 332 8423 9553 8811 15694 16170 4505 -2468 -6270 1578 2802 1041
15916 1041 242 -5578 -7864 -13691 -16072 3380 7258 6857 562 3957 6517 2800 6005 10180 1105
15901 1105 2571 2206 -6546 -13161 -12080 -1351 339 3231 526 5555 8585 16081 14549 9334 5219
15886 5219 -4878 -19703 -21541 -16639 -8442 168 1131 -472 -5894 -6735 612 -12605 -10702 1415
15872 1415 -341 -1456 -10352 -8369 -2662 -1349 -4352 4425 4304 -8547 -9097 -11263 -3874 -2007 612
15857 612 -6731 -11076 -7790 1665 9259 12092 10920 2300 -5500 -1639 8633 14391 4367 8029
15843 8029 9823 2021 1374 -1851 -3977 -2727 -2551 -1931 3731 -1615 -599 7052 -1260 -7321 -6821 -672
15827 -672 9148 1364 -15538 -7707 -287 1051 -8823 -8578 -13159 -8426 172 -4425 -7068 -9277 -4580
15812 -4580 -2480 -5254 -3897 -10364 -14099 -2630 3222 5008 -3537 -13939 -18727 -16393 -12577 -4487
15798 -4487 -3034 6996 8506 11796 14328 10816 11479 10665 14735 7802 2790 2625 -5095 -16344 -10503
15783 -10503 681 -74 -3543 -4636 -625 4601 12861 15837 5322 2965 8288 -1212 -16874 -22750
15769 -22750 -14755 -8187 1278 -38 459 -2397 -1179 2547 2950 -5901 -11454 -4614 13335 14512 18812
15754 18812 16598 2598 -5222 4740 8372 8847 6346 10491 18023 9816 1495 5774 5019 2082 10748
15739 10748 14627 9654 7909 10344 9989 6755 9368 11160 4814 -4482 -12216 -11672 -5622 -6067 -6027 -5770
15723 -5770 465 3884 8755 2268 -2542 -4491 -8651 -19710 -18434 -13136 -10551 -5531 -3176 -4804
15709 -4804 -5091 -7290 -2149 5159 -252 -4863 -3990 1745 -1494 -3505 -2185 -11724 -15039 -15310 -5850
15694 -5850 3126 8967 12180 11557 8553 -9452 -16225 -21284 -16880 -11196 -1445 -132 490 -9505 -13493
15679 -13493 -9151 -9541 -8336 -12986 -18584 -10784 -10579 -8112 -18742 -18315 -9993 -1729 -3659 -6490 -12080
15664 -12080 -7307 3011 10875 8148 2682 7947 9800 5793 617 -1117 -177 -3993 -4665 -8371 -10228
15649 -10228 -5758 -4453 -46 4817 3044 2957 -7803 -19768 -18408 -5476 1189 -5327 -8503 -3384
15635 -3384 1558 -228 -8703 -8093 -4275 -3242 -5775 3938 2830 3132 -6325 -13130 -10395 -1188 2317
15620 2317 8737 10736 6593 -6534 -14136 -14143 -12189 -13333 -2651 675 -170 15163 23429 12355 13480
15605 13480 12855 7144 1098 -3686 -8119 -5823 1606 8274 2310 1190 11019 8798 6286 5980 865
15590 865 -9069 -15808 -8995 -6785 -1919 4284 4127 4331 3470 1773 -7923 -7806 -9280 -15537 -19125 -8552
15574 -8552 6201 9360 4838 -7378 -7395 -7066 -9218 -8006 -3389 -374 -3717 -14692 -5073 3432 -941
15559 -941 1401 659 2005 940 -5518 719 4985 9001 14593 13896 6191 -914 -8496 -10366 -3834
15544 -3834 -11818 -3967 -552 -4877 -6284 -3047 654 -2245 -3808 -6098 -7115 -11408 -14831 -8620 -7753
15529 -7753 -8080 -21310 -25681 -25938 -21141 -18753 -2420 -3447 -8892 -7402 -7036 -48 5904 5674 -1858
15514 -1858 2495 3591 -3069 -10063 -15950 -21691 -16366 -1595 4850 11492 18692 12832 4360 4590 -241
15499 -241 -9064 -14735 -14472 -12949 -7094 -6559 -15178 -14137 -2811 -5496 -8752 -13894 -17355 -20625 -19873
15484 -19873 -23478 -26004 -23593 -13003 -15930 -14876 -6822 265 2660 -4601 -7190 -10531 -11668 -15821
15470 -15821 -10844 -10011 -8296 -14424 -4096 -178 2627 -2750 -2638 778 11564 23987 10300 1757
15456 1757 4565 1370 3252 -1093 -609 208 -771 -4398 -11610 -8547 -11877 -10723 -6377 -17320 -18827
15441 -18827 -3697 -2374 -2028 2059 4355 -6524 87 232 1447 -963 3509 3424 -2278 -141 1381
15426 1381 11395 14897 14243 8103 95 8548 10888 6393 -9167 -7161 2018 -9831 -8489 214
15412 214 -7359 -9620 -7810 753 -2868 -13448 -3875 229 -2964 -11942 -22949 -15894 -12483 -24686
15398 -24686 -31467 -34876 -26413 -13823 -3315 -4313 -3369 1371 -6191 2085 10541 14830 11052 -1829
15384 -1829 -5491 3035 -305 -8658 1583 22 -2229 -8766 -13801 -10676 -9310 -8642 -4699 -1473 6824
15369 6824 9459 9539 18098 15429 3841 -7178 5 7146 -590 3107 1846 647 -3586 4408 12884
15354 12884 14980 22232 23104 18798 13882 10360 7835 -3534 -5002 -1453 4620 7861 -905 -9099
15340 -9099 -7946 -3282 -14965 -10361 -7371 -846 3277 -11331 -11178 -3798 -2502 9229 9137 -2703
15326 -2703 -5454 -12207 -11290 -5076 4534 7378 6067 1086 -6086 -9345 -4465 -2232 -3091 -11931 -20502
15311 -20502 -22185 -15413 -3590 891 -2712 -4720 -12048 -11239 -8146 -5396 -2616 -1456 -5067 -3322
15297 -3322 -11629 -8396 714 931 3228 -1824 -2905 -8046 -12047 -6755 1447 93 -8075 -8928 -11519
15282 -11519 -12114 -12053 -3596 5874 9507 7166 -2539 -12775 -9418 -10404 -12911 -14583 -26183 -22211 -4456
15267 -4456 8154 -3859 -3968 -3488 -2710 -3219 -2340 -872 8626 6568 10994 12278 5157 2298 -4860
15252 -4860 -4694 -1608 -4670 -1609 2528 8415 15601 20271 13435 -89 -5416 -716 9686 8178
15238 8178 -875 -1291 14047 17798 22734 14572 7314 4910 4272 -7656 -7969 -1145 -430 6245 8279
15223 8279 5546 1953 245 -2258 -1113 1012 903 5944 -215 751 8388 8859 3399 -4507 -9433
15208 -9433 -12381 -13551 -6557 -3058 -9778 -16278 -12668 -12019 -13062 -3554 -3742 -5426 -10916 -17543 -20945
15193 -20945 -11552 -4806 939 910 1181 4682 8280 189 -2068 3465 -4061 -7898 -8237 -7437 -3275 -4286
15177 -4286 -3800 -9224 -11106 -10949 -13095 -16560 -12973 -9570 -4676 -2247 -4760 -1455 -10480 -22783 -14192
15162 -14192 -2696 1830 793 -1409 -693 -6761 -9903 -6676 -5035 -3213 4814 13134 7654 -1847
15148 -1847 -5796 4139 11693 8919 5180 5225 4969 835 3345 1772 8899 8202 11158 4545 -2064 -5612
15132 -5612 3981 -1439 -6457 517 2724 5018 685 -7203 -5589 -4896 -1577 7681 9732 14616 9904
15117 9904 8586 5422 -3428 -3724 1612 249 -3357 -505 -5327 -11636 -11923 -3471 1226 1007 12915
15102 12915 7476 -713 -1999 2501 6489 5520 1232 -6221 -8127 -2482 -1260 8357 9237 1728 -301
15087 -301 -11525 -12717 -7118 -4181 670 5837 6524 11277 13421 22143 23595 4140 -16959 -5330
15073 -5330 3049 168 -5718 -13572 -5892 674 3203 8825 17020 13542 3081 1522 75 11541
15059 11541 13576 4948 -1787 1551 -1945 1068 -4632 330 10894 10333 6830 1618 -3767 -11155
15045 -11155 -19933 -18692 -14920 -1209 -544 2808 -1251 -607 -3771 -10065 -3180 -1590 -810 -2675 -3957
15030 -3957 -2958 4945 13971 19110 15750 14263 12177 13711 21164 18515 8284 12710 11000 -2232
15016 -2232 -14033 -1403 17027 20863 13579 3121 -7145 -11755 -7901 4744 1536 6083 12952
15003 12952 7327 -1473 -9034 1020 10621 8490 14636 12700 3462 1284 7410 3039 1188 4609
14989 4609 -108 6112 9099 1498 -1537 -5010 -1739 6587 8748 11570 18938 14375 2851 4539
14975 4539 8856 7197 349 -1192 -4346 4965 13129 9840 3739 318 2723 7145 8458 -2592
14961 -2592 -8762 2322 6464 11865 14259 14127 16176 16895 12841 2204 -1602 -10186 -16630 -21953 -31248
14946 -31248 -28083 -24834 -21287 -22575 -24071 -18496 -13648 1726 6464 8862 -143 -14590 -12221 -5630
14932 -5630 5222 11866 4639 -10014 -6385 -913 -6852 -6837 -7436 -6136 -6227 -12762 -12473 -4873 -5165 -5407
14916 -5407 -8493 -3446 579 1604 10779 19114 10585 1753 -3026 -3724 -3110 4997 6245 11318 13933
14901 13933 9689 8517 3439 -3791 -4187 -4046 -8532 -14724 -19117 -15451 -1356 -1557 -7464 -1524 6416
14886 6416 15024 4075 -3620 -4029 2578 -2593 -12289 -13842 -14699 -13695 -8255 -7741 -6285 -7409 -15169
14871 -15169 -8246 2534 10334 19095 15773 14300 15455 554 -7819 -5646 -8398 -6417 1417 2161
14857 2161 2687 -863 -7576 -5933 -2169 1722 -3852 1682 -2637 -17030 -22218 -8963 8786 2489
14843 2489 -6041 -7090 -6526 -9491 -3915 2911 9511 6428 -1572 -10412 -11563 -6562 3561 7646 3347
14828 3347 1277 -816 7314 5702 -2065 -5066 2819 58 -4576 -10541 -13309 -12886 -11045 -11861 -16755
14813 -16755 -7702 3201 7011 14695 9473 4861 8108 5927 7964 11035 2287 -11730 -9652 -1845
14799 -1845 -6583 -12924 -4293 8462 6416 -6569 -11440 -16054 -20164 -7081 8260 4627 -2671 59
14785 59 -84 -7865 -8544 2415 10003 12018 3209 -8314 -12507 -9616 3072 9742 863 -2360 2392
14770 2392 11472 8732 2960 3222 573 -8386 -12254 -13136 -6586 -12579 -8189 -2566 -5048 -8262 -9491
14755 -9491 -12334 -12670 -6145 -8513 -5758 -951 -1676 -2666 1099 -3848 -11502 -18289 -13197 -12130 -8009
14740 -8009 -10 5427 2527 404 6211 6641 4855 5316 7383 4318 3493 54 -1300 3040 9042
14725 9042 11094 12035 7823 -1117 -7014 -8292 -11142 -10836 -5037 -4452 266 6527 7907 -1519 -4003
14710 -4003 -7857 -8918 8495 12679 10428 6393 2169 -7883 -14782 -13325 -11173 -1640 -3925 -12961
14696 -12961 -15657 -12560 -7977 -19940 -20664 -23095 -9993 -1284 -4706 -4588 -4130 -2841 446 1149 -2120
14681 -2120 -6634 -5858 -7044 -12560 -5617 8033 13295 9124 -1517 250 6117 11257 5349 4066
14667 4066 2173 1801 1254 -3019 -5016 -6224 -10201 -9571 -8885 -1630 -3823 -8300 -2196 -10151 -4527 2079
14651 2079 -3933 -2834 -558 -6290 -5843 -12190 -9637 2945 12635 11821 10612 13258 7001 1493 7801
14636 7801 10773 11255 7075 8087 1915 3505 623 -6624 -4227 -8944 -17850 -21353 -14747 -7429 -4993
14621 -4993 352 9174 12115 -1820 -6304 -5145 -9596 -14642 -11419 -11485 -8903 -13943 -10102 -3839 -8746
14606 -8746 -3206 -3433 -1900 2019 -7441 -5315 -8150 -2459 -529 -3238 2580 -1158 -9201 -7130 -1598
14591 -1598 -4999 -1697 -495 9470 5373 2790 9598 10571 14508 2715 -25 7518 5958 7292 6407
14576 6407 4234 11525 4468 -7059 -616 3691 3390 -2442 -5229 -5689 4329 4764 488 -8208 -22781
14561 -22781 -20654 -18430 -10966 -6649 -1275 -837 -892 4870 -1583 2668 2050 1293 415 9335 9845 2911
14545 2911 2269 3508 -263 -5650 2162 9763 10824 8882 984 -5905 -7936 -7540 -7813 -1277 -4245
14530 -4245 87 3959 449 -2586 -6647 -11125 -17102 -16655 -10356 -8546 -7816 1729 7755 15036 14159
14515 14159 11385 5217 -6019 1507 9513 5234 -3324 -7139 -10035 -2644 3659 -5832 -8072 -7148
14501 -7148 -13693 -22889 -11104 -120 -8640 -13372 -5219 -13881 -22722 -25489 -15390 -9736 -6163 495
14487 495 2458 -769 -3299 -3498 -246 -1353 1792 13335 6951 10557 12308 2266 -8962 -8045 -9517
14472 -9517 -15731 -5720 5521 8058 -3542 -59 -9240 -7587 4003 -679 -6753 -4564 -5979 -6284
14458 -6284 658 13675 17070 8051 -967 -1546 2351 8261 18683 21466 11767 -8166 -11220 -7400
14444 -7400 -6430 7572 9515 17150 17830 17573 12188 9636 9924 10912 12687 10348 13163 9035 -8131
14429 -8131 -19253 -14210 -21175 -21827 -5281 2630 2250 -5847 -7757 1962 -8027 -14754 -8688 -4595 720
14414 720 14 -7295 -10350 -9205 -3785 -6718 -2851 2149 -5102 -4174 -5151 -12064 -4762 2100 953 -12541
14398 -12541 -17074 -7928 2587 -3135 -2350 940 10202 644 -3672 7446 9635 9462 3683 2643
14384 2643 4484 8821 7179 11056 12125 3886 -7943 -21186 -20418 -16490 -14966 -6494 1482 -6599
14370 -6599 -10223 -2292 697 4839 2460 5353 6061 670 3277 3930 12187 10383 3764 4951 -1701
14355 -1701 -17780 -28872 -13208 9229 19176 11567 3289 7231 2422 6318 2091 -1536 -7994 -12552
14341 -12552 -7701 -3782 3584 5452 4464 7243 1131 10531 8587 11873 8030 3758 3230 -4307 1650
14326 1650 3240 7662 10091 5029 2149 411 4829 9092 5694 4024 -5850 -9770 -8020 -6598 -4331
14311 -4331 -4818 -7394 -7839 -5966 -2340 10422 10245 8755 15002 8233 174 -6976 -6802 1023 8288
14296 8288 3476 6775 5672 -948 -8916 -8858 -1692 -736 1421 8427 8651 11045 16965 14303 13819 9579
14280 9579 6301 2693 2983 8461 1657 -1481 -623 -594 -146 -835 6731 21231 23483 14088 10073 10537
14264 10537 3256 1378 7187 6407 732 -5928 380 6581 3277 -455 -3465 -432 -4898 -1852 3931
14249 3931 13287 14475 5143 1366 -3262 -2287 2919 1103 2894 3187 1920 -502 -4695 -9196 -12107
14234 -12107 -5004 -539 1265 -294 6095 5503 -1383 -6291 -14648 -10139 586 8946 5126 7151
14220 7151 -759 -14095 -10214 -5664 -9609 -10249 -11231 -7674 -7460 -4728 -444 -6879 -6144 -4825 -481
14205 -481 2502 3525 -7221 -708 18104 22836 11482 3848 5493 21122 26173 20523 8342 -6585
14191 -6585 -4756 8815 9481 10831 7127 1650 -5255 -18762 -21812 -2395 2891 10080 13832 26347
14177 26347 20203 13962 796 -2245 -13537 -18522 -11135 3768 3098 -8344 -4793 3907 2280 4995
14163 4995 4456 -2259 -9993 -14570 -10888 -7575 -5284 1123 11518 8894 9063 -4345 -7591 -5485 -17025
14148 -17025 -23297 -13312 -9870 -14502 -20769 -17826 -8983 -3496 1388 9306 14009 2199 -1469 -6658
14134 -6658 -15276 -7248 -3668 -4132 -4327 -5676 -13559 -7634 1938 8390 1327 -1899 -236 -11143 -12652
14119 -12652 -9084 -302 349 -7399 -6144 -188 -1262 3932 7541 1991 1348 4981 3874 -682 -3560
14104 -3560 -5948 -613 337 2601 -3310 -6239 -5899 -13534 -13418 2050 2723 1444 -5442 -9129 -8795 4252
14088 4252 10068 11878 14068 15174 11741 6166 6037 2161 -2579 2526 12036 5202 -11696 -8802 -2128
14073 -2128 -1126 4004 -2728 -1388 3745 5243 7763 17114 18020 13737 6340 -3187 -2756 -10404 -15934
14058 -15934 -8370 -1437 2966 7685 1881 -4511 -4695 -7172 -41 9591 4688 2998 8389 2332 -8678
14043 -8678 -10708 -3628 -2588 674 4175 3594 11964 17495 12480 10105 7819 9275 -5113 -12248 -10175
14028 -10175 1823 1541 512 3436 8305 -161 -10041 -460 308 2741 14338 16233 3730 -6851
14014 -6851 -5702 5375 6917 -8748 -11697 -12993 -10516 -930 2040 -1632 -3045 -4276 -5540 -1492
14000 -1492 4170 6808 9469 10461 13379 7782 4179 1997 4919 5108 8393 13820 4536 7207 11087
13985 11087 -1651 -4636 -3235 6288 8336 -2156 -10322 -10303 -9390 -3795 -3672 -1684 -1300 842 -1477
13970 -1477 -5890 -4648 113 2911 -1113 -5751 1275 563 568 3107 4218 -1999 -13737 -10195 -5168
13955 -5168 1580 6948 2623 1698 634 -1082 -8443 -4537 -1378 -4706 -12786 -8236 -9242 159 16733
13940 16733 28761 26107 16572 10686 7279 3723 2887 3050 4152 5997 5489 7180 8533 553 -8164
13925 -8164 -4623 -2153 1432 999 -1393 -6365 -13520 -10996 -2965 610 3697 -7605 -3059 13162
13911 13162 6861 -5049 6933 9955 8851 1551 1454 -2252 3723 9689 2547 3427 8548 9697 12814
13896 12814 9973 8851 7338 6257 -4079 -1916 1869 -1835 -5281 -6232 -172 10025 8532 -2014
13882 -2014 -12371 -12458 -4757 -4367 -4035 -3610 -5119 -1038 2730 5089 1250 -9401 -4330 -2377 2911
13867 2911 3600 3586 1059 -5602 -11409 -10530 -389 261 -1834 1525 7462 6328 5661 9050 9294 12960
13851 12960 6920 6765 21845 23240 13168 14175 8504 8604 10517 17677 30467 39488 35971 30193
13837 30193 30334 22165 14014 6275 728 4862 11859 14244 27024 30316 22751 14155 13199 15379 10856
13822 10856 -3979 -12574 -1630 2068 1518 3731 3154 2366 6991 2968 -4318 -12532 -13146 -10878 -624
13807 -624 10556 20880 32324 33087 28217 13001 -4 -2569 -531 -67 4647 2002 7266 15305
13793 15305 10070 7807 5887 -6431 -9881 -9161 -3330 1919 3382 -3709 -11428 -7825 -7233 1091 597
13778 597 1394 12672 10065 3205 -6295 -8339 -1526 -706 5024 -5357 -8202 -10639 -1189 -5657 -9792
13763 -9792 -6051 -4399 -8242 -9608 -2389 3020 424 -5464 -4156 -6888 -11228 -16694 -18871 -11110 -267
13748 -267 -1773 1029 7736 13335 19555 15984 9096 1088 -40 -4674 -5319 -1492 7297 8893 11538
13733 11538 9732 5196 549 5812 10981 5402 -1558 1695 3359 2952 -6976 3241 7273 6217
13719 6217 -1484 -3560 -4707 -7284 -6251 -9342 -4575 2666 1934 -4438 -6480 -5215 -5087 -10438 -9124
13704 -9124 29 -10837 -11406 -7064 -5868 -6304 -7530 1767 5465 2610 3302 12310 2592 -7603 3539
13689 3539 10791 8786 11208 19485 18395 3863 -6383 -14353 -9261 -5666 3960 5885 1440 1544
13675 1544 3808 5628 -3240 -10721 -5345 -7702 -645 859 9584 603 -1397 2269 -4734 896 12548
13660 12548 15462 14030 17256 6339 6005 6844 8562 8730 10481 12459 13658 2223 -1607 3624 14019
13645 14019 14788 3941 -2674 -2729 -393 13920 16250 16312 19323 18685 20373 19039 888 1465 -2388
13630 -2388 -2400 -2487 -7538 -17483 -22211 -18065 -11361 -8574 10310 17787 9220 5929 4264 1199 -612
13615 -612 64 1230 -5336 -11132 -6219 102 1642 6331 1875 5732 -2984 -17269 -14132 -12149 -3132
13600 -3132 -7065 -13290 -5536 -4108 -506 -3456 -7737 1447 6465 4769 2838 856 -2600 -3526 6934
13585 6934 7815 1759 985 5903 6100 5368 326 9555 18631 6784 534 8344 17654 19472 17093
13570 17093 9025 -5985 -4645 -3101 -224 11367 10426 -1013 -4637 -16647 -16385 -4174 5970
13557 5970 7330 -451 -1266 2193 -6141 -10773 -1862 701 -6404 -5076 -3230 6706 10917 10609 6553
13542 6553 -2934 -7078 -10452 -1540 0 830 6388 4687 1824 6628 9374 7270 10273 6406 4469
13527 4469 1292 -268 10869 12845 965 -1495 -6297 845 12958 21189 21982 20647 9005 3053
13513 3053 3558 9972 11233 1906 -13411 -19347 -13551 -6128 11039 9001 2914 -1718 -3919 7694
13499 7694 9999 -1035 2327 4415 3263 11822 9917 20652 29254 23911 19657 18175 17132 11596
13485 11596 11455 19964 27234 31019 47087 61592 83573 107101 112825 117074 109100 101785 96703 79434
13471 79434 61342 51796 43690 25778 8091 1946 5347 6796 1453 2534 6176 12344 19700 22185
13457 22185 22664 20446 17807 20953 19290 15676 6185 4275 15987 27228 32552 38740 41453 48514
13443 48514 63833 86376 99964 117249 152736 186175 217854 243962 241629 207852 162171 125040
13431 125040 107503 95743 81660 61438 45453 41179 42028 32113 28240 22683 12721 8430 9818
13418 9818 12973 17003 21594 22997 16749 8710 3333 9303 6622 768 4906 14274 13543 12738 15722
13403 15722 19659 26284 30175 41434 61506 84455 103379 108520 109330 107801 101131 91091 70493
13390 70493 49743 42430 36603 24965 25169 33001 29123 22173 16286 14832 2931 2840 -1301 -4145
13376 -4145 1457 7328 9899 9156 2168 -5977 -6683 -1138 2723 -1142 3305 4575 3323 6123 6715
13361 6715 8254 12548 5196 6108 4554 11804 18467 10692 7003 -1262 -9471 -2377 7220 9374 8312
13346 8312 5176 -6513 -3880 7416 15262 16128 10204 6376 9355 10663 7207 8879 13294 19989
13332 19989 21207 7063 3163 -2794 -934 -12720 -4668 -1444 -3708 -10155 -4591 -3440 -7377 -10748
13318 -10748 805 11755 -177 -3533 -2457 4414 9935 16105 19958 9856 3770 16415 21129
13305 21129 23495 26499 20166 10380 7275 6006 -1984 -364 7078 13243 7323 10692 16776 17986
13291 17986 15925 20996 23978 25890 28805 15229 14081 15614 18333 24809 30828 29270 20177 19645
13277 19645 20317 14212 23028 31509 32562 33677 46687 57628 46742 32932 35389 36853 25472
13264 25472 18917 18677 13975 13077 16660 8035 7919 6184 7152 11828 6708 15166 24983 30591 24033
13249 24033 18247 22365 21518 15535 15205 12943 19732 35126 51926 60805 61638 60790 59648 51676 49360
13234 49360 51508 59450 68754 81969 90180 90587 98072 96690 80446 56018 37778 32564 30786 29456
13220 29456 27119 24895 34180 37177 26552 28804 33015 32618 31170 30532 20046 16688 25097 29702
13206 29702 23179 19322 28270 30553 43527 49422 59511 77493 66140 58643 76888 86222 101531
13193 101531 111990 112612 115652 100686 82763 74064 65299 66883 58255 45856 37783 35464 33462
13180 33462 29452 25086 25270 22225 19155 18263 22481 22594 32480 45640 44514 39021 37251 48291 48371
13165 48371 45682 44930 39971 47615 50731 50487 51786 49742 51718 57657 83710 102459 101185 120868
13151 120868 155461 207022 260703 288919 271500 232755 192341 161501 127498 102357 85435
13140 85435 82077 76298 66095 67406 65878 61963 58500 52769 44758 48024 52883 57239 54680 53813
13126 53813 62339 57651 58571 60754 60307 68035 76103 86178 84969 83055 88434 100260 118713 127628
13112 127628 142610 151578 148173 138540 132864 138127 160668 196541 245626 290097 316211 290113
13100 290113 238013 191728 154431 140768 135094 119620 110787 101346 97682 93841 91659 91540 99534
13087 99534 98537 93760 95688 101325 103664 102570 105410 113544 115413 111859 115649 125523 123692 138211
13073 138211 150308 165041 184116 178972 172616 173818 168889 174662 175510 182303 194495 208932 231564
13060 231564 253932 276344 311419 337383 344203 344061 330132 334251 354579 369217 385897 408688
13048 408688 428829 466249 517127 566834 633469 718613 811671 930016 1068163 1225251 1402126
13037 1402126 1633024 1930388 2315381 2835939 3538575 4521445 5936869 8003154 10947122
13028 10947122 14778518 19003921 22489035 23968561 22954548 20041158 16372720 12883157
13020 12883157 10040256 7879556 6296958 5142207 4293327 3660680 3190910 2841120 2575376
13011 2575376 2372236 2204224 2068613 1970587 1895441 1855968 1859520 1894723 1952247 2055123 2217238
13000 2217238 2442409 2708613 3014403 3378909 3838605 4448253 5280323 6421848 8004945
12991 8004945 10254211 13562477 18489052 25476575 34292726 43327750 49679941 50787095
12983 50787095 46412554 38696086 30363395 23152977 17614060 13574965 10680126 8613881
12975 8613881 7108267 5992583 5131122 4461340 3934243 3502330 3143368 2835635 2583916
12966 2583916 2383363 2229025 2113297 2041139 2000941 1992629 2033297 2100056 2196979 2333008 2508970
12955 2508970 2754338 3101608 3580947 4268864 5228142 6594260 8599162 11472494 15278358
12946 15278358 19612762 23395967 25284430 24536501 21556350 17566525 13687664 10489198
12938 10489198 8058486 6286464 5006114 4070362 3377290 2857552 2443722 2111929 1836467
12929 1836467 1605577 1397720 1234579 1093639 974149 883003 803444 725785 669765 619880
12919 619880 569249 524075 488975 453995 423909 400703 380565 357842 340870 330576 309894
12908 309894 305042 291701 277749 262448 256404 252193 243191 238047 227715 215798 211752 195188 184695
12895 184695 186210 179635 174537 172466 170782 163217 149247 146555 132861 121062 122920 126291 131308
12882 131308 133172 127647 123503 118491 107553 112783 114730 107672 101947 103487 100569 97750 100794 103628
12868 103628 106525 117359 118179 117003 115761 114626 113538 112645 107620 96680 86313 79116 84202 83320
12854 83320 74645 70931 65614 60123 54783 55272 49503 43352 42018 44986 49831 49632 48191 50981 41150
12839 41150 30400 33534 32814 41449 42467 40626 43632 46300 51843 58405 62163 74562 82359 66469
12825 66469 54941 63042 62166 62225 59562 61644 59901 57595 52765 50714 47822 37422 25190 27099
12811 27099 31693 34102 32888 29585 38656 32551 40904 46935 43069 40062 38367 34517 33333 32517 34796
12796 34796 35749 35783 37982 50643 66304 86899 103916 100536 81470 64282 58240 54303 55009 57204
12782 57204 57931 50713 42906 38965 32505 34961 31947 32003 23241 19323 24759 30855 26841 21052 12868
12767 12868 13610 18569 27955 30076 36039 35138 30850 27384 46680 56654 52684 39816 30400 28113
12753 28113 30997 26244 22344 3550 4801 10554 13013 14282 16599 15560 24486 31670 35494 27792
12739 27792 19734 14140 12496 11961 10981 13781 19270 20197 30524 38277 28109 16984 14507 21921
12725 21921 30124 37121 33554 28109 32608 38638 31509 20818 13407 8721 11525 26968 29831 33478
12711 33478 38466 41800 27259 11416 12489 16162 22747 18776 15428 12417 7654 12676 6796 2520
12697 2520 7238 11050 5103 6603 7771 10155 9670 13955 15846 13954 13066 22270 27999 25479 19785
12682 19785 15668 11733 15409 26466 30934 24971 19732 15478 9060 7565 11437 18487 8139 -977
12668 -977 6729 7695 8593 15659 14013 11230 6958 9827 13110 10800 12060 8618 14272 15931 22250
12653 22250 20434 11127 12081 18555 8439 8593 11801 5794 4722 4254 5208 12762 11051 3168 -2503
12638 -2503 2179 -759 -2822 581 1203 6773 11012 7748 10464 3721 2498 6108 16113 15082 19295
12623 19295 13575 11374 9922 6639 -5310 890 3808 9856 22189 20170 9298 11100 6281 4731
12609 4731 5805 3305 1138 -6337 -11169 2186 1256 -10613 -6949 1945 -2524 -4890 -7112 -3985
12595 -3985 -8251 -14419 -3478 22989 25746 23106 25810 21175 15085 10697 3547 1664 -391 -3228
12581 -3228 -1967 16 6696 9411 4036 2759 16475 34873 30703 35567 41987 56221 67757 84329
12567 84329 103589 113182 111212 106339 98631 81010 62359 49800 30984 15192 16440 22703 24835
12554 24835 25457 19013 17038 11790 7203 8050 6244 10466 16507 18447 23836 22426 29813 24625 12513
12539 12513 5293 10495 18850 17227 23539 31714 41442 57582 79646 105863 129686 157499 192894
12526 192894 227967 246919 234303 206831 173829 129116 91173 72748 57215 50370 40666 36555
12514 36555 32249 33922 31826 28683 17104 7225 7702 12458 11790 20450 20136 8497 6194 -4062
12500 -4062 -2647 194 5709 5422 4635 2877 2275 10156 15769 27520 32014 38557 55704 86443 102040
12485 102040 115917 123681 118158 102596 81700 64685 58530 38647 22907 12527 11274 12715
12473 12715 14372 4690 -3260 -8627 -12334 -9429 -2619 -4716 -3110 12574 14149 5489 3804 2906
12459 2906 5500 6695 3316 2648 6196 2710 -4105 -10274 -3820 488 6171 6828 9199 6025 -6101
12444 -6101 -7865 -4124 -11148 -12692 -7171 2026 5886 2745 -49 -4985 7443 17111 15889 4017
12430 4017 9271 20807 11711 9108 5540 9275 4953 4906 1227 -8734 -11997 -7419 -7238 -2355 -235
12415 -235 7456 8181 9936 5199 333 -457 -6160 -6187 -6714 -4790 -4250 8940 13241 10749 8636 -1152
12399 -1152 -8088 -2141 3709 -5331 -509 7092 3916 252 9232 13473 18822 12644 4548 -3071 -9634
12384 -9634 -4027 -4324 473 -1009 -5741 -4865 -636 -2243 -7723 -14313 -10495 -3297 -1526 -753 465
12369 465 -7229 -1094 1578 -7263 -4847 -9340 -14351 -13461 -5729 317 -3256 -10356 -3727 -13648 -23530
12354 -23530 -24232 -17220 -9332 -4352 1642 -1780 -1091 -10000 -11014 -9589 -4089 6842 5378 1071 -1271
12339 -1271 -2745 -2754 -7457 -6167 -427 4986 7138 5185 4821 8807 -1282 -9670 -6413 2896 -2241
12324 -2241 -3805 -1772 3104 -8275 -16432 -8331 -12217 -13176 -8310 -1606 6 -3611 1958 10324 17450
12309 17450 15662 14025 16926 13937 2773 2138 5831 -2474 -8240 -5201 -1371 -3538 -3497 1315 -4290
12294 -4290 -4846 -1418 816 -8081 -6426 -5814 -1671 7902 14729 12717 4965 -1063 -7681 3244 6531
12279 6531 8510 -2467 -9693 -62 3536 -583 1408 9040 16547 16891 4483 1950 8065 2141
12265 2141 -172 5637 6661 10002 6651 -491 -5884 -3563 308 5785 2542 -959 2153 369 -4299
12250 -4299 -5883 -1126 3833 1860 -1007 2455 134 -759 61 3687 3195 -743 -8096 -17793 -19928
12235 -19928 -14017 -3760 -3060 -4689 -14575 -19540 -15021 -12672 -2615 -4192 -3073 -7948 -7415 -75
12221 -75 -1227 -7069 -12718 -9531 -888 -174 3683 1732 460 11041 977 -10284 -11564 -6201 -11452
12206 -11452 -14854 -9714 -9431 -10252 -4963 8214 7585 2742 614 532 949 976 -356 -2647 12 4352
12190 4352 6744 10244 3382 -3770 -16440 -20269 -15307 -546 2687 -6233 -15000 -7403 -9248 -4351
12176 -4351 -3170 -2202 3308 6154 4217 1632 1079 13220 17472 18204 6247 3810 918 1505 8398
12161 8398 9994 9449 5155 -273 -2340 -1919 -2108 -8695 -5984 3675 12309 9847 11323 1672 -8142
12146 -8142 -6454 -1403 -5891 -9361 -7961 -9952 -7445 -6916 -7294 -6502 -6217 -7733 -6323 3998 613
12131 613 -5849 -730 2843 -1908 2758 8101 3488 1101 -3334 -5274 -4359 6325 10614 11846 16368
12116 16368 14798 9202 7590 9745 5755 -800 6076 5665 4116 4837 5268 1067 -2206 -8230 -5632
12101 -5632 -5752 -4543 432 4458 6532 16985 10641 938 6042 11870 969 -12036 -17400 -6775
12087 -6775 2233 -1574 1923 -434 -5331 -7382 -9256 -3423 -6563 -3740 -34 143 7273 15530 13997
12072 13997 8688 9801 3577 11681 10598 6999 8297 5918 3309 -48 -2167 -576 21 4413 4819
12057 4819 7470 5462 -2453 -2536 -1932 3891 13910 6916 1414 -4149 5768 16096 17553 8723 2805
12042 2805 5571 12053 15815 6267 -10567 -11890 -8178 2616 10413 14223 15934 13105 6139 12593
12028 12593 14528 10429 10549 14308 14630 18510 12588 4636 -4659 2574 16287 12612 -3668 -11949
12014 -11949 -12071 -3320 5207 8176 3507 147 -2129 -2354 -6936 -6965 -2987 3998 2877 4194 -3479
11999 -3479 -6797 -5338 -5090 -1666 4603 9946 9698 4638 -3029 -7385 -5307 -3361 -4195 -3903 -2905 -5014
11983 -5014 80 8319 10013 5690 -3942 -6493 3929 7515 3603 845 -2884 -12217 -14084 -15186
11969 -15186 -13633 -11276 -17390 -18708 -16630 -17110 -17361 -15718 -13247 2320 8526 1363 -8185 -7068 3908
11954 3908 4868 -2921 -7694 -11512 -6213 -1686 3981 1229 5546 6162 9968 8674 7059 -1797 -7624
11939 -7624 -490 11458 15802 11904 9749 4919 6112 3715 -127 -12283 -14169 -18152 -19282 -11817
11925 -11817 -1736 1685 -7467 -1734 34 941 4352 8000 3554 1884 5538 7732 6726 2097
11911 2097 3350 3226 15131 12807 7912 12772 23439 17648 5349 -6072 -6312 -3005 -10642 -18619
11897 -18619 -19505 -18106 -16809 -12254 -8078 -5676 -9507 -3567 1925 1638 -1614 -4026 -9364 -8731 -6079
11882 -6079 -6078 -6258 336 8704 1598 1707 7365 959 29 607 -8557 -18527 -19962 -12692 -11888 -8789 -770
11865 -770 4099 2511 7546 9549 7536 4760 -552 6387 5836 13112 9635 3187 3720 5373 -4098
11850 -4098 -11111 -9627 -6788 4926 16507 12172 3326 426 -1470 -778 -5595 -8875 -21485 -33242
11836 -33242 -18973 -8133 -1319 1778 4603 6873 -2215 -6442 -7786 -4019 -5449 3711 1232 -1062
11822 -1062 7927 14156 13214 6826 639 -5100 -13801 -8814 -13866 -7501 -7130 -16040 -18457 -18850 -14144
11807 -14144 -10179 214 -5145 -13401 -19889 -15747 -6100 9410 19434 17196 -4389 -11964 -7751
11794 -7751 -11921 -12941 -14995 -11256 -4402 -14276 -14128 -8135 -5317 -4096 -634 6903 -916 355 1638
11779 1638 2835 6192 2598 9266 16895 28156 40211 39756 27607 24846 20276 11604 11211 6874
11765 6874 6255 6012 -1783 -12640 -16148 -17866 -21476 -17037 -1153 5490 2698 -1585 -8764 -6852 -4250
11750 -4250 947 13844 12382 4011 1764 1936 495 -6422 -7521 -6044 -2392 8252 3523 -1046
11736 -1046 -5199 -7117 -4469 -7900 -2182 6690 2621 2448 4368 5348 3539 993 -1336 6597 15075
11721 15075 18062 6162 6945 11456 6665 13653 16026 7531 1026 -2139 1228 2470 10343 3690
11707 3690 1718 8631 608 -6771 -9818 -1862 4776 -3530 -15203 -11691 -8115 -4542 -8029 418
11693 418 4484 3268 -6360 -5065 -7112 -10078 -2570 3499 -1943 -6076 -7998 -5110 5404 5870 -8031
11678 -8031 -11631 894 -3188 -13626 -14382 -12123 -10143 -18015 -17073 -11796 -11319 -8471 -9455 -3759 243
11663 243 3773 4177 -285 3163 1205 -4995 -3235 -327 4304 4183 8442 8325 3717 9792 11927 8525
11647 8525 995 -3059 3236 15068 15586 5987 5263 3630 5519 1488 5539 6643 1482 -1766 8974
11632 8974 292 -9122 -21004 -21691 -15868 -2176 641 -1536 -3192 1989 2501 14466 19729 25674
11618 25674 21628 18541 17017 12611 14384 -142 -4502 4471 6931 13758 20440 21262 26220 20767
11604 20767 14479 15298 12576 12144 4181 10315 15067 9225 2012 -1081 -8900 -828 6503 5262 8509
11589 8509 8851 6206 7234 -1659 -4019 -10418 -8470 -4233 -5267 -2571 -2857 -8 5491 15260 21751
11574 21751 19828 6523 2223 1081 -4364 -6170 -7916 -7617 -4597 -4726 -4891 -2389 -2108 -2720 119
11559 119 -7281 -5827 -2412 -3963 -4691 -8654 -7752 4749 85 2283 1022 -7207 -10740 -10119 -6015
11544 -6015 2217 1519 2402 8380 3660 414 -4591 1321 1395 -1850 -315 2434 -2136 -3438 -4111 -265
11528 -265 3084 1072 2612 -295 -6075 -11921 -3194 11266 7363 16572 18708 9211 9479 14360 13452
11513 13452 13844 10291 1852 -2407 7978 6110 -2363 -4194 -5916 -5309 -10034 -10706 1680 5574 7087
11498 7087 6879 5453 1610 1657 3965 3203 7754 6398 785 -7441 -7129 -1068 12947 22251 8925
11483 8925 8008 6270 -1389 1683 10060 15193 8391 -295 -5433 3910 6592 1805 7725 2994 705
11468 705 9906 3442 -1886 2538 3236 -7286 -11297 -9289 -6010 -4925 -1928 -6108 -10548 -11168 -9021
11453 -9021 -3414 -1199 -7377 -9597 -2855 -2801 -8978 -5880 -1485 625 2958 7406 383 -5271 -9978
11438 -9978 -2482 -438 2775 2390 -3395 -975 5096 3132 -966 -4860 -9575 -12216 2462 5969 9387
11423 9387 9875 9623 5331 8784 10340 9109 12452 3817 2819 -1269 -2781 -409 7891 13239 13471 5426
11407 5426 5739 5427 3840 2008 4389 5768 7105 4089 -556 8953 9023 6224 10557 10232 11582 11077
11391 11077 8366 7112 2484 3431 3089 2438 -7533 1644 11926 13379 8323 5676 1277 -15238 -14788
11376 -14788 -3397 9366 8202 -3862 -6381 10059 14178 10550 9254 9221 16258 19331 20015 13333
11362 13333 6650 11539 11501 5447 3050 3282 10558 8730 3319 2134 5001 7839 7700 4123 7743
11347 7743 9683 16179 15120 7856 7642 7052 10624 10121 7526 5456 10396 22621 20296 14771 5795
11332 5795 9633 8346 2049 1063 4939 -4233 -7376 -6877 -3670 -590 1123 1514 2888 4198 14937
11317 14937 11527 9122 8149 7779 10906 11271 11392 14766 26759 34669 43236 41178 40763 38361 37969 47560
11301 47560 56728 56526 66832 83160 93999 106121 129396 161817 203617 260161 347355 498212
11289 498212 754055 1178528 1763062 2267893 2489627 2562783 2496617 2111120 1553653 1089280
11279 1089280 759966 547058 411149 330394 271634 224113 183717 163179 142758 119411 94454
11268 94454 91007 78006 67780 56074 53185 44215 45539 38332 23918 12162 7241 11628 20201
11255 20201 23642 21915 16745 14911 21926 30070 23033 14425 15319 16448 17136 20641 18273 18186 16421
11240 16421 19840 19484 11473 5194 -1823 1556 5573 16981 21955 9261 4982 10100 16719 22798
11226 22798 14981 11405 18526 26251 23623 16087 17462 17232 10311 17037 26508 26672 28230 39627 44415
11211 44415 34057 42383 48205 42914 43739 58282 61018 54532 55432 55658 59272 74560 76427 79994
11197 79994 71363 66664 75982 74542 68653 59560 63967 64980 67850 68870 66396 80474 92121 88183
11183 88183 88768 95394 106098 125437 141072 172077 215064 271144 354630 499045 756707 1176200
11171 1176200 1717277 2075033 2099661 2079035 2207822 2224431 1873381 1366626 957523 675404
11161 675404 498297 375390 292954 237993 195089 166059 140980 118843 103070 86073 69262
11150 69262 58860 67359 73902 72834 67720 50647 34746 25102 32571 45170 51184 53000 41845
11137 41845 32859 27063 22227 9354 2705 10001 15579 17615 18467 19423 13432 16632 22238 17691 13014
11122 13014 10076 9757 7528 19085 16959 12300 10536 2716 2879 9938 12184 12995 9855 3593 7407
11107 7407 21099 15142 6912 12252 15069 8812 -594 856 8147 12422 16318 13942 9172 8400 9464
11092 9464 9440 228 -5612 -1022 7642 2 477 6142 3424 -2878 2163 7566 3216 -5352 -3148
11077 -3148 -8490 -9657 -10936 -6934 429 8746 11549 20131 11805 -2484 -11142 -2852 2735 128
11063 128 -8777 -439 6788 5501 1174 -796 4817 3746 5743 7819 9662 6178 -4091 -2214 12799
11048 12799 16061 16171 15100 14795 6708 8476 8001 4017 -54 -5792 -332 5428 6736 8945 2386
11033 2386 -448 -3437 -1652 -378 -7359 -9299 -14499 -15292 -24557 -28569 -15132 -5180 -5126 -5615 -4411
11018 -4411 -2871 -3433 -5411 -4457 -5477 -12627 -7634 -430 -9159 -16383 -6561 1095 6590 -747 -2089
11003 -2089 8891 6542 7109 8082 9547 -1992 -6246 7555 7790 8901 18626 17838 20839 12333 5635
10988 5635 8058 3660 3198 1820 1267 7931 8815 11305 8334 9221 3985 1305 9105 14283 16523 12015
10972 12015 6402 15161 19294 15330 16766 19857 22364 20468 13465 5991 14070 13278 12785 17228 23269
10957 23269 20809 7006 4059 11462 19581 14580 17706 18219 20297 22770 15633 12532 16133 16866 17212
10942 17212 15817 19529 17280 16943 12681 13568 20478 30650 25775 25079 28083 33143 32442 30923 32840
10927 32840 38329 55302 73962 92935 103744 109452 114276 112412 105296 94369 85587 67296 45622
10914 45622 38753 29224 21119 27016 34271 30146 32221 37077 39366 29438 21454 18423 16600 8877
10900 8877 12419 9353 2893 6552 17272 20755 21183 21955 29785 32723 38179 38400 32001 36263 44832
10885 44832 45595 57310 69718 84646 102594 131159 160243 193886 218438 218477 203533 187049 170504
10872 170504 146568 122758 102125 84742 64855 52846 36242 41919 53739 56114 45341 48864
10860 48864 46493 41137 37491 36664 36150 33430 27934 27504 32556 25296 25854 32070 35950 39178 34993
10845 34993 40061 48236 50099 40922 29829 25820 32473 51145 64910 75565 92369 104694 118576
10832 118576 133008 138022 130436 115516 99857 79965 68322 59028 64304 60143 41952 43740 37951
10819 37951 32046 25901 21325 21598 19378 29680 39819 34114 26898 22049 28360 30220 26156 18666
10805 18666 22859 22272 18566 12986 6610 10165 18316 21585 21661 15545 3926 -2962 1113 2694 4113
10790 4113 5474 9663 7460 14310 16089 16606 16883 24245 32582 30351 21937 14006 12578 18172 19872
10775 19872 24032 25501 35457 46724 47796 42947 34087 38487 39199 37824 34662 26009 15732 17901
10761 17901 20176 28812 27324 21550 19258 13384 12734 11425 6775 5630 6722 1336 -5044 -8233 256
10746 256 10448 20351 20717 22111 23362 34671 36304 34645 31908 24826 29608 29733 27733 19487 15511
10731 15511 21769 36147 45218 52571 54751 59602 64344 63570 57260 49198 44007 48255 44460 53474
10717 53474 59396 67953 63294 51592 49301 44665 37758 37879 31827 25927 24092 21757 24998 25411 28424
10702 28424 23722 17677 22927 30399 25862 21294 17374 16948 22085 27614 23704 24213 17147 9304 22411
10687 22411 29235 32219 29013 29099 30315 30441 21579 19062 19230 30192 36711 43711 61763 63991 58439
10672 58439 67082 73231 65603 54621 42161 36412 33337 35213 41232 34997 39147 37088 23888 26353
10658 26353 38872 39909 33528 31895 41983 51789 49604 43122 39266 40782 33782 34069 46895 51507
10644 51507 49366 49661 57491 59840 53522 69321 73085 72027 75347 68352 68561 68877 71967 67019 67089
10629 67089 83811 78836 70676 81074 76119 64443 52169 51815 56036 55643 61420 64639 55784 56215
10615 56215 64938 63860 60370 62793 63644 66222 68673 79775 91470 102044 116240 126398 130318
10602 130318 127171 116233 110106 109696 112077 126958 140810 154649 177040 195395 214130 231303
10590 231303 267096 315205 375737 473566 620016 794189 1001559 1211933 1382466 1476786
10580 1476786 1490084 1397796 1236129 1041865 852290 684927 550630 465025 398715 342941
10570 342941 300691 263876 244555 236092 231871 227077 216529 205364 189222 190126 189389 195492 196753
10557 196753 186514 179700 179427 195893 198348 210690 211325 199104 208912 215734 219270 223742 230526 232158
10543 232158 227285 230212 238746 251776 270510 285789 300696 316044 329758 348709 370049 396620
10531 396620 423073 461814 515738 580432 641807 724343 833044 952542 1092408 1237460 1391335
10520 1391335 1571501 1801725 2098317 2488005 3037849 3831588 4976492 6608592 8813199
10511 8813199 11514481 14402002 16944598 18603581 19025961 18179303 16310905 13869550
10503 13869550 11330941 9036511 7157078 5698923 4625935 3857031 3305599 2902015
10495 2902015 2613528 2398435 2224181 2084664 1967358 1875560 1804318 1749874 1711481 1696683
10485 1696683 1723055 1793956 1912325 2083259 2339848 2700300 3168654 3728171 4321404 4885778
10475 4885778 5366343 5789024 6247298 6879410 7854974 9400113 11796838 15289566 19967400
10466 19967400 25504689 30918839 34848507 36293592 35259697 32657285 29534953 26415996
10458 26415996 23289001 20027802 16719405 13635648 11021782 9005439 7576924 6622820
10450 6622820 6068741 5791045 5644500 5474913 5156939 4682280 4106113 3541505 3054549
10441 3054549 2682875 2407591 2196676 2063788 1998466 1970278 1987811 2048797 2144030 2273711
10431 2273711 2431880 2623979 2849341 3140207 3556837 4132203 4968944 6182610 7938422
10422 7938422 10391141 13566582 17264704 20921717 23705756 24909319 24263091 22030448
10414 22030448 18810903 15315025 12088720 9420053 7349395 5817453 4709761 3902051
10406 3902051 3315134 2879287 2531848 2251496 2004429 1775612 1566289 1389880 1233398
10397 1233398 1097242 975480 873223 780344 713104 658270 611172 571169 541465 508107 485423
10386 485423 477224 462660 452224 439545 423707 408164 397625 381030 374132 369331 360490 353385
10374 353385 331969 311602 298247 274711 247891 215777 187043 172447 167051 174612 209194 244535
10362 244535 263189 274795 273277 265186 266689 270716 269432 270261 272702 253861 227939 196658 183811
10349 183811 185315 197290 213177 218926 203423 205463 207693 206596 207581 224098 230440 225280 221288
10336 221288 233401 249330 260660 259908 265580 278800 284916 288897 291698 288301 270154 267735 268019
10323 268019 252006 231542 222178 204179 170764 153203 145782 153115 187500 225371 246338 264962
10311 264962 284495 299035 304419 300922 297126 294526 300153 298316 292130 296893 311047 329738 355727
10298 355727 378278 392687 414283 440380 479731 530085 560254 520908 441524 344636 268254
10287 268254 243543 252686 265760 286239 297748 302508 304480 308161 314080 311882 309053 326751 326946
10274 326946 309682 304641 302619 289868 281365 279221 292216 299018 304998 323357 332692 342428 359599
10261 359599 371593 377134 377321 376007 378223 372037 373278 380590 383506 385830 386533 391643 410860 429350
10247 429350 436613 438999 441213 439964 442185 437320 419249 411231 415497 420172 441365 467634 504390
10234 504390 523415 541837 559810 577170 590732 595213 597119 605196 608561 612868 628465 657585
10222 657585 688992 725760 760664 790513 809197 828618 869437 925106 983883 1040199 1091639
10211 1091639 1148381 1200684 1251683 1294172 1329751 1377231 1431817 1489356 1543941 1611600 1699723
10200 1699723 1802107 1899899 2008992 2125706 2268727 2425610 2554215 2697874 2850832 3050620
10190 3050620 3321009 3634267 4003276 4438094 4966132 5609298 6401188 7346119 8438041
10181 8438041 9633970 10833539 11874493 12796110 13875365 15391510 17567251 20640951
10173 20640951 24892916 30775922 39115490 51365668 70092486 99593297 145959219
10166 145959219 213807349 294281434 351968894 348327536 292084807 223093576 164520815
10159 164520815 120632386 89364405 67486265 52167710 41328391 33508506 27770636
10152 27770636 23510038 20361587 18112833 16594552 15543631 14553869 13362094 12005216
10144 12005216 10672568 9431095 8323765 7356346 6552955 5904253 5385320 4943671 4556694
10135 4556694 4215085 3922131 3695514 3512360 3339985 3154417 2961203 2791817 2647533
10126 2647533 2536204 2446549 2362280 2290275 2237260 2247232 2291856 2306934 2233192 2055212 1870114
10115 1870114 1715050 1587614 1495638 1430800 1383749 1349535 1316453 1273022 1241056 1219374 1190149
10104 1190149 1178166 1159935 1139142 1100622 1060123 1012002 965565 932516 905734 887485 874995
10093 874995 867270 871773 885982 903444 912716 916672 896604 853606 793521 732712 692956 658027
10081 658027 638475 620494 594372 566649 554547 548152 539708 542474 539431 527385 513127 494643
10069 494643 475137 470403 466547 462918 462923 464612 464600 485026 497197 500411 492137 483845 472904 458765
10055 458765 450250 441309 422794 411657 418881 433669 452745 469831 490415 510222 534137 564670
10043 564670 597023 630896 664621 688931 700428 660427 572751 480116 416939 382526 352190
10032 352190 322399 303108 279992 272492 261565 250881 242052 230258 223963 213470 203169 184893
10020 184893 180207 188588 190441 191815 198037 201302 218212 253482 286078 300793 308545 301819 287351
10007 287351 277333 265818 265010 266931 266253 266157 265705 266812 271742 277611 294099 295256 276549 263139
9993 263139 252868 237835 227329 213290 211869 214112 211183 209588 197565 177132 171824 172847 166908
9980 166908 164917 176260 182229 178696 166424 152262 136723 123783 100273 83356 79438 81907 86164
9967 86164 94975 107205 129806 158462 181941 207055 235215 238990 236858 216735 188357 172711
9955 172711 148695 129266 119448 116598 109841 109392 108425 97249 98874 103067 101976 110030 116419 110859
9941 110859 117163 134124 139843 136124 138255 135534 127863 123659 119817 117898 114431 117062 117270 121783
9927 121783 126330 128654 123415 128007 134007 139304 154031 152858 142722 144127 142913 136026 130350 129731
9913 129731 143062 149619 150325 132578 120906 109222 91470 86706 82113 93393 97776 106363 107555
9900 107555 105746 98172 99380 109713 113556 108864 109772 108163 117894 125869 120936 116836 118306 111032
9886 111032 110331 107908 104434 112199 121662 123979 125838 127970 128468 141641 152176 140221 131397 122411
9872 122411 115290 113903 120055 126167 130235 140245 153609 161861 164562 149169 138167 124750 103660
9859 103660 77782 63428 62793 62207 63809 79818 98699 120524 145423 156855 173546 197531 220396
9846 220396 250644 313749 420312 606007 897418 1183421 1263650 1087574 822700 599037
9836 599037 451732 362741 305798 265820 250184 232566 220314 200981 187857 176828 173261 174761
9824 174761 169681 175499 177417 172257 172501 191280 194118 190325 181633 179930 201561 219245 238321 268980
9810 268980 293926 324508 352038 395927 440919 494041 553649 629722 711261 816931 969026
9799 969026 1159835 1414671 1790460 2342707 3087130 4015778 5004317 5808845 6286694 6399009
9789 6399009 6062684 5298663 4372252 3509236 2812617 2284150 1893699 1607219 1397569 1242920
9779 1242920 1126694 1046759 986309 950164 939050 918081 905657 909850 918046 949641 993138 1061265
9767 1061265 1171854 1315365 1488710 1708267 1978490 2277383 2555420 2810011 3092333 3512455
9757 3512455 4143763 5094626 6504122 8527782 11212806 14223747 16852765 18449330 18644352
9748 18644352 17712683 16624102 16002572 15652019 14881769 13388167 11540701 9783815 8283224
9739 8283224 7061386 6067350 5269543 4644625 4184837 3851043 3560674 3261494 2980173
9730 2980173 2750049 2581890 2487815 2463616 2527678 2704563 3003514 3347879 3646960 3877870
9720 3877870 3982471 4013112 4110595 4373535 4850683 5624614 6797406 8512112 10847328
9711 10847328 13652004 16322523 18028000 18722861 19410603 20937392 23198702 24921568
9703 24921568 24681228 22531364 19587574 16617541 13883505 11466602 9434338 7855063
9695 7855063 6714104 5943768 5418184 4940460 4401299 3868208 3417384 3067821 2786337
9686 2786337 2577387 2433471 2335784 2303274 2330730 2398426 2430960 2417180 2403636 2433198 2511222
9675 2511222 2654587 2900810 3282571 3850339 4641290 5619204 6637335 7541040 8476070
9666 8476070 9771875 11572301 13713493 15666058 16790427 16810937 15996564 14663702 12826189
9657 12826189 10656141 8571113 6858388 5558041 4623898 3948247 3412315 2936420 2517032
9648 2517032 2185942 1937011 1734117 1552199 1403968 1287254 1177081 1081044 1000278 935195
9638 935195 892530 859129 838011 827842 825697 828533 856423 889399 941522 1030489 1155567 1310722
9626 1310722 1536671 1866196 2332474 2938852 3633516 4264422 4677926 4837224 4732068 4283678
9616 4283678 3583986 2865369 2256095 1772813 1423756 1161307 961952 813250 697907 613839
9606 613839 551308 500236 463990 431146 405684 371969 339745 315217 300821 279440 265428 245705
9594 245705 225360 205461 204924 194181 186149 180850 181732 173424 174456 166016 161218 156407 144107 142630
9580 142630 147865 149426 147080 143814 131455 127138 118265 115046 106086 100763 110795 107989 95705 97466
9566 97466 100816 93488 102092 108215 111448 114214 110826 116500 119367 117604 111023 118026 119071 113042 107282
9551 107282 101730 97841 98391 104086 103593 96876 98246 90593 80452 74419 76941 81925 83042 86789 97515
9536 97515 98057 88230 91082 82248 66235 53253 56198 67349 64919 54794 61388 66536 73519 75750
9522 75750 68346 73185 73454 77746 78671 82592 81864 76947 77347 79358 80044 89624 90079 95751 100089 88495
9506 88495 89389 79963 74764 81807 85871 79888 68815 61100 68414 79270 88333 80401 69511 70207
9492 70207 66646 64540 58662 61730 57790 57095 57716 56796 52572 45048 49757 55497 55627 57108 60922 70442
9476 70442 70642 66485 58632 49410 58656 68317 72168 74671 77532 87076 83357 74953 79303 81267 81060
9461 81060 81106 83162 82050 74161 76398 81894 67760 62936 62826 59071 53651 56983 60120 57136 53054
9446 53054 43677 46060 56921 57074 41523 37948 43782 51308 55483 57356 55180 33094 31892 47218
9432 47218 47290 49763 53325 60420 58110 48719 56435 56136 57221 52830 46176 55254 63902 57971 57280 57621
9416 57621 56749 54715 51833 45065 46439 48943 45116 48157 43738 43078 43374 38725 31243 25901 30909
9401 30909 40822 48001 49808 57290 47798 32491 31097 43295 47642 46513 54416 50294 42886 37265
9387 37265 48819 53876 49959 37112 44944 38626 25179 17384 23754 35932 32904 24707 25751 36623
9373 36623 35532 42637 37562 36478 36281 45244 53890 47049 43429 35404 27819 24453 30185 37818 43406
9358 43406 39809 43946 43462 44957 38849 42311 43426 45638 54708 69160 88403 100855 115356 131289
9344 131289 132023 120556 107125 107748 105735 92222 82236 70498 58978 49988 45269 47937 55067 55845
9330 55845 59703 55820 49988 50149 48331 46545 42324 31887 31800 35686 40863 43275 39667 33643 40125
9315 40125 38302 39684 44194 49706 66395 81586 83756 81881 80251 91848 110973 120630 122491 126351
9301 126351 133713 147887 150208 142108 125451 106641 100720 89281 80493 72974 69697 65918 60801
9288 60801 56732 61428 59600 53439 49934 42795 31478 23997 24417 27574 23848 21530 21281 18322 24850
9273 24850 27469 30799 40049 42526 32929 26317 29389 38045 48446 50638 58448 64425 68318 78403
9259 78403 84395 90735 96424 101628 102638 91162 72415 67481 68406 64217 44694 39304 39703 37471
9245 37471 42057 45086 41773 35276 31389 33002 39105 35313 25514 19488 16474 24228 23540 20889 23902
9230 23902 30156 36327 30208 21834 24221 32151 37745 28242 21732 25104 25617 25391 29600 32775 34090
9215 34090 38450 38435 33043 30013 31857 19111 12727 19231 15584 14115 10955 11543 16845 12173 2510
9200 2510 16362 26137 18226 15121 13445 11390 17520 23081 14169 10985 6221 9499 8062 5553 7273
9185 7273 14512 23733 23773 12743 10472 16476 21104 25141 24845 23624 20854 20127 16184 16211 14740 13852
9169 13852 20851 26443 28238 28321 21007 19829 18692 14383 20987 29873 23482 12017 12934 15379 19351
9154 19351 19538 17437 12150 3322 -1380 -7289 -3755 10866 19162 13078 7581 16944 21682 23835 23698
9139 23698 30951 36513 30283 24584 16898 6627 10624 16205 17874 15213 21978 16665 14148 10787
9125 10787 2776 4557 8399 13858 13154 13239 13329 8085 8645 13195 16384 15832 14508 2019 1640 12689
9109 12689 16404 12979 5165 -3421 -8407 -12264 -12297 -674 3827 814 -3914 -2367 8028 13161 6223
9094 6223 7269 -936 -6332 -1421 6060 9544 6758 11849 18590 14532 8993 -202 622 363 3386
9079 3386 7030 11119 11395 14902 11787 3910 -1659 -3188 10662 18152 12410 3546 -2447 4663 15056
9064 15056 17463 11992 16409 22734 15635 15656 8639 13435 11057 11834 9051 10613 8893 10173 15169
9049 15169 23133 21651 16266 12309 8246 9924 10901 14604 19595 25114 30077 22393 15628 17088 13825
9034 13825 9940 18438 11535 11588 9116 12114 18737 18513 11609 15292 23363 17094 5086 3599 14202
9019 14202 20439 15676 13648 11677 20765 24229 27611 20279 6555 3821 10602 16683 18083 11103
9005 11103 17792 22209 24271 13570 9771 11536 7206 5614 -910 9647 9526 15740 21778 23908
8991 23908 27225 21006 13402 17386 13274 9367 8814 2465 1124 9112 13356 15912 11450 3771 5818
8976 5818 7520 7820 10814 22258 13877 4416 1428 1575 -1369 7091 10704 8778 8199 14521 24008
8961 24008 21909 19246 15601 15851 13371 1624 4390 20129 29332 20289 -1185 -2720 -3194 4146
8947 4146 9377 17635 29098 27744 24391 19778 9704 587 -2553 -6015 9 679 5807 19076
8933 19076 18290 17551 20419 28279 21046 25087 21270 26693 30219 32569 38525 41042 36931 20642 12859
8918 12859 12959 8623 7743 2438 -4710 992 5796 17919 18293 12265 15481 12460 1038 -6463 -9172
8903 -9172 -11265 -9179 3277 4693 5309 9562 4527 5301 6872 1684 781 -6619 -7031 1572 6868 7313
8887 7313 -470 9404 15114 6655 965 5643 2619 8588 11785 14947 22631 14893 16975 14632 9162
8872 9162 17401 37404 52046 65939 86502 104119 120427 117755 95085 70760 46929 36166
8860 36166 28188 24227 12848 15240 12557 13041 14326 20049 19152 10827 9323 12794 10901 9541 12527
8845 12527 14205 12327 13154 10763 9344 13045 16483 18362 16763 21848 19895 20539 16213 20844 20566
8830 20566 9673 12638 17845 23802 34742 35980 23773 10655 15423 25271 22852 20131 28576 32086
8816 32086 24131 11225 6613 13442 18192 9521 11790 23989 23646 23092 15859 9728 8158 7249 11679
8801 11679 12322 3770 2501 5229 6794 11685 10087 9604 8709 6535 2809 -4641 -17343 -20681 -11136
8786 -11136 -11247 -7013 3878 6026 1794 -6049 -10446 1238 178 4713 12719 14996 18853 14115
8772 14115 6718 3415 3474 -3698 -6861 -7895 1792 11415 8684 -46 -546 -3417 2685 -1147 9147
8757 9147 11409 18129 19249 12486 4832 6475 10512 7126 13844 14770 14388 19091 24633 26380 21216
8742 21216 17634 16189 20031 8485 872 1609 11313 17779 15441 17464 16853 8309 -4330 673 4564
8727 4564 6272 7257 10263 16669 21673 11961 12255 18543 29688 27516 19121 23209 20257 13677 11600
8712 11600 15453 18426 5650 8825 19738 22849 20265 28156 28635 18551 17718 27679 36669 37926
8698 37926 25205 11441 11685 7671 2240 -1061 -6243 -4960 4660 23781 26370 25641 21561 18942
8684 18942 22227 25783 17415 8733 6109 -341 2040 7359 11137 13920 14211 15296 9620 10906 11084
8669 11084 12031 2972 6059 4977 11660 12785 13967 20070 15764 16216 17201 15550 20676 29595 32683
8654 32683 40748 45584 50557 56837 56278 53429 50041 38310 49064 54332 52357 78953 130777 200962
8640 200962 282640 336852 297450 233187 169351 121645 97876 85012 72060 61036 53013 52356
8628 52356 38189 25380 37460 36644 31016 38517 40474 41936 41793 39244 43203 40368 39465 43872 47275
8613 47275 49950 44310 23031 19192 20713 21236 23805 26724 50014 58308 65678 75860 93123 111197
8599 111197 138733 181683 248436 366082 543824 683386 630254 481442 365272 282294 226699
8588 226699 187926 172502 162832 148848 140513 132255 119639 107723 104486 100361 88929 79728 74917
8575 74917 73859 80676 78939 74312 70284 59554 48943 33607 22454 21475 21065 23529 26840 25274
8561 25274 29383 33143 30711 35022 38613 46359 57053 60189 79362 109298 157382 225921 296741
8548 296741 290902 216331 158581 124372 89800 72453 55755 45749 39649 35772 37313 31098 29044
8535 29044 33350 34902 30144 25266 14146 11199 20040 21159 21822 22290 22588 12344 796 1906 -1990
8520 -1990 145 9932 8781 9866 10533 8382 15411 19799 14790 13299 9642 11010 10227 6603 -158
8505 -158 -13189 -11592 -1317 5444 9894 9020 8975 16658 17224 11813 12600 19755 23862 18106 11478 -4120
8489 -4120 -8565 -15928 -10368 -946 -1600 -10353 -963 10935 12867 12434 9394 685 647 2869 1213 -10646
8473 -10646 -8201 1778 5545 2757 9478 16607 11051 3784 10854 15513 14941 14530 22211 15906 24065
8458 24065 27223 19916 15662 14863 11910 2944 1315 4683 9468 16373 17281 9634 1004 -1243 1169
8443 1169 9058 16043 8475 12190 8821 9578 17031 15379 10494 3900 6600 6128 981 -4761 -1521
8428 -1521 3401 7642 3776 1222 5461 14141 16656 15416 18608 11878 963 -7405 -9607 -6016 -6451
8413 -6451 1176 6255 10974 4858 -1507 143 9484 10977 14690 16385 10053 -8026 -15293 -5287
8399 -5287 3728 1931 3965 7902 11084 10927 3103 10943 7659 -4707 2241 3070 10365 17816 20096
8384 20096 14026 11430 7242 745 -9433 -9488 -11483 -18879 -11758 559 11100 15084 13779 22993
8370 22993 14248 5959 -2233 2747 7592 10198 15169 7619 11567 7238 10655 15519 8514 1348 -316
8355 -316 8909 16492 20243 19044 18951 15616 4626 7609 7977 -2429 -3720 989 12085 16910 10927
8340 10927 5598 -3504 -13005 -1625 -1881 -2443 1022 77 -184 12037 19208 14074 11399 12051 13274
8325 13274 17949 21219 19999 31447 34678 35649 39355 38663 34082 27820 14742 -3877 -7964 1368
8311 1368 5503 4126 6505 15897 18537 16169 7584 4884 17165 19327 10839 18896 11644 8780 17039
8296 17039 15872 3887 -1545 9678 11431 10528 9657 11932 17013 16398 11359 845 -1737 2273 10046
8281 10046 15482 26409 24017 21523 30709 42891 59137 82433 89085 73542 57028 38146 26471
8268 26471 26712 27682 28716 29628 27639 27967 22377 23890 15525 11824 9966 7937 10119 14781 19502 15205
8252 15205 5310 5341 10363 14738 624 1795 12814 16926 20244 13381 8630 12708 7828 8760 15950
8237 15950 21877 20839 21398 19754 20706 29574 33280 39921 50317 51827 50593 42037 32341 27355 20653
8222 20653 13082 10965 13320 19497 20704 13812 11106 1126 4018 8531 14493 9376 4678 -7847
8208 -7847 1305 11566 12074 12693 10680 18699 25978 21585 19663 16614 4633 7497 5505 4129 7171
8193 7171 13301 13920 16983 11833 3659 3442 6942 3591 -3988 -239 -4141 -5935 -9743 -3528 6342
8178 6342 4688 -1932 -7347 -10677 -10072 -1871 12754 8854 -5543 -18572 -14593 -2778 1928 1486
8164 1486 4670 7787 13046 21473 24391 21060 21233 22875 21453 17831 11324 9238 15771 11998 14251
8149 14251 18255 15922 15074 11241 1724 -9070 -12586 -10684 -2807 5692 8329 5833 5047 8732 8460
8134 8460 11173 7179 5901 8209 3975 -5268 921 2402 7841 7603 1931 1880 -54 2434 424 4704
8118 4704 5186 760 12868 9078 5966 -775 467 2040 -5484 5798 21041 28419 20436 12138
8104 12138 13861 15833 2384 4884 12568 16228 20848 22558 9216 2227 4059 407 1771 -1938
8090 -1938 4711 11348 12732 11722 13320 8667 8344 13311 6578 6927 6059 56 -10966 -3858 -7078
8075 -7078 -4562 -530 -754 -1278 -8377 4579 21845 21699 13204 2021 -9901 -8005 -8661 -10952 -7010
8060 -7010 8227 19236 23531 39012 43622 30404 27753 33593 24112 13882 11620 9303 12336 15360
8046 15360 18708 18888 21854 12244 14914 25207 30822 30018 31428 38676 39646 34611 30670 24375 22228
8031 22228 29108 31193 23736 24488 26882 34361 36797 30859 25003 30027 39732 49381 61797 67212 68139
8016 68139 69646 72284 79515 81568 75632 74063 71685 67448 73499 68244 55830 45214 38189 37809
8002 37809 47046 57686 60232 57147 57826 48521 44596 47318 46143 45892 50215 52064 52747 62036 66172
7987 66172 62231 54065 53093 50895 48021 53127 43939 41995 43334 46902 46988 45731 56754 63302 57690
7972 57690 51213 55016 52704 45991 44912 44570 44620 49559 51437 51163 59574 65630 51473 35574 35948
7957 35948 39207 48800 50822 49951 43408 44946 56711 66903 72585 78725 79478 69386 50472 45530
7943 45530 41020 40187 35780 34225 44199 44494 30019 17145 15636 6477 8320 21006 23879 23326 18486
7928 18486 17534 25150 21800 24773 22004 22746 22500 16751 9565 4878 11692 16585 15090 13207 17264
7913 17264 18863 30376 26689 25816 32245 31655 29228 28893 28785 23111 17931 18390 25552 16497 6534 1505
7897 1505 -738 4343 13995 18116 22453 21431 23029 18966 21011 22970 25103 24448 13994 6389 3067
7882 3067 9849 14658 -150 -7187 -5699 292 11279 20843 22082 25716 18645 8448 4839 3530
7868 3530 5487 6566 8469 1814 -557 -3781 -9275 1635 2988 3169 5304 -675 -855 529 -652
7853 -652 6012 7563 -3144 3802 9913 4552 2648 -9046 -14853 -6801 -5899 -7063 -10692 -3247 4025
7838 4025 -699 -3798 3178 2109 -657 598 8359 383 -12687 -9522 -11542 -7541 -5280 -8812 -8059
7823 -8059 -3304 -1279 6964 12625 3104 -2076 2068 6906 7702 6955 2096 -3268 -1756 5555 3436
7808 3436 -3706 -7347 -7415 -4225 -3816 -6592 2540 4207 3343 5683 5052 4791 6001 11607 13172 15093
7792 15093 12021 6111 7615 11797 3645 5193 1650 2703 2258 85 2526 -3848 -2645 -3763 -1230
7777 -1230 -1067 -15208 -17244 -8128 -401 5743 3091 -2392 -2147 6804 14840 4640 89 5143 6178
7762 6178 1510 -1629 4994 5391 243 -7610 -198 -3667 -635 7105 12390 13609 14914 5648 9086
7747 9086 9864 4552 -6028 -15663 -18371 -7524 132 5048 5646 6556 -4282 -12606 -17273 -16204 -16700
7732 -16700 -10619 -7699 -7505 -1239 5302 10947 15568 23879 20427 17023 13235 969 -6104 -4487 -4124
7717 -4124 -1107 3416 4933 7483 4433 6067 16662 16131 12299 14935 14396 4816 10177 13469 11933
7702 11933 9744 10723 787 3234 6114 11616 12269 9727 5703 5385 -2239 -1624 2146 9270 12837 8927
7686 8927 5775 4284 3996 1640 -192 2932 188 -8814 -12640 -8916 2444 8811 13090 17633 7680
7671 7680 -2064 -6356 -12489 -9485 -4137 -377 -4261 -6556 29 13460 15413 19721 19027 15372 4770
7656 4770 -1198 -2411 2087 4852 5735 5519 7766 12776 15852 7686 -2445 -9577 -13624 -9313 -8149
7641 -8149 5602 14210 10340 8712 3907 -6960 -10232 -5071 1538 1802 -1751 1491 5755 10757 10038
7626 10038 10830 9606 4691 664 -3328 228 1994 1207 2234 4584 -2033 -814 5200 4516 5290 -5399
7610 -5399 -15172 -11558 -17127 -15098 -17194 -9030 -2388 -5729 -6455 -9839 -8785 -2958 4058 487 -5906
7595 -5906 -952 1811 -8016 -12118 -14290 -8871 7484 10323 12525 10798 -966 -1059 4389 4531 242
7580 242 -1170 966 -5741 -18381 -18961 -11758 -12113 -9794 -17908 -18855 -12309 -3390 -3032 733 7312 12646
7564 12646 4184 -6333 2326 5016 9048 5795 6660 -4100 -18477 -21859 -22132 -20773 -6342 -357
7550 -357 -7184 -12637 -15677 -17353 -3771 -2711 -8514 -8330 -3936 994 -2204 -6488 -2399 -584 -3732
7535 -3732 2554 1821 2563 12305 8988 15364 14759 5573 -2508 1750 2367 -1400 -5709 -1291 6050 3070
7519 3070 5154 15915 6088 -6594 -11456 -10838 665 10303 9040 4825 10871 5418 683 -842
7505 -842 -2133 -1893 2532 6673 6830 9442 11694 14221 11956 9919 12226 8472 11032 10552 2995 3452
7489 3452 -5767 -3504 -10294 -11509 -7958 -7461 -10388 -7023 -5519 -1163 -5993 -19881 -19551 -20903 -15084
7474 -15084 -6501 1054 6259 110 4619 17167 14013 10827 9476 -615 3138 12853 14138 12924
7460 12924 10088 15036 7464 4911 1071 4326 8919 5329 5939 1427 -511 224 1767 -3919 -6188
7445 -6188 -3810 -10637 -8753 -7729 -696 -6732 -11744 -18804 -24970 -18917 -9145 -9090 -17389 -10323 -4554
7430 -4554 -6863 -15464 -8369 -1047 -2778 -5993 -205 10409 18537 16315 11845 2047 3307 4181 20737
7415 20737 19921 14141 -4249 -4632 6949 9415 3440 -1969 -6354 -9501 -13676 -17378 -12206 -11518 -14118
7400 -14118 -5082 2548 4061 -5698 -5037 6849 -4469 -10021 -7128 -5397 -6747 -4895 -6180 -5371 -5725
7385 -5725 -3056 4820 9554 15026 17270 10204 1935 -2237 -1443 -3161 -1703 -6217 -14328 -18760 -15745
7370 -15745 -8152 -6055 -3853 -1628 1745 2380 2601 12108 14868 9521 3226 563 -5060 -13734 -17066
7355 -17066 -4188 6689 11222 11895 15871 14589 16989 13047 8168 4793 7980 12571 17892 23026
7341 23026 20320 12857 -1355 -1215 -1056 2064 736 -1930 577 4171 -7949 -7252 -13563 -10117 -6715
7326 -6715 -4866 5340 5643 -4525 -8835 -6891 -11918 -16610 -13466 -7738 -6864 -2152 2004 -3434 -13619
7311 -13619 -13995 -16184 -20615 -20027 -17007 -3004 -159 -8458 -6389 -448 -154 -2506 831 755 -2337 -6132
7295 -6132 -5565 -4768 -3558 -849 -670 -4259 -2896 1183 -3610 -10821 -11038 -4148 6585 5917 2711 -7177
7279 -7177 -5679 -8705 -14016 -21637 -12782 -3361 2594 5845 6043 3574 3195 -3289 -7488 699 4332
7264 4332 1507 2930 3888 1837 3264 908 5445 7985 5347 5296 10636 2079 -7560 -6804 -9051 -4892
7248 -4892 -5177 -4715 -4878 -2080 4780 4497 356 -1294 -5217 1817 4606 3714 3943 -3186 -6674 -660
7232 -660 -9318 -10183 1556 9202 -1391 -9537 -9235 -9460 -3605 -1694 -7535 -6055 -4482 -4769 -10200 -4021
7216 -4021 2931 5988 18185 13737 -436 -5945 -6500 -5768 -281 6085 9565 5552 -12833 -10535 -1008
7201 -1008 -3067 -450 2361 -6192 -4145 -477 3617 4392 7182 11438 12502 -594 -10307 -12261 -1241
7186 -1241 -902 -495 -6323 -69 7003 -2457 -8072 -13608 -19050 -17310 -10512 -3928 -6006 -4189 -4843 -7813
7170 -7813 -10102 -8761 -3987 -6042 -4466 -16986 -26756 -25037 -10964 -6492 -6376 -7831 -6402 -905 5207
7155 5207 835 -2535 -215 -7645 -2896 3486 450 -3202 -697 -2415 -5455 -10549 -6131 -17733 -16852
7140 -16852 -18220 -19379 -19354 -13610 -7625 -8044 -5177 -7699 -16997 -14583 -7320 370 -3976 -12950 -17845
7125 -17845 -17554 -3472 550 -8492 -16668 -17480 -13737 -21279 -21709 -16041 -6639 7427 -5690 -14299 -4202
7110 -4202 -2313 -10465 -16793 -18510 -16067 -19019 -23019 -8410 -2934 -8210 -2862 6667 13729 7965 9893
7095 9893 9967 4796 -4248 -4566 -9521 -13976 -15548 -10624 -8484 -14228 -20986 -22294 -13941 -5245 -1127 -7725
7079 -7725 -10568 209 -2138 -2907 1204 -211 3370 7005 7504 637 -8966 -13417 -13615 -7452 -452
7064 -452 3553 -3239 -10485 -12162 -22187 -23853 -21497 -15328 -20305 -16510 -11905 -11320 -6419 -16851 -18142
7049 -18142 -20547 -17369 -14722 -4528 -4137 -12122 -16024 -7772 -5850 -14390 -22439 -14759 -4024 -866
7035 -866 5416 5486 41 9994 17278 11059 -2192 -6461 -1285 -8703 -9051 -5469 -2729 -25 -6 -1919
7019 -1919 -1662 -15295 -14197 -1188 -3827 -3884 -5546 -586 -7308 -18417 -26457 -23040 -20296 -3402 14246
7004 14246 15506 7056 8192 13816 11480 4426 -746 1146 4094 10276 18177 19215 17727 18237 14554
6989 14554 15705 15213 7613 1625 -3525 -2709 8737 16354 13015 11412 13789 14424 18899 25123 25309
6974 25309 11391 7154 -4550 -16450 -11364 -7977 -5570 -5540 -10132 3481 6611 3033 5940 4639
6960 4639 5971 8888 5665 1994 1351 -6717 -14890 -16013 -8551 -3713 -5042 2559 2555 11406 6943 2619
6944 2619 1092 14223 7884 -1926 -2511 -3407 -1905 -5567 -2110 7039 3123 3619 6053 10149 1493
6929 1493 3255 7213 7914 2323 -2402 -1624 -2545 -3979 -5148 -6276 -7946 -9940 -2529 1433 3182 1640
6913 1640 -361 -9801 -14805 -9826 -4923 -569 -4296 -9619 -4999 -8796 -8931 -3157 2563 7555 12212
6898 12212 6279 -7222 -13390 -21766 -28993 -22337 -6870 -1771 2152 2331 864 -6300 -17183 -10174
6884 -10174 -7903 -6640 -253 7027 189 -11316 -7456 -8559 -10908 -301 6575 15771 9523 10420
6870 10420 8378 5039 702 -6388 -1741 4654 3831 9087 14476 7457 3867 8725 67 -15538 -16486
6855 -16486 -9519 -12692 -15920 -6785 -11043 -14130 -13089 -12670 -4974 -3230 -2628 -5765 -3783 1280 -682
6840 -682 -12624 -10146 -16997 -4413 3415 -765 -6446 -16477 -17328 -5441 3863 -2464 -5438 -2909
6826 -2909 -4345 -3429 -4018 -4242 -7890 5580 16003 16506 11868 2940 -8163 -12491 -5768 -12411 -17706
6811 -17706 -15767 -7805 -7656 -3648 -9526 -20244 -25088 -20893 -8900 1067 1183 -3215 3196 10969 7788
6796 7788 4546 5095 7971 2224 -1439 10308 10039 -3599 -5745 -9885 -10781 -12140 -9303 -1783 -3249
6781 -3249 2998 -6994 -17396 -8717 -1761 6404 4116 -496 1280 5660 3867 -12114 -13866 -12339
6767 -12339 -9696 -7107 -13326 -12894 -10267 -4536 -1796 -311 2545 1587 4693 13412 14742 14340 7202
6752 7202 11348 1198 1527 89 -11952 -12002 -7673 -4600 -3017 2986 -1574 3611 451 -6907 -9628
6737 -9628 -1277 -1928 -11311 -17002 -13451 -10356 -9776 -5993 -4235 -4628 198 10761 15041 7854 4486
6722 4486 4065 -2543 -11720 -8323 -5466 -1972 -3619 -5380 -313 18177 24191 18671 11469 2808 1402
6707 1402 2219 -2423 -7630 -10071 -8652 -7517 -3776 1100 324 560 -1134 -2083 932 -2086 1711 3878
6691 3878 -5078 -6186 -1220 -2068 3727 8498 5861 5962 14548 19712 4671 -5342 -9060 -5258 3333
6676 3333 11594 9997 5337 -5670 -7134 -9837 -2647 -1021 -15772 -19388 -23231 -27334 -26445 -20149 -6927
6661 -6927 4423 -954 -1825 -2230 -965 3600 1165 -1749 -6582 -4317 -7642 -7723 -5988 -6573 -5947 -1107
6645 -1107 -12411 -4479 10205 8712 4317 -650 1868 1102 -10024 -22622 -20266 -12675 -9645 -5065
6631 -5065 -5166 534 -4231 -9430 2630 11393 12287 9158 1513 -7456 -12475 -12280 -12200 -1200 470 -4548
6615 -4548 -7045 -14066 -11394 -4343 -8809 -11724 -8272 -6611 -14747 -23744 -20557 -16187 -9106 -6417 -2989
6600 -2989 -2615 -9389 -4148 -1843 -2597 2549 3970 4571 -3478 -4109 -3361 -5897 -8073 -10014 -15778 -11964
6584 -11964 -5537 -12670 -11911 -5927 1854 1738 7147 13241 7139 -4619 -7614 -8348 -4062 -5463 -2648
6569 -2648 -5290 -11430 -7136 -1984 -5328 -9504 -5245 3138 6725 11744 11439 7250 4955 -3263 -4186
6554 -4186 -9213 -4179 -3389 -14582 -12248 406 6204 8745 -428 -10313 -9271 -9182 -8890 -9572 -13358 -7167
6538 -7167 4030 5941 2033 1012 157 -7239 -2217 5200 14182 19830 6776 3255 -2908 -3231 -4422
6523 -4422 1466 6557 438 -10253 -15847 -11966 -6846 -14771 -13491 -10851 -10175 753 698 -1088 -2470
6508 -2470 -2402 -5374 -462 1678 6854 -2451 -11691 -9505 -4782 9670 12641 16688 13210 9897 5228
6493 5228 460 -1746 417 -573 1793 6133 6627 3068 -909 -8151 -5736 11 -3259 -14064 -7859
6478 -7859 -13829 -23862 -24600 -15465 -2265 -5058 -1849 -3997 -3186 -113 -4737 -17582 -17312 -19403 -14729
6463 -14729 -8293 -7898 -9886 -15023 -12768 -5352 -1091 -787 -2258 3917 10912 8088 9161 4760 10931
6448 10931 18753 20100 14958 7032 5276 -9551 -14379 -8503 231 6470 2408 -1255 321 2168
6434 2168 -963 -4865 704 -4824 -7136 -14510 -8005 -867 2426 -910 -1022 -10007 -7316 2385 -3151
6419 -3151 -20779 -12954 -11943 -6410 -1625 -5682 -4336 -5466 -5064 -1397 -10058 -13230 -9324 -9433 2747
6404 2747 -2000 -3340 -4402 -4346 3528 5040 -7340 -12426 -3551 -2229 -2739 3020 6263 9052 7906
6389 7906 5199 7439 9612 5799 13939 16633 3564 -5355 -10194 -16237 -15166 -14790 -13342 -7358 -5136
6374 -5136 -1907 -4810 -9717 -7753 -930 3994 8195 9407 10599 7583 6986 -514 2008 -5372 -8579
6359 -8579 -8182 -6409 -3261 2008 -2977 -5192 -1739 -3576 -552 9261 7054 -8619 -10366 -12909 -18134
6344 -18134 -20686 -15032 2058 11190 5244 -8120 -6848 24 -5406 -3062 5403 -1269 -4984 -4615
6330 -4615 -7382 -15085 -11295 -5345 -11156 -10368 -7746 -4322 5057 8746 6816 2546 2217 1797 -79 -2083
6314 -2083 -11405 -14608 -20563 -14443 -3552 1853 2891 1533 269 -4747 -3217 217 19 8323 8295
6299 8295 5838 -4723 1334 14099 26394 24138 17944 11756 14045 7933 10718 16026 16201 17354
6285 17354 11765 1723 -6150 -9179 -5670 -4001 -1309 -1489 -1905 3949 9991 19577 13120 4375 8127
6270 8127 2516 -6454 -9435 -5786 2576 2432 -5012 -16378 -21771 -15470 -13060 -11724 -8042 -3844 3220
6255 3220 11724 8294 4682 -7448 -9531 -4672 2239 -2407 3294 12973 8437 4486 1007 6122 8410
6240 8410 7529 2439 2556 2196 7558 9995 5611 9754 8926 1716 10474 14208 9835 5483 1204 -3514
6224 -3514 -3662 -2459 -6759 -8325 -7005 -12257 -3665 -8193 -11775 -16250 -9465 -7187 -7734 -5535 -11370
6209 -11370 -6853 23 9945 18581 18756 17923 12647 6333 13112 20477 14687 3196 -2692 -6578 -6267
6194 -6267 -3646 -6224 -5592 3031 3965 3188 9870 2364 -8209 -15211 -12260 -2068 1586 -5843 -10155
6179 -10155 -6536 -1950 2694 175 -1903 -3183 -6146 -8540 -14706 -19430 -5136 3543 6965 330
6165 330 -7419 -5181 -7336 -8274 -4864 309 -1288 -2729 -3217 -5796 -2969 6976 9693 8036 7880 13330
6149 13330 21306 15099 4646 8136 687 -4791 -56 2253 3064 3459 -2315 -8609 -7574 -10814 10
6134 10 11698 8050 -1207 628 1643 -816 -763 -5401 -9245 3336 4401 10770 9938 11509 8409 2293
6118 2293 -2342 -7905 -5545 -2361 2971 10627 7021 10606 7316 2022 -6463 -2756 593 2533 6015
6103 6015 9845 1412 -5871 2945 4230 1472 7972 8903 15881 6943 -2263 -400 2594 4058 887
6088 887 -1050 2760 10511 15499 859 -10568 -14732 -17464 -1280 9448 -1952 -8269 -3184 8686
6074 8686 11624 11458 -1674 -5108 -12010 -9216 -2298 2684 2431 2197 1386 2483 -2852 -776 2786 -3350
6058 -3350 -5918 -6470 -13707 -10179 -8740 -9978 -13780 -6148 -947 2390 2139 8674 12268 3790 930
6043 930 6384 3696 4024 18489 25329 18182 16631 5117 -14683 -19500 -17365 -12432 3291 11187
6029 11187 555 -5716 2306 -3854 -13527 -9555 -1614 -5422 -8191 -332 -5192 -10815 -17715 -16015
6015 -16015 -5775 3420 7296 -8120 -21231 -13375 -3300 -12391 -10809 -14042 -18498 -18861 -11924 2571
6001 2571 8261 2841 -10852 -16816 -7426 1357 1805 5259 5314 -589 -6539 -4045 -5282 -9808 -10808
5986 -10808 -11227 -4778 -6143 -10218 -19321 -16509 -10220 -9409 -13923 -21880 -15376 -9872 -10016 -7668 -5417
5971 -5417 2833 4487 -6762 -278 85 1872 -314 -5447 -4899 -6626 -2869 4959 -4616 -12816 -8367
5956 -8367 479 989 -1209 -2046 -9534 -9354 -16120 -18052 -15564 -10964 -10118 -15201 -16643 -11440 -10680 -11584
5940 -11584 -14360 -17360 -17068 -13516 -3646 -7083 -8053 -6812 -7413 1706 2468 378 -2007 -2326 6798 5877
5924 5877 9424 4418 -7290 -8663 -5979 3151 2711 -1971 -10664 -8182 -12385 -7277 438 7357 6576
5909 6576 1524 3173 6773 7170 7994 2424 -3849 5161 9870 8448 4893 2611 3369 1487 -434 2199
5893 2199 -3456 -811 -3180 -5135 -18140 -21567 -12717 -9860 -6253 -10177 -15597 -15347 -17212 -13773 -10346
5878 -10346 -6908 -13190 -21324 -20378 -13506 -3190 -3327 -301 6980 4438 5346 3478 -5065 -18173 -12764
5863 -12764 -6863 -5954 -11543 -12110 -4822 4578 -109 46 3207 1623 2806 9259 5910 6990 3948
5848 3948 10186 17911 13365 9915 12679 12143 10882 5409 6249 6080 -926 5365 -1735 -1737 6587 174
5832 174 -2268 -4141 2521 11076 13228 4001 6268 6255 4661 -6973 -20442 -23601 -16534 -4395 5093
5817 5093 11964 19931 19289 3843 -4329 330 5019 5652 4490 1572 1718 804 -501 237 -983 -6395
5801 -6395 3277 1668 603 -5664 -1263 -6631 -9391 -10666 -11883 -11690 -9841 -6499 -10685 -11348 -9463
5786 -9463 -6612 -10287 -9468 -7861 -11434 -6844 -2379 5067 4212 6599 9297 5709 -3789 -12 506 4285
5770 4285 1409 5532 14486 6046 -2314 -1830 3770 3146 13225 9098 -1704 -12191 -11811 -9997 -9170
5755 -9170 -10358 -12998 -10965 -9921 -14744 -12437 -10232 -9375 -9045 -18440 -26489 -20351 -21686 -22055 -5545
5740 -5545 2970 -14130 -19363 -2129 3531 -2509 -9104 -14383 -16935 -8106 -3611 4285 1453 -407
5726 -407 2277 -3090 -474 12799 15430 14223 11057 -1241 -5393 -8852 -17158 -10175 3855 10590
5712 10590 7556 2657 -9193 -11539 1740 8135 1917 -2030 -3270 -3286 -6172 -3410 -7136 -6712 -4649
5697 -4649 11216 4915 -8000 -9887 -8360 -1187 1630 -4290 -14030 -11678 -2378 4540 1265 929 -10323
5682 -10323 -16595 -23006 -30068 -25307 -15483 -17402 -15655 -9738 -4724 -2781 -8700 -9198 -7321 -6463 3040
5667 3040 11721 9523 5250 -11940 -20270 -13513 -12512 -19175 -15717 -9126 -3496 -10739 -13542 -4762 640
5652 640 7966 7604 4177 9670 9204 1244 -2648 -9144 -4893 5354 4825 4839 7363 3167 2227 2781 -6720
5635 -6720 -2802 5727 2851 -3450 -6409 -1645 8428 8436 -1420 -2707 -1141 2398 997 4551 9017
5620 9017 4017 -5479 -14570 -8576 -10614 -18902 -20139 -14408 -1877 -922 -8189 -2847 -1652 -832 -7945
5605 -7945 -7821 -434 5755 1645 -3086 99 -967 1894 -6626 -9434 -7719 -3776 -1166 2570 479
5590 479 4194 -2748 -7467 -4125 -5647 -10004 -7664 -4062 -5416 -3021 -1465 3886 8632 15609 9357
5575 9357 -1458 -6619 -9598 -11713 -5407 -2758 -9215 -10352 -12681 -16008 -13527 -4087 -5503 -10133 -8484
5560 -8484 -4855 -1635 -736 -2922 -3026 7198 8677 1326 399 3068 807 -5213 -7593 -6905 -4652 1425
5544 1425 -690 -10484 -11323 -5934 -1677 1426 15356 13130 3962 -4056 -1674 -1234 1037 -3415 -4457
5529 -4457 -1685 3595 8186 1614 -5640 -224 3090 11707 5507 7723 7551 1513 8 -4675 -9143
5514 -9143 -6688 -12433 -18582 -17936 -7482 1195 7867 2952 -8359 -9508 -5746 -1621 6945 9206 -587
5499 -587 -9511 -12848 -7442 -3705 1439 6066 3487 -748 -2656 -5930 -9823 -9296 -12552 -8903 -13700
5484 -13700 -24568 -21507 -12206 -11770 -7425 170 9588 15148 18701 24705 16806 13737 22095 14820 8778
5469 8778 2842 -4279 -13785 -10248 -3315 -8051 -297 7246 12101 11471 10184 5043 9416 -1471 -7760
5454 -7760 -6240 -12987 -684 4235 1226 -317 -3741 -4702 -3220 -4591 -1042 -1105 -5343 -2368 12378
5439 12378 14959 3406 -4759 -11726 -12749 -9224 -7568 2789 12067 13103 8253 4343 -1987 -4127
5425 -4127 -1015 882 -2837 -3846 2038 -5333 -13405 -12020 -1028 -5234 -8152 -6116 -8256 3379
5411 3379 -1223 -6206 -9242 -2552 602 -1950 -5325 -3362 -3379 2963 10128 5677 -4724 -12805 -7275
5396 -7275 8691 2366 -1642 -4205 -4934 -7100 -9711 -10836 -6759 1156 3828 939 -3728 -3290 6005
5381 6005 14062 14211 6518 12418 10430 7588 5144 -5123 -18401 -16720 -5477 -2957 -10713 -19701
5367 -19701 -15601 -11121 -5661 -1649 4086 996 -2288 -4136 -1787 -3126 -6437 -3102 9299 4019
5353 4019 -4041 -7055 -4569 -2032 7560 11322 14192 13185 5536 -2720 -8009 1944 2701 -10192 -7735
5338 -7735 1070 8997 10047 5211 -6510 -11004 -11084 -16334 -20625 -10251 -6143 3913 5026 532 -3674
5323 -3674 -1567 -1537 2150 12330 11741 2830 -2522 -10781 1767 9699 16309 6536 -4842 958 3390
5308 3390 10291 13840 20156 8334 10452 14654 18981 15649 10697 7735 2347 6559 9003 6741 2366
5293 2366 1740 2567 -1302 -3855 -11256 -13126 -7432 -340 206 -3126 -3770 -7286 -7145 -660 4754 3513
5277 3513 -2355 -17358 -18833 -5137 5964 3563 1764 937 3062 -6578 -3047 1741 -1472 -1443 -1046
5262 -1046 2944 10387 437 -1265 -1995 -2074 -9020 -3526 4256 4112 2626 4031 13832 9745 -199 1389
5246 1389 1795 -2902 -5864 -14 5867 -1831 -450 -1891 -6212 -1285 6235 7980 11621 8871 -989
5231 -989 -2052 -9269 -20906 -12849 -2518 358 1188 -725 -2213 -6068 -7228 3743 4759 -154 3127
5216 3127 810 4656 13358 11362 3518 3275 10009 13489 3523 -5770 -5673 -6655 -4882 -12080 -21452 -21338
5200 -21338 -12655 -6584 -7383 -5751 578 -10624 -16593 -20653 -15782 -3641 -6896 -4946 -3567 -3269 -5690
5185 -5690 -9610 -8100 -5061 2553 5370 2936 -1261 -508 -4273 -6171 261 1103 3001 6243 -6722
5170 -6722 -11247 -6105 -1204 1593 4862 5141 314 -1406 5045 -1185 -5470 820 9457 2961 -9431
5155 -9431 -9274 -7405 -10017 -13655 -6768 4471 7142 12380 9559 -685 -6454 -7114 -6840 -12234 -16251
5140 -16251 -9280 -2981 -2431 -9488 -7482 565 4441 10184 15460 2190 571 -2932 2757 592 165
5125 165 6167 7441 -909 4163 5288 2656 -3494 -8205 -4896 4997 11864 17778 13093 6417 -2035
5110 -2035 -12944 -20826 -13353 2352 6024 -1155 -7627 -7559 -2823 -171 621 -13 -4306 2483 1221
5095 1221 -1939 4877 816 -9655 -17517 -15551 -12829 -1313 193 3258 4169 8623 -866 -11599
5081 -11599 -13991 -10821 -5536 -5150 -7644 -927 11183 7739 2768 -4920 -10107 -3993 -9973 -17138 -15051
5066 -15051 -14959 -11029 1599 -4588 -7046 2941 13722 20326 25167 19832 9277 5515 16919 24323
5052 24323 16770 2691 -2818 -3706 -1662 -949 14459 15813 5746 -653 -3270 -8495 897 -2997
5038 -2997 -4582 3223 9129 7774 8153 3821 -1107 2127 -234 -5290 -3862 2244 6260 5546 2206
5023 2206 2200 -797 -8299 -9324 -9648 -15038 -7871 -2041 11282 16573 14749 6789 -1270 -8517 -2697 1057
5007 1057 3777 8996 10230 4945 1911 -2145 -1105 -1682 5245 16202 19643 6656 -3396 286
4993 286 38 -1441 10981 17362 15750 2240 -8689 -5601 -7357 -10632 -9914 -2817 -2565 -4554 -6054
4978 -6054 -5976 -493 6021 600 -1267 -631 -1332 -3016 -4436 5797 12324 21561 17515 7804 3401 -4402
4962 -4402 -10453 -2953 10531 8912 -940 -5347 -8667 -2003 -4973 -8628 -14975 -13920 -7102 -6604 -2718
4947 -2718 -5498 -8003 -4713 -4788 -10310 -9462 -3371 1571 4872 3075 7986 8117 4495 -2480 -3542 -7475
4931 -7475 -5384 913 -547 -9532 -3665 -6863 -7160 -9004 -12122 -8850 -8979 -2143 -2905 -2928 -36 7784
4915 7784 8486 -3178 -2168 3227 -3424 -4929 -1201 13765 20524 16879 4242 -1768 -8162 -9885
4901 -9885 -3714 -2733 -5775 -5450 -4824 8623 7325 4909 9012 1634 2353 -4489 -3490 -6808 -12198 -16226
4885 -16226 -14198 -6450 -2645 1922 6895 7364 -8405 -8926 -4206 -2591 -819 -9853 -5249 -10406 -14209
4870 -14209 -13080 2708 8236 10118 6137 4960 -760 -427 3269 3653 -4421 1201 7824 3823 -2231
4855 -2231 -8015 -6112 2 -8719 -16337 -19524 -14063 -6755 -40 5399 -4694 -7719 -4353 1334 -1737
4840 -1737 -10771 -20549 -21971 -17044 -17047 -9452 -8450 -18020 -22415 -13781 -2073 -9164 -12123 -6216 -1904
4825 -1904 10967 -178 -9640 -21864 -16196 -6327 -9552 -2522 -7615 390 -9103 -10686 -967 10527
4811 10527 11271 9184 8423 784 -7324 -1069 -1200 -3524 -7711 -20756 -35526 -26533 -19789 -18480 -13628
4796 -13628 -9391 -13799 -7792 -9677 -11713 -10557 -4696 -7765 -8078 -7682 -1847 -10620 -16636 -13251 -9316
4781 -9316 49 3072 -7627 -13678 -9447 -2381 5252 4760 -495 -2037 -1441 1005 -10211 -17281 -7237
4766 -7237 -5693 -7451 -7569 -10019 -12491 -12998 -16862 -1787 1121 -2901 -14397 -11340 -3566 7291 3428
4751 3428 -16 2597 -2021 -1381 -4033 -10903 -11164 -8209 -10704 -2270 -864 -833 -4356 -1466 11552 8752
4735 8752 2343 2730 373 2975 3721 -238 -9190 -7025 -5713 -5280 -7117 -7736 -15169 -16645 -9546 -2269
4719 -2269 8573 5632 -3583 -9555 -1948 6498 4473 -1945 -3540 -2882 5409 5685 -9447 -17283 -18695
4704 -18695 -18757 -15223 -14513 -9912 2792 8617 5355 233 -184 1561 -3174 113 5801 7955 7960 -1144
4688 -1144 -2057 -1345 1239 312 -4427 -3646 269 1374 12892 10018 2259 4564 1408 -1877 -7235 -7534
4672 -7534 -57 -731 -7934 -8346 -2587 753 2476 3105 -12624 -22424 -18746 -11723 -16956 -29709 -27726
4657 -27726 -18443 -15766 -19502 -19664 -6895 -1209 4141 355 -661 -214 5226 3398 6970 8697 58
4642 58 1798 4498 8040 6884 -673 -1911 3289 6625 2305 -6108 -2074 3624 6566 -963 -8032
4627 -8032 -7169 -6340 3812 13801 12621 7094 1532 466 2811 11024 9460 -4915 -17266 -20468 -19553
4612 -19553 -17634 -11983 -4207 -7850 -12953 -10823 -9551 -17632 -18612 -14560 -3685 -3052 2363 -1318 -6203
4597 -6203 -3501 -3 -3748 -7529 1296 7027 2134 1169 -2152 -6461 -8158 -16696 -16902 -12029 -10640
4582 -10640 1548 10950 1179 5199 5044 3569 -3278 -18012 -11145 -3364 -4324 -15035 -18369 -18623 -13898
4567 -13898 -12427 -3963 4914 4745 440 -2296 -537 -3464 -9184 -9697 -7314 -6102 -10925 -9630 -2249
4552 -2249 -3114 -9765 -6150 -1240 -2961 -2616 -173 -2238 -1009 -6405 -15238 -9651 -5747 -1053 8533
4537 8533 11839 11699 503 -15379 -20307 -17769 -7921 5166 4658 -4921 -12702 -4094 -3827 -4290 2358
4522 2358 7327 8359 3656 4680 8459 11066 14494 12523 15790 5458 5018 14 -6384 -3479 1794
4507 1794 13583 19945 16454 333 -7608 -6009 -5564 -2179 3232 -1195 -2892 -677 6340 17350
4493 17350 12458 -835 -9797 -16648 -16633 -17109 -17846 -4851 -6619 -9463 -7763 -9570 -14186 -5635 5478
4478 5478 5105 3679 -821 -1641 -7368 -13235 -6798 -940 -3759 -5046 2211 12354 1654 -3570 1606
4463 1606 8628 8609 6651 1964 1991 -2424 -13386 -8975 -4964 -4639 -2807 -9699 -13645 -187 372 -11908
4447 -11908 -681 8080 4343 47 1290 358 10600 8938 4026 2495 8436 6368 9366 10565
4433 10565 9238 5004 11894 16911 20522 17066 11367 -2403 -6307 -6321 -5052 3844 12892 10070 -1004
4418 -1004 -9306 -4980 6110 9734 6848 4369 11731 13470 14748 10178 8060 6759 2574 -6159 -10910
4403 -10910 -15374 -6991 5125 10235 5887 3397 228 2042 1409 125 183 7076 8713 6592 6415
4388 6415 5180 3305 593 9468 9103 8656 16986 14957 4203 -8043 -20855 -16576 3176 11370
4374 11370 10780 9443 10726 13671 10595 12513 4762 1656 3303 6423 9386 254 -13461 -7091 4428
4359 4428 9168 4180 3598 3286 11329 17624 17604 8310 3866 -3853 -1064 9803 11054 8219 6392 1019
4343 1019 -4762 -4192 -855 -863 -2526 -2499 -6661 -6621 -8045 -3760 -7817 -6535 -3109 -1651 -7499 -14395 -9395
4326 -9395 772 -4785 -734 6443 -7097 -8635 -3595 526 3405 7528 -7884 -6848 -2986 3341
4312 3341 7842 2843 -618 -21 -5395 -6699 -3189 -5056 -6199 -6787 -7734 -7450 -3487 -14000 -21587 -13991
4296 -13991 7387 -3303 -8594 4817 -1906 -12222 -7426 -7443 -7012 -3396 -857 -6352 -1738 5611
4282 5611 6488 6625 5034 -205 7633 5913 7691 13803 -8 -740 -863 1630 4524 -1640 -9067 -11248
4266 -11248 -12235 -11412 -12026 -16453 -13980 -16551 -8966 335 -1465 -7657 -14474 -8678 -7738 -7348 -4129 475
4250 475 -8101 -6644 -822 10294 4769 -1051 3029 6362 871 -1335 -6952 -9970 -9375 -10712 -13010
4235 -13010 -21157 -27225 -21004 -12884 3277 2683 -5919 -10551 -9717 -8500 -3874 2935 7706 12120 12465
4220 12465 9772 17245 25051 14613 8562 10719 11466 -533 -10482 -8109 -5057 1269 1999 -5032 -5203
4205 -5203 -6742 -6307 365 3338 1841 -1011 -3580 -1964 -4747 -4581 6604 8027 4566 -1709 -1057
4190 -1057 -521 471 -6144 -11760 -14564 -2596 5454 -5654 -9782 -1804 11374 11584 4908 -1099 -7365
4175 -7365 -9359 -934 4651 7794 6040 -3304 1213 6561 12935 13390 13538 13938 6872 4396 7282 507
4159 507 -1793 -1993 -2120 8271 18980 22235 10011 -3833 -15626 -13572 -12158 -15049 -24344 -26015
4145 -26015 -12583 -3641 -15461 -14676 -12963 -20022 -1049 2003 -5300 -4916 -4574 3619 9632 1597 1849
4130 1849 -3187 -3778 3692 611 -2377 -12718 -15364 -6432 -1855 4256 -4830 -10170 -11436 -11936 -10105
4115 -10105 -6123 -7303 -8129 -16482 -21778 -10167 -3500 2345 7759 121 -7761 -3188 4411 2650 2210
4100 2210 4246 -6719 -9834 -5109 -2397 -2007 -1316 -5662 -3329 -5326 -15243 -11898 -12511 -11748 -10064 -9273
4084 -9273 -3098 8789 15148 11909 3042 -6016 -12491 -12659 -10352 -15646 -16313 -14853 -10001 11594 11226
4069 11226 9882 2333 2584 3892 5840 3097 3319 2491 2356 94 7358 19225 30856 38691 30211
4054 30211 14563 12625 7171 -4131 -11736 -12467 -1487 8005 -6398 -12271 -8630 -3749 -10518 -12488
4040 -12488 -3506 9572 -10 -10180 -5317 -3796 -5171 -9939 -4745 1622 -3503 -10625 -16564 -2308
4026 -2308 14766 19075 8595 -5786 -10686 2271 1846 -1667 -5114 -5565 -2473 2793 2425 -2753 -2179
4011 -2179 -6938 -4833 5002 9079 3852 -5174 -7386 -2809 -10947 -8308 -5486 1169 7500 6392 -3723
3996 -3723 -6034 -4890 -5215 -5229 -3365 -1336 -6202 -2340 5662 1507 1155 5195 20778 27434 15779
3981 15779 -67 -15565 -10944 8665 18252 17183 11087 10713 12002 5092 584 900 6495 4132
3967 4132 -4827 -9707 -1344 2752 6593 1179 -8031 -7370 -3599 5942 -2633 -14858 -15463 -10001 -9094
3952 -9094 -915 4127 5048 280 -5553 -9927 -14072 -1432 4908 -587 794 7984 8652 9413 3200
3937 3200 -6790 -8771 -14264 -14050 -5122 1379 1380 -308 -1848 -3019 5098 11350 3571 -2125 -1856 -758
3921 -758 6144 1486 1515 -33 -11094 -15579 -10480 -4143 -6536 -3613 1516 3320 8024 2946 7810
3906 7810 1026 -6204 -11929 -6881 1746 -1700 -10871 -6764 641 -294 -7933 -12430 -20902 -13876 -10986
3891 -10986 -16870 -15325 -10037 -6362 -3642 222 -1416 -4092 -7346 -17892 -14621 551 -1121 7372
3877 7372 8489 -1622 -2578 -2140 -5309 -798 -6195 -6662 -2414 -6034 -2614 5598 8621 5576 -8542
3862 -8542 -19690 -12249 -1543 -1529 -11406 -4271 -76 -317 2726 -7427 -9756 -13236 -3772 11446 10258
3847 10258 8703 11553 13187 8339 3333 11096 5833 -2194 -7916 -7455 -5716 2011 6761 69 -3691
3832 -3691 -1860 -8082 -14601 -13122 1848 5845 6255 6200 7249 11282 12135 10912 5539 563 -7967 -18618
3816 -18618 -14095 -6245 -5073 -16143 -7445 12537 11197 1635 4870 11517 6702 10180 3165 -6465
3802 -6465 -3201 2859 -2818 -4503 -15057 -17619 -13246 -19540 -21037 -15527 -4316 711 3874 -4260
3788 -4260 -5399 -5040 -3615 3648 11965 13415 9010 12069 9930 13380 13480 1377 -4785 5070 3926
3773 3926 -2953 -3938 4792 7522 4380 2718 5479 9267 19080 21648 13112 5746 4924 1354 4839
3758 4839 21007 26858 17466 12189 4166 -5649 -4815 4612 1223 -8157 -8700 1739 6738 1643 445
3743 445 -1049 4410 12220 19951 17125 12215 9296 11107 17916 25826 26982 20570 4440 -8242 -7322
3728 -7322 -2622 -4714 -10796 -16060 -14750 -12012 -5052 -4144 -7747 -8581 2681 4970 -1607 965 7866
3713 7866 10102 9796 2662 -9630 -8877 -11403 -10149 -1955 473 -702 2791 -846 -4185 5273 6759
3698 6759 6350 6660 8476 6238 13757 4220 4669 13523 6963 2848 2694 -1393 -3448 -7557 -1292 1011
3682 1011 -2153 -9722 -4626 -6541 -5247 3298 395 -4375 556 3623 2383 4720 4654 -359 -6158
3667 -6158 5925 6387 5478 9416 10259 12429 13752 12446 -63 -6705 3595 11188 12550 8033 4602
3652 4602 2547 -6502 -626 -1194 -7962 -3552 -881 -6282 -5964 -9710 5714 4609 -930 -9619 -8092
3637 -8092 -2472 5600 10044 6121 -2182 -7976 -16703 -15581 -14683 -14975 -15859 -13963 117 13063 10339
3622 10339 9756 4967 -1523 4147 9141 4786 3129 -3497 -6864 -9978 -8762 -8235 -4350 5565 13593
3607 13593 18295 10162 5834 247 -473 12919 8039 4839 3891 7017 1762 -843 4516 -7865 -5735
3592 -5735 -4441 -14273 -16373 250 8335 7794 4738 4145 -1041 -7488 -6822 -17643 -10191 1018 -817
3577 -817 -11739 -19460 -18965 -8967 -6100 -1447 5066 2591 -3682 -1941 -1236 -8963 -10436 -3897 -2160
3562 -2160 3341 13163 13942 8929 9697 6908 7317 -1652 -1240 2391 6891 2656 4991 -2274 -3449 4024
3546 4024 -5663 91 -226 -8172 -10121 -12934 -10428 1141 12362 10135 -5257 -1003 -2481 -10855
3532 -10855 -7214 -9109 -14434 -10400 -370 -1895 -7736 -3895 -1251 -573 -5742 -8119 -1094 2372 -629
3517 -629 -7102 -10384 -8631 -5432 2250 744 -1772 -9000 -12555 -18672 -19435 -8649 -12730 -4443 -4809
3502 -4809 -1120 3533 8144 -4132 -1610 10190 17731 9075 7417 2461 2375 8776 3614 -8424 -15797
3487 -15797 -8518 -5332 -5120 -826 -4739 -9718 -15334 -9675 -379 -4446 -12302 -8170 6660 9952 6641
3472 6641 8178 3817 11271 6528 702 3012 1798 -5167 1349 -3857 -11025 -14395 -16841 -14976 -14423
3457 -14423 -3970 3367 1761 -1224 -2862 -3537 2484 9985 9304 -1963 5255 3028 2836 3981 -3695
3442 -3695 -6629 -5158 1911 -5746 979 -3660 -8617 -10984 -9411 -6174 -5579 4925 7885 9663 18420
3427 18420 12929 -2737 -98 6658 12011 3214 -7567 -14900 -11091 -2339 -3780 -1751 -6997 -6092
3413 -6092 -3215 -4609 -8944 -14285 -10839 -13716 -9374 -4505 1720 9105 2381 -2257 2174 7642 9972
3398 9972 578 -1471 -1614 -9370 -6838 -8732 -15311 -16830 -25992 -18127 -4349 6859 4359 7048 6289
3383 6289 4605 7741 10333 2155 1184 -1975 11978 16175 11459 8304 -94 -3818 -5866 -4394 1720
3368 1720 466 5001 4582 7454 9058 5077 1415 398 -7126 -2980 -5181 -1644 -1740 -288 -6805 -9470
3352 -9470 -3002 8114 5380 1089 5024 4206 -3175 71 6771 5502 5996 7605 10516 18544 17444
3337 17444 19015 13811 7795 15263 19667 14549 8010 3858 6287 8112 15657 21453 18407 10602 6831
3322 6831 8025 9514 13115 10047 -6655 -13999 -15028 -17860 -12458 -11410 -12721 -10533 -21350 -18971
3308 -18971 -10146 -3877 3195 10221 4158 -1428 -4165 -2366 -2584 4573 744 -1929 -4286 -16037 -23889
3293 -23889 -21805 -12617 -7331 -3069 -4353 -1990 1387 -139 -6696 -7587 -10160 -8680 -2686 5556 9433
3278 9433 15856 5165 -13343 -16010 -7632 -5971 -6517 -3895 -6663 -9476 -13227 -11672 -6094 -11440 -8898
3263 -8898 -9847 -15126 -953 10244 9791 5442 -5029 -11404 -5095 2440 8292 7029 12666 12694 8622
3248 8622 7087 -2639 -4193 -9377 -10646 -11849 -6383 5312 10300 4680 -1789 -1646 -2450 566 7476
3233 7476 8157 4690 8319 -548 -10466 -5650 -272 8159 6887 -6618 -1497 3665 -1782 -5921 -162
3218 -162 9615 3356 -7526 -4478 -4010 -3433 -3755 -9290 -14261 -12336 -6503 -2577 -8817 -12531 -9538 -6376
3202 -6376 -2988 1291 3891 7488 12002 9031 9980 8209 -371 1306 6755 9348 3713 7595 16209
3187 16209 9893 6895 1906 5094 7351 9343 -3415 755 4538 2788 -10015 -19125 -13161 -5234
3173 -5234 -247 9 717 1873 10531 12048 10432 6596 183 4180 5442 4412 10827 7194 2
3158 2 -12764 -22438 -20521 -16784 -24013 -21151 -16301 -19135 -33309 -32444 -11334 -2090 1485 2894 -7931
3143 -7931 -8554 -8642 -7761 -11906 -10847 -7325 -5835 -11169 -4289 4512 8567 7880 3063 440 -571 -1783
3127 -1783 -1557 -3778 -2718 3712 16276 18270 15716 11277 2085 -4992 -6468 -13492 -20555 -11521 -13670
3112 -13670 -20596 -17185 -12843 -17342 -12645 -8442 2181 9989 681 1872 5304 1574 5217 14468
3098 14468 3495 3368 -851 -5117 3435 5887 7625 2910 3640 5230 -2914 -1965 6765 3563 2821
3083 2821 12755 10273 993 -7704 -2585 6544 5542 3076 2802 7432 4813 -3210 -5364 830 -534
3068 -534 -42 -4201 -6851 431 -1671 -1724 6765 362 -3553 496 -2200 -3850 -7372 -3521 4596 4813
3052 4813 761 -1388 -312 -3332 -7931 -8433 -21072 -24958 -21256 -5142 -8589 -7569 -3911 6314
3038 6314 1089 3412 8985 2033 -3675 -1111 -2976 -2220 503 -4746 -12019 -7432 3489 6897 8358
3023 8358 2077 748 4774 -290 -11338 -11996 -882 2749 -3328 -8541 -1246 2549 10641 8843 5852
3008 5852 7889 7654 4793 3108 1083 6296 8608 -270 -4181 -6468 2418 3866 7142 8641 1843
2993 1843 -1506 1291 1154 -4092 -2121 1356 -4191 2087 11468 14179 11283 5203 -6143 -10361 -953
2978 -953 9766 7662 1328 -1096 2432 -1902 -13697 -21703 -22702 -2074 7869 8216 9033 6919 7180
2963 7180 3881 3582 1050 2335 2104 -6488 -5139 -4002 -258 -3150 -5892 -360 111 7813 3012 2241
2947 2241 6542 13006 7286 8135 6184 -6839 -12156 -8294 -3628 3570 3732 -3028 6011 6027 2647 3553
2931 3553 1469 2554 7243 9288 22314 19873 7805 8255 12489 2315 -3313 4113 1184 1505 -8095
2916 -8095 2289 3525 -962 1446 -5408 -19995 -19559 -13987 -6368 -4995 -8504 -2967 -1921 -12614
2902 -12614 -10991 -6972 -8172 1081 9446 13059 7060 3048 6382 669 272 4340 6451 5617 -4997
2887 -4997 -13964 -14957 -9741 -9515 -18833 -14382 1687 10923 3568 -1146 -9858 -11380 -10826 -4967 2478
2872 2478 -1554 -9014 -16148 -12631 -3600 1730 511 -4660 2626 8380 15827 14403 16560 18732 25711
2857 25711 27893 17859 -3584 -14452 -11896 -6457 -6799 -5388 -2804 -1222 157 4073 6274 -1189
2843 -1189 -3072 2413 3580 3812 5623 13618 14128 9300 9271 5893 -848 774 1475 556 -7522 -8253 -11896
2826 -11896 -14805 -21621 -22202 -17423 -15037 -21367 -17560 -804 -6783 -8050 -10337 -8634 -3207 4454 667
2811 667 -11807 -9247 -4610 -2935 1899 -261 -2063 -7465 3295 12703 13729 12112 1252 -998
2797 -998 -7615 -7385 -3826 4050 5816 -1087 -7960 -4535 10098 17889 10767 4390 1939 -3021 4238
2782 4238 9013 13134 10039 4868 7190 5551 -6060 -10216 -8028 -10835 -6179 -4584 -5421 -17688 -10083
2767 -10083 -4499 989 1150 -3256 -2321 -8201 -10072 -12030 -12577 -14029 -16126 -11350 2542 2747 -412
2752 -412 6476 6021 1310 -163 1237 4092 9386 7224 -657 3753 5685 4192 9354 9281 3626 -5190
2736 -5190 -14027 -15363 -17233 -19285 -17836 -13245 -6848 -1049 828 963 7285 2788 3631 4693 -974
2721 -974 -1834 3192 -897 2704 12957 17703 12434 10191 12505 10290 2129 -1742 -3799 -7186 -13530
2706 -13530 -10401 -9129 -5186 -8069 -7097 -4251 -6838 -3302 -9119 -6591 -328 7069 -3675 -8159 -7289
2691 -7289 6141 11914 9221 399 -5364 -9281 -4384 2240 1575 1237 4694 8779 6000 -4864 -5474
2676 -5474 -6850 -2326 -451 -1953 2718 9783 4929 -6591 -5400 -2897 -3831 2229 7345 8048 5498
2661 5498 -1902 -7267 -2345 -1823 -7154 -5191 -5251 3576 5256 -2447 2581 3068 2315 7017 3423 -4551
2645 -4551 -5785 1804 13968 20811 23824 2896 -9963 -9015 -3170 -1207 2177 7352 6874 12549 25766
2630 25766 29521 18311 5664 3354 8155 16101 19854 8642 563 2097 4891 6015 -768 -873
2616 -873 -1284 -10420 -9051 -3475 -609 -2974 753 2469 -4589 -6840 -2419 -3398 -2910 -2059 7417 7591
2600 7591 5083 1971 4839 -4879 -7362 1328 6201 1178 2765 13058 10887 6784 3411 4057 -75
2585 -75 -7507 -4526 -2895 -1973 -1112 -761 -11863 -9663 522 6062 3121 -3273 -12075 -20448 -17975 -4712
2569 -4712 8024 3017 2076 4911 2411 7404 13098 8264 6388 4599 1583 3323 -1013 28 -4491
2554 -4491 -8549 -20162 -19260 -10105 -13138 -9028 -7964 -6304 -14563 -11493 -2737 -4845 -17127 -20901 -21951
2539 -21951 -26182 -22861 -14730 -8900 -8066 -10642 -10045 -7305 -4024 -4880 -17241 -26698 -28807 -14977 -4341
2524 -4341 145 -2761 -1150 3303 5258 6364 2110 4380 8249 2339 -4521 -8384 -14033 -459 6923
2509 6923 -3708 1038 3570 -3518 -7690 174 10386 6933 4831 1691 -3389 -5534 -9570 -21648
2495 -21648 -23141 -15533 -16380 -10295 -13493 -5818 2427 3460 -38 -3317 -5926 -6232 -1355 2406 -3287
2480 -3287 -7699 -1822 3553 6199 9131 10041 6658 713 -2960 -9208 -13775 -4703 2633 -8905 -13757
2465 -13757 -8052 -2513 13445 9028 -7202 -14730 -13286 -6237 -1517 -3679 -7560 -2227 614 6788
2451 6788 13003 15682 7892 1658 -725 1636 1811 3638 2493 -9037 -10593 -8327 143 5199 1321
2436 1321 -3061 -5660 -14752 -15271 -11248 -7584 3440 15316 9106 308 4430 10728 11713 2093 980
2421 980 5433 5474 2496 6263 6628 9760 12394 -1884 -7153 -1379 -904 5404 9541 15563 24674 19087
2405 19087 10885 3471 -1122 1066 -87 13875 15111 4789 -5979 -7928 -4479 -3578 -8660 -3305
2391 -3305 971 6618 12180 1774 -7280 -1209 5584 7466 11822 12741 16593 16344 4924 1367 1368 15465
2375 15465 13906 2225 -8933 -6539 -1065 8135 7932 1983 4005 387 -833 -9236 -711 8724
2361 8724 6674 -3721 -1087 3441 4741 11102 10205 6652 3772 4323 2892 10429 2005 -8494 707
2346 707 4078 3662 3930 -4085 -10219 -16700 -6358 1842 -4836 -8428 2557 16713 20657 11987 -4630
2331 -4630 -1705 1005 -3531 4479 15859 13715 1854 -569 -5529 -12155 -1244 8583 6783 175
2317 175 -1070 6722 8231 -3648 -5274 -4089 -4160 -6820 -12025 -8357 1467 -2540 -4646 -577 11488
2302 11488 8956 2959 11999 10286 10731 7209 1018 2374 -3838 -8217 -9490 -14035 -12978 -12626 -12908
2287 -12908 -6008 -13036 -10927 -8437 -8856 -13462 -16324 -10878 1671 -1881 -15981 -11694 -1877 5238
2273 5238 12173 16717 13951 5874 5304 17868 23971 21395 13756 14393 3083 -1888 -5152 -3244 3239
2258 3239 9839 5719 14823 6041 1207 -6535 -7981 -5870 -2467 4481 1790 -10114 -13841 -6731 -3322
2243 -3322 7536 9468 9651 8866 -105 -685 2862 5337 12076 1 1813 2458 -2353 1168 32
2228 32 4404 2851 -2420 1595 6393 4231 3626 14954 18643 15017 12152 14207 9937 7413 -1864
2213 -1864 -13000 -13897 -16226 -14885 -11421 -16248 -20031 -8299 -5536 -5744 -2273 -1678 -4330 3067 5536
2198 5536 3291 5657 2473 -3654 -5503 1984 -2092 4604 7356 9255 11576 7850 7021 366 -6813
2183 -6813 -5397 -1812 -9721 -10578 -3330 1175 -6073 -12797 -8914 -2652 2354 -5810 -2578 945 4799
2168 4799 493 -7823 -3465 -2941 -464 4691 -7355 -5423 10123 4934 -6030 371 -4170 -5676
2154 -5676 -4896 -4071 -3208 3918 8419 13127 9615 12573 8664 3318 697 9095 7118 8065 3336 1026
2138 1026 -8789 -14323 -9303 -5929 1631 10386 11718 8914 681 -3228 -11364 -11419 -3467 -160 -10288
2123 -10288 -17222 -16660 -10050 -10498 -7571 -12050 -11542 -14817 -12379 -16688 -10304 -13915 -19149 -19039 -6182
2108 -6182 -1886 -3283 -7162 -1372 -458 3897 6427 7768 3180 -4446 -26 1828 8664 8180 10061
2093 10061 5908 554 -6706 -7931 -3224 -2767 -4483 -10092 -6163 -5648 -6934 -9943 -10573 -14245 -11441
2078 -11441 -10038 -9935 -892 2593 1679 -2632 2564 5090 10182 4548 5981 1324 3139 8736 4878
2063 4878 9103 16814 22793 21783 7883 -2174 -10754 -10236 -1320 11332 14286 15238 17467 12112 5200
2048 5200 958 4923 3234 5650 11868 19228 8722 682 -11910 -26671 -26870 -18643 -17100 -4588
2034 -4588 6009 7921 12119 12126 12234 18658 13365 11925 10241 12698 14294 18625 20032 21375 19129 20683
2018 20683 13834 6914 5839 7991 7200 3963 2544 5867 3965 2797 -2355 -846 7598 10362 8213
2003 8213 -4601 -10309 -12461 -14217 -6784 1225 7599 4008 10848 15231 9481 6480 1669 4902 2114
1988 2114 -1015 -2210 2515 3770 4641 -1926 -2547 -6880 -11130 -12716 -7824 -4470 5985 1871 -3458
1973 -3458 -3068 -5719 2034 2669 3127 11892 5908 -2655 3291 4217 5585 7384 11129 12674 10949 1968
1957 1968 12889 10374 3811 2991 3358 1712 4457 -2222 -1981 5134 -3541 -9440 -5404 -7229 83
1942 83 5532 7470 9245 11119 10642 10949 17209 12400 14582 15974 10022 14526 13637 8776 13211 15140
1926 15140 13040 8458 -4851 -8633 -5351 -4441 5044 17263 13007 6142 982 1364 2013 6121 5619
1911 5619 2940 -1091 -10872 -9164 -1992 4378 7046 6056 6310 -4254 -5271 7675 12019 6628 8755
1896 8755 10238 15880 16614 11658 16732 23781 29505 26435 11893 6084 3522 -8346 -5333 -2133 -203
1881 -203 -3002 758 2346 871 2646 7242 10380 11345 -1580 -4002 -3902 -2540 6592 4729 2714
1866 2714 6434 4225 -7604 -10652 -11858 -12294 -5251 -5660 2277 8388 -806 -9757 -8159 2931 16686
1851 16686 19415 8723 9362 24661 20689 11403 10238 13012 10198 7882 2946 -1767 -2217 5412 2961
1836 2961 5217 6345 5942 -323 -4413 -6992 -1690 -6156 -1930 5285 5270 5693 -2675 -15846 -16888 -9771
1820 -9771 1655 6711 3649 7132 11970 5086 7263 14063 18621 20327 9786 8668 6111 112
1806 112 -3677 -8271 -10889 726 5859 8199 11876 5110 1516 -660 4489 5730 3526 1307 11242
1791 11242 16046 13838 16207 13714 17628 14540 840 -8618 -9326 -6513 -4504 -1942 1005 6129 9188
1776 9188 9471 -9747 -7588 -3422 -2501 -3635 -206 8276 11047 7107 5678 7161 4117 1987 2451
1761 2451 -3421 -4999 -5482 -5117 -5319 -2748 -1123 8756 6062 -7598 -11939 -11251 -12652 -14323 2404
1746 2404 11426 8620 1947 4588 9362 2502 6499 3708 4700 6191 2777 -2018 -1405 -1762 -2447 -505
1730 -505 8367 9282 6011 7106 14742 12558 12361 1054 893 6514 1188 -14474 -15130 2655 2615 6859
1714 6859 12428 12098 1590 109 6462 2235 -1170 1638 3475 -7935 -9930 -14507 -15261 -1674 5947
1699 5947 4754 -3060 -3998 -7537 -10558 -4936 -3921 -6621 -8552 -12857 -18103 -9366 -1548 -1458 2895 4499
1683 4499 6249 -3607 -3553 1408 -2974 -1022 9131 19895 22561 18698 7382 -8197 -718 6484
1669 6484 1068 -1313 2966 3943 2610 -3564 2461 12186 8745 209 7595 2190 -3669 -13566 -10625
1654 -10625 -11874 -14332 -12242 15 4483 8647 5185 9869 12691 7708 5079 2052 -8602 -11008
1640 -11008 -4416 -424 -1216 2713 8355 7409 -3320 -4078 10999 10640 -544 5525 12976 13940 9616
1625 9616 3006 556 -1876 -11243 1663 10082 4140 860 11308 7632 -2815 -7393 -8177 -2580
1611 -2580 -739 11313 18444 11270 4065 -3283 1773 4714 9551 6551 5087 7601 -2290 -3239 2868
1596 2868 1133 -5488 -2434 3729 10044 9689 10000 2583 -2013 -6399 -11158 -15165 -5474 -901 -8433
1581 -8433 -7071 -5597 -5332 -505 347 -3759 1645 4276 -5681 -5622 -1444 1130 -63 7945 1939 3068
1565 3068 5864 295 -1672 8918 15614 7475 569 -8718 -9316 -5706 -3863 -8612 -4846 -10602 -9022
1550 -9022 -6145 -15658 -14054 -7432 3114 10806 10697 -498 3039 5984 11262 5990 -5412 -9758
1536 -9758 -12373 -2962 -1878 -780 -3266 -13029 -15591 -16265 -6515 -3202 -2314 -1083 -2039 3380 8896 13208
1520 13208 21417 18143 6653 12903 14232 12581 7842 1342 -2956 188 -5863 -6569 -5666 -10157 -11482
1505 -11482 3060 17701 27948 25789 14565 12264 17028 17829 4678 -5727 -6027 -1798 -2881 -4678
1491 -4678 2079 4411 -10058 -11636 -11479 -21338 -18079 -4900 -1666 3677 12297 21923 13513 13603 9112
1476 9112 2916 3172 2935 2055 -4924 -503 5887 12126 8818 3656 123 5112 -35 -7004 -8923 -548
1460 -548 6983 15508 19439 20332 12373 4402 653 -9282 -20148 -16441 -10248 -15187 -10186 713 -8720
1445 -8720 -14063 -8720 -476 13714 19899 20559 12992 13867 11640 3221 -2288 -6537 -771 3198 6623
1430 6623 10661 13658 14020 5993 6705 16618 19468 17378 16781 2400 -2001 49 -5388 535 -5739
1415 -5739 -5638 2120 4354 873 -2033 4771 9211 326 407 7719 1616 -4685 -140 8964 14921 10393
1399 10393 7313 18756 24725 27747 25793 28359 32740 21140 12969 5288 5059 10531 15781 18038
1385 18038 14017 4624 -4250 -3147 -1112 -6672 -9215 -4554 5814 2430 -3293 -9269 -13438 -7402
1371 -7402 -3095 -13570 -12872 -3154 3118 2086 2748 877 2742 -215 -679 -3509 -4343 9140 10929
1356 10929 10932 15223 27151 27252 13768 5323 1470 2361 4677 1460 4117 1171 -3288 -3320 1634 -7113
1340 -7113 -17639 -13967 -1744 4701 1158 7966 8656 2301 -11383 -10326 1035 4328 5315 6780
1326 6780 7811 -1984 -8292 -8896 -12350 -15085 -6953 -2257 -583 -6484 -2249 6570 2624 -145 4598
1311 4598 -818 13550 4694 -3266 -4148 688 7937 7428 7463 2085 -4581 5112 18487 10322 9193
1296 9193 5233 1144 -367 -3077 8914 12107 12828 3671 2635 2100 -11114 -12993 -8993 -1060 -4943
1281 -4943 -2170 -4090 -11854 -13024 -11845 -2684 -145 -3236 -14908 -14930 -7641 -443 5879 14417 11907
1266 11907 -913 -7133 -10966 -1921 120 -8562 -14204 -6930 -9010 -13548 -11522 -9230 -8561 -1855 -12096
1251 -12096 -18725 -12953 -7804 -13308 -10897 -5534 -8039 -11200 -11497 -3760 -5729 -6751 -6194 -13289 -17639
1236 -17639 -9818 -3340 -2538 -5796 -4859 279 -8572 -3630 5139 6638 6295 11426 15462 15882 10207 15693
1220 15693 11525 3342 -3097 -9095 -9367 -4288 -5087 -9275 -10852 -11545 -7132 1094 2544 5256 8232
1205 8232 16258 8671 7862 13823 13113 17313 8806 8044 6938 -4032 -9627 -871 2935 1764 5165
1190 5165 1110 6363 -1092 -364 -165 -11693 -7118 -5560 911 4270 3586 -2979 2464 3153 -1424 -7658
1174 -7658 -3397 191 -218 5963 10131 1580 -8823 -11697 -7693 -907 6917 13632 13435 16225 15376
1159 15376 18767 29040 27618 11531 5514 4177 4491 7459 3862 -3218 -7182 -2939 5418 4224
1145 4224 6369 6267 -4416 -11201 -12842 -15632 -11650 -6501 -11189 -12912 -12086 -11968 -1116 -2161 5888
1130 5888 3765 5851 10391 9244 -262 -6261 -7421 7685 8165 1020 -10165 -16791 -8001 7038
1116 7038 6469 2726 587 3353 -3138 -1370 4565 -8904 -13586 -8595 389 1412 -2377 1286 -3394
1101 -3394 -6826 -8981 -6062 -2643 2230 -2374 -12655 -20022 -14173 3957 6406 1774 9503 14507
1087 14507 12112 15529 17564 16593 10177 10228 5455 3741 3277 2910 6357 5906 6688 7606 4476 1863 11820
1070 11820 5489 -3538 -16336 -23551 -10342 -3384 -1385 7037 8107 3598 -6909 -4592 -4441 -5887
1056 -5887 -4748 -10446 -9097 3433 5752 7523 2606 1199 12274 15089 12565 15623 21535 18704
1042 18704 10488 3678 3077 5133 8587 9318 9196 7473 1362 8165 15652 13991 10676 1801 5771
1027 5771 7739 -2831 -6997 -3669 -4336 -4052 -5872 -9317 -5289 -460 271 4190 4466 5815 7674 -812
1011 -812 -7975 -8713 -12681 -14155 -16113 -10419 -12656 -8019 4610 9902 15489 7374 2909 6952 5366
996 5366 10119 15944 14183 7487 7113 14966 16240 2151 4651 12594 3060 -6348 -16059 -10586 -3644
981 -3644 -2807 -5081 86 4399 1832 -4481 -10736 -11922 1498 5329 7445 7836 11547 18527 14830
966 14830 17312 16240 9900 8524 11508 2618 6221 11520 8193 12474 6576 273 4672 -1140 -710
951 -710 564 350 755 -3307 2381 2581 8894 8419 4837 4282 384 1467 880 7340 7547 -749 -4512
934 -4512 207 -3898 -10484 -27027 -24459 -14085 -16612 -12853 -8037 -6651 -15397 -12200 -3803 753 2624
919 2624 -3170 -1458 10548 11671 11606 8841 4249 6566 6683 3160 5113 14870 9486 5339 3360 3137
903 3137 -8348 -11495 -9147 -881 3876 8976 5751 516 -1886 -6548 -14523 -15222 -12476 -7675 -3483
888 -3483 -7990 3570 13989 3803 -2488 -1868 -2553 -8438 -9445 -1891 3058 6194 10917 8874 6762
873 6762 6182 2458 4256 10085 8762 -1424 -1185 -1777 769 -2500 -4649 -2777 11036 12324 9112
858 9112 14160 15950 20656 8506 3884 6317 11360 8225 124 13724 17814 16866 18356 26427 28101
843 28101 20900 13875 16338 30148 25580 15525 8819 16814 11901 -273 -17208 -18583 -14092 -5590
829 -5590 2900 5394 -5833 -9925 -12154 -8787 3064 6446 5602 11323 19649 20337 22160 17870 21625
814 21625 22772 21719 22862 22583 21814 22605 13857 4512 4169 1980 -7405 -2019 4022 7512 13993 17931
798 17931 12372 12193 13970 6295 -255 54 -338 110 -65 -3481 109 2905 3616 8532 13456 12948 9947
781 9947 7864 7298 2622 -10410 -11241 -6303 -880 692 2369 -4568 -6301 8945 14479 4126 5110
766 5110 6428 1753 3475 7657 12430 15443 25155 32044 20003 22484 19438 9214 10245 951 -1959
751 -1959 1626 3469 1875 1356 4139 8720 15252 16154 9896 -2526 -805 -49 -1650 8902 19747
736 19747 14132 -932 4065 7630 6710 4661 6952 11477 11215 11281 14617 13636 3697 1626 -5204 -3440
720 -3440 -466 3494 -637 231 -4060 -785 7517 15990 19041 20683 9581 7464 3979 10106 9016
705 9016 4823 5742 5197 13315 21112 24007 22213 22365 14279 17296 20039 14173 9738 11763 7672 5471
689 5471 7203 10544 14751 15022 13583 14168 18683 15672 12333 13254 17142 16326 6139 856 -1641 -692
673 -692 5201 2788 21827 24878 26402 22466 18137 12845 9731 14179 21851 20772 19793 14685 13152
658 13152 15285 21377 17505 14446 17662 20527 25024 26667 22383 23584 30049 17633 9280 3835 104
643 104 5754 7366 3323 8110 10250 8548 10655 6829 3429 4498 8994 13043 15714 21945 28572
628 28572 21121 11888 5620 6940 8538 1744 -3895 -219 3614 5991 12977 11696 10240 -362 -3621
613 -3621 974 -5516 1423 -484 -4403 1611 6881 8126 3110 7202 9920 6149 5352 7345 5400
598 5400 -1838 -8134 -11368 3279 11139 9205 5767 10662 8354 1902 -1542 5312 13852 8966 5936
583 5936 6644 2208 -2332 3384 14348 19332 17159 11837 9471 10272 11369 10920 6085 8395 4799 1626
567 1626 479 6845 12544 10630 2471 -1155 -306 -705 -4963 -1142 4053 9830 3880 2978 10897 18513
551 18513 18180 8274 -1452 1477 8208 9385 7922 13001 24699 24569 21914 8563 5147 4186 8481
536 8481 10125 9256 7050 933 -4724 3684 6529 1566 -731 13713 16578 14201 13727 5131 2995
521 2995 -1035 4749 14089 18949 17372 15342 14189 25677 27856 22107 23270 14273 9479 9027 6311
506 6311 9688 1488 -6543 -1693 4366 -300 -4359 -1245 7098 14797 12852 18642 25688 30880 23042
491 23042 18510 20387 20167 14900 9386 7900 7815 16121 27372 28358 10586 -3861 -2863 -680 8052
476 8052 11286 10338 10372 8509 12310 14062 14872 17501 22479 18609 14041 6772 4970 3660 7999 18626
460 18626 17013 10997 -6127 -10930 -8962 -290 5491 9207 20047 18964 14369 9754 10874 18976
446 18976 17675 20034 24819 9245 4049 6295 6826 7444 9710 10317 7726 4787 2568 -1301 9133
431 9133 16081 21797 21691 18132 14602 15718 14793 7566 7587 3794 1272 -1418 1625 8021 8086 -594 175
414 175 -370 -4409 -4027 7667 3330 7680 2707 1939 2733 8643 9849 9968 4741 1044 3892 8527
398 8527 12194 15950 23351 18533 15438 3790 766 15245 19332 26909 23244 20427 10254 5624
384 5624 8542 5959 9984 10305 4081 -1931 6125 9359 4382 -594 7560 8925 20972 25740 16175
369 16175 14052 15647 19549 15452 17293 15856 11355 6119 7343 12106 11260 6472 8686 4555 3000
354 3000 11096 10543 6074 17940 20704 10896 8108 1080 -3412 -10100 -2791 2348 746 3348 -99
339 -99 3023 5375 9593 4895 -1009 3418 2865 5651 6495 5547 6532 9026 15632 8245 833 2618 10813
322 10813 18367 22054 15427 8417 7318 12274 11342 10842 72 -5210 3199 3862 2313 4365 7165
307 7165 10179 7979 11888 16692 15176 17285 19441 18243 11831 7447 12286 7911 -6826 -9140 -4363
292 -4363 2743 1753 1451 2538 14275 20228 16346 16603 16725 22303 25232 13915 12468 10503 4310 6310
276 6310 14810 12724 9697 8513 3239 3137 10747 18084 19866 15862 5698 872 9248 11883 10196
261 10196 13983 13778 11497 13751 14866 9882 9551 10726 14105 22478 21497 25363 25068 24876 21834 20729
245 20729 22749 17754 16559 21489 19058 6585 361 527 2645 7339 12541 9652 157 6689 9809
230 9809 4921 4091 2061 -2623 8875 5633 3500 10972 11238 10075 14215 13092 10882 8827 9829
215 9829 14265 8179 9730 10570 5479 2352 417 316 -3883 -5611 -4142 7444 17762 12725 10902
200 10902 6998 3286 2275 4785 -2738 -5362 -173 8511 6550 1844 7555 9994 9798 17589 16139
185 16139 11430 6443 6212 10483 11768 13660 19443 21606 12146 11412 11912 7717 6383 6374 7996 16884
169 16884 13558 10975 15168 16705 15284 12631 12699 9497 6099 5194 4505 -377 2219 10515 12872 15496
153 15496 5006 2587 5166 3323 6377 11915 11440 13256 13927 16543 14853 15387 11534 5783 5230 8227
137 8227 5196 -3063 -727 923 2525 248 495 553 1441 973 7953 6894 6457 7584 9503 6603 4183
120 4183 1494 4173 10101 14387 16714 15860 16550 11989 10884 11829 8385 7364 8628 9254 120 -10472
104 -10472 -5955 6198 12874 13683 7551 4394 2833 4494 3372 14858 24128 22360 17632 12748 15510
89 15510 19087 23112 17454 10366 11857 13129 11616 13637 6749 6361 9785 6681 4005 4107 3985 5118
73 5118 10511 15798 18056 20370 23588 20801 12275 2674 7222 12769 14811 17755 21170 21260 15263 10330
57 10330 8414 8141 6380 5609 9876 13068 7995 4141 5444 7616 8520 6973 10434 16203 16195 10072 11962
40 11962 11088 17121 24076 24536 20130 14363 6885 5456 2669 489 10856 13375 11275 7954 133
25 133 2364 4657 6055 11328 15766 14133 11685 9844 6520 12679 12952 11057 14586 7798 8852 12147
9 12147 10877 8006 8697 7503 1745 -3666 -4909 -4516 1299
0 1299
$$ Imaginary data points
##PAGE= N=2
##DATA TABLE= (X++(I..I)), XYDATA
32767 28621 29070 29912 33850 39693 32367 23084 24630 25918 22451 21104 27964 33262 35221 39939 43353
32752 43353 46959 42839 40613 46282 44847 41186 47552 46217 45003 51032 54806 51235 45248 42857
32738 42857 47270 43185 43693 36914 32220 35442 35201 33216 45077 52521 53062 57869 58564 55886 55851 51716
32722 51716 50408 56328 60544 62781 53401 54765 60543 60362 55551 54391 50513 53251 60173 54057 56196
32707 56196 58727 54059 53441 52119 56152 53211 47259 51968 61181 54411 53455 58397 55554 61020 68789
32692 68789 69164 67386 71795 75648 78883 75626 71335 69327 63750 62473 66429 71700 78390 74252 77779
32677 77779 76181 69877 68434 74090 72886 75281 75505 75343 75141 78339 72581 70240 73215 69090 67040
32662 67040 70820 72533 71099 72457 71698 70210 74580 75305 78481 81291 75409 77725 72985 72902 86281
32647 86281 88789 84379 86664 86237 86743 89262 81349 74265 73340 77160 80363 86514 80652 75186 77352
32632 77352 80524 88064 91580 89872 78249 78151 88669 89513 80705 82725 87496 87272 83573 79259 81233
32617 81233 84072 87924 92583 91848 97498 96299 90620 89658 88668 87749 83436 83381 96149 106976 103813
32602 103813 96915 95496 88176 89640 89900 91337 91611 91371 92446 95102 94390 101253 108304 113507 114092
32587 114092 111395 110368 109973 110501 104127 107257 104208 102199 98351 101166 106361 107647 102541 97856 107290
32572 107290 109180 107353 99949 103409 109787 111286 111866 109509 111149 107965 107201 107005 109555 98927 99152
32557 99152 104469 107544 115138 125956 131267 126654 117667 115710 105861 105860 111419 112893 119609 122599 119413
32542 119413 116160 105841 106722 110784 115538 120053 127798 131866 126369 114800 114870 122903 124842 123126
32528 123126 123000 127600 126590 125938 128261 130365 130945 126512 124008 120664 114303 118679 125651 128143 130917
32513 130917 128691 128428 138902 144621 128059 123711 123953 128013 130635 136793 134586 129751 128378 130403
32499 130403 124419 123003 122501 128207 132827 131203 126556 127178 129866 124648 118756 125579 130542 130607 133811
32484 133811 131911 128707 134667 130180 130484 138263 139224 140995 141648 139979 131541 128283 130483 126287 119221
32469 119221 120697 131617 133797 127382 122250 130093 131576 129532 132647 144713 150127 154074 151669 141194
32455 141194 139185 134751 131219 131113 131306 134438 149097 154207 142206 132673 136577 136267 135871 138564 143128
32440 143128 141767 139842 132902 132909 139754 147086 154670 161230 170883 171591 159399 149503 148451 135705 134622
32425 134622 138218 139722 146080 148515 138116 130347 140086 148520 155794 152863 146664 144764 143636 148338
32411 148338 155392 145848 147302 149225 153761 148840 147102 148681 158059 159214 155539 152494 148583 154182
32397 154182 160852 159468 151171 152291 143880 152128 157370 154601 148181 141515 142994 147568 151192 160896
32383 160896 162116 161536 157133 154046 151153 158229 159525 153290 152266 161999 160468 160131 151055 143740 142566
32368 142566 142251 135527 135009 138249 140829 152808 169852 172422 161093 155682 161854 157344 159735 162311
32354 162311 167952 176230 170398 162588 167809 165477 156616 154641 148369 143827 144261 148142 158005 160698
32340 160698 157064 149000 133337 139666 147925 154977 156853 154086 162502 163691 166983 169407 163154 160336
32326 160336 163490 168542 171469 171530 165029 169417 168380 169015 167303 168321 160493 155035 150955 163705 171004
32311 171004 167848 162688 155429 155346 144071 138635 148933 157367 164372 167288 174059 171126 169778 170663
32297 170663 171295 160949 154330 161843 170937 169825 167862 163742 168306 166408 169196 174758 178047 180147
32283 180147 171417 180851 186751 181652 174968 165217 159236 163063 158399 157348 159019 156250 154277 157717
32269 157717 158975 154863 154641 151865 146599 153241 164224 165598 167608 167581 169877 177153 174991 174567 188210
32254 188210 189316 190217 185322 178346 171901 172752 163554 174752 174032 165205 168678 170595 167391 168436 168761
32239 168761 168946 162805 162439 166305 173231 176442 156825 153022 168976 175344 179378 183409 181428 180925
32225 180925 187451 179237 172091 170203 171768 173492 176517 168480 163600 173947 163042 157619 166823 178299
32211 178299 174840 171638 180157 182990 175130 168934 161649 159568 164802 155462 157011 167749 157903 157906 159995
32196 159995 161962 160544 155546 158510 163203 164651 163114 166867 169833 175925 180761 183115 186977 178502
32182 178502 161403 158556 167003 164975 162195 157786 155358 159317 158075 154779 154386 158049 157375 161829
32168 161829 166350 168658 167738 178084 191432 190423 181190 179877 177489 171419 170818 171331 160969 162362
32154 162362 169015 178958 179089 176780 179192 179595 172961 166753 162962 171277 171979 169956 175106 184777 186931
32139 186931 179520 176849 177287 167612 162889 171989 185096 185580 187825 180980 176429 177060 175432 181246 184472
32124 184472 184072 179265 176412 178756 181301 196064 196231 179505 170591 169721 167305 151654 158060 169174
32110 169174 167144 176494 178043 183988 198614 202567 194003 181647 176765 180136 174914 176043 181581 180018
32096 180018 167757 162601 158423 162832 172630 181023 177089 173849 177126 172246 162616 158296 163652 164633
32082 164633 166507 172910 182487 182243 190030 189591 189782 188725 188048 189747 186859 182011 185803 185958 192412
32067 192412 189502 183136 180284 180379 188850 189963 186910 187202 188597 176615 179077 180728 181506 175852 172056
32052 172056 172197 175989 184164 188019 182436 177316 179064 177619 182397 184870 179141 177102 180243 185526
32038 185526 186496 185338 181743 179875 185790 179639 184464 190453 190671 186466 189892 187478 191551 194169 198543
32023 198543 195636 185231 182929 187271 185954 190636 191060 185596 182340 174437 161649 161777 171374 167148
32009 167148 164727 156264 155569 161154 174534 174982 176832 176876 171007 164580 162304 166836 176577 195644 198798
31994 198798 190907 178082 169679 180291 184709 175979 169910 174462 177940 178889 174925 166283 165954 172115
31980 172115 170648 177579 184211 181789 179852 174616 172470 178187 182213 181638 180781 169939 167927 164357
31966 164357 165766 168301 176309 179285 177365 170759 163147 162333 175233 179648 182474 176752 177582 168836
31952 168836 148093 146228 161371 165857 168020 175192 176298 175430 171346 170303 176685 174861 173417 180735
31938 180735 181014 181219 179397 181113 185066 181241 178689 183583 186898 182656 172250 167783 177676 172086
31924 172086 180847 186743 177693 174436 171419 176808 182610 184380 182879 182537 181627 182816 184040 180195 182341
31909 182341 179986 174463 179490 180061 179186 173561 170440 172295 184717 190751 187910 185333 187501 187688 181063
31894 181063 176065 179723 177349 176645 183685 175183 169657 183094 189711 179981 179155 181307 186296 189431
31880 189431 186311 191688 190809 184849 182451 173523 166337 176448 177186 176100 180555 178534 171310 170768 172428
31865 172428 169293 169660 175292 171850 167475 167828 174108 175442 171252 170533 163220 157938 164681 163177 160354
31850 160354 162854 166137 180822 183788 174334 179235 181034 184694 186645 187442 188126 187965 183130 172958
31836 172958 170844 169394 158474 159402 165247 176013 182027 182472 179244 172535 179038 177705 169446 172254
31822 172254 175731 177534 173807 173049 166049 158573 160888 161774 156828 168121 178764 172156 173169 176475
31808 176475 171170 171786 173071 173355 174829 173504 171580 165283 164418 170749 175682 180061 175975 172090 163789
31793 163789 169298 185305 188508 181911 181509 178658 183218 187245 179435 178258 182951 182735 187705 185764
31779 185764 187127 177917 163474 161252 158333 158953 164626 173858 179538 184875 182439 182486 173301 169841 169322
31764 169322 167616 173117 177037 175796 168969 174050 172797 168164 167381 160453 157396 174107 176040 173611
31750 173611 181778 172723 177963 180440 175460 177795 177217 164752 157766 162197 172816 171953 173560 180127
31736 180127 182576 172566 168798 175688 185159 191037 197040 201716 196378 188138 184758 175975 175289 169556
31722 169556 172129 184970 195761 192629 189835 179891 179040 179230 170300 174845 176768 178807 181084 177351
31708 177351 175066 185067 189200 185513 190162 188900 184799 177125 170854 169911 171975 178201 180844 175945
31694 175945 170360 176052 173586 169840 173568 176435 168325 176593 172698 169233 176400 178715 180379 168524
31680 168524 163734 167933 176858 178962 175688 173185 172874 176329 179591 180706 170005 167839 173419 172614
31666 172614 164044 153368 153930 170273 161533 158307 167173 178457 181931 178596 176081 173318 176886 184630
31652 184630 190388 185742 190650 198670 195588 193512 187093 191830 182243 181155 179556 175043 176572 177035
31638 177035 178270 176746 176580 171294 165948 165399 174033 180229 171615 167343 167895 163720 159847 167508 167526
31623 167526 168552 170057 169059 180360 189059 196279 193474 188773 187233 180766 172816 176836 174318 178531
31609 178531 180578 179388 175281 179781 186126 183578 176263 180646 186272 181960 169884 165896 176856 175498
31595 175498 175687 178813 167015 153003 148655 152417 155169 163133 169155 168555 163144 165132 172081 185317
31581 185317 187295 184533 181177 182215 170769 173131 180192 180433 185467 180238 168975 169397 178538 181388
31567 181388 178420 182853 177555 178150 177605 175091 169996 170268 174257 174295 173502 173807 172907 171689 168027 160927
31551 160927 156422 167356 178214 177317 180012 166576 164141 170888 178280 180861 178440 174817 171564 170526
31537 170526 173936 173795 170681 174591 179152 177260 174267 169304 174364 178209 162391 156554 169954 183540
31523 183540 181181 170300 178061 190607 187328 187800 174713 170905 174947 179524 181123 172041 169229 175175
31509 175175 183440 182074 180806 181157 179364 178894 178479 178003 169423 172440 179801 177022 173410 168854 173470
31494 173470 188697 194382 188045 183604 176966 180480 172001 176212 174517 169518 172219 178231 185738 188791
31480 188791 177343 181367 177458 178609 175092 173245 169202 169721 167773 171845 181598 182247 179121 180253
31466 180253 179635 186793 181281 174717 178683 188018 188329 185462 181369 188142 183329 179604 169737 166088 164619
31451 164619 170596 176240 170777 166369 168820 170105 173751 174276 173138 171154 171437 180882 184223 182001 177727
31436 177727 183309 186672 182539 176298 178480 174768 179785 177456 176551 176175 183037 177266 168401 167074 161105
31421 161105 161937 173302 176198 174554 181467 184799 182228 178419 171153 163661 168156 171202 185987 193480
31407 193480 187277 184568 183495 176645 177942 172075 171985 180736 190528 179329 184629 188707 183947 176578
31393 176578 179881 181604 184588 196575 186657 178987 187701 189002 185776 177239 171009 178172 179429 171046
31379 171046 173098 190878 200361 191261 185285 173212 169495 169586 174700 171012 174727 173912 178248 173877
31365 173877 171812 175169 182168 190369 195441 186952 179390 188764 187316 176821 174956 184796 193333 190318
31351 190318 180717 174969 176961 181239 182883 183314 181978 185239 186921 186442 176822 170467 169450 174357 169639
31336 169639 182940 181585 173216 166792 178749 183274 185992 189948 188040 185527 186726 181029 175275 172356
31322 172356 170767 165662 167310 176741 177743 180508 177944 178378 172003 168887 173591 179401 183288 188651
31308 188651 186364 177634 179875 178429 171978 165866 165909 180268 180464 178249 170417 173871 179543 187620 183325
$$ [...]
##END NTUPLES=NMR SPECTRUM
##END=
