##TITLE=Analysis number 325918
Compound Code cc 59504
Book Reference 508/34/5/6
Project Code adrs
Chemist Name antons
##JCAMPDX= 6.0         $$ Bruker NMR JCAMP-DX V2.0
##DATA TYPE= NMR SPECTRUM
##DATA CLASS= NTUPLES
##ORIGIN= Bruker BioSpin GmbH
##OWNER= nmr
$$ XWIN-NMR		Version 3.5
$$ Fri Jan 19 09:00:48 2007 GMT Standard Time (UT+0h)  MAYBRIDGE\nmr@NMR_250MHZ
##.OBSERVE FREQUENCY= 250.131544655141
##.OBSERVE NUCLEUS= ^1H
##.ACQUISITION MODE= SIMULTANEOUS (DQD)
##.ACQUISITION SCHEME= undefined
##.AVERAGES= 16
##.DIGITISER RES= 18
##SPECTROMETER/DATA SYSTEM= dpx250
##.PULSE SEQUENCE= zg30
##.SOLVENT NAME= CDCl3
##.SHIFT REFERENCE= (INTERNAL, CDCl3, 0, 16.522)
##AUDIT TRAIL= $$ (NUMBER, WHEN, WHO, WHERE, WHAT)
$$ ##TITLE= Audit trail, XWIN-NMR		Version 3.5
$$ ##JCAMPDX= 5.01
$$ ##ORIGIN= Bruker BioSpin GmbH
$$ ##OWNER= nmr
$$ C:\u/data/dgb/nmr/ADRS/1400/pdata/1/auditp.txt
$$ ##AUDIT TRAIL=  $$ (NUMBER, WHEN, WHO, WHERE, WHAT)
(   1,<2007-01-19 09:00:26.46 +000>,<MAYBRIDGE\nmr>,<NMR_250MHZ>,
      <created by zg, POWCHK disabled, PULCHK disabled
       configuration hash MD5:
       49 4B E0 1D 92 C2 6B 37 9F E6 65 BC 52 41 86 1D
       data hash MD5: 64K
       00 34 0D A2 E1 BB 1D 04 86 12 D5 18 6C 69 73 2B>)
(   2,<2007-01-19 09:00:39.02 +000>,<MAYBRIDGE\nmr>,<NMR_250MHZ>,
      <Start of raw data processing
       ef LB = 0.3 FT_mod = 6 PKNL = 1 SI = 32K 
       data hash MD5: 32K
       AF A3 A0 39 76 11 09 A6 22 B9 B9 89 45 9F DB 26>)
(   3,<2007-01-19 09:00:40.68 +000>,<MAYBRIDGE\nmr>,<NMR_250MHZ>,
      <apk 
       data hash MD5: 32K
       7C 93 54 3B 42 ED E8 EF E6 A4 DC 60 3E 70 8B 68>)
(   4,<2007-01-19 09:00:41.52 +000>,<MAYBRIDGE\nmr>,<NMR_250MHZ>,
      <abs ABSG = 5 
       data hash MD5: 32K
       09 2C 81 58 54 46 13 66 DE E6 A2 4D 96 66 13 C7>)
$$ ##END=
$$ 
$$ hash MD5
$$ 5B 4A A6 05 1C CA 0F 6C 42 AD 17 86 1F E5 A8 DA
##$RELAX= 
##$RELAX= 
##$RELAX= 
##$RELAX= 
##$RELAX= 
##$RELAX= 
##$RELAX= 
$$ Bruker specific parameters
$$ --------------------------
##$DU= <C:\u>
##$EXPNO= 1400
##$NAME= <ADRS>
##$PROCNO= 1
##$TYPE= <nmr>
##$USER= <dgb>
##$AMP= (0..31)
100 100 100 100 100 100 100 100 100 100 100 100 100 100 100 100 100 100 
100 100 100 100 100 100 100 100 100 100 100 100 100 100 
##$AQSEQ= 0
##$AQ_mod= 3
##$AUNM= <au_zg>
##$AUTOPOS= <2 >
##$BF1= 250.13
##$BF2= 250.13
##$BF3= 250.13
##$BF4= 250.13
##$BF5= 500.13
##$BF6= 500.13
##$BF7= 500.13
##$BF8= 500.13
##$BYTORDA= 1
##$CFDGTYP= 0
##$CFRGTYP= 5
##$CHEMSTR= <none>
##$CNST= (0..31)
1 1 145 1 1 1 1 1 1 1 1 1 1 1 1 1 1 1 1 1 1 1 1 1 1 1 1 1 1 1 1 1 
##$CPDPRG= <>
##$CPDPRG1= <>
##$CPDPRG2= <>
##$CPDPRG3= <>
##$CPDPRG4= <mlev>
##$CPDPRG5= <mlev>
##$CPDPRG6= <mlev>
##$CPDPRG7= <mlev>
##$CPDPRG8= <mlev>
##$CPDPRGB= <>
##$CPDPRGT= <>
##$D= (0..31)
0 1 0 0 0 0 0 0 0 0.06 0 0 0 0 0 0 0.0002 0 0 0 0 0 0 0 0 0 0 0 0 0 0 
0 
##$DATE= 1169197225
##$DBL= (0..7)
120 120 120 120 120 120 120 120 
##$DBP= (0..7)
150 150 150 150 150 150 150 150 
##$DBP07= 0
##$DBPNAM0= <>
##$DBPNAM1= <>
$$ [...]
##$SUBNAM7= <"">
##$SUBNAM8= <"">
##$SUBNAM9= <"">
##$SW= 20.6930455092707
##$SWIBOX= (0..15)
0 0 3 0 0 0 0 0 0 0 0 0 0 0 0 0 
##$SW_h= 5175.983436853
##$TD= 65536
##$TD0= 1
##$TE= 294.16
##$TE2= 300
##$TE3= 300
##$TEG= 300
##$TL= (0..7)
0 120 120 120 120 120 120 120 
##$TP= (0..7)
150 150 150 150 150 150 150 150 
##$TP07= 0
##$TPNAME0= <>
##$TPNAME1= <>
##$TPNAME2= <>
##$TPNAME3= <>
##$TPNAME4= <>
##$TPNAME5= <>
##$TPNAME6= <>
##$TPNAME7= <>
##$TPOAL= (0..7)
0.5 0.5 0.5 0.5 0.5 0.5 0.5 0.5 
##$TPOFFS= (0..7)
0 0 0 0 0 0 0 0 
##$TUNHIN= 0
##$TUNHOUT= 0
##$TUNXOUT= 0
##$USERA1= <user>
##$USERA2= <user>
##$USERA3= <user>
##$USERA4= <user>
##$USERA5= <user>
##$V9= 5
##$VALIST= <valist>
##$VCLIST= <CCCCCCCCCCCCCCC>
##$VD= 0
##$VDLIST= <DDDDDDDDDDDDDDD>
##$VPLIST= <PPPPPPPPPPPPPPP>
##$VTLIST= <TTTTTTTTTTTTTTT>
##$WBST= 1024
##$WBSW= 4
##$XGAIN= (0..3)
0 0 0 0 
##$XL= 0
##$YL= 0
##$YMAX_a= 339954
##$YMIN_a= -349670
##$ZGOPTNS= <>
##$ZL1= 120
##$ZL2= 120
##$ZL3= 120
##$ZL4= 120
##$ABSF1= 16.522
##$ABSF2= -4.171173
##$ABSG= 5
##$ABSL= 3
##$ALPHA= 0
##$AQORDER= 0
##$ASSFAC= 0
##$ASSFACI= 0
##$ASSFACX= 0
##$ASSWID= 0
##$AUNMP= <proc_1d>
##$AZFE= 0.1
##$AZFW= 0.1
##$BCFW= 0
##$BC_mod= 0
##$BYTORDP= 0
##$COROFFS= 0
##$CY= 12.5
##$DATMOD= 1
##$DC= 0
##$DFILT= <>
##$DTYPP= 0
##$F1P= 14.0000005364418
##$F2P= -0.99999901652339
##$FCOR= 0.5
##$FTSIZE= 32768
##$FT_mod= 6
##$GAMMA= 0
##$GB= 0
##$INTBC= 1
##$INTSCL= 1
##$ISEN= 128
##$LB= 0.3
##$LEV0= 0
##$LPBIN= 0
##$MAXI= 10000
##$MC2= 0
##$MEAN= 0
##$ME_mod= 0
##$MI= 0
##$NCOEF= 0
##$NC_proc= -2
##$NLEV= 6
##$NOISF1= 0
##$NOISF2= 0
##$NSP= 0
##$NTH_PI= 0
##$NZP= 0
##$OFFSET= 16.522
##$PC= 1
##$PHC0= 226.2677
##$PHC1= 5.804951
##$PH_mod= 1
##$PKNL= yes
##$PPARMOD= 0
##$PSCAL= 4
##$PSIGN= 0
##$REVERSE= no
##$SF= 250.13
##$SI= 32768
##$SIGF1= 0
##$SIGF2= 0
##$SINO= 400
##$SIOLD= 32768
##$SREGLST= <1H.CDCl3>
##$SSB= 0
##$STSI= 32768
##$STSR= 0
##$SW_p= 5175.98343685301
##$SYMM= 0
##$S_DEV= 0
##$TDeff= 65536
##$TDoff= 0
##$TI= <Analysis number 999999
Compound Code 99
Book Reference 9
Project Code 9>
##$TILT= no
##$TM1= 0
##$TM2= 0
##$TOPLEV= 0
##$USERP1= <user>
##$USERP2= <user>
##$USERP3= <user>
##$USERP4= <user>
##$USERP5= <user>
##$WDW= 1
##$XDIM= 32768
##$YMAX_p= 313310825
##$YMIN_p= -26000
$$ End of Bruker specific parameters
$$ ---------------------------------
##NTUPLES= NMR SPECTRUM
##VAR_NAME=  FREQUENCY,     SPECTRUM/REAL,   SPECTRUM/IMAG
##SYMBOL=    X,             R,               I
##VAR_TYPE=  INDEPENDENT,   DEPENDENT,       DEPENDENT
##VAR_FORM=  AFFN,          ASDF,            ASDF
##VAR_DIM=   32768,         32768,           32768
##UNITS=     HZ,            ARBITRARY UNITS, ARBITRARY UNITS
##FACTOR=    0.157963299565203, 1,           1
##FIRST=     4132.6476996994, 0,             0
##LAST=      -1043.33573715361, 0,           0
##MIN=       -1043.33573715361, -26000,      0
##MAX=       4132.6476996994, 313310825,     0
$$ Real data points
##PAGE= N=1
##DATA TABLE= (X++(R..R)), XYDATA
$$ [...]
21625 -7571 -6545 -7801 -13020 -12172 -5376 -2357 -3353 -4629 2223 3159 -3976 -7142 -8939 -7803 -6220
21610 -6220 -9435 -5598 -8502 -5255 825 804 -563 1565 4941 497 485 -7088 -1684 4950 5589 7803
21594 7803 7687 3932 3370 9261 10649 10589 6665 -4832 -15198 -13777 -4447 -6312 -4050 -5343 -2698
21579 -2698 2139 -1102 10 -2747 -3797 1433 221 -2462 -1530 -2081 -4409 -7690 -12095 -16743 -22313
21564 -22313 -18681 -6070 2973 -845 -663 -5351 -9533 -1369 -2788 -4903 -586 -3592 -6176 -10033
21550 -10033 -11780 -9412 -3848 -2338 141 -2678 -1524 85 -4538 -1416 -8932 -12469 -9640 5180
21536 5180 9782 3823 1821 -3224 -5766 -3591 -1466 2206 312 -3633 -2643 -6806 -5327 4750 -1749
21521 -1749 -3322 1789 3613 4997 5442 -286 -173 8450 8904 -614 -6573 -13297 -11196 -6528 -7813
21506 -7813 -2103 646 -429 -2142 -5062 171 -4665 -12549 -15415 -10817 -10950 -11448 -896 -495 -529 8001
21490 8001 9409 7233 -1315 -7508 -6031 -7136 -11392 -10257 -8837 -8403 -5449 768 2142 -1068 -6912
21475 -6912 -4940 -6262 -6945 -10028 -8558 -7921 -3817 3227 -990 -5585 -7146 -11199 -13228 -15207 -6205
21460 -6205 -887 -1656 1688 5080 1137 3653 4140 -2020 33 -3152 -8556 -13184 -12125 -9489 -7765
21445 -7765 1557 2670 -1962 2539 7351 1906 -2332 -7831 -10788 -10961 -11483 -3077 4050 7785 2513
21430 2513 -7201 -5026 -2548 3191 755 -6580 -11453 -10459 -5337 -6815 -7664 -7278 1045 7807 3157
21415 3157 4922 2309 591 -1592 -3596 -4540 -3496 -697 673 -2642 -788 -2243 -2605 -5900 -6088
21400 -6088 -5958 -3821 -1514 -5743 -8119 -5611 -2014 -9203 -13032 -11655 -3069 5197 3940 4453 10458
21385 10458 14849 11941 12414 5853 1834 3444 3308 -140 -2452 1484 6901 9619 11380 5731 3876
21370 3876 -3040 -8387 -10610 -5955 2155 3443 -3133 -4133 -4598 -3315 -456 2218 470 -6960 65
21355 65 11614 7515 2127 -2500 -5212 -7687 -4607 -1508 2919 1942 2431 -68 1519 -845 -3239
21340 -3239 -399 -565 -4259 -6762 -2447 -2428 -3324 -12773 -12017 -8362 -3642 1189 6217 3719 6504 5434
21324 5434 -33 2708 -129 -8581 -9213 -10354 -11696 -9352 1915 5080 8289 6234 6503 8063 3947
21309 3947 -1315 -3243 -4860 -4423 133 1172 -1881 -1432 5348 9128 5049 -94 335 349 125 -499
21293 -499 -9827 -7839 -5875 1571 9065 6979 7044 3180 -511 -2133 -9804 -9014 -11959 -17109 -20946 -19489
21277 -19489 -8886 -4779 -2365 -6687 -10324 -8227 -1892 -1380 2523 3568 3217 2580 5169 4706 6337
21262 6337 8039 13109 12904 4922 -5416 352 2729 272 3438 1224 -951 2288 5829 5957 965
21247 965 -3155 -5177 -1927 2082 3477 -723 -2864 -8485 -9424 -4172 -524 -612 2835 -5183 -13968 -13219
21231 -13219 -5610 1518 5528 -4002 -7460 -3408 4158 3691 -5888 -6513 -5789 -9596 -7291 -9795 -8166
21216 -8166 -6815 -4616 2691 -2445 -2836 2480 4971 -2355 -7868 -8236 -10579 -11257 -6556 -1956 -2412 -2073
21200 -2073 86 -1719 2872 5012 4542 3128 220 49 9178 3262 780 -3375 -8131 -1997 -4751
21185 -4751 -2404 -1286 232 1119 298 -5775 -13651 -10496 -6619 -7484 -15407 -12683 -3770 -3790 -9112 -7406
21169 -7406 2972 5041 6960 6019 5216 2450 -5192 -9522 -5937 2122 2280 5116 3822 2231 6836
21154 6836 10010 -91 -4425 -5482 -4453 2927 5417 4438 4273 1648 9097 11566 10576 3276 -4885
21139 -4885 -4190 -2333 3292 8978 7463 6995 3395 4635 11774 10100 8847 4683 1008 5654 9927
21124 9927 1760 -3114 -2703 3692 8026 2700 -2801 -10030 -4842 -5394 -7868 -6106 -2536 -4349 -6857
21109 -6857 -8701 -2565 -71 -12 2822 -10 -3949 -4517 -3659 -5504 -8034 -13615 -13231 -2947 484 2670
21093 2670 9569 7741 8717 7036 3596 157 -3033 739 2884 10299 10056 1036 1625 246 665 9537
21077 9537 6235 6502 8404 -139 -10222 -9959 -6745 -4812 -4574 -5770 -10230 -3459 -2760 710 306 -2500
21061 -2500 -293 -2077 -6299 -4152 -580 -2054 -5334 -80 976 -6101 -1141 -112 -1635 2168 9389
21046 9389 12725 5429 2663 4780 5098 6887 6434 3568 -1211 877 8970 8103 -2754 -8184 -4238
21031 -4238 6873 5498 -3373 -10568 -11963 -8216 130 4072 3413 -2962 -2153 -3909 541 -680 -3165
21016 -3165 -6143 2102 330 9912 17320 12512 8245 3555 -4821 -5743 -5393 -3720 -2003 -4280 -6605
21001 -6605 -7578 -3311 -1639 1226 5031 -1250 -4435 -9193 -10349 -18592 -26000 -18385 -11061 -5041 -2099
20986 -2099 -3868 -1044 2271 4039 1287 1800 -910 -8315 -14866 -6346 -1123 -2165 -2098 -6664 -6630 -4813
20970 -4813 338 -1249 -4893 -14061 -10908 -3133 -3890 -1608 -2375 -3251 -590 57 -6487 -7205 -7904 -2740
20954 -2740 -2007 672 3695 2672 4114 3451 -3384 -9716 -12587 -13311 -12003 -6768 -2401 2731 4628
20939 4628 1886 -927 -6096 -8491 -4311 -1514 80 1394 1855 -3583 -8498 -8358 -5575 -5617 -3988 670
20923 670 2359 -1064 -2858 -4154 -642 -9364 -13820 -8055 -2319 -2685 -1564 -8087 -19451 -23499 -16807
20908 -16807 -14920 -15931 -18662 -13994 -11345 -12209 -12132 -14478 -13263 -16131 -17325 -11721 -8557 -8454 130
20893 130 3879 3274 -3529 1004 -550 407 -1144 -4666 -9280 -7184 -3067 -4360 -6604 -7249 -876 2829
20877 2829 2027 4921 -1487 -2853 4384 10536 7729 3945 4742 2064 -3774 -6430 -11248 -12367 -5288
20862 -5288 1053 1868 7061 10065 4286 1453 -425 995 2316 -3321 -3741 -7366 -9869 -4929 -2000
20847 -2000 -2471 -4996 -13 4317 6862 9862 7213 6998 6587 -383 -5879 -1831 2675 2212 -4880 -12569
20831 -12569 -6724 -7477 -3455 -2344 5208 6880 4453 5429 504 -5488 -10615 -8847 -3303 -12891 -12611
20816 -12611 -3433 -2122 -4607 4606 3524 176 -8058 -16959 -19389 -7752 472 6560 5134 1664
20802 1664 7050 8429 -1473 -10210 -12204 -7505 -7233 -5663 -8485 -9896 -10695 -12096 -9494 -11740 -8544
20787 -8544 4363 6756 8243 5422 -807 -1573 1977 -2340 -6215 -10346 -8787 -5449 -2388 -3750 -3092
20772 -3092 1920 166 -3768 -1972 -63 -3021 -4845 1056 6329 5650 6592 5969 4391 3283 7210
20757 7210 7418 356 -2454 -8798 -11427 -3240 4600 4161 4221 -4054 -7609 -9763 -11350 -10013 -4900 -2543
20741 -2543 -5921 -10018 -13438 -10345 -4606 1506 4028 -1857 -1984 -1731 1738 4975 5828 5605 396 143
20725 143 -2137 -750 5317 8139 2350 -4836 -3308 2359 3094 -4436 -2036 5936 -228 -13590 -15857
20710 -15857 -14335 -12199 -10290 -12382 -15213 -10279 -2261 3424 2028 1513 440 -3345 -3657 -1837 -1332
20695 -1332 -6490 -5824 -2369 -5395 -6232 26 4076 12056 10852 5813 7745 10496 6231 -3899 -5161
20680 -5161 -2549 -6847 -4805 -7190 -10152 -12454 -10322 -8870 -9760 -9757 -11490 -3676 -8109 -6432 2825 1925
20664 1925 2246 9167 4628 2924 2453 -2469 742 4762 9821 8489 8698 9361 4807 1295 -2983 -1748
20648 -1748 -7950 -8371 -12528 -16001 -18330 -22863 -25428 -9723 777 7079 6860 -2426 -2230 693 -3206
20633 -3206 -975 1898 -4151 -8161 -5555 54 4226 2473 -1005 -5777 -7687 -2787 -6449 -4312 -268
20618 -268 -806 8188 8886 9288 9107 -4550 -5724 -5281 -5180 771 -1606 -10902 -14113 -9259 -3911 -7646
20602 -7646 2796 11454 4119 -2916 -5846 -1569 -1370 1560 5561 4361 2391 8160 5477 6373 -1194
20587 -1194 -6808 -2997 -3026 -490 -5715 -11173 -10186 -10677 -8812 -1930 -8208 -9154 -4635 -2878 -1663 2273
20571 2273 4466 1433 -4160 -6396 -2305 -1745 254 -4097 -3684 -4742 -6155 -3710 3245 4443 2654
20556 2654 5411 12445 11468 2372 607 -3825 -9488 -12246 -14376 -16178 -19128 -24285 -20181 -12555 -9250
20541 -9250 -10486 -5320 -2420 2826 1357 748 5443 4089 -3011 -3875 3682 4801 5065 7754 10759
20526 10759 7402 5071 4456 4639 2700 -3138 3021 10727 5726 -716 -6565 -18126 -18999 -17571 -9861
20511 -9861 -8623 -11582 -4728 -314 -176 -337 7397 8445 -455 -6715 -8943 -10132 -13467 -9592 -1054
20496 -1054 2436 -3448 -1159 100 -3892 -11525 -13138 -20006 -14059 -5697 -6217 -7004 -3380 -971 -5536
20481 -5536 -7756 -8554 -4670 -4882 4494 -1367 -5416 -3621 -2402 -4046 -11875 -11417 -7895 -4286 -2959
20466 -2959 -4127 -9712 -10034 -10633 -2505 1527 6772 8854 8980 12609 3227 -5709 -6859 -6073 -541 2491
20450 2491 4730 4127 820 1807 7071 5933 4545 -942 -1594 4380 2900 -6182 -9263 -4820 -1423
20435 -1423 -3228 -3998 -10971 -12667 -4747 3182 -5611 -11163 -11749 -10423 -9411 -9554 -6508 -5125 -8647
20420 -8647 -9630 -2537 5485 2805 -4786 -2625 4606 9014 3523 -187 -4021 -2953 -3719 -10794 -11922
20405 -11922 -6955 -10977 -10275 -9303 -6425 -2921 -1996 -2079 229 2627 -686 -5042 -7057 -14412 -10304 -11827
20389 -11827 -10025 -3912 -4039 -9181 -10289 -4776 -3130 9452 14447 12892 3938 -369 -975 -1327 -640
20374 -640 2789 1452 -3693 -3883 -4760 -13878 -10618 -3064 -563 -849 406 1439 -307 566 -3878 -9510
20358 -9510 -7594 -3970 -816 3495 6962 14294 11402 199 2268 823 1469 385 1603 -1489 -9596
20343 -9596 -9304 -6615 -7083 -4531 -2045 -1706 -2529 1478 5260 1592 33 -601 -4969 -13961 -13741 -9377
20327 -9377 -3983 -10226 -10686 -4122 -7860 -18502 -24486 -16721 -10021 -6392 -10710 -8841 -9867 -10501 -3650
20312 -3650 389 2035 -801 -3291 113 -1231 -2139 -6845 -13399 -13731 -14803 -13313 -3621 -4474 -6113
20297 -6113 -6182 1759 4717 -3275 -1048 -1732 707 -3400 -10136 -11439 -8732 -6785 -5386 -8140 -9000 -6069
20281 -6069 5210 5087 -1341 -3309 -4163 -3562 255 4263 3923 -343 -8344 -2801 -3038 -1219 372 -1626
20265 -1626 1224 1194 3141 4064 98 3398 3097 -215 -1692 -3475 -9869 -4454 102 1006 -361 -5145
20249 -5145 -6720 -4705 -4623 -10752 -8891 -3604 -2915 -4984 -1136 2920 6653 7135 1432 244 761 -1883
20233 -1883 -3416 189 -3107 -5238 -6224 -7574 -14804 -18731 -13534 -2845 3765 2278 -5700 -5490 2238
20218 2238 5185 7984 5653 4814 4978 760 -2129 3359 4467 2939 5339 -1379 -7803 -5504 -610
20203 -610 -173 4596 6507 3867 -2131 -8869 -4344 404 3603 5188 -314 -6698 -14148 -10905 -8687
20188 -8687 -5722 -4661 -5852 -9626 -8012 70 473 -6688 -6334 -5873 -3553 -3894 -3868 7460 7663 5180
20172 5180 888 -6284 -6314 -444 -2093 -1951 -1185 2907 4985 1801 -6383 -2747 -2607 -8036 -2160 10030
20156 10030 8700 4588 6076 5696 -3556 -8226 -10940 -6307 -2569 2428 7104 8893 9161 7170 -5866
20141 -5866 -8703 -6393 -3280 -3116 1598 2538 -3200 -1619 1774 -763 -3564 -3314 -700 -183 -4779 -12690
20125 -12690 -7253 -3050 1211 679 -2652 -6205 -2037 -7306 -13160 -16769 -9104 -1299 -59 -953 -4507
20110 -4507 -5759 1767 6223 6471 -529 -650 3395 7125 9957 9440 3842 5194 7700 -538 -2692
20095 -2692 -2071 -7267 -9266 -4779 -1332 229 -2619 -7335 -6967 -1606 5492 9764 7643 2139 4282
20080 4282 1759 -6361 -12220 -9318 -2151 4385 328 -411 -2573 -4744 -4803 -5312 -4479 -6557 -7558 -4522
20064 -4522 -6763 -5625 -3444 -1189 608 2161 567 -28 -362 -1910 -1078 1106 1423 1141 -754 3853
20048 3853 5616 4664 -1223 -4425 -6298 -5297 -2173 -4350 -6863 -3504 -318 -4522 -2983 -1907 107
20033 107 -1297 44 6395 2335 -1242 -5136 -3051 -6256 -10399 -9218 -15268 -13512 -11325 -7439 -5326
20018 -5326 -2576 -2584 -1973 -8289 -7909 -7054 -10965 -6523 68 -370 -5374 -4401 -5918 -750 4143 2658 1071
20001 1071 7240 9498 6111 -5706 -5167 -8598 -4782 -5610 -1223 -4899 -4304 -2658 -3194 1484 6656
19986 6656 9819 7978 3552 3841 1852 3033 4594 8986 3973 -2812 -3492 -7428 -11040 -4931 7278
19971 7278 9769 2855 436 1816 -1084 -6964 -9404 -7611 -4319 -646 -2174 -4920 3574 -2114 -10842
19956 -10842 -7317 -5722 -2835 -4477 -1804 1250 -1087 -2258 -5203 -7504 -8296 -7418 -3060 -3138 -1625
19941 -1625 -57 2872 5878 6158 12435 7809 7185 573 -1004 6497 5587 1221 6627 2460 -6252
19926 -6252 -11249 -11313 -11295 -11790 -15709 -9813 -5288 -7891 -4349 -6706 -8151 -5139 -4960 -8084 -17519 -14733
19910 -14733 -6440 -9218 -6056 3642 14379 7999 -1935 -8683 -8103 -3617 -2760 -3109 -3890 1963 3893
19895 3893 2712 1236 1286 3492 4891 4662 208 1325 -7004 -8260 -6933 -1457 3499 -1192 4683
19880 4683 9195 9687 10384 10828 9964 5124 1916 -1264 -1248 -4899 -13401 -8030 -6341 -5144 -4752 -3294
19864 -3294 1279 5397 825 -1659 -3582 1390 4274 -1288 -12616 -15183 -8404 -6041 -4975 -2197
19850 -2197 7134 3891 -907 1498 -4294 -1703 -2152 -3380 -1123 1565 -10106 -10742 -7886 -5316 2718
19835 2718 2394 6614 6794 463 885 -3907 -11130 -7221 -6983 -10078 -8627 -5503 795 -3173 -2645 -891
19819 -891 -3088 -14538 -12888 -11119 -18244 -17999 -9007 -3445 -3264 1207 821 -4198 -5205 -2534 -3000 -3249
19803 -3249 -1043 219 -6199 -7142 -11573 -15203 -16233 -14347 -7729 -6080 -6078 -1614 -7809 -5523 -3660 -8320
19787 -8320 -5949 -11315 -13062 -3740 -4505 -7302 -5111 -1606 -85 -1405 -369 -671 -2072 -2275 -3770
19772 -3770 -7413 -4982 -264 -6 2069 151 -1575 -5460 -2598 543 9273 11410 4984 2918 -4854
19757 -4854 -8347 -8995 -6203 -4000 -4094 -1490 -3737 3293 10267 9380 6954 5092 4091 1675 4260 7894
19741 7894 13291 12950 7416 3851 -3001 1260 6153 3718 -1897 -24 3999 7099 1496 -2592 1266
19726 1266 173 -4105 -3163 -8769 -6794 -4489 1049 1113 5210 8135 5819 -636 -3594 -6061 -7234
19711 -7234 -6539 -4071 -4493 -6253 -6186 -10863 -18044 -14594 -2745 32 -5491 -15453 -17378 -8708 -4468
19696 -4468 -8608 -7513 -9924 -10932 -4155 5816 4290 -3474 -1032 2740 3299 980 -1677 -6978 -6308
19681 -6308 -6154 -8464 -12835 -9001 -2813 3823 1421 3385 5841 6939 8103 5664 708 2042 2655
19666 2655 -6658 -5700 -4570 874 7151 -171 -3338 -1092 -2702 -5994 -3568 -3745 -5672 -3908 -7462
19651 -7462 -5285 -9537 -3680 8947 5237 2552 -6620 -7213 -4927 -6059 -892 9821 8242 3840
19637 3840 705 -349 2940 3411 7204 -481 1035 1150 -789 -5558 -6956 -970 3921 6940 10298
19622 10298 14388 8410 -636 -3699 -4737 -4165 -9898 -10374 -7584 -7224 -2137 -1236 -2531 -1207 -8305
19607 -8305 -6138 253 3024 3551 5910 5958 4254 2990 713 -8329 -10444 -220 4842 5782 -1433
19592 -1433 -5080 -4758 -9334 -7202 -8926 -10260 -12854 -12723 -4079 77 -1065 -7953 -6005 2104 5902
19577 5902 332 -860 -2414 -2016 2346 2332 3495 7448 8805 3328 -12209 -4841 3719 3793 1703 7556
19561 7556 8627 5648 2566 -690 -2402 3559 1525 1299 -1201 -3636 -3393 2854 6130 5015 6106
19546 6106 4779 -5226 -14856 -7323 11018 13447 8449 2574 3138 6744 10967 15046 21872 35171
19532 35171 35335 34202 34041 34015 46267 60138 78436 81835 66110 52236 49855 50040 50670 53717 66764
19517 66764 84749 91448 90618 92693 100175 100093 89583 77239 68434 53632 46063 43712 49985 62379
19503 62379 66304 65495 53148 39988 31931 21232 9203 6937 5793 4513 10833 13211 10447 14205
19489 14205 14456 16302 21123 19381 14440 12601 19175 24428 26664 32142 49670 52692 45713 39500
19475 39500 31128 27886 31723 44334 63430 77414 83996 82847 74791 81309 91123 97842 94255 82705
19461 82705 74949 63306 53168 58948 73822 97604 109794 101641 82928 70849 57961 50694
19449 50694 52689 52445 41273 37547 33458 24143 17440 18104 16038 11274 13098 4290 -82 244 3825
19434 3825 12374 10952 9929 5263 4441 3709 5887 5007 6568 10018 11234 9211 4039 10734 12319
19419 12319 6149 2752 -938 -2493 -259 149 -208 3208 3972 -2916 -5118 -3546 -2312 -2305 -341 3354
19403 3354 3793 -1817 -4252 -1785 449 2808 1958 684 -1787 -5475 -4090 2613 8328 6056 -467
19388 -467 -2575 -3894 -5708 -4024 1744 9950 8410 3257 2021 -3277 -6794 -7258 -5533 2892 5633
19373 5633 6184 6097 6050 7847 12190 13846 8769 3298 -714 857 6929 7495 6732 796 389 5485 6799
19356 6799 7990 8108 6601 4994 5782 4254 -5714 -10354 -9984 -2693 2192 6704 4971 1812 2672 1647
19340 1647 1645 5395 1769 -139 4296 -1305 -3944 4328 13472 14148 17133 8131 2037 7527 937 -6794
19324 -6794 -9168 -5025 -204 -151 3544 6980 8454 11500 12080 10083 10890 16343 18717 14950 8214 3519
19308 3519 148 -3755 -4187 -9 7683 10912 12683 6977 4743 7042 11654 1812 -3952 -1243 1424
19293 1424 477 7256 12160 9250 11312 9458 13050 10188 11582 7471 4989 8644 2020 -3173 -936
19278 -936 -2090 -4481 -3739 -6350 71 6072 13261 16280 14559 18757 19558 22664 21854 26232 28418 26815
19262 26815 28719 24898 26059 22140 24218 26306 20285 12964 15604 24904 30756 23899 25720 25798 20924
19247 20924 17094 16874 14718 13444 8411 4437 14240 14768 11634 8758 15466 13684 6035 2598 5848
19232 5848 7114 10325 9547 4268 5488 11510 8685 8249 5699 7862 8879 14070 19345 13887 9750
19217 9750 10205 15791 20598 27043 34665 47199 54709 50655 43214 34308 31447 30047 26109 21886 16273
19202 16273 15698 17750 18779 13877 11642 9458 11367 16491 20342 20335 13812 8519 8937 11955 8670 11729
19186 11729 13415 10339 10129 16689 14740 15071 16458 17316 18834 15828 16389 17411 15393 19571 24719
19171 24719 29595 29866 34821 40622 42740 50468 45826 29175 22444 21884 21892 20454 24935 29821 31843
19156 31843 36765 40065 44376 39711 29806 26005 28371 27293 28405 24378 25924 15485 8578 10319
19142 10319 8922 12184 19161 28817 32647 30605 37933 40058 40832 36701 29719 34820 34095 30980 32447
19127 32447 35827 44348 48648 51317 51687 55905 49428 37684 31639 35877 36777 38631 44825 57811
19113 57811 65916 70787 80454 85086 76265 67410 64370 59141 58552 51217 43668 53634 64405 59663
19099 59663 56795 57635 57830 61431 60733 67216 67719 67121 61049 57098 52538 53193 59149 63651 73214 82899
19083 82899 95665 96961 97798 95547 96843 94814 93610 97078 100035 104157 102447 105093 107196 105107
19069 105107 105060 110380 117892 121619 135092 150482 162926 169056 177986 185216 191384 199823 195097 198161
19055 198161 211646 224554 241536 267824 294168 309864 329357 352537 395578 458083 544097
19044 544097 625938 663224 660721 653993 652490 679737 752969 866389 1035801 1281087 1659232
19033 1659232 2228520 3046555 3930611 4347505 3993128 3297594 2744624 2448908 2360259 2430813
19023 2430813 2646062 3027681 3635316 4571824 6058901 8510205 12604502 19129300 28155221
19014 28155221 36396622 37957680 32790128 26297180 20860207 15948928 11855218 9177039
19006 9177039 7730186 7194690 7448811 8479521 10117968 11567402 11489454 9596825 7163460
18997 7163460 5250712 3977638 3156618 2604828 2225371 1976663 1810780 1720066 1696651
18988 1696651 1721963 1769222 1786988 1777443 1757549 1716586 1686233 1698688 1763617 1894258 2105357
18977 2105357 2453199 2977028 3772931 5000195 6809688 9140883 11313371 11985881 10738380
18968 10738380 8837977 7505821 7019838 7352867 8613894 11043937 14990680 20411622
18960 20411622 26540677 33127557 39597505 41559181 35074868 24412179 16013332 10936514
18952 10936514 7917747 6035130 4814261 4000660 3442876 3080561 2893857 2900656 3137642
18943 3137642 3659523 4392839 4947507 4745843 3790284 2748954 2033648 1596982 1315278
18934 1315278 1117363 975964 875375 811087 781493 777126 773947 738510 662144 555758 460200
18923 460200 394194 348954 314493 286382 261538 242013 229415 217769 207784 200105 198292 198760
18911 198760 193506 188439 174036 154762 142053 133708 125839 121762 120209 113534 102138 97723 95889
18898 95889 96749 95366 99414 99023 93394 82100 85288 91078 85673 81120 78215 75032 75390 82125 81969
18883 81969 78471 75091 77922 78516 72429 66274 57873 45202 46109 45665 51086 52816 47159 44814 49571
18868 49571 49788 43871 36167 34619 33355 27469 14882 9255 7633 16510 27657 25459 29044 34185
18854 34185 40102 36875 31275 26539 27558 33483 29159 20854 21534 31438 36084 34693 26913 21777 26118
18839 26118 30041 36960 45846 48167 42490 46436 43740 37629 40590 49500 57903 54071 51478 57085
18825 57085 68381 68888 60674 50975 40533 24772 17493 8733 13348 19568 22841 22865 26181 28130
18811 28130 26807 28002 21710 13649 12388 -176 -1330 3796 6093 6732 8286 9086 13481 20228 21405
18796 21405 20580 25606 24455 30643 29323 33586 34089 23865 24496 31686 37377 41285 39484 29428 26688
18781 26688 28124 26100 24725 21266 17843 20174 22947 26443 41748 47678 51362 56350 63001 75587
18767 75587 100206 109366 82477 51193 33435 23012 13269 14426 20484 28640 29139 22068 21210 24445
18753 24445 29943 28910 29966 32195 32616 26101 30598 36693 34475 31785 28271 25244 29499 28917 19200
18738 19200 11008 11861 14499 17116 16130 18976 19454 15031 13606 18606 17289 9065 -2791 -2104 -3642
18723 -3642 -825 -2158 -6007 168 8462 12115 10548 10515 10033 6856 -1084 -2729 -6548 -9874 -1271
18708 -1271 4505 10283 14678 21980 25928 24137 21023 24070 20869 15973 17274 14903 11290 5595 5624
18693 5624 3978 2701 1622 150 4857 12787 17307 20875 19556 18643 18999 15415 18324 14782 15388
18678 15388 20248 18425 16117 16011 12608 15806 16941 14089 13704 9979 6895 9362 12793 12670 14940
18663 14940 18524 14833 9117 2651 -5806 1038 6451 5655 1766 5193 10320 17076 17725 18749 22146
18648 22146 17110 17425 19937 20660 18274 7293 6301 18700 16794 4840 1790 6886 10801 13655
18634 13655 9659 12289 10487 3680 7088 8195 4288 -1088 5373 8527 4560 6494 5392 6177 7703
18619 7703 9895 12183 11968 4619 5022 6598 3809 3153 2043 6262 8680 717 -5192 3345 9185
18604 9185 12955 6345 511 -5440 -2973 6961 4430 5282 6975 6049 7521 12127 7427 3879 5290
18589 5290 2555 -1946 -1370 3450 13943 10099 8187 12318 8977 412 -4061 -3150 -4900 2148 9591
18574 9591 3656 3666 2294 -7875 -6665 -7857 -5522 -6567 -6796 -9381 -10439 -6196 -586 1437 -351
18559 -351 982 -3552 -2527 8756 18755 22413 20282 22057 18418 5016 1467 -2352 -497 5212
18545 5212 -481 -3430 3388 8641 11393 6069 -3764 -6182 0 6319 7313 10801 8999 4836 947
18530 947 1216 -2599 -3038 60 6993 9789 9504 9764 6433 4217 12131 16395 23034 21614 17562 20168
18514 20168 22056 28705 38900 68923 92249 91540 80766 69637 63662 70612 76098 81452 89305
18501 89305 98989 99554 90093 90268 101388 107327 95488 79114 62594 53165 41820 30976 25968
18488 25968 26236 32905 43316 49998 48442 43363 30357 26649 21401 17760 16381 20072 24121 24040 19923
18473 19923 13325 11512 14756 15279 17171 14332 17214 22420 22392 31024 45797 53723 64679 77569
18459 77569 77217 67224 64198 67451 76260 92762 113410 123481 117487 102308 83307 66873 57142
18446 57142 57041 59243 65330 69285 65707 70295 84875 97105 94752 82875 69542 63580 53514
18433 53514 48919 41803 34763 25543 14353 6645 7341 11834 12006 19872 17832 14533 9112 13085 7040
18418 7040 9121 12048 9237 5304 4581 5901 6339 2497 -4437 -290 6279 3394 1152 3508 -2947
18403 -2947 -8868 -5488 -8224 -8102 -3551 2167 -1742 -3751 2828 932 3482 5304 -155 3003 7742
18388 7742 6425 14742 15441 13666 15180 10333 2450 -3970 -8328 -10549 -7012 -2737 -2510 -7878 -8288
18373 -8288 -9037 -6310 5425 5534 2530 -3462 -10043 -8717 -77 12993 16902 23472 36919 39558
18359 39558 29381 17022 10816 11650 11108 7446 9592 14338 13533 10214 11161 7969 4359 2221 4172
18344 4172 2490 3879 3740 7601 7756 5625 826 -34 5025 -826 -5078 -3227 -254 586 -2741 -179
18328 -179 2052 2861 2975 2025 -2744 -845 3872 5737 5418 4070 2833 1193 1189 3847 8426 9314 9283
18311 9283 7734 1340 -5766 -4533 -5060 -9022 -6813 -3731 3352 6364 -2775 1246 4712 4149 2440
18296 2440 3601 6045 -1468 1257 4673 2754 3178 6734 10735 10202 6046 2299 750 320 1922
18281 1922 1888 -1807 -2700 -1605 1116 3507 3966 11118 11140 -62 -2229 -2208 -3654 3084 6176 3826
18265 3826 -642 6179 9423 7533 8822 8101 8085 13044 7243 -1821 -7421 1613 5960 6756 12673 10878
18249 10878 6418 1540 3491 15849 17079 14012 7059 9556 12624 13648 11949 13583 22994 26402
18235 26402 38597 58802 81533 95263 100387 102567 93313 84847 72625 63054 54315 47874 49383
18222 49383 58473 60591 67119 69554 76166 85885 97957 100455 104584 100142 92136 92137 85992 75309 70675
18207 70675 73431 79238 72554 64578 51809 36825 26174 29922 26631 20945 20554 22590 22930 26366
18193 26366 26916 24615 26624 22820 20931 30331 39453 49470 50427 47244 46223 48385 45382 38641 30858
18178 30858 33038 42820 47713 55548 70319 85693 92804 94455 94326 85882 69372 54994 63888 70708
18164 70708 76642 73040 83745 83536 82057 84080 91449 88923 86993 83639 74552 65347 63447 60324
18150 60324 62030 60973 63016 60189 49700 45800 49355 50706 49671 47560 56527 62848 63615 62299
18136 62299 70053 67007 71341 81528 94082 104383 110594 114240 133083 152536 165666 184193 204007
18123 204007 223760 252072 295492 340438 386780 454874 553585 699619 930146 1276378 1841279
18112 1841279 2849575 4650531 7753803 12567744 16570911 13903762 8193528 4779528
18104 4779528 3066192 2126443 1565590 1199860 945362 753465 604246 496844 409628
18095 409628 342298 304719 269471 229798 202478 185180 161363 141628 129641 124703 119410 117784
18083 117784 112475 101036 92895 80584 79410 76858 76398 74230 68199 62920 60335 54319 56280 54289
18069 54289 50351 43539 37069 33258 26198 21811 24294 26107 22843 21891 22853 26261 23426 18404 16925
18054 16925 16662 18723 21203 21506 23072 22191 21383 20150 20387 21546 22012 26402 30252 34829 28071 19790
18038 19790 17761 12214 304 4907 5973 9581 16045 20570 17046 10318 3642 4729 619 1032
18024 1032 4226 3212 1211 -1640 -5838 -3015 -758 -3814 -3608 4930 4893 7105 14354 16859 16284 8729
18008 8729 1344 3549 12242 17134 19265 23297 22262 14615 14119 14379 13596 20626 24391 24481 18458 8201
17992 8201 4082 9465 11310 9184 12733 17812 15325 15698 17675 21909 27788 24264 17423 17543 14586
17977 14586 7194 4175 10028 16972 21587 18658 16240 15786 17483 21378 22877 33211 35894 35989 31433
17962 31433 27149 33465 41420 36912 35258 34214 27609 21412 19815 17890 16330 17408 18498 20339
17948 20339 18797 17482 16246 17049 10316 10939 21420 20007 12480 13910 18867 27439 25352 24972 24385
17933 24385 19560 14840 12450 8525 7656 14076 19437 17583 14399 17120 19479 23050 20198 14797 13455
17918 13455 13361 14976 10617 15618 22109 35218 46596 45812 44714 37185 35475 35246 36194 26844 22444
17903 22444 18865 17937 25505 24349 21229 21118 16967 11642 14245 11016 11446 15184 9977 11640 10453
17888 10453 11123 11213 11977 17162 26772 28517 24041 13761 11192 13651 15220 14424 8588 11223 7694
17873 7694 9976 15463 19838 30998 35179 41790 47285 43748 32953 29688 39150 38796 30979 19056
17859 19056 18372 26775 26103 22601 21326 34570 41276 39755 40059 31946 25304 21663 14623 13825 22212
17844 22212 23507 12785 9575 6375 12318 21910 28393 30685 39388 40920 40032 42455 45598 40576
17830 40576 37702 39742 38889 43844 46414 50976 54023 50912 54152 47140 45240 45301 46684 45857 45033 43583
17814 43583 42835 47158 60630 75767 76400 70636 68406 69866 62299 54172 51162 46634 44524 56847
17800 56847 62680 63100 70663 70509 67850 72849 72661 77020 86618 86389 78894 74739 72240 69161 65564
17785 65564 67492 74481 78543 87825 97148 99197 102575 100925 104659 104754 110921 107952 116687 126401 122901
17770 122901 119857 123679 129624 129328 134151 138034 140619 146248 153152 166962 177318 181966 186610 201900
17756 201900 215831 225480 228279 233580 254809 269146 277108 287018 297678 312444 330064 345662
17744 345662 367193 395338 438354 491334 565212 655986 768825 912432 1091764 1304691 1583469
17733 1583469 1976114 2505121 3117646 3637384 3919451 3981837 3805374 3419027 3056605 2887849
17723 2887849 2934805 3184306 3652984 4402244 5548416 7375244 10286282 14749921 20828173
17714 20828173 27297079 32073816 34430271 34242557 30802482 25227829 19839629 15569365
17706 15569365 12359782 10205863 9098265 8885306 9341519 10082924 10541374 10382793 9642031
17697 9642031 8354604 6696242 5139059 3989498 3231603 2737850 2404494 2163858 1975717
17688 1975717 1807957 1670520 1577409 1519813 1496105 1495382 1524073 1583448 1670975 1776402 1917111
17677 1917111 2118180 2409378 2840237 3516722 4547166 5937689 7509833 8807041 9521641
17668 9521641 9683428 9293068 8552833 8028798 8184753 9222661 11240378 14251538 18177638
17659 18177638 22955623 27976703 31411553 31771997 29563550 25442179 19706632 14040368
17651 14040368 9895598 7278312 5656452 4598713 3870298 3364208 3032977 2874938 2920193
17642 2920193 3142910 3440762 3622091 3584624 3357081 2945479 2400147 1907304 1537360 1274127
17632 1274127 1079682 915997 778375 664879 577956 507217 456015 413091 379467 356352
17622 356352 332725 301935 281688 266661 251755 234906 219220 209133 195322 179197 164703
17611 164703 155104 147384 142998 141841 141321 136415 124575 119221 118508 113618 110028 110792 107677 102653 102335
17596 102335 103746 101150 92336 85098 86513 85621 83425 80556 82784 88210 89925 95105 94783 91837 89429
17581 89429 85195 85142 80661 74408 73127 63858 58820 53679 55584 51618 56332 54879 53815 59059 61984
17566 61984 57631 51940 53139 46507 29414 21407 18628 21661 26348 29514 32120 30834 29744 30023
17552 30023 33297 40589 39300 32319 28960 16574 17092 19649 17235 20756 32583 42092 47722 49004
17538 49004 40585 44283 42125 35140 36528 48871 61375 67128 64182 61803 59537 59801 67352 73330
17524 73330 60979 55499 49896 36934 29742 21694 10913 6148 7942 15629 16986 16120 21888 32928
17510 32928 25403 20678 13126 5096 1772 9154 18442 17240 16999 18831 20567 15719 14311 14208 14366
17495 14366 18153 14087 7520 7935 9572 10488 14606 19534 26539 33088 29157 26702 27356 25658 26581
17480 26581 29406 27816 22678 23186 25141 29646 29013 25213 20860 13059 11618 13632 15785 15239 8491
17465 8491 5491 816 -5553 -3654 2427 -2733 -5785 3603 5790 10869 13604 14825 16133 17600 23261
17450 23261 25306 24119 23401 26025 30901 41046 47805 62904 88246 100697 76418 44824 30903
17437 30903 25376 18226 6843 5850 5880 3503 5584 9654 10082 4837 6619 -177 -6089 -4968 -207
17422 -207 389 2642 3091 6796 11591 15065 6181 -1930 -7262 -9792 -9940 -5446 -2700 -1986 -15 -940
17406 -940 -343 -4658 -4256 464 5279 5707 3199 6833 15095 19406 14442 12417 8430 1935 10032 10302
17390 10302 6796 3498 4696 9638 12925 18103 16093 5867 -690 1063 3543 8008 7257 1917
17376 1917 3993 -1358 4281 9077 4229 -9388 -7935 -477 3197 4787 -738 2413 6900 -242
17362 -242 2306 7554 -3111 -8108 -4408 -3186 -3611 1402 1719 1168 8187 7359 13882 13594 9227 7585
17346 7585 7505 5130 7488 13873 16645 7909 117 1691 6048 2856 778 -225 2957 -1666 3951
17331 3951 4245 -1079 1246 6096 16208 15879 10714 8116 1279 -4553 3933 8761 4654 -3214 1170
17316 1170 -941 -5563 -8814 -4487 -2539 531 3638 7948 2787 3415 3024 -637 -5950 -8354 -2140
17301 -2140 2243 2085 5302 12730 7871 -3187 -2334 263 2008 8360 6557 8650 8461 8075 8817 12764
17285 12764 8489 6597 2966 -510 -1107 -3000 -2155 2563 -6692 -12959 -10413 2315 9482 12366 7913
17270 7913 6517 6565 3572 1280 -3126 368 4188 3573 4971 6607 6793 8889 8304 4376 5163 5240 3295
17253 3295 8094 12182 17549 15511 16217 11894 3043 5616 5435 4437 9109 2743 -4627 152 9007
17238 9007 15098 16036 9082 2503 1324 4995 5565 822 -447 4997 7438 8082 7522 5507 6781 10894
17222 10894 11493 17693 21432 15297 7045 11954 14534 15078 13071 16279 26323 34418 44626 54553
17208 54553 61577 74942 89385 89951 96241 100593 94137 93943 95236 93807 99783 103297 96342 96856 109151
17193 109151 113700 116836 111865 101714 94274 84959 61947 39684 31467 25718 27780 24717 22120
17180 22120 29408 36139 43803 47837 49514 43766 37138 35152 31701 24315 19545 16417 12928 15462
17166 15462 12410 11774 14360 14906 17267 21814 30349 35380 36130 45330 59595 69615 83424 89122
17152 89122 88444 92396 100495 105587 103169 91987 76341 66028 58945 49148 50581 53895 50880 49785
17138 49785 52304 63090 73692 79697 83938 85728 84866 90262 79187 57040 45687 36572 18316
17125 18316 9424 7135 3825 9032 15073 12385 8561 7342 6622 5579 3494 6048 4908 169 -3427
17110 -3427 -3662 -3635 -3167 -245 -491 -7839 -2000 6677 7654 5146 4177 5422 872 -2134 -5192 -4405 -1084
17093 -1084 1769 6498 9258 9867 2368 1081 4015 3174 3898 1724 -3451 -5831 -5461 -2129 650 1695
17077 1695 -1646 -693 -1301 902 -3788 -2680 -2235 -11626 -13211 -11689 -9806 -6905 -6840 -4586 -6603 -8690
17061 -8690 -5888 2918 8312 5007 -136 -4332 -6726 -10994 -12395 -9336 -12488 -9156 -4266 -7244 -9634
17046 -9634 -593 3289 -1274 -2493 -1999 -3783 -7471 -10397 -8544 -6984 -3004 4753 6500 7739 9321
17031 9321 5517 573 -5270 -1370 -966 -5157 -1675 -5113 -3308 646 6348 8675 6426 5909 6080
17016 6080 10600 8128 7411 5578 2623 1894 3369 2747 1129 -64 2520 5310 2866 -3717 -9334
17001 -9334 -7852 -6086 -8824 -9822 -3134 -3303 -4112 -7658 -4563 -2846 -2678 -3397 -7805 -8394 -5537 -7244
16985 -7244 -14114 -17105 -16294 -10591 -7458 -7459 -12134 -11498 -2812 1758 8685 8718 3176 844 2818 1064
16969 1064 2155 1999 2603 -5349 -14433 -13886 -9003 -3799 5515 -273 -8148 -9355 -12723 -13015 -4326 -3945
16953 -3945 -6754 -8331 -11964 -8463 -6320 -6851 -6322 -3759 -1465 -483 -3294 -8967 -7492 -10254 -10725 -6711
16937 -6711 -3549 390 2245 2808 4260 -1441 -2606 -5607 -3743 -2193 -3907 -5329 -5950 -8139 -10389
16922 -10389 -6840 5979 3786 3948 5898 9668 5182 -1863 -2753 -14103 -18672 -15925 -6159 1639
16908 1639 -783 2160 -1061 -3708 -7139 -6575 -9795 -10959 -8103 -5889 2157 -918 -6875 -2064 1610
16893 1610 9271 9165 2481 -9 3484 3522 2468 -2635 -8250 -7430 -4867 -6289 -8080 -4124 4360 550
16877 550 1532 5475 5065 1597 7259 4400 -1507 1031 -5187 -11030 -9633 -5733 670 2969 4050
16862 4050 871 101 -3936 -11273 -11115 -5448 3056 4183 -271 3497 2091 -9296 -21602 -18323 -3605
16847 -3605 4324 5113 -991 -8662 -8069 -7094 -2895 1002 322 -1942 -7173 -9734 -14572 -18084 -8829 -6752
16831 -6752 -8682 -4674 -6267 -6791 993 -308 -1545 -3457 -3804 3606 1336 -2046 -8543 -11556 -10626
16816 -10626 -10436 -8158 -6145 -4125 -2130 -2544 1522 -5272 -7126 -8211 -5190 1406 -1885 -3942 -7360
16801 -7360 -12394 -8953 -5344 -7461 -7014 -11757 -12676 -14640 -10299 -10132 -6429 -2673 -9413 -9829 -10965 -6571
16785 -6571 4515 2736 4074 1502 -55 -957 4305 4946 -984 -4833 -9105 -6938 -5196 -6382 -5330
16770 -5330 -2109 788 -6664 -8945 -4748 -731 -2803 -8014 -3653 -5129 -6801 -7646 -6771 1891 7575
16755 7575 -2037 -7661 -4173 -4012 -4615 711 8079 832 -4242 1284 4067 2754 4775 6871 6013
16740 6013 12500 10716 -1323 -6376 -6546 -10423 -1618 2535 3620 6024 1354 -459 -2460 -8590 -8158
16725 -8158 -7253 -3231 -1932 -941 -2211 4229 -1329 -3491 -2161 -2399 -3249 -1458 -421 -3841 -8592 -10073
16709 -10073 -7475 -128 798 -1709 -2530 -2402 -3357 -6044 1577 -8026 -11227 -462 3106 2451 845
16694 845 -2745 -703 5860 4619 -3261 -8558 -10222 -12489 -7525 -7506 -7825 -7148 -2808 4618 2484 879
16678 879 2683 -3344 1344 2417 2114 3616 1310 -2565 -1307 -3930 -3950 -395 -1068 434 -1834 -3579
16662 -3579 -7697 -3315 -1199 -1169 -7872 -12879 -15759 -12699 -16246 -8053 -9606 -19060 -19309 -16397 -9619
16647 -9619 -4687 -1495 -4012 -11199 -12125 -5130 10199 8757 6587 8056 1152 -2528 -1039 1548 5212
16632 5212 1023 -4283 931 8091 7461 699 1840 1154 4398 2529 -4762 -7588 -6212 -4185 -3030
16617 -3030 2528 4003 1359 -1814 -9476 -3121 4275 3626 3151 153 -1632 4393 5123 -3060 -12514
16602 -12514 -12434 -15810 -15672 -11537 -10957 -7093 -9387 -14761 -7684 -7999 -7214 -12908 -10474 -8202 -9127 -12502
16586 -12502 -15278 -13021 -13098 -14116 -9148 -5506 -4487 -3989 -6845 -8051 -233 1271 -925 520 5064
16571 5064 1343 -5641 -10112 -12404 -11681 -6942 -3643 -6914 -9864 -13092 -12178 -5430 4907 2796 325
16556 325 2006 4512 4086 1547 6203 10533 12952 7395 5231 4418 13109 18631 16998 15020 7799
16541 7799 6217 8983 903 2836 -1846 1116 1750 -4461 -7220 3667 -506 -8811 -6297 -494 7932
16526 7932 7511 6185 7748 8149 2957 2778 -1865 -9193 503 189 -214 6476 5472 6964 6570 -1750
16510 -1750 -9790 -6348 1002 6107 8837 13995 12478 12238 8511 4423 7410 5304 4027 -1193 -10771
16495 -10771 -8893 -3132 1881 1466 -6826 -4031 -3046 1424 250 -5271 -7655 -4246 -5486 -10177 -1449
16480 -1449 102 -4762 -5447 -10798 -11336 -12711 -10442 -6843 -7128 -9120 -7825 -4902 -3481 -8050 -13697
16465 -13697 -6600 -2193 -4069 -6767 -3057 -765 -30 56 3098 1933 -3434 -5765 1324 5594 3666
16450 3666 2108 9154 13323 6623 2283 7309 9446 5397 1753 303 167 -1030 310 301 -361 -12180
16434 -12180 -18631 -11855 -8654 -4350 -4096 -6116 -6594 -1635 -1181 -7620 -7143 -8777 -8859 -2933 -1363 -5435
16418 -5435 -7529 -4231 1959 7244 5517 -5673 -8584 -11441 -6274 -1323 317 2306 -742 700
16404 700 5299 -1416 -7606 -2930 1612 -1572 -10645 -13728 -8644 623 8865 7973 -2481 -4745 -4132
16389 -4132 -6452 -9000 -9485 -3615 -3861 -5516 -645 37 -466 -4519 -4286 -2015 -4132 -8153 -1201 6869
16373 6869 10239 14828 12414 12083 5279 4413 6163 13672 11611 4618 3811 252 -4068 -6438 -11223
16358 -11223 -7964 -1573 -4109 -10781 -8873 -3964 -202 -314 846 -2804 -8637 -14682 -9260 -7349 -2714
16343 -2714 2074 -574 1520 -698 -5237 -7634 -8426 -6493 -4581 -7685 -13136 -9493 -8212 -2622 -458
16328 -458 -3605 -4679 -7982 -8435 -6804 -2735 -1529 -3934 -6267 -6001 -1349 -897 2267 1337 3032 3714
16312 3714 -2578 -9352 -16323 -13907 -8689 -12629 -16755 -15777 -9018 -4384 -2469 177 3681 4058 206
16297 206 1915 2289 3653 4167 -547 -5396 -4755 -11244 -11714 2328 10812 6793 -4412 -11070 -3209
16282 -3209 7913 5643 3993 11891 11311 5725 -2118 -180 -11 -2264 214 4634 382 -5118 -13972
16267 -13972 -6570 -2132 2294 1117 -8061 -10940 -6799 -5120 -1541 -2042 1849 11154 9586 1915 52
16252 52 557 -5601 -7774 -1368 5577 8089 7100 4881 4492 6912 2332 2648 9326 9228 7598 4312 2012
16235 2012 1862 -1635 -2205 878 347 -1919 -2652 504 5812 4986 6899 8944 7513 3141 6757 7047
16219 7047 -5017 -6971 1559 5370 5207 153 916 3111 3677 -760 1375 3919 1705 247 -3498
16204 -3498 -7184 -3301 -2464 -11212 -11909 -6221 -1550 -2662 -521 2544 -477 -3077 -6244 -9904 -3841
16189 -3841 -399 1002 239 -4192 724 112 2700 885 4294 5243 -1920 -5051 -4405 636 2577 4294
16173 4294 5230 -3403 -5152 -2920 -600 -1444 2616 1468 -1766 -3922 -2393 4302 4468 -987 -1776 -1522
16157 -1522 -658 2245 4641 3476 3746 2630 2935 -1060 -813 1237 617 -8966 -6382 -1965 512 -1935
16141 -1935 -8293 -14936 -13038 -6094 -4833 -2619 -7610 -6219 4413 10521 6940 946 -1136 -1033 -4770
16126 -4770 -967 3474 -445 -1304 -3965 -4866 -867 3105 566 5353 5282 -3722 -6845 -8516 -8956 -9317
16110 -9317 -14582 -9257 845 2327 3003 7200 7469 10611 7134 2511 5084 8461 13626 18481 15998
16095 15998 6883 -2143 -5437 -7723 -10962 -8176 -8049 -7797 -6225 -5549 -3963 -2133 -2357 -3192 -6521 -10195
16079 -10195 -9178 -12014 -14782 -10940 -6409 -1605 -799 -674 -4201 -7993 -10091 -9300 -3729 -3214 -12690
16064 -12690 -11207 -9490 -8696 -6093 -950 3800 -3238 -13332 -20620 -11804 -16 3818 497 1516
16050 1516 4592 1247 470 -4339 -4492 3349 7341 3178 465 6326 8449 9745 10695 8730 4223
16035 4223 6365 4129 -832 -441 6139 7834 7225 4108 -1034 -4981 -4846 -3780 -1075 -322 -2529 -4833
16019 -4833 -1809 187 -2257 -7794 -5252 -2443 43 -4583 -10411 -9357 -5750 898 1457 4665 2928
16004 2928 3055 -5346 -5729 3453 859 -7648 -3914 -2485 -200 2067 1828 3717 598 -1505 2136
15989 2136 3708 -531 -597 -301 5254 3563 4013 8489 6264 6093 3216 -196 292 -4490 -7346 -8030
15973 -8030 -8054 -6885 -1421 -5121 -8776 -12959 -12261 -8294 -5212 -552 2867 -2263 -3638 -3566 -2381 -3558
15957 -3558 -6260 -8867 -9703 -2844 -2003 -605 1427 -3946 -9038 -4960 2320 -2809 -9051 -9876 2325
15942 2325 10728 7451 7477 4337 2270 -5938 -9722 -7954 -7346 -3642 -904 -785 -4971 -9501 -3810 1996
15926 1996 404 2443 1387 -2667 -6861 -5932 -10267 -12446 -9065 -1486 1776 -1486 -8915 -10778 -1951
15911 -1951 4049 4603 1850 -2776 -4770 -8023 1110 10230 8635 4987 3259 4940 8033 6050 -6218
15896 -6218 -15861 -13990 -14022 -13876 -12540 -4287 -2435 -8254 -3357 3037 4708 1172 607 -716 -1710 -2842
15880 -2842 -1334 -2825 -3682 -7141 -1656 4888 6149 7109 -1174 -125 10389 10767 9060 8491 10520
15865 10520 9569 2058 -3202 -7615 -5710 -3787 -5907 -560 2691 1446 788 -4088 -3711 -6123 -1426
15850 -1426 2003 9291 7639 1471 4227 9148 8527 2934 9224 4214 -1504 -37 -4681 -3587 516
15835 516 302 -3483 -4502 -395 1230 4697 4041 5863 6894 5979 1591 -13775 -19674 -17418 -10993
15820 -10993 -11989 -6773 -2186 -750 -2383 -297 3204 2988 -470 -3053 -4060 -5884 -5408 -5769 -1844
15805 -1844 3029 -1872 -2197 -1017 5183 12758 7710 1818 -2791 217 4702 3016 2517 1603 1001 -705
15789 -705 -4141 -6999 -6940 -3084 479 5842 11554 10077 -1302 -126 4117 9169 9644 7160 310
15774 310 793 4280 10855 4659 -3688 -5917 -7767 -5086 -995 5148 10545 9451 4302 -3165 152
15759 152 1933 -8649 -6396 -3997 -3957 -4114 -4794 -3088 -2537 -1962 4857 6433 4120 -2101 -5315 -9263
15743 -9263 -8350 -2831 -1974 -373 1698 778 845 -4833 -4503 -4379 -5220 -1725 4520 9520 231 -8406 -7886
15726 -7886 -4883 -498 1456 3360 1109 -2308 -3410 1678 2625 1461 -3721 -5873 -505 -774 -5178
15711 -5178 -2996 -427 5906 9635 9524 1643 -4423 -3298 1424 747 4296 8594 1619 -3696 -632
15696 -632 -2837 -6562 -6663 -13471 -14599 -9926 -4452 419 -4081 -10014 -13386 -9445 -4622 -2873 -2423
15681 -2423 604 -3617 -9595 -8922 158 9463 13245 11520 9559 6940 3190 -1747 19 7291 5387
15666 5387 5511 400 -5034 -2040 4076 3456 -3963 -11197 -8666 -4951 -6048 -9566 -12279 -11026 -16414
15651 -16414 -15483 -10766 -5190 -6988 -17356 -16027 -11197 -11419 -15039 -13230 -10573 -12038 -11104 -4501 6772
15636 6772 10507 5318 3794 3791 1310 544 4539 10771 7387 -867 -3587 -1047 -4714 72 2963 1341
15620 1341 778 2030 10843 11596 13509 9965 1710 -4361 -3638 -1711 -3309 -3712 3728 5580 4701 -2447
15604 -2447 -11159 -17127 -12899 -4280 1211 4825 5284 2610 1934 3203 2876 4324 -368 1391 515 1915
15588 1915 7842 1560 -4162 -5220 -5158 -6780 -4858 -4733 -766 -1193 -5424 -8032 -4155 931 4103 -1551
15572 -1551 -1930 664 3543 -1767 -2965 7554 6493 -2193 -22 8021 11704 6090 -668 -3356 -6242
15557 -6242 -6994 -8452 -7236 -4591 487 78 -5505 -3497 -7570 648 3520 6069 7832 3483 -2278
15542 -2278 -3906 -5173 -8921 -9769 -11345 -14526 -14834 -6814 -1528 -3666 -1942 -964 -1261 1087 -644 -1342
15526 -1342 43 -4433 -11625 -10631 -4842 3645 7296 6807 8220 13399 10105 5293 4050 1766 -5222
15511 -5222 -5167 -2724 -5263 -6419 -14884 -23850 -14742 -7236 583 3092 4502 -1835 -5222 -1153 1475
15496 1475 -3821 -2034 -3960 -6755 -933 3911 -393 -6819 -5223 -2118 5576 5986 -3018 -2040 237
15481 237 3075 3152 -8939 -4836 4405 12415 17825 11252 1300 -3747 -4937 -5366 -4868 -4551 -7801 -13440
15465 -13440 -16700 -15662 -11365 -5628 -4328 -1030 -6840 -8465 -7654 -8573 -5647 -6641 -14307 -13554 -8886
15450 -8886 -3778 299 4283 1615 -2000 -4055 -12130 -14380 -10957 -4398 -1520 1695 4876 1446 698
15435 698 3351 -2119 -6015 -137 3883 495 4732 -2183 -7506 -4325 -5492 -8347 -15757 -17090 -13134
15420 -13134 -9135 -12524 -15410 -17972 -13404 -7878 -8831 -5507 -1306 2002 7719 8061 4392 -2095 -5807
15405 -5807 -3067 -1230 2056 -383 2669 6608 5537 8537 12062 9636 1091 -4263 -7322 -9046 -7471
15390 -7471 -3139 -3350 940 4823 3731 3316 -2523 -1177 -3084 -2269 -4367 -2504 2008 395 4631
15375 4631 3472 2524 -1276 -1374 -1963 -1536 -10148 -12682 -8384 -2765 -1523 -3500 -6340 -10957 -8242 -7916
15359 -7916 -5016 2741 -1320 -4 2584 1927 -6450 -7532 -6792 -10007 -11954 -8125 -4081 -2710 -835
15344 -835 -5257 -3926 -5157 -6308 -3894 -2827 2601 1383 5270 -928 -4464 -9678 -12276 -7010 -4310
15329 -4310 -5861 2633 3735 2205 -5466 -13426 -11847 -9919 -7036 -1891 5598 6815 6462 12064 13626
15314 13626 7871 3946 6136 16738 13698 7890 4958 2328 -455 -2222 411 3913 1289 -3349
15300 -3349 -3591 -3217 -360 1269 -3088 -12109 -11174 -12052 -12538 -15999 -14694 -9565 -6233 -921 2049 -3917
15284 -3917 -10065 -13508 -6880 1977 2889 -263 1423 -2107 -2326 7084 4286 -3746 -3972 5164 3080
15269 3080 3300 5594 4806 1942 -794 -3823 1480 2395 -4081 -6537 -12346 -10092 -6691 2237 8058
15254 8058 12676 12401 5346 2855 5660 1160 -2679 -4468 -8623 -8384 -11926 -5163 -2201 -11010 -15103
15239 -15103 -9506 -908 7241 4199 495 4204 1125 -7730 -6025 -1372 -3142 -805 -2055 -1571 4217
15224 4217 1758 2973 7342 4089 -3595 -4512 -3735 -2887 -2649 4202 1862 -2025 -3800 -5014 -4219 -5732
15208 -5732 4229 5228 6973 6008 624 -168 2248 2473 -3187 -9553 -6342 -326 528 -3250 -12338 -17567
15192 -17567 -14910 -9186 -6046 -1760 640 -2899 -12762 -10590 -259 5478 7706 5245 -1368 -8225
15178 -8225 -11476 -5949 -1157 -5868 -5828 -863 708 2631 5474 5228 8315 -650 1051 4565 7258
15163 7258 9992 12665 12175 6048 -5720 -12285 -9986 -1990 -5202 -8761 -8217 -2028 -3208 -1297 -765
15148 -765 1975 734 7945 5863 1904 5524 7273 3085 1004 -4622 -1513 -2537 -7058 -13380 -9070
15133 -9070 -3840 6663 -931 -3419 -4800 -1076 2609 6860 10956 9773 9151 5340 3997 5642 4915
15118 4915 -1290 -5288 -4274 -3569 -1292 -3060 209 5100 354 -3881 482 -1684 700 5370 12798
15103 12798 10667 5603 -4283 -6621 -7925 -8017 -4313 -274 4347 2891 1443 8770 13590 11524 1294
15088 1294 -177 -2487 -1478 1233 4052 9658 8405 7389 5605 4294 5771 3622 646 -790 5697
15073 5697 11773 6999 -513 -8508 -6267 -3597 -4321 -5148 -9756 -5147 -530 -3059 -4329 -358 7254
15058 7254 9808 5184 3559 1078 -4482 -7016 -5636 -1795 -3285 -1601 1765 5173 -3650 -7560 -3405
15043 -3405 -6662 -3116 -2612 -5568 -6026 -2050 -1574 715 3702 11128 13428 11278 9309 13127 17362
15028 17362 17338 21374 14900 4944 2165 -1070 1201 3681 7125 2778 1170 2659 5052 4483 4727
15013 4727 2312 -5533 -10263 -10372 -7719 -6032 -2588 2730 8962 9472 12726 12471 12748 12549 10450 3230
14997 3230 -1119 -4216 -3004 2150 8600 5729 4845 3358 3713 2344 2503 1812 5660 -809 -2241 -5918
14981 -5918 -2992 5239 2184 -1194 -4231 -2116 -2421 3350 7546 7755 -1175 -4067 -5947 -5906 -2591 52
14965 52 -1354 314 -6379 -5820 -6472 -5633 -5966 -4395 -5167 -5839 2169 3261 464 -1242 1596 4032 1013
14948 1013 -1449 -3428 1603 1490 -2277 2448 6631 2751 -3841 -8856 -6537 -5211 -6334 -989 1585
14933 1585 -2464 -1881 -5403 -3217 -3924 -6988 2651 3088 -8540 -9099 -6181 -1651 3138 1876 1752 -732
14917 -732 -5785 -5091 -4522 -4893 2446 1756 -663 -6194 -11637 -8305 -656 -859 3690 9641 7646 8413
14901 8413 3816 4809 2146 -1069 -1862 3416 6599 1276 -5650 278 -883 2159 2223 -3634 -2823 -843
14885 -843 2348 3982 4900 2545 -1498 -2289 3173 5423 7400 6065 3308 -230 -3749 -5066 -2945
14870 -2945 -6192 -153 -3042 -4511 -5003 -5614 -1292 -589 4184 9618 11023 15155 10258 6259 -1015
14855 -1015 -3183 -10690 -9010 -5025 -3578 -4090 2933 6911 10966 8223 1589 -4354 -7119 -199 4961
14840 4961 1326 -31 1904 8295 211 -4250 -1131 -5327 -10568 -10650 -7888 -7043 -4638 201 3992
14825 3992 7309 1183 -8858 -14378 -13675 -8253 -4618 -4073 -4679 -4421 4078 1923 -275 -1643 6646
14810 6646 7213 4765 4814 4189 8808 11977 15089 10185 8004 7541 8162 9036 6719 -1644 -7882 -1133
14794 -1133 4111 -2702 -2246 1042 208 -4723 2722 1445 -2705 224 6100 12682 10049 4615 -19
14779 -19 -40 -3688 -8798 -4356 -1914 -2196 -4970 -6399 -2415 2302 -335 -4888 -5904 -1098 -4016 -4355
14763 -4355 -6246 -1233 -1102 1773 -654 -3419 -1355 3516 8159 6138 778 -4501 1 -1520 7760
14748 7760 11078 1770 -1937 -258 945 -87 -6206 -7219 -5350 -6431 -10679 -7102 -2511 278 1902
14733 1902 -3883 -745 -1426 -6199 -7422 -809 8201 4999 5410 7661 5737 4917 -3684 -6842 93
14718 93 1421 -2643 -2946 1784 7467 6509 9165 9744 9990 7436 -238 -4725 -1342 -1545 -4854 -810
14702 -810 -985 -3614 -4861 -5393 -6512 -7582 -4646 835 -162 4091 7323 4219 5240 1993 -2366 -1187
14686 -1187 2152 202 1969 1434 1604 2586 7445 2175 -7805 -6192 -3572 -2666 -461 -5190 -11030 -10696
14670 -10696 -9438 -2650 3339 1950 -6221 -5305 -1982 -2911 1929 3346 -5091 -1138 -1395 -489 -2564
14655 -2564 -2598 -663 4253 1006 -7511 -11387 -8455 -1783 4695 5613 706 622 -587 -2091 3808 -249
14639 -249 -10240 -8522 231 4791 -3148 -11412 -13388 -16901 -13986 -13779 -13196 -10623 -13028 -8229 -5462
14624 -5462 -3950 -6342 2584 2338 1229 10114 11969 5674 -125 -805 -3525 -8613 -7279 -3020 -4438
14609 -4438 1161 2746 8634 7583 -7095 -6798 -6887 -7526 -11056 -15551 -14674 -11189 -8195 -207 -553 -3212
14593 -3212 2356 1845 -4556 -3697 2964 4620 2633 670 -2225 841 -220 -3426 -5466 -5856 -1209
14578 -1209 -144 859 -3222 -3844 3860 1854 -4418 -9920 -15210 -15233 -6444 1571 2790 1877 8818 7815
14562 7815 9437 11447 8216 5851 3255 3360 843 -7583 -10319 -14881 -18023 -16126 -9863 -3705 128
14547 128 708 -1958 -3272 -657 -59 -2746 -836 3528 1819 249 -4991 -7774 -4162 39 -2545
14532 -2545 -9962 -13818 -12333 -9337 -4705 2116 -3163 -8487 -10383 -10004 -8295 -8102 -14089 -12092 -5469
14517 -5469 -4910 -4847 -1541 6961 7631 8317 5450 -1237 4213 1124 -218 -1289 -8247 -8806 -8552 -12445
14501 -12445 -10699 -8174 -5180 -11645 -13308 -7791 -2904 -3100 -5307 -3091 4670 8650 2084 -11739
14487 -11739 -16898 -8433 6991 6170 2710 1981 -6180 -2720 -302 -3127 -8143 -6300 -9824 -13528 -9591
14472 -9591 -6763 1564 5374 -5701 -12590 -15331 -10898 -4880 2568 4958 55 -4296 -5527 -7631
14458 -7631 -9174 -4785 -2801 957 153 -320 3042 7493 10649 6423 954 -1730 -2242 -8121 -8951 -5723
14442 -5723 -3844 260 -3886 -6552 -5745 -799 346 -3112 -252 -3700 -4154 -307 -1158 -4698 -3962 -2679
14426 -2679 -3003 -2668 -2146 -2237 -3973 -4633 2785 5537 7796 3129 2361 9511 18323 10949 9848 11068
14410 11068 4059 -4058 -6643 -2270 -1589 492 -832 406 -3366 -6339 1347 3964 2811 4246 3731
14395 3731 8243 9618 6247 5682 5930 3871 2850 506 -964 2339 -3859 -975 755 1874 -7
14380 -7 2491 1372 -3078 -7693 -15092 -12116 -10506 251 10562 11030 4436 5072 4607 5078 5436 2342
14364 2342 9270 12462 3963 -431 -2691 4824 1495 -201 -10046 -7692 -4726 -3526 -12900 -14586 -7945
14349 -7945 -5404 -8279 -1599 1003 2736 -1087 -304 -1258 -3758 -4237 -4320 -1707 -2421 -1184 2536 5245
14333 5245 4407 967 -1968 -10770 -11157 -9968 -8161 -5544 -4251 -538 -5627 -1553 5113 3165 -3102
14318 -3102 -9492 -9272 -5872 -5784 -4409 -8709 -8533 -4803 -5065 1880 -2567 -9181 -6118 -5851 -3795 2735
14302 2735 7488 4577 -2540 -5316 -6299 -6354 -7613 -6873 -1101 4056 7742 -288 -7599 -4331 -2793 4641
14286 4641 8121 2665 -7821 -8123 -7194 -2659 -4478 -6926 -5095 -40 -2835 -4946 -6769 -5237 -4759
14271 -4759 -1848 -1909 -9875 -11489 -11049 -8605 2287 6342 10304 9388 2096 -10516 -17900 -2962 7663
14256 7663 5768 8172 2731 -12856 -14742 -4820 436 2327 -1585 -5724 -2345 -9054 -11212 -11625 -12997
14241 -12997 -8304 -8222 -6805 7716 13157 11790 15675 14910 8357 1799 -1135 -4516 -15764 -9263 -4495
14226 -4495 -3812 -4250 -6596 -10169 -15452 -8481 1469 6933 1855 -7978 -5546 4378 731 -4318 -6542
14211 -6542 -3856 1095 5268 6607 5584 1469 -3626 -4584 -1555 -31 5465 6440 -2260 -1596 722
14196 722 2886 8249 7867 6773 10831 15512 11859 790 -9271 -9720 -3430 -10428 -12532 -7470 -3809
14181 -3809 -6058 -993 -2078 -9892 -12965 -11255 -9241 -6364 63 8915 11068 8285 3646 -1569 -2088
14166 -2088 6624 6681 6048 796 3093 6020 2692 4399 6199 4852 5437 6329 5682 4376 3793 2025
14150 2025 -877 979 2979 4116 -1837 264 -5181 -4876 -2607 -548 1378 4706 1685 -2222 -7925
14135 -7925 -14888 -7831 -5847 -8025 -2845 -2225 -5304 -10425 -12425 -13004 -2779 2600 2292 1745 2502 -1192
14119 -1192 -1249 -83 1552 13217 15503 14761 12333 3120 -1457 -2930 -3020 1644 3139 -740 -5445 -5287
14103 -5287 -3931 -1296 1651 -841 -1509 -512 -3823 -903 -663 1505 588 -5052 374 9768 11669 10017
14087 10017 6748 10433 9408 3590 6939 14509 4881 1951 2534 -325 -7794 -11221 -7947 -7062 -5807
14072 -5807 -4219 -904 420 2421 3001 2012 4645 5947 3914 -3632 -4323 -4883 -2368 -830 -2909 -1689
14056 -1689 3428 4514 6494 6824 3244 3179 5444 9970 10538 8929 6586 -1447 -4308 -7327 -7384 -5828
14040 -5828 -7194 -1136 3298 5701 3357 4863 -3220 -6616 -6898 -5968 -8049 -1496 -1028 -784 1641 960
14024 960 1323 -132 6221 5982 1593 852 1705 1660 6221 11401 12418 13067 16400 8945 3732 9031 9703
14007 9703 -1898 -12721 -8636 -6570 -6930 -1863 946 6296 2139 7964 11630 7380 3076 1994
13993 1994 5472 429 -2832 -4317 -3326 -3854 -5048 -2669 -7357 -6555 -1768 -155 -276 14 3504 11312
13977 11312 12585 11558 8664 4893 1613 1397 6969 6564 -508 -6586 -11224 -8529 -2783 1250 7139
13962 7139 9887 6929 2452 -1474 -3840 947 4985 2461 7649 13758 18701 18174 12698 13350 15086
13947 15086 12162 12699 18260 18831 7658 8870 11304 13345 9390 10097 11530 8054 13644 14796 13002
13932 13002 8474 5832 5570 8768 12546 10581 8302 7870 9018 8646 7166 6300 2678 3926 7357
13917 7357 6706 5885 4883 2738 -522 -3437 8341 12860 12150 8297 10606 10369 12152 11350 4598 3393
13901 3393 11761 16739 8958 10712 12609 4724 7604 11345 20338 20980 14524 1698 -4436 -2667 4936
13886 4936 13232 15557 16909 11563 12689 8479 10564 6958 6873 4764 2775 -2554 -5956 -1919 4153
13871 4153 3451 -3324 -4323 -1095 -3887 -12042 -7961 -327 -7108 -4986 -849 4479 6653 10981 17309
13856 17309 15738 6207 6584 5626 2189 5886 3355 639 1883 2220 8526 14371 16767 16465 12557
13841 12557 5318 2948 1320 -4104 -5836 -6543 -3243 361 3902 2949 -5 2697 7850 4094 -6410
13826 -6410 -5658 -6979 -6353 -5063 -185 2454 -1155 -1055 -2145 5733 3230 -429 -3299 -3473 -9179 -9126
13810 -9126 -6412 -152 3800 6721 14445 18511 17367 9559 -3845 -9307 6 5990 8812 12627
13796 12627 12795 7386 5756 653 -1572 4059 12180 4632 -490 -5379 -12879 -12267 -489 4479 2407
13781 2407 -2210 691 -589 -6908 -6626 -2876 5879 2909 214 -4254 -537 -1922 4294 2139 -1987
13766 -1987 -4501 -3039 -4747 -5664 3228 2804 4712 3920 11581 6905 4199 2016 2804 4627 8139 6655
13750 6655 3428 -1696 -3778 -2236 -2294 -5237 -8005 516 10882 13848 14770 14502 6389 -2252 -577
13735 -577 939 8784 10234 8411 5663 3862 1823 2923 2007 138 246 2831 7318 7718 7637 4266
13719 4266 -277 2385 -3335 -6301 -7063 513 5259 2931 3929 6344 8400 5702 1002 -1402 -831
13704 -831 4646 3805 11052 12063 14844 12284 9044 6023 6438 6864 7776 10058 12118 10788 5861 4893
13688 4893 345 -6912 -4612 -66 -262 -4687 2448 8159 15667 11443 9859 5019 1258 -3100 -7109
13673 -7109 -4707 -2274 3492 6118 8881 5234 3006 4417 936 -750 3727 10717 12059 7179 12655
13658 12655 12603 7265 7445 4528 5480 13705 16995 7675 3907 8936 10444 9912 -1543 -5672 -5536 -9118
13642 -9118 -7102 -5678 -7930 -5436 -3924 -2931 -1107 2566 3428 397 -2430 -3254 981 5280 4665 4469
13626 4469 2672 -1314 -3573 -2175 -7194 -7364 -95 -1918 -1677 28 875 1617 2093 4751 8906 6706
13610 6706 5040 2679 1649 6465 7711 6940 8661 10767 17136 14413 15217 17363 19865 21059 25930
13595 25930 36061 53207 64660 80732 95089 104835 97903 81430 68479 55351 36551 28957
13583 28957 30128 29034 23117 19300 16601 14998 16269 15949 15938 12991 13261 13498 17150 20678 17912 13513
13567 13513 10715 14059 16510 17181 21285 25645 18705 11867 17669 27976 34025 41360 59293 76408
13553 76408 102845 139179 174070 201192 209584 196439 169441 136045 104463 78926 64336 49570
13541 49570 41700 42080 39381 30582 25100 19192 17124 22724 26212 22372 14892 8017 11059 9966 10020
13526 10020 17014 18265 20033 21615 20358 22046 18821 21112 29113 24795 24293 24630 32387 40901 57946
13511 57946 73339 92891 107218 106406 93273 79596 67010 51429 26703 16621 15083 10464
13499 10464 16949 27414 30103 23105 18404 11507 8475 6725 3875 5938 11269 9162 10810 8362
13485 8362 12962 8312 2773 323 8226 9352 7051 4215 1405 -78 1012 12599 11104 12706
13471 12706 6107 1554 5377 8507 11898 18026 14580 11529 2871 -1196 1545 8310 12292 12909 20721
13456 20721 19198 19240 21530 18630 10344 6446 10146 15340 12060 1668 -2126 4299 3870 3200 9097
13441 9097 11793 11525 7211 5741 4407 590 5226 7342 2199 1202 3784 5518 245 204 3943 8796
13425 8796 5447 2547 11240 15670 8059 6862 11624 8115 5893 2458 2463 2334 2342 2508 3693 2562 6921
13408 6921 5581 74 880 2051 2183 7727 11392 13781 13944 17656 25508 26447 27147 23442 23004 29363
13392 29363 31566 37952 42367 37221 30288 31257 27816 26050 27392 25841 25474 21008 21884 27395 30141
13377 30141 25824 15405 19534 21408 18084 13722 12234 13806 12455 7778 1476 4749 15596 21489
13363 21489 16690 16427 20975 20845 22009 22601 24307 27000 31410 39528 40819 38569 46208 49022 46480
13348 46480 45644 41976 31361 25444 25182 30086 32150 32828 32399 23752 21436 25584 35844 40344 33692
13333 33692 27472 20685 20325 26052 18286 16030 17294 19747 10922 6165 11182 18787 14154 15411 18161
13318 18161 18389 19599 19143 22295 18528 20859 24405 30499 31341 34788 34375 28105 25269 18348 18972 18415
13302 18415 20309 18168 18535 25941 34484 35563 38298 37609 38711 46316 42204 40147 46702 39382 30313
13287 30313 21964 18791 24913 21714 16436 16930 17001 14553 12361 17346 20018 26010 26333 24998 30131
13272 30131 34215 27401 27175 23131 15315 14915 25884 36178 40388 43274 50377 51473 51072 48696 47174
13257 47174 46156 46429 51061 58140 63720 65157 65319 64639 64512 62497 63680 60514 52458 47629 47782 46539
13241 46539 43696 42746 40516 37969 44004 45381 39262 37898 41172 46081 48162 46627 47894 52709 53959
13226 53959 58120 54532 64221 81763 95137 92245 88419 86253 78369 68985 64398 62033 67131 69172
13212 69172 71537 79691 84490 87779 86311 84964 87674 83689 75864 75212 74180 78994 85564 94566 99255
13197 99255 98814 99421 110686 115085 109053 112650 116354 113971 111777 118070 128159 131444 138152 151979
13183 151979 154453 160582 171823 181754 187349 193601 191672 195876 201330 199691 206909 215252 227048 237086
13169 237086 252999 267350 287680 305310 316470 332093 366128 397390 434718 473050 513710
13158 513710 560102 607895 675593 755466 849651 963396 1101866 1256125 1431156 1656478
13148 1656478 1957055 2358169 2899098 3658004 4756049 6361183 8681678 11819253 15538241
13139 15538241 19006310 20994846 20630340 18132581 14597264 11163937 8429630 6476832
13131 6476832 5122457 4168748 3483805 2984544 2613242 2333535 2123225 1961124 1836530
13122 1836530 1726449 1649771 1609403 1595791 1602606 1640671 1704390 1802357 1929978 2101552 2310935
13111 2310935 2551598 2835914 3177461 3612041 4201269 5018695 6167482 7800663 10168573
13102 10168573 13680980 18816899 25791863 33948021 41288696 44963545 43154662 36722106
13094 36722106 28481513 21008611 15393842 11557722 8981702 7196125 5908364 4950813
13086 4950813 4218862 3655867 3218103 2867755 2566925 2311067 2096767 1923056 1794844
13077 1794844 1711252 1661595 1637798 1641401 1676183 1734369 1820894 1925330 2048645 2216735 2448218
13066 2448218 2779189 3232968 3868189 4781461 6113653 8055484 10792079 14316571 18155975
13057 18155975 21226396 22288905 20789574 17375361 13399929 9943049 7380874 5611107
13049 5611107 4394617 3535779 2908167 2427774 2057299 1766474 1527331 1315749 1142721
13040 1142721 1002407 879569 774586 689626 625104 570724 527582 487465 453212 421567 390530
13029 390530 363981 347536 327602 308803 291619 272933 260058 245344 231156 220023 208283
13018 208283 192781 186501 175265 165749 162400 154140 152572 145281 145239 148687 141608 138743 132623 129026
13004 129026 118938 111158 107288 95918 94751 98432 94042 86297 90088 94811 93290 85609 79659 84047
12990 84047 79918 72968 72505 66040 56553 49171 49181 54568 51894 50072 55510 54726 53700 51769 43744
12975 43744 43181 47286 52026 54056 64924 75429 81749 88765 87563 84548 72721 61535 54052 57580
12961 57580 49008 43213 43315 51694 50102 49201 46171 46887 48706 47233 45893 44565 34062 28373 25497
12946 25497 18333 8139 1992 2889 12560 12931 13219 21669 30615 30297 33513 31277 32848 33739 36460
12931 36460 42440 49600 53749 55447 58150 57501 57224 56069 54450 53431 49596 42631 31731 34697 32864
12916 32864 32231 32517 31376 33136 38957 36606 30398 33981 36556 28444 18302 15682 8541 2917 2764
12901 2764 3724 4569 11168 10128 11295 12924 19893 22210 26193 30175 24870 21603 27873 27357 23101
12886 23101 22154 21074 20202 17604 23299 32331 42816 46990 42606 35484 28115 26738 31071 29958 24290
12871 24290 16154 22336 25738 28829 24698 21561 20959 18842 13289 9324 8080 2631 3012 7203 13521
12856 13521 15309 9904 -2643 -8763 1455 10137 19373 21315 22777 20109 14452 13180 11254 13377
12842 13377 23138 21663 16857 11312 10510 17119 23396 18293 11706 9419 8970 12867 13047 10164 9195
12827 9195 16653 14589 10074 5717 2482 1886 967 -1209 -611 4462 7693 10658 11349 7692 2902 778
12811 778 4660 10158 10318 3941 1365 -1677 -5269 -7850 -7412 -1091 3501 815 1035 378 5464 4622
12795 4622 9106 12490 10423 14476 17644 19824 23111 15210 6629 5530 9191 12628 18357 16612 14650
12780 14650 13517 16191 20841 17166 21928 27864 26217 22191 22391 28530 32967 31791 29521 26519 19871
12765 19871 14326 16840 16846 19024 20383 20358 17151 14001 14725 6960 6339 8924 9586 4976 7841 9777
12749 9777 7012 7847 17084 16384 16275 9848 14964 14580 10948 17266 19603 11945 8082 4091 -720 -1754
12733 -1754 -2279 -1212 -2965 2691 7163 12397 9575 7700 7110 4631 8242 7776 4460 9046 5654
12718 5654 3813 3858 7334 5108 5798 10720 13904 9335 14021 12518 11639 8809 10923 19771 15474 13431
12702 13431 12729 9716 6548 3520 2747 1203 692 -1554 4384 11385 13080 12984 7877 10254 19126 24887
12686 24887 27343 28705 28699 39937 49798 62461 79357 100705 112928 115381 105180 91905 76409
12673 76409 58114 50629 43098 30422 21957 22145 27689 26324 16157 10960 9606 16793 23690 23884
12659 23884 18240 9151 1862 6491 8778 12857 13595 11891 11727 20920 26798 27350 31825 45483 45355
12644 45355 41253 48343 72948 99264 126579 160562 201049 229465 235558 213856 174776 132400
12632 132400 98817 74216 50942 41036 36216 32395 27313 21001 10093 10632 13011 10372 9420 14949
12618 14949 17612 14387 12361 10547 4932 5130 4621 3244 5189 4504 4912 5772 14194 27660 34433
12603 34433 44227 52715 58356 67200 79655 92213 107708 118174 112301 106068 89363 64789 48791
12590 48791 37845 26595 13066 10066 10143 12733 16890 19279 18228 14603 15002 15135 8204 7939 9504
12575 9504 -474 -10048 -8013 -6751 -3120 -629 -3728 412 3954 6646 5513 842 -174 664 -1539
12560 -1539 -3619 -3406 -4408 -4461 -2782 -2645 -5439 -5282 1026 1992 509 -1727 -107 3745 2284 -3806
12544 -3806 -7474 -2835 -2412 -1883 4835 11459 15878 11891 8247 7290 13015 8718 -3140 -6584 -576
12529 -576 -898 -1669 1814 -340 -3798 -11280 -10848 -7938 -4836 -4021 -6420 194 1586 2295 765 1195
12513 1195 2294 -115 -3089 -2440 -2346 3582 5987 5455 4750 -4035 -2187 -3541 -5100 -5769 -4781 -8937
12497 -8937 -9456 -11754 -11303 -5047 -7625 -7906 -9024 -10912 -11493 -15340 -15506 -14324 -17409 -17537 -13943 -7809
12481 -7809 -690 -60 -18 -3900 -1148 1308 -766 -1477 -7681 -67 1483 -1271 -6399 -6074 -3057 5227
12465 5227 2238 -4304 -5761 -4855 -2871 -1718 2323 6026 1188 -5031 6323 13872 9094 -1217
12451 -1217 -3994 -2396 -1067 1953 976 205 -2517 -2668 3174 -3738 -7735 -6664 -5679 -7532 -12951 -11208
12435 -11208 -6711 -4672 348 3794 -4169 -9145 -5995 1107 -1273 94 -2303 -7536 -3304 2519
12421 2519 -2363 -4097 -5618 479 -6974 -9374 -4065 -46 5591 10485 9548 12623 8805 7169 12012
12406 12012 11633 8476 2041 178 1053 4780 2356 145 2047 -6302 -2804 7849 12123 9138 10318
12391 10318 1112 -8294 -7628 -11335 -9726 -3176 1499 2567 978 -1645 3272 3843 991 -86 -495
12376 -495 -2855 -8539 -11247 -10915 -9056 -2860 2276 4431 -1660 -910 2100 7536 4481 7931 7255 4272
12360 4272 3265 8719 2674 -4054 -6366 -7774 -4311 -918 1756 3415 6015 5793 7138 9159 16210
12345 16210 17894 14477 9375 8543 4409 -2193 -1647 1336 4382 7637 6006 6032 3322 3511 3375 -2509
12329 -2509 -878 1944 -166 2461 5480 -587 -5692 -9141 -11144 -14177 -12938 -7277 -5525 -2062 4797
12314 4797 8035 4463 -5996 -1530 2285 -5714 -7746 -6270 -2986 -1864 -4919 707 -2992 -4420
12300 -4420 292 -1570 1784 4553 5314 1769 -66 5013 3044 3341 -2543 -3018 1923 3589 8947
12285 8947 9596 9863 11986 10777 10400 7001 4730 2445 772 -1055 -1672 -1404 -1712 -744 -1185 -274 -1841
12268 -1841 138 -7750 -12943 -4493 818 240 6619 9919 10084 9723 7318 6433 8776 5852 2889 7871
12252 7871 3679 201 -596 1125 -1380 -47 -2198 -3999 -3017 -734 91 -1861 826 2852 8483
12237 8483 7006 4026 11007 2131 -3696 -6692 -11437 -8067 -1447 5312 12159 12675 10844 3849 5348
12222 5348 3803 10224 11899 7857 4737 4110 430 -4222 -5245 -3670 4093 9899 8039 4969 3113
12207 3113 7643 16280 11340 2017 705 3012 -2034 459 4682 203 -5348 -861 -2031 -3953 2045
12192 2045 3068 4784 8499 11177 16214 13749 11729 6951 3562 8254 13018 13115 3775 -1451 3288
12177 3288 13453 13921 14736 20177 13937 7023 8213 7645 3343 3950 2537 4833 -163 956 2840
12162 2840 6095 10298 13957 3760 -1281 3453 6456 -493 -2043 -390 -3058 -8046 -11005 -8825
12148 -8825 -6285 -7110 -4531 -544 -6648 -8957 -3252 -2525 -4555 411 7846 2660 1955 3479 -998
12133 -998 -4527 -3248 -4345 1952 6014 10050 8947 3817 -1551 -3614 -4150 -5849 -4037 -2071 5702
12118 5702 8089 3434 2098 -569 -2979 -6620 -1161 7754 14125 14835 6259 2985 8834 18293 15176
12103 15176 16923 16514 10464 1756 4687 9234 267 -3061 6180 12838 19208 17754 10219 10903 6832
12088 6832 -555 -3313 -7699 -3080 -9700 -14634 -7368 -430 2566 1 -5156 -3743 2148 779 3488
12073 3488 2704 165 2937 3785 3707 5363 3006 1483 4246 -1676 -1767 4756 4583 5415 12141 10067 7708
12056 7708 6432 6545 6537 12809 10516 9675 16506 14651 8110 3957 1827 6002 4503 -1533 -6150 -6392
12040 -6392 -7957 -9105 -9392 -5908 -2606 -166 -841 -374 -2979 -8703 -14720 -15004 -8962 -6189 -6992 -3554
12024 -3554 914 739 -261 -3278 -1631 4189 8409 1022 -6022 -1653 4342 8987 4992 6021 10605
12009 10605 12697 11780 8911 8276 6692 -1500 -2462 -711 -3822 -2789 -4821 -2563 1123 1358 1165 -5768
11993 -5768 -5263 -3234 -6367 -3017 -805 160 302 -2379 1216 -364 -3987 -59 2825 7274 2513
11978 2513 821 -1715 -4545 -2909 3860 2099 1317 4398 7483 3260 1827 -1632 -6509 -2354 -2627
11963 -2627 -3741 -4974 -6648 -8423 450 8887 9842 8216 2109 944 2014 10074 15970 6011 1415
11948 1415 3302 5981 -199 -10446 -14826 -11882 -9300 -8940 -12234 -7183 -15627 -15090 -8100 3042 3608
11933 3608 3876 7315 6309 5633 4321 2100 3954 9447 10073 15485 9767 -3282 -5863 -5033 1681
11918 1681 -1266 -7970 -9005 -6474 -3235 375 3115 -8592 -17936 -24288 -25213 -21531 -18075 -15308 -6391
11903 -6391 1181 -85 -1476 -3609 -5892 -6580 -2288 -105 -3973 -8821 -5780 -993 3194 2842 6778
11888 6778 3147 1058 -1737 -4631 -2106 -490 -2637 -4140 -2670 -786 -4928 -5808 -3783 2123 2867
11873 2867 1231 2578 -44 1597 -1129 6807 11044 843 -5475 -983 3182 5291 11025 13765
11859 13765 8408 3246 7514 8787 2598 -847 2197 5681 4864 3198 2953 1410 3717 -1895 -3124
11844 -3124 -3813 3552 8436 4030 3354 1668 -998 -3723 -393 2096 1140 -40 134 -1369 2789 4245
11828 4245 9006 11743 11309 4228 6250 5720 1560 1685 1737 -131 -3185 -7720 -4462 4934 -3018 -2431
11812 -2431 1942 2208 3605 6582 4059 -1033 830 1558 3193 -1795 -11241 -18437 -10871 -6910 -10458
11797 -10458 -8376 -319 -4258 -373 6141 8506 10520 3207 -169 -3035 -1791 -1868 -280 -620 -3780
11782 -3780 -5445 141 1396 -3939 -10469 -4061 1282 4737 2056 1209 283 3943 5763 2200 2704
11767 2704 951 -2140 286 -1272 -2610 -2837 -1723 -5954 -7165 -9169 -10278 -12917 -14929 -11681 -7668
11752 -7668 -4546 473 2612 -921 4719 7056 7434 1525 -3276 -3403 -939 4132 -2104 -11407 -10855
11737 -10855 -7706 -4270 -1326 -6838 -11998 -4051 3379 1994 -8111 -11608 -11092 -2877 868 5695
11723 5695 4877 5090 2782 4030 6467 2210 -3807 -771 4185 4688 4886 4211 4556 5105 4537 946 2012
11706 2012 2713 662 2222 425 2831 9036 8150 5600 11095 11967 5713 -1252 -5858 -195 7163
11691 7163 8674 9588 7598 7171 3910 6266 3531 -3084 -2503 -1601 -8167 -10422 -10321 -3993 -2170 -2369
11675 -2369 -5574 -4362 -1477 -1507 -9236 -11397 -10047 -8838 -9580 -6628 -6091 -1487 -8 4519 7865 7380
11659 7380 7074 7728 1779 -9106 -966 5734 1744 3054 4760 2108 -4450 -8078 -10432 -5513 2295
11644 2295 6285 8446 187 -5134 -2218 -3270 -10873 -14890 -8176 -7417 -7583 -6531 -3744 -3133 -7004
11629 -7004 -7025 -4477 5873 4442 3618 7722 6333 12511 11519 5757 1559 1599 -2015 -4149 -1492 481
11613 481 6097 3078 550 5132 5589 3702 -310 -4195 -4063 350 5192 3277 1924 -26 59 -1773
11597 -1773 -6903 -6997 -10452 -10837 -5603 -432 -1934 -6501 -2582 -3774 -2767 -5520 -1895 -2532 1444 3282
11581 3282 -3011 -5128 -4233 -9639 -6521 -998 -1002 -2372 1547 7624 9809 7248 7151 2216 -874 1415
11565 1415 4312 -86 -1910 -6136 -5049 609 -1532 -5715 -4816 746 3877 1055 2381 6095 8513
11550 8513 8885 8093 13044 9503 4395 -646 6777 10110 5851 3639 4887 8788 6236 2920 2287
11535 2287 2740 2057 -399 1133 -3804 -7609 -2656 -1502 2840 7704 7001 -3382 -11675 -4249 -455
11520 -455 -1534 -4065 -5223 2629 7068 6987 -1297 -3108 1058 -952 -807 -6867 -4572 4256 2984 3108
11504 3108 9648 18434 12944 7192 5033 9521 8588 5702 671 2819 9194 9283 8186 8065 6239 1345
11488 1345 -3318 -2200 722 2394 6127 10655 9427 7266 6994 5730 -4572 -9403 -2109 -1325 -3711
11473 -3711 -1349 -1668 -8370 -5150 -1725 -1460 -2767 1690 5908 6012 3154 -4349 -7165 2308 6086
11458 6086 4777 5482 9437 2683 1118 -831 4079 9487 12436 7984 7314 7914 3250 1608 12768
11443 12768 17910 10337 4177 -6440 -10739 -8507 -5743 -5742 -9861 -10345 -9269 -11322 -9902 -2732 4354
11428 4354 5713 3839 2373 1915 3184 -11 -12863 -16829 -9292 -1250 1347 -5215 -6472 -3726 -4685
11413 -4685 -2681 -5831 -11452 -5967 -4631 -3190 -1466 159 -393 3452 10682 11613 10397 5316 -324
11398 -324 -905 -601 -3378 -2274 -763 -4368 -6412 -6081 -1013 6553 2115 -1977 -5883 63 6795 6874
11382 6874 2500 -4560 1108 -1649 -3563 414 -146 -324 39 1184 -653 -5730 -9197 -7589 -1492
11367 -1492 -9164 -11725 -8810 -1917 -4326 5165 11074 4426 -3802 1349 6111 6789 -2222 -1303 529
11352 529 3993 3432 -1567 4142 3583 -971 -3988 -2200 3879 7570 12064 2323 -1893 3778 6597
11337 6597 8085 11904 6285 -3086 -3431 1720 621 -1518 -4088 -5488 -3659 -839 -890 -4961 -9195
11322 -9195 -4062 1937 7609 5696 101 -3261 4691 9207 8443 7410 4640 -2769 -521 2211 9086
11307 9086 19271 18251 2667 -6952 -6511 -1859 -8105 -7034 -1080 3737 4913 2176 -3693 -6320
11293 -6320 -5971 -298 -286 1405 2316 -1006 -2480 -2429 -1028 2988 1925 2151 9083 12103 14825 20334
11277 20334 19365 15462 18463 14351 12802 11281 12508 14635 11379 9631 15083 11917 7108 7065 15168
11262 15168 17350 19999 11297 4319 12229 15835 15646 16296 10427 7206 13321 24155 27531 24246 24503
11247 24503 20400 23058 13351 8849 16853 18794 10479 5770 11359 9924 6770 13175 12650 12851 11985
11232 11985 4941 4791 7248 5158 11552 8478 10502 10866 7343 4617 8769 7197 12820 10692 8784
11217 8784 11694 8792 9118 6642 13197 16315 11175 8709 6741 3016 -2129 475 4200 10239 21686
11202 21686 17987 13165 12686 13619 14841 17724 17562 15898 18055 20932 18231 16756 17677 15825 16716 16060
11186 16060 18423 16501 13106 6582 8484 12047 13980 10438 7253 7646 12738 9856 6535 4091 7881
11171 7881 10014 5288 11428 13645 6888 3361 8981 17431 19575 15849 15677 21478 23145 22542 18022
11156 18022 12624 14969 10229 8000 9611 1454 -1563 -1362 -4095 2761 8717 10252 9594 9810 11053
11141 11053 21668 20475 16639 15086 7603 5477 6943 7831 10396 7936 8011 2350 1274 -3004 4120
11126 4120 3136 3050 3957 6239 6769 13498 15872 11427 11801 14378 18083 19927 19003 17652 15343 7095
11110 7095 8896 5548 2694 6201 7417 1834 3496 6707 3580 8057 9900 10002 5584 3751 1058
11095 1058 -861 4396 5982 3193 270 2115 1364 3056 1948 -2379 2384 6978 6227 1466 6810
11080 6810 10355 10580 9980 9083 12833 13071 8594 7796 5220 10894 13593 7321 -1363 2618 12788 15261
11064 15261 18562 18473 16284 12972 5220 9691 14085 8412 4888 864 3941 7435 12086 10386 12545
11049 12545 17907 21940 26028 24236 16626 14629 7955 9181 14759 10212 5439 8091 8453 5794 5932
11034 5932 10193 12619 8203 10279 18868 16350 17340 20701 16879 14913 22970 27724 21807 14927 15276
11019 15276 15157 14651 13108 10237 7942 4217 3496 5348 8082 10894 11047 11729 20009 18971 16803 26418
11003 26418 25532 17276 14950 16036 14276 5958 1317 12775 17146 16527 20314 18259 9938 7479 6954
10988 6954 7051 4701 633 2118 -4417 -8540 -4566 777 7572 14562 11029 16410 18298 13652 13984
10973 13984 11796 8727 6207 4276 4885 6443 5254 7535 13774 18180 21899 25085 25989 25624 17679
10958 17679 12001 19650 23037 24855 30860 30278 27981 26109 22701 28760 34994 36693 36385 35458 36945
10943 36945 46338 56385 67612 78741 92031 103625 101243 86521 64970 47050 39142 30189
10931 30189 24353 19629 10992 11083 18298 21470 29885 29324 20896 19172 21629 27083 30945 23432 23189
10916 23189 22739 23440 20220 16447 17668 27293 33707 35578 34588 36895 39233 38396 32980 39863 53213
10901 53213 58486 68443 85733 104763 133287 167236 179575 185247 187195 179241 163969 144769 127275
10888 127275 101800 83872 76591 64312 59380 58084 57859 45987 40933 44715 51158 52566 47843
10875 47843 45966 42063 34549 27432 22381 23244 29674 31696 23495 17985 21991 36373 36003 30560 32352
10860 32352 31574 31980 29053 23570 32385 34803 42809 61543 78170 97546 114420 128034 128851 125081
10846 125081 123037 106836 88057 73370 55649 41360 36086 31101 21391 23422 23277 26612 21391
10833 21391 16155 14407 13354 14682 19015 21103 23261 23838 25154 19880 15826 11813 13699 16727 13811
10818 13811 7205 7554 7429 9338 16835 23478 26560 18581 12469 5356 347 -7348 1449 11525 14477
10803 14477 17346 22665 27564 28389 28666 29947 29507 27507 25271 26870 31365 28327 30528 29933 27672
10788 27672 32946 31909 31594 28103 27616 32208 42018 47948 52822 51671 39741 39837 39091 40231 39030
10773 39030 34899 35609 35203 33285 32412 29625 33265 32250 29207 32431 39087 37546 38185 32434 20977
10758 20977 22730 24745 28761 32176 29134 32459 31932 25904 28020 30296 30504 31007 23145 16441 14315
10743 14315 19787 25446 26814 26464 35344 44239 52571 54445 53442 56184 55321 58097 58877 58425 54868
10728 54868 51382 47359 46572 50982 53828 50883 45603 42832 35933 32748 27498 23122 21610 17264 15067
10713 15067 24921 30604 32079 29858 27478 35569 32759 26668 26333 30008 25000 27399 34724 41360 37593
10698 37593 29941 22877 31134 38672 41635 42865 38562 37148 38490 41901 44249 51788 54561 47980
10684 47980 44588 41153 45250 46625 50312 58749 63149 56354 56139 59900 56336 47312 44632 44109 48583
10669 48583 52668 51377 44748 41759 38540 30304 30924 28155 29501 31855 27292 33785 36225 38477 40810
10654 40810 49718 52871 52134 55578 62622 59925 61792 73954 80803 74413 72154 69070 62824 63855
10640 63855 68699 69591 68029 69644 74341 84753 94526 84302 82225 83397 86706 84295 80108 61384
10626 61384 38561 19577 14305 14788 15916 15822 19074 23649 23271 31308 44569 47146 41760 40353 40188
10611 40188 48412 60922 72944 82053 86532 97850 107227 103740 108548 119353 127489 140612 156241
10598 156241 164249 160385 161316 164660 181354 202776 221227 243779 274682 317496 397801 500543
10586 500543 630484 792794 972375 1136457 1268078 1333948 1304744 1197444 1037617 858518
10576 858518 695378 562820 465328 393651 336270 306917 292279 274919 258883 250912 247867
10565 247867 248931 248075 242255 241946 243629 246387 258000 265267 269220 277809 290003 304516 317053 332592
10551 332592 354049 376250 404451 440641 470042 514732 566354 626951 702434 789201 892435
10540 892435 1005123 1132479 1274733 1439434 1631425 1873773 2216641 2705303 3406697 4431566
10530 4431566 5888395 7835417 10209593 12721923 14895373 16232111 16428575 15478383
10522 15478383 13645303 11356061 9060724 7071466 5515003 4370211 3554508 2980348
10514 2980348 2576944 2295841 2084797 1925131 1799971 1698942 1614918 1543806 1479466 1435996
10504 1435996 1421845 1439350 1489973 1571413 1694744 1874411 2119267 2449869 2874007 3364885
10494 3364885 3879920 4371205 4775896 5106779 5450365 5937048 6758083 8122557 10253944
10485 10253944 13366102 17515803 22380663 27084466 30376392 31286904 29841880 27016938
10477 27016938 23955574 21233101 18775724 16261252 13605978 11027690 8813329 7133323
10469 7133323 5986595 5280181 4902508 4754722 4710308 4620776 4374893 3946924 3418351 2904922
10459 2904922 2485694 2163948 1937683 1787307 1692744 1651370 1649086 1691707 1770056 1872193
10449 1872193 1991519 2126424 2277478 2467825 2708081 3039199 3510299 4195698 5214293
10440 5214293 6695148 8763494 11474761 14650450 17822835 20302559 21419715 20857428
10432 20857428 18807296 15841854 12647930 9758998 7450260 5735144 4517309 3661395
10424 3661395 3055317 2617328 2303148 2069389 1883371 1731647 1593140 1455374 1297980
10415 1297980 1130535 988722 876945 784208 707555 645158 596925 558151 512757 471998 435760
10404 435760 406769 390701 379448 364105 346417 326350 304229 277656 254697 242386 229445
10393 229445 215254 201298 188368 181590 175888 170615 171365 171907 165594 163898 161845 168543 162659 152828
10379 152828 155399 160991 159292 146878 137331 126172 133634 136761 134407 128959 127604 130142 138287 145477
10365 145477 149196 160177 172509 183872 192238 191396 179912 170716 159287 150727 137532 115537 90203
10352 90203 76759 69047 67590 69950 72227 83009 85993 90861 94611 95154 94690 92584 93356 98887 100074
10337 100074 105379 103829 109888 108452 109288 108765 102769 106078 109020 107007 108621 117738 126766 138482
10323 138482 158548 173006 196727 229562 275365 328101 361551 367950 336162 291989 250073 224138
10311 224138 207312 191018 185033 186313 192491 197031 202996 203197 202339 197999 190155 180926 160371 136031
10297 136031 123853 115491 117953 123219 128422 143581 175810 224734 280508 314065 323313 304687
10285 304687 275333 247053 224213 212280 207755 218520 227782 225647 225877 229013 232794 228915 232063
10272 232063 230963 232792 236674 237082 246396 261291 276646 283502 285695 292943 299926 308695 314985 327430
10258 327430 340447 348676 354549 364546 370272 365493 356061 354370 353959 357903 364338 359155 363845 365737
10244 365737 368301 368207 373397 385906 401402 408114 408638 418854 427734 432227 433467 440220 454077 466731
10230 466731 487986 512571 549010 593253 630323 643611 644812 650518 666496 682781 704489 727630
10218 727630 748128 763615 783883 815807 848087 887596 932762 985378 1049772 1113987 1161283
10207 1161283 1209923 1252093 1299103 1357065 1425291 1489401 1547573 1596577 1640377 1697268 1771762
10196 1771762 1881697 2017457 2196861 2420391 2659113 2893245 3132486 3414917 3786980
10187 3786980 4255190 4816057 5486859 6293828 7228840 8277187 9387927 10432680 11282926
10178 11282926 12012651 12921710 14243170 16134388 18787385 22522935 27859465 35666081
10170 35666081 47349751 65345907 93526011 136688523 197313133 266439263 313310825
10163 313310825 303053313 241880518 171556013 118522555 83997743 61819595 47121850
10156 47121850 36958102 29624944 24185572 20108267 17061969 14828382 13282037 12273031
10148 12273031 11559126 10828774 9872524 8756395 7671513 6739372 5956714 5311873 4774232
10139 4774232 4316047 3917457 3563367 3273489 3048975 2887424 2750995 2598307 2431571
10130 2431571 2266546 2104055 1940584 1792583 1678961 1585980 1509511 1439997 1355743 1279240
10120 1279240 1220573 1171450 1152069 1151532 1164563 1170058 1159065 1137190 1108959 1063819 999647 935710
10108 935710 875482 832216 791340 751574 712670 672392 639341 617333 605156 606811 605979 590887
10096 590887 573242 558411 537889 512982 489156 467969 453800 447818 437402 431425 425487 420317
10084 420317 408447 389016 379821 373260 363626 346155 341682 345003 358722 371808 386705 394060 384745
10071 384745 355469 318900 299428 299326 305755 312956 316181 317013 317067 315148 310836 308768 306762 309819
10057 309819 307296 307629 296676 283699 278624 263219 242567 231953 222115 216459 220649 223183 218149
10044 218149 208893 197925 194341 197865 213758 252297 316668 391832 458088 495595 537158 554021
10032 554021 489571 406029 348731 310332 276711 247966 217141 194105 186520 192549 202684 213797
10020 213797 221486 232802 234436 229954 210777 190376 154271 97920 43061 9036 1964 21647
10008 21647 63732 99083 117732 128692 134978 134072 143512 143274 138762 140256 138630 142203 140817 146279
9994 146279 153000 146673 142691 137900 131328 140360 150672 160973 163636 166056 162145 162163 169182 178294
9980 178294 179381 184159 187244 183843 177040 165243 146084 125718 107966 83062 53615 33576 20677
9967 20677 12484 19649 36964 51904 71405 83000 82115 94666 111905 120873 117950 113060 116946
9954 116946 114344 105359 99474 96446 97552 96525 95724 95047 96683 94620 96795 105206 109007 111066 116011
9939 116011 121566 119933 112655 111730 115737 109823 95398 95178 93897 79389 64337 61338 58560 64942
9925 64942 67099 66382 68537 67720 56700 45005 38432 40579 43309 39760 37320 40038 47394 48969 45596
9910 45596 55989 65940 75689 74513 83694 98388 109707 113887 109537 109656 109251 102674 99391 105250
9896 105250 108225 104977 103765 103279 97118 89853 91740 92436 88103 83610 79765 73371 70590 78143 85147
9881 85147 90157 87665 88804 98304 92996 93991 102119 106986 102375 104472 106701 107034 105436 102891 97659
9866 97659 93892 95017 98717 95493 100838 119028 135129 154054 173880 204410 233297 240598 239603
9853 239603 238705 234547 235432 244001 249821 258772 264923 268870 276064 286474 302752 323061 345086 370674
9839 370674 401253 445725 486391 524907 580813 657540 744056 859996 1021541 1241296 1549178
9828 1549178 1980507 2581723 3368757 4250044 5031002 5503234 5627560 5414588 4811841 3954141
9818 3954141 3129564 2489530 2023473 1689681 1453612 1289170 1175027 1098575 1047177 1014078
9808 1014078 1000138 1002826 1011174 1021208 1041300 1073623 1120944 1186828 1279736 1399803 1544042
9797 1544042 1736508 1973587 2256949 2579170 2910015 3226860 3557311 3993869 4646448 5601194
9787 5601194 6988626 8968723 11690037 15098478 18689185 21668053 23426459 23642602
9779 23642602 22577993 20993321 19416669 17729441 15523834 12872582 10321230 8259294
9771 8259294 6724972 5616125 4818732 4266849 3890672 3626152 3416180 3195107 2927935
9762 2927935 2680773 2498295 2374375 2309423 2297814 2346077 2469570 2674757 2967390 3302372
9752 3302372 3559029 3649319 3685807 3839914 4194023 4791426 5706416 7064412 8980328 11446784
9742 11446784 14156865 16339516 17293167 17422568 17864794 19252233 21180056 22262997 21253959
9733 21253959 18528095 15403043 12625060 10306730 8384941 6873622 5787069 5063579
9725 5063579 4609977 4277482 3902783 3439728 2993095 2648320 2397016 2212462 2081541 1999489
9715 1999489 1964946 1986956 2053119 2132203 2169932 2158175 2133346 2154402 2246894 2400768 2653081
9704 2653081 3036152 3587030 4311703 5161420 5990883 6690676 7467733 8655493 10355681
9695 10355681 12357379 14102400 14902151 14504154 13331882 11828255 10009145 8010854
9687 8010854 6240014 4902998 3980139 3351777 2900155 2526963 2173536 1866337 1628086
9678 1628086 1444214 1297229 1173959 1061615 965737 885305 812711 762466 728039 706084 694084
9667 694084 682468 676698 680620 684005 701395 745365 804871 877183 972458 1118046 1320780 1627166
9655 1627166 2056601 2608129 3235279 3784664 4088525 4137496 3969918 3524693 2855397 2192096
9645 2192096 1664319 1289155 1020912 832940 699217 595463 509362 460430 421871 392707
9635 392707 363226 324848 293608 264277 235035 213969 191381 170498 155638 143187 135224 129953
9623 129953 124826 117361 111870 115041 119111 117105 107915 105907 114111 115443 111319 109377 106799 104024
9609 104024 102776 94363 92298 95057 96287 87806 81337 84467 85657 78248 76740 81270 81546 85861 83197
9594 83197 75161 67562 66392 64950 56725 52732 52888 52172 43680 40979 41136 36723 29267 30548 30496 30609
9578 30609 36512 42780 44454 47599 48863 53324 56463 58546 57073 52846 53812 56374 53968 50190 55217
9563 55217 59105 55082 54837 52817 51740 45513 48505 50088 47122 52039 49073 51910 49924 40298 30775
9548 30775 31502 33028 29141 25793 24755 22782 24550 21148 11856 12331 15947 11835 16845 20067 18044
9533 18044 21658 25003 28635 28489 36073 40454 38288 38019 34506 33683 39702 42512 42369 34856 28762 31132
9517 31132 38977 39426 25715 24950 30900 30855 33460 33996 26104 24239 29284 32721 30427 23974 22727 19483
9501 19483 15621 15172 9844 9044 8827 12735 16236 16033 16152 17069 10749 8815 10260 11699 12920 12721
9485 12721 15066 15269 14038 14035 1434 5211 6453 7225 7915 12526 17388 22207 27486 25195 21294 16914
9469 16914 14106 20559 23785 22631 21872 27427 26392 25343 26959 26490 23899 21231 16353 16119 19357
9454 19357 12145 7325 5637 5089 6884 2450 2847 8967 10572 9365 14795 20310 21497 12977 12924 15835
9438 15835 15555 14432 891 -882 966 6540 12352 14540 21317 23223 26899 32190 35451 37406 26198
9423 26198 20546 25954 28392 37189 36119 39179 50832 43705 35979 30722 29913 31409 20864 10313
9409 10313 8319 13763 22130 22654 16628 11933 12392 13865 17708 11833 8308 8858 15452 23317 20281
9394 20281 25734 23314 20582 30244 30856 27892 18442 15655 16536 29468 34579 34943 42581 49727 55394
9379 55394 69486 83158 97434 100193 93973 74459 60382 56488 61742 63024 45768 41066 36309
9366 36309 34840 32311 33458 38496 33241 26589 22147 20110 24958 31415 33180 31222 27122 25106 26133
9351 26133 31815 33152 26619 21181 29959 31747 27374 27175 25033 32124 40872 51897 60464 71473
9337 71473 84391 84258 85426 101913 115352 123338 130000 127189 113112 95365 85671 80367 67917
9324 67917 51607 38246 32142 30263 25850 22163 24720 27402 25601 19183 18052 19050 16389 12998
9310 12998 14555 17527 18668 14889 17251 20861 20091 21258 22135 19429 17883 22905 28345 27409 34857
9295 34857 37937 38941 48551 56431 65627 70227 76600 83831 89017 84767 74842 62250 51506 45966
9281 45966 40723 34904 30945 26926 20519 16286 18377 21578 16892 16196 9823 4079 365 5064 5967
9266 5967 6233 3661 12961 17482 13223 11185 9610 4202 -7541 -4049 3254 3714 3821 8166 10941
9251 10941 11450 7813 6847 15610 23739 31422 32712 31257 31965 25895 21320 20811 16893 15177 18247 21066
9235 21066 20695 14798 11957 12884 17696 17497 12611 8972 5914 9493 14816 12205 8953 7325 9371
9220 9371 10361 9289 4279 1715 -1527 -3296 -8056 -6734 -3971 -5190 -3811 884 4344 6156 4671
9205 4671 4628 1700 -1401 859 1504 1677 6858 5454 3938 6512 9160 14001 9934 4656 4801 10468
9189 10468 12046 7343 7263 12711 8564 9794 11674 10835 6001 12981 12346 6790 2097 298 -3325 -6427
9173 -6427 -8983 -6157 171 3489 2523 6333 9060 13339 9565 3758 1952 -2533 2233 4799 -370
9158 -370 2204 -1801 -386 2239 -1208 -1360 2935 7510 730 -4965 -4334 648 3205 3953 2278 506
9142 506 3941 11822 11288 7624 5546 8169 12069 8122 4972 9085 10293 9628 10537 12805 11843 8769
9126 8769 3242 -3236 -2348 173 -597 2645 8104 13023 6962 4675 2435 7657 8711 7935 8312 4007
9110 4007 2311 5184 3748 -4594 -362 -1051 -6425 -4457 -4946 -2349 -5003 -2278 -7750 -10592 -2536
9095 -2536 -2594 1071 -1465 -8747 -12865 -4030 -23 -2478 -3563 562 2721 833 -2183 -5068 -8507
9080 -8507 -5551 -1467 2155 4447 4733 1906 4444 5305 1525 1907 1319 5545 5865 9592 12426 13229
9064 13229 8450 5805 4369 313 -5469 -6015 -2384 1294 9289 7889 -3617 -3821 -2017 -8520 -2446
9049 -2446 -824 -1749 -1835 -849 -1985 -3655 1256 -620 2336 3758 1944 2242 3137 10126 14092 8460
9033 8460 526 1987 7970 12213 9847 8845 7629 5670 7587 4150 2476 5454 -1237 -6932 -6031
9018 -6031 -928 1627 883 -3876 -7910 -4333 -3107 -5806 -6555 323 1300 -248 1578 -1169 -10051 -11133
9002 -11133 -7566 -7943 -7131 -6997 -6732 5619 11534 13294 8482 -307 1514 4341 8128 10088 3798
8987 3798 -1429 -1126 2078 3437 1891 5758 6705 -1788 -7889 -11645 -12258 -7001 1923 3082 3703 4518
8971 4518 6280 1826 5675 5374 9980 11467 7990 6270 3774 2603 6177 2741 -4950 -5229 -1651
8956 -1651 10190 8023 -1312 -1461 356 3630 3475 3854 -1022 6839 13495 9467 7703 1027 790 4599
8940 4599 5034 4718 -677 -3976 -4835 -1697 2405 2671 2330 10013 9759 12964 12733 1535 -928 2562
8924 2562 2841 -6033 -7926 -273 12994 16685 9837 8783 3681 356 -3191 -5880 2361 8708 10077
8909 10077 10623 12288 9502 7007 7913 2196 1347 3541 2980 2680 2414 -2342 2428 4374 1038 -1498
8893 -1498 -2537 -4732 2208 3431 1954 5500 5145 3033 3828 1923 1027 5146 7600 7645 5950 3394
8877 3394 3723 3803 1558 3644 -743 -10870 -8712 -11023 -2090 848 -3715 -8493 -9750 -3284 2241
8862 2241 3393 15437 23969 23094 13077 11506 12432 9628 5247 12611 13336 9978 1936 74 5382
8847 5382 4136 -685 -5197 -5235 -6139 -7957 -4304 -4790 490 2377 7575 7486 14002 18876 15864 5933
8831 5933 -2179 -4841 -3970 3524 5488 2727 164 1825 882 -1344 -5756 -14745 -17167 -16393 -10080 -5252
8815 -5252 -1655 -5713 -4839 2077 5092 10887 9685 2829 998 135 -2036 -850 1385 2873 10600
8800 10600 9394 8320 7722 11422 13166 8732 6968 4922 -1003 -10779 -15507 -11003 -2120 -1088 1184
8785 1184 2625 2100 5131 3655 -1862 -4776 -3888 -199 -5298 -6077 -4148 -580 3802 7491 10116 4018
8769 4018 -2743 -2543 3 573 5436 8790 317 -2677 -665 -4482 -8841 -11813 -10779 -6374 463
8754 463 9046 11395 12267 11163 9158 9226 6205 7847 9717 8088 1215 -1611 2458 6009 8439 14448
8738 14448 11865 2907 -360 -2825 4076 5469 -2496 -7395 -6934 -201 4419 4184 -274 -8428 -3888
8723 -3888 371 -5089 -5637 -1582 263 -4531 1529 4629 4566 11327 5020 91 -222 4090 2999 8464
8707 8464 12998 3328 -5776 -5830 -2381 1055 -1121 -2940 -1847 1280 7556 3206 850 -2278 394
8692 394 2431 1146 591 999 4061 5966 4303 4038 3486 -1885 856 -287 -7809 -9145 -9388 -5956
8676 -5956 -2745 -3603 -7020 -6502 -1567 4228 5457 14163 11729 3871 -421 422 2560 -4580 -4291 -10741
8660 -10741 -13514 -12331 -7924 -772 -2828 -11310 -10015 -6688 190 11612 12519 9681 8076 3655 9222
8645 9222 10895 4984 5901 3329 29 -418 3792 -1170 -11532 -10875 -938 7848 11853 12453 17142 15195
8629 15195 11650 11674 7880 5674 -102 -5060 2656 6572 1422 -1049 5830 11671 8079 7063 13448
8614 13448 18931 17021 17454 15251 5525 -2112 -3469 -2012 -2428 -3195 831 2347 7019 13828 15325
8599 15325 11836 4861 2019 992 1891 -2837 -2486 1712 1740 5263 7273 10835 7726 1482 -3836 4998
8583 4998 7867 9609 7008 13557 10603 15562 16905 13520 16475 27367 29921 33465 32117 26010 17245
8568 17245 14866 14254 15966 15609 12898 13021 13309 8573 6705 522 -5501 -7158 -6487 1896 2691 3627
8552 3627 5594 4302 8473 12118 5567 66 3209 3531 2075 -301 -4052 -437 6361 7833 7426
8537 7426 6262 5343 6689 11094 8962 8806 7818 11725 10028 6631 2438 2381 6571 4333 4020 4452 6686
8520 6686 7755 13196 12023 1340 -6972 -13914 -14591 -5641 -3941 -7155 -11166 -6964 -9054 119 7136
8505 7136 3688 3746 4231 1231 -60 60 -1695 -4488 -7707 -4572 7296 11312 10986 3754 3958 3402
8489 3402 -2343 -2288 -8015 -8835 -9184 -11352 -3568 -4282 -5992 -625 4943 5419 10051 4206 7018 12732
8473 12732 4009 1847 -2559 -4930 6874 7007 1768 -255 -2067 -4101 -4721 -4770 -8916 -13488 -10498
8458 -10498 -3008 -461 -4652 -7746 -4718 -5486 -1024 4576 -3402 -2266 270 2589 4195 341 2342
8443 2342 4339 685 40 4446 9065 8102 5516 8570 3495 -6993 -3695 -2386 -2301 -2122 -495 4392
8427 4392 5274 3467 9727 18568 12145 6094 8125 14256 12816 6987 491 24 400 4450 8322 5747
8411 5747 -1441 112 -6067 -5707 -3331 2853 -1481 -8404 -7505 -10835 -13384 -8943 -2512 3460 10627
8396 10627 10008 1390 -3314 -6115 -4585 -3616 3844 10238 5562 2352 -3748 -9563 -4272 -1346 532
8381 532 4056 3043 -4443 -6112 -600 4637 5525 4885 2521 4415 3141 3071 1818 -565 -2334 -832
8365 -832 -8241 -17184 -3912 906 4001 1229 694 2967 -839 -3338 86 -81 -272 2550 1804 9178
8349 9178 11773 3077 174 -2074 -1607 -1899 -353 3326 -5455 -9562 -3130 4124 4894 738 -2350 -774
8333 -774 -3563 -2317 4983 4925 2782 -354 -891 -1232 -656 2246 4186 -2118 -2572 -5980 -8486 -7896 -7854
8316 -7854 -12569 -15591 -12986 -8281 -2046 -1397 -9304 -8323 -1295 -842 -2715 3751 1569 -1426 4094 892
8300 892 218 -32 -1090 -2784 -5129 -7018 -6852 -3523 -8061 -11247 -11327 -4275 1165 -60 -74 4738 2000
8283 2000 -4655 -10962 -8685 -3345 -3353 -3038 -8532 -3589 -2458 7827 7796 12584 16948 11765 6827 4115
8267 4115 5478 8067 6011 2836 38 -851 1688 -418 -5134 -3401 2003 4635 5684 3269 1261
8252 1261 2510 -2375 -2851 -211 -3935 -6641 -3311 4269 391 301 -1638 -4511 934 6587 9952 5480
8236 5480 7807 6981 713 4714 13469 15840 14836 7563 -224 -833 -3206 -5592 -10697 -10824 -12396 -13466
8220 -13466 -15923 -15885 -16702 -19085 -14967 -12254 -13747 -8652 -2161 2739 7644 4037 4334 3822 5343 7627
8204 7627 7286 -2103 -8673 -5514 -515 1580 -3346 -4589 -6819 1236 2972 2972 3739 9809 14701 15343
8188 15343 5552 -3106 -7175 -5784 -2247 1963 1557 -5537 -5556 -4480 -1233 4418 2878 602 11382
8173 11382 13541 1858 -4826 -4189 -6235 -11838 -5462 984 -2708 -5054 -14148 -12405 -10075 -2107 3985
8158 3985 1382 -1928 44 5905 8460 1494 2885 3058 1082 190 -1906 -5480 -1938 -134 1474
8143 1474 5327 8133 4495 1887 410 -291 5733 7645 3240 -1582 -2764 112 2456 4188 3144
8128 3144 6062 8029 5463 10008 8216 10996 11445 11130 10076 11360 16473 13412 11974 12578 11127 7872
8112 7872 5917 6791 4292 -31 1319 3324 3091 -4955 -7398 -11921 -5830 -4165 -6464 -8994 -2078
8097 -2078 -5227 -305 6954 1320 -2694 -4225 -4890 -4882 -5901 -9218 -4609 -3733 -3529 -3147 -5782 -2626 75
8080 75 6230 4027 -1249 -3816 1099 -434 -4436 -4910 -2472 3622 411 -1773 338 276 873 1205 2972
8063 2972 5312 5744 376 5984 12517 9319 -1041 -894 495 -4417 -4021 -4248 -2916 -3312 -2985 -3946
8047 -3946 -9203 -14846 -14999 -13441 -9308 -3128 -1564 -952 -362 -1854 -2956 -2851 -5015 -5422 -2245 441
8031 441 2208 11841 18806 14254 12809 13872 12911 12341 11599 2965 -3940 -3718 3542 6439 3490 265
8015 265 -4930 -6160 315 5975 5520 2162 -736 -1699 1210 4782 -2427 -877 -166 2584 307 1205
7999 1205 3760 -159 -172 -1054 -150 -3348 -8007 -2090 10431 10258 9927 11240 8249 6073 1807 2005
7983 2005 5989 8597 13499 11610 11881 12487 14277 13118 6562 -3141 3642 9803 4496 -5547 5095
7968 5095 9606 13302 16526 10790 7242 9170 11024 8095 9618 14244 18543 13290 11874 2042 -2572
7953 -2572 12354 18663 14117 8426 7368 15034 12287 10370 13959 15420 16411 10699 8568 5395 4826
7938 4826 390 1570 991 1583 1158 5493 9084 8766 4776 4196 8962 14566 17949 7103 -144 -2728
7922 -2728 -811 11177 17247 15744 12951 10943 12399 5501 6936 1528 -5167 -620 -943 -855 -1753 -1700
7906 -1700 -4354 -4067 -5242 -6607 3970 9095 12785 10540 6829 2299 -179 2532 3792 7554 8875
7891 8875 7601 12205 13844 21400 18156 8554 5446 1620 -5012 -5190 -1970 4876 5694 10371 13029
7876 13029 1416 1792 5397 9215 11716 9635 8941 4129 6825 7233 4947 6475 11697 3964 -1485
7861 -1485 -3856 -4042 -6247 -7748 -2361 -4089 -1444 6185 6327 399 -2018 -3528 -3744 -284 -4042 -5901
7845 -5901 -769 1667 3326 476 5294 10398 -990 -11494 -4991 -1377 -738 -1886 903 5131 3798
7830 3798 209 1206 2773 4568 -45 -3071 -5355 -4988 -1012 -10372 -9902 -8904 568 11723 8877 667
7814 667 -15 -3589 -975 1145 -4070 -3871 7466 4516 -2909 -206 -6665 -5491 -1215 4465 5680
7799 5680 10217 10655 7134 6690 9393 10113 4426 3520 3998 13634 12082 10125 8338 84 2460 -1299
7783 -1299 -4920 -1554 4474 4525 5096 6611 7107 2584 -237 2874 -268 1771 -156 -29 -918 4296
7767 4296 12406 9976 10813 7459 4589 1923 90 2353 1824 3088 6293 -331 -894 1581 1179 -3036
7751 -3036 -4407 1244 2214 -452 -977 -6537 -8707 -4249 -3270 -750 -4480 -7347 -12873 -15272 -14680 -9100
7735 -9100 -7519 -2933 -1362 -93 -5011 -4850 -2301 1806 -3656 -7384 1272 -4273 -8904 -10848 -6022
7720 -6022 -1489 3693 5311 7309 11437 19928 15814 8306 9479 11232 3913 -1117 -781 8014 7129
7705 7129 11587 7374 2923 2511 -4160 -10450 -10106 -6123 -2845 5205 6821 3927 2038 -7 2105
7690 2105 6721 9625 7699 3030 -4427 -9067 -14591 -10088 2352 4149 -762 101 6038 10148 12210
7675 12210 17317 14293 5432 4660 1944 -10652 -8259 -10896 -8544 -2729 -2327 -7107 -8054 -9896 -4205
7660 -4205 -1428 -2603 410 2622 3245 2826 3902 6443 2708 -6294 -4712 5013 2710 -4501 -7497
7645 -7497 -512 -1251 -3008 -4278 -9921 -6888 -5450 565 8888 9221 1260 -38 -6702 -780 1388
7630 1388 -2956 -4225 -1113 -2684 2132 4702 1401 2849 -496 -3923 -8029 -2781 2405 524 -2558
7615 -2558 -4155 -5092 -5428 -2604 -5394 -6594 -2462 6033 7849 3863 614 1999 4196 4962 6352 6884
7599 6884 6204 569 2135 -6453 -8148 -5943 -3551 -1879 -3759 -5149 -2870 3855 6350 2626 2144
7584 2144 2714 5120 1667 -2778 -5725 -4825 -5952 -6954 -9900 -7214 -8716 -12786 -9963 -8048 -3156
7569 -3156 1868 2007 3845 8809 8582 4601 -1123 -1795 -1894 3306 3700 -6122 -9547 -2271 -2255 -5452 -9448
7552 -9448 -5374 2405 570 -1964 -4725 -12590 -12356 -5078 -1151 -836 3886 5907 10009 7343 1839
7537 1839 1391 -1597 -7313 -3338 -3634 -6963 -7923 -10984 -6711 -3748 -6799 -3108 2200 -2827 -4927 -8884
7521 -8884 -10843 -6714 -2265 622 3096 -1967 -7038 -6529 -8468 -2052 -4550 -7096 -11214 -9639 1362
7506 1362 790 -930 -3864 -1927 -909 8548 14679 10285 -770 -1118 3554 3123 -785 -5927 -5636 -5129
7490 -5129 1218 1003 -532 1394 -1077 -3023 -11460 -9412 -4308 -4913 -2427 -7501 -6699 -5578 -5660 -5005
7474 -5005 -2508 2725 -474 -1538 -2615 -355 2574 4389 10097 5900 6826 358 -3369 -4541 -4546 -4795
7458 -4795 -5107 -6060 -5670 -5143 -5264 -4319 -5064 -258 -2677 -6505 -7117 -9012 -8219 -3450 6832 7761 5783
7441 5783 6653 6533 3739 -5755 -8048 -3096 3134 6620 -422 -1583 -7121 -14320 -11733 -8872 -7729
7426 -7729 -5366 -941 6505 4890 -49 -4203 -1190 -1108 1224 -8764 -10852 -9024 -1818 -5751 -11407
7411 -11407 -6960 -3130 2647 1053 -398 6786 11544 5566 1943 5219 429 -4123 -10080 -10195 -7201
7396 -7201 -3955 -4013 -7020 -8105 351 4709 1382 2451 -1528 146 -5360 -5831 1268 4224 2400 697
7380 697 -1070 -4311 4742 11749 8569 3626 -5281 397 4220 630 -8739 -15752 -18563 -9573 -3620
7365 -3620 -708 -2262 -6097 -14168 -11532 -9661 -8118 -9194 -15927 -19661 -20849 -16358 -15171 -16206 -8927
7350 -8927 -3993 -9527 -9848 -18530 -18342 -11474 -6706 -2975 -3628 -5725 -6788 -5926 -7567 -9936 -801 2250
7334 2250 -2456 -6561 -11353 -13566 -8296 -6270 -1465 2127 -1928 3794 8925 6332 5404 -2127 -6606
7319 -6606 -3479 7234 5597 -869 30 -2034 966 -1749 -3782 -677 2686 5016 1398 1115 -5080
7304 -5080 -7167 -5649 810 4865 955 384 4702 1811 2570 7443 5343 3636 42 -5077 -3387
7289 -3387 -5396 -5662 -2558 -8268 -6770 380 -3687 -3263 580 7159 7544 7995 6178 3930 -4940 -3821
7273 -3821 2187 6540 10204 9595 6993 1140 -7669 -17911 -17197 -6661 -4063 -3153 -879 1388 -2529
7258 -2529 -5029 136 162 380 3806 17 -5088 -2113 1837 2262 137 -386 -680 -3328 -1645 -4607
7242 -4607 997 10489 8508 500 -801 -1536 -1811 -4898 -6085 2051 8123 11882 13225 -503 -19390
7227 -19390 -20837 -11201 -8843 -5908 -5987 -6703 -961 -1533 -3319 -4396 -8611 -4721 -2154 -490 -4541 -6901
7211 -6901 -10376 -13493 -11120 -6728 -1330 -4112 -6430 -1080 1129 4847 -3037 -9261 -8840 -8901 -11371 -11069
7195 -11069 -8669 -4213 2871 4974 534 5308 4261 2863 4445 7964 11809 4920 4071 10519 4963
7180 4963 1336 2090 5327 3200 1066 1483 4804 6788 8508 3932 -767 -7618 -15734 -12770 -6357
7165 -6357 -989 3370 -215 -8547 -8001 -716 7798 12965 10812 2250 -5637 -5091 -2130 3236 2297 -3683
7149 -3683 -708 1002 3036 -4327 -7518 -5087 2137 267 -2558 4119 7654 3495 -1788 3594 11471
7134 11471 8817 2763 -1702 -1908 -7953 -3970 -5784 1312 3433 680 -1753 -5951 1559 4971 2449
7119 2449 3863 5716 4848 1808 1938 1211 1896 6091 4397 6369 8137 6221 612 -5 -251 -9942
7103 -9942 -11376 -7331 -452 679 -6321 -5544 -1850 3588 4834 3228 1224 -6386 -2837 724 -3539
7088 -3539 -2601 -3872 -6594 -5000 -8421 -3136 5466 -2221 -12234 -9321 -3545 4611 6228 6528 700
7073 700 -2428 -8825 -7113 -4418 -4 -1391 -3595 1021 -5212 -7879 -6326 -2002 459 -3894 -2606
7058 -2606 547 5860 3058 2017 4397 -913 -5141 -5674 -5872 795 5870 -635 -4239 -4234 -4750 -5412 -4110
7041 -4110 -4335 7404 8895 4049 4503 4398 2831 -1485 -389 -2707 -9856 -11998 -4136 -3 -305 -1559
7025 -1559 -4826 -5716 -4787 -3597 -5270 3081 5959 6636 5282 -2017 106 -1604 -5527 -1266 5163 6974
7009 6974 4667 1175 3623 3667 3590 3988 2592 878 3552 2988 1352 -5609 -9013 -8122 -5156 -3140 2887
6992 2887 7444 5119 -2610 -10797 -17940 -14733 -9073 -9728 -10660 -9254 -7405 -4794 2038 4832 -5316
6977 -5316 -16400 -9321 -5446 1982 1261 -6408 -8664 -6405 -5273 -6446 -9667 -6364 -6795 -942 -3180
6962 -3180 -5598 -8092 -5593 -915 -957 -9166 -6821 -5069 -2240 2908 2204 -1332 2188 9985 6838 -275
6946 -275 -9529 -7740 -1571 -7962 -15432 -12596 -9869 -4927 -5993 -13870 -16884 -20315 -22270 -16322 -5192
6931 -5192 2832 9219 10747 9542 6693 6270 5206 6681 7204 7023 14826 14045 7993 5269 7427 6011
6915 6011 12653 9059 2008 7784 13122 8494 -109 -2118 -3325 -7666 -12635 -20779 -16875 -9325 -4889
6900 -4889 -4952 -4584 -5543 -3830 937 -1398 -8344 -7230 -3913 -6217 -4564 -7773 -10477 -10298 -10805 -855
6884 -855 2300 -2565 -9238 -11367 -11630 -6453 -1702 2856 -2302 -2593 -3725 -6655 -7952 -3678 -4504 -596
6868 -596 768 4903 2656 -2914 -5224 -11115 -12783 -8749 -2678 3965 14130 13342 11609 -285 -3385
6853 -3385 -2789 -3613 -4022 209 2909 588 4108 3550 2651 11172 12504 11082 8252 1045 -5138 -7751
6837 -7751 -128 -1196 -6227 -10805 -10597 -9501 -4316 211 440 -2848 -1488 -1845 -4136 487 -2340 -6633
6821 -6633 -5380 1499 1910 7687 6610 1621 1114 4192 797 -9799 -4271 658 1261 -487 1064
6806 1064 -5366 -6052 -5027 -2131 -8085 -15238 -17473 -16311 -8134 3796 11196 6208 770 -4249 -8661
6791 -8661 -1487 9824 7470 -5267 -12073 -14061 -10867 -5134 -7630 -7208 -8782 -7976 -4778 -9498 -6142
6776 -6142 3943 1469 1794 -3536 -6113 -6520 474 7935 927 -3657 -6580 -10736 -11685 -13757 -7560
6761 -7560 3394 9194 9039 9697 1720 -7998 -10146 -2954 -309 -6475 -6564 -4489 -77 1729 -5536 -9047
6745 -9047 -12199 -18601 -10626 -9593 -6897 -2441 2971 7997 17881 8491 3798 372 -3075 -4996 -4127
6730 -4127 1248 7055 7032 -458 965 6214 7513 11214 5334 9760 9946 4770 897 4433 7412 13697
6714 13697 24815 28080 30838 35022 33751 29729 28502 20882 20057 17235 10305 4274 5024 2063 -6864
6699 -6864 -7308 -5779 -3360 -1748 4289 9489 10634 10719 7859 7498 9090 487 -6410 -10052 -3540 -1239
6683 -1239 -4457 -10057 -10961 -9833 -3699 -4275 -3168 -5251 52 5134 4656 4705 1055 -2574 -5544 -7710
6667 -7710 -185 507 10213 11435 11226 8597 554 -2968 3357 2336 -1296 1568 -1618 -4391 -1143
6652 -1143 -3157 -10558 -14983 -13359 -7926 -2507 -4394 2377 6899 9471 5028 5696 7928 7872 6121 5834
6636 5834 4601 2411 2542 -2849 -4641 -9893 -10359 -6346 -3120 -610 -2740 -3898 5988 3176 2032
6621 2032 -872 1667 1818 5227 4063 -2164 -996 -4776 -6538 -1654 952 1219 3195 82 3045
6606 3045 5595 1685 -5824 -9652 -7321 -7079 -12194 -8810 -2453 -438 857 3670 11343 13289 4867
6591 4867 5417 729 2374 -4069 -3987 5377 2728 -1346 -1959 -674 3614 5869 4730 1088 144 -1341
6575 -1341 -2935 3069 451 -405 817 5041 1231 -1736 -3593 1584 2075 1449 5806 4413 -1035 -1625
6559 -1625 6929 13211 6544 6195 3319 2668 -2109 -2557 5442 9172 6868 5873 8454 9841 6831 8024
6543 8024 6937 -1432 -6409 -1706 -2484 826 2423 1059 -640 -2566 -2410 6042 8043 6896 7716 5669
6527 5669 2776 643 -2758 -3251 -7161 -8869 -8813 -3429 3132 9910 9330 8999 9498 3494 3825 2335 5621
6510 5621 5120 7433 7056 258 -563 3100 -7290 -14813 -8916 346 -486 877 21 -3787 -12925 -11059
6494 -11059 -9033 -13915 -11155 -2177 -666 2678 8886 12550 5426 -927 -391 -1776 -8319 -10737 -10338
6479 -10338 -10330 -15729 -14307 -5850 1048 -373 -4531 -2481 2788 1114 -1572 -1063 -6926 -8345 -7389 -5207
6463 -5207 -6428 -2327 -3508 1345 -1629 -2065 4537 5195 -431 4712 5264 3478 4116 3788 392 -3883
6447 -3883 -7385 -7654 -7786 -3274 7233 9549 11784 4419 -1550 -4670 -4229 -3808 -7332 -9598 -8508 -214
6431 -214 2778 4294 5849 10708 4373 -864 2606 3595 1812 4909 7926 8939 2768 1139 401 -5965
6415 -5965 -7191 -7403 -11587 -17196 -20477 -13515 -4126 -3367 -8836 -9445 -10380 -15803 -13853 -11165 -11172 -1985 -3083
6398 -3083 -4301 -1096 3132 8237 9238 5543 6074 -5607 -9956 -6422 -2314 -5484 -3 -2798 -5402
6383 -5402 -3018 2475 1482 -1598 -1623 5110 4192 734 -2617 -2520 427 2313 1647 -4988 -3261 1079 1319
6366 1319 7302 3134 570 3459 7611 5614 5123 5556 215 -4668 2757 12048 12567 9169 10207 11321
6350 11321 -804 -2476 1311 977 -505 -949 -6394 -4975 -3068 -8004 -3903 61 5802 5048 3958
6335 3958 -3499 -9781 -8187 -3220 161 -2301 -3257 2636 -111 -2282 3176 -171 -2402 -3898 -4916
6320 -4916 -4037 -2648 -1713 -6246 -8750 -11833 -11468 -10718 -11331 -7623 -1295 3451 -173 6470 4731 -160
6304 -160 80 1612 789 2852 3340 -885 -265 3924 6970 5438 661 1227 -1579 -2629 -8293 -8399 -3849
6287 -3849 541 6724 11338 11480 6003 668 6544 6143 4550 -1769 2025 323 3893 1460 -1531
6272 -1531 6339 4331 5490 14695 12868 5841 4288 5079 2579 -2176 -4906 474 -1269 -6644 -9801
6257 -9801 -7798 -3095 2010 7992 2459 -5298 -3398 345 -3244 -3305 -1815 606 -469 763 -850
6242 -850 -8231 -2562 8067 11206 7011 -5383 -5090 -319 4324 3562 -698 -1889 -10088 -12922 1181
6227 1181 4687 2157 -1688 291 3711 3908 4378 3494 9914 7696 -253 -519 10836 12948 8284 10630
6211 10630 8604 6532 5652 4262 3320 1793 -3240 -6055 -4285 -1788 4057 8226 12334 9274 8651
6196 8651 14722 13531 9431 8678 7827 1871 -1905 -7801 -3748 4661 7543 7048 4964 -725 -42 360
6180 360 1114 -2772 -284 -195 -3396 -8938 -8630 -2770 -332 -5275 -9219 -12531 -6025 10737 14137 6639
6164 6639 734 -2183 -8782 -5563 -246 -6081 -5485 -5264 -4365 -12538 -14530 -9583 -6524 -5207 -8874 -5654
6148 -5654 -1770 3047 2020 -3261 -8072 -8564 -7446 -3677 -1466 -42 -1442 -4015 -2258 3021 3547
6133 3547 5639 6987 -2374 -6642 -10213 -10518 -10227 -12899 -7130 -4616 -5235 -3904 -6123 -7083 -6332 -5802
6117 -5802 -2147 -4343 -3251 -9329 -5788 -3413 -7214 -11966 -10383 -9825 -3083 -4997 -2352 1099 2610
6102 2610 -2498 -5692 -6483 -7261 -7006 -5869 8795 11479 6412 3916 868 -1833 -3678 -6418 -10286
6087 -10286 -7235 -5129 -4603 -6321 -2468 7579 9395 321 -5780 -8648 -11805 -12504 -7246 -5639 -7337
6072 -7337 -4691 -455 -892 -2488 -4064 -10365 -11960 -14139 -14042 -5566 -2844 -4810 -6908 -4325 1067 8121
6056 8121 6031 -954 -8589 -7947 -11466 -8064 -5454 -13893 -17562 -16829 -12227 -4281 117 -3837 -6443
6041 -6443 -26 604 2835 4759 -2434 -7746 -5437 -5856 -12519 -11527 -6835 -2792 -1406 154 -6070 -8578
6025 -8578 -2022 -8599 -4132 -907 -3742 -1135 703 6405 7518 8689 14582 10218 7330 6136 5449
6010 5449 1115 2278 7645 10451 5408 9562 11479 14609 11202 11434 5671 5629 6142 411 -2776 -836
5994 -836 549 -4031 -12424 -12641 -11041 -5064 -286 -3948 -278 4776 6991 9066 6467 4294 539
5979 539 -5456 -9760 -11121 -13802 -11417 -291 5137 8540 6621 -2311 -573 1947 -371 2268 -849
5964 -849 -7399 -3499 27 1707 -3188 -6133 -6826 4303 733 1578 1164 3435 6849 3264 3422 -4904
5948 -4904 -8837 946 -671 -4431 -7476 -8852 -9895 -8893 -9885 -9288 -6911 -2521 -3598 -6081 -13657
5933 -13657 -14014 -16865 -14936 -10913 -14706 -14648 -8274 -7008 -714 6767 9833 7524 4408 4900 2743 1472
5917 1472 -598 -2741 -2137 -3747 -6388 -9311 -11099 -3785 879 -2274 -548 4691 8353 11995 11798
5902 11798 5283 -3810 -5833 -7737 -5870 -3123 -2734 -2929 -5578 -4355 -3271 -742 -7198 -5197 -6265
5887 -6265 -6355 -6941 -9827 -10947 -10782 -653 5116 5714 11944 9221 3357 113 3306 2630 681 -6794
5871 -6794 -8245 573 4603 4132 5329 5711 -3585 -9853 -5589 -2316 2985 4996 4730 1953 3929 4126
5855 4126 6715 5994 3122 1125 -5545 -2339 1650 3299 5641 3944 -3819 -5952 -4476 -4446 -3383 -6990
5839 -6990 -9418 -5465 -1198 3795 3370 -1099 -9050 -5545 -1993 -120 3633 3696 8348 16203 13154 8153
5823 8153 10447 8656 3221 5878 4785 1202 1730 -2224 -3408 -3702 -198 -1183 -9108 -3222 -1616 -4452
5807 -4452 -5482 -8153 -11967 -10371 -11889 -6878 -2394 1133 -1344 -2644 2367 5009 3744 1389 4205
5792 4205 -51 -8367 -12104 -6320 -1098 -3963 -11642 -14818 -10642 -3329 -5676 150 5208 7101 8250
5777 8250 3732 -2213 -10104 -12302 -8751 -3758 -1601 2802 6809 -367 -12608 -14143 -7162 -3552 -2124
5762 -2124 992 -3996 2717 8056 1884 -402 549 -1044 -1054 1202 2804 8251 6503 11217 7809 2119
5746 2119 7764 5415 23 -7248 -1980 -3720 -13608 -12126 -4331 -5115 1392 5637 5256 226 1863
5731 1863 2448 -3864 -5640 -3833 -7037 -10098 -2912 -4764 -7630 -8640 -4280 1746 6434 2706 1622
5716 1622 -3900 -4047 -5437 1486 2888 -3182 -3999 -309 4454 6087 1261 -1534 -5397 -462 1795
5701 1795 4013 3906 -4084 -4421 -1726 -5151 -5858 -3714 -1051 3450 3410 -799 -4539 -5804 -3116 2767
5685 2767 583 -4239 4274 13801 4943 1327 3741 4210 3852 616 1584 6371 8529 6890 2286 1855
5669 1855 6687 8959 7554 8461 7803 4344 -4288 -5573 3562 -2958 -7597 -3046 -6674 -6775 -6231 -1826
5653 -1826 -4917 354 5811 4709 -1192 -5336 -2966 726 7744 7915 4949 5363 1823 -639 2430
5638 2430 1509 -617 -2298 4263 5286 -398 -2284 3813 9157 5947 7574 1192 -1569 1846 5377
5623 5377 3904 -3906 -12441 -10198 -8243 -9160 -9097 -8036 -8841 -4967 -3848 -2738 -1749 -1892 -2728 -3527 -6653
5606 -6653 -7729 -2495 2621 3471 9381 12113 9859 9058 560 -4141 -5305 -3684 880 3298 2303 11021
5590 11021 16270 11692 14085 16769 15603 11463 4107 -829 -2942 -5717 -6542 -3333 3508 4747 2166
5575 2166 10190 10041 3497 1580 -6365 -9372 -6622 -6264 -3511 2381 7309 2412 -2067 -9622 -8259
5560 -8259 -9933 -10425 -7347 -1230 1677 6707 4437 3862 -771 -5966 -2830 -6049 -4561 -10073 -5063
5545 -5063 83 7554 2345 -6164 -9951 -6019 -2826 -2410 -2085 -140 2201 -3440 -3645 3214 4044 -68
5529 -68 -395 4496 6026 9509 2238 -2423 -4404 -5915 -249 4768 -2692 -8937 -9695 -7287 -7811 -2729
5513 -2729 422 -1242 -2486 573 54 -2472 3517 10639 3480 -191 9730 16114 16919 7398 4662
5498 4662 -2498 -4305 -11032 -17490 -9150 -6716 -2046 975 -4209 -10292 -13543 -15018 -17683 -15556 -10337
5483 -10337 -9499 -14719 -20724 -7449 -3936 -1941 -680 -5162 1036 3085 -6333 -11984 -3993 1833 -652
5468 -652 -801 -460 -4899 -7985 -11601 -13139 -8727 -6996 -3537 880 -894 -764 -2962 -376 -881 3783
5452 3783 8981 11997 13018 13703 8752 -3012 -5862 -7023 -2464 263 -6152 -7952 -7185 -3496 3970
5437 3970 2067 -5295 -5513 3830 5667 -6566 -10648 -6770 -929 692 -1970 -5886 -4377 -1234 -1485
5422 -1485 167 1750 -240 2859 2769 -3788 -7784 -6490 -6984 -9061 -17052 -13404 -11787 -15530 -11282 920
5406 920 6338 5064 6152 4582 7558 10692 2971 -4784 -7875 -4829 -1369 3353 922 516 2457
5391 2457 3060 -3189 -8080 -4337 5185 -464 -7443 -7960 -3522 -3623 3710 5039 2541 3966 769 -3371
5375 -3371 -2670 -3061 1554 -1899 909 -245 -3380 -6989 -6133 -1792 -2676 -4536 -497 4161 4457 3093
5359 3093 3313 2780 5033 6956 -2162 -5212 -6843 -10207 -11581 -8249 2355 -3691 -3696 3720 9130 11212
5343 11212 13045 11077 -2425 -10262 -3999 -5713 -1699 4637 6454 2417 5264 1683 -7982 -7980 1150
5328 1150 7357 1726 7601 7078 2659 -3037 -1685 -4987 -7614 -1459 4752 5064 -621 -1916 -2592 -4911
5312 -4911 -1600 -5894 -8268 -4406 368 2261 449 4154 5555 2600 -2851 5872 6515 3651 86
5297 86 -237 -1140 -1904 856 3215 2997 2337 3588 1361 -1723 -4241 -7709 -4760 2596 5056 -125 -4085
5280 -4085 -2741 940 -3047 -6144 -6024 -4631 -5468 -8397 -7463 -6371 -8699 -4908 864 2539 1599 -865
5264 -865 -1625 -3011 -3881 -6249 -6817 -7561 -10872 -3885 641 9570 14685 14645 10528 4030 4392 8032 10963
5247 10963 13773 16108 14338 8956 3869 6620 -812 -7768 -8675 -9987 -3501 1963 -3032 -3581 -4653
5232 -4653 4411 7945 -3074 -11664 -7675 -9523 -8945 -4967 -7042 -4464 -3985 -5105 -7142 -975 295
5217 295 -1892 -3409 -4814 -2855 2966 -2988 -3582 1591 3302 2343 3663 -2429 1741 3192 234 5556
5201 5556 2719 5713 6399 4487 4188 2296 1349 -7187 -8831 -9097 -2931 -5000 1276 9072 8233 1101
5185 1101 -2437 1031 2682 -631 -855 1232 -1787 -2627 -3456 -2916 -1814 -902 1912 2861 4113 -3594
5169 -3594 -953 -44 1109 1312 7028 5817 5158 2387 1177 412 -493 1217 -2820 -4801 -5714 -2414
5153 -2414 -5749 -2697 -1306 -4219 -1385 3906 5706 5478 5837 -3547 -6575 -7932 -478 2394 -3029
5138 -3029 -2324 -921 -2547 -1400 1521 3309 -1411 -5231 2942 5889 2414 1872 1892 -9021 -11141 -7575
5122 -7575 -3801 -3080 -3068 -5355 -5347 -3851 -63 -5360 -8037 2144 10485 8717 7471 7761 -2152 -10361
5106 -10361 -8561 -5985 -4958 -459 6452 8837 6469 65 -2052 -2882 -6465 -8817 -13146 -10106 -189
5091 -189 -2227 1146 -498 7 -2657 -2750 -1296 1101 -3646 1476 -2395 -13830 -16373 -5694 4117
5076 4117 5093 -335 351 321 1392 1616 1344 -340 -3317 -6506 -5719 -9076 -11308 -6983 -462 1056 -1444
5059 -1444 -1751 -520 3948 8486 12247 12075 11486 3729 -4480 -5021 -4474 -3387 -2300 -3886 -3055 -11
5043 -11 4747 2450 4810 8225 6604 8208 5248 4105 4269 4662 6669 11363 4571 -9 -1710 7769
5027 7769 12463 8449 4416 5899 11371 8067 17029 18966 15525 5758 -870 5405 3677 -6334 -5712
5012 -5712 -10045 -15829 -4159 -837 -7573 -4365 1703 2724 1963 1597 4059 4569 8204 7951 1508 -783
4996 -783 -4203 -1062 1888 254 -3242 1272 4429 4252 1301 -6943 -4041 991 4331 5710 -1866
4981 -1866 -10320 -786 -64 -4768 -8618 -6556 -5860 -5303 -10218 -11613 -2173 4728 -1497 -9093 -9282 -8645
4965 -8645 -8012 -12631 -6728 -6089 -7413 -2833 2954 6598 10742 12700 9111 6069 2335 1725 2787 3772
4949 3772 -2786 -3629 -3888 -9522 -9973 -6425 -9287 -7688 -1775 1397 3954 2174 -214 -3554 -1976 1799
4933 1799 -4831 -7638 -1616 -1472 -1630 -2776 -4206 1053 6811 9985 444 -4756 -5652 -70 3897 -7096
4917 -7096 -5921 -5820 -5129 -139 -56 -1909 -9334 -5395 -5199 -3750 -4304 -21 4426 6439 1933 5084
4901 5084 9359 12238 9062 -1335 -1601 -6155 -9583 -2969 2780 3205 410 -5226 -13660 -13726 -8861 -11847
4885 -11847 -10823 -3163 -1028 3202 5174 -3909 -1844 -1900 -777 -4251 -11088 -13149 -14541 -10856 -8106
4870 -8106 -3151 -3429 -10060 -12818 -12270 -6272 -7350 -11137 -10754 -8310 -1463 6899 10041 517 -7604 -2905
4854 -2905 -10248 -5873 2835 -322 -2295 -2704 -2933 -2303 -1895 -549 4235 286 -9216 -2559 59 2832
4838 2832 -3545 -4845 -1444 -99 -2306 -1371 -4858 -5448 -1812 -8874 -14205 -11201 -5794 -5846 -9806 -8873
4822 -8873 -3723 -6171 -1542 -3901 -5086 46 969 -689 -1856 2939 1366 -2201 -8515 -13277 -11923
4807 -11923 -4446 -2423 1799 3909 7609 10270 6801 92 591 -647 -7209 -7853 -10807 -9477 -7554
4792 -7554 -4945 -5707 -5047 5810 4221 -2173 5518 11630 11695 1742 4810 11092 5499 1471 3291 3542
4776 3542 4156 -912 -5732 -931 285 -2487 -8455 -11021 -11495 -7788 -1698 -43 3 1592 -2464 -4764
4760 -4764 -682 -6227 -7229 -7509 -4860 -2359 -5601 -5255 -4176 3745 4692 5630 6338 9239 6224 3059
4744 3059 2254 4051 2765 -4223 5850 9986 6295 9737 8385 4654 -4098 -8588 -8460 -8073 -5682
4729 -5682 -2048 2132 11989 14948 10591 8917 7514 1661 -2513 299 424 1363 9354 4625 3570
4714 3570 4677 -2618 -5251 -2280 -1277 2210 3180 2876 9845 11507 9532 9176 1755 1334 7819 6831
4698 6831 7933 6930 3800 -3396 -7703 -6606 -6710 126 1682 2282 6664 815 856 2096 2991 4239
4682 4239 2500 3227 104 -6587 -11943 -10710 -11506 -14186 -10853 -9048 -1969 -6577 -10071 -7323 -2889
4667 -2889 -5673 -11087 -10174 -7255 -2346 2891 1057 -2460 -7210 -7378 -7522 -3332 2995 8157 5216 3433
4651 3433 -4185 -9351 -4059 429 4895 7266 -2299 -588 -2963 -204 -852 -409 -3673 309 7372
4636 7372 8056 1843 -2529 2283 2621 2025 -3828 -5817 -11225 -16218 -8840 -8042 -7682 -1452 1371 6272
4620 6272 4440 657 -2657 -3596 -4387 -4532 4002 11322 14053 12957 6567 7255 -491 -5327 -6123 -8639
4604 -8639 -5892 4864 3682 -787 8837 8219 -2962 -7223 -1255 5831 1443 9888 11706 9813 4643
4589 4643 1841 7731 11491 12970 13080 9043 5471 -444 -7365 -3661 -2443 -7187 -7187 -4018 -851 5189
4573 5189 1626 1127 4969 9242 10182 4649 3806 6729 285 3009 -645 -1528 1950 5974 -876 -6756
4557 -6756 -10766 -13010 -5983 -910 1699 -1035 2402 4641 4635 6504 5531 -119 -3238 -3481 -996 1559
4541 1559 4770 1868 4082 -11103 -22250 -21162 -8541 -409 1651 -2368 -4108 -6597 -2509 -931
4527 -931 -4663 -3490 -4509 -4826 -4201 -8891 -6089 -10208 -6280 -6847 -16490 -11924 -6579 -5878 -2520 -10104
4511 -10104 -9569 -10182 -8676 -3915 117 1164 154 -1669 1731 4189 -1341 -9953 -10976 -8479 -2178
4496 -2178 2078 4849 391 -3545 -10469 -7907 -5501 -10547 -9491 -7064 -9749 -17652 -17384 -13474 -8512
4481 -8512 -5471 1121 -3850 -11073 -9519 -4796 982 -4064 1097 10278 10603 5691 3561 2037 -1940
4466 -1940 -2296 509 977 5454 4741 -5383 -7178 1135 7526 6265 8425 7040 -192 -33 -2379 -2335
4450 -2335 1113 1488 -290 -5091 -8538 -10765 -9250 -12534 -15818 -10778 -15142 -6999 1415 -1357 -580
4435 -580 -2739 2787 8240 7115 3217 -4715 669 5471 1069 1586 -34 -5037 324 594 -2375 -1037
4419 -1037 4078 6438 6652 4130 -1092 -3359 -971 -1788 -6644 -18491 -12360 -4728 1480 29 -407
4404 -407 -478 814 888 1912 2504 1743 4290 2128 1887 6777 7859 6364 2763 805 -930 1922 -3115
4387 -3115 -4526 -3881 -913 -7926 -13193 -17849 -11796 -2329 -76 7464 9639 3386 977 -6178 -13841
4372 -13841 -8733 -6420 -5619 -6883 -1050 5360 966 -4475 -2300 -2413 2112 1027 -105 -7288 -4272
4357 -4272 2209 3308 4642 -808 8080 441 -4029 -4874 -652 -8323 -7616 -2130 -4398 -6972 -5648
4342 -5648 -9110 -8263 -1448 -6490 -10185 -2956 -3502 3355 2064 1035 8148 8600 -6728 -14761 -15336 -14429
4326 -14429 -9757 -8296 -7257 -3948 -3020 -1992 -10872 -16816 -15586 -7568 -11267 -7618 -4490 -5140 -100
4311 -100 -853 -3797 -1839 -4247 -5310 -3153 -7342 -10824 -15773 -9331 -10975 -9600 -1126 -2842 -8024
4296 -8024 -10633 -11559 1364 2829 -2150 -5374 -4286 -6104 553 7005 2231 -346 -1025 -1797 5181
4281 5181 806 469 -1505 -4194 -4645 -2205 -2365 -1729 -3117 -3296 -552 -671 663 5446 9280 13020
4265 13020 9509 4846 3476 3430 4288 1224 3925 2880 2323 4350 2731 -5085 -6180 -1307 3016 1871
4249 1871 -1298 -3406 -2868 -401 4454 3348 4588 3965 2856 4066 5661 5200 4083 2168 2289 11030
4233 11030 11927 10851 5481 7335 14433 10586 -3107 -11973 -9850 -5883 -270 6186 952 -9799
4219 -9799 -15637 -8095 -2655 -3243 -3895 -3895 -6919 -5927 -5965 -7276 -2272 -2715 -5296 2786 87 842 2834
4202 2834 -617 -5614 -3808 229 2611 10434 15903 15382 9152 -636 -6798 -6067 -4893 496 -5403
4187 -5403 -6558 -1061 1654 -3914 -4632 100 1998 3398 6509 5897 6733 9763 -798 -7150 -7978 -7031
4171 -7031 -4686 -9869 -8710 -6208 -11200 -13664 -9804 -7823 -7379 -2911 4317 -1062 -12849 -16077 -6420
4156 -6420 1625 2441 240 3007 3184 -1265 -10156 -12116 -13576 -9649 -3931 -4040 -5830 -4079 -1575 -1897
4140 -1897 8674 14511 11334 9591 7308 3262 -517 -2819 -1596 4059 4528 -3335 -3967 -3014 -762
4125 -762 -2915 -2818 90 3098 -1586 -2692 -452 2222 5199 -322 632 1837 -466 -6255 -16434 -13167
4109 -13167 -7213 -4999 -1672 -4832 -9971 -7974 583 5685 5338 707 -6684 -11938 -11692 -2094 6369
4094 6369 4193 839 -1893 -699 1705 7619 2538 3432 9457 7032 8410 9207 -977 -688 1336
4079 1336 3475 6195 6846 6632 200 2714 772 -170 -958 -4866 -3628 -7212 -13482 -15584 -8340 359
4063 359 10151 7209 4480 8921 4369 -1525 -6834 -9356 -5342 -2875 -1137 -8722 -8450 -6416 -8537
4048 -8537 -380 877 950 -3790 -9686 -10725 -5912 -10036 -8047 -3320 -5414 -4287 1185 3822 2407
4033 2407 -3850 -2321 -2482 -8977 -12026 2540 9536 7919 13634 11590 9411 9393 4422 939 858 2596
4017 2596 2673 -2242 -4574 -5833 -8358 -6368 -1909 -2435 -8193 -13853 -11970 -9834 929 713 493 5217
4001 5217 9916 10668 8891 8594 4213 -6096 -10356 -9105 -7874 -757 1560 -3083 -8066 -5185 -1025
3986 -1025 2510 -2060 -3463 -1753 -3746 -4542 -5225 -1226 3074 3631 6354 6952 7051 8030 7155 -1284 -6827
3969 -6827 -13124 -18128 -14617 -12343 -9562 -16693 -22656 -24401 -19765 -8188 1587 4386 8205 12818 10814
3954 10814 5820 -4222 -5963 -9168 -1673 11617 6362 -2977 -778 3839 5778 3818 -5456 -9434
3940 -9434 -7795 -8196 -9284 -13574 -11477 -8420 -5930 161 -561 -1877 -5471 -9701 -10156 -5576 -6002 -1878
3924 -1878 1075 1637 7347 5103 1154 5950 6365 2393 5435 7819 2723 -1849 -6294 -12484 -16346
3909 -16346 -12701 -5557 3276 4946 1254 2701 1420 -5064 -13976 -11534 -5162 -6791 -6567 -4412 783
3894 783 2078 -5329 -10393 -5359 4653 7462 8054 8676 1590 969 -523 -5830 -1037 426 1242 3982
3878 3982 5309 1749 -4214 -5042 -7406 -7430 -9320 -5536 -3026 5306 1084 -7647 -8614 -13475 -15502 -14461
3862 -14461 -16012 -9727 -859 2214 10518 11078 8198 8290 8767 4439 2864 3629 9891 11454 10474 12670
3846 12670 6381 -1474 -7241 -11990 -6379 -9201 -10974 -6718 -8663 -3001 -796 1752 282 -4537 -934
3831 -934 -2544 -1281 -2795 -2700 -8633 -11710 -4371 4123 926 1896 4961 4097 4137 6217 5513 -2014 -3405
3814 -3405 -5532 -3005 4588 8526 3280 1143 -1785 -2739 7941 10090 3595 5385 3919 -514 -839
3799 -839 1119 -1507 -4747 -2475 2654 3110 615 -2308 -4502 -696 -5898 -3824 3100 -2049 -2516 -2147
3783 -2147 2568 10057 15051 13991 -5179 -14057 -10771 -8345 -3251 2096 1138 -3796 -2367 -2535 -590
3768 -590 -1064 -5141 -8862 -11740 -5709 584 1478 2371 2332 1971 38 1802 -1760 -2281 -4769 -4092 -3370
3751 -3370 -23 7762 -1875 -3621 -1418 2898 -831 3614 5771 3067 5304 -614 -7282 -6219 -5973
3736 -5973 -4967 7404 10266 5918 118 631 4438 1578 1996 4185 3798 511 -5413 -7550 -4419
3721 -4419 -2120 -2833 -7539 -9654 -9158 -13550 -5365 -3448 -4842 -1448 3417 4254 1900 1270 -1151 -2962
3705 -2962 -4303 -7726 -9563 -9730 -10118 -5596 -2241 589 -2036 -5413 -5616 -5300 1195 8464 5063 7487
3689 7487 5377 -1794 -5292 -516 4180 6081 2392 6765 11182 4903 -1207 -7210 -6541 3632 4012
3674 4012 -2371 -2118 5988 7224 -2305 -4212 -7528 -10038 -4977 -1525 -1654 -5235 -5357 -2675 -1066 6606
3658 6606 7646 123 -1288 2352 5424 3201 -1545 -7109 -4083 5528 1407 -8185 -4148 -158 73
3643 73 -452 -2961 -2045 -860 -1939 -3615 -8194 -4031 -7586 -4791 -7752 -13767 -9526 -5340 -4017 -1071
3627 -1071 -4318 -3140 -1413 768 873 -368 -3303 -3310 -2914 169 -759 1600 4152 11413 6344 -1943
3611 -1943 875 6666 7967 8047 7021 6133 3017 -415 903 -3498 -6844 -2733 741 -1018 4523 13214
3595 13214 19304 11634 2694 585 989 -3065 -3532 3334 6277 5413 9849 7723 3006 -1315 -1646 2163
3579 2163 2264 2133 1580 232 2205 4866 4356 -159 452 -1446 -10311 -15328 -15925 -4569 1193 -2761
3563 -2761 -9404 -10127 -8921 -5190 -2105 -3971 -2931 3381 4759 3118 2093 995 -953 -1919 -2111 -2551
3547 -2551 -6783 1240 7081 2110 -3118 1480 479 -3256 -7094 -8122 -5859 -4684 -2265 -2298 -5962
3532 -5962 -2806 3588 10839 13600 5500 8076 9449 8686 14022 10639 4615 5635 3292 7045 8019
3517 8019 7725 7121 4684 5497 1796 1265 1762 1513 1091 5102 7317 3312 6640 920 -5192 -3581 160
3500 160 3395 1678 -4822 -12013 -20387 -17478 -4493 194 -3497 -5891 -3016 1991 4720 1838 -4824
3485 -4824 -7134 -1665 -8480 -5876 -3872 -4647 -12677 -12044 -9327 -4092 -9847 -13019 -7498 -3800 283
3470 283 4610 7371 5651 4456 3789 -858 -2835 -1750 -4985 -3666 3024 2897 2940 1753 -5740 -6229
3454 -6229 -3258 -4116 -1898 673 3375 -610 1283 2364 3328 9848 5326 -2924 -4731 -5260 -8501 -8886
3438 -8886 -4022 -2343 3329 9033 10940 10927 14083 13480 7946 2306 5005 7669 11211 5574 6661 3623
3422 3623 9520 15758 21615 14198 10135 10294 8073 2715 1005 -191 -2786 -3855 3390 1439 -5532
3407 -5532 -3574 -3106 -4952 240 4653 8087 14687 12785 10997 3225 -2112 -1042 -2348 -3514 2867
3392 2867 2425 5669 10075 12004 1061 -9083 -8520 539 6081 1716 246 664 1214 -7903 -9204
3377 -9204 -6913 -8234 -11143 -10809 1276 4476 -3261 -15590 -14985 -9409 -6080 -13206 -9638 -4773 -406
3362 -406 -1688 -4012 -2906 -4997 -7780 -9246 -6950 -6998 -12143 -5302 -3017 -7314 -13259 -11449 -10041 -6893
3346 -6893 -7007 -4514 -2000 -3690 -8841 -10131 -1511 623 2899 2581 2650 7100 3773 -2164 -583 3249
3330 3249 7098 9169 10588 4960 -3807 -5853 -6766 -3538 1010 -1930 -7689 -6954 -9980 -3618 6659
3315 6659 -1580 -5362 -2245 673 3971 4360 262 1977 10185 9442 3582 1274 -782 144 -5341 -4733
3299 -4733 -4142 -2836 -3034 -4734 -6003 -5957 -4767 -1257 1604 4754 5082 2637 4610 4240 7571 16059
3283 16059 13513 7363 9523 3334 -2811 -7692 -2415 6903 13514 9517 4781 99 833 -2162 -2852
3268 -2852 4254 -933 -6007 -4873 -5552 -6099 -3292 -640 3178 9272 5075 667 3808 2919 -1851 -6493
3252 -6493 -7416 -3364 138 992 4081 3266 2101 4266 -1301 -2457 -848 -2584 -5111 -5114 -1801 781
3236 781 -12 1316 3204 1745 3429 3495 4231 1453 1376 -5008 -10879 -4904 -1661 -453 5552 1283 -7465
3219 -7465 -5632 -7679 -1225 -6603 -4863 -825 -8302 -12652 -10166 -5007 -5102 -7185 -996 1884 -7845
3204 -7845 -7813 -7876 -2057 -939 -5369 -10968 -8330 -4300 -2229 -4819 -5228 -1976 3132 604 -3386 -1102
3188 -1102 -878 5610 5203 6034 10330 192 -12747 -13160 -12016 -683 5954 6098 -4790 -6596 -2213
3173 -2213 -234 -6415 -8610 -1818 -628 370 3712 4803 -1023 -5185 -2628 -2189 700 8432 11107
3158 11107 5401 -1478 626 7249 1984 -1381 -4533 -11389 -14031 -6950 -10011 -9594 -5772 -7579 -7179
3143 -7179 -6628 -9027 -8853 -10948 -12928 -10936 -8370 -6729 -6158 -84 -1788 -7994 -6773 -10198 -10075 -4964
3127 -4964 -4108 -8734 -7689 -1553 328 -4446 -13503 -12970 -5748 -11295 -8800 -4911 -771 1546 3843
3112 3843 11591 8405 9773 9093 8718 10520 10377 7937 1468 3569 8843 5784 229 -2725 -2006 -6039
3096 -6039 -7641 -3309 2850 1680 3230 6495 2081 -196 75 771 -3788 -8641 -11082 -4246 -1669
3081 -1669 6197 14505 15017 13699 12319 8634 9390 8723 7517 8744 7929 8278 4532 -2497 -1284 -6279
3065 -6279 -10541 -6791 2370 5512 -852 1204 -2057 3248 7436 3307 5162 814 -560 -2848 -2394
3050 -2394 -5911 -3665 -2366 -4249 -10910 -7293 -2486 -2581 -3580 -12965 -12838 -11370 -10573 -7465 -5405 -6849
3034 -6849 201 6884 9974 10122 10700 12531 6607 7033 12140 6766 5831 801 -4782 -3457 -2018 -12194
3018 -12194 -11484 -5401 -8123 -3883 1611 -2 -1662 -3886 -3378 -1091 -2068 -3582 -1782 194 131 -2499
3002 -2499 -744 3382 -1359 -3350 -2955 1874 2158 5715 2726 2018 1918 -73 -1345 -3368 -1970 1468
2986 1468 6267 15314 16203 12575 12752 1765 -3665 -6066 -2776 -3158 -3255 -3599 -531 2725 5050 7359
2970 7359 9025 13402 16436 13245 7230 9753 9318 9820 6550 343 -342 -1534 1498 -259 -8253 -12591
2954 -12591 -6780 -1285 -1070 2516 3974 2635 -1466 -2994 -5832 -10751 -13836 -8824 -7473 -11220 -7146
2939 -7146 -1292 5337 7468 6372 9967 16919 15073 14989 15026 13762 15075 8614 5508 -445 -1267 -1816
2923 -1816 528 3317 -328 -4125 -858 -552 -8060 -4150 -1114 90 3643 -852 -4847 -828 6026
2908 6026 9107 6677 -1565 -9504 -7600 867 4506 9658 4740 5112 6469 9124 4448 1587 -2866
2893 -2866 -4940 1632 3339 -2876 -1129 -1938 -4155 2599 2678 2627 1913 5926 4689 -404 -4905 -149
2877 -149 8032 12934 7758 -231 3103 -790 -2361 -971 -318 -3257 -3561 2171 -1421 -4696 -1383 5872
2861 5872 13057 16074 11142 8442 -2976 -3279 -2382 2237 -2515 -4761 -3207 3047 2307 -2212 225
2846 225 4365 5102 1689 855 3040 -1208 -5938 -826 3731 5206 2818 5294 4230 4488 4980 3616
2830 3616 -6380 -10167 -7824 -6081 -3992 -1491 2103 -2944 6135 10392 7529 6770 746 1186 -4961
2815 -4961 -2739 2396 4086 367 -2116 -1430 4592 3819 959 5366 3731 -4954 -6869 -625 3757
2800 3757 8071 12757 10831 13782 21172 14591 1705 2409 2548 608 -4885 -8191 -9928 -8009 -2213
2785 -2213 -2360 1007 6699 12680 9459 4863 368 -920 4009 4445 3711 3678 6939 12565 19678 16624
2769 16624 9922 12001 2803 -2422 -5391 -2367 -3107 -1480 534 -2673 -9124 -13120 -8609 -13346 -13488
2754 -13488 -10209 -2018 -2505 -6827 -8312 -11013 -9344 -8728 -9883 -1951 -3293 -2672 -4420 -11294 -11317 -13587
2738 -13587 -15412 -21863 -18755 -15154 -6180 -4041 -6199 -8944 -11492 -11850 -7663 -6379 -2649 3139 7183
2723 7183 6892 6131 12126 10265 6465 7337 7093 6442 -1474 -2469 -2032 -1439 2271 10259 12365 8061 -4384
2706 -4384 -7853 -5024 -2176 -156 -4633 -1578 3465 5160 4433 -1084 -3780 2497 6668 5398 -1778
2691 -1778 -688 73 -5599 -3352 -1553 -3996 -9244 -10396 -11694 -10103 -5371 -5905 -10017 -5396 694
2676 694 598 5893 12261 10500 9133 11365 13574 6735 2238 4027 12154 11268 4830 3410 308 2069
2660 2069 932 -821 -38 -3719 -8486 -9045 -10785 -6628 -585 -2555 -5997 -5123 367 7960 8794 2771
2644 2771 872 67 -2571 -8693 -4600 -4270 -2916 -5943 -4571 -3207 -3130 -2904 1548 2532 1273 4954
2628 4954 14176 12340 6924 3579 6502 5484 -316 812 10154 15285 18141 13646 10067 5439 9288
2613 9288 5115 3741 4300 2314 3494 3036 4782 4029 -1369 -2836 -335 1481 7711 9021 10104 20690
2597 20690 17467 7678 -1933 -7201 -1720 1167 -4120 3336 9366 11321 11755 13211 10546 11905 8108
2582 8108 7447 9146 5785 6687 6360 2911 -728 -1573 -2230 5083 10044 12320 15702 11024 462 -6810
2566 -6810 -6249 -6133 -4842 -4682 2463 5550 4635 1215 212 -716 -3836 2162 7375 1665 -6516 -8341
2550 -8341 -5507 -4529 -5195 -6995 -9646 -5479 2778 8280 1479 -5535 -9921 -12553 -4096 -1299 328
2535 328 4509 12555 8539 -192 -410 1179 5765 9441 3075 -4979 -5493 -1259 -538 1509 -20 -787
2519 -787 -2562 -3843 -1936 -470 -3971 -6084 -3776 -7610 -6802 -4579 -1285 1675 4107 -1349 -6016
2504 -6016 -8379 -6856 -403 1256 -3059 -3306 -4908 -2449 -1383 -8347 2155 8993 10766 11561 10886
2489 10886 11530 14217 15207 9266 7520 823 -1481 901 4367 7599 2660 -2758 3353 3294 1165 1121
2473 1121 -1925 -2007 5410 7985 14820 14658 17828 8346 579 -8390 -17595 -9469 -6479 -8807 -5392 -9220
2457 -9220 -9991 -4913 -6745 -11072 -9600 -4883 2721 1637 5970 2389 -4783 -3426 -2941 -1010 -3434
2442 -3434 -3542 2369 10811 9990 10349 7986 7607 -6297 -11939 -1966 -1593 -7690 -9190 -8134 -1818 4200
2426 4200 11738 7829 171 2927 1181 1895 6253 11374 6931 -98 1136 4537 6751 2807 -5490
2411 -5490 -1872 5536 13672 12079 3804 -1997 -3287 -4072 -714 -4153 -3617 -5547 -5835 -2683 4030 6249
2395 6249 6481 9215 4878 1903 5046 -1458 -3553 -2444 -1881 3057 1582 -604 -2844 844 3548
2380 3548 5872 8670 14415 12104 4218 2174 -34 -971 4624 7996 8686 5795 419 -3411 -3234 -2732
2364 -2732 -548 3542 7119 6420 -1461 -2937 1202 4127 3449 7335 13036 19850 22486 14885 5749
2349 5749 3423 3588 6701 7358 4879 409 -1137 -1017 -7866 -6652 -4228 -3594 -1806 -3171 -6003 4940
2333 4940 1995 -7347 -5990 -4669 -2973 -1036 679 -1204 6359 4546 5287 4534 1791 -692 -2588
2318 -2588 -469 2826 5400 4779 5746 4030 4025 7566 3782 1157 3774 3033 4801 2814 5058 6297
2302 6297 9133 8538 6422 9139 258 -4144 2129 1859 -378 -6679 -10934 -11825 -7441 -1730 -4790 407
2286 407 9914 661 -3451 -5387 -7113 -9637 -6000 2620 7500 4443 4905 1686 -130 4816 12554
2271 12554 11353 7716 4747 2779 1512 -1481 -4859 -4470 -3324 -1852 1325 1528 -3467 -7247 -3568
2256 -3568 3666 6523 6192 6614 -558 1901 3180 1095 -4507 -7 4709 -6001 -6181 -3629 -5175
2241 -5175 1419 10220 12643 2303 -451 -4236 -9018 -5933 -2304 -1648 5294 10437 703 -3686 648
2226 648 4698 -846 -3538 -1831 -2036 -291 1808 1834 2657 -2764 -13697 -13198 -8345 -10142 -9656 -14730
2210 -14730 -8817 -5526 -10622 -11930 -10815 -4123 -4745 -4157 -4314 -9054 -8100 -9257 -6617 -4615 -6966 -7398
2194 -7398 -6638 -10141 -11069 -10506 -6641 -6850 -6198 -6780 -3518 -4153 2119 -2463 -3530 2535 2628 -7609 -11437
2177 -11437 -4968 -4130 -7336 -1919 2539 4940 8359 2552 -2330 492 1485 1710 1350 835 3627 3402
2161 3402 2384 -7693 -7984 -4704 -3234 -5555 -7704 -9179 -7908 -6545 -14759 -12316 -9062 -9497 -6268
2146 -6268 -948 823 3064 1331 -3612 -11554 -13439 -8057 -7669 -8108 -11941 509 4829 4729 -354
2131 -354 6083 8226 4473 1204 9027 6472 -4122 -15191 -13078 -10887 -8048 -5941 -3570 2590 8624
2116 8624 9377 10413 5093 -921 2335 6183 -141 611 3408 1420 1876 1131 1219 3228 9430 4669
2100 4669 -1334 -3055 -4278 364 4248 9072 5246 2751 4610 5110 3204 -2258 -771 1214 -540
2085 -540 -3229 -7349 -4573 -6738 -3850 12 7046 7454 4829 9264 11721 8345 4246 1008 266 1936
2069 1936 -2360 -6898 -7850 -8963 -10201 -64 6514 2904 4007 1299 8785 6823 -2830 -915 655
2054 655 696 913 -5899 -12071 -8298 229 8451 10741 8106 7237 5256 2112 59 -622 3459 5899
2038 5899 15401 12592 13695 10795 10540 6479 -3939 -11436 -11891 -7791 -751 3312 4083 4017 5663 4872
2022 4872 8457 12682 10588 6708 5479 5393 3859 5631 5978 671 7282 10131 10594 8289 4370 3710
2006 3710 4749 6878 12599 15677 10605 8945 13200 12619 7606 7449 7828 2367 -1046 2076 3200 2414
1990 2414 -853 5192 5838 2287 1516 -659 -1840 4400 550 -622 -590 -7631 -7506 -955 8210 15109
1974 15109 7948 124 7501 5375 -4366 -644 5317 7086 3012 4922 4554 7119 6014 7911 10458
1959 10458 3427 3102 5942 5741 1017 5062 10400 12650 7492 -383 -8139 -291 6505 4721 854
1944 854 5309 7428 11178 10163 13871 17471 16373 14324 15726 8788 -761 -3424 -1253 -641 -1519 -10
1928 -10 2828 1641 1315 2657 5120 -86 185 2836 520 -1632 -1214 -984 1700 3657 3045 -5162 -4330
1911 -4330 5430 9181 10876 10234 8562 6185 -561 1958 8479 8742 10196 8098 3315 3633 4242 -621
1895 -621 -1614 -1998 6718 8176 4777 2537 6242 8302 8999 9814 -36 -3608 4515 3943 -416 3890
1879 3890 -5151 -7776 89 2110 1530 -1693 -738 917 1657 2644 1542 -3258 -2675 -1923 -1784 2603 6502
1862 6502 6953 -100 -6363 -8452 -5810 987 1131 -1147 3924 10203 7578 464 -3068 -405 -5855
1847 -5855 -7627 -6327 -4379 2347 2609 -6890 -7121 2180 1088 -4244 1192 1178 -3239 2585 -151 -3895
1831 -3895 1248 1462 1556 4896 671 1909 1212 -5980 -3402 3102 892 -2190 -5719 -4077 16 5694
1815 5694 3749 4505 7228 8146 6810 4992 4012 1051 1958 3303 2654 2131 1509 3812 4571 -6545 -4888
1798 -4888 -793 -122 2560 1384 -7112 -11950 -15036 -15474 -4484 2159 207 5944 7640 11646 13533
1783 13533 7390 9847 14466 11705 2694 -1152 1760 2204 1859 -2023 -733 3968 2977 258 -416 -9925
1767 -9925 -13820 -8989 -4737 -1886 -3353 -2448 -1194 389 1749 -465 1708 3644 6084 2287 2747
1752 2747 -2868 1314 5891 2736 6847 6404 6019 8376 10420 10121 10016 8045 -1024 -457 156 301 926
1735 926 -2462 -3717 60 -3461 -10018 -14427 -10022 -8723 -3274 3577 -2339 -6366 -7300 -6254 -5835 -2287
1719 -2287 517 -1113 -2537 -9831 -6726 990 3070 6905 5341 1170 -3151 -2987 -2829 -1253 1963
1704 1963 8371 8245 8847 11423 6422 -3873 -5081 -331 5470 4793 4373 2974 2387 8374 2350 -2064
1688 -2064 -1356 -6490 -11804 -15236 -16465 -11716 -6799 -6649 -1078 5178 7971 3515 5838 7646 5878
1673 5878 3441 3104 -1981 -3246 -1512 -2977 -7877 -6861 -4842 -4709 -772 754 2396 1303 -1308
1658 -1308 -6935 -16012 -14454 -11930 -10120 -4930 -2506 -2111 -3491 -2199 2270 4635 6511 3381 3458 10227
1642 10227 13534 3560 2024 225 -1458 -3931 -308 3909 6561 7862 3514 1373 4323 4003 163
1627 163 4129 3384 -507 -3848 280 -3209 -4303 -1350 -368 5808 10808 14871 17120 18328 14787 4843
1611 4843 -1487 -4407 5008 4408 -4495 -1619 -1594 -658 -4902 -1176 4026 4325 -532 707 -1074 3498
1595 3498 5312 7882 8791 8883 7783 5758 11178 9286 12883 14497 10470 5283 205 -4572 -264 5579
1579 5579 12975 6278 444 3325 8688 4007 2950 9496 8324 8395 16913 16933 11359 5831 -863 270
1563 270 -134 -2975 -856 1271 -13 3205 6473 -1464 -9336 1407 5090 -1123 -3320 2201 1750
1548 1750 -1027 -2060 -228 7126 1705 -6795 -2821 -2331 -1942 2987 8719 13366 11848 4061 8714
1533 8714 7015 7884 10836 10253 7300 3770 2933 576 1536 6408 7708 5402 -807 -7220 -9301 -12262
1517 -12262 -5792 3930 6863 11891 5678 10033 13539 8798 7189 16596 13067 8183 1074 -2675 -3600
1502 -3600 -501 -493 -3308 -7238 -12265 -17640 -17060 -14421 -6273 3205 729 7250 10619 12154 7886 6642
1486 6642 6457 6244 5701 5674 13162 18597 15694 5521 1338 4287 1052 3409 3517 -4052 -3485 -8399
1470 -8399 -11388 -9518 -7663 -4637 -7458 -13093 -6967 -1429 -880 1229 4921 4452 203 -2542 6756
1455 6756 9812 5197 6318 9697 8842 4278 1302 3145 4008 4663 5486 4171 3469 6872 13876 10600
1439 10600 5368 1632 2912 4774 -2359 352 9179 10619 11042 17218 22246 16685 12559 7606 7199
1424 7199 4978 7319 13376 7978 3936 4644 7777 8127 4131 3066 -2311 -5642 -3678 -3595 -6261 -7987
1408 -7987 -8911 -3667 -3525 -9826 -8609 2771 7016 5962 1228 -511 -5140 -1279 620 766 7026
1393 7026 3568 2466 2098 347 -875 -1808 -4994 -7462 -7658 -12773 -14893 -10238 -2642 813 -1395 1538
1377 1538 8863 10182 2662 -685 5068 8834 12143 16292 19954 22399 14124 4208 4713 6529 4448
1362 4448 838 1808 1425 -5947 -5664 2335 -302 -3076 -1637 3856 11944 13799 1254 -7866 -14629
1347 -14629 -14358 -4284 -5202 2519 9160 3135 2107 -2031 -3129 2841 1369 1847 6493 4326 -4504
1332 -4504 -9660 -12073 -10362 -9047 -11820 -10355 -5001 -534 1080 -3963 -6089 678 4159 5011 2466
1317 2466 -3615 6894 11545 9903 12488 8107 -2270 -7745 -1352 -787 -10158 -14605 -20883 -21691 -15111
1302 -15111 -7899 -623 2637 -799 1215 4563 1818 3467 6215 1759 -4397 -5018 -2612 -4253 -4773
1287 -4773 -2159 1382 -3030 -3705 -3966 -7171 -4150 -1765 940 6205 1975 -7148 -8076 -6032 -5089 -6523
1271 -6523 1253 9497 4906 2930 519 3020 2521 2340 13 -1555 -5449 -4096 -2764 -3555 -1450 -47
1255 -47 -2274 -6838 -2392 4869 3767 -11637 -10287 -1980 1306 3861 4798 4889 9196 3174 335 32
1239 32 621 1301 4292 4197 3606 3758 7267 6211 4397 8846 8909 10117 8162 700 -2882 -3517 -1020 2084
1221 2084 254 -2670 -4329 667 8074 5768 7989 3445 -2276 -1944 11017 13577 7259 7180 7745 5346
1205 5346 3361 644 320 3696 1746 -611 -2103 -4257 1915 1275 -1780 -688 -4786 -5782 -6776 -8268
1189 -8268 -10799 -4773 587 -488 -8228 -12021 -2946 1654 -345 5040 3232 2960 4998 7013 6344
1174 6344 12238 17694 24712 18194 6631 -5798 -10943 -9648 -3417 -3003 -8945 -6716 -3771 -1634 -4198
1159 -4198 -8639 -12291 -6391 -1448 -1931 -4022 -5602 -4008 -4551 -8158 -16158 -14002 -4028 -6594 -5871 3756
1143 3756 6086 1837 9153 10502 11401 3413 938 -1065 552 -1426 375 4254 6292 2703 6825
1128 6825 4859 5489 10939 9467 7207 4194 -1669 -9317 -9002 -5382 -522 5359 3414 5429 5060 -1721
1112 -1721 1893 10347 11381 6741 3847 -1413 3515 3465 -4498 -715 521 -2687 4770 8234 1765
1097 1765 -972 2548 5727 7193 2433 599 -2858 -6270 127 5954 -938 -760 7096 7815 3214
1082 3214 8976 6635 -584 -3436 -5099 113 2287 -2199 965 -1222 -5947 -11751 -7635 -1140 -6992
1067 -6992 -13380 -16859 -18699 -14530 -12054 -6864 -5433 1579 11593 9150 7699 9842 11692 10107 5833
1052 5833 5409 4712 6617 10998 13519 8647 8004 6087 2371 -4672 -8831 -12028 -4408 4891 2259 1907
1036 1907 5946 -890 -5875 -129 2050 -2081 -3777 -9095 -14686 -9773 -1413 3116 914 -1559 -4997
1021 -4997 6096 15858 16479 9635 6325 9268 6215 2635 2407 1441 -460 2359 -446 -2399 -4016
1006 -4016 -2257 -2059 -966 -3736 -4750 -1317 1721 -1857 -12749 -17405 -13941 -9517 -2157 3668 -4525
991 -4525 -10810 -11877 -11970 -9578 -12268 -14954 -7703 431 923 -1583 2308 5104 9857 6713 247 -3932
975 -3932 -4313 -7152 -13237 -18076 -7145 -2625 -6389 -8371 -5341 -917 3037 6317 786 -1958 -2492
960 -2492 1602 -5668 -10821 -7536 -10426 -12126 -12183 -612 7049 7431 8376 10452 4173 8742 6047 -4250
944 -4250 -9852 -9107 -2501 3708 3374 1592 2833 4559 4085 2703 4566 6626 2386 -5446 -8928 -4577
928 -4577 4686 6293 3955 -2611 -2094 -1767 -2155 -5637 -11970 -10031 -3865 -3034 -1005 859 -8346 -7622
912 -7622 2821 4919 5677 11593 9884 4453 7396 11164 7090 2258 1258 -3815 -9821 -2551 -5347
897 -5347 -10132 -8098 -4194 -1838 -4603 -5184 -694 -5003 -5013 -2588 -3330 -563 -1342 -2774 -1857 -7289 -6688
880 -6688 72 2778 -2198 -5830 -5167 -840 258 2382 2192 4782 5257 685 -6864 -11656 -10380 -8432
864 -8432 -9710 -5155 -1726 -1260 -1504 -4219 -2831 -2661 -2223 -3230 -5714 -528 2464 2299 3566 3388 686
847 686 2505 5102 7177 5708 2846 616 1353 -147 -3454 -2803 -184 5063 12890 11322 5093 -1009
831 -1009 3563 2333 2987 -3937 -8410 -5887 -5221 299 1153 -1812 -5641 -6294 -456 4961 7224 2565
815 2565 -144 -2720 -5867 -5287 1459 95 -3809 331 404 -4796 -5053 3444 7939 9895 7810 6678
799 6678 5131 -2142 -3549 2970 708 -1077 -608 1296 441 -1235 -6158 2159 12975 5670 759
784 759 -1711 -3289 -5574 -3387 -5174 2794 6431 6013 5584 -3157 -4536 -6723 -6302 4927 5052 655
768 655 6186 5267 3469 5007 5774 6279 -3525 -3036 2827 139 331 4012 10583 6451 165 2855 9759
751 9759 17344 15294 14090 12932 6816 4969 3009 453 -2839 4161 3039 -3718 -1542 333 -72
736 -72 -4061 1173 938 -1251 3209 7599 10066 11997 6636 -6551 -15609 -13738 -10870 -5239 -10628 -12609
720 -12609 -4478 -2814 2019 1971 -799 2478 6410 5883 3672 134 -5006 1353 6657 3915 90 -1307
704 -1307 763 8380 10054 10426 10534 5182 2681 3830 8861 3436 -3125 -3079 -1558 -281 1246 2712
688 2712 6124 -3015 -6688 -2707 -1332 3924 11503 9339 5226 1621 3270 -1424 -4634 -2362 4457
673 4457 6036 4876 2479 -891 -2319 -9111 -14645 -8360 1942 5842 5613 599 -1425 -7066 -9573
658 -9573 -9528 -9034 -10873 -11458 -6803 -874 719 5256 1947 1263 -922 -4135 -1057 4353 4919 5532 831
641 831 -4533 786 527 -4937 -2050 -7789 -7912 2851 8338 10167 11220 3998 -3719 -6208 -6298 -1430
625 -1430 -3791 -6601 -3237 -141 2510 889 -3521 -5306 -7941 -9083 -7959 2978 6087 -549 -336
610 -336 945 5965 7450 4478 -642 -1881 3215 13144 12702 8783 602 42 4429 9256 5912 -3590
594 -3590 -2502 1968 1412 551 1970 -2897 -5444 -5406 -6307 4672 4770 4960 4752 -2244 -4708 -6701 -3738
577 -3738 784 2865 5903 5334 8713 2232 -1664 1405 2731 -2370 -7403 -3119 3977 3885 8838 6830
561 6830 -3707 -2747 -1594 -1170 5254 12709 8547 -741 -5516 -1253 344 -4994 691 6531 9634
546 9634 -74 -4123 1537 6800 2556 -2983 -10030 -6112 -2631 -501 4849 6612 4104 4719 1547
531 1547 997 9512 14100 11708 9538 13351 10650 -4123 -10521 -9475 -1029 3957 -1530 -6465 -3106
516 -3106 -3426 -2383 -1846 4268 8618 194 -3808 -1298 1752 477 -5015 -10190 -8974 -8677 -2919 4780
500 4780 2763 242 2167 1601 7026 8919 7056 3787 4124 2452 3238 1882 -5171 -9296 -780 -1870
484 -1870 -7281 -8255 -8550 -6519 -4224 -1224 -2125 1044 -2175 -7774 -6102 -6659 -3808 -2241 -5603 -4928
468 -4928 980 3410 -264 -1485 672 1867 -1989 -3807 -3340 26 -2364 886 7245 6654 3778 3405
452 3405 1264 -4151 467 10675 13742 13233 11856 16531 15393 7486 -1410 -7058 -1945 6371 6745
437 6745 -914 -5347 6505 16400 14441 9221 1997 -482 1939 4646 8909 745 -2740 391 7546
422 7546 1444 -881 727 -1501 -4809 -2353 -1997 879 -2621 -3676 -2022 -6782 -5925 -11820 -14853 -15117
406 -15117 -9579 -5168 -1657 -110 4213 5650 1935 2545 -2354 -5496 -7702 -4823 1557 4804 8768
391 8768 -490 -5479 -5420 -6092 -3825 2964 8639 9163 4617 -1346 -9207 -12352 -6701 329 1663 -1297
375 -1297 -5605 -1604 3214 7424 6724 7578 1919 -2107 -64 -800 -8081 -335 6677 4930 1871 998
359 998 -1136 -742 -1045 -553 -4788 -4816 -8322 -11148 -9979 -8447 -3815 -2872 -5666 -70 10011 5661 2239
342 2239 420 1763 4154 2218 707 -1699 -2287 -3227 -1726 2360 2995 -94 165 -2545 -5672 -5295
326 -5295 -961 2969 3400 606 -3730 -7704 -7010 -4337 -4305 -5213 -4163 -2198 373 6800 6275 -2311 -4934
309 -4934 -6035 -6535 -5014 -438 686 2315 5390 6190 4777 2217 468 3 183 -829 -2503 -3607
293 -3607 -5531 -7319 -9200 -10083 -9127 -9914 -7822 -1776 -4515 209 3733 1034 -3077 -6180 -8881 -5192
277 -5192 5001 4768 1977 2397 -71 -1839 2479 7142 8585 5604 6112 6136 8712 3676 2362 971
261 971 -682 127 -5021 -6944 -4569 882 2549 -596 -2749 -671 4538 4272 3824 1609 -1955 -4250
245 -4250 -1270 -343 1160 -56 1177 -3667 -4060 434 4549 7984 11964 11258 12382 6036 1750 -7055
229 -7055 -14672 -8716 -1099 709 -2744 -3248 -6165 -4799 -570 1494 2445 2871 6119 4619 -738 -321
213 -321 -3536 -3605 -3423 -9780 -14372 -10900 -9201 -10772 -14810 -11895 -3308 2281 3953 1882 820 770 -2629
196 -2629 -616 2698 2972 4334 1198 -2268 -1066 219 4132 4258 -1565 373 -1204 -6173 -6074 -6514
180 -6514 -5230 -4581 790 -2380 -3494 -2596 -128 -554 -938 -2801 414 5661 8205 7432 7129 5758 6230
163 6230 1921 -831 1038 -3074 -8192 -7852 -9307 -3755 -2230 -2046 -1938 -2540 -1577 -4138 -5271 -1780
147 -1780 -2028 4142 5312 -2064 -3961 -4009 -4978 -7852 -6980 -10575 -10362 -8608 -5985 -1446 4042 4694 4978
130 4978 -451 -6066 -3064 -3603 -3105 2467 4631 3069 7661 9505 6286 4094 5219 3267 3800 4803
114 4803 3322 1601 4037 -1949 -5962 -5116 -6496 -2138 -1106 879 -353 -3339 -4689 -7300 -4187
99 -4187 -4340 -7092 -6004 -2860 -2001 -1467 1272 5360 2670 -2642 -5806 -5112 -3273 -3706 -8027 -13130 -8002
82 -8002 -6485 -6432 -5617 -2715 -1333 -1048 2602 271 90 -2083 -169 -475 1864 5229 3336 25 -2504
65 -2504 -264 -541 -3729 -4425 -8544 -11493 -11382 -2613 -455 2331 3222 -967 -4651 -2433 -2176 977 -1485
48 -1485 -884 3999 3284 -5086 -5243 -1966 -1602 -1385 1809 4851 5729 2476 578 -492 -1843 -838 2787
31 2787 6155 3659 2656 -529 -2704 -5441 -7720 -7317 -10032 -7847 -2456 -203 -880 -4665 -6636 -8615
15 -8615 -5353 -3779 -985 -1657 -5050 -6984 -5778 -3436 -1473 204 592 1035 3060 4813 1227
0 1227
$$ Imaginary data points
##PAGE= N=2
##DATA TABLE= (X++(I..I)), XYDATA
32767 37170 42423 40927 35896 33815 33188 30201 29429 33986 36851 34699 28596 24427 25723 31062 35281
32752 35281 39447 43696 45318 41169 37661 36639 40975 40767 43120 46182 47157 47829 48873 44265 42748
32737 42748 43288 44978 47634 49392 49978 46559 47412 42141 38850 39907 42706 48412 45805 43869 46986
32722 46986 48419 48600 48888 46058 43931 47473 49600 51674 51522 50620 51455 55243 52753 52189 48921 51183
32706 51183 58903 57888 56972 62176 63200 64150 64249 56704 57049 63040 60403 57994 56294 55837 54930 57190
32690 57190 61444 59829 55209 57460 64382 67344 61908 61128 60481 61052 59918 55313 60217 64262 63307
32675 63307 65937 65373 63378 64038 61461 58356 55974 57271 66233 73474 71659 70714 70058 65875 62773
32660 62773 63621 63821 66769 70779 70355 71616 78383 80501 80445 80286 82634 83111 85008 81011 77706 78930
32644 78930 78287 78995 82935 86607 89218 91234 87868 84855 88746 85396 84096 83006 78946 84759 86006
32629 86006 90738 88104 92158 94174 93607 89196 90098 91406 90012 88295 91775 92446 93167 90820 86621
32614 86621 85279 85634 83467 83968 90498 92992 97970 99920 97716 97727 96213 94585 92787 93684 98651 102314
32598 102314 101736 106270 108285 105583 109185 109372 101505 99728 101386 98160 98079 99422 96966 99267 97602
32583 97602 94932 90325 91793 97146 102150 101559 100903 98527 104905 105041 108544 111197 103576 94764 94495
32568 94495 96705 104946 112213 115835 109208 98108 94070 97036 97814 96358 100893 108627 101686 96835
32554 96835 99905 103820 103673 104901 102420 101538 110507 116688 114553 112066 115853 117590 118083 121810 121255
32539 121255 115973 112042 112542 113840 113386 110385 116733 122302 122366 121424 119125 115505 116551 121782 120962 117270
32523 117270 112832 111654 111984 115927 120075 125725 122036 116910 115410 113241 111088 114945 120484 122708
32509 122708 126908 126394 121175 111866 115331 125202 125606 121851 118693 115357 115001 117656 120843 119082 120508
32494 120508 116959 114862 120330 118605 118172 118505 118464 113002 110586 113354 115556 119455 118058 120418 121924
32479 121924 127315 133913 135804 135573 128853 130081 133435 133244 127622 124295 132081 131572 124293 121426 124453
32464 124453 125978 124491 121901 120260 123036 121236 123068 127275 126800 130974 131239 127904 126866 126554 130602
32449 130602 134927 131303 123611 121356 120231 125591 130521 133527 129674 125723 127613 128351 127798 123621 123130
32434 123130 122984 123333 126583 126194 127487 134566 137146 134060 137722 143122 137163 134357 135998 140280 141526
32419 141526 137389 136237 136777 137235 132898 136489 142223 139496 138306 137134 141046 142034 140596 139497 137496
32404 137496 135121 136701 139940 145316 142108 139255 143584 149147 148784 147757 150457 148373 146393 148313
32390 148313 145564 142104 143058 146832 143606 138698 137294 133652 131592 136108 141839 146213 148429 144660
32376 144660 139893 140760 140812 144544 147858 151288 153372 158835 153823 152291 152797 143996 142216 143143 144278
32361 144278 148270 147361 139882 129904 136538 146984 150332 150951 146265 143465 142639 138212 141117 140929 144113
32346 144113 145141 145791 148493 148390 153568 156850 152187 149639 144940 150816 147668 146061 151708 154747 161520
32331 161520 161090 154249 148467 147654 151967 151408 150007 150091 149003 148798 151449 156322 157395 151883 152343 149920
32315 149920 147636 139620 140967 148323 148654 137049 134300 138873 137033 139150 146164 152436 153505 150807
32301 150807 156902 158327 154530 153819 149439 145168 147450 145910 151181 155336 153808 161376 165500 159738
32287 159738 159177 163034 158881 154459 153643 153467 148138 146923 158337 164963 166017 165681 166079 161388 161213
32272 161213 158363 162011 166832 170783 171350 166684 160514 158257 157684 154170 150323 155116 159942 160943 154699
32257 154699 152547 154024 157693 167882 163928 161618 166164 159466 151384 148206 152957 159532 163778 164385
32243 164385 160756 163681 163896 159055 163154 164512 156928 153617 158915 160763 153494 152890 152674 149579 151458
32228 151458 150816 155608 160006 164043 156456 155773 159143 159821 159976 157502 152789 158755 157174 152104 152408
32213 152408 159062 161315 159889 155700 156851 157073 159896 169690 170083 166259 164592 163789 163503 162107 169182
32198 169182 165605 159519 151511 151417 150964 147845 151591 153229 159096 161148 154778 151819 148573 145196 145893
32183 145893 148460 147155 153795 165188 166998 163039 166532 167591 165119 164916 166006 163517 158170 151704
32169 151704 154779 161113 154821 156881 160233 155417 152388 154338 155790 157727 164614 171155 172441 167491
32155 167491 164983 162755 164801 164174 159365 156572 156752 153323 152164 154352 149887 151210 156042 157793 161220
32140 161220 157411 156221 151811 160704 156780 153799 162221 163448 158095 160237 158889 162198 160822 147108
32126 147108 138562 139174 141004 145302 149376 148424 151955 156293 162640 161263 161989 166165 162064 160280 158781
32111 158781 154543 153949 151752 155831 157806 153655 155000 159201 159006 162659 167976 170041 169450 170916 177380
32096 177380 179285 172403 164286 154551 155083 156167 160860 169942 176519 172518 168644 163008 161894 160456
32082 160456 153967 156191 155037 161870 168044 170695 170182 169784 164461 159633 160217 159436 160873 160361 157542
32067 157542 153682 153177 155304 158590 160806 155572 154787 161310 165470 159929 156885 152042 150168 150624 155551
32052 155551 153003 155618 162279 155619 155436 156500 156560 161723 162951 156925 149095 150331 149045 158401 162273
32037 162273 160072 159225 158933 162719 157820 158977 152241 148443 150264 145393 151114 161806 165543 162083
32023 162083 158716 157696 156177 155322 163186 164973 161793 156876 156507 160210 160374 162513 166235 164010 166270
32008 166270 171765 173127 163690 165573 168028 164790 164285 160213 153693 157791 164428 165013 160725 154323 154267
31993 154267 156927 158838 158153 161657 164363 166965 167718 165228 167700 170898 169028 168832 159857 157730 159367
31978 159367 162658 173395 174559 167029 158283 152463 149070 151391 155148 163544 168572 166905 161770 162303
31964 162303 163301 163472 166606 167760 172623 169540 165705 169012 172223 168636 168925 172227 167871 163619 160937
31949 160937 158904 161518 156798 153673 155566 154555 153212 154715 161079 166939 165589 158629 159167 156444
31935 156444 159930 153548 146920 149923 157877 159336 160248 163601 162133 154218 154623 160810 163486 154969 153396
31920 153396 156716 155384 155200 160842 166117 159194 157070 157128 157116 159432 162899 161935 160166 163510 165516 158115
31904 158115 154524 155990 155418 160047 170103 166187 156649 146734 150224 159811 164946 163088 165457 168172
31890 168172 160493 157981 158418 161028 160138 155546 156101 159878 170705 173211 162009 160306 163067 173831
31876 173831 180570 180916 173666 174996 174672 171110 161485 159555 156076 156003 151063 149717 149840 155489 161934
31861 161934 169764 165405 164391 164555 158227 151740 154519 156347 154715 159380 163065 161743 160737 163000
31847 163000 167584 170049 163338 159507 157086 159297 156569 156439 158697 166852 164727 160306 158965 167797
31833 167797 179981 177374 169200 167616 166093 163725 161724 161208 163260 161354 158839 159485 158339 154625
31819 154625 156165 158349 160264 164198 166448 161632 165343 165958 165613 157556 149012 149370 150908 151859 158572
31804 158572 161350 162037 151932 148932 157800 159519 158583 159303 161133 163054 160783 158147 158931 156246 150268
31789 150268 160384 166149 160918 162308 161168 157352 162491 162865 156959 154806 157497 160274 161304 163427
31775 163427 167551 166461 166448 161795 163179 167179 172203 174780 176197 175657 173445 170000 175466 172483 165246
31760 165246 162655 158009 162661 167175 166220 160519 159738 162150 163608 161632 162713 163189 164044 161454 158139
31745 158139 162132 170289 172094 161335 156109 154243 157653 162523 163167 165884 163527 164767 167309 164641
31731 164641 162206 166758 171334 168905 162808 166127 163428 153587 157826 155041 145321 151243 162630 172590
31717 172590 173595 164952 161781 158870 156897 163167 168570 170002 161202 159221 159811 156795 157618 157264 159689
31702 159689 156707 164238 168336 162126 161906 163481 163346 162398 156032 146024 149863 153886 160620 162475 155929
31687 155929 156820 161251 160310 161903 161565 161124 156305 153162 153865 157528 162902 164964 165624 161853 161906 160445
31671 160445 160223 155156 153116 155926 153045 158502 168845 169785 169548 166812 165098 161851 159434 165196 168956
31656 168956 170972 164910 164460 167938 165402 164158 165163 161755 158064 161647 167741 176262 174104 167141
31642 167141 161135 167057 169881 177430 181797 177756 171637 169670 168622 160211 159277 160380 160880 159906 163178
31627 163178 162728 162598 157397 156271 153987 155567 151278 146656 153640 160116 162724 161914 157322 157462 160374
31612 160374 163324 167450 171633 173955 169968 168520 165145 162323 159163 158664 162532 170629 171720 169614
31598 169614 174882 169901 170387 166650 163839 163437 163106 162767 163633 161554 162328 164179 159550 160841 158322 154422
31582 154422 157001 160385 165172 171049 168131 160503 148583 146474 154387 164256 166866 168833 166152 163084
31568 163084 164844 165810 165366 164035 165071 170428 171216 170141 167184 161609 164228 161639 156406 157733 163148
31553 163148 166874 169622 170827 170287 165290 164282 164200 162263 161960 156342 153305 161846 162503 157054 161432
31538 161432 167305 167032 166518 167796 167147 162084 165707 163144 161025 162946 168716 171423 169147 176910 173789
31523 173789 166040 154688 152103 152067 158143 163655 168892 163926 164274 166747 164656 157492 157014 162733 166563
31508 166563 167176 174247 177960 177616 178876 180725 178220 183494 186009 176369 167514 163459 169479 161195 157672
31493 157672 164565 170527 170208 166913 161394 159811 166918 173180 171093 172541 177597 179477 177486 172197
31479 172197 163360 166855 168436 164039 157531 156350 154413 158088 161483 162266 168018 162995 161607 169367
31465 169367 171950 172147 169752 168213 173863 177273 179804 175889 170021 175416 176762 175766 172067 168323 164779
31450 164779 167720 174908 179282 175740 176988 182810 188712 187948 184114 177069 172545 170315 168640 168835 167705
31435 167705 163926 165930 169996 172902 171040 171742 175546 171874 169718 169389 170050 170004 160397 159241 163491
31420 163491 162375 166097 165883 175171 174990 164740 163727 163329 163907 162632 162909 165778 165032 168553 165591
31405 165591 160665 170493 174938 173331 165804 164269 168729 169242 162082 164839 171914 173492 171454 170633 166884
31390 166884 166660 167568 163495 165617 173161 176023 169773 167764 176342 172932 173223 172689 169821 164359 162114
31375 162114 161918 161131 162201 155702 151522 155005 167060 173291 169805 164962 155785 158370 162603 165306
31361 165306 169578 172060 175384 171755 172065 170887 174024 172707 165665 160499 164019 169699 179307 181706
31347 181706 183063 180525 181415 181666 182399 174729 167033 161858 162091 173416 174236 171404 167040 163507 163964
31332 163964 167814 171416 166228 165588 173096 170105 165209 173429 173246 167219 165549 166374 168029 163692 164786
31317 164786 166746 163228 162343 161571 166019 171553 175270 173638 167996 164457 160660 167651 169831 167624 167909
31302 167909 172734 169058 164175 165988 170116 170337 165419 163018 167582 165954 171726 172454 172919 169075 169852
31287 169852 171857 162047 165403 176546 177053 174972 171135 168859 158807 156811 155967 163549 171375 170464
31273 170464 166495 164383 156861 153364 160929 162464 158292 162774 168948 161760 160988 164478 161862 159978
31259 159978 163885 164997 166352 162400 159549 163493 164750 169415 172472 174390 174886 178806 177742 172685
31245 172685 162619 167682 168537 170522 167356 165385 168632 170216 167281 167053 169932 171556 164286 165777
31231 165777 172531 174295 172152 165232 161657 158023 160727 164688 174238 175367 173698 171810 166750 164810
31217 164810 165845 169827 175551 176370 185470 185320 177434 174864 172993 165171 164248 165863 166178 165296 167347
31202 167347 167630 163385 166055 170337 171853 183262 174798 168752 166728 170052 168790 165845 164497 165179
31188 165179 166128 164263 162917 170154 172733 180733 178929 169718 165597 162320 166583 167959 172546 174274
31174 174274 171356 173831 175912 172606 174628 179408 183320 187284 190707 179160 174302 163931 158327 154710
31160 154710 153960 152396 157523 159250 163828 165312 168015 168268 165261 163728 163549 164852 165883 163782 168929
31145 168929 164912 166621 171092 176150 175936 170896 166607 166685 168228 165932 166959 160196 155788 161476 162373
31130 162373 166808 164393 160090 156853 170681 178572 177760 177196 175894 177114 180417 177678 181253 179984
31116 179984 172733 170538 177189 176598 175414 176119 172655 173443 171915 173307 177536 178729 170741 163696 170302
31101 170302 168167 167879 166373 167323 165775 165941 171378 170867 168662 174336 170636 166657 164875 163143 170579
31086 170579 175890 181100 181115 179417 171431 169035 170997 173540 169353 160520 153178 157013 161334 168053 171165
31071 171165 174299 177815 184113 181226 167682 159888 160539 159910 163589 165654 165368 163322 162839 169021 171018
31056 171018 169789 163842 169169 167300 164457 167776 171188 168389 167183 172052 176888 179417 179849 175529
31042 175529 174862 170968 169593 170256 167344 164560 162311 162815 169654 175596 175424 181109 175840 168368 167008
31027 167008 174425 180321 174198 164179 161626 168733 171922 177343 181759 175147 172807 175871 179272 175131
31013 175131 172808 166859 160307 162472 173460 180217 175822 166495 168345 170937 166025 162701 164751 168115
$$ [...]
##END NTUPLES=NMR SPECTRUM
##END=
