##TITLE=Analysis number 325935
Compound Code cc 59604
Book Reference 521/13
Project Code adrs
Chemist Name evam
##JCAMPDX= 6.0         $$ Bruker NMR JCAMP-DX V2.0
##DATA TYPE= NMR SPECTRUM
##DATA CLASS= NTUPLES
##ORIGIN= Bruker BioSpin GmbH
##OWNER= nmr
$$ XWIN-NMR		Version 3.5
$$ Fri Jan 19 10:16:42 2007 GMT Standard Time (UT+0h)  MAYBRIDGE\nmr@NMR_250MHZ
##.OBSERVE FREQUENCY= 250.131544655141
##.OBSERVE NUCLEUS= ^1H
##.ACQUISITION MODE= SIMULTANEOUS (DQD)
##.ACQUISITION SCHEME= undefined
##.AVERAGES= 16
##.DIGITISER RES= 18
##SPECTROMETER/DATA SYSTEM= dpx250
##.PULSE SEQUENCE= zg30
##.SOLVENT NAME= CDCl3
##.SHIFT REFERENCE= (INTERNAL, CDCl3, 0, 16.4595)
##AUDIT TRAIL= $$ (NUMBER, WHEN, WHO, WHERE, WHAT)
$$ ##TITLE= Audit trail, XWIN-NMR		Version 3.5
$$ ##JCAMPDX= 5.01
$$ ##ORIGIN= Bruker BioSpin GmbH
$$ ##OWNER= nmr
$$ C:\u/data/dgb/nmr/ADRS/1480/pdata/1/auditp.txt
$$ ##AUDIT TRAIL=  $$ (NUMBER, WHEN, WHO, WHERE, WHAT)
(   1,<2007-01-19 10:16:22.40 +000>,<MAYBRIDGE\nmr>,<NMR_250MHZ>,
      <created by zg, POWCHK disabled, PULCHK disabled
       configuration hash MD5:
       49 4B E0 1D 92 C2 6B 37 9F E6 65 BC 52 41 86 1D
       data hash MD5: 64K
       D1 55 42 1E 90 F1 CD 90 BD A0 4D D8 C0 48 BD 61>)
(   2,<2007-01-19 10:16:34.83 +000>,<MAYBRIDGE\nmr>,<NMR_250MHZ>,
      <Start of raw data processing
       ef LB = 0.3 FT_mod = 6 PKNL = 1 SI = 32K 
       data hash MD5: 32K
       EC 11 A4 71 BE 20 6E E6 D7 3C 2D 6E 4E 9E 92 3D>)
(   3,<2007-01-19 10:16:36.44 +000>,<MAYBRIDGE\nmr>,<NMR_250MHZ>,
      <apk 
       data hash MD5: 32K
       FE EA D5 C4 06 40 3E 43 25 06 D8 85 72 CB D5 08>)
(   4,<2007-01-19 10:16:37.13 +000>,<MAYBRIDGE\nmr>,<NMR_250MHZ>,
      <abs ABSG = 5 
       data hash MD5: 32K
       CA EE 65 3D 84 C4 30 DD 05 36 B3 FD DE 78 F4 37>)
$$ ##END=
$$ 
$$ hash MD5
$$ 6C 5A A4 1F 5C DD AA 8A 80 42 12 20 0E 5F 97 15
##$RELAX= 
##$RELAX= 
##$RELAX= 
##$RELAX= 
##$RELAX= 
##$RELAX= 
##$RELAX= 
$$ Bruker specific parameters
$$ --------------------------
##$DU= <C:\u>
##$EXPNO= 1480
##$NAME= <ADRS>
##$PROCNO= 1
##$TYPE= <nmr>
##$USER= <dgb>
##$AMP= (0..31)
100 100 100 100 100 100 100 100 100 100 100 100 100 100 100 100 100 100 
100 100 100 100 100 100 100 100 100 100 100 100 100 100 
##$AQSEQ= 0
##$AQ_mod= 3
##$AUNM= <au_zg>
##$AUTOPOS= <12 >
##$BF1= 250.13
##$BF2= 250.13
##$BF3= 250.13
##$BF4= 250.13
##$BF5= 500.13
##$BF6= 500.13
##$BF7= 500.13
##$BF8= 500.13
##$BYTORDA= 1
##$CFDGTYP= 0
##$CFRGTYP= 5
##$CHEMSTR= <none>
##$CNST= (0..31)
1 1 145 1 1 1 1 1 1 1 1 1 1 1 1 1 1 1 1 1 1 1 1 1 1 1 1 1 1 1 1 1 
##$CPDPRG= <>
##$CPDPRG1= <>
##$CPDPRG2= <>
##$CPDPRG3= <>
##$CPDPRG4= <mlev>
##$CPDPRG5= <mlev>
##$CPDPRG6= <mlev>
##$CPDPRG7= <mlev>
##$CPDPRG8= <mlev>
##$CPDPRGB= <>
##$CPDPRGT= <>
##$D= (0..31)
0 1 0 0 0 0 0 0 0 0.06 0 0 0 0 0 0 0.0002 0 0 0 0 0 0 0 0 0 0 0 0 0 0 
0 
##$DATE= 1169201781
##$DBL= (0..7)
120 120 120 120 120 120 120 120 
##$DBP= (0..7)
150 150 150 150 150 150 150 150 
##$DBP07= 0
##$DBPNAM0= <>
##$DBPNAM1= <>
$$ [...]
##$SUBNAM7= <"">
##$SUBNAM8= <"">
##$SUBNAM9= <"">
##$SW= 20.6930455092707
##$SWIBOX= (0..15)
0 0 3 0 0 0 0 0 0 0 0 0 0 0 0 0 
##$SW_h= 5175.983436853
##$TD= 65536
##$TD0= 1
##$TE= 294.16
##$TE2= 300
##$TE3= 300
##$TEG= 300
##$TL= (0..7)
0 120 120 120 120 120 120 120 
##$TP= (0..7)
150 150 150 150 150 150 150 150 
##$TP07= 0
##$TPNAME0= <>
##$TPNAME1= <>
##$TPNAME2= <>
##$TPNAME3= <>
##$TPNAME4= <>
##$TPNAME5= <>
##$TPNAME6= <>
##$TPNAME7= <>
##$TPOAL= (0..7)
0.5 0.5 0.5 0.5 0.5 0.5 0.5 0.5 
##$TPOFFS= (0..7)
0 0 0 0 0 0 0 0 
##$TUNHIN= 0
##$TUNHOUT= 0
##$TUNXOUT= 0
##$USERA1= <user>
##$USERA2= <user>
##$USERA3= <user>
##$USERA4= <user>
##$USERA5= <user>
##$V9= 5
##$VALIST= <valist>
##$VCLIST= <CCCCCCCCCCCCCCC>
##$VD= 0
##$VDLIST= <DDDDDDDDDDDDDDD>
##$VPLIST= <PPPPPPPPPPPPPPP>
##$VTLIST= <TTTTTTTTTTTTTTT>
##$WBST= 1024
##$WBSW= 4
##$XGAIN= (0..3)
0 0 0 0 
##$XL= 0
##$YL= 0
##$YMAX_a= 535781
##$YMIN_a= -511609
##$ZGOPTNS= <>
##$ZL1= 120
##$ZL2= 120
##$ZL3= 120
##$ZL4= 120
##$ABSF1= 16.4595
##$ABSF2= -4.233673
##$ABSG= 5
##$ABSL= 3
##$ALPHA= 0
##$AQORDER= 0
##$ASSFAC= 0
##$ASSFACI= 0
##$ASSFACX= 0
##$ASSWID= 0
##$AUNMP= <proc_1d>
##$AZFE= 0.1
##$AZFW= 0.1
##$BCFW= 0
##$BC_mod= 0
##$BYTORDP= 0
##$COROFFS= 0
##$CY= 12.5
##$DATMOD= 1
##$DC= 0
##$DFILT= <>
##$DTYPP= 0
##$F1P= 14.0000005364418
##$F2P= -0.99999901652339
##$FCOR= 0.5
##$FTSIZE= 32768
##$FT_mod= 6
##$GAMMA= 0
##$GB= 0
##$INTBC= 1
##$INTSCL= 1
##$ISEN= 128
##$LB= 0.3
##$LEV0= 0
##$LPBIN= 0
##$MAXI= 10000
##$MC2= 0
##$MEAN= 0
##$ME_mod= 0
##$MI= 0
##$NCOEF= 0
##$NC_proc= -2
##$NLEV= 6
##$NOISF1= 0
##$NOISF2= 0
##$NSP= 0
##$NTH_PI= 0
##$NZP= 0
##$OFFSET= 16.4595
##$PC= 1
##$PHC0= 226.0633
##$PHC1= 5.224207
##$PH_mod= 1
##$PKNL= yes
##$PPARMOD= 0
##$PSCAL= 4
##$PSIGN= 0
##$REVERSE= no
##$SF= 250.130015632685
##$SI= 32768
##$SIGF1= 0
##$SIGF2= 0
##$SINO= 400
##$SIOLD= 32768
##$SREGLST= <1H.CDCl3>
##$SSB= 0
##$STSI= 32768
##$STSR= 0
##$SW_p= 5175.98343685301
##$SYMM= 0
##$S_DEV= 0
##$TDeff= 65536
##$TDoff= 0
##$TI= <Analysis number 999999
Compound Code 99
Book Reference 9
Project Code 9>
##$TILT= no
##$TM1= 0
##$TM2= 0
##$TOPLEV= 0
##$USERP1= <user>
##$USERP2= <user>
##$USERP3= <user>
##$USERP4= <user>
##$USERP5= <user>
##$WDW= 1
##$XDIM= 32768
##$YMAX_p= 498458677
##$YMIN_p= -27567
$$ End of Bruker specific parameters
$$ ---------------------------------
##NTUPLES= NMR SPECTRUM
##VAR_NAME=  FREQUENCY,     SPECTRUM/REAL,   SPECTRUM/IMAG
##SYMBOL=    X,             R,               I
##VAR_TYPE=  INDEPENDENT,   DEPENDENT,       DEPENDENT
##VAR_FORM=  AFFN,          ASDF,            ASDF
##VAR_DIM=   32768,         32768,           32768
##UNITS=     HZ,            ARBITRARY UNITS, ARBITRARY UNITS
##FACTOR=    0.157963299565203, 1,           1
##FIRST=     4117.01483200557, 0,            0
##LAST=      -1058.96860484744, 0,           0
##MIN=       -1058.96860484744, -27567,      0
##MAX=       4117.01483200557, 498458677,    0
$$ Real data points
##PAGE= N=1
##DATA TABLE= (X++(R..R)), XYDATA
$$ [...]
##PAGE= N=2
##DATA TABLE= (X++(I..I)), XYDATA
18325 -455386 -447955 -429893 -420801 -406261 -384873 -365912 -359859 -356773 -346908 -332208 -310476 -295026
18313 -295026 -287589 -283287 -275874 -262641 -247068 -236904 -221379 -206924 -194515 -175340 -168614 -163723
18301 -163723 -162310 -163047 -144169 -133585 -127929 -135889 -133869 -123331 -111315 -114405 -121233 -110023 -95941
18288 -95941 -88000 -89441 -91654 -88817 -79409 -74474 -69149 -67468 -53071 -35803 -16141 -5971 -4705
18275 -4705 10980 27158 38851 51201 55161 63747 73475 83570 95738 99565 99379 112592 120876
18262 120876 133882 151421 167165 181300 189668 196270 210836 224430 236065 239375 233378 236588
18250 236588 246247 253780 257975 239678 218214 209314 218543 227441 232490 235479 237485 240125 243665 245088
18236 245088 251648 261216 277111 290781 305259 321580 332129 348598 366519 379059 386345 404136
18224 404136 410757 413402 418215 432360 439125 454268 469700 483708 495070 507747 525320 539075
18212 539075 549434 563060 580010 598765 614978 627663 635642 644537 640959 632283 621181 600652
18200 600652 576074 555291 526871 501627 477245 470236 468941 464542 452674 448631 459679 479829
18188 479829 511893 535325 554860 576035 593216 608983 627965 646537 660414 679395 697775
18177 697775 715533 737836 753315 771299 789512 802376 814392 824845 834608 848094 857740 876251
18165 876251 905317 925608 945611 965463 983841 1005699 1024584 1035444 1045989 1060021 1087462
18154 1087462 1117632 1139512 1157444 1172919 1173550 1177705 1195474 1208931 1209865 1217796 1231644 1246370
18142 1246370 1268647 1296188 1326154 1357548 1390439 1434825 1482249 1535708 1590871 1652302 1720089
18131 1720089 1786896 1863092 1940867 2024336 2120011 2222446 2332173 2458154 2595508 2753336
18121 2753336 2936573 3155345 3403028 3680797 4016701 4453277 5010993 5722876 6658702
18112 6658702 7885701 9249191 9999115 8397764 1398305 -6681000 -8976505 -7853608
18104 -7853608 -6453153 -5318579 -4469887 -3834066 -3326864 -2918064 -2575857 -2284056 -2044591
18095 -2044591 -1854090 -1693561 -1534966 -1389058 -1260123 -1148078 -1049289 -960595 -874911 -794231
18085 -794231 -716153 -654838 -606451 -554724 -500193 -448485 -405313 -360235 -311310 -265597 -232116
18074 -232116 -207213 -184465 -155245 -127926 -99949 -65706 -39657 -19474 7979 34615 58423
18063 58423 75866 105863 130108 157715 174535 185056 192981 197774 208391 229191 250466 258024
18051 258024 274180 293117 311906 328346 340880 348029 343922 345516 346673 364766 385847 401487
18039 401487 417381 437228 452969 464731 478734 496354 505845 515508 529590 542432 553895 561948
18027 561948 572091 582797 602337 615235 620243 637202 644621 651479 665186 680054 691799 705048
18015 705048 720118 728030 743059 758054 756235 746109 742465 745932 763913 779946 787858 778631 777660
18002 777660 784719 794742 800082 799526 805735 810303 823394 845553 863210 871714 872975 868391 854938
17989 854938 858312 866982 876499 890707 900887 916485 936292 943751 945002 949400 954628 961250 965053
17976 965053 974852 985185 995882 1003180 1008421 1031234 1052309 1066093 1077754 1089389 1097434 1105862
17964 1105862 1111161 1132538 1152719 1161179 1165853 1170457 1162368 1153363 1143929 1150592 1169580 1181900 1200939
17951 1200939 1218624 1229073 1240649 1256797 1261386 1242625 1220532 1208039 1206883 1228865 1243697 1247780
17939 1247780 1254938 1272609 1282739 1295460 1306015 1311924 1324127 1336315 1347462 1353897 1359657 1368556
17927 1368556 1374957 1391337 1410266 1417920 1416595 1425462 1445646 1458195 1474463 1489627 1500627 1506778
17915 1506778 1514351 1525356 1543741 1565761 1581975 1588066 1599251 1609669 1621250 1630933 1651680 1671819
17903 1671819 1681889 1692908 1702068 1710988 1727899 1742230 1753387 1756928 1763830 1767619 1775360 1779740 1784242
17890 1784242 1795628 1808042 1817887 1826860 1850129 1862313 1876388 1888094 1902343 1912690 1921908 1939794
17878 1939794 1953277 1970589 1986778 2000391 2011475 2027469 2047877 2066051 2077077 2092143 2113296
17867 2113296 2138264 2159069 2166301 2178461 2196761 2213431 2229503 2240557 2254053 2274929 2298966
17856 2298966 2322437 2336912 2354928 2371644 2382977 2399284 2425219 2451108 2470627 2488561 2499952
17845 2499952 2521779 2544223 2564813 2586485 2606648 2630585 2651985 2672929 2690230 2710732 2738566
17834 2738566 2761299 2789932 2806098 2817915 2841882 2867397 2894440 2922909 2942193 2967634 2999876
17823 2999876 3033834 3061330 3082581 3103338 3133039 3163402 3195237 3224846 3247080 3267714 3297030
17812 3297030 3332451 3369123 3399089 3431627 3468396 3508156 3543603 3575720 3617303 3655429 3697706
17801 3697706 3740344 3773789 3809906 3857833 3900826 3943847 3984898 4023993 4068428 4114232 4167142
17790 4167142 4218517 4281413 4347332 4404263 4461551 4519221 4571843 4628178 4691519 4756031 4824557
17779 4824557 4894169 4957378 5023363 5098792 5179317 5262808 5349072 5434492 5529633 5631501 5733784
17768 5733784 5844780 5949045 6067871 6177575 6284539 6400971 6516267 6645583 6780799
17759 6780799 6925616 7075954 7219191 7373120 7546831 7757590 7994408 8243652 8506457
17750 8506457 8804228 9152464 9548838 10004811 10531923 11138207 11828709 12636769 13497912
17741 13497912 14152923 14107722 13045703 12091540 12334400 13166296 13193792 11116328 7147018
17732 7147018 4051070 3491491 4167436 4248472 2684532 439244 -365307 283371 1367386
17723 1367386 2438667 3410547 4280989 5069196 5796954 6501294 7194131 7861817 8534169
17714 8534169 9245693 10012002 10821580 11661371 12536858 13502610 14645080 16025075 17634862
17705 17634862 19450007 21364465 23056611 23932617 23471341 21620302 19082589 17393874
17697 17393874 17315900 18123182 18199791 15900698 10513123 3814066 -678634 -2307074 -3493329
17688 -3493329 -6257786 -9949708 -12619741 -13475027 -14178483 -15885963 -17591740 -18854164
17680 -18854164 -19083887 -18071143 -16926233 -16171182 -15205203 -13848072 -12417606 -11096631
17672 -11096631 -9909963 -8838354 -7872830 -7003849 -6204803 -5442187 -4706248 -4000357 -3332172
17663 -3332172 -2690382 -2059537 -1409865 -723173 2715 779695 1630902 2588481 3682638
17654 3682638 4927522 6337567 7930948 9658547 11319258 12541867 12986320 12524562
17646 12524562 11534182 11002054 11074096 10658929 7920448 1801245 -6663539 -15306116 -22773899
17637 -22773899 -28080721 -29670273 -28147242 -25604876 -23336621 -21756383 -20726365 -19699064
17629 -19699064 -18495190 -17292273 -16210758 -15266304 -14446089 -13737341 -13128458 -12589471 -12096481
17620 -12096481 -11656895 -11263228 -10895982 -10543663 -10212035 -9917329 -9662789 -9438116 -9219446
17611 -9219446 -8991680 -8761644 -8542213 -8339394 -8159324 -7988020 -7816073 -7650340 -7497612
17602 -7497612 -7349794 -7204643 -7066396 -6931695 -6802178 -6673380 -6562086 -6456805 -6356473
17593 -6356473 -6260601 -6167212 -6077348 -5983980 -5897340 -5818766 -5738153 -5660189 -5585395 -5511762 -5438789
17582 -5438789 -5357676 -5286586 -5221445 -5148861 -5076508 -5010415 -4954323 -4901474 -4842007 -4788296 -4731687
17571 -4731687 -4676974 -4621951 -4564752 -4511478 -4464341 -4420196 -4376071 -4325329 -4276635 -4235132 -4197796
17560 -4197796 -4161977 -4123598 -4088151 -4057482 -4022088 -3984694 -3949818 -3908474 -3869815 -3836286 -3803300
17549 -3803300 -3775541 -3738926 -3702945 -3672863 -3643043 -3614647 -3573861 -3540937 -3515562 -3488933 -3474511
17538 -3474511 -3454810 -3434591 -3410612 -3387778 -3368261 -3341716 -3316022 -3296101 -3271783 -3242913 -3217882
17527 -3217882 -3186654 -3153809 -3132818 -3115052 -3088038 -3058294 -3033654 -3005800 -2985149 -2967538 -2947969
17516 -2947969 -2927186 -2909152 -2892753 -2877547 -2857784 -2839896 -2830444 -2815360 -2801913 -2784495 -2766358
17505 -2766358 -2753469 -2735179 -2710934 -2694335 -2678422 -2662127 -2642001 -2619480 -2603735 -2591877 -2581839
17494 -2581839 -2569368 -2543020 -2522253 -2512316 -2503479 -2496885 -2488669 -2475107 -2462904 -2450248 -2435973 -2415558
17482 -2415558 -2402636 -2388927 -2380457 -2368657 -2361310 -2352734 -2335896 -2318374 -2301580 -2284649 -2272682 -2260046
17470 -2260046 -2245170 -2223993 -2213170 -2203912 -2199606 -2190287 -2180076 -2162538 -2150750 -2148981 -2146345 -2136470
17458 -2136470 -2118872 -2104796 -2090360 -2084815 -2079865 -2065892 -2045699 -2028475 -2017947 -2003332 -1987672 -1970750
17446 -1970750 -1958588 -1943190 -1922069 -1912192 -1913100 -1947687 -1980285 -1972983 -1958060 -1942304 -1927081 -1916773
17434 -1916773 -1904334 -1894784 -1882961 -1878577 -1878183 -1870664 -1863303 -1857088 -1847939 -1839712 -1829418 -1818753 -1807917
17421 -1807917 -1804592 -1803127 -1799669 -1786095 -1768152 -1759888 -1755729 -1740407 -1730092 -1723615 -1727110 -1723398 -1722744
17408 -1722744 -1718259 -1704554 -1695181 -1681856 -1667267 -1657852 -1653384 -1648318 -1635474 -1632152 -1629888 -1618773 -1613839
17395 -1613839 -1612103 -1603688 -1592232 -1581540 -1566147 -1557483 -1551428 -1547447 -1550251 -1548146 -1545502 -1545203 -1536490
17382 -1536490 -1527846 -1514270 -1503920 -1498465 -1492399 -1486986 -1479906 -1478193 -1468549 -1468631 -1470849 -1467709 -1458381 -1446191
17368 -1446191 -1439754 -1438579 -1437332 -1436034 -1428825 -1410839 -1409843 -1402485 -1389075 -1381808 -1378767 -1367613 -1350825
17355 -1350825 -1335574 -1336590 -1337410 -1340233 -1354833 -1369623 -1378858 -1378095 -1371837 -1365029 -1356630 -1347340 -1336448
17342 -1336448 -1330070 -1328782 -1324287 -1315933 -1305063 -1299190 -1295003 -1294541 -1297622 -1294046 -1290680 -1280098 -1267498
17329 -1267498 -1262663 -1257130 -1256967 -1254793 -1253300 -1244329 -1236178 -1235724 -1237452 -1231561 -1224186 -1217657 -1213268 -1216569
17315 -1216569 -1209519 -1205130 -1197761 -1192359 -1183814 -1181649 -1184135 -1185086 -1180527 -1167624 -1156370 -1157424 -1161461 -1157911
17301 -1157911 -1151594 -1145317 -1140309 -1134472 -1128732 -1123387 -1120843 -1123667 -1121257 -1117209 -1112133 -1103565 -1104185 -1100749
17287 -1100749 -1094811 -1090938 -1090398 -1092608 -1093396 -1085748 -1079142 -1076926 -1070710 -1070682 -1064633 -1059116 -1050387 -1040829 -1040392
17272 -1040392 -1037766 -1029661 -1031579 -1034917 -1024366 -1020374 -1017720 -1014563 -1011425 -1013258 -1003924 -997642 -993698 -987975
17258 -987975 -982635 -978420 -977952 -979724 -973436 -961259 -955126 -944654 -938146 -937261 -936964 -947969 -963504 -979501
17244 -979501 -986358 -986679 -982835 -981079 -966433 -956577 -948814 -937426 -931583 -934861 -927284 -926859 -920822 -918600
17230 -918600 -915114 -910233 -896704 -884583 -879602 -874691 -872379 -867779 -862029 -856925 -849739 -840359 -840782 -843157
17216 -843157 -847239 -847671 -849911 -862380 -876328 -883419 -880123 -873521 -866044 -867020 -863846 -855946 -849840 -847609
17202 -847609 -837860 -827326 -817558 -810100 -807984 -797731 -788046 -777265 -766342 -762747 -757346 -751200 -755155
17189 -755155 -763738 -775478 -791353 -809169 -820324 -833647 -847255 -856188 -859655 -862229 -859736 -844477
17177 -844477 -833587 -817609 -802485 -789624 -776545 -777948 -779560 -785998 -787369 -790780 -798393 -807699 -815336
17164 -815336 -829918 -839779 -838934 -843732 -848484 -850443 -857693 -851282 -837548 -834092 -825651 -808356 -799936 -792162
17150 -792162 -781333 -767799 -760537 -762338 -754325 -746426 -735337 -722979 -711265 -702247 -693437 -689190 -694607
17137 -694607 -706013 -721599 -731160 -735688 -745674 -754904 -765166 -778404 -783513 -785953 -781501 -778505 -780421
17124 -780421 -778841 -771049 -773373 -766260 -753730 -751320 -764361 -772260 -777626 -780027 -778158 -778927 -780057 -776389
17110 -776389 -771764 -768676 -767143 -750781 -742710 -742725 -743734 -740850 -737904 -735792 -730291 -723130 -722386 -719752 -710132
17095 -710132 -699706 -699788 -701297 -699117 -697551 -698344 -692153 -686949 -682512 -683798 -685985 -685458 -682451 -675901 -666516
17080 -666516 -670264 -664409 -665791 -663605 -661285 -655784 -654719 -656481 -662005 -663879 -661613 -651536 -647917 -643908
17066 -643908 -650786 -647474 -641499 -635938 -630174 -633964 -631524 -631734 -628553 -632787 -630956 -621213 -620783 -621552 -616112
17051 -616112 -607677 -609719 -612666 -609641 -610368 -606502 -601858 -604581 -607155 -608959 -601392 -590609 -592986 -596256
17037 -596256 -595459 -595069 -593138 -590108 -589781 -583907 -583182 -587327 -592358 -590260 -584662 -579134 -571346 -565754 -570278
17022 -570278 -574316 -569908 -560231 -554086 -558717 -559996 -555332 -551054 -551696 -553844 -550895 -560203 -561465 -558534
17008 -558534 -551535 -545816 -543410 -539885 -540209 -538594 -541342 -545528 -542075 -539366 -535352 -535125 -531141 -529351 -531165
16993 -531165 -529265 -520605 -516332 -520123 -524895 -522475 -517318 -510037 -513350 -520986 -518678 -514467 -508133 -508788
16979 -508788 -512280 -512814 -510629 -515507 -513874 -510292 -512851 -508494 -507606 -500859 -493619 -491116 -492184 -490913 -486594
16964 -486594 -482718 -481608 -484787 -485562 -483674 -483068 -484648 -489724 -487228 -483605 -485902 -485623 -482129 -481288 -480802
16949 -480802 -479752 -472610 -467770 -461255 -455877 -454415 -455342 -454625 -456315 -458152 -459227 -452890 -448007 -451196 -457948
16934 -457948 -457888 -456264 -452988 -451078 -451531 -454480 -448704 -445793 -446395 -447830 -447569 -446112 -441489 -441979 -440831 -441269
16918 -441269 -442675 -433537 -426306 -433145 -433830 -431417 -431595 -428556 -424754 -417326 -422154 -425831 -430107 -434331 -435890
16903 -435890 -438126 -435013 -427417 -418987 -412076 -413823 -416827 -411276 -399476 -400316 -395204 -391301 -399761 -399563
16889 -399563 -402290 -398749 -389850 -397258 -399786 -400720 -407157 -407194 -405590 -408731 -406378 -404788 -403516 -402594 -400946
16874 -400946 -399013 -397768 -398464 -402026 -397373 -392706 -386597 -387441 -384848 -375922 -374681 -371777 -375584 -380189 -376157
16859 -376157 -371226 -369889 -373244 -376413 -376187 -382486 -380347 -375306 -385916 -386863 -380965 -380743 -374804 -365334 -360203
16844 -360203 -360811 -363483 -366231 -357068 -352187 -350509 -350301 -349521 -350237 -355408 -358553 -361349 -366590 -365466 -358093
16829 -358093 -360633 -352725 -345473 -337671 -336640 -337146 -331797 -327993 -326755 -335349 -339211 -338060 -332876 -326465
16815 -326465 -322771 -327155 -331309 -334536 -327949 -329765 -326543 -321564 -324078 -323208 -316508 -308932 -309328 -320845
16801 -320845 -326318 -332575 -327059 -318101 -316608 -318976 -315788 -319491 -327673 -326492 -316780 -308963 -311984 -313031
16787 -313031 -313740 -317389 -316675 -315077 -314781 -320335 -314190 -311108 -311476 -309860 -306242 -304487 -297672 -294891 -294508
16772 -294508 -293967 -292569 -291333 -292148 -297084 -298773 -297227 -297518 -295049 -293098 -291577 -291552 -286381 -281765 -291202
16757 -291202 -292049 -285473 -281748 -284074 -287048 -282273 -282321 -281476 -279684 -286576 -290295 -291276 -285276 -275936 -272160
16742 -272160 -274116 -275699 -271882 -270160 -271788 -266456 -263820 -265264 -266333 -267372 -270765 -262665 -264317 -263142
16728 -263142 -267077 -267316 -264628 -260321 -255711 -257077 -257164 -257951 -259381 -262669 -258446 -246850 -244474 -243024 -244598
16713 -244598 -248852 -252707 -256459 -259778 -254955 -255136 -253235 -246568 -240546 -239549 -240470 -239030 -240793 -240182 -238789
16698 -238789 -239121 -238910 -242059 -243525 -240294 -241273 -236137 -227298 -231798 -234222 -232361 -225008 -227971 -228462 -232347
16683 -232347 -237980 -238346 -231908 -226550 -220027 -215111 -216689 -214531 -219601 -226376 -224541 -222236 -221856 -219229 -219048
16668 -219048 -225793 -223216 -216557 -214187 -211142 -211513 -216065 -216195 -215107 -223426 -225109 -222034 -213446 -205357 -205127
16653 -205127 -204228 -201413 -203978 -203890 -202482 -201634 -207885 -222269 -222993 -216970 -207041 -199228 -196128 -198979 -196899
16638 -196899 -199280 -200686 -198068 -191308 -187036 -187752 -193214 -195215 -194585 -190645 -187068 -182720 -183828 -188278 -185907
16623 -185907 -183690 -188792 -181586 -189729 -198268 -201574 -204625 -205953 -196039 -180123 -182641 -189702 -190853 -192728
16609 -192728 -193329 -187232 -184316 -182342 -178998 -174318 -169713 -165802 -171817 -172953 -173129 -173118 -173162 -172338 -157476 -150208
16593 -150208 -157068 -163859 -164351 -160131 -164663 -170237 -173722 -169630 -166288 -165301 -160151 -154944 -157842 -158508 -161789
16578 -161789 -163533 -159132 -161162 -159368 -157279 -158015 -164643 -171895 -163903 -162470 -173604 -175602 -171663 -159374
16564 -159374 -151365 -143680 -143595 -152279 -159621 -154855 -152190 -152617 -148820 -150648 -154927 -151317 -146909 -147437 -147987
16549 -147987 -142435 -139209 -144669 -150793 -158926 -152412 -151363 -148674 -141554 -143420 -146241 -144931 -141953 -144090
16535 -144090 -144313 -142474 -142868 -135744 -133203 -135237 -133596 -130869 -122286 -123532 -120003 -125266 -125046 -116194 -116150
16520 -116150 -123871 -129919 -134707 -137699 -137223 -136221 -137475 -129338 -124855 -118763 -118621 -121520 -125939 -128170 -124625
16505 -124625 -115036 -112276 -114485 -114908 -113875 -118449 -118945 -121384 -124552 -124013 -111587 -100556 -102319 -107667
16491 -107667 -110004 -110369 -104773 -101225 -109308 -112453 -111174 -111940 -111708 -114605 -116392 -115598 -116181 -109474 -102080
16476 -102080 -101740 -102120 -101969 -103612 -98096 -91812 -100496 -104504 -104358 -100157 -102895 -107055 -107114 -107517 -106801 -100500
16460 -100500 -98078 -99078 -100799 -95479 -92150 -91860 -87160 -81643 -82455 -84167 -85128 -81276 -80657 -79043 -80064
16445 -80064 -82403 -86012 -92750 -90312 -94220 -94504 -91419 -94537 -91347 -84368 -82771 -85029 -81977 -72864 -76432
16430 -76432 -82984 -84372 -85495 -86110 -82926 -71202 -66031 -73548 -77478 -82940 -81419 -84029 -83407 -81208 -81675
16415 -81675 -80843 -76442 -75758 -69356 -66916 -68018 -60258 -54796 -61567 -75836 -81453 -75514 -68960 -60426 -66893
16400 -66893 -67113 -60839 -57451 -59784 -62331 -68010 -72106 -66738 -56643 -48504 -46727 -46971 -48125 -46468 -52487
16385 -52487 -68717 -72356 -66497 -59593 -63888 -59053 -56735 -53993 -50413 -56298 -56222 -52965 -52439 -51500 -45182
16370 -45182 -47259 -49609 -47548 -45095 -45633 -41818 -38077 -36933 -40975 -52457 -55768 -59654 -55065 -48211
16356 -48211 -42100 -40266 -36474 -32395 -30877 -43662 -47788 -46614 -42943 -44258 -47509 -40408 -25978 -29253
16342 -29253 -30948 -31690 -30238 -31160 -33502 -28547 -30879 -29163 -25319 -26573 -29606 -36522 -41429 -37549 -32166
16327 -32166 -31033 -33276 -36196 -38619 -33998 -21931 -22701 -30348 -27867 -27681 -37565 -30446 -22837 -18644 -13341
16312 -13341 -16465 -18845 -24341 -26399 -21975 -16684 -12951 -15674 -12856 -7779 -6518 -14725 -18645 -23297
16298 -23297 -28588 -32163 -27852 -16148 -11864 -9276 -14095 -10097 -9265 -14770 -12703 -12141 -16436 -17218 -10052
16283 -10052 1120 958 1468 -1513 -8867 -11313 -8421 -1117 456 1354 -3114 677 892 -1531 979
16268 979 8568 12499 7360 -3611 -825 7777 6263 -1531 -4915 -15047 -11390 -660 1263 6741
16254 6741 11762 12644 5885 2833 4538 1875 3753 1712 4860 3843 -2747 -1355 3338 806 433
16239 433 9726 13496 10717 6336 10417 5663 8184 14711 25267 30269 21198 13689 19938 19498 18190
16224 18190 19349 20597 25595 27286 28010 26038 25541 23703 23471 25139 30322 28796 20720 21725 20449
16209 20449 20035 25597 30767 32521 34025 37724 34620 30618 33751 31468 28811 27299 29700 31986 24521
16194 24521 19879 20920 19860 29622 33092 29515 28935 31418 31414 34131 32760 29979 33735 34848 35006 20636
16178 20636 16040 21126 26544 26567 26587 34246 39742 38264 31273 27935 35197 44342 42068 40406 43475
16163 43475 44757 47502 51264 50639 44614 45867 46872 41197 40549 42664 41777 36582 41531 49233 51712
16148 51712 47668 46867 47973 56659 58858 58615 62580 59797 55571 53805 52837 53893 59243 56210 55135
16133 55135 51925 50661 47428 50185 48949 52150 51574 47586 54587 64978 67666 62897 58907 59707 63833
16118 63833 62927 58810 63087 64185 62184 57493 52949 52295 54991 54812 62604 70258 64481 61816 64066
16103 64066 65427 67904 64409 60889 59723 66758 61961 67791 73212 66730 59656 59263 60634 63564 67291
16088 67291 65745 63804 65365 74513 78866 72383 69936 71327 72686 71165 67610 63973 61549 65363
16074 65363 65908 70020 65797 63806 64411 71002 71301 65207 67037 68125 73790 76520 82170 85410 91289
16059 91289 87998 82342 84699 81901 81613 84916 85009 85832 83870 82266 87363 97056 94510 89812 85901
16044 85901 84859 83904 87409 85123 82212 85679 87987 93881 98244 101972 97570 96865 95299 94056 99189
16029 99189 98101 100607 98665 94983 87848 84240 88770 91370 94441 94412 96307 99093 94230 99555 101536
16014 101536 110285 107288 99058 98710 101756 93625 94878 106482 112557 105950 101637 105825 111055 114441
16000 114441 107490 104395 101336 100614 105711 107541 112448 115218 114886 115209 113410 120899 118946 113584 117964
15985 117964 116646 111990 112708 111724 109385 108726 111004 118136 120755 115349 111581 109103 108098 113260 118159
15970 118159 115251 112333 110785 108983 112489 116083 121085 119144 119045 120574 117663 111740 108027 110536 109661
15955 109661 109144 113825 122472 130429 122813 114340 117499 123518 128036 128718 125115 121367 126201 127971 130996
15940 130996 127280 127024 127694 120658 121603 130400 135317 131907 136311 133387 131359 133074 133745 132215 133853
15925 133853 131605 129429 137408 132337 136944 138579 137453 133306 132712 133441 133134 142477 142625 140498 141590
15910 141590 143114 140598 145757 150214 149260 150125 148766 145002 142905 144818 140672 142624 139832 138239 143877
15895 143877 142007 146079 142238 132610 137420 141256 138374 135077 135080 140159 143048 143324 141999 148510 150454
15880 150454 156196 157139 152121 153410 150148 151520 152175 153924 159908 156169 155731 156132 151894 157513 153927
15865 153927 149463 144086 143002 148614 154921 155165 152234 152796 154353 150651 154076 160223 165211 168345 168782
15850 168782 164405 166500 168372 170579 165421 171294 163674 159294 168584 175018 176822 171867 171098 173569
15836 173569 170948 164595 163009 168577 168264 165594 164761 166499 164337 162105 172054 177487 178584 177384 176858
15821 176858 174300 170716 166823 169689 173385 179111 180726 174637 170801 167043 168569 173233 171706 166559
15807 166559 169741 175235 177137 175582 174295 169578 162911 162015 164768 163488 174957 180743 180828 181871 179466
15792 179466 176553 178176 176716 176691 177790 179446 178616 181254 187887 186291 173792 171995 173556 177658 183819
15777 183819 189979 192479 190909 187053 190972 197567 203927 199078 190380 185453 185571 185131 184258 191681 195192
15762 195192 194994 194002 195919 196474 198595 200927 201412 202054 203971 202651 201831 200629 203591 199431 196669 194864
15746 194864 193845 191168 195316 203208 209882 204833 204499 205514 200967 198550 197483 200417 203208 206982
15732 206982 205861 211025 214799 213898 213839 214702 211343 206117 206739 204705 200081 196280 204138 207427 207254 207836
15716 207836 210404 215814 216373 220175 220964 220038 220756 223778 221429 231288 241979 239181 236261 238319 240307
15701 240307 241991 243505 237228 230786 221956 206345 189345 186532 184452 185200 184329 183430 186045 190903
15687 190903 194254 192720 189955 189423 194278 193902 202541 207545 210660 213477 215792 218602 216902 209855 211524
15672 211524 216500 217805 218867 214344 206912 214242 214538 216797 219563 215641 214851 213261 216817 218806 217835
15657 217835 219939 220828 222926 224610 227642 229878 227663 227553 231233 231072 225607 221368 223611 230929 236175
15642 236175 231816 224429 222823 228802 232482 229017 225750 226555 226287 229499 230048 225238 226957 227666 230081
15627 230081 226604 225632 230641 228605 234478 234289 226735 225631 226145 222318 221739 224923 221806 216835 218102
15612 218102 224759 230529 227920 233162 230891 232458 236665 240198 244365 246088 243159 244510 243561 243413 241693
15597 241693 244637 246818 241868 234995 241773 247923 251499 248221 251787 253952 253604 256175 252754 249603
15583 249603 249428 246822 240372 243242 247342 253258 253358 249941 260568 267011 264942 261730 259611 260919
15569 260919 257043 248707 243098 239836 247868 254712 258268 260587 254778 249658 253830 258461 261130 260839
15555 260839 262229 264967 263091 259502 253278 256743 264134 268565 265846 261346 257785 251457 253468 256744
15541 256744 265445 268508 265408 258177 254678 256115 259215 258934 254395 254498 254542 246542 246956 259160 266961
15526 266961 271806 279218 276617 273406 279967 274786 274266 267530 268132 265599 266705 265998 268803 277260 280927
15511 280927 275567 273431 280308 280796 275525 271394 272991 277906 272140 272362 269742 268844 267159 269672 274403
15496 274403 277284 272062 271403 279107 278528 280113 287437 287732 280867 286512 283312 275839 272372 274912 280641
15481 280641 285838 285152 285665 279225 277264 280297 285359 293268 289614 287493 281948 282280 280264 286463 295459
15466 295459 297661 293272 286455 283937 282238 283590 287945 290842 294611 295481 297535 301871 299163 303441
15452 303441 296414 296811 298912 297169 295042 295816 292934 298296 298432 294730 294876 291499 297380 302586 302987
15437 302987 298823 297400 302117 299013 296867 297175 298168 299008 296511 297742 301375 297660 298577 302746 302602
15422 302602 305729 299643 301977 303018 306911 311036 312292 311580 310187 311347 314835 312849 313677 318111 315147
15407 315147 314252 316628 318217 319284 324167 325546 329601 326656 321613 314987 310710 310366 314001 316266 316122
15392 316122 317157 315003 311622 312152 315167 314598 308584 309006 314811 324443 323728 323889 325335 323037 321758
15377 321758 320478 312033 312008 315355 314464 316266 316447 323843 328028 332768 339598 334837 331208 336303 338925
15362 338925 334677 330338 332763 336142 334250 333889 334699 328702 330027 330587 329004 322162 320937 330896 333456
15347 333456 333447 333864 326722 322873 329080 329133 328031 327858 319942 316662 322425 323696 329450 336471 335685 334563
15331 334563 330477 325329 330391 337990 341258 335297 334003 334593 338494 342528 342463 341774 339312 343671 347828
15316 347828 346900 347620 347794 343835 340293 341098 343092 345231 349014 348538 345642 342281 352976 356257 351135
15301 351135 349951 354460 346712 339340 345566 354971 359691 362163 357814 354759 355124 350649 349380 354971
15287 354971 354286 351307 350543 350724 350576 351171 358332 361320 359863 362270 355599 349240 355086 358008 354212
15272 354212 356726 360453 361286 362297 359028 356609 355399 353780 357954 359929 363230 365655 363862 367590
15258 367590 377241 374534 375092 372140 371734 372330 368870 369808 372573 372604 375662 373744 369185 369944 370422 376948
15242 376948 380805 374433 375657 369707 366554 367542 372144 376023 375453 377960 380216 380112 378085 385309 384940
15227 384940 383593 387099 391726 392101 383652 376131 381126 379033 371987 378114 376663 375300 384658 389395
15213 389395 388276 392904 394620 394546 389556 387526 385223 386679 389949 392786 391264 384899 380820 391171
15199 391171 394179 391382 393003 391810 387050 389451 394170 393435 386765 388224 387703 388655 398420 403506 404906
15184 404906 408996 415396 415617 412969 414885 415018 411682 406955 408341 405930 404946 405362 405750 401868 398285
15169 398285 395962 395800 402951 408027 404735 403771 405726 411079 410715 407544 408252 407969 410888 414011 416822
15154 416822 422839 425214 418121 411228 413718 417671 418908 414725 415343 414064 413887 416067 418181 419064 419807
15139 419807 423307 421024 421200 424288 423142 422147 424773 418975 423849 422921 421144 417567 424409 430181 432699
15124 432699 432677 436866 446244 450858 442711 441318 441694 438891 436970 435906 439903 447192 436243 433694 428937
15109 428937 430222 440238 443620 438182 440770 442443 443925 449273 450972 452192 455321 449661 445496 444549
15095 444549 442969 439518 437291 447882 449934 451938 454242 452044 453559 457434 462145 466667 463017 463810
15081 463810 461659 458338 454154 452602 455872 458409 457898 458750 460499 460702 458548 456903 460255 455951 462062
15066 462062 474030 476937 472747 471584 467115 472252 473942 473651 479990 482981 483831 487989 484312 483561 483239
15051 483239 488498 499117 500855 501356 498779 494812 502297 499264 505289 515260 518640 525635 530485 536140
15037 536140 534903 536659 538356 538832 539131 542586 543232 540322 546849 547791 549057 554447 559765 558617 553767
15022 553767 556332 563564 562706 562076 563648 574374 579000 582734 584836 591207 595034 603571 608204 614472
15008 614472 625432 631832 634091 641771 647849 658356 671845 681628 689899 705106 722708 741942 768473
14995 768473 792211 813776 832945 848421 882546 930608 984471 1033001 1088210 1162719 1263537
14984 1263537 1388160 1544065 1756864 2022945 2275019 2267411 1466566 -303847 -1411378
14975 -1411378 -1415037 -1120304 -855363 -656421 -509540 -398972 -309711 -238366 -177315 -125914
14965 -125914 -83961 -51987 -21143 8656 36629 61260 78136 96796 114772 132416 148891
14954 148891 162475 174828 184007 192370 196516 197058 208585 222990 231888 235887 249082 258833 258604
14941 258604 259416 270350 280138 286285 296395 296967 295509 302182 305368 307127 309259 313600 323786 321705
14927 321705 319075 327204 330521 334835 336753 340331 342269 344112 347737 350763 353928 353201 346284 352335
14913 352335 355251 354242 358638 359476 365397 370952 372052 373651 374491 371566 370486 375469 369914 372323 375964
14898 375964 381722 388816 390249 392493 391325 393663 397567 394799 393404 396871 395807 397792 396415 398518
14884 398518 403226 405421 408493 407682 407253 405610 406200 408853 404286 398674 397528 404584 416989 415063 410772
14869 410772 406720 408625 413030 408870 418126 425043 429347 422102 419029 417640 418341 425868 435149 437734
14855 437734 433735 437092 437589 436483 430308 425009 425396 425603 429492 433946 432045 433312 430185 429105 425133
14840 425133 431724 434358 436540 432776 432292 436623 436533 436078 429186 432495 432515 435527 440368 440443 440906 440997 437150
14823 437150 436331 440693 444805 446144 445711 445569 443094 446252 452732 455053 456652 452510 457594 461747 458490
14808 458490 459478 460096 459305 454831 453672 459215 463367 461866 462829 467727 465910 464409 464685 466814 461493
14793 461493 455168 461274 461464 463195 465505 472122 477934 480608 477619 475655 474564 472212 463232 469949
14779 469949 471577 470966 471159 474092 475482 476239 481403 478401 477423 473194 479172 477964 479657 482872 482636
14764 482636 477523 484252 482987 486439 489431 482137 479947 488544 488596 486835 482297 479827 481538 479950 483758
14749 483758 486986 483795 482871 478912 488476 488533 489682 486101 485282 481785 481512 480748 486653 490853 491167 497930
14733 497930 498365 495301 493364 492213 498316 502120 503419 503174 499759 504152 504152 501134 506344 506941 508720 501960
14717 501960 497525 498934 499570 495688 500649 508032 517217 521476 517487 515777 513315 508864 506752 509999
14703 509999 509835 512114 517042 519216 523040 515631 509448 514037 514289 512001 511454 514635 513946 514002 516882 515944
14687 515944 514028 521777 534946 536393 532206 524045 521630 521827 523597 519823 517304 516972 519884 524673
14673 524673 529252 527610 521045 525171 531734 533558 526899 518228 521034 524809 528590 534415 530960 524215
14659 524215 523136 528661 525865 526316 521678 526949 532446 530976 526939 529137 530595 538342 535173 530585
14645 530585 532727 538328 535863 534742 529351 538605 546131 544145 543183 545229 547797 548937 545721 540303
14631 540303 541581 542993 544925 543824 543249 542395 546177 543708 543698 544012 547319 541818 537278 544132 551567
14616 551567 552526 548420 546158 543774 544102 548076 555944 566620 562379 555195 550601 553419 564491 571433
14602 571433 578015 575037 565097 567544 566931 568924 562156 558202 563397 561057 551723 552212 558416 564915 569332
14587 569332 575181 573099 570921 573617 581000 583859 583422 579906 573365 574950 578160 581086 573401 572537 571805
14572 571805 581350 586744 584601 578639 581380 581784 574726 571741 566978 565687 568214 567217 570558 568728 564065
14557 564065 571989 573127 569912 574394 582283 579985 578997 572298 570050 570093 573545 577092 578204 576128 580905
14542 580905 589286 585767 592373 596523 594600 598187 601598 600412 596744 598739 607910 605961 603951 602476
14528 602476 599988 598483 602793 609804 606746 604647 598650 594839 595882 588132 580413 586039 594840 604733
14514 604733 609008 606144 601407 592818 589711 594754 594623 592083 594961 599420 603091 601701 599174 602363
14500 602363 608526 611652 614133 617318 606379 601404 596510 594901 601842 608591 603192 603043 606782 611489
14486 611489 611729 612089 615971 617387 615469 612203 609344 609264 612763 615705 624795 618045 618137 618149 616267 613470
14470 613470 613596 619911 622864 621235 623779 623100 625510 628177 627325 630577 628717 626869 627630 628608 622852
14455 622852 621201 621472 620207 622142 634478 636328 639709 634367 629539 623622 625520 625949 626648 627852 630660
14440 630660 631386 633092 636011 632808 629936 630760 631547 640218 642952 637254 640448 647894 653010 651991 649832
14425 649832 649544 651738 649171 652946 657496 656724 657796 657025 650408 653395 658101 663951 661812 660163 656167
14410 656167 653641 651237 648011 650552 647679 648573 656495 657228 652575 652078 650887 655453 662971 664511 660609
14395 660609 664899 665153 660159 656032 662398 664541 659645 663942 666671 665300 665710 665043 662870 665841 666348
14380 666348 667344 662947 663729 668045 667192 668149 672568 679457 682220 681764 684098 688289 686164 683915 686576
14365 686576 681086 676095 675050 676540 680646 683861 680881 682212 677184 668645 671468 674972 680440 683914
14351 683914 684300 682469 680444 681185 687688 687016 682548 683852 689363 694083 699697 691457 685428 695389 701031
14336 701031 705155 705779 702861 702324 699377 695256 693528 699883 704072 699307 694902 692191 699039 702253 699934
14321 699934 697507 696930 700495 701816 703813 705588 705313 707105 705218 705312 707526 703271 700434 703871 701112
14306 701112 697125 695367 697138 704913 706461 706926 708529 708426 706610 710320 717094 725109 715745 713910 719022
14291 719022 720606 723958 727178 730124 733495 734045 726581 721580 722876 724060 725846 727651 729931 724458
14277 724458 725144 728688 728982 730940 723187 718512 710197 713261 725904 725783 727518 727570 731901 732643 731924 734826
14261 734826 740646 740368 739710 740295 743750 746902 738896 730256 730704 733565 733820 730564 734215 747164 754739
14246 754739 760355 755775 749528 742183 738682 731797 727720 731950 740961 743349 743355 743876 746863 753758 761890
14231 761890 761408 756850 758932 758607 759770 761379 756897 755431 749806 746095 746975 753900 760438 762388 767376
14216 767376 770330 770683 768351 763573 761328 768660 775045 778815 780241 779957 770683 773148 775854 775936 774881
14201 774881 774635 770854 769173 773185 770645 773546 779489 775582 776277 779190 779816 788366 796281 797101 792608
14186 792608 785730 783041 783264 778652 780631 779375 776974 778084 781297 784275 793697 794608 795266 799123 796304
14171 796304 791837 796404 795156 791978 796033 799606 802979 802386 802850 807123 810898 811220 811320 811422 811498 810358
14155 810358 808132 803438 805263 805756 803145 800604 798189 799492 801992 810811 819212 813368 811638 815760
14141 815760 809330 807888 815209 819022 815592 817171 819927 819080 819573 825265 830036 827847 824142 829189 829723
14126 829723 827021 829357 832583 833876 829650 823568 824526 824096 822799 822768 824429 831042 841366 845466 845230
14111 845230 842280 842330 843770 844416 842686 838399 835322 838144 836693 838391 847420 848823 853893 853285 847380
14096 847380 845137 846036 851786 850606 851189 850874 849210 850188 848221 853910 852724 855060 858948 860926 857998
14081 857998 864472 868928 876363 874329 865099 859170 863531 870571 867260 867935 864897 867444 869085 867361
14067 867361 869497 875236 877831 872716 872855 870529 863489 856821 862970 864433 863299 871818 879043 873441
14053 873441 878041 884038 883489 884251 883772 885236 882191 880155 876314 881082 880410 878483 877462 879154 881761
14038 881761 888075 895103 896992 899925 907493 905923 901907 898657 902792 907982 903637 898495 898637 900878
14024 900878 899540 898520 893645 898362 902460 910158 910345 907798 909874 917267 921536 923165 925716 927425
14010 927425 932152 932421 928996 928920 928172 927183 924835 922262 926200 923519 927411 927106 933141 934490 927087 930853
13994 930853 938523 942199 942550 937164 933144 930917 934690 939818 940152 939241 940605 940653 942728 940354 941632
13979 941632 935699 933264 935236 939641 946161 942504 938491 944782 953881 951091 951728 957449 957900 962390 966488
13964 966488 964666 967177 964578 970892 971509 966610 957057 959140 960408 952515 943236 942799 953497 958622
13950 958622 962638 958103 963607 964988 961635 961406 959343 960629 965516 965341 968309 968309 972584 971594 974392 973282
13934 973282 977003 985239 991044 986961 982833 985725 988519 992093 989767 987150 988496 992963 993367 993593 997693
13919 997693 995179 1001473 1007581 1004833 1002575 1003051 1005002 1004923 1005300 1009046 1010551 1013624 1020383 1016718 1010472
13904 1010472 1011247 1020035 1020483 1018751 1019885 1030048 1031139 1026623 1024537 1025108 1029533 1027575 1029122 1027436
13890 1027436 1020101 1016217 1026214 1033945 1038701 1042976 1041637 1036513 1032947 1040273 1046266 1048203 1049524 1048822
13876 1048822 1050139 1044550 1044899 1038143 1035773 1043434 1050474 1058599 1065327 1064485 1058710 1056294 1053439 1052466 1059751
13861 1059751 1060190 1057808 1059112 1065704 1069834 1073564 1073437 1077575 1080601 1083095 1090535 1086021 1087263 1088462
13847 1088462 1085587 1089441 1092528 1096381 1097449 1094659 1089490 1093933 1089140 1088021 1097595 1100440 1093762 1094550
13833 1094550 1098375 1101163 1103135 1108846 1114206 1118051 1128041 1124848 1119132 1111475 1107544 1112540 1122692 1128872
13819 1128872 1130704 1125099 1118637 1127034 1132569 1130210 1129085 1124266 1123718 1128861 1135757 1143748 1145570 1149637
13805 1149637 1147364 1140881 1136084 1128408 1129922 1136811 1145972 1150983 1164619 1164514 1166180 1169063 1160854 1157526
13791 1157526 1160268 1162029 1166526 1173936 1173254 1171278 1169959 1177278 1174506 1173357 1172107 1172121 1176731 1178497 1175658
13776 1175658 1176088 1180202 1185584 1191710 1198035 1191078 1194048 1190762 1188293 1188415 1192603 1201794 1203983 1209162
13762 1209162 1212462 1214572 1217683 1208608 1200834 1207885 1217417 1218082 1219568 1219725 1216016 1220268 1221295 1220838 1222859
13747 1222859 1229460 1230426 1229214 1238045 1234722 1237719 1243589 1240499 1231942 1236110 1244963 1251913 1255295 1263162
13733 1263162 1271954 1268291 1266606 1268231 1262894 1255277 1257638 1261610 1259679 1254769 1257345 1261737 1268088 1271111
13719 1271111 1271315 1275698 1278996 1282402 1285398 1285704 1288197 1288284 1290272 1291638 1289932 1295853 1300512 1299731 1297442
13704 1297442 1301348 1301240 1300793 1301492 1303407 1303175 1303469 1299486 1305276 1316824 1324306 1326555 1326309 1330475 1332651
13689 1332651 1336434 1342128 1350890 1346436 1347045 1345645 1346906 1349269 1350011 1352208 1351817 1356460 1362079 1366680 1368843
13674 1368843 1372196 1375786 1375222 1381176 1384008 1386467 1396394 1406864 1410778 1417170 1423019 1425540 1433341 1444365
13660 1444365 1441315 1434952 1434497 1437716 1440972 1449213 1460522 1470592 1489310 1499021 1501884 1502493 1493319 1471994
13646 1471994 1441394 1411728 1392520 1377349 1370749 1371238 1372501 1382776 1392914 1400076 1411571 1424600
13634 1424600 1434598 1439822 1444691 1449958 1452984 1457995 1465030 1469262 1480426 1487247 1489394 1494803 1504024 1506961
13620 1506961 1518373 1524442 1534566 1544692 1558557 1575201 1581324 1594569 1612135 1635243 1653263 1653878
13608 1653878 1632932 1589234 1527611 1456299 1395545 1353209 1336871 1338579 1347808 1366311 1386492 1400245
13596 1400245 1414054 1428923 1432914 1436411 1451211 1462207 1466315 1469040 1480694 1480926 1484008 1492487 1506815
13583 1506815 1517103 1519244 1524519 1528049 1528390 1535237 1545454 1551289 1567247 1580318 1594614 1611215 1620696
13570 1620696 1625377 1628062 1616905 1605854 1575983 1543692 1521013 1498055 1491390 1491512 1496073 1510195
13558 1510195 1518905 1527459 1534054 1538534 1549730 1555396 1560647 1569491 1573864 1583057 1585300 1591581 1597482 1604321
13544 1604321 1611502 1620154 1625825 1628805 1630664 1633416 1639376 1639196 1642765 1646076 1651878 1658385 1662646 1666133
13530 1666133 1671507 1674230 1673690 1675942 1685620 1699412 1705102 1713651 1715147 1714865 1716516 1719367 1726462 1734824
13516 1734824 1735345 1736768 1742357 1750195 1752525 1759731 1763411 1768519 1773472 1776810 1781399 1785921 1792285 1795903
13502 1795903 1798963 1802700 1808367 1817063 1827119 1832641 1834606 1833612 1837474 1836827 1839091 1844785 1847215 1855745
13488 1855745 1863019 1858052 1864927 1880376 1885600 1883457 1886595 1892031 1905813 1912238 1913945 1919393 1925543
13475 1925543 1930349 1930906 1936068 1944761 1943238 1946748 1951308 1957365 1965766 1977861 1977814 1977021 1979184 1984989 1984349
13460 1984349 1999007 2016166 2033537 2037329 2039628 2046840 2054724 2061710 2062317 2066282 2072135 2073803 2077227
13447 2077227 2077236 2078600 2080194 2081460 2086131 2094369 2096508 2096405 2106946 2120182 2130002 2131948 2135102 2139707
13433 2139707 2149804 2160209 2167848 2179763 2187668 2189784 2190633 2188539 2199474 2215027 2227456 2230302 2236626
13420 2236626 2243435 2251604 2266912 2276345 2283016 2290863 2298276 2309799 2322128 2332146 2339727 2347400 2347185
13407 2347185 2346717 2343176 2340353 2347216 2351116 2350937 2354519 2359485 2366445 2384621 2396111 2402399 2406059 2407677
13393 2407677 2416037 2429581 2442853 2455526 2462573 2474045 2478449 2484786 2492723 2500175 2508412 2519535 2534550
13380 2534550 2542870 2559228 2571763 2580301 2590277 2604332 2617680 2630883 2641900 2655178 2667812 2683448
13368 2683448 2690737 2692349 2701854 2713459 2719065 2724212 2731175 2742329 2753121 2768348 2782408 2794362
13356 2794362 2811863 2824487 2830293 2833294 2845373 2861453 2874607 2882839 2894690 2905630 2911542 2925113
13344 2925113 2944792 2959509 2976166 2997963 3025708 3042657 3053332 3064781 3081429 3095638 3107903
13333 3107903 3122988 3147897 3164118 3179494 3197395 3214368 3223842 3240858 3264103 3275635 3286900
13322 3286900 3297587 3307646 3316063 3335917 3357480 3377384 3395217 3410728 3432918 3449876 3473091
13311 3473091 3508192 3529445 3541677 3553702 3567237 3586989 3619399 3654403 3685237 3702332 3720817
13300 3720817 3750381 3771399 3791836 3814927 3834257 3866125 3895719 3927940 3957218 3981434 4004861
13289 4004861 4031153 4054574 4082014 4109831 4142747 4175058 4211877 4244327 4272785 4301569 4320969
13278 4320969 4347848 4384461 4426769 4464909 4502592 4544920 4581728 4612678 4649647 4693184 4736465
13267 4736465 4783755 4826328 4870801 4915753 4970982 5026078 5069224 5110075 5151076 5191839 5231270
13256 5231270 5277709 5329978 5387064 5452356 5511059 5572116 5642795 5708531 5778077 5847457 5916275
13245 5916275 5991741 6071053 6154275 6235669 6321427 6409305 6495264 6590494 6683244 6779021 6877209
13234 6877209 6978538 7085936 7196264 7303057 7422693 7557087 7691665 7828494 7977804
13225 7977804 8136356 8300149 8470131 8654600 8847916 9050873 9271769 9492140 9724217
13216 9724217 9970996 10233110 10528525 10851627 11208747 11606078 12031346 12494637 12997606
13207 12997606 13554428 14179370 14891242 15709047 16661561 17761544 19027151 20493946 22134903
13198 22134903 23818827 25143672 25350702 23471162 18842934 11848405 4039835 -2656569
13190 -2656569 -6889323 -8480656 -8175299 -6905708 -5355675 -3837467 -2441061 -1173633
13182 -1173633 -24821 1020443 1987570 2880591 3713845 4520142 5325345 6143065 6971762
13173 6971762 7825044 8717763 9650240 10622800 11635999 12701029 13853305 15122654 16572095
13164 16572095 18233537 20138901 22351963 24916753 27900339 31281959 34808267 37683669
13156 37683669 38282368 34399891 24475061 9141368 -8168147 -23099982 -32449534 -35744434
13148 -35744434 -34796034 -31857468 -28472124 -25339835 -22609312 -20263929 -18240476 -16486288
13140 -16486288 -14960581 -13621220 -12428038 -11328521 -10281072 -9281113 -8325616 -7388553
13132 -7388553 -6482163 -5596898 -4732536 -3877036 -3015056 -2147097 -1244678 -277964 779754
13123 779754 1942987 3222927 4662142 6277512 8030811 9784637 11114665 11228508
13115 11228508 9122922 4160863 -3272751 -11557801 -18619697 -22987680 -24484284 -23973788
13107 -23973788 -22519002 -20848056 -19274958 -17891975 -16704951 -15679640 -14789868 -14023547
13099 -14023547 -13348227 -12750360 -12213366 -11711555 -11230899 -10787291 -10385715 -10015999 -9691174
13090 -9691174 -9398310 -9124927 -8868128 -8627126 -8385971 -8156326 -7935379 -7727061 -7526701
13081 -7526701 -7340659 -7163534 -6990122 -6827916 -6680816 -6547166 -6421954 -6296496 -6167934
13072 -6167934 -6041569 -5921655 -5800666 -5698534 -5598157 -5505907 -5410563 -5318516 -5229237 -5149309
13062 -5149309 -5068126 -4981117 -4906413 -4839647 -4772701 -4710388 -4647490 -4582302 -4518689 -4458074 -4401620
13051 -4401620 -4349852 -4299423 -4253530 -4200051 -4140422 -4078367 -4020487 -3965015 -3912579 -3856840 -3807987
13040 -3807987 -3761412 -3721708 -3682466 -3646191 -3596037 -3545676 -3503075 -3463303 -3421569 -3371780 -3330268
13029 -3330268 -3299791 -3271463 -3243317 -3216056 -3185566 -3160340 -3128865 -3097322 -3066645 -3031892 -2994798
13018 -2994798 -2974567 -2948030 -2914824 -2887827 -2857355 -2835218 -2816433 -2789448 -2752871 -2727536 -2704408
13007 -2704408 -2676486 -2651439 -2617947 -2582172 -2550556 -2531976 -2523991 -2511551 -2494696 -2477247 -2454171
12996 -2454171 -2426027 -2400953 -2378227 -2358968 -2338073 -2316723 -2292648 -2273183 -2254462 -2238061 -2219478
12985 -2219478 -2201206 -2179394 -2164542 -2149369 -2135842 -2116915 -2101521 -2087982 -2074050 -2056965 -2037484
12974 -2037484 -2017729 -2001377 -1992042 -1983938 -1971458 -1953057 -1938186 -1914543 -1892384 -1871310 -1854657 -1838063
12962 -1838063 -1828396 -1819299 -1814126 -1799049 -1789918 -1785787 -1771704 -1750763 -1732867 -1717283 -1705297 -1694367
12950 -1694367 -1679682 -1652591 -1642176 -1623188 -1615961 -1606945 -1588884 -1576946 -1566978 -1557696 -1546901 -1542534
12938 -1542534 -1537878 -1526129 -1515158 -1511720 -1500735 -1486377 -1479898 -1472114 -1472829 -1463870 -1452894 -1436309 -1408341
12925 -1408341 -1399383 -1390117 -1382520 -1380652 -1368773 -1357549 -1349322 -1341205 -1336319 -1316517 -1300137 -1289260 -1281661
12912 -1281661 -1273444 -1260434 -1253940 -1253084 -1241700 -1235699 -1224635 -1214994 -1207742 -1196253 -1183836 -1185240 -1180003
12899 -1180003 -1163367 -1147984 -1145915 -1143278 -1138871 -1130510 -1121173 -1109722 -1099871 -1089527 -1079804 -1072839 -1071056
12886 -1071056 -1067698 -1058470 -1048462 -1047427 -1043821 -1038713 -1036418 -1033161 -1024901 -1009767 -998749 -983497 -976437
12873 -976437 -971897 -960081 -957915 -955160 -950828 -945010 -936321 -931469 -917159 -906831 -900839 -904100 -897287
12860 -897287 -891046 -888710 -882384 -875380 -865195 -857523 -846768 -841312 -829675 -819768 -815423 -815413 -814050 -811099
12846 -811099 -814396 -818150 -811060 -801284 -786992 -777712 -768799 -764912 -762634 -759006 -750220 -748466 -744005 -735768
12832 -735768 -729426 -726135 -724844 -722113 -710288 -702806 -697660 -697349 -690140 -685527 -683729 -680945 -677820 -672003
12818 -672003 -667302 -666886 -661396 -661173 -654591 -639525 -627732 -620499 -624061 -628855 -627247 -623309 -620854 -619165
12804 -619165 -617883 -604782 -598476 -599921 -596807 -588700 -585658 -579049 -572936 -569506 -560185 -556939 -557887 -556082
12790 -556082 -555863 -545713 -542371 -533286 -524857 -514263 -507931 -505800 -506019 -497563 -492423 -491267 -491580 -497624
12776 -497624 -493570 -482339 -476832 -469537 -460216 -454092 -454268 -445395 -447251 -443964 -438409 -431563 -430862 -425520
12762 -425520 -420621 -424516 -418950 -411071 -401025 -395437 -394025 -385333 -377710 -374218 -377180 -375475 -371928 -367729
12748 -367729 -357533 -352122 -349065 -344970 -337254 -329029 -324934 -318085 -304678 -290025 -279771 -277374 -269930
12735 -269930 -260936 -264522 -280401 -305933 -345728 -376515 -394538 -401288 -397514 -391431 -384843 -369456 -356338
12722 -356338 -351141 -343406 -334322 -323185 -313015 -313966 -301953 -292098 -285162 -279456 -273779 -260244 -254662
12709 -254662 -247081 -240383 -234056 -233606 -230388 -223986 -215598 -204267 -179467 -160436 -146840 -129914 -119157
12696 -119157 -109390 -103530 -118773 -154610 -214521 -282241 -348747 -387755 -408605 -410915 -400511 -385078
12684 -385078 -367785 -347508 -330815 -312783 -298618 -289150 -293384 -290260 -278125 -264154 -261424 -250258
12672 -250258 -241048 -234468 -229035 -227799 -225869 -212933 -202917 -198555 -194852 -187385 -178960 -171585 -167363 -165703
12658 -165703 -160200 -148191 -133864 -129996 -133553 -150950 -179842 -209204 -240206 -257643 -263765 -265786
12646 -265786 -258693 -242048 -234674 -230890 -218288 -203891 -201608 -201182 -195326 -195988 -191536 -184006 -178241 -168629
12632 -168629 -165065 -157317 -153352 -150349 -149517 -140154 -129314 -126646 -128683 -128824 -128806 -127851 -120767 -115248 -109939
12617 -109939 -108940 -107807 -107424 -113205 -114388 -108459 -106130 -103674 -98863 -92355 -86739 -86871 -92247 -94285 -92992
12602 -92992 -86680 -75344 -77033 -80317 -76632 -72538 -68449 -66746 -63012 -59818 -60884 -55347 -47986 -47311
12588 -47311 -46713 -40614 -35194 -31869 -29128 -23681 -26930 -23723 -21393 -28262 -23691 -18362 -14796 -14936 -8889
12573 -8889 -8414 -6816 -5035 -3664 -4557 1358 2996 2042 8784 6986 2112 7369 10080 15551 13973
12558 13973 11950 16674 26776 31091 24574 26656 32861 37115 34714 42435 46632 51358 48852 48772 48431
12543 48431 44693 48745 50215 58217 62831 57019 50964 53406 53652 56166 58773 65434 69996 72371 78425
12528 78425 80244 79886 78231 80608 76320 77504 80332 81074 79591 89755 98373 98064 93862 94056 96422
12513 96422 100021 105943 111586 108299 103240 106307 109104 111202 110983 110658 114630 118940 120559 118355 119980
12498 119980 125590 128532 128305 131819 138928 131779 129048 142228 141531 140403 145203 145675 147412 152519 152476
12483 152476 150893 148289 151401 158288 157468 161259 160854 164439 171152 168013 167372 170320 173717 176735 177745
12468 177745 173380 180377 181912 178148 181341 188880 191900 198665 200631 200700 203612 196413 197582 193553 196963
12453 196963 202280 198758 194984 203071 212207 213007 207528 203673 210410 221199 220330 216774 218959 222191
12439 222191 219936 219889 224616 233101 240040 239159 232818 233792 238165 239414 236890 234187 233617 231670 229796
12424 229796 231481 235493 239110 242239 250691 258470 255915 252991 247002 242786 248036 255351 253589 255214
12410 255214 258364 258783 256852 255357 252266 257820 259160 267135 275249 276125 276524 271139 265365 266280 278480
12395 278480 279828 276197 273172 277949 282373 286990 290990 290545 292913 295779 292854 292756 295666 294222 292546
12380 292546 294535 302932 302264 299534 301069 308961 312578 309866 313244 309918 310115 314514 315200 313152 310228
12365 310228 319358 332345 333732 332610 331391 326717 325277 335985 337032 332979 337279 339711 347793 349015
12351 349015 349045 347535 345918 352885 354100 359798 357153 351529 357540 364705 362825 362051 355838 346746 342161
12336 342161 345010 353411 364026 369422 370273 370467 375255 380247 375487 373941 366893 358210 360108 367359
12322 367359 370753 371611 373187 374582 375205 385356 390853 393688 396850 398666 400115 397823 398531 409771
12308 409771 416363 420232 418850 415264 417994 419336 418868 424866 424586 421680 425380 424289 427645 437493 440219
12293 440219 435352 434322 430046 430636 428324 427031 431913 438805 437964 435948 432131 434036 444932 455693
12279 455693 457224 456166 458077 469156 478705 477762 479050 480288 479752 480249 485267 494336 500603 510582 523481
12264 523481 525391 528465 532822 532048 540781 543160 532163 502872 465502 431265 402645 381866 377752
12251 377752 380688 378870 378202 378429 383155 388195 398842 404950 411217 419649 427978 430110 433371 437517
12237 437517 445387 446741 444155 446856 445560 450083 457569 458628 455759 462933 462631 462259 462376 463550 465722
12222 465722 467681 469001 477211 475019 475420 478840 489461 491173 494153 500140 502437 495950 495911 496582 494886
12207 494886 499135 507396 500568 492574 493937 502522 506984 502314 498489 502647 503452 502597 506388 510045 510546
12192 510546 511621 513103 513577 516547 519708 525495 528441 530105 531670 527637 526980 531585 534260 540519 545745
12177 545745 542433 544695 547140 549762 550127 546562 542079 546211 554829 558658 556710 556343 550196 545200 543575
12162 543575 538967 549941 563047 567117 572147 572827 566384 565438 560974 558106 552759 546607 542561 543482
12148 543482 552316 559378 561034 559176 557749 563603 574358 574982 568684 571422 576407 578607 577942 576740
12134 576740 573430 570794 572865 585976 591804 594019 602943 601828 601017 605089 604383 606393 610128 607301
12120 607301 607403 607499 599621 603385 606577 603763 608234 604893 602965 607816 618846 624280 622768 618087 620441
12105 620441 618688 615769 612505 611980 612428 612128 611629 614337 617541 623903 631181 627407 626711 628173 632633
12090 632633 627966 630381 634071 639571 647773 643355 641537 646529 645908 644445 649364 651345 651587 654305 651896
12075 651896 653645 658237 660928 663887 664620 665374 664573 671063 671136 668687 668215 664913 667200 668344 669080 670636
12059 670636 665019 663448 672007 674119 672009 673025 668950 663629 661729 664629 671601 675699 681475 685821
12045 685821 687811 690667 698087 702116 698655 698506 695982 692350 695489 691642 680256 680886 688599 694232
12031 694232 696597 700772 704279 707642 712046 712837 715749 709362 708555 713561 714452 713586 715586 710393 709758
12016 709758 709789 709745 713287 717061 718453 719974 722111 717934 717382 718639 721666 717570 719461 720145 722295 727696
12000 727696 731328 729914 729861 733742 734883 733079 734024 738983 742397 738226 740813 740001 735548 731128 730954
11985 730954 735732 732798 732686 739909 742006 737369 737854 737886 742260 746268 744085 743510 753454 757783 748826
11970 748826 750255 753253 755254 758659 766994 768247 769056 768883 763556 765052 771581 770042 768433 776069 779674
11955 779674 784412 791426 788015 785163 788437 789497 789545 784190 781510 789493 795668 795628 793800 794186 793958 795288
11939 795288 798591 796624 798699 798803 799354 806632 814252 817571 818286 811153 811510 816733 815427 816432 817755
11924 817755 818811 820506 817807 816853 816282 823134 826104 829484 828021 826125 825381 824687 824943 831515 833265
11909 833265 836082 832806 826627 822360 824733 832771 836844 844552 845169 841195 840372 842694 848094 848293 850513
11894 850513 850565 854071 854978 859537 867316 867115 866457 860309 856273 857915 865663 870238 870192 866760 867603 867381
11878 867381 869027 860728 855728 860646 874334 880306 881960 883583 880079 881149 873681 874216 882023 885436
11864 885436 893337 892290 887367 893672 899101 897140 899651 896798 896027 908959 906184 902408 906056 908591
11850 908591 906271 901750 909218 910141 911640 911262 909295 911979 911206 910032 912040 915444 918789 922827 915341
11835 915341 913673 912659 924167 938539 933756 930112 927119 936247 941589 944363 945770 943479 936597 939578
11821 939578 947807 950218 952090 949735 947160 949324 948704 950358 943419 943265 949119 956004 964694 970727 966427
11806 966427 954656 955824 960726 964615 964382 963201 962134 964333 964969 962830 962244 963005 968131 968537 974274
11791 974274 979448 978814 982887 988134 985532 977820 978171 980201 988827 996078 994416 990821 993091 995359 988162
11776 988162 989003 991034 994910 1000471 1002339 995794 992916 991327 988999 990807 993654 1005844 1013017 1017289
11762 1017289 1012534 1007151 1009071 1013690 1014571 1017471 1016978 1018534 1020799 1020193 1017607 1024643 1026943 1021731 1026938
11747 1026938 1026922 1030590 1033088 1034791 1037343 1036532 1039968 1037275 1035352 1034115 1039317 1044320 1051475 1060859 1059920
11732 1059920 1059060 1064586 1071777 1071841 1070066 1067952 1067651 1070001 1066721 1065459 1070561 1067588 1065491 1064337 1067351
11717 1067351 1070498 1076313 1085735 1087698 1088263 1084855 1081458 1086772 1082571 1082676 1087409 1098298 1104935 1096805
11703 1096805 1090815 1088141 1090833 1095367 1098291 1094757 1098015 1100363 1100572 1099820 1102196 1103534 1111304 1110393 1110255
11688 1110255 1118159 1118172 1109636 1111023 1117991 1116169 1112080 1112948 1121588 1123041 1125654 1127741 1127534 1126346 1130856
11673 1130856 1130384 1133042 1135644 1140970 1140726 1141945 1138552 1131502 1133636 1140096 1143407 1148045 1154135 1153774 1153748
11658 1153748 1151135 1151136 1160627 1167242 1164308 1161406 1162305 1165602 1168091 1171674 1174329 1172174 1168904 1162567 1163427
11643 1163427 1173333 1180823 1176327 1176781 1178173 1178300 1184534 1187150 1184236 1187096 1190774 1190498 1195725 1193148 1193245
11628 1193245 1192620 1194743 1197715 1202147 1203844 1203028 1201179 1204249 1209244 1215747 1213461 1216546 1217315 1218689 1209275
11613 1209275 1209901 1216442 1213089 1216685 1223010 1224743 1222830 1226559 1234810 1235357 1235912 1238864 1239413 1241336 1242033
11598 1242033 1236059 1238380 1246003 1250975 1249813 1243359 1245874 1249218 1251330 1251804 1247237 1246658 1247800 1248924
11584 1248924 1250578 1247608 1249846 1258846 1270113 1274861 1278298 1280121 1275229 1273377 1271379 1274373 1277416 1272913
11570 1272913 1268806 1270424 1279916 1283038 1279457 1278241 1280762 1283255 1282458 1287427 1293035 1294410 1299082 1298334
11556 1298334 1296513 1299740 1303991 1305945 1308284 1310411 1314226 1312757 1317044 1320567 1318016 1312945 1321330 1320671
11542 1320671 1314645 1317209 1319050 1327529 1334431 1331160 1332838 1328270 1326602 1328852 1338143 1341774 1343949 1345285
11528 1345285 1347348 1348085 1347090 1354574 1359457 1360177 1359570 1356018 1362307 1372955 1369571 1367221 1366312 1359926 1349831
11513 1349831 1348180 1348918 1354906 1363060 1369753 1373531 1377324 1376854 1376420 1376976 1376915 1376766 1382920 1392018 1392204 1391825
11497 1391825 1382803 1376943 1380829 1387532 1393874 1402055 1408133 1415171 1415268 1409941 1410342 1415118 1413562 1416177 1418074
11482 1418074 1422392 1420748 1418674 1419954 1421328 1430936 1437172 1437146 1437733 1431863 1429509 1434359 1434918 1442568 1455014
11467 1455014 1450950 1454700 1450538 1442060 1444373 1445259 1448865 1456957 1463257 1466320 1462544 1462140 1465124 1466842
11453 1466842 1475205 1482946 1484208 1478119 1476584 1473325 1478404 1483372 1483800 1488397 1488504 1490754 1491715 1498496 1504181
11438 1504181 1500596 1494316 1491403 1494169 1502426 1507148 1505588 1499069 1500474 1504556 1502007 1504740 1506321 1502795
11424 1502795 1499791 1503219 1509526 1516732 1517230 1523668 1532619 1539551 1541414 1542658 1545749 1550592 1550060 1544146
11410 1544146 1540305 1550640 1562823 1554230 1554051 1565451 1567942 1565325 1564910 1569897 1570456 1569842 1576578 1582262
11396 1582262 1585274 1584845 1584087 1582075 1581801 1586538 1592320 1597519 1597624 1600545 1601119 1601318 1599984 1597556 1604356
11381 1604356 1609166 1607797 1612476 1623040 1623947 1627729 1632329 1631267 1633501 1638140 1634050 1629204 1623829 1626300
11367 1626300 1637377 1644287 1644709 1652452 1653901 1657638 1652052 1643694 1647639 1649669 1657407 1660813 1660378 1658385
11353 1658385 1661945 1669630 1671203 1672493 1672485 1667624 1667012 1673648 1683224 1689923 1693417 1696494 1697452 1698565 1691238
11338 1691238 1690139 1694285 1697834 1699990 1697554 1701801 1709788 1713438 1713360 1720237 1724221 1730102 1740104 1744002
11324 1744002 1743013 1745025 1748256 1751695 1748609 1744322 1746904 1749395 1753853 1760381 1760864 1766919 1780912 1790581
11310 1790581 1790370 1781520 1782058 1784209 1793677 1798767 1801899 1801683 1796406 1793968 1807194 1818976 1826880 1836362
11296 1836362 1838832 1830675 1835055 1839100 1838831 1836807 1839439 1841065 1849903 1859726 1867692 1878399 1882706 1880841
11282 1880841 1887111 1894367 1904697 1916433 1923032 1933860 1954308 1975764 2006736 2033522 2056717 2086763
11270 2086763 2121881 2116446 2050600 1937985 1835450 1732324 1634739 1595471 1608603 1630025 1663619
11259 1663619 1693399 1720916 1739451 1751550 1761352 1771357 1779708 1790178 1799177 1807870 1818089 1825359
11247 1825359 1833905 1842906 1848671 1857514 1863830 1871182 1875585 1869306 1870526 1877630 1887523 1892687 1894135 1894940
11233 1894940 1894797 1898150 1903189 1909970 1911933 1917622 1926644 1926489 1933098 1935700 1938931 1952165 1961348 1964684
11219 1964684 1961965 1958046 1960310 1964725 1972918 1979145 1977894 1981943 1995287 1998758 2002828 2004583 2000664 2005824
11205 2005824 2010348 2024565 2035767 2035457 2040366 2050422 2059600 2063299 2063020 2067538 2066502 2072626 2075534 2077052
11191 2077052 2083771 2086185 2079170 2072077 2072668 2076839 2080780 2069550 2059221 2055487 2060223 2058819 2059464 2054793
11177 2054793 2056531 2061509 2072904 2075244 2080322 2090719 2095472 2104951 2116340 2125300 2134420 2140339 2143965
11164 2143965 2148501 2163417 2179257 2194278 2218435 2247466 2277299 2308451 2337397 2361169 2338794
11153 2338794 2254539 2163455 2118701 2085932 2006040 1907510 1867436 1887577 1920832 1956191 1983136
11142 1983136 2003292 2021008 2024244 2024181 2032440 2047980 2053845 2058728 2062564 2071371 2079692 2085133 2097498
11129 2097498 2104940 2113118 2125933 2130839 2136344 2143185 2150570 2154954 2156147 2162376 2168364 2171847 2172194 2179795
11115 2179795 2176938 2173927 2176551 2185092 2194686 2202129 2213232 2216492 2221748 2228754 2233459 2234796 2239888 2247541
11101 2247541 2250070 2253289 2260362 2268388 2275230 2277003 2277095 2273311 2282909 2287296 2284890 2286437 2292214 2296535
11087 2296535 2301319 2307318 2313917 2321982 2321257 2321353 2321439 2323884 2328713 2336325 2342402 2348605 2349450 2360199 2363884
11072 2363884 2366433 2366867 2368209 2377651 2384297 2387830 2394255 2399297 2408491 2412528 2411176 2405405 2405896 2418133
11058 2418133 2428252 2430578 2428810 2429030 2431095 2438095 2443229 2446984 2453604 2465797 2469657 2469660 2478011 2479788
11044 2479788 2481488 2480597 2489449 2496815 2506095 2515281 2519537 2514752 2510439 2514957 2519214 2518415 2518019 2528638
11030 2528638 2534239 2541167 2541817 2552415 2561706 2567922 2570661 2568053 2576552 2584516 2582675 2580397 2591162 2605357
11016 2605357 2616329 2624198 2626058 2625477 2627809 2631193 2634727 2640123 2640096 2641862 2643549 2650920 2661364 2665522
11002 2665522 2675249 2678007 2678316 2684305 2695330 2703209 2710347 2716675 2718728 2714571 2722075 2732302 2738641 2743432
10988 2743432 2748480 2752438 2764503 2774364 2781992 2782730 2781912 2790988 2798364 2806786 2815708 2830255 2838773 2851151
10974 2851151 2862871 2874870 2878948 2884562 2881229 2861262 2835463 2812235 2790635 2781393 2776896 2780501
10962 2780501 2784007 2795274 2802564 2815587 2830530 2844377 2855043 2868930 2878153 2887946 2891890 2904271
10950 2904271 2912995 2921783 2931135 2940533 2946440 2964280 2976281 2981183 2987089 2992061 2997677 3009163 3026292
10937 3026292 3035658 3044324 3047131 3052861 3066487 3082472 3105150 3127299 3143701 3152955 3151207 3143181 3121541
10924 3121541 3086398 3041539 2995002 2960759 2940529 2923366 2921690 2928906 2939809 2955632 2972271 2993470
10912 2993470 3010094 3029806 3040441 3041421 3046008 3061417 3065382 3074392 3086564 3100372 3105773 3116710
10900 3116710 3131263 3144308 3152182 3159791 3163444 3172504 3186510 3200179 3211228 3224269 3236987 3245713
10888 3245713 3252120 3263303 3283438 3309897 3323492 3339122 3358744 3369680 3368178 3349608 3315380 3277244
10876 3277244 3248886 3227438 3220308 3224087 3239248 3245453 3252724 3263966 3276285 3293729 3308254 3319655
10864 3319655 3325944 3340391 3350050 3360317 3371605 3380654 3389954 3404258 3416254 3429649 3438348 3450438
10852 3450438 3457226 3460475 3467956 3476545 3479763 3486149 3495720 3512462 3528578 3543357 3546958 3549867 3562955
10839 3562955 3567514 3573206 3581838 3598694 3611411 3625399 3632700 3632474 3639693 3648925 3660962 3668352 3674240
10826 3674240 3683144 3684157 3692911 3701465 3709015 3719046 3732403 3746360 3754234 3762221 3779099 3791872 3804159
10813 3804159 3816158 3822329 3829092 3835822 3842163 3843255 3852156 3863917 3881545 3894817 3899647 3900008 3906476
10800 3906476 3918406 3929791 3937049 3943850 3951584 3965904 3982577 3994670 4008435 4019294 4031385 4042227
10788 4042227 4046579 4054646 4069342 4086783 4099108 4103877 4118597 4130913 4138571 4150753 4167359 4178493
10776 4178493 4179660 4184963 4198020 4218165 4230575 4236432 4247697 4269586 4291344 4311429 4320829 4325076
10764 4325076 4331147 4333143 4343521 4356289 4359808 4369408 4377649 4386382 4401716 4405571 4410875 4421977 4437182
10751 4437182 4460660 4481185 4498730 4511600 4520156 4530933 4543557 4553016 4564619 4578994 4587630 4602318
10739 4602318 4619707 4632599 4649567 4666406 4682186 4697032 4709105 4729195 4752713 4775411 4797600
10728 4797600 4802913 4814483 4831041 4847810 4858209 4877688 4900807 4923329 4938770 4947534 4961634 4977781
10716 4977781 4994223 5011532 5027577 5043391 5051753 5070684 5078416 5090523 5108994 5124851 5147570 5166461
10704 5166461 5175876 5194696 5224200 5253007 5281716 5295501 5305382 5321787 5344953 5369618 5393654 5413873
10692 5413873 5435112 5459355 5480266 5503800 5525865 5550724 5576113 5595441 5621274 5650660 5675533
10681 5675533 5696641 5715536 5737722 5756120 5777156 5799594 5820545 5840775 5869974 5900833 5931600
10670 5931600 5968372 5996404 6020166 6043479 6069965 6096085 6118521 6129065 6134238 6146300 6174786
10659 6174786 6205687 6240263 6276903 6306224 6339224 6384110 6423483 6456720 6476789 6509567 6551860
10648 6551860 6589650 6624909 6657612 6694656 6736202 6772220 6817135 6859446 6895858 6935743 6976455
10637 6976455 7019087 7067016 7112004 7152310 7190119 7226798 7265094 7311750 7361498 7403778 7447870
10626 7447870 7499988 7552926 7605564 7656463 7703427 7749584 7796772 7848235 7901414 7963623 8030248
10615 8030248 8096161 8168156 8247863 8319499 8397525 8479018 8556387 8640017 8724452 8812896 8903134
10604 8903134 9002371 9105538 9205883 9304552 9407730 9509735 9613449 9727412 9847190 9974267
10594 9974267 10102598 10245543 10407233 10571011 10750823 10943860 11147976 11367154 11599018
10585 11599018 11849724 12092076 12296636 12443539 12492022 12422184 12271695 12107982 11988393 11972061
10575 11972061 12105487 12378864 12755532 13191915 13670236 14176132 14708599 15281643 15911671
10566 15911671 16630525 17456874 18410364 19526568 20801968 22173037 23463405 24295927 24141840
10557 24141840 22504465 19192254 14527752 9266980 4296913 353184 -2123132 -3102876
10549 -3102876 -2898558 -1988099 -766912 511426 1718005 2809241 3770511 4615902 5373805
10540 5373805 6072111 6735972 7375736 7999658 8638551 9308468 9997941 10720266 11472037
10531 11472037 12261657 13095663 13976798 14891526 15810099 16667163 17399594 17983145 18480856
10522 18480856 19038709 19853933 21075210 22769972 24957672 27539536 30263749 32619700
10514 32619700 33696745 32288332 27391075 19082571 8966028 -469784 -7378916 -11551043
10506 -11551043 -14032834 -15907741 -17454225 -18317287 -18146965 -16972007 -15149570 -13107935
10498 -13107935 -11146830 -9420410 -7993054 -6926871 -6276369 -5984615 -5876807 -5705485 -5288632
10489 -5288632 -4622233 -3795857 -2902530 -2007926 -1145672 -308518 501568 1302200 2098340
10480 2098340 2891463 3675184 4476867 5319937 6233939 7251870 8413532 9752882 11280807
10471 11280807 12987436 14767626 16323654 17107554 16404905 13560453 8414721 1581596
10463 1581596 -5701288 -12088937 -16601485 -18904508 -19311551 -18467733 -17016241 -15408251
10455 -15408251 -13882435 -12538412 -11394045 -10433471 -9627750 -8934608 -8322989 -7769069 -7265965
10446 -7265965 -6790487 -6330476 -5887406 -5471747 -5076702 -4709780 -4369089 -4060023 -3766662
10437 -3766662 -3494931 -3243913 -3000408 -2772333 -2555150 -2341902 -2140512 -1957954 -1783114
10428 -1783114 -1612581 -1443814 -1275899 -1105831 -942876 -781723 -625650 -475100 -325601
10419 -325601 -182611 -48002 57538 121470 139006 136157 163649 232367 325947 422217 528889
10408 528889 638591 742801 842190 937082 1038369 1130116 1214917 1297540 1379950 1469340 1560038
10397 1560038 1653660 1742287 1826219 1905618 1989147 2069596 2156978 2233060 2309654 2384544 2448559
10386 2448559 2516625 2591304 2661445 2741354 2818368 2894841 2968786 3032867 3093576 3154513 3221946
10375 3221946 3293656 3361416 3438685 3524313 3613352 3702843 3786606 3874631 3961248 4043706 4117825
10364 4117825 4176001 4194582 4133529 4021274 3957246 3985252 4069830 4160580 4247047 4330757 4412214
10353 4412214 4484765 4551683 4614249 4682623 4749266 4815729 4877324 4938699 4999934 5062817 5141322
10342 5141322 5226086 5302828 5384672 5468780 5545115 5624866 5704888 5768329 5826678 5884354 5936884
10331 5936884 5991334 6049202 6104128 6166437 6241830 6317834 6392607 6468400 6541917 6624951 6709680
10320 6709680 6783850 6840011 6884663 6919559 6950588 7002344 7096984 7244483 7409554 7536108 7611120
10309 7611120 7676883 7743190 7815447 7894661 7973651 8049399 8131032 8211913 8286736 8360064 8441296
10298 8441296 8520907 8606940 8697316 8796328 8897236 8992386 9090005 9175849 9242173 9307332 9392743
10287 9392743 9491435 9591025 9689538 9772878 9858431 9954533 10057454 10163336 10270864 10391709
10277 10391709 10518029 10640879 10767332 10898422 11036743 11168403 11281033 11377861 11479470
10268 11479470 11586387 11691697 11808829 11938831 12078101 12237660 12399523 12564244 12715169
10259 12715169 12852741 12996798 13159298 13328900 13497290 13658439 13816784 13987871 14169255
10250 14169255 14358061 14558322 14771017 14982761 15185996 15388789 15590681 15785350 15989190
10241 15989190 16209619 16435093 16671158 16925125 17204591 17481865 17760717 18029939 18276900
10232 18276900 18518969 18775845 19047650 19330460 19635753 19958509 20286910 20628667 20965803
10223 20965803 21319296 21693693 22074542 22465019 22873060 23304238 23767633 24264655 24785300
10214 24785300 25319010 25855969 26413995 26995183 27589534 28203229 28845393 29501970 30184830
10205 30184830 30878313 31576809 32302338 33101363 33981017 34910412 35882992 36906524 37991470
10196 37991470 39133519 40325160 41547682 42813090 44179782 45692433 47375018 49226772
10188 49226772 51224938 53376526 55696157 58195904 60873960 63711295 66680834 69751994
10180 69751994 72874506 76021382 79272007 82920883 87529237 93572450 101106152 110020827
10172 110020827 120361863 132488588 147006470 164616177 186026260 211631450 240145641
10165 240145641 264915745 268889191 224230413 109386325 -52900883 -191337462 -256142676
10158 -256142676 -259812476 -237847928 -211293420 -187141266 -166760310 -149779325 -135490358
10151 -135490358 -123342556 -112978348 -104127475 -96542449 -90052307 -84682745 -80504863 -77248675
10143 -77248675 -74286247 -71256232 -68155847 -65077821 -62124349 -59370316 -56835208 -54527712
10135 -54527712 -52438213 -50561090 -48842890 -47187536 -45559217 -43963442 -42445526 -41025397
10127 -41025397 -39727623 -38531142 -37406827 -36334319 -35306365 -34320881 -33386294 -32484073
10119 -32484073 -31620165 -30837410 -30153430 -29522231 -28887205 -28234748 -27579016 -26941670 -26320710
10110 -26320710 -25726274 -25154996 -24619599 -24140010 -23743648 -23430446 -23149609 -22798517 -22374247
10101 -22374247 -21923487 -21473499 -21040679 -20635440 -20275009 -19941110 -19622171 -19325892 -19053301
10092 -19053301 -18793915 -18560596 -18348806 -18154222 -17989856 -17866135 -17775783 -17702321 -17628849 -17544818
10082 -17544818 -17451701 -17361725 -17262709 -17172454 -17090142 -17007217 -16894043 -16758526 -16612874 -16461002
10072 -16461002 -16310532 -16162307 -15998330 -15822132 -15660903 -15526447 -15407620 -15266532 -15102968
10063 -15102968 -14923195 -14740492 -14550236 -14354857 -14170532 -13981874 -13786168 -13607989 -13430595
10054 -13430595 -13240446 -13055858 -12881821 -12718808 -12579713 -12457391 -12346253 -12239268 -12127658
10045 -12127658 -12019887 -11905145 -11801899 -11692960 -11575365 -11442873 -11303445 -11161381 -11039687
10036 -11039687 -10951722 -10899011 -10858464 -10788310 -10692660 -10581566 -10470387 -10356115 -10244259 -10133369
10026 -10133369 -10043366 -10012810 -10001666 -9922203 -9798020 -9677667 -9559481 -9445540 -9341287 -9239876
10016 -9239876 -9137859 -9033023 -8922583 -8813270 -8719914 -8665680 -8657318 -8656829 -8627017 -8541961 -8417282
10005 -8417282 -8296280 -8194213 -8107713 -8039945 -7978171 -7910425 -7833608 -7767464 -7707358 -7643402 -7585090
9994 -7585090 -7519119 -7443665 -7361808 -7282665 -7200552 -7126596 -7051776 -6977024 -6920175 -6866695 -6807415
9983 -6807415 -6749181 -6694337 -6646859 -6604006 -6557031 -6506445 -6453811 -6391295 -6331770 -6269599 -6202101
9972 -6202101 -6131982 -6062075 -5986813 -5912327 -5846353 -5781503 -5719240 -5661155 -5602655 -5559142 -5518028
9961 -5518028 -5449322 -5365703 -5284592 -5205632 -5133422 -5070920 -5022038 -4982639 -4944526 -4898104 -4848340
9950 -4848340 -4795490 -4736979 -4678433 -4622151 -4564040 -4501056 -4433253 -4369028 -4313634 -4259271 -4210417
9939 -4210417 -4160110 -4093704 -4025091 -3960648 -3896489 -3830790 -3773767 -3709029 -3646152 -3578906 -3511950
9928 -3511950 -3450313 -3384151 -3317174 -3257243 -3195976 -3130550 -3057137 -2976555 -2896193 -2817440 -2745176
9917 -2745176 -2670441 -2596986 -2525157 -2447124 -2358210 -2271565 -2186601 -2106669 -2029990 -1950849 -1860442
9906 -1860442 -1763767 -1671855 -1571745 -1464174 -1355185 -1242515 -1125944 -1012511 -897260 -764639
9896 -764639 -623206 -476682 -328555 -173624 -7162 170068 362825 569923 788953 1022902
9886 1022902 1287995 1578541 1906069 2280934 2710881 3190543 3698397 4167571 4462882 4369131
9876 4369131 3670472 2385504 806921 -843873 -2445749 -3654040 -4144924 -4036845 -3636645
9867 -3636645 -3144933 -2655173 -2185581 -1738044 -1304671 -891820 -487591 -93828 281255 628573
9857 628573 959346 1289888 1637299 2015964 2423850 2865188 3346310 3856700 4388682 4928149
9847 4928149 5458163 5965599 6435005 6944545 7650003 8604748 9785239 11151693 12597613
9838 12597613 13894580 14538893 13794744 11132647 6843868 1860131 -2449308 -4855446
9830 -4855446 -5525139 -5798162 -6932974 -9144033 -11393019 -12538013 -12414278 -11549061 -10409683
9821 -10409683 -9255592 -8187029 -7215100 -6344709 -5585450 -4961946 -4455278 -3943036 -3322504
9812 -3322504 -2615997 -1856283 -1065820 -256490 544011 1269031 1807843 2142848 2471212 3099092
9802 3099092 4091726 5339130 6750037 8281211 9835942 11175784 11848868 11290189 9167064
9793 9167064 5942036 3196976 2129628 2071853 1163988 -2228197 -8186691 -14577558 -18975838
9784 -18975838 -21003507 -21571747 -21468873 -20972847 -20085169 -18881543 -17567236 -16377290 -15466305
9775 -15466305 -14870941 -14363693 -13717582 -12944615 -12127575 -11314427 -10538494 -9804378 -9138847
9766 -9138847 -8572765 -8112930 -7674470 -7141259 -6477661 -5728445 -4939737 -4105618 -3221426 -2288948
9756 -2288948 -1386759 -656412 -285677 -277124 -262858 102488 617129 633927 -491506 -3009975
9746 -3009975 -6499110 -10115210 -13174221 -15562767 -17642795 -19416487 -20357301 -20374098 -19890729
9737 -19890729 -19278491 -18725141 -18246007 -17765769 -17212767 -16578995 -15926679 -15304625 -14737849
9728 -14737849 -14220890 -13750447 -13313289 -12893644 -12489051 -12106673 -11743540 -11397258 -11069849
9719 -11069849 -10755038 -10457943 -10156085 -9834648 -9502264 -9169733 -8821817 -8459845 -8075594
9710 -8075594 -7679368 -7289223 -6973440 -6871736 -7153920 -7908144 -8980364 -10130388 -11300854
9701 -11300854 -12363865 -13007687 -13124586 -12899553 -12537737 -12162784 -11807556 -11482536 -11184728
9692 -11184728 -10929566 -10697594 -10490899 -10312771 -10151796 -10010370 -9875715 -9740216 -9609943
9683 -9609943 -9483854 -9370866 -9261069 -9162553 -9067937 -8973261 -8876015 -8785740 -8704047 -8631772 -8561661
9672 -8561661 -8487075 -8414380 -8343768 -8266788 -8201195 -8134600 -8073713 -8012889 -7955980 -7903134 -7856058
9661 -7856058 -7813657 -7763299 -7713781 -7667103 -7622666 -7580856 -7535579 -7490402 -7438507 -7395115 -7357987
9650 -7357987 -7320456 -7283850 -7242188 -7193372 -7150289 -7113317 -7075838 -7035464 -6994144 -6958783 -6921151
9639 -6921151 -6887217 -6861350 -6840053 -6807939 -6778913 -6749051 -6716463 -6689046 -6659375 -6623634 -6586168
9628 -6586168 -6554269 -6519621 -6484834 -6459365 -6430406 -6409916 -6398363 -6376572 -6351786 -6335793 -6309973
9617 -6309973 -6276829 -6247951 -6217138 -6197531 -6175501 -6151997 -6130115 -6108954 -6085933 -6063800 -6041820
9606 -6041820 -6013612 -5987165 -5965958 -5949481 -5931397 -5905705 -5883633 -5863281 -5840835 -5817623 -5797072
9595 -5797072 -5780546 -5767234 -5747936 -5725024 -5704305 -5690662 -5669670 -5649034 -5630574 -5616154 -5603866
9584 -5603866 -5582029 -5560755 -5546088 -5530536 -5515934 -5494943 -5479194 -5458222 -5437755 -5420546 -5405999
9573 -5405999 -5391347 -5372446 -5355784 -5339178 -5324667 -5310377 -5291598 -5281358 -5268647 -5247656 -5235994
9562 -5235994 -5222986 -5210145 -5194793 -5174046 -5160279 -5147776 -5134092 -5117707 -5101097 -5084440 -5069774
9551 -5069774 -5053696 -5038297 -5021539 -5011749 -5012174 -5008662 -4996570 -4985724 -4973234 -4958585 -4943791 -4924876
9539 -4924876 -4909197 -4898676 -4889900 -4884625 -4863962 -4848046 -4831485 -4815174 -4804009 -4791743 -4780085 -4772962
9527 -4772962 -4765053 -4754903 -4746937 -4735756 -4726753 -4721591 -4704898 -4691193 -4685025 -4672909 -4657993 -4642750
9515 -4642750 -4628769 -4617979 -4601754 -4582836 -4571237 -4553825 -4543862 -4541508 -4531064 -4517908 -4502271 -4489554
9503 -4489554 -4483897 -4481933 -4476145 -4464804 -4452907 -4445106 -4434890 -4430349 -4431160 -4419745 -4415790 -4407128 -4390582
9490 -4390582 -4371950 -4363976 -4360135 -4358936 -4345879 -4329705 -4317776 -4310380 -4303477 -4298693 -4292241 -4275427 -4267380
9477 -4267380 -4260119 -4253699 -4249225 -4236673 -4226076 -4221381 -4215504 -4207422 -4200725 -4199145 -4193700 -4187962 -4181619 -4176360
9463 -4176360 -4172911 -4167921 -4147971 -4126730 -4117171 -4110775 -4103486 -4088859 -4082122 -4075127 -4070979 -4076412 -4070392
9450 -4070392 -4062203 -4055512 -4042667 -4025220 -4010255 -3993717 -3983708 -3972074 -3965846 -3960455 -3946853 -3939012
9438 -3939012 -3928299 -3923244 -3907922 -3895927 -3888367 -3878485 -3868089 -3873421 -3890105 -3906466 -3916202 -3925197 -3927690
9425 -3927690 -3918983 -3914670 -3917626 -3916865 -3912907 -3904030 -3892103 -3878499 -3867719 -3853232 -3842033 -3831448 -3823750
9412 -3823750 -3814460 -3811983 -3804790 -3800461 -3791280 -3784191 -3769409 -3752589 -3742788 -3736930 -3727076 -3713097 -3709827
9399 -3709827 -3704572 -3699529 -3685179 -3672662 -3662712 -3660899 -3649738 -3632995 -3616774 -3614983 -3621723 -3636271 -3646854
9386 -3646854 -3644349 -3646193 -3652885 -3662719 -3679123 -3700810 -3706614 -3707450 -3705882 -3694179 -3682988 -3678887 -3675446
9373 -3675446 -3660900 -3648954 -3639258 -3631023 -3618419 -3605257 -3593883 -3586025 -3580460 -3576537 -3567585 -3553019 -3547873
9360 -3547873 -3539085 -3524137 -3518498 -3514380 -3506391 -3501095 -3486919 -3475725 -3473255 -3462697 -3444663 -3436235 -3439392
9347 -3439392 -3440912 -3436493 -3435921 -3433804 -3429412 -3435282 -3445691 -3468336 -3482810 -3495797 -3500069 -3497263 -3485328
9334 -3485328 -3479378 -3473155 -3464884 -3461880 -3454369 -3445420 -3441342 -3428955 -3412461 -3402426 -3406213 -3403950 -3400570
9321 -3400570 -3398168 -3385124 -3374900 -3367561 -3360285 -3356730 -3351507 -3346361 -3341990 -3325808 -3314712 -3316252 -3311316
9308 -3311316 -3303366 -3298362 -3290814 -3279877 -3270442 -3263853 -3258818 -3257690 -3257341 -3261185 -3265282 -3269328 -3273023 -3273198
9294 -3273198 -3268270 -3257238 -3252146 -3241670 -3240042 -3236533 -3234724 -3232623 -3221123 -3219605 -3217677 -3215431 -3205326
9281 -3205326 -3194396 -3191023 -3182713 -3174585 -3172669 -3167741 -3161945 -3156849 -3152995 -3147091 -3144040 -3139204 -3133232 -3127744
9267 -3127744 -3119813 -3112965 -3106655 -3100530 -3099377 -3099348 -3097622 -3094747 -3093938 -3087326 -3077925 -3079318 -3070629 -3068750 -3067786
9252 -3067786 -3062204 -3053658 -3052473 -3049365 -3050207 -3051266 -3044879 -3044082 -3041654 -3037921 -3038517 -3028834 -3023561 -3018893 -3012765
9237 -3012765 -3009368 -3000852 -3001931 -3004293 -2998621 -2995515 -2989417 -2977953 -2975737 -2975637 -2971151 -2966497 -2960062 -2955701
9223 -2955701 -2956383 -2955466 -2950616 -2946594 -2942357 -2936554 -2934607 -2935711 -2929908 -2923917 -2927165 -2926618 -2918635 -2913618 -2903369
9208 -2903369 -2897479 -2898542 -2898189 -2890086 -2886095 -2880585 -2880312 -2880611 -2880009 -2873486 -2869207 -2864394 -2862083 -2860550 -2852201
9193 -2852201 -2843296 -2838885 -2841614 -2842954 -2838321 -2835362 -2833382 -2835803 -2831072 -2828971 -2831215 -2827379 -2822460 -2815822
9179 -2815822 -2811309 -2806702 -2800287 -2790324 -2791946 -2793733 -2791555 -2788620 -2783924 -2776056 -2772139 -2771309 -2767556 -2765257
9165 -2765257 -2764227 -2758009 -2750534 -2747746 -2755966 -2755873 -2748355 -2746472 -2746964 -2747399 -2738379 -2731324 -2733008 -2731279 -2723811
9150 -2723811 -2720479 -2720402 -2723031 -2724536 -2719317 -2714799 -2716612 -2713214 -2699304 -2688400 -2683520 -2682190 -2680332 -2675063
9136 -2675063 -2670925 -2674305 -2674425 -2666185 -2664328 -2663595 -2662157 -2660564 -2654871 -2652951 -2652802 -2654853 -2654017 -2647786 -2634743
9121 -2634743 -2632877 -2634013 -2639299 -2638852 -2632356 -2626428 -2623552 -2625779 -2623469 -2626097 -2622801 -2615414 -2607826 -2605728
9107 -2605728 -2604147 -2597647 -2590709 -2588639 -2592927 -2590683 -2587781 -2582756 -2582085 -2585868 -2585470 -2582917 -2570948 -2579503
9093 -2579503 -2580197 -2577943 -2571357 -2566219 -2555753 -2545713 -2544249 -2547757 -2550129 -2551299 -2551537 -2543672 -2535393 -2533353
9079 -2533353 -2534106 -2536856 -2535322 -2532689 -2531914 -2520279 -2509071 -2511813 -2517509 -2523228 -2522734 -2515024 -2506514 -2495167
9065 -2495167 -2490791 -2496884 -2496792 -2490434 -2487092 -2491010 -2484792 -2485176 -2484295 -2472975 -2470475 -2470397 -2470189 -2470107 -2466132 -2466797
9049 -2466797 -2468067 -2466505 -2469483 -2473393 -2470772 -2464453 -2456561 -2452508 -2449179 -2443215 -2436910 -2435362 -2433930 -2434048
9035 -2434048 -2435168 -2432381 -2421851 -2420331 -2421564 -2418342 -2411988 -2410545 -2409466 -2414376 -2410701 -2412182 -2413455 -2411668
9021 -2411668 -2406362 -2405011 -2409031 -2405670 -2404919 -2404254 -2398746 -2394545 -2385789 -2378192 -2375618 -2379843 -2373887 -2366155 -2365677
9006 -2365677 -2364637 -2361521 -2354507 -2345656 -2345945 -2349108 -2357241 -2358318 -2356959 -2350776 -2346525 -2350242 -2348737 -2340756
8992 -2340756 -2335145 -2329282 -2328229 -2325596 -2328347 -2328334 -2326265 -2329422 -2323478 -2317642 -2319358 -2321712 -2321340 -2322159 -2323067
8977 -2323067 -2321636 -2316429 -2312477 -2301212 -2295672 -2301665 -2300442 -2297947 -2299833 -2297116 -2293577 -2290753 -2283799 -2275765
8963 -2275765 -2266439 -2266039 -2267534 -2267947 -2262022 -2258608 -2256903 -2251554 -2252799 -2253698 -2250337 -2248027 -2248787 -2245611 -2241973
8948 -2241973 -2244576 -2248073 -2251593 -2248337 -2239964 -2237092 -2242257 -2239940 -2237791 -2235961 -2231893 -2229944 -2226532 -2221080
8934 -2221080 -2224692 -2225780 -2216483 -2211111 -2201688 -2197781 -2197691 -2201083 -2204478 -2198635 -2193326 -2189673 -2182844 -2178587 -2179317
8919 -2179317 -2178657 -2172612 -2168423 -2163412 -2172669 -2173248 -2174927 -2187170 -2193043 -2194110 -2190481 -2185234 -2178670 -2175417
8905 -2175417 -2168365 -2160444 -2154196 -2156108 -2160838 -2162771 -2158386 -2156423 -2163138 -2170458 -2168748 -2165090 -2166777 -2164379
8891 -2164379 -2157344 -2161925 -2162949 -2162842 -2160698 -2153695 -2142148 -2137073 -2138555 -2139410 -2138028 -2134679 -2130088 -2129733 -2128825
8876 -2128825 -2124112 -2117902 -2113499 -2116310 -2116876 -2119491 -2119062 -2114404 -2107787 -2104361 -2099916 -2094736 -2095582 -2095416 -2098562
8861 -2098562 -2097533 -2093433 -2090576 -2081635 -2071377 -2069942 -2067793 -2081312 -2098042 -2102576 -2103740 -2110111 -2102450
8848 -2102450 -2098516 -2098215 -2091839 -2087752 -2084701 -2081195 -2082559 -2078440 -2079216 -2077292 -2075378 -2078529 -2077007 -2072724 -2067636
8833 -2067636 -2061160 -2064276 -2065968 -2058943 -2060773 -2060056 -2051745 -2047980 -2049355 -2049983 -2051589 -2048223 -2046847 -2041862 -2038317
8818 -2038317 -2038698 -2034817 -2030538 -2031320 -2032377 -2036895 -2044009 -2043904 -2036944 -2029611 -2027243 -2023636 -2019581 -2016439 -2012149
8803 -2012149 -1999529 -1999601 -2007484 -2006782 -2003609 -2004638 -2008568 -2004822 -1997666 -1992409 -1989333 -1986507 -1991774 -1995486 -1994000
8788 -1994000 -1994634 -1991978 -1997162 -1997432 -1989564 -1989063 -1983771 -1982338 -1981723 -1983042 -1977622 -1975720 -1969597 -1968331 -1974550
8773 -1974550 -1977686 -1975129 -1969616 -1966726 -1969579 -1969161 -1962715 -1956241 -1956131 -1957167 -1955860 -1961581 -1954544 -1949038 -1947252
8758 -1947252 -1948467 -1948347 -1948314 -1942077 -1938776 -1932783 -1922636 -1923895 -1929378 -1932714 -1932535 -1934654 -1937337 -1929190 -1926887
8743 -1926887 -1924944 -1924251 -1918403 -1921833 -1918681 -1909986 -1909493 -1912902 -1913303 -1911510 -1912066 -1908222 -1908654 -1910451 -1908753
8728 -1908753 -1910268 -1903437 -1896104 -1892758 -1896001 -1896960 -1885932 -1883526 -1889221 -1888686 -1885807 -1885364 -1889165 -1888873 -1890320
8713 -1890320 -1889336 -1885946 -1885100 -1878853 -1880458 -1879264 -1877892 -1874232 -1878811 -1880024 -1870824 -1868411 -1868991 -1865284 -1870196
8698 -1870196 -1876252 -1870568 -1864299 -1855327 -1854681 -1856170 -1850652 -1846520 -1848413 -1852025 -1853813 -1856117 -1853624 -1851165
8684 -1851165 -1845376 -1844677 -1843068 -1843032 -1844859 -1841035 -1840023 -1837884 -1840157 -1835812 -1831515 -1831454 -1832270 -1830077 -1827302 -1826636
8668 -1826636 -1832281 -1831278 -1832351 -1831131 -1829588 -1829300 -1827438 -1819497 -1817501 -1814142 -1806914 -1808497 -1807374 -1804297
8654 -1804297 -1806842 -1807437 -1808544 -1798025 -1793307 -1789021 -1791861 -1795446 -1798453 -1794393 -1793369 -1793171 -1796541 -1800417
8640 -1800417 -1797690 -1798224 -1801284 -1803496 -1806503 -1794967 -1783879 -1780428 -1784693 -1788989 -1789356 -1790808 -1787608 -1778298
8626 -1778298 -1774129 -1776901 -1780224 -1781603 -1784258 -1780877 -1777926 -1779586 -1772341 -1760490 -1754780 -1754370 -1763322 -1763260 -1759954
8611 -1759954 -1758055 -1754611 -1748922 -1756213 -1763873 -1769532 -1760524 -1753410 -1747608 -1743077 -1749182 -1751460 -1749661 -1749576 -1749446
8596 -1749446 -1749372 -1747682 -1737941 -1732870 -1741821 -1737006 -1734205 -1730545 -1732155 -1731067 -1736104 -1738270 -1734378 -1730478 -1726932
8581 -1726932 -1725542 -1721315 -1714679 -1722825 -1730339 -1725764 -1723648 -1731261 -1728603 -1730310 -1728697 -1728072 -1728309 -1732958 -1733727
8566 -1733727 -1728396 -1728997 -1732595 -1739160 -1736332 -1727658 -1723410 -1726595 -1723484 -1723334 -1721384 -1720113 -1723031 -1723898 -1729755
8551 -1729755 -1728250 -1723110 -1724188 -1725748 -1720672 -1715710 -1719832 -1717820 -1711430 -1708737 -1714732 -1713249 -1708397 -1701223
8537 -1701223 -1691231 -1696040 -1708644 -1707057 -1704731 -1700705 -1693895 -1689581 -1688984 -1690220 -1691298 -1688625 -1687040 -1688878
8523 -1688878 -1687164 -1680130 -1674714 -1664518 -1669622 -1679422 -1683323 -1684571 -1683265 -1681597 -1676009 -1672060 -1675247 -1679977
8509 -1679977 -1682430 -1684980 -1684813 -1688195 -1682958 -1679959 -1676109 -1669290 -1665604 -1663468 -1665947 -1668857 -1672371 -1667536
8495 -1667536 -1662521 -1658852 -1653831 -1654510 -1651904 -1654149 -1650454 -1651878 -1654658 -1659833 -1655017 -1649208 -1644831 -1643973 -1646180
8480 -1646180 -1645480 -1643470 -1640542 -1637262 -1631248 -1628913 -1635835 -1641858 -1637836 -1634110 -1634764 -1631909 -1630281 -1625543 -1628011
8465 -1628011 -1627448 -1626355 -1628353 -1636437 -1634305 -1627647 -1627089 -1623243 -1623310 -1626087 -1624367 -1618004 -1611309 -1608927 -1611350
8450 -1611350 -1614806 -1612461 -1610019 -1608540 -1609113 -1606916 -1607486 -1607980 -1612547 -1609984 -1607962 -1604001 -1605142 -1606228 -1601922
8435 -1601922 -1588278 -1583735 -1586753 -1589840 -1595211 -1592451 -1592790 -1590797 -1592873 -1596404 -1598612 -1594688 -1592364 -1599331
8421 -1599331 -1591194 -1587015 -1581484 -1572610 -1576759 -1578908 -1580333 -1584550 -1584549 -1586661 -1589688 -1583461 -1578839 -1577239 -1572491
8406 -1572491 -1562925 -1556649 -1560869 -1565290 -1566639 -1564173 -1566114 -1567398 -1571097 -1569626 -1567195 -1564891 -1563135 -1565463
8392 -1565463 -1565091 -1564183 -1556941 -1557317 -1563083 -1563724 -1555012 -1550138 -1545943 -1546996 -1548630 -1544634 -1543208 -1541910 -1541300
8377 -1541300 -1539230 -1545257 -1548390 -1541465 -1541657 -1540281 -1537854 -1544379 -1541083 -1538292 -1532634 -1537363 -1541055 -1533619
8363 -1533619 -1534281 -1536048 -1531672 -1527628 -1524100 -1528677 -1530702 -1527526 -1527436 -1531075 -1530824 -1524971 -1524830 -1522642 -1520965
8348 -1520965 -1520802 -1522305 -1522246 -1520651 -1518369 -1520287 -1519861 -1513838 -1510682 -1505215 -1501127 -1504088 -1504498 -1503614 -1503706 -1503151
8332 -1503151 -1502735 -1502366 -1497203 -1494131 -1490908 -1495824 -1499322 -1495515 -1491627 -1493698 -1494773 -1492313 -1483890 -1484332 -1486362
8317 -1486362 -1492701 -1494792 -1489075 -1488571 -1488696 -1480785 -1474671 -1472581 -1471395 -1475757 -1484034 -1497948 -1503691 -1501856
8303 -1501856 -1499596 -1497640 -1494894 -1494394 -1494366 -1490189 -1489196 -1489185 -1484445 -1477997 -1476989 -1474050 -1472625 -1474733 -1477597 -1481800
8287 -1481800 -1476197 -1467961 -1463463 -1463943 -1465140 -1467396 -1471710 -1473507 -1468510 -1463304 -1464536 -1459096 -1460428 -1457568
8273 -1457568 -1447910 -1446220 -1443830 -1436249 -1435374 -1432286 -1427049 -1415674 -1412410 -1417609 -1438094 -1464397 -1486255
8260 -1486255 -1496517 -1496865 -1493733 -1489059 -1484336 -1480435 -1475657 -1472499 -1468408 -1459041 -1452215 -1448957 -1444038 -1444046 -1448603
8245 -1448603 -1450147 -1450569 -1446716 -1443844 -1443343 -1447733 -1444865 -1444345 -1447887 -1444644 -1445627 -1443829 -1438182 -1431781 -1424195
8230 -1424195 -1422151 -1425874 -1434415 -1427306 -1423393 -1416996 -1420141 -1424332 -1425095 -1422791 -1420610 -1420678 -1423921 -1430942 -1430603
8215 -1430603 -1430632 -1431429 -1430447 -1428213 -1428261 -1427137 -1425262 -1427540 -1425300 -1418273 -1411326 -1415871 -1420965 -1428104 -1424785 -1415451
8199 -1415451 -1408265 -1408210 -1412332 -1411594 -1409679 -1415834 -1410001 -1408721 -1404011 -1405154 -1403139 -1397324 -1397511 -1399891 -1399558
8184 -1399558 -1396260 -1399832 -1401873 -1399130 -1398539 -1398463 -1394206 -1389352 -1392878 -1394721 -1398079 -1395051 -1394797 -1389383 -1380834
8169 -1380834 -1378441 -1374146 -1372038 -1373315 -1378814 -1395462 -1407190 -1403281 -1395364 -1386519 -1382763 -1382725 -1385184 -1380656
8155 -1380656 -1373841 -1374556 -1377044 -1384898 -1386018 -1378375 -1377063 -1374539 -1369578 -1368372 -1367489 -1363384 -1368668 -1375891 -1376422
8140 -1376422 -1375782 -1375266 -1375216 -1370657 -1366543 -1365170 -1367378 -1359433 -1356113 -1350905 -1348649 -1344834 -1341374 -1335281 -1337765
8125 -1337765 -1348979 -1370175 -1382967 -1386039 -1386498 -1384269 -1381106 -1374891 -1368463 -1368391 -1370608 -1370059 -1369847 -1363801 -1362752
8110 -1362752 -1361440 -1365808 -1363703 -1360312 -1361254 -1360427 -1353553 -1351308 -1355668 -1355645 -1346072 -1341641 -1346843 -1354007 -1355442
8095 -1355442 -1354376 -1350036 -1346087 -1343623 -1339021 -1337010 -1335596 -1330763 -1324979 -1318450 -1318058 -1324421 -1339863 -1352736
8081 -1352736 -1365051 -1378149 -1384469 -1369152 -1357439 -1353376 -1342551 -1338229 -1336834 -1335973 -1336933 -1339133 -1348741
8068 -1348741 -1348900 -1348010 -1346167 -1339640 -1340971 -1343090 -1343920 -1333592 -1329098 -1330533 -1327452 -1327074 -1326976 -1321277 -1318725
8053 -1318725 -1315475 -1322419 -1323646 -1326171 -1325522 -1320349 -1316273 -1315616 -1313898 -1310938 -1310766 -1309140 -1301613 -1302075 -1299508
8038 -1299508 -1299214 -1302522 -1296782 -1295697 -1296960 -1294624 -1300910 -1306210 -1306449 -1304941 -1304188 -1301736 -1304410 -1310986 -1309386
8023 -1309386 -1305435 -1300559 -1295688 -1291566 -1297050 -1298322 -1299121 -1293253 -1281103 -1281900 -1285486 -1276921 -1275090 -1281053
8009 -1281053 -1279919 -1274214 -1270442 -1267508 -1267968 -1267552 -1269236 -1274406 -1273368 -1283071 -1299709 -1309041 -1303900 -1300697
7995 -1300697 -1300925 -1297943 -1298532 -1299676 -1299735 -1296278 -1289565 -1285724 -1279591 -1283040 -1286467 -1291534 -1292996 -1289695 -1286336
7980 -1286336 -1282318 -1277324 -1272900 -1275396 -1275797 -1279973 -1289859 -1297603 -1298364 -1292558 -1288731 -1286361 -1288703 -1280719 -1279390
7965 -1279390 -1279187 -1278829 -1278809 -1275752 -1279196 -1282859 -1284559 -1290749 -1299230 -1301227 -1297231 -1297036 -1299012 -1299199 -1297009 -1298061
7949 -1298061 -1295390 -1289137 -1286791 -1290374 -1294552 -1287145 -1280530 -1278434 -1277190 -1274506 -1271579 -1265103 -1263228 -1265037
7935 -1265037 -1271841 -1277806 -1283201 -1289678 -1296046 -1300321 -1299955 -1292384 -1295039 -1292943 -1295229 -1296512 -1293247 -1284392
7921 -1284392 -1277274 -1272379 -1273176 -1278875 -1281696 -1283330 -1283436 -1275540 -1271718 -1273505 -1271513 -1268984 -1268573 -1271582 -1272075
7906 -1272075 -1275474 -1269055 -1263003 -1262415 -1260025 -1256368 -1251182 -1251517 -1251464 -1250777 -1256248 -1258304 -1264560 -1267128 -1263079
7891 -1263079 -1259390 -1260791 -1260433 -1264243 -1268152 -1266545 -1261756 -1263901 -1259519 -1251535 -1253142 -1249996 -1246165 -1250225
7877 -1250225 -1250992 -1249557 -1249236 -1255051 -1257945 -1252657 -1245379 -1240161 -1241050 -1242287 -1234183 -1235922 -1233945 -1236117 -1239210
7862 -1239210 -1241791 -1248563 -1257508 -1250903 -1238416 -1238179 -1246338 -1242613 -1245786 -1249531 -1248074 -1245425 -1241619 -1241099
7848 -1241099 -1242592 -1242052 -1245448 -1247637 -1243214 -1235164 -1238241 -1247237 -1249672 -1240812 -1228325 -1225031 -1226632 -1227523
7834 -1227523 -1227335 -1225091 -1225659 -1229028 -1225567 -1224293 -1228628 -1229748 -1227225 -1226575 -1225213 -1222175 -1220684 -1215744 -1213223
7819 -1213223 -1217118 -1220626 -1221076 -1222194 -1219324 -1216697 -1218513 -1219360 -1218789 -1219053 -1213663 -1214718 -1212818 -1213601 -1212897 -1212089
7803 -1212089 -1210638 -1207939 -1205873 -1205969 -1212582 -1216504 -1215219 -1203964 -1201515 -1199267 -1205033 -1211423 -1212917 -1211803
7789 -1211803 -1208093 -1203765 -1197884 -1194433 -1187649 -1190175 -1193487 -1189944 -1189752 -1195116 -1201226 -1208407 -1203242 -1199474
7775 -1199474 -1196242 -1194817 -1198160 -1194208 -1189821 -1188007 -1189336 -1190454 -1193303 -1190614 -1188725 -1189278 -1188531 -1189530 -1193393
7760 -1193393 -1194663 -1197160 -1199252 -1195242 -1189277 -1181599 -1182373 -1182304 -1180971 -1180873 -1182571 -1185024 -1188944 -1191735 -1189248
7745 -1189248 -1183698 -1184139 -1189854 -1185486 -1180196 -1180767 -1180850 -1187101 -1185326 -1182679 -1181179 -1180590 -1179763 -1174311 -1168583 -1165793
7729 -1165793 -1166569 -1165877 -1163276 -1163106 -1162748 -1158575 -1162172 -1171610 -1172279 -1169867 -1168065 -1168510 -1167237 -1169439 -1171086 -1168738
7713 -1168738 -1168576 -1166601 -1163215 -1162020 -1162794 -1162184 -1163134 -1164394 -1163972 -1161082 -1169885 -1172649 -1157943 -1154368 -1154147
7698 -1154147 -1152741 -1154128 -1156828 -1158924 -1163064 -1152092 -1154047 -1156404 -1152122 -1155703 -1157929 -1158626 -1157351 -1155715
7684 -1155715 -1154254 -1152652 -1147079 -1139446 -1146534 -1149606 -1148477 -1150765 -1156205 -1161315 -1151972 -1146905 -1150560 -1151647
7670 -1151647 -1149375 -1152252 -1149280 -1145399 -1143681 -1143121 -1140658 -1143323 -1138727 -1139307 -1142785 -1141335 -1146670 -1143926 -1140732
7655 -1140732 -1143113 -1140473 -1134548 -1132136 -1130748 -1128300 -1133188 -1135643 -1139641 -1133517 -1133941 -1131355 -1127952 -1132046
7641 -1132046 -1137409 -1140657 -1137936 -1141856 -1147738 -1148131 -1140300 -1133848 -1127700 -1128585 -1125007 -1118817 -1118685 -1120870 -1121999
7626 -1121999 -1119763 -1119673 -1115832 -1120998 -1120002 -1110910 -1113141 -1112236 -1115497 -1115757 -1118383 -1120672 -1117209 -1114638 -1113938 -1112900
7610 -1112900 -1115087 -1112828 -1106355 -1109198 -1107799 -1111456 -1116752 -1115618 -1116918 -1115126 -1115080 -1113551 -1115048 -1126031
7596 -1126031 -1131150 -1129600 -1126018 -1117571 -1114889 -1116713 -1118172 -1114986 -1113777 -1112511 -1110234 -1109304 -1107656 -1104334
7582 -1104334 -1102164 -1097571 -1095116 -1100307 -1108092 -1102990 -1095721 -1097309 -1097396 -1096473 -1092983 -1098409 -1100806 -1105064 -1099683
7567 -1099683 -1103073 -1104531 -1103546 -1105518 -1103252 -1095918 -1098162 -1100204 -1098588 -1101617 -1106504 -1105880 -1096554 -1098644 -1093611
7552 -1093611 -1083164 -1083810 -1095283 -1100072 -1097305 -1097982 -1097421 -1093526 -1090409 -1095116 -1091857 -1093233 -1095707 -1097271
7538 -1097271 -1093147 -1094721 -1097845 -1094929 -1092386 -1089087 -1091664 -1096282 -1090754 -1091954 -1092794 -1082031 -1075045 -1081749
7524 -1081749 -1090334 -1088065 -1090950 -1093052 -1085017 -1081856 -1089203 -1086259 -1079576 -1076526 -1075956 -1077537 -1080625 -1078605
7510 -1078605 -1073345 -1073093 -1072993 -1068731 -1072496 -1077448 -1077963 -1070964 -1066670 -1070129 -1067193 -1065777 -1071188 -1068884 -1063288
7495 -1063288 -1059172 -1062497 -1066756 -1065917 -1061136 -1065314 -1064456 -1069699 -1070085 -1068695 -1071578 -1071407 -1070192 -1067832 -1065184
7480 -1065184 -1066342 -1067595 -1071795 -1075201 -1077535 -1077706 -1075374 -1067914 -1068169 -1068215 -1064851 -1066618 -1065824 -1062431 -1061891 -1056196
7464 -1056196 -1053402 -1057226 -1065184 -1071589 -1065338 -1065226 -1065911 -1060855 -1051832 -1051741 -1056227 -1053500 -1044925 -1044138 -1050092
7449 -1050092 -1054145 -1053175 -1048423 -1048478 -1047750 -1048617 -1058192 -1063526 -1058941 -1056067 -1054324 -1052814 -1050389 -1045407 -1047160
7434 -1047160 -1048252 -1052965 -1049914 -1052114 -1056873 -1058735 -1067180 -1064223 -1061490 -1059336 -1054261 -1054710 -1051088 -1050959 -1055007
7419 -1055007 -1054719 -1057311 -1058133 -1049918 -1044049 -1044115 -1049932 -1050831 -1053965 -1051056 -1048526 -1045538 -1040296 -1036084 -1034304
7404 -1034304 -1033592 -1026700 -1026149 -1039767 -1045348 -1039770 -1037621 -1035779 -1031352 -1029949 -1033226 -1025369 -1022150 -1021187 -1024262
7389 -1024262 -1023643 -1020659 -1024082 -1025763 -1029614 -1023131 -1024912 -1024431 -1025564 -1028494 -1026715 -1033823 -1032697 -1023198 -1019849
7374 -1019849 -1025122 -1027009 -1027335 -1028704 -1035795 -1029247 -1026911 -1022951 -1020349 -1018154 -1014478 -1014904 -1017327 -1022683 -1023162
7359 -1023162 -1017975 -1015415 -1018616 -1021073 -1013721 -1007840 -1007621 -1010326 -1019915 -1024995 -1023940 -1024298 -1019344 -1014933 -1016479
7344 -1016479 -1013955 -1015878 -1014975 -1014261 -1013899 -1019630 -1026813 -1026948 -1025231 -1023385 -1019802 -1016740 -1017577 -1015845 -1010865
7329 -1010865 -1002681 -999937 -1002611 -1008451 -1010957 -1012121 -1015699 -1014938 -1015771 -1014181 -1015151 -1010613 -1001354 -999781 -1001318
7314 -1001318 -998075 -1001456 -1005326 -1005865 -1009635 -1006370 -998950 -996341 -998972 -1002457 -1003448 -1002881 -997667 -991198 -991147
7299 -991147 -1000309 -996181 -992248 -997904 -997549 -1000146 -996328 -992295 -1001321 -1000921 -995558 -998802 -999353 -998393 -996238
7284 -996238 -996466 -994889 -993680 -995753 -999958 -999786 -998615 -998337 -990586 -986584 -988252 -985179 -981798 -982548 -985192
7269 -985192 -986252 -987289 -991628 -991457 -989317 -983586 -984929 -986193 -991755 -989586 -983728 -980655 -984878 -984192 -979197
7254 -979197 -981019 -981246 -975262 -976690 -978411 -975551 -977599 -979417 -983930 -985805 -979952 -977548 -979318 -979130 -979704
7239 -979704 -975186 -966029 -972111 -982883 -988728 -986119 -989382 -994289 -992890 -980449 -976435 -976067 -975989 -974167 -978434
7224 -978434 -974349 -969812 -973141 -974988 -978864 -979995 -987481 -991179 -983767 -979631 -983682 -982740 -980696 -980247 -978752
7209 -978752 -982182 -984227 -977560 -966745 -961571 -956334 -964177 -966200 -963114 -960300 -965438 -964108 -961051 -958742
7195 -958742 -964592 -969901 -968186 -964039 -964245 -965125 -965919 -967264 -961069 -962571 -959404 -950749 -954826 -956877 -958492
7180 -958492 -960529 -962410 -958699 -958236 -949336 -940503 -937304 -938420 -949737 -954105 -954618 -961135 -963296 -967594 -973680
7165 -973680 -969798 -965028 -954309 -950470 -950507 -952320 -956868 -952572 -953333 -953920 -961881 -960543 -953274 -951344 -951586
7150 -951586 -947202 -946539 -950932 -948964 -948195 -950100 -953045 -954010 -952754 -953646 -953141 -950795 -943988 -943199 -946944 -949669
7134 -949669 -950057 -949496 -952242 -953267 -955866 -958687 -959471 -956839 -955911 -948267 -938639 -941585 -940416 -937897 -937118 -938268
7118 -938268 -943497 -946604 -938920 -937183 -935081 -932108 -933657 -938907 -939464 -946186 -947355 -943142 -939831 -936344 -930415
7103 -930415 -936845 -942064 -934302 -934753 -933165 -929764 -924900 -926596 -927930 -932327 -932103 -933460 -935887 -927141 -920004
7088 -920004 -919474 -916836 -922545 -928196 -923216 -915586 -914203 -917725 -913825 -918461 -926473 -931706 -930146 -925133 -933290
7073 -933290 -931654 -932587 -933339 -934455 -935377 -927750 -923475 -926144 -924858 -926013 -927136 -925760 -920464 -918513 -916169
7058 -916169 -917417 -920177 -925749 -929360 -931935 -935713 -931920 -927205 -920202 -913991 -908728 -899260 -895112 -905218
7044 -905218 -912264 -913375 -913872 -910643 -915650 -923154 -924823 -919141 -911111 -913492 -915868 -916715 -914474 -907826 -908462
7029 -908462 -914251 -916633 -913467 -917790 -917051 -917860 -910111 -906266 -908351 -908215 -916381 -918582 -916562 -920406 -917785
7014 -917785 -917020 -920463 -922008 -917581 -908729 -903154 -898184 -901805 -911292 -915194 -909995 -902996 -907574 -910282 -909080
6999 -909080 -911837 -905507 -894814 -890633 -896140 -906335 -907553 -907973 -905262 -901645 -896428 -891191 -887915 -891982
6985 -891982 -898752 -894932 -896817 -905761 -904671 -903737 -899659 -893650 -893177 -888736 -888288 -890371 -894182 -895163 -892296
6970 -892296 -892819 -898942 -894802 -882060 -881786 -889227 -893913 -896489 -898669 -891647 -887859 -891324 -888337 -885426 -879793
6955 -879793 -883148 -885628 -886397 -885568 -886297 -889081 -888317 -891388 -893617 -891044 -881076 -877066 -886599 -889710 -888668
6940 -888668 -891416 -893170 -890793 -886088 -880276 -874581 -875724 -871698 -872969 -872430 -870820 -874164 -876315 -873287 -866663
6925 -866663 -862181 -858178 -857556 -865274 -875655 -878550 -881692 -884904 -878454 -870477 -866496 -859598 -856054 -855841 -861186
6910 -861186 -862736 -863305 -865529 -871260 -874587 -874932 -871499 -869026 -866214 -863715 -865160 -863157 -863187 -863338 -865677 -862406
6894 -862406 -855102 -851653 -846155 -850520 -858731 -862728 -860098 -864020 -863215 -861367 -855651 -855731 -866486 -867623 -866076
6879 -866076 -864335 -858930 -850928 -847515 -842281 -841618 -841924 -843425 -844172 -841443 -839733 -839312 -846398 -851697 -853115
6864 -853115 -852535 -851859 -847868 -853758 -853105 -849033 -852176 -848400 -847327 -849752 -840969 -836099 -838156 -839785 -846412
6849 -846412 -849208 -849003 -851068 -842329 -833175 -839764 -847737 -848392 -845167 -835740 -834491 -834063 -834355 -834572 -840209 -840772
6833 -840772 -838018 -841851 -838811 -836532 -837619 -834542 -838345 -840344 -832745 -828829 -830961 -835188 -835214 -831783 -826515
6818 -826515 -826007 -831589 -831247 -830250 -826775 -819685 -814506 -811336 -810812 -816337 -818745 -815667 -812472 -812272 -812178 -815468
6802 -815468 -812085 -806707 -807658 -808864 -805060 -807818 -804641 -795250 -789016 -796890 -801219 -799500 -800114 -800192 -796402
6787 -796402 -792875 -794443 -788127 -790831 -797399 -794012 -793130 -788139 -786650 -791790 -789706 -780129 -776415 -777029 -779629
6772 -779629 -778422 -772480 -766730 -766886 -761475 -750140 -747575 -748166 -745031 -742373 -743531 -745348 -742475 -739222 -731059
6757 -731059 -727197 -725974 -722313 -724002 -727181 -725967 -724745 -725382 -724124 -716125 -709265 -702111 -692589 -684544 -675565
6742 -675565 -671492 -661892 -651868 -646942 -640150 -635775 -633999 -627383 -616518 -599209 -583164 -572675 -553513
6729 -553513 -551507 -572398 -597711 -604721 -588650 -565673 -540130 -524474 -508227 -487028 -463742 -433019
6717 -433019 -392480 -339855 -292712 -238536 -168449 -88189 19221 151259 305145 463412 574309
6706 574309 500991 9930 -1011805 -1988249 -2330519 -2255970 -2086174 -1927855 -1788477 -1678779
6696 -1678779 -1595660 -1527640 -1465856 -1406324 -1361415 -1327360 -1290612 -1259768 -1234371 -1217326 -1194688
6685 -1194688 -1166370 -1138713 -1117894 -1105490 -1109984 -1120928 -1133048 -1129820 -1116868 -1101967 -1091227 -1084516
6673 -1084516 -1071756 -1060141 -1049353 -1043173 -1034674 -1029549 -1023459 -1017855 -1014402 -1007992 -1015800 -1021197 -1014541
6660 -1014541 -1011496 -1004141 -996508 -987195 -982593 -980029 -983352 -988555 -983404 -975150 -974437 -974685 -972201 -968728 -957442
6645 -957442 -949324 -942514 -939942 -938768 -931788 -938285 -944592 -940982 -935093 -940884 -944496 -936037 -931594 -927296
6631 -927296 -925517 -928990 -930733 -931460 -929987 -929134 -928316 -923991 -922895 -917782 -913504 -908256 -906877 -908054 -904715
6616 -904715 -903651 -904935 -907894 -905371 -904837 -907065 -907982 -905281 -896388 -898969 -905307 -901937 -901976 -903275 -901194
6601 -901194 -897575 -899615 -903420 -897575 -892485 -894256 -889699 -890766 -890428 -889602 -890587 -885570 -876611 -876734 -887255
6586 -887255 -889625 -889905 -892480 -888667 -890758 -886058 -886599 -882512 -881318 -877196 -873706 -875402 -883813 -882549 -881347
6571 -881347 -873145 -869680 -868434 -872632 -876078 -875283 -879398 -884688 -888115 -882852 -872446 -863031 -860423 -862319
6557 -862319 -864270 -874151 -880804 -878701 -879597 -878794 -878231 -879640 -878687 -872872 -868069 -866409 -868212 -871603 -864344
6542 -864344 -867432 -864749 -857992 -862415 -866916 -872180 -868383 -870892 -873793 -865805 -855035 -854757 -856367 -853989
6528 -853989 -848458 -849499 -855721 -854380 -849445 -846598 -844456 -853001 -853661 -854249 -857635 -852009 -850190 -852452 -846124
6513 -846124 -842378 -837814 -834722 -832889 -833660 -841556 -854310 -849806 -837061 -836542 -843141 -847288 -842892 -838212
6499 -838212 -844300 -849059 -850573 -844933 -841246 -846923 -850043 -848005 -845796 -845971 -842818 -835961 -836985 -840471 -842056
6484 -842056 -840958 -837979 -836010 -830169 -823724 -827739 -835674 -835543 -831365 -832189 -827401 -832499 -836487 -839874 -836800
6469 -836800 -840735 -848447 -849782 -846286 -846621 -849222 -848276 -838188 -829510 -827630 -829996 -831614 -830852 -821137 -821442
6454 -821442 -823405 -820076 -821136 -827232 -830923 -830721 -824069 -825186 -824095 -820129 -816663 -817490 -815160 -812619 -815411
6439 -815411 -814094 -811754 -817245 -825441 -829149 -824476 -825410 -827224 -820386 -817331 -821944 -824026 -826071 -821407 -820331
6424 -820331 -822027 -830878 -841448 -838713 -830804 -825564 -825462 -823600 -819234 -817083 -814307 -820921 -821562 -821523 -821261
6409 -821261 -817639 -817782 -816423 -817342 -817215 -807226 -800325 -801339 -800050 -802695 -808733 -807787 -812649 -815001 -809012
6394 -809012 -804797 -811077 -816733 -817363 -815809 -820317 -820342 -817768 -817977 -817792 -817096 -816806 -813918 -812836 -811646 -807545
6378 -807545 -810413 -815472 -817672 -818014 -812267 -813335 -817166 -817200 -813866 -816298 -814874 -813637 -814408 -806751 -801655
6363 -801655 -800854 -804263 -804336 -805596 -808086 -810062 -804652 -801989 -803053 -807644 -812978 -813652 -819622 -819048 -812717 -803064
6347 -803064 -802668 -803456 -802532 -802322 -809033 -808079 -811414 -812274 -806916 -803194 -805169 -803959 -795316 -798161 -805779 -799375
6331 -799375 -795785 -796946 -799946 -804362 -804621 -804136 -801424 -801692 -801773 -802441 -808825 -806978 -808231 -810014 -796991 -795367
6315 -795367 -788133 -785464 -792648 -804399 -808744 -798409 -790937 -790090 -789497 -792345 -791269 -791217 -794242 -792432 -792356
6300 -792356 -789064 -783289 -781130 -785262 -788562 -791867 -796863 -806883 -802396 -793152 -792590 -792233 -792846 -792753 -792908 -786911
6284 -786911 -786350 -786482 -785892 -782775 -777914 -782210 -790167 -793379 -798057 -800081 -795345 -794509 -791985 -792355 -794670 -790365
6268 -790365 -779800 -771795 -770966 -778183 -787844 -788439 -783567 -782017 -787204 -792008 -795419 -788608 -787395 -784013 -789142
6253 -789142 -788561 -783785 -777878 -774295 -777567 -782482 -783176 -778699 -773666 -773099 -779900 -783968 -776557 -777641 -789373
6238 -789373 -784807 -773124 -767591 -767289 -773187 -775976 -770761 -767223 -776125 -775686 -776978 -776791 -779766 -774177 -766176
6223 -766176 -771023 -778249 -777625 -773611 -775898 -781146 -779527 -778927 -777805 -773691 -771529 -776660 -781388 -776841 -764278
6208 -764278 -769759 -778612 -784430 -782360 -779768 -772978 -769641 -774260 -782343 -783146 -773006 -770004 -774436 -766529
6194 -766529 -761148 -764377 -764867 -770536 -779012 -781905 -769848 -770711 -773506 -771374 -766580 -764622 -772783 -776201 -776434
6179 -776434 -774775 -770824 -768276 -774053 -774905 -766731 -767103 -767855 -760995 -761919 -763675 -765627 -759525 -757581 -763501
6164 -763501 -760467 -755956 -754277 -750862 -751623 -758289 -760741 -758319 -752712 -758029 -765783 -766714 -766183 -770092 -770762
6149 -770762 -760083 -756287 -755595 -753105 -754403 -756845 -758764 -756303 -759946 -756300 -756528 -751262 -748415 -747757 -752854
6134 -752854 -760702 -762280 -764684 -764301 -758699 -755110 -756222 -758912 -754796 -754750 -757551 -757774 -762846 -759829 -754036
6119 -754036 -747254 -741558 -740626 -746421 -746560 -744113 -744634 -754977 -756205 -754618 -749168 -746638 -748763 -752509 -754596
6104 -754596 -760873 -759783 -755183 -755221 -752727 -750869 -742395 -744952 -752776 -755358 -758764 -765098 -771091 -771890 -759742
6089 -759742 -751245 -752979 -749821 -747213 -758118 -761550 -761249 -755345 -750602 -751908 -751405 -744972 -738776 -739140 -743749
6074 -743749 -746640 -745285 -741332 -748123 -752373 -755082 -757787 -753204 -750759 -751323 -752616 -746369 -745868 -744231 -735133
6059 -735133 -739443 -746182 -748974 -749001 -741368 -737110 -740714 -738800 -732107 -729693 -730333 -735574 -737806 -740322 -745388
6044 -745388 -747221 -746948 -743753 -742879 -737868 -736237 -740185 -745201 -745513 -746000 -746583 -742735 -734744 -724576 -728212
6029 -728212 -733646 -731725 -727945 -738874 -739789 -734411 -734568 -744988 -747054 -743144 -746329 -742941 -737850 -740068
6015 -740068 -741636 -739341 -740022 -742084 -739363 -734445 -733487 -732812 -735027 -735402 -741954 -746141 -744545 -741240 -741748 -745222
5999 -745222 -739823 -738478 -745035 -744458 -739642 -742412 -739698 -731355 -730657 -735614 -733864 -730233 -729547 -731579 -736889
5984 -736889 -734823 -731176 -725901 -726165 -727836 -729166 -732117 -729325 -731415 -727178 -726280 -733965 -734211 -732426 -733145
5969 -733145 -731970 -734879 -729406 -734410 -732645 -730316 -730866 -729083 -725480 -722435 -726195 -734418 -737039 -734144 -727563
5954 -727563 -723101 -722525 -724832 -720273 -729113 -729088 -724601 -722150 -730502 -730078 -723041 -725530 -733496 -731368 -726245
5939 -726245 -730827 -721993 -714398 -721084 -727279 -731955 -733717 -733447 -727259 -729874 -729393 -729775 -730999 -732778 -725716
5924 -725716 -715983 -716701 -721685 -722249 -722888 -723049 -723444 -715216 -706344 -706066 -706734 -709710 -713713 -718676 -721742 -723942
5908 -723942 -723522 -719612 -721885 -718653 -715104 -718033 -716104 -713416 -719181 -714658 -709650 -708290 -715712 -722199 -721001
5893 -721001 -719773 -719883 -715975 -716835 -721716 -719617 -719666 -714308 -716767 -719437 -717219 -719273 -722123 -719683 -718634
5878 -718634 -719517 -720350 -716051 -716079 -718802 -719246 -718053 -722663 -726283 -723178 -716827 -718416 -721047 -718946 -717398 -710374
5862 -710374 -708941 -717005 -713663 -717268 -715345 -715616 -716104 -713265 -712386 -715662 -714783 -715356 -715347 -714224 -710039 -711034 -711973
5845 -711973 -707079 -710520 -710401 -706505 -706166 -702484 -697363 -695566 -693411 -695968 -700524 -701259 -698107 -696806 -703017
5830 -703017 -706889 -709066 -709292 -711965 -715492 -712811 -711452 -708059 -707917 -711184 -713023 -718006 -715331 -710899 -710145
5815 -710145 -708042 -698564 -695543 -694051 -705125 -712561 -714033 -704518 -698686 -696326 -701369 -709042 -713015 -710878
5801 -710878 -711657 -709821 -708652 -711211 -708204 -707161 -698749 -698288 -701548 -703232 -704758 -699752 -703088 -708102 -709409
5786 -709409 -708624 -709145 -703394 -697984 -703212 -710093 -711805 -712017 -704434 -698886 -695003 -688918 -701795 -710742 -709458
5771 -709458 -707692 -701167 -696541 -693719 -691227 -692183 -695052 -689754 -688285 -692881 -698675 -697562 -695867 -696337 -696996
5756 -696996 -695174 -696252 -703103 -703101 -691803 -689037 -690145 -685559 -683095 -687914 -696187 -698662 -701739 -701588 -700233
5741 -700233 -699257 -698037 -691999 -691423 -696041 -702431 -703690 -701576 -700833 -699290 -696008 -693321 -687397 -686120 -688875
5726 -688875 -685518 -688537 -692511 -694054 -693919 -692638 -687963 -689122 -692963 -694958 -689936 -687806 -684811 -678663 -674325
5711 -674325 -673655 -673563 -671729 -669116 -668199 -673704 -671001 -675917 -680577 -682529 -680548 -677870 -680037 -682297 -673139
5696 -673139 -677511 -687565 -702631 -703646 -698330 -693665 -693090 -698970 -693845 -689622 -688979 -692060 -687755 -681206
5682 -681206 -677322 -680354 -687285 -686467 -678598 -679683 -688995 -689799 -695006 -694587 -693064 -691869 -687864 -680525 -677926
5667 -677926 -674643 -676286 -679533 -675117 -671229 -674369 -679896 -682611 -683225 -680371 -682033 -684658 -680706 -682650 -676805
5652 -676805 -678759 -683697 -683714 -677629 -677151 -681086 -678090 -671990 -680196 -682732 -677683 -682444 -689506 -690113 -692428
5637 -692428 -690718 -678000 -672800 -677693 -678664 -672616 -674556 -672754 -676075 -672741 -665788 -668582 -670987 -673819
5623 -673819 -674905 -676786 -682199 -685708 -687601 -684696 -685635 -680826 -677615 -670533 -670052 -673013 -675354 -681641 -677157
5608 -677157 -677525 -676297 -670535 -673417 -684143 -691607 -687923 -677347 -673560 -674375 -677313 -674726 -669694 -668552
5594 -668552 -669797 -668142 -662181 -662259 -662372 -663240 -662112 -662793 -663916 -666892 -667745 -669943 -665810 -666367 -672925 -675692
5578 -675692 -673866 -666647 -662130 -668410 -673177 -674619 -674176 -668397 -669411 -670676 -673535 -678507 -684734 -679903 -676675
5563 -676675 -676364 -676074 -675685 -678228 -678843 -681957 -673809 -668883 -669897 -667482 -667605 -665507 -662003 -662082 -660605 -658530
5547 -658530 -658288 -663668 -660894 -661400 -662668 -658680 -658929 -658950 -658514 -662586 -667099 -666992 -666657 -664948 -658153 -661234
5531 -661234 -660776 -657367 -663822 -663472 -656277 -657243 -659862 -653768 -649996 -657181 -660835 -661540 -661410 -661537 -662707 -657636
5515 -657636 -652840 -654113 -662632 -660532 -656140 -655003 -657378 -666445 -673311 -673683 -667180 -661893 -664763 -667143 -668555
5500 -668555 -669987 -670489 -674114 -672992 -673226 -678094 -678256 -669593 -666006 -662701 -661098 -665716 -656966 -645802 -646591
5485 -646591 -649274 -653014 -655987 -649034 -647029 -647602 -650276 -655039 -656212 -655460 -659898 -660564 -661357 -661361 -660314 -657716
5469 -657716 -658669 -658877 -657764 -663350 -665549 -666402 -665339 -662450 -662749 -664014 -660021 -657164 -659346 -661313 -654083
5454 -654083 -648539 -653284 -654470 -652113 -647994 -646990 -651739 -657146 -656075 -646804 -648811 -645030 -646458 -649660
5440 -649660 -650068 -650505 -657205 -654662 -654872 -653305 -653613 -656477 -658054 -651692 -646843 -649276 -652473 -659568 -663050
5425 -663050 -666230 -669258 -667172 -654886 -646948 -647246 -654485 -656317 -657246 -650341 -650978 -654881 -650189 -647096 -646645
5410 -646645 -641527 -639505 -641817 -642552 -646766 -645927 -646573 -654892 -654705 -653953 -657290 -659491 -661454 -655259 -651868 -654984
5394 -654984 -650519 -646378 -655999 -662418 -660997 -653495 -641145 -638430 -636122 -641336 -650141 -655352 -658480 -653706
5380 -653706 -649884 -650200 -648420 -645690 -639482 -640322 -643935 -651670 -658262 -662446 -659198 -657059 -651967 -649848 -651141
5365 -651141 -647271 -649093 -656036 -654059 -652852 -646803 -647261 -643712 -638383 -631642 -634812 -636381 -636053 -640276 -651895
5350 -651895 -658291 -661886 -655626 -648131 -642099 -635856 -638740 -636421 -636290 -635255 -634391 -642106 -643102 -643488 -642188
5335 -642188 -640880 -634600 -630655 -636292 -636872 -632852 -636637 -641074 -640294 -640744 -640795 -641845 -638065 -635887 -631530 -631771
5319 -631771 -635204 -637524 -635856 -638087 -638778 -637194 -636552 -640303 -646517 -645841 -640218 -637538 -635290 -636889 -638666
5304 -638666 -633891 -634336 -638102 -643455 -640837 -645694 -643276 -647692 -646962 -631246 -624437 -627349 -637275 -637476 -636236
5289 -636236 -632633 -632345 -636042 -631108 -630452 -639368 -640201 -635846 -637830 -638340 -635050 -624338 -629256 -637123 -633704
5274 -633704 -637082 -640560 -637615 -634082 -627193 -622841 -617722 -621056 -624032 -630090 -634244 -640439 -640596 -632604 -628980
5259 -628980 -627417 -628751 -631662 -633990 -628936 -632433 -635146 -633106 -632469 -630421 -634829 -634927 -632249 -635728 -628048
5244 -628048 -623678 -618583 -620090 -623938 -628671 -627175 -624618 -625183 -632490 -637909 -637461 -632564 -633411 -625655 -621413
5229 -621413 -622967 -624081 -628400 -631402 -638759 -632577 -626465 -625813 -625321 -625229 -622989 -620519 -619928 -617781 -622810 -622291
5213 -622291 -619672 -622776 -620128 -619089 -621227 -623050 -630598 -634381 -636086 -634222 -629772 -628352 -629191 -629893 -628266
5198 -628266 -625399 -629200 -634071 -629186 -626662 -623412 -625017 -633537 -636986 -634601 -626942 -627259 -620415 -613972 -616217
5183 -616217 -619111 -618469 -618833 -624113 -631092 -633327 -633098 -630200 -624571 -621908 -625062 -622364 -625337 -628203 -631671
5168 -631671 -628742 -628737 -624531 -621010 -626285 -628014 -621743 -623038 -622984 -617382 -614047 -615908 -619044 -616901 -614622 -616493
5152 -616493 -627322 -626029 -621135 -619936 -625885 -626162 -619345 -603930 -608772 -616468 -612820 -610657 -608905 -609386
5138 -609386 -611696 -616423 -616977 -612702 -621844 -624190 -622033 -625726 -628820 -629417 -623507 -615527 -616303 -622700 -630130
5123 -630130 -627619 -624764 -623248 -621843 -620457 -627741 -629057 -627268 -623786 -623935 -615402 -611648 -609800 -611173 -613702
5108 -613702 -615318 -607213 -609585 -612395 -606467 -600835 -608214 -616738 -618725 -612886 -611490 -616245 -615331 -614409 -613354
5093 -613354 -612947 -611683 -614127 -617734 -616475 -616829 -616945 -608709 -605397 -599659 -594549 -601791 -604825 -604133 -606567
5078 -606567 -602360 -605274 -609914 -613382 -616422 -614764 -612889 -614418 -616371 -617961 -622652 -616699 -608576 -611455
5064 -611455 -619934 -617901 -621312 -618197 -619086 -623432 -625192 -620680 -612517 -614649 -616862 -614144 -614921 -617047 -619211
5049 -619211 -616635 -614979 -611233 -613543 -609109 -611308 -610213 -605025 -603967 -602492 -603459 -616479 -621976 -612200
5035 -612200 -602328 -593352 -598354 -606141 -603272 -595107 -595422 -601409 -601996 -598544 -598913 -600572 -596250 -595203 -590985
5020 -590985 -587185 -589373 -600837 -608480 -610777 -611532 -605036 -602397 -596318 -596721 -601359 -596052 -594711 -593383 -596560
5005 -596560 -589578 -591955 -594959 -598804 -601735 -600278 -594203 -592762 -599624 -606090 -603713 -604701 -604462 -607995 -610216
4990 -610216 -605040 -603725 -602846 -600071 -598145 -590275 -588720 -594412 -597279 -596125 -601676 -606308 -606819 -611704 -606680
4975 -606680 -600882 -594959 -592408 -595576 -595087 -595063 -597941 -599939 -600582 -600027 -596584 -594501 -595683 -598979 -603443 -601664
4959 -601664 -598887 -598812 -597962 -594616 -590225 -590831 -587457 -579887 -587284 -590964 -591151 -594369 -588536 -585287 -589533 -588351
4943 -588351 -584970 -583426 -586845 -590693 -597625 -595201 -596875 -598320 -600246 -606153 -613580 -616161 -615795 -608140 -599928
4928 -599928 -602227 -601290 -599732 -599211 -601951 -603764 -599739 -595043 -592934 -590877 -589659 -590222 -595616 -599372 -598843
4913 -598843 -602656 -606844 -602226 -596663 -597146 -601115 -605438 -600942 -594353 -593737 -592948 -596898 -597826 -598981 -598801 -603590
4897 -603590 -599303 -586926 -583523 -579234 -575404 -574195 -584047 -589780 -593437 -589618 -584126 -583415 -585639 -592226
4883 -592226 -594372 -592969 -587595 -579736 -574194 -575969 -577235 -577022 -581344 -586747 -580224 -582511 -594268 -590541
4869 -590541 -584528 -587913 -584608 -580603 -584309 -586833 -590872 -592654 -595851 -596630 -594347 -592566 -594361 -592445 -595393
4854 -595393 -591533 -587696 -586999 -602528 -603368 -599452 -594209 -591908 -588385 -588261 -582893 -582166 -588318 -589725 -590147
4839 -590147 -593642 -598593 -592675 -588271 -582313 -578853 -580085 -587871 -582066 -577076 -583762 -582942 -580629 -579079 -580933
4824 -580933 -579999 -573726 -575842 -574339 -575927 -587044 -590713 -588659 -585018 -583773 -588474 -592547 -590398 -586899
4810 -586899 -583136 -588466 -591166 -585589 -584078 -581663 -576469 -575631 -576501 -571045 -570415 -579487 -583236 -582302 -577156
4795 -577156 -575121 -576598 -574492 -571865 -571543 -575508 -582744 -584102 -582419 -579958 -582675 -585081 -585046 -586400 -584338
4780 -584338 -586073 -588613 -587671 -590080 -584281 -583688 -586936 -586144 -583297 -586652 -590394 -584650 -582846 -583207 -583758 -580587
4764 -580587 -583288 -584540 -591233 -591818 -589040 -589017 -586248 -583527 -577813 -582166 -579155 -573193 -573694 -576917 -577952
4749 -577952 -575711 -572784 -570080 -573301 -571334 -571288 -574277 -581795 -578776 -574554 -580155 -579918 -573658 -569357 -574616
4734 -574616 -580113 -580871 -582826 -580458 -581698 -578325 -577859 -575766 -580365 -583165 -577742 -569190 -574186 -578730 -573608
4719 -573608 -573381 -575189 -576326 -573505 -569861 -570587 -568401 -569402 -566927 -573086 -577292 -571980 -568637 -566595 -576009
4704 -576009 -579811 -574999 -573334 -570734 -575643 -578603 -576711 -578643 -579792 -580807 -581754 -570654 -562732 -560356
4690 -560356 -552965 -555981 -562216 -574067 -576221 -571959 -569808 -564024 -560671 -561150 -570165 -577760 -579421 -574743
4676 -574743 -569782 -570108 -569065 -569932 -566773 -565492 -569372 -572862 -572932 -575627 -575317 -577007 -577536 -574695 -571050 -568938
4660 -568938 -568005 -572795 -573233 -567885 -559680 -558663 -563003 -568446 -573642 -579844 -577029 -576551 -574687 -576711 -570579
4645 -570579 -563891 -566210 -563096 -558151 -567514 -571792 -570369 -569508 -570482 -572563 -570245 -573746 -578793 -574461 -566950
4630 -566950 -560628 -564343 -567223 -573634 -579126 -574751 -572540 -580172 -586812 -579304 -571008 -570014 -565132 -563304 -563013
4615 -563013 -561810 -559393 -562649 -569006 -573134 -566985 -565758 -574031 -571153 -562617 -559442 -562370 -568823 -568018 -567600
4600 -567600 -566042 -569421 -570399 -566268 -566462 -564914 -565340 -567453 -568632 -569045 -569271 -564895 -564717 -569839 -565508 -564018
4584 -564018 -568059 -565253 -559154 -556324 -555309 -552582 -553661 -561780 -568473 -570328 -566428 -563425 -561749 -560431
4570 -560431 -557845 -554175 -553076 -556829 -563529 -568098 -565600 -561593 -552563 -549910 -549094 -553636 -564366 -566939
4556 -566939 -562132 -562494 -566509 -564695 -562414 -562780 -560601 -556804 -561841 -563793 -559232 -554397 -554510 -558504 -561613
4541 -561613 -562580 -568003 -572134 -574668 -571834 -569203 -567763 -571680 -569894 -563699 -562466 -564860 -565271 -563582 -565606
4526 -565606 -566268 -567354 -564577 -563989 -559274 -553563 -553967 -549818 -552482 -547490 -549012 -556227 -546238 -545581 -548986
4511 -548986 -550303 -556589 -558118 -556661 -552318 -548691 -549759 -554653 -559816 -560503 -559948 -555941 -553139 -554607 -558368
4496 -558368 -560971 -556331 -555934 -557697 -559632 -556876 -547568 -545517 -551859 -558725 -560825 -559860 -560860 -554913 -557292
4481 -557292 -562971 -556369 -561132 -562166 -559438 -554609 -545788 -540595 -543766 -542648 -544531 -545323 -551159 -553166 -556997
4466 -556997 -554094 -549463 -545585 -548591 -550513 -549828 -552041 -547739 -542248 -550978 -550462 -549466 -548300 -545579 -545931
4451 -545931 -545175 -541303 -542545 -550552 -553458 -556413 -548629 -546215 -548918 -555647 -550501 -548261 -551642 -556546 -557074
4436 -557074 -549909 -552858 -554036 -549743 -547922 -545658 -545688 -548707 -549357 -555694 -554154 -549100 -551165 -557519 -557906
4421 -557906 -554995 -551761 -553699 -546869 -542327 -538788 -533095 -535000 -534457 -540744 -543949 -545187 -544763 -545012 -542597
4406 -542597 -545650 -546296 -551126 -553765 -550961 -549092 -547332 -544843 -546190 -542159 -543936 -551052 -552689 -555382 -556504
4391 -556504 -557637 -552073 -548201 -544760 -549590 -547015 -548041 -543335 -543182 -548778 -550213 -547917 -549188 -543963 -539019
4376 -539019 -538907 -548766 -553586 -553267 -549109 -543382 -546096 -542387 -541088 -543214 -541006 -543325 -544603 -543377 -543609
4361 -543609 -543169 -539928 -545123 -545280 -540590 -537552 -535849 -539686 -539629 -532959 -534724 -540198 -550895 -552295 -544120
4346 -544120 -545675 -545006 -544717 -547089 -537045 -535133 -542303 -546476 -549424 -554039 -557038 -559664 -553519 -547229 -547649
4331 -547649 -541200 -538218 -537765 -533127 -535679 -539623 -537644 -537000 -540423 -545331 -548457 -543620 -539552 -539391 -544885
4316 -544885 -547327 -541966 -539525 -544567 -537700 -536175 -541792 -548119 -551697 -548300 -543295 -528488 -521097 -525239
4302 -525239 -524592 -522275 -526715 -525881 -524833 -524344 -530397 -533864 -531166 -536295 -534577 -532903 -535646 -531925 -527568
4287 -527568 -528093 -536222 -540729 -541880 -542128 -545541 -541059 -533247 -537246 -534662 -532791 -531413 -529714 -534130 -540643
4272 -540643 -541468 -537818 -536401 -534022 -534987 -535550 -534217 -539095 -540968 -534901 -535479 -538193 -532475 -532567 -535557 -535151
4256 -535151 -530803 -534437 -532951 -531044 -535499 -542575 -536893 -536460 -529032 -527593 -522915 -528424 -533841 -534484 -537722
4241 -537722 -540033 -538274 -533800 -533927 -535102 -537007 -539242 -535689 -529723 -523076 -523548 -529472 -532289 -528608 -526152
4226 -526152 -519385 -518441 -521681 -517787 -520396 -524725 -523690 -529568 -532499 -533295 -539546 -536088 -531781 -534210 -539211
4211 -539211 -543866 -536980 -535170 -530175 -528995 -529782 -528033 -522267 -524481 -523471 -525708 -522148 -519646 -527034 -532236
4196 -532236 -532578 -531103 -532077 -536936 -536298 -531168 -525354 -528078 -529576 -526767 -523930 -521993 -524992 -525034 -523058 -525943
4180 -525943 -527010 -530550 -533669 -542648 -535928 -528723 -527135 -530200 -531867 -526917 -527837 -530284 -531083 -530242 -523611
4165 -523611 -525892 -528841 -521058 -519213 -523526 -526868 -530910 -529800 -528610 -524560 -520303 -522509 -520664 -519127
4151 -519127 -526225 -528606 -525683 -524530 -521578 -526259 -530614 -522487 -515053 -517749 -522609 -524438 -525645 -520030
4137 -520030 -523731 -532027 -530395 -520780 -527512 -532845 -535630 -529852 -524342 -524550 -523294 -518623 -520013 -518065 -517277
4122 -517277 -520314 -521560 -517847 -514922 -520749 -528954 -533653 -532895 -537703 -536051 -533586 -530280 -528708 -523258 -521690
4107 -521690 -526069 -523305 -525310 -519307 -515624 -516008 -519426 -518463 -519528 -523912 -527598 -530991 -530799 -524744 -520524
4092 -520524 -518464 -524943 -531644 -531356 -531556 -524524 -523238 -518357 -514182 -506915 -508131 -516039 -516626 -519887 -520743
4077 -520743 -527455 -530478 -529435 -522062 -519989 -518193 -519480 -518687 -518652 -523900 -522664 -525325 -526641 -527349 -527829 -525624
4061 -525624 -521747 -521243 -526273 -531095 -528457 -526192 -525762 -516037 -516143 -519169 -516063 -514440 -514142 -523901 -528051
4046 -528051 -524467 -518762 -520546 -525952 -524749 -518099 -517114 -519275 -517097 -513610 -508472 -502422 -504016 -508066 -513481
4031 -513481 -515725 -518312 -521629 -521055 -522758 -527391 -530210 -524401 -520551 -515774 -516042 -513102 -514668 -521657 -523320
4016 -523320 -525681 -522591 -520633 -520757 -520090 -518889 -520749 -521116 -515866 -520052 -520490 -519412 -523857 -528600 -525574
4001 -525574 -517207 -516297 -518506 -521943 -522331 -518556 -512860 -506976 -508272 -513736 -504654 -502595 -505254 -505908 -505997 -510672
3985 -510672 -514940 -513949 -515410 -525956 -526810 -522538 -526460 -528367 -520790 -511434 -511690 -512850 -512463 -513527 -516260
3970 -516260 -513098 -507345 -512839 -511342 -505169 -505893 -510444 -511549 -508146 -506402 -507890 -507883 -503366 -504557 -506893
3955 -506893 -506206 -508351 -511907 -512850 -516205 -519545 -514676 -513093 -515059 -510116 -511728 -519146 -517081 -511369 -507627
3940 -507627 -515481 -515034 -513756 -514453 -511979 -510769 -508342 -505950 -507518 -508579 -510915 -510112 -505371 -497958 -504965
3925 -504965 -510827 -514897 -514495 -516315 -512622 -515743 -516627 -515567 -507954 -514399 -519781 -519901 -508987 -504142 -506678
3910 -506678 -505226 -503916 -497615 -501148 -509414 -507207 -503156 -500674 -500909 -500398 -500805 -500297 -504961 -510794 -508881
3895 -508881 -503684 -500361 -503108 -508780 -506148 -498529 -496256 -502076 -502974 -506235 -507003 -509294 -506972 -507374 -507497
3880 -507497 -503287 -504006 -505565 -503219 -502829 -502793 -501407 -502460 -502588 -504546 -506733 -508571 -509531 -507006 -506879 -504648
3864 -504648 -500202 -506521 -517985 -520002 -517525 -524235 -524270 -512044 -502910 -507478 -505977 -505679 -505358 -503670 -499798
3849 -499798 -499982 -499963 -498832 -505743 -511272 -511458 -510969 -511974 -515405 -514740 -509296 -507813 -517079 -518452 -516884 -510739
3833 -510739 -503981 -500536 -503071 -501601 -499574 -501070 -503314 -505243 -502252 -499979 -494586 -500506 -509032 -505541
3819 -505541 -499204 -495924 -495273 -494021 -499218 -500407 -496387 -493772 -497070 -502478 -502383 -496508 -492962 -489945 -491874
3804 -491874 -499627 -502125 -499811 -498512 -503414 -503187 -502565 -499618 -498316 -497496 -499555 -499458 -501504 -500852 -502517 -504343
3788 -504343 -502445 -498569 -495376 -491250 -489272 -495577 -500059 -498217 -497060 -500786 -503097 -503449 -499248 -499030 -500593
3773 -500593 -502388 -508359 -511005 -501501 -493886 -496912 -499305 -497326 -497883 -503536 -512044 -510556 -503865 -503872 -499124
3758 -499124 -496671 -495614 -497703 -507371 -509685 -504844 -496893 -494234 -492822 -488544 -491716 -493897 -496210 -500427
3744 -500427 -495176 -491332 -496945 -491401 -483342 -483986 -487359 -487880 -489011 -486377 -481693 -483683 -489656 -491677 -494777
3729 -494777 -485406 -481917 -485676 -490382 -490518 -491856 -490284 -491466 -493951 -495148 -492170 -493201 -494353 -494807 -492807
3714 -492807 -485616 -491110 -492390 -491847 -496943 -498728 -495836 -496431 -500055 -495826 -491199 -495526 -498071 -500034 -498458
3699 -498458 -494854 -488431 -491594 -497426 -492897 -495900 -499621 -494887 -491138 -486509 -482802 -480805 -479021 -484334
3685 -484334 -490433 -490654 -493449 -494168 -490808 -489404 -487022 -490355 -496370 -492602 -490304 -488665 -490201 -494851 -496025
3670 -496025 -494165 -490948 -494998 -492505 -491219 -492544 -488162 -484536 -481104 -485427 -492585 -498858 -489965 -482063
3656 -482063 -481760 -482937 -484586 -489908 -483777 -476472 -478994 -479513 -479602 -484120 -484457 -478464 -482866 -487605 -491932 -495189
3640 -495189 -490107 -478001 -482382 -491864 -494625 -493154 -489041 -495852 -497668 -500596 -502682 -501546 -501971 -502134 -498068
3625 -498068 -496702 -502335 -502976 -499567 -499628 -492856 -493970 -496178 -506446 -506728 -500884 -496777 -495761 -495128 -495364 -486390
3609 -486390 -482079 -481982 -479547 -481203 -483619 -485431 -489703 -491395 -488390 -483690 -487129 -490686 -493087 -487621 -491513
3594 -491513 -505014 -509741 -503227 -495446 -483707 -478947 -480278 -477420 -481539 -484283 -485308 -490258 -491712 -490775
3580 -490775 -489333 -494801 -491590 -487902 -489705 -494114 -496310 -496916 -498963 -496439 -497682 -498189 -498320 -497780 -498582 -495464
3564 -495464 -493477 -492489 -494618 -498130 -498018 -486231 -479926 -480696 -482815 -475958 -482597 -491156 -484272 -479192 -483266
3549 -483266 -485298 -488329 -491856 -490749 -484240 -484446 -485766 -491389 -488891 -484468 -483184 -482320 -474031 -471659 -469359
3534 -469359 -468028 -478846 -485531 -488092 -488329 -485152 -484446 -480010 -481076 -479067 -478854 -480967 -480486 -482065 -483713
3519 -483713 -482893 -483245 -481922 -478425 -482956 -478395 -475298 -476984 -469656 -476633 -481623 -477087 -478977 -475297 -472880
3504 -472880 -471147 -475392 -481265 -485503 -490511 -492218 -488520 -489223 -485291 -484915 -489171 -480711 -475622 -475872 -474197
3489 -474197 -479819 -484282 -490187 -493870 -492411 -487043 -478815 -472134 -473690 -475003 -481332 -483957 -483764 -481905 -479827
3474 -479827 -487023 -491700 -495322 -499684 -499646 -492987 -478153 -476236 -475724 -475655 -478693 -480053 -481083 -484670 -486060
3459 -486060 -481002 -472311 -466868 -466234 -469852 -473221 -477889 -484729 -484830 -478818 -483178 -483114 -479348 -481947 -479429
3444 -479429 -474405 -473241 -479233 -479695 -477063 -472772 -473355 -470262 -469999 -472179 -473210 -468480 -465522 -465243 -465538 -470920
3428 -470920 -476922 -481431 -473438 -469232 -473815 -470508 -466409 -471424 -474261 -475751 -477754 -479442 -483796 -484192 -478576
3413 -478576 -470215 -471739 -476773 -480937 -481898 -483895 -488505 -490721 -481615 -479334 -479035 -480083 -478057 -473629 -470752
3398 -470752 -472725 -473693 -467373 -465359 -468759 -466622 -465908 -468877 -470007 -471052 -475391 -475684 -471188 -466549 -466137
3383 -466137 -467338 -469437 -467594 -468726 -470632 -472467 -475520 -474000 -477596 -483778 -478848 -469551 -470585 -473549
3369 -473549 -478654 -484739 -484452 -477410 -475346 -475550 -474265 -479227 -479198 -476393 -476548 -477022 -473329 -474043 -472098 -472706
3353 -472706 -463354 -463542 -470589 -468583 -464988 -466811 -464061 -460626 -465009 -469864 -470815 -468913 -468448 -473365 -469232
3338 -469232 -464931 -464341 -463596 -467180 -465023 -463487 -471623 -472969 -469747 -466251 -465133 -467423 -465283 -465331 -470710
3323 -470710 -479132 -478503 -471834 -467558 -467335 -467168 -470251 -471189 -476263 -478575 -477714 -475379 -475155 -473551 -478058 -474547
3307 -474547 -465528 -470123 -473884 -469930 -466244 -467013 -469590 -465582 -464104 -469986 -468358 -464535 -465172 -462389 -458101
3292 -458101 -458206 -466874 -476989 -481659 -474777 -471703 -475907 -475301 -477409 -480516 -479460 -474507 -470738 -462104 -461887
3277 -461887 -461952 -461273 -463836 -461726 -463306 -464675 -467088 -463864 -470541 -469799 -465255 -473610 -477971 -478577 -470836 -469306
3261 -469306 -473298 -471099 -468626 -467380 -468092 -469899 -469819 -468786 -475742 -483354 -481338 -471597 -466774 -473165 -476228
3246 -476228 -468855 -468488 -470776 -474297 -474205 -470048 -462514 -460542 -465660 -467958 -464818 -468855 -471879 -478903 -475375
3231 -475375 -465770 -460538 -457114 -453553 -456410 -458565 -456800 -460659 -466209 -465153 -459556 -459369 -461121 -467759 -465380
3216 -465380 -468831 -470564 -465419 -466395 -464396 -466514 -468423 -463454 -460132 -457786 -458004 -457585 -462130 -464708 -464005
3201 -464005 -455982 -453894 -462643 -462993 -462114 -461764 -458461 -460385 -460286 -464765 -463911 -456982 -450857 -445801 -443362 -442663
3185 -442663 -450088 -456473 -467117 -470726 -469524 -468532 -471177 -468718 -463688 -463786 -463411 -458724 -459755 -460197 -460423 -463616
3169 -463616 -457676 -452930 -455686 -459555 -460214 -462539 -457480 -456533 -463014 -468356 -467462 -462662 -465523 -462562 -458073
3154 -458073 -454183 -454660 -458813 -462065 -465174 -465748 -461786 -454676 -446684 -449529 -456527 -465449 -457716 -452404 -452620
3139 -452620 -452973 -457571 -459161 -460977 -459317 -450621 -451218 -452178 -451070 -457539 -465177 -471751 -469962 -472104 -472471
3124 -472471 -466917 -466648 -461007 -458048 -458390 -459950 -459901 -462207 -462742 -460279 -465382 -461952 -456840 -455697 -458354 -458770
3108 -458770 -454238 -452016 -445635 -448996 -457977 -462682 -465934 -463070 -461666 -459903 -459030 -462371 -460678 -460662 -456760
3093 -456760 -461996 -464684 -463994 -463747 -458293 -453635 -455757 -457846 -458675 -461351 -464682 -466264 -465037 -465234 -456980
3078 -456980 -454715 -460201 -467147 -468180 -462361 -460563 -458761 -457350 -451702 -445078 -444611 -437994 -444458 -452603 -459320
3063 -459320 -463263 -460599 -458074 -459159 -460423 -465952 -465254 -461242 -453312 -447991 -452046 -457201 -449304 -446461 -445800
3048 -445800 -450307 -458855 -461020 -456609 -459360 -459433 -454195 -449691 -445119 -445935 -447469 -454628 -453313 -452276 -454939
3033 -454939 -452001 -450047 -449693 -454125 -452068 -454195 -453635 -450875 -445338 -443867 -445193 -448544 -450531 -453681 -453735
3018 -453735 -446498 -447859 -451231 -454951 -451116 -446101 -447019 -452886 -451321 -447753 -449205 -449276 -445210 -448725 -446604
3003 -446604 -445189 -447437 -445106 -449253 -448530 -449593 -453530 -455279 -455864 -453290 -452032 -449034 -454719 -456133 -453370
2988 -453370 -457709 -457648 -454901 -455152 -454090 -451084 -449870 -447763 -445599 -450687 -451684 -451062 -445566 -442472 -444045 -445315
2972 -445315 -453060 -452672 -445182 -440846 -444048 -456103 -454033 -446376 -446198 -444906 -444062 -440688 -443229 -442813 -450280
2957 -450280 -455057 -460767 -464137 -462872 -461788 -457754 -455234 -453367 -449231 -447978 -452364 -456549 -456893 -456247 -447295
2942 -447295 -444410 -454603 -461648 -458533 -456232 -453913 -450076 -448531 -452241 -452744 -452262 -446155 -442971 -439450 -440776
2927 -440776 -446210 -446703 -441217 -441122 -438760 -437737 -436946 -447773 -454895 -448139 -437231 -436361 -435916 -447016 -452227
2912 -452227 -454597 -448547 -451227 -453852 -456630 -447027 -439144 -445162 -444899 -440865 -438315 -439463 -446717 -451628 -449145
2897 -449145 -447083 -443137 -435450 -434263 -435666 -438337 -441474 -439965 -441675 -443583 -446838 -448823 -451110 -447648
2883 -447648 -448663 -442085 -437634 -436332 -437233 -433005 -431413 -436951 -442620 -441524 -435960 -435034 -441896 -445518 -442600
2868 -442600 -442335 -440837 -442091 -444936 -444789 -444365 -444481 -436812 -430647 -436516 -440836 -440660 -437975 -436458 -438630 -434919
2852 -434919 -442443 -446587 -439963 -439017 -437677 -433467 -435594 -439577 -441651 -439773 -437139 -436406 -441829 -444365 -441498
2837 -441498 -447443 -445436 -449153 -453200 -456035 -444465 -439393 -448256 -451253 -446628 -439512 -437470 -440644 -441132
2823 -441132 -440536 -441707 -434472 -434065 -438584 -440082 -436865 -431613 -428661 -430112 -433757 -439874 -441970 -440359 -441062
2808 -441062 -439355 -440276 -444351 -444925 -434920 -425540 -429762 -431601 -430665 -435616 -441763 -440691 -442490 -440742 -434029
2793 -434029 -435568 -438642 -445582 -447257 -446043 -445248 -437316 -427463 -429304 -427893 -432209 -440996 -444112 -434679 -427426
2778 -427426 -423024 -431390 -442555 -440973 -439965 -443635 -439222 -437116 -436357 -434975 -442255 -446710 -443856 -438986
2764 -438986 -433670 -436878 -436412 -437190 -439200 -441395 -441011 -441841 -440017 -442838 -440118 -441926 -445298 -442789 -436008
2749 -436008 -433668 -431521 -429509 -430174 -430264 -422385 -423033 -432650 -436179 -436632 -432917 -431267 -427324 -423963 -424655 -424227
2733 -424227 -427225 -425252 -428573 -430832 -434985 -430296 -429634 -436162 -440556 -437584 -433729 -433677 -432066 -428293 -435297
2718 -435297 -433826 -422263 -415723 -422898 -432247 -436589 -438487 -443359 -447073 -444624 -446529 -447873 -447309 -437972
2704 -437972 -440153 -441886 -446212 -442003 -440799 -430755 -434995 -435712 -432259 -428547 -429571 -427511 -431501 -433770
2690 -433770 -429926 -429992 -438709 -436356 -433170 -432932 -432251 -439977 -439438 -431264 -426251 -433639 -434085 -427316 -430593 -436541
2674 -436541 -440938 -442528 -439828 -432736 -427302 -431712 -430171 -420962 -421200 -423756 -421219 -425525 -432428 -428451 -428387
2659 -428387 -424666 -422958 -418779 -420929 -421453 -420864 -428509 -433224 -433589 -430818 -426243 -424645 -429292 -431469 -433952
2644 -433952 -436221 -427444 -428088 -436559 -434201 -426625 -424188 -426150 -430152 -428852 -432756 -439932 -440017 -438496 -444943
2629 -444943 -443714 -440314 -435594 -429899 -430844 -435775 -438271 -440211 -442137 -442167 -441225 -439903 -435200 -431768 -432257 -433219
2613 -433219 -431002 -436010 -432991 -437278 -441531 -437291 -439420 -448151 -441420 -445569 -442854 -435355 -432380 -433256 -441340
2598 -441340 -435478 -436293 -441157 -435443 -434554 -432319 -430982 -428723 -427129 -426320 -430377 -430626 -427407 -431027 -430503 -432259
2582 -432259 -429712 -423994 -423015 -425943 -426305 -424166 -423628 -423285 -428596 -431730 -427403 -428530 -435760 -436919 -429720
2567 -429720 -434658 -428930 -429543 -431637 -429117 -421625 -422614 -422446 -427685 -431153 -430341 -432334 -435076 -433720 -430847
2552 -430847 -431088 -436153 -445098 -451892 -446328 -438946 -442412 -441677 -435711 -430164 -424021 -422298 -425302 -425883 -423691
2537 -423691 -424406 -424666 -418981 -420421 -425696 -429151 -428904 -431080 -434381 -436556 -441306 -440271 -428806 -421963 -421410
2522 -421410 -422002 -424366 -424033 -424842 -423549 -424534 -427039 -423769 -426850 -431513 -420648 -418832 -426831 -427170 -423448
2507 -423448 -427678 -432454 -425331 -421274 -420962 -420415 -424536 -426541 -427123 -421090 -418774 -418597 -417085 -418310 -418595 -418500
2491 -418500 -419875 -418663 -428998 -428418 -431931 -436366 -434627 -429660 -426524 -430128 -428445 -432278 -431950 -434344 -430659
2476 -430659 -425872 -426629 -423427 -418354 -424639 -423733 -425398 -423533 -426045 -426172 -427819 -430380 -432814 -434298 -428668
2461 -428668 -428906 -430043 -425030 -420769 -418092 -423316 -428435 -428702 -427667 -427632 -420955 -417568 -421749 -426070 -419711
2446 -419711 -423011 -427167 -423766 -416539 -413970 -417976 -424196 -422957 -422491 -424414 -422223 -417362 -414828 -416345 -417821
2431 -417821 -422365 -420835 -423422 -424025 -423830 -425684 -429167 -427851 -425527 -422738 -422745 -422682 -422583 -420584 -422003 -422947 -418505
2414 -418505 -419760 -431595 -435516 -425457 -412127 -408220 -413863 -409808 -408521 -405635 -414507 -422956 -428800 -428690
2400 -428690 -425752 -422475 -419410 -420800 -419480 -414640 -421897 -424286 -424632 -422405 -417452 -412107 -419468 -425154 -426446
2385 -426446 -423205 -419350 -418151 -420840 -427988 -425801 -422331 -417529 -416506 -421474 -428247 -429194 -423935 -424461 -428880
2370 -428880 -426892 -420151 -424086 -432719 -439208 -428451 -419185 -409835 -410408 -408078 -409622 -417398 -418932 -416138
2356 -416138 -411712 -419498 -415790 -412683 -413381 -418481 -417627 -414607 -416092 -422171 -426834 -418631 -414139 -407965 -404520
2341 -404520 -408112 -409122 -413185 -419791 -424898 -428075 -426172 -422618 -413216 -416833 -417515 -417620 -418398 -416950 -409930
2326 -409930 -403283 -404357 -405744 -410612 -420823 -418309 -409833 -407525 -416374 -413423 -411431 -415623 -413598 -412052
2312 -412052 -407898 -407663 -412902 -409637 -397741 -398336 -402008 -409809 -406046 -410359 -415330 -419574 -421586 -419054 -418929
2297 -418929 -417159 -419406 -421691 -416273 -415333 -415027 -413287 -409256 -408448 -417640 -420102 -418170 -415876 -411541 -413700
2282 -413700 -419778 -420212 -414670 -414378 -413588 -413813 -407312 -409405 -414566 -412776 -413484 -418238 -420443 -419150 -417135 -409975
2266 -409975 -405133 -404117 -413042 -414918 -420127 -422343 -417425 -410962 -414565 -423542 -432006 -429661 -421673 -419169
2252 -419169 -415813 -414662 -413701 -418777 -417919 -412976 -419365 -413759 -407174 -403969 -407614 -413423 -415866 -416275 -414032
2237 -414032 -418460 -421719 -419585 -414822 -414599 -413165 -413615 -414279 -407831 -399001 -405184 -409426 -410755 -409287 -407486
2222 -407486 -408038 -411187 -407737 -411773 -414560 -418573 -424847 -422325 -415824 -409080 -410059 -413097 -411851 -408327 -404870
2207 -404870 -410669 -415130 -412188 -405810 -405272 -415403 -424742 -422990 -415067 -411113 -413966 -418234 -417767 -418511 -422150
2192 -422150 -424943 -419205 -408435 -414290 -417445 -408831 -406897 -409823 -411488 -407889 -406292 -407960 -405750 -403633
2178 -403633 -405107 -412043 -419476 -417995 -414993 -409925 -399169 -399083 -400713 -402600 -408531 -413598 -418498 -418107 -410756
2163 -410756 -408173 -410758 -417589 -418325 -414904 -408249 -404698 -405895 -397656 -399057 -399399 -396577 -395443 -401232 -402927
2148 -402927 -405958 -408704 -403482 -397162 -397373 -399761 -410619 -424966 -430327 -426487 -421634 -414905 -416115 -410965
2134 -410965 -414862 -413291 -404852 -398922 -403139 -408414 -411528 -410158 -402449 -399933 -407927 -406269 -403536 -403745 -408481
2119 -408481 -411999 -411183 -413493 -409561 -414443 -413772 -410675 -410825 -410532 -408942 -408895 -411259 -408742 -403898 -401712 -397867
2103 -397867 -402824 -409830 -402283 -397469 -399441 -400527 -400130 -400384 -408467 -409289 -408320 -401197 -396412 -400674 -402378
2088 -402378 -411736 -411249 -408679 -403136 -403770 -406799 -406636 -403972 -404702 -397477 -394371 -397394 -399900 -406972 -409259
2073 -409259 -405565 -405142 -407078 -405734 -407012 -404104 -405876 -407604 -408335 -412779 -412904 -412068 -404786 -405015 -409115 -409509
2057 -409509 -408709 -410215 -404912 -407944 -406068 -407044 -404259 -403691 -403223 -404808 -402181 -394946 -391197 -395743 -404651
2042 -404651 -410744 -405037 -402026 -407629 -415858 -410547 -405077 -401041 -397537 -398793 -397709 -400625 -400837 -398209 -404049
2027 -404049 -405787 -404260 -404279 -399618 -398862 -399967 -398114 -397636 -398780 -389781 -396599 -403072 -404302 -408117 -403120
2012 -403120 -404982 -401909 -399779 -399126 -398881 -402872 -400581 -405541 -411616 -405117 -401702 -402821 -401421 -400820 -399660
1997 -399660 -400821 -404941 -397803 -397534 -403316 -404279 -410852 -411201 -414195 -413006 -411406 -409561 -404409 -404281 -408632
1982 -408632 -411897 -407144 -407733 -409882 -402406 -404492 -413560 -409173 -408169 -406358 -402310 -407233 -412884 -412647 -409038
1967 -409038 -399965 -396079 -401097 -406476 -409359 -407533 -399278 -395938 -400671 -402687 -397788 -395000 -392964 -395125
1953 -395125 -397349 -398082 -403348 -404001 -401408 -397669 -394106 -396241 -397577 -403217 -405133 -403203 -396271 -396760 -402735
1938 -402735 -408471 -403980 -397754 -396782 -398876 -404339 -402285 -401139 -397395 -389594 -390807 -396591 -405678 -408558 -411205
1923 -411205 -406571 -394975 -392187 -392977 -393302 -395908 -402477 -407210 -409171 -405280 -406192 -404586 -402085 -402957 -400487
1908 -400487 -400628 -400255 -399402 -393677 -391411 -392383 -391399 -393978 -394191 -389055 -394785 -396904 -395155 -398225 -404543 -401474
1892 -401474 -402222 -398271 -393416 -390573 -397860 -405427 -407986 -404707 -401289 -399437 -396024 -397075 -399804 -403215 -400504
1877 -400504 -402721 -405205 -410315 -410124 -398318 -390219 -390147 -396438 -400316 -397590 -399034 -401445 -406398 -404126 -398572
1862 -398572 -394744 -391892 -392324 -396443 -397340 -400738 -392809 -397371 -397015 -394897 -398689 -404955 -409010 -406035 -402178
1847 -402178 -394860 -393950 -395936 -392866 -392742 -398802 -398927 -395705 -401677 -406153 -400526 -397176 -400532 -397977 -392028
1832 -392028 -389517 -386907 -391476 -389918 -390392 -385973 -375000 -382184 -386061 -384875 -393999 -390569 -388808 -393147
1818 -393147 -392965 -392376 -397138 -387527 -385737 -384967 -388622 -401885 -401766 -396475 -393310 -385188 -382727 -391769 -394083
1803 -394083 -395444 -395068 -389088 -384953 -388936 -396660 -402005 -398794 -391109 -384875 -388218 -397179 -399812 -399924 -401000
1788 -401000 -395634 -401056 -408470 -403342 -395257 -391528 -397921 -401693 -403365 -402607 -398769 -391588 -389201 -385730 -385717
1773 -385717 -384834 -391031 -402006 -405552 -403062 -398938 -390775 -389688 -397218 -400918 -399534 -391700 -385277 -391467
1759 -391467 -393070 -399114 -399463 -396773 -393988 -398464 -402833 -406374 -398325 -390463 -386842 -390209 -391924 -388656 -390574
1744 -390574 -397418 -400967 -399247 -395081 -393607 -395144 -394247 -386458 -386128 -389826 -388165 -390988 -394237 -393789 -394189
1729 -394189 -396077 -391132 -396611 -397092 -390791 -390082 -395972 -392155 -389975 -397981 -401317 -392366 -392414 -396687 -391666
1714 -391666 -388040 -388524 -388310 -385223 -386414 -389518 -395337 -387463 -379404 -381481 -387748 -386784 -387561 -390037 -391564
1699 -391564 -395104 -387686 -387236 -388853 -387024 -380741 -385802 -389780 -391657 -388532 -382561 -377121 -373995 -378627 -380334
1684 -380334 -380283 -379887 -380402 -387585 -389341 -384626 -379457 -378601 -383373 -388440 -385403 -387854 -394155 -387954 -380127 -379210
1668 -379210 -378387 -381185 -384029 -390682 -397433 -396029 -392549 -384298 -381814 -383865 -380170 -383163 -388017 -387201 -388228
1653 -388228 -387328 -388844 -392531 -392704 -390491 -389263 -386250 -386554 -390406 -390087 -387630 -388332 -388237 -384790 -388455 -384122
1637 -384122 -389100 -396383 -395936 -398117 -392908 -388769 -390351 -386064 -385963 -377428 -373912 -375046 -382069 -389350 -394891
1622 -394891 -394227 -389069 -388079 -389008 -390364 -383041 -379901 -386825 -391699 -389691 -386888 -386455 -384912 -390302 -388974
1607 -388974 -384826 -385074 -384870 -386771 -383245 -382803 -384244 -385831 -387289 -392043 -394947 -397024 -391643 -387489 -386085
1592 -386085 -391617 -396595 -400463 -395263 -393736 -394504 -397967 -399376 -399062 -395784 -392150 -385982 -382453 -383253 -380351
1577 -380351 -377727 -379625 -386830 -389392 -391488 -390621 -390067 -391264 -390737 -390238 -386125 -382190 -386644 -391325 -389861
1562 -389861 -385478 -386688 -384627 -389499 -398513 -404426 -394286 -382777 -378728 -373901 -380899 -379915 -377819 -382368
1548 -382368 -386898 -381949 -382275 -384059 -389812 -396699 -396885 -389101 -385758 -385029 -384939 -382155 -383142 -383966 -385907 -385410
1532 -385410 -395331 -389692 -388059 -384603 -381610 -386350 -393631 -390185 -387831 -387001 -387504 -380439 -375779 -379205 -385839
1517 -385839 -383345 -381894 -381350 -393437 -401156 -397848 -384743 -381867 -378468 -382419 -380028 -377791 -382776 -384055
1503 -384055 -384893 -384754 -390173 -392253 -387422 -379797 -379308 -377354 -380966 -384285 -383428 -389715 -387539 -389257 -393031
1488 -393031 -392296 -390368 -385182 -378843 -376570 -373034 -375207 -381588 -387125 -389675 -391050 -393556 -389896 -395574 -397885
1473 -397885 -394188 -392218 -388786 -388180 -385190 -380649 -377310 -373100 -374215 -378669 -382296 -382461 -379807 -373201 -370757
1458 -370757 -378449 -393673 -390495 -380542 -373564 -375363 -379183 -383092 -390203 -389518 -381782 -380531 -377701 -373020
1444 -373020 -377419 -373777 -377708 -381451 -378189 -375520 -381434 -385818 -381201 -373444 -368686 -377663 -388543 -390563
1430 -390563 -382744 -375410 -376527 -379137 -384120 -386040 -384627 -379758 -376939 -375427 -371545 -378668 -381080 -378690
1416 -378690 -375577 -377565 -382598 -385237 -377486 -369733 -374918 -383098 -387764 -385367 -384163 -383908 -385821 -385400 -382992
1401 -382992 -383043 -386272 -380525 -379304 -377135 -370283 -368230 -368344 -367948 -379813 -394942 -392824 -392227 -384031 -374913
1386 -374913 -368478 -368931 -371081 -370561 -373152 -378884 -374086 -371041 -371285 -380388 -377898 -379409 -377075 -378432 -379774
1371 -379774 -381531 -383454 -375357 -378653 -380434 -377940 -378804 -381232 -378990 -366673 -362771 -365987 -371033 -384492
1357 -384492 -387472 -383336 -380811 -378026 -371352 -367788 -365145 -365415 -361704 -368066 -374069 -374448 -378257 -381719 -379861
1342 -379861 -376252 -380188 -387927 -389500 -390756 -385887 -382199 -378822 -381422 -378032 -376465 -377395 -376966 -375096 -377642
1327 -377642 -377084 -372573 -377790 -385289 -374896 -360228 -359290 -369686 -370689 -366434 -368079 -369560 -367993 -372670
1313 -372670 -377613 -384617 -385385 -382668 -383218 -382790 -390146 -392300 -384299 -387844 -391688 -383021 -379555 -381455 -384330
1298 -384330 -376798 -374247 -374768 -370131 -371542 -372882 -373385 -368439 -369572 -371496 -369852 -363440 -361671 -369496 -371343
1283 -371343 -366478 -363860 -371210 -375827 -378063 -375000 -378717 -380348 -381648 -379488 -373026 -366851 -364658 -369674
1269 -369674 -370285 -371831 -365260 -361472 -369175 -371879 -371047 -369022 -371759 -370982 -377849 -381917 -380176 -376200 -375805
1254 -375805 -375625 -379608 -382900 -386749 -377504 -374258 -367873 -368545 -369043 -363947 -361039 -360724 -364804 -373690 -375944
1239 -375944 -376014 -382662 -384175 -379122 -371389 -368232 -370663 -372750 -382220 -379561 -375645 -377191 -374512 -373268 -372698
1224 -372698 -371020 -366926 -373176 -374857 -375852 -381765 -385641 -383912 -379601 -378599 -384538 -385664 -382476 -383325 -379412
$$ [...]
##END NTUPLES=NMR SPECTRUM
##END=
