##TITLE=Analysis number 325984
Compound Code cc 59610
Book Reference 521/11
Project Code adrs
Chemist Name evam
##JCAMPDX= 6.0         $$ Bruker NMR JCAMP-DX V2.0
##DATA TYPE= NMR SPECTRUM
##DATA CLASS= NTUPLES
##ORIGIN= Bruker BioSpin GmbH
##OWNER= nmr
$$ XWIN-NMR		Version 3.5
$$ Mon Jan 22 15:51:19 2007 GMT Standard Time (UT+0h)  MAYBRIDGE\nmr@NMR_250MHZ
##.OBSERVE FREQUENCY= 250.131544655141
##.OBSERVE NUCLEUS= ^1H
##.ACQUISITION MODE= SIMULTANEOUS (DQD)
##.ACQUISITION SCHEME= undefined
##.AVERAGES= 16
##.DIGITISER RES= 18
##SPECTROMETER/DATA SYSTEM= dpx250
##.PULSE SEQUENCE= zg30
##.SOLVENT NAME= CDCl3
##.SHIFT REFERENCE= (INTERNAL, CDCl3, 0, 16.522)
##AUDIT TRAIL= $$ (NUMBER, WHEN, WHO, WHERE, WHAT)
$$ ##TITLE= Audit trail, XWIN-NMR		Version 3.5
$$ ##JCAMPDX= 5.01
$$ ##ORIGIN= Bruker BioSpin GmbH
$$ ##OWNER= nmr
$$ C:\u/data/dgb/nmr/ADRS/1560/pdata/1/auditp.txt
$$ ##AUDIT TRAIL=  $$ (NUMBER, WHEN, WHO, WHERE, WHAT)
(   1,<2007-01-22 15:50:56.97 +000>,<MAYBRIDGE\nmr>,<NMR_250MHZ>,
      <created by zg, POWCHK disabled, PULCHK disabled
       configuration hash MD5:
       49 4B E0 1D 92 C2 6B 37 9F E6 65 BC 52 41 86 1D
       data hash MD5: 64K
       0E F2 44 44 31 30 6A 4A AE F6 F0 35 E4 3F ED 07>)
(   2,<2007-01-22 15:51:11.27 +000>,<MAYBRIDGE\nmr>,<NMR_250MHZ>,
      <Start of raw data processing
       ef LB = 0.3 FT_mod = 6 PKNL = 1 SI = 32K 
       data hash MD5: 32K
       99 EE 63 11 DE AA 49 49 35 6D 14 D8 C2 AC AF 7E>)
(   3,<2007-01-22 15:51:13.22 +000>,<MAYBRIDGE\nmr>,<NMR_250MHZ>,
      <apk 
       data hash MD5: 32K
       49 BB 57 47 23 0C DE C4 DF C7 C0 3A 12 96 82 D5>)
(   4,<2007-01-22 15:51:13.96 +000>,<MAYBRIDGE\nmr>,<NMR_250MHZ>,
      <abs ABSG = 5 
       data hash MD5: 32K
       D0 E3 15 49 DB 71 B8 4B E8 8A 91 97 E6 02 85 78>)
$$ ##END=
$$ 
$$ hash MD5
$$ BB BD A7 58 51 3D 34 42 13 96 36 22 81 A7 12 59
##$RELAX= 
##$RELAX= 
##$RELAX= 
##$RELAX= 
##$RELAX= 
##$RELAX= 
##$RELAX= 
$$ Bruker specific parameters
$$ --------------------------
##$DU= <C:\u>
##$EXPNO= 1560
##$NAME= <ADRS>
##$PROCNO= 1
##$TYPE= <nmr>
##$USER= <dgb>
##$AMP= (0..31)
100 100 100 100 100 100 100 100 100 100 100 100 100 100 100 100 100 100 
100 100 100 100 100 100 100 100 100 100 100 100 100 100 
##$AQSEQ= 0
##$AQ_mod= 3
##$AUNM= <au_zg>
##$AUTOPOS= <47 >
##$BF1= 250.13
##$BF2= 250.13
##$BF3= 250.13
##$BF4= 250.13
##$BF5= 500.13
##$BF6= 500.13
##$BF7= 500.13
##$BF8= 500.13
##$BYTORDA= 1
##$CFDGTYP= 0
##$CFRGTYP= 5
##$CHEMSTR= <none>
##$CNST= (0..31)
1 1 145 1 1 1 1 1 1 1 1 1 1 1 1 1 1 1 1 1 1 1 1 1 1 1 1 1 1 1 1 1 
##$CPDPRG= <>
##$CPDPRG1= <>
##$CPDPRG2= <>
##$CPDPRG3= <>
##$CPDPRG4= <mlev>
##$CPDPRG5= <mlev>
##$CPDPRG6= <mlev>
##$CPDPRG7= <mlev>
##$CPDPRG8= <mlev>
##$CPDPRGB= <>
##$CPDPRGT= <>
##$D= (0..31)
0 1 0 0 0 0 0 0 0 0.06 0 0 0 0 0 0 0.0002 0 0 0 0 0 0 0 0 0 0 0 0 0 0 
0 
##$DATE= 1169481056
##$DBL= (0..7)
120 120 120 120 120 120 120 120 
##$DBP= (0..7)
150 150 150 150 150 150 150 150 
##$DBP07= 0
##$DBPNAM0= <>
##$DBPNAM1= <>
$$ [...]
##$SUBNAM7= <"">
##$SUBNAM8= <"">
##$SUBNAM9= <"">
##$SW= 20.6930455092707
##$SWIBOX= (0..15)
0 0 3 0 0 0 0 0 0 0 0 0 0 0 0 0 
##$SW_h= 5175.983436853
##$TD= 65536
##$TD0= 1
##$TE= 294.16
##$TE2= 300
##$TE3= 300
##$TEG= 300
##$TL= (0..7)
0 120 120 120 120 120 120 120 
##$TP= (0..7)
150 150 150 150 150 150 150 150 
##$TP07= 0
##$TPNAME0= <>
##$TPNAME1= <>
##$TPNAME2= <>
##$TPNAME3= <>
##$TPNAME4= <>
##$TPNAME5= <>
##$TPNAME6= <>
##$TPNAME7= <>
##$TPOAL= (0..7)
0.5 0.5 0.5 0.5 0.5 0.5 0.5 0.5 
##$TPOFFS= (0..7)
0 0 0 0 0 0 0 0 
##$TUNHIN= 0
##$TUNHOUT= 0
##$TUNXOUT= 0
##$USERA1= <user>
##$USERA2= <user>
##$USERA3= <user>
##$USERA4= <user>
##$USERA5= <user>
##$V9= 5
##$VALIST= <valist>
##$VCLIST= <CCCCCCCCCCCCCCC>
##$VD= 0
##$VDLIST= <DDDDDDDDDDDDDDD>
##$VPLIST= <PPPPPPPPPPPPPPP>
##$VTLIST= <TTTTTTTTTTTTTTT>
##$WBST= 1024
##$WBSW= 4
##$XGAIN= (0..3)
0 0 0 0 
##$XL= 0
##$YL= 0
##$YMAX_a= 479024
##$YMIN_a= -370439
##$ZGOPTNS= <>
##$ZL1= 120
##$ZL2= 120
##$ZL3= 120
##$ZL4= 120
##$ABSF1= 16.522
##$ABSF2= -4.171173
##$ABSG= 5
##$ABSL= 3
##$ALPHA= 0
##$AQORDER= 0
##$ASSFAC= 0
##$ASSFACI= 0
##$ASSFACX= 0
##$ASSWID= 0
##$AUNMP= <proc_1d>
##$AZFE= 0.1
##$AZFW= 0.1
##$BCFW= 0
##$BC_mod= 0
##$BYTORDP= 0
##$COROFFS= 0
##$CY= 12.5
##$DATMOD= 1
##$DC= 0
##$DFILT= <>
##$DTYPP= 0
##$F1P= 14.0000005364418
##$F2P= -0.99999901652339
##$FCOR= 0.5
##$FTSIZE= 32768
##$FT_mod= 6
##$GAMMA= 0
##$GB= 0
##$INTBC= 1
##$INTSCL= 1
##$ISEN= 128
##$LB= 0.3
##$LEV0= 0
##$LPBIN= 0
##$MAXI= 10000
##$MC2= 0
##$MEAN= 0
##$ME_mod= 0
##$MI= 0
##$NCOEF= 0
##$NC_proc= -3
##$NLEV= 6
##$NOISF1= 0
##$NOISF2= 0
##$NSP= 0
##$NTH_PI= 0
##$NZP= 0
##$OFFSET= 16.522
##$PC= 1
##$PHC0= 78.56367
##$PHC1= 4.912806
##$PH_mod= 1
##$PKNL= yes
##$PPARMOD= 0
##$PSCAL= 4
##$PSIGN= 0
##$REVERSE= no
##$SF= 250.13
##$SI= 32768
##$SIGF1= 0
##$SIGF2= 0
##$SINO= 400
##$SIOLD= 32768
##$SREGLST= <1H.CDCl3>
##$SSB= 0
##$STSI= 32768
##$STSR= 0
##$SW_p= 5175.98343685301
##$SYMM= 0
##$S_DEV= 0
##$TDeff= 65536
##$TDoff= 0
##$TI= <Analysis number 999999
Compound Code 99
Book Reference 9
Project Code 9>
##$TILT= no
##$TM1= 0
##$TM2= 0
##$TOPLEV= 0
##$USERP1= <user>
##$USERP2= <user>
##$USERP3= <user>
##$USERP4= <user>
##$USERP5= <user>
##$WDW= 1
##$XDIM= 32768
##$YMAX_p= 481775508
##$YMIN_p= -26219
$$ End of Bruker specific parameters
$$ ---------------------------------
##NTUPLES= NMR SPECTRUM
##VAR_NAME=  FREQUENCY,     SPECTRUM/REAL,   SPECTRUM/IMAG
##SYMBOL=    X,             R,               I
##VAR_TYPE=  INDEPENDENT,   DEPENDENT,       DEPENDENT
##VAR_FORM=  AFFN,          ASDF,            ASDF
##VAR_DIM=   32768,         32768,           32768
##UNITS=     HZ,            ARBITRARY UNITS, ARBITRARY UNITS
##FACTOR=    0.157963299565203, 1,           1
##FIRST=     4132.6476996994, 0,             0
##LAST=      -1043.33573715361, 0,           0
##MIN=       -1043.33573715361, -26219,      0
##MAX=       4132.6476996994, 481775508,     0
$$ Real data points
##PAGE= N=1
##DATA TABLE= (X++(R..R)), XYDATA
$$ [...]
21116 1663 6028 8486 8048 -1702 -2086 6169 5563 7463 8118 1763 3933 1820 1947 893 -5937 -10089
21100 -10089 -10008 -5155 -1300 1731 -4606 -8202 -9160 -1598 1142 3044 1757 -3086 -4660 -7388 -3235
21085 -3235 982 1652 4707 7018 784 -1956 4749 12519 11129 9064 3851 -4104 -7233 1477 4104
21070 4104 -244 -7390 -8426 -5731 -3965 -1477 -495 -912 -1770 811 2058 1751 4520 7850 1934 -646
21054 -646 12 -8519 -11318 -7426 -14106 -20231 -17688 -20923 -8404 -401 2068 -2538 -5715 -6034 934
21039 934 1680 1912 -35 53 -4896 2400 6808 5022 3983 -2298 -3496 -3576 -1251 572 398 2193 -2898
21022 -2898 -8054 62 3999 -1136 -4383 -3630 629 2100 -2613 -7077 -1351 7013 11816 7847 3425
21007 3425 357 -5596 -7913 -986 -3711 -3657 -2333 -5255 -5586 -5921 -1426 -5178 -10386 -14227 -16808 -12754
20991 -12754 -11043 -14621 -8067 -2490 -4331 -4857 -3080 -6533 -4361 2613 11147 11876 7689 534 -564
20976 -564 -2595 786 425 7141 9670 7765 4502 -1591 -1125 4784 7049 -966 -2024 -4786 -3316
20961 -3316 -4341 -6487 -7524 -545 -5326 -9795 -8648 -7409 2164 2154 777 5532 2954 -4961 280
20946 280 3804 -5413 -10928 -11967 -15030 -14265 -13233 -8114 -4791 1500 3218 1463 -2057 -6782 -3734
20931 -3734 -1524 1182 3251 3000 245 -104 -3420 -2842 -6446 -8316 -11363 -13647 -11681 -11208 -12532 -11037
20915 -11037 -8104 -2562 1516 -2171 -5053 -4703 -3647 -6375 -924 -594 71 2423 -477 -3511 -3653
20900 -3653 -4059 -5434 -6844 810 1784 -1691 -4828 2390 4838 -400 -5036 -3802 -3111 -4213 -856
20885 -856 2011 409 -107 -1095 -3756 -6303 -3296 5045 10857 7661 8895 9070 8841 3626 -377 -3359
20869 -3359 -8955 -6143 -4301 -5521 -4484 -902 4102 -740 -2785 557 -3385 -3780 -5291 -5881 -6974
20854 -6974 -8745 -11520 -10896 -10928 -7922 -4577 -6340 -3788 2184 6434 5910 6752 -705 -5577 -909 -775
20838 -775 -709 -2828 -2734 985 -1299 -5865 -2280 234 4274 2274 -3406 -5962 -4995 -1718 -335 962
20822 962 4162 -8189 -10540 -17419 -15604 -12264 -12393 -12140 -4784 1872 3201 6992 2750 2155 3274
20807 3274 2207 -1280 2658 6585 7279 10735 10444 8011 9651 656 -8628 -14613 -13137 -7657 -1824
20792 -1824 -4173 -7661 -5112 -1644 -5226 -5194 -8012 -10711 -13157 -16216 -14760 -17986 -17297 -12508 -7463
20777 -7463 -916 1179 -1080 422 5501 10069 6114 4058 -19 -615 -1288 3616 -1413 -7507 -433
20762 -433 1028 2421 9269 12003 9023 1377 -6384 -3905 -846 -2522 -3085 -3542 -3579 -345 -369 -5094
20746 -5094 -6467 -7969 -6751 -2709 -10966 -15126 -12642 -11795 -11228 -8337 -12518 -12340 -11892 -12286 -10729 -9478
20730 -9478 -7632 -2877 -3009 2000 7085 2766 -4123 -1966 385 2895 1781 -4552 1304 6711 980
20715 980 -8527 -3425 -909 -6576 2229 4725 2900 1259 -581 483 -2170 -7357 -10146 -11427 -7156
20700 -7156 -11042 -6392 -4649 -9480 -15845 -17422 -13121 -4553 315 1735 1318 -4592 -11107 -15071 -15040
20685 -15040 -19698 -22949 -19717 -11219 -5542 -7568 -12657 -12262 -4988 -2716 -1655 -2965 1012 5706 11070
20670 11070 5068 -4393 -4613 -4069 -6311 -5376 -4798 -3421 -2527 -6067 -6271 -5911 -1971 -1463 -851 -2654 -3712
20653 -3712 982 -2708 -8846 -7570 -9565 -4949 -5122 694 2846 3863 6695 -2172 -7991 115 9771
20638 9771 3178 -11422 -12620 -14990 -10434 -2998 5130 9036 9823 4779 -601 -9504 -6539 -4311 -5435
20623 -5435 -10576 -12546 -10334 -272 -835 1132 3462 -759 3300 1070 -4084 -2298 1339 2623 -6092
20608 -6092 -10091 -7344 4071 4550 912 1839 -2823 -10645 -13937 -20406 -14328 -6077 -8834 -10773 -12879
20593 -12879 -2620 545 3767 5265 -244 -10050 -11611 -10292 -6457 -4544 -1350 1670 -486 -2222
20579 -2222 -3691 -11839 -6580 2070 -3646 -8068 2068 7608 6977 5184 625 -965 1373 -4649 -6348
20564 -6348 -5031 -9323 444 7491 5178 -218 517 1099 4100 8539 10918 5192 4886 913 -2569
20549 -2569 -2522 -2779 -3671 -1749 -2858 880 4622 6602 8300 -2604 -3017 -1111 4255 7102 4848 364
20533 364 -5568 -6889 -10885 -8414 -2395 2834 2424 -1578 -7304 -8233 -5179 -567 -1845 -5219 -530
20518 -530 -6766 -13640 -14090 -10994 -6380 -5731 -3309 -7716 -6980 -6179 -4479 -898 1156 -3 4806 2211
20502 2211 2580 5606 7952 1825 -4329 -3018 -4972 -5339 -4098 -5459 -9433 -8466 -2578 -4650 -4102 -3897
20486 -3897 -792 -1053 -4021 1457 841 1802 1577 -2446 -12298 -13539 -5010 -3359 -4656 -147 2113 1974
20470 1974 1318 -1988 -5877 -7232 -8646 -8903 -2374 -2294 -3123 -1998 -7006 -10427 -11247 -11864 -6032 -4831
20454 -4831 -11970 -10955 -11222 -10869 -5083 -8686 -13296 -11396 -7553 -10213 -7899 -4718 -1266 -4230 -14096
20439 -14096 -14400 -14154 -14892 -10593 -6660 -9020 -3054 7124 8847 5488 -613 -3322 1582 1025 -1135
20424 -1135 -1446 -5749 -7594 -4058 840 -2855 3794 9363 8036 5540 2981 2348 1926 5356 8532
20409 8532 6228 1847 617 4564 5207 533 5984 6433 4116 -6032 -10352 -5642 -517 3101 -21
20394 -21 -553 -643 -3546 -2240 -6754 -8159 -6553 -3472 -1697 1355 5034 3830 -2832 -5987 -6758 -2629
20378 -2629 -1135 -4698 -7455 -8339 -10230 -11683 -8850 -6367 -9786 -14874 -15904 -15681 -15065 -14515 -13641 -7900
20362 -7900 -7030 -10853 -2645 1469 7075 10069 2341 -2392 54 11578 15144 6454 -253 583 -1660
20347 -1660 -7457 -11519 -15858 -14928 -14628 -8910 829 -7202 -17689 -14947 -8775 -10662 -7881 -6778 873
20332 873 4507 7126 2833 4849 8156 7613 5425 5346 5522 4498 2535 -3209 -2582 2716 3141 -1321
20316 -1321 -1418 -130 -7389 -11701 -11034 -10890 -5737 -2469 -1918 -1378 -4498 -8368 -8326 -2128 2257 -1914 -8429
20299 -8429 -11728 -12906 -9099 -6145 -545 -551 -6731 -2244 -969 -6941 -7599 -6482 -10645 -5785 1423 1871
20283 1871 -5984 -7813 1832 2254 -2975 -6042 1889 227 -3139 -6081 -4537 97 -1248 998 6959
20268 6959 7778 4817 -4270 -5841 -710 9317 10932 1588 -2161 -4725 -2791 -3265 -1572 -3740 -2944
20253 -2944 478 -4651 -4852 1188 3057 6682 10758 6450 288 -5911 -12239 -17362 -18403 -13989 -10231
20238 -10231 -7555 -8447 -9614 3750 8755 6736 4571 2566 4384 5995 2873 4443 709 1607 -731
20223 -731 -6006 -3684 161 542 -6736 -8889 -5024 -7060 -3827 3293 2494 -1757 -3634 -4910 3955
20208 3955 -896 -6779 -2452 -8225 -10303 -4921 -2479 37 -2048 -3546 -3719 -5315 -5777 -1933 -3657
20193 -3657 -12173 -2098 1532 -3929 -9468 -9913 -9591 -5408 -1603 -759 -4217 -7396 -121 1577 -3411
20178 -3411 -1915 -658 -8252 -9747 -1965 1406 2580 -3271 -8062 -3466 5107 2863 -2779 -6749 -5517
20163 -5517 -1984 4324 4316 2806 4711 2234 -1577 -1180 1021 1985 7433 6134 771 3270 13455 8198
20147 8198 7600 4889 5316 3888 4816 4237 6220 8682 3310 -4784 -2215 4185 -546 -7847 -7405 -4747
20131 -4747 1316 593 788 1522 7897 5313 -1899 -8453 -9999 -9761 -9207 -15150 -14599 -7732 -3546 -7453
20115 -7453 -8364 -10165 -11181 -9475 -17169 -20342 -14388 -11558 -8427 -5625 -952 1655 -4163 -8354 -15914
20100 -15914 -17163 -10629 -4692 -4324 -3880 -10112 -15396 -11606 -4937 -5004 -1280 -1806 -3987 -4857 1300 881
20084 881 -96 1719 -1871 -3036 -5377 -3145 -1317 1697 3231 -271 887 8844 4720 -4469 989
20069 989 5391 4415 3962 2501 -3927 -2382 4029 6062 3160 -1722 -3855 -3443 -3036 -7487 -6209 -3798
20053 -3798 -104 -1893 -1814 -5400 -7975 -9539 -12904 -6056 -2889 -3276 2588 5985 6724 8667 5921 1850
20037 1850 4046 8347 10795 1865 -3774 -2095 -6952 -13589 -17561 -12839 -6980 -4119 -6308 -13851 -12227
20022 -12227 -4766 -1632 -1486 1145 -444 2065 2497 -2392 -5648 -2849 3107 8014 1685 887 15
20007 15 -1095 -2756 -6994 -5322 -996 -4752 -9192 -10303 -10286 -8190 -7558 -10676 -6791 -11986 -16054 -10282
19991 -10282 -3657 -2830 -9128 -16248 -15993 -10915 -8459 -12318 -13085 -8990 -7535 -7927 -9099 -11006 -15506
19976 -15506 -15399 -11643 -3596 4511 7549 5786 4605 -2438 -4250 -533 -6111 -10604 -12324 -1813
19962 -1813 -67 -2590 -992 -3162 -11042 -17232 -19956 -16517 -10092 -2702 -3089 -4817 -9960 -13531 -14400
19947 -14400 -12602 -8959 -5416 -8952 -4777 675 2387 4725 5432 4678 -4 -2316 -6786 -9095 -2228
19932 -2228 1181 6528 7015 -6702 -14508 -10105 -3129 -3454 -3475 -5356 -6920 -10877 -12265 -2361 1825
19917 1825 5938 8459 -2199 -6551 -3186 -229 -834 -1367 -1538 -661 -4634 -7990 -12121 -10071 -10524 -2254
19901 -2254 3681 -1650 -8714 -209 1605 -1268 -2498 -3333 -2864 -4723 -939 2340 888 -5677 -5190
19886 -5190 -7378 -4698 -5689 -8178 -5576 -2684 -789 -4163 -6545 -883 -2672 -2734 -7023 -9963 -8945
19871 -8945 -10871 -5524 -2455 -4919 -2168 1740 -5826 -15480 -18653 -14837 -9921 -6887 -8269 -12401 -16654
19856 -16654 -12099 -4086 -3093 -7258 -11675 -6796 -1346 -4683 -4857 -1033 -3559 -5180 -9908 -8197 -988
19841 -988 -2000 -7427 -7582 -1605 -1099 -787 -453 -3380 -4188 -2777 1327 6410 7215 353 -4316 -13134
19825 -13134 -11408 -6584 -9014 -10492 -11086 -8142 -6063 -3906 2086 -856 -4561 -5323 554 -3929 -11279
19810 -11279 -11942 -11917 -7788 -5560 -1253 -2311 -14968 -12794 -10892 -9242 -12327 -13220 -16919 -17171 -11366
19795 -11366 -10903 -10309 -1925 -909 -12883 -8905 -569 1034 3585 1394 2479 613 -6485 -9427 -3164
19780 -3164 1986 3004 4451 -2419 -11108 -9511 -5192 -2008 -9626 -11825 -6490 -3007 -3383 -5714 -6560
19765 -6560 -4312 -10192 -14999 -11184 -6021 -5 7927 4511 2442 -480 -3876 -6701 -596 -1404 -1940
19750 -1940 -527 -559 1471 3185 3832 1568 1289 990 -1020 2690 5433 5656 521 -2152 -757 -163
19734 -163 -768 -6291 -10408 -11048 -7833 -7674 -2170 -1883 -11722 -15055 -13584 -7428 -5094 -11708 -11812 -4748
19718 -4748 -1725 -8090 -10182 -12661 -16901 -13279 -10224 -6226 -2687 -7534 -7701 -5797 -4881 -3225 76
19703 76 1338 -1650 -405 -2277 -7815 -9359 -9081 -11161 -8323 -8857 -9966 -7047 -9457 -10412 -13046 -12990
19687 -12990 -16125 -16683 -8867 1714 630 -3698 -6613 -14484 -15811 -10124 -6264 -11661 -15135 -9845
19673 -9845 -1196 -1886 -8637 -9684 -5131 -11616 -12186 -6466 -7736 -11892 -12289 -1739 185 295 6472
19658 6472 4394 269 -8295 -10345 -10607 -6521 3393 7185 8075 7903 7400 -860 -6877 -15376 -11042 -7305
19642 -7305 -8337 -10286 -5294 5146 4417 581 6454 6216 6526 5383 1656 1683 3328 5367 4950 -6178
19626 -6178 -9033 -4609 -1749 -2067 -7487 -15532 -14212 -6986 -10027 -8150 -2072 830 11 -1007 -4747
19611 -4747 -7036 -10574 -11159 -13850 -8020 6285 11495 12600 9071 3538 -3292 2432 3479 983 -292
19596 -292 3992 3066 7357 12538 11431 7136 -911 1218 8406 7345 -372 1557 982 -1762 -1435 -4045
19580 -4045 -8879 -9961 -12837 -15466 -18656 -16790 -15233 -10087 -8562 -14203 -16477 -13044 -13659 -5726 -3082
19565 -3082 -1200 -4191 -5153 -11117 -14236 -12069 -10591 -3512 8 -4303 -6148 -8179 -5478 -5273 -10390
19550 -10390 -6680 2539 6344 2550 -3668 -6341 -4981 1594 9724 3602 -406 -3567 -2937 2579 -271
19535 -271 -2973 -4595 -6074 -12689 -13960 -11656 -7179 -5286 -116 1839 -2250 3079 2464 1757 3335
19520 3335 6318 -3228 -10720 -6005 -2083 -2802 -2284 -3600 2284 -142 -4133 -9122 -8454 721 6231
19505 6231 679 -4600 -2871 203 -2033 -4580 -8534 -4401 5630 10115 9362 52 -3473 -8226 -3896
19490 -3896 288 -859 -427 39 -1524 -4133 -4421 -2963 -1602 -2051 -3486 -3276 -3443 -2906 471 1046 2526
19473 2526 -697 -6617 -9415 -6403 -5685 -4900 387 -1294 2040 1200 -781 1129 1967 3444 8108 9135
19457 9135 12282 12225 6639 6064 894 -4174 -1590 -1448 -4054 -6951 -11280 -12339 -7524 -111 2684 -4264
19441 -4264 -7260 -3147 322 -3951 -5801 -7206 -5752 263 1113 624 520 1278 2553 3875 1015 1642
19425 1642 3105 -1363 -7304 -11680 -18042 -18627 -14476 -9841 -11315 -11798 -9883 -2254 -4209 -4563 -6151
19410 -6151 -2077 -1429 -2687 4739 7557 2297 -5892 -13579 -15879 -15016 -15606 -12951 -11106 -16111 -13077
19395 -13077 -11199 -15007 -14364 -8821 -12884 -2048 5839 8352 7715 5494 1512 1899 3020 4359 -558
19380 -558 -5837 -12073 -14537 -10615 -1470 4208 4872 -483 -6728 -10477 -7972 -4547 -1304 -320 -1586
19365 -1586 8621 11046 12406 8547 6321 4799 1487 -251 -591 -3588 -3517 -2194 -6639 -9421 -7831
19350 -7831 -4071 1763 5711 12327 14505 8055 2345 246 3673 -598 720 -34 5842 6973 -1000
19335 -1000 784 2325 -4779 -10453 -8746 -4193 2558 9237 13136 13001 7028 -1401 -5073 -4305 -204
19320 -204 5065 5703 5533 3765 -1298 1224 3130 4369 8679 2648 1793 4162 7579 2683 -679 -3770
19304 -3770 -10057 -5101 -4876 4195 10186 10430 15341 18005 16100 18752 20114 24457 26281 21375 22717
19289 22717 33994 30855 26725 24441 31696 35257 29421 27069 11583 4827 10343 17809 14698 7575
19275 7575 6704 9689 11355 12938 12117 10956 12329 11960 11872 8007 -1447 -13628 -15145 -6149 324 -2860
19259 -2860 -8341 225 425 -1882 4840 8709 2331 724 6997 -3198 -12247 -11214 -9245 -13191 -14127
19244 -14127 -11192 -10958 -11753 -3365 -1736 2333 3654 -1823 189 8771 8635 6968 6843 11394 10373
19229 10373 6129 4667 3538 1259 -1281 -4899 -947 -3742 -6333 -3936 -222 3181 -2036 555
19215 555 5587 -1728 -5364 -5140 -2272 -5413 -1137 -8307 -9562 -5917 -6285 -1458 4217 2741 -1664
19200 -1664 2186 236 -86 -1993 1526 5047 2739 -4398 -9075 -12356 -8234 -3263 -4088 -805 -587
19185 -587 -2548 -11872 -5808 -3319 -382 5848 3537 1686 -1973 -1028 -1974 -5935 -12100 -11576 -11294 -8068
19169 -8068 -1519 5556 4138 7073 9582 4413 2391 -1359 -3730 -9018 -6650 -7396 -4819 2554 4168
19154 4168 -3052 -3410 3769 6427 6725 4081 4368 7361 6471 4251 2966 2732 7484 12847 7813 -284
19138 -284 -3267 -4436 -2310 4498 7348 9655 9592 -5644 -18402 -16397 -7750 -5377 -4776 -5658 -10709
19123 -10709 -4656 1856 6262 9783 11187 15501 23003 18264 402 -11377 -5086 -5212 -10599 -14771
19109 -14771 -18202 -20010 -12936 -9851 -9556 -3473 5046 12202 13308 12635 8946 2943 1163 1590 -1370
19094 -1370 -7654 -3458 110 6255 1546 4456 4784 3899 9741 16625 9571 7145 6898 9372 4005
19079 4005 3182 9364 10080 15834 17046 18360 16955 15120 12604 3153 1189 9512 17781 20652 18083
19064 18083 28215 42517 66308 93636 129311 159494 162377 138385 104247 80974 72159 69014
19052 69014 77300 96705 138659 175478 189217 165256 118743 88138 71916 56607 42307 32450
19040 32450 27177 23514 25617 22922 22677 29728 43350 49172 43069 30499 25466 32370 34385 35196
19026 35196 34359 31803 36103 41040 50531 62346 59033 48331 43732 47144 54299 55694 54422 68188
19012 68188 88310 122762 169285 193261 187325 155689 119894 99666 92922 85743 91219 117422
19000 117422 151109 179667 183906 150114 105503 79259 69572 61018 48697 42271 41141 38749 29850
18987 29850 29958 26860 28989 36040 40321 46318 50551 41302 33368 31935 26783 24917 34993 45418
18973 45418 45765 47201 52134 45846 38203 28735 25994 24398 15632 8180 4397 3358 6408 10639 17207
18958 17207 18394 11403 6929 16172 19377 15956 11100 10059 10650 9795 9204 11507 11869 6322 13690
18943 13690 21619 20162 15659 9855 9977 10127 11263 10609 6756 2803 6739 7708 8019 3434 -1338 4640
18927 4640 13547 11695 2823 3986 5244 5059 -727 -6777 -5369 -13062 -17774 -12577 -5570 -970 -2999
18912 -2999 -2096 -252 7585 4524 -648 1512 4311 5649 5049 5203 9852 12836 5697 5054 9477 17553
18896 17553 19242 7076 -223 6479 5543 4914 5371 5917 6003 5900 1921 -4719 -11632 -10256 -6755 -1495
18880 -1495 3116 6482 -1790 -7606 -5494 328 8491 11632 13228 10928 14220 16315 17408 12968 3262
18865 3262 -434 -307 3249 11707 15457 17474 20053 18770 11320 4530 4901 775 686 10837 16341
18850 16341 9679 307 -3470 -5311 -2116 477 617 2700 14266 23549 16022 227 -12009 -21002
18836 -21002 -14775 -3533 -1833 6113 11307 8113 4356 9499 7469 9505 9667 9638 10423 14769 10020
18821 10020 510 60 6650 10952 7013 8251 7710 12404 14463 18587 18380 15691 13260 13829 13355 16016
18805 16016 8882 11806 12535 8878 7909 8260 4487 3399 7436 16375 26448 25892 23244 28439 27708
18790 27708 19095 12486 8166 10696 17416 20962 21476 22553 17748 11350 10131 10353 12256 9477 10141
18775 10141 10435 15660 19258 22622 29066 34700 51178 87767 112430 91203 57079 38664 28015
18762 28015 19028 14030 16718 20384 18030 14930 12891 5489 4303 5590 14761 23235 22827 16242 20327
18747 20327 32741 42865 51544 51702 47275 37723 34024 36050 29964 31356 41457 45258 49707 44210
18733 44210 38898 41199 39800 38687 35147 35322 33947 31421 26594 24196 19856 19085 20831 20822 14977 18023
18717 18023 22995 10943 7642 12042 9478 14757 19559 22948 27086 31407 29698 25066 25374 19495
18703 19495 25372 26272 23581 18569 13073 15641 26215 36696 37762 28651 22094 20655 19069 16098
18689 16098 17882 21888 32383 40386 44481 44172 39038 29777 17995 7685 9073 16535 17667 18245
18675 18245 22081 27771 29539 35909 36104 42282 56096 55210 54182 52713 49926 38644 37117 34935
18661 34935 34860 40007 48551 55972 57907 52842 45890 40989 37994 39057 38348 33574 32064 34034 38324
18646 38324 45533 51028 45060 34101 27070 22008 23494 26769 26986 27946 37109 45935 44861 40385 32019
18631 32019 22683 23632 29569 36164 37713 40113 45265 47064 50621 48610 55257 69338 89696 120130
18617 120130 136385 122437 103262 90451 93761 94329 96781 110157 134530 167238 185387 175076
18605 175076 147614 116061 93414 84090 77536 74628 80901 90875 93986 90779 86814 87904 85446
18592 85446 83428 84925 90506 103957 113278 117910 126628 126410 128413 123303 125532 129728 135566 147756
18578 147756 163961 183379 196362 215961 248203 292491 343089 401908 454927 481056 498498
18567 498498 535201 595240 649369 697874 778012 909494 1019328 1044984 1003255 958302 970115
18556 970115 1055841 1159849 1267132 1385342 1522148 1687013 1909836 2263280 2840418 3758260
18546 3758260 5235304 7705573 12015287 19067689 27516143 32529707 30862068 23920614
18538 23920614 16796783 12515885 10813349 11096843 13528825 18935713 27220292 33887937
18530 33887937 33990449 27281474 18459314 11886819 8017671 5757947 4353872 3458327
18522 3458327 2878899 2499731 2268509 2148516 2078187 2020345 1949245 1888398 1867248 1841210
18512 1841210 1765404 1660681 1590664 1580779 1630923 1714893 1804894 1881995 1939251 2018624 2133801
18501 2133801 2286099 2521803 2918472 3599227 4712278 6536168 9667546 15131865 23631313
18492 23631313 32429877 36072162 32115769 23774598 16671466 12863375 11635906 12541384
18484 12541384 15940638 22672038 31706349 37473030 35588708 27214455 17958572 11573331
18476 11573331 7837959 5617019 4224039 3330387 2734951 2318104 2028692 1834608 1694033
18467 1694033 1548482 1387243 1235056 1096537 977352 898032 860278 871376 901703 900854 840995
18456 840995 743303 649090 578092 534960 488657 439188 393919 358371 322332 292390 275991
18445 275991 259413 247978 242263 230985 212881 200948 192509 180188 169309 164415 159572 155923
18433 155923 152255 158227 163861 150583 138788 133265 128386 126104 120600 115382 109570 107854 103924 105507
18419 105507 98956 90571 92445 82200 82042 82998 88839 89080 82445 79402 84038 86534 81594 76413 80276
18404 80276 81320 87561 94361 92265 84705 77335 68495 60868 63225 67133 71010 72946 68686 65052
18390 65052 53782 46568 41259 39371 48515 58496 66740 64559 60970 61820 56437 44474 24240 6597
18376 6597 5242 19281 35917 46922 63579 71250 61759 52999 49809 54868 58354 55806 53893 54806
18362 54806 52592 49109 43988 39448 33423 27419 28124 35040 46250 51592 52464 47502 42373 40730 38115
18347 38115 44167 42422 37798 31024 33957 38519 34875 27895 9746 4542 7562 3603 9207 23951
18333 23951 32302 35353 34215 34761 29696 23548 13894 18157 30175 37673 34339 33822 32814 32584 38376
18318 38376 43665 43594 45036 44528 35322 42705 46969 43897 39200 45523 47742 44235 37261 33187 37177
18303 37177 39257 36191 36126 36058 33727 33187 37872 34364 33754 29805 20833 20811 19351 12896 16681 24889
18287 24889 32759 28073 30144 35119 36581 35531 38781 39677 43577 42291 48534 54080 62566 70013 79477
18272 79477 79588 70967 76477 92046 109663 143979 198928 249661 280025 273064 232742 175387 135201
18259 135201 121189 126721 140430 182336 247739 296375 295793 259556 205603 148042 115240 98988
18247 98988 80908 64692 55266 54406 63747 71044 65822 66133 68724 73706 84220 89456 85999 83716
18233 83716 74488 67114 72077 79498 88006 92465 99188 96759 90424 89825 84761 83149 90416 99044 116081
18218 116081 141278 179046 253244 321742 341041 299662 233004 174508 152281 152378 159520 180795
18206 180795 228875 298982 349033 348260 293755 212398 150174 117987 102794 89285 87162 86377
18194 86377 87145 85141 86434 82156 79261 89736 109175 124005 134989 137924 128370 123479 121797 117604
18180 117604 124004 140672 144512 143430 142110 146953 158096 173153 197263 245587 343188 478285
18168 478285 598613 642428 594034 475889 368559 308841 301455 323271 315041 276862 248997
18157 248997 245265 255101 283114 318085 327988 299012 258237 226336 213787 209302 208171 221189
18145 221189 242036 283604 330500 365817 376808 367457 360370 368849 384951 407809 431279 466288
18133 466288 521928 574370 619543 675315 741691 833921 962187 1105317 1225790 1313977 1387458
18122 1387458 1503670 1724978 2092914 2614512 3271304 4149124 5527679 7873908 11771655
18113 11771655 16920899 20357862 20504509 21114447 24012491 23117121 17325352 12446250
18105 12446250 10720976 11584034 14433590 16971534 15635493 11389605 7615742 5323141
18097 5323141 4006122 3193163 2643286 2267796 1976910 1744920 1581361 1465959 1372393
18088 1372393 1310273 1290999 1303040 1322831 1341844 1363295 1406027 1468665 1556604 1645157 1706116
18077 1706116 1763698 1876367 2080632 2358706 2723591 3246215 3991417 5078990 6866429
18068 6866429 9963363 14860611 20277310 22053945 19525670 17155840 17975337 21680259
18060 21680259 24580362 23141059 20007742 19302493 21529785 23377543 21474139 18082106
18052 18082106 17017033 19149961 22054964 20921827 15757471 10697440 7457329 5556148
18044 5556148 4377368 3573016 3011430 2620060 2340657 2147262 2022259 1936856 1879665 1837882
18034 1837882 1810412 1781250 1755218 1774796 1822787 1840380 1792470 1701878 1647440 1666429 1749494
18023 1749494 1882478 2084243 2395315 2875832 3559953 4555484 6231218 9175586 14021752
18014 14021752 19969431 22436123 18862223 13379840 9618278 7749744 7136703 7514094
18006 7514094 9080799 12335282 17332509 21215828 19575027 14058428 9170153 6188819
17998 6188819 4465701 3394668 2674181 2181535 1824516 1555809 1356093 1176692 1024464
17989 1024464 934844 902275 882332 843888 778281 738511 722128 709184 667981 608033 581408
17978 581408 602619 642993 651353 595211 534612 497013 462613 427092 404591 414998 435228 444348
17966 444348 441403 428749 386458 328222 284338 257181 245116 254248 270949 271003 245900 222242
17954 222242 206517 196811 200944 195992 197160 214635 235634 247000 233826 214312 208093 213114 231705
17941 231705 282628 344394 362126 346259 321664 283280 227660 190217 178263 178536 196936 238678
17929 238678 258860 228176 181927 147843 128852 117928 108678 96701 92211 88774 84326 84874 89309
17916 89309 88694 85199 76874 65217 58629 51928 58136 59973 58601 62459 67122 79486 88905 101085
17902 101085 129604 165221 188875 199655 183882 150147 122499 109678 114704 123455 141414 172244
17890 172244 202884 213684 188702 143411 112408 95174 87046 76531 69069 62288 60228 53757
17878 53757 49719 48205 44746 40956 38587 28430 37886 43969 41867 37115 34425 36103 32764 26196
17864 26196 21676 26100 24604 26599 29658 32810 33156 37479 39653 43286 47391 68903 92614 93723
17850 93723 73534 58580 52169 54523 55311 57885 66303 78983 98923 102316 88250 69674 53028
17837 53028 50917 47248 45714 43872 41433 35710 32089 30055 28468 30905 29466 33022 36486 32495
17823 32495 29738 28527 28736 28013 29003 31913 35511 39304 39452 35642 32278 37436 43540 45030 44852 46821
17807 46821 50182 50270 49746 48176 48927 47259 50735 51630 52220 55386 51878 50129 46566 43264 47536 45033
17791 45033 41371 39519 38577 37733 41694 37065 27567 28790 34540 33728 33235 24221 21282 19085 19847 25579
17775 25579 22987 19966 25249 26304 24313 24133 32589 38916 28259 23239 22782 25680 23521 28237 38217
17760 38217 47256 59616 63119 60483 59453 54819 58829 64006 77554 78658 76244 72608 74349 79475
17746 79475 77170 77236 71915 64601 58647 55531 57942 49860 42859 44036 36471 27139 29912 34185 39969
17731 39969 42661 45367 51549 49207 45828 44949 47785 48030 43983 48902 47439 38276 32475 35184 43610
17716 43610 46539 48663 53345 59854 59303 62427 66855 73430 78958 88226 106462 120215 123602 129769
17702 129769 130398 143914 163009 175937 173250 158458 139345 125106 106867 92785 85412 87591
17690 87591 93821 89430 71494 60131 65363 64079 54117 59678 66610 68958 72338 73154 84417 85827
17676 85827 88634 97723 94622 83002 78598 78446 76056 73265 74139 75411 80020 74383 73979 75457 80399
17661 80399 90227 94106 94163 98278 98655 103811 110481 116051 123631 134813 147282 159951 159337 156040 154762
17646 154762 151183 145296 134309 129334 125910 117222 113262 109879 103455 103035 114369 120112 124135 130979
17632 130979 134353 135924 138430 140651 150293 160831 178412 209818 256124 296211 298175 285347 282581
17619 282581 305030 357741 436435 494469 486912 436905 388977 386081 439222 518710 580530 574127
17607 574127 524321 466810 416917 388922 376508 376664 401680 438490 476027 490874 481294 461567
17595 461567 429768 402178 383822 386732 403004 424073 457279 506720 576564 652035 720652 765454
17583 765454 791779 812041 835317 880754 951867 1047902 1171206 1330127 1516012 1689586 1835942
17572 1835942 2001641 2217821 2437915 2633356 2925668 3448734 4286280 5547717 7501019
17563 7501019 10539482 14821446 19965920 25087242 28794359 30007727 28610079 25672804
17555 25672804 22982648 21922037 23143259 26466995 30826572 34214437 34699321 31754478
17547 31754478 26277091 20100299 14663517 10555355 7773282 5974336 4790558 3966753
17539 3966753 3358659 2897367 2570244 2358510 2245599 2207224 2214510 2248741 2272972 2273054 2231069
17528 2231069 2174977 2141592 2140497 2212127 2361219 2531452 2635560 2630631 2552883 2492759 2506471
17517 2506471 2621965 2830588 3155000 3681553 4528789 5880232 8017314 11214874 15444501
17508 15444501 20191485 24250620 26219429 25504773 22770910 19695807 17814801 17977895
17500 17977895 20157651 23516045 26535532 27566432 25868071 21834415 16849834 12225013
17492 12225013 8654050 6239544 4706476 3710113 3024912 2536870 2190540 1953926 1809293
17483 1809293 1709270 1623801 1542850 1440634 1312354 1185902 1090453 1052716 1061195 1091002 1120606
17472 1120606 1129574 1081344 987710 883321 800379 737379 703501 702104 709615 699538 650091 594557
17460 594557 560479 551673 555614 566597 577996 588584 610707 650560 701051 760350 836783 944548
17448 944548 1073524 1233093 1431694 1693432 2078473 2669458 3556805 4886703 7116192
17439 7116192 10970377 16816684 21999354 21495905 16493129 11910050 9406758 8552377
17431 8552377 9102601 11311433 15407065 19573820 19299085 14575701 9703943 6580538
17423 6580538 4741235 3600758 2858441 2371418 2041125 1796007 1622195 1500807 1410332
17414 1410332 1339133 1273430 1217062 1198180 1207396 1220589 1226107 1231926 1248536 1277056 1340221 1450624
17402 1450624 1606584 1782708 1954978 2157828 2477520 2970548 3720076 4837552 6544268
17393 6544268 9321289 13930171 20604844 26542745 28573271 29208199 29126407 25476926 20426396
17384 20426396 17726379 18356278 21826653 25738143 26870516 26524788 25713704 21592595
17376 21592595 15317640 10304817 7236360 5382590 4175783 3348337 2774104 2353284
17368 2353284 2046475 1803708 1602428 1449279 1348931 1293125 1253487 1222981 1200866 1176026
17358 1176026 1137160 1120895 1144426 1207122 1278198 1321472 1368521 1431495 1505982 1620486 1815767
17347 1815767 2146422 2668212 3461065 4744998 6984066 10770726 15692992 17992520 15237987
17338 15237987 10878029 8025022 6797628 6743458 7856850 10447555 14239517 16339219
17330 16339219 13946785 9496860 6115980 4150911 2997722 2278938 1819696 1497078
17322 1497078 1239990 1029396 865213 744282 651851 590523 546752 516230 501397 483909
17312 483909 447444 400058 364639 353574 350580 354250 372182 398850 400675 367653 318811 283651
17300 283651 261331 249193 244942 253019 262203 257866 220585 189479 175747 163182 147031 134656
17288 134656 127348 129725 131068 113211 106194 102204 101264 108045 111728 108792 104806 101588 86217 74148
17274 74148 70497 70201 66676 82592 86099 83500 76597 73391 69070 65624 64893 70466 73230 67705 71198
17259 71198 76085 77989 78881 79069 74123 71083 80468 86394 83786 78441 71478 64691 65986 64945 62167
17244 62167 57954 51617 48653 48688 48970 45502 39942 27748 19593 14400 26797 33551 30242 28898 33905
17229 33905 31068 26202 26279 19412 21912 23883 20714 29069 37296 41876 41200 44529 45299 37701 36672
17214 36672 31926 28456 30179 32103 30661 27899 26303 28994 28381 33678 34000 33338 43493 40870 39729
17199 39729 37323 32333 34769 29368 24078 24063 27489 25769 26607 29343 30933 24247 14128 14915 13999
17184 13999 14765 12611 10239 13922 19485 22084 17083 11885 11969 14474 8558 4279 17903 23806 28252
17169 28252 30109 27694 27237 31201 27373 21256 18107 18100 20513 24250 24052 26119 29265 29111 26504 24025
17153 24025 31062 36140 29632 22338 15822 13886 16782 19581 21838 21852 21158 21429 21363 23876 24389 25079
17137 25079 23477 15692 15351 25685 33050 29098 22949 28959 26053 24203 20420 21434 22451 24225
17123 24225 23676 27272 25332 22709 21893 16973 10905 4383 1202 2946 3991 5882 9379 9340 11667
17108 11667 10807 8916 11862 16124 14576 7141 8355 11055 15402 15249 16823 11798 10865 11717 9749
17093 9749 9382 17490 15668 10305 8965 8839 10471 12733 13675 22772 27103 25412 27214 25367 23030
17078 23030 18986 19274 19759 22753 31731 30187 23096 20866 16265 17087 16495 16843 12328 3469 8821 15342
17062 15342 12767 20089 29295 30613 29337 38244 47173 57726 82898 115452 147514 169542 170452
17049 170452 159129 141625 120409 114066 115305 131266 149208 156498 154898 144861 115391 98897
17037 98897 85361 64891 47724 36968 31016 26811 21420 16788 14381 14878 21409 20280 16441 15024
17023 15024 15946 16254 19431 18458 17521 18209 12910 7765 11572 12621 12486 16191 21502 19680 20275 19924
17007 19924 18851 18380 31098 43344 51271 72179 107018 139601 154467 154741 146235 135621 123513
16994 123513 115671 115979 116256 134099 144229 140091 129398 115732 96376 74140 50374 41981 41140
16981 41140 31981 20585 14707 18672 21609 21564 15932 13948 19995 21613 23375 22494 12300 10268 8001
16966 8001 1308 360 6600 12690 13703 12199 18327 13570 5263 1403 1663 -1020 5936 8192 5073
16951 5073 6671 3625 8546 9246 10344 9950 6508 2547 4216 1411 397 -724 5344 8692 4304
16936 4304 3465 9262 3767 4347 3709 8948 7163 4837 6188 4319 8189 12261 19219 21155 30110
16921 30110 42092 55525 83269 106882 106998 84523 67869 53409 47929 55903 68086 82537
16909 82537 96971 102937 84091 60360 41725 24543 19639 17207 19902 25654 29793 22046 13467
16896 13467 4268 -5502 -2248 1155 6417 12792 12941 15952 15029 13959 12830 10566 10127 7196 9199
16881 9199 13910 24022 22951 14506 25003 40572 45189 55830 72216 100498 131208 142972 146529
16868 146529 143250 131706 108778 94658 99117 120712 146472 152296 142028 138239 118039 86690
16856 86690 55990 40249 34553 32498 26183 24911 14311 10370 13810 16954 13196 14511 15749 14892
16842 14892 9121 11463 12058 5753 2 -1942 -2563 470 519 1929 6152 10124 11803 13462 9657
16827 9657 15901 24263 31664 46008 61594 81041 92592 92293 65422 49001 42442 40919 46664
16814 46664 64076 79540 86288 73549 57898 44315 33094 27947 21774 14995 9215 5903 7206
16801 7206 8537 15461 16700 8698 10425 1257 -5776 -916 4090 2611 6447 11079 10397 2783 2206
16786 2206 5859 2282 -2550 -4032 1235 8031 10616 5431 -3363 -9581 -9248 93 7351 3484 4128
16771 4128 -3219 -1445 -2927 -4839 -2690 1007 -4535 -9247 -4846 91 4658 2514 -680 -566 -1113
16756 -1113 -6418 -3440 3006 4605 8275 4168 1411 965 1043 4018 -2456 -3867 -3351 -9202 -2947 5365
16740 5365 2938 -1023 -4731 2648 4392 1118 -2281 -11620 -12078 -2246 -5335 1632 2273 1392 -572
16725 -572 -5709 -10502 -10042 -9742 -7954 -3016 1026 -4564 -7753 -3994 -5099 -8165 -6557 -4596 -1364
16710 -1364 551 -2260 -2037 -2135 -4721 -8249 -4026 634 1245 -154 -2047 -8365 -10582 -3434 -274 -4017
16694 -4017 -5442 1730 4181 -416 -2256 5245 11082 6949 4234 2645 1461 -5119 -11176 -8694 2064
16679 2064 1669 -3810 1397 -5073 -7241 -75 3398 5775 11945 10623 2781 209 -8025 -13247 -13286
16664 -13286 -17621 -17360 -16018 -15003 -10504 -10624 -13801 -13981 -6208 -245 -731 3895 5829 8350 12687
16649 12687 9918 5724 3669 6211 10488 9543 4161 1369 1560 -4087 -6614 -5964 -8728 -4978 1005
16634 1005 -6321 -8559 -2282 -172 -1485 888 1482 -5580 -6470 410 8861 8252 459 -4315 -1404
16619 -1404 -3104 660 -1194 2196 4254 3047 6621 9348 10418 5562 4573 3105 6048 3986 -1705
16604 -1705 -1971 3125 1490 -973 1824 279 -7830 -17553 -10908 -4989 -7023 -1332 1323 -1372 -181
16589 -181 3950 1702 -1035 -4766 -9826 -7941 -3107 3397 2683 37 1026 6990 7286 7980 5031 4942
16573 4942 1165 2215 38 -7821 -10042 -4552 -3560 -4751 -4036 75 3789 2782 -24 -3823 -5122
16558 -5122 -8007 -10562 -12873 -12226 -10976 -8216 -3959 -720 1101 3146 3821 -3130 -8441 -6938 -6611
16543 -6611 -3913 -5981 -422 -1626 -4429 -3124 -1262 -2520 1489 -3833 -13035 -11906 -5481 -3760 -984
16528 -984 -1689 -988 6280 -239 -5159 -4410 -1554 990 2154 4811 11285 8065 -1087 -4578 -2077 -1805
16512 -1805 -6073 -4447 -5463 -1964 4355 6873 5907 4265 2667 555 -3853 -7657 -10415 -10279 -8407
16497 -8407 -9754 -10837 -7258 -3944 2820 8058 3549 -1855 -8064 -8850 -11726 -13189 -3056 -1858 -11260
16482 -11260 -12234 -8835 -1733 -348 -1708 -4175 -5069 -2163 1486 -1502 -2339 -1671 -6825 -12116 -10827
16467 -10827 -2641 1008 -2042 -3821 -1498 3119 305 674 8760 5713 4251 3554 4263 3336 11353
16452 11353 12210 5364 -2762 -7010 -1977 871 -4073 -4475 318 133 3147 -957 -3093 2621 3589
16437 3589 613 2105 3698 1212 4540 6621 2280 -4432 -15951 -23131 -24177 -17654 -7456 -18
16423 -18 341 1130 2451 -4202 -7559 -4787 10707 10868 1261 -2840 -1850 1911 2295 -117 -586 -2592
16407 -2592 -5851 -12448 -25031 -25431 -17815 -12533 -7279 -11784 -12433 -5098 -2004 -4139 -7745 -7739 -6153 -4647
16391 -4647 -4043 -4154 -4251 -6295 -9078 -9840 -9663 -11552 -12120 -21912 -16969 -11813 -11218 -7211 -4732 -7154 -1981
16374 -1981 -3188 -12777 -8314 -2315 1899 3156 1661 1667 -6333 -8486 -5905 -7712 -2040 -2649 -987 823
16358 823 -517 -6110 -5754 -1169 -304 -6264 -12056 -13790 -5891 -6669 -4791 -209 -405 -5068 -9538 -5470
16342 -5470 -1785 464 62 -974 -6381 -2199 -731 -2013 -2092 -5871 -5330 -1338 1791 3288 8155 4690
16326 4690 -2128 -8502 -15776 -18998 -11691 -11673 -9857 -7927 253 -4649 -13118 -9123 -7039 -5811 -412
16311 -412 -4088 -6290 -5911 -7652 -4444 -4488 -2275 -7165 -9826 307 5800 10880 10946 9110 6596 -13
16295 -13 4195 9148 13432 6822 -3854 -6228 -3525 2479 6947 2008 -7863 1975 1003 3313 13083
16280 13083 5761 2148 5906 3182 2479 6692 2885 -1892 -997 2024 3466 -2710 -5411 -1104 -151
16265 -151 634 -1252 -1014 3836 8535 1568 -5511 -5380 -7874 -13172 -6123 -538 -9549 -20777 -22486
16250 -22486 -14877 -14572 -9019 -4195 -2506 -2085 -678 -59 -1678 6239 7539 4189 6176 8940 8219
16235 8219 2620 -571 -1192 -1873 4412 3149 -4642 -3795 -1899 -3448 -5532 -10191 -5003 -2075 -2490 -8853
16219 -8853 -7001 -2959 -4399 -817 -864 -8686 -4375 -2782 -9646 -16111 -9074 -7545 -9226 -9353 -8239
16204 -8239 -10276 -14025 -10599 -4390 -3784 -4862 2540 8790 6395 -1142 -7719 -11773 -9844 -9558 -8569
16189 -8569 -1717 2492 -4830 -14506 -13959 -9349 -3126 -62 -8213 -18159 -10534 -4511 -1376 -1506 -7641
16174 -7641 -8073 -182 4363 -157 -3700 -8254 -7559 -8889 -3602 -501 721 4201 3162 236 7027
16159 7027 3324 -860 -192 289 -3983 -2111 -3983 -4603 -8173 -9374 -7560 -7966 -8742 -11855 -14051 -15038
16143 -15038 -16932 -15990 -13328 -9082 -7418 -9690 -14998 -13579 -11485 -6417 -869 -4200 -6046 -3552 495
16128 495 -162 -625 -83 -1679 -3919 -2627 -2603 2762 2801 9320 8939 5929 -2644 -4946 1135 4319 7595
16111 7595 9128 3961 -1586 -3964 -4610 -7954 -1804 6695 7638 4926 4227 -2464 -6143 -8065 -13051
16096 -13051 -12764 -8444 -4356 -5248 -11762 -16462 -11473 -3771 2917 2914 662 52 1230 -3066 -8029 -5830
16080 -5830 -3270 5698 7745 6796 -3828 -1746 1133 1147 -4055 -2911 -3374 -1626 -3014 -4972 -54
16065 -54 -2527 -4669 -6286 -7860 -10274 -3599 -2443 349 -2680 -6661 -4982 -4902 -4660 -3483 -6604 -3278
16049 -3278 -2504 -2596 -2327 -3836 -3701 -979 -685 4366 4050 4725 3102 8675 10211 2354 -5995 -2002 2294
16032 2294 -1194 -3767 -1790 1163 1795 -2174 -5494 -2225 -9910 -17605 -15383 -11774 -4106 -5057 -3490
16017 -3490 -2423 -6415 -8327 -359 2119 4637 3443 -6982 -12530 -13442 -8154 -3113 -4901 -6849 -8821
16002 -8821 -5254 -5129 -6316 -10936 -15171 -16404 -12895 -6627 -1235 1313 -3440 -2311 -1365 -423 -4485
15987 -4485 -4632 -4614 -3574 -2764 -6222 -9543 -9666 -10700 -5488 -2729 458 3288 2462 -4183 -8519 -13220
15971 -13220 -15484 -13843 -15503 -12237 -12079 -6312 -9059 -11201 -8909 -5097 -3378 -527 -2575 -11342 -17948
15956 -17948 -16605 -13293 -15985 -15568 -15307 -9013 -7563 -8349 -8977 -3478 -1497 -1776 -5995 -3100 -2561 3499
15940 3499 1861 2190 9752 12433 9080 6097 -2020 -7209 -4116 -8875 -15805 -17355 -8429 -918 -3111
15925 -3111 -3995 -4045 1263 3873 -349 491 -1161 -3115 -4786 -4239 -649 -3304 3449 3823 2477 4695
15909 4695 7658 8741 5517 3914 -6046 -15960 -10462 -2774 -4922 -9091 -10181 -3836 -4829 -9188 -9527
15894 -9527 -2938 -7596 -15870 -15643 -10225 -10083 -8409 -7719 -11695 -10090 -6978 -9939 -16340 -12485 -14208
15879 -14208 -16697 -12960 -8458 -13629 -16102 -15738 -12134 -292 4461 -239 -6473 -15035 -18081 -10231
15865 -10231 -5351 -3068 -1610 2454 439 -6482 -2496 1838 687 400 3115 -4234 -7773 -9357 -9471
15850 -9471 -10302 -9741 -7094 -7586 -8184 -6355 -3237 -3561 7649 10813 6698 3734 -1113 -2385 277 10047
15834 10047 9053 6685 8575 6117 -3061 -5006 -10899 -6044 -5649 -7989 -9345 -10729 -10392 -11582 -12900
15819 -12900 -8264 -1336 1341 -1700 -10168 -9718 -8071 -3015 -1672 -2907 -1910 1877 4640 -789 -1325
15804 -1325 824 -1974 3711 8085 10526 11710 2036 -5683 -5687 -5232 4413 10686 4714 -77 1851 1906
15788 1906 -5337 -5194 -4860 -9981 -9848 -345 5278 -228 -2513 2172 389 -414 -2797 -3016 -6132 -7360
15772 -7360 -10426 -7463 -2781 1365 -1462 -61 480 1401 -2005 -2162 -1285 -3782 -2966 1062 284 -2978
15756 -2978 -5542 -7769 -6685 21 3846 3407 3887 267 -2428 -3761 -1962 -485 -5060 -2623 -514
15741 -514 -3910 -2354 -3726 -6332 -8618 -6490 -4530 -10634 -2806 499 -2205 -271 22 -4318 -9523
15726 -9523 -2564 7758 -484 -4140 -753 -1204 3964 -2383 -5776 -2680 -6522 -9427 -7843 -12973 -15470
15711 -15470 -7433 -5538 -8597 -10132 -8896 -10351 -9519 -2062 -487 1009 682 -4634 -3798 -2727 -6123
15696 -6123 -5337 -9861 -6815 -3338 -7920 -12245 -6894 -2812 -1550 -789 -544 -2957 -3000 -368 -8138 -11883
15680 -11883 -4733 -4787 -9620 -7927 -4767 -7421 -6885 -10906 -10741 -8310 -13060 -10885 -12440 -14392 -14599 -13774
15664 -13774 -12964 -9952 -2563 -888 2428 2474 -1235 -8563 -20438 -14928 -7557 -5147 5105 511 -2493
15649 -2493 2216 5911 4880 -3377 -11789 -9019 -5492 -6092 -1907 2761 5333 3485 73 2289 894
15634 894 9853 8937 7255 2810 3308 -1687 -6966 -4346 661 2631 -2749 -2274 -1966 -6585 -11413 -11948
15618 -11948 -9497 -12945 -14995 -19181 -13218 -10193 -14303 -14911 -14200 -10121 -5453 -2508 -9428 -20909 -19461
15603 -19461 -17345 -19869 -9205 3485 3552 4750 4384 1208 -783 2791 9909 14593 6037 6669 5123
15588 5123 3314 2692 6632 7411 4195 4524 1928 -686 3517 -466 -2005 -5479 -2804 -6951 -9525
15573 -9525 -4463 -2858 -6416 -7857 -5612 -3476 -2758 -4868 -6552 -9290 -12023 -7331 -5132 -7985 -8063
15558 -8063 -7358 -5784 452 -3079 -4285 -4049 -5160 -15036 -4577 82 86 2987 3648 5434 7397 10008
15542 10008 8036 3185 -2035 2172 10887 14320 2595 -6688 -6189 -6790 -6173 354 4454 -2016 -8071
15527 -8071 -9352 -6861 -6735 -11378 -13572 -11608 -6276 -3134 415 -1814 -3413 -7615 -3662 -1693 -2467
15512 -2467 2632 -732 -5643 -12946 -17528 -10367 -8251 -13934 -9371 -7723 -4916 -1177 -2335 -3660 -6633
15497 -6633 -3267 6445 2089 -4576 -1332 3758 3977 -2566 -7380 -6229 1142 531 2316 715 -7337
15482 -7337 -12390 -7935 -1609 -4912 -4335 -2090 1096 -4569 -8346 -8699 -6181 -4262 -6130 652 6536
15467 6536 2837 2109 -4240 -9760 -13328 -16250 -20438 -10696 -10560 -8903 -5599 -10931 -10067 -9183 -6078 -3363
15451 -3363 -5886 -3092 -3118 -8146 -8162 -6921 -12662 -17335 -8123 -8010 -8858 -6625 -7435 -8417 -11599 -20213 -24263
15434 -24263 -17416 -15402 -13718 -6217 947 -1039 -1474 2657 -1027 -7089 -11393 -11932 -4052 -5106 -4662
15419 -4662 -9069 -19415 -12094 -9100 -5859 -8941 -14083 -12457 -10871 -7558 -2009 -378 -3867 -3313 1746
15404 1746 1675 -5523 -6974 -6160 -9492 -4380 700 -2449 -4055 -9545 -10467 -11208 -5246 -9265 -11908 -7864
15388 -7864 -10204 -14651 -10246 -11510 -9213 -5400 271 185 2935 6437 6687 6383 3826 3200 -1529 -3205
15372 -3205 -5298 -5370 -10421 -16405 -16950 -19262 -21013 -14939 -10263 -10305 -7133 -2828 527 -5807 -11761 -15172
15356 -15172 -11018 -9947 -10067 -3071 3160 6998 2514 -2785 -4337 -8072 -13663 -15653 -9456 -9130 -4411
15341 -4411 1655 -3186 -295 1440 -1817 -2797 383 785 -523 -4389 -5306 -467 4945 6028 4416
15326 4416 8158 7977 -2646 -15395 -15355 -7702 -5711 -2223 -412 -5789 -9387 -7308 3253 12824 10148
15311 10148 7686 3880 -1099 -8903 -5532 1605 -4173 -11412 -11786 -2961 -5466 -10219 -8201 -12633 -12971
15296 -12971 -13100 -9360 -3974 -1256 -1427 -7621 -14505 -5155 -2769 -2953 108 -2519 -6308 -5859 -6096 -10468
15280 -10468 -21080 -19118 -14368 -11684 -7078 -1266 4465 -942 -762 1777 1786 1510 3038 -1168 -8788
15265 -8788 -11846 -9098 -9087 -8046 1188 4603 2333 2746 -3168 -6904 -7442 -10107 -6424 -4937 -2156 8608
15249 8608 7313 10108 3193 -1090 -1609 1057 7209 14803 12903 8388 3965 -2357 -439 4343 5901
15234 5901 11611 15123 14248 7640 796 -372 -2925 -2758 5030 5666 1699 -1347 -6499 -5486 -3055
15219 -3055 -2785 -8872 -4514 3215 6739 85 -4210 -1719 2593 925 -7773 -10036 -11485 -5439 37
15204 37 -1023 -347 -5001 -4182 -4136 -7938 -7057 -9696 -9770 -5085 420 1640 3638 -3528 -12766 -12410 -12613
15187 -12613 -16709 -13239 -14184 -15180 -11853 -3725 -1449 -6001 -6970 -7666 -8009 -2806 -3745 -5958 -8927 -11000
15171 -11000 -8263 -9668 -12025 -15160 -16719 -7311 -1514 -8276 -11568 -8547 -6595 636 -516 -5172
15157 -5172 -7717 -10443 -10598 -8506 -4199 767 4286 747 5503 7397 6730 10224 11918 6695 -4426
15142 -4426 -6395 -3307 -3006 -5260 -7055 -6208 -6477 -5765 -3820 -3181 -4397 -4877 -1654 -1558 -1665 6447 1211
15125 1211 588 6606 7036 5020 4728 -221 1694 168 2922 3012 3730 903 -4167 -6767 -5083 2190
15109 2190 6203 1537 -2515 -2796 -1144 -4210 -6643 -9664 -7367 -3419 785 3490 6236 7052 4889
15094 4889 2066 -473 -4606 -5206 -2080 -6175 -4033 -3123 -5337 -11534 -7865 -1867 -5450 -15102 -16029
15079 -16029 -11381 -2752 5002 -257 3849 -714 -8855 -8364 -5465 -3593 -4945 -4800 -6418 -8460 -11309
15064 -11309 -21261 -24483 -15165 -7291 -4601 -5472 -2558 -2050 -6025 -5324 -4585 -8803 -15679 -17785 -14138
15049 -14138 -10050 -3675 -4198 -2403 713 974 4324 2964 4122 13192 24925 23822 8871 -1593
15035 -1593 -2382 -6577 -7551 -6710 -8480 -12439 -12999 -7818 -3881 -5836 -12179 -10083 -2493 4207 8670 578
15019 578 -3936 -854 -1921 -7427 -7193 -9166 -8844 -1444 6308 13361 14492 9058 3939 2453 -4523
15004 -4523 -7816 1136 17832 31651 38600 33156 33480 40172 45345 51166 51356 56331 72787 97380
14990 97380 119970 141873 181715 241696 329466 491374 776704 1307660 2306606 3818341
14980 3818341 4534868 3504443 2067357 1202826 762112 519387 373861 285570 232594
14971 232594 189316 153100 121746 95416 74542 58009 48771 49575 52065 49496 47275 42548 34130
14958 34130 30848 28245 21447 14869 14195 18564 20910 16267 9699 6043 5864 6490 7213 11037 7952
14943 7952 6869 9672 11384 14850 11207 4989 -4048 2020 8057 7490 4852 9437 6658 735 -3975
14928 -3975 -3040 5622 4313 -5860 -6764 -4608 -2130 -2264 2412 -4172 -5491 -1217 3485 73 -4166
14913 -4166 -2721 -6258 -9134 -2775 -2594 -4014 -5998 -4809 -4739 -3050 -2928 -3782 -2076 -1852 -8306 -10363
14897 -10363 -9508 -7006 -4578 2570 1795 -5717 -8774 -9087 -9719 -6569 -7666 -8633 -6857 -7017 -9701 -11646
14881 -11646 -3063 2628 -210 1127 1575 -127 -4652 -2785 -2768 -2474 6795 8547 4562 2055 1039
14866 1039 1430 -5999 -4237 3642 11126 7118 4538 1805 2784 7161 6640 6631 6825 7287 6024 582 -3006
14849 -3006 -7952 -8723 -2848 -1516 -8140 -9925 -8483 -9237 -2765 -1360 -2899 -6048 -12869 -19184 -8281
14834 -8281 -3155 -207 558 4548 4205 -5521 -14219 -20849 -12684 -9088 -1196 -3796 -3440 -6790 -3185
14819 -3185 4660 8239 9842 6065 5332 -158 -2574 -8927 -10154 -5272 4517 6570 -1721 -10938 -8402
14804 -8402 -15243 -15240 -6518 -1281 -2937 -3720 -3161 -8577 -10901 -12535 -353 4046 526 -2337 -7700 498
14788 498 3504 432 -9392 -11655 -8747 -2700 -4547 -3090 -4923 -17475 -16178 -8635 -7633 -3464 62
14773 62 -4869 -3701 3647 2242 2627 -517 343 5411 1436 -1325 -373 -3533 -10572 -11747 -8360 -6418
14757 -6418 -12677 -10707 -5774 -3566 -11638 -15424 -12202 -9747 -13250 -17722 -13718 -12206 -12246 -16368 -13489
14742 -13489 -4823 8559 6706 3120 -1982 -5121 -5928 -1921 -6199 -4534 1368 2387 4589 10151
14728 10151 8202 3594 10662 12349 1520 -6340 -4009 -9029 -4429 -995 -6717 -5157 1258 3370
14714 3370 3188 2215 -11178 -9496 -1307 1186 -2163 -6941 -13354 -3433 1177 -5468 -7019 -6621 -5886
14699 -5886 3607 1879 -1662 5276 4022 3433 -1939 1106 4666 -1966 -15559 -16830 -8371 -6859 -6328
14684 -6328 -3842 -11206 -10482 -10433 -11368 -9078 -9809 -4834 -3552 -950 -5343 -7802 -5223 -5471 -4401 2195
14668 2195 1989 -799 -1362 -4502 -4909 -13547 -19632 -9462 -13266 -12886 -8691 -8763 -11136 -14458 -8843 241
14652 241 -2594 -5935 -6155 -7257 -2916 2695 -711 -5736 -4521 15 743 -1778 -6499 -7293 -1776 -2122
14636 -2122 -6615 -5632 -11766 -10866 -5472 -2079 -3423 -8514 -9029 2292 10938 7238 -2676 -7607 -6298
14621 -6298 -2497 -3320 -4101 -6207 -2636 4338 5603 5106 2427 -2334 -6517 -4688 -2086 -4234 -1970
14606 -1970 4589 2000 -5206 -362 5501 2876 -1964 -5507 -10277 -8280 -8076 -4605 -2917 584 1975
14591 1975 -4942 -9544 -14658 -22264 -20268 -6738 -1511 -3959 -1909 -2000 -6147 -5590 -4717 -3855 -11071 -10204
14575 -10204 -6366 -2164 1621 -143 -5417 -9872 -12743 -12616 -8809 -3733 3593 15123 15999 14943 12969
14560 12969 1077 -6141 -6860 -6508 -3599 -11904 -13808 -1239 -3147 -1687 -113 -6607 -10340 -14438
14546 -14438 -14334 -10589 -9055 -2758 -1939 -10824 -10120 -2236 -1922 568 4748 3435 4722 1104 34
14531 34 -2862 -1870 -3199 -8261 -4250 -4451 -521 -2268 4073 11041 8772 8679 7408 7013 8202 2784
14515 2784 -2675 -1012 1733 815 3457 -305 -2546 -6007 -8365 -6509 -7023 -7502 -11694 -7100 -8294
14500 -8294 -7526 -3753 9443 9638 9 -1176 -6395 -14892 -16881 -9988 -9639 -5575 -8274 -7950 -4726
14485 -4726 -3004 368 -4735 -12845 -11748 -10599 -8814 -4278 116 3608 -3508 -7213 525 1517 -7031
14470 -7031 -8577 -6538 -3260 -521 -2982 -736 -1146 261 -4675 -6507 -6424 -3751 2240 3300 -3156
14455 -3156 4006 11870 10596 2491 -2014 1477 2790 831 96 -1391 -239 1998 939 4026 6950
14440 6950 943 -6592 -10231 -2198 -2712 -6598 -6143 -7644 -10678 -8158 -6586 -11472 -4845 945 3835
14425 3835 -1652 -7483 -5697 -3183 -2655 3171 3807 6786 4973 -439 -54 8612 10589 8376 5165
14410 5165 262 5852 7939 2057 -452 -4499 -9496 -8479 -4184 -1089 -1479 -2752 -2393 -1745 4239
14395 4239 3683 -2399 2268 5701 5931 9662 5236 -94 -2667 -7422 -11033 -20184 -20647 -13202 -8233
14380 -8233 -9458 -14683 -14737 -11665 -8498 -11364 -11389 -7976 -6846 -11038 -6235 1619 -23 -10867 -16667
14365 -16667 -9381 -6172 -3383 -5880 -7922 -9822 -11356 -8186 -5286 -3056 530 -2592 -2446 3120 -2926
14350 -2926 -5417 -7557 -3740 -7747 -13263 -16595 -13274 -10919 -9215 -11329 -12161 -17095 -17662 -16330 -10387
14335 -10387 -2364 6723 9787 334 -3998 -5221 -6256 -11551 -9279 -9229 -6710 -4025 -4558 -8807 -1793
14320 -1793 -1139 -3834 -5172 -3203 -2302 -6475 -9304 -1529 911 -5053 -10868 -15987 -15574 -18442 -13247
14305 -13247 -5294 -919 793 2424 -5255 -1164 1212 3062 -1850 -8667 -4882 8 2180 -5371
14291 -5371 -12949 -12257 -8722 -518 1417 -478 1815 3717 5441 -619 -8358 -4572 -4947 -10629 -14342
14276 -14342 -11747 -9821 -7541 -2741 1090 -1141 -6696 -7468 -7903 -9375 -9548 -11408 -11285 -4013 4140
14261 4140 1798 -6457 -7718 758 -297 -4628 -7638 -14396 -11355 -7987 -9835 -6193 -4353 -7543 -7656
14246 -7656 -5763 -5105 -8556 -11640 -7562 -12420 -14685 -17532 -18155 -18923 -21450 -25171 -23712 -16403 -11299
14231 -11299 -12217 -13848 -13740 -12933 -13288 -8898 -10207 -13539 -13252 -11274 -9306 -11380 -13516 -7954 -2470 -6067
14215 -6067 -5829 -6291 -1574 -1556 -10755 -15611 -11877 -7770 -8491 -7014 -4041 2908 693 -6884 -9452 -8809
14199 -8809 -4628 -3658 -5607 -13007 -13875 -9145 -1302 -767 970 -1706 -3323 -2775 -3928 -7822 -6534 -3413
14183 -3413 -5655 -5212 -5637 -4920 -1971 4475 3881 2456 1768 2714 3323 4194 3570 1938 -7167 2048 7314
14166 7314 5813 -332 -7040 -17004 -20447 -14140 -12757 -8804 -4143 -6336 -3476 -208 1338 -4637 -8410
14151 -8410 -14705 -19154 -13665 -16494 -12867 -16737 -18058 -17540 -12078 -2761 505 -7257 199 3143 5400
14136 5400 5424 -732 -2559 -4517 1291 -353 -3793 -14455 -13750 -5905 -11725 -10953 -4327 -3879 -8582 -11224
14120 -11224 -15482 -19913 -19331 -11376 -11484 -16215 -14178 -12997 -15828 -12193 -2984 -8054 -10796 -4386 -2177
14105 -2177 5042 2902 -5365 -1919 3351 9397 2408 -2459 -2300 -2545 -3535 -3997 -3275 -7595 -12812 -9830
14089 -9830 -1494 4857 10157 2260 -5040 -5159 -3745 -7262 -14782 -14126 -19460 -18461 -11802 364 9111
14074 9111 5426 -137 -6896 -8750 488 2942 1202 1707 1400 -1896 -5082 -4242 -2780 923 3441
14059 3441 1250 -1586 -10224 -12570 -15016 -15759 -10548 -3758 -3772 3302 -1111 -3370 -3232 -1696 -1173 -1446
14043 -1446 -3666 3130 2759 -10718 -10209 -1047 -4213 -6925 3212 8531 7400 4467 2937 1153 6022
14028 6022 2384 1951 -4617 -8219 -3002 -4956 -10448 -7353 -4063 -1880 3044 4280 -328 -519 2544
14013 2544 4070 -327 -7765 -7706 -216 -1952 -3209 -1912 2299 4229 4297 2104 -5390 -4323 -1251 -5913
13997 -5913 -11910 -14500 -12599 -13780 -11118 -11189 -5614 4985 3170 3529 1129 418 -4642 -9308 -15037
13982 -15037 -16254 -18130 -17747 -12964 -5410 1047 774 1718 9300 1104 -48 3359 5755 9443 6773
13967 6773 7632 2165 294 739 1388 -358 -763 -5362 -1254 -1237 -6365 -10934 -5588 -264 -1202 1543
13951 1543 -2565 -2570 -2072 -7133 -6458 -5147 -4309 -1467 -247 1318 6285 4795 -3474 -6503 306 -128
13935 -128 805 3052 6245 4502 4170 979 588 3734 1795 1051 152 -3174 1412 -7180 -8676 -1086
13919 -1086 6558 11166 11959 4200 7637 14510 17776 9571 8347 5109 4039 -5930 -4839 2566 9016
13904 9016 12396 17308 18383 7982 -1100 -9181 -6001 -4313 -2623 4845 8998 13040 13206 5368 -4328
13889 -4328 -4584 -6204 -8956 -4770 9249 19456 18942 9881 14473 16504 9416 8178 9229 11015 12017
13874 12017 8393 9389 9675 14217 17276 11528 10225 8792 5303 12692 12006 7030 5518 5871 7420
13859 7420 4175 -481 1438 6132 2344 -1777 2204 4703 2243 -3617 -2153 3863 3448 4776 -1230
13844 -1230 -4851 -1508 -2724 134 1659 1790 -4588 -6056 -5296 -4396 -3058 -3268 -245 323 3531 3924
13828 3924 5391 5687 6942 -1170 -5991 -7553 -3096 2000 407 -3216 -6017 -8298 -8177 -4141 -7640
13813 -7640 -5236 -1466 4158 -964 -5010 -7784 -7280 -10198 -4900 -297 -2628 -5843 -573 5074 5780
13798 5780 -499 -6914 -7405 -2437 5733 7370 5871 4910 -2433 -7771 -4626 2501 -1855 -6901 -15332
13783 -15332 -15997 -9256 -3158 -1168 -1375 -6840 -4754 -5667 608 10711 12078 10797 8139 6252 -2600
13768 -2600 -14212 -14928 -10867 -4748 -11097 -8983 -11133 -13877 -7871 -4279 2758 7220 4556 2064 -3218
13753 -3218 -4882 -1920 -5499 -1986 961 4994 8698 1846 2740 -196 -4171 -329 315 -3148 -395
13738 -395 5309 6892 9149 10419 8845 5755 -822 -2765 -5287 -8591 -2971 4106 7360 8721 10931
13723 10931 11599 1957 -4286 -4797 -3803 -3227 -3775 -4262 1551 6079 -261 -7676 -2848 -1402 -4011 -9185
13707 -9185 -14961 -15829 -6455 -3707 -2626 -1756 4653 4971 9272 11061 10339 7926 7898 12379 13960 7117
13691 7117 269 598 4144 6488 6122 6477 2629 419 1049 4728 6491 4561 -3571 -6495 -7971 -5714
13675 -5714 1698 -111 570 4752 5449 -1806 -1806 1544 6315 1258 -3623 -2414 4542 700 -1646 -8419
13659 -8419 -8071 -1363 -2281 473 857 -2619 -4764 631 6582 675 1414 6774 4863 5810 12184 14598
13643 14598 11978 8489 3126 -1699 137 4695 10096 15905 18640 9370 4216 8764 13403 10727
13629 10727 12561 15710 8934 3241 1674 3943 10269 9311 10819 11069 6912 6782 -1227 -2032 81
13614 81 1683 3837 6892 6788 13070 7370 1840 8662 12804 10521 1944 5166 4560 3121 6235 7998
13598 7998 6782 3938 799 8165 13157 15317 9683 13256 15480 13283 14231 16058 12474 7695 9677
13583 9677 10279 8167 7417 10369 11886 9410 14407 14400 11657 11526 9065 3342 -1391 -2748 -3005 3162
13567 3162 6684 7482 16451 22466 26620 27489 27549 30415 34947 42200 49205 54577 61905 74216 99829
13552 99829 129501 158603 192155 219255 227842 215823 189394 157560 124033 94377 74930 62539
13540 62539 54523 44424 34752 33816 35050 30145 25128 21346 24367 33726 27731 32780 40511 40113 41081
13525 41081 42474 46781 50536 51010 54269 65241 74755 89769 99894 110117 126969 149480 186458
13512 186458 240081 305430 378889 445352 477632 462271 412053 334995 257077 189594 144357
13501 144357 116176 91034 78770 71904 63234 53913 42541 34650 33608 40348 33788 28352 30321
13488 30321 32596 35091 29286 20542 21979 22119 27103 32202 38949 51493 59637 58496 61084 65137
13474 65137 81753 104274 121709 158852 194789 224457 243647 236297 207898 172899 132305 99373
13462 99373 79298 67558 60246 57491 55558 43699 29632 28184 27053 25498 21480 19668 22336
13449 22336 20234 23467 21294 17940 25776 24352 23640 18199 13396 17072 18420 21133 22509 14219 11699
13434 11699 14417 19653 15695 8371 -534 552 7084 10733 10699 7724 413 3137 1256 -1074 2738
13419 2738 10152 15834 15665 20761 24845 22623 24561 33060 29409 24393 16034 16784 20157 10228 7462
13404 7462 3942 2771 -1213 1914 3506 8625 7549 10570 13563 18135 20558 19176 16729 13576 14886
13389 14886 13664 11521 18451 18442 18295 22654 31187 29451 27054 27032 20460 19523 18077 14490 9012 9443
13373 9443 13415 13691 12797 10546 11250 16848 11905 3998 -622 -11312 -20566 -22576 -14606 -3771 6471
13358 6471 18823 32732 40922 42626 39162 42389 44326 52883 52256 50719 56060 52847 46621 34701
13344 34701 27330 24016 23480 27610 31185 28197 26597 22520 20616 19550 21196 18014 16566 19509 20720
13329 20720 19322 21678 24863 14131 10472 12980 12430 15561 11871 11800 12763 14733 34757 51291 54446
13314 54446 53503 57409 66459 74703 80821 80217 78573 74782 70436 61160 54619 48367 48350 45158 45390 46108
13298 46108 49170 48575 43456 41048 40819 45032 51592 53575 47773 49123 52174 59013 61795 54007 48563
13283 48563 45007 36962 34855 36708 40924 47198 50292 54941 59069 57785 61081 64545 68085 79199
13269 79199 83252 76980 67339 66570 64490 58636 55592 60969 63735 65910 68467 70796 68549 59843 63420
13254 63420 67801 76793 87193 98389 94108 92812 92938 86007 77098 66461 66506 67282 63555 66190 69572
13239 69572 62704 56205 53678 52855 52363 53629 56276 62026 65993 73741 78074 74031 70353 76293 86887
13224 86887 89730 101830 117548 121711 117611 100259 82346 74004 75816 80707 85400 90928 100431
13211 100431 116735 126225 119971 117952 105095 101508 99719 100079 101228 106486 120294 141470 165257
13198 165257 168590 161813 151381 135862 124709 118929 114489 110399 111938 114291 129275 139835 150098
13185 150098 162793 174136 181333 180375 173644 161419 149775 138222 131690 136673 139528 147522 158977
13172 158977 165302 164171 163081 161884 160169 160757 163317 166297 177428 199613 227737 259247 289519
13159 289519 313889 327655 329752 323349 299797 280865 262808 249769 240136 234884 237454 240963 242824
13146 242824 252381 264517 279340 289224 303285 312429 312814 311616 316279 318605 324286 341023 359374
13133 359374 381046 397211 419082 449025 474842 500994 535451 564719 612756 659228 713881
13122 713881 772483 847059 933816 1020517 1114538 1211595 1324356 1460640 1627875 1831214 2070101
13111 2070101 2337963 2661173 3057969 3556699 4189007 4994240 6052401 7498297 9556996
13102 9556996 12587298 17041114 23235890 30849763 38516879 44090350 45740892 42961453
13094 42961453 36821690 29358353 22428707 16961962 13049764 10339160 8439754 7086652
13086 7086652 6092127 5351544 4813562 4420149 4128683 3909974 3746139 3632713 3574398 3582907
13076 3582907 3670001 3837681 4086745 4419135 4835406 5340035 5933479 6650666 7553122 8714559
13066 8714559 10247345 12273731 15021497 18914312 24646000 33217669 45509446 61249739
13058 61249739 77958751 91079710 96161121 91504186 78748076 62262291 46572177
13051 46572177 34171739 25398256 19472589 15433018 12581225 10498595 8931495 7733183
13043 7733183 6812828 6095045 5506383 5006598 4581848 4236117 3987421 3816574 3719988 3701428
13033 3701428 3753337 3867372 4043962 4286545 4599273 5010500 5570291 6311856 7317332
13024 7317332 8686803 10620854 13435834 17572570 23434661 30910868 38927709 45416488
13016 45416488 48209981 46328977 40404342 32408606 24551557 18176542 13565718 10387900
13008 10387900 8195126 6637361 5486529 4606484 3927760 3395857 2967051 2612640 2318954
12999 2318954 2074969 1874138 1736808 1667685 1657952 1690420 1752281 1786061 1736065 1597259 1404740
12988 1404740 1209208 1039188 904945 809100 731016 675879 637293 595392 556855 526249 507161
12977 507161 486117 463075 446205 427089 410968 394270 380259 375662 373744 370543 376999 373143
12965 373143 370840 374436 375741 372683 377067 397220 420396 449582 516348 624335 786193 1020104
12953 1020104 1341958 1675597 1901633 1927491 1737602 1424271 1093556 824035 628891 499003
12943 499003 408817 351785 322028 293383 274679 258189 252447 246332 238559 228439 219141 209535
12931 209535 201007 201696 196529 185986 183804 187337 185263 190431 200171 196516 199121 210617 221160 231336
12917 231336 253338 291233 348201 431410 550136 702590 864079 961917 950772 840588 676831
12906 676831 509667 380338 282310 213589 165996 139342 122892 122109 125359 120297 113364 107043
12894 107043 101384 100395 102402 99856 97682 94726 90703 81486 78801 79639 77198 74739 68757 64809 65985
12879 65985 67710 70412 68797 64123 60925 54655 51021 46569 40952 38071 33878 30292 31707 23199
12865 23199 13612 6078 7847 5398 -1726 -6395 843 7351 5427 7495 13938 19183 15533 15392 20434
12850 20434 27292 34500 37771 50352 57138 59118 60525 57683 50048 49053 46820 33953 31023 31338
12836 31338 27263 25800 23778 18404 16341 13352 10189 11668 13364 16253 12409 12730 21441 18576 8496
12821 8496 6770 5990 10130 13199 16577 18617 19370 25753 29864 29599 28119 30138 35113 37731 43311
12806 43311 42414 36171 41120 41352 40416 41900 41880 31567 30118 29482 26540 28641 34665 34481 33359 29102
12790 29102 32368 39951 41576 39972 30988 22072 15960 16862 22696 29421 25600 22915 23816 26493 24883
12775 24883 29704 28130 24099 24940 26077 23901 20195 17042 16659 14601 14977 16346 25834 33088 30747
12760 30747 23210 23081 17202 15049 20847 17695 18966 25255 32942 41855 44066 39634 40356 32326 22506
12745 22506 15054 9978 11677 11001 12070 16031 13116 7991 12195 14783 13397 8328 7975 14855 14926
12730 14926 14136 11653 7332 10626 12014 12208 10552 5929 4456 3713 6256 11154 19206 22223 14413
12715 14413 12409 17384 20966 29206 33154 38644 40029 41084 30860 16370 10950 988 -1532 -10106
12701 -10106 -6683 -1212 6581 18238 22122 16004 11702 14630 15376 11426 11689 10547 4588 7993 11136
12686 11136 9378 5932 7499 4522 7173 11226 13805 10988 12559 17049 17635 18233 12428 11424 11452
12671 11452 11889 12881 13419 15657 21085 17952 14304 8490 4965 4604 6210 4954 5917 8671 12091 13039
12655 13039 11600 11556 13801 12086 8143 11948 14695 20950 27545 30384 34285 38827 45631 58056 80675
12640 80675 109343 135938 167646 196829 206894 200534 181019 150014 121587 101175 75082 59153
12628 59153 54092 45216 37272 25239 25361 29255 24348 14575 18799 20935 17930 23548 30810 34345
12614 34345 28514 24221 28981 37925 45145 40613 39969 51804 65161 73594 85105 101528 123489
12601 123489 154069 204190 278889 347516 409720 442596 424720 380446 317203 248574 182438
12590 182438 142624 114612 93822 76379 65404 59131 52877 46410 43601 41893 39272 27734 19182
12577 19182 21781 13698 12096 13333 10958 12534 15284 17334 17732 16515 14026 12562 27992 39083
12563 39083 45237 63309 85271 115932 142243 170717 201149 219423 222276 205429 170454 127185
12551 127185 96873 77735 63540 53207 46076 42724 33779 22521 20160 18518 15433 11620 13892
12538 13892 14215 6747 3660 8719 15817 20219 13658 6483 4054 -7666 -15449 -5501 -941 -328 1578
12523 1578 -3642 -12 7077 -887 -13313 -11750 -6792 -9294 -9992 -10696 -7839 -29 1076 -1853 -3439
12508 -3439 -5939 -3443 -255 -224 -1156 -3414 -3948 86 1869 623 4885 6967 -1190 -8300 -7378 -6849
12492 -6849 1909 5189 5662 3486 2132 -95 5915 10864 13360 12973 11414 14471 17214 16318 7040
12477 7040 40 -6326 -5132 901 766 3793 3742 -1679 -5202 -2435 -760 -4131 -6628 -6539 -6992 -2282
12461 -2282 -1809 -13 -2375 -3349 2185 4687 3108 721 -802 2135 4886 2456 -2156 -4357 -806
12446 -806 410 1195 2948 1424 -1321 1152 1462 2983 1966 5369 7974 8453 3060 -1098 1194 -3320
12430 -3320 -4241 -2970 5651 7556 258 -5559 -4219 881 2183 -3602 -4518 -3660 -571 -2731 -5764
12415 -5764 698 3731 1834 -2014 -3297 -4909 -4994 -7715 -5334 -5263 -432 6106 8884 8734 5108 2135
12399 2135 4643 4146 -2183 -6546 -4760 2073 11133 12954 2997 314 2780 2107 3353 7160 5831
12384 5831 6188 1851 2122 11298 12749 10773 9783 9776 3389 -1090 3984 -2631 -6781 1817 6188 5588
12368 5588 -30 1999 3332 3451 -2512 -4773 -4603 -3245 384 -1097 -5364 -12704 -4385 -3763 -5412
12353 -5412 2170 13958 14711 9579 2668 -924 3395 6370 6212 -1209 3733 3773 4253 3664 4919 -1256
12337 -1256 -1600 2328 9619 11212 6935 2558 247 -39 2095 3998 -885 -342 3222 3814 5620 4733
12321 4733 67 1830 -717 -2615 1076 -313 -4389 -8072 -3875 -1141 -1152 2420 5753 6162 2731
12306 2731 2791 2912 688 4206 4956 4420 -836 -6080 -6633 -5085 -3815 217 4351 10312 7130 626
12290 626 3624 8507 7095 3639 2469 5543 5262 1379 1803 3183 7896 10484 5585 -1496 -1862 2148
12274 2148 2916 7740 4481 -2707 -5898 1380 7971 6747 4828 14160 16229 13228 12793 5502 6548
12259 6548 11994 8677 8912 6714 47 -1217 -4189 -8578 -698 1698 3128 4614 613 4765 7291
12244 7291 9817 1018 -6227 -4657 3428 6731 7078 2598 -711 -299 1460 13700 16008 14066 11515
12229 11515 6724 -1628 2278 3214 -1526 -135 1760 -54 -10490 -11065 -8376 -8593 -12003 -9006 -4769
12214 -4769 1066 -1546 507 5622 4237 165 -6175 -6778 -6303 -1296 -4091 -6368 -9038 -6675 1867
12199 1867 -12 -5044 -322 3190 -2585 -9181 -10312 -8486 -3956 -2942 -3301 -6333 -3802 889 751
12184 751 1198 2354 1926 363 3219 7093 2356 3257 301 4755 5387 5955 4067 5717 4881 1046
12168 1046 656 246 -1170 -3086 -3327 -2160 4319 6700 5234 2674 1971 4810 7160 5499 5284 2898
12152 2898 3801 -533 1685 4494 -1048 -3170 -2427 -530 -313 219 -1618 -3076 -695 -1729 -3666 -1128
12136 -1128 2933 3014 4844 8721 9812 11589 11530 12211 16381 10993 7280 11792 5575 5282 5964 -1697
12120 -1697 1773 -1098 -7366 -7124 -1753 -1037 -6832 -8691 -13463 -10939 -13096 -14232 -3111 4148 2051
12105 2051 -8512 -4756 6432 8139 3456 -5070 -10392 -9349 -3112 2219 2036 4673 10543 14518
12091 14518 16526 11358 10850 16363 24317 29486 34632 37826 39273 31395 15295 12256 10543 11110 8943
12076 8943 5891 -341 -829 1964 -4463 -11662 -11355 -7800 -2981 -1877 -3336 -6293 -8965 -10158 -6050
12061 -6050 -6798 -6970 -6403 -9274 -5207 -1629 793 -3030 -1279 -2196 -311 -4564 -6110 -3420 -5066 -144
12045 -144 3414 3662 4102 5674 6261 9991 14139 10273 5482 6187 8580 7406 9635 17811 10925 -341
12029 -341 -3266 348 4609 3376 9321 7066 4282 4112 -3933 -1646 993 771 -1486 -3101 4250
12014 4250 9019 11354 3056 -5776 -2614 -299 -5756 -6497 -2327 3747 -637 971 942 4022 8367
11999 8367 10072 12004 9460 3082 -13220 -15959 -8573 -5308 -8905 -10574 -9852 -9240 -7400 -6766 -771
11984 -771 -1063 -5297 -8615 -134 4815 3603 2241 1074 1194 -1184 -2088 -3347 -1457 4461 3179 924
11968 924 5310 5834 8791 14588 7720 2446 5795 2941 -103 -6215 -9489 -3894 -3572 360 5213
11953 5213 8180 14776 15637 11107 6842 9836 -837 -8550 -6269 -9324 -9272 -8935 -1489 2559 -2301
11938 -2301 -6146 -8837 -18572 -13213 -5101 4501 7777 6102 1624 2194 2046 6319 2399 -2288 -4154
11923 -4154 -863 3066 7075 3765 -294 -519 -2768 -3469 1855 4486 4767 7400 2567 -2377 -5215
11908 -5215 -1278 3037 2772 6316 4530 -117 560 1757 1041 564 -6059 -5195 5499 -2834 -11021 -7223
11892 -7223 -2191 2126 3562 5611 1653 2847 1157 255 2094 1441 1090 4235 7702 8374 1709 3134
11876 3134 9050 8482 12965 12198 6076 252 -1592 942 2174 2884 -3680 -2182 1877 9060 6153
11861 6153 -454 2099 4279 4707 5342 9158 5487 3039 4849 11119 11472 12727 10432 5271 4829 4521
11845 4521 -2129 4885 8360 1760 -865 1427 9209 12856 4699 -1161 -6529 -7268 -7234 -3857 -150
11830 -150 2689 7108 11035 4656 4348 4605 981 -5118 -1512 4507 9208 14922 14679 11762 6673 -679
11814 -679 2543 9110 4497 6499 10056 7983 7301 6975 4753 5386 4280 2324 -4847 -7202 -6190 -4503
11798 -4503 -4410 -1296 -3 804 5255 1653 -257 3415 4070 4571 9676 5478 -843 -3647 -9383 -11723
11782 -11723 -1398 10855 12781 6362 7806 11322 6142 -1986 -5073 -9052 -8529 -5935 -2450 9098
11768 9098 8946 7719 5783 3185 2424 3832 846 1037 7085 3687 -1255 3113 -802 -10762 -7030
11753 -7030 1079 5699 10229 5290 7802 15238 15847 13592 10232 7889 8954 10208 9390 4833 6894
11738 6894 7158 12189 14989 10551 7946 10741 5391 6775 6903 10197 13554 5565 6080 8842 3642
11723 3642 3617 8273 9115 3472 -1218 -4605 -2394 4810 4094 2891 5216 12562 10855 9168 8902 4497
11707 4497 6472 11425 12636 12245 8804 9012 10591 9794 12958 13925 10657 14657 22058 17524 14867 7978
11691 7978 191 -2011 1396 4358 9952 6949 4693 7773 11058 11652 10826 9540 9816 11410 1339
11676 1339 -7235 -5573 6106 16593 17655 18165 10357 6684 4797 3172 6531 7674 4322 1725
11662 1725 -1092 3874 8025 8306 4596 3274 5461 2559 -4033 -3726 4246 -988 -2473 1706 8798
11647 8798 6867 -126 4375 3282 -2386 -178 -2428 -3019 -6510 1847 3791 5499 -1421 -399 3556
11632 3556 1343 3425 6230 5877 9139 14125 13520 2032 213 5200 7430 7355 8873 5203 3027
11617 3027 9579 13961 7610 1581 1856 8629 14274 10662 10655 8068 8020 4277 -1804 -1080 4698 12813
11601 12813 19073 13331 3481 2323 4903 4292 -5719 -4669 2521 -2645 -8114 -5616 3256 5148
11587 5148 3383 2747 1055 -578 -540 4929 7455 6602 9743 4035 -1461 -3387 4539 5225 6238 3349
11571 3349 2697 316 7424 11174 10094 8408 -20 -2639 -3819 -6029 -10 541 2283 2530 8637
11556 8637 9748 11173 11869 9199 2527 -5200 48 5672 7155 4314 -317 -2375 1228 2624 1294
11541 1294 682 628 2236 1284 4566 3550 -4408 -4162 -3904 -2975 -2438 2420 8142 11031 14212 9065 5102
11524 5102 2312 113 5670 10599 1242 42 -908 621 2434 5250 4371 6212 9030 6859 5974
11509 5974 7992 10750 19997 20684 14995 11766 6798 5685 4386 4090 -1262 3434 10204 10617 15560
11494 15560 19721 21163 19211 12152 14498 16059 15671 15665 14401 6479 8341 11686 15309 17421 15987
11479 15987 16812 9151 7151 8864 9175 10111 16517 17489 14842 10896 7312 6396 7081 14517 17390 22531
11463 22531 23476 22916 16684 17614 28523 31400 27044 24113 22031 26121 23937 15844 12008 13571 13486
11448 13486 14083 12585 10327 14067 20574 24677 18045 14400 12785 16661 19260 10384 6577 16474 21591
11433 21591 21282 13412 9598 9747 16114 24173 18588 28197 31355 35010 38151 30784 25252 20811 21603
11418 21603 14046 14418 10432 8428 14920 14512 13769 10468 9963 17911 11533 7687 9282 10163 17035 21918
11402 21918 22908 19747 18671 18740 23786 26390 23606 27734 23958 24348 30381 30995 30138 26374 22469 28079
11386 28079 28536 26256 19288 20065 15358 12186 19351 30738 30462 20974 18920 13927 17275 15496 16465
11371 16465 15774 16377 8316 4708 9256 20806 17877 14837 12762 16971 24252 28254 17787 18905
11357 18905 27903 26783 22600 19843 11147 15885 31304 35544 29949 21442 18274 17480 8843 11200
11343 11200 22357 24143 28695 32764 33138 24891 21888 25087 20641 18853 29884 30510 24240 11059
11329 11059 8860 14302 19448 17408 9997 8186 11038 11927 9885 17150 18422 20051 21015 25157 31445
11314 31445 21192 13225 22803 23696 19097 12366 8991 10171 5741 8735 12338 14478 15341 15475 18980
11299 18980 19447 16220 21913 26070 25122 30077 32658 37245 39014 32690 28583 25106 23219 22275 27212
11284 27212 29003 23981 15591 13974 16887 23945 28939 39006 37873 39365 35665 33884 38583 43514
11270 43514 53262 72746 106002 162584 233546 285061 295876 293295 268392 206428 142625 100914
11258 100914 74858 58252 55163 50933 45937 37924 29799 27586 23099 19587 24241 21061 16774 22254
11244 22254 25144 23325 25859 18911 13736 9558 14770 20314 30764 30903 25008 20874 20604 21921 22742
11229 22742 30547 34579 40771 39107 35555 31662 34359 40990 44761 45241 38768 36767 42670 46780 41925
11214 41925 35391 35744 32733 29020 31210 37271 31220 29803 35748 41956 48824 54499 55180 63200 71744
11199 71744 66420 67230 69629 72267 81178 83534 82667 76588 77273 73779 72413 63919 62126 64101 63026
11184 63026 58412 60834 57943 49847 51811 47224 43633 40426 41487 50053 45296 42568 52426 60944
11170 60944 53361 44952 49044 57703 56488 53876 58753 78260 117508 176581 237532 267789 256780
11157 256780 249355 264027 254681 199895 142869 108298 84084 65252 57569 48745 41896 49319 48318
11144 48318 38606 39876 42409 40962 38107 33254 35117 32509 28472 30296 28991 29570 25880 22681 22262
11129 22262 24182 26539 30918 30093 25398 20929 19892 25916 29397 31532 31617 29754 29537 34675 37093
11114 37093 30286 25991 26993 30476 25975 27738 33635 32001 36218 39031 39678 35811 31923 30260 34545
11099 34545 42770 47540 47957 43813 41527 36461 31616 32326 27512 29545 33635 37959 38449 40787 36120
11084 36120 43086 42186 44098 47239 43238 39843 38741 41817 44833 42682 39767 28894 28620 33704 36086
11069 36086 37379 38607 37413 45629 55237 55982 47332 43582 41125 35080 30556 30252 30386 29176 30418
11054 30418 42795 43744 44730 47553 45776 48525 47111 39858 35750 33429 30592 39233 52118 53294
11040 53294 53696 44917 43019 47833 53885 52488 55006 57923 65454 74427 77080 82358 94068 103131
11026 103131 106980 114977 136306 155819 167345 170995 176332 185531 189079 183556 165409 144588 130844
11013 130844 123263 114119 100081 92100 84673 71644 68761 67784 68098 70359 74731 79297 80847 82539
10999 82539 80918 77665 77651 85909 83803 84009 89004 95184 102875 106401 104432 109606 117249 125679 132446
10984 132446 140830 153118 167891 188579 206610 227048 247766 273996 293253 300611 301449 292151
10972 292151 284884 272153 247487 229864 219402 204047 185735 168639 150042 140971 126352 122950
10960 122950 118986 114179 110508 97519 87697 92151 94128 85756 75714 73173 75432 78328 81301 81885
10946 81885 82307 87157 92384 86556 90384 92341 98073 97478 101080 109481 122825 134714 152464 161512
10932 161512 171082 190591 207366 220464 223130 215192 202777 186797 168001 148466 132850 120647
10920 120647 113119 112552 112082 100343 89703 82544 76710 72407 64532 64504 62503 62785 68653 69384 61936
10905 61936 63429 65845 63109 58491 66266 65479 61551 63665 64852 70604 74066 71901 66957 72882 75763
10890 75763 72339 76000 76688 69709 70705 68922 68945 75814 73872 67209 66342 61188 60022 62058 63603 62531
10874 62531 64371 61830 58420 62395 68061 67294 66975 61158 55652 53220 61334 67575 72505 71524 70058
10859 70058 74358 80233 82217 80149 75107 70164 70178 75572 78954 81992 87051 91842 85887 82921 74709
10844 74709 72305 74623 77059 88906 94947 95459 90943 92649 94041 92499 82048 82732 87379 94055
10830 94055 87872 79817 77928 82256 82750 80804 83799 87290 81967 80477 80729 90750 95969 101494 107129
10815 107129 109099 109645 110974 112226 118630 120114 119822 113725 110241 112044 111271 116252 121511 125502 123002
10800 123002 123330 123772 119043 117728 119746 120593 115383 113765 106329 99622 99350 104240 116323 117979 112136
10785 112136 109822 118127 122124 123657 123039 128082 134792 136972 134191 133048 129354 129321 142002 141244 144406
10770 144406 147163 145958 151654 152018 149714 151241 151921 150060 151247 151326 156375 161754 164781 172570 173655
10755 173655 170117 166714 163311 167839 171990 175559 176580 173047 170051 168243 166393 169502 175026 179541
10741 179541 177129 181540 179584 174397 178569 181777 181583 185243 187589 188032 196475 213130 219273 230068
10727 230068 236069 240077 247705 243998 237581 235899 233965 231905 234384 239368 244758 242510 235865 232381
10713 232381 232582 237647 237731 240664 241141 241107 245876 250805 262312 265028 260939 255933 250067 256901 266599
10698 266599 267032 267655 269726 275241 280911 292560 297585 297719 301457 309802 321618 331907 340562 342078
10684 342078 350445 364055 384189 391911 398236 394991 398027 399379 405724 415305 419019 422478 420857 431108
10670 431108 447079 451417 457751 467629 478834 482763 489355 495092 501647 509401 518327 526604 531218 542035
10656 542035 555808 572424 585275 598505 611950 622949 645303 673260 695091 713104 729943
10645 729943 754524 787316 825487 870093 919667 967284 1019305 1083088 1153614 1229942 1298070
10634 1298070 1361179 1423863 1481733 1553375 1649895 1754903 1874747 2013706 2174063 2360216
10624 2360216 2573447 2825144 3125811 3463015 3848344 4285255 4790151 5382271 6101333
10615 6101333 6978337 8067022 9419083 11079340 13076652 15391256 17911430 20429322
10607 20429322 22664401 24303111 25088907 24911191 23828432 22052846 19877413 17598807
10599 17598807 15459207 13585100 12053779 10867801 10000059 9396595 8994871 8708420 8452559
10590 8452559 8177664 7866567 7534217 7199038 6897668 6673084 6537121 6498037 6573495 6776520
10580 6776520 7093528 7549099 8136102 8849071 9670565 10587110 11565744 12601246 13726010
10571 13726010 15001744 16537140 18472404 20926472 23996852 27707146 31936293 36378834
10563 36378834 40552652 43878244 45890899 46351485 45372677 43315291 40601316 37571305
10555 37571305 34379276 31108330 27846506 24705095 21821191 19307062 17219760 15552854
10547 15552854 14270361 13292775 12509277 11814968 11117661 10398522 9651206 8923735 8248312
10538 8248312 7673063 7200149 6832107 6576733 6428800 6371552 6405552 6527894 6734468 7035628
10528 7035628 7421329 7934429 8588824 9414170 10449695 11742493 13367877 15388280 17822094
10519 17822094 20625201 23666492 26680908 29278722 31049061 31683399 31058703 29275536
10511 29275536 26638386 23557754 20401376 17450900 14853181 12660144 10861795 9401010
10503 9401010 8224453 7264103 6474495 5822063 5277234 4809656 4399621 4037657 3719908
10494 3719908 3441417 3188718 2960119 2756106 2571905 2402356 2254267 2124668 2015609
10485 2015609 1912814 1815293 1731759 1664202 1617889 1601576 1617784 1648138 1680080 1710384 1721985
10474 1721985 1701605 1666233 1615037 1550506 1485409 1418961 1351398 1282359 1224526 1166231 1103750
10463 1103750 1052156 1007650 967902 937194 906387 878502 852188 823553 801546 786079 776822
10452 776822 762130 749283 746591 756805 767468 770450 781333 792428 796720 806698 809372 812124 819879
10439 819879 845013 869253 900066 934009 974820 1026375 1088527 1157842 1240645 1330986 1420406
10428 1420406 1497466 1532050 1525899 1485818 1415561 1338593 1271082 1202486 1148300 1116986 1090887
10417 1090887 1069960 1058949 1058605 1068019 1077533 1091100 1103862 1112364 1110236 1106687 1111901 1117132 1122887
10404 1122887 1134017 1136899 1142142 1141554 1136031 1120092 1099851 1081372 1060445 1045194 1028180 997495
10392 997495 968958 937768 897175 858949 830219 807779 787980 772311 760018 747526 739090 735096
10380 735096 741162 750703 759217 764443 765896 756661 736523 717062 696380 688867 686736 676365 664016
10367 664016 659721 652494 642474 628911 618015 603055 593246 586770 580820 571918 562162 557358 556366
10354 556366 554379 550963 547515 542254 542635 543499 547118 551534 550585 549420 553635 555863 549089 541470 533809
10339 533809 527980 518311 504715 500950 492197 493902 500431 512226 540970 590376 642027 676390 685044
10326 685044 658575 614274 575815 545410 530493 519127 511761 507434 504718 507624 504370 503580 503304
10313 503304 496271 486250 480941 489759 510557 541750 577419 617684 665700 717656 780310 840379
10301 840379 892909 915195 911663 875209 823456 779157 744659 714588 699928 697758 696819 694284
10289 694284 694353 696590 690198 692090 706120 716128 720230 730697 743770 764367 787638 815574 828921
10276 828921 831595 844841 868360 879473 896465 904732 904908 916800 935005 940462 948670 963592 970037
10263 970037 971591 974411 985006 1001407 1028015 1056069 1077590 1110612 1134000 1164929 1200188 1236912
10251 1236912 1281596 1328012 1368973 1411793 1456600 1497751 1538521 1578442 1616330 1657526 1694029
10240 1694029 1735752 1776476 1808124 1840243 1881952 1932748 1990245 2052945 2120378 2200837 2276794
10229 2276794 2345501 2417592 2492643 2576200 2685306 2806303 2930446 3060098 3200519 3350140
10219 3350140 3503287 3657980 3828218 4007791 4206901 4432307 4676947 4941717 5225224
10210 5225224 5524222 5854875 6220407 6609530 7012333 7447214 7918202 8442521 9034541
10201 9034541 9721810 10528931 11471247 12548243 13790033 15247008 16956740 18940795 21215005
10192 21215005 23785119 26604361 29609910 32749814 36124599 40037829 44876574 51091245
10184 51091245 59206444 69916463 84225345 103529901 129847186 165886787 214712322
10177 214712322 278211293 353283859 426902432 476416080 481775508 441370830 373260023
10170 373260023 300441200 237281307 187864799 150854596 123314945 102328158 85694371
10163 85694371 72198023 61314002 52727819 46080067 40957868 36926564 33546326 30466192
10155 30466192 27537737 24771496 22228031 19962223 17979778 16256007 14771573 13496333
10147 13496333 12402586 11450953 10605447 9849745 9177502 8571681 8029929 7549528 7105034
10138 7105034 6718232 6375173 6057426 5773504 5519568 5284999 5067145 4859841 4649960
10129 4649960 4438401 4226744 4034676 3869277 3729530 3608774 3498879 3378805 3251666
10120 3251666 3120182 2993981 2869176 2750869 2637415 2530223 2426790 2326533 2229363 2136018
10110 2136018 2042570 1959045 1893025 1835298 1782735 1739374 1700572 1665120 1635730 1612553 1588302
10099 1588302 1563256 1546421 1529366 1515743 1502670 1481395 1456053 1421954 1386034 1350912 1312391
10088 1312391 1268964 1238188 1202657 1165699 1133181 1099107 1063670 1026398 995110 969021 941730
10077 941730 914581 883689 843099 811306 791753 774889 760245 754119 745337 756344 768230 765057
10065 765057 755998 739486 726074 714257 699585 688881 682440 675199 669338 670823 680269 693934 706246
10052 706246 708331 713264 719506 722236 708781 691258 670882 667806 671092 681953 691906 704411 713783
10039 713783 726603 758728 821614 931925 1136250 1533264 2290429 3263251 3315161 2384574
10029 2384574 1533466 1079838 853212 721654 635579 562120 488387 410417 334179 280792
10019 280792 264525 282725 321778 356019 380132 380417 373329 364988 348312 330364 317710 303653
10007 303653 288073 279491 271069 259478 257240 251515 249814 253139 250128 247748 244783 244129 244315 250646
9993 250646 247584 232469 227099 222079 211284 204260 198925 183552 170884 165576 154507 153655 153067 160762
9979 160762 164665 166198 167491 168484 160877 153151 144732 141496 149549 165674 183164 203676 232083 262046
9965 262046 278480 285348 288813 285983 282077 287150 289054 287271 285572 287618 281338 269307 252442 244325
9951 244325 238428 237818 239157 227353 215713 213263 213159 214794 222997 232824 237210 247399 249020 245121
9937 245121 239820 233295 246543 254260 258640 269226 269466 269172 270018 269325 270339 277676 289423 295822 307543
9922 307543 319532 328440 331290 324866 315544 304379 293099 279287 256914 252599 247363 237069 236446
9909 236446 238017 234483 237964 235129 226924 224853 234896 244265 255656 267055 275870 286210 295226
9896 295226 309336 325272 334762 347138 349630 351448 351596 355492 354695 350546 351927 358443 359368 373489
9882 373489 384060 396117 405684 417051 435852 450106 464094 484906 515891 558967 627865 721681
9870 721681 823513 937180 1052578 1157557 1250172 1332729 1440475 1593935 1812736 2124649
9860 2124649 2573894 3227434 4177424 5515157 7271683 9290383 11130634 12325429 12660667
9851 12660667 12052839 10530956 8540329 6671242 5211990 4154688 3409490 2897555 2541837
9842 2541837 2291334 2105604 1980931 1901025 1853671 1822270 1811825 1819910 1832471 1864692 1943175
9831 1943175 2060999 2209888 2401158 2669752 3008208 3406910 3868499 4387987 4915223 5447650
9821 5447650 6062876 6906779 8165413 10065128 12885869 16915110 22186445 27997793 32820601
9812 32820601 35220015 34669405 31968949 28866846 26699889 25640614 24859427 23227328
9804 23227328 20302989 16749287 13490346 10954774 9148701 7894860 7043028 6471616
9796 6471616 6075791 5779418 5502460 5200617 4900305 4658850 4529478 4519679 4629850 4887939
9786 4887939 5284133 5823561 6446423 7015547 7452653 7819522 8292877 9048714 10249438
9777 10249438 12064626 14701614 18354112 22910661 27681299 31544314 33686316 34474221
9769 34474221 35186462 36917492 39817466 42836102 43959494 41814781 37219569 31993855
9761 31993855 27125689 22752706 18903286 15778195 13495760 11970578 10998776 10336279
9753 10336279 9743884 9127337 8518810 7934684 7380684 6859308 6405725 6051248 5814970
9744 5814970 5686185 5619153 5579395 5564072 5602263 5710232 5903040 6216800 6714695 7506921
9734 7506921 8650633 10127026 11789526 13416903 14978572 16684400 18860797 21691862
9726 21691862 25044288 28309888 30566275 31141987 30093473 27904577 24725377 20653077
9718 20653077 16400038 12791305 10118547 8247955 6917475 5901392 5072713 4383686
9710 4383686 3832194 3390546 3044555 2766615 2549256 2357783 2188359 2054908 1971429 1947096
9700 1947096 1960411 1992181 2015233 2021043 2021959 2039278 2094317 2199031 2357168 2562471 2807200
9689 2807200 3097911 3477291 4053254 4905636 6082645 7473839 8747154 9547560 9739687
9680 9739687 9286520 8152645 6594981 5065256 3838344 2961478 2340822 1894304 1575253
9671 1575253 1348679 1179547 1059904 977338 908387 847711 783717 720407 667044 626727 591842
9660 591842 564227 550412 541201 532353 529978 531974 545568 567611 600125 650315 708395 762573
9648 762573 781675 762526 714895 650146 571473 487970 414009 364755 329990 308009 296697 279459
9636 279459 255848 235761 218201 211788 211630 204546 202195 199239 191064 178265 161041 160339 161508 161978
9622 161978 159692 157142 152767 143671 141194 140101 139282 143012 141406 140270 145735 159130 182033 208337
9608 208337 236273 261470 272035 277036 264115 242870 213953 189089 173337 163296 150956 145248
9596 145248 130750 117354 104939 100448 100160 99138 99617 92707 83219 81499 87575 84810 81709 77367
9582 77367 67650 65747 66156 62093 56673 57189 58390 55233 55874 54410 53598 47753 46035 44747 50574 53844
9566 53844 55358 63952 58198 56592 55205 63117 78828 79181 72820 64715 59552 63472 71796 72650 68110
9551 68110 70116 73105 70241 66640 57753 53960 52186 49520 41769 38626 37797 32644 40097 48040 44062
9536 44062 43510 48551 46267 46447 51890 50605 50328 50361 50463 45476 46314 44038 40290 38824 40397 41914
9520 41914 47459 55048 60268 62507 65446 66481 69378 68577 70051 70536 74656 74434 73065 75456 80120
9505 80120 82028 81352 80594 71802 71692 69596 62472 60506 56099 51159 45351 43395 42058 43665 40161
9490 40161 40221 46931 50002 47931 49120 50232 45710 45914 45053 41925 41600 38720 37683 40226 48145 50699
9474 50699 50001 50574 50236 52604 56088 60989 67470 66819 76602 86832 78608 64652 62538 63582 61468
9459 61468 63744 69365 71289 63414 60519 63902 71804 86338 92158 93344 99615 113000 111018 100556
9445 100556 85809 71956 55661 57172 59042 49447 42679 44377 49363 53182 50009 47020 47785 48510
9431 48510 48072 44166 45967 54758 62657 63317 62469 66339 66380 63344 68387 70114 75553 77492 75773 78834
9415 78834 88147 98049 110428 126926 149571 177459 202478 216003 215326 204595 188082 174951 167375
9402 167375 160893 148702 134758 116873 97962 87226 81240 70725 62329 55263 54961 60366 66533
9389 66533 65710 55389 50473 50067 59460 65443 64918 66949 64819 64858 66938 72950 74618 76057 80787 85233
9373 85233 82387 89194 104057 122029 144006 178193 206319 216645 222294 223009 230751 235194 235969 228582
9359 228582 213255 191965 164339 140607 119335 99241 83272 63027 55787 59047 56418 51773
9347 51773 52957 53835 48773 44796 42073 42117 41052 43493 42997 48726 50422 53918 54582 54330 58271 64680
9331 64680 58331 51662 57013 71137 84227 91889 93966 103567 115472 135489 153210 170323 183381
9318 183381 182864 170520 155304 134498 102875 77529 64115 48172 36822 31353 29802 26396 25483
9305 25483 24381 23518 21200 27567 30714 28514 23513 24320 20796 22549 30519 30415 27941 22064 22413 28181
9289 28181 31438 31334 33956 33025 33120 40827 43872 44073 55637 64534 66434 68461 59600 52048 57645 56106
9273 56106 45609 34450 25787 19861 17732 13423 5507 4919 7957 3011 3765 10306 19886 21153 7992
9258 7992 1380 1381 8433 17194 17723 11109 11607 15563 7522 4210 8127 11690 5777 7595 12968 8160
9242 8160 -3139 -2834 -1924 9138 5795 6895 9315 6083 12426 18927 15529 8392 9772 9178 9924
9227 9924 6189 -362 -3272 -5299 -7249 1494 8589 13874 15815 17978 13770 19205 23088 20330 12375
9212 12375 8666 6386 10280 9637 7909 7183 8901 10528 10880 13119 10818 6581 9144 13914 11874
9197 11874 10799 10722 13943 8644 1175 2026 2054 11406 18047 14262 3386 987 4324 9093 12771 15254
9181 15254 15175 8085 1933 146 -2079 -1082 6037 15324 13997 6617 3697 8195 9450 2967 905
9166 905 7975 9823 8526 6739 3989 5314 7906 10656 8960 7128 7806 9113 15607 12751 11687
9151 11687 15911 18546 18574 14660 12534 14051 9849 -56 2752 2549 2329 -4520 -2764 5649 5849 2951
9135 2951 -476 9306 14711 11520 10041 5467 930 3984 7484 6973 8027 9762 7100 12116 16823
9120 16823 12637 10404 11786 8326 7397 6534 5334 7422 4690 2641 7151 9950 7620 9589 9711
9105 9711 12964 15031 16813 16597 7598 2424 -583 52 3001 5728 6667 8550 8968 10019 6720 5485
9089 5485 4056 6186 10070 5492 5503 1675 3436 7956 -2142 -5682 -3766 6759 5665 6462 7798
9074 7798 8976 11852 9948 6211 8083 10149 8396 3595 4303 8260 10304 13452 9393 6819 4145
9059 4145 10921 10803 12005 6710 8452 8556 7194 7340 15207 14199 12319 19969 21657 15607 9125 11629
9043 11629 12107 1331 -426 5221 6128 9915 3927 602 -175 2789 6755 11538 9292 1487 -2256
9028 -2256 -5904 -620 6344 11220 13565 11341 13200 13144 5497 -1183 2823 5062 8029 10756 9832 8334
9012 8334 8307 1564 1161 -420 -2687 2011 -1537 -2585 306 -4235 -5107 -3280 -312 2912 3416 1407
8996 1407 713 5038 8307 9654 8396 6450 -483 -9065 -6597 4591 9033 11235 12903 8963 8411
8981 8411 3682 -653 -4180 3223 8847 17612 13900 5240 5732 8889 5227 3336 2355 -1503 -4164
8966 -4164 1720 4408 6085 6723 11296 11287 7384 2636 -1452 8638 11304 2155 1884 -2794 -4314 -2827
8950 -2827 3206 10181 12392 10140 5139 1334 12071 16925 10413 11219 9321 7765 8261 8834 12587
8935 12587 15585 13998 9040 7204 11392 12931 11546 15075 15103 12154 10160 12876 11702 11389 10731 10058
8919 10058 -188 1297 7523 4640 1490 4534 8658 9337 20039 20195 12422 2215 2178 2965 4491
8904 4491 6608 9395 12667 9915 3234 949 -1234 2490 4948 5015 6264 169 3980 9763 6261
8889 6261 4208 5444 7715 9595 10789 13397 16914 16496 18880 13960 15641 13584 14117 24862 32174
8874 32174 38831 57597 99969 154187 220954 265035 241204 170649 105444 67628 55978 39514
8862 39514 30572 19563 20396 24421 24515 12811 9103 6297 6136 13263 17136 17187 14079 6016 3863 7041
8846 7041 3822 2552 2691 2344 5800 5353 5945 5218 1119 -1283 5048 15826 17668 11568 7076 2484
8830 2484 -905 2201 1372 71 1423 195 8306 9777 9184 8648 7652 10768 10678 6276 5557 8337 6130
8813 6130 3978 4643 10482 14602 15611 19054 16157 11543 11640 12807 13725 14118 16537 8091 5023 3625
8797 3625 4915 6370 10553 9990 3580 2864 4644 -2921 -8020 -910 -3093 -1638 2820 3377 3944 1597
8781 1597 -2320 -5052 -2533 370 -4274 -1595 4925 3636 9786 12250 13666 21562 17907 12221 6889
8766 6889 1847 -2296 -7308 -3537 557 11244 7575 -1796 -7207 -2999 2023 -6947 -7441 -1412 -780
8751 -780 5476 6750 11106 7753 5601 3563 6182 7637 2627 3122 6762 14250 21151 22636 23237 21298
8735 21298 13947 8606 8114 1176 -5735 -621 2030 7220 8387 5659 5937 7442 10343 10619 9454
8720 9454 3936 6170 10501 12101 12518 6350 6872 3113 -9881 -8911 3186 8703 13232 11016 3974
8705 3974 6304 11490 7756 1497 -5357 -8475 -14019 -10967 -2383 -2812 -4765 346 3436 712 5145
8690 5145 3909 4746 4375 2539 3398 5295 7776 8701 11326 8375 5684 1656 105 -1944 3972 7567
8674 7567 14643 20614 15648 9026 10839 12350 5354 6799 11758 17713 13674 11967 18015 18008 13830 8806
8658 8806 6092 5765 188 -879 2544 7976 11137 11384 12462 15299 17422 16474 20150 18429 21236 17348
8642 17348 17176 19108 18538 29330 31951 25516 24416 23562 21721 18013 17739 25083 32656 35032 34076 29326
8626 29326 26776 26734 27199 24400 23476 24552 24392 22875 15586 8402 9756 21483 21186 18400 17760 23213
8610 23213 30160 23071 20345 26752 32806 37301 39486 40476 43031 54649 60568 63780 71944 81343 84971
8595 84971 80938 87555 97266 105220 111807 115717 117981 127333 126128 114870 99141 84084 69586 57758
8581 57758 44967 36367 33889 29685 28509 28793 27653 28683 25970 29042 32267 27142 22621 20795 22908
8566 22908 19027 21666 24639 16047 19106 33199 41494 42011 31869 21932 20114 18729 14473 18337
8552 18337 17049 14191 19134 17972 11864 10044 16670 13797 8681 4391 10092 13860 14540 17657 14719
8537 14719 13392 18967 20822 19050 22320 15936 17051 21225 18767 13475 12815 12110 13145 14745 13602
8522 13602 16389 13685 10768 19699 28020 40311 55969 57658 49680 45318 36587 22242 16478 13679
8508 13679 10161 11440 14712 13841 11664 8622 1544 -2115 2024 5269 5520 1522 -3281 967 2018
8493 2018 -4866 -5886 -2077 4383 2477 -2973 1409 9480 8571 8054 9977 7649 8971 12153 9245
8478 9245 4359 3175 3329 4774 13591 20641 27877 35876 30320 19959 12639 5740 -201 2016 7937
8463 7937 10329 3813 3256 4890 5591 6099 7961 5955 4209 6106 6051 10246 8862 3849 4526 1903
8447 1903 -4070 -1912 -1706 3319 4522 -2445 -7497 -7877 -3034 2196 6706 7886 -3423 745 10984
8432 10984 8453 4928 -5193 -13803 -11819 -10174 -7760 -3139 297 1297 2476 1139 7529 13131
8418 13131 6499 1864 5545 1461 -293 3294 5186 6787 967 1123 920 -1800 5831 8502 6187
8403 6187 4231 3680 -734 1393 3484 5069 5460 2886 321 -3011 -5379 -7114 44 -952 -306 4322
8387 4322 10757 11329 6064 -1537 -2536 7110 13386 3351 1263 3131 6995 2090 332 9181 14117
8372 14117 11531 1587 -564 5531 9411 9185 6437 6701 3654 -1522 -830 -2687 -260 8582 9485 6952
8356 6952 2677 -3524 -1314 740 3783 6717 1501 -1933 -936 4501 3888 -1107 -5099 1044 7292
8341 7292 8847 12477 11800 13905 10355 6828 9506 15987 11836 1842 4775 13965 24838 34730 45120
8326 45120 49076 36661 28578 17291 7565 3726 2135 5044 9252 4861 6603 7521 -877 -7169
8312 -7169 -12123 -8244 -2024 -6392 53 2194 4151 6885 8038 10438 3170 2972 -2246 -10527 -7510
8297 -7510 -3023 1320 70 1676 4882 4419 1926 7917 14518 18247 23985 27345 35950 49294 68435
8282 68435 90754 99852 85248 58065 38477 23694 17599 17009 10381 6671 4480 7369 7124 -1769
8268 -1769 -3011 -4592 -4836 -1363 2304 8601 7886 8160 13216 12689 13702 14436 14768 6761 -136 8811
8252 8811 11710 14041 11645 10018 9402 16625 23949 14933 3715 1801 10330 16170 13430 15931 21662
8237 21662 31136 43316 40575 28393 24050 19157 11849 7996 8325 10270 12660 11252 5942 3395
8223 3395 2481 -3806 1984 4587 7382 4396 1568 880 -6689 -9113 -2978 -1489 -50 326 383 -4810
8207 -4810 -1635 -833 -7601 -5744 4412 6356 7139 944 -883 -3285 -6630 -4659 -2348 5858 11650
8192 11650 13391 13338 14577 11738 10562 5146 4392 2178 1056 -1596 -1081 9418 11726 7464 8091 9971
8176 9971 12996 9639 8512 7733 7295 5798 4288 6968 1500 -2632 -7124 -4992 4280 7806 5028
8161 5028 1371 601 10379 14595 14183 9515 5025 1786 4282 12931 15690 13733 11512 7757 14769
8146 14769 22081 18542 18582 18661 17683 14132 11282 9220 8117 9859 13109 7205 57 -2597 2075 10983
8130 10983 11410 1195 -1925 3754 4524 6020 7236 14676 12798 11868 11039 12618 7101 5758 495
8115 495 386 1574 1646 1993 -1662 -6391 1666 5476 9218 7512 10268 12198 14523 5499 600 -3677
8099 -3677 -2236 -5588 -3558 -2764 -7127 -4429 723 -1527 -2849 -4933 1965 2738 2762 5911 8039 11331
8083 11331 10907 9578 9932 8871 8613 12309 17592 19979 13234 12634 14519 15234 8023 150 2767 5806
8067 5806 9733 13814 16419 17662 17566 9936 10368 11676 7711 4684 7343 19490 44648 60523 56736
8052 56736 46292 35819 27692 25977 21272 18217 16974 15578 12500 16014 18143 23448 28018 20515
8038 20515 21069 26677 28534 26096 20620 20607 27116 26837 18534 24027 30587 29212 30036 33219 26760 34678
8022 34678 49477 53201 59104 69560 75028 86057 92223 90994 95301 102561 106710 110321 92806 78988
8008 78988 68251 55410 52871 44284 37455 31172 28639 28356 32045 43067 58222 59689 55692 62392
7994 62392 65530 61388 58931 53498 43375 39024 45589 56333 65376 69171 66383 54835 53752 55533
7980 55533 55647 56351 63035 69780 75592 79132 85718 84779 75562 77659 77218 65553 54909 54107 59217
7965 59217 54510 45915 39020 29956 35091 39288 36687 35739 35759 33330 37779 42567 40822 39078 33913
7950 33913 28221 29458 28388 26779 36454 48914 56182 56412 47267 28505 20859 19081 24179 18879
7936 18879 17184 10233 6396 5370 6830 11292 14295 13683 12818 14963 14462 9245 6756 7064 8396 12065
7920 12065 11779 11236 13705 17653 22787 22324 18790 14973 7151 1564 2930 3372 1995 2014 9697 10514
7904 10514 10469 10265 12039 15691 15747 14022 3632 849 -2854 -5771 -1143 4623 7286 10289 11429 11023
7888 11023 6908 7541 12891 12952 3724 6934 8588 6136 5720 6298 8651 5942 8184 12749 9930 8672
7872 8672 6321 -5946 -11042 -8977 -10665 -3501 362 -3754 -5489 -6014 -3829 -5904 -9939 -6352 -7023
7857 -7023 -4629 -4910 -6200 -11848 -16444 -16160 -14597 -15988 -9759 -7059 -7664 -4284 -2246 -259 -8360 -14589
7841 -14589 -8958 -8208 -3433 -2415 6269 2928 850 -5877 -7979 -5769 -2686 -1253 -1136 -3053 -2898
7826 -2898 -3460 462 3522 -2370 -4417 -3596 -8818 -5936 1961 -1091 -2098 -5467 -3477 -2300 -1238
7811 -1238 -2867 4558 1156 -4997 587 523 1124 2203 3766 -1625 -5849 -8887 -8993 -6055 -4699 -334
7795 -334 3427 3979 2130 6597 6949 1109 -9898 -14491 -7819 -4622 -273 -5027 -4664 -5141 -5674 -5072
7779 -5072 1912 1998 -4003 -3562 9199 7183 1351 848 6119 126 -10162 -9122 -4100 -3612 -1334 -5171
7763 -5171 -7700 -1299 -595 5201 5457 1094 -1579 -2886 -3376 -2825 3029 8736 7539 3710 6519 5184
7747 5184 -1025 5245 4433 817 1528 5732 9452 6192 2931 -2026 -2059 1869 9673 15494 5146 -5914
7731 -5914 -7206 -3950 941 7911 4832 2072 -3279 -3704 -6032 -10031 -7320 -9550 -13564 -20610 -18577
7716 -18577 -4435 916 663 3300 -371 -490 2954 3549 -5628 -12140 -12614 -14672 -24254 -25209 -17883 -12504
7700 -12504 -10240 -11338 -8628 -4483 836 4881 2004 521 -6610 -6154 -8782 -5131 -417 -5405 -15051
7685 -15051 -13923 -9375 -2878 -2914 623 6008 -1260 -7295 -4162 4137 6353 7809 4573 8941 7426
7670 7426 -7817 -7631 -532 7233 10231 6900 534 947 6540 -1840 -6664 -7872 -543 -1570 -7587
7655 -7587 -4909 -2538 -3454 -7406 -9536 -10332 -14102 -9000 -2995 861 -6060 -9134 -3331 -3113 -6435 -10815
7639 -10815 1532 1904 -8873 -15949 -13201 -697 983 -1832 -2244 -5254 -7354 -7725 -3257 -5812 -8489
7624 -8489 -6496 -1042 -3413 -1515 3885 189 3055 927 4328 2739 -4080 -2810 -4290 -6098 -9356
7609 -9356 -12695 -5849 355 -1467 -4415 -8928 -16088 -9345 -5715 -4829 -3466 -6137 -7704 -4372 -9845
7594 -9845 -18081 -21913 -13528 1438 931 -9463 -13643 -17239 -10567 519 2657 -1758 -10490 -10003 -2648
7579 -2648 -467 2475 338 -2594 894 12120 12322 2962 346 -3740 -5910 -5684 -4472 -4383 1461 -212
7563 -212 2224 640 -10250 -16092 -23383 -18613 -13599 -13992 -10274 -11356 -17066 -16040 -10825 -3833 -3319
7548 -3319 -5096 -4732 -3024 -4126 -8700 -4426 944 5700 -4245 -10536 -9048 -9704 -8125 -7402 -10425 -14808
7532 -14808 -9860 -4041 -2882 -1861 -3969 -753 2040 4576 4420 -821 2563 7270 3322 -3209 -2117
7517 -2117 -457 -608 2360 4568 12467 9139 3798 1712 512 -3282 -3732 275 -417 4381 3052 -5926
7501 -5926 -5843 -2673 -792 682 1523 2424 -1472 -761 -2213 678 -1527 386 12 4026 -3695 -8640
7485 -8640 -9252 -6683 -2585 -3727 -1879 -6842 -8794 -3898 -5244 -3156 -2224 -4443 -7274 -5874 -3225
7470 -3225 -3598 -1895 269 -3702 1118 2802 6729 5424 996 -4147 -7285 -6954 -3363 -2496 -1772 -3280
7454 -3280 -8526 -15438 -18001 -8996 -2335 -517 395 -2512 -1581 -944 -7502 -11935 -12870 -7201 -1698 -6302
7438 -6302 -19634 -20330 -13651 -9336 -13622 -13316 -8981 -6927 -2341 6111 -1770 -11905 -8722 -5620 -4983
7423 -4983 1412 -1635 -6915 -5315 -5542 -15021 -16573 -7039 -7342 -14325 -20866 -14347 -13057 -8510 -5424
7408 -5424 -7836 -7799 -5203 3451 9541 1543 -3792 -973 2478 4553 2392 -4964 -4851 -4251 -882 4884
7392 4884 10958 6799 -1933 -10265 -14232 -15864 -17140 -19759 -20355 -16909 -18233 -17391 -9819 -11831 -15844
7377 -15844 -8038 -4851 -7099 -8877 -9823 -15633 -16034 -15395 -14700 -12683 -2580 -3594 -8486 -3807 -433
7362 -433 -676 -6324 -13285 -9876 -2610 2727 1513 -889 -741 -383 -1274 2774 -346 -6578 -8317 -9609
7346 -9609 -12505 -16418 -9184 -9483 -9642 -7675 -3335 -7409 -11486 -17900 -21389 -13893 -5446 1534 6210
7331 6210 6859 5324 -843 -4122 -11970 -23744 -24913 -24159 -15683 -14977 -10698 -6248 -8469 -16833 -9013
7316 -9013 -6184 -9496 -10901 -6943 1744 867 -2444 -4118 -1460 -5668 -10758 -7962 -10388 -12121 -15795
7301 -15795 -11234 -10473 -13628 -21317 -17404 -12772 -7907 5669 20507 18472 16976 16107 19276 21683 11293
7286 11293 1648 -7159 -10597 -6776 -4967 -3776 -9212 -8278 -1718 -2716 -7653 -3795 2854 5343 -5878
7271 -5878 -6205 -4573 -5049 -2222 3756 4398 3762 -2048 2663 4736 417 -7000 -10723 -15565 -9813 -10425
7255 -10425 -18633 -13695 3002 11146 11693 11508 11247 5708 -1962 -12379 -19846 -16397 -12804 -9348 -4025
7240 -4025 -2844 -6372 -8604 -3047 -3206 -8962 -6616 -7637 -4312 -2621 2616 4075 7160 6228 8065
7225 8065 13860 11783 5824 -2987 -7018 -5489 -1293 -3487 -3697 -2064 -6014 -9965 -9444 -945 -981 -9454
7209 -9454 -5573 -7257 -10933 -8750 -9496 -6526 -7917 -11118 -8170 -3079 -3487 -3208 -5644 -11612 -17089 -17408
7193 -17408 -14591 -19387 -23486 -21226 -15086 -10211 -9231 -5864 -1495 3764 972 -1048 5517 12168 10996
7178 10996 9647 4219 -49 -6142 -3449 -2431 730 -3083 -7832 -12873 -15629 -15769 -16857 -15880 -13086
7163 -13086 -15266 -13685 -8367 -3731 -5790 -7524 -10711 -10284 -10669 -11395 -9439 -10329 -9081 -10558 -12388 -7637
7147 -7637 -8706 -6011 -4848 -2688 719 5964 2335 -3002 -2788 11921 11940 8291 4202 3612 -1802 -5398
7131 -5398 -9045 -3760 368 944 -4700 -10080 -13089 -12126 -8453 -8901 -7707 -5210 -4504 -4390 -12060 -11730
7115 -11730 -11230 -13776 -12222 -11261 -15438 -12281 -4053 -974 -6804 -8378 -10201 -9854 -8572 -14373 -15067 -9414
7099 -9414 -7548 -7206 -1637 2317 5328 4313 8228 4462 5099 2233 -575 -7562 -14337 -14742 -12712 -11493
7083 -11493 -10358 -8158 -14537 -13707 -13661 -9750 -5027 -12891 -15515 -19025 -9762 -5536 2524 5823 7860
7068 7860 1625 1068 4467 -1782 -7120 -7532 -9343 -11415 -7495 -7058 -5923 -6341 -3580 -1411 -2555 6253
7052 6253 17675 17439 9346 2781 -3968 -4448 -3831 -3149 -768 -2925 -5975 -9663 -5946 -5141 -6594 -3589
7036 -3589 -237 346 328 -155 -3539 -5738 -6627 -9404 -7780 -5823 -8658 -12149 -11109 -15017 -14745 -9761
7020 -9761 -12156 -11140 -13290 -10876 -7414 -7761 -17944 -15610 -10555 -9990 -12440 -18286 -16619 -11752 -11337
7005 -11337 -9813 -6244 -4969 -12980 -16181 -12651 -8496 -3083 4006 5173 -594 1711 -1903 -7019 -5882
6990 -5882 -5801 -5899 -5406 -3399 -3128 -4440 -1401 -2829 -3612 -9561 -11701 -10711 -2661 6026 -5564 -13040 -19226
6973 -19226 -8873 -5471 -6505 -8647 -8644 -10156 -9369 -3202 -5563 -4985 -4711 -12414 -16113 -16527 -12057 -9766
6957 -9766 -7199 -4567 -728 5253 6997 6626 3207 677 -823 2039 -2081 -7884 -10467 -12398 -8663
6942 -8663 -3989 2286 -2881 -5713 -5173 -10767 -14838 -13070 -12537 -13720 -18277 -10014 -383 1810 381
6927 381 -2405 -7275 -11982 -11917 -7958 -4282 -6209 -11427 -8014 -1996 1089 799 -166 -7512 -16407 -12643
6911 -12643 -10659 -16758 -20743 -10709 -510 -5853 -10373 -8394 -10163 -7626 -9573 -5571 -2517 -2901
6897 -2901 -4337 -8803 -7059 -9344 -9057 -1614 -850 4659 10024 6603 8257 4998 -1077 -7091 -4452
6882 -4452 -2241 2360 5509 -7818 -10339 -4516 -4182 1571 6302 6918 9995 10829 6883 1207 5375
6867 5375 1799 2380 -760 -9178 -12359 -6573 25 7108 7490 3489 -2817 -9277 -4515 -4427 1652 -501
6851 -501 -1541 3014 2257 1182 3702 512 -7642 -11953 -7192 -3785 -4790 -5778 -6580 -9453 -6246 -2813
6835 -2813 -1645 -2901 -5178 -3747 -3419 -9568 -7799 -5097 -937 -3034 -3031 -1980 -3444 -2088 -3132 -6114
6819 -6114 -6179 -5178 -8053 -8179 -9813 -9234 -12210 -10992 -7397 -4097 2420 6534 7104 1556 -1301 -940
6803 -940 -2032 -4766 -3007 4801 6836 -1046 -11890 -9387 -6711 -6362 513 59 -5709 -7344 -8708
6788 -8708 -3333 6481 13024 10718 4737 1163 5667 6146 -2694 -962 2026 870 -5400 -1365 855
6773 855 -795 -5548 -2915 6145 -557 -3324 -3161 3911 3322 -1447 -7936 -11526 -6240 -3407 -3361 -9348
6757 -9348 -2845 -2016 -4592 -12150 -11934 -13400 -15332 -12170 -5099 1168 4968 2852 1841 4713 6390
6742 6390 4926 8273 11590 5173 7669 13830 15475 19792 18585 17608 19212 16817 18137 16959 21849
6727 21849 33428 49991 64001 84125 90497 82760 64540 44288 28046 20870 22134 21635 26361
6714 26361 26545 19630 10780 13848 16184 20371 12267 7578 2274 -5603 -4448 2797 3557 -3414 -4267
6699 -4267 -4601 -4637 -1125 -2465 1755 4480 4588 4257 4276 8365 7968 5751 -2500 -2542 7320 8047 4773 3243
6681 3243 408 -5788 -10851 -11487 -9898 -8531 -4823 242 -4606 -7407 -9868 -14494 -15075 -14759 -6174 -10039
6665 -10039 -6342 -5197 -112 -473 -5207 -7421 -5665 -2842 -3913 -14803 -17495 -11754 -10071 -17010 -16072
6650 -16072 -13431 -13145 -15661 -10468 -3212 -6036 -1761 3041 -2280 146 -5998 -10559 -2575 -5380 -3341
6635 -3341 -3058 -5733 -2397 348 840 -3273 -3799 960 1029 -3349 -10131 -8072 4705 13652 13852 6961
6619 6961 3132 2257 4727 4154 2590 -232 6371 11106 8932 3026 -4553 698 8753 5492 -1138
6604 -1138 -552 -1646 -4775 -7563 -8256 -6044 -6251 -4334 -6712 -8440 -3883 -5762 -1619 1939 5536 1749
6588 1749 2065 2985 4456 -17 4008 9354 4695 2206 -2142 -3885 52 3543 3435 -514 -3484 -8017
6572 -8017 -8680 -5941 1072 1261 1392 -128 -2131 3456 4439 945 -826 1193 199 937 800 2477 1315
6555 1315 -4831 -6252 -2544 -2350 -3586 -5015 392 -729 -3338 -1411 -3256 -7223 -15446 -12857 -6283
6540 -6283 -1174 638 219 781 4749 7899 39 -5679 -5652 -2461 5756 5156 8866 5837 8588 6992
6524 6992 7278 278 423 1801 -6828 -15035 -19464 -9694 -3490 1335 6648 4337 1084 2399 -1195
6509 -1195 -9195 -10275 -12041 -10584 -9450 -5828 -3024 -5078 -6010 193 -2803 -8279 -8621 -8420 -12952 -14307
6493 -14307 -6316 -2150 738 1841 3917 4532 -798 -904 -541 5391 2892 -1321 -8630 -8333 -5208 -5616
6477 -5616 252 -781 -2243 -5206 -14791 -15064 -15407 -10167 -9389 -10203 -5502 -4640 -8808 -7882 -2869 724
6461 724 4720 5423 1687 -5045 -3301 1356 2312 7958 6299 980 -839 749 -2025 551 -1407 -3003
6445 -3003 -2804 -2364 -920 -1591 -1311 -582 -4594 -8139 -6926 -5040 -2801 3187 -3986 -8375 -4219 -885
6429 -885 -8538 -10431 -7722 -11389 -7441 -6421 -4384 -6719 -5594 -10215 -1473 4538 1510 -2253 -3032
6414 -3032 4005 6404 10984 6213 1274 14027 19420 11646 4844 -1323 3278 2859 -2857 -8570 -4139
6399 -4139 1589 1179 5125 8912 4796 6344 2619 2153 -729 5261 2780 5080 3209 4591 10558
6384 10558 9782 9671 7061 -2988 -1496 -3766 -10771 -7600 -7158 -9412 -9508 -9721 -10452 -14177 -13124 -11946
6368 -11946 -9915 -8209 -4668 1517 -206 -6742 -6973 -5586 -6547 -5466 -9001 -13375 -10592 -1691 1780
6353 1780 -795 778 -3518 -8292 -2476 -2216 -7033 -12388 -16355 -14056 -12912 -13060 -11492 -14331 -14550 -10957
6337 -10957 -6903 1269 5655 11184 6967 6786 3925 -4348 -6840 -1834 2696 5457 -1959 -11679 -15279
6322 -15279 -18302 -19807 -15895 -4803 -4158 -9254 -10444 -8230 -6225 -34 5843 4353 -3939 -5185 -4860
6307 -4860 -8025 -10777 -15839 -20066 -23798 -21599 -13738 -3495 -1197 -3902 -7219 -9149 -8450 -5764 -119
6292 -119 -4568 -3630 2204 6733 8734 9929 8202 3708 -1056 -1444 -815 -1099 -729 4428 9104 10135
6276 10135 8723 9634 7343 7294 5575 -1593 -8617 -8873 -9720 -11325 -6208 -7321 -2290 -816 -2596 -2158
6260 -2158 1186 -2282 -486 -3349 -7670 -6205 -746 1495 8053 10500 6011 -1014 2692 6131 6482
6245 6482 7288 6410 7708 6257 1106 -7493 -7662 -1694 1911 -3503 -13159 -19543 -18705 -12001 -9658 -1189
6229 -1189 -55 -296 -4438 -4633 -10105 -14660 -10390 -13796 -20032 -14945 -3202 -1841 -2702 -5524 -8275
6214 -8275 138 -583 -2608 -166 7026 10561 11437 12679 6459 2614 -1422 -4357 -3758 -3112 -7584 -8109
6198 -8109 -9144 -11263 -14403 -16352 -18951 -12265 -8161 -10164 -17979 -15142 -8155 -11739 -16220 -10140 -5995
6183 -5995 -3833 -9040 -7756 -4163 -7197 -2608 -4054 -2357 -1655 -3930 -5276 -4565 -5307 -2584 -3649 -10171
6167 -10171 -10931 -8964 -10906 -7206 -2483 -4592 -6581 -4921 2404 10352 12610 8363 -958 1967 3644
6152 3644 2841 -6592 -11863 -5239 -8970 -10619 -10696 -15005 -10139 -8361 -4251 -8489 -14157 -7460 -4873 -6258
6136 -6258 -3065 -6794 -8096 -5252 -4189 -2895 -3495 -2322 -3086 -6790 -8067 -10861 -10999 -7068 -3264 112
6120 112 2765 -722 397 -592 -2516 -2890 -2275 -1169 2470 -230 1492 10795 3363 -5341 -6967 -9464
6104 -9464 -9002 -3768 -2761 -12413 -14498 -9520 -7646 -3159 757 2220 3346 -6651 -3166 -926 -5461
6089 -5461 -8201 -4932 3175 2422 -1571 -3441 -3025 -8544 -6306 -3692 -2118 1349 4354 8294 8248 116
6073 116 -4583 -2806 -1429 -4672 -10511 -13504 -16508 -19066 -11200 -7661 -7930 -11912 -12150 -6236 -14227 -19897
6057 -19897 -12666 -9230 -9791 -12004 -10445 -8885 -7287 -7045 -9610 -13999 -14970 -13593 -10695 -9421 -8843 -17072
6041 -17072 -16542 -10695 -6003 -1820 -3441 -2686 4697 3959 -1519 -4008 -8137 -2944 -3760 -7630 -5476 -3260
6025 -3260 -2642 -1366 -3509 -4015 -4273 -7655 -8382 -12792 -15515 -15833 -17955 -21947 -15898 -11715 -9134 -12115
6009 -12115 -6618 5666 3468 -6549 -8176 -11234 -11115 -10604 -10672 -5773 -5120 -6501 -2482 -737 992
5994 992 -2591 -3270 -4669 -7163 -4439 -1064 -2584 640 7543 11213 2719 162 -3393 -9793 -11117
5979 -11117 -9204 -14906 -17392 -16754 -17155 -17950 -18761 -15031 -12684 -14588 -8355 -4881 -10450 -12746 -10721 -5316
5963 -5316 -2765 -3245 -3686 75 3029 2683 4225 877 2729 6515 9246 663 -3405 -2821 1868 4330
5947 4330 7137 1885 2849 -496 -2992 -2850 -5178 -257 -294 1372 4904 1394 -4339 -9076 -9631 -8643
5931 -8643 -6985 -2133 -4920 -6165 -5688 -3217 -2983 -1913 -2910 916 2151 4109 10603 4165 -421 6876
5915 6876 8413 7998 5681 647 -3261 -14917 -15581 -7575 -5742 4574 3413 3985 3253 845 2688
5900 2688 -547 2450 4094 4475 -1127 1155 487 -1590 -3489 -2796 -3777 2590 1221 -5649 -1474 1119
5884 1119 -1887 2242 5932 8675 6102 -3042 -5320 -8516 -4849 -1710 1183 1144 -724 -10375 -4056
5869 -4056 282 -2439 -4874 -6027 -448 -5693 -17113 -18646 -9902 -7774 -4790 -1317 -2490 -2093 -7687
5854 -7687 -9210 -8508 -3425 1937 -2444 -11025 -9109 -10276 -15878 -23008 -23580 -14687 -4756 2018 441
5839 441 -9083 -9249 -5871 -3697 1416 6962 3018 -1902 3638 8562 938 -6016 -10612 -5579 951
5824 951 -652 -1178 864 -4570 -1265 -2012 -1607 1226 -1134 -4398 -6843 -5473 -2682 1833 -632 -4399
5808 -4399 -10349 -12414 -10595 -7030 -6980 -6361 -8307 -12757 -18536 -16454 -12523 -8756 -7610 -2709 2509 150
5792 150 2262 2969 -2493 -7215 -3995 -1492 -9626 -12291 -14111 -14824 -15314 -8579 -11761 -14194 -8730 -5976
5776 -5976 -514 -2493 -4305 -8521 -6103 -5315 -4139 -2963 -1940 -1801 -3001 8829 13059 2814 -3173
5761 -3173 -5064 -10078 -7142 -3441 -2944 -6100 -4433 2797 5475 3446 -706 2462 8258 7014 1241
5746 1241 -4905 -12527 -10213 -13073 -14384 -7351 -6125 -4938 -5616 -5660 -1534 -1435 -159 -3237 -8945 -15091
5730 -15091 -12019 -8612 -6757 -9618 -6385 -96 -5068 -5488 -11924 -16451 -14622 -11492 -9281 -9090 -7634
5715 -7634 -5151 -9577 -11059 -12849 -18243 -17857 -9390 -8222 -13017 -14995 -12680 -13175 -11059 -3426 1295
5700 1295 1483 -2182 -10018 -9919 -6179 -1772 4406 6737 182 -6575 -11843 -10207 122 3262 3272 1618
5684 1618 6975 7382 4237 4539 -4664 -11349 -9005 -8648 -8848 -4205 -6972 -7819 -4095 1306 3915 11166
5668 11166 6080 3569 4348 3640 1078 6718 7622 6808 3690 2378 3449 3422 984 -1995 -2115 -10053
5652 -10053 -5036 1086 1671 2316 5905 -2418 -16698 -10945 -3623 -5725 -10306 -10148 -995 1794 2305
5637 2305 3156 -2537 -782 -1996 -7391 -9249 -15912 -17895 -14934 -15075 -15194 -8949 -6415 -8592 -8303 -10098
5621 -10098 -10974 -8203 -6011 -4964 -662 3096 5818 -3310 -12364 -10512 -8673 -7499 -9314 -3455 -2095
5606 -2095 -8925 -2404 6608 9310 6768 -1011 -12138 -10542 -8358 -4911 -2760 -5819 -7282 -1234 4247
5591 4247 -1952 -8477 -5287 -4283 -9206 -5784 935 6794 10648 59 -4020 -7852 -2904 6172 8204
5576 8204 11343 11317 314 -4246 -5660 -5054 -424 -2159 -3256 -849 146 -1144 -5117 -8093 -5916 -8589
5560 -8589 -4291 -4775 -13767 -23217 -17964 -18264 -15012 -8126 -2577 37 1839 -4217 -9410 -6020 -8898
5545 -8898 -12263 -4348 -6087 -12747 -9831 -3568 -4450 -1784 4544 7956 1353 -8407 -11598 -12644 -7881
5530 -7881 625 -703 -9001 -9171 -8269 -7825 -11441 -15243 -15617 -9153 -3976 -6686 -6234 -6334 -4330 -3041
5514 -3041 -8341 -9900 -8289 -10145 -10098 -5974 -4563 -3410 -1817 -3141 -5092 -2037 -8747 -12458 -6819
5499 -6819 -8675 -6701 -3703 -2791 -316 567 -4507 -9853 -12290 -5402 -3350 -7627 -8307 -9247 -7185 -4945
5483 -4945 -4624 -5952 -1867 1278 2678 7709 12196 13152 8760 4326 -2089 -3274 -7310 -3006 2813
5468 2813 -4140 -10153 -2194 2370 5206 2420 -2474 -8861 -9505 -7898 -9223 -5935 -6419 -7043 -8757 -9893
5452 -9893 -8592 -7587 -7077 -7611 -10934 -6252 -878 -9938 -17382 -15575 -14645 -9735 -4588 -3869 1288 -7744
5436 -7744 -11001 -12019 -11974 -13585 -9758 -7205 -12356 -10731 -3685 -5330 -9221 -10139 -8232 -6097 1118 -5487
5420 -5487 -8071 -9809 -17527 -16859 -7913 -603 3321 5654 2505 -877 -1368 2311 4226 -541 -2309
5405 -2309 -1057 4770 5495 2610 -536 676 -300 -879 -7053 -11373 -8917 -2448 6598 5597 -1372 -10043
5389 -10043 -9951 -3595 3457 4771 11040 9043 11829 10994 7525 2139 3126 8116 9567 7971 6166 858
5373 858 -7827 -8286 -7986 -4103 -390 801 2894 2014 -241 -5184 -17317 -13248 -11546 -7010 -575 1680
5357 1680 3439 -3740 -11277 -15485 -16874 -5926 2909 10955 5977 -808 -3073 -3403 -2054 655 2563
5342 2563 9138 12231 4736 -3933 -370 -1824 -3182 -59 -5056 -5010 -7652 -7762 1801 30 737 194
5326 194 92 -3364 -1613 1329 5224 2371 4882 8477 2821 3687 7572 6695 4921 3689 2454 -2095
5310 -2095 -3529 -4419 -2856 -4364 -1581 -2665 -6768 -12554 -11456 -5608 3397 2213 -1332 4726 9963
5295 9963 8714 1404 -4340 -2071 -3519 -4504 -2392 412 -1809 -6846 -15013 -14887 -3400 -354 5413
5280 5413 7911 8742 11458 13573 11473 2978 -797 -1195 -4666 5223 12863 6476 4202 7718 1678
5265 1678 -2582 841 3098 -460 -3615 -2827 -435 -1447 2122 6983 12629 7035 -494 -1871 3199
5250 3199 694 919 -1296 -135 2028 1119 7612 12305 7997 2491 -191 8577 3676 -3683 3918
5235 3918 5142 4608 5476 4982 5109 6292 9517 9375 6791 10465 6587 8562 1760 -8032 -10966 -7037
5219 -7037 555 7491 9602 6359 -3249 -4067 2084 -8290 -6553 -2555 2441 173 -8360 -10480 -13978
5204 -13978 -12554 -11756 -13407 -14744 -12865 -12736 -7962 -2825 -7611 -7940 -5331 -2339 -3978 -7600 -5599
5189 -5599 743 7118 7499 7588 4905 5094 4013 4303 8373 3766 207 -3000 -9188 -8981 -9154 -12044 -11118
5172 -11118 -7817 -9751 -5467 -475 -96 -1262 3015 5673 4277 -2272 -7732 -9918 -7332 -4145 -18
5157 -18 -5714 -7517 -7744 -4090 -2358 -11987 -9355 -2209 -4072 -6160 -2310 -74 -1655 -556 6980 10737
5141 10737 15974 13492 9731 5571 559 336 -61 4374 5236 3 -4815 -309 1150 -149 -8608
5126 -8608 -9889 -6243 -15013 -16106 -3990 2896 7892 6328 5414 2318 -248 3826 5969 -2076 -9289
5111 -9289 -5877 -6936 -7876 -9099 -3923 -4704 -3111 -4740 252 2991 -2927 -4907 -6602 -3511 1481
5096 1481 3417 -1313 -1805 -4305 -10590 -15725 -16589 -10667 -9041 -6738 -165 -4002 -2013 -5408 -6913
5081 -6913 -3572 5950 -2569 -3048 170 5251 4340 1097 -2422 851 6422 4750 969 -3116 -5708
5066 -5708 -5437 -8402 -6501 1676 -15 -5495 -7939 -5198 -398 7450 6858 975 646 3306 284 -5322
5050 -5322 -11471 -11019 -8376 -7109 -7239 -9592 -3471 -311 6839 8899 8788 11533 13502 9527 -281 -7090
5034 -7090 -6352 -4617 1639 -3183 -10414 -10004 -5795 -9891 -16744 -16956 -10234 -12005 -8815 -4680 -7819 -7503
5018 -7503 -4419 -3366 -491 1368 -2785 -785 1188 461 4993 4495 1825 -1351 -9525 -8529 -7813 -7700
5002 -7700 -9184 -10528 -4092 -3404 -6518 -6417 -7314 -4822 -3760 -1771 1240 6000 10242 3919 -5049 -6998
4986 -6998 1404 5172 821 3818 8887 7079 1099 133 -7787 -9394 -6288 -11418 -11967 -12572 -6132 -1077
4970 -1077 -279 4018 7802 2772 5212 11414 11267 12338 16341 15542 14789 14094 2988 -3588 -6720 -9280
4954 -9280 -16522 -13824 -6970 -2524 3411 -386 1365 3285 -5095 -8573 -3935 -2921 -8662 -11043 -7383
4939 -7383 828 55 4115 4724 -936 2799 1372 -768 -2136 -5374 -467 -1404 -6857 -6700 -6449 -8261
4923 -8261 -4149 -1969 3284 7533 10273 6286 3209 -1774 -7846 -1580 1746 -1325 -1315 -3870 -1757
4908 -1757 1924 -1184 989 4934 4320 -5446 -1496 10201 9603 -3687 -5591 -294 -2419 -4951 -6346
4893 -6346 -6246 -4750 -2433 -2012 -2728 21 2568 -961 -5871 -13983 -18366 -12912 -4193 -3443 -7521 -6550
4877 -6550 -770 1278 1132 2054 2147 -163 1740 4310 3861 -880 -6901 -6593 -9503 -8034 429 9321
4861 9321 5045 2936 3552 7861 -109 -2213 629 -1627 -5590 -8762 -4202 2985 -349 -3963 757
4846 757 2837 2186 -7703 -8539 -5469 -6381 -11663 -15157 -5917 1887 3399 2224 -3246 -9819 -10452 -5229
4830 -5229 1048 1596 3383 2142 4858 11637 3845 71 -3783 -10208 -10887 -10597 -5130 -281 4287 4589
4814 4589 2998 2586 -1173 -2276 -3222 -5311 -3829 -3406 -5440 -12115 -8496 -6485 -9052 -8667 -10109 -8155
4798 -8155 -10204 -7006 -11081 -11378 -8923 -9546 -7761 -9868 -9260 -303 -3128 2443 1885 -5640 -7958 -10846
4782 -10846 -16635 -18053 -14418 -9284 -6243 -5778 -9269 -4188 -4268 -5854 -8615 -6635 1499 11058 9561
4767 9561 1445 2996 -1719 -9757 -10765 -9239 -7912 -10130 -17393 -14189 -8503 -5067 -4097 -4185 -6201 -3591
4751 -3591 -6250 61 8741 7297 -3636 -16958 -17405 -14838 -13364 -12481 -12263 -11381 -11487 -10417 -3473 -1413
4735 -1413 -5618 -5254 -12566 -13480 -9868 -4662 4762 8417 9998 8611 5672 2619 1372 1447 2761 2358
4719 2358 -1984 -6607 -4841 -4921 -5722 -8009 -6361 -8924 -15908 -10513 -2169 -316 4835 755 -4605 -7320
4703 -7320 -10299 -7426 -5647 -863 423 -3146 -7989 -11424 -13887 -12282 -4935 -2857 4169 2960 -2726
4688 -2726 -4758 -4890 -26 -1033 -6164 -9650 1244 13798 15550 8801 1335 4018 8154 5259 4426
4673 4426 8933 2356 -816 2350 4534 5931 806 -1356 -6212 -7657 -3340 2740 7820 2214 -5513
4658 -5513 -2222 -1415 -6967 -12733 -9456 -7694 -5177 -2853 4522 14661 13599 9990 9386 6507 5992
4643 5992 3134 2683 6140 2389 2806 3650 1 -421 -5515 -14308 -17301 -17564 -16788 -13420 -9478 -8356
4627 -8356 -4211 -4716 -927 1781 -3541 -6252 -4469 -3383 -1912 5650 2796 -3900 -3704 1796 -3790
4612 -3790 -7875 -11989 -18495 -15024 -2164 5149 1923 4074 1434 -2696 -11443 -13455 -12356 -9434 -1603
4597 -1603 546 -849 -846 -5726 -4317 2801 5305 -1697 -8843 -10305 -7154 -5903 -5287 -5066 1883 -2362
4581 -2362 -9475 -6425 927 -340 -4784 -5278 -3064 -9035 -14877 -10831 -1558 2298 335 -4973 -14210
4566 -14210 -14010 -10499 -8141 -10266 -13969 -9749 -8623 -6432 -6016 -5468 -1505 863 4643 4071 4828 4282
4550 4282 2909 2566 298 -7292 -1308 -417 -1070 -8351 -120 8667 -491 -8766 -13874 -16780 -10754 -4672
4534 -4672 -5837 -16592 -22390 -20183 -19050 -15929 -9117 -3228 -3182 -5752 -62 -3002 -8591 -6454 4253
4519 4253 1434 -2943 -5281 -1756 1511 3912 -881 -2467 -4676 -3582 -1918 2528 -2385 -146 -1220
4504 -1220 -5688 -13425 -10700 -9048 -12911 -12956 -14102 -9986 -6665 -7550 -5915 -8328 -12691 -11504 -6030 -4462
4488 -4462 -1854 1157 1029 717 1204 -6853 -12061 -14314 -10313 -11155 -11702 -10359 -8136 -6024 2683 990
4472 990 -391 -3949 -1694 871 -594 358 4546 2304 2816 6920 6954 7013 4039 -2605 3467 3324 2513
4455 2513 3986 1355 2112 4098 -1719 -4146 -1396 5972 10074 8730 -2890 -4796 -2451 -4621 -11665
4440 -11665 -19265 -17187 -8786 -3628 -1105 -4609 3283 5664 2965 4925 7811 3695 -1964 -2696 1474
4425 1474 -512 -3552 -4363 -5382 -3320 6012 7434 3408 -292 -5307 -5306 -6471 -3430 4497 3420 -4087
4409 -4087 -3049 -6362 -10343 -3729 -703 -2445 1003 2555 5837 2365 -9327 -6905 -13341 -16370 -11299
4394 -11299 -6107 -8877 -5763 -1476 -2256 3236 1715 342 -528 -473 -3955 -2735 4131 9224 10994 6793
4378 6793 9528 11328 5567 -3036 -5163 -3050 -3773 -3052 -2116 -1973 -6340 -11845 -17653 -17127 -17874 -14580
4362 -14580 -7727 -8347 -11767 -3090 -2005 -7996 -9400 -4504 -2904 -213 526 -4272 -5909 -6406 -5014
4347 -5014 -4290 -4524 -8142 -13437 -13800 -12063 -12264 -13665 -8784 -1588 391 -3576 -4770 -4609 -7390 -13161
4331 -13161 -12475 -10034 -9684 -11497 -10228 -3549 -3861 -330 5098 6697 4075 -3025 -5155 -181 -1454
4316 -1454 -2421 3164 6458 3213 2110 1899 -2954 -5558 1695 -4386 -3927 -4963 354 1792 642 1826
4300 1826 -921 -1869 -1930 987 5181 6842 2379 5366 1549 -1855 -7874 -11344 -811 4674 795
4285 795 4241 12524 10833 6551 4749 -4263 -14659 -18763 -8281 -2764 -5000 -5132 1499 -1556 -3885
4270 -3885 -4594 -7296 -2474 -376 -1806 -8005 -9052 1393 8073 5720 4438 1929 -75 -9446 -13211
4255 -13211 -15579 -15490 -12248 -4816 -2535 1882 5977 320 -7421 -10626 -7390 -2428 -2289 -1729 -2810 -4430
4239 -4430 -6702 -8866 -7242 -2927 -186 925 2525 -1584 -7312 -7413 3556 4544 191 557 5894
4224 5894 2963 5042 10340 9144 -604 619 858 -975 3548 10690 8458 6693 4257 4334 3664 -789
4208 -789 1489 -274 -1345 7562 5660 -3900 -2268 -411 -1925 -1764 -1019 2127 6962 3176 2508 317
4192 317 -361 2839 1603 -1138 612 -575 -3517 -1191 1416 -1265 -4573 510 -3077 -7469 -1499
4177 -1499 986 3480 504 9201 9965 10440 6041 6602 4034 718 2382 -1752 -4307 -5201 -5432 -5632
4161 -5632 -8113 -1883 9018 -1627 -9424 -10416 -10974 -12112 -8355 -819 3263 1113 991 -7357 -7702
4146 -7702 -2058 -2296 -2550 -8778 -6595 -9770 -10046 -13521 -15159 -8380 -785 -2112 -1676 3782 4127 4873
4130 4873 8999 10617 11738 7675 1888 -7451 -6998 -5585 -5782 -4005 -6080 -5913 -8718 -13549 -12717 -4232
4114 -4232 988 -6657 -3064 -3910 571 -3972 -4799 -4518 2794 531 3904 8031 6649 -3297 -5846 -2383
4098 -2383 -2804 -3606 -293 1505 2566 5036 6827 7862 7172 8781 7755 5525 1221 -2051 558 5396
4082 5396 3327 5733 4866 7242 8173 1314 2274 5605 7271 6389 2091 29 3649 -674 -1500 -4275
4066 -4275 -8386 -8473 -8483 -16112 -16729 -15004 -13767 -5769 2588 9453 11223 3953 1094 189 -2492 -4263
4050 -4263 -6024 -3062 365 2207 6496 7032 4561 999 -3220 -3607 314 5885 12930 15448 8928
4035 8928 3136 2185 6502 2004 -2928 -5746 -10853 -8154 -825 2830 53 -468 -304 5469 8435 8735
4019 8735 12730 12875 13795 8159 6145 5421 4852 -487 -3989 -7172 -8046 -9489 -7879 -1124 -4203 -4491
4003 -4491 -6951 -9535 -2508 897 1638 5999 5323 4358 1404 -225 -991 -7317 -4400 -5182 -11027 -12649
3987 -12649 -2051 -2616 -3664 1229 -1607 -1111 2290 4080 -4156 -4104 -952 -2138 -3409 149 4433
3972 4433 8601 10495 7088 1780 -447 1192 -1763 -6451 -2417 829 1 6695 6048 5259 1437 1017
3956 1017 -1351 -1493 -9937 -16912 -15832 -13154 -15223 -16342 -10637 -5280 -360 5766 11681 14262 10345
3941 10345 414 1925 2357 -2356 -7359 -3179 -267 -1347 716 139 -6206 -774 414 -2720 -4105
3926 -4105 -8724 -15215 -15630 -15196 -13922 -13094 -12152 -3601 -4488 -2641 2938 9568 10548 3655 -3088 -1344
3910 -1344 -907 -1545 -810 -64 2099 3373 1938 -508 8697 3529 3905 835 -170 440 -2417 -1071
3894 -1071 7712 4327 5919 2003 -3277 -534 356 827 11036 11350 5417 -2606 -3467 1211 5371 2787
3878 2787 1560 2398 976 2116 -1034 -3291 270 1279 3976 20 -4525 410 2404 6156 15588
3863 15588 12337 9327 5548 2044 -4193 -5359 -2198 -1614 10081 7494 1542 2520 12034 14149 7765
3848 7765 -151 -5073 -5554 -8005 -7269 -6270 2535 8351 11263 4713 3517 4633 4785 7657 8824 6827
3832 6827 -109 -3006 -9217 -12792 -13607 -8481 -9515 -12864 -8275 3586 7700 5797 2454 -79 2567
3817 2567 6328 12508 14684 7247 2718 1705 4729 6270 295 -2601 -3535 -6719 -8343 -8723 -3082
3802 -3082 -10637 -18630 -16242 -6971 -386 3231 2801 11360 16377 17745 6202 -2869 -1235 -5373 -17276
3787 -17276 -20407 -11188 2397 9530 9082 4507 503 -3958 -4109 -3168 -3922 -4199 -3234 498 23 -2470
3771 -2470 -7061 -5240 -1997 1382 -2428 -86 2785 11304 14688 14035 7229 -50 -3568 -4732 -4620
3756 -4620 -568 3287 5866 8065 8143 8374 8088 5894 7442 4594 12846 12596 6436 -174 -224 691 -6056
3739 -6056 -13603 -15892 -12194 -7322 -2989 5916 5196 3420 1650 5280 5738 -4739 -1111 2334 5747
3724 5747 3706 6568 1895 -4725 -1128 786 -3073 -4260 -7440 -1822 572 4505 5931 5929 7033 315
3708 315 -6455 -4738 1927 3327 -3676 -845 -2375 -5523 -9546 -13786 -8788 -4454 1845 1416 3857
3693 3857 11901 7734 2988 3632 2507 -2376 -1365 -1179 1047 1873 3513 1262 -612 -4315 -6200 -4745
3677 -4745 -4840 -1374 -5840 -103 -1034 -2609 1294 622 953 -473 6035 7531 3701 -4055 -6917 -1638
3661 -1638 3052 -714 -2697 -9472 -10330 -7398 -1389 4911 5145 2451 -878 -8276 -12821 -7951 -2255
3646 -2255 -434 -3892 -2903 -887 2246 -1014 -2646 4419 3763 105 1516 1530 -613 -1655 -6205 -7556
3630 -7556 -7297 -7408 -7727 -10947 -8334 -2801 -1694 -95 -3933 -5506 -7117 -11905 -7248 -7630 -9420 -4474
3614 -4474 -297 -1372 -7265 -9000 -5521 -10728 -8931 -10339 -6459 -10465 -3132 3800 5317 10847 6510
3599 6510 5712 10425 6077 -4024 -5822 72 4515 509 8350 7944 -1754 -4369 1029 2712 9726
3584 9726 3434 -1586 -2567 -4665 -1392 -2365 -945 -3255 -1454 1170 -3152 -8214 -6995 -6571 -4683 -2417
3568 -2417 1496 992 -1298 -3233 538 1724 4273 9753 1348 -3462 -889 -1773 -4119 -6473 -13772
3553 -13772 -17724 -8621 1262 3522 2295 2723 4254 390 -2398 -2886 -4482 -5647 -9412 -5917 -3764
3538 -3764 -2814 -5602 -11459 -13545 -8559 -10626 -8358 -5469 2005 662 -3211 -6621 -4510 4286 6597
3523 6597 5925 7047 11311 6262 7711 2974 6852 1627 -2147 -6425 -2693 4820 8477 2573 -8249
3508 -8249 -16382 -16484 -10824 -7744 -6585 -4743 5339 5342 9170 8421 5233 6579 3576 -4987 -11921 -9679
3492 -9679 -2724 6411 9277 5798 1113 7575 4011 -7667 -11009 -12482 -1068 -131 -13813 -16869
3478 -16869 -8770 -7793 -11056 -6378 -374 -1005 -3878 -7459 406 6128 7178 53 -8499 -5956 651
3463 651 2633 7773 13594 10126 1638 5411 5741 3311 2148 4606 6868 928 4214 9063 11827
3448 11827 11482 1620 1561 4831 891 -1982 7391 11324 6013 2182 962 -5178 -5430 -4974 3154 9482
3432 9482 589 430 1852 -473 1135 -534 -10592 -9318 -2766 -858 -4947 -11389 -15302 -11007 -3190
3417 -3190 -993 537 1396 3480 -2272 -10313 -14465 -14997 -12584 -9461 -997 4572 5917 3514 -1586
3402 -1586 -1213 -694 -894 -3817 101 4263 11596 435 -7441 336 1799 1255 1558 -5349 -2436 4569
3386 4569 -35 3680 9488 10084 4923 2057 -4878 -13345 -16058 -11755 -1706 3805 3419 940 -4026
3371 -4026 -1475 4701 1562 3660 3841 -7347 -7564 -4341 -1761 4297 10361 7081 3625 3595 157 -455
3355 -455 6346 3935 -2027 -886 -1773 3001 6963 4584 8620 4686 -12279 -19079 -18608 -4521 662
3340 662 -654 2743 55 -3106 -1432 3516 3585 -3440 -3787 -2 -309 1144 -3240 -7502 -4521 -5929
3324 -5929 -838 7525 3708 755 4012 2848 2254 -5655 -5954 -3951 -9008 -10949 -7396 -3088 -3769 -5321
3308 -5321 2059 -1599 -8455 -4857 -4590 -10069 -8611 -3502 2631 4266 2389 1791 6194 8540 4896
3293 4896 5047 6777 5491 -1795 107 -1372 -6221 -11718 -7723 -3068 -7358 -8708 -10146 -8505 -6920
3278 -6920 -1473 6153 6727 1042 -2647 336 5852 5224 1125 -3825 -5641 -5666 -4255 4502 3410 -3805
3262 -3805 -6204 -4820 -4752 -2178 -2901 -2249 -5301 -1836 -989 -47 4008 4053 1199 2103 7083 5822 447
3245 447 2868 7948 6060 3532 1718 -8727 -16131 -15631 -6017 2392 1158 -2850 -8611 -7146 -2620
3230 -2620 -1375 -1865 415 6306 8420 10672 4561 4594 3427 3742 10189 11788 6585 -643 -4312 1204
3214 1204 -818 1828 2671 -619 -7761 -8561 -13334 -12925 -6350 -1294 5774 6325 -460 -6877 -4155 -2857
3198 -2857 -4918 227 5650 3648 5050 8992 10776 10900 6780 3687 -3657 -4703 3820 9389 5428
3183 5428 3102 4961 9207 11093 13823 12612 6844 1216 -1512 790 -1868 -5304 -258 528 -7965
3168 -7965 -10560 -8101 -9734 -4378 -3344 -6124 -828 6035 8633 4560 7121 11140 4345 -314 6817
3153 6817 3059 3034 5227 2110 -6264 -3337 6357 11740 4126 3812 11138 17221 18601 17411 12969 4896
3137 4896 -3229 -2825 3271 10314 10981 5807 293 1523 -907 -2862 2164 2149 -2317 -4790 -8027 -8764
3121 -8764 -5408 335 5930 8384 6111 1888 -4784 -606 -1415 -6717 -222 -341 -7342 -8556 -2545
3106 -2545 2545 2350 -1470 -2407 4737 5762 9898 14639 11809 2560 897 5083 8363 -2407 -8471
3091 -8471 -5135 605 4354 4854 -1357 -13593 -23109 -19758 -20129 -20055 -11840 -5818 -6452 -5243 -559 7495
3075 7495 4482 -1128 -4538 -7278 -4423 -2133 -9721 -10109 -880 -1635 1384 -1311 -355 2159 98 692
3059 692 -1649 -6874 -5050 -3781 -3257 4310 2663 1048 232 -2496 -4391 -9687 -14681 -18336 -22275 -18391
3043 -18391 -13379 -6055 -1432 -1551 5503 8763 9774 8815 9026 5790 8209 5735 1187 2308 -2579
3028 -2579 -4045 -776 7845 2606 71 4634 1852 2572 2876 400 131 2764 6005 5808 4872 2762
3012 2762 1305 4726 4795 3265 1033 1591 8581 9420 11366 6249 -31 45 820 978 3206 2734 -104
2995 -104 -337 -832 -519 3275 7657 12543 12593 4845 355 -1027 2302 4545 1089 1354 -546 -3845 -1160
2978 -1160 -2005 3279 1961 -4151 -344 -4101 -6221 -2567 -3935 -855 1337 4352 5415 11717 13622
2963 13622 8884 -20 -735 2560 7099 4931 6156 8035 5345 -1656 -3164 -4211 -1416 -6068 -8242
2948 -8242 -5684 -3561 -5643 -2881 -1237 -4503 -3878 1518 -314 -991 -4402 809 -807 -5183 -4481 2228
2932 2228 895 -3252 4225 9440 8170 2127 -3412 -7153 -6499 886 3379 4442 8287 11513 1242
2917 1242 -7310 -5164 -4033 -3190 4336 10480 16290 4478 -2861 -3026 -1542 -6310 -6198 -3343 -7092
2902 -7092 -4712 5153 6169 7658 6805 -149 -808 -724 -653 -3127 -4 953 -7345 -9088 -4530 6072
2886 6072 7866 7948 5918 6690 1549 2444 9544 8964 3380 2203 1261 56 -4074 -6224 -2546 -4148
2870 -4148 -7108 -6042 2108 6161 2590 9737 12775 11188 5809 -3581 -14586 -14482 -12556 -15810 -16785
2855 -16785 -17395 -6538 1102 10887 14214 8940 2104 -721 622 -4908 -5190 -1162 8838 13658 16388
2840 16388 17262 9725 1003 -7768 -9203 -6796 -3960 551 2117 2080 -2019 -7919 -12002 -3991 -177
2825 -177 3060 3102 3365 5716 8645 8278 3694 4127 -2567 -4624 90 4722 5041 1068 5500 5808 5250
2808 5250 -413 -3631 -5277 -4282 -3482 -570 -2023 -2530 630 5463 8235 6309 2851 2950 -3884 -6117
2792 -6117 -5524 3271 9597 15064 14063 14586 11911 4706 -33 -2597 -2548 1716 -2987 -6473 -1129 499
2776 499 -1261 -5795 -3252 -4164 -5259 -1250 3665 6119 2581 3475 5381 2701 -2964 -230 -495 -1834
2760 -1834 1834 1096 4465 3724 4226 3421 679 1132 4921 9470 9907 3108 -5349 -7020 -13186 -6243
2744 -6243 -1609 4985 9145 8333 11199 16057 14827 6504 2102 4100 801 2188 4525 1517 -1270
2729 -1270 3008 -277 -3089 -1126 5070 5988 2482 -650 -2957 -12123 -11178 -6526 3486 3407 562 -3764
2713 -3764 -813 -509 -3606 -5304 -6252 -1354 3132 8279 3702 -4536 -10104 -1039 5408 3108 4681
2698 4681 3780 -3931 -8016 -6853 -5739 892 5097 4974 7864 7904 10854 6603 7820 10037 9990 7185
2682 7185 6437 -2468 -7900 -14071 -10453 1269 6474 1990 -1691 1503 7791 9481 9544 8456 5651
2667 5651 4922 7046 5221 6393 8442 6750 2979 1905 -687 -11126 -12345 -3188 7327 6078 1244
2652 1244 -1673 -4668 -5788 -7203 -3280 -4469 -8871 -4823 -1934 2281 -282 -6537 -5648 -4613 -831
2637 -831 2226 2246 5851 1795 -2006 -2792 -2087 -10191 -8541 -7468 -6700 -1867 2830 1453 3505 2546 -4847
2620 -4847 -7662 -512 1024 6462 7771 7133 2758 1842 -5808 -3350 -2252 6888 11553 9053 8900 7057
2604 7057 3843 -5376 -10171 -7807 4534 10657 5186 -8456 -7661 -3720 -545 4514 3070 1826 8405
2589 8405 7230 9269 10342 7968 4783 4299 -2736 -6075 -4669 -831 4634 927 2966 3889 1520
2574 1520 -2473 -6483 -4549 -3910 49 -4618 -12151 -16879 -14877 -6952 -1206 436 2391 -35 -2660
2559 -2660 1203 6286 12711 12326 13085 9805 9494 10586 3368 5215 9079 7450 -1439 -7294 -6694 1001
2543 1001 7397 9841 9275 4903 10497 13604 9010 4117 10518 17338 9706 3271 -180 3473 3156
2528 3156 -2080 -2619 -4752 -5263 -5143 -6536 -4857 -97 6804 10244 9282 9783 3574 -5161 -1476 -1146
2512 -1146 -2519 2644 3067 5305 1344 -634 -3185 -33 6020 6494 2107 1434 -463 -6062 -14233 -13502
2496 -13502 -4762 2262 5198 8686 18646 24235 21271 9285 -634 1706 8481 11419 12102 18192 21718
2481 21718 15510 12344 15941 11977 13225 10409 5750 8851 8610 9677 -275 -6673 -5926 -2862 1021
2466 1021 6614 5891 5920 10814 5228 -84 -6451 -8712 -12248 -6270 -4186 5570 8367 7827 4632 30
2450 30 -3742 -3425 1585 1694 3093 5821 2552 1127 -7276 -3946 2370 235 2851 1128 6154 8334
2434 8334 6978 511 -2072 3607 2692 -2125 -3209 4499 6434 5305 14119 16485 19376 16467 13161
2419 13161 6414 8349 8817 3966 5337 4325 2468 -5887 -11810 -9343 -3352 -7291 -8747 -10602 -13807
2404 -13807 -7071 2414 4884 5404 -2321 -5324 -504 4575 -324 -3716 396 5589 9069 5645 12635
2389 12635 17199 13998 13047 15572 21935 17322 9038 10306 12900 7594 11975 10408 12145 12943 6964
2374 6964 -1975 417 -274 28 -55 4529 8716 6272 8096 10119 -425 1971 4746 4412 3030 6745
2358 6745 8165 2982 -71 5174 9076 1181 -5670 -7165 -3233 -2415 3898 11762 16008 12225 10782
2343 10782 15871 12120 3591 3576 -2357 628 5878 8459 10181 7374 10558 12738 10830 2347 -4764
2328 -4764 2054 1859 281 -3009 -1261 -2997 -6188 -8461 -6027 1710 9118 18799 21352 16946 10723
2313 10723 3041 37 -4889 -3326 3214 6082 -557 -5702 -2423 -2605 681 3789 -1250 -5809 -6544
2298 -6544 -2784 2054 10980 4726 -7227 -15816 -5282 8096 8083 2142 -4793 -9777 667 5594
2284 5594 3146 -1762 -4178 -6558 -7357 -6712 -4776 -9114 -11387 -12895 -6983 -2927 -249 -5231 416
2269 416 5286 1508 -1773 -29 7698 8560 5792 -5619 -5386 -3003 -4041 2211 4517 2802 2902 -3937
2253 -3937 -6156 -6555 -3615 -855 3812 11383 11343 2715 1092 -7304 -5986 -4714 -2739 -1155 6464 12724
2237 12724 16125 14524 4946 -3150 -6074 -599 12314 20246 20322 18636 12743 10291 8797 7088 6767
2222 6767 4177 -4511 -8034 -8248 -2809 194 2597 2396 7008 6754 1091 -5255 -3300 -3039 -7136 -8456
2206 -8456 324 6631 8166 3392 -107 -4077 -9993 -7565 -366 4575 -173 4991 11272 17130 15697
2191 15697 10607 6306 6207 192 -3242 -2203 -2239 -5550 -2168 1951 8257 8842 13217 12901 10885 10677
2175 10677 8633 4373 2025 -1162 -1038 1392 289 -8719 -11075 -8803 -103 1369 -1469 5114 3990
2160 3990 -412 -6344 -5548 -2910 -5864 -6128 -7626 -3678 -542 43 3316 330 1932 -2250 -4799 -6076
2144 -6076 -2227 -3955 -5325 299 1928 -1031 -2844 -2587 -3749 -8156 -6408 -7066 -5145 -3109 -747
2129 -747 -3903 -677 3638 -5418 -7273 -6147 -402 9601 12556 13060 13800 7435 2107 -1393 -7078
2114 -7078 -6791 -328 1908 6445 8022 5891 9410 10994 7025 1152 3293 5951 6580 5322 7924
2099 7924 4761 -83 1486 -2412 -2073 2965 6142 11561 11573 9321 6939 -632 -2168 -3980 442 -5356
2083 -5356 -8476 -2184 64 2596 5479 6328 12778 16937 15229 15514 13750 9294 3835 16 -3752
2068 -3752 -3519 -833 5057 7087 8515 8569 6202 -947 -591 3231 4223 3354 -3589 -2719 -3822 -3383 602
2051 602 1495 -118 6125 4222 5100 9696 3405 -4765 -502 1623 1267 -805 -283 78 -2406 -6963
2035 -6963 -6162 -1537 257 4272 2030 1317 2960 5184 6679 9977 15444 15317 16466 14626 11740 8578
2019 8578 10412 9083 4391 2733 4613 1606 1375 3191 2088 -2090 -4314 -1301 -1864 -1572 -4323 -4080
2003 -4080 -5649 -1129 -148 -5672 -2466 1284 -2393 -747 6976 7344 1732 86 157 -6299 -6324 -7359
1987 -7359 -8364 -1676 2345 1381 -1990 -4499 187 4584 1887 -1481 1054 1047 -5858 -3508 -1770 -2229
1971 -2229 4107 -2583 -8406 -10385 -10988 -8302 -8409 -13300 -17603 -16329 -9392 -528 915 3700 919
1956 919 2826 3326 -578 -3103 -86 3932 4307 5001 1563 -3321 -3323 -31 3645 7327 11135 9445 4841
1939 4841 1638 -4085 -5141 -917 6065 -5235 -12054 -7756 -10737 -10256 -3252 2294 4987 -635 2471
1924 2471 3812 4373 3460 1318 -995 -9137 -10204 -1323 -311 2712 5299 4231 2244 1632 -3286 -2426
1908 -2426 -5441 -3618 1130 -1604 1426 9932 9067 5343 101 -2457 -5345 58 1753 5522 8421
1893 8421 9351 9945 6287 1181 -5736 -4072 719 -3567 -26 2431 3765 4442 1659 3779 4906 3184
1877 3184 3086 8234 2362 -6287 -7248 -1617 3753 5229 4495 8363 16340 22012 20010 8424 -6135
1862 -6135 -23049 -20491 -5916 6209 12104 13043 17333 16986 16012 16625 4965 -2998 -10748 -16248 -5333
1847 -5333 9957 11895 12168 12956 9601 5277 4499 2434 743 -845 -4028 -1745 4483 7822 8254 2639
1831 2639 -6357 -4546 1866 5348 8941 10574 -1935 -12853 -9012 1059 10261 15210 13200 9183
1817 9183 9288 14004 22651 20855 387 -15480 -20088 -9419 8169 14413 10129 14559 11031 8685
1803 8685 5389 3625 -2894 -4936 -6567 629 4919 5484 4686 -6705 -2560 9895 10607 9162 6285
1788 6285 1251 2607 -3778 -3632 -7818 -9502 -2146 -1719 -2594 2614 9639 11199 12651 6394 147 -3468
1772 -3468 -5500 -5168 -3015 773 4675 -211 308 442 3060 7422 9830 12876 15706 11023 3677 1084
1756 1084 5648 11045 12396 7852 2132 -2185 -5675 -6396 -1399 655 759 -6602 -5469 -154 1382
1741 1382 -5618 -7632 -5512 622 4573 -942 -5771 -1503 2481 7411 1507 3555 2621 7882 12385
1726 12385 12700 9956 4785 2014 6419 3046 -36 1762 9002 12413 6199 108 6913 12797 7207
1711 7207 6366 3107 4840 14902 18782 14083 7456 7263 9422 7149 7998 11466 4581 680 -2878
1696 -2878 -7590 1000 -1963 -9227 -2784 1000 2882 5529 11048 7978 -923 -5933 -8916 -4292 -7738
1681 -7738 -10158 -12579 -9991 -1280 6027 10055 10416 10408 14063 11966 9793 4732 771 2114 105 -5150
1665 -5150 -5838 -5490 2710 7216 1025 -3153 -2702 357 -1693 -4378 -4308 -785 4034 4667 525 -3373
1649 -3373 -2627 2609 8877 14424 6302 3229 37 3191 6163 8554 12762 9929 4341 -816 -2228
1634 -2228 -5005 -3600 2018 7970 11373 9919 3791 -3442 -3101 -4038 -4528 -5057 -1144 1386 -697 -2836
1618 -2836 -5816 1123 4518 7085 4590 10961 10858 6894 4987 2976 4995 9747 9896 5451 5336 3788
1602 3788 1560 1108 1040 -4266 -2594 -4005 -5972 -5169 -2142 -3900 -5619 -2289 -1013 3318 4714 374
1586 374 3100 -101 -3981 -1258 -2442 1549 5702 6994 9943 8583 -309 4445 3037 2162 798
1571 798 3533 1782 2192 5949 2098 4296 -958 -3173 -674 1487 4676 7302 4888 6743 3111
1556 3111 -1284 1089 4754 4122 7548 14255 15751 12039 7163 9324 8404 7749 2685 1583 2059 5476
1540 5476 7219 2993 -2193 -2811 -1293 1208 2363 1777 -1122 -6110 -11885 -12914 -125 6208 5110
1525 5110 60 1943 7193 6048 9450 12251 10057 9257 10415 7349 9994 12571 7841 2144 2617
1510 2617 1832 -1168 -2416 -396 -945 1891 3588 -337 -3195 -1948 -920 -1108 -2172 1955 7733 14075
1494 14075 6687 -3357 3832 6656 10673 12562 11728 10082 6804 1125 296 -300 1971 -435 -6987
1479 -6987 -7957 -8163 -2427 775 6547 14111 19359 15766 7500 5475 4272 3301 -301 1742 6459 2913
1463 2913 657 3828 4580 2308 -853 2866 9740 7894 3871 5148 4565 1249 355 4943 4343 5813
1447 5813 9014 8425 10489 9486 5124 3708 -1049 -5182 -9127 -4424 2707 200 -2164 -2804 -6310
1432 -6310 -15685 -12867 -12952 -8644 -5736 3492 8450 7681 5090 -4140 -8418 -7464 -3911 -8828 -417 4349
1416 4349 -2925 -8531 -3183 1175 -4315 -5062 -1247 -747 2347 8228 8841 7145 3063 2309 -1029 2408
1400 2408 10182 6252 38 2872 1774 -6058 -10954 -12283 -7711 -11876 -15849 -14754 -16639 -20957 -13258
1385 -13258 -9594 -3866 -1400 1176 -2266 -4575 2391 8696 -1222 -5191 -5704 -914 4936 3468 -3806
1370 -3806 -6694 -11005 -4257 -3557 -7547 -5874 -4485 -6478 -8010 -1220 -4380 -1046 3312 -2011 2287
1355 2287 12750 18194 20657 10411 5214 6814 10514 13071 10223 6940 288 1495 1666 1640 -3052
1340 -3052 -2106 1391 -2015 570 2409 1577 -3682 -1744 8343 11796 4798 -486 3601 6391 -2216
1325 -2216 -6288 -1465 4264 4438 6657 12635 12589 10942 5905 -3273 -7837 -2279 5047 5360 4096 2366
1309 2366 7359 9541 8223 5848 7022 11977 7759 1250 -4805 -826 12955 13823 13063 10924 9267
1294 9267 4407 -186 -3632 -777 -8799 -18707 -18556 -12634 -2001 5366 12828 10940 663 -6386 -10021
1279 -10021 -5077 -6378 -6178 -1568 580 -4362 -7126 -6314 2354 8765 7936 8406 6956 7176 13813 12577
1263 12577 6727 10906 5315 817 -2356 -9459 -10895 -2871 2340 1015 -4820 -7905 -5452 -6722 -6837
1248 -6837 -5562 -1998 2379 3694 -3056 -2911 -10411 -10101 -6350 -7533 -6948 -10729 -8282 -1787 1534 2495
1232 2495 -3475 -10146 -7466 -1417 205 3926 10454 16207 7100 2315 3161 4279 5746 5611 5834 6982
1216 6982 4607 8342 7548 3403 1126 1204 6664 8086 3538 336 -3858 -2267 -295 -2239 -5215 -298
1200 -298 6083 11653 9122 6093 6309 7948 5711 5177 4236 2840 520 2056 5148 10394 7772 3826
1184 3826 1851 7802 6537 5184 3957 -1449 -3926 3513 349 -3689 -2717 -760 -5675 -6630 -3659
1169 -3659 561 2081 -986 -5155 -1647 3825 4727 4234 -1034 -2344 -3663 -1952 969 -9232 -16286
1154 -16286 -13730 -5100 878 2030 1340 216 3074 8144 10779 6771 5652 665 -5627 -4355 -2371
1139 -2371 -2384 -1023 -2628 -4409 -4179 -3526 -3135 -2436 -12720 -14912 -6931 79 741 -5102 -9175 -9360 -6448
1122 -6448 -6106 -1731 -2904 -3875 -1917 -5537 -3162 2434 2241 1575 1803 102 -3842 -1426 4123 3468
1106 3468 7428 12490 8374 -3059 -5862 -1627 4014 9027 4844 -3321 -3115 -2488 -1874 2808 -98
1091 -98 -7611 -7307 -8725 -11454 -10986 -5099 -3057 1223 -4373 -6124 -5985 -8684 -10314 -8767 -8372 2001
1075 2001 4950 6084 2402 8026 10253 10998 7772 8341 63 -4555 -4344 -7673 -7542 1971 816 2887
1059 2887 6746 9970 9177 5297 397 4482 6160 2752 4417 5979 5041 8201 7860 2619 2964 -2219
1043 -2219 -5296 -4217 -4692 -3290 2355 987 7888 9638 1450 3020 2680 -782 -1004 2355 -8739
1028 -8739 -13588 -5280 1180 2579 1371 6535 1986 -87 -642 -4145 -8122 -562 9670 14158 7417
1013 7417 5380 3973 784 -4430 -6028 -2597 -516 -4166 -7970 -7811 -4333 1604 1397 1590 2383 -3327
997 -3327 -6858 -10604 -7890 -2574 -289 851 -1753 -3553 75 -149 7509 10546 -1038 -13778 -15568
982 -15568 -5744 -1363 2342 -2238 -2209 4247 -745 127 1198 -1553 32 4074 7616 9315 1726 -2684
966 -2684 -5192 -7171 -185 6119 8591 4836 -5457 -9504 -8331 -8510 -7747 -3082 2954 7084 6657 -3883
950 -3883 -9703 -10797 -430 3635 2109 6954 6933 3591 4452 2612 -3508 -10028 -11114 -14293 -19799 -14652
934 -14652 -5955 -3340 3901 2904 3910 10081 12285 5211 73 2266 -2014 -4115 -7602 -2226 -904
919 -904 -651 4959 4571 -1061 -3936 -3919 -2521 -5978 -13685 -15435 -9349 325 4953 14473 11065 -159
903 -159 -6360 -8209 -11523 -5645 -7338 -12420 -10849 -1516 8246 7495 2728 1749 7906 10618 8602 5976
887 5976 7480 8476 5568 -170 -1357 1405 5356 2418 -6797 -11198 -12697 -6991 1474 6034 2538
872 2538 466 -4996 -5539 -10616 -12777 -6876 -3924 -4004 -5641 -6246 1764 1689 -4169 -3883 -4945 -8017 -7837
855 -7837 -11931 -11890 -2230 1645 -4021 -4350 4987 8138 2882 -1017 -4947 -8868 -7001 -3974 -3813 -8700
839 -8700 -6431 3130 10506 11254 10708 12917 16266 17154 8554 2577 -2992 -286 3670 3690 189 7345
823 7345 3451 -65 5032 6069 6257 3648 -4368 -9363 -226 3456 -3177 -5432 -1290 -2116 295 6
807 6 -169 4614 10372 13683 8404 9042 9679 4512 5452 8496 14926 11244 3400 -1090 -2019 -6706 -2257
790 -2257 4907 -609 -3253 -1117 4252 7645 8297 9292 2952 2985 7912 13123 9049 4610 9287 15129
774 15129 7928 555 -31 -4612 -5744 -4013 936 1853 4732 2810 -2048 381 6863 -333 -93 9711
758 9711 13554 12472 6914 5515 -2330 2261 4484 -2506 -5185 -2828 -2737 -4732 -5876 -994 923 3555
742 3555 -818 -6807 -10504 -12790 -12020 -2266 -779 3288 5193 2119 407 -2475 -2850 2814 8483 6366
726 6366 3126 7055 4496 5540 7543 9528 11015 5661 327 -737 -2364 -1683 -6605 -9057 -1864
711 -1864 4001 -648 -1554 4390 7095 2990 -3214 -3837 -566 751 4668 3292 3648 9330 5086 4932
695 4932 8917 9273 7848 3366 3646 4774 3116 -1253 -2401 3357 8412 9521 6623 -3006 -3344 -2644
679 -2644 -3522 2295 7570 8968 7049 3643 2154 3712 1819 13883 12568 238 -8036 -5323 -3900
664 -3900 -1300 7070 7738 11179 6322 479 2962 4785 3338 -900 -8031 -2036 4258 5583 6483 3091
648 3091 3985 3230 -1365 -6476 -3353 5813 8276 11458 11571 13421 7770 476 1636 5046 4419 5928
632 5928 4869 3118 644 844 2218 3665 5046 6381 5093 2367 9860 13008 12634 8689 5963 -447
616 -447 -4309 -969 692 883 5991 4638 -149 -3002 3749 1566 -219 -630 -3963 -1864 -1285 -4697
600 -4697 -4564 -2252 -1611 392 -534 1465 4242 6871 3071 -4208 -551 -2112 -1067 3567 -4836 -9009
584 -9009 -103 9078 4252 2874 877 -2528 -324 3127 4934 1497 -1234 -2964 2575 2863 -3191
569 -3191 -993 7227 8533 2761 -255 -1099 -10133 -9611 -13076 -13116 -10448 -10113 -6403 -2060 -660 -1293 4116
552 4116 2602 -3931 -8813 -5957 -612 3044 8955 5788 9062 14481 19089 12321 9647 326 -2768
537 -2768 2929 826 -2642 -2942 -2729 6129 7139 2235 3839 6574 12636 15301 9216 2782 3765 5478
521 5478 2586 5608 1551 -2631 1502 -340 206 -7738 -7822 -210 63 -1565 -2603 -6700 -7343 -8358
505 -8358 -9234 -4529 -1052 -715 2532 6730 4546 -1185 452 9345 10724 6808 3930 5852 10747 12179
489 12179 4457 -3512 -2459 1175 4773 5150 5959 9252 6772 3781 1092 -5908 -9384 -8627 -16305 -12700
473 -12700 -3676 5475 11435 8800 3833 -108 -4570 -9274 -8351 703 1695 5661 8685 6078 4529
458 4529 4217 -705 2523 4643 -2507 -6313 -1708 1836 1813 3083 8283 9704 8056 7097 6457 5884 2908
441 2908 -755 -4556 -4387 -9016 -6972 3631 8244 12374 12649 14124 9732 7468 3993 461 -24 3519
425 3519 3801 -4515 -10330 -12200 -9874 -8939 -2781 4495 3772 -2750 -2766 2244 4608 4768 816 6023 4724
408 4724 2513 -5281 -4446 -3574 -6468 -15020 -22747 -11868 -690 4597 4263 -837 -2283 3683 1661
393 1661 -1712 -1699 -3203 92 121 547 3884 7709 11936 6426 7705 7662 7378 4533 4598 8342 3617 1462
375 1462 2861 7476 7346 1684 478 2578 3730 8476 5467 564 981 1989 -2623 -5827 -2484 -174
359 -174 -5595 -10801 -3243 7312 10608 1612 -60 -281 2607 4904 6701 10604 9060 367 -5398
344 -5398 -7402 -3017 -769 -5845 -7790 179 9087 11118 8832 8525 -4164 -1703 2010 2545 756
329 756 -1392 3342 5662 2629 -3000 -3426 -3771 -4140 1107 6344 4419 4620 5303 -961 943 -3016 -2128
312 -2128 1535 -2088 -3253 5013 7733 3193 -1132 151 1625 4077 3797 -615 3177 6617 6325 5904
296 5904 7625 6839 13066 10999 3686 -8231 -6520 -4748 595 8952 10926 6776 9989 14229 11939
281 11939 6663 7451 11608 12036 8975 4181 5439 4676 2238 -1661 -750 5366 1222 2494 -1055 -5036
265 -5036 -7960 -8250 -125 736 -147 -1047 29 -2588 -5167 -5677 -2117 -2039 4785 5266 272 -3107 -2923
248 -2923 2408 1280 -955 1229 3976 -2625 -8332 -7744 -2231 1671 157 -587 2087 4194 4828 -1642
232 -1642 -1831 -7612 -10371 -3075 296 -683 -3057 -3872 -850 -188 -3189 -3701 -4618 -6045 -3021 1679 -3819
215 -3819 -3858 -3229 -2617 -3540 -1561 -4335 -6340 -7289 -5967 -4304 -3745 -6611 -6210 -2485 -940 698 -2298
198 -2298 -6572 -8049 -10265 -10197 -8741 -4023 -2842 -1013 -1031 4785 6772 5090 1622 2003 2379 2050 -850
181 -850 3775 2250 -3589 -7065 -6643 -5360 -9050 -11819 -9212 -5050 -8367 -8664 -5752 -6805 -5799 -1657
165 -1657 4417 3604 1 -2275 -2145 -1871 4304 3581 4068 8868 7447 6976 5553 10030 5829 3605 2254
148 2254 3752 8676 7066 3682 -2909 -6095 -6125 -6040 -702 3073 -1930 172 740 -2637 -3119 -2711 -5458
131 -5458 -2386 4893 4943 4779 -645 -2568 1935 2287 -710 -3713 -5240 887 3952 2954 6397 12410
115 12410 8716 3636 2760 1934 -1321 -7944 -13357 -9407 -1829 3737 8008 9395 7362 8260 8056 6937
99 6937 8357 3325 -4323 -6992 -7677 -7418 -1247 -940 72 1843 1747 2666 5504 5494 5248 7713 6077 -107
81 -107 -3710 -1384 416 -488 -2146 5894 11056 6373 2902 3453 5474 3649 985 2727 5180 6221
65 6221 4393 3635 5341 6250 5338 1126 -4235 -6815 -6710 -5453 401 4938 7633 5989 592 493 -1586
48 -1586 -2020 -1297 700 -1136 2278 6382 2526 -2373 -8624 -621 73 -3619 -2694 -4067 -4747 -2749 -3070
31 -3070 -154 -1196 -428 -1255 348 1585 1959 2501 1978 -1180 -2601 -2947 -3041 -944 -440 -2395 -1516 -6439
13 -6439 -3031 -2497 -2426 -24 307 -1431 1386 1171 -1102 -1161 -7542 -10849 -4996
0 -4996
$$ Imaginary data points
##PAGE= N=2
##DATA TABLE= (X++(I..I)), XYDATA
32767 55965 54635 56850 58116 57261 56472 57597 54862 59507 63937 67916 66327 65426 62158 65209 67062
32752 67062 66941 66022 71630 69660 67784 72085 74284 75972 75868 75400 78907 82378 82294 81448 80141 84087
32736 84087 83432 82182 78300 79924 77194 75221 82537 91574 96882 93676 89801 91728 94075 89363 84675
32721 84675 87265 84820 82012 82101 85533 85927 87210 90935 91241 92097 98570 100877 100532 97638 99817 99144
32705 99144 96587 98325 98102 100541 106540 110094 106132 107734 107473 111921 111266 110567 114715 119844 127099
32690 127099 126934 123962 118874 118594 122449 126277 128453 123312 120155 115782 114773 118336 121730 124330 125892
32675 125892 123929 127838 125457 126458 127769 131622 129804 124623 123145 125820 133691 133709 133900 134237 136281
32660 136281 139062 143444 143370 142513 139756 137633 135448 136225 137081 139588 141111 144371 148889 154713 157909
32645 157909 153140 146129 146558 149640 151614 151461 147329 147605 151175 152758 150635 151800 155496 154267 148813
32630 148813 147393 148158 156481 161945 163631 163970 162705 162965 161390 159382 160877 163142 165538 165287 171845
32615 171845 179574 177148 176238 175048 173814 168166 171641 176946 174256 171022 172901 174143 174821 175335 177645
32600 177645 175938 175768 178011 185165 184660 180776 183738 183910 181829 180285 182196 191939 188609 182658 183892
32585 183892 177895 172909 174292 178404 184218 188516 193668 195675 197212 194730 196342 197410 190526 183917
32571 183917 184870 195912 200620 205404 201634 200227 198576 195954 195539 195155 193519 193569 194945 200223 202403
32556 202403 203581 203319 202768 202397 207697 207568 207705 205674 205185 208505 210354 203888 204080 201736 196930 200607
32540 200607 204579 207507 207364 210241 215104 216662 219416 217665 220682 220564 218817 219348 213317 214806 214402
32525 214402 214965 213010 211816 215364 216031 219264 225117 227617 228470 230458 233820 229226 218449 220068 220948
32510 220948 219200 215333 212173 214465 220246 226813 234342 238435 241729 245790 244221 239500 235247 232206
32496 232206 232046 230384 228325 231895 234990 233952 235653 242405 238970 237394 240112 239904 240883 242799 242457
32481 242457 240553 240263 241071 246675 249092 249574 246236 243796 236152 233158 236033 244004 250050 248227 247469
32466 247469 248061 245265 242037 243996 246724 244621 235264 231033 234118 241885 249424 254194 253650 252321 251432
32451 251432 259559 265418 262595 260231 257226 260016 264459 268174 273041 272862 269505 265828 262284 261950 266333
32436 266333 256957 252662 252665 253227 251776 251142 248534 253696 257213 258265 256776 257589 255286 255363 255865 259945
32420 259945 261489 261790 259958 265317 262681 260792 259249 262152 263574 261658 259783 260671 261408 258458 255246
32405 255246 260681 260318 257353 258481 257894 257462 263417 264034 260149 262305 268420 270131 264969 266363 267240
32390 267240 265910 263066 262266 263110 256467 262279 269829 267025 268496 266000 264375 269088 267296 272261 270482
32375 270482 276029 279088 270713 264561 270003 276997 278012 283671 282488 279201 278517 272955 268735 273806
32361 273806 283060 279759 270320 272240 274144 275441 282572 280772 280391 277142 271056 266953 265187 268593
32347 268593 268804 271622 276315 279926 277448 281973 277188 275153 274675 270012 272598 275526 271186 276268 280109
32332 280109 280647 275210 277711 285099 287341 284827 283023 281169 273817 268123 272071 281833 285236 283940
32318 283940 283613 290423 290793 287465 281927 276072 281537 282403 286286 288868 293647 293091 296821 297579 299424
32303 299424 293130 293237 288078 284042 288165 283113 279340 282600 293111 290901 285097 279797 280257 277204
32289 277204 282727 284983 288182 290015 301089 302728 295651 289523 293077 293443 291718 288839 282200 276524
32275 276524 280297 287094 291398 295823 293876 294971 299986 297227 292014 294821 291714 283733 290317 288905
32261 288905 281879 287038 295605 298088 299454 296869 293471 295045 299323 295487 289100 287768 286849 284617
32247 284617 284207 288655 297857 294261 290017 292891 296073 296527 305874 304607 298801 295635 295309 295743 292106
32232 292106 296543 300757 297118 286375 283847 291895 290776 290598 294352 306053 307749 304259 299052 297374
32218 297374 302393 303033 301748 302311 305489 309433 306427 300028 302499 303486 303569 299473 299589 293454 290631 295641
32202 295641 295554 296244 301876 304300 306848 306089 297462 297288 299875 291859 293033 297004 305412 299363 300331 299249
32186 299249 302072 303292 300985 304313 309586 303506 295820 294370 302717 305573 302933 303500 302123 301231 303236
32171 303236 307978 305959 304071 305948 311647 304561 300782 293078 294929 302287 307128 306228 305638 307905 307583
32156 307583 307333 309493 308661 300705 296407 295143 291539 294366 301555 306827 313869 311894 305579 308811 306044
32141 306044 297914 291647 299696 308051 304739 299224 299742 299302 302101 304923 303395 308283 308112 304743 300356
32126 300356 308874 308721 303623 310082 313509 314776 306245 304467 308345 301180 304361 305889 304897 304406 303848
32111 303848 300598 301252 299838 297596 297384 296642 290989 297705 289891 286624 293277 294913 291675 291510 300125
32096 300125 303605 297519 293204 293588 293073 296949 301035 308258 301717 292749 297586 300943 306197 297867 294444
32081 294444 298609 303425 304623 307881 312858 317009 317280 310385 311056 309452 306949 303611 299964 295826 297993
32066 297993 299547 300907 297698 298557 304490 308004 308161 307016 302085 305736 306608 303596 301086 307133 305461
32051 305461 294879 295324 296927 302780 311778 309444 300165 300011 309719 313453 304386 299676 299648 298483 299923
32036 299923 307668 312874 315436 316100 316938 309393 309236 318244 316966 320455 324123 323831 324438 320527 312917
32021 312917 310242 312296 307858 313500 316471 315429 319129 314379 311276 312373 317719 315546 312040 315319
32007 315319 314563 317797 321580 320401 315884 312673 309573 307484 308666 310300 311536 305835 305435 302527 302032
31992 302032 300334 297252 301542 304408 302727 305304 306523 300389 292406 296421 299285 304617 300649 300205
31978 300205 298667 288657 289748 294994 299817 297627 298393 303042 303772 304846 307854 305733 312210 310326
31964 310326 304863 310059 311693 311701 303448 303291 302727 304750 311157 317793 312411 314509 312292 304043 301738
31949 301738 307522 308309 309235 306288 297990 296643 304978 310446 309778 305959 306618 311373 312348 310261 313224
31934 313224 309161 302694 305346 310796 305060 295754 294354 295779 305290 312953 312956 311433 309977 305207 307552
31919 307552 310836 313270 314714 315249 312242 306544 305398 311036 312799 314195 316425 312141 309581 308329
31905 308329 305486 308727 319185 317411 308561 306652 308140 306418 307246 304682 311231 316107 317261 315258
31891 315258 313682 318989 316206 307708 310026 311724 310379 305558 305968 308796 314894 309027 305408 305009 304495
31876 304495 305778 307895 307994 310469 314611 318716 319162 321056 317169 309783 311857 309881 299586 298773 304924
31861 304924 306713 313645 315099 313844 311986 314126 316346 316519 308125 306277 307470 312945 313539 315072 315772
31846 315772 315034 313267 311183 311545 310743 308431 306634 306482 306055 305765 304760 303912 307786 307444 312168 307768
31830 307768 309136 310109 311003 318489 321072 320324 322454 322271 319213 317671 309144 305656 308904 311720 312888
31815 312888 313833 324688 326287 310350 307626 310599 312406 307928 311564 311718 308129 301715 301096 298520
31801 298520 301288 300163 300574 306795 304392 307304 310423 319932 325563 328646 331812 325357 324177 321270
31787 321270 318853 320795 318656 316616 310816 307606 311017 312736 314734 317609 318785 315719 313918 315658
31773 315658 311236 313553 316811 320715 320111 322457 320871 322492 322522 320181 318827 314024 315120 318378 317714
31758 317714 316864 313305 308415 306077 307674 313064 311597 308324 312645 317716 314970 308976 302255 305380
31744 305380 309742 313785 320292 327237 326880 316610 307136 304458 308115 315919 320077 321513 319796 316150
31730 316150 314105 309661 305404 306961 310477 306853 307922 311723 306678 298450 299652 310635 314852 314069
31716 314069 316289 320129 325899 326066 319021 306819 304850 302313 301635 297303 299945 303672 307463 303450
31702 303450 310914 318153 314339 308571 307359 315707 316528 312198 312041 316024 315268 318388 317622 313914 320546
31687 320546 322549 321292 316556 312918 314295 316028 316728 315396 313037 311199 316969 316936 312701 310672 317444
31672 317444 321307 320553 310674 304492 305692 310242 309289 314298 320470 323279 323333 318013 318279 318555 315305 317849
31656 317849 318153 312616 313186 315891 313874 307830 309151 317586 318931 316120 314393 311743 310475 313305 313880
31641 313880 307994 307206 307485 306554 305462 308891 307003 310436 319419 316738 320064 322041 319831 321036 325464
31626 325464 324844 326637 327778 322711 316984 311298 316644 312370 307656 311548 314199 319922 319467 324771 319373
31611 319373 309176 309141 309986 312052 317188 316828 310760 311185 319331 326727 329759 326655 326715 315321 313433
31596 313433 322221 321789 322333 324697 319340 310164 302010 299109 299304 302046 304328 306316 306390 302942 303268 303496
31580 303496 307174 305714 308429 302680 296334 299798 306702 309380 311518 315948 319919 318591 310215 308821
31566 308821 305045 294855 299027 302271 306982 311784 311187 308615 315329 318520 321614 319154 317432 315244
31552 315244 312013 308859 305399 305051 308731 314110 317388 308324 305027 303855 304339 309197 314495 316951 311716
31537 311716 312856 317243 312853 314551 312652 311009 311885 318378 318975 311794 306727 302229 311054 318249 318023
31522 318023 314242 316401 313643 308510 310813 319927 325683 323651 320232 318619 312458 312370 319671 320989 313976
31507 313976 309710 307417 310970 317620 315689 309511 308371 308353 312060 317213 321109 321953 324953 323895 318630
31492 318630 316915 316688 314438 308008 305504 303304 303864 298209 295436 300634 311499 316552 312094 312917 316451
31477 316451 317198 316507 310743 309107 317858 315729 313749 318443 318696 316231 319703 314418 317006 321238 318376
31462 318376 313650 311786 309687 308627 313875 325818 322934 314424 315467 320610 321798 325005 321164 313701
31448 313701 311778 315544 321586 321431 313907 312382 317157 317134 320298 324752 324309 324623 319317 316905 312839
31433 312839 314205 315679 314732 315124 318172 324092 320299 322333 324015 324195 327893 324488 318906 315170 314515
31418 314515 321919 320148 315934 313465 317593 318149 309356 311992 309754 312026 313192 317920 322313 322937 320539
31403 320539 318703 316407 308254 306666 312406 312585 305474 304104 309240 306242 312147 319354 319193 315910 309521
31388 309521 307294 312606 320520 328983 323392 323952 326584 320084 315326 314749 311898 315748 316955 322100 318629
31373 318629 315455 316543 313275 314130 320009 320276 323098 322995 324599 314900 313568 316897 312371 315253 319409
31358 319409 326619 328005 322375 323434 317836 311219 303514 306179 311903 311896 310333 308691 305399 308149 316191
31343 316191 319749 320436 317297 321226 316773 311539 313063 310081 304153 309180 315559 312879 315501 312424
31329 312424 305487 310809 311199 310098 317093 324675 328469 326673 324779 324040 322571 320940 314934 314871 311528
31314 311528 314636 320318 322765 314497 313638 322265 323501 320836 319135 315210 317814 318161 316509 316582 322018
31299 322018 321073 318466 312834 310905 310698 316734 313596 315561 311206 309832 307819 307816 307921 311834 312318 311410
31283 311410 310249 315412 312123 309064 309378 315795 318145 317012 319213 314563 305357 304249 306621 310681
31269 310681 316785 317298 315291 311279 314854 311202 307888 311586 314365 321410 319174 315778 317380 324408
31255 324408 319255 310075 308807 313978 318550 315389 318468 316692 320954 323535 321784 323982 315433 309598
31241 309598 310659 312073 316250 316095 320325 324016 316729 308445 314077 323983 326689 325819 327809 326088 317427
31226 317427 315033 317823 324249 330305 329993 329198 327421 323425 320862 320824 326143 329638 325172 315140 314547
$$ [...]
##END NTUPLES=NMR SPECTRUM
##END=
