##TITLE=Analysis number 326124
Compound Code cc 59616
Book Reference 521/15
Project Code adrs
Chemist Name evam
##JCAMPDX= 6.0         $$ Bruker NMR JCAMP-DX V2.0
##DATA TYPE= NMR SPECTRUM
##DATA CLASS= NTUPLES
##ORIGIN= Bruker BioSpin GmbH
##OWNER= nmr
$$ XWIN-NMR		Version 3.5
$$ Thu Jan 25 08:35:02 2007 GMT Standard Time (UT+0h)  MAYBRIDGE\nmr@NMR_250MHZ
##.OBSERVE FREQUENCY= 250.131544655141
##.OBSERVE NUCLEUS= ^1H
##.ACQUISITION MODE= SIMULTANEOUS (DQD)
##.ACQUISITION SCHEME= undefined
##.AVERAGES= 16
##.DIGITISER RES= 18
##SPECTROMETER/DATA SYSTEM= dpx250
##.PULSE SEQUENCE= zg30
##.SOLVENT NAME= CDCl3
##.SHIFT REFERENCE= (INTERNAL, CDCl3, 0, 16.522)
##AUDIT TRAIL= $$ (NUMBER, WHEN, WHO, WHERE, WHAT)
$$ ##TITLE= Audit trail, XWIN-NMR		Version 3.5
$$ ##JCAMPDX= 5.01
$$ ##ORIGIN= Bruker BioSpin GmbH
$$ ##OWNER= nmr
$$ C:\u/data/dgb/nmr/ADRS/1790/pdata/1/auditp.txt
$$ ##AUDIT TRAIL=  $$ (NUMBER, WHEN, WHO, WHERE, WHAT)
(   1,<2007-01-25 08:34:42.11 +000>,<MAYBRIDGE\nmr>,<NMR_250MHZ>,
      <created by zg, POWCHK disabled, PULCHK disabled
       configuration hash MD5:
       49 4B E0 1D 92 C2 6B 37 9F E6 65 BC 52 41 86 1D
       data hash MD5: 64K
       54 A8 EC 7F 44 12 B0 7E E1 CC 84 D3 C8 5B 3E D3>)
(   2,<2007-01-25 08:34:54.77 +000>,<MAYBRIDGE\nmr>,<NMR_250MHZ>,
      <Start of raw data processing
       ef LB = 0.3 FT_mod = 6 PKNL = 1 SI = 32K 
       data hash MD5: 32K
       AE 9C 3B 23 9F 3E BB 78 2D 60 54 3F 74 15 27 9B>)
(   3,<2007-01-25 08:34:56.41 +000>,<MAYBRIDGE\nmr>,<NMR_250MHZ>,
      <apk 
       data hash MD5: 32K
       32 A6 14 4D 1E 9A E8 12 B6 16 6D 3F BC AA AE 58>)
(   4,<2007-01-25 08:34:57.11 +000>,<MAYBRIDGE\nmr>,<NMR_250MHZ>,
      <abs ABSG = 5 
       data hash MD5: 32K
       1A 45 F3 FE 58 D2 85 2F DF BB F2 3A 01 5B 8F 04>)
$$ ##END=
$$ 
$$ hash MD5
$$ 23 39 AC 04 8A F7 3B F8 D8 DC EE C2 B3 18 07 B3
##$RELAX= 
##$RELAX= 
##$RELAX= 
##$RELAX= 
##$RELAX= 
##$RELAX= 
##$RELAX= 
$$ Bruker specific parameters
$$ --------------------------
##$DU= <C:\u>
##$EXPNO= 1790
##$NAME= <ADRS>
##$PROCNO= 1
##$TYPE= <nmr>
##$USER= <dgb>
##$AMP= (0..31)
100 100 100 100 100 100 100 100 100 100 100 100 100 100 100 100 100 100 
100 100 100 100 100 100 100 100 100 100 100 100 100 100 
##$AQSEQ= 0
##$AQ_mod= 3
##$AUNM= <au_zg>
##$AUTOPOS= <1 >
##$BF1= 250.13
##$BF2= 250.13
##$BF3= 250.13
##$BF4= 250.13
##$BF5= 500.13
##$BF6= 500.13
##$BF7= 500.13
##$BF8= 500.13
##$BYTORDA= 1
##$CFDGTYP= 0
##$CFRGTYP= 5
##$CHEMSTR= <none>
##$CNST= (0..31)
1 1 145 1 1 1 1 1 1 1 1 1 1 1 1 1 1 1 1 1 1 1 1 1 1 1 1 1 1 1 1 1 
##$CPDPRG= <>
##$CPDPRG1= <>
##$CPDPRG2= <>
##$CPDPRG3= <>
##$CPDPRG4= <mlev>
##$CPDPRG5= <mlev>
##$CPDPRG6= <mlev>
##$CPDPRG7= <mlev>
##$CPDPRG8= <mlev>
##$CPDPRGB= <>
##$CPDPRGT= <>
##$D= (0..31)
0 1 0 0 0 0 0 0 0 0.06 0 0 0 0 0 0 0.0002 0 0 0 0 0 0 0 0 0 0 0 0 0 0 
0 
##$DATE= 1169714081
##$DBL= (0..7)
120 120 120 120 120 120 120 120 
##$DBP= (0..7)
150 150 150 150 150 150 150 150 
##$DBP07= 0
##$DBPNAM0= <>
##$DBPNAM1= <>
$$ [...]
##$SUBNAM7= <"">
##$SUBNAM8= <"">
##$SUBNAM9= <"">
##$SW= 20.6930455092707
##$SWIBOX= (0..15)
0 0 3 0 0 0 0 0 0 0 0 0 0 0 0 0 
##$SW_h= 5175.983436853
##$TD= 65536
##$TD0= 1
##$TE= 293.16
##$TE2= 300
##$TE3= 300
##$TEG= 300
##$TL= (0..7)
0 120 120 120 120 120 120 120 
##$TP= (0..7)
150 150 150 150 150 150 150 150 
##$TP07= 0
##$TPNAME0= <>
##$TPNAME1= <>
##$TPNAME2= <>
##$TPNAME3= <>
##$TPNAME4= <>
##$TPNAME5= <>
##$TPNAME6= <>
##$TPNAME7= <>
##$TPOAL= (0..7)
0.5 0.5 0.5 0.5 0.5 0.5 0.5 0.5 
##$TPOFFS= (0..7)
0 0 0 0 0 0 0 0 
##$TUNHIN= 0
##$TUNHOUT= 0
##$TUNXOUT= 0
##$USERA1= <user>
##$USERA2= <user>
##$USERA3= <user>
##$USERA4= <user>
##$USERA5= <user>
##$V9= 5
##$VALIST= <valist>
##$VCLIST= <CCCCCCCCCCCCCCC>
##$VD= 0
##$VDLIST= <DDDDDDDDDDDDDDD>
##$VPLIST= <PPPPPPPPPPPPPPP>
##$VTLIST= <TTTTTTTTTTTTTTT>
##$WBST= 1024
##$WBSW= 4
##$XGAIN= (0..3)
0 0 0 0 
##$XL= 0
##$YL= 0
##$YMAX_a= 344613
##$YMIN_a= -325348
##$ZGOPTNS= <>
##$ZL1= 120
##$ZL2= 120
##$ZL3= 120
##$ZL4= 120
##$ABSF1= 16.522
##$ABSF2= -4.171173
##$ABSG= 5
##$ABSL= 3
##$ALPHA= 0
##$AQORDER= 0
##$ASSFAC= 0
##$ASSFACI= 0
##$ASSFACX= 0
##$ASSWID= 0
##$AUNMP= <proc_1d>
##$AZFE= 0.1
##$AZFW= 0.1
##$BCFW= 0
##$BC_mod= 0
##$BYTORDP= 0
##$COROFFS= 0
##$CY= 12.5
##$DATMOD= 1
##$DC= 0
##$DFILT= <>
##$DTYPP= 0
##$F1P= 14.0000005364418
##$F2P= -0.99999901652339
##$FCOR= 0.5
##$FTSIZE= 32768
##$FT_mod= 6
##$GAMMA= 0
##$GB= 0
##$INTBC= 1
##$INTSCL= 1
##$ISEN= 128
##$LB= 0.3
##$LEV0= 0
##$LPBIN= 0
##$MAXI= 10000
##$MC2= 0
##$MEAN= 0
##$ME_mod= 0
##$MI= 0
##$NCOEF= 0
##$NC_proc= -3
##$NLEV= 6
##$NOISF1= 0
##$NOISF2= 0
##$NSP= 0
##$NTH_PI= 0
##$NZP= 0
##$OFFSET= 16.522
##$PC= 1
##$PHC0= 232.0682
##$PHC1= 5.131658
##$PH_mod= 1
##$PKNL= yes
##$PPARMOD= 0
##$PSCAL= 4
##$PSIGN= 0
##$REVERSE= no
##$SF= 250.13
##$SI= 32768
##$SIGF1= 0
##$SIGF2= 0
##$SINO= 400
##$SIOLD= 32768
##$SREGLST= <1H.CDCl3>
##$SSB= 0
##$STSI= 32768
##$STSR= 0
##$SW_p= 5175.98343685301
##$SYMM= 0
##$S_DEV= 0
##$TDeff= 65536
##$TDoff= 0
##$TI= <Analysis number 999999
Compound Code 99
Book Reference 9
Project Code 9>
##$TILT= no
##$TM1= 0
##$TM2= 0
##$TOPLEV= 0
##$USERP1= <user>
##$USERP2= <user>
##$USERP3= <user>
##$USERP4= <user>
##$USERP5= <user>
##$WDW= 1
##$XDIM= 32768
##$YMAX_p= 538400078
##$YMIN_p= -165658
$$ End of Bruker specific parameters
$$ ---------------------------------
##NTUPLES= NMR SPECTRUM
##VAR_NAME=  FREQUENCY,     SPECTRUM/REAL,   SPECTRUM/IMAG
##SYMBOL=    X,             R,               I
##VAR_TYPE=  INDEPENDENT,   DEPENDENT,       DEPENDENT
##VAR_FORM=  AFFN,          ASDF,            ASDF
##VAR_DIM=   32768,         32768,           32768
##UNITS=     HZ,            ARBITRARY UNITS, ARBITRARY UNITS
##FACTOR=    0.157963299565203, 1,           1
##FIRST=     4132.6476996994, 0,             0
##LAST=      -1043.33573715361, 0,           0
##MIN=       -1043.33573715361, -165658,     0
##MAX=       4132.6476996994, 538400078,     0
$$ Real data points
##PAGE= N=1
##DATA TABLE= (X++(R..R)), XYDATA
$$ [...]
16473a361p299l028J2211r871n22Q444J4425j740j1423l820O486M959N861J81
16459A3503n761n986N059M323Q51l670N76r206p048o391m367M38J0691R25K716
16444c347j307k781l462O769m73K451m898l101o531j1143J4525R862k061N645
16430A48R1o690k740o078M713O867M918O258N36J3140j6295p027q299O570L873
16415a5p964j8311k092R541J5691K259K561J3882q648J3261N375j3306m440j047
16401F747R59Q001j3686o315N941m456N381O008J1598q75q288n434L872m076n969
16386e92p892K962p77J1130j758M765O953L499L912K156l832p807j6535o43l145
16371g604J3905O25k3000r207K1824K1427q34n817M123m993q716r886J7905R852
$$ y = [-1361, -8660, -11688, 523, -9348, -9870, -1426, 12999, 11259, -164, -3984, 2502, 7461, 13322, 13503, 7742, 1756, 6815, 11138, 11989, 8319, 8895, -311, -7359, -13750, -18117, -17679, -6988, -6063, -3347, -4654, -7435, -10897, -4128, -4601, -2150, -7048, -10149, -16680, -27823, -13298, -3436, -5497, 148, 239, -6451, -9191, -15269, -10556, -3689, 1229, 7487, 8023, 21163, 4868, -2159, -10458, -3888, -15, -7979, -26290, -28382, -18841, -3150, -891, 1670, 15552, 6904, 20165, 25540, 12234, 7794, 6747, 7706, 15707, 2021, -4294, 1647, -2809, 2572, 8580, 20178, 19303, 11015, 5581, 9453, 5377, -592, -8484, -5522, -6299, 4831, 3073, 7838, 14791, 18290, 22202, 24358, 20526, 12719, -3816, -4459, -7604, 6301, 6926, -16074, -25281, -3457, 17970, 17136, 11319, 15442, 10449, 1733, -8153, 9752, 19604]
16357A9604k96o359p504l613k841J6924m38l230K9N212k669j506l397n551l337
16342A028k1972j427K0716K645J313K187j3777O947N790o459K213j1556K502j635
16328a1485r001J1031J2396l677L459J140P727q760P95Q575j3149l369K259J631
16314d28l575K303m5k511m613p390J0208J1618l849p8P695K208O193K12Q768r187
16298A7529J868M885M311q878r922J464m200J0682J4213j594O205o790k6502J114
16284D385J2941J152r264j0060j909j3268j5978P266M981J2644J2430J1417n936
16271A0801j4146J646O316O851j0000j6037j647J5775O153K939p428m430n610
16258h817m27L713m515O410L731j3155n919J87O725O311J3268j055q93l562l479
$$ y = [19604, 19308, 12949, 5445, 1832, -1009, 15915, 15477, 12247, 12276, 17488, 14819, 13313, 9916, 4365, 1028, -20944, -22371, -1655, 990, 2303, 4490, -9287, -2340, 3450, -3009, -796, -12352, -9850, -11485, -20486, -9455, 2941, -736, 2723, 3863, 11590, 2830, 3625, 12200, -949, -4318, -2059, -428, -4003, -1700, -1745, -4256, -8869, -16259, -6051, 5567, 1718, 1640, 9335, 11543, 17736, 17948, 26716, 17529, 19397, 24282, 28593, 19715, 9793, 11257, 7057, 17739, 31952, 30358, 36563, 29773, 3271, 4385, 17326, 18478, 9214, -846, -2755, -16023, -32001, -24735, -19754, -7110, 5320, 16737, 10801, -3345, -1699, 4617, 11468, 1468, -14569, -16216, -441, 5712, 8651, 1223, -3207, -8817, -9244, -5531, -10046, -3636, 95, -13060, -18979, -18792, -12067, -5756, 7512, 6457, 5564, 2002, -1477]
16243a477P707J630r92N423J1033M99k5025o686n16q335l618m070J1830K2930
16229A0333Q026l657q701m110L983O200l221L090P88O828j394O372L149j2333
16215A5353j1476K277p307r733j225N243N897p548R11mJ910Q412q803l644J1328
16200A591M748j0893m100m67N284J2404r416L672J531J2881j4600j4583J208M413
16186f327P421J3502k313n451j7349K310j597J1068p088l569K701n070r85J3543
16172G96n182j1873R313J353K918J3272K302p091R11O490k076K8K0J0605N940
16157B7726l989j9074j3698j1364l295O294O887P277J0728J810M277r448j8839
16144a4708l59M332p021P329N586p619o095J0774M345r325j5046Q125J0903K3376
$$ y = [-1477, 6230, 7860, 6868, 12291, 23324, 23823, -1202, -7888, -8404, -16739, -20357, -24427, -12597, 10333, 18359, 14702, 6001, 1891, 5874, 12074, 8853, 11943, 12731, 19559, 18165, 24537, 27686, 15353, 3877, 6154, -1153, -10886, -12111, -6868, -971, -8519, -7608, -7612, -5702, 2710, -6093, -9737, 1591, 6339, -4554, -8654, -9121, -3837, 8567, -849, 2823, 4354, 17235, 2635, -11948, -10740, -6327, 1094, 14596, 12283, 6832, -10517, -8207, -9804, 1264, -5824, -9393, -6692, -11762, -12747, 796, -4386, -16259, -6946, -5593, -2675, 10597, 12899, 5808, 6719, 13209, 11133, 11161, 11181, 21786, 27726, 23737, 4663, -9035, -20399, -23694, -17400, -10513, -3236, 7492, 9302, 13579, 4131, -14708, -15067, -10735, -17756, -10427, -4841, -12460, -18555, -7781, -3436, -12761, -27807, -19682, -8779, 14597]
16130A4597J5106n673j4790j034q05M655N354p789q260r642K106j1431q444j342
16116b7392P965J3334M458j0377r000L500K916J6955O419K615p609j2639n587
16103a4442P215N266M96j0810N880O104r804n15J3367P827J943J02j7256j0334
16089a4961K21J1870J1323q856j8736o511M196M160L57q755k743K0279J0171q112
16075f097n670m130O347M925J0571m849j3628J3438J8113n413o02j175j2825l873
16061d868L399J0807k698K277K891j6569r756k314R673P312m668j0398r373o636
16047c0921J9086J2175N059K435J5347J622q328n241j293K944o430l308p400p048
16033a1301j5220l3J5654N731p114j9536N69R060J0803o90M196P017L257o827
$$ y = [14597, 29703, 24030, 9240, 8206, 7401, 12056, 17410, 9621, 1361, -8281, -6175, -17606, -26050, -27392, -19427, -6093, -1635, -12012, -21012, -17512, -14596, 2359, 8778, 11393, 3784, -8855, -14442, -7227, -1961, -1465, -12275, -6395, -291, -10095, -10610, 2757, 10584, 12527, 12629, -4627, -14961, -14740, -2870, 8453, -403, -19139, -25650, -21454, -17294, -16937, -25692, -28435, -8156, 2015, -6097, -11767, -15897, -9550, -4625, 5946, 1097, -12531, 907, 19020, 13607, 13005, 11830, -995, -4868, -1469, 9338, 6640, 8917, 11808, -4761, -14517, -16831, -7158, 154, -4514, -14912, -24285, -30921, -11835, 340, 5399, 7834, 23181, 24803, 16475, 11234, 9941, 12885, 6455, 3147, -4253, -11301, -26521, -26554, -10900, -5169, -12283, -31819, -31250, -22190, -11387, -12077, -7881, -864, 2393, -4434]
16019d434l003J2794J0911j0476k1348j1689J8614K5151K803j0925j1450N57M112
16006A617O059J0340M475J453R94l072j5683j1662O210L286n249k750n297j2475
15992b1754L971O758O429Q216l7l803m25Q068Q733k240j4577q927o767O645N245
15977d465K730J1991P295p966k350k0382l722R442M784r166k158N735Q716l946
15963c462L984m603l936R94J741K038L127R696L833m52q726n860J4879n971q886
15948a604j5235r257M199O330q911n876J0941J307r404J5206Q23m163J0844o14
15934e414K873k780m89L178q982k471N826j4999r077O240J9743J2789L559M665
15920A4661j0421r506Q95l332j9543p303J1084K1863N414J5m039q026r772J718
$$ y = [-4434, -7437, 5357, 16268, 5792, -15556, -27245, -8631, 16520, 19323, 8398, -3052, -2495, 1617, 7676, 18016, 22491, 23944, 24938, 21866, 6183, -5479, 731, 4017, -1232, -3982, -9279, -21754, -17783, -11025, -4596, 3620, 3583, -220, -645, 7423, 16156, 13916, -661, -9588, -16355, -9710, -4465, -1735, 10256, 17551, 9585, 7235, -13147, -16869, -7427, -2643, -11809, -13967, -8232, 484, -3462, 522, -4081, -8017, -7023, -5282, -3244, -117, 9579, 13412, 12960, 4234, -1626, 13253, 7282, -1604, -16839, -26096, -21897, -15567, -24478, -30354, -19413, -18106, -27510, -12304, -11481, -15644, -4800, -5414, -2541, -5321, -5810, -2632, -11614, -14085, -8259, -23258, -32335, -26095, -6352, 6437, 9996, 14661, 4240, -5266, -4371, -7703, -27246, -34549, -23465, -1602, 3812, 3827, -212, -8238, -18010, -16292]
15906a6292J0353J561l245K469O335P588q091n115p016K869Q935j2501r814L221
15892a8743m174j0758K2570J9966L83r307n71r069r865P904q3O252N18K515J0345
15877G883k191p002M12J4486o018n494J750j996k307j815j929O15l584L885R518
15862F213Q924J471k4796j7605j879J2986N773J5471n414j0264J6839N977j3940
15849b44k948M059J102o049L987J0996K77k260K548J158o561q183K990M807m127
15834A552n555q973O3j293p82J415l134K71q113k425Q687J9503J959K589m534
15819A230j3969o620J6992K1692o663p966N230J963o424m014m792J124J6687n308
15805I162P251r118j2893n249M320O903m346K652L267J2572J704j564J4408j3054
$$ y = [-16292, -5939, -4378, -7623, -5154, 1181, 8769, 678, -4437, -11453, -8584, 351, -12150, -21964, -18743, -22917, -33675, -11105, 8861, 9244, -63, -634, -9703, -19568, -11664, -11747, -5495, -4977, -2462, 7883, 5692, -1310, -898, 13588, 7570, 2076, 3826, 1830, -477, -2292, -4221, -3606, -7190, -3305, 6213, 15137, 16608, -8188, -25793, -27672, -14686, -8913, 6558, 1144, -9120, 7719, 13696, -244, -3192, 867, 1969, -4080, -93, 10903, 11180, 8920, 11468, 12626, 6065, -2118, 872, 5679, 1552, -4003, -12976, -12913, -14206, -14988, -13573, -16707, -16436, -24549, -26974, -18287, 1216, 3175, 5764, 1230, -12739, -19359, -2367, 19325, 12662, 4696, 9926, 11889, 5465, 1451, -3341, -2217, 14470, 9162, 16413, 7295, -5598, -10847, -6527, 376, -3970, -1318, 1949, 14521, 16225, 14661, 29069, 16015]
15791A6015j2448L173L032l416N983J319m25p582j7334j381p686p831O091j812
15777b4302k387J8572m295q603j344J2957K117n077r2j99k741O837J6751J0760
15763A8954j204n684L082N190o496j5238n407k998N799k746M756j2639J614O143
15749f874L580J6174Q58o594j774P103j0078j1916k09J0223P162k310r649L154
15735a150J0111k702j586P12J472R693p569J0115J797J0513m713o957l820k782
15721A3134j819L39O788k3417m802P206O683J150Q157n583M912L760r936K722
15707I294Q349n721N606J0597k0703O411L259j8593j8444k815J5934N007k877
15694d696p609K651L132M763o999R313J6272j915j1104K1293o435k0078j106n28
$$ y = [16015, 3567, 6740, 9772, 6356, 12339, 13658, 13233, 5651, -11683, -13064, -20750, -28581, -22490, -24302, -26689, -8117, -12412, -21015, -22359, -9402, -7285, -12362, -12454, -12653, -15394, -8557, 8194, 18954, 17750, 12066, 15148, 20338, 13842, -1396, -6803, -9801, -4002, -6748, -1992, -14631, -13017, -6874, -3294, 12880, 13738, 7144, 5370, 12473, 2395, -9521, -9730, 493, 7655, 5345, -4304, -1150, 8961, 6259, 4673, 5385, 6857, 16550, 8981, 19096, 20893, 31406, 26693, 19736, 15916, 13134, 11315, 11654, 18442, -4975, -9777, -2571, 4112, 5262, 13419, 7836, 12748, 16508, 6572, 9294, 17643, 11922, 17528, 28125, 7422, 13833, 17092, -1501, -19945, -22760, -6826, -1819, -4696, -12305, -9654, -6522, -1759, -8758, 555, 16827, 14912, 3808, 25101, 18666, -1412, -2518, -3046]
15680c046J0548n89n735m015p767o538m386M989Q421N306J5082o915j464j2950
15666i059j0622N136N107R836O25j930l475O183M243k085L968K934l293m08l172
15651C988j48M04M398j290p20n092o408r187j3425Q928O983k818J1793n09j488
15636d591Q024N677p148j3612n390O933J1668R862p579o668J1667k302j0668p817
15622a1944K764R929K408K15n138N768K687J2370P158r369Q61q705o918j0902
15608h816N1l685Q12N138j426J4938M926j994j710o58j445n146M74n638m690J264
15592g605o275l676K1755O100j74J673R602N205l189n069N42P818n542q217K95
15577A3243r648j31L302j446n011K553J929m752j446M471j440j3118n957p499
$$ y = [-3046, 7502, 6913, 1178, -2837, -10604, -17142, -21528, -16539, -8118, -2812, 12270, 5355, 3891, -9059, -19681, -14545, -9438, 398, 1023, -907, -4382, 1801, 6044, 3959, 7927, 10861, 7568, 7160, 3988, 3840, 4244, 8642, 7352, 6632, 1540, -4868, -14055, -27480, -18552, -11569, -14387, -2594, -3103, -4591, 3433, 9110, 1962, -11650, -17040, -10107, 1561, 11423, 3844, -2824, 8843, 6541, -4127, -11944, -9180, 749, 3157, 3372, -1766, 4002, 6689, 19059, 26217, 16848, 17709, 9004, 2086, -8816, -8765, -12450, -11638, -6500, -7926, 7012, 11938, 9944, 8234, 7576, 6131, 985, 1459, -4179, -8869, -7605, -13880, -17556, 4199, 10299, 10125, 11798, 21400, 26605, 23416, 18347, 18889, 26707, 21165, 12948, 13243, 3595, 3464, 6766, 5320, 309, 2862, 4791, 39, -1407, 3064, 1624, -11494, -17451, -24950]
15563b4950Q94M464J2694R939R293N411o062j1200P379J8626l834K3508R956j2363
15549D3755o296p958j4975o954K072K702q361n127j0825L176J8652J1395p593
15536A3663p800o95K990j0370J077J979l318n542k421l37k159m128Q743P749L65
15521b04n97J3026M100J251j0313r948q30r973j0586J5812k673o279K329N974
15507h911O774m195j886L547p339k486J005l04K037J5389J6040m316n072j320
15493H963Q130J4699r812Q12j3272J823L802P51O390k668J642j4004K391j883
15479G764j4979m384L33P013O20k653N379J101J082p03O943J62n967j6605q09
15464a5703K8682J8207q92k4003j8646n537Q785R508K222m203r165j4033L126
$$ y = [-24950, -24056, -19592, -6898, 3041, 12334, 17745, 11683, 483, 7862, 26488, 22654, 46162, 56118, 43755, 37459, 29501, 14526, 7572, 9644, 12346, 3985, -1142, -11967, -8791, 9861, 21256, 13663, 5863, 5168, 8158, -2212, -1135, 844, -2474, -8016, -10437, -10774, -12933, -17061, -8318, -569, -204, -801, 12225, 16325, 17576, 7263, -2685, -3515, -13488, -24074, -8262, -10935, -17214, -14885, -8911, -2137, -6332, -8218, -4671, -12010, -14496, -13491, -13795, -11758, 3631, 19671, 15355, 10283, 8963, 17093, 31792, 21980, 22792, 9520, 11343, 15145, 15896, 22286, 19618, 21260, 7256, 9647, 7764, -7215, -11599, -11266, -4253, -3633, -6286, -907, 194, 1276, 573, 7516, 7678, 1711, -14894, -15703, 12979, 31186, 30294, 6291, -12355, -17892, -9107, 401, 2623, -1580, -10745, -24778, -21652]
15451b1652Q674J2118o018j0715J786K553R201M988p164J3306J1626j0021r125
15438d43M052m680j592n398k080R370j0318m218N019j12k012l192N978R185n980
15423f421K570O911j322L343P555n315k0835p233J3785J5309l184j0581J2174
15410F756l345p124L321N2o586J145L242l194J609J460K549M104r707l386m685
15395a3789k0J456n921m540J4118J6626p769l977j4552J634k7O794O149Q239O251
15380A0672l812k134J849J0138o707j0108l66J309P467j0019p078J662l82J34
15366g375K398k252m033J1609N274j5918K401n529Q211R435M181P681n858k768
15352G457Q011m194m379l118p272M611J5579M541R791l002j8049k1483l62O430
$$ y = [-21652, -12978, -860, -6878, -17593, -15807, -13254, -4053, 935, -6229, 7077, 18703, 8682, -443, 3609, -1071, -2663, -8061, -10141, -771, -11089, -15307, -10288, -10400, -12412, -15604, -9626, -441, -6421, -3851, 3060, 1738, 5081, 12636, 7321, -13514, -20747, -6962, 8347, 5163, -5418, 6756, 3411, -3713, -392, -340, -6926, -5781, -2539, -5733, -4124, -2664, -115, 3989, -5718, -9104, -13789, -13809, -12353, -18274, -22814, -8696, 7930, 161, -3816, -18368, -16734, -16761, -9967, -3818, 4421, 10672, 6860, 4726, 6575, 16713, 10006, -102, -468, 841, 8308, -1711, -8789, -7127, -7509, -7375, -4977, -7229, -11262, 347, 5621, -10297, -7896, -13425, -5214, 4221, 8402, 16083, 10225, 7457, 15468, 11274, 6895, 3777, -3495, 1116, 16695, 21236, 31027, 28025, 9976, -11507, -11869, -5439]
15338e439J5627K718j657k104r008r246l596M64L268j0360J585J2097J0137Q97
15324E383j0753l052O50P950J3127J52L223o899o215R68r728Q876m173j2065r859
15309b2415p998O806J1989P968N46o472j2085J1524K2370Q993j3170j5412R220
15296A864p523l669l101P414M356J3403q793j1862R108q268p007J1129m560J617
15282e892J912N463J804Q212J488j0956J811J3181l979n799P355m047K11m705
15268F059L788Q613l781l355l531k948j1763p067P173j0489L679Q164l568j5071
15254b4097k446N585Q215J2680J0798j043k173o343M324P23m740k641K076M133
15240E051M522r837k3426J584J166J3831r453p214J086J4644K1662Q029j1341
$$ y = [-5439, 10188, 12906, 11249, 9145, 137, -9109, -12705, -12241, -8973, -19333, -17748, -5651, 4486, 5383, -5370, -8422, -7772, 178, 13305, 13457, 16680, 9781, 3566, 4534, -5194, 3682, -491, -12556, -22415, -30413, -23607, -11618, -3650, -3104, -9576, -21661, -10137, 12233, 21226, 8056, -7356, 1864, -5659, -9328, -12429, -5015, -659, 12744, 3951, -7911, 1197, -7071, -14078, -2949, -7509, -5892, -3980, 1483, 3287, 11499, 12987, 2031, 3842, 17023, 13044, 7245, 14600, 10553, 10764, 6059, 9847, 18460, 14679, 11324, 7793, 4845, -6918, -13985, -6812, -17301, -13622, -5458, -9026, -24097, -26543, -20958, -12743, -63, 10735, 9692, 7519, 1176, 5500, 6223, 1483, -1158, 918, 5051, 9573, -264, -23690, -22106, -20940, -7109, -16562, -23776, -22690, -8046, 13616, 21645, 10304]
15227A0304N478k099J354k200j288K965L989o264p681J2986M982p733j6223k0102
15213b1532j148P734j064O198L832N985O46m438j3169K209q79P604Q359K625n79
15198B383j6298j0897J0914L122J3832J1529j0989j5417J1030R110j0367k870
15186d918N759r30n710j520Q094K713K259J294K0160P207q185p946j2503P125
15172A2899J409L703j878j6467n432Q697J2605j353j2061q094o366J194J0053
15159a091L196r20k88K112j936p461q158l593m290J0036J6835O038M042j1897
15145B625j1990n650n755J2484Q087Q942J074J905j0290o226M550M624N315m276
15131E419m398k461J947O57M111j6565j34J1294m26p526J3693j795j935j5431
$$ y = [10304, 15782, 13683, 15037, 12837, 11549, 14514, 18503, 12239, 4558, 17544, 22526, 14793, -1430, -21532, -22680, -14946, -16010, -9812, -5980, 5, 651, -3787, -16956, -14747, -15626, -8022, 337, 2962, 2383, -13915, -24812, -13898, -10776, 3056, 14585, 3596, -11821, -791, 8319, -2048, -4918, 841, -89, -5799, -7319, 775, 3488, 5747, 7041, 27201, 34408, 26223, 18277, 5774, 12899, 14308, 18011, 16133, -334, -5766, 2931, 15536, 14183, 2122, -5972, -12338, -11144, -1091, 2105, 1185, 897, 3009, 1073, -6388, -14546, -18139, -22429, -12393, 4442, 10480, 14522, 2625, -9365, -15015, -20770, -8286, -199, 8743, 9817, 11722, 1432, -4794, -244, 4380, 9695, 5419, 1021, -1440, 507, 1164, 5275, -11290, -11424, -130, -556, -8082, 5611, 3816, 1881, -13550]
15117a3550n440Q68k79o889J069J7063q117n480P421J1867K461M705k604o44r401
15102f950j240j034j1524j0294K869K2093J1845r089J58%m764l264J2187j956
15088i63N641M50j023J6553J207n693o195J1179j078k355L387N159J825l605j0223
15073A4266M362J1125p35k1712q052J2268n21R87m007r245q456L976J0902k115
15059C043o802n217L36J8318j3145r375K609K2422J7608j0229j0644o074L729
15046F579J1592J2182m879k2049j4988n339N771Q26J2862P053m174J378K714j527
15032H001Q488N901J1934q096q039j4023k162J1608n309K35l75n292K0301J8130
15018D1302L820n822K66q805L14J7143N456l350l508l92P958J7373P857M992J7780
$$ y = [-13550, -18990, -18122, -18401, -25290, -24221, -7158, -15275, -20755, -13334, -1467, 994, 5699, 3095, 2451, -6950, -8190, -9224, -20748, -31042, -28173, -6080, 5765, -3324, -3166, -3166, -7930, -11194, 993, -963, 4678, 5128, 4105, 20658, 21865, 16172, 9977, 21156, 20078, 17723, 21110, 26269, 28094, 24489, 14266, 18628, 29753, 29018, 7306, -746, 11522, 11001, 11988, 7981, -1264, -9720, -5744, 5158, 3043, -3759, -8976, -8640, 9678, -3467, -12842, -10233, 12189, 29797, 19568, 8924, 2850, 6579, 18171, 30353, 25474, 3425, -11563, -16902, -11131, -10305, 2557, 9610, 5436, 6814, 9528, 8001, 16489, 22390, 34324, 26228, 18189, 4166, 2004, 13612, 8303, 8538, 8163, 2871, 23172, 41302, 45122, 39300, 39566, 30761, 31075, 48218, 53674, 50324, 46816, 46424, 54382, 71755, 79612, 84604, 102384]
15003A02384P091J7709M2098P7055J33403J85771K80657M11145O48447J073233
14993B978993J074701J29156r91956j341577p49862l59650j95498j12625q8843
14984C42839o8833m8340m5174l5182k2573O972j0798j0707j5920n705j2298k0524
14972E3757L011q046j4280n311K662j5814j3378p380o11O525J8244O263N667M001
14958C5310J1463P717k871o089r137j1071J333n519q767o201j6538J701O832K4057
14944B2220q199o849r868j048Q309O120j2309j827J362P973m239m692L913o565
14930e699l607O344k184J0472M439j1188j437m057k781J8552k186o088J665K396
14916D641M255Q063j7425j3480N434K4J0857O234K482m542K0673O256j0273k573
$$ y = [102384, 109475, 127184, 169282, 246337, 379740, 565511, 846168, 1257313, 1905760, 2978993, 4053694, 4182850, 3190894, 1849317, 1099455, 739805, 544307, 431682, 342839, 274006, 225666, 180492, 145310, 122737, 129709, 118911, 108204, 92284, 86579, 74281, 53757, 56768, 48722, 34442, 29131, 31793, 15979, 2601, -4779, -5390, 1135, 19379, 25642, 31309, 35310, 46773, 54490, 51619, 45530, 36393, 25322, 26655, 21136, 12369, 6168, -10370, -8669, -1837, 22220, 14021, 7172, -2696, -3744, 4565, 10685, -1624, -3451, -2089, 5884, 1645, -3047, 866, -5699, -9306, -2962, -5146, 5326, 9765, -1423, -2860, -6917, -9698, 8854, 6668, 580, 2245, 4641, 8896, 16959, -466, -13946, -8512, -8488, 2369, 8603, 11085, 6543, 27216, 33472, 23199, 20626]
14902B0626p809j3198l287J1555j1400k096J1065M455k4439j6946N49J4414J5744
14889g67Q336r961M981J4375k458q593o924n664l036j458j590J0412k05j2605
14875a5157j871O214q127J793J2606P099L589k572Q69q686L222L398Q552R212
14861B0141k441j1392o134n815M637k191j524O088r71M39R139J471rk707L62k745
14845F348m27M098R121q495j2066J8019O03j5125j1528R383M737p982L723N122
14831E531N439j496M702j234o819r299p928J5664L561J0236p461j6967n012q675
14817a9758J6762J039p365J0435j115L006N052k446J597k899n00K475R51j742
14803E492O881O730j007m575J2321q773j2566k30p057j442O828J7308k369J22
$$ y = [20626, 12817, -381, -3668, 7887, -3513, -5609, 5456, 9911, -14528, -31474, -30925, -16511, -767, 7569, -2392, 2589, 16964, 14506, 5913, -1011, -6675, -9711, -11169, -12759, -2347, -2552, -15157, -17028, -10814, -18941, -17148, -4542, 2557, 6146, 3574, 4443, -4243, -1021, 2377, 10929, 20141, 17700, 6308, 174, -5641, -1004, -3195, -4719, 1369, 398, 837, 9976, 11447, 11438, 8731, 9093, 6348, 5921, 10019, 19140, 10645, -1421, 16598, 17201, 2076, -9452, -69, 4668, -3314, 409, 5531, 10970, 9474, 14176, 12942, 6123, -3176, -11104, 4560, 8121, 18357, 10896, -6071, -11083, -19758, -2996, -1957, -9322, 1113, -2, 3004, 8056, 5610, 7207, 4308, 3808, 6283, 7234, 5492, 12373, 19103, 18096, 13521, 25842, 17069, 4503, 4273, -2784, -4226, 2602, 19910, 17541, 17663]
14789A7663m130M140p740n927o622N802M785n382L316J384j2427o127J2829J4350
14775A5914l777L657j0324m70J427j0975r512O847p24K962o333L028Q798J0523
14761A1041k676o418p386K674q309k295j14J4630J831j0376q59J7255J0150J193
14747B0341M148M852r471j4363j3573J090N816J4403p347j8104O445L000n851
14734h614j210L117R157n545m297o806O076n170r634P554Q52K651P770J198K879
14719b2j748P559J920o857N572l363p360J6559k213P007m377Q626L873j6731j7166
14704h721q731O139P666L356n098J0067j772q95P423j3335n111k370J6752M614
14690I984L541P672k585j8013l207p40m020J442M820K217N365p654j2130j642
$$ y = [17663, 13533, 17673, 9933, 4006, -2616, 3186, 7971, 2589, 5905, 7289, -5138, -11265, 1564, 15914, 12137, 15794, 5470, 5000, 6427, -4548, -14060, -7213, -7937, -4975, -11308, -8280, 518, 11041, 8365, 1947, -5439, -2765, -11074, -13369, -13483, 1147, 2978, -7398, -8257, 8998, 19148, 20341, 24489, 29341, 19870, 5507, -8066, -6976, -1160, 13243, 5896, -12208, -5763, -2763, -8614, -9824, -6707, 2450, -3095, -7392, -14198, -8122, -13292, -22926, -15372, -14520, -11869, -4099, -2901, -22, -1770, 5789, 7709, 852, 6424, 3061, -4299, 12260, 10047, 17054, 12677, 21303, 25176, 8445, -8721, -17452, -11313, -3647, -291, -5389, 4678, 2906, 2011, 9434, -3901, -9012, -11382, 5370, 9984, 13525, 21197, 18612, 599, -2608, -3348, -7368, -5926, -1106, 1111, 6476, -1178, -13308, -14950]
14676a4950J9678K5311m228r453j9246l915N340L330j1206N483O693q260N175
14663b48L107J226J0995O93j2890L036o090j3499r830l557J0020R227K344j918
14649g384p585j057R184o371r036K3566J8430J367k3399l565J0465K32o110r366
14635a0629k916q900j592J4347K946l762J7750O871j9105K259n131j2208k828
14622b2898J6568p96r357M888Q545J0354l90P96J0093P652o851j0989n857P892
14608I650q2M051k191j7918j3185q465j0875M789L312Q810J7085L64l149l064
14594a0868r958K093M537J4672J4504m410j8699L753j92K203j2297l954J0890
14581g726r171j4027L084O754O829j120L567R895n160j2579P455J7994L380K561
$$ y = [-14950, 4728, 30039, 25811, 16358, -2888, -6803, -1463, 1867, -9339, -3856, 2837, -5423, -248, 2859, 4085, 15080, 15773, 2883, 5919, -171, -13670, -23500, -27057, -17037, -7810, -5466, -7384, -14969, -16026, -6842, -13213, -22249, 1317, 19747, 21114, -2285, -5850, 4615, 4847, -1263, -10629, -13545, -22445, -24037, -9690, -6744, -10506, 7244, 14115, -4990, -2731, -7862, -20070, -22898, -6330, -7126, -16483, -11595, -3050, 7304, 6914, 7710, 17803, 25455, 18604, 7615, 1758, 9650, 9568, 13619, 11428, -6490, -19675, -28140, -39015, -34226, -30914, -22104, -5019, -4655, -7804, -10868, -20826, -18733, -14196, 476, 14980, 10570, -8129, -4376, -4568, -2365, -14662, -18616, -7726, -16897, -30924, -27840, -21086, -14257, -15377, -11810, -1915, -7075, -19654, -12199, 5795, 9175, 11736]
14567A1736n097m850p81p122j7896P376J4326J2872q233J0684Q017L803j4523
14554A0312j0744O290O826N221r627j2762k644l379L830l307R749N543n797O50
14540A61k467M704J6413q47n312J457k763k554j980L198Q709k397m318K970n121
14525I853k2356n478q798O194r941q443q096P893J4650J2772O389N691k116j0937
14511a2723l888K843J787M942J3762P544O807m076q926j2459n839J0862K162L101
14497E899n536p680l441J1579l493l863l113J7989M603p779K068j3370j4234M021
14483a6350o32M441m330J123R340J137O207J0496n026q148k606J116j874L109
14469a997j4697k851J7218R331N802k836j0798j917p684L212Q390L756J0637J196
$$ y = [11736, 6639, 1789, 1008, -6114, -24010, -16634, -2308, 10564, 2331, 13015, 21032, 24835, 10312, -432, 5858, 12684, 17905, 8278, -4484, -7128, -10507, -6677, -9984, -235, 5308, -489, 161, -2306, 2398, 18811, 17964, 12652, 14109, 11346, 8792, 6812, 10010, 18719, 16322, 12004, 14974, 9853, -12503, -17981, -26779, -20585, -30526, -38969, -47065, -39172, -24522, -11750, -5361, 330, -1786, -12723, -16611, -13768, -11981, -7039, 6723, 14267, 21074, 16998, 8072, -4387, -10226, 636, 2798, 5899, 363, -7317, -10758, 821, -2672, -6535, -9648, 8341, 12944, 5165, 7233, -6137, -20371, -16350, -16982, -12541, -16871, -15748, -6408, -5271, 936, 11432, 6406, -1742, -4348, -3232, -5106, -1997, -16694, -19545, -2327, 7004, 12806, 9970, -828, -2745, -10429, -7217, 1173, 4929, 15566, 16762]
14455A6762p54r151o875q475P686k062l730r13K674n33J989j1973J2394Q214o938
14440a685j0833l771k793q708J0386K943N817Q479P244J3652M480L554M222J436
14426C4423K669j1673j3988M49m774j7034m912K636O314N083K97L465n34o111
14412c690o298J9304q6m289j4722l212N927O101L072k054q611n201R684Q554J0809
14397A5288J848n705j791j1490m486n14n87J1497L807L67p886r976k023o983j616
14382b0250K2976R440q59j9011M451J309k640K220p151N410P580j8158L489J0393
14368h01P715q98K754J2934J1655o078k3551j3405j384K347R841Pp806O413m705
14353d962p94J3059O307L567j95j406j0449k4427k458l572J9037P915j5260j1703
$$ y = [16762, 16008, 6857, -18, -8493, -807, -2869, -6599, -7512, -4838, -5371, -3382, -15355, -2961, 5253, -1685, -12518, -16289, -19082, -27790, -17404, -14461, -8644, -165, 7079, 20731, 25211, 28765, 32987, 34423, 37092, 25419, 11431, 11880, 7106, -9928, -14840, -12204, -5890, -807, -510, 2955, 2421, -3690, -9988, 9316, 9230, 4941, -9781, -12993, -7066, -965, 2107, 53, -8558, -13759, -4075, 4479, 15288, 17136, 11431, 9640, -1850, -6336, -6850, -7437, 4060, 7867, 8234, 348, -9628, -11651, -18634, -20250, 2726, 12166, 11307, -7704, -3253, -1944, -4584, -2364, -9515, -4105, 3475, -14683, -11194, -801, 6914, 6016, 8770, 21704, 33359, 27281, 3730, -9675, -11059, -8712, 1129, 1136, -6670, -257, -4962, -5756, 7303, 13610, 17177, 16982, 15576, 5127, -19300, -21758, -25330, -6293, 1622, -13638, -25341]
14339b5341j1447O650R615J671J9223J1635n379r570p074p367j4378P359J1609
14326a2794J0018J2546j941r115o451o21M370O137j817k766m788K964J4680K731
14312A3153p862j0859O480j772l46K585J369Q093p420N410j8156j5559L385J1154
14298a0345k59r445n359K5187R941n120o56o031N043J1833M670k099o279n336
14284E745N3r275K346R724K442R888O05j7040k931K962n005p677n611M625J5577
14269F428N738j5916p351O817M496K128q951m347J0503O164p367r307R842J4257
14255A3134m102p587j959m802q02K598N432J535k193m930K003K334l540O961k206
14240A876k227J0256Q884j2053m956l411L640J7965k821l367j966m45J0212l902
$$ y = [-25341, -36788, -30138, -20523, -18852, 371, 12006, 6627, -2943, -10017, -17384, -31762, -24403, -12794, -2776, 9770, 7829, -1286, -7737, -8358, -3988, 2149, 332, -2434, -7222, -4258, 10422, 13153, 5291, -5568, 912, -860, -1206, 1379, 2748, 10841, 3421, 8831, -9325, -24884, -21499, -10345, -10604, -20049, -25408, -221, 9720, 4600, 3944, -2087, 2956, 14789, 19459, 17360, 11081, 5745, 5798, -3477, -1131, 8593, 11035, 20923, 21528, 4488, 1557, 4519, -486, -8163, -13774, -9149, 6428, 12166, -3750, -11101, -4284, 212, 2340, -6611, -10958, -455, 5709, -1658, -10965, -1123, 13134, 9032, 1445, -514, -5316, -6118, -3520, 1912, 3447, 1254, -3676, -1673, 661, -2879, 4082, 1876, -351, 9905, 18789, 6736, 1780, -1631, 2009, 19974, 17153, 13786, 11820, 11375, 21587, 17685]
14226A7685j2935L953p303j8750m933J0403M125N50N793m885q321K819O963N311
14212D75N798q378R998J5447N294Q16j3223k2815p072L986Q154o374K545j201
14198f550l355o242J3161N11p531j1634J262J3438J963m101J2941J1411j0876
14185D398q167M354l629l227J872r256J2273M931L967j0643j6221M396P267P847
14171A62l627J6461n338L885N55j7995r077N116J0822Q81j15J3073k455q946J5628
14156A9030Q635p837o053j8071j6305K968j958K071j442L766J4773j083q854n355
14142a5715L141k222J151j5967q381P076M412N320k235J8654M060K845M741o896
14128a6o923L768J5896O892j7368k1059n25P205K117j1665P198N23q737m79K2731
$$ y = [17685, 4750, 8703, 1400, -17350, -22283, -11880, -7755, -7205, -1412, -6297, -14618, -11799, -4836, 475, 6273, -2105, 7893, 23340, 28634, 29450, 16227, -6588, -13660, -9674, -1520, -7894, -5349, -6550, -9905, -16147, -2986, -2475, -10006, -21640, -20378, -6940, -4977, -9078, 3863, 15274, 4398, -3769, 585, -3044, -6271, -4399, -13655, -1382, 3549, 7516, -3127, -19348, -14952, -7685, 162, -3465, 12996, 7658, 11543, 12098, -5897, -14974, -9858, 964, 1845, 1730, 14803, 12348, 3402, 19030, 27665, 19828, 13775, -4296, -20601, -17633, -19591, -17520, -18962, -15196, -423, -1506, -10360, -15715, -12574, -14796, -13645, -29612, -37993, -30917, -26505, -21185, -23420, -4766, -706, 2139, 6880, -16, -6939, -3171, 12725, 19617, 2249, -18810, -19335, -12130, -10013, -21678, -14480, -13957, -22694, -23173, -442]
14113d42L191L542J2404J3921q688j5355r080Q701J4487K057K115k276j4876j7083
14099g382j383R102k986N287Q284j8541QP767m083k255L310o879R257O784l507
14084B783J1294q59k846m586j2251q007n542q757Q43J5491M907p135j7714P711
14070b4668P037K643p5k267N516J7222J6829j3512r594m462K663R291L507j0112
14056A8L341K1531m687j4978o091m302j1003L152J554O979j593q174O072L996
14042d185q522M567J7601P881n291m778j5607O680R888p731j3708J2772j985k192
14028d610k951l901j934R381M399J3327K071j4047k234Q492m194n436O584K2455
14014B7402O941j5566j6841q795L941R135K080L540M56p730r80q78Q264r650O316
$$ y = [-442, 2749, 6291, 18695, 32616, 23928, 8573, -507, 8194, 22681, 24738, 26853, 24577, 9701, -7382, -8765, 337, -2649, 2638, 10922, -7619, -7611, 156, -3927, -6182, -2872, -9751, -494, 6290, 2783, 14077, 13218, 10372, 5786, -6465, -14472, -20014, -28771, -27928, -12437, -7530, -14665, -32379, -24668, -17631, -14988, -15063, -17330, -11814, 5408, 22237, 8725, -869, -5331, -2668, 6623, 10130, 18, 3359, 24890, 20203, 5225, -866, -5168, -16171, -13019, -11465, -4486, -6079, -14253, -8181, -4185, -12707, -8140, 9461, 17342, 12051, 7273, -8334, -1654, 8234, 503, -13205, -433, -2418, -4610, -7561, -11462, -13396, -4015, 384, 13711, 15782, 1735, -499, 7993, 3799, -1637, 4947, 27402, 34343, 18777, 1936, -6859, -2918, 6217, 8297, 11837, 12293, 4563, 3583, 2705, 10969, 1319, 7635]
13999G635R629l847j366j2584P84L919m814j2764m088J1364N040j3248k557P263
13985i634J7247O682K741o904n97k206j2219n752m894R118q792p298J4125J5769
13971G386l593l832P757J2J397J2795k131M309j0966q454N461M116k693j0893
13957F71l086q004P051J7043o364k4129M499N637N561J5019R835p827q542N587
13943A2951m323N511J574P651q492j5211K087O548j1637n873M40M799q32O172
13929A365P976j379o63j9207j1293m786J4105J8587J6418n84j5573j4247j2394
13916b1675m479J4630q0O74q403J964N075N96O290N976q281p973r41j100J1414
13901f313K690q034J1480J5765J737r865l731J0463k594r824m47n49m357j0933
$$ y = [7635, 17264, 13417, 12051, -533, 251, 4170, -644, -13408, -17496, -6132, -1092, -14340, -16897, -9634, 7613, 14295, 17036, 10132, 9535, 7329, -4890, -10642, -15536, -6418, -15210, -22508, -8383, 7386, 3793, -39, 7718, 7730, 9127, 21922, 19791, 24100, 13134, 4680, 10141, 14257, 11564, 671, -2415, -10419, -3368, 13675, 7311, -16818, -12319, -6682, -1121, 13898, 23733, 15906, 7364, 12951, 8628, 14139, 15713, 23364, 14872, -339, 1748, 8296, -3341, -9214, -8774, -3975, -4807, 1365, 9341, 7962, 7299, -11908, -23201, -27987, -13882, 4705, 21123, 20539, 4966, -9281, -21675, -26154, -11524, -11604, -10930, -19333, -17369, -12294, -11698, -5408, 568, -7713, -15686, -16627, -17727, -6313, -3623, -11657, -177, 15588, 17325, 7460, 3729, 14192, 11598, 1774, 1327, 778, -3579, -14512]
13887a4512r508j1837J528Q245P780J0639M277R912n025K579J1093K033j5359
13874A845o246J266j6987R944J683l058N313O052J1795o524j456n005l722P174
13860B074k177L84J6178M334q287j4250q552j2589J1629K451l561n086k388j469
13846b1309n619O409P919N288M956N539K178N198P94j416j9782j0659n978J1782
13832a4700O089j3273m830J24Q524J3650M758r35j0969q055O922J2603N344M517
13818I769m910N693Q332m604j4576P85l075o807O068l883j1207N765k164J1479
13804c335J525j6649j0029L674J5383l007j5058q099n086J2080n13K17o521k431
13790c7849N859J6973M819j2206J620l359L426J0477K5J2445r82J6963l976r602
$$ y = [-14512, -24020, -35857, -34329, -26084, -18304, -7665, -3388, 6524, 1499, 4078, 15171, 17204, 1845, -4401, -3135, -20122, -10178, -8495, -11553, -6240, -188, 11607, 5083, 3627, -1378, -5100, 2074, -103, 281, 16459, 20793, 12506, -1744, -10296, -22885, -11256, -8805, -12366, -17452, -19840, -21309, -26928, -20519, -12600, -7312, -2356, 3183, 5361, 10559, 11353, 9937, -9845, -20504, -26482, -14700, -8611, -21884, -26714, -26590, -18066, -4416, 342, -593, -11562, -19617, -12695, -92, 5252, 9769, 4859, 10552, 18884, 14280, -296, 489, -2586, -9393, -3325, -7208, -18415, -12650, -14814, -3335, -1810, -18459, -28488, -24814, -9431, -12438, -27496, -35595, -40681, -28601, -29114, -28897, -35418, -37849, -31990, -15017, -10198, -22404, -20784, -24143, -20717, -10240, -10215, 2230, 1248, 18211, 14235, 4633]
13776D633l883j9372O737J6873J54m118p293o444J3233M66r229J1152L835M300
13762A1044J83q799J084q348m944K078O061M245m489L539O999Q625j6903j6840
13748a6465p720Q293j412J586P071J4964j146j1846J0570L287n787K29L568J977
13734G169j1319p049m15Q212m13O605K46P051j0380m242J1616J2279k607l042
13720A3711p035m138j1435j836l908L564J0165M672K138m612J5091M460j6423
13707D414j2467P467k796p245j6991M562J6303J1571k905n726J0290P753J1086
13694B5316j1769k2345m366N393R198J519q259j0260M329l452m060R241o500m938
13680b0953J7828J4502K514r067j6135r710M811n853n537o123J2455K5849K88
$$ y = [4633, 750, -18622, -11885, 4988, 5142, 1024, -6269, -12713, 520, 986, -8243, 2909, 6744, 11044, 11227, 2428, 3512, -4836, -9780, -7702, -1641, 2604, -1885, 1654, 8653, 17278, 375, -16465, -24185, -15892, -17304, -15718, -8647, 6317, 5171, -6675, 3895, 7182, 1395, 1624, 5192, 7169, -4150, -11199, -11614, -3402, -3815, 2790, 3036, 10087, -293, -4535, 7081, 19360, 16753, 13711, 6676, 2538, -8897, -10733, -14641, -11077, -912, 3760, 5898, 1286, 16377, 20837, 4414, -8053, -586, -3382, -10627, -27618, -23056, -6753, 4818, 1913, -3813, 6477, 14230, 25316, 13547, -8798, -13164, -7771, 1427, 2946, -5313, -15573, -11244, -14696, -18756, -9515, -16015, -20953, -3125, 11377, 13891, 4824, -11311, -21021, -16210, -22063, -27600, -33723, -21268, 4581, 4869]
13667D869K891R849M666l980L59L584q439n860Q675J735M840J4280J1596n04K1770
13652G0331K3748J7505J7245N0212K3974j2010k1569k5215k2044j7368k6887k8410
13640D9512j7396l951Q942m138p809l133j159o186r284K379j573l499k179O332
13626F858N12L559l84J467n631P227J1290K3897J7406P57j0676P998K8107L9978
13612A32365J7791M0803O2988O2516M6079K3492k0961n0454n0767n9889o2141
13601A41822l8685j1736m581l244m614j5928r905r385j8373J169k264p84j1566
13588A1926q287o494K099R757p899J0499J560J768q768o288K2438J238p231J5432
13574C1750J1876Q255j988L1514M2218L3863J6772J7079m868k6389j6714j9562
$$ y = [4869, 7760, 17609, 22275, 18295, 18654, 22238, 13799, 7939, 16614, 18349, 23189, 37469, 49065, 48561, 70331, 94079, 111584, 128829, 179041, 203015, 191005, 169436, 144221, 122177, 104809, 77922, 49512, 32116, 28165, 37107, 32969, 25160, 22027, 20868, 14682, 5398, 7777, 6204, 2705, 526, 6858, 7370, 10929, 10545, 12012, 6381, 13608, 24898, 48795, 66201, 66958, 56282, 64280, 92387, 132365, 150156, 190959, 253947, 316463, 362542, 386034, 365073, 314619, 263852, 203963, 141822, 103137, 91401, 86820, 83576, 78962, 63034, 53129, 43744, 25371, 26540, 24276, 23492, 11926, 3639, -2855, -756, 9001, 1102, 11601, 13161, 14929, 6161, -127, 22311, 23549, 16318, 31750, 43626, 51881, 49893, 81407, 123625, 157488, 174260, 191339, 186471, 160082, 143368, 123806]
13562A23806l6229l0949j302o550m690k0868j1408J0226J3649J719k3827j5385
13550a808J1897Q462m866P745n3O886j0302r466j446M593O83m781p475M300p610
13535c241j0843m681J7292Q669J1384l221Q669P077j0373j6477M517M03j792p227
13521A56n630j428J0271K462M59p556j5152M03J2545P317j521j4574K465J1360
13507A577R803j3724r922l168K4n345O420J201m933m839J0529O183K232J038J1946
13492I022J1307r656q863j107p307p305P738Q658n41j3949l315J9719l197m418
13478c214j3875l776R359J797l079N366o313k782J8558K1266j003p205j14l649
13464A1336O687J5170L626j7592q128P584n133j7559r043J0425J5836J2353O902
$$ y = [123806, 87577, 56628, 55326, 48776, 44086, 23218, 11810, 22036, 35685, 37404, 13577, -1808, 10089, 18551, 13685, 21430, 21377, 28263, 17961, 8495, 7049, 11642, 12325, 7544, 69, 4369, -3241, -14084, -18765, -1473, 7196, 18580, 15359, 24028, 31105, 20732, 4255, 8772, 9175, 7383, 156, -5474, -6902, 3369, 5831, 6290, -1266, -16418, -16015, -3470, 3847, 2326, -12248, -9783, 1577, 11380, -2344, -12266, -15434, -15410, -20755, -14335, -13134, -18067, -22906, -12377, -6194, -3962, -2924, 9022, 20329, 10673, 1810, 703, -6604, -13909, -6171, 2487, 1946, -12003, -15318, 4401, 1204, -3214, -17089, -20865, -11506, -9709, -12788, -7422, -13735, -16517, 2041, 23307, 22304, 15099, 14985, 11336, 18023, 33193, 36819, 19227, 11099, 18683, 13550, -4009, -13052, -2627, 13209, 25562, 32464]
13451C2464Q321J0387j73N672o266q455r064J715r780n56j54j6737J0069R607
13437B7050K05m059n452j1396n031K591j783k147L314n939r6K0039K977n112n683
13422I478K29Q461l239j2830Q63J1322Q968r99L032Q605O340k616J438J8767J7606
13407G5425K6785Q910j9956j0606q633n538j7542j6577J826n897K150R603K939
13394D2889j3115j5264k0282Q696J0761J429o227j614k647P165J1247j533m942
13381A6563j9331k5l508o18P472n351J6073J7087P202Q333q815o676j1625M585
13367B1366J4487J7902O162p815j5996j7918J412L999M72p060P612J0270j4253
13354B0640j1881j974O308j2571n214n677K562k302r439k406M795n438m193J3309
$$ y = [32464, 40785, 51172, 50999, 56671, 50405, 41950, 32886, 34601, 24821, 24265, 24111, 7374, 17443, 27050, 27255, 23196, 17744, 6348, 1317, 3908, 2125, -22, 3292, -2647, -2743, 17296, 20273, 15161, 9478, 9707, 18168, 14929, 2099, 2962, 14284, 23252, 22253, 25285, 33890, 40230, 37614, 39052, 57819, 75425, 102210, 111120, 91164, 80558, 71925, 66387, 48845, 32268, 34094, 28197, 30347, 39950, 42889, 29774, 14510, -5772, 2924, 13685, 15114, 8887, 7273, 4626, 11791, 23038, 21505, 16563, -2768, -2793, -6301, -6919, 553, -4798, 11275, 28362, 35564, 43897, 35082, 28406, 16781, 21366, 35853, 53755, 59917, 52102, 36106, 18188, 19600, 23599, 24071, 17011, 24623, 34893, 20640, 8759, 6785, 13093, 522, -4692, -10369, -7807, -10109, -19548, -21954, -17159, -22597, -26790, -13481]
13340a3481p091l733R398J561K550P743M584J1767j7179j4019J5721J9078J403
13327A8302N203M38n196m372m995q874N231P233j14J2350J6882M431j2242q6J0794
13312D4985L18j2975l346j2462j191j637k600M251o822k2237L24L446Q405R932
13298H391J2811q331j3935k811K2488P941n166j1960L215O526K4913r437j6447
13285A8198r166M431q906j897J7858K4908J8018J3503K1387O080J530n89n621
13272I9734l752o035n917M884O808M904l626m457j3622K707Q682j8434N869j498
13258G6247L486l179L010O429J6152L191m035R723J6948k380j3404O116N542N405
13244A29251R461O024N386J1174J0268P434J2564J7969J5641Q401P937r12R83
$$ y = [-13481, -20572, -24305, -14907, -13346, -10796, -3053, 1531, 13298, -3881, -17900, -2179, 16899, 18302, 23505, 23943, 18747, 14375, 9380, 506, 5737, 12970, 12856, 25206, 42088, 46519, 34277, 34191, 44985, 45303, 32328, 28982, 16520, 15329, 13692, 11092, 15343, 8521, -13716, -13392, -9946, -1541, 8391, 21202, 12871, -1064, -3875, 18613, 26554, 21388, 9428, 12643, 19169, 44082, 34645, 18198, 9032, 13463, 4557, 2660, 20518, 45426, 63444, 76947, 98334, 104414, 105944, 105355, 99734, 95982, 89947, 84030, 88914, 95722, 100626, 97000, 92543, 78921, 81628, 90310, 71876, 77745, 76247, 79733, 76554, 79564, 85993, 102145, 105336, 101301, 111024, 127972, 125592, 112188, 118304, 123846, 129251, 138712, 144736, 150122, 161296, 171564, 178998, 191562, 209531, 225172, 233573, 241510, 240598, 241581]
13231B41581R094J5519L2223K1139K1333L2265J8620J1982J3211K0164K9151L3805
13219E00087M2740M4528N3892O6742O5068J00428J07445J18415J36328J74877
13209A410550K03655K34805K92795L52809M64886O13213Q46684J197461J685642
13200G302500K345683L255243M360142N447646N974534N212725K891445m58371
13192C6331547l638293n575982n888125m995329l713516k607890j805463j291304
13184F815645r64437p29017n78073m49071l40199k64662j97991j49628q7457l3247
13174C021863O654N6696R6239J47463K24744L08558L99080M70972O12824P80192
13164F125285J018697J444259K057042K911778M108240N759675P962993J0497693
$$ y = [241581, 250675, 266194, 298417, 319556, 340889, 373154, 391774, 403756, 416967, 437131, 466282, 500087, 542827, 587355, 641247, 707989, 773057, 873485, 980930, 1099345, 1235673, 1410550, 1614205, 1849010, 2141805, 2494614, 2959500, 3572713, 4419397, 5616858, 7302500, 9648183, 12903426, 17263568, 22711214, 28685748, 33898473, 36789918, 36331547, 32693254, 27117272, 21229147, 16233818, 12520302, 9912412, 8106949, 6815645, 5851208, 5122191, 4544118, 4095047, 3754848, 3490186, 3292195, 3142567, 3055110, 3021863, 3028517, 3085213, 3181452, 3328915, 3553659, 3862217, 4261297, 4732269, 5345093, 6125285, 7143982, 8588241, 10645283, 13557061, 17665301, 23424976, 31387969, 41885662]
13156D1885662J2516119J2497848R074402K477588n252840j1147568j3433052
13149D8618159j2229895r320500o422833m324572l008662k178164j678081j301431
13141H154021j022148q26052o80702n59553m79838l97201l23336k34069j70010
13132C461112j13948m6064q625N9660J27615J75001K39279L37349M52533O39549
13122E323461R09718J283191J816026K531786L503536M663459N707778O074576
13114C1813531N033841K393766j193713m462442o281557o325066n214254l779069
13106A1985037k604920j797803j316840j005129p80371o34070n17696m25673l41987
13097B560548k95842k54273k11952j77402j44231j36481j07833o8483n6423o8042
$$ y = [41885662, 54401781, 66899629, 75974031, 78451619, 73198779, 62051211, 48618159, 36388264, 27067764, 20644931, 16320359, 13311697, 11133533, 9455452, 8154021, 7131873, 6305821, 5625119, 5065566, 4585728, 4188527, 3865191, 3631122, 3461112, 3347164, 3301100, 3292475, 3352135, 3479750, 3654751, 3894030, 4231379, 4683912, 5323461, 6233179, 7516370, 9332396, 11864182, 15367718, 20031177, 25738955, 31813531, 36847372, 39241138, 38047425, 33584983, 27303426, 20978360, 15764106, 11985037, 9380117, 7582314, 6265474, 5260345, 4479974, 3845904, 3328208, 2902535, 2560548, 2264706, 2010433, 1798481, 1621079, 1476848, 1340367, 1232534, 1164051, 1107628, 1039586]
13087A039586p5592n5820n0191n6670m1900m4038l2670l0971m1918k6356j0265
13076E73195l8114k2677k0051l1051l9822k8625J670L391M873J2151P356r724
13064D12572k4750j6816j5493j7972j9893j4110j4215j1963j5338o772p868P763
13052B55145L444k551l6L817P947o944p221o741j9722j4905k0959k28M324k968
13038A92402r00j7473j7772j7559j4515r486P181K4096J3417l645J2236J2323
13026A80305n053n910M10R40O764j0807M118q088j6840j4829R466J043Q495M942
13012A54956R59L676n00j029k320j0059q054K3831J5449j036j8053p509n150j4630
12998A30531j4328j2964j049l611j2912K603J0283K319o63Q571j2873l433J248
$$ y = [1039586, 963994, 908174, 857983, 801313, 759413, 715375, 682705, 651734, 609816, 583460, 573195, 535081, 512404, 492353, 461302, 421480, 392855, 394525, 397916, 402789, 414940, 422296, 412572, 387822, 371006, 355513, 337541, 317648, 303538, 289323, 277360, 262022, 255250, 247382, 255145, 258589, 256038, 256002, 259819, 267766, 260822, 253601, 246860, 227138, 212233, 191274, 191046, 195370, 192402, 191502, 174029, 156257, 138698, 124183, 114697, 121878, 145974, 159391, 155746, 167982, 180305, 175252, 169342, 169752, 170692, 177456, 166649, 170767, 162679, 145839, 131010, 140476, 141519, 150014, 154956, 155915, 159591, 159091, 158062, 155742, 145683, 137629, 161460, 176909, 175873, 157820, 150311, 145161, 130531, 116203, 103239, 102190, 98579, 85667, 88270, 98553, 100872, 100209, 108780, 95907, 92474, 93722]
12985I3722J2903O941J3888Q357k0118l0649q810M040m808J633M067J8476J8639
12972A18281R903K126p903o6j6407j0644J583o058o359n679m526o204j064k424
12958F4559k49p722K367L105j1524Q376N191J104m947j8341r663J2917J434o192
12944D0415O014R270J912J0210q99q384k5033q558J3104j2402J3171J4091l412
12931D9499r603k364k192r378J3366j3066n159J0109R803P586m812j0176j95Q629
12917D2047K919r320k3770k153J7959J4685r954j4019o680k132J739J5999j6555
12904A0765j0766N966K024O206J2123J125n031M611L841Q310m546R934n37M76
12890D4501J7394n188k5878o147J1607N557r528r387R268N800k959r283N61Q490
$$ y = [93722, 106625, 113566, 127454, 135811, 115693, 85044, 76234, 80274, 75466, 77099, 81166, 99642, 118281, 128184, 130310, 122407, 122341, 105934, 95290, 96873, 90815, 84456, 78777, 74251, 68047, 66983, 64559, 64310, 56588, 58955, 62060, 50536, 58912, 64103, 65207, 60260, 41919, 32256, 45173, 46607, 40415, 46429, 55699, 57611, 67821, 66922, 58538, 33505, 24947, 38051, 25649, 38820, 52911, 49499, 39896, 37532, 35340, 25962, 39328, 26262, 21103, 31212, 41015, 48601, 43789, 33613, 33418, 42047, 44966, 35646, 11876, 9723, 27682, 42367, 32413, 18394, 11714, 9582, 11321, 27320, 10765, -1, 5965, 7989, 14195, 26318, 27443, 22412, 27023, 30864, 39174, 34628, 44562, 44025, 44501, 61895, 56707, 30829, 24682, 36289, 41846, 32318, 22931, 32199, 37999, 35040, 25757, 26318, 34808]
12876C4808n035o949Q840P040K778o733j0433j265J170O466K131k400j1550Q65
12862A9733Q415p810j1673O534j644L79K673K662n608P28K2327L738N403m555
12848D1302j7312q99m679r293R116o22n241K521o066R493J9230J72P59p871k036
12833B8574k125j2081m478k778j1501K30m998J678J4317Q628O051L179j834k833
12819B0029j1277k429J0732J0490k025j825j288k577m604K211N358J800j0144
12806A4451M160N205L440J2559n046j1071l793J1346M931n640j0279Q416O139
12793C4818L021o643K190P379n670o995J0357q807k2262J750J5977J0819j0773
12780B5161j6333p876J1622m747J02J0145L342r373o350N378L833m495j557N206
$$ y = [34808, 29773, 22824, 31664, 38704, 41482, 34749, 24316, 23051, 24221, 30687, 32818, 30418, 18868, 19733, 28148, 20338, 8665, 15199, 13555, 13934, 16607, 19269, 13661, 14389, 36716, 40454, 45857, 41302, 23990, 23091, 18412, 9119, 18235, 17613, 12372, 14893, 8827, 18320, 37550, 37722, 38481, 30610, 28574, 26449, 14368, 9890, 7112, -4389, -4159, -9157, -7479, 6838, 15466, 21517, 24696, 22862, 20029, 8752, 6323, 17055, 27545, 25520, 23695, 22407, 19830, 15226, 17437, 22795, 24595, 14451, 18611, 23816, 27256, 39815, 34769, 23698, 19905, 31251, 36182, 30542, 20263, 28679, 34818, 37839, 31196, 33386, 40765, 35095, 28100, 38457, 29650, 7388, 9138, 25115, 35934, 25161, 8828, 952, 12574, 7827, 7929, 18074, 21416, 12043, 5693, 11071, 14904, 10409, 8852, 14058]
12766A4058M19j0014P38k394n253J3983N159j2859m271J103R704k694J7614K1666
12752D6959N125j1985o151j1580P998L145J5542O256J430j3300m671j937l251
12739C3580L905K0463K3829K1421L7310K9395J7052Q095J0598j0151k6170l9218
12727A30109k7740k3471k0705j0790k0115p565p486R30K648L36L127j2351o209
12714G18l204M716j0084K3502J6349n220k52K845p499K795j966K869J4050R546
12700D9165J2558J6943K1398K9112L6460N9310O5926M9521L4811J3266p852m0436
12688C40182n4508o4183n1165l3814l4091j0250j7415j5293M043R30n032l499
12676E5905m896n415j3453q453r400j371N215N312j1045L996M926Q105o178L885
$$ y = [14058, 14477, 4463, 5201, 2807, -2446, 11537, 16696, 3837, -434, 669, 10373, 7679, 25293, 46959, 52084, 40099, 33948, 22368, 30366, 33511, 49053, 55309, 56739, 43439, 38768, 36831, 33580, 37485, 57948, 81777, 103198, 140508, 169903, 186955, 195050, 205648, 195497, 169327, 130109, 102369, 78898, 58193, 47403, 27288, 19723, 12237, 13167, 15815, 16151, 19278, 6927, 718, -2486, 2230, -7854, 15648, 31997, 26777, 26525, 29370, 21871, 24666, 22700, 25569, 39619, 49165, 61723, 78666, 100064, 129176, 165636, 224946, 290872, 340393, 375204, 388470, 380618, 340182, 285674, 221491, 170326, 136512, 102421, 92171, 74756, 59463, 63506, 64436, 59404, 55905, 51009, 45594, 32141, 23688, 14288, 12917, 18132, 23444, 12399, 16395, 21321, 29426, 23248, 27133]
12662B7133J05n711Q648K2532K4198N216J140J5073K6983L5889J1762J2132J5088
12649B00188n689m0128l4495j3383j0497k6606j6319j9439L23j594q422k851o348
12636A4740M302j2139L014m6l790K972o981o187P671j208N952Q1m989j929J3380
12621A4843M90j2389k999R80N688m130O967L934j261j944l205m2o732j1332R845
12606a287o474k493l299j1375J2804R750O801J554N719n001K831R071R772Q083
12592C6456j266q451j0585K838R264p980j7840M78L83k239L340j597q84J855k616
12577A156J693M228L00l653o877o22J408o099J096R506O555n258k1082j1839J0785
12562a8703L685N736J1623P90n392r558k172m970N208J454J4757J1034J702j4676
$$ y = [27133, 27238, 21527, 30175, 52707, 76905, 82121, 83261, 98334, 125317, 161206, 172968, 185100, 200188, 194499, 154371, 119876, 106493, 95996, 69390, 53071, 33632, 33955, 32361, 23939, 21088, 14740, 19042, 6903, 9917, 9871, 6081, 9053, 2072, -4115, 3556, 2348, 8300, 8381, 3392, 1463, 14843, 15333, 2944, -55, 925, 6613, 2483, 9450, 13384, 12123, 10179, 6974, 6932, 200, -11132, -1287, -7761, -10254, -13553, -24928, -12124, -2374, 4427, 5981, 11700, 6699, 9530, 18601, 28373, 36456, 35190, 26739, 16154, 18992, 28256, 20276, 2436, 2914, 3297, 1058, 4398, 2801, 1917, 3772, 1156, 2849, 7077, 7377, 3724, -3153, -3775, -2367, -8466, -7370, 2136, 8691, 3433, -17649, -29488, -18703, -15018, -9282, 2341, 3131, -2261, -11819, -13991, -18961, -13753, -12299, 2458, 13492, 15194, 518]
12548E18p754J920Q703O650l308R301K552n477j2608N061J5998p226j5018k0105
12534b0793q777J3838P664K102r118O654j412p10l022J4058J1678n824Q59k43
12520F954K349o98n648M522r137k814K750M159J2088l564k053m579k596M461j4454
12505h260K285P568j4105J59K1297Q892q228o601k066k734O043L147L350k852
12491G895k1390m427J4057p2O853J535m323l446M524L439J3443K059j9563K641
12477C225N082j165p373l804P328J0127M066j6162O772J4242r703j3383j1623
12464a2371j1342L73J3646L21K198K783M934J707M588K916J666K663J0871j9677
12450E276r703P35P979k480P345k394Q954J14K534M226n193Q160p965k5413j1753
$$ y = [518, -7236, -5316, 3387, 10037, 6729, 16030, 18582, 13105, 497, 5558, 21556, 14330, -688, -20793, -29570, -15732, -8068, -5966, -15084, -8430, -9842, -10552, -13574, 484, 12162, 6338, 7197, 6954, 9303, 8605, 2957, 7479, -1658, -4472, -1722, 2437, 14525, 10961, 8908, 4329, 1733, 6194, -8260, -5975, 1593, -12512, -12353, 8944, 17836, 9608, 3007, 941, -1793, 4250, 7397, 10747, 7895, -13495, -17922, -3865, -3937, 2916, 4451, 128, -3318, 1206, 4645, 18088, 20147, 584, 3225, 8307, 7142, -231, -4035, 3293, 13420, 17486, 1324, 8096, 22338, 12635, -748, -12371, -23713, -23340, -9694, -9373, -7175, -4392, 542, 2249, 6837, 9753, 11419, 14082, 24953, 5276, -4427, -3692, 4287, 1807, 9152, 6758, 15712, 15826, 18360, 22586, 17393, 25553, 17588, -7825, -19578]
12435a9578o949P374J6381J2851J274L697l850n534J933L800n780m600n775j794
12421f550L259K540J4640p187k0047o70J7363J0917L469m503j7058q373R088P310
12407D198J6856O363n343k1741n218P980m094o708N89r209j249l78J8591J3420
12393A4057j9547j1126k899J2360M046l068J491j7316J0036O065j8307N986Q574
12380i648J1568J1173p647l317L407O516K816R53k621j3900j0165J0266R376q456
12366C21Q097J1023J3171r219j2804O03K99n434k597M964K342J937k1N957p13
12351A7926l404n629r627o52K485J0442K430K93p789o834q084q27J617J3863K040
12336H250k2846j1131M570J3522P263m887K820J302j2145j3745M445K025j1317
$$ y = [-19578, -26527, -19153, -2772, 10079, 11353, 15050, 11200, 5666, 7599, 11399, 5619, 1019, -4756, -6550, -3291, -751, 13889, 6702, -13345, -14015, 3348, 14265, 17734, 13231, -3827, -12200, -3112, 4198, 21054, 27417, 22074, 333, -4885, 3095, -999, -7707, -7118, -16327, -17576, -17954, 637, 14057, -5490, -16616, -19515, -7155, -3109, -6177, -4686, -22002, -11966, -5901, -24208, -18222, -9648, 1920, 13093, 5446, 2129, 5536, 12052, 14868, 15821, 13200, -700, -10865, -599, 8777, 321, 8418, 19441, 32612, 23393, 10589, 11192, 11491, 6057, 3460, 8424, 10766, 12703, 12682, 18639, 17926, 14522, 8893, -734, -1386, 1099, 11541, 13971, 14264, 6475, -359, -8443, -9270, -7653, 6210, 8250, -14596, -25727, -21157, -7635, -372, -5259, -2439, -1137, -13282, -27027, -22582, -20557, -31874]
12323c1874L985J5395J4082m612N092R793j437R520L394p80j1441o855j0976Q456
12309A742J5250N757o639m877k205P614R12o562l094Q57n753r961M547L874O910
12294H372J363o231j701M363R708M195j7889j3542l069j5358N064Q664J2480N472
12280A891k1724o427J0327J3027P369L535r599j0497J1725J3728m668L565r583
12267B669M149M564K376j2306m908j1841l752J2645L240l410m68o169J689J52
12253a1370o16r001m996J3042l046J2252J4107J6288j3767M883J0005l452o85
12240B3644l874j0918J0416L55l261m141J871M776p278r796n191O51n648M033
12226d361J1934k949p178j2897M729J3197J181o232q00O211n690n305j0366M557
$$ y = [-31874, -27889, -12494, 1588, -3024, 2068, 11861, 10424, 19944, 23338, 22558, 11117, 4262, -6714, 1742, 16992, 22749, 16110, 11233, 9028, 16642, 17554, 10992, 7898, 8755, 3002, -6959, -2412, 1462, 8372, 9735, 3504, 1803, 6166, 15874, 20069, 2180, -11362, -14431, -29789, -24725, -16061, -3581, 1891, -19833, -26260, -15933, -2906, 4463, 7998, -1601, -12098, -373, 13355, 8687, 12252, 2669, 6818, 11382, 13758, 1452, -3456, -15297, -19049, -6404, -3164, -6574, -7042, -13211, -11522, -11370, -11986, -20987, -25983, -12941, -15987, -3735, 10372, 26660, 12893, 17776, 27781, 24329, 23644, 19770, 8852, 19268, 19623, 16362, 12221, 14092, 18868, 11590, 1794, -3397, -2746, -8394, -4361, 7573, 4624, -2554, -15451, -10722, 2475, 3656, -2576, -3376, 2835, -2855, -8160, -18526, -13969]
12212a3969k486j774R663j4730r34R201O123J5273O182p584L332Q448L770n839
12198A4676K845k976m101p235O841l974o962j0004Q01J2617N605J0569L825j0187
12184A2340p344L495J2399J626J423l040k115l195J299j759m290N657K82Q028
12170B4806P243M361K363n331J072n037j423R215k804M870o248p638R474K830
12156C7753J1389o352q775M091q601n648p90N115m626m897K128p45K66q902R79
12141A2385r297J482P076J0971L869n063J1085j691p188p755M189N782M338M356
12127C4539o932l384q867Q710j305k364n094r321O390n16Q275r31j0235k663M148
12112A0450J124j6480p352n891j0838L15J1918J771n144J1785q937P23j764L370
$$ y = [-13969, -16455, -18229, -8566, -23296, -24230, -15029, -8906, 6367, 12549, 4965, 8297, 16745, 20515, 14676, 17521, 14545, 10444, 3209, 10050, 6076, -886, -10890, -10089, 2528, 8133, 18702, 22527, 12340, 4996, 8491, 20890, 22516, 23939, 20899, 18784, 15589, 16888, 15129, 10839, 16496, 16778, 24806, 32049, 36410, 38773, 33442, 34514, 29477, 28054, 37269, 34465, 39335, 33087, 25449, 34923, 37753, 49142, 42790, 34015, 38106, 29505, 23857, 23067, 28182, 23556, 18659, 20787, 20042, 20308, 11406, 12385, 3088, 4570, 11646, 22617, 26486, 21423, 32508, 30817, 23629, 15874, 20063, 25845, 30183, 34539, 27607, 24223, 15356, 24066, 22761, 20397, 15303, 5982, 12372, 11856, 20131, 19200, 8965, 6302, 10450, 11574, -4906, -12258, -18149, -28987, -28672, -16754, -14983, -20127, -8342, -17279, -16556, -18320, -14950]
12098a4950O185K0982M140l750o650N045N193J055o213j2072J591m653q877n825
12084a8799J4549J3856M42l317j798k020J4870Q319K961j1643o943l155m30O884
12070A3776J3192p830j9492m071J0548O857r011o390m057J0249Q033j2352K010
12057A462l501K021K317j0117K960N651q294J5516M467r415q119J1115J1009l876
12043A3196L535j3505j1433J519O158O233K08J0415J876J0390j808j3260j3112
12030D12j601K878N00J204L411O972o81j3299o953l599K848q338k715P458J2188
12015F85J3608J9j0494L409R207k422K063O578L91N52k215KP76K350n166p327
11999A2016l899m360r249j0016P348R3J1279P932r485j7562j63L790J2282J0513
$$ y = [-14950, -8765, 12217, 16357, 12607, 5957, 11002, 16195, 17250, 11037, -1035, 556, -4097, -12974, -18799, -4250, 9606, 10048, 6731, 4933, 2913, 17783, 26102, 29063, 17420, 10477, 7322, 6892, 13776, 26968, 19138, -354, -4425, 6123, 12980, 3969, -2421, -6478, 3771, 11804, -548, 1462, -2039, -18, 2299, -7818, -4858, 793, -7501, 8015, 12482, 3067, -5052, 6063, 17072, 13196, 16731, 3226, -8207, -6688, -530, 5703, 5911, 16326, 18202, 28592, 26784, 13524, 412, -1189, 1689, 2189, 3393, 6804, 13776, 13095, -204, -7157, -10756, -7908, -16246, -18961, -11503, 685, 14293, 14312, 3818, 7227, 16434, 14012, 16075, 22653, 23044, 23596, 21381, 21383, 22159, 24509, 19343, 12016, 8117, 3757, -5492, -15508, -8160, -8067, 3212, 11144, 1659, -15903, -16066, -12276, 6, 10519]
11985A0519r241j8410p171J754J6939j243O906l247k658k300q802n152R894o339
11971a8551r805j3691m6J5706J5512R401n808j2837r687M444k113j392J0794J2682
11957e391K405L92N02o100K08J5731P924j2979M350M602r590k352Q485r421p263
11942h497m179m399Q970Q362k5695p489K85m602J405K6199M749j1534P507J1563
11928B645R555k595n406K158K53m745M231J059N946n187r264K442o451o872j4933
11913b7164M72P379J6918J3364Q31m382P63o280n509N528Q220j672o230q078q896
11898a4736l623N98P399N089o106R026P620j2742m392q920n770N883J1737J5378
11884F441o45l895k796p240l794J1123K4633l051k9232j3326Q520P293j917k966
$$ y = [10519, 1278, -17132, -24303, -22549, -5610, -6853, 53, -3194, -5852, -8152, -16954, -22106, -12212, -18551, -28356, -42047, -42093, -26387, -10875, -1474, -7282, -20119, -29806, -25362, -27475, -28867, -18073, -5391, -2986, -2594, -2092, -8192, -7984, 7747, 15671, 2692, 7042, 11644, 2054, -298, 8187, -1234, -8497, -12676, -17075, -8105, 257, -25438, -32927, -32642, -37244, -35839, -9640, -4891, -16425, -8918, 2645, 12200, 9605, 4199, 6357, 6610, 1865, 6096, 7155, 13101, 7914, -1350, 1092, -5359, -12231, -27164, -26692, -19313, -2395, 10969, 11800, 7418, 8181, 1901, -3608, 1920, 10140, 8468, 2238, -5840, -14736, -18359, -17761, -10362, -5273, -11379, -2353, 5267, -7475, -11867, -20787, -26557, -20674, -8937, 6441, 5796, 1901, -895, -8135, -11929, -806, 23827, 20776, -8456, -21782, -13262, -5969, -7886, -10852]
11870a0852r860L144J6434n98j3921j7347k511J5833K1560P138p385J1713j2618
11857G30j0186M519p572j2310N913o394N670L825j1960j1509j69K0325J1634N311
11843b173R931M68L241N165n984q151o73o282J3249J4279k862q230j0655j2240
11829a0917P451R415j6498n879O501k39O604K800J6111J38k7882K125q246j8087
11815c6603K648K632L2382R425m37q38J380k510j4783o954K963j0557k248O610
11801a6890P356M155l969j989Q544r95P179q566o483n856m938L565M639l049K982
11786a4315J038N426k974j221m592j801N845J0680Q049l787j1786P156N302j1162
11772h142P412M975m26q322N405J4408K424j2216j9271r255K883R359n742n160
$$ y = [-10852, -20712, -17568, -1134, -1732, -15653, -33000, -35511, -19678, 1882, 9020, 1635, 13348, 730, -9456, -4937, -12509, -24819, -18906, -25300, -19630, -15805, -27765, -39274, -39443, -19118, -7484, -2173, 7758, 8226, 11467, 16632, 10648, 2497, 1824, -4458, 8791, 23070, 20208, 11978, 1323, -10917, -3466, 5949, -10549, -16428, -9927, -10166, -3562, -762, 15349, 15487, -12395, -10270, -18516, -36603, -33955, -31323, 1059, 10484, 10047, 9209, 10589, 8079, -6704, -13658, -10695, -21252, -23500, -16890, -9534, -5379, -9348, -11337, -2793, -3788, 3391, -5175, -11658, -17514, -22452, -18887, -14248, -17297, -14315, -13277, -7851, -10825, -12046, -16638, -18439, -12594, -1914, 6135, 2348, -9438, -2282, 3020, -8142, -730, 4245, 3819, -4503, 902, 15310, 17734, 5518, -13753, -23008, -20125, -10766, -16508, -21668]
11758b1668o83R36l873K378O640P260O875j1349p234J4627K936j713K0087Q332
11744B3551r430j8247p201j2691N663J8393K847j312j492j222M603k414j6095
11731a5047j463l17N500J3941R781J285L042k132j154p012q825j0289L670J1800
11717B780R540p490r306m992r72m819O429k950m670o913P928J0244m575r870k332
11702b1968N499l474N305j338M23K405n974j2361m493Q912J1783J3208P570O88
11688F185p400m170Q547p378j2105L033l016J0886n260j4590k766J9662J4038
11675E666o603J0422m655o226N981o886j0436j1068J7638K519j588r527L458j0092
11661b1397N22J422J4848j924n535n393R627P107J2964K963j1214j0562j1734
$$ y = [-21668, -22351, -21415, -25288, -22910, -16270, -9010, -2135, -13484, -20718, -6091, -3155, -4868, 15219, 23551, 14121, -4126, -11327, -24018, -18355, 38, 2885, 1573, 81, -1141, 3462, 1048, -15047, -16510, -16827, -11327, 2614, 12395, 13680, 16722, 14590, 13436, 6424, -2401, -12690, -9020, 2780, 12320, 4830, -4476, -9468, -10440, -15259, -8830, -11780, -16450, -23363, -15435, -5191, -9766, -19636, -21968, -16469, -19943, -14638, -15976, -15553, -13148, -19122, -31483, -35976, -27064, -15281, -2073, 5497, 6185, -1215, -5385, 3162, -4216, -16321, -13288, -16304, -5418, -10678, -25268, -28034, -8372, 5666, -937, 9485, 4830, -1396, 4585, -2301, -12737, -23805, -6167, -3648, -5236, -14763, -11305, -21397, -20875, -19453, -4605, -6529, -12064, -17457, -7830, -723, 12241, 15204, 3990, -6572, -18306]
11648a8306M227J619J671q464M475J0932m674o56Q754M537p815p819M727O724
11634f8n799r253r917r191J2529n957K437J2585P217P35p056j4607O38K464j1078
11619c4321K0017J3608O441L698j4408o049m026j5606L675J7788L139l998l006
11606a3048j4046K5504K4756m966l788M008l501m699o71L032j347M947k447q261
11592E473j0246L037q722J6525P22j5540j3883n318J6563J1228j1218K153M214
11579e012Q229j908j0050n509O099J2021R217p834j0523M118m731N828P878j800
11565F023J415r430j2227l055k263N433o21j2809L862l759J1628J2488M690k068
11551f93j0033K360P413j792o658n309k365q860k05J2495O616K423P165o561j3332
$$ y = [-18306, -14079, -12460, -10789, -19253, -14778, -3846, -8520, -9176, -422, 4115, -3700, -11519, -6792, -68, -5867, -15120, -25037, -34228, -21699, -27656, -25219, -12634, -5417, -4682, -11738, -26345, -25707, -23243, -34321, -14304, -696, 5745, 9443, -4965, -11014, -15040, -30646, -26971, -9183, -6044, -10042, -13048, -27094, -1590, 23166, 18200, 14412, 18420, 14919, 10220, 9549, 12581, 11234, 16181, 13734, 5473, -4773, -1736, -10458, 6067, 6789, -8751, -22634, -27952, -11389, -161, -11379, -9226, -5012, 3217, 1309, -8741, -14250, -8151, 3870, 13087, 5253, -5270, -1152, -5883, -55, 7823, 6023, 7438, -1992, -14219, -17274, -19537, -14104, -14725, -27534, -23672, -27431, -15803, -3315, 1375, -693, -10726, -8366, -953, -2745, -9403, -14712, -17077, -25937, -26142, -13647, -7031, -4608, 2557, -4004, -17336]
11536a7336r108j603P114J4618n079j5170j332O515M43Q412J3122n075p494K901
11522i072L804N155p157m307j1496k2595O358J3541Q170M47K061n245P675Q478
11508d183l270l238K799R203M213j2257j1551m408R039K26K671l371L974N689
11494d464m782j2120k424J513L045m575N092P566N745q584m410n165r406J0763
11480b2206M052k928k770K377P503M454J172l242k2072n051O170J1137j702J60
11466b2946N899q119j1069J69J859j832K2767J9471j5213p618L018p345L376J4170
11452c413R101j2228j194J1707k32j0670o671J0225K022l430L529N642m159m907
11438d678r732M452L360m296P820m490j0863R216l666l418N785J0682p504l796
$$ y = [-17336, -26444, -28047, -20933, -6315, -11394, -26564, -27896, -21381, -20938, -12526, 596, -4479, -11973, -9072, -5268, -113, -7270, -11577, -23073, -45668, -39310, -25769, -17599, -17152, -15091, -20336, -12661, -4183, -7453, -10691, -7892, 1311, 5524, -6733, -18284, -22692, -13653, -13427, -10756, -14127, -10153, -4464, -9246, -21366, -23790, -22277, -19232, -23807, -18715, -11149, -5404, -13988, -18398, -23563, -32969, -22206, -18154, -21082, -23852, -21475, -13972, -9518, -8346, -11588, -33660, -38711, -32541, -21404, -23106, -22946, -17047, -25166, -36235, -36066, -34207, -36039, -13272, 6199, -9014, -16632, -13614, -20959, -17583, -3413, 5688, -6540, -7734, 3973, 3741, -6929, -13600, -3375, -1353, -4783, -1254, 4388, 229, -4678, -14410, -9958, -6598, -10894, -3074, -7564, -18427, -9211, -12877, -16295, -10510, 172, -7332, -11128]
11424a1128q18r019p157J0038J2646P885M530n48j420j0034k37j005r88l202j913
11409a2370M262L981N954p726r31J3130J053l685n784j3100J2478N375j0162o269
11395a3794K459r383j34m022p826P507K4139O910o333M546m493j2923l715R003
11381h059k139m45P851L862J5104o30j1126j0306l312n411j2347l842R466J5340
11367e994q047R041N960o426n371p17m813n115R130J752O629L393j4090j0141
11353b4809j9357J0508N634K1204J2985j0606r458R006K0524N949j1627j5004
11341e051J738j2694o676L618M618L455P644R428k695j445J4320j773J10n553
11327I044l043l155j7008k848L1257O609j6435o234j0R48J0126N104m714j3544
$$ y = [-11128, -11946, -20965, -28122, -18084, -5438, 2447, 6977, 6429, 5009, -5025, -5262, -6267, -7255, -10457, -12370, -8108, -4127, 1827, -5899, -6830, 6300, 7353, 3668, -2116, -15216, -2738, 2637, -7525, -13794, -11335, -20718, -20852, -24874, -32700, -25193, -1054, 5856, -477, 4069, -424, -13347, -17062, -8059, -10198, -10643, -2792, 1070, 16174, 15544, 4418, -5888, -9200, -14611, -26958, -30800, -21334, -5994, -14041, -5000, 960, -5466, -10837, -11554, -16367, -21482, -12352, -10600, -3971, -578, -14668, -24809, -44166, -33658, -28024, -6820, 6165, -4441, -13899, -4893, 15631, 21580, 9953, -5051, -3313, -16007, -22683, -19065, -14447, -10992, -3348, 6080, 3385, 1940, 16260, 14487, 14597, 9044, 6001, 2846, -14162, -17010, 14247, 20856, 4421, -1813, -1823, -875, 9251, 14355, 9641, -3903]
11313c903q767j1751o294Q35Q655J6468Q199J3755q533n66o725r612R120M532
11299E413J537j5716j6068n631K652K6218P132J3442J3435o979k1963J1735K3424
11286C8631M6272N5123N6344M3110J1054q534k2661n3073o0083l4541j9834k7389
11274B4419q858k989j3577P919P237J647K696n729N225R470j336j549k611j2309
11260I655q903L157J0110N518k096k768j1611j0819M745L788J1512m467o045L882
11246E658R341O652J0260l384j1678j7016r638o05J4735P275l765K175J085k864
11232H231m995r058j725j0623L603P433J164j508j0224j1447P53J4548n66l46
11218a4760j128k508Q464L713p036R572Q956L489J2883n545j3728L489J1722J0708
$$ y = [-3903, -12670, -24421, -30715, -29880, -21225, -4757, 3442, 17197, 8664, 8098, 1373, -8239, 881, 5413, 6950, -8766, -24834, -30465, -27813, -1595, 5537, 18979, 32414, 25435, 3472, 15207, 38631, 84903, 140026, 196370, 239480, 250534, 242000, 219339, 166266, 106183, 71642, 51808, 24419, 15561, 12572, -1005, 6914, 14151, 15798, 18494, 12765, 17990, 27460, 26124, 24575, 21964, 9655, 752, 3909, 14019, 19537, 17441, 14673, 3062, -7757, -3012, 776, 12288, 7821, 1776, 5658, 14999, 21651, 31911, 28527, 16849, -167, -9805, -10410, 4325, 11600, 7835, 10010, 11095, 8231, 3236, -5822, -7547, -18170, -14567, -7134, -5970, -7478, -17702, -29149, -28396, -13848, -14414, -14760, -15888, -18396, -9932, -6219, -13255, -3683, 5273, 8762, 21645, 16100, 2372, 5861, 17583, 28291]
11204B8291n875J2938P327P20N112J515m206J506K8946J3129L524j9422m350N036
11190G4191j1074p071j6753N700R337P238K410k2691j0661R934j0822j9874l371
11177F493O628O306M447l88J07L938K8360J9219K0809L9175N0007K5307l333j3673
11163A93402J4867j3858n0831n1209l9008k2620j1727m936J951M549J3819j3166
11151B1233n263p198P165J792r64M034N872j5077p301o459m951M689N900j738
11137A734k746j178J683r846N085J2934O561J3973L551M221q999r050n18M115
11123B1520r297j2635j285O727k435o069Q402P908n137j2344k287P739J0479j1654
11109c68j0098P051k159L906O812P963o305M936O877J0779q860r419j4595k0739
$$ y = [28291, 22416, 35354, 42681, 43401, 48513, 50028, 45822, 47328, 76274, 89403, 92927, 73505, 69155, 74191, 63117, 56046, 39293, 44993, 54330, 61568, 63978, 41287, 30626, 40560, 29738, 9864, 6493, 13121, 19427, 23874, 23486, 23593, 27531, 55891, 75110, 95919, 135094, 185101, 210408, 207075, 193402, 208269, 194411, 143580, 92371, 53363, 30743, 19016, 14080, 16031, 20580, 34399, 21233, 15970, 8772, 15937, 17729, 16765, 20799, 26671, 11594, 4293, -2166, -7117, -2428, 3472, 1734, -1012, -2190, -507, -10353, -5268, 7666, 14227, 28200, 31751, 35972, 26973, 17923, 17405, 21520, 12223, -412, -1697, 5030, 2595, -3474, 4928, 12836, 7699, -4645, -6932, 807, 11286, -368, -10466, -3415, -5574, -1668, 5144, 13107, 6802, 11738, 18615, 29394, 20534, 11115, -3480, -24219]
11095b4219N353R74J1794J7056J5466j1768m877J495M434j0042o220j1707o734
11082a8995Q52q228p929P581r325K317K2376l205j5377J437J6883Q366m859J476
11068f630R59M104L078N242p484j4095J5645L362P277r076q657Q841O51k2822
11054a9605j1755R949P778Q503L213n021r606M497K444l07o334O318K4969p871
11040G172j6559l089J3185M13O186m864n621m77K884q50q021K056J2109k616j1037
11025i129M576P289K81N35O22m803j371Q457J7261J3303N001r18o442j174K230
11010C5718P893J4716P819O455K0814J7758J9125L9746K7047l37j6226k2810l3889
10997A23829k7594j9572n817J308j2555o649k898L259j4838o08r749L082J29j7469
$$ y = [-24219, -18866, -17892, -6098, 10958, 26424, 14656, 9779, 11274, 15708, 5666, -554, -12261, -18995, -18143, -26371, -34300, -26719, -36044, -33727, -11351, -14556, -29933, -28496, -11613, -3247, -8106, -6630, -5671, -1567, 1511, 6753, -731, -14826, 819, 4181, 11458, 2382, -6275, 2566, 3217, -19605, -31360, -21411, -13633, -5130, -1917, -6938, -16544, -12047, -9603, -9910, -16244, -9926, 15043, 7172, -9387, -12476, 709, 1122, 7308, 2444, -3177, -3654, -770, -1620, -9641, -7585, 4524, 1908, -9129, -4553, 2736, 3017, 3552, 4174, -629, -2000, 6457, 23718, 37021, 42022, 41104, 34662, 33488, 35718, 43611, 58327, 66146, 72601, 93415, 111173, 130298, 170044, 197091, 196754, 180528, 157718, 123829, 96235, 76663, 70846, 72154, 59599, 52950, 50052, 53311, 38473, 37865, 28116, 31198, 31327, 13858]
10983A3858j7402k463Q11j1658N729O175o989m318J4635k917J6852K6964O599
10970D5876j5106j297J1023K2272J1187R201J7755K6015M4951N9691O3353L3220
10958C28141J4716M893k0638n3549m1133l7426m8601m2088k3760k3892j2409M014
10946D8268k711J1806n036j0230M899p353l822P546j7353m204p50k290L920j114
10932B1576j276J4799o660l289p181n127j010L487k881J2875K3491Q973K827K065
10918F2669R706K4353L6765K9917K2030N203k659m1566m8055j2775j1992j3626
10906E9970j9038j2748R839K537j9915q968M204k70j0011L058Q427o276j411J347
10892A0745M909m116j4308j2985P561k351O988J2233j433M460m675r343L93m01
$$ y = [13858, -3544, -6007, -5196, -16854, -11125, -4950, -11939, -16257, -1622, -4539, 12313, 39277, 45876, 30770, 29473, 40496, 62768, 73955, 83156, 100911, 126926, 171877, 231568, 294921, 328141, 342857, 347750, 327112, 273563, 232430, 195004, 146403, 104315, 80555, 56663, 44254, 48268, 45557, 57363, 52327, 42097, 46996, 39643, 35821, 43367, 26014, 21810, 21060, 18770, 22690, 21576, 20300, 35099, 28439, 25150, 17969, 12842, 11832, 15319, 12438, 25313, 48804, 57777, 60604, 62669, 72375, 96728, 133493, 163410, 185440, 190643, 187984, 146418, 98363, 85588, 73596, 59970, 40932, 28184, 38023, 40560, 20645, 11677, 15881, 15611, 5600, 8658, 17085, 10809, 9398, 10745, 15654, 11538, -2770, -15755, -8194, -10545, -3557, 8676, 7243, 11703, 7028, -2315, -1922, -2323]
10878b323q106P127j0468J554J5240l907n283k724L314o901k477Q13P197J122
10864e822q127K017M656N636J489J522o664j2961O378K363p866O881J2195J5398
10850A7095j994j1257k1177J1180J3971J7766J1944m209j2097J364M119P271o225
10837B7751o796N875r537l896j0778L007R219J722J0948J0692l632n04k67n233
10823B8571j8826j4882r637K902K6250M955o951L409P765o405p598o880r359J0232
10809C546J2233J583j4399n565j3118r693O239J7260Q767J0511J0055J4749L946
10796D6114k495m097p767N300O576k226p13p029q806O52j858j632R317k216j1258
10781A7862J405O253j6949j4028p543p921j80R682M630J3420N085q828K839l327
$$ y = [-2323, -10429, -3302, -13770, -12216, 3024, -883, -6166, -8890, -5576, -12477, -14954, -14141, -6944, -5822, -13949, -11932, -7276, -1640, -151, 1371, -5293, -18254, -11876, -9513, -17379, -10498, 1697, 17095, 15101, 3844, -17333, -6153, 7818, 25584, 37528, 33319, 21222, 22586, 26705, 33976, 27751, 20955, 26830, 17293, 13397, 2619, 5626, 14845, 16567, 27515, 38207, 34575, 34071, 33804, 28571, 9745, -5137, -14774, -11872, 14378, 19333, 12382, 15791, 23556, 17151, 9553, 2673, -6686, 3546, 15779, 17362, 2963, -2602, -15720, -25413, -19174, -1914, 6853, 17364, 27419, 42168, 46114, 43619, 39522, 31755, 37055, 43631, 41405, 40692, 33663, 24857, 25509, 23651, 22019, 31336, 29120, 17862, 19267, 25520, 8571, -5457, -13000, -20921, -21101, -11419, -6789, 6631, 11716, 2888, 5727, 2400]
10767B400N911R639J7056K176q995l606j2778o290J8492m303J95L562J8562J2995
10753E5016J3567L440j7765o704p991J732k123K617m272R50j5191r801n162j3128
10739d815r606Q912L972L157J0077j873j5198o845J7945K206o736l162J007k124
10725c083o943m5L450J1083R292j2040j0191L640K326L349P498J3311K316O691
10711C0654P116J1287J3304m264N910j0304j1551M591M823K043r437k757J867
10698D3282n824k378N621j13j7430j8654n414L29J416J8859J972o991r548K215
10684G342J1192J8891p219o421J1014j0262o466O511J1488M140J1019L683p945
10671D6967j114J3669R196R344J4892N242J0768J2109Q556Q091k09j0842j7322
$$ y = [2400, 8311, 17950, 35006, 37182, 28187, 24581, 11803, 5513, 24005, 19702, 19897, 23459, 42021, 55016, 68583, 72023, 54258, 47554, 39563, 41295, 39172, 41789, 37517, 38467, 23276, 13475, 8313, -4815, -14421, -5509, -1537, 1620, 11697, 9824, -5374, -12219, 5726, 7932, 1196, -1966, -959, -3083, -10026, -10071, -6621, 4462, 13754, 1714, -8477, -4837, -2511, 838, 8336, 21647, 23963, 30654, 37770, 49057, 62361, 58097, 64007, 53703, 42152, 46743, 51566, 53609, 44172, 41415, 43282, 37458, 35080, 40701, 40588, 23158, 4504, -910, -581, 835, 19694, 21666, 14675, 5127, 7342, 18534, 37425, 30206, 23785, 34799, 24537, 18071, 24582, 36070, 40210, 51229, 54912, 46967, 45853, 59522, 68718, 78062, 92954, 98196, 108964, 121073, 129629, 137720, 137511, 126669, 109347]
10658A09347j0725P719O597J0650M617o906P736Q093M346J1046J2719o219l167
10645A55853L049k957k950J626l523o124K285J7350N606O205p873m704Q238L789
10631A75870J4940J2701n732O091N126R600L7503K8537L6631J9157K2495L1430
10619C94349K7694J4447J0913K4551L9593L0820L8107L2582M2053N7143Q8637
10608H00889J03790J02610J30829J66486J76536J93138K35269K72846L18176L71237
10598B871806M85321O55747R03027J266087J787899K445395L213091L922336M297328
10589B1848037M033269K968970J246892p05869k406286l469877l772686l439327
10581A6303123k826644k199881j723247j363473j115946r45346p81139o19595
$$ y = [109347, 98622, 106341, 112938, 123588, 128205, 121299, 129035, 137128, 141474, 152520, 165239, 159020, 155853, 158902, 155945, 152995, 154621, 151098, 144974, 147259, 164609, 170215, 176420, 168547, 163843, 172081, 175870, 190810, 203511, 197779, 203870, 208996, 218596, 256099, 284636, 321267, 340424, 362919, 394349, 422043, 436490, 447403, 471954, 511547, 542367, 580474, 613056, 655109, 712252, 800889, 904679, 1007289, 1138118, 1304604, 1481140, 1674278, 1909547, 2182393, 2500569, 2871806, 3357127, 4012874, 4915901, 6181988, 7969887, 10415282, 13628373, 17550709, 21848037, 25881306, 28850276, 30097168, 29391299, 26985013, 23515136, 19742450, 16303123, 13476479, 11276598, 9553351, 8189878, 7073932, 6128586, 5347447, 4727852]
10573D727852m95765l76689k94026k38388j84565j44488q2809j1197L9143J07000
10563C046068J82980K59131L46089M67214N64956O60651P44646Q01004Q54288
10554G927027R34348J150183J602177K306393L360710M728674O336619P911822
10546C6257953Q901656Q619131O580348K997839j209599m906678p373918q418833
10538D1447899q217351p160351n666498m170237k934319j995176j291250q31940
10530I180777n70573m78982n38423o51056p49995p47141o61619n26038l84852
10521C872098k72584j73007r1437j8660L5332P7769J32650J98402K31071K72444
10511D264078L37838M58690O31816R00122J294981J853987K577676L459789M434083
$$ y = [4727852, 4232087, 3855398, 3561372, 3322984, 3138419, 2993931, 2911122, 2899925, 2939068, 3046068, 3229048, 3488179, 3834268, 4301482, 4866438, 5527089, 6271735, 7072739, 7927027, 8861375, 10011558, 11613735, 13920128, 17280838, 22009512, 28346131, 36257953, 45159609, 53778740, 60359088, 63356927, 62147328, 57240650, 49866732, 41447899, 33230548, 26070197, 20403699, 16233462, 13299143, 11303967, 10012717, 9180777, 8610204, 8131222, 7592799, 6941743, 6191748, 5444607, 4782988, 4256950, 3872098, 3599514, 3426507, 3335070, 3316410, 3351742, 3429511, 3562161, 3760563, 3991634, 4264078, 4601916, 5060606, 5692422, 6592544, 7887525, 9741512, 12319188, 15778977, 20213060]
10502B0213060N179377N356659M552721K633903q300k662175m599550n465421
10494B5200274n266403m445524l434980k515875j822062j319591r58314p04641
10486D732884n57735m67225m08321l65355l02425k84816k63024k39378j95994
10477A648611j46315j27550j30550r9962q4125o6689o8973n9786o5502m7989m7357
10466G03813l6927l9070k4240Q955j822o214k8022j8375j1005k2031j6594o225
10454E02243j1423k4084l4350k7135j6948M52j6957N151l037k1958k6757j7121
10442C08076j2233q772k959R44p764j1484K8108K5956N533j1561l972k3053j4358
10429B72461p922j4786l9500k6942k654K3499K3181K4742L5641O2679O1304O3104
$$ y = [20213060, 25392437, 30749096, 35301817, 37935720, 37927420, 35265245, 30665695, 25200274, 19933871, 15488347, 12053367, 9537492, 7715430, 6395839, 5437525, 4732884, 4175149, 3707924, 3299603, 2934248, 2631823, 2347007, 2083983, 1844605, 1648611, 1502296, 1374746, 1244196, 1144234, 1060109, 993420, 924447, 864661, 799159, 751170, 703813, 666886, 627816, 603576, 612531, 610709, 604495, 576473, 558098, 547093, 525062, 508468, 502243, 490820, 466736, 432386, 405251, 388303, 388755, 371798, 376949, 373912, 351954, 325197, 308076, 295843, 287071, 284112, 285056, 277292, 265808, 293916, 319872, 325405, 313844, 309872, 286819, 272461, 264539, 249753, 210253, 183311, 180657, 204156, 227337, 252079, 287720, 350399, 411703, 474807]
10417D74807P3018N2600J272l8864n5374n6277o4449n0008l4600m4230k3149r726
10405B25020J141p381j1616N492k2544j9033k020N196k44J1081K0494J4380r465
10392B10501k8372k1679p78l089k685l178J1094n488k1112K81M008J2304Q031
10379A59838K636J2926R489K6841O907q393K5570J0806l847k1561N61K888k9547
10366A95114l0363R656J9989J008k1303r486j2870k1236j7810j3654j581K256
10354I9720P406J0145L490J4906J7392J1688o413o645m555k2359m950J8026M697
10341A42548Q642P064k0675j6356Q463q50j61j3195j0792j473M000J0136K944
10328A20295K1577K6257J7025Q680o574j6831j4544j2740j1277j8126k5973l1314
$$ y = [474807, 547825, 600425, 601697, 562833, 507459, 451182, 386733, 336725, 302125, 257895, 234746, 225020, 226161, 218780, 207164, 212656, 190112, 171079, 169059, 174255, 174011, 185092, 205586, 219966, 210501, 182129, 160450, 159672, 156583, 153898, 150720, 161814, 156326, 135214, 135495, 139503, 151807, 159838, 162474, 175400, 184889, 211730, 218637, 210244, 235814, 246620, 242773, 221212, 221773, 224661, 195114, 164751, 174407, 194396, 195404, 174101, 164615, 151745, 130509, 112699, 99045, 97464, 99720, 107126, 117271, 120761, 135667, 153059, 164747, 158334, 151689, 147134, 124775, 119825, 137851, 142548, 151190, 158254, 137579, 121223, 129686, 128836, 128675, 115480, 104688, 103215, 107215, 117351, 120295, 141872, 168129, 185154, 193834, 187260, 170429, 155885, 143145, 131868, 113742, 87769, 56455]
10316E6455l4062m4674p3922m8544k0911J0405L5249J6892K3601L3703K0318K0697
10304d793L139J2651J653k22m200j3575l655J4394k961n340J604M775P606J1214
10290B2290L7493P4920R6816Q5837N1674K0155k898j3374j3111k6408j8788j5157
10278B99449L89K896j3891j2366J2862J2900M850J8890J8482J2812J2963J6725
10266C86961P599Q539J0829K965N285L349p06J600j2482j4249j4151k3523m091
10253C57925J0989J4044J3634K9030K6998K4190L8418N0309K2446J1284n790k1786
10241E71691p064p146J6788M1278K9770L7967L1543M3034M4668K4209j712m34
10229H24592J580M867J0832L895K1221M8129P1002N2985M6390J5137K246K6778
$$ y = [56455, 22393, -22281, -96203, -144747, -165658, -155253, -120004, -103112, -79511, -45808, -25490, -4793, -1654, 10997, 12650, 12428, 8228, -5347, -9002, 5392, 2431, -2909, -1305, 3470, 11076, 22290, 59783, 134703, 231519, 317356, 369030, 389185, 386287, 372913, 359802, 333394, 314606, 299449, 299838, 302734, 288843, 276477, 289339, 302239, 307089, 325979, 344461, 357273, 370236, 386961, 394560, 403099, 413928, 416893, 422178, 425527, 424821, 426421, 413939, 399690, 385539, 362016, 357925, 368914, 382958, 396592, 425622, 452620, 476810, 515228, 565537, 587983, 599267, 593477, 571691, 564627, 557481, 574269, 615547, 645317, 683284, 714827, 757861, 802529, 826738, 825026, 824592, 826172, 831039, 841871, 845766, 866987, 915116, 986118, 1039103, 1085493, 1100630, 1102876, 1129654]
10217A129654K2991L5782K7137L7565L0406K9415N1440P8381Q3151P2907N9767
10206A658596J5427J8372M2205Q1963J30040J40799J50817J51878J59079J67944
10196B717120J53428J54268J88062K47897L12961L88057M72561N22866O14253
10187E771473P17854Q12183R71432J162997J322630J482846J621450J753378J777759
10178A7394002J605137J484187J662441K359364L548606N246905P696884J1363280
10170E2360806J6783350K4521789L5263708N0047048O9862175R2969044J05818758
10163D47626678Q0953121R820279p2014070j15312968j04592339p2283819m5957708
10156A28239174k9816414k0283952j4566410j0960853q431989o467928m874077
$$ y = [1129654, 1152645, 1188427, 1215564, 1253129, 1283535, 1312950, 1364390, 1442771, 1525922, 1598829, 1658596, 1674023, 1692395, 1734600, 1816563, 1946603, 2087402, 2238219, 2390097, 2549176, 2717120, 2870548, 3024816, 3212878, 3460775, 3773736, 4161793, 4634354, 5157220, 5771473, 6489327, 7301510, 8272942, 9435939, 10758569, 12241415, 13862865, 15616243, 17394002, 18999139, 20483326, 22145767, 24505131, 28053737, 33300642, 40997526, 52360806, 69144156, 93665945, 128929653, 178976701, 248838876, 341807920, 447626678, 528579799, 538400078, 466386008, 351073040, 246480701, 174196882, 128239174, 98422760, 78138808, 63572398, 52611545, 44179556, 37711628, 32837551]
10149C2837551l569584k533114j827427j620496j799589k109224k226569k018290
10141A5133258j675912j367903j122669r54732q08627o70358n56227m68902m20328
10132G087600l82974l49601l09720k76480k52447k48023k24750k19890k01073
10123D622642j76867j74218j90557k01896j92662j68093j24431r2475r6324j52412
10113C052707j99731k09742j95121j47691j03094j02289r0323j11053q5910m8261
10103A759492n0004l8077O71p991l5084m9358p1849p7586p7045p5742p7564o2412
10091A137451m4980l0874j5571r127j0990j0967K6l351k3476m1965l1235j3765
10079I01176j4540k539K874p045k8580l2027k4322l83j1729j9556l415k0283l9442
$$ y = [32837551, 29267967, 26734853, 24907426, 23286930, 21487341, 19378117, 17151548, 15133258, 13457346, 12089443, 10966774, 10012042, 9203415, 8533057, 7976830, 7507928, 7087600, 6704626, 6355025, 6045305, 5768825, 5516378, 5268355, 5043605, 4823715, 4622642, 4445775, 4271557, 4081000, 3879104, 3686442, 3518349, 3393918, 3301443, 3205119, 3052707, 2852976, 2643234, 2448113, 2300422, 2197328, 2095039, 2004716, 1893663, 1807753, 1759492, 1709488, 1671411, 1672082, 1664091, 1629007, 1579649, 1507800, 1430214, 1353169, 1277427, 1199863, 1137451, 1092471, 1061597, 1046026, 1036899, 1025909, 1014942, 1014968, 1011617, 988141, 946176, 914941, 901176, 886636, 884097, 886971, 879926, 851346, 819319, 794997, 794614, 782885, 763329, 759914, 739631, 700189]
10066G00189n0080n5683m2447j3192q23O70j4267m346j1119j4209k744o423m298
10053D81228k699l685p921K409j0336j0886j8516Q68N298N944j0570j5114j1644
10040D04376J518N0518P3654J14543J25404N9288j3491m3520n3373l6115k0512
10029F62290j5878j2566q497j9125k2702k0591j3062j6077q326L1114J8807J3951
10017E89338J9582J0473P038J8378Q715o650l8879o4044p9254n3869k0408j4015
10005C76405k2499m819j9311p063j6868n041k878N198J0789J3201P589N532j512
9992C38723k2703k9720j8649k4535j4213k061q236o683R524K377r950K1063J3482
9979B48419K972P58n510q698L619J5247Q032J093q238N686N332k1333j2192K049
$$ y = [700189, 650109, 594426, 551979, 538787, 537964, 538634, 524367, 520021, 508902, 494693, 491949, 485526, 481228, 478529, 474844, 466923, 469332, 458996, 448110, 429594, 430462, 435760, 441704, 431134, 416020, 404376, 405894, 456412, 530066, 644609, 770013, 829301, 815810, 772290, 718917, 682802, 662290, 646412, 633846, 625349, 606224, 583522, 562931, 549869, 533792, 525466, 556580, 575387, 589338, 608920, 619393, 626431, 644809, 653524, 646874, 607995, 543951, 464697, 410828, 390420, 376405, 353906, 349087, 329776, 322713, 305845, 300804, 297926, 303124, 313913, 327114, 334703, 340235, 338723, 316020, 286300, 267651, 243116, 228903, 226842, 218606, 211923, 221447, 223824, 213874, 234937, 248419, 251391, 252149, 246639, 237941, 241560, 256807, 264839, 265932, 257694, 263380, 268712, 247379, 235187, 237236]
9965B37236j4693k0003k4570j4460J063O711Q67J1187J890L506n681p190j0125
9952A65738j790J2519L677O331Q883J152K964K742K025j3458p012J181N883m157
9938A86678n171P507J0865J4135k759j0137j1887o040j981N249n979O036n351
9925A81165J346J455P32j363L848K162j0738L607K524M587k188m192J7994K0622
9911B21561K2506o355P399Q825K47m942N906J3522J5357K1604J1123K4377P433
9898C48563j065q315P531J3230J0886J3872L8655K1763N2223N6775O1968R0359
9886G06445R4270R5538J15291J34250J89395K75139L83755N35054P13949R80445
9876D223531J260487J479500J479147J136487N53263j25821q15603j359012j569876
$$ y = [237236, 222543, 202540, 177970, 163510, 164573, 171284, 172151, 183338, 185228, 188734, 183053, 175863, 165738, 163948, 176467, 180144, 186475, 195358, 196510, 199474, 202216, 204241, 190783, 183771, 184952, 190835, 186678, 181507, 189014, 199879, 214014, 211255, 201118, 189231, 183191, 181210, 186459, 180480, 186516, 181165, 182511, 183966, 184698, 183335, 187183, 189345, 178607, 182214, 184738, 189325, 187137, 182945, 200939, 221561, 244067, 237712, 245111, 253936, 254183, 249241, 255147, 268669, 284026, 305630, 316753, 341130, 348563, 347498, 339183, 346714, 359944, 370830, 384702, 423357, 445120, 497343, 554118, 616086, 706445, 800715, 896253, 1011544, 1145794, 1335189, 1610328, 1994083, 2529137, 3243086, 4223531, 5484018, 6963518, 8442665, 9579152, 10132415, 10006594, 9190991, 7831979, 6262103]
9867F262103j369648j011187p03933m89295l60796k53158j71810j10810p5592
9858A715874o9530o2225l8863k1404k0855j5418L6678O7917J01688J20669J54983
9847A969514K06865K46336L12081L76799M31329M67574N26835O76455R53711J391681
9837G559180J994734K788369L719316M562900M797359M133227K588275O13262
9829C2756622j178101k337588k940181l431170l790973l691519l103185k328203
9821I955702j672070j189358q45530o01712m23132l49487l39807l52518l22973
9812C859115k50446j62121r3008l0167L0216J18197K14993K82839L82548M71244
9802D823410M56490L88266L82143N29733Q81470J333890J929776K663268L593075
$$ y = [6262103, 4892455, 3881268, 3177335, 2688040, 2327244, 2074086, 1902276, 1791466, 1715874, 1646344, 1584119, 1545256, 1523852, 1502997, 1487579, 1524257, 1592174, 1693862, 1814531, 1969514, 2176379, 2422715, 2734796, 3111595, 3542924, 4010498, 4537333, 5213788, 6167499, 7559180, 9553914, 12342283, 16061599, 20624499, 25421858, 29555085, 32143360, 32756622, 31578521, 29240933, 26300752, 22869582, 19078609, 15387090, 12283905, 9955702, 8283632, 7094274, 6248744, 5647032, 5223900, 4874413, 4534606, 4182088, 3859115, 3608669, 3446548, 3353540, 3323373, 3353589, 3471786, 3686779, 3969618, 4352166, 4823410, 5279900, 5668166, 6050309, 6580042, 7461512, 8795402, 10725178, 13388446, 16981521]
9793A6981521M568136N337950N536075M827069L633625K444078R42879j406404
9785D2864929m018374n539200n672106n045244m235698l444657k641590j914508
9777A0353552j334153r72758q11609p64824p11336n96009m76536l72067k83103
9768D031157k14494j51507r2179j9899O3753R2638J02807J19211J37792J53962
9758D223241K27913L60566N34746P63032J092131J527594K058573K601733L063139
9749A6452668L289992L372077L267741K650285J305569l60032j672731k514390
9741B5791179l082621l439087l280471k715823k097579j642274j333399j111494
9733G088431r56406p99861o49118n35579m26317l60597l17752k56017k41779k07216
$$ y = [16981521, 21549657, 26887607, 32423682, 37250751, 40884376, 43328454, 44271333, 42864929, 38846555, 33307355, 27635249, 22590005, 18354307, 14909650, 12268060, 10353552, 9019399, 8046641, 7235032, 6470208, 5758872, 5162863, 4686327, 4314260, 4031157, 3816663, 3665156, 3572977, 3553078, 3616831, 3709469, 3812276, 3931487, 4069279, 4223241, 4451154, 4811720, 5346466, 6109498, 7201629, 8729223, 10787796, 13389529, 16452668, 19742660, 23114737, 26382478, 29032763, 30338332, 29978300, 28305569, 25791179, 22708558, 19269471, 15989000, 13273177, 11175598, 9533324, 8199925, 7088431, 6132025, 5332164, 4683046, 4147467, 3721150, 3360553, 3042801, 2786784, 2545005, 2337789]
9723B337789j58088j34695j04077p5692n9769l3994j3750j0649K5566M9348Q3623
9712A905612J40356K18835L09734M64880O30100Q15972J012589J079870Q72863
9703G450811M45949l4774n11289r59329j209219j146611q98446o28392m32212
9694B076488l37732k57235j92440j41743j09255q1710o5646o2192n7336n7173
9684G14026m1587l2827m6001m3074m6644l6397k1912m439j1741m012j2418j8326
9672C94648k0606k4450p373j8967j5966j9224j6706k788K936j4336o412N493J7884
9659B74133p51r998k023q421j5146L482J1729j643L89r779k0295q84O659k502
9645B24950r820j48O01r63j576o243N455K041j4525n648J2295j2905M073R444
$$ y = [2337789, 2179701, 2045006, 1940929, 1865237, 1805468, 1771474, 1757724, 1747075, 1772641, 1821989, 1905612, 2045968, 2264803, 2574537, 3039417, 3669517, 4485489, 5498078, 6577948, 7450811, 7896760, 7861986, 7350697, 6391368, 5182149, 4035538, 3137092, 2508700, 2076488, 1738756, 1481521, 1289081, 1147338, 1038083, 956373, 890727, 828535, 771199, 714026, 672439, 639612, 593611, 550537, 503893, 467496, 445584, 441145, 429404, 425392, 412974, 394648, 374042, 349592, 342219, 323252, 307286, 288062, 271356, 268568, 271504, 257168, 250756, 256249, 274133, 273382, 263384, 261361, 252940, 237794, 241276, 253005, 251362, 251751, 241972, 221677, 220793, 227452, 224950, 215130, 214982, 215583, 214620, 213044, 206801, 212256, 214297, 199772, 194124, 206419, 193514, 197587, 207031]
9631B07031k63j7950j1121j3926j0202j972J538M338l337o609Q138O639M473J1333
9617A78110l261j4611J460K708j6666o461j822j815Q21Q220p287j204P539j0935
9603A34796j3138R861J0177J482J0381P522j5049P548Q637K976M613j8316m441
9590A47049j6074q090j283j049l444k986P483M025j917o875k4526p339J0608p89
9576I4793m102L764J864o912J7446O853j8874R89J2172K646j6451J7742M167k160
9562A13937k095p117N005J7758n117j430R321j278n440j1071L102P446n359k2136
9548I5526j7454j0190M250Q036k186M495p73K318j879j2144q756o817p602O21
9534D7445N465P52L942J1815L360k925J175O667J039k65N29j6681m305O706R944
$$ y = [207031, 206768, 188818, 177697, 163771, 153569, 151597, 153135, 157473, 154136, 147527, 155665, 162304, 166777, 178110, 174849, 160238, 161698, 164406, 147740, 141279, 139457, 137642, 138463, 146683, 139396, 138192, 145731, 134796, 121658, 131519, 141696, 143178, 153559, 161081, 146032, 153580, 162217, 165193, 169806, 151490, 147049, 130975, 122885, 121602, 120553, 117109, 114123, 121606, 125631, 123714, 116839, 92313, 84974, 95582, 94793, 90691, 94455, 96319, 89407, 106853, 113706, 94832, 95821, 107993, 110639, 94188, 111930, 116097, 113937, 111842, 104725, 109730, 127488, 122371, 120941, 130262, 128984, 123544, 112473, 115575, 123021, 117662, 95526, 78072, 67882, 72132, 80168, 77982, 82477, 81704, 84022, 82143, 69999, 61243, 54426, 46824, 47445, 52910, 53662, 57604, 69419, 72779, 69854, 71029, 77696, 78735, 78470, 78999, 62318, 58013, 64719, 74663]
9519G4663K014r117r339O951J3980L086Q698Q334J946n151j2613P454L247j7335
9505G6818j3252J2597J5458M09j3834n465p235n888j397n10o632O874J8642J2199
9491H8784M74k1309k3400j1358J1284J5715R360p310j0185p997J9567J4088k635
9478G5078k296O560k722J7467J7063l986p404m262j702M330K4261J4474J789K405
9464A41055j0495k2856o963j459R729o346o688j2364l493p322K978J4408k126
9451H8058j4042q217R226K977N78j1930K584J815J923n511Q8j127m883L67M312
9436F6218R882L363n08m523O164L1750L9811L6330J6268P478J31j764j2512N69
9422A98657j906j2685l2360j7678j9689n46q705r439L71r362j1126n087M567L69
$$ y = [74663, 76677, 67560, 58221, 65172, 79152, 82238, 90936, 99270, 101216, 96065, 83452, 90906, 94153, 76818, 63566, 76163, 91621, 92030, 78196, 72731, 65496, 59608, 58211, 57701, 51069, 57943, 76585, 88784, 89258, 67949, 44549, 33191, 44475, 60190, 69550, 62240, 52055, 44058, 63625, 77713, 75078, 72782, 79342, 76620, 94087, 111150, 107164, 99760, 95498, 93796, 98126, 122387, 136861, 138650, 141055, 130560, 107704, 100741, 99282, 109011, 102665, 95977, 83613, 80120, 72798, 75776, 90184, 88058, 74016, 65799, 75025, 78002, 78580, 66650, 69234, 71049, 72972, 67461, 67549, 66422, 61539, 61906, 66218, 76100, 79463, 78955, 74432, 80596, 112346, 152157, 188487, 204755, 212233, 212364, 210600, 198088, 198657, 196751, 184066, 151706, 134028, 114339, 113793, 105088, 95649, 96020, 86658, 75532, 70445, 75012, 75381]
9408G5381j5654P898P879O053m950j1640j0255K88J6505R952N622N74K797K46
9394I0696k0348j1569J3684J0184J7977J9076K2558K1950M3678L3636L628j546
9382B43604Q91N313n254k2168l6025l5828k9300r228j6272O135k436k361J408
9369I8479M961r868j9360k1286j6278P55J6572R872R59n140o600j369L303o81
9355E4319Q333K855K4137J5041j2664j1162R034Q252O357P408P308K4043J2588
9342A55849O701K4744M689l318j5550j5747q498j4220l0515k9604j9689j1199
9330D3643N379M156K386M374m361Q690L254j4376j3915m260L981P665N162k1642
9316C0136n293R086J1996j0705p543P822O385n73k916j7702r624K3805J2463J4077
$$ y = [75381, 59727, 67625, 75504, 81557, 76607, 64967, 54712, 55000, 71505, 81457, 87079, 87653, 90450, 90696, 70348, 58779, 72463, 82647, 100624, 119700, 142258, 164208, 207886, 241522, 245150, 243604, 244495, 249808, 244554, 222386, 186361, 150533, 121233, 112005, 95733, 101868, 99432, 97071, 98479, 103440, 93572, 74212, 52926, 36648, 37403, 53975, 63847, 64806, 59666, 53066, 51697, 55000, 54319, 62652, 65507, 89644, 104685, 92021, 80859, 89893, 98145, 104502, 111910, 119218, 143261, 155849, 162550, 187294, 191983, 188665, 173115, 157368, 148870, 134650, 104135, 74531, 54842, 43643, 49022, 53178, 55564, 59938, 55577, 64267, 67521, 53145, 39230, 34970, 38951, 46616, 51778, 30136, 24843, 33929, 45925, 35220, 27677, 35499, 41884, 41311, 38395, 20693, 11069, 34874, 47337, 61414]
9302F1414n72j0049j722Q402L431R84O993n794j6223p133o162m723k158l526J5100
9287C8262O879p832q727j2340n983P074O451o99m606N028Q818k406M884R14J2557
9272D8274p882p71Q9L660O426o758j6407L492J868q290J4790K816q561j0001j3240
9257I505m930J1835K8082M033n435j2581N938R22K776Q05l282j9018j4152O573
9243A1071N069r262k494J3010J4536K831p869m135R345M374J215j3938q551q12
9229A4390Q217N914j5687O475J5130R781R865j0149o93N587j1028j2562J950j66
9215B7024q73Q326J1616J850m614l319q299j5207j1340p711K071Q431Q062j0372
9201E645N684K16q615O625J102J8787J2200j3305K178P224N162k842k730n629
$$ y = [61414, 60842, 50793, 49071, 57473, 60904, 61888, 68881, 63087, 46864, 39731, 33569, 28846, 26688, 23162, 38262, 45141, 37309, 28582, 16242, 10259, 17333, 23784, 23085, 18479, 23507, 32325, 29919, 34803, 35717, 48274, 40392, 39621, 39710, 43370, 49796, 43038, 26631, 30123, 31991, 23701, 38491, 41307, 32746, 22745, 9505, 4575, 16410, 44492, 48525, 43090, 30509, 36447, 37369, 40145, 40950, 37668, 18650, 4498, 11071, 16140, 6878, 4384, 17394, 31930, 34761, 26892, 22757, 32102, 36476, 37691, 23753, 15202, 14390, 22607, 28521, 12834, 19309, 34439, 44220, 54085, 43936, 43243, 48830, 37802, 25240, 27190, 27024, 26151, 34477, 46093, 47943, 43329, 40010, 31711, 16504, 5164, -2547, -476, 7955, 16017, 5645, 11329, 11545, 2930, 9555, 10657, 29444, 41644, 28339, 30517, 37741, 42903, 40061, 37331, 31702]
9187C1702l635r96N7M530q693j3063j761N306l065J7330N543j3241j8277k787
9173a050M725N748M736L01J033J2202r44n677J0682Q15j3543j308j0308o414R8
9158A096M805R281J2461j0196M298J0396K326J0539j5204j0738p694l176n845
9145B349j270J4929J0680l061j5383l864N444n112n180J0260P934J0637j0004
9132A8359j4152j3568j007P310J4168L934Q80j6347j6959j1649K7165L2827L143
9119C4104n238k862p409M7j2377o331L806J4469M475J118L582n59j282N723O281
9104C7547o533j0457J0514J2095m834k714M508p34m178k240J0511l784n552k3712
9090A0437r358L764J5507M02o520m769M715Q747O184J903m719n358M639j988k331
$$ y = [31702, 28067, 27071, 27128, 31658, 22965, 9902, 8141, 13447, 10382, 27712, 33255, 20014, 1737, -1050, 3675, 9423, 14159, 14460, 15493, 27695, 26751, 21074, 31756, 32571, 19028, 17720, 7412, 998, 1096, 5901, 15182, 27643, 17447, 21745, 32141, 34467, 45006, 29802, 19064, 11370, 8194, 2349, 1079, 16008, 26688, 23627, 8244, 4380, 9824, 4712, -468, 9792, 17726, 28363, 18359, 4207, -9361, -10368, -3058, 11110, 15044, 15924, -423, -17382, -29031, -1866, 30961, 34104, 28866, 26004, 18595, 18642, 6265, -66, 3740, 18209, 22684, 23802, 27384, 26825, 25543, 31266, 37547, 31014, 20557, 31071, 43166, 38332, 35618, 40126, 39392, 35214, 32974, 43485, 39701, 34149, 10437, 1079, 4843, 20350, 20752, 14232, 9463, 14178, 22925, 29109, 31012, 26293, 20935, 25574, 23586, 21255]
9075B1255j1490p75O57J0189R348r173r515R677N921j602J505K125k132l353q415
9060A4222j126R931j0171j4908O450P194J3113J0681O627p288k513L163K458m537
9046C3296o392o318N982J453q60q046m662J906M960q553j4492J186J384R174o076
9031C942M733N867p40Q362J1962j0274j0285q017P450L847K549j522o505n424
9017E945K027L04R015P692n29k267J76k283O942j1438k813j769j0282j418J2008
9002A1310K3435p78r55o548k831Q480o893r13l601j3756m470J3050N783j2313
8988I000j5149J3505M741n336q045m32o157k19O286K0236M397N643N937n916R07
8973B9398K093r430j5803Q50O225j39r112j122N277q915j3925K0816K5632J6986
$$ y = [21255, 9765, 8990, 9647, 19836, 29184, 20011, 10496, 20173, 26094, 24492, 25997, 28122, 25990, 22637, 14222, 13096, 23027, 12856, -2052, 4398, 11592, 24705, 35386, 42013, 34725, 32212, 35375, 37833, 33296, 26904, 20586, 26568, 28021, 27161, 19115, 14453, 16359, 21319, 12766, -1726, -540, 844, 10018, 3942, 8675, 14542, 13802, 22164, 34126, 23852, 13567, 5550, 13000, 16847, 19396, 17874, 11369, 5945, 7972, 8276, 17291, 24983, 24454, 22187, 22363, 20080, 27022, 15584, 12771, 11002, 720, -698, 11310, 34745, 33967, 33012, 26464, 23633, 32113, 25220, 24307, 20706, 6950, 2480, 15530, 21313, 9000, -6149, 7356, 12097, 6761, -1284, -1716, -7873, -8092, -1806, 18430, 22827, 28470, 34407, 28491, 29398, 31491, 22061, 6258, 7108, 13333, 13194, 4082, 2960, 8237, -678, -14603, 6213, 31845, 48831]
8959D8831l088l500n212k3488j2744l654j387l988K403K3169J3304L950o262j0433
8945A7901n919o083l141o219L527K190J4726p28j5205Q835J6741j0657Q92j0442
8931F418r2J224j0524n954J0633P419n292Q804R425J1942J7183P447o377j3900
8917C8356j3247o263o751L801J1049J714J377m528J949J9821N718P814j406m090
8903E5314j575j0980q176j8948j1206L217J2394R263K274j2204P218o853m090
8890A5648J2909j508q230p94J443L850p393q517m773Q603k690o418J1119O260
8876A9509N816N404L071p697j5245O934M714r460Q658L4344K2313L0215J4790
8863A23366J8330r574k7650k6041j5033j1072j1560P47j593m755k801N275q498
$$ y = [48831, 45743, 42243, 37031, 13543, 799, -2855, -4242, -8230, -5827, 17342, 30646, 34596, 28334, 17901, 11982, 5899, 2758, -3461, 66, 2256, 16982, 16254, 1049, 9884, 26625, 15968, 16860, 6418, 6326, 7550, -2974, -8928, 1705, 9124, 3832, 12636, 22061, 34003, 51186, 58633, 52256, 38356, 25109, 18846, 12095, 15896, 26945, 28659, 30036, 25508, 27457, 47278, 52996, 60810, 59404, 55314, 53739, 42759, 34583, 15635, 4429, 7646, 20040, 29303, 31577, 19373, 26591, 19738, 15648, 28557, 27049, 18819, 18025, 19468, 23318, 15925, 7408, 2635, 11238, 8548, 2130, 13249, 19509, 25325, 30729, 33800, 26103, 10858, 17792, 22506, 13046, 21704, 56048, 78361, 108576, 123366, 141696, 132122, 104472, 78431, 63398, 52326, 40766, 41513, 39920, 35165, 32364, 37639, 29141]
8850B9141L066N145j0810j5461M010q129j823o528l155r049N200l414N762N311
8836g34j183n311M743o003j260J6140J1486l376m805N103J1304J6765o544k6837
8822I488n244J3064J0617o302r502J407P138K1607R27n864k303j5596p537k978
8808H922l996J5156k850L63K641j9586k909j38o718O354M317K027P454L21m256
8793G102N56j191J5407J183m401o288J1043P534q246r01p112p003O93K591R963
8778B0930o400m390j08O661L24n214l197J242j5936n749J4155O296M556J90j162
8763A2198n739q312N805k918k439p238N70j0205J573J1010n64Q501N844J402M707
8748A4195p303j6858J345k337J2592K1495P71l371j120j3691o063N571J5439J3791
$$ y = [29141, 32207, 37352, 26542, 11081, 15091, 6962, 5139, -1389, -4544, -13593, -8393, -11807, -6045, -734, -1917, -7228, -2485, -8488, -9748, 6392, 17878, 14502, 9697, 14800, 26104, 42869, 36325, 9488, 4244, 17308, 27925, 21623, 12121, 13528, 20666, 42273, 43200, 37336, 35033, 19437, 11900, 8922, 4926, 20082, 17232, 17595, 20236, 650, -2259, -2397, -9115, -2761, 1556, 3583, 11037, 11358, 7102, 7658, 6467, 21874, 23057, 18656, 12368, 23411, 30945, 22699, 21798, 14686, 7683, 8376, 10967, 20930, 14530, 10140, 10032, 16693, 17017, 11803, 8606, 9848, -6088, -11837, 2318, 8614, 13170, 13360, 12198, 6459, -1853, 3952, 1034, -1405, -8643, -8073, -18278, -16705, -5695, -6259, 2242, 8086, 9488, 14195, 6892, -9966, -8621, -10958, 1634, 23129, 23900, 20529, 19409, 5718, -345, 5226, 20665, 34456]
8734C4456J229K690Q861o330j1869o426J1318j6365r227k938k127M252r245j1163
8720a2884J38k990Q781K960L411P559p592Q583N944j965Q747r63K255L672q63
8705B4793P818n307J583P951q272k118j2102j6726J1709J4707p423o330o280K1708
8691B5711j0952j3786J5540J1122n545P089j4N170J1889L013m943j1971j498m733
8677B6092j490J5556o317j8353j1694p939J5969K5074j486j4195q684j3908p190
8664h565J4460l934M227Q997P242J5755k247k075J0158n030p806l364j2807j2438
8650B573M52R66N509Q929N540O035K874p306j1875L992r28N411k101R37O380P015
8634C4403p963j6839k209N248j354m213L193l608p004m37R225J7711R517L914
$$ y = [34456, 35685, 38375, 47236, 40906, 29037, 22611, 33929, 17564, 8337, 5399, 3272, 7524, -1721, -12884, -12746, -15736, -6955, -3995, -584, 6975, -617, 7966, 13910, 11945, 20692, 19729, 21984, 25656, 24793, 32611, 27304, 28887, 36838, 28566, 26448, 14346, -2380, 9329, 24036, 16613, 10283, 4003, 25711, 14759, 973, 16513, 27635, 22090, 29179, 29165, 34335, 46224, 49237, 44294, 32323, 30825, 26092, 24602, 40158, 33841, 15488, 3794, -4145, 11824, 36898, 35412, 21217, 12533, -1375, -8565, 5895, 1961, 6188, 15185, 22427, 38182, 35935, 33860, 44018, 38988, 31182, 27818, 15011, 2573, 3025, 3991, 9500, 18429, 23969, 30004, 32878, 25572, 13697, 17689, 16761, 22172, 20071, 21008, 27388, 34403, 26440, 9601, 7392, 12640, 11286, 7073, 10266, 6658, -346, -783, 8442, 26153, 35670, 39584]
8620C9584l777j5112L436J3661j1026j1428q074J581J2765J0170l778K491M39
8607C0932o934R284P926m990L913j945r202j0037q112m3K438J1823P084o50J0558
8592D2045L739k229n500o346j712K890j0145o196P54j874J8596Q432R782m966
8578D7270p533m24n673j0171K974P039j1866q13M961l329m567j9517J960l501
8564c190j322j1232N462J1526J2371J686j8094Q576K1154m28r051q12N868R247
8550C1761O765j5126m454J6494K680k486n982m241j4298o174O745j965j2290P834
8536E263Q954N399q773j5703j009R536J3067L673l174j0136k257k334k6519l080
8522b7093J2421m791K460J0087J7079J115J872k331q541m030J6251J934p077N497
$$ y = [39584, 35807, 20695, 24131, 37792, 26766, 15338, 7264, 8845, 21610, 31780, 28002, 30493, 30932, 23998, 33282, 41208, 36218, 40131, 38186, 28984, 18947, 10835, 10792, 13230, 25053, 32137, 31487, 42045, 45784, 43555, 38055, 31709, 29997, 32887, 22742, 16546, 17300, 15426, 34022, 42454, 52236, 47270, 39737, 39313, 33640, 23469, 26443, 33482, 21616, 20803, 25764, 22435, 17868, -1649, 311, -3190, -4512, -15744, -10282, 1244, 13615, 15301, -2793, 5783, 26937, 26509, 17458, 16646, 22514, 31761, 38526, 23400, 18946, 35440, 38120, 35634, 29652, 25411, 11113, 4939, 11684, 9719, -2571, 5263, 14217, 19616, 10843, -4860, -5869, 3667, 16734, 20407, 17233, 7097, 4840, 2506, -24013, -27093, -14672, -19463, -17003, -6916, 10163, 11278, 13150, 10819, 2278, -1752, 14499, 16433, 9356, 14853]
8508A4853P532J909O83m615p408m194J6613j2061j3460L35J3448j1398j4899N086
8494g576J5867Q662l789m420R000J3198q327L367M33k057l045Q977M501n896N874
8479C4769N219j9266j8819O959j0697j2616J113J7827K823R188L015o702p138
8466E675o259J1222J2090L515L162j0311j2119K267j631l38L278J024l302J50
8452H423l692j5159M003M552J4910K46j0475n119l096M623K5515m363P64o727
8438A4405j8903M479J5160N147p981n207j3625l214J4265j037k0487K444K4703
8425A0149N461L797L381j2417J6836L647o344M778N40N772m210N408j0289j1059
8411A5450L80r993O50k268j083J477Q65r699n020N856L501j422o844K257m302
$$ y = [14853, 22385, 24294, 24977, 20362, 12954, 8760, 25373, 13312, -148, 187, 13635, 2237, -12662, -7576, 8291, 16953, 13164, 8744, 17744, 30942, 22615, 25982, 26415, 24358, 21313, 30290, 34791, 28895, 34769, 39988, 20722, 1903, 8862, -1835, -14451, -13338, 4489, 7312, 16500, 19515, 12813, 5675, -584, 10638, 22728, 26243, 29405, 19094, 6975, 9242, 7611, 7273, 10551, 11575, 8273, 8423, 4731, -10428, -6425, -1873, 13037, 13283, 2808, -2311, -5407, -784, 24731, 20368, 21132, 14405, -4498, -19, 15141, 20288, 12307, 7100, -6525, -9739, 4526, 3489, -16998, -14554, 10149, 15610, 19407, 22788, 10371, 27207, 30854, 24510, 29288, 29828, 35600, 31390, 36798, 26509, 15450, 15830, 5837, 6487, 4219, 3136, 4613, 5478, -4221, -9241, -3385, 116, -1306, -8150, -5893, -10195]
8396a0195N720N105N006j1469l250p308j4215N300J6663J4902R303K345p310n76
8382A0021J1368J0764p167n447r580p329K946R70j146N34R459l244K603k028n84
8367A2140j0497j3734J2202N105N76Q537m685p207r18M746k723M037j3926n581
8353a1928Q793J5258J1273j5152p603J0729o088k0322L101J8185L845J326Q083
8340A9500R801P460j275m483k118o043r121L514o503o333m15l396P857O344j2692
8325B097L488R384J913j830K132k349n025j1147j3978O624K4841J9386J765j2603
8311B4698J2238R799j0835q428O038q786r582J259OK679M921Q29Q47k781o901
8296A6001J885K31j033o779n09p68L871J403j6267j1856O971R672P166J8352n75
$$ y = [-10195, -4475, 630, 5636, -5833, -9083, -16391, -30606, -25306, -8643, 6259, 15562, 17907, 10597, 10021, 21389, 32153, 24986, 19539, 9959, 2630, 5576, 6546, 5400, 5934, 15393, 12149, 14752, 12724, 12140, 1643, -12091, 111, 5216, 5792, 14329, 9644, 2437, 1519, 6265, 3542, 7579, -6347, -11928, -3135, 12123, 23396, 8244, 641, 11370, 5282, -15040, -11939, 6246, 10091, 11417, 19500, 29301, 36761, 35486, 31003, 28885, 22842, 13721, 17235, 10732, 4399, 3984, 588, 8445, 14789, 2097, 5585, 14969, 16882, 15052, 17184, 14835, 9810, -1337, -15315, -8691, 16150, 35536, 37301, 24698, 36936, 46735, 35900, 27472, 33510, 24724, 15142, 16401, 16407, 19086, 24007, 24836, 25683, 22902, 16001, 17886, 18117, 17084, 10305, 9796, 9028, 12899, 14302, -1965, -13821, -6850, 2822, 9988, 28340, 27765]
8281B7765k45n797J779j858M315P054m420N202Q237m510J749q630m939Q423J5130
8266D9255K6549J5292l328l0462k8237j4351K303K505J643q534j1731k867J2040
8253A0077J5492O993m97j896n308j3659n968J743l052J1547m694J714R486k902
8239A9076n53j958P448J2885q827p650J126m924J3832p896j1946Q997L205j3471
8225I344L299L283J4389j599M168L771P26k510k2133L541J804m422M654J0458
8211B8773M163Q196j6407j6938q806p69M966O715P563P799j315m605m457q46K664
8196A6696L136R31p574N511l229m932m956o766n233P03J690l546p540J4142K026
8181A059K148m123j5168j2250J0357J7363J3351r278j1112R85Q018O901K300j965
$$ y = [27765, 27520, 21723, 23502, 21644, 25959, 33013, 28593, 33795, 42032, 37522, 39271, 30641, 25702, 34125, 49255, 75804, 91096, 87768, 57306, 29069, 14718, 17021, 19526, 21169, 12635, 904, -1963, 10077, 25569, 32562, 32065, 30169, 24861, 11202, 5234, 6977, 3925, 15472, 10778, 12492, 21978, 19076, 18523, 16565, 24013, 36898, 28071, 20421, 21547, 16623, 30455, 22559, 10613, 19610, 22815, 9344, 12643, 15926, 30315, 28716, 32884, 36655, 37381, 34871, 12738, 16279, 18083, 13661, 18315, 28773, 32936, 41132, 24725, 7787, -1019, -1788, 3178, 9893, 17456, 25255, 23940, 19335, 14878, 14032, 16696, 19832, 20763, 13189, 18700, 15471, 10539, 5583, -1183, -6416, -5713, -4023, -7569, -15109, -967, 1059, 3207, -916, -16084, -28334, -17977, -614, 12737, 3459, -7653, -6668, 1350, 8251, 10551, 8586]
8167H586J719K304m901l041m480Q9M45J5015J2342l185j8534k4008o985L158J7017
8152d459J324m829J1345J0921L648P52j1486k65k920L206M464l48L265k499j227
8137A0892L860j4570o555O213L691o405P294J1562J4174p5o451p880j7089N613
8123D274q6m554O81j4079J386N362p00k718k734J4793P430m934j0142L142O012
8108C133m144m750p93M829M113n856M355L054k022l455P486L564K498o047j3910
8093g945Q650N394j2384m156J732J1720N573n938o708l609n123L831ro679k528
8078a8179O335J1069R064j3401j3972p105Q850P566n893L761J9434J0025l597
8065A3957j2519r445J6041Q752K60o869m111J352J0484O120J3683K913r383m583
$$ y = [8586, 10305, 12609, 7708, 4667, 187, 276, 721, 15736, 28078, 24893, 6359, -17649, -24634, -21476, -4459, -3135, -7964, 3381, 14302, 17950, 18702, 7216, 6951, 4031, 7237, 11701, 11353, 14618, 12119, 10892, 14752, 182, -6373, -160, 3531, -2874, 4420, 15982, 30156, 30081, 23630, 15750, -1339, 4274, 4188, -366, 315, -13764, -12378, -7016, -7716, -10434, -13168, 1625, 9055, 4121, -6021, -2879, 3133, -1011, -5761, -6554, -1725, 2388, -3468, 887, 3941, 1919, -1536, 5950, 9514, 12012, 5965, -7945, 705, 6099, -6285, -10441, -8709, 3011, 8584, 2646, -4062, -7671, -12794, -8963, -8972, -15651, -18179, -11844, -775, 8289, -5112, -19084, -26189, -17339, -9773, -15666, -11905, 7529, 17554, 13957, 1438, -8007, 8034, 16786, 17046, 10177, 6066, 7418, 17902, 24022, 37705, 40618, 31235, 26652]
8051B6652N873n449q479n351k187J2906Q241k800o550J283q057N849j0256M51
8037A2126r274q669J338j49l096J4202M122r816q823N807O937J6348J9441k161
8023C8333o778r583j587n620J857N819R206j980K179j768J111M500J4701O870
8009E7260J1436L486p679q479r976k672P157k650q675L781o958o100j0241j1552
7995H138r224P308P999R11Q52k028O808K852j475O178O703L272r220P624J5398
7980E2096O077J2794j420m432P876J204n923n378j0273K44p837m849M419M506
7966D9104N140P8M180M04K831J2187p234m141k3125q754Q433M75j2013k7203p068
7951f706O018j475J8464L062l480l623R14K188R97j4107L405J4159l95r357P468
$$ y = [26652, 32525, 27076, 18597, 13246, 11059, 23965, 32206, 29406, 22856, 24139, 16082, 21931, 11675, 12126, 2852, -5817, -4479, -4628, -7724, 6478, 10600, 784, -8039, -2232, 4705, 21053, 40494, 38333, 31555, 21972, 20385, 14765, 16622, 22441, 31647, 29667, 31846, 30078, 31189, 35689, 50390, 57260, 68696, 72182, 64503, 56024, 46048, 43376, 50533, 47883, 39208, 42989, 36031, 29931, 19690, 8138, -1086, 6222, 14221, 15132, 15984, 13956, 20764, 23616, 22141, 28319, 35022, 38294, 29074, 36698, 52096, 58173, 70967, 69547, 65115, 72991, 74195, 68272, 62894, 52621, 52865, 45028, 40179, 44598, 49104, 54244, 54322, 58502, 58906, 61737, 73924, 66690, 62549, 39424, 30670, 39103, 39578, 27565, 362, -6706, -688, -2163, 16301, 19363, 15883, 12260, 13174, 15362, 16359, 2252, 5657, 19816, 19421, 10064, 17532]
7936A7532M445p294K849J4655J108J481Q09Q598J8730Q209p958k0793l5116K294
7922I549J7867M153j926R373J8764k3989j2511P14J76k85j0362q27J6228L160
7908C0084j4250j5547j291J5909O734J2837q441j2815M964q21l434o537Q466k352
7894A3506K97J0062k791r035r35J5369N204j2979j2265o79k455n411O781J456
7880F125P209k546p952M945j0030r174P129J2940o422J551J729j3789l741R759
7866b267O1J059j297J2701J255M455j92j1198n112N582j661k224R964O226m66
7851A6886j4706n854J0484R525O52n568k169r014J502R183K079J015m841j0782
7837a608m26l47N582p752K42J6122J3806k7412j5688l690P825M431j418p203O617
$$ y = [17532, 21977, 14683, 17532, 32187, 33295, 34776, 35585, 44183, 62913, 71122, 63164, 42371, 7255, 9549, 27416, 31569, 29643, 39016, 57780, 33791, 21280, 21994, 22170, 21885, 11523, 10696, 26924, 30084, 15834, 287, -1004, 14905, 21639, 34476, 26035, 13220, 18184, 17363, 13929, 7392, 15858, 13506, 13803, 23865, 21074, 12039, 11104, 26473, 31677, 18698, 6433, 5754, 3299, -2112, 4669, 6125, 13334, 10788, 2836, 7781, -2249, -11423, -4294, 8646, 2224, 3775, 5504, -8285, -12026, -2267, -2206, -1147, -2444, 10257, 11512, 15967, 15775, 4577, -535, 5047, 3386, 1162, 11126, 17352, 16886, 2180, -3674, 6810, 16335, 16987, 11419, 9250, 236, 1738, 10921, 13000, 14015, 9174, -1608, -2034, -2381, 3201, -4551, -4309, 11813, 25619, -1793, -17481, -21171, -13346, -8915, -10333, -17536, -10919]
7822a0919j646j3725J40J3187J2296j2452O777k865p9J698Q745P994O470k939
7808A2682J129Q55j2982q60J653J0163R258p264j822K591K565K008N040j701n194
7793A8121j2676O240j2050q851o529O975o373l025K2135J2635j2487o686k01l168
7779e940q630R402J2681J2963K111J1662j6548k5151J0493k852j4662J795k097
7766a4773N463r515R579P004J260Q60Q953K748L038l009l859j7399o889J3084
7752c455N867j5745n377O725n619j3590M967K2624j636o720N763J7449n70J338
7738A2021J905J447n360r301Q800J4191n795n432j784l740o134j5787L481Q397
7724c091j809J4127N163q808r566l926N476k892O1N416m563q526J4985Q222j8805
$$ y = [-10919, -12565, -26290, -26150, -12963, -667, -13119, -6342, -9207, -9286, -7588, 1157, 9151, 15621, 12682, 13811, 14666, 1684, 824, 2477, 12640, 21898, 14634, 12812, 15403, 17968, 19976, 25016, 23315, 18121, 5445, 11685, -365, -9216, -15745, -8770, -15143, -18168, 3967, 16602, 4115, -2571, -2772, -5940, -14570, -5168, 7513, 20476, 22587, 34249, 17701, -7450, 3043, 191, -14471, -12676, -14773, -9310, -18825, -9246, -2242, -982, -122, 8831, 11579, 14617, 11608, 7749, -9650, -16539, -3455, 2412, -13333, -18710, -11985, -17604, -31194, -26227, -3603, -5239, -11959, -6196, 11253, 10683, 12021, 13926, 15373, 10013, 712, 9512, 23703, 17908, 12476, 10692, 6952, 818, -14969, -11488, -3091, -4900, 9227, 14390, 5582, -3984, -7910, -2434, -5326, -5265, 151, -4412, -12938, 2047, 10269, -8536]
7709h536q805O386n400k830J052m840k032O026Q631n623K584M997q029M266L677
7694h476N541K248n797J877J446K676Q658o347J178N719k768P90j0648q913r607
7679b2423l415K960Q238J7943N914j2696K3J0584J161K115k164q60R984J103j3358
7664E109j628k838M447r48M470l658r633L216L747rj4049k0543N882J3632K2656
7649I853R429r994j971P107M535K138n457M20p011p983k265o880l646L212M971
7634c542M342k415N54M210j1399l767J4041O400j2284q029n828K497Q231N53n653
7619a2089L990j608L808K961k121L824l580J006o695N264Q681P563r672m269M677
7604A740Q552o652p317m07J0986K1248J905q857k484q966M686P079J5562j3093
$$ y = [-8536, -17341, -10955, -16355, -19185, -18133, -22973, -25005, -18979, -10348, -15971, -13387, -8390, -16419, -12153, -8476, -2935, -687, -6484, -4607, -3161, -485, 8173, 1826, 3004, 8723, 5955, 6745, -3903, -12816, -22423, -25838, -22878, -14640, 3303, 9217, -3479, -3456, 7128, 8289, 10404, 8240, 7380, 17364, 18467, 5109, 3481, 643, 5090, 4142, 8612, 4954, -4679, -1463, 2284, 2275, -11774, -32317, -26435, -12803, 9853, 19282, 9288, 7317, 14424, 18959, 21097, 15640, 16060, 9049, 1066, -1199, -8079, -11725, -8513, -3542, 800, -1615, -1061, 3149, -8250, -12017, 2024, 8424, -3860, -11889, -17717, -15220, -6989, -6436, -12089, -8099, -9707, -5899, -2938, -5059, -1235, -4815, -3809, -10504, -5240, 3441, 11004, 1332, -2937, 1740, 10292, 3640, -3677, -4084, 6902, 28150, 30055, 21198, 18714, 9748, 14434, 21513, 37075, 23982]
7590B3982q003J21l566j262N17p43q359O179n624L734Q582j2966j7938Q716J4596
7575G966J5668j836k012n228j4016P888R03l196R380o78l180M483J650j8414J26
7560d96r573N808m67K272j856q154Q69q30j3067O152L331N16Q609m1j58j832J351
7543g566n609m523J0473J1783J940J2512p10o720j942l9M062P29m310J4100O148
7528C0328n57j3798l751R026n994q365n744J2332j0166j0333j896J5549N068J932
7514A3631n359j283L432k0197K609r524K148J5725L611j2612j6225l428R752Q275
7500i445K14K199O70j2706j9422P110J0196L70Q566P837k577J3376J0690q855
7486H223j1454K536J2977j2760n532r786j364N371P119j56L982l797j5624j1429
$$ y = [23982, 15979, 16100, 12534, 11272, 11789, 11046, 2687, 8866, 3242, 6976, 15558, 2592, -15346, -6630, 7966, 23634, 21798, 19786, 14558, 542, 8430, 9333, 6137, 15517, 14839, 11659, 16142, 17792, -622, -496, -10069, -4261, -4728, -2456, -4312, -12466, -11597, -12427, -25494, -19342, -16011, -15495, -6886, -6927, -7085, -8917, -7566, -13175, -17698, -7225, 4558, 6498, 19010, 18300, 11580, 9638, 9599, 13661, 14390, 10080, 24180, 30328, 29771, 15973, 12222, 21248, 15254, 6889, 1145, 13477, 3311, -7022, -8918, 6631, 11699, 13631, 8272, 6989, 10421, -9776, -7167, -16691, -14543, 1182, 4793, -7819, -24044, -27472, -17720, -9445, -9231, -7032, -6362, -19068, -38490, -31380, -21184, -20814, -12248, -4411, -6988, 6388, 17078, 8223, -3231, -695, 12282, -478, -6010, -15796, -17160, -11789, -4670, -4826, -844, -4641, -20265, -31694]
7472c1694J5402K6416J7945j1279j3987l062q619j746k712L781K308L943J226
7459b078L369N351P831Q661m160K770j4672j0549j406q60j411l036j0202M688
7445a5704n28j946O015J0668J687o892j4034o987j551r89J181Q159K283J6753
7431a885k24L92Q964M225k377j0582j3236k037l819M732j04q21R030L834o430
7416a0338J0098Q733L002O967k056m133o655l671M467N886K315Q776j0708n609
7402G074Q19m017q312J0737J1401q570Q142K170j1889m728K51n781L035k165j25
7387a958k176p447N828p772k2455O519J5973K487o500o325j799N321L261p573
7373b4616m249J0204J4428j248m06p169P114J9897J2511l549m156q591p835J151
$$ y = [-31694, -16292, 10124, 28069, 16790, 2803, -259, -8878, -10624, -13336, -9555, -7247, -3304, -2078, 1291, 6642, 14473, 23134, 18974, 21744, 7072, -3477, -4883, -5743, -7154, -10190, -20392, -15704, -16232, -18178, -12163, -1495, 192, -6700, -20734, -27721, -29272, -30261, -29080, -20921, -18638, -1885, -2109, -1717, 7247, 11472, 9095, -1487, -14723, -16760, -20579, -15847, -15951, -16772, -7742, -3908, -10338, -240, 8493, 11495, 18462, 16406, 12273, 5618, 1947, 6414, 12300, 14615, 23391, 12683, 7074, 7893, 3876, -4436, 6301, 17702, 9132, 17274, 19444, 7555, 2827, 3078, -2703, 332, -1833, -1958, -4134, -11581, -5753, -13525, -35980, -29461, -13488, -11001, -17501, -23826, -25625, -20304, -17043, -24616, -28865, -18661, -4233, -5481, -5887, -13056, -5942, 13955, 26466, 22917, 18761, 10170, 2335, 3486]
7359C486j3910K024L981O114J0602j7755j2770l727J1562R637l174m242L629k082
7345f625J283Q006K502o391l872n131L472Q772N798N495j1765j0782p0J5866J0848
7330A7406K796r424j4360j505L001j1255R462k48P660L935R05l921P83j178M692
7315H749J797k4114r173J3051j1312k89K2763j916o550j6454L833l554J0727J3130
7301F88Q358o543R860J8855j591n414j5221p976n904j904J2649R335O641k8802
7287f969k1614J1977L680q345p538K702M165R613Q160N065q92j4519l657N697
7273a2475R433J772J0096J702j2022o686m696J0585J5755J298o086o67J1395n825
7259A3579m125j0859n045M505N583j2902J2609M788m564q878p586k021P838j28
$$ y = [3486, -10424, -8400, -4419, 1695, 12297, -5458, -18228, -21955, -10393, -756, -3930, -8172, -4543, -6625, -5342, 2664, 5166, -1225, -5097, -10228, -6756, 2016, 7814, 13309, 1544, -9238, -9308, 6558, 17406, 20202, 10778, -3582, -5087, -2086, -13341, -3879, -4127, 3533, 7468, 8373, 4452, 5235, 4057, 8749, 10546, -13568, -22741, -9690, -21002, -21291, 1472, -444, -6994, -23448, -19615, -23169, -12442, 688, 9046, 2503, 12363, 31218, 29627, 24213, 8992, 1016, -4888, -6792, 5857, 15192, 21833, -6969, -28583, -16606, -12926, -21271, -28809, -26107, -21942, -12329, -4169, 896, 4, -14515, -18172, -12475, -3042, -1270, 8826, 10528, -1494, -8180, -12876, -2291, 13464, 14762, 8676, 8009, 19404, 13579, 9454, -1405, -6450, -1945, 3638, -9264, 3345, 8133, 3569, -5309, -12895, -14916, -7078, -7206]
7245g206l685n651q58J0878N240o273p383l9N397O122J2545O512j599j954n479
7230F567k2667o466l16Q268R201K652J3661k208q553l701O034J5645O787o994
7216A7910k4111n393J9084L952p547l608l10o608N864l065L604K771k42m093M673
7201B881P047q159m121j0875l508N626L903m800m187r609M576q70M788L849J6076
7186B617j2421j155k970l776L616K895l38k564P703O893R444J2866m811k101p753
7171H145K041r297l076L318N35o404r67q24M224K277L287K544J45r48O4r061k976
7154f973J3662k905p711j4961p72K1196O287P116o078q181K11m665m71J4913P85
7139A1453j066l634j185K858J6643J574K221K738j0903k5940j8335R73J3330j798
$$ y = [-7206, -10891, -16542, -17400, -6522, -1282, -7555, -14938, -14977, -9580, -3458, 9087, 15599, 14000, 12046, 6567, -16100, -22566, -22882, -14614, -5413, -2761, 10900, 8692, 139, -3562, 2472, 18117, 24904, 17910, -6201, -11594, 7490, 11442, 3895, 287, -23, -6631, -767, -3832, -228, 2543, 2301, -1792, 2881, 9928, 1769, -2352, -13227, -16735, -11109, -7206, -12006, -16193, -25802, -21226, -22096, -17308, -13459, 2617, -9804, -10959, -13929, -17705, -14089, -11194, -11532, -14096, -6393, 500, 9944, 22810, 17999, 15898, 8145, 10186, 889, -2187, 1131, 1666, -4738, -5705, -6529, -2305, -28, 3259, 5803, 5948, 5000, 5064, -3997, -6973, 6689, 3784, -3927, -18888, -19660, 1536, 7823, 14939, 8861, 680, 891, -3774, -4245, 10668, 11453, 10387, 6753, 5568, 8426, 25069, 26643, 28864, 31602, 20699, -5241, -23576, -22603, -9273, -11071]
7125a1071j9132q919R042J8061J3695K934r398j4248P46M416J4961J5770j1144
7112E713j2767L807q885p392k557K0133M969k427j3396L803r397k529j2076k661
7098c5662J4144K0375P255n631j4392J200J006J7146K894k2718l0255J1768K2132
7085a0738M15q127P345L446J2998L809l758j997q78P221k1641n767P149N978M537
7070hp546K587L253K768l359n422M219P971m829Q17q376p013O936j599J0410j1396
7054a0587j2764R251L074O731R385n811m881j6239l545j962R493P233M544j2776
7040a8854m433N992J0797j760P40J614K297M29L153O690K580N073K755n227j2641
7025g95o8L748J207k102m590N442k643M033J2683m041p456j797n636q053l00J1205
$$ y = [-11071, -30203, -39122, -30080, -12019, 1676, 4610, -4788, -19036, -18290, -13874, 1087, 16857, 5713, -7054, -3247, -12132, -19524, -22081, -1948, 3021, 594, -12802, -8999, -18396, -20925, -33001, -35662, -21518, -1143, 6112, 481, -13911, -12711, -11705, 5441, 8335, -14383, -44638, -32870, -10738, -10323, -18450, -11105, -7659, 5339, 9148, 5390, 3393, 2515, 9736, -11905, -17672, -10523, -4545, -8, -7554, -4967, -1714, 1054, -2305, -7727, -3508, 4463, -366, 451, -7925, -14938, -8002, -9601, 809, -10587, -23351, -14100, -11026, -4295, 5090, -721, -5602, -21841, -25386, -27348, -17855, -10622, -6078, -18854, -23287, -17295, -6498, -8258, -7518, -5904, -3607, -3178, -25, 6665, 9245, 14318, 17073, 11846, -795, -863, 2885, 4092, 1990, -2600, 2842, 199, 4232, 16915, 12874, 5418, 3621, -2015, -10068, -10368, 837]
7009H37O927J2509J0636J0466K067K994j3033j3033j0587n626J2321P527M79K213
6995B6697m760j6333o453j1088k963Q34O307P200m271j263l65R203J0084q923
6981C906j0296m036J492M809j4475j67Q112n906j4248P408j797p959M930J5212
6967a3015R775J4748N834o748j2061j751l303M765K550Q079n227L828J706P975
6953A7155m633r351p344J072j751L309k016J06j829P21M228J636J971p823k636
6938g185Q698k367L528m734J680Q441j0673Q611N486j546q61Q67N381P213k5074
6923b535j022p549k574J0205J3843l737j5219l010M442l166r468j4820M472J7593
6909a2545J7974M057K858o73q921p374J407Q66J1197m624l466R18j602L487m423
$$ y = [837, 7764, 20273, 30909, 41375, 43442, 46436, 33403, 20370, 9783, 4157, 16478, 24005, 24484, 26697, 21937, 5604, -849, -11937, -14900, -14066, -7759, -559, -4830, -6093, -6458, 2745, 12829, 3906, -6390, -10426, -8934, -4125, -18600, -18767, -10655, -16561, -30809, -23401, -25198, -33157, -28227, -13015, -3240, 11508, 17342, 10594, -1467, -3218, -6521, -1756, 794, 8873, 3646, 7474, 9180, 17155, 12522, 3171, -4173, -3101, -4852, -1543, -3559, -3453, -5282, -4561, -333, 1303, 3274, -4549, -7185, 1513, -854, 2674, -2060, -380, 8061, -2612, 5999, 11485, 9939, 9078, 9945, 15326, 22539, -2535, -3557, -11106, -13680, -3475, 10368, 6631, -8588, -11598, -7156, -10322, -19790, -34610, -30138, -12545, 5429, 9486, 12344, 11671, 2750, -4624, -3217, -2351, 8846, 4222, 756, 1674, 72, 3559, -864]
6894h64K438L040j7810o413j0752O894J1470J2327Q138K078j0720N323L160j340
6880F969j5899N376l643l704j919R048P69J1311M471L940R813K821j0583j2442
6866F328j05r624j4742N976J5880k362j229q288j2246R781J0467K607P547o583
6852C407J8387N808j4555r387l59j2031R282L216n884P42j911K609p550o904N322
6837i808k073r27J1241N941o630k214N318r434j2076p369q305P398J3823R739
6823e376M001K172R354l363j10o174k6442O241l101O915Q856j109L337N443J3148
6808A3792J3004L90j9573k716J0707j4792L868Q120q523p629l804k13n341R401
6794c309M538r282j2434M637J6522J2563p827j1905k018O368m658m924Q205J467
$$ y = [-864, 1574, 4614, -13196, -19609, -30361, -23467, -11997, 330, 8468, 10546, -174, 5149, 8309, 6969, -8930, -3554, -7197, -10901, -12820, -3772, -3003, 8308, 12779, 16719, 26532, 29353, 18770, 6328, 6223, -3401, -18143, -12167, 3713, 1351, 122, -8166, -20412, -10631, -164, 2443, 9990, 3407, 21794, 27602, 13047, 3660, 3301, -8730, 552, 3768, -2116, -1374, -3285, -676, -8226, -15130, -9808, -11881, -12808, -1567, 4374, -2256, -4470, 848, -8586, -20662, -28031, -36336, -28938, -15115, -5376, -1375, 797, 10151, 6788, 6678, 504, -25938, -19697, -22798, -15883, -7027, -8136, -4799, 644, 13792, 26796, 27186, 7613, 4897, 15604, 812, 4680, 12800, 4277, -3352, -7156, -7369, -12710, -3309, 1229, -8053, -20487, -15850, 672, 13235, 5408, -6497, -8515, -2147, -6805, -11729, -3524, -2057]
6780b057j1820j998L296L406Q297l599j0460K397N692J608Q94j0341O616K222
6766e847m510R70m719L723p587k641K1872J0400j9496q615k336L902r466O664
6752a7686Q709L188N644O497L998R144M405r94M469n233k3161j3010o274l709
6738b4013K961Q508N549J450m450o925K387N364P825m193J1496N048j1676J775
6724A106P634J2691l10j0074l529j4835n0P835K75k268J1942k055L147J2915M018
6709B8442j0208R043N775k3361k0454J752l563n705j3137l840J1470R820J3909
6696e7m594m162K360P56K001Q993p393J164K1443N100l56k303p78M944j2234l813
6680A1071L696m60L65j6340K724N482N377n32m580N977j60M40k054j516p953M958
$$ y = [-2057, -13877, -15875, -12579, -9173, -876, -4475, -14935, -12538, -6846, -5238, -4344, -14685, -8069, -5847, -10357, -9387, -14106, -10383, -17970, -20611, 1261, 11661, -7835, -16450, -18786, -14884, -24350, -17686, -8977, -5789, -145, 6352, 10350, 19494, 23899, 22905, 27374, 22141, -1020, -14030, -20304, -24013, -21052, -12544, -6995, -5545, -9995, -16920, -14533, -9169, -1344, -5537, 5959, 11007, -669, 1106, 8740, 21431, 21121, 11047, 7518, -7317, -7367, 468, 743, -1525, 10417, 8362, 11509, 24424, 28442, 18234, 27277, 33052, 9691, -10763, -9011, -12574, -18279, -31416, -35256, -23786, -13966, -57, -4651, -8813, -6453, -5697, -3696, 5297, -2096, -932, 20511, 25611, 25255, 22952, 22174, 27118, 14884, 11071, 14767, 14307, 14672, -1668, 1056, 6538, 11915, 11383, 6803, 12780, 12620, 13060, 11006, 9490, 1537, 6495]
6664F495K250K602J0627l331j5921o824Q588J524P99o545O84J768K247O883J976
6649A3822r686q671J717N595L264J929n749o448P388M608l247p278r466j0832
6635b3054J3249J8512j497J212J3819n746j004j4892M398K022o389o87q068j953
6621a0078K695Q585K337R416o062j5057n078R0P585P734m821L499l907l826m350
6606a1238j0625J1431R274k155m355p367P881j506p124R455J3621n040J1751P539
6592B1542o616N675J76j3342j4039J1438J4843j2308L681j1315M550j061j4635
6579a1411p170M368J4191R309k754M400J161j6902p989q035K575Q828p789q035
6565b5253R82J6465N641j2427q96J7176k766q588o730J1958l948j6718J69N523
$$ y = [6495, 8745, 11347, 21974, 18643, 2722, -4102, 4486, 6010, 6809, 264, 948, 2716, 4963, 11846, 13822, 4136, -4535, -2818, 2777, 6041, 7970, 2221, -4227, 3161, 7769, 4522, -2756, -12222, -23054, -9805, 8707, 7210, 8422, 22241, 16495, 15491, 599, 4997, 7019, 630, -57, -8125, -10078, -7383, 1202, 3539, 12955, 6893, -8164, -13242, -13152, -5567, 2167, -2654, 845, -3062, -6888, -11238, -21863, -10432, -1158, -3313, -7668, -15035, -7154, -8660, -15784, -6329, 7292, 2252, 14003, 21542, 14926, 20601, 20777, 7435, -6604, 4834, 19677, 7369, 11050, -265, 4285, 3224, -11411, -18581, -14213, -22, 9287, 6533, 10933, 12094, -4808, -12797, -20832, -18257, -9429, -17218, -25253, -24271, -7806, -2165, -14592, -15488, 1688, -1078, -9666, -16396, -4438, -8386, -25104, -24935, -19412]
6551a9412M921L99l678M516l806J782N918O196n30n833L351q179j7763k566Q791
6536b5893J1002K7983O318M203n175j7398o672O095l192R766l323o337M734j376
6522G35R896N353o447n136o978J054L76P925l659k2540o161J6018J0272m781k368
6507f441k736M160N775K889M618m045q893l484O694l801J121L242n095k4982j001
6492c1979J5535Q775L89k120J3925J169j2678K660M015k19N415o271k490R698
6478E824J5099P767j8438k5280O697J0601J303J2031n701j9047O241J2597J080
6465A0774j0437L75J942l898j5440K37Q177J5591J1698j1036r931l788K607Q471
6451E342Q74r830J1469q828m71Q926j0943l309K1703J2728r246N049k812k284
$$ y = [-19412, -14491, -14092, -17770, -13254, -17060, -15278, -9360, -3164, -3694, -9527, -6176, -14355, -32118, -34684, -25893, -14891, 13092, 19410, 23613, 18438, 1040, -5632, 463, -2729, 7037, 3714, -2623, 2111, 735, 10631, 15984, 9537, 4401, -2577, -1523, -1147, 6778, 3119, -19421, -25582, -9564, 708, -4073, -6441, -9177, -5017, 758, 3647, 8265, 4220, -4673, -8157, -1463, -5264, -4143, -901, -5996, -30978, -31979, -16444, -7669, -7280, -9400, 4525, 5694, -6984, -4324, -309, -528, 4887, -1384, -3874, 5824, 20923, 28690, 10252, -15028, -8331, 2270, 3573, 15604, 9903, -9144, -2903, 9694, 10774, 337, 712, 2654, -1244, -16684, -16447, -8270, 7321, 19019, 7983, -1948, -5736, -3129, 5342, 6216, -3614, 7855, -973, -1444, 7482, -3461, -6770, 14933, 27661, 18415, 23464, 20652, 18368]
6437A8368j4039j0527r175N56J4526P132K0749Q125j3044k7444L411L113j6164
6424a4413n18j532n525M088J9320j1366j6211R776J0578J273P586J0081N46J511
6410A5194N994O5P221j5421o136l899j6261J484r492o81O044R97P58O260j0827
6395a8700j1649K38O496J5491K0352J774J5284N075p509m964j2475j3403m643
6382h633O9Q343n617m218K220R02l016p600J2774N298k862P379L278q323o229
6367f235j3840M598L326q940l23R566m401j0496P640J2385R603j2762l215J7917
6353D823J1404j0316p379K986k52j4855j3047o406J4272K0442J4704l589p433
6340E354m923K137m059J1874Q371n396o353k3353r595N748K500j0083o255O435
$$ y = [18368, 4329, -6198, -15373, -14817, -291, 6841, 27590, 35715, 22671, -4773, -1362, 1751, -14413, -14931, -16463, -21988, -17900, 1420, -9946, -26157, -16381, -5803, -4530, 3056, 13137, 13683, 15194, 21188, 21253, 28474, 13053, 6917, 3018, -13243, -11759, -21251, -21932, -15888, -14891, -14133, -7873, -18700, -30349, -30111, -23615, -8124, 12228, 14002, 29286, 34361, 26852, 21888, 9413, -3990, -8633, -8564, -221, -5838, -10056, -7836, -6934, -9950, -17550, -4776, 522, -2340, 5039, 8317, -6, -6235, -20075, -15477, -12151, -21091, -21414, -11848, -16249, -26745, -19105, -6720, 2883, -9879, -13094, 4823, 16227, 5911, -1468, 1518, 1266, -13589, -26636, -33042, -18770, 1672, 16376, 12787, 5354, 431, 2568, -1491, 10383, 18754, 13358, 7005, -16348, -25943, -20195, -17695, -27778, -34033, -27598]
6326b7598J0152M556r143r66N214N024K458K239M750L736J727j1561J960p902
6312a5354k683K373J1190J1214J139n168j0792q399j2875J1587J3238j755n363
6299a1648l430N284L272J288j5159j3516Q637K705m068j730K086J1467K0119J1623
6285A6930l613j693j0711J039o50j040j3686q785N412j1437L713J1084R854R869
6271F286M948q3r547J319k160Q706n984j5164l783O450j1374Q880K921j759o72
6256a1016j4884j1243j1871K146J7008K070O85J2687N325J070R624J296n939m216
6242g258r836P33Q868j2073q31L370O597k258M555J1954R782o827n846p283R145
6227B792p306R839o422j667R393J27j7399j502P90k680r48R935Q820J511j0141
$$ y = [-27598, -17446, -12890, -22033, -22999, -17785, -12761, -10303, -8064, -3314, 422, 2149, -9412, -7452, -15354, -18037, -15664, -4474, 6740, 7879, 2711, -8081, -16480, -29355, -17768, -4530, -6285, -11648, -15078, -9794, -6522, -5234, -20393, -33909, -25272, -22567, -26635, -28365, -26279, -14812, 5307, 16930, 13317, 11624, 913, 1952, 1302, 262, -13424, -22209, -16797, -28234, -24521, -13437, -3583, 6286, 11234, 11151, 1604, 2923, 763, 9469, 3485, -11679, -15462, -9012, -20386, -11506, -8585, -10344, -11016, -25900, -37143, -49014, -46868, -29860, -27790, -27105, -14418, -9093, -8023, 1601, 2897, -3042, -7258, -17094, -16361, -7493, -19566, -20397, -17027, -10430, -12688, -8133, 3821, 13603, 6776, 930, -6353, 2792, -4514, 5325, -1097, -2764, 6629, 6756, -10643, -12145, -11355, -14035, -14983, -5048, 3772, 5283, -4858]
6212d858Q787n869j829k41M22J0884J8099J1156l075r921l123j0860l017l048
6198C507j5694P879K0415O502j5180N38J068P7r471J3591k016k0663J1017O455
6184H025k0810M935J6315R439j029l566o393R62j694k810k830J0776K712j2058
6170A974k330R591j548r502r862P152J0648J808M155Q357j280j0044m721p166
6156b768L310k6K532J663o040J568J0181l827j2865l577J913Q48N529o915j2363
6141b0837p429L747O311O13K832k907P647j64j313O982M174k925L056p808K740
6126e281Q404j844m23j5455j4951O383J3957L348L397N359n125j1547N589Q154
6112c5K731m222j1203j4739O452L347O392J0327j721j982l007k9274Q000J1143
$$ y = [-4858, 3929, -1940, -3769, -4010, -3588, 7296, 25395, 36551, 33476, 23555, 20432, 9572, 6555, 3507, -12187, -4308, 16107, 22609, 7429, 7967, 9035, 9112, -359, 13232, 11216, -9447, 1570, 8025, -12785, -7850, 8465, 17904, 16875, 13309, 6916, 7878, 6184, 3374, 544, 11320, 14032, 1974, -356, 9235, 7687, -1815, -11677, -4525, 6123, 7931, 12086, 20443, 19163, 9119, 4398, -2768, 542, 516, 3048, 4711, -1329, 239, 10420, 6593, -6272, -9849, -7936, -7088, -1559, -8474, -20837, -28266, -24519, -18208, -17595, -14763, -17670, -10023, -10187, -11500, -4518, -344, -3269, -213, -8021, -5281, 3123, 1279, 856, -14599, -29550, -23167, -9210, -5862, -2465, 2894, -2231, -13778, -8189, -35, 2696, -1526, -12729, -27468, -21016, -17669, -11277, -950, -2671, -4653, -7660, -36934, -28934, -17791]
6098a7791M397j644L594j880j0268o949L218J7352L794M397J5249N5l372j0085
6084F7J067N459J503J706K792l96j5669j6877J366O258J3233J922r57K425L230
6069G129J215J299k668l546o883j2615j109K456L013j3951n294N734J7811j7082
6055b4491j1099Q377O885q39j3322J704K1469J1649Q026R116q498j5947p817j577
6041a6364k186P583p70m141m405j0065m048M155J3103R96p071J1010O675Q579
6027C051R73j5633j2214M172J5895J3072j0036k1845J8885P701K919j105j1456
6014e621R0p203l29n152Q448k066r247k49P172l771m640R614J0034J1058j5267
5999g129q916O74o720J890J3881P280K463l397k157Q299l635L910p830j1074R845
$$ y = [-17791, -13394, -15038, -11444, -13324, -23592, -30541, -27323, -9971, -6177, -1780, 13469, 13524, 10152, 67, 1134, 6593, 8096, 9802, 12594, 12198, -3471, -20348, -18982, -12724, 509, 2431, 1474, 3899, 7129, 8344, 9643, 6975, 3429, -3454, -16069, -17178, -14722, -11709, -25660, -30954, -25220, -7409, -24491, -35590, -27213, -20328, -21167, -34489, -32785, -11316, 333, 8359, 17475, 8977, -6970, -14787, -16364, -18550, -10967, -11737, -15878, -20283, -30348, -34396, -30241, -17138, -16142, -23213, -12203, -5528, 3051, 4024, -11609, -23823, -19651, -3756, 9316, -720, -22565, -3680, 4021, 6940, 5835, -5621, -5531, -12734, -13063, -18215, -9767, -11833, -21080, -21329, -14157, -17928, -22568, -12954, -2920, 8138, -7129, -16045, -15371, -22091, -20201, -6320, 960, 3423, 26, -2131, 6168, 2533, 6443, -1387, -12461, -2616]
5984b616j877r355N857P558k559j8489n701J0358L237J224P95O859M161P902M23
5969G777m641n029J7282J1993l741k525j0814k489M129m869p748m566n817K26
5955a0832M966L167O753O044p84n594L969J047j6994m042J0982k967M414j814
5941a685j3449L377L669M04N448q364k891K232R826M622n055j701j624q367p359
5926b0917j1422M771P443O742L481P039O804K854j0751j2240Q132P922M02m697
5912d437R442M612n507j7k808j671k44q644M579P783l331j2249J455K357R527
5897H47O536n958o860j0001O7K827J9791Q453n833k3509l025O472L908Q189j325
5882E79j3257L140R607j0280n82P793j031q701Q294j251k247o211O898n890R853
$$ y = [-2616, -4493, -13848, -7991, -433, -2992, -21481, -27182, -16824, -13587, -12363, -11568, -4709, -548, 7354, 7777, 3136, -1893, 15389, 27382, 23641, 21116, 10302, 7813, 11942, 7073, -675, -5241, -11058, -10832, -5866, -2699, 4054, 10098, 9314, 3720, 7689, 8736, -8258, -12300, -1318, -4285, 129, -1685, -15134, -11757, -8088, -7684, -2236, -10600, -13491, -11259, -1433, 3189, -1866, -3567, -5191, -13558, -20917, -32339, -27568, -20125, -13383, -9902, -2863, 3941, 6795, -3956, -16196, -8064, -142, 260, -4437, 5005, 9617, 4110, 4093, 1285, -386, -630, -9274, -4695, 3088, -243, -12492, -11037, -8680, 847, 7383, 1425, -5435, -15436, -15369, -12542, 7249, 15702, 9869, -13640, -16665, -10193, -6285, 1904, 579, -12678, -9538, 69, -10211, -10793, -3000, -4031, -12732, -4438, -5689, -7936, -14147, -7249, -13139, -3286]
5867c286J4692J72l813J0962l530j0971n747o520j0230L835m080J2870J1626O960
5853A2940l799M463J383j5854j118J6744J9602j4882r611O182p632q492n453J303
5839d224o11j3003N413J8619L067k2503n798J7001J860p135l967L724l52p887
5825a5796p445P656J0551L469R027O911j2182j9000o532J4304M087p309M051r62
5811i170j625r593k506Q851K734J4925n533q482O825o476j5134L974L57o453J875
5796b5431L4579J0500o998p343j3891j2136J0004n243j3716M377N276m263q287
5783c2572K899J3049K320K847L296m502M988p443k247L291Q156P390N088R536
5769A6096l032J631r352q706k1695K438j901Q743j567n135p765n97k199J1833
$$ y = [-3286, 11406, 11578, 7765, 18727, 15197, 4226, -1521, -8041, -18271, -14436, -18516, -5646, 5980, 12940, 9141, 13604, 14987, -867, -1985, 14759, 34361, 19479, 9868, 16050, 8418, -74, -5527, -4224, -4835, -17838, -12425, 6194, 9261, -13242, -19040, -2039, -179, -7314, -11281, -7557, -7909, -15796, -23241, -15585, -5034, -1565, 7462, 14373, 2191, -16809, -23341, -9037, -4950, -12259, -8208, -9170, -10795, -20388, -22894, -14043, -11309, 3616, -1917, -10399, -3574, -10050, -25184, -21210, -20853, -27306, -25431, 9148, 19648, 12650, 5307, -8584, -20720, -10716, -15959, -29675, -25298, -20022, -24285, -32572, -29673, -16624, -14304, -11457, -8161, -12663, -7675, -15118, -17365, -14074, -5918, 1472, 6560, 16096, 13064, 14695, 5343, -3363, -25058, -22620, -24521, -15778, -17345, -22480, -30245, -30842, -33041, -21208]
5755b1208Q136k867P357J0828J2219r197J696q84n466n340j1940M071K2244M800
5741A4449J965r740j1752M10j0015N876J1071J903j644J1661q525J712j418j888
5727D065r342m875n645L691J9780j0301j6595Q684J9369O527j8739j0742m356
5714a8479R552J7016Q120k0774j1586M390r24J2329J281p959J3694Q806j6099
5701f33l334P903p92r259o203J3157n325j5713j2429J3155K1415K328m646P295
5687F919M483j355L677j2851k2370j442J242J1674J814j31m874r195j2197N780
5673b8826J0278Q673M890J097L834j0886j4032J1983Q764J259l422J2076R713
5660A5401j0352j0160n44m637P674M223O485J622k312j0758R59K734Q96o75p57
$$ y = [-21208, -13072, -15939, -8582, 2246, 14465, 5268, 6964, 6080, 614, -4726, -16666, -12595, 9649, 14449, 16414, 6674, -5078, -4668, -14683, -8807, 2264, 4167, 2523, 14184, 5659, 7371, 5953, 4065, -5277, -10152, -15797, -12106, 7674, -2627, -19222, -10538, 8831, 15358, -3381, -14123, -18479, -8927, 8089, 16209, -4565, -16151, -11761, -12685, -356, 925, -7034, 6660, 15466, -633, -3967, 3936, 3144, -6115, -12318, 839, -4486, -20199, -32628, -19473, 1942, 4270, -376, 6919, 11402, 10047, 13724, 873, -21497, -22939, -21697, -10023, -8209, -8340, -13214, -22409, -34606, -28826, -18548, -9875, -4985, -3888, -54, -10940, -24972, -12989, -4225, -2966, -6388, 5688, 15401, 5049, -5111, -5655, -10292, -2618, 1605, 8090, 9712, 7400, -3358, -2399, 335, 1231, 556, -201]
5645b01K217J1529J4094n614m793j4418j200l853O165q334j635Q494N215l311
5631D355k0518l652N437M550O88o90L23J0329J206m861M591k429Q651k415r072
5616c507m686J0288Q635n702p423o287k680N42M549K927j1546n477n4k980j810
5601b5211L169J1809J1025J196m179j0243l510M197k0375m638J2094L0396Q588
5588A4318j0624l734P149O690k336k969r305k403O728K889Q118n50n79j8127J370
5573c365o954O278P59r648J896L982P251j9304j5223j6298p0J9001o83j252J721
5558c1909P96K548J4638L984J3442J795L968l127j5893j020O213R402l640k949
5544a752J298J4033P570o722n699l96J890r800j1343j95L153j048L114l616l557
$$ y = [-201, 2016, 13545, 27639, 22025, 17232, 2814, 1614, -2239, 3926, -4408, -6043, 2451, 7666, 4355, -16163, -19815, -14378, -9828, -9140, -9830, -9507, 822, 2028, -2833, 1758, -671, 7980, 5565, -3507, -8193, 2095, 10730, 5028, -2395, -8682, -11362, -10820, -6271, -3344, -14890, -20367, -20421, -23401, -25211, -22042, -10233, 792, 1988, -2191, -12434, -15944, -11747, -32122, -36760, -24666, 5730, 14318, 3694, -40, 7109, 13799, 11463, 8494, -811, -3214, 3514, 6403, 14521, 13971, 13392, -4735, -3365, -10319, -4041, -3282, -12930, -11034, -7052, 199, -19105, -34328, -50626, -50696, -31695, -32378, -33630, -31909, -31113, -28565, -13927, -9943, 3499, 5294, 9262, 6135, -9758, -10778, -4565, 4837, 1197, -1752, -454, 13579, 21149, 14427, 8728, 8332, 10222, 422, -10921, -11116, -7963, -9011, -5897, -9513, -13070]
5529a3070j0028L822q547P174M529N298l822l573M896l034n395m512r039J7283
5515a8018J2592O400j1589N399O858j681M200O998j10j6738P565P385q944M544
5501D861p520O139J2954N390n952o123j2930l817l37J3469Q95j1610L793R540
5487H752j686j1118L128j1041m819J1252P971j1215j0940k710O397k071k530o032
5473b6662M0Q164N250P2J1966J2797K687m787j4648J862K754K663P850O399j4407
5458B000j3817J3935L891m937k0347L951J1388J1155L495P829J347q045q338J4733
5444A8240J634m290J045q481j1112O969l486j6155L981J935O601J1950J499k681
5430G649m984j795N179p685j2341Q055M490j731J3762Q90l905j7225l502J2720
$$ y = [-13070, -23098, -19276, -27823, -20649, -16120, -10822, -14644, -18217, -13321, -16355, -21750, -26262, -35301, -18018, -5426, 974, -10615, -5216, 1642, -39, 4161, 11159, 11049, -5689, 1876, 9261, 317, 4861, -2659, 3480, 16434, 21824, 15872, 9749, -3181, -6998, -7335, 6134, 7029, -4581, -788, 8752, 7066, -4052, -924, -11965, -16784, -5532, 2439, -8776, -19716, -22426, -16029, -18100, -20630, -26662, -26622, -18458, -13208, -13136, -1170, 11627, 14314, 9527, -5121, -3259, -505, 2158, 10008, 16407, 2000, -11817, 2118, 6009, 1072, -19275, -15324, -3936, 7219, 10714, 18543, 19890, 11845, 3507, 18240, 19874, 15584, 16629, 8148, -2964, 4005, 519, -15636, -11655, -9720, -3119, 8831, 10330, 7649, 2665, 870, 6049, -1636, -13977, -5922, -1432, -3163, 10599, 11489, 7584, -9641, -13143, -423]
5416d23R879n30j179P484r409j1614M286J4301j364j4371O365J3276p223j9678
5402a0200k241l4j0074l101J4567K6959J1367j3866J843j5157j025R32p741o480
5388a4251M983k561J2278J588r16k134j0761l924p749J2530R972O773q657O048
5374C219K621o883O146N37K557Q3p297k0128j240J1325O476K840J2969j017R46
5359A3154p064n775N52l757Q509J1909r147j731J872L138n451p812m402O553j3082
5344a2534l293k199n423R181M703n765p736R718J0280N908p389J692m615o872
5330a4344l696J6807J345m026k446k630O83R8K043l101m495J38K580j673n248
5315a7965l555J0060Q291l264O782J840Q175R416j5183k0325P592J440o344L110
$$ y = [-423, 9456, 8926, 7747, 15231, 5822, -5792, -1506, 12795, 11431, -2940, 3425, 16701, 9478, -10200, -12441, -12475, -22549, -25650, -11083, 15876, 27243, 13377, 15220, 63, -962, -30, -7771, -14251, -9268, -11829, 449, 2037, 1121, -1013, -11774, -15698, -23447, -10917, -945, 5828, -2829, 3219, 5840, -1043, 5103, 5640, 8197, 8280, 983, -19145, -20385, -9060, -2584, 256, 13225, 12208, 13154, 6090, 315, 867, -2890, 5619, 17528, 8381, 6650, 8522, 11660, 6209, -1603, -6005, 548, -12534, -15827, -18026, -23449, -14268, -9565, -15330, -23066, -13348, -3068, 2840, -4549, -2857, -7472, -14344, -18040, -1233, 112, -3914, -6360, -8990, -8307, -8209, -6166, -9267, -13762, -13624, -11044, -12717, -17965, -21520, -11460, -3169, -6433, 349, 2189, 10364, 19780, 4597, -15728, -8136, -6696, -13040, -9930]
5301i930P409R92j5048P013m697R51M782J1709o439L273Q271m31p000j0555J0147
5286D47J827j0370j6762O55J2244J5468p070j5487R39m175M986K763J4478P970
5272G913n97M849J2094o005L53Q657j3234p282k245l654M963r94p884j2884N329
5257a0621K7864M883q907k4363M411M466o75O470j863j2593q017Q667Q612M243
5243B577R51l522M414r982M9n186P19O082m94l104L198O987k319k836k506k633
5227g605k310k664L608L729j834O79Q30K460J127l73j640n897R595N822k74n174
5211G9r624j0376p218J995R554j1208J075M455O220J5158J2386j257l964l219
5197D056j1738R6j0808p695J4175j4053Q161N488K4762J3414m903m719j7155j4305
$$ y = [-9930, -2521, -1529, -16577, -9564, -14261, -13310, -8528, 3181, -3258, 15, 8286, 7855, 855, -9700, 447, 2274, -8096, -24858, -24203, -11959, 3509, -3561, -19048, -18109, -22284, -17298, -14535, -57, 7913, 7316, 12165, 24259, 18254, 18607, 27264, 14030, 6748, 4503, 849, 5812, 4818, -3066, -15950, -10621, 17243, 22126, 13219, -11144, -6733, -2267, -2942, 3528, 1665, -10928, -18945, -10278, -1666, 2577, 3528, 6, 4420, -5562, -5513, -10699, -9980, -3898, -4392, -7496, -4298, 2689, 370, -2466, -4972, -7605, -9915, -12579, -8971, -5242, -7076, -6397, -5567, -3107, -1980, -2353, -3993, -9890, -295, 5527, 5253, 79, -9545, -19921, -27139, -25144, -15590, -26798, -25723, -21268, -15048, 110, 12496, 11239, 7275, 4056, -7682, -7586, -18394, -26089, -11914, -25967, -17806, -12318, 12444, 25858, 20955, 16236, -919, -15224]
5183a5224L347Q706P015J7306n684j1221l954Q01p680j0873R13Q820o618R814
5169d532J0729l397N84N053k996j132K082r699l468O621L585K913R847j2705n863
5154b378J503j8000j9233p046N22N695O275L010o616M708J0756J3653J4766J2214
5140A9829k98j1294l514P606M991r219j2923j5061m651N802J6382K1071J1972
5127C0693j1552l334j892n63n233N596J803j3375L549J175p164L089P859K914
5113A3565N100j668j6121j0276J3473J0894L703Q79j0565j4329j0869J2040Q799
5100D625j109j1014j0296J1327J1499K1056m253p872k0109m864P927Q076o364
5087a371r061p02l107J1115K724K733J970O59o22n744j403R151P760n8J329P779
$$ y = [-15224, -11877, -3171, 3844, 21150, 15466, 4245, 291, 1092, -6588, -17461, -16548, -7728, -14346, -4532, 6197, 2800, 3384, 8437, 5441, 4309, 6391, -3308, -6776, -155, 3430, 6343, 16190, 3485, -2378, -875, -18875, -38108, -45154, -44632, -38937, -32662, -29652, -36268, -31560, -20804, -7151, 7615, 19829, 19531, 8237, 4723, 12329, 17320, 8101, -4822, -19883, -24534, -18732, -2350, 18721, 30693, 19141, 15807, 13915, 13352, 8119, 13715, 15518, 2143, 5692, 6867, -297, 2792, 10651, 13565, 18665, 16997, 876, -9400, 4073, 14967, 18670, 19549, 8984, -5345, -16214, -4174, 4625, 3516, -7498, -17794, -6467, 5032, 26088, 21835, 13963, -6146, -11010, -3083, 4993, -1371, -10432, -11134, -14241, -3126, -402, 2331, 4301, 4960, 4338, -1406, -2809, 6342, 14102, 14044, 15373, 23152]
5071B3152p916j3045k175m453j0305k001O866J2657l962r851n2o819J0291J6379
5057H766L472r747o164m873q049j6298j230J2221J4233K2770L873k2866j1240
5044a5132j1846q779J6401j216K707k557n436k928M833R168J7997j190l202M918
5030C738m28j4772r552J1493K1857l781m838Q502M102p38k937J3324K556J941
5016C0467r99j3513r008j6299j1246J1722J1957o077N762n806p398l270N669N149
5002b890L831l593M005M672R110n733m691r320J942J6460K531k731l964p3j1604
4987b048J966R703k363Q384N586p865k1121n61j3947P341J5943J0872n485o036
4973C69m054n072R756O883r608j3169P901Q856q182q152j261M127J9423P948k145
$$ y = [23152, 15236, 2191, 16, -4437, -14742, -16743, -9877, 2780, -1182, -11033, -11085, -17904, -7613, 8766, 12238, 2491, -3673, -8546, -16595, -32893, -34123, -21902, -7669, 15101, 18974, -3892, -15132, -26978, -35757, -19356, -20572, -17865, -20422, -25858, -28786, -23953, -14785, 3212, 2022, -1180, 3738, 3310, -11462, -21014, -9521, 12336, 8555, 3717, 12219, 16321, 15583, 12646, 25970, 28526, 30467, 29468, 15955, 6947, -9352, -20598, -8876, 3081, -2996, 2766, -3040, -10438, -13708, -8039, -2890, 941, -2652, 1353, 6025, 15135, 9402, 4711, -4609, -2667, 13793, 16324, 13593, 9629, 9556, -2048, -82, 9621, 7258, 15642, 21228, 13363, -7758, -8319, -22266, -14925, 1018, 11890, 6405, 369, -3685, -8757, 999, 7882, -1726, -14895, -6994, 1862, -6320, -14472, -15733, -11606, 7817, 15765, 13620]
4958A3620j7264n311J6169K805j139l196j3121o777n29M587l722O124P857P716
4944G819M636L773j2884j2643m951Q42K868M575r098l125L421L180M982J693M301
4929f11k150l340L884R41N6l950j1356J3304N795r638j0336L429Q690o569l91
4914a2242j2007P739K965O556K481l796P98r513K602J7440O352k9758q729J4721
4900a4391J5226N325j0708P07n62k25J3431j801k0535o732M928J5576J1357K722
4886A4318O829m6n391k092q035m871l346m317J903k568o574M160J2482j946j2225
4871a1719l750J3344Q735O368k5303j0767L512M603P086Q955J658p064K801K044
4857E03k480l002p38j40J1361M012l567J264Q353l271j1784j368J1919k752p342
$$ y = [13620, -3644, -8955, 7214, 10019, 8880, 5684, -7437, -14214, -14743, -10156, -13878, -7754, 103, 7819, 12455, 16228, 3344, -9299, -14250, -13408, -10540, -5965, -15063, -18188, -14767, -11587, -6605, -4912, -611, -2761, -6101, -2217, -1276, -1220, -5170, -16526, -3222, 2573, -7065, -17401, -13972, -5282, -11851, -12242, -24249, -16510, -13545, -6989, -4508, -8304, -7506, -17019, -14417, 3023, 9375, -20383, -29112, -14391, 835, 6160, -4548, -3841, -4403, -4628, 8803, 7002, -13533, -20265, -15337, 239, 11596, 14318, 21147, 21101, 15710, 13618, 5583, 712, -2634, -6951, -5048, -7616, -14190, -10030, 2452, 506, -11719, -15469, -2125, 6610, 12978, -12325, -23092, -19580, -14977, -7891, 1064, 2722, -4342, -1541, 503, -1977, -4979, -5717, -5857, 5504, 9516, 5949, 7213, 15566, 12295, 511, -857, 11062, 8310, 968]
4842I68q944L595o503n011N710J3883J2366k253p522J854R381m06J929j3216N42
4827F373L462j3937P57j857q325K0055k592j0067o168Q355Q634M281j471r443
4813a943M400j690L799Q410o14j4851m094Q988N449m388P148l003R19k322n3m216
4797A939r1q031p187M200P120J1847j598o122l922k78j4011r179O685M871N348
4782h409O580K067K677J3056J541r88n230O670L492p833k2361J344O819m603J3618
4767H440J3870j3150j5633q563J054j5685o422J1543O859O406o850k804o02r079
4753c0616J0532J7160M679j722J1726P382j2798j1315k522j1624m171n30L540
4740b0279J7729J2801O339n484L247j2218j3950L568J3831N149k6887j0826L612
$$ y = [968, -7976, -4381, -10884, -15895, -10185, 3698, 16064, 13811, 6289, 8143, 17524, 17118, 19047, 5831, 6373, 9835, -4102, -3345, -5202, -13527, 6528, 3936, -6131, -12299, -3944, 4690, 8971, 7500, -1943, 2457, 767, 4566, 12976, 12362, -2489, -6583, 2405, 7854, 3466, 10614, 7611, 8530, 6208, 6155, 1939, 1848, -6183, -13370, -9170, -2050, 9797, 8199, 2077, -1845, -2123, -16134, -25313, -18628, -13757, -8409, -1829, 238, 2915, 15971, 17512, 16524, 11294, 17964, 21456, 13623, -8738, -7394, -575, -5178, 8440, 22310, 9160, -6473, -15036, -13982, -29667, -36089, -24546, -17687, -11281, -18131, -20935, -21537, -30616, -20084, -2924, 1755, 33, 11759, 19141, 6343, -4972, -7494, -19118, -23289, -23819, -20279, -2550, 10251, 16590, 11106, 14353, 2135, -11815, -8247, 5584, 10733, -16154, -26980, -23368]
4727b3368N450k13J0240o997L586L620O443O183M890r824R87K94j7323o983m674
4712b7689p44J2866P519k446M320P622l624l669m008n765J191k389o555J0160
4698a3211J1146R99O443j6897j2526J5656P42j4530j60J6422J036j3025M438M713
4684h754m381m827O090K0310J741o864j504j6284N10p554N882j462L447K608L572
4669g470k816q621L909Q181N886k707M521n459j12L911j4104l106j421M756P390
4654g262Q273P784L462J693J429o020j9767K497M20k053r795K844J0999M586j99
4639a109n319p513O325M140K2134P7r156k856o859o344k730P988M968R521j8850
4624e583j5574j1461l683r690J630J4002K4164P548j8188J067J2492k402k783
$$ y = [-23368, -17918, -18131, -7891, -14888, -11302, -7682, -1239, 4944, 9834, 10, 997, 1291, -16032, -23015, -27689, -28433, -15567, -8048, -10494, -6174, 1448, -2176, -5845, -9853, -15618, -14427, -16816, -23371, -13211, -2065, -1066, 5377, -11520, -24046, -8390, -7648, -22178, -22338, -5916, -4880, -17905, -13467, -8754, -13135, -17962, -11872, 8438, 10179, 3315, 1811, -14473, -13963, -21517, -15635, -17097, -13650, -11042, -7470, -10286, -18907, -14998, -6817, -931, -3638, 883, -4576, -4688, -777, -14881, -17987, -19408, -14652, -7262, 1011, 8795, 12257, 13950, 15379, 9359, -10408, -7911, -7491, -9544, -19339, -16495, -5496, -910, -1109, -6428, -13941, -7616, -3476, 18658, 18735, 9579, 6723, -136, -6480, -9210, -1222, 3746, 13267, -5583, -21157, -32618, -36301, -45991, -44361, -30359, -6195, 1353, -16835, -15768, -3276, -5678, -8461]
4611h461o438l137K880M256k397J1660L651l024k0482k434R401j510j289Q184
4597i140M848P194j1991j2871m888P258J6952K985o78Q05j598J33n88M33R400
4582H254o040n469Q098N772n018m466j8618k2077J0620L2415o195p422m15N734
4568d827J083P944p296j0808M407N212J3517J1917j5044q665j1001m981J5294
4555c248J2187J0896q704q255j183q096Q748L95k237j0186O843l654J30R369L141
4540F146j4472L848O348Q858m239j1148l401p201m534J1466R063L586P13N197
4526A0230M870M405j3995m636j3590j7833o636J7686J5969J4075J340o623r773
4513d511M474L560j2901o842K231P990J0333J045k65k557k786q8j516O45o727
$$ y = [-8461, -14899, -18036, -15156, -10900, -13297, -1637, 2014, -1010, -21492, -23926, -14525, -16035, -17324, -9140, -4292, 2902, -9089, -21960, -26848, -19590, -2638, 347, -331, 474, -1124, -991, -1579, -1146, 8254, 2214, -3255, 4843, 10615, 5597, 1131, -17487, -39564, -28944, 3471, -2724, -10146, -10561, -4827, -3744, 4200, -3096, -13904, -9497, -4285, 9232, 21149, 6105, -2560, -13561, -18542, -3248, 8939, 19835, 11131, 2876, 1693, -6403, 2345, 2740, 503, -9683, -2840, -6494, -6364, 3005, 6146, -8326, -4478, 1870, 10728, 6489, -4659, -8060, -15261, -19795, -8329, 734, 4320, 5033, 10230, 15100, 19505, 5510, 874, -12716, -30549, -37185, -19499, -3530, 10545, 11885, 5262, -4511, -37, 3523, -9378, -16220, -13989, -5999, 4334, 5379, 5114, 2557, -229, -317, -1833, -1188, -7915]
4498g915L192Q001J0928R877j3456j2971K655J673o55p330K733m351K617q114
4484a3116K46J9804L286q625J2388N702j9524j3605k752J6376J6302j918q477
4471F087o71l233q571j0231j3784J6754J1556n938K986J257j9752k1778J0723
4458c4595n5Q588k661j447O279o964r607N669K0677J0929j2147P464O424M441
4444B995N307j530o073n931k0243P39J1584J4871K53j699N261l56k632n079j753
4429d286J575K57K646j1582j0753Q022l090n862j33L97J0563l959k567l717j433
4414b3922r809N171K6166J7097Q512p730j3886p544j480K884L071j0072m233K30
4400a5545M008R458J1642j3412m607j419j5845R148J5343P114l836Q660K6210
$$ y = [-7915, -4723, 3278, 14206, 24083, 10627, -2344, 311, 1984, 1329, -6001, -3268, -7619, -5002, -13116, -12870, 6934, 10220, 1595, 13983, 19685, 161, -13444, -16196, 180, 16482, 14564, 6087, 5416, 2183, -6388, -16619, -30403, -13649, -2093, -8031, -5045, -3788, -23540, -45318, -34595, -34650, -26062, -28723, -30170, -23891, -30855, -40462, -34793, -14116, -3187, -15334, -7870, -1446, 2995, 8302, 6772, 699, -5232, -25475, -24736, -13152, 1719, 1972, 273, 5534, 5178, 2546, -2533, -4286, -2711, -2454, 192, -11390, -22143, -14121, -17211, -23073, -23206, -22809, -12246, -16205, -18772, -22489, -23922, -33731, -28560, -2394, 14703, 23215, 15485, 1599, -5945, -7425, -4541, -1470, -11542, -15775, -15545, -11537, -2079, 9563, -3849, -8456, -9875, -25720, -16572, -1229, 5885, 2049, 10709, 36919]
4387C6919m746j8226p165p834n924J0729M885M757O244p960l855j1887K461J4557
4373A2955P612l238j1784k5064q815n330l52j964O344L99J0999R374r819j262
4359a9945J0918J8829q623p09J1671M15n94J369j518J171n720j6732J1991L060
4345E583p920M708p327j257m704J3547q263P249n769p410R562R981J2970P048
4331B7998o611k5146k817K044l641Q034J6153j3578k2694l375R035K6766J0038
4318B2206m480j80p764q804L920l341k122N447o588r975r42J6326Q429n647p050
4303e65m306O32O545N446j4700j013J3685j267n333j8000J814J145P085n18j4317
4288b3667J3666O514J1589K040j998j8820J86M897M43P893O754J09p006n719J891
$$ y = [36919, 32173, 13947, 6782, -1052, -6976, 3753, 8638, 13395, 19639, 11679, 7824, -4063, -1602, 12955, 20567, 17329, 5545, -19519, -28334, -33664, -34016, -35980, -29636, -29237, -18238, -8864, -18683, -19945, -9027, 9802, 1179, 470, 12141, 12556, 11962, 13331, 11813, 12984, 7264, -9468, 2523, 5583, -2337, 2371, -4956, -6213, -10917, 2630, -5633, 1616, -4153, -11563, -2001, 7980, 20950, 27998, 21387, -3759, -6576, -4532, -8173, -139, 16014, 2436, -20258, -23633, -14598, 12168, 22206, 17726, 17546, 9782, 978, 4898, 1557, -565, 4882, -1706, -11681, -12623, 3703, 12132, 6485, -565, -4871, -4239, 2306, 7752, -6948, -7961, 5724, 4457, -876, -18876, -17062, -15917, -8832, -9350, -23667, -10001, -3487, 8102, 10142, 8144, -10676, -10490, -5593, -5150, 2743, 9497, 9606, 2600, -3119, -1228]
4273a228J1242j07o653p06n001j4779n807N134J7234N024m670o982j713P10M846
4258c456L696j045J6179K705m89J2435q678j4393k106O75O345j1924j9887N697
4244a4246O308J0045l542N685Q80P68q648j7726L835K233J738R083J0707P139
4230A4259L689O675o824j22K882P094j1874j7622q741n426o781J16k027J4164
4216a0538K517o118O36p178k242J4112K639J8591q149o691r47j1035J3653L504
4202B754L71r413j9495o226J2954O011M998O970n188j733j819k71L645r08m611
4187a1961j0495R605R395n450r03M597J108n861L079J7289j156o15j1080j8492
4173b0940m316L846K0726J7616N255m287J555n034j2339k1087P437P107J059M174
$$ y = [-1228, 10014, 9907, 3254, 2548, -2453, -17232, -23039, -17905, -671, 4353, -317, -7299, -9012, -8302, -3456, 240, -805, 15374, 18079, 17590, 30025, 21347, 6954, 4848, 5523, 11868, -56, -19943, -14246, -7938, 2107, -1435, 4250, 5130, 5898, -2750, -20476, -16641, -14408, -12670, -3587, 7120, 14259, 17948, 24623, 17799, 17677, 20559, 27653, 15779, -1843, -10584, -16010, -22791, -22675, -24702, -10538, -8021, -14139, -13503, -20681, -22923, -8811, -6172, 12419, 4270, -2421, -3368, -14403, -750, 2754, 3125, -6288, -25783, -32009, -19055, -13044, -8046, -1076, -6264, -7997, -9816, -10087, -6442, -7350, -11961, -22456, -12851, -3456, -8906, -9809, -5212, -4104, -9965, -6886, 10403, 9247, 8632, -2448, -20940, -25256, -21410, -684, 16932, 22187, 17900, 19455, 14421, 2082, -19005, -11568, -4461, -3402, 772]
4159G72P942j4890n727J1808Q252p51j120o210n075n538N961O614J8396P080j7066
4144A0448j4014j251m177Q245J1558J2117Q39j4728m439o396o264N992j2040j2872
4130b6982J516J3060J7406m237O59Q721P840n473n449o922r547q503L709K7j651
4115a5826p647Q474Q681R871j272j6678J503K3719K0539j6432j9659k384O034
4102a077J2043k555r011n69M29Q324k31j1107q352R549R718Q367J1013j0305l1965
4087a5729j3902r535J3866J1773J8611K265r803r021j9111m40J6764Q662j2755
4074a8355R236J4063J52l272m966Q27m966j0047J176J460m872K137P745O982l355
4059f055L050L595l604m473O484O675J0962L201r428M98p24j6293j833j233L265
$$ y = [772, 8714, -6176, -11903, -95, 8157, 7406, 6286, 76, -4999, -10537, -4576, 2038, 20434, 27514, 10448, -3566, -4817, -8994, -749, 10809, 22926, 23765, 9037, 4598, -1798, -8062, -2070, -14110, -26982, -25466, -12406, 5000, 763, 1422, 10143, 17983, 12510, 7061, 139, -9408, -17911, -14202, -14175, -15826, -23473, -14999, -6318, 3553, 2281, -14397, -12894, 10825, 31364, 14932, -4727, -7111, -1077, 10966, 8411, -600, -1169, -740, 7584, 7353, -3754, -12106, -2557, 7161, 15528, 26541, 16236, -15729, -29631, -39166, -25300, -13527, 5084, 7349, -2454, -11475, -30586, -31026, -14262, -5600, -18355, -9119, 4944, 5096, 1824, -3142, -2315, -7281, -17328, -16152, -14692, -19564, -17427, -9682, -2700, -6055, -3005, 590, -3014, -7487, -1003, 5672, 16634, 19835, 10407, 10905, 10181, -6112, -7945, -9178, -5913]
4044e913O691j0275j501k206M018L121k1610J1082K6095Q802j0549j829J1378
4031A7304n856j2638J47Q941M663j2875K022L336l869j1048l168O453n818k302
4017a4708J7117J2404m738j8691j493L861J2397m657L269M394k376j3443j3633
4004b0297p232J208P550J7673j982j9114j3574m729J6795K2755l679J419O819
3991C612L008o933o180p938K38r497j2558P363N865O625L353o145m505J2976P751
3976b965j559l202j979p809L551P687n413j2351J2599J0631j4255J566N033n50
3962i016j32J2846Q707l759l441n893k070l31K80K0188k645l118q913K867R274
3947A4844p930j7718j2403l751L443J7649O629k0701N596L065L534j1266Q971
$$ y = [-5913, 778, -9497, -10998, -13204, -9186, -6065, -27675, -16593, 9502, 18304, 7755, 5926, 17304, 11448, -1190, -1043, 7898, 12561, -314, 1708, 5044, 1175, -9873, -13041, -6588, -12406, -14708, 2409, 14813, 10075, -8616, -10109, -6248, 6149, 1492, 4761, 9155, 6779, -6664, -20297, -27529, -26321, -18771, -1098, -3080, -22194, -35768, -40497, -23702, -947, -4626, -3207, 3612, 6620, -313, -6493, -14431, -14193, -23690, -36248, -28885, -23020, -16395, -13042, -19187, -23692, -10716, -2965, -4524, -7726, -9705, -17514, -13963, -6276, -11689, -24040, -11441, -810, -15065, -13499, -8466, -9016, -9148, 3698, 12405, 8646, 5205, -688, -2758, -3089, -2809, 17379, 14734, 11616, 2703, 5570, 14844, 6914, -10804, -23207, -26958, -23515, -5866, 763, -19938, -14342, -11277, -7743, -19009, -10038]
3934a0038M008j2070J805j586Q33L401R238P292J1767j2259Q05J5974P943l609
3920B3504r14l87j5610k2811q792J2725J9552m988q831K30o574n470O616M449
3906g301L169M366l289p245l165L150J1795Q097j2013p284l499r92K308M118J0078
3891B293M992Q221l637j7950p275q70J044M818k096m172J0607J8898p96j2744
3877A333j7728k870L816L090R04Q241J3590l987q508l314J752j1515p952L929
3863a9219J1224R42J0725P638P071L423J44j5659j0129P496k001J576R91L284
3849G506J2944j522j6500m360L843m117j811L464j913p516J009k746j3333R546
3835a5506L125j657k5J8081J0734l530m886K922n436m208j2676j3565K0662J5424
$$ y = [-10038, -6030, -18100, -16295, -17881, -17048, -13647, -4409, 2883, 14650, 2391, 3196, 19170, 27113, 23504, 22590, 22203, 6593, -16218, -25010, -12285, 7267, 2279, -6552, -6322, -12896, -18366, -11750, -7301, -4132, 234, -3055, -10300, -13465, -10315, 1480, 9577, -2436, -9720, -13219, -14211, -11903, -7785, 2293, 7285, 15506, 11869, -6081, -13356, -14226, -13182, -8364, -10460, -14632, -4025, 14873, 14077, 1333, -16395, -19265, -15449, -12359, -11455, -3214, 10376, 6389, -2119, -5433, -3681, -15196, -23148, -19219, -7995, -7053, 3672, 11310, 18381, 21804, 21948, 6289, -3840, 3656, 1655, 3231, 4222, 7506, 20450, 18928, 2428, -1932, 1911, -2206, -4017, -553, -2466, -9982, -8973, -11719, -25052, -15506, -12381, -14038, -14063, 4018, 14752, 11222, 6336, 9258, 3822, -386, -13062, -26627, -5965, 9459]
3821I459j1652j9795l777N834R214j5374j5730J4851K2672J1626K978O493m07
3808A6392j3244q754r131o908M32R175L712k0561j1468J5557J3667J1852J000
3795A721k840o213K377o462Q048J3335j600j0653O397N597J0246p928j3720N899
3781D204J2542m484o703n787J4536R99j6928K253q780m669O091J6866K636j6183
3767c407J5622N877r399L15j0954o698J5966m777k1266P024J0479J1192J5277
3754B5251q440j8684p345J3775N871P895o749j1054J703K120r874O654J9365K068
3740B2556k1307j5230K791j1146K92J1845J5241K050l559l446J263j1128j5069
3727b4847N146k076K884O548L509K813M131L722m28k707q04j0858J5507P668o413
$$ y = [9459, -2193, -21988, -25765, -19931, -10717, -26091, -41821, -26970, -4298, 7328, 10306, 16799, 16392, 3148, -5606, -14737, -21645, -21213, -12038, -8326, -28887, -40355, -24798, -11131, 721, 1721, -1119, -7332, -4955, -11417, -3369, 9966, 8366, -2287, 4110, 9707, 19953, 12025, -1695, 4204, 16746, 12262, 5559, -228, 14308, 15307, -1621, 632, -8148, -12817, -6726, 10140, 12776, -3407, 12215, 18092, 8693, 9008, -1946, -8644, 7322, 2545, -18721, -11697, -1218, 9974, 25251, 16811, -1873, -9218, 4557, 10428, 18323, 11574, 520, 2223, 4343, -5531, 1123, 20488, 22556, 1249, -13981, -11190, -22336, -22044, -10199, 5042, 7092, 3533, 87, 1350, -9778, -24847, -19701, -21777, -18893, -12345, -8836, -6023, -1892, 1830, 1402, -1305, -2109, -12967, 2540, 10208, 3795]
3712C795n215l97j368Q66j6986p090J4417P251K134o85q321j041Q630O176J4061
3697A6227N145j2799n525L96p630J501J8514j996q950j2712k201J6263J0406p158
3683I481j3285j6587J0051P726J0430O685j596j1354N387J6471J3751l583j5069
3670A8508j1695j6197R986R067N136l640j2493P241L560j931j3652L060N234q808
3656f624o430O522j57j3226k174J6955Q852N120M724j3217k4770M021J3993N923
$$ y = [3795, -1420, -1817, -3185, -2319, -19305, -26395, -11978, -4727, -2593, -3278, -11599, -12640, -4010, 2166, 16227, 21372, 8573, 3048, 3444, -4186, -2685, 15829, 13833, 4883, -7829, -10030, 6233, 16639, 9481, -3804, -20391, -10340, -2614, 7816, 14501, 12905, 1551, 6938, 23409, 37160, 33577, 18508, 6813, -9384, 602, 9669, 14805, 11165, -1328, 5913, 9473, 7542, -6110, -3050, 2184, -6624, -13054, -6532, -6689, -19915, -22089, -5134, 3718, 8838, 13562, 345, -24425, -20404, -6411, -488]
$$ [...]
##END NTUPLES=NMR SPECTRUM
##END=
