##TITLE=Analysis number 325941
Compound Code cc 60451
Book Reference 470/142
Project Code adrs
Chemist Name mikem
##JCAMPDX= 6.0         $$ Bruker NMR JCAMP-DX V2.0
##DATA TYPE= NMR SPECTRUM
##DATA CLASS= NTUPLES
##ORIGIN= Bruker BioSpin GmbH
##OWNER= nmr
$$ XWIN-NMR		Version 3.5
$$ Wed Jan 24 14:56:19 2007 GMT Standard Time (UT+0h)  MAYBRIDGE\nmr@NMR_250MHZ
##.OBSERVE FREQUENCY= 250.131544655141
##.OBSERVE NUCLEUS= ^1H
##.ACQUISITION MODE= SIMULTANEOUS (DQD)
##.ACQUISITION SCHEME= undefined
##.AVERAGES= 16
##.DIGITISER RES= 18
##SPECTROMETER/DATA SYSTEM= dpx250
##.PULSE SEQUENCE= zg30
##.SOLVENT NAME= DMSO
##.SHIFT REFERENCE= (INTERNAL, DMSO, 0, 16.522)
##AUDIT TRAIL= $$ (NUMBER, WHEN, WHO, WHERE, WHAT)
$$ ##TITLE= Audit trail, XWIN-NMR		Version 3.5
$$ ##JCAMPDX= 5.01
$$ ##ORIGIN= Bruker BioSpin GmbH
$$ ##OWNER= nmr
$$ C:\u/data/dgb/nmr/ADRS/1780/pdata/1/auditp.txt
$$ ##AUDIT TRAIL=  $$ (NUMBER, WHEN, WHO, WHERE, WHAT)
(   1,<2007-01-24 14:55:48.62 +000>,<MAYBRIDGE\nmr>,<NMR_250MHZ>,
      <created by zg, POWCHK disabled, PULCHK disabled
       configuration hash MD5:
       49 4B E0 1D 92 C2 6B 37 9F E6 65 BC 52 41 86 1D
       data hash MD5: 64K
       8B FE A8 D9 4F 7C EF A7 97 5B 5C 66 A8 4F 06 DF>)
(   2,<2007-01-24 14:56:07.48 +000>,<MAYBRIDGE\nmr>,<NMR_250MHZ>,
      <Start of raw data processing
       ef LB = 0.3 FT_mod = 6 PKNL = 1 SI = 32K 
       data hash MD5: 32K
       57 7B AC 4B 70 4B C6 BC 09 D4 BC 34 01 EA 74 A1>)
(   3,<2007-01-24 14:56:09.50 +000>,<MAYBRIDGE\nmr>,<NMR_250MHZ>,
      <apk 
       data hash MD5: 32K
       30 17 8C 9E 53 BB 17 57 12 23 3D BD B7 71 F7 78>)
(   4,<2007-01-24 14:56:10.58 +000>,<MAYBRIDGE\nmr>,<NMR_250MHZ>,
      <abs ABSG = 5 
       data hash MD5: 32K
       C2 6B 48 CF 58 74 3F F4 B7 40 68 86 6C BA E1 E4>)
$$ ##END=
$$ 
$$ hash MD5
$$ 3E FE BA 3F CE 74 78 B1 49 FD 79 4D 39 C7 D9 2F
##$RELAX= 
##$RELAX= 
##$RELAX= 
##$RELAX= 
##$RELAX= 
##$RELAX= 
##$RELAX= 
$$ Bruker specific parameters
$$ --------------------------
##$DU= <C:\u>
##$EXPNO= 1780
##$NAME= <ADRS>
##$PROCNO= 1
##$TYPE= <nmr>
##$USER= <dgb>
##$AMP= (0..31)
100 100 100 100 100 100 100 100 100 100 100 100 100 100 100 100 100 100 
100 100 100 100 100 100 100 100 100 100 100 100 100 100 
##$AQSEQ= 0
##$AQ_mod= 3
##$AUNM= <au_zg>
##$AUTOPOS= <30 >
##$BF1= 250.13
##$BF2= 250.13
##$BF3= 250.13
##$BF4= 250.13
##$BF5= 500.13
##$BF6= 500.13
##$BF7= 500.13
##$BF8= 500.13
##$BYTORDA= 1
##$CFDGTYP= 0
##$CFRGTYP= 5
##$CHEMSTR= <none>
##$CNST= (0..31)
1 1 145 1 1 1 1 1 1 1 1 1 1 1 1 1 1 1 1 1 1 1 1 1 1 1 1 1 1 1 1 1 
##$CPDPRG= <>
##$CPDPRG1= <>
##$CPDPRG2= <>
##$CPDPRG3= <>
##$CPDPRG4= <mlev>
##$CPDPRG5= <mlev>
##$CPDPRG6= <mlev>
##$CPDPRG7= <mlev>
##$CPDPRG8= <mlev>
##$CPDPRGB= <>
##$CPDPRGT= <>
##$D= (0..31)
0 1 0 0 0 0 0 0 0 0.06 0 0 0 0 0 0 0.0002 0 0 0 0 0 0 0 0 0 0 0 0 0 0 
0 
##$DATE= 1169650547
##$DBL= (0..7)
120 120 120 120 120 120 120 120 
##$DBP= (0..7)
150 150 150 150 150 150 150 150 
##$DBP07= 0
##$DBPNAM0= <>
##$DBPNAM1= <>
$$ [...]
##$SUBNAM7= <"">
##$SUBNAM8= <"">
##$SUBNAM9= <"">
##$SW= 20.6930455092707
##$SWIBOX= (0..15)
0 0 3 0 0 0 0 0 0 0 0 0 0 0 0 0 
##$SW_h= 5175.983436853
##$TD= 65536
##$TD0= 1
##$TE= 294.16
##$TE2= 300
##$TE3= 300
##$TEG= 300
##$TL= (0..7)
0 120 120 120 120 120 120 120 
##$TP= (0..7)
150 150 150 150 150 150 150 150 
##$TP07= 0
##$TPNAME0= <>
##$TPNAME1= <>
##$TPNAME2= <>
##$TPNAME3= <>
##$TPNAME4= <>
##$TPNAME5= <>
##$TPNAME6= <>
##$TPNAME7= <>
##$TPOAL= (0..7)
0.5 0.5 0.5 0.5 0.5 0.5 0.5 0.5 
##$TPOFFS= (0..7)
0 0 0 0 0 0 0 0 
##$TUNHIN= 0
##$TUNHOUT= 0
##$TUNXOUT= 0
##$USERA1= <user>
##$USERA2= <user>
##$USERA3= <user>
##$USERA4= <user>
##$USERA5= <user>
##$V9= 5
##$VALIST= <valist>
##$VCLIST= <CCCCCCCCCCCCCCC>
##$VD= 0
##$VDLIST= <DDDDDDDDDDDDDDD>
##$VPLIST= <PPPPPPPPPPPPPPP>
##$VTLIST= <TTTTTTTTTTTTTTT>
##$WBST= 1024
##$WBSW= 4
##$XGAIN= (0..3)
0 0 0 0 
##$XL= 0
##$YL= 0
##$YMAX_a= 302572
##$YMIN_a= -270557
##$ZGOPTNS= <>
##$ZL1= 120
##$ZL2= 120
##$ZL3= 120
##$ZL4= 120
##$ABSF1= 16.522
##$ABSF2= -4.171173
##$ABSG= 5
##$ABSL= 3
##$ALPHA= 0
##$AQORDER= 0
##$ASSFAC= 0
##$ASSFACI= 0
##$ASSFACX= 0
##$ASSWID= 0
##$AUNMP= <proc_1d>
##$AZFE= 0.1
##$AZFW= 0.1
##$BCFW= 0
##$BC_mod= 0
##$BYTORDP= 0
##$COROFFS= 0
##$CY= 12.5
##$DATMOD= 1
##$DC= 0
##$DFILT= <>
##$DTYPP= 0
##$F1P= 14.0000005364418
##$F2P= -0.99999901652339
##$FCOR= 0.5
##$FTSIZE= 32768
##$FT_mod= 6
##$GAMMA= 0
##$GB= 0
##$INTBC= 1
##$INTSCL= 1
##$ISEN= 128
##$LB= 0.3
##$LEV0= 0
##$LPBIN= 0
##$MAXI= 10000
##$MC2= 0
##$MEAN= 0
##$ME_mod= 0
##$MI= 0
##$NCOEF= 0
##$NC_proc= -6
##$NLEV= 6
##$NOISF1= 0
##$NOISF2= 0
##$NSP= 0
##$NTH_PI= 0
##$NZP= 0
##$OFFSET= 16.522
##$PC= 1
##$PHC0= 218.4812
##$PHC1= 4.462107
##$PH_mod= 1
##$PKNL= yes
##$PPARMOD= 0
##$PSCAL= 4
##$PSIGN= 0
##$REVERSE= no
##$SF= 250.13
##$SI= 32768
##$SIGF1= 0
##$SIGF2= 0
##$SINO= 400
##$SIOLD= 32768
##$SREGLST= <1H.DMSO>
##$SSB= 0
##$STSI= 32768
##$STSR= 0
##$SW_p= 5175.98343685301
##$SYMM= 0
##$S_DEV= 0
##$TDeff= 65536
##$TDoff= 0
##$TI= <Analysis number 999999
Compound Code 99
Book Reference 9
Project Code 9>
##$TILT= no
##$TM1= 0
##$TM2= 0
##$TOPLEV= 0
##$USERP1= <user>
##$USERP2= <user>
##$USERP3= <user>
##$USERP4= <user>
##$USERP5= <user>
##$WDW= 1
##$XDIM= 32768
##$YMAX_p= 291123533
##$YMIN_p= -418685
$$ End of Bruker specific parameters
$$ ---------------------------------
##NTUPLES= NMR SPECTRUM
##VAR_NAME=  FREQUENCY,     SPECTRUM/REAL,   SPECTRUM/IMAG
##SYMBOL=    X,             R,               I
##VAR_TYPE=  INDEPENDENT,   DEPENDENT,       DEPENDENT
##VAR_FORM=  AFFN,          ASDF,            ASDF
##VAR_DIM=   32768,         32768,           32768
##UNITS=     HZ,            ARBITRARY UNITS, ARBITRARY UNITS
##FACTOR=    0.157963299565203, 1,           1
##FIRST=     4132.6476996994, 0,             0
##LAST=      -1043.33573715361, 0,           0
##MIN=       -1043.33573715361, -418685,     0
##MAX=       4132.6476996994, 291123533,     0
$$ Real data points
##PAGE= N=1
##DATA TABLE= (X++(R..R)), XYDATA
$$ [...]
$$ plain form
16069 99072 15145 -43156 -32572 -66439 -59420 44279 56430 95433 104057 104318 146337 107452
16057 107452 152917 203298 178227 145937 5491 33361 72246 47144 -62982 -70897 84515
16046 84515 189340 127329 147653 197365 186040 105008 84255 29690 -61571 -176771 -173760
16035 -173760 -71843 -98903 -87197 -53621 -11508 -5625 -83480 2061 57733 -3054 -78664
16024 -78664 -41516 -11431 51976 126298 145018 149910 191748 134316 80906 8518 69884 26503
16012 26503 -171799 -254942 -214441 -153118 -55926 83530 191322 207419 155752 121023 116470
16001 116470 65247 846 76500 121679 144181 215811 123872 -40256 -114821 -21444 -87487
15990 -87487 -158208 -113328 145339 188088 54179 -49509 -85342 -165441 -240532 -157919 -75983
$$ packed form
16069I9072q3927n8301J0584l3867P019J03699J2151L9003Q624K61M2019l8885
16057A07452M5465N0381k5071l2290j40446K7870L8885k5102j10126p915J55412
16046H4515J04825o2011K0324M9712j1325q1032k0753n4565r1261j15200L011
16035a73760J01917k7060J1706L3576M2113N883p7855Q5541N5672o0787p5610
16024g8664L7148L0085O3407P4322J8720M892M1838n7432n3410p2388O1366m3381
16012B6503j98302q3143M0501O1323R7192J39456J07792J6097n1667l4729m553
16001A16470n1223o4401P5654M5179K2502P1630r1939j64128p4565R3377o6043
15990h7487p0721M4880K58667M2749j33909j03688l5833q0099p5091Q2613Q1936
$$ plain form
15979 -75983 34669 27891 -15052 179150 245176 159955 134320 100396 44676 60093 108747
15968 108747 32949 -61526 -33830 -59552 -43097 5408 57729 84854 72533 19888 6373
15957 6373 69070 86365 72780 74661 140361 41044 -26936 64830 102196 53314 62084 106433
15945 106433 143167 -29825 -69430 -88638 -46509 79710 163917 138435 119357 85332 54124
15934 54124 -23622 -17826 169498 231814 36957 -162109 -119644 -60100 -40101 -29596 -37380
15923 -37380 -47225 68390 171183 252086 223737 110594 -107233 -108200 -43661 -106865 -93896
15912 -93896 -101210 -56663 17124 36790 94675 154583 261197 239160 104934 66355 83246
15901 83246 10567 79948 137033 52737 -146262 -154198 25413 119698 126595 70177 86885 -12042
$$ packed form
15979g5983J10652o778m2943J94202O6026q5221k5635l3924n5720J5417M8654
15968A08747p5798r4475K7696k5722J6455M8505N2321K7125j2321n2645j3515
15957F373O2697J7295j3585J881O5700r9317o7980R1766L7366m8882Q770M4349
15945A06433L6734j72992l9605j9208M2129J26219Q4207k5482j9078l4025l1208
15934E4124p7746N796J87324O2316j94857j99066M2465N9544J9999J0505p784
15923c7380r845J15615J02793Q0903k8349j13143k17827r67O4539o3204J2969
15912i3896p314M4547P3787J9666N7885N9908J06614k2037j34226l8579J6891
15901H3246p2679O9381N7085q4296j98999p936J79611R4285O897n6418J6708r8927
$$ plain form
15889 -12042 -29365 -91208 -62318 -41750 -53026 48381 257381 328932 237520 93680 14113
15878 14113 60059 34686 -70043 -26316 -40361 -78764 -62062 -62915 -46263 32276 -23022 31197
15866 31197 95718 8956 -5528 22293 31684 52583 183263 168737 72646 14257 54938 82553
15854 82553 41271 52742 115589 74871 120412 232190 220948 81807 -186 115689 189780
15843 189780 132339 95493 135488 69491 10356 -9891 -44454 -36327 -73667 15367 88912 13141
15831 13141 3052 21110 34440 21810 46908 -21224 -8855 21039 -55565 -77906 897 126871
15819 126871 65470 -1150 -118053 -105953 -28633 -28233 -72032 -78909 -21492 -37375 -23628 67559
15807 67559 192283 267124 308068 168673 -32617 -117562 -132211 -65676 17043 34584 66461
$$ packed form
15889a2042j7323o1843K8890K0568j1276J01407K09000P1551r1412j43840p9567
15878A4113M5946k5373j04729M3727j4045l8403J6702q53J6652P8539n5298N4219
15866C1197O4521q6762j4484K7821R391K0899J30680j4526r6091n8389M0681K7615
15854H2553m1282J1471O2847m0718M5541J11778j1242j39141q1993J15875P4091
15843A89780n7441l6846L9995o5997n9135k0247l4563Q127l7340Q9034P3545p5771
15831A3141j0089J8058J3330j2630K5098o8132J2369K9894p6604k2341P8803J25974
15819A26871o1401o6620j16903J2100P7320M00m3799o877N7417j5883J3747R1187
15807F7559J24724P4841M0944j39395k01290q4945j4649O6535Q2719J7541L1877
$$ plain form
15796 66461 145756 147728 -31140 -12482 646 -96131 -91567 -100617 -123539 -47058 -28013 -36132
15784 -36132 -76839 -78597 -92149 -92348 -50318 -50221 67429 154200 253439 274160 205314 167861 214245
15771 214245 201335 132796 96218 60407 165627 121093 102576 73873 92260 138599 112470
15760 112470 164935 235246 312543 265381 83514 33195 66774 69705 57355 9608 16129 14146
15748 14146 -44482 -105097 -94092 33500 153396 183579 12228 75201 167276 140018 67471
15737 67471 30559 44607 4565 45889 129904 77222 -15873 -42750 18535 -23502 -113217 -101506
15725 -101506 -88789 -72406 -51818 47900 11186 -26090 -117975 -127712 -136276 -166068 -174586 -52794
15713 -52794 -2543 -10374 -89945 -100131 -52628 -62080 -17912 121389 177887 116330 51106 46292
$$ packed form
15796F6461P9295J972j78868J8658J3128r6777M564r050k2922P6481J9045q119
15784c6132m0707j758j3552j99M2030R7J17650Q6771R9239K0721o8846l7453M6384
15771B14245j2910o8539l6578l5811J05220m4534j8517k8703J8387M6339k6129
15760A12470N2465P0311P7297m7162j81867n0319L3579K931j2350m7747O521j983
15748A4146n8628o0615J1005J27592J19896L0183j71351O2973R2075k7258p2547
15737F7471l6912J4048m0042M1324Q4015n2682r3095k6877O1285m2037q9715J1711
15725a01506J2717J6383K0588R9718l6714l7276r1885r737q564k9792q518J21792
15713e2794N0251p831p9571j0186M7503r452M4168J39301N6498o1557o5224m814
$$ plain form
15701 46292 163960 163638 125218 5763 5551 88354 157076 144032 -1887 -9627 83739 54566
15689 54566 -20316 -3575 45121 124897 134388 -25723 -42145 -64591 -27242 51788 61021 -4788
15677 -4788 26493 -60555 -83675 -132656 -143297 -128162 -16652 112540 9887 -92204 -94782
15666 -94782 -109319 3217 43548 19508 50211 62350 97655 32095 132391 184721 235736
15655 235736 269952 289568 233374 176983 113890 12179 -11814 18783 53446 87536 147255
15644 147255 171754 84056 18135 109516 173054 90681 75095 147094 248842 256484 204843
15633 204843 179211 165490 155992 100364 9564 44890 101012 104526 38007 -34843 34448 114314
15621 114314 83216 166198 190688 197452 147911 153584 148740 -42625 -95161 57982 173295
$$ packed form
15701D6292J17668l22l8420j19455k12Q2803O8722j3044j45919p740R3366k9173
15689E4566p4882J6741M8696P9776R491j60111j6422k2446L7349P9030R233o5809
15677d788L1281q7048k3120m8981j0641J5135J11510J29192j02653j02091k578
15666i4782j4537J12536M0331k4040L0703J2139L5305o5560J00296N2330N1015
15655B35736L4216J9616n6194n6391o3093j01711k3993L0597L4663L4090N9719
15644A47255K4499q7698o5921R1381O3538q2373j5586P1999J01748P642n1641
15633B04843k5632j3721r498n5628r0800L5326N6122L514o6519p2850O9291P9866
15621A14314l1098Q2982K4490O764m9541N673m844j91365n2536J53143J15313
$$ plain form
15610 173295 246769 142884 45884 51567 73302 130891 238161 273349 311151 275736 105098
15599 105098 -68395 -123022 80736 204894 208458 171372 146217 93103 76094 639 -13956
15588 -13956 -31527 26948 108594 112160 92587 -9809 96824 116283 76028 -94110 -110007
15577 -110007 -25364 -46493 -95337 -66540 4901 171480 205715 203320 189229 92005 -1289
15566 -1289 -123000 -155927 -4847 9569 -103915 -5108 64381 64254 38459 124594 127989 24895
15554 24895 21089 85434 60595 -65188 -48075 20566 71929 208310 279235 206366 139855
15543 139855 100681 238275 348770 401298 325199 176127 93179 139925 200486 35337 -34142
15532 -34142 -59305 64901 12446 -43256 -79942 -54328 -23800 -11873 -53411 -72225 22711
$$ packed form
15610A73295P3474j03885r7000N683K1735N7589J07270L5188L7802l5415j70638
15599A05098j73493n4627K03758J24158L564l7086k5155n3114j7009p5455j4595
15588a3956j7571N8475Q1646L566j9573j02396J06633J9459m0255j70138j5897
15577a10007Q4643k1129m8844K8797P1441J66579L4235k395j4091r7224r3294
15566a289j21711l2927J51080J4416j13484R8807O9489j27k5795Q6135L395j03094
15554B4895l806O4345k4839j25783J7113O8641N1363J36381P0925p2869o6511
15543A39855l9174J37594J10495N2528p6099j49072q2948M6746O0561j65149o9479
15532c4142k5163J24206n2455n5702l6686K5614L0528J1927m1538j8814R4936
$$ plain form
15521 22711 154154 130775 11698 -64963 173515 262481 263980 197534 163564 138819 153579
15510 153579 124247 133031 81124 62609 133081 187464 244028 108853 102762 131967 49107 -63670
15498 -63670 -92987 -93571 -52431 -46770 -5160 -13422 -23612 20767 23397 77029 94339 -2824 46298
15485 46298 200188 303111 195270 92142 -7952 -81359 57273 89565 60928 38410
15475 38410 -26972 -68031 -85697 -6555 71956 190386 114757 30533 -164511 -167058 -103310
15464 -103310 -67535 -49495 -33377 637 76131 54622 62938 79080 173904 208010 230791 151455
15452 151455 60587 14373 -14086 -31919 -25354 80949 157721 207843 217985 177490 153139
15441 153139 179192 72596 22476 49218 -19860 28799 23083 -17420 90528 119330 252554
$$ packed form
15521B2711J31443k3379j19077p6661K38478Q8966J499o6446l3970k4745J4760
15510A53579k9332Q784n1907j8515P0472N4383N6564j35175o091K9205q2860j12777
15498f3670k9317n84M1140N661M1610q262j0190M4379K630N3632J7310r7163M9122
15485D6298J53890J02923j07841j03128j00094p3407J38632L2292k8637k2518
15475C8410o5382m1059j7666P9142P8511J18430p5629q4224j95044k547O3748
15464a03310L5775J8040J6118L4014P5494k1509Q316J6142R4824L4106K2781p9336
15452A51455r0868m6214k8459j7833O565J06303P6772N0122J0142m0495k4351
15441A53139K6053j06596n0120K6742o9078M8659n716m0503J07948K8802J33224
$$ plain form
15430 252554 323700 188500 107950 34339 17681 35504 118199 88787 119005 184882 114113
15419 114113 59819 89271 269318 365131 203764 -29171 -53230 -103946 -51600 23986 15665
15408 15665 69894 111047 121695 6840 8339 -27200 -43127 -171358 -34704 124223 101710
15397 101710 69154 103652 172850 258646 273832 218397 213082 157304 95015 51222 23946 11860
15385 11860 29790 -8883 -85067 -79687 -63933 69259 63621 84158 209993 193502 165612 135491
15373 135491 116008 142280 107448 194880 210202 154469 76810 -11146 -45176 -2311 -30128
15362 -30128 -68710 -51976 -33610 41048 21566 92890 11344 -56227 -26167 -9009 -63501 36248
15350 36248 149769 171886 178555 92086 128551 156551 159358 212196 253731 193892 162451 132386
$$ packed form
15430B52554P1146j35200q0550p3611j6658J7823Q2695k9412L0218O5877p0769
15419A14113n4294K9452J80047R5813j61367k32935k4059n0716N2346P5586q321
15408A5665N4229M1153J0648j14855J499l5539j5927j28231J36654J58927k2513
15397A01710l2556L4498O9198Q5796J5186n5435n315n5778o2289m3793k7276j2086
15385A1860J7930l8673p6184N380J5754J33192n638K0537J25835j6491k7890l0121
15373A35491j9483K6272l4832Q7432J5322n5733p7659q7956l4030M2865k7817
15362c0128l8582J6734J8366P4658j9482P1324q1546o7571L0060J7158n4492R9749
15350C6248J13521K2117O669q6469L6465K8000K807N2838M1535n9839l1441l0065
$$ plain form
15338 132386 154403 257567 247666 236734 255068 212102 168868 107414 17901 49564 117138
15327 117138 232619 178721 157239 66046 114966 272333 366135 237468 213504 119435 62668
15316 62668 34268 69104 50956 -24521 1860 -63413 -85879 47801 171226 143983 131743
15305 131743 171637 196121 216514 165839 145865 120038 125773 170002 72307 -7534 -16422 -85407
15293 -85407 -57405 81710 157106 141390 -50881 -192594 -153959 -54803 -13965 172221 232437
15282 232437 158345 226876 199404 149052 146721 121793 156740 197899 239539 159894 -47151
15271 -47151 -35776 57502 144077 221363 283881 297014 272023 249292 227190 222584 190529 169410
15259 169410 144854 47767 115201 128304 191922 251528 228664 267780 217478 225403 110415
$$ packed form
15338A32386K2017J03164r901j0932J8334m2966m3234o1454q9513L1663O7574
15327A17138J15481n3898k1482r1193M8920J57367R3802j28667k3964r4069n6767
15316F2668k8400L4836j8148p5477K6381o5273k2466J33680J23425k7243j2240
15305A31743L9894K4484K0393n0675j9974k5827N735M4229r7695p9841q888o8985
15293h5407K8002J39115P5396j5716j92271j41713L8635R9156M0838J86186O0216
15282B32437p4092O8531k7472n0352k331k4928L4947M1159M1640p9645k07045
15271d7151J1375R3278Q6575P7286O2518J3133k4991k2731k2102m606l2055k1119
15259A69410k4556r7087O7434J3103O3618N9606k2864L9116n0302P925j14988
$$ plain form
15248 110415 39213 11174 127912 254298 220159 59291 96506 167288 196909 225475 192064
15237 192064 172136 176384 80690 93752 183540 204765 219867 266716 231122 145792 96547 107327
15225 107327 140456 262805 265370 220799 183101 216023 133266 119708 175312 197777 182976
15214 182976 73892 77480 76906 167385 247230 261828 221195 58220 -45433 -32645 -101736
15203 -101736 -132744 -85251 28543 112221 89372 133516 120672 244765 257297 266375 239902
15192 239902 217981 201663 231644 214612 205735 224280 221169 202474 134878 209251 195344 179093
15180 179093 72350 -55735 -34331 12876 -2787 154823 257648 299826 204904 255922 267065
15169 267065 202349 93956 38300 -42803 -19825 104571 138220 143742 150303 276167 162935
$$ packed form
15248A10415p1202k8039J16738J26386l4139j60868L7215P0782K9621K8566l3411
15237A92064j9928M248r5694J3062Q9788K1225J5102M6849l5594q5330m9245J0780
15225A07327L3129J22349K565m4571l7698L2922q2757j3558N5604K2465j4801
15214A82976j09084L588n74R0479P9845J4598m0633j62975j03653J2788o9091
15203a01736l1008M7493J13794Q3678k2849M4144j2844J24093J2532R078k6473
15192B39902k1921j6318K9981j7032q877J8545l111j8695o7596P4373j3907j6251
15180A79093j06743j28085K1404M7207j5663J57610J02825M2178r4922N1018J1143
15169B67065o4716j08393n5656q1103K2978J24396L3649N522O561J25864j13232
$$ plain form
15158 162935 -48133 -46247 37048 46762 48286 -34957 11025 79506 148200 99733 139373 183782
15146 183782 194785 134489 88350 203894 267113 169835 151043 156981 174463 167683 185327 206833
15134 206833 204791 201881 153125 85953 49577 82482 59420 119564 237736 223888 106905
15123 106905 -20977 -18626 92987 146248 148537 182571 155044 210635 276514 322325 344160
15112 344160 231951 211277 144189 89890 150583 137964 232956 274997 350306 299276 286955
15101 286955 277624 199947 112171 134974 126957 74483 118407 142836 241856 281166 347196 339442
15089 339442 397281 422055 377984 289949 193661 130652 191987 192287 146422 105823 60878 60025
15077 60025 136661 126282 94301 160736 185717 227447 241724 135716 63878 114106 34004
$$ packed form
15158A62935k11068J886Q3295R714J524q3243M5982O8481O8694m8467L9640M4409
15146A83782J1003o0296m6139J15544O3219r7278j8792N938J7482o780J7644K1506
15134B06833k042k910m8756o7172l6376L2905k3062O0144J18172j3848j16983
15123A06905j27882K351J11613N3261K289L4034k7527N5591O5879M5811K1835
15112C44160j12209k0674o7088n4299O0693j2619R4992M2041P5309n1030j2321
15101B86955r331p7677q7776K2803q017n2474M3924K4429R9020L9310O6030p754
15089C39442N7839K4774m4071q8035r6288o3009O1335L00m5865m0599m4945q53
15077F0025P6636j0379l1981O6435K4981M1730J4277j06008p1838N0228q0102
$$ plain form
15066 34004 68559 36841 4822 14148 125062 257242 254037 194935 147676 99754 137856 166721
15054 166721 143691 173861 164350 77260 79134 214354 201765 151704 118098 119407 155754 186960
15042 186960 205128 225856 118981 138013 233122 177074 145129 225391 217824 208306 283118 275863
15030 275863 262719 302022 269317 228259 118286 163534 191695 135282 62662 73564 210231
15019 210231 178869 67511 51381 186023 253133 150801 118064 296249 422122 287754
15009 287754 291341 315331 375323 319365 231715 238771 171953 152049 147804 102700 51145 156276
14997 156276 188813 248852 333188 312369 156867 81876 96082 51139 190878 293089 235138
14986 235138 224622 166103 158088 231677 186179 126807 148861 270156 306799 112156 86855
$$ packed form
15066C4004L4555l1718l2019R326J10914J32180l205n9102m7259m7922L8102K8865
15054A66721k3030L0170r511q7090J874J35220j2589n0061l3606J309L6347L1206
15042A86960J8168K0728j06875J9032R5109n6048l1945Q0262p567r518P4812p255
15030B75863j3144L9303l2705m1058j09973M5248K8161n6413p2620J0902J36667
15019B10231l1362j11358j6130J34642O7110j02332l2737J78185J25873j34368
15009B87754L587K3990N9992n5958q7650P056o6818j9904m245m5104n1555J05131
14997A56276L2537O0039Q4336k0819j55502p4991J4206m4943J39739J02211n7951
14986B35138j0516n8519q015P3589m5498n9372K2054J21295L6643j94643k5301
$$ plain form
14975 86855 141149 186472 162663 102873 177314 269469 260651 249513 235139 220626 235160 189536
14963 189536 187979 179547 200963 178374 189168 225427 140535 75132 190058 131576 90008 79478
14951 79478 127028 130406 162546 268482 343312 299618 264132 200311 183544 144788 113076 -30951
14939 -30951 -4664 39656 -32586 -9229 21256 799 49610 166551 197364 185239 342627
14928 342627 437816 381615 398168 323387 235786 164798 206753 230236 274521 198140 169201
14917 169201 162968 198401 227337 190944 53962 94999 109157 21002 49395 82060 119985
14906 119985 210883 204765 130175 141713 238710 230211 207156 184283 152344 196922 252427 220464
14894 220464 238972 272210 156368 -26920 11414 4359 66503 63702 137112 178928 203122
$$ packed form
14975H6855N4294M5323k3809n9790P4441R2155q818j1138j4374j4513J4534m5624
14963A89536j557q432K1416k2589J0794L6259q4892o5403J14926n8482m1568j0530
14951G9478M7550L378L2140J05936P4830m3694l5486o3821j6767l8756l1712j44027
14939c0951K6287M4320p2242K3357L0485k0457M8811J16941L0813j2125J57388
14928C42627R5189n6201J6553p4781q7601p0988M1955K3483M4285p6381k8939
14917A69201o233L5433K8936l6393j36982M1037J4158q8155K8393L2665L7925
14906A19985R0898o118p4590J1538R6997q499k3055k2873l1939M4578N5505l1963
14894B20464J8508L3238j15842j83288L8334p055O2144k801P3410M1816K4194
$$ plain form
14883 203122 166890 136064 152089 78602 114133 155515 198244 303533 304922 232889 258791
14872 258791 230563 234741 271998 280305 334021 369284 255751 225105 153380 188230 313606
14861 313606 323063 229933 168609 127415 146588 45095 57527 215688 259245 244540 247051
14850 247051 231392 202450 235181 301709 314242 341764 286235 230640 326731 364302 312725
14839 312725 249093 183718 253517 394091 427255 330498 310435 274845 120218 51262 108890
14828 108890 156809 129326 253942 400224 352043 224956 174259 77612 43021 -9128 51150
14817 51150 157031 266062 343313 356114 306710 245346 151822 178575 115535 101894 91691
14806 91691 177020 230568 272130 332189 410285 339927 146602 114794 268450 345281 314104
$$ packed form
14883B03122l6232l0826J6025p3487L5531M1382M2729J05289J389p2033K5902
14872B58791k8228M178L7257Q307N3716L5263j13533l0646p1725L4850J25376
14861C13606R457r3130o1324m1194J9173j01493J2432J58161M3557j4705K511
14850B47051j5659k8942L2731O6528J2533K7522n5529n5595R6091L7571n1577
14839C12725o3632o5375O9799J40574L3164r6757k0063l5590j54627o8956N7628
14828A08890M7919k7483J24616J46282m8181j27087n0697r6647l4591n2149O0278
14817E1150J05881J09031P7251J2801m9404o1364r3524K6753o3040j3641j0203
14806I1691Q5329N3548M1562O0059P8096p0358j93325l1808J53656P6831l1177
$$ plain form
14795 314104 303677 229535 213338 227025 192633 214188 282714 215469 218731 201229 200493 241000
14783 241000 306887 258971 292646 350725 343752 200077 160561 126585 173971 148967 232812
14772 232812 286243 205752 218727 201785 175419 121885 122122 159090 134959 146930 203803 349131
14760 349131 321974 287549 272514 208484 212807 182525 103691 28646 53577 127104 153540 242689
14748 242689 224744 158071 70393 97306 224301 121446 135475 191381 262932 275154 190207
14737 190207 239460 305604 322586 288738 332875 334973 195010 68281 83696 94969 72896
14726 72896 151732 300865 400524 290463 164399 136238 178443 225469 307948 257876 135785
14715 135785 265580 337704 306238 331327 283991 210114 269130 285393 172192 200212 158226
$$ packed form
14795C14104j0427p4142j6197J3687l4392K1555O8526o7245L262j7502p36M0507
14783B41000O5887m7916L3675N8079o973j43675l9516l3976M7386k5004Q3845
14772B32812N3431q0491J2975j6942k6366n3534K37L6968k4131J1971N6873J45328
14760C49131k7157l4425j5035o4030M323l0282p8834p5045K4931P3527K6436Q9149
14748B42689j7945o6673q7678K6913J26995j02855J4029N5906P1551J2222q4947
14737A90207M9253O6144J6982l3848M4137K098j39963j26729J5415J1273k2073
14726G2896P8836J49133R9659j10061j26064k8161M2205M7026Q2479n0072j22091
14715A35785J29795P2124l1466K5089m7336p3877N9016J6263j13201K8020m1986
$$ plain form
14704 158226 94264 106500 134539 119230 226927 310821 250880 239390 234826 268410 374059
14693 374059 304012 239677 247006 303556 239700 203175 362615 367574 386111 417958 331538 250195
14681 250195 174877 101063 115050 343090 386836 326248 332178 298388 236267 240761 237325 242652
14669 242652 270489 285027 223164 227029 375918 431699 339082 341493 266333 180331 185198 314821
14657 314821 411867 395279 287872 242462 327510 418675 428488 379179 317483 276136 404863
14646 404863 379887 276813 284191 320845 249929 160608 222436 333216 313856 346031 381060
14635 381060 254821 226140 298328 322494 329286 316997 313690 219753 145951 149617 214173 218052
14623 218052 186387 232509 288858 354821 317255 226345 221446 312090 356417 374468 378555 392071
$$ packed form
14704A58226o3962J2236K8039j5309J07697Q3894n9941j1490m564L3584J05649
14693C74059p0047o4335P329N6550o3856l6525J59440M959J8537L1847q6420q1343
14681B50195p5318p3814J3987K28040M3746o0588N930l3790o2121M494l436N327
14669B42652K7837J4538o1863L865J48889N5781r2617K411p5160q6002M867J29623
14657C14821R7046j6588j07407m5410Q5048R1165R813m9309o1696m1347J28727
14646D04863k4976j03074P378L6654p0916q9321O1828J10780j9360L2175L5029
14635C81060j26239k8681P2188K4166O792j2289l307r3937p3802L666O4556L879
14623B18052l1665M6122N6349O5963l7566r0910m899R0644M4327J8051M087J3516
$$ plain form
14611 392071 409512 373812 288046 300018 304853 226095 245729 389427 444911 496800 524479
14600 524479 457550 470372 476134 330266 128541 122584 197220 168990 190491 263812 270108 170648
14588 170648 246605 235065 209784 267694 243817 292368 245730 199792 240585 332917 372528
14577 372528 372863 360829 357398 277753 313154 284474 224472 280159 300602 302295 266967 264287
14565 264287 368550 410572 286970 289933 282297 345648 308346 261052 238293 306783 311077 282734
14553 282734 383892 419117 456589 397038 337719 390137 377665 416968 372051 216052 138399
14542 138399 50861 126848 274185 252973 215843 314857 294015 317415 313131 378695 297355
14531 297355 221427 138874 99542 163865 283817 234335 167562 284189 301664 225813 175669
$$ packed form
14611C92071J7441l5700q5766J1972M835p8758J9634J43698N5484N1889K7679
14600E24479o6929J2822N762j45868k01725n957P4636k8230K1501P3321O296r9460
14588A70648P5957j1540k5281N7910k3877M8551m6638m5938M0793R2332L9611
14577C72528L35j2034l431p9645L5401k8680o0002N5687K0443J693l5328k680
14565B64287J04263M2022j23602K963p636O3351l7302m7294k2759O8490M294k8343
14553B82734J01158L5225L7472n9551n9319N2418j2472L9303m4917j55999p7653
14542A38399q7538P5987J47337k1212l7130R9014k0842K3400m284O5564q1340
14531B97355p5928q2553l9332O4323J19952m9482o6773J16627J7475p5851n0144
$$ plain form
14520 175669 258427 323020 391817 442217 415080 272038 190447 199037 244729 192266 161322
14509 161322 131290 94517 175377 134070 149558 248245 297360 364099 271949 178973 245607
14498 245607 260423 323465 372463 394785 363931 351479 332149 286142 228836 173403 154762
14487 154762 99624 89275 208528 296286 432903 462805 406390 441232 432215 377145 306955
14476 306955 338493 442350 534058 513808 545001 536386 445265 373660 382350 416479 342895 302686
14464 302686 331491 359594 431881 472185 425240 410768 382547 212164 244992 322367 327299
14453 327299 312262 318429 332829 351638 326204 326459 310428 277631 264917 307177 329754 350099
14441 350099 425501 391311 374447 352226 289473 349630 433104 410464 317342 195074 224135
$$ packed form
14520A75669Q2758O4593O8797N0400k7137j43042q1591Q590M5692n2463l0944
14509A61322l0032l6773Q0860m1307J5488R8687M9115O6739r2150r2976O6634
14498B45607J4816O3042M8998K2322l0854j2452j9330m6007n7306n5433j8641
14487A54762n5138j0349J19253Q7758J36617K9902n6415L4842r017n5070p0190
14476C06955L1538J03857R1708k0250L1193q615r1121p1605Q690L4129p3584m0209
14464C02686K8805K8103P2287M0304m6945j4472k8221j70383L2828P7375M932
14453C27299j5037O167J4400J8809k5434K55j6031l2797j2714M2260K2577K0345
14441C50099P5402l4190j6864k2221o2753O0157Q3474k2640r3122j22268K9061
$$ plain form
14430 224135 301474 403213 485788 546063 494528 359782 302885 241317 229636 319987 294876
14419 294876 339348 453232 349887 209547 126192 215002 356197 276527 78167 41464
14409 41464 4233 -18922 185527 287247 265088 141311 240184 379179 404582 347500 364895
14398 364895 298751 248252 284842 293518 286872 274333 221345 204521 13862 76020 215766
14387 215766 329478 317001 276733 320254 276635 228995 253385 238527 253870 312172 262287
14376 262287 308864 461753 505639 420315 363709 309844 334775 328751 340894 335757 255614 170957
14364 170957 131953 149362 199439 170578 193187 222218 268037 427579 442013 400395 335474
14353 335474 286642 348613 411922 423850 358036 355034 395841 391463 341882 246663 290855 290329
$$ packed form
14430B24135P7339J01739Q2575O0275n1535j34746n6897o1568j1681R0351k5111
14419B94876M4472J13884j03345j40340q3355Q8810J41195p9670j98360l6703
14409D1464l7231k3155K04449J01720k2159j23777R8873J38995K5403n7082J7395
14398C64895o6144n0499L6590Q676o646j2539n2988j6824j90659O2158J39746
14387B15766J13712j2477m0268M3521m3619m7640K4390j4858J5343N8302m9885
14376B62287M6577J52889M3886q5324n6606n3865K4931o024J2143n137q0143q4657
14364A70957l9004J7409N0077k8861K2609K9031M5819J59542J4434m1618o4921
14353C35474m8832O1971O3309J1928o5814l002M0807m378m9581r5219M4192n26
$$ plain form
14341 290329 276128 242197 165203 41246 76763 171264 283842 261049 241926 282697 290960
14330 290960 207368 327276 387244 309475 344098 296307 219550 252135 456057 477714 451078
14319 451078 457638 438584 479642 516273 534093 535286 559306 528302 612681 649733 581280 454789
14307 454789 466151 535158 525774 521512 553122 558912 520287 545437 477807 527192 630901 683815
14295 683815 599362 479733 387291 311834 377901 463991 484692 454589 396487 338053 347056
14284 347056 321223 243460 242947 354069 483115 550035 407177 284261 267632 304391 395703
14273 395703 431094 338101 334890 392037 381450 343465 363227 396710 421609 484388 509085 494062
14261 494062 492007 465436 477573 487595 614056 676059 691013 651633 632748 515835 492752
$$ packed form
14341B90329j4201l3931p6994j23957L5517R4501J12578k2793j9123M0771Q263
14330B90960q3592J19908N9968p7769L4623m7791p6757L2585K03922K1657k6636
14319D51078O560j9054M1058L6631J7820J193K4020l1004Q4379L7052o8453j26491
14307D54789J1362O9007r384m262L1610N790l8625K5150o7630M9385J03709N2914
14295F83815q4453j19629r2442p5457O6067Q6090K0701l0103n8102n8434R003
14284C47056k5833p7763n13J11122J29046O6920j42858j22916j6629L6759R1312
14273C95703L5391r2993l211N7147j0587l7985J9762L3483K4899O2779K4697j5023
14261D94062k055k6571J2137J0022J26461O2003J4954l9380j8885j16913k3083
$$ plain form
14250 492752 372107 280650 480284 596259 592038 535807 384194 326648 384302 403867 393764
14239 393764 544910 508343 437274 380023 435696 564855 584183 558889 571341 675817 569130
14228 569130 499562 444931 299487 186072 277778 454896 521290 474722 468328 379373 334297
14217 334297 382901 413755 408732 484348 498386 549358 533426 550785 543375 545581 516410 433852
14205 433852 432409 440439 370361 420625 430309 368296 349302 248542 264155 361441 493098 559209
14193 559209 480812 450438 442116 502114 583455 527271 478969 381733 319047 294635 280367 374675
14181 374675 325495 303674 405528 452840 430640 470277 340193 318518 319867 346479 272907
14170 272907 243263 332030 380769 423278 557384 639480 596160 633830 704520 758194 729128
$$ packed form
14250D92752j20645r1457J99634J15975m221n6231j51613n7546N7654J9565j0103
14239C93764J51146l6567p1069n7251N5673J29159J9328k5294J2452J04476j06687
14228E69130o9568n4631j45444j13415R1706J77118O6394m6568o394q8955m5076
14217C34297M8604L0854n023P5616J4038N0972j5932J7359p410K206k9171q2558
14205D33852j443Q030p0078N0264R684o2013j8994j00760J5613R7286J31657O6111
14193E59209p8397l0374q322N9998Q1341n6184m8302r7236o2686k4412j4268R4308
14181C74675m9180k1821J01854M7312k2200L9637j30084k1675J349K6612p3572
14170B72907k9644Q8767M8739M2509J34106Q2096m3320L7670P0690N3674k9066
$$ plain form
14159 729128 597835 470379 470766 516821 535054 504411 433062 427005 408939 405727 485013 568203
14147 568203 563768 486892 392250 450731 462101 503787 502872 552197 565779 604412 624569 558183
14135 558183 552677 563506 560035 517507 532397 534906 534507 484307 544133 607949 642862 683665
14123 683665 820169 700984 595015 533238 562004 593932 646725 613463 519937 468829 460452
14112 460452 414530 442612 415215 496444 542977 458340 465412 483509 352320 341584 386860
14101 386860 491827 574707 652534 630387 532094 548734 531673 452506 350920 391482 421602
14090 421602 432864 452720 531751 507101 416485 410803 483113 517392 524226 610424 705058 747549
14078 747549 735255 621462 470809 468499 427021 477655 442688 302877 351497 412152 387998
$$ packed form
14159G29128j31293j27456L87M6055J8233l0643p1349o057j8066l212P9286Q3190
14147E68203m435p6876r4642N8481J1370M1686r15M9325J3582L8633K0157o6386
14135E58183n506J0829l471m2528J4890K509l99n0200N9826O3816L4913M0803
14123F83665J36504j19185j05969o1777K8766L1928N2793l3262r3526n1108q377
14112D60452m5922K8082k7397Q1229M6533q4637P072J8097j31189j0736M5276
14101C86860J04967Q2880P7827k2147r8293J6640j7061p9167j01586M0562L0120
14090D21602J1262J9856P9031k4650r0616n682P2310L4279O834Q6198R4634M2491
14078G47549j2294j13793j50653k310m1478N0634l4967j39811M8620O0655k4154
$$ plain form
14067 387998 505988 498972 346350 336417 378606 372185 398502 515525 631269 547280 459655
14056 459655 424650 509560 543216 629733 682686 633024 565692 579815 453049 341802 386949
14045 386949 536178 663800 667857 633527 574869 529337 574788 529657 582509 661034 760348
14034 760348 821774 864953 771560 626754 540506 525550 395189 408781 429688 383026 389256
14023 389256 486918 493105 603853 631409 580779 433545 447449 508856 521824 452144 434730
14012 434730 504398 517932 508831 533181 508784 556038 564899 596610 630032 596596 580664 667737
14000 667737 659884 529244 521577 602983 547510 551532 549190 572901 587639 528655 562092 551306
13988 551306 374706 335122 413745 378348 374419 414457 419062 324717 366443 419823 551845
$$ packed form
14067C87998J17990p016j52622r933M2189o421K6317J17023J15744q3989q7625
14056D59655l5005Q4910L3656Q6517N2953m9662o7332J4123j26766j11247M5147
14045C86949J49229J27622M057l4330n8658m5532M5451m5131N2852P8525R9314
14034G60348O1426M3179r3393j44806q6248j4956j30361J3592K0907m6662O230
14023C89256R7662O187J10748K7556n0630j47234J3904O1407J2968o9680j7414
14012D34730O9668J3534r101K4350k4397M7254Q861L1711L3422l3436j5932Q7073
14000F67737p853j30640p667Q1406n5473M022k342K3711J4738n8984L3437j0786
13988E51306j76600l9584P8623l5397l929M0038M605r4345M1726N3380J32022
$$ plain form
13977 551845 641241 690838 774308 739049 697570 678460 565260 519691 583608 555815 509897
13966 509897 420915 467380 495890 716933 889585 840139 789161 726355 613559 566081 577353
13955 577353 625466 684209 695056 573040 535808 494979 566787 560756 521894 608923 644836
13944 644836 616164 594741 581447 544932 532165 526408 530183 440588 426845 530400 589420 561599
13932 561599 560017 417945 364819 472897 575586 530227 526780 678212 629278 648355 616950
13921 616950 562615 498269 503230 506361 509336 601648 545532 493363 489721 507872 500216 633906
13909 633906 686732 663152 641889 644443 611286 664466 706495 742094 621448 490723 522536
13898 522536 611617 576093 606548 582583 527373 622337 651614 799129 827291 807563 763775
$$ packed form
13977E51845Q9396M9597Q3470l5259m1479j9110j13200m5569O3917k7793m5918
13966E09897q8982M6465K8510K21043J72652m9446n0978o2806j12796m7478J1272
13955E77353M8113N8743J0847j22016l7232m0829P1808o031l8862Q7029L5913
13944F44836k8672k1423j3294l6515j2767n757L775q9595j3743J03555N9020k7821
13932E61599j582j42072n3126J08078J02689m5359l447J51432m8934J9077l1405
13921F16950n4335o4346M961L131K975R2312n6116n2169l642J8151p656J33690
13909F33906N2826k3580k1263K554l3157N3180M2029L5599j20646j30725L1813
13898E22536Q9081l5524L0455k3965n5210R4964K9277J47515K8162j9728m3788
$$ plain form
13887 763775 678013 566753 468677 566665 627349 561802 589365 626823 750479 631852 601117
13876 601117 692114 609476 558633 590423 567047 593524 750558 835027 793354 697621 793892
13865 793892 939041 957761 928523 820481 708675 732994 701656 720802 698404 703636 673528
13854 673528 699388 644954 619495 558830 530863 472963 583905 609995 603917 710053 845454
13843 845454 777448 682246 634063 558198 637316 600590 581033 596603 672350 652757 619214
13832 619214 678359 795791 798835 829200 792633 890321 791333 732489 728733 747478 770575 702218
13820 702218 748685 769888 682751 770102 731465 758647 746937 695961 696780 765713 821025 730433
13808 730433 691149 710914 709294 819680 852389 621475 489001 623217 751994 795471 662726
$$ packed form
13887G63775q5762j11260r8076R7988O0684o5547K7563L7458J23656j18627l0735
13876F01117R0997q2638n0843L1790k3376K6477J57034Q4469m1673r5733R6271
13865G93892J45149J8720k9238j08042j11806K4319l1338J9146k2398N232l0108
13854F73528K5860n4434k5459o0665k7967n7900J10942K6090o078J06136J35401
13843H45454o8006r5202m8183p5865P9118l6726j9557J5570P5747j9593l3543
13832F19214N9145J17432L044L0365l6567R7688r8988n8844l756J8745K3097o8357
13820G02218M6467K1203q7137Q7351l8637K7182j1710n0976Q19O8933N5312r0592
13808G30433l9284J9765j620J10386L2709k30914j32474J34216J28777M3477j32745
$$ plain form
13797 662726 603170 594583 690520 695712 619583 570979 609218 699166 867888 813051 649628
13786 649628 664802 786554 802198 800201 769717 787061 836011 862095 870591 812028 730555 795032
13774 795032 755329 687804 706464 737320 770951 793318 709688 691255 683799 774939 910046
13763 910046 885749 749084 728355 803150 797539 787814 804561 772984 742690 750117 672294 702568
13751 702568 735726 748150 886446 962068 937216 876710 801198 739905 841611 932482 854089
13740 854089 798756 837197 846189 759835 748004 700305 643813 771297 844039 730003 745367
13729 745367 803659 824990 846189 844620 751034 758825 898784 959999 926849 936608 875593 869835
13717 869835 976587 1058295 1108827 1132649 995608 875692 879282 1026759 1048694 1016449 998766
$$ packed form
13797F62726n9556q587R5937N192p6129m8604L8239Q9948J68722n4837j63423
13786F49628J5174J21752J5644j997l0484J7344M8950K6084Q496n8563q1473O4477
13774G95032l9703o7525J8660L0856L3631K2367q3630j8433p456R1140J35107
13763I10046k4297j36665k0729P4795n611r725J6747l1577l0294P427p7823L0274
13751G02568L3158J2424J38296P5622k4852o0506p5512o1293J01706R0871p8393
13740H54089n5333L8441Q992q6354j1831m7699n6492J27484P2742j14036J5364
13729G45367N8292K1331K1199j569r3586P791J39959O1215l3150R759o1015n758
13717H69835J06752Q1708N0532K3822j37041j19916L590J47477K1935l2245j7683
$$ plain form
13706 998766 926558 875443 722157 647791 746672 885881 886360 902542 908029 898837 865956 800902
13694 800902 836959 789297 743132 738727 658729 661331 716160 837391 848108 805716 860658 911771
13682 911771 963401 939306 906750 838887 852804 946449 1020857 893515 802954 801739 805042 801863
13670 801863 883185 854766 802778 919454 904601 863645 777022 747962 820053 861035 953848
13659 953848 1024747 943754 926166 925185 902970 849834 849302 869791 900939 869921 810834 771483
13647 771483 732886 740171 783626 929841 1043225 1005964 882364 880030 909476 923005 886688
13636 886688 878596 885449 806533 682921 712465 850108 892591 840370 799238 745857 840740
13625 840740 859891 831975 872346 979308 1029365 1096597 1147211 1040553 1069336 1094147 1059609
$$ packed form
13706I98766p2208n1115j53286p4366R8881J39209M79J6182N487r192l2881o5054
13694H00902L6057m7662m6165m405p9998K602N4829J21231J0717m2392N4942N1113
13682I11771N1630k4095l2556o7863J3917R3645P4408j27342r0561j215L303l179
13670H01863Q1322k8419n1988J16676j4853m0956q6623k9060P2091M0982R2813
13659I53848P0899q0993j7588r81k2215n3136n32K0489L1148l1018n9087l9351
13647G71483l8597P285M3455J46215J13384l7261j23600k334K9446J3529l6317
13636H86688q092O853p8916j23612K9544J37643M2483n2221m1132n3381R4883
13625H40740J9151k7916M0371J06962N0057O7232N0614j06658K8783K4811l4538
$$ plain form
13614 1059609 1050311 1111770 1198987 1075228 991883 1032830 1057525 1037353 960615 907329 973797
13603 973797 1011646 1069136 1092552 1008553 907934 943195 987147 1051631 1096795 1177963 1125098
13592 1125098 1109385 1129282 1152994 1212084 1020690 854333 861277 851544 799894 866672 880241
13581 880241 915122 998969 1033277 1120643 1112886 983948 1029739 945478 954309 970385 874660 832398
13569 832398 776499 700919 760893 881564 867855 874795 946022 983256 941542 846530 1016713
13558 1016713 1146886 1144764 1103804 1019586 1092463 1079577 1117505 1152101 1129062 1055557 1042190
13547 1042190 1036928 865550 1045596 1199219 1208877 1110161 1048996 1108549 1083571 1128200 1073029
13536 1073029 954783 946053 1049825 1070714 1036867 1115705 1115962 1014060 957358 1049710 1121242
$$ packed form
13614A059609r298O1459Q7217j23759q3345M0947K4695k0172p6738n3286O6468
13603I73797L7849N7490K3416q3999j00619L5261M3952O4484M5164Q1168n2865
13592A125098j5713J9897K3712N9090j91394j66357O944r733n1650O6778J3569
13581H80241L4881Q3847L4308Q7366p757j28938M5791q4261Q831J6076r5725m2262
13569H32398n5899p5580N9974J20671j3709O940P1227L7234m1714r5012J70183
13558A016713J30173k122m0960q4218P2877j2886L7928L4596k3039p3505j3367
13547A042190n262j71378J80046J53623R658r8716o1165N9553k4978M4629n5171
13536A073029j18246q730J03772K0889l3847P8838K57j01902n6702R2352P1532
$$ plain form
13525 1121242 1122078 1101690 1122130 1226808 1157017 1008741 909166 1027046 1141223 1034884 914417
13514 914417 1005209 1018171 1101502 1115247 1106665 1108094 1014047 944286 833121 842863 971838 1078711
13502 1078711 1027458 970466 766790 762823 971711 1129368 1068887 1054264 1062150 1066388 982920
13491 982920 1037613 1056655 1152966 1091130 1068991 1110701 1156514 1150805 1201349 1227611 1181577 1056182
13479 1056182 1082823 1078588 1002290 1030007 1186213 1128073 1159225 1290458 1234786 1159732 1197900
13468 1197900 1191295 1189984 1309022 1389977 1331130 1391788 1468658 1603303 1590364 1562380 1592108
13457 1592108 1560578 1494389 1439857 1425111 1494580 1477507 1426413 1331290 1376619 1336421 1228437
13446 1228437 1148043 1170997 1223115 1208244 1212043 1313587 1219814 1154859 1124196 1128762 1232142
$$ packed form
13525A121242Q36k0388K0440J04678o9791j48276r9575J17880J14177j06339j20467
13514I14417R0792J2962Q3331J3745q582J429r4047o9761j11165R742J28975J06873
13502A078711n1253n6992k03676l967K08888J57657o0481j4623P886M238q3468
13491I82920N4693J9042R6311o1836k2139M1710M5813n709N0544K6262m6034j25395
13479A056182K6641m235p6298K7717J56206n8140L1152J31233n5672p5054L8168
13468A197900o605j311J19038Q0955n8847O0658P6870J34645j2939k7984K9728
13457A592108l1530o6189n4532j4746O9469j7073n1094r5123M5329m0198j07984
13446A228437q0394K2954N2118j4871L799J01544r3773o4955l0663M566J03380
$$ plain form
13435 1232142 1170556 1094116 1037425 1096372 1198930 1247476 1231542 1265227 1374384 1467667 1489867
13424 1489867 1526242 1658473 1655178 1691645 1835421 1935558 2157648 2381412 2554030 2807415
13414 2807415 2895513 2914809 2948047 2821167 2562197 2196285 2026069 1771370 1598422 1562553
13404 1562553 1571248 1591630 1484219 1408133 1389215 1394517 1415549 1461612 1444011 1427657 1328884
13393 1328884 1309598 1392965 1415338 1353622 1344765 1334366 1415061 1443437 1384796 1346500 1318713
13382 1318713 1368626 1461449 1539590 1526851 1462588 1427299 1452317 1641093 1736139 1929272 2230374
13371 2230374 2634644 3013265 3215223 3352179 3382239 3162127 2706819 2303928 2112631 1887684
13361 1887684 1663548 1623764 1722480 1766480 1591403 1400542 1384119 1427141 1492367 1413720 1383882
$$ packed form
13435A232142o1586p6440n6691N8947J02558M8546j5934L3685J09157R3283K2200
13424A489867L6375J32231l295L6467J43776J00137K22090K23764J72618K53385
13414B807415Q8098J9296L3238j26880k58970l65912j70216k54699j72948l5869
13404A562553Q695K0382j07411p6086j8918N302K1032M6063j7601j6354r8773
13393A328884j9286Q3367K2373o1716q857j0399Q0695K8376n8641l8296k7787
13382A318713M9913R2823P8141j2739o4263l5289K5018J88776R5046J93133L01102
13371B230374M04270L78621K01958J36956L0060k20112m55308m02891j91297k24947
13361A887684k24136l9784R8716M4000j75077j90861j6423M3022O5226p8647k9838
$$ plain form
13350 1383882 1435765 1599497 1683146 1610361 1567324 1604885 1569517 1545422 1473893 1414724 1394584
13339 1394584 1374610 1406013 1378401 1400662 1342744 1299912 1399603 1521918 1537975 1594211 1640954
13328 1640954 1726461 1741000 1829019 1863237 1873848 1965639 2048596 1965337 1795920 1607017 1584668
13317 1584668 1596771 1599527 1504593 1408818 1437165 1486737 1483542 1601258 1720110 1746622 1573727
13306 1573727 1511416 1626745 1611803 1566738 1528880 1624928 1569354 1580742 1531076 1516594 1540803
13295 1540803 1526109 1496761 1460894 1434305 1504775 1579481 1551037 1461095 1535047 1510930 1565369
13284 1565369 1626353 1584932 1481320 1526625 1590836 1544346 1525204 1533752 1555669 1629916 1662123
13273 1662123 1567227 1486709 1456461 1448739 1501515 1439828 1400866 1506926 1563086 1524510 1502226
$$ packed form
13350A383882N1883J63732Q3649p2785m3037L7561l5368k4095p1529n9169k0140
13339A394584j9974L1403k7612K2261n7918m2832R9691J22315J6057N6236M6743
13328A640954Q5507J4539Q8019L4218J0611R1791Q2957q3259j69417j88903k2349
13317A584668J2103K756r4934r5775K8347M9572l195J17716J18852K6512j72895
13306A573727o2311J15329j4942m5065l7858R6048n5574J1388m9666j4482K4209
13295A540803j4694k9348l5867k6589P0470P4706k8444q9942P3952k4117N4439
13284A565369O0984m1421j03612M5305O4211m6490j9142Q548K1917P4247L2207
13273A662123r4896q0518l0248p722N2776o1687l8962J06060N6160l8576k2284
$$ plain form
13262 1502226 1458973 1467625 1522337 1534920 1589823 1558673 1613703 1560067 1448127 1410038 1412668
13251 1412668 1407175 1456148 1551775 1554644 1544858 1476900 1522017 1547574 1592139 1512570 1536726 1569474
13239 1569474 1643669 1681886 1636180 1657347 1675728 1570670 1559819 1569664 1482405 1547337 1635821
13228 1635821 1643854 1578894 1601675 1683896 1702591 1577162 1544984 1585881 1670108 1694592 1703870
13217 1703870 1803601 1842047 1900396 1908973 1799593 1697962 1658802 1679770 1700896 1652357 1674060
13206 1674060 1759121 1760172 1567647 1565016 1563309 1718773 1680496 1786880 1897488 1852409 1707565
13195 1707565 1633793 1738238 1806852 1919545 1956586 2039916 2025941 1856795 1776596 1687853 1715179
13184 1715179 1810765 1760984 1643003 1618242 1574098 1452573 1546595 1597736 1611563 1628529 1582574
$$ packed form
13262A502226m3253Q652N4712J2583N4903l1150N5030n3636j11940l8089K630
13251A412668n493M8973R5627K869r786o7958M5117K5557M4565p9569K4156L2748
13239A569474P4195L8217m5706K1167J8381j05058j0851R845q7259O4932Q8484
13228A635821Q033o4960K2781Q2221J8695j25429l2178M0897Q4227K4484R278
13217A703870R9731L8446N8349Q577j09380j01631l9160K0968K1126m8539K1703
13206A674060Q5061J051j92525k631j707J55464l8277J06384J10608m5079j44844
13195A707565p3772J04445O8614J12693L7041Q3330j3975j69146q0199q8743K7326
13184A715179R5586m9781j17981k4761m4144j21525R4022N1141J3827J6966m5955
$$ plain form
13173 1582574 1585783 1687094 1764471 1673217 1635518 1658634 1684954 1719064 1840345 1858298 1976927
13162 1976927 1953834 1838857 1828365 1800373 1781376 1733611 1758396 1921225 1983628 2019312 2006855
13151 2006855 1996067 2020634 2081742 2080454 2116073 2155739 2102404 1918520 1877110 1790460 1729672
13140 1729672 1806330 1934238 2016927 2040456 2110282 2121108 2158183 2197561 2142009 2124828 2192558
13129 2192558 2246416 2249700 2215862 2100799 2045371 2070033 2025677 2041053 2076125 2054980 2138355
13118 2138355 2262085 2333768 2301176 2173246 2221146 2211920 2241469 2230263 2221932 2134697 2043684
13107 2043684 2036075 2040603 2037009 2159173 2177019 2101093 2138887 2085565 2075107 2083178 2053639 2022147
13095 2022147 2028321 1992140 1991626 2005548 2117297 2132840 2096617 2191694 2288191 2513082 2701122
$$ packed form
13173A582574L209J01311P7377r1254l7699K3116K6320L4110J21281J7953J18629
13162A976927k3093j14977j0492k7992j8997m7765K4785J62829O2403L5684j2457
13151B006855j0788K4567O1108j288L5619L9666n3335j83884m1410q6650o0788
13140A729672P6658J27908Q2689K3529O9826J0826L7075L9378n5552j7181O7730
13129B192558N3858L284l3838j15063n5428K4662m4356J5376L5072k1145Q3375
13118B138355J23730P1683l2592j27930M7900r226K9549j1206q331q7235r1013
13107B043684p609M528l594J22164J7846p5926L7794n3322j0458Q071k9539l1492
13095B022147O174l6181n14J3922J11749J5543l6223R5077R6497K24891J88040
$$ plain form
13084 2701122 2705791 2699763 2666419 2635318 2638521 2520008 2454655 2579791 2689420 2673937 2727108
13073 2727108 2784526 2776994 2701148 2444023 2263737 2291113 2319255 2324945 2303489 2259355 2249344
13062 2249344 2304252 2337444 2343188 2280458 2188877 2205495 2188520 2206778 2310906 2349069 2398347
13051 2398347 2298527 2265698 2308290 2408283 2384956 2401985 2448048 2484860 2457925 2425586 2495564
13040 2495564 2513806 2636625 2689214 2769204 2805754 2648482 2605911 2692779 2742695 2817131 2857800
13029 2857800 2818556 2687266 2738895 2732278 2686405 2626243 2606367 2646990 2606016 2597428 2712211
13018 2712211 2768421 2635760 2452556 2373803 2332670 2307742 2249746 2348476 2326744 2420180 2459346
13007 2459346 2427062 2347986 2249245 2201326 2312015 2403032 2476979 2573654 2611650 2645701 2680409
$$ packed form
13084B701122M669o028l3344l1101L203j18513o5353J25136J09629j5483N3171
13073B727108N7418p532p5846k57125j80286K7376K8142N690k1456m4134j0011
13062B249344N4908L3192N744o2730r1581J6618j6975J8258J04128L8163M9278
13051B398347r9820l2829M2592R9993k3327J7029M6063L6812k6935l2339O9978
13040B495564J8242J22819N2589P9990L6550j57272m2571Q6868M9916P4436M0669
13029B857800l9244j31290N1629o617m5873o0162j9876M0623m0974q588J14783
13018B712211N6210j32661j83204p8753m1133k4928n7996R8730k1732R3436L9166
13007B459346l2284p9076r8741m7919J10689R1017P3947R6675L7996L4051L4708
$$ plain form
12996 2680409 2749874 2800305 2792941 2701206 2637709 2652047 2661632 2626002 2578679 2527287 2668477
12985 2668477 2926245 2965402 2889423 2771347 2773544 2763300 2731772 2693822 2694635 2695754 2724678 2665375
12973 2665375 2582670 2606775 2702311 2649491 2571026 2552890 2512305 2561378 2645336 2712133 2714875
12962 2714875 2722181 2714771 2623067 2586888 2622157 2700023 2751411 2788687 2754985 2685947 2550107
12951 2550107 2541209 2584452 2713941 2682836 2595780 2699286 2783069 2822165 2827947 2819021 2813746 2857182
12939 2857182 2838182 2804401 2859218 2849484 2937901 2942157 3016413 3116979 3074625 3005150 2952721
12928 2952721 2910333 2891522 2903732 2880438 2918119 2946131 2848738 2839331 2942293 2932226 2908037
12917 2908037 2949001 2907100 2951449 2835680 2790869 2858396 3046927 3216866 3310459 3227716 3134269
$$ packed form
12996B680409O9465N0431p364r1735o3497J4338R585l5630m7323n1392J41190
12985B668477K57768L9157p5979j18076K197j0244l1528l7950Q13J119K8924n9303
12973B665375q2705K4105R5536n2820p8465j8136m0585M9073Q3958O6797K742
12962B714875P306p410r1704l6179L5269P7866N1388L7276l3702o9038j35840
12951B550107q898M3243J29489l1105q7056J03506Q3783L9096N782q926n275M3436
12939B857182j9000l3781N4817r734Q8417M256P4256J00566m2354o9475n2429
12928B952721m2388j8811J2210k3294L7681K8012r7393r407J02962j0067k4189
12917B908037M0964m1901M4349j15769m4811O7527J88531J69939R3593q2743r3447
$$ plain form
12906 3134269 3083091 3077446 3040457 2975207 3007905 3077440 3029610 3003910 3058499 3020248 3102244
12895 3102244 3247487 3173655 3084363 3154481 3130738 3090768 3076484 3100312 3106220 3096949 3282186
12884 3282186 3213470 3151447 3159594 3108348 3040597 3092111 3098275 3157847 3145093 3158246 3235164 3315960
12872 3315960 3191264 3114924 3018981 3018416 3165402 3267630 3271382 3275846 3313712 3366340 3297643
12861 3297643 3311195 3408096 3376221 3244020 3330130 3491370 3563033 3570374 3648393 3485502 3371735
12850 3371735 3410913 3471763 3434062 3470315 3488443 3451682 3347615 3261388 3295503 3374090 3413621
12839 3413621 3463015 3441189 3355310 3367659 3357214 3372730 3514046 3627103 3619490 3529638 3491189
12828 3491189 3486847 3571196 3624437 3553980 3571244 3693755 3638113 3468851 3403417 3482124 3543570
$$ packed form
12906C134269n1178n645l6989o5250L2698O9535m7830k5700N4589l8251Q1996
12895C102244J45243p3832q9292P0118k3743l9970j4284K3828N908r271J85237
12884C282186o8716o2023Q147n1246o7751N1514O164N9572j2754J3153P6918Q0796
12872C315960j24696p6340r5943n65J46986J02228L752M464L7866N2628o8697
12861C297643J3552R6901l1875j32201Q6110J61240P1663P341P8019j62891j13767
12850C371735L9178O0850l7701L6253J8128l6761j04067q6227L4115P8587L9531
12839C413621M9394k1826q5879J2349j0445J5516J41316J13057p613q9852l8449
12828C491189m342Q4349N3241p0457J7264J22511n5642j69262o5434P8707O1446
$$ plain form
12817 3543570 3584751 3560605 3671163 3790447 3753953 3687670 3724627 3727491 3852920 3889079 3792893
12806 3792893 3795814 3807623 3751403 3737793 3721762 3700965 3712296 3678220 3702654 3679086 3696606
12795 3696606 3658643 3674865 3817492 3912137 3893093 3867338 3908299 3926616 3858453 3926269 3954954
12784 3954954 3849672 3995133 4046546 3976102 3907060 3845585 3859431 3933831 3962163 3875944 3916099
12773 3916099 4063922 4125825 4080294 4015217 3950506 4030584 4104630 4120303 4082811 4089514 4159206
12762 4159206 4063338 3991565 4037144 4104568 4241866 4324951 4305826 4280020 4270300 4124680 4016491
12751 4016491 4010644 4035654 4092630 4177223 4271474 4352349 4424118 4405651 4401761 4380711 4420156 4481900
12739 4481900 4437420 4393254 4444428 4386194 4434119 4371772 4404172 4413177 4440296 4463261 4543607
$$ packed form
12817C543570M1181k4146J10558J19284l6494o6283L6957K864J25429L6159r6186
12806C792893K921J1809n6220j3610j6031k0797J1331l4076K4434k3568J7520
12795C696606l7963J6222J42627R4645j9044k5755M0961J8317o8163O7816K8685
12784C954954j05282J45461N1413p0444o9042o1475J3846P4400K8332q6219M0155
12773C916099J47823O1903m5531o5077o4711Q0078P4046J5673l7492O703O9692
12762D159206r5868p1773M5579O7424J37298Q3085j9125k5806r720j45620j08189
12751D016491n847K5010N6976Q4593R4251Q0875P1769j8467l890k1050L9445O1744
12739D481900m4480m4166N1174n8234M7925o2347L2400R005K7119K2965Q0346
$$ plain form
12728 4543607 4589936 4592700 4629056 4682007 4639236 4637396 4746283 4743990 4787192 4799232 4720656 4617197
12716 4617197 4606544 4674873 4727849 4673577 4738019 4741664 4754056 4829080 4884599 4957912 4953838 4949525
12704 4949525 4960201 4930510 4893222 4864661 4939748 5015193 5083238 5087635 5050264 5081200 5162538
12693 5162538 5214545 5185234 5040709 5066441 5099628 5195673 5107027 5050577 5022901 4992155 5020345
12682 5020345 5202624 5186371 5046805 4981307 5004459 5096811 5197049 5248400 5325337 5436635
12672 5436635 5627393 5835672 5993556 6094222 5999288 5803859 5698410 5665359 5543737 5444784
12662 5444784 5343956 5450156 5510213 5535435 5543493 5619408 5677246 5606875 5673126 5758656 5898791
12651 5898791 5910598 5892522 5857331 5956380 6025485 6061169 6018755 6115986 6078136 6245314 6304589
$$ packed form
12728D543607M6329K764L6356N2951m2771j840J08887k293M3202J2040p8576j03459
12716D617197j0653O8329N2976n4272O4442L645J2392P5024N5519P3313m074m313
12704D949525J0676k9691l7288k8561P5087P5445O8045M397l7371L0936Q1338
12693E162538N2007k9311j44525K5732L3187R6045q8646n6450k7676l0746K8190
12682E020345J82279j6253j39566o5498K3152R2352J00238N1351P6937J11298
12672E436635J90758K08279J57884J00666r4934j95429j05449l3051j21622r8953
12662E444784j00828J06200O0057K5222Q058P5915N7838p0371O6251Q5530J40135
12651E898791J1807j8076l5191R9049O9105L5684m2414R7231l7850J67178N9275
$$ plain form
12640 6304589 6293949 6409788 6597748 6686381 6851966 6804990 6796906 6850590 6891365 7039200 7110821
12629 7110821 7133410 7065610 7135419 7352055 7339025 7304676 7290827 7409035 7555217 7692730
12619 7692730 7745786 7859064 7828681 7925890 8153831 8247946 8267316 8430672 8598522 8813127
12609 8813127 9027790 9217083 9417191 9593155 9814519 9907691 10091708 10273094 10519203 10773983
12599 10773983 11176288 11465556 11712641 11958328 12282715 12620457 12837263 13134109 13505959
12590 13505959 13918608 14093450 14294910 14393565 14464534 14647866 14768557 14918282 14989002 15075517
12580 15075517 15063802 15009289 15141328 15323528 15528585 15751290 16055485 16388969 16744296 17208556
12570 17208556 17780360 18367360 18891905 19484388 19844864 20225763 20682003 21172084 21680963
$$ packed form
12640F304589j0640J15839J87960Q8633J65585m6976q084N3684M0775J47835P1621
12629G110821K2589o7800O9809K16636j3030l4349j3849J18208J46182J37513
12619G692730N3056J13278l0383R7209K27941R4115J9370J63356J67850K14605
12609H813127K14663J89293K00108J75964K21364R3172J84017J81386K46109K54780
12599A0773983M02305K89268K47085K45687L24387L37742K16806K96846L71850
12590A3505959M12649J74842K01460R8655P0969J83332J20691J49725P0720Q6515
12580A5075517j1715n4513J32039J82200K05057K22705L04195L33484L55327M64260
12570A7208556N71804N87000N24545N92483L60476L80899M56240M90081N08879
$$ plain form
12561 21680963 22033191 22222315 22445488 22533397 22551119 22350173 22216664 22084983 21835445 21488960
12551 21488960 21147606 20808405 20398998 20072428 19857904 19718508 19588506 19354189 19034200
12542 19034200 18876535 18747412 18703024 18609017 18530644 18488958 18431561 18350268 18378350 18410101 18438104
12531 18438104 18584061 18827081 19043264 19177596 19358085 19702617 20029293 20550792 21244218
12522 21244218 22052623 22925261 23786897 24758177 25880163 27108147 28416859 29612615 30729361
12513 30729361 32071090 33471977 34679203 35686249 36516580 37223791 37882352 38204306 38337068
12504 38337068 38171618 37945596 37633919 37038421 36388117 35494153 34644775 33977906 33296431
12495 33296431 32573210 31910259 31275602 30752016 30406662 30325857 30403040 30433948 30338220 30398824
$$ packed form
12561B1680963L52228J89124K23173Q7909J7722k00946j33509j31681k49538l46485
12551B1488960l41354l39201m09407l26570k14524j39396j30002k34317l19989
12542A9034200j57665j29123m4388r4007p8373m1686n7397q1293K8082L1751K8003
12531A8438104J45957K43020K16183J34332J80489L44532L26676N21499O93426
12522B1244218Q08405Q72638Q61636R71280J121986J227984J308712J195756J116746
12513C0729361J341729J400887J207226J007046Q30331P07211O58561L21954J32762
12504C8337068j65450k26022l11677n95498o50304q93964q49378o66869o81475
12495C3296431p23221o62951o34657n23586l45354q0805P7183L0908r5728O0604
$$ plain form
12485 30398824 30802011 31283257 31818323 32230446 32747227 33202145 33678269 33921312 34042398
12476 34042398 34154641 34066120 33710074 33279250 32743674 32063492 31383777 30675953 29778809
12467 29778809 29181330 28523395 27998792 27529920 27168616 26787044 26524807 26446429 26500415 26642628
12457 26642628 26758651 26924453 27248120 27593649 27889640 28363247 28634875 29031057 29294601
12448 29294601 29476999 29658453 29751691 29860751 29792329 29678715 29558889 29507926 29428110 29420807
12438 29420807 29548840 29843219 30257031 30747975 31372055 32015742 32879400 33969544 35230362
12429 35230362 36672510 38280620 39897211 41578713 43281702 45070336 46688139 48125239
12421 48125239 49357650 50329823 50868975 51060819 50884840 50176969 49235824 47946883 46446708
$$ packed form
12485C0398824M03187M81246N35066M12123N16781M54918M76124K43043J21086
12476C4042398J12243q8521l56046m30824n35576o80182o79715p07824q97144
12467B9778809n97479o57935n24603m68872l61304l81572k62237p8378N3986J42213
12457B6642628J16023J65802L23667L45529K95991M73607K71628L96182K63544
12448B9294601J82398J81454R3238J09060o8422j13614j19826n0963p9816p303
12438B9420807J28033K94379M13812M90944O24080O43687Q63658J090144J260818
12429C5230362J442148J608110J616591J681502J702989J788634J617803J437100
12421D8125239J232411R72173N39152J91844j75979p07871r41145j288941j500175
$$ plain form
12412 46446708 44779590 42858679 40871687 38996944 37201097 35448658 33808967 32289073
12404 32289073 30746546 29346368 28037719 26831745 25855797 25046828 24162897 23296538 22520982
12395 22520982 21876824 21319419 20797848 20334768 19990107 19709238 19346093 19082407 18736531
12386 18736531 18545913 18291374 18059225 17888825 17681882 17428538 17323463 17144567 16824048
12377 16824048 16544098 16232581 15847057 15555032 15328338 15222760 15147508 14935637 14590903
12368 14590903 14366916 14207955 13983919 13815773 13692802 13433244 13058835 12748022 12670564
12359 12670564 12596936 12389245 12189825 11827191 11626179 11665461 11623075 11508374 11423622 11292561
12349 11292561 11166283 11056246 11038309 10979829 10895652 10819388 10742329 10748117 10711381 10764675 10822242
$$ packed form
12412D6446708j667118j920911j986992j874743j795847j752439j639691j519894
12404C2289073j542527j400178j308649j205974r75948q08969q83931q66359p75556
12395B2520982o44158n57405n21571m63080l44661k80869l63145k63686l45876
12386A8736531j90618k54539k32149j70400k06943k53344j05075j78896l20519
12377A6824048k79950l11517l85524k92025k26694j05578p5252k11871l44734
12368A4590903k23987j58961k24036j68146j22971k59558l74409l10813p7458
12359A2670564p3628k07691j99420l62634k01012L9282m2386j14701q4752j31061
12349A1292561j26278j10037j7937n8480q4177p6264p7059N788l6736N3294N7567
$$ plain form
12338 10822242 10727718 10607295 10530642 10479680 10537975 10559798 10482346 10370275 10364604 10386300 10554895
12327 10554895 10603189 10634779 10484381 10421250 10470920 10509493 10491767 10517476 10462123 10411541 10452877
12316 10452877 10532195 10742512 10804462 10797206 10831443 10845721 10891919 10967671 11143267 11204208 11231919
12305 11231919 11369591 11453603 11487407 11573042 11767337 11986861 11996476 12036391 12126211 12293322
12295 12293322 12549215 12793557 13030965 13237471 13448881 13608000 13720655 13872248 14085660
12286 14085660 14294138 14516787 14895675 15191626 15526571 15898763 16322555 16784491 17301904
12277 17301904 17842027 18303382 18756907 19421592 20010996 20323537 20786496 21427964 21990805
12268 21990805 22432203 22920256 23393093 24008187 24647757 25224683 25890816 26523340 27169460
$$ packed form
12338A0822242r4524j20423p6653n0962N8295K1823p7452j12071n671K1696J68595
12327A0554895M8294L1590j50398o3131M9670L8573j7726K5709n5353n0582M1336
12316A0452877P9318K10317O1950p256L4237J4278M6198P5752J75596O0941K7711
12305A1231919J37672Q4012L3804Q5635J94295K19524R615L9915Q9820J67111
12295A2293322K55893K44342K37408K06506K11410J59119J12655J51593K13412
12286A4085660K08478K22649L78888K95951L34945L72192M23792M61936N17413
12277A7301904N40123M61355M53525O64685N89404L12541M62959O41468N62841
12268B1990805M41398M88053M72837O15094O39570N76926O66133O32524O46120
$$ plain form
12259 27169460 27648475 28144193 28819192 29584574 30262356 30883462 31539373 32169730 32738955
12250 32738955 33193585 33624958 34135721 34783379 35377062 35787933 36182921 36580672 36991117
12241 36991117 37442228 37904236 38446272 38983651 39626608 40311025 41035408 41737858 42425112
12232 42425112 43149712 43938979 44668211 45419696 46203770 46991324 47778367 48807405 49788974
12223 49788974 50701797 51613001 52656068 53775375 54867384 56004995 57207752 58330078
12215 58330078 59358622 60496075 61687537 62938675 64311086 65615986 66912168 68097852
12207 68097852 69336820 70730316 72194061 73837042 75710287 77494261 79322281 81325228
12199 81325228 83503927 85827649 88555628 91591499 94672374 98010671 101483334 105007145
$$ packed form
12259B7169460M79015M95718O74999P65382O77782O21106O55911O30357N69225
12250C2738955M54630M31373N10763O47658N93683M10871L94988L97751M10445
12241C6991117M51111M62008N42036N37379O42957O84417P24383P02450O87254
12232D2425112P24600P89267P29232P51485P84074P87554P87043J029038R81569
12223D9788974R12823R11204J043067J119307J092009J137611J202757J122326
12215E8330078J028544J137453J191462J251138J372411J304900J296182J185684
12207F8097852J238968J393496J463745J642981J873245J783974J828020K002947
12199H1325228K178699K323722K727979L035871L080875L338297L472663L523811
$$ plain form
12191 105007145 108727897 112432856 115952983 119200802 122087620 124496271 126250233 127290326
12183 127290326 127635694 127323662 126299884 124563525 122345082 119774292 116863071 113714398
12175 113714398 110506965 107199600 103959614 100810760 97831716 95090497 92567532 90314124
12167 90314124 88087722 86077972 84447672 82892305 81405999 80140547 79161608 78213495
12159 78213495 77437944 76765809 76103650 75755379 75383216 75090322 74936482 74844066 74824600 74845767
12149 74845767 74910549 74940756 74939890 75102656 75390697 75761575 76189687 76766843 77388385 78135322
12139 78135322 79133635 80270476 81492052 82864795 84341209 85761885 87167701 88570998
12131 88570998 89934624 91257347 92692252 94223489 95729860 97146214 98484451 99691871
$$ packed form
12191A05007145L720752L704959L520127L247819K886818K408651J753962J040093
12183A27290326L45368l12032j023778j736359k218443k570790k911221l148673
12175A13714398l207433l307365l239986l148854k979044k741219k522965k253408
12167I0314124k226402k009750j630300j555367j486306j265452r78939r48113
12159G8213495p75551o72135o62159l48271l72163k92894j53840r2416j9466K1167
12149G4845767O4782L0207q66J62766K88041L70878M28112N77156O21542P46937
12139G8135322R98313J136841J221576J372743J476414J420676J405816J403297
12131H8570998J363626J322723J434905J531237J506371J416354J338237J207420
$$ plain form
12123 99691871 100786089 101731344 102650999 103450314 104144185 104688612 105275760 105974449 106538925
12114 106538925 107076069 107603653 108198309 108731845 109165850 109604186 109975945 110228637 110230242
12105 110230242 110146895 109789316 108970736 107764982 106349318 104792447 102844365 100527002
12097 100527002 97874733 95053549 92205918 89426831 86658748 84176357 81709128 78813663
12089 78813663 75690332 72776539 70139436 67118589 64199745 61812976 59558440 57648015
12081 57648015 55986555 54352299 52863436 51633901 50521813 49544004 48764817 47912908
12073 47912908 47201786 46753314 46613110 46571742 46501207 46681197 46919632 47149652 47500419 48080698
12063 48080698 48561758 49048308 49617915 50251186 50941916 51604144 52158012 52619478 53101475
$$ packed form
12123I9691871J094218R45255R19655P99315O93871N44427N87148O98689N64476
12114A06538925N37144N27584N94656N33536M34005M38336L71759K52692J605
12105A10230242q3347l57579q18580j205754j415664j556871j948082k317363
12097A00527002k652269k821184k847631k779087k768083k482391k467229k895465
12089G8813663l123331k913793k637103l020847k918844k386769k254536j910425
12081E7648015j661460j634256j488863j229535j112088r77809p79187q51909
12073D7912908p11122m48472j40204m1368p0535J79990K38435K30020L50767N80279
12063D8080698M81060M86550N69607O33271O90730O62228N53868M61466M81997
$$ plain form
12054 53101475 53694354 54229816 54629350 55127824 55630013 56372440 57112683 58104553 58502343
12045 58502343 58313023 58094867 57832912 57216664 56223071 55472862 54768222 54152631 53645817
12036 53645817 53237207 52848929 52419668 51990759 51677677 51571062 51534409 51469002 51494144 51643436
12026 51643436 51870937 52101990 52575225 52966512 53349627 53768805 54199879 54686446 55161011
12017 55161011 55607817 56024441 56474313 56687482 56722354 56634575 56564629 56544619 56261145 55968222
12007 55968222 55733850 55607219 55589347 55573228 55768162 56021837 56086327 56289357 56640738 56966143
11997 56966143 57150756 57528879 58035123 58625817 59208308 59851984 60432102 60932452 61435609
11988 61435609 61824551 62118248 62388206 62717770 62954977 63088528 63160248 63337855 63559673
$$ packed form
12054E3101475N92879N35462L99534M98474N02189P42427P40243R91870L97790
12045E8502343j89320k18156k61955o16248r93593p50209p04640o15591n06814
12036E3645817m08610l88278m29261m28909l13082j06615l6653o5407K5142J49292
12026E1643436K27501K31053M73235L91287L83115M19178M31074M86567M74565
12017E5161011M46806M16624M49872K13169L4872q7779o9946k0010k83474k92923
12007E5968222k34372j26631j7872j6119J94934K53675O4490K03030L51381L25405
11997E6966143J84613L78123N06244N90694N82491O43676N80118N00350N03157
11988F1435609L88942K93697K69958L29564K37207J33551P1720J77607K21818
$$ plain form
11979 63559673 63839235 64276473 64824106 65559301 66422308 67316699 68286888 69140090 69793747
11970 69793747 70351807 70644339 70460897 70064060 69395781 68478467 67541483 66300911 64909062
11961 64909062 63581131 62404766 61359085 60505709 59847645 59310581 59015498 58941042 59169611
11952 59169611 59578162 60189176 61161929 62320243 63785579 65399783 67328216 69456011
11944 69456011 71587661 73897606 76094752 78246365 80251690 81998308 83427954 84428756
11936 84428756 85074690 85323319 85075432 84341492 83087994 81339276 79122719 76685603 74132800
11927 74132800 71430342 68769776 66279513 64023624 61973842 60182546 58728302 57444774
11919 57444774 56276032 55518879 55029674 54658402 54432058 54334481 54440647 54680927 54893955
$$ packed form
11979F3559673K79562M37238N47633P35195Q63007Q94391R70189Q53202O53657
11970F9793747N58060K92532j83442l96837o68279r17314r36984j240572j391849
11961F4909062j327931j176365j045681q53376o58064n37064k95083p4456K28569
11952E9169611M08551O11014R72753J158314J465336J614204J928433K127795
11944F9456011K131650K309945K197146K151613K005325J746618J429646J000802
11936H4428756O45934K48629k47887p33940j253498j748718k216557k437116k552803
11927G4132800k702458k660566k490263k255889k049782j791296j454244j283528
11919E7444774j168742p57153m89205l71272k26344r7577J06166K40280K13028
$$ plain form
11910 54893955 55115851 55259060 55291472 55080923 54797521 54213833 53351527 52195979 50842384
11901 50842384 49164263 47368642 45402031 43447560 41415164 39415358 37573669 35809109
11893 35809109 34286288 32972931 31643355 30443917 29444937 28573774 27752375 27155619 26649670
11884 26649670 26145410 25698281 25353810 25194052 25039472 24878719 24865061 24776304 24818957 25045645
11874 25045645 25219055 25440663 25620316 25943045 26389049 26910883 27423308 27970856 28550976
11865 28550976 29168193 29996131 30836520 31710543 32606782 33698312 34857873 35904968 37019215
11856 37019215 38178754 39108232 39987424 40760285 41271837 41553394 41686601 41414723 41005778
11847 41005778 40357484 39454559 38563651 37676345 36797603 35943541 35194351 34719978 34324365
$$ packed form
11910E4893955K21896J43209L2412k10549k83402n83688q62306j155548j353595
11901E0842384j678121j795621j966611j954471k032396j999806j841689j764560
11893C5809109j522821j313357j329576j199438r98980q71163q21399n96756n05949
11884B6649670n04260m47129l44471j59758j54580j60753j3658q8757M2653K26688
11874B5045645J73410K21608J79653L22729M46004N21834N12425N47548N80120
11865B8550976O17217Q27938Q40389Q74023Q96239J091530J159561J047095J114247
11856C7019215J159539R29478Q79192P72861N11552K81557J33207k71878m08945
11847D1005778o48294r02925q90908q87306q78742q54062p49190m74373l95613
$$ plain form
11838 34324365 34035953 33901179 34087903 34343071 34642628 35209002 36042546 37041785 38195929
11829 38195929 39574924 41253142 42877641 44601887 46331229 47857996 49344732 50738510
11821 50738510 51670779 52279590 52559949 52537968 52313564 51961232 51492561 50815043 50273665
11812 50273665 49788671 49235532 48797685 48808188 48948991 49197910 49522341 50017302 50801950
11803 50801950 51540806 52451230 53466148 54364822 55163217 55812559 56232657 56437792 56378350
11794 56378350 55974312 55294163 54451986 53523626 52454679 51370617 50379470 49447194 48549005
11785 48549005 47868183 47529916 47508793 47609338 47962270 48571075 49385398 50376190 51540205
11776 51540205 53079555 54873254 56659005 58545962 60427668 62287842 63905276 65301250
$$ packed form
11838C4324365k88412j34774J86724K55168K99557N66374Q33544R99239J154144
11829C8195929J378995J678218J624499J724246J729342J526767J486736J393778
11821E0738510R32269O08811K80359k1981k24404l52332m68671o77518n41378
11812E0273665m84994n53139m37847J0503J40803K48919L24431M94961P84648
11803E0801950P38856R10424J014918Q98674P98395O49342M20098K05135n9442
11794E6378350m04038o80149q42177r28360j068947j084062r91147r32276q98189
11785D8549005o80822l38267k1123J00545L52932O08805Q14323R90792J164015
11776E1540205J539350J793699J785751J886957J881706J860174J617434J395974
$$ plain form
11768 65301250 66497267 67164000 67466558 67378166 66872362 66042601 65058495 63871292 62557611
11759 62557611 61301757 60023058 58777686 57637242 56631400 55862342 55340740 54921558
11751 54921558 54544043 54370650 54253393 54217754 54317347 54344650 54323004 54209860 54018833 53641583
11741 53641583 53034294 52403340 51840227 51187362 50394600 49473326 48532614 47616537 46670231
11732 46670231 45702341 44965748 44380080 43908778 43461113 43099546 42988087 42879441 42821134
11723 42821134 42872350 43054854 43350526 43692935 44008867 44282432 44654336 44897936 45108384
11714 45108384 45246403 45338236 45176870 44870403 44542679 44172416 43888814 43513363 43077074
11705 43077074 42648878 42166377 41702649 41359773 41044630 40875918 40770904 40697099 40588044
$$ packed form
11768F5301250J196017O66733L02558q8392n05804q29761r84106j187203j313681
11759F2557611j255854j278699j245372j140444j005842p69058n21602m19182
11751E4921558l77515j73393j17257l5639R9593K7303k1646j13144j91027l77250
11741E3641583o07289o30954n63113o52865p92762r21274r40712r16077r46306
11732D6670231r67890p36593n85668m71302m47665l61567j11459j08646n8307
11723D2821134N1216J82504K95672L42409L15932K73565L71904K43600K10448
11714D5108384J38019R1833j61366l06467l27724l70263k83602l75451m36289
11705D3077074m28196m82501m63728l42876l15143j68712j05014p3805j09055
$$ plain form
11696 40588044 40628613 40755093 40976659 41193800 41329043 41393875 41384438 41434173 41467848 41318302
11686 41318302 40996964 40569197 40201959 39653206 39120448 38520951 37889966 37131164 36385090
11677 36385090 35722691 34945077 34151729 33527490 32837970 32177526 31621610 31070561 30598019
11668 30598019 30093562 29579195 29161982 28793877 28543516 28232923 27961797 27633779 27324217
11659 27324217 26908339 26405386 25909125 25423026 24879665 24250717 23507880 22883992 22177166
11650 22177166 21456513 20771969 20139637 19590745 19184217 18656436 18149469 17680644 17305945
11641 17305945 17028101 16957854 16943947 16855591 16761069 16624666 16496282 16625465 16683897 16661632
11631 16661632 16617397 16528628 16644288 16717223 16673579 16501858 16388907 16081365 15962258 15965355
$$ packed form
11696D0588044M0569J26480K21566K17141J35243O4832r437M9735L3675j49546
11686D1318302l21338m27767l67238n48753n32758n99497o30985p58802p46074
11677C6385090o62399p77614p93348o24239o89520o60444n55916n51049m72542
11668C0598019n04457n14367m17213l68105k50361l10593k71126l28018l09562
11659B7324217m15878n02953m96261m86099n43361o28948p42837o23888p06826
11650B2177166p20653o84544o32332n48892m06528n27781n06967m68825l74699
11641A7305945k77844p0247j3907q8356r4522j36403j28384J29183N8432k2265
11631A6661632m4235q8769J15660P2935m3644j71721j12951l07542j19107L097
$$ plain form
11621 15965355 15803215 15586516 15497055 15411404 15299455 14944304 14773686 14701948 14617585 14524283
11611 14524283 14390907 14336897 14027144 13669145 13429238 13116557 12844458 12621216 12306902
11602 12306902 11923536 11424433 11191217 10951624 10487751 10061968 9650292 9295139 9025501
11593 9025501 8647532 8284780 8056181 7864069 7672353 7504663 7238655 6971687 6702058
11584 6702058 6439092 6320614 6339748 6279450 6057321 5834979 5679492 5585216 5465635 5354428
11574 5354428 5360370 5461218 5499394 5369216 5282192 5124207 5060832 4989107 4934275 4839523 4880067
11563 4880067 4945170 4811255 4790862 4770791 4743482 4880385 4850740 4759175 4776755 4925844 4813321
11552 4813321 4769295 4657482 4611920 4675622 4743761 4779292 4740136 4658209 4693367 4818186 4896133
$$ packed form
11621A5965355j62140k16699q9461q5651j11949l55151j70618p1738q4363r3302
11611A4524283j33376n4010l09753l57999k39907l12681k72099k23242l14314
11602A2306902l83366m99103k33216k39593m63873m25783m11676l55153k69638
11593I025501l77969l62752k28599j92112j91716j67690k66008k66968k69629
11584F702058k62966j18478J9134o0298k22129k22342j55487r4276j19581j11207
11574E354428N942J00848L8176j30178q7024j57985o3375p1725n4832r4752M0544
11563D880067O5103j33915k0393k0071k7309J36903k9645r1565J7580J49089j12523
11552D813321m4026j11813m5562O3702O8139L5531l9156q1927L5158J24819P7947
$$ plain form
11541 4896133 4876289 4818621 4827105 4871450 4808326 4674459 4745601 4771698 4670485 4623914 4634290
11530 4634290 4620564 4655912 4754193 4755280 4735170 4733369 4741440 4722337 4702327 4702913 4731636 4789652
11518 4789652 4831869 4925097 4909952 4889834 4914744 4975152 5044217 4933011 4863095 4863338 4896352
11507 4896352 4899917 4775819 4756899 4799594 4775500 4700728 4688960 4589846 4409845 4463851 4543278
11496 4543278 4652727 4785904 4888598 4857105 4793750 4807448 4886890 4952721 5041429 5123116 5138051
11485 5138051 5159861 5128674 5125156 5009607 4851579 4727035 4630993 4576787 4476109 4396513 4372206
11474 4372206 4335501 4225649 4133870 4046178 3971169 3933334 3916823 3888599 3877610 3826457 3794569
11463 3794569 3688588 3556371 3367069 3389586 3406543 3391160 3309981 3301492 3282421 3276347 3204604
$$ packed form
11541D896133j9844n7668Q484M4345o3124j33867P1142K6097j01213m6571J0376
11530D634290j3726L5348R8281J087k0110j801Q071j9103k0010N86K8723N8016
11518D789652M2217R3228j5145k0118K4910O0408O9065j11206o9916K43L3014
11507D896352L565j24098j8920M2695k4094p4772j1768r9114j80001N4006P9427
11496D543278J09449J33177J02694l1493o3355J3698P9442O5831Q8708Q1687J4935
11485E138051K1810l1187l518j15549j58028j24544r6042n4206j00678p9596k4307
11474D372206l6705j09852r1779q7692p5009l7835j6511k8224j0989n1153l1888
11463C794569j05981j32217j89302K2517J6957j5383q1179q489j9071o074p1743
$$ plain form
11452 3204604 3219551 3217399 3166863 3136811 3132822 3069492 3078461 3158277 3122911 3060062 3011478 2910033
11440 2910033 2860484 2879847 2830600 2797580 2632814 2552005 2586824 2488548 2426203 2591439 2584439
11429 2584439 2479093 2451647 2357475 2349768 2512971 2626646 2670797 2593281 2516060 2583235 2551729
11418 2551729 2461310 2421993 2423538 2499296 2532111 2630936 2695723 2748570 2751709 2724515 2557492
11407 2557492 2350923 2371962 2485348 2580022 2628262 2672860 2678096 2670640 2716195 2611154 2581284
11396 2581284 2569589 2555107 2613519 2684128 2737744 2709896 2706834 2624096 2495830 2471580 2363193
11385 2363193 2396093 2479361 2545101 2601128 2620502 2434148 2309440 2296302 2369113 2369370 2388053
11374 2388053 2391175 2298377 2230546 2168109 2078189 2090383 2147424 2166833 2180323 2150580 2247269
$$ packed form
11452C204604J4947k152n0536l0052l989o3330Q969P9816l5366o2849m8584j01445
11440B910033m9549J9363m9247l3020j64766q0809L4819r8276o2345J65236p000
11429B584439j05346k7446r4172p707J63203J13675M4151p7516p7221O7175l1506
11418B551729r0419l9317J545P5758L2815R8825O4787N2847L139k7194j67023
11407B557492k06569K1039J13386R4674M8240M4598N236p456M5555j05041k9870
11396B581284j1695j4482N8412P0609N3616k7848l062q2738j28266k4250j08387
11385B363193L2900Q3268O5740N6027J9374j86354j24708j3138P2811K57J8683
11374B388053L122r2798o7831o2437q9920J2194N7041J9409J3490k9743R6689
$$ plain form
11363 2247269 2298406 2191037 2134864 2067930 2037135 2102250 2047028 2128327 2249200 2182780 2091510
11352 2091510 2159743 2247614 2254096 2298988 2278695 2270920 2286013 2240139 2094746 1991050 2070944
11341 2070944 2168535 2036202 1979862 2013124 2120297 2197295 2163473 2268938 2368347 2360322 2303488
11330 2303488 2346327 2427033 2345347 2300845 2339787 2347354 2329995 2493428 2506138 2445597 2441762
11319 2441762 2398864 2408890 2417540 2376859 2433351 2481946 2299733 2234557 2225264 2186207 2115659
11308 2115659 2090874 2083381 2067095 2066220 2087663 2050982 2045448 2098705 1977960 2004536 2104931 2092753
11296 2092753 2021107 1991535 2036601 2079386 2070175 2073175 2127272 2156165 2095762 2110531 2232394
11285 2232394 2232686 2195733 2166145 2162865 2189122 2252823 2329364 2317566 2262808 2201311 2135957 2132040
$$ packed form
11363B247269N1137j07369n6173o6934l0795O5115n5222Q1299J20873o6420r1270
11352B091510O8233Q7871O482M4892k0293p775J5093m5874j45393j03696P9894
11341B070944R7591j32333n6340L3262J07173P6998l3822J05465R9409q025n6834
11330B303488M2839Q0706q1686m4502L8942P567j7359J63433J2710o0541l835
11319B441762m2898J0026Q650m0681N6492M8595j82213o5176r293l9057p0548
11308B115659k4785p493j6286q75K1443l6681n534N3257j20745K6576J00395j2178
11296B092753p1646k9572M5066M2785r211L000N4097K8893o0403J4769J21863
11285B232394K92l6953k9588l280K6257O3701P6541j1798n4758o1497o5354l917
$$ plain form
11273 2132040 1985766 1983382 2033597 2037438 2036161 2019746 2063178 2132707 2143082 2112844 2119276 2236616
11261 2236616 2274077 2136281 2072816 2156634 1992318 1927052 2060667 2158702 2117914 2154137 2228887
11250 2228887 2203984 2256281 2302622 2362594 2395171 2332427 2352748 2292178 2296947 2345085 2259262
11239 2259262 2131134 2129123 2162043 2180866 2253506 2197321 2217689 2232172 2219609 2253662 2260991
11228 2260991 2220298 2223980 2208987 2222157 2170923 2185125 2213976 2282575 2338831 2419587 2423160 2354538
11216 2354538 2302840 2267161 2210730 2219960 2352622 2478390 2523745 2447066 2379125 2280814 2224109
11205 2224109 2274544 2322798 2340660 2283699 2281464 2349585 2326604 2280546 2402488 2485785 2567910
11194 2567910 2690712 2693179 2724148 2845123 2891524 2903545 2890981 3000334 3050986 3069779 3046518
$$ packed form
11273B132040j46274k384N0215L841j277j6415M3432O9529J0375l0238O432J17340
11261B236616L7461j37796o3465Q3818j64316o5266J33615R8035m0788L6223P4750
11250B228887k4903N2297M6341N9972L2577o2744K0321o0570M769M8138q5823
11239B259262j28128k011L2920J8823P2640n6185K0368J4483j2563L4053P329
11228B260991m0693L682j4993J3170n1234J4202K8851O8599N6256Q0756L573o8622
11216B354538n1698l5679n6431R230J32662J25768M5355p6679o7941r8311n6705
11205B224109N0435M8254J7862n6961k235O8121k2981m6058J21942Q3297Q2125
11194B567910J22802K467L0969J20975M6401J2021j2564J09353N0652J8793k3261
$$ plain form
11183 3046518 2975092 2958524 2948856 3030841 3132124 3103961 3067979 3168473 3278310 3324585 3314219
11172 3314219 3295090 3286532 3403599 3425622 3472054 3544481 3609224 3698397 3720819 3779956 3816448
11161 3816448 3885859 3917849 3954866 4030343 4105308 4238711 4405335 4491784 4350489 4325869 4306380
11150 4306380 4258675 4196821 4219554 4234150 4295662 4429376 4507682 4601427 4657848 4740528 4747585
11139 4747585 4826820 4975649 5001371 5078917 5163705 5154234 5179641 5307612 5367990 5376317 5504323
11128 5504323 5657815 5897689 6087354 6200187 6329206 6566085 6654276 6712678 6860111 7076049
11118 7076049 7199101 7399638 7700892 8034913 8314462 8570475 8848257 9040974 9400428
11109 9400428 9677293 10043637 10444342 10866539 11326266 11810739 12293743 12893046 13520037
$$ packed form
11183C046518p1426j6568r668Q1985J01283k8163l5982J00494J09837M6275j0366
11172C314219j9129q558J17067K2023M6432P2427O4743Q9173K2422N9137L6492
11161C816448O9411L1990L7017P5477P4965J33403J66624Q6449j41295k4620j9489
11150D306380m7705o1854K2733J4596O1512J33714P8306R3745N6421Q2680P057
11139D747585P9235J48829K5722P7546Q4788r471K5407J27971O0378Q327J28006
11128E504323J53492K39874J89665J12833J29019K36879Q8191N8402J47433K15938
11118G076049J23052K00537L01254L34021K79549K56013K77782J92717L59454
11109I400428K76865L66344M00705M22197M59727M84473M83004N99303O26991
$$ plain form
11100 13520037 14189574 14921153 15811947 16797318 17657096 18547734 19645483 20806273 22017297
11091 22017297 23547570 25333895 27337246 29508261 31824438 34558227 37672321 40981761
11083 40981761 44709842 49029356 54097720 59877747 66289498 73663324 82394520 92333322
11075 92333322 103861138 117171801 132299773 149230018 167799976 187580659 208090674
11068 208090674 228247264 246921152 262844194 274947430 282407438 285007697 283054107
11061 283054107 277302701 268783746 258590884 247676751 236991255 226975215 218049787
11054 218049787 210429863 204218589 199520646 196392211 194648706 194391385 195685113 198536449
11046 198536449 202842172 208630188 216023346 224891541 234995882 246050790 257632432
$$ packed form
11100A3520037O69537P31579Q90794R85371Q59778Q90638J097749J160790J211024
11091B2017297J530273J786325K003351K171015K316177K733789L114094L309440
11083D0981761L728081M319514N068364N780027O411751P373826Q731196R938802
11075I2333322J1527816J3310663J5127972J6930245J8569958J9780683K0510015
11068B08090674K0156590J8673888J5923042J2103236P460008K600259j953590
11061B83054107n751406q518955j0192862j0914133j0685496j0016040q925428
11054B18049787p619924o211274m697943l128435j743505k57321J293728K851336
11046A98536449M305723N788016P393158Q868195J0104341J1054908J1581642
$$ plain form
11039 257632432 269063323 279214706 286874616 291102210 291123533 286391427 276663330 262596134
11031 262596134 245188648 225791553 205628069 185676637 166785908 149525584 134016382
11024 134016382 120508287 108694019 98360531 89326690 81623135 74870459 68991676
11017 68991676 63974413 59435677 55357766 51588501 48236362 45113540 42131320 39568427
11009 39568427 37134823 34825070 32676966 30784626 29160587 27696486 26399257 25251334
11001 25251334 24115810 23054851 22120759 21222441 20210992 19268937 18527830 17796259 17104857
10992 17104857 16559327 16118147 15790117 15542446 15500163 15438132 15452656 15520034 15364121 15025108
10982 15025108 14493463 13921792 13284093 12696066 12129841 11395960 10681275 10185046 9754945
$$ packed form
11039B57632432J1430891J0151383P659910M227594K1323m732106r728097j4067196
11031B62596134j7407486j9397095k0163484j9951432j8890729j7260324j5509202
11024A34016382j3508095j1814268j0333488r033841p703555o752676n878783
11017F8991676n017263m538736m077911l769265l352139l122822k982220k562893
11009C9568427k433604k309753k148104j892340j624039j464101j297229j147923
11001B5251334j135524j060959r34092q98318j011449r42055p41107p31571o91402
10992A7104857n45530m41180l28030k47671m2283o2031J4524O7378j55913l39013
10982A5025108n31645n71671o37699n88027n66225p33881p14685m96229m30101
$$ plain form
10973 9754945 9288537 8837834 8495033 8178621 7731312 7411138 7184367 6978715 6740487
10964 6740487 6484197 6250144 6032504 5811548 5655834 5602991 5549469 5427762 5368689 5239141
10954 5239141 5183439 5158295 5163597 5116680 5175574 5162819 5192183 5146244 5217929 5243926 5237268 5266741
10942 5266741 5312130 5290511 5155510 5054145 4842010 4674782 4523984 4296086 4026700 3809137
10932 3809137 3737614 3684539 3544442 3468162 3452072 3415198 3360514 3409610 3436177 3454788 3415667
10921 3415667 3461413 3442002 3404308 3467836 3511673 3579534 3521322 3509674 3510690 3427412 3375141
10910 3375141 3353168 3114401 2869343 2919876 2893460 2828718 2764552 2613581 2526367 2447550 2510466
10899 2510466 2572235 2570346 2427333 2314674 2266723 2209424 2265129 2213340 2102160 2093490 2065318
$$ packed form
10973I754945m66408m50703l42801l16412m47309l20174k26771k05652k38228
10964F740487k56290k34053k17640k20956j55714n2843n3522j21707n9073j29548
10954E239141n5702k5144N302m6917N8894j2755K9364m5939P1685K5997o658K9473
10942E266741M5389k1619j35001j01365k12135j67228j50798k27898k69386k17563
10932C809137p1523n3075j40097p6280j6090l6874n4684M9096K6567J8611l9121
10921C415667M5746j9411l7694O3528M3837O7861n8212j1648J016q3278n2271
10910C375141k1973k38767k45058N0533k6416o4742o4166j50971q7214p8817O2916
10899B510466O1769j889j43013j12659m7951n7299N5705n1789j11180q670k8172
$$ plain form
10888 2065318 1922268 1828456 1891797 1882477 1810206 1777226 1740181 1775752 1730113 1565369 1564946
10877 1564946 1755815 1846737 1849566 1812708 1771582 1687671 1662133 1642585 1611293 1672442 1690766
10866 1690766 1706087 1792014 1702801 1558082 1560897 1540207 1577938 1582084 1511598 1485754 1499404
10855 1499404 1412606 1321318 1358264 1340766 1386219 1536847 1486149 1325359 1365010 1387487 1351447
10844 1351447 1184462 1195939 1156980 1234660 1336987 1235954 1139192 1059005 1048519 1189380
10834 1189380 1288343 1356945 1341643 1285578 1322029 1335701 1214372 1092934 1096094 1078339 1163677
10823 1163677 1092351 1112518 984398 1007785 1012501 896241 958794 1018774 971718 928260 1000798
10812 1000798 1126875 1125970 1071214 1080241 1022769 966100 892749 852398 893169 949711 966991 1010809
$$ packed form
10888B065318j43050r3812O3341r320p2271l2980l7045L5571m5639j64744m23
10877A564946J90869R0922K829l6858m1126q3911k5538j9548l1292O1149J8324
10866A690766J5321Q5927q9213j44719K815k0690L7731M146p0486k5844J3650
10855A499404q6798r1288L6946j7498M5453J50628n0698j60790L9651K2477l6040
10844A351447j66985J1477l8959P7680J02327j01033r6762q0187j0486J40861
10834A189380R8963O8602j5302n6065L6451J3672j21329j21438L160j7755Q5338
10823A163677p1326K0167j28120K3387M716j16260O2553N9980m7056m3458P2538
10812A000798J26077r05n4756R027n7472n6669p3351m0351M0771N6542J7280M3818
$$ plain form
10800 1010809 1059664 974606 925681 829414 840473 902488 852860 772711 809075 885530 873971
10789 873971 911959 1025113 996923 995081 1048014 1041363 1128842 1061377 1062706 1033137 956525 984993
10777 984993 979133 909334 1049117 995516 888113 919397 937323 918670 906640 883803 866345
10766 866345 838813 853654 947808 895703 878978 904011 857868 801202 968008 975665 963845
10755 963845 930247 945580 1005950 942220 832123 870756 896338 736033 688745 618003 629649
10744 629649 748589 799920 812348 770479 780132 863568 924549 882785 889984 897988 988954 1028061
10732 1028061 1062288 1086285 1140746 1188313 1132225 1260449 1326901 1335870 1262383 1184636 1148727
10721 1148727 1144212 1272304 1343339 1473605 1540855 1612874 1589170 1593583 1603897 1510841 1420727
$$ packed form
10800A010809M8855q5058m8925r6267J1059O2015m9628q0149L6364P6455j1559
10789H73971L7988J13154k8190j842N2933o651Q7479o7465J329k9569p6612K8468
10777I84993n860o9799J39783n3601j07403L1284J7926j8653j2030k2837j7458
10766H66345k7532J4841R4154n2105j6725K5033m6143n6666J66806P657j1820
10755I63845l3598J5333O0370o3730j10097L8633K5582j60305m7288p0742J1646
10744F29649J18940N1331J2428m1869R653Q3436O0981m1764P199Q004R0966L9107
10732A028061L4227K3997N4461M7567n6088J28224O6452Q969p3487p7747l5909
10721A148727m515J28092P1035J30266O7250P2019k3704M413J0314r3056r0114
$$ plain form
10710 1420727 1480069 1580471 1542302 1586282 1703135 1761739 1731531 1752878 1860459 1914717 1893387
10699 1893387 1864590 1771047 1774666 1759324 1712768 1696264 1695511 1757302 1749861 1752295 1651000 1559364
10687 1559364 1469797 1486666 1569995 1593355 1552928 1561476 1620999 1582721 1604471 1548663 1460343
10676 1460343 1442252 1430657 1612534 1676756 1648328 1635714 1709254 1789064 1824274 1669798 1650111
10665 1650111 1809860 1999851 2109174 2144737 2172512 2190299 2222684 2234435 2241440 2248880 2305290
10654 2305290 2433831 2419437 2439069 2534961 2618819 2665882 2614502 2670617 2760052 2835635 2769119
10643 2769119 2821436 2951850 3133778 3284945 3542685 3729892 3977103 4356219 4698474 5270023
10633 5270023 6006621 6475167 6863468 7289899 7793406 8386259 9010618 10011982 11317323
$$ packed form
10710A420727N9342J00402l8169M3980J16853N8604l0208K1347J07581N4258k1330
10699A893387k8797r3543L619j5342m6556j6504p53O1791p441K434j01295r1636
10687A559364q9567J6869Q3329K3360m0427Q548N9523l8278K1750n5808q8320
10676A460343j8091j1595J81877O4222k8428j2614P3540P9810L5210j54476j9687
10665A650111J59749J89991J09323L5563K7775J7787L2385J1751P005P440N6410
10654B305290J28541j4394J9632R5892Q3858M7063n1380N6115Q9435P5583o6516
10643B769119N2317J30414J81928J51167K57740J87207K47211L79116L42255N71549
10633E270023P36598M68546L88301M26431N03507N92853O24359J001364J305341
$$ plain form
10624 11317323 13032107 15375953 18542635 23003492 29001393 36663580 46167868 56463085
10616 56463085 65704473 72587969 77202171 79790314 80504789 80088182 80157492 82904232 89970413
10607 89970413 102214726 119248820 138202316 154361978 164333036 168436468 167903679 162829980
10599 162829980 154288945 146656834 144433443 150053806 164149479 184995892 207562051
10592 207562051 224507406 231775898 230352934 222031589 206560660 185755405 165710561
10585 165710561 152280023 147281163 150089164 158348052 167842312 173236849 172364047 165993562
10577 165993562 155152895 139905021 121941835 105326932 93114506 86170803 83673798
10570 83673798 83814494 84565694 83837746 80526261 75119731 67846921 58833497 48744118
$$ packed form
10624A1317323J714784K343846L166682M460857N997901P662187R504288J0295217
10616E6463085R241388O883496M614202K588143P14475m16607O9310K746740P066181
10607H9970413J2244313J7034094J8953496J6159662R971058M103432n32789n073699
10599A62829980q541035p632111k223391N620363J4095673K0846413K2566159
10592B07562051J6945355P268492j422964q321345j5470929k0805255k0044844
10585A65710561j3430538m998860K808001Q258888R494260N394537q72802o370485
10577A65993562j0840667j5247874j7963186j6614903j2212426o943703k497005
10570H3673798J40696P51200p27948l311485n406530p272810r013424j0089379
$$ plain form
10562 48744118 39380497 31673740 25774668 21403787 18085510 15650876 13807397 12286108
10554 12286108 11054633 10099841 9264252 8528908 7804995 7213861 6655105 6139722 5721951
10545 5721951 5414852 5103099 4841555 4667339 4375449 4168530 4096594 3895855 3723367 3677363
10535 3677363 3509880 3250835 3061502 2957302 2820994 2753646 2718580 2630142 2537898 2518285
10525 2518285 2425482 2376235 2364669 2250092 2198830 2048139 1953100 1934751 1892897 1883393 1775485
10514 1775485 1832590 1774863 1574963 1579152 1592342 1595557 1671067 1590254 1479183 1469695 1492405
10503 1492405 1463387 1362404 1287389 1209535 1253794 1278940 1224816 1090600 1238709 1253856 1228602
10492 1228602 1199134 1049411 960091 1010624 1088057 1103467 1031076 1014852 1092657 1063954 961312
$$ packed form
10562D8744118r363621p706757n899072m370881l318277k434634j843479j521289
10554A2286108j231475r54792q35589p35344p23913n91134n58756n15383m17771
10545E721951l07099l11753k61544j74216k91890k06919p1936k00739j72488m6004
10535C677363j67483k59045j89333j04200j36308o7348l5066q8438r2244j9613
10525B518285r2803m9247j1566j14577n1262j50691r5039j8349m1854r504j07908
10514A775485N7105n7727j99900M189J3190L215P5510q0813j11071r488K2710
10503A492405k9018j00983p5015p7854M4259K5146n4124j34216J48109J5147k5254
10492A228602k9468j49723q9320N0533P7433J5410p2391j6224P7805k8703j02642
$$ plain form
10481 961312 854915 728658 619250 591186 687616 793927 764525 791833 799550 794391 819154
10470 819154 720125 730066 709556 681978 644219 577284 717647 738324 640024 787254 927828
10459 927828 977150 924555 931819 970843 1025287 1086750 1100478 1125596 1133023 1165112 1094288 1089178
10447 1089178 1124096 1140303 1197955 1170889 1123649 1146864 1107929 1077966 940656 918995 953452
10436 953452 1042886 1081249 998539 839005 745973 825865 929433 933279 904404 893590 931564
10425 931564 1002011 913134 844166 857240 952874 927562 774451 662597 670830 818349 803993
10414 803993 826509 805240 755879 762486 806324 856535 857929 859764 909747 972692 1038630 1057316
10402 1057316 1018185 905782 886700 944861 903323 942754 1019761 1020584 991709 933339 922129
$$ packed form
10481I61312j06397j26257j09408k8064R6430J06311k9402K7308P717n159K4763
10470H19154r9029R941k0510k7578l7759o6935J40363K0677r8300J47230J40574
10459I27828M9322n2595P264L9024N4444O1463J3728K5118P427L2089p0824n110
10447A089178L4918J6207N7652k7066m7240K3215l8935k9963j37310k1661L4457
10436I53452Q9434L8363q2710j59534r3032P9892J03568L846k8875j0814L7974
10425I31564P0447q8877o8968J3074R5634k5312j53111j11854Q233J47519j4356
10414H03993K2516k1269m9361O607M3838N0211J394J835M9983O2945O5938J8686
10402A057316l9131j12403j9082N8161m1538L9431P7007Q23k8875n8370j1210
$$ plain form
10391 922129 1020164 1009436 948539 933360 949878 984442 1026086 1008938 1041708 1025975 934684
10380 934684 907606 868008 812571 824113 752609 684246 693870 839028 899646 829304 733530
10369 733530 791228 874305 875910 932464 929154 922163 1003945 1035451 1044551 954268 883489 927339
10357 927339 846807 799220 965572 1096948 1163855 1139616 1251657 1300463 1402698 1384075 1278411
10346 1278411 1274740 1212354 1296901 1247376 1228726 1271201 1280105 1427947 1429679 1431564 1394204 1308646
10334 1308646 1310523 1377832 1330543 1373752 1376389 1441389 1451486 1434084 1395285 1237698 1235104 1284072
10322 1284072 1276464 1303799 1209235 1189418 1309923 1419505 1512505 1439209 1299285 1373423 1505641
10311 1505641 1632421 1604643 1472580 1478624 1571578 1645912 1716475 1776019 1866788 1934710 2005990
$$ packed form
10391I22129R8035j0728o0897j5179J6518L4564M1644j7148L2770j5733r1291
10380I34684k7078l9598n5437J1542p1504o8363R624J45158O0618p0342r5774
10369G33530N7698Q3077J605N6554l310o991Q1782L1506R100r0283p0779M3850
10357I27339q0532m7587J66352J31376O6907k4239J12041M8806J02235j8623j05664
10346A278411l671o2386Q4547m9525j8650M2475Q904J47842J732J885l7360q5558
10334A308646J877O7309m7289M3209K637O5000J0097j7402l8799j57587k594M8968
10322A284072p608K7335r4564j9817J20505J09582R3000p3296j39924P4138J32218
10311A505641J26780k7778j32063O044R2954P4334P0563N9544R0769O7922P1280
$$ plain form
10300 2005990 2099981 2271304 2383733 2377029 2351564 2437380 2693718 2750617 2768035 2852874 3046369
10289 3046369 3259907 3431083 3565435 3654334 3693131 3825141 3940479 4100007 4086906 4103547
10279 4103547 4233196 4389311 4639184 4777774 4860391 4977822 5073846 5134049 5240639 5390792
10269 5390792 5508103 5512968 5654279 5779912 5828177 5969140 6019747 5905489 6022742 6040139
10259 6040139 5938221 6053627 6269551 6349998 6317612 6328311 6287481 6254260 6242762 6315219 6370434
10248 6370434 6353423 6272139 6321630 6378653 6346465 6397806 6544248 6585386 6708406 6830660 6936036
10237 6936036 7073477 7294482 7425145 7462746 7454263 7515270 7514025 7586337 7716305 7847348 7951502
10226 7951502 8021673 8136642 8204355 8230367 8166826 8113966 8149962 8326605 8459977 8478953 8510211
$$ packed form
10300B005990R3991J71323J12429o704k5465Q5816K56338N6899J7418Q4839J93495
10289C046369K13538J71176J34352Q8899L8797J32010J15338J59528j3101J6641
10279D103547J29649J56115K49873J38590Q2617J17431R6024O0203J06590J50153
10269E390792J17311M865J41311J25633M8265J40963N0607j14258J17253J7397
10259F040139j01918J15406K15924Q0447l2386J0699m0830l3221j1498P2457N5215
10248F370434j7011q1284M9491N7023l2188N1341J46442M1138J23020J22254J05376
10237F936036J37441K21005J30663L7601q483O1007j245P2312J29968J31043J04154
10226G951502P0171J14969O7713K6012o3541n2860L5996J76643J33372J8976L1258
$$ plain form
10215 8510211 8663157 8709823 8829041 8929446 9029798 9063502 9031634 9044513 9158333 9292776
10205 9292776 9380441 9446192 9545865 9731189 10023006 10201746 10318183 10491464 10687540 10854819
10195 10854819 11000298 11269818 11510302 11751627 12070865 12459996 12902341 13467502 14052809
10186 14052809 14682915 15324480 15890762 16499166 17078925 17598632 18049735 18380037 18607107
10177 18607107 18874197 19088886 19112097 19007569 18995636 18973981 19069808 19275204 19480987 19649845
10167 19649845 19897311 20002005 20161517 20371082 20690459 20939795 21199202 21465932 21816068
10158 21816068 22089154 22497109 22924940 23227233 23445266 23593938 23728705 23827877 23904358 23966506
10148 23966506 24146780 24274828 24583364 24866914 25067015 25351037 25771135 26239264 26559541
$$ packed form
10215H510211J52946M6666J19218J00405J00352L3704l1868J2879J13820J34443
10205I292776Q7665O5751R9673J85324K91817J78740J16437J73281J96076J67279
10195A0854819J45479K69520K40484K41325L19238L89131M42345N65161N85307
10186A4052809O30106O41565N66282O08404N79759N19707M51103L30302K27070
10177A8607107K67090K14689K3211j04528j1933k1655R5827K05396K05783J68858
10167A9649845K47466J04694J59512K09565L19377K49336K59407K66730L50136
10158B1816068K73086M07955M27831L02293K18033J48672J34767R9172P6481O2148
10148B3966506J80274J28048L08536K83550K00101K84022M20098M68129L20277
$$ plain form
10139 26559541 26814265 27137586 27622824 28097151 28521669 29011481 29736887 30515805 31188542
10130 31188542 31823741 32547706 33224618 33787995 34310506 34789311 35240097 35723129 36072030
10121 36072030 36317767 36461504 36739542 37120923 37431918 37901712 38483979 39140634 39947138
10112 39947138 40746221 41576269 42532858 43532253 44395172 45278825 46178137 46932981 47695906
10103 47695906 48407817 48883206 49276462 49542513 49626789 49694498 49888535 50127457 50234500 50286162
10093 50286162 50278493 50183950 50081834 50091757 50219801 50425856 50697536 51105522 51613321 52139839
10083 52139839 52766793 53443369 54176665 54959570 55637484 56266901 56693081 56960061 57186601
10074 57186601 57313100 57287409 57180335 56989956 56800086 56453431 56019261 55687321 55383570
$$ packed form
10139B6559541K54724L23321M85238M74327M24518M89812P25406P78918O72737
10130C1188542O35199P23965O76912N63377N22511M78805M50786M83032L48901
10121C6072030K45737J43737K78038L81381L10995M69794N82267O56655Q06504
10112C9947138P99083Q30048R56589R99395Q62919Q83653Q99312P54844P62925
10103D7695906P11911M75389L93256K66051Q4276O7709J94037K38922J07043N1662
10093E0286162p669r4543j02116R923J28044K06055K71680M07986N07799N26518
10083E2139839O26954O76576P33296P82905O77914O29417M26180K66980K26540
10074E7186601J26499k5691j07074j90379j89870l46655m34170l31940l03751
$$ plain form
10065 55383570 55302059 55357749 55294941 55292512 55445087 55652807 55874711 56375993 56860795 57210425
10055 57210425 57578459 57989708 58375723 58501574 58423324 58441838 58461428 58454420 58295011 57932490
10045 57932490 57561641 57144466 56662078 56116664 55589855 54951364 54196848 53377819 52599233
10036 52599233 51890543 51300739 50563905 49729436 49079224 48629686 48188638 47841146 47427679
10027 47427679 46929241 46568081 46446926 46357098 46108332 45735584 45382350 44949464 44523509
10018 44523509 44166760 43690998 43218877 42682381 42044383 41366383 40537275 39687598 38852410
10009 38852410 37873145 36947392 35935935 34904720 33801346 32731370 31687547 30677528
10001 30677528 29598345 28688456 27901518 27040330 26231711 25400507 24691124 23969801 23369082
$$ packed form
10065E5383570q1511N5690o2808k429J52575K07720K21904N01282M84802L49630
10055E7210425L68034M11249L86015J25851p8250J8514J9590p008j59409l62521
10045E7932490l70849m17175m82388n45414n26809o38491p54516q19029p78586
10036E2599233p08690n89804p36834q34469o50212m49538m41048l47492m13467
10027D7427679m98438l61160j21155q9828k48766l72748l53234m32886m25955
10018D4523509l56749m75762m72121n36496o37998o78000q29108q49677q35188
10009C8852410r79265r25753j011457j031215j103374j069976j043823j010019
10001C0677528j079183r09889p86938q61188q08619q31204p09383p21323o00719
$$ plain form
9992 23369082 22818227 22242903 21543780 21077590 20693634 20292422 20037583 19881599 19681870
9983 19681870 19574606 19258188 19169822 19122649 19058401 18864275 18597179 18267648 17791924 17333041
9973 17333041 16962527 16549446 15914579 15374815 14913991 14537155 14184525 13833779 13500168
9964 13500168 13233272 12967247 12737668 12492816 12239351 12112074 12044247 11886823 11709591 11651474
9954 11651474 11701863 11644881 11428445 11186941 11041828 10902262 10746737 10490815 10245829 10154512
9944 10154512 10049877 9825592 9644779 9467750 9332007 9357153 9263381 9232848 9134750 9060670
9934 9060670 9033604 8975246 9009632 9030860 8961028 9039507 9161303 9139819 9086266 9001541 8909525
9923 8909525 8870172 8872329 8766894 8562037 8444544 8398945 8264131 8051505 7888282 7733650
$$ packed form
9992B3369082n50855n75324o99123m66190l83956m01212k54839j55984j99729
9983A9681870j07264l16418q8366m7173o4248j94126k67096l29531m75724m58883
9973A7333041l70514m13081o34867n39764m60824l76836l52630l50746l33611
9964A3500168k66896k66025k29579k44852k53465j27277o7827j57424j77232n8117
9954A1651474N0389n6982k16436k41504j45113j39566j55525k55922k44986r1317
9944A0154512j04635k24285j80813j77029j35743K5146r3772l0533r8098p4080
9934I060670k7066n8358L4386K1228o9832P8479J21796k1484n3553q4725r2016
9923H909525l9353K157j05435k04857j17493m5599j34814k12626j63223j54632
$$ plain form
9913 7733650 7517730 7327823 7183863 7040144 6888607 6736648 6582327 6544809 6444717 6320891
9903 6320891 6213119 6225646 6170063 6069763 5834910 5608316 5454914 5333227 5245579 5196691
9893 5196691 5122907 5029052 4931296 4919592 4921270 4796383 4560613 4350968 4307865 4200116 4100038
9882 4100038 3826098 3507037 3464988 3450210 3408446 3321658 3100181 2929034 2811657 2753500
9872 2753500 2660739 2635185 2686342 2568348 2449927 2399950 2228024 2182344 2135494 2092575 1995925
9861 1995925 1775384 1700976 1741828 1746818 1646052 1531791 1526052 1535660 1527526 1386377 1263439
9850 1263439 1337878 1321209 1224510 1137091 1121462 1162799 1153851 1123271 1012301 851912 834354
9839 834354 944420 973677 953683 951607 940942 873379 935417 931633 779785 802889 823095 651105
$$ packed form
9913G733650k15920j89907j43960j43719j51537j51959j54321l7518j00092j23826
9903F320891j07772J2527n5583j00300k34853k26594j53402j21687q7648m8888
9893E196691p3784r3855r7756j1704J678j24887k35770k09645m3103j07749j00078
9882D100038k73940l19061m2049j4778m1764q6788k21477j71147j17377n8157
9872B753500r2761k5554N1157j17994j18421m9977j71926m5680m6850m2919r6650
9861A995925k20541p4408M0852M990j00766j14261n739R608q134j41149j22938
9850A263439P4439j6669r6699q7419j5629M1337q948l0580j10970j60389j7558
9839H34354J10066K9257j9994k076j0665o7563O2038l784j51848K3104K0206j71990
$$ plain form
9827 651105 584490 411847 454186 543155 564719 566296 615244 667378 651745 697653 695480 661630
9815 661630 737821 783971 725400 621469 567970 572574 602476 569947 566683 582620 572106 498051
9803 498051 572829 584977 481440 487060 478825 512837 526837 505966 479428 564695 509011 341425
9791 341425 272468 380542 422945 408778 385004 414531 428798 465315 412721 470420 559341
9780 559341 582802 549225 559428 636879 626186 624147 640685 573722 408654 377564 456468 544610
9768 544610 541651 487072 505018 520394 420677 416945 499788 484280 463391 453857 386221 325915
9756 325915 404671 561562 645699 541123 506212 438267 430721 429147 331579 403694 467112 433005
9744 433005 397753 409231 422762 375649 466942 550509 541090 548568 513042 573170 600194 453993
$$ packed form
9827F51105o6615j72643M2339Q8969K1564J577M8948N2134j5633M5908k173l3850
9815F61630P6191M6150n8571j03931n3499M604K9902l2529l264J5937j0514p4055
9803D98051P4778J2148j03537N620q235L4012J4000k0871k6538Q5267n5684j67586
9791C41425o8957J08074M2403j4167k3774K9527J4267L6517n2594N7699Q8921
9780E59341K3461l3577J0203P7451j0693k039J6538o6963j65068l1090P8904Q8142
9768E44610k959n4579J7946J5376r9717l732Q2843j5508k0889r534o7636o0306
9756C25915P8756J56891Q4137j04576l4911o7945p546j574r7568P2115O3418l4107
9744D33005l5252J1478J3531m7113R1293Q3567r419P478l5526O0128K7024j46201
$$ plain form
9732 453993 413559 412692 466227 490700 600488 646537 551648 476055 545048 636890 582313 507099
9720 507099 542926 456351 406346 489626 469984 399080 460847 542212 517239 505539 591222 615256
9708 615256 599139 626499 628905 592848 588552 611067 604222 549935 530007 521836 559991 533319
9696 533319 509836 549680 671571 683555 621784 646486 581973 543674 569933 514917 495805
9685 495805 467643 469054 544696 556298 547761 561429 536932 487867 538464 682859 579678 463574
9673 463574 363195 383818 444279 418955 513161 539104 581518 656516 617400 623046 579158 552315
9661 552315 603286 580101 482516 463406 507319 567437 744839 879872 1129941 1423450 1503958
9650 1503958 1414467 1277828 1221610 1218828 1106976 881803 683824 571611 445197 437757 441189
$$ packed form
9732D53993m0434q67N3535K4473J09788M6049r4889p5593O8993R1842n4577p5214
9720E07099L5827q6575n0005Q3280j9642p0904O1767Q1365k4973j1700Q5683K4034
9708F15256j6117K7360K406l6057m296K2515o845n4287j9928q171L8155k6672
9696E33319k3483L9844J21891J1984o1771K4702o4513l8299K6259n5016j9112
9685D95805k8162J411P5642J1602q537J3668k4497m9065N0597J44395j03181j16104
9673D63574j00379K0623O0461k5324R4206K5943M2414P4998l9116N646m3888k6843
9661E52315N0971k3185r7585j9110M3913O0118J77402J35033K50069K93509Q0508
9650A503958q9491j36639n6218k782j11852k25173j97979j12213j26414p440L432
$$ plain form
9639 441189 535651 561221 531499 513241 479889 459681 448919 435844 385766 389514 484340 464544
9627 464544 516319 610482 643238 675354 645009 592387 586962 520677 510102 566539 520750 478898
9615 478898 393596 316981 312265 328827 365247 272215 285217 349814 353402 365503 380488 390203
9603 390203 428168 439624 347630 313961 299588 287748 260796 261695 235436 272617 296164 299042
9591 299042 190778 125483 102516 75636 27482 500 -37906 -41475 135486 170650 82279
9580 82279 146250 152135 172425 185396 90923 -15047 -75513 -23339 146574 148334 218429 192543
9568 192543 104388 58105 31409 83744 127222 89869 107524 140593 227810 269595 262843 297733
9556 297733 246477 289247 228401 188752 235042 271395 240003 147458 -431 -69904 -4393
$$ packed form
9639D41189R4462K5570k9722j8258l3352k0208j0762j3075n0078L748R4826j9796
9627D64544N1775R4163L2756L2116l0345n2622n425o6285j0575N6437m5789m1852
9615D78898q5302p6615m716J6562L6420r3032J3002O4597L588J2101J4985R715
9603C90203L7965J1456r1994l3669j4373j1840k6952Q99k6259L7181K3547K878
9591B99042j08264o5295k2967k6880m8154k6982l8406l569J76961L5164q8371
9580H2279O3971N885K0290J2971r4473j05970o0466N2174J69913J760P0095k5886
9568A92543q8155m6283k6696N2335M3478l7353J7655L3069Q7217M1785o752L4890
9556B97733n1256M2770o0846l9649M6290L6353l1392r2545j47889o9473O5511
$$ plain form
9545 -4393 64890 92280 78031 148181 232272 200301 154453 83145 22440 8020 13933 75175
9533 75175 136515 184066 191300 156066 204999 215205 210227 171427 129945 146456 220714 278282
9521 278282 292218 351671 340121 307108 310608 259418 99558 20024 32206 -543 -8049 104778
9509 104778 233793 226763 179949 108347 171088 197771 172472 211341 238250 295111 200303 185771
9497 185771 163201 66266 74102 158671 134675 129690 117686 94389 131724 150793 171461 173777
9485 173777 145263 28527 -5337 -58146 -73079 -69795 86212 145945 87875 56696 74130
9474 74130 135491 245391 287213 296853 309715 223072 113649 103483 73474 166815 247730 203077
9462 203077 136736 81415 73378 48345 93595 52917 75031 217877 292841 217785 205146 163828
$$ packed form
9545d393O9283K7390j4249P0150Q4091l1971m5848p1308o0705j4420N913O1242
9533G5175O1340M7551P234l5234M8933J0206m978l8800m1482J6511P4258N7568
9521B78282J3936N9453j1550l3013L500n1190j59860p9534J2182l2749p506J12827
9509A04778J29015p030m6814p1602O2741K6683k5299L8869K6909N6861r4808j4532
9497A85771k2570r6935P836Q4569k3996m985j2004k3297L7335J9069K0668K316
9485A73777k8514j16736l3864n2809j4933L284J56007N9733n8070l1179J7434
9474G4130O1361J09900M1822R640J2862q6643j09423j0166l0009R3341Q0915m4653
9462B03077o6341n5321q037k5033M5250m0678K2114J42846P4964p5056j2639m1318
$$ plain form
9450 163828 133946 87142 49239 107320 209535 241446 361689 384495 358916 287031 339201
9439 339201 393186 375680 250895 222225 324511 294900 282912 291728 308587 213857 235257
9428 235257 438925 446057 400856 426588 450550 450733 517587 527987 503887 429017 362911 333324
9416 333324 397943 415509 419702 485689 400294 208872 157685 91147 34748 11625 13330 -80754
9404 -80754 -27045 89257 177937 261420 287450 210484 101795 -20536 -59379 55000 -14536
9393 -14536 -988 40210 23953 -73468 -170824 -224703 -279169 -111211 17001 61469 68085 131679
9381 131679 56581 14716 -15790 4309 114247 207934 196635 201925 153998 184396 105131 49962
9369 49962 43783 142792 87987 57678 151501 191108 252705 284516 271676 293076 316454 226593
$$ packed form
9450A63828k9882m6804l7903N8081J02215L1911J20243K2806k5579p1885N2170
9439C39201N3985j7506j24785k8670J02286k9611j1988Q816J6859r4730K1400
9428B35257K03668P132m5201K5732K3962J83O6854J0400k4100p4870o6106k9587
9416C33324O4619J7566M193O5987q5395j91422n1187o6538n6399k3123J705r4084
9404h0754N3709J16302Q8680Q3483K6030p6966j08689j22331l8843J14379o9536
9393a4536J3548M1198j6257r7421r7356n3879n4466J67958J28212M4468O616O3594
9381A31679p5098m1865l0506K0099J09938R3687j1299N290m7927L0398p9265n5169
9369D9962o179R9009n4805l0309R3823L9607O1597L1811j2840K1400K3378q9861
$$ plain form
9357 226593 250901 285476 396660 394681 422616 339224 387839 442950 403084 355038 236650
9346 236650 154830 299259 313628 311800 297528 358572 394268 379020 293399 287424 363791 257971
9334 257971 254950 303449 298318 294604 359924 379986 334337 317079 327395 239184 124594 115039
9322 115039 269407 307360 154104 189569 257753 138427 -989 -1646 11728 89901 85707
9311 85707 40293 37948 35242 -56604 -3320 99787 145418 193941 160401 71644 6733 -115542
9299 -115542 -121251 -39215 -95523 -79038 -15527 35819 -13398 -28451 -59742 -68558 41212 81036
9287 81036 41950 -37830 77228 123346 33040 85903 142202 285342 282810 239059 241167 321383
9275 321383 232427 189217 163400 178276 217969 164174 -20051 -21858 63329 54841 -32397 -103005
$$ packed form
9357B26593K4308L4575J11184j979K7935q3392M8615N5111l9866m8046j18388
9346B36650q1820J44429J4369j828j4272O1044L5696j5248q5621n975P6367j05820
9334B57971l021M8499n131l714O5320K0062m5649j7258J0316q8211j14590r555
9322A15039J54368L7953j53256L5465O8184j19326j39416o57J3374P8173m194
9311H5707m5414k345k706r1846N3284J03107M5631M8523l3540q8757o4911j22275
9299a15542n709Q2036n6308J6485O3511N1346m9217j5053l1291q816J09770L9824
9287H1036l9086p9780J15058M6118r0306N2863N6299J43140k532m3751K108Q0216
9275C21383q8956m3210k5817J4876L9693n3795j84225j807Q5187q488q7238p0608
$$ plain form
9263 -103005 -185310 -204913 -86502 59667 155540 150987 243713 238991 156236 142767 156560 211419
9251 211419 188222 89299 8724 -24664 2170 102455 186209 201046 106669 107272 184421 164967
9239 164967 130844 75431 -12592 -131679 -71892 -55047 -110477 -67032 -9225 -55377 -18963
9228 -18963 1960 -40139 -133623 -138400 -88730 -85838 -100370 48221 43009 21581 75372 -34896
9216 -34896 -90092 -123922 -54436 72155 71503 31657 15519 97554 82378 6103 32353 44342
9204 44342 97481 31000 -21221 124995 157605 64914 30431 -28511 -83821 -174025 -216597 -232523
9192 -232523 -179054 -92929 -105122 -149519 -115387 -46352 -24479 14866 63390 152029 70022 16958
9180 16958 -66742 -33014 -3545 66502 98105 65800 -33908 -68004 -142187 -84366 -7614 -96119
$$ packed form
9263a03005q2305j9603J18411J46169R5873m553R2726m722q2755j3469J3793N4859
9251B11419k3197r8923q0575l3388K6834J00285Q3754J4837r4377O03P7149j9454
9239A64967l4123n5413q8023j19087N9787J6845n5430M3445N7807m6152L6414
9228a8963K0923m2099r3484m777M9670K892j4532J48591n212k1428N3791j10268
9216c4896n5196l3830O9486J26591o52l9846j6138Q2035j5176p6275K6250J1989
9204D4342N3139o6481n2221J46216L2610r2691l4483n8942n5310r0204m2572j5926
9192b32523N3469Q6125j2193m4397L4132O9035K1873L9345M8524Q8639q2007n3064
9180A6958q3700L3728K9469P0047L1603l2305r9708l4096p4183N7821P6752q8505
$$ plain form
9168 -96119 -94575 -1464 70635 36771 -25552 37091 17896 -69089 -15106 -16710 -142182 -142165 31497
9155 31497 49606 -20501 -158794 -81953 57039 42697 -37316 29251 27589 105712 126614 53031
9143 53031 -38917 -129543 -60064 104068 129196 20342 29028 35229 -35563 -106434 -106958 -118899
9131 -118899 -156817 -171126 -41305 49868 -45937 -99887 -15477 -44045 -45337 -45278 102384 67069
9119 67069 109213 188821 223454 37913 -7260 68142 186576 151381 -53350 -91951 -61522
9108 -61522 -159642 -24642 92028 103118 55493 -37209 -62206 -155047 -77268 -89893 -78977
9097 -78977 -22560 -13442 -3988 -70166 -92955 -60966 -75961 -56027 -70914 -143016 -70908 -2912
9085 -2912 18317 -12513 -135411 -200159 -102053 -2859 15358 -262 40193 -129382 -246671
$$ packed form
9168i6119J544R3111P2099l3864o2323O2643j9195q6985N3983j604j25472J7J73662
9155C1497J8109p0107j38293P6841J38992j4342q0013O6567j662P8123K0902p3583
9143E3031r1948r0626O9479J64132K5128j08854Q686O201p0792p0871n24j1941
9131a18899l7918j4309J29821R1173r5805n3950Q4410k8568j292N9J47662l5315
9119F7069M2144P9608L4633j85541m5173P5402J18434l5195k04731l8601L0429
9108f1522r8120J35000J16670J1090m7625r2702k4997r2841P7779j2625J0916
9097g8977N6417R118R454o6178k2789L1989j4995J9934j4887p2102P2108O7996
9085b912K1229l0830j22898o4748R8106R9194J8217j5620M0455j69575j17289
$$ plain form
9074 -246671 -203907 -124040 -182760 -253843 -306101 -286188 -98503 -40672 -42810 -190490 -274638
9063 -274638 -259599 -76352 -33031 9449 87803 24614 -123086 -159967 -87686 -99116 -142973
9052 -142973 -60024 -63446 -100117 -50573 9693 15639 97716 20428 -136836 -112419 -166026 -45876
9040 -45876 -78749 -75186 61445 54661 104521 35972 -82563 -98018 -18112 -24162 -96373 -263253
9028 -263253 -299277 -247833 -198655 -204032 -183987 -75984 -1143 -18564 18805 -31830 -131610 -99398
9016 -99398 -50735 -85309 -231459 -335460 -263937 -94325 -38914 -59103 -119784 -195788 -299491
9005 -299491 -271810 -127839 -66561 5678 -30099 -94020 -17948 -2370 -23541 -1910 -662 -24846
8993 -24846 4182 -89739 -213567 -176851 -82970 -9476 17558 -56242 -201408 -314579 -347527
$$ packed form
9074b46671M2764P9867n8720p1083n2258J9913J87685N7831k138j47680q4148
9063b74638J5039J83247M3321M2480P8354o3189j47700l6881P2281j1430m3857
9052a42973Q2949l422l6671M9544O0266N946Q2077p7288j57264K4417n3607J20150
9040d5876l2873L563J36631o784M9860o8549j18535j5455P9906o050p2211j66880
9028b63253l6024N1444M9178n377K0045J08003P4841j7421L7369n0635r9780L2212
9016i9398M8663l4574j46150j04001P1523J69612N5411k0189o0681p6004j03703
9005b99491K7681J43971O1278P2239l5777o3921P6072J5578k1171K1631J248k4184
8993b4846K9028r3921j23828L6716R3881P3494K7034p3800j45166j13171l2948
$$ plain form
8982 -347527 -276980 -101758 -8535 -57481 -123334 -145503 -157382 -42663 -84405 -222056 -184156
8971 -184156 -99592 -139217 -124188 -82623 -19721 35003 -32757 -87960 -154487 -153452 -150866 -117632
8959 -117632 -59488 -132490 -213765 -179211 -230031 -199991 -192813 -143022 -173038 -266599 -217846 -69885
8947 -69885 -9280 -84535 -92573 -38738 192 44711 -118006 -94277 -44440 -109550 -63580 -4126
8935 -4126 -101764 -138646 -1539 -47357 -154855 -90760 5758 -32946 4515 100392 108037 -10499
8923 -10499 -96057 -19283 27306 40590 -30775 -61282 -19676 -25872 -109251 -150875 -20835 46811
8911 46811 30081 -34868 -182375 -138933 -75743 -89495 -143059 -202165 -211312 -179663 -140870 -149849
8899 -149849 -205115 -156416 -18934 -21796 -47901 -11094 -44587 -93563 6268 -18013 -92726 -115539
$$ packed form
8982c47527P0547J75222R3223m8946o5853k2169j1879J14719m1742j37651L7900
8971a84156Q4564l9625J5029M1565O2902N4724o7760n5203o6527J035K586L3234
8959a17632N8144p3002q1275L4554n0820L0040P178M9791l0016r3561M8753J47961
8947f9885O0605p5255q038N3835L8930M4519j62717K3729M9837o5110M5970N9454
8935d126r7638l6882J37107m5818j07498O4095R6518l8704L7461R5877P645j18536
8923a0499q5558P6774M6589J3284p1365l0507M1606o196q3379m1624J30040O7646
8911D6811j6730o4949j47507M3442O3190j3752n3564n9106r147L1649L8793q979
8899a49849n5266M8699J37482k862k6105L6807l3493m8976R9831k4281p4713k2813
$$ plain form
8887 -115539 -179467 -179345 -176708 -74866 -60290 -16584 -43228 -109604 -122975 -123188 -111454 -68957
8875 -68957 -103029 -41863 34659 -18760 -107510 -126009 -7133 41662 43749 90929 33430 58806
8863 58806 97422 54949 7478 -55404 742 -17269 -97207 -38452 -21358 38289 127244 62612
8851 62612 -1101 -50754 -94034 -88230 -144767 -265748 -241957 -250444 -211822 -123477 -7640 53564
8839 53564 44159 -21032 -115611 -185793 -202934 -117416 -55730 -53346 62751 48554 -32337 -55223
8827 -55223 -37561 -122691 -114775 -110604 -149848 -213121 -205206 -92426 -110771 -88132 -112988 -66319
8815 -66319 -19873 25807 -66259 -187814 -187080 -54757 68498 106799 185550 91696 -360 26047
8803 26047 12263 -23544 -81669 -193230 -166691 -70705 -20689 -130105 -197189 -252019 -224851
$$ packed form
8887a15539o3928J22K637J01842J4576M3706k6644o6376j3371k13J1734M2497
8875f8957l4072O1166P6522n3419q8750j8499J18876M8795K087M7180n7499K5376
8863E8806L8616m2473m7471o2882N6146j8011p9938N8755J7094N9647Q8955o4632
8851F2612o3713m9653m3280N804n6537j20981K3791q487L8622Q8345J15837O1204
8839E3564r405o5191r4579p0182j7141Q5518O1686K384J16097j4197q0891k2886
8827e5223J7662q5130P916M171l9244o3273P915J12780j8345K2639k4856M6669
8815f6319M6446M5680r2066j21555P34J32323J23255L8301P8751r3854r2056K6407
8803B6047j3784l5807n8125j11561K6539R5986N0016j09416o7084n4830K7168
$$ plain form
8792 -224851 -125358 -108672 -57244 -54412 -109126 -40254 -52043 -124464 -181496 -277016 -216836 -106169
8780 -106169 31267 46798 -168720 -181177 -134244 -142951 -175682 -148589 -28822 43414 20808
8769 20808 -128732 -127928 -45626 -18693 97587 200886 243201 113912 160125 156779 15626
8758 15626 12744 44612 80669 -24794 -68057 -3917 66535 140405 185646 246157 339050 490832
8746 490832 581566 710669 914756 1078506 1365407 1701211 1914773 2015323 1977121 1765193
8736 1765193 1369039 999815 815323 647367 370757 261274 259046 249061 231034 126951
8726 126951 152660 233107 292283 168822 -34375 7833 106578 134258 127584 107156 99403 90321
8714 90321 115264 165372 292684 298337 235311 141153 62175 119119 167235 177908 201329 194346
$$ packed form
8792b24851R9493J6686N1428K832n4714O8872j1789p2421n7032r5520O0180J10667
8780a06169J37436J5531k15518j2457M6933q707l2731K7093J19767P2236k2606
8769B0808j49540Q04Q2302K6933J16280J03299M2315j29289M6213l346j41153
8758A5626k882L1868L6057j05463m3263O4140P0452P3870M5241O0511R2893J51782
8746D90832R0734J29103K04087J63750K86901L35804K13562J00550l8202k11928
8736A765193l96154l69224j84492j67956k76610j09483k228r985j8027j04083
8726A26951K5709Q0447N9176j23461k03197M2208R8745K7680o674k0428p753r082
8714I0321K4943N0108J27312N653o3026r4158p8978N6944M8116J0673K3421o983
$$ plain form
8702 194346 320772 723735 1052750 1527144 2250632 3146418 3891536 4083986 4052734 4067710
8692 4067710 3669531 2860945 2051238 1513967 1080404 712666 589682 589404 538333 555615
8682 555615 385730 265324 357184 484634 360907 185833 122934 163347 113462 61092 67263
8671 67263 130363 201159 219761 213197 3403 17690 114157 73277 46050 72818 92930 152043
8659 152043 189479 280228 398034 666081 796049 1026044 1216347 1549053 1774797 1862436
8649 1862436 1907250 1782874 1509309 1273824 936342 672082 525622 364160 312379 221410
8639 221410 178923 115958 50412 53746 52827 9183 30521 9239 -117749 -115031 52807 97900
8627 97900 -127575 -198527 -173162 -112697 -87573 -87966 -23208 4627 8073 90092 167743 193642
$$ packed form
8702A94346J26426M02963L29015M74394P23488Q95786P45118J92450l1252J4976
8692D067710l98179q08586q09707n37271m33563l67738j22984k78n1071J7282
8682E55615j69885j20406R1860J27450j23727j75074o2899M0413m9885n2370O171
8671F7263O3100P0796J8602o564k09794J4287R6467m0880k7227K6768K0112N9113
8659A52043L7436R0749J17806K68047J29968K29995J90303L32706K25744Q7639
8649A862436M4814j24376k73565k35485l37482k64260j46460j61462n1781r0969
8639B21410m2487o2965o5546L334r19m3644K1338k1282j26988K718J67838M5093
8627I7900k25475p0952K5365O0465K5124l93O4758K7835L446Q2019P7651K5899
$$ plain form
8615 193642 127781 108662 158776 197592 153520 149347 140174 227634 306592 270571 130025 15594
8603 15594 -38762 -100872 -42250 131099 86847 54565 106609 127753 205666 137157 212213 218421
8591 218421 171860 229746 226754 173351 59320 84092 147199 154285 100935 -1695 -83362 -95545
8579 -95545 -21111 25581 75782 143883 155589 205407 309929 335145 321874 386195 654946
8568 654946 770912 843813 1026337 1231779 1241140 1136194 1120808 961792 823415 759550 646301
8557 646301 505816 402692 262222 247897 334231 346341 335615 268094 219949 243152 289696
8546 289696 250744 344435 345042 307035 290675 271175 270252 364028 294083 212399 146957 231356
8534 231356 263910 135102 89085 99888 36887 44195 -2998 17638 197669 398693 582636
$$ packed form
8615A93642o5861j9119N0114L8816m4072m173r173Q7460P8958l6021j40546j14431
8603A5594n4356o2110N8622J73349m4252l2282N2044K1144P7913o8509P5056O208
8591B18421m6561N7886k992n3403j14031K4772O3107P086n3350j02630q1667j2183
8579i5545P4434M6692N0201O8101J1706M9818J04522K5216j3271O4321K68751
8568F54946J15966P2901J82524K05442R361j04946j5386j59016j38377o3865j13249
8557F46301j40485j03124j40470j4325Q6334J2110j0726o7521m8145K3203M6544
8546B89696l8952R3691O07l8007j6360j9500r23R3776o9945q1684o5442Q4399
8534B31356L2554j28808m6017J0803o3001P308m7193K0636J80031K01024J83943
$$ plain form
8523 582636 966955 1355930 1852420 2125561 2137599 1979241 1903631 1619160 1137706 803267
8513 803267 500470 477566 447514 381294 341265 275100 287246 301173 256896 160681 109487
8502 109487 226897 181312 109031 145334 134999 176161 229274 219739 227444 155709 87526 100956
8490 100956 130374 137573 210312 193695 146782 246289 301142 391673 350681 365584 482383 530990
8478 530990 628896 863616 1012548 1084054 1091706 1136349 1131764 1086110 1038361 838313 679403
8467 679403 631353 701783 700732 747521 951175 1232365 1511908 1987054 2542487 3417170 4719066
8456 4719066 6224095 7292810 7574462 7442337 7070203 6284528 4851717 3510605 2523981
8447 2523981 1831661 1345322 1181614 1054583 804498 674646 706673 620779 547613 469178
$$ packed form
8523E82636L84319L88975M96490K73141J2038j58358p5610k84471m81454l34439
8513H03267l02797k2904l0052o6220m0029o6165J2146J3927m4277r6215n1194
8502A09487J17410m5585p2281L6303j0335M1162N3113r535P705p1735o8183J3430
8490A00956K9418P199P2739j6617m6913R9507N4853R0531m0992J4903J16799M8607
8478E30990R7906K34720J48932P1506P652M4643m585m5654m7749k00048j58910
8467F79403m8050P0430j051M6789K03654K81190K79543M75146N55433Q74683J301896
8456D719066J505029J068715K81652j32125l72134p85675j432811j341112r86624
8447B523981o92320m86339j63708j27031k50085j29852L2027q5894p3166p8435
$$ plain form
8437 469178 329731 338441 361496 279891 217826 190904 288993 379993 316650 158713 4219
8426 4219 -60437 14860 149794 168322 124236 58048 -6676 -53907 -107666 -102974 34779 60018
8414 60018 10863 -8894 -84741 -81777 46882 17185 7289 53867 -45078 -111801 -24898 -15987
8402 -15987 3720 -13 96284 21347 -18871 49445 73685 84533 159321 122805 95877 128841
8390 128841 82044 110972 96244 -19846 -59280 -93850 -54942 77829 67677 52325 8121
8379 8121 -32909 -7784 20546 88793 145919 113009 110856 148104 151250 158210 158552 155145 11608
8366 11608 -44140 -16958 -24880 -83084 -162496 -148938 -153973 -129382 -66970 -48200 -61191 -103327
8354 -103327 -62155 -63135 -134262 -107313 -89676 -86340 -43999 51509 58856 20602 129755 243051
$$ packed form
8437D69178j39447Q710K3055q1605o2065k6922R8089R1000o3343j57937j54494
8426D219o4656P5297J34934J8528m4086o6188o4724m7231n3759M692J37753K5239
8414F0018m9155j9757p5847K964J28659k9697r896M6578r8945o6723Q6903Q911
8402a5987J9707l733R6297p4937m0218O8316K4240J0848P4788l6516k6928L2964
8390A28841m6797K8928j4728j16090l9434l4570L8908J32771j0152j5352m4204
8379H121m1030K5125K8330O8247N7126l2910k153L7248L146O960L42l407j43537
8366A1608n5748K7182p922n8204p9412J3558n035K4591O2412J8770j2991m2136
8354a03327M1172r80p1127K6949J7637L336M2341R5508P347l8254J09153J13296
$$ plain form
8342 243051 247265 437846 813747 1202944 1696302 2404202 2681418 2481548 2408593 2246856
8332 2246856 1585481 873535 480464 290222 112882 32862 11993 47374 -3271 -25220
8322 -25220 150668 203838 104418 35974 112498 329319 461115 414444 375714 268303 247348
8311 247348 214101 233756 183177 203656 205834 194079 172306 128744 73651 117983 89814 127137
8299 127137 320147 404053 787002 1293392 1962225 3043001 4441888 5115326 4920490 4800834
8289 4800834 4714645 3883409 2558967 1675873 1164515 737016 517167 392441 350160 273763
8279 273763 246190 148182 105539 104967 53124 112132 109285 141905 171742 208056 354577 342216
8267 342216 233260 214049 165090 95384 3277 -11109 96536 35140 28782 -17454 27564
$$ packed form
8342B43051M214J90581L75901L89197M93358P07900K77216j99870p2955j61737
8332B246856o61375p11946l93071j90242j77340q0020k0869L5381n0645k1949
8322b5220J75888N3170r9420o8444P6524K16821J31796m6671l8730j07411k0955
8311B47348l3247J9655n0579K0479K178j1755k1773m3562n5093M4332k8169L7323
8299A27137J93010Q3906L82949N06390O68833J080776J398887O73438j94836j19656
8289D800834q6189q31236j324442q83094n11358m27499k19849j24726m2281p6397
8279B73763k7573r8008m2643n72n1843N9008k847L2620K9837L6314J46521j2361
8267C42216j08956j9211m8959o9706r2107j4386J07645o1396o358m6236M5018
$$ plain form
8256 27564 152011 244104 168973 218262 392691 702992 1282243 2005234 2560255 2520885 2234927
8245 2234927 2092089 1822243 1160835 737974 455569 318360 278636 147352 70532 100944
8235 100944 74222 42085 -78027 -95535 -80300 -64939 -1643 100103 94344 88228 203774
8224 203774 244838 201564 136679 -21215 61446 73298 135617 261123 193376 103533 65662
8213 65662 148076 234327 157744 3205 -60063 -82038 -127388 -196755 -158711 -129750 -102684 87409
8201 87409 66550 -46213 -21484 43391 101768 93880 139342 196522 128292 136564 37555 -60239
8189 -60239 -89600 -176527 -189347 -117191 -130002 -101721 -44914 39267 115320 96519 62607 138960
8177 138960 170942 86349 109873 138371 159790 147639 62816 -9028 11214 7983 53417 186715
$$ packed form
8256B7564J24447R2093p5131M9289J74429L10301N79251P22991N55021l9370k85958
8245B234927j42838k69846o61408m22861k82405j37209l9724j31284p6820L0412
8235A00944k6722l2137j20112j7508J5235J5361O3296J01746n759o116J15546
8224B03774M1064m3274o4885j57894Q2661J1852O2319J25506o7747q9843l7871
8213F5662Q2414Q6251p6583j54539o3268k1975m5350o9367L8044K8961K7066J90093
8201H7409k0859j12763K4729O4875N8377p888M5462N7180o8230Q272r9009r7794
8189f0239k9361q6927j2820P2156j2811K8281N6807Q4181P6053j8801l3912P6353
8177A38960L1982q4593K3524K8498K1419j2151q4823p1844K0242l231M5434J33298
$$ plain form
8165 186715 66477 -46579 -6601 5336 51666 -21827 -53982 57832 98333 142527 147278
8154 147278 159200 59336 -108487 -163051 -113639 -18214 64144 90393 27274 -20159 66151
8143 66151 58296 41759 -39635 -33671 1248 -48374 -53565 -22095 -128306 -86822 6115 -75997
8131 -75997 -147130 -60771 -270 50767 67363 -15767 -48853 5771 -6340 6631 -28294 -66333
8119 -66333 -24035 -69702 -131127 -158434 -41666 82540 -8112 -15963 54368 6281 -5190 -3759
8107 -3759 -11435 -90905 -129132 -114482 -30191 5806 14317 86671 193419 251403 209035 132245
8095 132245 124007 54346 28148 40542 44081 90738 107980 50139 64393 19078 30022 -13092
8083 -13092 4789 -19409 12574 14105 115714 192793 283557 247086 173316 68612 56226 -28435
$$ packed form
8165A86715j20238j13056L9978J1937M6330p3493l2155J11814M0501M4194M751
8154A47278J1922r9864j67823n4564M9412R5425Q2358K6249o3119m7433Q6310
8143F6151p855j6537q1394N964L4919m9622n191L1470j06211M1484R2937q2112
8131g5997p1133Q6359O0501N1037J6596q3130l3086N4624j2111J2971l4925l8039
8119f6333M2298m5667o1425k7307J16768J24206r0652p851P0331m8087j1471J431
8107c759p676p9470l8227J4650Q4291L5997Q511P2354J06748N7984m2368p6790
8095A32245q238o9661k6198J2394L539M6657J7242n7841J4254m5315J0944m3114
8083a3092J7881k4198L1983J531J01609P7079R0764l6471p3770j04704j2386q4661
$$ plain form
8071 -28435 -77291 -74740 -70332 -43528 -129056 -168299 -84396 -13070 67253 46953 79463 145820
8059 145820 191660 84359 32734 -34231 5642 112019 114622 87601 -99776 -111861 -163483
8048 -163483 -146885 -52730 -13151 -46072 -69835 -78531 31250 143318 164323 174757 184961
8037 184961 138430 24317 156957 216483 195525 71802 130723 289896 359186 291676 214570
8026 214570 159211 90392 146416 127347 74491 8165 -78802 -144708 -27270 120137 23281
8015 23281 -145400 -203703 -84002 -6744 -28523 -61907 -226499 -185307 -137680 -121071 -83857
8004 -83857 -88790 -126305 -175269 -209213 -173392 -111004 -39148 -122079 -213291 -148584 -84917 -157182
7992 -157182 -214774 -246994 -241558 -235577 -199400 -120646 -64645 -37087 76172 43793 20608 4385
$$ packed form
8071b8435m8856K551M408K6804q5528l9243Q3903P1326Q0323k0300L2510O6357
8059A45820M5840j07301n1625o6965L9873J06377K603k7021j87377j2085n1622
8048a63483J6598R4155L9579l2921k3763q696J09781J12068K1005J0434J0204
8037A84961m6531j14113J32640N9526k0958j23723N8921J59173O9290o7510p7106
8026B14570n5359o8819N6024j9069n2856o6326q6967o5906J17438J47407r6856
8015B3281j68681n8303J19701P7258k1779l3384j64592M1192M7627J6609L7214
8004h3857m933l7515m8964l3944L5821O2388P1856q2931r1212O4707O3667p2265
7992a57182n7592l2220N436N981L6177P8754N6001K7558J13259l2379k3185j6223
$$ plain form
7980 4385 35987 15472 -29782 59032 121141 74755 27726 -42979 -85874 -62441 28457 29956
7968 29956 -2079 148684 252220 203145 121121 10637 57873 25502 42408 -23667 -31164
7957 -31164 -40520 -62616 -4485 -38986 -78544 -33573 80368 153583 153689 12693 -13149 -61333
7945 -61333 31421 4653 -99494 3375 62136 14814 -69643 -109793 -29073 3020 -3018 -5045
7933 -5045 3291 -86533 -101302 -11576 39891 4301 -45766 76655 88073 104700 116372 151350
7921 151350 189789 216840 92042 19965 -96084 -59859 -91374 -134001 -103322 -148598 -151125
7910 -151125 -237486 -343059 -293689 -223024 -156853 -248915 -243536 -192854 -140734 -65672 -51935 3861
7898 3861 10483 -33122 -57673 -166506 -172195 -120631 -177467 -184889 -212506 -237630 -37605 85482
$$ packed form
7980D385L1602k0515m5254Q8814O2109m6386m7029p0705m2895K3433R0898J499
7968B9956l2035J50763J03536m9075q2024j10484M7236l2371J6906o6075p497
7957c1164r356k2096N8131l4501l9558M4971J13941P3215J06j40996k5842m8184
7945f1333R2754k6768j04147J02869N8761m7322q4457m0150Q0720L2093o038k027
7933e045Q336q9824j4769Q9726N1467l5590n0067J22421J1418J6627J1672L4978
7921A51350L8439K7051j24798p2077j16049L6225l1515m2627L0679m5276k527
7910a51125q6361j05573M9370P0665O6171r2062N379N0682N2120P5062J3737N5796
7898C861O622m3605k4551j08833n689N1564n6836p422k7617k5124K00025J23087
$$ plain form
7886 85482 48865 52026 21427 -23403 33528 49995 126061 99547 -52199 -131778 -96268 44943
7874 44943 86376 84048 -28690 -63159 -135591 -129057 58203 162218 31564 3857 87885
7863 87885 119424 82725 139537 90731 77320 31644 6685 -73478 -16555 -88454 -86176 70098
7851 70098 91407 63686 61993 50588 18888 25919 15354 31461 -39231 -137829 -134498 -95848
7839 -95848 -68789 -46426 -40890 36733 37659 5313 78811 85788 50326 204767 160701 35878
7827 35878 -107809 -131410 -99318 -58991 -138295 -131630 -49435 -16616 13404 -19931 -90988 -108474
7815 -108474 -76047 -19213 -1934 -63236 -57485 -83182 32744 103827 -62115 -77278 -59094
7804 -59094 -158271 -130106 -53616 -137041 -158536 -102577 -223948 -322305 -287158 -213038 -266287 -204304
$$ packed form
7886H5482l6617L161l0599m4830N6931J6467P6066k6514j51746p9579L5510J41211
7874D4943M1433k328j12738l4469p2432O534J87260J04015j30654k7707Q4028
7863H7885L1539l6699N6812m8806j3411m5676k4959q0163N6923p1899K278J56274
7851G0098K1309k7721j693j1405l1700P031j0565J6107p0692r8598L331L8650
7839i5848K7059K2363N536P7623R26l2346P3498O977l5462J54441m4066j24823
7827C5878j43687k3601L2092M0327p9304O665Q2195L2819L0020l3335p1057j7486
7815a08474L2427N6834J7279o1302N751k5697J15926P1083j65942j5163J8184
7804e9094r9177K8165P6490q3425k1495N5959j21371r8357L5147P4120n3249O1983
$$ plain form
7792 -204304 -173577 -146309 -231580 -151765 -26954 60799 102117 30750 -17083 27270 -53946
7781 -53946 -53262 -86615 -137763 -97079 -123505 -137202 -20660 53686 71384 8675 -83010 -139239
7769 -139239 -228637 -183296 -61563 -101175 -96013 -74171 -16552 44365 52628 69115 95249 101020
7757 101020 33569 -41562 -78687 -81437 -130642 -177634 -156263 -37853 -74611 -138154 -260757
7746 -260757 -185537 -45733 31114 34431 -45869 -96352 -75812 -74257 -75502 -176840 -228082 -283294
7734 -283294 -207989 -123059 -41832 -145915 -201106 -107942 -76193 -180746 -254573 -293619 -242843
7723 -242843 -76948 -90840 -198250 -218632 -217467 -214399 -140161 -1123 73947 -46392 -136402
7712 -136402 -161851 -188480 -275141 -318913 -368739 -303161 -183599 -106528 -14922 34737 1837
$$ packed form
7792b04304L0727K7268q5271P9815J24811Q7753M1318p1367m7833M4353q1216
7781e3946O84l3353n1148M0684k6426j3697J16542P4346J7698o2709r1685n6229
7769a39239q9398M5341J21733l9612N162K1842N7619O0917Q263J6487K6134N771
7757A01020o7451p5131l7125k750m9205m6992K1371J18410l6758o3543j22603
7746b60757P5220J39804P6847L317q0300n0483K0540J555j245j01338n1242n5212
7734b83294P5305Q4930Q1227j04083n5191R3164L1749j04553p3827l9046N0776
7723b42843J65895j3892j07410k0382J165L068P4238J39038P5070j20339r0010
7712a36402k5449k6629q6661m3772m9826O5578J19562P7071R1606M9659l2900
$$ plain form
7701 1837 33899 -70597 -55250 18808 -31871 -41501 -1131 129679 120872 -59 -81031 7966
7689 7966 -14882 -85084 -177794 -72544 -80521 -186244 -114426 -25629 15360 -11439 9586 98346
7677 98346 13970 -69812 -121696 -160994 -192976 -142047 -167782 -194614 -259074 -237569 -237906 -231883
7665 -231883 -159148 -134496 -48182 -17225 25801 -32266 -80836 -64646 -69583 -34759 -80268 -87815
7653 -87815 -37038 -87617 -157294 -45132 58789 143941 135826 50915 18284 -130546 -217598
7642 -217598 -52724 -17981 -22381 8342 -10191 -81736 -134724 -211333 -157702 -144726 -169174 -177635
7630 -177635 -196833 -180927 -140044 -118167 -184125 -20832 -71751 -147702 -48899 29476 -84786
7619 -84786 -168652 -171593 -111648 -134925 -96610 -93104 -107813 -135002 -69543 -111729 -182102 -117043
$$ packed form
7701A837L2062j04496J5347P4058n0679r630M0370J30810q807j20931q0972Q8997
7689G966k2848p0202r2710J05250p977j05723P1818Q8797M0989k6799K1025Q8760
7677I8346q4376q3782n1884l9298l1982N0929k5735k6832o4460K1505l37O023
7665b31883P2735K4652Q6314L0957M3026n8067m8570J6190m937L4824m5509p547
7653h7815N0777n0579o9677J12162J03921Q5152q115q4911l2631j48830q7052
7642b17598J64874L4743m400L0723j8533p1545n2988p6609N3631J2976k4448q461
7630a77635j9198J5906M0883K1877o5958J63293n0919p5951R8803P8375j14262
7619h4786q3866k941N9945k3277L8315L506j4709k7189O5459m2186p0373O5059
$$ plain form
7607 -117043 -110635 -111809 -206211 -214719 -72986 -159568 -189310 -266814 -262396 -211478 -50170 -14672
7595 -14672 8936 18244 97725 41040 -11687 142293 180531 122808 16183 32002 41131 1773
7583 1773 -19433 -36119 -77893 -114978 -156490 -267859 -228642 -150496 -108811 -154681 -25767 60148
7571 60148 55951 27822 -30805 -69501 -8815 -23343 -82891 -66796 -38702 44503 -66074 -176094
7559 -176094 -212028 -107643 -13622 -983 -18842 76558 5959 -123977 -205638 -163088 -94161
7548 -94161 -167434 -186702 -45574 -26164 -98491 -62214 -132899 -185151 -213278 -195152 -191747 -116998
7536 -116998 -138338 -150568 -136191 -107186 -111598 -98203 -136161 -206435 -127368 -18524 -12944 58797
7524 58797 -2022 9210 40441 57536 -80348 -160613 -11515 11322 -6423 9186 9067 -41874
$$ packed form
7607a17043O408j174r4402q508J41733q6582k9742p7504M418N0918J61308L5498
7595a4672K3608R308P9481n6685n2727J53980L8238n7723j06625J5819R129l9358
7583A773k1206j6686m1774l7085m1512j11369L9217P8146M1685m5870J28914Q5915
7571F0148m197k8129n8627l8696O0686j4528n9548J6095K8094Q3205j10577j10020
7559a76094l5934J04385R4021J2639j7859R5400p0599j29936q1661M2550O8927
7548i4161p3273j9268J41128J9410p2327L6277p0685n2252k8127J8126L405P4749
7536a16998k1340j2230J4377K9005m412J3395l7958p0274P9067J08844N580P1741
7524E8797o0819J1232L1231J7095j37884q0265J49098K2837j7745J5609j19n0941
$$ plain form
7512 -41874 -43599 -192202 -253009 -147947 -137327 -90032 -43033 -40203 49015 77677 -1908 -48386
7500 -48386 -21108 -12197 -64231 -139707 -125999 -126106 -257080 -146347 -124173 865 162827 195026
7488 195026 70909 -6731 -83511 -124213 -82983 -36781 -142894 -176165 -199008 -114117 -58068
7477 -58068 -3675 -100932 -25886 -38567 -144515 -169054 -67765 -15956 3291 -12895 -70810
7466 -70810 -152204 -205368 -114467 -99835 -102429 -14226 101272 75847 5008 19903 63249 53284
7454 53284 -22366 -106976 -23248 170676 165353 95024 87197 122509 90706 -3267 17189 9007
7442 9007 -99278 -90953 -70228 -101265 -105828 35840 139718 154881 30996 -125863 -94643
7431 -94643 -46210 43175 8738 -24717 -50151 -75506 -64687 -65651 -176604 -212090 -101737 -107427
$$ packed form
7512d1874j725j48603o0807J05062J0620M7295M6999K830Q9218K8662p9585m6478
7500d8386K7278Q911n2034p5476J3708j07j30974J10733K2174J25038J61962L2199
7488A95026j24117p7640p6780m0702M1230M6202j06113l3271k2843Q4891N6049
7477e8068N4393r7257P5046j2681j05948k4539J01289N1809J9247j6186n7915
7466g0810q1394n3164R0901J4632k594Q8203J15498k5425p0839J4895M3346r965
7454E3284p5650q4610Q3728J93924n323p0329p827L5312l1803r3973K0456q182
7442I007j08285Q325K0725l1037m563J41668J03878J5163j23885j56859L1220
7431i4643M8433Q9385l4437l3455k5434k5355J0819r64j10953l5486J10353n690
$$ plain form
7419 -107427 -128745 -269434 -230462 -147789 -165744 -153306 -99039 -76006 -62689 -133055 -104262
7408 -104262 -24254 -105252 -103022 -38290 -40909 -45837 -71419 -185964 -93026 -29648 -15203 -56724
7396 -56724 -34800 -15420 4934 -101565 -191133 -185610 -126837 -61512 -134789 -118664 -44076 -42090
7384 -42090 -74899 -94485 -201360 -293220 -358116 -359539 -250236 -167291 -103146 -74427 -25853 -77251
7372 -77251 -31031 100753 39131 -46443 -24141 -65396 -168968 -227942 -188135 -113660 27347
7361 27347 20768 -7729 -74764 -138124 -199119 -41521 30020 5043 -59170 -6998 43339 52612
7349 52612 117580 155385 76997 -69595 -236741 -195966 -189398 -144396 44213 39641 49216 88137
7337 88137 23248 -20742 -181258 -166645 -108612 -78940 -81386 -55482 12311 -77281 -65698 -54352
$$ packed form
7419a07427k1318j40689L8972Q2673j7955J2438N4267K3033J3317p0366K8793
7408a04262Q0008q0998K230O4732k619m928k5582j14545R2938O3378J4445m1521
7396e6724K1924J9380K0354j06499q9568N523N8773O5325p3277J6125P4588J986
7384d2090l2809j9586j06875r1860o4896j423J09303Q2945O4145K8719M8574n1398
7372g7251M6220J31784o1622q5574K2302m1255j03572n8974L9807P4475J41007
7361B7347o579k8497o7035o3360o0995J57598P1541k4977o4213N2172N0337R273
7349E2612O4968L7805p8388j46592j67146M0775O568M5002J88609m572R575L8921
7337H8137o4889m3990j60516J4613N8033K9672k446K5904O7793q9592J1583J1346
$$ plain form
7325 -54352 -168386 -188794 -138666 -139390 -179838 -132731 -12815 -17917 -49280 -5459 17557 -134770
7313 -134770 -203997 -244886 -202273 -186854 -256047 -249637 -206840 -177106 -143416 -180545 -211553 -109545
7301 -109545 -25117 -61551 -84199 -30741 36107 -30506 -123400 -56279 -11687 -51822 -111567 -124645
7289 -124645 -101470 -69975 -116700 -78718 -62094 45863 32039 -71495 -70279 -66081 -139327 -154301
7277 -154301 -141764 -89213 -95832 -121962 -4382 107798 11847 -84923 22993 16561 -1350
7266 -1350 -37406 -214 48122 65466 -70837 -32309 29780 11068 -4460 8566 -20051 -32854
7254 -32854 -75187 -173502 -225128 -85460 -43156 -17410 -74262 -89792 -24151 -19459 -91176 -102702
7242 -102702 -104473 -97585 -118214 -158839 -219999 -212109 -119099 -143907 -274922 -287157 -246608 -165961
$$ packed form
7325e4352j14034k0408N0128p24m0448M7107J19916n102l1363M3821K3016j52327
7313a34770o9227m0889M2613J5419o9193O410M2797K9734L3690l7129l1008J02008
7301a09545Q4428l6434k2648N3458O6848o6613r2894O7121M4592m0135n9745j3078
7289a24645K3175L1495m6725L7982J6624J07957j3824j03534J216M198p3246j4974
7277a54301J2537N2551o619k6130J17580J12180r5951r6770J07916o432j7911
7266a350l6056L7192M8336J7344j36303L8528O2089j8712j5528J3026k8617j2803
7254c2854m2333r8315n1626J39668M2304K5746n6852j5530O5641M692p1717j1526
7242a02702j771O888k0629m0625o1160P890R3010k4808j31015j2235M0549Q0647
$$ plain form
7230 -165961 -221407 -106407 -59815 30929 76670 -5893 -169479 -178294 -182052 -29754 -76296
7219 -76296 -202486 -205548 -127570 -60306 -88401 -183711 -116160 -41056 -100553 -81945 -44068 33535
7207 33535 34886 32569 -63837 -82450 -132245 -138870 -188591 -165622 -65897 -165951 -212003 -148939
7195 -148939 -66165 53794 72780 72854 37371 21700 91024 103571 -40289 -53022 -27588 -38075
7183 -38075 -140141 -145810 -137129 7902 24164 -27569 -68978 -86692 -136962 -133741 -74217 -31904
7171 -31904 13895 36640 -66181 -129925 -119406 -128582 -184588 -111687 -141857 -134439 -31440 -3879
7159 -3879 -89660 -75636 34985 -1118 -71182 -73097 -130952 -131202 -88537 -21306 -102011 -154568
7147 -154568 -211645 -193863 -123352 -120388 -134741 -72334 29668 35081 -90651 -77644 -122293 -185430
$$ packed form
7230a65961n5446J15000M6592R0744M5741q2563j63586q815l758J52298m6542
7219g6296j26190l062P7978O7264k8095r5310O7551P5104n9497J8608L7877P7603
7207C3535J351k317r6406j8613m9795o625m9721K2969R9725j00054m6052O3064
7195a48939Q2774J19959J8986P4l5483j5671O9324J2547j43860j2733K5434j0487
7183c8075j02066n669Q681J45031J6262n1733m1409j7714n0270L221N9524M2313
7171c1904M5799K2745j02821o3744J0519r176n6006P2901l0170P418J02999K7561
7159c879q5781J4024J10621l6103p0064j915n7855k50M2665O7231q0705n2557
7147a54568n7077J7782P0511K964j4353O2407J02002N413j25732J3007m4649o3137
$$ plain form
7135 -185430 -66074 -76280 -64369 -6569 -104925 -30930 13328 -40564 -26078 -83979 -95939
7124 -95939 -72495 -102350 -229026 -249797 -212673 -192575 -67614 -27466 -134259 -188150 -100908
7113 -100908 48049 73500 -26571 -49570 43301 10372 13502 76663 -15052 -243578 -164761
7102 -164761 -69187 -42080 41420 80923 -26460 -96515 -97675 -45684 -19630 -97633 -162406 -101684
7090 -101684 -58501 -154932 -126312 104642 78224 36823 -16017 -86302 -62371 -73879 4500
7079 4500 5273 -11970 -104213 -151241 -155155 -116752 -92158 -143670 -215213 -146137 -90539 -105755 -47721
7066 -47721 -105480 -181554 -184678 -151945 -53296 45668 115760 98716 8715 24739 40320 79336
7054 79336 79617 -20773 -80276 -40342 49003 35306 -31729 -24484 -70469 -157513 -159536 -149417
$$ packed form
7135a85430J19356j0206J1911N7800r8356P3995M4258n3892J4486n7901j1960
7124i5939K3444k9855j26676k0771L7124K0098J24961M0148j06793n3891Q7242
7113a00908J48957K5451j00071k2999R2871l2929L130O3161r1715k28526P8817
7102a64761R5574K7107Q3500L9503j07383p0055j160N1991K6054p8003o4773O0722
7090a01684M3183r6431K8620K30954k6418m1401n2840p0285K3931j1508P8379
7079D500P73j7243r2243m7028l914L8403K4594n1512p1543O9076N5598j5216N8034
7066d7721n7759p6074l124L2733R8649R8964P0092j7044r0001J6024J5581L9016
7054G9336K81j00390n9503L9934Q9345j3697o7035P245m5985q7044k023J0119
$$ plain form
7042 -149417 -155426 -50267 -22411 -106974 -12260 41868 35451 53236 19740 12325 -76564 -37873
7030 -37873 17097 28507 -64054 -69462 -38121 -56315 -21082 -48626 -90674 -137827 -131542 -65044
7018 -65044 -55611 -62389 -63467 -164374 -162852 -194504 -210669 -174228 -83490 -102449 -107751 -63299 -20186
7005 -20186 -86651 -76393 -8278 -25955 -56192 -24049 29944 -32160 -123387 -124954 -163856 -125217
6993 -125217 -148824 -135398 -25643 -16431 -38256 -97193 -20326 47177 35522 8553 -16984 34654
6981 34654 63455 134631 56951 4993 -668 -17880 -7473 -30210 -80133 -208754 -222825 -194601
6969 -194601 -237529 -160180 -96748 -86573 -47513 -138172 -175746 -125432 -105321 -139607 -91895 -95821
6957 -95821 -83988 -8197 -78821 -79643 -7113 -59472 -116883 11042 43413 -10359 -124015 -155552
$$ packed form
7042a49417o009J05159K7856q4563R4714N4128o417J7785l3496p415q8889L8691
7030c7873N4970J1410r2561n408L1341j8194L5233k7544m2048m7153O285O6498
7018f5044R433o778j078j00907J522l1652j6165L6441R0738j8959n302M4452M3113
7005b0186o6465J0258O8115j7677l0237L2143N3993o2104r1227j567l8902L8639
6993a25217k3607J3426J09755R212k1825n8937P6867O7503j1655k6969k5537N1638
6981C4654K8801P1176p7680n1958n661j7212J0407k2737m9923j28621j4071K8224
6969a94601m2928P7349O3432J0175L9060r0659l7574N0314K0111l4286M7712l926
6957i5821J1833P5791p0624q22P2530n2359n7411J27925L2371n3772j13656l1537
$$ plain form
6945 -155552 -86404 4536 52482 -53821 -80507 -102034 -166132 -32168 142520 47303 -45445
6934 -45445 -3301 35493 1694 -37863 -52789 -86251 -54942 3849 -4030 -74748 -226193 -293421
6922 -293421 -191855 -28971 68842 121016 59388 15393 -19372 -2731 -83280 -78011 -166026
6911 -166026 -143657 -44132 -28861 -47098 -18758 -104339 -120014 -160737 -207312 -130653 -108179 -46820
6899 -46820 -22662 -35649 -51982 -52950 -25329 -16392 42702 16259 12716 -28141 -21175 -65939 -36518
6886 -36518 131498 152740 6980 -100715 -75082 -21506 101254 125781 53885 63890 134369
6875 134369 93773 6042 -21465 46976 53608 -32967 -132073 -209198 -183144 -122582 -73308 -27578
6863 -27578 -60044 -27835 -71155 -91095 -68127 -61945 -35710 -20737 -105355 -115970 -89140 -120411
$$ packed form
6945a55552O9148R0940M7946j06303k6686k1527o4098J33964J74688r5217r2748
6934d5445M2144L8794l3799l9557j4926l3462L1309N8791p879p0718j51445o7228
6922b93421J01566J62884R7813N2174o1628m3995l4765J6641q0549N269q8015
6911a66026K2369R9525J5271j8237K8340q5581j5675m0723m6575P6659K2474O1359
6899d6820K4158j2987j6333r68K7621Q937N9094k6443l543m0857O966m4764K9421
6886c6518J68016K1242j45760j07695K5633N3576J22760K4527p1896J0005P0479
6875A34369m0596q7731k7507O8441O632q6575r9106p7125K6054O0562M9274M5730
6863b7578l2466L2209m3320j9940K2968O182K6235J4973q4618j0615K6830l1271
$$ plain form
6851 -120411 -134177 -129784 -47178 -20941 39213 -10790 -119891 -134760 -107426 -2498 72958
6840 72958 -1407 19324 1110 -8674 63920 120216 138251 64807 9364 38929 61961 59988
6828 59988 137767 189240 145121 -10710 -1158 47900 5460 -130062 -24635 57330 11855
6817 11855 90485 34731 -43220 -76460 -83596 -148549 -165712 -31472 79121 6465 4155 -5078
6805 -5078 28929 -12840 20221 117264 136273 38712 67666 45419 27011 20994 14940 -15466
6793 -15466 -22647 -19351 41637 67365 107340 24201 -63048 -162968 -137301 -63749 -30651 17888
6781 17888 -13923 -10156 -3704 -8126 7203 27091 -23411 -35406 -71754 -78731 -90531 -124948 -84268
6768 -84268 85532 28363 -57649 -105799 -62705 3025 -22569 -47585 -115213 -224316 -181818
$$ packed form
6851a20411j3766M393Q2606K6237O0154n0003j09101j4869K7334J04928P5456
6840G2958p4365K0731j8214r784P2594N6296J8035p3444n5443K9565K3032j973
6828E9988P7779N1473m4119j55831R552M9058m2440j35522J05427Q1965m5475
6817A1855P8630n5754p7951l3240p136o4953j7163J34240J10593p2656k310r233
6805e078L4007m1769L3061R7043J9009r7561K8954k2247j8408o017o054l0406
6793a5466p181L296O0988K5728L9975q3139q7249r9920K5667P3552L3098M8539
6781A7888l1811L767O452m422J5329J9888n0502j1995l6348o977j1800l4417M0680
6768h4268J69800n7169q6012m8150M3094O5730k5594k5016o7628j09103M2498
$$ plain form
6757 -181818 -124905 -32068 -1317 -14364 10128 14804 47958 87147 133098 107341 110537 203800
6745 203800 142242 41113 -18595 -50469 -131230 -157989 -166125 -185006 -202488 -172872 -113668 -41774
6733 -41774 25102 6499 109589 115220 -19155 -47099 -36311 -3465 32986 -60496 -58106 -87673
6721 -87673 -68755 -119825 -48433 -28031 18560 7566 -162931 -215517 -335293 -171489 -31975
6710 -31975 77611 75679 -45656 -5458 50728 169807 165772 93115 -76650 -208046 -196532
6699 -196532 -134184 -178213 -148754 -31771 -3606 -39008 -22221 -5345 -27275 4730 -104954
6688 -104954 -196784 -245591 -181898 -6939 -13400 -154761 -204124 -184018 -153294 -101557 -43095
6677 -43095 63414 39659 -129296 -125414 -88863 -53002 21091 -83232 -136972 14803 199682
$$ packed form
6757a81818N6913R2837L0751j3047K4492M676L3154L9189M5951k5757L196R3263
6745B03800o1558j01129n9708l1874q0761k6759q136j8881j7482K9616N9204P1894
6733d1774O6876j8603J03090N631j34375k7944J0788L2846L6451r3482K390k9567
6721h7673J8918n1070P1392K0402M6591j0994j70497n2586j19776J63804J39514
6710c1975J09586j932j21335M0198N6186J19079m035p2657j69765j31396J1514
6699a96532O2348m4029K9459J16983K8165l5402J6787J6876k1930L2005j09684
6688a04954r1830m8807O3693J74959o461j41361m9363K0106L0724N1737N8462
6677d3095J06509k3755j68955L882L6551L5861P4093j04323n3740J51775J84879
$$ plain form
6666 199682 303634 124599 -2004 -336 9638 70516 73821 -59267 -197275 -174719 -136412
6655 -136412 -232732 -252858 -269649 -253364 -166199 -230096 -319704 -227031 -193880 -86951 -19647
6644 -19647 -16496 31859 72306 17717 10993 -36789 -5640 -641 -1861 20513 82803 -36022
6632 -36022 -135292 -173371 -58493 6434 -145772 -191677 -272747 -167539 -151743 -68798 40697
6621 40697 81539 122387 101860 -80161 -241364 -260056 -240333 -259540 -209847 -110833 -117182 -16391
6609 -16391 50914 -11300 31145 -7867 -31225 -156812 -259215 -225083 -126547 -92687 23001
6598 23001 -84641 -103241 -44496 23953 -6608 56329 53096 -7063 -31877 -72896 -73730 -27009
6586 -27009 -4994 -32201 -13784 -54837 -73504 -30018 6764 -83355 -104395 -119799 40194 132128
$$ packed form
6666A99682J03952j79035j26603J668R974O0878L305j33088j38008K2556L8307
6655a36412r6320k0126j6791J6285Q7165o3897q9608R2673L3151J06929O7304
6644a9647L151M8355M0447n4589o724m7782L1149M999j220K2374O2290j18825
6632c6022r9270l8079J14878O4927j52206m5905q1070J05208J5796Q2945J09495
6621D0697M0842M0848k0527j82021j61203j8692J9723j9207M9693R9014o349J00791
6609a6391O7305o2214M2445l9012k3358j25587j02403L4132R8536L3860J15688
6598B3001j07642j8600N8745O8449l0561O2937l233o0159k4814m1019q34M6721
6586b7009K2015k7207J8417m1053j8667M3486L6782r0119k1040j5404J59993R1934
$$ plain form
6574 132128 102222 63306 14998 12914 15127 26103 149248 163491 102112 104069 81795 40017
6562 40017 89461 81271 34009 -25999 -77689 -34275 -47135 -5797 -86319 -171679 -79811 -27898
6550 -27898 -61770 -13258 47193 113210 87064 14413 -48120 -31944 -37506 76595 19658 -125913
6538 -125913 -147155 -170371 -140371 -127885 -116294 -153529 -160640 -111639 -59178 2272 64679 88426
6526 88426 31541 6510 -9410 -64105 -124370 -235482 -167586 -59071 1084 15862 35818
6515 35818 -44687 -52825 -51711 -77881 57670 26581 -38413 62379 -70101 -173014 -47709
6504 -47709 -14764 -88731 -132510 -97991 -22491 25205 112516 85045 28605 -47024 -99770 -70063
6492 -70063 -72541 -124602 -133703 -133361 -141482 -115809 42152 -99699 -174743 -74161 33900 102080
$$ packed form
6574A32128k9906l8916m8308k084K213J0976J23145J4243o1379J957k2274m1778
6562D0017M9444q190m7262o0008n1690M3414j2860M1338q0522q5360R1868N1913
6550b7898l3872M8512O0451O6017k6146p2651o2533J6176n562J14101n6937j45571
6538a25913k1242k3216L0000J2486J1591l7235p111M9001N2461O1450O2407K3747
6526H8426n6885k5031j5920n4695o0265j11112O7896J08515O0155J4778J9956
6515C5818q0505q138J114k6170J35551l1089o4994J00792j32480j02913J25305
6504d7709L2945p3967m3779L4519P5500M7696Q7311k7471n6440p5629n2746K9707
6492g0063k478n2061r101L42q121K5673J57961j41851p5044J00582J08061O8180
$$ plain form
6480 102080 10669 33953 37860 -53794 -65363 -28995 10437 -12591 -83892 -147565 -75582 -118815
6468 -118815 -86409 -2061 41197 -2666 60956 -9931 -70325 -71424 -71688 -76311 -18459 59666
6456 59666 34056 -63410 -125260 -116816 9474 36369 37891 38976 -22199 -30795 -51426 -124896
6444 -124896 -246172 -296165 -211993 -207631 -114070 5727 -33921 -135480 -79614 7130 67154
6433 67154 -16221 -21091 -26960 -20536 -36775 56410 132914 24220 -162198 -102819 28142 67889
6421 67889 -9629 -99499 -237636 -141964 -19498 74930 49971 62707 91845 28571 -50516
6410 -50516 -147149 -99716 -22548 -63443 -50159 11033 19541 -2456 60749 20755 -83861 -21271
6398 -21271 64842 67736 51140 109306 112556 43090 -6625 46239 -27241 -43901 -76616 -110761
$$ packed form
6480A02080r1411K3284L907r1654j1569L6368L9432k3028p1301o3673P1983m3233
6468a18815L2406Q4348M3258m3863O3622p0887o0394j099k64m623N7852P8125
6456E9666k5610r7466o1850Q444J26290K6895J522J085o1175q596k0631p3470
6444a24896j21276m9993Q4172M362R3561J19797l9648j01559N5866Q6744O0024
6433F7154q3375m870n869O424j6239R3185P6504j08694j86418N9379J30961L9747
6421F7889p7518q9870j38137R5672J22466R4428k4959J2736K9138o3274p9087
6410e0516r6633M7433P7168m0895J3284O1192Q508k1997O3205l9994j04616O2590
6398b1271Q6113K894j6596N8166L250o9466m9715N2864p3480j6660l2715l4145
$$ plain form
6386 -110761 -92577 -68890 -143213 -129143 -74368 -58078 -70508 -191234 -202098 -116331 -159420
6375 -159420 -146902 -110788 -52121 -50278 -205672 -294508 -185151 -114651 -52741 26151 18816 69753
6363 69753 88163 196944 181074 104712 49868 -42569 -111236 11526 -54635 19458 56727
6352 56727 -33629 -127028 -122394 -8566 18592 16654 26157 -62039 -163909 -165466 -145688 -121632
6340 -121632 -33019 -122766 -144609 -44158 -48481 -60410 -133402 -54452 7036 -72040 -70601 -51485
6328 -51485 -83988 -9109 303 -6805 -103928 -157402 -145677 -95447 -30379 -84364 -115556 -70423
6316 -70423 -57378 -100303 -182991 -189485 -178991 -89794 -29773 -84341 -132811 -219348 -181329 -132235
6304 -132235 -147232 -212297 -129371 -49126 -96642 -25892 53723 -9894 -99045 -101876 -158461 -178548
$$ packed form
6386a10761J8184K3687p4323J4070N4775J6290j2430j20726j0864Q5767m3089
6375a59420J2518L6114N8667J843j55394q8836J09357P0500O1910P8892p335N0937
6363F9753J8410J08781j5870p6362n4844r2437o8667J22762o6161P4093L7269
6352E6727r0356r3399M634J13828K7158j938R503q8196j01870j557J9778K4056
6340a21632Q8613q9747k1843J00451m323j1929p2992P8950O1488p9076J439J9116
6328e1485l2503P4879R412p108r7123n3474J1725N0230O5068n3985l1192M5133
6316g0423J3045m2925q2688o494J0494Q9197O0021n4568m8470q6537L8019M9094
6304a32235j4997o5065Q2926Q0245m7516P0750P9615o3617q9151k831n6585k0087
$$ plain form
6292 -178548 -229108 -232715 -187070 -163293 -72451 -95258 -170788 -129087 -70164 -15951 -25774 -124031
6280 -124031 -259033 -283727 -181904 -171251 -115070 -99309 11701 138162 95877 -29382 -72437
6269 -72437 -64642 -50332 -42883 -31665 -79388 -119821 -145564 -166355 -174210 -96348 4314 17563
6257 17563 35294 73067 61181 40605 26063 -108820 -154704 -115495 -280544 -266481 -101872
6246 -101872 58431 -51893 -44399 -20377 13873 33671 71531 -40855 14356 57602 67272
6235 67272 18995 -20441 -21246 -29900 -103656 -120771 -69951 29168 55679 111449 108739 72962 -118274
6222 -118274 -213570 -255371 -174002 -21635 -64239 -23677 -711 -20902 24084 85017 -30127
6211 -30127 -171736 -239780 -195754 -77741 -88395 -187788 -183582 -79583 -34670 -77803 -59677
$$ packed form
6292a78548n0560l607M5645K3777R0842k2807p5530M1701N8923N4213r823r8257
6280a24031j35002k4694J01823J0653N6181J5761J11010J26461m2285j25259m3055
6269g2437P795J4310P449J1218m7723m0433k5743k0791p855P7862J00662J3249
6257A7563J7731L7773j1886k0576j4542j34883m5884L9209j65049J4063J64609
6246a01872J60303j10324P494K4022L4250J9798L7860j12386N5211M3246R670
6235F7272m8277l9436q05q654p3756j7115N0820R9119K6511N5770k710l5777j91236
6222a18274r5296m1801Q1369J52367m2604M0562K2966k0191M4986O0933j15144
6211c0127j41609o8044M4026J18013j0654r9393M206J03999M4913m3133J8126
$$ plain form
6200 -59677 -114811 -186795 -104984 -45132 -46962 63694 24392 -25759 -54069 -166650 -201154 -49571
6188 -49571 54866 -2144 -101400 -108149 -55133 -16204 -34753 -104768 -164785 -124716 -123981 -181470
6176 -181470 -185870 -97207 -36777 -30243 -67968 -112196 -96802 -39804 -6729 -15107 -99727 -156268
6164 -156268 -107011 -142335 -203923 -241636 -170183 -25065 55791 45721 -7905 -17304 107212
6153 107212 61503 58093 -5537 -11714 65348 -18605 -56225 13544 59797 4971 -21758 -109310
6141 -109310 -136608 -125774 -132466 -111995 -211806 -182449 -70472 -80516 -85658 -58446 879 121997
6129 121997 75771 -16753 -140518 -105232 -4473 -488 31472 19922 -9179 -56190 -88770
6118 -88770 -30421 -346 -62560 -84040 -60027 -74377 2188 -49850 -22042 80110 177750 97768
$$ packed form
6200e9677n5134p1984Q1811N9852j830J10656l9302n0151k8310j12581l4504J51583
6188d9571J04437n7010r9256o749N3016L8929j8549p0015o0017M0069P35n7489
6176a81470m400Q8663O0430O534l7725m4228J5394N6998L3075q378q4620n6541
6164a56268M9257l5324o1588l7713P1453J45118Q0856j0070n3626r399J24516
6153A07212m5709l410o3630o177P7062q3953l7620O9769M6253n4826k6729q7552
6141a09310k7298J0834o692K0471r9811K9357J11977j0044n142K7212N9325J21118
6129A21997m6226r2524j23765L5286J00759L985L1960j1550k9101m7011l2580
6118h8770N8349L0075o2214k1480K4013j4350P6565n2038K7808J02152R7640p9982
$$ plain form
6106 97768 141779 99964 104679 20057 57443 79949 23603 -8637 -21395 -55389 57808 75660
6094 75660 -8531 53358 33955 -152126 -257909 -229539 -165140 -138992 -107365 -207895 -200462
6083 -200462 -111139 -181396 -242107 -198799 -6051 30087 71002 26379 -70098 -20363 -98478
6072 -98478 39818 182491 186707 115044 101511 27087 -62560 -114789 -148543 -73258 25078 7000
6060 7000 -62514 -132245 -57419 -35341 -5124 -47639 -110107 -70419 -35877 9550 139915 250246
6048 250246 152427 96398 -82556 -312859 -336789 -232193 -176767 -117508 -108731 -127871 -47419
6037 -47419 -57921 -6740 56711 18490 166470 174740 106491 103664 137025 160051 108168 46484
6025 46484 53363 75227 -37769 -162474 -58402 -17374 -104854 -158954 -186361 -146163 -225039
$$ packed form
6106I7768M4011m1815M715q4622L7386K2506n6346l2240j2758l3994J13197J7852
6094G5660q4191O1889j9403j86081j05783K8370O4399K6148L1627j00530P433
6083b00462Q9323p0257o0711M3308J92748L6138M0915m4623r6477M9735p8115
6072i8478J38296J42673M216p1663j3533p4424q9647n2229l3754P5285R8336j8078
6060G000o9514o9731P4826K2078L0217m2515o2468L9688L4542M5427J30365J10331
6048B50246r7819n6029j78954k30303k3930J04596N5426N9259Q777j9140Q0452
6037d7419j0502N1181O3451l8221J47980Q270o8249k827L3361K3026n1883o1684
6025D6484O879K1864j12996j24705J04072M1028q7480n4100k7407M0198p8876
$$ plain form
6014 -225039 -239032 -226588 -219175 -145084 -106858 -142888 -100227 -27932 37384 -48655 -143575 -167343
6002 -167343 -243958 -230903 -199053 -72508 -17553 -42044 -86893 -72622 26612 48818 9459
5991 9459 -78798 -139881 -148257 -71161 -61221 -37064 -67057 -186759 -184358 -178129 -193450 -236013 -223593
5978 -223593 -224334 -112214 -111667 -92762 -94149 -8589 11636 15264 21785 -3894 -28577 -183447 -173615
5965 -173615 -34215 78406 121412 99902 108700 86148 23411 112658 -11747 -120936 -214859
5954 -214859 -143544 -63873 -36620 -24726 112213 70459 -31829 -90573 -28030 6795 23820
5943 23820 -55319 -58770 -4091 85670 150637 181198 164112 27258 -84550 -157178 -113730 -41660
5931 -41660 -3667 30351 26421 -43469 18264 -74824 -146127 -121312 -71908 -131631 -160053 -115899
$$ packed form
6014b25039j3993J2444P413P4091L8226l6030M2661P2295O5316q6039r4920k3768
6002a67343p6615J3055L1850J26545N4955k4491m4849J4271R9234K2206l9359
5991I459q8257o1083q376P7096R940K4157k9993j19702K401O229j5321m2563J2420
5978b23593p41J12120N47J8905j387Q5560K0225L628O521k5679k4683j54870R832
5965a73615J39400J12621M3006k1510Q798k2552o2737Q9247j24405j09189r3923
5954b14859P1315P9671K7253J1894J36939m1754j02288n8744O2543L4825J7025
5943B3820p9139l451N4679Q9761O4967L0561j7086j36854j11808p2628M3448P2070
5931d1660L7993L4018l930o9890O1733r3088p1303K4815M9404n9723k8422M4154
$$ plain form
5919 -115899 -78566 -99906 -118097 -165539 -121639 -52901 -38005 -79573 -58806 117722 105952
5908 105952 48420 -53007 -109463 -52370 -51511 -74424 46007 105882 -57621 -201093 -199613
5897 -199613 -170629 -103669 12804 9743 -56496 -117753 -123856 -3045 107836 67103 24180
5886 24180 38485 -38473 59953 63088 -12032 -51083 -23905 37581 -75312 -114059 -107730 -109042
5874 -109042 -165066 -149978 -51510 -102957 -149258 -113843 -106610 -71349 9471 -30789 -23022 6104
5862 6104 37875 33098 -66507 -54542 -62830 -36098 103898 87329 -28005 -117237 -137547 -125763
5850 -125763 -74501 2530 -5487 -77484 -120942 -120318 -111391 -152763 -221390 -196611 -61568 113386
5838 113386 28373 4346 -18742 -101635 -127367 -183992 -182746 -104289 -102907 -187432 -84399 65952
$$ packed form
5919a15899L7333k1340j8191m7442M3900O8738J4896m1568K0767J76528j1770
5908A05952n7532j01427n6456N7093Q59k2913J20431N9875j63503j43472J480
5897a99613K8984O6960J16473l061o6239o1257o103J20811J10881m0733m2923
5886B4180J4305p6958R8426L135p5120l9051K7178O1486j12893l8747O329j312
5874a09042n6024J5088R8468n1447m6301L5415P233L5261Q0820m0260P767K9126
5862F104L1771m777r9605J1965q288K6732J39996j6569j15334q9232k0310J1784
5850a25763N1262P7031q017p1997m3458O24Q927m1372o8627K4779J35043J74954
5838A13386q5013k4027k3088q2893k5732n6625J246P8457J382q4525J03033J50351
$$ plain form
5826 65952 221476 252727 140737 81299 63962 68889 44194 4886 -91582 -203448 -92785
5815 -92785 40974 56908 22449 40388 80717 -28399 -88159 -25091 101587 294805 326576
5804 326576 266222 208923 161382 142572 157398 99299 70551 60012 88077 66946 42208 -28174
5792 -28174 -91343 -15673 65505 103411 53079 -80364 -88423 -116756 -129912 -27307 45489 -66374
$$ packed form
5826F5952J55524L1251j11990n9438j7337M927k4695l9308r6468j11866J10663
5815i2785J33759J5934l4459J7939M0329j09116n9760O3068J26678J93218L1771
5804C26576o0354n7299m7541j8810J4826n8099k8748j0539K8065k1131k4738p0382
5792b8174o3169P5670Q1178L7906n0332j33443q059k8333j3156J02605P2796j11863
$$ [...]
##END NTUPLES=NMR SPECTRUM
##END=
