##TITLE=Analysis number 326084
Compound Code cc 60604
Book Reference 486/92
Project Code adrs
Chemist Name simons
##JCAMPDX= 6.0         $$ Bruker NMR JCAMP-DX V2.0
##DATA TYPE= NMR SPECTRUM
##DATA CLASS= NTUPLES
##ORIGIN= Bruker BioSpin GmbH
##OWNER= nmr
$$ XWIN-NMR		Version 3.5
$$ Wed Jan 24 13:02:26 2007 GMT Standard Time (UT+0h)  MAYBRIDGE\nmr@NMR_250MHZ
##.OBSERVE FREQUENCY= 250.131544655141
##.OBSERVE NUCLEUS= ^1H
##.ACQUISITION MODE= SIMULTANEOUS (DQD)
##.ACQUISITION SCHEME= undefined
##.AVERAGES= 16
##.DIGITISER RES= 18
##SPECTROMETER/DATA SYSTEM= dpx250
##.PULSE SEQUENCE= zg30
##.SOLVENT NAME= CDCl3
##.SHIFT REFERENCE= (INTERNAL, CDCl3, 0, 16.522)
##AUDIT TRAIL= $$ (NUMBER, WHEN, WHO, WHERE, WHAT)
$$ ##TITLE= Audit trail, XWIN-NMR		Version 3.5
$$ ##JCAMPDX= 5.01
$$ ##ORIGIN= Bruker BioSpin GmbH
$$ ##OWNER= nmr
$$ C:\u/data/dgb/nmr/ADRS/1670/pdata/1/auditp.txt
$$ ##AUDIT TRAIL=  $$ (NUMBER, WHEN, WHO, WHERE, WHAT)
(   1,<2007-01-24 13:01:59.54 +000>,<MAYBRIDGE\nmr>,<NMR_250MHZ>,
      <created by zg, POWCHK disabled, PULCHK disabled
       configuration hash MD5:
       49 4B E0 1D 92 C2 6B 37 9F E6 65 BC 52 41 86 1D
       data hash MD5: 64K
       5C F1 CB 1C 55 2C F3 19 A3 DB 7D B8 4C 12 3C 0C>)
(   2,<2007-01-24 13:02:15.37 +000>,<MAYBRIDGE\nmr>,<NMR_250MHZ>,
      <Start of raw data processing
       ef LB = 0.3 FT_mod = 6 PKNL = 1 SI = 32K 
       data hash MD5: 32K
       18 5F AE 45 2A 6B 9B 90 70 5A 58 48 A0 FE 8F 0B>)
(   3,<2007-01-24 13:02:17.18 +000>,<MAYBRIDGE\nmr>,<NMR_250MHZ>,
      <apk 
       data hash MD5: 32K
       9A 63 7F 35 4B CB 92 BD 11 4A 60 35 05 F9 4B 86>)
(   4,<2007-01-24 13:02:18.12 +000>,<MAYBRIDGE\nmr>,<NMR_250MHZ>,
      <abs ABSG = 5 
       data hash MD5: 32K
       B1 E8 B5 71 00 07 5D 5F B3 B7 53 88 73 BB 81 9C>)
$$ ##END=
$$ 
$$ hash MD5
$$ B0 E1 74 53 7C CB D7 84 2C 31 79 3D E9 5D 14 8C
##$RELAX= 
##$RELAX= 
##$RELAX= 
##$RELAX= 
##$RELAX= 
##$RELAX= 
##$RELAX= 
$$ Bruker specific parameters
$$ --------------------------
##$DU= <C:\u>
##$EXPNO= 1670
##$NAME= <ADRS>
##$PROCNO= 1
##$TYPE= <nmr>
##$USER= <dgb>
##$AMP= (0..31)
100 100 100 100 100 100 100 100 100 100 100 100 100 100 100 100 100 100 
100 100 100 100 100 100 100 100 100 100 100 100 100 100 
##$AQSEQ= 0
##$AQ_mod= 3
##$AUNM= <au_zg>
##$AUTOPOS= <18 >
##$BF1= 250.13
##$BF2= 250.13
##$BF3= 250.13
##$BF4= 250.13
##$BF5= 500.13
##$BF6= 500.13
##$BF7= 500.13
##$BF8= 500.13
##$BYTORDA= 1
##$CFDGTYP= 0
##$CFRGTYP= 5
##$CHEMSTR= <none>
##$CNST= (0..31)
1 1 145 1 1 1 1 1 1 1 1 1 1 1 1 1 1 1 1 1 1 1 1 1 1 1 1 1 1 1 1 1 
##$CPDPRG= <>
##$CPDPRG1= <>
##$CPDPRG2= <>
##$CPDPRG3= <>
##$CPDPRG4= <mlev>
##$CPDPRG5= <mlev>
##$CPDPRG6= <mlev>
##$CPDPRG7= <mlev>
##$CPDPRG8= <mlev>
##$CPDPRGB= <>
##$CPDPRGT= <>
##$D= (0..31)
0 1 0 0 0 0 0 0 0 0.06 0 0 0 0 0 0 0.0002 0 0 0 0 0 0 0 0 0 0 0 0 0 0 
0 
##$DATE= 1169643718
##$DBL= (0..7)
120 120 120 120 120 120 120 120 
##$DBP= (0..7)
150 150 150 150 150 150 150 150 
##$DBP07= 0
##$DBPNAM0= <>
##$DBPNAM1= <>
$$ [...]
##$SUBNAM7= <"">
##$SUBNAM8= <"">
##$SUBNAM9= <"">
##$SW= 20.6930455092707
##$SWIBOX= (0..15)
0 0 3 0 0 0 0 0 0 0 0 0 0 0 0 0 
##$SW_h= 5175.983436853
##$TD= 65536
##$TD0= 1
##$TE= 294.16
##$TE2= 300
##$TE3= 300
##$TEG= 300
##$TL= (0..7)
0 120 120 120 120 120 120 120 
##$TP= (0..7)
150 150 150 150 150 150 150 150 
##$TP07= 0
##$TPNAME0= <>
##$TPNAME1= <>
##$TPNAME2= <>
##$TPNAME3= <>
##$TPNAME4= <>
##$TPNAME5= <>
##$TPNAME6= <>
##$TPNAME7= <>
##$TPOAL= (0..7)
0.5 0.5 0.5 0.5 0.5 0.5 0.5 0.5 
##$TPOFFS= (0..7)
0 0 0 0 0 0 0 0 
##$TUNHIN= 0
##$TUNHOUT= 0
##$TUNXOUT= 0
##$USERA1= <user>
##$USERA2= <user>
##$USERA3= <user>
##$USERA4= <user>
##$USERA5= <user>
##$V9= 5
##$VALIST= <valist>
##$VCLIST= <CCCCCCCCCCCCCCC>
##$VD= 0
##$VDLIST= <DDDDDDDDDDDDDDD>
##$VPLIST= <PPPPPPPPPPPPPPP>
##$VTLIST= <TTTTTTTTTTTTTTT>
##$WBST= 1024
##$WBSW= 4
##$XGAIN= (0..3)
0 0 0 0 
##$XL= 0
##$YL= 0
##$YMAX_a= 310017
##$YMIN_a= -529111
##$ZGOPTNS= <>
##$ZL1= 120
##$ZL2= 120
##$ZL3= 120
##$ZL4= 120
##$ABSF1= 16.522
##$ABSF2= -4.171173
##$ABSG= 5
##$ABSL= 3
##$ALPHA= 0
##$AQORDER= 0
##$ASSFAC= 0
##$ASSFACI= 0
##$ASSFACX= 0
##$ASSWID= 0
##$AUNMP= <proc_1d>
##$AZFE= 0.1
##$AZFW= 0.1
##$BCFW= 0
##$BC_mod= 0
##$BYTORDP= 0
##$COROFFS= 0
##$CY= 12.5
##$DATMOD= 1
##$DC= 0
##$DFILT= <>
##$DTYPP= 0
##$F1P= 14.0000005364418
##$F2P= -0.99999901652339
##$FCOR= 0.5
##$FTSIZE= 32768
##$FT_mod= 6
##$GAMMA= 0
##$GB= 0
##$INTBC= 1
##$INTSCL= 1
##$ISEN= 128
##$LB= 0.3
##$LEV0= 0
##$LPBIN= 0
##$MAXI= 10000
##$MC2= 0
##$MEAN= 0
##$ME_mod= 0
##$MI= 0
##$NCOEF= 0
##$NC_proc= -3
##$NLEV= 6
##$NOISF1= 0
##$NOISF2= 0
##$NSP= 0
##$NTH_PI= 0
##$NZP= 0
##$OFFSET= 16.522
##$PC= 1
##$PHC0= 229.9507
##$PHC1= 7.738787
##$PH_mod= 1
##$PKNL= yes
##$PPARMOD= 0
##$PSCAL= 4
##$PSIGN= 0
##$REVERSE= no
##$SF= 250.13
##$SI= 32768
##$SIGF1= 0
##$SIGF2= 0
##$SINO= 400
##$SIOLD= 32768
##$SREGLST= <1H.CDCl3>
##$SSB= 0
##$STSI= 32768
##$STSR= 0
##$SW_p= 5175.98343685301
##$SYMM= 0
##$S_DEV= 0
##$TDeff= 65536
##$TDoff= 0
##$TI= <Analysis number 999999
Compound Code 99
Book Reference 9
Project Code 9>
##$TILT= no
##$TM1= 0
##$TM2= 0
##$TOPLEV= 0
##$USERP1= <user>
##$USERP2= <user>
##$USERP3= <user>
##$USERP4= <user>
##$USERP5= <user>
##$WDW= 1
##$XDIM= 32768
##$YMAX_p= 538215233
##$YMIN_p= -203532
$$ End of Bruker specific parameters
$$ ---------------------------------
##NTUPLES= NMR SPECTRUM
##VAR_NAME=  FREQUENCY,     SPECTRUM/REAL,   SPECTRUM/IMAG
##SYMBOL=    X,             R,               I
##VAR_TYPE=  INDEPENDENT,   DEPENDENT,       DEPENDENT
##VAR_FORM=  AFFN,          ASDF,            ASDF
##VAR_DIM=   32768,         32768,           32768
##UNITS=     HZ,            ARBITRARY UNITS, ARBITRARY UNITS
##FACTOR=    0.157963299565203, 1,           1
##FIRST=     4132.6476996994, 0,             0
##LAST=      -1043.33573715361, 0,           0
##MIN=       -1043.33573715361, -203532,     0
##MAX=       4132.6476996994, 538215233,     0
$$ Real data points
##PAGE= N=1
##DATA TABLE= (X++(R..R)), XYDATA
$$ [...]
18765B495205k01404j85045j13955n4124o5318M9493J92419J45857r220q3712
18755B170196J1793J29247Q0462n9154j99581k90083l13563k23725l0969O0976
18745A335599M4955j3584j35998k37999k23657j31252j01030p1346n7772o1250
18735C46666n6565o745J3229j5475k2664k3831J8463j9343j5837N699O011K891
18723B32499N067j6949n291o185o205N761J9186N9317L8320P8024J00331J37111
18711F40986J75762J24158N6154L976k2434L3967J64285J83536R4317P813j22286
18700A340234k00365j56915j11835r1543p7096r6320q5244o1374l7452l2438l8011
18689C51641n3877k0839k1844j2759K975j220k2618o901m186j6996J457j1476
$$ plain form
18765 2495205 2293801 2108756 1994801 1940677 1875359 1924852 2117271 2263128 2253908 2170196
18755 2170196 2181989 2311236 2391698 2332544 2132963 1842880 1529317 1305592 1274623 1335599
18745 1335599 1380554 1366970 1230972 992973 769316 638064 537034 465688 407916 346666
18735 346666 290101 283356 296585 281110 258446 234615 253078 233735 217898 223597 229608 232499
18723 232499 237566 220617 215326 209141 202936 208697 227883 287200 325520 403544 503875 640986
18711 640986 816748 940906 997060 1001036 978602 1012569 1176854 1360390 1454707 1462520 1340234
18700 1340234 1139869 982954 871119 779576 702480 606160 520916 459542 422090 389652 351641
18689 351641 297764 276925 255081 242322 245297 244077 221459 214558 210372 193376 194833 183357
18677A83357K846Q045J9280J4314N720L576n132J2533J6640J1327l410K2991M4737
18664C36824N0620M7773N2252L6583K2934K152j438J344M4911L8420O912O686
18652F45973j0203m9425k7929k3548l3754k2572k0101K5033M8157L2737M7507
18641F11875P6727R8600Q6629M3609O6282N8745P700p389j5061j9556K0563L3274
18629A061998O9485J13228J40308J93442K38358L36191M75905O65962J022573
18620D317450J533311K421257L892614N846516O651489N252097M683034M714603
18612C9312371J113482l576010m500880m537598o038081o217083m490469k790484
18604H275248j798713j181386q74827o40639m65176l55900k61118j74828j11792
$$ plain form
18677 183357 186203 194248 213528 227842 233562 237138 232006 244539 261179 272506 269096 292087 336824
18664 336824 387444 435217 487469 524052 546986 549138 547700 549044 593955 632375 639287 645973
18652 645973 635770 586345 558416 534868 501114 478542 458441 483474 531631 564368 611875
18641 611875 688602 787202 873831 917440 983722 1042467 1050167 1042778 1027717 1008161 1028724 1061998
18629 1061998 1131483 1244711 1385019 1578461 1816819 2153010 2628915 3294877 4317450
18620 4317450 5850761 8272018 12164632 18011148 24662637 29914734 34597768 39312371
18612 39312371 40425853 36849843 32348963 27811365 21773284 15556201 11065732 8275248
18604 8275248 6476535 5295149 4420322 3779683 3314507 2958607 2697489 2522661 2410869
18595B410869r8461m1368M4345J22163J20976J32893P9261J9315l9496j05758
18585B644739j10282j31927j21363k4801M0387R6616J75960K69092L37089M42910
18575C618420O27370R32440J357426J983781L054986M949064P852067J0736296
18567C5111850J0517601Q320053Q420021O619841j239900p301766p823128q975595
18559D3648977j0877551r611909o434943l926440k448257j526889q71081m50175
18551G501732l04297n49983q75299q90771o87418m94000k78443j32764r2043m0729
18541C155985m0358p5500j12675j74735k09487k06454j83529j66841j02047o5550
18531A818809o862L5621Q7412J19062J78344K87602M05752O20956R69852J532989
$$ plain form
18595 2410869 2312408 2271040 2315385 2437548 2558524 2691417 2770678 2789993 2750497 2644739
18585 2644739 2534457 2402530 2281167 2256366 2296753 2393369 2569329 2838421 3175510 3618420
18575 3618420 4245790 5178230 6535656 8519437 11574423 16523487 24375554 35111850
18567 35111850 45629451 53949504 62369525 68989366 67749466 60447700 52624572 43648977
18559 43648977 32771426 23159517 16724574 12798134 10349877 8822988 7951907 7501732
18551 7501732 7197435 6647452 5772153 4881382 4193964 3699964 3421521 3288757 3196714 3155985
18541 3155985 3115627 3040127 2927452 2752717 2543230 2336776 2153247 1986406 1884359 1818809
18531 1818809 1811947 1847568 1934980 2054042 2232386 2519988 2925740 3546696 4516548 6049537
18521F049537K499541L860005M744572L929346L171607L393334J431426k195384
18513B6883984l351328l140708m127882m542086l472880k193055j365689r13216
18505C777140o30272m59134l50613k61951j86777j24695n7958j3357N199k8974
18495A668608o5783r8110r5735m0505j5547o4398o1635l3802l3521k0212J7007
18484A156367k5003q7291j12874j11779j03394l2843k5803P87N148M7225P1329
18473G81869N4968k7018q6495r5643r4327n4122k7905j4724J6870L8992J5824
18462E08289l4859l3970j9796k3732o562M170j2471J2664k979J0159L4002K7140
18450D62055J1441m717M2683K5074M531j3269J9885n097j4391Q437p505l2314
$$ plain form
18521 6049537 8549078 12409083 17153655 21083001 24254608 27647942 29079368 26883984
18513 26883984 23532656 20391948 16264066 11721980 8249100 6056045 4690356 3777140
18505 3777140 3146868 2687734 2337121 2075170 1888393 1763698 1705740 1692383 1697582 1668608
18495 1668608 1602825 1504715 1408980 1368475 1352928 1288530 1226895 1193093 1159572 1139360 1156367
18484 1156367 1131364 1044073 931199 819420 716026 683183 657380 658167 663315 710540 781869
18473 781869 836837 809819 723324 627681 533354 479232 451327 436603 453473 492465 508289
18462 508289 473430 439460 419664 395932 389370 393540 381069 393733 390754 400913 434915 462055
18450 462055 473496 468779 511462 536536 541067 527798 547683 542586 528195 536632 529127 496813
18438D96813k9475p315L3816N4487L7392K5510O6030J19501J51809J66941J53443
18427A268952J64437Q3550j6702q7117j55172j73593j82856j37944p8851n1601
18417F33103k1478j4789l0770m7402k8618n54L5195J5024r526l8157n41L3600
18405E25087O0452N2779O1017O0857O2113L0803L9904K8531J6922q644j3783K51
18393I16289M2738Q0485N9265O9181J17563J50342J99792K17534K00800J38958
18383B192947J31948J62187K25764K66761K69724K37498J81802Q5941O5106Q8518
18373C908196J27770J96375L23729M20361N07278O74652J040509J659098K752922
18364A1610890M549451P341884J0843291J3759182J4720667J0660442L782752
$$ plain form
18438 496813 467338 460023 493839 548326 585718 611228 677258 796759 948568 1115509 1268952
18427 1268952 1433389 1516939 1500237 1413120 1257948 1084355 901499 763555 684704 633103
18417 633103 611625 596836 566066 518664 490046 489492 524687 539711 530185 492028 491487 525087
18405 525087 585539 638318 699335 760192 822305 853108 893012 921543 938465 929821 916038 916289
18393 916289 959027 1039512 1098777 1167958 1285521 1435863 1635655 1853189 2053989 2192947
18383 2192947 2324895 2487082 2712846 2979607 3249331 3486829 3668631 3754572 3819678 3908196
18373 3908196 4035966 4232341 4556070 4976431 5483709 6158361 7198870 8857968 11610890
18364 11610890 16160341 23502225 34345516 48104698 62825365 73485807 77268559
18357G7268559l559277j0372896j3341077j1992150q768473n152272j923061Q80151
18349B3039504L995338P746855J1421182J3814762J2802533O659623m42310q020702
18341G1016785j3484176j4342875j1881402q553497n558232l527905k277891j540600
18333I850207j118925r02604p37769o34563n50559n21008n40622n03923m79876
18324C860358m15313l30393k34284j72350p5646l9197k1046m4173r1000j31534
18314B305422j42788j48811j21337j08704j20853r8919j04423r3369k3126J6547
18304A359639L9745J09215J86381L26790M23046M83995L71048J46036p6109k75017
18294C094769l30512j72193J3467J47369K00054J26944J48025J99185K02238J52839
$$ plain form
18357 77268559 73709282 63336386 49995309 38003159 29234686 24082414 22159353 23039504
18349 23039504 27034842 34781697 46202879 60017641 72820174 79479797 79037487 71016785
18341 71016785 57532609 43189734 31308332 22754835 17196603 13668698 11390807 9850207
18333 9850207 8731282 7828678 7090909 6456346 5905787 5384779 4844157 4340234 3860358
18324 3860358 3445045 3114652 2880368 2708018 2632372 2593175 2572129 2527956 2436956 2305422
18314 2305422 2162634 2013823 1892486 1783782 1662929 1564010 1459587 1366218 1343092 1359639
18304 1359639 1399384 1508599 1694980 2021770 2444816 2928811 3299859 3445895 3369786 3094769
18294 3094769 2764257 2592064 2605531 2752900 2952954 3079898 3227923 3427108 3629346 3782185
18284C782185R8402k7937j65350k50239k60378j32245M3698J38080K0792j37933
18274C109075l20070m28482m30962l10577j83545q5783m8734K8860J33783K53850
18264A717415L58535L87045K45703M5122k03793l68638m20932l59678k65554j66867
18254I68358j33624p2097n2161k3412k5791N173M8191N0025M9495J24288J75935
18243A114380J87507J46203O7573J6450n768q7439j54178j99447k03303j93191
18233F88787j27929p7725o7732m0358k7411q52r808Q316K2823N577N075K2061
18221D00824K4203j3336k9917n1191m277J099Q509R558M9555j7117k2330K948
18209C58528k133j5131n994j2279J1577M172q09N934j3485q492J3486K2179J7075
$$ plain form
18284 3782185 3880587 3852650 3687300 3437061 3176683 3044438 3088136 3226216 3247008 3109075
18274 3109075 2789005 2360523 1929561 1618984 1435439 1349656 1300922 1329782 1463565 1717415
18264 1717415 2075950 2462995 2708698 2753820 2550027 2181389 1760457 1400779 1135225 968358
18254 968358 834734 762637 710476 687064 661273 666446 714637 764662 814157 938445 1114380
18243 1114380 1301887 1448090 1515663 1532113 1526345 1438906 1284728 1085281 881978 688787
18233 688787 560858 483133 415401 375043 347632 346780 336972 345288 368111 373688 378763 400824
18221 400824 425027 411691 381774 330583 326306 327405 335914 345472 395027 377910 355580 358528
18209 358528 356395 341264 335270 322991 334568 338740 337931 343865 330380 321888 335374 357553 374628
18196C74628N2047N3083O6185N7901P6959N3435P0445P8210O0955P590L2321N6619
18184A040378N6541P8137J09096J21150Q2608M6173O945m6893r8693j10235p9470
18173A205737n4950k7234j6907j8750o262l5420p0964j10519q2090j05299j19088
18162E58254q5947o5268l4108r473N744k6952l2157R18l33p523m573j4811j0071
18149B73700R868R237J9703L7774J8521K2111L6632O4439J21781P5619J5680J8018
18137G23083L0598J5052L0271K7186K8103N3178N9550M7658K6436l859O414J0939
18125A054609L6325O0960O6041J03182J10169J31641J54478K14136L18753M84945
18115B735239P40245J091093J857589L320794O221476J1548748J8741624J5038370
$$ plain form
18196 374628 426675 479758 545943 603844 680803 734238 804683 882893 943848 951438 983759 1040378
18184 1040378 1096919 1175056 1284152 1405302 1487910 1534083 1541028 1494135 1395442 1285207 1205737
18173 1205737 1150787 1123553 1106646 1087896 1081634 1046214 975250 864731 782641 677342 558254
18162 558254 472307 407039 372931 363458 369202 342250 310093 311011 310678 303155 298582 283771 273700
18149 273700 283568 292805 312508 350282 368803 390914 427546 491985 613766 689385 705065 723083
18137 723083 753681 768733 799004 826190 854293 907471 967021 1014679 1041115 1037256 1043670 1054609
18125 1054609 1090934 1151894 1217935 1321117 1431286 1562927 1717405 1931541 2250294 2735239
18115 2735239 3475484 4566577 6424166 9744960 15966436 27515184 46256808 61295178
18107F1295178o252254j8953359j4818796p747062m177118k460458j522554r74437
18099D389140o83889n45829m41091l76384l61249k85954k16300j54043j00009
18090A224392r2754j01486o8913o8911q3311n4609m6204n3207n0113o1105o8558
18079D75221l1386k6962k7940l3978n218k0794k0040N575k9l468k9934m1713j410
18066B37924j2704o481l517k3214J1528K0417R372l624j8497L619L0920R202M7780
18053C02725N5907K3133J5622J4575L6226j8036k4615n4121o3852o1982l6279
18042A89303l1501m9745n377R723k8030L794K599M356j1907p019n97R454j0396
18029G4657p39J4505j0796P083P588p051j4479j3787K9602K8200K490K321K004
$$ plain form
18107 61295178 55042924 36089565 21270769 13523707 9346589 6886131 5363577 4389140
18099 4389140 3705251 3159422 2718331 2341947 1980698 1694744 1478444 1324401 1224392
18090 1224392 1131638 1030152 961239 892328 809017 754408 708204 654997 604884 543779 475221
18079 475221 443835 416873 388933 354955 349737 328943 308903 314478 314449 310981 281047 239334 237924
18066 237924 225220 218739 215222 192008 203536 223953 233325 229701 211204 214823 245743 254945 302725
18053 302725 358632 381765 397387 411962 448188 430152 405537 351416 287564 225582 189303
18042 189303 157802 108057 102680 112403 84373 88167 90766 95122 83215 76196 75599 85053 74657
18029 74657 73918 88423 77627 84710 92298 85247 70768 56981 86583 114783 117273 119594 121598
18016A21598r195j9229P22k246o549m952n738J7502k154J1917J7586K8187O67
18003A48116K3584M1864L8581q819l5940j3305j8244k0727j7498m5070k333N325
17991I5534j1521J0709J2541o081j5428j035J4672m259O844k1794m8270j2104
17979A9808L482O911Q199N778Q29J7580K3791k3147k4786k7859K3588J1272J6907
17966F2353m625J799J8864j3820k3897K515r720R914j6918J292L1257j1892l2087
17953A5035K3602O523p760q725J684J557J2363p057l3461Q167J5573J6415p447
17940C6469j8258K191J5430O800j6641n127J3436J691K880j7119K225J7931n488
17927C6420J567J2379K6296L614k6350k8539l1841l617L0396L3681P177j0629
$$ plain form
18016 121598 112403 93174 93896 91650 85101 80149 74411 91913 89759 101676 119262 147449 148116
18003 148116 171700 213564 252145 243326 207386 194081 175837 155110 137612 92542 90209 95534
17991 95534 84013 94722 107263 101182 85754 84719 99391 95132 101976 80182 31912 19808
17979 19808 23290 30201 38400 44178 45007 62587 86378 63231 38445 10586 34174 45446 62353
17966 62353 57728 59527 78391 64571 40674 43189 33469 43383 26465 27757 59014 47122 15035
17953 15035 38637 45160 37400 28675 30359 31916 44279 37222 3761 11928 27501 43916 36469
17940 36469 18211 20402 35832 42632 25991 20864 34300 35991 38871 21752 23977 41908 36420
17927 36420 37987 50366 76662 80276 53926 25387 -6454 -10071 20325 54006 61183 50554
17915E0554l1302k1526O103R127R558K861l295m711m778m859N509j2303K3194
17902B4132J3080O472o238k4319n370M235R278o34k1621k6314o963K7337O545
17889c80N410J3795p03J0637J1905j4022r412N871J740l022P654j7240k3025j2997
17875b3789J0159L7784L1867k1144j8408O995R979p236J4076j8250J2156J5354
17863D9543J979q096r15J0119j4162k4236K898j7653N906J4959L6160P212k6381
17850C7333k4874j1390M706k603m041q700K6376m173j765R413j6333L0794q338
17837B6405M992m271q78j1074P060l701j7069n037K569J4116M0K192L51j7316
17823a621N783O961L0221p779j1789M947N111k4560r666R405J6969O705k3438
$$ plain form
17915 50554 19252 -2274 3829 12956 22514 25375 22080 17369 12591 7732 13241 938 24132
17902 24132 37212 43684 37446 13127 7757 11992 21270 20636 -985 -27299 -34262 -6925 -380
17889 -380 5030 18825 18122 28759 40664 26642 17230 23101 24841 21819 29473 12233 -10792 -23789
17875 -23789 -13630 24154 56021 34877 16469 23464 33443 26207 40283 22033 34189 49543
17863 49543 51522 43426 42511 52630 38468 14232 17130 -523 5383 20342 56502 63714 37333
17850 37333 12459 1069 5775 3172 -869 -9569 16807 12634 10869 20282 3949 34743 26405
17837 26405 31397 27126 26248 15174 22234 18533 1464 -3573 -1004 13112 13152 15344 15695 -1621
17823 -1621 4162 11123 41344 33565 21776 26723 31834 7274 -2392 7013 23982 30687 7249
17810G249j5489J0941r1n568M351P015m874K9457L694j8744L701J6320J1797m575
17796D5184j0823J222j9568p030J2767j6520j4826M925J0218P02J2648O770J1212
17783C6881R2k0623M437K0547J8813j3756p537J5761J2377k9J565J7730L8325
17770A24583M9196O4690Q2616N0995J3083R918k9335o5823n4599l6375p660k7079
17758A74210l5121J2511M4859M4321O0854N1296K0888p851N989o4048p0296m9075
17746A88537m2766k7548k2226j5946L821j0295j5235p210j7318j1735j4551j942
17734E586J6585K0420K2300o057k163K835Q10j387j9839k495L543n075r154N897
17720C1806j6144k492N729J37r98k920J1224P759j326K49J1854q64j5119k335
$$ plain form
17810 7249 -8240 2701 2610 -2958 1393 8408 3534 32991 36685 17941 21642 37962 49759 45184
17796 45184 34361 35583 16015 8985 21752 5232 -9594 -4669 5549 6251 18899 25669 36881
17783 36881 36973 16350 20787 41334 60147 46391 38854 54615 66992 66963 68528 86258 124583
17770 124583 173779 238469 321085 372080 385163 395081 365746 299923 245324 208949 201289 174210
17758 174210 139089 151600 196459 240780 301634 352930 373818 365967 371956 307908 237612 188537
17746 188537 145771 118223 95997 80051 83872 73577 58342 51132 33814 22079 7528 5586
17734 5586 22171 42591 64891 58834 56671 59506 60316 58929 39090 36595 40138 35063 25909 31806
17720 31806 15662 13170 18899 19036 18038 15118 26342 34101 32775 33024 44878 44014 28895 26560
17706B6560k793J0610n131P113L02n39j8579j5593n838J2518N367j877J2876K7290
17692E2286O228j8473k155n836k4728O850L666j5908j1212J8356J4602J7699P449
17679D8824j4768j1522l716J9409j6879k714P684j2227o916k435j3766L447L5735
17666C0156L786k5006j8389j5035O369K6831O070j7977O882n061j0624M978J1671
17653D651j8861q342J1599J7463N451L93r410J7145K5504j4098k4805Q537O347
17640B1574L9829N6920Q3992J16805J32387R2944j2772r2683j40242j13443o1444
17629A23867m2515J7242K5623J0694M3074J3310L0619J14730R3904K6744m1192
17618D16100q9332r5090o0908l9364k5804j8754j8292R866J881j3967j2932J1053
$$ plain form
17706 26560 23767 34377 29246 36359 36661 36122 17543 1950 -3888 8630 13997 12120 24996 52286
17692 52286 58514 40041 37886 32050 7322 14172 17838 1930 -9282 9074 23676 41375 48824
17679 48824 34056 22534 18818 38227 21348 18634 26318 14091 7175 4740 -9026 -5579 30156
17666 30156 33942 8936 -9453 -24488 -18119 8712 14782 -3195 3687 -1374 -11998 -7020 4651
17653 4651 -14210 -22552 -10953 6510 11961 12354 2944 20089 45593 31495 6690 15227 21574
17640 21574 61403 118323 202315 319120 451507 544451 531679 438996 298754 185311 123867
17629 123867 81352 98594 124217 134911 177985 191295 221914 336644 430548 457292 416100
17618 416100 326768 231678 170770 131406 105602 86848 68556 78422 80303 66336 53404 64457
17606F4457R34l1532l0876j079K4405J3692j0323j2601k1233o883O91O088l4072
17593c8332J903L4815K5045J9720n13r203k7181k17K0992j2727j7797n67J9077
17580A5015n346J633J3930N910j2433r347Q5o107l978Q632J5613k170j4854J0690
17566A7273j4367J0837P327P515j1156j6180J9454K739k5200L774K9885J2086
17554D3987J0435j1872j0677J430k7858j5770J8457J6401J1619k614j0413l859
17542A9266q085k3545k5982J5336J7877R019J530n646Q047L963q383L936n644
17529A689J6764N63j0541j5986m684J270Q991n348K80n831J8094p171j3664K1755
17515F181L8848j2631r013j8867o167L8910J3543l133k2211k8647j2963j6979
$$ plain form
17606 64457 65391 33859 2983 1904 26309 40001 29678 17077 -4156 -11039 -10348 -4260 -38332
17593 -38332 -36429 -1614 23431 43151 42638 33435 6254 6037 27029 14302 -3495 -4062 15015
17580 15015 9669 11302 25232 31142 18709 9362 9447 3340 -638 7994 23607 21437 6583 17273
17566 17273 2906 13743 21070 28585 17429 1249 20703 23442 -1758 2016 31901 43987
17554 43987 54422 42550 31873 33303 5445 -10325 8132 24533 36152 33538 23125 19266
17542 19266 11181 -12364 -38346 -23010 -5133 3886 5416 -230 7817 11780 3397 7333 1689
17529 1689 18453 19016 8475 -7511 -12195 -10925 -1934 -7282 -7002 -12833 5261 -1910 -15574 6181
17515 6181 45029 32398 23385 4518 -1649 37261 50804 47671 25460 -3187 -16150 -33129
17503c3129J4191K1630J7573L733l461k2323J2905J3252K0232j6134k9149R611
17491H931N258j7915o069L5929J6111k826q391n079j2552j5601L687K1654N525
17478B8662k119N198k1215j7754l878J609p276M458J8624K4178j4079O508M864
17465B7780o726K0381J1605l887J0644q197J1603j3072k7384j6641J4283q526
17453A1863J0683j0202j2263n159j5706R349K3134J1834M3298M1639P5895J11711
17441B96076K0534p3069r3110k7048m6595l5335k7474k9141J9446J2360J3480
17430C0124J9263k5902M685k81J0884O740J5916J6375k7779k9118j1722K366J4983
17417B6534j4117J156K8544l016Q217K965j1501K0212q906j4467r429k3405k3290
$$ plain form
17503 -33129 -18938 2692 20265 23998 20537 -1786 11119 24371 44603 28469 -680 8931
17491 8931 14189 -3726 -9795 26134 42245 39419 31028 25949 13397 -2204 1483 23137 28662
17478 28662 26543 31741 10526 -7228 -11106 -9497 -16773 -12315 6309 30487 16408 22916 27780
17465 27780 21054 41435 53040 49153 59797 51600 63203 50131 22747 6106 20389 11863
17453 11863 22546 12344 81 -5078 -20784 -11435 11699 23533 66831 108470 184365 296076
17441 296076 316610 243541 150431 123383 76788 41453 13979 -15162 4284 16644 30124
17430 30124 49387 23485 28170 27889 38773 45513 61429 77804 50025 20907 9185 11551 26534
17417 26534 12417 13573 42117 39101 47318 50283 38782 58994 50088 35621 26192 2787 -20503
17404b0503K6379J518K1439j5599j5862Q821j4153N279J0432O919K0257n031j7014
17391A2882J2509J618j2846j9453J4624n954m383K091N664K3341p196r738j4358
17378a199j1579J1371K8373J765o745k3425J901M70n734J982L862m765j3974K686
17364a5011J3031J8125j0070r123k7461M047P052J3032K0353J8252M077j9677
17352A6627j920J1459J1228K3810M198Q307k6498P117M880M231K0316j9789j7643
17339D6323O692K7453r55P507J1148r67J4942l071o650k9713k7415Q3J2265K38
17325E7880J8472K027J1474J0986J5617j9896j9169r073m022j9262R54L770M753
17312E4511k0971P353R68J8924n360k7630j622N778l819j3556R497J6413K2j1067
$$ plain form
17404 -20503 5876 7394 28833 13234 -2628 6193 -7960 -2681 7751 14670 34927 29896 12882
17391 12882 25391 27009 14163 -5290 9334 3380 -1003 1088 6752 30093 22897 13159 -1199
17378 -1199 -12778 -1407 26966 28731 21986 -1439 462 932 -4802 -2820 1042 -3723 -17697 -15011
17364 -15011 -1980 16145 6075 -3048 -30509 -26462 -19410 -6378 13975 32227 36304 16627
17352 16627 14707 26166 37394 61204 65402 73709 47211 54328 59208 63439 83755 63966 46323
17339 46323 53015 80468 79513 87020 98168 97201 112143 109072 102422 72709 45294 45377 57642 57880
17325 57880 76352 78379 89853 100839 116456 96560 77391 68318 64296 45034 45988 49758 54511
17312 54511 33540 40893 41861 60785 55425 27795 26173 31951 28132 14576 24073 40486 40508 29441
17298B9441l309k2796n081J1843J9308Q991J3643j0914j9064l895K4545N488j7924
17285C0276m133j1464J2257N25K2294K4435P100J2554k1453m64M741q526j1100
17272E7042j5653j5420j0182j0719j4304K2017J6582J3254j5982j8887n219k0700
17260a8171L5948K3909n120j2648L507L958j3569M397K0157j353k7812q465l679
17247A059Q442Q083L9536J3003j215k4774j6975l1869j822L676J3505k321j995
17234F333l88o327N443K4262l7k2040N804n007P348k4037l942m275j4063K7864
17220c062N7628M7946j4855J842R242J6122O980o896J5160J1056J9768j1236l2841
17207A16854k7936j5859m252j3486J8895K4344J699o633K3503K7144o500n64j2106
$$ plain form
17298 29441 26132 3336 -1745 10098 29406 38397 52040 41126 22062 18167 42712 48200 30276
17285 30276 26143 14679 26936 27461 49755 74190 81290 93844 72391 71927 76668 68142 57042
17272 57042 41389 25969 15787 5068 -9236 12781 29363 42617 26635 7748 2529 -18171
17260 -18171 17777 41686 36566 23918 27425 31383 17814 22211 42368 41015 13203 4738 1059
17247 1059 9501 17584 57120 70123 68908 44134 27159 -4710 -6532 -2856 10649 8328 6333
17234 6333 5945 -382 5061 29323 29286 7246 13050 8043 15391 -8646 -12588 -16863 -30926 -3062
17220 -3062 54566 102512 87657 89499 98741 114863 121843 114947 130107 141163 160931 149695 116854
17207 116854 88918 73059 68807 55321 74216 98560 100259 93626 117129 144273 137773 137209 125103
17194A25103O689l7428m1232j2160M512L0195J9009j543J500L799j2964R71o343
17181H0108j3156l3006N655J1849m69J2470J5276m446p07M584k0354J6091M1398
17168A15293O004j5369R352Q235j0158m061L985j658p142j1320J7642R308J5401
17155A35512R927q326L739j2927M834L778M804L375n236L2161P160l949Q792L1969
17141B15613K0409O981L077q849J41J7583J2204k7313k8951j1141p093K8025L2747
17128B53433J5496Q134J4223K1067J4576M2627L3188J9939J6443M2595K8579L7489
17116E47789L0381M8888N4578O1091M7448O0641J13216J58204J75325J49747K9967
17105A477275k2928M0218R4609J38138J42485J54475K00815L11358M18906M43856
$$ plain form
17194 125103 131792 94364 53132 40972 45484 75679 94688 93145 94645 98444 85480 86451 80108
17181 80108 66952 33946 39601 51450 50981 63451 78727 74281 73574 78158 57804 73895 115293
17168 115293 121297 105928 115280 123515 113357 109296 113281 111623 104481 93161 110803 120111 135512
17155 135512 145439 137113 140852 127925 132759 136537 141341 144716 139480 171641 178801 174852 183644 215613
17141 215613 236022 243003 246080 237231 237372 254955 267159 239846 210895 199754 192661 220686 253433
17128 253433 268929 277063 291286 312353 326929 369556 402744 422683 439126 481721 510300 547789
17116 547789 578170 627058 681636 742727 790175 850816 964032 1122236 1297561 1447308 1477275
17105 1477275 1454347 1494565 1589174 1727312 1869797 2024272 2225087 2536445 2955351 3399207
17095C399207L70997L97277N15397O58333Q98298J306101K017915L132381N088704
17086A7784610Q532571J4619202K3202474K7720524J2744231j4067557k6311515
17079F4224540k0949283j2432334o937060l684283j491357K99318K203152M955527
17071B6188220R644398J6956138K5050751K2458722m71080k2597297k5473692
17064E1756160j7252111j0178511o178139l959152k613220j773342j215242p43041
17056G843402k45769K01668J99752m40967j007815j014181p88495n45700l33433
17047C868462k47396k45515k50528j54716J9499K49773N70072P03071K02899o13574
17037D102047r33028p53161m29800k02570p4814p6516j44794k19457j84506j20299
$$ plain form
17095 3399207 3770204 4167481 4682878 5341211 6239509 7545610 9563525 12695906 17784610
17086 17784610 26317181 40936383 64138857 91859381 104603612 90536055 64224540
17079 64224540 43275257 30842923 23905863 20221580 18730223 19029541 21232693 26188220
17071 26188220 35832618 52788756 77839507 100298229 99827149 77229852 51756160
17064 51756160 34504049 24325538 18147399 14188247 11575027 9801685 8586443 7843402
17056 7843402 7597633 7799301 7999053 7558086 6550271 5536090 4747595 4201895 3868462
17047 3868462 3621066 3375551 3125023 2970307 2989806 3239579 3809651 4512722 4715621 4102047
17037 4102047 3169019 2415858 1986058 1783488 1708674 1632158 1487364 1267907 1083401 963102
17027I63102q9948o5974n3910n1386m0756k4688k0153l3530m8911j8231j2715
17016E02900l0506j7813j0980k737j4311j2394l1071k6246j9156j8984j8108j084
17004B99510J4459K8824O473J0040L7811j753j3717m4127m5426p210J49J3654
16992B98687k8843j9257k1202K1864M7037M1056K2317J8181L3438J7860L5539
16981D66677O5542J13311J88373L41243N44912P81543O50955m5998o64306o87304
16971A754948m48237k64900j68954q6672k8740K3738J28896K35471L85775O27929
16961B159254P40436K91732m46122p30238n79125m16557k85814j98693p9646l9144
16951D16083m1996l3176m8170n128L645l305J2354J3384m616m2395o7235m0922
$$ plain form
17027 963102 873154 807180 753270 701884 661128 636440 616287 582757 533846 515615 502900
17016 502900 472394 454581 443601 440864 426553 414159 383088 356842 337686 318702 300594 299510
17004 299510 313969 342793 349266 359306 397117 395364 381647 337520 292094 284884 285033 298687
16992 298687 269844 250587 229385 251249 298286 339342 361659 379840 413278 431138 466677
16981 466677 532219 645530 833903 1175146 1720058 2501601 3152556 3106558 2442252 1754948
16971 1754948 1306711 1041811 872857 786185 757445 781183 910079 1145550 1531325 2159254
16961 2159254 2899690 3191422 2745300 2015062 1435937 1019380 733566 534873 455227 416083
16951 416083 374087 340911 292741 287613 291258 287953 300307 313691 309075 266680 199445 158523
16939A58523k6033O530k5351k9255j4051q173K3832L4298j776j4685J2380J9112
16927A35351J592J6321q043j9047j6077j9342k4886r867K764R026J4635K8979
16915A11406j557k795L954L711j6699j0966l050P656l895M92n585p919J2404J5827
16901A02984J9421j059j275L434q265j3756K375k7289l3915q290K5868m592j7823
16888C7818N426J0369p258k3201J0638J0939Q82J2422J5099J7083j527q230m0260
16875D0200j3201q395m843J6376j0778L060K7593M107q115K5016J2358k8223o301
16862D8854k5926L190r825m31N216l056j343m886r516r269J4983l687K6682J5000
16848D5986m771k5216q300K7989j3835M242o268O345N318P477K797j8040L57J0842
$$ plain form
16939 158523 132490 139020 113669 84414 70363 62190 86022 120320 118544 103859 116239 135351
16927 135351 136943 153264 145221 126174 110097 90755 65869 56002 58766 67792 82427 111406
16915 111406 109849 107054 111008 114719 98020 87054 84004 91660 87765 88257 82672 74753 87157 102984
16901 102984 122405 121346 120071 123505 115240 101484 103859 76570 42655 34365 60233 55641 37818
16888 37818 43244 53613 46355 23154 33792 44731 45613 58035 73134 90217 88690 80460 40200
16875 40200 26999 18604 13761 30137 19359 22419 50012 54119 46004 71020 83378 55155 48854
16862 48854 22928 26118 16293 15862 21078 18022 16679 11793 2277 -6992 7991 4304 30986 45986
16848 45986 41215 15999 7699 35688 21853 26095 19827 26172 31490 38967 41764 23724 24081 34923
16834C4923j9583N449J7735k5233J1009J9230j3126M985J0991J6873J7079L22
16822H0654q147l4062j6213l640Q310K0136j376O079L633n104j1121j5417K96
16809B4028m518J0479r57n892N086k490j8958p893J4615N031k430j7380j0952
16796a2231J2098J8150J0558p919L822m784l671J3168J1915j5569j8755L4479
16784D1261J1400N055L6r079j2965j1819j7642j4522j4072L0635K4348j0874J7470
16771C9232J3973o458j9161q020J8119o547k4623o271n211J640J348j2794J7877
16758C104L8542j9405k0164N328q599J3528K9224K6070k267k3541n330j2361n463
16745A8666Q549L2301K5572K563j3541k0118j5304k2120j192L9954L2472k021
$$ plain form
16834 34923 15340 20789 38524 13291 24300 43530 30404 35389 46380 63253 80332 80654
16822 80654 72507 38445 22232 18592 26902 47038 45662 51741 55374 50270 39149 23732 24028
16809 24028 19510 29989 29032 23140 28226 25736 6778 -1115 13500 18531 16101 -1279 -12231
16796 -12231 -133 18017 28575 20656 24478 19694 16023 29191 41106 25537 6782 41261
16784 41261 52661 57716 57752 48673 35708 23889 6247 -8275 -22347 8288 32636 21762 39232
16771 39232 53205 46747 27586 19566 37685 31138 6515 244 -4967 -3327 -1979 -14773 3104
16758 3104 41646 22241 2077 7405 -1194 12334 41558 67628 65361 41820 36490 24129 18666
16745 18666 27215 59516 85088 87651 74110 53992 38688 16568 15376 55330 87802 85781
16733H5781L861j244j8545L1658K3822J3827J4343p905n693K0503J489q055J8268
16720A72110M2851M3425N7625R0470J53449K19237L80032O54310P98521M15509
16710C027539l11830o88442o12954l88551k07412p2611L7805J55206L17720N55292
16700A811762P26276M94049k42753p31609o78397m27068k53589j68139j05324
16691D25208p3799o4550m9256j6111j4264j4551j5329j7519j2725j875p611j4723
16679A22895k1421J5231j0599j5853k9763J039J039J0848J5741j0627k2785p364
16667D8381K056K604k7981J809l788J1322L0708l245Q304K4027j6004k3371o061
16654D8761m564K723M0515Q289n912k2597j7031N395o741j2980k6999M141K0460
$$ plain form
16733 85781 89642 88398 69853 101511 125333 139160 153503 145598 139905 160408 161897 153842 172110
16720 172110 214961 258386 316011 406481 559930 779167 1159199 1813509 2612030 3027539
16710 3027539 2715709 2027267 1414313 1025762 818350 745739 783544 938750 1256470 1811762
16700 1811762 2538038 3032087 2789334 2057725 1379328 952260 698671 530532 425208
16691 425208 351409 286859 237603 221492 207228 192677 177348 159829 147104 145229 137618 122895
16679 122895 101474 116705 106106 90253 60490 61529 62568 73416 89157 78530 55745 48381
16667 48381 50437 53041 25060 26869 23081 34403 65111 61866 70170 94197 78193 54822 48761
16654 48761 44197 46920 87435 95724 89812 67215 50184 55579 48838 35858 8859 13000 33460
16641C3460K0156K7816J3306P466j0687l2644j2898M384n424k1255K3259j6684
16629C0255j7385j9269j7095J0784K5370q55J6278j126P92p988p296K6447Q954
16616D7866J1854J4946M6717P5234R0611P5683L1685q1017r6611q2783j0970j5817
16604A07398J4036M8131N4419M1647O3827N9361J7509o4061p6739p0689n1953
16593A42886n0715k0079j9825j992m707k3002j459j8605J376J4279q740R263J3130
16580C1810J5634J2162J1075j421r868k8893k2821l522J0300n670K609j348k8184
16567a8137k475o978L523K7723K7030L788j5051L189p744R829J7117k573k1359
16554A7882j292J5523k08L521k2031j4071j668K0904Q063j7715R045J0195p516
$$ plain form
16641 33460 53616 81432 94738 102204 91517 58873 45975 50359 44935 23680 46939 30255
16629 30255 12870 -6399 -23494 -12710 12660 11805 28083 26957 27749 19761 12465 38912 47866
16616 47866 59720 74666 121383 196617 287228 362911 394596 313579 216968 134185 123215 107398
16604 107398 121434 169565 223984 265631 329458 388819 406328 342267 265528 194839 142886
16593 142886 92171 72092 52267 50275 45568 22566 21107 2502 3878 18157 9417 18680 31810
16580 31810 47444 59606 70681 69260 59392 30499 7678 4156 14456 8786 11395 10047 -18137
16567 -18137 -20612 -27590 -24067 3656 30686 34474 19423 22612 14868 24697 41814 39241 17882
16554 17882 16590 32113 31905 35426 13395 -676 -2344 18560 26623 8908 17953 28148 20632
16541B0632k8262L314J0868J2185L291P392j980N512K1783J329J42J891J7630
16528G5727J9611N3251Q5820J03517J23962M4953p0863j18898n9694m6871n6583
16517A53932k8698k8071j7234K9275K2582N6779Q4982J28138R7698k1738r8514
16506C79131j07516o7735m7141o4995l7609j1293Q073j247j0577j0015J2495R088
16494E0659l755K4658P889j9249M452j8076k6385k2749j7142L936K9435n053j4210
16481e590J3605m685p893J6760P383P381J4365j5390j059k486j6055l622p54j0474
16467h514J7183N629l2472j2718K4563Q668j2499Q95j67k5332j7031K7127K2124
16454b544j2079j2214j7341M580K6622Q243j4056K135l6495j9940K6949K4368
$$ plain form
16541 20632 -7630 -4316 6552 18737 22028 29420 27440 32952 54735 56064 56206 58097 75727
16528 75727 95338 148589 234409 337926 461888 506841 435978 317080 257386 210515 153932
16517 153932 125234 97163 79929 109204 131786 188565 273547 401685 499383 477645 379131
16506 379131 271615 203880 156739 91744 54135 42842 50915 49668 39091 29076 41571 50659
16494 50659 46904 71562 79451 60202 64654 46578 20193 -2556 -19698 -15762 13673 8620 -5590
16481 -5590 8015 3330 -4563 12197 19580 26961 41326 25936 24877 22391 6336 2714 1960 -8514
16467 -8514 8669 14298 -18174 -30892 -6329 2339 -10160 -9265 -9432 -34764 -51795 -24668 -2544
16454 -2544 -14623 -26837 -44178 -39598 -12976 -4733 -18789 -16654 -53149 -73089 -46140 -21772
16442b1772P057R295L293p406M238J001m833j0749o392P567K246j2383j2669K1986
16428a9521k825j5093o02K9873K85j2732j4534J9776J8780J6058j1069K0175j2400
16415A6171k2840k2676p034J0383p271J2815K799K0455R568j8327j6277N903K170
16402a4161Q845O630j5118o56J957q081P372n645j2388o438J872K206r96L385
16388c1216p989j3041L9J9445M05K2834J6000j3363j5616j7805M928J0234R715
16375a5430L1058j016J6789J4975O187l3307j8239J36j598O988N880j4149j7109
16362a8835j926J0929k163K0686n800k6221K829k2465j3459J8460n88Q200L951
16349b6402M133M0278K909j8561j5073j1937j2001m24J6958J8619M21j0154j5079
$$ plain form
16442 -21772 -14715 -5420 -2127 -9533 -5295 -4294 -9127 -19876 -26268 -18701 -16455 -28838 -41507 -19521
16428 -19521 -22346 -37439 -38041 -8168 -7883 -20615 -35149 -15373 3407 19465 8396 28571 16171
16415 16171 -6669 -29345 -36379 -25996 -33267 -20452 -17653 2802 12370 -5957 -22234 -16331 -14161
16402 -14161 -5316 1314 -13804 -14460 -12503 -20584 -13212 -18857 -31245 -37683 -35811 -33605 -34601 -31216
16388 -31216 -39205 -52246 -52207 -32762 -32357 -9523 6477 -6886 -22502 -40307 -35379 -25145 -15430
16375 -15430 15628 14612 31401 46376 52563 19256 1017 1153 -445 6543 12423 -1726 -18835
16362 -18835 -20761 -9832 -11995 8691 2891 -23330 -20501 -42966 -56425 -37965 -38553 -30353 -26402
16349 -26402 -22269 18009 20918 2357 -12716 -24653 -36654 -37078 -20120 -1501 -1080 -11234 -26313
16336b6313j1226K6033J3637j6852l2150K0559K6691J4841j600l77m406j1374
16324b537J959q072o959R788J958k0054j7700J4786J7952n335j4961J0855q676
16311b6996k0811J5231J3356j103K3530O607l441l4533J1021J4756m8l450j8334
16298b4215L1972L8512P643j7956j3064j5728j846J9131N892J9621Q544k0620
16286C7886m9246k0088J356R486j7544j4102J4239L0860J9312M504r272l8567
16274c1176K342R716J270r052j4408M217L0999K000L829M886Q910o87K2794m193
16260C1447l3032M529k1503m997K7529K8633k7474m041J852M642j6531l906N193
16247g659L78J05N826Q893m275p443j643K2535K677o422j8639K4702L2400p463
$$ plain form
16336 -26313 -37539 -11506 2131 -14721 -46871 -26312 379 15220 13620 13243 8837 -2537
16324 -2537 -578 -8650 -15609 -5821 -3863 -23917 -41617 -26831 -8879 -14214 -29175 -18320 -26996
16311 -26996 -47807 -32576 -19220 -20323 3207 9814 6373 -28160 -17139 -2383 -2431 -5881 -24215
16298 -24215 7757 46269 53912 35956 22892 7164 5318 24449 30341 49962 58506 37886
16286 37886 -11360 -31448 -30092 -20606 -38150 -52252 -38013 -7153 12159 16663 7391 -31176
16274 -31176 -28834 -19118 -17848 -26900 -41308 -37091 -6092 -4092 -263 4623 13533 12846 35640 31447
16260 31447 -1585 2944 -18559 -23556 3973 32606 5132 1091 2943 7585 -8946 -12852 -7659
16247 -7659 -7281 -7176 -1350 7543 3268 -4175 -5818 16717 19394 12972 -5667 19035 51435 43972
16233D3972j778l886j4284k1245j3117m066j4750k1460N560K1787J3927r373j3101
16220c1814K0351K1610J716P95R170K1118j4852j8847J8702J422j6889J946o454
16207G974P461J105N312Q122N071J253r718k6975j7696l995j7464K4351P495J228
16193f476p194R053m809l15J2030n004j3081K928J3417j5586J3764L814n467k9752
16179c2678p949K0115K577n17O69Q060J318j2914q576k966m465K3315L920j3479
16165b3570j4471J6347L1389J481j6726k7909J8792J6552j0957k4599j3314n135
16153e2120J8771J7441J2894P989m814q997j1052J4337j8504j8300J8796R949
16141a3610J2233j873J3362J2008N724j1159q66k3474j6816J3838J973l2184L469
$$ plain form
16233 43972 42194 38308 24024 2779 -10338 -14404 -29154 -50614 -45054 -23267 -9340 -18713 -31814
16220 -31814 -11463 10147 11863 12658 21828 42946 28094 9247 27949 29371 12482 14428 7974
16207 7974 15435 16540 21852 29974 35045 36298 26580 -395 -18091 -22086 -39550 -15199 -7704 -6476
16193 -6476 -13670 -4617 -9426 -9741 2289 -2715 -15796 -12868 549 -15037 -1273 2541 -2926 -32678
16179 -32678 -40627 -20512 -17935 -18452 -17783 -9723 -8405 -21319 -29895 -32861 -37326 -14011 -10091 -23570
16165 -23570 -38041 -21694 9695 11176 -5550 -33459 -14667 1885 -9072 -33671 -46985 -52120
16153 -52120 -33349 -15908 -3014 4975 161 -8836 -19888 -5551 -24055 -42355 -23559 -13610
16141 -13610 -1377 -3250 10112 22120 27844 16685 15819 -7655 -24471 -10633 -8660 -40844 -37375
16128c7375M1182M939p456j2107p744M309J3639P63M210n280R413r60R049J9683
16114C6265J6651j1206j310j0210k7304k2652J1419N799P35k394k4239O975J8367
16101c104j811J4191j9255M423J8584q835k7037N945k941O279j3460K911J4690
16088i420O237J3658K0527l712r961m303j8322k3572R039J2750j0238l873M483
16075a6707n52O621J6247J4790O965k6894n984N359j6476j5270K6604O599O00
16062A902j7943j4114L4045K0350n324j1902j8248l1961k44p177L6423K816j7730
16049b9107j0048p758K5729K5385M028R517L430l917O812k825j9272R6M625O493
16035A3188k2075j7982K343p77J0033L586r600r567J4143K4224J5156j033j7761
$$ plain form
16128 -37375 3807 8746 1290 -10817 -18561 -14252 -613 150 4360 -920 8493 7533 16582 36265
16114 36265 52916 41710 40400 30190 2886 -19766 -8347 -2548 -1813 -4207 -28446 -21471 -3104
16101 -3104 -4915 9276 -9979 -5556 13028 4193 -22844 -16899 -19840 -13561 -27021 -24110 -9420
16088 -9420 -3183 10475 31002 27290 17329 13026 -5296 -28868 -19829 -7079 -17317 -21190 -16707
16075 -16707 -17259 -10638 5609 20399 27364 470 -5514 -155 -16631 -31901 -5297 1302 1902
16062 1902 -16041 -30155 3890 24240 18916 7014 -11234 -43195 -43439 -50616 -14193 -11377 -29107
16049 -29107 -39155 -46913 -21184 4201 8229 17746 21176 17259 24071 21246 1974 2070 6695 13188
16035 13188 -8887 -26869 -24526 -25303 -15270 -11684 -21284 -30851 -16708 7516 22672 21639 3878
16022C878n329m687R820N142M008J4912l16j4503k126o59j0022m998M052K0496
16008A9668P490l2111l2737J4094K25J2088N410L922J3390k039l1524j6555P35
15995c7944K9127P411j4643J904j1391J5721J9533j8748q484p478l19J3829J566
15982i916O062K058O334p252P30l292k645K87l761J7468J924k7497k8911K1718
15968b6693Q28L809p52j2864R50m600l731j0002J8062K0236j3612L385j323P91
15954b5516J6239o5j8076P871J6455L6349J99j8250K976j3346Q720Q990k0640
15941A906p55k6479p434J8590J2279K294j9725p296j3746J7613J585J2655R080
15928E67k5603j5847L627R133J2413J818j8305O146Q831O475j0885J2789J5282
$$ plain form
16022 3878 -1451 -6138 3682 8824 12832 27744 27428 12925 10799 10140 118 -4880 -828 19668
16008 19668 27158 -4953 -37690 -23596 -23371 -11283 -5873 -1951 11439 9400 -22124 -38679 -37944
15995 -37944 -8817 -1406 -16049 -14145 -25536 -9815 9718 -9030 -17514 -24992 -25311 -11482 -9916
15982 -9916 -3854 -1796 4538 -2714 -1984 -5276 -7921 -7634 -11395 6073 7997 -19500 -48411 -26693
15968 -26693 -25865 -22056 -22808 -35672 -34722 -39322 -43053 -53055 -34993 -14757 -28369 -24984 -26307 -25516
15954 -25516 -9277 -9342 -27418 -19547 -3092 33257 33456 15206 18182 4836 13556 22546 1906
15941 1906 1151 -25328 -32762 -14172 -1893 401 -19324 -26620 -40366 -22753 -21168 -8513 567
15928 567 -25036 -40883 -37256 -28123 -15710 -13892 -32197 -26051 -17220 -10745 -21630 -8841 6441
15915F441M157m340K8357N757j5759J994J699j5746J0766p931Q903J9035j570
15902D1763j5715k9961k3871R51j871N273J2983K1785K4949n329j2938L865l558
15889A8326l0774j8796P017J5883j7981j3807J9364K7806o556k659J1369n325
15877C867L248j206j2787n606m03K0280k644j5352l583j47L0016m472L230j0217
15863D224J8436l637j5946L61j018o113R802L227J3479O682N46k4402k2273J2945
15849c687j5832k350J576J1090R210j7903J3461M474r099j2558J609j1872J6091
15836a5790K3105j3332p350J855K3512K5328j6899k9009K5604Q099q096j5360
15824A667k0205k3080J8751J7644J8043N750m517K395j6590j9400J5824J1795
$$ plain form
15915 6441 10598 6258 34615 40372 24613 26607 28306 12560 23326 15395 24298 43333 41763
15902 41763 26048 -3913 -27784 -26833 -28704 -23431 -10448 11337 36286 30957 18019 21884 18326
15889 18326 -12448 -31244 -24227 -8344 -26325 -40132 -20768 7038 482 -2177 9192 3867
15877 3867 7115 5909 -6878 -12484 -12887 7393 4749 -10603 -14186 -14333 15683 11211 14441 4224
15863 4224 22660 19023 3077 3438 2420 -3693 6109 9336 22815 29497 30043 5641 -16632 -3687
15849 -3687 -19519 -21869 -20293 -9203 7 -17896 -4435 39 -9060 -21618 -20009 -31881 -15790
15836 -15790 7315 -6017 -13367 -11512 12000 37328 20429 -8580 17024 25123 17027 1667
15824 1667 -18538 -41618 -22867 -5223 12820 18570 14053 16448 -142 -19542 -3718 8077
15812H077j5167n033J6826J7118j4965K433n565j7922q732J5203J233J3849k656
15799D699j752j4729j1062L6201N449J4517P468n599l4713p207J7135j7262l1951
15786c8806K3233K3921N701o37q683k0131k8033j0642P503K5694O106Q056J276
15773e442p704j4216M44K0074K5832m064q466l987K3936J3578k5793k2728k4748
15760c3284l0945M2365J8976j732R816j5928K454J1060R560J0690l009o890K753
15747A5886o421J508j2498j4922j2250R37K9J0976K792L087p622k992P352J9919
15733E781j0368J10N024J5147j2789L066J0890j7143J1280m561n772j8943M685
15720a3593Q963K866O302k6206K3471N562p95J5633q933j0851j3962j9719j1064
$$ plain form
15812 8077 -7090 -12123 4703 21821 6856 9289 3724 -14198 -22930 -7727 -6494 7355 4699
15799 4699 2947 -11782 -22844 13357 18806 33323 40791 35192 479 -6728 10407 -6855 -38806
15786 -38806 -15573 8348 14049 13412 4729 -15402 -43435 -54077 -46574 -20880 -14774 -6718 -5442
15773 -5442 -13146 -27362 -26918 -6844 18988 14924 6458 2471 26407 39985 14192 -8536 -33284
15760 -33284 -64229 -21864 -2888 -4620 5196 -10732 -8278 2782 12342 23032 20023 13133 15886
15747 15886 9465 10973 -1525 -16447 -28697 -27760 -27731 -16755 -13963 -10876 -18498 -21490 -14138 5781
15733 5781 -4587 -4477 547 15694 2905 5971 16861 -282 10998 6437 665 -18278 -13593
15720 -13593 -4630 -1764 4538 -21668 1803 7365 6570 22203 13270 2419 -11543 -31262 -42326
15707d2326p456J0198J904j9761p996R423j278JJ2283J3477K2050J2753j2692
15694i420o067N041J2285l577l4485l0408R830K6442J3112k4078o447J6800O441
15681b4531j0398J6845R606J942K579J8189R98j0035j0776j638o939l664N374
15668a2448o334M710J3942j264n194L963k276q244K69M157j621j6759r804J8772
15654a8131n702J5995l192j0199J0969Q993k7453J483J9201M138j6779j2482p704
15641d0863K538M141K5093K0136k368p459O758l061j4575q706q561N516K9760
15628H349q070K079k8141j741J4798j566j5891N531J0855J5942O649m8114m4323
15615h3643K1811J3027J6193L3287O613j3560p941N799K453k386J0791J4019j9739
$$ plain form
15707 -42326 -49782 -39584 -37680 -57441 -65437 -56014 -57292 -57291 -45008 -31531 -9481 3272 -9420
15694 -9420 -15487 -10446 1839 -1738 -36223 -66631 -56801 -30359 -17247 -41325 -47772 -30972 -24531
15681 -24531 -34929 -18084 -8478 -6536 -3957 14232 15230 5195 -5581 -7219 -14158 -17822 -12448
15668 -12448 -18782 -14072 -130 -1394 -6588 -2625 -4901 -13145 -12876 -8719 -10340 -27099 -36903 -18131
15654 -18131 -23833 -7838 -11030 -21229 -10260 -1267 -28720 -27237 -8036 -3898 -20677 -33159 -40863
15641 -40863 -38325 -34184 -9091 11045 8677 1218 7976 4915 -9660 -18366 -26927 -21411 8349
15628 8349 279 2358 -25783 -27524 -12726 -14292 -30183 -24652 -13797 2145 8794 -39320 -83643
15615 -83643 -61832 -48805 -32612 675 7288 -6272 -14213 -8414 -5961 -8347 2444 16463 -3276
15602c276n110j0196J3516M889N027J0524p07j6686j4247m316j0446J9846r874
15589b1056l0749p19K3083J7270O915J3700o393j4890p651Q365Q94Q127M024m948
15575d028k3876k4727q326J8081J0417l0K7884M277j0520N798N834o757j5924
15562b1897O379k767o536O407L30J4811k529o138n898K2383J1414J5531j4022
15549A7468l4748j5861K1340J2136J7225J9482k103j1257j7905K279j1148J5374
15537A2282J2500p59n183j126k5013l3631J4438K3959l382k4320j5413j2200K4571
15524c3277K2262r78J5478j2640k3578N874K465Q562J168L147j0516j0074J1858
15511b0249J5139K5973j0775j0104o791K695j3784j7529M043N519K3690K9944
$$ plain form
15602 -3276 -8386 -18582 -5066 -177 4850 15374 14667 -2019 -16266 -20582 -31028 -11182 -21056
15589 -21056 -51805 -52524 -29441 -12171 -5256 8444 2051 -12839 -20490 -12125 -11231 -3104 920 -4028
15575 -4028 -27904 -52631 -60957 -42876 -32459 -32489 -4605 -328 -10848 -5050 784 -5973 -21897
15562 -21897 -15518 -18285 -24821 -18414 -18084 -3273 -5802 -11940 -17838 4545 15959 31490 17468
15549 17468 -17280 -33141 -11801 335 17560 37042 34939 23682 5777 8056 -3092 12282
15537 12282 24782 24023 18840 17714 -7299 -40930 -26492 -2533 -5915 -30235 -45648 -57848 -33277
15524 -33277 -11015 -11993 3485 -9155 -32733 -26859 -24394 -15832 -14664 -11517 -22033 -32107 -20249
15511 -20249 -5110 20863 10088 -16 -6807 -4112 -17896 -35425 -31382 -25863 -2173 27771
15499B7771j5832j3686k7261k9933J3570m45K2145J1969J4815K4142M747k2773
15487I229j6511L72J0482m688j2511j2405R296J1518r547Q705K4284o468o954
15474D802J1780j9283m394j3728j8248O683K8853k989J2897k2073n466L897K2043
15461D774l016j0829L374L3327J715j7145J4698j653k7603j8769J3000j8500l1093
15448e7720k5963L0472N076J7356K3257r922k411r277j2069n642P043L70K868
15435c6562P236J511L7548J1657M201N435j1184r176k4833k7718L891K2072n700
15422b1622J4060J9118j987j6143m191j427P771L884j2786K888j0530p004J8218
15409i751J0255p372K086J8466K2801k6711m5179j4202P305O009J81J0806P978
$$ plain form
15499 27771 11939 -1747 -29008 -58941 -45371 -45816 -23671 -11702 3113 27255 32002 9229
15487 9229 -7282 -6910 3572 -1116 -13627 -26032 -16736 -5218 -14765 -6060 18224 11756 4802
15474 4802 16582 -2701 -7095 -20823 -39071 -32388 -3535 -6524 6373 -15700 -21166 -17269 4774
15461 4774 1758 -9071 -5697 27630 29345 12200 26898 25245 -2358 -21127 -8127 -26627 -57720
15448 -57720 -83683 -53211 -48135 -30779 -7522 -17444 -19855 -29132 -41201 -46843 -39800 -39430 -36562
15435 -36562 -29326 -27815 9733 21390 25591 31026 19842 10666 -14167 -41885 -37994 -15922 -21622
15422 -21622 -7562 11556 9569 -6574 -10765 -12192 -4421 -537 -13323 -10435 -20965 -27969 -9751
15409 -9751 504 -6868 -4782 13684 36485 9774 -35405 -49607 -42302 -36293 -36112 -25306 -17328
15396a7328L198j2209M590K4150O242j5577l3639j1099M405J1452J5056q046N72
15383b8233O869k0301l156O421O276k858J7253J75j7024k4909K973J5120L1207
15370a0187J6016m937j463N734o613j0078q620k035k293r414J6343K006j283j0654
15356b7478j213Q64j8501J1702q115k731M438k211J1113J116k20p059j6267P407
15342d7155j119k583j058K425K6183J6587r984J060O186k5203j3510P244K7587
15329a3340J9173p228J2929j569l384o144l1667j4074K973R697n162J5742P559
15316a4495j1401q949p194p101O600J3414p061j2387j2844p971K5921K7920J4285
15303a263k491j704o956P009J5382K6201j8127j5328q174J1750P267k6217k3117
$$ plain form
15396 -17328 -14130 -26339 -21749 2401 8643 -6934 -40573 -51672 -47267 -35815 -20759 -28805 -28233
15383 -28233 -21364 -41665 -44821 -38400 -32124 -34982 -17729 -17554 -34578 -59487 -56514 -41394 -10187
15370 -10187 5829 892 -571 5163 -1450 -11528 -20148 -22183 -24476 -33890 -17547 -15541 -16824 -27478
15356 -27478 -28691 -27827 -46328 -34626 -42741 -45472 -41034 -43245 -32132 -31016 -31236 -38295 -54562 -47155
15342 -47155 -48274 -50857 -51915 -49490 -23307 -6720 -16704 -15644 -9458 -34661 -48171 -40927 -13340
15329 -13340 5833 -1395 11534 9965 6581 437 -31230 -45304 -42331 -32634 -37796 -22054 -14495
15316 -14495 -25896 -34845 -42039 -49140 -42540 -29126 -36187 -48574 -61418 -69389 -43468 -15548 -1263
15303 -1263 -3754 -5458 -12414 -5405 9977 36178 18051 2723 -5451 6299 13566 -12651 -35768
15290c5768K056J3476L929J0738P493J8666J0305k0876J2231j6356J9117J0371
15278C5382k5623j8326k997j4738r317P987l3414p145J9332J4201n451J5112j6858
15265d1855r924M6480K2390L835m342l4573r050l298K3675M233j5447j9525K0231
15252a7170J1519R531n076j3199m196R32J8435J8048j2387j8710j2188k1557q778
15239e4796Q472q43J2845R755L3798J7696m70k2804k1376J5100j0325R475L237
15226b36l631M912k1024n92M766j6566k3446M520L8068J4726k6221k2680j0527
15213e7931L1853J7538l286K1580O906M226j2344K3j2347K7786j2435k5499k0791
15200c4721j2357l40M481P596q41m746j0802O242j0627L246K1202J5697k0696
$$ plain form
15290 -35768 -33712 -20236 -16307 -5569 1924 20590 30895 10019 22250 5894 25011 35382
15278 35382 9759 -8567 -11564 -26302 -35619 -27632 -61046 -68191 -48859 -34658 -40109 -24997 -41855
15265 -41855 -51779 -5299 17091 20926 16584 -17989 -27039 -30337 -6662 -2429 -17876 -37401 -17170
15252 -17170 -5651 3880 -1196 -14395 -18591 -17659 776 18824 6437 -12273 -24461 -46018 -54796
15239 -54796 -46324 -47167 -34322 -24567 9231 26927 26457 3653 -17723 -2623 -12948 -3473 -236
15226 -236 -3867 1045 -19979 -20571 -15805 -32371 -55817 -51297 -13229 1497 -24724 -47404 -57931
15213 -57931 -26078 -8540 -11826 9754 16660 20886 8542 8565 -3782 24004 11569 -13930 -34721
15200 -34721 -47078 -47418 -42937 -35341 -36182 -40928 -51730 -45488 -56115 -52869 -31667 -15970 -36666
15187c6666J87J2337J9436J7520o220j3384k2300J2678M727O856p244m419J19
15174a6373N819O233K5977M889q065q861j5515l755J0135m021r609k190l5668
15161e1004J0351L2837J0997q775O152k9173j7396j2028R600K0526J8131q95K7049
15148A6372J4647j4853k0331J5250p882j2470j3166J164K5909J5710k9132o571
15136a5353k73o095K135k256J0748L061J9951K3482k1396q014J4298n539j8891
15123d142l5486n49J4090J5943q602J6426J2612O167J3502j0971p875j2966O21
15110a230m074Q72M591K362L505j5582L253P966j4055J2934L151M937j4295j6132
15096b1797j686J2193q43j1568K480Q235o320j467J6304P482m176o934n643N04
$$ plain form
15187 -36666 -36479 -24142 -4706 12814 6594 -6790 -29090 -16412 -11685 -4829 -12073 -16492 -16373
15174 -16373 -10554 -4321 21656 26545 18480 9619 -5896 -9651 484 -3537 -13146 -15336 -51004
15161 -51004 -40653 -7816 3181 -5594 558 -28615 -46011 -58039 -48439 -27913 -9782 -10677 16372
15148 16372 31019 16166 -4165 11085 3203 -9267 -22433 -21269 4640 20350 -8782 -15353
15136 -15353 -15626 -21721 -19586 -21842 -11094 -8033 11918 35400 14004 5990 20288 14749 -4142
15123 -4142 -39628 -40177 -26087 -10144 -18746 -2320 10292 16459 29961 18990 11115 -1851 -1230
15110 -1230 -5304 -4432 159 2521 6026 -9556 -6303 1663 -12392 542 3693 8630 -5665 -21797
15096 -21797 -23483 -11290 -12133 -23701 -21221 -12986 -19306 -20773 -4469 3013 -1163 -8097 -13740 -13236
15082a3236R496R913J1170q784j4682J3849R587k0519J0590r051j5993J0983k280
15069h957K152L5878j8577k9669r698p495M939L7232K1263q431q599j1314k3492
15056b4768k4399l898K363K3083p039j5104N372N665l761J5451J2750J6965r768
15043g088j4054k037J0641L974j9790J4187J0823K205J0144j9661r579j9455o909
15030d6599O93J2248K2254R994p611l061J8433N456k1171j1071j9655k318M391
15017c8017J6971J2562J6896k5309j5930N795N316n852K1207j517k529K6997J4540
15004C1130j1968J806J2890L902k3551k7089k0584K804R065J5458J7341N5309
14992F6513J13970K02734J40454o3814j77172j24083o9881m1628j6578j1109q042
$$ plain form
15082 -13236 -3740 6173 17343 8559 -6123 7726 17313 -3206 7384 -1667 -17660 -6677 -8957
15069 -8957 -6805 29073 10496 -19173 -28871 -36366 -31427 5805 27068 18637 10038 -1276 -24768
15056 -24768 -49167 -53065 -50702 -27619 -34658 -49762 -44390 -38725 -42486 -27035 -14285 2680 -7088
15043 -7088 -21142 -23179 -12538 -8564 -28354 -14167 -3344 -1139 9005 -10656 -20235 -39690 -46599
15030 -46599 -45906 -33658 -11404 -1410 -9021 -12082 6351 11807 -9364 -20435 -40090 -42408 -38017
15017 -38017 -21046 -8484 8412 -16897 -32827 -27032 -21716 -27568 -6361 -7878 -10407 16590 31130
15004 31130 19162 20968 33858 37760 14209 -12880 -33464 -30660 -21595 -6137 11204 66513
14992 66513 180483 383217 523671 459857 282685 158602 88721 47093 30515 19406 11364
14981A1364j272K1894j034J3832J3920k1894q457n792j55J1728r097j2720J1941
14968B4258O458q858j2787r001N429j5704K9581j3036O910J8619k2498N928k740
14955A2559k16o175n781j1181R026J433P011j880o904p345J2244j2076k1760j2832
14941d3877L60L9856M165l0189k0664m041J8685K1147K0176R034q876j9338M408
14928i154J676j626L765R159j680j4730j0339j7834K0504J8312J2782j6835j0481
14915a6481o832j5005j564k591o396M604K4097K5729O198j9101m884J1075J0422
14902I271J1374m447k5960j6750Q657J4060J6267j5129p875Q654J063J8411k2618
14889e022k761K526J5975j8068l2991o906O363J8373J4808J9165j4017k0700k160
$$ plain form
14981 11364 10092 31986 30952 44784 58704 36810 28353 22561 22406 34134 25037 12317 24258
14968 24258 30716 21858 9071 70 5499 -10205 19376 6340 13250 31869 9371 15299 12559
14955 12559 12343 6168 387 -10794 -1768 -335 6676 4796 -2108 -9453 2791 -9285 -31045 -43877
14941 -43877 -43517 -3661 504 -29685 -50349 -54390 -35705 -14558 5618 14652 5776 -13562 -9154
14928 -9154 -7478 -9104 -5339 3820 2140 -12590 -22929 -40763 -20259 -1947 10835 -6000 -16481
14915 -16481 -23313 -38318 -39882 -42473 -48869 -44265 -20168 5561 11759 -7342 -12226 -1151 9271
14902 9271 20645 16198 -9762 -26512 -17855 -3795 12472 -2657 -10532 -1878 -815 17596 -5022
14889 -5022 -7783 -5257 10718 -7350 -40341 -47247 -40884 -22511 -7703 11462 -2555 -23255 -25415
14876b5415J6868r506J516m514p253l104Q147L2088L5j8648R728j4197j170L6422
14862B0997K6045R421j6105m7628J090L273j0686k5539j1991J7839J4237o285
14850b5332j633K160J0828M4906J0865k0642k6431j5253m38J3266J9611L387K23
14837A5517O918M253n647k7640m1025J5030K1191K2957Q840q639q059J4697n342
14824A3051R029J0576j2294Q89q103k3659j0932L7119L1323k2383k1594j2717
14812i695j7136m302j440J7476J4484J0154J4690R839l139j3325j398j4848J1042
14799A2402K2844j1819o1251k218J5687J5349m74o46k455l860o660n354Q953J6654
14785b848J1105k9239J901J3193R600j5569j2533M251N139p436q630J5956K5808
$$ plain form
14876 -25415 -8547 -18053 -16537 -21051 -28304 -31408 -23261 8827 8862 -9786 -58 -14255 -15425 20997
14862 20997 47042 56463 40358 -7270 -6180 -2907 -13593 -39132 -51123 -33284 -19047 -25332
14850 -25332 -26965 -24805 -13977 30929 41794 21152 -5279 -20532 -20970 -7704 11907 15294 15517
14837 15517 22435 26688 21041 -6599 -47624 -32594 -11403 11554 20394 11755 3696 18393 13051
14824 13051 22080 32656 20362 21251 13148 -10511 -21443 15676 46999 24616 3022 -9695
14812 -9695 -26831 -31133 -32573 -15097 -613 9541 24231 34070 30931 17606 16208 1360 12402
14799 12402 35246 23427 -37824 -40042 -24355 -9006 -9480 -10126 -12581 -16441 -23101 -28455 -19502 -2848
14785 -2848 8257 -20982 -19081 -5888 3712 -11857 -24390 -20139 -15000 -22436 -31066 -15110 10698
14772A0698J741j4961j9820j8329q925J2874L8034J5458O645J4840J1050k614
14760D6691j5908j2526O8K743K3098j580r603k9647k6674L5262J1700j4760j4144
14747e280Q828o710p571Q657o590j458K8908N119j1947j1944P343K740k295P154
14733A4954M114R332J0037k126q325j2567k2419n67l093J5827l962n325J896q114
14719a0338n399J6098L025L968p218k4828m394n771O238J1351K2963j0405J795
14706b915K833k147L697q250m823J997J7105Q651k3960J0944M073J3761j810P978
14692B7134J1807k021r875J0052j0243o433k1853j5714K7905L2468k6434k4308
14680g515j839Q174K748j7975N930K6915Q980L349J0738Q454k3451m1697j3974
$$ plain form
14772 10698 12439 -2522 -22342 -40671 -49596 -36722 1312 16770 23415 38255 49305 46691
14760 46691 30783 18257 18325 21068 44166 42586 32983 3336 -23338 11924 23624 8864 -5280
14747 -5280 3548 -3162 -10733 -2076 -8666 -10124 18784 23903 11956 12 7355 10095 7800 14954
14733 14954 19068 28400 38437 36311 27986 15419 -7000 -7567 -10660 5167 1205 -4120 -2224 -10338
14719 -10338 -15737 361 3386 7354 136 -24692 -29086 -34857 -28619 -17268 5695 -4710 -2915
14706 -2915 -82 -2229 1468 -6782 -11605 -9608 7497 16148 -7812 3132 7205 20966 19156 27134
14692 27134 38941 36920 27045 37097 26854 20421 -1432 -17146 10759 43227 16793 -7515
14680 -7515 -9354 -1180 1568 -16407 -10477 16438 25418 28767 39505 47959 24508 -17189 -31163
14667c1163P604l211k936J7929J8591k1454k1582J343K0530j1194N122J4774P733
14654B086j4309j305N352J6165L111q551l1324J4620J7284P179p490l24L621P129
14640A3244r644j6544p936o219J7143R430L780j1221K1867m398J3142J8218j2038
14627B8824j3605l441J282J890J0203j7465k3569r473j979K6184J4178P650k1181
14614e02j2652j29R622k0280q8J3450P10q387Q265l088J8683O462j8635p311k078
14599a5958J7890M3570j3976j8427j7559k969k6392L932J4896J3580j1386J2246
14587e53j7066p786K0467k063J3601J9127J4716j5754l7359m585j1227q825j2585
14574d9892p707l586L3445J0723L567j9658j4099P366K3502K5695J1976J2320
$$ plain form
14667 -31163 -23559 -26770 -29706 -11777 6814 -14640 -36222 -34879 -14349 -25543 -20421 -5647 2086
14654 2086 -12223 -13528 -8176 7989 11100 2549 -28775 -14155 3129 10308 2818 2494 6115 13244
14640 13244 3600 -12944 -20880 -27099 -9956 -526 3254 -7967 13900 9502 22644 40862 28824
14627 28824 15219 11778 13060 14950 25153 7688 -15881 -25354 -27333 -1149 13029 20679 -502
14614 -502 -13154 -13283 -3661 -23941 -24029 -10579 -9869 -18256 -9991 -13079 5604 12066 -6569 -13880 -15958
14599 -15958 1932 45502 31526 13099 -4460 -7429 -33821 -29889 -14993 -1413 -12799 -553
14587 -553 -17619 -25405 -4938 -7001 6600 25727 40443 24689 -12670 -17255 -28482 -37307 -49892
14574 -49892 -57599 -61185 -27740 -17017 -13450 -33108 -47207 -39841 -16339 9356 21332 33652
14562C3652k4881J0197k796J5143m092L184J7707o493k0359j8579N582P653J6067
14549C1985R984L918n922q934j3888k4970k914K818R983J2389r133j3651j3206
14536b1541k6305J5344J3834N90K0953J5808k587l789O713J552j4162j698K3476
14523B8188J1075m0382k8648J8934J6782J0608O40q556J372m12j8506j7812R15
14510b5802J6830k1146n978K5394M4208J8262j9479l934J2325N375j3283R077
14498D1849N889n089j5712k6270k2609L816J9528J493n918K7538J3131N727P563
14485E0936p927k5695L566K4345n354k298j1611k4525q183m074k2427j841K0155
14472a4933K114P97K1409P426J3531K1430r474k5194l4931J3672J1160l092P547
$$ plain form
14562 33652 8771 18968 16172 31315 27223 30407 48114 41621 21262 2683 8265 15918 31985
14549 31985 41969 45887 39965 31031 17143 -7827 -10741 -7923 2060 14449 5316 -8335 -21541
14536 -21541 -47846 -32502 -18668 -18078 2875 18683 16096 12307 19020 20572 6410 4712 28188
14523 28188 39263 -1119 -29767 -10833 5949 16557 17197 8641 10013 9601 -8905 -26717 -25802
14510 -25802 -8972 -30118 -36096 -10702 33506 51768 32289 28355 40680 46055 32772 41849
14498 41849 47738 42649 26937 667 -21942 -18126 1402 2895 -3023 24515 37646 43373 50936
14485 50936 43009 17314 20880 45225 39871 37573 25962 1437 -6746 -10820 -33247 -35088 -14933
14472 -14933 -12819 -12022 9387 16813 30344 51774 42300 17106 -17825 -4153 7007 3915 11462
14459A1462j219p011j3073j1959K4326J4646K732J4669j502l0503K183K3882J277
14446B9910K1163R416j5709n174o497m770J2120O671J045j5797J818P108k4205
14433A7099j3031Q469k998j3325j789L2982N426O206Q740o06j7718O610j4305
14420B1760k3240L328q862J2778k100Q485Q274L193k3197l2039j6781l793P466
14407d4728K928R329K5908K628K5684R362q032k3043L658j2863O017K2078q701
14394A0225j0128j3330J0597J3072K4109J7152Q50K739j3237k7829O054o791k272
14381A1211o450n990l617j568q789J1384J5491L1610K3876R529p062Q599J7451
14368I5675K7602o035K3622J8164J0466J6371K0691K9727N109P887O0018M5397
$$ plain form
14459 11462 10243 3232 -9841 -21800 2526 17172 19904 34573 33071 2568 4751 28633 29910
14446 29910 51073 60489 44780 39606 33109 28339 40459 47130 48175 32378 34196 41304 17099
14433 17099 4068 12537 9539 -3786 -5575 27407 32833 39039 47779 47173 29455 36065 21760
14420 21760 -1480 1848 -7014 5764 3664 12149 20423 23616 419 -31620 -48401 -52194 -44728
14407 -44728 -41800 -32471 -6563 -3935 21749 31111 23079 36 3694 -9169 -3152 18926 10225
14394 10225 97 -13233 -2636 10436 34545 51697 52547 55286 42049 14220 20274 13483 11211
14381 11211 4761 -1229 -4846 -6414 -15203 -3819 11672 43282 67158 76687 69625 78224 95675
14368 95675 123277 117242 140864 159028 169494 185865 206556 236283 241392 249279 309297 354694
14356C54694M5279N1978K3222O3095J07238J35470J63173K14329K97839L44138
14346A800455L40631L49891L61502L35427L06601K24607J80066J14479O3435N8990
14336D136084J0775l6117q0653r9190j44155k11409k48473l21809l53715l60426
14326B290912l43743l28444k72550k36894j92983j34509j09420p7672n1326p9551
14316D63820m6170k8042l5482n4897k0827o439k9048l9637l6102j4488N043j781
14304A55950K694j5493r212j5367j1174K0096J9591n972q429J823j712k7597k2816
14291H2382j7665j266J4512j8055j715j730J124j5225p016o307P377J0069L709
14278E0194n1008j5892J9395K5844N163Q293N106o603j4946j8614j9217p175r762
$$ plain form
14356 354694 399973 451951 475173 538268 645506 780976 944149 1158478 1456317 1800455
14346 1800455 2141086 2490977 2852479 3187906 3494507 3719114 3899180 4013659 4077094 4136084
14336 4136084 4146859 4110742 4030089 3930899 3786744 3575335 3326862 3005053 2651338 2290912
14326 2290912 1947169 1618725 1346175 1109281 916298 781789 672369 594697 543371 463820
14316 463820 417650 389608 354126 299229 278402 271963 242915 203278 167176 152688 157731 155950
14304 155950 158644 143151 133939 118572 107398 127494 147085 141113 132684 134507 132795 105198 82382
14291 82382 64717 63451 77963 59908 58193 56463 57587 42362 35346 29039 36416 46485 50194
14278 50194 -814 -16706 2689 28533 33696 41989 47095 40492 25546 6932 -12285 -19460 -29222
14265b9222K1959K4839J7002J2109j1622k0368p977K2441J1112R099q706p760
14253C2906k0412k597m742R264K6382K7276j7356k4656M225j4949k448o872k01
14240E820K2668J1760k0117J6171J3001k0191k4881k2471J0104Q389J9297j363
14228A8187q661q017R60l250j1999M446R231j5607k222K9974L2623L336k7767
14215B1234L7134q342k9806j9043q699J1401P2n113j3155l706J8678J5541K234
14202A8430L326q551r901J2372j3393j2818J9729J1353q573k1546j1151j1288
14190c2011K0875L3654O814J0667N10p582j0669r220j7511j787J3348J183R298
14177A7569J1788Q630k7816k1741J45N748K456K8536n666O826J3333K848k3242
$$ plain form
14265 -29222 -7263 17576 34578 46687 35065 14697 6720 29161 40273 49372 40666 32906
14253 32906 12494 9897 5155 14419 40801 68077 50721 26065 30290 15341 12893 6021 5820
14240 5820 28488 40248 20131 36302 49303 29112 4231 -18240 -8136 253 19550 18187
14228 18187 9526 1509 2469 -781 -12780 -8334 897 -14710 -16932 13042 45665 49001 21234
14215 21234 58368 50026 20220 1177 -7522 3879 3951 -1162 -14317 -18023 655 16196 18430
14202 18430 21756 13205 3304 15676 2283 -10535 9194 20547 11974 -9572 -20723 -32011
14190 -32011 -11136 22518 29332 39999 40509 32927 22258 13038 -4473 -6260 7088 8271 17569
14177 17569 29357 37987 10171 -11570 -11425 -5677 -3221 25315 19649 26475 39808 42656 19414
14164A9414n871j3869j262k6429r030J9385n321p1R119r757M934Q060r725L661
14150a6762J3072K1876J0949k9913J5527J6082O372R26K982O678j467n807l169
14137C7346m751k1563j4409J43J038P080J7146J1927o268j4295Q18n917J8326
14124B6621n429P38J0560j1951k5271R118l531J6216L2338J5271m837j5797j8230
14111B5816J023K795j9405j1093j3761P152J9590K8266o753r238L402M746k7854
14098D686j8731K5437L1898J5261O355o116k1646J8523k8561J571K810L079J3979
14085D8545n748j2814O772L687n773n173j6386Q745R039M98p595j2536Q88q052
14071D097P920M166O061l053p026J3820k437j022m444k2333q190J9452J5073l3229
$$ plain form
14164 19414 13543 -326 -1588 -28017 -37047 -17662 -22983 -23054 -13935 -23692 -18758 -10698 -20423 -16762
14150 -16762 -3690 18186 29135 -778 14749 30831 37203 38129 41111 47789 46322 40515 37346
14137 37346 32595 11032 -3377 -3234 -2196 4884 22030 33957 27689 13394 14212 8295 26621
14124 26621 21192 21930 32490 20539 -4732 4386 855 17071 49409 64680 59843 44046 25816
14111 25816 26839 29634 10229 -864 -14625 -7473 12117 40383 33630 24392 27794 32540 4686
14098 4686 -14045 11392 43290 58551 64906 58790 37144 55667 27106 28677 31487 34566 48545
14085 48545 42797 29983 36755 40442 34669 29496 13110 21855 30894 31392 23797 11261 12149 4097
14071 4097 12017 16183 22244 19191 12165 25985 23548 22526 18082 -4251 -12441 7011 22084 -11145
14057a1145j1467R910q35J5412K3201r982k4774l321p718k133j3790K045n515
14044d0112N178L5608J5785p552J0150j2187q652K6221p348l0311j3959p55J5455
14031a2479P434M626J5544J1096j2360l316j395o122j1542o063J3788o132J5206
14018H285L607N793N398l981k8275J9167j3169N84l718k0831j2171n812n119J0171
14004d0071J1498J0174J8885q756O876K33k8932J0511p213j0964n40o738O904
13991c8133J1887j412q299J950K5971K6793J6037j0857k2811k7134j3986Q799
13979c1195L0347J745K632N699J2966J154r840j2022j5285J2236J9588j716n430
13966A0879j8466l684J358j1344j7145J5009L3692k783j0945m399k2525k8663
$$ plain form
14057 -11145 -22612 -12702 -13537 1875 25076 15094 -9680 -13001 -20719 -22852 -36642 -34597 -40112
14044 -40112 -34934 674 16459 8907 19057 6870 -1782 24439 17091 -13220 -27179 -27934 -12479
14031 -12479 -5045 -419 15125 26221 13861 10545 9150 3028 -8514 -14577 -789 -6921 8285
14018 8285 11892 17685 23083 19102 -9173 9994 -3175 -2591 -6309 -27140 -39311 -45123 -50242 -40071
14004 -40071 -28573 -18399 486 -8270 -1394 -1161 -30093 -19582 -26795 -37759 -38299 -45037 -38133
13991 -38133 -26246 -27658 -35957 -34007 -8036 18757 34794 23937 1126 -26008 -39994 -31195
13979 -31195 -848 897 3529 9228 22194 23348 13508 1486 -13799 -1563 18025 16309 10879
13966 10879 -7587 -11271 -9913 -21257 -38402 -23393 10299 7516 -3429 -7828 -30353 -59016
13954e9016j0236p125J0159K0228O033o373L631K1089K1662K449q260j5344N309
13941a5794K4138q960K46J6646J6280n397j7030k7932K97P758J397J3308j3371
13928h414J0652j587j4064K2875k759k6139k0625R089k024M7008k899J6828r671
13915A8270m236l806k4110N994j1970N952J2365j2154J0632J8992J3904r288M906
13902B5451r453n217j9091p612J2185L349j2043O30R366K4096n15p883J3579p122
13888A9720K0174l495k4557k6145n975J1518J8385K890r136K018L152J8489l134
13875B3904j0444O781J9820L404r089j4675J9256o890j1428j7421J0034l299j6858
13862f905K2710l505K0567p479l3672q184k248m537K418J7512K1942q078r304
$$ plain form
13954 -59016 -69252 -76377 -66218 -45990 -39957 -46330 -42699 -21610 52 2501 -5759 -21103 -15794
13941 -15794 8344 -616 -370 16276 32556 27159 10129 -17803 -17506 -9748 -8351 4957 -8414
13928 -8414 2238 651 -13413 9462 6703 -19436 -40061 -30972 -32996 14012 11113 27941 18270
13915 18270 14034 10228 -13882 -7888 -19858 -13906 -1541 -13695 -3063 15929 29833 20545 25451
13902 25451 15998 10781 -8310 -15922 -3737 -388 -12431 -11801 -2435 21661 21146 13263 26842 19720
13888 19720 39894 36399 11842 -14303 -20278 -8760 9625 12515 3379 5397 8549 27038 23904
13875 23904 13460 20241 40061 43465 34376 19701 38957 32067 20639 3218 13252 9953 -6905
13862 -6905 15805 12300 32867 25388 -8284 -16468 -18716 -23253 -20835 -3323 18619 10541 1237
13849A237L604j0726o69L59k9350Q269p635J1669L3752o02l5020j4958k2992R423
13835e3639L3841J4067o712r27p06q047J8798K0853O173Q04n688j8586l578L726
13821C79k734j2068q626K5378J714n945m139J8041K2013l567k3040k5012M400
13808a3206K8918Q372j0209m3371j8350M875M0552K1253M331k0030j3298J5095
13796D932N4k3977P15L6546K3506J174k197q619j4101j9490o375l899j5355N22
13782b6564K4190J3959J2322l4869k4115K4334q90K607J7645K670j5189k0198
13770b4098J4331K6191p633j8026k1192o241j452J725j0104J027M28L989J6953
13757b4102r880k913J6496K7286k5118j3273K2446J3868k6909r450Q938K4402
$$ plain form
13849 1237 4841 -5885 -6554 -6195 -35545 -27276 -34911 -23242 10510 9908 -25112 -40070 -63062 -53639
13835 -53639 -19798 -5731 -12443 -13370 -14076 -22123 -3325 17528 23701 24505 18817 231 -3347 379
13821 379 -2355 -14423 -23049 2329 4043 -1902 -6041 12000 34013 30446 7406 -17606 -13206
13808 -13206 15712 24084 13875 -29496 -47846 -42971 -2419 18834 23165 3135 -10163 4932
13796 4932 4986 -18991 -18276 18270 41776 42950 40753 32134 18033 -1457 -7832 -11731 -27086 -26564
13782 -26564 -2374 11585 23907 -10962 -35077 -10743 -11633 -9026 8619 11289 -3900 -24098
13770 -24098 -9767 16424 8791 -9235 -30427 -36668 -38120 -36395 -46499 -45472 -45044 -41055 -24102
13757 -24102 -33982 -36895 -20399 6887 -18231 -31504 -9058 4810 -22099 -31549 -22611 1791
13745A791Q025O131k066j3882q362O059K0916J6938J9641k0751k5010L270r375
13732C325j2416n237p536J321r409o667J1539K1065K0025K8047J1000k1377m0074
13719f394J4314o44l469M776M519M112J639j9478j2636N547M2052J0337j1485
13706C3190j5220N57p789l981K244Q726j1245j4004k955K5654J5320j2486Q48
13693A8859j0359k522j328j1649p012O06j0714J7085r017o318n927RL1283j7349
13679a4353R653L1316J197J8435j357j8663p994q464o865r473r73Q280O090M648
13665A1477r609r32Q936J7798l1217j2469k2489R442J5636J0617J3204O542N137
13652B2073J5241J1037j1142m3275o6p128j3473k072R050M941J2105j0860K684
$$ plain form
13745 1791 9816 15947 13881 -1 -8363 -2304 18612 35550 55191 34440 9430 12700 3325
13732 3325 -9091 -14328 -21864 -20543 -29952 -36619 -25080 -4015 16010 44057 55057 33680 -6394
13719 -6394 7920 7276 3807 8583 13102 17214 18853 -625 -13261 -7714 34338 44675 33190
13706 33190 17970 18527 10738 6757 9001 17727 6482 -7522 -10477 15177 30497 18011 18859
13693 18859 8500 5978 4650 -6999 -14011 -13405 -24119 -7034 -16051 -22369 -28296 -28287 2996 -14353
13679 -14353 -4700 26616 27813 46248 44891 26228 18234 9770 2905 -6568 -7541 739 6829 11477
13665 11477 1868 936 9872 27670 -3547 -16016 -38505 -29063 -13427 -2810 10394 16936 22073
13652 22073 37314 48351 37209 -6066 -6132 -13260 -26733 -28805 -19755 -14814 -2709 -13569 -10885
13639a0885m037j4307J6292j383K9132j0166k1646J4926M069L729P263m431L370
13626A1926k494j2295j9367K4623L5290k2125m3406k83J7624J3774l666j3895
13614a4294q431j851R082j947J7413o648J2980J4790K3034K709k2926j811r589
13601A2511K5439L2q355j3291k3878J4929L1680p288k3001J463K6441O5k2497
13588A4250l0269k678Q149J0332J0318R740j0217n192l741J5456L0978j7434n762
13575B3930j695J7957j7683o972J962m4636j2328J9447K4567j1584j4747n77p316
13562b9675j1154J2031J0923J1946J3334k453j0548K7105J462m530P506l413K907
13549B5441j1440j9079j3870O846J5932j3286k2079J327J7928K6204j6033J7L1118
$$ plain form
13639 -10885 -14922 -29229 -12937 -14320 14812 4646 -17000 -2074 1995 5724 12987 8556 11926
13626 11926 9432 -2863 -22230 2393 37683 15558 -27848 -28131 -10507 3267 -399 -14294
13614 -14294 -22725 -24576 -15494 -17441 -28 -6676 6304 21094 44128 46837 23911 22100 12511
13601 12511 37950 37982 29627 16336 -7542 7387 39067 31779 8778 10241 36682 36747 14250
13588 14250 -16019 -18697 -10548 -216 10102 19842 9625 4433 692 16148 47126 29692 23930
13575 23930 22235 40192 22509 15537 17499 -27137 -39465 -20018 4549 -7035 -21782 -22359 -29675
13562 -29675 -40829 -28798 -17875 -5929 7405 4952 -5596 21509 22971 18441 25947 22534 25441
13549 25441 14001 -5078 -18948 -12102 3830 -9456 -31535 -30208 -12280 13924 -2109 -2092 29026
13536B9026Q258j4557j759O730J0885O090k2407k7723j9535r28K3572j4005L333
13523a3020J4561R632o201J8059M656m351k3223l3832j1766r994O379J1686J6109
13510b1305M045n82l932L782L9506J0908j6951j3638l580n699j6135j5123L172
13497c5532M478Q232k186Q035K8078J8375Q79k0136J928K2633N064j9712j3041
13484G095j8689J1535q083j6176j3702O9L1978K6370K3202j7723j8827J0186K009
13471A9244j3362l781l9201l6851j3360L2216N1860J85k0528l526p161K6204l332
13458a1393j2989J6628o669K395J4023J3027R426J8675k4469j6868k2954k6181
13446d7349J1689K5247L6546L703r825k6681j3086N108q718L8j1825J4034o954
$$ plain form
13536 29026 37284 22727 20968 27698 38583 44673 22266 -5457 -24992 -25920 -2348 -16353 -13020
13523 -13020 1541 11173 4972 23031 27687 23336 113 -33719 -45485 -55479 -49100 -37414 -21305
13510 -21305 -17260 -17842 -21774 -17992 21514 32422 15471 1833 -1747 -7446 -23581 -38704 -35532
13497 -35532 -31054 -22822 -25008 -16973 11105 29480 30359 10223 12151 34784 39848 20136 7095
13484 7095 -11594 -59 -8142 -24318 -38020 -37951 -5973 20397 43599 25876 7049 17235 19244
13471 19244 5882 2101 -37100 -73951 -87311 -55095 -3235 -3050 -23578 -27104 -34265 -8061 -11393
13458 -11393 -24382 -7754 -14423 -12028 1995 15022 24448 43123 18654 1786 -21168 -47349
13446 -47349 -35660 -10413 26133 29836 20011 -6670 -19756 -14648 -23366 -23328 -35153 -21119 -28073
13433b8073R005K5781N308J0697J6827q729n516k6592l0375P828N015O181J1762
13420h81j4836J658m901O301j0162j1171R780L0746J5425j0140k707R722r725
13407I109l0043j0108k103j4020o680l911K1931J4613L47J5634J6305M993J0333
13394B6400n225j921q106q333j1391k4414K214L4980J4494J7401o556o653n549
13381A7341J0107m059q027j4O715m211j7792q699m398J6339K1480q380j178m822
13367A0402N543r892L0080J8941J000k7228r937m667P658n300r237j274J306P703
13353A5098P626N584K3049L3053J6595Q896L991M041Q03K3940K6340K0381L9919
13340B29316P5600J60728J84201L21864N32076O76760N15117J55926k67023n85976
$$ plain form
13433 -28073 -19068 6713 12021 22718 39545 30816 25300 -1292 -31667 -23839 -18824 -12643 -881
13420 -881 -15717 -14059 -18960 -12659 -22821 -33992 -24212 6534 21959 11819 9112 18834 9109
13407 9109 -20934 -31042 -33145 -47165 -53845 -57756 -35825 -21212 -20865 -5231 11074 16067 26400
13394 26400 21175 19254 11148 2815 -8576 -32990 -30776 4204 18698 36099 29543 22890 17341
13381 17341 27448 23389 15362 15348 22063 17852 60 -8639 -13037 3302 24782 16402 15224 10402
13367 10402 15945 6053 36133 55074 56074 28846 18909 14242 21900 16600 7363 6089 7395 15098
13353 15098 22724 28308 51357 84410 101005 109901 113892 117933 118736 142676 169016 189397 229316
13340 229316 304916 465644 649845 971709 1503785 2180545 2695662 2851588 2584565 1998589
13330A998589n97260m43640k79376j54798j14962p6941o7246m4424j3418j7863
13320A88661j6458q372l8758j2561N165m6894o3314J3868L2614j8512j3244M411
13308B6606Q873o516K1007Q427L035J4990M795K6388R878n060N554K2925j6125
13295A24777k5987j3142n945m158k158J3276n514l731O464j5156k3277l2317n117
13282H015R4J1281K1075J2178P173R856j2471k3133j0860j6868J2620J5836L817
13269C8613k37N133O577o786k7425n195n194n535J2074M933K4907o418J8259M9260
13255A02966K1717j1597m0842q861j5905k0702j0847K702J4696k368J078l472
13243B8565j7369j89J0880M15P163j3542l246j0601j6823R858Q100J6073J9645
$$ plain form
13330 1998589 1401329 957689 678313 523515 408553 331612 264366 219942 206524 188661
13320 188661 172203 163831 125073 112512 117677 70783 7469 21337 53951 35439 22195 26606
13308 26606 35479 28963 49970 58397 61432 76422 81217 107605 117483 112423 117977 140902 124777
13295 124777 98790 85648 79703 75545 73387 86663 81149 77418 83882 68726 45449 13132 8015
13282 8015 8109 19390 40465 52643 59816 69672 57201 34068 23208 6340 18960 34796 38613
13269 38613 38376 43509 50086 43300 15875 10680 5486 -49 12025 16958 41865 35447 53706 102966
13255 102966 124683 113086 72244 63383 47478 26776 15929 18631 33327 30959 32037 28565
13243 28565 11196 11007 21887 22302 29465 15923 12677 2076 -14747 -4889 3211 19284 38929
13230C8929n424J1409k7910p165J5158j0562j0040l978J981n06L081N711k5003
13217a4319n470k218K0940K7240J1972j584j0797j7718j6150o755j6542l349J3739
13204b1011o025p42K3540M4830K5989J4229j1263j8881J822J4650M7157P945l7053
13191H5187l7593k4279j3884R600p191J0184J2296j8709m4373j7277K5541J8104
13179b394M2934k034j95K3473l043q467J5258j6022k0378k024m176o378K7798
13166D4352n814J8631J2021Q935O400N103O950n331k0445J0297J6989M1938L5861
13153A75887pJ6419Q8171J49969K01478R1267o2277r2532j18327j18077q1014
13142B50957o6516n5430j1962j8688O013J837k7094J940r237K549J7579J8561
$$ plain form
13230 38929 33505 44914 17004 9839 24997 14435 4395 417 2398 1892 4973 10684 -14319
13217 -14319 -19789 -22007 -1067 26173 38145 36561 25764 8046 -8104 -14859 -31401 -34750 -21011
13204 -21011 -27036 -27778 -4238 40592 66581 80810 69547 50666 52488 67138 114295 122240 85187
13191 85187 47594 23315 9431 19031 11840 22024 34320 15611 -28762 -46039 -20498 -2394
13179 -2394 40540 38506 38311 61784 58741 50274 65532 49510 29132 27108 22932 16554 44352
13166 44352 38538 57169 69190 78125 84525 89628 96578 91247 70802 81099 98088 140026 175887
13153 175887 175880 192299 280470 430439 631917 723184 660907 568375 450048 331971 250957
13142 250957 184441 129011 117049 98361 104374 106211 79117 81057 71820 74369 91948 110509
13130A10509j5485J0290O508j2620l1266N185J8011J1169O788N910o929J935O524
13117A16529q795N540J4681J6960k6172l426K101j4101Q492m79K1433M3924N3603
13104B30290J06704Q8902j1o1025o6762m1064l9627m0516k7461L373K0895j402
13092A72296Q017J6073K9504r931n0188n1245l5602j8441M653L467j4163k6185
13080B8255j2503O714K3445L1277n385K266J1338k280R080O580J1607j0925R35
13067A00404m668N76j8145J0894J2006o418j9042j5915J7808L9389J8017P73k0967
13054A14712j7923k3250l8406l5297k1571K9910K5887P673J7036M5400N4870M8395
13042B07436K6405O289k891j4615l8954k1684L760J1170k654K5020n319J6371
$$ plain form
13130 110509 95024 105314 111822 99202 67936 73121 91132 102301 109089 114999 108070 110005 116529
13117 116529 107734 113274 127955 144915 118743 115317 117418 103317 111809 111330 132763 176687 230290
13104 230290 336994 425896 425885 364860 298098 257034 217407 176891 149430 152803 173698 172296
13092 172296 180313 196386 225890 215959 165771 114526 78924 60483 65136 68603 54440 28255
13080 28255 15752 22466 45911 77188 71803 74069 85407 83127 92207 98787 110394 99469 100404
13067 100404 95736 96312 78167 89061 101067 94649 75607 59692 77500 116889 134906 135679 114712
13054 114712 96789 73539 35133 -164 -21735 8175 34062 41735 58771 104171 159041 207436
13042 207436 233841 240130 237239 222624 183670 161986 165746 176916 174262 199282 193963 210334
13030B10334P262K9159K4056L7479P0331O0173J11141R0468J322p8295j57871
13019D05559j75887r3797n3360l0152L894M7757K7812P94j3640j103J3821m161
13007A27537l2179k5839O15Q889j0592J8861L4380K1120J7604J1183L135p706
12995A67008J1454J5854Q341J4724j189J5263n248l5811j4185j826J8822o326
12983A86881N141J6748P851L0962Q601l2458j5492K898J4526L7231M3431O9000
12971C75320N3240K3980K5133L9075K9383l0376m4951k8781j3786K4660L2113
12960D85010K836K2441K5512K3373J5514K4888L7127K8491L3331L0382N890L4558
12948G69353K9087l3151L133K0312K7898P2159N1510N2480M1874K7245P384J6348
$$ plain form
13030 210334 217596 246755 270811 308290 378621 438794 549935 640403 641725 563430 405559
13019 405559 229672 135875 82515 52363 56257 104014 131826 132620 118980 117877 131698 127537
13007 127537 95358 69519 70134 79023 68431 87292 121672 142792 160396 171579 174714 167008
12995 167008 178462 194316 202657 217381 216192 231455 226207 190396 176211 174385 193207 186881
12983 186881 192022 208770 216621 247583 256184 223726 208234 211132 225658 262889 306320 375320
12971 375320 428560 452540 477673 516748 546131 515755 470804 442023 428237 452897 485010
12960 485010 487846 510287 535799 559172 574686 599574 636701 665192 698523 728905 734795 769353
12948 769353 798440 765289 768422 788734 816632 888791 940301 992781 1034655 1061900 1069284 1085632
12936A085632O5136R8486R7417O4696M6813P2519J11304J43777J83376K09263
12926B178419K22966K11516K25826K18797K05179J57037J65067J71266K46671
12917D002744L10443L83932M58505N59203O63489Q22921R68775J199506J469394
12908A0838912J733210K113260K669586L578304M904757O581876Q940134J2643458
12900E4003497J9233564L1818346N4993454R2006432J27994492J12191256M5974192
12893E38215233l1592731j01852057j24437375r4893555n6958495l3563619k0916044
12886G4001357j4156813j0394730q133505o629635n328550m161568l201002k479807
12878A9515747j971742j655154j382710j174593r33039p35498n42847l55510j41928
$$ plain form
12936 1085632 1150768 1249254 1346671 1411367 1458180 1530699 1642003 1785780 1969156 2178419
12926 2178419 2401385 2612901 2838727 3057524 3262703 3419740 3584807 3756073 4002744
12917 4002744 4313187 4697119 5155624 5714827 6378316 7201237 8170012 9369518 10838912
12908 10838912 12572122 14685382 17354968 20933272 25838029 32419905 41360039 54003497
12900 54003497 73237061 105055407 160048861 252055293 380049785 492241041 538215233
12893 538215233 506622502 404770445 280333070 185439515 128481020 94917401 74001357
12886 74001357 59844544 49449814 41316309 34686674 29358124 25196556 21995554 19515747
12878 19515747 17544005 15888851 14506141 13331548 12398509 11663011 11120164 10764654 10622726
12869A0622726j5537q3053j95123k05877R932O14714J556280K600124K942904
12860A7847090J847069J7914j744323k489165j736809r5380J610312K453113J536650
12851A9246471l40196k381501l564892l286956k234411j403324r08196o26172
12843D500823m92057m14147l23277k84583k34897j82169j41429j10366r4760p5702
12833B147436m0875n7979o3700m4758Q626J6873L5844O6728R6801P9742J33481
12822B378219K18287L90249O47658J148799K179015L843705N609410M086515j618429
12813A8883428n339841m671466k749034j549010r09237n96912m20503l22777k66752
12804B057896k12346j79507j46700j29659j03648q4459p8984n1844k5959k1645
$$ plain form
12869 10622726 10607189 10524136 10329013 10123136 10133068 10747782 12304062 14904186 17847090
12860 17847090 19694159 19712073 17967750 15478585 13741776 13646396 15256708 17709821 19246471
12851 19246471 18906275 16524774 12959882 9672926 7438515 6035191 5126995 4500823
12843 4500823 4008766 3594619 3271342 2986759 2751862 2569693 2428264 2317898 2223138 2147436
12833 2147436 2106561 2048582 1984882 1940124 1948750 1965623 2001467 2068195 2164996 2244738 2378219
12822 2378219 2596506 2986755 3634413 4783212 6962227 10805932 16415342 20501857 18883428
12813 18883428 13543587 8872121 6123087 4574077 3664840 3067928 2647425 2324648 2057896
12804 2057896 1845550 1666043 1519343 1389684 1286036 1201577 1122593 1070749 1044790 1023145
12794A023145k7885k4426q103n4843j5792r263j2287r105M0101K8524L8972N5045
12782A024083R0038J36907J93405J42613J1781l3688Q9451L28802O19167N95287
12772C197846K8407n40784o11508m86176m07828l58007k49131j09326K4132O5804
12762E53429J7423k7143r954k2957k1376r180k4163m8828N059K0134m934j4478
12750D13032k2387n1368l4300k9264K547J9294J9589K8460R758L3950L4243K0507
12738D44061K1920K8956L8449l0102m8332j3929J4213O700K8563J4495k7182n6309
12726D21503l3161n2474l2938j6878J6635l966j1873l601k3372l4964M716J3011
12714B42638K5735J3014j8356j3447K5132k682j7623j4738r838Q967q678j0931
$$ plain form
12794 1023145 995260 970834 962731 907888 892096 882833 870546 861441 901542 930066 969038 1024083
12782 1024083 1114121 1251028 1444433 1587046 1598827 1565139 1654590 1983392 2602559 3197846
12772 3197846 3226253 2685469 2073961 1587785 1179957 821950 572819 463493 487625 553429
12762 553429 570852 543709 533755 510798 489422 480242 456079 407251 412310 432444 427510 413032
12750 413032 390645 339277 304977 275713 278260 297554 317143 345603 355361 389311 423554 444061
12738 444061 465981 494937 533386 503284 454952 441023 455236 461936 490499 504994 477812 421503
12726 421503 388342 335868 302930 286052 302687 298721 286848 283247 259875 224911 229627 242638
12714 242638 268373 281387 263031 249584 274716 272034 254411 239673 229835 238802 230124 219193
12702B19193R187k2440m8907k7512k7116j9913l541M172m08n774M796K4737j1722
12689I4752k2591k151K1049R291r967P457M966J3743L3015L304Q842o090K689
12676A58309j8499k4029l2524L41K7312R61J9408P64J0953K0190J834o332K206
12663A60894n781j4636P105K5155J851k1057k7011j3735J7407j007j9996J1854
12651A21043J5925n574j9825r103R36J4655J5776M8688P274m47o089l6463l1166
12638A15630J517J4354L1038j869l2518l1589q451K0576j981k2118p666l728R764
12625H2959Q189q482M254j7433k5537J6564L8556R427P984k974k7102l986j180
12612H1239L236K0670K0950N375K048k2748j288K0941L923J5530K468j9686j7807
$$ plain form
12702 219193 228380 205940 157033 129521 102405 82492 78951 83123 82715 76941 81737 106474 94752
12689 94752 72161 70010 91059 100350 90383 97840 102806 116549 149564 152868 161710 155620 158309
12676 158309 139810 115781 83257 83598 110910 111871 131279 132043 142996 163186 165020 158688 160894
12663 160894 155113 140477 147582 172737 174588 153531 126520 112785 130192 129185 109189 121043
12651 121043 136968 131394 111569 102466 103402 118057 133833 182521 189795 189348 183259 146796 115630
12638 115630 117147 131501 162539 160670 128152 96563 88112 108688 106707 84589 76923 73195 82959
12625 82959 91148 82666 86920 69487 43950 60514 99070 108497 116481 113507 86405 82419 81239
12612 81239 84475 105145 126095 131470 133518 110770 109482 130423 134346 149876 152344 132658 114851
12599A14851J3556J8404n544m297K0564j4476p0j1582k2966p110J158K6914m780
12586A24622j8049L0650q121l0106m774J4159p828k6011j0792J050K284o059K5084
12573H6109k637Q061p901j149j1585K810j0266K670j0220o633k4617k1388K7068
12560C0322K2217q982K769J22k4789R916J8996J5003M836J3207J1515J79k3783
12547G1528N767L0628M789k1012j1300j574j0683p448L5510Q445j6173j3278O683
12534H1882j5830l5900J7807L7060j4743k1005Q763L2258N049j3681m409P788
12522H5039j2555r151N150K917j0836j0640J7757J140l538J1713P229j0654m214
12509F9357P28O429R773l627R303l088j8077Q072j9280l5019o988J4855P249Q039
$$ plain form
12599 114851 128407 146811 141267 136970 157534 143058 142988 131406 108440 101330 102488 129402 124622
12586 124622 106573 137223 129102 98996 94222 108381 100553 74542 63750 64800 67084 61025 86109
12573 86109 83472 91533 83632 82483 70898 73708 63442 66112 55892 49259 24642 3254 30322
12560 30322 52539 43557 46326 46448 21659 31575 50571 65574 70410 83617 95132 95311 71528
12547 71528 77295 107923 112712 91700 80400 78826 68143 60695 96205 104650 88477 75199 81882
12534 81882 66052 30152 47959 85019 70276 49271 58034 90292 95341 81660 77251 85039
12522 85039 72484 63333 68483 71400 60564 49924 67681 68821 65283 76996 84225 73571 69357
12509 69357 70085 76514 86287 82660 91963 88875 70798 78870 59590 24571 17583 32438 39687 47726
12495D7726n944k312K3369L7094M81l7044k8974M190K0931K023k5430O63M060
12482D0833K2229J4559p839n557J2570M6552Q142o268k9331l2426r324k323J2922
12469F4739N904o662o853R548L758J4224j5768O49J2097J9066K3548L9726M0034
12456B04010J5855O7039J14585J58830K72935M50268O53830N77579K60259j36427
12446B638763n16202o36166m89526k94262j63434j14127j15359m8249j4757k6628
12436B20053m0697m583n564m8152j6235O012K3067N750k8039N585j8343o348K1947
12423A14453l707J1373L656p057P692P328j2972J6313R665O679L093J7524l761
12410A70279O94M364R413q431k0046k9175k1064j4623J6348Q914j4655j7667j2554
$$ plain form
12495 47726 41782 39470 62839 99933 100414 63370 34396 38586 59517 61540 36110 36773 40833
12482 40833 63062 77621 69782 64225 76795 123347 131489 125221 95890 63464 54140 51817 64739
12469 64739 70643 63981 57128 66676 70434 84658 68890 69539 81636 100702 124250 163976 204010
12456 204010 219865 286904 401489 560319 833254 1283522 1937352 2514931 2775190 2638763
12446 2638763 2122561 1486395 996869 702607 539173 425046 309687 261438 246681 220053
12436 220053 179356 174773 169209 121057 104822 110834 133901 139651 111612 117197 98854 92506 114453
12423 114453 110746 122119 125775 118718 126410 133738 120766 137079 146744 153423 156516 174040 170279
12410 170279 170973 175337 184750 176319 156273 127098 106034 91411 107759 116673 102018 84351 71797
12397G1797j6707L176k192K1287N802j7299J8270j4105L162J244L1940J8841j5396
12384A09820K544k1980k4465J0854J6561j4052o164J35l1458N207J8379J4391
12372G9772K1860J2976J0891K3263J654k1105j8141R066j6606k3976j4150o591
12360E8913O428O411M152J4879L142O823J2988j7687m33n67K86j068k1540j8097
12346E4630Q677N791K0926L021k012j0050o723k7836l1349Q950n41M292K726J0251
12332D0753j250l142k971J2994K0334K6600J4759j2630j6984l0712l730O377j6346
12319C4052n973Q071K854q79j9060L175M212K8083K7732k3459l201L6308j774
12306I0141m0335j9156J2389q903j8635P946k69j3673J7212K3836N131O8J2808
$$ plain form
12397 71797 55090 58266 56074 77361 83163 65864 84134 70029 73191 74435 106375 125216 109820
12384 109820 112364 90384 65919 76773 93334 79282 73118 73253 41795 47002 65381 79772
12372 79772 101632 114608 125499 148762 150416 129311 111170 120236 103630 79654 65504 58913
12360 58913 65341 71752 75904 90783 93925 100748 113736 96049 95616 95049 95335 94267 72727 54630
12346 54630 63307 69098 90024 93045 91033 80983 74260 46424 15075 24025 23484 27776 30502 40753
12332 40753 39503 36361 33390 46384 66718 93318 108077 95447 78463 47751 44021 50398 34052
12319 34052 28079 36150 39004 38125 19065 22240 26452 54535 82267 58808 55607 91915 90141
12306 90141 49806 30650 43039 34136 15501 23447 23178 9505 26717 50553 55684 55752 68560
12293F8560j4084J1544m7j9487J4035O056m674k7794j7473J9593J6829k1777p172
12280B4109J2254o449j852M819J9765O434j2077j9693K9203J9109k7058l0467
12268A8097k2940J057m282O805K7984K3516K0487J7260k2802k7678j1722p84Q311
12255C3309O532l285r649m292N352Q403j0174r561J6174Q085L2013k140P097J7522
12241I5386j0918l9028o871K823K566K5493p172k6186n361n634O241l502r541
12228A8296j4450j864J3908J9969p981p541K1640J5884k0394j0034j0087j0696
12216F650j351K670l477K8269J9685p006k5764J1109P747n504j4198j1833l284
12203C713J1786M202P094R27K7740j4525k9174K7640K2402k1921l834J6535J4549
$$ plain form
12293 68560 54476 66020 65973 46486 60521 66577 61903 34109 16636 36229 53058 31281 24109
12280 24109 36363 29914 28062 32881 52646 59080 47003 27310 56513 75622 48564 18097
12268 18097 -4843 -3786 -8068 -1263 26721 50237 70724 87984 65182 37504 25782 24998 33309
12255 33309 39841 36556 26907 22615 27967 36370 26196 16635 32809 40894 72907 70767 77864 95386
12241 95386 84468 45440 38569 41392 43958 69451 62279 36093 30732 25098 31339 27837 18296
12228 18296 3846 1982 15890 35859 27878 20337 41977 57861 37467 27433 17346 6650
12216 6650 5299 7969 4492 32761 52446 45440 19676 30785 38532 33028 18830 6997 3713
12203 3713 15499 19701 26795 27722 55462 40937 11763 39403 61805 39884 36050 52585 67134
12190F7134k6576j5750K0651P251j2068j6020m279m678q810J3904J8637l234k0472
12177A5690l42N650l417j3788j3K8368Q597j6507Q91o368k945k843J6994K7871
12163E7838m092J2841p861j3374k5050q196P853M230P547j8753o971J411L186
12150A0609j2465O675J0802j7504J4021J7344J2009o346k5496j7054j855p244
12138a6504j2750J1609P964L718K309o632P702J3256K266L0969M488k6919q390
12125A3086k20r049j1372m596N434R356J443Q014K1729j7860m207Q870N135J9407
12111D5170K588j6543M124J5275J5158J7778k168j2619p989l5078j4011j524j4904
12098d743k100K0684L5349r491j8985J9238r284j8373j9292j4161K130J5238K3941
$$ plain form
12190 67134 40558 24808 45459 52710 40642 24622 20343 15665 6855 20759 39396 36162 15690
12177 15690 15348 20998 17581 3793 3780 32148 40745 24238 25129 18761 15816 12973 29967 57838
12163 57838 53746 66587 58726 45352 20302 12106 19959 24189 31736 12983 6012 7423 10609
12150 10609 -1856 4819 15621 -1883 12138 29482 41491 35145 9649 -7405 -9260 -16504
12138 -16504 -29254 -17645 -9681 -5963 -3654 -10286 -2584 10672 12938 43907 48395 21476 13086
12125 13086 12866 3817 -7555 -12151 -6717 2639 4082 12096 33825 15965 11758 20628 25763 45170
12111 45170 47758 31215 35339 50614 65772 83550 81382 68763 60774 25696 11685 10161 -4743
12098 -4743 -6843 13841 49190 39699 20714 39952 30668 12295 -6997 -21158 -19028 -3790 20151
12085B0151P147n644K755J1639r206j399J6362L817j0915j7187p448K3902K53
12072C4227p11k934k862L2535J5778j4277j3214j2691j8411j0204j9372L686P162
12059a288j1995n553L640R100J8934L0407k753k0719q832r206p626J204K5089
12046B0402J0900n993l880k351j409J1814O511n574N219N414j841k6422p528L858
12032I120J2360q663j7141Q299R527j9417j4112p122O423j1238m21J7088K0065
12019D768J3758M085j4868r131q045O662J3149p16k7106k3403L863n38K6128J504
12005i890j4851K7508J0344K160J486k7148K610J7963m816j8554j7472K2707K5913
11992A7960L2000K132m1138L792K5531j9218o964K0469J0292l9324j6649k0369
$$ plain form
12085 20151 27298 21654 24409 36048 26842 25443 41805 45622 34707 17520 10072 33974 34227
12072 34227 33516 30582 27720 60255 76033 61756 48542 35851 17440 7236 -12136 -8450 -1288
12059 -1288 -13283 -18836 -15196 -6096 12838 43245 40492 19773 10941 1735 -5891 -4687 20402
12046 20402 31302 25309 21429 19078 17669 29483 35994 30420 35639 41053 39212 12790 5262 9120
12032 9120 21480 12817 -4324 3975 13502 -5915 -20027 -27149 -20726 -31964 -32385 -15297 4768
12019 4768 18526 22611 7743 -1388 -9433 -2771 10378 9662 -17444 -40847 -36984 -37522 -11394 -9890
12005 -9890 -24741 2767 13111 15271 16757 -10391 -7781 10182 5366 -13188 -30660 -7953 17960
11992 17960 49960 52092 10954 14746 40277 21059 14095 34564 44856 5532 -11117 -31486
11980c1486K8018O1445R004j8363q233m3927j4051j2585K757O320R066N72r473
11967b0936K5671r754k593m742l246K5992M5458L63k5629k2760j8311m0255P67
11954d9975k037J3592O152L4006M401K010K2411O949j3329k612j4722j3830J944
11941e040M919o191O496J1114L881J6755J781k6907j7289l234J2532J4637l3107
11928a9653j7931Q879K0986R689q79J0909l969k043k832P449R976j7120N180P471
11914A6112j3161q689N251J3673J7303R591n22J022k1711K163L749n304p726J0212
11900B1963k709j6154J6332O707j4296J4091J3934k6329j2426k662r747l264J5281
11887G21l740k1603L6126L6652J212k68j5975j7856j5863l066K1239p480L042
$$ plain form
11980 -31486 -3468 57977 66981 48618 40385 -3542 -17593 -30178 -27421 -21101 -12035 -11463 -20936
11967 -20936 4735 -5019 -7612 -12354 -15600 10392 55850 56213 30584 7824 -10487 -50742 -49975
11954 -49975 -52012 -38420 -32268 1738 6139 8149 30560 37509 24180 21568 6846 -6984 -5040
11941 -5040 -121 -6312 184 11298 15179 31934 33715 6808 -10481 -13715 -1183 13454 -19653
11928 -19653 -37584 -28705 -7719 1970 1091 12000 8031 5988 3156 10605 20581 3461 8641 16112
11914 16112 2951 -5738 -487 13186 30489 40080 39558 40580 18869 21032 24781 19477 11751 21963
11900 21963 19254 3100 19432 26139 11843 25934 39868 13539 1113 -1549 -11296 -14560 721
11887 721 -3019 -24622 11504 48156 49368 49100 33125 15269 -594 -3660 17579 10099 13141
11874A3141J4937j0692o845Q194j2674k9851K7651J2584L09k3134j8337R14K8649
11861D846j462n377l5579p208K6388K7103Q381O137k4312p319J5011O088j1138
11848A559j0701J57K4908J7320k3154L198j343m276o137j2129O836p338j0563
11835b1663P674J114r878j1614j4389j0747J7340P620j1697L436K3399N854o206
11822a9757K2580p361Q589J284j2736j079L9552K0930j1901p669j4127j2061j3833
11809g589K3999R272j5681k4756L647K6988J48n959K5531J6283L545k2463N363
11796C8328j600q407j186j2153J2900k1895l4499Q802Q519J4829r944j0011n696
11783b2013L887Q581J0381J5085j0715j1956l732J9547n748j1774j2690j4787
$$ plain form
11874 13141 28078 17386 10541 18735 6061 -23790 3861 16445 16754 -6380 -24717 -23803 4846
11861 4846 3384 -1993 -37572 -44780 -18392 8711 17092 23229 -1083 -8402 6609 12697 1559
11848 1559 -9142 -8985 15923 33243 10089 13287 11944 7668 1531 -10598 -3762 -11100 -21663
11835 -21663 -13989 -12875 -22753 -34367 -48756 -59503 -42163 -34543 -46240 -42804 -19405 -13551 -19757
11822 -19757 2823 -4538 4051 5335 -7401 -8480 31072 52002 40101 32432 18305 6244 -7589
11809 -7589 16410 25682 10001 -14755 -11108 15880 16028 10069 35600 51883 55428 32965 38328
11796 38328 36728 28321 27135 14982 27882 5987 -28512 -19710 -11191 3638 -6306 -16317 -22013
11783 -22013 -18126 -9545 836 15921 5206 -6750 -10482 9065 3317 -8457 -21147 -35934
11771c5934j3877K3354K6942m053j404J6197K0480r282m542k6895p996P004L140
11758f866k416j0635p443R197n07j3908j828J6232j382K911j0263k6535J7468
11745c5975R848Q565J2K403j0118r72p802K5106K0741J2646m73j5093j9548J8539
11731G879M212o745J1753q173l452k675J388K6640o749o708O85k0741j7423M72
11717a9637j8449n52J2253Q298K5140J6487Q148j0786k8550J1474K2345m607q409
11704A3155R973l571m666K4134p14J7966r771k5984l3955k3613J6998L1453M813
11691A6218k1321L129J2938P290R67r949Q346M621n126J7083j0400r996K8273
11678D2073J695n984j2062j4019j7335j3272o279J0110j1114L310J4049K29j6430
$$ plain form
11771 -35934 -49811 -26457 485 -3568 -4972 11225 31705 22423 17881 -9014 -17010 -10006 -6866
11758 -6866 -9282 -19917 -27360 -18163 -18670 -32578 -34406 -18174 -19556 -16645 -26908 -53443 -35975
11745 -35975 -26127 -17562 -17550 -15147 -25265 -26237 -34039 -8933 11808 24454 23981 8888 -10660 7879
11731 7879 12091 5346 17099 8926 5474 2799 4187 30827 24078 17370 18055 -2686 -20109 -19637
11717 -19637 -38086 -38638 -26385 -18087 7053 23540 31688 20902 -7648 3826 26171 21564 13155
11704 13155 23128 19557 14891 39025 38311 56277 46506 20522 -13433 -37046 -20048 11405 16218
11691 16218 -5103 -1974 10964 18254 19221 9272 17618 22239 17113 34196 23796 13800 42073
11678 42073 43768 37784 25722 11703 -5632 -18904 -25183 -15073 -26187 -22877 -8828 -8599 -25029
11665b5029J1859L3061L4000o358l4057k5278J1635L670O995O29k4728j8650Q639
11652b3612J5124j0941j3630K9271J5501j5795j9580J691Q976L198J9702K8447
11640C8352K095J5769q623k3029j9612l4430j9481k58P025J6534J3559P650j5974
11627b0423r40l416l400J8045q393n585J792n053q253K2398R351L345Q431Q628
11613A6527j665j495j4748k0944n955K2370P816L396J113j1074o198k308k163
11600a5328j0547K142m989J4718K2432R289j8830j8429N490N013o072l565O033
11587a2643J6688J4685k1372Q396l061n891J5453N760q966J6333K3098j6933j4927
11574A6620J3573J4070k816R030m121k0578j8313P782O18j9015j2655l14Q584
$$ plain form
11665 -25029 -13170 19891 53891 47533 13476 -11802 -167 3503 10498 11127 -13601 -32251 -23612
11652 -23612 -8488 -19429 -33059 -3788 11713 -4082 -23662 -21971 -12995 -9797 9905 38352
11640 38352 40447 56216 47593 24564 4952 -29478 -48959 -49217 -42192 -25658 -12099 -4449 -20423
11627 -20423 -21363 -24779 -28179 -10134 -18527 -24112 -22320 -27373 -35626 -13228 -3877 -532 7899 16527
11613 16527 14862 13367 -1381 -22325 -28280 -5910 1906 5302 6415 -4659 -10857 -13165 -15328
11600 -15328 -25875 -23733 -28722 -14004 8428 17717 -1113 -19542 -14052 -9039 -15111 -18676 -12643
11587 -12643 4045 18730 -2642 5754 2693 -3198 12255 18015 9049 25382 48480 31547 16620
11574 16620 30193 44263 41447 50477 46356 25778 7465 15247 15865 -3150 -15805 -16119 -7535
11561g535J877n419Q743J6150r985l27k9232j2876J8237o76Q402Q812k7750j6430
11547d8009K910R286J7144J8640K264p363r505n645Q18L209l2k7679M966L815
11533c5181P219J6922K970n937Q544L2794P913j8849l224J6471M374j2301J184
11520B2899J2418q710k1718m942R849N646k5055j5466o381L273Q070J2886J0708
11507C477j0076R036N275J1197j2632j3517R62O045K0314K0304J478l261J1325
11494D9927n561l5102k0922r179L7764L3079j9490k3844j0164j3540q559J1587
11482a4004Q748j1089j2855M063J9727J94K901p223j609M439p02K424K5713K267
11468B2994P021k9875j0005o913q785K7226K9j0073J7381j2886k042J7416l174
$$ plain form
11561 -7535 -5658 -11077 -2334 13816 3831 3504 -25728 -38604 -20367 -21043 -12641 -3829 -31579 -48009
11547 -48009 -45099 -35813 -18669 -29 2235 -5128 -14633 -20278 -19460 -16251 -16283 -43962 -38996 -35181
11533 -35181 -27962 -11040 -8070 -14007 -5463 27331 35244 16395 13171 29642 34016 21715 22899
11520 22899 35317 26607 4889 -53 9796 15442 -9613 -25079 -31460 -28187 -20117 -7231 3477
11507 3477 -6599 2437 7712 18909 6277 -7240 -6278 -233 20081 40385 41863 38602 49927
11494 49927 44366 9264 -11658 -20837 16927 50006 30516 6672 -3492 -17032 -25591 -14004
11482 -14004 -5256 -16345 -29200 -25137 -5410 -5216 -2315 -9538 -11147 -6708 -7410 -4986 20727 22994
11468 22994 30015 140 -9865 -16778 -25563 1663 1692 -8381 9000 -3886 -5928 11488 8314
11455H314N693J070K432l4130O068O776j7014N091L939m300k270J2586j7200q620
11441c1565J0183j5874j5752L1093J1620J2816j5900j6936j0881J1397J0801o107
11429b5105P310K7460K90o43j218m075K658J1803L572N5j1374j1746j4304n590
11415b0907O631j5397P416J076K3P115j2927l438K3197J9101k1696l2670P444
11402c5032K4953q779j0438R940n341J0757P766L449J7691L890M515l004J173
11389B1540k4035k8260j2768K782L0946J2048n904q970K0786k0919k1312J9116
11377a4950K3847K9256j6094l5445J0228M915J300k7008q469L8931p850r613J5456
11364D504l307j5786j9385p672K6596J9612R982j8373l6130n472J7494K0569N399
$$ plain form
11455 8314 14007 15077 17509 -16621 -10553 -3777 -20791 -15700 -11761 -16061 -18331 -5745 -22945 -31565
11441 -31565 -21382 -37256 -53008 -21915 -10295 2521 -13379 -30315 -41196 -29799 -18998 -25105
11429 -25105 -17795 9665 9955 9312 8094 4019 6677 18480 22052 22107 10733 -1013 -15317 -20907
11415 -20907 -14276 -29673 -22257 -21181 -21158 -14043 -26970 -30408 -7211 11890 -9806 -42476 -35032
11402 -35032 -10079 -18858 -29296 -19356 -24697 -13940 -6174 -2725 14966 18856 23371 20367 21540
11389 21540 -2495 -30755 -43523 -40741 -9795 2253 -3651 -12621 8165 -12754 -34066 -14950
11377 -14950 8897 38153 22059 -13386 -3158 1757 3057 -23951 -32420 6511 -1339 -10952 4504
11364 4504 1197 -14589 -33974 -41646 -15050 4562 14544 -3829 -39959 -45431 -27937 -7368 -1969
11351a969l2405p38J3513N828J4814J5096j7393m26m826J1797q991j6032o213
11338b7945O58l3799m220M1294J0650j456M991K072J0618J2041Q01k0912j5685
11325b0892R005J609J6854N548M274r147j9169j9677J3363R53K8663P907q334
11312A0957q171o637k5502M722O708K083k5959J2815J384J6853K7732N853l3374
11299a0536j8872J7325J0860m780j0332q591O071J3235J3447o710o173M832J0989
11286A0765P626j7505k0229J7490K9319L1674L7759L1280L8648P4742O2517M4426
11274C48512L6113j8459o1299q0253o0172l8867k9260k1172j1049j0153j4215
11263C9726K817Q146k2371k3562J9608O501o995l97L256q34m587l3040k0840K2020
$$ plain form
11351 -1969 -34374 -35112 -21599 -15771 -957 14139 -3254 -3680 -8506 3291 -5700 -21732 -27945
11338 -27945 -27287 -61086 -65306 -24012 -13362 -14818 -9827 -7755 2863 14904 15705 -5207 -20892
11325 -20892 -11887 -10278 6576 12124 16398 7251 -11918 -31595 -18232 -17279 11384 19291 10957
11312 10957 2786 -3851 -29353 -24631 -17923 -15840 -41799 -28984 -27600 -10747 16985 22838 -10536
11299 -10536 -29408 -12083 -1223 -6003 -16335 -24926 -18855 -5620 7827 1117 -5056 -224 10765
11286 10765 18391 886 -19343 -1853 27466 59140 96899 128179 166827 241569 304086 348512
11274 348512 384625 366166 304867 224614 164442 125575 96315 75143 64094 53941 39726
11263 39726 42543 50689 28318 4756 24364 30865 23870 23473 26729 25895 21308 -11732 -32572 -10552
11249a0552K3326J0753p515q441J1533O968p789J717Q917R353k680j1050j9282
11236E258J346Q99j7940R257K088R83P917k5114k3312K946J7503l425j4453J2002
11222b4045Q071J092l6004m154J2197R567k1281L571J4643J4676J7691L788l1370
11209c1558j2764P396K0976J3126O152q643n654n289K5503Q697j8970l186j7158
11196b1372n166J6185J8251J4684k1774k366m562l780l048N733J3594o241J75
11183C13L080N912j6671Q163J2834j2223J4194K231n534j0171k026J8358J9741
11170C8201J7840M878P272N5152R5530P8870m798j8535L4747P343k5218j04315
11158A86967n9124m4222k3483r877k111j3977J3302m399N7r931j7318j1111N68
$$ plain form
11249 -10552 12774 23527 16012 7571 19104 26072 18283 20000 28917 38270 35590 24540 5258
11236 5258 6604 7503 -10437 -1180 908 1891 9808 -15306 -38618 -35672 -18169 -21594 -36047 -24045
11222 -24045 -15974 -14882 -50886 -55040 -42843 -33276 -54557 -50986 -36343 -21667 -3976 -188 -31558
11209 -31558 -44322 -36926 -15950 -2824 3328 -5315 -10969 -16258 9245 17942 -1028 -4214 -21372
11196 -21372 -26538 -10353 7898 22582 808 -1558 -6120 -9900 -12948 -7215 6379 138 313
11183 313 3393 9305 -7366 797 13631 1408 15602 17833 12299 2128 102 18460 38201
11170 38201 56041 60919 68191 123343 218873 297743 292945 274410 309157 316500 291282 186967
11158 186967 127843 83621 60138 50261 48150 34173 47475 43076 43133 33202 15884 4773 5341
11145E341k1600J9229J6669N494k4894k8463j2548J6446J5384O037J2440l124
11133F411k75q297k1332R525J5420P239L692J2588J7237j1284j739j3594l5852
11120b0261j2010K0561R282k5698j6756P583Q366j2448J2786K0862l019j9371
11108c0123o758J0897K6732K1084j7135j6395l126p045R061L1760J5387j6117
11096A8222j9054j0994n941k947L6546k508j7862o954q653P092J6685L9372J2938
11083E5942j9464k9382k8836j2707Q021l164m192K9133L0719L169j0826L668j1520
11070A0561l752Q69j5593k1157L973J7680k4376k6106p327K8114J8691J0040j8761
11057b7144r800O324J4645K712J1005J0493j2099L293j9926l151K7896J6904m946
$$ plain form
11145 5341 -16259 2970 19639 25133 239 -28224 -40772 -24326 -8942 -2905 9535 6411
11133 6411 6136 -2161 -23493 -13968 1452 8691 12383 24971 42208 30924 29185 15591 -20261
11120 -20261 -32271 -11710 -2428 -28126 -44882 -37299 -28933 -41381 -28595 -7733 -10752 -30123
11108 -30123 -36881 -25984 748 21832 4697 -11698 -14824 -21869 -12808 18952 34339 18222
11096 18222 -832 -11826 -17767 -20714 15832 13324 -4538 -11492 -20145 -13053 3632 43004 55942
11083 55942 36478 7096 -21740 -34447 -26426 -29590 -33782 -4649 26070 29239 18413 22081 10561
11070 10561 6809 7678 -7915 -29072 -25099 -7419 -31795 -57901 -65228 -37114 -18423 -8383 -27144
11057 -27144 -36944 -30620 -15975 -13263 -2258 8235 -3864 -571 -20497 -23648 4248 21152 16206
11044A6206j4360L729r006J293j7980K405k409L246j4689J0463K6173J5260R133
11031B9464k0314j2944n045r506P541M522M829J2506J5520j656Q099j3229j1093
11018H694O460J6736K922L983j3029n233j7794K592N961K98O298J420j0625l638
11004E045J7225q610M583j3595O06o522n368m405Q201q355r590o875J619K804
10990b3237N463J0769l889J402Q526L320J235J5290r420k5334J6418j0247j2626
10977b2330l030J1262J7498l0629l0887n054N681J0000K5302K171K113J8061J195
10964A353j2750J440J7293J4278j023N148j615l3796j2914m453K3204J6503k5887
10951a3219j6077J0170P29J1129k3929j9996J431R101J0657K8856r414j4790j3057
$$ plain form
11044 16206 1846 5575 -3431 -2138 -20118 -17713 -20122 -16876 -31565 -21102 5071 20331 29464
11031 29464 9150 -3794 -8839 -18345 -10804 -6282 -1453 11053 26573 24917 33016 19787 8694
11018 8694 15154 31890 34812 38795 25766 20533 2739 5331 11292 11590 17888 19308 8683 5045
11004 5045 22270 13660 18243 4648 5254 -1268 -6636 -11041 -2840 -11195 -20785 -27660 -26041 -23237
10990 -23237 -17774 -7005 -10894 -9492 -966 2354 3589 18879 9459 -15875 543 -9704 -22330
10977 -22330 -25360 -14098 3400 -27229 -58116 -63170 -57489 -47489 -22187 -20016 -17903 158 1353
10964 1353 -11397 -9957 7336 21614 20591 25739 24124 -9672 -22586 -27039 -3835 12668 -13219
10951 -13219 -29296 -19126 -18397 -7268 -31197 -51193 -49762 -40661 -30004 -1148 -10562 -25352 -38409
10938c8409K4514J8325j5381K03N728K5171l252j1384j9590j4294M157j0091K2867
10925a1436Q012j4828O962K1384n740n695l3790P778N834k931l284K6161N010
10912C437J1247j5552l0930j2255O064J4039J9452J5658k557R190P644J3447N126
10899D4010j1930j7781L686O748n537J0074p03m6901j4294K1024P600O298J4203
10886A6497J8168j9752j0094J0352K1668J3931o544j0661j6572j575N103j0461
10874A0060j984j7476K069J2160J4553k1140J9322K6970j5407l979k8479l70R318
10861E617N034l460R684j0687p91r000q733J1921K1251M881P158l838l98o444
10847B2195j694j7796J6030l244q006J608Q239J2604j265k2929k4505j0268O375
$$ plain form
10938 -38409 -13895 4430 -10951 -10748 -5020 20151 16899 5515 -14075 -28369 -24212 -34303 -11436
10925 -11436 -3424 -18252 -11290 10094 4354 -1341 -35131 -27353 -21519 -24450 -27734 -1573 3437
10912 3437 14684 -868 -31798 -44053 -37989 -23950 -4498 11160 8603 17793 25437 38884 44010
10899 44010 32080 14299 17985 24733 19196 29270 28567 -18334 -32628 -11604 -4004 2294 16497
10886 16497 34665 14913 4819 15171 36839 50770 44226 33565 16993 15418 20521 10060
10874 10060 8076 -9400 -7331 4829 19382 -1758 17564 44534 29127 25148 -3331 -3701 5617
10861 5617 10651 7191 16875 6188 5397 -3603 -12336 -415 20836 25717 32875 29037 28639 22195
10847 22195 20501 2705 18735 15491 7485 9093 17332 29936 28671 5742 -18763 -29031 -22656
10834b2656O702J853P370J8076J055j0993k039p273O973J311l2187R241k013r36
10820b5516l472j3136K1312J1960m180k3912P35K0986J3106l143o325L834j694
10807i445J8759P762L469j2006j2845j3728R842L665j037j6852k764L0954J8678
10794B4452J4257K284l2804k1446O870O218j1969P712K811m528j8227j4842j89
10781c9401J5940J3005j1310L672J0762K7976n451j2431J4962J9837K520j6194
10769B3887k7503o572J5753N157q367k025j2173j0449J3727j4856N61L334j0007
10756b9533l692J2077J2198L2923k5164k0050M29l637m359j1833n751L9201Q255
10743A064O59Q538r447R28J7626p263q489l5803k0461K0339K6771K2856l006l1251
$$ plain form
10834 -22656 -15954 -14101 -6731 11345 12400 1407 -632 -7905 -932 379 -31808 -22567 -24580 -25516
10820 -25516 -28988 -42124 -20812 -8852 -13032 -36944 -36209 -15223 -2117 -5260 -11585 -7751 -9445
10807 -9445 9314 17076 20545 8539 -4306 -18034 -8192 -4527 -5564 -22416 -25180 5774 24452
10794 24452 38709 40993 8189 -13257 -6387 -169 -12138 -4426 -1615 -6143 -24370 -39212 -39401
10781 -39401 -23461 -10456 -21766 -18094 -7332 20644 15193 2762 17724 37561 40081 23887
10769 23887 -3616 -10188 5565 10722 2355 330 -11843 -22292 -8565 -23421 -22860 -19526 -29533
10756 -29533 -33225 -21148 -8950 23973 -1191 -21241 -20812 -24449 -28808 -40641 -46392 -7191 1064
10743 1064 1723 10261 814 1742 19368 12105 3616 -32187 -52648 -32309 -5538 17318 14312 -16939
10729a6939j5586j4203L390N099K4762j7468j0955K470R608M068j0016J2883n970
10716b8857K508N9m093o05j2057J312r067n278l157O247K2704J3042j3954p101
10702c8297J2357J0368Q612J7969J0154O741k1828j5822j5986m686k134L385j6980
10689d6147Q0Q069k153L540J2333k6017n645J2374M730R48l218J960l229j5137
10675e7512K989J1414K283K1128O967J4054j043j0618k7760p663P647J5975K1009
10662a130q868K5645L3223k3766j8527r857N280J8541O088j5903m764k892j5645
10649a2575N939l470j099o037J7303J3880k8154j2520L202P36K1984M689m137
10636b59K121k4015k5952K115M00p425L206J7678L0582J6567J0159M505l612k5791
$$ plain form
10729 -16939 -32525 -46728 -43338 -38239 -13477 -30945 -41900 -39430 -29822 -25754 -35770 -22887 -28857
10716 -28857 -26349 -26290 -30383 -30988 -43045 -41733 -50800 -56078 -59235 -52988 -30284 -17242 -31196 -38297
10702 -38297 -25940 -15572 -6960 11009 21163 27904 6076 -9746 -25732 -30418 -32552 -29167 -46147
10689 -46147 -46067 -37998 -40151 -36611 -24278 -50295 -55940 -43566 -38836 -37888 -41106 -39146 -42375 -57512
10675 -57512 -54523 -43109 -40826 -19698 -12731 1323 280 -10338 -38098 -45761 -38114 -22139 -1130
10662 -1130 -9998 15647 48870 25104 6577 -3280 2000 20541 26629 10726 5962 3070 -12575
10649 -12575 -6636 -10106 -11205 -17242 61 13941 -14213 -26733 -23531 -22795 -811 3878 -259
10636 -259 1862 -22153 -48105 -45990 -45590 -53015 -49809 -32131 -1549 15018 25177 29682 26070 279
10622B79j6882J663q472q627J2237q995K9418Q329k0767o117J4640N383j0085
10609g996p650j1036j102j4831P897R421M803j66J3545J4966k4171j98O509K6145
10595A6136L16l2035J024J2951j2201j7711j4951K821O470J1569j1299m409o95
10582d2014K9753J8938l39K0502N003j7144L326r701K3514q916k4275k9388q72
10569c1613R638J2868M928o12l957J1713L3524j3648l7609m501J2442j143n069
10556a3039k0448r47K1952q061P135J2616R454J123N087J0055j5050j2601j502
10543d226J7192P59O711j3337n128m055j819J7618L675l5089m104O142K3573J4787
10529B2699R370j3320j567l69J509j7856L223R64j3391K68q250K557J6051L282
$$ plain form
10622 279 -16603 -14940 -23412 -32039 -19802 -28797 621 8950 -11817 -17934 -3294 2089 -7996
10609 -7996 -15646 -26682 -27784 -42615 -34718 -25297 -20494 -20660 -7115 7851 -16320 -16518 -10009 16136
10595 16136 16452 -15583 -14559 -1608 -13809 -31520 -46471 -43650 -37180 -25611 -36910 -41319 -42014
10582 -42014 -12261 6677 6338 26840 31843 14699 18025 8324 31838 22922 -1353 -30741 -31613
10569 -31613 -21975 -9107 -4179 -4791 -8748 2965 36489 22841 -14768 -19269 -6827 -7970 -13039
10556 -13039 -33487 -34434 -12482 -20543 -13408 -792 8662 9785 14872 24927 9877 -2724 -4226
10543 -4226 12966 13725 20436 7099 1971 -2084 -3903 13715 17390 -17699 -21803 -15661 7912 22699
10529 22699 32069 18749 17182 16813 18322 466 3689 4653 -8738 -8470 -16720 -14163 1888 5170
10515E170P569l043Q884o801j0428j0270N007P771J2815j1812k0652J512N440
10502h838J9491Q879j3208k4180l624J3570J4965K0r436k768m312J3259O577k320
10488H075O126J511L968k150N561l108J1645j984K641P007J0558k2468j1564j219
10474A4599o633k5198j2657J908n415j1377Q06k2273K852K2405m602K5447K8860
10461H722M0k753k2081j0097m45J0507O783k701K5677J4622k9419j1665j3125
10448b5935K2894K4053j801R859O034k1784J1360L3716n023j5043M595Q93K8710
10435G2528J4339k1614l0495k387M442k9957J698J869K686j610J63j6365o485
10422a1188k314J0494J7470Q409r504k7406K1387j955k5110j2089J9414J8963
$$ plain form
10515 5170 12739 9696 18580 11779 1351 -8919 -3912 3859 16674 4862 -15790 -14278 -8838
10502 -8838 10653 19532 6324 -17856 -21480 -7910 7055 7075 -2361 -5129 -9441 3818 10395 8075
10488 8075 14201 15712 19680 17530 23091 19983 31628 29644 32285 39292 49850 27382 15818 14599
10474 14599 7966 -17232 -29889 -27981 -33396 -44773 -43967 -66240 -63388 -40983 -45585 -20138 8722
10461 8722 8762 6009 -16072 -26169 -26614 -16107 -9324 -12025 13652 28274 -1145 -12810 -25935
10448 -25935 -3041 21012 19211 29070 35104 13320 24680 58396 53373 38330 42925 43818 72528
10435 72528 86867 65253 34758 32371 36813 6856 8554 10423 13109 11499 11662 -4703 -11188
10422 -11188 -13502 -3008 14462 22871 13367 -14039 7348 5393 -19717 -31806 -12392 6571
10410F571l361l0778J915L6792j1410j5875K4580l351k253j902O459K985j469
10397H903M576j8107l639k427J132M090K284j9128l4135J097O315J5611L895J1454
10383a8079J9238p461r987Q393j8535J4047l430M744j3027K5882J0673r073P650
10370A1035n972k9698J84j5776j0999K1013l210K1869m19M720j3241j4654P402
10357b7746n119p599Q028J2313P74J4859J5651l0158j0819J4508J6447N710k2886
10344a6037J9975K8540r180l0397j7864r373J1382k399J5694j511O737q147r447
10331b2027M680Q811K925J281J764k26P713J1761k5818K0195k485l1327j0888
10318c3641q312L3805K3477j2611j5371k5019J4667J313p617K3647J1801j0488
$$ plain form
10410 6571 3210 -27568 -25653 11139 -271 -16146 8434 5083 2830 928 7387 10372 8903
10397 8903 13479 -4628 -8267 -10694 -9562 -5472 -3188 -22316 -56451 -55354 -49039 -33428 -29533 -18079
10383 -18079 1159 -6302 -16289 -7896 -26431 -12384 -15814 -11070 -24097 1785 12458 3385 11035
10370 11035 5063 -24635 -24451 -40227 -51226 -30213 -33423 -11554 -11973 -7253 -20494 -35148 -27746
10357 -27746 -32865 -40464 -32436 -20123 -19349 -4490 11161 -18997 -29816 -15308 1139 6849 -16037
10344 -16037 3938 32478 23298 -7099 -24963 -34336 -22954 -25353 -9659 -11170 -4433 -12580 -22027
10331 -22027 -17347 -8536 -5611 -4330 -2566 -2792 4921 16682 -9136 11059 8574 -22753 -33641
10318 -33641 -41953 -8148 15329 2718 -12653 -37672 -23005 -21692 -29309 -5662 6139 -4349
10306d349j4436j1068J417Q250J057O448R922j6568K501J553j1077J6773K8603
10293A9026J7220j4021P648n636J808k212M148r068J1921j7882j9196j6503P715
10280a5032O601p673j8955j0642k539M500K0788K2319J9904k3046r456J5611R222
10267A1602J5447o911J889R755j4804r845p909K1976K286j3865j1369k3131k8997
10254e3876J0517L0886M3658p935j5739k8204j3396k948L4952K0963L050K0875
10242D2803j5432j3179j2029O560q948J5186J8288n627J7138J4413j063k8272
10230B9838k5530N450k7502K961R876O629k0070k969Q469J7525K4120K785j8297
10217A3285k175m215O78R547o319j3862n155R386j613l721N96J2183R152m757
$$ plain form
10306 -4349 -18785 -29853 -28436 -20186 -19129 -12681 -2759 -19327 -16826 -15273 -26350 -9577 19026
10293 19026 36246 22225 29873 24237 26045 23833 27981 18913 30834 12952 -6244 -22747 -15032
10280 -15032 -8431 -16104 -35059 -45701 -48240 -43740 -22952 -633 19271 -3775 -13231 2380 11602
10267 11602 27049 20138 22027 31782 16978 7133 -776 21200 23486 9621 -1748 -24879 -53876
10254 -53876 -43359 -12473 31185 23250 7511 -20693 -34089 -37037 -2085 18878 21928 42803
10242 42803 27371 14192 2163 8723 -225 14961 33249 27622 44760 59173 58110 29838
10230 29838 4308 9758 -17744 -14783 -4907 1722 -18348 -21317 -12848 4677 28797 31582 13285
10217 13285 11110 6895 7573 17120 10801 -3061 -8216 1170 -443 -4164 -3568 8615 17767 13010
10203A3010m580J2860r040j3379k8533p672J8103r09N564N600l273J68P467P787
10189C173Q563j561K300p129j5776q933J2156K3986J3272j2690j3301K208K7953
10176C4221o880r831q695m88M814j313j5702J8782J7587J0451k8916J3658J7137
10163D4825k7717j3832n567J3501R563L003k495J5960n138k2362k3108k90R062
10150d595M3006J2791j9118k7966r575K339o133n235L4995r46Q01m278R826m716
10136B1196j3654j1893j6857o705K8653L474k980k1972r704M174J3077L0430J9596
10123C6835k0471r948l659J3276O744K032O461r980K899j930K969M3491J5509
10110H4228k1542j3323k4203j6516j0068o683K0154K7577J7757m176k8164k2253
$$ plain form
10203 13010 8430 21290 12250 -1129 -29662 -37334 -19231 -20140 -14576 -8976 -12249 -12081 -4614 3173
10189 3173 11736 10175 12475 5346 -10430 -19363 -7207 16779 30051 17361 4060 6268 34221
10176 34221 27341 17510 8815 8327 13141 11828 -3874 14908 32495 42946 14030 27688 44825
10163 44825 17108 3276 -2291 11210 20773 23776 21281 37241 32103 9741 -13367 -13657 -4595
10150 -4595 38411 51202 32084 4118 -5457 -3118 -9251 -14486 20509 19563 20364 16086 25912 21196
10136 21196 7542 -4351 -21208 -27913 740 4214 1234 -20738 -30442 -26268 -13191 17239 36835
10123 36835 16364 6416 2757 16033 22777 24809 31270 21290 24189 22259 25228 68719 84228
10110 84228 62686 49363 25160 8644 -1424 -8107 12047 39624 57381 53205 25041 2788
10098B788j3414l313L234M561J2830R813j2435K508Q955J5308k713o87J1006k106
10084C6335l798K100J3162l849j2457j3766j00N653r254J2608j490r177Q603m17
10070B4153J8080J3466j8257N356K1836N322j4531j431J1757J2682J5384L6069
10058A29886L3772L3586N5957L6232l1081o639K0958M3325L3057O7158J07989
10047E24200J07120J64918K57912L81288N35310R47724J867172L551195O213383
10038A4550222O285509r35019o479133n598503k947311j542558q87643n61779
10030A883785l72969k68287k00967j73945j51270j04291p3787n0127j8361k4032
10020D45749j2254P374k7980p4603o3385k0396q821l4119l2723q286j4118m941
$$ plain form
10098 2788 -10626 -13939 -10705 -6144 6686 16499 4064 6572 15527 30835 28122 27435 38441 36335
10084 36335 32537 34637 47799 43950 31493 17727 17627 23280 14026 26634 25144 15967 24570 24153
10070 24153 42233 55699 37442 42798 64634 69956 55425 53994 65751 78433 93817 129886
10058 129886 163658 197244 253201 289433 258352 251713 272671 315996 349053 416211 524200
10047 524200 631320 796238 1054150 1435438 1970748 2918472 4785644 8336839 14550222
10038 14550222 20835731 19900712 13421579 7823076 4875765 3333207 2445564 1883785
10030 1883785 1510816 1242529 1041562 867617 716347 612056 538269 488142 469781 445749
10020 445749 433495 440869 412889 338286 274901 254505 245684 211565 178842 170556 156438 151497
10008A51497k5203m2160J0015j0450n259m94j0599l1796J103J963j0216k4081
9996D320p293J875k270J4847K472q491j1699k714K2530j904o517k4104R514J1990
9982B556j525j913m122K4082R629K0422O358j9501j3051n011J4035j437J3065
9969D3587J7568k0559P749j0579l4758o806o002m515p459o03L705J3431o652j5127
9955b7020P783R159j7481j6010j7669J6682L0130K3966j2704j0062j1486p029
9943c1741L0584k874p790L157L0273K5389k2541J2528J7094j9342j9107M843j6714
9930C759j3959O889N100n24Q296j917Q503P3k1366j0872J3454j9455O986M3792
9916B8759K551q090n220K8484p183k9043j1287R370J4272n074k3981k8168l937
$$ plain form
10008 151497 126294 84134 94149 83699 78440 77946 67347 35551 36654 38617 28401 4320
9996 4320 -2973 -1098 -3368 11479 13951 5460 -6239 -8953 13577 11673 5156 -18948 -9434 2556
9982 2556 1031 -882 -5004 19078 28707 49129 55487 35986 22935 17924 31959 30522 43587
9969 43587 61155 40596 48345 37766 3008 -3798 -9800 -14315 -21774 -22377 -18672 -5241 -11893 -27020
9955 -27020 -19237 -10078 -27559 -43569 -61238 -44556 -14426 9540 -3164 -13226 -24712 -31741
9943 -31741 -1157 -4031 -11821 -8664 21609 46998 24457 36985 54079 34737 15630 20473 3759
9930 3759 -10200 -3311 1789 1265 9561 7644 16147 16220 -5146 -16018 -2564 -22019 -15033 28759
9916 28759 31310 23220 18000 46484 39301 10258 -1029 8341 22613 17539 -6442 -34610 -38547
9903c8547N549J9365J4044l702q485J8070j895N388R585J5328J4771q551j8201
9890B2719k1376r360l903k2J6533J3246q91j21m136J4289O20j0700j0069l641
9876C188J7464J477j8076M329M938m957J4870Q602j1410j3069M356Q991r362L273
9862A4614N796r387M810k1548r751K3994Q1n985P193R634j083P568K0858K2886
9848F9680J7743R818L5404M7396R7279J56451K70705L73525L06472J8816l01902
9837A101387l84652k69776j40445p1991l7882l7534k4626n1787k9320q896k173
9826D2305k3626j1343N57j427J91R087o235K518K0288m895j3129j3144k3671l138
9812b5662J1473K2615l568r55R694N495J9200o179k7090j0562j21m180K799J4665
$$ plain form
9903 -38547 -32998 -13633 411 -3291 -11776 6294 4399 9787 19372 34700 49471 40920 22719
9890 22719 1343 -8017 -11920 -11942 4591 17837 16946 16825 12689 26978 27598 16898 6829 3188
9876 3188 20652 22129 4053 8382 13320 8363 23233 31835 20425 7356 11712 20703 11341 14614
9862 14614 20410 11023 15833 -5715 -15466 8528 8609 2624 9817 19451 18368 25936 46794 69680
9848 69680 87423 97241 132645 180041 277320 433771 704476 1078001 1384473 1403289 1101387
9837 1101387 716735 446959 306514 234523 196641 159107 134481 82694 53374 44478 42305
9826 42305 18679 7336 7893 6466 6657 15744 9509 12027 32315 27420 14291 1147 -22524 -25662
9812 -25662 -14189 8426 4858 3903 13597 19092 38292 32113 5023 -5539 -5660 -9840 -7041 7624
9798G624K8383J7294k9453k5941m320J1966N540R038J4633k68l1861k9215P31
9785b5849J299m041k1719j100k353J9984J5739Q907N413L351j1033Q848K272q812
9771i094J543O528J4692M011o204Q157j68J1427K411j6486j8781L349K0524l639
9757A8270m864j2588j5671j4269j8424J6911J9372J5704J8372j5992j2627o887
9745a2693L1423P489j3972k500m933j1988j1572N422j0170M49J1720l6679j5930
9732f3934K9787K3119L054K6396Q623l254j4682j1344K7398j486j2159j3219p807
9719i508j3207M98J8214K6070p882j3912n828J7024J2724j0804j5870L1234J0880
9706C9633j4558J8122n616k6974j6755l801J4685R238J1136r886L547k2718j3925
$$ plain form
9798 7624 36007 53301 23848 -2093 -6413 5553 11093 20131 34764 34496 2635 -26580 -25849
9785 -25849 -24550 -28591 -50310 -51410 -53763 -33779 -18040 -9133 -3720 -369 -11402 -2554 -282 -9094
9771 -9094 -7551 -1023 13669 17680 11476 19633 19465 30892 33303 16817 -1964 1385 21909 18270
9757 18270 13406 818 -14853 -29122 -47546 -30635 -11263 4441 22813 6821 -5806 -12693
9745 -12693 18730 26219 12247 9747 4814 -7174 -18746 -13324 -23494 -23045 -11325 -48004 -63934
9732 -63934 -34147 -11028 -7974 18422 27045 23791 9109 -2235 25163 23677 11518 -1701 -9508
9719 -9508 -22715 -22217 -4003 22067 14185 273 -5555 11469 24193 13389 -2481 28753 39633
9706 39633 25075 43197 37581 10607 -6148 -9949 4736 13974 25110 15224 18771 -3947 -17872
9693a7872J652j8286k3155J1000N8178L0283N478l7788l8529L048J6448j5349
9681b4892k3216K2330L7529J5136r391J334L759J1117J6192K6486J346j1895r309
9668E6526o363k0944l592q405L00r877n286K7512k516j6441k780N230l4241J2359
9654h518K7313J2067K838K0622L47k0274k6495j1094K0361M354j5886J901J8177
9641B5713J2200L476j4989k350K5832K0103J2124j6288j0273j1176L0138j611
9629G2899n644l7220L736j327n314J3479q421j6656P773M982J0885k799r272j1908
9615A5193j3476K739k8566j0059K6531l741J6135N2738N414p732m599l4046k8139
9602a1608N729R609K0487O790o976K205R925J1483k2430k9358J5051j6487R748
$$ plain form
9693 -17872 -16220 -34506 -57661 -46661 11517 41800 47278 9490 -29039 -25991 -9543 -24892
9681 -24892 -48108 -25778 11751 26887 17496 18830 22589 33706 49898 76384 77730 65835 56526
9668 56526 50163 29219 25627 17222 17522 7645 2359 29871 27355 10914 8134 13364 -20877 -8518
9654 -8518 18795 30862 33700 54322 54669 34395 7900 -3194 17167 21521 5635 7536 25713
9641 25713 37913 41389 26400 24050 49882 69985 82109 65821 55548 44372 74510 72899
9629 72899 67255 30035 33771 32444 27130 40609 32188 15532 23305 28287 39172 36373 27101 15193
9615 15193 1717 4456 -24110 -34169 -7638 -11379 4756 57494 62908 55176 50577 16531 -11608
9602 -11608 -5879 3730 24217 31007 24031 26236 36161 47644 25214 -4144 10907 -5580 4168
9589D168R674j3381l835j0228J3493M406n172k774M71l942j3944k7297K8401K1460
9575A500J0249j4564j219J8762J6389j10k1155j0401R770o63m084o523K466J1250
9561A1667j4698j2892J7126N314k5394o528K4699L1144L281L1724M868m809j5510
9548D9992l2831j1662J4981j0292k438Q465J1487j9886j1676l555O841J595j7048
9535a6027k1699J3268K5773J5012L636m533N093J1666k075k229L682j8378o104
9522G085l02j6698O601L373j4582r468J5154J0635J1869J3457R212k7516j5320
9509f500m010J3104k6776j0940J2759J2498J913L0816M502j0422j3718q944j2890
9496a8608L0608j4438L280J5283j6780M444M678R51j5355j8791J1282M889j3778
$$ plain form
9589 4168 13842 461 -3374 -13602 -109 4297 -875 -3649 -3178 -7120 -21064 -48361 -19960 1500
9575 1500 11749 -2815 -4034 14728 31117 31007 9852 -549 9221 8558 4474 -2049 417 11667
9561 11667 -3031 -15923 1203 6517 -18877 -25405 -706 30438 33719 65443 70311 65502 49992
9548 49992 17161 5499 20480 10188 7750 16215 27702 7816 -3860 -7415 -574 1021 -16027
9535 -16027 -37726 -24458 1315 16327 19963 15430 20523 32189 30114 27885 31567 13189 7085
9522 7085 6783 -9915 -3314 59 -14523 -23991 -8837 1798 13667 27124 36336 8820 -6500
9509 -6500 -10510 2594 -24182 -35122 -22363 -9865 -7952 22864 27366 16944 3226 -5718 -18608
9496 -18608 12000 -2438 842 16125 -655 3789 8467 9418 -5937 -24728 -13446 -8557 -22335
9483b2335k46P565J2213J0410j3731J718j8132K3400J4637j1873J8505L2519K2431
9470G7081k666j1933j0503j0662k0783o727k462K5766K4058qJ8827k4159l1245
9457B4584j5542J3652j6003K19Q280J0039j0055R86j0619n641J9247J6229J0037
9444D5413k269k804n328J2470J6345q425j4285J422j6829J2973J9414L715k114
9431E9698j0619j0143r858J761p678j0128m90K2688M1546q77j1155j6730P445
9418E5460J968k5443n444O40K6058L0193J8185j0745l0561l703K8096J8339j4968
9405H8075J4805R084q365Q129j1126n020j5266J223J8304K5941K1482J8450Q39
9392A66555j2810j2466j6294j0618J3768L751J8559R243L9588M873K8657M340
$$ plain form
9483 -22335 -22581 -15016 -2803 7607 -6124 -4406 -22538 862 15499 3626 22131 54650 77081
9470 77081 74415 62482 51979 41317 20534 13807 11345 37111 61169 61161 79988 55829 24584
9457 24584 9042 22694 6691 6910 15190 25229 15174 16160 5541 -100 19147 35376 45413
9444 45413 43144 40340 35012 47482 63827 55402 41117 42539 25710 38683 58097 61812 59698
9431 59698 49079 38936 29078 30839 23161 13033 12543 35231 76777 75900 64745 48015 55460
9418 55460 57428 31985 26541 27181 53239 83432 101617 90872 60311 56608 84704 103043 88075
9405 88075 102880 111964 103599 111728 100602 95582 80316 81539 99843 125784 147266 165716 166555
9392 166555 153745 141279 124985 114367 128135 131886 150445 159688 199276 204149 232806 237146
9380B37146l798J3801K6537K3623K0773J9775J3298N151M979K1681L6694J9066
9368D38726K8556M4012N2085O5384M4783P2090O5192P7335Q4266Q9761J16131
9357A178321J34593J61889J25922J46861J67238J68102K07221J92433K05726K40932
9347B929238K01234J53625J12663K3799L890n5883q9035j55532j99953k13918
9337B710128k10736k17323j99921j69595j63799j40224j14525r5805j20887j45826
9327A131487r3132o5254p6849q7538n7084n9315o1588k0885j5010j9142l8801
9316E36889m7390k4839m9152k0477O076j7389p667j5479l2197j0274n9150m2214
9304B16737J9819n161P709M909k0168m214R339j5223p537m087o322o767n440j5382
$$ plain form
9380 237146 233348 247149 273686 297309 318082 337857 351155 356306 361285 382966 419660 438726
9368 438726 467282 511294 563379 628763 673546 745636 810828 888163 972429 1062190 1178321
9357 1178321 1312914 1474803 1600725 1747586 1914824 2082926 2290147 2482580 2688306 2929238
9347 2929238 3130472 3284097 3396760 3420559 3424449 3368566 3279531 3123999 2924046 2710128
9337 2710128 2499392 2282069 2082148 1912553 1748754 1608530 1494005 1398200 1277313 1131487
9327 1131487 1038355 973101 896252 808714 751630 692315 630727 609842 594832 575690 536889
9316 536889 489499 464660 415508 395031 401107 383718 376051 360572 328375 318101 258951 216737
9304 216737 236556 231395 239104 244013 223845 219631 228970 213747 206210 202123 195801 189034 183594 168212
9290A68212J3019J645j9763k529j1053k6524k6526j7107K3292J2042j2215q580
9278I3913p851K7647J7205k9784l0939K0512J1586j6239J074q505j1715J2222
9266G9126J4448p041Q559r402N652P442K547j5412j9818j6782L657J2462R299
9253G4737j575j0831J9047K689j250Q962o666J6330k493p135L110N192M410J2896
9239A17423r575k0312l3671j2331J3446j0829p664L975K1014P301J2101O234p380
9226G9732m4695L025J0982J4463K8499P598k4837j1317Q425Q473o43j068q33L480
9212H1284j6733k8091q585J5584N19Q25Q784n174q740K5323L8794J5851j0052
9199A09589l8620l1821j503r366p34J8000M478n974q130k020l1831p833k3063
$$ plain form
9290 168212 181231 182876 163113 160584 149531 123007 96481 79374 102666 114708 102493 93913
9278 93913 86062 113709 130914 101130 70191 90703 102289 86050 87124 78619 66904 79126
9266 79126 93574 86533 95092 85690 91342 98784 101331 85919 66101 49319 52976 65438 74737
9253 74737 73162 62331 81378 84067 82817 91779 85113 101443 98950 91815 94925 100117 104527 117423
9239 117423 107848 87536 53865 41534 54980 44151 36487 40462 61476 68777 80878 87112 79732
9226 79732 35037 38062 49044 63507 92006 99604 74767 63450 71875 80348 79705 78637 77804 81284
9212 81284 64551 36460 27875 43459 43978 44803 53587 48413 39673 64996 103790 119641 109589
9199 109589 70969 39148 37645 28279 27545 45545 50023 44049 35919 33899 2068 -5765 -28828
9186b8828k375o111O470K1984L3396K1359j0202m514L3396J6180j0195l1397k1809
9173A7354J831L917j8566k552Q064J0264Q062j464L100l306J018o387l400L0176
9159D8111R959k2243n45j5760j3775r065R42j4131r244Q481Q881J46K8040R599
9145B9396j468R052j0771m297j0233n829J5861J5382j977j7886N913j0204R666
9132B2605j2406j6876m707j008N323J3088Q814j9641j2229q374j9062J5406J1537
9119a7530N555l989M591J2992R586M674l585l569J3742N499k6700Q68J5628K8543
9105D6305j6545o164m044k0694j0877J2113Q748J4454q803K228N064k4489J9424
9092A6720K3383k4369j1967K8678p61k1501J429k600j0701K3680j3786o083J0587
$$ plain form
9186 -28828 -31203 -37314 -30844 -8860 24536 45895 35693 31179 64575 80755 70560 39163 17354
9173 17354 19185 23102 4536 1984 10048 20312 28374 26910 30010 26704 27722 21335 17935 48111
9159 48111 58070 35827 35282 19522 5747 -3318 -2376 -16507 -25751 -17270 -8389 -8243 19797 29396
9145 29396 27928 36980 26209 21912 11679 5850 21711 37093 35116 17230 23143 12939 22605
9132 22605 10199 -6677 -11384 -12392 -7069 6019 14833 -4808 -17037 -25411 -44473 -29067 -17530
9119 -17530 -11975 -15964 -11373 1619 11205 15879 12294 8725 22467 27966 1266 2134 17762 46305
9105 46305 29760 23596 19552 -1142 -12019 94 8842 23296 14493 16721 21785 -2704 16720
9092 16720 40103 15734 3767 32445 31684 10183 11612 9012 -1689 21991 8205 2122 12709
9079A2709K0742j2866r213r470K1409J0407j1113r163q819L171K5312k3114j6006
9066f014m725o58P326J2721O845j1265P611l7525j7214K1333M9102J0208m807
9053C2938k433o343m720j9409J2958J5232n986o670K2971k1054J83O236J0828
9040C4731Q335j1857q012K148J1497K396l905r685k3106j4283K610o008K5016
9027I877p108j1251j2585M287K5329R60j7066r672J5803J3017k814J1825o67k7106
9013g171O907j733K7033k57n809k4398q23Q160J2786J4498j2480o99Q359Q994
8999C3367k2832k0023J3667K7826L2046K6010l3805l9976l5359L238n465L152
8987a8154J5637r696N127N396n173O24J2000K0077l56n339P480O217k393k1786
$$ plain form
9079 12709 33451 20585 11372 1902 23311 33718 22605 13442 4623 7794 33106 9992 -6014
9066 -6014 -10739 -11397 -4071 8650 15495 4230 11841 -25684 -42898 -21565 27537 37745 32938
9053 32938 30505 24162 19442 33 12991 28223 22237 15567 38538 17484 17667 23903 34731
9040 34731 43066 31209 23197 25345 36842 39238 35333 25648 2542 -11741 -9131 -15139 9877
9027 9877 2769 -8482 -21067 -16780 8549 9509 -7557 -17229 -1426 11591 8777 20602 19935 -7171
9013 -7171 -264 -1997 25036 24779 18970 -5428 -6251 1909 14695 29193 16713 16014 24373 33367
8999 33367 10535 -9488 4179 32005 64051 90061 56256 16280 -19079 -15841 -21306 -18154
8987 -18154 -2517 -12213 -7086 -1690 -6863 -6239 5761 25838 25482 20143 27623 33840 31447 9661
8973I661j6917K4495J0119L422K4149j2382l2950m255L2120K7081j5752j1258
8961C7533k482M860j3542J4529k3882k4729o840M034M843R445P05q339K545O498
8947E178r536J9457r358j9339n085K0444J2395J0264j2613l267j7492J2688R45
8934D681J1119K3891l738o842j0747p831q348j5661k982R436L311K2053J6700
8921C5042m551n201j1069K638Q343j4828j1893M59n140L3109K4226k7491o020
8908A7624j6514J7339J6973m828k4940p405j4455J1065r182R751p782J6931J339
8895E916r059J1880j1967n102L671j3843k0549Q96M2801R325k7641J950K6737
8882A5015j59k0586J3735J4776P558j899p408p481Q037j0010k924o65j4638l247
$$ plain form
8973 9661 -7256 17239 27358 30780 54929 42547 9597 5342 37462 64543 48791 37533
8961 37533 35051 39911 26369 40898 17016 -7713 -14553 -10519 -5676 3769 4474 -3865 -1320 5178
8947 5178 -4358 15099 5741 -13598 -18683 1761 14156 24420 11807 8540 -8952 3736 4681
8934 4681 15800 39691 35953 29111 18364 10533 2185 -13476 -16458 -7022 -3711 18342 35042
8921 35042 30491 25290 14221 16859 25202 10374 -1519 -1060 -6200 26909 51135 23644 17624
8908 17624 1110 18449 35422 30594 5654 -1751 -16206 -5141 -14323 -4572 -12354 4577 5916
8895 5916 -3143 8737 -3230 -8332 -4661 -18504 -39053 -38157 4644 13969 -13672 -11722 15015
8882 15015 14856 -5730 8005 22781 30339 28440 21032 13551 21588 11578 8654 7989 -6649 -9896
8868i896L0794J4804J594L003k176N247n20j4234k1114k7713Q343K7498J8083
8855C3713n58L647j4738j4910J2856l258k6076L273J1638R65K772j3647K856L0659
8841B9192j3365j0859K110j1038j5227R02K7616j838N626J8755J879k3416l533
8828F804q203q250l922l804m405l066J309J2599J9450l834J4478j2325j7299M450
8814f018J0388l016l0383p177Q4L931J1628l900K326K4842n492j9025j691Q122
8800a5381j2430K2519K072J4791k161j7248l2932J8283J5333j1867K07Q02j0908
8787b8920L160q863J4724J4278q79j1323k0999K0387L2627m010j36j2663n587
8774h204j3845K4017L1125J6896p527r934j3061l5263K785l744j0285J1438L687
$$ plain form
8868 -9896 20898 35702 37296 40299 38123 43370 42850 28616 7502 -20211 -11868 15630 33713
8855 33713 33155 36802 22064 7154 20010 16752 -9324 -6051 5587 6552 9324 -4323 -1467 29192
8841 29192 15827 4968 7078 -3960 -19187 -18285 9331 7493 13119 31874 33753 10337 6804
8828 6804 -1399 -9649 -13571 -17375 -21780 -24846 -23537 -10938 8512 4678 19156 6831 -10468 -6018
8814 -6018 4370 1354 -29029 -36206 -36122 -32191 -20563 -24463 -22137 2705 -2787 -21812 -23503 -15381
8800 -15381 -27811 -5292 -3220 11571 9410 -7838 -40770 -22487 -7154 -19021 -18814 -18012 -28920
8787 -28920 -25760 -34623 -19899 -5621 -6500 -17823 -38822 -18435 14192 10182 10046 -2617 -8204
8774 -8204 -22049 1968 33093 49989 42462 32528 19467 -15796 -13011 -16755 -27040 -15602 -11915
8761a1915j1556L257K6274Q855j5978k7337L04J4662n346J0146K8795J5087j8105
8748A7143l1256j5927J8611J3098k273j6131o72l656Q888L29J0161K095J0596
8735A1006L145j5878J284J1917J4267j1051j0647r742Q889L538K0097m039j2988
8722I798J3523K2437N024K566m1425L519J9937J3608P526l3835q057J1894n701
8709B0814Q028J1118J8027J5314j4040k57k1008l4315j0900L3677M9013J2468
8697H7939k644k4671p937N772o835M830j7727M378j1457M574p353K1081J1810
8684F1760j4242k1994j900o779L076J0863j8434q831K3139J0021j6169j2865o539
8671A106j467J3204R020J6876o457j4876J6510l084n486R915j433M737K0202K2992
$$ plain form
8761 -11915 -23471 -20214 6060 14915 -1063 -28400 -28096 -13434 -18780 -8634 20161 35248 17143
8748 17143 -14113 -30040 -11429 1669 -604 -16735 -17407 -21063 -12175 -11846 -1685 410 11006
8735 11006 14151 -1727 -443 11474 25741 14690 4043 -5699 3190 6728 26825 22786 9798
8722 9798 23321 45758 50782 53348 11923 15442 35379 48987 56513 22678 14621 26515 20814
8709 20814 28842 39960 57987 73301 59261 59004 37996 3681 -7219 26458 75471 87939
8697 87939 85295 60624 52687 58459 51624 56454 38727 43105 31648 36222 28869 49950 61760
8684 61760 47518 25524 23624 16845 19921 30784 12350 3519 26658 36679 20510 7645 1106
8671 1106 -361 12843 21863 38739 32282 17406 33916 30832 25346 35261 33828 38565 58767 81759
8657H1759K923j1804n4894k9683Q458R414P458O513M970R676J4553r681J2635
8644E2297P526L8913M6824M9556O1535Q8544P2213m6006j12944p7341m4864j0189
8632A26064r799l0945k3631l0539J1533R497j1845J4646R02J2819n457j2200J4324
8619F5369M4350k3005l9555o565M506L531J5826K8598J0891j9276J6472K4834
8607A25976K5700j2637k3473O736K8121J4172Q211J0225N9071N0522M2227J11578
8595D46429J62810J98662J67544j4934j75748j61606p8317l2094k6621n4251m6773
8584C85101l2920n3343j8011J7629p067m1919k8074j7392m5382l1894j1924j4310
8572A00494K323J798n764k712m51K4319l807j9998j0496O076k214j7403m151j6689
$$ plain form
8657 81759 84682 72878 17984 -11699 -3241 6173 13631 20144 25114 34790 49343 39662 52297
8644 52297 59823 98736 145560 195116 256651 345195 417408 371402 258458 181117 136253 126064
8632 126064 116265 85320 61689 31150 42683 52180 40335 54981 55883 68702 63245 51045 65369
8619 65369 109719 86714 47159 40594 45100 48631 64457 93055 103946 84670 101142 125976
8607 125976 151676 139039 115566 122302 150423 164595 172806 183031 242102 292624 334851 446429
8595 446429 609239 807901 975445 960511 784763 623157 544840 512746 486125 431874 385101
8584 385101 352181 298838 280827 298456 291389 249470 221396 204004 158622 126728 114804 100494
8572 100494 102817 104615 98851 96139 95688 120007 116200 96202 85706 91782 89568 72165 68014 51325
8558E1325L013R860Q91n767K9837K1314L3038K1793L5815Q6633Q5485Q982p8817
8545C03402r1222n7293k2269o72m8421k7875R541J1747p524R75K8362N020j2014
8532I1757r54q728J12k6737k790J51j852J6407k4998J213J0699R115M101r208
8518E8288M840l857Q37m515N171n66P702J109j308j8508j2207o657O772m910J2549
8503D4740J6072n663p622L0219l30m716J9327K8961J4931j999J2165k6631k2088
8490I7366k7895q220p814j6013K038J1324K0815j3114j0769p798j2897Q422J4497
8477D9942j3504j13P407R986l85j5748n830n732q144l247K396J720r295Q1o908
8462B626j955K1667k673N23L0250M418j0766j522P146m206j8630R762j0843j9457
$$ plain form
8558 51325 54338 64198 65089 59322 89159 110473 143511 165304 201119 287752 373237 382219 303402
8545 303402 212180 154887 132618 131946 83525 55650 65191 76938 69414 70389 98751 103771 91757
8532 91757 90803 82075 82187 55450 52660 52811 50959 67366 42368 43581 54280 63395 67496 58288
8518 58288 63128 59271 60108 55593 60764 60198 67900 69009 67701 49193 36986 30329 37101 32191 44740
8503 44740 60812 55149 47527 77746 77416 72700 92027 120988 135919 133920 146085 119454 97366
8490 97366 69471 61251 53437 37424 39462 50786 71601 58487 47718 39920 27023 35445 49942
8477 49942 36438 36325 43732 53718 53333 37585 31755 26023 17879 14632 17028 18748 9453 9534 2626
8462 2626 671 22338 19665 20188 50438 54856 44090 42568 49714 45508 26878 36640 25797 6340
8448F340j2792R767J9627N400P882Q67J0334K917r689r227J061j7957k9172j4167
8434b8809K4157P002R410R908J2423N562J177J1693k2854N867N632k115r747j7145
8420A2161j694L048J11L846n428q157J2026j0375M980M359k269L425L544j4392
8406E185K458M187j2391J1032L914K576K4064k755j5379j0276J5718j7796R992
8393B0529Q440j8735J2449n466N054J0295J136j3015j0960n386N92Q351r898l549
8379a63L936K5851K201j036J2527l324k1062j0202j6375j5515m370J0767P962
8366h803l409J5194o991j1449j4117J8976M496L969o934j2023p922J8406L1594
8353B0987J5823j7440j5387l6906j5291L1133k822j430J1134K4312l408O579J7720
$$ plain form
8448 6340 -6452 3315 22942 28342 36224 37091 47425 50342 40653 31426 32487 14530 -14642 -28809
8434 -28809 -4652 2350 11760 21668 34091 39653 40830 52523 29669 35536 41168 39053 29306 12161
8420 12161 10467 13515 13626 17472 12044 3887 15913 5538 10518 14877 12608 16033 19577 5185
8406 5185 7643 11830 -561 10471 14385 16961 41025 38270 22891 12615 28333 10537 20529
8393 20529 28969 10234 22683 17217 22271 32566 33702 20687 9727 4341 4933 13284 3386 -163
8379 -163 3773 29624 31825 30789 43316 39992 18930 8728 -7647 -23162 -27532 -16765 -8803
8366 -8803 -12212 2982 -4009 -15458 -29575 -10599 -6103 -2134 -9068 -21091 -29013 -10607 20987
8353 20987 36810 19370 3983 -32923 -48214 -17081 -19903 -21333 -10199 14113 10705 17284 35004
8340C5004L5k0028l2649j8097J9581k235L76K3801J2198J2820J6133k2597q403
8327A5939K886N823k1185P775K530k3466j8120K7897J2929P481M818Q09L3793
8314E9909M069k6462k0788j2049L751J89j8220k256j3577J2316J0397J4114n203
8301F190j0249j6613J1652r580J3166J7788R900O670J538N096J621j4986j2752
8288I441j4858j4990R997N713J4793P541j280j6829Q741n812l8339J2681J9691
8275c510j7998J3146O651M914Q749J5442M498j0095K6137J1057k2750j0701q648
8262A6892j3493O998k677M542R321k5835k1560L266M285J1879J3896K3517L433
8249C4464k7402j4313K6965k953k0709j6325J2387j4329j745J3380R145k2862
$$ plain form
8340 35004 35039 15011 -17638 -35735 -16154 -18389 -18013 5788 17986 30806 46939 24342 15939
8327 15939 18825 24648 3463 11238 13768 -9698 -27818 79 13008 20489 25307 26116 59909
8314 59909 63978 37516 16728 4679 8430 8619 -9601 -11857 -25434 -13118 -2721 11393 6190
8301 6190 -4059 -20672 -9020 -18600 -5434 12354 22254 28924 30462 35558 37179 22193 9441
8288 9441 -5417 -20407 -10410 -4697 10096 17637 16357 -472 8269 2457 -35882 -23201 -3510
8275 -3510 -21508 -8362 -1711 3203 11952 27394 31892 21797 47934 58991 36241 25540 16892
8262 16892 3399 10397 7720 12262 21583 -4252 -25812 -22546 -18261 -6382 7514 31031 34464
8249 34464 7062 -7251 19714 16761 -3948 -20273 -7886 -22215 -23960 -10580 -1435 -24297
8237b4297j4411j367j720K1450J8154n279k1648k6417N386J2551J4907L2190K2800
8224C2299m178J0452k1481j5641J1886n861n864J0236O755j4418k6705k415O044
8211a8891K2701J3521j6456j8278J736J864N221j021k718m042r381n832K1544
8198a0032J351J4369k3148M839R587L0387J8885j7989l712j5258p806K492J4046
8185A8011j2160k4515P963J8391l254P562j4450j4164j5177j0315L4527n060j5226
8172b7867J2366K3168P659J071J881n082l5700K6419J9542j5201R59L297j2452
8159F0j5474K4280j132o090J1763j7022O015R246K2616J2926j2765n659N009M56
8145C4229J2143J713O495P508k2582o616M34J1380j7889k5762K7950K1886p12
$$ plain form
8237 -24297 -38708 -40075 -41795 -20345 -2191 -7470 -29118 -55535 -50149 -37598 -22691 9499 32299
8224 32299 28121 38573 17092 1451 13337 7476 1612 11848 18603 4185 -22520 -24935 -18891
8211 -18891 3810 17331 875 -17403 -15667 -13803 -8582 -9603 -12321 -16363 -25744 -31576 -10032
8198 -10032 -8681 5688 -17460 -12621 -3034 27353 46238 28249 24537 9279 1473 3965 18011
8185 18011 5851 -18664 -10701 7690 4436 11998 -2452 -16616 -31793 -42108 -7581 -12641 -27867
8172 -27867 -15501 7667 15326 16397 18278 13196 -22504 3915 23457 8256 9215 12512 60
8159 60 -15414 8866 7734 1644 13407 -3615 2400 11646 34262 47188 34423 28764 33773 34229
8145 34229 46372 48085 54580 62088 39506 32890 33324 44704 26815 1053 29003 50889 50177
8132E0177J793j0845j8434k3573p215k7943j427L3074N4172R320j7288P834m125
8119D5520n249M268j2190K6365K776q952k8656l893l020k9528m928n788k880L8814
8105A2659J7600r396K678K7429k2153m4792K165J2952R126J0568j3626o024L686
8092B872J5536J3772k891K179o913P487J0505R436j4430k0861j7082J7107Q569
8079B5286J6470l856k4721j7103j0753M4132M71k3498j8072J5231J0182m569J7790
8066B6990k1k3643k4422L960K7972K4124J4983K647j2414n609K098j2124q505
8053A6036j2105j3121o086k255J7962k897p454K2744J5270q028J9676Q755p784
8040D0713J6009j3741O707k6204J0659J9487k0878q899K0234r674j6354j8120
$$ plain form
8132 50177 51970 41125 22691 -882 -8097 -36040 -37467 -4393 49779 59099 41811 49645 45520
8119 45520 40271 44539 32349 58714 61490 52538 23882 19989 16969 -12559 -17487 -23275 -26155 12659
8105 12659 30259 20863 23541 50970 28817 -15975 -13810 -858 8268 18836 5210 -814 2872
8092 2872 18408 32180 29289 31468 24555 32042 42547 51983 37553 16692 -390 16717 25286
8079 25286 41756 37900 13179 -3924 -14677 29455 29926 6428 -11644 3587 13769 9200 26990
8066 26990 26969 3326 -21096 -17136 10836 34960 49943 52590 40176 34567 36665 24541 16036
8053 16036 3931 -9190 -15276 -17531 431 -2466 -9920 12824 28094 20066 39742 48497 40713
8040 40713 56722 42981 49688 23484 34143 53630 32752 23853 44087 34413 18059 -61
8028f1L477j1706j6089j9762r71J1650K4958J2968N598J2662P243o141J0849J6885
8014E1560k1889j5492K7935J3750j3904k697J1127o452L02J6218j8064l677J872
8001D0589j5458m797J1247K4462P070k555L5614J0815l704p185j3955r163J1229
7988H4209j4937k9430j8913Q290K9904M179j3359j4020J1094n64L507r574k355
7975C8031K8215R854L563p359J3086J7829q398j4464L418p530q128k06Q256J5530
7961I1697O587j2537j1722P511L865M4398R599m7939j1997n009J668M4889J7613
7948A38623o687j8564Q355J7460k0755q816j5775m339J3083L518j3804P754J9798
7935A19851J5874j4369k3636m1087k9421n705P111Q898Q184L6708r970j699k0490
$$ plain form
8028 -61 3416 -8290 -24379 -44141 -45112 -33462 -8504 4464 10062 22724 29967 23826 34675 51560
8014 51560 29671 14179 42114 55864 41960 39263 50390 43938 44240 60458 42394 38717 40589
8001 40589 25131 20334 31581 56043 63113 60558 96172 106987 103283 96098 82143 72980 84209
7988 84209 69272 39842 20929 29219 59123 63302 49943 35923 47017 46453 49960 40386 38031
7975 38031 66246 76100 79663 72304 85390 103219 94821 80357 83775 76245 68117 67911 76167 91697
7961 91697 98284 85747 74025 81536 85401 129799 139398 91459 79462 74453 76121 121010 138623
7948 138623 131936 113372 121727 139187 118432 109616 93841 89502 102585 106103 92299 100053 119851
7935 119851 135725 121356 97720 56633 27212 21507 28618 37516 45700 82408 72438 70739 50249
7922E0249r627J8152L2711J0751j3256j0168j7952o624J9438J3971M428j1509
7910H0564k9485N447N496j3823j9731q022o629K8871L5166R34k893k4539j6371
7897C4985M825M109j6406m885K0204K4435K143r785k0282l234L259j8378j0881
7884A0109n65j443m930J8025K1409J0785k3494m0911j6856K648k150K5409K5702
7871B3738q041r116o837O61Q606j0232J984O706J1131n45L805r302k6936n237
7857a9615J7069J5543J2211J2128k0240j1886K5385N682k9444M527J1707k2289
7845G78M89j792o644J2999K7917j2134k5072n252L746J7981P464q609j2426J9308
7831A8753O15k324r704l423j1034J5687k833K5235j605k7647l1976k646L7944
$$ plain form
7922 50249 40622 58774 91485 102236 88980 78812 60860 54236 73674 87645 92073 80564
7910 80564 51079 56526 62022 48199 28468 20446 13817 42688 77854 78788 75895 51356 34985
7897 34985 39810 43919 27513 22628 42832 67267 69410 59625 39343 36109 39368 20990 10109
7884 10109 9544 8101 3171 21196 42605 53390 29896 -11015 -27871 -25223 -27373 -1964 23738
7871 23738 15697 6581 -256 405 9011 -1221 763 7469 18600 18055 21860 12558 -14378 -19615
7857 -19615 -2546 12997 25208 37336 17096 5210 30595 36277 6833 11360 23067 778
7845 778 1267 -525 -7169 5830 33747 21613 -3459 -8711 -4965 13016 20480 11871 -555 18753
7831 18753 19368 17044 7340 3917 -7117 8570 5737 30972 29367 1720 -30256 -32902 5042
7818E042J3401j8415p245J7101k3298R026J067K4293J2193l824j9461o293o693
7805c106j1406k1142K94L7569q382O688J3648j1122Q311j173j0482J3208k406
7792A0499J0078Q980O874j3063N238k2999k6502N629N3103J4408k1704l4112L0247
7779B6676J2790j7539K0433J8149l0313k7222k607j0447J0365J0579k8581Q607
7767i110P089k507N803P428J6229j8918m878q860j2374L136J4228o927J5262K3446
7753B9047J9823O674r58k0873j3606k6036j1991P452J4029j624p231j5585R586
7740a1293J0920j7106j3120l891J0617r323J5585K1214q944k2236p346L397p386
7727c8912L626K9119P877r316r003J1872j3846J1531J6493M4J3573J266P00j8737
$$ plain form
7818 5042 18443 28 -7217 9884 -13414 -4388 -3321 20972 33165 29341 9880 3587 -3106
7805 -3106 -14512 -35654 -35360 2209 -6173 515 14163 3041 11352 10179 -303 12905 10499
7792 10499 20577 29557 36431 23368 28606 5607 -20895 -15266 37837 52245 30541 -3571 26676
7779 26676 39466 21927 42360 60509 30196 2974 367 -10080 285 10864 -17717 -9110
7767 -9110 -2021 -4528 1275 8703 24932 6014 1136 -7724 -20098 -16962 -2734 -9661 5601 29047
7753 29047 48870 55544 54586 33713 20107 -5929 -17920 -10468 3561 1937 -5294 -20879 -11293
7740 -11293 -373 -17479 -30599 -34490 -23873 -33196 -17611 3603 -5341 -27577 -34923 -31526 -38912
7727 -38912 -35286 -6167 1710 -7606 -16609 -4737 -18583 -7052 9441 9485 23058 24324 25024 6287
7713F287k0655j1625j1516K826K7525J9847N154Q075j6802k1877n948M03j1771
7700c0077n585M2878K6460M389r392k4685k2828k463J7811k0261j8936L0641J9995
7687G947R419N497l384l802n211Q819o591M769J596j3826L793j2416n102K7851
7673A9359k483j8971k5876j3292J0437o20j585L75J523O442J4655J1051O203q658
7659a440p323J7811j8878O953J4420J3412j144R839j2644j6733j3142M880J009
7646b980J2259J7684j2185j6494j9184l6036K066K3046J0152r43k2531J6355K1314
7633g477K5327j6262k0210R754Q694M781j1547q375r876J3526J3722k378j497
7620a818o714j0868n633k4484R980J9840L238N134L915j9974K733J5780j3731
$$ plain form
7713 6287 -14368 -25993 -37509 -34683 -7158 12689 17843 25918 9116 -12761 -18709 -18306 -30077
7700 -30077 -35662 7216 33676 38065 28673 3988 -18840 -21303 -3492 -23753 -42689 -12048 7947
7687 7947 17366 22863 19479 15677 10466 19285 12694 17463 19059 5233 9026 -3390 -8492 19359
7673 19359 16876 -2095 -27971 -41263 -30826 -31446 -33031 -32656 -31133 -24691 -10036 1015 7218 -1440
7659 -1440 -8763 9048 -9830 -2877 11543 24955 23811 33650 21006 4273 -8869 -3989 -2980
7646 -2980 9279 26963 14778 -1716 -20900 -56936 -54870 -31824 -21672 -22615 -45146 -28791 -7477
7633 -7477 17850 1588 -18622 -8868 -174 4607 -6940 -15315 -25191 -11665 2057 -321 -1818
7620 -1818 -8532 -19400 -25033 -49517 -39537 -19697 -16459 -11325 -7410 -27384 -24651 -8871 -22602
7607b2602k3040J2835J1637J7401J342o467K3424J0399J7633j7678k7106p117
7595i339J0449j1281J1525k5240j0069J2410o806l195J7542j1289J2504k0247
7583c3036k4424O283J868J4177P842K8633r412m443p921K0075J5385J1703j8753
7570G977l0987p246K1095o059k440M220k3566j3415j713K4158J1435Q906M529
7557c106P846P798p02l3024p91L8443J3242k3154O7J3261j9957q452K89M602J6877
7542A3239k529n362j5374j605j9833J8002J8882m185o212j8886k2844m84o913
7529e4104l315j630K6125K6742J4663l2687m034J9125R149q993L024M995K079
7516A139j7647j2983k7186n320J8878J2274K9084J3205L894J3631q642j4474k7150
$$ plain form
7607 -22602 -45642 -32807 -21170 -3769 -2427 -8894 14530 24929 42562 24884 -2222 -9339
7595 -9339 1110 -10171 1354 -23886 -33955 -21545 -28351 -31546 -14004 -25293 -12789 -33036
7583 -33036 -57460 -51177 -49309 -35132 -27290 1343 -8069 -12512 -20433 -358 15027 26730 7977
7570 7977 -23010 -30256 -9161 -15220 -17660 -13440 -37006 -50421 -52134 -27976 -16541 -7635 -3106
7557 -3106 4740 12538 11836 -21188 -21979 16464 29706 6552 6619 19880 -77 -8529 -8240 -3638 13239
7542 13239 10710 5348 -10026 -11631 -31464 -13462 5420 1235 -4977 -23863 -46707 -47191 -54104
7529 -54104 -57419 -59049 -32924 -6182 8481 -24206 -28240 -9115 34 -8959 -5935 -940 1139
7516 1139 -16508 -29491 -56677 -61997 -43119 -30845 -1761 11444 15338 28969 20327 5853 -21297
7503b1297j1261J523p311p874J4315k337j3990J809n666J1731Q940K1647L2253
7490B2482O587L398l157p262M986K130J001k876q618j6041R631O762O028l922
7476B1129P66K407K274n543m987o644k3118r955O58J13Q119J4453L1904K5017
7462E6593j9907j9801Q849j6704l428j307J3761R507m928k0985l9207l4686J4776
7449e7467L2424L9560J4005M077J3751M245J0229k8662j3692j1422P791J8237
7437C3076l146j491j479l1965j0829J7528L9456K1876m2465o945l2887k1653l158
7424d4082n651L0614O100k029k4390Q408N152K8062K632o453j949q240j674O518
7410f982J0352P363j6352p363J0309j534Q288J5560k3156j1992K365j7186n628
$$ plain form
7503 -21297 -32558 -31035 -38346 -46220 -31905 -34242 -48232 -46423 -52089 -40358 -31418 -9771 22482
7490 22482 29069 32467 29310 22048 27034 29164 30165 27289 18671 2630 12261 19023 25051 21129
7476 21129 21895 24302 26576 21033 16046 9402 -13716 -23671 -23013 -22900 -14781 -328 31576 56593
7462 56593 36686 16885 25734 9030 5602 4295 18056 27563 22635 1650 -37557 -72243 -57467
7449 -57467 -25043 14517 28522 32599 46350 50595 60824 32162 18470 7048 14839 33076
7437 33076 29930 28439 26960 -5005 -15834 1694 41150 63026 20561 13616 -19271 -40924 -44082
7424 -44082 -49733 -19119 -13019 -15048 -39438 -31030 -25878 2184 4816 -1637 -3586 -11826 -13500 -6982
7410 -6982 3370 10733 -5619 -12982 -2673 -4207 4081 19641 -3515 -15507 -13142 -30328 -35956
7397c5956K5905Q78j9417J2334o322j2979o058J8252J538L272K6898r839k6787
7384b8281M366L1166Q963m653p598k6807O38K0295J6983l887J0205O46r848k8887
7370a6699l177K6209J3333j743n392P21j9539k3630O155J9621M023K5328R204
7357C4414j4735m0095j0160N523J9643K712M593M47O477m092k1977q582J3667
7344a2165J2707r436p232L76R456j5007n355j4884j0339Q602M371J2247l257j537
7330c1453K3725j1380k9205l36J677K0207J3461K812Q573K0830j4233j7896J2925
7317b93j1180j128J9405q223J1232M104o276P929o813J705L2197r958r096r411
7303A4194j2020M31q771j5383N652J3221k6663M139K0745k29O597n159K523J5528
$$ plain form
7397 -35956 -10051 -9173 -28590 -16256 -22578 -35557 -41615 -23363 -21825 -18553 8345 -1494 -28281
7384 -28281 -23915 7251 16214 11561 3963 -22844 -22206 -1911 15072 11185 21390 22036 12188 -16699
7370 -16699 -19876 6333 19666 17923 12531 13252 -6287 -29917 -23762 -4141 -118 25210 34414
7357 34414 19679 -20416 -30576 -25053 -5410 -2698 1895 2342 8819 4727 -17250 -25832 -12165
7344 -12165 542 -8894 -16126 -15750 -6294 -21301 -26656 -41540 -51879 -43277 -38906 -26659 -29916 -31453
7330 -31453 -7728 -19108 -48313 -48649 -46972 -26765 -13304 -10492 -1919 18911 4678 -13218 -293
7317 -293 -11473 -12601 6804 -1419 9813 13917 7641 15570 8757 10462 42659 32701 23605 14194
7303 14194 2174 2605 -6166 -21549 -15897 -2676 -29339 -25200 -4455 -4684 1913 -3246 -723 14805
7289A4805j9484q076J2013M085K3800l251r420Q27k5660k4382N328m139P672P142
7275a8740N845J1000J5730j8765m856J4536m140m39l559K083o263n439r268L095
7261a9180M342p800P243j5032J9464J1917K542j898L397J0267j072J5266M672
7248C4128j8048j0741J5610P34l877r488q962j9137k1320J1792J1025j1765o583
7235c6632m984J9422K3030J0407j7353P503J1298k819J728J0118N358N066q912
7222B3230k808k5917l772k1068j0453M67J0330J2426O824k538J8669m42J6414
7209B1362q921p678J260r175k708o116J5492J3981n0407M872K1202j7497k6619
7196e0952L3442Q159j870j1510R979J627P05j3301J617J9465k1554Q107L4328
$$ plain form
7289 14805 -4679 -12755 -742 3343 27143 23892 14472 15299 -10361 -34743 -29415 -33554 -25882 -18740
7275 -18740 -12895 -1895 13835 -4930 -9786 4750 610 171 -3388 -1305 -7568 -13007 -22275 -19180
7261 -19180 -14838 -22638 -15395 -30427 -10963 954 3496 1598 4995 15262 14190 29456 34128
7248 34128 16080 5339 20949 21683 17806 8318 -644 -19781 -41101 -29309 -18284 -30049 -36632
7235 -36632 -41616 -22194 836 11243 -6110 1393 12691 9872 11600 21718 27076 32142 23230
7222 23230 20422 -5495 -9267 -30335 -40788 -40321 -29991 -17565 -10741 -13279 5390 4948 21362
7209 21362 12441 4763 6023 -3152 -5860 -11976 3516 17497 -32910 -28038 -6836 -24333 -50952
7196 -50952 -17510 -9351 -11221 -22731 -12752 -11125 -10420 -23721 -22104 -2639 -24193 -16086 18242
7183A8242P763o567j4558j1537j7833j8557j1539M2785K2452j3335J280K632j7978
7170a6750J0967J4435J3972l864r938k4310m491k088k4139J9527K1544K4164j596
7157A7433N26k5901l052K4963Q160j0874j4685j9467N691N751M45k7116k6768
7144f4894J981R101j66R907J0191Q946J7973j408J718l828L235p945J7531k2622
7130b0280j5817l648L5755J7557k3392l8195k0297k959J2929K5000J1953J3976
7118g418R22l4615k9633Q342K4311L8503P635o015J4132J366j584J7708R58j2489
7104B2123n15j8356K181K4682j5993j1084Q179m023j6687n136J1266q939j2413
7091b4715R589J74j92J0397j3442j2348m287k917J1123q542K706M209j387K093
$$ plain form
7183 18242 26005 19438 4880 -6657 -24490 -43047 -54586 -11801 10651 -2684 -1404 1228 -16750
7170 -16750 -5783 8652 22624 18760 8822 -15488 -19979 -22067 -46206 -26679 -5135 19029 17433
7157 17433 17959 -7942 -10994 13969 22129 11255 -3430 -22897 -17206 -11455 -11010 -38126 -64894
7144 -64894 -62913 -53812 -53978 -44071 -33880 -24934 -6961 -8369 -6651 -10479 -7244 -15189 2342 -20280
7130 -20280 -36097 -39745 -3990 13567 -9825 -48020 -68317 -71276 -58347 -33347 -21394 -7418
7118 -7418 -6496 -41111 -70744 -62402 -38091 412 8047 2032 16164 17530 15946 33654 34612 22123
7104 22123 21608 3252 5433 30115 14122 3038 11217 7194 -9493 -14629 -3363 -12302 -24715
7091 -24715 -15126 -14952 -15144 -4747 -18189 -30537 -34824 -37741 -26618 -35160 -32454 -28245 -29632 -27539
7077b7539J6496j735m368j2077J380p439K8667K2601o968k2315j646J9075k148
7064A984j2935q814J0835J2095p402L790O226k5033o567j522q240j1160L79k1992
7050f8356L544M979J0300N5460J5970l1599J130Q039P294K8230J5629j4308l8139
7037a827j5015J8825J7595J789q632k9467j0208J7275l509j9640r310J5081J0484
7024a6559L0222m295j9420j5124q202k7880k652J0522J8382J7015J4615k514j036
7011f926J0712J7430L363n765j8012j5922j3139L8628J6204R545k554j9733l8442
6998b4611P050K7627L737p231K891K4323M835N92l6222k9206n132q222K1431M8048
6984B9910J1950k5714m2564k2369l816L6218J6032Q073m00k4848l110j0043l533
$$ plain form
7077 -27539 -11043 -12778 -17146 -29223 -27843 -35282 -6615 15986 9018 -13297 -14943 4132 1984
7064 1984 -10951 -19765 -8930 3165 -4237 -447 5779 -19254 -25821 -27343 -35583 -46743 -46364 -68356
7050 -68356 -64812 -59833 -49533 5927 21897 -9702 -8572 -533 6761 34991 50620 36312 -1827
7037 -1827 -16842 1983 19578 21367 12735 -16732 -26940 -9665 -13174 -32814 -42124 -27043 -16559
7024 -16559 13663 9368 -10052 -25176 -33378 -61258 -63910 -53388 -35006 -17991 -3376 -5890 -6926
7011 -6926 3786 21216 24579 18814 802 -15120 -28259 10369 26573 36118 33564 13831 -24611
6998 -24611 -17561 10066 13803 6572 9463 33786 38621 39213 2991 -26215 -31347 -39569 -18138 29910
6984 29910 41860 16146 -26418 -48787 -52603 -16385 -353 7720 7320 -17528 -20638 -30681 -34214
6971c4214m925J3252J6047J6921n761j5312j935K3364J0282L87N250j444l434
6958A8478k5932j1163J3987J6628r496j3836j4432m257K7047J8670j7705j7227
6946a9238P306Q511K972j2300j3143J6862m104l291k828J1521k36J4322M665J5212
6932B6231Q473k4914k8721M16R988J3850J4985o877j8871m886Q504j6191r686
6919b7699N789J769M620n864K4231K8192R619n337l3563k9203M301M557P131K601
6905h856R502M706L269n942n532m612O504j6848K0450K2408O490j1402k3900k0170
6891b3933N567j4810R292J7691K371K4970q745k5958q501Q456L586j7629M67K48
6877b6928J8553J9994o605q450j877n366r980J7996J173J9033J601J3763J0685
$$ plain form
6971 -34214 -39139 -25887 -9840 7081 1320 -13992 -15927 7437 17719 18106 23356 21912 18478
6958 18478 -7454 -18617 -4630 11998 2502 -11334 -25766 -30023 -2976 15694 -2011 -19238
6946 -19238 -11932 -3421 -449 -12749 -25892 -9030 -13134 -16425 -19253 -7732 -7968 6354 11019 26231
6932 26231 34704 9790 -18931 -18515 -8527 5323 20308 13431 -5440 -10326 -1822 -18013 -27699
6919 -27699 -21910 -20141 -15521 -21385 2846 31038 40657 35320 1757 -27446 -23145 -18588 -11457 -8856
6905 -8856 646 5352 8621 2679 -2853 -7465 -961 -17809 2641 25049 31539 20137 -3763 -23933
6891 -23933 -18366 -33176 -23884 -6193 -3822 21148 12403 -13555 -22056 -13600 -10014 -27643 -27176 -26928
6877 -26928 -8375 11619 5014 -3436 -5313 -10679 -20659 -2663 -1490 17543 19144 32907 43592
6864D3592j9344k4101k940P721k4133j6377r64k674K520K963J4667J3382j8626
6851b4314J8364J6578J963k8449O349L703j1423J2555L5219J9147q190k806o769
6838C1927J0928j7847q412P332j2084r127k049O203q626p449p360k3987O23J1139
6824b8789m977M147J3844O634k0323p915K4262p526l158q245Q743J2518J3477
6811B692j9233j6251q477k6807J5079J8938K145q494N76M244K335n678p299K5953
6797b0277k347K971k134j4722j4468J996o365j1171m530J5935J774k061K8906
6784b6493N174j0492K992R081k904K7890j5843m808l493L015K2037q406r255n507
6770a7012J581J9041l343m103q475j3099N855j3192j1763p180j8197o090N283
$$ plain form
6864 43592 24248 147 -2793 4928 -19205 -35582 -36546 -39220 -36700 -33737 -19070 -5688 -24314
6851 -24314 -5950 10628 12591 -15858 -9509 -5806 -17229 -4674 30545 49692 41502 38696 31927
6838 31927 42855 25008 16596 23928 11844 2717 668 6871 -1755 -9204 -16564 -40551 -39928 -28789
6824 -28789 -33766 -29619 -15775 -9141 -29464 -37379 -13117 -20643 -23801 -32046 -23303 -10785 2692
6811 2692 -16541 -32792 -41269 -68076 -52997 -34059 -31914 -40408 -39832 -35588 -33253 -38931 -46230 -20277
6797 -20277 -22624 -19653 -21787 -36509 -50977 -48981 -55346 -66517 -71047 -55112 -53338 -55399 -26493
6784 -26493 -21319 -31811 -28819 -19738 -22642 5248 -10595 -15403 -18896 -15881 6156 -2250 -11505 -17012
6770 -17012 -15431 3610 267 -3836 -12311 -25410 -19555 -32747 -44510 -51690 -69887 -75977 -70694
6757g0694M2824J7724J4389l427K876k2546o653K9782K5787r912O433K959J973
6744C1515j8785j6817q982n459k762J9474J0066K494M506n242j932P437r094j0803
6730d384j5306K1483p014k8238J4524K6467K2165K0715J8816L9557M8059K9037
$$ plain form
6757 -70694 -27870 -10146 4243 816 3692 -18854 -25507 4275 30062 20150 26583 29542 31515
6744 31515 12730 -4087 -13069 -18528 -21290 -1816 8250 10744 15250 10008 8076 15513 6419 -4384
6730 -4384 -19690 1793 -5221 -33459 -18935 7532 29697 50412 69228 108785 156844 185881
$$ [...]
##END NTUPLES=NMR SPECTRUM
##END=
