##TITLE=Analysis number 326085
Compound Code cc 61216
Book Reference 483/102/1
Project Code adrs
Chemist Name mattw
##JCAMPDX= 6.0         $$ Bruker NMR JCAMP-DX V2.0
##DATA TYPE= NMR SPECTRUM
##DATA CLASS= NTUPLES
##ORIGIN= Bruker BioSpin GmbH
##OWNER= nmr
$$ XWIN-NMR		Version 3.5
$$ Wed Jan 24 12:30:37 2007 GMT Standard Time (UT+0h)  MAYBRIDGE\nmr@NMR_250MHZ
##.OBSERVE FREQUENCY= 250.131544655141
##.OBSERVE NUCLEUS= ^1H
##.ACQUISITION MODE= SIMULTANEOUS (DQD)
##.ACQUISITION SCHEME= undefined
##.AVERAGES= 16
##.DIGITISER RES= 18
##SPECTROMETER/DATA SYSTEM= dpx250
##.PULSE SEQUENCE= zg30
##.SOLVENT NAME= CDCl3
##.SHIFT REFERENCE= (INTERNAL, CDCl3, 0, 16.4601)
##AUDIT TRAIL= $$ (NUMBER, WHEN, WHO, WHERE, WHAT)
$$ ##TITLE= Audit trail, XWIN-NMR		Version 3.5
$$ ##JCAMPDX= 5.01
$$ ##ORIGIN= Bruker BioSpin GmbH
$$ ##OWNER= nmr
$$ C:\u/data/dgb/nmr/ADRS/1680/pdata/1/auditp.txt
$$ ##AUDIT TRAIL=  $$ (NUMBER, WHEN, WHO, WHERE, WHAT)
(   1,<2007-01-24 12:30:15.14 +000>,<MAYBRIDGE\nmr>,<NMR_250MHZ>,
      <created by zg, POWCHK disabled, PULCHK disabled
       configuration hash MD5:
       49 4B E0 1D 92 C2 6B 37 9F E6 65 BC 52 41 86 1D
       data hash MD5: 64K
       31 98 45 9B FA 92 CB F2 21 A5 04 1D A6 5C F3 1D>)
(   2,<2007-01-24 12:30:27.89 +000>,<MAYBRIDGE\nmr>,<NMR_250MHZ>,
      <Start of raw data processing
       ef LB = 0.3 FT_mod = 6 PKNL = 1 SI = 32K 
       data hash MD5: 32K
       0C AC 83 2E 7D CE 92 83 82 FA 30 E5 EE 51 F5 0F>)
(   3,<2007-01-24 12:30:29.59 +000>,<MAYBRIDGE\nmr>,<NMR_250MHZ>,
      <apk 
       data hash MD5: 32K
       1D 25 CF 8C 91 91 00 27 A1 D8 7A BA 69 2E 2E CA>)
(   4,<2007-01-24 12:30:30.29 +000>,<MAYBRIDGE\nmr>,<NMR_250MHZ>,
      <abs ABSG = 5 
       data hash MD5: 32K
       50 5D 44 56 89 4E F6 62 08 1B 24 04 64 0D CD AE>)
$$ ##END=
$$ 
$$ hash MD5
$$ 9D 7A 83 F5 F1 26 F4 B5 AA 74 07 6E 1F 9D 4B 1E
##$RELAX= 
##$RELAX= 
##$RELAX= 
##$RELAX= 
##$RELAX= 
##$RELAX= 
##$RELAX= 
$$ Bruker specific parameters
$$ --------------------------
##$DU= <C:\u>
##$EXPNO= 1680
##$NAME= <ADRS>
##$PROCNO= 1
##$TYPE= <nmr>
##$USER= <dgb>
##$AMP= (0..31)
100 100 100 100 100 100 100 100 100 100 100 100 100 100 100 100 100 100 
100 100 100 100 100 100 100 100 100 100 100 100 100 100 
##$AQSEQ= 0
##$AQ_mod= 3
##$AUNM= <au_zg>
##$AUTOPOS= <19 >
##$BF1= 250.13
##$BF2= 250.13
##$BF3= 250.13
##$BF4= 250.13
##$BF5= 500.13
##$BF6= 500.13
##$BF7= 500.13
##$BF8= 500.13
##$BYTORDA= 1
##$CFDGTYP= 0
##$CFRGTYP= 5
##$CHEMSTR= <none>
##$CNST= (0..31)
1 1 145 1 1 1 1 1 1 1 1 1 1 1 1 1 1 1 1 1 1 1 1 1 1 1 1 1 1 1 1 1 
##$CPDPRG= <>
##$CPDPRG1= <>
##$CPDPRG2= <>
##$CPDPRG3= <>
##$CPDPRG4= <mlev>
##$CPDPRG5= <mlev>
##$CPDPRG6= <mlev>
##$CPDPRG7= <mlev>
##$CPDPRG8= <mlev>
##$CPDPRGB= <>
##$CPDPRGT= <>
##$D= (0..31)
0 1 0 0 0 0 0 0 0 0.06 0 0 0 0 0 0 0.0002 0 0 0 0 0 0 0 0 0 0 0 0 0 0 
0 
##$DATE= 1169641814
##$DBL= (0..7)
120 120 120 120 120 120 120 120 
##$DBP= (0..7)
150 150 150 150 150 150 150 150 
##$DBP07= 0
##$DBPNAM0= <>
##$DBPNAM1= <>
$$ [...]
##$SUBNAM7= <"">
##$SUBNAM8= <"">
##$SUBNAM9= <"">
##$SW= 20.6930455092707
##$SWIBOX= (0..15)
0 0 3 0 0 0 0 0 0 0 0 0 0 0 0 0 
##$SW_h= 5175.983436853
##$TD= 65536
##$TD0= 1
##$TE= 294.16
##$TE2= 300
##$TE3= 300
##$TEG= 300
##$TL= (0..7)
0 120 120 120 120 120 120 120 
##$TP= (0..7)
150 150 150 150 150 150 150 150 
##$TP07= 0
##$TPNAME0= <>
##$TPNAME1= <>
##$TPNAME2= <>
##$TPNAME3= <>
##$TPNAME4= <>
##$TPNAME5= <>
##$TPNAME6= <>
##$TPNAME7= <>
##$TPOAL= (0..7)
0.5 0.5 0.5 0.5 0.5 0.5 0.5 0.5 
##$TPOFFS= (0..7)
0 0 0 0 0 0 0 0 
##$TUNHIN= 0
##$TUNHOUT= 0
##$TUNXOUT= 0
##$USERA1= <user>
##$USERA2= <user>
##$USERA3= <user>
##$USERA4= <user>
##$USERA5= <user>
##$V9= 5
##$VALIST= <valist>
##$VCLIST= <CCCCCCCCCCCCCCC>
##$VD= 0
##$VDLIST= <DDDDDDDDDDDDDDD>
##$VPLIST= <PPPPPPPPPPPPPPP>
##$VTLIST= <TTTTTTTTTTTTTTT>
##$WBST= 1024
##$WBSW= 4
##$XGAIN= (0..3)
0 0 0 0 
##$XL= 0
##$YL= 0
##$YMAX_a= 470235
##$YMIN_a= -453061
##$ZGOPTNS= <>
##$ZL1= 120
##$ZL2= 120
##$ZL3= 120
##$ZL4= 120
##$ABSF1= 16.46005
##$ABSF2= -4.233122
##$ABSG= 5
##$ABSL= 3
##$ALPHA= 0
##$AQORDER= 0
##$ASSFAC= 0
##$ASSFACI= 0
##$ASSFACX= 0
##$ASSWID= 0
##$AUNMP= <proc_1d>
##$AZFE= 0.1
##$AZFW= 0.1
##$BCFW= 0
##$BC_mod= 0
##$BYTORDP= 0
##$COROFFS= 0
##$CY= 12.5
##$DATMOD= 1
##$DC= 0
##$DFILT= <>
##$DTYPP= 0
##$F1P= 14.0000005364418
##$F2P= -0.99999901652339
##$FCOR= 0.5
##$FTSIZE= 32768
##$FT_mod= 6
##$GAMMA= 0
##$GB= 0
##$INTBC= 1
##$INTSCL= 1
##$ISEN= 128
##$LB= 0.3
##$LEV0= 0
##$LPBIN= 0
##$MAXI= 10000
##$MC2= 0
##$MEAN= 0
##$ME_mod= 0
##$MI= 0
##$NCOEF= 0
##$NC_proc= -2
##$NLEV= 6
##$NOISF1= 0
##$NOISF2= 0
##$NSP= 0
##$NTH_PI= 0
##$NZP= 0
##$OFFSET= 16.46005
##$PC= 1
##$PHC0= 229.9526
##$PHC1= 5.951895
##$PH_mod= 1
##$PKNL= yes
##$PPARMOD= 0
##$PSCAL= 4
##$PSIGN= 0
##$REVERSE= no
##$SF= 250.130015493855
##$SI= 32768
##$SIGF1= 0
##$SIGF2= 0
##$SINO= 400
##$SIOLD= 32768
##$SREGLST= <1H.CDCl3>
##$SSB= 0
##$STSI= 32768
##$STSR= 0
##$SW_p= 5175.98343685301
##$SYMM= 0
##$S_DEV= 0
##$TDeff= 65536
##$TDoff= 0
##$TI= <Analysis number 999999
Compound Code 99
Book Reference 9
Project Code 9>
##$TILT= no
##$TM1= 0
##$TM2= 0
##$TOPLEV= 0
##$USERP1= <user>
##$USERP2= <user>
##$USERP3= <user>
##$USERP4= <user>
##$USERP5= <user>
##$WDW= 1
##$XDIM= 32768
##$YMAX_p= 333663320
##$YMIN_p= -79204
$$ End of Bruker specific parameters
$$ ---------------------------------
##NTUPLES= NMR SPECTRUM
##VAR_NAME=  FREQUENCY,     SPECTRUM/REAL,   SPECTRUM/IMAG
##SYMBOL=    X,             R,               I
##VAR_TYPE=  INDEPENDENT,   DEPENDENT,       DEPENDENT
##VAR_FORM=  AFFN,          ASDF,            ASDF
##VAR_DIM=   32768,         32768,           32768
##UNITS=     HZ,            ARBITRARY UNITS, ARBITRARY UNITS
##FACTOR=    0.157963299565203, 1,           1
##FIRST=     4117.15270732685, 0,            0
##LAST=      -1058.83072952616, 0,           0
##MIN=       -1058.83072952616, -79204,      0
##MAX=       4117.15270732685, 333663320,    0
$$ Real data points
##PAGE= N=1
##DATA TABLE= (X++(R..R)), XYDATA
$$ [...]
16806A3326k1552L14O258J2423j1635P893l176j884l322j8688p510J1589J9570
16793C606J366Q988N092O020L572j4735m378l637p132n11k367J0188R170m066
16779A1176m298O236p775j7101L002j213N321O933J3397J3137J197j7011j3987
16766i86R671j549o762o699j1659O37K220J64Q846M299o657J5549J2612j3011
16752F675j0710o39j1297k729L486M036L308R417J885k515K434k95L999K434o884
16737B605L640O187N085n458k802l71J329m083k709p172j2533L255J3289J7272
16723A7534P768k1348q883Q677k1596k4013j548M561R604j408J4722J5014K80
16710f36k889K107o039j0149J762J2008m076j3790N268Q685J2640N561j0044m42
$$ plain form
16806 13326 -8226 -7912 -1654 10769 -866 7027 3851 1967 -1355 -20043 -27553 -15964 3606
16793 3606 4972 13960 19052 25072 28644 13909 9531 5894 -1238 -1749 -4116 6072 15242 11176
16779 11176 6878 13114 5339 -11762 -8760 -9973 -4652 2281 15678 28815 30012 13001 -986
16766 -986 8685 7136 374 -6325 -17984 -17347 -15127 -14963 -6117 -1818 -8475 7074 19686 6675
16752 6675 -4035 -4674 -15971 -18700 -15214 -11178 -7870 1547 3432 917 3351 3056 7055 9489 2605
16737 2605 6245 12432 17517 12059 9257 8886 10215 6132 3423 -3749 -16282 -13027 262 17534
16723 17534 25302 3954 -4929 3748 -17848 -41861 -43409 -38848 -29244 -30652 -15930 -916 -636
16710 -636 -3525 -1418 -7457 -17606 -15844 -3836 -7912 -21702 -16434 -7749 4891 10452 408 -34
16696c4K025K221L758l711j407R887J299L09n820K954j3928k810l221l834M166
16681h146N94Q42N41k124j512r081L803J0904J7781R309j5615L64J0804q407j7105
16666g048j936J5368n962r387N497J4801j0930j2534o99J7986K0113j1573j0203
16653C493m987m063o998O693K0418j2787j019J4880R53l953K8M295L75j940K432
16638A7820L471j3396j0009J902Q951j133L875P35l261j0800j689L781j0753o571
16624a7077j7129R942O870J1770j9874j4029O403J1469J6051J874o245O188J5220
16611A1433m779j2490k0480k327J4879M930J5117K039J525r260k997o104l346
16598a1860j120J0675K853l437P794N054R281r2j7908o05K162Q377p603k861l820
$$ plain form
16696 -34 1991 4212 7970 4259 2852 12739 14038 14347 8527 11481 -2447 -5257 -8478 -12312 -8146
16681 -8146 -7552 -6710 -6169 -8293 -9805 -18886 -15083 -4179 13602 22911 7296 7660 18464 10057 -7048
16666 -7048 -8984 6384 422 -8965 -3468 11333 403 -12131 -12830 5156 25269 13696 3493
16653 3493 -1494 -5557 -12555 -5862 14556 1769 750 15630 16583 12630 12658 16953 17328 15388 17820
16638 17820 21291 7895 -2114 -212 8739 7606 11481 12216 8955 -1845 -3534 247 -10506 -17077
16624 -17077 -34206 -24264 -17394 -5624 -25498 -39527 -33124 -21655 -5604 -3730 -9975 -3787 11433
16611 11433 6654 -5836 -26316 -28643 -13764 -8834 6283 8322 9847 587 -2410 -8514 -11860
16598 -11860 -12980 -2305 548 -2889 4905 9959 19240 19148 1240 635 2797 11174 3571 710 -3110
16583c110Q297m587k371L896O06q14L492l562n697K205P106j799N438R444M02
16568A8946L36j6822M208J3831k2065j3861J3427L321k81L814r222r807j0923
16555b5098k536J8020P374m05J954K3798N704j6932o427m742j621j1775J670P314
16541c702P22J1209k506j2311j656o235q559K446j4099p940Q173N927J7664R354
16527a513N318J4639q929k6140j3239J2085Q090q068j9143n247L0240M020p020
16514a4907m375Q094l50o369k599K017J9836N483J0869m787j9879o200j190N074
16500i283R781J0405Q14j5985J609o709k093R879O782j8086N94L259R766J8545
16486A9278q637k904k199N05K0406O762j8025p675K413K014n718N961R54k09k976
$$ plain form
16583 -3110 5187 600 -1771 2125 2731 1917 5409 1847 -3850 -1645 5461 3662 9100 18544 18946
16568 18946 19282 2460 6668 20499 -1566 -15427 -2000 1321 1040 4854 -4368 -14175 -25098
16555 -25098 -27634 -9614 -2240 -2645 -691 23107 28811 11879 5452 710 -911 -12686 -11016 -3702
16541 -3702 -2980 8229 5723 -6588 -8244 -14479 -23038 -20592 -34691 -42631 -34458 -28531 -10867 -1513
16527 -1513 3805 18444 9515 -16625 -29864 -17779 -9689 -17757 -36900 -42147 -11907 -7887 -14907
16514 -14907 -19282 -11188 -11538 -17907 -20506 -18489 1347 6830 17699 12912 -6967 -13167 -14357 -9283
16500 -9283 498 10903 11717 -4268 -2659 -9368 -11461 -1582 5200 -12886 -12292 -9033 733 19278
16486 19278 10641 7737 5538 6043 26449 33211 15186 7511 9924 11938 6220 12181 13135 12926 9950
16471I950m35k534K226L97P53K38L677J56j0813j3515J4364J4068R743p028j0757
16456A0490m498O096p387j5486P346P20m042n788q949N335J1541K20p841J6812
16442D569K1453o508k773j3063j5601Q703R276j066p201m006O360L043n924M015
16428A277l287R29L15R638k408j4770j1696m41K0603J170j7782r718K1738O204
16414A772n383Q462o171j9226m081r889O799R080J2002j4051m940J0724Q832p049
16400a3119Q488R344J0405r243m232K1932Q259l0420k1651r436J0567J2747R324
16387B965P625n438p007j5547k758r857Q678O567M308R397N265k404j6643p027
16373b1876o46J2431O866rm7K029n348k461k953P913J6155Q256k1326q055p196
$$ plain form
16471 9950 9515 6981 9207 9604 10357 10595 14272 14428 3615 -9900 4464 18532 28275 21247 10490
16456 10490 5992 12088 4701 -10785 -3439 -2719 -6761 -12549 -21498 -16163 -4622 -4402 -12243 4569
16442 4569 26022 19514 16741 3678 -11923 -3220 6056 4990 -2211 -6217 143 3186 -2738 1277
16428 1277 -2010 -1081 -766 8872 6464 -8306 -20002 -20443 160 1330 -16452 -26170 -4432 1772
16414 1772 -3611 4851 -1320 -20546 -24627 -34516 -27717 -18637 -6635 -20686 -25626 -14902 -6070 -13119
16400 -13119 -4631 4713 15118 5875 1643 23575 31834 1414 -20237 -29673 -19106 -6359 2965
16387 2965 10590 5152 -1855 -17402 -20160 -30017 -21339 -14772 -10464 -1067 4198 1794 -14849 -21876
16373 -21876 -22522 -10091 -3225 -3234 -3281 -1252 -6600 -9061 -12014 -4101 12054 20310 -1016 -9071 -16267
16358a6267j1580j4140p227J514O992J6146R338P155r340k572O548J8078M041
16345H686L785n287m189m880p024o511N562J4388M278P335J104j7011M118p728
16331c374q798k19K1666J3128J194j3301k366p416P732L023j86M870Q02Q035N378
16316C0168j512j4399J486m89m693r70K345j5932K477J0953l321K012O141M392
16302A8658q201k0155m338P710J012Q228K836P694n610J27o198q624p520Q223
16288f158N578o614J0490P876k882O821N297O136L009j3308k4797j5141K321J5403
16274e969M973k561l412j479m885j2664R437J6828k355R223M256K70j2258j804
16260b400Q72J5197p572j2303K079m340L721n158J865K280j4435J2418K1811Q245
$$ plain form
16358 -16267 -27847 -41987 -49214 -47700 -40708 -24562 -15224 -8069 -17409 -19981 -13433 4645 8686
16345 8686 12471 7184 2995 -1885 -8909 -15420 -9858 4530 8808 16143 17247 236 4354 -3374
16331 -3374 -12172 -12391 9275 22403 23597 10296 7930 514 8246 11269 11083 15953 16755 24790 30168
16316 30168 28656 14257 15743 15254 10561 9591 11936 -3996 -1519 9434 6113 8125 14266 18658
16302 18658 10457 -9698 -14036 -6326 -5314 2914 5750 13444 7834 7961 1763 -6861 -14381 -6158
16288 -6158 -580 -7194 3296 11172 8290 15111 20408 26544 29553 16245 -8552 -23693 -21372 -5969
16274 -5969 -996 -3557 -6969 -8448 -13333 -25997 -16560 268 -2087 7136 11392 11662 -596 -2400
16260 -2400 -1528 13669 6097 -6206 -4127 -8467 -4746 -9904 -8039 -5759 -20194 -7776 14035 22280
16246B2280M347o207L13N156J4960R88k3039k594J499J0830j3096j7798o320k027
16232a0708J3330P194k061P990l604j2976J1474N952q415j2898l785j871O993
16219c385O622N509J3401l352j668J1801p549j917j2221n234l332n357j420J1450
16205C348R225J3959O003N579k0709j754L091n37m839r918J327n527m7m499J265
16190d033K861j0494o945N020N356J3007l85m524L437j308P33N714J0686L215
16176B2340k522m934j9296m646P576K1890K53j8933q83O707R428k884k92k223
16162A1581j5789j1546q749J2451J6919l131j0656N505j998n57m729J16N392P523
16148B332P911j686R25J583K689J444k189q942m792R738J2040j1004q333p434
$$ plain form
16246 22280 26627 20420 20733 25889 40849 41837 18798 16204 17703 28533 15437 -2361 -8681 -10708
16232 -10708 2622 9816 7755 15745 12141 -835 10639 16591 8176 -4722 -8507 -10378 -3385
16219 -3385 3237 8746 22147 18795 17127 28928 21379 19462 7241 2007 -1325 -6682 -8102 3348
16205 3348 12573 26532 32535 38114 17405 15651 18742 18205 13366 3448 4775 -752 -799 -5298 -4033
16190 -4033 -1172 -11666 -18611 -13591 -8235 4772 4387 -137 3300 1992 2725 8439 19125 22340
16176 22340 19818 14884 -4412 -9058 -1482 20408 20661 1728 845 7552 16980 14096 13804 11581
16162 11581 -4208 -15754 -24503 -12052 4867 1736 -8920 -3415 -5413 -5970 -10699 -10583 -5191 2332
16148 2332 10243 8557 9482 11065 13754 15198 13009 4067 -725 9013 21053 10049 1716 -5718
16134e718k486K3095J4929k2022j6034J7705J1782k0224k2300J761K1266J4192
16122A5946o38n903J0808J424j7754j5276K531M042m03j492q25l904r27J5916
16108C545J0017O553L185j2164j0046j342O246K929j206O657Q073j2428K28J71
16094A0418o725j3903l663J226O538j748j0839J719l588j2106R830J1627J1744
16081E30o253j1153O917K0051J887L116Q299j241o980p17m951j993j264l488p787
16066e027j941r712l37K3645J9913j6081j0807N934M782k650P780O059k847n137
16052A3574J011L385r415r13j311J4517J1791o566l495j0536p830j2544j4488
16039b2820J2188J0480q083j073K778p98N783m619n762K941p25O88K752L699K83
$$ plain form
16134 -5718 -8204 14891 29820 7798 -8236 9469 21251 1027 -21273 -19512 1754 15946
16122 15946 15308 9405 20213 21637 3883 -11393 -8862 -4820 -5223 -6715 -7540 -11444 -12371 3545
16108 3545 13562 20115 23300 11136 1090 -252 5994 8923 7717 14374 22447 10019 10247 10418
16094 10418 3693 -10210 -13873 -12647 -6109 -7857 -18696 -16977 -20565 -32671 -22841 -11214 530
16081 530 -5723 -16876 -9959 10092 11979 15095 23394 22153 15173 14456 9505 7512 6248 2760 -5027
16066 -5027 -6968 -16680 -17017 6628 26541 10460 -347 5587 10369 7719 15499 21558 18711 13574
16052 13574 14585 17970 8555 7642 6331 20848 32639 26073 22578 12042 4212 -8332 -22820
16039 -22820 -10632 -152 -8235 -9308 -6530 -7328 -1545 -6164 -11926 -8985 -9710 -9022 -6270 -2571 -2288
16024b288k477j1524j4526J2308P267J2011O539N594m924L01l909n017m121r37
16010e703N463O716P152n229n083O935J390Q575L601k4701n280N413n818J6653
15996A0084O938j2775M873j2534m969r967J647M884J0516O302K273j411m037j6284
15982a4460N226J7395O57j1608L755M075q018k6455k459J8579k499j208K2009
15969D989j337j9659L383r231k779J8915R400j752n225K188L265R742J96j3642
15955a547j0342p608K301K658n342J3535O072m421k424L825L280k86P14R095J1893
15940B1403q503j4668j4128n55J4018J8609K531L148j1552p92O249q496l713N451
15926I002r25q664J330N178k439o744N653J0028K038q18j2021k725K132j069O160
$$ plain form
16024 -2288 -4765 -16289 -30815 -18507 -11240 771 7310 12904 7980 8281 4372 -645 -4766 -5703
16010 -5703 -240 6476 13628 8399 3316 10251 11641 20216 23817 -884 -6164 -751 -6569 10084
15996 10084 17022 4247 9120 -3414 -8383 -18350 -16703 -11819 -1303 4999 7272 5861 1824 -14460
15982 -14460 -9234 8161 8818 -2790 965 5040 -2978 -29433 -31892 -13313 -15812 -17020 4989
15969 4989 3652 -16007 -12624 -21855 -24634 -5719 3681 1929 -3296 -1108 2157 11899 12095 -1547
15955 -1547 -11889 -19497 -17196 -14538 -19880 -6345 -273 -4694 -7118 -3293 -13 -299 415 9510 21403
15940 21403 12900 -1768 -15896 -16451 -2433 16176 18707 21855 10303 9511 15760 7264 3551 9002
15926 9002 8077 -587 743 5921 3482 -3262 2391 12419 14457 13639 1618 -1107 1025 -44 6116
15911F116j202r088m083L634L048j340J0190j202M110j2357J5810J3127m202j3030
15897I531j4046L658P585L193k483J6255j335j3676n244no621m598j7575m725
15883c0086J2200J0184J3291O027J0579m606m291O791p505p499j649j3033m320
15870a3917q09m634J4489J8986j1097n823n637j0914j050M346j170Q519M511J6126
15856A1926q78k1880K969R806J5239J1173j1669j2065j5413p51J7943J971n615
15843B756k428O640L442m777P97N839j08m061n979l332J3126J223r23K13k255
15828A0173j289j0693r259N737j1256m646P634j390J0250J97n804N63J1381o500
15814d902J5171M271K202r337j5326p280J2205J72N891J4602r687p343j4126j1066
$$ plain form
15911 6116 4914 -4174 -8257 -4623 -1575 -2915 7275 6073 10183 -2174 13636 26763 22561 9531
15897 9531 -4515 -857 6728 9921 7438 23693 22358 8682 3438 3433 -3188 -7786 -25361 -30086
15883 -30086 -17886 -7702 5589 11616 22195 17589 13298 20089 12584 5085 3436 -9597 -13917
15870 -13917 -14726 -19360 -4871 14115 3018 -2805 -8442 -19356 -20406 -16060 -17230 -8711 -4200 11926
15856 11926 11048 -10832 -7863 1943 17182 28355 16686 4621 -10792 -11543 6400 8371 2756
15843 2756 328 6968 10410 5633 6430 12269 12161 8100 2121 -1211 11915 13138 12215 12428 10173
15828 10173 8884 -1809 -11068 -5331 -16587 -21233 -13599 -14989 -4739 -4542 -10346 -9783 1598 -4902
15814 -4902 10269 14540 16742 7405 -7921 -15201 -2996 -2824 3067 17669 7982 639 -13487 -24553
15800b4553J619J1259O434J1246L058k2666q198k486J7221J0382j1997o788J1624
15787c845J4464n81o148P536J4697j0540k0799M76M42K747p27j96L692J8254r620
15772I852q755j3860o012n393J3313P11K252j049M044M663Q546M441O819j1090
15758H482j6607M411j244m384r800J0522l776p290N679J9840L926Q51j2520R768
15744G858p511j2156R278Q370j524j021O307j532q760R452J276m143L874L33k80
15729I821j7121j744j996n092k418K213o273K0921J1457q645L812j295j1953K51
15715h062P653L569q191j482N442j4182l47K738p738J772N466L691J3154J286
15701D769j0274q519m068m538Q13N437R984k25l460k885R729Q182m197P093P309
$$ plain form
15800 -24553 -22934 -11675 -5241 6005 9063 -13603 -21801 -24287 -7066 3316 -8681 -15469 -3845
15787 -3845 10619 10038 3890 11426 26123 15583 -5216 -4740 -4298 -1551 -2278 -2474 1218 19472 9852
15772 9852 1097 -12763 -18775 -24168 -10855 -10144 -7892 -8941 -4897 -234 8312 12753 19572 8482
15758 8482 -8125 -3714 -4958 -9342 -19142 -8620 -12396 -19686 -14007 5833 9759 10610 -1910 7858
15744 7858 347 -11809 -2531 5839 4315 3294 9601 8069 -691 8761 10037 5894 9768 10101 9821
15729 9821 -7300 -9044 -11040 -16132 -18550 -16337 -22610 -1689 9768 1123 4935 3640 -8313 -8062
15715 -8062 -409 3160 -5031 -6513 -1071 -15253 -15600 -12862 -20600 -18828 -13362 -9671 3483 4769
15701 4769 -5505 -14024 -18092 -22630 -21817 -16380 -6396 -6621 -10081 -12966 -3237 4945 748 7841 15150
15686A5150N465r572k62N098Q951q525k2045k1850J755J5453O051J938r806o361
15672a8560Q047J4191K144j6488k8530J532K3821P497J3335p410l924P700j8039
15659a4684Q96k569J658O77k928J6245J4354j4164p324j26j1776j74R789J7570
15645G444J5427r897o723O571K471L872O627p43j2051j8323P403J0064q264R260
15631A3138J6321J495j4669r882k785j269Q88j0417j6351J454J4456R492R224
15618A1095j0701j4L799p563j954J0024k1848j4307P434J2286Q448J3239j4801
15605d863j2532j8439K652J4466J6605O723j1997q613j276J5812J2479j9p346
15592C652r918o377P281R294p406K2296K1829J1856q339k3625N732j3981k2235
$$ plain form
15686 15150 20615 11043 10781 15879 24830 16305 -5740 -27590 -25835 -10382 -4331 -2393 -12199 -18560
15672 -18560 -10513 3678 5822 -10666 -39196 -37664 -13843 -6346 6989 -421 -4345 3355 -14684
15659 -14684 -13788 -16357 -14699 -14022 -16950 -705 13649 -515 -7839 -7965 -19741 -19915 -10126 7444
15645 7444 22871 12974 6251 12822 15293 19165 25792 25049 12998 -5325 2078 12142 3878 13138
15631 13138 29459 30954 16285 6403 3618 2349 3237 -7180 -23531 -22077 -7621 1871 11095
15618 11095 394 380 4179 -3384 -5338 4686 -17162 -31469 -24035 -11749 -3301 9938 -4863
15605 -4863 -17395 -35834 -33182 -18716 -2111 4612 -7385 -15998 -17274 -1462 11017 10998 3652
15592 3652 -6266 -12643 -5362 3932 -3474 18822 40651 52507 44168 20543 26275 12294 -9941
15579i941r874J5561J4824N723o153r592J4919N254j8711K458k013j1642O363
15566b824J595r98L820j2720P50J3009J717j890M583j1638j6323k937R173J3929
15552g54j501Q718j3499j7018j985L268m49k531L206N166N559J2009J2493o673
15538F009L967m07q981j836M125p154r427o840J1424J851n454Q684j3800j1990
15524b9829J0294k672j206K07P804L133P390J128O975J0510Q952j3897j590J0728
15510A7927J2645k034r549j3906J0687p548m260r381K654K608k840J919M116l051
15496a3r628L11M35M276m9l677l099r378j005K7613J6472j2245R16j2247M079
15481B761j374p93j295K953k330k306J206k203O794P605L332p129j4469M208m452
$$ plain form
15579 -9941 -19815 -4254 10570 16293 10140 548 15467 20721 2010 4468 2455 -9187 -2824
15566 -2824 -1229 -2227 1593 -11127 -10377 2632 4349 2459 7042 -4596 -20919 -23856 -14683 -754
15552 -754 -2255 6463 -7036 -24054 -26039 -22771 -23220 -25751 -22545 -17379 -11820 189 12682 6009
15538 6009 9976 9569 588 -1248 2877 -4277 -13704 -20544 -9120 -7269 -12723 -4039 -17839 -29829
15524 -29829 -19535 -22207 -23413 -23206 -15402 -12269 -4879 -3751 3224 13734 22686 8789 7199 17927
15510 17927 30572 28538 18989 5083 15770 8222 3962 -5419 -2765 -157 -2997 -1078 3038 -13
15496 -13 -9641 -9330 -8895 -4619 -4668 -8345 -11444 -20822 -21827 5786 22258 10013 10929 -1318 2761
15481 2761 1387 594 -701 2252 -78 -2384 -1178 -3381 3413 11018 14350 7221 -7248 -3040 -7492
15466g492l961j090K919r810n278m524j587j4628J1348J5807L888k436J9093J0074
15452A2323j4210j2656n745m329J2885J7018j0961j0632R319J8697J4251P019
15440C2979r49q031M74O28j6819j8849R474L471O538j615J1774J3293j0900n859
15426A5609l371j5584m332J8514J2381J1950p866k2739p295M423R849m633J711
15413H617j600N00J2579M895j913p928l433o540j269O056o658q272p9J706R996
15398F657J6489J9025j6208k1241O45l134M675R297O356k4622q029K033J2796
15385D739j0115J7117K712l483N463Q209J74j4003j2001n428l39J0491m402L37
15371e29l701O815l301N477N187n572n501Q199n248O035K3210k190j1071j2168
$$ plain form
15466 -7492 -11453 -12543 -9624 -19434 -24712 -29236 -30823 -45451 -34103 -18296 -14408 -16844 2249 12323
15452 12323 -1887 -14543 -20288 -24617 -11732 5286 -5675 -16307 -6988 11709 25960 32979
15440 32979 32030 23999 24473 25101 8282 -10567 -1093 2378 8916 7301 19075 32368 21468 15609
15426 15609 12238 -3346 -7678 10836 23217 35167 27301 4562 -2733 1690 11539 6906 8617
15413 8617 7017 7517 20096 24991 23078 15150 11717 5177 3908 9964 3306 -4966 -5045 -3339 6657
15398 6657 23146 42171 25963 4722 5367 2233 6908 16205 22561 -2061 -10090 -8057 4739
15385 4739 -5376 11741 14453 10970 16433 24642 24816 10813 -1188 -6616 -6955 3536 -866 -529
15371 -529 -4230 2585 -716 4761 9948 4376 -1125 7074 1826 7861 31071 28881 17810 5642
15357E642N601M550J2688J175r249r624l037K454j3790O27j742J35J025q60J688
15342b717J0077J216j2167J2676j1830j6740J7243R729k164o215p327p914O754
15329i379J13M377J7321P758j5859k4089j095j615O681J0831Q173R85o46M871
15315H427L043J248P565O23r985j8153q668R312J0909M747J2869k507k4619n205
15301a0394R473j2372r054R938R205j835o835J3406O121M29R530o410k44J1720
15287B2678q839p699N477j2828m459J088J8922N651j5070j8460L8J9021P747j5642
15273b375j6143J513P384J3558J0271J2760M38j6205m583O446p746k4099j1147
15260b9928M689O941J0729j905r40j434L858J3021K0378J83r618j6922o208M689
$$ plain form
15357 5642 11243 15793 28481 29656 20407 10783 7746 10200 -3590 -2963 -4705 -4570 -3545 -4405 -2717
15342 -2717 7360 8576 -3591 9085 -2745 -19485 -2242 7487 5323 -892 -8219 -16133 -9379
15329 -9379 -9266 -4889 12432 20190 4331 -19758 -20853 -22468 -15787 -4956 3217 4202 3556 8427
15315 8427 11470 12718 20283 20906 10921 -7232 -15900 -6588 4321 9068 21937 19430 -5189 -10394
15301 -10394 -921 -13293 -22347 -12409 -3204 -5039 -11874 1532 7653 8082 17612 11202 10958 22678
15287 22678 13839 6140 11617 -1211 -5670 -4582 14340 19991 4921 -13539 -13501 5520 13267 -2375
15273 -2375 -18518 -17005 -9621 3937 14208 26968 27406 11201 6618 13064 5318 -18781 -29928
15260 -29928 -25239 -18298 -7569 -9474 -10414 -11848 -7990 5031 25409 25592 15974 -948 -7156 -2467
15246b467P926j906k193l13q539J6009J0562q880q613j5096Q130R723j179J777
15232D941q51J4824j2735j7341O556K281N30l628N99l398j627L206J1718J5719
15218B0794o858q370J1368K741q383k00j5294R73L883j48K452j025J879l268J1723
15203A2267J0276p618j0764j6512q51J1171J580k920m357L004J7052q026j132
15190C170K673o687m569J3076K564j9107n128J3503L185j4646j3037K0626Q852
15177D475p03N404M180k883p766Q817j885K386K154j4458l132L572j5567Q7O057
15162i262K3264P952j2298j3534P574o355n63J351K968O459L480M000K1092n579
15148C0549k0413j3300J4010Lj990m603m710k940j0688o065J0096p494j6335J17
$$ plain form
15246 -2467 5459 3553 1360 1047 -7492 8517 19079 10199 1586 -13510 -5380 4343 3164 4941
15232 4941 4090 18914 6179 -11162 -4606 -2325 -1795 -5423 -4824 -8222 -9849 -6643 5075 20794
15218 20794 13936 5566 16934 19675 11292 11092 -4202 -3229 654 506 2958 1933 3812 544 12267
15203 12267 22543 14925 4161 -12351 -13202 -2031 -451 -3371 -7728 -4724 12328 4302 3170
15190 3170 5843 -844 -5413 7663 10227 -8880 -14008 -505 2680 -11966 -25003 -4377 4475
15177 4475 3772 9176 13356 10473 2707 11524 9639 12025 14179 -279 -3411 161 -15406 -15319 -9262
15162 -9262 14002 21954 9656 -3878 3696 -2659 -3222 -1871 1097 7556 11036 15036 36128 30549
15148 30549 10136 -3164 10846 10849 8859 4256 -454 -3394 -14082 -20147 -10051 -17545 -33880 -33763
15134c3763J2602J8121N245K297l938o024L09n069J059n95n04P276N708N039M946
15119A2709q760L791O913K923m507q800L559j329r463P456J9526k759r973q087
15105C199k737K902j050J971k768r555o9L394M269k348L237p992p266l966j906
15090b0685Q92J1230R816J0733Q99j6717q572o199K137L551j494Q043K113j5945
15076b0198j6364j225R689R246J8813L460p802q754O435N821j441p058J9388J0061
15062B0071j0921l013j5960L777J0278r49r7J596n169n286l17J0048L131J41J0694
15047A8024p782j584N99m79n768o441P549R484k554j3534O624R448o631j123r439
15032c607N228K765l691n575P772J7551l398l845j2009j7905n708N827J189R5
$$ plain form
15134 -33763 -21161 -3040 2205 4502 564 -5460 -5151 -10220 -9161 -9756 -10260 -2984 2724 7763 12709
15119 12709 3949 7740 14653 17576 13069 4269 7828 6499 -2964 4492 24018 21259 11286 3199
15105 3199 462 3364 2314 4285 1517 -8038 -8107 -4713 -444 -2792 445 -7547 -14813 -18779 -20685
15090 -20685 -19793 -8563 1253 11986 12885 -3832 -12404 -18603 -16466 -12915 -14409 -6366 -4253 -20198
15076 -20198 -36562 -37787 -28098 -18852 -39 3421 -4381 -13135 -6700 -879 -2320 -9378 10010 20071
15062 20071 9150 6137 -9823 -6046 4232 3283 3186 4782 -387 -5673 -5990 4058 7189 7330 18024
15047 18024 10242 8658 9257 8778 3010 -3431 4118 13602 11048 -2486 4138 13586 6955 5832 -3607
15032 -3607 1621 4386 695 -4880 2892 20443 17045 13200 1191 -16714 -22422 -16595 -15406 -15311
15018a5311Q865M144n708k0828o038J2886K2571j679O599n842J158R60m089J642
15004f70J1873p474j4504r269j0167M482J5656l848k206m830J331K6441L24k658
14990D481m385J0013k708m617J6j0350m643j599R057N782K764j2341P88O831j2579
14975a3490n677k169K782J3009R354M757J1788j1143q958l059J1259M766J1970
14962B5189L66j0433j060P530j4695K422q243p340J1637j2894K857p004n598P728
14948i538J0406n041j4477J6543K149k681K894o014j0194J4142J3493k564N928
14935A5046l75q407J0306J067j1269R31p057o924K394M681L868J1490p208k1839
14921a3296N626j508L381J3209n371j2131J198K841j107k376J2882N080R725k754
$$ plain form
15018 -15311 -6446 -2302 -8010 -28838 -34876 -21990 581 -1098 5501 -341 817 1777 -2312 -670
15004 -670 11203 3729 -10775 -20044 -30211 -25729 -10073 -13921 -16127 -20957 -19626 6815 7139 4481
14990 4481 96 10109 7401 2784 2800 -7550 -12193 -13792 -4735 1047 3811 -8530 -7742 -911 -13490
14975 -13490 -19167 -21336 -18554 -5545 3809 8566 20354 9211 253 -2806 8453 13219 25189
14962 25189 25555 15122 14062 21592 6897 9319 1076 -6264 5373 -7521 -4664 -11668 -17266 -9538
14948 -9538 868 -4173 -18650 -2107 42 -2639 255 -5759 -15953 -1811 11682 9118 15046
14935 15046 14671 6264 16570 17637 6368 7299 242 -6682 -4288 393 4261 15751 8543 -13296
14921 -13296 -7670 -9178 -5797 7412 2041 -10090 -8892 -6051 -7158 -9534 3348 8428 18153 15399
14907A5399J8120J367j5502k4924L510O259o226k141O529N931k254r636q952M548
14893g972j509J3360J387p261k923J1937l531K510o798j0719p489J6825Q226R63
14879G006j718J808L816k4j8455p12J309J0662j191j10N828r69r827J5705o442
14864F686j9213j625J7110J2460M025o849j575o251r572N043N763l377K692j7092
14850a1775r767L523L022K427N776M715J8259p655j5425l521l069j6012m010K249
14836c1263N763O614O629r797M619R962O97L524K1380k372q754L254j492j4351
14822e587j4667J13l34p59Q890J6689J0362J2031J0589j3201k7782j5732J80J36
14808a9072n599J476J4584J2552j632P820J553k4871l810J6282L726M85J3126
$$ plain form
14907 15399 33519 34886 19384 -5540 -2030 4229 -1997 -4138 2391 8322 6068 -3568 -12520 -7972
14893 -7972 -9481 3879 5266 -1995 -4918 7019 3488 5998 -800 -11519 -19008 -2183 6043 7006
14879 7006 5288 7096 10912 10888 -7567 -8279 -6970 3692 2501 2391 8219 7250 -2577 13128 6686
14864 6686 -12527 -14152 2958 15418 19443 12594 11019 4768 -4804 239 6002 2625 5317 -11775
14850 -11775 -21542 -18019 -14997 -12570 -6794 -2079 16180 8525 -6900 -10421 -13490 -29502 -33512 -31263
14836 -31263 -25500 -18886 -12257 -22054 -17435 -7473 -6776 -3252 18128 15756 7002 10256 8764 -5587
14822 -5587 -20254 -20141 -20475 -21234 -12344 4345 14707 26738 37327 24126 -3656 -19388 -19208 -19072
14808 -19072 -24671 -23195 -8611 3941 2309 10129 11682 -13189 -16999 -717 3009 3494 16620
14795A6620J1701o310k0495O445P889p420j8626J503O190J0341N727J609R485
14782B4659J1005k418P87j4181k4571J324K2799K771n087j5639J20q778p77M943
14768c043J473j0864L737Q473J974J4721J906o947q155r212J249J2470n915r529
14754g662m046K859o52q570l828Q641K614q123K8454k568q867j61n13j4936J2123
14739e235R195J972P54N815M261j0688P586q51l339j0737K299o133j4134Q114
14725a1121J2671K2433p410j943n867j0794p862n039l887L897j0571J8537J2749
14712E793n739k5500m860K0626J0168r57j57p002O543N010M928p395M1Q903p758
14697B644r276Q393r203P182O779L147j090j827K75n52n685K856J0952m978j5810
$$ plain form
14795 16620 28321 22011 1516 7961 15850 8430 -10196 -8693 -2503 7838 13565 15174 24659
14782 24659 35664 33246 34033 19852 -4719 -3395 19404 22175 17088 1449 1569 -7209 -7986 -3043
14768 -3043 -1570 -12434 -8697 -224 1750 16471 18377 11430 3275 -5937 -4688 7782 1867 -7662
14754 -7662 -11708 -8849 -9501 -18071 -21899 -13258 -10644 -18767 9687 7119 -1748 -1909 -2422 -17358 -5235
14739 -5235 3960 5932 6686 12501 16762 6074 13660 12809 9470 -1267 1032 -5101 -19235 -11121
14725 -11121 1550 23983 16573 14630 8763 -2031 -9893 -14932 -18819 -14922 -25493 -6956 5793
14712 5793 54 -25446 -30306 -9680 488 -469 -626 -7628 -1085 3925 8853 1458 1499 10402 2644
14697 2644 -6632 1761 -7442 -260 6519 9666 8576 6749 7024 6472 787 3643 14595 9617 -6193
14682f193n461K0391J1499P939K21P034l354Q325r088k0378l458K572q33o7l709
14667E440j428k611R12J6565j066j2781j1973k936J071J8240j0784r993J356k473
14653a2461N247j002M966j1146m281Q13m014l561j478K039n677M052o067L0273
14639b297J0364j1786j8316J154M705J8230o38p245K2597J0461j3838n50k0683
14626g842j9124J145l644K969L194J9524R552l865n870K284K058j4888R48k468
14612a6027J1739J0161J59k1777j0087O768j002J5611n5J128j2513p460J0594
14599a2761L296M963P119j1465j7578L695J1021Q603k790j138J1345n097j17L927
14585C023p824j0698J2339P048J2986O422O901o424k695n420o703M444J1708o019
$$ plain form
14682 -6193 -11654 8737 20236 28175 28396 35430 32076 40401 31313 10935 7477 10049 9216 9149 5440
14667 5440 4012 1401 2313 18878 17812 5031 -6942 -9878 -8807 9433 -1351 -11344 -9988 -12461
14653 -12461 -7214 -8216 -3250 -14396 -18677 -17864 -21878 -25439 -26917 -24878 -30555 -26503 -32570 -2297
14639 -2297 8067 -3719 -22035 -20881 -16176 2054 1416 -5829 16768 27229 13391 12841 -7842
14626 -7842 -26966 -25821 -29465 -26496 -23302 -3778 5774 1909 -3961 -1677 381 -14507 -13559 -16027
14612 -16027 -4288 5873 6032 -15745 -25832 -19064 -20066 -4455 -4510 -3382 -15895 -23355 -12761
14599 -12761 -9465 -4502 2617 -8848 -26426 -22731 -11710 -3107 -5897 -7035 4310 -787 -904 3023
14585 3023 -4801 -15499 -3160 3888 16874 23296 30197 23773 21078 15658 8955 13399 25107 19088
14571A9088k4066J684R519k345j2082l929K897J1118J229K970j94k638M7k972
14557C26O198L527P437K868j4357J5274l733m559N065n555l54l7j0275Q142j5833
14542e866K810J4000K964Q77j6071j2881P082M88n630J8580J7686M992r608k0463
14528a040J919K6909o937j6515J2213j444J596k599j6950j0306O090J913l612
14515h763J861N232R22J9829N362j3372L239J1661j6386j1859P312M29J491o36
14501F322O938l246l901j637p85j697r109j850P038m052J205n984k828k881J0493
14486e974K1363j4314N556O376j2082j3824K0588K0296j1723k2898p457O056J5810
14473G773l449j0406L48m929j816M253r919J899R853m439M122R423m981O129O737
$$ plain form
14571 19088 -4978 -3294 6225 3880 -8202 -12131 -9234 1884 3113 6083 5889 3251 3298 326
14557 326 6524 10051 17488 20356 5999 21273 17540 12981 18046 12491 12137 12100 1825 9967 -5866
14542 -5866 -3056 10944 13908 14785 -1286 -14167 -7085 -6597 -12227 6353 24039 29031 19423 -1040
14528 -1040 879 27788 20851 4336 16549 15105 16701 14102 -2848 -13154 -7064 -5151 -8763
14515 -8763 -6902 -1670 -748 19081 24443 11071 14310 25971 9585 -2274 5038 5467 6958 6322
14501 6322 13260 10014 6113 4476 3691 1994 -7115 -8965 -1927 -5979 -4774 -10758 -13586 -16467 -5974
14486 -5974 15389 1075 6631 13007 925 -12899 7689 27985 16262 -6636 -14093 -8037 7773
14473 7773 4324 -6082 -5734 -10663 -12479 -8226 -18145 -16246 -6393 -10832 -6710 2713 -2268 3861 10598
14458A0598o862l300M035l008o7J3949J570j3193j4320K965K877m783J1124R675
14444A1260k713O194J6801P810j7876j7767o245Q59K0185k499j4916o098q62J661
14430d206n208L177J5774r856o331J026R692J8294J4548l566j0790k609j0348
14417I597m558J0086J930j0620j3134m223n079p246J8160Q290Q933N818r15J135
14403A8174K442J622j388O281l344l1j0151j9383Q566k100j6654P596J8134K008
14389A1772P525j0549j0587K4622J2862p315r303j6549M25P808m691l987J1942
14376A3975k071k245K078j8805j4880P200K2371j292N415J1856L532j6765R9J8564
14362B9032J0131j6622j6852j2101l861J7916L498k912n742j7458J1030P649j386
$$ plain form
14458 10598 3736 436 4471 1463 1396 15345 16915 3722 -10598 -7633 -4756 -9539 1585 11260
14444 11260 8547 14741 31542 39352 21476 3709 -2536 -1677 18508 16009 1093 -5005 -5867 -4206
14430 -4206 -9414 -6237 9537 -319 -6650 -5624 4068 22362 36910 33344 22554 19945 9597
14417 9597 5039 15125 17055 6435 -6699 -10922 -16001 -23247 -5087 3203 12136 17954 17039 18174
14403 18174 20616 22238 20850 27131 23787 23756 13605 -5778 2788 688 -15966 -8370 9764 11772
14389 11772 19297 8748 -1839 22783 35645 28330 19027 2478 2903 10711 6020 2033 13975
14376 13975 11904 9659 11737 -7068 -21948 -14748 7623 6331 11746 23602 27134 10369 10468 29032
14362 29032 39163 22541 5689 -6412 -10273 7643 11141 8229 2487 -14971 -3941 3708 2322
14349B322k089P30l609J1112K823k708L960L884j0960p480n208L183K3731p441
14335A2250l458j7231P64j1534p068K1755J6501j3221k1214Q213j383o24q787
14322b5037L174L008j732K891J8853m910l291k532M491j3642r303J1392J2610
14309d028p009q329l364O022L86l170J7893R825m748n677J1066P086r459L928
14295A0422O660oR1j1261j601j672o979q592O313J1654R253O91q860L329L460
14280A2902O774Q608O229p47k2395j4517R936p372L76p588m576L927j833J35R88
14265i153M911J8296P189l448L43m188j6449k915m690j1962J2483J6697n403j334
14251C77J6164l241j261J1846J754j2098p91J2514J2767m122j5866j5898M63j0393
$$ plain form
14349 2322 233 963 -2646 8466 11289 8581 12541 16425 5465 -2015 -7223 -4040 19691 12250
14335 12250 8792 -8439 -7675 -19209 -26277 -4522 11979 -1242 -22456 -14243 -15626 -16250 -25037
14322 -25037 -21863 -18855 -20587 -17696 1157 -3753 -7044 -9576 -5085 -18727 -28030 -16638 -4028
14309 -4028 -11037 -19366 -22730 -16708 -16322 -19492 -1599 8226 3478 -2199 8867 15953 6494 10422
14295 10422 17082 17076 17167 5906 4305 2633 -4346 -12938 -6625 5029 14282 14973 6113 9442 12902
14280 12902 19676 28284 34513 33766 11371 -3146 6790 -582 -206 -7794 -12370 -8443 -10276 -10141 -9153
14265 -9153 -4242 14054 21243 17795 18138 13950 -2499 -5414 -10104 -22066 -9583 7114 1711 377
14251 377 16541 13300 12039 23885 25639 13541 12750 25264 38031 33909 18043 2145 2608 -7785
14237g785L191l673M598m200J1806J0801J306j0239j5723r87M19j3542L841M089
14223a6098Q397J2083m825j492q15Q742J6528j1461q932P463J1468r414j6074
14210d430P94J8541m570K572p033q403J070J3380J4508M425M740j3148n742K547
14196A9251j0057j27K908k332j5761l094l55j1480j3848J1829J603j524Q076J3291
14182a620q268Q151p300o043M133k66n650p60Q056O085l785Q664M083l170j7325
14167a5015o226K876r51n378K894P344J7988k37Q605J2108L618K743j1856m662
14153A3851l919j418k521M958j3431l799J3619J2319l75j6012p772J5951J4131
14140B5582k713j0369j3308l354l541r579o817K714R15o69j770m91J1853K601
$$ plain form
14237 -7785 -4594 -8267 -3669 -7869 3937 14738 16044 5805 -9918 -10905 -10486 -24028 -20187 -16098
14223 -16098 -7701 4382 -443 -1935 -2750 5992 22520 11059 2127 9590 21058 11644 -4430
14210 -4430 -3636 14905 10335 12907 5874 -2529 -1459 11921 26429 30854 35594 22446 16704 19251
14196 19251 9194 9067 11975 9643 -6118 -9212 -9567 -21047 -34895 -23066 -21463 -22987 -14911 -1620
14182 -1620 -9888 -1737 -9037 -15080 -10947 -11213 -16863 -17623 -9567 -3482 -7267 1397 5480 2310 -15015
14167 -15015 -21241 -18365 -19316 -24694 -21800 -14456 3532 3295 11900 24008 27626 30369 18513 13851
14153 13851 9932 8514 5993 10951 -2480 -6279 7340 19659 19284 3272 -4500 11451 25582
14140 25582 22869 12500 -808 -4162 -7703 -17282 -24099 -21385 -20470 -21139 -22909 -23400 -11547 -8946
14126h946q835N546R777j113l040O406q610m851k10N567J5561J316n797J251l99
14111C623j2027M092P504l115K358o785P746L402r776r119M47N951M915J1434
14097A0650O138m266j1461N241K07j0083k254J0623n096k464J8887K230n489p335
14083E528J1534K269k8559J3668L665L337R670j098p354r601K762o335j4223Q072
14069f665R820O760m846J3727N779m353j0925l446J0533J1735n011j9846p470
14056d208j394l984Q399r211L878J27n739Q268J7946R744l434r363O454n796r380
14041B307L105J5727m363j5332j7763K813j538q950J7952J5675r211n687J7259
14028A1994J1417j2326p330l800p701P95Q40k21K0125O283M153O002R781k677
$$ plain form
14126 -8946 -17781 -12235 -2458 -3571 -6611 -205 -8815 -13666 -13876 -8309 7252 8568 2771 4022 3623
14111 3623 -8404 -4312 3192 77 2435 -4350 3396 6798 -2978 -12097 -11650 -5699 -784 10650
14097 10650 16788 12522 1061 6302 6509 -3574 -5828 4795 -301 -2765 16122 18352 12863 5528
14083 5528 17062 19331 -9228 4440 8105 11442 21112 20014 12660 3059 5821 -514 -14737 -6665
14069 -6665 3155 9915 5069 18796 24575 20222 9297 5851 16384 28119 23108 3262 -4208
14056 -4208 -5602 -9586 -1187 -10398 -6520 -6393 -12132 -3864 14082 23826 20392 11029 17483 11687 2307
14041 2307 5412 21139 16776 1444 -16319 -13506 -15044 -23994 -6042 9633 422 -5265 11994
14028 11994 23411 11085 3755 -45 -7746 -6951 -6111 -6332 13793 20076 24229 30231 40012 37335
14014C7335j4373j9002k918o473Q000N271n560P065M550j4317r026Q061P492J99
14000F304J0849l185k2092j054J1941l671M343j812J2283k356j607k043q387l097
13986c584o848N477j495q478o224K2106l568j2764p797O416J2621L479o472k877
13972a0008L85K017P575L682n909N983k891J673m383p89J0482j0837j6404J48
13958a9276J4892J1572K89O721q482j443Q464L733K381J0357J1598r716j2345
13945A8745j6611j6815j2253R1J0620J5955L34n384J2796J9218j3701n089M081
13932A1987j7459j3195k008J1280J5361R282R985j0419k9045j3525K722J2970
13920a2064J6153K3627o76j5077j6413j2138R999N220L84Q036r239q16j758L269
$$ plain form
14014 37335 22962 3960 1042 -5431 2569 7840 2280 9345 13895 -422 -9448 -1387 6105 6304
14000 6304 17153 13968 -8124 -9178 2763 -908 3435 1623 13906 11550 9943 7900 -487 -3584
13986 -3584 -10432 -4955 -6450 -14928 -21152 954 -2614 -15378 -23175 -16759 -4138 -659 -7131 -10008
13972 -10008 -9623 -7606 -31 3651 -2258 3725 834 2507 -1876 -2665 7817 -3020 -19424 -19276
13958 -19276 -4384 7188 7477 14198 5716 4273 12737 16470 18851 29208 40806 31090 18745
13945 18745 2134 -14681 -26934 -26843 -16223 -268 66 -5318 7478 26696 12995 7906 11987
13932 11987 -5472 -18667 -20675 -9395 5966 15248 25233 14814 -14231 -27756 -25034 -12064
13920 -12064 4089 27716 27040 11963 -4450 -16588 -6589 -1369 -985 7051 -2188 -3004 -4762 -1493
13906a493l347N164q793J9332J4951n998j168j7441n224k666O323N343J856L389
13892A0228m728j3842p486N337j507m377J5817J7030p259j2201n231k022J3360
13879C119O706L888m369K38L186p270j1902K1802O013j5479k0102m488K3049L171
13865G562k045L093J0580j2022j0114J384N961N390m340K83R300j6279j6221k58
13851a7726J2845O942N250N092k401J200J382q855O997O754q110j4826J1210L200
13837H954r315o510J4641R644n935k095P118R127j309m588L07p335j5655j922
13823d873j932o401N594J7787K1850L439j445q776n360J2663Q58L80l764k151
13809B7869j4644l847J0734j2427k235l63N491K467j2281j6969o484J4923p73
$$ plain form
13906 -1493 -4840 324 -8469 10863 25814 19816 18648 1207 -4017 -6683 -360 4983 6839 10228
13892 10228 5500 -8342 -15828 -10491 -11998 -16375 -558 16472 9213 -2988 -8219 -10241 3119
13879 3119 9825 13713 9344 9582 12768 5498 -6404 15398 21411 5932 -14170 -18658 4391 7562
13865 7562 5517 8610 19190 7168 -2946 -1562 4399 9789 5449 5732 15032 -1247 -17468 -17726
13851 -17726 -4881 2061 7311 12403 10002 11202 12584 3729 10726 17480 9370 -5456 5754 8954
13837 8954 -361 -6871 7770 17414 11479 9384 16502 25629 24320 19732 20039 12704 -2951 -4873
13823 -4873 -6805 -13206 -7612 10175 32025 35464 34019 25243 19883 32546 33404 33784 30020 27869
13809 27869 13225 9378 20112 7685 5450 5087 10578 13045 764 -16205 -22689 -7766 -8539
13796h539m323K744J9802M497k617Q42p271n898k78L386K536j2755m184K984r375
13781a8449k209O812M570j8671P400J3369O318k468l639J4683J1931l116j5104
13768A427K345O643K504L388M637j0018j8116j6352J0073J2331P177J3361M015
13755B3415M358N055j27O769L096m669j7504j9056j5705j3984N202j629m382J7560
13741a1601Q380j940Q75m197N979J097O206o23N985j3866J297L088p90K215J4471
13726A6576j301L057l299m156j4950j6276L556K275r043J075L959P413n637L412
13712a3339O739P711K621K895n765o784J953K526K712P694n65j314j0745J87O866
13697C392L141k424K519Q198j5822j5405O621r648l291K3854J9339O222j0656
$$ plain form
13796 -8539 -12862 -10118 9684 14181 11564 12406 5135 -763 -1041 2345 4881 -7874 -12058 -9074 -18449
13781 -18449 -20658 -13846 -9276 -27947 -20547 -7178 -860 -3328 -6967 7716 19647 16531 1427
13768 1427 3772 10415 12919 16307 20944 10926 -7190 -23542 -13469 -1138 6039 19400 23415
13755 23415 27773 32828 32701 39470 42566 37897 20393 1337 -14368 -28352 -23150 -24779 -29161 -11601
13741 -11601 -3221 -5161 -4286 -8483 -2504 -1407 4799 4176 10161 -3705 -2408 680 -110 2105 16576
13726 16576 15275 18332 15033 10877 -4073 -20349 -16793 -14518 -23561 -22486 -18527 -11114 -16751 -13339
13712 -13339 -6600 1111 3732 6627 862 -5922 -3969 -1443 1269 8963 8398 7084 -3661 -3474 3392
13697 3392 6533 4109 6628 14826 -996 -16401 -9780 -19428 -22719 1135 20474 26696 16040
13684A6040K295K571j6648j6969Q270q584N478J1437j0482q238N992o41j734r72
13670a2185j1862Q690J1852l415q231n10J2677l654p521N057r658k307p101m737
13656c2905j067J4579L048P195K30R021J830J168L648L07p296j5344K763P023
13642e800M511p068M343O96j5418k577J0592K6967J3976m076j7963k1504J4422
13629A101O579r996n748k606J1005j0229q834J5961N465k315J142k518k505K499
13615i99l417o185l95K1028J0283p702j6512N141N094o663o06l081O133R28k405
13600F42J88K267r47j074J31j7828o619j0262P768K501L315K1606J1763K2417
13586C5868O822o699j7365k2857j1949L737J0623Q195l986j5065L347n660K266
$$ plain form
13684 16040 18335 20906 4258 -12711 -4441 -13025 -7547 3890 -6592 -14830 -8838 -9479 -11213 -12185
13670 -12185 -24047 -15357 -3505 -6920 -15151 -15661 -2984 -6638 -14159 -9102 -18760 -21067 -28168 -32905
13656 -32905 -33972 -19393 -16345 -9150 -8920 101 1931 3099 6747 7054 -242 -15586 -12823 -5800
13642 -5800 -1289 -8357 -4014 -3318 -18736 -21313 -10721 16246 30222 26146 8183 -13321 1101
13629 1101 7680 -2316 -8064 -10670 335 -9894 -18728 -2767 2698 383 1525 -993 -3498 -999
13615 -999 -4416 -10601 -10996 10032 20315 12613 -3899 1242 6336 -327 -933 -4014 2119 3047 642
13600 642 830 3097 2150 1076 1207 -16621 -23240 -33502 -25734 -23233 -19918 1688 13451 35868
13586 35868 42690 35991 18626 -4231 -16180 -12443 -1820 6375 2389 -12676 -9329 -14989 -12723
13573a2723J028q434J136L6641K1201J465r111M113M948j1534k0122L834K984
13560A5426k1000j8869l541J3570J1723j2878J9450k974R16J7628P874j6935j9522
13547i132K2443O951r995q018K582o922q755J0445K332n910j209O901J3380L294
13533A8387j1718p035L14K754J102m961o066k340M274J623K215j951k806o61J4530
13518G661k131j1651l380j159j0931k598J3982j59j1362o979M0J1554Q083o138
13504a5168o201P944O719j1574m151J4608L099j8702P69Q004P636K1799p082l194
13490D506q471j2604r271O429J3771R012r369j438J5736J6779j670L803p060j5157
13476D996j1213j681o60N381K075Q96J0530r950j0390N200O42k932k445P788N366
$$ plain form
13573 -12723 -11695 -20129 -18993 17648 38849 40314 31203 35316 40264 28730 8608 12442 15426
13560 15426 -5574 -24443 -27984 -14414 -2691 -15569 3881 907 1823 19451 27325 10390 -9132
13547 -9132 13311 20262 10267 2249 4831 -2091 -10846 -401 1931 -3979 -5188 1713 15093 18387
13533 18387 6669 -366 -52 2702 3804 -1157 -7223 -9563 -5289 -3666 -1451 -3402 -6208 -6869 7661
13518 7661 5530 -6121 -9501 -10660 -21591 -24189 -10207 -10366 -21728 -28707 -28667 -17113 -9030 -15168
13504 -15168 -21369 -13425 -6706 -18280 -22431 -7823 -4724 -23426 -22657 -14653 -7017 14782 7700 4506
13490 4506 -3965 -16569 -25840 -19411 -5640 3372 -5997 -7435 8301 25080 23410 27213 20153 4996
13476 4996 -6217 -7898 -8558 -3177 -1102 -206 10324 374 -10016 -4816 -4174 -7106 -9551 -1763 3603
13461C603q457k708J960M640o366R651j0321j5122n54L985P170J1044l85K070
13447B10j763O484j0735j323M953N149Q782l03k840q348p405J2351N294l952j7850
13432a1296O595J0104l933j4340j5038k739K932J7368N583n123P299Q559j0848
13419d877m473l826M460J5229L335P542J1660J430j0651P387r180j7709j3136
13406a2809P920R130J572O572M491j2756q246Q064k346j1305k446L503R086P808
13392H238j047o098n386p8J964M730O670j098j2255R168r115l843N146J0208N491
13377A2695K233J768K099j553o589r910m19L067J5378J1588O041l976j1248j1131
13363A0043p625P138j6417M831J4857L78j2327M187K817m91q33O014q339o919
$$ plain form
13461 3603 -4854 -7562 -5602 -962 -7328 2323 -7998 -23120 -23674 -19689 -12519 -1475 -1860 210
13447 210 -1553 4931 -5804 -7127 -2174 2975 11757 11454 8614 266 -7139 5212 10506 6554 -11296
13432 -11296 -4701 5403 1470 -12870 -27908 -30647 -27715 -10347 -4764 -9887 -2588 5971 -4877
13419 -4877 -9350 -13176 -8716 6513 9848 17390 29050 30480 19829 27216 18036 327 -12809
13406 -12809 -4889 4241 5813 12385 16876 4120 -4126 3938 1592 -9713 -12159 -8656 430 8238
13392 8238 7191 1093 -4293 -4371 -2407 2323 8993 7895 -4360 4808 -4307 -8150 -3004 7204 12695
13377 12695 14928 16696 18795 17242 10653 743 324 3391 18769 30357 36398 32422 21174 10043
13363 10043 2418 9556 -6861 -2030 12827 13205 878 5065 7882 7391 6558 12572 4233 -2686
13349b686j90J0298J1455l285j4313M82o304N848O280L099O39N928J985k570j0478
13334F188l064k189j892k034j0943k236n01R127K88P152K1400j677k0278j4405
13320a5064N72P962M14m834R615J2957N412k0848M553J3569p504j0399k480k913
13306h988P255R144K2206J0379q341j1557j3013K07N127k306M611k2306k550Q510
13292a622l654l376m054P708o534Q523J096m236J472j865L133P397J2288n383
13278A0893r182j1350o249J0249J3105K524n495P16l023m280j683J886m548N693
13264g44k978O883o501k7290o233K581J8891J0322L349M858N683J0511j5334j0242
13250f244L977J3684n742O00o346j1408K252q89K71j3411P240K2176j2418j3466
$$ plain form
13349 -2686 -2876 7422 18877 15592 1279 1761 -4543 1305 7585 10684 11323 17251 19236 16666 6188
13334 6188 3124 935 -957 -2991 -13934 -16170 -16671 -7544 -7256 -104 21296 19619 -659 -15064
13320 -15064 -14492 -6530 -6116 -10950 -1335 11622 17034 -3814 739 14308 6804 -3595 -6075 -8988
13306 -8988 -1733 7411 29617 39996 31655 20098 7085 7292 12419 10113 14724 -7582 -10132 -1622
13292 -1622 -5276 -8652 -12706 -4998 -11532 -3009 -1913 -6149 -4677 -6542 -3409 3988 16276 10893
13278 10893 1711 -9639 -15888 -5639 7466 9990 4495 5211 2188 -2092 -3775 -1889 -6437 -744
13264 -744 -3722 3161 -3340 -30630 -36863 -34282 -15391 -5069 -1720 3138 8821 19332 3998 -6244
13250 -6244 -2267 11417 5675 6275 -71 -11479 -9227 -10116 -9845 -23256 -16016 6160 -6258 -19724
13236a9724p150P285P091J1233J2270j4425k0014Q514J7141o635p347J6297R540
13223A4076J027o522o570R24L846J2923k295j3123m326O279l905j90N293Q351
13209A5788p502R391r776j3938K59P467l161r623l181q060m648K2840l556m112
13195a1812P117M127k838N067L354j1299j3215J1262K8160J7236r164M15K3268
13182E1678j3244j8016j1078L228Q911Q304k707r913j3018l891J1665K437O77
13169A5033j2481j4399q42J194K310o49J3739q226l390N391j1253o571J0338J3791
13155C985l035K08N29q62L488Q63M209j3956J6927n272r38P854k84O521J3069
13140C3306j0446J3973p291k795K344q363n892q522j3167k901N822J998j0979
$$ plain form
13236 -19724 -26874 -19589 -12498 -1265 11005 -3420 -23434 -14920 2221 -4414 -11761 4536 14076
13223 14076 15103 8581 2011 2935 6781 19704 17409 4286 -40 6239 2334 2144 7437 15788
13209 15788 8286 17677 7901 -6037 -5778 1689 -1472 -11095 -14276 -22336 -26984 -4144 -7700 -11812
13195 -11812 -4695 -568 -3406 1661 5015 -6284 -19499 -8237 19923 37159 27995 28410 51678
13182 51678 38434 20418 9340 12568 21479 29783 27076 17163 4145 254 11919 14356 15033
13169 15033 2552 -11847 -12689 -11495 -9185 -9834 3905 -4321 -7711 -2320 -13573 -20144 -9806 3985
13155 3985 950 1158 1687 825 4313 5176 9385 -4571 12356 7084 6146 14000 13716 20237 33306
13140 33306 22860 36833 29542 26747 29091 20728 14836 6314 -6853 -9754 -3932 -1934 -12913
13127a2913P952N66l274j087r084P524J1719L361K3357j1120o516n809r093l553
13113g970j25P597Q936q625j544L473j1766n271K373L437P488R353J0554M02o746
13098A1566q180n515l5N701L0399K0688j677j3360j0526j8771O388R955L954J206
13084C1793j6795r476q38J0288r712j5289R710J1401Q517m095j1868M06m410k94
13070f62j5018j071J1314l713J235O032J1730M734j483p644J077N456l112q956
13056h1K447p236j1770j7022o517J6506O247J2469j868j8350J6197J2010m077
13043a045Q588J3992m371j6899n204m159p610j0837J3252Q887j2521q361J2152
13030a4136j648q083Q88m107L864N719J0639m400R989P52k762K487K688K484Q225
$$ plain form
13127 -12913 -4961 -4395 -7669 -8756 -17840 -10316 1403 4764 28121 17001 10485 4676 -4417 -7970
13113 -7970 -8095 -498 8438 -187 -1731 1742 -10024 -15295 -12922 -9485 -1997 7356 17910 18312 11566
13098 11566 3386 -2129 -2164 3537 33936 54624 52947 39587 29061 10290 16678 26633 30587 31793
13084 31793 14998 5522 4684 14972 5260 -10029 -319 11082 19599 15504 3636 4042 -368 -662
13070 -662 -15680 -16751 -5437 -9150 -7915 -1883 9847 14581 13098 5454 6531 11987 8875 -81
13056 -81 2366 -4870 -16640 -33662 -40179 -23673 -17426 -4957 -6825 -25175 -8978 3032 -1045
13043 -1045 7543 21535 17164 265 -4939 -9098 -16708 -27545 -14293 -5406 -17927 -26288 -14136
13030 -14136 -15784 -23867 -22979 -27086 -23222 -17503 -6864 -11264 -1275 -523 -3285 -798 1890 4374 12599
13015A2599R135n930k9227p70J3879N081r906n532J743k042J819Q029K934n208
13001c396n75o273J048Q808Q926k566q686o807n35N190J49O096J0129l743m109
12986C656p974m675N80k1554j0682J1743P898J768L160j2431J1120J6239R368
12973H216m436l546K52j7873L39R917J7928n006n183J746j5017j5816J4436K412
12959a1631K478N435J2185R72n156q597l810J4231J1226J0264j2031j6359j0416
12946a1209j2877J3726J8397J3523k474K917p955k61k551j4745j890M419L420
12933B440Q838j002L248J575M827M605M43j0649j3016j1913j413K278Q347O046
12919D654P048p42R8j0562j633l404N857o224P345k321j3785r771J6609K883N959
$$ plain form
13015 12599 21734 15804 -13423 -14193 -314 4767 -5139 -10671 -8928 -10970 -9151 -1122 1812 -3396
13001 -3396 -3971 -10244 -9196 -388 8538 5972 -2714 -9521 -10056 -4866 -4717 1379 11508 7765 3656
12986 3656 -4318 -8993 -8413 -29967 -40649 -28906 -21008 -19240 -16080 -28511 -17391 -1152 8216
12973 8216 3780 234 486 -17387 -17048 -7131 10797 5791 608 2354 -12663 -28479 -14043 -11631
12959 -11631 -9153 -3718 8467 9439 4283 -4314 -8124 6107 17333 27597 15566 -793 -11209
12946 -11209 -24086 -10360 8037 21560 19086 22003 14048 13787 11236 -3509 -5399 -980 2440
12933 2440 11278 10276 13524 15099 19926 24531 24974 14325 1309 -10604 -12017 -9739 -1392 4654
12919 4654 11702 10960 11058 496 -1137 -4541 1316 -4908 2437 116 -13669 -23440 -6831 -3948 2011
12904B011M576k875J622j0742l609n773O477J624n81K427J9632j622N93l800j5146
12889e186j6125k369O374K486j610N954O387k806o659K252k0392o226P686Q67
12875b9367J3755J4165k077j1313m086N062Q95m364R58J5655j0453J7396O453
12862A2679r15j1690Q857k172o675r204m610m924K407J4307J2821K572M24j7280
12848c403k237K243o429n557K05O660Q176P505j706j3717M994R114J0017j1480
12834D385j0568L13j4499M613n593l851P628K0962J2804Q74p706o382j0372J070
12820f322j063n726K761K687L75m389p8N67j80j6640Q327J4060Q301Q631k308
12805I003j0256J978J9058L91j6972j1632J6653l885l479J770l938k014l187J075
$$ plain form
12904 2011 6587 3712 5334 -5408 -9017 -14790 -8313 -6689 -7270 -4843 14789 13167 13760 9960 -5186
12889 -5186 -21311 -23680 -17306 -14820 -16430 -10476 -4089 -6895 -13554 -11302 -31694 -37920 -30234 -29367
12875 -29367 -15612 -1447 -3524 -14837 -18923 -13861 -12966 -17330 -16372 -717 -11170 6226 12679
12862 12679 11764 74 8931 6759 84 -9120 -13730 -18654 -16247 -1940 10881 13453 13877 -3403
12848 -3403 -5640 -3397 -9826 -15383 -15178 -8518 -342 7163 5457 -8260 -3266 5848 15865 4385
12834 4385 -6183 -5870 -20369 -15756 -21349 -25200 -17572 3390 16194 17068 9362 2980 -7392 -6322
12820 -6322 -7385 -13111 -10350 -7663 -7288 -11677 -11755 -11188 -11368 -28008 -19681 -5621 2680 11311 9003
12805 9003 -1253 725 19783 20174 3202 -8430 8223 4338 859 2629 -1309 -3323 -6510 -5435
12791e435q821O848Q576M47J038N024n359j0870J85J0835Q284j1896m019l420
12777h583J315K039N158J0634J1253j6728k016o184K352J3844N301j9097o649
12764g361J0547o674M853O143l375p035r115J4551k027m891k052J0860p54O453
12750A0123Q119R847q388p810k279j958Q242n761m044Q82M116J0523n581j9092
12736c061k5389k266l331J0915N014J3654p102J0595J6372J069J459J777N235
12723B4941k708m250j3605j4334O1J7938Q47r525o36L812n333o755l760j4466
12709b7773K141J5401N673m122J536r508M25Q925O666J6552J0530P4j1709j6864
12695b053K242j108J6560Q513K688m663j1396l103J0378l416j792J2885K281p440
$$ plain form
12791 -5435 -14256 -7408 1168 1615 2653 7677 2318 -8552 -8367 2468 10752 -1144 -5163 -8583
12777 -8583 -7268 -5229 -71 10563 21816 5088 3072 -3112 -760 13084 18385 -712 -7361
12764 -7361 3186 -3488 1365 7508 4133 -2902 -12017 2534 507 -4384 -6436 4424 3670 10123
12750 10123 18242 28089 19701 11891 9612 7654 15896 10135 6091 6973 11089 21612 16031 -3061
12736 -3061 -28450 -30716 -34047 -23132 -18118 -4464 -11566 -971 15401 16470 17929 19706 24941
12723 24941 22233 17983 4378 -9956 -9895 8043 8890 -635 -1271 2541 -2792 -9547 -13307 -27773
12709 -27773 -25632 -10231 -4558 -8680 -7144 -16652 -16227 -7302 -636 15916 26446 26520 14811 -2053
12695 -2053 189 -919 15641 24154 26842 22179 10783 7680 18058 14642 12850 25735 28016 20576
12681B0576J387q83o069n484k094J286m408j0232lK8821j2656j3010p288L438
12667f619l053P844j3557q060Q18Q110m035L979J2301J3665j4090j0079j363O579
12653g560l305L567j407j467J763r232N475J5421O319J0345j4595p287J1497R889
12639A9423j315j0946j8043p599j2392R933Q842L371o748m819K3365m542j0138
12626a1608m479N34K240Q352o649l931L499K030J5818O043Q28q201r00M67M764
12611H807K46n696j2392l444k777k505k891J8240J2486n970j3834lJ2036j165
12597A138M024M897r748j0935j4135P741R392O665N377J1579O533r282J5858J671
12583C0775n351j2962j5328j3957N982J3562j1249p780j3866n253m919R045O794
$$ plain form
12681 20576 21963 21080 15011 9527 7433 8719 4311 -5921 -5924 22897 10241 -2769 -10057 -6619
12667 -6619 -9672 -1828 -15385 -23445 -22627 -14517 -18552 -14573 -2272 11393 -2697 -12776 -14139 -7560
12653 -7560 -10865 -7298 -8705 -10172 -8409 -17641 -12166 3255 9574 19919 5324 -1963 9534 19423
12639 19423 18108 7162 -10881 -18480 -30872 -20939 -12097 -8726 -15474 -20293 3072 -1470 -11608
12626 -11608 -16087 -15553 -13313 -4961 -11610 -15541 -12042 -10012 5806 11849 12677 4476 3576 4043 8807
12611 8807 9053 3357 -9035 -12479 -15256 -17761 -20652 -2412 10074 4104 -9730 -9733 2303 1138
12597 1138 5162 10059 311 -10624 -24759 -17018 -7626 -961 4416 15995 22528 13246 29104 30775
12583 30775 25424 12462 -2866 -16823 -10841 2721 -8528 -16308 -30174 -35427 -40346 -31301 -24507
12570b4507J0947J2452j3821j2528N611J1388J1154j739J3301q434O341J2062
12558B2227J3610l580l0373l973J7925j1318N923P229m533l738j6593M333j572
12545d433N535l910r025n959N239J0461J434j3062p601Q240K0226M947l774j3798
12531e480J067N185Q610J1429j0927o028N700n888J4378K823J039O882j6154k4106
12517a1470p146j119J1887O140p423L576O92o093n405n16n341J4297o324l780
12503a8025J3479J2731P632J0982q651k822k033o9q815k820L902p115K684K7914
12489B8974q239j6403m332J680K375M16K382K556r360j3864P952J850k884J047
12475e850R571k631j1129o133j5802j1887R612Q166J0489N872K52N103L149J2125
$$ plain form
12570 -24507 -13560 -1108 -14929 -27457 -21846 -10458 696 -1043 12258 3824 10165 22227
12558 22227 35837 32257 1884 -2089 15836 4518 10441 17670 13137 9399 -7194 -2861 -4433
12545 -4433 1102 -2808 -11833 -17792 -12553 -2092 -658 -13720 -21321 -13081 7145 12092 8318 -5480
12531 -5480 -4413 772 9382 20811 9884 3856 9556 3668 18046 20869 21908 28790 12636 -11470
12517 -11470 -18616 -19735 -7848 -1708 -9131 -5555 -4863 -10956 -16361 -16877 -22218 -7921 -14245 -18025
12503 -18025 -4546 8185 15817 26799 18148 15326 13293 13224 4409 1589 5491 -1624 1060 28974
12489 28974 20735 4332 0 1680 4055 4471 6853 9409 49 -13815 -5863 -4013 -6897 -5850
12475 -5850 3721 1090 -10039 -16172 -31974 -43861 -34249 -26083 -15594 -9722 -9470 -4367 -1218 10907
12461A0907r657R591J4629l28l559m991o467j2278k0882M277J1503J2691m17m966
12447E3J490L064K559q38M036o902q115P02N510K059o027j218L879O109J4504
12432B0865o454j993K707n969N000r337j9537l213p539q396K64P315K5437J0266
12418I416k685j2208K502p260M023K3305Q935P83r470j3861q853m9P065Q270O560
12403A6473j0384L999p787m226P547N17p651O18J838N240O167n367r520l99J2967
12388A0032J6461M394j228n401j5798j0031r001J4042K471j1137k2077j0620J208
12375c6685J8571K5934J8767m977r671j0847n244j0285P793J0880J2908q394q639
12362A11j0706J2727J1128j0306j5771j1623K145q347Q701J1734K2680L270j9626
$$ plain form
12461 10907 1250 10841 25470 25142 21583 16592 10125 -2153 -23035 -18758 -7255 5436 5019 53
12447 53 1543 4607 7166 6328 10364 3462 -4653 -3951 1559 3618 -2409 -3627 252 6361 20865
12432 20865 14411 12418 15125 9156 14156 4819 -14718 -17931 -25470 -33866 -33602 -26287 -850 9416
12418 9416 6731 -5477 -2975 -10235 -6212 17093 26028 26811 17341 3480 -5373 -5422 1643 9913 16473
12403 16473 6089 10088 2301 -1925 5622 6139 -1512 -894 944 6184 12351 6984 -2536 -2935 10032
12388 10032 26493 30887 29659 24258 8460 -1571 -10572 3470 5941 -5196 -27273 -37893 -36685
12375 -36685 -18114 7820 26587 21610 11939 1092 -4152 -14437 -6644 4236 17144 8750 111
12362 111 -10595 2132 13260 2954 -12817 -24440 -22295 -30642 -21941 -10207 12473 15743 -3883
12349c883L793O613L684q540j3030l3403o422K3905J0164J1455j244J1442R073
12336A3607j4205j8529J977J6847j1525m178J8328p328M90J1964m569j2447o501
12323a6069j0521L085J0029q495N222K0404R621j2895o191Q31l14p662N208J2516
12309D769J7301q279r761P624J0437M093j611j3110J894j0665r419N45j748p393
12295a5323Q81K4088K2114N415r712o169P283N226j915n999M833o293k0980m783
12281a334j3439o742J1677r877M369o771J4602M586M978p904j2308J1936J6687
12268A0460j5282j0273J4286K134r682j4668K910P746J41O673j855j7096j4232
12255c8738l940J5509M502M742Q163k238J5798J3878j1120J0835J3931j6314j7477
$$ plain form
12349 -3883 -90 6523 10207 1667 -11363 -44766 -51188 -27283 -17119 -5664 -6908 4534 13607
12336 13607 -598 -19127 -17150 -303 -11828 -16006 2322 -5006 -4516 7448 2879 -9568 -16069
12323 -16069 -26590 -23505 -13476 -21971 -16749 3655 13276 381 -5810 -4979 -5293 -12955 -7747 4769
12309 4769 22070 13791 4030 11654 22091 26184 24573 11463 13357 2692 -6727 -6182 -7930 -15323
12295 -15323 -14442 9646 31760 37175 27463 21294 28577 33803 31888 25889 30722 24429 3449 -1334
12281 -1334 -14773 -21515 -9838 -19715 -15346 -22117 -7515 -2929 2049 -5855 -18163 -6227 10460
12268 10460 -4822 -15095 -809 1325 -8357 -23025 -20115 -12369 -12228 -5555 -7410 -24506 -38738
12255 -38738 -42678 -27169 -22667 -17925 -9762 -12000 3798 17676 6556 17391 31322 15008 -2469
12242b469K344p038j5023j2215N225K0355R092J2033m128J416n081o039R412P768
12228A5652P367M40j1621p339J1883L251J1103n415r534r65j1728j4605r035J3325
12214g221K612n781Q016o080j721l917j1748J380K5178J6827k402n818r18k545
12200E862j5331p086j597p014m621J258O41O369m448M058P64O133O308M812j1461
12185a5353p652O742R219J2692Q588j4936j906q039j3867K193N009M973N285M619
12171b433P09J655K485Q25N36k524j0395R304O792j5308o502J0520k71Q916M541
12156H850o551Q0l40j0946j1098m054J403m564R159K237K114L536m965k712l183
12141b1034j0754M863O688J562p047j700J7181R48n108O534k526j1544R242L828
$$ plain form
12242 -2469 -125 -7163 -22186 -34401 -29176 -8821 271 12304 8176 9592 4511 -1528 7884 15652
12228 15652 23019 23459 11838 4499 16382 19633 30736 25321 15787 14822 3094 -11511 -20546 -7221
12214 -7221 -4609 -10390 -2374 -8454 -10175 -14092 -25840 -24460 718 17545 15143 9325 8407 5862
12200 5862 -9469 -16555 -18152 -25166 -29787 -28529 -27888 -21519 -25967 -21909 -21145 -15012 -8704 -3892 -15353
12185 -15353 -23005 -16263 -7044 5648 14236 -700 -2606 -10645 -24512 -22319 -17310 -12337 -7052 -2433
12171 -2433 -1724 -69 2416 3241 3777 1253 -9142 162 6954 -8354 -14856 -4336 -4607 4309 8850
12156 8850 2299 2379 2039 -8907 -20005 -24059 -22656 -27220 -18061 -15824 -13710 -10174 -15139 -17851 -21034
12141 -21034 -31788 -26925 -20237 -18675 -25722 -27422 -10241 -9293 -14401 -7867 -10393 -21937 -12695 -8867
12127h867R685o240r434K184J9171J6390L343o807j6546o245k640l019J5509q918
12113b434k181k52m338m476J1982O257j7186q846J4617k222M307J583R842J971
12099H624m416J885k163o969p184R695J033K652j2667Q007N48j2205L842M538
12085d780q455j072M045n450J4228J2011M089j3967k0071O581J670n457R339O093
12071a196r878j341Q297K746M847R184j5864r478J3831J0411m394n186j899J017
12057A097J7264q728l2611r502k886K0322P61M021p42J0711K459j5974r622o944
12043c0374J4565j366J5216J6263p514k0209J650J5719Q996n427o15Q131r916
12030E119j5064j3661Q948J6498Q154j3813j6805k338O246L658M386M872k129
$$ plain form
12127 -8867 818 -5422 -14856 -12672 6499 22889 26232 19425 2879 -3366 -6006 -9025 6484 -2434
12113 -2434 -4615 -4867 -9205 -13681 -1699 4558 -12628 -21474 -6857 -9079 -4772 -3189 6653 8624
12099 8624 4208 6093 3930 -3039 -10223 -528 505 3157 -9510 -1503 -955 -13160 -9318 -4780
12085 -4780 -13235 -14307 -10262 -15712 -1484 10527 14616 649 -19422 -12841 -11171 -16628 -7289 -1196
12071 -1196 -11074 -12415 -4118 -1372 3475 12659 -3205 -12683 1148 11559 7165 1979 80 1097
12057 1097 18361 9633 -22978 -32480 -35366 -15044 -14283 -10262 -11004 -293 2166 -13808 -23430 -30374
12043 -30374 -15809 -17175 -1959 14304 6790 -13419 -11769 3950 12946 7519 6904 15035 5119
12030 5119 -9945 -23606 -14658 1840 9994 -3819 -20624 -22962 -16716 -13058 -8672 -3800 -5929
12017e929j481K772M306L084J128P944p820k53j690J212n656N239j1054j3879
12003b2077J931N148L542J5822J6376j3995j8520l847R071K0013j80j0028r527
11990f271O801M518j092N138l554j3838P213J1734P28j0468j1503Q369M701L304
11976E780M361o218o104q114r93p185p17J161J584R653M815P880L468J6286O446
11961C2103j2140j6981j5508R160J0501p918p913J0916P29j7567n552M482M341
11948a1347K749m655l157n063J854p99M486P33N678J404j651P145j201K987J0515
11933I678m048j477j2332K272N742R060p845J2472Q395k519n860n305p611r041
11919h419l632j3554M863k803O85J539N643J5752k721j1029l252p341O17J8929
$$ plain form
12017 -5929 -7410 -4638 -332 2752 3880 11824 4004 3751 2061 3273 -2383 2856 -8198 -22077
12003 -22077 -20146 -14998 -11456 4366 20742 6747 -11773 -15620 -6549 13464 13284 3256 -6271
11990 -6271 530 5048 3956 9094 5540 -8298 -1085 10649 11377 909 -10594 -2225 2476 5780
11976 5780 10141 3923 -2181 -10295 -11288 -18473 -19190 -18029 -16445 -6792 -1977 5903 9371 25657 32103
11961 32103 19963 2982 -12526 -3366 7135 -783 -8696 2220 2949 -14618 -20170 -15688 -11347
11948 -11347 -8598 -13253 -16410 -21473 -19619 -20418 -15932 -15199 -9521 -8117 -9768 -2623 -3824 -837 9678
11933 9678 5630 4153 -8179 -5907 -165 8895 1050 13522 21917 19398 13538 8233 622 -8419
11919 -8419 -12051 -25605 -20742 -23545 -22860 -21321 -15678 74 -2647 -13676 -16928 -24269 -23652 -4723
11905d723J5104O697o939l879o986J899r772o277J1433q56l772K355J0796m908
11891A72J0006P072L723j3977N867j357m087o935n957j3840K406O002j314k037
11877a4256Q188K3226n921J169m440L874N851j1455L745j4656p825N431k760K0355
11863A0526K5020J73k2325j0231K883O787l616l172m279m557M134l487k790N039
11849A05k779l264M688j2362j4681J3541P947k133j0042K053L905M339l104K5
11835a1762J0452L730n242q439j110N10k519j124R448n371m510o724J487R975
11821a1199J615p936J179J055k287K479L377l740m098k029Q297L961q953K973
11807a5306J4724p223O331r217j0087M342J511N120Q86P994J0445L961M074K471
$$ plain form
11905 -4723 10381 17078 10139 6260 -726 1173 -8599 -14876 -3443 -4299 -8071 -5716 5080 172
11891 172 10178 17250 20973 6996 12863 11506 7419 484 -5473 -19313 -16907 -10905 -12219 -14256
11877 -14256 -6068 17158 11237 12406 7966 11840 17691 6236 9981 -4675 -12500 -7069 -9829 10526
11863 10526 35546 35719 13394 3163 6046 12833 9217 6045 1766 -2791 1343 -2144 -4934 105
11849 105 -2674 -5938 -1250 -13612 -28293 -14752 -6805 -8938 -18980 -16927 -13022 -8683 -11787 -11762
11835 -11762 -1310 2420 -2822 -11261 -12371 -11861 -14380 -15504 -6056 -11427 -15937 -22661 -21174 -11199
11821 -11199 -9584 -17520 -16341 -15286 -17573 -15094 -11717 -15457 -19555 -21584 -13287 -9326 -18279 -15306
11807 -15306 -582 -7805 -1474 -10691 -20778 -16436 -14925 -9805 -8919 -925 9520 13481 17555 20026
11793B0026k2251P06J8730P242r334k6097J5357j071n078O930P168k843J239P321
11779A8045j0488m674n155n16J447O905l14O794j2276j2986N122R11Q784J5793
11765A7392P158k250k7032j1187R894q347l6J0082J4513Q112j6605j7217K958
11752a2565J58L282q036K891J4669J3851n274j29o457J3149l73j4474M701Q712
11738A4105O74o570L41j988r272L067k44k40o746m812q652L587R110L479P384
11723C223J6403O038j1400l893m765p553P865m480k6915R1n339k063J2902K760
11709a7126m189K31J0667k61l303O271N992J0703O4o243o072N253k44L945L573
11694I261j3522K749M508p273k819J0604l573j3588j1694J0063K5336L575k4985
$$ plain form
11793 20026 -2225 -1519 17211 24453 15119 -10978 4379 3308 -1770 5160 12328 9485 10724 18045
11779 18045 7557 2883 -2272 -2788 -1341 5564 5250 12044 -232 -13218 -8096 -7185 1599 17392
11765 17392 24550 22300 -4732 -15919 -6025 -14372 -14408 -4326 10187 18299 1694 -15523 -12565
11752 -12565 -12407 -9125 -17161 -14270 399 14250 8976 8847 2390 15539 15166 692 5393 14105
11738 14105 14779 8209 8550 6562 -2710 357 113 -127 -6873 -11685 -20337 -16750 -7640 -4161 3223
11723 3223 19626 25664 14264 10371 5606 -1947 5918 1438 -25477 -25386 -30725 -32788 -19886 -17126
11709 -17126 -21315 -21084 -10417 -10678 -13981 -7710 -1718 8985 9049 2806 -3266 1987 1743 5688 9261
11694 9261 -4261 -1512 2996 -4277 -7096 3508 -65 -13653 -25347 -15284 10052 13627 -11358
11681a1358j5508J7486J2811j0663k615J1124K4080M805j7177j3424Q987N970
11669A4518J509k745J008k757j0320j4559N647p440j4863k81K1907j294p647L324
11655a3993P173J6590N546J188N885l293p431j1436q033J2934K6504n572j4168
11642A1894j9215J534K030P61O198k274r249Q490j911j2536m538m361J0436K3859
11628A1118O707j1810n9j238m330q594P972N02j3138p880Q555Q462J573l595m1
11613e796p303n117j0525n512J3259K038R565N200M595K851N001J5887m102M755
11599B4796O73j8542j2880q953R172P517L294k2986j101J6731j126j3082P94R808
11585e885J1304j969p799J941j311L711J0351q058j4272M847R095j945j42J2131
$$ plain form
11681 -11358 -26866 -9380 3431 -7232 -9847 1277 25357 30162 12985 -439 8548 14518
11669 14518 16027 13282 14290 11533 1213 -13346 -7699 -15139 -30002 -30283 -8376 -9670 -17317 -13993
11655 -13993 -6820 9770 15316 16504 22389 19096 11665 229 -7804 5130 31634 26062 11894
11642 11894 -7321 -5787 -3757 -2996 3202 928 -8321 169 -1742 -14278 -18816 -23177 -12741 11118
11628 11118 17825 6015 5956 4718 388 -8206 -234 268 -12870 -20750 -12195 -3733 -2160 -5755 -5796
11613 -5796 -13099 -18216 -28741 -34253 -20994 -18956 -9391 -4191 404 3255 8256 24143 20041 24796
11599 24796 25469 6927 -5953 -14906 -5734 1783 5077 -17909 -19010 -2279 -3405 -16487 -15693 -5885
11585 -5885 5419 3450 -4349 -2408 -3719 -8 10343 2285 -11987 -7140 1955 10 -132 11999
11571A1999J3055N389o575j8332L2k400q903M81J0309nQ163K377k0205j7441n806
11556b7862J2754O725J3080J1482K699j4137O904j0388j9845l887K092M994J3659
11543a730j4639N833J2714M380j5738L232M650k227J4558J829k999j5628Q891
11530C126N744m466L743j0855j2476N656P855M495J125P82p749M260J843j054
11516B029M420O163K084m013j64P910j1154j0842N819J5916J2244o948p087p103
11502I274j9108j4430o819j381o241L1479K0661J3796M941r851k2644k7107j073
11489b8503J2030J9640K0379k2713q330K275J4356o503n725O779P539P997R354
11476B8575q967j1718l489Q107k542j6143n509J2723Q880p376q156l440m824o224
$$ plain form
11571 11999 25054 30443 23868 5536 5568 3168 -5735 -5254 5055 5050 13213 15590 -4615 -22056 -27862
11556 -27862 -15108 -8383 4697 16179 18878 4741 11645 1257 -18588 -22475 -20383 -15389 -1730
11543 -1730 -16369 -10536 2178 6558 -9180 -5948 -1298 -3525 11033 12862 9863 -5765 3126
11530 3126 8870 4404 8147 -2708 -15184 -9528 -1673 2822 3947 4729 -3020 1240 3083 2029
11516 2029 6449 12612 14696 10683 10519 18429 7275 -3567 2252 18168 30412 23464 16377 9274
11502 9274 -9834 -24264 -31083 -32464 -38705 -7226 13435 27231 32172 22321 -323 -27430 -28503
11489 -28503 -16473 3167 23546 833 -7497 -5222 9134 2631 -3094 3685 11224 19221 28575
11476 28575 19608 7890 4401 12508 9966 -6177 -11686 1037 9917 2541 -5615 -9055 -13879 -20103
11462b0103M514O145L323Q051J2767l972L741P436j4970j2051k1276R525J2312
11449d558m363J219M238R452Q328j6505rJ5206j0221l498O186k99Q77l261k386
11434D06J1621j3056j1925q138m556J6222P315j1429k494N019K1563J9219o356
11421B3411q348l238n125r057K051k084L759P119n401K997J0963j0030p32k157
11407D128m562p327m297N60j45O713Q21Q552J0381J02k0038j6086n811O816Q943
11392a1250j830p140o517J2150Q360N450J5377r690k298R161j901Q54o557O5m389
11377a55r083O965J3590l576j3737m227n470o028R699J3596O851Q687q808j2080
11363c776J2736j977L276Q310k161J315l069l904j6071l931r85k255q5k433o007
$$ plain form
11462 -20103 -15589 -9444 -6121 1930 14697 10725 14466 21902 6932 -5119 -26395 -16870 -4558
11449 -4558 -8921 -7702 -3464 5988 14316 -2189 -2198 13008 2787 -711 5475 5176 6053 2792 406
11434 406 12027 -1029 -12954 -21092 -25648 -9426 -2111 -13540 -16034 -11015 10548 29767 23411
11421 23411 15063 11825 6700 -2357 -306 -2390 1369 8488 3087 6084 17047 7017 6285 4128
11407 4128 -434 -7761 -12058 -11498 -11643 -4930 -4109 4443 14824 14926 -5112 -21198 -27009 -20193 -11250
11392 -11250 -13080 -20220 -26737 -14587 -6227 -777 14600 4910 2612 11773 9872 10726 4169 4234 -155
11377 -155 -9238 -2273 11317 7741 -5996 -10223 -15693 -21721 -12022 1574 8425 17112 8304 -3776
11363 -3776 8960 6983 10259 18569 16408 17723 14654 10750 -5321 -9252 -10237 -12492 -12577 -15010 -21017
11348b1017L148N295K0514J2698k0183k0865n251N304R757J124l011oJ5644L600
11334F751p209P687L241j5299K675p404k415K0036P669J3970j0591j2723j5651
11321i263j155p138L697O071l052l090P762O546M135j5793J283J0382O307l296
11307C396P489o909q177K205N47j1463K116R898O988Q791R171J512p571q459R702
11292A9236k465k1784j0679J2186J360J986Q186J6269p774N909J1927J1502J8223
11279F4082L3489n85n120J785j8108j9739k3198j3903r794o036J3169R454j850
11266B3646K807k926O502j4746q334k636J1158k081j325j710M007r769q360k4698
11252b8465l709J3014J1940K963Q044M108j4589j1173q217O283J1857P440L457
$$ plain form
11348 -21017 -17869 -12574 7940 20638 455 -20410 -25661 -20357 -10600 -9476 -12487 -12493 3151 6751
11334 6751 -458 7229 10470 -4829 -2154 -9558 -11973 8063 15732 29702 19111 6388 -9263
11321 -9263 -10418 -17556 -13859 -7788 -10840 -13930 -6168 378 4513 -11280 -9997 385 6692 3396
11307 3396 10885 3976 -4201 -1996 -1449 -12912 -10796 -898 6090 14881 24052 25564 17993 9534 19236
11292 19236 16771 -5013 -15692 -3506 -2146 -160 8026 24295 16521 22430 34357 45859 64082
11279 64082 97571 96986 91866 93651 75543 55804 32606 18703 8909 2873 16042 25496 23646
11266 23646 26453 23527 30029 15283 6949 4313 15471 13390 12065 10355 14362 4593 -3767 -28465
11252 -28465 -32174 -19160 -7220 -4257 3787 7895 -6694 -17867 -26084 -19801 -7944 -504 2953
11239B953o126N614O761J04K787o666r564K480P750M061l601j5282k0960O466
11225b3223J8027N624j566j0264n00L243J298P695n165M742L790j0841j5573m311
11211b7024O60Q476k755J5176Q613p851L975N142J4116M874R244m457L20L385
11197C1894j161j4559k3703l329M524L487K614J8m689j1028K419J3963N024r543
11183d069l552O141O25J1165Q134q576k1470p296K2356M004J505j345J2862n093
11169A5391L626m904p418J5952J0977J1668J7485Q096M234J966n42J0773K580
11156H9884j0202l2203j8968o982j8407o173J1084J1439q66o091p067K267k015
11143E700j2672o325j2515M763L4P953J4235j194m607p492o428o794L021K0682
$$ plain form
11239 2953 -3173 2441 9202 9306 12093 5427 -4137 -1657 6093 10154 6553 -8729 -29689 -23223
11225 -23223 -5196 428 -1138 -11402 -11902 -8659 -7361 334 -4831 -89 3701 -7140 -22713 -27024
11211 -27024 -26364 -17888 -20643 -5467 3146 -4705 -730 4412 18528 23402 32646 28189 28509 31894
11197 31894 30733 16174 -7529 -10858 -6334 -2847 -233 -215 -4904 -15932 -13513 450 5474 -4069
11183 -4069 -7621 -1480 -855 10310 18444 9868 -11602 -18898 3458 7462 8967 7622 20484 15391
11169 15391 19017 14113 6695 22647 33624 45292 62777 70873 75107 77073 76531 87304 89884
11156 89884 79682 47479 28511 21529 3122 -3051 8033 19472 18606 12515 5448 7715 5700
11143 5700 -6972 -13297 -25812 -21049 -21015 -13062 1173 -21 -4628 -12120 -18548 -25342 -22321 -1639
11129a639J1806J303j1849j0991j4006J925l56m681J5515N286j6739M966J2145
11116g315k558K192m365M861Q380k216k100J1450r75j0307M998N478J4518J0609
11102C2650j267j799r739p914j541Q417R145R22n221O058J2248j4396j3745j394
11088A2424l639j4028P787j538L283P432P473j0163j0545M325L396Q954L095j7044
11074A212R910j541l507j8567m264N351j422M993P884J7760M524n721j2618J0854
11060A4848R664M211j89k880n825n731M934o456j7468j5218Q106J7007o871j4349
11046a6217K813R446J5060n383J775M473N71j1166p918m895q442j8697r1J8073
11032b0598J6529J2268j0443j2468o294M564o966r763J1486K698L676L441k236
$$ plain form
11129 -1639 10167 11470 -379 -11370 -25376 -23451 -23807 -28488 -12973 -7687 -24426 -19460 -7315
11116 -7315 -9873 -7681 -12046 -7185 1195 -1021 -3121 8329 7354 -2953 2045 7523 22041 32650
11102 32650 31383 29584 19845 11931 10390 18807 27952 28874 23653 29711 41959 27563 13818 12424
11088 12424 8785 -5243 2544 1006 4289 11721 19194 9031 -1514 2811 6207 15161 18256 1212
11074 1212 11122 9581 6074 -12493 -16757 -11406 -12828 -7835 49 17809 22333 16612 3994 14848
11060 14848 24512 28723 28534 25654 19829 14098 19032 12576 -4892 -20110 -12004 5003 -1868 -16217
11046 -16217 -13404 -3958 11102 5719 7494 11967 12538 1372 -6546 -11441 -19883 -38580 -38671 -20598
11032 -20598 -4069 8199 -2244 -14712 -21006 -16442 -23408 -33171 -21685 -18987 -15311 -11870 -14106
11019a4106j0303J1913N926L673L470J1496Q33j7880n994P708N121J3431M169
11006A9457N016K418K727l121j7992j4167P246N569O053r504o783O908q04o397
10992c374l526o90k039Q674L183n660R894Q13j3187N752m201J376k422q721P776
10977f352K1545J8034j2901j9627j6474Q711j02j3700q642J7351K466m482J1581
10964b592m068j1605J1622j4676n865O566M857P916n236r756J1843K2206r815
10951A397q150k2707r272k167K0791L100j551r748Q535K7199k701J3992j0075
10938H643j3328J0415J1934j8284N853O151q337m360K2571P178j1248r528n902
10925A758j2863J3974J6376O374m169l598O9O225J43j6385n945R898j4551q747
$$ plain form
11019 -14106 -24409 -12496 -6570 -2897 573 12069 12902 -4978 -10972 -3264 1857 15288 19457
11006 19457 24473 26891 29618 26497 8505 -5662 1584 7153 13206 3702 -3081 3827 3023 -3374
10992 -3374 -6900 -7590 -9629 -955 2228 -3432 6462 7275 -5912 -160 -4361 -2985 -5407 -14128 -6352
10977 -6352 15193 33227 20326 699 -15775 -7064 -7166 -20866 -29508 -12157 -9691 -14173 -2592
10964 -2592 -6660 -18265 -6643 -21319 -27184 -20618 -15761 -7845 -13081 -22837 -10994 11212 1397
10951 1397 -6753 -29460 -38732 -40899 -20108 -17008 -18559 -28307 -19772 7427 4726 18718 8643
10938 8643 -4685 5730 17664 -620 5233 11384 3047 -1313 21258 28436 17188 7660 1758
10925 1758 -11105 2869 19245 25619 21450 17852 17921 24146 24289 7904 1959 11857 -2694 -11441
10911a1441R681J1306j3599J345K536m794p35L443j3673N313Q807j4430j597P108
10897a0730J0099r876j0711N256J2634K510j1965K729m105q227Q61J0011Q206
10884c308K7201J4124l165O31k0727j2942L900j6508j8349N630K748J0887P908
10871a970o055J949O083J1550R341j437J362l562Q897J2650l2249m226j1791o356
10857a5814O654P526j1524j544K5020Q184j7232k1650n695P082J3952O097L608
10844D664O780K353n572j4961m182O921R627k978p573q186j864R499N031k787
10830c228p655K692R696O938J1458j470n87M939j2555l483N789J1993l891m836
10816A5800o980Q07N390K221n94l173o909k333l431O806l725k175J0009K2463
$$ plain form
10911 -11441 -1760 9546 -4053 -2708 -172 -4966 -5701 -2258 -15931 -10618 -1811 -16241 -17838 -10730
10897 -10730 -631 -10507 -21218 -15962 -3328 -818 -12783 -10054 -14159 -22386 -21525 -11514 -3308
10884 -3308 23893 38017 34852 35483 14756 1814 5714 -10794 -29143 -23513 -20765 -9878 -1970
10871 -1970 -8025 -6076 7 11557 20898 19461 20823 17261 26158 38808 6559 2333 -9458 -15814
10857 -15814 -9160 -1634 -13158 -14702 10318 18502 1270 -20380 -26075 -18993 -5041 1056 4664
10844 4664 11444 13797 8225 -6736 -10918 -3997 5630 2652 -4921 -13107 -14971 -5472 -441 -3228
10830 -3228 -10883 -8191 1505 8443 19901 18431 17844 22783 10228 6745 12534 24527 20636 15800
10816 15800 8820 9627 15017 17238 16644 13471 6562 4229 798 7604 3879 1704 11713 34176
10802C4176m948j2740k6q579J01M399K723K80k411m632K0521q54j9183m701r644
10787e518k571o527L385m86J7623O908l484K168R4P354K099K550J175j0051r358
10772E361k673l438K4035J568k444j0641P100M803J523l505J3433m808j3811O712
10758B3215K295P648p156L318M464j698j4151j0311j74m228K227p468Q891J175
10744H047N395p363N697K224N673J7662K219k6409j4353j344r80m505L087Q310
10730C360j061L618P854M586J1884M93J097j379P094K987k919j1698L181j580
10716B7517N14m750p115J7806K0355J1487p261J2725K0156K5933K8295K7731K8186
10703B01579L2029P4980J60590K55924L95921M47716K45981j68449m18059l93794
$$ plain form
10802 34176 29228 16488 16462 7883 7984 12383 15106 15386 12975 8343 28864 28010 8827 4126 -5518
10787 -5518 -8089 -14616 -11231 -11717 5906 12814 9330 11498 11592 18946 21045 23595 24770 14719 5361
10772 5361 2688 -750 23285 24853 22409 11768 18868 23671 25194 21689 35122 30314 16503 23215
10758 23215 25510 33158 26002 29320 33784 32086 17935 7624 7450 3222 5449 -2019 6872 8047
10744 8047 13442 6079 11776 14000 19673 37335 39554 13145 -1208 -2552 -3532 -8037 -4950 3360
10730 3360 2299 5917 13771 18357 30241 30734 31831 30452 37546 40533 37614 25916 29097 27517
10716 27517 28031 23281 16166 33972 54327 65814 58553 71278 91434 117367 145662 173393 201579
10703 201579 233608 308588 469178 725102 1121023 1568739 1814720 1646271 1228212 834418
10693H34418k69868j58471j10657o7679k4414j5733k8288k8150k7301j8356j0111
10682G5390m93p849j812r133J8O825k632K195m103p187l334j1437j7811o35P885
10667B5887J401J0013P784j2908m096n693M47q615J1536Q135j9247j8589J1802
10654G857n51j8079Q604J1023J4133R100L45n373k6998o510Q225R561J6118O237
10640C3692O193o630q863J2483J4979n101j9277N51J1557m398j6330j356J942
10627A9442m583p505L353J1121m634o772L899j316o594J4921K0323j650O339Q11
10613D7155J0370n895j7220P20m615j4595q2J4627N952P36R630O459J2473R82
10599F6697p459j847j2444j0661j4159j0508m143j580O231M745m697l396j703
$$ plain form
10693 834418 564550 406079 295422 227743 203329 187596 159308 131158 103857 85501 75390
10682 75390 74897 67048 65236 56103 56121 62946 60314 62509 58406 51219 47885 36448 18637 18002 25887
10667 25887 27288 37301 45085 32177 28081 22388 22835 14220 25756 33891 14644 -3945 7857
10654 7857 7306 -10773 -2169 8854 22987 32087 32432 27059 61 -6449 1776 11337 27455 33692
10640 33692 39885 33255 24392 36875 51854 46753 27476 28027 39584 35186 18856 17500 19442
10627 19442 14859 7354 10707 21828 17194 10422 14321 13005 6411 21332 41655 40005 46344 47155
10613 47155 57525 51630 34410 35130 30515 15920 15838 30465 36417 37153 46783 53242 65715 66697
10599 66697 59238 57391 44947 34286 20127 9619 5476 3896 10127 14872 10175 6779 5076
10586E076N235J1135O611N832O5j605j0685j3934k603J2669j009l284P238M132
10572B4873Q967J755q473n340O767m302j2645P307p98L222J5118J324P201j3728
10558C1248j2201P247l230j0567r874l667O565L033J3389M5112N1043K1070q84
10545A38284k0792k1375K9295k221m7389m4238k25J2083n917J3414J550j5887
10533C6582M966J4160J0065r464J0891M882n296J92k0155j3712J2386K996P64
10520D9257m777q708N715J194J995j560k1544k2745J4637J5092K541Q861J2835
10507E2793q007J0227j8424m297R617J3622n267R253J0432J0420j6791o118p842
10494D9618q971n903K249M135L738m003p434l2798k9411j3831J6671L5237J7529
$$ plain form
10586 5076 10311 21446 28057 33889 33954 32349 21664 7730 5127 17796 16787 13503 20741 24873
10572 24873 33840 35595 27122 21782 28549 24247 11602 18909 18111 21333 36451 37775 44976 31248
10558 31248 19047 26294 23064 12497 2623 -1044 5521 8554 21943 67055 118098 139168 138284
10545 138284 117492 96117 125412 123191 75802 31564 31339 43422 37505 50919 52469 36582
10533 36582 41548 55708 65773 56309 67200 72082 66786 66978 46823 33111 45497 48493 49257
10520 49257 44480 35772 41487 42681 44676 43116 21572 -1173 13464 28556 31097 39958 52793
10507 52793 44786 55013 36589 32292 41909 55531 50264 59517 69949 80369 63578 57460 49618
10494 49618 40647 34744 36993 41128 44866 40863 33429 631 -28780 -42611 -25940 9297 26826
10481B6826O453j957M603K7900J9L724J1153Q61l118N322L858Q334N428p861k554
10466H8991O188j0929j2407J1643J2961p466K074N015o035j983O356l920L65j153
10452H9700k0550r032J2951o521j0393J2365L5935L1849L2546L9532J0390j057
10440B17715j4176l2638j3860j1301q00j5736j122K4686J2579k644q074j427J0118
10427A63320J5414K4754K9173M132O955J4066K5903L4605L3916j2870m1340m0858
10415B57170l0338r070j3516j1831p137k618N986J3557r039j5900K669K164r281
10402A72816J888K4214J0562l522K834m94N19p85k02K119r674k0306r286M232
10388A74915O056R549P550P695n910j1903k1574J007K5911q059J915J3697J2551
$$ plain form
10481 26826 33279 31322 35925 63825 63844 67568 78721 79582 76464 81786 85644 93978 99406 91545 88991
10466 88991 95179 84250 71843 83486 96447 88981 91055 96070 90035 88052 94408 90488 90853 89700
10452 89700 69150 60118 73069 66548 56155 68520 104455 136304 168850 208382 218772 217715
10440 217715 203539 170901 157041 145740 144940 129204 128082 152768 165347 162703 154629 153202 163320
10427 163320 178734 203488 232661 236793 243748 257814 283717 318322 352238 339368 298028 257170
10415 257170 226832 217762 204246 192415 185278 182660 188646 202203 193164 177264 179933 182097 172816
10402 172816 174704 198918 209480 205958 208792 208298 208817 208032 207830 209949 200275 179969 170683 174915
10388 174915 180971 190520 198070 205765 199855 187952 166378 167385 193296 185237 187152 200849 213400
10375B13400J4817K2160J0723R626N585R411Q780n646q279k0662j4290R974k971
10362B52628N613J4131J6011m65J1664J3557J3817O542J3171J1242J4277K2571
10350C94759J4980K1059K9930J4342O902J3104j7289J9983M6001L8357K6839K2240
10338F31207J1285M0207M8081L5973M2723N9684O7062N2566L6832M8911L2746
10327A107277J9923N3492P3472O0903O8663J22151J79256K04704K34207K70802
10317B394850L33587M34453N74669O13247L83047L9683j08021P3J92650L77839
10307E236077O09965P95305R91224J235999J563238K098775K848661L884090N266523
10298B4529857P407383J1304466J8460310L1121003N1722963P7024076Q1522625
$$ plain form
10375 213400 228217 250377 261100 270726 276311 285722 294502 288856 280577 259915 245625 255599 252628
10362 252628 258241 272372 288383 287918 299582 313139 326956 333498 346669 357911 372188 394759
10350 394759 409739 430798 460728 475070 481972 495076 477787 497770 543771 582128 608967 631207
10338 631207 642492 682699 730780 766753 809476 869160 936222 988788 1025620 1074531 1107277
10327 1107277 1127200 1180692 1254164 1315067 1383730 1505881 1685137 1889841 2124048 2394850
10317 2394850 2728437 3162890 3737559 4350806 4733853 4773536 4665515 4665588 4858238 5236077
10307 5236077 5846042 6641347 7632571 8868570 10431808 12530583 15379244 19263334 24529857
10298 24529857 31937240 43241706 61702016 92823019 144545982 221570058 303092683
10291C03092683L0570637m7018085q4378856p1116102m3865194k5411368j5623626
10284D6250089j0383538p255430n238342l929237l050935k383136j886553j505579
10276A0617339j202679r63701q07723o96546n33953l03987q6372N8173m118l26247
10266E750186o94942p87426o28072m64113l20599k41676k16608k06729k09096
10257A980925j69016j61035j36137j35943j15047r5858o5924n6536o3062n2904
10247I29463m1897k7017j9114m3062m8168k4941k3344k3415k5030l5606l6614
10236E81255m2430k6195o07P29n403j816L544q029k2619k4457p906j8686m0249
10223C87131j7679q070n24o971j8829k9568k1326j1087j6904j0185q435k6372
$$ plain form
10291 303092683 333663320 286645235 202266379 131150277 87285083 61873715 46250089
10284 46250089 35866551 28611121 23372779 19443542 16392607 14009471 12122918 10617339
10276 10617339 9414660 8450959 7643236 6946690 6412737 6108750 6022378 6080551 6076433 5750186
10266 5750186 5055244 4267818 3639746 3175633 2855034 2613358 2396750 2190021 1980925
10257 1980925 1811909 1650874 1514737 1378794 1263747 1167889 1101965 1045429 982367 929463
10247 929463 887566 860549 841435 798373 750205 725264 701920 678505 653475 617869 581255
10236 581255 538825 512630 512023 512752 507349 505533 509077 501048 478429 453972 446066 427380 387131
10223 387131 369452 361382 360858 353887 335058 305490 284164 273077 256173 245988 237553 211181
10211B11181Q124J0332j3585N43K0769J6623j006n992L109L995m575k6626q457
10198B14435l12n661l782j110l555j2485K203j0641n845j1191j1880j7237j6465
10185A16474q579p029P00K025Q958M907J1335N135j1074j5396p940q686k921O589
10171I4498P132K3018J2403m598O195j4932m8649m3214l541K2275J2910k597o084
10158E4816P874J0618n188n734J0455j216l532J938p184N02k26j6666k1931m731
10144A9795o61j9868l7651l0340j0479J7571L7402L4723L7313M6785L4924k130
10132A27384k0602k4034O141K7188K1382m22j5176j7965l1208k1737k1374j5957
10120A3620j3350J748J7005N408q900J826K061j0395J0366j627j6717J169J0701
$$ plain form
10211 211181 219305 229637 216052 216595 237364 253987 252981 246989 250098 254093 249518 222892 214435
10198 214435 214123 208462 204680 203570 200015 187530 189733 179092 173247 162056 150176 132939 116474
10185 116474 107895 100866 101566 103591 112549 117456 128791 133926 122852 107456 99516 90830 87909 94498
10171 94498 101630 124648 137051 132453 138648 123716 75067 31853 28312 50587 63497 60900 54816
10158 54816 62690 73308 68120 62386 72841 71625 68093 70031 62847 63349 63123 46457 24526 19795
10144 19795 19134 -734 -38385 -68725 -79204 -61633 -24231 10492 47805 94590 129514 127384
10132 127384 106782 82748 88889 116077 137459 137037 121861 103896 72688 50951 29577 13620
10120 13620 270 2018 19023 24431 15531 17357 19418 9023 19389 17762 1045 2214 12915
10107A2915J0906J48J533K8112K2174O885J5004N579J5799L90m853j7785k7292
10094F9515j2547p856J74o151M275J486R622j0148j512K756k340N355L743J3222
10080F9594Q079j2760j1564j7460m543K6701K1010m770J538Q141J124l572m712
10067G6806j3116j2323n922J1112J3973J3225J304o936R193N15j2973j4188J2572
10054G3242J6496J5055L9836K3356j4o497J1192L2960K3574L6650L7616P9020
10042C82486J11640J20383J87229K99679N26504R84398J787381K899077K624856
10033I923633q72538l058929k514042j301312o69058l96683k55550j78504j17597
10024E59420q0870p2130o2844n1458m1099k5740k0526j9314n646P675m138K44
$$ plain form
10107 12915 23821 23969 25502 53614 75788 82673 97677 103256 119055 119445 114592 96807 69515
10094 69515 56968 49112 49286 43135 47410 48896 58518 48370 46858 49614 47274 52629 56372 69594
10080 69594 77673 64913 53349 35889 31346 58047 79057 74287 75825 83966 85090 81518 76806
10067 76806 63690 51367 45445 56557 70530 83755 85059 78123 87316 87831 74858 60670 73242
10054 73242 89738 104793 144629 167985 167971 161474 172666 205626 229200 265850 303466 382486
10042 382486 494126 614509 801738 1101417 1627921 2612319 4399700 7298777 9923633
10033 9923633 9051095 5992166 3478124 2176812 1507754 1111071 855521 677017 559420
10024 559420 478550 406420 343576 292118 251019 225279 204753 185439 179793 187468 183330 183574
10012A83574p046n952L158j1284j7925j5380k1053k5850j0454M742o772j3272
10000E6486p261j819j8442j007K740N845K0382J3394j60L078j4058j4860M969
9987D9287j5460j3397j3884j0897q727L385K2659M560J158q948K8K521J2456N385
9973C0126P050L562k01p21q531M483j4420j9249l383O202J3970K825K678J3812
9959C8203P296n024j46r498l623l465j47P110M323N03p815M409J8032O71M642
9944E5471M193m497m589P21R574L39O465k997k3639l474Q868o50j4225j4421J3508
9929C0647O48k083m764j2494o323N469J574j3969J0216K3389Q731M830r071q020
9915B8780P639M857l22j4811J612j570L154P38M203J4943J693L729l660m895K039
$$ plain form
10012 183574 176528 170576 173734 162450 144525 129145 108092 82242 71788 76530 69758 56486
10000 56486 49225 47406 28964 27957 30697 36542 56924 70318 70158 73236 59178 44318 49287
9987 49287 33827 20430 6546 -4351 -13078 -9693 12966 17526 18684 9736 9764 12285 24741 30126
9973 30126 37176 40738 40537 39816 31285 35768 21348 2099 -1284 4918 18888 21713 24391 38203
9959 38203 45499 40475 40329 30831 27208 23743 23596 30706 35029 35532 27717 32126 50158 50829 55471
9944 55471 59664 55167 50578 51299 60873 61212 67677 64680 41041 37567 46435 45785 31560 17139 30647
9929 30647 31295 29212 24448 11954 5631 11100 12674 -1295 8921 32310 41041 45871 36800 28780
9915 28780 36419 41276 40954 26143 27755 26185 29339 30077 34280 49223 50916 54645 50985 46090 48129
9900D8129m596j986N292j1547N504J0731J3281M836J6203P930n147J6497K8980
9887A34107K4925O5022J12967J44628K24622L57106M34572K81676r5785m07863
9877A275977m14514k92309j75263q8077o4519m9764l6621l4455k5357M448k322
9866I7224p810k17L214p160j7844K783P125M335n441P275N959m134j05o037r644
9851F9523l085J7145N926J0078Q496K211L75o420O228J4135j471O787L6478L2584
9837A98990J5754K0203N1823O4614P4873M8541N633j7996n088J4794M4239Q2326
9825E98706J26251J50287J88070K86360M14317O13617R20618J320000J785015
9816F403241J915874J105046n34494j758081j894154j446847r89277o58227m61290
$$ plain form
9900 48129 43533 41547 46839 35292 40796 51527 64808 69644 85847 93777 88630 105127 134107
9887 134107 159032 224054 337021 481649 706271 1063377 1497949 1779625 1683840 1275977
9877 1275977 861463 569154 393891 305814 241295 191531 154910 120455 95098 99546 97224
9866 97224 89414 89197 92411 85251 67407 70190 77315 81650 76209 83484 89443 85309 85204 79167 69523
9851 69523 66438 83583 89509 99587 108083 110294 110669 104249 110477 124612 123141 129928 166406 198990
9837 198990 214744 234947 286770 351384 426257 474798 480431 462435 457347 472141 516380 598706
9825 598706 724957 875244 1063314 1349674 1763991 2377608 3298226 4618226 6403241
9816 6403241 8319115 9424161 8889667 7131586 5237432 3790585 2801308 2143081 1681791
9807A681791l32240k33897j90877j47277j02897r6322q0930n8325n1559n1878
9797C35589m0788j6836k1085r313j7008q367j5906k3773j1556r696j1161k8710
9785A21390j2196k791k548k1872j4209P873q206j0237J141K470K336Q00q179J281
9771E7053P709J1651p823k4788j6582O080K058P520M170p440r357n442K115J9499
9757D6423J0447n856k0412r685p847J8021K218n683N752j108r72N780J1469m304
9743D4243k1536k4507L963J5969J3142p889O070o699m854o771L102J2764J6015
9730D3012p921j2754n045K071r305O574o871j7529j708j222o842N475J1408K11
9716d46m109K1134N642q179J391m779q995k503M243R755M713j0622O440k669r55
$$ plain form
9807 1681791 1349551 1115654 924777 777500 674603 578281 497351 439026 387467 335589
9797 335589 294801 277965 256880 247567 230559 222192 206286 182513 170957 161261 150100 121390
9785 121390 109194 106403 103855 81983 67774 75647 67441 57204 58345 60815 63151 63951 55772 57053
9771 57053 64762 76413 68590 43802 27220 33300 35358 42878 47048 39608 30251 24809 26924 46423
9757 46423 56870 51014 30602 20917 13070 31091 33309 27626 33378 32270 31298 37078 48547 44243
9743 44243 22707 -1800 2163 18132 31274 23385 29455 22756 17902 11131 14233 26997 43012
9730 43012 35091 22337 17292 19363 10058 16632 9761 -7768 -9476 -10698 -17540 -12065 -657 -446
9716 -446 -4555 16579 22221 14042 15433 10654 1659 -844 3399 13154 17867 7245 13685 11016 10061
9701A0061j5755J175N351L655m59j0342J2215J5096K242p414j391p755k750K459
9687F388O40j407J056N781r132J579l626j227M222J0520j599n397M331J598k3315
9672i588j516o154J3840O557r4m128l603r30l047j4007R883J1527M399l060l080
9657c001J2199K587j1365p249J0412P255J1141k930m432J001J087j151J317N12
9643A7383q397o828o468N320L071m036N951j0791j2227J941J8834K6256J1792
9630D1801l301Q231L071m614M849p032l0445j0204J6762R182o372k1718J633m844
9616c001j0010n24J1405J3365p094n67N756k694M816l86q501R517k0p125n095
9601a58j7355j1229R775M812J2000n05m360K288m85r74P884j2125j6094L913O372
$$ plain form
9701 10061 -5694 -4519 832 4487 4028 -6314 5901 20997 23239 15825 14434 6679 3929 6388
9687 6388 7028 5621 6677 12458 3326 4905 1279 52 4274 14794 13195 7798 12129 13727 -9588
9672 -9588 -11104 -17258 -3418 3139 3045 -1083 -4686 -5616 -8663 -22670 -12787 -1260 3139 79 -3001
9657 -3001 9198 11785 420 -6829 3583 10838 21979 19049 14617 15618 16705 15554 16871 17383
9643 17383 8986 2158 -4310 1010 4081 45 5996 -4795 -17022 -15081 3753 30009 41801
9630 41801 38500 46731 49802 45188 50037 43005 12560 2356 19118 28300 21928 210 1843 -3001
9616 -3001 -13011 -13535 -2130 11235 4141 3574 9330 6636 11452 11066 2565 12082 12062 4937 -158
9601 -158 -17513 -28742 -18967 -14155 -2155 -2660 -7020 -4732 -5217 -6191 1693 -10432 -26526 -22613 -16241
9586a6241N801O460l028o027K114j6036l236J1432J4158J3763R305j931m483q548
9572C503N79J1676J994k974p258j2232r037j235n303N294J669O167R328J2158
9558A4329J1088J5513j0836k2979N062K843o709o00Q241M738L902J1388j0443
9545B5537q865j7126m781q55J1074J7281r994p661R858J588l353j7845j1014O73
9531a5483r01M803m54P047O472j3365n061R675M936N315K250o587M93L892Q7l363
9515b44j777j040j50j5516r649O39q088L648K5026K0929l344k912m022k605L497
9500D392R231J1122O341r982j0873K1J8227R18j7025j3584O64p314j0702J1033
9486g531K6665j2162n924o742N761r321o379J5237O17j5237J3125P55j940M284
$$ plain form
9586 -16241 -10440 -3980 -7008 -13035 -10921 -26957 -30193 -18761 -4603 9160 18465 16534 12051 3503
9572 3503 4082 15758 17752 14778 7520 -4712 -13749 -14984 -20287 -14993 -13324 -7157 2171 14329
9558 14329 25417 40930 30094 7115 12177 15020 8311 7711 15952 20690 24592 35980 25537
9545 25537 16672 -454 -5235 -6090 4984 22265 12271 4610 14468 16056 12703 -5142 -16156 -15483
9531 -15483 -16384 -11581 -12035 -4988 1484 -11881 -16942 -7267 -2331 2984 5234 -1353 -860 3032 3119 -244
9515 -244 -2021 -3061 -3211 -18727 -28376 -27737 -35825 -32177 -7151 13778 10434 7522 3500 895 4392
9500 4392 13623 24745 31086 21104 10231 10252 28479 29397 12372 -1212 -548 -7862 -18564 -7531
9486 -7531 19134 6972 1048 -5694 67 -9254 -15633 -396 221 -15016 -1891 -1136 -3076 1208
9472A208Q743r997p279K674M861j2390n33J4301J0945n855o65l796p441q123k792
9457a6139L253k097J2085Q826P263O328q127k11J2211L698p339J811P086N296
9443C3944n252L439J356j5118p306l94Q809O061j246k463j0052j5299P542P595
9429A1616O238L424k790L400n787L103n802p210k256O43J5349J0535r032j9640
9415A791r127o034K1836n4j7498j2784R225M409j13N282M345q376M709R1n988
9400h286O048k138k099M775K213j54L119R785p920j7181j9099M189J1232M867
9386a0649N582n28P307j274j5655k0581K041J2808p76J1051J5116j266r365R450
9372C261q647q898k393L134J8745O487p270N856k667j5723p823O930R110m514
$$ plain form
9472 1208 9951 -46 -7325 -4651 210 -12180 -12713 1588 12533 6678 6013 2217 -5224 -13347 -16139
9457 -16139 -12886 -14983 -2898 5928 13191 19519 11392 11181 23392 27090 19751 21562 28648 33944
9443 33944 28692 32131 33487 18369 11063 10669 19478 25539 24293 21830 11778 -3521 4021 11616
9429 11616 17854 21278 18488 21888 16101 19204 13402 6192 3936 4579 19928 30463 21431 1791
9415 1791 -7336 -13370 8466 8412 -9086 -21870 -12645 -8236 -8349 -3067 1278 -7098 -2389 -2298 -8286
9400 -8286 -2238 -4376 -6475 -1700 513 359 3478 13263 5343 -11838 -30937 -26748 -15516 -10649
9386 -10649 -5067 -5595 1712 438 -15217 -35798 -33757 -20949 -21725 -10674 4442 3176 -6189 3261
9372 3261 -5386 -14284 -16677 -13543 5202 11689 4419 10275 7608 -8115 -15938 -9008 102 -4412
9358d412M175J1120K0j3369K53l949p265N634J7846M280r001p604j4551k261m766
9343b3850K888P319N552P641r107L378k937r34j991j2658m470K061N657J2633
9329h818R666k914k093j6226p113J6655M206Q072j0443m118M010o53K440R344
9315B015o135n637K811l01j892l370j0966J3516K2677mr707j0367p082j6955n934
9300c7331J378J0794O948O459J1721n02k243j6275M446J8816O01j4814j617P573
9286d046j0254j6364Q34J9686N980L115l411o992o784R727J0804Q849J2911j3698
9272A0357j7144j9590n265M757N287R746J6761O497j204k3630q706j645j2989
9259c6768k600J4862Q070j0584O306K2860K6206J1967J154l600J898j2127r762
$$ plain form
9358 -4412 -237 10883 10903 -2466 -2213 -6162 -13427 -7793 10053 14333 5332 -2272 -16823 -19084 -23850
9343 -23850 -20962 -13643 -8091 -450 -9557 -6179 -9116 -10050 -12041 -24699 -29169 -27108 -21451 -8818
9329 -8818 848 -2066 -4159 -20385 -27498 -10843 -6637 1435 -9008 -13126 -9116 -9769 -7329 2015
9315 2015 -4120 -9757 -6946 -7247 -9139 -12509 -23475 -9959 12718 12714 3007 -7360 -14442 -31397 -37331
9300 -37331 -35953 -25159 -18211 -11752 -31 -533 -2776 -19051 -14605 4211 4812 -10002 -11619 -4046
9286 -4046 -14300 -30664 -29830 -10144 -4164 -1049 -4460 -11452 -18236 -8509 2295 11144 24055 10357
9272 10357 -6787 -26377 -31642 -26885 -21598 -11852 4909 11406 10202 -13428 -22134 -23779 -36768
9259 -36768 -39368 -24506 -16436 -27020 -20714 2146 28352 40319 41473 37873 39771 27644 17882
9246A7882N044n61m319j2395j1130q714R739O226N881j4666r711N419k118J809
9232a1614j738M246J3944n550j2326o589R957n369m108p71J6850O128n846K042
9218g44N327n80j1693q816J1794N63O23j498K13N485n935J919j1581J28L439j3995
9202b5351r67K1436O03p203N952J2177Q628j2507o91J464j727q873o37P315O056
9187E675j2746L610O358l322j220L505K528J0263q399p798n138j0001j0284J1845
9173a5124M753M508L160o308j4750k298J1415k327J3555O133j1091r10J4012L720
9159H448o770r289r094k999p287n8R224K0336N884j3629o302K55J6624J6099j0653
9144A0789j3204p229J0275Qo426o577K472J4530J614K580o486o468j6641M832
$$ plain form
9246 17882 22926 22365 18046 5651 -5479 -14193 -4454 1772 7653 -7013 -16724 -11305 -13423 -11614
9232 -11614 -13352 -9106 4838 -712 -13038 -19627 -9670 -15039 -19147 -19918 -3068 3060 -2786 -744
9218 -744 4583 4003 -7690 -16506 -4712 -4149 -3526 -5024 -4811 674 -5261 -3342 -14923 -14795 -11356 -25351
9202 -25351 -26318 -4882 -4279 -11482 -5530 6647 15275 2768 2077 3541 1814 -7059 -7696 -381 5675
9187 5675 -7071 -3461 2897 -425 -1645 1860 4388 14651 6252 -1546 -6684 -16685 -26969 -15124
9173 -15124 -10371 -5863 -2703 -9011 -23761 -26059 -14644 -16971 -3416 2717 -8374 -9284 4728 8448
9159 8448 1678 -7611 -16705 -19704 -26991 -27049 -17825 2511 8395 -5234 -11536 -11281 5343 21442 10789
9144 10789 -2415 -9644 631 639 -5787 -12364 -9892 4638 6252 8832 2346 -4122 -20763 -15931
9130a5931J2918R316O054N21k203M494n084j1056N10N664j8769J562P074R5J1955
9115G120o033P321J1664m320r999j4845N913k079K034m569p563J0086J4348m167
9101D911j6589O20J4728j1068r583J2803R940j640n219p90m417m466J927l922
9087a2765K371o758o813J1798J7586l726p2r478j5302J5695k354p600J322J9936
9073C840L758r640j0082N64J666P218p195k547M776L618p721n554M877o080K702
9058a5800J9070n67j943k0o390o069l731l456J8520N275R517o55p532l962j192
9043A065m655N576P86m747L03l462k051j66J150J5312P301j696o628j2766M363
9028c15j2385j1304P748M015M737K357J0988N303j659r938j7241k4815q140J5097
$$ plain form
9130 -15931 -3013 6303 12357 12878 10675 15169 10085 -971 -461 5203 -13566 -12004 -4930 -4835 7120
9115 7120 1087 8408 20072 15752 5753 -9092 -3179 -5258 -3224 -7793 -15356 -5270 9078 4911
9101 4911 -11678 -11058 3670 -7398 -16981 -4178 5762 4122 -1097 -1887 -6304 -10770 -8843 -12765
9087 -12765 -10394 -17152 -23965 -12167 5419 1693 1621 -7857 -23159 -7464 -9818 -17418 -16096 3840
9073 3840 7598 -2042 -12124 -11560 -9894 -2676 -9871 -12418 -7642 -4024 -11745 -17299 -12422 -18502 -15800
9058 -15800 3270 2703 760 740 -5650 -11719 -15450 -18906 -386 4889 14406 13751 6219 2257 1065
9043 1065 -3590 1986 2772 -1975 -1672 -5134 -7185 -7351 -6201 9111 16412 14716 8088 -4678 -315
9028 -315 -12700 -24004 -16256 -12241 -7504 -5147 5841 11144 9485 -453 -17694 -42509 -50649 -35552
9014c5552J6331k076L653J4330n88l02j0946j4600o02j45K66M452J3502J9913
9000G636k840j6767K946o133J4649l823J1086P232j3349p618o446L071P798o68
8986c226o59k067r80l323j1533J5843j39J223J6806Q443k2732q760J2298m216
8972c022J1124O306j1816K492O720j400j9574j2494J1963q363P372k053K783O256
8958c706L686q599j96J6868J8594Q763j1271r549j120o690J1232J2266m537n266
8944B0475o576j2982L369q134N1J7233j3574j2196n898K0875K0884j2473o224
8931D830p490P792O112j4613j3316j700J6399K138k1253k945J4884l663j760P002
8917g583j846J2723L26N416J4006j0382m424Q242j0473o597N062r82P928N843
$$ plain form
9014 -35552 -19221 -21297 -17644 -3314 -3902 -4204 -15150 -29750 -30352 -30497 -30231 -25779 -12277 7636
9000 7636 4796 -11971 -9025 -15158 -509 -4332 6754 13986 637 -6981 -13427 -10356 -2558 -3226
8986 -3226 -3885 -5952 -6932 -10255 -21788 -5945 -6084 -4861 11945 20388 -2344 -11104 1194 -3022
8972 -3022 8102 14408 2592 5084 11804 10404 -9170 -21664 -9701 -18064 -10692 -12745 -9962 -3706
8958 -3706 -20 -8619 -8815 8053 26647 35410 24139 14590 13470 6780 18012 30278 25741 20475
8944 20475 13899 917 4286 -3848 -3797 13436 -138 -12334 -18232 2643 23527 11054 4830
8931 4830 -2660 5132 11244 -3369 -16685 -18385 -1986 152 -21101 -24046 -9162 -12825 -14585 -7583
8917 -7583 -9429 3294 3620 9036 23042 12660 8236 16478 6005 -592 4470 3488 11416 17259
8903A7259k14p891j3543M941K4580R804o121j0434m523r109o354K404J5155J4799
8889C0753j4083p342r410l53p312l406K770J217O915J129O895K635j5217j496
8875f305J2053P683Q09q176j4361O300m572J455J0738n195n592q099K904k471
8861a2829J084p49J6531p90L493L162l557k100p782L392j4451q645J1963J9994
8847H716K259r194K630P719j570j2188j0639L451J0805j2728m654p729P035J1901
8833d186L394J5806J791j815p617K773J0347k6305J2373M387J0285n719j1117
8820D397J7739J373n069q694R057n8j2673j1340L11q97M491J245J1654o949j9377
8805a4790K937K56k0796k500J3125J8266N177m908N702j080J2568K296l992j9695
$$ plain form
8903 17259 17045 9154 -4389 552 25132 34936 28815 18381 13858 4749 -1605 799 15954 30753
8889 30753 16670 9328 -82 -435 -7747 -11153 -8383 -7166 -251 878 7773 10408 -4809 -6305
8875 -6305 5748 13431 14240 6064 -8297 -1997 -6569 -5114 5624 429 -5163 -13262 -10358 -12829
8861 -12829 -11745 -12494 4037 3247 6740 9902 6345 4245 -3537 -145 -14596 -23241 -11278 8716
8847 8716 10975 1781 4411 12130 10560 -1628 -12267 -8816 1989 -10739 -15393 -23122 -16087 -4186
8833 -4186 -792 15014 16805 14990 7373 10146 20493 -5812 6561 10948 21233 15514 4397
8820 4397 22136 23509 18440 9746 18803 18745 6072 -5268 -4957 -5854 -1363 -118 11536 4587 -14790
8805 -14790 -11853 -11597 -32393 -34893 -21768 -3502 1675 -3233 2469 1389 13957 16253 12261 -7434
8791g434j1225Q40M183Q577J6526m553j1368n658P673O923k611k809j3053J917
8777a2072M706K511N781J822n259q174m977Q886O096r50j833j0627p40J554Q549
8762d727M938k394m241J4823L139k592Q063Q182o732j1344p123j0699l860Q107
8748f460n933j857M418R153Q205K711O466j2026L562M844j9285j1752J4955R613
8734F614O506j222j2996M901K2995M275r712r914k800k1629j1085J5866J8837
8721A0636L906k2589k633R555j371j165j0827Q486J5559n796l027k047q174j000
8707a0487r03Q129J3068j5781p668k085J2435J0678J1717j950J0254m649k1923
8694H35j0587M949K937J4558P088l656j374o025J897o695K397p721k862J0211
$$ plain form
8791 -7434 -18659 -17819 -13636 -5059 11467 6914 -4454 -10112 -2439 4484 1873 -936 -13989 -12072
8777 -12072 -7366 -4855 926 2748 -2511 -10685 -15662 -6776 -680 -1630 -3463 -14090 -14830 -13276 -4727
8762 -4727 211 -2183 -6424 8399 11538 8946 17009 25191 18459 7115 -8 -10707 -14567 -6460
8748 -6460 -12393 -14250 -9832 -679 7526 10237 16703 4677 8239 13083 -6202 -17954 -2999 6614
8734 6614 13120 11898 -1098 3803 26798 31073 21361 11447 8647 -12982 -24067 -8201 10636
8721 10636 14542 -8047 -10680 -1125 -2496 -3661 -14488 -6002 9557 3761 734 -1313 -9487 -10487
8707 -10487 -11390 -3261 9807 -5974 -13642 -15727 -3292 7386 19103 17153 27407 22758 835
8694 835 -9752 -4803 -1866 12692 19780 16124 14750 8725 10622 3927 6324 -1397 -4259 5952
8680E952K1508N512m335o963l56k082M036j0500r041j1065K098j0211N525L192
8666f730J647N039j897J0585N301j0553q858q73K1338J276j1962j6005P640J6289
8652A2237L384j896J5653J940l377k193j2207J2925l696q540l49j838r011n999
8638b967N436Q337K835L152J7572Q994O872J6934N637o441k6405q176J7017j1318
8624C7479k2320j0557J0573P477R798r417j1234k639L688M775P136J3549M967
8611D3275r873p537P407O17O585J6319K829Q924m150J698n352L606j769r66m497
8596E7116J0858m841j0127m328m064L238J5678K1502L3640L3290L8550r259j2322
8583A68931j8785o852j3566j0497J2j638J4599l239l324o097j8305k8462j8266
$$ plain form
8680 5952 27460 32972 28637 21674 21318 19236 23272 12772 3731 -7334 -5236 -15447 -9922 -6730
8666 -6730 -5083 -44 -1941 8644 13945 3392 -5466 -6339 14999 16275 4313 -11692 -4052 12237
8652 12237 15621 13725 29378 31318 27941 25748 13541 26466 22770 14230 13881 12043 3032 -2967
8638 -2967 2469 10806 13641 16793 34365 43359 50231 67165 72802 66361 39956 31780 48797 37479
8624 37479 15159 4602 15175 22652 32450 23033 11799 9160 12848 17623 24759 38308 43275
8611 43275 33402 25865 33272 33889 40474 56793 59622 68546 64396 66094 60742 64348 62579 61613 57116
8596 57116 67974 63133 53006 48678 44614 47852 63530 85032 118672 151962 190512 181253 168931
8583 168931 150146 143294 129728 119231 119243 117605 132204 128965 125641 119544 101239 72777 54511
8570E4511o276N040q60r849q350j1617r1K853j2370n995K061o266o51J2501J2672
8555B7313q235j1576o8J0606J5629R263j2319p784j373m713m764K2831J4774P872
8541E7456Q967j1229k4423j8015L179J2327n371K828n967K020O612j8232p905
8528B247L51N712J919M125j1822q663M534R115P310L533L196j7505J0781J3331
8514B8164j2561r193R526L761M536j9148j2113P488J1671J6174K283j3740j0476
8501F372o96J0894L249j410j1933l486j553l052m124P334N997n861m907R276J208
8486G308N57j2873n85K009L534J2117O639o284j2058r216J747j922J16M108J74
8471d629k416o417L249R416M026j484r687L581R340J612J0918R12j1029r281P452
$$ plain form
8570 54511 48235 53275 52415 42566 34216 22599 22508 25361 12991 6996 9057 2791 2140 14641 27313
8555 27313 19078 7502 7434 18040 33669 42932 30613 22829 21456 16743 11979 34810 49584 57456
8541 57456 66423 55194 30771 12756 15935 28262 22891 25719 19752 21772 28384 10152 2247
8528 2247 2598 8310 10229 14354 2532 -6131 -1597 7518 14828 18361 21557 4052 14833 28164
8514 28164 15603 6410 15936 19697 24233 5085 -7028 460 12131 28305 30588 16848 6372
8501 6372 5676 16570 19819 18409 6476 2990 1437 -1615 -5739 1595 7592 1731 -3176 6100 7308
8486 7308 7865 -5008 -5593 -3584 -50 12067 18706 12422 364 -8852 -7105 -9027 -8911 -4803 -4629
8471 -4629 -7045 -13462 -10213 -797 3229 1745 -7942 -4361 4979 6591 17509 18421 7392 -1889 5563
8456E563J0703R27k085j1523j3176P497N559L323q11m998q895j9J5104j370j535
8441D264j0000k05J6932p074Q729j392r459k1806m549o179J5871Q343k300N83
8427h242r338J0984R143k819j2832O864J1552o400J2399P706k826l60P61o462
8413A0130O662P638m572k2384n215J6292k377p111n704P673j2072j2305r152q58
8399c3355J6951J4124k825k108L105o673r869R14K280Q378K0125J9494k065q232
8385B0244Q109j0987j2057q244N6J37N469l236o721R765J3649J523o123n700P335
8370A3219m266j2019m408Q205O617P216k40q374j3416o271J834J2601K4526p630
8356A7594l648j1788n638j000k510J691n40J0963l084l60p479M562J5476m93Q562
$$ plain form
8456 5563 16266 17193 15108 3585 -9591 -2094 3465 6788 5977 979 -7916 -7935 7169 5799 4264
8441 4264 -5736 -5941 10991 3917 12646 11254 1795 -20011 -24560 -30739 -14868 -6525 -8825 -8242
8427 -8242 -17580 -6596 2547 -272 -13104 -6240 5312 -1088 11311 19017 16191 15831 16592 10130
8413 10130 16792 24430 19858 -2526 -7741 8551 6174 -937 -6641 1032 -11040 -23345 -32497 -33355
8399 -33355 -16404 -2280 -5105 -7213 -4108 -10781 -20650 -19736 -17456 -9078 11047 30541 28476 20244
8385 20244 28353 17366 5309 -2935 -2879 -2742 2727 -509 -7230 2535 16184 17707 11584 5884 13219
8370 13219 8953 -3066 -7474 731 7348 14564 14324 5950 -7466 -13737 -11903 698 25224 17594
8356 17594 13946 2158 -3480 -4480 -6990 -5299 -5839 5124 2040 1680 -5799 -1237 14239 13746 22308
8341B2308O435m167o468j2736M396N568N736m976j7280o514K869P168n011r378
8327a2050n92k17o873k082R749L17J4576J5260q894j0281J8274L590j5288q464
8313b975J3097Q85p359j4302J1794j1858L947J500l445m278j1582j1750j398R319
8299b8405j75N306J7980m941l454O764k313j1745o782N270L236K4002k895J1316
8285A3164O165l832j5635J0457J3424J247L56l984j765o566j2294j7081R215p24
8271g853N965M399P24L270r519n987j1482m455M403K0383N701J468q265j0262
8257a1510n709M184o879Q824J4853M840j4770j5284j1307j068r98K535J6235J9052
8243B998P199m247m659o716P381J6600k0040j0729K386J1286n071L626q065m911
$$ plain form
8341 22308 28743 24576 18108 5372 9768 15336 21072 16096 -1184 -7698 -4829 2339 -2672 -12050
8327 -12050 -12642 -12859 -19732 -21814 -12065 -11748 2828 18088 9194 -1087 17187 20777 5489 -2975
8313 -2975 10122 11007 3648 -10654 1140 -10718 -6771 -5271 -8716 -12994 -24576 -36326 -37724 -28405
8299 -28405 -28580 -23274 -5294 -10235 -13689 -6925 -9238 -20983 -27765 -22495 -19259 4743 1848 13164
8285 13164 19329 15497 -138 10319 23743 24990 25346 21362 19597 13031 737 -16344 -7129 -7853
8271 -7853 -1888 2511 3235 6505 -3014 -9001 -20483 -24938 -20535 -152 5549 7017 -1248 -11510
8257 -11510 -17219 -13035 -19914 -11090 3763 8603 -6167 -21451 -32758 -33826 -34824 -32289 -16054 2998
8243 2998 10197 5950 1291 -5425 1956 18556 -1484 -12213 -9827 1459 -3612 14 -8051 -12962
8229a2962J225m834N930J4556r350k7486L398R845r74j1516K691J4492J4792M800
8215D607j258R392R799j2531J620N042j028j0125J4033J0630m224j7055k6917
8202a8015k6845m829J1859R702J6058J3445L383q501r923L84Q783L825l927o778
8188a1379r50L472r37o831p269L813J1304j255L166n52N187K1602m348K012n784
8173A1251l210q79n446K827J1865R809R869j6855k1423j2567m968P489J2594M509
8159D865p280j4620r20p815K469m409k30M044J3449J5416M224j7733j6661j288
8145b6489J1060O816n16O956Q533j0304j036P31R295M191p761q587J3962R052
8131A5903J20o317o24K424J1178J0211o973o455J661M979n625l621j0497j2064
$$ plain form
8229 -12962 -11737 -16571 -10641 3915 -5435 -32921 -29523 -19678 -20652 -32168 -29477 -14985 -193 4607
8215 4607 3349 12741 22540 10009 11629 16671 15643 5518 19551 30181 25957 8902 -18015
8202 -18015 -44860 -49689 -37830 -28128 -12070 1375 4758 -3743 -13666 -13282 -4499 -674 -4601 -11379
8188 -11379 -12329 -8857 -9794 -16625 -23894 -20081 -8777 -10032 -6866 -7418 -2231 19371 15023 17035 11251
8173 11251 8041 7162 1716 4543 16408 26217 36086 19231 -2192 -14759 -19727 -12238 356 4865
8159 4865 -2415 -17035 -17955 -25770 -23301 -27710 -27940 -23896 -10447 4969 9193 -8540 -25201 -26489
8145 -26489 -15429 -8613 -9129 -2173 6360 -3944 -4980 -4249 5046 9237 1476 -7111 6851 15903
8131 15903 16023 9706 9082 11506 22684 32895 25922 19467 21128 26107 20482 16861 6364 -5700
8117e700j449M288r53J1267J5242M700n784R19k0796j3209p344l948O351M859
8103a1557K894J0750m165M622j616j4087p377k678n01L126N554N729R979p752
8089g079Q7K80m030L873L056M032J4769J3051k0956j7846K3833L7117j16k4975
8075B5096j756j1735p17l103M042m268j1011l409R926j289j5361N525J8081J4709
8061B4730n56n617M644O600q192j1597j0301p743j498M840J960K1281N342m730
8047A9163j6L725L975O039J114j3517p087R19m987n104k610o833o656r354J4816
8032f413J1101J9599J857O904o567j5659J350J4262J0526l533j5992N293p373
8019A5355r702j4331Q86n901n302M488J190Q666j0109j593p312P035J1218J0593
$$ plain form
8117 -5700 -7149 -2861 -3814 7453 22695 27395 21611 22530 1734 -11475 -18819 -22767 -16416 -11557
8103 -11557 -8663 2087 -2078 2544 928 -13159 -20536 -23214 -23715 -20589 -15035 -9306 673 -7079
8089 -7079 -6992 -6712 -10742 -6869 -3813 219 14988 28039 7083 -10763 13070 50187 50071 25096
8075 25096 23340 11605 10888 7785 11827 7559 -3452 -6861 3065 1776 -13585 -8060 10021 24730
8061 24730 24174 18557 23201 29801 21609 10012 -289 -8032 -9530 -4690 -2730 18551 23893 19163
8047 19163 19147 22872 26847 32886 34000 20483 13396 14315 9328 4224 1614 -5219 -11875 -21229 -6413
8032 -6413 4688 24287 26144 33048 26481 10822 12172 26434 36960 33427 17435 22728 15355
8019 15355 5653 -8678 -7792 -13693 -18995 -14507 -13317 -4651 -14760 -16353 -23665 -16630 -5412 5181
8005E181K1944O016j0892p850O232j0495k883l028L03L976o033n105j48J4240
7991A1458j4751j6753O561J9244J1569m229q606R938Q04K3722J5212o421k999
7978D4749j9273k978o318l198r774J601R586n921j4659N816J0503N792j6239j8892
7964a9205j5095J0504Q648K064k082R319P977O483J9233J389l869k4990j3461
7951a3085J1947J0142j633K375J0739R625J46L658o50J454j1377j0887K111j7409
7937b844j2508R561J4090j961m151J31r27j606P717j0212J4414K423L071K4350
7923D1548q663l648J450p012j066L673j0232q731N093J0992P550m11m350p396
7909A8797j988J2128r194j626J2802Q178r936J495K276m032o846m329q52k017
$$ plain form
8005 5181 27125 33141 22249 14399 20631 10136 7253 4225 4528 8504 2471 -2634 -2782 11458
7991 11458 -3293 -20046 -13485 5759 17328 13099 4493 14431 15235 38957 54169 47748 44749
7978 44749 25476 22498 16180 12982 3208 4809 14395 8474 -6185 -369 10134 15926 -313 -19205
7964 -19205 -34300 -23796 -15148 -13084 -15166 -5847 2130 8613 27846 29235 25366 376 -13085
7951 -13085 -1138 9004 7371 9746 20485 30110 30256 33914 33264 34718 23341 12454 14565 -2844
7937 -2844 -15352 -5791 8299 6338 2187 2318 1391 -215 7502 -2710 11704 14127 17198 41548
7923 41548 32885 29237 30687 23675 22609 26282 16050 7319 12412 23404 30954 30543 26193 18797
7909 18797 16809 28937 19743 18117 30919 39097 29161 30656 32932 28900 22054 17725 16873 14856
7895A4856R91N496j9137N968J5880j707j0701m231q11p455o66J7131P89j0483
7881E920k685m536J4788J5498k671n403n323m739j257K197J53m187J3598Q065
7867B9418j5150j1954L113Q206j1335q289K925J514J0674Q279k769j2819l271
7854a458J4085n2n923p118p275k441q924j06J0501J980j1649J459M138L568J6001
7839F786l402L181J4438K942q740m280J0237K993k783o765j7628j0772N550J2030
7825C787N962l854Jj2201l799J2482P794o633q758R220K835r873j6533L260L832
7810a2478J5213q666m02o918J494l86l182Q439J7320L913n454J2685N834j1553
7796A5859o685J0498m944n324Q715P760l806q801j2261r774N56N336L905Q751
$$ plain form
7895 14856 15847 21343 2206 8174 24054 22347 11646 7415 6604 -851 -1517 15614 16403 5920
7881 5920 3235 -1301 13487 28985 26314 20911 15588 10849 9592 11789 11942 7755 21353 29418
7867 29418 14268 2314 5427 13633 2298 -5991 -3066 -1552 9122 17401 14632 1813 -1458
7854 -1458 12627 12575 6652 -466 -7741 -10182 -19106 -19212 -8711 -6731 -18380 -16921 -12783 -9215 6786
7839 6786 3384 6565 21003 23945 15205 10925 21162 24155 21372 14607 -3021 -13793 -8243 3787
7825 3787 9749 5895 5896 -6305 -10104 2378 10172 3539 -5219 4001 6836 -3037 -19570 -16310 -12478
7810 -12478 2735 -5931 -6333 -13251 -11757 -12143 -15325 -6886 10434 14347 8893 21578 27412 15859
7796 15859 9174 19672 14728 9404 18119 25879 22073 13272 1011 -8763 -8207 -2871 1034 9785
7782I785p01l932J2769m037j5221j6418m977m481J4107r70q773K0130m819j6615
7768b4153r946J3134J0713L483M513q0m082l805j461L196J7313R481k462j419
7754A4425q308p014Q635J7442k334j806n349J0190N500j7406k7477j4277Q607
7741a9172J3529q69j89J0646N689l951N586K85P759j3885k318K638k66J0212o88
7726A5006j5273j2478n599M238J1516J1475P912q880r594P41K431m552r453Q997
7712c513P929q845l707m084N624p70K160r407J572l925N258O52Q459P001j1024
7697f620j6464J4036N028L859k669j9402M684K740Q152k292M749K2781l594m393
7683A0595q001l507j9762j0283J8567M359N704l193k813k425P982M860j2995o063
$$ plain form
7782 9785 9084 5152 17921 13884 -1337 -17755 -22732 -27213 -13106 -14076 -22849 -2719 -7538 -24153
7768 -24153 -34099 -20965 -10252 -6769 -2256 -2336 -6418 -10223 -11684 -8488 8825 18306 15844 14425
7754 14425 6117 -897 7738 25180 22846 21040 15691 25881 31381 13975 -13502 -27779 -19172
7741 -19172 -5643 -6512 -6701 3945 9634 5683 11269 11554 19313 5428 3110 5748 5482 15694 15006
7726 15006 -267 -12745 -18344 -14106 -2590 8885 16797 7917 -1677 -936 1495 -3057 -12510 -3513
7712 -3513 4416 -4429 -8136 -12220 -6596 -7366 -5206 -14613 -13041 -16966 -11708 -11056 -2597 4404 -6620
7697 -6620 -23084 -9048 -4020 -161 -2830 -22232 -17548 -14808 -6656 -8948 -4199 18582 14988 10595
7683 10595 2594 -913 -20675 -30958 -12391 -8032 -2328 -5521 -8334 -10759 -2777 2083 -10912 -16975
7669a6975P107O398k416N15j4777m734N538N774J9416J4324J247K525o733k250
7655A4959j16j7912j0231M170N82n16Q542j097j7784L105L788k356P605N905r57
7640b313j917l370N608J0805Q657m681j0183l651q37J342k696m09M094N478N590
7625A1517j5676j3532L418P938l529q897J3905J5957M409P025N101q907j0464
7612H265m229K752N486n509k26J036q650J099J010R461k37j4476N530J272p091
7597d507n936R798l166q267N595J6033N477j1888n732Q262R781j4523o800k182
7583h055O936r198k21N168O728J0299q556k898K60J3938N371j1978o376P338k211
7568F545o991k082l579J3263J1351L191J109M21r586L65j0932N595m785p089r914
$$ plain form
7669 -16975 -9868 -3470 -5886 -5371 -20148 -24882 -19344 -13570 5846 20170 21417 23942 17209 14959
7655 14959 14843 -3069 -13300 -9130 -8548 -9064 -522 -1619 -19403 -16298 -12510 -14866 -7261 -1356 -2313
7640 -2313 -4230 -7600 -1992 8813 17470 12789 2606 -1045 -1882 -540 -3236 -3645 449 5927 11517
7625 11517 -4159 -17691 -14273 -6335 -9864 -18761 -4856 11101 15510 22535 27636 18729 8265
7612 8265 4036 6788 12274 6765 6539 7575 -1075 24 1034 10495 10258 -4218 1312 2584 -4507
7597 -4507 -10443 -645 -3811 -12078 -6483 9550 15027 3139 -2593 5669 15450 927 -5873 -8055
7583 -8055 -1119 -10317 -10538 -5370 1358 11657 3101 203 463 14401 19772 7794 1418 8756 6545
7568 6545 -446 -2528 -6107 7156 18507 21698 22807 23228 13642 14007 3075 8670 3885 -3204 -13118
7553a3118J2773K316L808K208L696Q90K455j5034j6401M769J7566o53R30J988
7539H193J420m705o778N947J1417J7415m954q747J7236N828j5318j4571j2076
7526C07j3859O779k76j1284Q243N582q04J315k778R155P045K398P989j7961j2209
7511a0358r035M021m70j0991P158O930R549M868M935J0084n360J830m467r004
7497c10o115p223j4472p35N014Q633J4429q477n414L785N043K1644l812j2109
7483a19j3383l242k065j1316J8063J9020j107n233N06k864O957M514O08J2402
7469B2741k511P86j550j3337K386m597r50j4847j894J7349j237r314l438O077
7455d336L861l771J3268M934p908l252L554J0085j628R203k104k585m780j6696
$$ plain form
7553 -13118 -345 1971 5779 7987 11683 12573 15028 -6 -16407 -11638 5928 5275 6205 8193
7539 8193 9613 4908 -1870 4077 15494 32909 27955 19208 36444 42272 26954 12383 307
7526 307 -13552 -6773 -7049 -18333 -10090 -4508 -5312 -3997 -6775 2380 9425 11823 19812 1851 -10358
7511 -10358 -19393 -15372 -15842 -26833 -19675 -12745 -3196 1672 6607 16691 11331 13161 8694 -310
7497 -310 -6425 -13648 -28120 -28855 -23841 -15208 -779 -9256 -14670 -10885 -5842 15802 11990 -119
7483 -119 -13502 -16744 -18809 -30125 -12062 6958 5851 618 1124 -1740 5217 9731 10339 22741
7469 22741 20230 21016 19466 6129 8515 3918 2968 -11879 -13773 3576 2339 -6975 -10413 -4336
7455 -4336 -475 -4246 9022 13956 6048 2796 6350 16435 14807 24010 21906 19321 14541 -2155
7441b155j9303q13J8265J0882q035n233M299J1468J1870l167m721n782m063j3856
7427a0344j25J731J3524J4011R725j9976r841j850J2929O520l327k139n394K888
7413H332O919o541k1247K915k482o099N781M757P353Q523r78j3022o794J02O429
7398f052j2719R235J1697k048M273p594j6165r439o013J6910J1362k405q696J0737
7384f917P457M151l205p917j0527m542J1954J6471J5219j0318k577m139l226O855
7370H739J2477j337j463L077q495k4878j1599K308J3796Q022o609J96K5155J7199
7356C6588j2274j5281K296Q47J5225J4235k832j7590p555j710J5106p078j1424
7343H553J359K007j2850k6746Q15Q760O223m192l827J256J2516k042J31j0276
$$ plain form
7441 -2155 -21458 -22271 -4006 6876 -1159 -6392 -2093 9375 21245 18078 13357 7575 3512 -10344
7427 -10344 -10469 -8738 4786 18797 28522 8546 -1295 -3145 9784 16304 12977 10838 5444 8332
7413 8332 15251 8710 -12537 -9622 -12104 -18203 -12422 -7665 -312 8211 7233 -5789 -12583 -12481 -6052
7398 -6052 -18771 -9536 2161 113 4386 -3208 -19373 -28812 -34825 -17915 -6553 -8958 -17654 -6917
7384 -6917 540 4691 1486 -6431 -16958 -21500 -9546 6925 22144 11826 9249 5110 1884 8739
7370 8739 21216 19879 18416 21493 12998 -11880 -23479 -21171 -7375 647 -5962 -5766 19389 36588
7356 36588 24314 9033 11329 12176 27401 41636 38804 21214 13659 11949 27055 19977 8553
7343 8553 9912 11919 -931 -27677 -26862 -18102 -11879 -16071 -19898 -18642 -6126 -8168 -8037 -18313
7329a8313n28p879N379J1472O605q936o987j131M41J2716j0492j2380m550K81
7315c4302o167J4763J4388N199p349r708J1936K2375j1777j1412p7j2766k458
7302b7355L626M187K876p021K753J4004k050j0782N273J1311J1967m784j1048
7289g043j570o089k11n026P143M831m34J1085L182P893m603j3653k086M441J5602
7274A3462j1153j646m921j3166R46Q689O512o908K980O257q480q985K002P734
7260f677J739j0032K2626P94j768K651l315l002J2379O255j7784p415j140j3654
7246a8343j0752J8172O736j0039J4555o49j1819k356j1808k2114K169K0284J8583
7233g381N766o445j0659r559j78O564K7378N127m898Q675M16l082j3323q037J6686
$$ plain form
7329 -18313 -18841 -26720 -21341 -9869 -3264 -12200 -19187 -20318 -19877 -7161 -17653 -30033 -34583 -34302
7315 -34302 -40469 -25706 -11318 -6119 -13468 -23176 -11240 11135 -642 -12054 -12131 -24897 -27355
7302 -27355 -23729 -19542 -16666 -23687 -20934 -6930 -8980 -19762 -14489 -3178 8789 4005 -7043
7289 -7043 -8613 -14702 -14913 -19939 -12796 -7965 -8399 2686 5868 13761 9158 -4495 -6581 -2140 13462
7274 13462 2309 663 -4258 -17424 -16478 -7789 -1277 -8185 -5205 1052 -7428 -16413 -14411 -6677
7260 -6677 -4938 -14970 7656 8450 6682 9333 6018 3016 15395 21650 3866 -3549 -4689 -18343
7246 -18343 -29095 -10923 -4187 -14226 329 -320 -12139 -14495 -26303 -48417 -46248 -25964 -7381
7233 -7381 -1615 -8060 -18719 -28278 -28456 -21892 5486 10613 5715 14390 14806 11724 -1599 -9636 7050
7218G050J5705Q07j8611k023p207k6711q586R814J5861k997j0796p036J2176M375
7204a8179Q348l859K2517J0636j305l946k221M931p025N028Q003M996j2582j3503
7190A839J2611K697o710k599o590j2806M28o887k459N667J2924K1833M339j1297
7176A2990n999p130o513p517q588m358P678N254j0214L473R928Q948q249l55N141
7161e511P53L1j4099K431J8851N909J060P559j0710j0605j692o266j578L522K5426
7146A5081J3561j0285j1792o456k361j748j764J6366P585k0466o339r37k187Q73
7132a0869j109o714Q094L516Q360k088M120j678p949O07J5152j599n252K717N802
7117A1110J396n913J919j4121l597j0449O237R223m360k526J6022P989k908j0992
$$ plain form
7218 7050 22755 23562 4951 2928 -4279 -30990 -39576 -29762 -13901 -16898 -27694 -34730 -22554 -18179
7204 -18179 -9831 -13690 8827 19463 18158 14212 11991 16922 9897 14925 22928 27924 15342 1839
7190 1839 14450 17147 10437 7838 1248 -11558 -11130 -18017 -20476 -14809 -1885 19948 24287 12990
7176 12990 6991 -139 -6652 -14169 -22757 -27115 -19437 -14183 -24397 -20924 -10996 -2048 -10297 -10652 -5511
7161 -5511 -4758 -4727 -18826 -16395 2456 8365 9425 16984 6274 -4331 -6023 -12289 -13867 -10345 15081
7146 15081 28642 18357 6565 109 -2252 -4000 -5764 10602 18187 -2279 -8618 -9555 -11742 -10869
7132 -10869 -11978 -18692 -10598 -7082 1278 -810 3310 1632 -6317 -5710 9442 7843 2591 5308 11110
7117 11110 12506 6593 8512 -5609 -9206 -19655 -13418 -4195 -8555 -11081 4941 12930 10022 -970
7103i70J980J3598k411p852O866Q22j7809J1986P600n892N021J6305R636k0959
7089A7921j2858r575j634J3163M287l369j47J8396J0379o952m693n470l026Q32
7075A7254Q908q610L522o682p51j4523j4081Q444N559j9516j4316J5681K2542
7062C431Q155K537j579K248M078o28O011m889o584j0174l907M89n82r088j7162
7047b7644o225J5340J7431k115p392p175Q632R187J2306O392j0920n792O688N257
7033A3970O13k347j3265o475P051k473o483l694M981K365J1904J1592n16j1523
7019E700j2316j1276M118J0116J2382J4438J0558L716k1796j9491L955J2116O289
7006A8509j0726p26m724j3752j78k138K288J1386r141J2705J6321P511j5143j6648
$$ plain form
7103 -970 1010 14608 12197 4345 11211 12033 -5776 6210 13810 7918 12939 29244 38880 17921
7089 17921 5063 -4512 -6146 7017 11304 7935 7788 26184 36563 29611 24918 19448 16422 17254
7075 17254 26162 17552 21074 14392 13641 -882 -14963 -6519 -960 -20476 -34792 -19111 3431
7062 3431 11586 14123 12544 14792 18870 18242 24253 19364 12780 2606 -1301 -812 -1394 -10482 -27644
7047 -27644 -33869 -18529 -1098 -3213 -10605 -17780 -9148 39 12345 18737 7817 2025 8713 13970
7033 13970 14583 12236 -1029 -7504 -453 -2926 -9409 -13103 -8122 -5757 6147 17739 17223 5700
7019 5700 -6616 -17892 -13774 -3658 8724 23162 33720 37436 15640 -3851 104 12220 18509
7006 18509 7783 7057 2333 -11419 -11597 -13735 -11447 -61 -9202 3503 19824 27335 12192 -4456
6992d456m00K606o094Q653l154l045m121O26J7336k813j4930J2942J1703L251
6978A8104J0465q443q4q148r778j0986q020M927K527O605R133P239L185j103r073
6963F550j0695j1797M832R04L710R840K742J79n575J555J4029j225j1322N75m433
6948a31J353m72j2598q490k516R302N57M683R670R372K97j4719P740P595n381
6933F262J7768j2818p650j2067j2099J6518J1011o925q439J916J1769P650n410
6920G486j6480k754l179J8945J4590P309j6650k1176p149L812Q927j3242m786
6907b4347l621O330Q331J4980j0703J569J3021o362J722J340J6015J864n755l031
6893A1353L768m927n626J19R882J395l159R259j2372n220J1929J7755p573j3798
$$ plain form
6992 -4456 -4856 -2250 -8344 309 -2845 -5890 -10011 -9385 7951 5138 -9792 3150 14853 18104
6978 18104 28569 20126 20042 11894 2116 -8870 -16890 -11963 -9436 -2831 6302 13541 16726 15623 6550
6963 6550 -4145 -15942 -11110 -10206 -6496 3344 6086 6265 690 2245 16274 15049 3727 4302 -131
6948 -131 1222 750 -11848 -20338 -22854 -13552 -12995 -8312 1358 10730 11027 -3692 4048 11643 6262
6933 6262 24030 11212 3562 -8505 -20604 -4086 6925 0 -8439 -6523 5246 12896 7486
6920 7486 -8994 -11748 -14927 4018 18608 25917 9267 -11909 -19058 -15246 -6319 -19561 -24347
6907 -24347 -27968 -21638 -13307 1673 -9030 -7461 5560 -802 920 2260 18275 20139 14384 11353
6893 11353 15121 10194 4568 4687 14569 15964 12805 22064 9692 4472 16401 34156 26583 12785
6879A2785q542K666K577j3070R362J0551j4775j0443n18J14J6902J79q81n383
6865A524M642j8246o618R321r59R219P124o793K681R026l326j5077k5932k0426
6851e3840J8141P575J3370q507O820K6939J141j6147r632R348K280j7641K495
6838a7658L922j568m08J6368P55Q204J4944q425o283m127O345Q85M587j053p727
6823H761K100J0335o478l694r27j1376j8199P820P500o648N549K3035J107q295
6809A0590L938r11m020K408k581J4827j4773j7782J369n878J6763J4324r721o061
6795B492p155j752M393J0159r093k197J285J3764J0708l493j1930l988k2696K183
6781a7320J4261J525j6759J490J0275J1085J9460q82n630j1138K664N857j4953
$$ plain form
6879 12785 4243 6909 9486 -3584 5778 16329 1554 -8889 -9407 -9293 7609 7788 6907 1524
6865 1524 6166 -12080 -18698 -9377 -10336 -1117 6007 -786 1895 10921 7595 -7482 -33414 -53840
6851 -53840 -35699 -28124 -14754 -23261 -16441 10498 11639 -4508 -14140 -4792 -2512 -20153 -17658
6838 -17658 -13736 -15304 -15712 656 1411 9615 24559 16134 9851 5724 12069 12954 17541 16488 8761
6823 8761 10861 21196 14718 11024 10097 -1279 -19478 -11658 -4158 -10806 -5257 17778 18885 10590
6809 10590 14528 13617 9597 12005 9424 24251 9478 -8304 -6935 -12813 3950 18274 8553 2492
6795 2492 -4663 -6415 -2022 8137 -956 -3153 -1868 11896 22604 19111 7181 3193 -19503 -17320
6781 -17320 -3059 -1534 -18293 -16803 -6528 4557 24017 23135 17505 6367 9031 14888 -65
6768f5l0094j8182M565J7203J9408Q845K29N467p424r188J772j2873r937J2814
6754a7460J1072R250L223q940l760N715p765p519m136l791J0647K0210Q845J1132
6740B6723j3315o079j0453k6785r40L1081J6792j0438j4067q539O77K060P167
6727f116K2437J0016j8330j6826j2207j1229R796l208P181R056J331j900j4110
6714b4109o374P546J9525K1164J7938J7212J5594J6415L719L3251K9353J1712
6702A62946l0200m6576k7556j6099j7628j9490k846M420r859j3817K1189j08j2225
6689g849k354j377n391j964R838J4573N383m715p428l567m656O19q14J5506J8134
6674B3938N56r181j3822L056m527P768N499j5958o322J5046J8457l243R645k1124
$$ plain form
6768 -65 -30159 -48341 -43776 -26573 -7165 1680 1909 7376 -48 -9236 -7464 -20337 -30274 -17460
6754 -17460 -6388 2862 6085 -2855 -6615 -900 -8665 -16184 -20320 -24111 -13464 6746 15591 26723
6740 26723 13408 7329 -3124 -29909 -30849 232 17024 6586 -7481 -16020 -15343 -13283 -6116
6727 -6116 16321 26337 8007 -8819 -21026 -32255 -22459 -25667 -18486 -9430 -8099 -9999 -24109
6714 -24109 -30483 -22937 -3412 17752 35690 52902 68496 84911 88630 121881 151234 162946
6702 162946 132746 86170 58614 42515 24887 5397 2551 6971 -2888 -16705 4484 4376 -7849
6689 -7849 -10203 -11580 -16971 -18935 -9097 5476 10859 6144 -1284 -4851 -9507 -8888 -9702 5804 23938
6674 23938 24494 15313 1491 4547 20 7788 13287 -2671 -8993 6053 24510 21267 30912 9788
6660I788r381O166j3614m168J6946N060l479j305j0733M14m592L204J8546N100
6646A7952r073m410j4596p201n145j281k507p827N398K3049J4469l591O690n122
6632F805r361Q635l433M23P688q519Q68P27k871j7302K623Q510j0447k954J0708
6617g900J4571J3043q58k0463Q14M202J3223m026M944N078k714k4167k4799M079
6603b4973J4831J4388o254L139k405k071M638j043j2642P109R915L945O935j3694
6589A818n274J314j073j263J7004k055n065j46J2484p174o445M056M75o164j469
6574A023P756J3443j4689r748l184J138J0541m561l656j5200q771J6666J0122
6561H80q822q821J627R915K0779O651l438k773J4246l988L218l394m784n807k3927
$$ plain form
6660 9788 407 6573 -7041 -11209 5737 10797 7318 6013 -4720 -4306 -8898 -5694 12852 17952
6646 17952 8879 4469 -10127 -17328 -22473 -23754 -26261 -34088 -28690 -5641 8828 5237 11927 6805
6632 6805 -2556 6079 2646 3069 10757 2238 3106 3833 962 -16340 -13717 -5207 -15654 -18608 -7900
6617 -7900 6671 19714 18856 -1607 -793 3409 16632 12606 17550 22628 19914 -4253 -29052 -24973
6603 -24973 -10142 4246 -2008 1131 -1274 -3345 1293 250 -12392 -5283 4632 8577 15512 1818
6589 1818 -3456 -2142 -3215 -4478 12526 10471 5406 5260 17744 10570 4125 8181 8656 2492 1023
6574 1023 8779 22222 7533 -2215 -5399 -4261 6280 1719 -1937 -17137 -25908 -9242 880
6561 880 -7942 -16763 -15136 -5221 15558 22209 18771 15998 30244 26256 29474 26080 21296 15489 -8438
6546h438j6070R378m392J4497J803R26l1862m168J7501O256l367M555p570J0077
6532a0874P380M697Q250n352j8214j6435M012J6152J283P761L147k012o284n77
6518g066n861r028P987J0229j4531n945k562J3510L650q889r140J289N796J5013
6504e548N271J1134M42j40j4515j8769M954m413P342Q463l55J1858J7369J054
6490B4147J212J1490O210j438j4246o701m998j7098J5011J4289j2895j7374j9460
6477b1851P822K1307j316j899n532o781o637k03K3356k12l295r905j1039K072
6463a4113K3075R531O179j5511j2410p758j9599j299O748L972q516q895J2777
6450b5819J1289K972P768k844p52L028j2707l658J299J720J8980J6616j6478j0062
$$ plain form
6546 -8438 -24508 -15130 -19522 -5025 -3222 -2296 -34158 -38326 -20825 -14569 -17936 -13381 -20951 -10874
6532 -10874 -3494 1203 9453 4101 -14113 -30548 -26536 -10384 -9101 -1340 1807 -205 -6489 -7066
6518 -7066 -12927 -21955 -13968 -3739 -18270 -24215 -26777 -13267 -9617 -18506 -27646 -26357 -20561 -5548
6504 -5548 -277 10857 11299 11159 -3356 -22125 -17171 -21584 -14242 -5779 -6134 5724 23093 24147
6490 24147 25359 36849 43059 41621 27375 20674 15676 -1422 13589 27878 14983 -2391 -21851
6477 -21851 -14029 7278 5962 4063 -1469 -8250 -14887 -15090 8266 8054 4759 -5146 -16185 -14113
6463 -14113 8962 18493 24672 9161 -3249 -11007 -30606 -31905 -25157 -21185 -29701 -38596 -25819
6450 -25819 -14530 -11558 -3790 -6634 -7386 -4358 -17065 -20723 -19424 -17704 1276 17892 1414 -8648
6436h648q558K539q612r383J220j396O504K5457R023R57k706m87o391j4962l827
6421a9270Q980K3383l20m790q211l761k721N607J4370N724L069o748k0105j1812
6407a6605K166j3617K800Q026Q384J0387o31o764O49N53j2058N377N205m676j815
6392a2619L094l07R007kL373J0493q134o546j7934J1040J2233j1828q597L399
6378a3328J0939n400J292j3579k2834K170J9435O829K227J1687N203J086L249
6365H976Q166O033k214o993p299k166j6302P660q205K652N799l166R681J2282
6351A4904j7612l755J4159r39j4011J1360L004o087j0931k900n634L150J6807
6338A515p417M036n494J4155J6241L868m613q040O321k964k0909p000J450Q667
$$ plain form
6436 -8648 -17206 -14667 -23279 -32662 -31442 -32838 -26334 -877 8146 9103 6397 5910 -481 -15443 -19270
6421 -19270 -10290 13093 12773 7983 -228 -3989 -6710 -1103 13267 18991 22060 15312 -4793 -16605
6407 -16605 -14439 -28056 -25256 -17230 -8846 1541 910 -5854 -5205 -4652 -16710 -11333 -6128 -10804 -12619
6392 -12619 -9525 -9832 -825 -827 2546 13039 4905 -1641 -19575 -8535 3698 -8130 -16727 -13328
6378 -13328 -2389 -7789 -6497 -20076 -42910 -40740 -21305 -14476 -12249 -562 4641 5727 8976
6365 8976 17142 23175 20961 13968 6669 4503 -11799 -4139 -12344 -9692 -3893 -7059 2622 14904
6351 14904 -2708 -6463 7696 6757 -7254 4106 7110 1023 -9908 -12808 -18442 -15292 1515
6338 1515 -5902 -1866 -7360 6795 23036 26904 22291 14251 20572 17608 -3301 -10301 -8851 -184
6324a84L12j1493J35J4693J1297k900n187n935m352j6431J3839J0758p523L287
6310C16J1394P453O070j0144l786L015j8431L625l793j8178k213N183N687l908
6296a7710Q859j0383K719M204K625n452R025l204N576P449O431J0264P23j3705
6282G421j086J2264J1042k288q787L718r79p137j9541j2138J7607J4469j7542
6269b977j840J0885o087J518R503J3414m669k6785p355L647j984J8192R596J3719
6255B8777K649k4012j4064m047o285K394j320L35J3616r480j0298l88J4708J2034
6241D619o923j3405r539P235m514J711R508O757J357l614j0671L126Q252q595
6227a4696p632L245N380R245K42K970O533n785N36l186j742m003m923K707j1180
$$ plain form
6324 -184 128 -11365 -11230 3463 14760 11860 6673 738 -3614 -20045 -6206 4552 -2971 316
6310 316 11710 19163 25233 15089 11303 14318 -4113 -488 -4281 -22459 -24672 -19489 -13802 -17710
6296 -17710 -8851 -19234 -16515 -12311 -9686 -15138 -6113 -9317 -3741 3708 10139 20403 21126 7421
6282 7421 6335 18599 29641 27353 18566 22284 21305 14168 -5373 -17511 96 14565 -2977
6269 -2977 -4817 6068 -19 1499 11002 24416 19747 -7038 -14393 -10746 -12730 5462 15058 28777
6255 28777 31426 7414 -6650 -10697 -16982 -14588 -15908 -15573 -1957 -11437 -21735 -22123 -7415 4619
6241 4619 -2304 -15709 -25248 -18013 -22527 -20816 -11308 -4551 -3194 -6808 -17479 -14353 -6101 -14696
6227 -14696 -22328 -19083 -13703 -4458 -4216 -1246 5287 -498 38 -3148 -4890 -8893 -13816 -11109 -22289
6212b2289O841m490R216K835j5131q362J5307Q784r22P123N269j2348K682J6771
6198A1286m409n127k759J3972n476j0682p859J4325q00O259j349J0490J1264j0813
6184A8322k1972m86p733N901l166p647J073j2825R690M029m792q233P167J8653
6170b019N416j2956R01P958K650k200j5297j2452m376J4401L6898L718k3243k1873
6156b2474n048j841j385o071R496P339R96J4997n28k4374p125P549M217O178j2132
6141c0206J1446R810q495j3060n33J2075J3371O248M51m220n858J6904k077j8528
6127a2672k721j0159q202J3803O214N251J6056m176K262k676M120R140J339O736
6113B4315P132j7125o898n059j5945k9J2750J0895O133p580m353n456m023Q249
$$ plain form
6212 -22289 -15448 -19938 -10722 -7887 -23018 -31380 -16073 -7289 -8211 -1088 4181 -8167 -5485 11286
6198 11286 6877 1750 -1009 12963 7487 -3195 -11054 3271 2471 8730 7381 17871 29135 18322
6184 18322 -3650 -4136 -11869 -5968 -9134 -16781 -15708 -28533 -18843 -14814 -19606 -27839 -20672 -2019
6170 -2019 3397 -9559 -8658 -700 1950 -250 -15547 -27999 -32375 -17974 18924 22642 -601 -22474
6156 -22474 -27522 -29363 -30748 -36819 -27323 -19984 -18988 -3991 -4519 -28893 -36018 -28469 -24252 -18074 -30206
6141 -30206 -18760 -8950 -17445 -30505 -31038 -18963 -5592 656 1107 -3113 -8971 7933 5856 -12672
6127 -12672 -15393 -25552 -33754 -19951 -13737 -8486 7570 3394 5656 2980 7100 16240 17579 24315
6113 24315 31447 14322 7424 2365 -13580 -13609 -859 10036 16169 8589 4236 -1220 -5243 3006
6099C006Q049j0862m339K117J384R212J0003O020m642J296j2163p155j00O797
6085H623N235J838J0066q96j0569Q32K377r986j0129Q745l465N418P146j2575
6071B660P6j572j17j0863P744O110N01k890q937n842j4218J073J8080m722o842
6056a9759k4803l984j418J0169O951J0239K1709J5166r302r122k2153K811M445
6043a9051q595K787R01l558J4450M043o141r652l13J8491J755K053R805Q687J3285
6028B8947L866o735m535q100N206n78l047j6370j9759P380m23K329l998J0647
6014e170J8379K526l119r750j8715K059k782j3790l343O887O587Q509J5359Q688
6000A2325m587n093p759k204k086L959J3152J974n796O088P295J1506L944j6441
$$ plain form
6099 3006 11055 193 -4146 -2029 -645 8567 18570 24590 19948 21244 9081 1926 1826 8623
6085 8623 13858 15696 25762 24866 14297 15129 17506 7520 -2609 6136 2671 8089 15235 2660
6071 2660 2736 1164 1047 -9816 -2072 4038 4539 1649 -7288 -13130 -27348 -26275 -8195 -12917 -19759
6056 -19759 -44562 -48546 -49964 -39795 -32844 -22605 -896 14270 4968 -4154 -26307 -23496 -19051
6043 -19051 -27646 -24859 -23958 -27516 -13066 -9023 -15164 -24816 -25129 -6638 -4883 -2830 6975 15662 28947
6028 28947 32813 26078 21543 13443 18649 18071 15024 -1346 -21105 -13725 -14148 -11819 -15817 -5170
6014 -5170 13209 15735 12616 2866 -15849 -13790 -16572 -30362 -33705 -26818 -20231 -11722 3637 12325
6000 12325 7738 2645 -5114 -7318 -9404 -5445 7707 9681 3885 9973 17268 28774 32718 16277
5986A6277o259Q170p694o455j398Q047r273J2293Q562r070j47m892j0758j958
5972d555j617N453o407j8778n935L201L637K0400K3828l026j7047j6273K494j2610
5958b7235n588M709J1959l517N665O710M674k116m171J869J0540Q407M521k871
5944A3556j1003l068j0427N559J8486j4910j0445N082k655l595j3599J2893K1255
5931G129l879J5135o033j0580o661j021o405o233j2894O826J1343J0587m532o58
5917g876k1543j01P187Q587R145n859J5846J227K662L274Q516k530k812q635k0160
5902a3072N028J3417J8119n009j3336n997r985J8038K1497m272l485j0571J1145
5889B1517Q006j3968j3648n708j079p301R266K4804K336n900l187J858N973j7214
$$ plain form
5986 16277 10018 18188 10494 4039 2641 10688 1415 13708 22270 13200 13053 8161 -2597 -4555
5972 -4555 -6172 -719 -7126 -25904 -31839 -28638 -25001 -4601 19227 16201 -846 -17119 -14625 -27235
5958 -27235 -32823 -28114 -16155 -19672 -14007 -7297 -2623 -4739 -8910 -7041 3499 11906 16427 13556
5944 13556 2553 -515 -10942 -5383 13103 -1807 -12252 -7170 -9825 -13420 -27019 -14126 7129
5931 7129 3250 18385 12352 1772 -4889 -5910 -12315 -18548 -31442 -24616 -13273 -2686 -7218 -7876
5917 -7876 -29419 -29520 -22333 -13746 -4601 -10460 5386 6613 9275 12549 21065 18535 15723 7088 -13072
5902 -13072 -8044 5373 23492 18483 5147 -850 -10835 7203 28700 24428 20943 10372 21517
5889 21517 29523 15555 1907 -3801 -4880 -12181 -2915 21889 24225 18325 15138 16996 22969 5755
5875E755j3919M332L686R76P221Q379j3305p498K172q07K245n849J718L401l90
5860a883N079j156J33P853j1736N918J1311l054P282J3658k0149j7197J668M523
5846B250j437l915J2978O85L676l164l20k694m278L83L877j0822j5050j2629J1482
5831a8978J572l134p893j91M533J7496J1432n963j4441j3708Q108R798J1416j4744
5817a4697j3660R293J5135J968o362K728M584O753j862j4625j738P976l205Q152
5803D40L192n943k303R165J7972o463j8347L154j0365j3886M803O615l004M616
5789a0354j262q535M016K0669J1109o83R780L770j6636j7713m336o96J65J2843
5775B137n001o28j1378N011J6232n720j4805j763J610R49m884J761L499J4374
$$ plain form
5875 5755 -8164 -3832 -146 830 8051 16430 3125 -4373 -2201 -3008 -763 -6612 -4894 -1493 -1883
5860 -1883 3196 2040 2173 10026 -1710 4208 15519 12465 19747 33405 13256 -3941 -2273 2250
5846 2250 813 -3102 9876 10561 14237 11073 10753 8059 3781 4164 8041 -2781 -17831 -30460 -18978
5831 -18978 -17406 -20540 -28433 -28624 -24091 -6595 4837 -1126 -15567 -29275 -21167 -11369 47 -14697
5817 -14697 -28357 -19064 -3929 -1961 -8323 -5595 -1011 5742 3880 -10745 -12483 -4507 -7712 440
5803 440 3632 -2311 -4614 4551 22523 16060 -2287 867 -9498 -23384 -18581 -11966 -14970 -10354
5789 -10354 -11616 -20151 -16135 4534 15643 14960 24740 28510 11874 -5839 -10175 -10871 -10706 2137
5775 2137 -2864 -3492 -14870 -9859 6373 653 -14152 -15915 -14305 -13356 -18240 -16479 -12980 1394
5761A394J9791r631j6281O491J5269N027L309o899j5862L73M781p656q253M847
5747c300o289m921J1155j0116L818J3882P606k1067k0527j4747j369Q973O722
5734c0180J1370J6925L795k426m869n763k640J0926J4514l956k1857j2073L900
5721b2334P371N936M968O885n725K931Q03K564K830k601O622o214J0055l375J1415
5706B2131k83q388j1514p166k7984R518J8435k805l535l568K341L626J3551R866
5692A4225k519j6982j2238n328j982J3069J6383P0j4692p90K2901J0344p043n805
5678I613R471J1535j8934K993J5088n70k204j0390l546j2936M332K959P877J426
5664A6714k989r202L484M009n679m645q715j120l489J611Q707o494n564O485J183
$$ plain form
5761 1394 21185 11554 -4727 1764 17033 22060 25369 18470 2608 2981 7762 106 -8147 -3300
5747 -3300 -9589 -14510 -3355 -13471 -9653 4229 11835 -9232 -29759 -44506 -45875 -36902 -30180
5734 -30180 -18810 -1885 1910 -516 -5385 -11148 -13788 -2862 11652 7696 -14161 -26234 -22334
5721 -22334 -14963 -9027 -4059 2826 -2899 32 835 3399 6229 3628 10250 4036 14091 10716 22131
5706 22131 21848 13460 1946 -5220 -33204 -23686 -5251 -8056 -11591 -15159 -12818 -9192 4359 14225
5692 14225 11706 -5276 -17514 -22842 -24824 -11755 4628 4698 -9994 -10784 12117 22461 15418 9613
5678 9613 19084 30619 11685 14678 29766 29196 26992 16602 13056 120 4452 7411 15288 16714
5664 16714 13725 4523 8007 12016 6337 1692 -7023 -8143 -11632 -10021 -1314 -7808 -13372 -6887 -5704
5649e704P434M328j4725j8994J2064R555N213Q824q066k980k618J7051m627r628
5635b873q849j1162J0443p99p385r108M559J5012J7818P426q230j39j494P773
5621A2992m023r148P72J0309r114p102p035o041k479L007Q254p65l011K3882P204
5606A7702r440k464P979P607q039j1380J733P488n518j03L383L634m892l99J87
5591G478j2697M210P063p79O633N125r057p976L396r639p924J2886M790o081m204
5576f776R921O005o777m192M46O838m34p165j1380R882K585q580K46j2866P272
5561a4975K1414M373n102K16M91J0580P902j2173j1545o39R46K0091Q113P114
5547C6806j5921p333j1169r304Q244o6Q902J4963o731L476j0228n280L568K100
$$ plain form
5649 -5704 1730 6058 -8667 -27661 -15597 -6042 -829 7995 -71 -3051 -5669 11382 6755 -2873
5635 -2873 -11722 -22884 -12441 -13240 -20625 -29733 -25174 -10162 7656 15082 6852 6713 5219 12992
5621 12992 8969 -179 593 10902 1788 -5314 -12349 -18390 -20869 -17862 -9608 -10373 -13384 10498 17702
5606 17702 8262 5798 13777 21384 13345 1965 3698 11186 5668 5565 8948 12582 7690 7291 7478
5591 7478 -5219 -1009 6054 5275 11908 17033 7976 0 3396 -6243 -14167 -1281 3509 -2572 -6776
5576 -6776 3145 9150 2373 -1819 -1373 5465 5031 -2134 -13514 -3632 -1047 -9627 -9381 -22247 -14975
5561 -14975 6439 10812 5710 5926 6417 16997 24899 12726 1181 542 1488 21579 29692 36806
5547 36806 20885 13552 2383 -6921 1323 1257 10159 25122 18391 21867 11639 6359 9927 12027
5533A2027K035r680l720q018l037l32j779P608n694k6907P643J8865R748O954
5519E713O33L604R284r248n108L12J137j110q118p452Q55l070J076J359M787J4474
5503I128l445O795P737K765j784j3431R175J513k2786k5586l946k547J5165J0846
5489a0401N453L819q971j171J3895K2164K621k6271J649J5o716Q291n454o966
5475h043J3656N42J674j3176j300N911k111p928j4322o215P851K0681Q225K147
5461G592J9563J0405R308m82q992k0622j0930M62o709n96m765k483J6704m756
5447C699N409Q98j5796K685L338L464m834J0783j3849j169L929J7978k702n801
5433H032j3090K2R970P342p505j2641j4033P519J9977n002k501J31K025M041q121
$$ plain form
5533 12027 14062 4382 662 -7356 -10393 -10725 -12504 -4896 -10590 -37497 -29854 -10989 -1241 5713
5519 5713 6346 9950 19234 9986 4878 5190 6327 5217 -2901 -10353 -9498 -12568 -11492 -10133 -5346 9128
5503 9128 5683 12478 20215 22980 21196 7765 16940 18453 -4333 -29919 -33865 -36412 -21247 -10401
5489 -10401 -4948 -1129 -10100 -11271 2624 24788 27409 1138 2787 2802 -3914 4377 -1077 -8043
5475 -8043 5613 6155 7829 -5347 -6647 -736 -2847 -10775 -25097 -31312 -23461 -2780 5445 7592
5461 7592 27155 37560 46868 46386 37394 16772 5842 6304 -405 -1001 -5766 -8249 8455 3699
5447 3699 9108 10006 -5790 -3105 233 3697 -1137 9646 -4203 -5372 -1443 16535 13833 8032
5433 8032 -5058 -5036 4934 12276 4771 -7870 -21903 -14384 5593 591 -1910 -1779 246 4287 -3834
5418c834q538K434J634P545K251N340j1288j8426L098J2989M145L779m57K681
5404C353m020m355R181P416m566j1886J3052R992j1573j802p414q712M265J936
5390e133R387J1219p908p529j206k811L590j3714O769J775n803N315O545j099
5376f03K586q289j9564m419P917l848J2979J9127r421n318j1565j2547K2617J6314
5362E966K217r952l998O16p95r309K557N637l12Q443l658K70o551o628n680k093
5346b3270j1738L602J8098J3655o30J827q10k2315q557n50J2381J0721J4662j0283
5332c207p978j677J3114j454l475K808k115j4109J337K674J4391J5767j7688k0684
5318b2296j3821L329M613l02J4759J0239j1578k067K229l681o338J3641K3380
$$ plain form
5418 -3834 -12372 -9938 -8304 -759 1492 6832 -4456 -22882 -19784 -6795 -2650 1129 672 3353
5404 3353 -667 -5022 4159 11575 7009 -4877 8175 18167 6594 4792 -2622 -11334 -7069 -5133
5390 -5133 4254 15473 7565 36 -1170 -3981 -391 -14105 -7336 -5561 -11364 -6049 496 -603
5376 -603 1983 -6306 -25870 -30289 -22372 -26220 -13241 5886 -3535 -8853 -20418 -32965 -10348 5966
5362 5966 8183 -1769 -5767 -5151 -5946 -15255 -12698 -7061 -7373 1070 -2588 -2318 -8869 -15497 -21177 -23270
5346 -23270 -35008 -31406 -13308 347 -283 1544 734 -21581 -30138 -30688 -18307 -7586 7076 -3207
5332 -3207 -11185 -12862 252 -1202 -4677 -1869 -3984 -18093 -16756 -14082 309 16076 -1612 -22296
5318 -22296 -36117 -32788 -28175 -28477 -13718 -3479 -15057 -17124 -14895 -18576 -24914 -11273 12107
5305A2107k068j7528K738J950l973J7178p315K31m05N181n143j0471P700k531
5291b349O706J2917K88k51j6008k422M085N880m135p24r181q971J7939O944J4151
5276B4869m327K571j2140r268O46q612l820J7387r210p679L527J5558N062J259
5262A5823l81k7985j8409N338M335J3771J3895J681J286j8074q949l54J8457Q843
5248I277l44k773O850L85J2989M81j1952j9117j796P293m26j932l556o949R314
5233b256J9064O503Q023j2094k0800Q612J2380r28j4808j4331M82N565k355N549
5219a394l681J071J3041J1319M057j751o571j1923o383J446m462J453j1496J2259
5205c015P851L256o617q033k1827K377O300j768j7048K1783J3709l600j5390O550
$$ plain form
5305 12107 10039 -7489 -4751 -2801 -6774 10404 3089 3320 2915 8096 2953 -7518 182 -2349
5291 -2349 4357 17274 17562 17311 1303 -1119 2966 8846 4711 3987 -5194 -14165 3774 10718 24869
5276 24869 20542 23113 10973 1705 2351 -6261 -10081 7306 -1904 -9583 -6056 9502 14564 15823
5262 15823 15442 -12543 -30952 -25614 -21279 -7508 6387 8068 9354 -8720 -17669 -18023 434 9277
5248 9277 8933 6160 13010 13395 26384 26865 14913 -4204 -6000 1293 867 -1065 -4621 -11570 -2256
5233 -2256 16808 23311 31334 19240 -1560 7052 19432 18504 3696 -10635 -10153 -4588 -6943 -1394
5219 -1394 -5075 -4004 9037 20356 24413 22662 16091 4168 -2215 -769 -5231 -3778 -15274 -3015
5205 -3015 4836 8092 1475 -6558 -28385 -26008 -19708 -21476 -38524 -16741 -3032 -6632 -22022 -15472
5191a5472J7248J816K954M027J193o889j4694j5572n829J4216K1310o04M666l335
5177E035r583N77M401P572o675n863M817q65j9173P662O868o47j501J0871n801
5162b305P907P85j362l011l737r676n570J3758L900O528p599m48l738O386P723
5147I541K489K440o234r543M780O25j2088k3448O40J6117Q344Q982j022L505p642
5132b514q074K372p771q568j513k109R652p041p402K529R021Q822K0236L848O873
5117A8361L863j2358k499k372k1325K646J3049O333M072l428Q835l461j6048m911
5103i243J169j970l408Q72K0741J8818r270k6124r59Q152n895p405K5968K4845
5089C6291k247k3979j8488q513r905P838J9954J4765j785n029K062J0244j362
$$ plain form
5191 -15472 1776 3592 6546 10573 11766 4877 -9817 -25389 -31218 -17002 4308 3704 8370 5035
5177 5035 -4548 -3971 430 8002 1327 -4536 281 -584 -19757 -12095 -5227 -5874 -7375 3496 -2305
5162 -2305 5602 6387 5025 2014 -1723 -11399 -16969 -3211 689 7217 -382 -830 -4568 1818 9541
5147 9541 12030 14470 8236 -1307 3473 4098 -7990 -31438 -30798 -14681 -6337 2645 1623 5128 -2514
5132 -2514 -10588 -8216 -15987 -24555 -26068 -28177 -18525 -25566 -32968 -30439 -21418 -12596 7640 11488 18361
5117 18361 22224 9866 7367 4995 -16330 -13684 -635 5698 9770 6342 15177 11716 -4332 -9243
5103 -9243 -8074 -10044 -13452 -12580 8161 26979 17709 -8415 -9374 -1222 -7117 -14522 11446 36291
5089 36291 34044 10065 -8423 -16936 -26841 -19003 951 15716 13931 8902 10964 21208 19846
5076A9846k0425l830K1029M663l508r990Q928K441n098k171P97O821j1874j2165
5062d536P373n916q982K173K8097o688j7186k654r204j406O467j5156m786J0728
5048b1676J352p005R240K2616o604j2683j0967L970L0160J4803j1407j4313K471
5035d3K30j0017l808J0739k61j0963l690J6921R698j670l453m537O461o874P633
5020F366K128K525J830o213J3854O498p08p207j8092J686M287k857j3232L75K0473
5005A1713J6641k802j5386j9071p39N855n97M731J6620J7156j2283r980j3431
4992a573N10J4952q448k234q283k608j1745p884Q626K7078K857k627j4793n956
4978a2128K408J6674j102p369J148J37m375k2161o207l431J4419J6111k513n911
$$ plain form
5076 19846 -579 -4409 16620 21283 17775 7785 16713 19154 14056 11885 12682 19503 7629 -4536
5062 -4536 2837 -3079 -12061 -9888 18209 11521 -5665 -8319 -17523 -18929 -12462 -27618 -32404 -21676
5048 -21676 -20324 -27329 -18089 4527 -2077 -14760 -25727 -21757 8403 23206 11799 -2514 -43
5035 -43 187 -9830 -13638 -2899 -3160 -14123 -17813 -892 8806 7136 3683 -854 5607 -1267 6366
5020 6366 8494 11019 12849 6636 20490 26988 26280 19073 981 2667 6954 4097 -9135 -8760 11713
5005 11713 28354 25552 10166 -8905 -9644 -3789 -4386 345 16965 34121 21838 11858 -1573
4992 -1573 -1063 13889 5441 3207 -5076 -7684 -19429 -27313 -18687 8391 11248 8621 -6172 -12128
4978 -12128 -9720 6954 5852 -1517 -369 -232 -4607 -26768 -32975 -36406 -21987 -5876 -8389 -14300
4964a4300R14Q459M143J7429J9125o196l440j3267j3173p989j184R395p727j2923
4950b0734o504J1651N104j0496P267j2337j2434J811N690Q490J4639J0349q877
4937f381R702j0775j6575L780J6691J7661N638j44j6658j8476K195J3125O228
4924F011q081j3533j1783L310K309K0654N70j0750o791K060J514L816P374r912
4910a3232N053O992k659q617J6337J1825j099j374q646l109l370J710r091K715
4896f565K935n299n881P529R477J788m23p112o951J638N466j0997k135Q181N048
4881c301K551n830J2052n091j015R919k54L451o384l63j0750n353q467R492J1296
4866A953J1413j230q708n753j1409k751l965J0493J6803n741k496j448r24L486
$$ plain form
4964 -14300 -13386 -4927 -784 16645 35770 29574 26134 12867 -306 -8295 -9479 -84 -7811 -20734
4950 -20734 -27238 -15587 -10483 -20979 -13712 -26049 -38483 -36672 -30982 -22492 -7853 2496 -6381
4937 -6381 3321 -7454 -24029 -20249 -3558 14103 19741 19597 2939 -15537 -13342 -217 6011
4924 6011 -2070 -15603 -27386 -24076 -21767 -1113 -543 -11293 -18084 -16024 -14510 -10694 -3320 -13232
4910 -13232 -8179 -1187 -3846 -12463 3874 15699 14600 13226 4580 1471 -1899 -189 -9280 -6565
4896 -6565 -3630 -8929 -14810 -7281 2196 3984 3561 -3551 -10502 -8864 -3398 -14395 -16530 -8349 -3301
4881 -3301 -750 -6580 5472 381 -634 9285 9031 12482 6098 5735 -5015 -10368 -18835 -9343 1953
4866 1953 13366 12136 3428 -2325 -13734 -16485 -20450 -9957 6846 1105 -1391 -2839 -3763 -277
4852b77J066j5942p910j293J1140P224k879l127n44J1769J1433j4288q662j67
4838a2457p071J409j608L283J942J0774P939j289r866N610q59j275Q419q51M895
4823H995m621J112j5698k763J0151p861k967o249J6887P239K234J6187p033r323
4809F290m006p16m112j020m398M055n738j0816M492J0430K340j0609k062J302
4795a4568K687Q240J2409l039o225R752J0867m302l454p56K914j5013k254K99
4781b443K652Q326J8416r728j5285r538O336n757n005J6326n251o728O407n56
4767a828L7n051n330j6278j36J6254M973K569k2025k3725R546J7380J3955M272
4753e387j4334m39l042m502N254O760P371J3822O284Q385q026r735M026J29q037
$$ plain form
4852 -277 789 -15153 -23063 -24356 -13216 -5992 -8871 -11998 -12542 -773 10660 -3628 -12290 -12457
4838 -12457 -19528 -18119 -19727 -16444 -14502 -3728 4211 2922 -6944 -1334 -2193 -3468 4951 4100 8995
4823 8995 4374 5486 -10212 -12975 -2824 -10685 -13652 -19901 -3014 4225 6459 22646 15613 6290
4809 6290 2284 1568 -2544 -3564 -7962 -3907 -9645 -20461 -15969 -5539 -3199 -13808 -15870 -14568
4795 -14568 -11881 -3641 8768 5729 -496 9256 20123 15821 12367 11611 14525 -488 -2742 -2443
4781 -2443 209 8535 26951 17223 1938 -7600 -1264 -7021 -12026 4300 -951 -7679 -1272 -1828
4767 -1828 -1791 -6842 -12172 -28450 -28586 -12332 -7359 -4790 -26815 -50540 -40994 -23614 -9659 -5387
4753 -5387 -19721 -20160 -23202 -27704 -22450 -15690 -8319 5503 11787 20172 12146 2411 6437 6566 -1471
4738a471P777Q644j889L855O594l796r959n789r363J1725N398r002o531J6812
4724A3005j7393o697Q367K581L826M851J1505M471P99j0652J1660j0408j9016
4711c101R825l04p688J3878J1815o176j1617L448m552j6969r008Q146O075n604
4697a1832R386N907j375m198j091L971l650q187j793N150Q459M174j3665k883
4683a1627K202J763N081J1313J3344j4550q872Q885k394p79p789J1702J1010n613
4669A3676q872j0867P424M487o63M331j2974J122K1080o36P24m029j2699j1131
4655i027J2162j4775q114M360J6500R346K970q284J659j219o232J945J5172L486
4641A9949N166j4257o963n33n964L434j187p852P575K192J0938l783K492k2064
$$ plain form
4738 -1471 6306 14950 13061 16916 23510 19714 9755 3966 -5397 6328 11726 2724 -3807 13005
4724 13005 -4388 -11085 -2718 -137 3689 8540 20045 24516 25315 14663 26323 15915 -3101
4711 -3101 6724 6420 -1268 12610 24425 18249 6632 10080 5528 -11441 -20449 -12303 -6228 -11832
4697 -11832 -2446 3461 2086 -2112 -3203 768 -2882 -11069 -12862 -7712 747 4921 -8744 -11627
4683 -11627 -9425 -7662 -2581 8732 22076 7526 -1346 7539 5145 4366 -3423 8279 19289 13676
4669 13676 4804 -6063 1361 5848 5185 9516 -3458 -2336 18744 18108 18832 14803 2104 -9027
4655 -9027 3135 -11640 -19754 -15394 1106 10452 13422 5138 6797 5578 -654 1291 16463 19949
4641 19949 25115 10858 3895 3362 -2602 832 -355 -8207 -632 1560 12498 8715 11207 -10857
4627a0857k941J6848K359r358m108P665R640O661j64l965j3970N399L215o676
4613b52J8930N530K681m810q572l814k135m864r413j550o226K365k062R493m538
4598i237m56q964l443r36K840P243l515M008k634M043J3174J744j3771J061J7307
4583H464k555j9226j1097Q671J9882Q292o493o420p038l496J399P846o126o880
4569a4777J1532O108p94R473k311Q631Q42j1102j1838J13j811J3894N549Q455
4555B1964L170j5657j4298L648l696j0122q07J2210M592p809o622L125k963m027
4541a7292J6440J0086l222l101m758j989Q405J6081K331L681l182r360o452o714
4527I54o793j4922K125R97O393Q875O548q840o876L093P545Q012r194q601m369
$$ plain form
4627 -10857 -13798 3050 5409 -3949 -8057 -392 9248 15909 15745 11780 -2190 3209 6424 -252
4613 -252 18678 24208 26889 22079 13507 9693 7558 2694 -6719 -8269 -14495 -12130 -14192 -4699 -9237
4598 -9237 -9693 -18657 -22100 -23036 -20196 -12953 -16468 -12460 -15094 -11051 2123 3867 -9904 -8843 8464
4583 8464 5909 -13317 -24414 -15743 4139 12431 5938 -482 -7520 -11016 -9617 -1771 -7897 -14777
4569 -14777 -3245 2863 2069 11542 9231 17862 18704 7602 -4236 -4123 -5934 7960 13509 21964
4555 21964 25134 9477 -4821 -1173 -4869 -14991 -15798 -3588 1004 -6805 -13427 -10302 -13265 -17292
4541 -17292 -852 9234 6012 2911 -1847 -3836 4569 20650 22981 26662 23480 14120 7668 954
4527 954 -5839 -20761 -18636 -17639 -11246 -2371 4177 -4663 -11539 -8446 -901 7111 -2083 -10684 -15053
4512a5053R764m055p963K438K902j6789q078J8397J0522r784q41R443K2097j767
4498A1233J0549Q27m1644q333M496q45O436J4907M728j4N313O237j3308j024J0406
4483I964p351m396L735P641r846r110R482J0695j2493k047J3792j0208p073m700
4469a1915q16k30L597R587J520J917j1100j2269j668K5695J0284r244m146k421
4455a209K908q210K142J9464J929q107j4608j1200p710k86j2561J1387M709J1905
4441i447O687P224n644K861J0351N404m893m744M995q04n318j0758J6783L106
4427A5803N271n865L215l032j1145j2502j0579q987J651M753N190Q277J3038J04
4413E192o680M452l279o807j5200J0087J2790q067L53p740q327o285J5098J183
$$ plain form
4512 -15053 -5289 -9344 -17307 -14869 -11967 -28756 -36834 -18437 -7915 -17699 -18540 -9097 13000 11233
4498 11233 21782 22609 -19035 -27368 -22872 -23717 -17281 -2374 2354 2340 7653 13890 582 -442 9964
4483 9964 2613 -1783 1952 9593 -253 -9363 119 10814 -1679 -3726 10066 -142 -7215 -11915
4469 -11915 -12731 -12961 -9364 223 1743 3660 -7440 -19709 -21377 4318 14602 5358 1212 -1209
4455 -1209 1699 -6511 -4369 15095 17024 8917 -5691 -16891 -24601 -24887 -37448 -26061 -21352 -9447
4441 -9447 -2760 4464 -1180 1681 12032 17436 12543 7799 12794 11990 6672 -4086 12697 15803
4427 15803 21074 15209 18424 15392 4247 -8255 -18834 -27821 -26170 -21417 -16227 -7950 5088 5192
4413 5192 -1488 2964 -315 -7122 -22322 -12235 555 -7512 -7159 -14899 -23226 -29511 -14413 -13230
4399a3230P695P218M299m624j381M588m290o934Q518o084j9053j2815q840J8070
4385b6863J4070k81P579Q972j3252P691J8306m57o666N094N260j4923q679P602
4371C453J1787n2r419j78L183J971k88j2387R033K911r925K467N056m773M226
4356G065q515k1588J797J1639K0675J0318n300r084L768l581j195l51J2573k882
4342A5339k0504o026M076R537p781J76P588O4j4850J492M855Q24j4130R58N788
4327a2594J4177J249k365n014n725k164K479l195r074p052L4615J0585j1655j8458
4313a4191j8268n475K109J1540J5500J0742N84k359K290l98J4217J665k3978o168
4299a2190J3004J2004j7783M991p47M901M566r005j4423O445J97p590q730N202
$$ plain form
4399 -13230 -5535 1683 5982 1358 -23 4565 275 -6659 1859 -4225 -23278 -36093 -44933 -26863
4385 -26863 -12793 -13074 -5495 3477 -9775 -2084 16222 15765 9099 14193 19453 4530 -4149 3453
4371 3453 15240 15188 5769 5591 8774 10745 10457 -1930 7103 10014 89 2556 7612 2839 7065
4356 7065 -1450 -23038 -21241 -9602 11073 21391 16091 7007 10775 7194 5999 5648 18221 15339
4342 15339 -5165 -11191 -7115 2422 -5359 -5183 2405 2469 -12381 -10889 -6034 -5210 -19340 -18382 -12594
4327 -12594 1583 2832 467 -4547 -10272 -12436 -9957 -13152 -22226 -29278 5337 15922 4267 -14191
4313 -14191 -32459 -37934 -35825 -24285 -8785 1957 2541 182 2472 2074 16291 17956 -6022 -12190
4299 -12190 814 12818 -4965 26 -721 4180 8746 -259 -14682 -8237 -8040 -15630 -24360 -19158
4285a9158K7106R877R049j8766j1179j243J0661l561o739K424N608o812m577K4692
4271A7382J0741k728j1j4994j8200n285P518N555o839k228l853Q28K705m591l313
4256a7313L561K3838J7149l63r926n785k3014l96R252J2252Q658o706j1302K512
4242B417q460j734j480J6509j2968o349j081L887P164j663J225n654N28k1475
4228b9134j1774J7097K3898J8264M041p508j3794j5545J42J1097m425j0221P904
4215i958J0441j6274q777J3946J4900m870o122J3803n385n650r834j4707R136
4202a9351P522J0737J0355k884J666l890r291l286j0760P476K1942p046j4963
4189a1773k2700j7315J6726P038O737N269K278k194n765j90Q781J3491M174p366
$$ plain form
4285 -19158 7948 17825 26874 8108 -3071 -4314 6347 2786 -3953 -1529 4079 -2733 -7310 17382
4271 17382 28123 25395 25384 10390 -7810 -13095 -5577 -22 -6861 -9089 -12942 -12114 -9409 -14000 -17313
4256 -17313 -13752 10086 27235 26872 16946 11161 -11853 -12249 -2997 9255 17913 11207 -95 2417
4242 2417 -6043 -7777 -9257 7252 -5716 -12065 -13146 -9259 -2095 -3758 -2533 -8187 -7659 -29134
4228 -29134 -40908 -23811 87 18351 22392 14884 1090 -14455 -14313 -3216 -7641 -17862 -9958
4215 -9958 483 -15791 -24568 -10622 4278 -592 -6714 7089 1704 -3946 -13780 -28487 -19351
4202 -19351 -11829 -1092 9263 6379 8045 4155 -5136 -8422 -19182 -11706 10236 3190 -11773
4189 -11773 -34473 -51788 -35062 -28024 -21287 -16018 -13740 -15934 -21699 -21889 -13108 383 4557 -2809
4175b809N079Q363K640l979j382J1305K899J6657J5031k5001k7368o163j199N223
4161g04N340o017J469j2027m402L061K034K1922Q620M704j2759J0008r94q959
4147A1296J883l814r330K246K3256N608n655k0643p70o380r999j5996J0143J1216
4133f939k779k734P542O552m445n838k826l407P35p647L094R772J1089q522j1323
4118a7676K618m796l912J1413R396j043L356P291Q626l78O978r888j3454N141
4104C672P975n387o098J591N411O950n058k1822P068N217J0025L056j254o59N602
4089A6289M853p809j5954m511L871j5725m344J2791J1389o351L706J2706j60N082
4075A5833M532k480q677q240l167N950M113k021o354M301K838m105K762K640J846
$$ plain form
4175 -2809 2270 10633 13273 9294 7912 19217 22116 38773 53804 28803 1435 -4728 -5927 -704
4161 -704 4636 -1381 88 -11939 -16341 -13280 -11246 10676 19296 24000 11241 21249 20255 11296
4147 11296 13179 9365 35 2281 25537 31145 25490 4847 4077 -2303 -12302 -28298 -18155 -6939
4133 -6939 -9718 -12452 -4910 1642 -2803 -8641 -11467 -14874 -14139 -21786 -18692 -8920 2169 -6353 -17676
4118 -17676 -15058 -19854 -23766 -12353 -2957 -4000 -644 6647 15273 14895 21873 11985 -1469 3672
4104 3672 11647 6260 162 1753 7164 14114 9056 -12766 -5698 -481 9544 12600 11346 10687 16289
4089 16289 21142 13333 -2621 -7132 -3261 -18986 -23330 -10539 850 -5501 -1795 10911 10751 15833
4075 15833 20365 17885 9208 968 -2199 3751 7864 5843 -511 3790 6628 2523 5285 7925 9771
4060I771k282n911n296m727P367q195N36Q754p28J935R859J3453l482p13Q164
4045B8505J1755j1786j3891k0574k994J3646L397j8089j8283j3656R970L1649
4033c51J8890j6502j3612P221M329o63R789j827N898j575q460L078J6406j949
4019B0672k220J587k734j0756J0631P569j1768j0542L737K933O310j7752j3042
4006a5375Q463L518Q850m061K426J4337j1726j3027J7590J484j2833n475p366
3993a3195J0046j0623j4412R186K4405m30j7129o198J0046M622K747m684o934
3980a2553q438J5181q274o069o17J2893M538L441o258M188o438j3373m840o565
3966c3184j015R150K4795O72k943j2325q890N386J1701P644n02o128j9006j314
$$ plain form
4060 9771 7489 1578 -3718 -8445 -1078 -9273 -8737 17 -711 1224 11083 24536 21054 20341 28505
4045 28505 40260 28474 14583 -5991 -8985 4661 8058 -10031 -28314 -41970 -32000 -351
4033 -351 18539 2037 -11575 -4354 -25 -688 9101 7274 13172 11597 3137 6215 22621 20672
4019 20672 18452 20039 17305 6549 17180 24749 12981 2439 6176 9109 15419 -2333 -15375
4006 -15375 -6912 -3394 5456 1395 3821 18158 6432 -6595 10995 12479 -354 -5829 -13195
3993 -13195 -3149 -13772 -28184 -18998 5407 4977 -12152 -18350 -8304 -3682 -935 -5619 -12553
3980 -12553 -20991 -5810 -14084 -20153 -20770 -7877 -3339 102 -6156 -1968 -8406 -21779 -26619 -33184
3966 -33184 -34199 -25049 -254 418 -2525 -14850 -23740 -18354 -6653 991 489 -5639 -24645 -25959
3952b5959J2281K534m469q302L129R18P120N017O427k442J3266p212j4192k434
3938a4318O820Q22R168j0635q738p964J853J339J3242k75n28j3749J4186K2477
3924A3700J09j8549J26m613k2646M281J4605m96J5086m936p940K397J990K072
3910d814j350n260r678L0402m385n936l836j4868q248J7814L0837n509j6601q200
3896i632k083n747R498j4155j161J2925J1567l313J294q936p711m421J2223R473
3882a79j2089q691j058P163k403Q492O078k401Q600P000j13j0671R482J029j278
3867H961J0301k752j188j851k741J837k0024j5861j622J2121P623J3943L816n824
3853F739k354l763J8169J7034K79m711j1200j2991J1023J6069m11n344J495K408
$$ plain form
3952 -25959 -13678 -11144 -15613 -23915 -20786 -19868 -12748 -7731 -1304 -3746 9520 2308 -11884 -14318
3938 -14318 -7498 -6676 2492 -8143 -16881 -24845 -22992 -21653 -8411 -8686 -9214 -22963 -8777 13700
3924 13700 13809 -4740 -4614 -9227 -31873 -27592 -12987 -13483 1603 -3333 -11273 -8876 -6886 -4814
3910 -4814 -6164 -11424 -21102 9300 4915 -1021 -4857 -19725 -27973 -10159 20678 15169 -1432 -9632
3896 -9632 -11715 -17462 -7964 -22119 -23280 -10355 1212 -2101 -807 -9743 -17454 -21875 -9652 -179
3882 -179 -12268 -20959 -22017 -14854 -17257 -8765 -2687 -5088 3512 10512 10399 -272 9210 10239 8961
3867 8961 19262 16510 15322 13471 10730 12567 -7457 -23318 -24940 -12819 -5196 8747 12563 6739
3853 6739 4385 622 18791 35825 36104 31393 20193 7202 18225 34294 33883 28539 30034 32442
3839C2442j4884j9775p920J6616M818O731k519L020j205o95j5568j0665l742Q867
3825d479L39P109n645l590J1377j0205j1373M968p043Q047P20J5064P283o400
3811F172j3105l712J6371j0776q103J0514M610L111j216R929P365j2127j1333
3798b300N95J3832P074j7441k3253J3849Q410n661o88K077O630k773L295N660
3784I306k050J359K6195P4j6658m937L959P13r715l383O252n652o268o16Q839
3769G418K0708l437k0249j391o596m724M384J154Q29K90q65K357l364R63J2721
3754A0198o44q167J884k176L878k531m277j266P058P752k143L464k118J2126R318
3739C2356m473J407J341n155j151p646j2996j400k089n529L629Q093O486j8196
$$ plain form
3839 32442 17558 -2217 -10137 6479 11297 18028 15509 18529 17324 16629 1061 -9604 -13346 -4479
3825 -4479 -4140 2969 -2676 -6266 5111 -5094 -16467 -11499 -18542 -10495 -9775 5289 12572 6172
3811 6172 -6933 -10645 5726 -5050 -13153 -2639 1971 5082 3866 13795 21160 9033 -2300
3798 -2300 -1705 12127 19201 1760 -21493 -7644 766 -4895 -5583 -3506 3124 351 3646 9306
3784 9306 7256 8615 34810 34884 18226 13289 17248 17961 8246 4863 11115 5463 -805 -1421 7418
3769 7418 28126 24689 4440 3049 -3547 -8271 -3887 -2733 -1904 -1614 -2479 -122 -3486 -2523 10198
3754 10198 9554 1387 3271 1095 4973 2442 -1835 -3101 3957 11709 9566 13030 10912 23038 32356
3739 32356 27883 29290 30631 25476 24325 16679 3683 2283 194 -5335 -1706 6387 12873 -5323
3725e323k493J8637P019j2018o973Q42J4093K449Q982j5199j038k80K375O750
$$ plain form
3725 -5323 -7816 10821 17840 5822 -1151 -309 13784 16233 25215 10016 8978 8698 11073 17823
$$ [...]
##END NTUPLES=NMR SPECTRUM
##END=
