##TITLE=Analysis number 326184
Compound Code cc 61301
Book Reference 494/96
Project Code adrs
Chemist Name craigr
##JCAMPDX= 6.0         $$ Bruker NMR JCAMP-DX V2.0
##DATA TYPE= NMR SPECTRUM
##DATA CLASS= NTUPLES
##ORIGIN= Bruker BioSpin GmbH
##OWNER= nmr
$$ XWIN-NMR		Version 3.5
$$ Tue Jan 30 10:00:31 2007 GMT Standard Time (UT+0h)  MAYBRIDGE\nmr@NMR_250MHZ
##.OBSERVE FREQUENCY= 250.131544655141
##.OBSERVE NUCLEUS= ^1H
##.ACQUISITION MODE= SIMULTANEOUS (DQD)
##.ACQUISITION SCHEME= undefined
##.AVERAGES= 16
##.DIGITISER RES= 18
##SPECTROMETER/DATA SYSTEM= dpx250
##.PULSE SEQUENCE= zg30
##.SOLVENT NAME= DMSO
##.SHIFT REFERENCE= (INTERNAL, DMSO, 0, 16.522)
##AUDIT TRAIL= $$ (NUMBER, WHEN, WHO, WHERE, WHAT)
$$ ##TITLE= Audit trail, XWIN-NMR		Version 3.5
$$ ##JCAMPDX= 5.01
$$ ##ORIGIN= Bruker BioSpin GmbH
$$ ##OWNER= nmr
$$ C:\u/data/dgb/nmr/ADRS/2250/pdata/1/auditp.txt
$$ ##AUDIT TRAIL=  $$ (NUMBER, WHEN, WHO, WHERE, WHAT)
(   1,<2007-01-30 10:00:10.39 +000>,<MAYBRIDGE\nmr>,<NMR_250MHZ>,
      <created by zg, POWCHK disabled, PULCHK disabled
       configuration hash MD5:
       49 4B E0 1D 92 C2 6B 37 9F E6 65 BC 52 41 86 1D
       data hash MD5: 64K
       B8 24 7D F2 34 BB 3B 21 67 5C 00 0D F2 18 69 FC>)
(   2,<2007-01-30 10:00:22.50 +000>,<MAYBRIDGE\nmr>,<NMR_250MHZ>,
      <Start of raw data processing
       ef LB = 0.3 FT_mod = 6 PKNL = 1 SI = 32K 
       data hash MD5: 32K
       76 B7 C2 31 F7 53 2A CA 2A 00 6D 4C 30 B7 0B 15>)
(   3,<2007-01-30 10:00:24.87 +000>,<MAYBRIDGE\nmr>,<NMR_250MHZ>,
      <apk 
       data hash MD5: 32K
       D7 AB 9B 61 53 E9 F5 2A BB 01 34 A9 DD AC 24 01>)
(   4,<2007-01-30 10:00:25.58 +000>,<MAYBRIDGE\nmr>,<NMR_250MHZ>,
      <abs ABSG = 5 
       data hash MD5: 32K
       D4 7D A0 92 8A B3 14 1A 00 82 8F 53 9D 14 75 19>)
$$ ##END=
$$ 
$$ hash MD5
$$ 0A 2F F6 92 8D C7 5F 70 E4 C3 D5 18 05 FF D0 8E
##$RELAX= 
##$RELAX= 
##$RELAX= 
##$RELAX= 
##$RELAX= 
##$RELAX= 
##$RELAX= 
$$ Bruker specific parameters
$$ --------------------------
##$DU= <C:\u>
##$EXPNO= 2250
##$NAME= <ADRS>
##$PROCNO= 1
##$TYPE= <nmr>
##$USER= <dgb>
##$AMP= (0..31)
100 100 100 100 100 100 100 100 100 100 100 100 100 100 100 100 100 100 
100 100 100 100 100 100 100 100 100 100 100 100 100 100 
##$AQSEQ= 0
##$AQ_mod= 3
##$AUNM= <au_zg>
##$AUTOPOS= <31 >
##$BF1= 250.13
##$BF2= 250.13
##$BF3= 250.13
##$BF4= 250.13
##$BF5= 500.13
##$BF6= 500.13
##$BF7= 500.13
##$BF8= 500.13
##$BYTORDA= 1
##$CFDGTYP= 0
##$CFRGTYP= 5
##$CHEMSTR= <none>
##$CNST= (0..31)
1 1 145 1 1 1 1 1 1 1 1 1 1 1 1 1 1 1 1 1 1 1 1 1 1 1 1 1 1 1 1 1 
##$CPDPRG= <>
##$CPDPRG1= <>
##$CPDPRG2= <>
##$CPDPRG3= <>
##$CPDPRG4= <mlev>
##$CPDPRG5= <mlev>
##$CPDPRG6= <mlev>
##$CPDPRG7= <mlev>
##$CPDPRG8= <mlev>
##$CPDPRGB= <>
##$CPDPRGT= <>
##$D= (0..31)
0 1 0 0 0 0 0 0 0 0.06 0 0 0 0 0 0 0.0002 0 0 0 0 0 0 0 0 0 0 0 0 0 0 
0 
##$DATE= 1170151209
##$DBL= (0..7)
120 120 120 120 120 120 120 120 
##$DBP= (0..7)
150 150 150 150 150 150 150 150 
##$DBP07= 0
##$DBPNAM0= <>
##$DBPNAM1= <>
$$ [...]
##$SUBNAM7= <"">
##$SUBNAM8= <"">
##$SUBNAM9= <"">
##$SW= 20.6930455092707
##$SWIBOX= (0..15)
0 0 3 0 0 0 0 0 0 0 0 0 0 0 0 0 
##$SW_h= 5175.983436853
##$TD= 65536
##$TD0= 1
##$TE= 294.16
##$TE2= 300
##$TE3= 300
##$TEG= 300
##$TL= (0..7)
0 120 120 120 120 120 120 120 
##$TP= (0..7)
150 150 150 150 150 150 150 150 
##$TP07= 0
##$TPNAME0= <>
##$TPNAME1= <>
##$TPNAME2= <>
##$TPNAME3= <>
##$TPNAME4= <>
##$TPNAME5= <>
##$TPNAME6= <>
##$TPNAME7= <>
##$TPOAL= (0..7)
0.5 0.5 0.5 0.5 0.5 0.5 0.5 0.5 
##$TPOFFS= (0..7)
0 0 0 0 0 0 0 0 
##$TUNHIN= 0
##$TUNHOUT= 0
##$TUNXOUT= 0
##$USERA1= <user>
##$USERA2= <user>
##$USERA3= <user>
##$USERA4= <user>
##$USERA5= <user>
##$V9= 5
##$VALIST= <valist>
##$VCLIST= <CCCCCCCCCCCCCCC>
##$VD= 0
##$VDLIST= <DDDDDDDDDDDDDDD>
##$VPLIST= <PPPPPPPPPPPPPPP>
##$VTLIST= <TTTTTTTTTTTTTTT>
##$WBST= 1024
##$WBSW= 4
##$XGAIN= (0..3)
0 0 0 0 
##$XL= 0
##$YL= 0
##$YMAX_a= 279942
##$YMIN_a= -254854
##$ZGOPTNS= <>
##$ZL1= 120
##$ZL2= 120
##$ZL3= 120
##$ZL4= 120
##$ABSF1= 16.522
##$ABSF2= -4.171173
##$ABSG= 5
##$ABSL= 3
##$ALPHA= 0
##$AQORDER= 0
##$ASSFAC= 0
##$ASSFACI= 0
##$ASSFACX= 0
##$ASSWID= 0
##$AUNMP= <proc_1d>
##$AZFE= 0.1
##$AZFW= 0.1
##$BCFW= 0
##$BC_mod= 0
##$BYTORDP= 0
##$COROFFS= 0
##$CY= 12.5
##$DATMOD= 1
##$DC= 0
##$DFILT= <>
##$DTYPP= 0
##$F1P= 14.0000005364418
##$F2P= -0.99999901652339
##$FCOR= 0.5
##$FTSIZE= 32768
##$FT_mod= 6
##$GAMMA= 0
##$GB= 0
##$INTBC= 1
##$INTSCL= 1
##$ISEN= 128
##$LB= 0.3
##$LEV0= 0
##$LPBIN= 0
##$MAXI= 10000
##$MC2= 0
##$MEAN= 0
##$ME_mod= 0
##$MI= 0
##$NCOEF= 0
##$NC_proc= -4
##$NLEV= 6
##$NOISF1= 0
##$NOISF2= 0
##$NSP= 0
##$NTH_PI= 0
##$NZP= 0
##$OFFSET= 16.522
##$PC= 1
##$PHC0= 198.0204
##$PHC1= 52.07276
##$PH_mod= 1
##$PKNL= yes
##$PPARMOD= 0
##$PSCAL= 4
##$PSIGN= 0
##$REVERSE= no
##$SF= 250.13
##$SI= 32768
##$SIGF1= 0
##$SIGF2= 0
##$SINO= 400
##$SIOLD= 32768
##$SREGLST= <1H.DMSO>
##$SSB= 0
##$STSI= 32768
##$STSR= 0
##$SW_p= 5175.98343685301
##$SYMM= 0
##$S_DEV= 0
##$TDeff= 65536
##$TDoff= 0
##$TI= <Analysis number 999999
Compound Code 99
Book Reference 9
Project Code 9>
##$TILT= no
##$TM1= 0
##$TM2= 0
##$TOPLEV= 0
##$USERP1= <user>
##$USERP2= <user>
##$USERP3= <user>
##$USERP4= <user>
##$USERP5= <user>
##$WDW= 1
##$XDIM= 32768
##$YMAX_p= 457308041
##$YMIN_p= -6397812
$$ End of Bruker specific parameters
$$ ---------------------------------
##NTUPLES= NMR SPECTRUM
##VAR_NAME=  FREQUENCY,     SPECTRUM/REAL,   SPECTRUM/IMAG
##SYMBOL=    X,             R,               I
##VAR_TYPE=  INDEPENDENT,   DEPENDENT,       DEPENDENT
##VAR_FORM=  AFFN,          ASDF,            ASDF
##VAR_DIM=   32768,         32768,           32768
##UNITS=     HZ,            ARBITRARY UNITS, ARBITRARY UNITS
##FACTOR=    0.157963299565203, 1,           1
##FIRST=     4132.6476996994, 0,             0
##LAST=      -1043.33573715361, 0,           0
##MIN=       -1043.33573715361, -6397812,    0
##MAX=       4132.6476996994, 457308041,     0
$$ Real data points
##PAGE= N=1
##DATA TABLE= (X++(R..R)), XYDATA
$$ [...]
15739D614L816L5689k7957m3872o896M166k8112K4143l2869n3424L9828J3050
15727f7824j9830M52l0900L2542J4207n623N3154N9175j1367l6224o0024o2887
15715a35149l2373L2368M658O5124n273J4524N2961M6843k908n6686o4341j2947
15703i3199O2100L2122j8194l8570o8456j4339L5880j5441M2245J4152n5170o5063
15691a81933L1452J6602O8093l7175J2837L8265k0208L4975m3698j3768M8585
15680d5973J07258K8216r8898q5768l808J01639N5530k8778j9772l4037n2004
15669g6395L8065Q8556P07o7566j3563j414j7692L4622M0376n2729k3453j5451
15657f5937l7260K1293k2175N9735J9319j5880q822n8843J8048O5686K5429j7557
$$ y = [4614, 8430, 44119, 16162, -27710, -34606, -30440, -58552, -34409, -67278, -120702, -80874, -67824, -87654, -87202, -118102, -85560, -71353, -76976, -23822, 35353, 23986, -12238, -72262, -135149, -167522, -135154, -130496, -65372, -70645, -56121, -3160, 43683, 40775, -15911, -80252, -93199, -31099, 1023, -17171, -55741, -124197, -138536, -102656, -118097, -75852, -61700, -116870, -181933, -150481, -133879, -65786, -102961, -90124, -51859, -72067, -37092, -80790, -94558, -45973, 61285, 89501, -9397, -95165, -98973, 2666, 58196, 29418, 9646, -24391, -76395, -38330, 50226, 50933, -16633, -30196, -31610, -49302, -14680, 25696, -27033, -50486, -65937, -103197, -81904, -104079, -44344, -25025, -40905, -49727, -108570, -90522, -24836, 593, -16964]
15645a6964l532n3322j8251j75J216J7966N945J9734M5717p812J0324j0638l9816
15632d9608J9175K1310O261K8742p253o58N3567k1217r8246m7118N881K1333L7388
15619c0443m8364K4355p5945L114M1281M1052L4305l3714o3967k5467L5350O0723
15607c7720N7979l0901J1448J4326m6736l0594n9109M0894L3678m0281J0956J1850
15595f4210M081j5841n0208J8315L7121O8992O4115l6119q8253m076L8305p0827
15583i8605j9179J3056P7570O279M1944j5994M9324M6249j8041k3394j08286m7107
15571i6184Q608K2753P5860n0214o4645M9187J9879j4428o316Q617P373K6612
15559a2898J3408j5818m7590L1626l301K8333n8252Q666N830k1855N737k2075
$$ y = [-16964, -20496, -73818, -92069, -92244, -91028, -73062, -67117, -47383, -1666, -9478, 846, -9792, -49608, -30433, -9123, -2862, 25880, 18627, 17969, 71536, 50319, -47927, -95045, -89164, -67831, -30443, -78807, -54452, -130397, -127283, -86002, -44950, -10645, -44359, -108326, -133793, -98443, -37720, 20259, -10642, 806, 15132, -31604, -62198, -121307, -80413, -46735, -87016, -76060, -64210, -60129, -75970, -126178, -107863, -70742, -1750, 62365, 26246, -62007, -66083, -27778, -98605, -117784, -104728, -27158, -20879, 21065, 5071, 54395, 100644, 82603, 59209, -49077, -96184, -87576, -64823, 11037, -39177, -103822, -54635, -34756, -49184, -55500, -46883, -39510, -12898, 510, -15308, -62898, -31272, -34573, -6240, -64492, -55826, -49996, -71851, -66114, -88189]
15547h8189M3383J1853K729k769m2461n6463L0500N0918L0539L9960l8167k2825
15535d0992j8042j347k4486M7365J8574j48l8332l6335m5340L4560R235o931L080
15522i9139j6030o029K2807r008n730L1152j7138K2384O9401k8758k088J5617
15510b2559N8321K009j0128o391k6818k0659J8745r112L6983k1144l7979K6014
15498a2718N867q77n7372r369k6631j6727M5025P7886J884M2242J1794k9871m7252
15485a6119m2348N262L7824j4458m2057q3416L3478n84k5656K6628L3505j9764
15473a07705n2713Q8617Q1177l2358k5959L2043l8606j6335M6692L2616m4337
15462c6868K3629m7856K0864O2231O5926j1946m9332j8229M942j5845j3490k5371
$$ y = [-88189, -44806, -32953, -30224, -32993, -75454, -131917, -101417, -50499, -19960, 20000, -18167, -40992, -59034, -60381, -84867, -37502, -18928, -19076, -57408, -93743, -139083, -104523, -95288, -102219, -99139, -115169, -121198, -98391, -107399, -113129, -81977, -99115, -76731, -7330, -36088, -38176, -22559, 35762, 37771, 27643, 21252, -5566, -26225, -7480, -16592, 20391, -753, -38732, -12718, -6851, -7728, -65100, -74469, -101100, -117827, -72802, 5084, 6968, 49210, 61004, 31133, -16119, -58467, -53205, -15381, -29839, -71896, -155312, -121834, -122418, -148074, -121446, -87941, -107705, -160418, -71801, 9376, -22982, -48941, -16898, -55504, -71839, -25147, 7469, -36868, -13239, -61095, -40231, 22000, 87926, 75980, 26648, 8419, 13361, -2484, -15974, -41345]
15450d1345m9611P68l4050n2496N9806K5689M8926M9546m0253l2627p402j3950
15438h6999K6764j609k8786k1520J7787L9202M2952L4438j5851M0556N3105m0786
15426E9253j12306j6411J06280L3901k3296m0377k3790n4473o4235M7057J8994
15415f9403p097L77k7374J7717K3350P2404O9283k7720n6627m7720k8485j859
15403h3154m8801p9092P9794Q0059R61N9007j7352m0451k0225m758n522J4992
15391f4542L9132l6305K5414l878l486P0477K9842q778m5338N529l691k3193q0296
15378i9113R857M5583O7894n1877q5796M0939M6387j5662J0579k0076j9806P342
15366f3749n656L3198J2722j0086J6147l812L6739M752m4942m5517L4373j675
$$ y = [-41345, -90956, -90188, -124238, -176734, -116928, -91239, -42313, 7233, -33020, -65647, -73049, -86999, -60235, -61844, -90630, -112150, -94363, -55161, -12209, 22229, 6378, 46934, 100039, 59253, -53053, -69464, 36816, 70717, 47421, 7044, -16746, -71219, -135454, -88397, -69403, -76500, -76123, -103497, -85780, -62430, 9974, 79257, 51537, -5090, -52810, -81295, -83154, -131955, -211047, -131253, -51194, -50233, 8774, -8578, -49029, -69254, -74012, -79534, -64542, -25410, -61715, -36301, -40179, -43665, 26812, 56654, 47876, 2538, 8067, 4376, -18817, -99113, -89256, -43673, 24221, -27656, -113452, -72513, -26126, -41788, -31209, -51285, -71091, -63749, -69405, -36207, -23485, -33571, -17424, -21236, 15503, 20255, -24687, -70204, -35831, -37506]
15354c7506p1792l0594J0087k4551P2471Q0741J9550l7969m8863k324k8692j8280
15342a17722K9633P1809k0633j4763M6866L6696L0699j4504p6526j6049m0806
15331h5300K1942L1441j437K508J4812J6615m8451r717o6166j02352O1002N6979
15319a08124K5051J13113R5852o0402k8547o3090q3716M7010N6609J9672l6552
15308b3124n6571l6203J5546J6976K4241P608k4222q656K5881n0025j8355K3475
15296a03429M5776K81m3724R595N9745K9571P00R908N5520l3579m5740l7906l7406
15283i0688l0992q7699P4385J10452N9812r48n9830k7409N1676M8428n4884l9469
15271d7166M919j3345k7950q530O6937J4070L4599P047k1412O348q354j1243l2301
$$ y = [-37506, -109298, -139892, -129805, -154356, -81885, -1144, 18406, -19563, -68426, -70750, -99442, -117722, -88089, -16280, -36913, -51676, -4810, 31886, 62585, 48081, -28445, -44494, -85300, -63358, -31917, -33354, -30846, -16034, 581, -47870, -57587, -123753, -226105, -165103, -108124, -83073, 30040, 125892, 65490, 36943, -26147, -109863, -62853, -6244, 13428, -23124, -79695, -115898, -100352, -83376, -59135, -51527, -75749, -84405, -58524, -108549, -126904, -103429, -57653, -57372, -101096, -91501, -31756, -2185, -1485, 8423, 63943, 30364, -15376, -53282, -90688, -121680, -209379, -134994, -24542, 35270, 34322, -25508, -52917, -1241, 47187, -7697, -47166, -42247, -55592, -83542, -92072, -25135, -11065, 23534, 30581, 9169, 15517, 7163, -4080, -36381]
15258c6381k6593L7403J8692p0003n4291L8293j1536l2817o221J9394N90N066
15246a18404K8616Q2328M2866o6232J045J2916K4984K5512l2473o3363P714J8786
15234c5705m127k9336o4928R929P561r624O5022N4014N3021J2598p592l9964j8474
15221g605o1573K5830N7471l9471m9126o6488j0153M768q914l9789k2190L4154
15209a83086Q0965N1788M5055L8198l1234L5961K2482R371o2128J3107m938q3477
15197f7936l0148M5875K3587M762l4257l7774p3625K1281k3008R733P9947O0493
15185b1070J4185N3646J2195r6692o0129k1804N4353Q2067Q443M080k7765J8849
15173B0358M9611m5152q6626l4732J6135j7534k7076J0731K8629O126p304J5900
$$ y = [-36381, -62974, -25571, -6879, -76882, -131173, -92880, -104416, -137233, -143454, -124060, -123470, -118404, -89788, -7460, 35406, -30826, -29781, -16865, 8119, 33631, 1158, -62205, -54491, -35705, -39832, -69168, -134096, -124167, -116606, -126230, -61208, -7194, 45827, 58425, 50833, 10869, -7605, -69178, -43348, 14123, -25348, -74474, -140962, -151115, -146347, -155261, -195050, -217240, -183086, -102121, -50333, -5278, 32920, 1686, 37647, 60129, 69500, 7372, 20479, 15541, -67936, -98084, -52209, -28622, -23860, -58117, -95891, -169516, -148235, -171243, -161510, -81563, -21070, -6885, 46761, 58956, -37736, -97865, -119669, -65316, 16751, 25194, 29274, 1509, 20358, 69969, 24817, -61809, -96541, -80406, -97940, -125016, -114285, -85656, -79530, -86834, -70934]
15161g0934q1073o4698R4643O6046k8248L0428O3254l5695o91m1522l5653l1007
15149a35150J6282p306N005M858N9986J26526M9605q8622m4540J9331N87q241
15137a679L1957j9874k9109O845Q365l4409J1142q757j0015P8810N263r1441M4968
15124g934K7132K0172J001l6360m7567R959J0233K946j9514o7515J5301n32m1607
15111a34285o959L8052K5439J9488Q2354j8650l2752l7864n1038J9924L3136m0658
15099a03813j8773m447M0936O7751M629j0164m0172j6939Q487K2681P7888m9043
15087b0979J2092M0277k6172r9116j3928O7708K7950L9095k477J7493j7274q6866
15075f2197l9198k4652J01840K7705j8813l985J7679l9078o0874j7617k6862m340
$$ y = [-70934, -152007, -216705, -122062, -56016, -84264, -53836, 9418, -26277, -26968, -68490, -104143, -135150, -118868, -126174, -121169, -116311, -56325, 70201, 119806, 31184, -13356, 5975, 6562, -1679, 30278, 10404, -18705, -11860, -3495, -37904, -26762, -35519, -45534, 33276, 38539, -52902, -7934, 19198, 39370, 40371, 4011, -43556, -33597, -23364, -20418, -39932, -107447, -92146, -92678, -134285, -141244, -103192, -77753, -58265, 24089, 5439, -27313, -65177, -116215, -96291, -63155, -103813, -122586, -127033, -86097, -18346, -13717, -23881, -64053, -80992, -72505, -49824, 28064, -20979, -8887, 31390, 5218, -93898, -107826, -40118, -12168, 26927, 24450, 41943, 24669, -62197, -101395, -126047, -24207, 3498, -15315, -19300, -1621, -40699, -101573, -119190, -146052, -150392]
15063a50392P5245L5558n8164J6305L5771N083M0181J8678m4158J4940K1104n232
15051D919K1313j3394N655L9777j1732m6406q3084j2044k9979O5317R0793l19
15039C0816P159J2073l2364j2510p3830L8834O8360P097p2537M9585J11564k2421
15027A11826l5309l1065k8925k1021n348m4445O3038p378l4244p696j6575l232
15015f0374K0477j9176O0873K5765q3344o1192K113j434J187L0997K3372L3354
15003b7382L7974N2093k7677m0400J6985R792k7077l5120O9350K1643K2594j0316
14991F2459k9392l9837l0705L9619K0028N7386R956q4628m4046j2753k6703n118
14979h3734P864l632p710N7946L6766l5216r496L0806K8153l6921J1310P274n4008
$$ y = [-150392, -75147, -39589, -97753, -81448, -45677, -40594, -413, 18265, -25893, -10953, 10151, 4919, 26232, 12838, 18493, 58270, 46538, 132, -82952, -94996, -124975, -59658, 31135, 30816, 37975, 50048, 17684, 5174, -68656, -29822, 38538, 45635, -26902, 22683, 134247, 111826, 76517, 45452, 16527, -4494, -9842, -54287, 8751, 1373, -32871, -40567, -57142, -60374, -39897, -59073, 1800, 27565, -55779, -116971, -114858, -116292, -115105, -84108, -60736, -27382, 10592, 62685, 35008, -5392, 11593, 21385, -5692, -40812, 28538, 50181, 72775, 62459, 33067, -6770, -37475, 2144, 22172, 79558, 89514, 4886, -39160, -51913, -78616, -83734, -75870, -79502, -87212, -29266, 7500, -27716, -37212, -6406, 21747, -15174, -3864, 3410, -50598]
14966e0598L739J6658L746q6601j2551O8451L548R939P405M1924P7643J20878
14954B04181q2799j41715j5735l4790r455M1125J7999o717r099n1455l41L4810
14942e3991k6793J2830L3963k3642K9448q019n4307N6912K6912l6779J8798j4498
14930c9166M7393L5245K3861k9625k5335m1432J0955l4775J8339r495j0253k84
14918e4572J8449k8049M3152K5378j7238J0925Q232K2029M012l9338m9816P047
14906d9789M0070M9484o348m0584n1577k5330Q4375L7399k2727o1153m5301k686
14894i4167P7051J04427j7584m3556p0747L6025p7215O4935O1786j9036p823k8889
14882a4793R168n1575l6242j7496J874n078L6888L8711m3100j7393Q039J5113
$$ y = [-50598, -46859, -30201, -26455, -113056, -125607, -57156, -53608, -43669, -36264, 5660, 83303, 204181, 121382, -20333, -36068, -70858, -80313, -39188, -21189, -27906, -37005, -88460, -88801, -53991, -80784, -67954, -33991, -57633, -28185, -36204, -90511, -33599, -6687, -43466, -24668, -39166, 8227, 43472, 67333, 37708, 12373, -29059, -18104, -52879, -34540, -44035, -54288, -54572, -36123, -64172, -21020, 4358, -12880, -1955, 6277, 28306, 32318, -7020, -56836, -49789, -9719, 39765, 33417, -7167, -58744, -84074, 301, 37700, 14973, -46180, -91481, -94167, -17116, 87311, 69727, 26171, -44576, -8551, -85766, -20831, 40955, 21919, 14096, -14793, -5625, -57200, -93442, -110938, -109064, -114142, -77254, -38543, -81643, -99036, -90997, -75884]
14870g5884L2558L4355J8114m4029k1944M9362M1733o0348k2090K6424P0120l8923
14858I448L878J1245N7795J9318o6928m0306n2305k5402o1545M1226K9237n3592
14846a27931L3899k8754k1571K8325L4342N2241M7920M7549o9597k8385K0958
14835a1004m7239m0577k0221L9756K2171R63j9679l0848J2207K9696k0239j4826
14823i9840K8352M7002r1162j611K7480M059R5768J4552l751n4021j2126m691
14811d9989m7583k234k8533M3410M2089q8373j612L7782N0550K6715j0494N3949
14799B5677R573K1886p1163O104J5486o3376m711L3512j4471n390k1899K4212
14787d4560R5404j4037r9203J4812K0381l8244K578J1163J2120J9042M69K5285
$$ y = [-75884, -43326, -8971, 9143, -34886, -56830, -7468, 34265, -26083, -48173, -21749, 48371, 9448, 13326, 24571, 82366, 101684, 34756, -5550, -57855, -83257, -144802, -103576, -74339, -127931, -94032, -122786, -144357, -116032, -81690, -29449, 18471, 66020, -3577, -31962, -11004, -58243, -98820, -119041, -79285, -57114, -56151, -75830, -106678, -94471, -64775, -85014, -99840, -71488, -24486, -115648, -117259, -89779, -85720, 10048, 24600, 20849, -33172, -45298, -49989, -97572, -99806, -128339, -84929, -42840, -131213, -132825, -95043, -44493, -17778, -28272, 25677, 35250, 57136, -14027, -7923, 7563, -55813, -60524, -27012, -41483, -46873, -68772, -44560, 50844, 36807, -62396, -47584, -27203, -65447, -62869, -51706, -39586, -20544, -20075, 5210]
14775E210m3035k3397m71l2405p6642K3700Q3294M9156K1001K6377L3846k2933
14763D3701K4066J0430j7765p4078j6371j8734k4248M4970L2595k5276j0199L1515
14751F06M618l1036k144L5482J0285o2504o2030n3409O5277M1071M3634P4277
14739F4127j3847P425k9289k4739n018J8024K1078o5947j9572J402M8419Q4442
14727H6505k0942j12318l8932J7392k4147K2173K6242m8986J5282Q537Q1552m7453
14715c5095k2548k0869o7536R2557L4883m3115n2032N5334M8674L6304n9048m6733
14703g9224l3414j8601l8536K0709M3489J05174M4560k1449J0100N6151l0650
14692E8309l6735J3122P924o4306L6795O058J7514n8550p4354J7158O0968r876
$$ y = [5210, -37825, -61222, -61693, -94098, -170740, -147040, -63746, -14590, 6411, 32788, 66634, 43701, 67767, 78197, 60432, -13646, -30017, -48751, -72999, -28029, 4566, -20710, -30909, 606, 5224, -25812, -27956, 7526, 17811, -44693, -106723, -160132, -94855, -53784, -10150, 64127, 50280, 57705, 28416, 3677, -1341, 16683, 37761, -28186, -47758, -46356, 2063, 86505, 65563, -46755, -85687, -68295, -92442, -70269, -44027, -93013, -77731, -69194, 12358, -35095, -57643, -78512, -146048, -53491, -18608, -61723, -113755, -58421, -9747, 26557, -32491, -79224, -112638, -131239, -169775, -149066, -105577, -403, 44157, 22708, 32808, 88959, 58309, 21574, 34696, 42620, -21686, 15109, 21167, 38681, -19869, -94223, -77065, -16097, -25973]
14680b5973K7275Q9864j8164j04364j00572j1619L3263M3893j8227l8224Q7700
14669c5148O1408n5043m2469O843l8124O1970K0158M8345L666M0951r253J9245
14657H2549m6974m8054k0055j0062K8104O97l8976n3472L8553N158J5796N7321
14645A0585K5328K0678Q158n4221m8693M0910L4821J0860q478K0490K2953o1199
14633B2192j9453J9406J4027p626m3967k5222j9847n1399n030L029j8204K2849
14621a09245J0423j6738L1781L8413N0306k4026J5082l6198l3764j9310j29718
14610b22994j3768M4820K2153k7591K0776N8458m1325K6001J5383L1604j5964
14599a02447J8138O9801L6894m949l1339p326K9963l3536o0118O196J6859K4260
$$ y = [-25973, 1302, 91166, 73002, -31362, -131934, -143553, -110290, -66397, -84624, -122848, -35148, 26260, -28783, -71252, -64409, -102533, -40563, -20405, 27940, 31606, 72557, 63304, 82549, 35575, -12479, -32534, -42596, -14492, -13795, -52771, -106243, -67690, -62532, -46736, 10585, 35913, 56591, 64749, 10528, -38165, 2745, 37566, 48426, 39948, 60438, 83391, 22192, 2739, 22145, 36172, 28546, -15421, -40643, -60490, -111889, -116919, -113890, -132094, -109245, -98822, -115560, -83779, -45366, 4940, -19086, -4004, -40202, -73966, -93276, -222994, -236762, -191942, -169789, -197380, -176604, -118146, -159471, -133470, -118087, -86483, -102447, -84309, -14508, 22386, 17437, -13902, -21228, 8735, -24801, -84919, -78723, -61864, -37604]
14587c7604J6422K7767Q182j5816n1776K8679J9938n2269n1961M432j780Q8104
14575a7682J0771j3928M1420K0746k5069l0201m232K3025M0792J6718j8397n7139
14563a3176m605O866M5524M392l1666P087o2446k4591m9328L7624J1230k0412
14551i3501L5649M5689P734O3232J7218K1247J5081n0119q5652N5145k910q6243
14539e7430Q094N1362P1085L2827M6029n3655j30173l8134P074O8887L1211M6017
14527H3194l4988P625m412j9223L000m1601J0722n4038l0585l906K4664q203M201
14514f3550N1850J4127l372r8857L7718M8564j8893k6347j2798M6658L9206L8890
14502E3196J1675q4991q801L8236k273Q822L758k7225p8758L7129P7303L8623
$$ y = [-37604, -21182, 6585, 14767, -1049, -52825, -24146, -4208, -56477, -108438, -104006, -105786, -17682, -6911, -20839, 20581, 41327, 16258, -13943, -18175, 4850, 45642, 62360, 43963, -13176, -17781, -10915, 34609, 39001, 7335, 14422, -48024, -72615, -121943, -84319, -73089, -93501, -57852, -12163, -4429, 58803, 76021, 97268, 112349, 62230, -23422, 31723, 28813, -57430, -49336, 2026, 73111, 105938, 151967, 98312, -31861, -69995, -62921, 5966, 37177, 83194, 48206, 55831, 51419, 32196, 35196, -6405, 4317, -49721, -80306, -84212, -59548, -67751, -63550, -11700, 2427, -945, -99802, -62084, -13520, -32413, -58760, -71558, -24900, 14306, 53196, 64871, -20120, -28921, 9315, 7042, 15864, 19622, -7603, -86361, -49232, 28071, 66694]
14490F6694l6444k1661n1299O9002O1249m2225l2513Q732l2112J3645M3924M2389
14478H9381k4949M1657J0803q4142k3682k3551L790J5648K7060m70l6900j2263
14466a7618J8548j6335n6339Q535L1367k2188L5993o3904m9972L7266K7930r4012
14454a60729k0110M2016Q6240K0158o7482o995L0356M9995K1866L1N7812k2545
14442C0613l4787J6381m2375J8290Q7526J0293k6039P904L1243m5226r5913J0768
14430c1322K9348J0056l5208J1035M8568k0537J5533Q60L268m3131l3881M3762
14418a649L4742P370n7043j9058K7687M8946r814L646J5302J2817R639l056J37
14405F9666O662K2526o5596m4146Q0265j3062q3515j0266L9315J511l2998j6241
$$ y = [66694, 30250, 8589, -42710, 26292, 87541, 45316, 12803, 21535, -10577, 3068, 46992, 89381, 64432, 106089, 116892, 32750, 9068, -14483, -10693, 4955, 32015, 31545, -5355, -17618, 930, -15405, -71744, -63209, -31842, -54030, -18037, -81941, -131913, -94647, -66717, -160729, -180839, -138823, -52583, -32425, -99907, -106902, -76546, -26551, -4685, -4654, 53158, 30613, -4174, 12207, -30168, -11878, 75648, 85941, 59902, 67806, 99049, 53823, -42090, -31322, -1974, 8082, -27126, -16091, 32477, 11940, 27473, 28333, 31601, -11530, -45411, -1649, 33093, 40463, -16580, -35638, -7951, 40995, 31181, 34827, 50129, 62946, 72585, 69529, 69666, 76328, 98854, 33258, -10888, 69377, 56315, -27200, -37466, 1849, 3360, -29638, -45879]
14393d5879m9819L9083K4014l4638J8461j7524N201K9734N021N7761k4912q6438
14381g9935k7225P1034R3038R339p8777q2296L680L7494m718M8050k945j3064
14369b6325N3939K5414m9813j12635k0467O2263L2672k4037r0699j3964K4444
14358a39208R8546K7594m1171m2054N9410K50k1438j628r798J8102j9393j6864
14346h7652k4656J04148J6745J4984O0312J9707r132o3246n5816N921J5738K9767
14334B6820L3765r3689l5132M7324l3458K4045L4814l2446l8045L3376K3818l5942
14322d4750P904Q327L2649j5722L134N098q8592J7675O7756N9800K8382n4677
14310B6984m3462M7983l416o168J4749l1748m0432l3265J0882K9422K7860l9100
$$ y = [-45879, -95698, -56615, -32601, -67239, -48778, -66302, -61101, -31367, -26346, 31415, 6503, -79935, -107160, -36126, 56912, 66251, -12526, -94822, -91142, -53648, -58366, -10316, -13261, -26325, 27614, 53028, 3215, -109420, -129887, -67624, -34952, -58989, -149688, -163652, -139208, -40662, -13068, -54239, -96293, -36883, -36633, -58071, -59699, -69497, -51395, -70788, -87652, -112308, -8160, 8585, 23569, 83881, 103588, 94456, 31210, -24606, -18685, -2947, 26820, 60585, -33104, -68236, -20912, -54370, -30325, 4489, -27957, -66002, -32626, -8808, -44750, -36846, -28519, 4130, -11592, -8458, -3360, -91952, -74277, -6521, 53279, 81661, 26984, -16478, 31505, 28089, 21921, 36670, 4922, -35510, -68775, -57893, -28471, -611, -39711]
14298c9711J9949J269K243N4735L9475l876k6874n5811m4534R357O3426l645o2001
14285d5998K0105p2160R933N3451M5995P3677p688o7594m2199M1332J17765m0568
14273H6051r0755p5930M492L0672L7015M2627R609m1172j098K313J8529j9278
14261C075R831L6209M6347m6318n622J6084n3598l0910N5067M8705k1472l585
14249E3813M0282K7815j9528j7002J9090k1292n3319r780M0922K031l8573J5033
14237C9492P0738n226J5532p0933n6186L0485q4573k8697M9616M5931J2459o322
14225A2316l7845j143M4821O391P234k0787q586J9565J0394N1708n089l6463K0267
14212F2783n9651p1066n5931M5127l547M6946R8641M5698j9723J3328K5128q756
$$ y = [-39711, -19762, -18493, -16250, 38485, 77960, 74084, 47210, -8601, -53135, -43778, 19648, 16003, -45998, -25893, -98053, -88120, -34669, 11326, 85003, 77315, 9721, -32478, 8854, 126619, 86051, -4704, -80634, -76142, -45470, -8455, 34172, 43781, 2609, 1511, 3824, 22353, 3075, 12906, 49115, 95462, 49144, 43522, 59606, 6008, -24902, 30165, 78870, 57398, 53813, 94095, 121910, 102382, 85380, 104470, 83178, 29859, 20079, 61001, 63032, 24459, 39492, 110230, 105004, 120536, 49603, -6583, 23902, -60671, -89368, -39752, 6179, 18638, 12316, -25529, -26672, 18149, 24540, 31774, 10987, 2401, 21966, 32360, 84068, 78979, 42516, 62783, 3132, -67934, -123865, -78738, -82285, -35339, 63302, 109000, 89277, 102605, 127733, 118977]
14200A18977K5636o1870j13278P815N9227j1617l8665l224J5097M0799n728m6401
14188a3232J3363L4796j0239O1215O744k3849L2297O84k3522p3164j7901J39858
14176A27050N6153q204m5098o9503o6180k0255J2426l8055q500k267P8387J07506
14164A23460Q78o1168K2541l0431p2888j7826M3342M5386K857l9659m5559L8317
14152I250j1068l2991k9673N8287Q9044n0870q673N865l6034P4765O5543j19421
14140A4024j9670J288p912l488K4568N3779K2575j8219q4923k5922o5918L3561
14128g6257M3771L8003L187O2756R3948K5562k9662j957j19263q5947O061m1970
14116h1768N4890Q2093L0715r687k424j8512n7670j8178M4536K9400m575j8466
$$ y = [118977, 144613, 82743, -30535, -22720, 36507, 24890, -13775, -16999, -1902, 38897, 33169, -13232, 131, 34927, 24688, 85903, 92647, 68798, 101095, 101779, 78257, 5093, -12808, 127050, 183203, 174999, 129901, 60398, -5782, -26037, -13611, -51666, -60166, -62433, 15954, 123460, 124338, 63170, 85711, 55280, -17608, -35434, 7908, 53294, 56151, 16492, -29067, 9250, -1818, -34809, -64482, -6195, 82849, 31979, 23306, 29171, -6863, 67902, 133445, 14024, -5646, -4358, -12270, -15758, 8810, 62589, 85164, 66945, -17978, -43900, -109818, -76257, -32486, 5517, 8704, 71460, 165408, 190970, 161308, 159351, 40088, -45859, -39798, -81768, -26878, 55215, 85930, 76243, 73819, 55307, -2363, -20541, 23995, 53395, 48820, 30354]
14104C0354o7196m3462J5774M7103L2893n1429l0422K8982Q8420n8565J4273J2551
14092A9276k398k2478n7789o800O1471J28656M4911o1097r0971n6531j2865l9931
14080i6546L444N2697J10721L6720j1960r5615j6161k8663l7216n4908j5343l6136
14068a88966L8498Q3831J6995j5190L120r97J5010J08928R087m6573k5885j9108
14056b1250k3686L3126j0853k5870j503o085k9103K6822j2594K0424J00324O6757
14044A16509o8904P858J0265K1018j1322m9853m0209j4697K3884J6151p696J8389
14032B1393k4248M597K9924K051m0347K8839L0307j8914j3129L5858j818o4012
14020i499n6224r658O1803O8738J657J0936J9695Q344j2712P155k2916k9259j7360
$$ y = [30354, -36842, -80304, -64530, -17427, 15466, -35963, -66385, -37403, 51017, -7548, 6725, 19276, 16878, -5600, -63389, -70189, -8718, 119938, 164849, 103752, 12781, -43750, -56615, -96546, -93102, -40405, 70316, 107036, 95076, -539, -16700, -45363, -82579, -137487, -152830, -188966, -150468, -66637, -49642, -64832, -61712, -62709, -47699, 61229, 70316, 23743, -2142, -21250, -44936, -11810, -22663, -48533, -50036, -56121, -85224, -58402, -70996, -50572, 49752, 116509, 47605, 55463, 65728, 86746, 75424, 25571, -14638, -29335, -5451, 10700, 3004, 21393, -2855, 1742, 31666, 33717, -6630, 22209, 52516, 33602, 20473, 56331, 54513, -9499, -65723, -75381, -13578, 55160, 56817, 67753, 87448, 95792, 83080, 90235, 67319, 38060, 20700]
14007B0700O9039N2764k3497o48k1573p7852l0467J3935n5067o993O6403L25P549
13994A4618L7465J5500j034j9586P570k8308m6072R63N0711L7009J4850J7084
13982A00770j2147k0652k532p970L0001J2556n342o5812l8344k9201L6174K4063
13970B1564K9421O9697j5823n1632j0018M7554J2391o6189l69J03266M6494n8360
13958A27996m4978q2065j3001j840J16069Q0520o4477n026J2827p920k4922M0466
13946A33649K401o1123o2533L7103L6334k2543k2741n2005R9886L4154l4339j1826
13934G6417o016P3293M8182j15503k6473k5179L3651K2071n4849n613Q5685M2501
13922A48167l7100L4142l8615o554M091m7494L310O8444P500j6643L0452q583
$$ y = [20700, 89739, 142503, 119006, 118358, 96785, 18933, -11534, 2401, -52666, -59659, 6744, 7069, 14618, 52083, 67583, 66549, 46963, 54533, 26225, -19847, -18884, 31827, 68836, 83686, 100770, 88623, 67971, 65439, 57469, 87470, 100026, 94684, 28872, -9472, -38673, -2499, 21564, 50985, 120682, 104859, 53227, 43209, 90763, 103154, 36965, 36596, 139862, 186356, 127996, 83018, 953, -12048, -13888, 102181, 182701, 118224, 113198, 126025, 118105, 93183, 133649, 136050, 74927, 12394, 49497, 85831, 63288, 40547, -11458, 88428, 122582, 88243, 76417, 70401, 143694, 191876, 76373, 49900, 24721, 58372, 80443, 25594, 19981, 105666, 148167, 111067, 145209, 106594, 100040, 104131, 56637, 59947, 128391, 135891, 119248, 149700, 141117]
13910A41117m1862r5615k8868l2678m1710P6362M7234l1616J5182K8883P7969
13899A14398O779l2408q554n3562j8051O0600L4985r518J1971j4202J7081K5900
13887A35419k9398n7476K1812l822m0949P423l8539K4883n4808M5272K6512m9196
13875a2867L0837J0501k1145j1678J9220O597k5192P9512L3686k7879j2009J2875
13863H2458J0080k632j8093L6026k2950l567o303m6689O1394j6229n439J7040
13851H5096j7415m7438k2666m2044k925n8091M0298R4373J551k3657j0827M8411
13839D4666M2943J6790n4760m4546J9108Q5455N2881Q499k8228l3521n3062L7696
13827I3921k3755J1735q959K5719M140k5306k2613l8616J4092J1366m0104m0950
$$ y = [141117, 99255, 3640, -25228, -57906, -99616, -23254, 23980, -7636, 7546, 36429, 114398, 121177, 88769, 80215, 26653, 8602, 69202, 104187, 94669, 106640, 92438, 109519, 135419, 106021, 48545, 70357, 66535, 25586, 33009, -5530, 19353, -35455, 9817, 36329, -12867, 17970, 28471, 7326, -4352, 14868, 21465, -3727, 75785, 109471, 81592, 69583, 82458, 92538, 89906, 71813, 107839, 84889, 81322, 75019, 28330, 89724, 73495, 68056, 85096, 67681, 20243, -2423, -44467, -47392, -105483, -65185, 29188, 30739, 7082, -3745, 44666, 87609, 104399, 49639, 5093, 24201, 109656, 162537, 171036, 142808, 109287, 56225, 93921, 70166, 81901, 72942, 98661, 102801, 77495, 54882, 16266, 30358, 41724, 1620, -39330]
13815c9330r116Q2447N9898j2330m9509m6184R4956J4669J2205M4060J3675J2797
13803A78238k2237n6631l4231L4246K3316l8369l7605L7234n4520j7689j339Q5592
13791I6005P2648K691m743K2355l857m8746p1435m0197j0247O4678M3167M277
13779A26596p3132j4263L1748O3446o496L2666n235o0031k7860k2299l7841l0257
13767b2958R5494N3129l435k0472J533m984K2490k7352m1151M8194J6173l2806
13755H3855m2520M3643K4880j2612m9535N787M5619M7954k0914k0592p202M9732
13743A48095J2010j3588q022k0893n6611K2214J9559k3516l2291m9696J4856j0453
13731A664K5343j4617j849M2864L6128j29073q2058P3810O3542P7510j8001l3377
$$ y = [-39330, -48446, 34001, 93899, 81569, 32060, -14124, 80832, 95501, 107706, 151766, 165441, 178238, 156001, 99370, 65139, 99385, 122701, 84332, 46727, 83961, 29441, 11752, 10413, 96005, 168653, 171344, 166601, 188956, 185099, 136353, 64918, 24721, 14474, 79152, 122319, 126596, 53464, 39201, 70949, 134395, 127899, 160565, 155330, 95299, 67439, 45140, 7299, -22958, 72536, 125665, 122230, 101758, 103291, 98307, 120797, 93445, 52294, 100488, 116661, 83855, 41335, 84978, 109858, 97246, 47711, 53498, 99117, 147071, 126157, 105565, 98363, 148095, 160105, 146517, 138495, 117602, 60991, 83205, 102764, 79248, 46957, -2739, 12117, 1664, 27007, 12390, 10541, 53405, 89533, -39540, -121598, -47788, 15754, 93264, 75263, 41886]
13719D1886J4745K2880M137r644m197l6978N6588J3689l6111K1502J1440O703
13707A06640r308K650k0045r088j8356k7588M1368R036j5190r724K4733K620n1453
13694B6295l5039m5666J1413M7004L578K4659J23248J06490k8627l0870j07202
13683I5283n9879l51j934l2781n8869K3027J9193N0835L8632P7449K7118L2057
13671B09780m470M4390Q101j2970l9571j10211n0886K246q679J8864J4891K8799
13659A00284m3045j1183l3741m9145J0587R2181N5402p075k0576J5729j0176k6341
13647G2901j1447J5490O840M8026O8258l604p2711o0904l570M1382O028M7832
13635A54521k2547p9054l0956k6724O090M7350k8993P6279N0437p7059l9869K3722
$$ y = [41886, 56631, 79511, 83648, 74004, 69807, 32829, 89417, 103106, 66995, 88497, 99937, 106640, 97332, 99982, 79937, 70849, 52493, 24905, 66273, 75309, 60119, 50395, 75128, 77748, 26295, -8744, -54410, -42997, 4007, 7585, 32244, 155492, 261982, 233355, 202485, 95283, 35404, 35053, 33119, 338, -58531, -35504, -16311, 34524, 73156, 150605, 177723, 209780, 205310, 249700, 257801, 244831, 205260, 95049, 44163, 46409, 37730, 56594, 71485, 100284, 57239, 46056, 12315, -36830, -26243, 65938, 121340, 114265, 93689, 109418, 99242, 72901, 61454, 76944, 83784, 131810, 200068, 196464, 123753, 62849, 59279, 100661, 106689, 154521, 131974, 52920, 21964, -4760, 1330, 48680, 19687, 95966, 146403, 69344, 29475, 53197]
13623E3197J8449O569r012n8785p3389M9549j224P7370O6991M807k3245O8715
13611A79992j4614l8883j4239k5065m6724J2961P2794J6053l6675J1666m729k7850
13599H4687m2980l3884N5577M9072L1058N2335J457M0482j1346m2600q446j4479
13587A60933R4923k9685k5835J1241q3078q5591J4406K5505l705N2496N7625P235
13575A96470L1809m2044k5590j00418J7736O2630j6836m282m5132R570K8683M3526
13563A56122l9035n6037L2703K2755Q788M3756k5341m3603j443j0321j3389J6351
13551I1306n2863m8845j5748M6434N3737K8309q012K7056M0703M3093k8439n1181
13539A25550q161m9766O120j8130J7072N6727L3729l4613j8057k1614K1664l980
$$ y = [53197, 71646, 78215, 69203, 10418, -62971, -13422, -14646, 62724, 129715, 134522, 111277, 179992, 165378, 126495, 112256, 87191, 40467, 53428, 126222, 142275, 105600, 117266, 112537, 84687, 41707, 7823, 63400, 112472, 143530, 195865, 197322, 237804, 226458, 183858, 175412, 160933, 255856, 226171, 200336, 211577, 128499, 42908, 57314, 82819, 79114, 131610, 189235, 196470, 228279, 186235, 160645, 60227, 77963, 140593, 123757, 119475, 74343, 83913, 112596, 156122, 117087, 61050, 93753, 116508, 125296, 169052, 143711, 100108, 98665, 88344, 74955, 91306, 38443, -10402, -26150, 20284, 74021, 102330, 94318, 121374, 162077, 205170, 176731, 125550, 117389, 67623, 73743, 55613, 72685, 129412, 163141, 128528, 110471, 88857, 110521, 106541]
13527A06541K1134O3646M1159j259J2067n9744n6636r583L1369P692O6877l2111
13515A91152l3231J0279l0089j3532K0657k2718j43N7825L6366j6058m6654r0311
13503F3543R572P8441m9008l5402o9271M4815K7628K6250j4263Q655j0435n504
13491G5021M729K2288O8784n1816J4017P572J7802L9415J1019L187j60l7508o9568
13478A04782o243l6955p2102K6386M0833p295l6291M672M1626J3442L7923J69
13466A10947j7075L4703Q3657L0155m8228n030M6747K535j32667p026K3173l9701
13454H2190j3938L7538L9844n1015n4690N1233M349J7315J4308j6291l1679l3145
13442D6019k021P1128Q095J921J1646J3259l8892L3137n396k8825r7146M5626
$$ y = [106541, 127675, 191321, 232480, 231221, 243288, 183544, 126908, 117325, 148694, 156386, 223263, 191152, 157921, 168200, 138111, 124579, 145236, 122518, 122375, 180200, 216566, 200508, 153854, 63543, 73115, 151556, 102548, 67146, -2125, 42690, 70318, 96568, 82305, 90960, 80525, 75021, 79750, 102038, 170822, 119006, 133023, 140595, 158397, 197812, 208831, 212018, 211858, 174350, 104782, 98539, 61584, -10518, 15868, 56701, 49406, 13115, 17787, 59413, 72855, 110778, 110947, 93872, 128575, 212232, 242387, 194159, 189129, 235876, 238411, 105744, 98718, 121891, 82190, 68252, 105790, 145634, 94619, 39929, 91162, 95511, 112826, 127134, 110843, 79164, 46019, 43998, 115126, 123221, 125142, 136788, 150047, 111155, 144292, 138896, 110071, 12925, 58551]
13430E8551Q2286M7692K9580n8185j19282l4298k365J0493K2137O5752O9974l4388
13418A37947o1177n5389K864K4085K8382K8379l4577J2682Q5877Q108p7192p2594
13406B7395J2652L7676m100k6322n3830p830R8279K7139p99R249L2675j579K5688
13393A76293K137l327K4604n3559m1970o2709K548L1358P0047r408N7753L3206
13381B26973k640Q171k0062Q704j3898k7461j9017r5279P9184K2664p6484j935
13369H8920J9207O641j2867L169L9550k2286L5720R073n5236k799k2687q982J302
13356G8725j2305M0712M6344K3099m6509M212J7569l3200R424j6532k8590N1956
13344A34905Q217j5810Q443k8063K9608L9750J6746l5936L3319k68m6332k0702
$$ y = [58551, 140837, 188529, 218109, 159924, 40642, 6344, 3979, 14472, 36609, 102361, 172335, 137947, 76770, 21381, 24245, 48330, 76712, 105091, 70514, 83196, 169073, 177181, 99989, 27395, 40047, 77723, 73623, 47301, -6529, -14359, 83920, 111059, 110260, 119509, 152184, 150605, 176293, 178430, 175103, 199707, 146148, 104178, 41469, 44017, 75375, 145422, 136014, 193767, 226973, 224333, 232504, 212442, 221146, 207248, 179787, 160770, 65491, 144675, 167339, 90855, 88920, 108127, 114768, 101901, 105070, 144620, 122334, 158054, 167127, 111891, 109092, 86405, 77423, 78725, 66420, 107132, 153476, 176575, 130066, 134278, 151847, 118647, 128071, 111539, 82949, 134905, 143122, 127312, 135755, 107692, 137300, 177050, 193796, 157860, 191179, 190911, 144579, 123877]
13332A23877j8657j1645o888J254M6217Q4855L1442n0145k4831k7654K0790L5420
13320B04035k9681p0l372k412M2996j6597P412L9445k8737k9899J0520q180l2699
13307A52761j4622N37l6634k921R3552L0316j6210K2475m9372l0765l3181j3401
13295A02535Q676N6647J1535m0401p560j3644M7327l010k6382k5795k2577K1294
13283A08645O3576K1380m6216j003m1706o1948L2216j4951J6161K2584L353O0253
13271A62344K7962m1654l2752r497O9388M6788M7580j4185l8909o5212k5572m1512
13259H4769N705O4371m7771K8013N8470J5823m1573n3525j6604K2537P702L1698
13247A59615p1570N914M9883N7090R0173l2716j5550j4629j4328M369J5162l0895
$$ y = [123877, 105220, 93575, 86687, 87941, 134158, 219013, 250455, 200310, 175479, 147825, 168615, 204035, 174354, 174284, 170912, 168500, 211496, 194899, 202311, 241756, 213019, 183120, 193640, 185460, 152761, 138139, 138676, 102042, 99121, 192673, 222989, 206779, 229254, 179882, 149117, 115936, 102535, 111211, 167858, 179393, 138992, 131432, 117788, 165115, 162105, 135723, 109928, 87351, 108645, 172221, 193601, 147385, 146382, 104676, 42728, 74944, 59993, 76154, 98738, 102091, 162344, 190306, 148652, 115900, 106403, 175791, 222579, 270159, 255974, 217065, 151853, 126281, 84769, 90474, 154845, 107074, 135087, 193557, 209380, 167807, 114282, 97678, 120215, 127917, 159615, 88045, 93959, 143842, 200932, 291105, 258389, 242839, 228210, 213882, 218251, 233413, 202518]
13235B02518l9035m0037k6173k0994O4998P4257l6515n7185J2121R3859n6216
13224A71598n7008O609J0337k2514l1185K6940M7528K4289j0697K7571J7576k7740
13212A83304J3736k1141l1095j6732q2962J4322P9371Q9360m102m9721o3937J5176
13200A25579k4690L2140k6160q0347m2596K7019P365p2555N851R3765n54p563
13188C7254P5858J04847m2811n0053K1869R7829J2019j5234j2830n7591l4469
13177A36688L5463N2814k4705l2256j0982j5709J103M8352P0474j1217l6828k4648
13165A88549j0479J4189O5229K571k1729l2294n539L2270k7858o7115L5002j174
13153A71622l9908m0195J2852M0735O7413k8925L15J5575j1655J2875m1565J7499
$$ y = [202518, 163483, 123446, 97273, 76279, 141277, 215534, 179019, 121834, 133955, 227814, 171598, 114590, 121199, 131536, 109022, 77837, 104777, 152305, 176594, 165897, 193468, 211044, 183304, 197040, 175899, 144804, 128072, 45110, 59432, 138803, 228163, 224061, 174340, 110403, 125579, 100889, 133029, 106869, 26522, -16074, 10945, 18310, -54245, -48394, 45371, 44817, 37254, 113112, 217959, 175148, 125095, 146964, 244793, 256812, 241578, 228748, 171157, 136688, 172151, 224965, 200260, 168004, 157022, 141313, 142416, 190768, 261242, 250025, 213197, 188549, 178070, 192259, 257488, 260059, 238330, 206036, 200497, 232767, 204909, 137794, 172796, 171622, 131714, 91519, 104371, 145106, 212519, 183594, 183909, 199484, 187829, 200704, 159139, 176638]
13141A76638K4842m452l6174M1148m0611N656N9139L4016O4185o0696m2127R06
13129B22470j6484p5749k4369L9433K8034p7679k3756M4484R861j1198P1850J6100
13117B02997K0363k1233L2549J7081K3765m5825m9478L4198N0566j4011m9131
13106B01841p5901K4959P7920n644k3522K9460J6964j6025r5832l6960L621r786
13094I1095N8559K8725m4156p6456J8589O9611k0605N0452M6613N8029k3768o1412
13082A95276p0411M8356J39101N9384m907p8086p5820j3247l7987n6739n029N5321
13070A55212L0143m0863r5354J9485Q0502k0522O1726K3787m0223l9893N6117
13059A90117K9882J2555l3305l957L9514O3856j0788p2555o341Q6109J4413n3115
$$ y = [176638, 201480, 197028, 160854, 202002, 161391, 167047, 226186, 260202, 324387, 263691, 221564, 222470, 205986, 130237, 105868, 145301, 173335, 95656, 71900, 116384, 126245, 115047, 186897, 202997, 223360, 202127, 234676, 251757, 275522, 229697, 180219, 214417, 264983, 250972, 201841, 125940, 150899, 228819, 223175, 199653, 229113, 246077, 230052, 134220, 97260, 100881, 91095, 149654, 178379, 134223, 57767, 76356, 145967, 125362, 175814, 222427, 280456, 256688, 195276, 124865, 173221, 312322, 371706, 366799, 288713, 212893, 199646, 161659, 104920, 99891, 155212, 185355, 144492, 49138, 68623, 149125, 128603, 190329, 214116, 173893, 134000, 190117, 219999, 232554, 199249, 195292, 234806, 298662, 287874, 215319, 208978, 295087, 309500, 256385]
13047B56385L1491k8724l9232Q828J8099L1981j7659k9463k2423l6626O2615j7748
13035B17524m6474K6601J0880l8915j9667P7753J8551k0112J5424K9574m0783
13024B30356m0658L499K8115J085l1415n7677J1150j4327J3225M7087N7601m694
13012B43347L1553M5312o158J1851n814l9622j3047N150k9339j9920k9542o0620
13000A33151j5611K7749k9570k4325P3747r314o4868l6120Q3554N5432k8939J0371
12988A75257L0174N6402M5775P539K7707K2384n6151j6229m9814p9803j1433M6220
12976A98028O888k3069j3640R3878M2046m2601m7856q2137M9587Q0668M1717L8533
12964C42042j6736O748j0669o1069j3416l298l4811p2587j6352J7634n1549n1668
$$ y = [256385, 287876, 259152, 219920, 228748, 246847, 278828, 261169, 231706, 209283, 172657, 235272, 217524, 171050, 197651, 208531, 169616, 149949, 227702, 246253, 226141, 241565, 271139, 230356, 189698, 193197, 221312, 222397, 190982, 133305, 144455, 130128, 143353, 190440, 248041, 243347, 274900, 320212, 314054, 325905, 320091, 280469, 267422, 272572, 243233, 223313, 193771, 133151, 117540, 145289, 115719, 91394, 165141, 155827, 90959, 54839, 138393, 193825, 164886, 175257, 205431, 261833, 307608, 315147, 342854, 365238, 309087, 292858, 243044, 163241, 151808, 198028, 204916, 181847, 168207, 262085, 304131, 261530, 213674, 131537, 181124, 261792, 303509, 342042, 325306, 332054, 321385, 260316, 246900, 243602, 208791, 136204, 119852, 137486, 85937, 34269]
12952C4269J10694J3713M7977L6037k1198J9299J2154o0361J3286j3948Q5217
12941B77139N3882m8646m2951M2462n750q708n402j1683J1840l5820P371j7404
12929B16330n3473J8430j147j8418N2147O5761K8998n3067o2552M4407l3262M190
12917B08344L1550K2314l2308l0805J5328K8729P9991P8612j7944p0686j5356
12906B97769L2796m0887j780o578J7761j7056L0976j3241j2361j953r581n1379
12894B24486n2405R51K4760k1855O532O1758m137M2567N5994k2814l8037n9604
12882B18196J1284R3288M8136k4380k5107k4522k265J4219j8822o3719K4149o1046
12870A89411j7707P7225J5113L9664k1350j3018O872l3085o0845m8802j0644N2594
$$ y = [34269, 144963, 158676, 206653, 242690, 221492, 240791, 252945, 192584, 205870, 191922, 277139, 331021, 282375, 239424, 281886, 276136, 267428, 262026, 250343, 262183, 226363, 233734, 216330, 162857, 181287, 180140, 161722, 213869, 279630, 308628, 255561, 193009, 237416, 204154, 208344, 239894, 262208, 229900, 199095, 214423, 243152, 323143, 401755, 383811, 313125, 297769, 330565, 289678, 287898, 281320, 299081, 282025, 313001, 299760, 287399, 285446, 275865, 224486, 172081, 173032, 197792, 175937, 182469, 244227, 240090, 282657, 338651, 315837, 277800, 218196, 229480, 322768, 370904, 346524, 321417, 296895, 294630, 308849, 290027, 226308, 250457, 189411, 171704, 248929, 264042, 303706, 282356, 269338, 276210, 243125, 182280, 133478, 122834, 175428]
12858A75428l496n1401O3802Q1715J8621j1757K597l838r086L4030m5599M6704
12846B97720l5740l6838K3224r151J446J8380J1253P743l6228m5498m2794J3384
12834A66901m1544K4996P1906R5006L6162J0006J6518o5817l1494q173j7007L3805
12822B91265J0098r570J4916l9159j08849J1201P2404l69k262j46k6462M3835
12810B56902P3725n9522j8880j4080M7494N0103L6318p4385p8345J6577k6194
12799B09713j9442r617l2590M2218O1595l5509j6220k3438j4058m0796K3249R5307
12787B40412O7755K9774K7077q088j7422k1445n1599j1042K0778j1333L5066n2812
12775B47121K2647M1161o5418n8669o380M6281O4795J7331R603K1058J1823j5844
$$ y = [175428, 171932, 120531, 184333, 266048, 284669, 272912, 275509, 271671, 262585, 296615, 251016, 297720, 261980, 225142, 248366, 239215, 240661, 259041, 270294, 278037, 241809, 196311, 153517, 166901, 125357, 150353, 222259, 317265, 353427, 363433, 379951, 314134, 282640, 274467, 257460, 291265, 301363, 291793, 306709, 267550, 158701, 169902, 242306, 241937, 239675, 239529, 213067, 256902, 330627, 271105, 252225, 238145, 285639, 335742, 372060, 297675, 219330, 235907, 209713, 190271, 180654, 148064, 190282, 251877, 216368, 200148, 176710, 162652, 121856, 145105, 240412, 308167, 337941, 365018, 356930, 339508, 318063, 266464, 255422, 276200, 264867, 299933, 247121, 269768, 310929, 245511, 186842, 180462, 226743, 291538, 308869, 318472, 339530, 351353, 335509]
12763C35509p7489N444M4803J549M7417j6256o1311n1797k6958l3792k2960N3781
12751A97940J13190J3277l2588l7622j3604n3130K0646M2102K9665l797J8706
12740B94785k0574n7163Q155P95n4514M0804J04777N6509k7977o5859j5951k1007
12728B42780o2719k0658M1657l5074M1087N6694m0809q5080M8314P4175j5210
12717B45157J9967J6950J7361k490k0914j441l2237o232J1370k7495L8267L1422
12705B89685k1290m217M8968P5979o7012j5731J7186r546j00068l623M9503k3014
12693B36820k3489O0605L0285k4137j1804J8363K4913K8094l6487n7802Q792M7372
12681C01525j7938p3325J1069K1874N201j8223K255k76j1181l0186O2546M0364
$$ y = [335509, 258020, 263464, 308267, 309816, 357233, 340977, 279666, 227869, 200911, 167119, 144159, 197940, 311130, 324407, 291819, 254197, 240593, 187463, 208109, 250211, 279876, 276079, 294785, 274211, 217048, 225203, 225998, 171484, 212288, 317065, 373574, 345597, 279738, 263787, 242780, 180061, 159403, 201060, 165986, 207073, 263767, 222958, 137878, 186192, 260367, 245157, 265124, 282074, 299435, 296945, 276031, 274590, 242353, 236121, 247491, 219996, 258263, 289685, 268395, 264178, 313146, 389125, 322113, 306382, 323568, 314022, 213954, 210331, 259834, 236820, 213331, 273936, 304221, 280084, 268280, 286643, 311556, 339650, 303163, 245361, 254153, 301525, 283587, 210262, 221331, 243205, 248406, 230183, 232438, 232162, 220981, 190795, 253341, 293705]
12669B93705L2964p8585m4762O897P1820M8408J2031n2607n9217K6023L4683j6962
12657B74398k7625k1353K8113J7612L583l1463m4863r215Q127m1451M5479n8722
12645A42620O9313J3514j4979O7162j5665o097O8802j3012l5331J5044K2107M5573
12633C59051o4088j536N7516n303j3120k7799N177J547J4066k849j6623J6611
12621C22650K861p8557K426O964j2013J5711J328l0067j12913n097R653M580O1592
12608A89118Q8727K1381m7505J6408P531L5962k6604M7543N2824r370n3797l6668
12596B85550l6224l4226K9843k908N8735L17k3784O9996l0343n3888j2377k8146
12584B22545K8387O8878K698N7236n159n0360P50M773P174L6724j0914o5038m2170
$$ y = [293705, 326669, 248084, 203322, 210219, 282039, 330447, 342478, 289871, 230654, 256677, 291360, 274398, 246773, 225420, 253533, 271145, 274728, 243265, 198402, 189187, 197314, 155863, 201342, 142620, 211933, 225447, 210468, 277630, 261965, 255868, 324670, 311658, 276327, 291371, 313478, 359051, 294963, 293427, 350943, 345640, 332520, 304721, 309898, 311445, 325511, 322662, 306039, 322650, 325511, 246954, 249380, 256344, 244331, 260042, 261370, 231303, 118390, 113293, 122946, 127526, 189118, 277845, 299226, 251721, 268129, 275660, 311622, 285018, 332561, 385385, 376015, 322218, 285550, 249326, 215100, 244943, 242035, 300770, 301087, 277303, 347299, 316956, 263068, 250691, 222545, 250932, 319810, 322508, 379744, 374585, 324225, 324975, 329748, 336922, 373646, 362732, 297694, 255524]
12571B55524P171L5521M4646j2790K9016l8155Q578p8473J6734M538o719l5306
12559B30285j3422j8861K6897N3895N7302o0315o7523J9016J01064J09037K1415
12548D58790k0958k2395j14804l3864o44L4351J5032K8061J0566P0195l3352k7574
12536C63404n0200J8883L1088J9818n3389o6750n5347l1777J761l0508K8978J8285
12524A94246N568P0541O2754K8430l6500n2791N196j1320m8087O4114N1010k5228
12512C07933K748k0111J9711m9342l9153L2490Q5395K0590m4465n7921j09589
12501A48286M3555N2188P8606O6833Q84m576K888k5754O0284K2407p0873p0101
12489C04627P7308M485k1796m3609k3461k8726O092N5260j8663N10P1531p9631
$$ y = [255524, 262695, 298216, 342862, 330072, 359088, 320933, 329511, 251038, 267772, 272310, 265591, 230285, 216863, 198002, 224899, 278794, 336096, 275781, 208258, 227274, 328338, 437375, 458790, 437832, 415437, 300633, 266769, 266125, 300476, 315508, 343569, 354135, 424330, 390978, 363404, 313204, 332087, 363175, 382993, 329604, 262854, 207507, 175730, 177491, 146983, 175961, 194246, 199814, 270355, 333109, 361539, 325039, 272248, 277444, 266124, 218037, 282151, 333161, 307933, 310681, 290570, 310281, 260939, 221786, 254276, 339671, 360261, 315796, 257875, 148286, 191841, 244029, 322635, 389468, 390352, 385776, 388664, 362910, 423194, 445601, 374728, 304627, 381935, 386420, 364624, 321015, 297554, 268828, 274920, 330180, 311517, 312027, 383558, 303927]
12477C03927o1175L0208J49K700J3004o835M8846M2422M2518o9091n7605q284
12465B80784l709l4259l4600M8762R4503J2422j7828J8469m255m3492m1945j3349
12453B61503J680L7418n2767O762J4821N105N4533K7647j4522K5122m4570m0108
12441B82624o8977k1523L3095P2408K7003l1827j1767n6082N4729K8336j7275
12430B90744n586L9073k5997n483N1691J7232j7316l9162r92M447J2735j506m0141
12417B79739k1820o10Q3742j1815p1819l2700K7443N6340O4217l639J190n657
12405C64611K7114n6471L455K4164P3245n8395n2774k9320J8608R397k4339j7369
12393B81926L509M6771j8143k3725M6053M2366o413n9323k3324M0341J4925N1987
$$ y = [303927, 242752, 272960, 273109, 275809, 288813, 281978, 330824, 373246, 415764, 346673, 289068, 280784, 277075, 242816, 208216, 256978, 351481, 363903, 346075, 364544, 360289, 316797, 274852, 261503, 263183, 300601, 247834, 254596, 269417, 274522, 329055, 356702, 342180, 367302, 322732, 282624, 213647, 192124, 225219, 297627, 324630, 292803, 281036, 224954, 279683, 308019, 290744, 285158, 324231, 298234, 292751, 344442, 361674, 344358, 305196, 304204, 308651, 321386, 319880, 279739, 257919, 257309, 341051, 329236, 257417, 224717, 252160, 308500, 372717, 369078, 370268, 364611, 391725, 335254, 338709, 362873, 436118, 377723, 324949, 295629, 314237, 323634, 299295, 281926, 285435, 332206, 314063, 290338, 336391, 378757, 372344, 313021, 289697, 330038, 344963, 396950]
12381C96950K7590k6256q7350m7818j8984k4075j5860K1598J5685r630N4459j7378
12369B68931O920M3717J6467k3710l0910P870J2727J5089n8319o9186M6863M3205
12357B79664l31K4644O2652P1093J7469q7202j8543k452k2674p1393j8787l9966
12345A94174J3406J9726O4837M9143K1121m0987J9371J5685j3518l8972k0241
12334B83745O349L0119P014K5060q691k0493j1986M5561N0706q7069n1479L0049
12322B98885j5898o8464j6252K1310N9501n313M3990O3680J8221M8314j4849j17330
12310C15795q6364N6147Q0160N3252p1496n6248r4944j3692O6774J8101r222j605
12298B56658o4328K5006J4938j1222l9906M9999Q9733l3455J4500Q6570p287j08395
$$ y = [396950, 424540, 398284, 310934, 263116, 244132, 220057, 204197, 225795, 241480, 231850, 286309, 268931, 275851, 319568, 336035, 312325, 281415, 289285, 302012, 317101, 258782, 189596, 236459, 279664, 279333, 303977, 366629, 437722, 455191, 367989, 349446, 346994, 324320, 252927, 234140, 194174, 207580, 227306, 292143, 341286, 362407, 321420, 340791, 356476, 342958, 303986, 283745, 290094, 320213, 327227, 352287, 343596, 323103, 311117, 356678, 407384, 320315, 268836, 298885, 282987, 214523, 198271, 219581, 279082, 273769, 317759, 381439, 399660, 447974, 433125, 315795, 229431, 285578, 365738, 418990, 347494, 291246, 196302, 182610, 249384, 267485, 258263, 256658, 192330, 217336, 232274, 221052, 181146, 231145, 320878, 287423, 301923, 388493, 381206, 272811]
12286B72811k7956J5254n4874J01858M5800K843k3254m7505l2275R04m42N450
12274B58614M6882o3054L9646J33981J0897k5572J6422N8179K2077k9713l4212
12263D34147j4128k3928q439J2317n9920r1500N4983M2723n941l1738J6581m3362
12251B81795n5565l5540J1329J24892l9074k1315M4738n3953J8947N9580K2700
12240C58534K795n817q559o0242l6837M2295K3389P6757Q799n594l6840m4976
12228C13704l892J2891k5048M0396j4370n5677L2901L7238l717N970o809j7137
12216C16450p5662K7748L1509M8335j2816p0489M7150J02700j9549r4835m8227
12205B52314N8181Q1635l6135n9643K3679J0713k0506Q839N4070m2272p2803j2778
$$ y = [272811, 244855, 260109, 205235, 307093, 352893, 355736, 332482, 284977, 252702, 253606, 253164, 258614, 305496, 242442, 282088, 416069, 426966, 401394, 417816, 475995, 498072, 468359, 434147, 420019, 396091, 387652, 399969, 340049, 248549, 303532, 346255, 340314, 308576, 325157, 281795, 226230, 190690, 202019, 326911, 287837, 266522, 311260, 257307, 276254, 335834, 358534, 361329, 355512, 346953, 286711, 249874, 292169, 315558, 392315, 401114, 395520, 358680, 313704, 309812, 322703, 297655, 338051, 323681, 268004, 300905, 338143, 334426, 340396, 333587, 316450, 240788, 268536, 300045, 348380, 335564, 265075, 312225, 414925, 395376, 300541, 252314, 310495, 392130, 355995, 296352, 320031, 330744, 310238, 319077, 373147, 330875, 258072, 245294]
12193B45294L8595M0448k3020l3267J5125O1656j0379n3114j4150k0711K0335
12182B66812K275l6799L6414L9660n18K300J6338L3357j2189l1069J6094k2236
12170C10439l0173j0011r6396p7744R036Q8218J01143j4935j7013l2502j1461
12159B18601L4234j8721m8085p633R4813Q9941j0293k8497m1027n8848J0965J8995
12147B54445J9928j8224P2539L4621L6813j3375k4275k4277K7451m0430l8373
12136B86843l1204K4584L926M8619J6733p9709o521l2819L4279N1014n8606n4372
12124B02767j1408j2426K0423J7215j214J008Q4630K6326o5901l4428j6454J3985
12112B24523j5876N4864l812K584l0932k1488J28514J608n5367l8659L493L5840
$$ y = [245294, 283889, 324337, 301317, 268050, 283175, 344831, 334452, 281338, 267188, 246477, 266812, 269087, 232288, 268702, 308362, 307844, 310144, 326482, 359839, 347650, 316581, 332675, 310439, 280266, 270255, 173859, 96115, 105151, 193369, 294512, 279577, 262564, 230062, 218601, 252835, 234114, 186029, 178396, 273209, 363150, 352857, 324360, 283333, 224485, 235450, 254445, 274373, 256149, 328688, 363309, 400122, 386747, 362472, 338195, 365646, 325216, 286843, 255639, 280223, 284149, 332768, 349501, 269792, 263271, 230452, 264731, 315745, 257139, 202767, 191359, 178933, 199356, 216571, 215357, 216365, 300995, 327321, 261420, 226992, 210538, 224523, 208647, 263511, 259699, 262283, 231351, 209863, 338377, 339985, 284618, 245959, 249452, 285292]
12100B85292n9103k651k5048M754k088M802k1754N8795L5203n2492p1520k9451
12088A24739O0461O6090N605m9835k9514M8331J5949O434J7544p267p5486L321
12076A86372P7756M1384j7152n8879J8976K992M24M7564J6895j0359j4552P874
12064B99295o4959r669J08869l8080n455J0152L1830j0027j1584K3865N925q8761
12052B51401k9803M9430k2388p6997l9604M7294P4653M0237L1207L5045K96N2323
12040D13094N7280N257m8739n2247M469k5788o7773J560j2514k3483k3641p0135
12028A57340o4898O472N1727J4042j7344o5281R270N2575P8799M5321J815M294
12016B74132k0907Q519m7210m7654n5937N9883N4495J1552l3582J6305k7921j8692
$$ y = [285292, 226189, 223538, 198490, 203244, 201156, 205958, 184204, 242999, 278202, 225710, 154190, 124739, 185200, 251290, 256895, 207060, 177546, 225877, 241826, 248260, 265804, 258537, 183051, 186372, 264128, 305512, 288360, 229481, 248457, 251449, 251873, 299437, 316332, 305973, 291421, 299295, 234336, 224667, 333536, 295456, 290001, 300153, 331983, 321956, 310372, 334237, 340162, 251401, 221598, 271028, 248640, 171643, 132039, 179333, 253986, 294223, 325430, 360475, 360771, 413094, 470374, 475631, 426892, 374645, 379114, 353326, 285553, 287113, 274599, 251116, 227475, 157340, 92442, 98914, 150641, 164683, 147339, 82058, 91328, 143903, 222702, 268023, 269838, 274132, 253225, 261744, 214534, 166880, 110943, 170826, 225321, 236873, 203291, 219596, 191675, 172983]
12004A72983L9338N1370m0219o4054N365J0886M376M2454o63k4737L8364l8966
11992A96497j1459l3248L521p813j7071L1N9212K3260j5185k158n2768M2611K8793
11979B14223K0829P076j5937j3286k1027N8070k2281l9118K809o3160n8937K5748
11967I5009L2510J2019N3237N8706n3649j1330o9692k0376k0327J7398P6682m1337
11955A28850J6457K0527j5829j9327p9148J6356j3188Q201M6375L3585J14946
11944B57805q431m3768l6515k6347Q7707M6561k7465j04343p833J1545m790j4915
11932A29211k5404N0528K9057L3283k8620q801N8517m373l2162k5248j7936j436
11920A56616p21K7656N4115O9553m8832K056k8580n8153l5032J9488k146o4927
$$ y = [172983, 212321, 263691, 223472, 159418, 164783, 175669, 180045, 222499, 221836, 197099, 235463, 196497, 185038, 151790, 155311, 147498, 130427, 130458, 189670, 212930, 197745, 195587, 142819, 185430, 214223, 235052, 242128, 226191, 212905, 191878, 249948, 227667, 188549, 191358, 128198, 69261, 95009, 127519, 139538, 192775, 251481, 197832, 186502, 116810, 96434, 76107, 93505, 170187, 128850, 145307, 165834, 150005, 130678, 51530, 67886, 54698, 62899, 109274, 142859, 257805, 249374, 205606, 169091, 142744, 230451, 277012, 249547, 145204, 137371, 148916, 144126, 129211, 103807, 154335, 183392, 216675, 188055, 179254, 237771, 233398, 201236, 175988, 158052, 156616, 155895, 183551, 237666, 307219, 258387, 260443, 231863, 173710, 138678, 158166, 156020, 91093]
11908I1093m0046l6302J6239K9017N0672M316J3669M5770k0111K5877j1763l3480
11896A34951o8270l5619K228L4225l019K0641J7205j7188M5902o686p6412k4657
11884B3301P8099M5198q39J8572M67p2447L7627k5892k6611M2578M3669n1731
11872A11991m627Q5448M4724K8419K9606M1281n0228J5191m2252q1228K2094O3212
11860B63631J6541k0391l2725N4862Q479q8604k388o6592k6730m150l3794j5019
11848E3120m3564Q4304R5635P8593n1363J7795K2107p770k5931q269k3395r7396
11836I3866K7062J6791J8873N2707j2199k8356o7205L4945J3470k680n586j7681
11824A24007j9132J4714L8469J9663n1439m0887m0115n689L5511O0359N5509m708
$$ y = [91093, 51047, 14745, 30984, 60001, 110673, 114989, 128658, 174428, 154317, 180194, 168431, 134951, 66681, 31062, 33290, 67515, 64496, 85137, 102342, 85154, 131056, 124370, 47958, 23301, 101400, 146598, 145759, 164331, 164798, 92351, 129978, 104086, 77475, 120053, 163722, 111991, 107364, 192812, 237536, 265955, 295561, 336842, 286614, 301805, 259553, 178325, 200419, 263631, 280172, 259781, 227056, 281918, 290397, 201793, 199405, 132813, 106083, 101933, 68139, 53120, 9556, 93860, 189495, 268088, 216725, 234520, 256627, 248857, 222926, 214657, 191262, 93866, 120928, 137719, 156592, 209299, 197100, 168744, 101539, 136484, 149954, 147274, 141688, 124007, 104875, 119589, 158058, 177721, 126282, 85395, 45280, 39591, 75102, 135461, 190970, 186262]
11812A86262l2582l3266O9414M208k9873m3849j10098L4113N0711J4784K2265
11801A32089o622m6168j9214L6028J4002M3219J934K3847o60O994m5647n1686
11789H8116N3410J7456N8304j9028q4527r0697K6971j1668k4419L9721n992m9414
11777a767l6273L6017O3856K0501K7821O6133k3978m0803j5077n9888J2473L3383
11765H2398J6478n1437L5945m0457J1477J9017J8908j2686J5273k7416j1854L4371
11753I0017m3228m7462Q8090N3381j7079j5077l3228m2250L5268K3328P079l6195
11741F2644M4505j5268j0033j6739r858L2537L9101O544j9926J0728M6846m9584
11729A21497l3562o1371k9238O4249P4203o0521l5994l719J0896O5056m0078k7557
$$ y = [186262, 153680, 120414, 189828, 194036, 164163, 120314, 10216, 44329, 95040, 109824, 132089, 125467, 79299, 60085, 96113, 110115, 153334, 155268, 179115, 178455, 185449, 139802, 88116, 141526, 158982, 217286, 198258, 113731, 23034, 50005, 38337, 13918, 53639, 47647, -1767, -38040, -2023, 61833, 82334, 110155, 176288, 152310, 111507, 96430, 36542, 49015, 82398, 98876, 47439, 83384, 42927, 54404, 73421, 92329, 79643, 94916, 67500, 55646, 90017, 46789, -673, 87417, 140798, 123719, 108642, 75414, 33164, 68432, 91760, 98839, 62644, 107149, 91881, 81848, 65109, 55251, 87788, 126889, 133433, 113507, 124235, 171081, 121497, 87935, 26564, -2674, 61575, 135778, 75257, 39263, 35544, 46440, 111496, 71418, 43861]
11717D3861J19064N2813J0143k2099o1480m0918p5794l4080k85L0027m5931K3061
11705a618l1633K6811n575l5205k6293K7961M4494O2458Q962o2540n2375K6453
11693a8100J4137p333J9988j4949K5166q151l3853k9209K4329j0864o8N5110J5597
11680C1800j2684j02000K8955P8309R2566k0359o5242o3521j6658o7907j7480
11669a34221P1369K8232j9446P1160N5393M7079j8722l1095j2493o8828j6405
11658b7977K8044k7006L512l401l6261j8069N2769k0458k4791j0516N3650K9070
11646a434l8564K6754k574l533J19765N9901J2043K3936N0857J01490K35961N17506
11634A102108P82549R31788L64902n09193p24456o41052m01570j65127j28887
$$ y = [43861, 162925, 215738, 225881, 203782, 142302, 101384, 25590, -8490, -8775, 21252, -24679, -1618, -33251, -6440, -12015, -47220, -73513, -45552, -1058, 61400, 70362, 7822, -44553, -18100, -3963, -11296, 8692, -6257, 18909, 10758, -23095, -52304, -27975, -38839, -38907, 16203, 31800, 19116, -82884, -53929, 24380, 116946, 96587, 31345, -32176, -48834, -116741, -134221, -62852, -34620, -54066, 17094, 72487, 119566, 100844, 69749, 57256, -11572, -27977, 67, -26939, -23427, -26828, -63089, -81158, -28389, -48847, -73638, -84154, -30504, -1434, -39998, -13244, -15818, -19351, 100414, 160315, 172358, 196294, 247151, 348641, 584602, 1102108, 1884657, 2816445, 3181347, 2672154, 1947698, 1306646, 905076, 739949, 611062]
11625F11062j49835p6429l5o4024o2290R161L27l9773o2312o7709Q486k0023q8473
11612a867K0886L7567j201n763m6987k9975J2582K3999J36218N2650o5408k5455
11600A07246L2355O9243J40700Q2865J53123K30062N04692Q39386R11600K71892
11590C343164n53734p97314n60479l60688k71051j36771j38404q7263k6746q847
11580D01867K136k5091n0808m7665p9082j10144q1342L8029p802O229j1311J1342
11568D6358Q417M0090o788r3536m6862k2922O855L1302O4540N0011j9357J3756
11556G1864O2847l7818o2150N9445k1446j11705M0477K1432j5788k0559J0872
11545b529k7310N3871m21o3666K7468J8148l3608K785P19l5679K4993M7218o882
$$ y = [611062, 461227, 384798, 384763, 320739, 258449, 267610, 267937, 228164, 165852, 98143, 106629, 86606, -1867, 19019, 56586, 55385, 49622, 2635, -27340, -14758, 9241, 145459, 198109, 132701, 107246, 139601, 208844, 349544, 432409, 585532, 815594, 1320286, 2159672, 3071272, 3343164, 2789430, 1992116, 1431637, 1070949, 799898, 663127, 524723, 437460, 410714, 401867, 404003, 378912, 328104, 280439, 201357, 91213, 9871, 47900, 40098, 46327, 35016, 46358, 54775, 94865, 88077, -5459, -52321, -75243, -68388, -37086, 27454, 77465, 58108, 71864, 134711, 96893, 34743, 94188, 72742, -38963, 1514, 22946, 7158, -13401, -2529, -29839, 24032, 23611, -40055, -12587, 5561, -28047, -25262, -24543, -60222, -35229, 11989, 5107]
11532E107J6969l4804q0335k6571k2021j9271n7N8831J0667L4249K8500j4082
11520d2818m2541l4345K0346k6463o2456P4822N4355j1769P8328O3992r6225q5486
11508a10260l8622K3218K9917n2843l4487j3036K2986R0863Q1456k9978j5240
11497d6026l0926j9279N5962J7117m8362n8975P558M7111J2149p344l5876k4351
11485a31242M2p983m089k6148k5993K6951J7502L0064P6831r2479n8193N0662
11473a44075O6626m061q129k3502p4451k1344m3329r126L5477J0630N5960P5134
11461h4190j6376n3592l0891P0233L0143n7642j7618J8946j5656J8277j1775M3229
11449a06912L1039p5126j6136K7582j9104O958M6272l2734p3766p5450k8286R963
$$ y = [5107, 22076, -12728, -93063, -119634, -141655, -160926, -160983, -102152, -91485, -57236, -28736, -42818, -85359, -119704, -99358, -125821, -188277, -113455, -59100, -70869, 7459, 71451, -24774, -110260, -148882, -125664, -95747, -148590, -183077, -196113, -173127, -82264, -808, -30786, -46026, -76952, -96231, -40269, -23152, -71514, -130489, -122931, -75820, -63671, -71015, -106891, -131242, -131200, -139183, -143272, -169420, -195413, -168462, -150960, -120896, -44065, -136544, -194737, -144075, -77449, -81510, -89639, -113141, -187592, -208936, -252265, -261391, -225914, -215284, -159324, -84190, -100566, -154158, -185049, -114816, -84673, -142315, -159933, -140987, -156643, -138366, -150141, -106912, -75873, -150999, -167135, -139553, -158657, -151699, -105427, -138161, -211927, -287377, -315663, -305700]
11437c05700M6434N7027Q9551j7533n3655j0152P833M2078j3423n4612n5444N4412
11425b13184l6385m4578L2012O9735K8806K217j00940q0070P3632M8364j1677
11414b32068K8753R094j8865J0211j5857o9131J5486K427N36P3093j0722j6394
11402b23437K3596N7187M7512m0607k9239m7189o963n0144l7026N1626M8176M4950
11390a61558j681j5181o8067l0783J196l5290l6453j2164k5735p084Q0622l3973
11378c46151k0262P7975M7304R3943L323k9159k2592M7387m90j20701L3692K123
11366b33608m9749n2297M7401L4058n3704j4991j5816p597N0161N6004k8600J1100
11354b57638O837j9671m7837q4905l7909K3871J3201K6529M2170M2282m7966m0748
$$ y = [-305700, -259266, -202239, -112688, -130221, -183876, -194028, -186195, -144117, -157540, -212152, -267596, -213184, -249569, -294147, -262135, -192400, -163594, -161377, -262317, -342387, -268755, -220391, -232068, -203315, -194221, -213086, -202875, -218732, -287863, -272377, -269950, -269414, -196321, -207043, -223437, -199841, -142654, -95142, -135749, -164988, -212177, -219140, -269284, -306310, -254684, -206508, -161558, -163239, -178420, -246487, -277270, -276074, -311364, -347817, -359981, -385716, -392800, -312178, -346151, -366413, -288438, -241134, -147191, -143868, -173027, -195619, -148232, -148722, -269423, -235731, -233608, -283357, -335654, -288253, -254195, -307899, -322890, -338706, -346303, -296142, -240138, -268738, -257638, -250801, -270472, -318309, -403214, -441123, -417252, -404051, -377522, -335352, -293070, -341036, -381784]
11342c81784o0130k1315Q0230K9858j367l377l2180k0048R2069N5671l7063L3329
11330b66107M0559m3324o9666j280N2116O4380K0256O037k2108n0816L5389m0998
11318b75562k1070N6836q8430q5113M1428Q3222L6336j4060k2236l7368J4744
11307c11273n7219p2885j571J5925M975P6225m9408k0340j667m9444m907O8251
11295d03338N3617Q8728N4116l1419o5552k9034o735r130j4829j789j2542O2551
11283c15356R159j8066K3856K1149k054j0295j16483o0826M4133M9599J9190n0199
11271d06193M502O0460J14691O6868j9489o6605j468N45q5649r7212l5304P5544
11259c89310M2535r938n1814N3048P5842M340K9281m0291J1015L7474m8311p3059
$$ y = [-381784, -441914, -463229, -382999, -353141, -354508, -357885, -390065, -410113, -318044, -262373, -299436, -266107, -225548, -268872, -338538, -339818, -287702, -223322, -203066, -197029, -219137, -269953, -234564, -275562, -296632, -239796, -328226, -413339, -371911, -288689, -252353, -266413, -288649, -326017, -311273, -368492, -441377, -442948, -427023, -422048, -345823, -395231, -415571, -417238, -466682, -471589, -403338, -349721, -260993, -206877, -238296, -303848, -332882, -339617, -348747, -363576, -365365, -377907, -315356, -306197, -324263, -300407, -279258, -281312, -291607, -408090, -468916, -424783, -375184, -355994, -406193, -401691, -341231, -226540, -159672, -179161, -245766, -247234, -246689, -332338, -429550, -464854, -389310, -346775, -356713, -408527, -355479, -279637, -275297, -246016, -286307, -275292, -237818, -286129, -359188]
11247c59188K001K3059m2508o5206l5415J5656K5883o9556k8150O1138J9743j3971
11235d66514n2470m3066M257M3825m452k8052J5708O7354J5416j2831J091M8678
11223d11056q3259p4379l6126M9540M1266o4288n6973K933Q5512N5066j4253j09976
11211f15993K1289L1658L4768r389n8552p346K3249K5694k7965k6691Q1379L2654
11199d95245N5023L9752J4871n7013l5428j375m5395N847k4226O4785L2841o5111
11187e10674o1292M710O7697Q2897K397q3829j550k5754J1311o9406q01Q2174
11175e02120L3436o2642m3279j8795K4352m7500j06350N0132Q3077o375k0188
11164f16252J8960k6634K5851k0493K4589O2774J6235M5959o2143m1340P0887
$$ y = [-359188, -357187, -334128, -376636, -441842, -477257, -461601, -435718, -505274, -533424, -472286, -452543, -466514, -518984, -562050, -557793, -513968, -518420, -546472, -530764, -463410, -447994, -460825, -459734, -411056, -494315, -568694, -604820, -555280, -514014, -578302, -635275, -632342, -546830, -491764, -506017, -615993, -594704, -563046, -528278, -537667, -596219, -603565, -580316, -554622, -582587, -609278, -527899, -495245, -440222, -400470, -385599, -442612, -478040, -479415, -524810, -518963, -543189, -478404, -445563, -510674, -571966, -567256, -499559, -416662, -414265, -498094, -499644, -525398, -514087, -583493, -584294, -502120, -468684, -531326, -574605, -593400, -569048, -616548, -722898, -672766, -589689, -596064, -616252, -597292, -623926, -598075, -618568, -593979, -531205, -514970, -469011, -531154, -572494, -501607]
11153e01607J279K0872J8370l2256o1720q2208r873L0167j4648N101O0823o722
11141e72422Q5038N198j12209r6496N124K6054Q1774J6606n8306n0358m6153K2872
11129f93278m4729J9554P406N302K8034N7647O5786j777q485l9637l5055Q7452
11117e51780J5862q4541L8731o0906o2080o7009N5473R0810N1773j3207J2220
11106e74654n1441j9978K075r0041n406J4640J2448K9546l8037j5279N456L9038
11094f91633L4053L3693j8117K4377j2609L0112n7249N870J7485O241r6669k8036
11082g52482K524R349J03130L3278r066n4916K0437J0025K6311k282k5591L5774
11070f03509o4636r1150M1944p159r663M3234O904J968m5224k7051r069l1944
$$ y = [-501607, -500328, -479456, -461086, -493342, -555062, -637270, -647143, -616976, -631624, -626523, -565700, -572422, -487384, -482186, -594395, -690891, -685767, -659713, -577939, -561333, -619639, -669997, -716150, -693278, -738007, -718453, -711047, -705745, -677711, -620064, -554278, -556055, -564540, -604177, -639232, -551780, -535918, -620459, -581728, -642634, -704714, -771723, -716250, -625440, -573667, -586874, -574654, -626095, -646073, -643998, -734039, -739445, -724805, -712357, -682811, -720848, -736127, -730671, -691633, -657580, -623887, -642004, -617627, -630236, -600124, -657373, -651503, -634018, -627777, -724446, -752482, -749958, -740609, -637479, -604201, -613267, -668183, -647746, -637721, -611410, -613692, -639283, -603509, -668145, -759295, -717351, -724510, -734173, -690939, -684035, -682067, -727291, -754342, -763411, -795355]
11058g95355l469n1161Q553Q404P374j2441k3366k5582M4601J64334R5010K2789
11046e60309O6876O1828J3398p8599j0122R802p5711R854J9761O7547R1492j6896
11034d01079O1281Q3658K3745L1389m5854j29474m9415j5863q9690M9806J56009
11023c25487J25217J24146J10427K1002o4377j06922j82053r0362k5609M1483
11013c72535M0153N2748O2244O3685o5108K7630p4204l1796p8425p1579k4395
11002d71582n4078k0917Q4154O8970J0358J2699o0789j26581q7350k2142j5860
10991f83118m7470j4310l2079m2576k2410k8222j0954q9396K8253p333j8531M3041
10979i25105L3263J6705l1315K3679j8464j067K5475K339J8633n400k4535j05522
$$ y = [-795355, -798824, -849985, -841432, -833028, -825654, -838095, -861461, -887043, -842442, -678108, -583098, -560309, -493433, -431605, -418207, -496806, -506928, -497126, -572837, -562983, -543222, -475675, -384183, -401079, -339798, -256140, -232395, -201006, -246860, -376334, -425749, -441612, -531302, -481496, -325487, -200270, -76124, 34303, 55305, -9072, -115994, -298047, -388409, -414018, -372535, -332382, -279634, -217390, -153705, -218813, -191183, -265387, -297183, -375608, -447187, -471582, -525660, -546577, -462423, -393453, -383095, -370396, -431185, -557766, -645116, -667258, -683118, -730588, -744898, -776977, -819553, -841963, -870185, -881139, -970535, -942282, -949615, -968146, -925105, -891842, -875137, -906452, -882773, -901237, -902304, -876829, -874490, -855857, -861257, -885792, -991314]
10967i91314l546j0264l0254O3732n6060L1773K9034m7386K7982L1340l8430k5840
10955a019233m153L2947L3072j2194k7826o7822p673R9086L6368k8842l7167m2662
10943a046099r464k9625j6471j04264k4959P8449N1076N1576k6302j05193r553
10932a190829M9168J8677L2346r056j3792J1178K9183K5075j0888m8007m0818
10921a147763K1726l8175l006M4242N8489n9429q2235L9224J7796p6395K5688
10910a199838P624m020M1760K8299M3874J1016n6344J520l3492n3767o0544N9957
10898a213955k57l399K6998K1325J7334l5307m2113m3697m4462O5585L5452o8865
10886a285361q9995M8315J2900l3249j7373k0377k2210q470M5540j8829N0478
$$ y = [-991314, -994860, -1005124, -1035378, -971646, -1027706, -995933, -966899, -1014285, -986303, -954963, -993393, -1019233, -1023386, -990439, -957367, -969561, -997387, -1065209, -1072882, -973796, -937428, -966270, -1003437, -1046099, -1055563, -1085188, -1101659, -1205923, -1230882, -1152433, -1101357, -1049781, -1076083, -1181276, -1190829, -1141661, -1122984, -1090638, -1099694, -1113486, -1102308, -1073125, -1048050, -1058938, -1106945, -1147763, -1126037, -1164212, -1167218, -1122976, -1064487, -1123916, -1206151, -1166927, -1149131, -1225526, -1199838, -1192214, -1196234, -1154474, -1126175, -1082301, -1071285, -1127629, -1126109, -1159601, -1213368, -1273912, -1213955, -1214212, -1217611, -1190613, -1169288, -1151954, -1187261, -1229374, -1273071, -1317533, -1251948, -1216496, -1285361, -1375356, -1327041, -1314141, -1347390, -1364763, -1385140, -1407350, -1415820, -1370280, -1389109, -1338631]
10875a338631M8186J4192j9905m6102k7703M5002m3435J7018K6909k2660m9873
10864a397002O344k1047K6516O001P024K5354K2266P0627N364l0168k5944j6783
10852a321448m3622j3078j4487n6700K1894k8571K0800N5555J4102J9463j9134
10841a365226k4347n0566k4492l9809K0152M126Q054P4112l1564q0388m261m966
10829a519175J9356n1460l92l7813O775K5363k6592n3036k1083o5964k2104L0070
10817a716055M8390k0957j1710j4597m9465l918k6223m3045n3236O1543O4682
10806a764591j7105J9708j1015j2866j6603k6584k7806o2142P43J2205k5030r872
10794a940958j2854M5995N2767P354J0335q6393l9778m9822J3357M4450j0974
$$ y = [-1338631, -1290445, -1276253, -1296158, -1342260, -1369963, -1324961, -1368396, -1351378, -1324469, -1347129, -1397002, -1390658, -1411705, -1385189, -1379188, -1372164, -1346810, -1324544, -1253917, -1248553, -1278721, -1304665, -1321448, -1365070, -1378148, -1392635, -1449335, -1427441, -1456012, -1435212, -1379657, -1365555, -1346092, -1365226, -1389573, -1440139, -1464631, -1504440, -1484288, -1480162, -1472108, -1397996, -1429560, -1509948, -1514209, -1519175, -1499819, -1551279, -1551671, -1589484, -1582709, -1557346, -1583938, -1636974, -1658057, -1724021, -1746125, -1716055, -1667665, -1688622, -1700332, -1714929, -1764394, -1768312, -1794535, -1837580, -1890816, -1829273, -1764591, -1781696, -1761988, -1773003, -1785869, -1802472, -1829056, -1856862, -1919004, -1918261, -1906056, -1931086, -1940958, -1953812, -1907817, -1855050, -1847696, -1837361, -1923754, -1963532, -2013354, -1999997, -1955547, -1966521]
10783a966521n933k003l4971P1210K1521j06046n3893r197R660l250K7318L8657
10771b013448K3361l6645m9835m9880R3951M2206j39369n8791K2476j5624p0859
10760b252457p630L1663m4787r4683n852N424N0018L5626k9719o688j8416n8063
10748b395564Q354J1087O295l3761k2643k1268m767o051p4904m4159M8428J0054
10736b518899k1389K577o0750n954J3168l3831k3630J6123j1252k3344m0033k5242
10724b732456q299J363n3410m4266j53n3298j9699q793k6925k5919j7594p13l7649
10711c027811n6051j7092P2497M1729m1825J0192m9731l4410j6925r822n7380
10700c186629j7322o066m5423K6339l7141j0765q6424j35411m1426n3890m4566
$$ y = [-1966521, -1972454, -1974457, -2009428, -1938218, -1916697, -2022743, -2076636, -2085833, -2076173, -2079423, -2052105, -2013448, -1990087, -2026732, -2076567, -2126447, -2032496, -1990290, -2129659, -2188450, -2165974, -2181598, -2252457, -2260087, -2228424, -2273211, -2367894, -2373746, -2368322, -2318304, -2282678, -2312397, -2319085, -2337501, -2395564, -2387210, -2376123, -2369828, -2403589, -2426232, -2447500, -2452267, -2458318, -2533222, -2577381, -2528953, -2518899, -2540288, -2537711, -2598461, -2604415, -2591247, -2625078, -2648708, -2632585, -2643837, -2667181, -2707214, -2732456, -2740755, -2739392, -2792802, -2837068, -2837221, -2890519, -2910218, -2919011, -2945936, -2971855, -2989449, -2990162, -3027811, -3083862, -3100954, -3028457, -2986728, -3028553, -3018361, -3068092, -3102502, -3119427, -3129249, -3186629, -3203951, -3210017, -3255440, -3229101, -3266242, -3277007, -3363431, -3498842, -3540268, -3594158, -3638724]
10689c638724N4045K931p5853J6749o4360q5118j07710r887J0785J1424l7278
10678c922996k8748K1539K6948r291k6674q5021K8089J9233J34518J96886L10842
10667c334675M25807M51856K59349j74219l63837m19283l82381l18969k27282
10658d083634k49107j58637p5409j14202q9667p3701l4408j01553j00318l6914
10648e117550q2501j77581o8565k5293j76668j19676p1907p5045o1770r6330j17815
10637f190701j24907q2204J1606J16038J69784J99917J97235O2803K360p7876
10627e715945p618R7286K61303M99913O65868J062532J682310K401049L507015
10618D453713M809536O394596Q041668Q492146O493980K543114j024173k725045
$$ y = [-3638724, -3584679, -3581748, -3657601, -3640852, -3705212, -3790330, -3898040, -3907927, -3897142, -3885718, -3922996, -3951744, -3930205, -3903257, -3912548, -3939222, -4024243, -3996154, -3976921, -3842403, -3645517, -3334675, -2908868, -2457012, -2197663, -2371882, -2735719, -3155002, -3537383, -3856352, -4083634, -4332741, -4491378, -4566787, -4680989, -4770656, -4844357, -4878765, -4980318, -5080636, -5117550, -5200051, -5377632, -5446197, -5471490, -5648158, -5767834, -5839741, -5914786, -5976556, -6072886, -6190701, -6315608, -6397812, -6386206, -6270168, -6100384, -5900467, -5703232, -5640429, -5638069, -5715945, -5723563, -5626277, -5364974, -4865061, -4199193, -3136661, -1454351, 946698, 4453713, 9263249, 15657845, 23699513, 32191659, 38685639, 41228753, 40204580, 37479535]
10610C7479535k398435p26732J601791M589584Q430986J2985866J7262140J7956484
10602I7181219J1910951J145545p495977j0401046q710460m917014j75709N127762
10594H3665271J1141814J7659719K2792767K2073483J1565644m791473j6567084
10587A47540141j9292932j6356809j1503284o200101r55724M134552Q997111J2308856
10579A18671810J0837981K896113p917095j4919906j5725326j2959555r311044
10572G1572978n842193k724409o4703K014424K980904J925895j481099n435172
10564F2946625p835649q067633p161284n680827m513109l539564k709065k103052
10556B1336442j755203j433918j237048j063452r12976q32300q01567p40507o52197
$$ y = [37479535, 35081100, 34354368, 35956159, 40545743, 48976729, 61962595, 79224735, 97181219, 109092170, 110237715, 102741738, 92340692, 83630232, 78713218, 78537509, 83665271, 94807085, 112466804, 135259571, 157333054, 168898698, 164107225, 147540141, 128247209, 111890400, 100387116, 94187015, 93231291, 97365843, 106362954, 118671810, 129509791, 132405904, 124488809, 109568903, 93843577, 80884022, 71572978, 65730785, 63006376, 62941673, 64956097, 67937001, 69862896, 68381797, 62946625, 55110976, 47043343, 39882059, 34201232, 29688123, 26148559, 23439494, 21336442, 19581239, 18147321, 16910273, 15846821, 14933845, 14101545, 13299978, 12559471, 11907274]
10547A1907274n34631n23493n05611l94925k98617l92448l36743l31175k77798
10538H311833k41103k79011k37415k58544j63050j74923k16400j32416j62354
10529F446617j73598k07637j37268r7470j74662j97120j37322r0979j00648j10726
10519E019187k7077o7674m5297p6558r7083r2099j29827j72571j13389p5833m6071
10508D075708r2602r0463j13824j08316p1878m8484j07798n9507j03070n3438
10498C226328K5435n3255l3205p8466m2861k7260n6466n3125j4083j6035l8300
10487B838707k6462j16684k4009N245o1588o7963j24217j12994o2293m8393l9047
10476B160302m0402j24224k1907M8476o885N2620J8840o4495l2042r2505n3199
$$ y = [11907274, 11372643, 10849150, 10343539, 9948614, 9649997, 9257549, 8920806, 8589631, 8311833, 8070730, 7791719, 7554304, 7295760, 7132710, 6957787, 6741387, 6608971, 6446617, 6273019, 6065382, 5928114, 5830644, 5655982, 5458862, 5321540, 5230561, 5129913, 5019187, 4992110, 4924436, 4879139, 4802581, 4705498, 4613399, 4483572, 4311001, 4197612, 4121779, 4075708, 3983106, 3892643, 3778819, 3670503, 3598625, 3550141, 3442343, 3382836, 3279766, 3226328, 3251763, 3198508, 3165303, 3086837, 3043976, 3016716, 2960250, 2907125, 2893042, 2877007, 2838707, 2812245, 2695561, 2671552, 2676797, 2615209, 2547246, 2423029, 2310035, 2247742, 2199349, 2160302, 2119900, 1995676, 1973769, 2022245, 2015360, 2067980, 2086820, 2022325, 1990283, 1897778, 1844579]
10465A844579Q227m3029L124L7140k6674k1282l0960q8222q0203l2738L2901j2037
10453A590826n7271n434m8993m1809J7146m6001j13793o7345M0129L1033J3181
10442A311669n7363k140L7502J629m1104q3423p6458q4376m4007j8310r1353K1694
10430H73960K7425k1662n3345k2800O381O740r3263k7155o0276r7756p6106M0143
10418E02286l891l4038M938M4139p3817p7557l1323m1594M6476M8457P8529k4256
10406D38349k5449k3166l3170j6297o0821L205K5795n2834j05575o4655M4994
10395A30376L8993K3244n9545l440L6072q8684n071m1664j7917J0645l3615o0875
10383g1481j00424j12597j6908N9861R996m7316p9365j22235n1448M2597N5313
$$ y = [1844579, 1852806, 1809777, 1812901, 1850041, 1823367, 1802085, 1771125, 1682903, 1602700, 1569962, 1602863, 1590826, 1533555, 1528121, 1479128, 1437319, 1454465, 1408464, 1294671, 1227326, 1267455, 1298488, 1311669, 1254306, 1252166, 1289668, 1291297, 1250193, 1166770, 1090312, 1005936, 961929, 943619, 852266, 873960, 901385, 879723, 826378, 803578, 809959, 816699, 723436, 696281, 636005, 538249, 462143, 502286, 498395, 464357, 469295, 513434, 439617, 362060, 330737, 289143, 335619, 384076, 462605, 438349, 412900, 389734, 356564, 340267, 279446, 282651, 308446, 255612, 150037, 85382, 130376, 169369, 192613, 133068, 129628, 165700, 77016, 71945, 30281, 12364, 23009, -10606, -71481, -171905, -284502, -301410, -241549, -231553, -278869, -358234, -480469, -531917, -489320, -434007]
10372d34007M1132l4595k8540p2635l8583o7325j8932o699O066q8712n4588j9581
10360h16999K0415j9408q5189o0684r61J7555l1958n1248J0134N92k1103Q87p7537
10347a115504n6333q0398r6449j4431L7210p0852J0286P4324m8487l3297j14848
10336a508779q7040n7544j8364j9443r0825m2209p3431j05180p7817k3546J0065
10325b094113j5312k6296j22672j92824q9742N097Q406j5132k9955j07817o2477
10314b742837l1714l8302q1374o7464k1639j07865O455o7481j11384j22355m9945
10303c435905n9120l5215m3443j02870j28568o4829l9909l1505n6746m0872N5405
10292c983577r782p6249L066J2445J12015J69405K46382M90295O47978O21609
$$ y = [-434007, -392875, -427470, -456010, -528645, -567228, -634553, -653485, -660184, -654118, -742830, -797418, -816999, -796584, -815992, -901181, -961865, -962826, -945271, -977229, -1028477, -1018343, -1017751, -1038854, -1037967, -1115504, -1171837, -1252235, -1348684, -1363115, -1325905, -1396757, -1386471, -1312147, -1360634, -1393931, -1508779, -1595819, -1653363, -1671727, -1691170, -1781995, -1824204, -1897635, -2002815, -2080632, -2104178, -2094113, -2109425, -2135721, -2258393, -2451217, -2540959, -2535862, -2527456, -2542588, -2572543, -2680360, -2742837, -2774551, -2812853, -2894227, -2961691, -2983330, -3091195, -3084740, -3152221, -3263605, -3385960, -3435905, -3495025, -3530240, -3573683, -3676553, -3805121, -3869950, -3909859, -3941364, -3998110, -4038982, -3983577, -3993359, -4069608, -4066542, -4054097, -3942082, -3772677, -3526295, -3036000, -2388022, -1766413]
10282a766413L02051L0951j81091k20908J08609K67475N56597R04986J356785
10273A359042J853058K425722L187133M409238O323462R151409J3611068K1080023
10265F3400155L3289987N2935286Q0854359J06940365R6557069K3330820o0043040
10258C97265001q9022603p5719917n4177498l7554386k6443350j9211318j4449731
10251H0686198j1189345q761683p065135n647539m605242l846231l242917k781551
10243C3546555k402592k063016j748280j299219r62699p05130p69668j101897
10235B2494054j422177j412948j246262r53024q22039q00904o87906n82170n18472
10226A4048152n11229m53453l91452l56985m24374l42743l43959l01557k69087
$$ y = [-1766413, -1464362, -1433411, -1614502, -1835410, -1726801, -1459326, -902729, 2257, 1359042, 3212100, 5637822, 8824955, 13234193, 19557655, 28709064, 42320132, 63400155, 96690142, 149625428, 230479787, 337420152, 433977221, 457308041, 397265001, 308242398, 232522481, 178344983, 140790597, 114347247, 95135929, 80686198, 69496853, 60735170, 53670035, 48022496, 43417254, 39571023, 36328106, 33546555, 31143963, 29080947, 27332667, 26033448, 25070749, 24365619, 23595951, 22494054, 21071877, 19658929, 18412667, 17459643, 16637604, 15836700, 15148794, 14566624, 14048152, 13536923, 13083470, 12692018, 12335033, 11910659, 11567916, 11223957, 10922400, 10653313]
10217A0653313l72046l45601k67071j89970j70439k46658k23403j71148j96742
10208H470235j86216j33533j28335j47996k25970q7223m9571j05405j55941j74655
10198G075390k06017p5500r1030j17088j05357j57306q4277m3762o4040p0545
10188F060468r4612r5742m6137q1181m8677j29759p5507L4636m496p7315o1022
10177E380656n8620p8052q5736j5870k8081p133l0829n229r828q4703K4609J41298
10165E142482M1797k0443j06839j50340j16363p5352J9682m5128j740J26022Q7363
10154D901141J12191L3847n7117j17638k05804j42047j4726K3928r2309o006k0450
10143D415010J7066L7637P079k9998j01212j73995j04085j8786n8306m1655Q113
$$ y = [10653313, 10281267, 9935666, 9668595, 9478625, 9308186, 9061528, 8838125, 8666977, 8470235, 8284019, 8150486, 8022151, 7874155, 7648185, 7560962, 7511391, 7405986, 7250045, 7075390, 6869373, 6793873, 6702843, 6585755, 6480398, 6323092, 6238815, 6195053, 6131013, 6060468, 5965856, 5870114, 5823977, 5742796, 5694119, 5564360, 5488853, 5523489, 5518993, 5441678, 5380656, 5322036, 5243984, 5158248, 5142378, 5114297, 5107164, 5076335, 5071106, 5061278, 4976575, 5001184, 5142482, 5184279, 5163836, 5056997, 4906657, 4790294, 4714942, 4734624, 4689496, 4687756, 4813778, 4901141, 5013332, 5047179, 4990062, 4872424, 4666620, 4524573, 4509847, 4533775, 4441466, 4435460, 4415010, 4432076, 4469713, 4476792, 4446794, 4345582, 4171587, 4067502, 4048716, 3990410, 3948755, 3956868]
10132C956868j2363J3056l6791p2067j12494r5296n3771k0217q4923k6079p7032
10121C378891o4224m991P323k3127J0742l6917o6693n4076o8800n25L4211k0250
10109C091564k8845m9348j05582o634n250j562J8830N128l4895L0441J1385o2417
10097B862815o4047j0535N7173M9188j3333m3519p9278n221o9780m808m612j9127
10085B654916k1827j5976k0633n7329J2627o999l9562o1407m6626M612O2682k557
10073B461921p1550o0100l9187K4317O4616R5776P066k8252K8977m6355k5200
10062B412029R372k652j0927M8025j7114l8720o6184m0898q2312K9839O1990k4626
10050B277822r6472o7395K1109R1887P1824m100J3772j7436k2745r973q423p1901
$$ y = [3956868, 3944505, 3957561, 3920770, 3848703, 3736209, 3640913, 3587142, 3566925, 3482002, 3455923, 3378891, 3314667, 3309676, 3316999, 3293872, 3304614, 3267697, 3201004, 3146928, 3078128, 3077603, 3111814, 3091564, 3062719, 3013371, 2907789, 2901155, 2895905, 2894343, 2913173, 2918301, 2883406, 2913847, 2925232, 2862815, 2798768, 2788233, 2845406, 2894594, 2881261, 2837742, 2758464, 2753243, 2683463, 2678655, 2674043, 2654916, 2633089, 2617113, 2596480, 2539151, 2551778, 2544779, 2505217, 2443810, 2397184, 2401796, 2464478, 2461921, 2390371, 2330271, 2291084, 2315401, 2380017, 2475793, 2482859, 2454607, 2483584, 2437229, 2412029, 2421401, 2418749, 2407822, 2455847, 2438733, 2400013, 2333829, 2292931, 2210619, 2240458, 2302448, 2277822, 2181350, 2113955, 2135064, 2226951, 2298775, 2294675, 2308447, 2291011, 2268266, 2258293, 2249870, 2177969]
10038B177969j24014l041O682N0594M4514M896o0945m7947J0787K0562k576J5534
10026B093015L85q578n5333K8162K6124n3289o5594p2816n8996j0280k4839O1042
10014A859003R5750N324K0662l4520J2956L5046L3328Q390j1943o1542j4651Q7271
10002B035074j4521q7685o7392l5831J5300M672K2231O8772k4459n6064k2936
9991A837161k1440O443J7603K1106j3356l5428n1325k7289k984J2409m6086R570
9979A706384J749J8474N4122J1170N2054J8331M85j25842p3692J3111k870J1783
9967A685259j2115k1172p6579k298J06373O1380r4376j10484l3354J3471p414
9956A508691O2L7387p2066k4005Q4220P7925j7326l522N1776M1224K0833l8653
$$ y = [2177969, 2053955, 2050914, 2057596, 2108190, 2152704, 2157600, 2096655, 2048708, 2059495, 2080057, 2077481, 2093015, 2093400, 2084822, 2029489, 2057651, 2083775, 2030486, 1964892, 1892076, 1833080, 1822800, 1797961, 1859003, 1954753, 1960077, 1980739, 1946219, 1959175, 1994221, 2027549, 2035939, 2023996, 1962454, 1947803, 2035074, 2020553, 1932868, 1865476, 1829645, 1844945, 1849617, 1871848, 1940620, 1916161, 1860097, 1837161, 1815721, 1822164, 1839767, 1860873, 1847517, 1812089, 1760764, 1733475, 1730491, 1742900, 1696814, 1706384, 1708133, 1726607, 1780729, 1791899, 1843953, 1862284, 1862769, 1736927, 1663235, 1676346, 1673476, 1685259, 1673144, 1651972, 1575393, 1573095, 1679468, 1740848, 1646472, 1535988, 1502634, 1516105, 1508691, 1508753, 1546140, 1474074, 1450069, 1534289, 1612214, 1594888, 1591366, 1643142, 1684366, 1705199, 1666546]
9944A666546q9035k038j4640K6248l1649n0431L1965L9613r050L4829Q0689o6885
9932A616162k9310r928L965O9433j6141j31592p2606m0400N7145k040k150K5199
9920A467737l6529k0137J6690r1516l4675M7480O8540K6847l5140l64l3903r920
9908A365110K9025J6783L8669J2582M4898J6025j7131l6616n1722K0268l4936
9897A402955M624O8041j6681k7053J161L9659j8293m2083k5668r4534o814L4452
9885A319766J2117p232K2845j3188l9265j1324O4569O2047N1625n182p9543o6903
9873A310332J7056P689k5967L9996j3620m9302j3504P0119K9770L0829j5964p201
9861A380233n187N3170K6911J4728P0501J45926J77568J60563K82425N44063N63672
$$ y = [1666546, 1577511, 1575473, 1560833, 1587081, 1555432, 1505001, 1536966, 1576579, 1567529, 1602358, 1683047, 1616162, 1586852, 1576924, 1580889, 1650322, 1634181, 1502589, 1429983, 1389583, 1446728, 1444688, 1442538, 1467737, 1431208, 1411071, 1427761, 1336245, 1301570, 1349050, 1417590, 1444437, 1409297, 1408933, 1375030, 1365110, 1394135, 1410918, 1449587, 1462169, 1507067, 1523092, 1505961, 1469345, 1417623, 1437891, 1402955, 1407579, 1475620, 1458939, 1431886, 1433047, 1472706, 1454413, 1412330, 1386662, 1292128, 1285314, 1319766, 1331883, 1324651, 1347496, 1334308, 1295043, 1283719, 1348288, 1410335, 1461960, 1456778, 1377235, 1310332, 1327388, 1335077, 1309110, 1349106, 1335486, 1286184, 1272680, 1342799, 1372569, 1403398, 1387434, 1380233, 1375046, 1428216, 1455127, 1469855, 1540356, 1686282, 1863850, 2024413, 2306838, 2850901, 3414573]
9850C414573J72216k47028m05614l32748k50174k15280k26655j15873l3520o4241
9840A695656k4160p1006o6765n9148o3628K5539k9592k4619m4943l8637K2837
9829A321534O1342L2786R798n5125j5691k9067l7380K2179J8110l2516k0349p3466
9817A202155k4662L3483J4733j9316k5200k4251O1816N5268K844k6400j4973r7460
9805A138037m8260N5835P083j1600m2658o460M7548j1575j0347K6000J617j2412
9793A132808r204L6207J38532q111m4146l0902m7196l1359P0889N573n7090j1480
9781A144521l5667n234O1678J8548m5543m4303O5825k2023J0095L2158l4421j9241
9769A126393l9248m099L5510M1102k3508P285k5733L8603j4962o911R778k1223
$$ y = [3414573, 3586789, 3339761, 2934147, 2601399, 2351225, 2135945, 1909290, 1793417, 1759897, 1695656, 1671496, 1600490, 1533725, 1474577, 1410949, 1436488, 1406896, 1382277, 1337334, 1298697, 1321534, 1382876, 1415662, 1425460, 1370335, 1354644, 1325577, 1288197, 1310376, 1328486, 1295970, 1275621, 1202155, 1177493, 1210976, 1225709, 1206393, 1181193, 1156942, 1218758, 1274026, 1276870, 1250470, 1235497, 1138037, 1089777, 1145612, 1152695, 1141095, 1098437, 1091977, 1139525, 1127950, 1117603, 1143603, 1145220, 1132808, 1123604, 1159811, 1298343, 1290232, 1246086, 1215184, 1167988, 1136629, 1207518, 1213091, 1156001, 1144521, 1108854, 1103620, 1165298, 1183846, 1138303, 1094000, 1159825, 1137802, 1147897, 1180055, 1145634, 1126393, 1087145, 1083046, 1118556, 1159658, 1136150, 1143435, 1117702, 1156305, 1141343, 1134432, 1144210, 1122987]
9757A122987j9115O102j5927M101M239P399k931k6804J3312Q467M123m9463j00731
9744I55759n015Q0073K5937l6441m6130n3035M6265N2981L3408P8101L584l4235
9732A101252m2629o4022J002n4464p6783L9187l1719M5792R2861K976j5532r8287
9720H99634J385k6384m0209M8532M5606M3119O4851m963K1667j8197k1192j4085
9708I99764k1458K2116j3787K3396k5000k850m3292j14l456m6898k4224O705L4493
9695I05395m2355k3343K8725L4294n1378M6630R8654K838j1627J5910n6332k156
9683I45255J8237J573n3696p629j2370n6103j7954K7883L8941J9405R856j0477
9671I02921n7773N907N6303k3261n2745L4858L6027k8052k6446O2480O3382k5366
$$ y = [1122987, 1103872, 1109974, 1094047, 1098148, 1102387, 1109786, 1106855, 1080051, 1093363, 1101830, 1105953, 1056490, 955759, 950744, 1030817, 1056754, 1020313, 974183, 921148, 967413, 1020394, 1053802, 1131903, 1135487, 1101252, 1058623, 994601, 995603, 941139, 864356, 903543, 871824, 917616, 1010477, 1013453, 997921, 899634, 901019, 874635, 834426, 882958, 928564, 971683, 1036534, 1031571, 1053238, 1035041, 1013849, 999764, 978306, 1000422, 986635, 1010031, 985031, 982181, 938889, 938775, 935319, 888421, 864197, 870902, 905395, 863040, 839697, 868422, 902716, 851338, 897968, 996622, 999460, 987833, 1003743, 947411, 945255, 963492, 965065, 911369, 903740, 891370, 835267, 817313, 845196, 884137, 903542, 913398, 902921, 845148, 851055, 907358, 884097, 831352, 866210, 902237, 874185, 847739, 910219, 973601, 948235]
9659I48235J1268L9209N9467L5613J71145L21969P07542J181844J436827J94352
9649E107471r86801j068948o64088k88289k42869k46288j46954o8555q5482m3293
9639A265904K0284p1293r6841n3945m2020l2841R7051L0895j7044O8188p93k4728
9627A142817j29201l3856J1477l0535m2670n9662J0214R615O9469l2578Q788k1709
9615I02169L2483M2885K4084j8256O4431m9630q5170M745l3455p2204k4081N3098
9603H41099m6235l9904Q3003N8924N742L2497J0975p270j3444m518m6320l7916
9591H36633O369k0132O939O866L886n0434l8059J0336o4818j4020Q6604P1302
9579H41472N9305P5302o1223o3852m5461n6032p285K7302j1328L6774N7534k7527
$$ y = [948235, 959503, 998712, 1058179, 1093792, 1264937, 1586906, 2294448, 3476292, 4913119, 5107471, 4120670, 3051722, 2387634, 2099345, 1856476, 1610188, 1463234, 1394679, 1309197, 1265904, 1286188, 1214895, 1118054, 1064109, 1022089, 989248, 1086299, 1117194, 1100150, 1168338, 1167545, 1142817, 1013616, 979760, 991237, 960702, 918032, 858370, 868584, 878199, 947668, 915090, 923878, 902169, 934652, 977537, 1001621, 983365, 1047796, 998166, 912996, 917741, 884286, 812082, 788001, 841099, 794864, 754960, 837963, 896887, 902629, 935126, 946101, 938831, 925387, 920869, 874549, 836633, 843002, 822870, 829809, 836675, 840561, 790127, 752068, 762404, 697586, 683566, 770170, 841472, 900777, 976079, 914856, 851004, 805543, 749511, 742226, 769528, 758200, 794974, 852508, 824981]
9567H24981l0945L0300k5833N529L2817m4316M5408k8886o2302j0328R9085j1695
9555H23815k1874n1400m0524k9515J6083O8479j0671l3895m0299J5690m0500K2111
9543F77500P6415p056L4635k3107m4015m467m9454l0421J644N1976K5148L0203
9531G39001Q811K9093j0786p4482J038L0432K2698o9275o6042o9195RQ0361M0485
9518F62148L3364O4473J9801m4959K3744L2146M5849o1503L6739M7439n128M806
9506H58919j6226k5878m8917r432r698n8323q392N3267O6168K4317r014L9484
9494H56275O2880M422p5070r420k6404n3230l3062J0857O0858k9519n1551J4197
9482G31233n5368j7158K3826l0341K263J7862j1835L8780Q401o4139m5148k8987
$$ y = [824981, 794036, 824336, 798503, 804032, 836849, 792533, 837941, 809055, 746753, 736425, 835510, 823815, 801941, 750541, 710017, 680502, 696585, 765064, 754393, 720498, 680199, 695889, 655389, 677500, 753915, 746859, 781494, 758387, 714372, 709905, 660451, 630030, 631674, 683650, 708798, 739001, 747812, 776905, 766119, 691637, 692675, 723107, 745805, 676530, 610488, 541293, 541302, 621663, 662148, 695512, 759985, 779786, 734827, 758571, 790717, 836566, 775063, 811802, 859241, 854113, 858919, 842693, 816815, 767898, 758466, 748768, 690445, 682053, 735320, 801488, 825805, 816791, 856275, 919155, 923577, 848507, 839087, 812683, 759453, 726391, 737248, 798106, 768587, 717036, 731233, 675865, 658707, 682533, 652192, 654455, 672317, 660482, 699262, 707663, 643524, 598376, 569389]
9470E69389L2713N416m9593J7194L4864J9507J9021j6025K9592J7895K9367k449
9458G06891q538O3709k7814p8027m8959l8749N6237M3016J4028k3832n5936r032
9446E92994j4380M7705O2784L6354o6124r5224k2019Q4285L1895o197k60j7247
9434F34566N5798k7118l4665O012K8829J5096M5108N874k9900l7283j7876J1518
9422F55959m5952n1263J7063P6459m864m6814l0035j788N211K3570n5976L3979
9410E75549K3741L8741J9328k7856M6226P5699r7430r9300K5119R4606L0354n608
9398F99169n6573M5607N9648J1515o3752k3538j13204Q902O3005m2539k4522P5944
9386F39662P7158M1391o0842m9425o1977l5077q488o0360n4091j0226P4856Q8276
$$ y = [569389, 602102, 607518, 557925, 575119, 609983, 629490, 648511, 632486, 662078, 679973, 709340, 706891, 698353, 762062, 734248, 656221, 607262, 568513, 624750, 667766, 681794, 657962, 602026, 592994, 578614, 626319, 689103, 725457, 659333, 564109, 542090, 626375, 658270, 652073, 651813, 634566, 690364, 663246, 628581, 634593, 663422, 678518, 723626, 729500, 699600, 662317, 644441, 655959, 610007, 558744, 575807, 652266, 647402, 600588, 570553, 568765, 573976, 597546, 541570, 575549, 599290, 638031, 657359, 629503, 675729, 751428, 653998, 554698, 579817, 674423, 704777, 699169, 642596, 688203, 747851, 759366, 695614, 672076, 558872, 567774, 630779, 588240, 563718, 639662, 716820, 758211, 697369, 647944, 585967, 550890, 542402, 482042, 427951, 417725, 492581, 580857]
9374E80857j9683L9067M167k3137R5414O346m5936j9175K728m9725K149N7254
9362F30326M0162J7048r151J0566M6552k6789m3029K0310p2272j1941j7442j2888
9350E71452L3089Q282n4988K002l4879J8304L4257J06702J11689k5568r2400j5627
9338F62315k5841k8185K2917M0763m4775k2618n7520K6535Q1330q24O9860m8226
9326F75731n6588o6342j00177J9573M9636J7160l435l9099J1114P4676O9486n6933
9314E94802j15907m2170K8773M7436m5134k254r695K5492P564L4744N4386o3845
9302E14192p6789O0089O7982K128M0898n1101m2353N7068J4853l3386r370J9895
9290E64106N4270r399J6467K7930l6664K021L1463k918o3230m4685j4675L9961
$$ y = [580857, 561174, 600241, 604408, 581271, 676685, 683031, 637095, 617920, 620648, 570923, 573072, 630326, 670488, 687536, 678385, 688951, 735503, 708714, 665685, 685995, 613723, 601782, 584340, 571452, 604541, 612823, 557835, 559837, 524958, 543262, 577519, 684221, 795910, 770342, 677942, 662315, 636474, 608289, 631206, 671969, 627194, 604576, 547056, 573591, 654921, 654097, 723957, 675731, 619143, 552801, 452624, 472197, 521833, 538993, 535558, 496459, 507573, 582249, 651735, 594802, 478895, 436725, 465498, 512934, 467800, 465546, 455851, 481343, 488907, 523651, 578037, 514192, 437403, 497492, 565474, 567602, 608500, 557399, 515046, 572114, 586967, 553581, 544211, 564106, 618376, 608977, 625444, 653374, 616710, 618731, 650194, 647276, 584046, 539361, 524686, 564647]
9278E64647O2848L5786k7240l5990K9004q202p9642j22664Q873N514N2561Q074
9266D93569K5895o3347n1917K2289L0599M2142n6847n2243J05357J12061L4923
9255F42481k3565l4472k7784j8156o355N2441K8942l8669K395n138J1653M649
9243E88422P2477N5933R611j173J9515Q818p3903p3629o6639L1732M502p0685
9231E04981L1162M2030l9096M9929m3904j08013l6808J5755M6815j1824M3012
9220D94039P906l9046K9949Q2143K1730j6517k5299j9869l0239L1297N1293m0257
9208E47130m5016J3251O538M0956j4655J30915J53745L4983P273k3309P6674M2167
9196I70652n9696o7557m0529o2291l1455m3937p5211l2418k989k1043p0465o885
$$ y = [564647, 627495, 663281, 636041, 600051, 629055, 620853, 541211, 418547, 427420, 432934, 485495, 493569, 519464, 456117, 404200, 426489, 457088, 499230, 442383, 390140, 495497, 607558, 642481, 618916, 584444, 556660, 538504, 532149, 584590, 613532, 574863, 577258, 572120, 583773, 588422, 660899, 716832, 726443, 725270, 744785, 753603, 679700, 606071, 539432, 571164, 575666, 504981, 536143, 578173, 539077, 589006, 545102, 437089, 400281, 416036, 462851, 451027, 494039, 501945, 462899, 492848, 574991, 596721, 580204, 554905, 535036, 504797, 536094, 587387, 547130, 502114, 515365, 521903, 562859, 548204, 679119, 832864, 867847, 875120, 851811, 928485, 970652, 910956, 843399, 802870, 740579, 709124, 665187, 589976, 557558, 554569, 533526, 463061, 456176]
9184D56176K842P569R678k5961n320j63k7378L4003N6019k9811n9674M6568J4760
9171D79308q3484l2064K1299J3995N3049M2065L6726K8510L3536N9433J7041L5668
9159G05082P5050J25522J30750Q8055J6273j11100o6847n1017o5753j07833r6647
9148F41535k7951l6331k8577q5178j5934O3213J5827l2014N5633m9688r8409K9731
9136D31857N8497q918l1487n3970j4203K6048J2744o852O1645K7045M0176m8K045
9123E44579M191K7827M0961O3500k3469Q3067O7243K1787Q8807N2392j1774p5620
9111H83491q2713o4716n8392p5316n9309L5239N518K2817o0900n7152l9367L1342
9099D80542l4058M3292L8104k7206j4415k1375l0721Q3964M7989m6705J4260M6616
$$ y = [456176, 459018, 466587, 476265, 450304, 444984, 444821, 417443, 451446, 507465, 477654, 417980, 464548, 479308, 395824, 363760, 385059, 399054, 452103, 494168, 530894, 559404, 592940, 652373, 669414, 705082, 780132, 905654, 1036404, 1124459, 1140732, 1029632, 962785, 911768, 846015, 738182, 641535, 613584, 577253, 548676, 463498, 447564, 510777, 526604, 494590, 550223, 500535, 402126, 431857, 490354, 481436, 449949, 395979, 381776, 407824, 420568, 413716, 475361, 502406, 542582, 542534, 544579, 548770, 576597, 617558, 681058, 657589, 740656, 807899, 829686, 918493, 970885, 959111, 883491, 800778, 736062, 677670, 602354, 543045, 578284, 583802, 606619, 545719, 488567, 449200, 480542, 446484, 489776, 527880, 500674, 486259, 464884, 434163, 518127, 566116, 519411, 533671, 580287]
9087E80287o930r203k7771q6735J0163N2631r777L8443r900j7546O232J17392
9075F37286O6294K2868n797j3224J3193l8170o7323j48945q0925P525J02005J8586
9063E13373K7527K5299K0673l4635r2694k6408l5443o6762J5481K6314J1814l5914
9051C48625M5262M3270L0152j7883o8572j0953L7750k9567m4228j1547J1341O0745
9039C94395K8319o628M3985O7570o1334q343K0793Q733N1551K6441l7994k6052
9027E01436L9924p0365q8513Q568Q34l186L7969L6771j0385n2047R459O7991N7841
9014E36297k5243k4859L7084K426L9402m2470J4410P8325J6636o3856n6947l5521
9002D75684m7444n0503l547l0473K5229O0345l06N2446J9354m9896k2645M1366
$$ y = [580287, 573357, 564154, 536383, 449648, 459811, 512442, 502665, 541108, 531208, 513662, 519894, 637286, 703580, 726448, 720651, 707427, 720620, 682450, 615127, 466182, 385257, 392782, 494787, 513373, 540900, 566199, 586872, 552237, 459543, 433135, 397692, 330930, 346411, 372725, 384539, 348625, 393887, 437157, 467309, 449426, 380854, 369901, 407651, 378084, 333856, 322309, 333650, 394395, 422714, 416086, 460071, 527641, 466307, 457964, 478757, 487490, 539041, 565482, 527488, 501436, 541360, 470995, 382482, 391050, 391884, 388698, 426667, 463438, 453053, 401006, 410465, 478456, 536297, 511054, 486195, 523279, 525705, 565107, 522637, 537047, 615372, 632008, 568152, 511205, 475684, 428240, 377737, 374190, 343717, 368946, 429291, 428985, 481431, 500785, 450889, 428244, 469610]
8990D69610M2093m078o0961j506l574q0021o7961J9024O625M4077K2284k7858
8978C57754J0841N7079L8183j14342q5461K8824L5250M2857R8762J3445n8134
8967D25058n2135l2135m475Q889l0760M6430o380K0048N9850k6494n1228k7272
8955C29396O1233M1936k7023M7960l0363l4737K3627J2198k9618m0514J02015
8944D56110j4822n2658L364l2667L4005L208k5744n4813n3947l2421m4508Q1973
8932B67080O3670N0674k1155k1306K2991O7951l9987K10L0732J3776n4232o1007
8920C19397J5197N3224N5321j6384m8382k0945O310m8717m5635L0092Q453N2708
8908C60639K8185j878k8340N0166J3491m0409K25l372j1345m2100P533j509n0083
$$ y = [469610, 511703, 507625, 446664, 445158, 441584, 361563, 293602, 312626, 319251, 363328, 385612, 357754, 368595, 425674, 463857, 349515, 264054, 292878, 328128, 370985, 469747, 483192, 425058, 372923, 340788, 336313, 345202, 314442, 360872, 354492, 374540, 434390, 407896, 356668, 329396, 390629, 432565, 405542, 453502, 423139, 388402, 412029, 424227, 394609, 354095, 456110, 441288, 388630, 391994, 359327, 393332, 396540, 370796, 315983, 262036, 229615, 185107, 267080, 330750, 381424, 360269, 338963, 361954, 429905, 389918, 390128, 420860, 434636, 380404, 319397, 334594, 387818, 443139, 426755, 378373, 357428, 363738, 315021, 269386, 299478, 307931, 360639, 388824, 386946, 358606, 408772, 422263, 381854, 382079, 378707, 367362, 325262, 332795, 331286, 281203]
8895B81203o6308o637L4011J7985L9672k1041n8557J2028L4554l22L9658Q80K8348
8882C35474l1390J613l5303j1352K1602r456M7952O116n2129l6265L8892K9344
8870C05098J2426m6m5926j5949J0991L3643M8235K1186J6878m7107p1641m1067
8858B26721J6999R715m3042o521J7231J5115O8935M8294m5705k7539J9518L1469
8846C31190n1766J6856L7229m3247L9724N514J8933N4129P140l0284J8250n0331
8834C53337L2771M1620m4668o8727l8120O6777J6452k3623N0757o253o479K1111
8822C94955o8079o9143k3479k7054j6959J28844O3239l5498n005N9750J4439q7105
8810C28905j16128L536K8141N6575Q2190J9975q5174k3737K254o7971n316R5710
$$ y = [281203, 214895, 208258, 242269, 260254, 299926, 278885, 220328, 232356, 266910, 266588, 306246, 307126, 335474, 304084, 305697, 270394, 259042, 280644, 271188, 319140, 325256, 273127, 236862, 275754, 305098, 317524, 317478, 271552, 255603, 266594, 300237, 348472, 369658, 386536, 339429, 267788, 226721, 243720, 253435, 210393, 203872, 221103, 236218, 305153, 353447, 307742, 280203, 299721, 331190, 279424, 296280, 333509, 290262, 329986, 335500, 354433, 408562, 415702, 385418, 403668, 353337, 386108, 427728, 383060, 314333, 276213, 342990, 359442, 335819, 386576, 380323, 373844, 394955, 326876, 257733, 234254, 207200, 190241, 319085, 382324, 346826, 341821, 401571, 416010, 328905, 212777, 216313, 244454, 301029, 383219, 403194, 318020, 294283, 296537, 228566, 223250, 318960]
8798C18960O3715m8121j0020K2317O325N053M8798O3650m0497q7443n8731m3624
8786B40382L7682P4116j4827p7298J725j0307k120R782O3466l3768L110M3890
8774C35833J3380M9329n628k1043m7730m5432j8898k1215M1353R772J301J5069
8762C06091M1330j1609n3473k6469L9654M1198l1091j7467K4696m2512m2699L235
8750B30884P8680J4765L2210j5628L8237N5126n0476p4762K7944k7069k8755m6056
8738B35100j7482J7320l2625n441N4053M0429p492n5201M4893K2386L3263o8272
8726B60931p2546k5899L8586k908j8053k959M1030P9997J1412m0322j068M5667
8714C13868L5254Kr7443q8448l1368N8365O3038O9333K6469j6602l7706j2992
$$ y = [318960, 382675, 334554, 324534, 346851, 353176, 358229, 407027, 470677, 430180, 342737, 284006, 240382, 278064, 352180, 337353, 260055, 261780, 251473, 249353, 259135, 322601, 288833, 291943, 335833, 349213, 398542, 392914, 371871, 324141, 278709, 259811, 238596, 279949, 289721, 291022, 306091, 347421, 335812, 282339, 255870, 295524, 336722, 305631, 288164, 312860, 270348, 227649, 230884, 309564, 324329, 356539, 340911, 379148, 434274, 383798, 309036, 336980, 309911, 281156, 235100, 217618, 234938, 202313, 196872, 250925, 291354, 283862, 228661, 273554, 295940, 329203, 260931, 188385, 162486, 201072, 198164, 180111, 177152, 218182, 298179, 309591, 269269, 268201, 313868, 349122, 349124, 251681, 163233, 131865, 190230, 253268, 322601, 349070, 332468, 294762, 281770]
8702B81770J097K3865L5437N2428L11m7814p7719j0162K4428m7227L3317N1810
8690C21541j7007J885j9806O50m3802m7438M9010N8915Q5228L8279k4097j3825
8678C89533k8040l3963K2838p124K5502J8609K5326j9261m7245p335j5928N051
8666C27963n0780l5905M7401N2542m735m8740j4768M1876L1128j7331l0290l8254
8654B60107j07l258Q91K7979k7086l1753J7522l5406k7679k9816M2m454k0197
8641A26785P636Q6385L0905j6599K5398Q18R61j5657l3102m878m6941j0578L0254
8628A81387K7325N4504Q7954L2687j3761q0230n0896l2005N1912O1668K1677k3124
8616C19098K990J7422j7176o6694o0304k357j8573q349P424j4855j2123K3273
$$ y = [281770, 282867, 306732, 342169, 394597, 394908, 347094, 269375, 259213, 283641, 236414, 269731, 321541, 304534, 306419, 286613, 287263, 243461, 196023, 245033, 303948, 389176, 427455, 403358, 389533, 361493, 327530, 350368, 343244, 368746, 387355, 412681, 393420, 346175, 338840, 322912, 327963, 277183, 241278, 288679, 341221, 336486, 287746, 272978, 314854, 345982, 328651, 298361, 260107, 260000, 256742, 257633, 285612, 258526, 226773, 244295, 208889, 181210, 151394, 151436, 146982, 126785, 134421, 220806, 251711, 235112, 260510, 261328, 262289, 246632, 213530, 208652, 161711, 151133, 181387, 208712, 263216, 351170, 383857, 370096, 289866, 238970, 206965, 258877, 320545, 342222, 319098, 322088, 339510, 322334, 255640, 195336, 192979, 174406, 166057, 173481, 158626, 146503, 169776]
8604A69776K671q4175J2667P0948R4369K3503m9976m3866Q498p410O2391J367
8592B60763n1358q342Q34j0007n7746j625M8852O6185K9422k4541q9497J164K7779
8579A91883n732P7964N0075q687o7143m369L3571O7397M842l2597k3341j074j2292
8566B70497M961O8792o060j3967j7195K9821J7872k6243m1469j5200m4242l4809
8554A92758k2513K3142o576J2228p123K6446p605k7449j7939M2904K3292j6929
8542B14636J6375k3299n536P139q145O2474K2831P256r24p1128L6708J01520Q969
8529C68876o1478j8649K5018o294p7707L512L985m1965j8703M8931o632K0999
8517B39893K794q814M0142J0210l1112N892M9562n410k3258k759O1114N1193o1813
$$ y = [169776, 172447, 88272, 100939, 171887, 266256, 289759, 239783, 195917, 204415, 197005, 259396, 260763, 209405, 201063, 201897, 191890, 134144, 132519, 181371, 247556, 276978, 252437, 162940, 164104, 191883, 186151, 264115, 314190, 305503, 238360, 233991, 267562, 334959, 339801, 307204, 283863, 282789, 270497, 275458, 344250, 338190, 324223, 307028, 336849, 354721, 328478, 287009, 271809, 227567, 192758, 170245, 193387, 186811, 199039, 191916, 218362, 210757, 183308, 165369, 208273, 231565, 214636, 231011, 207712, 202176, 209315, 201170, 263644, 286475, 293731, 292807, 221679, 258387, 359907, 368876, 307398, 288749, 313767, 307473, 229766, 233278, 237263, 195298, 176595, 225526, 218894, 239893, 242687, 233873, 274015, 284225, 253113, 259005, 308567, 303157, 279899, 277140, 338254, 389447, 327634]
8504C27634n7998K3014j1821o7807N640M5851M5613k2576J0781K7310J2963m3111
8492B95493p6833q2316M5265M3739L388l3293L3050J3354n8590P8092P956J65
8480B69470o78j00012k1851N9551N6229L2625p4636K3809J7216l1892o97O1600
8468B90734J9873o1815m8809J16294N8100q3728p7617k3605J4921l1327M359L4368
8456B11748l2816K0308K6831p767j7382J4617q022K1606K4994R192k4012J1751
8444B51048l5728J4120J2455j8541J0646Q299Q593M0832j8520J7582m0941K2806
8432B72651k9257M103n1306J0109O2122O5988j0268o3319m9059R6891N673p9796
8420B34532j9878P5732K8182p0278o6704K4872L8752j0139J3794k8688N9686K854
$$ y = [327634, 269636, 292650, 280829, 213022, 218662, 264513, 310126, 287550, 298331, 325641, 338604, 295493, 218660, 136344, 181609, 225348, 228736, 195443, 228493, 241847, 183257, 261349, 269305, 269470, 268792, 168780, 146929, 206480, 262709, 295334, 220698, 244507, 261723, 229831, 229134, 290734, 310607, 248792, 199983, 316277, 374377, 290649, 213032, 189427, 204348, 173021, 177380, 211748, 178932, 199240, 226071, 218304, 200922, 215539, 207517, 229123, 254117, 263309, 239297, 251048, 215320, 229440, 241895, 223354, 234000, 242299, 250892, 291724, 273204, 290786, 249845, 272651, 243394, 247497, 196191, 206300, 268422, 334410, 324142, 260823, 211764, 308655, 314328, 234532, 214654, 290386, 318568, 248290, 181586, 206458, 245210, 235071, 248865, 220177, 279863, 282717]
8408B82717J7578m9662n8457n796O7604P408j2130l0079k3556r1293M3190n3526
8396I3998j4605O6859k779K2278K4532m0369K8727R079k8285l7085j8404k5877
8384G8069O0070L6286L4043K4791O4459o5717p2564N8135J8938K9239K1042k3860
8372B62931l6924m2995j0432M1696O266m0322m8144n2402O0875M6397Q0451j3701
8360B53696n0829k5294p634J0777M5117j780k2272N2769N3588J2278o3221m1316
8348B15879o687K1593p097L1534m9265o4288j8006K2982J1430j1419M5347k3355
8336A68648N4353Q0137L7870j0370o3040K7684J3753R075l4412k268j230j3313
8324B66887k9918n5928K4443K8862Q864l1207p2723r093L6767N5555J5373M7984
$$ y = [282717, 300295, 250633, 192176, 186380, 253984, 261392, 249262, 219183, 195627, 104334, 147524, 93998, 79393, 146252, 143473, 165751, 190283, 149914, 178641, 187720, 159435, 122350, 103946, 78069, 138139, 174425, 208468, 233259, 297718, 232001, 159437, 217572, 236510, 265749, 286791, 262931, 226007, 183012, 172580, 214276, 220542, 180220, 132076, 79674, 140549, 186946, 267397, 253696, 202867, 177573, 169939, 180716, 225833, 224053, 201781, 254550, 308138, 320416, 257195, 215879, 209192, 230785, 223688, 255222, 205957, 141669, 123663, 146645, 158075, 146656, 192003, 168648, 223001, 303138, 341008, 330638, 267598, 295282, 309035, 318110, 283698, 281430, 280200, 266887, 236969, 181041, 205484, 234346, 243210, 212003, 139280, 130187, 166954, 222509, 237882, 285866]
8312B85866j9592k3247K7273m961K4665k5631o5141l7165K6764O5176J6027j1340
8300B58694k5416l9597J2315M4145q357J7241K7810q158L5358J6145k6666l0642
8288B72872n1513k7686m7078L3712O1419m353M0749M3768o5326m3343m0375r878
8276A62968m2979k5414J6820O2293q5557l1077N1291l7269K5605J7941J9712K8532
8264A62866J9041j09924R640J0825k6799O5154P3110j1626n4471m5719L6365K483
8252A30945L1997P3284l9921m9546j4151M967J1971m0423j023J302k0812k1811
8240F6779K3106O2644r982n1408N6433J537k2187Q414L4172J7330l5056l4812
8228A16970k4167K7598J9791M6572M170M5783N8081O8253K8755j6182K1016j1102
$$ y = [285866, 266274, 243027, 270300, 265339, 290004, 264373, 199232, 162067, 188831, 254007, 270034, 258694, 233278, 193681, 205996, 250141, 241784, 259025, 286835, 278677, 314035, 330180, 303514, 272872, 221359, 193673, 146595, 180307, 241726, 237373, 278122, 321890, 256564, 213221, 172846, 162968, 119989, 94575, 111395, 173688, 88131, 57054, 108345, 71076, 96681, 114622, 134334, 162866, 181907, 71983, 81623, 92448, 65649, 130803, 203913, 192287, 137816, 92097, 128462, 130945, 162942, 236226, 196305, 146759, 132608, 137575, 149546, 109123, 108100, 109402, 88590, 66779, 89885, 152529, 142547, 91139, 147572, 149109, 126922, 135336, 169508, 186838, 151782, 116970, 92803, 120401, 140192, 186764, 190934, 236717, 294798, 363051, 391806, 375624, 396640, 385538]
8216C85538m8283o8022q574m4715k4877L6334l887o331O3670k7653r8047L3452
8204A88605P3983J7719P228q6269q2471J3196R53p491Q2121j5251o6561N0168
8192A75930M2587M624q844N9524K4135m7011J7243j7335k1307P6338J6766o1399
8180B61251O3943N1679m5934n6102k9169q97m2755l775M59l6931N1870L4095n9525
8167A88209o3946K6787P6062L8789J4133l1239q5008L9442J12585l8137m6292
8156B31385l8483Q2071O0262K3434o6907q1698m5555j7645N492J7666L244mn1571
8143A21691j23129l2897Q6831M1673P4397P324k1925j721Q3087l3826l3707q6283
8131H1515l2895Q5409P818j7722n555k2664l8511O8485O9252K0798K9585r6327
$$ y = [385538, 337255, 269233, 260659, 215944, 191067, 227401, 223514, 217183, 280853, 253200, 155153, 188605, 262588, 280307, 287535, 201266, 118795, 131991, 132944, 125453, 207574, 192323, 125762, 175930, 218517, 223141, 214297, 273821, 297956, 250945, 268188, 250853, 229546, 305884, 322650, 261251, 325194, 376873, 330939, 274837, 245668, 244771, 202016, 198241, 198700, 161769, 213639, 247734, 188209, 124263, 151050, 227112, 265901, 280034, 248795, 163787, 203229, 315814, 277677, 231385, 192902, 274973, 335235, 358669, 291762, 210064, 164509, 146864, 152356, 170022, 173266, 173262, 121691, -1438, -34335, 52496, 94169, 168566, 175890, 153965, 152244, 235331, 201505, 167798, 81515, 48620, 134029, 141847, 124125, 118570, 95906, 57395, 125880, 195132, 215930, 245515, 149188]
8119A49188o4077n2124k4447J4547o064M760J7565K4584n7217p365k1650N102
8107a7198K7322j4403l1441O1015Q4941K3938n3370k8422J7671M9146K3508L7504
8095A80211k6626j3650k4688J3738k2094l6997K9876K6542O235m7902M96K7303
8083A12444K0204N4356o6518l3988K4758m098L265K7052l5725K8998J3652M7443
8071A91843N838O505J4033l4189n3001l925K4127n9104j7616K7190l2384m1761
8059B7556J6686o1411K8430P6739M8236n2282j18976J1587M8752L3202k4172L443
8047C7790j7575J9860l0405q353M4929j1307n0818L2159R789J6323L0141q937
8035F3596Q535K9574l6227l1013n5040o7409K2178L6908J6935j6841L9200k7720
$$ y = [149188, 85111, 32987, 8540, 23087, 17023, 21783, 39348, 63932, 6715, -650, -22300, -17198, 10124, -4279, -35720, 25295, 110236, 134174, 80804, 52382, 70053, 119199, 142707, 180211, 153585, 139935, 115247, 128985, 106891, 69894, 99770, 126312, 132547, 84645, 85141, 112444, 132648, 187004, 120486, 86498, 111256, 107158, 110423, 137475, 101750, 130748, 144400, 191843, 197681, 204186, 218219, 184030, 131029, 127104, 151231, 92127, 74511, 101701, 69317, 27556, 44242, -17169, 11261, 88000, 136236, 83954, -35022, -23435, 25317, 58519, 34347, 37790, 20215, 40075, 9670, 1317, 46246, 34939, -15879, 16280, 26069, 42392, 72533, 63596, 72131, 101705, 65478, 34465, -20575, -87984, -65806, -28898, -11963, -28804, 10396, -17324]
8023a7324n8460J7058Q2337L8518O242l9961n239q2004j5581M322J3751R0406
8011C4065K7182k963K232n581K7235k4730n9354l804M9945R2275k2556r1569K0085
7998D2462M2467J3100n0637J7114P753o4714o3206J0229K4383J2987K8001R068
7986B9007K0034j1041l2074j4584J2460n0372J0368M6984n569r4378q9064L3087
7974a45142J10233l7532m4949J5419o740N2823K975K0380M5968L3938L8202J1030
7962I6605J6742p2339k5066L374J3727n8475q3243k0853P8696O4454J53085L19636
7950D86343M10091Q81986J675647K587374K932657J399417j326045k377985j922365
7941D747120j283325q42575n37722k95708k64005j70331q6545j04081q1480q5577
$$ y = [-17324, -75784, -58726, 23611, 62129, 68371, 28410, 23171, -58833, -74414, -70092, -56341, 34065, 61247, 58284, 60516, 54935, 82170, 57440, -1914, -5718, 44227, 136502, 113946, 22377, 42462, 84929, 98029, 47392, 64506, 72259, 7545, -55661, -45432, -21049, -8062, 19939, 29007, 49041, 38000, 5926, -8658, 3802, -46570, -36202, 10782, 5213, -89165, -178229, -145142, -34909, -72441, -117390, -101971, -108711, -55888, -52913, -32533, 13435, 47373, 85575, 96605, 113347, 41008, 15942, 19316, 33043, -25432, -108675, -129528, -50832, 13622, 166707, 486343, 896434, 1778420, 3454067, 6041441, 8974098, 10373515, 9047470, 6669485, 4747120, 3463795, 2621220, 2083498, 1787790, 1523785, 1353454, 1266909, 1162828, 1081348, 995771]
7931I95771p7469p1953k662p44l2189r9523p7004n8168n8341m028o6284j3356
7919D34050n7798l0520L5611N2330j8857q2954K778P3025J29014J37677J48369
7908H22725L01016O75182J256677K255433K781662J560183o33595j966531j925080
7899E127672j313510q17927n73470l42365k36785k48475k68505j50890r4202k9285
7889A052258P174k9085l9674p5113n6951Q132q6332m9040m8971l1907l3065p8168
7877E39258q887J3724L3788m2060n2810l5894K4577N5077q832q5741M629Q9m6193
7864C90725N30j461k3178Q389L0242m711N391l8269n670k397l3096K6538K0595
7851C73628j03601l3711K2485K2519K2291J9354j5978J558N0756K7167m3951o3205
$$ y = [995771, 918302, 846349, 843687, 842943, 810754, 711231, 634227, 576059, 517718, 513690, 447406, 434050, 376252, 345732, 381343, 433673, 414816, 331862, 334640, 407665, 536679, 674356, 822725, 1123741, 1798923, 3055600, 5311033, 8092695, 9652878, 9019283, 7052752, 5127672, 3814162, 2996235, 2422765, 2080400, 1843615, 1595140, 1326635, 1175745, 1081543, 1052258, 1059432, 1030347, 990673, 915560, 858609, 866741, 780409, 731369, 682398, 650491, 617426, 539258, 530371, 544095, 577883, 535823, 483013, 447119, 471696, 526773, 517941, 432200, 436829, 436918, 390725, 391255, 389794, 366616, 375005, 405247, 400536, 405927, 367658, 361988, 359591, 326495, 353033, 373628, 270027, 236316, 258801, 281320, 303611, 322965, 306987, 308545, 359301, 386468, 342517, 279312]
7839B79312l8109K0552L7910K1507j9778j7112J002p8684p0476j036R8097O1037
7827B94222k3855j3270L1075j2060O883J6008k4566j7337k4551P395Q5199L4103
7815C59246q904l8937o6018R178M6362K6994Q021k4714k7384o879l1445o6659
7803A78861r925N7472L577m17J2714O2019J9424N3880K440k2821r8285k9431L0858
7790B60366L3080n027L6604N424k1183n1714j5815l7603p2144m0377R0222L3659
7778B15492m9399L3601M004K8013n8618q325L9467n6047p3153j9898J8667K1267
7766I5071j1719L3158K4312Q080p7946R5968N9725K4119R263N3678K501j6972
7754B99238q5841j8088K3859n4360l8158M2509O9185K2420P54m8846n897J3917
$$ y = [279312, 241203, 261755, 299665, 321172, 301394, 284282, 285284, 206600, 136124, 135088, 233185, 294222, 270367, 257097, 288172, 276112, 282995, 299003, 274437, 257100, 232549, 239944, 325143, 359246, 350342, 311405, 245387, 254565, 300927, 327921, 335942, 311228, 283844, 276965, 245520, 178861, 168936, 226408, 229985, 229568, 242282, 304301, 323725, 377605, 380045, 357224, 258939, 229508, 260366, 293446, 288419, 325023, 330447, 309264, 257550, 241735, 204132, 131988, 91611, 181833, 215492, 166093, 199694, 203698, 231711, 173093, 164768, 204235, 148188, 75035, 55137, 73804, 95071, 83352, 116510, 140822, 148902, 70956, 166924, 226649, 250768, 260031, 313709, 316210, 299238, 213397, 195309, 219168, 164808, 126650, 169159, 238344, 260764, 261518, 212672, 206775, 220692]
7742B20692l3033K4623R312N2588J5117k8109J7927l9775k109K3168J1247j4241
7730B57407n0171j2063k5352l4694K0473j1364j3155l573J6711O7968K113Q549
7718B22849m1950L1699j8432k9180M7012M5812L1907m9329o3240k1452M1253M0697
7706B37646Q239O951K9769m7903o1247M275K7185P411k5425O347j1198o2900p0419
7693D8731P5027N6173k4312n053P4437L423l4009k6370J1111j0606K978o399J6561
7680A81692J9515n065l2017M578K2552J1235k4060J8278L8772q4710q4241j5903
7668E0626L4128n0888J0787M3064J5667K8084K00k0709l9363L5106r576K5962
7656A23088J6872M6854j4775o1719P2066J21895Q7854J4462q8332l9429j04422
$$ y = [220692, 187659, 212282, 221594, 274182, 289299, 261190, 279117, 239342, 237233, 260401, 271648, 257407, 207236, 195173, 169821, 135127, 155600, 144236, 131081, 127508, 144219, 212187, 214300, 222849, 180899, 212598, 194166, 164986, 211998, 257810, 289717, 240388, 177148, 155696, 196949, 237646, 245885, 252836, 282605, 234702, 173455, 177730, 204915, 212326, 186901, 193248, 182050, 119150, 48731, 123758, 179931, 155619, 150566, 225003, 228426, 194417, 168047, 179158, 168552, 171530, 165131, 181692, 201207, 196142, 164125, 168703, 191255, 202490, 178430, 196708, 235480, 150770, 66529, 50626, 84754, 33866, 44653, 87717, 103384, 131468, 131668, 110959, 71596, 106702, 97126, 123088, 139960, 186814, 172039, 110320, 182386, 304281, 392135, 406597, 318265, 278836, 174414]
7645A74414j4106l4416k2219J5591K9914N3575P080k8174Q765l841n6936j6219
7633A13428N7891m6357l3682j599K3072K0658k5923j7466r0149k5924J10097O2532
7621A46578N1894k8245L3611L9175j9870m4488l3161j17184o298M387O922R2599
7609A25920R7500o4305l8633K7545m0841L9742M869n3170l1949o9176l7871M1697
7597A328J26297j8636r2178N4332L0089L1737j2662K7400l0702j2913J10O2676
7585A66878M9846k0496l6562L1446O3294P6451k5850l8298k358j5974o0282l4349
7573A53746K2917k1549k3685n379N9333r174K8628k5737L5608J554j1172M357
7561B09447o5161l5499l8646m9719N1418R5530O5086K6847M896j4480K035M637
$$ y = [174414, 160308, 125892, 103673, 119264, 149178, 202753, 209833, 181659, 190424, 186583, 129647, 113428, 171319, 124962, 91280, 89681, 112753, 133411, 107488, 90022, -127, -26051, 84046, 146578, 198472, 170227, 203838, 243013, 223143, 178655, 145494, 28310, 22012, 26399, 33321, 125920, 223420, 159115, 120482, 148027, 107186, 146928, 151797, 98627, 66678, -2498, -40369, 1328, 127625, 108989, 16811, 71143, 101232, 132969, 120307, 147707, 117005, 104092, 104202, 166878, 216724, 196228, 159666, 191112, 254406, 330857, 305007, 266709, 264351, 248377, 188095, 153746, 176663, 155114, 131429, 126050, 185383, 176209, 204837, 179100, 214708, 216262, 205090, 209447, 144286, 108787, 70141, 20422, 71840, 167370, 232456, 259303, 264199, 249719, 251754, 256391]
7549B56391n418k7293j193l035k7510k2652p1409J4827r47j4569j0839N0747l3198
7536A03902n119O70j1752O0444M8475R1881k7739p6458k6268l8483l7456j8347
7524F3750n179j709J5433k2620o769Q961L5664J286k9291l3625k6006M8697L0649
7511G9241J6490M3528K5392k8425m7410j8055L9018M3625m6985o3864L4183R2235
7499A68973O236l2152K1028J7741k2195K4891M544l9489K6045K8862p9073p8020
7487D7391p7032J6044Q6919Q2610m12m0317q7433j3081N5624J6200M4804K2772
7475A54089l7839j8847K3155l7037L1843N3241L540O943J2051q558m8240N4001
7463A88342m482q005J0756L6353n401l1995L3754n6971j8414J1869J4687m5292
$$ y = [256391, 250973, 223680, 222487, 219452, 191942, 169290, 97881, 112708, 111761, 97192, 86353, 137100, 103902, 98783, 99453, 87701, 148145, 196620, 288501, 260762, 184304, 158036, 119553, 82097, 63750, 58571, 56862, 72295, 49675, 42906, 51867, 87531, 88817, 59526, 25901, -105, 48592, 79241, 95731, 139259, 164651, 136226, 88816, 70761, 109779, 153404, 106419, 42555, 76738, 168973, 175209, 143057, 164085, 181826, 159631, 184522, 189066, 149577, 175622, 204484, 125411, 47391, -29641, -13597, 73322, 155932, 155520, 115203, 27770, 14689, 70313, 86513, 131317, 154089, 116250, 97403, 120558, 83521, 115364, 168605, 172145, 179088, 191139, 182581, 134341, 188342, 183860, 175855, 186611, 222964, 217563, 185568, 219322, 162351, 143937, 155806, 170493, 125201]
7451A25201r037j802j4815O373l9317j0883O2283K0214j3698O784r537Q296k7917
7438A02145n997m8691k476K0727K3390J7927N905o9738Q1142M5159q9950K5739
7426A05282Q0531k1583k3527p3282n4884o5539n694P4424L7217M9507M8357l6983
7414A13826J0175j5746J7954n5280o8001j6385j036P1349N1984J3190J7835l1048
7402A08817M0194o712k9676J8102L4068n2874P071j7669K1485m508J6501J9649
7390A54448K089j3127n5586L9846Q296l9492j4528j1538J293K95O112R987L3647
7377A21742p791O0877K7308o8088j8178L6434N6236M8182q4817o5354L568m448
7365A05671m8932l3278J5807j9419k495K0764j9553N3976N6994K0810J2944o1278
$$ y = [125201, 116164, 114362, 99547, 105920, 66603, 55720, 118003, 138217, 124519, 131303, 121766, 130062, 102145, 96148, 47457, 44981, 65708, 89098, 107025, 112930, 43192, 124334, 169493, 79543, 105282, 185813, 164230, 140703, 67421, 12537, -53002, -58696, 15728, 52945, 102452, 150809, 113826, 124001, 108255, 126209, 70929, 2928, -13457, -14493, 56856, 108840, 122030, 139865, 108817, 149011, 142299, 112623, 130725, 164793, 111919, 118990, 101321, 122806, 118298, 134799, 154448, 156537, 143410, 87824, 127670, 135966, 96474, 81946, 70408, 71701, 71996, 78108, 88095, 121742, 113951, 174828, 202136, 134048, 115870, 152304, 208540, 256722, 171905, 106551, 110119, 105671, 56739, 23461, 39268, 19849, 17354, 38118, 18565, 72541, 129535, 150345, 163289, 102011]
7353A02011K2187l8376j1180m50M3716l3676k2189j2561J8646K9331k7111n241
7341F5107M691K1330M6749q3214J1887j8644k2436r503j3462J3392K7089j0998
7329C1988J4178l2124l2235J620N1798K5897P0282J9942k2230K2275R961j4565
7317A46787M6338j8248L0920p7573m6698j7497k7063j906M0435m3088J0645O9376
7305A12428J1190o01j031l9696K9661L07j0140k446K6740K8438n9835m139J3841
7292A04717J31318l2008r9370j1335k4983J8076k0982l1803K6408O4623K5966
7281A50627q2142K4963L974o5265n0564P414j6550o893j4634N249p855j8165K8543
7268d1298M0831M8631J7298O773M118M9143n0573m7871J5995N317m1361q628n254
$$ y = [102011, 124198, 85822, 74642, 74192, 117908, 84232, 62043, 49482, 68128, 97459, 70348, 65107, 69798, 91128, 137877, 54663, 66550, 47906, 25470, 15967, 2505, 15897, 42986, 31988, 46166, 14042, -18193, -16573, 35225, 61122, 131404, 151346, 129116, 151391, 161352, 146787, 193125, 174877, 205797, 128224, 81526, 64029, 36966, 35060, 75495, 32407, 43052, 112428, 123618, 123017, 121986, 82290, 111951, 112258, 102118, 99672, 126412, 154850, 95015, 90876, 104717, 236035, 204027, 104657, 93322, 68339, 86415, 65433, 33630, 60038, 124661, 150627, 68485, 93448, 97422, 32157, -18407, -10993, -27543, -34436, -49070, -43821, -51676, -69841, -41298, -467, 48164, 65462, 72235, 76353, 125496, 74923, 27052, 43047, 48364, 7003, -1625, -6879]
7255f879J06502K1362n8347j0808j3797m2511L0753j9156j993N9234Q2886n214
7243A42032n2033N0172L0315j5439q4086m0986l7602q183J4194R835Q2115N6058
7231A46392j0923l3388J2792J6554p0543r9099J6165l8145j8806P6140O6403Q563
7219G2105K9700M0999K8767k4050L2635M088o0088k29J070k6086j07153j2870
7207b1112L3783O1132j1859j9691n2202Q212O1384j2706k0328J1820L2503k5876
7195D5060m1093k1768L0090R3402P3580l2594j7328r6982K2020J7436p0979K0095
7183B0939M7395Q9083O9370J0169j13376r1777M0303O6309n093n5701J5369k6309
7171F6681O5866l7586k9876Q588O6150O1436J89r6131p5461M7799j1037J2039
$$ y = [-6879, 99623, 120985, 62638, 51830, 38033, -4478, 26275, 7119, 5126, 64360, 147246, 142032, 89999, 140171, 170486, 155047, 70961, 29975, -7627, -15810, -1616, 8219, 90334, 146392, 135469, 102081, 114873, 131427, 60884, -38215, -22050, -60195, -79001, -2861, 63542, 72105, 101805, 142804, 171571, 147521, 180156, 184244, 124156, 123927, 124997, 98911, -8242, -21112, 12671, 73803, 61944, 42253, -9949, -1737, 59647, 46941, 26613, 38433, 70936, 45060, 3967, -17801, 12289, 105691, 179271, 146677, 129349, 32367, 54387, 71823, 844, 20939, 68334, 157417, 226787, 236956, 123580, 31803, 72106, 138415, 133322, 77621, 92990, 66681, 132547, 94961, 65085, 73673, 139823, 201259, 201448, 105317, 29856, 77655, 66618, 78657]
7159G8657M4356O7440n0302p1270m0958l4025K9149N9363j9567M0308O1379L5914
7147B00444m5185p9710k9704k1303j8992o4174J3122P4820j1020J3298k4596O2583
7135F9583L7590L3249K1722K1700m2140o7930l7242M7013J9863l5293j6407j2415
7123C9293L6908l3883k6863j6271O3342J2576l0477L9311N7816L2444L1393p3310
7111A32279q5936m4626M1620p515K9198K273k5774p601L3029l5117n7859m1678
7099f7707O2782L1029Q384J6019m4519m7832Q9237O4304k4064m9867Q137K1409
7087F7312k8032m4515Q688Q8483Q1687Q3333o4582j17307l7879R5037P0081j02378
7075I9928l5913L5606J2957k3578J294J1692K4047j9317l8739k5187K8959K0088
$$ y = [78657, 123013, 190453, 140151, 68881, 27923, -6102, 23047, 82410, 62843, 103151, 164530, 200444, 155259, 75549, 45845, 24542, 5550, -58624, -45502, 29318, 18298, 31596, 7000, 69583, 107173, 140422, 162144, 183844, 141704, 73774, 36532, 83545, 103408, 68115, 51708, 39293, 76201, 42318, 15455, -816, 62526, 75102, 44625, 83936, 141752, 174196, 205589, 132279, 46343, 1717, 43337, 35822, 65020, 67293, 41519, 33918, 66947, 31830, -26029, -67707, -4925, 26104, 34488, 50507, 5988, -41844, 47393, 111697, 87633, 37766, 45903, 67312, 39280, -5235, 3453, 91936, 173623, 256956, 192374, 75067, 37188, 132225, 202306, 99928, 64015, 99621, 112578, 89000, 90294, 101986, 126033, 106716, 67977, 42790, 71749, 91837]
7063I1837J7337J3424n0458k0530n5118l3533M0077L7740j9757k3532K406n400
7051e507J1687j2236N6462L1350k4961l1955R819o2658O922K7140N1512L6782
7039I4357j5871k5894k2823L4315L1444K2053L9942k4526o970O0422k2295k9385
7027A34769k995j9312M4069K7596k4285k2335j1387j2587k6089k9789p1811k104
7015a6260j4659Q621L489r421L533L2507L0750m5625k8918M9749L8627L9914j1186
7002H1121r4570k458L8640J0711J138M661j3450l5933k55M7810l4977n3980M5477
6989f065N4777P3995n6717r6001l6537P2970K8459q4662J3922Q230O0276K2182
6977E4829k4155j3914j8806j3759m91N0438L9221l0465k4810K0618N9335j7161
$$ y = [91837, 109174, 122598, 72140, 51610, -3508, -37041, 3036, 40776, 21019, -2513, -107, -5507, 6180, -6056, 50406, 81756, 56795, 24840, 34659, -27999, -21077, 6063, 57575, 94357, 78486, 52592, 29769, 64084, 95528, 117581, 157523, 132997, 126027, 186449, 164154, 134769, 131774, 112462, 156531, 184127, 159842, 137507, 126120, 113533, 87444, 57655, -14156, -16260, -30919, -22298, -18809, -28230, -24697, 7810, 38560, -7065, -35983, 13766, 52393, 92307, 81121, -13449, -15907, 22733, 33444, 34582, 39243, 25793, -10140, -10395, 37415, 2438, -51542, -6065, 48712, 122707, 65990, -30011, -66548, 6422, 34881, -49781, -35859, -27629, 32647, 54829, 30674, 16760, -2046, -15805, -16296, 34142, 73363, 42898, 18088, 38706, 98041, 80880]
6965H0880K021Q449j6889m1751O966k4140N163J603J1416n4155n8768k0643L5334
6952f4514P0023L9746K0169n192k9128K0521M4168j4518K4591L327N320o5382
6940D9131j9139J4259k0655j509J0165K926q247j0000N3329K6589L8629O555J4855
6927A56888m9126m5521l6977M1509l238N576J6099m4973j0249L5974j2229K95
6915E4028J31J33J1523K4266j2029m1578M878K1431q2455j8343P229n760L7780
6902A234K8919o4336p16j9315J1627o3412P8268P3777l9072j3995M9822K6197
6890F8998o9903J9328O4020k7712L0784m910r0767K304L4934j5321p8566p2014
6878a38825j2805R4855P8705J0388O2139K7526K497p6122j9538p933M8683K4478
$$ y = [80880, 82901, 91350, 74461, 32710, 39676, 15536, 20699, 22302, 33718, -20437, -79205, -99848, -64514, 5509, 45255, 65424, 60232, 31104, 51625, 95793, 81275, 105866, 109193, 114513, 49131, 29992, 44251, 23596, 22087, 32252, 35178, 26931, 16931, 70260, 96849, 135478, 142033, 156888, 107762, 62241, 25264, 66773, 63535, 69111, 85210, 40237, 29988, 65962, 53733, 54028, 54159, 54292, 65815, 90081, 78052, 36474, 41352, 62783, -19672, -38015, -30786, -36546, 1234, 30153, -34183, -34899, -54214, -42587, -105999, -27731, 46046, 6974, -7021, 42801, 68998, -905, 18423, 82443, 54731, 85515, 80605, -10162, -7858, 27076, 11755, -66811, -138825, -151630, -56775, 21930, 32318, 94457, 121983, 124480, 48358, 28820, 20887, 69570, 94048]
6866I4048O2702r154o6807o0099L071J1975O8200J5246j5298l8615L608J647k9324
6853D1200k3857K2226l3136K6480P664n598Q460K3796n8008l0579k246M7998P0582
6840I4982L7544k2072l1210m1755o9774M52M9812P3058j8270m6604K2548j1894
6828C6817k9820j480J7780l114K3093l5628J8729M7003k6601o7182N0146k6495
6816C248l0584N5189J02287m975q8555j052O8888l5463k9680k7690L5427M0189
6804H7229n1453J2390K1712n607k2296L7279L2331J0703J6770K4660l9801j25952
6792b035m3283N7807O9628r116q908J9003k3894j2875L9668R254K3825P3800n1429
6779A41445m3878o3120l6618J6333k4501J7312K4402P4270J8661m8233n7944p4979
$$ y = [94048, 156750, 147596, 80789, 20690, 23761, 35736, 103936, 119182, 103884, 65269, 68877, 70524, 41200, 17343, 39569, 6433, 32913, 40577, 34979, 43439, 67235, 9227, -21352, -23598, 24400, 94982, 132526, 110454, 79244, 37489, -32285, -31833, 17979, 91037, 72767, 26163, 48711, 36817, 6997, 5517, 23297, 20183, 43276, 7648, 26377, 73380, 46779, -20403, 29743, 3248, -27336, 27853, 130140, 125165, 36610, 35558, 104446, 68983, 39303, 11613, 47040, 87229, 35776, 48166, 69878, 64271, 41975, 79254, 111585, 122288, 139058, 163718, 123917, -2035, -45318, 12489, 82117, 73001, 64093, 83096, 59202, 46327, 85995, 95249, 119074, 192874, 141445, 97567, 34447, -2171, 14162, -10339, 6973, 31375, 105645, 124306, 76073, 18129, -56850]
6767e6850K6246N4197K840k7197n1011M7210j2156j0387L3530K217J580L0441
6755D0660K3750j4396j8580l1514K2963P511k2972Q523j188l1971k9543N815K0884
6742b0058K007K849j167L5984N8102J1423q795k8829o7262Q001J48J2717M0080
6729D5200L4123O8691J1156k5247n3847o1270j489k492M7136N163J0135l109J0102
6716H4252j9140k3318m0613j9249o5686K2281P238k3142N4691j5561K2183l0537
6704d6601O626K3159M4139k749J2394l4697M775K1031m0742j0605j9907O1068
6692A7891L9134K1611l5977N00L3541n4337o7356L1862L7299q5959O2964J26518
6680A27691j5827n604K621q8172n51K4641O945J1810J6072p843L9552r963k9729
$$ y = [-56850, -30604, 23593, 26433, -764, -51775, -4565, -16721, -27108, 6422, 8639, 10219, 40660, 64410, 50014, 31434, -80, 22883, 30394, 7422, 15945, 14757, -17214, -46757, -40942, -20058, -18051, -15202, -16369, 19615, 77717, 89140, 80345, 51516, -15746, -7745, -7597, 5120, 45200, 79323, 148014, 159170, 133923, 80076, 18806, 17317, 14825, 61961, 67124, 77259, 74150, 84252, 65112, 41794, 1181, -18068, -83754, -61473, -54235, -77377, -22686, -38247, -16064, -46601, -39975, -16816, 27323, 24574, 36968, 2271, 7046, 28077, -12665, -23270, -43177, 17891, 57025, 78636, 42659, 43159, 76700, 22363, -44993, -13131, 24168, -61791, 1173, 127691, 111864, 106260, 108881, 20709, 20158, 44799, 51744, 63554, 79626, 71783, 111335, 101372, 71643]
6667G1643L888K0507L3583K1994N780l3735k6126q6083J0204M4502M2233j6942
6655I1448k8164p109J0321l444q830k4849q8523l8050k781L9779N1370N4661N5028
6642A00857p3329o3501k4926j6860K6257N7J7486L864K9654J115L2108N5103o172
6629H1713k221m9436p2209k9791n150j6355K3985Q0333K0380J8913o3620j8406
6617c1864K6256K6014K982m915j3241j4624K6311M7977j2822n002J05679K6524
6605A79275m1736n7287K5868n9448n2750k7945O685R382K1880r521J0373K6724
6593C1500R1771M181m7042k3986J6679R402P0124M435j26692k907q4393m5948
6581a02876K275L6673M1531N7913l454n4430O5244O8623K1409j7956m4942n3509
$$ y = [71643, 75531, 96038, 129621, 151615, 157395, 123660, 97534, 11451, 21655, 66157, 108390, 91448, 63284, 56175, 66496, 63052, 54222, 29373, -59150, -97200, -99981, -60202, -8832, 45829, 100857, 27528, -35973, -60899, -77759, -51502, -51445, -33959, -30095, -441, 674, 32782, 87885, 81713, 79492, 30056, -42153, -71944, -77094, -93449, -69464, 10869, 31249, 50162, -13458, -31864, -5608, 20406, 23388, 18473, 5232, -9392, 16919, 64896, 52074, 47072, 152751, 179275, 137539, 80252, 106120, 46672, -6078, -34023, -27338, -17956, 3924, -5597, 4776, 31500, 123271, 127452, 80410, 56424, 73103, 82505, 152629, 157064, 30372, 27465, -56928, -102876, -100601, -63928, -22397, 35516, 32062, -22368, 42876, 111499, 132908, 114952, 70010, 16501]
6569A6501k9092Q7127P641j2431N746k8190k5021L9346m494o6019K979n163L3856
6556B2786R359J6937O06Q4420q692j04050o9697j1065J0225P645k0045M4628K4465
6543G522l139J1998K9152N2920l7788k6652l8723j06461m3070l0470J8439P1491
6531i4781K2841Q877p5715K7221Q0293P5893L2017K4501n1340j1782n3441k580
6519a7996m2382k5348J25217L8152m6941L1483M9657K2791N32q8421p746L6323
6507G5321l3808q635N777m3799m3826M8785Q7637R075m9421m1039L8083N3680
6495I7830P8744K6941r2645l0900q010l5213n3879O8737Q010q0267m0084L1144
6483b9592M1021k6168N9635N2643l4105o5531M2034m2009q1767l0214N0943K7294
$$ y = [16501, -12591, 74536, 82177, 69746, 75492, 47302, 22281, 61627, 57133, -8886, -5907, -11070, 22786, 32145, 49082, 49688, 134108, 125416, 21366, -48331, -59396, -49171, -41526, -61571, -16943, 7522, 4383, 16381, 45533, 98453, 60665, 34013, -4710, -111171, -154241, -184711, -166272, -94781, -71940, -63063, -138778, -111557, -31264, 44629, 76646, 101147, 49807, 38025, -15416, -17996, -60378, -85726, 39491, 77643, 30702, 62185, 111842, 134633, 135165, 46744, 38998, 75321, 41513, 32878, 38655, -5144, -48970, -185, 87452, 96527, 47106, 6067, 44150, 97830, 176574, 203515, 110870, 79970, 71960, 36747, -17132, 51605, 59615, -20652, -60736, -29592, 11429, -14739, 44896, 97539, 63434, -2097, 39937, -2072, -83839, -114053, -63110, -35816]
6471c5816J6165j846j7593L346N8533k5011j2881j6261M8797J8855l2970M7236
6459E0554L1811K3999k3516L488j8428j5843n1093p2384K6000N4586O9732L2891
6447A11797N1330j3598k9939p6583j6553m0104n1729j271J7354J4801N7005K5251
6435D7761L594k1749n5567K7687L4199l7070l4419M5512L0867j7398k1711j0566
6423h860j8163j6656j2658O3653P8626J0733p5806n0701M0823M6890j8049l5586
6411D246m5451K7688K1260L647P0939K2539O0281L7752n7094q080m6795n5838
6399C5094o4320J3554M0159n6439n295M0812k1324J1162q775J830l3155k9386
6387g6083j1527k679r335Q6755L4140j0119L4433k1497L5629k9800O7935L9514
$$ y = [-35816, -19651, -21497, -39090, -35744, 22789, -2222, -15103, -31364, 17433, 36288, 3318, 50554, 82365, 106364, 82848, 86336, 67908, 52065, 972, -71412, -45412, 9174, 78906, 111797, 163127, 149529, 119590, 43007, 26454, -13650, -65379, -66650, -49296, -34495, 22510, 47761, 51355, 29606, -25961, 1726, 35925, -1145, -35564, 9948, 40815, 23417, 1706, -8860, -27023, -43679, -56337, 7316, 85942, 96675, 20869, -29832, 10991, 57881, 39832, 4246, -41205, -13517, 7743, 11390, 82329, 104868, 165149, 202901, 145807, 137727, 90932, 35094, -29226, -15672, 24487, -31952, -37247, 3565, -17759, -6597, -15372, -13542, -46697, -76083, -87610, -90289, -99624, -12869, 21271, 11152, 45585, 24088, 59717, 29917, 97852, 137366]
6375A37366l7941j7166L8365L1503j4234p9667j5274J910m8226K0643o7567j4199
6363f4487R7896P690k8197L3422l5569k4671o0009m8573J907L8268R282K398J07293
6350C6650K8514o178l9582m1007k3886n3679J6728K9525J00420M77l2311m5827
6338c0156j6676P890J5693N5154M1690O266l6584j7431o1297l6063P336k9646
6326i3824N936j6742o505K3970q323J3434O1300K2659L787k2247n562J8459M0335
6313C6677J1837l3424k2069k890k6923j0361J5579J3123M7264r810q6161r8514
6301a65672l9256N4022Q2880K5134L1418R650m3748L786p8168l303P3864l2213
6289h1606L545O3136O9708m3606J9141J8264l0881k4237N4056k2719k8414J8980
$$ y = [137366, 99425, 82259, 120624, 152127, 137893, 58226, 42952, 44862, -3364, 17279, -50288, -64487, 33409, 41099, 12902, 46324, 10755, -13916, -73925, -122498, -120591, -82323, -73041, -70643, 36650, 65164, 58986, 19404, -21603, -45489, -99168, -82440, -52915, 47505, 47982, 15671, -30156, -46832, -38942, -23249, 31905, 73595, 79861, 43277, 25846, -35451, -71514, -64178, -93824, -87888, -104630, -111135, -87165, -95488, -82054, -20754, 1905, 5692, -16555, -22117, -3658, 36677, 48514, 15090, -6979, -9869, -36792, -47153, -31574, -18451, 28813, 19003, -67158, -165672, -204928, -150906, -68026, -42892, -11474, -1824, -45572, -41786, -119954, -123257, -49393, -81606, -78061, -14925, 54783, 11177, 30318, 48582, 17701, -6536, 47520, 24801, -3613, 15367]
6277A5367m355K7902j6409K1442M606n2324k4571m3749M2057P5411K1668p002
6265F0043m7584l891J4205l7021M9938J1736p6199J7334K2998J6609j2169q0016
6253f4017k4011J0239J6520M9761M669k9991k1161M1733M8609j2247J9395o075
6241C3424l6091j4760L6514K7292J9807L1016m349l1813K1236j8107k1176k5066
6229A7927j0010L1865j3925J3253n8257M142N6902L896j182j347l235p998K9446
6216F1477K2805J4646K6129k6949l9433j8250j6393J6790p395o7965l1912o616
6204g3066O1941P9793m0806l2560o1938J9292M0N267k8271k4876O2773m400r38
6191c7749j1043p6122K0340M1355J8361L4144N4089O4780K5682q9466m5112Q520
$$ y = [15367, 11012, 38914, 22505, 43947, 48553, -3771, -28342, -72091, -30034, 45377, 67045, 60043, 12459, 8568, 22773, -14248, 35690, 47426, -28773, -11439, 11559, 28168, 15999, -64017, -88028, -77789, -61269, -11508, -6839, -36830, -57991, -16258, 32351, 20104, 39499, 33424, -2667, -17427, 19087, 46379, 66186, 97202, 92853, 61040, 82276, 64169, 42993, 17927, 7917, 39782, 25857, 39110, -19147, -15005, 41897, 45793, 44611, 43264, 40029, 32031, 61477, 84282, 98928, 125057, 98108, 58675, 40425, 24032, 40822, 33427, -34538, -66450, -73066, -11125, 68668, 27862, -4698, -66636, -47344, -47304, -42037, -70308, -95184, -32411, -36811, -37749, -48792, -124914, -104574, -63219, -44858, -10714, 43375, 108155, 133837, 44371, -741, 7779]
6179G779M4704L0259k3446O0760L0830j5810o9295m7280L9327n3979p5391L1296
6167d0246M8463J2834j1423l9643J9760P1821m263J4460n6196q6577O204J2548
6155e2258K9573m2091O4712N6405k322k2654q1170O190R1818q11l3281j5757K2909
6142B1263N7160m8970n6963m8674m8080n1543K091L9519P8439R5602m1106k0501
6130b1763K9452m062k5393M2792N2269k7710m9593O049k5656j0596k1269k277
6118e7757M0734K8706n8927J2714K4241k9461j2123R862K534j9959J4959m6987
6106i1464j510M2475M0514K2430O856j9697K4264j3659m1889K7555L5665j9636
6094A1904j0839K0412n048j7142r1508n3393P4787k1976m0975N6497M6035j9115
$$ y = [7779, 52483, 82742, 59296, 120056, 150886, 135076, 65781, 18501, 57828, 3849, -71542, -40246, 8217, 21051, 9628, -30015, -10255, 61566, 57303, 71763, 15567, -71010, -64806, -52258, -22685, -64776, -64, 56341, 54019, 31365, -49805, -43615, 48203, 47392, 14111, -1646, 21263, 78423, 29453, -27510, -76184, -124264, -175807, -173716, -134197, -55758, 39844, -1262, -21763, 7689, 3627, -21766, 21026, 73295, 45585, -4008, 2041, -23615, -34211, -55480, -57757, -17023, 11683, -47244, -34530, -10289, -39750, -51873, -42011, -39477, -59436, -44477, -91464, -92974, -50499, -9985, 12445, 19301, -396, 23868, 10209, -31680, -4125, 31540, 11904, 1065, 21477, 16429, -713, -92221, -145614, -70827, -92803, -133778, -77281, -31246, -50361]
6082e0361k1339L0019l0578m0723Q6673L1165k1841j8337L2723l6694j6609K9378
6070b6524J7476k3581p0680O081k706k964N6741M2802L2867p8660p5278M7873
6058g6553J6049O468k9725o1812p5O4777O2214J1107j7920n9075n5281J225L0438
6045a08163M3302j9609R725l5666N9020M6560l75J0720q4331L900M2475O6362
6033C3920l2534o1768k048k6832k6059N0629O2460L8418m4405m253O1721o9507
6021b0258k7291Q37l4496o526Q3165L7143p0182l9325M5432N642p4894n4343N969
6008a49127L602L9625K074M6915J705J4265m4876K7956l646k0071K6483M0412
5996a4683J0638J2335j4736K016O838p414p976P0234n0192k5612K4266l1293l2632
$$ y = [-50361, -71700, -41681, -72259, -112982, -26309, 4856, -16985, -35322, -2599, -39293, -55902, -26524, -9048, -32629, -103309, -97228, -99934, -102898, -46157, -3355, 29512, -49148, -124426, -76553, -60504, -54036, -83761, -145573, -145648, -80871, -18657, -7550, -25470, -84545, -139826, -138601, -108163, -64861, -84470, -74745, -110411, -51391, -4831, -5206, 5514, -78817, -74917, -32442, 33920, 1386, -60382, -62430, -89262, -115321, -64692, -2232, 36186, -8219, -12472, 49249, -20258, -47549, -46712, -81208, -87734, -4569, 32574, -37608, -76933, -31501, -25859, -100753, -155096, -149127, -145525, -105900, -103826, -56911, -55206, -40941, -85817, -57861, -61507, -81578, -55095, -14683, -4045, 8290, -6446, -4430, 2408, -5006, -12982, 57252, 7060, -18552, 5714, -25579, -58211]
5983e8211J5228Q090o895K3129K7144K742M0855N2199l3819q2648k716L4280N2376
5970G1754j1441m6370r1697J4821J4876n9855J2264k8106j0565L9563Q0449M5512
5958C1205Q4021L2818k3635q7678p4282N2234L5229l9185r068K1075j1203j5172
5946c641L796K3597p7265m3364L4032L9060O8536J2451K19o703q2511J3709P1236
5933E3152l4519k7011j0142K2494k909M86K7543N206L720J1713k6354j339l4726
5920a2686j3879P2964N5393j4366j3414P86p5971j0683k1617O306o2363n358K1504
5907g3384P507M5381k198m2800m4588K1504P3480j1438j8584J7484K2003l2833
5895c8466j336k4849L0761Q664j7635J19070M4623m4378j2200R256n5928K411
$$ y = [-58211, -42983, -34893, -41788, -18659, 8485, 11227, 52082, 104281, 70462, -12186, -14902, 19378, 71754, 60313, 13943, -77754, -62933, -48057, -107912, -95648, -123754, -134319, -94756, -14307, 31205, 115226, 148044, 124409, 36731, -37551, 14683, 49912, 10727, 1659, 22734, 11531, -3641, 155, 23752, -53513, -96877, -62845, -23785, 44751, 57202, 57421, 50718, -31793, -18084, 53152, 18633, -8378, -18520, 3974, 1065, 1551, 29094, 34300, 38020, 49733, 23379, 22040, -12686, -26565, 46399, 101792, 87426, 74012, 74798, -1173, -11856, -33473, -27167, -89530, -94888, -73384, -65877, -20496, -22694, -65494, -110082, -88578, -15098, -26536, -45120, -27636, -5633, -38466, -39802, -64651, -33890, -25226, -42861, 76209, 120832, 76454, 64254, 73510, 17582, 19993]
5883A9993L5432n1866o5536L1528N5688m2908q937M517k1601l703j621M1279O118
5870a617k0316o866J1245o0174p6544L8202P2839J0808N61j8542M0220m1766o2621
5857a14571J7762O8665M4432O9635l6569l43M4569n4781J0655l922r570M87M4228
5844H0677J0405m577l4314j37628n9369L3533J4333R306Q981L4608N8356l7738
5832b3427L1578M6226J6595l1587j9470m313m2616m0523K0191M0573k9782j9596
5820e6151K1385j2735J3101L2730R046m8438L5496M9492k0419l5726o421L099
5808a5541j3469r5856L5859Q7973O2530j9303k4604l1004p7733l0682K0571N2604
5796d8655J5119m9J3010o2150j6176j4961J4930j0625m0251J2488P0275J8086
$$ y = [19993, 55425, 3559, -61977, -30449, 25239, -17669, -26606, -22089, -43690, -47393, -49014, -7735, -1617, -21933, -28799, -17554, -77728, -154272, -116070, -43231, -32423, -31862, -50404, -10184, -51950, -114571, -96809, -28144, 16288, 85923, 49354, 49011, 93580, 38799, 49454, 45532, 35962, 36449, 80677, 91082, 86505, 52191, -85437, -144806, -111273, -96940, -87634, -78653, -44045, 14311, -23427, 8151, 54377, 70972, 39385, 19915, 15602, -27014, -67537, -47346, -6773, -36555, -56151, -34766, -47501, -34400, -1670, 7376, -41062, -5566, 43926, 23507, -12219, -18640, -15541, -29010, -124866, -89007, -1034, 61496, 42193, 17589, -13415, -91148, -121830, -101259, -48655, -33536, -33585, -20575, -82725, -98901, -113862, -98932, -109557, -149808, -137320, -67045, -48959]
5784d8959m3540k4636k5707K4430Q5245J5451j4540O895O0405P7957k6132m4577
5772D2292J3637L6263J2371l9618m5595l3805l4955J6187m6156k2906M3666o050
5760f4669K0573M3422k2950O404J1931n6602J767Q359O8780M3969J2221J9498
5748I2703k7064m6131q3270o4547k2044j5255Q1514n495l1804Q8433L7779l3103
5736b8284j3438M9208M9744m4273L054K9043M7387M530p5815n864L0694q43L45
5723D5488l4185n9012o4267N1724R808p061l1236M166k4432j7813Q997K2409K5973
5710f9441j1170M1297j6189L9522j5731p266L5974L4322k3055k4931M874q949
5698b0743k2553K3682Q9567K2691m3218n5098J8085L3114j1601k0486m3013K9870
$$ y = [-48959, -92499, -117135, -142842, -118412, -33167, -17716, -32256, -25361, 35044, 113001, 86869, 42292, 55929, 92192, 104563, 64945, 19350, -14455, -49410, -33223, -79379, -102285, -58619, -64669, -44096, -674, -23624, -17220, -5289, -61891, -60124, -51765, 17015, 60984, 73205, 92703, 65639, 19508, -63762, -128309, -150353, -165608, -84094, -89589, -121393, -32960, 4819, -28284, -41722, 7486, 57230, 12957, 16011, 45054, 92441, 96971, 21156, 15292, 45986, 45143, 45488, 11303, -47709, -111976, -60252, -50444, -57505, -88741, -84575, -109007, -126820, -117823, -95414, -69441, -80611, -39314, -55503, -15981, -31712, -38978, -3004, 31318, 8263, -16668, -11794, -20743, -43296, -19614, 69953, 92644, 49426, -5672, 12413, 45527, 33926, 13440, -29573, 297]
5686B97L7653k0870L4750R93k9101n0317k7487M1956K9736r689r872n7449m9785
5673a09185N9675q597K238K1761L6478O0527k8306k2325p5934n657J1436K1480
5661c6409L879J6424L4978k5320r553K1418j9796n0019o642J7615M7174L6204
5649B9953J1729q807j9444p4175m6407P8213J911n1301j6200P0173L2408k74j2549
5636d770N3088n2373l1346j7763K2241j5447J6690L9091j9904j5319J00698R0650
5624A65536K5661p0575J438r7142n9178n2485J9362k6314j4428J7136M6777k4998
5612f9210J4671P8054R3561o1090o5137m2668L456M1380J8758P840m3047K5099
5600A667L2392M2456P1328L1425J8436J9882j08644p1869K3748p156K9588L1527
$$ y = [297, 37950, 17080, 51830, 52823, 23722, -26595, -54082, -12126, 17610, 7921, -1951, -59400, -109185, -49510, -58107, -55869, -34108, 2370, 62897, 34591, 12266, -63668, -69325, -57889, -36409, -32530, -16106, 18872, -6448, -16001, 5417, -14379, -64398, -71040, -53425, -6251, 29953, 41682, 32875, 13431, -60744, -107151, -28938, -27027, -78328, -94528, -24355, 8053, 7779, -4770, 48318, -4055, -35401, -53164, -30923, -46370, -29680, 9411, -10493, -25812, 74886, 165536, 191197, 120622, 122060, 24918, -34260, -86745, -67383, -93697, -108125, -90989, -44212, -69210, -54539, 23515, 117076, 55986, -9151, -51819, -48363, -6983, 11775, 19615, -23432, 1667, 34059, 76515, 147843, 179268, 197704, 217586, 108942, 37073, 60821, 53665, 83253, 114780]
5588A14780K4r5300m9519O477k3344J961M1747L9864j0279r5862m7795J1539K0220
5575h5487N6096l8003m4272m2432n340N1656k3018m266N1223o334O1307O4353
5563C5483j398p8112r2111l1521j1812L0763j0685j399Q5341N337N986l256M0402
5550b6982N7604J5974m2409n9374n1146J8263O9097M8659l2767j1259n0232m9351
5538a13923Q067K7559K5606K9925O2284j8379p1347O165J7956j7899K6619q486
5526b5853j8238J020M0758p308J6772k2523l8310p0282l5275J16218N4371N1365
5514F2715q894n1910m8925p2525k7167L7590M3199O9992k0232j3154M9267q230
5502A1726j0694k2892q0918J0977J00564K9591N236n439J6509J4383l1341n2286
$$ y = [114780, 114804, 19504, -30015, -23538, -46882, -44921, -3174, 36690, 26411, -69451, -117246, -105707, -85487, -29391, -67394, -111666, -154098, -159438, -107782, -130800, -135066, -83843, -90177, -28870, 35483, 34085, -44027, -136138, -167659, -179471, -148708, -159393, -160792, -75451, -70114, -64128, -67384, -26982, 30622, 46596, 4187, -55187, -106333, -88070, -18973, 29686, -3081, -14340, -64572, -113923, -105856, -78297, -52691, -22766, 39518, 21139, -50208, -44043, -26087, -43986, -17367, -25853, -44091, -43071, -2313, -9621, 7151, -15372, -53682, -123964, -159239, -43021, 11350, 62715, 53821, 1911, -47014, -119539, -146706, -109116, -65917, 4075, -16157, -29311, 19956, 11726, 1032, -21860, -102778, -91801, 8763, 38354, 43590, 38151, 54660, 69043, 37702, -14584]
5490a4584q4829J476M4738P0917Q327J3738M1875p0232j4253L1234j6726J3552
5478B5233k2390k3786o9969N4522R6881l8926o3170K6647k7244m8645M9024K3687
5466a8136q099o0453m0763J7484J6013P7920J8655Q817k6658m0008L5839L9783
5454B0394L278l3982N8882M7435K8231K0719j4235q7801m7866N6431J0783k0342
5442D1927m3307j8899k5132l2746l3224J9392N808l4806l4284O4780J7653p6394
5430a49232j2674L5502K6196l2715N0574O2954M0050M1133l9240j01556n0034
5419a29042P301L2796K2855k1122L9739p195J8281l3470R150m1514j650Q4284
5407a9587K4185N424J2018M2995m494n1046m4940n6918k4160O7066L8597J0467
$$ y = [-14584, -99413, -97937, -53199, 17718, 26045, 39783, 81658, 11426, -2827, 28407, 11681, 25233, 2843, -20943, -90912, -36390, 60491, 21565, -41605, -14958, -42202, -90847, -41823, -18136, -26235, -86688, -127451, -109967, -93954, -16034, 2621, 11438, -15220, -55228, -19389, 20394, 23672, -10310, 48572, 96007, 124238, 144957, 130722, 42921, -4945, 51486, 62269, 41927, -1380, -20279, -45411, -78157, -111381, -91989, -86181, -120987, -155271, -90491, -72838, -149232, -161906, -126404, -100208, -132923, -82349, -19395, 20655, 61788, 22548, -79008, -129042, -121741, -88945, -66090, -87212, -47473, -54668, -36387, -69857, -60707, -102221, -103871, -19587, 4598, 10022, 22040, 65035, 60541, 9495, -35445, -92363, -116523, -49457, -10860, -393]
5395c93m1985K195J2951k1222K9677k137P077l5171m9237P4683L8014K4562p5496
5382c6482r71R4655L3398m7650l4436J4212k9793n3230m636j6264L5924L8727
5370f546L944J5167M5083p297l6191N4737K4135k6223K4861M697j0054l1610l7088
5357A7615L644j7624O1397q091r1656o9704N7915J6980o886M7657J2265l9388
5345a5876l5285l0817k2712M0146K9882J4274K5952r276j4572q469n608Q557P842
5332a5962q2267m0070M9973L8810K9812K2627Q808J9694Q507l1499n9668k1607
5320g2842l5766N1055o184j6419K1355K3305k7384K8128O7695R921R184J9535
5308G1583J725M0756J9025q1759j5055k4923L4569J5429l7068n7296l9495j4115
$$ y = [-393, -42378, -40183, -27232, -48454, -18777, -20914, -13837, -49008, -98245, -23562, 14452, 39014, -36482, -37453, 57202, 90600, 42950, 8514, 22726, -7067, -60297, -64933, -81197, -45273, -6546, -2602, 12565, 57648, 50351, 14160, 68897, 93032, 66809, 91670, 96367, 86313, 54703, 17615, 21259, 3635, 65032, 56941, -34715, -104419, -46504, -29524, -36410, 11247, 23512, -15876, -51161, -81978, -104690, -64544, -34662, -20388, 5564, -3712, -18284, -26753, -32361, -23804, -15962, -98229, -138299, -88326, -49516, -19704, 2923, 11731, 31425, 39932, 8433, -51235, -72842, -108608, -57553, -63737, -80156, -58801, -35496, -62880, -34752, 32943, 42864, 52048, 71583, 73308, 114064, 133089, 51330, 36275, 11352, 45921, 61350, 24282, -33014, -72509, -86624]
5296h6624J3762P7800q099n5595m888l9107K2569k1090j1048N9642K3430Q0641
5284E1393j3835n0055k2819L0503K4852r705l5210m2112o3094O7991L8560n3705
5272g7236L8733M9728m6038q4902K0777M9645L5651l0320j6190N9519J3407q2781
5260g0007l7943O3764j4629j7644J02993j9427r0135o4141O2549K1320p978K6642
5248d4636N7955K0973k3700o3005j411N3218R516k4288m4215N5097P1349K749
5236F9602l7026o6070k974j9203k3196j9311j176K7664J8546L6250M2980J454
5224B7540k9745m0712j2564k2307L4697M5426K3340J0491K590K9674L218q3208
5212a1560j06407l4899P681J632N9684J3762N5284J5494o3032k5386O6211J0384
$$ y = [-86624, -72862, 4938, -3161, -58756, -63644, -102751, -80182, -101272, -112320, -52678, -29248, 51393, 37558, -12497, -35316, -4813, 20039, 10334, -24876, -66988, -130082, -62091, -23531, -77236, -38503, 11225, -34813, -119715, -98938, -49293, -13642, -43962, -60152, -633, 12774, -70007, -107950, -44186, -58815, -76459, 26534, 7107, -83028, -147169, -84620, -63300, -71278, -44636, 13319, 34292, 10592, -52413, -53824, -606, 8910, -15378, -59593, -4496, 66853, 69602, 32576, -33494, -36468, -55671, -78867, -98178, -99354, -71690, -53144, -16894, 26086, 27540, -2205, -42917, -55481, -77788, -43091, 2335, 25675, 36166, 38756, 68430, 71648, -11560, -117967, -152866, -145185, -143553, -83869, -70107, -14823, 671, -62361, -87747, -21536, -11152]
5200a1152o8470M1842K3746K9739L0898K1739m6551j3779l3285l2855J06251L6185
5188H4308o0776l9942k7168n464K7648P9357l3705n5167j5434l9167p9442k0543
5176a85495M3802R534l584O2852O854K0842N929O23l6651p1700M2801O0768L5386
5163h039J594l4000m1926j4705O4402k2110p047k3937L8869l2755r483l240j9110
5150a11487j1332N3932O2879q278k4334j8049L6497J4698J4444j1020n148k5702
5138c2900n1658l1979M1226J8152o8195o3724K7026M6086N2087J8627J2680J6949
5126a5623N0437M755j2136l7163L1736L6832n9920j3470K9800M1746K0222k3662
5114E3554k5563j3696m4315L8044J6555o716J7229m5244l3329m6550j8214l4023
$$ y = [-11152, -79622, -37780, -14034, 15705, 46603, 68342, 21791, 8012, -25273, -58128, 48123, 84308, 23532, -16410, -43578, -49042, -21394, 57963, 24258, -30909, -46343, -85510, -164952, -185495, -141693, -132159, -135743, -72891, -66037, -45195, -39266, -38643, -75294, -146994, -104193, -43425, -8039, -6445, -40445, -82371, -97076, -32674, -54784, -61831, -85768, -46899, -79654, -89137, -92377, -111487, -122819, -68887, -6008, -14286, -38620, -56669, -20172, -5474, 8970, -2050, -7198, -32900, -84558, -116537, -75311, -57159, -125354, -189078, -162052, -115966, -63879, -45252, -32572, -15623, 34814, 39569, 27433, -9730, 22006, 58838, -1082, -14552, 15248, 56994, 77216, 53554, 27991, 14295, -30020, 8024, 24579, 17863, 35092, -10152, -43481, -90031, -108245, -142268]
5102a42268M5253P1252J3945k1600J1388l0106k1976M5699K7032N1851n815o6664
5090b2009N6271p463j8149q0984O351L8539k2696o6977n4359N1918L8988k8349
5078a08919O8641K8069J0423k5968p8717n3607m5110K5862J11246L5315p8360
5067a11125N7047Q58L2206J8070j23363m1350Q9468Q0521L2305q8982j1181O0881
5055d645j0537R088k5867M7802L8812k9385k5667r3884r657L8450L5836n8378
5043h8032L5185M873k170m789J0382R776P20j8750J323l6432j8527N1482O622
5030d8337k7789k3202J09150L5822l9170J1858O8884j3587m6953m1675k4326N090
5018c4235K3709P920L7545K3919k1689o7060j5585J4038j8072j4906M9458L328
$$ y = [-142268, -97015, -25763, -11818, -33418, -22030, -52136, -74112, -28413, -1381, 50470, 44655, -22009, 34262, 26799, 8650, -72334, -65983, -27444, -50140, -117117, -171476, -119558, -80570, -108919, -40278, -12209, -1786, -27754, -106471, -160078, -205188, -179326, -68080, -32765, -111125, -54078, -53220, -21014, -2944, -126307, -167657, -78189, 2332, 34637, -54345, -65526, -4645, -15182, -6094, -31961, 15841, 54653, 25268, -399, -94283, -103940, -65490, -29654, -88032, -52847, -47974, -50144, -54933, -44551, -34775, -34055, -52805, -51482, -87914, -106441, -54959, -48337, -76126, -99328, 9822, 45644, 6474, 18332, 87216, 73629, 26676, -14999, -39325, -34235, -10526, -2606, 34939, 58858, 37169, -29891, -45476, -31438, -49510, -64416, -14958, -11630]
5006a1630L3266L4497m4781m3173O634j8465k9893R095J1256k5257k2787m4511
4994a45749K8749L903K9808K8387L46k6732p65K1063j220J5280K3896M2493l8062
4981a8603L9563k5997o0155p640L6726K0187M5724l0288m8724O2239k787p0008
4969e9763k9091K1582J7871j2546J339j6447k7939K3566l2640l7926M4692L8098
4957f9204J1344Q046j1324K3572j5219k2046n0805K29j4689L251k4420O2713K2268
4944g6284k3046K4617M4143o725k996k3149n0237K0620M8297L0430K7692l0144
4932a6782m8014K648j5523P341k1115R966J0230K3475J14060L8948l4387k4795
4920D6052l0904m0086L0014L8519m6165k2018J70J7293l1483l2169j7457j1622
$$ y = [-11630, 21636, 56133, 11352, -31821, -25187, -43652, -73545, -64450, -53194, -78451, -101238, -145749, -117000, -113097, -83289, -54902, -54556, -81288, -82053, -60990, -62210, -46930, -23034, 19459, -18603, 20960, -5037, -65192, -72832, -36106, -15919, 29805, -483, -49207, 13032, 10245, -59763, -88854, -67272, -49401, -61947, -60608, -77055, -104994, -81428, -114068, -151994, -107302, -69204, -57860, -49814, -61138, -37566, -52785, -74831, -125636, -125407, -140096, -136845, -161265, -98552, -76284, -99330, -74713, -30570, -37295, -40291, -63440, -113677, -93057, -44760, -14330, 13362, -16782, -64796, -62148, -77671, -70330, -91445, -81479, -71249, -47774, 66286, 105234, 70847, 46052, 15148, -24938, 5076, 43595, -2570, -24588, -24418, -7125, -38608, -70777, -88234, -99856]
4908i9856K1929k673j3836N3706L0047L841J1735K3556n2118m6064n5157l3581
4896a58471j4648J4936R6082L0672k4326N111Q3646O8207N429k6229q0655k0482
4884b0728j1305m2973p504J57280J7680r1927j6644O7726J8006M966L8185k6357
4872H6405j2078p9595p2110J1775P5004J7576k4760o769l740m3842l7918j5912
4860a05964J5972l7850K1715L4944K1741l7382R052L292r607J1102n2684K0468
4848a05201N495J8962l1528L6044M1684k4740p632m3499j3038P5317l626n0433
4836a02195J2712P5490j2322q2609n5781P1937L6836q366j1596P7040M950p0003
4824f3907l9027j9764L9537P2582l8358K96L2995N2678n4366o7761q4434K3377
$$ y = [-99856, -77927, -80600, -94436, -40730, -10683, -6842, 4893, 28449, -23669, -69733, -124890, -158471, -173119, -158183, -62101, -31429, -55755, -50644, 33002, 101209, 106638, 80409, -246, -20728, -32033, -75006, -82510, 74770, 92450, 523, -16121, 51605, 69611, 74577, 112762, 86405, 74327, -5268, -77378, -65603, 9401, 26977, 2217, -4552, -8292, -52134, -90052, -105964, -89992, -127842, -106127, -71183, -49442, -86824, -77772, -74480, -84087, -72985, -125669, -105201, -99706, -80744, -112272, -76228, -34544, -59284, -66916, -110415, -123453, -48136, -51762, -102195, -89483, -13993, -26315, -108924, -164705, -92768, -55932, -64298, -75894, 1146, 6096, -63907, -102934, -122698, -83161, -10579, -48937, -48641, -15646, 37032, -17334, -85095, -169529, -146152]
4812a46152L9738M4113l342N5503k8044j8567O161J9404N6803k8565o9802J5371
4800e7379N6894K2933l8307l999j9871K130j0129k5201k6141M4090K0622k5732
4788f0090j0365n8543M6186O6533J4823N9598p4107o2054K6840K9931k2506m4137
4776h7891L9922p3472P398P3155M6804P3463N9060p6067j12937k7764L1391J9207
4764b7731l2535N490J7907j4085N998Q9561M9318k9924r5271M28J9712N8715j95
4751D7388m2735k9842q5939J1805O72k347M161M107P3471k5945J8038J5065J2377
4738B76m6833r947R03k271L8669L3736N564J2467l2604m2989M3310L9368K3012
4725F2661l519q3090k4759L1105K9113J9539M016N7267o6022p2499n161N2957
$$ y = [-146152, -106414, -62301, -65643, -10140, -38184, -56751, -50590, -31186, 25617, -2948, -72750, -57379, -485, 22448, -15859, -19858, -39729, -37599, -47728, -72929, -99070, -54980, -34358, -60090, -70455, -128998, -82812, -16279, -1456, 58142, -15965, -78019, -51179, -21248, -43754, -87891, -47969, -121441, -114043, -40888, 5916, 79379, 138439, 62372, -50565, -78329, -46938, -27731, -60266, -54776, -36869, -50954, -44956, 44605, 93923, 63999, -31272, -30844, -11132, 47583, 47388, 4653, -25189, -111128, -99323, -98651, -100998, -96837, -92730, -19259, -45204, -27166, -12101, 276, -46557, -56504, -55601, -57872, -19203, 14533, 20097, 32564, -40, -43029, 281, 39649, 62661, 59142, -23948, -48707, -17602, 11511, 31050, 35066, 92333, 26311, -46188, -51349, 1608]
4713A608Q5800P5855Q524n4949j32448m5259m2869N2606n4764p1088K6121K0842
4701a30021j4380P3715M2313M9046K0500l6250J1469J4706N274J4898N379N3637
4689A10286k019q6552m9076n1902q7938P281J36338N5713k2884M08n5663k6548
4677g2556r439k1050J0597j4862N307J720K6525q1911m2517N2959K3826N9316
4665f2085M5371k7769K9894L4348J0685n842o9984l9823M9379j17763j3495K6541
4653a40543O5776R9226J2362K526N660l3025l1344l7037N875j9149m3768q2566
4641a96007K9989M2879K7192L8015R370L0521J0453l4118p6919L2885Q3462K0788
4629A8510p8168p5925m0564K5616M0697Q0919O0128m4813J4495p5424l659J8129
$$ y = [1608, 87408, 163263, 171787, 116838, -15610, -60869, -103738, -51132, -105896, -176984, -150863, -130021, -144401, -70686, -28373, 20673, 41173, 4923, 16392, 31098, 36372, 51270, 56649, 110286, 108267, 21715, -27361, -79263, -167201, -159920, -23582, 32131, 9247, 9655, -46008, -72556, -81995, -103045, -92448, -107310, -102003, -100283, -73758, -155669, -198186, -145227, -121401, -62085, -16714, -44483, -14589, 19759, 30444, 24602, -45382, -85205, -35826, -153589, -167084, -140543, -74767, 24459, 36821, 39347, 45007, 11982, -19362, -56399, -50524, -69673, -113441, -196007, -166018, -123139, -95947, -57932, -48562, -18041, -7588, -41706, -118625, -85740, -2278, 18510, -59658, -135583, -176147, -150531, -109834, -28915, 31213, -13600, 895, -74529, -78188, -60059]
$$ [...]
##END NTUPLES=NMR SPECTRUM
##END=
