##TITLE=Analysis number 326229
Compound Code cc 61313
Book Reference 494/114
Project Code adrs
Chemist Name craigr
##JCAMPDX= 6.0         $$ Bruker NMR JCAMP-DX V2.0
##DATA TYPE= NMR SPECTRUM
##DATA CLASS= NTUPLES
##ORIGIN= Bruker BioSpin GmbH
##OWNER= nmr
$$ XWIN-NMR		Version 3.5
$$ Mon Jan 29 11:15:57 2007 GMT Standard Time (UT+0h)  MAYBRIDGE\nmr@NMR_250MHZ
##.OBSERVE FREQUENCY= 250.131544655141
##.OBSERVE NUCLEUS= ^1H
##.ACQUISITION MODE= SIMULTANEOUS (DQD)
##.ACQUISITION SCHEME= undefined
##.AVERAGES= 16
##.DIGITISER RES= 18
##SPECTROMETER/DATA SYSTEM= dpx250
##.PULSE SEQUENCE= zg30
##.SOLVENT NAME= CDCl3
##.SHIFT REFERENCE= (INTERNAL, CDCl3, 0, 16.522)
##AUDIT TRAIL= $$ (NUMBER, WHEN, WHO, WHERE, WHAT)
$$ ##TITLE= Audit trail, XWIN-NMR		Version 3.5
$$ ##JCAMPDX= 5.01
$$ ##ORIGIN= Bruker BioSpin GmbH
$$ ##OWNER= nmr
$$ C:\u/data/dgb/nmr/ADRS/2200/pdata/1/auditp.txt
$$ ##AUDIT TRAIL=  $$ (NUMBER, WHEN, WHO, WHERE, WHAT)
(   1,<2007-01-29 11:15:32.31 +000>,<MAYBRIDGE\nmr>,<NMR_250MHZ>,
      <created by zg, POWCHK disabled, PULCHK disabled
       configuration hash MD5:
       49 4B E0 1D 92 C2 6B 37 9F E6 65 BC 52 41 86 1D
       data hash MD5: 64K
       5C 71 2C 1E 5E C8 1F 9F 01 2D E4 D9 97 D9 1E 51>)
(   2,<2007-01-29 11:15:46.59 +000>,<MAYBRIDGE\nmr>,<NMR_250MHZ>,
      <Start of raw data processing
       ef LB = 0.3 FT_mod = 6 PKNL = 1 SI = 32K 
       data hash MD5: 32K
       15 DC 32 EB B0 BF 49 69 1B 39 6D 4F 0A B8 CD 3C>)
(   3,<2007-01-29 11:15:48.37 +000>,<MAYBRIDGE\nmr>,<NMR_250MHZ>,
      <apk 
       data hash MD5: 32K
       18 37 F9 D0 CB D6 1F AE 85 BF 2C 1D 68 07 6D 09>)
(   4,<2007-01-29 11:15:49.19 +000>,<MAYBRIDGE\nmr>,<NMR_250MHZ>,
      <abs ABSG = 5 
       data hash MD5: 32K
       C8 F3 A5 58 57 F2 5D 38 71 90 F2 55 96 DE EF B2>)
$$ ##END=
$$ 
$$ hash MD5
$$ 3E 4F C7 A4 04 6B 3F 4F A7 26 D7 27 A4 E5 67 1C
##$RELAX= 
##$RELAX= 
##$RELAX= 
##$RELAX= 
##$RELAX= 
##$RELAX= 
##$RELAX= 
$$ Bruker specific parameters
$$ --------------------------
##$DU= <C:\u>
##$EXPNO= 2200
##$NAME= <ADRS>
##$PROCNO= 1
##$TYPE= <nmr>
##$USER= <dgb>
##$AMP= (0..31)
100 100 100 100 100 100 100 100 100 100 100 100 100 100 100 100 100 100 
100 100 100 100 100 100 100 100 100 100 100 100 100 100 
##$AQSEQ= 0
##$AQ_mod= 3
##$AUNM= <au_zg>
##$AUTOPOS= <31 >
##$BF1= 250.13
##$BF2= 250.13
##$BF3= 250.13
##$BF4= 250.13
##$BF5= 500.13
##$BF6= 500.13
##$BF7= 500.13
##$BF8= 500.13
##$BYTORDA= 1
##$CFDGTYP= 0
##$CFRGTYP= 5
##$CHEMSTR= <none>
##$CNST= (0..31)
1 1 145 1 1 1 1 1 1 1 1 1 1 1 1 1 1 1 1 1 1 1 1 1 1 1 1 1 1 1 1 1 
##$CPDPRG= <>
##$CPDPRG1= <>
##$CPDPRG2= <>
##$CPDPRG3= <>
##$CPDPRG4= <mlev>
##$CPDPRG5= <mlev>
##$CPDPRG6= <mlev>
##$CPDPRG7= <mlev>
##$CPDPRG8= <mlev>
##$CPDPRGB= <>
##$CPDPRGT= <>
##$D= (0..31)
0 1 0 0 0 0 0 0 0 0.06 0 0 0 0 0 0 0.0002 0 0 0 0 0 0 0 0 0 0 0 0 0 0 
0 
##$DATE= 1170069331
##$DBL= (0..7)
120 120 120 120 120 120 120 120 
##$DBP= (0..7)
150 150 150 150 150 150 150 150 
##$DBP07= 0
##$DBPNAM0= <>
##$DBPNAM1= <>
$$ [...]
##$SUBNAM7= <"">
##$SUBNAM8= <"">
##$SUBNAM9= <"">
##$SW= 20.6930455092707
##$SWIBOX= (0..15)
0 0 3 0 0 0 0 0 0 0 0 0 0 0 0 0 
##$SW_h= 5175.983436853
##$TD= 65536
##$TD0= 1
##$TE= 294.16
##$TE2= 300
##$TE3= 300
##$TEG= 300
##$TL= (0..7)
0 120 120 120 120 120 120 120 
##$TP= (0..7)
150 150 150 150 150 150 150 150 
##$TP07= 0
##$TPNAME0= <>
##$TPNAME1= <>
##$TPNAME2= <>
##$TPNAME3= <>
##$TPNAME4= <>
##$TPNAME5= <>
##$TPNAME6= <>
##$TPNAME7= <>
##$TPOAL= (0..7)
0.5 0.5 0.5 0.5 0.5 0.5 0.5 0.5 
##$TPOFFS= (0..7)
0 0 0 0 0 0 0 0 
##$TUNHIN= 0
##$TUNHOUT= 0
##$TUNXOUT= 0
##$USERA1= <user>
##$USERA2= <user>
##$USERA3= <user>
##$USERA4= <user>
##$USERA5= <user>
##$V9= 5
##$VALIST= <valist>
##$VCLIST= <CCCCCCCCCCCCCCC>
##$VD= 0
##$VDLIST= <DDDDDDDDDDDDDDD>
##$VPLIST= <PPPPPPPPPPPPPPP>
##$VTLIST= <TTTTTTTTTTTTTTT>
##$WBST= 1024
##$WBSW= 4
##$XGAIN= (0..3)
0 0 0 0 
##$XL= 0
##$YL= 0
##$YMAX_a= 384595
##$YMIN_a= -470325
##$ZGOPTNS= <>
##$ZL1= 120
##$ZL2= 120
##$ZL3= 120
##$ZL4= 120
##$ABSF1= 16.522
##$ABSF2= -4.171173
##$ABSG= 5
##$ABSL= 3
##$ALPHA= 0
##$AQORDER= 0
##$ASSFAC= 0
##$ASSFACI= 0
##$ASSFACX= 0
##$ASSWID= 0
##$AUNMP= <proc_1d>
##$AZFE= 0.1
##$AZFW= 0.1
##$BCFW= 0
##$BC_mod= 0
##$BYTORDP= 0
##$COROFFS= 0
##$CY= 12.5
##$DATMOD= 1
##$DC= 0
##$DFILT= <>
##$DTYPP= 0
##$F1P= 14.0000005364418
##$F2P= -0.99999901652339
##$FCOR= 0.5
##$FTSIZE= 32768
##$FT_mod= 6
##$GAMMA= 0
##$GB= 0
##$INTBC= 1
##$INTSCL= 1
##$ISEN= 128
##$LB= 0.3
##$LEV0= 0
##$LPBIN= 0
##$MAXI= 10000
##$MC2= 0
##$MEAN= 0
##$ME_mod= 0
##$MI= 0
##$NCOEF= 0
##$NC_proc= -3
##$NLEV= 6
##$NOISF1= 0
##$NOISF2= 0
##$NSP= 0
##$NTH_PI= 0
##$NZP= 0
##$OFFSET= 16.522
##$PC= 1
##$PHC0= 228.2257
##$PHC1= 5.419587
##$PH_mod= 1
##$PKNL= yes
##$PPARMOD= 0
##$PSCAL= 4
##$PSIGN= 0
##$REVERSE= no
##$SF= 250.13
##$SI= 32768
##$SIGF1= 0
##$SIGF2= 0
##$SINO= 400
##$SIOLD= 32768
##$SREGLST= <1H.CDCl3>
##$SSB= 0
##$STSI= 32768
##$STSR= 0
##$SW_p= 5175.98343685301
##$SYMM= 0
##$S_DEV= 0
##$TDeff= 65536
##$TDoff= 0
##$TI= <Analysis number 999999
Compound Code 99
Book Reference 9
Project Code 9>
##$TILT= no
##$TM1= 0
##$TM2= 0
##$TOPLEV= 0
##$USERP1= <user>
##$USERP2= <user>
##$USERP3= <user>
##$USERP4= <user>
##$USERP5= <user>
##$WDW= 1
##$XDIM= 32768
##$YMAX_p= 576625333
##$YMIN_p= -105675
$$ End of Bruker specific parameters
$$ ---------------------------------
##NTUPLES= NMR SPECTRUM
##VAR_NAME=  FREQUENCY,     SPECTRUM/REAL,   SPECTRUM/IMAG
##SYMBOL=    X,             R,               I
##VAR_TYPE=  INDEPENDENT,   DEPENDENT,       DEPENDENT
##VAR_FORM=  AFFN,          ASDF,            ASDF
##VAR_DIM=   32768,         32768,           32768
##UNITS=     HZ,            ARBITRARY UNITS, ARBITRARY UNITS
##FACTOR=    0.157963299565203, 1,           1
##FIRST=     4132.6476996994, 0,             0
##LAST=      -1043.33573715361, 0,           0
##MIN=       -1043.33573715361, -105675,     0
##MAX=       4132.6476996994, 576625333,     0
$$ Real data points
##PAGE= N=1
##DATA TABLE= (X++(R..R)), XYDATA
$$ [...]
16334c756J3607p741n807j5211j5097K0005J8415J2362P439j3266k817q498j0630
$$ -3756 9851 2110 -3697 -18908 -34005 -14000 4415 16777 24216 10950 8133 -365 -10995
16321a0995m0768R729J1982K2352O705k3865q578K2675R905M1077R739j6523q612
$$ -10995 -51763 -42034 -30052 -7700 -995 -24860 -33438 -10763 -858 40219 49958 33435 24823
16308B4823Q53q766q89K254K4299j5895n881l137L5994J9808j2524J0619J2142
$$ 24823 25676 16910 16021 18275 42574 26679 20798 17661 53655 73463 60939 71558 83700
16295H3700k5243j2274k464L319m0999m1485k2822j337N796J9005Q344j4011r056
$$ 83700 58457 46183 43719 47038 6039 -35446 -58268 -59605 -53809 -34804 -26460 -40471 -49527
16282d9527j0883J6902J0238l720l662n780R306K3656j5110R96Q691l1035P540
$$ -49527 -60410 -43508 -33270 -36990 -40652 -46432 -37126 -13470 -28580 -27584 -18893 -49928 -42388
16269d2388K3579M060j347Q954l5817l724J5301k4312j4445L0644K588j4422K3244
$$ -42388 -18809 -14749 -16096 -7142 -42959 -46683 -31382 -55694 -70139 -39495 -36907 -51329 -28085
16256b8085Q516K735j144R015K1661j161l4166j5056Q970K4358m271n849q271
$$ -28085 -19569 -16834 -17978 -8963 12698 11537 -22629 -37685 -28715 -4357 -8628 -14477 -22748
16243b2748K607p659P378k229l892j6282j7634K791L7806J3834K8203r741k6519
$$ -22748 -20141 -27800 -20422 -22651 -26543 -42825 -60459 -57668 -19862 -6028 22175 12434 -14085
16230a4085P923J4271m93M643p92r773J0371N542j9923j6773O092Q9j930p791
$$ -14085 -6162 8109 7616 12259 11467 1694 12065 17607 -2316 -19089 -12997 -12908 -14838 -22629
16216b2629j4452j1894K2769L323L0257J6336K1714P917m8798j8132K659J1694
$$ -22629 -37081 -48975 -26206 -22883 7374 23710 45424 53341 4543 -13589 -10930 764
16204G64o769j9817j394r497j0353L80L1325R119n659L5629J9156j2084n4068
$$ 764 -6005 -25822 -27216 -36713 -47066 -46686 -15361 -6242 -11901 23728 42884 30800 -23268
16191b3268j7383J0568j217j755K0402K9981J4226j7714o730K431K0897P966j9398
$$ -23268 -40651 -30083 -31300 -33055 -12653 17328 31554 13840 7110 9541 30438 38404 19006
16178A9006k9825l11k870n3J7539j6658j1949j3062K1363R244J6908k3500j3374
$$ 19006 -10819 -11130 -14000 -14053 3486 -13172 -25121 -38183 -16820 -7576 9332 -14168 -27542
16165b7542j0231J7049K562K877j211J210k1687J039K8217K297j7626M660k918
$$ -27542 -37773 -20724 -18162 -15285 -16496 -15286 -36973 -35934 -7717 -5420 -23046 -18386 -21304
16152b1304l3284J1494J7384j3325m881J606N516J0948R394J0451k447J4766k3597
$$ -21304 -54588 -43094 -25710 -39035 -43916 -42310 -36794 -25846 -16452 -6001 -8448 6318 -17279
16139a7279m4841N355J1334O629P353j1689m4064j1884Q69J1570N388K0008J3064
$$ -17279 -62120 -56765 -45431 -38802 -31449 -43138 -87202 -99086 -98217 -86647 -81259 -61251 -48187
16126d8187L220K1334J9444K8140j333j201Q31l1247j8103J4598J8388L4391J0202
$$ -48187 -44967 -23633 -4189 23951 22618 21417 22248 -8999 -27102 -12504 5884 40275 50477
16113E0477j2420k0667m062j2343k7450J1243K7893M730n318k580J3658K8664
$$ 50477 38057 17390 13328 985 -26465 -15222 12671 17401 12083 9503 23161 51825
16101E1825j3929l2795j6613K8600K801r911k1123O830J3756L451k2984p186K0955
$$ 51825 37896 5101 -11512 17088 19889 9978 -11145 -4315 9441 12892 -10092 -17278 3677
16088C677l4470j8597J1509L2519J1367l5136J570M54N012j2594K7254J530N589
$$ 3677 -30793 -49390 -37881 -5362 6005 -29131 -27561 -27107 -22095 -34689 -7435 -5905 -316
16075c16n177p600q148L813l273j4706K260K1082J8007J0073k0869j0459R606
$$ -316 -5493 -13093 -21241 -17428 -20701 -35407 -33147 -12065 5942 16015 -4854 -15313 -5707
16062e707J3548j5773k5845Q254R464q893L2351M476k4944j2312N585l175j7161
$$ -5707 7841 -7932 -33777 -25523 -16059 -24952 7399 11875 -13069 -25381 -19796 -22971 -40132
16049d0132L870K0803l438o366J8548L1612K165P665j7638k667p263J8078j1808
$$ -40132 -36262 -15459 -18897 -25263 -6715 24897 27062 34727 17089 14422 7159 25237 13429
16036A3429l1700l781J1860j5768j7263R588j1162r623j9554k0025K5616K7066
$$ 13429 -18271 -22052 -10192 -25960 -43223 -33635 -44797 -54420 -73974 -93999 -68383 -41317
16024d1317J3527K6820J5133J2526j7648n415m671J4340m9009n772k49k8034J878
$$ -41317 -27790 -970 14163 26689 9041 3626 -1045 13295 -35714 -41486 -41735 -69769 -67891
16011f7891J1795J8515J302k948J0526K6097K1012j6098k492J2239k507k4792
$$ -67891 -56096 -37581 -36279 -39227 -28701 -2604 18408 2310 -182 12057 9550 -15242
15999a5242k1972K3044n592J7643Q015k4631j3156m836O216j050J2789m576R55
$$ -15242 -37214 -14170 -19762 -2119 5896 -18735 -31891 -36727 -30511 -31561 -18772 -23348 -22393
15986b2393K4928J0519o478j4066o530J7002J4839n3566j7754M6154l191q773
$$ -22393 2535 13054 6576 -7490 -14020 2982 17821 -35745 -53499 -7345 -10536 -19309
15974a9309j314l0586m753J2657K7926r688j0883P134k3572l282j0620Q482K508
$$ -19309 -20623 -51209 -55962 -43305 -15379 -25067 -35950 -28816 -52388 -55670 -66290 -57808 -55300
15961e5300J3437k6362P611M3202J7424k0443j345J2623J2883k3463j60Q203N357
$$ -55300 -41863 -68225 -60614 -17412 12 -20431 -21776 -9153 3730 -19733 -19893 -11690 -6333
15948f333K9370J2407J2835j2107j7026r094J5579M636l0321j6675k1481j498
$$ -6333 23037 35444 48279 36172 19146 10052 25631 30267 -54 -16729 -38210 -39708
15936c9708N5451K2385k3940R068O578J2980J222J5428k6781l5732p298M299k696
$$ -39708 15743 38128 14188 23256 29834 42814 44036 59464 32683 -3049 -10347 -6048 -8744
15923h744k701k3592K5306K1836j6174j8906k656J3152J3425l8262J2470J6341
$$ -8744 -11445 -35037 -9731 12105 -4069 -22975 -25631 -12479 946 -37316 -24846 -8505
15911h505J6048J3868j7943l6574J460N205K1794N951j5248j2307J0470J3487
$$ -8505 7543 21411 3468 -33106 -31646 -26441 -4647 1304 -13944 -26251 -15781 -2294
15899b294m990l865J6175j5537k8324l578P109O421P800K711M170j1649l2752
$$ -2294 -7284 -11149 5026 -10511 -38835 -42413 -35304 -28883 -21083 -18372 -14202 -25851 -58603
15886e8603J1855L072j6271K1483K3249j9504N465K3847j1356p422j1968l5314
$$ -58603 -46748 -43676 -59947 -38464 -15215 -34719 -29254 -5407 -16763 -24185 -36153 -71467
15874g1467r855J0325M5735K5585j3170j4938j8053l519k1753J0408J8562P792
$$ -71467 -81322 -70997 -25262 323 -12847 -27785 -45838 -49357 -71110 -60702 -42140 -34348
15862c4348J1419K4782J3910K8141j0973k5302j2209j8106l2303j5707L268L0755
$$ -34348 -22929 1853 15763 43904 32931 7629 -4580 -22686 -54989 -70696 -67428 -36673
15850c6673k0605j6628m929K355J6180R43k0615J0749M3119K1182j1943J0367
$$ -36673 -57278 -73906 -78835 -76480 -60300 -59357 -79972 -69223 -26104 -4922 -16865 -6498
15838f498l920K8669K6071l269M162k4816l3482J0230r226K614L3276J1060J633
$$ -6498 -10418 18251 44322 41053 45215 20399 -13083 -2853 -12079 -9465 23811 34871 36504
15825C6504m95N926j9766K286j1141K099l373k9758Q291J8516k1880j1314K6131
$$ 36504 36009 41935 22169 24455 13314 15413 12040 -17718 -9427 9089 -12791 -24105 2026
15812B026k6436n062Q154j8615K0004K6849J067p510K811n459j8949l463K667
$$ 2026 -24410 -29472 -21318 -39933 -19929 6920 7987 477 3288 -2171 -21120 -24583 -21916
15799b1916J9983J3242J266j2642r317Q037k9276n673K2348P683o595L508k1273
$$ -21916 -1933 11309 12575 -67 -9384 -1347 -30623 -36296 -13948 -6265 -12860 -9352 -30625
15786c0625K0450n698q751L0271q922Q96P639q375N140j2565k1071K0204L2649
$$ -30625 -10175 -15873 -24624 5647 -3275 -2379 5260 -3115 2025 -10540 -31611 -11407 21242
15773B1242m817k3099J5765j2356K952L9240p784m5828k3295j2323n278K7569
$$ 21242 16425 -6674 9091 -3265 -313 38927 31143 -14685 -37980 -50303 -55581 -28012
15761b8012K296k20O595J3613k3303k9013K5856M0158K3086l0293j9204j472j1568
$$ -28012 -25716 -25936 -19341 -5728 -29031 -58044 -32188 7970 31056 763 -18441 -19913 -31481
15748c1481K4625J0499j3805o697R587K8850k6014K147M497J2383p702J9567k917
$$ -31481 -6856 3643 -10162 -16859 -7272 21578 -4436 -2289 2208 14591 6889 26456 23539
15735B3539j9528k7618n929Q81P545P417j895K1078o616p815J3084R500J1628
$$ 23539 4011 -23607 -29536 -28655 -21110 -13693 -15588 5490 -1126 -8941 4143 13643 25271
15722B5271j3760k8423K2559J2405k0936n050M246q271O802j1434L155p665P001
$$ 25271 11511 -16912 5647 18052 -2884 -7934 -3688 -11959 -5157 -16591 -13436 -21101 -14100
15709a4100R180o927J3035J457J3836j7349k2063L0132J9391l0798k2418J1677
$$ -14100 -4920 -11847 1188 2645 16481 -868 -22931 7201 26592 -4206 -26624 -14947
15697a4947J1932j2392N165J9791L539j1368l166o188q789j763l152j0018K7675
$$ -14947 -3015 -15407 -10242 9549 13088 1720 -1446 -7634 -16423 -18186 -21338 -31356 -3681
15684c681P651K1054o640j8252r434O811J339j1730j5606j1870j1350O284l42
$$ -3681 3970 25024 18384 132 -9302 -2491 -1152 -12882 -28488 -40358 -51708 -45424 -45766
15671d5766k3383O949r149J6432K5136P353P151J4639J1055j1779r069j4479j4590
$$ -45766 -69149 -62200 -71349 -54917 -29781 -22428 -15277 -638 10417 -1362 -10431 -24910 -39500
15658c9500P71K6787J3471j3458l856Q377k9486k5003J1566M3128l51l2124K6142
$$ -39500 -38729 -11942 1529 -11929 -15785 -7408 -36894 -61897 -50331 -7203 -7554 -39678 -13536
15645a3536l608J226Q542p841k10J7346m133P78r330j5586J3813L7054J0507m0098
$$ -13536 -17144 -15918 -7376 -15217 -15427 1919 -2214 -1436 -10766 -26352 -12539 24515 35022 -5076
15631e076l6384p050K4828L702L756J7818j855j5997j678J4769O079l1070k0113
$$ -5076 -41460 -48510 -23682 -19980 -16224 1594 -261 -16258 -17936 -3167 2912 -28158 -48271
15618d8271O586L0023l706p377l181j6785j4838j332j800K3913J2475n621k0910
$$ -48271 -41685 -11662 -15368 -22745 -25926 -42711 -57549 -58881 -60681 -36768 -24293 -29914 -50824
15605e0824R641L6496N021k2234p773j504k4560J1599K6522r39L2895K2930o269
$$ -50824 -41183 -4687 334 -21900 -29673 -31177 -55737 -44138 -17616 -18555 14340 37270 31001
15592C1001J205j970J206l174k2651l57K258n217m852k425o906o779j0130j5683
$$ 31001 32206 30236 31442 28268 5617 5260 7518 2301 -2551 -4976 -11882 -18661 -28791 -44474
15578d4474J1523n41K2029L533j706k592j4488j3931K0061n994k5892L5301N9101
$$ -44474 -32951 -33492 -11463 -7930 -9636 -12228 -26716 -40647 -20586 -26580 -52472 -17171 41930
15565D1930n117k2252N869P51q055J4247J6277k2172J342n621j8233J9503J7189
$$ 41930 36813 14561 20430 21181 13126 27373 43650 21478 22820 17199 -1034 18469 35658
15552C5658l5331q208k525j602p128K7967M818k6833j8729j809K0785L353l0950
$$ 35658 327 -7881 -10406 -12008 -19136 8831 13649 -13184 -31913 -33722 -12937 -9584 -40534
15539d0534l400K0920J5727J7548N865R133J1740k8222k2118R221J0958l7369
$$ -40534 -43934 -23014 -7287 10261 16126 25259 36999 8777 -13341 -4120 6838 -30531
15527c0531n513K492L263j9291n777K0670P316O075q729k0724k7819J9428K0696
$$ -30531 -36044 -33552 -30289 -49580 -55357 -34687 -27371 -21296 -30025 -50749 -78568 -59140 -38444
15514c8444J0396L0875M246j7813j9924J262j65J3574L9919j8751k317j1342m062
$$ -38444 -28048 2827 7073 -10740 -30664 -29402 -29567 -15993 23926 5175 2858 -8484 -12546
15501a2546O885l9724r083K3328K3886j915l5449J2662L3511J3519q033j056l316
$$ -12546 -5661 -45385 -54468 -31140 -7254 -9169 -44618 -31956 1555 15074 7041 5985 2669
15488B669m059n143j2310j1241p436J9003K2532M24k3052q145L22l3412j3148
$$ 2669 -1390 -6533 -18843 -30084 -37520 -18517 4015 4439 -18613 -26758 -26436 -59848 -72996
15475g2996M2341L9521k420k5268M681l059Q931J2584j7050p654J8656j4721l5263
$$ -72996 -30655 8866 6446 -18822 -14141 -17200 -8269 4315 -12735 -20389 -1733 -16454 -51717
15462e1717K7156K938O751p308j0551n122J3496J1216M577k124j3838j9562J1714
$$ -51717 -24561 -21623 -14872 -22180 -32731 -37853 -24357 -13141 -8564 -10688 -24526 -44088 -32374
15449c2374r266k3248J9767K3304J6250M262j8678k4249R171J1749J9984P987
$$ -32374 -41640 -64888 -45121 -21817 -5567 -1305 -19983 -44232 -35061 -23312 -3328 4659
15437D659j1155j7063L15O142Q663J021k3315J3324J0888J412J0089J0087O773
$$ 4659 -6496 -23559 -23244 -17102 -8439 -7418 -30733 -17409 -6521 -5109 4980 15067 21840
15424B1840J9346J9482p117j1777l9955J0057L1231K8950R610l9748k6787k3933
$$ 21840 41186 60668 53551 41774 1819 11876 43107 72057 81667 41919 15132 -8801
15412h801l6608J7684K1317j0904j2925m360R478K42L0056J0776l0831j5871M555
$$ -8801 -45409 -27725 -6408 -17312 -30237 -34597 -25119 -24877 5179 15955 -14876 -30747 -26192
15399b6192K936J5423O161k7614j1810J4144L0634J2446j1626o806p258q952J4640
$$ -26192 -23256 -7833 -1672 -29286 -41096 -26952 3682 16128 4502 -2304 -9562 -18514 -3874
15386c874L08j4257J6723R688o672J602k3967j9024K314L491J3674K8101n776
$$ -3874 -3566 -17823 -1100 8588 1916 3518 -20449 -39473 -37159 -33668 -19994 8107 2331
15373B331J1448J0749R659n478M313j1466n033N858l2731Q16N365l3667l9589
$$ 2331 13779 24528 34187 28709 33022 21556 16523 22381 -10350 -9534 -4169 -37836 -77425
15360g7425N508J6770R115K6350p177q075K2205J8579j5272l0213J9161L0724
$$ -77425 -71917 -55147 -46032 -19682 -26859 -34934 -12729 5850 -9422 -39635 -20474 10250
15348A0250k535j3566j7876K923l714R419J148j3235l263m630k3603J307O450
$$ 10250 7715 -5851 -23727 -20804 -24518 -15099 -13951 -27186 -30449 -35079 -58682 -57375 -50925
15335e0925J0859L091r005P344J3105o15R98N770m587O979L0437J8899j3711N277
$$ -50925 -40066 -36975 -45980 -38636 -25531 -26146 -25148 -19378 -23965 -16986 13451 32350 18639 23916
15321B3916q411R38P977j6930l184K0430j3824j9784R43l908J4912J3218j5578
$$ 23916 15505 16443 24420 7490 4306 24736 10912 -8872 -7929 -11837 3075 16293 715
15308G15M392j3202L379l021j397K9042m036k2468q057M381K1195K562k7058j0414
$$ 715 5107 -8095 -4716 -7737 -9134 19908 15872 -6596 -14653 -10272 10923 13485 -13573 -23987
15294b3987o530J1400J9381k888j8744j2833l686J8681J7148J6976O554k5091
$$ -23987 -30517 -19117 264 -2624 -21368 -34201 -37887 -19206 -2058 14918 21472 -3619
15282c619j7748K2008L519k2252Q256K1989L448p471l5600n711j1339N956J827
$$ -3619 -21367 641 4160 -18092 -9836 12153 15601 8130 -27470 -33181 -44520 -38564 -36737
15269c6737O035l51n056K5322K5982L550M019O521j4182k1877R58L429N201j6813
$$ -36737 -30702 -31053 -36109 -10787 15195 18745 22764 29285 15103 -6774 -5816 -2387 2814 -13999
15255a3999n97P798M381m010l431j562k903o62j1925j2370M637J923K9133j481
$$ -13999 -14596 -6798 -2417 -6427 -9858 -11420 -14323 -14985 -26910 -39280 -34643 -32720 -3587 -5068
15241e068J8194O250k7467R57j0545m061J8136J3047J967k1095J0036Q127l183
$$ -5068 13126 19376 -8091 -7134 -17679 -21740 -3604 9443 11410 -9685 351 8478 5295
15228E295j5070j5645K0875J6408K3549J1887J2373O370j8404j7270j7630o369
$$ 5295 -9775 -25420 -4545 11863 35412 47299 59672 66042 47638 30368 12738 6369
15216F369K324O677j6389K739o947k257k833q109L6624J2153j753r831N759j9275
$$ 6369 8693 15370 -1019 1720 -5227 -7484 -10317 -18426 18198 30351 28598 18767 24526 5251
15202E251J071l0968m1424j1238L3156L2389J4723P522O754m2021k6244J0401
$$ 5251 6322 -24646 -66070 -77308 -44152 -11763 2960 10482 17236 -24785 -51029 -40628
15190d0628K2457J1062o690J1123J6267j9479k0527K7766j2996j2934J1348K054
$$ -40628 -18171 -7109 -13799 -2676 13591 -5888 -26415 1351 -11645 -24579 -13231 -11177
15178a1177J4159L5054Q671l9448k3259k158Q853J0731J4204k4924j7570p986
$$ -11177 2982 38036 46707 7259 -16000 -18158 -9305 1426 15630 -9294 -26864 -34850
15166c4850o680O180L6780L3190j6706j4274k5071N243K1624K7982p574k6912
$$ -34850 -41530 -35350 1430 34620 17914 3640 -21431 -16188 5436 33418 25844 -1068
15154a068k4812J2156J7398Q031J094q445j961P906m6438L840L0149K2179J6200
$$ -1068 -25880 -13724 3674 11705 12799 4354 2393 10299 -36139 -32299 -2150 20029 36229
15141C6229N54j799j8971j4684Q991j3128j3336L561k413J609k498L95o345K5542
$$ 36229 36783 34984 16013 1329 10320 -2808 -16144 -12583 -14996 -13387 -15885 -15490 -21835 3707
15127C707M2419q038j0628k3263j5020j0969j6691j7516j1037J1458K0575K5118
$$ 3707 46126 38088 27460 4197 -10823 -21792 -38483 -55999 -67036 -55578 -35003 -9885
15115i885K0557K911k4849J2851K8881j9547j1832J6625k334P461J0632R41p748
$$ -9885 10672 13583 -11266 1585 30466 10919 -913 15712 13378 20839 31471 32412 24664
15102B4664R40r073k8753j0411j0535k364O496J7317Q14j080k886K595J9369L547
$$ 24664 25604 16531 -12222 -22633 -33168 -35532 -29036 -11719 -10905 -11985 -14871 -12276 7093 10640
15088A0640j381k3960P815J7592p152m300j3688O873q477o922J5122J8974J5471
$$ 10640 9259 -14701 -6886 10706 3554 -746 -14434 -7561 -16038 -22960 -7838 11136 26607
15075B6607j6925Q152m485j4131j3462r38j666J7944P712j2871k8991J6971R683
$$ 26607 9682 17834 13349 -782 -14244 -15182 -16848 1096 8808 -4063 -33054 -16083 -6400
15062f400m478n792p443J3643K7493j2763M704l792j6598j0770q277l911R519
$$ -6400 -10878 -16670 -24113 -10470 17023 4260 8964 5172 -11426 -22196 -30473 -34384 -24865
15049b4865K0816o216J3166K6742k5480j5114m618K3494Q487l180J1608k2393
$$ -24865 -4049 -10265 2901 29643 4163 -10951 -15569 7925 16412 13232 24840 2447
15037B447r209j874J8473R857J855J4910J3171j9917l2869J1552K0693j9041j3704
$$ 2447 -6762 -8636 9837 19694 21549 36459 49630 29713 -3156 8396 29089 10048 -3656
15024c656J3567M66o283k3082l588J4412l495L454Q117O394j3507J7310J6281
$$ -3656 9911 10377 4094 -18988 -22576 -8164 -11659 -8205 -88 6306 -7201 10109 26390
15011B6390l6145j343j1609k1606P397K2318K9734j7859r563q157K548q158O476
$$ 26390 -9755 -11098 -22707 -44313 -36916 -14598 15136 -2723 -12286 -20443 -17895 -26053 -19577
14998a9577n692k72j3382P502j753o412j814J7311J5402J4695J9101j7657k5362
$$ -19577 -25269 -25541 -38923 -31421 -33174 -39586 -41400 -24089 -8687 6008 25109 7452 -17910
14985a7910j8315p647P584K6938J8059o950J1371K341l5996P299L7271n171J980
$$ -17910 -36225 -43872 -36288 -9350 8709 1759 13130 15471 -20525 -13226 24045 18874 20854
14972B0854j8988K93J3302P544j6643l786j6195j9824Q739J4032n484j5008r478
$$ 20854 1866 2159 15461 23005 6362 2576 -13619 -33443 -24704 -10672 -16156 -31164 -40642
14959d0642k2784o184O205J1988K2309K4156j8631l8201k5440Q488L9852L9376
$$ -40642 -63426 -69610 -63405 -51417 -29108 -4952 -23583 -61784 -87224 -78736 -38884 492
14947D92J7917J4923r354j2545j05L005K8131K6002q953n7471n498J4239M72j3085
$$ 492 18409 33332 23978 11433 11328 14333 42464 68466 59513 2042 -3456 10783 11255 -1830
14933a830j0794R884L969M31l154n938N651P77j6764J8556K2157n425j8741J2080
$$ -1830 -12624 -2740 1229 1660 -1494 -7432 -1781 -1004 -17768 788 22945 17520 -1221 10859
14919A0859P622k213j8184o801J41K9892J3017N193m0567j7541K762p02Q918M348
$$ 10859 18481 16268 -1916 -8717 -8576 21316 34333 39526 -1041 -18582 -15820 -16522 -7604 -3256
14905c256l7491p068L2762K2460m162n232K2697J7869j2586k1054K1206q822l0950
$$ -3256 -40747 -47815 -15053 7407 3245 -1987 20710 38579 25993 4939 26145 17323 -13627
14892a3627m450Q432j5215Q936L1073j2412m052M520m270j3511M556N322K513
$$ -13627 -18077 -9645 -24860 -15924 15149 2737 -1315 3205 -1065 -14576 -10020 -4698 -2185
14879b185J1463j8646q242K0075q541K411n472J0005J2173m6746k4497L6420N0858
$$ -2185 9278 -9368 -17610 2465 -6076 -3665 -9137 868 13041 -33705 -58202 -21782 29076
14866B9076J500l667l512K148j9605j854J1477j3682j5107K3589K4831l8509j0019
$$ 29076 30576 26909 23397 25545 5940 4086 15563 1881 -13226 10363 35194 -3315 -13334
14853a3334j124J8040Q226j6580k0923Q355L857n420l254J8766J6653j1339N236
$$ -13334 -14458 3582 11808 -4772 -25695 -17340 -13483 -18903 -22157 -3391 13262 1923 7159
14840G159P578k0137Q933J9085m430n722K874l9955J5188N7905j4219k0570R302
$$ 7159 14737 -5400 3533 22618 18188 12466 15340 -24615 -9427 48478 34259 13689 22991
14827B2991J0564r151p595M356L867j8104m6798j7085J3060J9184K9771K414j6978
$$ 22991 33555 24404 16809 21165 25032 6928 -39870 -56955 -43895 -24711 5060 7474 -9504
14814i504k2506m863J2280K5611j0949L076J3488j8650j6642l971R446q02q320
$$ -9504 -32010 -36873 -24593 1018 -9931 -6855 6633 -12017 -28659 -32630 -23184 -23986 -32306
14801c2306J0140J4935j2375L586P126o761q233R975O775j4343L88J8540o459
$$ -32306 -22166 -7231 -19606 -16020 -8894 -15655 -23888 -13913 -7138 -21481 -21093 -2553 -9012
14788i012n796k6346O132l599J7693J9721o754p416J0304J7476j634j3824J1198
$$ -9012 -14808 -41154 -35022 -38621 -20928 -1207 -7961 -15377 -5073 12403 10769 -3055 8143
14775H143k5305R270J9531K179j1540O726o965j5992L5427k1617m851K6629n306
$$ 8143 -17162 -7892 11639 13818 2278 9004 2039 -13953 21474 -143 -4994 21635 16329
14762A6329k0476j1198P32p825J5752k247M696n802j3966J1800r712j3016j3417
$$ 16329 -4147 -15345 -14613 -22438 -6686 -8933 -4237 -10039 -24005 -12205 -21917 -34933 -48350
14749d8350Q098L4411K8107J4452j0138j2004k2205j6347r883L338J8302o897
$$ -48350 -40252 -5841 22266 36718 26580 14576 -7629 -23976 -33859 -30521 -12219 -19116
14737a9116K9144J7254N49j6978J4226j6426O046N718q689k4233j9515J1118L0372
$$ -19116 10028 27282 27831 10853 25079 8653 14699 20417 11728 -12505 -32020 -20902 9470
14724I470j2038j7483j5688J6573J2886n307j8223j962p354j2355L2926N3690
$$ 9470 -2568 -20051 -35739 -19166 -6280 -11587 -29810 -31772 -39126 -51481 -18555 35135
14712C5135k656q048J2455r096L025l612J7000Q926l3571J854j4505j0875P978
$$ 35135 32479 24431 36886 27790 30815 27203 44203 53129 19558 21412 6907 -3968 4010
14699D010J128j535j2798N002L201k7644q245n725P910J4863J2771K6918j523
$$ 4010 5138 3603 -9195 -4193 -992 -28636 -36881 -42606 -34696 -19833 -7062 19856 18333
14686A8333k9511k006K566J0773L534J9244j8118r226k1490J166J0760L6497J2564
$$ 18333 -11178 -13184 -10618 155 3689 22933 4815 -4411 -25901 -24735 -13975 22522 35086
14673C5086j112K6611m425K319R043Q183j8793j3938Q075j1768k5363J7587J2451
$$ 35086 33974 60585 56160 58479 67522 75705 56912 42974 51049 39281 13918 31505 43956
14660D3956N644q671j841j9188j6612N0025J0156j1632Q932j1158m73m097q153
$$ 43956 49600 40929 39088 19900 3288 53313 63469 51837 60769 49611 49138 45041 36888
14647C6888J579J8058L5840J2965j9829k2886J4252K3041r015K9944K1946k4696
$$ 36888 38467 56525 92365 105330 85501 62615 76867 99908 90893 120837 142783 118087
14635A18087j6211j362k6929J4252K1021j5574J6305r593q768Q103j4225j9793
$$ 118087 101876 100514 73585 87837 108858 93284 109589 99996 91228 99331 85106 65313
14623F5313Q380l623J021K6424K8767J0560q312Q607j2569j1135K5428l158r512
$$ 65313 73693 70070 71091 97515 126282 136842 128530 137137 124568 113433 138861 135703 126191
14610A26191j5539j8621k6702k1055P053J702J153J1253J0091j1155k8323o152
$$ 126191 110652 92031 65329 44274 51327 53029 54182 65435 75526 64371 36048 29896
14598B9896L6006l546j4915M413J4255q391J5964l643j4813o459j7293k9175K3240
$$ 29896 65902 62356 47441 51854 66109 57718 73682 70039 55226 48767 31474 2299 25539
14585B5539n294j697J6357J4181L876Q745N090R636k7368k5596r252m659o798
$$ 25539 20245 18548 34905 49086 52962 61707 66797 76433 49065 23469 14217 9558 2760
14572B760R113n244r43K612l807L104L3126J2344l9041j4618K506p283J5268n967
$$ 2760 11873 6629 5686 8298 4491 7595 40721 53065 14024 -594 1912 -5371 9897 3930
14558C930n484j0632j1459K8085J8190O005k975j2371j9385Q655o347k189J8477
$$ 3930 -1554 -12186 -23645 4440 22630 28635 25660 13289 -6096 2559 -3788 -5977 12500
14545A2500R627K4496l0719k652K3828J0009j0342l892l381j431o870p841O496
$$ 12500 22127 46623 15904 13252 37080 47089 36747 32855 29474 28043 21173 13332 19828
14532A9828k684J2385J9128m589p747n800R022p139j9216J5530k731k0311k2358
$$ 19828 17144 29529 48657 44068 36321 30521 39543 32404 13188 28718 25987 5676 -16682
14519a6682k007N1367P505l40o855k3547l0658J3057J9018Q051j8773K633K2185
$$ -16682 -18689 32678 40183 39843 32988 9441 -21217 -8160 10858 18909 136 2769 24954
14506B4954K9034j1582L496j5810l890m2593l2892J0389R892L686j0077Q773J0920
$$ 24954 53988 42406 45902 30092 26202 -16391 -49283 -38894 -29002 -25316 -35393 -26620 -15700
14493a5700j8243l116J479J5763K9849L646q348k774L880L004o713J0787k4458
$$ -15700 -33943 -37059 -35580 -19817 10032 13678 5330 2556 6436 9440 2727 13514 -10944
14480a0944q53J1191M043J3027k3927M916K9479n00l0168M931J6103K6320k353
$$ -10944 -11797 -606 3437 16464 -7463 -2547 26932 26432 -3736 1195 17298 43618 41265
14467D1265k9887j9094M137k3173j5261j5047N596Q649L1773K0134R255j027r644
$$ 41265 11378 -7716 -3579 -26752 -42013 -57060 -51464 -42815 -11042 9092 18347 17320 7676
14454G676P757j3930l248k0234J3952K3430R021j4021o744J2414k2919N844j5965
$$ 7676 15433 1503 -1745 -21979 -8027 15403 24424 10403 3659 16073 -6846 -1002 -16967
14441a6967n801M7601P526r869j2297n347P933J1474r500j8466n793M499J019
$$ -16967 -22768 24833 32359 22490 10193 4846 12779 24253 14753 -3713 -9506 -5007 -3988
14428c988J8444K0688l4105j7646J2618J5447r445j7873J2699J1839m653J7758
$$ -3988 14456 35144 1039 -16607 -3989 11458 2013 -15860 -3161 8678 4025 21783
14416B1783k1561J2212K4593k989j454k7633l0324J2914Q887j357J6902K9529
$$ 21783 222 12434 37027 34038 32584 4951 -25373 -12459 -3572 -4929 11973 41502
14404D1502N681o721k5866n114j6974j166J4986j8252k5252J367K0005J0156R055
$$ 41502 47183 40462 14596 9482 -7492 -8658 6328 -11924 -37176 -35809 -15804 -5648 3407
14391C407k734m595M453M56j0111K7835K5011j4989r013l2663K816J7037K7057
$$ 3407 673 -3922 531 987 -9124 18711 43722 28733 19720 -12943 -10127 6910 33967
14378C3967K3957l494j6881l2432Q166n247n633J8408Q018O763j9752k90K1784
$$ 33967 57924 54430 37549 5117 13283 8036 2403 20811 28829 35592 15840 15550 37334
14365C7334k9300k6648r491K3237p775j7130K4364K6640k5922m7553J6673P3059
$$ 37334 8034 -18614 -28105 -4868 -12643 -29773 -5409 21231 -4691 -52244 -35571 37488
14353C7488R84k0333o100R617q184k5402L0163K771q966K3498O057j3732j2131
$$ 37488 38472 18139 12039 21656 13472 -11930 18233 21004 12038 35536 41593 27861 15730
14340A5730P097k5053j8411p282o427M994K2283j5729j0905j5556M351L6203J1239
$$ 15730 22827 -2226 -20637 -27919 -34346 -29352 -7069 -22798 -33703 -49259 -44908 -8705 2534
14327B534o437J2327o730L065J2123r617j0592r099j9910K3254J9932j8494m6672
$$ 2534 -3903 8424 1694 4759 16882 7265 -3327 -12426 -32336 -9082 10850 -7644 -54316
14314e4316j629J5773q22J3452o474J2787J1828l784J9546J5420j5474j8251p593
$$ -54316 -55945 -40172 -40994 -27542 -34016 -21229 -9401 -13185 6361 21781 6307 -11944 -19537
14301a9537Q700o414R092j62N913J7286K6878r803q207M607j8321j6060j4989
$$ -19537 -10837 -17251 -8159 -8321 -2408 14878 41756 31953 23746 28353 10032 -6028 -21017
14288b1017K9727K7978n48k895R558j8970j7188j2380N131K5115J0813k9418K1229
$$ -21017 8710 36688 36140 33245 42803 23833 6645 -5735 -604 24511 35324 5906 27135
14275B7135j3125l2226K068K10J6983N965l828M291k415r245J3627j988r853J0324
$$ 27135 14010 -18216 -16148 -15938 1045 7010 3182 7473 5058 -4187 9440 7452 -2401 7923
14261G923j236j2682j4104j1554K8780J1603j7296j1967P654j6058K9646l393
$$ 7923 6687 -5995 -20099 -31653 -2873 8730 -8566 -20533 -12879 -28937 709 -2684
14249b684O634l807J796k1752j4436R442K6P537K5478p904l3790l111N182O67
$$ -2684 3950 143 1939 -19813 -34249 -24807 -24781 -17244 8234 330 -33460 -36571 -31389 -30722
14235c0722j5454q85J2750O502k773j49K438n594J7414j437L662R388j1425m834
$$ -30722 -46176 -47061 -34311 -27809 -30582 -30731 -28293 -33887 -16473 -17910 -14248 -4860 -16285 -21119
14221b1119J6584M0090n125J4347O746k0561k1365j4657J8830R226j675L7394
$$ -21119 -4535 35555 30430 44777 51523 30962 9597 -5060 13770 22996 21321 58715
14209E8715j1674l9039k2439Q277k0293j6341M787K3472J6898j144J4101K2296
$$ 58715 47041 8002 -14437 -6160 -26453 -42794 -38007 -14535 2363 1219 15320 37616
14197C7616J4849j703N866K3749Q45j2865K0002K0175J5963j9068P596k30j5607
$$ 37616 52465 50762 56628 80377 81222 68357 88359 108534 124497 105429 113025 112795 97188
14184I7188j7071j7388k9049j5354M564q910l6322J0981j1237J4621M899L2696
$$ 97188 80117 62729 33680 18326 22890 13980 -22342 -11361 -22598 -7977 -3078 29618
14172B9618p863K614O302J0167J8603J88k8809j7806r423j4594J0862M1966r37
$$ 29618 21755 24369 30671 40838 59441 59629 30820 13014 3591 -11003 -141 41825 40888
14159D0888l83L084Q182K288q883L215L262J498j6299j5869n638J2360R366J0105
$$ 40888 40505 43589 51771 54059 45176 48391 51653 53151 36852 20983 15345 27705 37071 47176
14145D7176k0231k6563J3675K1463j6578k2833p522J1353N158n232O058O64n803
$$ 47176 26945 382 14057 35520 18942 -3891 -11413 -60 5098 -134 5924 6588 785
14132G85o295J5379l113j6842k863j1719M850O826P54K4860O288k9805n355P634
$$ 785 -5510 9869 6756 -10086 -12949 -24668 -19818 -12992 -12238 12622 18910 -10895 -16250 -8616
14118h616J599q241n59Q874P787j9559p532J0431K5500o790O699P854l9613j3817
$$ -8616 -7017 -15258 -15817 -6943 844 -18715 -26247 -15816 9684 2894 9593 17447 -22166 -35983
14104c5983o583J5928N049J0164P248o10j2279O66M966J3861J769M75J0621j866
$$ -35983 -42566 -26638 -21589 -11425 -4177 -4787 -17066 -16400 -11434 2427 4196 4671 15292 13426
14090A3426l5655l6746N830K1221k99J8401J4236L244N061Q041k3287k2691J4405
$$ 13426 -22229 -58975 -53145 -31924 -32223 -13822 414 3658 8719 16760 -6527 -29218 -14813
14077a4813J4662J4486N75K1888l4860m8782K5024J1493l0547K1588M800J4567
$$ -14813 -151 14335 14910 36798 1938 -46844 -21820 -10327 -40874 -19286 -14486 81
14065H1J5140m673J8666J8453M053J0986p170j5907l9103P530K67j534K402J6188
$$ 81 15221 10548 29214 47667 51720 62706 55536 39629 526 8056 8323 6789 9191 25379
14051B5379J0190L554j655k7061k7770Q833l468k044j3638J4166J2821J2206M080
$$ 25379 35569 39123 37468 10407 -17363 -8530 -11998 -14042 -27680 -13514 -693 11513 15593
14038A5593r171r082p518o371K8658J6402j4149j9619j9482J5703N454L618R14
$$ 15593 6422 -2660 -10178 -16549 12109 28511 14362 -5257 -24739 -9036 -3582 36 950
14025I50n391P19j1443Q371K2416j0659j558k7071P547J5720j6527K0580j0707
$$ 950 -4441 -3722 -15165 -6794 15622 4963 3405 -23666 -16119 -399 -16926 3654 -7053
14012g053j6800r711j761J1102K2492N0884j4952j4985P546q205k7084r266l084
$$ -7053 -23853 -33564 -35325 -24223 -1731 49153 34201 19216 26762 18557 -8527 -17793 -20877
13999b0877R383L0793O494k1806J955J9695j4395k417q473j6589J5608J3132k5116
$$ -20877 -11494 19299 25793 3987 5942 25637 11242 8825 352 -16237 -629 12503 -12613
13986a2613J728J485L1313Q668k6061K5485J0479k8055o134N036K5237j7158m3686
$$ -12613 -10885 -9400 21913 30581 4520 30005 40484 12429 6295 11331 36568 19410 -24276
13973b4276P22M46O362j8778j5594L147K986J0070q778J073n595P520K8852L0408
$$ -24276 -23554 -23108 -16746 -35524 -51118 -47971 -44985 -34915 -43693 -42620 -48215 -40695 -11843 18565
13959A8565n47j0400J6773j5127k877R756m220p753j4571j9867l055L1681J9326
$$ 18565 18018 7618 24391 9264 6387 16143 11923 4170 -10401 -30268 -33323 -1642 17684
13946A7684Q259k5631j5082O569m094k1002P815M3098r176o563m558j2351K1874
$$ 17684 25943 312 -14770 -8201 -12295 -33297 -25482 17616 8440 1877 -2681 -15032 6842
13933F842K1613q034J0931n3848m7457o737j744K7589K0700J2496K8687m237j0753
$$ 6842 28455 20421 31352 -22496 -69953 -76690 -78434 -50845 -30145 -17649 11038 6801 -3952
13920c952M406K2620J331J5098k646r070L4960o065j9256J7164l27J6803N230
$$ -3952 454 23074 24405 39503 36857 27787 62747 56682 37426 54590 54263 71066 76296
13907G6296o268R158P849l64L7j1413n615k076P795j884K542Q528N616k7140r634
$$ 76296 70028 79186 87035 86671 86708 75295 69680 67604 75399 73515 76057 84585 90201 63061 53427
13892E3427j3397r501j5456J0157J3439M3945o995m177o420j8497J0547k513P095
$$ 53427 40030 30529 15073 25230 38669 82614 75619 71442 65022 46525 57072 54559 61654
13879F1654l778j261o345p516j7156L603K4098O549n2354m6824q49L5721P060
$$ 61654 57876 56615 50270 42754 25598 29201 53299 59848 7494 -39330 -40179 -4458 2602
13866B602J2954q174O086P270k3262j1581k4626J1919K0481J5326J1692L668k9257
$$ 2602 15556 7382 13468 20738 -2524 -14105 -38731 -26812 -6331 8995 20687 24355 -4902
13853d902J1675K8064j3249L033M1854j5761l9408r329j6629J5241K794J130J7426
$$ -4902 6773 34837 21588 24621 66475 50714 11306 1977 -14652 589 3383 4513 21939
13840B1939O256l8716r256N221K9234J9766J3510K0025J3643J0643k8106r083
$$ 21939 28195 -10521 -19777 -14556 14678 34444 47954 67979 81622 92265 64159 55076
13828E5076k4897j895j1422l5089k8941P373K2660J1599J9623J9082k1316m956
$$ 55076 30179 28284 16862 -18227 -47168 -39795 -17135 -5536 14087 33169 11853 6897
13816F897j0036q378j8999J5893j596l837j351R350l766n44J5018J0878k2817
$$ 6897 -3139 -11517 -30516 -14623 -16219 -20056 -21407 -12057 -15823 -16367 -1349 9529 -13288
13803a3288j1377J2095J3586N8499j3272n4348N397K325O720m893P075L260j6166
$$ -13288 -24665 -12570 1016 59515 46243 -8105 -2708 -383 6337 1444 8519 11779 -4387
13790d387J6130J5126K095L065p495r751j5231j1442k0726K0424J1381K9856O717
$$ -4387 11743 26869 28964 32029 24534 14783 -448 -11890 -32616 -12192 -811 29045 35762
13777C5762j2043j7696q788N00k0399K5377K0178k0060K6232L012K2706m984l3493
$$ 35762 23719 6023 -2765 -2265 -22664 2713 22891 2831 29063 32075 54781 49797 16304
13764A6304k3723k3030K2622J7060j2778j3351k3598J1064K870p845K756K7983
$$ 16304 -7419 -30449 -7827 9233 -3545 -16896 -40494 -29430 -26560 -34405 -31649 -3666
13752c666J7460j9215K2665N118j9556j8252r137K127j7747q171J7719R063J8611
$$ -3666 13794 -5421 17244 22362 2806 -15446 -24583 -22456 -40203 -48374 -30655 -21592 -2981
13739b981M607m662p489j8140K5627j314q53K8464p793o585j6664j442K4021l0951
$$ -2981 1626 -3036 -10525 -28665 -3038 -4352 -5205 23259 15466 8881 -7783 -9225 14796 -16155
13725a6155k1987m866J0191J9128J1595K7779N251j2694k4814K588L0105J3831
$$ -16155 -38142 -43008 -32817 -13689 -2094 25685 30936 18242 -6572 -3984 26121 39952
13713C9952j7225o335K0656J8314j1132j4101p853k5019p407M9595J6432k6676
$$ 39952 22727 16392 37048 55362 44230 30129 22276 -2743 -10150 39445 55877 29201
13701B9201k3904l364Q228J921K3663J2680M485J6297k901J1487m287l9265m0068
$$ 29201 5297 1933 10161 12082 35745 48425 52910 69207 66306 77793 73506 34241 -5827
13688e827L7432L2092K855j3985l8133M79j613k5104Q459L3470K3330N285M780
$$ -5827 31605 63697 66552 52567 14434 14913 13300 -11804 -3345 30125 53455 58740 63520
13675F3520N871k7768o217k033O562m145o316n497o710q032K774Q888K8710J4627
$$ 63520 69391 41623 35406 33373 39935 35790 29474 23977 17267 9235 12009 20897 49607 64234
13661F4234m2940l0230j286n58J2621j708J3696k6413l3758O903K0482J8780J8830
$$ 64234 21294 -8936 -10222 -10780 1841 133 13829 -12584 -46342 -39439 -18957 -177 18653
13648A8653r75O985J9391K1996O267k1551k3284j0791P224J8549k178j8983j7199
$$ 18653 17678 24663 44054 66050 72317 50766 27482 16691 23915 42464 40286 21303 4104
13635D104O796P005j4126Q86K578j0493j2940J030J2851m067J4358J0562O206
$$ 4104 10900 17905 3779 4665 7243 -3250 -16190 -15160 -2309 -6376 7982 18544 24750
13622B4750j9654l4932P050J539J3872P5J0131N27n63k136K2405r407J2459l890
$$ 24750 5096 -29836 -22786 -21247 -7375 -7300 2831 3358 2795 659 23064 13657 26116 22226
13608B2226j739J8060m233K1526j4465l5617j7907k8748j1934J6766M1974P315
$$ 22226 20487 38547 34314 55840 41375 5758 -12149 -40897 -52831 -36065 5909 13224
13596A3224K284J6870j6774k4839l4936L5159L1884q550j2682l506j9388Q726
$$ 13224 15508 32378 15604 -9235 -44171 -9012 22872 14322 1640 -1866 -21254 -12528
13584a2528Q934r655q575r390j8178J4284J7437J7321K5498j4956j8363l8375
$$ -12528 -3594 -13249 -21824 -31214 -49392 -35108 -17671 -350 25148 10192 -8171 -46546
13572d6546J3929N9622R071o549J2146j3703o405J1487k605l5814q88K1817J2943
$$ -46546 -32617 27005 36076 29527 41673 27970 21565 33052 30447 -5367 -6255 15562 28505
13559B8505L579j9460k9862J8276J2240k0956q793p081j1410N017L5896m025j9581
$$ 28505 32084 12624 -17238 1038 13278 -7678 -16471 -23552 -34962 -29945 5951 1926 -17655
13546a7655j7173M282k003J0378J6339J8470m787J020J1754J3312o777k4968k7965
$$ -17655 -34828 -30546 -32549 -22171 -5832 12638 7851 8871 20625 33937 27160 2192 -25773
13533b5773R698J3146L5354j5820l4047P337K3291q688p569J186M235r556j2003
$$ -25773 -16075 -2929 32425 16605 -17442 -10105 13186 4498 -3071 -1885 2350 -7206 -19209
13520a9209J3664K2684j698Q209Q966K734J2752k6027j473n292l120l269j4443
$$ -19209 -5545 17139 15441 23650 32616 35350 48102 22075 20602 15310 12190 8921 -5522
13507e522K0196K3041M712k5515M8K6248k8232k379M9863J1395q19L227l9960
$$ -5522 14674 37715 42427 16912 16960 43208 14976 12597 62460 73855 73036 76263 36303
13494C6303k3451m952Q666K2338Q400m238j0124p263K542o781j4949P701J0786
$$ 36303 12852 7900 16566 38904 47304 43066 32942 25679 28221 21440 6491 14192 24978
13481B4978q382q052n294K6140o404j5419Q113L0447r522j9245j6913n219p593
$$ 24978 16596 8544 3250 29390 22986 7567 15680 46127 36605 17360 447 -4772 -12365
13468a2365J2016R580R788K2972K9356j0314m1868j686l025k776J8527l925J4466
$$ -12365 -349 9231 19019 41991 71347 61033 19165 17479 14454 11678 30205 26280 40746
13455D0746p215p099J2264J2910l3019K469J0479N002n797l3232l430K0202Q028
$$ 40746 33531 26432 38696 51606 18587 21056 31535 36537 30740 -2492 -5922 14280 22308
13442B2308q349n456Q424J584J4014O089j2683q120l049m409J0146r705j4964
$$ 22308 13959 8503 16927 18511 32525 38614 25931 17811 14762 10353 20499 10794 -4170
13429d170k463j6996m969J2449L4340J7891K4054q951m569r385J1457l1620m0777
$$ -4170 -6633 -23629 -28598 -16149 18191 36082 60136 51185 46616 37231 48688 17068 -23709
13416b3709J1618K0352K6808N111j8317m0583Q056J4305o04Q698k5116o39Q881
$$ -23709 -12091 8261 35069 40180 21863 -18720 -10664 3641 3037 11735 -13381 -14020 -5139
13403e139P768j3289N25p361r418O271Q555L1464J5282J3853p907j5186m003r725
$$ -5139 2629 -10660 -10135 -17496 -26914 -20643 -12088 19376 34658 48511 40604 25418 21415 11690
13389A1690P784j538L801J4865J0674m2320l9656j9814L3097K2440j1235K0656
$$ 11690 19474 17936 21737 36602 47276 4956 -34700 -54514 -21417 1023 -10212 10444
13377A0444K8224O217k929j9939m129o664k1120R161L0168J0840k0799r463n317
$$ 10444 38668 44885 41956 22017 17888 11224 -9896 -735 29433 40273 19474 10011 4694
13364D694p016K1460J8771J3696r295k1865k9528J0281J0239J5868j3137j2662
$$ 4694 -2322 19138 37909 51605 42310 20445 -9083 1198 11437 27305 14168 1506
13352A506J3892J8968j8656N23k2128q563p486J0842j601l465J0588J5914J0985
$$ 1506 15398 34366 15710 16233 -5895 -14458 -21944 -11102 -12703 -16168 -5580 10334 21319
13339B1319q384K7083J4700j350k8072j8879l891J2714j5545j9707J9888J5312
$$ 21319 12935 40018 54718 53368 25296 6417 2526 15240 -305 -20012 -124 15188
13327A5188R40l825J7912k718o95p10j0533M955J3534K4646N316J3652j8107l1775
$$ 15188 16128 12303 30215 27497 26802 26092 15559 20514 34048 58694 64010 77662 59555 27780
13313B7780P705K7501J4144m2645k0946j249R633N1032L7415N334l9340k3245
$$ 27780 35485 62986 77130 34485 13539 12290 21923 72955 110370 115704 76364 53119
13301E3119K1796Q084J1614K3685P2261P1186J20588R9854Q3667Q3260J18918
$$ 53119 74915 82999 94613 118298 190559 261745 382333 482187 565854 649114 768032
13290G68032J21327N9237J8067j4333m3164r8970j11858j17771j24268q4164q9867
$$ 768032 889359 948596 966663 952330 909166 810196 698338 580567 456299 372135 282268
13279B82268p0589n1085l8848K0939j0724r579L549l0901q170j3164k9308o377
$$ 282268 211679 160594 121746 142685 131961 122382 125931 95030 86860 73696 44388 38011
13267C8011j0352l00L1561N462l881p377l417J3251L462J0808l6j8N676m582m820
$$ 38011 27659 27359 58920 64382 60501 53124 49707 62958 66420 77228 77192 77174 82850 78268 73448
13252G3448k2328l0589l5090l0206N532J4428J9242n1J1727P625J9834K4927J5453
$$ 73448 51120 20531 -14559 -44765 -39233 -24805 -5563 -5614 6113 13738 33572 58499 73952
13239G3952P62k8851j1678J0023P859j019N274j8801k7037R299K1473K3166J7475
$$ 73952 74714 45863 34185 44208 52067 51048 56322 37521 10484 19783 41256 64422 81897
13226H1897q031K110p959m338k9773l5026k1847j5602O700K5202J2826K7356j0909
$$ 81897 73866 75976 68017 63679 33906 -1120 -22967 -38569 -31869 -6667 6159 33515 22606
13213B2606j1223K9404L3076K2124q564O558J672l0503Q131j8005k6052l3148
$$ 22606 11383 40787 73863 95987 87423 93981 95653 65150 73281 55276 29224 -3924
13201c924K6108M4052O70l5425j8109J8575O082j0671j3619R904n726p767m584
$$ -3924 22184 66236 66906 31481 13372 31947 38029 27358 13739 23643 17917 10150 5566
13188E566m584j2068K730j223K6194j0233j1217K3328k035k8359j5443kK3248
$$ 5566 982 -11086 -8356 -9579 16615 6382 -4835 18493 16458 -11901 -27344 -27346 -4098
13175d098J8605j2490r874j519J4785J0272M987K8409L509j642j1502r526J44
$$ -4098 14507 2017 -7857 -9376 5409 15681 20668 49077 52586 50944 39442 29916 30060
13162C0060J0376K3116n93j0040j3140R948j5741R551k7006J0299p235k7590k6844
$$ 30060 40436 63552 62959 52919 39779 49727 33986 43537 16531 26830 19595 -7995 -34839
13149c4839M004P721j7678P501R320N1559K5928l020N634J8826k3939p357L3502
$$ -34839 -30835 -23114 -40792 -33291 -23971 27588 53516 50496 56130 74956 51017 43660 77162
13136G7162p342k2544K0276j5525r449l2129M731m096J556K403J4266K5409M0759
$$ 77162 69820 47276 67552 52027 42578 10449 15180 11084 12640 15043 29309 54718 95477
13123I5477L6990K6118J2088O049R770L0410O343r863l0112k1177k7918m1525
$$ 95477 132467 158585 170673 176722 186492 216902 223245 213382 183270 162093 134175 92650
13111I2650K408L686M487j3060Q604j1085j1887r103M442k5237L99P198J5107
$$ 92650 95058 98744 103231 90171 98775 87690 75803 66700 71142 45905 46304 53502 68609
13098F8609j8866n651K8796K2485J2354j9274j5259j4541o955j0826o212j4046
$$ 68609 49743 44092 72888 95373 107727 88453 73194 58653 51698 40872 34660 20614
13086B0614J0031j564j5962J5542K9662K1397j3544k1429j755m1133Q717K9783
$$ 20614 30645 29081 13119 28661 58323 79720 66176 44747 42992 1859 10576 40359
13074D0359Q722j1375j8907Q06l484o214M739m234q28j0220J8094N1367M7702
$$ 40359 49081 37706 18799 19605 16121 9907 14646 10412 9584 -636 17458 68825 116527
13061A16527j747q201o812J2513J193M472P725p096l4183j3519j9557j3631J2575
$$ 116527 114780 106579 99767 112280 113473 117945 125670 118574 84391 70872 51315 37684 50259
13048E0259J3414N867k2764m7823q400K5289K5473Q319j2167l0750J6062J2396
$$ 50259 63673 69540 46776 -1047 -9447 15842 41315 49634 37467 6717 22779 35175
13036C5175j6007J1191p241j2481o462K1296K7778M9183q226j3024m211L0091
$$ 35175 19168 30359 23118 10637 4175 25471 53249 102432 94206 81182 76971 107062
13024A07062M0556J4266P544j7067l2778k2311j6250j510n483P872j4381K125
$$ 107062 147618 161884 169428 152361 119583 97272 81022 79512 74029 81901 67520 69645
13012F9645L9185j2772j0725l701P816K8609q534J6568L104q14J051j1290L3252
$$ 69645 108830 96058 85333 81632 89448 118057 109523 126091 129195 128381 129432 118142 151394
12999A51394L1020m44o417j01J0016k2161r978k211J8022J2054K2449P756M836
$$ 151394 182414 181970 175553 175452 185468 163307 153329 151118 169140 181194 203643 211399 216235
12986B16235j295p907l6550k7880P484J1247K0059K5835l278L1551J116k4576
$$ 216235 214940 207033 170483 142603 150087 161334 181393 207228 203950 235501 236617 212041
12974B12041j2425r74j6783K897K1749K6043J0665K013r482j5557j91J624k643
$$ 212041 199616 198642 181859 184756 206505 232548 243213 245226 235744 220187 219996 221620 218977
12961B18977J745J681k3954j8225k3356L763J3307L1344Q816O546J214n939J9087
$$ 218977 220722 222403 198449 180224 156868 160631 173938 205282 214098 220644 221858 215919 235006
12948B35006n323l5955J0504K296J8748K471J3576J0035J4017K0795J1456j4M8336
$$ 235006 229683 193728 204232 206528 225276 227747 241323 251358 265375 286170 297626 297612 345948
12935C45948L0258j140Q993K4909k1562O480J8068K0591M435j1687m07L0141O336
$$ 345948 376206 375066 384059 408968 387406 393886 411954 432545 436980 425293 424886 455027 461363
12922D61363J7600K4674J838p110K0345K8163J1892L6489N6169L0963K0186O6459
$$ 461363 478963 503637 505475 498365 518710 546873 558765 595254 651423 682386 702572 769031
12910G69031M4408P4488O8199P5068Q6577R9059O9491N6014Q2216P7232O8844
$$ 769031 813439 887927 956126 1031194 1117771 1216830 1286321 1342335 1424551 1501783 1570627
12899A570627P7753R0745Q5948J09132J33281J26786J44281J49616J86596K31119
$$ 1570627 1648380 1739125 1825073 1934205 2067486 2194272 2338553 2488169 2674765 2905884
12889B905884K42329K65662L18435M45503N70575O90624Q26731R27185J067776
$$ 2905884 3148213 3413875 3732310 4177813 4748388 5439012 6265743 7192928 8260704
12880H260704J272184J444516J584485J884950K390191L173243M378472O513070
$$ 8260704 9532888 10977404 12561889 14446839 16837030 20010273 24388745 30901815
12872C0901815J0081820J5159162J9784040K0980173K0529674K2030541K2894844
$$ 30901815 40983635 56142797 75926837 96907010 117436684 139467225 162362069
12865A62362069J6692129N704294n26763l373152j0586247k1398509k5039431
$$ 162362069 179054198 184758492 184231729 180858577 170272330 148873821 123834390
12858A23834390k1663611j8619152j8281865j6605788j2277704q064050n233950
$$ 123834390 102170779 83551627 65269762 48663974 36386270 28322220 23088270
12851B3088270l557192k616459k081457j721755j459958j321474j233451j120586
$$ 23088270 19531078 16914619 14833162 13111407 11651449 10329975 9096524 7975938
12843G975938r74379q46700p43983o24891n57664m81228l52122l08142k58623
$$ 7975938 7001559 6154859 5410876 4785985 4228321 3747093 3394971 3086829 2828206
12834B828206k22132k30216k15023j78969j61289j64279j35547p7252m9337p1118
$$ 2828206 2606074 2375858 2160835 1981866 1820577 1656298 1520751 1443499 1394162 1323044
12824A323044n8692o6332n7609j1257n0576k9651N366l841q257l4307l4300j2872
$$ 1323044 1264352 1198020 1140411 1129154 1078578 1048927 1054293 1050452 1042195 1007888 973588 960716
12812I60716o651k2483l585M643K469N587k5946j6529n4447p6141l3533n9839
$$ 960716 954065 931582 927997 932640 935109 940696 914750 898221 843774 767633 734100 674261
12800F74261m4991o3630p341k7434n2638l3182l8813p203q00m286j3078k8520
$$ 674261 629270 565640 558299 530865 478227 445045 406232 399029 398229 393943 380865 352345
12788C52345k1812m950R824K7536q86j9934k627M056m735j2497j4135j4565o833
$$ 352345 330533 325583 335407 362943 362057 342123 339496 343552 338817 326320 312185 297620 290787
12775B90787j3012m566o555O722P526m970o1471j7369j547k344M8469J8425N3803
$$ 290787 277775 273209 266654 273376 280902 275932 214461 197092 195545 193201 241670 260095 313898
12762C13898M3917k2209o9459m8867K959l2013k1943j3221k3512k2639j0568L4129
$$ 313898 357815 335606 266147 217280 220239 188226 166283 153062 129550 106911 96343 130472
12750A30472N2918M482K0254K8311K5347J5838M5464O3197N4240Q3793R8470P8399
$$ 130472 183390 187872 208126 236437 261784 277622 323086 386283 440523 524316 622786 701185
12738G01185O5712M3525L93Q057j8375l6960n8045n1316p5598o6196o4047n7194
$$ 701185 766897 810422 810815 818872 800497 763537 705492 654176 578578 512382 448335 391141
12726C91141k7517o0922o4185k8932l2023J092L286j249m489j2459Q705j0258
$$ 391141 363624 302702 238517 209585 177562 178654 181940 180691 176202 163743 172448 162190
12714A62190j1008K2903m0587q831j8924P131K3281M258Q921j6331n745j2018
$$ 162190 151182 174085 133498 124667 105743 112874 136155 140413 149334 133003 127258 115240
12702A15240J2463K2134R780j9803k3741K7239P648J253J1437r729K8410N7649
$$ 115240 127703 149837 159617 139814 116073 143312 150960 152213 163650 153921 182331 239980
12690B39980J3811n5430n3905k1209K7577k579r722j482j2312j064j8618m370
$$ 239980 253791 198361 144456 123247 150824 148245 138523 137041 124729 123665 105047 100677
12678A00677j7106k7954j5390L965J1860J0849M803N619k7092j4561J7210J3573
$$ 100677 83571 55617 40227 44192 56052 66901 71704 77323 50231 35670 52880 66453
12666F6453j2580k2903K6406J0840m950j0950K3916K6746j368k5320j8607J2367
$$ 66453 53873 30970 57376 68216 63266 52316 76232 102978 101610 76290 57683 70050
12654G0050L3343J0774j4093J357L2180L6168K629L419R863L3371J2957o367j6653
$$ 70050 103393 114167 100074 101431 133611 169779 172408 175827 185690 219061 232018 225651 208998
12641B08998K92L0664j2776k8107l3767j5587j7639k3641l0912k1946Q994R906
$$ 208998 209290 239954 227178 199071 165304 149717 132078 108437 77525 55579 64573 74479
12629G4479L297Q996Q043j7110k1073J1506N317j8299K3874J0175j9628R717J7168
$$ 74479 77776 86772 94815 77705 56632 68138 73455 55156 79030 89205 69577 79294 96462
12616I6462n94j0170j8432J9587q244j698J4082j5384J6723j3676O807J4169N486
$$ 96462 95868 85698 67266 86853 78609 76911 90993 75609 92332 78656 85463 99632 105118
12603A05118j890n212k9830Q970P377j2916m015O662K6580J6914o492j3586l0592
$$ 105118 103228 98016 68186 77156 84533 71617 67602 74264 100844 117758 111266 97680 67088
12590F7088k9025K4113L6507k0968j5146K5450L8036L0805p796o784N3443N3926
$$ 67088 38063 62176 98683 77715 62569 88019 126055 156860 149064 142280 195723 249649
12578B49649N5371P3047P8603M0101P3925P0326M2038J8404k3093m0037m6063
$$ 249649 305020 378067 456670 496771 570696 641022 683060 701464 678371 638334 592271
12567E92271q4918p6155o4980l6946n0963k9056k766r942l2255k394k0663j3649
$$ 592271 507353 431198 366218 329272 278309 249253 246487 236545 204290 201896 181233 167584
12555A67584k1621o068R460k9285j7809L556m762k5529l9160k2651j1367J625
$$ 167584 145963 139895 149355 120070 102261 105817 101055 75526 36366 13715 2348 3973
12543C973J0127k648K9121Q857l741n770N622J549o956q827j2734j9292J907J6859
$$ 3973 14100 11452 40573 49430 45689 39919 45541 47090 40134 31307 18573 -719 1188 18047
12529A8047K281l8251K749J4961J584L283P594l684n652J7468J6663J3888J1284
$$ 18047 20328 -17923 -15174 -213 1371 4654 12248 8564 2912 20380 37043 50931 62215
12516F2215K042L814j2478l1214J540L054J1107o981j2657j354K4432k066K210
$$ 62215 64257 68071 55593 24379 25919 28973 40080 33099 20442 19088 43520 41454 43664
12503D3664J8967r150k9570J44j194P449K9236n430j2955J3262J0859L211m864
$$ 43664 62631 53481 23911 24055 22861 30310 59546 54116 41161 54423 65282 68493 63629
12490F3629r656j39J6530J9295J3287l520n328L2035N3531L0211M5543L4884J6930
$$ 63629 53973 53834 70364 89659 102946 99426 94098 126133 179664 209875 255418 290302 307232
12477C07232j6248m4629n5645m1590l9889k4009j912K1610j0785p803L8680O0944
$$ 307232 290984 246355 190710 149120 109231 85222 83310 104920 94135 86332 125012 185956
12465A85956O567K1097L0496R600M132j4497k0061j2976K4892L0511n938j2890
$$ 185956 192523 213620 244116 253716 257848 243351 223290 210314 235206 265717 259779 246889
12453B46889J7810O852N095L5762K6647K1401K2928N8538P9106J21122J13572
$$ 246889 264699 271551 276646 312408 339055 360456 383384 441922 521028 642150 755722
12442G55722R6209N6064L6926J4171M2692M6571Q2005J06738N4426k2121l7963
$$ 755722 851931 907995 944921 959092 1001784 1048355 1130360 1237098 1291524 1269403 1231440
12431A231440k1132m2318o4596j41630j42632r9831q1101j03138r7836o3522o1377
$$ 1231440 1210308 1167990 1103394 961764 819132 719301 638200 535062 437226 373704 312327
12420C12327M491P138j3368l6989m4655J0425J7350j0236l3522k1852j4969K7844
$$ 312327 316818 323956 310588 273599 228944 239369 256719 246483 212961 191109 176140 203984
12408B03984N6060Q3250N4566N25m5527n8193n4619m1561m3522J112L619k7222
$$ 203984 260044 343294 397860 398385 352858 294665 240046 198485 154963 156075 159694 132472
12396A32472l2033j7810N244n107j8724k255Q58j221j9262J0338j1394j879R015
$$ 132472 100439 82629 87873 82766 64042 61787 62645 61424 42162 52500 41106 39227 48242
12383D8242K742J5648j0133o331K957Q718q943k7894J1750k561m751N010J4322
$$ 48242 50984 66632 56499 50168 53125 61843 52900 25006 36756 34195 29444 34454 48776
12370D8776L0257j5743j6670j3862K269K0978K1768l6959k2790J3577K9663j327
$$ 48776 79033 63290 46620 32758 35027 56005 77773 40814 18024 31601 61264 59937
12358E9937l157k1388j0027j4450o514K6997K3000N94j9736k1002k4197K1467
$$ 59937 56780 35392 25365 10915 4401 31398 54398 54992 35256 14254 -9943 11524
12346A1524L2355K1049q023l031M4j2246P294j9693k1420J671J1210J4220L108
$$ 11524 43879 64928 56905 53874 53918 41672 48966 29273 7853 9524 20734 34954 38062
12333C8062k5474J0077Q280P115j761R55j8111l4369J02p81J7344J9537J8228
$$ 38062 12588 22665 30945 38060 36299 37254 19143 -15226 -15124 -15905 1439 20976 39204
12320C9204m579R832j0195j0814j7595K4621J9881K2501l3855m2896K6365j2930
$$ 39204 34625 44457 34262 23448 5853 30474 50355 72856 39001 -3895 22470 9540
12308I540k8388l35m783N193L7093p930o172j1713R614p306L247J6986R658j4577
$$ 9540 -18848 -19183 -23966 -18773 18320 10390 4218 -7495 2119 -5187 -1940 15046 24704 10127
12294A0127J4710m512j4797P421K4912Q215m767l4142K257p183M42q026J295J5543
$$ 10127 24837 20325 5528 12949 37861 46076 41309 7167 9424 2241 2683 -5343 -4048 11495
12280A1495M994L212N067R081k1969j2185J7103n560o099k7580j7796R712K3786
$$ 11495 16489 19701 24768 33849 11880 -305 16798 11238 5139 -22441 -40237 -30525 -6739
12267f739J3398r984j0802R565L0648P472P326k421l918P999k2707l4672P18Q684
$$ -6739 6659 -3325 -14127 -4562 26086 33558 40884 38463 34545 42544 19837 -14835 -14117 -5433
12253e433Q285k2172o465J5123q648k933M16J733J0914J8554J1463k949j1521
$$ -5433 2852 -19320 -25785 -10662 -19310 -22243 -21827 -20094 -9180 9374 20837 17888 6367
12240F367j0924n641m827J5354n942o655K7697P06l498N800k0990M869j8371l575
$$ 6367 -4557 -10198 -15025 329 -5613 -12268 15429 16135 12637 18437 -2553 2316 -16055 -19630
12226a9630J3289K0836j6441j8724j545R281R044r575M796J0073j010N928K8270
$$ -19630 -6341 14495 -1946 -20670 -22215 -12934 -3890 -13465 -8669 1404 394 6322 34592
12213C4592M727j0575j2400m701j1015j1809j4333Q718J7621O769k2885J2501
$$ 34592 39319 28744 16344 11643 628 -11181 -25514 -16796 825 7594 -15291 -2790
12201b790N708l4239j7374o937j0980J1340O627M368K8296K0530J0217J3546Q622
$$ -2790 2918 -31321 -48695 -55632 -66612 -55272 -48645 -44277 -15981 4549 14766 28312 36934
12188C6934j1715m815M237j8631p283l8233J2980K4510l034j3399K0023J0173
$$ 36934 25219 20404 24641 6010 -1273 -39506 -26526 -2016 -5050 -18449 1574 11747
12176A1747j8219k689l337p961n171O536j9545m841K776J095K8740J0195j6992
$$ 11747 -6472 -9161 -12498 -20459 -25630 -19094 -38639 -43480 -40704 -39609 -10869 -674 -17666
12163a7666l9644K2140K6042l0073L857J0615K4916J5087j6314M34P093j271j2338
$$ -17666 -57310 -35170 -9128 -39201 -35344 -24729 187 15274 -1040 -606 6487 5216 -7122
12150g122m6077K729L0529P156k4623N096J3221J3058J1037m355J4824J291q520
$$ -7122 -53199 -50470 -19941 -12785 -37408 -32312 -19091 -6033 5004 649 15473 16764 8244
12137H244L053k5288J8474J0042o699O06K0333Q012K658j1363k2326j2151l496
$$ 8244 11297 -13991 4483 14525 7826 8432 28765 36777 39435 28072 5746 -6405 -9901
12124i901n638J2511j4390r628k2760K5450K2004j5035j9684p337M1885L5438
$$ -9901 -15539 -3028 -17418 -27046 -49806 -24356 -2352 -17387 -37071 -44408 -2523 32915
12112C2915L524j9298m970m514k9032m1611q046L096P89J6597J8825J4785q438
$$ 32915 36439 17141 12171 7657 -21375 -62986 -71032 -67936 -67147 -50550 -31725 -16940 -25378
12099b5378m093n501j0543M528r364J0201K5279J8315O243r37o632P369M769N334
$$ -25378 -29471 -34972 -45515 -40987 -50351 -40150 -14871 3444 9687 8750 2118 9487 14256 19590
12085A9590O996L132j6748m8127k1590L7342P92J0824K6986n232K1263j7044l4197
$$ 19590 26586 29718 12970 -35157 -56747 -19405 -18613 -7789 19197 13965 35228 18184 -16013
12072a6013L00R302L2780J5264l171m8357j7607J1305o495J0794J0766j091k2225
$$ -16013 -15713 -6411 26369 41633 38462 -9895 -27502 -16197 -22692 -11898 -1132 -2223 -24448
12059b4448p286r702j116K8059L3401L1469R818k1932k7288K1035K5265j2184
$$ -24448 -31734 -41436 -42552 -14493 18908 50377 60195 38263 10975 32010 57275 45091
12047D5091k818r244l0974k4847O882P82J2166K1450J6318r45l202n203j0096
$$ 45091 42273 33029 2055 -22792 -15910 -15128 -2962 18488 34806 33861 30659 25456 15360
12034A5360k0315l298R234K4429k5166k0697n213J0207K0355K5160j8189k2655
$$ 15360 -4955 -8253 981 25410 244 -20453 -25666 -15459 4896 30056 11867 -10788
12022a0788j3844O370j1462K7892j1477m003j1500J6826M0829J5131j7939k6219
$$ -10788 -24632 -18262 -29724 -1832 -13309 -17312 -28812 -11986 28843 43974 26035 -184
12010a84n15J6852J6490l3045k2006j7060O12K0120K4540L0199M521K304q514
$$ -184 -699 16153 32643 -402 -22408 -39468 -38856 -18736 5804 36003 40524 42828 34314
11997C4314O53k057k4319m921K317O031j6941R70K91M043R90q837O336J1761L99
$$ 34314 34967 32910 8591 3670 5987 12018 -4923 -3953 -3662 381 1371 -7466 -1130 10631 11030
11982A1030q624Q848J1188k2020p745L41l812j3724o161R244J6926K1086O722
$$ 11030 2406 11254 22442 422 -7323 -6982 -10794 -24518 -30679 -21435 -4509 16577 23299
11969B3299l0184P706L237M243k6136R007K3599n893j2504N193L310j0517j1616
$$ 23299 -6885 821 4058 8301 -17835 -8828 14771 8878 -3626 1567 4877 -5640 -17256
11956a7256j2838j712m355L380M454J6272J6983J0421r882k5199J484j172M761
$$ -17256 -30094 -31806 -36161 -32781 -28327 -12055 4928 15349 5467 -19732 -18248 -19420 -14659
11943a4659J1821j5420P067L139J703O436p450Q767J9982k0025k3742l1671L662
$$ -14659 -2838 -18258 -11191 -8052 -6349 87 -7363 1404 21386 1361 -22381 -54052 -50390
11930e0390M2646j3335J515O524l1383k202J6477j1523J8651j237o541J6369o322
$$ -50390 -7744 -21079 -19564 -13040 -44423 -46625 -30148 -41671 -23020 -24257 -30798 -14429 -20751
11917b0751J3740J4983K9536j5337l2873j4522j5755N803L6986J4120l5315l3894
$$ -20751 -7011 7972 37508 22171 -10702 -25224 -40979 -35176 1810 15930 -19385 -53279
11905e3279O15n717j5141J4836L3470K7380P428P083P82n728R706j112j6262m328
$$ -53279 -52664 -58381 -73522 -58686 -25216 2164 9592 16675 17457 11729 21435 20323 4061 -267
11891b67J0001p056j6313K927n4N619Q978O566N054j8617k0732J6769J1814O350
$$ -267 9734 2678 -13635 -10708 -10762 -5143 3835 10401 15455 -3162 -23894 -7125 4689 11039
11877A1039o697k9428J54K5154N380J5553K0862l8011j8786k3097k7649q888j3076
$$ 11039 4342 -25086 -24932 222 5602 21155 42017 4006 -14780 -37877 -65526 -74414 -87490
11864h7490L8260O7081M711k6502j7881l473J1196J4473L487l275L392P403k7934
$$ -87490 -49230 17851 22562 -3940 -21821 -25294 -14098 375 3862 587 3979 11382 -16552
11851a6552K454J4464j3956n444P451j7216J0403K408L2041K3467j4150k5110
$$ -16552 -14098 366 -13590 -19034 -11583 -28799 -18396 -15988 16053 39520 25370 260
11839B60n643l140J0060k508O181N051K6697l286k3544k1942k0453J8942O796
$$ 260 -5383 -8523 1537 -971 5210 10261 36958 33672 10128 -11814 -32267 -13325 -6529
11826f529J5348K2781o812j3703K206K544K3229p270k7292J3919q811r638J2258
$$ -6529 8819 31600 24788 11085 13291 15835 39064 31794 4502 18421 9610 -28 12230
11813A2230j103j726R745q241r325J320j0669j5020K6417J7413k5762j8281J5264
$$ 12230 11127 9401 19146 10905 1580 2900 -7769 -22789 3628 21041 -4721 -23002 -7738
11800g738q728R596K4858r428j2590k3110j4549j5860K5547J8648J3008j0479
$$ -7738 -16466 -6870 17988 8560 -4030 -27140 -41689 -57549 -32002 -13354 -346 -10825
11788a0825n642M870L6197O50J5723k0354k0668j2786n182j928j0915m112p607
$$ -10825 -16467 -11597 24600 25250 40973 20619 -49 -12835 -18017 -19945 -30860 -34972 -42579
11775d2579L6324M1427j7771l272l5791k3497Q195K3923J0514P31j335m153o278
$$ -42579 -6255 35172 17401 14129 -21662 -45159 -36964 -13041 -2527 -1796 -3131 -7284 -13562
11762a3562j9708P448q367R918J862K865K5511J04p383K2498j195l2680k093k962
$$ -13562 -33270 -25822 -34189 -24271 -22409 -19544 5967 6071 -1312 21186 19991 -12689 -14782 -17744
11748a7744r914K270J4410M235j8096J515K6035K1503J3458j3166l3710J4955
$$ -17744 -27658 -25388 -10978 -6743 -24839 -23324 2711 24214 37672 24506 -9204 5751
11736E751L1867L929j2163j4578k203k1111k8788J3635J3245m102j0554J6617
$$ 5751 37618 41547 29384 14806 12603 -8508 -37296 -23661 -10416 -14518 -25072 -8455
11724h455M461j636P694J1890k1492j4745L8520L2204q874k5126P680P91L215
$$ -8455 -3994 -5630 2064 13954 -7538 -22283 16237 48441 39567 14441 22121 22912 26127
11711B6127K8041J7107l9514p342L2166n1555m8220J6535k78J4575q44J146O983
$$ 26127 54168 71275 31761 24419 56585 5030 -43190 -26655 -26933 -12358 -13202 -12056 -5073
11698e073k062k3616J3465K0071j8062q692L4990p194O634l115n741L7983l774
$$ -5073 -7135 -30751 -17286 2785 -15277 -23969 11021 3827 10461 7346 1605 39588 35814
11685C5814j6718J8570m228l1193j9627o167K404J0474M2137j6483l2807J3128
$$ 35814 19096 37666 33438 2245 -17382 -23549 -21145 -10671 31466 14983 -17824 -4696
11673d696p644m108R253K6436q048k9853j0865J5432J3418j5067l272K2928K8872
$$ -4696 -12340 -16448 -7195 19241 11193 -18660 -29525 -14093 -675 -15742 -19014 3914 32786
11660C2786j3067k5680k9019J3329j306p945J2114J4999J3494J4783Q233M905
$$ 32786 19719 -5961 -34980 -21651 -22957 -30902 -18788 -3789 9705 24488 32721 37626
11648C7626k3820m8791j1738P456M984J986O527J4395J5150L4417j4284q515j353
$$ 37626 13806 -34985 -46723 -39267 -34283 -32297 -25770 -11375 3775 38192 23908 15393 14040
11635A4040r426k1051n063R297L7332O662n1793k8443J0186P086K4722J0600p101
$$ 14040 4614 -16437 -21500 -12203 25129 31791 -20002 -48445 -38259 -31173 -6451 4149 -2952
11622b952m5J7300K8855l112k1142l3458k102J5578j1170P26j1179j1962O047
$$ -2952 -2997 14303 43158 40046 18904 -14554 -16656 -1078 -12248 -11522 -22701 -34663 -28616
11609b8616K220N521L2186J966K1881J6332j4870j9654k0494k230L9463L2105
$$ -28616 -26396 -20875 11311 13277 35158 51490 36620 16966 -3528 -5758 33705 65810
11597F5810j226k1991k4773l1440j4921J3655Q167j4234m01n43r04J8967J5492
$$ 65810 64584 42593 17820 -13620 -28541 -14886 -6719 -20953 -21354 -21897 -22801 -3834 11658
11584A1658R36l665M312j5307L150K6846Q05l868k578J9012m4k3486j7221r918
$$ 11658 12594 8929 13241 -2066 1084 27930 28735 24867 22289 41301 41257 17771 550 -9368
11570i368L6567k0728k5963j821M914o738Q165J7025J3794L762j7018k626j4496
$$ -9368 27199 6471 -19492 -21313 -16399 -23137 -14972 2053 15847 19609 2591 -35 -14531
11557a4531o201M3704K3696J6322j5832k3020j4358m140j1251k6051n599Q812
$$ -14531 -20732 22972 46668 62990 47158 24138 9780 5640 -5611 -31662 -37261 -28449
11545b8449L3988J0767j3636j346J3402j3423J272K769k4372j9696J1801P925
$$ -28449 5539 16306 2670 1324 14726 1303 2575 5344 -19028 -38724 -26923 -18998
11533a8998O893q700M925J1799j1603n381M749L4961J7821k9565J175J6637O189
$$ -18998 -12105 -20805 -15880 -4081 -15684 -21065 -16316 18645 36466 6901 8076 24713 30902
11520C0902r039k5020q875J6397j3125o534r921r48K1976K6726K902p495j9627
$$ 30902 21863 -3157 -12032 4365 -8760 -15294 -25215 -26163 -4187 22539 25441 17946 -1681
11507a681k2887p599M9376l384p672O325n978k4311K7295O093j1443J807j7140
$$ -1681 -24568 -32167 17209 13825 6153 12478 6500 -17811 9484 15577 4134 5941 -11199
11494a1199m1149K3745L734N182k6926q444J7045K7079J5049K1533k684k1940
$$ -11199 -52348 -28603 -24869 -19687 -46613 -55057 -38012 -10933 4116 25649 22965 1025
11482A025O164n99r027K678K1616J0352R525j3800j5409j1281l0801r687J543
$$ 1025 7189 6590 -2437 241 21857 32209 41734 27934 12525 1244 -29557 -39244 -37701
11469c7701K0864L7108L1228r95k2859j3780k5248j4342P757j2617L586K6534
$$ -37701 -16837 20271 51499 50504 27645 13865 -11383 -25725 -17968 -30585 -26999 -465
11457d65o994O426K8126K0789m945J2764l376l7824n340J0329J584j9246j6867
$$ -465 -7459 -1033 27093 47882 42937 55701 52325 14501 9161 19490 21074 1828 -15039
11444a5039K275r652k5561j0963K1912R774K647J443M916o922L842J3535J7931
$$ -15039 -12764 -22416 -47977 -58940 -37028 -27254 -24607 -23164 -18248 -25170 -21328 -7793 10138
11431A0138q35q893j1130k9037N679J5766k027K9408J9333m643J811l113J9013
$$ 10138 9303 410 -10720 -39757 -34078 -18312 -20339 9069 28402 23759 25570 22457 41470
11418D1470j5130P745m358j0660j1005p509n335j3322M617K8138R226K8904j0612
$$ 41470 26340 34085 29727 19067 8062 553 -4782 -18104 -13487 14651 23877 52781 42169
11405D2169m2169k2235L4194K5715L551K8061k5094k0562O369J9069k734M994
$$ 42169 0 -22235 11959 37674 41225 69286 44192 23630 29999 49068 46334 51328
11393E1328j7606j7421N833j2927j3593j547J1023k115m929j7128j9464L772J1851
$$ 51328 33722 16301 22134 9207 -4386 -5933 5090 2975 -1954 -19082 -38546 -34774 -22923
11380b2923K2862j2982L305L960K3130K049O474j0024q562K1421R283J546K457
$$ -22923 -61 -13043 -9738 -5778 17352 19401 25875 15851 7289 28710 37993 39539 41996
11367D1996j1831m0001k0663J3835K2104J7381K9496o185k8028m744J373j9578
$$ 41996 30165 -9836 -30499 -16664 5440 22821 52317 46132 18104 13360 14733 -4845
11355d845r547j4869L1004k1743n565K0827N435K7902J4549q018Q664j077j5209
$$ -4845 -14392 -29261 1743 -20000 -25565 -4738 697 28599 43148 35130 43794 42717 27508
11342B7508k6044m252n518O876K2121o437m056j569J0302K1112j8058j4115j5291
$$ 27508 1464 -2788 -8306 -1430 20691 14254 10198 8629 18931 40043 21985 7870 -7421
11329g421L2023J3485j0832r493J3898J4061j893j1937j0235n687l4034K6879
$$ -7421 24602 38087 27255 17762 31660 45721 43828 31891 21656 15969 -18065 8814
11317H814Q019k0036j0156J075P237l474l393Q504o235Q687j5104J0896p163K334
$$ 8814 16833 -3203 -13359 -12284 -5047 -8521 -11914 -3410 -9645 -958 -16062 -5166 -12329 -9995
11303i995J3248K3867r664L518J7514k4205k7404j5762R232J3729P713J0786j7546
$$ -9995 3253 27120 17456 20974 38488 14283 -13121 -28883 -19651 -5922 1791 12577 -4969
11290d969K5880O213j0371n115J803n41K4691N086k9435J0928M9921M7957M8114
$$ -4969 20911 27124 16753 11638 13441 12900 37591 42677 13242 24170 74091 122048 170162
11277A70162R1009J58622K21246J01555r8689k29347j47899p2790n4635n2897
$$ 170162 261171 419793 641039 742594 643905 414558 266659 193869 139234 86337
11267H6337m2713l2993m541J2608k0406k844M364k116K175j8730J438L0262k7560
$$ 86337 43624 10631 6090 18698 -1708 -4552 -188 -2304 -129 -18859 -17421 12841 -14719
11254a4719j5222o703J338J4113J4712K6062J2641L223j4448k852N890j3287l279
$$ -14719 -29941 -36644 -35306 -21193 -6481 19581 32222 35445 20997 18145 24035 10748 7469
11241G469J5264q485N511k2830l47J5069K1546L158k3356m0339Q801K1261J3089
$$ 7469 22733 14248 19759 -3071 -3418 11651 33197 36355 12999 -27340 -18539 2722 15811
11228A5811P628k4856n344K0362P769q718l905J7766J6090r74k0124N298k0305
$$ 15811 23439 -1417 -6761 13601 21370 12652 8747 26513 42603 41629 21505 26803 6498
11215F498N816n024o251N585j3609k3600J5662K590J4907M811L051k0330k351
$$ 6498 12314 7290 1039 6624 -6985 -30585 -14923 -12333 2574 7385 10436 -9894 -12245
11202a2245o449K2394J4615j69l9815J104R12j795L0496L3762j951l1280j4984
$$ -12245 -18694 3700 18315 18146 -21669 -20565 -19653 -21448 9048 42810 40859 9579 -5405
11189e405k1108K2314J5328J7064M532q068k7881l1779K0561K4567J7933J2170
$$ -5405 -26513 -4199 11129 28193 32725 24657 -3224 -35003 -14442 10125 28058 40228
11177D0228k0794l5563m302j1546R233K8349K5607O847n044M127k573J1660j6806
$$ 40228 19434 -16129 -20431 -31977 -22744 5605 31212 38059 33015 37142 34569 46229 29423
11164B9423K2378K034J0795M394R296l9771l4504k086J4761j87K041j877N367
$$ 29423 51801 53835 64630 69024 78320 38549 4045 1959 16720 16533 18574 16697 22064
11151B2064n932R652Q087Q929J5507j1436j2953l5770q094K0472O886j1781J0608
$$ 22064 16132 25784 33871 42800 58307 46871 33918 -1852 -9946 10526 17412 5631 16239
11138A6239k7002P631L5065j288l5096o920l954L735K0501L0275K2214k1649k4409
$$ 16239 -10763 -3132 31933 30645 -4451 -11371 -15325 -11590 8911 39186 61400 39751 15342
11125A5342k5739j4893K5256M1269L4585k9977k2244O455K0740n546J1652l5430
$$ 15342 -10397 -25290 -34 41235 75820 45843 23599 30054 50794 45248 56900 21470
11113B1470k4208j8030K2833J057P691J760O366J0798N41j9196k39R759K4991
$$ 21470 -2738 -20768 2065 3122 10813 12573 18939 29737 30278 11082 10843 20602 45593
11100D5593j1414l5484k6078j8299K9514J8343j3392j8595K8595J956o315p167
$$ 45593 34179 -1305 -27383 -45682 -16168 2175 -11217 -29812 -1217 739 -5576 -12743
11088a2743J516j420R806K8504j0088M092q667K324m23l707o776p528J4461O315
$$ -12743 -11227 -12647 -2841 25663 15575 19667 11000 13324 12901 9194 2418 -5110 9351 15666
11074A5666J6860K6530k7856r800N933j7851K4778J4506k550O888n104j6177j3722
$$ 15666 32526 59056 31200 21400 27333 9482 34260 48766 46216 53104 48000 31823 18101
11061A8101O004n19j9686J4716L4056K357j4662j2593j7019k627j7405l4679j170
$$ 18101 24105 23586 3900 18616 52672 55029 40367 27774 10755 8128 -9277 -43956 -45126
11048d5126J4539K3198L5058K2957L684n720k2300j1533j0512j0443L692P084
$$ -45126 -30587 -7389 27669 50626 54310 48590 26290 14757 4245 -6198 -2506 4578
11036D578Q636j3537j4024J3902r902m297k3321o423L197J4021J6353J4175K0734
$$ 4578 13214 -323 -14347 -445 -10347 -14644 -37965 -44388 -41191 -27170 -10817 3358 24092
11023B4092K7659j103j6755J2045J2013j9855j0530q870M391q190j1105K1212
$$ 24092 51751 50648 33893 45938 57951 38096 27566 18696 23087 14897 3792 25004
11011B5004l292J2900k0464j892M1597K666j5652j210K442J2109K709o730K423
$$ 25004 21712 34612 14148 12256 53853 56519 40867 39657 42099 54208 56917 50187 52610
10998E2610n680j3043m4498k4708J071J5558M09j6244n5M152K6293J3852J01J0179
$$ 52610 46930 33887 -10611 -35319 -34248 -18690 -18281 -34525 -34580 -30428 -4135 9717 9818 19997
10984A9997k1694P614K2770K5659j2177m365j017j7996j9983l255O413N699m071
$$ 19997 -1697 5917 28687 54346 42169 37804 36787 18791 -1192 -4447 1966 7665 3594
10971C594J2007j1592O688J0232J1839n843K153L200j2570k744J5809k318j2716
$$ 3594 15601 4009 10697 20929 32768 26925 29078 32278 19708 16964 32773 30455 17739
10958A7739j093K7855L8612P964m2760j1143j3837j8292j0437K2923J4117K8593
$$ 17739 16646 44501 83113 91077 48317 37174 23337 5045 -5392 17531 31648 60241
10946F0241m002j3350j9708k5988k2251K5520J299k4460r590K0707L3353r40R400
$$ 60241 56239 42889 23181 -2807 -25058 462 1761 -22699 -32289 -11582 21771 20831 30231
10933C0231J2012q736P57M195L299J707k848K796k288r957q382m5797M426L1997
$$ 30231 42243 33507 34264 38459 41758 43465 40617 43413 41125 31168 22786 -23011 -18585 13412
10919A3412K9212m227l2360M1745P54j5608J834K6011j9019m609J2623K0768j004
$$ 13412 42624 38397 6037 47782 48536 32928 34762 60773 41754 37145 49768 70536 69532
10906F9532l879K378j9420R922q245N987j0100n180j7952n761j1579L044K6185
$$ 69532 65653 68031 48611 58533 50288 56275 46175 40995 23043 17282 5703 8747 34932
10893C4932J4216k2251k0941q125K560K2731P729R55j4067J0001K1735J7400p033
$$ 34932 49148 26897 5956 -2169 391 23122 30851 31806 17739 27740 49475 66875 59842
10880E9842k9163l5301q335j4433j0045J3634L5596N591J656K4225j0705O831
$$ 59842 30679 -4622 -12957 -27390 -37435 -23801 11795 17386 19042 43267 32562 39393
10868C9393l265m892n263K3003J4224r8m8559n347J5678j2233R546J6251j515
$$ 39393 36128 31236 25973 48976 63200 63102 14543 9196 24874 12641 22187 38438 36923
10855C6923p076j4181K3402K4829n226r059l989l0788k78L3400J3099J871K1743
$$ 36923 29847 15666 39068 63897 58671 49612 45623 14835 14557 47957 61056 62927 84670
10842H4670l880m7730k8023J2175K5329K1396J4409J4954L040j8685m5645k9225
$$ 84670 80790 33060 5037 17212 42541 63937 78346 93300 96340 77655 32010 2785
10830B785N345p889Q666M1604K3014l4454j4297j1954j748J9333J738j6005j6897
$$ 2785 8130 241 8907 50511 73525 39071 24774 12820 11072 30405 32143 16138 -759
10817g59O17r303j665R760O4187K2738l7789k8962k5699J3389o183l879P933M15
$$ -759 -142 -9445 -11110 -1350 62837 85575 47786 18824 -6875 6514 331 -3548 4385 4800
10803D800J4167M5132j590L232K957j618j3231j6281Q131l450r607m098K6331
$$ 4800 18967 64099 62509 65741 68698 67080 53849 37568 45699 42249 32642 28544 54875
10790E4875L5507J720k4478j5478M552M37Q088l445l538K2284K2822n357J2746
$$ 54875 90382 92102 67624 52146 56698 57135 65223 61778 58240 80524 103346 97989 110735
10777A10735l372k0062j0890l5382M455J9094j1744J4463R555j0332o137O743
$$ 110735 107363 87301 76411 41029 45484 64578 52834 67297 76852 66520 60383 67126
10765F7126J0887K1004J3754l3748J2224K0011N167L6081J8414M7940R6202P1824
$$ 67126 78013 99017 112771 79023 91247 111258 116425 152506 170920 218860 315062 386886
10753C86886P5907J36679K25832M20972P14841Q70971L32379n47125q64836o46682
$$ 386886 462793 599472 825304 1246276 1961117 2832088 3164467 2617342 1752506 1105824
10743A105824l76689j81423j05919q0936q6562n8788J3039l764q738m3925m1347
$$ 1105824 729135 547712 441793 360857 274295 215507 228546 224782 216044 172119 130772
10732A30772j6033k102j5733r841N715J3838J6083k1030j7881R81m432J901J9102
$$ 130772 114739 112637 96904 87063 92778 106616 122699 101669 83788 84769 80337 82238 101340
10719A01340j3524m009j5907j1670k302J036k1504l880Q119n227o690p606o062
$$ 101340 87816 83807 67900 56230 53928 54964 33460 29580 37699 32472 25782 18176 12114
10706A2114M653L1218M237j8251k6102K0491J9411K3669m231J5629N523J6721
$$ 12114 16767 47985 52222 33971 7869 28360 47771 71440 67209 82838 88361 105082
10694A05082p456o414L631k3231j8337j4002Q010L5901J6114q159j4497R137j386
$$ 105082 97626 91212 94843 71612 53275 39273 47283 83184 99298 91139 76642 85779 84393
10681H4393k646R138j3488l716k3242P719J9055j4427K311Q203o819j7738J3896
$$ 84393 81747 90885 77397 73681 50439 58158 77213 62786 65097 73300 66481 48743 62639
10668F2639J3608J428l9541l1906Q741L2924j950j3122J3226K9915o363k4424
$$ 62639 76247 77675 38134 6228 14969 47893 45943 32821 46047 75962 69599 45175
10656D5175N516m649l0401l3380P12L5787L8138K5725J9844l8643l7621J1415
$$ 45175 50691 46042 15641 -17739 -17027 18760 56898 82623 102467 63824 26203 37618
10644C7618R051K8034L311K4038O787j0924j469k7582k0494j5841o286R198L6640
$$ 37618 46669 74703 78014 102052 108839 97915 96446 68864 48370 32529 26243 35441 72081
10631G2081L8082p464l4651k736j6700N937o923l5978M807K9149K5821N131o444
$$ 72081 110163 102699 68048 65312 48612 54549 47626 11648 16455 45604 71425 76556 70112
10618G0112J7545K9368J6439j9931j7198k9256j1425q278j6247n812k2412Q46
$$ 70112 87657 117025 133464 113533 96335 67079 55654 47376 31129 25317 2905 3751
10606C751L2349J6740L0J6604L6949L3591K8123L8979P6515P9977N8138p983m7568
$$ 3751 36100 52840 52870 69474 106423 140014 168137 207116 283631 363608 421746 413763 366195
10593C66195r4626j11291n2937j3411j2748k4462j8750K7700J4460k4230k088
$$ 366195 271569 160278 107341 93930 81182 56720 37970 65670 80130 55900 53812
10582E3812K3343J9629J0660k3228K467Q739J0787l555j331M423M873k664j0910
$$ 53812 77155 96784 107444 84216 86683 95422 106209 102654 101323 105746 110619 107955 97045
10569I7045j2384J1406j5660q561J3851K2516p063j167L104l032K3192J3429J8464
$$ 97045 84661 96067 80407 71846 85697 108213 101150 99983 103087 100055 123247 136676 155140
10556A55140L86m684l161j4617j1216j1721k4361l0589m0152m940J7996Q009K8362
$$ 155140 155526 150842 147681 133064 121848 110127 85766 55177 15025 10085 28081 36090 64452
10543F4452K4355N8117J2047j6269j5029l081K1097K4185M141o827J7061j894
$$ 64452 88807 146924 158971 142702 127673 124592 145689 169874 174015 167188 184249 182355
10531A82355j5825l0106k5759P377L3451O9959Q8851K6643l5757r5389o3485K97
$$ 182355 166530 136424 110665 118042 151493 221452 310303 336946 301189 205800 142315 142612
10519A42612l908q05m3415m1502m354L4948Q250K952J1140l619j7827J7526M64
$$ 142612 138704 137899 94484 52982 48628 83576 91826 94778 105918 102299 84472 101998 102462
10506A02462l894J7607J1726J2707r195j6895j2486P400P875K8687L6318K3630
$$ 102462 98568 116175 127901 140608 131413 114518 102032 109432 117307 145994 182312 205942
10494B05942r853j3525j8757L2894J1927k5201r752J6937M8207J4232L6898J2423
$$ 205942 196089 182564 163807 196701 208628 183427 173675 190612 238819 253051 289949 302372
10482C02372Q232l3090j8835r588J4271J6114j1862K8877r785j8602Q37J4636
$$ 302372 310604 277514 258679 249091 263362 279476 267614 296491 286706 268104 268941 283577
10470B83577J7211J8660m3979j7695J6435N622j9929k7884k0607r445K1045M4996
$$ 283577 300788 319448 275469 257774 274209 279831 259902 232018 211411 201966 223011 268007
10458B68007N2180R978Q017j3520J1271J0991N1083Q4634Q5476J77308K40640
$$ 268007 320187 330165 338182 324662 335933 346924 398007 482641 568117 745425 986065
10447I86065K3686j78621j65523j02317n8515m1010k1004l3676n9452m0900R776
$$ 986065 1009751 831130 665607 563290 504775 463765 442761 409085 349633 308733 318509
10436C18509K8161O535J1800P629K191N427J095P961K8295K8733j8991K2622J6095
$$ 318509 346670 353205 365005 372634 374825 380252 381347 389308 417603 446336 427345 449967 466062
10423D66062J2876M4461L6713L054p724l611R584L9503r942R537M8300Q409k109
$$ 466062 478938 523399 560112 563166 555442 551831 561415 600918 590976 600513 648813 657222 655113
10410F55113j415l0816r17J8224K1394M2254L7953Q478l4186j715P1257N6578
$$ 655113 653698 622882 621965 640189 661583 703837 741790 750268 716082 714367 785624 842202
10398H42202K7391L046J7490q904K9425N2320L7137J2652N5327J22497J20706
$$ 842202 869593 872639 890129 881225 910650 962970 1000107 1012759 1068086 1190583 1311289
10387A311289J23827J30822J31039J56677J81557J85391J78485J91735L02147
$$ 1311289 1435116 1565938 1696977 1853654 2035211 2220602 2399087 2590822 2892969
10378B892969K14482l0087p4791J2643J10618J54093K05169K35470K03440K99842
$$ 2892969 3107451 3077364 3002573 3015216 3125834 3279927 3485096 3720566 3924006 4223848
10368D223848M98330P32091J033134J287441P88239k30221m32102o49N09003Q63094
$$ 4223848 4722178 5454269 6487403 7774844 8563083 8332862 7900760 7900111 8409114 9272208
10358I272208J129616J330014J607670K026316K641595L567017M807044O383302
$$ 9272208 10401824 11731838 13339508 15365824 18007419 21574436 26381480 32764782
10350C2764782Q619067J2024972J7679992K7664369M5921036P9532050J33747742
$$ 32764782 41383849 53408821 71088813 98753182 144674218 224206268 357954010
10343C57954010J64549975N4121348j15587912j59756193j13899292o4695428
$$ 357954010 522503985 576625333 461037421 301281228 187381936 122686508
10337A22686508l6277554k1916048j4130953r797961p212283n321826m054031
$$ 122686508 86408954 64492906 50361953 40563992 33351709 28029883 23975852
10330B3975852l279031k791002k272019j747290j366998j093695q90493p17480
$$ 23975852 20696821 17905819 15633800 13886510 12519512 11425817 10535324 9817844
10322I817844o25740l50232R3238J52042n88413j270210j224759r22936o47684
$$ 9817844 9192104 8841872 8935110 9087152 8498739 7228529 6003770 5080834 4433150
10313D433150l99660k14182r2759j55075l06586l73498l20494k21882j62023j83610
$$ 4433150 4033490 3819308 3726549 3571474 3264888 2891390 2570896 2349014 2186991 2003381
10303B003381j93400j57224r5210j3971p5674m1709J4923J9108J0708j0331p802
$$ 2003381 1809981 1652757 1557547 1543576 1467902 1426193 1441116 1460224 1470932 1460601 1452799
10292A452799k4798q2174p5381o8344j01116j01621o3843l5587J0837k3851n6460
$$ 1452799 1428001 1345827 1270446 1202102 1100986 999365 935522 899935 910772 886921 830461
10281H30461o2369l6863M646q107j806k7506m2234n4225n5892k5081j1960K65
$$ 830461 768092 731229 735875 727768 725962 698456 656222 601997 546105 521024 509064 509329
10269E09329K1968L847k3809n454N736Q87J5147J781p655P384P843l411m802l3137
$$ 509329 531297 535144 511335 505881 511617 512504 527651 529432 521777 529161 537004 533593 528791 495654
10255D95654j9359l3331k4443m2425K99p142k0132R301N107j0528m9092p0477
$$ 495654 476295 442964 418521 376096 376395 369253 349121 358422 363529 353001 303909 233432
10243B33432R501O02k3642R09J2141k0585k3876n380p720r694K795J3419L4180
$$ 233432 242933 243535 219893 220802 232943 212358 188482 183102 175382 165688 168483 181902 216082
10230B16082K7518J2083k4701j9247L6506K0318L5415M9631L9302K0166j2167
$$ 216082 243600 255683 230982 211735 248241 268559 303974 353605 392907 413073 400906
10219D00906J9396N1251O2806O0320j5657j09787r9558n0900l4427l3787k055
$$ 400906 420302 471553 534359 594679 579022 469235 369677 318777 284350 250563 248508
10208B48508L0719R813q42O364q137N117K7833J5122M8062Q3679J27031K31070
$$ 248508 279227 289040 288198 294562 286425 291542 319375 334497 382559 466238 593269 824339
10196H24339L11413M27428L05505J16574K13986M08156K61023k34306l99511k32454
$$ 824339 1135752 1563180 1868685 1985259 2199245 2607401 2868424 2634118 2234607 2002153
10186B002153j31798l07651m09102k99986k06092j57146p7981j9842L03k1339
$$ 2002153 1870355 1562704 1153602 853616 647524 490378 412397 392555 392858 371519
10176C71519j5207l8641O93j9821m3471M776M173K4102o721j0546n822k4994j7167
$$ 371519 356312 317671 318364 298543 255072 259848 264021 288123 281402 270856 265034 240040 222873
10163B22873n886K0340K4706J5193J6274P037j6304j2478l7836n8801k4472p698
$$ 222873 216987 237327 262033 277226 293500 300537 284233 271755 233919 175118 150646 142948
10151A42948m874l4463L458M2540J0650j8410j0885j4007j0312J6089L2520L8419
$$ 142948 138074 103611 107069 149609 160259 141849 130964 116957 106645 122734 155254 193673
10139A93673L7521J4929o017k1857l4016j6697j9664q883m250j4910k2966K510
$$ 193673 231194 246123 240106 218249 184233 167536 147872 138989 134739 119829 96863 99373
10127I9373k2543N821J8941K8247K6708k5608l5262L0597K4194r227q242k7514
$$ 99373 76830 82651 101592 129839 156547 130939 95677 126274 150468 141241 132999 105485
10115A05485l9759M22L9319n24k9330k3533J6646J740R212J060K5880L0532P818
$$ 105485 65726 66148 105467 104943 75613 52080 68726 70466 79678 80738 106618 137150 144968
10102A44968L2409q254k2509p069j6009P564j1894R193l0426k3262j7682J757
$$ 144968 177377 169123 146614 139545 123536 131100 119206 128399 97973 74711 57029 58786
10090E8786K3471k136j5170n343k718O663k2717o435K685R783j4674K349M5903
$$ 58786 82257 80121 64951 59608 56890 63553 40836 34401 37086 46869 32195 34544 80447
10077H0447M7290K3209k102l7361o95J0301k1985k1266j4750k011M322K6401k016
$$ 80447 127737 150946 148844 111483 110788 121089 99104 77838 63088 61077 65399 91800 89784
10064H9784M138l679j9190J6726J6517M212k7663j2772k0824j921l825J4845r718
$$ 89784 93922 90243 71053 87779 104296 108508 80845 68073 47249 45328 41503 56348 46630
10051D6630J5998K3229R860k1044M099J4502J116J042k2078o969P617o630J1672
$$ 46630 62628 85857 95717 74673 78772 93274 94390 95432 73354 66385 74002 67372 79044
10038G9044K0643l6376j1699K5519J284O245l062j5668j6958J045o239O338K0784
$$ 79044 99687 63311 51612 77131 78415 84660 81598 65930 48972 50017 43778 50116 70900
10025G0900K394j0780k4498k1669j5717M116K0599L850L5851J5124k2733l5119
$$ 70900 73294 62514 38016 16347 630 4746 25345 29195 65046 80170 57437 22318
10013B2318r19K661L4715J6952L356k254j6820k855J2921N132J249J6787k0676
$$ 22318 21399 24060 58775 75727 79083 76829 60009 57154 70075 75207 76456 93243 72567
10000G2567L140J7325j1387m9389l4847O806Q032J3990O88J900R684L0375J3530
$$ 72567 75707 93032 81645 32256 -2591 4215 12247 26237 26925 28825 38509 68884 82414
9987H2414K5838K694n791j5766J6605P493k6581J2561J2727l6770k4338p790k958
$$ 82414 108252 110946 105155 89389 105994 113487 86906 99467 112194 75424 51086 43296 40338
9974D0338M434K7134r890k2246J5834J0358j0306j5674K1274r46J0075L5543j3609
$$ 40338 44772 71906 62016 39770 55604 65962 55656 39982 61256 60310 70385 105928 92319
9961I2319j5220l303Q601K1808N575J2347k0259j525j409j5986k2101J3645K8329
$$ 92319 77099 73796 82397 104205 109780 122127 101868 100343 98934 82948 60847 74492 102821
9948A02821K377p998J217L9409J6666J9705K7625L8414M3268O2718Q8834J20660
$$ 102821 105198 97200 98417 137826 154492 174197 201822 240236 283504 346222 435056 555716
9936E55716J99888L14132N64540Q96136O83894k72016q66159p24057m75175k74509
$$ 555716 755604 1069736 1634276 2530412 3214306 2942290 2076131 1352074 876899 602390
9926F02390j64297j03400k3262m4705m1395k0804l512J0981k953j8185r315j7297
$$ 602390 438093 334693 311431 266726 225331 204527 201015 211996 209043 190858 181543 164246
9914A64246l1800k2148J937j7129j6169l410Q430p572j963k2059j9075J0726q410
$$ 164246 132446 110298 112235 95106 78937 75527 83957 76385 74422 52363 33288 44014 35604
9901C5604k7233o188J0532K8621J7263L1466J9771l342k3680O801O4J2267j3970
$$ 35604 8371 2183 12715 41336 58599 90065 109836 106494 82814 89615 89679 101946 87976
9888H7976n1896k1669q120J3475K2683J9093Q182K3633J649J2087J6355K9735
$$ 87976 36080 14411 6291 19766 42449 61542 69724 93357 95006 107093 123448 153183
9876A53183L1018j8229J8486M2590N8798P6295J49951K30111K86242N5580k41508
$$ 153183 184201 165972 184458 227048 285846 362141 512092 742203 1028445 1084025 842517
9865H42517k72765j28387p8885o1004k2665j5226k6707l7438k9668k2248l2743
$$ 842517 569752 441365 362480 301476 278811 263585 236878 199440 169772 147524 114781
9854A14781o780K1417M1951j4664l6178m232l446J374J5404K9296m254j721l386
$$ 114781 108001 129418 171369 156705 120527 116295 112849 114223 129627 158923 154669 152948 149562
9841A49562J0992j1849k8646m0949Q47K4695M132J1877j1484r66J7745K3568L0701
$$ 149562 160554 148705 120059 79110 79957 104652 108784 120661 109177 108211 125956 149524 180225
9828A80225k0552L218k7791j3352k0870n802J8555P660J7599j2213Q67k7657m8152
$$ 180225 159673 162891 135100 121748 100878 95076 113631 121291 138890 126677 127544 99887 51735
9815E1735k0410J5879J9458n548k6471K9689O1165q900l1107j5031r914o325M0622
$$ 51735 31325 47204 66662 61114 34643 64332 125497 116597 85490 70459 60545 54220 94842
9802I4842P294P375J7978n335p894j6667J6606K1775J929P600j2015R86k5424
$$ 94842 102136 109511 127489 122154 114260 97593 114199 135974 137903 145503 133488 134474 109050
9789A09050l0844j0760J7203K8412J2437j8555j7982R409j7282k5156j7506l209
$$ 109050 78206 67446 84649 113061 125498 106943 88961 98370 81088 55932 38426 35217
9777C5217j7548j8770K9792M5167m622j4898j9575K721K4610J0398j8804Q980
$$ 35217 17669 -1101 28691 73858 69236 54338 34763 37484 62094 72492 53688 62668
9765F2668L0545m292L370p620J22P37j821J9131k1407j9147r625J1132R314K0808
$$ 62668 93213 88921 92291 84671 84793 85530 83709 102840 81433 62286 52661 63793 73107 93915
9751I3915R210l32j0669k3255k6934N400M2225j8773m211L0687O904k3960l12
$$ 93915 103125 102793 92124 68869 41935 47335 89560 70787 66576 97263 104167 80207 79895
9738G9895K535j2135K2236j2907K3009K0591j6587P665N928O036n067k9691m843
$$ 79895 82430 70295 92531 79624 102633 123224 106637 114302 120230 126266 121199 91508 86665
9725H6665J6617j0969j2060K1263M783l516N637j995l6163j2392L0612J5891k0681
$$ 86665 103282 92313 80253 101516 106299 102783 108420 106425 70262 57870 88482 104373 83692
9712H3692j4784J7468P402K4329j4272k6090J3853J8846L156J5437M4999J6936
$$ 83692 68908 86376 93778 118107 103835 77745 91598 110444 113600 129037 174036 190972
9700A90972J7806l3030m1952J275M053n495k6529l3015K7136J979k7339M917K0121
$$ 190972 208778 175748 133796 135071 139124 133629 107100 74085 101221 103200 75861 80778 100899
9687A00899Q394P956r478j1939l183M570j7704l035j8136J0343J9618k0303J1692
$$ 100899 109293 117249 107771 95832 92649 97219 79515 76480 58344 68687 88305 68002 79694
9674G9694M5557J1251k8233l3074J0485P18l664J9771J145j1126N609j712Q225
$$ 79694 125251 136502 108269 75195 85680 86398 82734 102505 103650 92524 98133 96421 104646
9661A04646j151n931J0281o95Q891m342o552O511o707l406J2035j8333j6125L0629
$$ 104646 103495 97564 107845 107150 116041 111699 105147 111658 104951 101545 113580 95247 79122 109751
9647A09751N964k4850J707j4417j7985N132l766J3442J2737m90m315L0114L0433
$$ 109751 115715 90865 92572 78155 60170 65302 61536 74978 87715 87225 82910 113024 143457
9634A43457j1481k0069j6508J2987K1838M588r821p534j1960Q482J5683j809K053
$$ 143457 131976 111907 95399 108386 130224 134812 124991 117457 105497 113979 129662 127853 129906
9621A29906j3294m131K2846J497K5856j8921r233n587r298p759r524k1308Q345
$$ 129906 116612 112481 135327 136824 162680 143759 134526 128939 119641 111882 102358 81050 89395
9608H9395K9932J9396j4130o465j4235J2294M7549L089l7394k9419l688l890J3833
$$ 89395 119327 138723 124593 118128 103893 116187 163736 166825 129431 100012 96324 92434 106267
9595A06267j9041K698j1383L3009J5121j9080j2016j2196M517J3645M087L5923
$$ 106267 87226 89924 78541 111550 126671 107591 95575 83379 87896 101541 105628 141551
9583A41551j7523k9802R995J2513K533M7J0112M691O170K4074r416q332K3858
$$ 141551 124028 94226 104221 116734 119267 119314 129426 134117 140287 164361 154945 146613 170471
9570A70471k6797j3360O188k59j3676K5918K4601J305m537L819o8o332k2437l5859
$$ 170471 143674 130314 136502 136243 122567 148485 173086 174391 169854 173673 173605 167273 144836 108977
9556A08977l400n698k9578n035J5545J6579M765K3871J6161J6893O631K4334r661
$$ 108977 105577 99879 70301 65266 80811 97390 102155 126026 142187 159080 165711 190045 180384
9543A80384k7776l4819r517J747M274k5499l10L8819J8236k152J830J5256l792
$$ 180384 152608 117789 108272 110019 114293 88794 88484 127303 145539 143387 145217 160473 156681
9530A56681m599j7621K9752J5784L149n577P975O967J2813J2872k9943q818l46
$$ 156681 152082 134461 164213 179997 183146 177569 185544 192511 205324 218196 188253 179435 179089
9517A79089j7652J6035J9490n842k6225j3566r05k648J8189j5555j3431K3446
$$ 179089 161437 177472 196962 191120 164895 151329 150424 147776 165965 150410 136979 160425
9505A60425R24l1984p194J2276j1705j0233M0763N0506K6450J8859p116j9723
$$ 160425 161349 129365 122171 134447 122742 112509 153272 203778 230228 249087 241971 222248
9493B22248k6026j6965J3261K5995K1397K615N601J0067M216j594r997j907q332
$$ 222248 196222 179257 192518 218513 239910 242525 248126 258193 262409 260815 250818 248911 240579
9480B40579k2614l4964J541j5640K455J7624J0188j0509O000m56l329M929K3678
$$ 240579 217965 183001 184542 168902 171357 188981 199169 188660 194660 194204 190875 195804 219482
9467B19482k2363n711K3382K578R780J541j0633o732O76K0293J0889j3340j0064
$$ 219482 197119 191408 214790 217368 227148 228689 218056 211324 212000 232293 243182 229842 219778
9454B19778O634o659n894j7933p129K0151j5600j9639K9524M5080J1884J3512
$$ 219778 226412 219753 213859 195926 188797 208948 193348 173709 203233 248313 260197 273709
9442B73709P621l4530j4884j1814R993J860k2798O065r344q027K4274K0414J2649
$$ 273709 281330 246800 231916 220102 230095 231955 209157 215222 205878 197851 222125 242539 255188
9429B55188o205q72N821K12j2989M889N439o06j612L614j0337j3570K1376R765
$$ 255188 248983 248111 253932 254144 241155 246044 251483 250877 249265 252879 242542 228972 250348 260113
9415B60113l328J3372L4431Q23p146j3710j3567o432n697k25L4426K8880o907
$$ 260113 256785 270157 304588 305411 298265 284555 270988 264556 258859 258634 293060 321940 315033
9402C15033l5201r832l658M128Q736L3036J1038l924J7984q703l2577j0501R68
$$ 315033 279832 270000 266342 270470 279206 312242 323280 319356 337340 328637 296060 285559 286527
9389B86527J225J5764k1290j3250J0620j857n226J0413K5788J4901j3495m2334
$$ 286527 287752 303516 282226 268976 279596 277739 272513 282926 308714 323615 310120 267786
9377B67786j4220P205j2358l304L596J7605J5341j580l551J8157K9268M8745j5328
$$ 267786 253566 260771 248413 245109 248705 266310 281651 280071 276520 294677 323945 372690 357362
9364C57362j9021m437N297K8205j089P160N590k7830j5410L0804J1671k602P182
$$ 357362 338341 333904 339201 367406 366317 373477 379067 351237 335827 366631 378302 375700 382882
9351C82882Q694L893L412k5760j4934j1678j2934P159K6936K5725M577j6557j5767
$$ 382882 391576 395469 398881 373121 358187 346509 333575 340734 367670 393395 397972 381415 365648
9338C65648j836j948K1817L4580J5691l395P564J5531L4577J1268K1735L4233
$$ 365648 363812 361864 383681 418261 433952 430557 438121 453652 488229 499497 521232 555465
9326E55465L7843N7337L8996K4202l8964o4118m5468j4382k189Q314j4223N22
$$ 555465 593308 650645 689641 713843 674879 610761 565293 550911 548722 557036 542813 543335
9314E43335L13Q216K6445P796N0950K8410L4163M8509m434j4052m6798j7591L8690
$$ 543335 543648 551864 578309 586105 637055 665465 699628 748137 743703 729651 682853 665262 703952
9301G03952j9499l3034j7399j6034L958J8159M4997P818j779N2547J02313R2308
$$ 703952 684453 651419 634020 617986 621944 640103 685100 692918 691139 743686 845999 938307
9289I38307J00962R2575P5319L870j21062j61580j01104p6120k5708M240o499
$$ 938307 1039269 1131844 1207163 1211033 1089971 928391 827287 751167 725459 729699 723200
9278G23200j8372k228o460J1130J6328O909L1919K1886K5549J201p122M7601K0312
$$ 723200 704828 702600 696140 707270 723598 730507 762426 784312 809861 811062 803940 851541 871853
9265H71853l7855l8855m5590j7273Q911J837n421j5190R29K1806M0968P1852L6266
$$ 871853 833998 795143 749553 732280 741191 743028 737607 722417 723346 745152 786120 857972 894238
9252H94238K9798L8793j1576n5206p8505m5704k6466j2718k9825J8201O706n584
$$ 894238 924036 962829 951253 896047 817542 771838 745372 732654 702829 721030 727736 722152
9240G22152j659j3923l877K2597J4561J2944J2211K408q665j151k2844j6464M052
$$ 722152 720493 706570 702693 725290 739851 752795 765006 767414 758749 757598 734754 718290 722342
9227G22342K0570m672m812M5347J5201N867K6221R850n618k3665R100K9712K0445
$$ 722342 742912 738240 733428 778775 793976 799843 826064 835914 830296 806631 815731 845443 865888
9214H65888O980J4421m41k7698N158K5221J2577m730j2860M936R750K3393k5833
$$ 865888 872868 887289 886848 859150 864308 889529 902106 897376 884516 889452 899202 922595 896762
9201H96762J7398M999o617l925J9255J4311R229J8n867K4768K4300l549k9123
$$ 896762 914160 919159 912542 908617 927872 942183 951412 951430 945563 970331 994631 991082 961959
9188I61959K4744J1092J6553K9016m374K0534N049K0118L2529M6637K111j9129
$$ 961959 986703 997795 1014348 1043364 1038990 1059524 1064573 1084691 1117220 1163857 1165968 1146839
9176A146839k3912P339L1997J3711N06N819J5691k151L1323p447j0882J4179L3853
$$ 1146839 1122927 1130266 1162263 1175974 1176480 1182299 1197990 1195839 1227162 1219715 1208833 1223012 1256865
9163A256865L8017J0068n580n171L1866L38o614L7283Q086k6566j1344K8180M9612
$$ 1256865 1294882 1304950 1299370 1294199 1326065 1326403 1319789 1357072 1365158 1338592 1327248 1355428 1405040
9150A405040L3887L1057J6698J5698K5176L6805J6109J1277P31O137J4850L6755
$$ 1405040 1438927 1469984 1486682 1502380 1527556 1564361 1580470 1591747 1592478 1598615 1613465 1650220
9138A650220L3517K0668N540m781L9992L2383J9282l25K896J0591L1140J7465
$$ 1650220 1683737 1704405 1709945 1705164 1745156 1777539 1796821 1796496 1799392 1809983 1841123 1858588
9126A858588L3594K7009L4203L5974M8868L1430K5613j930J6844M0402N1673N2151
$$ 1858588 1892182 1919191 1953394 1989368 2038236 2069666 2095279 2093349 2110193 2150595 2202268 2254419
9114B254419N0964K8859K6982l112J2900L4171L9660O0299L1508K3783J7208J9855
$$ 2254419 2305383 2334242 2361224 2358112 2371012 2405183 2444843 2505142 2536650 2560433 2577641 2597496
9102B597496L5141Q1372N3241M0959M2510M0150J9717M4384K3502J7314N3047
$$ 2597496 2632637 2714009 2767250 2808209 2850719 2890869 2910586 2954970 2978472 2995786 3048833
9091C048833R7368L4908L7405N4308N1213M3031L9920M6554O4574N3227P8122
$$ 3048833 3146201 3181109 3218514 3272822 3324035 3367066 3406986 3453540 3518114 3571341 3649463
9080C649463O1313K5018N7252Q6407P9775N7172O7270R2330R9185N0200L9353
$$ 3649463 3710776 3735794 3793046 3879453 3959228 4016400 4083670 4176000 4275185 4325385 4364738
9069D364738Q6124Q8238O4904N9017Q7114J10760J15948P7178P1947J03426J02953
$$ 4364738 4450862 4539100 4604004 4663021 4750135 4860895 4976843 5054021 5125968 5229394 5332347
9058E332347J31489R1465J14702J07978J06886J41683J10839J01254J06634J18430
$$ 5332347 5463836 5555301 5670003 5777981 5884867 6026550 6137389 6238643 6345277 6463707
9048F463707J41737J62179J71518J53340J28301J42597J34298J55222J60775J48926
$$ 6463707 6605444 6767623 6939141 7092481 7220782 7363379 7497677 7652899 7813674 7962600
9038G962600J66498J80121J99650K13593K25589K17456J56449J59337J98717J84700
$$ 7962600 8129098 8309219 8508869 8722462 8948051 9165507 9321956 9481293 9680010 9864710
9028I864710K28726K36664K36180K31934K46166K55194K56134K44949K36239K54313
$$ 9864710 10093436 10330100 10566280 10798214 11044380 11299574 11555708 11800657 12036896 12291209
9018A2291209K85167K94533K61315K90387K80564K75337K83541K92997K95563
$$ 12291209 12576376 12870909 13132224 13422611 13703175 13978512 14262053 14555050 14850613
9009A4850613L13738L07771L08325K90316L19238L05806L02389L02065K94733
$$ 14850613 15164351 15472122 15780447 16070763 16390001 16695807 16998196 17300261 17594994
9000A7594994L05714K84173K69312K52930K31409K59946K29540J95890K09966
$$ 17594994 17900708 18184881 18454193 18707123 18938532 19198478 19428018 19623908 19833874
8991A9833874K22934K05329J95825J79927J43991J03010R0107P3700P4331O4822
$$ 19833874 20056808 20262137 20457962 20637889 20781880 20884890 20974997 21048697 21123028 21187850
8981B1187850M0464j2352m8677m7538m3462n9929q5360j26462j42858j21359j58873
$$ 21187850 21228314 21215962 21167285 21119747 21076285 21016356 20930996 20804534 20661676 20540317 20381444
8970B0381444j89192j90890k50985k31791k31461k41793k68241k96806k84086
$$ 20381444 20192252 20001362 19750377 19518586 19287125 19045332 18777091 18480285 18196199
8961A8196199k53762k61030l09226l38879l02459k89915l22920l21131l06090
$$ 18196199 17942437 17681407 17372181 17033302 16730843 16440928 16118008 15796877 15490787
8952A5490787k99152k99866k95956k73071k86287l16421k94534k81820k62652
$$ 15490787 15191635 14891769 14595813 14322742 14036455 13720034 13425500 13143680 12881028
8943A2881028k53953k48655k64750k57422k55865k39960k56880k55172k42122
$$ 12881028 12627075 12378420 12113670 11856248 11600383 11360423 11103543 10848371 10606249
8934A0606249k36519k05024k04830k49091k18226j93876k04543j80823j85785
$$ 10606249 10369730 10164706 9959876 9710785 9492559 9298683 9094140 8913317 8727532
8925H727532k13831j74690j74527j63267j39280j72952j63175j61991j55792j55231
$$ 8727532 8513701 8339011 8164484 8001217 7861937 7688985 7525810 7363819 7208027 7052796
8915G052796j52584j57775j39195j34705j31473j36658j41414j15248r9637r8915
$$ 7052796 6900212 6742437 6603242 6468537 6337064 6200406 6058992 5943744 5844107 5745192
8905E745192j02128q8986r4336p7682j06152j14894j04008q0133n8823n9299p0376
$$ 5745192 5643064 5554078 5459742 5382060 5275908 5161014 5057006 4976873 4918050 4858751 4788375
8894D788375o8530r6090r1912p8233n8709l8851n1369n6333o3271m0187l5101
$$ 4788375 4719845 4623755 4531843 4453610 4394901 4356050 4304681 4248348 4185077 4144890 4109789
8883D109789m0510m9051o3015k4529l801j7405J2934M9780N8857J9663L5660P7729
$$ 4109789 4069279 4020228 3957213 3932684 3928883 3911478 3924412 3974192 4033049 4052712 4088372 4166101
8871D166101J12949J43377J25479J49968K74899M42158O78159J088305J743162
$$ 4166101 4279050 4422427 4547906 4697874 4972773 5414931 6093090 7181395 8924557
8862H924557K899204M632432O400208M392804k485666o312870n519158l519368
$$ 8924557 11823761 16456193 22856401 27249205 24763539 18450669 12931511 9412143
8854I412143k118924j329151q39800n48699m05416k67124j79541j45371j61185
$$ 9412143 7293219 5964068 5124268 4575569 4170153 3903029 3723488 3578117 3416932
8845C416932j76436j47942j33325j20920j19706q9454p8908j01898j22482j01540
$$ 3416932 3240496 3092554 2959229 2838309 2718603 2629149 2550241 2448343 2325861 2224321
8835B224321o0063n1014j6191l5082o1029o7083k7535l5871n7971l4550k4383
$$ 2224321 2164258 2113244 2097053 2061971 2000942 1933859 1906324 1870453 1812482 1777932 1753549
8824A753549l8171k9578O234l8306n9647q904J2302k2987k8339J111k2000N398
$$ 1753549 1715378 1685800 1692034 1653728 1594081 1585177 1597479 1574492 1546153 1547264 1525264 1530662
8812A530662k8759l5195l4019j753n577j6856j2381j3946l8881j115l5425k2400
$$ 1530662 1501903 1466708 1432689 1430936 1425359 1408503 1396122 1382176 1343295 1342180 1306755 1284355
8800A284355j3548L457j6179l0447m1951k1791j3453Q877N050l236j4272j9985
$$ 1284355 1270807 1274264 1258085 1227638 1185687 1163896 1150443 1159320 1164370 1161134 1146862 1126877
8788A126877j218j4056j946k2408j1314j5765l5738l7893N222M934k0943j6572
$$ 1126877 1125659 1111603 1109657 1087249 1075935 1060170 1024432 986539 991761 996695 975752 959180
8776I59180J974k4565j3498r188R173M2639N356m8670k3833k8299K0656J7237
$$ 959180 961154 936589 923091 913903 923076 965715 971071 922401 898568 870269 890925 908162
8764I08162j5626j9597p064j6422k7761J2497N237l437n619j6528k4799J447j2711
$$ 908162 892536 872939 865875 849453 821692 834189 839426 835989 830370 813842 789043 790490 777779
8751G77779j8963K0778j0381l0292j4421O093K3153k7346k681J48J0025K7023
$$ 777779 758816 779594 769213 738921 724500 730593 753746 726400 723719 723867 733892 760915
8739G60915k3937j6710l520m438j7017R214O182N067k7543m9113j9562j0110o763
$$ 760915 736978 720268 716748 712310 695293 704507 710689 715756 688213 639100 619538 609428 602665
8726F02665M5183K2615j2708r620k6579K292L225j4751K6192L1944j273p022l6187
$$ 602665 647848 670463 657755 648135 621556 623848 627073 612322 638514 670458 669185 662163 625976
8713F25976l114k6949q153K603j5104m031k116Q121P474k1579k9640r702j0390
$$ 625976 622862 595913 587760 590363 575259 571228 569112 577233 584707 563128 533488 523786 513396
8700E13396K049l239l0658J1286L4749r432K561K3888q120l8457j3963J3838J2237
$$ 513396 515445 512206 481548 492834 527583 518151 520712 544600 536480 498023 484060 497898 510135
8687E10135j1759q120J492j5133J1181j338k0465k5927O162j0991p667J686J7837
$$ 510135 498376 490256 491748 476615 487796 486458 465993 440066 446228 435237 427570 429256 447093
8674D47093P601R396j4719J0996J3826j1622K1307j3065k6040l074j8538j7073
$$ 447093 454694 464090 449371 460367 474193 462571 483878 470813 444773 441699 423161 406088
8662D06088J1529P427j323j562J7411j189k902N82o629n81n858j3952m554Q741
$$ 406088 417617 425044 423721 422159 439570 438381 435479 436061 429432 428851 422993 409041 404487 413228
8648D13228k8682l2504k944p066K3946q303k586O073k247j256k7319j8632L7432
$$ 413228 384546 352042 349098 342032 365978 357675 355089 361162 358915 357659 330340 311708 349140
8635C49140K2535p296j7081P365n329l411P903K4165j0960j4130l03J4535J3953
$$ 349140 371675 364379 347298 354663 349334 345923 353826 377991 367031 352901 352598 367133 381086
8622C81086k0311o565K1428l032k366J1398j0903j599O786j5652j0297M372j4386
$$ 381086 360775 354210 375638 372606 370240 381638 370735 369136 375922 360270 349973 354345 339959
8609C39959r2K9144k786j4608J558J213j2013J755Q305j1876j4161j032P711J2009
$$ 339959 339867 369011 366225 351617 353175 354388 342375 344130 352435 340559 326398 325366 333077 345086
8595C45086J9976P168O533N794j4889L6942M5675k2343j3219J4984P717j266l437
$$ 345086 365062 372230 378763 384557 369668 406610 452285 429942 416723 431707 439424 438158 434721
8582D34721N984K8072m611m378J3838J9609L4540k4056l8064l0829n134k276l5209
$$ 434721 440705 468777 464166 459788 473626 493235 527775 503719 465655 434826 429692 427416 392207
8569C92207l5057k2584L134j9647k5867l057l40N463J064r949l888j1617k0475
$$ 392207 357150 334566 337700 318053 292186 289129 288789 294252 295316 285367 281479 269862 249387
8556B49387P489Q595r378k2522k8402O031o690J0n945L2804j1969O594L4050R350
$$ 249387 256876 265471 256093 233571 205169 211200 204510 204520 198575 231379 219410 226004 260054 269404
8542B69404O339j7674m918J3481j5894l3227m140o102J4367j7058r406n98K9335
$$ 269404 275743 258069 253151 266632 250738 217511 213371 207269 221636 204578 195172 194574 223909
8529B23909j6762M895R316j0957l403J2031P934l0514k5116l061j9458J0883K5235
$$ 223909 207147 212042 221358 210401 206998 219029 226963 196449 171333 168272 148814 159697 184932
8516A84932j0852m032L550L869l353r413J0686r931L902N042j3700K913J1040
$$ 184932 174080 170048 173598 177467 174114 164701 175387 165456 169358 174400 160700 163613 174653
8503A74653j6499K6945q68j0324K754Q965j4823k1610j765J0371R308L870J2659
$$ 174653 158154 185099 184231 173907 176661 185626 170803 149193 147428 157799 167107 170977 183636
8490A83636l953n972j9226K3283P793j48J0705J8651J5880k0485L530K08k4966
$$ 183636 179683 173711 154485 177768 185561 185413 196118 214769 230649 210164 213694 213902 188936
8477A88936k2920N78o963J9171J4377k1601l579l985r570J5468O066Q394J1343
$$ 188936 166016 166594 159631 178802 193179 171578 167999 164014 154444 169912 175978 184372 195715
8464A95715j041J3224J99n17k65k643J0461J1828K5339J6145l7528o2254r834
$$ 195715 194674 207898 208097 207580 207315 204672 215133 226961 252300 268445 230917 168663 158829
8451A58829L71O652q028k7681m390J9469K617L140k317J353R670P078K3004r146
$$ 158829 159200 165852 157824 130143 125753 145222 147839 150979 148662 150015 159685 166763 189767 180621
8437A80621j4560j885m036r655K385K967J0626k8652j7523J2672N72l6126j8496
$$ 180621 166061 164176 160140 150485 152870 155837 166463 137811 120288 132960 133532 97406 78910
8424G8910O1587M424k5918j8614j422M3846L7116Q501k5613k2076l5776k2358
$$ 78910 140497 144921 119003 100389 98967 142813 179929 188430 162817 140741 104965 82607
8412H2607J2514K4284j1867J181J5595O311o671K0814p049l6107j4256L0866R852
$$ 82607 95121 119405 107538 108719 124314 130625 123954 144768 137719 101612 87356 118222 128074
8399A28074j8906m983l926j2420q391k8411l051j3315J4192M5312L5324P133j7611
$$ 128074 109168 104185 100259 87839 79448 51037 47986 34671 48863 94175 129499 136632 119021
8386A19021j7429j166J0378n284K615j228k2012k3670M4986J8845l3569k2275
$$ 119021 101592 100426 110804 105520 108135 106907 84895 61225 106211 125056 91487 69212
8374F9212J6438K5010J732l5625L852J1579J4861j1723r752m350J914J3220J7285
$$ 69212 85650 110660 112392 76767 80619 92198 107059 95336 85584 81234 83148 96368 113653
8361A13653K2696K0604J0183o956r479k0468l2384k6323o41n469J9560n168j2853
$$ 113653 136349 156953 167136 160180 150701 130233 97849 71526 70885 65416 84976 79808 66955
8348F6955j102O033K1027J0104j634J6318n062l6510j9573K6253L8858j0273m241
$$ 66955 65853 71886 92913 103017 101383 117701 112639 76129 56556 82809 121667 111394 107153
8335A07153J4588k933J2155K1736q392L843J2334N80m5323l5794k5189r757L948
$$ 107153 121741 118808 130963 152699 144307 148150 160484 161064 115741 79947 54758 45001 48949
8322D8949n065l107N787K7099N028K0542J4152J1238R01l5313N1o06j5793R0O880
$$ 48949 43884 40777 46564 73663 78691 99233 113385 124623 125524 90211 90262 89656 73863 73953 80833
8307H0833L195J5363K1241k541j6391l2785Q633J7809K155p664k7973r073l499
$$ 80833 84028 99391 120632 118091 101700 68915 77548 95357 97512 89848 61875 52802 49303
8294D9303J6692J6465k243o561n603k916n696L0973K4999R124k0132R172j5451
$$ 49303 65995 82460 80217 73656 68053 65137 59441 90414 115413 124537 104405 113577 98126
8281I8126k3814J5174j9019j0601K3479k0029l2668j3871K91K4082J2497N608
$$ 98126 74312 89486 70467 59866 83345 63316 30648 16777 17068 41150 53647 59255
8269E9255J6120l815o198M633N65Q246R935J854J2372J8185k1560L869J8106J8458
$$ 59255 75375 71560 65362 69995 70560 78806 88741 90595 102967 121152 99592 103461 121567 140025
8255A40025N593k5236k4870j2862p251J2297j736O019M153j7126l7703P174q67
$$ 140025 145618 120382 95512 82650 75399 87696 85960 91979 96132 79006 41303 48477 47610
8242D7610M0257J6187q359j5996M678K0745J0028k2263k3724j3675j4255J6342
$$ 47610 87867 104054 95695 79699 84377 105122 115150 92887 69163 55488 41233 57575
8230E7575j7374O193K7213O024r21L3455n627J3876K440j9991j6022p805L106
$$ 57575 40201 46394 73607 79631 78710 112165 106538 120414 122854 102863 86841 79036 82142
8217H2142K779n925p334k822L246J9197M125L448j508r697k1350L190K0551l4996
$$ 82142 84921 78996 71662 68840 72086 91283 95408 98856 97348 87651 66301 69491 90042 55046
8203E5046k3192r575J6487J4868N653J1452M947j7626j6926k538K0462p313J4888
$$ 55046 31854 22279 38766 53634 59287 70739 75686 58060 41134 38596 59058 51745 66633
8190F6633J8922j4034k2865M736K193j0892j3031j59J9567j565J1535O241M734
$$ 66633 85555 71521 48656 53392 55585 44693 31662 31503 51070 49505 61040 67281 72015
8177G2015J4161J3980l6589j2870L323m179J9055K8880k41j8286j1934l3705J4226
$$ 72015 86176 100156 63567 50697 54020 49841 68896 97776 97535 79249 67315 33610 47836
8164D7836J3147r706j6748K0798J6214j348Q204n017k2873r624L3623K418K0086
$$ 47836 60983 51277 34529 55327 71541 70193 78397 73380 50507 40883 74506 76924 97010
8151I7010m163q006j863j2483J0023K0194R267k350j2899j947j6522j9981m3932
$$ 97010 92847 84841 82978 70495 80518 100712 109979 107629 94730 92783 76261 56280 12348
8138A2348k1270J6019K0855K4953J2817J7657j8004R838R234k4621k2648J3720
$$ 12348 -8922 7097 27952 52905 65722 83379 65375 75213 84447 59826 37178 50898
8126E0898k4273p401K2173M9754L3624o952j8085l3549k9415l776j3313j5470
$$ 50898 26625 19224 41397 91151 124775 117823 99738 66189 36774 32998 19685 4215
8114D215J9893J3379L643q932K0521J6424J5861J3718j2538m1651j9708j4762
$$ 4215 24108 37487 41130 32198 52719 69143 85004 98722 86184 44533 24825 10063
8102A0063K9726K8785q37j5733o532m13N852K5941l0767N365O337p713J2519k3522
$$ 10063 39789 68574 67737 52004 45472 45059 50911 76852 46085 51450 57787 50074 62593 39071
8088C9071k1862Q549j436k3705j2328J2052K6637j7626M26J4090K5578K1720l3026
$$ 39071 17209 25758 24322 617 -11711 341 26978 9352 9778 23868 49446 71166 38140
8075C8140o82K9371K2232k779k9134j6345k0159K592M2127L4063j075k2754j7061
$$ 38140 37458 66829 89061 86282 57148 40803 20644 23236 65363 99426 98351 75597 58536
8062E8536l9817R477J1446J5769Q096o645l293J9767M564j1354k0405L845j2959
$$ 58536 18719 28196 39642 55411 63507 56862 53569 73336 77900 66546 46141 49986 37027
8049C7027P368j4269M922k4265n910P772j1598j023K3336J6517R383j3285J237
$$ 37027 44395 30126 35048 10783 4873 12645 1047 24 23360 39877 49260 35975 37212
8036C7212j606m033L892K3074P48J9682n170m3351M586k3932q391K3569K7798
$$ 37212 35606 31573 35465 58539 59287 78969 73799 30448 35034 11102 2711 26280 54078
8023E4078J8481n778j0952j7274K4995J0244p658j281n014J8635l3139k458R845
$$ 54078 72559 66781 55829 38555 63550 73794 66136 64855 59841 78476 45337 42879 52724
8010E2724j878l6972j0190J684M1505J8522P055j3030k1420j7553M103J434J7068
$$ 52724 50846 13874 3684 5368 46873 65395 72450 59420 38000 20447 24550 25984 43052
7997D3052P263L203l825j488K1721L1801j6199l0655J4156N728K249P408K1685
$$ 43052 50315 53518 49693 48205 69926 101727 85528 54873 69029 74757 77006 84414 106099
7984A06099j4642O754k5146j5122j4357k2039K0249J2486J0534k6920j2757J2168
$$ 106099 91457 98211 73065 57943 43586 21547 41796 54282 64816 37896 25139 37307
7972C7307n290J8342j0063R678J8959k51k3527r95n897N918k966P687P503j0344
$$ 37307 32017 50359 40296 49974 68933 68682 45155 44160 38263 44181 41215 48902 56405 46061
7958D6061k8312Q722K7738l11R459J3744K299J521R652J7101N472l0306r205O239
$$ 46061 17749 26471 54209 53898 63357 77101 79400 80921 90573 107674 113146 82840 73635 79874
7944G9874L014R529K0355J335j492q606l111j9328J8572J7680k0745R83n562m0523
$$ 79874 82888 92417 112772 114107 112615 104009 100898 81570 100142 117822 97077 98060 92498 51975
7930E1975J903j7919o000m70M527K5937j5245j7067n885O623J2876j0685k0316
$$ 51975 53878 35959 29959 29489 34016 59953 44708 27641 21756 28379 41255 30570 10254
7917A0254n104M116O873q76J624l578L682L1149L1307L0086j4070N525p660m585
$$ 10254 5150 9266 16139 15263 16887 13309 16991 48140 79447 109533 95463 100988 93328 88743
7903H8743K153j2980L544j3291O356j0888k0913J3272K3103J5491Q318j827j1949
$$ 88743 90896 77916 81460 68169 74525 63637 42724 55996 79099 94590 102908 101081 89132
7890H9132j3193k1910K759j2126O804j813k2872o628L3503L8303J791l3232n6884
$$ 89132 75939 54029 56788 44662 51466 49653 26781 20153 53656 91959 93750 60518 3634
7877C634l649L2559j880j4133p557p601K4940m268j2238J2024j1572L824K9407
$$ 3634 -15 32544 30664 16531 8974 1373 26313 22045 9807 21831 10259 14083 43490
7864D3490M198j1611k3101j2428K2018j1948k2557K490K0749J1774j119o278K341
$$ 43490 47688 36077 12976 548 22566 10618 -11939 -9449 11300 23074 21955 15677 18018
7851A8018J7242M960j4680j809J3401O976k7750K634L683n649J9010j1488j1302
$$ 18018 35260 40220 25540 23731 37132 44108 16358 18992 22675 17026 36036 24548 13246
7838A3246N167j501j6413Q870J2144L330j1928n989n693J1740J9597l256K8434
$$ 13246 18413 16912 499 9369 21513 24843 12915 6926 1233 12973 32570 29314 57748
7825E7748K4715j7175l705q09O82q417k5478j7962P128J1867l9438k1454j2448
$$ 57748 82463 65288 61583 60774 61456 53039 27561 9599 16727 28594 -10844 -32298 -44746
7812d4746M9247J7880l5282k6701k5637J6700j719m124P220J1532L3605J6675
$$ -44746 4501 22381 -12901 -39602 -65239 -48539 -50258 -54382 -47162 -35630 -2025 14650
7800A4650P403k7905k4792k3690L8707K3177L3256K0819k3989j4565j451P901
$$ 14650 22053 -5852 -30644 -54334 -15627 7550 40806 61625 37636 23071 21620 29521
7788B9521k9346P357N8k555J2104j0461k855l8526K0638J7890J2642j0337K7873
$$ 29521 175 7532 7590 5035 17139 6678 3823 -34703 -14065 3825 16467 6130 34003
7775C4003J1197k1442k4324J0171L574O028L304k8097l6816R917M6467M5452R838
$$ 34003 45200 23758 -566 9605 13179 19207 22511 -5586 -42402 -32485 13982 59434 69272
7762F9272J551k2138k8036R674j1585j2822K409j5474j353J2529j1989j6644k943
$$ 69272 70823 48685 20649 30323 18738 5916 8325 -7149 -8502 4027 -7962 -24606 -27549
7749b7549k2127n330L6130M4669K8314K307j0062k0473L318o895m2993L503J579
$$ -27549 -49676 -55006 -18876 25793 54107 56414 46352 25879 29197 22302 -20691 -17188 -15609
7736a5609K9923R680K6950j1075j6869j216l1229J6618J0671j7903q371j1508
$$ -15609 14314 23994 50944 39869 23000 21784 -9445 7173 17844 -59 -8430 -19938
7724a9938j1853K8068L2462O52M1q28j425j363J3403J0736k4039j6369k4177j7791
$$ -19938 -31791 -3723 28739 29391 29432 28604 27179 25816 39219 49955 25916 9547 -14630 -32421
7710c2421K4316K3487J4882Q932n470j5229J7322R439m0348k0584m394K0654O260
$$ -32421 -8105 15382 30264 39196 33726 18497 35819 45258 4910 -15674 -20068 586 6846
7697F846M064j2387K818K565l919k5683r208J7612R555q952k7762K6567J0499
$$ 6846 10910 -1477 1341 3906 -13 -25696 -34904 -17292 -7737 -16689 -44451 -17884 -7385
7684g385Q63j1614l420p825J5183M808J0038k264k7577J1417K6741K5087o187
$$ -7385 -6522 -18136 -21556 -29381 -14198 -9390 648 -1616 -29193 -17776 8965 34052 27865
7671B7865k5632k5966K3548L6877j9892j9095K6096Q063j5981k0737k3839J1070
$$ 27865 2233 -23733 -185 36692 16800 -2295 23801 31864 15883 -4854 -28693 -17623
7659a7623j6532k2620l912L7917L6945j4069j7451j1619O937J753J2941J4547
$$ -17623 -34155 -56775 -60687 -22770 14175 106 -17345 -28964 -22027 -20274 -7333 7214
7647G214m659J2938J4008J0478k0652j9095J6468N619j0639p722R209J820J4511
$$ 7214 2555 15493 29501 39979 19327 232 16700 22319 11680 3958 13167 14987 29498
7634B9498k888k4286o291M713Q14j5139O788L702L15k4215J292O582O009Q116
$$ 29498 26610 2324 -3967 746 1560 -13579 -6791 -3089 -2774 -26989 -25697 -19115 -13106 -4990
7620d990J6079R092j0417k1010q601K7292n656O802P513j5678L721J67j6848j6020
$$ -4990 11089 20181 9764 -11246 -19847 7445 1789 8591 16104 426 4147 4314 -12534 -28554
7606b8554Q416J4843K4212R222k0777P627R934J2795j4751O631k4739k5032K787
$$ -28554 -20138 -5295 18917 28139 7362 14989 24923 37718 22967 29598 4859 -20173 -17386
7593a7386M9494j1610l0924j2013L3838O83m607J0000J7029k4450q783K0838K7385
$$ -17386 32108 20498 -10426 -22439 11399 12082 7475 17475 34504 10054 1271 22109 49494
7580D9494Q284Q540p430l7297M446j8088r373O737p829j7485k2292J7734K6163
$$ 49494 57778 66318 58888 21591 26037 7949 -1424 5313 -2516 -20001 -42293 -24559 1604
7567A604k385l489P774l94J3907n31k1826N054J1124j4782j2155J982J2509K4499
$$ 1604 -781 -4270 3504 3110 17017 16486 -5340 -286 10838 -3944 -16099 -14117 -1608 22891
7553B2891j5008j1775L866j8066J3240p918J4982J2630j8115R167j734p218K9015
$$ 22891 7883 -3892 -26 -18092 -4852 -12770 2212 14842 -3273 5894 4160 -3058 25957
7540B5957O887M386J067m803k4161k3497J0224j4255J0316N501k836j0188l689
$$ 25957 32844 37230 38297 33494 9333 -14164 -3940 -18195 -7879 -2378 -5214 -15402 -19091
7527a9091L2164K9863k0043j7156J1343O202K6897k055m1939m1188k462J363L3241
$$ -19091 13073 42936 22893 5737 17080 23282 50179 48124 6185 -35003 -37465 -36102 -2861
7514b861K8477n03J799j3973j0301j8760j0476J7196L0683Q05r479L1042L0854
$$ -2861 25616 25113 26912 12939 2638 -16122 -26598 -9402 21281 22086 12607 43649 74503
7501G4503k2374q492k5975q577P125Q283J3650J9358J3145k5311l9212q236L198
$$ 74503 52129 43637 17662 9085 16210 24493 38143 57501 70646 45335 6123 -2113 1085
7488A085K7816n466l0551k3631K413J5014L8068P940K009J6707k9216k8774J4640
$$ 1085 28901 23435 -7116 -30747 -28334 -13320 24748 32688 34697 51404 22188 -6586 8054
7475H054K1314r748K3278q393k4836L97r119n30q593O44k366K4376L1307l4198
$$ 8054 29368 19620 42898 34505 9669 10066 947 417 -8176 -7532 -9898 14478 45785 11587
7461A1587k1318L564j0391j1321m6706l1090J9517M5635K3439P18O996K991K9083
$$ 11587 -9731 -6167 -16558 -27879 -74585 -105675 -86158 -40523 -17084 -16366 -9370 -6379 22704
7448B2704J3899k4348j5061m34J7800j5980P332k104K325q455m551K2875k131
$$ 22704 36603 12255 -2806 -3240 14560 -1420 5912 3808 6133 -2322 -6873 16002 13871
7435A3871p312P718j2476K671Q936j1782j2875Q257J2475Q704n0921j4832N731
$$ 13871 6559 14277 1801 4472 13408 1626 -11249 -2992 9483 18187 -32734 -47566 -41835
7422d1835J2380J8138J3413k1325O407q011k3774k665L8935J1810j7120l9264
$$ -41835 -29455 -11317 2096 -19229 -12822 -20833 -44607 -47272 -8337 3473 -13647 -52911
7410e2911j3706j0577K0427J5280K09P099m938R824J1296j2425p97N887J9765
$$ -52911 -66617 -77194 -56767 -41487 -41278 -34179 -39117 -29293 -17997 -30422 -31219 -25332 -5567
7397e567J7535J3269r007p495K3386n668k7536q620j6093j5618n990K9277J5296
$$ -5567 11968 25237 16230 8735 32121 26453 -1083 -9703 -25796 -41414 -47404 -18127 -2831
7384b831m2826n778k033k2935K1205L2967R924O837r72k325O318q914m945J0889
$$ -2831 -45657 -51435 -53468 -76403 -55198 -22231 -12307 -5470 -6442 -8767 -2449 -11363 -16308 -5419
7370e419K4232J1959m8995k2063J435L0069J4171k766P282Q729m735O792P168
$$ -5419 18813 30772 -18223 -40286 -38851 -8782 5389 2623 9905 18634 13899 20691 27859
7357B7859M419k437k3469M705J7698J3105p480j447l886n132k042J5972o147j5660
$$ 27859 32278 29841 6372 11077 28775 41880 34400 32953 29067 23935 21893 37865 31718 16058
7343A6058l979k1010j2558j3924J8892J8934M462J5466k0829l7185j4728K9841
$$ 16058 12079 -8931 -21489 -35413 -16521 2413 6875 22341 1512 -35673 -50401 -20560
7331b0560J9213J3554J4085Q598J4645l924j2854R346k1655l4372j3307k4334
$$ -20560 -1347 12207 26292 34890 49535 45611 32757 42103 20448 -13924 -27231 -51565
7319e1565J1053P503N606M3269J2779l4541J6086J7781j5787J3313p099l7310
$$ -51565 -40512 -33009 -27403 15866 28645 -5896 10190 27971 12184 25497 18398 -18912
7307a8912J3199Q59J3438J7042l2021k6286P969K0237j765m867L974q268J6083
$$ -18912 -5713 -4854 8584 25626 -6395 -32681 -24712 -4475 -6240 -11107 -7133 -15401 682
7294F82J527l1035M341J3986J0282K0993r570j956J8274M978j3253j5771j3210
$$ 682 2209 -28826 -24485 -10499 -217 20776 11206 9250 27524 32502 19249 3478 -9732
7281i732m694l3643j5222K5256K2390J3028L2259O704j5291k3348m877j6389l8817
$$ -9732 -14426 -48069 -63291 -38035 -15645 -2617 29642 36346 21055 -2293 -7170 -23559 -62376
7268f2376J088K6416j6844J1203J1432M254J1368n111M41N463J1725j9035N503
$$ -62376 -61288 -34872 -51716 -40513 -29081 -24827 -13459 -18570 -18129 -12666 -941 -19976 -14473
7255a4473R205k4367j8305J7262k3434r708K8294K7954M160R633m801r573k5490
$$ -14473 -5268 -29635 -47940 -30678 -54112 -63820 -35526 -7572 -3412 6221 1420 -8153 -33643
7242c3643k2794J7846K8799k0925J222M885L1100J4625N55J712j5380P351P196
$$ -33643 -56437 -38591 -9792 -30717 -29495 -24610 6490 21115 21670 23382 8002 15353 22549
7229B2549k5847n440J9319L6082P521j9769l4867k7965L1139P169J4915J8684
$$ 22549 -3298 -8738 10581 46663 54184 34415 -452 -28417 2722 9891 24806 43490
7217D3490j0354j4145j7213l318P110O417k1084k232l938n932L268k7295J2549
$$ 43490 33136 18991 1778 -1540 5570 11987 -9097 -11329 -15267 -21199 -17931 -45226 -32677
7204c2677J3693K8466K703m601q27J1657l98j0537j7103q425P847K5635Q957J3900
$$ -32677 -18984 9482 12185 7584 6757 18414 18016 7479 -9624 -18049 -10202 15433 24390 38290
7190C8290l5107l3733J8767k1086l2241L832K3544R64M309J9111J4230J7495O993
$$ 38290 3183 -30550 -11783 -32869 -65110 -61278 -37734 -36770 -32461 -13350 880 18375 25368
7177B5368j9467j1266K1315l546j1115K0759K060k0029k2966n778M01j3045j6492
$$ 25368 5901 -5365 15950 12404 1289 22048 24108 4079 -18887 -24665 -24264 -37309 -53801
7164e3801k34r654K7807L9061J1871K069j4884J1951J149k6013J0030p682J9821
$$ -53801 -54035 -63689 -35882 3179 15050 17119 2235 14186 15335 -10678 -648 -8330 11491
7151A1491J9877j6849L744L231J7642N585o887j417o742k8102j5086l34m523Q975
$$ 11491 31368 14519 18263 21494 39136 44721 37834 36417 29675 1573 -13513 -13847 -18370 -9395
7137i395k3785m524J5768K9286j9217k0289o830K6326J6881J3096K8957k473l507
$$ -9395 -33180 -37704 -21936 7350 -11867 -32156 -38986 -12660 4221 17317 46274 43801 40294
7124D0294k1063j753J0953L279J736L955j5415j0564j6539j1151K7797K9819K0615
$$ 40294 19231 17478 28431 31710 33446 37401 21986 11422 -5117 -16268 11529 41348 61963
7111F1963p937m2165k4606L2379J4777q773J0599J6688j3348j8323j8520j2785
$$ 61963 54026 11861 -12745 19634 34411 25638 36237 52925 39577 21254 2734 -10051
7099a0051L049m1j9517L726N0662k4892l511j3736K4535K9844j595j6095l4284
$$ -10051 -7002 -7043 -26560 -22834 27828 2936 -575 -14311 10224 40068 38473 22378 -11906
7086a1906k567q298L11J1610J5473o33l0188j9466P419J7797J4256r65l8054k3899
$$ -11906 -14473 -22771 -22460 -10850 4623 3990 -26198 -45664 -38245 -20448 -6192 -7157 -45211 -69110
7072f9110K2067M4575J5659m715j2671j55j1063N661J8119K462l7821k81k960
$$ -69110 -47043 -2468 13191 8476 -4195 -4350 -15413 -9752 8367 10829 -26992 -27273 -30233
7059c0233j3506J0474J0028j1657L4836L4666j6313j5245m110Q329o837j9872
$$ -30233 -43739 -33265 -23237 -34894 -58 34608 18295 3050 -1060 7269 432 -19440
7047a9440j3070m5O899L0712J4939k7194j1919L888J4582k056j9421q740J1788
$$ -19440 -32510 -32555 -25656 5056 19995 -7199 -19118 -15230 -648 -2704 -22125 -30865 -19077
7034a9077r877N278R572O021K444K1717j013j805J1918K1453k803k0488j3843
$$ -19077 -28954 -23676 -14104 -8083 -5639 16078 15065 13260 25178 46631 43828 23340 9497
7021I497k3667k5707o504R935P550J9950j831R581N958j3300o503Q082K3779j745
$$ 9497 -14170 -39877 -46381 -36446 -28896 -8946 -10777 -1196 4762 -8538 -15041 -6959 16820 15075
7007A5075N695o429j4722r178Q432o361j3273M542L982j7178k379k632J0359K1109
$$ 15075 20770 14341 -381 -9559 -1127 -7488 -20761 -16219 -12237 -29415 -31794 -34426 -24067 -2958
6993b958j3490K397m309k6721K649K5720K5746J076j792k8190j1704L1762j9598
$$ -2958 -16448 -14051 -18360 -45081 -42432 -16712 9034 10110 8318 -19872 -31576 186 -19412
6980a9412J5509J8353o51Q877m098m7690k2842J8188M8584L3284J2438k7012l6783
$$ -19412 -3903 14450 13799 22676 18578 -29112 -51954 -33766 14818 48102 60540 33528 -3255
6967c255j7737p439L204l1238j69N1796J2921l2679j9026P993M5382J0243m4007
$$ -3255 -20992 -28431 -25227 -56465 -56634 -4838 8083 -24596 -43622 -35629 9753 19996 -24011
6954b4011k1374J3660K5984N696L4541k178k5582l2911q767P196j3994k0376j716
$$ -24011 -45385 -31725 -5741 -45 34496 32318 6736 -26175 -34942 -27746 -41740 -62116 -63832
6941f3832M9901J8259n242Q242L1334K2023j1433j8035l185K3783r876k5484l0276
$$ -63832 -13931 4328 -914 7328 38662 60685 49252 31217 28032 51815 41939 16455 -13821
6928a3821M028J0293Q173r922l7714n398J3439R620J3206j1314j0900n330q14
$$ -13821 -9793 500 8673 -1249 -38963 -44361 -30922 -21302 -8096 -19410 -30310 -35640 -36454
6915c6454J3410J0559J3048k0883o908j6268N289L1441J7334n341j3120q5J01
$$ -36454 -23044 -12485 563 -20320 -27228 -43496 -38207 -6766 10568 5227 -7893 -7978 -7877
6902g877K6405L7063O264m6273q945J3284K0138r158l1516k3719K1699K097p494
$$ -7877 18528 55591 61855 15582 6637 19921 40059 30901 -615 -24334 -2635 -538 -8032
6889h032q39K3601K9799N402j9065m1722j4360M221M949Q019K5099j7405k7545
$$ -8032 -8871 14730 44529 49931 30866 -10856 -25216 -20995 -16046 -8027 17072 -333 -27878
6876b7878o085n62n268L1114O39m706k700J0224p229M645j0242M607r20J2665
$$ -27878 -33963 -34525 -39793 -8679 -8040 -12746 -15446 -5222 -12451 -7806 -18048 -13441 -14361 -1696
6862a696j9753N996l262k8020J2377N615r101j2283O190J6502K9687j2190k7614
$$ -1696 -21449 -15453 -18715 -46735 -34358 -28743 -37844 -50127 -43937 -27435 2252 -9938 -37552
6849c7552L043R054j1264k208j249K768q185j5091o314R489K5127J9348j8413
$$ -37552 -34509 -25455 -36719 -38927 -40176 -37408 -45593 -60684 -66998 -57509 -32382 -13034 -31447
6836c1447j6707q273J6069M5216O756k8953N011J2218p988l295q829K467K2306
$$ -31447 -48154 -56427 -40358 4858 11614 -17339 -12328 -110 -8098 -11393 -20222 -17755 4551
6823D551J9455k434k7455l0011J1381o780m734J657M294N185p112j7341K2371
$$ 4551 24006 21572 -5883 -35894 -24513 -31293 -36027 -34370 -30076 -24891 -32003 -49344 -26973
6810b6973Q406P217J2521j6041M88J1418j8080j2415j0728K051L1278j3767j7162
$$ -26973 -18567 -11350 1171 -14870 -14382 -2964 -21044 -33459 -44187 -42136 -10858 -24625 -41787
6797d1787J9087O106k2671o460j2555K157L147p256r944J4007Q593J8329J1497
$$ -41787 -22700 -16594 -39265 -45725 -58280 -56123 -52976 -60232 -70176 -56169 -47576 -29247 -17750
6784a7750J6638K7632k3219O669Q228K4698J935j4185j1265l8430p869l38M875
$$ -17750 -1112 26520 3301 9970 18198 42896 44831 30646 19381 -19049 -26918 -27256 -22381
6771b2381J4533J9872M09l713j9623m746J0106J0503j6685J8311R127k5324l413
$$ -22381 -7848 12024 12433 8720 -10903 -15649 -5543 4960 -11725 6586 15713 -9611 -13024
6758a3024j3922j0386O776J3337q501k9246J0166K5846K6389J3979R518L4058
$$ -13024 -26946 -37332 -30556 -17219 -25720 -54966 -44800 -18954 7435 21414 30932 64990
6746F4990n913l5484m346L594l4790l1028k2433L5512L4593M384K954o654j0046
$$ 64990 59077 23593 19247 22841 -11949 -42977 -65410 -29898 4695 9079 12033 5379 -4667
6733d667j8371j3529Q911K2910J113j8716p190J9764J4133n038j3463K573j1480
$$ -4667 -23038 -36567 -27656 -4746 -3633 -22349 -29539 -9775 4358 -680 -14143 -11570 -23050
6720b3050J043r100l075J9127K2143k203m91j9666j1523K2365L5438o51J639l0666
$$ -23050 -22007 -31107 -34182 -15055 7088 4885 4394 -15272 -26795 -4430 31008 30357 31996 1330
6706A330k4753j1542R028L2290J3307Q073j5894Q947k1298j9854o519j240L365
$$ 1330 -23423 -34965 -25937 6353 19660 27733 11839 20786 -512 -20366 -26885 -28125 -24760
6693b4760j6283p579O954k7007N911J7458k4047R896J2633Q684K0844l727J3503
$$ -24760 -41043 -48622 -41668 -68675 -62764 -45306 -69353 -59457 -46824 -38140 -17296 -21023 -7520
6680g520j5806p659n703Q672J239m694J4898K2956n997k7818q349j820k0662K1406
$$ -7520 -23326 -30985 -36688 -28016 -26777 -31471 -16573 6383 386 -27432 -35781 -37601 -58263 -36857
6666c6857J9708K454J1337M776J7182o646q839o935k0140M403j124J3379O914
$$ -36857 -17149 -14695 -3358 1418 18600 11954 3115 -3820 -23960 -19557 -20681 -7302 -388
6653c88K5306q032j0966j8605j1923j2829J5039J6338j1612j2572q516K2915J6648
$$ -388 24918 16886 5920 -12685 -24608 -37437 -22398 -6060 -17672 -30244 -38760 -15845 803
6640H03j3588q46j4719k0466K6536J0925j8043P890k980m6519j7408M4771L9444
$$ 803 -12785 -13631 -28350 -48816 -22280 -11355 -29398 -21508 -24488 -71007 -88415 -43644 -4200
6627d200J6064m019K0005o472j1469P388j2607P719N853l895k5622k4532q383
$$ -4200 11864 7845 27850 21378 9909 17297 4690 12409 18262 14367 -11255 -35787 -44170
6614d4170N475j5088J4424l0271Q29L5389L3822M2548k320j9762K062j6163n56
$$ -44170 -38695 -53783 -39359 -69630 -68801 -33412 410 42958 40638 20876 22938 6775 6219
6601F219J2611N597P660j2214k7824k1357J2947J6300n818n660J2830r029K4p056
$$ 6219 18830 24427 32087 19873 -7951 -29308 -16361 -61 -5879 -11539 1291 -7738 -7714 -14770
6587a4770J2376J8727J9216j2260r115j0001O499j7433L5806J3616O65l3425l1723
$$ -14770 -2394 16333 35549 23289 14174 4173 10672 -6761 29045 42661 43326 9901 -21822
6574b1822K506J123K915j2378j5629j0745P196N448Q867K159p811j8092j491K0563
$$ -21822 -19316 -18193 -15278 -27656 -43285 -54030 -46834 -41386 -32519 -30360 -38171 -56263 -57754 -37191
6560c7191M393j5382N564j2573K4113L8089l2232j0646J5297M267J0219K7199
$$ -37191 -32798 -48180 -42616 -55189 -31076 7013 -25219 -35865 -20568 -16301 -6082 21117
6548B1117r07j0096r713o246l904J1678j6507j7522k637J5810L1164J7293j0518
$$ 21117 20210 10114 401 -5845 -9749 1929 -14578 -32100 -34737 -18927 12237 29530 19012
6535A9012q971m651l060J7549N626J4677p246r596J2861J5095J8176m1917m0777
$$ 19012 10041 5390 2330 19879 25505 40182 32936 23340 36201 51296 69472 27555 -13222
6522a3222l0905K2578k54J0589L300j5884K2684J8974k4634j021J3870P262j4164
$$ -13222 -44127 -21549 -21803 -11214 -7914 -23798 -1114 17860 -6774 -7795 6075 13337 -827
6509h27N538k2105J5026K2761j8266o708K886M419q766j7500O895K1465l061p385
$$ -827 4711 -17394 -2368 20393 2127 -4581 -1695 2724 -6042 -23542 -16647 4818 1757 -5628
6495e628Q924J3029j584k1703J4655n142l7975l021Q386k885K998j318Q408L4499
$$ -5628 3296 16325 14741 -6962 7693 2551 -35424 -38445 -30059 -32944 -29946 -31264 -22856 11643
6481A1643K0601J6632J6452j1057m4118j5126m698r018k749k138q484O444q064
$$ 11643 32244 48876 65328 54271 10153 -4973 -9671 -18689 -21438 -23576 -32060 -25616 -33680
6468c3680r262Q611J2887L4712R240j8403j5606O644j0011p026j6921M2721J6713
$$ -33680 -42942 -34331 -21444 13268 22508 4105 -11501 -4857 -14868 -21894 -38815 3906 20619
6455B0619J9669J0659j6141O055j3065j3022j4203j790K010k375M048l455m4843
$$ 20619 40288 50947 34806 40861 27796 14774 571 -1219 791 -1584 2464 -991 -45834
6442d5834J5840K6431O464J2858j32j5002j181j1995j5126L1359L8573J1859l3721
$$ -45834 -29994 -3563 2901 15759 15627 625 -556 -12551 -27677 3682 42255 54114 20393
6429B0393j4370J8999r203q455q737L224j5080J0658J9493k2598n642P504k64
$$ 20393 6023 25022 15819 7364 -1373 1851 -13229 -2571 16922 -5676 -11318 -3814 -4078
6416d078k0327q124j7622J3050P909l937N109J413m839J888p432k716P391K035
$$ -4078 -24405 -32529 -50151 -37101 -29192 -33129 -28020 -26607 -31446 -29558 -36990 -39706 -32315 -30280
6402c0280k388m558L5m744R078L6355r01m829l122j0377M912o417p546q546J139
$$ -30280 -32668 -37226 -37191 -41935 -32857 3498 2597 -2232 -5354 -15731 -10819 -17236 -24782 -33328 -32189
6387c2189q522j697P777o99L1805P36k5022q071R367J3186K0444k583L535K0977
$$ -32189 -40711 -42408 -34631 -35330 -3525 -2789 -27811 -35882 -26515 -13329 7115 4532 8067 29044
6373B9044l989l531q294j535k9243l3538q418K0122P327k9129J5171o461J9016
$$ 29044 25055 21524 13230 11695 -17548 -51086 -59504 -39382 -32055 -61184 -46013 -52474 -33458
6360c3458L8780J082O710J192j7703q927L1697K5483k7895O496j2456l3610r858
$$ -33458 5322 6404 13114 14306 -3397 -12324 19373 44856 16961 23457 11001 -22609 -32467
6347c2467N193M840J5888k1449j2158k394k4136r873n373J4686J7761Q250J069
$$ -32467 -27274 -22434 -6546 -27995 -40153 -42547 -66683 -76556 -81929 -67243 -49482 -41232 -40163
6334d0163K6477K3526j0185l2178J1715K4874Q577m0830Q241K8099J319r295R706
$$ -40163 -13686 9840 -345 -32523 -20808 4066 12643 -28187 -19946 8153 9472 177 9883
6321I883q68p354n96K795J6409r24j1039k0396L891R052l1161j6760m836J7847
$$ 9883 9015 1661 1065 3860 20269 19345 8306 -12090 -8199 853 -30308 -47068 -51904 -34057
6307c4057L0412j5739m2027K648K8395K3084N170n257J4408N516j0368o552j9031
$$ -34057 -3645 -19384 -61411 -58763 -30368 -7284 -2114 -7371 7037 12553 2185 -4367 -23398
6294b3398O909n244J5650K3815l896r66j022K900Q661k1488j9175J1543o614J4393
$$ -23398 -16489 -21733 -6083 17732 13836 12870 11848 14748 23409 1921 -17254 -5711 -12325 2068
6280B068K9178J7336q75k2874l7839m131J5920J6535l62k1421j9069m721l552
$$ 2068 31246 48582 47707 24833 -13006 -17137 -1217 15318 14956 -6465 -25534 -30255 -33807
6267c3807l972R136o382L986K3780j2082j2912K8331j0554j4309j3617K0782L5766
$$ -33807 -37779 -28643 -35025 -31039 -7259 -19341 -32253 -3922 -14476 -28785 -42402 -21620 14146
6254A4146m076j0385J7557l3849k6045J1522j063J2858n570k8276J411L6063K5116
$$ 14146 10070 -315 17242 -16607 -42652 -31130 -32193 -19335 -24905 -53181 -51770 -15707 9409
6241I409J1402j4132r31Q871r184j3196k9501M713K4532M091k5498k32j7880J2111
$$ 9409 20811 6679 5748 14619 5435 -7761 -37262 -32549 -8017 -3926 -29424 -29656 -47536 -35425
6227c5425M0231K059j5141l9252O800J7025n840o908j080j2810J1063L2534M0353
$$ -35425 4806 6865 -8276 -47528 -40728 -23703 -29543 -36451 -37531 -50341 -39278 -6744 33609
6214C3609n681l1951r145j3298J7198Q93j2096k4684p645K6676R821p279j478
$$ 33609 27928 -4023 -13168 -26466 -9268 -8375 -20471 -45155 -52800 -26124 -16303 -23582 -25060
6201b5060J5547N090J1993j4927j0759K7241J1337m5025j675K1910o795J3097
$$ -25060 -9513 -4423 7570 -7357 -18116 9125 20462 -24563 -26238 -4328 -11123 1974
6189A974R366j5503k028j1953o387K2235k846k6398k6365J3195J291j6716Q839
$$ 1974 11340 -4163 -6191 -18144 -24531 -2296 -5142 -31540 -57905 -44710 -43419 -60135 -51296
6176e1296N1418K521N384J4536Q795j3736j3650k401r635J0832M6958k634n4425
$$ -51296 122 2643 8027 22563 31358 17622 3972 1571 -8064 2768 49726 47092 -7333
6163g333j9285O651J2822k1006j087J1856K7825j0284K6437m6908k8010K1771
$$ -7333 -26618 -19967 -7145 -28151 -29238 -17382 10443 159 26596 -20312 -48322 -26551
6151b6551Q453J0809m28j740k1091n078J428m345M578K397R770j0438J9623L0457
$$ -26551 -18098 -7289 -7717 -9457 -30548 -35626 -34198 -38543 -33965 -31568 -21798 -32236 -12613 17844
6137A7844k862k0158K0989k122K27j4948K3876p6j0971J5595J9646j2582k3184
$$ 17844 14982 -5176 15813 13691 13918 -1030 22846 22770 11799 27394 47040 34458 11274
6124A1274j3743P639r75q151n93O883J8192J9433j6055J7411J2113p468k8421
$$ 11274 -2469 5170 4195 -3956 -4549 2334 20526 39959 23904 41315 53428 45960 17539
6111A7539j7327P573q396k338M552J0793J6922K624j29p642k3334k4064J0843
$$ 17539 212 7785 -611 -2949 1603 12396 29318 31942 31813 24171 837 -23227 -12384
6098a2384K1878j1645O797L2173J4337j2602k2198k764j9943p125r989M677M762
$$ -12384 9494 -2151 4646 36819 51156 38554 16356 13592 -6351 -13476 -23465 -18788 -14026
6085a4026j97J9326r907n421K1409J8132j8141k1558R754o671J6124j5632P813
$$ -14026 -14223 5103 -4804 -10225 11184 29316 11175 -10383 -629 -7300 8824 -6808 1005
6072A005J5693j4104l097J7317J5150R315J6033J2919m2481l2252L758K318O286
$$ 1005 16698 2594 -503 16814 31964 41279 57312 70231 27750 -4502 -744 1574 7860
6059G860k8194m31J388L924L4052J7313k2334m6965l1224K8331K4242P041J626
$$ 7860 -20334 -20765 -19377 -15453 18599 35912 13578 -33387 -64611 -36280 -12038 -4997 -3371
6046c371j1465O626j752l0683l773K2248K7517J3594k1795m103K3894O624M971
$$ -3371 -14836 -8210 -9962 -40645 -44418 -22170 5347 18941 -2854 -6957 16937 23561 28532
6033B8532J2228j2948o332j359n833j4068M495P614P45N784K4304j5256q123j0398
$$ 28532 40760 27812 21480 20121 14288 220 4715 12329 13074 18858 43162 27906 19783 9385
6019I385j6869J3658o952l3122N417M151N857J6891O476j9561j5268q368k574
$$ 9385 -7484 6174 -778 -33900 -28483 -24332 -18475 -1584 4892 -14669 -29937 -38305 -40879
6006d0879K3195r719K200J3061k587R490Q867L2p214j9543j4072j1643R121J3847
$$ -40879 -17684 -27403 -25203 -12142 -14729 -5239 3628 3660 -3554 -23097 -37169 -48812 -39691 -25844
5992b5844j0559L1251r55r627K3660l0537k4280k4548J681R45J6452K9345M4287
$$ -25844 -36403 -5152 -6107 -15734 7926 -22611 -46891 -71439 -69758 -68813 -52361 -23016 21271
5979B1271j2864j5766J9575j7724k9714J5133J5564j938k6170R295j936o962m227
$$ 21271 8407 -7359 12216 -5508 -35222 -20089 -4525 -6463 -32633 -23338 -25274 -32236 -36463
5966c6463R938p97J7663j5839J5450J7187o271K4179J1352M166k9275k2219K2783
$$ -36463 -26525 -27322 -9659 -25498 -10048 7139 868 25047 36399 40565 11290 -10929 11854
5953A1854p878k0428k9248k3002J8200K0734K6144j2918M050j3066j8695K5254
$$ 11854 3976 -16452 -45700 -68702 -50502 -29768 -3624 -16542 -12492 -25558 -44253 -18999
5941a8999K5294j4571O890M909o360q509M065J5712k063j4007l677j9583k043
$$ -18999 6295 -8276 -1386 3523 -2837 -11346 -7281 8431 6368 -7639 -11316 -30899 -32942
5928c2942l935K2612P539l3612K1047R42p410M750K140L3172L080j8286j9101
$$ -32942 -36877 -14265 -6726 -40338 -19291 -18349 -25759 -21009 -18869 14303 17383 -903 -20004
5915b0004l3565J3964j4670J3002N327K6951K9226q79N909k7553j0036Q425j9213
$$ -20004 -53569 -39605 -54275 -41273 -35946 -8995 20231 19352 25261 -2292 -12328 -3903 -23116
5902b3116n299J8081J6306l0515j4921j5079r941Q610J1154K8062L317k7189J622
$$ -23116 -28415 -10334 5972 -24543 -39464 -54543 -64484 -55874 -44720 -16658 -13341 -40530 -38908
5889c8908K2482J7191J9698q516j0425q947j442j0213k544J6899r494j5000K6062
$$ -38908 -16426 765 20463 11947 1522 -7425 -8867 -19080 -21624 -4725 -14219 -29219 -3157
5876c157n946P558M25j2174k295j2639j3615O539J3267N072O668m951N714L3023
$$ -3157 -9103 -1545 -1120 -13294 -15589 -28228 -41843 -35304 -22037 -16965 -10297 -15248 -9534 23489
5862B3489o594j6146j1251j8785r410k0802K5948J8688J6815j0537R451k598K658
$$ 23489 16895 749 -10502 -29287 -38697 -59499 -33551 -14863 1952 -8585 866 -1732 926
5849I26R68k0611j3951J5965l475q461M943K354j2681N56J6030j5072P52R961
$$ 926 1894 -18717 -32668 -16703 -20178 -28639 -23696 -21342 -34023 -33467 -17437 -32509 -31757 -21796
5835b1796K953J399J4079J1278j2364J3713Q870Q869M552j0598o551j708L652
$$ -21796 -18843 -17444 -3365 7913 -4451 9262 18132 27001 31553 20955 14404 12696 16348
5822A6348l0771m625j0333K3458J3421O178K4509O213q864k4979l8325K7039P524
$$ 16348 -14423 -19048 -29381 -5923 7498 13676 38185 44398 35534 10555 -27770 -731 6793
5809F793r017j5142j5338J9162j2463J3789j0931O147j7308P218L6238l21K3690
$$ 6793 -2224 -17366 -32704 -13542 -26005 -12216 -23147 -17000 -34308 -27090 9148 8827 32517
5796C2517o127q169J0650q204j7359p798J9127m660k3934j2254J7809J8254K4983
$$ 32517 26390 18221 28871 20667 3308 -4490 14637 9977 -13957 -26211 -8402 9852 34835
5783C4835l9072j6232j0483q871l900Q532p942Q084K0029J5938J7400o576j5339
$$ 34835 -4237 -20469 -30952 -39823 -43723 -35191 -43133 -35049 -15020 918 18318 11742 -3597
5770c597l1864k96j223O185J8854l023k949o064k0490j6911q052L8913J9403k3818
$$ -3597 -35461 -35757 -36980 -30795 -11941 -14964 -17913 -23977 -44467 -61378 -69430 -30517 -11114 -34932
5756c4932j3624J4790p463j3699J757L6640J3539l04j5615m25J982K8929Q13j6571
$$ -34932 -48556 -33766 -41229 -54928 -53171 -16531 -2992 -3296 -18911 -19336 -17354 11575 12388 -4183
5742d183N533k1539m2830L069K1629J2915M2942r129k9868j275J4429J2576K1584
$$ -4183 1350 -20189 -63019 -59950 -38321 -25406 17536 8407 -21461 -22736 -8307 4269 25853
5729B5853J3325Q629k3455o424k3685m626J6088P484j9117p817J911j198J453
$$ 25853 39178 47807 24352 17928 -5757 -10383 5705 13189 -5928 -13745 -11834 -13032 -11579
5716a1579K5042M2804L4706l0502k0460j4350L90j0524k7341o373J6127j9727
$$ -11579 13463 56267 90973 60471 40011 25661 26051 15527 -11814 -18187 -2060 -21787
5704b1787Q207O572j4411p623K0700K7527P794M21j4917j0414L977j8829j8599
$$ -21787 -13580 -7008 -21419 -29042 -8342 19185 26979 27400 12483 2069 6046 -12783 -31382
5691c1382P648K7076o684j7794J0045O00L36K696k8911L899j0074P869R095r653
$$ -31382 -23734 3342 -3342 -21136 -11091 -10491 -10155 -7459 -36370 -32471 -42545 -34676 -25581 -35234
5677c5234R432K1664P205o718n195j4058K8004R498k6281J0741k2129o097P759
$$ -35234 -25802 -4138 3067 -3651 -8846 -22904 5100 14598 -11683 -942 -23071 -29168 -21409
5664b1409Q416K0166j250k2549k468o25J522j4983J2267N450J90j3430j618J1687
$$ -21409 -12993 7173 5923 -16626 -19094 -19719 -18197 -33180 -20913 -15463 -15273 -28703 -30321 -18634
5650a8634l354j2146J3219p72l0650J6328K0702L1340J8105m293j4687j6342m9182
$$ -18634 -21988 -34134 -20915 -21687 -52337 -36009 -15307 16033 34138 29845 15158 -1184 -50366
5637e0366q422L1642K022p264K0513J5784k994m307j2347j510r051L074L4893
$$ -50366 -58788 -27146 -25124 -32388 -11875 3909 915 -3392 -15739 -17249 -26300 -23226 11667
5624A1667J2047m74j9779M553n411m4977K633O2171R553j5889j5817J2726J0175
$$ 11667 23714 23240 3461 8014 2603 -42374 -39741 22430 31983 16094 277 13003 23178
5611B3178k592j0309J005J7328n355L671l3582j7822j899J8270J6861k5731M202
$$ 23178 20586 10277 11282 28610 23255 26926 -6656 -24478 -26377 -8107 8754 -16977 -12775
5598a2775O536k8611k4240j9793R952J3059j0557K2480L3601J0407k317j096N547
$$ -12775 -6239 -34850 -59090 -78883 -68931 -55872 -66429 -43949 -10348 59 -2258 -3354 2193
5585B193n597L7001K7911J2297k3764l3089n166l2105o819O374L7297o648j9465
$$ 2193 -3404 33597 61508 73805 50041 16952 11786 -20319 -27138 -20764 16533 9885 -9580
5572i580j060O775l22j447l699R527j6511J2381J8635L127k1777k7240j5022K8771
$$ -9580 -10640 -3865 -4187 -5634 -9333 194 -16317 -3936 14699 17826 -3951 -31191 -46213 -17442
5558a7442K4473q261j0944R051K801j6737q590j1267n396L6686M2445n298k4764
$$ -17442 7031 -1230 -12174 -3123 -322 -17059 -25649 -36916 -42312 -5626 36819 31521 6757
5545F757m862J4955J4521k635o311K107L094q261j1400J6324j2462l6905m039
$$ 6757 1895 16850 31371 28736 22425 24532 27626 19365 7965 24289 11827 -25078 -29117
5532b9117N750L2131K0692R293Q429k1349j8011p765L380N727j7875j4386k5042
$$ -29117 -23367 8764 29456 38749 47178 25829 7818 53 3433 9160 -8715 -23101 -48143
5519d8143l240L6208J1257j6329m411l709K6989J0245L092j2041P404K5489N083
$$ -48143 -51383 -15175 -3918 -20247 -24658 -28367 -1378 8867 11959 -82 7322 32811 37894
5506C7894k4283j5785O236J1104Q454n042r154k1103l9646j5365K673N642r554
$$ 37894 13611 -2174 4062 15166 23620 18578 9424 -11679 -51325 -66690 -64017 -58375 -67929
5493f7929K2042M7219J9826l886r876j8387J1255R968J9102R834k4628o660k3009
$$ -67929 -45887 1332 21158 17272 7396 -10991 264 10232 29334 39168 14540 7880 -15129
5480a5129J0294J4803P978l5570j8096Q566j667j438J1849r29j1113J3401R117
$$ -15129 -4835 9968 17946 -17624 -35720 -27154 -28821 -30259 -18410 -19339 -30452 -17051 -7934
5467g934J6846Q550k7196j6834k0054J873r53l28l782K5249j6445k0637L4865
$$ -7934 8912 17462 -9734 -26568 -46622 -44749 -45702 -46030 -49812 -24563 -41008 -61645 -26780
5454b6780P640L082J3294l0459m231J1362k7529R305L3263P677q61o004j5779
$$ -26780 -19140 -16058 -2764 -33223 -37454 -26092 -53621 -44316 -11053 -3376 -4237 -10241 -26020
5441b6020l308l132n22j1859J8271j4862J692K4596J3588j9788k3348K6540K4762
$$ -26020 -29328 -32460 -32982 -44841 -26570 -41432 -39740 -15144 -1556 -21344 -44692 -18152 6610
5428F610j3133J1665J5413m96L143J4330k520k5451p220R102J2822O206n2398
$$ 6610 -6523 5142 20555 20059 23202 37532 35012 9561 2341 11443 24265 30471 -21927
5415b1927k626K8076K8413r760j3009j766j7773k0377K0063J5993q636j3876k4334
$$ -21927 -24553 3523 31936 22176 9167 7401 -10372 -30749 -10686 5307 -3329 -17205 -41539
5402d1539J2711j1817J7099K4022K2558r303l1553M462J9106J0356m027m744j2800
$$ -41539 -28828 -40645 -23546 476 23034 13731 -17822 -13360 5746 16102 12075 7331 -5469
5389e469j4178n438j780r406N501j4372J1330L0106q972j7276j6261j5453J6491
$$ -5469 -19647 -25085 -26865 -36271 -30770 -45142 -33812 -3706 -12678 -29954 -46215 -61668 -45177
5376d5177J6928J9558J4576m602j112R698j7442R147J4485M714p896o511n335
$$ -45177 -28249 -8691 5885 1283 171 9869 -7573 1574 16059 20773 12877 6366 1031
5363A031k4088L584K6492m289m1982k6276k2078L1222M3751J3887K5762M360j1725
$$ 1031 -23057 -19473 7019 2730 -39252 -65528 -87606 -56384 -12633 1254 27016 31376 19651
5350A9651k783j4421j3075k0412K7069L3641o002j7930j7790j2335R201J0560
$$ 19651 16868 2447 -10628 -31040 -3971 29670 23668 5738 -12052 -24387 -15186 -4626
5338d626j589j2723K1631L7054q964m984k0286l7298k22n707o205J9459O297r747
$$ -4626 -6215 -18938 2693 39747 30783 25799 5513 -31785 -32007 -37714 -43919 -24460 -18163 -27910
5324b7910J2279j9115M176q802K0676K2272J1993M683R950j529J4688l16k9215
$$ -27910 -15631 -34746 -30570 -39372 -18696 3576 15569 20252 30202 28673 43361 43045 13830
5311A3830n8072R643K7302J5101k8030p407J3364q241k319K1666n433n22k245
$$ 13830 -44242 -34599 -7297 7804 -20226 -27633 -14269 -22510 -24829 -3163 -8596 -9118 -11363
5298a1363M626j080k3271k5717J0971J2542L1113J8878J1696l7782r664M428J4560
$$ -11363 -6737 -7817 -31088 -56805 -45834 -33292 -2179 16699 28395 -9387 -19051 -14623 -63
5285f3P417J6904M523j6859j1792k7932j1239o390k2513l18L2054K3344J0315
$$ -63 7354 24258 28781 11922 130 -27802 -39041 -45431 -67944 -68262 -36208 -12864 -2549
5272b549L5720l38k7923K941j3118k8693p446k931J0093K2596K1159J4153n541
$$ -2549 33171 32833 4910 7851 -5267 -33960 -41406 -44337 -34244 -11648 9511 23664 18123
5259A8123q412j8460j884N826J36p806j3905n503J1771j5328M0013n343j4194
$$ 18123 9711 -8749 -10633 -4807 -4671 -12477 -26382 -31885 -20114 -35442 4571 -772 -14966
5246a4966K9813M069L447K059j0248J2125k41l0818Q608j3539R636J7272l911
$$ -14966 14847 18916 22363 24422 14174 26299 26058 -4760 3848 -9691 -55 17217 13306
5233A3306q82K0332J307j9528n921o617j1420J7207k1591j0104j3705J1956R282
$$ 13306 12424 32756 34063 14535 8614 1997 -9423 7784 -13807 -23911 -37616 -25660 -16378
5220a6378j148k4386N560O228j2947J4497L791N065K7134q850j2764j693K3779
$$ -16378 -17526 -41912 -36352 -30124 -43071 -28574 -24783 -19718 7416 -1434 -14198 -15891 7888
5207G888j1738K2567n719J961J94l392j4094o47J1970q934L604N705n289N567
$$ 7888 -3850 18717 12998 14959 15153 11761 -2333 -2980 8990 56 3660 9365 4076 9643
5193I643K6165k4883N722j6287l8379k7450L780J8860J3025R129j949q429J0415
$$ 9643 35808 10925 16647 360 -38019 -65469 -61689 -42829 -29804 -20675 -22624 -31053 -20638
5180b0638K9648J3210J082k6276j0356k309j237L0411j5924M315P315J301J583
$$ -20638 9010 22220 23302 -2974 -13330 -15639 -16876 13535 -2389 1926 9241 10542 12125
5167A2125K3113j2450L897m323O879j7507l772k9816K0825J7551J463k2601n2376
$$ 12125 35238 22788 26685 22362 29241 11734 7962 -21854 -1029 16522 17985 -4616 -56992
5154e6992J4140K6825N172k8039r32J995o875K8068K1985K6394q293l7718P876
$$ -56992 -42852 -16027 -10855 -38894 -39826 -37831 -44706 -16638 5347 31741 23448 -14270 -6394
5141f394o115P129J0632k387J8596N1593k1195j4990m767K577j4024m6312l2831
$$ -6394 -12509 -5380 5252 2865 21461 73054 51859 36869 32102 34679 20655 -25657 -58488
5128e8488Q36M5987K9285j8999p842K0529l881j106J0382J3277j551l210K7470
$$ -58488 -57652 -11665 17620 -1379 -9221 11308 7427 6321 16703 29980 28429 25219 52689
5115E2689j8274m5101k3617m557J1675o596k067J4450J7807k6410m29K5133q698
$$ 52689 34415 -10686 -34303 -38860 -27185 -33781 -35848 -21398 -3591 -30001 -30430 -5297 -13995
5102a3995r797K406J3915K5747j4837k1066L4013L0457l501k5944k3257J7664
$$ -13995 -23792 -21386 -7471 18276 3439 -17627 16386 46843 43342 17398 -5859 11805
5090A1805J7491J012j4117j4483P654L377K505j0201r219q007j7485K5221J2438
$$ 11805 29296 30308 16191 1708 9362 12739 15244 5043 -4176 -12183 -29668 -4447 7991
5077G991M959o360k633J1763j2741P291n384Q609M245k2587n232J2223K3897l547
$$ 7991 12950 6590 3957 15720 2979 10270 4886 13495 17740 -4847 -10079 2144 26041 22494
5063B2494j76n771l4643j1045K2002J9967j1935j5519P651Q318J714j8600k2114
$$ 22494 22318 16547 -18096 -29141 -7139 12828 893 -14626 -6975 1343 3057 -15543 -37657
5050c7657J9229J9180n167l624j778J8800J0228N708Q231q789K2386L0041m518
$$ -37657 -18428 752 -4415 -8039 -9817 8983 19211 24919 33150 24361 46747 76788 72270
5037G2270j4614k4008Q18J0341k16r697J6420j5637k5001J9271K612j7327j7913
$$ 72270 57656 33648 34466 44807 44591 34894 51314 35677 10676 29947 32559 15232 -2681
5024b681j4998j1942k231K7969K0303J2476j6063n659j0803M164J5839j4778m014
$$ -2681 -17679 -29621 -31852 -3883 16420 28896 12833 7174 -3629 535 16374 1596 -2418
5011b418q094j909K5613j3700k0877R80N890K376J074J723k785J1947k6516l7281
$$ -2418 -10512 -12421 13192 -508 -21385 -20405 -14515 -12139 -11065 -9342 -12127 -180 -26696 -63977
4997f3977J6598K9629J1320N580o502O840q449J509J6005N661o922r204k3331
$$ -63977 -47379 -17750 -6430 -850 -7352 -512 -8961 -7452 8553 14214 7292 -1912 -25243
4984b5243J5729Q036n150J4017J8085J878k969K6844M689j3652k9363k0786j9131
$$ -25243 -9514 -1478 -6628 7389 25474 27352 24383 51227 55916 42264 12901 -7885 -27016
4971b7016j510K2266N941K664k2362j3331j045J4354j5414k064l321J2047J6742
$$ -27016 -28526 -6260 -319 2345 -20017 -33348 -34393 -20039 -35453 -37517 -40838 -28791 -12049
4958a2049k2327j7859J4227L5841k7389r073P400J8471j1295J9719K3951k7686
$$ -12049 -34376 -52235 -38008 -2167 -29556 -38629 -31229 -12758 -24053 -4334 19617 -8069
4946h069k3046p055K7495K2066P542q914j3796J7144r976P066R004M137k9299
$$ -8069 -31115 -38170 -10675 11391 18933 10019 -3777 13367 3391 10457 19461 23598 -5701
4933e701k2938J5971r294l986L947J3275J2310J3454j3091q839k0227J8362P198
$$ -5701 -28639 -12668 -21962 -25948 -22001 -8726 3584 17038 3947 -4892 -25119 -6757 441
4920D41j8117J029J5950M179j1749l5581j7523N1845L5606m90j3034k5475m619
$$ 441 -17676 -16647 -697 3482 -8267 -43848 -61371 -9526 26080 25590 12556 -12919 -17538
4907a7538J2904k4679n499K3295L561j0407P43K7624R553l5713k6731J1313M6219
$$ -17538 -4634 -29313 -34812 -11517 -7956 -18363 -17620 10004 19557 -16156 -42887 -31574 14645
4894A4645J0921m099l622m762l1008n281J5695n311j2450m131j771K7177M95M312
$$ 14645 25566 21467 17845 13083 -17925 -23206 -7511 -12822 -25272 -29403 -31174 -3997 -3502 810
4880H10M053J0082j7166J5652J6524J088k525j2036l7309J8016P362K723j8731
$$ 810 4863 14945 -2221 13431 29955 31043 28518 16482 -20827 -2811 4551 7274 -11457
4867a1457j1288K0902N72o24q856J833J0435L238k7m17p457N776j2637j9658N424
$$ -11457 -22745 -1843 -1271 -1895 -10751 -8918 1517 4755 4728 4311 -3146 2630 -10007 -29665 -24241
4852b4241O871j155M188j555J2941O633M497k8550N347J4721N143n121M729j922
$$ -24241 -17370 -18525 -14337 -15892 -2951 3682 8179 -20371 -15024 -303 4840 -281 4448 2526
4838B526R218J1637j0213Q171N821k1370r367J1589O148l157r907k0745o413J8667
$$ 2526 11744 23381 13168 21339 27160 5790 -3577 8012 14160 11003 1096 -19649 -26062 -7395
4824g395J4884J071q865j0180p083j761L2J403Q369q665j066j5650J2552J5582
$$ -7395 7489 8560 -305 -10485 -17568 -19329 -19297 -17894 -9525 -18190 -19256 -34906 -22354 -6772
4810f772l880J6090P867k8134R581K0553k0056k1784K7468K6072j5721k4603k5417
$$ -6772 -10652 5438 13305 -14829 -5248 15305 -4751 -26535 933 27005 11284 -13319 -38736
4797c8736j1989L4769M275J208L067J1064J6346J1382K5457j984j8776j0912j0552
$$ -38736 -50725 -15956 -11681 -10473 -7406 3658 20004 31386 56843 54859 36083 25171 14619
4784A4619p854K2636R24k1246j9033J3836K1346k361Q487j638k5222j1880K6110
$$ 14619 6765 29401 30325 9079 -9954 3882 25228 22867 31354 29716 4494 -7386 18724
4771A8724K2837j4677r274o515J2462l4771n267n367r018L681J3273K4357j7075
$$ 18724 41561 26884 17610 11095 23557 -11214 -16481 -21848 -30866 -27185 -13912 10445 -6630
4758f630q4J8087j0345L690P297J5659j8279M065N90j961K410k3324j0559P249
$$ -6630 -6714 11373 1028 4718 12015 27674 9395 13460 14050 12089 14499 -8825 -19384 -12135
4744a2135J2023J914m198k086k2835n207J8506J0153J7883J2499j2769q501l0059
$$ -12135 -112 1802 -2396 -4482 -27317 -32524 -14018 -3865 14018 26517 13748 5247 -24812
4731b4812l5117K066J9984R306N096K3610J8283l620J2456k718j0653n47L062
$$ -24812 -59929 -57863 -37879 -28573 -23477 133 18416 14796 27252 24534 13881 13334 16396
4718A6396K164k1328j7340j0589m672K3473r598Q268j8517J2825j203k0093j2655
$$ 16396 18560 -2768 -20108 -30697 -35369 -11896 -21494 -13226 -31743 -18918 -20121 -40214 -52869
4705e2869k1071j874n08M2037L9131R610q73r838j3882N485l1092j7219M630N1645
$$ -52869 -73940 -75814 -76322 -34285 4846 14456 13583 3745 -10137 -4652 -35744 -52963 -48333 3312
4691C312J7657K278Q081m109k3631k4655J1107K6196L4821J5139l7669r498o762
$$ 3312 20969 23247 31328 27219 3588 -21067 -9960 16236 51057 66196 28527 19029 12267
4678A2267M242k7586j3307O540j972J6251l919j2216j077J1733K601j1646o202
$$ 12267 16509 -11077 -24384 -17844 -19816 -3565 -7484 -19700 -20777 -9044 -6443 -18089 -24291
4665b4291J2458J2100J0127Q125p629k0343J4773L10o958J293j664l999M399J6565
$$ -24291 -11833 267 10394 18519 10890 -9453 5320 5630 -1328 -35 -1699 -5698 -1299 15266
4651A5266k4523r550k763K8988J878k357m871j5954j8360J8901R791P807J0710
$$ 15266 -9257 -18807 -21570 7418 9296 6939 2068 -13886 -32246 -13345 -3554 4253 14963
4638A4963j0248K9603m427n036k7855k4578M943n852Q009j0133R059L721l710
$$ 14963 4715 34318 29891 24855 -3000 -27578 -22635 -28487 -20478 -30611 -21552 -17831 -21541
4625b1541K2892J2506J089n947k8162J6101L1730K0066r322p471n767j0669j1757
$$ -21541 1351 13857 14946 8999 -19163 -3062 28668 48734 39412 31941 26174 15505 3748
4612C748k4062k7889K1025J8847L4103j223j2104l3350l3984J2302J8681J0536
$$ 3748 -20314 -48203 -27178 -8331 25772 24549 12445 -20905 -54889 -42587 -23906 -13370
4600a3370J8363k595P042Q343k9014j4289K7644J9582j0986k0613k4702j2033
$$ -13370 4993 2398 9440 17783 -11231 -25520 2124 21706 10720 -9893 -34595 -46628
4588d6628k3815K2613M0877J7193j079j9932p233J4554j7412J1821k357K053K876
$$ -46628 -70443 -47830 -6953 10240 9161 -10771 -18004 -3450 -20862 -9041 -11398 -9345 -6469
4575f469j5848j0454K1684R747j2308N11o361j4329M309K1855r823J3103L229
$$ -6469 -22317 -32771 -11087 -1340 -13648 -13137 -19498 -33827 -29518 -7663 -17486 -4383 -1154
4562a154l186J3489j0011l900J680q111J1930J3856N939k4670k8983K5046L2340
$$ -1154 -4340 9149 -862 -4762 -3082 -11193 737 14593 20532 -4138 -33121 -8075 24265
4549B4265J8359j2666k4690n74P412J1900k0863l0651l7373n442N7462K7905J4852
$$ 24265 42624 29958 5268 4694 12106 24006 3143 -27508 -64881 -70323 -12861 15044 29896
4536B9896l64K1287j0040N652j8682l4163q38J4589J6441q908L893k459j6752
$$ 29896 29532 50819 40779 46431 27749 -6414 -7252 7337 23778 14870 18763 16304 -448
4523d48j7000j6082J6687k4506N028K1002K3578q075o284j9963L6761N947r613
$$ -448 -17448 -33530 -16843 -41349 -36321 -15319 8259 184 -6100 -26063 10698 16645 7032
4510G032j4325K6370Q24j4246k3060l2555P811J5383O074o324j4783L519n384
$$ 7032 -7293 19077 19901 5655 -17405 -49960 -42149 -26766 -20692 -27016 -41799 -38280 -43664
4497d3664j1513J9231J7114Q70L7210J6528J7960j3342l6484j3437L884K3524
$$ -43664 -55177 -35946 -18832 -17962 19248 35776 53736 40394 3910 -9527 -5643 17881
4485A7881J8326r884j4580M378j8275j8163l5949K18L2516J0533P628j753J6843
$$ 17881 36207 26323 11743 16121 -2154 -20317 -56266 -56048 -23532 -12999 -5371 -7124 9719
4472I719Q521O958J7496J7116l929m569m6044O72J4246L490K1717j3709p015j9978
$$ 9719 18240 25198 42694 59810 55881 51312 5268 5940 20186 23676 45393 31684 24669 4691
4458D691j7780J2586m157R566K4377n236k2637j6890k7999P079J9316J0515K1036
$$ 4691 -13089 -503 -4660 4906 29283 24047 1410 -15480 -43479 -36400 -17084 -6569 14467
4445A4467l2921k1299J597J1536R065N373N560r725j6054p677J8630n1j6693K1640
$$ 14467 -18454 -39753 -38156 -26620 -17555 -12182 -6622 -16347 -32401 -40078 -21448 -21499 -38192 -16552
4431a6552M211q329N492L1094r28k1260m072M149k6825n878J4221l203O926J0665
$$ -16552 -12341 -20670 -15178 15916 14988 -6272 -10344 -6195 -33020 -38898 -24677 -27880 -20954 -10289
4417a0289k964J019j5631l1531k119N2967J8313q284K162M735j7158K1924J1549
$$ -10289 -13253 -12234 -27865 -59396 -61515 -8548 9765 1481 3643 8378 -8780 13144 24693
4404B4693j0133Q391L26k0088k1532K1723J6331N965k4214j0481r564r33k487
$$ 24693 14560 22951 23277 3189 -18343 3380 19711 25676 1462 -9019 -18583 -19516 -22003
4391b2003j0848K8717l796j1904l669J3983K3034k6279J2035O113k0838j3397
$$ -22003 -32851 -4134 -7930 -19834 -23503 -9520 13514 -12765 -730 5383 -15455 -28852
4379b8852k802K9683J5210O04m464j0158P674O327J7028r39J0885j3599j8999
$$ -28852 -31654 -1971 13239 13843 9379 -779 6895 13222 30250 29311 40196 26597 7598
4366G598k0330K62J5859p759M371j7591j0190P467J1829k3071k6086j0261K9028
$$ 7598 -12732 -12470 3389 -4370 1 -17590 -27780 -20313 -8484 -31555 -57641 -67902 -38874
4353c8874L831j0204j3130J010L4675L3861q822m137p993l8039Q176M7041P434
$$ -38874 -35043 -45247 -58377 -57367 -22692 11169 2347 -1790 -9783 -47822 -39646 7395 14829
4340A4829l4837k901K0827K0097J0331j7059j1741r971k1402k0876L4572M1614
$$ 14829 -20008 -22909 -2082 18015 28346 11287 -454 -10425 -31827 -52703 -18131 23483
4328B3483J487l5477k7555M6381L9878k599j2214J819j6126k6008J5660l285q808
$$ 23483 24970 -10507 -38062 8319 48197 45598 33384 35203 19077 -6931 8729 5444 -3364
4315c364k3482j3006M534L5042J5838j0432k6017j5810K6220L5622Q367k6363
$$ -3364 -26846 -39852 -35318 -276 15562 5130 -20887 -36697 -10477 25145 33512 7149
4303G149j6899J1215J4479J4515O432P116j7633j9642j1523J4439J4305k7944
$$ 7149 -9750 1465 15944 30459 36891 44007 26374 6732 -4791 9648 23953 -3991
$$ [...]
##END NTUPLES=NMR SPECTRUM
##END=
