##TITLE=Analysis number 326162
Compound Code cc 61413
Book Reference 449/184
Project Code adrs
Chemist Name davee
##JCAMPDX= 6.0         $$ Bruker NMR JCAMP-DX V2.0
##DATA TYPE= NMR SPECTRUM
##DATA CLASS= NTUPLES
##ORIGIN= Bruker BioSpin GmbH
##OWNER= nmr
$$ XWIN-NMR		Version 3.5
$$ Thu Jan 25 15:32:56 2007 GMT Standard Time (UT+0h)  MAYBRIDGE\nmr@NMR_250MHZ
##.OBSERVE FREQUENCY= 250.131544655141
##.OBSERVE NUCLEUS= ^1H
##.ACQUISITION MODE= SIMULTANEOUS (DQD)
##.ACQUISITION SCHEME= undefined
##.AVERAGES= 16
##.DIGITISER RES= 18
##SPECTROMETER/DATA SYSTEM= dpx250
##.PULSE SEQUENCE= zg30
##.SOLVENT NAME= CDCl3
##.SHIFT REFERENCE= (INTERNAL, CDCl3, 0, 16.522)
##AUDIT TRAIL= $$ (NUMBER, WHEN, WHO, WHERE, WHAT)
$$ ##TITLE= Audit trail, XWIN-NMR		Version 3.5
$$ ##JCAMPDX= 5.01
$$ ##ORIGIN= Bruker BioSpin GmbH
$$ ##OWNER= nmr
$$ C:\u/data/dgb/nmr/ADRS/2090/pdata/1/auditp.txt
$$ ##AUDIT TRAIL=  $$ (NUMBER, WHEN, WHO, WHERE, WHAT)
(   1,<2007-01-25 15:32:32.98 +000>,<MAYBRIDGE\nmr>,<NMR_250MHZ>,
      <created by zg, POWCHK disabled, PULCHK disabled
       configuration hash MD5:
       49 4B E0 1D 92 C2 6B 37 9F E6 65 BC 52 41 86 1D
       data hash MD5: 64K
       3D 32 EB D4 BC 47 D1 A8 E2 C6 6E 5E D0 1C C9 0C>)
(   2,<2007-01-25 15:32:46.32 +000>,<MAYBRIDGE\nmr>,<NMR_250MHZ>,
      <Start of raw data processing
       ef LB = 0.3 FT_mod = 6 PKNL = 1 SI = 32K 
       data hash MD5: 32K
       FB 6F 3D 0C 5E 4E A9 32 9E 4B FC A0 1D 68 64 17>)
(   3,<2007-01-25 15:32:48.30 +000>,<MAYBRIDGE\nmr>,<NMR_250MHZ>,
      <apk 
       data hash MD5: 32K
       16 13 E3 89 9C C8 D8 2E 4B B2 6F DC F9 47 A2 10>)
(   4,<2007-01-25 15:32:49.09 +000>,<MAYBRIDGE\nmr>,<NMR_250MHZ>,
      <abs ABSG = 5 
       data hash MD5: 32K
       FC 92 78 48 AC 9B 9F F4 28 ED 66 9A 54 EA 8F 98>)
$$ ##END=
$$ 
$$ hash MD5
$$ D4 27 C0 64 92 40 6A 24 43 08 CC 14 D6 A1 65 0F
##$RELAX= 
##$RELAX= 
##$RELAX= 
##$RELAX= 
##$RELAX= 
##$RELAX= 
##$RELAX= 
$$ Bruker specific parameters
$$ --------------------------
##$DU= <C:\u>
##$EXPNO= 2090
##$NAME= <ADRS>
##$PROCNO= 1
##$TYPE= <nmr>
##$USER= <dgb>
##$AMP= (0..31)
100 100 100 100 100 100 100 100 100 100 100 100 100 100 100 100 100 100 
100 100 100 100 100 100 100 100 100 100 100 100 100 100 
##$AQSEQ= 0
##$AQ_mod= 3
##$AUNM= <au_zg>
##$AUTOPOS= <45 >
##$BF1= 250.13
##$BF2= 250.13
##$BF3= 250.13
##$BF4= 250.13
##$BF5= 500.13
##$BF6= 500.13
##$BF7= 500.13
##$BF8= 500.13
##$BYTORDA= 1
##$CFDGTYP= 0
##$CFRGTYP= 5
##$CHEMSTR= <none>
##$CNST= (0..31)
1 1 145 1 1 1 1 1 1 1 1 1 1 1 1 1 1 1 1 1 1 1 1 1 1 1 1 1 1 1 1 1 
##$CPDPRG= <>
##$CPDPRG1= <>
##$CPDPRG2= <>
##$CPDPRG3= <>
##$CPDPRG4= <mlev>
##$CPDPRG5= <mlev>
##$CPDPRG6= <mlev>
##$CPDPRG7= <mlev>
##$CPDPRG8= <mlev>
##$CPDPRGB= <>
##$CPDPRGT= <>
##$D= (0..31)
0 1 0 0 0 0 0 0 0 0.06 0 0 0 0 0 0 0.0002 0 0 0 0 0 0 0 0 0 0 0 0 0 0 
0 
##$DATE= 1169739151
##$DBL= (0..7)
120 120 120 120 120 120 120 120 
##$DBP= (0..7)
150 150 150 150 150 150 150 150 
##$DBP07= 0
##$DBPNAM0= <>
##$DBPNAM1= <>
$$ [...]
##$SUBNAM7= <"">
##$SUBNAM8= <"">
##$SUBNAM9= <"">
##$SW= 20.6930455092707
##$SWIBOX= (0..15)
0 0 3 0 0 0 0 0 0 0 0 0 0 0 0 0 
##$SW_h= 5175.983436853
##$TD= 65536
##$TD0= 1
##$TE= 294.16
##$TE2= 300
##$TE3= 300
##$TEG= 300
##$TL= (0..7)
0 120 120 120 120 120 120 120 
##$TP= (0..7)
150 150 150 150 150 150 150 150 
##$TP07= 0
##$TPNAME0= <>
##$TPNAME1= <>
##$TPNAME2= <>
##$TPNAME3= <>
##$TPNAME4= <>
##$TPNAME5= <>
##$TPNAME6= <>
##$TPNAME7= <>
##$TPOAL= (0..7)
0.5 0.5 0.5 0.5 0.5 0.5 0.5 0.5 
##$TPOFFS= (0..7)
0 0 0 0 0 0 0 0 
##$TUNHIN= 0
##$TUNHOUT= 0
##$TUNXOUT= 0
##$USERA1= <user>
##$USERA2= <user>
##$USERA3= <user>
##$USERA4= <user>
##$USERA5= <user>
##$V9= 5
##$VALIST= <valist>
##$VCLIST= <CCCCCCCCCCCCCCC>
##$VD= 0
##$VDLIST= <DDDDDDDDDDDDDDD>
##$VPLIST= <PPPPPPPPPPPPPPP>
##$VTLIST= <TTTTTTTTTTTTTTT>
##$WBST= 1024
##$WBSW= 4
##$XGAIN= (0..3)
0 0 0 0 
##$XL= 0
##$YL= 0
##$YMAX_a= 392220
##$YMIN_a= -442921
##$ZGOPTNS= <>
##$ZL1= 120
##$ZL2= 120
##$ZL3= 120
##$ZL4= 120
##$ABSF1= 16.522
##$ABSF2= -4.171173
##$ABSG= 5
##$ABSL= 3
##$ALPHA= 0
##$AQORDER= 0
##$ASSFAC= 0
##$ASSFACI= 0
##$ASSFACX= 0
##$ASSWID= 0
##$AUNMP= <proc_1d>
##$AZFE= 0.1
##$AZFW= 0.1
##$BCFW= 0
##$BC_mod= 0
##$BYTORDP= 0
##$COROFFS= 0
##$CY= 12.5
##$DATMOD= 1
##$DC= 0
##$DFILT= <>
##$DTYPP= 0
##$F1P= 14.0000005364418
##$F2P= -0.99999901652339
##$FCOR= 0.5
##$FTSIZE= 32768
##$FT_mod= 6
##$GAMMA= 0
##$GB= 0
##$INTBC= 1
##$INTSCL= 1
##$ISEN= 128
##$LB= 0.3
##$LEV0= 0
##$LPBIN= 0
##$MAXI= 10000
##$MC2= 0
##$MEAN= 0
##$ME_mod= 0
##$MI= 0
##$NCOEF= 0
##$NC_proc= -3
##$NLEV= 6
##$NOISF1= 0
##$NOISF2= 0
##$NSP= 0
##$NTH_PI= 0
##$NZP= 0
##$OFFSET= 16.522
##$PC= 1
##$PHC0= -130.712
##$PHC1= 10.38267
##$PH_mod= 1
##$PKNL= yes
##$PPARMOD= 0
##$PSCAL= 4
##$PSIGN= 0
##$REVERSE= no
##$SF= 250.13
##$SI= 32768
##$SIGF1= 0
##$SIGF2= 0
##$SINO= 400
##$SIOLD= 32768
##$SREGLST= <1H.CDCl3>
##$SSB= 0
##$STSI= 32768
##$STSR= 0
##$SW_p= 5175.98343685301
##$SYMM= 0
##$S_DEV= 0
##$TDeff= 65536
##$TDoff= 0
##$TI= <Analysis number 999999
Compound Code 99
Book Reference 9
Project Code 9>
##$TILT= no
##$TM1= 0
##$TM2= 0
##$TOPLEV= 0
##$USERP1= <user>
##$USERP2= <user>
##$USERP3= <user>
##$USERP4= <user>
##$USERP5= <user>
##$WDW= 1
##$XDIM= 32768
##$YMAX_p= 454801793
##$YMIN_p= -88878
$$ End of Bruker specific parameters
$$ ---------------------------------
##NTUPLES= NMR SPECTRUM
##VAR_NAME=  FREQUENCY,     SPECTRUM/REAL,   SPECTRUM/IMAG
##SYMBOL=    X,             R,               I
##VAR_TYPE=  INDEPENDENT,   DEPENDENT,       DEPENDENT
##VAR_FORM=  AFFN,          ASDF,            ASDF
##VAR_DIM=   32768,         32768,           32768
##UNITS=     HZ,            ARBITRARY UNITS, ARBITRARY UNITS
##FACTOR=    0.157963299565203, 1,           1
##FIRST=     4132.6476996994, 0,             0
##LAST=      -1043.33573715361, 0,           0
##MIN=       -1043.33573715361, -88878,      0
##MAX=       4132.6476996994, 454801793,     0
$$ Real data points
##PAGE= N=1
##DATA TABLE= (X++(R..R)), XYDATA
$$ [...]
16325C458r430l3071K0184L8857o20O481k1563k638r898j3389J1155K2812J5686
$$ 3458 -5972 -39043 -18859 19998 19378 25859 4296 1658 -8240 -21629 -10474 12338 28024
16312B8024j4346j6370j6849m126L404J3834r445j4635j1573j5844J9230J0173
$$ 28024 13678 -2692 -19541 -23667 -20263 -6429 -15874 -30509 -42082 -57926 -38696 -28523
16300b8523j6792L662R227q023N635J2120k848j6110l219R854j1782K4931Q263
$$ -28523 -45315 -41653 -32426 -40449 -34814 -22694 -25542 -41652 -44871 -35017 -46799 -21868 -13605
16287a3605J4185q886r453j4016J2272J7830j5141m733L5531L7232n345k0137
$$ -13605 580 -8306 -17759 -31775 -19503 -1673 -16814 -21547 13984 51216 45871 25734
16275B5734l2317O42j0552l443R19j3860k922K0330j169k1064M622J3919j837
$$ 25734 -6583 -5941 -16493 -19936 -19017 -32877 -35799 -15469 -16638 -37702 -33080 -19161 -20998
16262b0998J1068n039q43l2892J5476J8609r137j2583m561J86J0959Q872P426
$$ -20998 -9930 -14969 -15812 -48704 -33228 -14619 -23756 -36339 -40900 -40714 -29755 -20883 -13457
16249a3457j0795m297n23K350L903j578j7339j1375M597J1893K0171N447K8780
$$ -13457 -24252 -28549 -29072 -26722 -22819 -24397 -41736 -53111 -48514 -36621 -16450 -11003 17777
16236A7777J2178j1777l5348R450M2041n397k6430k2661j5980l4239K4379K1334
$$ 17777 29955 18178 -17170 -7720 34321 28924 2494 -20167 -36147 -70386 -46007 -24673
16224b4673k4820J372J4377P513p499K0737o920o700k3534R428J1609N829N482
$$ -24673 -49493 -48121 -33744 -26231 -33730 -12993 -19913 -26613 -50147 -40719 -29110 -23281 -17799
16211a7799L716R920K3531M521l3050Q427L1270j7981k6288P500K2991M679l1225
$$ -17799 -14083 -4163 19368 23889 -9161 -734 30536 12555 -13733 -6233 16758 21437 -9788
16198i788k5444J0078M117M588o859o730L189K9726n146j3956J1714m166J7996
$$ -9788 -35232 -25154 -21037 -16449 -23308 -30038 -26849 2877 -2269 -16225 -4511 -8677 9319
16185I319p40R222q338j0262r105j2342R742N362R519j084o133j346j2419K1102
$$ 9319 8579 17801 9463 -799 -9904 -22246 -12504 -7142 2377 1293 -4840 -6186 -18605 2497
16171B497M023K0586J992j7996J0598J0537r258j2111n069k0937j467L6524l582
$$ 2497 6520 27106 29098 11102 21700 32237 22979 10868 5799 -15138 -16605 19919 16337
16158A6337j9403j019j7474M498K3351L768j873L500j8525j6934l955j4971q27
$$ 16337 -3066 -4085 -21559 -17061 6290 10058 8185 11685 -6840 -23774 -27729 -42700 -43527
16145d3527Q488L1512J7266L354Q714J1307j3356k3012L908l339r824J4197K419
$$ -43527 -35039 -3527 13739 17093 25807 37114 23758 746 4654 1315 -8509 5688 8107
16132H107j099j3664j1938R610M392l578M112j3789K430R846k828M57J1739M406
$$ 8107 7008 -6656 -18594 -8984 -4592 -8170 -4058 -17847 -15417 -5571 -8399 -7942 3797 8203
16118H203n154j2712k0796J1210n634R864K8050L8417j5909j3175l3557l3440
$$ 8203 3049 -9663 -30459 -19249 -24883 -15019 13031 51448 35539 22364 -11193 -44633
16106d4633K0965J8458o73l927m852j4514J2804k728n473j5221o116N032N853
$$ -44633 -23668 -5210 -5883 -9810 -14662 -29176 -16372 -19100 -24573 -39794 -45910 -40878 -35025
16093c5025j1792m320J7131K6711J3636j2606k1253j5705j7735K3376L4065j2791
$$ -35025 -46817 -51137 -34006 -7295 6341 -6265 -27518 -43223 -60958 -37582 -3517 -16308
16081a6308j5348K6384J9302r184j1135j8183j8447o758O627K0988P326o926o346
$$ -16308 -31656 -5272 14030 4846 -6289 -24472 -42919 -49677 -43050 -22062 -14736 -21662 -28008
16068b8008K1498L514j6175P77J5044r848l244j0383J6775J2428o982k807k819
$$ -28008 -6510 -2996 -19171 -18394 -3350 -13198 -16442 -26825 -10050 2378 -4604 -7411 -10230
16055a0230K422O369L1386L1616o154j6504j6095r995r779L721Q219m007J5854
$$ -10230 -7808 -1439 29947 61563 55409 38905 22810 12815 3036 6757 14976 10969 26823
16042B6823N561j21o496j7401j5378Q112K1166K467j8207J260J097m961q882o541
$$ 26823 32384 32263 25767 8366 -7012 1100 22266 24733 6526 7786 8883 3922 -4960 -11501
16028a1501K7747k137p161j8066m052K1617N66j0564l772J2631Q325L611L485
$$ -11501 16246 14109 6948 -11118 -15170 6447 7013 -3551 -7323 5308 13633 17244 20729
16015B0729l0813j5636j577J0642O897K6215K1174O785R352J141l2056q602P050
$$ 20729 -10084 -25720 -27297 -16655 -9758 16457 37631 44416 53768 54909 22853 14251 21301
16002B1301j2956k802J1972j4553j445l024Q502L2058J5142k7978j5985M400k2261
$$ 21301 8345 5543 17515 2962 1517 -1507 6995 39053 54195 26217 10232 14632 -7629
15989g629j5180L2275M5438k2972k3784r723j1928J6931K8049k531r805k1513
$$ -7629 -22809 9466 54904 31932 8148 -1575 -13503 3428 31477 28946 19141 -2372
15977b372j7083J2868l815j8724J351L088J780J1976N86R551p81r794J661m000
$$ -2372 -19455 -6587 -10402 -29126 -27775 -24687 -22907 -10931 -10345 -794 -1575 -11369 -9708 -13708
15963a3708Q11k4568j3807J9323J6354N748J5868N431m251J6530k807j6770r252
$$ -13708 -12897 -37465 -51272 -31949 -15595 -9847 6021 11452 7201 23731 20924 4154 -5098
15950e098l807Q18J0996R786j0355j5334R154L015Q135J6577P848r361R714R797
$$ -5098 -8905 -8087 2909 12695 2340 -12994 -3840 -825 7310 23887 31735 22374 32088 41885
15936D1885k6819k5253R174J6162M529Q972l082j8283K636K5438J3605q28p390
$$ 41885 15066 -10187 -1013 15149 19678 28650 25568 7285 9921 35359 48964 48136 40746
15923D0746n706j1021j098r834O47J0906j9725m957L6359J385l5288n335J4805
$$ 40746 35040 24019 22921 13087 13734 24640 4915 -42 36317 37702 2414 -2921 11884
15910A1884o897K5545j1094l7802k0733L4522K6782L528j2396j8943j0706J3519
$$ 11884 4987 30532 19438 -18364 -39097 -4575 22207 25735 13339 -5604 -16310 -2791
15898b791j2501n377K0386P4O675M554R390J1199k939k02j512k7872P870K2224
$$ -2791 -15292 -20669 -283 -209 6466 11020 20410 31609 28670 28468 26956 -916 6954 29178
15884B9178k2265K436L504J4316K6312K409j1439P079m777j6204m564k4646K459
$$ 29178 6913 9349 12853 27169 53481 55890 44451 51530 46753 30549 25985 1339 3798
15871C798p664J9121L2479M896j4149R666J5593J80J458K084p637l5856j4154
$$ 3798 -3866 15255 47734 52630 38481 48147 63740 63920 65378 67462 59825 23969 9815
15858I815o491J2935J2051o78L110j6835R576l765K0671l280N697j4810n233J018
$$ 9815 3324 16259 28310 27632 30742 13907 23483 19718 40389 37109 42806 27996 22763 23781
15844B3781L235k2029J5985L2439M992j4039K634L5704L365m323m545l6358l853
$$ 23781 27016 4987 20972 53411 58403 44364 46998 82702 86067 81744 77199 40841 36988
15831C6988K732p284k3210l383J9757L1077N943r629j9876P733m995N46K644K0090
$$ 36988 39720 32436 9226 5843 25600 56677 62620 52991 33115 40848 35853 36399 39043 59133
15817E9133K5845J2597L190j3833r038j5250k8456j0426P143k464J5403Q981j3575
$$ 59133 84978 97575 100765 86932 77894 62644 34188 23762 30905 28441 43844 52825 39250
15804C9250Q010M6341R42l1456P284J9720l7218j3745L885R393k3748k497l634
$$ 39250 47260 93601 94543 63087 70371 90091 52873 39128 43013 52406 28658 26161 22527
15791B2527J993k3531M616j1906O582m71j15K1307M1468K5929k232k1451k2476
$$ 22527 24520 989 5605 -6301 281 -190 -305 21002 62470 88399 86167 64716 42240
15778D2240n06r196O639J0423j1215k961Q054J3402r216n383J589J7608L050J1562
$$ 42240 41734 32538 39177 49600 38385 35424 43478 56880 47664 42281 43870 61478 64528 76090
15764G6090O192j1984o280k2761L5921P866j4892k1472l5528O989J9539o867q464
$$ 76090 82282 70298 64018 41257 77178 85044 70152 48680 13152 20141 39680 32813 24349
15751B4349j852q28O498n942K9883k3875k7934K076K0176L9219N24k3453O217
$$ 24349 22497 21669 28167 22225 52108 28233 299 2375 22551 61770 62294 38841 45058
15738D5058K5576n29l3992j5209J82o43q859L2439J2051L1372p066k8524k9901
$$ 45058 70634 70105 36113 20904 21086 20443 11584 44023 56074 87446 80380 51856 21955
15725B1955q914J0410K4984K765j5688N023Q999J6922l0275j6145J1074J7489
$$ 21955 13041 23451 48435 51200 35512 40535 49534 66456 36181 20036 31110 48599
15713D8599K1623q449l0077j9769J1012M848J8991J901O442L963k0062k5135j2012
$$ 48599 70222 61773 31696 11927 22939 27787 46778 48679 55121 59084 39022 13887 1875
15700A875q548J4910K7631k240J3137r517k256j0246l8917L719J6848o677j9572
$$ 1875 -6673 8237 35868 33628 46765 37248 34992 24746 -14171 -10452 6396 -281 -19853
15687a9853M427K1522J3434J4937n593j5933j8285o622Jq311J3716Q905p865Q931
$$ -19853 -15426 6096 19530 34467 28874 12941 -5344 -11966 -11965 -20276 -6560 2345 -5520 3411
15673C411L1443K8561j1834J0154J2640j8752j3292r872N340Q413J7462q229j2303
$$ 3411 34854 63415 51581 61735 74375 55623 42331 32459 37799 46212 63674 55445 43142
15660D3142j0332N586J367P725J6116q646l542k544k5991n195j5226j2140j203
$$ 43142 32810 38396 39763 47488 63604 54958 51416 48872 22881 17686 2460 -9680 -10883
15647a0883J1692m637P3J0118M424j2319Q646J54J480j1473O8R923K0048Q386
$$ -10883 809 -3828 -3755 6363 10787 -1532 7114 7268 8748 -2725 -2657 7266 27314 35700
15633C5700k280k5283j306j7554j2371N88J4678j4741n471N710J1985J4800j5179
$$ 35700 33420 8137 6831 -10723 -23094 -22506 -7828 -22569 -28040 -22330 -10345 4455 -10724
15620a0724J7790j6904j8350r636P205K4023N086K2898o409o485J791j5065j1632
$$ -10724 7066 -9838 -28188 -37824 -30619 -6596 -1510 21388 14979 8494 10285 -4780 -16412
15607a6412N348J8857n755j643k1514L949J2155j5898k036j186P46J100J4622
$$ -16412 -11064 7793 2038 395 -21119 -17170 -5015 -20913 -22949 -24135 -23389 -22289 -7667
15594g667L803J462k08m50k168j91r258j8374p839K9422K0115J0619L3025r065
$$ -7667 -3864 -2402 -2610 -3060 -5228 -5419 -14677 -33051 -40890 -11468 8647 19266 52291 43226
15580D3226k7290j7532j613J5935J5249L0320j6651l8040k2113j7186p780K4549
$$ 43226 15936 -1596 -3209 12726 27975 58295 41644 3604 -18509 -35695 -43475 -18926
15568a8926K9686J4791l074K960o062M635N035l0401k5691J331k219m303k224
$$ -18926 10760 25551 22477 25437 19375 24010 29045 -1356 -27047 -25716 -27935 -32238 -34462
15555c4462o901N206Q032J969q445J7221L2751M778j3133q845O656J6209Q274
$$ -34462 -41363 -36157 -28125 -26156 -34601 -17380 15371 20149 7016 -1829 4827 21036 29310
15542B9310j8788l4956k1534n671J3634L6850K0192o921l235Q254p882L878J436
$$ 29310 10522 -24434 -45968 -51639 -38005 -1155 19037 12116 8881 17135 9253 13131 14567
15529A4567o902M762k1636l3535O132M9077L6332L187j7069k5751p148J7956q871
$$ 14567 7665 12427 -9209 -42744 -36612 12465 48797 51984 34915 9164 2016 19972 11101
15516A1101L0503J900l1044l137L50R629j7510J275j097j0371l145N400l87n801
$$ 11101 41604 43504 12460 9323 9673 19302 1792 3067 1970 -8401 -11546 -6146 -6533 -12334
15502a2334L476o85K879L8612O030k1450k5973q429j2347j2455N863J402K0525
$$ -12334 -8858 -9543 -6664 31948 37978 16528 -9445 -17874 -30221 -42676 -36813 -35411 -14886
15489a4886k218O909J7804m718l537K016j1147J0123J2072J5114k519k6446j5641
$$ -14886 -17104 -10195 7609 2891 -646 1370 -9777 346 12418 27532 25013 -1433 -17074
15476a7074q175L3133o266k1250M759R977J2309K0763P772k8250m349l642J3966
$$ -17074 -25249 7884 1618 -19632 -14873 -4896 7413 28176 35948 7698 3349 -293 13673
15463A3673j0740K420J7248j8822n0850j9657J400J2826K9051N605o191r804n082
$$ 13673 2933 5353 22601 3779 -47071 -66728 -65328 -52502 -23451 -17846 -24037 -33841 -38923
15450c8923K7477O011l3453R037L9006O845K9j6306k3621J6777K1296k0362j2546
$$ -38923 -11446 -5435 -38888 -29851 9155 16000 16029 -277 -23898 -7121 14175 -6187 -18733
15437a8733j912n398j750p06K0163K7867J8260j281o911j5606j8348j5107j5564
$$ -18733 -20645 -26043 -27793 -28499 -8336 19531 37791 36510 29599 13993 -4355 -19462 -35026
15424c5026O003j0911J6462J8217m47n068K6231J3458j5170j9122P138k7450j4738
$$ -35026 -29023 -39934 -23472 -5255 -5702 -10770 15461 28919 13749 -5373 1765 -25685 -40423
15411d0423R680J5203L3504j2745j7704k0706L273K4103j4121O722L405o118R68
$$ -40423 -30743 -15540 17964 5219 -12485 -33191 -29918 -5815 -19936 -13214 -9809 -15927 -14959
15398a4959K521r879J1137L031p243K54o395j0913J6012J9375q824j3702k558
$$ -14959 -12438 -22317 -11180 -8149 -15392 -15138 -21533 -32446 -16434 2941 -5883 -19585 -22143
15385b2143J7232J8155J813n065p079p65j67L2151j4732o660p473j0423J4647
$$ -22143 -4911 13244 15057 9992 2913 2148 1981 34132 19400 12740 5267 -5156 9491
15372I491P429O23n645q768j0955k492m595N132q494P613J0010q801j3451P888
$$ 9491 16920 17543 11898 3130 -7825 -10317 -14912 -9780 -18274 -10661 -651 -9452 -22903 -15015
15358a5015N593j4229r257K8400J5591j4033P330K039N7m5006k4377R698K3540
$$ -15015 -9422 -23651 -32908 -4508 11083 -2950 4380 6419 6476 -38530 -62907 -53209 -29669
15345b9669O298R858J3296Q340j2504k1552j967J4192J614K3075M520k2934j5367
$$ -29669 -23371 -13513 -217 8123 -4381 -25933 -27900 -13708 -12094 10981 15501 -7433 -22800
15332b2800K9863J8780j0175j5462K309j4204j2356Q031J5944j692k9274n265
$$ -22800 7063 25843 15668 206 2515 -11689 -24045 -16014 -70 -1762 -31036 -36301
15320c6301K2860J3131K952j4038K012J1596n801J8833N523j7790k4053O259R76
$$ -36301 -13441 -310 2642 -11396 -9384 2212 -3589 15244 20767 2977 -21076 -14817 -13841
15307a3841J8183j0606j826J3138k4671Q768M5j8302p755J0702K0937J6357Q291
$$ -13841 4342 -6264 -8090 5048 -19623 -10855 -10810 -29112 -36867 -26165 -5228 11129 19420
15294A9420J1711l2866r436k3221q698L5710j424j5497j0722J4591l873p938N219
$$ 19420 31131 -1735 -11171 -34392 -43090 -7380 -8804 -24301 -35023 -20432 -24305 -32243 -27024
15281b7024J8861j4793l0521o134J4031J4899J9906N154l505k1035o118O699J6650
$$ -27024 -8163 -22956 -53477 -59611 -45580 -30681 -10775 -5621 -9126 -30161 -36279 -29580 -12930
15268a2930P250o666j9564j5899k391j1293K8107K3106l654J6760Q134k8847k346
$$ -12930 -5680 -12346 -31910 -47809 -50200 -61493 -33386 -10280 -13934 2826 10960 -17887 -20233
15255b0233J0876q489l015N963r486j5432K208K739K9190J5801k1131P724K6819
$$ -20233 -9357 -17846 -20861 -14898 -24384 -39816 -37608 -34869 -5679 10122 -11009 -3285 23534
15242B3534M805k6179k1393J4756M097k9919k7192J4964J2765J6675J8160j9627
$$ 23534 28339 2160 -19233 -4477 -380 -30299 -57491 -42527 -29762 -13087 5073 -14554
15230a4554k3854l8463N987J1114L721M851L3185J0927K4187L3944o232j7474
$$ -14554 -38408 -76871 -70884 -59770 -56049 -51198 -18013 -7086 17101 51045 44813 27339
15218B7339k9227K127j9331k2718j020r88Q144K6106J0624k1630r570K156k2538
$$ 27339 -1888 239 -19092 -41810 -42830 -43818 -35674 -9568 1056 -20574 -30144 -27988 -50526
15205e0526j11J6893R083j657p194j1023j8642L059O071O379J6725K2985R004
$$ -50526 -50637 -33744 -24661 -26318 -33512 -44535 -63177 -60118 -54047 -47668 -30943 -7958 1046
15192A046K78j1388j4737p918M5807K7433l3245j5960J7094n711j0951n489K4
$$ 1046 1324 -10064 -24801 -32719 13088 40521 7276 -8684 8410 2699 -8252 -13741 -13717
15179a3717L870J7582Q333K5009K050j6631k0744O129L915q754k2716j2033J8959
$$ -13717 -9847 7735 16068 41077 43127 26496 5752 11881 15796 7042 -15674 -27707 -8748
15166h748J6419o155l5190m4253J4516O680J062K0484K1874n938j7169J4019r528
$$ -8748 7671 1516 -33674 -77927 -63411 -56731 -55669 -35185 -13311 -19249 -36418 -22399 -31927
15153c1927k7911K409Q439p791J3209J8522M742k2153Q299J7281J5740j5574k937
$$ -31927 -59838 -57429 -48990 -56781 -43572 -25050 -20308 -42461 -34162 -16881 -1141 -16715 -19652
15140a9652j588j7569J0920K0053j3323J3096K5079m56K7148k0702j1971O034
$$ -19652 -21240 -38809 -27889 -7836 -21159 -8063 17016 16560 43708 23006 11035 17069
15128A7069p706k4526k2183j8108l127K535L0750P781l845p555j777n203j6897
$$ 17069 9363 -15163 -37346 -55454 -58581 -56046 -25296 -17515 -21360 -28915 -30692 -35895 -52792
15115e2792J5556L193l2228O615L268J5031k756J17J7512n65J998Q148L930j7014
$$ -52792 -37236 -34043 -66271 -59656 -56388 -41357 -44113 -43996 -26484 -27049 -25051 -16903 -12973 -29987
15101b9987r468P297K0306L757l817j7808Q564K1482k0126j0208J0620J0048J9014
$$ -29987 -39455 -32158 -11852 -8095 -11912 -29720 -21156 326 -19800 -30008 -19388 -9340 9674
15088I674K509r940M199N723J3350K0324j0924j2740j2496k0189j9205J1319K2868
$$ 9674 12183 2243 6442 12165 25515 45839 34915 22175 9679 -10510 -29715 -18396 4472
15075D472J3414K1122p404j4093j1021k6944j8146k1931K4758J7576L892n920
$$ 4472 17886 39008 31604 17511 6490 -20454 -38600 -60531 -35773 -18197 -14305 -20225
15063b0225p158n35J075k3001j5979J9496M4789Q639j7413K3308r705p457p285
$$ -20225 -27383 -27918 -26843 -49844 -65823 -46327 -1538 7101 -10312 12996 3291 -4166 -11451
15050a1451q549J2575q241N596K7245J0617j5345j5794j4359j4999J7328J1720
$$ -11451 -20000 -7425 -15666 -10070 17175 27792 12447 -3347 -17706 -32705 -15377 -3657
15038c657k721k1295k9744L060K5137K2386K2332J0412J1807j0232n83N609n427
$$ -3657 -6378 -27673 -57417 -54357 -29220 -6834 15498 25910 37717 27485 26902 32511 27084
15025B7084j5428m388k8445j2840k921L0715J8438O011J7372R560K1943n968j2963
$$ 27084 11656 7268 -21177 -34017 -36938 -6223 12215 18226 35598 45158 67101 61133 48170
15012D8170J5252P251k1739j2248j5409k8341l042j5852l799K1698J2085j421
$$ 48170 63422 70673 48934 36686 21277 -7064 -10106 -25958 -29757 -8059 4026 2605
15000B605K516J1207p680k3642j3592L484N409k293J9481k1039o554J4430J1699
$$ 2605 5121 16328 8648 -14994 -28586 -25102 -19693 -21986 -2505 -23544 -30098 -15668 -3969
14987c969M650J653j5463p669j8048M053J8497J0037N666N499L18N28J1254J2183
$$ -3969 681 2334 -13129 -20798 -38846 -34793 -16296 -6259 -593 4906 5224 5752 17006 29189
14973B9189p529k5732n130O560O908k4958k0780j4583p196Q984J0380J1096K7023
$$ 29189 21660 -4072 -9202 -2642 4266 -20692 -41472 -56055 -63251 -54267 -43887 -32791 -5768
14960e768J8508k949q44j4969o349j4375j5681J1121K8935j7593r350K5315j484
$$ -5768 12740 9791 8947 -6022 -12371 -26746 -42427 -31306 -2371 -19964 -29314 -3999 -5483
14947e483k850j3887p942R826L483N829k2225P69O488J4684j4497o661L198J0266
$$ -5483 -8333 -22220 -30162 -20336 -16853 -11024 -33249 -32480 -25992 -11308 -25805 -32466 -29268 -19002
14933a9002j7278J321J4983l882j3712Q550J9361K5449O964L187k2372j3216J7963
$$ -19002 -36280 -34959 -19976 -23858 -37570 -29020 -9659 15790 22754 25941 3569 -9647 8316
14920H316p580p219k2694K984J5290J6918J6917k4682k6377k968j29K5641K9234
$$ 8316 736 -6483 -29177 -26193 -10903 6015 22932 -1750 -28127 -31095 -31224 -5583 23651
14907B3651k09J2841j7132p782j1738p297k6267j2754J9165j4527j7084K0009
$$ 23651 23442 36283 19151 11369 -369 -7666 -33933 -46687 -27522 -42049 -59133 -39124
14895c9124K9969j5215r509n803l886M674K3221L8007j3089l5773k576Q602j3638
$$ -39124 -9155 -24370 -33879 -39682 -43568 -38894 -15673 22334 9245 -26528 -29104 -20502 -34140
14882c4140j287K5562Q589K3272L3513j9578j6439j8173k676m973j3622k944R33
$$ -34140 -35427 -9865 -1276 21996 55509 35931 19492 1319 -1357 -6330 -19952 -22896 -21963
14869b1963M130o893R54K6091l756j4055k2871J3915k641j6176J6124j2431J2899
$$ -21963 -17833 -24726 -23772 2319 -1437 -15492 -38363 -24448 -27089 -43265 -27141 -39572 -26673
14856b6673J0070j0369K771K4817M705k8774k651j7173m345R415P033J5158J1587
$$ -26673 -16603 -26972 -24201 616 5321 -23453 -26104 -43277 -47622 -38207 -31174 -16016 -4429
14843d429P647j5273P18M412j6493j9955J4095O938j8999J7412K9408j1858K64
$$ -4429 3218 -12055 -11337 -6925 -23418 -43373 -29278 -22340 -41339 -23927 5481 -6377 -6113
14830f113q498J362l381j8327k6487J1091j2507J9147R520J8785K2086R28j612
$$ -6113 -14611 -13249 -16630 -34957 -61444 -50353 -62860 -43713 -34193 -15408 6678 7606 5994
14817E994p825J5725k328l1471m634n987L79j1119K781r707j6026p918J2960J1000
$$ 5994 -1831 13894 11566 -19905 -24539 -30526 -30147 -41266 -38485 -48192 -64218 -72136 -59176 -48176
14803d8176J1134J5645M395J3821J070j357r513k1723q683J4004R912J1753M546
$$ -48176 -37042 -21397 -17002 -3181 -2111 -3468 -12981 -34704 -43387 -29383 -19471 -7718 -3172
14790c172k7247q541J5658J8583L1368p680j7299P556K249M558j8261J3828K4374
$$ -3172 -30419 -38960 -23302 -4719 26649 18969 1670 9226 11475 16033 -2228 11600 35974
14777C5974j2674o078K3971n910q391j8614j7991O072J0697O655p850P166l778
$$ 35974 23300 17222 41193 35283 26892 8278 -9713 -3641 7056 13711 5861 13027 9249
14764I249j218j7320J0733j619j5522k2679N968Q559l979M4Q945K871P501n134
$$ 9249 8031 -9289 1444 -175 -15697 -38376 -32408 -23849 -27828 -27784 -18839 -15968 -8467 -13601
14750a3601n623R716j84l0562Q752J7392K8275J2749j7228j1699m721j1654P532
$$ -13601 -19224 -9508 -9692 -40254 -31502 -14110 14165 26914 9686 -2013 -6734 -18388 -10856
14737a0856j8404j4982n817m843k067L582J3120O192l035j913J3662K3111J3496
$$ -10856 -29260 -44242 -50059 -54902 -56969 -53387 -40267 -34075 -37110 -39023 -25361 -2250 11246
14724A1246K7508J662k6663l0572M370j072R541J1157O354O723p535L040M03j5692
$$ 11246 38754 40416 13753 -16819 -12449 -13521 -3980 7177 13531 20254 12719 15759 16162 470
14710D70J4601K2529j8030k7765j4015l6748j050K1269L3124O755j1436j9292
$$ 470 15071 37600 19570 -8195 -22210 -58958 -60008 -38739 -5615 1140 -10296 -29588
14698b9588j1421Q986q439L615J7229j2150j4101j2780L838J2078j6459R548K2836
$$ -29588 -41009 -32023 -40462 -36847 -19618 -31768 -45869 -58649 -54811 -42733 -59192 -49644 -26808
14685b6808N564k3604q195k5432N95j447L183L2319K9389L844p12L0350J7988
$$ -26808 -21244 -44848 -53043 -78475 -77880 -79327 -76144 -43825 -14436 -10592 -11304 19046 37034
14672C7034K990Q662J5309j2658l4007l2482o310p568J1422J974J0853q868J0455
$$ 37034 40024 48686 63995 51337 17330 -15152 -21462 -29030 -17608 -15634 -4781 -13649 -3194
14659c194q207l17J534j8499k659j210J3619j4349r53J3427j907J2427L246r679
$$ -3194 -11401 -11718 -10184 -28683 -31342 -32552 -18933 -33282 -34235 -20808 -22715 -10288 -7042 -16721
14645a6721O128k29j3230R911J1129j8119j6152K829J5681m433J578j3080O914
$$ -16721 -10593 -10822 -24052 -14141 -3012 -21131 -37283 -34454 -18773 -23206 -21628 -34708 -27794
14632b7794Q485K2263M731m488P820P044L352j0663k2704p163N874R354o683j7541
$$ -27794 -19309 2954 7685 3197 11017 18061 21413 10750 -11954 -19117 -13243 -3889 -10572 -28113
14618b8113Q532J0426M295k2162M07L1638J5191j7514j2706M915j3100J0196J7085
$$ -28113 -19581 -9155 -4860 -27022 -26615 5023 20214 2700 -10006 -5091 -18191 -7995 9090
14605I090l2315K152L050M487j2269j1318K1768K8148N195J5359j7766j6363k
$$ 9090 -23225 -21073 -18023 -13536 -25805 -37123 -15355 12793 17988 33347 15581 -782 -784
14592g84k993O766O039J5358k2513J0034J932j1916j9619j2939O997L506K053
$$ -784 -3777 2989 9028 24386 1873 11907 13839 1923 -17696 -30635 -23638 -20132 -18079
14579a8079J5633M58k71l074J5490j1317j6234J4858N366j2987R00k835K137o891
$$ -18079 -2446 -1988 -2259 -5333 10157 -1160 -17394 -2536 2830 -10157 -9257 -12092 -9955 -16846
14565a6846k0826k0138r282M0058J438k6822j6734J1374O699k419J8272J8371
$$ -16846 -37672 -57810 -67092 -27034 -25596 -52418 -69152 -57778 -51079 -53498 -35226 -16855
14553a6855q830j3805j0543R231k631K1067K9728J337r04j5588O658j1563q352
$$ -16855 -25685 -39490 -50033 -40802 -43433 -22366 7362 8699 7795 -7793 -1135 -12698 -21050
14540b1050l349q721p183m5601K0531L0784J495l893J791L6848j891k8074J804
$$ -21050 -24399 -33120 -40303 -85904 -65373 -34589 -33094 -36987 -35196 1652 -239 -28313 -26509
14527b6509K522K2384K0304j8154j4492J9721l076J6610K338n362j4598j4617
$$ -26509 -23987 -1603 18701 547 -13945 5776 2700 19310 21648 16286 1688 -12929
14515a2929J3621k7775j0745o912j9618J6476J2541J913K194J8666J7123J7820
$$ -12929 692 -27083 -37828 -44740 -64358 -47882 -35341 -33428 -31234 -12568 4555 22375
14503B2375M051k3003l7322n549J5808j1169J7457P605j2282J3070q377n11J819
$$ 22375 26426 3423 -33899 -39448 -23640 -34809 -17352 -9747 -22029 -8959 -17336 -17847 -16028
14490a6028N96o695k3310k2302K3172L3785m187J6061N176J6364Q00L357j3538
$$ -16028 -15432 -22127 -45437 -67739 -44567 -10782 -14969 1092 6268 22632 23432 26789 13251
14477A3251j9674j404k6582r34L0297j059k9002q691M952P685j1702l247K0436
$$ 13251 -6423 -7827 -34409 -35343 -5046 -6105 -35107 -43798 -38846 -31161 -42863 -46110 -25674
14464b5674j3045N645L6390K8697n323l6841j2828q862R85K1054n20L918J1639
$$ -25674 -38719 -33074 3316 32013 26690 -10151 -22979 -31841 -30856 -9802 -10322 -6404 5235
14451E235m998l176j4813j4384j5077m805J7155O062J2624j2666j1532L0125r924
$$ 5235 237 -2939 -17752 -32136 -47213 -52018 -34863 -28801 -16177 -28843 -40375 -10250 -20174
14438b0174j4773j2355l219J4721K9991j3107k0607R005L5116n908k2883q548
$$ -20174 -34947 -47302 -50521 -35800 -5809 -18916 -39523 -30518 4598 -1310 -24193 -32741
14426c2741N42P221K3479R433J6070j5154J198m736r408L0008K3926j3756J682
$$ -32741 -32199 -24978 -1499 7934 24004 8850 10048 5312 -4096 25912 49838 36082 37764
14413C7764n676l1116q543q22J8818L336O324q550j4206K2860m009J499K5249
$$ 37764 32088 972 -7571 -8393 10425 13761 20085 11535 -2671 20189 16180 17679 42928
14400D2928J4556j7417j7008L5362j2582k2075J0162K3031K9417J2892N550R592
$$ 42928 57484 40067 23059 58421 45839 23764 33926 56957 86374 99266 104816 114408
14388A14408J1695J9089L0316L5511N3351L6936M7199N9372K1561K0412J3780
$$ 114408 126103 145192 175508 211019 264370 301306 348505 407877 429438 449850 463630
14377D63630L2069l247p938K2368J6410R994j6504m185k2762m4323m7010k1601
$$ 463630 495699 492452 484514 506882 523292 533286 516782 512597 489835 445512 398502 376901
14365C76901l8545p2419m5997k3607m4421m7149l0376o591k2103l989l869j2854
$$ 376901 338356 265937 219940 196333 151912 104763 74387 67796 45693 41704 37835 24981
14353B4981J881J0875J447n859j5086l922J6359M42k0796N090j2837K0422L5042
$$ 24981 26862 37737 39184 33325 18239 14317 30676 31118 10322 15412 2575 22997 58039
14340E8039P536k3404k8090j0192J7357P248K2144J7644j1761j1664k0378k599
$$ 58039 65575 42171 14081 3889 21246 28494 50638 68282 56521 44857 24479 21880
14328B1880p865l290n117J3078k959j4577J4663j8722L392J8335J6760J2956k229
$$ 21880 14015 10725 5608 18686 15727 1150 15813 -2909 483 18818 35578 48534 46305
14315D6305p353q446k485Q246p66j6523q622K649K144r272r326O849j0270k377
$$ 46305 38952 30506 28021 36267 35501 18978 10356 13005 15149 5877 -3449 3400 -6870 -9247
14301i247J5232N593r232L6516j175l3434j4937J5258J4407j5504M524P283k1082
$$ -9247 5985 11578 2346 38862 37687 4253 -10684 4574 18981 3477 8001 15284 -5798
14288e798j9130M702J8151M569K981k265o859o299m48K6518L3125K1103k6936
$$ -5798 -24928 -20226 -2075 2494 5475 3210 -3649 -9948 -10396 16122 49247 70350 43414
14275D3414k3230j4682Q79L461J6708L142O237k0805l87J6145j229p611k1803
$$ 43414 20184 5502 6381 9842 26550 29692 35929 15124 14737 30882 29653 22042 239
14262B39l0320J6069K0237p471k2236j9280L552K5904J4054k753q561j404q01
$$ 239 -30081 -14012 6225 -1246 -23482 -42762 -39210 -13306 748 -2005 -10566 -11970 -12771
14249a2771m284j8619J1337j3784m611K736L703J6028J590l9143N880K1693p883
$$ -12771 -17055 -35674 -24337 -38121 -42732 -39996 -36293 -20265 -18675 -57818 -51938 -30245 -38128
14236c8128j6473j6626L2146J8222p162l2602J0585L8269K9185Q298j4832k6833
$$ -38128 -54601 -71227 -39081 -20859 -28021 -60623 -50038 -11769 17416 25714 10882 -15951
14224a5951M157Q544j7545K688J1736R701k641j6684k1014n803j9446M955M2237
$$ -15951 -11794 -3250 -20795 -18107 -6371 3330 689 -15995 -37009 -42812 -62258 -57303 -15066
14211a5066K760j2841j7143L0454j0157k2059J371J0414K0399n226J2468J6354
$$ -15066 -12306 -25147 -42290 -11836 -21993 -44052 -42681 -32267 -11868 -17094 -4626 11728
14199A1728n578j4809P530l416l928J6607K4488N458O606j2405j1660j3068R960
$$ 11728 6150 -8659 -1129 -4545 -8473 8134 32622 38080 44686 32281 20621 7553 17513
14186A7513J7755O7543M2373K0043K6826K8558L3608j271Q930k359j6246j8485
$$ 17513 35268 102811 145184 165227 192053 220611 254219 252948 261878 259519 243273 224788
14174B24788j6841n2921n3231k9196j4777L930r288j401j0728K323M87j9168j3022
$$ 224788 207947 155026 101795 72599 57822 61752 52464 51063 40335 42658 43145 23977 10955
14161A0955j972R064M668r104j4868k4776k0313j448J4721M5016O433l795Q376
$$ 10955 8983 18047 22715 13611 -1257 -26033 -46346 -47794 -33073 11943 18376 14581 22957
14148B2957J900j9485k0543K2745q812Q417J6475K142j9714j2904k288k9605M92
$$ 22957 24857 5372 -15171 7574 -1238 7179 23654 25796 6082 -6822 -9110 -38715 -38223
14135c8223M9654O760n290Q768J4908j2797j2301j299j2198O253O086J8298n877
$$ -38223 11431 18191 12901 21669 36577 23780 11479 10180 -2018 4235 10321 28619 22742
14122B2742L659l804l1178k4940q091L3463K4885j0428N05J9195q276j6639r101
$$ 22742 26401 22597 -8581 -33521 -41612 -8149 16736 6308 6813 26008 17732 1093 -8008
14109h008j3464q564k261J5827J0738j1530J4611L2587j1499O835l89j0300J8470
$$ -8008 -21472 -30036 -32297 -16470 -5732 -17262 -2651 29936 18437 25272 24883 14583 33053
14096C3053j0024K105Q584Q78p547j604K475m872p690l075l006l3747k8992J6293
$$ 33053 23029 25134 33718 34596 27049 25445 27920 23048 15358 12283 9277 -24470 -53462 -37169
14082c7169L1400J6886m904k3998O774j5959J1591Q424M370n744o192K0108m966
$$ -37169 -5769 11117 6213 -17785 -11011 -26970 -15379 -6955 -2585 -8329 -14521 5587 621
14069F21k523J1990R478n854j0175J0660K063k5587n787M229N629n569j7857K2750
$$ 621 -1902 10088 19566 13712 3537 14197 16260 -9327 -15114 -10885 -5256 -10825 -28682 -5932
14055e932K4668J756q991R80p776l1045n739k1654k130L5943J4747j8050p344
$$ -5932 18736 20492 11501 12481 4705 -26340 -32079 -53733 -55863 -19920 -5173 -23223 -30567
14042c0567M582K533R120N482K4383K1041q061j8233l190J3792j0683N328L776
$$ -30567 -25985 -23452 -14332 -8850 15533 36574 28513 10280 7090 20882 10199 15527 19303
14029A9303K9157J6626k1702l4238r43j316n521j469J2642R243m85j469Q817J8312
$$ 19303 48460 65086 43384 9146 8203 6887 1366 -103 12539 21782 21297 19828 28645 46957
14015D6957j2172j7881k3437J6764O087r749j4413J7656P897K0439K453j4489
$$ 46957 34785 16904 -6533 10231 16318 6569 -7844 9812 17709 38148 40601 26112
14003B6112k4032j6590L615Q806p288K1977J4196j0128N152j2306j4897j0508
$$ 26112 2080 -14510 -10895 -2089 -9377 12600 26796 16668 21820 9514 -5383 -15891
13991a5891K608M719Q207q639k5424j0379j1720K7254K3530J4513m798j0371K4590
$$ -15891 -13283 -8564 -357 -8996 -34420 -44799 -56519 -29265 -5735 8778 3980 -6391 18199
13978A8199Q80R706P948o197q956j039P966J0539J2444J2216N035k3107j8557
$$ 18199 19079 28785 36733 30536 21580 20541 28507 39046 51490 63706 68741 45634 27077
13965B7077k536J758K0622J0559j9964n973k6188J7587R688l0911l4017K1729
$$ 27077 24541 26299 46921 57480 37516 31543 5355 22942 32630 1719 -32298 -10569
13953a0569K7865K2796n967j7892j322n118j0880J0165P884M197K6036k927l096
$$ -10569 17296 40092 34125 16233 14911 9793 -1087 9078 16962 21159 47195 44268 41172
13940D1172p141j2832j2658j0042r721J0150J5995J5681K160j1208J030J7073
$$ 41172 34031 21199 8541 -1501 -11222 -1072 14923 30604 32764 21556 22586 39659
13928C9659L7836j7147J0885L695m303m845K6081L0178K4626K0486k3065j5385
$$ 39659 77495 60348 71233 74928 70625 65780 91861 122039 146665 167151 144086 128701
13916A28701k782j0579J3916n869p253J0952K3359L0728P282k5055j2152L789
$$ 128701 125919 115340 129256 123387 116134 127086 150445 181173 188455 163400 151248 155037
13904A55037J8759K2778J1832J5766K6916j4364j9052j9857q368P458j6295N383
$$ 155037 173796 196574 208406 224172 251088 236724 217672 197815 189447 196905 180610 185993
13892A85993K3434j1712l5002q787J416K3672R903L2558M9569L7044M3210N311
$$ 185993 209427 197715 162713 153926 155342 179014 188917 221475 271044 308088 351298 356609
13880C56609n1986o7684l9617l5833m4171l1977k6070j3647R058K3684q730N103
$$ 356609 304623 236939 197322 161489 117318 85341 59271 45624 54682 78366 69636 74739
13868G4739O135k4447l3607q464k792j8902L1662J1016j8803n478j0454Q902J7589
$$ 74739 80874 56427 22820 14356 11564 -7338 24324 35340 16537 11059 605 9507 27096
13855B7096O85J6885P333m923j5157P19K9350L4793J2747q326J486j7965l3039
$$ 27096 27781 44666 51999 47076 31919 32638 61988 96781 109528 101202 102688 84723 51684
13842E1684k200j8397J3954L8690n350m3730q081K004o433l792k855P143K562
$$ 51684 49484 31087 45041 83731 78381 34651 26570 28574 22141 18349 15494 22637 25199
13829B5199M945q022q00J9939R841J556K2045J7791P03N980j3863p237J9604J8739
$$ 25199 30144 22122 21322 41261 51102 52658 74703 92494 93197 99177 85314 78077 97681 116420
13815A16420J9900j3191m0781J5785J6001O73l5486L045K5258j2964o62k287m682
$$ 116420 136320 123129 82348 98133 114134 114807 79321 82366 107624 94660 93998 91711 87029
13802H7029j4549j1529J7517J0257j0219j2065j4066l5661l2763K11L324q412
$$ 87029 72480 60951 78468 88725 78506 66441 52375 16714 -16049 -15838 -12514 -20926
13790b0926N834K5014J7311n312j0757k8984L386m693j8980k539J4491j035k05
$$ -20926 -15092 9922 27233 21921 11164 -17820 -14434 -19127 -38107 -40646 -26155 -27190 -27395
13777b7395k1765j5774J0715L7953K6076m5048R591J5347K2667o813L721j699
$$ -27395 -49160 -64934 -54219 -16266 9810 -35238 -25647 -10300 12367 5554 9275 7576
13765G576O664L59j890r850M270q549L1020J4652O093n338L702J0116L42k2522
$$ 7576 14240 14599 12709 2859 7129 -1420 29600 44252 50345 45007 48709 58825 59167 36645
13751C6645o929J8192R793j9983K4109J2355K5528J406k5351p069j4654p14k3012
$$ 36645 29716 47908 57701 37718 61827 74182 99710 101116 75765 68696 54042 53328 30316
13738C0316l0041M253J27P17R873k3811m90J3251J5093J0851M147L237O822n310
$$ 30316 275 4528 4655 5372 15245 -8566 -9056 4195 19288 30139 34286 37523 44345 39035
13724C9035L440m748k1428j0509k1065q683J6367J8352J5955M422o875J9565L0259
$$ 39035 42475 37727 16299 5790 -15275 -23958 -7591 10761 26716 31138 24263 43828 74087
13711G4087J2661j519j4356R131k0066J0236K9931r912j0997R96O63k3324R480
$$ 74087 86748 85229 70873 80004 59938 70174 100105 90193 79196 80192 80855 57531 67011
13698F7011K1707j0231k2783j0560l043j1060j3277m633J0752J191K7111K2484
$$ 67011 88718 78487 55704 45144 42101 31041 17764 13131 23883 25074 52185 74669
13686G4669J3391J4926k6023j5089j8546q5P772p946l746K0883j414k4035k97
$$ 74669 88060 102986 76963 61874 43328 43243 51015 43069 39323 60206 58792 34757 34460
13673C4460Q891j0300l0070L839J0960l4057P778K2067o19J7937n375M654p901
$$ 34460 43351 33051 2981 6820 17780 -16277 -8499 13568 12949 30886 25511 30165 22264
13660B2264k411j9225J0646J599j6022J4229L524n35K0242R906o40k9658k8726
$$ 22264 19853 628 11274 12873 -3149 11080 14604 14069 34311 44217 43577 13919 -14807
13647a4807j530L835O023q655o276K920n701n901R889P586R468j7114L318L633
$$ -14807 -16337 -12502 -6479 -15134 -21410 -18490 -24191 -30092 -20203 -12617 -3149 -20263 -16945 -13312
13633a3312j4434m30j0762k0256M029K1902J8572n636j697Q58j0138K0619O12
$$ -13312 -27746 -28176 -38938 -59194 -55165 -33263 -14691 -20327 -22024 -21166 -31304 -10685 -10073
13620a0073R409k2404q977oJ4635K4024J6468o148j0652j047K24K0689R240j6760
$$ -10073 -664 -23068 -32045 -32051 -17416 6608 23076 16928 6276 5229 5453 26142 35382 18622
13606A8622r053Q435r176j463j3044j057j7577j6670O481P177j938O664P731J3056
$$ 18622 9569 18004 8828 7365 -5679 -6736 -24313 -40983 -34502 -27325 -29263 -22599 -14868 -1812
13592a812K4457n173r51L1135K496j9271l2168L899J6288j8680J2318R2k0406
$$ -1812 22645 17472 16521 47656 50152 30881 -1287 2612 18900 220 12538 12630 -7776
13579g776l491R906P705Oj5343O347K9024Q354k9111r626k660N385O728r954j1090
$$ -7776 -11267 -1361 6344 6350 -8993 -2646 26378 34732 5621 -4005 -6665 -1280 5448 -4506 -15596
13564a5596O158j4127k2145K2988J4901J4771J2965J1429J6663J5528n333n707
$$ -15596 -9438 -23565 -45710 -22722 -7821 6950 19915 31344 48007 63535 58202 52495
13552E2495j5160k634l1751l109L07J465L027j2792K228j9959j0248R21n011o443
$$ 52495 37335 34701 2950 -159 148 1613 4640 -8152 -5924 -25883 -36131 -35210 -40221 -46664
13538d6664J5543J5785K4298j1649n881m192j0836J4353K5614N177o440k8963
$$ -46664 -31121 -15336 8962 -2687 -8568 -12760 -23596 -9243 16371 21548 15108 -13855
13526a3855k679O32o396L058j8279K5217K7463k0285j2759J4856O045K5187k266
$$ -13855 -16534 -15902 -22298 -19240 -37519 -12302 15161 -5124 -17883 -3027 3018 28205 25939
13513B5939k0957L621R054L351l5386j1491O286J7694J2414j7060r197N273j780
$$ 25939 4982 8603 17657 21008 -14378 -25869 -19583 -1889 10525 -6535 -15732 -10459 -12239
13500a2239l741l420m989J2652M018j4381j8620j4349K4016J6725N191n29J8279
$$ -12239 -15980 -19400 -24389 -11737 -7719 -22100 -40720 -55069 -31053 -14328 -9137 -9666 8613
13487H613p707n441Q527J8619j8296k2009k8508J7855L2630J2481o886j3449J0404
$$ 8613 906 -4535 3992 22611 4315 -17694 -46202 -28347 4283 16764 9878 -3571 6833
13474F833J6918j2597j4252J218N484j2485M573K1220j1524J0855k466m349j5018
$$ 6833 23751 11154 -3098 -1880 3604 -8881 -4308 16912 5388 16243 13777 9428 -5590
13461e590k639J5935L5130J8992l0850l3334j5241k866J1612N718J7238N140J3106
$$ -5590 -8229 7706 42836 61828 30978 -2356 -17597 -20463 -8851 -3133 14105 19245 32351
13448C2351M849k290k0309q884j2194l763j546J2929R569M979p574j2338P609
$$ 32351 37200 34910 14601 5717 -6477 -10240 -11786 1143 10712 15691 8117 -4221 3388
13435C388K798j7542k2635k6946R396L1099m271l383O414O431J327j448n774M352
$$ 3388 6186 -11356 -33991 -60937 -51541 -20442 -24713 -28096 -21682 -15251 -13924 -15372 -21146 -16794
13421a6794M930J4805M715j0890j0044P998J7203N672J6574j7657q204l940J1248
$$ -16794 -11864 2941 7656 -3234 -13278 -5280 11923 17595 34169 16512 8308 4368 15616
13408A5616k366j5537j1535R14N68J651O382p51p06P291J5051K0704J9151j9977
$$ 15616 13250 -2287 -13822 -12908 -12340 -10689 -4307 -5058 -5764 1527 16578 37282 56433 36456
13394C6456p178k3137K263R397j7207L68k347R51l333j068k9729j6815j4726l21
$$ 36456 29278 6141 8404 17801 594 962 -1385 -434 -3767 -4835 -34564 -51379 -66105 -66426
13380f6426K3750J2037j6963L054M686K3019J6630m877R311K546N83P90J5139
$$ -66426 -42676 -30639 -47602 -44548 -39862 -16843 -213 -5090 4221 6767 7350 8140 23279
13367B3279j2329j6696P19J7682N621r847m07J692M855m912k7889l7J5024K0913
$$ 23279 10950 -5746 -5027 12655 18276 8429 8022 9714 14569 9657 -18232 -18269 -3245 17668
13353A7668L317l872l2350m216l090p315K4296J984j8125O165Q58P23J1411R824
$$ 17668 20985 17113 -15237 -19453 -22543 -29858 -5562 -3578 -21703 -15538 -14680 -13957 -2546 7278
13339G278k0657n655K653J218m775Q532l0518r385J2219j3286J9738K5721M38
$$ 7278 -13379 -19034 -16381 -15163 -19938 -11406 -41924 -51309 -39090 -52376 -32638 -6917 -6479
13326f479j4311J0011J265j720n741q612J8046K8397L241j7994N644j158J1158
$$ -6479 -20790 -10779 -9514 -11234 -16975 -25587 -7541 20856 24097 6103 11747 10589 21747
13313B1747j5120k2478p466j5087K400J6060J022J7545L1279M12j1664l4314k3584
$$ 21747 6627 -15851 -23317 -38404 -36004 -19944 -18922 -1377 29902 30314 18650 -15664 -39248
13300c9248J157O686L710J7205J9877L1530J2497j6718j924K2791P94O774M1867
$$ -39248 -38091 -31405 -27695 -10490 9387 40917 53414 36696 34772 57563 58357 65131 106998
13287A06998P4183P8149O1036O3764O1252P8434Q6481P5023O7886K6689k4336
$$ 106998 181181 259330 320366 384130 445382 523816 610297 685320 753206 779895 755559
13276G55559p1334n1211q9451q4109p7385q9972r1706p1325m6449O628k8J1273
$$ 755559 684225 633014 543563 459454 382069 292097 200391 129066 82617 89245 89217 100490
13264A00490j3903j6008k8868j8272J7092K1890j2130l0333o251k6386k6822L577
$$ 100490 86587 70579 41711 23439 40531 62421 50291 19958 13707 -12679 -39501 -35924
13252c5924k809j5068J4615l650j1052P222M3761K2495j1190j6562R318J0946
$$ -35924 -38733 -53801 -39186 -42836 -53888 -46666 -2905 19590 8400 -8162 1156 12102
13240A2102k092R299j2971n556Q079J4011j1979j064j7018p110n481J7159N180
$$ 12102 10010 19309 6338 782 8861 22872 10893 9829 -7189 -14299 -19780 -2621 2559
13227B559m954M767K0274K6104l0054k6863O699O383J502k9328o376J2161J8959
$$ 2559 -2395 2372 22646 48750 18696 -8167 -1468 4915 6417 -22911 -29287 -17126 1833
13214A833q248k587J7564M901J5683M910j9654n293r714l073j911n270k2595p753
$$ 1833 -6415 -9002 8562 13463 29146 34056 14402 9109 -605 -3678 -5589 -10859 -33454 -41207
13200d1207o883J9016P426K779j1306j4166J1757J6562j5436N37K5599J8699K3443
$$ -41207 -48090 -29074 -21648 -18869 -30175 -44341 -32584 -16022 -31458 -30921 -5322 13377 36820
13187C6820O4844M4142O8637R2185J33664R4000k6285p7609j24091j26242p5631
$$ 36820 101664 145806 214443 306628 440292 534292 508007 430398 306307 180065 104434
13176A04434k7740o137k5536K167j3149J571J4221J2149j0959K2871K0198J4839
$$ 104434 76694 70557 45021 47188 34039 35610 49831 61980 51021 73892 94090 108929
13164A08929j2958k234q925r995K4031p468j5504o672O936l029j8149q467P232
$$ 108929 95971 93737 84812 74817 98848 91380 75876 69204 76140 73111 54962 46495 53727
13151E3727J2772J0221r985k1290j574J4484L9493M0382N0858N6397J17204K20006
$$ 53727 66499 76720 66735 45445 43871 58355 97848 138230 189088 245485 362689 582695
13139E82695L51371L72476K79159J5740k93546l55588l32823j90205j33496r0946
$$ 582695 934066 1306542 1585701 1601441 1307895 952307 619484 429279 295783 204837
13129B04837m6661j2596j7978k1175k7562j0888j6609k0826m398J4015O977J0452
$$ 204837 158176 145580 127602 106427 78865 67977 51368 30542 26144 40159 47136 57588
13117E7588M435K030K830J5767L9090M0625R373o224J661O880Q160k0564j6319
$$ 57588 62023 64053 66883 82650 121740 162365 171738 165514 167175 174055 182215 161651 145332
13104A45332l982m63K856k4917K429M9442O0861M7468R9701J94910L10718L98737
$$ 145332 141350 140887 143743 118826 121255 170697 231558 279026 378727 573637 884355 1283092
13092A283092L20584R2698k23001m16641l46505k36856j21130p3423m0282l6366
$$ 1283092 1603676 1696374 1473373 1056732 710227 473371 352241 278818 238536 202170
13082B02170l3556m4887k6368j0347o19j9412k5115k2066q021R444j934K420R615
$$ 202170 168614 123727 97359 87012 86393 66981 41866 19800 11779 21223 19289 21709 31324
13069C1324K6486J1299r160N747j445j2853j0244j313J4053l524N254M058j1535
$$ 31324 57810 69109 59949 65696 64251 51398 41154 39841 53894 50370 55624 59682 48147
13056D8147J1487J5212J7562o957K2341L7067O1577Q5862J22244J45691O0486
$$ 48147 59634 74846 92408 85451 107792 144859 206436 292298 414542 560233 620719
13045F20719n3112j29112j45705p6528l4861k0627k1650n1385k8421o094J6227
$$ 620719 567607 438495 292790 216262 181401 160774 139124 87739 59318 53224 69451
13034F9451O195j6615j078K262K7192K6855j8295O210K1744O489k7556m2590q082
$$ 69451 75646 59031 57953 60215 87407 114262 95967 102177 123921 130410 102854 60264 52182
13021E2182R181J7868M304J5715R15j7952k4104O55k896j4306K0658j923K1730
$$ 52182 61363 79231 83535 99250 100165 82213 58109 58764 55868 41562 62220 60297 82027
13008H2027J0670p553K0891R76L447K9292J9176P213j2908l3712R279J1929j141
$$ 82027 92697 85144 106035 107011 110458 139750 158926 166139 153231 119519 128798 140727 139586
12995A39586l960k095k0887j2087J6199P499l737j259O1748O0622K3046Q858l288
$$ 139586 135626 133531 112644 100557 116756 124255 120518 119259 181007 241629 264675 273533 270245
12982B70245N980L0358J6794m3508k7031o282l654k4406k5626m3492n0509j8602
$$ 270245 276225 306583 323377 279869 252838 246556 242902 218496 192870 149378 98869 80267
12970H0267R206J131k5580l4403M389K2495P011O374K917j2360O442L9865J3365
$$ 80267 89473 90604 65024 30621 35010 57505 64516 70890 73807 61447 67889 107754 121119
12957A21119j2888m575m259j1457J0130P88q537k943n842J9734P129K3085J7586
$$ 121119 108231 103656 99397 87940 98070 98858 90321 87378 81536 101270 108399 131484 149070
12944A49070j8251j6033J1816K5797K3775n853L0205l844j6845J9295J4879K7300
$$ 149070 130819 114786 126602 152399 176174 170321 200526 196682 179837 199132 214011 241311
12932B41311L711K328k9887l996O275J6679J3849j6787k948j5130J2213r950n823
$$ 241311 245022 247350 217463 213467 219742 236421 250270 233483 230535 215405 227618 217668 211845
12919B11845j0433j987L3274L1616K1897j7983k4074L6383K8354K747J5639K8111
$$ 211845 201412 199425 232699 264315 286212 268229 244155 280538 308892 311639 327278 355389
12907C55389L4092L8902L6593J4022M8684M2210M3375Q224L4014K5623J050K9030
$$ 355389 389481 428383 464976 478998 527682 569892 613267 621491 655505 681128 682178 711208
12895G11208N4116K4978L0002M4315O0627N4679O0481N4507Q7094O3504N7341
$$ 711208 765324 790302 820304 864619 925246 979925 1040406 1094913 1182007 1245511 1302852
12884A302852J03454J28781J29491J42243J70573K26849K57050L11310M10950
$$ 1302852 1406306 1535087 1664578 1806821 1977394 2204243 2461293 2772603 3183553
12875C183553N26576O29208P09562Q48844R32029J041994J164801J316781J548892
$$ 3183553 3710129 4339337 5048899 5897743 6829772 7871766 9036567 10353348 11902240
12866A1902240J943389K651158L847360N847086R029247J3056718J6268499J8025007
$$ 11902240 13845629 16496787 20344147 26191233 35220480 48277198 64545697 82570704
12858H2570704J8057646J7533670J6173644J2882390O948718j241001q330784
$$ 82570704 100628350 118162020 134335664 147218054 154166772 152925771 144594987
12851A44594987j3315950j5793075j7454852j8208169j7768139j5409922j1758760
$$ 144594987 131279037 115485962 98031110 79822941 62054802 46644880 34886120
12844C4886120q105158n406873l674160k578321j935130j581328j341834j150780
$$ 34886120 26780962 21374089 17699929 15121608 13186478 11605150 10263316 9112536
12836I112536j006970r14789p97996p29568o20092n36894m51312l42410l09860
$$ 9112536 8105566 7190777 6392781 5663213 5043121 4506227 4054915 3712505 3402645
12827C402645k69943k44925k30001k21269j76745j60792j56450j46441j28534
$$ 3402645 3132702 2887777 2657776 2436507 2259762 2098970 1942520 1796079 1667545
12818A667545j15330q9168q0563q4464p0355q4335o9812r4002o2890l6911k7602
$$ 1667545 1552215 1463047 1382484 1298020 1227665 1143330 1073518 979516 916626 879715 852113
12807H52113l5724l3179k4412j3138l0049k3670l1287M80J8527l165l2251l4677
$$ 852113 816389 783210 758798 745660 715611 691941 660654 661134 679661 676496 644245 609568
12795F09568j633l0549p801j7846j5708N61m3384j9678j6249j5591k7055j5504
$$ 609568 607935 577386 569585 551739 536031 536592 493208 473530 457281 441690 414635 399131
12783C99131K140k0245k1875r284j1564k3089k3660l5460R639K4501R980j5134
$$ 399131 401271 381026 359151 349867 338303 315214 291554 256094 265733 290234 300214 285080
12771B85080k8215j9170J2717O569J0321K0415m308j2158M784J1249P877J2214
$$ 285080 256865 237695 250412 256981 267302 287717 283409 271251 276035 287284 295161 307375
12759C07375N862J1725J0740Q508l4210k0888k895j9754k2916L022o458n695q828
$$ 307375 313237 324962 335702 344210 310000 289112 286217 266463 243547 246569 240111 234416 225588
12746B25588p677M664k7680q482q080k363j7236j163o38P280J0787p284J91k105
$$ 225588 217911 222575 194895 186413 178333 175970 158734 157571 156933 164213 175000 167716 167907 165802
12732A65802k7653p045P551m574J1895J2482O823J7352j2921j271O641O206K684
$$ 165802 138149 131104 138655 134081 145976 158458 165281 182633 169712 168441 175082 181288 183972
12719A83972L020L268M371k7414m2208k5614l151r794k8220O371p890j5236n195
$$ 183972 186992 190260 194631 167217 125009 99395 96244 86450 58230 64601 56711 41475 36280
12706C6280j2493k0501j1110K0409J7929o762M0906K1796J596K6283n056J1558
$$ 36280 23787 3286 -7824 12585 30514 23752 64658 86454 88050 114333 109277 120835
12694A20835q46k50K102R778L70o426L5143L6832L829m1540l2372j5357l1158
$$ 120835 119989 119739 121841 131619 131989 125563 160706 197538 201367 159827 127455 112098 80940
12681H0940Q89J3513k0019l0709K99L1868J301P753J0140k4668q981N539Q078
$$ 80940 81829 95342 75323 44614 44913 76781 78082 85835 95975 71307 62326 67865 75943
12668G5943j8199J1406J5420j1920k6313N668J2484J4896K6495K4356k1324l2020
$$ 75943 57744 69150 84570 72650 46337 52005 64489 79385 105880 130236 108912 76892
12656G6892j9657J9381K773j107P05j5843l569N166j510O69N868Q662J5058l2322
$$ 76892 57235 76616 79389 78282 78987 63144 59575 64741 63231 63900 69768 78430 93488 61166
12642F1166k0025J0475N754O854q980j1424R288N592K109p613m64J4706N704k217
$$ 61166 41141 51616 57370 64224 55244 43820 53108 58700 60809 53196 52732 67438 73142 70925
12628G0925P550M092l975m2238k8637l135L9737K9018J1836j532Q250m371R366
$$ 70925 78475 82567 78592 36354 7717 4582 44319 73337 85173 83641 91891 87520 96886
12615I6886j3377j1245K762J4555r880l418j3170j0482p285K072p713k1365Q588
$$ 96886 83509 72264 75026 89581 79701 76283 63113 52631 45346 47418 39705 18340 26928
12602B6928Q431J8883J4901l222j534j9880p790J5117K2606m229k6855j0172j6683
$$ 26928 35359 54242 69143 65921 64387 44507 36717 51834 74440 70211 43356 33184 16501
12589A6501J0412K129J2620k584O205N047j3231j916n505J5095o127p631J0349
$$ 16501 26913 29042 41662 39078 45283 50330 37099 35183 29678 44773 38646 31015 41364
12576D1364k0042l0680K0584K0355L1921n414k6376k1883K8717J0841K981N46
$$ 41364 21322 -9358 11226 31581 63502 58088 31712 9829 38546 49387 52368 52914
12564E2914l702M405j6320n340J2640J364J334K2967k515k3921j4448O606K088
$$ 52914 49212 53617 37297 31957 44597 45961 47295 70262 67747 43826 29378 35984 38072
12551C8072O122L627j1767J6550L114j3358P243K6436J30J1529q700k1435n157
$$ 38072 44194 47821 36054 52604 55718 42360 49603 76039 76169 87698 78998 57563 52406
12538E2406K314L108K0385K8083Q299j6709k0391l4135l2757n493K56K0606O86
$$ 52406 54720 57828 78213 106296 114595 97886 77495 43360 10603 5110 5366 25972 26658
12525B6658J995j0509j1299J7886K7197J3744K1587J5204K7198K1777L1908M105
$$ 26658 28653 18144 6845 24731 51928 65672 87259 102463 129661 151438 183346 187451
12513A87451L049q244k1172n291k0166k0240j7007n668J079J5591O002j6427O524
$$ 187451 190500 182256 161084 155793 135627 115387 98380 92712 93791 109382 115384 98957 105481
12500A05481K995J1719l877j3428n23k8251j4616Q73Q904j2037j3566j2714J181
$$ 105481 108476 120195 116318 102890 102367 74116 59500 60373 69277 57240 43674 30960 32141
12487C2141J5487J2227N110N760k1073k492J3468K4399L4799N0545L1901K3053
$$ 32141 47628 59855 64965 70725 49652 47160 60628 85027 119826 170371 202272 225325
12475B25325j599n993l9653k7243k0416k2927J0606j1101j2773M492J0958l431
$$ 225325 223726 217733 178080 150837 130421 107494 118100 106999 94226 98718 109676 106245
12463A06245j276j476J3428J6469K8247L3135l296j6524l0653K0212j695l025
$$ 106245 104969 103493 116921 133390 161637 194772 191476 174952 144299 164511 162816 159791
12451A59791P768K0220l534k4576O564K5646L6434N9683K8218O7895Q3787M6063
$$ 159791 167559 187779 184245 159669 166233 191879 228313 287996 316214 384109 467896 513959
12439E13959j6083l2964o2540l9039o273qJ8682n476L2898O7891M3637R3250J29748
$$ 513959 497876 464912 402372 363333 357060 357052 375734 370258 403156 471047 514684 607934 737682
12426G37682J21458R0506M5536k6350o4228n9635o7480q4785o4092q8697r5845
$$ 737682 859140 949646 995182 968832 904604 844969 777489 692704 628612 539915 444070
12415D44070q0090n3457l7149m3414l8187r872k933O99j487J1103N4107K1867
$$ 444070 363980 310523 273374 229960 191773 181901 178968 179667 178180 189283 243390 265257
12403B65257k0610j2325k3654o6850m8453J1250j9250j1746k5647k3779m299J5872
$$ 265257 244647 232322 208668 141818 93365 104615 85365 73619 47972 24193 19894 35766
12391C5766Q354J451Q909J610l2992m145J6550j5803j7122p965M076K6517J4157
$$ 35766 44120 45571 54480 56090 23098 18953 35503 19700 2578 -5387 -1311 25206 39363
12378C9363Q901J4958K792k4659o21q42k1440j24M454J23l764R742k987J0625
$$ 39363 48264 63222 66014 41355 40734 39892 18452 18328 22782 22905 19141 28883 25896 36521
12364C6521J8374j4409N0O174L823k4044j6384j0221O145M070j0862J2394R318
$$ 36521 54895 40486 40536 46710 50533 26489 10105 -116 6029 10099 -763 11631 20949
12351B0949j8745j8190K1900J9104J9275L844j3636j9760j8979J3177k379j3821
$$ 20949 2204 -15986 5914 25018 44293 48137 34501 14741 -4238 8939 6560 -7261
12339g261n503j201j3802K051K6764J3616K457j3213j9439j1847K7175Q535J1206
$$ -7261 -12764 -13965 -27767 -25716 1048 14664 17121 3908 -15531 -27378 -203 8332 19538
12326A9538J3189J7753l896r582k3292N634K0205k7500L071o5j6355Q127L882
$$ 19538 32727 50480 46584 37002 13710 19344 39549 12049 15120 15055 -1300 6827 10709
12313A0709J8765Q885q52m677k8743j7778J750o469k719J8142j4543j4006P547
$$ 10709 29474 38359 37507 32830 4087 -13691 -11941 -18410 -21129 -2987 -17530 -31536 -23989
12300b3989J9079J2440K1453j2610r959j7791j8081L307l8P51L9704M910j487
$$ -23989 -4910 7530 28983 16373 6414 -11377 -29458 -26151 -26189 -25438 14266 19176 17689
12287A7689k8774m6277N04L4777M3893k864q855J936K5982K6229j4093j6243j3550
$$ 17689 -11085 -57362 -56858 -22081 21812 18948 10093 12029 38011 64240 50147 33904 20354
12274B0354k713n041j4001j0043j2198P506J4503p494M216Q23j8497L0104N192
$$ 20354 17641 12600 -1401 -11444 -23642 -16136 -1633 -9127 -4911 -4088 -22585 7519 12711
12261A2711l2271P631K2142K2118j197j7787o371Q669k094N693k3085p993q456
$$ 12711 -19560 -11929 10213 32331 31134 13347 6976 15645 13551 19244 -3841 -11834 -20290
12248b0290J7862J2606Q189O338j7974k6273j4509j477J97J9269J0479M425r418
$$ -20290 -2428 10178 18367 24705 6731 -19542 -34051 -35528 -35331 -16062 -5583 -1158 -10576
12235a0576J7760P777J0920q74J8929J3068k3778l603p923p409j5176l632J6618
$$ -10576 7184 14961 25881 25007 43936 57004 33226 29623 21700 14291 -885 -4517 12101
12222A2101J6132p033J7274R06k9850j0381J0631K3990N731j9003K8687k893j8631
$$ 12101 28233 21200 38474 39380 9530 -851 9780 33770 39501 20498 49185 46292 27661
12209B7661j1958k2215K1940K2832l257m722o960L305k7574o552r105o107J1216
$$ 27661 15703 -6512 15428 38260 35003 30281 23321 26626 -948 -7500 -16605 -22712 -11496
12196a1496Q804p847j7128j2856Q452J1598Q017Q478j2431o701M924M156R265
$$ -11496 -2692 -10539 -27667 -40523 -32071 -20473 -12456 -3978 -16409 -23110 -18186 -14030 -4765
12183d765p807q48j0613J5418J6724q941j029j272N432J3292L3790j2057l3383
$$ -4765 -12572 -13420 -24033 -8615 8109 -832 -1861 -3133 2299 15591 49381 37324 3941
12170C941j2069K167Q851k1045k3464Q157K9682M031m609J7497M283p281k7866
$$ 3941 -8128 -5961 2890 -18155 -41619 -33462 -3780 251 -4358 13139 17422 10141 -17725
12157a7725J0785O820j6621o255J9481k438k975O07q233j5769j2275L1210J6804
$$ -17725 -6940 -120 -16741 -22996 -3515 -5953 -8928 -8321 -16554 -32323 -44598 -13388 3416
12144C416j5202J0305q060r703j0324k5107K0191K2303J0612K3303P288m146L633
$$ 3416 -11786 -1481 -9541 -19244 -29568 -54675 -34484 -12181 -1569 21734 29022 24876 28509
12131B8509r391p681m48r335j3417m890j8901J4928q423j0380o477L346P185M335
$$ 28509 19118 11437 10989 1654 -11763 -16653 -35554 -20626 -29049 -39429 -45906 -42560 -35375 -31040
12117c1040K4113o373Q05M358r056L242N403P509P814j5761K5401K4387N806P197
$$ -31040 -6927 -13300 -12495 -8137 -17193 -13951 -8548 -1039 6775 -8986 16415 40802 46608 53805
12103E3805j696k9657l3349k4015j1226R028n774j392K6549O737p493M642r222
$$ 53805 52109 22452 -10897 -34912 -46138 -37110 -42884 -44276 -17727 -10990 -18483 -13841 -23063
12090b3063O998O072k2907l770J2012O270M6299J3998n2934k7447K7168J5116
$$ -23063 -16065 -9993 -32900 -36670 -24658 -18388 27911 41909 -11025 -38472 -11304 3812
12078C812n058M095l321o629j4807j270K471J793J185o384J3293J9521o634k0764
$$ 3812 -1246 2849 -472 -7101 -21908 -23178 -20707 -18914 -17729 -24113 -10820 8701 2067 -18697
12064a8697j7975n383l496J3814J8114N169K2481K875l6338O619m895j9815k232
$$ -18697 -36672 -42055 -45551 -31737 -13623 -8454 14027 16902 -19436 -12817 -17712 -37527 -39759
12051c9759K9779J9707n791j634J5299q192J0570P505q887K517j8333l39J5723
$$ -39759 -9980 9727 3936 2302 17601 9409 19979 27484 18597 21114 2781 2442 18165
12038A8165J2842k9344j8812J5367M436l1091l694R230R430m063j8073M645L4905
$$ 18165 31007 1663 -17149 -1782 2654 -28437 -32131 -22901 -13471 -17534 -35607 -30962 3943
12025C943K032l2953K6330q585m146j9545j922J6152J3907k064q419J6744J6441
$$ 3943 5975 -26978 -648 -9233 -13379 -32924 -34846 -18694 -4787 -6851 -15270 1474 17915
12012A7915O682j1445J5916j6025l7795k87J8122J4665p441j3853l206J9807J3096
$$ 17915 24597 13152 29068 13043 -24752 -25039 -6917 7748 307 -13546 -16752 3055 16151
11999A6151q984l3385k0814L2343P004J6752P437r666k47J223r222J214J802q514
$$ 16151 7167 -26218 -47032 -14689 -7685 9067 16504 6838 6591 7814 -1408 -194 1608 -6906
11985f906O743J3210j6929R018K4017k0468L9J1777R207r334n684J357Q62k3911
$$ -6906 -163 13047 -3882 5136 29153 8685 8724 20501 29708 20374 14690 16047 16909 -7002
11971g002M937O75R226N538j5247k090J9826K1154N822j1294J3626kj8054l737
$$ -7002 -2065 -1390 7836 13374 -1873 -3963 15863 37017 42839 31545 45171 45169 27115 23378
11957B3378l2039k1771J4177j756O724J5219L014M346j7095l9050J133J4689m99
$$ 23378 -8661 -30432 -16255 -18011 -11287 3932 6946 11292 -5803 -44853 -43720 -29031 -29530
11944b9530J6525Q857p171j0041M930K4492J0430q361l861o791P301o156j4334
$$ -29530 -13005 -4148 -11319 -21360 -16430 8062 18492 10131 6270 -521 6780 624 -13710
11931a3710K5780K6877k4366k0873J2035L458n439k180J2645j4894o296O418K2673
$$ -13710 12070 38947 14581 -6292 5743 9201 3762 1582 14227 -667 -6963 -545 22128
11918B2128J1622k402l007Q91j6012p107J0826P292K607j6223p608P903r100J1468
$$ 22128 33750 31348 28341 29232 13220 6113 16939 24231 26838 10615 3007 10910 1810 13278
11904A3278K1563m747j2995p92k7912r198O795q699K0724j0763L250L655j8846
$$ 13278 34841 30094 17099 16307 -11605 -20803 -14008 -22707 -1983 -12746 -9496 -5841 -24687
11891b4687j0493Q980K0180J4397o751j397M673k3674j2554L149J0239Q666Q475
$$ -24687 -35180 -26200 -6020 8377 1626 229 4902 -18772 -31326 -28177 -17938 -9272 -797
11878g97O710J918k3111j7756K1376K6771j7502J0805m952K234O754J046J5512
$$ -797 5913 7831 -15280 -33036 -11660 15111 -2391 8414 3462 5696 12450 13496 29008
11865B9008l858o369o345k0556J3432J8527p967k3715R717l110q520K8543j3447
$$ 29008 25150 18781 12436 -8120 5312 23839 15872 -7843 1874 -1236 -9756 18787 5340
11852E340j7257p498Q61P736j2811j3834Q228J5200J9834Q718P763l461J1429
$$ 5340 -11917 -19415 -18554 -10818 -23629 -37463 -29235 -14035 5799 14517 22280 18819 30248
11839C0248n667k5867j2706J2917j8799J3674J5468J7398j3453j5252K1690P848
$$ 30248 24581 -1286 -13992 -1075 -19874 -6200 9268 26666 13213 -2039 19651 27499
11827B7499k3360q98K6858N483J7138j4784j6421j8008k649O020J8302j9594l5571
$$ 27499 4139 3241 30099 35582 52720 37936 21515 3507 858 6878 25180 5586 -29985
11814b9985j4333k018J0842K8964J8621R840j873N491k3492p703j046j9491m680
$$ -29985 -44318 -46336 -35494 -6530 12091 21931 20058 25549 2057 -5646 -6692 -26183 -30863
11801c0863n582j1404j627K5001K6277J316j7612m464Q041J4892j1120K962J6129
$$ -30863 -36445 -47849 -49476 -24475 1802 3118 -14494 -18958 -10917 3975 -7145 -4183 11946
11788A1946J1632j0093N809J5813J8579j4991k7046j439j1578k3511k4454r878
$$ 11946 23578 13485 19294 35107 53686 38695 11649 10210 -1368 -24879 -49333 -59211
11776e9211K9970L2289j1908P318k0281m230K6204m054P886J4612j2161l228M481
$$ -59211 -29241 3048 -8860 -1542 -21823 -26053 151 -3903 3983 18595 6434 3206 7687
11763G687j8345K141L494j4554j5575J8285J1060K7200Q183j7849m965n470j7663
$$ 7687 -10658 -8517 -5023 -19577 -35152 -16867 -5807 21393 29576 11727 6762 1292 -16371
11750a6371r846K6072J8121j4872k3552k431j9571j2311j1005J6689L6610P279
$$ -16371 -26217 -145 17976 3104 -20448 -22879 -42450 -54761 -65766 -49077 -12467 -5188
11738e188k4517R028Q830j3217l0806j6791r762k08K9224K5883L22j2587P173
$$ -5188 -29705 -20677 -11847 -25064 -55870 -72661 -82423 -82631 -53407 -27524 -27202 -39789 -32616
11725c2616J4611L455J2717q735k1281R117R150K359L122O062m589j7060J3724
$$ -32616 -18005 -14550 -1833 -10568 -31849 -22732 -13582 -11223 -8101 -2039 -6628 -23688 -9964
11712i964m922j0062L707j0933J3398O428j9595o878J54N765R964P74j582j4742
$$ -9964 -14886 -24948 -21241 -32174 -18776 -12348 -31943 -38821 -38667 -32902 -22938 -22164 -23746 -38488
11698c8488P406K1714K3586o506k8601m602K889k033J651q091J833j0819K2739
$$ -38488 -31082 -9368 14218 7712 -20889 -25491 -22602 -24635 -22984 -31075 -29242 -40061 -17322
11685a7322J3491M078Q602k6332j0952J714J9419J939N360p309j4843p288J5764
$$ -17322 -3831 247 8849 -17483 -28435 -26721 -7302 -5363 -3 -7312 -22155 -29443 -13679
11672a3679j113R499k3792k1141J6611K2095J4073k425J1143n141n936j5210o462
$$ -13679 -14792 -5293 -29085 -50226 -33615 -11520 2553 128 11271 6130 194 -15016 -21478
11659b1478J078O035m04l3042R001M093J2690J5473J2721K0403L766l646k0514
$$ -21478 -20400 -14365 -14769 -47811 -38810 -34717 -22027 -6554 6167 26570 30336 26690 6176
11646F176pJ9554k4569j3991n611J1400N909K594q625K543l6255R721N835L759
$$ 6176 6169 25723 1154 -12837 -18448 -7048 -1139 1455 -7170 -4627 -40882 -31161 -25326 -21567
11632b1567J5717p612M816K1124L365k944l0855k3599J8605O448q392O037K8696
$$ -21567 -5850 -13462 -8646 12478 15843 12899 -17956 -41555 -22950 -16502 -24894 -18857 9839
11619I839J739o22q217m146L969l174k1990q691L8256J2923l4015j7436J6008
$$ 9839 11578 10956 2739 -1407 2562 -612 -22602 -31293 6963 19886 -14129 -31565 -15557
11606a5557L00J4988O648J2767p668J321J0988k3174j1053L761l167j2079J6K443
$$ -15557 -15257 -269 6379 19146 11478 12799 23787 613 -10440 -6679 -9846 -21925 -21909 -19466
11592a9466j2167J3521Q834n268j4765J549j7857M969L1491K2356P43l776P209
$$ -19466 -31633 -18112 -9278 -14546 -29311 -27762 -45619 -40650 -9159 13197 13940 10164 17373
11579A7373j2123K1043o821J374j265p371P377j3604r106l0786p601M237m18j1923
$$ 17373 5250 26293 19472 20846 19581 12210 19587 5983 -3123 -33909 -41510 -37273 -37691 -49614
11565d9614O261K1519L6345K5794k7991j9719M325m840j0367J3876r12j4555o294
$$ -49614 -43353 -21834 14511 40305 12314 -7405 -3080 -7920 -18287 -4411 -5323 -19878 -26172
11552b6172J4657J5474r671k2812o815O435J2642P431K8502j4568k7771K867J5813
$$ -26172 -11515 3959 -5712 -28524 -35339 -28904 -16262 -8831 19671 5103 -22668 -19801 -3988
11539c988q137K993J8835J2576M872k3275k3155J0318K3016j2351J432j0790j3450
$$ -3988 -12125 -9132 9703 22279 27151 3876 -19279 -8961 14055 1704 3136 -7654 -21104
11526b1104j754J3612J8730j9764j1787J9318L112l372q582k701J5043L0029N229
$$ -21104 -22858 -9246 9484 -10280 -22067 -2749 363 -3009 -11591 -14292 751 30780 36009
11513C6009k3399p052P633q348k7959j577j2758N756K0105J2551j7017O80l42
$$ 36009 12610 5558 13191 4843 -23116 -24693 -37451 -31695 -11590 961 -16056 -15376 -15718
11500a5718k561P361K130J2260K4102j4621m8295k2703K7703q178k9825O799L3708
$$ -15718 -18279 -10918 -8788 3472 27574 12953 -35342 -58045 -30342 -38520 -68345 -61546 -27838
11487b7838J74J1749J6161J1479J2315M067j6351j3967j372n886O339J2757P678
$$ -27838 -27664 -15915 246 11725 24040 28107 11756 -2211 -3583 -9469 -3130 9627 17305
11474A7305R734K0086k4764l1885J0136j7056r174j2524J112J9536J5066J6059
$$ 17305 27039 47125 22361 -9524 612 -16444 -25618 -38142 -37030 -17494 -2428 13631
11462A3631j6086j8980K6170n895q035j0458Q275P745J5429K8398Q626k7237j9709
$$ 13631 -2455 -21435 4735 -1160 -9195 -19653 -11378 -3633 11796 40194 48820 21583 1874
11449A874j1110p950J965M247K4930j9400o517K2149K3510p954R555j1275j8203
$$ 1874 -9236 -17186 -15221 -10974 13956 -5444 -11961 10188 33698 25744 35299 24024 5821
11436E821j4515j1896J1207Q013K16R156j0054j5745l823l902j95K0894L8434
$$ 5821 -8694 -20590 -9383 -1370 -1154 8002 -2052 -17797 -21620 -25522 -25717 -4823 33611
11423C3611P301p182k230O428j2165k3704k7067r798J5433L214j2268K1791K3342
$$ 33611 40912 33730 31500 37928 25763 2059 -25008 -34806 -19373 -16159 -28427 -6636 16706
11410A6706J8003j6468p898k0834j8002J1925J2540J5801j04l008r618q393r160
$$ 16706 34709 18241 10343 -10491 -28493 -16568 -4028 11773 11669 8661 -957 -9350 -18510
11397a8510m616J0736o932n835N128J8968r517j9720K0826J8847Q00p50P435k1265
$$ -18510 -23126 -12390 -19322 -25157 -20029 -1061 -10578 -30298 -9472 9375 10175 9425 16860 -4405
11383d405j5729j2053k647K738J5052K978j3150k38L1814k2693q715J6125n379
$$ -4405 -20134 -32187 -34834 -32096 -17044 -14066 -27216 -27454 4360 -18333 -27048 -10923 -16302
11370a6302P819j8899j0538k3108P362K7155Q053L509m774L342J4050K2479R956
$$ -16302 -8483 -27382 -37920 -61028 -53666 -26511 -18458 -14949 -19723 -16381 -2331 20148 30104
11357C0104j0293k3310j5275O716O871j4518N305J0900p679j4144K777J8398K2903
$$ 30104 19811 -3499 -18774 -12058 -5187 -19705 -14400 -3500 -11179 -25323 -22546 -4148 18755
11344A8755J865j189j2415k559M691r565O539P186k0924O700n778K2830p424M816
$$ 18755 20620 19431 7016 4457 9148 -417 6122 13308 -7616 -916 -6694 16136 8712 13528
11330A3528j6565k6026K2241K3547p881k8875J6604P095J0710P720n15j328j0335
$$ 13528 -3037 -29063 -6822 16725 8844 -20031 -3427 3668 14378 22098 21583 20255 9920
11317I920k0985P711K2205J8406n621k6183j4553K2250J5916N234l2243j720J7598
$$ 9920 -11065 -3354 18851 37257 31636 5453 -9100 13150 29066 34300 2057 337 17935
11304A7935j3816l014p784j8613j8976J1760P833J1710K6978J0622p721J3442
$$ 17935 4119 1105 -6679 -25292 -44268 -32508 -24675 -12965 14013 24635 16914 30356
11292C0356L8617k426k5074O658N088J197j6993k6047j0330k6461N659M3213N837
$$ 30356 68973 66547 41473 48131 53219 54416 37423 11376 1046 -25415 -19756 23457 29294
11279B9294j586O007q14p198J7622Q443m004j6929j2066J899j1213j0899j1218
$$ 29294 27708 33715 32901 25703 43325 51768 47764 30835 18769 20668 9455 -1444 -12662
11266a2662J7384K0306q718l179L3031N2771j063K2265K0579M158k4876j1119
$$ -12662 4722 25028 16310 13131 46162 98933 97870 120135 140714 144872 119996 108877
11254A08877j7623j187M899k5695p836l8056J456J6235j8534N65r863K19m657
$$ 108877 91254 90067 94966 69271 61435 23379 24835 41070 22536 23101 13238 13457 8800
11241H800J4697M118L331k130r320j2037Q121P975M539m1j1696M459O779k778
$$ 8800 23497 27615 30946 28816 19496 7459 15580 23555 28094 28053 16357 20816 27595 24817
11227B4817o070J3169K2995r38m364J2887O07j1236R16R650P295j4055O421J555
$$ 24817 18747 31916 54911 53973 49609 62496 63103 51867 52783 62433 69728 55673 62094 63649
11213F3649K361J3669N898k9740L460L3957K420j2617k6686M655q814k592m850
$$ 63649 66010 79679 85577 55837 59297 93254 95674 83057 56371 61026 52212 49620 44770
11200D4770k0284J1842p928J0978P464j5307j6702j4090J3635J9306L960j9296
$$ 44770 24486 36328 28400 39378 46842 31535 14833 743 14378 33684 37644 18348
11188A8348j0721P585N548P586O483j7856j7363Q932N472l708r711r134n143k1962
$$ 18348 7627 15212 20760 28346 34829 16973 -390 8542 14014 10306 595 -8539 -13682 -35644
11174c5644p671L2960K9941r608K0255K4576J025j7886k8564J054k418j8826J6188
$$ -35644 -43315 -10355 19586 9978 30233 54809 55834 37948 9384 10438 8020 -10806 5382
11161E382O628J151K5692n825J2871K438n774j8475q578O109k725O777Q008n865
$$ 5382 12010 13161 38853 33028 45899 48337 42563 24088 15510 21619 18894 25671 33679 27814
11147B7814k9659j1897L414J5272J0185J839j561r235R030P203j1214m177o378
$$ 27814 -1845 -13742 -10328 4944 15129 16968 15407 6172 15202 22405 11191 7014 636
11134F36K688P813K479J3077L65n0198j3172K9227M909l816J1501q429k4984j031
$$ 636 3324 11137 13616 26693 27058 -23140 -36312 -7085 -2176 -5992 5509 -2920 -27904 -28935
11120b8935K6601J2010N071J6366k608j7962n395L410K4585r33j7252l0702J9353
$$ -28935 -2334 9676 14747 31113 28505 10543 5148 8558 33143 32210 14958 -15744 3609
11107C609l456N225J2415K3727N02o680j0281L012j3257K3491l645r544j6809
$$ 3609 153 5378 17793 41520 42022 35342 25061 28073 14816 38307 34662 25118 8309
11094H309k2297j332k2684R113L0659J0000J3253j5223J0206K041k717L823k457
$$ 8309 -13988 -15320 -38004 -28891 1768 11768 25021 9798 20004 22045 19328 23151 20694
11081B0694K3408K607p771k2858o571n407J3349K187O021J0091l7333j8448R3
$$ 20694 44102 46709 38938 16080 9509 4102 17451 19638 25659 35750 -1583 -20031 -19938
11068a9938J5989K1382K7462j7409j2965k0374K0030p411q116M766P196N679R333
$$ -19938 -3949 17433 44895 27486 14521 -5853 14177 6766 -1350 3416 10612 16291 25624
11055B5624j0799j1736m41Q016q204m966q947n045K4841K5750k1703p926J9803
$$ 25624 14825 3089 2648 10664 2460 -2506 -11453 -16498 8343 34093 12390 4464 24267
11042B4267P795k1318j6688j7752J447K7478p49K063j917J4981J8692k267l5061
$$ 24267 32062 10744 -5944 -23696 -22249 5229 4480 6543 4626 19607 38299 36032 971
11029I71J3300N330j7159J4914o435j1940k81M748J9346L825o252K034j7394j1854
$$ 971 14271 19601 2442 17356 10921 -1019 -1300 3448 22794 26619 20367 22401 5007 -6847
11015f847R021J7045K051j1654l0016J2410J6050J30p949J4713Q479j2839j3687
$$ -6847 2174 19219 21270 9616 -20400 -7990 8060 8190 241 14954 23433 10594 -3093
11002c093Q857Q04J2900k007N646j66M60M82K116j0199o964R727P08j5542o142
$$ -3093 5764 6568 19468 17461 23107 22941 23401 23883 25999 15800 8836 18563 19271 3729 -2413
10987b413L3117j1269j8108L0978M069J093L21j5033j7606q890J6843J2908j4622
$$ -2413 30704 19435 1327 32305 36374 37467 37788 22755 5149 -3741 13102 26010 11388
10974A1388L036j5466p563J3333j0404J166L6325M408k155o734R207J8867J8921
$$ 11388 14424 -1042 -8605 4728 -5676 -4510 31815 36223 34068 27334 36541 55408 74329
10961G4329r466j0970l1631L877j8830n0426K752J3739J979Q165K3918J1513j5530
$$ 74329 64863 53893 22262 26139 7309 -43117 -40365 -26626 -24647 -16482 7436 18949 3419
10948C419m469K5036R863K0072J4185j3891k2767q278J1174J257K3579J0985o917
$$ 3419 -1050 23986 33849 53921 68106 54215 31448 23170 34344 35601 59180 70165 63248
10935F3248j7910l2819j1843J0726K4911K1549r844k9628j8714l8027R046L8709
$$ 63248 45338 12519 676 11402 36313 57862 48018 18390 -324 -38351 -29305 9404
10923I404j135j0945m673J7692K1584j4303q855K528Q02K629l259r072k1512N365
$$ 9404 8269 -2676 -7349 10343 31927 17624 8769 11297 12099 14728 11469 2397 -19115 -13750
10909a3750P764j0245k887J3151j1149j2746R407Q86K0100k47O492K4475O112
$$ -13750 -5986 -16231 -19118 -5967 -17116 -29862 -20455 -19569 531 284 6776 31251 37363
10896C7363J288j307j0636J3070l663j1505J1593K491l971k0004J1648M053k420
$$ 37363 38651 37344 26708 39778 36115 24610 36203 38694 34723 14719 26367 30420 28000
10883B8000l929j2072J4625K2042J4857j6612l6742p498K316q779J3161J4509
$$ 28000 24071 11999 26624 48666 63523 46911 10169 2671 4987 -3792 9369 23878
10871B3878k2566R734R985M718r34J0352L406Q673R014k3474l008J4308J6544
$$ 23878 1312 11046 21031 25749 24815 35167 38573 47246 56260 32786 29778 44086 60630
10858F0630p779k0161M745r26k643j3657p377j5366L6335j0888l2446J7955K9983
$$ 60630 52851 32690 37435 36509 33866 20209 12832 -2534 33801 22913 -9533 8422 38405
10845C8405O444J8777J9098l903l3415l0614n319K014N074J17r765j1569L525
$$ 38405 44849 63626 82724 78821 45406 14792 9473 11487 16561 16678 6913 -4656 -1131
10832a131L2138J0237P888N641Q375k287k022k089R455k4445l1712p046J757P452
$$ -1131 31007 41244 49132 54773 63148 60861 58839 56750 66205 41760 10048 3002 4759 12211
10818A2211K931j4842J5437O517j0581J525L5405L4464K3617j8401l3495j765
$$ 12211 15142 300 15737 22254 11673 13198 48603 83067 106684 88283 54788 53023
10806E3023K5233j729M115j3104j7321p626J1668K1930L31r71L81j2821n109J3593
$$ 53023 78256 76527 80642 67538 50217 42591 54259 76189 76520 75549 75930 63109 58000 71593
10792G1593p408P921j0476j4275m699j2527K961K8773J4713l275k9404m029k3027
$$ 71593 64185 72106 61630 47355 42656 30129 33090 61863 76576 73301 43897 39868 16841
10779A6841j0230M618p150j6385L034q404l139K2488K6111j753k9259n874O729
$$ 16841 6611 11229 4079 -12306 -9272 -17676 -20815 1673 27784 26031 -3228 -9102 -2373
10766b373J7659J2651p80o125j5072K6774j2391J7209L1485o732j8439j7304l433
$$ -2373 15286 27937 27157 21032 5960 32734 20343 37552 69037 62305 43866 26562 23129
10753B3129J0567P665K2227j1686J5534J1608J319J0122n064o43N279r472J6477
$$ 23129 33696 41361 63588 51902 67436 79044 80363 90485 85421 84778 90057 80585 97062
10740I7062P219J0158L1723J3437L944M454O1827O4056O8785R8744K07702L61228
$$ 97062 104281 114439 146162 159599 163543 167997 229824 293880 362665 461409 669111 1030339
10728A030339N83932O23805K21883l73432o21563m67985k99226k12629j16844
$$ 1030339 1614271 2238076 2459959 2086527 1464964 996979 697753 485124 368280
10719C68280p4664p4915l7002k3756l872r715j8011j8181Q52r370M510k0992M260
$$ 368280 293616 218701 181699 157943 154071 144356 126345 108164 109016 99646 104156 83164 87424
10706H7424K3450r306m212k3866j4951K99l498J7000m762j7058m975J0882J7712
$$ 87424 110874 101568 97356 73490 58539 58838 55340 72340 67578 50520 45545 56427 74139
10693G4139J2970o019m159L72L842q961O020j3363m420j5260j6106O407pl316
$$ 74139 87109 81090 76931 77303 81145 72184 78204 64841 60421 45161 29055 35462 35455 32139
10679C2139j4352L88J8855m751J567O321M652r699j7972j646K2193K3123J8076
$$ 32139 17787 18175 37030 32279 33846 40167 44819 35120 17148 15502 37695 60818 78894
10666G8894k8483j4448k951j4270P851j4136k1532J8423J7134J4796r234K695
$$ 78894 50411 35963 33012 18742 26593 12457 -9075 9348 26482 41278 32044 34739
10654C4739K0943O235L244k4002m1774K4573K7539j0824K1191N490k683J1972
$$ 34739 55682 61917 65161 41159 -615 23958 51497 40673 61864 67354 64671 76643
10642G6643n847j5614J775J0213j8857p365m818j5652r482J115J8647J9944P053
$$ 76643 70796 55182 56957 67170 48313 40948 36130 20478 10996 12111 30758 50702 57755
10629E7755J3320K9751K2107j2795k2526J2949q684m825j1327j2866j1259k0598
$$ 57755 71075 100826 122933 110138 87612 100561 91877 87052 75725 62859 51600 31002
10617C1002j0607j4279n142J8116R614K4594J1393K579j0990j3608K0469j1184
$$ 31002 20395 6116 974 19090 28704 53298 64691 67270 56280 42672 63141 51957
10605E1957j4429j0535j516J7789K2302K1034k4924M218K3269J4769R637k372
$$ 51957 37528 26993 25477 43266 65568 86602 61678 65896 89165 103934 113571 111199
10593A11199j7050j5599J3035j543k4019L670n308M215k788j1276J695K2430J196
$$ 111199 94149 78550 91585 90042 66023 69693 64385 68600 65812 54536 56231 78661 79857
10580G9857K7077K0924M0186O0898Q8487N3127K8724k3359o9981q8481o2119l7162
$$ 79857 106934 127858 168044 228942 317429 370556 399280 375921 305940 217459 155340 118178
10568A18178j3824k445Q25q010k000j4131p761Q015Q350m770j1315M660Q492j1618
$$ 118178 104354 101909 102734 94724 92724 78593 70832 78847 87197 82427 71112 75772 84264 72646
10554G2646J4167m876j4821j3002r315j7137J4594J5844j0656K3K8133J7905J2554
$$ 72646 86813 81937 67116 54114 44799 27662 42256 58100 47444 47467 75600 93505 106059
10541A06059K2765j8042Q384O445m178j69J40N08o266o325L33j7847l7982k5086
$$ 106059 128824 110782 119166 125611 121433 121264 121404 121912 115646 109321 109654 91807 53825 28739
10527B8739m665J0578J0244N93l398N887J1779k3521l629P150J1928J5739P980
$$ 28739 24074 34652 44896 45489 42091 47978 59757 36236 32607 39757 51685 67424 75404
10514G5404j715P631J0662m569r22m310L4197M5007J4538J307j3132k915O341
$$ 75404 73689 81320 91982 87413 86491 82181 116378 161385 175923 177230 164098 161183 167524
10501A67524q410p576J030n17j2164j0920j9347r548k2237j733M1338N5232J2522
$$ 167524 159114 151538 152568 152051 139887 128967 109620 100072 77835 76102 117440 172672 185194
10488A85194l796k7818k5936j4586M848Q401j6784K2217j7536l0707j7664n390
$$ 185194 181398 153580 127644 113058 117906 126307 109523 131740 114204 83497 65833 60443
10476F0443K0828M5932P6476Q9937N8091J5894l2617m4878m0633j7203m90p791
$$ 60443 81271 127203 203679 293616 351707 367601 334984 290106 249473 232270 231780 223989
10464B23989Q761J4609J513P024q1k607N429j4746n232M3730N6990N7089Q0120
$$ 223989 232750 247359 248872 255896 255815 253208 258637 243891 238659 282389 339379 396468 476588
10451D76588J49591K34774K64156K02287q108k27984k96520k07404p8053j6457
$$ 476588 626179 860953 1125109 1327396 1319288 1091304 794784 587380 509327 492870
10441D92870l6384m6776o4459p3506k1681k2078j1694N0887K7138l299J938j8533
$$ 492870 456486 409710 345251 271745 250064 227986 216292 267179 294317 291018 292956 274423
10429B74423k2619j4995n80M534K1585n7j2293k181L1316L3326N017M419J1353
$$ 274423 251804 236809 236229 240763 262348 262291 249998 247817 279133 312459 317476 321895 333248
10416C33248J3003J1659q812K9100P220k0338o582q400K4379O0310M3570N1638
$$ 333248 346251 357910 349098 378198 385418 365080 358498 350098 374477 434787 478357 529995
10404E29995O4603M5660M2082K3207O4182J07386J64311J88596K79042M07221
$$ 529995 594598 640258 682340 705547 769729 877115 1041426 1230022 1509064 1916285
10394A916285O37919J074268J827036K741049K511501M28445j490762j887346
$$ 1916285 2554204 3628472 5455508 8196557 10708058 11136503 9645741 7758395
10386G758395j560583j400072j202070q54708n53772l62814k82479k18898j35151
$$ 7758395 6197812 4797740 3595670 2740962 2187190 1824376 1541897 1322999 1187848
10377A187848n2270k9689k847K3902M7902M5261N6146K9481O5466J01981J82509
$$ 1187848 1135578 1105889 1103042 1126944 1174846 1220107 1276253 1305734 1371200 1473181 1655690
10366A655690K70938L62917M79426M24686N5577l10046m22795l06952j70287k9999
$$ 1655690 1926628 2289545 2768971 3193657 3249234 2939188 2516393 2209441 2039154 2009155
10356B009155J9300O269K1093L3984O3866R8797J59349J95450K73373L63361N67095
$$ 2009155 2028455 2034724 2055817 2089801 2153667 2252464 2411813 2607263 2880636 3243997 3811092
10345C811092R30104J247662R71844L84413Q5385K54584O32363Q10009O52279
$$ 3811092 4741196 5988858 6960702 7345115 7430500 7685084 8317447 9127456 9779735
10336I779735O04033R42228J546897K260130L000194L533487M150250N465576
$$ 9779735 10383768 11325996 12872893 15133023 18133217 21666704 25816954 31282530
10328C1282530Q025951J2629820K0967725L6641730O5362973J08735541J25302661
$$ 31282530 39308481 51938301 72906026 109547756 174910729 283646270 408948931
10321D08948931M5852862o7269554j16529152r7575559o0265834l4540783k0575127
$$ 408948931 454801793 387532239 271003087 173427528 113161694 78620911 58045784
10314E8045784j3140543q992697o584900n029842l759239k734192k100845j851173
$$ 58045784 44905241 35912544 29327644 24297802 20538563 17804371 15703526 13852353
10306A3852353j661242j400882j062905p74514n83581k89331M8737K81902J55362
$$ 13852353 12191111 10790229 9727324 8952810 8369229 8079898 8128635 8410537 8565899
10297H565899m64124r86559j016194p90589n82223m60545l61850l25454k78697
$$ 8565899 8101775 7115216 6099022 5308433 4726210 4265665 3903815 3578361 3299664
10288C299664k29703j87167j29053j12983j18612j26799j58852j70185j17237
$$ 3299664 3069961 2882794 2753741 2640758 2522146 2395347 2236495 2066310 1949073
10279A949073r2227r4415j21859q4061o3028l3078m2667n5805k5012J0966K1281
$$ 1949073 1856846 1762431 1640572 1556511 1493483 1460405 1417738 1361933 1336921 1347887 1369168
10268A369168J5561m719r573m2846o0507m1721n3786m3862n4403k8282j4664j2776
$$ 1369168 1384729 1380010 1370437 1327591 1267084 1225363 1171577 1127715 1073312 1045030 1030366 1017590
10256A017590l5746m5079l6616m4043j3836K409k583k1335l1776k8837J417J5294
$$ 1017590 981844 936765 900149 856106 842270 844679 842096 820761 788985 760148 761565 776859
10244G76859J5718r56j2904k6092j9397k8118l9Q022k6244j1954N374m400K972
$$ 776859 792577 791621 778717 752625 733228 705110 705071 713093 686849 674895 680269 675869 678841
10231F78841L303q918l3665l3544k4114j281P589L0599K7716R298k7423l0226
$$ 678841 682144 673226 639561 606017 581903 580622 588211 618810 646526 655824 628401 598175
10219E98175r86j1060j4100O343J941l84k0359k9665k5788k1190J019K8214L7668
$$ 598175 597189 586129 572029 578372 580313 579929 559570 529905 504117 482927 483946 512160 549828
10206E49828L059j4794k5352k4819K4844K8586K3519K1521J8071j189n8559n5029
$$ 549828 552887 538093 512741 487922 512766 541352 564871 586392 604463 603274 544715 489686
10194D89686l9843n9923m7270K680J0988K7246L3771J1986j1461j1322j826j8787
$$ 489686 449843 389920 342650 345330 356318 383564 417335 429321 417860 406538 404712 385925
10182C85925J0529K0764j570j7288k8356j3216P233J4020r605l8473o6011n0233
$$ 385925 396454 417218 415648 398360 370004 356788 364021 378041 368436 329963 263952 213719
10170B13719p12P1939J01612N1456J9421K6694J529M960l4948k8772j9686J2124
$$ 213719 213007 284946 386558 438014 457435 484129 485658 490618 455670 426898 407212 419336
10158D19336j4242q342M456j7465k2318l0330J2568L6515P467j1666k0252j2164
$$ 419336 405094 396752 401208 383743 361425 331095 343663 380178 387645 375979 355727 343563
10146C43563L5229M373Q496j0203k831r218q936K6462K6469R646m051M20J4583
$$ 343563 378792 383165 391661 381458 378627 369409 360473 386935 413404 423050 418999 419419 434002
10133D34002j4640R868j7668o79M285J7285J1298K3193J1978m454j4388j7094
$$ 434002 419362 429230 411562 410883 415168 432453 443751 466944 478922 474468 460080 442986
10121D42986k8329l096P983J4055j4969J893L8059j8489k016k4900m646K257q805
$$ 442986 414657 411561 419544 433599 418630 420523 458582 440093 438077 413177 408531 410788 401983
10108D01983k3920k5588J230j5739K697L9270K6854O411o829j008l673J1528j7856
$$ 401983 378063 352475 353705 337966 340663 379933 406787 413198 406369 405361 401688 413216 395360
10095C95360j5475L406M535M493j3047j1350J4485J0061N67j31J8006L1079r125
$$ 395360 379885 383291 387826 392319 379272 367922 382407 392468 393035 392904 410910 441989 432864
10082D32864N90P875N585j6692n43M739m094K4330N872J9783k62M964j9106Q385
$$ 432864 433454 441329 446914 430222 429679 434418 430324 454654 460526 480309 480047 485011 465905 474290
10068D74290P265M929k743r242Q989K9014K180j4963k3810l7310N752J0055J2840
$$ 474290 481555 486484 483741 474499 483488 512502 514682 499719 475909 438599 444351 454406 467246
10055D67246J2741j3977n775J9558O39o862J573P198K469j9873j199K1759J1002
$$ 467246 479987 466010 460235 479793 480432 473570 475143 482341 484810 464937 463738 485497 496499
10042D96499Q233J7482K0973L2436N8733R8617J81299L31567O18776N94394j44753
$$ 496499 504732 522214 543187 575623 634356 732973 914272 1245839 1864615 2459009 2314256
10031B314256n82654n31183k85289j29630r1991l6638k8297l1443j7262k2804
$$ 2314256 1731602 1200419 915130 785500 693509 656871 628574 597131 579869 557065
10021E57065k1784l6827j1239q845j5159m010Q758L0623K5921J5574l18l0048
$$ 557065 535281 498454 487215 478370 463211 459201 467959 498582 524503 540077 539759 509711
10009E09711p294j0491k391K1918K5241j1491q710j9309k6370k859k276m186M260
$$ 509711 502417 491926 489535 511453 536694 525203 516493 497184 470814 467955 465679 461493 465753
9996D65753L9720K4294l313r421R503M498k1466K2041q88R044N137l9211J1047
$$ 465753 505473 529767 526454 517033 526536 531034 509568 531609 530721 539765 544902 505691 516738
9983E16738M913J3045M3028J7618N761j2377k8539p148K712J3744J3911j2649
$$ 516738 521651 534696 577724 595342 601103 588726 560187 553039 555751 569495 583406 570757
9971E70757K921j3501J4360J3014o3j1231J9376J7860K8491J1559K457j9541j1300
$$ 570757 573678 560177 574537 587551 587488 576257 595633 613493 641984 653543 656000 636459 625159
9958F25159j4010j7647K0881K1062M8643L5789J4822j8229n5283j9314M004l4014
$$ 625159 611149 593502 614383 635445 684088 719877 734699 716470 661187 641873 645877 611863
9946F11863J0193J3225q585r017N471K4829J8363j7957j894M34j243L0230K400
$$ 611863 622056 635281 626696 617679 623150 647979 666342 648385 646491 646925 645682 675912 678312
9933F78312Q32J2687L300m554k4702q576L4804L3613K8629p936m192J3464N888
$$ 678312 679144 691831 695131 690577 665875 657299 692103 725716 754345 746409 742217 755681 761569
9920G61569K2739K5002L8595O4577Q7542J39401K66519M63971O21094N30434n204
$$ 761569 784308 809310 847905 912482 1000024 1139425 1405944 1869915 2491009 3021443 3016239
9909C016239m87769n95604m31916k81494j52286p7177m3526n3208k1844j3967
$$ 3016239 2528470 1932866 1500950 1219456 1067170 989993 946467 893259 871415 857448
9899H57448j1417Q903K110l4285k167K3317j304j3807J2959n38o703Q854R585
$$ 857448 846031 854934 857044 822759 820592 843909 842605 828798 841757 841219 834516 843370 852955
9886H52955J1128L4254O0335R2076J35651J00751j1263p6658p6761n1096q4815
$$ 852955 864083 898337 958672 1050748 1186399 1287150 1275887 1199229 1122468 1071372 986557
9875I86557o2408k2279R219R035J3599J1869L1534L6454J30562J33890K7172m0286
$$ 986557 924149 901870 911089 920124 933723 945592 977126 1013580 1144142 1278032 1305204 1264918
9863A264918q6287r9384r0379m8998l0907J0371k499J6054N950J0989L496J7124
$$ 1264918 1178631 1079247 988868 939870 908963 919334 916835 932889 938839 949828 953324 970448
9851I70448K9392J7141K4854K2914l166j2281K178K4297L5130L7481K5020P1542
$$ 970448 999840 1016981 1041835 1064749 1061583 1049302 1051480 1075777 1110907 1148388 1173408 1244950
9839A244950O8065Q2656J21962K06728L75961O79984J215891J936897K016369
$$ 1244950 1313015 1395671 1517633 1724361 2100322 2780306 3996197 5933094 7949463
9830G949463P73762j019420j969701j745568j111269o03239l44372j96049j34960
$$ 7949463 8723225 7703805 5734104 3988536 2877267 2274028 1929656 1733607 1598647
9821A598647j00116o3050m9256l1385J0574P620k3254l6101l6439r852n18K7371
$$ 1598647 1498531 1435481 1386225 1354840 1365414 1373034 1349780 1313679 1277240 1267388 1266870 1294241
9809A294241M0646L038j2904j7834l4805j0638K5281N565p403p085j818J732J6263
$$ 1294241 1334887 1337925 1325021 1307187 1272382 1261744 1287025 1292590 1285187 1278102 1276284 1278016 1294279
9796A294279J3839J6835J6978J6588q772r040N905O312J361k726R668M540J3822
$$ 1294279 1308118 1324953 1341931 1358519 1349747 1340707 1346612 1352924 1354285 1351559 1361227 1365767 1379589
9783A379589L4708P444l463R067J8110K0798J5294l312k22k756R749M243J1230
$$ 1379589 1414297 1421741 1418278 1427345 1445455 1466253 1481547 1478235 1478013 1475257 1485006 1489249 1500479
9770A500479J8488J4824K8960J3621J065j3743K0877L1554J2930o268R836R336
$$ 1500479 1518967 1533791 1562751 1576372 1577437 1563694 1584571 1616125 1629055 1622787 1632623 1641959
9758A641959O789R858L4073L6319q632j199J8490O815K216L7606K4219J5236K0293
$$ 1641959 1648748 1658606 1692679 1728998 1720366 1719167 1737657 1744472 1746688 1784294 1808513 1823749 1844042
9745A844042K8352N562J0050J0844K0966P022R230M2254o742k344J7692L1209
$$ 1844042 1872394 1877956 1888006 1898850 1919816 1926838 1936068 1978322 1971580 1969236 1986928 2018137
9733B018137M0882M2992L9022M0624M1276M8183M2990N988k3795n4296J4765K4234
$$ 2018137 2059019 2102011 2141033 2181657 2222933 2271116 2314106 2320094 2296299 2242003 2256768 2281002
9721B281002Q456L0449J4328J234J2736j0219L318J0456K3403M6208L6230K3560
$$ 2281002 2289458 2319907 2334235 2335469 2348205 2337986 2341304 2351760 2375163 2421371 2457601 2481161
9709B481161L0146K5943K8417n651P19L1780L3895L0399K1167o153R225L3438
$$ 2481161 2511307 2537250 2565667 2560016 2560735 2592515 2626410 2656809 2677976 2671823 2681048 2714486
9697B714486M9642N0917L9978O781K2946P833L2268K0295N036L6148R571L2888
$$ 2714486 2764128 2815045 2855023 2861804 2884750 2892583 2924851 2945146 2950182 2986330 2995901 3028789
9685C028789M1661N8774L7903J6293K7111J6665K4320K4687M0788K8642K8452
$$ 3028789 3070450 3129224 3167127 3183420 3210531 3227196 3251516 3276203 3316991 3345633 3374085
9674C374085N5640N6596J0530K1684K8853M7523K4377K2132P9302O2523N2673
$$ 3374085 3429725 3486321 3496851 3518535 3547388 3594911 3619288 3641420 3720722 3783245 3835918
9663C835918J7404M0049P5701M4040P0596L1583O540L7826O2654L1345N922L0374
$$ 3835918 3853322 3893371 3969072 4013112 4083708 4115291 4121831 4159657 4222311 4253656 4259578 4289952
9651D289952N7611N0733M2791L8203P0614N4443N6762L5301M8206Q6467O6862
$$ 4289952 4347563 4398296 4441087 4479290 4549904 4604347 4661109 4696410 4744616 4831083 4897945
9640D897945P9513M7189N3826M9553M8008M4300M9122P0991O8205P1404N5078
$$ 4897945 4977458 5024647 5078473 5128026 5176034 5220334 5269456 5340447 5408652 5480056 5535134
9629E535134O3181O5137Q0392P5929O6525O1605O3537P3742P5799O8454O5267
$$ 5535134 5598315 5663452 5743844 5819773 5886298 5947903 6011440 6085182 6160981 6229435 6294702
9618F294702O0259P2763Q2253J17174Q3081O7299O2817R8732R9484O3420N7784
$$ 6294702 6354961 6427724 6509977 6627151 6710232 6777531 6840348 6939080 7038564 7101984 7159768
9607G159768R8271J08812J09417J06232Q9300J11453J10293R0850O9246J13687
$$ 7159768 7258039 7366851 7476268 7582500 7671800 7783253 7893546 7984396 8053642 8167329
9597H167329R2655Q0154R1591J07237J26312J13509J51416J10431R7099Q0552
$$ 8167329 8259984 8340138 8431729 8538966 8665278 8778787 8930203 9040634 9137733 9218285
9587I218285R5596J32793J26838J26740J07842R5872J08013J34780J25960J34979
$$ 9218285 9313881 9446674 9573512 9700252 9808094 9903966 10011979 10146759 10272719 10407698
9577A0407698J39397J23786J32697J26000J05598J05899J35681J33951J28315
$$ 10407698 10547095 10670881 10803578 10929578 11035176 11141075 11276756 11410707 11539022
9568A1539022J32873J38547J40321J53219J34825J15287J37723J19154Q3850J12296
$$ 11539022 11671895 11810442 11950763 12103982 12238807 12354094 12491817 12610971 12694821 12807117
9558A2807117J39613J53228J40927J25640J24414J55995J41817J25927J39969
$$ 12807117 12946730 13099958 13240885 13366525 13490939 13646934 13788751 13914678 14054647
9549A4054647J38398Q9174R8044J35150J42223J25804J16470J13384J14469R4814
$$ 14054647 14193045 14282219 14380263 14515413 14657636 14783440 14899910 15013294 15127763 15222577
9539A5222577Q3444J00734P8727Q3432P6645Q2362P6539O1113O3983P6422Q4417
$$ 15222577 15306021 15406755 15485482 15568914 15645559 15727921 15804460 15865573 15929556 16005978 16090395
9528A6090395P8429P7970N3432M5436M4884L5660L4150L0942J5488Q221L366J9703
$$ 16090395 16168824 16246794 16300226 16345662 16390546 16426206 16460356 16491298 16506786 16515007 16518373 16538076
9516A6538076j431k548j9475J5142J1659k5350n2281l4108l4547l5282l9407o6117
$$ 16538076 16536645 16534097 16514622 16529764 16541423 16516073 16463792 16429684 16395137 16359855 16320448 16254331
9504A6254331p2582n0685m7998o6686o3304j00440r6515q4816p8314o0629p9685
$$ 16254331 16181749 16131064 16083066 16016380 15953076 15852636 15756121 15671305 15592991 15532362 15452677
9493A5452677r4028j06227q0374j11775j16468j19059j29575j41621j00574q7572
$$ 15452677 15358649 15252422 15172048 15060273 14943805 14824746 14695171 14553550 14452976 14365404
9483A4365404j27385j16368j29337j30163j20286j47914j36668j24947j30134
$$ 14365404 14238019 14121651 13992314 13862151 13741865 13593951 13457283 13332336 13202202
9474A3202202j28198j27240j42499j13196j15922j62850j43776j39168j08251
$$ 13202202 13074004 12946764 12804265 12691069 12575147 12412297 12268521 12129353 12021102
9465A2021102j24360j33710j22946j19945j31153j45018j13738j24917j30593
$$ 12021102 11896742 11763032 11640086 11520141 11388988 11243970 11130232 11005315 10874722
9456A0874722j13839j27771j07243j05174j07267j38438j32085j10856j09890
$$ 10874722 10760883 10633112 10525869 10420695 10313428 10174990 10042905 9932049 9822159
9447I822159j30575j22361j20031j30364j21264r5931r2749j04108j12783j27406
$$ 9822159 9691584 9569223 9449192 9318828 9197564 9101633 9008884 8904776 8791993 8664587
9437H664587j23095r3948q0507r4814q1556j00545j19061j06293q5120p6503r0341
$$ 8664587 8541492 8447544 8367037 8272223 8190667 8090122 7971061 7864768 7779648 7703145 7612804
9426G612804q7632j11488j11901r4732o1248q5167m7408n3035r0596r9181q0518
$$ 7612804 7525172 7413684 7301783 7207051 7145803 7060636 7013228 6960193 6869597 6770416 6689898
9415F689898r2530r1275p6285j06358o9863n8285o9748q4527q1015p0459l6367
$$ 6689898 6597368 6506093 6429808 6323450 6253587 6195302 6125554 6041027 5960012 5889553 5853186
9404E853186m3994p2702q2628p6295p4602m8019n8901o6349n7698o3853n6601
$$ 5853186 5809192 5736490 5653862 5577567 5502965 5454946 5396045 5329696 5271998 5208145 5151544
9393E151544o2642o0062n5761l6848m7881o9791o9974l4630j8432p2262o6658
$$ 5151544 5088902 5028840 4973079 4936231 4888350 4818559 4748585 4713955 4695523 4623261 4556603
9382D556603l9246n9021o4712n1646l2170k1240o9894p5528m4834n0475k2163
$$ 4556603 4517357 4458336 4393624 4341978 4309808 4288568 4218674 4143146 4098312 4047837 4025674
9371D025674j7874j6946k8425q2552p1399n7004l1465q522m437k9796m2351m9253
$$ 4025674 4007800 3990854 3962429 3879877 3808478 3751474 3720009 3711487 3707050 3677254 3634903 3585650
9359C585650m0880l2335j7313k0970l5971m0900l8422j6384m0065l4994k5032
$$ 3585650 3544770 3512435 3495122 3474152 3438181 3397281 3358859 3342475 3302410 3267416 3242384
9348C242384j9332l0072o5768l7954K637M274l8708l9775l1381k1722k0473l6573
$$ 3242384 3223052 3192980 3127212 3089258 3091895 3096169 3057461 3017686 2986305 2964583 2944110 2907537
9336B907537k8890j0396q861k0453l6315l8973l9290j1327o598j3230j5637j940
$$ 2907537 2878647 2868251 2859390 2838937 2802622 2763649 2724359 2713032 2706434 2693204 2677567 2675627
9324B675627J856K0406k988m8732m8472l893l0380m8848l4502l1020l4697m5746
$$ 2675627 2677483 2697889 2694901 2646169 2597697 2593804 2563424 2514576 2480074 2449054 2414357 2368611
9312B368611j2717K9206N140J0491l649l366N457L031l5495k8319l5512l4025
$$ 2368611 2355894 2385100 2390240 2400731 2397082 2393716 2399173 2402204 2366709 2338390 2302878 2268853
9300B268853p45j9606m750k4556m709k6071m2713j5425r69J9097K8364M3972R9135
$$ 2268853 2268108 2248502 2243752 2219196 2214487 2188416 2145703 2130278 2129309 2148406 2176770 2220742 2319877
9287B319877O4259R011l4695p4023o2109q1024q2799p6590m5127j6367K814k1577
$$ 2319877 2384136 2393147 2358452 2284429 2222320 2141296 2058497 1981907 1936780 1920413 1923227 1901650
9275A901650j8785m5738r294j4976j3295k1705J3118M729N917J8903j5642k4046
$$ 1901650 1882865 1837127 1827833 1812857 1799562 1777857 1790975 1795704 1801621 1820524 1804882 1780836
9263A780836l0896m6569n4292k6186J3063j0662m9245m654M773K7684M354J8585
$$ 1780836 1749940 1703371 1649079 1622893 1635956 1625294 1576049 1571395 1576168 1603852 1608206 1626791
9251A626791M4074J8757m0718n5669l8389r377j9868l4666k2134m0411k6359P378
$$ 1626791 1670865 1689622 1648904 1593235 1554846 1545469 1525601 1490935 1468801 1428390 1402031 1409409
9239A409409n171k5502j4795K028J03p955j4832m315j5512j2408k3548m269o241
$$ 1409409 1404238 1378736 1363941 1365969 1366072 1358117 1343285 1338970 1323458 1311050 1287502 1283233 1276992
9226A276992k8787j4874M116Q698Q433k471j884n996j3114j1763k4670j1172k6648
$$ 1276992 1248205 1233331 1237447 1246145 1254578 1252107 1250223 1244227 1231113 1219350 1194680 1183508 1156860
9213A156860J741M186Q597r859j9718j0587P815r088k3820k0075j3000j0713o399
$$ 1156860 1158601 1162787 1171384 1161525 1141807 1131220 1139035 1129947 1106127 1086052 1073052 1062339 1055940
9200A055940J7504P666q583j0916n769k2762k8891O971J9273j5725N858r299k1689
$$ 1055940 1073444 1081110 1072527 1061611 1055842 1033080 1004189 1011160 1030433 1014708 1020566 1011267 989578
9187I89578j3974P658j2148P486K580l1174l0415Q699K399j1061k918K0361k8572
$$ 989578 975604 983262 971114 978600 981180 950006 919591 928290 930689 919628 916710 937071 908499
9174I08499l5953J047K3468J2420m043r315P416j7020k1396K6333n379n506o098
$$ 908499 872546 873593 897061 909481 905438 896123 903539 886519 865123 891456 886077 880571 874473
9161H74473j6060r181Q592R153r014M129o75m5n629n13j2572r475J602j5844K1890
$$ 874473 858413 849232 857824 866977 857963 862092 861417 861372 855743 855230 842658 833183 834785 818941 840831
9146H40831L0339k6634n6602k1141N465m34M190r947j2606O93j8979J0354J4192
$$ 840831 871170 844536 787934 766793 772258 771824 776014 766067 753461 754154 735175 745529 759721
9133G59721K036K179r303q636j029k0602O241L4452p388N05k3003l672M220j1193
$$ 759721 761757 763936 754633 745997 744968 724366 730607 765059 757671 758176 735173 731501 735721 724528
9119G24528j1065j0696m560j0320N771K9001J0499k4271p922p86p466j5559j8120
$$ 724528 713463 702767 698207 687887 693658 722659 733158 708887 700965 700179 692713 677154 659034
9106F59034J1541R648k8134j7530N886k1765K487l827k3660J5146K1483j3514
$$ 659034 670575 680223 652089 634559 640445 618680 621167 617340 593680 608826 630309 616795
9094F16795L998j6855k1864n500J1308Q186l507J6355l161M328J2447j98j2290
$$ 616795 620793 603938 582074 576574 587882 596068 592561 608916 605755 610083 622530 622332 610042
9081F10042l9472j9394J0775P754L607o478k3244j0027P18J946P352J4126p829
$$ 610042 570570 551176 561951 569705 573312 566834 543590 533563 534281 536227 543579 557705 549876
9068E49876N499R921J898j2236k2357j3477J0944J1157j5467j619j5292K6709
$$ 549876 555375 565296 567194 554958 532601 519124 530068 541225 525758 524139 508847 535556
9056E35556K2671j7450k5968j3118J5715K1406N72p569J7646J0231J4982j9328
$$ 535556 558227 540777 514809 501691 517406 538812 539384 531815 549461 559692 574674 555346
9044E55346j6532j8372Q648k1727p443j3198M685J3823q150j1421p861r749J5633
$$ 555346 538814 520442 529090 507363 499920 486722 491407 505230 497080 485659 477798 468049 483682
9031D83682p602O77j1879p328K9594M213m702r79j3290j9217j8249J0086J1621
$$ 483682 476080 476757 464878 457550 487144 491357 486655 485676 472386 453169 434920 445006 456627
9018D56627k7308o964K1065J3206Q584M44K545k1739J5273P438J0799J8780J2027
$$ 456627 429319 422355 443420 456626 465210 465654 468199 446460 461733 469171 479970 498750 510777
9005E10777J041j8819j6666k0469k2256j3063R777o690J898J8814j7152j6358
$$ 510777 511818 492999 476333 455864 433608 420545 430322 423632 425530 444344 427192 410834
8993D10834R458n728m246P990J559n785j7443n250K2618n32k968r716J4257J5352
$$ 410834 420292 414564 410318 418308 419867 414082 396639 391389 414007 413475 410507 400791 415048 430400
8979D30400r019k6250P367K250K177m076k064j9858k4385J2891Q13j144j3703
$$ 430400 421381 395131 402498 404748 406925 402849 400785 380927 356542 369433 370246 369102 355399
8966C55399k1070q941M420j3157J4851J5213K6753J2459P08k5507k2695j2468
$$ 355399 334329 325388 329808 316651 331502 346715 373468 385927 386635 361128 338433 325965
8954C25965J6523K7402M813J291J4964o882m0389l9743J0315j5065J9759O236
$$ 325965 342488 369890 374703 375994 390958 384076 343687 303944 314259 299194 318953 325189
8942C25189P51J3675m421J5506L2191p024k2985k3702J5893K0978j6284j3017
$$ 325189 325940 339615 335194 350700 382891 375867 352882 329180 345073 366051 349767 336750
8930C36750J4649n01l1425k978R672J651l0758j9024Q421J4827J9502R977M902
$$ 336750 351399 350898 319473 316495 326167 327818 297060 278036 286457 301284 320786 330763 335665
8917C35665L965r359j0898k084j6162j6597k1507R727J9276Q039Q073J7503r515
$$ 335665 339630 330271 319373 317289 301127 284530 263023 272750 292026 300065 308138 325641 316126
8904C16126o038k4209o593p15K7976k662j2824j0422Q420P491J7K9991K0649M501
$$ 316126 310088 285879 279286 278571 306547 303885 291061 280639 289059 296550 296567 326558 347207 351708
8890C51708l5319K87P917k1786o264j4481n457O032M213q420J4223J2986o6J3527
$$ 351708 316389 316676 324593 302807 296543 282062 276605 282637 286850 278430 292653 305639 305573 319100
8876C19100J7444j6422j5876k8016M230j2010j8861k4638L553J0064P993L8614
$$ 319100 336544 320122 304246 276230 280460 268450 249589 224951 228504 238568 246561 285175
8864B85175K0386K841j9742k5078k6389J4528K5233M113l703l129R604R073o734
$$ 285175 305561 308402 288660 263582 237193 251721 276954 281067 277364 274235 283839 292912 286178
8851B86178j2479j5468m341O762j4801r601J4010j492J945q282r195L0046q170
$$ 286178 273699 258231 253890 260652 245851 236250 250260 248768 250713 242431 233236 263282 255112
8838B55112j4577j2406j217R446J5406L540J1651K2663J5800j1079k7562J393
$$ 255112 240535 228129 226912 236358 251764 255304 266955 289618 305418 294339 266777 268170
8826B68170K82r901J0741j2495M231J9419j8992m0939L262L451J1339J4220o348
$$ 268170 268452 258551 269292 256797 261028 280447 261455 220516 223778 227229 238568 252788 246440
8813B46440j6569J443j1395N262J0959L693m136k327K506j1144J2884q011j9780
$$ 246440 229871 231314 219919 225181 236140 239833 235697 233370 235876 224732 237616 229605 209825
8800B09825M0491L026m4415l1742n322J1845K9385L0707J6080j7823o448j5927
$$ 209825 250316 253342 208927 177185 171863 183708 213093 243800 259880 242057 235609 219682
8788B19682J8648J1284N238k8216r359j6122l952J3289R166r976k6196j7116j1842
$$ 219682 238330 249614 254852 226636 217277 201155 197203 210492 219658 209682 183486 166370 154528
8775A54528j3657K5209J5928l034j345N352K270J4800k0442o268n866K8536K1644
$$ 154528 140871 166080 182008 178974 177629 182981 185251 200051 179609 173341 167475 196011 217655
8762B17655k695K752j858O551o834k2839J117j3723Q63q62L508J0018N676J7165
$$ 217655 214960 217712 215854 222405 215571 192732 193849 180126 180989 180127 183635 193653 199329 216494
8748B16494j1321j2256K7890J3855k3209l6618O213J2501q620J793Q869l757M802
$$ 216494 205173 192917 220807 234662 211453 174835 181048 193549 184929 186722 195591 191834 196636
8735A96636l255J4371J1577p047q01l4726q844l1j9186q477J2191J547J1507J2104
$$ 196636 193381 207752 219329 212282 211481 176755 167911 167880 148694 140217 152408 153955 165462 177566
8721A77566K3239j0914p458J3642P453M144j8945r172k0326k160j6771J447o138
$$ 177566 200805 189891 182433 196075 203528 207672 188727 179555 159229 157069 140298 141745 135607
8708A35607N598J257J9528L9086J7793k2648p333k807j3998q288K1766k8900r005
$$ 135607 141205 142462 161990 201076 218869 196221 188888 186081 172083 163795 185561 156661 147656
8695A47656n535q966J1783j315j3945R199l2281m192J4398K5292Q641k208K7793
$$ 147656 142121 133155 144938 143623 129678 138877 106596 102404 116802 142094 150735 148527 176320
8682A76320Q394l0224j0840k0459j9982J0047Q836Q306N229J2544J6778N025J708
$$ 176320 184714 154490 143650 123191 103209 113256 122092 130398 135627 148171 164949 169974 171682
8669A71682R17p564k466R933Q088j4538l984j3994j2516o902K392L9533J8556
$$ 171682 172599 165035 162569 172502 180590 166052 162068 148074 135558 128656 131048 170581 189137
8656A89137j501o074k4049p76J2555j5251L812m122q251R285L619J4522R641J5562
$$ 189137 187636 181562 157513 156737 169292 154041 157853 153731 145480 154765 158384 172906 182547 198109
8642A98109j930j1760q924J7810J1113L1809N7377L2854M2124J06989J92346L45591
$$ 198109 196179 184419 175495 193305 204418 236227 293604 326458 368582 475571 667917 1013508
8630A013508N74378N18081k8261m73729n13312l92552k06423q3498n2978l1651
$$ 1013508 1587886 2105967 2077706 1603977 1090665 698113 491690 408192 355214 323563
8620C23563p955k3017n8496r582K503k865J9329k073k6354m2822j9888R428J2692
$$ 323563 315608 292591 234095 224513 227016 224151 243480 241407 215053 172231 152343 161771 174463
8607A74463m788m931J2847K0349K5914j427J1476Q229J8460Q924O887J7064K4285
$$ 174463 169675 164744 177591 197940 223854 222427 233903 242132 260592 269516 276403 293467 317752
8594C17752L2401o116q667L5778O4443J02424J78288L29728O05253J072623J233889
$$ 317752 350153 344037 335370 371148 435591 538015 716303 1046031 1651284 2723907 3957796
8583C957796J57599q67178j106728p69023m29024k39944j40231p5680p3839l3267
$$ 3957796 4115395 3248217 2141489 1372466 943442 703498 563267 487587 413748 380481
8573C80481k4846j2185j0867n0340l0660j3388k6125j8781Q871J828j1849Q124
$$ 380481 355635 343450 332583 282243 251583 238195 212070 193289 202160 203988 192139 200263
8561B00263q331J6415K7642J2397M827J8984r694l0384k9611j4544N794K3749
$$ 200263 191932 208347 235989 248386 253213 272197 262503 232119 202508 187964 193758 217507
8549B17507j1639r17J0142M0252M3952L8448P5319J51155K67335M25856N73712
$$ 217507 205868 204951 215093 255345 299297 337745 413064 564219 831554 1257410 1831122
8538A831122K50144k93971n18685m24156k58401j47497q6257p2774m0815k3918
$$ 1831122 2081266 1787295 1268610 844454 586053 438556 352299 279525 238710 214792
8528B14792j2133j3401k3475n779J7915K712j5223m503j2014q581J3066p859N575
$$ 214792 202659 189258 165783 160004 177919 180631 165408 160905 148891 140310 153376 145517 151092
8515A51092J9459R240J5504j1969j4981j3082o662k2638k6623j311K4706J0993
$$ 151092 170551 179791 195295 183326 168345 155263 148601 125963 99340 98029 122735 133728
8503A33728N32l687J5213J9769j7936M979j1611k0225M106L725K3721Q533o801
$$ 133728 134260 130573 145786 165555 147619 152598 140987 120762 124868 128593 152314 160847 154046
8490A54046k3624j9345O461K1256J2330j5981L838J814P240j4030k3151j0083
$$ 154046 130422 111077 117538 138794 151124 135143 138981 140795 148035 134005 110854 100771
8478A00771K272J5203K2214J2678j9156j1453j8528J1591p951J1256o620j4376
$$ 100771 103043 118246 140460 153138 133982 122529 104001 115592 107641 118897 112277 97901
8466I7901o316k070P282J4452k288l96j0090k5277J92J0971O032J8332l2406j3680
$$ 97901 91585 89515 96797 111249 108961 108565 98475 73198 73390 84361 90393 108725 76319 62639
8452F2639J6615o951j4864n28K2652J2981K1029L2667J1781l4714k8859m56K740
$$ 62639 79254 72303 57439 56911 79563 92544 113573 146240 158021 123307 94448 93992 96732
8439I6732j4177L0731l585J23q44q864j3772J253o046q796n955O796K9433K0762
$$ 96732 82555 113286 109701 109824 108980 100116 86344 87597 81551 72755 66800 73596 103029 123791
8425A23791o23o748k2739j2339L7420J0575j0563j7164j1502r048O473l953J8353
$$ 123791 123168 116420 93681 81342 118762 129337 118774 101610 90108 81060 87533 83580 101933
8412A01933R508j9115k751R392R900j9766J4885K3048J2984K721l9831L486M563
$$ 101933 111441 92326 89575 98967 108867 89101 103986 127034 140018 142739 102908 106394 110957
8399A10957M296k3404l64P899n174l524j8088J415R683R679J3070K4443n756j4036
$$ 110957 115253 91849 91485 99384 94210 90686 72598 74013 83696 93375 106445 130888 125132 111096
8385A11096J2512q78k7140l05j9230k823L119m716j7075r722K6006J4195K3054
$$ 111096 123608 122730 95590 95285 76055 73232 76351 71635 54560 44838 70844 85039 108093
8372A08093k585k5873j7356j066j3994K9285J9029n247K643j2570K0393J9985
$$ 108093 105508 79635 62279 61213 47219 76504 95533 90286 92929 80359 100752 120737
8360A20737Q849M286l34k9371j6144j2667P18j5929J263K8292J5329K8537J5592
$$ 120737 129586 133872 133538 104167 88023 75356 76074 60145 61408 89700 105029 133566 149158
8347A49158j3649k0092m270m357J5316L556j1280k5574j5662Q930P832P873j3045
$$ 149158 135509 115417 111147 106790 122106 125662 114382 88808 73146 82076 89908 97781 84736
8334H4736j3425o983M0585N931p503O991l070l523j5282j1019J3934J3953P125
$$ 84736 71311 64328 104913 110844 103341 110332 107262 103739 88457 77438 91372 105325 112450
8321A12450j2510k7873j6697O254O028o85l934J4122p099k2488O980K0933J6180
$$ 112450 99940 72067 55370 61624 67652 66967 63033 77155 70056 47568 54548 75481 91661
8308I1661o784r03l153Q394k333k2030J1456N399J2778L3872J0997k4128P079
$$ 91661 84877 83974 80821 89215 86882 64852 76308 81707 94485 128357 139354 115226 122305
8295A22305J9669k507j1571j4320j1579j8194j8997k1032O574K3181J4698k3614
$$ 122305 141974 139467 127896 113576 101997 83803 64806 43774 50348 73529 88227 64613
8283F4613M374N508L4680j54m275m999k0385J030j8899m634O984K0189j1849J1772
$$ 64613 68987 74495 109175 109021 104746 99747 79362 80392 61493 56859 63843 84032 72183 83955
8269H3955J0214r731q463J284j1934O943R363J7967j2303j3578J3872j468o83
$$ 83955 94169 84438 75975 77259 65325 72268 81631 99598 87295 73717 87589 86121 85438
8256H5438J4995J5963p914N764j7748j4825j7484j2284K4251K0479J2981J8084
$$ 85438 100433 116396 108482 114246 96498 81673 64189 51905 76156 96635 109616 127700
8244A27700k2525j5631j300J1790o397j1084N549J5736P986q694N979j1071j6496
$$ 127700 105175 89544 88244 100034 93637 82553 88102 103838 111824 103130 109109 98038 81542
8231H1542l0322j1781r721R783J8206j0194j2608j4459Q512J1355J0986L0094
$$ 81542 51220 39439 29718 39501 57707 47513 34905 20446 28958 40313 51299 81393
8219H1393K6751M624k0833l7071j0236J6660J5494L914M069P181j8173r18k612
$$ 81393 108144 112768 91935 54864 44628 61288 76782 80696 84765 91946 73773 72855 70243
8206G0243o706p565J6144J9549k690k0649k5118Q07j108J1724J699P559N609k7669
$$ 70243 63537 55972 72116 91665 88975 68326 43208 44015 42907 54631 56330 63889 69498 41829
8192D1829q043j0061m547K2879L3211j3190l3344j6327J8120K0116N136K631P463
$$ 41829 33786 23725 19178 42057 75268 62078 28734 12407 30527 50643 55779 58410 65873
8179F5873K3766p814j6169L537o615j4902J1796k3297k97J2273K6876o043k4477
$$ 65873 89639 81825 65656 69193 62578 47676 59472 36175 35878 48151 75027 68984 44507
8166D4507M911J2623J3304M170j7611J0606J2127R389j1155j3871k096l422k6549
$$ 44507 49418 62041 75345 79515 61904 72510 84637 94026 82871 69000 66904 63482 36933
8153C6933N825J0223M988J4252L338j0673K1250j881k4665j1641k1120j191K7585
$$ 36933 42758 52981 57969 72221 75559 64886 86136 84255 59590 47949 26829 25638 53223
8140E3223J1620r078J221R031k234j2002j6938N832N393P52o201R453K2914O615
$$ 53223 64843 55765 56986 66017 63783 51781 34843 40675 46068 46820 40619 50072 72986 79601
8126G9601j0003k956P4n662J069q408m676M591p351j1511J0558k627N66J2263
$$ 79601 69598 66642 66716 61054 62123 53715 49039 53630 46279 34768 45326 42699 43265 55528
8112E5528L993M073j268j4529k2896J5230M822j3315j5288J1101L807j042j4619
$$ 55528 59521 63594 62326 47797 24901 40131 44953 31638 16350 27451 31258 30216 15597
8099A5597K1682J8605J3343P248J5171m722j7203O401J436O052j1463L032P266
$$ 15597 37279 55884 69227 76475 91646 86924 69721 76122 77558 83610 72147 75179 82445
8086H2445j2281l6314N853K75o801K2146L0014m41k8203k069R476J2961L305L111
$$ 82445 70164 33850 39703 39978 33177 55323 85337 84896 56693 54624 64100 77061 80366 83477
8072H3477l0295j4097J4373P814J2641o612j1120k802j2708p122j785J9635M090
$$ 83477 53182 39085 53458 61272 73913 67301 56181 53379 40671 33549 31764 51399 55489
8059E5489k2754J766J230n717J2779J3595j1498r608N718K2406M398M324j6720
$$ 55489 32735 34501 35731 30014 42793 56388 44890 35282 41000 63406 67804 72128 55408
8046E5408o913L847p156j424M187K2326O921j2046k0386Q706q288j0181R436J8444
$$ 55408 48495 52342 45186 43762 47949 70275 77196 65150 44764 53470 45182 35001 44437 62881
8032F2881n230j5285L63j7871n566K26J9603P016K721K4430j2468q727k0003j6493
$$ 62881 57651 42366 42729 24858 19292 19518 39121 46137 48858 73288 60820 52093 32090 15597
8018A5597M31R376J7422J0602r524l0875k6727K9186K9138J9091j4669j0999m530
$$ 15597 16028 25404 42826 53428 43904 13029 -13698 15488 44626 63717 49048 38049 33519
8005C3519q99J3646K6442J5462j7053r92r256n530j1117N360J5281p713k4143
$$ 33519 32620 46266 72708 88170 71117 70125 60869 55339 44222 49582 64863 57150 33007
7992C3007l031J7615J2666j934l3808k2151J1361K6769L3100j8490l5937J3079
$$ 33007 29976 47591 60257 58323 24515 2364 13725 40494 73594 55104 19167 32246
7980C2246J9241o274J753P951p963j2726J568O152L495r371Q502m498R091o0R787
$$ 32246 51487 45213 46966 54917 46954 34228 35796 41948 45443 36072 44574 40076 49167 49107 58894
7965E8894J3662K0069Q048l1909l84q631m0920j3377K846J0831J6250l116q110
$$ 58894 72556 92625 100673 68764 68380 59749 18829 5452 8298 19129 35379 32263 24153
7952B4153k2288Q824M0433L1004J562j0299p652p892R426Q759j7001o489o379
$$ 24153 1865 10689 51122 82126 83688 73389 65737 57845 67271 76030 59029 52540 46161
7939D6161r192J5922J3316Q385J581m930j1194r99j258j7087L325J8051P242J227
$$ 46161 36969 52891 66207 74592 76173 71243 60049 59050 57792 40705 44030 62081 69323 70550
7925G0550K3556J5596j6420l6043k7404L2144J5768k5205j5721r59j0539k7821
$$ 70550 94106 109702 93282 57239 29835 61979 77747 52542 36821 35862 25323 -2498
7913b498R526J0158R215P570J2873k6143k8220M5238L3044j190p179k3247q9q
$$ -2498 7028 17186 26401 33971 46844 20701 -7519 37719 70763 69573 62394 39147 39058 39050
7899C9050j2734J0719L2684j214o978P554k0o413k4452j3353P119J2860M952q020
$$ 39050 26316 37035 69719 68505 61527 69081 69061 62648 38196 24843 31962 44822 49774 41754
7885D1754n74K0739q55l1929r761K1874M55l767j1238J2289l163J3833N195l993
$$ 41754 41180 61919 61064 29135 19374 41248 41703 37936 26698 38987 35824 49657 54852 50859
7871E0859L48j2256O257N268O74l34j3673J0063K3038k1400j9124K974K98N808
$$ 50859 51207 38951 45208 50476 51150 50816 37143 47206 70244 48844 29720 32694 32992 38800
7857C8800J4901k0292l585J858m601P079j0042j0713q11L106J9109R796l1392
$$ 38800 53701 33409 29824 31682 27081 34160 24118 13405 12594 15700 34809 44605 13213
7844A3213p432K9222R12o446j4260K4332J312l618K691o573k5682L361K2221j4328
$$ 13213 5781 35003 35915 29469 15209 39541 40853 37235 39926 33353 7671 11032 33253 18925
7830A8925j2585M055K5838J2707j4081L33J0415N091k12l489K950k2829o596Q657
$$ 18925 6340 10395 36233 48940 34859 35192 45607 50698 50486 46997 49947 27118 20522 29179
7816B9179P502j0911L035r613j8019N928L1565K8728j3401j9847k347l660q0j9105
$$ 29179 36681 25770 28805 19192 1173 7101 38666 67394 53993 34146 31799 28139 28059 8954
7802H954l305O858L888m8719J0214L2763J1552K0282J4231N981K11m727p570P892
$$ 8954 5649 12507 16395 -32324 -22110 10653 22205 42487 56718 62699 62910 58183 50613 58505
7788E8505j496J5378m013j9644j4972j3387l060J3451J67n891J416r076j3287
$$ 58505 57009 72387 68374 48730 33758 20371 17311 30762 30929 25038 26454 17378 4091
7775D091J4965K5373K3563K631k8817m1737K808K4624j1865N345R370Q430m096
$$ 4091 19056 44429 67992 70623 41806 69 2877 27501 15636 20981 30351 38781 34685
7762C4685j0742R871K1682j8226M0j3031j1517J3094J5345M899n936q142J7737
$$ 34685 23943 33814 55496 37270 37310 24279 12762 25856 41201 46100 40164 32022 49759
7749D9759J8510j0877k264j1556L087Q247o176K989Q826J4792j1286l925n052
$$ 49759 68269 57392 55128 43572 46659 54906 48730 51719 60545 75337 64051 60126 55074
7736E5074q954q505l424q455n380n589j1687K3945P807J0008k961R426j3812n516
$$ 55074 46120 37615 34191 25736 20356 14767 3080 27025 34832 44840 41879 51305 37493 31977
7722C1977O840q741O859j1178L899n291L542O517K193J2675j759p503q260N773
$$ 31977 38817 30076 36935 25757 29656 24365 27907 34424 36617 49292 47533 40030 31770 37543
7708C7543j0289l0659m564J2717Q892P134j1001K7042J4653j9419k0805j4519
$$ 37543 27254 -3405 -7969 4748 13640 20774 9773 36815 51468 32049 11244 -3275
7696c275K927J5645l936k1618K176J3675J0167J6574M467j0511r718r79J4297
$$ -3275 -348 15297 11361 -10257 -8081 5594 15761 32335 36802 26291 16573 15594 29891
7683B9891J3746J0634j1497L709o152n184K336k1614K860R590j1271o5N15J1287
$$ 29891 43637 54271 42774 46483 40331 35147 37483 15869 18729 28319 17048 16983 17498 28785
7669B8785J6808l050J2579J7574j7820N881m85j5290k0967j388O179J8944j7810
$$ 28785 45593 42543 55122 72696 54876 60757 60272 44982 24015 22627 28806 47750 29940
7656B9940j3221o588J770M961R029j7224k4969J6354J1989N785n47r717J3586
$$ 29940 16719 10131 11901 16862 25891 8667 -16302 52 12041 17826 17279 7562 21148
7643B1148q416K5747J0922p452l363J950J0283m354o699J7489l315j5119j8827
$$ 21148 12732 38479 49401 41949 38586 40536 50819 46465 39766 57255 53940 38821 19994
7630A9994R967K2798K9360l3l853j4869k4983l7477p273K4926j167L933J2103
$$ 19994 29961 52759 82119 82086 78233 63364 38381 904 -6369 18557 17390 21323 33426
7617C3426K3742K014j9860l734k436j3375J635m30J717j2604o268p818J7478K1623
$$ 33426 57168 59182 39322 35588 33152 19777 21412 20982 22699 10095 3827 -3991 13487 35110
7603C5110K45L127q51j0228j8148O848K3312M804O641J5954K391k4000l7844r92
$$ 35110 35355 38482 37631 27403 9255 16103 39415 44219 50860 66814 69205 45205 7361 6369
7589F369j8931k1285J9969J3894N145J0691K002m250J506k0801K804M4468J9555
$$ 6369 -12562 -33847 -13878 16 5161 15852 17854 13604 15110 -5691 -2887 41581 61136
7576F1136k9632k3271p096P454J2930k845L3244P801k8886n382P967P027K171
$$ 61136 31504 8233 1137 8591 21521 18676 51920 59721 30835 25453 33420 40447 42618
7563D2618o106J1535j1159j878Q325k4080K759K201p196j8254k0337J2253k398
$$ 42618 36512 48047 36888 35010 43335 19255 22014 24215 17019 -1235 -21572 -9319 -11717
7550a1717J2725K1309P510P441j1667Q070M641q695j0362p105N140L711j6555
$$ -11717 1008 22317 29827 37268 25601 33671 38312 29617 19255 12150 17290 21001 4446
7537D446P50p442J9796J2724R089o403j6231k1433o699J1420L52m83q333J7897
$$ 4446 5196 -2246 17550 30274 39363 32960 16729 -4704 -11403 17 369 -114 -8447 9450
7523I450l454J5j2092p542J4365L9708m840j1831l060q848K0158M7J795p628p109
$$ 9450 5996 6011 -6081 -13623 742 40450 35610 23779 20719 11871 32029 32076 33871 26243 19134
7508A9134m349N372j3729J601r887j9575R633L1385q373J2977k0663j0921O891
$$ 19134 14785 20157 6428 8029 -1858 -21433 -11800 19585 11212 24189 3526 -7395 -504
7495e04J8787j634l158l745p881p193J9886J0183j278n389L015J6931j4963J2641
$$ -504 18283 16649 13491 9746 1865 -5328 14558 24741 23463 18074 21089 38020 23057 35698
7481C5698J6980j3940j9415p290O106K0075k099j4841j4745k6565m465J1227J6578
$$ 35698 52678 38738 19323 12033 18139 38214 36115 21274 6529 -20036 -24501 -13274 3304
7468C304r437k944j741K0942q316K8873K2433q374p836l92j6930j5229M690K8424
$$ 3304 -6133 -9077 -10818 10124 1808 30681 53114 44740 36904 36512 19582 4353 9043 37467
7454C7467k0505n695k678J2771M727j3321k961N983L7570P845q910N293n432j5710
$$ 37467 16962 11267 8589 21360 26087 12766 9805 15788 53358 61203 52293 57586 52154 36444
7440C6444l0760j1446N264l967Q934K4367n839j7054K2396J2799j2401k265l795
$$ 36444 5684 -5762 -498 -4465 4469 28836 22997 5943 28339 41138 28737 26472 22677
7427B2677K057K154o59K12k3226q402J4657K3213o019k1073n731R450j9903j1582
$$ 22677 24734 26888 26229 26441 3215 -5187 9470 32683 26664 5591 -140 9310 -10593 -22175
7413b2175L4121J0775n460J3181N018k1278J323P893J4672k03R908j5289j3732
$$ -22175 11946 22721 17261 30442 35460 14182 15505 23398 38070 37867 47775 32486 18754
7400A8754k2373J0995M632j7757P123J243j224R254j6402L471Q770l0663J3721
$$ 18754 -3619 7376 12008 -5749 1374 2617 1393 10647 -5755 -2284 6486 -24177 -10456
7387a0456L0543k012j7186J1726M711Q561Q403j1380j1178K502N124R042K1200
$$ -10456 20087 18075 889 12615 17326 25887 34290 22910 11732 14234 19358 28400 49600
7374D9600J5253J925k7030k8088M8J4613K696j5902j8664j576J8466J8403k206
$$ 49600 64853 66778 39748 11660 11708 26321 29017 13115 -5549 -7125 11341 29744 27538
7361B7538n283p114K321p15J5262Q733N23k1902j4179J7169j061m003J0857L951
$$ 27538 22255 15141 17462 16747 32009 40742 41265 19363 5184 22353 21292 17289 28146 32097
7347C2097r081k2848j2933l367K411j0820L0249K0461m599p994k4487j938K4843
$$ 32097 23016 168 -12765 -16132 -13721 -24541 5708 26169 21570 13576 -10911 -12849 11994
7334A1994p850o290J2724J9814K3810p00j4313o786k4702q865R054j75j7710k2027
$$ 11994 4144 -2146 10578 30392 54202 53502 39189 32403 7701 -1164 7890 7715 -9995 -32022
7320c2022K9092K7214q130j3286K605J024k820K0309n16O797J0715J7686J6162
$$ -32022 -2930 24284 16154 2868 5473 6497 3677 23986 23470 30267 40982 58668 74830
7307G4830o058l6115l7531q540L3500J4394p910j2421J2951o284j6185k0493J7069
$$ 74830 68772 32657 -4874 -13414 20086 34480 26570 14149 27100 20816 4631 -15862 1207
7294A207L035L904J5986k3002j0256J9880N221j8789k1647m364J50r98K5012n576
$$ 1207 4242 8146 24132 1130 -9126 10754 15975 -2814 -24461 -28825 -28675 -29673 -4661 -10237
7280a0237J1775L486J0625J4619r833J2723J4353n248k1194j4629R345m565m4951
$$ -10237 1538 5024 15649 30268 20435 33158 47511 42263 21069 6440 15785 11220 -33731
7267c3731j2819m493J6464J4275J793j492j6331J6131J0271j2549K6690O701o631
$$ -33731 -46550 -51043 -34579 -20304 -18511 -20003 -36334 -20203 -9932 -22481 4209 10910 4279
7254D279k95l451J9698J341m37J9607j5021k2721j2656N017n039N332k0818m825
$$ 4279 3984 533 20231 21572 21135 40742 25721 3000 -9656 -4639 -9678 -4346 -25164 -29989
7240b9989K218k811M168j4502R667J4377K1591J1250j2389J152J5607r469j7473
$$ -29989 -27771 -30582 -26414 -40916 -31249 -16872 4719 15969 3580 4732 20339 10870 -6603
7227f603M348M730k927j0155l0345M983K9262J1196j3874j8139J6662N891l3763
$$ -6603 -2255 2475 -452 -10607 -40952 -35969 -6707 4489 -9385 -27524 -10862 -4971 -38734
7214c8734m081N3799K0390K164k683j6062l2479L77K2343J1572l3254k2406j61
$$ -38734 -42815 10984 31374 33538 30855 14793 -17686 -17309 5034 16606 -16648 -39054 -39215
7201c9215M8968K8032m886n078L46J251k6786K424M334K516L543M312j2324j1076
$$ -39215 9753 37785 32899 27821 28167 29418 2632 5056 9390 11906 15449 19761 7437 -3639
7187c639O599k7866j5216K343j070M461M856n782J0Q329L2467K225J4236k4830
$$ -3639 2960 -24906 -40122 -37779 -38849 -34388 -29532 -35314 -35304 -26975 5492 7717 21953 -2877
7173b877j8964Q845J6637J9643J4982j1241P408J4299J645k9513o857K909K3024
$$ -2877 -21841 -12996 3641 23284 38266 27025 34433 48732 50377 20864 14007 16916 39940
7160C9940O870k4216p448K6330n984n845Q4M276j522M138k3463q181K379j2956
$$ 39940 46810 22594 15146 41476 35492 29647 29731 34007 32485 36623 13160 4979 7358 -5598
7146e598k0781J6996K228j5239n924J6159J1341j390m089q292k996J4117k726
$$ -5598 -26379 -9383 -7155 -22394 -28318 -12159 -818 -2208 -6297 -14589 -17585 -3468 -6194
7133f194l370k207J2976K0089K82K6993N495k3308J1277K7315j615j8476j9908
$$ -6194 -9564 -11771 1205 21294 21576 48569 54064 30756 42033 69348 67733 49257 29349
7120B9349k6586k4134k54R948K7313K2441o569k2305j451L985L824J1527k877
$$ 29349 2763 -21371 -21625 -11677 15636 38077 31508 9203 7752 11737 15561 27088 24211
7107B4211N987j4759k1233N721O396k6816Q344K536R488K3010J8041o785J0891
$$ 24211 30198 15439 -5794 -73 6323 -20493 -12149 -9613 -125 22885 40926 34141 45032
7094D5032J5228M344r706n802M553k2079j1765J5551J7282k7621j9282j393L863
$$ 45032 60260 64604 54898 49096 53649 31570 19805 35356 52638 25017 5735 4342 8205
7081H205R275L231o288Q830p228o955p069J4822J092j1513P09q746m177M888K6955
$$ 8205 17480 20711 14423 23253 16025 9070 2001 16823 17915 6402 7111 -1635 -5812 -924 26031
7066B6031j5561N446j3426Q065q144j1190K0873Q640j1905P417j6829J6727j239
$$ 26031 10470 15916 2490 10555 2411 -8779 12094 20734 8829 16246 -583 16144 14905
7053A4905l1477K659M934q182n020L601K3590J3685J1232J8253K937K688o653
$$ 14905 -16572 -13913 -8979 -17161 -22181 -18580 5010 18695 29927 48180 51117 53805 47152
7040D7152l5569L899O757K343J567q988k9807k4742K9368J1758N582K813l4801
$$ 47152 11583 15482 22239 24582 26149 17161 -12646 -37388 -8020 3738 9320 12133 -22668
7027b2668l4442M9238J9707J0308K774L061L572l0101k0866j0362l454Q83K0688
$$ -22668 -57110 -7872 11835 22143 24917 27978 31550 1449 -19417 -29779 -33233 -32350 -11662
7014a1662J9843K435r03J9073J3689R383l6522l1715J0316M029K531O90j1084
$$ -11662 8181 10616 9713 28786 42475 51858 15336 -16379 -6063 -2034 497 1187 -9897
7001i897P949l88R453Q116L784m466j6578l614j3481J3081K6565K3051k58o709
$$ -9897 -1948 -2336 7117 15233 19017 14551 -2027 -5641 -19122 -6041 20524 43575 43317 36608
6987C6608m408M874K884j2186k8495m880j6072j2890j4237P211Q792J6930p280
$$ 36608 32200 37074 39958 27772 -723 -5603 -21675 -34565 -48802 -41591 -32799 -15869 -23149
6974b3149p462M137k9529J2795K4965J0986R553j3789J7438p59P436k1924k4125
$$ -23149 -30611 -26474 -56003 -43208 -18243 -7257 2296 -11493 5945 5186 12622 -9302 -33427
6961c3427R618J9746k498j0236n796L729J6851K3033j0242P51Q983j437O577j8190
$$ -33427 -23809 -4063 -6561 -16797 -22593 -18864 -2013 21020 10778 11529 20512 19075 25652 7462
6947G462l0687N245J7714J9826K92k1090K766J364L2221J9239k1210j6810k063
$$ 7462 -23225 -17980 -266 19560 19852 -1238 1528 2892 35113 54352 33142 16332 14269
6934A4269l0212n008O772j2567J4262J9160K2010Q594J3836q361j0513R678L147
$$ 14269 -15943 -20951 -14179 -26746 -12484 6676 28686 37280 51116 42755 32242 41920 45067
6921D5067k7134p982l098rk4250j4787J9944R501J9142j2496L988j625k0781K495
$$ 45067 17933 9951 6853 6844 -17406 -32193 -12249 -2748 16394 3898 7886 6261 -14520 -12025
6907a2025K2520J8034P936n19j719N004J2418M4974L8557K6227j2712l7573l8436
$$ -12025 10495 28529 36465 35946 34227 39231 51649 96623 135180 161407 148695 111122 72686
6894G2686l0271p860j0695R415r126l1671j3760J3875L485j675K2497p69J8066
$$ 72686 42415 34555 23860 33275 24149 -7522 -21282 -7407 -3922 -5597 16900 16131 34197
6881C4197j4576n786L2749J8207k4285j7197q099j8578k2104l39J0963K6443J71
$$ 34197 19621 13835 46584 64791 40506 23309 15210 -3368 -25472 -25811 -14848 11595 11766
6868A1766p387j8699J0460J1879K0785L0282J0913j2527l1505k0081J2580L5762
$$ 11766 4379 -14320 -3860 8019 28804 59086 69999 57472 25967 5886 18466 54228
6856E4228P934k9454l3444j2119K5170K0720r395J2138L812P483m74l4265J4080
$$ 54228 62162 32708 -736 -12855 12315 33035 23640 35778 39590 47073 46599 12334 26414
6843B6414J4507j7958O944K5280j7322J6203m798r507k3829j8860R820R387p185
$$ 26414 40921 22963 29907 55187 37865 54068 49270 39763 15934 -2926 6894 16281 9096
6830I096P893J2423j6805j6491J9802K224m048k0909j537K2905R723R920K6921
$$ 9096 16989 29412 12607 -3884 15918 18142 14094 -6815 -8352 14553 24276 34196 61117
6817F1117j9821l374J4370O438k5931l0585j4502j099L017J2613J0274m678k1211
$$ 61117 41296 37922 52292 58730 32799 2214 -12288 -13387 -10370 2243 12517 7839 -13372
6804a3372Q533l097n327K6382N201Q075O34J3956m636p053l707j2251q804K3093
$$ -13372 -4839 -7936 -13263 13119 18320 26395 27029 40985 36349 29296 25589 13338 4534 27627
6790B7627P260j9154k0263m77J731j3149r06n31Q488K403m031J6699J6230j7417
$$ 27627 34887 15733 -4530 -5007 -3276 -16425 -17331 -17862 -9374 -6971 -11002 5697 21927 4510
6776D510j0919K6671J8999k3357l5636j3294j1157k993L3056k64k103K0975J7438
$$ 4510 -6409 20262 39261 15904 -19732 -33026 -44183 -47176 -14120 -14384 -16487 4488 21926
6763B1926m725j7900j5600k0713L5346j2983j4489J0747P281J9676J010j7949
$$ 21926 17201 -699 -16299 -37012 -1666 -14649 -29138 -18391 -11110 8566 9576 -8373
6751h373q455J4523J0272n830J1024o81j1802r115L049j997M088L3301J2761k2401
$$ -8373 -16828 -2305 7967 2137 13161 12480 678 -8437 -5388 -7385 -3297 30004 42765 20364
6737B0364m5936k5489M1911L7797n290Q214j9009k577n197j2499K2769K2777m440
$$ 20364 -25572 -51061 -9150 28647 23357 31571 12562 9985 4788 -7711 15058 37835 33395
6724C3395n398l2684J0203O065K670J5216k3986k2520j6777j5152J6483J6933
$$ 33395 27997 -4687 5516 11581 14251 29467 5481 -17039 -33816 -48968 -32485 -15552
6712a5552p417j1009R019R519K2779L3514P343R154j2293N141l094k1296l2166
$$ -15552 -22969 -33978 -24959 -15440 7339 40853 48196 57350 45057 50198 47104 25808 -6358
6699f358k3254K09J028J0695J1146J1853n524k732J4522j2308Q631K4215j8j606
$$ -6358 -29612 -29403 -28375 -17680 -6534 5319 -205 -2937 11585 -723 7908 32123 32105 30499
6685C0499q625j3011p714j0896K1736k831r112r436K2577J6211j9220j8030k417
$$ 30499 21874 8863 1149 -9747 11989 9158 46 -9390 13187 29398 10178 -7852 -10269
6672a0269J5612J7012J825j7022j0068L4481N952k9782N632j6604k510k776r787
$$ -10269 5343 22355 24180 7158 -2910 31571 37523 7741 13373 -3231 -5741 -8517 -18304
6659a8304L167K063J9044M119j7315J421k1646J9381M30n290j100R264p416M320
$$ -18304 -15137 -13074 5970 10089 -7226 -5805 -27451 -8070 -7640 -12930 -14030 -4766 -12182 -7862
6645g862K1994j9435o305L294K0328j2603l3003Q10j705m678J9947J153K3828
$$ -7862 14132 -5303 -11608 -8314 12014 -589 -33592 -32782 -34487 -39165 -19218 -18065 5763
6632E763Q704p000m497k0561k205J468o54j4374n879N990K961J3414J1305J0406
$$ 5763 14467 7467 2970 -17591 -19796 -18328 -18982 -33356 -39235 -33245 -30284 -16870 -5565 4841
6618D841K7575j5541J0089R64j8852J0096k7458l1449J5404J4277q95o303L193
$$ 4841 32416 16875 26964 27928 9076 19172 -8286 -39735 -24331 -10054 -10949 -17252 -14059
6605a4059J1081j707j2503K554K351j7164J7930K1962K992j849K9514r474l754
$$ -14059 -2978 -4685 -17188 -14634 -12283 -29447 -11517 10445 13437 11588 41102 31628 27874
6592B7874j5245j6451l845j6167J039j1721o585L3101j368m209P861k5704j0398
$$ 27874 12629 -3822 -7667 -23834 -22795 -34516 -41101 -8000 -9368 -13577 -5716 -31420 -41818
6579d1818l856R841K5335k157K116q007m313O890k369J4672k678j4341K156J7802
$$ -41818 -45674 -35833 -10498 -12655 -10539 -18546 -22859 -15969 -18338 -3666 -6344 -20685 -18529 -727
6565g27L8840K2882k9277k8094n620J781o618L325L510k292J0357j3033O630o126
$$ -727 38113 60995 31718 3624 -1996 -215 -6833 -3508 2 -2290 8067 -4966 1664 -4462
6551d462l063L977M017R529K0996l531J9969J8578j4840k8152j0620o889k7958
$$ -4462 -7525 -3548 469 9998 30994 27463 47432 66010 51170 23018 12398 5509 -22449
6538b2449L767K2277q532j6728p63l801R482J1049P061k256o852p323J4218N726
$$ -22449 -18682 3595 -4937 -21665 -22428 -26229 -16747 -5698 1363 -893 -7745 -15068 -850 4876
6524D876q726O484J3864o807j5109p511M043Q535m946M264o745k4100K0064J1715
$$ 4876 -3850 2634 16498 9691 -5418 -12929 -8886 -351 -5297 -1033 -7778 -31878 -11814 -99
6510i9N014L072n212k3K953j8980j4727l10J6316J8533j6563j2351n552j0117
$$ -99 4915 7987 2775 2752 5705 -13275 -28002 -28312 -11996 6537 -10026 -22377 -27929 -38046
6496c8046k010O1536J3646n67K530j1815p378Q264k7316n970J5792O483m739j0092
$$ -38046 -40056 21480 35126 34559 37089 25274 17896 26160 -1156 -7126 8666 15149 10410 318
6482C18j5736o315J8675K4688j8489k9348o487J2071J5694K923O615L1561j9195
$$ 318 -15418 -21733 -3058 21630 3141 -26207 -32694 -20623 -4929 -2006 4609 36170 16975
6469A6975k0784j1921j12J0986k4661K882J0010l993J0234p715k9J5596j4979
$$ 16975 -3809 -15730 -15842 -4856 -29517 -26635 -16625 -20618 -10384 -18099 -18128 -2532 -17511
6456a7511r220L169p942j1643r859L0672L1655J364p17k767M8p366q297j8290
$$ -17511 -26731 -23562 -31504 -43147 -53006 -22334 9321 10685 9968 7201 7249 -117 -8414 -26704
6442b6704p553R113Q800m709P751o202n62N631j4583J9576K1811L3960J8845q108
$$ -26704 -34257 -25144 -16344 -21053 -13302 -19504 -20066 -14435 -29018 -9442 12369 46329 65174 57066
6428E7066j8701j1152k3840j5654K8433O665j5270p976Q682J713o005j5626k6341
$$ 57066 38365 27213 3373 -12281 16152 22817 7547 -429 8253 9966 3961 -11665 -38006
6415c8006J1331o37J1351J2780J1056j1064R02j5930k3517j1969n94K3238J2116
$$ -38006 -26675 -27312 -15961 -3181 7875 -3189 -2287 -18217 -41734 -53703 -54297 -31059 -18943
6402a8943P993Q061M606k1623k0585J370M707p285o649l873J479N575J2826J1004
$$ -18943 -10950 -2889 1717 -19906 -40491 -39121 -34414 -41699 -48348 -52221 -50742 -45167 -32341 -21337
6388b1337p65P997J77K2285K699q886K1402R305n262m789J5655lJ318j2187L753
$$ -21337 -22102 -14105 -13928 8357 11056 2170 23572 32877 27615 22826 38481 38478 39796 27609 31362
6373C1362j408q720L083p406l2823J974q127j4460R556J7679K3002j9138j2407
$$ 31362 29954 21234 24317 16911 -15912 -13938 -22065 -36525 -26969 -9290 13712 -5426 -17833
6360a7833j2783J7912R060L4649K5410m1701l0002R137n111k1099P333J4691j2265
$$ -17833 -30616 -12704 -3644 31005 56415 14714 -15288 -6151 -11262 -32361 -25028 -10337 -22602
6347b2602j2339J2318J8659o907k273K823J354K014j2295J8509L196R533j3316
$$ -22602 -34941 -22623 -3964 -10871 -13144 -10321 -8967 -6953 -19248 -739 2457 11990 -1326
6334a326k0585k0780j0539L3322Q845M24L006k714K7820J6981p936n739j778R610
$$ -1326 -21911 -42691 -53230 -19908 -11063 -10639 -7633 -10347 17473 34454 26518 20779 19001 28611
6320B8611m299L834r824l0339o492J2572K4800M742K1261m805r7l3139j3560Q867
$$ 28611 24312 28146 18322 -12017 -18509 -5937 18863 23605 44866 40061 39964 6825 -6735 2132
6306B132M271l2673M117n962J2005p507j3448O080J9666J6738K2062J1077j3487
$$ 2132 6403 -26270 -22153 -28115 -16110 -23617 -37065 -30985 -11319 5419 27481 38558 25071
6293B5071l0218l1176J485J2976J3752M564L938j0748J7688j6504k3760M880M346
$$ 25071 -5147 -36323 -34838 -21862 -8110 -3546 392 -10356 7332 -9172 -32932 -28052 -23706
6280b3706j3943q706o895m335J2633M4024K8583o906l016j764k6569k1816J9104
$$ -23706 -37649 -46355 -53250 -57585 -44952 -928 27655 20749 17733 15969 -10600 -32416 -13312
6267a3312J6695k1071J6772L0943K644N644j1569r001q457n954m621K2426J8367
$$ -13312 3383 -17688 -916 30027 32671 38315 26746 17745 9288 3334 -1287 21139 39506
6254C9506p998j6087k3876m396J7975N421k18o513l640n626k1304k5951k95J2781
$$ 39506 31508 15421 -8455 -12851 5124 10545 10327 3814 174 -5452 -26756 -52707 -53002 -40221
6240d0221N436K4963K0618r739p111K205P949l8150l329K127J6727L1741R334
$$ -40221 -34785 -9822 10796 1057 -6054 -3849 4100 -34050 -37379 -35252 -18525 13216 22550
6227B2550J933l654p83o391J266k4285M549J5846L04j1145j134r82l531j1346
$$ 22550 24483 20829 20046 13655 14921 -9364 -4815 11031 11335 190 -944 -1926 -5457 -16803
6213a6803J141L5984K0893R097Q432j9383j6355P432K4002m627l1647k3432j0829
$$ -16803 -15662 20322 41215 50312 58744 39361 23006 30438 54440 49813 18166 -5266 -16095
6200a6095L4292J7808l6432k4562J6183K6951q230m0397j2598r901J4149L6583
$$ -16095 18197 36005 -427 -24989 -8806 18145 9915 -30482 -43080 -52981 -38832 -2249
6188b249R647K335J0440k6960J1392O429p960j1147m665L086n834j8099l096Q821
$$ -2249 7398 9733 20173 -6787 4605 11034 3074 -8073 -12738 -9652 -15486 -33585 -36681 -27860
6174b7860O581m624J584M420j1420J30K1973L1568L6798j7675l7410l6768j2543
$$ -27860 -21279 -25903 -24319 -19899 -31319 -31189 -9216 22352 59150 41475 4065 -32703 -45246
6161d5246j3629L751K3553l889K007L664J9972o376j2057J2368j6527K2716K763
$$ -45246 -58875 -55124 -31571 -35460 -33453 -29789 -9817 -16193 -28250 -15882 -32409 -9693 -6930
6148f930k4918L9589n802j8293o077N710J4246J2480O523k7839o468J5506Q144
$$ -6930 -31848 7741 1939 -16354 -22431 -16721 -2475 10005 16528 -11311 -17779 -2273 5871
6135E871n097J2361R686K454m974P29k5655j5864P579K9486P981j7236J1232L858
$$ 5871 774 13135 22821 25275 20301 21030 -4625 -20489 -12910 16576 24557 7321 18553 22411
6121B2411j6430J7411K996l6256J720J8553K393O61R080j7043o399J2124j0833
$$ 22411 5981 23392 26388 -9868 -8148 10405 12798 13459 22539 5496 -903 11221 388
6108C88l7933K5743J1392j4237k680j5394R209J512J5046Q793J9539M053j7193
$$ 388 -37545 -11802 -410 -14647 -17327 -32721 -23512 -22000 -6954 1839 21378 25431 8238
6095H238j2099k1675R856M660Q067n901m933l977K648K1096L2006n867j6834k759
$$ 8238 -3861 -25536 -15680 -11020 -2953 -8854 -13787 -17764 -15116 5980 37986 32119 15285 12526
6081A2526k302P158l168l452L232l538o804J8607M540j7807p477M02j6122j1294
$$ 12526 10224 17382 14214 10762 13994 10456 3652 22259 26799 8992 1515 1917 -14205 -25499
6067b5499o605N272J7326l273j063j0933j4845J3660k400M709L2438j0254j3371
$$ -25499 -32104 -26832 -9506 -12779 -13842 -24775 -39620 -25960 -28360 -23651 8787 -1467 -14838
6054a4838J9788j8631j226J6215r43o105j4506J8488L855q172j2939j893P122
$$ -14838 4950 -13681 -14907 1308 365 -5740 -20246 -1758 2097 -6075 -19014 -20907 -13785
6041a3785o28j4132r327K907K6967l112L871J8499L8108k7427m7022J3566K6314
$$ -13785 -14413 -28545 -37872 -34965 -7998 -11110 -7239 11260 49368 21941 -25081 -11515 14799
6028A4799K7679k5781k1383J1526J0686K726J0837j1622k4690k976J622J532K589
$$ 14799 42478 16697 -4686 6840 17526 20252 31089 19467 -5223 -8199 -6577 -5045 -2456
6015b456J2567j189j7243J4210K124K482L782K872J4456j3338k4583M845J7185
$$ -2456 10111 8922 -8321 5889 8013 10495 14277 17149 31605 18267 -6316 -1471 15714
6002A5714L083K796R533n521k9426k2703M73K3807N948R087k1285r649K2119K367
$$ 15714 18797 21593 31126 25605 -3821 -26524 -26051 -2244 3704 12791 -8494 -18143 3976 6343
5988F343J1356n629K2727J5564R96k7393L476j3616l4508l5407L849K5827K1853
$$ 6343 17699 12070 34797 50361 51357 23964 27440 13824 -20684 -56091 -52242 -26415 -4562
5975d562J7484j209j0966j1619j2581P207Q965K850J3777M83j6893k0454K6602
$$ -4562 12922 11713 747 -10872 -23453 -16246 -7281 -4431 9346 9829 -7064 -27518 -916
5962i16L8676J6645q006l6830k7190j37r218K5958L1893J2220m8953k1893J0843
$$ -916 37760 54405 46399 9569 -17621 -17758 -26976 -1018 30875 43095 -5858 -27751 -16908
5949a6908J6830K5690N003j3100O478k4470L43J5585j7853l5180O291M294M007
$$ -16908 -78 25612 30615 17515 23993 -477 -134 15451 -2402 -37582 -31291 -26997 -22990
5936b2990j090q092K4652p468O070k46j8795o024J3621j1559k5805J5275J668
$$ -22990 -24080 -32172 -7520 -14988 -8918 -9164 -27959 -33983 -20362 -31921 -57726 -42451 -40783
5923d0783j3843K1253o380K477J5732l348J5191K2964j5826l590R177k781o862
$$ -40783 -54626 -33373 -39753 -37276 -21544 -24892 -9701 13263 -2563 -6153 3024 243 -6619
5910f619L021m596K2933J4057Q69m6303j1005L540j3529K646n333K6936K7950
$$ -6619 -3598 -8194 14739 28796 29665 -16638 -27643 -24103 -37632 -34986 -40319 -13383 14567
5897A4567L41j8596L282J5161Q993R209l0143l6134m673J5468p395l023M445J1851
$$ 14567 14908 -3688 -406 14755 23748 32957 2814 -33320 -37993 -22525 -29920 -32943 -28498 -16647
5883a6647J4881K40R130k1780k4895M108J9758K0513l6542j0577Q314p709J4652
$$ -16647 -1766 -1526 7604 -14176 -39071 -34963 -15205 5308 -31234 -41811 -33497 -41206 -26554
5870b6554j0384j5451L516J6117J6597l02N759K280P625k2323J1250n484J9876
$$ -26554 -36938 -52389 -48873 -32756 -16159 -16461 -10702 -8422 -797 -23120 -11870 -17354 2522
5857B522J1724k3846J0656K1072M550p926O794R941k1934k0843k8130k3199r552
$$ 2522 14246 -9600 1056 22128 26678 18752 25546 35487 13553 -7290 -35420 -58619 -68171
5844f8171j061R653R348J5917K4901k203Q211K7149J697K381M301j4114j1989
$$ -68171 -69232 -59579 -50231 -34314 -9413 -11616 -3405 23744 25441 27822 32123 18009 6020
5831F020R905j6362k8378k2590j842l405j1343K9411m650q044m274L2468N8695
$$ 6020 15925 -437 -28815 -51405 -53247 -56652 -67995 -38584 -43234 -51278 -55552 -23084 35611
5818C5611N790m1621k3938m324J1861P021j0914j9998N921J7004J4376O638o153
$$ 35611 41401 -220 -24158 -28482 -16621 -9600 -20514 -40512 -34591 -17587 -3211 3427 -2726
5805b726j9491j8494J364J3072j1J6142k034k0606k256l024J5957J0901m0431
$$ -2726 -22217 -40711 -39347 -26275 -26286 -10144 -12178 -32784 -35040 -38064 -22107 -11206 -51637
5792e1637j6102k166J7756P749k293J6918M807q944j0913J5257M0066J0326k0141
$$ -51637 -67739 -69905 -52149 -44400 -46693 -29775 -24968 -33912 -44825 -29568 10498 20824 683
5779F83q76P831j782l3589j3332M1130J9868k5409k2572J1292J4392j6124N096
$$ 683 -193 7638 5856 -27733 -41065 65 19933 -5476 -28048 -16756 -2364 -18488 -13392
5766a3392j9702J386K1881O884n116J3679o724J6739j0695N147j0028l769j5552
$$ -13392 -33094 -31708 -9827 -2943 -8059 5620 -1104 15635 4940 10087 59 -3710 -19262
5753a9262m641J5028k314J2996J0015K446m55j8212m384P725R861J7091J0522
$$ -19262 -23903 -8875 -11189 1807 11822 14268 13813 -4399 -8783 -1058 8803 25894 36416
5740C6416q05j8001k6521L380J0095l547j8643m904l566K354M530q764K0577J3427
$$ 36416 35611 17610 -8911 -5531 4564 1017 -17626 -22530 -26096 -23742 -19212 -27976 -7399 6028
5726F028L853n742J6946r412o709J5660r946j8053k180l449J2318q137n392J8499
$$ 6028 9881 4139 21085 11673 4964 20624 10678 -7375 -9555 -13004 -686 -8823 -14215 4284
5712D284Q475j3623j0630P554j0572p670j539j2275j3643K0283K9388L2418J8516
$$ 4284 12759 -864 -11494 -3940 -14512 -22182 -23721 -35996 -49639 -29356 32 32450 50966
5699E0966J1506k3711k7956j2882n771l475m417J86J636J3520j3640o494K1243
$$ 50966 62472 38761 10805 -2077 -7848 -11323 -15740 -15554 -13918 -398 -14038 -20532 711
5686G11K583j2467P727j5433p953P768r689J781j8253M043J651K0119R456n14
$$ 711 3294 -9173 -1446 -16879 -24832 -17064 -26753 -24972 -43225 -39182 -37531 -17412 -7956 -8470
5672h470K273J646j8804l804J0085J193j9098K934R872k895J35j190j524J7160
$$ -8470 -6197 -4551 -23355 -27159 -17074 -15881 -34979 -32045 -22173 -25068 -24933 -26123 -27647 -10487
5658a0487P227K1931j3285j4083r471l70L9115J3593j1994j4131o902j188l0791
$$ -10487 -3260 18671 5386 -8697 -18168 -18538 20577 34170 22176 8045 1143 -45 -30836
5645c0836j5432K6529J0865q801m434k036j388r393l782J4448j2658L366M085
$$ -30836 -46268 -19739 -8874 -17675 -22109 -24145 -25533 -34926 -38708 -24260 -36918 -33552 -29467
5632b9467J1100K6227j020J47n850j1438k1955J2465L7666j974j2158K0125N998
$$ -29467 -18367 7860 6840 6987 1137 -10301 -32256 -19791 17875 15901 3743 23868 29866
5619B9866k5395j1759L61K75J0679m783j8323k7076P083k667Q48J3672J3747J842
$$ 29866 4471 -7288 -6927 -6652 4027 -756 -19079 -46155 -39072 -41739 -40891 -27219 -13472 -11630
5605a1630J0789j6840N655k961n635j799L14M177J1587p395o892Q928P915J2309
$$ -11630 -841 -17681 -12026 -14987 -20622 -22421 -22107 -17930 -6343 -13738 -20630 -11702 -3787 8522
5591H522J1759K0819k8990l1861p867L4632J2852j6189r294J246q135k1964R918
$$ 8522 20281 41100 12110 -19751 -27618 7014 19866 3677 -5617 -4371 -12506 -34470 -24552
5578b4552K0344j3260J0285Q865J4587j8287j1086j6093m308j136N382N692j4613
$$ -24552 -4208 -17468 -7183 1682 16269 -2018 -13104 -29197 -33505 -34641 -29259 -23567 -38180
5565c8180m887J8623K2797J6305r310J489K0443j354l036j5641l1098r465j516
$$ -38180 -43067 -24444 -1647 14658 5348 6837 27280 25926 22890 7249 -23849 -33314 -34830
5552c4830K6912J4534O409k3971j3893k1499J2528O768j3582q178K0403J7076
$$ -34830 -7918 6616 13025 -10946 -24839 -46338 -33810 -27042 -40624 -48802 -28399 -11323
5540a1323O003j7631j1482L2792P167q608k6443L137J4765R634m412r92J2311
$$ -11323 -5320 -22951 -34433 -1641 5526 -3082 -29525 -26388 -11623 -1989 -6401 -7393 4918
5527D918k9321j309o16O684J579R85j0750j3637L3195J9648N105m785o443J4548
$$ 4918 -24403 -25712 -26328 -19644 -18065 -17080 -27830 -41467 -8272 11376 16481 11696 5253 19801
5513A9801n174j5331J4805r598j9404L162j862j3768k5445M882M3744K7040P045
$$ 19801 14627 -704 14101 4503 -14901 -11739 -13601 -27369 -52814 -47932 -4188 22852 29897
5500B9897j6460r925q282q183l1045n803K8800L4993J5282j3790j4117Q38L891
$$ 29897 13437 3512 -4770 -12953 -43998 -49801 -21001 13992 29274 15484 1367 2205 6096
5487F096N528j167k442j1228k8406k2298J944J7379m615J2430K8154K3683l5979
$$ 6096 11624 10457 8015 -3213 -31619 -53917 -51973 -34594 -39209 -26779 1375 25058 -10921
5474a0921r898j691j456K3407l098j6609j0777j3354P653J9528K115J3276j4753
$$ -10921 -20819 -22510 -23966 -559 -3657 -20266 -31043 -44397 -36744 -17216 -15101 -1825 -16578
5461a6578J7089J6931M426j2675k6963j3680K3455O758l0046r414J8105n655N092
$$ -16578 511 17442 21868 9193 -17770 -31450 -7995 -1237 -31283 -40697 -22592 -28247 -23155
5448b3155J1835j4961P818J5875K929k3404j956j771k1014k4923J1323K6265P451
$$ -23155 -11320 -26281 -18463 -2588 341 -23063 -25019 -26790 -47804 -72727 -61404 -35139 -27688
5435b7688j495J5192o647k335j0360l808J3427p927j2587P136J8232r726j6328
$$ -27688 -29183 -13991 -20638 -22973 -33333 -37141 -23714 -31641 -44228 -37092 -18860 -28586 -44914
5422d4914q362Q390K2199p93M391K1882J5396j6764j6580k531n032k2576J2220
$$ -44914 -53276 -44886 -22687 -23480 -19089 2793 18189 1425 -15155 -17686 -22718 -45294 -33074
5409c3074K6052j2142P070j6185l583L573N490J376p114l430O92J1232L61P740
$$ -33074 -7022 -19164 -12094 -28279 -31862 -28289 -22799 -21423 -28537 -31967 -31275 -20043 -19682 -11942
5395a1942J0561p245j8227J6383K3175k7604j5440m415o301L5207K6087j7691
$$ -11942 -1381 -8626 -26853 -10470 12705 -14899 -30339 -34754 -41055 -5848 20239 2548
5383B548M890K8259k5133k3365K6854j4891l0584J0275j5636k1346K0308L0661
$$ 2548 7438 35697 10564 -12801 14053 -838 -31422 -21147 -36783 -58129 -37821 -7160
5371g160K844j6906J1341J6804K4227o014n1625j8427O320J2143J0322N874K53
$$ -7160 -4316 -21222 -9881 6923 31150 25136 -26489 -44916 -38596 -26453 -16131 -10257 -10004
5358a0004k0556r194M19L379R614K1775p361J3870j2412M286j0119R25N243L792
$$ -10004 -30560 -39754 -39335 -35956 -26342 -4567 -11928 1942 -10470 -6184 -16303 -15378 -10135 -6343
5344f343R416K058N08k842N216p799o797L775j6057L9408k1169j0608n212j8087
$$ -6343 3073 5131 5639 2797 8013 214 -6583 -2808 -18865 20543 -626 -11234 -16446 -34533
5330c4533K3021K6694m306q327j6796j1078R138K2951j2896k8065J3523J0643
$$ -34533 -11512 15182 10876 2549 -14247 -25325 -16187 6764 -6132 -34197 -20674 -10031
5318a0031o247n471Q326K0138K995L074M650j9476k7718J583J3883j1775j456
$$ -10031 -16278 -21749 -13423 6715 9710 12784 17434 -2042 -29760 -28177 -14294 -26069 -27525
5305b7525j2228j7311L5287M226m190l030o082L334O30k3104k783o480J3476O693
$$ -27525 -39753 -57064 -21777 -17551 -21741 -24771 -30853 -27519 -26889 -49993 -52776 -59256 -45780 -39087
5291c9087P254J8713j6808j4823m187R764L1035J1500M480r478m627N763l233
$$ -39087 -31833 -13120 -29928 -44751 -48938 -39174 -8139 3361 7841 -1637 -6264 -501 -3734
5278c734J0120r359k6121K2008M553p415K6286p561j4401M895M596m641o674j3079
$$ -3734 6386 -2973 -29094 -7086 -2533 -9948 16338 8777 -5624 -729 3867 -774 -7448 -20527
5264b0527j6976J8534K0025N357l876J1747N836J923m786r402j7289J099p279
$$ -20527 -37503 -18969 1056 6413 2537 14284 20120 22043 17257 7855 -9434 -8335 -15614
5251a5614k909K452j1365k4444Pl886J8204M3815Q981j2992r313q115L062n476
$$ -15614 -18523 -16071 -27436 -51880 -51873 -55759 -37555 6260 15241 2249 -7064 -15179 -12117 -17593
5237a7593j5675N085J5175J3619M067j9748j7984M281K5649O644N312j1363J0963
$$ -17593 -33268 -28183 -13008 611 4678 -15070 -33054 -28773 -3124 3520 8832 -2531 8432
5224H432j4335K680r926k2194o607J5692J5127N524j5257l06Q299J4143J0255
$$ 8432 -5903 -3223 -13149 -35343 -41950 -26258 -11131 -5607 -20864 -21170 -12871 1272 11527
5211A1527k807k611J3228q481k0843n971L225J7933J1231n187K728J6736p066
$$ 11527 8720 6109 19337 10856 -9987 -15958 -12733 5200 16431 11244 13972 30708 23642
5198B3642k3738q180j6487J416J473P226R860j1968p229R140J1067p238j9078
$$ 23642 -96 -8276 -24763 -23347 -21874 -14648 -4788 -16756 -23985 -14845 -3778 -11016 -30094
5185c0094J0945N999L273J979p723l3526J689L827R397K1083k3117J931J2644
$$ -30094 -19149 -13150 -9877 -7898 -15621 -49147 -47458 -43631 -34234 -13151 -36268 -34337 -21693
5172b1693n610J3674N847q108J581N428N01O629L882p685k863Q90J5152k256k6654
$$ -21693 -27303 -13629 -7782 -15890 -14309 -8881 -8380 -1751 2131 -5554 -8417 -7527 7625 5369 -21285
5157b1285l2093J347K042M160J3098p122J3478j148n715j2367r993P893J7824
$$ -21285 -53378 -52031 -49989 -45829 -32731 -39853 -26375 -27523 -33238 -45605 -55598 -47705 -29881
5144b9881p491J6268L6586J2829n102r392K47j2240j1623K9337o045j3369P301
$$ -29881 -37372 -21104 15482 28311 23209 13817 14064 1824 -9799 19538 13493 124 7425
5131G425o248j1996j0442j7750l387O408O050r24R275K0151K2271K7449J9097
$$ 7425 1177 -10819 -21261 -39011 -42398 -35990 -29940 -30864 -21589 -1438 20833 48282 67379
5118F7379j123k8637k5851J503R957J4771m0013k6525J1767J7346R556m917K0024
$$ 67379 66256 37619 11768 13271 23228 37999 -2014 -28539 -16772 574 10130 5213 25237
5105B5237J3585P95m920k9348q375p651m098k163R755R174j5027o811j3230k2457
$$ 25237 38822 39617 34697 5349 -3026 -10677 -14775 -16938 -7183 1991 -13036 -19847 -33077 -55534
5091e5534m451P655J7043J7802M535J6405m923Q727J9029K170k1112R04l2474
$$ -55534 -59985 -52330 -35287 -17485 -12950 3455 -1468 7259 26288 28458 7346 8250 -24224
5078b4224P691J979j118K718n850J1178K2813j650l1263k3646J7658L9116K6994
$$ -24224 -16533 -14554 -15672 -12954 -18804 -7626 15187 13537 -17726 -41372 -23714 15402 42396
5065D2396O724p7j0179P14J0698q959j0908K424j9139k2636o911K1283N331q932
$$ 42396 49120 49043 38864 39578 50276 41317 30409 32833 13694 -8942 -15853 5430 10761 1829
5051A829J929J1892j111k3045k0225L323k0184j2087K423K2768J711M505J3752
$$ 1829 3758 15650 14539 -8506 -28731 -25408 -45592 -57679 -55256 -32488 -30777 -26272 -12520
5038a2520j0067R169J1219J952K8963J138k5772o314R742J1031k770j5261j1509
$$ -12520 -22587 -13418 -2199 -247 28716 29854 4082 -2232 7510 18541 15771 510 -10999
5025a0999O364J0004J62j4990j3472J5744J5809M429J4306l859m773j0265J1075
$$ -10999 -4635 5369 5531 -9459 -22931 -7187 8622 13051 27357 23498 18725 8460 19535
5012A9535N297R357j3590J3283j4960l2469o485m276j7520R823K4784j3257q38
$$ 19535 24832 34189 20599 33882 18922 -13547 -20032 -24308 -41828 -32005 -7221 -20478 -21316
4999b1316K2134J1301m963J3645j0076k5350k546K800j5646J0924j0097K0627
$$ -21316 818 12119 7156 20801 10725 -14625 -17171 -14371 -30017 -19093 -29190 -8563
4987h563J0645j0340L659p101p61P807L425r191J2770P292J1895N160j4087J6615
$$ -8563 2082 -8258 -4599 -11700 -12461 -4654 -1229 -10420 2350 9642 21537 26697 12610 29225
4973B9225p127j3250O948l645j7418j3524k744p647K095J5756J2575l024j5200
$$ 29225 22098 8848 15796 12151 -5267 -18791 -21535 -29182 -27087 -11331 1244 -1780 -16980
4960a6980j7459m566m710j321o788R888L0692J8333K0111j5282l5748n202J8639
$$ -16980 -34439 -39005 -43715 -45036 -51824 -41936 -11244 7089 27200 11918 -23830 -29032 -10393
4947a0393K566J1337Q459K151l3868j9741J9260k391j2078J0535K8820k442k4083
$$ -10393 -7827 3510 11969 14120 -19748 -39489 -20229 -22620 -34698 -24163 4657 2215 -21868
4934b1868J5511J5398m778k9877j070K3115n588M747J8075Q015j3883K094O67
$$ -21868 -6357 9041 4263 -25614 -26684 -3569 -9157 -4410 13665 21680 7797 9891 10558
4921A0558J0685j884k234j5306m003J3237J855L572K4671j5495k6755j6459j3063
$$ 10558 21243 19359 17125 1819 -2184 11053 12908 16480 41151 25656 -1099 -17558 -30621
4908c0621o987N203J9560M355o429J4744K841J7318k1953l1031J827n792J3871
$$ -30621 -37608 -32405 -12845 -8490 -14919 -175 2666 19984 -1969 -33000 -31173 -36965 -23094
4895b3094K5417J8198M487n23q820N908N058l1821L438K3800q163k6277Q652k399
$$ -23094 2323 20521 25008 24485 15665 21573 26631 -5190 -1752 22048 13885 -12392 -3740 -6139
4881f139j5849q009J300L1607Q488j8575K501o938P123m944j3215J0755K0519
$$ -6139 -21988 -29997 -28697 2910 11398 -7177 -4676 -11614 -4491 -9435 -22650 -11895 8624
4868H624J090j8441O307k573l563k350k6675l103O112K7540L324J8919K3122j6514
$$ 8624 9714 -8727 -2420 -4993 -8556 -10906 -37581 -40684 -34572 -7032 -3708 15211 38333 21819
4854B1819o006j4052n6896J3991M4049O723k2611N42P656k792p325J2094O097
$$ 21819 15813 1761 -55135 -41144 2905 9628 -12983 -12441 -4785 -7577 -14902 -2808 3289
4841C289j6231m318N927j5622L908J7326j7149q969L9365J9475j5489m070P290
$$ 3289 -12942 -17260 -11333 -26955 -23047 -5721 -22870 -31839 7526 27001 11512 7442 14732
4828A4732N463K4729j1877k7381K0205Q926J0745k8538k8487j5016J9341n49k0736
$$ 14732 20195 44924 33047 5666 25871 34797 45542 17004 -11483 -26499 -7158 -7707 -28443
4815b8443l262Q082J1106J6525L2589N996m236l1520k9412R745K1522J5134J3211
$$ -28443 -31705 -23623 -12517 4008 36597 42593 38357 6837 -22575 -12830 8692 23826 37037
4802C7037K330k1645k0492k0103o782J1003J6222K2723p402n639o980J5443P639
$$ 37037 39367 17722 -2770 -22873 -29655 -18652 -2430 20293 12891 7252 272 15715 23354
4789B3354Q282k1723j0160j8260K144j5179j1905J2940l114O598m54R802N428
$$ 23354 31636 9913 -247 -18507 -16363 -31542 -43447 -30507 -33621 -27023 -27477 -17675 -12247
4776a2247M149k5201q808O698K6869J3366j8255r316o324K1166K2777P748L07
$$ -12247 -8098 -33299 -42107 -35409 -8540 4826 -13429 -22745 -29069 -7903 14874 22622 22929
4763B2929J0084n146l430R047r556j3376p717J757k2381k5045m549J6466m00k8881
$$ 22929 33013 27867 24437 33484 23928 10552 2835 4592 -17789 -42834 -47383 -30917 -31317 -60198
4749f0198Q763J5926J4135M676K8312K9763j5333l6025j7165r266R616K0061L995
$$ -60198 -51435 -35509 -21374 -16698 11614 41377 26044 -9981 -27146 -36412 -26796 -6735 -2740
4736b740k2834n812N719J810l089K997J3031R009P029Q700o771K853o025P888
$$ -2740 -25574 -31386 -25667 -23857 -26946 -23949 -10918 -1909 5120 13820 7049 9902 3877 11765
4722A1765j998p453l999m472n762q929J4625K5058O377k6221j4737J3736n399
$$ 11765 9767 2314 -1685 -6157 -11919 -20848 -6223 18835 25212 -1009 -15746 -2010 -7409
4709g409k8573O722M310M750j5688q289J7208J5051J0452j024k418j7217N046
$$ -7409 -35982 -29260 -24950 -20200 -35888 -44177 -26969 -11918 -1466 -2490 -4908 -22125 -17079
4696a7079j0570K0715q683Q904K4527o104n720j6275m071R336J1106m824n641
$$ -17079 -27649 -6934 -15617 -6713 17814 11710 5990 -10285 -14356 -5020 6086 1262 -4379
4683d379R540j4885j1405K34j1002J3016k356J2189J4657R899NP303M214l959
$$ -4379 5161 -9724 -21129 -20895 -31897 -18881 -21237 -9048 5609 15508 15513 22816 27030 23071
4669B3071k7320k4337q558K5479J3812j8499j3556K1216q481P298K323J4621J1289
$$ 23071 -4249 -28586 -37144 -11665 2147 -16352 -29908 -8692 -17173 -9875 -7552 7069 18358
4656A8358l614k768k6234m998J013q962J3753N640n01n124j197q122K5305J6534
$$ 18358 14744 11976 -14258 -19256 -18243 -27205 -13452 -7812 -8313 -13437 -14634 -22756 2549 19083
4642A9083j6657Q50R95m072j972J2530L475p288o626L275p672k820j2105j2463
$$ 19083 2426 3276 4271 199 -1773 10757 14232 6944 318 3593 -4079 -6899 -19004 -31467
4628c1467K5499J008r093J601r873N652l851J807m741K6450Q967p776n825J3714
$$ -31467 -5968 -4960 -14053 -12452 -22325 -16673 -20524 -18717 -23458 2992 11959 4183 -1642 12072
4614A2072k0358j123J5466l858L71J3160q593k4765j7403K3061K4664J1659l0446
$$ 12072 -8286 -9409 6057 2199 2570 15730 7137 -17628 -35031 -11970 12694 24353 -6093
4601f093l4342r645P745L143K6030J6171K3595o724m1550k1758k368M200J7683
$$ -6093 -40435 -50080 -42335 -39192 -13162 3009 26604 19880 -21670 -43428 -45796 -41596 -23913
4588b3913N036L1269L658p257j7414q690J1817j0505J2699J9175Q682k3418k1156
$$ -23913 -18877 12392 16050 8793 -8621 -17311 -5494 -15999 -3300 15875 24557 1139 -20017
4575b0017o879N226j944p784m19K774n625k0440J912R993J3481P635J9011J497
$$ -20017 -26896 -21670 -23614 -31398 -31817 -29043 -34668 -55108 -53196 -43203 -29722 -22087 -3076 -1579
4561a579j0923K2475K5216j1418k1889Q711K4074j2436k7408k2010r769N043n590
$$ -1579 -12502 9973 35189 23771 1882 10593 34667 22231 -5177 -27187 -36956 -31913 -37503
4548c7503L2277J4783J8269o995M038j5573j9905N087M481j7388L0727J5764J1495
$$ -37503 -5226 9557 27826 20831 24869 9296 -10609 -5522 -1041 -18429 12298 28062 39557
4535C9557k5303l0062J5419J1574j8842q619k2381K789K175q486J2652m718j4471
$$ 39557 14254 -15808 -389 11185 -7657 -16276 -38657 -35868 -33693 -42179 -29527 -34245 -48716
4522d8716O548J5464J797j128L465R84N602j3798J1417O976m108K0391J4254m104
$$ -48716 -42168 -26704 -24907 -26035 -22570 -21586 -15984 -29782 -18365 -11389 -15497 4894 19148 15044
4508A5044k0381j6315J7151J6760j4331j8772q243K3573L4368J9698l257o330
$$ 15044 -5337 -21652 -4501 12259 -2072 -20844 -29087 -5514 28854 48552 45295 38965
4496C8965r578L089l9044j0240L3615J3704j4198j9257j2733n26O166o10J1314
$$ 38965 29387 32476 -6568 -16808 16807 30511 16313 -2944 -15677 -16203 -10037 -10647 667
4483F67Q229j0452K0815J1876M266k3921j3725n761J3613P847J9673r736o440
$$ 667 8896 -1556 19259 31135 35401 11480 -2245 -8006 5607 13454 33127 23391 16951
4470A6951q462j1664J3206j6704q38K925N873O516Q666J2478P89M60J751j4691
$$ 16951 8489 -3175 10031 -6673 -7511 -4586 1287 7803 16469 28947 29736 30196 31947 17256
4456A7256l9045k7680J7367J5755k3659P990J0810J303J7888n117k5584j4406
$$ 17256 -21789 -49469 -32102 -16347 -40006 -32016 -21206 -19903 -2015 -7132 -32716 -47122
4444d7122q39j6175o779Q120K4641N401J2114K6354K617J4412j5487j844j5965
$$ -47122 -47961 -64136 -70915 -62795 -38154 -32753 -20639 5715 8332 22744 7257 5413 -10552
4431a0552O286K3477k3514k4177j0713j8937j237J9947K9538l071j7854l955m351
$$ -10552 -4266 19211 -4303 -28480 -39193 -58130 -59367 -39420 -9882 -12953 -30807 -34762 -39113
4418c9113j0811J416J2430P880N573r804M642J0064P769K0277k545l950j4734
$$ -39113 -49924 -48508 -36078 -28198 -22625 -32429 -27787 -17723 -9954 10323 7778 3828 -10906
4405a0906J0179k2556j2271P069L4214K045k80Q011K034j1444j7758o710L070
$$ -10906 -727 -23283 -35554 -28485 5729 7774 7494 15505 17539 6095 -11663 -18373 -15303
4392a5303R197O275N665L355k6567q638K277J2904n377Q311m580L3810R650o195
$$ -15303 -6106 169 5834 9189 -17378 -26016 -23739 -10835 -16212 -7901 -12481 21329 30979 24784
4378B4784n625j6342o329j2259j9519J7067N721k141k0380j639J3037J6628j1868
$$ 24784 19159 2817 -3512 -15771 -35290 -18223 -12502 -14643 -35023 -36662 -23625 -6997 -18865
4365a8865j6996r71K071k609o971K6379J0702N946J5357J4299j7998l466j3443
$$ -18865 -35861 -36832 -34761 -37370 -44341 -17962 -7260 -1314 14043 28342 10344 6878 -6565
4352f565l0402j5417R693K691L127L065L0304Q207j2212M742K5762j9290j6438
$$ -6565 -36967 -52384 -42691 -40000 -36873 -33808 -3504 4703 -7509 -2767 22995 3705 -12733
4339a2733j4302J7217J6008J3032l413N445J3487l8772l2024M065j7095r035J4183
$$ -12733 -27035 -9818 6190 19222 15809 21254 34741 -4031 -36055 -31990 -49085 -58120 -43937
4326d3937K1480J1516K710q364K2275J9682R229j3449j7394n302j194l2274j2053
$$ -43937 -22457 -10941 -8231 -16595 5680 25362 34591 21142 3748 -1554 -2748 -35022 -47075
4313d7075j0461P7J6629p783j7779j7675L0227K2797K437J2301J1147J2488J3707
$$ -47075 -57536 -57459 -40830 -48613 -66392 -84067 -53840 -31043 -28606 -16305 -5158 7330 21037
4300B1037j772j0184j7365o434K1806M956j4704J1212J176p821k2840j031M217
$$ 21037 19265 9081 -8284 -14718 7088 12044 -2660 8552 9728 1907 -20933 -21964 -17747
4287a7747J6486K51O613k926j1448p196O592k489j5111j8992K0255M2127J2225
$$ -17747 -1261 -1010 5603 2677 -8771 -15967 -9375 -11864 -26975 -45967 -25712 16415 28640
$$ [...]
##END NTUPLES=NMR SPECTRUM
##END=
