##TITLE=Analysis number 326135
Compound Code cc 62303
Book Reference 505/55
Project Code adrs
Chemist Name robb
##JCAMPDX= 6.0         $$ Bruker NMR JCAMP-DX V2.0
##DATA TYPE= NMR SPECTRUM
##DATA CLASS= NTUPLES
##ORIGIN= Bruker BioSpin GmbH
##OWNER= nmr
$$ XWIN-NMR		Version 3.5
$$ Thu Jan 25 10:02:02 2007 GMT Standard Time (UT+0h)  MAYBRIDGE\nmr@NMR_250MHZ
##.OBSERVE FREQUENCY= 250.131544655141
##.OBSERVE NUCLEUS= ^1H
##.ACQUISITION MODE= SIMULTANEOUS (DQD)
##.ACQUISITION SCHEME= undefined
##.AVERAGES= 16
##.DIGITISER RES= 18
##SPECTROMETER/DATA SYSTEM= dpx250
##.PULSE SEQUENCE= zg30
##.SOLVENT NAME= CDCl3
##.SHIFT REFERENCE= (INTERNAL, CDCl3, 0, 16.522)
##AUDIT TRAIL= $$ (NUMBER, WHEN, WHO, WHERE, WHAT)
$$ ##TITLE= Audit trail, XWIN-NMR		Version 3.5
$$ ##JCAMPDX= 5.01
$$ ##ORIGIN= Bruker BioSpin GmbH
$$ ##OWNER= nmr
$$ C:\u/data/dgb/nmr/ADRS/2020/pdata/1/auditp.txt
$$ ##AUDIT TRAIL=  $$ (NUMBER, WHEN, WHO, WHERE, WHAT)
(   1,<2007-01-25 10:01:40.59 +000>,<MAYBRIDGE\nmr>,<NMR_250MHZ>,
      <created by zg, POWCHK disabled, PULCHK disabled
       configuration hash MD5:
       49 4B E0 1D 92 C2 6B 37 9F E6 65 BC 52 41 86 1D
       data hash MD5: 64K
       67 64 00 40 21 9C E0 BA 43 1F B4 D0 C9 B5 10 18>)
(   2,<2007-01-25 10:01:54.65 +000>,<MAYBRIDGE\nmr>,<NMR_250MHZ>,
      <Start of raw data processing
       ef LB = 0.3 FT_mod = 6 PKNL = 1 SI = 32K 
       data hash MD5: 32K
       4E 34 47 49 A5 D5 C6 FA 61 23 64 53 71 DC 6D 0C>)
(   3,<2007-01-25 10:01:56.35 +000>,<MAYBRIDGE\nmr>,<NMR_250MHZ>,
      <apk 
       data hash MD5: 32K
       07 65 D7 18 1B FF CA 01 D0 4B 5F 1C EC 3B FB 27>)
(   4,<2007-01-25 10:01:57.15 +000>,<MAYBRIDGE\nmr>,<NMR_250MHZ>,
      <abs ABSG = 5 
       data hash MD5: 32K
       6C DE 90 67 87 03 3F C7 48 7E 76 97 E4 88 55 D9>)
$$ ##END=
$$ 
$$ hash MD5
$$ 17 D0 C7 52 D3 DE 0F 38 BC F7 38 D7 66 77 11 83
##$RELAX= 
##$RELAX= 
##$RELAX= 
##$RELAX= 
##$RELAX= 
##$RELAX= 
##$RELAX= 
$$ Bruker specific parameters
$$ --------------------------
##$DU= <C:\u>
##$EXPNO= 2020
##$NAME= <ADRS>
##$PROCNO= 1
##$TYPE= <nmr>
##$USER= <dgb>
##$AMP= (0..31)
100 100 100 100 100 100 100 100 100 100 100 100 100 100 100 100 100 100 
100 100 100 100 100 100 100 100 100 100 100 100 100 100 
##$AQSEQ= 0
##$AQ_mod= 3
##$AUNM= <au_zg>
##$AUTOPOS= <12 >
##$BF1= 250.13
##$BF2= 250.13
##$BF3= 250.13
##$BF4= 250.13
##$BF5= 500.13
##$BF6= 500.13
##$BF7= 500.13
##$BF8= 500.13
##$BYTORDA= 1
##$CFDGTYP= 0
##$CFRGTYP= 5
##$CHEMSTR= <none>
##$CNST= (0..31)
1 1 145 1 1 1 1 1 1 1 1 1 1 1 1 1 1 1 1 1 1 1 1 1 1 1 1 1 1 1 1 1 
##$CPDPRG= <>
##$CPDPRG1= <>
##$CPDPRG2= <>
##$CPDPRG3= <>
##$CPDPRG4= <mlev>
##$CPDPRG5= <mlev>
##$CPDPRG6= <mlev>
##$CPDPRG7= <mlev>
##$CPDPRG8= <mlev>
##$CPDPRGB= <>
##$CPDPRGT= <>
##$D= (0..31)
0 1 0 0 0 0 0 0 0 0.06 0 0 0 0 0 0 0.0002 0 0 0 0 0 0 0 0 0 0 0 0 0 0 
0 
##$DATE= 1169719299
##$DBL= (0..7)
120 120 120 120 120 120 120 120 
##$DBP= (0..7)
150 150 150 150 150 150 150 150 
##$DBP07= 0
##$DBPNAM0= <>
##$DBPNAM1= <>
$$ [...]
##$SUBNAM7= <"">
##$SUBNAM8= <"">
##$SUBNAM9= <"">
##$SW= 20.6930455092707
##$SWIBOX= (0..15)
0 0 3 0 0 0 0 0 0 0 0 0 0 0 0 0 
##$SW_h= 5175.983436853
##$TD= 65536
##$TD0= 1
##$TE= 293.16
##$TE2= 300
##$TE3= 300
##$TEG= 300
##$TL= (0..7)
0 120 120 120 120 120 120 120 
##$TP= (0..7)
150 150 150 150 150 150 150 150 
##$TP07= 0
##$TPNAME0= <>
##$TPNAME1= <>
##$TPNAME2= <>
##$TPNAME3= <>
##$TPNAME4= <>
##$TPNAME5= <>
##$TPNAME6= <>
##$TPNAME7= <>
##$TPOAL= (0..7)
0.5 0.5 0.5 0.5 0.5 0.5 0.5 0.5 
##$TPOFFS= (0..7)
0 0 0 0 0 0 0 0 
##$TUNHIN= 0
##$TUNHOUT= 0
##$TUNXOUT= 0
##$USERA1= <user>
##$USERA2= <user>
##$USERA3= <user>
##$USERA4= <user>
##$USERA5= <user>
##$V9= 5
##$VALIST= <valist>
##$VCLIST= <CCCCCCCCCCCCCCC>
##$VD= 0
##$VDLIST= <DDDDDDDDDDDDDDD>
##$VPLIST= <PPPPPPPPPPPPPPP>
##$VTLIST= <TTTTTTTTTTTTTTT>
##$WBST= 1024
##$WBSW= 4
##$XGAIN= (0..3)
0 0 0 0 
##$XL= 0
##$YL= 0
##$YMAX_a= 475948
##$YMIN_a= -509273
##$ZGOPTNS= <>
##$ZL1= 120
##$ZL2= 120
##$ZL3= 120
##$ZL4= 120
##$ABSF1= 16.522
##$ABSF2= -4.171173
##$ABSG= 5
##$ABSL= 3
##$ALPHA= 0
##$AQORDER= 0
##$ASSFAC= 0
##$ASSFACI= 0
##$ASSFACX= 0
##$ASSWID= 0
##$AUNMP= <proc_1d>
##$AZFE= 0.1
##$AZFW= 0.1
##$BCFW= 0
##$BC_mod= 0
##$BYTORDP= 0
##$COROFFS= 0
##$CY= 12.5
##$DATMOD= 1
##$DC= 0
##$DFILT= <>
##$DTYPP= 0
##$F1P= 14.0000005364418
##$F2P= -0.99999901652339
##$FCOR= 0.5
##$FTSIZE= 32768
##$FT_mod= 6
##$GAMMA= 0
##$GB= 0
##$INTBC= 1
##$INTSCL= 1
##$ISEN= 128
##$LB= 0.3
##$LEV0= 0
##$LPBIN= 0
##$MAXI= 10000
##$MC2= 0
##$MEAN= 0
##$ME_mod= 0
##$MI= 0
##$NCOEF= 0
##$NC_proc= -1
##$NLEV= 6
##$NOISF1= 0
##$NOISF2= 0
##$NSP= 0
##$NTH_PI= 0
##$NZP= 0
##$OFFSET= 16.522
##$PC= 1
##$PHC0= 230.1752
##$PHC1= 7.390606
##$PH_mod= 1
##$PKNL= yes
##$PPARMOD= 0
##$PSCAL= 4
##$PSIGN= 0
##$REVERSE= no
##$SF= 250.13
##$SI= 32768
##$SIGF1= 0
##$SIGF2= 0
##$SINO= 400
##$SIOLD= 32768
##$SREGLST= <1H.CDCl3>
##$SSB= 0
##$STSI= 32768
##$STSR= 0
##$SW_p= 5175.98343685301
##$SYMM= 0
##$S_DEV= 0
##$TDeff= 65536
##$TDoff= 0
##$TI= <Analysis number 999999
Compound Code 99
Book Reference 9
Project Code 9>
##$TILT= no
##$TM1= 0
##$TM2= 0
##$TOPLEV= 0
##$USERP1= <user>
##$USERP2= <user>
##$USERP3= <user>
##$USERP4= <user>
##$USERP5= <user>
##$WDW= 1
##$XDIM= 32768
##$YMAX_p= 369514319
##$YMIN_p= -155358
$$ End of Bruker specific parameters
$$ ---------------------------------
##NTUPLES= NMR SPECTRUM
##VAR_NAME=  FREQUENCY,     SPECTRUM/REAL,   SPECTRUM/IMAG
##SYMBOL=    X,             R,               I
##VAR_TYPE=  INDEPENDENT,   DEPENDENT,       DEPENDENT
##VAR_FORM=  AFFN,          ASDF,            ASDF
##VAR_DIM=   32768,         32768,           32768
##UNITS=     HZ,            ARBITRARY UNITS, ARBITRARY UNITS
##FACTOR=    0.157963299565203, 1,           1
##FIRST=     4132.6476996994, 0,             0
##LAST=      -1043.33573715361, 0,           0
##MIN=       -1043.33573715361, -155358,     0
##MAX=       4132.6476996994, 369514319,     0
$$ Real data points
##PAGE= N=1
##DATA TABLE= (X++(R..R)), XYDATA
$$ [...]
##PAGE= N=2
##DATA TABLE= (X++(I..I)), XYDATA
$$ plain form
18642 4257770 4403005 4552427 4736832 4929039 5077436 5157999 5144821 5028273 4902322 4859843
18632 4859843 4861681 4835628 4812898 4876452 5026366 5221504 5430584 5633379 5810977 5978321
18622 5978321 6157629 6363825 6594486 6844684 7106799 7371571 7625467 7868164 8123812
18613 8123812 8416315 8743394 9081981 9414783 9757126 10123700 10539328 11031133 11609648
18604 11609648 12262238 12985273 13781184 14668434 15697342 16899142 18284359 19863275 21616487
18595 21616487 23452299 25116181 26040928 25075333 20477480 11554019 1415202 -5270646
18587 -5270646 -7387527 -6600743 -4527217 -1977673 725817 3462518 6096349 8290667
18579 8290667 9315207 7783891 1942926 -8049953 -18017356 -23801222 -25368927 -24665727
$$ packed form
18642D257770J45235J49422J84405J92207J48397Q0563j3178j16548j25951m2479
18632D859843J838k6053k2730O3554J49914J95138K09080K02795J77598J67344
18622E978321J79308K06196K30661K50198K62115K64772K53896K42697K55648
18613H123812K92503L27079L38587L32802L42343L66574M15628M91805N78515
18604A1609648O52590P23035P95911Q87250J028908J201800J385217J578916J753212
18595B1616487J835812J663882R24747r65595m597853q923461j0138817o685848
18587e270646k116881P86784K073526K549544K703490K736701K633831K194318
18579H290667J024540j531316n840965r992879r967403n783866j567705P03200
$$ plain form
18571 -24665727 -23134051 -21435396 -19809625 -18328142 -17000648 -15820661 -14775803 -13855813
18563 -13855813 -13044293 -12311504 -11644169 -11050565 -10530111 -10073442 -9659500 -9272520 -8915108
18554 -8915108 -8602111 -8320978 -8041656 -7767013 -7520271 -7303540 -7098445 -6888369 -6667304
18545 -6667304 -6447273 -6235136 -6042647 -5870189 -5735629 -5628575 -5524083 -5402798 -5269402
18536 -5269402 -5140720 -5030010 -4933646 -4830351 -4714900 -4599352 -4481450 -4368262 -4259232 -4154605
18526 -4154605 -4055686 -3963977 -3882250 -3814835 -3755489 -3707327 -3660580 -3613689 -3568927 -3527290 -3480999
18515 -3480999 -3428207 -3372863 -3314683 -3256970 -3197124 -3137896 -3085747 -3031558 -2976570 -2927403 -2878458
18504 -2878458 -2833042 -2788332 -2745411 -2703375 -2660977 -2617180 -2573873 -2535898 -2497142 -2462635 -2426964
$$ packed form
18571b4665727J531676J698655J625771J481483J327494J179987J044858R19990
18563a3855813Q11520P32789O67335N93604N20454M56669M13942L86980L57412
18554h915108L12997K81133K79322K74643K46742K16731K05095K10076K21065
18545f667304K20031K12137J92489J72458J34560J07054J04492J21285J33396
18536e269402J28682J10710R6364J03295J15451J15548J17902J13188J09030J04627
18526d154605R8919R1709Q1727O7415N9346M8162M6747M6891M4762M1637M6291
18515c480999N2792N5344N8180N7713N9846N9228N2149N4189N4988M9167M8945
18504b878458M5416M4710M2921M2036M2398M3797M3307L7975L8756L4507L5671
$$ plain form
18493 -2426964 -2386612 -2352932 -2316888 -2284702 -2252669 -2219745 -2187059 -2158086 -2130543 -2097782 -2066706
18482 -2066706 -2039374 -2017379 -1992705 -1966419 -1938383 -1912972 -1889998 -1863188 -1839448 -1813576 -1790268
18471 -1790268 -1767520 -1739293 -1716016 -1690363 -1670634 -1655594 -1638488 -1622471 -1609570 -1594103 -1578352
18460 -1578352 -1562237 -1546486 -1528911 -1507048 -1486367 -1469837 -1453836 -1434312 -1420356 -1407485 -1394650
18449 -1394650 -1385502 -1380605 -1373959 -1364313 -1349325 -1336304 -1321867 -1308229 -1301551 -1291884 -1280227 -1267721
18437 -1267721 -1256454 -1243384 -1223370 -1203159 -1191026 -1176991 -1161764 -1149061 -1138996 -1130315 -1119807
18426 -1119807 -1113141 -1107976 -1099492 -1083195 -1065006 -1048584 -1029726 -1014837 -1003963 -992702 -978300 -964992
18414 -964992 -955560 -945583 -935984 -923670 -912939 -901306 -888866 -875448 -865249 -852923 -841940 -834938
$$ packed form
18493b426964M0352L3680L6044L2186L2033L2924L2686K8973K7543L2761L1076
18482b066706K7332K1995K4674K6286K8036K5411K2974K6810K3740K5872K3308
18471a790268K2748K8227K3277K5653J9729J5040J7106J6017J2901J5467J5751
18460a578352J6115J5751J7575K1863K0681J6530J6001J9524J3956J2871J2835
18449a394650R148M897O646R646J4988J3021J4437J3638O678R667J1657J2506
18437a267721J1267J3070K0014K0211J2133J4035J5227J2703J0065Q681J0508
18426a119807O666N165Q484J6297J8189J6422J8858J4889J0874J1261J4402J3308
18414i64992R432R977R599J2314J0731J1633J2440J3418J0199J2326J0983P002
$$ plain form
18402 -834938 -828712 -818405 -803784 -788425 -779677 -770781 -755240 -739724 -724755 -712070 -699858 -688735
18390 -688735 -690888 -695531 -704467 -715119 -719734 -715124 -705348 -692283 -679292 -668958 -657091 -642097 -629249
18377 -629249 -624362 -633212 -646968 -656210 -656406 -650384 -646127 -635472 -622928 -615644 -605043 -594056 -585018
18364 -585018 -577093 -566804 -556005 -548133 -543253 -533609 -521315 -511491 -503430 -499308 -493169 -488829 -480890
18351 -480890 -473067 -466579 -459614 -456085 -449903 -442071 -434504 -428062 -422409 -414822 -407064 -400539 -396571 -392597
18337 -392597 -384749 -381508 -378083 -370067 -361311 -354169 -345936 -341687 -336242 -325041 -312363 -304594 -299602 -290460
18323 -290460 -282112 -271079 -260789 -250366 -239188 -228491 -217080 -206778 -194790 -178824 -165463 -158348
18311 -158348 -154841 -154597 -158307 -154812 -149152 -145680 -144268 -138374 -125899 -115006 -135732 -232998 -362326
$$ packed form
18402h34938O226J0307J4621J5359Q748Q896J5541J5516J4969J2685J2212J1123
18390f88735k153m643q936j0652m615M610R776J3065J2991J0334J1867J4994J2848
18377f29249M887q850j3756r242j96O022M257J0655J2544P284J0601J0987R038
18364e85018P925J0289J0799P872M880R644J2294R824Q061M122O139M340P939
18351d80890P823O488O965L529O182P832P567O442N653P587P758O525L968L974
18337c92597P848L241L425Q016Q756P142Q233M249N445J1201J2678P769M992R142
18323b90460Q348J1033J0290J0423J1178J0697J1411J0302J1988J5966J3361P115
18311a58348L507K44l710L495N660L472J412N894J2475J0893k0726r7266j29328
$$ plain form
18298 -362326 -420005 -408049 -375395 -341213 -305982 -274508 -245091 -213149 -179151 -146735 -134420
18287 -134420 -165071 -271155 -383221 -415536 -397500 -366556 -340076 -318295 -297780 -281687 -265903
18276 -265903 -255941 -242852 -231896 -219736 -206746 -199700 -193307 -186376 -177102 -166527 -161750 -157427 -145875
18263 -145875 -134722 -131611 -127351 -117548 -106642 -94576 -84207 -72940 -59229 -46551 -28071 -8991
18251 -8991 8227 21492 29087 25806 8091 -18775 -46382 -68838 -88802 -112033 -131398 -148276
18239 -148276 -153582 -144797 -129946 -112767 -95512 -78718 -68367 -60203 -53371 -46815 -40616 -30852 -20943
18226 -20943 -15539 -9158 -1516 3585 11309 19511 22242 24118 33757 41532 47698 53115 57463 62618
18212 62618 65289 70976 76202 84218 91390 100763 104358 106108 109900 116353 124641 128767 133303 139933
$$ packed form
18298c62326n7679J1956L2654L4182L5231L1474K9417L1942L3998L2416J2315
18287a34420l0651j06084j12066l2315J8036L0944K6480K1781K0515J6093J5784
18276b65903R962J3089J0956J2160J2990P046O393O931R274J0575M777M323J1552
18263a45875J1153L111M260R803J0906J2066J0369J1267J3711J2678J8480J9080
18251h991J7218J3265P595l281j7715k6866k7607k2456j9964k3231j9365j6878
18239a48276n306Q785J4851J7179J7255J6794J0351Q164O832O556O199R764R909
18226b0943N404O381P642N101P724Q202K731J876R639P775O166N417M348N155
18212F2618K671N687N226Q016P172R373L595J750L792O453Q288M126M536O630
$$ plain form
18198 139933 143382 148584 155019 163145 171005 177843 185569 192990 200245 203798 211857 218763 220807 224934
18184 224934 228886 233716 241479 248982 257508 263808 266305 272565 280889 290904 298348 307882 317618 327840
18170 327840 332675 336586 346211 360057 370865 377621 383638 391701 398379 404076 410653 423051 435093
18157 435093 444755 452057 459021 469637 481954 493664 504893 509230 519491 534337 547960 559731
18145 559731 577478 595807 611934 630792 650888 669626 688781 709111 731207 752425 775413
18134 775413 801425 825244 853882 884652 922359 961316 1004643 1052157 1103811 1160631 1222322
18123 1222322 1291964 1373869 1463498 1566770 1685992 1829674 2002731 2217776 2492934 2854711
18113 2854711 3317088 3909475 4625932 5371058 5440233 2193850 -3406026 -5172033 -4527404
$$ packed form
18198A39933L449N202O435Q126P860O838P726P421P255L553Q059O906K044M127
18184B24934L952M830P763P503Q526O300K497O260Q324J0015P444R534R736J0222
18170C27840M835L911R625J3846J0808O756O017Q063O678N697O577J2398J2042
18157D35093R662P302O964J0616J2317J1710J1229M337J0261J4846J3623J1771
18145E59731J7747J8329J6127J8858K0096J8738J9155K0330K2096K1218K2988
18134G75413K6012K3819K8638L0770L7707L8957M3327M7514N1654N6820O1691
18123A222322O9642Q1905Q9629J03272J19222J43682J73057K15045K75158L61777
18113B854711M62377N92387P16457P45126O9175l246383n599876j766007O44629
$$ plain form
18104 -4527404 -3671068 -3017701 -2540135 -2182294 -1907023 -1683875 -1495314 -1339554 -1205901
18095 -1205901 -1088564 -987592 -898261 -820372 -751405 -691983 -636546 -582614 -537651 -495033 -456550
18084 -456550 -422193 -388199 -360018 -332990 -306945 -280433 -257006 -236493 -217386 -197571 -177980
18073 -177980 -156270 -138627 -124536 -112287 -98180 -83924 -68955 -55275 -42859 -25433 -13269
18062 -13269 -6406 5175 17046 24256 38537 49646 61459 73475 81170 89822 101963 114640
18050 114640 117442 123276 130202 137578 143887 154286 166126 174111 182327 187408 193739 202947 209299 216064
18036 216064 220311 225738 231945 237538 246089 253355 256472 264588 271389 275943 279842 285173 293835 301367
18022 301367 303861 309116 316452 322552 331540 345074 356148 362941 370704 374966 379102 383915 388438 390122
$$ packed form
18104d527404Q56336O53367M77566L57841K75271K23148J88561J55760J33653
18095a205901J17337J00972Q9331P7889O8967N9422N5437N3932M4963M2618L8483
18084d56550L4357L3994K8181K7028K6045K6512K3427K0513J9107J9815J9591
18073a77980K1710J7643J4091J2249J4107J4256J4969J3680J2416J7426J2164
18062a3269O863J1581J1871P210J4281J1109J1813J2016P695Q652J2141J2677
18050A14640K802N834O926P376O309J0399J1840P985Q216N081O331R208O352O765
18036B16064M247N427O207N593Q551P266L117Q116O801M554L899N331Q662P532
18022C01367K494N255P336O100Q988J3534J1074O793P763M262M136M813M523J684
$$ plain form
18008 390122 394657 399565 405556 413207 423677 435854 448306 457043 466521 474156 481634 488785 496096
17995 496096 502949 508092 511886 519512 526457 535305 545971 557466 569344 583027 596070 607436 622998
17982 622998 639523 652921 661318 669879 667871 651918 616003 570489 537703 530635 543535 562935
17970 562935 581060 594828 602925 605442 612579 621148 617644 594092 551401 506482 483910 487110 498166
17957 498166 512234 522198 529702 531424 528259 539586 552782 566311 579623 591325 601482 615265
17945 615265 630753 643164 651196 657277 666602 675724 685175 695301 703401 713299 721829 726648 733309
17932 733309 741286 747967 757684 767227 776250 780740 786930 793092 802750 810426 815553 823073 829642 835816
17918 835816 843546 852740 864332 877221 891331 900636 905256 907521 911183 918364 925602 932572 932371 931294
$$ packed form
18008C90122M535M908N991P651J0470J2177J2452Q737R478P635P478P151P311
17995D96096O853N143L794P626O945Q848J0666J1495J1878J3683J3043J1366J5562
17982F22998J6525J3398Q397Q561k008j5953l5915m5514l2786p068J2900J9400
17970E62935J8125J3768Q097K517P137Q569l504k3552m2691m4919k2572L200J1056
17957D98166J4068R964P504J722l165J1327J3196J3529J3312J1702J0157J3783
17945F15265J5488J2411Q032O081R325R122R451J0126Q100R898Q530M819O661
17932G33309P977O681R717R543R023M490O190O162R658P676N127P520O569O174
17918H35816P730R194J1592J2889J4110R305M620K265L662P181P238O970k01j077
$$ plain form
17904 931294 935806 947324 963607 976798 993565 1007026 1012821 1021264 1032250 1036523 1042022 1042354 1036883
17891 1036883 1029449 1031930 1046059 1061123 1073281 1086902 1099551 1112165 1125070 1139232 1147479 1150366
17879 1150366 1144013 1140641 1143386 1151151 1165177 1178007 1183895 1189275 1199333 1208583 1215504 1222813 1226820
17866 1226820 1235173 1259831 1287936 1312755 1328751 1336684 1343704 1354298 1363650 1370619 1377846 1385492 1385945
17853 1385945 1387339 1405978 1437997 1466562 1487223 1507159 1519827 1530915 1549815 1564549 1580172
17842 1580172 1605415 1630475 1644525 1654114 1667500 1680468 1692346 1707251 1724887 1738624 1753074
17831 1753074 1774182 1796972 1814571 1836357 1865203 1883537 1900093 1917618 1932505 1948427 1966997
17820 1966997 1984750 2003779 2023939 2046898 2070808 2094433 2114062 2138939 2165241 2186693 2213176
$$ packed form
17904I31294M512J1518J6283J3191J6767J3461N795Q443J0986M273N499L32n471
17891A036883p434K481J4129J5064J2158J3621J2649J2614J2905J4162Q247K887
17879A150366o353l372K745P765J4026J2830N888N380J0058R250O921P309M007
17866A226820Q353K4658K8105K4819J5996P933P020J0594R352O969P227P646M53
17853A385945J394J8639L2019K8565K0661J9936J2668J1088J8900J4734J5623
17842A580172K5243K5060J4050R589J3386J2968J1878J4905J7636J3737J4450
17831A753074K1108K2790J7599K1786K8846J8334J6556J7525J4887J5922J8570
17820A966997J7753J9029K0160K2959K3910K3625J9629K4877K6302K1452K6483
$$ plain form
17809 2213176 2240289 2263782 2288977 2314476 2338047 2363683 2390807 2421272 2451988 2482851 2517481
17798 2517481 2551309 2582066 2613379 2642897 2674610 2709420 2745189 2779657 2816680 2854807 2894143
17787 2894143 2935648 2981722 3029722 3073552 3116332 3158759 3209361 3259633 3312636 3364467 3414728
17776 3414728 3469561 3528736 3589536 3649942 3709240 3766840 3826935 3894086 3964114 4036967 4112096
17765 4112096 4193486 4275732 4357576 4445389 4534706 4627345 4718616 4817234 4925546 5039044 5153649
17754 5153649 5268190 5400992 5548053 5700063 5851591 6000710 6161291 6335393 6516204
17745 6516204 6714126 6927027 7150089 7386695 7636875 7914099 8225139 8566773 8930485
17736 8930485 9298590 9633326 9920229 10283863 10793293 11396030 12045660 12694926 13339842
$$ packed form
17809B213176K7113K3493K5195K5499K3571K5636K7124L0465L0716L0863L4630
17798B517481L3828L0757L1313K9518L1713L4810L5769L4468L7023L8127L9336
17787B894143M1505M6074M8000M3830M2780M2427N0602N0272N3003N1831N0261
17776C414728N4833N9175O0800O0406N9298N7600O0095O7151P0028P2853P5129
17765D112096Q1390Q2246Q1844Q7813Q9317R2639R1271R8618J08312J13498J14605
17754E153649J14541J32802J47061J52010J51528J49119J60581J74102J80811
17745F516204J97922K12901K23062K36606K50180K77224L11040L41634L63712
17736H930485L68105L34736K86903L63634N09430O02737O49630O49266O44916
$$ plain form
17727 13339842 14088641 15061579 16289579 17776539 19552301 21698247 24298133 27480727
17719 27480727 31372113 35693099 39002806 35972780 17355398 -8953469 -21120270 -19950256
17711 -19950256 -14979261 -9953923 -5397910 -1112493 3208126 7787996 12640135 17382428
17703 17382428 20089431 14124896 -7735388 -30976540 -38444919 -35983186 -31612249 -27710734
17695 -27710734 -24578937 -22146807 -20259965 -18683126 -17276004 -16029389 -14923764 -13957257
17687 -13957257 -13157194 -12494739 -11934874 -11439645 -10937358 -10427711 -9969244 -9617687 -9378561
17678 -9378561 -9129856 -8829970 -8523927 -8224248 -7941381 -7683902 -7449003 -7231962 -7025392
17669 -7025392 -6822966 -6629218 -6449420 -6281896 -6130377 -5994466 -5859470 -5729633 -5601340
$$ packed form
17727A3339842P48799R72938J228000J486960J775762K145946K599886L182594
17719B7480727L891386M320986L309707l030026j8617382k6308867j2166801J170014
17711a9950256M970995N025338M556013M285417M320619M579870M852139M742293
17703A7382428K707003n964535k1860284k3241152p468379K461733M370937L901515
17695b7710734L131797K432130J886842J576839J407122J246615J105625R66507
17687a3957257Q00063O62455N59865M95229N02287N09647M58467L51557K39126
17678i378561K48705K99886L06043K99679K82867K57479K34899K17041K06570
17669g025392K02426J93748J79798J67524J51519J35911J34996J29837J28293
$$ plain form
17660 -5601340 -5475486 -5357390 -5241018 -5128377 -5022676 -4926749 -4832669 -4741692 -4652897 -4570089
17650 -4570089 -4490098 -4414810 -4343341 -4268782 -4198580 -4129005 -4054131 -3983486 -3920561 -3864159 -3806210
17639 -3806210 -3750056 -3695099 -3641419 -3586536 -3538039 -3490200 -3443065 -3400153 -3359340 -3315014 -3276750
17628 -3276750 -3239291 -3200984 -3160211 -3121583 -3082607 -3045515 -3010330 -2977220 -2940633 -2900547 -2864891
17617 -2864891 -2834685 -2806699 -2779263 -2751744 -2722385 -2691947 -2664117 -2637992 -2607589 -2579224 -2552656
17606 -2552656 -2522378 -2498038 -2479322 -2458810 -2436302 -2414820 -2393277 -2368289 -2341906 -2318876 -2294191
17595 -2294191 -2268071 -2243749 -2219902 -2195316 -2170352 -2151580 -2141519 -2139517 -2139388 -2135320 -2124961 -2107182
17583 -2107182 -2088604 -2068468 -2044956 -2020797 -2002152 -1982219 -1965960 -1951810 -1943321 -1942715 -1942474 -1937950
$$ packed form
17660e601340J25854J18096J16372J12641J05701R5927R4080R0977Q8795Q2808
17650d570089P9991P5288P1469P4559P0202O9575P4874P0645O2925N6402N7949
17639c806210N6154N4957N3680N4883M8497M7839M7135M2912M0813M4326L8264
17628c276750L7459L8307M0773L8628L8976L7092L5185L3110L6587M0086L5656
17617b864891L0206K7986K7436K7519K9359L0438K7830K6125L0403K8365K6568
17606b552656L0278K4340J8716K0512K2508K1482K1543K4988K6383K3030K4685
17595b294191K6120K4322K3847K4586K4964J8772J0061K002J29M068J0359J7779
17583b107182J8578K0136K3512K4159J8645J9933J6259J4150Q489O06K41M524
$$ plain form
17571 -1937950 -1927295 -1917309 -1904818 -1890222 -1880914 -1870822 -1863813 -1866003 -1863490 -1848429 -1825988 -1803973
17559 -1803973 -1786649 -1771711 -1756520 -1743096 -1725461 -1710100 -1694037 -1691009 -1695624 -1700791 -1698206 -1681688
17547 -1681688 -1662908 -1645815 -1633252 -1617507 -1603212 -1588513 -1574576 -1562377 -1554065 -1548483 -1540820 -1529732
17535 -1529732 -1521050 -1513716 -1505689 -1494281 -1486815 -1480792 -1473097 -1468828 -1466517 -1461702 -1452254 -1438133 -1419029
17522 -1419029 -1400520 -1384253 -1373775 -1364206 -1353640 -1342746 -1335923 -1331413 -1332659 -1345991 -1358192 -1359659
17510 -1359659 -1351481 -1338796 -1328149 -1315955 -1305330 -1293996 -1283886 -1273000 -1263941 -1259153 -1255080 -1251320
17498 -1251320 -1244711 -1237450 -1228943 -1221192 -1215627 -1209368 -1201934 -1194435 -1190305 -1190529 -1183381 -1173416 -1167628 -1167977
17484 -1167977 -1164001 -1157254 -1149659 -1144459 -1137457 -1133407 -1127612 -1124627 -1118636 -1112708 -1110970 -1104582 -1099760 -1095595
$$ packed form
17571a937950J0655R986J2491J4596R308J0092P009k190K513J5061K2441K2015
17559a803973J7324J4938J5191J3424J7635J5361J6063L028m615n167K585J6518
17547a681688J8780J7093J2563J5745J4295J4699J3937J2199Q312N582P663J1088
17535a529732Q682P334Q027J1408P466O023P695M269K311M815R448J4121J9104
17522a419029J8509J6267J0478R569J0566J0894O823M510j246j3332j2201j467
17510a359659Q178J2685J0647J2194J0625J1334J0110J0886R059M788M073L760
17498a251320O609P261Q507P751N565O259P434P499M130k24P148R965N788l49
17484a167977L976O747P595N200P002M050N795K985N991N928J738O388M822M165
$$ plain form
17470 -1095595 -1087040 -1081690 -1076742 -1077166 -1076911 -1070496 -1061927 -1057302 -1053454 -1049901 -1046502 -1045995 -1040419 -1031115 -1025712
17455 -1025712 -1023297 -1017656 -1009742 -1004889 -1001165 -997301 -993186 -989694 -986715 -977592 -970030 -961681 -955691 -955888
17441 -955888 -975514 -999662 -1000606 -989457 -976762 -970838 -963408 -954956 -949323 -942319 -936893 -931152 -930520 -927004
17427 -927004 -923791 -919863 -913147 -908351 -902996 -897933 -891103 -885993 -887176 -887221 -885802 -880446 -875098 -877857 -879040
17412 -879040 -880682 -880936 -877072 -872416 -867147 -864301 -861058 -855307 -850038 -848037 -844030 -840639 -842367 -844129
17398 -844129 -846105 -845031 -840601 -835709 -833101 -828689 -823554 -819678 -814881 -812607 -807550 -803186 -802670 -802676 -801029
17383 -801029 -799558 -796929 -791533 -785176 -781021 -776637 -771143 -770031 -768351 -765070 -758967 -758188 -756469 -756812 -754670
17368 -754670 -750582 -746745 -741811 -737561 -736797 -737019 -735801 -733833 -729527 -728261 -725960 -722141 -721766 -717243 -713826
$$ packed form
17470a095595Q555N350M948m24K55O415Q569M625L848L553L399N07N576R304N403
17455a025712K415N641P914M853L724L864M115L492K979R123P562Q349N990j97
17441i55888j9626k4148r44J1149J2695N924P430Q452N633P004N426N741O32L516
17427i27004L213L928O716M796N355N063O830N110j183m5J419N356N348k759j183
17412h79040j642k54L864M656N269K846L243N751N269K001M007L391j728j762
17398h44129j976J074M430M892K608M412N135L876M797K274N057M364N16oJ647
17383h01029J471K629N396O357M155M384N494J112J680L281O103P79J719l43K142
17368g54670M088L837M934M250P64k22J218J968M306J266K301L819L75M523L417
$$ plain form
17353 -713826 -709291 -702420 -702502 -704250 -704538 -699142 -697059 -694767 -689445 -685883 -684979 -686914 -686303 -683438 -676756
17338 -676756 -670965 -669915 -670254 -668831 -666169 -663377 -658325 -653110 -654966 -664588 -668485 -666008 -662569 -659544
17324 -659544 -656188 -650466 -646314 -649007 -648918 -646761 -644495 -642398 -641597 -637537 -635476 -629685 -624586 -624267 -621254
17309 -621254 -622217 -624677 -621551 -618593 -616378 -610038 -603795 -605547 -605647 -603767 -597341 -595776 -595018 -593563 -589815
17294 -589815 -586861 -585688 -581752 -582107 -579134 -581556 -586217 -589230 -587337 -585738 -582456 -582476 -578636 -570413 -565452
17279 -565452 -564544 -566115 -569914 -568944 -567688 -565156 -560395 -553953 -548546 -548376 -550470 -549544 -547447 -546870 -547546 -545207
17263 -545207 -542349 -538211 -538144 -536562 -531284 -529018 -526658 -527590 -530041 -525680 -518823 -514944 -515431 -515232 -517711
17248 -517711 -517271 -515424 -512321 -506750 -501909 -503524 -506836 -506733 -505848 -505155 -501938 -499945 -497630 -500421 -500856
$$ packed form
17353g13826M535O871q2j748k88N396K083K292N322L562R04j935O11K865O682
17338f76756N791J050l39J423K662K792N052N215j856r622l897K477L439L025
17324f59544L356N722M152k693Q9K157K266K097Q01M060K061N791N099L19L013
17309f21254r63k460L126K958K215O340O243j752j00J880O426J565P58J455L748
17294e89815K954J173L936l55K973k422m661l013J893J599L282k0L840Q223M961
17279e65452R08j571l799R70J256K532M761O442N407J70k094R26K097N77o76K339
17263e45207K858M138O7J582N278K266K360r32k451M361O857L879m87J99k479
17248e17711M40J847L103N571M841j615l312J03Q85O93L217J993K315k791m35
$$ plain form
17233 -500856 -499673 -499741 -499320 -497592 -494606 -492208 -491410 -489950 -488601 -485326 -482830 -479889 -480202 -480288 -475549 -473392
17217 -473392 -473739 -472068 -472933 -469399 -465132 -466471 -466028 -464879 -464847 -464798 -462764 -458440 -454417 -453302 -451824 -452282
17201 -452282 -457941 -456361 -450656 -445414 -439439 -436378 -435939 -436199 -438538 -436502 -434219 -433475 -435111 -430468 -425871
17186 -425871 -421817 -421989 -424738 -423885 -425422 -424735 -421388 -421432 -422484 -419552 -417627 -414092 -411253 -407505 -408148 -406051
17170 -406051 -401582 -400702 -400964 -400377 -397411 -399094 -399709 -395776 -389791 -387531 -382214 -377213 -378031 -378605 -376456 -374212
17154 -374212 -375668 -374123 -367885 -364795 -363118 -362855 -359131 -354535 -351918 -347784 -341718 -337600 -335658 -336416 -336016
17139 -336016 -330850 -322003 -313762 -306361 -302361 -296310 -287568 -284500 -272560 -255318 -240836 -222822 -203033
17126 -203033 -182075 -172110 -208814 -326866 -447603 -486215 -467566 -439110 -412265 -387423 -364171
$$ packed form
17233e00856J183o8M21J728K986K398P98J460J349L275K496K941l13q6M739K157
17217d73392l47J671q65L534M267j339M43J149L2M9K034M324M023J115J478m58
17201d52282n659J580N705N242N975L061M39k60k339K036K283P44j636M643M597
17186d25871M054j72k749Q53j537O87L347m4j052K932J925L535K839L748o43K097
17170d06051M469Q80k62N87K966j683o15L933N985K260N317N001q18n74K149K244
17154c74212j456J545O238L090J677K63L724M596K617M134O066M118J942p58M00
17139c36016N166Q847Q241P401M000O051Q742L068J1940J7242J4482J8014J9789
17126b03033K0958R965l6704j18052j20737l8612J8649K8456K6845K4842K3252
$$ plain form
17115 -364171 -338763 -311363 -284903 -259806 -257567 -315368 -445680 -547037 -568610 -550995 -525914
17104 -525914 -502980 -485818 -474091 -462506 -451279 -439456 -429585 -425895 -423261 -419683 -416770 -411478 -406176
17091 -406176 -403114 -399933 -390985 -388614 -395040 -394391 -390285 -388382 -390947 -388782 -384640 -379007 -373821 -371142
17077 -371142 -367943 -366399 -364195 -364694 -364854 -363410 -362122 -356820 -355842 -353448 -348830 -342707 -342289 -345436 -343886
17062 -343886 -339813 -338284 -336675 -337604 -337879 -338679 -336594 -337176 -337638 -334650 -331722 -327661 -325262 -323749 -321539
17047 -321539 -318710 -316928 -315724 -313019 -311957 -313909 -317287 -314863 -310435 -308071 -306988 -307441 -308360 -305300 -306986
17032 -306986 -311762 -309996 -304045 -302452 -301166 -299354 -296554 -297016 -296941 -295360 -294895 -292168 -285023 -282386 -281615
17017 -281615 -280841 -277391 -275226 -274870 -273953 -273543 -275610 -272249 -270463 -269967 -271108 -270600 -269600 -265471 -262919 -261189
$$ packed form
17115c64171K5408K7400K6460K5097K239n7801j30312j01357k1573J7615K5081
17104e25914K2934J7162J1727J1585J1227J1823R871L690K634L578K913N292N302
17091d06176L062L181Q948K371o426O49M106J903k565K165M142N633N186K679
17077c71142L199J544K204m99j60J444J288N302R78K394M618O123M18l147J550
17062c43886M073J529J609r29k75q00K085n82m62K988K928M061K399J513K210
17047c21539K829J782J204K705J062j952l378K424M428K364J083m53r19L060j686
17032c06986m776J766N951J593J286J812K800m62P5J581M65K727P145K637P71
17017b81615P74L450K165L56R17M10k067L361J786M96j141N08J000M129K552J730
$$ plain form
17001 -261189 -257527 -255376 -252905 -250540 -250168 -250779 -249954 -245781 -244683 -239619 -235371 -233633 -227419 -220384 -218593
16986 -218593 -216092 -212467 -210027 -200768 -194915 -187990 -181988 -173309 -164023 -171461 -209220 -254132 -272159
16973 -272159 -267937 -253351 -240022 -224064 -208136 -195557 -187288 -193946 -226823 -259902 -264255 -250084
16961 -250084 -231893 -221594 -231339 -266071 -302096 -315931 -306615 -291006 -275810 -262921 -247934 -238601
16949 -238601 -237765 -252345 -293591 -328373 -336016 -327965 -319492 -309798 -302344 -295103 -289640 -289065 -284937 -281827
16935 -281827 -278901 -272633 -266798 -262439 -262876 -258890 -254027 -257682 -261496 -261353 -258627 -256586 -255148 -249835 -248464
16920 -248464 -245844 -244448 -241916 -239654 -237863 -237051 -238341 -234610 -232061 -234628 -234167 -231984 -232613 -231243 -224778
16905 -224778 -220867 -220292 -221182 -218939 -217323 -214899 -213554 -211925 -215799 -220582 -222456 -219216 -215755 -211581 -207717
$$ packed form
17001b61189L662K151K471K365L72o11Q25M173J098N064M248J738O214P035J791
16986b18593K501L625K440R259N853O925O002Q679R286p438l7759m4912j8027
16973b72159M222J4586J3329J5958J5928J2579Q269o658l2877l3079m353J4171
16961b50084J8191J0299r745l4732l6025j3835R316J5609J5196J2889J4987R333
16949b38601Q36j4580m1246l4782p643Q051Q473R694P454P241N463N75M128L110
16935b81827K926O268N835M359m37L986M863l655l814J43K726K041J438N313J371
16920b48464K620J396K532K262J791Q12j290L731K549k567M61K183o29J370O465
16905b24778L911N75q90K243J616K424J345J629l874m783j874L240L461M174L864
$$ plain form
16890 -207717 -205169 -207084 -205591 -202850 -205372 -207238 -206564 -205592 -203179 -200829 -199036 -198830 -203729 -207283 -203140
16875 -203140 -203062 -200740 -195817 -194626 -194681 -197026 -198648 -199590 -204227 -205090 -200770 -196911 -195064 -191600 -190541 -187287
16859 -187287 -184394 -185023 -182522 -182533 -184612 -180658 -175314 -173035 -170968 -171112 -173385 -173382 -173886 -174941 -171723 -167780
16843 -167780 -165580 -167828 -168290 -168748 -170513 -167687 -165434 -164249 -158537 -155863 -158541 -157370 -153600 -152907 -152293
16828 -152293 -153645 -150275 -146138 -145428 -145620 -143724 -144915 -147506 -147628 -147021 -146335 -143304 -139279 -140157 -139817 -137226
16812 -137226 -135398 -137057 -140511 -144097 -143566 -140923 -134220 -130202 -124916 -122378 -122927 -122217 -124623 -125588 -124619
16797 -124619 -124073 -124647 -120221 -118125 -118707 -123941 -126979 -127745 -123124 -117615 -112719 -107891 -106215 -105463 -104528 -108748
16781 -108748 -112903 -111028 -111139 -107353 -104055 -103709 -99417 -93488 -90078 -93843 -95743 -97690 -95608 -90369 -91229
$$ packed form
16890b07717K548j915J493K741k522j866O74R72K413K350J793K06m899l554M143
16875b03140P8K322M923J191n5k345j622r42m637q63M320L859J847L464J059L254
16859a87287K893o29K501j1k079L954N344K279K067j44k273Ln04j055L218L943
16843a67780K200k248m62m58j765K826K253J185N712K674k678J171L770O93O14
16828a52293j352L370M137P10j92J896j191k591j22O07O86L031M025q78L40K591
16812a37226J828j659l454l586N31K643O703M018N286K538n49P10k406r65R69
16797a24619N46n74M426K096n82n234l038p66M621N509M896M828J676P52R35m220
16781a08748m155J875j11L786L298L46M292N929L410l765j900j947K082N239q60
$$ plain form
16766 -91229 -90468 -88273 -85159 -83039 -81413 -80946 -80786 -79290 -76663 -73289 -72069 -68399 -67419 -66413 -62414
16751 -62414 -57726 -53708 -51416 -52429 -49746 -47097 -46528 -45611 -44269 -41667 -38666 -35685 -32038 -29681 -27370
16736 -27370 -25958 -23905 -19647 -16195 -10390 -6786 -805 4863 6624 11731 13881 14964 18458 21745
16722 21745 27175 33530 40602 52474 55715 62125 65814 68224 72457 80439 89131 99360 107574 114692
16708 114692 122004 133831 146289 160957 175685 194530 213370 231109 253417 275301 300992 329475
16696 329475 366622 411708 464623 515408 556491 555518 470333 294099 94269 -33664 -62138
16685 -62138 -12723 70009 161315 254744 341485 403518 400278 306677 144750 -8691 -126601
16674 -126601 -248456 -408915 -561578 -634343 -619856 -552016 -467999 -379029 -294102 -222286 -185334
$$ packed form
16766i1229P61K195L114K120J626M67J60J496K627L374J220L670R80J006L999
16751f2414M688M018K292j013K683K649N69R17J342K602L001K981L647K357K311
16736b7370J412K053M258L452N805L604N981N668J761N107K150J083L494L287
16722B1745N430O355P072J1872L241O410L689K410M233P982Q692J0229Q214P118
16708A14692P312J1827J2458J4668J4728J8845J8840J7739K2308K1884K5691K8483
16696C29475L7147M5086N2915N0785M1083r73q5185j76234j99830j27933k8474
16685f2138M9415Q2732R1306R3429Q6741O2033l240r3601j61927j53441j17910
16674a26601j21855j60459j52663p2765J4487O7840Q4017Q8970Q4927P1816L6952
$$ plain form
16663 -185334 -227091 -366466 -561838 -716479 -776245 -762668 -719316 -670629 -625877 -589935 -557237
16652 -557237 -531311 -506177 -476591 -452372 -430033 -413820 -400688 -386351 -374919 -366068 -356105 -349586
16640 -349586 -341959 -333435 -328662 -318879 -310179 -301508 -294765 -286625 -279895 -276658 -268771 -263708 -255793 -248463
16626 -248463 -243550 -235495 -230598 -223691 -216672 -214827 -211275 -203434 -196978 -191786 -184284 -175803 -173533 -168200
16612 -168200 -160268 -150949 -144153 -138530 -133876 -129392 -124085 -118687 -109693 -103231 -96835 -91496 -89221 -98736
16598 -98736 -120765 -152004 -187215 -220632 -248539 -267166 -275573 -281239 -283154 -276516 -269643 -264775 -260158
16585 -260158 -255145 -250353 -245050 -240207 -240362 -240717 -238081 -236043 -233947 -233711 -234257 -232267 -230148 -226669 -224967
16570 -224967 -220781 -216052 -213340 -211064 -211082 -211494 -215258 -214218 -211527 -209997 -211405 -210430 -204652 -199783 -194602
$$ packed form
16663a85334m1757j39375j95372j54641n9766J3577M3352M8687M4752L5942L2698
16652e57237K5926K5134K9586K4219K2339J6213J3132J4337J1432Q851R963O519
16640c49586P627Q524M773R783Q700Q671O743Q140O730L237P887N063P915P330
16626b48463M913Q055M897O907P019J845L552P841O456N192P502Q481K270N333
16612a68200P932R319O796N623M654M484N307N398Q994O462O396N339K275r515
16598i8736k2029l1239l5211l3417k7907j8627q407n666j915O638O873M868M617
16585b60158N013M792N303M843j55l55K636K038K096K36n46J990K119L479J702
16570b24967M186M729K712K276j8m12l764J040K691J530j408R75N778M869N181
$$ plain form
16555 -194602 -193469 -195223 -196907 -197367 -194793 -191524 -191348 -194756 -195962 -192449 -188321 -185448 -183651 -182819 -180444
16540 -180444 -179206 -177453 -177645 -177066 -173925 -173222 -166637 -162216 -164228 -165860 -163386 -162596 -158637 -154583 -153852
16525 -153852 -151659 -148373 -147365 -146776 -146380 -145041 -145177 -146423 -143439 -140912 -138295 -133187 -132629 -133434 -130976
16510 -130976 -130439 -132370 -132823 -134051 -133164 -128549 -128486 -130922 -131837 -132930 -132565 -126958 -119708 -117596 -117092 -117303
16494 -117303 -118010 -115432 -110322 -108251 -106491 -105157 -103291 -105113 -103678 -99080 -96625 -94518 -94252 -89117 -85363
16479 -85363 -91622 -101037 -111662 -116892 -118312 -115745 -110828 -107144 -99385 -93695 -96137 -97113 -93539 -91459
16465 -91459 -93278 -95105 -92569 -91011 -89209 -87295 -87538 -85334 -77126 -73621 -70947 -70085 -69228 -67943 -66148
16450 -66148 -63443 -55635 -47670 -40598 -29700 -19333 -18630 -41492 -82205 -120511 -140228 -139192 -132767
$$ packed form
16555a94602J133j754j684m60K574L269J76l408j206L513M128K873J797Q32K375
16540a80444J238J753j92N79L141P03O585M421k012j632K474P90L959M054P31
16525a53852K193L286J008N89L96J339j36j246K984K527K617N108N58q05K458
16510a30976N37j931m53j228Q87M615O3k436r15j093L65N607P250K112N04k11
16494a17303p07K578N110K071J760J334J866j822J435M598K455K107K66N135L754
16479h5363o259r415j0625n230j420K567M917L684P759N690k442r76L574K080
16465i1459j819j827K536J558J802J914k43K204Q208L505K674Q62Q57J285J795
16450f6148K705P808P965P072J0898J0367P03k2862m0713l8306j9717J036O425
$$ plain form
16437 -132767 -125211 -118136 -118625 -117121 -111410 -105259 -100306 -91416 -84166 -84658 -84047 -83292 -79462 -76494 -76183
16422 -76183 -75261 -71330 -68310 -66033 -62177 -57295 -58546 -60774 -60100 -54713 -47569 -45057 -40984 -32654 -23103
16407 -23103 -16742 -9477 -1566 5728 2099 -27959 -80384 -114329 -119002 -108490 -93209 -80151 -71088
16394 -71088 -61116 -48549 -37314 -36202 -46691 -86173 -135525 -158498 -156977 -150157 -141770 -134571 -128701
16381 -128701 -124932 -122816 -116781 -109346 -106089 -102542 -101151 -100691 -96446 -93872 -93952 -88249 -84300 -84927 -85267
16366 -85267 -81646 -78976 -79103 -76252 -75438 -72454 -70503 -67996 -70477 -70068 -70631 -70176 -69098 -64487 -62227 -62529
16350 -62529 -60970 -57914 -59025 -59299 -58652 -58579 -58137 -53711 -52539 -50185 -50926 -50775 -50986 -51661 -51791 -52087 -52438
16333 -52438 -52295 -52110 -48012 -46493 -47307 -48595 -46062 -43141 -45346 -47027 -43894 -41998 -42279 -41287 -41735 -45270
$$ packed form
16437a32767P556P075m89J504N711O151M953Q890P250m92O11P55L830K968L11
16422g6183R22L931L020K277L856M882j251k228O74N387P144K512M073Q330R551
16407b3103O361P265P911P294l629l0058n2425l3945m673J0512J5281J3058R063
16394g1088R972J2567J1235J112j0489l9482m9352k2973J521O820Q387P199N870
16381a28701L769K116O035P435L257L547J391M60M245K574q0N703L949o27l40
16366h5267L621K670j27K851Q14K984J951K507k481M09n63M55J078M611K260l02
16350f2529J559L056j111k74O47P3M42M426J172K354p41J51k11o75j30k96l51
16333e2438J43J85M098J519q14j288K533K921k205j681L133J896k81R92m48l535
$$ plain form
16317 -45270 -46673 -44695 -43438 -43290 -43344 -41902 -37566 -33270 -32374 -33475 -36599 -33559 -32866 -30705 -26621 -31337
16301 -31337 -33449 -34007 -36968 -38261 -38128 -40343 -35689 -36114 -35837 -32781 -31128 -27625 -20154 -17317 -22411
16286 -22411 -26260 -31671 -28217 -23482 -20712 -21176 -21516 -20760 -21732 -23151 -19818 -17792 -15380 -13089 -16420
16271 -16420 -17662 -16624 -12811 -12254 -12630 -14468 -14230 -11546 -9497 -9379 -10310 -9726 -11063 -12384 -12606 -9659
16255 -9659 -7636 -4705 468 2063 871 -1347 -1626 -2934 362 4142 5311 850 -2336 841 667
16240 667 1046 539 -2117 -2509 985 3281 2262 2962 7456 10806 9934 8373 5920 8500 10310 11991
16224 11991 12083 13956 16469 16686 16567 15983 15649 19262 19046 20074 18683 19785 22883 22437 21387 22497
16208 22497 24829 25215 22805 23066 24202 22999 23321 25910 23919 21734 21515 22883 27973 31602 29342
$$ packed form
16317d5270j403J978J257J48n4J442M336M296Q96j101l124L040O93K161M084m716
16301c1337k112n58k961j293J33k215M654m25K77L056J653L503P471K837n094
16286b2411l849n411L454M735K770m64l40P56r72j419L333K026K412K291l331
16271a6420j242J038L813N57l76j838K38K684K049J18r31N84j337j321k22K947
16255i659K023K931N173J595j192k218k79j308L296L780J169m461l186L177j74
16240F67L79n07k656l92L494K296j019P00M494L350q72j561k453K580J810J681
16224A1991R2J873K513K17j19n84l34L613k16J028j391J102L098m46j050J110
16208B2497K332L86k410K61J136j203L22K589j991k185k19J368N090L629k260
$$ plain form
16193 29342 27198 27718 31182 32857 34108 35266 38142 41057 41043 41703 43115 42851 40056 40449 40502 41553
16177 41553 43348 44321 46463 47254 47306 49269 51022 49902 48271 48828 52249 51861 50710 50682 48058 51061
16161 51061 52122 51441 53820 56180 57034 56367 56166 56263 57864 60022 60865 62458 63023 63127 59936 56122 57765
16144 57765 60947 62932 64621 66272 63948 66030 67114 69968 73087 71289 74354 77587 77152 75542 78108
16129 78108 80592 77736 77921 78438 80500 81234 83562 82570 81986 83574 83245 84228 87370 88824 87902 90520
16113 90520 93830 97960 96375 96768 97362 99073 96502 93281 92131 89628 90125 92416 100691 103329 101876
16098 101876 102397 104373 106848 109245 108018 108385 108979 109126 114925 114796 112902 112701 115903 120990 126578 129105
16082 129105 127177 126629 131660 130558 131364 135061 133032 128415 129457 134941 139049 140632 143232 143597 144205
$$ packed form
16193B9342k144N20L464J675J251J158K876K915j4O60J412k64k795L93N3J051
16177D1553J795R73K142P91N2J963J753j120j631N57L421l88j151k8k624L003
16161E1061J061o81K379K360Q54o67k01R7J601K158Q43J593N65J04l191l814J643
16144E7765L182J985J689J651k324K082J084K854L119j798L065L233m35j610K566
16129G8108K484k856J85N17K062P34K328r92n84J588l29R83L142J454r22K618
16113I0520L310M130j585L93N94J711k571l221j150k503M97K291Q275K638j453
16098A01876N21J976K475K397j227L67N94J47N799j29j894k01L202N087N588K527
16082A29105j928n48N031j102Q06L697k029m617J042N484M108J583K600L65O08
$$ plain form
16067 144205 143842 143067 142490 147352 151221 153589 158219 160252 157019 156349 158938 165357 165982 169979 173894
16052 173894 173539 175227 175636 176388 177925 179970 180262 181548 184310 186985 185285 188837 188835 192820 198011 201927
16036 201927 204119 209660 214302 217530 218032 222652 224714 227721 230166 231104 234622 240380 245242 246900 248969
16021 248969 252697 257324 260392 263372 269361 273725 278670 279810 284229 289808 296165 300961 307438 315457
16007 315457 322766 327680 333528 339258 341430 343753 349490 356941 361607 370308 384738 394199 398804 405417
15993 405417 418438 429833 440662 450890 465125 478853 492190 504300 518040 529172 543032
15982 543032 563042 583730 608172 633566 658738 684017 708105 738472 772189 808147 849055
15971 849055 893845 945454 999761 1060254 1132358 1213540 1304288 1408826 1526897 1664802 1837640
$$ packed form
16067A44205l63p75n77M862L869K368M630K033l233o70K589O419O25L997L915
16052A73894l55J688M09P52J537K045K92J286K762K675j700L552kL985N191L916
16036B01927K192N541M642L228N02M620K062L007K445R38L518N758M862J658K069
16021B48969L728M627L068K980N989M364M945J140M419N579O357M796O477Q019
16007C15457P309M914N848N730K172K323N737P451M666Q701J4430R461M605O613
15993D05417J3021J1395J0829J0228J4235J3728J3337J2110J3740J1132J3860
15982E43032K0010K0688K4442K5394K5172K5279K4088L0367L3717L5958M0908
15971H49055M4790N1609N4307O0493P2104Q1182R0748J04538J18071J37905J72838
$$ plain form
15960 1837640 2064514 2359098 2738846 3209464 3713448 3996693 3536708 1955135 -390319
15951 -390319 -2527899 -3635589 -3726523 -3301374 -2813741 -2415774 -2109821 -1874805 -1689781
15942 -1689781 -1541820 -1417651 -1307358 -1210442 -1121922 -1047008 -976777 -911159 -852426 -800376 -755952
15931 -755952 -715689 -678058 -646181 -620353 -597352 -580415 -564725 -544967 -525935 -503991 -485632
15920 -485632 -468139 -454850 -437085 -419366 -403258 -391378 -381525 -367380 -354729 -346181 -338693 -333461
15908 -333461 -326004 -315659 -306007 -295756 -287789 -278616 -273062 -268997 -262236 -254755 -245943 -235718 -231079
15895 -231079 -229741 -227552 -219258 -211169 -206244 -201434 -195138 -188739 -185145 -183552 -177135 -166438 -158700 -153697
15881 -153697 -153534 -155039 -156093 -152499 -146505 -143202 -139905 -135076 -131062 -126336 -121890 -118660 -116580 -116859 -114569
$$ packed form
15960A837640K26874K94584L79748M70618N03984K83245m59985j581573k345454
15951c90319k137580j107690r0934M25149M87633L97967L05953K35016J85024
15942a689781J47961J24169J10293R6916Q8520P4914P0231O5618N8733N2050M4424
15931g55952M0263L7631L1877K5828K3001J6937J5690J9758J9032K1944J8359
15920d85632J7493J3289J7765J7719J6108J1880R853J4145J2651Q548P488N232
15908c33461P457J0345R652J0251P967R173N554M065O761P481Q812J0225M639
15895b31079J338K189Q294Q089M925M810O296O399L594J593O417J0697P738N003
15881a53697J63j505j054L594N994L303L297M829M014M726M446L230K080k79K290
$$ plain form
15866 -114569 -110639 -111016 -107653 -105022 -103369 -101496 -98306 -95294 -89971 -88384 -87583 -83752 -80817 -76771 -70251
15851 -70251 -65926 -64060 -63751 -65476 -66173 -65123 -60478 -57000 -54573 -50428 -46887 -42551 -41254 -39160 -35059
15836 -35059 -33029 -29117 -25669 -22329 -21700 -17857 -11917 -6606 -869 3536 5561 5493 5158 8211 10410
15821 10410 13643 17403 20592 23998 26063 34727 45986 58890 74861 87693 99237 113416 130418
15808 130418 154165 181651 215874 260571 319571 383600 401155 274621 -13457 -322288 -476787
15797 -476787 -466978 -402073 -342456 -294673 -261886 -234933 -211884 -193291 -179315 -168579 -161727 -154328
15785 -154328 -145485 -136468 -128185 -119687 -113534 -107968 -99915 -95052 -92487 -86876 -80531 -71065 -66378 -63795
15771 -63795 -62438 -67823 -73850 -77269 -73574 -66794 -66144 -61976 -57677 -57328 -55608 -53725 -52101 -52171 -49905
$$ packed form
15866a14569L930l77L363K631J653J873L190L012N323J587Q01L831K935M046O520
15851g0251M325J866L09j725o97J050M645L478K427M145L541M336J297K094M101
15836c5059K030L912L448L340O29L843N940N311N737M405K025o8l35L053K199
15821A0410L233L760L189L406K065Q664J1259J2904J5971J2832J1544J4179J7002
15808A30418K3747K7486L4223M4697N9000O4029J7555j26534k88078l08831j54499
15797d76787R809O4905N9617M7783L2787K6953K3049J8593J3976J0736O852P399
15785a54328Q843R017Q283Q498O153N566Q053M863K565N611O345R466M687K583
15771f3795J357n385o027l419L695O780O50M168M299L49J720J883J624p0K266
$$ plain form
15756 -49905 -47022 -45018 -44762 -44096 -41133 -38066 -37134 -38366 -37866 -36762 -33673 -31309 -29997 -35787 -34738
15741 -34738 -32084 -31153 -29563 -24922 -23687 -23603 -23105 -21051 -19779 -18029 -13003 -11682 -12284 -11719 -11524 -14782
15725 -14782 -14321 -12798 -10984 -10100 -9311 -8692 -6499 -3715 -5220 -6174 -4853 -5171 -3732 -323 3803 -115
15709 -115 -5985 -7954 -4920 -1522 -714 982 768 1421 3168 4035 4748 4966 8616 11491 13506 12484
15693 12484 14530 14311 15590 18900 20313 19440 19910 19088 21884 22356 19308 17228 20159 22223 20621 19610
15677 19610 22956 27073 27510 26903 25675 24050 22192 23050 25874 29441 33441 33393 33888 36117 36289 35103
15661 35103 35313 36133 36312 34440 35081 37736 37024 35971 36112 39068 36403 34696 35402 34977 36129 37085 37985
15644 37985 38949 38851 41498 45620 46470 42870 41656 44459 44527 46344 48528 48300 48089 47172 47085 47751 47989 50814
$$ packed form
15756d9905K883K004K56O66K963L067R32j232N00J104L089K364J312n790J049
15741c4738K654R31J590M641J235Q4M98K054J272J750N026J321o02N65J95l258
15725a4782M61J523J814Q84P89O19K193K784j505r54J321l18J439L409M126l918
15709a15n870j969L034L398Q08J696k14O53J747Q67P13K18L650K875K015j022
15693A2484K046k19J279L310J413q73M70q22K796M72l048k080K931K064j602j011
15677A9610L346M117M37o07j228j625j858Q58K824L567M000m8M95K229J72j186
15661C5103K10Q20J79j872O41K655p12j053J41K956k665j707P06m25J152R56R00
15644C7985R64r8K647M122Q50l600j214K803O8J817K184k28k11r17q7O66K38K825
$$ plain form
15626 50814 55651 54835 55170 54230 58869 56157 52751 53695 54496 54964 54493 52731 52234 53395 53512 53302 57644
15609 57644 60771 58281 55187 55685 57329 56257 56589 55507 57969 55431 55679 58604 59747 61758 63047
15594 63047 63252 61339 60589 61627 60753 59602 57658 62574 69051 73264 72841 69680 68585 65933 65074 66933
15578 66933 71182 70939 70514 69732 70337 74220 73494 67755 68913 71891 71912 69590 70036 71193 68746 72181
15562 72181 72525 75336 80227 81882 83210 79840 79216 77053 73875 76020 78578 80640 80494 80446 79604 80353
15546 80353 81984 82470 81193 81459 82454 83208 83216 87876 88665 87229 84458 85408 83040 85726 87216 86511 88048
15529 88048 87927 86608 85404 86439 87955 87795 87074 83850 85013 89488 90013 90536 92491 90792 89162 90251
15513 90251 90058 90618 91982 94190 93397 92470 95251 96175 95562 94465 96264 100577 101889 100627 97186 97994
$$ packed form
15626E0814M837q16L35r40M639k712l406R44Q01M68m71j762m97J161J17k10M342
15609E7644L127k490l094M98J644j072L32j082K462k538K48K925J143K011J289
15594F3047K05j913p50J038q74j151j944M916O477M213m23l161j095k652q59J859
15578F6933M249k43m25p82O05L883p26n739J158K978K1k322M46J157k447L435
15562G2181L44K811M891J655J328l370o24k163l178K145K558K062j46m8q42P49
15546H0353J631M86j277K66R95P54QM660P89j436k771R50k368K686J490p05J537
15529H8048j21j319j204J035J516j60p21l224J163M475N25N23J955j699j630J089
15513I0251j93N60J364K208p93r27K781R24o13j097J799M313J312j262l441Q08
$$ plain form
15497 97994 103000 104527 104789 106061 107364 107678 105134 104590 104508 103230 102753 101442 101191 101704 100923 101513 102480
15480 102480 102106 104568 108241 108447 109688 111030 110068 108316 109821 105446 106815 111317 112460 111914 108621
15465 108621 112411 112734 110099 108530 108033 111481 111721 112699 114204 111875 109163 108301 111713 117001 119729
15450 119729 120037 117422 115509 115324 116284 118857 117921 118498 119637 118202 120565 126941 124915 123625 127208
15435 127208 127797 129034 128774 127591 129786 128461 129343 132866 132126 136926 138081 141571 146258 146201 141448 137922
15419 137922 131332 121291 110539 108707 113334 117202 122786 125145 120578 120044 121733 123826 125509 126146
15405 126146 128000 127255 126936 129203 128672 128212 126423 125034 127450 131072 132316 132730 137842 139500 136210
15390 136210 134775 136332 130904 128104 132355 138410 138782 135257 136159 139309 137433 134430 133039 135666 137809
$$ packed form
15497I7994N006J527K62J272J303L14k544n44q2j278m77j311k51N13p81N90R67
15480A02480l74K462L673K06J241J342r62j752J505m375J369M502J143n46l293
15465A08621L790L23k635j569m97L448K40R78J505k329k712q62L412N288K728
15450A19729L08k615j913j85R60K573r36N77J139j435K363O376k026j290L583
15435A27208N89J237k60j183K195j325Q82L523p40M800J155L490M687n7m753l526
15419A37922o590j0041j0752j832M627L868N584K359m567n34J689K093J683O37
15405A26146J854p45l19K267n31m60j789j389K416L622J244M14N112J658l290
15390A36210j435J557n428k800M251O055L72l525R02L150j876l003j391K627K143
$$ plain form
15375 137809 139897 140862 139167 137724 138785 140911 143350 143870 147569 148715 150221 146661 144290 145733 148472
15360 148472 149010 147016 150224 151957 154041 155121 152400 151080 150115 145719 144872 146191 144781 143716 146308
15345 146308 142811 144874 147436 149863 151552 149971 150259 148858 150197 152932 152334 151295 152949 156012 157732
15330 157732 156955 154449 154887 157454 156587 154647 152514 153358 154396 157783 159458 158596 160059 161440 160828 162400
15314 162400 163205 161314 157187 152757 153512 157465 162292 162947 160108 158676 158800 161110 163960 162345 163030
15299 163030 164057 161046 162291 166481 167376 165413 164797 166948 167867 169208 169763 169877 170072 169990 167224 165303
15283 165303 163442 164013 167733 170033 172343 171485 171431 169992 167522 171735 177710 178415 177177 175337 176334 178024
15267 178024 176729 175035 176361 175567 171932 170303 170229 172921 174578 177596 179280 179237 177934 173069 174097
$$ packed form
15375A37809K088R65j695j443J061K126K439N20L699J146J506l560k371J443K739
15360A48472N38j994L208J733K084J080k721j320r65m396q47J319j410j065K592
15345A46308l497K063K562K427J689j581K88j401J339K735n98j039J654L063J720
15330A57732p77k506M38K567q67j940k133Q44J038L387J675q62J463J381o12J572
15314A62400Q05j891m127m430P55L953M827O55k839j432J24K310K850j615O85
15299A63030J027l011J245M190Q95j963o16K151R19J341N55J14J95q2k766j921
15283A65303j861N71L720K300K310q58n4j439k470M213N975P05j238j840R97J690
15267A78024j295j694J326p94l635j629p4K692J657L018J684m3j303m865J028
$$ plain form
15252 174097 178695 177530 177749 176674 175669 175294 175286 173440 173152 173548 171800 173078 176286 174989 177927 184419
15236 184419 184716 183541 185993 189304 187330 186360 187589 187284 186046 184856 184903 179959 181920 188062 193282
15221 193282 194992 196112 194827 189515 187860 188434 189543 191829 188983 190205 191961 192724 191835 191863 191646 189476
15205 189476 188402 188222 188473 191364 190990 193374 195033 197578 199028 200114 199385 199172 199822 200355 200067 194256
15189 194256 191974 193545 195275 197307 200041 205211 205501 203409 202066 200239 201580 201278 200269 202543 205747
15174 205747 207844 208835 210600 207642 203414 200847 202158 207598 210100 208091 209630 207832 208537 214477 214608
15159 214608 212016 207415 207813 210966 211985 214045 212203 213758 214822 211984 208775 209907 212563 212013 212123
15144 212123 212040 211017 213665 214250 214570 217506 220850 216473 215104 214607 215756 215305 215480 217502 220976 224601
$$ packed form
15252A74097M598j165K19j075j005l75qj846k88L96j748J278L208j297K938O492
15236A84419K97j175K452L311j974r70J229l05j238j190M7m944J961O142N220
15221A93282J710J120j285n312j655N74J109K286k846J222J756P63q89K8k17k170
15205A89476j074j80K51K891l74K384J659K545J450J086p29k13O50N33k88n811
15189A94256k282J571J730K032K734N170K90k092j343j827J341l02j009K274L204
15174B05747K097R91J765k958m228k567J311N440K502k009J539j798P05N940J31
15159B14608k592m601L98L153J019K060j842J555J064k838l209J132K656n50J10
15144B12123q3j023K648N85L20K936L344m377j369m97J149m51J75K022L474L625
$$ plain form
15128 224601 223968 223198 220449 218656 221457 225433 224290 226914 230800 229160 226072 223642 224985 221129 218484
15113 218484 220146 221518 224896 227860 229868 229747 227283 225443 225049 226929 226335 229724 232496 232439 235630
15098 235630 233940 233282 233859 235036 236475 234187 237000 239532 239115 239138 237398 237286 232025 228221 221045 215094
15082 215094 220719 225047 224389 222190 223034 224425 229223 233833 233206 234092 233099 230515 228873 228858 226955 228002
15066 228002 230703 232699 233148 231005 230596 233335 234766 237063 236305 235202 238845 242336 242642 243986 246299
15051 246299 242194 238091 239015 239444 241442 243981 244372 245315 242907 243507 247524 246909 244684 244600 243371 243065
15035 243065 244773 244932 248686 251866 251112 247871 249047 251593 251592 251111 252150 254910 251675 252852 253243 252024
15019 252024 250966 252700 255897 256277 257524 260201 261904 261653 263176 261521 261521 261060 256614 254621 258474 263236
$$ packed form
15128B24601o33p70k749j793K801L976j143K624L886j640l088k430J343l856k645
15113B18484J662J372L378K964K008j21k464j840l94J880n94L389K772n7L191
15098B35630j690o58N77J177J439k288K813K532m17K3j740j12n261l804p176n951
15082B15094N625M328o58k199Q44J391M798M610o27Q86r93k584j642j5j903J047
15066B28002K701J996M49k143m09K739J431K297p58j103L643L491L06J344K313
15051B46299m105m103R24M29J998K539L91R43k408O00M017o15k225q4j229l06
15035B43065J708J59L754L180p54l241J176K546jm81J039K760l235J177L91j219
15019B52024j058J734L197L80J247K677J703k51J523j655%m61m446j993L853M762
$$ plain form
15003 263236 266523 265485 266741 267208 266697 265814 265232 263537 260076 262044 262771 262139 265243 269493 270566 267494
14987 267494 268077 266389 265162 264144 260588 264026 268987 268072 265501 266212 268073 273486 273668 272157 268367
14972 268367 265831 268735 271994 276241 279007 280397 279952 275734 270953 267888 267291 267661 269317 272563 272863
14957 272863 274974 274763 272671 270979 272626 273900 272634 271527 274787 278704 280682 281107 279568 277879 279012
14942 279012 284120 283596 281341 282133 281854 283324 287620 288251 289563 292071 293695 294406 293375 291594 291130 287709
14926 287709 284951 284243 285597 288259 291696 292044 291737 286916 289454 291032 289425 289898 291312 293117 292615
14911 292615 294916 292414 290452 293016 294694 293607 292073 289523 290855 295536 298455 298217 301892 305220
14897 305220 303891 304138 303322 301426 298726 301438 303821 301363 300520 301831 302322 305065 305929 302026 300687
$$ packed form
15003B63236L287j038J256M67n11q83n82j695l461J968P27o32L104M250J073l072
14987B67494N83j688j227j018l556L438M961r15k571P11J861N413J82j511l790
14972B68367k536K904L259M247K766J390m45m218m781l065n97L70J656L246L00
14957B72863K111k11k092j692J647J274j266j107L260L917J978M25j539j689J133
14942B79012N108n24k255P92k79J470M296O31J312K508J624P11j031j781m64l421
14926B87709k758p08J354K662L437L48l07m821K538J578j607M73J414J805n02
14911B92615K301k502j962K564J678j087j534k550J332M681K919k38L675L328
14897C05220j329K47q16j896k700K712K383k458q43J311M91K743Q64l903j339
$$ plain form
14882 300687 301088 301866 305442 307345 305006 301399 301697 301133 299579 302375 304723 304274 304785 304641 309247 310073
14866 310073 308474 306663 305713 305924 310321 313722 313576 313435 313771 314947 313814 316593 318832 319667 318598 320164
14850 320164 319688 317133 316240 318255 317796 317342 318550 318280 319340 322613 321295 319500 318256 318616 318464 321885
14834 321885 325301 325208 326722 325898 321216 322940 327458 327667 325653 325233 326610 326851 325182 326828 334068 337325
14818 337325 334302 332015 332383 331312 330903 329591 330045 329966 333768 333627 336179 336673 336662 335339 337239 338550
14802 338550 335179 336860 337588 338221 337817 337311 337898 338072 339526 341435 343031 342490 340668 339850 341465 339397
14786 339397 333946 336203 340198 343838 345323 346734 344425 340441 341582 344210 343017 342637 343880 348464
14772 348464 351313 350918 350603 349356 351704 351879 348931 346991 347485 348401 351171 352601 354015 352398 356898
$$ packed form
14882C00687M01P78L576J903k339l607K98n64j554K796K348m49N11j44M606Q26
14866C10073j599j811r50K11M397L401j46j41L36J176j133K779K239Q35j069J566
14850C20164m76k555q93K015m59m54J208k70J060L273j318j795j244L60j52L421
14834C21885L416r3J514q24m682J724M518K09k014m20J377K41j669J646P240L257
14818C37325l023k287L68j071m09j312M54p9L802j41K552M94j1j323J900J311
14802C38550l371J681P28O33m04n06N87J74J454J909J596n41j822q18J615k068
14786C39397n451K257L995L640J485J411k309l984J141K628j193l80J243M584
14772C48464K849l95l15j247K348J75k948j940M94R16K770J430J414j617M500
$$ plain form
14757 356898 356799 356214 352560 350909 350937 352790 353559 355841 360516 363161 364535 363117 365098 365428 359727 360098
14741 360098 363897 362699 361395 361563 364594 367147 365051 364446 366340 365319 366606 368065 369957 371263 369737
14726 369737 366018 365104 363283 363195 363016 363126 367008 368610 370518 372767 370668 369703 370447 373596 372715 372309
14710 372309 371652 372387 375219 376715 378927 379200 374327 374117 376634 378381 379867 380077 381674 382677 382253 382214
14694 382214 386889 390192 390211 389178 388241 390994 392767 390662 390819 392410 393167 396980 397224 396997 401365 407606
14678 407606 405242 393095 379883 371285 370725 372370 373118 377335 382519 387582 387762 386658 388235 390587
14664 390587 393140 391659 389905 390848 391088 390374 390527 393404 395169 393082 395233 398307 396829 397023 398150
14649 398150 401534 402896 401772 399085 396480 402045 408569 406314 401938 398627 399079 405390 405839 408437 412562
$$ packed form
14757C56898r9n85l654j651K8J853P69K282M675K645J374j418J981L30n701L71
14741C60098L799j198j304J68L031K553k096o05J894j021J287J459J892J306j526
14726C69737l719r14j821q8j79J10L882J602J908K249k099r65P44L149q81m06
14710C72309o57P35K832J496K212K73m873k10K517J747J486K10J597J003m24l9
14694C82214M675L303J9j033r37K753J773k105J57J591P57L813K44k27M368O241
14678D07606k364j2147j3212q598n60J645P48M217N184N063J80j104J577K352
14664C90587K553j481j754R43K40p14J53K877J765k087K151L074j478J94J127
14649C98150L384J362j124k687k605N565O524k255m376l311M52O311M49K598M125
$$ plain form
14634 412562 410949 409850 407074 407216 409322 407768 410127 415702 416655 415895 412945 410438 415529 417369 416161
14619 416161 417837 416116 416454 418093 417891 416244 414747 414345 419672 424906 425874 422574 421628 424481 423046
14604 423046 421972 420024 422029 426420 425927 419129 414593 417916 423796 425465 427710 426843 426301 427836 430495
14589 430495 429221 429192 429867 432226 435310 435525 438093 437360 440566 439285 438722 439626 443377 441615 439686 440755
14573 440755 440779 440056 438489 442355 443390 446988 449256 446988 445405 445467 448613 451445 450171 448039 446070
14558 446070 444648 445007 444139 445766 446045 444650 448353 450694 452125 454243 452261 450404 450602 450614 452965 454529
14542 454529 455129 452286 453500 460179 463858 463428 465015 466419 463532 461562 461191 463148 466066 466738 467511
14527 467511 468415 467024 466765 465739 467459 466978 470031 472422 472581 470369 472376 473385 471965 473209 472831
$$ packed form
14634D12562j613j099k776J42K106j554K359N575R53p60k950k507N091J840j208
14619D16161J676j721L38J639k02j647j497m02N327N234R68l300r46K853j435
14604D23046j074j948K005M391m93o798m536L323N880J669K245q67n42J535K659
14589D30495j274k9O75K359L084K15K568p33L206j281n63R04L751j762j929J069
14573D40755K4p23j567L866J035L598K268k268j583O2L146K832j274k132j969
14558D46070j422L59q68J627K79j395L703K341J431K118j982j857J98J2K351J564
14542D54529O00k843J214O679L679m30J587J404k887j970l71J957K918O72P73
14527D67511R04j391k59j026J720m81L053K391J59k212K007J009j420J244l78
$$ plain form
14512 472831 471786 470657 468683 467386 469392 473098 474070 475213 478194 476620 474846 477160 481260 482478
14498 482478 485729 483769 487508 489788 490236 487041 486891 486046 486887 486907 486182 485880 485060 482983 487761 488448 490190
14481 490190 493925 493431 493576 496832 496138 497689 495725 494509 497725 496640 496744 498392 491126 489541 492727
14466 492727 497989 500307 501369 500839 499889 502615 503804 501625 505618 505231 505976 508781 508133 507814 508764 507393
14450 507393 504864 504162 506436 509473 508865 508659 508638 506067 504800 507567 510546 512507 516348 519086 519919 520588
14434 520588 521558 520651 520363 520100 521777 521669 522306 521011 523138 525599 527365 525615 526388 526119 530186 533498
14418 533498 531262 526155 526045 529653 532895 533534 531022 533667 533752 534465 533591 532428 536260 536934 535059 536876
14402 536876 536532 534738 534924 537898 541368 541896 544481 544339 547152 544754 546540 549750 551314 551011 554758
$$ packed form
14512D72831j045j129j974j297K006L706R72J143K981j574j774K314M100J218
14498D82478L251j960L739K280M48l195j50q45Q41K0p25l02q20k077M778O87J742
14481D90190L735m94J45L256o94J551j964j216L216j085J04J648p266j585L186
14466D92727N262K318J062n30r50K726J189k179L993l87P45K805o48l19R50j371
14450E07393k529p02K274L037o08k06k1k571j267K767K979J961L841K738Q33O69
14434E20588R70r07k88k63J677j08O37j295K127K461J766j750P73k69M067L312
14418E33498k236n107j10L608L242O39k512K645Q5P13q74j163L832O74j875J817
14402E36876l44j794J86K974L470N28K585j42K813k398J786L210J564l03L747
$$ plain form
14387 554758 557426 556498 555765 552868 553154 554460 554989 558612 559704 559184 560662 561666 560798 560251 557731 556299
14371 556299 560821 566027 567456 564556 563338 563693 565660 567494 567806 565532 563440 564159 568988 568884 567832
14356 567832 572466 576394 577504 575323 574034 574397 571829 574582 577141 576013 576027 577622 580350 583307 584323
14341 584323 582950 584210 582455 579141 581802 584426 588583 592087 594466 597440 597168 596622 594365 591841 592728
14326 592728 595665 597360 598124 599750 599189 598703 596668 597938 598256 600111 601387 600345 599490 602734 605396
14311 605396 607317 609889 613361 614658 613144 613917 613955 613460 614597 616285 616829 620484 618406 616879 618878
14296 618878 620336 623503 626352 626828 626123 622778 622569 623291 626848 625602 624095 626821 627159 625925 628101
14281 628101 631898 634553 636762 636749 636106 632734 631035 635226 639484 642123 641274 644728 645722 645061 643405 639124
$$ packed form
14387E54758K668r28p33k897K86J306N29L623J092n20J478J004q68n47k520j432
14371E56299M522N206J429k900j218L55J967J834L12k274k092P19M829j04j052
14356E67832M634L928J110k181j289L63k568K753K559j128J4J595K728K957J016
14341E84323j373J260j755l314K661K624M157L504K379K974k72n46k257k524Q87
14326E92728K937J695P64J626n61m86k035J270L18J855J276j042q55L244K662
14311F05396J921K572L472J297j514P73L8m95J137J688N44L655k078j527J999
14296F18878J458L167K849M76p05l345k09P22L557j246j507K726L38j234K176
14281F28101L797K655K209j3o43l372j699M191M258K639q49L454R94o61j656m281
$$ plain form
14265 639124 638362 640602 643701 645588 643902 645366 647786 650108 647276 650826 653594 655173 652797 653935
14251 653935 658939 662215 659547 659622 659962 658500 662241 663143 665480 669629 669532 667434 670066 667380 668249 671279
14235 671279 671431 670356 671814 671739 671802 673302 675073 674061 677914 683534 682950 679752 679468 682448 682791 685114
14219 685114 687707 686708 688323 688678 689615 687849 690745 696999 700213 701334 699875 696900 696578 697893 703474
14204 703474 703447 699538 696840 698511 701654 708581 709143 708979 710001 710594 712887 713675 712929 716696 716193 717363
14188 717363 718542 720493 722955 724961 723662 722002 720683 720647 720211 723846 729754 730876 730578 732262 734968
14173 734968 736495 732560 727287 728661 731893 735984 734327 733494 736220 739376 741813 740993 741188 746349 746937
14158 746937 745072 746836 744462 742933 746768 754684 755023 756905 757876 758189 756448 755303 759368 762647 765203
$$ packed form
14265F39124p62K240L099J887j686J464K420K322k832L550K768J579k376J138
14251F53935N004L276k668P5L40j462L741R02K337M149r7k098K632k686Q69L030
14235F71279J52j075J458p5O3J500J771j012L853N620n84l198k84K980L43K323
14219F85114K593r99J615L55R37j766K896O254L214J121j459k975l22J315N581
14204G03474k7l909k698J671L143O927N62j64J022N93K293P88p46L767n03J170
14188G17363J179J951K462K006j299j660j319l6m36L635N908J122k98J684K706
14173G34968J527l935n273J374L232M091j657q33K726L156K437q20J95N161N88
14158G46937j865J764k374j529L835P916L39J882R71L13j741j145M065L279K556
$$ plain form
14143 765203 762800 764187 765006 763798 768056 768946 770967 773557 773299 775593 773413 772517 773714 774040 778311
14128 778311 782070 784574 784980 787196 788907 790761 793147 795202 798192 800412 800342 797755 794586 794447 795566
14113 795566 795955 796770 800545 802903 803592 800242 801984 805581 807747 810106 809244 810199 814414 817566 820925
14098 820925 820129 817109 816966 819102 819492 818512 822314 827570 825788 826318 824979 823950 827193 826499 828973 833660
14082 833660 833707 834522 835824 837447 839554 843111 845887 846818 845922 849712 849254 848296 850894 854588 857845 858230
14066 858230 857531 859065 857882 858176 862827 868168 865630 866196 869476 874864 877771 877363 872732 878590 884414
14051 884414 887518 888075 886175 882399 882813 883451 883326 886878 891820 893751 892194 892310 893265 896926 899962 901521
14035 901521 902188 899955 900712 905645 911013 910904 912265 913943 912705 913111 914582 915963 916195 918806 920246
$$ packed form
14143G65203k403J387Q19j208M258Q90K021K590k58K294k180q96J197L26M271
14128G78311L759K504M06K216J711J854K386K055K990K220p0k587l169j39J119
14113G95566L89Q15L775K358O89l350J742L597K166K359q62R55M215L152L359
14098H20925p96l020j43K136L90r80L802N256j782N30j339j029L243o94K474M687
14082H33660M7Q15J302J623K107L557K776R31q96L790m58r58K598L694L257L85
14066H58230o99J534j183K94M651N341k538N66L280N388K907m08m631N858N824
14051H84414L104N57j900l776M14O38j25L552M942J931j557J16R55L661L036J559
14035I01521O67k233P57M933N368j09J361J678j238M06J471J381K32K611J440
$$ plain form
14020 920246 919459 919148 922345 923203 926233 929307 931759 934638 936234 935954 938187 939752 941442 943237 946619
14005 946619 947424 947372 948994 952521 954238 956309 959494 961490 961989 961725 962714 961132 964602 965960 966819 970074
13989 970074 976223 978408 979782 984464 984575 983383 985543 986877 988708 986795 983776 986494 989336 989901 990119
13974 990119 994241 997320 998970 1000099 1000291 1004086 1007745 1006626 1012336 1015257 1017168 1018125 1018034 1018397 1020434
13959 1020434 1026165 1030511 1030695 1033135 1035413 1035174 1033257 1034027 1034625 1035893 1037315 1040252 1043340 1046133 1046148
13944 1046148 1049720 1050577 1051500 1055455 1060055 1061923 1064317 1066035 1067100 1070550 1069353 1068249 1069632 1071293
13930 1071293 1076018 1079179 1082214 1083079 1086332 1089259 1093082 1092168 1094303 1095641 1097030 1099142 1103474 1105148
13916 1105148 1107535 1110260 1110101 1111303 1111908 1115213 1118336 1122644 1128877 1133331 1133829 1132795 1135310 1135752 1135475
$$ packed form
14020I20246p87l11L197Q58L030L074K452K879J596k80K233J565J690J795L382
14005I46619Q05n2J622L527J717K071L185J996M99k64R89j582L470J358Q59L255
13989I70074O149K185J374M682J11j192K160J334J831j913l019K718K842N65K18
13974I90119M122L079J650J129J92L795L659j119N710K921J911R57r1L63K037
13959A020434N731M346J84K440K278k39j917P70N98J268J422K937L088K793J5
13944A046148L572Q57R23L955M600J868K394J718J065L450j197j104J383J661
13930A071293M725L161L035Q65L253K927L823r14K135J338J389K112M332J674
13916A105148K387K725j59J202O05L305L123M308O233M454M98j034K515M42k77
$$ plain form
13901 1135475 1139755 1142087 1142327 1145076 1146470 1147847 1150168 1154510 1156367 1160678 1166533 1171854 1170448 1169108
13887 1169108 1169326 1172896 1178543 1178302 1178903 1181501 1182419 1180727 1182191 1186944 1189453 1191757 1190934 1189980 1191900
13872 1191900 1194364 1195834 1199000 1204970 1208451 1212887 1217402 1218269 1223709 1230926 1234691 1233319 1235295 1240397
13858 1240397 1243282 1242525 1242921 1247325 1251165 1251794 1257381 1262996 1264574 1265822 1267166 1270322 1271573 1274779 1279865
13843 1279865 1284447 1288344 1291589 1295294 1297646 1298669 1300373 1305796 1309845 1310099 1313902 1317726 1322110 1321535
13829 1321535 1321854 1324846 1327351 1330822 1337761 1344709 1344025 1343505 1346699 1350230 1354885 1359494 1362875 1366623 1368630
13814 1368630 1368728 1371208 1373667 1375890 1379025 1384675 1391311 1396384 1401613 1408546 1414485 1421723 1422184 1425682 1426174
13799 1426174 1427630 1433978 1440482 1448408 1453987 1460031 1463631 1462092 1460582 1460288 1458854 1461353 1467137 1471701
$$ packed form
13901A135475M280K332K40K749J394J377K321M342J857M311N855N321j406j340
13887A169108K18L570N647k41O01K598R18j692J464M753K509K304q23r54J920
13872A191900K464J470L166N970L481M436M515Q67N440P217L765j372J976N102
13858A240397K885p57L96M404L840O29N587N615J578J248J344L156J251L206N086
13843A279865M582L897L245L705K352J023J704N423M049K54L803L824M384n75
13829A321535L19K992K505L471O939O948o84n20L194L531M655M609L381L748K007
13814A368630R8K480K459K223L135N650O636N073N229O933N939P238M61L498M92
13799A426174J456O348O504P926N579O044L600j539j510k94j434K499N784M564
$$ plain form
13785 1471701 1481994 1484315 1489829 1494664 1498285 1502604 1505417 1512486 1518932 1524465 1530117 1531479 1533448 1538632
13771 1538632 1543269 1551307 1560424 1565391 1569484 1577186 1585147 1597721 1616641 1629588 1633113 1641063 1653046
13758 1653046 1660664 1669328 1678082 1686551 1696147 1709236 1724310 1745629 1767221 1785491 1800854 1817472
13746 1817472 1842316 1873135 1902925 1945909 2002237 2059804 2118943 2195276 2301474 2440942 2595312
13735 2595312 2696374 2450687 1505263 667415 532975 679867 837896 957157 1039761 1097454
13725 1097454 1148758 1195455 1232244 1269269 1303827 1331866 1354409 1375425 1395271 1417348 1432483
13714 1432483 1443614 1457136 1472083 1487035 1501907 1510813 1520308 1531908 1545628 1560476 1571843 1576130
13702 1576130 1582757 1592099 1599660 1611612 1626092 1636371 1641895 1648541 1656646 1664223 1671706 1672836 1671158
$$ packed form
13785A471701J0293K321N514M835L621M319K813P069O446N533N652J362J969N184
13771A538632M637Q038R117M967M093P702P961J2574J8920J2947L525P950J1983
13758A653046P618Q664Q754Q469R596J3089J5074K1319K1592J8270J5363J6618
13746A817472K4844L0819K9790M2984N6328N7567N9139P6333J06198J39468J54370
13735B595312J01062k45687r45424q37848j34440J46892J58029J19261Q2604N7693
13725A097454N1304M6697L6789L7025L4558K8039K2543K1016J9846K2077J5135
13714A432483J1131J3522J4947J4952J4872Q906R495J1600J3720J4848J1367M287
13702A576130O627R342P561J1952J4480J0279N524O646Q105P577P483J130j678
$$ plain form
13689 1671158 1670611 1672046 1679075 1683626 1689344 1696747 1704461 1711096 1718673 1723305 1733287 1741110 1749101 1760081
13675 1760081 1771397 1778255 1783911 1792114 1797171 1799966 1805733 1810140 1812583 1816445 1826143 1831322 1838421 1844946
13661 1844946 1853692 1859649 1864182 1871565 1879435 1889937 1897907 1903010 1908789 1911959 1921034 1933375 1943150
13648 1943150 1950866 1960830 1962045 1961464 1962758 1965807 1971391 1978942 1986840 1994337 2001177 2013031 2022133 2028633
13634 2028633 2034062 2042009 2046473 2053081 2059411 2063595 2067603 2069926 2076413 2082403 2088370 2098971 2112081
13621 2112081 2115993 2122076 2130518 2138105 2146506 2155935 2164591 2171739 2181561 2193265 2203735 2209105 2207996
13608 2207996 2205939 2209695 2213974 2218425 2226949 2237304 2246618 2253656 2256390 2262615 2269397 2279333 2285426 2290293
13594 2290293 2295121 2298997 2308218 2315869 2319078 2319239 2328964 2368227 2420755 2447938 2461663 2468098 2470339
$$ packed form
13689A671158n47J435P029M551N718P403P714O635P577M632R982P823P991J0980
13675A760081J1316O858N656Q203N057K795N767M407K443L862R698N179P099O525
13661A844946Q746N957M533P383P870J0502P970N103N779L170R075J2341R775
13648A943150P716R964J215n81J294L049N584P551P898P497O840J1854R102O500
13634B028633N429P947M464O608O330M184M008K323O487N990N967J0601J3110
13621B112081L912O083Q442P587Q401R429Q656P148R822J1704J0470N370j109
13608B207996k057L756M279M451Q524J0355R314P038K734O225O782R936O093M867
13594B290293M828L876R221P651L209J61R725L9263N2528K7183J3725O435K241
$$ plain form
13581 2470339 2476587 2488184 2505247 2514811 2515686 2516113 2521815 2526214 2535402 2545140 2551714 2561105 2574549 2593289
13567 2593289 2604691 2610339 2621442 2631458 2637255 2645482 2656507 2669176 2682572 2691963 2702873 2714225
13555 2714225 2728639 2745037 2756152 2762154 2771849 2786037 2804031 2822238 2839850 2857345 2877195 2899383
13543 2899383 2926129 2951972 2980066 2999029 2978745 2900439 2784012 2739330 2751681 2787344 2822478
13532 2822478 2851998 2876154 2899027 2925711 2956372 2982927 2993093 2997895 3007100 3017464 3033644 3050220
13520 3050220 3065823 3078111 3091512 3107799 3130473 3153023 3170451 3186696 3204247 3226852 3258513
13509 3258513 3285120 3310448 3340384 3365139 3374263 3375466 3380074 3388388 3406907 3434019 3458379 3477052
13497 3477052 3481042 3483052 3485848 3488491 3495175 3512831 3538273 3566044 3591861 3614021 3634251 3662451
$$ packed form
13581B470339O248J1597J7063R564Q75M27N702M399R188R738O574R391J3444J8740
13567B593289J1402N648J1103J0016N797Q227J1025J2669J3396R391J0910J1352
13555B714225J4414J6398J1115O002R695J4188J7994J8207J7612J7495J9850K2188
13543B899383K6746K5843K8094J8963k0284p8306j16427m4682J2351L5663L5134
13532B822478K9520K4156K2873K6684L0661K6555J0166M802R205J0364J6180J6576
13520C050220J5603J2288J3401J6287K2674K2550J7428J6245J7551K2605L1661
13509C258513K6607K5328K9936K4755R124J203M608Q314J8519K7112K4360J8673
13497C477052L990K010K796K643O684J7656K5442K7771K5817K2160K0230K8200
$$ plain form
13485 3662451 3702923 3743941 3781826 3802300 3807140 3813556 3822183 3824652 3821386 3817879 3813223 3817055 3831404
13472 3831404 3854671 3884084 3920873 3953926 3991858 4029861 4054787 4072047 4086890 4093007 4101298 4123930
13460 4123930 4155003 4195947 4235169 4261871 4286251 4311531 4333652 4356572 4378213 4399948 4425202
13449 4425202 4459709 4494755 4536232 4571422 4594719 4607080 4617884 4630399 4643987 4651600 4654509 4640894
13437 4640894 4617666 4630668 4738070 4872195 4975421 5037418 5067019 5093967 5127831 5162044 5187309
13426 5187309 5208517 5237381 5273599 5318423 5366041 5413003 5457218 5500606 5546915 5595308 5651336
13415 5651336 5708632 5775075 5846543 5935379 6063020 6115998 6137954 6159726 6186852 6219500 6247838
13404 6247838 6286514 6330324 6380008 6433911 6486682 6533444 6575731 6627503 6692580 6769247 6849248
$$ packed form
13485C662451M0472M1018L7885K0474M840O416Q627K469l266l507m656L832J4349
13472C831404K3267K9413L6789L3053L7932L8003K4926J7260J4843O117Q291K2632
13460D123930L1073M0944L9222K6702K4380K5280K2121K2920K1641K1735K5254
13449D425202L4507L5046M1477L5190K3297J2361J0804J2515J3588P613K909j3615
13437D640894k3228J3002J07402J34125J03226O1997K9601K6948L3864L4213K5265
13426E187309K1208K8864L6218M4824M7618M6962M4215M3388M6309M8393N6028
13415E651336N7296O6443P1468Q8836J27641N2978K1956K1772K7126L2648K8338
13404F247838L8676M3810M9684N3903N2771M6762M2287N1772O5077P6667Q0001
$$ plain form
13393 6849248 6920017 6985704 7054392 7122346 7188444 7256007 7330400 7398531 7468395 7554510 7638329
13382 7638329 7718587 7791595 7856819 7929060 8020655 8116519 8210217 8296231 8373026 8460312 8561858
13371 8561858 8672982 8791559 8913458 9038278 9149003 9251961 9360255 9480757 9602520
13362 9602520 9718934 9839374 9969247 10106247 10245996 10395876 10545769 10697229 10844248
13353 10844248 10985272 11142283 11317824 11503529 11702440 11897609 12084105 12275550 12485342
13344 12485342 12712916 12933669 13127690 13318379 13540418 13796242 14058199 14315902 14589872
13335 14589872 14890556 15199050 15506507 15820549 16156839 16501084 16857306 17252855 17678288
13326 17678288 18123519 18569460 19014780 19527664 20109633 20717945 21324732 21930384 22573237
$$ packed form
13393F849248P0769O5687O8688O7954O6098O7563P4393O8131O9864Q6115Q3819
13382G638329Q0258P3008O5224P2241R1595R5864R3698Q6014P6795Q7286J01546
13371H561858J11124J18577J21899J24820J10725J02958J08294J20502J21763
13362I602520J16414J20440J29873J37000J39749J49880J49893J51460J47019
13353A0844248J41024J57011J75541J85705J98911J95169J86496J91445K09792
13344A2485342K27574K20753J94021J90689K22039K55824K61957K57703K73970
13335A4589872L00684L08494L07457L14042L36290L44245L56222L95549M25433
13326A7678288M45231M45941M45320N12884N81969O08312O06787O05652O42853
$$ plain form
13317 22573237 23258137 23980099 24769713 25622409 26527899 27486096 28495062 29601004 30840617
13308 30840617 32191719 33632924 35168392 36848735 38712755 40777813 43121097 45732192
13300 45732192 48655641 52023446 55852525 60216318 65323782 71464846 78957551 88024280
13292 88024280 98873325 111665747 128026409 149588776 174347832 194810279 182967111
13285 182967111 74706385 -99838291 -188988299 -187644729 -161707689 -137301927 -118377654
13278 -118377654 -104975447 -95225709 -86481427 -78479573 -71595592 -65746841 -60675242 -56306729
13270 -56306729 -52579030 -49328480 -46399129 -43789347 -41439807 -39307884 -37400629 -35677158
13262 -35677158 -34112305 -32712091 -31449487 -30262803 -29112147 -28025417 -27033625 -26131580
$$ packed form
13317B2573237O84900P21962P89614Q52696R05490R58197J008966J105942J239613
13308C0840617J351102J441205J535468J680343J864020K065058K343284K611095
13300D5732192K923449L367805L829079M363793N107464O141064P492705R066729
13292H8024280J0849045J2792422J6360662K1562367K4759056K0462447j1843168
13285A82967111j08260726j74544676q9150008J343570K5937040K4405762J8924273
13278a18377654J3402207R749738Q744282Q001854O883981N848751N071599M368513
13270e6306729L727699L250550K929351K609782K349540K131923J907255J723471
13262c5677158J564853J400214J262604J186684J150656J086730R91792R02045
$$ plain form
13254 -26131580 -25288867 -24475632 -23700488 -22974291 -22289083 -21660864 -21097494 -20606522 -20137360
13245 -20137360 -19626035 -19107420 -18641764 -18219456 -17823595 -17430707 -17033833 -16653643 -16294950
13236 -16294950 -15945501 -15613989 -15314377 -15026024 -14723691 -14430044 -14165673 -13912637 -13642335
13227 -13642335 -13359818 -13106280 -12893007 -12693240 -12492236 -12290646 -12104330 -11923894 -11753396
13218 -11753396 -11586364 -11420675 -11244501 -11060085 -10895592 -10751916 -10617448 -10480897 -10342980
13209 -10342980 -10203541 -10067111 -9926803 -9794538 -9670347 -9550039 -9424258 -9304872 -9200694
13200 -9200694 -9102049 -9005030 -8911428 -8818444 -8720761 -8614141 -8503226 -8408673 -8324911 -8239397 -8152035
13189 -8152035 -8055497 -7959980 -7868859 -7788365 -7721085 -7656133 -7573738 -7490080 -7412076 -7334632 -7260395
$$ packed form
13254b6131580Q42713Q13235P75144P26197O85208O28219N63370M90972M69162
13245b0137360N11325N18615M65656M22308L95861L92888L96874L80190L58693
13236a6294950L49449L31512K99612K88353L02333K93647K64371K53036K70302
13227a3642335K82517K53538K13273J99767K01004K01590J86316J80436J70498
13218a1753396J67032J65689J76174J84416J64493J43676J34468J36551J37917
13209a0342980J39439J36430J40308J32265J24191J20308J25781J19386J04178
13200i200694R8645R7019R3602R2984R7683J06620J10915R4553Q3762Q5514Q7362
13189h152035R6538R5517R1121Q0494O7280O4952Q2395Q3658P8004P7444P4237
$$ plain form
13178 -7260395 -7189878 -7116154 -7051380 -6997964 -6945232 -6890712 -6826472 -6745057 -6663837 -6597287 -6534317
13167 -6534317 -6471100 -6407773 -6339329 -6263886 -6176541 -6085401 -6000408 -5937217 -5918202 -5965717 -6053283
13156 -6053283 -6115224 -6113574 -6072758 -6019961 -5968468 -5921968 -5877127 -5832379 -5786163 -5745436 -5718849
13145 -5718849 -5689666 -5647765 -5597862 -5542907 -5492527 -5449842 -5406560 -5359452 -5320847 -5317867 -5355485
13134 -5355485 -5423294 -5456911 -5388656 -5284500 -5205596 -5149533 -5098335 -5050098 -4997652 -4942628 -4893053
13123 -4893053 -4860447 -4834402 -4809555 -4791672 -4775681 -4750264 -4716932 -4680825 -4648747 -4620103 -4595638
13112 -4595638 -4568649 -4542379 -4529059 -4520335 -4502089 -4471493 -4425141 -4379241 -4349623 -4326663 -4310492
13101 -4310492 -4303784 -4292505 -4276781 -4271015 -4265812 -4246264 -4209542 -4161691 -4116117 -4073671 -4027120 -3990852
$$ packed form
13178g260395P0517P3724O4774N3416N2732N4520O4240Q1415Q1220O6550O2970
13167f534317O3217O3327O8444P5443Q7345R1140Q4993O3191J9015m7515q7566
13156f053283o1941J650M0816N2797N1493M6500M4841M4748M6216M0727K6587
13145e718849K9183M1901M9903N4955N0380M2685M3282M7108L8605K980l7618
13134e355485o7809l3617O8255J04156P8904N6063N1198M8237N2446N5024M9575
13123d893053L2606K6045K4847J7883J5991K5417L3332L6107L2078K8644K4465
13112d595638K6989K6270J3320Q724J8246L0596M6352M5900K9618K2960J6171
13101d310492O708J1279J5724N766N203J9548L6722M7851M5574M2446M6551L6268
$$ plain form
13089 -3990852 -3959887 -3921593 -3890190 -3870115 -3865268 -3866065 -3866160 -3861593 -3850069 -3836291 -3822816 -3806034 -3795907
13076 -3795907 -3779006 -3749047 -3711933 -3678523 -3650049 -3626368 -3610895 -3598073 -3587550 -3571124 -3548425
13065 -3548425 -3515547 -3482258 -3464968 -3463925 -3465877 -3455923 -3452130 -3448738 -3433185 -3418564 -3409027 -3396392
13053 -3396392 -3386535 -3378784 -3367363 -3350585 -3331286 -3315688 -3299416 -3283146 -3271694 -3252243 -3227547 -3209521
13041 -3209521 -3203047 -3199906 -3193723 -3185354 -3168246 -3150708 -3136588 -3121571 -3117408 -3122850 -3133184 -3132379 -3113430
13028 -3113430 -3094311 -3079154 -3063322 -3051491 -3037125 -3025919 -3016304 -3001513 -2985163 -2973405 -2961201
13017 -2961201 -2946687 -2927934 -2915540 -2910202 -2902884 -2889825 -2876788 -2866994 -2856146 -2848476 -2838145 -2822713
13005 -2822713 -2806153 -2790893 -2777956 -2766347 -2763076 -2763613 -2754926 -2741093 -2731623 -2722845 -2709884 -2697216
$$ packed form
13089c990852L0965L8294L1403K0075M847p97r5M567J1524J3778J3475J6782J0127
13076c795907J6901K9959L7114L3410K8474K3681J5473J2822J0523J6426K2699
13065c548425L2878L3289J7290J043j952R954L793L392J5553J4621R537J2635
13053c396392R857P751J1421J6778J9299J5598J6272J6270J1452J9451K4696J8026
13041c209521O474L141O183Q369J7108J7538J4120J5017M163n442j0334Q05J8949
13028c113430J9119J5157J5832J1831J4366J1206R615J4791J6350J1758J2204
13017b961201J4514J8753J2394N338P318J3059J3037R794J0848P670J0331J5432
13005b822713J6560J5260J2937J1609L271n37Q687J3833R470Q778J2961J2668
$$ plain form
12993 -2697216 -2683616 -2662356 -2643769 -2638516 -2631652 -2617525 -2605560 -2592914 -2585910 -2582197 -2592757 -2631840
12981 -2631840 -2652357 -2639251 -2617205 -2605493 -2596793 -2590188 -2578669 -2563310 -2551933 -2543959 -2537593 -2528019
12969 -2528019 -2512710 -2500302 -2494185 -2490122 -2485799 -2475477 -2462719 -2450186 -2436317 -2420888 -2405536 -2395044
12957 -2395044 -2391111 -2383409 -2375488 -2368968 -2364926 -2358247 -2348009 -2340041 -2330061 -2324128 -2316803 -2308997 -2305664 -2297166
12943 -2297166 -2282363 -2273951 -2265153 -2256577 -2240114 -2224349 -2211446 -2196300 -2175368 -2155681 -2146847 -2156466
12931 -2156466 -2189169 -2233653 -2276913 -2303411 -2297505 -2279581 -2262116 -2243378 -2228181 -2214254 -2201178
12920 -2201178 -2195243 -2189215 -2179504 -2169042 -2161750 -2153900 -2147356 -2146382 -2139672 -2133838 -2127983 -2120563 -2109812 -2102960
12906 -2102960 -2095520 -2087147 -2082495 -2078210 -2068600 -2055232 -2044255 -2035982 -2029061 -2024807 -2022524 -2017459 -2011196
$$ packed form
12993b697216J3600K1260J8587N253O864J4127J1965J2646P004L713j0560l9083
12981b631840k0517J3106K2046J1712Q700O605J1519J5359J1377P974O366R574
12969b528019J5309J2408O117M063M323J0322J2758J2533J3869J5429J5352J0492
12957b395044L933P702P921O520M042O679J0238P968R980N933P325P806L333Q498
12943b297166J4803Q412Q798Q576J6463J5765J2903J5146K0932J9687Q834r619
12931b156466l2703m4484m3260k6498N906J7924J7465J8738J5197J3927J3076
12920b201178N935O028R711J0462P292P850O544R74O710N834N855P420J0751O852
12906b102960P440Q373M652M285R610J3368J0977Q273O921M254K283N065O263
$$ plain form
12893 -2011196 -2005910 -1999430 -1996495 -1987981 -1978803 -1974783 -1966200 -1960612 -1954891 -1943779 -1937103 -1929683 -1923175 -1916784
12879 -1916784 -1910946 -1904595 -1896147 -1890389 -1889240 -1883012 -1875314 -1864274 -1850294 -1841885 -1836512 -1833025 -1829543
12866 -1829543 -1824705 -1817396 -1806964 -1799740 -1796046 -1785484 -1778881 -1773089 -1768790 -1761225 -1749992 -1743409 -1735482
12853 -1735482 -1721395 -1707955 -1690993 -1680457 -1667697 -1648179 -1628646 -1610993 -1591230 -1570646 -1548925
12842 -1548925 -1522986 -1487603 -1442132 -1396769 -1348415 -1294513 -1231899 -1156302 -1062840 -936826 -786197
12831 -786197 -663351 -788396 -1593748 -2554428 -2827601 -2723695 -2566941 -2430258 -2330116 -2264468
12821 -2264468 -2203076 -2150072 -2110285 -2079101 -2048137 -2017567 -1989500 -1960555 -1941246 -1922020 -1904570
12810 -1904570 -1890050 -1872706 -1853024 -1839617 -1833888 -1827469 -1824192 -1816536 -1805549 -1791181 -1783487 -1780664
$$ packed form
12893b011196N286O480K935Q514R178M020Q583N588N721J1112O676P420O508O391
12879a916784N838O351Q448N758J149O228P698J1040J3980Q409N373L487L482
12866a829543M838P309J0432P224L694J0562O603N792M299P565J1233O583P927
12853a735482J4087J3440J6962J0536J2760J9518J9533J7653J9763K0584K1721
12842a548925K5939L5383M5471M5363M8354N3902O2614P5597R3462J26014J50629
12831g86197J22846j25045q05352r60680k73173J03906J56754J36683J00142O5648
12821b264468O1392N3004L9787L1184L0964L0570K8067K8945J9309J9226J7450
12810a904570J4520J7344J9682J3407N729O419L277P656J0987J4368P694K823
$$ plain form
12798 -1780664 -1775322 -1769015 -1758405 -1746117 -1734621 -1727476 -1721118 -1715863 -1711576 -1706843 -1701044 -1691101 -1679205
12785 -1679205 -1672507 -1665434 -1661850 -1656038 -1650946 -1644276 -1640674 -1636311 -1629115 -1623559 -1620507 -1618160 -1614067 -1605703
12771 -1605703 -1596988 -1589508 -1583641 -1580130 -1574402 -1570047 -1566514 -1560772 -1556848 -1552320 -1545756 -1542980 -1539170 -1533061
12757 -1533061 -1522268 -1514248 -1507707 -1498260 -1489742 -1480851 -1473918 -1467794 -1462935 -1459646 -1452469 -1444219 -1438642 -1426101
12743 -1426101 -1415872 -1405199 -1390269 -1375947 -1359685 -1342534 -1324776 -1304864 -1280262 -1256183 -1225405
12732 -1225405 -1183934 -1128560 -1061504 -985765 -910128 -902279 -1094068 -1437502 -1790414 -2015938 -2024749
12721 -2024749 -1946050 -1869294 -1810543 -1762109 -1724627 -1695950 -1668791 -1645843 -1626783 -1609220 -1592611
12710 -1592611 -1575061 -1556732 -1539547 -1525461 -1514207 -1504295 -1495993 -1486793 -1479362 -1468405 -1455850 -1443587
$$ packed form
12798a780664N342O307J0610J2288J1496P145O358N255M287M733N799R943J1896
12785a679205O698P073L584N812N092O670L602M363P196N556L052K347M093Q364
12771a605703Q715P480N867L511N728M355L533N742L924M528O564K776L810O109
12757a533061J0793Q020O541R447Q518Q891O933O124M859L289P177Q250N577J2541
12743a426101J0229J0673J4930J4322J6262J7151J7758J9912K4602K4079L0778
12732a225405M1471N5374O7056P5739P5637P849j91789l43434l52912k25524q811
12721b024749P8699P6756N8751M8434L7482K8677K7159K2948J9060J7563J6609
12710a592611J7550J8329J7185J4086J1254R912Q302R200P431J0957J2555J2263
$$ plain form
12698 -1443587 -1431038 -1420461 -1412461 -1403369 -1388854 -1373558 -1361154 -1343790 -1324710 -1304474 -1282991 -1257263
12686 -1257263 -1228849 -1193223 -1151277 -1090110 -1019018 -935573 -864696 -913587 -1313813 -1827398 -1990521
12675 -1990521 -1954282 -1884398 -1816502 -1762548 -1720409 -1685623 -1658157 -1633443 -1612285 -1590347 -1573729
12664 -1573729 -1558844 -1543920 -1532498 -1520652 -1511917 -1506790 -1503066 -1497702 -1489221 -1478352 -1468768 -1460923 -1456567
12651 -1456567 -1451830 -1448915 -1447661 -1441550 -1434368 -1428384 -1425325 -1422105 -1417738 -1409003 -1400525 -1396271 -1394068 -1391146
12637 -1391146 -1389696 -1386640 -1382342 -1380549 -1377140 -1373209 -1368215 -1362793 -1362969 -1364081 -1363033 -1359562 -1349039 -1345893
12623 -1345893 -1345359 -1342966 -1341765 -1337284 -1333782 -1333355 -1334253 -1330674 -1327286 -1322928 -1319325 -1315475 -1311035 -1309604 -1307429
12608 -1307429 -1302674 -1300013 -1299372 -1300076 -1295404 -1290128 -1286595 -1283987 -1285190 -1285991 -1284606 -1281521 -1281011 -1281682 -1278631
$$ packed form
12698a443587J2549J0577Q000R092J4515J5296J2404J7364J9080K0236K1483K5728
12686a257263K8414L5626M1946O1167P1092Q3445P0877m8891m00226n13585j63123
12675a990521L6239O9884O7896N3954M2139L4786K7466K4714K1158K1938J6618
12664a573729J4885J4924J1422J1846Q735N127L724N364Q481J0869R584P845M356
12651a456567M737K915J254O111P182N984L059L220M367Q735Q478M254K203K922
12637a391146J450L056M298J793L409L931M994N422j76j112J048L471J0523L146
12623a345893N34K393J201M481L502M27q98L579L388M358L603L850M440J431K175
12608a307429M755K661O41p04M672N276L533K608j203q01J385L085N10o71L051
$$ plain form
12593 -1278631 -1275208 -1267396 -1262231 -1262099 -1263974 -1262291 -1258406 -1256953 -1254754 -1250152 -1248302 -1251756 -1253580 -1252585
12579 -1252585 -1249021 -1244868 -1239190 -1236201 -1237771 -1240163 -1239992 -1235354 -1235504 -1232020 -1226503 -1221269 -1221787 -1222629 -1221903
12564 -1221903 -1219897 -1220672 -1219361 -1213621 -1208529 -1206327 -1203727 -1203116 -1200359 -1195493 -1196537 -1198613 -1194319 -1189151
12550 -1189151 -1188922 -1185928 -1184007 -1184935 -1187350 -1187598 -1185303 -1181759 -1177732 -1172932 -1169511 -1170690 -1172106 -1173245 -1173852
12535 -1173852 -1171944 -1168443 -1164196 -1162865 -1159679 -1159578 -1158844 -1157426 -1154175 -1154243 -1152825 -1150655 -1147790 -1149533 -1148365
12520 -1148365 -1144069 -1141317 -1138333 -1134532 -1133457 -1137135 -1143436 -1144714 -1140957 -1137554 -1132984 -1129089 -1127761 -1127142
12506 -1127142 -1124674 -1120487 -1115356 -1114455 -1114124 -1112957 -1110222 -1110947 -1112349 -1114008 -1113129 -1107078 -1103785 -1103834 -1102840 -1102269
12490 -1102269 -1097591 -1096763 -1098941 -1097710 -1095994 -1092974 -1091006 -1088852 -1087294 -1082866 -1080886 -1079653 -1079257 -1077415
$$ packed form
12593a278631L423P812N165J32j875J683L885J453K199M602J850l454j824R95
12579a252585L564M153N678K989j570k392J71M638j50L484N517N234n18q42P26
12564a221903K006p75J311N740N092K202K600O11K757M866j044k076M294N168
12550a189151K29K994J921r28k415k48K295L544M027M800L421j179j416j139o07
12535a173852J908L501M247J331L186J01P34J418L251o8J418K170K865j743J168
12520a148365M296K752K984L801J075l678o301j278L757L403M570L895J328O19
12506a127142K468M187N131R01L31J167K735p25j402j659Q79O051L293m9R94N71
12490a102269M678Q28k178J231J716L020J968K154J558M428J980J233L96J842
$$ plain form
12476 -1077415 -1074695 -1071151 -1074661 -1075851 -1076306 -1074073 -1071983 -1066480 -1062680 -1060096 -1055790 -1054621 -1053161 -1056376
12462 -1056376 -1062042 -1069617 -1076187 -1079303 -1075035 -1068865 -1065775 -1060967 -1056061 -1051931 -1047959 -1046883 -1049326 -1045882
12448 -1045882 -1041746 -1041697 -1040427 -1039276 -1035456 -1030727 -1029185 -1028191 -1028070 -1032355 -1031412 -1027686 -1026329 -1028331 -1028130
12433 -1028130 -1024678 -1020102 -1019617 -1018415 -1016483 -1016941 -1021331 -1025225 -1026161 -1024781 -1023230 -1021436 -1018627 -1017496 -1017150
12418 -1017150 -1011928 -1009282 -1003850 -999496 -1003541 -1008008 -1010823 -1011783 -1011918 -1013573 -1015344 -1009829 -1003056 -1000750
12404 -1000750 -1002531 -998262 -995498 -994351 -991487 -989046 -986945 -983638 -982983 -986322 -988707 -988796 -989314 -987636 -982453
12389 -982453 -982074 -982717 -980101 -977499 -976246 -974894 -972554 -969808 -971971 -971943 -969508 -967603 -966097 -965595 -963687
12374 -963687 -962157 -959810 -960174 -961063 -957599 -952854 -951803 -947975 -944197 -943366 -942927 -950020 -959630 -965100 -966275
$$ packed form
12476a077415K720L544l510j190m55K233K090N503L800K584M306J169J460l215
12462a056376n666p575o570l116M268O170L090M808M906M130L972J076k443L444
12448a045882M136M9J270J151L820M729J542R94J21m285R43L726J357k002K01
12433a028130L452M576M85J202J932m58m390l894r36J380J551J794K809J131L46
12418a017150N222K646N432M354m045m467k815r60j35j655j771N515O773K306
12404a000750j781M269K764J147K864K441K101L307O55l339k385q9n18J678N183
12389i82453L79o43K616K602J253J352K340K746k163K8K435J905J506N02J908
12374i63687J530K347l64q89L464M745J051L828L778Q31M39p093r610n470j175
$$ plain form
12359 -966275 -966104 -963299 -957329 -954363 -950990 -950611 -951518 -947585 -947795 -947252 -947511 -945773 -946895 -945515 -938755 -938676
12343 -938676 -938715 -940635 -943807 -942778 -941377 -937757 -939131 -938532 -939483 -935941 -934013 -932781 -933187 -936212 -930379
12328 -930379 -929709 -931053 -927793 -923891 -923400 -922841 -923268 -923277 -922131 -919832 -915918 -912198 -914528 -915664 -915712 -912300
12312 -912300 -912546 -912402 -910904 -908602 -906715 -909032 -905532 -901202 -900546 -899685 -898016 -894616 -891067 -888634 -891157
12297 -891157 -889846 -892334 -893836 -891746 -888345 -888335 -887465 -886220 -884665 -884448 -879815 -878915 -878700 -877469 -877361 -876252
12281 -876252 -877231 -879927 -881329 -881688 -881738 -881312 -878900 -875595 -876553 -876365 -876261 -874180 -874526 -871847 -869439 -872665
12265 -872665 -873745 -868257 -867565 -866758 -866697 -865949 -864078 -863088 -861500 -859080 -855146 -857149 -857693 -856372 -857169 -860626
12249 -860626 -860317 -856262 -854592 -855834 -855231 -852670 -848133 -842464 -841626 -846495 -845986 -845129 -843298 -842609 -842834 -842419
$$ packed form
12359i66275J71K805N970K966L373L79r07L933k10N43k59J738j122J380O760P9
12343i38676l9j920l172J029J401L620j374N99r51L542J928J232m06l025N833
12328i30379O70j344L260L902M91N59m27rJ146K299L914L720k330j136m8L412
12312i12300k46J44J498K302J887k317L500M330O56Q61J669L400L549K433k523
12297h91157J311k488j502K090L401J0Q70J245J555K17M633R00K15J231J08J109
12281h76252r79k696j402l59n0M26K412L305r58J88J04K081l46K679K408l226
12265h72665j080N488O92Q07O1P48J871R90J588K420L934k003n44J321p97l457
12249h60626L09M055J670j242O03K561M537N669Q38m869N09Q57J831O89k25M15
$$ plain form
12233 -842419 -843776 -842243 -836076 -832796 -835275 -841047 -841726 -838103 -838723 -839653 -839730 -839270 -840008 -837870 -834173 -831010
12217 -831010 -827513 -826503 -825960 -824839 -826821 -827380 -825612 -824150 -822939 -825318 -827671 -826259 -823740 -826061 -829743
12202 -829743 -829823 -824151 -819177 -819988 -820854 -817689 -818895 -818935 -815551 -815043 -815036 -812251 -811821 -810634 -808883 -808803 -808914 -806979
12184 -806979 -806580 -808697 -808061 -807757 -805815 -808476 -806968 -807170 -805564 -802216 -799833 -799932 -803275 -806371 -802464 -799093
12168 -799093 -799498 -800190 -800131 -797454 -795708 -795807 -794818 -794672 -793431 -793668 -793755 -791948 -793674 -793556 -792463 -789933 -785267
12151 -785267 -787386 -787231 -786125 -783812 -781372 -778954 -777708 -778539 -778671 -776791 -776708 -775487 -777984 -776670 -773820
12136 -773820 -778552 -781799 -782069 -779394 -776929 -777871 -779564 -779039 -776863 -772931 -771361 -770758 -769303 -765743 -765600
12121 -765600 -769011 -768208 -765251 -761909 -761452 -760919 -761518 -765270 -763461 -759796 -756205 -758240 -760474 -763500 -765814
$$ packed form
12233h42419j357J533O167L280k479n772o79L623o20r30p7M60p38K138L697L163
12217h31010L497J010N43J121j982n59J768J462J211k379k353J412K519k321l682
12202h29743q0N672M974q11q66L165j206m0L384N08PK785M30J187J751Q0j11J935
12184h06979L99k117O36L04J942k661J508k02J606L348K383r9l343l096L907L371
12168g99093m05o92N9K677J746r9R89J46J241k37q7J807j726J18J093K530M666
12151g85267k119J55J106K313K440K418J246q31j32J880Q3J221k497J314K850
12136g73820m732l247k70K675K465r42j693N25K176L932J570O03J455L560J43
12121g65600l411Q03K957L342M57N33n99l752J809L665L591k035k234l026k314
$$ plain form
12106 -765814 -766577 -762864 -762351 -763658 -763581 -763454 -760290 -756040 -755546 -756147 -754712 -754043 -755727 -753520 -752535 -751523
12090 -751523 -749173 -746649 -745578 -752001 -750682 -745626 -743467 -745623 -745837 -743628 -744591 -743787 -742651 -741516 -740951
12075 -740951 -739313 -738243 -738874 -738204 -738349 -735683 -734913 -736439 -736036 -734819 -736643 -740845 -737367 -731706 -732653 -736279
12059 -736279 -734650 -734604 -734002 -734710 -732795 -729401 -726641 -725195 -728704 -733263 -734665 -734345 -734680 -728340 -727278 -726202
12043 -726202 -724491 -722403 -720552 -719080 -718812 -720655 -721896 -722431 -726485 -725398 -721949 -717357 -716769 -716634 -717435
12028 -717435 -718533 -718254 -713664 -707384 -706894 -705669 -705698 -705158 -704304 -704210 -706190 -707276 -707506 -706077 -705340 -703184 -701472
12011 -701472 -702047 -701517 -700029 -702538 -702969 -701264 -703569 -705378 -701830 -698619 -699067 -696862 -696498 -697967 -696678
11996 -696678 -696216 -697296 -693500 -689887 -689898 -690842 -691014 -691639 -691767 -689829 -689006 -694027 -694715 -692353 -690475 -690351 -690457
$$ packed form
12106g65814p63L713N13j307P7J27L164M250M94o01J435O69j684K207R85J012
12090g51523K350K524J071o423J319N056K159k156k14K209r63Q04J136J135N65
12075g40951J638J070o31O70j45K666P70j526M03J217j824m202L478N661r47l626
12059g36279J629M6O02p08J915L394K760J446l509m559j402L20l35O340J062J076
12043g26202J711K088J851J472K68j843j241n35m054J087L449M592N88J35q01
12028g17435j098K79M590O280M90J225k9N40Q54R4j980j086k30J429P37K156J712
12011g01472n75N30J488k509m31J705k305j809L548L211m48K205L64j469J289
11996f96678M62j080L796L613j1r44j72o25j28J938Q23n021o88K362J878J24j06
$$ plain form
11979 -690457 -688592 -688705 -687957 -683735 -683977 -685276 -684807 -681856 -681369 -681706 -681100 -680365 -684328 -683216 -680269 -680715
11963 -680715 -678322 -679602 -680148 -680244 -682180 -679731 -678023 -677332 -676283 -675178 -677545 -675982 -674164 -674738 -672347
11948 -672347 -674638 -673185 -668852 -667706 -668791 -668734 -669494 -668062 -668141 -666065 -665711 -662854 -659579 -659568 -662236 -668281
11932 -668281 -675812 -678468 -675268 -669659 -666290 -667530 -668773 -665404 -665789 -666034 -665264 -666312 -663991 -665402 -661989
11917 -661989 -659177 -655884 -652450 -653248 -652804 -648797 -648204 -648829 -653341 -657405 -661262 -660267 -660707 -658831 -659532 -661386
11901 -661386 -658619 -659264 -660636 -659613 -659675 -658232 -653883 -654831 -653360 -650485 -650367 -645991 -642418 -644186 -649062
11886 -649062 -649700 -650411 -647401 -644535 -647434 -646984 -644530 -645745 -649372 -649855 -651934 -646586 -644932 -647409 -646692
11871 -646692 -644208 -643508 -643375 -643464 -641565 -639751 -638629 -637103 -636917 -635745 -636213 -635897 -636806 -635621 -632524 -633383
$$ packed form
11979f90457J865j13P48M222k42j299M69K951M87l37O06P35l963J112K947m46
11963f80715K393j280n46r6j936K449J708O91J049J105k367J563J818n74K391
11948f72347k291J453M333J146j085N7p60J432p9K076L54K857L275J1k668o045
11932f68281p531k656L200N609L369j240j243L369l85k45P70j048K321j411L413
11917f61989K812L293L434p98M44M007N93o25m512m064l857R95m40J876p01j854
11901f61386K767o45j372J023o2J443M349r48J471K875J18M376L573j768m876
11886f49062o38p11L010K866k899M50K454j215l627m83k079N348J654k477P17
11871f46692K484P00J33q9J899J814J122J526J86J172m68L16r09J185L097q59
$$ plain form
11855 -633383 -634930 -631858 -628942 -627490 -630029 -629787 -631569 -632277 -631216 -632554 -636079 -635752 -634309 -632335 -629886
11840 -629886 -626310 -625178 -628066 -628426 -625164 -622891 -622997 -622400 -619714 -619711 -625267 -626688 -626719 -627516 -623996 -621007
11824 -621007 -617417 -617849 -619867 -617189 -616455 -615554 -613492 -612169 -612711 -611911 -613411 -616666 -618165 -617730 -616160 -618077
11808 -618077 -618938 -618713 -617585 -615835 -615160 -614426 -614540 -615191 -614641 -612724 -613500 -617275 -617336 -614255 -612004 -611169 -612506
11791 -612506 -611419 -611349 -610379 -613962 -614978 -612376 -611964 -611866 -611788 -608328 -603411 -602450 -602969 -605326 -604291 -600671 -598051
11774 -598051 -599438 -601199 -603538 -604092 -605340 -606341 -605320 -602194 -599003 -596363 -595577 -595203 -596346 -595534 -596100
11759 -596100 -598574 -596844 -596612 -598592 -598089 -597147 -597370 -594161 -594211 -600126 -600039 -596873 -598475 -597769 -596370 -594915
11743 -594915 -595578 -593180 -591471 -592785 -591646 -590125 -587722 -587640 -591988 -593405 -595132 -593631 -591544 -587346 -587633
$$ packed form
11855f33383j547L072K916J452k539K42j782p08J061j338l525L27J443J974K449
11840f29886L576J132k888l60L262K273j06N97K686Ln556j421l1p97L520K989
11824f21007L590m32k018K678P34R01K062J323n42Q00j500l255j499M35J570j917
11808f18077q61K25J128J750O75P34j14o51N50J917p76l775o1L081K251Q35j337
11791f12506J087P0R70l583j016K602M12R8P8L460M917R61n19k357J035L620K620
11774e98051j387j761k339n54j248j001J021L126L191K640P86L74j143Q12n66
11759e96100k474J730K32j980N03R42k23L209n0n915Q7L166j602P06J399J455
11743e94915o63K398J709j314J139J521K403Q2m348j417j727J501K087M198k87
$$ plain form
11728 -587633 -587147 -586513 -588061 -589520 -589033 -588842 -590065 -589835 -589762 -586102 -581947 -583645 -583978 -584320 -583646 -582819 -581478
11711 -581478 -585204 -586821 -585578 -586204 -584924 -581284 -584171 -586076 -581616 -578761 -576457 -578962 -578642 -574952 -575513
11696 -575513 -577805 -577993 -574199 -573623 -572061 -572052 -568822 -568098 -570170 -572006 -572181 -569428 -568957 -570869 -569613 -570489
11680 -570489 -575080 -573615 -572378 -571738 -570932 -570829 -569384 -572091 -573743 -574657 -574253 -570894 -569234 -569693 -570686 -568099
11664 -568099 -566927 -566121 -567344 -567582 -566537 -564289 -562992 -563319 -561286 -559770 -560163 -561837 -560909 -556901 -554896
11649 -554896 -556620 -556620 -555745 -557899 -562160 -563752 -567757 -567276 -560793 -560167 -558853 -559329 -562137 -562621 -560047 -557683
11633 -557683 -559023 -559618 -558076 -555901 -555984 -556671 -553801 -555270 -554321 -551902 -552457 -552891 -553348 -552861 -553065 -551327 -550258
11616 -550258 -551100 -550841 -551482 -553358 -552338 -548999 -550306 -554221 -554372 -553468 -553327 -551684 -550443 -551088 -548204 -546009
$$ packed form
11728e87633M86O34j548j459M87J91j223K30P3L660M155j698l33l42O74Q27J341
11711e81478l726j617J243o26J280L640k887j905M460K855K304k505L20L690n61
11696e75513k292j88L794N76J562RL230P24k072j836j75K753M71j912J256q76
11680e70489m591J465J237O40Q06J03J445k707j652r14M04L359J660m59r93K587
11664e68099J172Q06j223k38J045K248J297l27K033J516l93j674R28M008K005
11649e54896j724%Q75k154m261j592m005M81O483O26J314m76k808m84K574K364
11633e57683j340n95J542K175q3o87K870j469R49K419n55m34m57M87k04J738J069
11616e50258q42K59o41j876J020L339j307l915j51R04J41J643J241o45K884K195
$$ plain form
11600 -546009 -546083 -546521 -545557 -544572 -545605 -542253 -540301 -540846 -542747 -547596 -549830 -548870 -544721 -543118 -541142 -539178
11584 -539178 -538836 -537512 -537872 -534727 -535829 -535145 -534522 -536291 -538652 -542983 -543233 -541259 -539340 -539010 -537287 -531201
11568 -531201 -528317 -531682 -533601 -535346 -535595 -533887 -531910 -531215 -531429 -529957 -528350 -530787 -531427 -533085 -535284
11553 -535284 -533393 -533019 -531774 -529653 -530307 -527295 -526105 -528808 -528769 -528576 -527301 -529584 -527845 -527275 -527016 -528492
11537 -528492 -526353 -527630 -527184 -526611 -528844 -532445 -529695 -528235 -527925 -529281 -530670 -530267 -527250 -527945 -530780
11522 -530780 -532543 -531704 -532328 -533555 -532565 -530239 -528443 -526924 -527620 -524347 -521542 -522043 -522691 -525213 -526029 -523807
11506 -523807 -520036 -520480 -523782 -524644 -520402 -516777 -515329 -517980 -519468 -518575 -517741 -521955 -523409 -522641 -519422
11491 -519422 -517061 -513575 -510482 -512059 -514066 -512922 -511395 -510786 -513539 -511139 -510977 -513125 -511080 -510345 -510366
$$ packed form
11600e46009p4m38R64R85j033L352J952n45j901m849k234R60M149J603J976J964
11584e39178L42J324l60L145j102O84O23j769k361m331k50J974J919L30J723O086
11568e31201K884l365j919j745k49J708J977O95k14J472J607k437o40j658k199
11553e35284J891L74J245K121o54L012J190k703L9J93J275k283J739N70K59j476
11537e28492K139j277M46N73k233l601K750J460L10j356j389M03L017o95k835
11522e30780j763Q39o24j227R90K326J796J519o96L273K805n01o48k522q16K222
11506e23807L771m44l302q62M242L625J448k651j488Q93Q34m214j454P68L219
11491e19422K361L486L093j577k007J144J527O09k753K400J62k148K045P35k1
$$ plain form
11476 -510366 -511641 -513139 -509742 -507534 -507939 -510170 -514886 -516932 -513880 -510995 -511460 -509085 -509610 -512832 -512098
11461 -512098 -514838 -511701 -506076 -502308 -500769 -500881 -499706 -500723 -501120 -499581 -501082 -501360 -500910 -502875 -507656
11446 -507656 -504682 -502101 -503673 -502845 -502848 -503011 -500616 -498801 -496923 -500574 -502416 -504136 -503287 -500334 -498721 -501065
11430 -501065 -498843 -496450 -498811 -497603 -497595 -500432 -501217 -499781 -496203 -493932 -493323 -494413 -494709 -498306 -495095 -496482
11414 -496482 -494956 -493115 -491318 -494393 -494577 -493828 -493834 -491997 -489968 -486381 -483878 -490605 -497824 -501370 -497701
11399 -497701 -495131 -497596 -498585 -499111 -496745 -495482 -492929 -491373 -493067 -491539 -492666 -492602 -489164 -484948 -483668
11384 -483668 -486154 -490398 -490524 -492156 -492049 -488735 -488610 -487366 -487143 -483509 -482423 -483247 -484892 -489801 -494840
11369 -494840 -490184 -485339 -485099 -484062 -483379 -486625 -488257 -488493 -486437 -484653 -480862 -479716 -479109 -478382 -477427 -475104
$$ packed form
11476e10366j275j498L397K208m05k231m716k046L052K885m65K375n25l222P34
11461e12098k740L137N625L768J539j12J175j017l97J539j501k78M50j965m781
11446e07656K974K581j572Q28lj63K395J815J878l651j842j720Q49K953J613k344
11430e01065K222K393k361J208Qk837p85J436L578K271O09j090k96l597L211j387
11414d96482J526J841J797l075j84P49oJ837K029L587K503o727p219l546L669
11399d97701K570k465r89n26K366J263K553J556j694J528j127O4L438M216J280
11384d83668k486m244j26j632J07L314J25J244K23L634J086q24j645m909n039
11369d94840M656M845K40J037O83l246j632k36K056J784L791J146O07P27R55K323
$$ plain form
11353 -475104 -475969 -474068 -475240 -485622 -495955 -495605 -492230 -490941 -489458 -488493 -485627 -484494 -481677 -481441 -480675
11338 -480675 -480230 -482601 -481466 -483103 -481684 -477328 -476407 -477008 -478131 -477389 -475062 -474183 -471884 -471253 -471139 -470407
11322 -470407 -468895 -466040 -468091 -477885 -490387 -490586 -489469 -490206 -484461 -481646 -480556 -480011 -474763 -471727 -475510
11307 -475510 -474706 -474161 -471631 -471843 -470299 -468462 -470490 -475283 -478566 -480849 -476747 -474243 -472440 -471640 -472957
11292 -472957 -474722 -472479 -472030 -472753 -471826 -473686 -471379 -468673 -468720 -471283 -472301 -474205 -473005 -473641 -473375 -469664
11276 -469664 -466713 -470377 -470050 -469249 -469483 -466015 -464948 -463424 -464713 -459937 -461691 -464567 -463440 -461102 -462462
11261 -462462 -466333 -470437 -473676 -471758 -467027 -464950 -465387 -462886 -463697 -465538 -466868 -465364 -460901 -461466 -461818
11246 -461818 -460101 -464348 -466107 -464818 -465513 -464173 -462553 -459124 -459265 -462212 -460403 -459055 -456510 -454976 -453896
$$ packed form
11353d75104q65J901j172j0382j0333L50L375J289J483R65K866J133K817K36P66
11338d80675M45k371J135j637J419M356R21o01j123P42K327Q79K299O31J14P32
11322d70407J512K855k051r794j2502j99J117p37N745K815J090N45N248L036l783
11307d75510Q04N45K530k12J544J837k028m793l283k283M102K504J803Q00j317
11292d72957j765K243M49p23R27j860K307K706m7k563j018j904J200o36K66L711
11276d69664K951l664L27Q01k34L468J067J524j289M776j754k876J127K338j360
11261d62462l871m104l239J918M731K077m37K501q11j841j330J504M463n65l52
11246d61818J717m247j759J289o95J340J620L429j41k947J809J348K545J534J080
$$ plain form
11231 -453896 -450637 -454980 -463000 -464562 -465504 -463661 -459964 -457269 -456156 -456748 -455478 -454736 -452483 -455018 -455405
11216 -455405 -454606 -457356 -460479 -458857 -458521 -455902 -454453 -453606 -451336 -452436 -452097 -455716 -459008 -458879 -460844
11201 -460844 -462059 -459908 -457660 -454712 -452821 -451930 -455965 -453965 -449494 -450404 -450827 -450065 -448969 -450724 -447725
11186 -447725 -446320 -447423 -447428 -446517 -447769 -449337 -449849 -448692 -450984 -451013 -453046 -451982 -450219 -448877 -448718 -449720
11170 -449720 -446821 -444887 -445660 -444073 -445571 -448402 -448892 -448253 -444486 -444610 -446476 -447401 -447631 -444769 -441759 -445031
11154 -445031 -447914 -449397 -448282 -446550 -442889 -439259 -439609 -443123 -445048 -445722 -442411 -439154 -435764 -435291 -437614
11139 -437614 -437102 -438241 -439345 -441778 -443587 -442410 -439200 -437629 -441016 -442816 -440832 -438895 -438394 -435857 -437660
11124 -437660 -439129 -438440 -436516 -439253 -441281 -440568 -438842 -436541 -436788 -435631 -432330 -431467 -435028 -441284 -440880
$$ packed form
11231d53896L259m343q020j562r42J843L697K695J113n92J270P42K253k535l87
11216d55405P99k750l123J622L36K619J449Q47K270j100L39l619l292J29j965
11201d60844j215K151K248K948J891Q91m035K000M471r10m23P62J096j755K999
11186d47725J405j103nR11j252j568n12J157k292k9k033J064J763J342J59j002
11170d49720K899J934p73J587j498k831m90O39L767j24j866r25k30K862L010l272
11154d45031k883j483J115J732L661L630l50l514j925o74L311L257L390M73k323
11139d37614N12j139j104k433j809J177L210J571l387j800J984J937N01K537j803
11124d37660j469O89J924k737k028P13J726K301k47J157L301Q63l561o256M04
$$ plain form
11109 -440880 -436452 -435665 -436356 -434386 -433153 -431511 -430470 -432847 -435334 -435578 -433692 -434129 -432435 -432436 -431539 -430289
11093 -430289 -428075 -430006 -430078 -426583 -429701 -433103 -431706 -429442 -427100 -427465 -428521 -432519 -433083 -433371 -434201 -433804
11077 -433804 -435157 -434867 -430129 -431965 -429409 -425343 -426830 -428343 -429005 -431770 -427300 -425231 -427575 -424648 -422912
11062 -422912 -421003 -421835 -422289 -426730 -427664 -426999 -426550 -426870 -426948 -426117 -427055 -430049 -427736 -423574 -418986 -417799 -420604
11045 -420604 -423515 -426920 -429354 -432085 -429030 -425315 -423648 -425392 -425932 -422854 -419425 -422894 -425570 -427838
11031 -427838 -428371 -426040 -421872 -418150 -417257 -417916 -420638 -424111 -425868 -424663 -420641 -418351 -417197 -417674 -416971
11016 -416971 -416039 -416855 -416383 -416627 -421869 -420728 -422445 -423471 -423776 -419738 -416468 -414740 -414689 -416619 -415676 -415192
11000 -415192 -414541 -412999 -414983 -413985 -414527 -412460 -411150 -409657 -408486 -408687 -407950 -410094 -411542 -410876 -411871 -408966
$$ packed form
11109d40880M428P87o91J970J233J642J041k377k487k44J886m37J694jQ97J250
11093d30289K214j931p2L495l118l402J397K264K342l65j056l998n64k88q30L97
11077d33804j353K90M738j836K556M066j487j513o62k765M470K069k344K927J736
11062d22912J909q32m54m441r34O65M49l20p8Q31r38k994K313M162M588J187k805
11045d20604k911l405k434k731L055L715J667j744n40L078L429l469k676k268
11031d27838n33K331M168L722Q93o59k722l473j757J205M022K290J154m77P03
11016d16971R32q16M72k44n242J141j717j026l05M038L270J728N1j930R43M84
11000d15192O51J542j984R98n42K067J310J493J171k01P37k144j448O66r95K905
$$ plain form
10984 -408966 -409674 -412164 -413887 -409880 -409106 -413243 -414136 -417044 -414221 -411492 -409109 -406789 -411529 -411943 -411630
10969 -411630 -410852 -413117 -415421 -415163 -412752 -411137 -410498 -415220 -415131 -413295 -413641 -414650 -412995 -409765 -409190 -410062
10953 -410062 -411755 -409860 -408585 -407750 -410550 -412998 -411914 -412468 -411337 -409439 -408015 -410183 -405385 -401325 -400532
10938 -400532 -401421 -401884 -404696 -406878 -407270 -405014 -401035 -401554 -405286 -404124 -403513 -403841 -404827 -406135 -405859 -402991
10922 -402991 -402051 -403204 -402803 -400216 -398574 -400309 -402794 -403050 -404109 -404391 -400315 -398673 -398045 -399628 -399600 -400528
10906 -400528 -402178 -400502 -399618 -398706 -398950 -398468 -396880 -396342 -394590 -394656 -397184 -396161 -394520 -394701 -396685 -398749
10890 -398749 -395836 -395053 -395743 -398736 -398101 -396598 -396433 -397618 -395941 -396899 -397767 -396499 -397962 -396806 -396597 -399264
10874 -399264 -400638 -398029 -395379 -395549 -392031 -390457 -391036 -392010 -393809 -391663 -392677 -394453 -391710 -389854 -392392
$$ packed form
10984d08966p08k490j723M007P74m137q93k908K823K729K383K320m740m14L13
10969d11630P78k265k304K58K411J615O39m722Q9J836l46j009J655L230N75q72
10953d10062j693J895J275Q35k800k448J084n54J131J898J424k168M798M060P93
10938d00532q89m63k812k182l92K256L979n19l732J162O11l28r86j308K76K868
10922d02991R40j153M01K587J642j735k485k56j059k82M076J642O28j583K8r28
10906d00528j650J676Q84R12k44M82J588N38J752o6k528J023J641j81j984k064
10890c98749K913P83o90k993O35J503J65j185J677r58q68J268j463J156K09k667
10874c99264j374K609K650j70L518J574n79r74j799K146j014j776K743J856k538
$$ plain form
10859 -392392 -393151 -388501 -386245 -384457 -384910 -389472 -393217 -390797 -390898 -391776 -394168 -394360 -387142 -384888 -385216 -382704
10843 -382704 -385282 -390567 -390926 -392663 -391361 -387947 -389670 -390409 -387838 -388987 -388435 -385358 -385468 -387154 -389351
10828 -389351 -387661 -386147 -383663 -379882 -383019 -383677 -387450 -385610 -384127 -385916 -390061 -391690 -393814 -389964
10814 -389964 -385633 -383233 -381786 -379489 -377548 -379282 -382882 -383934 -382012 -381747 -383422 -383143 -382449 -382611 -383282
10799 -383282 -385175 -386054 -382793 -378486 -378489 -381980 -383610 -380979 -379949 -383064 -383741 -381458 -379864 -378073 -374389
10784 -374389 -370988 -370924 -371913 -374257 -379766 -383537 -380940 -379063 -378742 -379642 -383357 -383184 -386912 -388751 -383284 -378740
10768 -378740 -377733 -377108 -375735 -376505 -373986 -372313 -374197 -378761 -379879 -382042 -381088 -382538 -379269 -378916 -377218
10753 -377218 -379466 -378338 -374979 -378305 -378427 -376515 -375505 -372072 -372497 -373850 -374811 -375952 -377207 -375590 -375769
$$ packed form
10859c92392p59M650K256J788m53m562l745K420j01q78k392j92P218K254l28K512
10843c82704k578n285l59j737J302L414j723p39K571j149N52L077j10j686k197
10828c89351J690J514K484L781l137o58l773J840J483j789m145j629k124L850
10814c89964M331K400J447K297J941j734l600j052J922K65j675K79O94j62o71
10799c83282j893q79L261M307ll491j630K631J030l115o77K283J594J791L684
10784c74389L401O4r89k344n509l771K597J877L21r00l715J73l728j839N467M544
10768c78740J007O25J373p70K519J673j884m564j118k163R54j450L269L53J698
10753c77218k248J128L359l326j22J912J010L433m25j353r61j141j255J617j79
$$ plain form
10738 -375769 -378934 -380706 -377090 -377773 -373952 -371908 -371413 -375247 -375864 -375572 -377028 -374634 -374941 -376478 -375966 -369892
10722 -369892 -370235 -370989 -373426 -375682 -376595 -374264 -371571 -371271 -373650 -373847 -372363 -369403 -368516 -370377 -368901 -367238
10706 -367238 -368453 -367578 -368735 -368247 -366503 -367462 -369539 -370169 -366865 -363777 -363211 -366175 -368465 -368031 -370286 -367746
10690 -367746 -364594 -363125 -360371 -357427 -359722 -360089 -359672 -358350 -355415 -353665 -353701 -354285 -356033 -355234 -354021 -354939
10674 -354939 -356417 -352657 -348761 -349021 -346005 -347720 -351713 -356582 -368752 -377280 -381936 -382401 -379509 -375020
10660 -375020 -371948 -370753 -370681 -368007 -364415 -366071 -362890 -362830 -360964 -361184 -359781 -358093 -356130 -352961 -355220
10645 -355220 -357979 -356526 -356218 -358415 -360365 -358113 -356041 -353654 -352437 -355734 -362797 -367480 -369063 -368267 -368414
10630 -368414 -368039 -363856 -359330 -355249 -352195 -350944 -349150 -347983 -347517 -346485 -349292 -353640 -357048 -360511 -360766
$$ packed form
10738c75769l165j772L616o83L821K044M95l834o17K92j456K394l07j537N12O074
10722c69892l43p54k437k256r13K331K693L00k379j97J484K960Q87j861J476J663
10706c67238j215Q75j157M88J744r59k077o30L304L088N66k964k290M34k255K540
10690c67746L152J469K754K944k295l67M17J322K935J750l6n84j748P99J213r18
10674c54939j478L760L896k60L016j715l993m869j2170q528m656m65K892M489
10660c75020L072J195P2K674L592j656L181O0J866k20J403J688J963L169k259
10645c55220k759J453L08k197j950K252K072K387J217l297p063m683j583P96j47
10630c68414L75M183M526M081L054J251J794J167M66J032k807m348l408l463k55
$$ plain form
10615 -360766 -361729 -364155 -370057 -375550 -377479 -371680 -367255 -369891 -371189 -367795 -360915 -359726 -359457 -361393 -357972
10600 -357972 -354055 -351056 -348445 -351319 -355820 -355336 -354729 -353645 -357385 -358884 -356718 -356390 -354394 -357520 -362233
10585 -362233 -360037 -358539 -361943 -362691 -359717 -356906 -353684 -350881 -349172 -347680 -344377 -343314 -344775 -348411
10571 -348411 -346396 -345326 -341663 -339536 -340769 -348173 -360569 -371573 -382072 -385758 -384211 -382835 -379366
10558 -379366 -375145 -368405 -363968 -364951 -364982 -365319 -367756 -368388 -368395 -368587 -366275 -363044 -360778 -364801 -364053 -359301 -355007
10541 -355007 -353954 -355031 -360970 -363487 -362929 -361282 -356436 -355570 -355914 -358410 -358433 -356695 -352182 -353592 -353571 -352831
10525 -352831 -350969 -350539 -351055 -352954 -352171 -351409 -353187 -353551 -353633 -354343 -354076 -352633 -352543 -352820 -351266 -352582 -351895
10508 -351895 -348900 -349361 -352408 -354155 -350147 -345813 -344278 -342515 -344618 -349560 -350446 -349577 -347109 -345893 -346258
$$ packed form
10615c60766r63k426n902n493j929N799M425k636j298L394O880J189K69j936L421
10600c57972L917K999K611k874m501M84O07J084l740j499K166L28J996l126m713
10585c62233K196J498l404p48K974K811L222K803J709J492L303J063j461l636
10571c48411K015J070L663K127j233p404j2396j1004j0499l686J547J376L469
10558c79366M221O740M437r83l1l37k437o32pj92K312L231K266m023P48M752M294
10541c55007J053j077n939k517N58J647M846Q66l44k496k3J738M513j410K1P40
10525c52831J862M30n16j899P83P62j778l64q2p10K67J443R0k77J554j316O87
10508c51895K995m61l047j747M008M334J535J763k103m942q86Q69K468J216l65
$$ plain form
10493 -346258 -346912 -349231 -350180 -348726 -349506 -350637 -351605 -348809 -344368 -345490 -349706 -349239 -349785 -347153 -345811 -346063
10477 -346063 -348149 -348041 -343919 -345341 -347838 -349063 -346887 -341660 -339660 -338787 -336392 -334298 -338867 -344121 -344817
10462 -344817 -342874 -343150 -343594 -341467 -341105 -340068 -340518 -340928 -341560 -338002 -337298 -336278 -337580 -339629 -339558 -336987
10446 -336987 -337317 -336976 -334881 -334734 -334996 -333883 -333768 -334861 -340282 -342880 -344966 -346304 -349625 -349934 -347102 -344819
10430 -344819 -341534 -338372 -336952 -336205 -335888 -331558 -331313 -335353 -341133 -337640 -336372 -337352 -338156 -336328 -335628 -336750
10414 -336750 -334316 -333488 -334139 -333183 -334341 -335025 -334273 -333773 -332122 -331452 -329312 -331326 -335784 -335116 -334269 -336071
10398 -336071 -336397 -336496 -332336 -332051 -335915 -335571 -336242 -338955 -341742 -340578 -340479 -343427 -343081 -338920 -336658 -338479
10382 -338479 -342842 -342851 -340642 -335732 -333598 -332848 -333977 -331922 -329217 -327777 -329990 -333444 -335576 -332583 -330057
$$ packed form
10493c46258o54k319r49J454p80j131r68K796M441j122m216M67n46K632J342k52
10477c46063k086J08M122j422k497j225K176N227K000Q73K395K094m569n254o96
10462c44817J943k76m44K127L62J037m50m10o32L558P04J020j302k049P1K571
10446c36987l30L41K095J47k62J113J15j093n421k598k086j338l321l09K832K283
10430c44819L285L162J420P47L17M330K45m040n780L493J268r80q04J828P00j122
10414c36750K434Q28o51R56j158o84P52N00J651O70K140k014m458O68Q47j802
10398c36071l26r9M160K85l864L44o71k713k787J164R9k948L46M161K262j821
10382c38479m363rK209M910K134P50j129K055K705J440k213l454k132K993K526
$$ plain form
10367 -330057 -329460 -333453 -333818 -333621 -334989 -337669 -336347 -337407 -338215 -336434 -332557 -333289 -332986 -329573 -330629 -333194
10351 -333194 -336102 -334760 -337186 -336140 -331231 -329563 -330790 -329530 -330597 -334995 -337225 -335374 -333154 -328994
10337 -328994 -325092 -328347 -330904 -334325 -334563 -332987 -330400 -329496 -328797 -329361 -327296 -327739 -327457 -325260 -328935 -329703
10321 -329703 -330082 -330744 -329073 -327250 -326805 -332071 -332310 -330032 -330100 -333633 -333166 -329939 -325530 -323606 -323020 -326628
10305 -326628 -329674 -330908 -328469 -325658 -326064 -331321 -330001 -327759 -326593 -327750 -329077 -326563 -328475 -327582 -326724
10290 -326724 -328948 -327448 -331122 -328426 -327607 -329184 -331775 -330051 -328729 -327042 -326128 -326028 -325309 -324473 -327632
10275 -327632 -332549 -335355 -333442 -333219 -329416 -326562 -324682 -324802 -322171 -322067 -319667 -317792 -316515 -316684 -317102
10260 -317102 -317201 -317141 -315435 -313608 -315715 -318534 -320150 -318375 -313363 -310059 -312343 -317153 -318513 -320747 -326327
$$ packed form
10367c30057N97l993l65J97j368k680J322j060q08J781L877p32L03L413j056k565
10351c33194k908J342k426J046M909J668j227J260j067m398k230J851K220M160
10337c28994L902l255k557l421k38J576K587R04O99n64K065m43K82K197l675p68
10321c29703l79o62J671J823M45n266k39K278o8l533M67L227M409J924N86l608
10305c26628l046j234K439K811m06n257J320K242J166j157j327K514j912Q93Q58
10290c26724k224J500l674K696Q19j577k591J724J322J687R14J00P19Q36l159
10275c27632m917k806J913K23L803K854J880j20K631J04K400J875J277j69m18
10260c17102r9O0J706J827k107k819j616J775N012L304k284m810j360k234n580
$$ plain form
10245 -326327 -330107 -332767 -334332 -334682 -331511 -325575 -324903 -324927 -325918 -326346 -325921 -323899 -325181 -324669 -325549 -323993
10229 -323993 -323767 -321452 -319286 -318651 -320564 -322548 -324443 -327126 -325976 -325710 -322611 -323080 -324941 -326371 -325677
10214 -325677 -323154 -320129 -314923 -314270 -315531 -317107 -321206 -321354 -317454 -314779 -316880 -317491 -320197 -321770 -316777
10199 -316777 -314553 -316026 -315676 -315767 -318382 -317882 -318693 -317280 -314845 -313464 -313769 -314935 -314554 -313910 -312163 -310991
10183 -310991 -312056 -311816 -310921 -309970 -312277 -314619 -315405 -314894 -314184 -311050 -306544 -305843 -306638 -307063 -309424 -309092 -305579
10166 -305579 -307001 -307285 -305206 -307144 -310771 -313931 -312049 -307099 -302421 -300063 -303329 -307003 -308999 -308642 -310633
10151 -310633 -312215 -311643 -310463 -311425 -313665 -310356 -306813 -309431 -313083 -315208 -315167 -314066 -311263 -310822 -312618
10136 -312618 -312713 -312008 -310988 -310452 -312980 -310275 -307341 -307237 -307165 -305788 -308131 -310413 -308654 -306561 -302724 -305063
$$ packed form
10245c26327l780k660j565l50L171N936O72k4r91m28M25K022j282N12q80J556
10229c23993K26K315K166O35j913j984j895k683J150K66L099m69j861j430O94
10214c25677K523L025N206O53j261j576m099j48L900K675k101o11k706j573M993
10199c16777K224j473L50r1k615N00q11J413K435J381l05j166L81O44J747J172
10183c10991j065K40Q95R51k307k342p86N11P10L134M506P01p95m25k361L32L513
10166c05579j422k84K079j938l627l160J882M950M678K358l266l674j996L57j991
10151c10633j582N72J180r62k240L309L543k618l652k125M1J101K803M41j796
10136c12618r5P05J020N36k528K705K934J04P2J377k343k282J759K093L837k339
$$ plain form
10120 -305063 -306940 -308316 -306369 -310233 -309322 -310686 -309027 -308014 -309421 -307861 -306940 -307677 -306678 -303245 -303406
10105 -303406 -302891 -300304 -300820 -301326 -302077 -301471 -300343 -302148 -306867 -307530 -305367 -305149 -307247 -309316 -310012 -308845
10089 -308845 -307898 -303291 -301174 -301468 -298753 -298866 -301890 -301532 -298612 -299257 -301927 -307404 -307402 -304018 -304604 -302444
10073 -302444 -301937 -303037 -305079 -300510 -297434 -297939 -301382 -302265 -303298 -304842 -302502 -299216 -295905 -296160 -293914
10058 -293914 -295233 -299280 -302041 -301338 -301506 -300179 -296241 -296143 -293441 -295333 -295081 -292753 -291112 -291322 -292132 -291260
10042 -291260 -289766 -290552 -293626 -294216 -294959 -295449 -294549 -290429 -289714 -293363 -303780 -307034 -306787 -304616 -299361 -299258
10026 -299258 -301242 -303412 -302070 -300718 -298878 -296695 -298118 -299090 -299362 -298348 -295797 -297282 -294859 -294093 -295103
10011 -295103 -298853 -300211 -301148 -298324 -295017 -294184 -297679 -296870 -295395 -294725 -293100 -293314 -294859 -293835 -294798 -295126
$$ packed form
10120c05063j877j376J947l864R11j364J659J013j407J560R21p37R99L433j61
10105c03406N15K587n16n06p51O06J128j805m719o63K163K18k098k069o96J167
10089c08845R47M607K117k94K715j13l024L58K920o45k670n477KL384n86K160
10073c02444N07j100k042M569L076n05l443q83j033j544K340L286L311k55K246
10058b93914j319m047k761P03j68J327L938R8K702j892K52K328J641k10q10Q72
10042b91260J494p86l074n90p43m90R00M120P15l649j0417l254K47K171N255J03
10026b99258j984k170J342J352J840K183j423r72k72J014K551j485K423P66j010
10011b95103l750j358r37K824L307Q33l495Q09J475O70J625k14j545J024r63l28
$$ plain form
9995 -295126 -296106 -294636 -293800 -291446 -292121 -294806 -294570 -293470 -293578 -296105 -294623 -289464 -290529 -291626 -290761 -293054
9979 -293054 -293090 -289714 -286890 -286921 -287657 -287404 -284889 -284534 -286603 -288116 -288053 -290376 -294033 -293695 -289963 -291654 -291490
9962 -291490 -290293 -290686 -291780 -288633 -288355 -289196 -292998 -291292 -287972 -287298 -287905 -281579 -279286 -281652 -280693 -280407
9946 -280407 -286108 -286534 -283657 -282315 -279529 -283467 -286061 -287393 -288319 -288561 -290416 -290320 -287752 -285432 -286203 -287101
9930 -287101 -288575 -287077 -280192 -276207 -276979 -279275 -280092 -279831 -278258 -277944 -282879 -283064 -278475 -276001 -275903 -272795
9914 -272795 -269873 -268099 -272534 -282923 -284806 -285637 -285758 -285992 -288238 -286561 -284578 -283310 -283728 -283392 -280497
9899 -280497 -285228 -287149 -287122 -284687 -283334 -286049 -284774 -281748 -282883 -288675 -288957 -286934 -286203 -283787 -282918 -284798
9883 -284798 -283898 -282946 -283631 -284509 -285036 -283639 -283194 -284580 -285426 -284033 -282045 -284620 -286784 -286045 -281800 -277141
$$ packed form
9995b95126r80J470Q36K354o75k685K36J100j08k527J482N159j065j097Q65k293
9979b93054l6L376K824l1p36K53K515L55k069j513O3k323l657L38L732j691J64
9962b91490J197l93j094L147K78q41l802J706L320O74o07O326K293k366R59K86
9946b80407n701m26K877J342K786l938k594j332r26k42j855R6K568K320p71q98
9930b87101j474J498O885L985p72k296q17K61J573L14m935j85M589K474R8L108
9914b72795K922J774m435j0389j883q31j21k34k246J677J983J268m18L36K895
9899b80497m731j921K7K435J353k715J275L026j135n792k82K023P31K416Q69j880
9883b84798R00R52o85q78n27J397M45j386q46J393J988k575k164P39M245M659
$$ plain form
9867 -277141 -275524 -272518 -272343 -274578 -279309 -279861 -277670 -275465 -272614 -273580 -275054 -272895 -273141 -274823 -276106
9852 -276106 -273328 -272608 -275447 -282449 -288831 -290243 -290430 -289191 -285478 -280687 -279195 -281120 -282244 -282797 -282184
9837 -282184 -279600 -281269 -281628 -279854 -278261 -283932 -284721 -282274 -282154 -279687 -279609 -278277 -274105 -273649 -273390 -274790
9821 -274790 -274087 -271007 -270327 -267748 -267046 -270327 -274488 -276647 -278396 -280090 -279363 -274757 -271074 -275198 -276197 -273998
9805 -273998 -274422 -275324 -275396 -277358 -275772 -274515 -272741 -275011 -276731 -275088 -276396 -279193 -276537 -275952 -276390 -274689
9789 -274689 -274506 -277339 -275120 -274003 -275592 -276442 -274608 -274561 -276912 -275863 -273821 -273652 -274643 -275621 -272821 -273149
9773 -273149 -269461 -263405 -263938 -263994 -266624 -267203 -270419 -275946 -279030 -278681 -276527 -275920 -277316 -275643 -272851 -266686
9757 -266686 -266971 -272174 -274429 -273965 -271552 -271489 -272342 -272547 -272352 -271593 -272610 -273063 -271917 -270158 -271118 -275173 -276922
$$ packed form
9867b77141J617L006J75k235m731n52K191K205K851r66j474K159k46j682j283
9852b76106K778P20k839p002o382j412j87J239L713M791J492j925j124n53O13
9837b82184K584j669l59J774J593n671p89K447J20K467P8J332M172M56K59j400
9821b74790P03L080O80K579P02l281m161k159j749j694P27M606L683m124r99K199
9805b73998m24r02p2j962J586J257J774k270j720J643j308k797K656N85m38J701
9789b74689J83k833K219J117j589q50J834M7k351J049K042J69r91r78K800l28
9773b73149L688O056n33n6k630n79l216n527l084L49K154O07j396J673K792O165
9757b66686k85n203k255M64K413O3q53k05J95P59j017m53J146J759r60m055j749
$$ plain form
9740 -276922 -275775 -273502 -270500 -270250 -270348 -269429 -271105 -274850 -271910 -266415 -267187 -268332 -269612 -271275 -269602 -271802
9724 -271802 -271618 -267832 -265311 -265716 -264317 -265217 -264123 -260067 -261328 -263412 -265057 -265049 -263053 -261621 -264788 -268118
9708 -268118 -268846 -266255 -266361 -266308 -265842 -265908 -262892 -260582 -263141 -265441 -260894 -259571 -261806 -262292 -261069 -262703
9692 -262703 -266100 -265353 -265399 -267076 -265449 -262629 -263175 -263819 -259676 -257395 -256401 -260676 -261832 -260472 -265395 -270205
9676 -270205 -269407 -267140 -265311 -264162 -262971 -265433 -263468 -261399 -257657 -255962 -255225 -253956 -256688 -261490 -260351
9661 -260351 -258741 -259822 -261336 -257559 -254169 -257650 -260082 -256571 -254978 -254433 -257767 -256938 -254691 -256602 -257179
9646 -257179 -259253 -257451 -257215 -254948 -254852 -254839 -253050 -252737 -254825 -256176 -256328 -255232 -253986 -255497 -257193 -257052
9630 -257052 -252148 -250783 -253906 -256882 -257078 -255981 -255769 -257195 -258159 -256409 -256471 -255394 -255138 -259634 -260036 -259431
$$ packed form
9740b76922J147K273L002K50r8R19j676l745K940N495p72j145j280j663J673k200
9724b71802J84L786K521m05J399r00J094M056j261k084j645QJ996J432l167l330
9708b68118p28K591j06N3M66o6L016K310k559k300M547J323k235m86J223j634
9692b62703l397P47m6j677J627K820n46o44M143K281R94m275j156J360m923m810
9676b70205P98K267J829J149J191k462J965K069L742J695P37J269k732m802J139
9661b60351J610j081j514L777L390l481k432L511J593N45l334Q29K247j911n77
9646b57179k074J802K36K267R6J3J789L13k088j351j52J096J246j511j696J41
9630b57052M904J365l123k976j96J097K12j426r64J750o2J077K56m496m02O05
$$ plain form
9614 -259431 -258556 -256452 -255810 -258342 -258224 -255258 -257818 -258659 -257125 -258765 -260609 -259722 -260425 -261927 -264271 -265845
9598 -265845 -266255 -266657 -264794 -260794 -258189 -258970 -260646 -258955 -257356 -260045 -264850 -260090 -258753 -263680 -262321
9583 -262321 -263039 -263618 -263865 -264681 -262570 -260670 -262075 -262728 -262755 -264258 -263866 -265679 -267252 -269067 -268840 -269893 -275067
9566 -275067 -274421 -270320 -268224 -267824 -269116 -269676 -271246 -273667 -270993 -269807 -273221 -270191 -269673 -271682 -272700
9551 -272700 -272582 -273146 -273673 -272981 -273324 -277275 -275270 -273543 -274324 -274026 -274184 -275508 -276199 -278100 -279736 -280275 -278631
9534 -278631 -279740 -280924 -280010 -281104 -282178 -283442 -284878 -284553 -278429 -276869 -280550 -285316 -286913 -285862 -288195
9519 -288195 -287805 -283977 -282651 -284262 -283494 -282254 -280022 -280036 -281930 -279257 -276381 -280162 -286159 -285427 -285843 -282916
9503 -282916 -282702 -286210 -289682 -289629 -289591 -290681 -291673 -294200 -293414 -291264 -291076 -289590 -290205 -289524 -286240 -286457 -285954
$$ packed form
9614b59431Q75K104O42k532J18K966k560q41J534j640j844Q87p03j502k344j574
9598b65845m10m02J863M000K605p81j676J691J599k689m805M760J337m927J359
9583b62321p18n79k47q16K111J900j405o53k7j503L92j813j573j815K27j053n174
9566b75067O46M101K096M00j292n60j570k421K674J186l414L030N18k009j018
9551b72700J18n64n27O92l43l951K005J727p81K98j58j324o91j901j636n39J644
9534b78631j109j184R14j094j074j264j436L25O124J560l681m766j597J051k333
9519b88195L90L828J326j611P68J240K232j4j894K673K876l781n997P32m16K927
9503b82916K14l508l472N3L8j090r92k527P86K150J88J486o15O81L284k17N03
$$ plain form
9486 -285954 -286477 -283711 -282406 -282647 -283546 -285673 -286957 -288556 -287556 -289587 -292508 -292401 -292588 -291125 -290190 -286322
9470 -286322 -285661 -284920 -289239 -295768 -299413 -296742 -293624 -296397 -296587 -291521 -289291 -291449 -289912 -286937 -284622
9455 -284622 -287042 -287209 -287283 -285116 -285016 -287270 -287585 -289980 -293443 -292503 -291718 -289878 -288340 -287288 -288144 -288754 -291301
9438 -291301 -286992 -284677 -283274 -279299 -278144 -281954 -286320 -284277 -282118 -280813 -281686 -286526 -285973 -284447 -281374
9423 -281374 -279638 -277753 -279291 -278786 -277275 -279165 -280354 -279628 -281035 -280214 -277893 -276789 -276270 -275397 -280551 -284901
9407 -284901 -285834 -284450 -286070 -283676 -281306 -276461 -273652 -272850 -273337 -276293 -280668 -277502 -274989 -277304 -279931
9392 -279931 -280393 -281622 -282433 -279624 -277427 -275698 -274925 -275364 -278294 -279377 -278861 -278072 -281284 -278647 -275886 -278503
9376 -278503 -277806 -276647 -275261 -271335 -269029 -266730 -268812 -273622 -275586 -273866 -274317 -275953 -276769 -277412 -279305
$$ packed form
9486b85954n23K766J305k41q99k127j284j599J000k031k921J07j87J463R35L868
9470b86322O61P41m319o529l645K671L118k773j90N066K230k158J537K975K315
9455b84622k420j67p4K167J00k254l15k395l463R40P85J840J538J052q56o10k547
9438b91301M309K315J403L975J155l810m366K043K159J305q73m840N53J526L073
9423b81374J736J885j538N05J511j890j189P26j407Q21K321J104N19Q73n154m350
9407b84901r33J384j620K394K370M845K809Q02m87k956m375L166K513k315k627
9392b79931m62j229q11K809K197J729P73m39k930j083N16P89l212K637K761k617
9376b78503O97J159J386L926K306K299k082m810j964J720m51j636q16o43j893
$$ plain form
9361 -279305 -278756 -280170 -280888 -276640 -273225 -271399 -269603 -274118 -274937 -270991 -269875 -272549 -272711 -274767 -272468
9346 -272468 -270314 -269571 -269226 -271174 -271953 -272566 -273591 -271006 -269167 -270203 -268386 -269308 -269647 -270643 -268664 -267189
9330 -267189 -268098 -269103 -268303 -271152 -272080 -269182 -268946 -269446 -269409 -268841 -267307 -266707 -268881 -268669 -269665 -271005 -269045
9313 -269045 -267700 -267946 -266926 -268252 -267293 -264784 -262664 -263729 -263927 -259585 -258055 -258228 -256764 -258766 -255952
9298 -255952 -254795 -254579 -252512 -250342 -250001 -252044 -256444 -263559 -268036 -265061 -257649 -259870 -262446 -261094 -259939
9283 -259939 -261999 -268085 -278847 -284552 -284350 -283030 -282657 -278875 -273861 -272158 -273237 -275654 -274476 -272711 -271848
9268 -271848 -270020 -269394 -267727 -265911 -268336 -268144 -265530 -265065 -264388 -259730 -259752 -259867 -257914 -256949 -256279 -254373 -254384
9251 -254384 -254721 -252349 -247713 -248396 -249780 -254944 -261675 -266047 -265652 -267175 -272673 -275272 -275977 -273776 -272974 -271399
$$ packed form
9361b79305N49j414p18M248L415J826J796m515q19L946J116k674j62k056K299
9346b72468K154P43L45j948p79o13j025K585J839j036J817r22l39r96J979J475
9330b67189r09j005Q00k849r28K898K36n00L7N68J534O00k174K12r96j340J960
9313b69045J345k46J020j326R59K509K120j065j98M342J530j73J464k002K814
9298b55952J157K16K067K170L41k043m400p115m477K975P412k221k576J352J155
9283b59939k060o086j0762n705K02J320L73L782N014J703j079k417J178J765Q63
9268b71848J828O26J667J816k425J92K614M65O77M658k2j15J953R65O70J906j1
9251b54384l37K372M636o83j384n164o731m372L95j523n498k599p05K201Q02J575
$$ plain form
9235 -271399 -270270 -270478 -270548 -268765 -268790 -267487 -264655 -264581 -262435 -261473 -262177 -260591 -260964 -259344 -259342 -259883 -261874 -261576
9217 -261576 -257421 -260680 -265851 -274276 -275996 -270730 -266752 -263230 -259178 -257368 -254584 -251170 -250168 -251947
9203 -251947 -250073 -250700 -249365 -251621 -261943 -271671 -272981 -272952 -272860 -274465 -270511 -268415 -266841 -268345 -270713
9188 -270713 -273037 -271580 -267567 -263678 -263375 -263349 -263754 -265391 -263138 -259599 -259098 -258415 -257861 -256629 -258201 -263948
9172 -263948 -267040 -270725 -272499 -269557 -271173 -274817 -274548 -273360 -271862 -269572 -267457 -265105 -264587 -265152 -263090
9157 -263090 -263521 -263159 -263983 -263495 -261674 -263492 -264344 -260271 -260549 -261539 -262846 -264867 -265563 -265069 -268285 -268707 -267265
9140 -267265 -264610 -266059 -268309 -269794 -270191 -268806 -264723 -262432 -261670 -264139 -264093 -257371 -253552 -255234 -256619
9125 -256619 -256902 -259284 -266101 -267777 -263499 -259015 -258592 -260502 -261872 -259839 -258764 -256701 -251815 -247733 -247509
$$ packed form
9235b71399J129k08p0J783k5J303K832P4K146R62p04J586l73J620Kn41j991K98
9217b61576M155l259n171q425j720N266L978L522M052J810K784L414J002j779
9203b51947J874o27J335k256j0322r728j310K9R2j605L954K096J574j504k368
9188b70713k324J457M013L889L03K6m05j637K253L539N01O83N54J232j572n747
9172b63948l092l685j774K942j616l644K69J188J498K290K115K352N18n65K062
9157b63090m31L62q24M88J821j818q52M073k78r90j307k021o96M94l216m22J442
9140b67265K655j449k250j485l97J385M083K291P62k469M6O722L819j682j385
9125b56619k83k382o817j676M278M484M23j910j370K033J075K063M886M082K24
$$ plain form
9110 -247509 -244867 -248860 -252986 -254561 -258798 -259740 -261000 -265343 -262775 -262576 -263795 -262490 -260954 -262567 -268103
9095 -268103 -269789 -268796 -266475 -264405 -263968 -264755 -263594 -260411 -260507 -260752 -260626 -259954 -258027 -260018 -261639 -266012
9079 -266012 -267865 -263983 -263555 -262684 -262896 -265746 -265020 -261116 -257386 -256839 -260091 -262605 -262076 -259026 -256353 -252343
9063 -252343 -253043 -252092 -249818 -252651 -257275 -259942 -261308 -261919 -262360 -265050 -267351 -267585 -267327 -268242 -266409 -265922
9047 -265922 -264018 -260766 -262900 -265692 -263952 -265268 -262796 -259195 -263786 -268537 -271551 -271247 -267172 -266623 -266745
9032 -266745 -265656 -262954 -257985 -254528 -253595 -254429 -258210 -262240 -261353 -257313 -258130 -255495 -252884 -253410 -255537 -253956
9016 -253956 -251874 -253792 -256221 -254759 -253232 -254245 -256297 -258562 -257635 -258312 -261014 -265167 -266071 -267017 -268611
9001 -268611 -266825 -262893 -259479 -256645 -257650 -257198 -258546 -261373 -261499 -262600 -260458 -262673 -262002 -260145 -258159
$$ packed form
9110b47509K642l993m126j575m237r42j260m343K568J99j219J305J536j613n536
9095b68103j686R93K321K070M37p87J161L183r6k45J26O72J927j991j621m373
9079b66012j853L882M28Q71k12k850P26L904L730N47l252k514N29L050K673M010
9063b52343p00R51K274k833m624k667j366o11m41k690k301k34K58r15J833M87
9047b65922J904L252k134k792J740j316K472L601m591m751l014L04M075N49j22
9032b66745J089K702M969L457R33q34l781m030Q87M040q17K635K611n26k127J581
9016b53956K082j918k429J462J527j013k052k265R27o77k702m153r04r46j594
9001b68611J786L932L414K834j005M52j348k827j26j101K142k215O71J857J986
$$ plain form
8986 -258159 -258061 -256914 -255755 -255902 -256381 -257313 -258682 -259599 -256652 -254475 -248956 -248058 -251223 -253975 -250738 -249343
8970 -249343 -250302 -249167 -252988 -250606 -250834 -252587 -252657 -253513 -253443 -254733 -255432 -260229 -262156 -262363 -263923 -260765 -255444
8953 -255444 -252542 -252681 -253240 -254684 -257170 -257754 -256389 -253465 -252985 -252870 -252658 -254402 -252631 -253335 -254139 -254702 -254176
8936 -254176 -254734 -252719 -251777 -252812 -254850 -257932 -258698 -255972 -258149 -261145 -259787 -254912 -252348 -254142 -255656
8921 -255656 -255340 -254601 -253029 -250916 -249465 -253310 -255596 -252095 -250582 -252966 -253601 -254104 -254190 -255383 -252650 -254223
8905 -254223 -254865 -254026 -252309 -248783 -246016 -247063 -247183 -247374 -248906 -248149 -250628 -250856 -249877 -247303 -247017 -245899
8889 -245899 -247273 -247181 -245453 -246100 -247893 -249332 -250378 -253055 -251900 -249172 -247408 -247986 -247455 -246615 -242037 -239344
8873 -239344 -240526 -244485 -244160 -240189 -243814 -254576 -254711 -246771 -245728 -245627 -244676 -245537 -245243 -244899 -240708 -237635
$$ packed form
8986b58159R8J147J159j47m79r32j369r17K947K177N519Q98l165k752L237J395
8970b49343r59J135l821K382k28j753p0q56P0j290o99m797j927k07j560L158N321
8953b55444K902j39n59j444k486n84J365K924M80J15K12j744J771p04q04n63N26
8936b54176n58K015R42j035k038l082p66K726k177k996J358M875K564j794j514
8921b55656L16P39J572K113J451l845k286L501J513k384o35n03q6j193K733j573
8905b54223o42Q39J717L526K767j047j20j91j532P57k479k28R79K574K86J118
8889b45899j374R2J728o47j793j439j046k677J155K728J764n78N31Q40M578K693
8873b39344j182l959L25L971l625j0762j35P940J043J01R51q61K94L44M191L073
$$ plain form
8857 -237635 -240975 -237147 -238632 -252299 -255270 -251219 -249898 -246300 -243709 -244674 -248273 -247021 -245175 -243517
8843 -243517 -242826 -240338 -238667 -241573 -241052 -245109 -246807 -247001 -245793 -244975 -241560 -243117 -246229 -247040 -245850 -244700
8827 -244700 -246033 -247462 -250053 -248112 -245018 -244046 -245570 -243136 -246388 -248660 -249721 -247686 -244269 -244882 -244930
8812 -244930 -244227 -245083 -240727 -238965 -240383 -242747 -245399 -246476 -243411 -243206 -243209 -242271 -241767 -243027 -242481 -238614 -238661
8795 -238661 -239875 -239670 -238340 -237404 -235587 -234666 -231547 -227251 -229966 -233870 -237914 -240234 -240895 -244137 -247346
8780 -247346 -245438 -239658 -240199 -240215 -241445 -242036 -241117 -238004 -236359 -235746 -235412 -237467 -234926 -232537 -234654 -237026
8764 -237026 -236673 -238486 -240518 -240205 -242131 -244382 -243326 -240374 -242903 -241736 -239884 -241760 -240077 -234907 -235636
8749 -235636 -235148 -233621 -231908 -229683 -231056 -232585 -236059 -238178 -238602 -239444 -240014 -239985 -237011 -236541 -233538 -232544
$$ packed form
8857b37635l340L828j485j3667k971M051J321L598K591r65l599J252J846J658
8843b43517O91K488J671k906N21m057j698j94J208Q18L415j557l112q11J190J150
8827b44700j333j429k591J941L094R72j524K434l252k272j061K035L417o13m8
8812b44930P03q56M356J762j418k364k652j077L065K05lR38N04j260N46L867m7
8795b38661j214K05J330R36J817R21L119M296k715l904m044k320o61l242l209
8780b47346J908N780n41j6j230n91R19L113J645O13L34k055K541K389k117k372
8764b37026L53j813k032L13j926k251J056K952k529J167J852j876J683N170p29
8749b35636M88J527J713K225j373j529l474k119m24q42n70K9K974M70L003R94
$$ plain form
8733 -232544 -233342 -235065 -238031 -241582 -237340 -234819 -233487 -232466 -229364 -229753 -232596 -239654 -243119 -245105 -245729
8718 -245729 -247328 -247348 -243716 -242869 -245282 -247248 -244160 -243671 -243555 -244657 -242831 -241513 -239851 -236111 -235154 -236252
8702 -236252 -240340 -239423 -237985 -235817 -236170 -237153 -234984 -235325 -232561 -231920 -236932 -240126 -240498 -237826 -240950 -242478
8686 -242478 -242250 -243019 -242671 -239355 -236883 -235817 -235596 -240947 -241880 -240969 -236991 -235810 -237771 -238581 -238305 -237409 -239265
8669 -239265 -239748 -239947 -238735 -236011 -233265 -233869 -231921 -229925 -229068 -229109 -230881 -233801 -235112 -242839 -239042 -232651
8653 -232651 -229963 -228481 -228423 -229622 -234162 -235342 -232407 -231509 -233642 -237403 -239078 -236204 -237647 -239637 -238006
8638 -238006 -238458 -239588 -238053 -235721 -231944 -230819 -230265 -231207 -232557 -231869 -232547 -233763 -233555 -231969 -231586 -232619
8622 -232619 -232092 -234688 -232458 -231850 -233609 -234436 -235295 -236619 -238410 -238068 -237853 -237154 -235741 -229372 -226161 -226679
$$ packed form
8733b32544p98j723k966l551M242K521J332J021L102l89k843p058l465j986o24
8718b45729j599k0L632Q47k413j966L088M89J16j102J826J318J662L740R57j098
8702b36252m088R17J438K168l53r83K169l41K764O41n012l194l72K672l124j528
8686b42478K28p69L48L316K472J066K21n351r33R11L978J181j961q10K76Q96j856
8669b39265m83j99J212K724K746o04J948J996Q57m1j772k920j311p727L797O391
8653b32651K688J482N8j199m540j180K935Q98k133l761j675K874j443j990J631
8638b38006m52j130J535K332L777J125N54r42j350O88o78j216K08J586L83j033
8622b32619N27k596K230O08j759q27q59j324j791L42K15O99J413O369L211n18
$$ plain form
8606 -226679 -230370 -229958 -225627 -224114 -228189 -230857 -233155 -230597 -229921 -228857 -230271 -228703 -226653 -227519 -228669
8591 -228669 -227763 -227072 -229393 -229922 -231395 -230356 -228190 -229603 -233659 -233990 -233316 -230863 -232402 -233344 -234966 -233055
8575 -233055 -233885 -231239 -233090 -232964 -235256 -234200 -233480 -236000 -233533 -230255 -231729 -230355 -230200 -228679 -227098
8560 -227098 -227257 -232283 -231527 -230420 -231332 -233621 -231711 -229981 -230009 -228388 -227134 -224015 -223858 -225352 -227419 -225389
8544 -225389 -225159 -224726 -226240 -227042 -225715 -224864 -223776 -227545 -229945 -229423 -231144 -230923 -231654 -232461 -231255 -229685
8528 -229685 -227266 -227462 -227445 -226688 -227614 -225127 -222642 -219490 -221047 -223818 -225783 -226905 -226209 -224803 -225658 -227325
8512 -227325 -226830 -224459 -226241 -224533 -222597 -221957 -225675 -225547 -224566 -224129 -221526 -219767 -223028 -223802 -222820 -220512
8496 -220512 -217560 -215355 -216145 -216638 -214800 -213907 -218138 -223121 -224987 -222722 -218491 -216374 -215864 -215682 -215016 -214433
$$ packed form
8606b26679l691M12M331J513m075k668k298K558O76J064j414J568K050q66j150
8591b28669R06O91k321n29j473J039K166j413m056l31O74K453j539r42j622J911
8575b33055q30K646j851J26k292J056P20k520K467L278j474J374J55J521J581
8560b27098j59n026P56J107r12k289J910J730k8J621J254L119J57j494k067K030
8544b25389K30M33j514q02J327Q51J088l769k400N22j721K21p31q07J206J570
8528b29685K419j96J7P57r26K487K485L152j557k771j965j122O96J406q55j667
8512b27325M95K371j782J708J936O40l718J28R81M37K603J759l261p74R82K308
8496b20512K952K205p90m93J838Q93m231m983j866K265M231K117N10J82O66N83
$$ plain form
8480 -214433 -213056 -218663 -226637 -233174 -237549 -235619 -231523 -230264 -235057 -233273 -231938 -228567 -229664 -229535 -228073
8465 -228073 -224304 -225149 -221811 -218725 -220072 -221024 -221041 -221673 -224258 -225072 -223888 -221623 -222781 -222357 -221097 -220931
8449 -220931 -221753 -221548 -217902 -217360 -217135 -214325 -212817 -209715 -209756 -208803 -206980 -204155 -199332 -196501 -192765 -192021
8433 -192021 -195662 -206938 -225184 -235399 -238909 -237630 -236005 -235723 -237566 -233786 -228940 -228052 -227165 -225707
8419 -225707 -226046 -226876 -224432 -225583 -227893 -225428 -224320 -222476 -223693 -223125 -222414 -221566 -220407 -223897 -222658 -217558
8403 -217558 -213381 -212248 -212634 -215976 -218465 -222155 -221264 -220379 -218351 -213479 -209718 -211458 -216554 -214558 -211217
8388 -211217 -209185 -209815 -211415 -215326 -222135 -226456 -228653 -228895 -228843 -228059 -231486 -232161 -230023 -225679 -222924 -226177
8372 -226177 -225600 -229186 -230142 -229055 -230339 -229605 -227331 -220339 -218154 -217502 -217012 -215686 -217040 -217766 -216272 -216233
$$ packed form
8480b14433J377n607p974o537m375J930M096J259m793J784J335L371j097J29J462
8465b28073L769q45L338L086j347r52j7o32k585q14J184K265j158M24J260J66
8449b20931q22K05L646N42K25K810J508L102m1R53J823K825M823K831L736P44
8433a92021l641j1276j8246j0215l510J279J625K82j843L780M846Q88Q87J458
8419b25707l39q30K444j151k310K465J108J844j217N68P11Q48J159l490J239N100
8403b17558M177J133l86l342k489l690Q91Q85K028M872L761j740n096J996L341
8388b11217K032o30j600l911o809m321k197k42N2P84l427o75K138M344K755l253
8372b26177N77l586r56J087j284P34K274O992K185O52M90J326j354p26J494L9
$$ plain form
8356 -216233 -219713 -221486 -218120 -219483 -215573 -213285 -212533 -212628 -216310 -216896 -221342 -221792 -221973 -217843 -217240 -215672
8340 -215672 -215233 -216621 -217019 -216387 -214610 -211663 -210350 -212043 -214875 -216393 -218538 -219835 -220438 -218520 -213430
8325 -213430 -207492 -206580 -206784 -208379 -208944 -209179 -210421 -208764 -207651 -205615 -204437 -205966 -204144 -200890 -202802
8310 -202802 -204811 -209204 -211815 -211469 -210209 -211365 -212607 -208832 -208090 -205478 -201945 -200568 -201826 -198669 -194563
8295 -194563 -194918 -195414 -194763 -194929 -190935 -192006 -195502 -195218 -191776 -189673 -191095 -194586 -194228 -191508 -193320 -193598
8279 -193598 -189605 -186447 -184915 -183568 -184698 -186278 -189663 -198904 -214363 -227024 -236602 -243668 -238945 -232805
8265 -232805 -230260 -227942 -223364 -216343 -211814 -211868 -211985 -209917 -207978 -207735 -207803 -204008 -204999 -201738 -198372 -194582
8249 -194582 -192125 -191541 -189150 -188207 -187721 -188357 -187287 -186252 -180976 -175488 -170908 -168334 -171650 -177997 -180310
$$ packed form
8356b16233l480j773L366j363L910K288P52r5l682n86m446m50j81M130O03J568
8340b15672M39j388l98O32J777K947J313j693k832j518k145j297o03J918N090
8325b13430N938R12k04j595n65k35j242J657J113K036J178j529J822L254j912
8310b02802k009m393k611L46J260j156j242L775P42K612L533J377j258L157M106
8295a94563l55m96O51j66L994j071l496K84L442K103j422l491L58K720j812k78
8279a93598L993L158J532J347j130j580l385r241j5459j2661r578p066M723O140
8265b32805K545K318M578P021M529n4j17K068J939K43o8L795r91L261L366L790
8249a94582K457N84K391R43M86o36J070J035N276N488M580K574l316o347k313
$$ plain form
8234 -180310 -176697 -169658 -162979 -161470 -157700 -161320 -170585 -182869 -200277 -226545 -256608 -274827 -280253
8221 -280253 -276766 -267684 -261697 -257532 -249988 -239007 -233361 -231949 -229844 -223733 -222505 -227150 -226525 -226763 -228890
8206 -228890 -228313 -227729 -223515 -218172 -217799 -214813 -210850 -209309 -209927 -207772 -206726 -209368 -208750 -207739 -205586 -199448
8190 -199448 -195038 -189848 -184241 -179036 -176154 -176022 -187249 -204984 -225546 -240367 -248422 -252604 -258393 -261932
8176 -261932 -263783 -261624 -261037 -260692 -257251 -254254 -249884 -245079 -240816 -232726 -227677 -227891 -226837 -228801 -237412
8161 -237412 -247076 -249736 -248195 -247975 -242064 -240951 -239617 -235590 -232850 -233340 -233328 -230728 -231752 -232370 -230037 -228937
8145 -228937 -228854 -230535 -229778 -224152 -216012 -213591 -214796 -222254 -229905 -233155 -235676 -239582 -243265 -246406 -242347
8130 -242347 -241659 -244800 -243775 -239389 -233501 -229592 -228543 -227984 -226612 -225257 -220690 -223495 -223271 -225726 -230184
$$ packed form
8234a80310L613P039O679J509L770l620r265j2284j7408k6268l0063j8219n426
8221b80253L487R082N987M165P544J0981N646J412K105O111J228m645O25k38k127
8206b28890N77N84M214N343L73K986L963J541o18K155J046k642O18J011K153O138
8190a99448M410N190N607N205K882J32j1227j7735k0562j4821q055m182n789l539
8176b61932j851K159N87L45L441K997M370M805M263Q090N049k14J054j964q611
8161b37412r664k660J541K20N911J113J334M027K740m90J2K600j024o18K333J100
8145b28937Q3j681P57N626Q140K421j205p458p651l250k521l906l683l141M059
8130b42347O88l141J025M386N888L909J049N59J372J355M567k805K24k455m458
$$ plain form
8115 -230184 -232721 -231956 -232697 -229688 -229746 -231117 -232697 -229960 -231017 -232187 -231318 -231193 -230362 -227105 -226058 -227481
8099 -227481 -226472 -223961 -221307 -223489 -224409 -224426 -223194 -223300 -226006 -228859 -231582 -228393 -229053 -227086 -226078 -228024
8083 -228024 -226795 -225564 -224576 -222876 -221684 -223193 -221534 -222258 -220257 -219282 -217977 -220053 -223219 -223912 -223191 -223190
8067 -223190 -223683 -223767 -223793 -223497 -225521 -227271 -226843 -226233 -223574 -221190 -222215 -219885 -218241 -219673 -221369 -221299 -223729
8050 -223729 -224908 -225178 -225338 -220347 -217835 -220588 -221334 -224795 -224999 -222619 -222743 -223424 -223710 -224145 -223341 -221308 -221342
8033 -221342 -222839 -224517 -220566 -221419 -219603 -221578 -226771 -229219 -227235 -221056 -217862 -219604 -219603 -218563 -218721 -219039
8017 -219039 -218670 -216599 -216395 -217170 -218934 -220727 -219811 -221184 -220845 -219829 -218610 -219865 -218553 -215116 -210663 -211826
8001 -211826 -213766 -216796 -217298 -216647 -217881 -218615 -218193 -218624 -219853 -222066 -222419 -220018 -220456 -221438 -219172 -212719
$$ packed form
8115b30184k537P65p41L009n8j371j580K737j057j170Q69J25Q31L257J047j423
8099b27481J009K511K654k182r20j7J232j06k706k853k723L189o60J967J008j946
8083b28024J229J231R88J700J192j509J659p24K001R75J305k076l166o93P21J
8067b23190m93q4k6K96k024j750M28O10K659K384j025K330J644j432j696P0k430
8050b23729j179k70j60M991K512k753p46l461k04K380j24o81k86m35Q04K033l4
8033b21342j497j678L951q53J816j975n193k448J984O179L194j742JJ040j58l18
8017b19039L69K071K04p75j764j793R16j373L39J016J219j255J312L437M453j163
8001b11826j940l030n02O51j234p34M22m31j229k213l53K401m38r82K266O453
$$ plain form
7985 -212719 -213774 -218110 -218428 -217245 -216865 -219424 -220649 -223279 -227691 -227622 -223363 -219114 -220377 -224127 -225359
7970 -225359 -225311 -224972 -224423 -222678 -220116 -221168 -221777 -220902 -222997 -220989 -215519 -212194 -213745 -217966 -219912 -220057
7954 -220057 -220694 -220366 -219601 -222101 -222468 -216725 -215442 -217003 -217733 -217020 -215045 -214813 -214274 -216757 -218278 -219604
7938 -219604 -217566 -215213 -216168 -218715 -222255 -223032 -219927 -216175 -216513 -216265 -218390 -216949 -218068 -218571 -219162 -220553
7922 -220553 -222080 -223163 -220597 -220570 -218576 -216323 -216670 -216784 -216945 -218402 -218430 -219211 -219079 -216545 -215770 -213015 -213832
7905 -213832 -216661 -216627 -214654 -210027 -209806 -215351 -215614 -212487 -213233 -215635 -215824 -216523 -214152 -212069 -212926 -215843
7889 -215843 -215761 -214350 -213011 -211879 -211976 -211513 -214003 -216278 -213819 -212724 -213758 -213743 -211230 -212071 -214055 -213639 -213397
7872 -213397 -212746 -209312 -209106 -210298 -211096 -208960 -211722 -211705 -212221 -210755 -209338 -207334 -209969 -210449 -215879 -218265
$$ packed form
7985b12719j055m336l18J183L80k559j225k630m412O9M259M249j263l750j232
7970b25359M8L39N49J745K562j052o09Q75k095K008N470L325j551m221j946j45
7954b20057o37L28P65k500l67N743J283j561p30P13J975K32N39k483j521j326
7938b19604K038K353r55k547l540p77L105L752l38K48k125J441j119n03n91j391
7922b20553j527j083K566K7J994K253l47j14j61j457k8p81J32K534P75K755q17
7905b13832k829L4J973M627K21n545k63L127p46k402j89o99K371K083q57k917
7889b15843Q2J411J339J132r7M63k490k275K459J095j034J5K513q41j984M16K42
7872b13397O51L434K06j192p98K136k762J7n16J466J417K004k635m80n430k386
$$ plain form
7856 -218265 -220680 -221084 -219510 -219242 -215384 -214679 -215840 -215395 -214763 -215478 -212691 -209780 -206398 -209522 -211803 -214061
7840 -214061 -212781 -208299 -206807 -208231 -208376 -209000 -212046 -213416 -212359 -211381 -212138 -210046 -209763 -211827 -214810 -213496
7824 -213496 -214713 -216012 -215051 -211723 -212770 -211551 -211684 -210927 -207004 -202843 -202558 -203951 -203667 -207223 -211830 -213559
7808 -213559 -210606 -210024 -210211 -209321 -207220 -205004 -207636 -208251 -209439 -211792 -208861 -206570 -203964 -206252 -209583
7793 -209583 -209973 -206680 -207490 -206383 -204091 -203074 -208300 -209724 -205685 -204295 -203864 -201234 -201041 -199875 -204738
7778 -204738 -207861 -208225 -205979 -208197 -208353 -207994 -208082 -209768 -210457 -209464 -208661 -210489 -207862 -207904 -204655 -203104 -203369
7761 -203369 -206181 -206816 -209016 -210863 -210086 -206421 -206328 -205065 -204384 -209694 -207675 -203555 -202378 -201991 -201793 -203433
7745 -203433 -205600 -206446 -207995 -207402 -208859 -208524 -206600 -204412 -202009 -201026 -201732 -202084 -207232 -208012 -206684 -208563
$$ packed form
7856b18265k415m04J574K68L858P05j161M45O32p15K787K911L382l124k281k258
7840b14061J280M482J492j424j45o24l046j370J057R78p57K092K83k064k983J314
7824b13496j217j299R61L328j047J219j33P57L923M161K85j393K84l556m607j729
7808b13559K953N82j87Q90K101K216k632o15j188k353K931K291K606k288l331
7793b09583l90L293q10J107K292J017n226j424M039J390M31K630J93J166m863
7778b04738l123l64K246k218j56L59q8j686o89R93Q03j828K627m2L249J551k65
7761b03369k812o35k200j847P77L665R3J263O81n310K019M120J177L87J98j640
7745b03433k167q46j549N93j457L35J924K188K403R83p06l52n148p80J328j879
$$ plain form
7729 -208563 -210179 -211172 -212192 -212081 -208719 -205193 -204879 -203516 -203837 -205902 -205244 -203194 -202021 -199415 -199588 -198171
7713 -198171 -197336 -200905 -204271 -203632 -199604 -203009 -204581 -201348 -200597 -197174 -197866 -200689 -203093 -205991 -205875 -204383
7697 -204383 -203475 -205666 -206347 -205309 -202323 -198917 -203983 -205337 -203645 -201206 -202286 -206294 -206661 -203162 -203397
7682 -203397 -205038 -204294 -203761 -202893 -203439 -205293 -204165 -202864 -204813 -206230 -203476 -200413 -196681 -200353 -202690
7667 -202690 -204683 -207574 -209010 -207202 -205086 -203483 -203200 -203972 -200130 -198336 -203907 -209543 -208514 -205501 -202674
7652 -202674 -205086 -205261 -202357 -200184 -199336 -198359 -199398 -199639 -199959 -198187 -196926 -195532 -197027 -202556 -199714 -198186
7636 -198186 -200403 -199105 -200470 -203961 -204255 -201015 -197520 -196795 -199219 -202006 -204864 -201060 -199838 -199366 -199166
7621 -199166 -201067 -200540 -201475 -201705 -203611 -203302 -201996 -201927 -202736 -200467 -199708 -198839 -198177 -200708 -200769 -203358 -201338
$$ packed form
7729b08563j616r93j020J11L362L526L14J363l21k065O58K050J173K606j73J417
7713a98171Q35l569l366O39M028l405j572L233P51L423o92k823k404k898J16J492
7697b04383R08k191o81J038K986L406n066j354J692K439j080m008l67L499k35
7682b03397j641P44N33Q68n46j854J128J301j949j417K754L063L732l672k337
7667b02690j993k891j436J808K116J603K83p72L842J794n571n636J029L013K827
7652b02674k412j75K904K173Q48R77j039k41l20J772J261J394j495n529K842J528
7636a98186k217J298j365l491k94L240L495P25k424k787k858L804J222M72K00
7621a99166j901N27r35k30j906L09J306O9q09K269P59Q69O62k531o1k589K020
$$ plain form
7604 -201338 -200065 -201409 -202035 -203357 -206662 -206814 -203047 -203492 -201624 -197964 -198765 -197899 -198387 -201532 -197286 -194884
7588 -194884 -198140 -201577 -202985 -200722 -197925 -195935 -198430 -201606 -203500 -199922 -198621 -199001 -202600 -202026 -202013
7573 -202013 -203309 -201816 -200269 -200035 -201855 -201103 -200058 -198957 -198374 -200950 -198821 -199826 -201759 -202585 -203546 -203391
7557 -203391 -198529 -195756 -194206 -197702 -200462 -199832 -196398 -194461 -193982 -195926 -197773 -194892 -193995 -198070 -202745
7542 -202745 -202455 -200990 -200205 -199544 -195096 -192341 -192977 -194358 -195273 -191889 -193169 -194946 -197735 -192843 -191903 -192483
7526 -192483 -190267 -189204 -189822 -193253 -194714 -194374 -192375 -192173 -190698 -189281 -193346 -198025 -198259 -195229 -195079 -199138
7510 -199138 -201048 -195841 -194355 -195673 -192040 -189083 -190168 -193532 -198657 -201071 -197903 -197097 -196560 -193753 -195269
7495 -195269 -196483 -194635 -193340 -191394 -190291 -191618 -190792 -193389 -194004 -192843 -189241 -189098 -191740 -193564 -196140
$$ packed form
7604b01338J273j344o26j322l305j52L767m45J868L660q01Q66m88l145M246K402
7588a94884l256l437j408K263K797J990k495l176j894L578J301l80l599N74J3
7573b02013j296J493J547K34j820P52J045J101N83k576K129j005j933q26r61J55
7557b03391M862K773J550l496k760O30L434J937M79j944j847K881Q97m075m675
7542b02745K90J465P85O61M448K755o36j381r15L384j280j777k789M892R40n80
7526a92483K216J063o18l431j461L40J999K02J475J417m065m679k34L030J50m059
7510a99138j910N207J486j318L633K957j085l364n125k414L168Q06N37K807j516
7495a95269j214J848J295J946J103j327Q26k597o15J161L602J43k642j824k576
$$ plain form
7480 -196140 -193703 -190532 -193794 -196424 -197422 -197826 -196937 -195915 -193750 -194458 -195608 -194888 -194374 -194334 -194543 -193173 -193962
7463 -193962 -192847 -192409 -190169 -189076 -188482 -190585 -193234 -192192 -193742 -196708 -194228 -193810 -194754 -191198 -188790
7448 -188790 -189744 -189707 -189899 -191566 -195721 -195591 -193390 -192603 -191219 -193438 -191382 -190844 -191597 -192743 -192746 -192149 -190543
7431 -190543 -189184 -187176 -189523 -193250 -195119 -195985 -195682 -191999 -192829 -193110 -195540 -193135 -189407 -187792 -191138
7416 -191138 -193141 -195874 -199625 -200251 -200317 -205138 -208825 -206038 -200231 -197262 -193304 -193217 -194126 -192341 -191629 -192037
7400 -192037 -192934 -196416 -196009 -191364 -188460 -193530 -195463 -191828 -189397 -190558 -193992 -196777 -194570 -194365 -195555
7385 -195555 -196560 -198678 -195334 -193956 -195900 -195479 -194868 -195001 -193754 -193498 -195638 -193002 -196967 -200710 -199312
7370 -199312 -191886 -188352 -185275 -186222 -188490 -188664 -185247 -184587 -185395 -189463 -187170 -187962 -191195 -195488 -197620 -191952
$$ packed form
7480a96140K437L171l262k630r98m04Q89J022K165p08j150P20N14M0k09J370p89
7463a93962J115M38K240J093N94k103k649J042j550k966K480M18r44L556K408
7448a88790r54L7j92j667m155J30K201P87J384k219K056N38p53j146lN97J606
7431a90543J359K008k347l727j869q66L03L683q30k81k430K405L728J615l346
7416a91138k003k733l751o26o6m821l687K787N807K969L958Q7r09J785P12m08
7400a92037q97l482M07M645K904n070j933L635K431j161l434k785K207K05j190
7385a95555j005k118L344J378j944M21O11j33J247K56k140K636l965l743J398
7370a99312P426L534L077r47k268j74L417O60q08m068K293p92l233m293k132N668
$$ plain form
7354 -191952 -190417 -192845 -194171 -195480 -194884 -194931 -194366 -194663 -196218 -198377 -197010 -197303 -197486 -195029 -194795 -194362 -194602
7337 -194602 -194571 -193668 -191026 -192190 -192097 -191941 -195263 -193527 -191188 -190537 -192784 -190669 -187193 -185244 -185317 -181109 -183902
$$ packed form
7354a91952J535k428j326j309N96m7N65k97j555k159J367k93j83K457K34M33k40
7337a94602L1R03K642j164R3J56l322J736K339O51k247K115L476J949p3M208k793
$$ [...]
##END NTUPLES=NMR SPECTRUM
##END=
