##TITLE=Analysis number 326525
Compound Code gk 02622
Project Code adrs
Chemist Name af chempharm
##JCAMPDX= 6.0         $$ Bruker NMR JCAMP-DX V2.0
##DATA TYPE= NMR SPECTRUM
##DATA CLASS= NTUPLES
##ORIGIN= Bruker BioSpin GmbH
##OWNER= nmr
$$ XWIN-NMR		Version 3.5
$$ Fri Feb  9 13:57:36 2007 GMT Standard Time (UT+0h)  MAYBRIDGE\nmr@NMR_250MHZ
##.OBSERVE FREQUENCY= 250.131544655141
##.OBSERVE NUCLEUS= ^1H
##.ACQUISITION MODE= SIMULTANEOUS (DQD)
##.ACQUISITION SCHEME= undefined
##.AVERAGES= 16
##.DIGITISER RES= 18
##SPECTROMETER/DATA SYSTEM= dpx250
##.PULSE SEQUENCE= zg30
##.SOLVENT NAME= DMSO
##.SHIFT REFERENCE= (INTERNAL, DMSO, 0, 16.522)
##AUDIT TRAIL= $$ (NUMBER, WHEN, WHO, WHERE, WHAT)
$$ ##TITLE= Audit trail, XWIN-NMR		Version 3.5
$$ ##JCAMPDX= 5.01
$$ ##ORIGIN= Bruker BioSpin GmbH
$$ ##OWNER= nmr
$$ C:\u/data/dgb/nmr/ADRS/650/pdata/1/auditp.txt
$$ ##AUDIT TRAIL=  $$ (NUMBER, WHEN, WHO, WHERE, WHAT)
(   1,<2007-02-09 13:57:04.66 +000>,<MAYBRIDGE\nmr>,<NMR_250MHZ>,
      <created by zg, POWCHK disabled, PULCHK disabled
       configuration hash MD5:
       49 4B E0 1D 92 C2 6B 37 9F E6 65 BC 52 41 86 1D
       data hash MD5: 64K
       C0 36 73 E4 FA 19 07 9F 1A 1E 4C 3D 47 1F 14 0E>)
(   2,<2007-02-09 13:57:28.02 +000>,<MAYBRIDGE\nmr>,<NMR_250MHZ>,
      <Start of raw data processing
       ef LB = 0.3 FT_mod = 6 PKNL = 1 SI = 32K 
       data hash MD5: 32K
       B9 B1 15 3A DF E6 C8 70 9E 6B A5 DF 3E 02 95 56>)
(   3,<2007-02-09 13:57:30.66 +000>,<MAYBRIDGE\nmr>,<NMR_250MHZ>,
      <apk 
       data hash MD5: 32K
       89 48 AD 15 4D 57 CE F1 6A 49 97 D3 8B EB 89 48>)
(   4,<2007-02-09 13:57:31.61 +000>,<MAYBRIDGE\nmr>,<NMR_250MHZ>,
      <abs ABSG = 5 
       data hash MD5: 32K
       03 38 59 B0 25 17 DE 85 FB 41 44 AE CA A0 18 6C>)
$$ ##END=
$$ 
$$ hash MD5
$$ CE B8 CF B5 3D 32 DD 3C 53 D6 24 3D A2 A7 90 BF
##$RELAX= 
##$RELAX= 
##$RELAX= 
##$RELAX= 
##$RELAX= 
##$RELAX= 
##$RELAX= 
$$ Bruker specific parameters
$$ --------------------------
##$DU= <C:\u>
##$EXPNO= 650
##$NAME= <ADRS>
##$PROCNO= 1
##$TYPE= <nmr>
##$USER= <dgb>
##$AMP= (0..31)
100 100 100 100 100 100 100 100 100 100 100 100 100 100 100 100 100 100 
100 100 100 100 100 100 100 100 100 100 100 100 100 100 
##$AQSEQ= 0
##$AQ_mod= 3
##$AUNM= <au_zg>
##$AUTOPOS= <52 >
##$BF1= 250.13
##$BF2= 250.13
##$BF3= 250.13
##$BF4= 250.13
##$BF5= 500.13
##$BF6= 500.13
##$BF7= 500.13
##$BF8= 500.13
##$BYTORDA= 1
##$CFDGTYP= 0
##$CFRGTYP= 5
##$CHEMSTR= <none>
##$CNST= (0..31)
1 1 145 1 1 1 1 1 1 1 1 1 1 1 1 1 1 1 1 1 1 1 1 1 1 1 1 1 1 1 1 1 
##$CPDPRG= <>
##$CPDPRG1= <>
##$CPDPRG2= <>
##$CPDPRG3= <>
##$CPDPRG4= <mlev>
##$CPDPRG5= <mlev>
##$CPDPRG6= <mlev>
##$CPDPRG7= <mlev>
##$CPDPRG8= <mlev>
##$CPDPRGB= <>
##$CPDPRGT= <>
##$D= (0..31)
0 1 0 0 0 0 0 0 0 0.06 0 0 0 0 0 0 0.0002 0 0 0 0 0 0 0 0 0 0 0 0 0 0 
0 
##$DATE= 1171029423
##$DBL= (0..7)
120 120 120 120 120 120 120 120 
##$DBP= (0..7)
150 150 150 150 150 150 150 150 
##$DBP07= 0
##$DBPNAM0= <>
##$DBPNAM1= <>
##$DBPNAM2= <>
$$ [...]
##$SUBNAM6= <"">
##$SUBNAM7= <"">
##$SUBNAM8= <"">
##$SUBNAM9= <"">
##$SW= 20.6930455092707
##$SWIBOX= (0..15)
0 0 3 0 0 0 0 0 0 0 0 0 0 0 0 0 
##$SW_h= 5175.983436853
##$TD= 65536
##$TD0= 1
##$TE= 294.16
##$TE2= 300
##$TE3= 300
##$TEG= 300
##$TL= (0..7)
0 120 120 120 120 120 120 120 
##$TP= (0..7)
150 150 150 150 150 150 150 150 
##$TP07= 0
##$TPNAME0= <>
##$TPNAME1= <>
##$TPNAME2= <>
##$TPNAME3= <>
##$TPNAME4= <>
##$TPNAME5= <>
##$TPNAME6= <>
##$TPNAME7= <>
##$TPOAL= (0..7)
0.5 0.5 0.5 0.5 0.5 0.5 0.5 0.5 
##$TPOFFS= (0..7)
0 0 0 0 0 0 0 0 
##$TUNHIN= 0
##$TUNHOUT= 0
##$TUNXOUT= 0
##$USERA1= <user>
##$USERA2= <user>
##$USERA3= <user>
##$USERA4= <user>
##$USERA5= <user>
##$V9= 5
##$VALIST= <valist>
##$VCLIST= <CCCCCCCCCCCCCCC>
##$VD= 0
##$VDLIST= <DDDDDDDDDDDDDDD>
##$VPLIST= <PPPPPPPPPPPPPPP>
##$VTLIST= <TTTTTTTTTTTTTTT>
##$WBST= 1024
##$WBSW= 4
##$XGAIN= (0..3)
0 0 0 0 
##$XL= 0
##$YL= 0
##$YMAX_a= 320195
##$YMIN_a= -373702
##$ZGOPTNS= <>
##$ZL1= 120
##$ZL2= 120
##$ZL3= 120
##$ZL4= 120
##$ABSF1= 16.522
##$ABSF2= -4.171173
##$ABSG= 5
##$ABSL= 3
##$ALPHA= 0
##$AQORDER= 0
##$ASSFAC= 0
##$ASSFACI= 0
##$ASSFACX= 0
##$ASSWID= 0
##$AUNMP= <proc_1d>
##$AZFE= 0.1
##$AZFW= 0.1
##$BCFW= 0
##$BC_mod= 0
##$BYTORDP= 0
##$COROFFS= 0
##$CY= 12.5
##$DATMOD= 1
##$DC= 0
##$DFILT= <>
##$DTYPP= 0
##$F1P= 14.0000005364418
##$F2P= -0.99999901652339
##$FCOR= 0.5
##$FTSIZE= 32768
##$FT_mod= 6
##$GAMMA= 0
##$GB= 0
##$INTBC= 1
##$INTSCL= 1
##$ISEN= 128
##$LB= 0.3
##$LEV0= 0
##$LPBIN= 0
##$MAXI= 10000
##$MC2= 0
##$MEAN= 0
##$ME_mod= 0
##$MI= 0
##$NCOEF= 0
##$NC_proc= -3
##$NLEV= 6
##$NOISF1= 0
##$NOISF2= 0
##$NSP= 0
##$NTH_PI= 0
##$NZP= 0
##$OFFSET= 16.522
##$PC= 1
##$PHC0= 199.951
##$PHC1= 37.66731
##$PH_mod= 1
##$PKNL= yes
##$PPARMOD= 0
##$PSCAL= 4
##$PSIGN= 0
##$REVERSE= no
##$SF= 250.13
##$SI= 32768
##$SIGF1= 0
##$SIGF2= 0
##$SINO= 400
##$SIOLD= 32768
##$SREGLST= <1H.DMSO>
##$SSB= 0
##$STSI= 32768
##$STSR= 0
##$SW_p= 5175.98343685301
##$SYMM= 0
##$S_DEV= 0
##$TDeff= 65536
##$TDoff= 0
##$TI= <Analysis number 999999
Compound Code 99
Book Reference 9
Project Code 9>
##$TILT= no
##$TM1= 0
##$TM2= 0
##$TOPLEV= 0
##$USERP1= <user>
##$USERP2= <user>
##$USERP3= <user>
##$USERP4= <user>
##$USERP5= <user>
##$WDW= 1
##$XDIM= 32768
##$YMAX_p= 344570924
##$YMIN_p= -119221
$$ End of Bruker specific parameters
$$ ---------------------------------
##NTUPLES= NMR SPECTRUM
##VAR_NAME=  FREQUENCY,     SPECTRUM/REAL,   SPECTRUM/IMAG
##SYMBOL=    X,             R,               I
##VAR_TYPE=  INDEPENDENT,   DEPENDENT,       DEPENDENT
##VAR_FORM=  AFFN,          ASDF,            ASDF
##VAR_DIM=   32768,         32768,           32768
##UNITS=     HZ,            ARBITRARY UNITS, ARBITRARY UNITS
##FACTOR=    0.157963299565203, 1,           1
##FIRST=     4132.6476996994, 0,             0
##LAST=      -1043.33573715361, 0,           0
##MIN=       -1043.33573715361, -119221,     0
##MAX=       4132.6476996994, 344570924,     0
$$ Real data points
##PAGE= N=1
##DATA TABLE= (X++(R..R)), XYDATA
$$ [...]
18796A3359j1796l3393J8353Q071O496j2316k296q967J5271P597r968N976J8971
18783A5358K359q54k0468k4815N552L2600J387P702J2600j1050j3961j2002j1448
18770a7040J218r432J8917J7559K414J8432q286j9326j1338l5009K9M1393L8557
18757C8088J2873l7597j5042J7038l492k5718J6258l403R688M930j851l1177K6429
18744G024J3694N077l7180J072n314k2525j4695M498J2177K3984R463N721K7786
18731C0782N729q398m0849l0072k329Q716q878J6833K4951K9735K2909j3651j8412
18718A7066l980o345j4880p289L1752j1269k2768R918j4266j9667l628N341K3883
18705a6132R143O882L4438j5832k2947J4286K6154M491n780j6230l4400m3298
$$ y = [13359, 1563, -31830, -13477, -5406, 1090, -11226, -13522, -22489, -7218, 379, -9589, -3613, 15358, 17717, 16863, -3605, -28420, -22868, 9732, 11119, 18821, 31421, 20371, 6410, -5592, -17040, -15822, -25254, -6337, 11222, 13636, 32068, 23782, 4456, -6882, -41891, -41862, -469, 38088, 50961, 13364, -1678, 15360, 11868, -13850, 2408, -995, 8693, 13623, 11772, -19405, 7024, 20718, 25795, -11385, -10313, -15627, -38152, -52847, -48349, -36172, -12188, -2725, 2996, 30782, 36511, 28113, -12736, -42808, -45137, -36421, -45299, -28466, -3515, 26220, 49129, 35478, 17066, 13086, 6741, -8139, -15428, 16324, 5055, -17713, -7795, -22061, -41728, -45356, -40015, -16132, -6989, -107, 34331, 18499, -4448, 9838, 35992, 40483, 34703, 18473, -15927, -59225]
18693e9225K3562K2156J0145K8630k0588k3586M407J5172p681p155l108J2789
18681d482K109N972k0302K7150l034k9866K4470J9690j3653m2729l9102j565K7771
18668d7571J227J1045P428l618J8388K0561j993J7267N503J8848p294k8997k1053
18655a0259k5807M281J5403k1849j0903J3665r322P843j3554N276J0547j3490
18643d8169L274J4824L0948K6198o970k6115q75j5829J1129K0404j6433k7691
18631c5305o869R688J6341M7680r564l2989p988n45q365K6498J5132J3586j889
18618B5411r879m2991j0511M0984K6514k309n136J7911K185l257j5200Q654l113
18605B9263j0140k4155l0544J690R042R862L1882L850k546m908p679J8407Q883
$$ y = [-59225, -35663, -13507, -3362, 25268, 4680, -18906, -14499, 673, -7008, -14163, -17271, -4482, -2373, 3599, -16703, 10447, 7413, -22453, 2017, 21707, 8054, -34675, -73777, -75342, -47571, -46344, -35299, -27871, -31489, -13101, 7460, 5467, 22734, 28237, 47085, 39791, 10794, -10259, -36066, -31785, -16382, -38231, -49134, -35469, -44791, -36948, -50502, -45226, -34679, -48169, -44895, -30071, 877, 27075, 20105, -6010, -6885, -22714, -11585, 8819, -7614, -35305, -42174, -32486, -16145, 31535, 21971, -11018, -19006, -19551, -27916, -1418, 13714, 27300, 25411, 15532, -27459, -37970, 3014, 29528, 27219, 22083, 39994, 42179, 38922, 23722, 32376, 29263, 19123, -5032, -35576, -33886, -24844, -14982, 16900, 20750, 18204, 13296, 5617, 24024, 32907]
18592C2907j5215k0811k4009P382j2215L600M823L254J0740J4435r318J8262k1802
18579g967Q574N189K9241j5291k2523j2896j1074o277J9154K9577J968O771J0708
18566C5154K7039n0109j2414J7273J4052L698r108k7984n734P709q140j0635k304
18553b1503K9684n759K074N016k5969j1721o206j0281j3206R582L2227J0803j861
18540g120J4631O739k7809k4085j6247P349K9613J1396q01P952J9344o902k8940
18527a4880Q88J3529r91m730m30r067J5497o328k2322j7735j9798P957M4637K7028
18513A3255j6980R470L728J2187p470J9242K7481o437J870k4439k1529L340l1239
18500a7521j9818J4264J5691j0521j4550m972k55l790N584R756L980J4715J0333
$$ y = [32907, 17692, -3119, -27128, -19746, -31961, -28361, -23538, -20284, -9544, 4891, -4427, 13835, -7967, 607, 5796, 35037, 19746, -2777, -15673, -26747, -33024, -13870, 15707, 17675, 24446, 35154, 62193, 12084, -330, 16943, 30995, 34693, 25585, -2399, -8133, -424, -8564, -19199, -21503, 8181, 2422, 4496, 9512, -16457, -28178, -34384, -44665, -57871, -48289, -16062, -5259, -7120, 7511, 14250, -13559, -37644, -53891, -46542, -16929, -5533, -6334, 1618, 20962, 14060, -14880, -13992, -463, -1454, -6184, -6614, -15681, -184, -6512, -28834, -46569, -66367, -58410, -13773, 13255, -3725, 5745, 9473, 21660, 14190, 33432, 60913, 54476, 56346, 31907, 10378, 13718, -17521, -37339, -23075, -7384, -17905, -32455, -37427, -37682, -41472, -35888, -26132, -22152, -7437, 2896]
18487B896N240k779k1459J9273J0666j5392k1644k873K8187M3176k1021k8722
18475d452q468Q910k8950j6206K8p297N069K5459J7044J0714j2469m335N348M779
18461d826J1460j4489l171J9340r853k7153l334j0096o24r29J4212J1260q973
18448b7176j41j8844J4225R344K315O493K3627J6592j64m2402l3003P605M2533
18435A004l808q125J428j659M889j8936q229J6763J5126k788L448j3945l8805
18422e3637o352J791M9011J9021K9973j1683J2276j4164j4668k2856q752j3457
18410c3497k1418J5136p062J5698J2897J5537j388J3672M633j6049KJ609j6971
18397a7201N067L837N091j3841q949J4289L363K1440J9398K2034K2822p016j4267
$$ y = [2896, 8136, 5357, -16102, 3171, 13837, -1555, -23199, -26072, 2115, 45291, 24270, -4452, -12920, -4010, -32960, -49166, -49138, -56435, -51366, -25907, -8863, 1851, -10618, -14953, -9605, -4826, 6634, -7855, -11026, 8314, -1539, -28692, -32026, -42122, -42746, -43675, -29463, -18203, -27176, -27317, -46161, -31936, -22592, -20277, -13784, 9843, 26435, 26271, -16131, -49134, -41529, 1004, -2804, -10929, -9501, -11160, -6271, -25207, -33436, -16673, -1547, -4335, -887, -14832, -53637, -59989, -58198, -9187, 9834, 39807, 28124, 40400, 26236, 11568, -11288, -20040, -33497, -54915, -39779, -46841, -31143, -18246, -2709, -4097, 9575, 14208, -1841, -1839, -230, -17201, -12134, -8297, -3206, -17047, -25996, -11707, -8344, 13096, 32494, 54528, 77350, 70334, 56067]
18384E6067j0848k8777o505k8239l182o011r219j3651p556J7717o153j1900k880
18371f1137j1052K79J0129M0730K1450J4261N580n321l179Q774k4854j4759j9269
18358c8368j4506K4854J0545j8483J8588J9076J3478K356j1981q288J1383n026
18346C628l7234l91K7524J0259l3758K520l0687K9386L1223k0912P21J5608M190
18333B077J0395j6999K8026k453j6871j3076K5415k1435J771q265j3970L289J9851
18320b245q268j6647K0415J5698k9865L412L2640J5365j713J1292q120j4325k7675
18307a0036r71J2001J4408r855k2220j0936L3430K0920l485m529k9988J5563J5103
18294A9405k412m1552k4899J0960L754r12L9774J985k267k8399k172M0723n219
$$ y = [56067, 45219, 16442, 9937, -18302, -21484, -27495, -36714, -50365, -57921, -40204, -46357, -58257, -61137, -72189, -71910, -61781, -21051, 399, 14660, 20240, 14919, 11740, 20514, -4340, -19099, -38368, -52874, -28020, -17475, -35958, -17370, 1706, 15184, 17540, 5559, -2729, 8654, 3628, -33606, -33997, -6473, 3786, -29972, -27452, -58139, -28753, 2470, -18442, -17721, -2113, 2077, 12472, -4527, 23499, 21046, 4175, -8901, 16514, -4921, -3150, -11415, -25385, -22096, -2245, -10513, -27160, -6745, 8953, -20912, -17500, 15140, 30505, 28792, 40084, 31964, 17639, -10036, -11007, 994, 15402, 5547, -16673, -27609, 5821, 26741, 23256, 18727, -11261, 4302, 19405, 16993, -24559, -49458, -38498, -34744, -35656, 4118, 6103, 3836, -24563, -26735, 13988, 8769]
18281H769l1664p301m5677l2001P371J5629J3135N0530K4608l5699o720K9639
18269i381J2244j1998k5455K132K5131L0286k4073l3163K09J0568O015k6504J1885
18256c2104J1911J7533l545J6899r247k4917q518J1691k590l2321K5504K0988
18244h716q097q327J9484L6615k1008j1959J3040l743J722k682j8238K712J0681
18231A484J2085N165Q623k6530r762L8229J906n084k5948J5869K3903P941j2675
18218C5206K114J2786j2092j6261l0069l8086l946J3348o19K1999J3016j4116
18206a6720j5274J7982m2J113J4095K419k3263p616J0222J6746j6484p041K999
18193b0864n523j0944L3574K6186J790j0742r558l6078L692L3953j5695J1344
$$ y = [8769, -22895, -30196, -75873, -107874, -100503, -84874, -71739, -21209, 3399, -32300, -39020, -9381, 2863, -9135, -34590, -32458, -7327, 22959, -1114, -34277, -34068, -23500, -17485, -43989, -32104, -20193, -2660, -6205, 10694, 1447, -23470, -31988, -20297, -22887, -55208, -29704, -8716, -16813, -25140, -5656, 30959, 9951, -2008, 11032, 7289, 9011, 6329, -11909, -9197, 1484, 13569, 18734, 27357, 827, -8935, 29294, 31200, 26116, 168, 16037, 39940, 47881, 35206, 37320, 50106, 38014, 21753, -8316, -46402, -50348, -37000, -37619, -15620, -2604, -16720, -31994, -14012, -14054, -12941, 1154, 3573, -19690, -27306, -17084, -338, -16822, -23863, -20864, -26387, -37331, -3757, 22429, 24219, 13477, 3919, -32159, -28467, 5486, -10209, 1135]
18181A135M715j3296j2444L5953L4762j3938j350j3306j0163j2068j2089j4788
18169b6877l2760K2028L2557N612j5008q144j591L3156M0051p116r280K98Q679
18156D1605J5040k2016k4629m574n372p563K0942k1886k1887J2591K8560p672
18144C139o617r735p116J2194n40p489r125J7787L5885j1837J0349k7419j2597
18131a3121L7195J9395j3373l816r863o737R942K905k2017k8915p789k561M9841
18118A1086L2698k2149O09J2565M436m828r197p765q981K421P789N344R064J6726
18104D9818k3954j6341l5584j3076L011J8207k855l253J10J7775K9620p929n888
18091I661J3343k2124p906j0862J5051j8560k1284J6531J2111J1150J293j35l921
$$ y = [1135, 5850, -7446, -19890, 16063, 50825, 36887, 35537, 22231, 12068, 0, -12089, -26877, -59637, -37609, -5052, 560, -14448, -22592, -24183, 8973, 49024, 41908, 32628, 32926, 41605, 56645, 34629, 10000, 5426, 54, -7509, 13433, -8453, -30340, -17749, 10811, 3139, -3478, -13213, -20329, -8135, -8675, -16164, -25289, -7502, 28383, 16546, 26895, -524, -13121, 24074, 43469, 30096, 26280, 16417, 9680, 19622, 22527, 510, -28405, -36194, -38755, 11086, 43784, 21635, 22244, 34809, 39245, 34417, 25220, 17455, 8474, 10895, 18684, 24028, 33092, 49818, 25864, 9523, -26061, -39137, -36126, -17919, -20774, -24027, -23917, -6142, 23478, 15549, 9661, 23004, 880, -7026, -17888, -2837, -21397, -42681, -26150, -14039, -2889, -1596, -1731, -5652]
18078e652l443n248J3943j0527K625J378k0056j8393L371R184Q133k4348K3535
18065b5498N724j3725J7508k3806K113N6304J4649J2k604j5429O013j7649M806
18052H418K3665j9600n2942j691N065k8315J5404r937N743K4786p699j7651K0977
18039c3777K9171J1279r793K029l429R873L836j4111k4681N666J0713O432O099
18026f93o128J8219J1785j2459O439j1271J5253M012k8788j8716O010J6702J5490
18013A5855J1788k0335O75j0340j3277o120m422j0138n901K6601j4731K0362J9135
18000I152L893j1507P649J4074J740L2604r899k1731j5227j5743k9581j5523M2621
17987g478J7696J9801l8907k6512K0183J2707J5311K3651k8543j4956p708K8403
$$ y = [-5652, -9095, -14343, -400, -10927, -8302, -6924, -26980, -45373, -42002, -32818, -24685, -49033, -25498, -19774, -33499, -15991, -39797, -37684, 18620, 33269, 33281, 30677, 15248, 21261, 3612, 8418, 32083, 12483, -40459, -42150, -37085, -65400, -49996, -59933, -54190, -29404, -37103, -54754, -33777, -4606, 6673, -3120, -1091, -4520, 5353, 9189, -4922, -29603, -23937, -13224, -6792, -693, -6821, 11398, 23183, 10724, 17163, 5892, 21145, 25157, -3631, -22347, -16337, 365, 15855, 27643, 7308, 7983, -2357, -15634, -21754, -26176, -36314, -42215, -15614, -30345, -9983, 9152, 13045, 1538, 9187, 23261, 25001, 57605, 47706, 25975, 10748, -4995, -34576, -50099, -7478, 10218, 30019, -8888, -35400, -15217, -2510, 12801, 36452, 7909, -7047, -14755, 13648]
17975A3648K1385j3357p918j3528K0257J7420j6950q589K1504J8773j6276j3009
17963B3360N878K2190j9871m0282j3440J1427L984j4393m694K3286M1442K764
17951D1651m380q298j8982O277l022q378j4524M147j3471j0820L4772r190K760
17938a458q133J3514Q884J796O070j0962j8074J8371J9680j1263k5291o925R015
17925d776k5195K298J3545J6063J9450N813k7756j7379J4115K9350j0085j3322
17913B121K70j5473j9364m296K8956O493j578k1058p913k5752M840J5209J0969
17900b6576J2676K502K4104j2073j9000J1283M056L312k5186J8833J8561P533
17888B0025l812K5344J2555j1704j5011m3936m367M0949j1323l1972N564J6616
$$ y = [13648, 35033, 21676, 13758, 230, 20487, 37907, 20957, 12368, 33872, 52645, 36369, 23360, 29238, 51428, 31557, -8725, -22165, -10738, -6754, -21147, -25841, -2555, 38887, 41651, 37271, 28973, 9991, 16268, 13246, 4868, -9656, -5509, -18980, -29800, 4972, -4218, -1458, -9591, 3923, 12807, 14603, 20673, 9711, -8363, 10008, 29688, 18425, -6866, -13791, -4776, -29971, -27673, -14128, 1935, 21385, 27198, -558, -17937, -3822, 25528, 15443, 2121, 2391, -13082, -32446, -36742, -7786, -1293, -2871, -23929, -31842, -57594, -52754, -37545, -26576, -13900, -11398, 12706, 633, -18367, -7084, -3028, 284, -24902, -6069, 12492, 20025, 16213, 41557, 54112, 42408, 27397, -16539, -20906, 20043, 8720, -23252, -17688, -1072]
17876a072K7883j5827j2712r207m497K765J8463j8642j1568O933L901l5518P485
17863d1613L830L336M672K3543R192J0918K855j7026K910R748l868j7435K172
17850f766J6855K5002k3228m9331j8534M176n821M494k927L0450L5540L7776K6012
17837G3698k9171m1295j9391K7706Q775l444l4588l2005M1495J0160j6210K294
17825a1976K730k18K6341K0990q758l2158j1316K8831J5994L575O911K0705R295
17812G0946j5721j1142j2770j0906j5631K687L14j6518M000n328r991L572p450
17799b3938j5568J9454K9478R684j3573p966m760p184j2408P361J7469q203r796
17786a9950J795J352j1368Q640J1385P60k3573j3510N259n03M9846K2720k4609
$$ y = [-1072, 26811, 10984, -1728, -10935, -15432, -12667, 5796, -12846, -24414, -17481, -13580, -49098, -41613, -37783, -34447, -29775, -6232, 2960, 13878, 16733, -293, 2617, 12365, 8497, -8938, -6766, 10089, 35091, 11863, -37468, -56002, -51826, -57647, -53153, -56080, -25630, 9910, 47686, 73698, 44527, 3232, -16159, 11547, 20322, 16878, -17710, -49715, -8220, 1940, -14270, -11976, -9246, -9464, 16877, 37867, 29109, -3049, -14365, 14466, 30460, 34035, 40946, 61651, 70946, 55225, 44083, 31313, 20407, 4776, 7463, 7777, -8741, -4741, -10069, -20060, -16488, -23938, -39506, -20052, 9426, 19110, 5537, -2429, -7189, -14373, -26781, -19420, -1951, -10154, -19950, -18155, -16803, -28171, -19531, -8146, -7386, -30959, -44469, -39210, -39713, 10133, 32853, 8244]
17773H244m438k0746j8024K0071K6184N558J9943o804l2520k8027R913P752K1092
17760H198k4562l4109J3811K7936M732k8221J5227L8784M273k9591O940K7423
17748C0841Q377k6380m684K7795k644j015l0972l7890j3004J9127N2014K0573
17736D2138k3084j2865Q201K52k7391l0248j9662p863J1670K218K2590Q417K5791
17723A64M3058n533O535j8732p697l002j3803o354n638J3261j0109j7224j9390
17710d4464J5219K7669K4855O408k078k0515k5352J1530R901j7653K360p499k2174
17697d1793J8444K2069k1135j6860J682J049j1810N251K5685J9806J5383J0414
17685B8185r730M941o06o321j4715J4562J0809J5562J4521k8947n890j0366p053
$$ y = [8244, 3806, -16940, -34964, -14893, 11291, 16849, 36792, 29988, -2532, -30559, -20646, -12894, 8198, -16364, -50473, -36662, -8726, -3994, -32215, -16988, 21796, 26069, -3522, 3418, 30841, 39218, 12838, 8154, 35949, 33305, 32290, 1318, -36572, -49576, -30449, 21565, 42138, 19054, 6189, 14390, 14642, -12749, -42997, -62659, -70522, -58852, -56634, -34044, -25627, 164, 43222, 37689, 44224, 25492, 17795, 14793, 990, -5364, -11002, 2259, -7850, -25074, -44464, -29245, -1576, 23279, 29687, 27609, 7094, -18258, -6728, 3173, -14480, -12120, -19619, -41793, -23349, -1280, -22415, -39275, -37593, -36544, -48354, -43103, -17418, 2388, 17771, 28185, 18455, 23396, 22790, 16469, 1754, 16316, 27125, 42687, 57208, 28261, 22371, 12005, 4952]
17672D952k3366J0021K9804q952m181K141l7114O9O1635k170k4590J5692J2648
17659C6589j131j0960k2806k0959j931o544q278j6496K1885J9398o691K0619K0044
17646B2739l2432o3459k0439L3789J6640k4605J0924J6544l66L2999M8813l1313
17634I834j9899J9186J29k2971j1307o872J1933k86j0443K4051K2322L7556k3330
17621B9903n9211Q350N026j9573K1667J9468J6475j2768j8976j6155L22L2393
17609F921K6469m724k5326J0020J1049j3709k5619p562M047J5704K319R33l1121
17596c0599l439o788J4971J8482o902j4518L7360o023l3975K4341K6816r844j7510
17583g628P14L5092j4028l5070m28r338J0892P712J5786K5537j1944l8526q653
$$ y = [4952, -18414, -8393, 21411, 12459, 8278, 10419, -26695, -26626, 35009, 32839, 8249, 23941, 36589, 35458, 24498, 1692, -19267, -21198, -27742, -36020, -52516, -30631, -11233, -17924, 2695, 22739, -9693, -73152, -93591, -59802, -43162, -67767, -56843, -40299, -40665, -7666, 41147, 9834, -10065, 9121, 9250, -13721, -25028, -31900, -19967, -20253, -30696, -6645, 15677, 53233, 29903, -29308, -20958, -15932, -35505, -13838, 5630, 22105, 9337, -9639, -25794, -25472, 6921, 33390, 28666, 3340, 13360, 24409, 10700, -14919, -22481, -18434, -2730, -411, 522, -30599, -34038, -40826, -25855, -7373, -14275, -28793, 8567, 2544, -31431, -7090, 19726, 9882, -7628, -6914, 28178, 14150, -20920, -21348, -30686, -19794, -12082, 3704, 29241, 17297, -21229, -29882]
17570b9882k6024P895Q764j0533K9264O909m338L3743P496j2891j7310o722K2668
17557I039O450j4713l2150O247Q647M168j458n091J1806j7843k7155O717M721
17544d0615J2030j0142J4217J8528j1007P487P558j8116k481K5514L358j1098
17532d767j4733K7228L819l7866l3740p123L2077j359k848J3121J7022j9151j6028
17519d4348J6964J9669k6394l2878k1196O709K2653M7474J8010K0265j7170j3940
17507d182j029J071p965j6069J1478k1410m07N2965K4782j0499j5893o729M221
17494A0334j1172j6756J8919J4410k3804j6111L5369m995r87j844p394j877J0548
17481D640k3951J5085J3003J0345j3548j4283L741q839j8771K87K9960j0167J9058
$$ y = [-29882, -55906, -48011, -39247, -49780, -20516, -13607, -17945, 15798, 23294, 10403, -6907, -13629, 9039, 15489, 776, -31374, -25127, -16480, -12312, -13770, -18861, -7055, -24898, -52053, -45336, -40615, -28585, -38727, -24510, -5982, -16989, -9502, -1944, -20060, -22541, 2973, 6331, -4767, -19500, 7728, 11547, -26319, -60059, -67182, -35105, -36464, -39312, -26191, -9169, -28320, -44348, -27384, -7715, -34109, -66987, -88183, -81474, -58821, -11347, 6663, 26928, 9758, -4182, -5211, -4140, -12105, -28174, -16696, -38106, -38513, 14452, 39234, 28735, 12842, 6113, 10334, -838, -17594, 1325, 15735, -8069, -24180, 11189, 6194, 5207, 3363, -4031, -5908, 4640, -19311, -4226, 8777, 19122, 5574, -8709, -4968, -13807, -32578, -32291, -2331, -12498, 6560]
17468F560J2884J71l9107J9050L1442j1088J0811J1405k6313q265N244J5631m125
17455B4300m234k2075j1524j5581J3711J7255l966K2728K4074N495l1344l1714
17443a2875o397J1134J5212J2803m93n535k5061R864K9053j5782j6307N562QK86
17429A472J1394j1206k4500j2875O666n743J8570j0515l0413J5813L0373J3838
17417B874R05J3899j2678k3252J0188J3996K260j1514L586j0606j2714J8600k1274
17404b5730k4541K415K166K3445K2574J940O488j9932j6904L841L4352j7860P661
17391h5q257M499P638O568J4785k235j8142l0811l3648L1007R000r847n132j1616
17377d6276k0816L8477K9853j0251Q272R135M1256J373k8725r393k4805k5128
$$ y = [6560, 19444, 19615, -19492, -442, 31000, 19912, 30723, 42128, 15815, 7550, 12794, 28425, 24300, 20066, -2009, -13533, -29114, -15403, 1852, -2114, 20614, 44688, 50183, 18839, -12875, -19272, -8138, 7074, 19877, 19384, 13849, -11212, -1348, 27705, 11923, -4384, 1178, 1186, 1472, 12866, 1660, -22840, -35715, -29049, -34792, -16222, -26737, -57150, -41337, -10964, 2874, 3779, 17678, 5000, -18252, -8064, 5932, 8192, -3322, 264, -10342, -23056, -4456, -25730, -50271, -47856, -45690, -22245, 329, 2269, 8757, -11175, -28079, -24238, 10114, -7746, -85, -8342, -3843, 3795, 10363, 25148, 22913, 4771, -26040, -59688, -28681, -19681, -29528, -34660, -46276, -67092, -28615, 1238, -9013, -741, 8394, 49650, 51023, 22298, 12905, -11900, -37028]
17365c7028q062r446L0616J7362j8111n979k0291l9849j1417K349J4303K2486
17353f3067P74J6135O654j3810J021K0318J2011m896L839N078J5591L8009J383
17340C9040l5760m75J3604l4909j0410k6372J1581M4296K4642j8335l6862j3336
17328d3296j0877L801L7283M1524M057J0257j5948m0244k197r231r406J7416Q982
17315g879o715p920J8966J9124J9886o604j9526J0621K597j7273l8514k609k9258
17302f5104J9178L9530L1838K3169j6532m391k1421k5364r583N9081J4560k3620
17290B1341k840R15r696J6223K3606k8722k2674Q034L0459j0279j4638J2762o102
17277A8389O04M666k9190k0658J7301j6923k4276K8972K6204K2466k611Q41r792
$$ y = [-37028, -45090, -54536, -23920, -6558, -24669, -30648, -50939, -90788, -102205, -99856, -85553, -63067, -62293, -46158, -39504, -53314, -52293, -31975, -19964, -24860, -21021, -15943, -352, 37657, 39040, 3280, 2805, 16409, -18500, -28910, -55282, -43701, 595, 25237, 6902, -29960, -43296, -54173, -50372, -13089, 28435, 32492, 42749, 26801, -13443, -15640, -24871, -34277, -16861, -7879, -14594, -22514, -3548, 15576, 35462, 28858, 9332, 19953, 22550, 5277, -33237, -35846, -65104, -45926, -6396, 25442, 48611, 32079, 27688, 6267, -19097, -28680, 30401, 44961, 21341, 18501, 19416, 9720, 25943, 49549, 20827, -1847, 6187, 36646, 26367, 11729, 24491, 18389, 18993, 23659, -5531, -26189, -8888, -25811, -50087, -21115, 5089, 27555, 24944, 25785, 15993]
17264A5993k620L146L381Q342k2670j369j837l2645p040o855J8821J5127L2367
17251B2141M412N968J2524j7861j8261o611r145Q057M04j8118l944O278J2786
17238a370M914j716k2378P823K0466J7718j5436j494j1439p842j1707j8948J8422
17225b2987K8004J7137k24K848j404l2384o874R785K0590p116m2452j2990J0705
17212c7362k296J4072Q59j078K8998K067l9094J1684J1306P269J7689K9701j6238
17199B7577p67P976L846l3778j0014O510J7915R117M496n053J3058m982j2134
17186B3767k0804J3168O369m72j1645J3042J7294k8159K431J9650J0156j0603
17174C4194k8344J4035r096K713j0985K678M3746J7512j7182j1548k0240j2728
$$ y = [15993, 13373, 16519, 19900, 28242, 5572, 4203, 2366, -30279, -37319, -44174, -25353, -10226, 22141, 26553, 32521, 45045, 27184, 8923, 2312, -6833, 1224, 1628, -16490, -20434, -14156, -1370, 3544, 1828, -20550, -12727, 7739, 25457, 10021, 8527, -2912, -10754, -22461, -41409, -22987, 5017, 22154, 21930, 24778, 23374, -9010, -15884, -6099, 14491, 7375, -35077, -48067, -37362, -39658, -25586, -24727, -25805, 3193, 5260, -33834, -22150, -10844, -3575, 14114, 43815, 27577, 26810, 34786, 38632, 4854, -5160, 1350, 19265, 28382, 32878, 27825, 40883, 35901, 23767, 2963, 16131, 22500, 22028, 10383, 23425, 40719, 12560, 14991, 34641, 44797, 34194, 5850, 19885, 10789, 13502, 2517, 5195, 48941, 66453, 49271, 37723, 17483, 4755]
17162D755k520k4145k765J3001L369J9491L536j4289j511k668n857j2321K6649
17149D725J6949k8046k2224r217l120J2518K7509J7013Q095l5216j7106J9893
17137h227k4121m80J7169J7759L5784K4312p959k8888k9387l050M0949J3748k2122
17124B5487k7541j1456J4940J6266k4683j5649l926k0775k6836K5425J8316j6037
17112d6469j8832K4871M0556O195q638k3248J009k62J577J741Q446P052L9j3058
17098a9021Q204k3214k6653L4270M5908J5925p780k8599k1672j865j148O874l22
17085a9093K228J6215L627k9663Q156j050l384r794n071j626j6014K619J2859
17072c9991m704k669j1141J7152M178l766l336K1709J6133J5292L324q868k0980
$$ y = [4755, 2235, -21910, -24675, -11674, -8305, 11186, 14722, 433, -1078, -3746, -9603, -21924, 4725, 21674, -6372, -28596, -37813, -40933, -28415, -906, 16107, 24202, -11014, -28120, -8227, -32348, -32828, -15659, 2100, 37884, 62196, 54237, 25349, -4038, -7088, 33861, 47609, 25487, -2054, -13510, 1430, 17696, -6987, -22636, -26562, -47337, -74173, -48748, -30432, -46469, -65301, -40430, 126, 6321, -2317, -25565, -24556, -24818, -23241, -21500, -13054, -6002, -5963, -19021, -10817, -34031, -60684, -26414, 19494, 35419, 27639, -960, -22632, -24497, -25645, -18771, -19093, -16865, -650, 2977, -26686, -18530, -19580, -22964, -32758, -37829, -39455, -55469, -52850, -39991, -44695, -47364, -58505, -41353, -37175, -40941, -44277, -22568, -6435, 8857, 12181, 3313, -17667]
17059a7667q77K4833r662k2057P92J2840J6385K5064K3778j7028j0996q395m216
17046A2794Q0J0036P875l872J1981L17N419o403q70k4526J3654K6924j1169k2054
17032B0186k6338k4369j0356K0539K7971K1148J2902l6114j9497J808Q754j0227
17020a3593K0059J0318j3457k3906j8778p704R825n015J8888M0452M540k8570
17008f941k7260q384R70q837N467N4879O9001J6648l0140o35l5182k8799m151
16995c364R297l569J7636L419r572k8328l55l088o148K6981J1489k9689p065L825
16981a8531K2321K0879p290m485q104J8898j5035k8949m709j1551J8482L589j0047
16968b4532L3648J7522J576J596j7178j0163j5344R121K4525j2004k6231o768
$$ y = [-17667, -18544, 6289, -3373, -25430, -24638, -11798, 4587, 29651, 53429, 36401, 25405, 17010, 12794, 12874, 22910, 30785, 26913, 38894, 39211, 44630, 38227, 37357, 12831, 26485, 53409, 42240, 20186, -6152, -30521, -40877, -20338, 7633, 28781, 41683, 5569, -13928, -12120, -3366, -13593, 6466, 16784, 3327, -20579, -39357, -47061, -37236, -42251, -23363, 17089, 21629, -6941, -34201, -42585, -41615, -50452, -44985, 9894, 78895, 95543, 65403, 64768, 29586, 787, -3364, 5933, 2364, 20000, 23419, 13847, -14481, -14836, -17924, -24072, 2909, 14398, -15291, -22356, -18531, 3790, 24669, 17379, 12894, 4790, 23688, 8653, -20296, -25005, -36556, -18074, -14485, -24532, 9116, 26638, 28214, 29810, 12632, 2469, -12875, -3754, 20771, 8767, -17464, -24232]
16956b4232q278K5440o66N969k926k5885K692J7922k8887r182K3197O197L321
16943a5318P947J0153J4128j6351k2459j0787L0012K3908j7585L389m15J199l1305
16930b3484J93K8503l231l2437j452L6428j9579o319j8631J9004j5332n454J8161
16917b3630M0934M604k5022k5167k5916l4726O972J9213N0388K2657j5978P56
16905d915J4232r130O77o247k535J1329J6831k0654m001L1821J6271J0657P427
16892F1763m2200m384m255m425k6635q112k278J8073j267k0196O762K3247j8437
16879b2344J8691K616j2842j9211Q740J836J3570K9061J7732j1250P317r558q146
16866A6212l093l4197k3R956J2803l4124m1554L2242N3349J9889J0750l8489k5732
$$ y = [-24232, -32510, -7070, -7736, -1767, -4693, -30578, -27886, -9964, -38851, -48033, -24836, -18639, -15318, -7371, 2782, 16910, 559, -21900, -32687, -2675, 21233, 3648, 7037, 6622, 7821, -23484, -23291, 5212, 1981, -30456, -31908, 4520, -15059, -21378, -40009, -21005, -36337, -41791, -23630, 17304, 21908, -3114, -28281, -54197, -88923, -81951, -62738, -12350, 10307, -5671, -4915, 9317, 187, 864, -5383, -7918, 3411, 20242, -412, -4413, 27408, 43679, 54336, 61763, 19563, 15179, 10924, 6499, -20136, -28248, -30526, -12453, -13720, -33916, -27154, -3907, -22344, -3653, -1037, -13879, -33090, -24350, -22514, -8944, 20117, 37849, 26599, 33916, 24358, 16212, 13119, -21078, -21101, -11145, 1658, -32466, -74020, -41778, 11571, 31460, 42210, 3721, -22011]
16853b2011J4998l468Q121L866j0177J377J7419j6212j0774J4588N506j1063q875
16840a6705K0089j534k7693k1871k171J1765J1924j9745k5423m372J74K0196K2934
16827c2432j5371J3023R358q111M884L6680k66m615L0905R158j9856l5623j9774
16814c2040j5313K4636J3235J2374r294k3732k965K8820M8218k130j3462R302
16802C7649k6406l0896j9999l8933o286K5171N0209J2202q995k7567j1862N3710
16790G997K038M317J5944k6705J6222Q0m7561N744L436J1701J1868k5471k4894
16777d5284J6857L206p294J4158K1256P409n07k718l1842l0002J116J8168J0570
16764b4907J2371j0345K7286K0957J958k5225j9356l52l167k7357M240K1672R272
$$ y = [-22011, -7013, -10481, -2360, 1506, -8671, -7294, 10125, -6087, -16861, -2273, 3233, -7830, -16705, 3384, 1850, -25843, -47714, -49885, -38120, -26196, -45941, -71364, -75736, -75562, -55366, -32432, -47803, -34780, -25422, -33533, -28649, 8031, 7765, 3150, 34055, 43213, 23357, -12266, -32040, -47353, -22717, -9482, 2892, -6402, -30134, -33099, -4279, 43939, 41809, 28347, 37649, 11243, -19653, -39652, -78585, -84871, -59700, -9491, 2711, -6284, -33851, -45713, 7997, 10035, 14352, 30296, 3591, 19813, 19893, -27668, -21924, -18488, -6787, 5081, -20390, -45284, -28427, -25221, -32515, -18357, 2899, 10308, 9801, 7083, -24759, -54761, -53645, -35477, -24907, -12536, -22881, 4405, 25362, 27320, 2095, -17261, -17613, -20780, -48137, -43897, -22225, -12953]
16751a2953r187N463r25J0931k730L566J3064l906K720M905k646J1658L705j9919
16737C746n150l642r462k945n79L2627q546m2238q963L188J1648j3330K29J9254
16723b4163j9756r265P778o407r446n51M261J6438J8420L140j0196j5700j0743
16710e6190J751J2735M1427L5797m269l1256J6853K1090k9902j7761j6971j370
16698b8066k5877m1336J7598N2653L2136K06O804k3087j3167j8063L7261N706
16686B768j1738O511M499k24j7014L1757J3163J0521L734k211n437k3409j460
16673A1460J0334j1669k4374j6275j0982P430K683L123k6541o982J0259K6728
16661b4806L4955K9510p257l8778k6562K504J6210k9273n172J7279J4788K7328
$$ y = [-12953, -22140, -16677, -17602, -6671, -9401, -5835, 7229, 3323, 6043, 10948, 8302, 19960, 23665, 3746, -1404, -5046, -14508, -17453, -18032, 14595, 6049, -36189, -45152, -41964, -30316, -43646, -43417, -24163, -43919, -53184, -45406, -51813, -61259, -61810, -57549, -41111, -22691, -19551, -29747, -45447, -56190, -54439, -41704, -277, 35520, 31251, -5, 16848, 37938, 8036, -9725, -26696, -28066, -53943, -95279, -77681, -25028, 7108, 7314, 14118, -8969, -22136, -40199, -2938, 2768, -8970, -2459, 2040, 1816, -15198, 16559, 29722, 40243, 43977, 41766, 36329, 12920, 11460, 21794, 10125, -14249, -30524, -41506, -34076, -31393, -28270, -54811, -61793, -51534, -24806, 10149, 39659, 32402, -6376, -32938, -30434, -14224, -43497, -48669, -31390, -16602, 10726]
16649A0726P522j7055J4016n630j0775J368k2978K2225J1929Q895J5328r788J0964
16636C6747L869j6239l1885j8606M581m896J3079M0210n212j2617j0109K3767
16624B2689O815L1822j4147k0949k8584k1481K6696K6630N703j6462j9810l684
16612d762L0181j19q966q208K901k1044j260j4379J7446J878N586o725p394j1757
16598b6622j5356L5425O2865L676l1534j4419p251r792O630k690p247j5705K909
16585a9111N350O036K0959j042N666R100n968k2872j5738M407j2732J1352L347
16572a1246k5560K2671J7741o279J9372j1100k7436j0843N567j2486J0416l833
16560c3016k068J3992p189k166J1265L3508O606K639j8906M917J0360j0715j1207
$$ y = [10726, 18248, 1193, 15209, 9579, -1196, 172, -22806, -581, 11348, 20243, 35571, 25783, 36747, 40616, 24377, -7508, -26114, -21533, -26429, -13350, 26860, 21648, 9031, -1078, 22689, 29504, 61326, 47179, 26230, -2354, -23835, 2861, 29491, 35194, 18732, -1078, -4762, 25419, 25300, 16334, 8126, 11027, -10017, -11277, -25656, -8210, -6332, -746, -7471, -14865, -26622, -41978, -6553, 56312, 59988, 28454, 14035, 6784, -3008, 3622, 932, -6315, -22020, -19111, -13761, -7725, 13234, 12192, 17858, 26958, 20990, -1882, -17620, -13213, -25945, -14593, -11246, -36806, -14135, 3606, -2673, 16699, 5599, -21837, -32680, -27113, -39599, -29183, -33016, -35084, -21092, -28281, -30447, -19182, 14326, 20932, 23571, 4665, 9582, 19942, 9227, -1980]
16547a980j6821j2515J0189j170M377q022r474p256J9637K7487J5783k0509n758
16534f032k344n141J8078J3501J2154k2610k8185q204r827p380J197J1700o798
16521c9891R066L0859Q542K2224M586J4918J618m2513P403P576k375P967j1577
16508A8403j6500k2306k7809Q575n382K4360K1936O794j9470j09r343k6720J1615
16495c5956L674J8578J3675o831o978J09J6341k884R342J6141n304j1909j6213
16482h215j088l7j6421J8529J4664J1999r575P711K5054J474l3364k335K4834
16469C3230k5342k5673J7636R262K9028o5k278R799k4380k8091J507k2669J9487
16456h549o58l074k4524P292m511L6717K2431m174j8202N986J0120j6648m052
$$ y = [-1980, -18801, -31316, -21127, -22297, -17920, -25942, -35416, -42672, -23035, 4452, 20235, -274, -6032, -8376, -13517, 4561, 18062, 30216, 7606, -20579, -28783, -38610, -45990, -44793, -33093, -39891, -30825, 34, 8576, 30800, 35386, 50304, 51922, 9409, 16812, 24388, 22013, 29980, 18403, 1903, -20403, -48212, -39637, -45019, -20659, 1277, 8071, -11399, -11508, -20851, -47571, -35956, -32282, -13704, -29, -6860, -13838, -13729, 2612, -272, 9070, 25211, 19907, 7998, -8215, -9303, -9340, -25761, -7232, 7432, 19431, 9856, 17567, 42621, 44095, 10731, 8396, 33230, 7888, -17785, -149, 9113, 38141, 38076, 35798, 45597, 21217, -6874, -5367, -28036, -8549, -9207, -12281, -36805, -29513, -34024, 2693, 25124, 20950, 2748, 8734, 18854, 2206, -1846]
16443a846R073l034L14Pj4771j137K1241K3760M07k7682p132p663P92o033j536
16428a5240N315J8980k4612m759K488p363O406l459J5044Q786J4659k3184q250
16415a5189J4664J7009l3187P668J0055J7744J2j206k6568M850j4747j7985j0868
16402d7748L4249L191j258J6109K4140J1730K755N572j3001k5143j7546K952K1716
16389A7718L382J9180k8845j6036J0299J5563J7419j3767k2214j547k3961p885
16377c0694J2971j3354J5270n705j3142K4404J0825j2557m0517N985L8150M748
16365c616j610l382k1321j0910J2335K063K875J7255q50k2785L586Q819J4171
16352c370K541r989K9950l383l5745l7254j2307q144K3882L7765J8505j0904m879
$$ y = [-1846, 7227, 4193, 4507, 4514, -10257, -11394, 9847, 33607, 34014, 6332, -800, -8463, -7671, -13704, -15240, -9925, 9055, -15557, -20316, -17828, -25191, -18785, -22244, -7200, 1586, 16245, -6939, -15189, -525, 16484, -16703, -9035, 1020, 18764, 18776, 17570, -8998, -4148, -18895, -36880, -47748, -13499, -10308, -11566, 4543, 28683, 40413, 43168, 48740, 35739, 10596, -6950, -3998, 17718, 21100, 40280, 11435, -4601, 5698, 21261, 38680, 24913, 2699, 1152, -22809, -30694, -17723, -31077, -15807, -21512, -34654, -10250, 575, -11982, -52499, -46514, -8364, -3616, -5226, -8608, -29929, -40839, -28504, -26441, -23566, -6311, -7161, -29946, -26360, -17541, -3370, -829, -10818, 19132, 15749, -19996, -57250, -69557, -77701, -53819, -16054, 2451, -8453, -13332]
16339a3332N0515r456o434q829o330j5861p779R055j9915l582q286m532J1852
16326c2914J2745k797k803j7558J8366J2442P069l6539Q017k151l8047J7030L0767
16313b6373p31k682J8197L9138k8937l98P982L3244r092l5349J762K9369J3199
16300C9329j5447K129K9434l423l604l2528J161J2862p590k605J2485k191P946
16287C7958K2870N591k5011k9930q328m154l54q310q374J5551r048k9686j0641
16274e1866M070j9068n643Q341L0175R137k0574L136K9560M862o850J4458K3787
16261B3525K3048r757m1749k5559J8055J7557K574n600L141K3131L6128J5568
16249H0062j9400k1228l353l9784j9425J1151L0557L064k0112l4283j7341J7452
$$ y = [-13332, 37183, 27727, 21293, 12464, 6134, -9727, -17506, -8451, -28366, -31948, -40234, -44766, -32914, -20169, -22966, -25769, -43327, -24961, -12519, -5450, -41989, -33972, -36123, -74170, -57140, -26373, -27104, -29786, -11589, 27549, -1388, -1786, 6196, 39440, 30348, -5001, -3239, 26130, 39329, 23882, 26011, 55445, 52022, 48418, 15890, 17051, 29913, 22323, 19718, 32203, 30012, 37958, 60828, 66419, 41408, 11478, 3150, -1004, -1358, -9668, -18042, -2491, -11539, -41225, -51866, -47796, -66864, -72507, -64166, -33991, -24854, -45428, -42292, -12732, -7870, -14720, -262, 23525, 46573, 36816, -4933, -30492, -12437, 5120, 7694, 2094, 5235, 28366, 64494, 80062, 60662, 39434, 36081, -3703, -23128, -11977, 18580, 21644, 1532, -32751, -50092, -32640]
16237c2640L0843P734k9131l5176p319L2996K2749j2691l5897J3700L3596J3652
16225B416N498l0133j1066J191P429l532P412L8682M220j2480J8025p450l0911
16212a0699k7080k5603J6837K0650K2707N108j1803j6082J8236J3834J214m0367
16200c3048o229L8951L2363o921l1073J4434Q173k4632j8228J4613j6879J7402
16188a1074L1450K310j6487j4780j6230m080J5587J4187j0426j3512l8932k229
16176f4216K3840L8008J0013o993N980l080J7328j0308n0737j4646K0209j7365
16164e1967J5223L096P968n47j4211J443K1494P209j6069l1266P696L6955l601
16151a6577j5277j1887Q585J3090p17R196J579k0564l5086K6763M9495j3020L722
$$ y = [-32640, -1797, 5937, -23194, -58370, -65689, -32693, -9944, -22635, -58532, -44832, -11236, 2416, 7914, -22219, -33285, -32094, -24665, -28197, -20785, 17897, 22117, 9637, 27662, 20212, -10699, -37779, -63382, -46545, -25895, -3188, 1920, -9883, -25965, -7729, 6105, 7319, -33048, -39277, -326, 32037, 25116, -5957, 8477, 16650, -7982, -26210, -11597, -28476, -11074, 20376, 22686, 6199, -8581, -24811, -28891, -13304, 883, -9543, -23055, -61987, -64216, -40376, -2368, 7645, 652, 6632, 3552, 20880, 10572, -40165, -54811, -34602, -51967, -36744, -33648, -25680, -26227, -40438, -38995, -17501, -10292, -26361, -57627, -49931, -12976, -16577, -31854, -43741, -35156, -22066, -22783, -13587, -12008, -32572, -67658, -40895, 8600, -4420, -698]
16138f98k616K3843j1563N353l876J4127j0217K984J0586J0607N044k4545q697
16125A0332j6429j1405K0066J7952j5337k539m815j5651j746P351j2P367j4771
16112a9637K748L3063k1975j9214P482R951j1419L152M950J2023K1038k3384l241
16099d463q147r522j1072k1723J4805N764P710O925R653n814m1414j0685J373
16086f6610l155M2883J5226l153R428r584L721l370Q376Q395R021l078k1856o15
16072a4371L1623R628k097J5184o012l0137o377R425N993k4986K4981j3630o5308
16059f6084J1461L1829k1520J1022Q350o600J4899n557q627J9386J6418J2834
16047A7811K244J4952q48k2466L1931K0031k6853j947j4035k5728J1353L1634
$$ y = [-698, -3314, 20529, 8966, 14319, 10443, 24570, 14353, 17337, 27923, 38530, 43574, 19029, 10332, -6097, -17502, 2564, 20516, 5179, 2640, -2175, -17826, -19572, -12221, -12233, -4866, -19637, -16889, 16174, -5801, -25015, -17533, -7582, -19001, -15849, -10899, 1124, 22162, -1222, -4463, -12610, -22132, -33204, -54927, -40122, -34358, -26648, -19723, -10070, -15884, -57298, -67983, -66610, -69765, -26882, -11656, -14809, -5381, -14965, -11244, -14614, -6238, 2157, 11178, 8100, -13756, -14371, 17252, 26880, 24783, 39967, 33955, 3818, -2559, 6866, 12859, -12127, 12854, -776, -66084, -54623, -22794, -44314, -33292, -24942, -31542, -16643, -22200, -30827, -11441, 4977, 17811, 20055, 35007, 34159, 11693, 43624, 63655, 36802, 34855, 20820, -4908, 6445, 38079]
16035C8079K3303m710j6397k5664n629n462N306q407r038j819n591R867J7050
16022A0888j2587N247K2294J4499j2663j6516j717j6063J5710n925N46M558m4607
16009c6336j3303J2274K3615R142m899p616K4990L2200K1063j7990n0207m0110
15997d7177K368N905L4579M525l8375P207o408j3333K1380j591k4103J9595M1167
15984E739J8563J2500M429j1589k1578k3672l601J0683L331j1004k1950L730J7019
15971a7400J3442k3476J2394j5092J0116K419K4760j245j4806j4138K236j9610
15959d0400Q018J3624n574J793J3135N370J9632o976P674J3039q070o753p742
15946F770k3426J8030J4733J1203M445r080L1918k616j3494l6339j6690n933r106
$$ y = [38079, 61382, 56672, 40275, 14611, 8982, 3520, 8826, 419, -8619, -10438, -16029, -6162, 10888, -1699, 3548, 25842, 40341, 27678, 11162, 9445, -6618, 9092, 3167, 3713, 8271, -36336, -49639, -37365, -13750, -4608, -9507, -17123, 7867, 40067, 61130, 43140, -7067, -47177, -44809, -38904, -4325, 200, -38175, -30968, -37376, -50709, -29329, -30920, -55023, -35428, 5739, 24302, 36802, 41231, 29642, 8064, -15608, -19209, -8526, -5195, -16199, -38149, -34419, -17400, -3958, -27434, -15040, -30132, -20016, -17597, 7163, 5918, -8888, -23026, -20790, -40400, -32382, -18758, -24332, -22539, -9404, -4034, 15598, 8622, 16296, 29335, 21265, 14512, 6770, -16656, 1374, 16107, 27310, 31755, 22675, 54593, 51977, 38483, 2144, -14546, -20479, -29585]
15933b9585q107j2231l589J1590K2637O16o131L340J2441L1423j3410j64P94r099
15919E25K8870j9503j9082p947k2681L999n563j933J7082N060J4095p265m015
15906a8358K949J0180K7669r396p747J0690j2685K2849j7547J3588j9331k3281
15894b0420r449r891k6489K4628K8328r367R427K035m764J155q968J1362K4433
15881A2020K3884P765l6996k4959j6096L3913K3762K0925J0539j1561j7613q241
15869A7342J4818j011m0039k2467k0883m974J4015K9580K4601J5796R919P677
15857D4374j17m3008m8453q34j0806j03J9144J439n539K4533N791K6623J9001
15844C2045J3714L584j0308J0445M281O183j4323J494j4159k5096R985Q944M559
$$ y = [-29585, -37692, -49923, -53512, -41922, -19285, -18669, -24800, -21460, -9019, 22404, 8994, 8830, 9624, 525, 29395, 9892, -9190, -17137, -39818, -35819, -41382, -43315, -26233, -21173, -7078, -14343, -18358, -15409, -5229, 22440, 13044, 5297, 15987, 3302, 26151, 8604, 22192, 2861, -20420, -29869, -39760, -66249, -41621, -13293, -22660, -13233, -11198, -15962, -14807, -23775, -12413, 12020, 35904, 43669, 6673, -18286, -34382, -469, 23293, 44218, 54757, 43196, 25583, 17342, 32160, 31149, -8890, -31357, -52240, -57214, -43199, -13619, 10982, 26778, 36697, 44374, 44257, 1249, -47204, -48038, -58844, -58947, -39803, -38364, -43903, -19370, -13579, 13044, 32045, 45759, 49343, 39035, 49480, 53761, 59944, 45621, 47115, 32956, 7860, 17845, 26789, 31348]
15831C1348m1672k1879J3180K3294J1114k8508j2686p003r352R858J9397Q74m4956
15818e6991j2166K9952L5937Q285k0489m857l468J0073r294J4135k122q707p668
15805b7380M394j9962j2429j3654J9094J2403k9770K988L0018N853J440j7176
15793d4181k935J6207j5366k605J1005K5665L6989j3641K815p090K22j2603m8805
15780e4323j2465K7982J9916p473N125n131K2605K4209j3072L339q53j2195j8874
15767b1210k603l333Q086R458M687O694Q157M325J1962j1471j6845j4631j5360
15754c2084R625R944K4849k4413J1669M05K2466L9023m06l235k9073m6657j3047
15741c0934N86R093j4069L586K7223K7627J2462k3700j4766n156k1716M96m233
$$ y = [31348, -10324, -32203, -19023, 4271, 15385, -13123, -25809, -32812, -42164, -32306, -12909, -12035, -56991, -69157, -39205, -3268, 5017, -15472, -20329, -23797, -13724, -23018, -8883, -11005, -19712, -27380, -22986, -42948, -55377, -69031, -49937, -37534, -67304, -64316, -34298, -28445, -27005, -44181, -47116, -30909, -46275, -48880, -37875, -12210, 24779, 11138, 13953, 6863, 7085, -5518, -54323, -66788, -38806, -18890, -26363, -21238, -26369, -3764, 20445, 7373, 10712, 9859, -2336, -21210, -23813, -27146, -19060, -9602, -4915, 1779, 9936, 14261, 26223, 14752, -2093, -16724, -32084, -22459, -12515, 12334, -12079, -410, -5, 22461, 61484, 61078, 57843, 28770, -17887, -30934, -30348, -21255, -35324, -31738, -4515, 23112, 35574, 11874, -2892, -8048, -29764, -29268, -33501]
15728c3501j787l5623J0500J2473l08j8455j81K2929J2637j733j3539k1319M9499
15715a8408J4110j6283J1623O07J8475K5352k738k402P428l0637k9408m312M080
15702b2513J4654k819j6334r240O859l367J5493J3105Q30k0918K703J9691J5495
15689A3639j5898J3010l0843k536K5121J2290K176j434k830j1513J7929J0843
15677B9954O693Q476K1668k770j8029j2111j6351J4858N046k6755J6952J4507
15665D2138K2607J2544J5304P14m7101k6453N995J7445j6673m94j3980q202q720
15652d876n570J2735l2415j1933N544K1364J245N376j2918n285O097j2153L99
15639c2390L429L105J4080O134j2269Q911L004P29m2519j1826J3680R345p304
$$ y = [-33501, -35288, -70911, -60411, -47938, -48246, -66701, -66882, -43953, -31316, -33049, -46588, -67907, -18408, -4298, -20581, -8958, -8351, 10124, 35476, 32738, 30336, 37764, 7127, -22281, -26593, -22513, -7859, -10678, -27012, -36252, -29393, -32760, -17267, -4162, -3332, -24250, -21547, -1856, 13639, -2259, 10751, -20092, -22628, 2493, 14783, 16959, 15525, 12695, 1182, 19111, 29954, 36647, 45123, 66791, 64021, 45992, 33881, 17530, 32388, 37434, 10679, 27631, 42138, 64745, 77289, 92593, 93307, 46206, 19753, 25748, 43193, 26520, 26026, 12046, 3844, -4876, -10446, 2289, -30126, -42059, -36515, -15151, -13906, -8530, -21448, -26733, -20636, -32789, -32390, -28961, -25856, -11776, -5642, -17911, -9000, -5996, -5267, -47786, -59612, -45932, -36587, -43891]
15626d3891k4772J9502J481R557J7774q158j6361j6947j6995K6134K2950q312
15614c8038k93L971O082n115j0117L3094J6087J5800J0216K6257O292j7042m7721
15601e27r778K1705K6704N590J0222k3891P67J6410j1502r579o105p632j4074
15588a690m0276J6290Q618J3155l330P253m4069k1197N929Q657J9351K7014R33
15575c362Q785J9389M130L033j3521k8289j1052Q514k340j4754j9368l809N049
15562d7595K6358K3010K5269R95K868m426n729J5296J2481j2869n038j2438l1772
15549a3590k0709K7836K326J1745K692j8265O832K092l7383l3965J5765J8545
15537c6079J3160l03K4105J4342J605j0166J6035K3062n251j8600q468q673k8052
$$ y = [-43891, -68663, -49161, -47680, -38123, -20349, -28507, -44868, -61815, -78810, -52676, -29726, -38038, -38331, -34360, -28278, -33393, -43510, -10416, 5671, 21471, 31687, 57944, 64236, 47194, -527, -10305, 11400, 38104, 43694, 53916, 30025, 30792, 47202, 35700, 26121, 20016, 12384, -1690, -41966, -25676, -17058, -3903, -7233, 20, -44049, -65246, -59317, -50660, -31309, -4295, -3362, 5423, 24812, 28942, 31975, 18454, -9835, -20887, -12373, -14713, -29467, -48835, -52644, -47595, -21237, 1773, 27042, 28037, 30905, 26479, 20750, 36046, 48527, 35658, 30620, 18182, -13590, -34299, -6463, -4137, 7608, 10300, -7965, -1133, 959, -36424, -70389, -54624, -36079, -22919, -23222, 883, 15225, 16830, 6664, 22699, 45761, 40510, 21910, 13442, 4769, -23283]
15524b3283j898P336P246Q461j4496l1334j7811L6467L6837P090j3032j1717j8970
15511b9104j6179N428J5322j3907P426K4060K4552o50P118l648k6525j1118Q477
15498h748l917J1142K7809l2095m0465K7182P284K1313J7396j7514j683L167j0099
15485G72o1883j3354J2908L2152L1324K0748Q791L4018l720q057j5565L818r845
15472C2107j6673m1487n808K6906L3658k1441j2688l437n961k4057m6795j6745
15460a02421K9565M8036J1990J9780J5926k7184r656j9800P517j3128k2467k2281
15448h4123J6057J5215L4606M204K2183J6193j2504j8294j8189l97j1679J1872
15436b4856J2397p412K383M0746L701k8460k6492J132L7230L6767K2924L429k8091
$$ y = [-23283, -25181, -17845, -10599, -2138, -16634, -47968, -65779, -29312, 7525, 14615, 1583, -10134, -29104, -45283, -39855, -24533, -38440, -31014, -6954, 17598, 16948, 24066, 20418, -6107, -17225, -8748, -12665, -1523, 26286, -5809, -46274, -19092, -11808, 9505, 26901, 9387, 7704, 10871, 772, -61111, -74465, -61557, -29405, 1919, 22667, 31458, 65476, 61756, 53699, 38134, 41952, 32107, 15434, -26053, -31861, -4955, 28703, 7262, -5426, -8863, -14824, -38881, -85676, -102421, -72856, -24820, -12830, 6950, 22876, -4308, -13964, -33764, -26247, -39375, -61842, -84123, -68066, -52851, -18245, -14041, 8142, 24335, 11831, -6463, -24652, -25049, -36728, -24856, -12459, -19871, -17488, 23258, 26959, -1501, -27993, -26861, 10369, 47136, 70060, 73489, 45398]
15423D5398m2398q195j3180P189Q390o522P80O005K3469P599n016L053l9195l3842
15409d6465r176J3668J0638O459P526j8981l44j0114J0186r006o816J2583J1596
15396b8246J6114o46o28J8639L0602k2213k5577J7324k3267k571K2125N7384J2616
15383G1656q04l9768k4773p187J104l9O045J1746j5739k4702K4015l224J6159
15370A4489K2666J081K319k6533M901n965p626m56k7772J7215M0298O842r125
15357C2334j0154j5679o933L5221P574k1601l7479J7215K7549Q479J9251K844
15345E8621j0220n839K2262l5416m3575q772J8249J9848P568p424j9427n532J941
15332g716J9857J9922k5905n1602m878n299K0051J8592j6357j8933p84R117p289
$$ y = [45398, 3000, -5195, -18375, -11186, -2796, -9318, -8538, -2533, 20936, 28535, 23519, 26572, -12623, -46465, -55641, -41973, -31335, -24876, -17350, -36331, -36675, -46789, -36603, -45609, -52425, -39842, -28246, -12132, -12778, -13406, 5233, 35835, 13622, -11955, 5369, -17898, -20469, 1656, 59040, 71656, 70852, 31084, 6311, -876, 228, 189, 6234, 17980, 2241, -22461, 1554, -1670, 14489, 37155, 38236, 40555, 14022, 18923, 12958, 5332, 4876, -22896, -5681, 34617, 41459, 32334, 22180, 6501, -432, 34789, 42363, 20762, -16717, 498, 28047, 36526, 55777, 58621, 48401, 42562, 64824, 29408, -14167, -22939, -4690, 15158, 22726, 15302, -4125, -9657, -7716, 12141, 32063, 6158, -45444, -50322, -55621, -35570, -16978, -33335, -52268, -53052, -43935, -51224]
15319e1224L1767L6709O641p775l0342j057J5657j2300J8410J597O264O692j2148
15306H891m1433J795m752J0708j4727J2743K442J5458M9817j126j3161q827l4459
15293a6631j6328Q473J5925K140J6940j865m5729k5117J3306J2454J4677j402
15281b3157p302R051J4698k070j8075K3282Q732J0767N875m798p100P926J0887
15268B8716l4051j2467K0213P765J9675J2460O534k4816R2p676k4209j592J4165
15255D809J0503j8140l33K0648N504M854p892j4500j2812j1299p28j784K3754
15242B584O665r223r710q953o544L3594M820k244m0413j2574L5285K282q821n213
15228a8465k05K0122J1671k1896j5587M2663J8653j3102l3836l0877p027L0228
$$ y = [-51224, -19457, 17252, 23893, 16118, -14224, -15281, 376, -11924, 6486, 8083, 14347, 21039, 8891, -32542, -30747, -35499, -24791, -39518, -26775, -24333, -8875, 40942, 39816, 26655, 17828, -16631, -32959, -24486, -8561, -6421, 10519, 8654, -37075, -62192, -48886, -36432, -21755, -23157, -30459, -21408, -6710, -8780, -26855, -3573, 5159, 15926, 21801, 17003, 9903, 17829, 28716, -5335, -17802, 2411, 10176, 29851, 42311, 48845, 24029, 24121, 16445, -7764, -9356, 4809, 15312, -2828, -3161, 17487, 22991, 27845, 19953, 5453, -7359, -18658, -19386, -21170, 2584, 9249, 26, -9684, -18637, -25181, 8413, 13233, 10989, -29424, -41998, -6713, -4431, -13252, -18465, -18670, 1452, 13123, -8773, -24360, 18303, 36956, 23854, -9982, -40859, -47886, -17658]
15216a7658L6023J8932l4049O006J0103j3024K2107J5110k3014q81M835j3652
15204A0838o528J4469j0247j953r862%l0702K8937M0751k710k0189j4931l2182
15191c4309K322j872k527N230J456J404J5555j2742l8117Q386K3192J2146r142
15178b9018N4943P000o204j2731j8011q537l3185J4021K4686M233L065j317k5977
15165b7032j1043r305O675J7250L351j9872k9976J8974N5982K9364k006r715j9322
15152C325m741n771j8690j6743r713l077P317O5938j2796l1523J2817M0679R377
15139C6399j1955k2395j8564j2779n677K8295J3725l6951M168L0764l7K2140j8069
15126I064n314J4037R709j0820m227m516p207L279j340l929o180q379K4136N6495
$$ y = [-17658, 18365, 37297, 3248, 9254, 19357, 6333, 28440, 43550, 20536, 19655, 24490, 10838, 4310, 18779, 8532, 6579, -3283, -3283, -33985, -5048, 35703, 32993, 12804, -2127, -34309, -31987, -33859, -36386, -31156, -29700, -28296, -12741, -25483, -63600, -55214, -32022, -19876, -29018, 25925, 32925, 26721, 13990, -4021, -12558, -45743, -31722, -7036, -2803, 262, -1055, -27032, -38075, -47380, -40705, -23455, -20104, -39976, -69952, -50978, 5004, 34368, 32362, 22647, 3325, -1416, -7187, -25877, -42620, -52333, -55410, -48093, 17845, 5049, -26474, -13657, 27022, 36399, 24444, 2049, -16515, -29294, -34971, -6676, 7049, -29902, -25734, 5030, 4993, 27133, 9064, 3750, 17787, 27496, 16676, 12449, 7933, 726, 4005, 2665, -1264, -7444, -15823, 8313, 64808]
15112F4808K353j0369k6750L16k8312l194L065L300p046j8444Q49K7535J7730
15099B5841l4074J6565L7076o697k527J2448k085j8865m0846j5345j4888k600
15087d5997R999M7847R595j9375r81J7855k488j4992J5577R422J2024M594m1467
15074A613o473K3566J809K1454N17j9277k872K0526j3631j7510k5972o559m419
15061b7228l606L4468J9492q132J2814r17K9860l403l5429k1872M239K1129j327
15048B0088O112K1970r687N449R992m914j994J3722J6649r617m916j8580l7758
15035F516o269L3760J5079J2046j9477k6478L803k849J982L644J418M885j1588
15022A6472l0097K781N565L2567o95L248O831M711j634j3898j402N865J5510n8267
$$ y = [64808, 67161, 56792, 30042, 30358, 2046, -1148, 1917, 5217, -1829, -20273, -19424, 8111, 25841, -8233, 8332, 45408, 38711, 36184, 48632, 46547, 27682, -13164, -28509, -43397, -45997, -35998, 11849, 21444, 2069, 1088, 18943, 16455, 1463, 17040, 26462, 38486, 43080, 1613, -4860, 18706, 20515, 41969, 42486, 23209, 20337, 40863, 27232, 9722, -16250, -22809, -27228, -30834, 3634, 23126, 14994, 27808, 26891, 56751, 53348, 17919, -3953, 286, 21415, 20088, 26200, 48170, 38483, 43932, 53924, 49010, 47016, 60738, 77387, 67770, 62854, 44274, 6516, 247, 34007, 49086, 61132, 41655, 15177, 18980, 16131, 18113, 21757, 23175, 28060, 16472, -13625, -10844, -5279, 27288, 26593, 29841, 36672, 41383, 39749, 25851, 24449, 30314, 45824, -12443]
15008a2443j1628K8500j6366j8947J8089J0259n321J1632j5877J9159J4043j4305
14996F795l0625K6658J1734J9095o952n5552j959J6172J5569r647j3859j2244
14984c4815p242N729J8276K5129K8765j9523L157q498K3251j7470k4602j7332
14972b5175k0210O110J6824J4924J2243k2451j3128k635M335j294l56J5023K0385
14959D595M640O680L633j6234p718R396K455l921k2448J157K8337J800L305Q29
14945A6506r301K2391J6233L198q552j5515N278P959m2273j3189K3731Q652j4795
14932C23j0864m973o938R813K7059K1930q746j3845J9244k36l4698j1974L802
14919a0103L0327M797m402K640k5769p031K0786J5816j311k7581m0761r654L0965
$$ y = [-12443, -24071, 4429, -11937, -30884, -12795, -2536, -7857, 3775, -12102, 7057, 21100, 6795, -23830, 2828, 14562, 33657, 26705, -28847, -30806, -14634, 935, -8712, -22571, -34815, -42057, -36328, -18052, 7077, 35842, 16319, 19476, 10978, 34229, 16759, -7843, -25175, -45385, -39275, -22451, -7527, 4716, -17735, -30863, -33498, -29163, -30457, -30813, -15790, 4595, 9235, 15915, 19548, 3314, -4404, 4992, 7447, 3526, -18922, -17765, 10572, 12372, 15677, 16506, 7205, 29596, 45829, 49027, 40475, 24960, 30238, 38197, -4076, -17265, 6466, 15118, 323, -10541, -15514, -22452, -12639, 14420, 36350, 27604, 13759, 33003, 32767, -1931, -13905, -10103, 20224, 25021, 20619, 23259, -2510, -9541, 11245, 27061, 25750, -1831, -42592, -52246, -21281]
14906b1281L9181j9150k5807k1890k742L617M2736L1626j1476q751R171j1655
14894C579J9485J0604j1380J3932L68k1035j5622j4087M046o044m852J4319J8202
14881A1515K4300Q244P295l8456j2361L9654J8521J767l635l758j8466k2770K226
14868A4076K0574k5016k0967nM825J5986R177r487J7915J3204Q869J2522k0367
14855D1306k4527l2508j6396K0313J6712k0156m337l939j2928J2420p046Q037
14843b3049k550J2235n042l586J7878J3821J6141P620Q810j7423R198R529K775
14830D6357l649J8564p60j7830j3982m3798K0150K2753L626k504J0324J015p573
14817C2693q289j7482k3147j0325p082q457L2892J6144J6618j3978o472m43J0593
$$ y = [-21281, 17900, -1250, -27057, -48947, -51689, -48072, -5336, 26290, 14814, 6063, 15234, 3579, 23064, 33668, 22288, 36220, 36588, 15553, -69, -14156, -10110, -16154, -21006, -6687, 11515, 35815, 44059, 51354, 12898, 537, 40191, 58712, 60479, 56844, 53086, 34620, 11850, 14076, 34650, 9634, -11333, -11338, -6513, 9473, 18650, 9163, 27078, 40282, 49151, 61673, 41306, 16779, -15729, -32125, -11812, 4900, -15256, -19593, -23532, -36460, -24040, -31086, -23049, -25599, -13364, -18406, -21992, -4114, 9707, 25848, 33468, 42278, 24855, 34053, 43582, 46357, 42708, 61272, 60512, 42682, 28700, -15098, 5052, 27805, 31431, 28927, 39251, 40266, 32693, 24404, 6922, -16225, -26550, -33632, -42089, -9197, 6947, 23565, 9587, 3115, 2672, 13265]
14804A3265r510l917P067j0722j098J8118p969P974L7717R626l1818l0016M879
14791C596l7516p359K3311L8252L1719j1243n280l814J102L736R926l1254r383
14778E793k0276k2613L2859J1917J166J5191J9798J5201M663q207k5258j548l661
14765B5025k3673p648o438p152K4769K4765k2957j0782j4140j512J9319j9754
14753b0178k6564q81L9599K9025L2628j3516o549j1604P483n488j8838j260j3187
14740i330l175J8923j5560k3219j5554K3143J7840K6415O234P87J8771r944m3208
14727g877k7590l230J3855Q55R014O079Q822o019k5460n312j5026j46J9428K1074
14713a1533K5075k4436l1878l151L386P042K4170p36J0493L2179j573j1378p481
$$ y = [13265, 3755, -162, 6905, -3817, -4915, 13203, 5234, 13208, 50925, 60551, 28733, -1283, 3596, -33920, -41279, -17968, 20284, 52003, 40760, 35480, 31666, 32768, 36504, 46430, 15176, 5793, -14483, -37096, -4237, 7680, 8846, 24037, 43835, 59036, 63699, 55492, 30234, 28686, 25025, 1352, -6296, -12734, -19886, 4883, 29648, 6691, -4091, -18231, -19743, -424, -20178, -46742, -47623, -8024, 21001, 53629, 40113, 33564, 21960, 29443, 23955, 5117, 3857, -9330, -12505, 6418, -9142, -32361, -47915, -24772, -6932, 19483, 25717, 26504, 45275, 35331, -7877, -35467, -38697, -24842, -23987, -14973, -8894, -72, -6091, -31551, -36863, -51889, -52035, -32607, -11533, 13542, -10894, -42772, -45923, -42537, -35495, -11325, -12061, -1568, 30611, 29038, 17660, 10179]
14700A0179l5352J6008K8545L9925J4568l3446k2435O453J1784p801l9611j7070
14688b8253n86K3590L2053j2241q428k0041k7090j5807n339L2231K4763K6414
14676B1266k8877j913K7399J386j4811j177J00j9944o671j7221L5230K5859k058
14663A8568j1787J3722K0894j0135J2234J3547j9836j2471K1177n527n430R989
14651D4945L562j2079k742K4903N027l3655j4953M288o263M989m369j0658o777
14638c782j8414N190L9756Q90j4003l4140k4122K4855K4285J7526k8117J579j8720
14625b7217q097K8426P683J9111L1311J360m1064n3484j3165K1018J4631M720
14613a4767k2233J2355J8953R20J6135l5971k7923L8391M209k1273m599K5279
$$ y = [10179, -25173, -9165, 19380, 59305, 73873, 40427, 17992, 24445, 36229, 28428, -11183, -28253, -28839, -5249, 26804, 14563, 6135, -13906, -40996, -56803, -62142, -29911, -5148, 21266, -7611, -9524, 17875, 19261, 4450, 3273, 3373, -16571, -23242, -40463, -5233, 20626, 18568, 6781, 20503, 41397, 31262, 43496, 57043, 37207, 24736, 45913, 40386, 34956, 44945, 48507, 36428, 33686, 58589, 63616, 29961, 15008, 19296, 13033, 18022, 13653, 2995, -3782, -22196, -17006, 22750, 23640, 9637, -24503, -48625, -23770, 515, 18041, -10076, -8497, -27217, -35314, -6888, 795, 19906, 51217, 52577, 11513, -41971, -55136, -34118, -19487, -14767, -37000, -24645, -5692, -4772, 11363, -24608, -52531, -14140, -9931, -31204, -35803, -10524]
14601a0524L4802L712Q055k7968j3682L509R600k4251P699K2421K8980P997k570
14588D7780n695j3956P124J3526l091j8651j9551j0102J5395J3597P429J4226
14576D8031n600N593L0931j4237k2234j9992k4751j6549O39K328J5612j7782j4492
14563c2503L1010K7085J8150Q112l2882k0177r46R207K3048P190J5642j5001m128
14550C3807J0818k456K0958K7175n46l0138l2090l5404q140L9755K7365j5931
14538C5173l1876k2834r60K8030o710J1971K2012j2949J9709k1525l568R470L1129
14525E7072j6685l6470j0917N873P817J7286q923j1105j3720m500K3464J7741
14513B6933K7429M634j0952j7424M661j4124j2919l7745k9801o451J5648J3661
$$ y = [-10524, 24278, 27990, 36045, 8077, -5605, -2096, 7504, -16747, -9048, 13373, 42353, 50350, 47780, 42085, 28129, 35253, 48779, 45688, 27037, 7486, -2616, 12779, 26376, 33805, 48031, 42431, 48024, 78955, 64718, 42484, 22492, -2259, -18808, -18169, -15841, -229, -18011, -32503, -1493, 25592, 43742, 51854, 18972, -1205, -2151, 7056, 30104, 37294, 52936, 37935, 33807, 44625, 42169, 63127, 90302, 89756, 59618, 27528, -7876, -16016, 23739, 51104, 35173, 3297, -19537, -20497, 7533, 823, 12794, 34806, 21857, 41566, 20041, 16473, 25943, 57072, 40387, 3917, -7000, -1127, 6690, 23976, 15053, 3948, -9772, -14272, 9192, 26933, 54362, 58996, 48044, 30620, 35281, 21157, 8238, -29507, -59308, -65759, -50111, -36450]
14501c6450k0451j2630K5240J8278J0940J0705J9204j2615l0116J3197o001J0968
14489i731j6303j858O589J4101J049J2051J0098L5744p454l5338m16j276O083
14476A3339l863J7732n33l7829l0160L010K2547L4426K9826n43r258k4015L626
14463A8305M689L1751k7063k2954J3454L012k5233J5292K8281Q211k2932J3583
14451C8396K2404k5314j9538m0809j0776J9408j0016P626J9879J531J0523L9032
14439E2346k9645j7973r502k6551j3159K8051K2280p127k5707l102J5411J9257
14427D579P50j0677J4249K5372k550r067N061L0078q445m5950p544R142K9763
14414C4761J12j0476j538N827q853n786n78O166l353O253m873N064O35J6062N900
$$ y = [-36450, -56901, -69531, -44291, -26013, -15073, -4368, 14836, 2221, -27895, -14698, -20699, -9731, -26034, -27892, -21303, -7202, -6153, 5898, 15996, 51740, 44286, 8948, 8532, 7256, 13339, 9476, 27208, 26675, -11154, -41314, -38304, -15757, 18669, 48495, 47952, 38694, 14679, 18305, 22994, 54745, 27682, 4728, 18182, 21194, -4039, 11253, 39534, 47745, 24813, 38396, 60800, 35486, 15948, -24861, -35637, -16229, -26245, -18619, 1260, 2791, 13314, 52346, 22701, 4728, -4774, -31325, -44484, -16433, 5847, -1280, -26987, -30089, -14678, 4579, 5329, -5348, 8901, 34273, 31723, 22656, 27717, 57795, 49350, 3400, -4144, 4998, 34761, 34873, 24397, 22859, 28686, 19833, 14047, 13469, 19635, 16282, 22535, 17662, 22726, 23361, 39423, 45323]
14399D5323j0332J0730o863j4507K2477K0471k317m2949k9659n98P388n267L4267
14386B8164K6071r736K499n732k6168O935L006L569n578J0688J1766J5274K6753
14373H7511j176m4019n7343L5941J2605Q995K497J0484K8092j4178M012p987j9557
14360D5877J0842j0476l2029M432J502l5661K58M4565K350k5060J9318J6753j0384
14347C2287K1930J8409m7743l9534R862q58j0499K2563J7557J7361K2303j8619
14335D5019m8506m5948L0938M2038L6728j8915l6089q140N653J6135K2809p819
14323C3903J779N347j1850q905O248J3138k176K340K8703K8360J206m8452l1224
14310A8417k908Q424J8970J0023j7762q399r239R692k1543j1716K719l934q089
$$ y = [45323, 34991, 45721, 38858, 24351, 46828, 67299, 64982, 22033, -7626, -8224, -836, -6103, 28164, 54235, 44499, 46998, 41266, 15098, 22033, 25039, 28608, 23030, 33718, 45484, 60758, 87511, 86335, 42316, -15027, 20914, 33519, 42514, 45011, 55495, 83587, 69409, 73421, 65434, 45877, 56719, 46243, 14214, 18646, 20148, -15513, -15255, 29310, 31660, 6600, 25918, 42671, 32287, 54217, 72626, 24883, -14651, -4789, -5647, -16146, 6417, 23974, 41335, 63638, 45019, -3487, -49435, -18497, 23541, 60269, 41354, 5265, -2875, 2778, 18913, 41722, 33903, 35682, 41029, 29179, 20274, 26522, 39660, 37484, 39824, 68527, 96887, 98093, 49641, 18417, 15509, 23933, 42903, 52926, 35164, 26765, 17526, 27218, 5675, -6041, -3322, -7256, -15345]
14297a5345j7584J4062L1811K6491Q504J9879P732n3137j2122L4821j3451L918
14285C5579q521L385R726J9284k5494K595k5878n156K862j1418j2147J2842j0290
14272a2631l531L2620J3459l0877J9600P801k3419n4J4704L1493J1808n706j1475
14259D3792J700J9241p774k0438J2043K6811R687k0704j5788k0182M499L307m4421
14246h227k7333J5365M2557L3199k5292Q917J7106O700J6634R2j9074j5999j0870
14233C3775j5286l8539j1784L002J2946K8009J1479M182K0218j3437R196J5413
14221E9174k0917l1747J7815K0328O785N454j1485k6639q47L6382r605q934k153
14208C3611P375L2062Q727J2371R922R826O100q628o134j9782j4577k481k372
$$ y = [-15345, -32929, -18867, 12944, 39435, 47939, 67818, 75550, 22413, 10291, 45112, 31661, 35579, 27058, 30443, 40169, 59453, 33959, 36554, 10676, 5520, 8382, -3036, -15183, -2341, -12631, -16162, 16458, 29917, -960, 18640, 26441, 3022, 2968, 17672, 49165, 60973, 55267, 43792, 45492, 64733, 56959, 36521, 48564, 75375, 85062, 64358, 48570, 28388, 32887, 36194, -8227, -35560, -20195, 22362, 55561, 30269, 39186, 56292, 62992, 79626, 79718, 60644, 44645, 33775, 18489, -20050, -31834, -28832, -15886, 12123, 23602, 27784, 48002, 34565, 43761, 59174, 38257, 6510, 24325, 44653, 51438, 56892, 45407, 18768, 17921, 54303, 44698, 35764, 33611, 40986, 73048, 81775, 94146, 104068, 113894, 119994, 111366, 105232, 85450, 70873, 68392, 66020]
14195F6020k0168j4768J1444K4981o306J3732j2192k6899P881j7398J060L2748
14183F0135K4476o413j4765m7242j7206M0609K3196J2519l210J8354l165k7310
14171E9978N941J8707k9506k3013K053L426Q47N626Q571K4332L410Q438J4640
14158A03450J4420j3709n578l5237p455j4861o814J5786O302K6954M056j9517
14146F7797j8380j3745K4699J9545M165l3827k6052j8683K7393Q670K205k1786
14134B2001j5107J3914K8625P703J461r854Q874L824J5069o6l9389j7260O432
14121B6227J2275K015O953N696J5954J2438k4585k2217J0787J3869q444j4700
14109C6268J2214j0886m340j9412m4355R099K6213J4925L2456J6345l1728j7365
$$ y = [66020, 45852, 31084, 42528, 67509, 61203, 74935, 62743, 35844, 43725, 26327, 27387, 60135, 84611, 78198, 63433, 16191, -1015, 39594, 62790, 75309, 72099, 90453, 87288, 59978, 65919, 84626, 55120, 32107, 34160, 37586, 38433, 44059, 52630, 76962, 80372, 88810, 103450, 117870, 104161, 98583, 63346, 55891, 41030, 34216, 50002, 56304, 83258, 87314, 67797, 49417, 35672, 60371, 79916, 84081, 50254, 24202, 5519, 32912, 41582, 43787, 22001, 6894, 20808, 49433, 57136, 58597, 48743, 57617, 61441, 76510, 76444, 37055, 19795, 26227, 38502, 40517, 47470, 53166, 69120, 81558, 56973, 34756, 45543, 59412, 50968, 36268, 48482, 37596, 33256, 13844, -30511, -21412, 4801, 19726, 52182, 68527, 36799, 19434]
14097A9434K4936k842n608o057J2634r10P52K0462R60k0763q856q778L5510K3032
14083H3906l6023k4532K5410J4847J700j6535J6731J8879J3654K3837q383K841
14071A16332p907k5837M882K185l0644k9735l661M291P76k2542R571L8261p857
14058D8115k3592j7861M9L383k3785o084K9343K2164Q284r076K0299J102k6029
14045B6312J2044r933j0388N100J205r111k2923K784k707P610K6633j320j4603
14032A0703N262K247J3325m030l8540j1162J8096K9617J4499j7150l4479L1096
14020A9484M7511P157k1533M655K289k7324p266L4314J4088p682p177L493p117
14007E4892k5719r91J1932o765j0431j1958J4238K8207O406m706l894Q084L708
$$ y = [19434, 44370, 41528, 35920, 29863, 42497, 41587, 42339, 62801, 63761, 42998, 34142, 25364, 60874, 83906, 47883, 23351, 48761, 63608, 65308, 48773, 65504, 84383, 98037, 121874, 113491, 116332, 108425, 82588, 87470, 89655, 59011, 29276, 25615, 29906, 30682, 8140, 17711, 55972, 48115, 24523, 6662, 6711, 10094, -13691, -19775, 9568, 31732, 40016, 30940, 51239, 52341, 26312, 38356, 28423, 18035, 23135, 24340, 15229, -7694, -4910, -7617, -7, 26626, 25306, 10703, 15965, 18212, 31537, 27507, -11033, -22195, -4099, 25518, 40017, 22867, -11612, 19484, 66995, 74152, 52619, 57274, 59563, 32239, 24973, 59287, 73375, 65693, 58516, 62009, 54892, 29173, 28182, 40114, 33349, 22918, 10960, 25198, 53405, 59811, 55105, 51211, 59295, 63003]
13994F3003o586l7119k3062l1757J951N1360J9848K406L2933J295J9665j3848
13982H0089l0065k0468L073K8570K7580j9690j7514Q618J2604j224k2896J8178
13970F6855o267R845j225j3369J5678M4721j4042l2145l5669J2556j087l625Q765
13957E0991J5699l951J1673r929k4107q90R143j0066K0808M745M2071j2904l2904
13944F0379k5496j2575J04r083p348Q752J9671K9384K0235k5190k4584J0410L201
13931D7860o218n838K4546r44l9603p74L2073K5293j0736m564K324m207r939M200
13917E3473R085J2444k818k7673j961O506K453J1801o747J1513k3263j0401k0012
13904A4400J8130K5798J7693J5916o691l4349l5104j9278M0117J7030j8797N859
$$ y = [63003, 56417, 19298, -3764, -35521, -33570, 17790, 37638, 40044, 72977, 74272, 93937, 80089, 50024, 29556, 32629, 61199, 88779, 69089, 51575, 60193, 72797, 71573, 48677, 66855, 60588, 70433, 69208, 55839, 71517, 116238, 102196, 70051, 34382, 46938, 45851, 42226, 50991, 66690, 62739, 74412, 64483, 40376, 39486, 48629, 38563, 59371, 64116, 106187, 93283, 60379, 34883, 22308, 22412, 13329, 5981, 14733, 34404, 63788, 84023, 58833, 34249, 44659, 47860, 41642, 35804, 60350, 59406, 19803, 19029, 51102, 76395, 65659, 61095, 63419, 59212, 49273, 53473, 62558, 75002, 72184, 44511, 42550, 49056, 51509, 63310, 56563, 68076, 44813, 34412, 14400, 32530, 58328, 76021, 91937, 85246, 50897, 15793, -3485, 36632, 53662, 34865, 40724]
13892D0724O119n088j76k3109j7724Q471n348L4156L1032m479K1977K7045l453
13879A10147j6095l5260k3507L892K0125K2354j432Q872j0494o080j7033j0437
13867D5052m0545j012L8704m738r805K65k5656O723M1748K1660j6302Q962q695
13854E6361k5938k5158N945K7918K8671j8621l8508K3517J5484Q891K585n735
13842E5412p925k8095k5463M048O293J9614K2511K2024j4696o033l852j7229k3100
13829C509n564L5821J4228J367j4166O732Q050K5756j2703j201J401L560k103
13816F4687j2716j6757m47L256q349J128L8179R728O484j8826o533J6407k1626
13803E4615J3322J4832k0010l7407m502J5141l4576m1062J9247L2230L0959k598
$$ y = [40724, 46843, 41755, 41579, 18470, 746, 9217, 3869, 38025, 69057, 64578, 86555, 113600, 110147, 94052, 58792, 35285, 39177, 59302, 81656, 80224, 89096, 78602, 72522, 55489, 45052, 4507, 3495, 42199, 37461, 27656, 27921, 2265, 8988, 50736, 72396, 56094, 65056, 56361, 30423, 5265, 11210, 39128, 67799, 49178, 10670, 34187, 49671, 58562, 61147, 55412, 47487, 19392, -6071, -2023, 4270, 23884, 46395, 68419, 53723, 47690, 43838, 26609, 3509, -2055, 33766, 47994, 49361, 35195, 41927, 49977, 75733, 63030, 61829, 63230, 66790, 64687, 51971, 35214, 34767, 38023, 29674, 30802, 68981, 78709, 85193, 66367, 59834, 76241, 54615, 67937, 82769, 62759, 25352, 20850, 35991, 1415, -39647, -20400, 11830, 42789, 40191]
13791D0191K4738J5553k3224l1099J9694q441N375J8246K0897L4456k3578n507
13779H7301P490q518n731R171K594J9332j6141n546L546j1078q877l019O107j6284
13765F0347l423Q540o724J0897J9129Q015p792j1630L225P939J0607q732l737
13752H6661k3801k9799j3060K6174M087k1959J5084K5819k4851q253K5079P526
13740F8707j0241k2506k8875M0793L8296r315O443J3764N578L1172m052N493R702
13727A44959k8641l4285M964l094j7662k4669n592M869J9234o572P903n43M095
13714F4966N367j781L55k7778p50P01L4291K5775o939k9093m2178j3144P916J7748
13700C5456J685k0288J3126N70j5600P078P961J9511K1557q758j3311r777J6699
$$ y = [40191, 64929, 80482, 57258, 26159, 45853, 37412, 42787, 61033, 81930, 116386, 92808, 87301, 94791, 86273, 80542, 89713, 92307, 111639, 95498, 89952, 93498, 82420, 73543, 70524, 76631, 60347, 56924, 65464, 58740, 69637, 88766, 96781, 88989, 77359, 80584, 88523, 99130, 90398, 86661, 62860, 33061, 20001, 46175, 50262, 28303, 43387, 69206, 44355, 36102, 61181, 68707, 58466, 35960, 7085, 47878, 86174, 76859, 83302, 97066, 102644, 133816, 129764, 135257, 144959, 116318, 82033, 86997, 83903, 66241, 41572, 35980, 40849, 60083, 53511, 61414, 60871, 64966, 70333, 68552, 68907, 41129, 40379, 41080, 75371, 101146, 94207, 65114, 22936, 9792, 17708, 35456, 37141, 16853, 29979, 30549, 14949, 22027, 29988, 49499, 71056, 62298, 48987, 39210, 55909]
13687E5909L9282j0735k0505j5858M629m419L033L1077j2856M144K8486n550j939
13674I4698J239j4977l5993N15K378j1148J7892R918j2450K8395J7992K981j3593
13661H7847j254J6611K4120j4606j9443K457J5042l8105j0999L4452K073J5422
13649A13617p232k6639m5813k9392j4780K8458K4845N134Q798k741J7686L087
13637G5028M772n179k3290j9123K4316n394P955K2522O834o509K0240K1829j5595
13624A08406M234j5758l6951J2772K490M496K0662J9832L527L001l0259j4185
13612H2267J7173k1507k7894p033J2285L5718j079k3901M293P590q044L455L77
13599G3700M2128J9463j131l5313n343j0101k9133K543J4560j3395k7523m607
$$ y = [55909, 95191, 84456, 63951, 48093, 52722, 48303, 51336, 82413, 69557, 73701, 102187, 96637, 94698, 95937, 80960, 44967, 45482, 47860, 36712, 54604, 64522, 52072, 80467, 98459, 101440, 87847, 86593, 103204, 127324, 112718, 93275, 95732, 110774, 72669, 61670, 96122, 98195, 113617, 106385, 79746, 33933, 4541, -10239, 18219, 43064, 48198, 56996, 54255, 71941, 75028, 79800, 74621, 51331, 32208, 56524, 51130, 59085, 81607, 88441, 81932, 102172, 124001, 108406, 112640, 96882, 59931, 72703, 75193, 79689, 100351, 120183, 123710, 126711, 96452, 82267, 99440, 77933, 50039, 43006, 55291, 91009, 89930, 66029, 70322, 77912, 69868, 73323, 73700, 115828, 135291, 134160, 98847, 93504, 83403, 54270, 56813, 71373, 57978, 30455, 25848]
13587B5848j3901P389K2927o273p554M0418K3001J9739q403j9846k3016L566j6605
13574D7290J8543k0159N886k527K5473J8774K0463J3831j6206m1571J6789m765
13562H1821m49K4371J1952L1871R506m8146m0828k2082J1138k58K3372J9581j3550
13549H8299r589N343j941K6462M796K795P004j2189k2556N2k5145k0910l369L5494
13535G4546L3545L7870Q362l75k0412o5898k956K1986J5179O807J7995J069k0279
13522A07439j2852O027j1994J0488J6629J8740J4473k1707k3793L4807R014j1651
13510A35620L327l3923j6018L833j1152J8388j4668P006k546M7654q677r125J7949
13497A37668j5849m8608K645M4166J6581j8657j6245K9872P445l6692r683J4724
$$ y = [25848, 11947, 19336, 42263, 35990, 28436, 68854, 91855, 111594, 103191, 83345, 60329, 63895, 47290, 65833, 45674, 51560, 49033, 74506, 93280, 113743, 127574, 111368, 69797, 86586, 81821, 81372, 105743, 117695, 149566, 159072, 110926, 70098, 48016, 59154, 58896, 82268, 101849, 88299, 78710, 84053, 82112, 108574, 113370, 116165, 123169, 110980, 88424, 88476, 63331, 42421, 39052, 74546, 108091, 145961, 154323, 153948, 133536, 67638, 64682, 86668, 101847, 108654, 126649, 127718, 107439, 94587, 100614, 88620, 99108, 115737, 134477, 148950, 127243, 103450, 138257, 147271, 135620, 138947, 105024, 89006, 92839, 81687, 100075, 85407, 92413, 89867, 137521, 128844, 119719, 137668, 121819, 73211, 75856, 120022, 136603, 117946, 101701, 131573, 139018, 102326, 92643, 107367]
13485A07367P380K7351J8027j0281J0215k1588l0899J4565J2794j3902j1220j351
13473A08458L163j5747K506J6374M23q795j3090l0843N760r880K3998K2867J1289
13460A16483j8931l830q614l3154N55J6080L7718R529K2984L375j0933Q687l6390
13447A03559k4820J2602Q972k1055j5444j0755K5197J1951L0942M5353m051k0469
13435A41982k7950n940L7185J0921P27J4307m279k7347q881l4282K499k5347n886
13422F7709L2223K0744J1918J9459M695o610j5713l5452k9685r330J7105K7187
13410A04250K3559p878O858J1523l1146k6124K851l464J0894Q081m226j719l071
13397I0388n151j7778K7146J2313k564q213k0574J9725K3263J1510R832k5827
$$ y = [107367, 114747, 142098, 160125, 149844, 160059, 138471, 107572, 122137, 134931, 121029, 109809, 108458, 111621, 95874, 98380, 114754, 115177, 106382, 93292, 62449, 68209, 58329, 82327, 105194, 116483, 97552, 93722, 85108, 51954, 52509, 68589, 106307, 115836, 138820, 142195, 131262, 139949, 103559, 78739, 91341, 100313, 79258, 63814, 53059, 78256, 90207, 121149, 166502, 162451, 141982, 114032, 108092, 145277, 156198, 156925, 171232, 166953, 139606, 130725, 96443, 98942, 73595, 67709, 99932, 120676, 132594, 152053, 156748, 150138, 134425, 98973, 69288, 59958, 77063, 104250, 127809, 119931, 126789, 138312, 107166, 81042, 83893, 80429, 91323, 99404, 95178, 93459, 90388, 85237, 67459, 94605, 106918, 104354, 96141, 75567, 95292, 118555, 130065, 139897, 114070]
13385A14070j2545j7129K4851L6024L338P597m686K391k2619j9938O679L0042
13373A48075K5906j7598m0292l0129K3316K0877j1392M8304L0410j5160j085j2187
13361A69045l0076k6914R451L1546R537j4485k2038m484Q948j85k513Q777J3257
13348A49866k5138O913j3550o180K3199K3666j5296j572J708j1400K644J0486
13336A45346J7442L0959m860m8813m1035K9499K1443L7N489K0273n050O11J2280
13323A83621K38j3432l1530k123j5033o794m211n949J9906J8462J6395m010k3853
13310A31687Q18J0061k4898m453L7286k259J2437K4392N34J0604k8975k1282O891
13297A52843J3264J1380j5718l604J6742J4798Q250M716j6431o501j630M873K8206
$$ y = [114070, 101525, 84396, 109247, 145271, 148609, 156206, 151520, 153911, 131292, 111354, 118033, 148075, 173981, 156383, 116091, 85962, 109278, 130155, 118763, 167067, 197477, 182317, 181232, 169045, 138969, 112055, 121506, 153052, 162589, 148104, 126066, 121582, 130530, 130345, 127832, 136609, 149866, 124728, 131641, 118091, 111911, 135110, 158776, 143480, 141908, 143616, 132216, 134860, 145346, 162788, 193747, 188887, 140074, 99039, 128538, 149981, 150018, 155507, 175780, 170730, 171341, 183621, 183859, 170427, 138897, 136774, 121741, 114947, 110736, 104787, 124693, 143155, 159550, 155540, 131687, 132505, 142566, 117668, 113215, 150501, 148242, 160679, 185071, 185605, 196209, 167234, 145952, 152843, 166107, 177487, 161769, 158165, 174907, 189705, 197955, 202671, 186240, 179739, 178109, 182982, 211188]
13284B11188J598j9709l5019J9349P1011Q682K6871L5172M3475O7968J17488J24613
13272F72687J67169J66519J88248J97016J71672J61693J25608O1707o0171j54860
13262A697288j90287j80725k01441j88162j46718j49180j04124o1905m6107m1806
13252C86833k8209k7282j7809k4019q036r086r125J433l0132l2532N780L1263
13240B39079j1297k3504r146O445o631J6564J5775q800m4418l1232J1355J7152
13228A71342J8264j1539k4921O082m236p196J1271J6783n454J6891j6774k7711
13216A42802j4572J4599K0252L679M599J4441K0958j1347j3348N837o74j5310
13204A71916L0050K347j5730l0378j0976L945J3465J044K3826M6139P107m2025
$$ y = [211188, 212786, 193077, 158058, 177407, 248418, 257100, 283971, 319143, 362618, 430586, 548074, 672687, 839856, 1006375, 1194623, 1391639, 1563311, 1725004, 1850612, 1912319, 1852148, 1697288, 1507001, 1326276, 1124835, 936673, 789955, 640775, 536651, 474746, 428639, 386833, 358624, 331342, 313533, 289514, 281478, 272392, 263267, 264700, 234568, 202036, 207816, 239079, 227782, 204278, 195132, 201577, 194946, 211510, 227285, 218485, 174067, 142835, 154190, 171342, 189606, 178067, 153146, 159228, 154992, 147796, 159067, 175850, 170396, 187287, 170513, 142802, 128230, 142829, 163081, 166760, 171359, 185800, 206758, 195411, 182063, 187900, 187226, 171916, 201966, 204313, 188583, 158205, 147229, 151174, 164639, 165683, 189509, 235648, 242755, 200730]
13192B00730j5267J5866j082K718p667j6512K3538P493r485J2527L155j2053p661
13179A96300R918k232J7540K3502K547k0369q397p24j2339J0747J5181N780J104
13166B38558j1209j0046r646r534j8215J950j2759J6732K3421p713J2680J6327
13154B30546j1620p987j6944l1309r93M335J0014K6023J7661N204j3874J5092
13142B26148K5432j4113k6670n637J7181L413J6525J6368J560j1147j1009l669
13130B34382j7347K4946J7505J9339l8921m1798J5155J9188R582J6847J3066k1379
13118B50565k454k178L133K918J6039J4135k4893K2771M4041j1518k501m094j2989
13105B92975k5432j5925L439O943K2129K209j788j8193j4060P550j1800j6216
$$ y = [200730, 185463, 201329, 200247, 202965, 195298, 178786, 202324, 209817, 200332, 212859, 216014, 203961, 196300, 206218, 203986, 221526, 245028, 247575, 227206, 218809, 218085, 205746, 216493, 231674, 237454, 238558, 227349, 217303, 207657, 198123, 179908, 181858, 169099, 185831, 209252, 201539, 214219, 230546, 218926, 210939, 193995, 162686, 161693, 166028, 176042, 202065, 219726, 224930, 211056, 226148, 251580, 237467, 210797, 205160, 222341, 225754, 242279, 258647, 260207, 249060, 238051, 234382, 217035, 241981, 259486, 278825, 239904, 198106, 213261, 232449, 242031, 258878, 271944, 250565, 248111, 245933, 249066, 251984, 268023, 282158, 257265, 280036, 324077, 312559, 310058, 305964, 292975, 267543, 251618, 255057, 262000, 284129, 286338, 284550, 266357, 252297, 259847, 248047, 231831]
13093B31831J7192J1636O674K665o799o67r295J8345k388j5520j4499N692K1018
13080B65885J0268K3003K3851M1944J5338N558K7377M0519N3410J6788K1005J20
13068E45066k8324j4613m4838n7020j7534p688k5558l5038j5348q261K5556J0097
13056C26497o032j5266l7776l7499j0901J7224K5833J4910k7515j9518K2274q722
13044B43509j9296j2982J5230K372M1924J542N558l605P555J1482j5500O197J913
13031B85899J398L424J5323K6041K7878j048l4219l4360k4607J5070M0775L3645
13019C55219P545m4553l9435J9821N751p547J3838N876p243J3992J4023r136j4516
13006C13635J4800j7851m7544l4354J4289K7297l703j2388n960L3386k501l887
$$ y = [231831, 249023, 260659, 267333, 269998, 263199, 262532, 253237, 271582, 269194, 253674, 239175, 244867, 265885, 276153, 299156, 323007, 364951, 380289, 385847, 413224, 453743, 507153, 523941, 544946, 545066, 516742, 502129, 457291, 400271, 382737, 375049, 349491, 314453, 299105, 290844, 316400, 326497, 320465, 305199, 267423, 229924, 219023, 236247, 262080, 276990, 249475, 229957, 252231, 243509, 224213, 211231, 226461, 228833, 270757, 272299, 277857, 274252, 281807, 293289, 277789, 283986, 285899, 287297, 290721, 306044, 332085, 359963, 358915, 324696, 290336, 265729, 280799, 321574, 355219, 362764, 318211, 278776, 298597, 304348, 296801, 310639, 316515, 309272, 323264, 337287, 328151, 313635, 328435, 310584, 263040, 228686, 242975, 270272, 266569, 254181, 248221, 281607, 279106, 275219]
12994B75219K2925K2534o607j3102q261O256j1948R3Q353l2K7639J2075j6826
12981C18318r80J0757L9265K8118r178J2800j955j3070k5411O740N462k4372J1003
12968C57497j46J8407q852K0219R610L294J357p623m5469j0718M3463R153p01
12955C89491K0604M174k1396J8448M796j0204L8999K6212J0324L2514J6051K412
12943E32425O4383N9151L5624K8299P740j1858r608j4850j0712l3568o954O263
12931F46335j7777l3889K3302M2815j230o464P535K0465N028J016j1186J4007
12919F89957n285j5234P458M612K939j5913M971M7293J6806J0834k046j0774L8392
12906G74010O5220J5033j3303j7474q878O129L9826L699R03L1106K0932M1669
$$ y = [275219, 298144, 320678, 314071, 300969, 292708, 298964, 287016, 287109, 295462, 295430, 323069, 335144, 318318, 317338, 328095, 367360, 395478, 386300, 399100, 397145, 384075, 358664, 365404, 370866, 346494, 357497, 357351, 375758, 366906, 387125, 396735, 400029, 401386, 393763, 348294, 337576, 381039, 390192, 389491, 410095, 414269, 392873, 411321, 416117, 405913, 444912, 471124, 481448, 513962, 530013, 532425, 596808, 655959, 691583, 719882, 727622, 715764, 706156, 691306, 680594, 647026, 640072, 646335, 628558, 594669, 617971, 660786, 659556, 653092, 660627, 681092, 686120, 687136, 675950, 689957, 684672, 669438, 676896, 681508, 684447, 668534, 673505, 720798, 737604, 748438, 746392, 735618, 774010, 839230, 854263, 840960, 823486, 814608, 820737, 860563, 864262, 865165, 896271, 917203, 958872]
12894I58872Q467Q094J4681o316K8973L1804M0725L2623K5759n494R614J2451
12882A160253K4795N2701N3259J9776J0685M2200N1046N3451L4352M464L7381
12871A544363L5649O5046N6693P5232Q3558P3326O1112Q5658P7852R9918P8846
12860B337253O1817Q8183O2714P8460J17350J31094J31287J68841J87604K19942
12850C584545K04139K05906K89418K90957K90063L21927L74238M05443M67723
12841F434359N43746N83105O91290Q17957R48030J078887J241025J445863J764647
12832A5548909K177210K634951L273354M186244N343283O966684R219692J2391767
12824F1742094J6844281K2717082K9724494L6769860M2347531M5122369M2474571
$$ y = [958872, 967339, 975433, 990114, 983798, 1012771, 1044575, 1085300, 1117923, 1143682, 1138188, 1147802, 1160253, 1185048, 1237749, 1291008, 1310784, 1321469, 1363669, 1414715, 1468166, 1502518, 1506982, 1544363, 1580012, 1645058, 1701751, 1776983, 1860541, 1933867, 1994979, 2080637, 2158489, 2258407, 2337253, 2399070, 2487253, 2549967, 2628427, 2745777, 2876871, 3008158, 3176999, 3364603, 3584545, 3788684, 3994590, 4284008, 4574965, 4865028, 5186955, 5561193, 5966636, 6434359, 6978105, 7561210, 8252500, 9070457, 10018487, 11097374, 12338399, 13784262, 15548909, 17726119, 20361070, 23634424, 27820668, 33163951, 40130635, 49350327, 61742094, 78586375, 101303457, 131027951, 167797811, 210145342, 255267711, 297742282]
12817B97742282L1273407J5126890M28345j3683203k9704491m1030086m2481893
12810B17671251l9123163l5597998l0725446k4110762j7893285j3238684r976352
12803D7005561p707279o123608m922073l955616l204223k631065k187119j838344
12795A4436234j536958j275182j114994r71489q40909p09338o20916n59160n06811
12786F300477m22107l65261l52658l17858k66467k27338k37189k10238j71260
12777C730101j55654j78530j56994j44462j52144j27170j16729j37532q6189o1337
12767B413360p0084j04764q0835m6383o7272j01767j08609n9060n1411m2249j9799
12756A661127m3009p7419m0688l1162k7088n1467m1251j6331m1062k9677k0370
$$ y = [297742282, 329015689, 344142579, 344570924, 330887721, 301183230, 260153144, 217671251, 178548088, 142950090, 112224644, 88113882, 70220597, 56981913, 47005561, 39298282, 33174674, 28252601, 24296985, 21092762, 18461697, 16274578, 14436234, 12899276, 11624094, 10509100, 9537611, 8696702, 7987364, 7366448, 6807288, 6300477, 5878370, 5513109, 5160451, 4842593, 4576126, 4348788, 4111599, 3901361, 3730101, 3574447, 3395917, 3238923, 3094461, 2942317, 2815147, 2698418, 2560886, 2474697, 2413360, 2343276, 2238512, 2157677, 2111294, 2044022, 1942255, 1833646, 1774586, 1723175, 1680926, 1661127, 1618118, 1540699, 1500011, 1468849, 1441761, 1390294, 1349043, 1332712, 1291650, 1261973, 1241603]
12745A241603j4725o537k0410l3885l3725k5208j5451j7916k3560R206N106k3941
12733A040557k5916k9906q483K4314O57l2811k8978j5882k3315j4832P528Q851
12721I01784k1900k0025p276L581k2025k2156j6322K174r396k3652j3665N528
12709G56650j799m0555l7807K0726J3420M891J851j4541l7079j5553j9373J243
12697F32074J0245J5111k2332P632M4066K3831J4593K1063j802L0164L9426J842
12685H15913J1385J1687M239n503j9759j5134r120j1380q287l3342K324j0785
12673G32238j1993M1587K5785k7072n7142j9133J0651N161K3551K6070k3995m9552
12661F76156k2674m948J3903J335j4130r556l4537o966j4816k1128L1295M5989
$$ y = [1241603, 1226878, 1220341, 1199931, 1166046, 1132321, 1107113, 1091662, 1073746, 1050186, 1059392, 1064498, 1040557, 1014641, 984735, 976252, 1000566, 1001223, 968412, 939434, 923552, 900237, 885405, 892933, 901784, 879884, 859859, 852583, 856164, 834139, 811983, 795661, 797835, 788439, 764787, 751122, 756650, 754851, 714296, 676489, 697215, 710635, 715526, 717377, 702836, 665757, 650204, 630831, 632074, 642319, 657430, 635098, 642730, 686796, 710627, 725220, 746283, 744481, 774645, 814071, 815913, 827298, 838985, 843224, 837721, 817962, 802828, 793708, 782328, 774041, 740699, 743023, 732238, 720245, 761832, 787617, 760545, 703403, 684270, 694921, 700082, 723633, 749703, 725708, 676156, 653482, 648534, 662437, 663772, 649642, 640086, 605549, 598583, 583767, 562639, 593934, 639923]
12649F39923N218N207j3349k5823q594J774l338q522K9653r4J7883q156J0451
12636F42233J2166J7143j1945J2930J4497m043j8409r019l3283j8661k6915j9434
12624E57260l31q560l897K5618L8243p142j6980o503J9164l965j6736q580J3300
12611E80891m377J0264l2574j1951J2220K3260m560R221P963J8134q411j1166
12599E88914L344l5562R379K2730k1307k2292J2052J5199M156q731J114J4886
12587E83882l980N275J5059Q51n060R146J7860k49j5095O962J8455J9760R883
12574F62749j2605J5951O845j0547n502o625o056M8005R384k3656k0538K5673
12562F83078J6812n501l834j2592j2634J636m36o64J2910j3021p02k0634j0184
$$ y = [639923, 645141, 650348, 636999, 611176, 602582, 604356, 601018, 592496, 622149, 622055, 639938, 631782, 642233, 654399, 671542, 659597, 672527, 687024, 682981, 664572, 655553, 622270, 603609, 576694, 557260, 556929, 548369, 544472, 570090, 608333, 601191, 584211, 577708, 596872, 592907, 576171, 567591, 580891, 576514, 586778, 554204, 542253, 554473, 577733, 573173, 582394, 590357, 608491, 600080, 588914, 592258, 556696, 566075, 588805, 567498, 545206, 557258, 572457, 576613, 567882, 568996, 583882, 579902, 585177, 600236, 601087, 596027, 605173, 623033, 622784, 607689, 614651, 633106, 652866, 662749, 650144, 666095, 672940, 662393, 656891, 650266, 644210, 692215, 701599, 677943, 657405, 683078, 699890, 694389, 690555, 677963, 665329, 666965, 666529, 665865, 678775, 665754, 665052, 644418, 634234]
12549F34234K2093j392j5916R990L4016K895j1922R063o821k5751k898j6292j0944
12536F20355j0549M990L749j9536j688L1866L2079k675N769j1036L598p512k4674
12523F24736K7515L9890j1117J1202K2104q727l3784K52k264k8917Q526J1300
12511F60716N460Q788L102K93J726J4707K5840J0638l027m1484l8353P343J8720
12498F74469L5766K4417J5983j5738j5726K8423J5040J3862J9568l5765j855J8734
12486G77178j633J1713m786m66J5172q82J7850j9673j4938Q835P605N442J1366
12473H12783k8013j9666P993l1068J5519M8057L6874Q329j9417J7491J4637R906
12461H73425n580k6585j1695r414l1876M458q918L3126R458k239j711j2296K3355
$$ y = [634234, 656327, 654935, 639019, 649009, 683025, 685920, 673998, 683061, 676240, 650489, 647591, 631299, 620355, 609806, 614796, 618545, 599009, 597321, 629187, 661266, 658591, 664360, 653324, 656922, 649410, 624736, 652251, 692141, 681024, 692226, 714330, 705603, 671819, 672071, 669807, 640890, 649416, 660716, 666176, 674964, 678066, 678359, 680085, 694792, 720632, 731270, 728243, 686759, 648406, 655749, 674469, 710235, 734652, 750635, 734897, 719171, 747594, 762634, 776496, 796064, 760299, 758444, 777178, 775545, 787258, 782472, 782006, 797178, 796296, 814146, 794473, 779535, 788370, 795975, 801417, 812783, 784770, 765104, 773097, 742029, 757548, 805605, 842479, 850808, 831391, 848882, 863519, 873425, 867845, 841260, 829565, 820151, 788275, 792733, 783815, 816941, 826399, 824160, 822449, 810153, 833508]
12448H33508K7347N494K2910O262j678k4321j4605L2964L0650J7731m383k7909
12436I03970l07K8806J646l555J3870j9939q654P619K5036L234J2940M9293K7740
12423A041699j5035j8117j9910J4618K232p103m4518j4636L0805J1175O141J4313
12411A001664L008J4013n687k6324J1882m06j3821O856J0122J478m143J0991N7820
12398A067453K2498l6113q449K032q752J8517K687l0134j4918K1581L2192J2053
12386A080647K9684l468K0313K1129j9942j1462K4381J3481J7126L3570L1584
12375A237043N6J5483J5079K1414J9930M0923N8814O2584J10755J13313J70574
12364A865968J64400J53468K37821K32067J52741J02686p630l4443j06783j77431
$$ y = [833508, 860855, 866349, 889259, 895521, 893843, 869522, 854917, 887881, 918531, 936262, 931879, 903970, 903663, 932469, 934115, 930560, 944430, 924491, 915837, 923456, 948492, 951726, 964666, 1013959, 1041699, 1026664, 1008547, 988637, 1003255, 1005487, 998384, 953866, 939230, 970035, 981210, 987351, 1001664, 1004672, 1018685, 1012998, 986674, 998556, 998150, 984329, 991185, 1001307, 1002785, 998642, 1009633, 1067453, 1089951, 1053838, 1045389, 1047421, 1038669, 1057186, 1059873, 1029739, 1014821, 1036402, 1068594, 1080647, 1110331, 1106863, 1127176, 1148305, 1128363, 1116901, 1141282, 1154763, 1171889, 1205459, 1237043, 1237099, 1252582, 1267661, 1289075, 1309005, 1349928, 1408742, 1471326, 1582081, 1695394, 1865968, 2030368, 2183836, 2421657, 2653724, 2806465, 2909151, 2901521, 2867078, 2760295, 2582864]
12354B582864j58781j51947j88909j79198j07979j07063q5324o5906k0856m2890
12344A474011m6395j350J2839j3791l9897j1228L5695M521o713r70k470j0084
12332A394168J850q486J6980K3916j462J4699l5320m973K7837O144K21J1854P481
12319A454909K5633o269l729L972j7831N250J5513J5059L349J0535K6676K2983
12307A556050O014j3124k2405l441Q41QJ1223N4409L9757J7918O534k4568P220
12294A636436M326j0099n016J8433J7632J1008J7137K4985m928J8510J5542m773
12282A739193J7362M874Q022j1321k208J6639M023M2071N8680K7316k981n462
12270A896208m5532m847L3932L197L3539Q507j4455K768J7503n884J494K9950
$$ y = [2582864, 2424083, 2272136, 2083227, 1904029, 1796050, 1688987, 1603663, 1537757, 1516901, 1474011, 1427616, 1426266, 1439105, 1425314, 1385417, 1374189, 1409884, 1414405, 1407692, 1406722, 1404252, 1394168, 1396018, 1387532, 1404512, 1428428, 1426966, 1441665, 1406345, 1401372, 1429209, 1435353, 1435574, 1447428, 1454909, 1480542, 1474273, 1470544, 1474516, 1456685, 1461935, 1477448, 1492507, 1495856, 1506391, 1533067, 1556050, 1562064, 1548940, 1526535, 1523094, 1523935, 1523943, 1535166, 1589575, 1629332, 1647250, 1653784, 1629216, 1636436, 1640762, 1630663, 1625647, 1644080, 1661712, 1672720, 1689857, 1714842, 1709914, 1728424, 1743966, 1739193, 1756555, 1761429, 1769451, 1758130, 1755922, 1772561, 1776584, 1818655, 1877335, 1904651, 1901670, 1896208, 1850676, 1845829, 1879761, 1882958, 1916497, 1925004, 1910549, 1913317, 1930820, 1924936, 1926430, 1956380]
12258A956380P302L0646J9987l761J2085M2201J5290J8572k3346q327L1092K1954
12246B120075j2116j7552J3317J5278K0552J2043K8484J6992K7646R096K0686
12235B254501R820k7711n01L7392K5503j2251Q602M2919L0424L1499L0139l923
12223B426413p864K0731K4986J8913J3167K3432J099r704r411J7330L2969J3761
12211B565822J0279M2477K3610l090K7503P138M380j5031Q931K1437L2276K7874
12199B753606L3624L5031K4211K4314K6600J2463J5101K0842o010L0126M1429
12188C011337K1292j125j703L6687K9360K3298K359L356K9930N6031M1463k389
12176C249896j2061J5393K8247M8513M1421L0216N357k1995o059K1589M0023K1975
$$ y = [1956380, 1963682, 1994328, 2014315, 2010554, 2022639, 2064840, 2080130, 2098702, 2075356, 2067029, 2098121, 2120075, 2107959, 2090407, 2103724, 2119002, 2139554, 2151597, 2180081, 2197073, 2224719, 2233815, 2254501, 2264321, 2236610, 2236109, 2273501, 2299004, 2286753, 2295355, 2338274, 2368698, 2400197, 2430336, 2426413, 2418549, 2439280, 2464266, 2483179, 2496346, 2519778, 2520877, 2511173, 2501762, 2519092, 2552061, 2565822, 2576101, 2618578, 2642188, 2639098, 2666601, 2673739, 2678119, 2663088, 2672019, 2693456, 2725732, 2753606, 2787230, 2822261, 2846472, 2870786, 2897386, 2909849, 2924950, 2945792, 2939782, 2969908, 3011337, 3032629, 3031504, 3029801, 3066488, 3095848, 3119146, 3121505, 3124861, 3154791, 3210822, 3252285, 3249896, 3237835, 3253228, 3281475, 3329988, 3371409, 3401625, 3406982, 3384987, 3378928, 3400517, 3440540, 3462515]
12164C462515R384L2768O8832K2513K128K3389K9971K0796M3856J6423L3400P272
12152C773247K592L1819O7017N6981J728L0577K8070q807L0233K3387K5063J8808
12140D080715J692N3490J8029M6934O8986L6461K0489M6799L6830j7421J2069
12129D405073M3513K6661P614J9067N2866N2721L6397K8484M1090N1359L0023
12118D794868K4236Q311L3073P1436N2516M4557M3326L8008O545M0887M6227M3313
12106E247303L1338K9234P2986M9477M6282O1649M1192O568R967L3569P6723O4235
12094E770523J9501M5131L9436O4944O4574L5614O3537P3525J0823J6729P006
12083F211343N6519M4848O5370J14199Q0932P0882M7148L6755M8559N9265L2607
$$ y = [3462515, 3471899, 3504667, 3573499, 3596012, 3598140, 3621529, 3651500, 3672296, 3716152, 3732575, 3765975, 3773247, 3775839, 3807658, 3874675, 3931656, 3933384, 3963961, 3992031, 3983224, 4013457, 4036844, 4061907, 4080715, 4082407, 4135897, 4153926, 4200860, 4269846, 4306307, 4326796, 4373595, 4410425, 4393004, 4405073, 4448586, 4475247, 4482861, 4501928, 4554794, 4607515, 4643912, 4672396, 4713486, 4764845, 4794868, 4819104, 4827415, 4860488, 4931924, 4984440, 5028997, 5072323, 5110331, 5116876, 5157763, 5203990, 5247303, 5278641, 5307875, 5380861, 5430338, 5476620, 5538269, 5579461, 5586029, 5595996, 5629565, 5706288, 5770523, 5790024, 5835155, 5874591, 5939535, 6004109, 6039723, 6103260, 6176785, 6187608, 6204337, 6211343, 6267862, 6312710, 6378080, 6492279, 6573211, 6644093, 6691241, 6727996, 6776555, 6835820, 6868427]
12072F868427N2471O3352J2901j5210L1617O9993Q3078P0364O8104P0758O8150
12061G444005O7505O9926O3643O4003M4586K9495N6518O8012M9418L7111M5853
12050H040075O0267P2850O6738M6309R6553P4247O8494M0179J4971M6002N2807
12039H679492O8760N8066M3754P2640R4850R5009O8847K9123P9011P1779N6428
12028I417759L6644O9778Q7750R9404M9755P7543N7453L0216L6315Q3787P9240
12017A0125644O2777O6134N2185M3733N8683O1768M5731M9072O6213P6872N5497
12006A0764309M7038P3412M6414N2415N7742O5866R1850P1776Q6023O7204M8482
11995A1472531L0194K8564K7231K4280M3720O5438L4277N8860O2287Q5241O2821
$$ y = [6868427, 6920898, 6984250, 6997151, 6981941, 7013558, 7083551, 7166629, 7236993, 7305097, 7375855, 7444005, 7511510, 7581436, 7645079, 7709082, 7753668, 7783163, 7839681, 7907693, 7957111, 7994222, 8040075, 8100342, 8173192, 8239930, 8286239, 8382792, 8457039, 8525533, 8565712, 8580683, 8626685, 8679492, 8748252, 8806318, 8850072, 8922712, 9017562, 9112571, 9181418, 9210541, 9289552, 9361331, 9417759, 9454403, 9524181, 9611931, 9711335, 9761090, 9838633, 9896086, 9926302, 9962617, 10046404, 10125644, 10188421, 10254555, 10306740, 10350473, 10409156, 10470924, 10516655, 10565727, 10631940, 10708812, 10764309, 10811347, 10884759, 10931173, 10983588, 11041330, 11107196, 11199046, 11270822, 11356845, 11424049, 11472531, 11502725, 11531289, 11558520, 11582800, 11626520, 11691958, 11726235, 11785095, 11847382, 11932623, 11995444]
11984A1995444K9355j5926L5425P9046M5403L2683M6615K1443J4597L7035M9566
11973A2370686O164K0445P3324K6511J8408L9229Q113J8427J4586n848O718M1833
11961A2638596J4159J8605J6799o394n7M9176K5919M3024J3205k9991l4111l0061
11949A2718869K5695R329j7176Q408p662j7577j6458l9394l4180p122L613m5006
11937A2581339l3201M3201J089n1015o3044k5915k2624o31l5465o7147j9665j0903
11925A2296019m2272m8913k3785q30m2319n8031p8104l6424m0640m2948l8628
11914A1843125q2119o9931k4821j6734l8775l6757n4139l8814o8633o8439o2378
11903A1281585n2586n3386o5663m7767l9983n3713q3094l8837l8827q5479o7755
$$ y = [11995444, 12024799, 12008873, 12044298, 12123344, 12168747, 12201430, 12248045, 12269488, 12284085, 12321120, 12370686, 12376850, 12397295, 12470619, 12497130, 12515538, 12554767, 12562880, 12581307, 12595893, 12590045, 12596763, 12638596, 12652755, 12671360, 12688159, 12681765, 12681708, 12730884, 12756803, 12799827, 12813032, 12783041, 12748930, 12718869, 12744564, 12753893, 12736717, 12745125, 12737463, 12719886, 12703428, 12664034, 12629854, 12622732, 12626345, 12581339, 12548138, 12591339, 12592428, 12541413, 12478369, 12452454, 12429830, 12429199, 12393734, 12326587, 12306922, 12296019, 12253747, 12204834, 12181049, 12180219, 12137900, 12079869, 12001765, 11965341, 11924701, 11881753, 11843125, 11761006, 11691075, 11666254, 11649520, 11610745, 11573988, 11519849, 11481035, 11412402, 11343963, 11281585, 11228999, 11175613, 11109950, 11062183, 11022200, 10968487, 10885393, 10846556, 10807729, 10722250, 10654495]
11892A0654495o2200o1576l2417n9121p5976r2005o2078n8982o6743o9067o5472
11881I948858n6057m0432o9219n7727o2555n8243p8882m6630l9828o3049n8933
11870I317303m4895o1319r6751r9058n1371o6768p4126n8131n4772n5590p4789
11859H579733o6090o2497l3664o5432p8800l2738n0937o1729p5567m5053m6022
11848G961204n9166p1680q5753m4480l2524n2112p4681m9604n3300p2501q2711
11837G282692n4731n3808l4013n1055o7595o9561m6946o3478l0968k9715n6513
11826F724309o5592m1455o2145l1643m7786m1788k7907m7531n7153m0864k6982
11815F233463n7302p4103q0209o0261k0662l2075n4409l8265m1339m6618n4102
$$ y = [10654495, 10592295, 10530719, 10498302, 10439181, 10363205, 10271200, 10209122, 10150140, 10083397, 10014330, 9948858, 9892801, 9852369, 9783150, 9725423, 9662868, 9604625, 9525743, 9479113, 9439285, 9376236, 9317303, 9272408, 9211089, 9114338, 9015280, 8963909, 8897141, 8823015, 8764884, 8710112, 8654522, 8579733, 8513643, 8451146, 8417482, 8352050, 8273250, 8240512, 8189575, 8127846, 8052279, 8007226, 7961204, 7902038, 7830358, 7744605, 7700125, 7667601, 7615489, 7540808, 7491204, 7437904, 7365403, 7282692, 7227961, 7174153, 7140140, 7089085, 7021490, 6951929, 6904983, 6841505, 6810537, 6780822, 6724309, 6658717, 6617262, 6555117, 6523474, 6475688, 6433900, 6405993, 6358462, 6301309, 6260445, 6233463, 6176161, 6102058, 6021849, 5961588, 5940926, 5908851, 5854442, 5816177, 5774838, 5728220, 5674118]
11804E674118l9879n2226j8149L870l1480o1883o8663p0632n4731n1785n3845
11793E174715l6735R553j3800k8429o3808m7939k0218m3074n0735m5203j7295
11782D817032m740l5137p0144l4659m0412k9123j9037q94l5638o6303k1570l1998
11770D427377l1502n5283l1592p444m0459m1273n0200k6122n215n7110k1944J1557
11758D070790m0930n8976p0443k2565j038r930J7279j3327k5275k7747k8251j9083
11746C770504J055j6327o2233n4088l3932q4569l2303j2347K6212J3545l7159
11735C478358k2104m191k6096m6838m7353o0755n9137q850K0740R631j9290l1569
11723C182546k8167k8658l8966k8224q526r712K064J216l0514j3620j5483m0605
$$ y = [5674118, 5634239, 5582013, 5563864, 5567734, 5536254, 5474371, 5405708, 5335076, 5280345, 5228560, 5174715, 5137980, 5147533, 5133733, 5105304, 5041496, 4993557, 4973339, 4930265, 4879530, 4834327, 4817032, 4812292, 4777155, 4707011, 4672352, 4631940, 4602817, 4583780, 4582886, 4547248, 4480945, 4459375, 4427377, 4395875, 4340592, 4309000, 4301556, 4261097, 4219824, 4169624, 4143502, 4138287, 4081177, 4059233, 4070790, 4029860, 3970884, 3900441, 3877876, 3876838, 3866908, 3884187, 3870860, 3845585, 3817838, 3789587, 3770504, 3771559, 3755232, 3692999, 3638911, 3604979, 3520410, 3488107, 3475760, 3501972, 3515517, 3478358, 3456254, 3452063, 3425967, 3379129, 3331776, 3271021, 3211884, 3203034, 3223774, 3233405, 3214115, 3182546, 3154379, 3125721, 3086755, 3058531, 3050005, 3040293, 3042357, 3043573, 3013059, 2999439, 2983956, 2943351]
11711B943351k5517k7543p204j7204k1368j2689l0574k3082m4471j0307j776j0836
11699B710780M76m291l2192n5180j6733p679k2197k0371m3516M043j1938K2327
11687B523529K5215k2100j8672l5353n4599l3584j1818j6443j3946r001O87j2943
11675B320972j2964j831K529j334R870J0332L4142l0077k1447k8841k1942J0710
11663B270119J1144j9774k9112l4898J2322o270J868j0188M02K1017L2587K7037
11651B276254M7674O0025N9173M6991J08044J17042J17236J09545R8803P9237
11641C120024J6805m9732r7180j20409j19774j34136j25759j03071r9179o3029
11631B224560l9542n9630m5003p6628m8641n5954K076j3694l9181k8204l1120
$$ y = [2943351, 2917834, 2890291, 2883087, 2865883, 2844515, 2831826, 2801252, 2778170, 2733699, 2723392, 2721616, 2710780, 2711256, 2706965, 2674773, 2619593, 2602860, 2595181, 2572984, 2552613, 2509097, 2513140, 2501202, 2523529, 2548744, 2526644, 2507972, 2472619, 2418020, 2384436, 2372618, 2356175, 2342229, 2333228, 2333915, 2320972, 2308008, 2306177, 2308706, 2307372, 2317242, 2327574, 2361716, 2331639, 2310192, 2281351, 2259409, 2270119, 2281263, 2261489, 2232377, 2197479, 2209801, 2203531, 2205399, 2195211, 2195613, 2216630, 2249217, 2276254, 2323928, 2383953, 2443126, 2490117, 2598161, 2715203, 2832439, 2941984, 3040787, 3120024, 3136829, 3087097, 2989917, 2869508, 2749734, 2615598, 2489839, 2386768, 2287589, 2224560, 2185018, 2125388, 2080385, 2003757, 1955116, 1899162, 1901238, 1887544, 1848363, 1820159, 1789039]
11620A789039l2854j1621K790l5694j3884j4891j2388L67j5279j1126J0038k0483
11608A634014n885j6847k3689j264J3135P915o279J5147l1384j3224q919j5424
11596A547296k244j1845j8979J4994l7654j0701J4951l9507r712J021k1224l1430
11584A394966K049k543l2016j432K7368k535j6365J8257j0619K1729K968m2977
11572A358850l5255j4453K2141J847k3501j2625R532L814l1687K54k6166k6578
11560A226173n951j6388R100O431o667K1808n185j3334j9332m8628j0397M853
11548A142483M086J8082K8059P643q611J181j8150k482j6811j4915J7953J61n5911
11535A102768k2306J794L5727p917j5996r977J3034L787p771l8044m107K9593
$$ y = [1789039, 1756185, 1744564, 1747354, 1711660, 1697776, 1682885, 1670497, 1670864, 1655585, 1644459, 1654497, 1634014, 1628129, 1611282, 1587593, 1586329, 1599464, 1607379, 1601100, 1616247, 1584863, 1571639, 1562720, 1547296, 1545052, 1533207, 1514228, 1529222, 1491568, 1480867, 1495818, 1456311, 1446599, 1447620, 1426396, 1394966, 1397015, 1394472, 1362456, 1361024, 1388392, 1385857, 1369492, 1387749, 1377130, 1398859, 1401827, 1358850, 1323595, 1309142, 1331283, 1333130, 1309629, 1297004, 1306536, 1310350, 1278663, 1278917, 1252751, 1226173, 1220222, 1203834, 1212934, 1219365, 1212698, 1234506, 1229321, 1215987, 1196655, 1148027, 1137630, 1142483, 1146569, 1164651, 1192710, 1200353, 1191742, 1192923, 1174773, 1172291, 1155480, 1140565, 1158518, 1158679, 1102768, 1080462, 1082256, 1117983, 1110066, 1094070, 1084093, 1097127, 1100914, 1093143, 1055099, 1050992, 1080585]
11523A080585R097j7054m470l0573k8822q341Q59J1851O780j9467l4208l186K2902
11510I85953M527L594q188j3896J3960J4659j3464k4957q700K9774j1677l2879
11498I38706j2196j3924J5410J1650j7892L1150N0349N405l1304m5515N209n012
11486I32036l3524r460N503N676j3274k1568J351R460Q857J9499J6953J3079j4636
11473I19952k9429l1112p65l3518l6644K3197M2053k883q534l779k6641J8953
11461H30850K5660k7145k8086k4802o361K1344j120j8952M124K316j3806k0433
11449G43589k58k648J2476J660K4078l3116k2389j752J724J1337J1629J1636k6898
11436G31068n195J5114R270j1376J0458k2220l8711J7445j3973k2610l621K621
$$ y = [1080585, 1089682, 1072628, 1068158, 1037585, 1008763, 1000422, 1001281, 1013132, 1019912, 1000445, 966237, 963051, 985953, 990480, 994074, 985886, 971990, 985950, 1000609, 987145, 962188, 953488, 983262, 971585, 938706, 926510, 912586, 927996, 939646, 921754, 952904, 1003253, 1008658, 977354, 931839, 937048, 932036, 898512, 889052, 894555, 900231, 886957, 865389, 866740, 876200, 885057, 904556, 921509, 934588, 919952, 890523, 859411, 858646, 825128, 788484, 811681, 853734, 850851, 842317, 838538, 811897, 830850, 856510, 829365, 801279, 776477, 770116, 791460, 790340, 771388, 775512, 777828, 764022, 743589, 743331, 740683, 753159, 754819, 778897, 745781, 723392, 721640, 723364, 734701, 746330, 757966, 731068, 725873, 740987, 750257, 738881, 749339, 727119, 688408, 705853, 691880, 669270, 665649, 668270]
11424F68270J6487L1728j1060p345p61k952k4861j7479J7255K4945r860l9966
11412F44401L531P201K4565j5810j5856l404J117L761p114j8955o074o286l210
11399F07867J405K4060J5212J6370J8796j9455k7651J4742l6307l4669J8582K658
11387F01610O066L3168o288o071o762j3430k8124k9519k0845j984L0053K1160
11375E79034J3317j1365J0621q847k0471K1250j9080k2913K697K3481R944K447
11363E80115j0309r778L868m037Q146l863j5537J0832j3526n069k669k2888J345
11350E16630J4843O194P920k5252k7503j2916o153k1566k996K3191r084Q102R990
11337D81400J8999j9426k1712P807j175R330K1121J9206p326l4968Q395K4930
$$ y = [668270, 684757, 716485, 705425, 698080, 697319, 694367, 669506, 652027, 669282, 694227, 684367, 644401, 647932, 655133, 679698, 663888, 648032, 644628, 645745, 649506, 642392, 623437, 617363, 611077, 607867, 609272, 633332, 648544, 664914, 683710, 664255, 636604, 651346, 615039, 580370, 598952, 601610, 607676, 640844, 634556, 628485, 621723, 608293, 580169, 550650, 529805, 527821, 557874, 579034, 592351, 580986, 591607, 582760, 562289, 583539, 564459, 541546, 544243, 567724, 577668, 580115, 569806, 560028, 563896, 559859, 568005, 564142, 548605, 559437, 545911, 540842, 538173, 515285, 516630, 531473, 537667, 545587, 520335, 492832, 479916, 473763, 452197, 449201, 472392, 463308, 471410, 481400, 500399, 480973, 459261, 467068, 465893, 475223, 496344, 515550, 508224, 473256, 481651, 506581]
11325E06581L511k6043j2017K854q668m143l481j3699l843k374r280j583n286
11312D22529J6253L241K905n757J7381J4762j4246k094O728j0271j9839j5609
11300D15983K3681j243j2114k549R373M465j2517J5789J3746J0519j4031k9283
11288D21819o552K3002K1860j0644j3460K5558j0861l5532P17K9845J1317k0954
11276D36115o3424k3408K070L1878J8712R417k9271K5323K4394o816J5276l603
11264D36663k2730k3795K246L511L952K1175n29j7863Q85p786j167q974j1986
11251C73602J3165J007M437l877j1832j3080k8835j3502R144J1759K0204N041
11239C67233l8835O593J5997j3219N028J126J7735L344m3696n41M5213k8648k5021
$$ y = [506581, 510092, 484049, 472032, 474886, 466218, 462075, 458594, 444895, 441052, 438678, 429398, 427815, 422529, 438782, 442023, 444928, 439171, 456552, 471314, 457068, 454974, 461702, 451431, 431592, 415983, 439664, 438421, 426307, 423758, 433131, 437596, 425079, 440868, 454614, 465133, 451102, 421819, 415267, 438269, 460129, 449485, 436025, 461583, 450722, 415190, 415907, 445752, 457069, 436115, 372691, 349283, 351353, 383231, 401943, 411360, 382089, 407412, 431806, 424990, 440266, 436663, 413933, 390138, 392384, 395895, 399847, 421022, 420493, 402630, 403515, 395729, 394562, 385588, 373602, 386767, 387774, 392211, 388334, 376502, 363422, 334587, 321085, 330229, 341988, 362192, 367233, 328398, 334991, 350988, 337769, 342797, 343923, 361658, 365002, 321306, 320765, 365978, 337330, 312309]
11226C12309R748R602j2137K998N420k625n513O582P547q284M120K4561J793J7236
11212C73357K418J188k279j6915K712K847j6625l4164p226J4335J7164K2357j476
11199C57693n353J6723k5851o406L3433K4412l701j7574j113j1947j209j9016
11187C40091j3115n895R759l9179l5104j3428K8581J4883J6255K4434M0876j0025
11175C58133m7722k410J3833j4439L8029j799p436r278m659J61o35J6986l809
11162C34955k0138O443n834j9281j1940j1061K301J3595p498J4863L9900R828
11150C46133k6034l6755k3061K2206J0206m9579k3570j2724J9274k4715J231J9635
11138B22247K1154n69J732J0696j5241o921Q68m98K5182J6785l845o878j2972
$$ y = [312309, 322057, 331659, 319522, 322520, 327940, 325315, 319802, 326384, 333931, 325647, 329767, 354328, 356121, 373357, 375775, 376963, 374684, 357769, 360481, 363328, 346703, 312539, 305313, 319648, 336812, 359169, 357693, 352340, 369063, 343212, 336806, 370239, 394651, 390950, 373376, 372263, 360316, 359107, 340091, 326976, 321081, 330840, 291661, 256557, 243129, 271710, 286593, 302848, 327282, 368158, 358133, 310411, 308001, 321834, 307395, 345424, 343625, 336189, 326911, 322252, 322413, 321778, 338764, 334955, 314817, 321260, 315426, 296145, 284205, 273144, 275445, 289040, 281542, 296405, 336305, 346133, 320099, 283344, 260283, 282489, 292695, 243116, 219546, 206822, 226096, 201381, 202612, 222247, 243401, 242832, 244564, 255260, 240019, 233098, 233966, 233468, 258650, 275435, 271590, 264712, 251740]
11125B51740N002Q631j950N244L357p224j4262o368J186q863r709n292L679R84
11111B26155k3442q569P720J5499M2328J346p460n272k9490k9144N260J2517o975
11098B00473Q704J6538O86k3284P365M1474K7177k6275n4733L091P512j2873O903
11085B02758k3241j0530l651J1861R027k35Q877n668K043Q371N382L449k189l9033
11071A67221m977J1620K1000J0829l726N453k2612r741K3171J6853N313k0936
11059A99468j6162l485K8034n790j2508J0289J2286j611L190N845O921J6221M0929
11046B83627J8931J0175j6307P03j5037j0447K5305K8293R368L4730J5022J8817
11034D03180M4199L7608j4k2611m472j9604m8557o0223L1036N5567M9066O4934
$$ y = [251740, 256742, 265373, 263423, 268667, 272024, 264800, 250538, 244170, 245356, 236493, 226784, 221492, 225171, 226155, 202713, 194144, 201864, 217363, 259691, 261037, 253577, 248305, 218815, 189671, 194931, 207448, 200473, 209177, 225715, 226401, 203117, 210482, 251956, 279133, 252858, 198125, 201216, 208728, 195855, 202758, 179517, 168987, 165336, 177197, 186224, 185989, 194866, 189198, 191241, 199612, 204994, 208443, 206254, 167221, 162244, 173864, 194864, 205693, 201967, 207420, 184808, 175067, 198238, 215091, 220404, 199468, 183306, 179821, 207855, 202065, 189557, 199846, 212132, 210521, 213711, 219556, 226477, 242698, 283627, 302558, 312733, 296426, 297129, 282092, 271645, 296950, 325243, 334611, 369341, 384363, 403180, 447379, 484987, 484973, 462362, 457890, 438286, 389729, 329506, 360542, 416109, 465175, 530109]
11022E30109L3870K3913p517n8865l1768l537l1591k6457n0644Q821J3003J7041
11010D16378L1832K4365j4868k8177l5754n3740l3756k2063L977J0281p14r044
10998B88717p870L852N691k1693m2629m6909o906J9980N4k893L159P732l2667
10985A67618l8056j4807Q393N1024J277j4883j3367L856Q892k880k8358L535K3589
10972A55833k4992k7789J2049K2767r321K031N718K042J1189K5740M923j7189
10960A63001J08n805k8201j4697K274l47j1271j6080O624J5202J0830L4247L5689
10947A91574K320l8461p95j4168N527k2883K4315R209k8805R621k5878N632J4368
10934A31576j7555p520k6128J3651J378j0984K6256m81j0249Q278j35n2545p395
$$ y = [530109, 563979, 587892, 580375, 521510, 489742, 486205, 454614, 428157, 377513, 386334, 399337, 416378, 448210, 472575, 457707, 429530, 393776, 340036, 306280, 284217, 288194, 298475, 297761, 288717, 280847, 284699, 290390, 268697, 226068, 179159, 172253, 192233, 192287, 189394, 192553, 200285, 167618, 129562, 114755, 123148, 174172, 175449, 160566, 147199, 151055, 159947, 157067, 128709, 132244, 155833, 130841, 103052, 115101, 137868, 128547, 130578, 136296, 138338, 149527, 175267, 180190, 163001, 163109, 157304, 129103, 114406, 116680, 116333, 105062, 88982, 95606, 110808, 121638, 155885, 191574, 193894, 155433, 154638, 140470, 145997, 123114, 147429, 156638, 127833, 137454, 111576, 117208, 131576, 114021, 106501, 80373, 94024, 95402, 84418, 110674, 110193, 99944, 108222, 108087, 55542, 48147]
10921D8147M3663K9748J5312k8795j97J2603j1474Q112J6197r894l253K1141p149
10908A34161j0318o861R593L001p666j6778j836J7940J3753j0422j4732k2890
10896H6945k045L5320O766k0190j3753L764l5776k8813L3098R538j429O286J9483
10883I9194m053J4437L2617k1072n924q098j2291k2113n636J7377p882R89K8981
10870A06526n04J154n233J5054M393j0962l106j1066j2033K4681k3891j688K3559
10857A06884N525k7554l0835K7461J28k5263J0776j6388p425L6115J7151K952
10845I9527K216r55k7390M211J4170q670k2237k0819p11J4158l410p203r848J0218
10831D3257K6722J301k6095P514Q984N516Q418J490J2585j0932j2760N611k3241
$$ y = [48147, 91810, 121558, 136870, 108075, 107878, 120481, 109007, 117119, 133316, 123422, 120169, 141310, 134161, 123843, 116982, 126575, 129576, 121910, 105132, 103296, 121236, 134989, 124567, 109835, 86945, 84900, 120220, 126986, 106796, 93043, 96807, 61031, 32218, 65316, 74854, 73425, 79711, 99194, 95141, 109578, 142195, 121123, 115199, 107101, 94810, 72697, 67061, 84438, 76556, 77545, 106526, 106022, 107176, 101943, 116997, 121390, 110428, 107322, 96256, 84223, 108904, 85013, 83325, 106884, 112409, 84855, 54020, 81481, 81609, 56346, 67122, 50734, 43309, 79424, 96575, 99527, 101743, 100788, 73398, 77609, 91779, 83109, 60872, 40053, 39342, 53500, 50090, 42887, 33039, 43257, 69979, 71280, 45185, 52699, 61683, 67199, 75617, 77107, 89692, 78760, 66000, 71611, 48370]
10818D8370k3913k6947J0518K0603J4840q48k4962L3339K2879J145L317j0775
10806F7566k2898j4800k09p946k5582m084M3069K7966L288q331m2934r244K6802
10793C2663L1719J629m4061o5153L1816J3895M342j2929L012J2385K1005k85n910
10780B4128j2373k7986R391p165j0640N641m409N979N6060p696k8932K1507M735
10767B8240l2745k2743J3920J1621J3325j3798J9219n708p857p226k9181k1526
10755e4459J1670L7503M977q002j6434J825j5003j0907L165K6717K4599l191r738
10742g278j2009O797J2980O57j1607N745M259p767j1054J1339J931n961Q283K529
10728a156k3795K6703J4316l3548l4615P834R255L0774J5645J1843j4510j575
$$ y = [48370, 24457, -2490, 8028, 28631, 43471, 42623, 17661, 51000, 73879, 75024, 78341, 67566, 44668, 29868, 29659, 21713, -3869, -7953, 35116, 63082, 66370, 58039, 15105, 5861, 32663, 64382, 66011, 21950, -43203, -11387, 2508, 6850, -6079, -3067, 9318, 30323, 30038, 24128, 11755, -16231, -6840, -14005, -24645, -19004, -23413, -17434, 38626, 30930, 1998, 23505, 28240, -4505, -27248, -13328, -1707, 11618, -2180, 17039, 11331, 3474, -3752, -32933, -54459, -42789, -5286, -309, -8311, -24745, -22920, -37923, -48830, -45665, -18948, 5651, 2460, -7278, -19287, -12490, 490, 1147, -10460, -4715, -456, -8223, -19277, -7938, -6007, -11968, -3685, -1156, -24951, 1752, 16068, -17480, -52095, -44261, -35006, -4232, 11413, 23256, 8746, 7171]
10716G171R796j7652r497J5083J5904j8851p197L178q705m1075k790K8914J4329
10703a1392k932J0893j005L039j661j7708k1916K0698N784L000Q867J4989j3169
10690b513p444L608K479Q966N074o660j0717K6302J807k4011l2119k06M69P314
10676b7651m165k8466k1972j2672L195K3391K3648j92j5378r822P123L5442K835
10663b4684M282L736j5411N47J6932L6516M811n5413j526Q96K8217J6449j1265
10650D087L7153P649P343m693J2794J0677N583N5498k393J7124M1445l825L1893
10637B20335L1561P0079N1318J20059J44144J66330J49524J16444R4492R0293
10627A254579J33848K19484K46830L87883N41456P64691J054701J366371J878587
$$ y = [7171, 16967, -685, -10182, 4901, 20805, 1954, -5243, -2065, -10770, -51845, -54635, -25721, -11392, -14324, -3431, -4436, -1397, -3058, -20766, -42682, -21984, -16200, -13200, -4333, 10656, -2513, -9957, -6349, -3870, 5096, 10170, 3510, -7207, 19095, 20902, -3109, -35228, -35434, -34965, -27651, -31816, -60282, -82254, -94926, -91731, -68340, -44692, -44884, -60262, -70084, -62961, -27519, -24684, -20402, -16666, -32077, -31530, -14598, 21918, 26729, -28684, -30210, -29314, -1097, 15352, 4087, 41240, 48889, 56232, 51539, 64333, 75010, 80593, 136091, 133698, 150822, 192267, 188442, 220335, 251896, 321975, 373293, 493352, 637496, 803826, 953350, 1069794, 1164286, 1254579, 1388427, 1607911, 1854741, 2242624, 2784080, 3548771, 4603472, 5969843, 7848430]
10618G848430K474597L081135L558744L315227K198252O60846o48846j111623
10610B1376762p59763R1554J242389K694121M390928O112188P205370O487698
10602D8841247L390395q27254l899318m591428l454350j499397P04300L076703
10594D1740898N637597P963770R094509P377569K271582m017959q137878q683128
10586E3246960o923202m525148k065944K25422K354039M048271M670925L204779
10578E4236102m79183m562550o928979o899523n484849l705110k123717p91231
10570B3260960K85592R75670J038905K76286j225032k741191l548027l499326
10562A4823837k905253k295310j734809j276538j016824p30964n41382m61675
$$ y = [7848430, 10323027, 13404162, 16962906, 20278133, 22476385, 23137231, 22488385, 21376762, 20616999, 20708553, 21950942, 24645063, 29035991, 35148179, 42353549, 48841247, 52231642, 51404388, 47505070, 42913642, 39459292, 37959895, 38664195, 41740898, 47378495, 55342265, 64436774, 71814343, 74085925, 70067966, 61930088, 53246960, 46323758, 41798610, 39732666, 39958088, 42312127, 46360398, 51031323, 54236102, 53756919, 49194369, 42265390, 35365867, 29881018, 26175908, 24052191, 23260960, 23546552, 24522222, 25561127, 25837413, 24612381, 21871190, 18323163, 14823837, 11918584, 9623274, 7888465, 6611927, 5595103, 4864139, 4322757, 3861082]
10554C861082l77046l30032k66763k17400k06477j87745j65388j55885r4431r8868
10544A761047j09011q9714p7730j06670o1227o2607k3997j0257k9980l6939n7256
10533A095659l0503k0391l7447n2885m2179J2173j9510l0054p739j6084k0475
10522H30565O575K1174k4461m7049l2536j2455j6820L650j6865m5263j8988J7945
10510F65472p36o114n3425k4877o483j0252J380j8097k441N956j0027l2630r258
10497D98468J3378J3227l9468k8573j1725k0212j3412J5398R166j1799L82L670
10485D28500R840j510k1671j3273J2044K26l136p99l6525n203J0425J2556Q225
10472C99699K444j3006k358J0977K5900l1436j8888K6789J104J3939k4047m1253
$$ y = [3861082, 3484036, 3154004, 2887241, 2669841, 2463364, 2275619, 2110231, 1954346, 1859915, 1761047, 1652036, 1562322, 1484592, 1377922, 1316695, 1254088, 1230091, 1219834, 1189854, 1152915, 1095659, 1065156, 1044765, 1007318, 954433, 912254, 924427, 904917, 874863, 867124, 851040, 830565, 837140, 858314, 833853, 786804, 754268, 741813, 724993, 728643, 711778, 666515, 647527, 665472, 664736, 658622, 605197, 580320, 573837, 563585, 564965, 546868, 544427, 550383, 540356, 507726, 498468, 511846, 525073, 485605, 457032, 445307, 425095, 411683, 427081, 436247, 424448, 424830, 428500, 438340, 436830, 415159, 401886, 413930, 414156, 411020, 410221, 373696, 368493, 378918, 391474, 399699, 402143, 389137, 386779, 397756, 423656, 392220, 373332, 400121, 401225, 415164, 391117, 349864]
10460C49864j4616n664q633l968L221k131L49K9792L9351R355l057k0208J6789
10447C90444P821k5587j5988J5914k831k0441J6949J549j7220K889R123l4777
10435C27845n338q25L124l5419k7641m110L1702L2676j3086m636k1509R910J803
10422B94496k9315j1963j731Q239L3473L4009Q235j5045m6950j8135p493N24M968
10409B53312J1137m2074j0310J5161J6619j6675R208M4469j0630j468J5184l829
10397B80104J0843q316j5626J9682j9130j1652j064l0657K2353J5924p0628j3055
10385A78778K2179L496J8216J2515j5948j0338j1978J5853j3995m775K9186k4665
10373A98524l0033L2128L2792k4390m2514M471K059q782K9597O144o644m686L169
$$ y = [349864, 335248, 329584, 320951, 316983, 320204, 318073, 318422, 348214, 387565, 396920, 393863, 373655, 390444, 398265, 372678, 356690, 372604, 369773, 349332, 366281, 367830, 350610, 353499, 362622, 327845, 322507, 321682, 324806, 289387, 261746, 257636, 289338, 322014, 308928, 304292, 282783, 292693, 294496, 265181, 253218, 251487, 259726, 293199, 327208, 335443, 320398, 273448, 255313, 247820, 248344, 253312, 264449, 222375, 212065, 227226, 243845, 227170, 236378, 280847, 270217, 268749, 283933, 280104, 290947, 282631, 267005, 286687, 267557, 255905, 254841, 224184, 246537, 262461, 191833, 178778, 200957, 204453, 222669, 235184, 219236, 208898, 196920, 212773, 198778, 194003, 223189, 198524, 168491, 200619, 233411, 209021, 166507, 170978, 173037, 164255, 193852, 199996, 193352, 188666, 191835]
10360A91835k312R790L8029M065J9725j4290j8828k004K095J689M181K8675O344
10347B68994o106j9256n8400j0348j0557K5743Q658L0763K877k7957k9744K010
10335A76677J8667J0797k0987N664K25K986o608k8281K378j560J498J2866j129
10322A73193m899j0195Q809K387L2137O781p665o252J1633p06l4575k1285j3314
10309A36049r537R659J4274K8021j476J776k1064l405k4065l816K8804J7990j4129
10296A59081k799J9807K0776J4936n426l7092o091r677j4920r586j627j2461J3570
10283A28491J3025k9802k7905J529N658N381L1274J8623r814k06J254j1756j4406
10270A11346J6593j4155J135k6537J0225J6738j3401K347L4004J6681r508J3740
$$ y = [191835, 189523, 199313, 237342, 241407, 261132, 246842, 228014, 226010, 228105, 229794, 233975, 262650, 268994, 262888, 243632, 185232, 174884, 164327, 190070, 198728, 229491, 232368, 204411, 174667, 176677, 195344, 206141, 185154, 190818, 191043, 194029, 187421, 159140, 161518, 159958, 161456, 174322, 173193, 168294, 158099, 166908, 169295, 201432, 208213, 200548, 194296, 205929, 205223, 170648, 149363, 136049, 126512, 136171, 150445, 178466, 176990, 178766, 157702, 154297, 130232, 126416, 155220, 173210, 159081, 156282, 176089, 196865, 211801, 206375, 169283, 163192, 153515, 138595, 129009, 127382, 114921, 128491, 141516, 111714, 83809, 85338, 90996, 96377, 127651, 146274, 136460, 136254, 137508, 125752, 111346, 127939, 113784, 114919, 88382, 98607, 115345, 101944, 104291, 138295, 154976, 145468, 159208]
10258A59208N233J434l1417l8839P141J288K3489K7717K1384j1680k3974j6700
10246A24284J4773K683k042j5239J2868J9480j8604m837K1501J5423l6616j2596
10234A21078L2394J4542k0767P892l768l9170k57J7778O990k4889l1664k5854
10222E4305n352L2668L2538j4133j2941K7803J8219R512k4909k3143j8609J0683
10210H6641m226j8461J855K6013J922o051R307K5913P192k455j2694Q964j8774
10197A05146k810J0538J2168l1454K4782K2369j6432n029K8047l298l0904K439
10185A15562K0805L0108k9433M502J8817K1971K7693M4567K3797j3573J6047O360
10173B87223n162K898R459p913k4024N4960O5659M8343R291k53m0547o0015m1650
$$ y = [159208, 164441, 165875, 134458, 95619, 102760, 104048, 127537, 155254, 176638, 164958, 140984, 124284, 139057, 141740, 139698, 124459, 137327, 156807, 138203, 133366, 154867, 170290, 133674, 121078, 153472, 168014, 147247, 155139, 151371, 112201, 111944, 129722, 136712, 111823, 80159, 54305, 48953, 81621, 114159, 100026, 87085, 114888, 133107, 142619, 117710, 94567, 75958, 86641, 82415, 63954, 65809, 91822, 93744, 87693, 97000, 122913, 130105, 127650, 114956, 123920, 105146, 102336, 112874, 125042, 93588, 118370, 140739, 124307, 119278, 147325, 144027, 113123, 115562, 136367, 166475, 137042, 141544, 160361, 182332, 210025, 254592, 278389, 264816, 280863, 287223, 282061, 284959, 294418, 286505, 262481, 317441, 383100, 431443, 440734, 440481, 399934, 339919, 298269]
10160B98269O013L5664R040J3682M5406O1012L2579k0720k604k2882m8785k8952
10148C77722J9927j101k2817k4716q51K1695M4133r938o9591n0677j7851k8867
10136B37068j5005o252N491m519K065R533j3669q483m0111l6916j6779j7019J2007
10123A07411l259P836J89K4135K5176k3538j6164J7248L6488J6225l4337j5820
10111A41590N189m0479j2526j6910J7746J6153K495j6541J530m788O481M085m047
10098I9978j6164k2130q039J1707n794J0185j177K8126M446K3203q731k3793k8789
10085F3028l0707R763L2925P808n151m309l826k9863o267K1689O2944M0486j7769
10072A40751J2679j9330j2233o38P522k9606m0799j4862J8386O206J5844j7759
$$ y = [298269, 304282, 339946, 348986, 362668, 408074, 469086, 501665, 480945, 478341, 455459, 406674, 377722, 397649, 396548, 373731, 349015, 348164, 369859, 413992, 404054, 334463, 283786, 265935, 237068, 222063, 215811, 221302, 216783, 218848, 228381, 214712, 206229, 166118, 129202, 112423, 95404, 107411, 104152, 111988, 112177, 136312, 161488, 137950, 121786, 139034, 175522, 191747, 157410, 141590, 146779, 106300, 93774, 76864, 94610, 110763, 113258, 96717, 98247, 93459, 99940, 104025, 99978, 83814, 61684, 53645, 65352, 59558, 69743, 68566, 96692, 101138, 124341, 115610, 91817, 63028, 32321, 42084, 75009, 82817, 77666, 73357, 69531, 39668, 33401, 55090, 118034, 158520, 140751, 153430, 134100, 121867, 121229, 128751, 99145, 58346, 43484, 61870, 68076, 83920, 66161]
10060F6161j89L3445L539k399R280K1425J1926l5626l7216j3582O451J5176L65
10047G8756o732l871J5999J5658M423j7437j6370J9493K9438J2425j2731j3809
10035A05242j5465r519K671j3303Q406R200k069J3527j8062k0830p64L800m365
10022E8469J5767K4876k4257r445k0284L761J3934O449Q242L408L845j012q459
10009G5294l8975q672J7761M532L711J4770J2560j4439J284L600L1399p014l1018
9996F4793J6529L2972K1553l0182N768l512J4267Q202j3704k8752N315R856j5059
9983H8046k7829j937K031k250K316J4947J4338K2890j6647k3393j3557j5525J8706
9970F2136L1841L242K43J3390j869m964j9086J5917r98p832J4878M926j5204j9265
$$ y = [66161, 65972, 99417, 102956, 100557, 109837, 131262, 143188, 107562, 70346, 56764, 63215, 78391, 78756, 72024, 68153, 84152, 99810, 104233, 86796, 70426, 89919, 119357, 131782, 119051, 105242, 89777, 80258, 82929, 69626, 78032, 87232, 85163, 98690, 80628, 59798, 59034, 62834, 58469, 74236, 99112, 74855, 65410, 45126, 48887, 62821, 69270, 77512, 80920, 84765, 83753, 75294, 36319, 27647, 45408, 49940, 53651, 68421, 80981, 66542, 67826, 71426, 102825, 95811, 64793, 81322, 114294, 135847, 105665, 111433, 107921, 122188, 130390, 116686, 87934, 93249, 103105, 88046, 60217, 58280, 60311, 58061, 60377, 75324, 89662, 112552, 95905, 72512, 58955, 43430, 62136, 93977, 97219, 97462, 110852, 108983, 104019, 84933, 100850, 99852, 92020, 106898, 111824, 96620, 77355]
9956G7355k0960j1666j0419J8705J3198L203Q072l889k5331J4466J1598j0290
9944F4042j2322J5895L379J9593J0171M129J9791L97j4058j3117m311n146n249
9931H3194J3589L7017J947J0905J476j7300r141r028j4713J5471L1355o840n3126
9918H4806k3045j8023o693J9054p081k6200j2847L6006m368j2134J2413J3228
9906E5116J3893l608l536J5508r834k519O037k0511q234J4858l3951R109K4015
9893E6343n11K4906j4781k0496Q716K0654P517k5059k7640j5578K8646N054P396
9880E5167K4739J4158o049k1683n695L966k4367J5824L1962P761k105L457q628
9867H8507k5469j1380J192L3495j5270m5944L290k183P892L4069L0703M177j6038
$$ y = [77355, 56395, 44729, 34310, 53015, 66213, 69416, 77488, 73599, 48268, 62734, 74332, 64042, 51720, 67615, 70994, 90587, 100758, 104887, 124678, 125075, 111017, 97900, 93589, 88443, 83194, 96783, 133800, 135747, 146652, 148128, 130828, 121687, 112659, 97946, 113417, 144772, 137932, 84806, 61761, 43738, 37045, 56099, 49018, 22818, 9971, 45977, 41609, 29475, 41888, 55116, 69009, 65401, 61865, 77373, 67539, 65020, 71057, 50546, 42312, 57170, 23219, 32328, 56343, 55832, 80738, 65957, 45461, 54177, 74831, 82348, 57289, 29649, 14071, 42717, 47771, 55167, 79906, 94064, 88015, 66332, 60637, 64603, 40236, 56060, 88022, 95783, 93678, 97135, 88507, 63038, 51658, 52850, 86345, 71075, 25131, 28421, 26238, 34130, 68199, 98902, 103079, 87041]
9854H7041K668K3154j2138k7088j3884l91J3948j8171k667K5574J0391p510r849
9841G1078o086o052j0980o487O95R206M1834J9117j2725l306l263o2728K781K5349
9827E8433r432j3394p332k212K6556K3314k3852k2568m52j2842p091K8144L1513
9814F8785K6690r068j9585j6286k771J3130l1735o576j2199k4N935N942J5489
9801C7727L1887j914l4904j7782J3777L4469J5286M177N497m6208k1921K1664
9789D1755J3883k0599J2659K8463M117r016l5662l481n863J9827R449J8022M904
9776G8458m716k61J3006j5260m1987q196O307k955N048M886J6623J9663l964k3010
9762D3642M556J2154J6391j2035m971K3158p633k5390K4370J2993j5549L1604
$$ y = [87041, 89709, 112863, 100725, 73637, 59753, 59362, 73310, 55139, 52472, 78046, 88437, 80927, 71078, 64992, 58940, 47960, 41473, 42168, 51374, 93208, 112325, 99600, 96294, 93031, 30303, 33084, 58433, 49001, 35607, 28275, 26063, 52619, 75933, 52081, 29513, 29061, 16219, 9128, 37272, 68785, 95475, 86407, 66822, 50536, 47765, 60895, 29160, 22584, 10385, 10361, 16296, 22238, 37727, 69614, 67700, 32796, 15014, 28791, 63260, 78546, 82723, 88220, 42012, 20091, 41755, 55638, 35039, 47698, 76161, 80278, 71262, 35600, 32119, 26256, 46083, 55532, 73554, 78458, 73742, 73481, 86487, 71227, 29240, 21044, 27351, 24396, 29444, 34330, 50953, 70616, 66652, 43642, 48198, 60352, 76743, 64708, 59737, 82895, 75262, 49872, 74242, 87235, 71686, 103290]
9750A03290M640J9612j9690l7343k0237p991q251o088k057j5320J814k456K3602
9737C3525R373J934p87l4370k2648L3777J5733j3534L0088K1266j8538K600O662
9724F5081j4870j0353R140J8509j4471k1091o544q675K2393M0782P819J1112O263
9711A05095k5048l0920J259K0615m165l5579k5312M3134J6335o760k6180k0702
9699A1772J2352j5627P945K1074J7435m978n519K2850J4089q193q679m305l2018
9686B8198R395r603k300O161j1820J1609O260J21J0253J6615L81j834j9354m1875
9672B207L4094K7757k2101k9526L438j8402j64J3863J8043o02J7459K3636r623
9659F0079k2686r942m615J9251J5507n47J9215n42K7451L0188K8337J8548k6206
$$ y = [103290, 107930, 127542, 107852, 70509, 50272, 42281, 34030, 27942, 25885, 10565, 12379, 9923, 33525, 42898, 44832, 44045, 9675, -12973, 20804, 36537, 23003, 53091, 74357, 55819, 58419, 65081, 50211, 39858, 48998, 67507, 53036, 31945, 25401, 16726, 39119, 79901, 87720, 98832, 105095, 80047, 49127, 50386, 71001, 66836, 31257, 5945, 49079, 65414, 58654, 32474, 11772, 24124, 8497, 16442, 37516, 54951, 49973, 44454, 67304, 81393, 73200, 64521, 60216, 28198, 37593, 27990, 25690, 31851, 20031, 31640, 37900, 38021, 48274, 64889, 65270, 63436, 44082, 2207, 36301, 64058, 41957, 12431, 15869, -2533, -2697, 11166, 29209, 28607, 46066, 69702, 60079, 37393, 27451, 22836, 42087, 57594, 57047, 76262, 75720, 103171, 133359, 161696, 180244, 154038]
9646A54038j8490j7303k7507j6776k3558j1980j7657J0840J6583N315k3786j4609
9634A5110J4294O232m493j236j3255K7721J401J8210K0553k3312j8224j5239j2909
9621A4853J2583J1748P707j4273J466J3817J0714l1368q282n206K2279L4350J6178
9608H6566n104j8598k3281Q726K3678Q437J42j2291k2960j5099j6069K0354M2763
9595G7264L7220O997k7778l1364p217l508J2353R171j3066j6387R142l55j2008
9582D0464N726k5958j5069R488K4373K9495k9152j3800J0042J6359o049N198q718
9569D2399O707j0486k3035L498j0012P836L0910K668j7846J0389j019j9460r083
9556A3466k0633J4353J2280l245J3201j7417j4498J5599K1916K3348M426k3893
$$ y = [154038, 135548, 118245, 90738, 73962, 50404, 38424, 20767, 31607, 48190, 53505, 29719, 15110, 29404, 35636, 31143, 29907, 16652, 44373, 45774, 63984, 84537, 61225, 43001, 27762, 14853, 27436, 39184, 46891, 32618, 34084, 47901, 58615, 27247, 18965, 13759, 36038, 70388, 86566, 81462, 62864, 39583, 48309, 71987, 80424, 80566, 68275, 45315, 30216, 14147, 34501, 77264, 114484, 121481, 93703, 62339, 55122, 51614, 63967, 73138, 60072, 43685, 52827, 52472, 40464, 46190, 20232, 5163, 14651, 39024, 68519, 39367, 25567, 35609, 51968, 45919, 51117, 42399, 49106, 38620, 15585, 19083, 9071, 16907, 47817, 50485, 32639, 43028, 42009, 22549, 13466, -7167, 7186, 19466, 16221, 29422, 12005, -2493, 13106, 35022, 58370, 62796, 38903]
9544C8903K378j722j0914L413n313q922k7690J4478M3101J5012r35K5242k4905
9531F2126j2488m004j4269l340J9946J5594K549R461J3462j2351l3928j2239j9413
9518A1106N563K2330n888J2079K0168j4994o790O115j6170O090j0445J2362J2438
9505E3964J0744j5467j7129K6583j970l9130k0115K4952J3307K0125j5657j3566
9493B6641m8237j6950K955K8385O639r021J4935M4430k413j0987J4197l614j6971
9480B9989o083K1138j255k0176j4396j8187P777J1414K5300P057j4703l1326n192
9467h643m677J1053P143Q083q565l254m176J7471L9857K908j4161J1155l5132
9454A9062j7379K4368o461P323R765Q93L868L194R570m082j9735k0692m269J9503
$$ y = [38903, 41281, 39559, 28645, 32058, 26745, 17823, -9867, 4611, 47712, 62724, 61789, 87031, 62126, 49638, 45634, 31365, 28025, 47971, 63565, 66114, 75575, 89037, 76686, 42758, 30519, 11106, 16669, 38999, 33111, 45190, 65358, 50364, 43574, 49689, 33519, 39609, 29164, 41526, 53964, 64708, 49241, 32112, 58695, 56725, 17595, -2520, 22432, 35739, 55864, 40207, 26641, -21596, -38546, -35591, -7206, -567, -9588, 5347, 49777, 47364, 36377, 50574, 46960, 29989, 23906, 45044, 43789, 23613, 9217, -8970, -1193, 10221, 35521, 42578, 27875, -3451, -8643, -13320, -2267, 4876, 12959, 4394, 1140, -3036, 14435, 54292, 57200, 43039, 54194, 19062, 1683, 26051, 19590, 26913, 36678, 37571, 41439, 44633, 54203, 50121, 30386, 9694, 5425, 24928]
9440B4928j7149J2357J3139M392k4104j0525L544J7797P357J8390K2898R442m0851
9427D1615k1754j76l046J2282J1827j1026j0437K7914l3993j6997K6914K2255
9415D5378j4891j7568j4792j6552K6174j933m668m237j0277p740L4887M232o940
9402A1073j6221j7525L841J1631J1324j6330P590J8818N28K887N675K4446P220
9389E4957q473k6959o155J2445J9482k911k5730j687K3274J9297k541j5354o16
9376C9029N499K7496l5696l1907k855J1102J1289j325P150r138l3582k17J3892
9363G37q89K2582k0977Q977K4613j9425j2405j6522L1098O833J7238J7385j1647
9350D7598k7490j4493J4902j2733J7231p896l277J5136J3156J9073P509j4706
$$ y = [24928, 7779, 20136, 33275, 37667, 13563, 3038, 6582, 24379, 31736, 50126, 73024, 82466, 41615, 19861, 19685, 16639, 28921, 40748, 29722, 19285, 47199, 13206, -3791, 23123, 45378, 30487, 12919, -1873, -18425, 7749, 5816, 1148, -3089, -13366, -21106, 13781, 18013, 11073, -5148, -22673, -18832, -7201, 4123, -12207, -4617, 14201, 14729, 17616, 23291, 47737, 54957, 46484, 19525, 13370, 25815, 45297, 42386, 16656, 14969, 38243, 57540, 54999, 39645, 39029, 44528, 72024, 36328, 4421, 1566, 12668, 23957, 22632, 29782, 20644, -12938, -13155, 737, -152, 22430, 1453, 10430, 35043, 15618, 3213, -13309, 17789, 24622, 41860, 59245, 47598, 20108, 5615, 20517, 7784, 25015, 17119, 13842, 28978, 42134, 61207, 68716, 54010]
9338E4010j2221j6162O342O799J9289N972R937j0358L492k7591o977Q667k5253
9325A5946j4442N065K652L0617J1807k5850m0389j0126M402J9273N5067M1353
9313I5375j2011l9243K5897J1368k3251m595P593k2483m1426J0344J0222J5414
9301C3204Q12l342p48Q104q604J4225j8363l5898K0527K1396k5376J0194K5723
9288D1854n370l6289Q092J8935M947l0551L921J5634j2573j4418J4566j307l4913
9275b7472k3192O664K3032J5938j758j9010K2357K5282k6899j0668L06O931K3968
9262A5479K5687J4419N51O001m926M01J9222k4505m3846j1069L3095K5369J2064
9249F7942j1122j7507j7629l1400k2639N548K6364J1221j4710L638K2797k4565
$$ y = [54010, 41789, 25627, 31969, 38768, 58057, 64029, 73966, 63608, 67100, 39509, 32532, 41199, 15946, 1504, 6569, 9221, 39838, 51645, 25795, -14594, -24720, -20318, -1045, 54022, 95375, 83364, 44121, 70018, 81386, 58135, 53540, 61133, 38650, -2776, 7568, 17790, 33204, 34016, 30674, 29926, 38030, 29426, 43651, 25288, -10610, 9917, 31313, 5937, 16131, 41854, 36484, 195, 8287, 27222, 32169, 1618, 5539, 21173, 8600, -5818, 8748, 7441, -27472, -50664, -44000, -20968, -5030, -6788, -25798, -3441, 21841, -5058, -15726, -15420, -8489, 15479, 41166, 55585, 56136, 62137, 57211, 57612, 76834, 52329, 8483, -2586, 30509, 55878, 67942, 56820, 39313, 21684, -9716, -32355, -26807, -443, 10778, -3932, -294, 22503, -2062]
9237b062m0764L507K3403K5281N008q11r12j5819J0613K7890J2358J7271r193
9224E5770q258N801J0679j340k9447k6476j0547J6587J1527j3467k9017l168K488
9211a8868j7559K9094N9794O16j4718p498L127p920K635R517j7965j4484n013
9198G58M456k505p042j5690k3q537q426J4294N0878Q124j2095n968k5064l914
9184a0754j3565j436L2056J8975L1504r682j5863K2609K6758k3562k3346m801
9172B8893Q165q929L707J2800K7078K7196j3889k6755o774l2318j2732k8998o779
9159b9335L981J7670m222k3462p650J9261N134K1230k42n449R387K6236n15l435
9145B8589l367O781L2446J5864k1867k1301P44j7733r582J3642K1938K0337j2627
$$ y = [-2062, -42826, -39319, -15916, 9365, 14373, 13562, 12650, -3169, 7444, 35334, 47692, 64963, 55770, 47512, 53313, 63992, 62652, 33205, 6729, -3818, 12769, 24296, 10829, -18188, -21356, -18868, -36427, -7333, 52461, 53077, 38359, 30861, 33988, 26068, 28703, 38220, 20255, 5771, 758, 5214, 2709, -4333, -20023, -20046, -28583, -37009, -22715, 28163, 36287, 24192, 18224, -6840, -10754, -24319, -25755, 6301, 25276, 56780, 47098, 31235, 53844, 80602, 57040, 33694, 28893, 37058, 28129, 31836, 44636, 71714, 98910, 85021, 58266, 51492, 19174, 6442, -22556, -29335, -25354, -7684, -11906, -35368, -43018, -23757, -18623, 2607, 2365, -3084, 6303, 32539, 32024, 28589, 25222, 32003, 64449, 80313, 58446, 37145, 37889, 20156, 10574, 24216, 46154, 66491, 53864]
9132E3864q433k2260k0024O944J3335j4735J577J4923k3857J6045L5658j717l4688
9119A6632k1506L306l4135j8827J3204L8089J7929R687J0963l668l824m084k182
9106B1584j2892P03o826k419O992j6141l8405j9209M1884K9664k3116k0836J8812
9093b0205R470J9407L926o861L976L6899k3000j1426j5867K5505j6240k2132k3210
9080c9758J4124L4971j1943j8140j5507l409J5614L1728K09l8936n712N4792J8406
9067C6439N331j6193m5715j5246J7263j721J568J8066J6831N157R374J0287j9417
9054B2024j6655k0855M717K0452J8412N804j8021o276J5017m849l2491j4758J0879
9041a6600K0929L90k5653l5627Q550J7048J9397k6j6332J0429K7977J7965k778
$$ y = [53864, 45431, 23171, 3147, 10091, 23426, 8691, 10268, 25191, 1334, 17379, 53037, 51320, 16632, -4874, -1568, -35703, -54530, -41326, -3237, 14692, 24379, 35342, 31674, 27850, 23766, 21584, 8692, 9395, 2569, 150, 7142, -8999, -47404, -66613, -24729, 4935, -18181, -39017, -20205, -10735, 8672, 12598, 5737, 9713, 46612, 23612, 12186, -3681, 21824, 5584, -16548, -39758, -25634, 9337, -2606, -20746, -36253, -39662, -24048, 7680, 7889, -31047, -36759, 18033, 36439, 41770, 25577, -20138, -35384, -18121, -19842, -18274, -208, 16623, 21780, 31154, 41441, 22024, 5369, -15486, -10769, 9683, 28095, 33899, 15878, 9602, 24619, 19770, -12721, -27479, -16600, 4329, 4719, -20934, -56561, -48011, -30963, -11566, -11592, -27924, -17495, 10482, 28447, 25669]
9028B5669J1634k1123N057K6527K3291Q731k3686k2034m7249j8241j769k5091
9016e8284j562K8946P131J812J3101J0885n839m888K981j1194P999K1870j439
9003A1519m855J1818j5897N094K2809J6874m274n546j8652m006l83o67k3942l0254
8989d0362j5044M418J3606K5509j4711J5218J5542J7754O533J874l523j0416r387
8976G011J3894p127R073j6464q627O226K1382j519l710J8659K123q379k8800j1223
8962g481L0437K0962J9725Q174j2864K602j9960l0142j327j6053j6656K6155K7605
8949C1177m498l12k042J2425r475j0948n288L8365L7676m9703k4540j0539K5952
8936B8250J4440j9795J5918K97j6634j673K2191J3590j6814k7617J6924P629k9050
$$ y = [25669, 37303, 16180, 21237, 47764, 71055, 79786, 56100, 34066, -13183, -31424, -33193, -58284, -59846, -30900, -23769, -21957, -8856, 2029, -3810, -8698, -5717, -16911, -8912, 12958, 11519, 6664, 18482, 2585, 7679, 30488, 47362, 43088, 37542, 18890, 14884, 14501, 13834, -10108, -40362, -55406, -50988, -37382, -11873, -26584, -11366, 4176, 21930, 28463, 30337, 26814, 16398, 7011, 20905, 13778, 22851, 6387, -2240, 3986, 25368, 23849, 20139, 38798, 40921, 32542, 3742, -7481, 22956, 43918, 63643, 71817, 58953, 61555, 41595, 11453, 10126, -5927, -22583, 3572, 31177, 26679, 26367, 24325, 36750, 27275, 16327, 11039, 49404, 87080, 37377, 12837, 2298, 28250, 42690, 22895, 38813, 39110, 22476, 20803, 42994, 56584, 39770, 12153, 29077, 36706, 7656]
8923G656j3837K0080M266L102j793j1034j353k7150k0690j9287M0355M3394j5035
8910H674k526K5254J7716p593r165k1146q669J4674k1309o386O710J4246j091
8897I389K0120O157M586L07q500K596j7212p188q547Q415l0514r925L0020m061
8883d357N088k959K6693L3891O373j6176P588j2381j3050j1354J0003j3584l4388
8870a8613j0035J4349n97M182L2940L1438K182l3569j5027k0741J5093J7690k331
8857A6961M22K2125K3383j2878k7507p502Q761J1299q653j5622p488K8633j572
8844C0362l2868r652K224r684L759q588P652N602M4391o185j827n619J2191P692
8830C9450l7974k1902K5523P99N533J0766m849Q52j4413m029J2139J2355j6255
$$ y = [7656, -6181, 13899, 18165, 21267, 19474, 8440, 7087, -20063, -40753, -60040, -19685, 23709, 8674, 6148, 31402, 49118, 41525, 32360, 11214, 2545, 17219, -4090, -10476, -3766, 10480, 9389, 29509, 35666, 40252, 40559, 32059, 34655, 17443, 10255, 1708, 10123, -20391, -30316, -296, -4357, 731, -2228, 24465, 58356, 64729, 48553, 56141, 43760, 30710, 19356, 29359, 15775, -18613, -28648, -14299, -14896, -10714, 22226, 53664, 55846, 22277, 7250, -13491, 1602, 19292, 16961, 17383, 39508, 62891, 50013, 22506, 15004, 23765, 35064, 26411, 10789, 3301, 31934, 30362, -2506, -12158, -9934, -19618, -15859, -24447, -16795, -11193, 33198, 27013, 25186, 19567, 31758, 39450, 1476, -20426, 5097, 5896, 11429, 22195, 17346, 18198, 3785, -244, 11895, 24250, 7995]
8817G995k9016n929n488m87l282L5914J859L5327J1437m9183m5182P593K4868
8804a3574M3872R77J462j0053j960l2708J1039P670J1551l0620P138Q595M240
8791G629J1924k206o2L2029J2150l8781Q39Q553l042J739k3797k3320j892j794
8777b0031J9411Q130L060Q674K1256r386j5406K507N422l6421P116K8497M1734
8764F4563k703k4927j5774M496k0924p029J9112j9842j961m416J813k1269J0303
8751a8558J7845q827j0686J9310k948K776j5792J779M9046p329j3398l973J7535
8738B6780J7873j8099j7922j9596j1239k0970J0361K491J9264P548K2363j5472
8726C382p965J0007J2824k0769j8666K3449j7507J0397J0708J4028R685j9357
$$ y = [7995, -21021, -26950, -32438, -32925, -36207, -293, 1566, 36893, 48330, -853, -46035, -38442, -13574, 30298, 31275, 32737, 22684, 20724, -11984, -945, 6725, 18276, -12344, -5206, 3389, 7629, 19553, 17347, 17285, 49314, 61464, 22683, 23522, 32075, 29033, 30772, 6975, -16345, -18237, -20031, -620, 7510, 10570, 19244, 40500, 31114, 15708, 18215, 23637, -12784, -5668, 22829, 64563, 61860, 36933, 21159, 25655, 4731, -2298, 16814, -3028, -4989, -9405, -7592, -28861, -18558, -713, -9540, -20226, -916, -3864, -1088, -16880, -15101, 33945, 26616, 13218, 9245, 26780, 44653, 26554, 8632, -10964, -22203, -43173, -32812, -30321, -11057, -3509, 18854, 3382, -4583, 5424, 18248, -2521, -21187, 2262, -15245, -4848, 5860, 19888, 29573, 10216]
8714A0216J5232k0962j1035R560k4734j0849O861L069J851p067J150j6952k211
8701d5871L267j1030M5004M3448n8603k9633M4854L8241j0388j406j4439j7691
8689a4247L13k8382J8817J5598K1k829M528o445J9348J7132m802K459O046J6497
8675D4054J0196m6454m150L5546M809K066K95J4085j9184k0931j6212p01J4438
8662A7857J488m384k5021n259j5204J3060J9337R718r118J7142M40k5950n544
8649a1438L1496o072l392L55l873J5914l888r01K2945K9820j4336k0867j5188
8636B0575l6123o888Q068L4269N709j6983J2132J4853K6320K293j8669j1148l0795
8623C613p709o687Q68N730j0586p674L308q223j2087M407L0052K68o164J1448
$$ y = [10216, 25448, 4486, -6549, 3011, -21723, -32572, -25711, -22642, -20791, -27858, -26708, -43660, -45871, -42604, -53634, -8630, 34818, -23785, -53418, -8564, 29677, 19289, 17883, 3444, -14247, -13934, -42316, -23499, -7901, -7880, -10709, -6181, -12626, 6722, 23854, 19052, 21511, 27557, 44054, 54250, 7796, 3646, 39192, 44001, 46067, 46362, 60447, 41263, 20332, 4120, 3419, 17857, 19345, 14961, -10060, -15319, -30523, -17463, 1874, 11592, 2474, 19616, 20056, -5894, -11438, 20058, 13986, 10594, 10949, 7076, 22990, 19102, 18201, 41146, 70966, 56630, 35763, 20575, -15548, -22436, -14368, 19901, 25610, 8627, 20759, 35612, 61932, 64225, 45556, 34408, 3613, -4096, -10783, -9915, -4185, -14771, -22445, -19137, -27360, -39447, -35040, -4988, -4720, -10884, 564]
8609E64j584j7409j2252J4291K517R035r72K1116p803J3467N907o722m4316n871
8595c0032J704K1131q25j2086n762K2557K3689j1755M74M4460K3287j7987j4457
8582D4398o135j5028j1970j8774k8599L776P968K3186O988l0250k7137N258K2954
8569b3365J0864J8174J6692o249O616m484O351k743k2272L475N971J6351P091
8556C2472j5306l3791l1652k4863J4372K3888K975J0221K3841j1197l457Q137
8544d360j083n388K240K992j2894r555k198J786L4828L552j1260n701j4196J2750
8530h487j1486r42J3427o411q778N593L2668J1373l7072j8892K4291J582R934
8517F800P634M729L0879J9309m8185j4906r660K972j7492K0047M924l6541O397
$$ y = [564, -1020, -18429, -30681, -16390, -13873, -4838, -5810, 15306, 7503, 20970, 26877, 20155, -24161, -30032, -28328, -7197, -8022, -20108, -25870, -3313, 20376, 8621, 9095, 53555, 76842, 58855, 44398, 38263, 23235, 11265, -7509, -36108, -32332, -24364, -1178, 5810, -24440, -51577, -46319, -23365, -12501, 5673, 22365, 16116, 22732, 18248, 24599, 21856, -416, 3059, 9030, 25381, 32472, 17166, -16625, -48277, -73140, -58768, -34880, -31905, -21684, 2157, -9040, -12497, -4360, -5443, -10831, -8591, -5599, -18493, -28048, -30246, -28460, 6368, 9920, -1340, -7041, -21237, -8487, -19973, -20915, -7488, -13899, -22677, -17084, 15584, 26957, -10115, -29007, -4716, -3134, 6800, 14434, 19163, 50042, 69351, 21166, 6260, -3400, -428, -17920, 2127, 7051, -29490, -23093]
8504b3093k0753j9795J635J1804K5424K5155J4130n268r61j5031j285O704L2064
8491C0730j1606n0896J945P305J8223p282j5022J9026j5069j4633l037K5834N708
8478h774j5819k7306m700Q4J2184J7419M657K3367J1501j6602O188n310M372J6778
8464A8039k6741l2443l769j0694P759K9058Q537K3167K3321L2055L9811r970m2047
8451E6083k1121j0778J3172k654K702K0163r488j532k2130j5621j4137K5353j2140
8438G872j1874J2980L0895j58k2690j4469j1877m482K2060j2284k559j2244n966
8425b4796q393k765N845j5506J7160N3607K3819k8095j8362K0282J4406J4931
8413E2133m0093j9120J6274M7940K2607k4795l4801p338q412j9323J1311L4550
$$ y = [-23093, -43846, -63641, -62006, -50202, -24778, 377, 14507, 9239, 8278, -6753, -8038, -1334, 30730, 19124, -31772, -29827, -22522, -4299, -11581, -26603, -7577, -22646, -37279, -40316, -14482, -8774, -24593, -51899, -56599, -56515, -44331, -26912, -22255, 1112, 12613, -3989, 2199, -3111, 1261, 18039, -8702, -41145, -44914, -55608, -47849, -18791, -10254, 12913, 36234, 68289, 108100, 98130, 56083, 34962, 24184, 37356, 34702, 37404, 57567, 48079, 46547, 24417, 8796, -5341, 20012, 7872, -4002, 8978, 39873, 39715, 17025, 2556, -9321, -13803, 8257, -4027, -6586, -18830, -24796, -33189, -35954, -30109, -45615, -28455, 25152, 48971, 20876, 2514, 22796, 37202, 52133, 12040, -7080, 9194, 57134, 79741, 54946, 20145, 12807, 4395, -14928, -3617, 30933]
8401C0933r543R373K6504j2614L521L125n814K1546J0669l265k9973K0854J3559
8388G8875k1088J443o921k6846j9900K3622M816k9014J4120j0169l792O271l3166
8375b1749l3982K1788J0049K357L638K7823J6928j3211k6676k804l794j0060j5669
8362d5362J1748Q396J6017P971K8498n940J222J4694k879O439J1070J0345p881
8349E4338j2250L930L8060k2818n469j7096J8126q146k1402l0065l4781o003M1989
8336a587m835j6685L985L5515K2028j4133k5036K2474J3952l1020Q165L2675r838
8323C5660o1464l193K289k9150K0024J0423K1617M1088N924k1632j710N503j8191
8310G188j9178J480l851K8926K5981l1092k190J8989j3715n924k1604q165J3035
$$ y = [30933, 21390, 30763, 57267, 44653, 48174, 51299, 45485, 67031, 77700, 74435, 44462, 65316, 78875, 57787, 59230, 52309, 25463, 5563, 29185, 34001, 4987, 19107, 8938, 5146, 11417, -21749, -55731, -33943, -23894, -21537, -17899, 9924, 26852, 13641, -13035, -15839, -19633, -29693, -45362, -33614, -25218, -9201, -1230, 27268, 21328, 22550, 37244, 34365, 40804, 51874, 62219, 54338, 42088, 46018, 84078, 61260, 55791, 38695, 56821, 48675, 27273, -2792, -37573, -43576, -1587, -6422, -23107, -19122, 16393, 38421, 24288, -748, 21726, 35678, 4658, 12823, 45498, 35660, -25804, -28997, -26708, -55858, -35834, -25411, -3794, 37294, 43218, 21586, 19876, 25379, 7188, -11990, -10510, -14361, 14565, 40546, 9454, 7264, 26253, 12538, 6614, -14990, -23155, -10120]
8297a0120J1302n820j4272O3J6490J1591J4059m324l0226j2142l083N29J3128
8284a2825J3266M872J8400p628O601M763N481J6982J06R011J117j0147N99o276
8270D4322l5138r561k655J1387m451l5251k4767K2786N2299J0245M151P073q566
8257C1874R605L19j3891m5656M62J6225q411k1733J9247J1261k2880m734J0343
8244a7969J7639K667M516J424m620O860J9875R868l9213l6065l484J7548n673
8231b6627J4016J4419L0930j1094l3307M287r643R777J0933j2689k7010o348K4737
8218a7619J4145n996p499p597n600P253L6125K8649J2966k1261k2206J1576k0756
8205B180j5134o945j6101J8177P478j0409m694O914N333m77k749J1k0135J3735
$$ y = [-10120, 1182, -4638, -18910, -18847, -2357, 9234, 23293, 18969, -11257, -23399, -26482, -25953, -12825, 441, 5313, 23713, 16085, 22686, 27449, 32930, 49912, 50018, 59029, 60146, 49999, 50598, 44322, 9184, -377, -3032, 8355, 3904, -31347, -56114, -33328, 18971, 29216, 33367, 40440, 31874, 41479, 41798, 27907, -17749, -17287, -1062, -9473, -31206, -11959, -698, -23578, -28312, -17969, -330, 2337, 6853, 8277, 3657, 10517, 30392, 40260, 1047, -35018, -38502, -20954, -26627, -12611, 1808, 32738, 21644, -11663, -7376, -17019, -7242, 3691, -8998, -36008, -42356, -17619, -3474, -9470, -16969, -24566, -30166, -22913, 13212, 41861, 54827, 33566, 11360, 22936, 2180, -12954, -19899, -36000, -17823, -10345, -20754, -25448, -18534, -13201, -13678, -16427, -16416, -36551, -22816]
8191b2816J2231j0155J8357M990o962p006j1383J564J4374L3736K674j7343j0429
8178A832J157K7587q894k2421J6728J0713j3085l1779m392l62K91q988j6768J127
8164d7254q80L702J2847J8636R077Q073p230J3986L4305q571j5230q728r413j5928
8150a2608M104O236K5042P825k0068l2232l1608K6983N0935J2713J9049j0789
8138D5582j1471n773J2598K221L81q745o287k8503j4038j5763J8288N2614P982
8125D9086p986k1087l6812N661O122L3136O838k2630l7620k5461L643J9975J6598
8112a0537J0701o506L1293m643j3377o19o017J1017j3814k2527k279l205J1210
8099a9303N345K9161R611j8903k0428l4705l546K4063J3354j9594J6727K4627
$$ y = [-22816, -10585, -20740, -2383, 2607, -4355, -11361, -22744, -21180, -6806, 26930, 29604, 12261, 1832, 2989, 30576, 21682, -739, 15989, 26702, 13617, -18162, -22554, -22916, -22625, -31613, -48381, -47254, -48134, -44432, -31585, -12949, -3872, 4201, -3029, 10957, 45262, 36691, 21461, 12733, 3320, -12608, -8504, -2268, 22774, 30599, 10531, -21701, -53309, -26326, 24609, 37322, 56371, 45582, 34111, 28338, 40936, 43157, 43538, 34793, 28506, 3, -14035, -29798, -11510, 41104, 49086, 41100, 20013, -16799, -11138, -5016, 28120, 34958, 12328, -25292, -50753, -47110, -27135, -10537, 164, -6342, 24951, 20308, 6931, 6312, 295, 11312, -2502, -25029, -27308, -30513, -19303, -13958, 15203, 24814, 5911, -14517, -49222, -52768, -28705, -15351, -34945, -18218, 6409]
8087F409J0325k7998J110o98j8314m519N612M21L1464M0899K9900j1213j9036
8074D4362n621k537k1892j0072j6716j8872n38K2405k7602j1058j1205L704J1297
8061d4345p44k043K570j6628J243M4982L4450l778j6840R116O709K6421P529q696
8047C9946k3237k1415m435M475J4066L5626K4629K816k4076j5288l3477j5393
8035a5763J7469K1510P537p861j1832o280l036J9194J6450j7218k3500M151J7808
8022A8629j2310j2814R861j0958J184o716k535j592J245J5780n055m855K926K4168
8008A6958L0849N053l6969n957L19P457k879J4174K861q593R855L959j197j502
7994C4388j2687m0775l1378j5211M9160J2889L044L2944r383j7156l9539k7267
$$ y = [6409, 16734, -11264, -10154, -10852, -29166, -33685, -28073, -27652, 3812, 44711, 74611, 63398, 44362, 38741, 36204, 14312, 4240, -12476, -31348, -31886, -9481, -37083, -48141, -59346, -55642, -44345, -45089, -47132, -44562, -61190, -59947, -14965, 19485, 15707, -1133, 7983, 14692, 41113, 48642, 39946, 16709, -4706, -9141, -4666, 9400, 45026, 69655, 72471, 48395, 33107, -370, -15763, 1706, 23216, 30753, 22892, 11060, 4780, 1744, 20938, 37388, 20170, -3330, 821, 18629, 6319, -6495, 3366, -7592, -6408, -13124, -15659, -17251, -16006, -226, -5281, -10136, -7210, 16958, 47807, 52860, 15891, 9934, 10253, 17710, 14831, 29005, 31866, 23273, 33128, 37087, 35890, 34388, 21701, -19074, -50452, -65663, -16503, -3614, -570, 32374, 22991, 5835, -33704, -60971]
7982f0971J107K2835q03l2227J2445L1802M449O515M102k9036m560q77K6318K5537
7968F636p438k1010n654J1204p261j868K7018K1462P630l0225k6332J5340J520
7955h978k0584k8857J2580M9989L934k7340n689J5673K503R742R870J6823j1874
7942A7792L1020O753n726j8011l9810m024K7475K6655m5666k7054K1510N873K700
7929e13R076o608K685M8878j836l5243o360O985j7995j2957l2130k7246K6815
7916d6449m906K0146J4421k1389R044N447J287K0854L7978j910l798j8279l2605
7903b0159r419l096J231k6154k7604M0502K7265N242J6575kl202J2946k816N694
7889A7003j2793R340p084k8339N695j0434k3062J0240M8237l786l8046J8994L0431
$$ y = [-60971, -59864, -37029, -37832, -70059, -57614, -25812, -21363, -14848, -10746, -39782, -44342, -45219, -18901, 6636, -802, -21812, -27466, -16262, -23523, -25391, 1627, 23089, 30719, 494, -25838, -10498, -8978, -29562, -58419, -45839, 4150, 8084, -19256, -24945, -9272, -6769, 2973, 12843, 29666, 17792, 48812, 55565, 49839, 31828, -7982, -12006, 15469, 42124, -3542, -30596, -9086, -3213, -513, 8563, 1955, 4640, 53518, 51682, 16439, 10079, 17064, -931, -13888, -46018, -73264, -46449, -51355, -31209, -16788, -38177, -29133, -23686, -22399, -1545, 36433, 34523, 30725, 12446, -20159, -29578, -32674, -31443, -57597, -85201, -44699, -17434, -12192, 4383, 4381, 1179, 14125, 11309, 17003, 4210, 13550, 6466, -21873, -16178, -26612, -49674, -39434, 8803, 5017, -33029, -14035, 16396]
7876A6396l7711j6633j1408J5737K3535p489M4875Q364k6939O401o401j992M458
7863A1193j0545k0199k2087J3094K8337N227J6327L9675m4224m4111q19j0523
7851c8655m2982L6837K8617J5345q442j5843J9633k270l8545K2432K9627K024
7839G778q798m809L0363J7181J9194j0734o854j2505k7025O861M513m2996k1005
7826d8836n670P556k952L2039K9422J779J3840Q379k9417j5303L8066P947n1920
7813a5070k8116M539N636J604K9149l795k6780O087J4044J6787Q019l505N385
7800A3984N562J1309k3085j7248J0894O64l830p94K1373Q569K447k7244k1510
7787a8909J2106L0258o302j9222J0065P827J6911J3781J0221L354r789q520N046
$$ y = [16396, -21315, -37948, -49356, -33619, -10084, -17573, 27302, 35666, 8727, 15128, 8727, 6735, 11193, 648, -19551, -41638, -28544, -207, 5020, 21347, 61022, 16798, -27313, -28132, -38655, -81637, -44800, -16183, -838, -9280, -25123, -5490, -7760, -46305, -23873, 5754, 7778, -1020, -5829, 24534, 41715, 60909, 50175, 43321, 30816, 3791, 10652, 15165, -27831, -48836, -54506, -46950, -49902, -17863, 11559, 13338, 27178, 35557, 6140, -9163, 28903, 36850, -15070, -43186, -38647, -33011, -31407, -2258, -6053, -32833, -26746, -12702, 4085, 12104, 8599, 13984, 19546, 30855, 7770, -9478, 1416, 2080, -1750, -2544, 18829, 27398, 29845, 2601, -18909, -6803, 23455, 17153, -2069, 7996, 15823, 32734, 46515, 56736, 60090, 50301, 41781, 46827]
7774D6827j2739j5760k3071P115J0480O140j1290l0193p114N303J0959J2024k565
7761c884K003J8494J4633k509l403O150k5832l0474K2105J4155k0185o199P63
7748a4183J3532L0885l65O754J3319n87l0109q35k7695r549K1587J9241j1246
7735A0749j7067j3322K0893N281p574j1453l7001O935L2327Q131P623O739m598
7722G663j7270J7009K6776K720j6624j3879K628J5077o620l4371k2487j7874o241
7709f3493L6479M4269R429l2106k910Q786n714J9632j7225j6607j9032k1215K9602
7696c0105J9489J5461j2787k0063k187p310Q955K1384o047k1845m963j1643m351
7683e6012P395J4626Q564L632J910K4495j866k1228j1470j05K0881J0242o839
$$ y = [46827, 34088, 18328, -4743, 2372, 12852, 18992, 7702, -22491, -29605, -24302, -13343, -1319, -3884, -1881, 16613, 31246, 28737, 25334, 31484, 5652, -24822, -2717, 11438, -8747, -14946, -14183, -651, 30234, 29869, 36623, 49942, 49355, 19246, 18411, -9284, -18833, 2754, 21995, 10749, -6318, -19640, 1253, 6534, -1040, -12493, -49494, -42559, -10232, -2101, 5522, 12261, 7663, -9607, 7402, 34178, 36898, 20274, 6395, 9023, 24100, 17480, -16891, -39378, -57252, -63493, -27014, 17255, 26684, -5422, -8332, 454, -5260, 14372, -2853, -19460, -38492, -59707, -30105, -10616, 4845, -7942, -28005, -30192, -37502, -28547, -7163, -13210, -35055, -40018, -51661, -56012, -48617, -33991, -25427, -21795, -19885, 4610, 2744, -18484, -29954, -30059, -9178, 1064, -5775]
7670e775l528J6519J0172m049k4707l0993J083q416O871J1719m539J0675K0271
7657d697L0588o749J1258K261k5035Q563J1950n11l4991k5216J3389K5948k1824
7644a5066l0983l944N863J8701r673k248J9159Q410M606k1536p723m043K2407
7631a6070J1920J2251j6968r699L0286P752M466q566j6668j941J9743J168J7787
7618C5461q876j5266k6739l5354L5597L4251j3438k8011L159K2675J7127J3186
7606C3772q008l007M063J5355l8658j5856m039k951o372k639k8874R661N1411
7593C858p563j6512j2023M031q674j5423L0344L0732j0971L442R645J2320m341
7580A8865k3347k0402l041l847r682j318j662J1096K1334j258P951p769l4777
$$ y = [-5775, -9303, 7216, 17388, 13339, -11368, -42361, -41278, -49694, -42823, -31104, -35643, -24968, -4697, 25891, 19142, 30400, 32661, 7626, 16189, 28139, 27628, -7363, -32579, -19190, 6758, -15066, -46049, -49993, -44130, -25429, -35102, -37350, -18191, -9781, -5175, -26711, -34434, -38477, -16070, -4150, 8101, -8867, -18566, 11720, 19472, 23938, 15372, -1296, -3237, 16506, 17674, 35461, 26585, 11319, -15420, -50774, -15177, 19074, 5636, -22375, -19216, 3459, 20586, 33772, 25764, 22757, 26820, 42175, 3517, -12339, -16378, -19329, -25701, -28340, -57214, -47553, 3858, -3705, -20217, -32240, -28209, -36883, -52306, -21962, 8770, -2201, 1241, 10886, 23206, 18865, -4482, -24884, -27925, -31772, -41454, -42772, -44434, -33338, -12004, -13262, -5311, -13080, -47857]
7567d7857K559J4306l804k7089k896n303K7816M9673J8224q646j3160k2164j0342
7554b8683o280K06L7196J790r364n010l0455j3745K3312j9340k0436r541Q838
7541g1512N092K9351L204L3250L8311K0684l881k8059k2102j0756m0509j5020
7529f1947J4771l832m833j9385J5290J3831K4017n310n631J5060M095J2351K3111
7516B1588K0925L08l331k9197k3788N614j3370j1787K4006L4783p221k3543N358
7503C45L7115l821k7636l766o096K5686J6090p284k3842k7184m021N397L3018
7490A4001P439k9251M521j857J1800L662J1338n826j0667q232J649M896k524k1433
7476b0484J0041o455P416J1062K612J7061M641K0821k128k9217j5574k278K9316
$$ y = [-47857, -45298, -30992, -34796, -61885, -64781, -70084, -42268, 7405, 25629, 16983, 3823, -18341, -28683, -34963, -34757, 2439, 4229, -5135, -10145, -40600, -54345, -31033, -50373, -70809, -80350, -71512, -66420, -37069, -33865, -615, 37696, 58380, 54499, 26440, 4338, -6418, -46927, -61947, -47176, -51008, -55841, -75226, -59936, -46105, -22088, -27398, -33029, -17969, -13874, -1523, 21588, 42513, 42821, 39490, 10293, -13495, -7881, -21251, -33038, -9032, 25751, 18530, -5013, 345, 37460, 33639, 6003, 2237, -3859, 21827, 37917, 30633, 6791, -20393, -24414, -19017, 14001, 21440, -7811, -3290, -5147, 6653, 10315, 21653, 15827, 5160, -3072, -1423, 3473, 949, -20484, -10443, -16898, -9482, 1580, 4192, 21253, 25894, 46715, 44587, 15370, -204, -2482, 26834]
7463B6834L62N510K1343J5777j0843k1834N038j9130n6100j4793J3194J9341L114
7450a2187l728l50l998J480q280M744j8182k5655J8117L6275J2031l264r787j3207
7436b5991P066R524O206J9023k8863O773j07j0825l0047R388N1480M2355m917
7423E1065m8426j7142M327j479J9534Q177j0878K0594j0249j2264J0466j125l1276
7410a8676l6678K5042K6776J902r582j6422J7249J675J8030q222k474l062J583
7397b859n224k0143k7215M301L8431L5067n640k757q6M027o276j312o432r648
7383e766o7m252o858O540J3674k0014k4703J7384J3914l759j0976K8080M4711
7370D7908R826k8274m859K5947k4493r533L4201j7376j5184j6993J1523n892J0672
$$ y = [26834, 27196, 32706, 54049, 69826, 58983, 37149, 42187, 23057, -33043, -47836, -34642, -15301, -12187, -15915, -16265, -20263, -18783, -27063, -22319, -40501, -66156, -48039, -11764, 267, -2997, -12784, -25991, -18925, -9401, -3195, 15828, -13035, -6262, -6369, -17194, -47241, -37853, 13627, 55982, 51065, 2639, -14503, -10176, -11655, 7879, 16056, 5178, 25772, 15523, 3259, 13725, 12600, -18676, -55354, -30312, -3536, -1634, -11216, -27638, -10389, -8714, 9316, 1094, -1380, -4442, -2859, -8083, -28226, -55441, -51140, -12709, 22358, 16718, 13961, 13875, 17902, 11626, 10314, 3882, -5766, -5833, -10085, -16943, -10403, 3271, -16743, -41446, -24062, -10148, -13907, -24883, 3197, 47908, 57734, 29460, 24601, 50548, 26055, 16522, 50723, 33347, 18163, 1170, 12693, 6801, 17473]
7357A7473O664J432j8037l1163Q15Q138J304K1579P514L63j1479J165J8598l007
7343B1359k6292K2802K2741j166j6833l7657J7431K1321J4786k7255j7496n15
7331f774J4487j4425k9204m722k230J6405l688j9351L6423L9540K1603J65j8343
7318B9886q854N691q701j0467l7608J2887k32k8160l098J8533k939J1086J5036
7305f940R484J2016J8528j434O272j0663k6635L960p390j6931L0215q454j0857
7292h829J0495J1926j8302K0328n950q816j7393J3308J2106M013j5428k7634k181
7279c2357o538K959p732n251k5371L2077L5173j2790o219K3298K7105K8359J692
7266E4405J398n1543p970p641j3468J9911J5036o183J4627N955j6111J793Q809
$$ y = [17473, 24137, 25569, 7532, -23631, -22816, -14678, -13374, 8205, 15719, 16082, 4603, 5768, 24366, 21359, -4933, 17869, 40610, 39444, 22611, -15046, 2385, 23706, 38492, 11237, -6259, -6774, 7713, -6712, -35916, -40638, -42868, -26463, -30151, -49502, -13079, 26461, 48064, 48229, 29886, 21032, 26723, 18022, 7555, -30053, -17166, -17398, -45558, -48656, -30123, -33062, -21976, -6940, 2544, 14560, 33088, 31654, 37926, 27263, 628, 4588, -2802, -19733, 10482, 2028, -8829, 1666, 13592, -4710, 15618, 9668, 852, -16541, -3233, 8873, 12886, -2542, -30176, -32357, -38895, -35936, -43668, -48919, -74290, -42213, -7040, -19830, -26049, -2751, 24354, 52713, 54405, 55803, 4260, -3710, -11351, -24819, -4908, 10128, 3945, 18572, 24527, 8416, 10209, 19018]
7253A9018k3034l8460J81q125J4703j2122L184K3122N239l311J131p190M730K9254
7239H320m432P287K1947r613j1699M530J4956p949O520J6407q993J887r98l3935
7225D235l3104K8045J8940k357l724J4795K1037j7010n0573j0801L2143j4289
7213a2663k7702k3980J0278L4628K4443R363q393L887j0958j0422J509n078m453
7200a9541J8458J8678k0794M962o717r808K0039R962n697n580p726K9772J8132
7187D4140K0981m995l3918o145Q639L7660l286j4871l1558k5080J244J1393R146
7174A3350J1161r877j9282J2608m288k6107j8761P964k1496K761k9634K1657J6974
7161d2970n501j418J3525p293K832J7762J4346M58q820k4577k286K2860p737p344
$$ y = [19018, -4016, -42476, -42295, -50420, -35717, -47839, -44655, -21533, -16294, -19605, -18474, -25664, -20934, 8320, 3888, 11175, 33122, 23509, 11810, 16340, 31296, 23347, 29867, 46274, 37281, 39168, 38170, 4235, -28869, -824, 18116, 15759, 12035, 26830, 47867, 30857, -19716, -30517, 1626, -12663, -40365, -64345, -54067, -19439, 5004, 14367, 5974, 9861, -1097, -11519, -10010, -15088, -19541, -1083, 17595, -3199, 1763, -4954, -14762, 5277, 15239, 9542, 3962, -3764, 26008, 44140, 65121, 60126, 26208, 20063, 28702, 66362, 63076, 48205, 16647, -8433, -7189, 4204, 13350, 24511, 14634, -4648, 7960, 3672, -22435, -41196, -33232, -54728, -51967, -81601, -59944, -42970, -48471, -49889, -36364, -43657, -40825, -23063, -8717, -8259, -17079, -41656, -43942, -21082, -28819, -36163]
7147c6163r868J6345K7455j690k920K7382j0921l4663l980J6699J0505J0256j5883
7134g446J6109L1487J1983l7428k2331n225l2099k1501L4847N8385o74k4546J393
7121B954p336J4247R521j0083j3191M202p085k3640K159K1108q28M47O99L65o000
7106a2461J5351K5453j1464r802k8570K498M279l1644k634K9745q779m157n39
7093c2724M129J858L0261K2018j5135j2399k1946j7109K8147q374q992K923M67
7080b6876j6515O015J3861j9340J8852p251N600J5722K0070K738k4037k362k2700
7067c6223o678J2653n32j5792k9980K3960R049p791K0599K2290N422J2124l416
7054E685j8868j5319O450j2163k0809j6748L4442M3758J2644r185R61J666j7447
$$ y = [-36163, -46031, -29686, -2231, -3921, -6841, 20541, 9620, -25043, -29023, -12324, -1819, 8437, -7446, 8663, 40150, 52133, 14705, -7626, -12851, -44950, -66451, -31604, 26781, 26107, 1561, 2954, -4382, 9865, 19386, 9303, -3888, 314, -6771, -30411, -28252, -7144, -7972, -7525, -6826, -6461, -12461, 2890, 28343, 16879, 7077, -21493, -18995, -14716, -46360, -48994, -19249, -28028, -32185, -32724, -28595, -26737, 3524, 25542, 10407, -1992, -23938, -41047, -12900, -21274, -30266, -27343, -26876, -43391, -37376, -23515, -42855, -24003, -31254, -25654, -9932, 10138, 12876, -11161, -13523, -36223, -42901, -30248, -30780, -46572, -76552, -52592, -43543, -51334, -30735, -8445, -3023, 9101, 5685, -13183, -28502, -22052, -34215, -55024, -71772, -37330, 6428, 19072, 9887, 10848, 12514, -4933]
7041d933n482J0027k1094q147r070j9896Q930L9524K3163J2629l7926l6216K3145
7028b5346J769J3394m653l2059o720N673L1021N750k0402n648K7095J6875K896
7015I645m448k5773j2487m054L451K3555K1833r555k2550K2090J3694p270K3022
7002C1153p673N400N85k6824Q856M8939P56j8246l4159l7330M1035M1673j8770
6989C5395Q718R393j7077J6076k6408K068k568n529J6559l3637j3227L7025J1504
6976C8292l28j7728Q610l0191m713J1290m409P697K1033J7933j7320J821R712
6963D1699J0741K0527n456k700m0205k9899m007N296R697r721l133J9818O840
6950A9497p652r938J1802J6481k8931j1328K5109J8024P53l2414r912p733n063
$$ y = [-4933, -10415, -388, -21482, -29629, -38699, -58595, -49665, -10141, 13022, 25651, -12275, -48491, -25346, -23577, -10183, -14836, -46895, -53615, -47942, -16921, -11171, -31573, -37221, -10126, 6749, 9645, 5197, -20576, -33063, -37117, -33666, -10111, 11722, 2167, -20383, 1707, 15401, 8131, 31153, 23480, 28880, 29465, 2641, 11497, 60436, 61192, 42946, 8787, -28543, 12492, 54165, 35395, 44113, 53506, 36429, 52505, 26097, 28165, 25597, 20068, 36627, 2990, -10237, 26788, 38292, 37964, 20236, 28846, -1345, -6058, 5232, 823, 8520, 29553, 47486, 30166, 31987, 41699, 52440, 72967, 67511, 64811, 24606, -5293, -9300, -4004, 5693, -4028, -7161, 12657, 19497, 11845, 1907, 13709, 30190, 1259, -10069, 15040, 33064, 33817, 1403, -8509, -16242, -21305]
6937b1305J9348K7671M473k0194K2647K2159J8698k4541k7274j9549l4273m8575
$$ y = [-21305, -1957, 25714, 30187, 9993, 32640, 54799, 73497, 48956, 21682, 2133, -32140, -80715]
$$ [...]
##END NTUPLES=NMR SPECTRUM
##END=
