##TITLE=Analysis number 326708
Compound Code km 09079
Project Code adrs
Chemist Name prosynth
##JCAMPDX= 6.0         $$ Bruker NMR JCAMP-DX V2.0
##DATA TYPE= NMR SPECTRUM
##DATA CLASS= NTUPLES
##ORIGIN= Bruker BioSpin GmbH
##OWNER= nmr
$$ XWIN-NMR		Version 3.5
$$ Tue Feb 20 08:54:06 2007 GMT Standard Time (UT+0h)  MAYBRIDGE\nmr@NMR_250MHZ
##.OBSERVE FREQUENCY= 250.131544655141
##.OBSERVE NUCLEUS= ^1H
##.ACQUISITION MODE= SIMULTANEOUS (DQD)
##.ACQUISITION SCHEME= undefined
##.AVERAGES= 16
##.DIGITISER RES= 18
##SPECTROMETER/DATA SYSTEM= dpx250
##.PULSE SEQUENCE= zg30
##.SOLVENT NAME= DMSO
##.SHIFT REFERENCE= (INTERNAL, DMSO, 0, 16.522)
##AUDIT TRAIL= $$ (NUMBER, WHEN, WHO, WHERE, WHAT)
$$ ##TITLE= Audit trail, XWIN-NMR		Version 3.5
$$ ##JCAMPDX= 5.01
$$ ##ORIGIN= Bruker BioSpin GmbH
$$ ##OWNER= nmr
$$ C:\u/data/dgb/nmr/ADRS/1250/pdata/1/auditp.txt
$$ ##AUDIT TRAIL=  $$ (NUMBER, WHEN, WHO, WHERE, WHAT)
(   1,<2007-02-20 08:53:43.41 +000>,<MAYBRIDGE\nmr>,<NMR_250MHZ>,
      <created by zg, POWCHK disabled, PULCHK disabled
       configuration hash MD5:
       49 4B E0 1D 92 C2 6B 37 9F E6 65 BC 52 41 86 1D
       data hash MD5: 64K
       33 AC B2 CD 6E 76 1B 04 5C 46 77 71 C2 4C 88 60>)
(   2,<2007-02-20 08:53:56.85 +000>,<MAYBRIDGE\nmr>,<NMR_250MHZ>,
      <Start of raw data processing
       ef LB = 0.3 FT_mod = 6 PKNL = 1 SI = 32K 
       data hash MD5: 32K
       D2 C5 8E 2F 6E 6E 5E D1 24 F7 AA A8 89 60 8A 0A>)
(   3,<2007-02-20 08:53:58.47 +000>,<MAYBRIDGE\nmr>,<NMR_250MHZ>,
      <apk 
       data hash MD5: 32K
       71 CD D3 3D 88 F8 B9 64 A4 FD A3 BC B6 41 EF 7F>)
(   4,<2007-02-20 08:53:59.24 +000>,<MAYBRIDGE\nmr>,<NMR_250MHZ>,
      <abs ABSG = 5 
       data hash MD5: 32K
       80 B0 96 9C 8C C2 B9 E7 87 46 11 76 95 94 F1 3F>)
$$ ##END=
$$ 
$$ hash MD5
$$ 2B 1E 26 9C 86 BF 53 93 48 00 B0 31 39 E9 8A 00
##$RELAX= 
##$RELAX= 
##$RELAX= 
##$RELAX= 
##$RELAX= 
##$RELAX= 
##$RELAX= 
$$ Bruker specific parameters
$$ --------------------------
##$DU= <C:\u>
##$EXPNO= 1250
##$NAME= <ADRS>
##$PROCNO= 1
##$TYPE= <nmr>
##$USER= <dgb>
##$AMP= (0..31)
100 100 100 100 100 100 100 100 100 100 100 100 100 100 100 100 100 100 
100 100 100 100 100 100 100 100 100 100 100 100 100 100 
##$AQSEQ= 0
##$AQ_mod= 3
##$AUNM= <au_zg>
##$AUTOPOS= <23 >
##$BF1= 250.13
##$BF2= 250.13
##$BF3= 250.13
##$BF4= 250.13
##$BF5= 500.13
##$BF6= 500.13
##$BF7= 500.13
##$BF8= 500.13
##$BYTORDA= 1
##$CFDGTYP= 0
##$CFRGTYP= 5
##$CHEMSTR= <none>
##$CNST= (0..31)
1 1 145 1 1 1 1 1 1 1 1 1 1 1 1 1 1 1 1 1 1 1 1 1 1 1 1 1 1 1 1 1 
##$CPDPRG= <>
##$CPDPRG1= <>
##$CPDPRG2= <>
##$CPDPRG3= <>
##$CPDPRG4= <mlev>
##$CPDPRG5= <mlev>
##$CPDPRG6= <mlev>
##$CPDPRG7= <mlev>
##$CPDPRG8= <mlev>
##$CPDPRGB= <>
##$CPDPRGT= <>
##$D= (0..31)
0 1 0 0 0 0 0 0 0 0.06 0 0 0 0 0 0 0.0002 0 0 0 0 0 0 0 0 0 0 0 0 0 0 
0 
##$DATE= 1171961622
##$DBL= (0..7)
120 120 120 120 120 120 120 120 
##$DBP= (0..7)
150 150 150 150 150 150 150 150 
##$DBP07= 0
##$DBPNAM0= <>
##$DBPNAM1= <>
##$DBPNAM2= <>
$$ [...]
##$SUBNAM7= <"">
##$SUBNAM8= <"">
##$SUBNAM9= <"">
##$SW= 20.6930455092707
##$SWIBOX= (0..15)
0 0 3 0 0 0 0 0 0 0 0 0 0 0 0 0 
##$SW_h= 5175.983436853
##$TD= 65536
##$TD0= 1
##$TE= 295.16
##$TE2= 300
##$TE3= 300
##$TEG= 300
##$TL= (0..7)
0 120 120 120 120 120 120 120 
##$TP= (0..7)
150 150 150 150 150 150 150 150 
##$TP07= 0
##$TPNAME0= <>
##$TPNAME1= <>
##$TPNAME2= <>
##$TPNAME3= <>
##$TPNAME4= <>
##$TPNAME5= <>
##$TPNAME6= <>
##$TPNAME7= <>
##$TPOAL= (0..7)
0.5 0.5 0.5 0.5 0.5 0.5 0.5 0.5 
##$TPOFFS= (0..7)
0 0 0 0 0 0 0 0 
##$TUNHIN= 0
##$TUNHOUT= 0
##$TUNXOUT= 0
##$USERA1= <user>
##$USERA2= <user>
##$USERA3= <user>
##$USERA4= <user>
##$USERA5= <user>
##$V9= 5
##$VALIST= <valist>
##$VCLIST= <CCCCCCCCCCCCCCC>
##$VD= 0
##$VDLIST= <DDDDDDDDDDDDDDD>
##$VPLIST= <PPPPPPPPPPPPPPP>
##$VTLIST= <TTTTTTTTTTTTTTT>
##$WBST= 1024
##$WBSW= 4
##$XGAIN= (0..3)
0 0 0 0 
##$XL= 0
##$YL= 0
##$YMAX_a= 209007
##$YMIN_a= -273828
##$ZGOPTNS= <>
##$ZL1= 120
##$ZL2= 120
##$ZL3= 120
##$ZL4= 120
##$ABSF1= 16.522
##$ABSF2= -4.171173
##$ABSG= 5
##$ABSL= 3
##$ALPHA= 0
##$AQORDER= 0
##$ASSFAC= 0
##$ASSFACI= 0
##$ASSFACX= 0
##$ASSWID= 0
##$AUNMP= <proc_1d>
##$AZFE= 0.1
##$AZFW= 0.1
##$BCFW= 0
##$BC_mod= 0
##$BYTORDP= 0
##$COROFFS= 0
##$CY= 12.5
##$DATMOD= 1
##$DC= 0
##$DFILT= <>
##$DTYPP= 0
##$F1P= 14.0000005364418
##$F2P= -0.99999901652339
##$FCOR= 0.5
##$FTSIZE= 32768
##$FT_mod= 6
##$GAMMA= 0
##$GB= 0
##$INTBC= 1
##$INTSCL= 1
##$ISEN= 128
##$LB= 0.3
##$LEV0= 0
##$LPBIN= 0
##$MAXI= 10000
##$MC2= 0
##$MEAN= 0
##$ME_mod= 0
##$MI= 0
##$NCOEF= 0
##$NC_proc= -5
##$NLEV= 6
##$NOISF1= 0
##$NOISF2= 0
##$NSP= 0
##$NTH_PI= 0
##$NZP= 0
##$OFFSET= 16.522
##$PC= 1
##$PHC0= 217.5391
##$PHC1= 9.789955
##$PH_mod= 1
##$PKNL= yes
##$PPARMOD= 0
##$PSCAL= 4
##$PSIGN= 0
##$REVERSE= no
##$SF= 250.13
##$SI= 32768
##$SIGF1= 0
##$SIGF2= 0
##$SINO= 400
##$SIOLD= 32768
##$SREGLST= <1H.DMSO>
##$SSB= 0
##$STSI= 32768
##$STSR= 0
##$SW_p= 5175.98343685301
##$SYMM= 0
##$S_DEV= 0
##$TDeff= 65536
##$TDoff= 0
##$TI= <Analysis number 999999
Compound Code 99
Book Reference 9
Project Code 9>
##$TILT= no
##$TM1= 0
##$TM2= 0
##$TOPLEV= 0
##$USERP1= <user>
##$USERP2= <user>
##$USERP3= <user>
##$USERP4= <user>
##$USERP5= <user>
##$WDW= 1
##$XDIM= 32768
##$YMAX_p= 362838101
##$YMIN_p= -672711
$$ End of Bruker specific parameters
$$ ---------------------------------
##NTUPLES= NMR SPECTRUM
##VAR_NAME=  FREQUENCY,     SPECTRUM/REAL,   SPECTRUM/IMAG
##SYMBOL=    X,             R,               I
##VAR_TYPE=  INDEPENDENT,   DEPENDENT,       DEPENDENT
##VAR_FORM=  AFFN,          ASDF,            ASDF
##VAR_DIM=   32768,         32768,           32768
##UNITS=     HZ,            ARBITRARY UNITS, ARBITRARY UNITS
##FACTOR=    0.157963299565203, 1,           1
##FIRST=     4132.6476996994, 0,             0
##LAST=      -1043.33573715361, 0,           0
##MIN=       -1043.33573715361, -672711,     0
##MAX=       4132.6476996994, 362838101,     0
$$ Real data points
##PAGE= N=1
##DATA TABLE= (X++(R..R)), XYDATA
$$ [...]
17888C80688j71470K8123O9639o4513L4476J25232k3369j21662J07431K3028k0852
17877C66751J04297K9209J8387O650P526p3782n8241n4403Q8055Q2980n9161m2915
17865D15353K57197J27598M8323p6127k10349j25040q8613j33207J25644J92926
17855E33705J65576J88731M0609J6990Q155q5066k38032q5753K6392n3698n1123
17844D66486K5547J36487J4129q3128m2094n3911N3164N0100k5142M9448j0713
17833E80373m6784q4092j4216K06934K33439P2887J2474K6043Q2409j3966L7408
17822A092909J08879J08006K46926K59825K37370M2655P1167J38341J58271P0496
17812B534845j1564J4290K93473K67952K08353K31655N96438P32987O53836Q22070
$$ plain form
17888 380688 209218 237341 306980 242467 276943 402175 378806 257144 364575 387603 366751
17877 366751 471048 500257 518644 525294 532820 459038 400797 346394 434449 517429 458268 415353
17865 415353 672550 800148 848471 772344 561995 436955 348342 215135 340779 533705
17855 533705 699281 888012 928621 945611 953766 868700 630668 544915 571307 517609 466486
17844 466486 492033 628520 642649 559521 517427 463516 516680 566780 541638 591086 580373
17833 580373 533589 449497 435281 642215 875654 948541 961015 987058 1069467 1055501 1092909
17822 1092909 1201788 1309794 1556720 1816545 2053915 2096570 2167737 2306078 2464349 2534845
17812 2534845 2523281 2537571 2831044 3098996 3307349 3539004 4135442 4868429 5522265 6344335
17802F344335J193645J715304K194258K718934L783775N416053P469073R305226
17794D0140603J0583892J0039498O056478j77514n607848q502147r034464q206047
17786C5292451o650439n288213m080845l253603k821438k053861j435360j246714
17778H461978j092120r04946o96231r30279n78529l97970j63906M5557j02355
17769C641199o7712N4320q6031j01626J4829j09206r9291q7335k27714Q5168J14314
17758C130915j27048k3050P4864M46402K06477L45398N09708L52240M68980J156800
17748F541686J429161J746381K261892K761944L746755M973619O506406Q127103
17740C8094947Q600673P592534M408954p72327n661385q363592q430970p192628
$$ plain form
17802 6344335 7537980 9253284 11447542 14166476 17950251 23366304 30835377 40140603
17794 40140603 50724495 60763993 66820471 66642957 61035109 52532962 43498498 35292451
17786 35292451 28642012 23353799 19272954 16019351 13197913 11144052 9708692 8461978
17778 8461978 7369858 6464912 5768681 4838402 4259873 3861903 3697997 3743554 3641199
17769 3641199 3573487 3627807 3541776 3440150 3454979 3345773 3246482 3159147 2931433 3016601 3130915
17758 3130915 3003867 2980817 3055681 3502083 3708560 4053958 4563666 4915906 5384886 6541686
17748 6541686 7970847 9717228 11979120 14741064 18487819 23461438 29967844 38094947
17740 38094947 46695620 54288154 58697108 57924781 52263396 43899804 35468834 28276206
17732B8276206n886152m329528l205740k589947k275495j843266j205613r65521
17724E974944r45947o02127o43242n65774n30226k62380p3908m9018j33113k25273
17714A943936k14309j31351j1007k21481q6005p3106o5817j33792k30543j20120
17704F56405q0813K2478J699j00976r9801M9592O5878n9320O7772q5423J0721
17693D48212o5692P4896n2774n0608j40251k4936p7320R5505J35948m1367k08911
17682I2702j60350O5432m100O412q2377K8965n6841K7316O2510Q9831J67889L3324
17670B70713j07388j15508N8419J1624p8021p525J83759J52737q428M514p0551
17659B94345o2857l1083q5973j28143j24662J7077J58450N4186O9635q634k00383
$$ plain form
17732 28276206 22390054 18060526 14854786 12264839 9989344 8146078 6940465 5974944
17724 5974944 5028997 4426870 3783628 3217854 2687628 2425248 2351340 2302322 2169209 1943936
17714 1943936 1729627 1598276 1587269 1365788 1279783 1206677 1140860 1007068 776525 656405
17704 656405 575592 598070 599769 498793 398992 448584 514462 455142 522914 437491 448212
17693 448212 382520 457416 404642 354034 213783 188847 111527 207032 342980 301613 92702
17682 92702 -67648 -2216 -6316 96 -82281 -53316 -110157 -82841 -20331 69500 237389 270713
17670 270713 163325 47817 106236 117860 39839 32314 216073 368810 360382 364896 294345
17659 294345 231488 200405 114432 -13711 -138373 -121296 37154 91340 160975 152341 -48042
17648d8042k59418M589L35259J12044l1164j15490o1644J2284j335J51905k7023
17637G1965j98508n1905R9644J97571O2909J29246J15058Q817k14718n0896j49617
17626A9566p1012m7511p2006J9599r260J95923l1093j90786O9110P4494j0562
17615e3538q326J9889q467K1450J42904J33329l797K582L4257p9836n3212k09171
17603f1936j41840o9040M7043R1074L7748k9296J00248o5717k25870k6438J84462
17592a59562M4728q4540J84740K69208q1658j63787P1112r7988R0722P7070j72905
17581b2860j57092k7418N5319P7184J75540K5819M4968j3639k20131J51832P0499
17570A60021j15380l501J45458o9083r7874J36864j03600o0622P1532j23752j09943
$$ plain form
17648 -48042 -307460 -302871 32388 144432 113268 -2222 -63866 -51582 -52917 98988 71965
17637 71965 -126543 -178448 -78804 118767 181676 310922 425980 434797 220079 169183 19566
17626 19566 -51446 -98957 -170963 -151364 -160624 35299 4206 -186580 -117470 -42976 -53538
17615 -53538 -61864 -41975 -50442 -28992 113912 247241 243444 246026 280283 200447 147235 -61936
17603 -61936 -203776 -272816 -225773 -134699 -96951 -126247 -25999 -91716 -317586 -344024 -159562
17592 -159562 -114834 -199374 -14634 254574 172916 9129 80241 -17747 72975 150045 -22860
17581 -22860 -179952 -207370 -152051 -74867 100673 126492 171460 157821 -62310 89522 160021
17570 160021 44641 41140 186598 117515 19641 156505 52905 -7717 63815 -59937 -169880
17559a69880N6422j1512J8487n5464J54447L0536o0797p8102O3488J09169Q706
17548F5500n0083o0204o5976o2727o8685R7664J20841m6192M871N2703k7559J16732
17536G6885J40063L7927j67107j00004L6765O5558K2848L8064o7606l4371q4944
17525c5922L5443m4276J7874j30156K8101J81826M779m2928k0972j18738K1926
17514a03043p1369o6554R5744K3141o1478Q1424l2060k5048n511N4116L8091o5581
17502a38128m4185J58754J37082N2357J30594r5945j03415j16772l7101N3949
17492b810J8296O5022q2651j1867J9735j38343k6976Q73r1878L3652K4712P8247
17480a13988j8377p5732q915q1807J01905K1896J02885r2973j67765o5703J08521
$$ plain form
17559 -169880 -113458 -124970 -106483 -161947 -7500 23036 -37761 -115863 -52375 56794 65500
17548 65500 15417 -44787 -110763 -173490 -242175 -144511 -23670 -69862 -64991 -12288 -39847 76885
17536 76885 216948 254875 87768 -12236 24529 90087 112935 150999 83393 49022 -35922
17525 -35922 -479 -44755 -26881 -157037 -128936 52890 57669 14741 -6231 -124969 -103043
17514 -103043 -174412 -240966 -145222 -122081 -183559 -102135 -134195 -159243 -164754 -110638 -72547 -138128
17502 -138128 -182313 -23559 113523 165880 296474 200529 97114 -19658 -56759 -2810
17492 -2810 15486 80508 -2143 -14010 5725 -132618 -159594 -158721 -250599 -216947 -192235 -113988
17480 -113988 -132365 -208097 -217012 -298819 -196914 -175018 -72133 -165106 -332871 -398574 -290053
17469b90053P9213m0822J0723L9614O4423q2572l7302n17J27208Q6903N2747K9138
17457C8703l275l1864J8687J38717r621m0449J6100j30324J868N8545k6179j07854
17445g6946j4260J4832J39942m4027P8k8170J4260j8798j55829j10715O9285J76309
17433c4039R1953K1079l8135m9609r8505J4208J5766n5748K82j41698j84283Q6969
17421c71760K35684J0326Q0601M366K8478M0159O462k54962K5483J65897R1715
17410F2449m4740J55175J30130J9834j1800r1598j13618M2710L3374j92979k300
17399a3363q9990l3885P911k3459j48779j38278j5958J41147Q5237P9338Q3020
17388f7059J71358O8926O9309J4080j60377n6216K2469J31148J51414q9137k15332
$$ plain form
17469 -290053 -210840 -251662 -240939 -201325 -136902 -219474 -256776 -257293 -130085 -43182 9565 38703
17457 38703 35428 3564 22251 160968 151347 110898 126998 -3326 -1458 57087 30908 -76946
17445 -76946 -91206 -76374 63568 19541 19619 -8551 5709 -13089 -168918 -279633 -210348 -34039
17433 -34039 57914 78993 40858 -8751 -107256 -93048 -77282 -133030 -132748 -274446 -458729 -371760
17421 -371760 -136076 -125750 -45149 -40783 -12305 27854 34316 -220646 -195163 -29266 62449
17410 62449 17709 172884 303014 322848 311048 219450 105832 148542 181916 -11063 -13363
17399 -13363 -103353 -137238 -129327 -152786 -301565 -439843 -455801 -314654 -229417 -150079 -67059
17388 -67059 104299 173225 242534 256614 96237 40021 62490 193638 345052 255915 40583
17377D0583j13317l8255J05070J1095l484P5218k06105j06520r4945J51823O1889
17366a16948K23279J20445r7756n9310M5153M0346k13735j16450m5740P4483J06181
17355d0052k5894j36828J05732J36004o3368j74614Q005j18414o9676O5691J09165
17344b04249K742R4558q2561k0323p476J34543Q8406k22345o5212J19034P4949
17333h7934j9536M9141J9531N4154M4642J14954n7276k25623j22195j2114N12
17322b41744J71064k902Q2210L2383N5704J9747j58122r6646k1967L5280l2246
17311a57239j43229j9604J22519L9860M253P0931l9712q8278l2103J39817J43353
17300D0568L248Q8817J16093J19241j46583j06594Q2027O606J69677L5130j69098
$$ plain form
17377 40583 -72734 -110989 -5919 5176 1692 76910 -129195 -235715 -330660 -178837 -116948
17366 -116948 106331 226776 129020 69710 114863 155209 -58526 -174976 -220716 -146233 -40052
17355 -40052 -65946 -202774 -97042 38962 -24406 -199020 -191015 -309429 -379105 -313414 -204249
17344 -204249 -201507 -106949 -189510 -209833 -217309 -82766 5640 -216705 -281917 -162883 -87934
17333 -87934 -107470 -58329 -38798 15356 59998 174952 117676 -107947 -230142 -242256 -241744
17322 -241744 -70680 -73582 8628 41011 96715 116462 -41660 -138306 -160273 -124993 -157239
17311 -157239 -300468 -320072 -197553 -157693 -153440 -82509 -122221 -210499 -242602 -102785 40568
17300 40568 43816 132633 248726 367967 221384 114790 196817 203423 373100 408230 239132
17289B39132r4724N638R2631k4105R9693L0821m9041L0804J6675r558n5393j59171
17277A23402j38792J3351l6542j03933J43778J23191m2897J1571j61015j63773
17267b31659r2600M5292m5873j10146K9842R7076J23102J05424k256N9121L4503
17256A1826k374o6098j09637n3243K12080J87861l0763n0217k5802l4797o0074
17245b1238J02364J6375j3485J06743Q3422q7363j49106n1559n8759J25867l0536
17234B2725M2431K4085N6461q359N051R1197M8796n7006j48859K460N3045M1165
17222A73192N5236j23402j04339J00086j21016N9828O8978J17815M0068p6466
17212A89980j10492k6959l682l641n8815K3721P9868K0873j10868o7181J29328
$$ plain form
17289 239132 144408 150046 242677 218572 318265 349086 300045 330849 347524 337966 282573 123402
17277 123402 -15390 -2039 -38581 -142514 1264 124455 81558 93129 -67886 -231659
17267 -231659 -324259 -278967 -324840 -434986 -405144 -308068 -184966 -79542 -81798 -22677 11826
17256 11826 9452 -56646 -166283 -219526 -7446 180415 149652 99435 73633 38836 -21238
17245 -21238 81126 97501 84016 190759 274181 186818 37712 -13847 -72606 53261 22725
17234 22725 65156 89241 145702 137343 142394 233591 282387 225381 76522 78982 132027 173192
17222 173192 228428 105026 687 100773 -20243 39585 108563 226378 266446 189980
17212 189980 79488 52529 48847 45206 -13609 10112 89980 110853 -15 -67196 62132
17201F2132J2908j45286Q0882M1337K5679j44860j36689N5218J3987J13012q3872
17190a05552m5096R7876Q5676j63546j45095J23851J53204M2970J1996J1404j20148
17179e2460k2240L3309J65882J57996j05371k18775k62520Q7463K20037P7122
17169H0443N8574L5173O589j17391J6555j22762m756P1329k4872P308k0899j57130
17157a71839m6130J47302P0516P8672J0188p7475j11019j5650k7887k09776J0364
17146c42734N9806O5783Q4709K0514o637L0008j8682J72899L7900L7976j43746
17135b204k88023n2113J91204R7833k2912k0360j15785K7441j52219M936J44988
17124a87214J97291M5743N1082q2823j81137Q4744J22743j06795n738R0655N8219
$$ plain form
17201 62132 75040 -70246 10636 51973 77652 -67208 -203897 -148679 -134692 -21680 -105552
17190 -105552 -150648 -52772 32904 -130642 -275737 -151886 1318 44288 56284 67688 -52460
17179 -52460 -74700 -41391 124491 282487 177116 -41659 -304179 -216716 3321 80443
17169 80443 139017 174190 180779 63388 79943 -42819 -47575 23754 -1118 6190 -14709 -171839
17157 -171839 -217969 -70667 -151 78521 88709 11234 -99785 -115435 -143322 -353098 -342734
17146 -342734 -282928 -217145 -132436 -111922 -118559 -88551 -107233 65666 103566 141542 -2204
17135 -2204 -290227 -342340 -151136 -53303 -76215 -96575 -212360 -184919 -337138 -332202 -187214
17124 -187214 10077 55820 106902 24079 -157058 -72314 50429 -56366 -62104 28551 86770
17113H6770J41367J94915k38650k86653R565J57652l2413o9482K0927M8587K02
17102C2787j22142m1583j16878j04640p9983J46121J64806m607m9541O6056R3506
17091a6098j71113j03293m1796O5124J39943q66l04573j22041K6602J44018J59139
17080b24954n3052M6605J10131j7018l7922n8893N2489J11212J75608k1022k13868
17069a30684N3678J25541J8929j2301L1625j17947j17972K1892L140j29225n531
17058b58855j2476J22205L2027k5556j27939K91482J12371q4522l6785l1660L8680
17047A8972P1807J09352m0576p4664k7755l1607O981L7614p9647q1355N3247o1060
17035i8691R4025J70232m6656j4707j89657r6171r4508L9271J41949N4563K6271
$$ plain form
17113 86770 228137 423052 184402 -102251 -92686 64966 32553 -36929 -16002 32585 32787
17102 32787 -89355 -130938 -247816 -352456 -432439 -286318 -121512 -126119 -175660 -109604 -16098
17091 -16098 -187211 -290504 -332300 -267176 -127233 -128099 -432672 -554713 -528111 -384093 -224954
17080 -224954 -278006 -231401 -121270 -138288 -176210 -235103 -182614 -71402 104206 83184 -130684
17069 -130684 -77006 48535 67464 55163 86788 -31159 -149131 -127239 -124099 -253324 -258855
17058 -258855 -271331 -149126 -117099 -142655 -270594 20888 133259 48737 11952 -19708 18972
17047 18972 90779 200131 159555 84891 57136 25529 32510 70124 -9523 -90878 -37631 -98691
17035 -98691 -4666 165566 118910 104203 -85454 -181625 -276133 -236862 -94913 -40350 -14079
17024a4079q9089o9762n3632J36129j43618k25434R8799K0977q7423J79373J45274
17013a02485o3527o2291O0802L6840j21223r5503O7012J6285q56j17665J1536
17002c71075k1295K34215P0739q678J13452Q111M4207Q6305q3218L932l4690j01758
16990e9753o3000n0550n289J98559Q3836j45249r0402K4712K9290r112o2291j71812
16978c21061J09622J33576R4182K3953O3829j44991M8182N6932l6533j22921q721
16967a03951L5526N1961k4574P0127j1713M0874J5543k1456m9394R703J1273p1584
16955d7665l1744Q7363n1785j08766j81899j04489J59910J6988K4206P1834M685
16944a61362J3796r8100K05676J84075P0748L7132l3320j39373j19657j2059N3226
$$ plain form
17024 -14079 -103168 -172930 -226562 -90433 -234051 -459485 -360686 -339709 -427132 -247759 -102485
17013 -102485 -166012 -228303 -167501 -130661 -251884 -347387 -280375 -264090 -264946 -382611 -371075
17002 -371075 -392370 -158155 -87416 -96094 17358 25469 69676 155981 72763 76695 42005 -59753
16990 -59753 -122753 -173303 -178592 19967 103803 -41446 -131848 -107136 -77846 -86958 -149249 -321061
16978 -321061 -211439 -77863 16319 40272 104101 -40890 7292 64224 27691 -95230 -103951
16967 -103951 -68425 -16464 -41038 29089 17376 58250 73793 52337 2943 12646 23919 -47665
16955 -47665 -79409 7954 -43831 -152597 -334496 -438985 -279075 -262087 -237881 -166047 -161362
16944 -161362 -147566 -245666 -39990 144085 214833 251965 218645 79272 -40385 -52444 782
16933G82K2139p1248k8968J29843N2289p3456L9075J49517j79619l9430j30622
16922a29698j43875J68705J77347j43917l4768p3035m6277K0739k3001J9604J26044
16911h2132r807n1430Q8151p6958q8629K3701K30292P0703r4026j35937O2517
16900f3555P0974P5908p437p3827p4397N3266q672J98117J26367j23432j27816
16889D5496n3348k725m700q4914q1790J09564L04035r2757j24888j14799j08979
16878b09805p4529P4106K8513l5423R9044o1300r4459P8092k6631j00824M4753
16867b78463K48057P2601l3166m1969j44087j60101M2472K24319K8641J22884
16857H1188m406J84719J8148k06567n8375Q6748r4189j06288K49857M822k63281
$$ plain form
16933 782 22921 -48327 -77295 52548 104837 31381 70456 219973 40354 924 -129698
16922 -129698 -273573 -104868 72479 -71438 -106206 -179241 -225518 -204779 -227780 -208176 -82132
16911 -82132 -91939 -143369 -55218 -132176 -220805 -197104 33188 103891 9865 -126072 -63555
16900 -63555 7419 83327 75890 2063 -72334 -19068 -27740 170377 296744 173312 45496
16889 45496 -7852 -10577 -15277 -100191 -181981 -72417 231618 138861 13973 -100826 -209805
16878 -209805 -284334 -210228 -181715 -217138 -118094 -179394 -273853 -195761 -222392 -323216 -278463
16867 -278463 -30406 42195 9029 -32940 -177027 -337128 -294656 -70337 -41696 81188
16857 81188 76782 261501 279649 73082 14707 101455 7266 -99022 150835 155657 -107624
16846a07624m1623N1251r6123n4511k2495J53005m5759r9150j31194J66059m7857
16835b76021m0691J28296L3789j14862J07385P3067j62464P8462l7921q7627J81650
16824a16937P6926J02321r3797N2910N4311j88595o6316J6979q0977J8945J03458
16813a20772J22854J58622j49742L3639Q6179K8315q4038j43595m1347K66700
16803A56815L6826M3565R9861l3654j30787q7810j57412O5076l707j78073o3070
16792b52370j44240J44771J69972J6166P5646m9061n1346J90863J77914j09424
16782A68891q6102m5381j90621j41166l5700J31398J73614n1645m0279P2074Q9782
16771D4865O9661j2143K6550p9866n5815P5359O2623q1118J4181j59523N200N4887
$$ plain form
16846 -107624 -149247 -97996 -194119 -248630 -271125 -118120 -163879 -263029 -394223 -228164 -276021
16835 -276021 -316712 -188416 -154627 -269489 -162104 -89037 -251501 -173039 -210960 -298587 -116937
16824 -116937 -40011 62310 -31487 21423 75734 -112861 -179177 -162198 -243175 -224230 -120772
16813 -120772 2082 160704 10962 44601 130780 159095 75057 -68538 -109885 156815
16803 156815 193641 237206 337067 303413 172626 84816 -72596 -7520 -11227 -189300 -252370
16792 -252370 -396610 -251839 -81867 -65701 9945 -39116 -90462 100401 278315 168891
16782 168891 82789 37408 -153213 -294379 -330079 -198681 -25067 -76712 -116991 -44917 44865
16771 44865 114526 102383 128933 49067 -6748 68611 131234 50116 64297 -95226 -90026 -35139
16759c5139j0429J78441p193j9926M2107R651J24057j23335j59772K7343p773
16748A8032j19775L5323J00717r6643j72039o4745K76531R7664n4523p5961j62980
16737b18399n3626L2802L3402O265l6322J27653N1572N5360j78230j44550R8997
16726b25076J78089J5680j14854L5928J3158m6714j1018M4840J04679N877m559
16715c970q969n2208J50988J10323l9170K2776k9311q4357q6333P5224q7065j10556
16703a42628n6070J43025k9903k663l955R3360O9334L0172n5087r5673k42945
16692b93033m5531J57168J61106J13315N097j44434j29350j17824k53n0804N4611
16681b89932j7757J73112J15511k6264m604j7486M1405J92445J49791p8552j71810
$$ plain form
16759 -35139 -45568 132873 125680 105754 147861 157512 281569 158234 -1538 25805 18032
16748 18032 -101743 -66420 34297 -62346 -234385 -299130 -22599 75065 20542 -55419 -218399
16737 -218399 -272025 -239223 -205821 -199556 -235878 -108225 -56653 -1293 -179523 -324073 -225076
16726 -225076 -46987 -31307 -146161 -110233 -97075 -143789 -154807 -109967 -5288 589 -3970
16715 -3970 -12939 -65147 85841 196164 156994 179770 150459 66102 -20231 54993 -32072 -142628
16703 -142628 -198698 -55673 -85576 -88239 -92194 1166 70500 100672 45585 -50088 -293033
16692 -293033 -338564 -181396 -20290 93025 98122 -46312 -175662 -293486 -293739 -344543 -289932
16681 -289932 -307689 -134577 -19066 -45330 -49934 -67420 -26015 166430 316221 237669 65859
16670F5859k65795j14584L0277L416R7049P4080J31932Q4563P953K16021M4390
16659C75161m7938o4359j05158j8547J47960k8407q5233j59661L4245j5863j47106
16648a14906p0071J500J52696J60166j37902l2057M3486L0215j08876m03949j93013
16637f72711J78165J44703P6262j24201j44081J34186K78082j4019L0615J70979
16627E7980K7318l8089j08238l9696P0202n4991k26191k246J40325j8130j9038
16616b10794R6271k3619j2890o7221p1469N1820Q163j4676N6227j3466J75439
16605b6215M8173K1346J6587n2137k8212J53581P9460q1360l0598j70398n6939
16594a26712L9020J42843k2208J06632k21648j84613J10912M78J4650j35153j48245
$$ plain form
16670 65859 -199936 -314520 -284243 -280827 -183778 -109698 22234 106797 114750 330771 375161
16659 375161 327223 262864 157706 139159 287119 258712 173479 13818 48063 32200 -114906
16648 -114906 -184977 -183477 -30781 129385 -8517 -40574 2912 33127 -75749 -479698 -672711
16637 -672711 -494546 -349843 -273581 -397782 -541863 -407677 -129595 -143614 -112999 57980
16627 57980 85298 47209 -61029 -100725 -30523 -85514 -311705 -313951 -173626 -191756 -210794
16616 -210794 -114523 -138142 -151032 -218253 -289722 -237902 -229739 -244415 -188188 -201654 -26215
16605 -26215 21958 43304 59891 7754 -20458 133123 212583 131223 100625 -69773 -126712
16594 -126712 -87692 55151 32943 139575 -82073 -266686 -155774 -155296 -140646 -275799 -424044
16583d24044J95250L3102J28828J3665j83707N534P7852N4812J56650K2355m9693
16572C0604K0789O25J6084m1771j8029R2901J45152j48079k67660o2913K29563
16561b734J11812k413o9058j10355p1322j21229j74288J50620K52742J34326P9216
16550A77317j846k0580L1771q4654J17376q2577o9122j29985P7896J00748l7245
16539G9099n9957K1622l9495k07080k81384J17566K18376l2599j06977J49158
16529a41671J39847j12667r0953r755N5663M424l6095n0099j94141n2895J56175
16518c32167J90944P9501J06434p9804j7476j6390k25787p2538N2430r0279j9671
16507d24803K7287M5396M2402J24432Q0370p315Q328j06794Q0910J1013n9678
$$ plain form
16583 -424044 -228794 -195692 -66864 -53199 -236906 -231372 -153520 -98708 57942 80297 30604
16572 30604 51393 52018 68102 26331 8302 101203 246355 98276 -169384 -232297 -2734
16561 -2734 109078 106665 37607 -72748 -144070 -265299 -439587 -288967 -36225 98101 177317
16550 177317 175471 154891 186662 102008 219384 136807 67685 -62300 15596 116344 79099
16539 79099 19142 40764 1269 -205811 -487195 -369629 -151253 -183852 -290829 -141671
16529 -141671 -1824 -114491 -205444 -215199 -159536 -155112 -191207 -241306 -435447 -488342 -332167
16518 -332167 -141223 -61722 44712 -35092 -52568 -68958 -294745 -367283 -314853 -405132 -424803
16507 -424803 -397516 -352120 -309718 -185286 -104916 -112231 -103903 -210697 -129787 -118774 -178452
16496a78452q769J43085o6554p9857k0618q6773k7201J56394N1611K3770J30606
16485C7242R3774n6543j39121R9736J0927R451R3877K965L445k20917j499p474
16473g4137L149J35615J34957R7627m5479k1499q7518j6377n8146j18463J3930
16462c6341Q9551r8212k36999m7773J30680P234M9479m1196j49082R2651K04133
16451c5875Q3691j17401j09311J9650q1534Q2174P7908K9311m1377l9840k15666
16440c48270j7241J32396J61238J44001L4576j92828k25449o0136L19211O4635
16430A2133R9210l7823j07614J11082J35548l2017j53193K7887p421n2489J7387
16419A2690p2431l9855n1751m6334N9371J8394O4817j07613P2416j11565j60416
$$ plain form
16496 -178452 -187221 -44136 -110690 -190547 -211165 -297938 -325139 -168745 -117134 -93364 37242
16485 37242 131016 74473 -64648 35088 46015 55466 149343 152308 155753 -65164 -66663 -74137
16473 -74137 -70988 64627 199584 297211 251732 230233 142715 126338 68192 -50271 -36341
16462 -36341 53210 -45002 -282001 -329774 -199094 -191860 -142381 -183577 -332659 -240008 -35875
16451 -35875 47816 -69585 -178896 -159246 -240780 -158606 -80698 -51387 -92764 -132604 -348270
16440 -348270 -365511 -233115 -71877 72124 106700 -86128 -311577 -371713 -52502 12133
16430 12133 111343 73520 -34094 76988 212536 180519 27326 55213 47792 -4697 12690
16419 12690 -59741 -99596 -151347 -197681 -138310 -119916 -55099 -162712 -90296 -201861 -362277
16408c62277M8325m4719J16841J07541P8193J20534p2952P7105j43360O7470L3087
16397B5788l3696O8225K3804L2115K8449j03298J770J4982L472P9341K7036o2585
16385A05403M525o1570N3478J5714j45127J37982j0649M8693m6982K2146M4977
16374A68590o6562r5151P0766n2577r5563m5238j40049j23447J61503K08911Q6136
16363G7319o9558k41818J2802Q7776J75426k4142k4653Q8531Q2140M3365r3896
16352A13292k5701M3409j36217j23186M9671J38658J25746O2387k46854j61245
16342a60040o5714k38814n2275J34034R1958M3960N9522m1806K47610J51747m8018
16331A22164j82034q0720L2826M4336m7631M7344J9410o3057N8585L6627J0675
$$ plain form
16408 -362277 -313952 -358671 -241830 -134289 -56096 64438 -8514 68591 -74769 -7299 25788
16397 25788 -7908 60317 84121 116236 144685 41387 43157 58139 61611 140952 167988 105403
16385 105403 109928 48358 101836 117550 -27577 110405 99756 148449 101467 123613 168590
16374 168590 102028 6877 77643 25066 -70497 -115735 -255784 -379231 -217728 -8817 77319
16363 77319 7761 -234057 -221255 -133479 41947 17805 -6848 81683 163823 207188 113292
16352 113292 87591 131000 -5217 -128403 -78732 59926 185672 248059 1205 -160040
16342 -160040 -225754 -464568 -516843 -382809 -290851 -246891 -187369 -229175 18435 170182 122164
16331 122164 -59870 -140590 -107764 -63428 -111059 -63715 -44305 -107362 -48777 -12150 -1475
16320a475j16768Q6452p7592k1385P6021l1240o880R3022m8351J23320j5840J8740
16308G8024l5657j18472J947K9043q115N943N0877q0298n5152M2057P8903J14721
16296A03821L310N6819O3268j03141j74227k1664p7077m3847J21669J40939l4923
16285C4947N7821j8921r6214k3641N9540p7946j31653M0952Q885R925J36721J06738
16273A07154k2352r8021p3409J49171R016k7234j01646j30077L9454J75910P4537
16262A02503N1997j16785j77762j49549J18016M2327J26437O8329o767N9343j46499
16251b8410k14750o3414R9406J08958M0061J27850j42790j69107L4229J01506
16241a06461J09938N1935j36643o643K9425k2700K659J29778r7297J56284J2070
$$ plain form
16320 -1475 -118243 -31791 -109383 -130768 -54747 -85987 -92867 155 -48196 75124 59284 78024
16308 78024 42367 -76105 -74158 -45115 -53230 -47287 3590 -76708 -131860 -89803 -10900 103821
16296 103821 107131 163950 227218 124077 -50150 -71814 -148891 -192738 -71069 69870 34947
16285 34947 92768 73847 -22367 -46008 13532 -64414 -196067 -155115 -146230 -136305 416 107154
16273 107154 84802 -13219 -86628 62543 71559 44325 -57321 -187398 -147944 27966 102503
16262 102503 154500 37715 -140047 -289596 -171580 -129253 -2816 65513 58746 118089 -28410
16251 -28410 -243160 -306574 -207168 -98210 -58149 69701 -73089 -242196 -207967 -106461
16241 -106461 3477 55412 -81231 -87874 -58449 -81149 -78490 51288 -46009 110275 122345
16230A22345k34398p6128N377P1182O0422O3328l5292M3195Q9613J16621l2034
16219A94231j29496j10169q6917J25486J16489l8177l5445J0895K6172j03323
16209c0254j544Q7331M4498k2567r2251j8119m4206j72695L5491J69606N6812
16198A2102r563j11480l4879m7749j19267j53232K00942J99687J2345j36740n5509
16187b43343l2161J02242K33103M9867j52669K0353K5898J5842r3492p2611J38455
16176h516K1707N3864Q1900M7633r4381j11150k6066J37551Q2281N3862k24494
16165A4191p0426p0375O6244P7008M2555j28211K3788r4110J5604J15722m1903
16154d9913J9599J11389J50343o352k79944k17568J28221k0122l9137j7783K27927
$$ plain form
16230 122345 -112053 -188181 -182804 -111622 -51200 12128 -23164 20031 109644 226265 194231
16219 194231 64735 -45434 -132351 -6865 109624 71447 36002 46897 73069 -30254
16209 -30254 -31798 55533 100031 77464 -14787 -32906 -77112 -249807 -214316 -44710 12102
16198 12102 2539 -108941 -143820 -191569 -310836 -464068 -263126 -63439 -51094 -187834 -243343
16187 -243343 -275504 -173262 59841 109708 -42961 -22608 3290 19132 -74360 -146971 -8516
16176 -8516 13191 67055 148955 196588 102207 -8943 -35009 102542 184823 238685 14191
16165 14191 -56235 -126610 -60366 16642 59197 -69014 -45226 -139336 -123732 -8010 -49913
16154 -49913 -30314 81075 231418 225066 -54878 -272446 -144225 -164347 -203484 -221267 6660
16143F660J89094J1950n4668j56111R909L1149J45177N1376p3644J6500q6836
16132I0556k7290N6388k50712j51189J93006M3266l4836o754n9217K7741R1055
16121b7986n2519j8867M0906j35865j35511R0051J98358M6254k27331L8620o7541
16110b51431L176K1826P333P0230J15913n5972J2068J00083Q0748m2187n563J0750
16098F6974r6933P2527l7373J63422L1987n051O5950j70411j69516k64377L3027
16087c09774Q2061j1442K24150K18025j7773j70538R3069J13639o3012q8184J21870
16076A92091n4809L0753J54760j08435p7638K06386J4136j56604r333J14888o3787
16065B42408m7596j31959k36320Q8568J67170O4768j07066l5987j54102n32n0868
$$ plain form
16143 6660 195754 207704 153036 -3075 6834 37983 183160 234536 160892 177392 90556
16132 90556 63266 119654 -131058 -282247 -89241 -45975 -80811 -87565 -146782 -119041 -27986
16121 -27986 -80505 -99372 -58466 -194331 -329842 -239791 -41433 4821 -222510 -183890 -251431
16110 -251431 -248255 -226429 -219096 -148866 -32953 -88925 -76857 23226 103974 61787 56224 66974
16098 66974 -29959 42568 5195 168617 200604 195553 261503 91092 -78424 -342801 -309774
16087 -309774 -227713 -239155 -15005 203020 185247 14709 107778 221417 158405 70221 192091
16076 192091 137282 168035 322795 214360 136722 343108 357244 200640 191307 306195 242408
16065 242408 194812 62853 -173467 -84899 82271 147039 39973 3986 -150116 -150648 -201516
16054b01516j11834j53595N9922J55991R4903R0185J15361q1236o3082L8988K3242
16043c2671N4309K2301J35653l7594n2987q9290j54065j464J60313q8655j14412
16032a98562M4811L6655K8995r5142M8501J4511r4530M6267J23356k5861k3981
16021i4980k9836l9000r223L1198j8033l3423R9090J45023l7300m4946J16426
16010H4996k7903n9023J39899K0465k27087N2887P6345J105O2226j06319j23384
15999a05793k363N0894K3064J04294k07942j24226P793K6992p4287Q509L2580
15988b60485L5959K3376J41859P934j4330m7440j42008r380r631K3072J28454
15977a22620J03279J46753q0316j55220J2492R8432m2227P7724J25145j34716
$$ plain form
16054 -201516 -313350 -466945 -407023 -251032 -156129 -65944 49417 -31819 -94901 -55913 -32671
16043 -32671 21638 43939 179592 141998 89011 -279 -154344 -155808 4505 -84150 -198562
16032 -198562 -153751 -117096 -88101 -183243 -134742 -120231 -214761 -168494 -45138 -70999 -94980
16021 -94980 -124816 -163816 -173039 -141841 -159874 -193297 -94207 50816 13516 -31430 84996
16010 84996 57093 -1930 137969 158434 -68653 -15766 60579 61684 123910 17591 -105793
15999 -105793 -108156 -57262 -34198 70096 -137846 -262072 -254279 -227287 -301574 -293065 -260485
15988 -260485 -224526 -201150 -59291 -51357 -65687 -113127 -255135 -264515 -274146 -251074 -122620
15977 -122620 -19341 127412 47096 -108124 -95632 2800 -39427 38297 163442 28726
15967B8726J0258J88452o3668j39044n9942l2871o6427m5548J05510k2443O2461
15956c4536P4849j10256J17396o7310n3922j25127r8892m6340R6978l7489J28263
15945a56386J79596j4421N0825j04895l3115J21799N7886J9064k0680j19891k5152
15934d5370O0943N5560J11498m927j84299m2399P6747j5637l3509r8120k9719
15923a49232l3596N6250l3427J3398P8362R9500J20204j6655R3223M3279k39337
15912C1969j26348m6437m7463M5356O7760M1856j3505o5022j62045r2357K28922
15901a37314k812M0946o5786R2747Q0879j26377j27921L7665L7687j45217P5643
15890b39860J48197Q5840Q9688k9233j74836o277O994l6057k1969J17670R736
$$ plain form
15967 28726 38984 227436 163768 24724 -35218 -68089 -134516 -180064 -74554 -96997 -34536
15956 -34536 40313 -69943 47453 -19857 -73779 -198906 -297798 -344138 -247160 -284649 -156386
15945 -156386 23210 8789 59614 -45281 -78396 43403 101289 120353 99673 -20218 -45370
15934 -45370 15573 71133 182631 177704 -6595 -48994 27753 12116 -21393 -119513 -149232
15923 -149232 -182828 -126578 -160005 -146607 -68245 31255 151459 134804 228027 271306 31969
15912 31969 -94379 -140816 -188279 -142923 -75163 -33307 -46812 -111834 -273879 -366236 -137314
15901 -137314 -140126 -99180 -164966 -72219 8660 -117717 -245638 -207973 -170286 -315503 -239860
15890 -239860 -91663 -5823 83865 54632 -120204 -126481 -119487 -155544 -177513 -59843 -50107
15879e0107j98086p608K42157k7029j66454k40669L6822K41853K41759J00454
15869A73092P8174k35414J0290j46624k1258J66007o0766j98897J2834J32885
15859h9677J04426J0716l4645j7611k00143j51141Q7023J49647K36821J21984
15849B17400J0043l7459j68119n9159J2325k3467j5071j92874j31636K7549N3061
15838c07407L5140J74702J07591j09713K2319L7045L519j5343j7441r1373J3717
15827a47244q012M6150O0006L9173l090p9401l0808j409j10109K8294L2555k0434
15815a94329J20156K18357P2611k49879k2543M7200j26051K7624R4404L2469P7552
15804I7571l0774M4059L4267K7o2837n5176o0752r634O4774j25052o0817O5960
$$ plain form
15879 -50107 -248193 -255801 -13644 -40673 -207127 -447796 -410974 -169121 72638 173092
15869 173092 251266 15852 26142 -120482 -141740 24267 -36499 -235396 -222562 -89677
15859 -89677 14749 25465 -9180 -26791 -226934 -378075 -291052 -141405 95416 217400
15849 217400 227443 189984 21865 -37294 -24969 -48436 -63507 -256381 -388017 -360468 -307407
15838 -307407 -272267 -97565 10026 -99687 -77368 -40323 -36804 -52147 -69588 -160961 -147244
15827 -147244 -155256 -109106 -49100 -9927 -13017 -92418 -123226 -124635 -234744 -206450 -173895 -194329
15815 -194329 -74173 144184 216795 -33084 -55627 -8427 -134478 -106854 -12450 20019 97571
15804 97571 66797 110856 145123 145150 82313 27137 -33615 -43249 21525 -103527 -164344 -98384
15792i8384o6754q8371j07752Q1406M9994r865j4730N0783K9623O9524P9685J5182
15780i659M649Q0105q6105k7620j803j61076r5677K3326J24795M0032O8575K8627
15768a1831j47986J65342K2729m3620M9021m8749Q1170k0053p3485K2577N7057
15757E2172j49231k07580N4059K35497l4497P0434k3157q8347q9627N3515k3993
15746a50755J50251P1762p1834k3899j56508K5739J11207J9119q6412K7842j12668
15735a96156K3530j4946l4673J97924R0852r7715K4819N5776N7708J2416l1802
15724H7733k24570K369O0232K24112K1981k32287M5712K09057j8026m1548j3874
15713A20891j86838j4291J30610j4809p8959J10855J35882M949j15488J2653n7546
$$ plain form
15792 -98384 -165138 -253509 -361261 -279855 -229861 -239726 -254456 -203673 -174050 -104526 -24841 -9659
15780 -9659 -5010 75095 -11010 -38630 -40433 -201509 -297186 -273860 -149065 -109033 -40458 -11831
15768 -11831 -159817 5525 28254 -15366 33655 -15094 66076 46023 -27462 -4885 52172
15757 52172 -97059 -304639 -250580 -15083 -49580 20854 -2303 -90650 -180277 -126762 -150755
15746 -150755 -504 71258 -576 -24475 -180983 -155244 -44037 -24918 -111330 -83488 -196156
15735 -196156 -172626 -187572 -222245 -24321 66531 -31184 -6365 49411 107119 119535 87733
15724 87733 -136837 -134468 -74236 149876 171857 -60430 -14718 194339 176313 134765 120891
15713 120891 -65947 -80238 50372 35563 -43396 67459 203341 208290 92802 105455 47909
15702D7909r4945j49608L6138Q7952R495j8920l0119q4770J812L3815J42731L9664
15690B1154O4391l6224q1519J8130l1097N9245M065r5172m16J4501m764j46353
15678b14059O8579K08468J06454M4145n7215O1386L3460R49q699o1210K3929m5670
15666A60517j3228J9154o8155p167j8260n1505j61206r090N4870q2979M9521J31532
15654D004O8843J82940o1792j29588l5332p5008M3231N5836k9253j67633P841
15643a35911K6008j67164J61852J66730k2045o1146j58347Q5925J29139N955m2643
15632a1647m8781q4964p3675J11826O851q1218k24912J65809K42407Q639j08031
15621i7696N7922J11833j3507O1182r0526j3654P8777j4889j22559o6710k7599
$$ plain form
15702 47909 -47036 -196644 -160506 -72554 -63059 -81979 -112098 -196868 -195056 -161241 -18510 21154
15690 21154 85545 49321 -32198 -14068 -45165 14080 18145 -77027 -77443 -62942 -67706 -214059
15678 -214059 -145480 62988 169442 213587 156372 217758 251218 252167 243468 182258 206187 160517
15666 160517 147289 166443 98288 91121 72861 21356 -139850 -148940 -94070 -177049 -127528 4004
15654 4004 72847 255787 193995 64407 29075 -45933 -2702 53134 23881 -143752 -135911
15643 -135911 -109903 -277067 -115215 51515 29470 -31676 -190023 -104098 25041 30996 -11647
15632 -11647 -60428 -145392 -219067 -107241 -100390 -181608 -406520 -240711 1696 10335 -97696
15621 -97696 -39774 72059 58552 119734 29208 15554 94331 79442 -43117 -109827 -137426
15610a37426k300O124L3783j95343j07378r1710K26324K38841J50566j13448m3190
15599c5157l9586k0859R7783J53184j39897j7167K0176p9382q7662J35343J62110
15588A48886o2960n6048l6597O2489Q141o3329k9031k3454n7226j58226p476L8812
15576b36019l770J17239P6014Q5238j00698r8009O1092O5630n1112n623k2640
15565a12658L6025J16732q7824j27085Q513j06556J0018J06721J41765K9064m4836
15554c0121l0781K5986N8094N7179L0575M9338m5930j59943j54084N8368K06090
15543F4771J56156O3724p5730l2650q7881N2525K8970K5156p1977m1623j26184
15532d4743n4692j4062j9049K4470p4894N4887Q3837J99722P1123m5235J9552
$$ plain form
15610 -137426 -139726 -133602 -99819 -295162 -402540 -494250 -267926 -29085 121481 8033 -35157
15599 -35157 -74743 -95602 2181 155365 15468 -1699 18477 -60905 -148567 -13224 148886
15588 148886 85926 29878 -6719 55770 63911 582 -28449 -51903 -109129 -267355 -274831 -236019
15576 -236019 -239789 -122550 -46536 38702 -61996 -160005 -98913 -33283 -84395 -90018 -112658
15565 -112658 -76633 40099 -47725 -174810 -166297 -272853 -262835 -156114 -14349 14715 -30121
15554 -30121 -60902 -34916 23178 80357 110932 160270 114340 -45603 -199687 -141319 64771
15543 64771 220927 284651 208921 176271 88390 140915 169885 195041 123064 81441 -44743
15532 -44743 -99435 -113497 -132546 -108076 -182970 -128083 -44246 155476 226599 181364 200916
15521B00916j74919m7482P3841j8399n6841J52652J57120P3006J32791j7054l39147
15510A36484j52396n5258J02801J41471k46718j41037J96608j4626k8989j05344
15500a67004L9905k17185j28372K48383J14773o612K00287M7297J06058N8382
15490B95912j47428j96124p4142O3044P4940q9168N5565p8787j50420R1739k8152
15479a83021M1277J43564J04014m2300q6837j1677o7102j58666j9854j2877n261
15468b98740L1868l7159K49215N1566r9362o196J43229J36565J4982j6101k4460
15457A45407j30127j70842P7712M179k2562j0072k22192R5040J31517p5267R710
15446a67497Q2639N8280O1976p2549K0461o7204j98967j15942p1457K14505J60929
$$ plain form
15521 200916 25997 -21485 52356 33957 -22884 129768 286888 359894 492685 475631 136484
15510 136484 -15912 -71170 31631 173102 -73616 -214653 -18045 -32671 -61660 -167004
15500 -167004 -127099 -344284 -472656 -224273 -109500 -116112 84175 131472 237530 295912
15490 295912 148484 -47640 -121782 -58738 16202 -72966 -17401 -96188 -246608 -154869 -183021
15479 -183021 -141744 1820 105834 63534 -23303 -34980 -102082 -260748 -280602 -293479 -298740
15468 -298740 -266872 -304031 -54816 -3250 -102612 -108808 34421 170986 185968 169867 145407
15457 145407 15280 -155562 -77850 -73671 -96233 -106305 -328497 -233457 -101940 -177207 -167497
15446 -167497 -84858 -26578 35398 -37151 -16690 -83894 -282861 -398803 -470260 -255755 -94826
15435i4826j39750k11002n5801J89465K38315M7519O445L8056P1771O592k08393
15424a11609J20497J58183L2655j1823j49373j16142l6322O3800M7929o3133J5146
15413e0192j97932o373Q6632J9214J00858J06245J08771P9345k40141j08578k5726
15402a27877j3670j79706J8578K06464J41103K6614j56307o4969J9156K6383j8351
15391a22582L7313k8192L9020o7082J4259j90669J016J41475J0665O9187J08049
15380A2459L3788J10656j4786R3508M092J9727k9486m7213o0685l8862j10262
15369b7064k5192L5012L0089k0326o5118R2675L3063o1095K6212j37485j19865
15358b39094j4209J30364p0528O3163P9344r8843m6002J55866J93152M4636k5571
$$ plain form
15435 -94826 -234576 -445578 -501379 -311914 -73599 -26080 -19635 18421 90192 96784 -111609
15424 -111609 8888 167071 199726 187903 38530 -77612 -113934 -50134 -2205 -65338 -50192
15413 -50192 -248124 -254497 -167865 -148651 -47793 58452 167223 246568 6427 -102151 -127877
15402 -127877 -141547 -321253 -302675 -96211 44892 71506 -84801 -149770 -130614 -104231 -122582
15391 -122582 -85269 -113461 -74441 -141523 -127264 -317933 -316917 -175442 -164777 -95590 12459
15380 12459 46247 156903 142117 235625 239717 259444 229958 182745 122060 83198 -27064
15369 -27064 -52256 -17244 12845 -7481 -72599 20076 53139 -7956 18256 -119229 -239094
15358 -239094 -253303 -122939 -193467 -130304 -50960 -149803 -195805 -39939 153213 197849 172278
15347A72278j00727l2238M1285l4638j09653R5935K0068R9257p5633j26343L2959
15336a7450J22005M4124p7196j33661J31051k0242l19698j09584r737R8846K2104
15325b69438j7292Q8406J01501J20710r8914q98l3187O9233n458k3239j15831
15314a84407J62985K9769o579j04468O5985N8060J15930j50858p4139P2553r6073
15303a11242l4862J08011K11015l8787M8122L3690m500j05802k6408J25883P7398
15292B82518m1303M2540J2487j25331j54060M1318j7391N8816J0060M3134n1590
15281A01198m9017O5767R3184l410N3227M1872l6768j05634N871n4511k9971m9307
15269C2501q0097K6925K2934N1340J38103R720j16527k3054n8819j11909J1651
$$ plain form
15347 172278 71551 39313 80598 45960 -63693 32242 52310 151567 75934 -50409 -17450
15336 -17450 104555 148679 71483 -62178 68873 48631 -271067 -380651 -390388 -291542 -269438
15325 -269438 -286730 -198324 -96823 23887 -75027 -75925 -109112 -39879 -45337 -68576 -184407
15314 -184407 -21422 8347 1768 -102700 -36715 21345 137275 -13583 -87722 -15169 -111242
15303 -111242 -146104 -38093 172922 134135 182257 215947 211447 105645 79237 205120 282518
15292 282518 241215 283755 296242 170911 16851 58169 40778 99594 109654 152788 101198
15281 101198 52181 117948 211132 207722 260949 302821 266053 160419 166290 111779 81808 32501
15269 32501 -47596 -20671 2263 53603 191706 201426 84899 61845 3026 -108883 -97232
15258i7232P2206J60619Q6767L5111L6829R0139K4244k7604O8873j19012j50584
15247A80356j21890p8897j14200Q0199N7347J20615J24683j7563j61027r8317
15237b8694J00799q373l8399j88438j54585O7518K11254n6632p0366k332M153
15226a64095P5346J04575o6269n7966j38377J90578J45775j51698k4553m0910
15216a27594j50500n1679J47847P8605J54005n273j00969J4864m9307R448k9362
15205a09915k2468N0768J26059o4949q7185M7558J08715K5470L9756j14210k07594
15194b07995R4402J54241k8672j34610j33676M0216J09125K1636J5017J5725N554
15183d9037K05027J50138N0669L9181q9350k39730j76662j5805K76422L8292r7396
$$ plain form
15258 -97232 -25026 135593 222360 257471 294300 384439 408683 381079 449952 330940 180356
15247 180356 58466 -20431 -134631 -54432 2915 123530 248213 230650 69623 -28694
15237 -28694 72105 63732 25333 -163105 -317690 -250172 -38918 -95550 -165916 -168248 -164095
15226 -164095 -88749 15826 -50443 -108409 -246786 -56208 89567 -62131 -86684 -127594
15216 -127594 -278094 -329773 -181926 -103321 50684 45411 -55558 -40694 -90001 -80553 -109915
15205 -109915 -132383 -81615 44444 -20505 -107690 -60132 48583 74053 113809 -401 -207995
15194 -207995 -113593 40648 11976 -122634 -256310 -216094 -106969 -85333 -70316 -54591 -49037
15183 -49037 155990 306128 356797 395978 306628 66898 -109764 -125569 150853 189145 91749
15172I1749r1874n6442p2600L8696J61468k7544j27281j43339k5174J17696O4445
15161g0200m0101k17767o9191N6915r7392J26667K61521K9896p5906j18117k7622
15150b41297n1490P6898n5835l512J57689Q1419J09991n3094j14493r130L9706
15139f3148j8289j2630m901j2205o4200J03984M1457P4823Q5995R4552K5107J2305
15127B62850r9941M6890J20262n9120j80676l4507o0021j1651j3465p0980j4422
15116a14781P6760M2894J4882J15503R377P428k3013r4310j52457J39985J52691
15105A74959p4439K1076O6356l3783j91851O2282j4322M752l4676r5212r1073
15094b05931J921o2095J39673l9180q4844m767j07878O7008J20831j04870k6057
$$ plain form
15172 91749 -125 -56567 -129167 -90471 70997 43453 -83828 -227167 -252341 -134645 -70200
15161 -70200 -110301 -328068 -397259 -340344 -437736 -311069 -49548 -19652 -95558 -213675 -241297
15150 -241297 -292787 -215889 -271724 -275236 -117547 -36128 73863 20769 -93724 -102854 -63148
15139 -63148 -81437 -94067 -98968 -111173 -175373 -71389 -29932 44891 130886 225438 250545 262850
15127 262850 162909 209799 330061 270941 90265 55758 -4263 -15914 -29379 -100359 -114781
15116 -114781 -38021 4873 19755 135258 144635 152063 129050 34740 -117717 22268 174959
15105 174959 100520 121596 187952 154169 -37682 24600 10278 15030 -19646 -114858 -205931
15094 -205931 -204010 -266105 -126432 -165612 -250456 -255223 -363101 -296093 -175262 -280132 -306189
15083c06189M4844J03117M4660q436L1369J05901J61322m3670q3166l6552m4301
15072c1101o9440o8736j24643K6856P2566Q0690R0326O6145j751j83010k2373
15061a64471L0676L2500q697j06091M2823J47218j42314R3372K05297O3855j10428
15050H3740l3826p1872o6195m9423O9078J1072P1726M4446k55254j51749R0097
15039b58160J35533N5528R0937n37P6474J8737O0888r7321j01347K8059j98257
15028a89466O8562K8420M019o9770l5262R4810J27108j30048p8740P5988J21458
15017A7079o8724q5699k04649j5929l1680j1342K67880J04658j3683j0347J16729
15006F4293J1144n8733R341J56820J59120l6605j39706j45172R8813p9675l07081
$$ plain form
15083 -306189 -261345 -158228 -113568 -122004 -90635 15266 176588 132918 49752 13200 -31101
15072 -31101 -100541 -169277 -293920 -267064 -194498 -113808 -23482 42663 40912 -142098 -164471
15061 -164471 -133795 -101295 -109992 -216083 -173260 -26042 -168356 -74984 130313 194168 83740
15050 83740 49914 -21958 -88153 -137576 -68498 -57426 14300 58746 -196508 -348257 -258160
15039 -258160 -122627 -67099 23838 23301 99775 118512 179400 82079 -19268 8791 -189466
15028 -189466 -120904 -92484 -88465 -158235 -193497 -98687 28421 -101627 -180367 -104379 17079
15017 17079 -51645 -137344 -341993 -357922 -389602 -400944 -133064 -28406 -42089 -52436 64293
15006 64293 75437 16704 26045 182865 341985 305380 165674 20502 119315 39640 -267441
14995b67441l2552M9951J1123J15771J20482R0949M0573p997j50656n0636o039
14984h6472n1510j06320J12787J15565j58373j37586j34725m8815j05704K24529
14974c76624J0545J13495R9942k7638r155N3644K1826R28L1944R1361l6323J39160
14962A13105k6667j85110o7519L9267N0225o6592l7299O3576L8037m7435J55209
14951B8797n5662o8155O5723k111n8375P9685p6005R5921O7488o9979N6620k00938
14939a36991j34939J50167J19839n1211J07637n1720r993l2410j26761j07387
14929b73769J2921j6540P043n2444K6821L7406N2536P8345R7901p426o3740J17022
14917A6076K36759m3108j54885k0067m1222j687O2555N7138J35401k8583J40175
$$ plain form
14995 -267441 -299993 -250042 -238919 -123148 -2666 88283 128856 120859 -29797 -80433 -86472
14984 -86472 -137982 -244302 -131515 -15950 -174323 -311909 -446634 -495449 -601153 -376624
14974 -376624 -366079 -252584 -152642 -180280 -189435 -135791 -113965 -113037 -81093 10268 -26055 113105
14962 113105 86438 -98672 -166191 -126924 -76699 -143291 -180590 -117014 -78977 -126412 28797
14951 28797 -26865 -95020 -29297 -31408 -89783 -10098 -86103 9818 77306 7327 63947 -136991
14939 -136991 -271930 -121763 -1924 -53135 54502 2782 -7211 -39621 -166382 -273769
14929 -273769 -260848 -277388 -270345 -322789 -295968 -258562 -206026 -127681 -29780 -37206 -100946 16076
14917 16076 252835 209727 54842 34775 -6447 -8134 54421 111559 246960 218377 358552
14906C58552r0168k34439j47213o3287J387J42472K3938m5865O7774L2052q1630
14895c6427j34247m2970J3517J43550K74938l8849j20644j22657J50265N0236
14885A36712L1716J23262O0010p4180k03078k16230j21146J56301R4074j50927
14875a63486l1975J56210j28516q8070L19618r396m851o3186o1790J367N3180
14864b0895k1939k7567j55510P3058K19876R9488O4180L5525J8755N276n1224
14853B39023j00590N311J3781k6598J1129j5005J37695L2638j21979k80345J7126
14842h7814J8713N2083J43323K1359p4800j29546n1288o2756O9255K4693j8643
14831i5421l3832J3617k5623p7830R949P9957J60228O8495m1424K5899l8328p4697
$$ plain form
14906 358552 268384 33945 -113268 -176555 -175168 -32696 -8758 -54623 13151 45203 -36427
14895 -36427 -170674 -213644 -200127 -56577 218361 179512 58868 -63789 86476 136712
14885 136712 168428 291690 351700 277520 74442 -141788 -262934 -106633 -12559 -163486
14875 -163486 -195461 -39251 -167767 -255837 63781 54385 49534 -13652 -75442 -74075 -20895
14864 -20895 -42834 -70401 -225911 -152853 67023 166511 230691 266216 284971 290247 239023
14853 239023 138433 143744 157525 130927 142056 127051 264746 297384 175405 -104940 -87814
14842 -87814 -69101 -17018 126305 147664 72864 -56682 -107970 -170726 -101471 -76778 -95421
14831 -95421 -129253 -115636 -141259 -219089 -209140 -129183 31045 99540 58116 84015 45687 -29010
14819b9010j33272Q055P9747j42756O9515P4122o1631J14855J14773J25131r2632
14808A26897p3166j70641j870o4806Q0720K00872J1129m8610J42627j13161l6851
14797E3140P783j20738j41r4938o0527k2386Q2317J57787M794q590o5448J28025
14785F1078P3767k1825N9183Q2676j62441r3584R4880M5499k2621J33169j24112
14774A25669R2663j20426k03101r7105j9991p6733j3250P8039j10142K05610J58877
14763B0110r5006o9449J45169J31848m0314j74327r4021J24370J62883J54689
14753B65952O4006k2590k09963j39184Q6419M2609m8035o0454o3124j31410o82
14742b16456J29051J25911L7252j46856k108J21763N4767N933K9047R2813J2364
$$ plain form
14819 -29010 -162282 -154227 -74480 -217236 -147721 -73599 -135230 -20375 94398 219529 126897
14808 126897 53731 -116910 -118780 -183586 -102866 98006 109135 60525 203152 89991 53140
14797 53140 60923 -59815 -59956 -154894 -215421 -237807 -155490 2297 7091 -1499 -66947 61078
14785 61078 134845 113020 172203 254879 92438 -1146 93734 139233 116612 249781 125669
14774 125669 218332 97906 -105195 -202300 -222291 -299024 -312274 -234235 -344377 -138767 20110
14763 20110 -74896 -144345 824 132672 92358 -81969 -175990 -51620 111263 265952
14753 265952 329958 307368 97405 -41779 44640 87249 39214 -21240 -84364 -215774 -216456
14742 -216456 -87405 38506 75758 -71098 -73206 48557 103324 109257 138304 231117 243481
14731B43481m291k10955q5642j2759m3704l323J41890O6688L6503o4543m8091
14720A5254k6492p9072O6075O9858K552L5202M47O7993j12546j58836K36865L3773
14708A51073m8544O7943J9400P1983j6096l9411j43215J62694J36855k19463o4603
14697G8616J38949n5032k5975n1945k3061m3700j37580N3159R6048j7345p9847
14686f7713j4736L4794O7032J1671p3379m4915K9844p1777q1820k278J19564L8401
14674e5312K13529K1096l1804j19390J7407R3187j4086j38524O4928M3661n0697
14663D3995P5917r3297n4523J69750P2726L5463k8211q3120j56255j4884l3733
14652f6172J00300J25985Q8723J00785o9071j38621j50825J87465J49282q3755
$$ plain form
14731 243481 239190 28235 -57407 -70166 -113870 -117193 24697 91385 127888 63345 15254
14720 15254 -11238 -90310 -24235 45623 48175 83377 83824 151817 39271 -119565 117300 151073
14708 151073 102529 170472 189872 261855 245759 206348 63133 225827 362682 143219 78616
14697 78616 217565 162533 136558 84613 61552 17852 -119728 -66569 29479 12134 -67713
14686 -67713 -82449 -47655 19377 31048 -42331 -87246 -57402 -129179 -210999 -213277 -93713 -55312
14674 -55312 158217 179313 147509 28119 45526 138713 124627 -13897 51031 94692 43995
14663 43995 119912 26615 -27908 141842 214568 250031 221820 138700 -17555 -32439 -66172
14652 -66172 34128 160113 248836 349621 280550 141929 -8896 178569 327851 244096
14642B44096m9882M5443n9689j6132q836K0704j47216P718J816R8273r1840p9463
14630c5008m0911N4291j6117p6184p8606k1560k234J17076q560q2824o0984J85880
14618f5741L5954K0514P4192j68406j7904J29745J08625M5287j4306J9857R9522
14607B67339j817j37299n1816m1984N017m5066l8912P3599l1862p8547q1016O9177
14595i3187o8290k9275o5366L866J41384L2703q1568O3704O8885j6036M6602o0288
14583e6866J9670J2650M5172n7900O9391N9544N8800k533J17478q5835r0706Q8750
14571A77615J92760P579j13889l2542L5776J4650l3104k3834j9920n193j05449
14560I4449j24536L5426l3012j6237J43782J85502j12561j77025r5373N9724J18080
$$ plain form
14642 244096 194214 239657 179968 163836 155000 175704 28488 36206 38022 136295 44455 -35008
14630 -35008 -75919 -21628 -37745 -113929 -192535 -214095 -216329 -99253 -107813 -190637 -251621 -65741
14618 -65741 -29787 -9273 64919 -103487 -121391 8354 116979 162266 147960 167817 267339
14607 267339 265522 128223 76407 34423 39440 -5626 -44538 29061 -2801 -81348 -162364 -93187
14595 -93187 -161477 -190752 -256118 -252252 -110868 -78165 -159733 -96029 -27144 -43180 3422 -56866
14583 -56866 -37196 -24546 20626 -37274 32117 91661 150461 147928 265406 179571 88865 177615
14571 177615 370375 377954 264065 231523 267299 281949 248845 225011 205091 199898 94449
14560 94449 -30087 5339 -27673 -43910 99872 285374 172813 -4212 -99585 -39861 78219
14549G8219p5970j2563N175l7Q268M8322O1676j58175r1863J59869j27857j91983
14537b96919j01545P0930J79671J29722q167P1827M8106n6060j07563J7698j9429
14526g1729j16782M7936J87949j3957j45631N0771j8133l7693m4923R8104O2377
14515a711K0583M3564n8034O9381P1394k5376p096M2327p8519o8210k08516j46889
14503c47102p8269N6881K15042J12660Q613j3797L5474K18359N4291o5786j02725
14492I3641p8356n4746n777r5181o3362O8273q103j65586l7941j8165J36705K73714
14480D5116n3994r6344J11315K8402l8873l7558K27299l2897R9974k6856k74774
14469d9190j57632Q8554R8658K3137J07151J10333j29085l3950J3277J49987J45837
$$ plain form
14549 78219 2249 -10314 -5139 -5176 3092 51414 113090 -45085 -136948 22921 -104936 -296919
14537 -296919 -398464 -327534 -147863 -18141 -26308 45519 93625 37565 -69998 -52300 -71729
14526 -71729 -188511 -140575 47374 33417 -112214 -61443 -79576 -117269 -162192 -64088 -1711
14515 -1711 18872 62436 4402 73783 145177 119801 112705 155032 76513 8303 -200213 -347102
14503 -347102 -425371 -368490 -153448 -40788 -32175 -45972 -10498 207861 262152 196366 93641
14492 93641 15285 -39461 -45238 -140419 -203781 -135508 -143611 -309197 -347138 -365303 -228598 45116
14480 45116 -8878 -105222 6093 34495 -4378 -41936 185363 152466 252440 225584 -49190
14469 -49190 -206822 -118268 -19610 3527 110678 221011 91926 57976 71253 221240 367077
14458C67077m0742o4491r405n0985r6348q7359M4050j4161m4257J23396j21291
14447E484p1300L259Q985J24999o7498o6095o4730K28090O2174j85887r3789j43596
14435b59904o5026J87591N3712j1647j08951k0555O1568J78435O906J2316j03665
14424f9220J23195J51460q0581j25057n0414j36557o1448p1159J6704J02168J52768
14413d8141K3600J97676J39247k2752K7540q0158j36832j7416j69305J70075J34466
14402B18000k50137j67302J19437P2324j1157Q392L0519l2902n2498J80507Q5989
14391B01172j01791R1607J48986Q7391R3628r3405j20774L0396n7477J65722J7440
14380D62895r7213o6376o7884P3052l3176M5206Q9209J58036J33060Q6514J14139
$$ plain form
14458 367077 326335 261844 252439 201454 105106 17747 61797 47636 3379 126775 5484
14447 5484 -65816 -62557 -53572 71427 3929 -62166 -126896 101194 163368 -22519 -116308 -259904
14435 -259904 -324930 -137339 -83627 -95274 -204225 -224780 -163212 15223 22129 34445 -69220
14424 -69220 53975 205435 124854 -203 -50617 -187174 -248622 -319781 -303077 -200909 -48141
14413 -48141 -24541 173135 312382 289630 317170 237012 100180 82764 -86541 83534 218000
14402 218000 -32137 -199439 -80002 -7678 -18835 -10443 20076 -12826 -65324 115183 201172
14391 201172 99381 190988 339974 427365 520993 427588 306814 337210 279733 445455 462895
14380 462895 365682 299306 231422 304474 271298 316504 405713 563749 696809 783323 897462
14369H97462J12149r5090j51319J79858j21984j80343r4461l8170M2512M4603
14359E95217K524L200o3737J53672K1860j0782K8J33130j4689P6582j1915o8788
14347H16302N2414L278J24363Q3891o7608k5043m1597L3404Q3376J26694J56454
14336A345928J04239j9440L1047J0588Q9505J9628l0244N6363K737p3455k5753
14325A511143j44651j9569j02725k0896J71449O9363r2983L2965K5715m6440L3826
14314A417197J84194J11636p8508o2443Q5003R9326J24100L76058K70371L52175
14304B879109L93085N57547M90347P72398O88549P56671O26405M94913K97110
14295G956134J81061N0740K6919J16151J88562K53069M09047N38085M12789O54505
$$ plain form
14369 897462 1009611 914521 763202 943060 821076 640733 546272 508102 550614 595217
14359 595217 597741 600941 537204 690876 712736 701954 701982 835112 820423 897005 885090 816302
14347 816302 868716 871994 996357 1080248 1012640 987597 946000 979404 1062780 1189474 1345928
14336 1345928 1450167 1430727 1461774 1472362 1561867 1581495 1551251 1607614 1610351 1536896 1511143
14325 1511143 1366492 1346923 1244198 1223302 1394751 1464114 1371131 1404096 1429811 1383371 1417197
14314 1417197 1601391 1713027 1634519 1572076 1657079 1756405 1880505 2256563 2526934 2879109
14304 2879109 3272194 3829741 4320088 5092486 5781035 6537706 7164111 7659024 7956134
14295 7956134 8137195 8187935 8214854 8331005 8519567 8772636 9181683 9719768 10132557 10787062
14285A0787062R45165P82971O57151M60600k3029J25721J69794k83429m89403
14276A3132603p46316n09969m20578l26709k50777J3825K65395L22085N35566
14267A2015125O10258N86067O18741P79136P28222P01824O75908M28536L7407
14258A7181224J62961Q9370o2308j68325j443K83768Q02190J075603J115901J156214
14248B1635155J154906Q57415O81888L27007J57277k85359r41872j073325j040590
14239B1472502j075153q28037n76563m79069k12541j26761M6707J47843m3458
14230A8325470j79264l22765n88000o74828p43473r50531r11447p60651o74836
14221A2519675o55412m85273k75639q9633j49445j5731K87167M77047O93585O16656
$$ plain form
14285 10787062 11732227 12515198 13172349 13632949 13609920 13735641 13905435 13622006 13132603
14276 13132603 12386287 11876318 11455740 11129031 10878254 10892079 11157474 11479559 12015125
14267 12015125 12625383 13211450 13830191 14609327 15337549 16039373 16715281 17143817 17181224
14258 17181224 17344185 17433555 17371247 17202922 17201479 17485247 18287437 19363040 20478941 21635155
14248 21635155 22790061 23647476 24329364 24656371 24813648 24528289 23586417 22513092 21472502
14239 21472502 20397349 19569312 18992749 18513680 18301139 18174378 18221085 18368928 18325470
14230 18325470 18146206 17823441 17235441 16560613 15817140 14866609 13955162 13194511 12519675
14221 12519675 11864263 11378990 11103351 11013718 10864273 10848542 11135709 11612756 12306341 12922997
14211A2922997N46076M92172K19954k73116m89012p76521q17531q55124p45322
14202A0224573o03294m80124k83345l18418j73828p4890j55855j05336M7477m0401
14192H036559k93568n41250n87853p34725o80817p93861o47223m68567l87607
14183B901088m63137l99826l42985j18957J9544j73331o1210m3080j00000r6836
14173A121270k15762j82232j31967j07192J3516K6036j99925J11889k0272K4085
14163D39446J83017J70948o1577l3953j17482k11267j08655L5445o3001j5837
14153B17084K08428o341j76150p8451n8189J37024O6993j31399j13038J04966
14143A70927J24300M0165l3891l5216p4814p1392Q8126J18664L2257N7606m3773
$$ plain form
14211 12922997 13469073 13961245 14181199 13908083 13419071 12642550 11825019 10969895 10224573
14202 10224573 9621279 9141155 8857810 8539392 8365564 8290674 8134819 8029483 8076960 8036559
14192 8036559 7742991 7201741 6613888 5879163 5198346 4404485 3757262 3288695 2901088
14183 2901088 2437951 2038125 1695140 1576183 1595727 1422396 1361186 1318106 1218106 1121270
14173 1121270 905508 723276 591309 484117 497633 523669 323744 435633 415361 439446
14163 439446 622463 793411 731834 697881 580399 369132 260477 295922 232921 217084
14153 217084 425512 419171 243021 164570 106381 243405 310398 178999 65961 170927
14143 170927 295227 335392 301501 266285 191471 120079 208205 326869 359126 416732 372959
14132C72959j49625n5711J77714j42125l7568R185j20319K4528J29733j22859
14122H5912N6456P8823N7182p2550j06244k3738j9840o9226J02640K45677j6101
14111C18991q9920N7817P7506o2350m242j10818j48241L9134J41267l3783n3012
14100A32349J37143J03241j47940j27764J77609L5169L5205m2351O0550j71817
14090A91394o9143m6876n5967n6717r9483P28M7946J8023k6651j9405k645j01838
14078b20634J42343L03890J86435n0934j91959J2783m5339L9936J73848K8293
14068C78662J45902R857k21873m9304j3943q0199p7369j9071N8567j5214m7240
14057F8775n1868l4231M2445l6694k6344L2029q1214m7218m5595J861J4092J03314
$$ plain form
14132 372959 223334 167623 345337 203212 165644 174829 54510 79038 208771 85912
14122 85912 142368 221191 278373 205823 99579 75841 56001 -13225 89415 335092 318991
14111 318991 229071 286888 364394 302044 297802 186984 38743 77877 219144 185361 132349
14100 132349 269492 372733 224793 97029 274638 309807 345012 302661 363211 191394
14090 191394 122251 75375 19408 -37309 -136792 -136064 -88118 -70095 -96746 -116151 -118796 -220634
14078 -220634 -78291 225599 412034 361100 169141 181924 136585 176521 350369 378662
14068 378662 524564 534421 312548 263244 249301 169102 91733 72662 131229 116015 68775
14057 68775 16907 -17324 25121 -11573 -37917 -5888 -87102 -134320 -179915 -178054 -163962 -60648
14045f0648Q1098J42429J10505q6735r2184k51817j50282k9536Q2248K743J00516
14034a51663J60837J69818O8390k08297r6013J77274P5019O0249j7674j24149
14024A13791j43657q6951M9653J07869k4932L4308k4024J07194l0927j00074J014
14013C264J21844J7029m9079L114M9584j63229O2890J52006N2436p9885j78442
14002h468P8026j03615m7693P0334J11341L1051p6882k21260k42903q6324J19334
13991c77059Q7976L3185P7863l629P3134k6044r2873J17370n5829J31816J13287
13980G9197J1385r7278p7052J4075R3259j64006p746p0706M7582j1281m4695j9171
13968b46437P6117J08460K8586K4404J7267Q9297j4007O4772J0609o7201J06204
$$ plain form
14045 -60648 20450 162879 273384 186649 94465 -157352 -307634 -337170 -254922 -252179 -151663
14034 -151663 9174 178992 247382 39085 -56928 120346 195365 255614 237940 113791
14024 113791 -29866 -116817 -67164 40705 15773 50081 26057 133251 102324 2250 3264
14013 3264 125108 142137 93058 96172 145756 -17473 45417 197423 249859 169974 -8468
14002 -8468 69558 -34057 -81750 -11416 99925 130976 54094 -167166 -410069 -496393 -377059
13991 -377059 -289083 -255898 -178035 -181664 -108530 -134574 -227447 -110077 -165906 -34090 79197
13980 79197 90582 -6696 -83748 -69673 23586 -140420 -148166 -218872 -171290 -182571 -227266 -246437
13968 -246437 -170320 -61860 -33274 -8870 8397 97694 83687 148459 159068 91867 198071
13957A98071O5387p6341n9417L1017j20155k6265K7550j6227P021r5946j4321
13946g9626q636m254J33941j40557m5169K7978L0214Q3332j26276L3315J78867
13935H3129J92109j27895k16164R6480j10988q0737q139J33715k1236j36283J29
13924a95880Q0067m8996j56004Q7050Q8805K05369k1475k15312N6175l762J6786
13913a07177n2372q3066j45294J27040K51390K03577J89573M3887j88200O4031
13903C03389j6810j5909M6327p9227r7790J52556P1272m3458j46170j02486J57131
13892B28825j17576j90559m9810J9053R0580N4837M7591l624j86610M6095j7225
13881g8423J68402J46550k7864P5529N4453Q9020j75156j82125o4702j0686j11165
$$ plain form
13957 198071 263458 187117 127700 158717 38562 12297 39847 23620 30641 -65305 -79626
13946 -79626 -88262 -92516 41425 -99132 -144301 -116323 -86109 -2777 -129053 -95738 83129
13935 83129 275238 147343 -68821 27659 -83329 -164066 -172205 -38490 -59726 -196009 -195880
13924 -195880 -115813 -164809 -320813 -233763 -144958 60411 38936 -176376 -120201 -123963 -107177
13913 -107177 -159549 -242615 -387909 -260869 -9479 194098 383671 427558 239358 303389
13903 303389 286579 270670 316997 237770 139980 292536 363808 320350 174180 71694 228825
13892 228825 111249 -79310 -129120 -110067 -19487 35350 82941 79317 -107293 -61198 -78423
13881 -78423 89979 236529 208665 284194 338647 427667 252511 70386 5684 -5002 -116167
13870a16167j42738L0842j2302L6846J00686P4559q2021K2368K72684k3699l4533
13859A26525j9376o3110L45m4484J87081K227q8719j07646o9185q7263k8951J42969
13847d9587J19279O6976N3393q2279n1660P1894P2614J1850O5595J51648l0086
13836C99637o8489j53039j0634L6725l1091p7430m0293l1680O7261M148j5023
13825H0092L4520k4410r664m2899l37889p0703J11303Q6491k6591J59442J51137
13814A10829l3681j4367K0919m9899K8754K9425o7600L3299R2422N7451R705p4984
13802A42273j00310J00235J30808j58212r3288J04526J5414j46170n2098J15099
13792E8277K5601m0620j05575o5903O2098m5971J37670L4498j32993N4954J98635
$$ plain form
13870 -116167 -258905 -228063 -240365 -203519 -102833 -28274 -110295 -87927 184757 161058 126525
13859 126525 107149 44039 44384 -100 186981 189208 100489 -7157 -76342 -163605 -192556 -49587
13847 -49587 69692 136668 190061 107782 56122 128016 200630 212480 278075 429723 399637
13836 399637 331148 178109 167475 204200 173109 95679 55386 23706 90967 95115 80092
13825 80092 114612 90202 80538 37639 -300250 -370953 -259650 -173159 -199750 -40308 110829
13814 110829 77148 62781 83700 33801 62555 91980 24380 57679 150101 207552 217257 142273
13802 142273 41963 142198 273006 114794 21506 126032 141446 -4724 -56822 58277
13792 58277 83878 43258 -62317 -128220 -66122 -112093 25577 60075 -72918 -17964 180671
13781A80671Q0398k09333j59590n9647P2947l6427M0720J04304P180J34243J25776
13770B81242n1274j2265K9235j4292N7632M2271j50407j1504J15932J22730j63449
13759B45851j26082N4325O9356o5621p6099J20250j06671k26043j35911O5679
13749a80966M6250M4719P7512O2903J19496j2674n9888O5161N6806j06966j71891
13738e9538j16395r0303K05131L0419j09637l357J65085K22587N4192j21965M793
13727A81012R0958k2432p7894M409p9885j17810j24113p763K26793J41304J1236
13716B25815k29628m7030K44844L626j58100J25488k10065O3622O0346k7381l8241
13705A3296m0848P2288J6538j19440L6583k5450j1508J27803J03695J23597J17580
$$ plain form
13781 180671 261069 51736 -107854 -167501 -94554 -130981 -90261 14043 21223 155466 281242
13770 281242 229968 217703 246938 232646 290278 332549 182142 170638 286570 409300 245851
13759 245851 119769 174094 243450 177829 101730 221980 115309 -110734 -246645 -180966
13749 -180966 -134716 -89997 -12485 50418 169914 157240 97352 162513 219319 112353 -59538
13738 -59538 -175933 -266236 -61105 -30686 -140323 -143680 21405 243992 298184 176219 181012
13727 181012 271970 249538 171644 176053 96168 -21642 -145755 -153518 73275 214579 225815
13716 225815 -3813 -50843 194001 197627 39527 165015 -45050 18572 78918 51537 13296
13705 13296 -27552 44736 61274 -58166 -21583 -47033 -58541 69262 172957 296554 414134
13694D14134j53486P6458n7229q5599m7079K9148p7544k719n2676j2284l7836
13683f712K8698o5649r7138n5984j2996N2499J14952Q3147j40608k6001J22111
13672c681J05151J01225J19866L6901J32936j91614j86884n1632O8454Q1863P118
13661B19703k01644k6471n9072q7281j0879K2598O9367J67105K465j03024k7499
13650c4632J48066J46918o3380p8270l4533P8439J25568j2529j40446J0177Q3889
13639B29267n8757J09565j88352j72153j5829P48j17055L3807k0004k6304M7220
13628a77847J884K0783p7793j80403O0661J27505R5397J16559L4857j03030K4684
13617e6743P4431J19019o2189r7281m5508q7056k5780Q2163K7292q064O0625N3024
$$ plain form
13694 414134 260648 337106 279877 194278 147199 176347 98803 96084 43408 31124 -6712
13683 -6712 21986 -43663 -140801 -196785 -209781 -157282 -42330 40817 -99791 -125792 -3681
13672 -3681 101470 202695 322561 359462 492398 300784 113900 62268 130722 212585 219703
13661 219703 18059 -8412 -67484 -154765 -165644 -143046 -73679 93426 95891 -7133 -34632
13650 -34632 113434 260352 196972 118702 84169 162608 288176 275647 135201 145378 229267
13639 229267 170510 280075 91723 -80430 -96259 -95511 -212566 -178759 -198763 -225067 -177847
13628 -177847 -175963 -155180 -232973 -413376 -352715 -225210 -129813 -13254 21603 -81427 -56743
13617 -56743 17688 136707 74518 -22763 -68271 -155327 -181107 -98944 -71652 -79716 -19091 33933
13605C3933J72774M1413r8721j01721L4412Q4080N8823q4674o3993l7281l7497
13594A548N8175J13078L9270j30530j69009j46896J27242N3682J74292Q5373k76695
13583g0470p4559N8716K0351L2271M8395r1645J56487j0198j75272K1797J34029
13572D9902o001M6155K3333N8332O4616k13730m8186j9997l6152N3548k7958Q7339
13560C1201m7662j5007j11087L606N3958j4741R0460r671j63254k7202M3689L6690
13548a29020r7663O8505J81286p3127o094k09171K9399m912J00188J24725J40882
13537A24998r525j18289j31148L5167Q8819k0062n5698J53358M0938j25898O852
13526a0488m8641j36572k45197K0052K69981J36458j66047N252M4310j8337O9976
$$ plain form
13605 33933 206707 248120 149399 47678 82090 166170 224993 140319 76326 39045 1548
13594 1548 59723 172801 212071 81541 -87468 -234364 -107122 -53440 120852 206225 -70470
13583 -70470 -145029 -86313 -65962 -33691 14704 -76941 79546 69348 -105924 -84127 49902
13572 49902 43901 90056 113389 171721 236337 22607 -25579 -45576 -81728 -28180 -56138 31201
13560 31201 -16461 -31468 -142555 -138949 -84991 -99732 -9272 -18943 -182197 -209399 -165710 -129020
13548 -129020 -226683 -158178 23108 -50019 -56113 -265284 -235885 -240797 -140609 -15884 124998
13537 124998 115473 -2816 -133964 -98797 -9978 -30040 -85738 67620 108558 -17340 -10488
13526 -10488 -59129 -195701 -440898 -420846 -150865 -14407 -180454 -175202 -130892 -149229 -79253
13515g9253K3731M9093l4759j06654o2870K8806M1790l5661j19899J27210m6430
13504b14896P134K89297K7069j34549k2745j39774j77689Q4625R8854J46910R4344
13493E8580J29807r8266l7094o628j33337m9234J33815j43150J9760k9072o5614
13482b20433k6550J81338J30626M331l2994J38410j60630n6806P2463l057j52781
13471a26083j5325R0023m7815l9867L2267n9935J34473M5886m4711L2378p605
13460f314j18570j82622L3843J71811J28177J9477j35714k08561j7174p257r9531
13449d22435J08475J66288K70563M1468j45505n1739j13169r0860Q9635K90806
13439A43527J02104O084N7816o4325l2918j09889j40714l7490J32614J053o3835
$$ plain form
13515 -79253 -55522 -6429 -41188 -147842 -210712 -181906 -140116 -175777 -295676 -168466 -214896
13504 -214896 -207762 81535 108604 -25945 -48690 -188464 -366153 -281528 -182674 -35764 58580
13493 58580 188387 90121 53027 46399 -86938 -136172 -2357 -145507 -125747 -154819 -220433
13482 -220433 -246983 -65645 64981 69312 36318 174728 14098 -42708 29755 26698 -126083
13471 -126083 -141408 -51385 -99200 -139067 -106800 -166735 -32262 13624 -31087 1291 -6314
13460 -6314 -124884 -307506 -273663 -101852 26325 45802 -89912 -298473 -315647 -322904 -422435
13449 -422435 -313960 -147672 122891 164359 18854 -32885 -146054 -236914 -147279 143527
13439 143527 245631 251715 309531 245206 212288 102399 -38315 -75805 56809 57862 -5973
13428e973j42047j371K1393q644r1484o6268Q0621R0298P3072j41564k1831O5571
13416a48227K74933K6125n4558Q2344j9277M9340N0808o8038J10589r014j67363
13405A27662j32660j04401L9164l1876Q4131J94134J47618k22699l4552P1329
13395A37850J21777m8915j20661l4140j11125J9756J3091n645L366J56584J06267
13384B38205r7558k7369Q2275O1317K0571L5061k9905r0039M4354o4114j8630
13373A54168M4166k17475k01605l9108J19278m6801O2420J25675k3806K584N2412
13362C1908j9698j9616j15802m0295P1946L9099j20354o3572K11612O9832l8469
13351F591j0594R2871O1175k1604J7071r6330j11476J9343O2908P1260M780P546
$$ plain form
13428 -5973 -148020 -149391 -127998 -136642 -228126 -294394 -213773 -123475 -50403 -191967 -213798 -148227
13416 -148227 126706 152831 98273 180617 161340 210680 261488 193450 304039 295025 127662
13405 127662 -4998 -109399 -70235 -102111 -17980 176154 323772 101073 66521 137850
13395 137850 259627 210712 90051 55911 -55214 -35458 -22367 -28012 -24646 131938 238205
13384 238205 140647 113278 195553 256870 277441 312502 282597 192558 236912 172798 154168
13373 154168 198334 -19141 -220746 -259854 -140576 -187377 -124957 718 -23088 -20504 31908
13362 31908 12210 -7406 -123208 -163503 -91557 -52458 -172812 -236384 -24772 45060 6591
13351 6591 -4003 88868 150043 128439 145510 49180 -62296 -42953 19955 91215 95995 103541
13339A03541M4771m5418k7998R746l7542J23218J40835n5515k40101j45044L5322
13328i4185j50189n9956K04992J33855j0308l8911m2809P532R5408K2865j15997
13317d7703K2172n6008R528R3194M8650p1988n774J52624J03958k8051j57676
13306F2926l6117j10654M5258J42536R8977j04223k3256m841k16085l8615O367
13295a77727l2481j16423K22965m0357J102R7530J46241j10525q3855M2663N6040
13284E173k6170m4575J01011J00387N397l0621j01026n9284M0883q8678n0968
13273a48471N9191M1701k4518k9987m0673Q3162N2610J53553N4261O2275m9313
13262B13791N3653m6953q8675L0739J19795j28255m1124M9802j5636q3008j41546
$$ plain form
13339 103541 148312 102894 74896 84642 47100 170318 311153 255638 15537 -129507 -94185
13328 -94185 -244374 -304330 -99338 34517 24209 -14702 -57511 -49979 45429 68294 -47703
13317 -47703 -25531 -81539 -72011 21183 69833 -2155 -7929 144695 248653 220602 62926
13306 62926 26809 -83845 -38587 103949 202926 98703 75447 70606 -145479 -184094 -177727
13295 -177727 -210208 -326631 -103666 -144023 -142921 -45391 100850 -9675 -93530 -50867 5173
13284 5173 -20997 -65572 35439 135826 141223 110602 9576 -49708 -8825 -97503 -148471
13273 -148471 -89280 -47579 -72097 -102084 -142757 -59595 -6985 146568 200829 263104 213791
13262 213791 267444 220491 131816 162555 282350 154095 112971 162773 147137 64129 -77417
13251g7417q5255O0157N3252J9805j21931j88357L7229M6627J16513N7990l244
13240h4631o1139m2774P2579J55807j4908j00436J9650Q2699K66353j38736k11306
13229e6842q1414K5480K6670M2556L7511J2204M8582Q576k01312j7348L0126k9997
13217a55208J76822J87228j62981r7247Q7907j2898j272N3254J4852k6354J7362
13206H1465m3521j27380m1775j49630q6846N1137K30985J54617Q18L7207M386
13195A11463P2274j15622r9262R7179Q7438j5065j0105r8242r5808P2708M3090
13184E0048N5387j06104r0172Q9998J55215N2353r8873j1489Q0794o7688k82702
13173a73233O5111M8949n5082O9193J19531J69224n658j50669n7576K8042l3564
$$ plain form
13251 -77417 -162672 -102515 -49263 -29458 -151389 -339746 -302517 -255890 -139377 -81387 -84631
13240 -84631 -145770 -188544 -115965 39842 24934 -75502 -55852 26847 293200 154464 -56842
13229 -56842 -138256 -112776 -86106 -43550 -6039 6165 54747 63323 -137989 -155337 -125211 -155208
13217 -155208 21614 208842 45861 -51386 36521 23623 22351 75605 90457 64103 81465
13206 81465 37944 -89436 -131211 -280841 -367687 -316550 -85565 69052 69870 107077 111463
13195 111463 183737 68115 -31147 66032 153470 138405 128300 30058 -65750 6958 50048
13184 50048 105435 -669 -90841 -843 154372 206725 107852 96363 177157 109469 -173233
13173 -173233 -108122 -59173 -114255 -45062 74469 243693 238035 87366 29790 57832 24268
13162B4268m5507p5977k2034l0559N3692K0546K013j11533j32762M8186J00772
13151a68895J8932K4061J10988O4787q4983R575J6798J2340m8999J06415J87823
13140B48842Q0494k6348j08059j81360k0016Q61m3361M6251l4811j28898J33949
13129c2456K17200J31049Q1206Q0464Q0634O7466J78274L3694J96308M29574J05465
13118A568878L9093N0796l1171k15606k55896j04622n3662k17223l10649j66483
13108C03455j02762N3617J77015K5164r6908j24918j256J4269j0050L50j14582
13097A23394j50237n9423r8252k5705J99489M0626o08N2217L0450L8207o1855
13086H8303O7339M8632J5258o8761m6991m0593j2659Q4975K9488j72753J221R5249
$$ plain form
13162 24268 -21239 -97216 -119250 -149809 -96117 -75571 -73558 -185091 -317853 -269667 -168895
13151 -168895 -149963 -125902 -14914 49873 -35110 -25535 -8737 3603 -45396 61019 248842
13140 248842 329336 302988 194929 13569 -6447 -5586 -48947 -2696 -37507 -166405 -32456
13129 -32456 184744 315793 396999 477463 558097 625563 803837 837531 1033839 1463413 1568878
13118 1568878 1607971 1658767 1627596 1411990 1156094 1051472 997810 780587 469938 303455
13108 303455 200693 254310 431325 456489 359581 234663 233407 247676 237626 237976 123394
13097 123394 -26843 -86266 -184518 -210223 -10734 29892 29284 81501 111951 150158 88303
13086 88303 155642 204274 219532 150771 103780 63187 50528 135503 164991 -7762 -6541 88708
13074H8708o0306R3868j6953p1431j50199Q0966O9011p8176K9249k7768J01103
13063E8072J07866j5344M2292k7932j08141j19945J33352j1044j4347n3914l4220
13052d3305N5430R8871J36334m0519N2638j53538l8878J2173L0423L5299l7704
13041A07224n3679M6157L4543J56914j33933r0363o5611M5018J00028K8549J8407
13030A93254j1720M1609L1924o2713q5730j9600k392j2855m8306M1925J11923
13019A77319m0791j30539j38785J07945K07493j11456j24947J7433P8478M0045
13009H2195L2363m9355j55385l9979k1845j19976L513J53265n9623j7144J40133
12998e1838k5827j31446l30260Q7173L56473J37553J770k14523P3170J80511J17668
$$ plain form
13074 88708 28402 122270 105317 33886 -116313 -35347 33664 -44512 -15263 -43031 58072
13063 58072 165938 150594 192886 164954 56813 -63132 70220 59176 44829 -9085 -43305
13052 -43305 12125 110996 247330 206811 259449 105911 67033 79206 109629 144928 107224
13041 107224 53545 99702 134245 291159 157226 66863 1252 46270 146298 174847 193254
13030 193254 181534 223143 255067 192354 106624 87024 84632 71777 23471 65396 177319
13019 177319 136528 5989 -132796 -24851 182642 71186 -53761 -36328 42150 82195
13009 82195 114558 65203 -90182 -130161 -152006 -271982 -268469 -115204 -174827 -191971 -51838
12998 -51838 -77665 -209111 -539371 -452198 -95725 41828 43598 -170925 -97755 82756 200424
12987B00424j14428j61528J2571J09606N7682k7903L617M2278r1220J71322O0796
12976B63217j29925j26917J41094P3025p7701q025p2832o4838m7385Q734K2431
12965a9122J23024K0922n1913m9058n534M2807L9228Q542K2716N1548j31067k3752
12953B8341J62521P9258J2960J46247l10083l09080j51365J37512l6795j27311
12943c67795O9025J10599J03335J3974j2924J06252N7519j59326j95780L0835
12933b44286J49488L2642J11833J18518Q669j37242L7428k6812j4850K6578L7775
12922I9741R4326m2427j48874m0324j2842K05462K13813q4612n4479O7268j34510
12911A62542N574K67172K01712j66567j03328j6508k7632j78090O9185P2907R5418
$$ plain form
12987 200424 85996 -75532 -62961 46645 104327 76424 80041 122319 31099 202421 263217
12976 263217 133292 6375 147469 220494 142793 134768 61936 -2902 -50287 -41553 -19122
12965 -19122 103902 124824 72911 23853 18319 61126 100354 108896 131612 183160 52093 28341
12953 28341 190862 270120 283080 429327 119244 -189836 -341201 -203689 -240484 -367795
12943 -367795 -298770 -188171 -84836 -70862 -83786 22466 79985 -79341 -275121 -244286
12933 -244286 -94798 -62156 49677 168195 176864 39622 77050 50238 35388 61966 99741
12922 99741 194067 151640 2766 -37558 -50400 155062 368875 284263 229784 297052 162542
12911 162542 168116 435288 637000 470433 367105 350597 322965 144875 214060 286967 382385
12900C82385q759j75602j94503j55374O2643J69337j38730k1442J30977K74757
12890C25689r8003o6086J44829q4676j47761R114Q3655j6720N7819m9463J07637
12879B66034j1063o1520k13292j2039J0826P9454L2191R8409o4194j6169J15219
12868B23856j1075L3431j32647j0619j03629l0883P9032m3378l4751m584K00441
12857A65194L2686J01458L8486k483j26274p7420M6154L2776q8335P3279K1734
12846B17255J00889J11317M8646L4273j25813j33697p9185L242j52500j23936
12836i9509m4892k15507j19385J8336K23883L6362r9054N3474J19547J65471P7181
12825A15907m0804K0151j9812m0900m0995M4855J94384m6237M6916L9329r7205
$$ plain form
12900 382385 373626 198024 3521 -151853 -89210 80127 -58603 -80045 50932 325689
12890 325689 227686 161600 306429 221753 73992 83106 166761 150041 207860 158397 266034
12879 266034 254971 193451 -19841 -31880 -21054 58400 90591 189000 124806 108637 223856
12868 223856 212781 246212 113565 102946 -683 -31566 47466 4088 -30663 -35247 165194
12857 165194 197880 299338 337824 335341 209067 131647 177801 210577 122242 195521 217255
12846 217255 318144 429461 478107 512380 386567 252870 173685 176927 24427 -99509
12836 -99509 -144401 -359908 -479293 -460957 -237074 -200712 -299766 -246292 -126745 38726 115907
12825 115907 75103 95254 75442 34542 -6453 38402 232786 186549 233465 272794 175589
12814A75589J3767O1359N2232J51623O3356J41224r6505j29369j79625j31015
12804A22636K8924J17924j32321j24157J22957J66184K4766n600O5191K12443
12794E98947J64856O130k07579j67071K7792p612q037J24295J36205L6678N0326
12783G54930j21401j46969M4400j2817O3552K3855J35432J208K4423n2385m7773
12772F66455k61j29214j29514J3560o990q225P7158K37145N8299j05607O1980
12761G34786k40243N872Q5200J14153J50424M5977k6936M2439M2233R1035K82916
12750A327856O2415J1120L09006K89749K60958L47058K33100M30773O41906Q62279
12740D776220J275255J706544K291323L079897L297946K516316R06738j211725
$$ plain form
12814 175589 189356 250715 302947 454570 517926 659150 562645 433276 253651 122636
12804 122636 151560 269484 137163 13006 135963 302147 326913 321313 386504 598947
12794 598947 763803 769933 562354 395283 423075 415463 407426 531721 667926 704604 754930
12783 754930 633529 486560 530960 518143 581695 605550 740982 742190 766613 714228 666455
12772 666455 666194 536980 407466 421026 414036 405811 482969 720114 778413 672806 734786
12761 734786 494543 500415 585615 699768 850192 896169 869233 911672 953905 1044940 1327856
12750 1327856 1390271 1401391 1710397 2000146 2261104 2608162 2841262 3272035 3913941 4776220
12740 4776220 6051475 7758019 10049342 13129239 16427185 18943501 19850239 18638514
12732A8638514k653031k824089k529677j994485j409981j126738r31634n91050
12724D577829m02175l47207l55526k86389j45989k38115k71438K6101k2216O4451
12714B599326O2064j07088k1381L8291j13684k4887J44745K30073M0915J09210
12704B957584K30938m9009J61150P7181K30287J19109J32964K42052K13147L29990
12694D645393K90088N28945M30158L14574N27934L38430N58558P80011R41309
12685I355400N91200R56791R91820J150911J593525J850947K195002K467725K888889
12676B4042210L367359L890206M587701N896271P531956R621728J2740477J6979426
12668H8657334K2979598L0890535M0429419N0137095N5803352M8832046K5108722
$$ plain form
12732 18638514 15985483 13161394 10631717 8637232 7227251 6100513 5168879 4577829
12724 4577829 4175654 3828447 3472921 3186532 3040543 2802428 2530990 2557091 2534875 2599326
12714 2599326 2661390 2554302 2532921 2571212 2457528 2432641 2577386 2807459 2848374 2957584
12704 2957584 3188522 3139513 3300663 3377844 3608131 3727240 3860204 4102256 4315403 4645393
12694 4645393 4935481 5464426 5894584 6209158 6737092 7075522 7634080 8414091 9355400
12685 9355400 9946600 10903391 11895211 13046122 14639647 16490594 18685596 21153321 24042210
12676 24042210 27409569 31299775 35887476 41783747 49315703 58937431 71677908 88657334
12668 88657334 111636932 142527467 182956886 233093981 288897333 337729379 362838101
12661C62838101p857529l6009777m9291142m8632912m1207723l2934141k6193629
12654A20711248k0714219j6365519j3050983j0521778q423734o853057n684910
12647C9097048m947388m327081l781100l110076k481464k145905k039887j728140
12639A4536007j269034j376499j002768q01516r46253p65122n09068m95194o40988
12630F729565m64981l65471k14073k76978l84499l72882l45518k19643N1517j66677
12620C970360l78042l48390l12119q1027N2116j53849q3672j01846K559N0932
12610B617022j16216l05548m7416O4103m1183j35437j72101m5983l6062k71125
12600A510054q0219J01412N839r5007K27494l4855L8191n5000l19313j68333p0250
$$ plain form
12661 362838101 354980572 318970795 269679653 221046741 179839018 146904877 120711248
12654 120711248 99997029 83631510 70580527 60058749 51635015 44781958 39097048
12647 39097048 34149660 29822579 26041479 22931403 20449939 18304034 16264147 14536007
12639 14536007 13266973 11890474 10887706 10086190 9139937 8374815 7865747 7370553 6729565
12630 6729565 6264584 5899113 5685040 5408062 5023563 4650681 4305163 4085520 4137037 3970360
12620 3970360 3592318 3243928 2931809 2850782 2902898 2749049 2665377 2563531 2566090 2617022
12610 2617022 2500806 2195258 2147842 2211945 2170762 2035325 1863224 1817241 1781179 1510054
12600 1510054 1429835 1531247 1537086 1442079 1669573 1634718 1672909 1617909 1298596 1130263 1060013
12589A060013j40966J32083Q1309j55481p9732J55445l0618j14888j2299M4649
12579I39515o0637r0814L5453J11048M4448O514j76280r0693l7758J86084R9369
12568I66249q0174j18514N5497n1129o8104K4517k28084m7614N2224J58485j15440
12557E47913q0849R1537N5145P8292O6285p2837l0707O2059R4654J15829m4684
12546H82637j73669j00235L1655j04753k2269L9983K8217j20683K4004J84872
12536F69759N2847j26446J40566n47k6568J6086M9907l6954l7760m5930m2377
12525F12583k2600q0294O9522L4r2478j38387L210J30908J09758r0847q1755q5103
12513C34551j6j5125l3494k7732n6050j8214K9898j5807J59835m746M8170p9569
$$ plain form
12589 1060013 919047 1051130 1132439 976958 897226 1052671 1022053 907165 894866 939515
12579 939515 878878 788064 823517 934565 979013 985527 809247 718554 680796 866880 966249
12568 966249 886075 767561 823058 771929 703825 728342 500258 452644 504868 663353 547913
12557 547913 467064 558601 613746 692038 758323 685486 654779 716838 811492 927321 882637
12546 882637 708968 608733 640388 535635 513366 553349 581566 460883 484887 669759
12536 669759 722606 596160 736726 736179 709611 725697 775604 738650 700890 654960 612583
12525 612583 589983 509689 579211 579245 486767 348380 351590 482498 592256 501409 419654 334551
12513 334551 334535 319410 285916 258184 202134 183920 213818 198011 357846 353100 401270 321701
12501C21701n7396K1602j5181r3188J79138J28112M064k14741k06519R0986J02736
12490B61314N7882r667k39349J05929p0951L2524J25576l7130m2787m9914J9048
12479A52475m9304j8100l7792n8650Q1921Q183O4415j3105n1604J11757J18036
12468C08232j02072j0350k1230K731k8160L2230q1048j3361l1768q8628O1800
12457B8376j22121l3515J84646J90944j02449J8452L6342q5945l3028O8475R1409
12446B41586P413O0267j0301j24374N3361j31663q4963J89798K27964o7538j34773
12435B26777J0237M261R7027j4131k24261q2822K55935P7318j56353j50545J30437
12424A73880Q9661k5977J921K29142R5964o1375k75371J35693J9067j54956J2411
$$ plain form
12501 321701 264305 285907 270726 177538 356676 484788 488852 274111 67592 158578 261314
12490 261314 319196 309529 70180 176109 105158 137682 263258 226128 183341 133427 152475
12479 152475 103171 85071 47279 -11371 70550 78733 143148 130043 78439 190196 308232
12468 308232 206160 195810 174580 177311 149151 181381 100333 86972 55204 -33424 28376
12457 28376 -93745 -127260 57386 248330 145881 164333 200675 114730 81702 150177 241586
12446 241586 248999 309266 298965 174591 227952 96289 11326 201124 429088 361550 226777
12435 226777 237014 241275 338302 324171 99910 17088 273023 350341 193988 43443 173880
12424 173880 263541 237564 239485 468627 564591 503216 227845 363538 382605 227649 240060
12413B40060K6217L941m5200J16513k3863r4177l4055J04088m3973o8874M2560
12402B23237O7222n3639m5976k7657k8577J83284Q3607k01812k4897o3475q5006
12391B6311j5598Q592q5788J42310J85171J08761m962m7070M5841J60681m1682
12380D82567k7700j07543k15531J08624o8849j63122k3035K5483Q7650J25526
12370B24070q5618n9872K16465o2412j96069m2691o1921L7324J15832o2890r9632
12359g7414j43410R2116P9213J94752J26255J31011j45397j51297J8997K4223
12349A49049J27697L2519j10422Q3621P5761j7892k2304M5174J58000R437j03867
12338D26773j12455j03097o728o9031L0622J61270j23528j29646N9992Q4296M9898
$$ plain form
12413 240060 266277 270218 225018 341531 317668 223491 189436 293524 249551 180677 223237
12402 223237 290459 236820 190844 163187 134610 317894 401501 199689 174792 111317 26311
12391 26311 10713 19305 -66483 75827 260998 369759 364797 317727 363568 524249 482567
12380 482567 454867 347324 131793 240417 171568 8446 -14589 10894 98544 224070
12370 224070 138452 78580 295045 232633 36564 -6127 -68048 -30724 85108 22218 -77414
12359 -77414 -220824 -128708 -49495 145257 271512 402523 257126 105829 124826 149049
12349 149049 276746 309265 198843 282464 358225 340333 318029 363203 521203 530640 426773
12338 426773 314318 211221 204493 135462 166084 327354 203826 74180 134172 218468 268366
12327B68366O0638j1823J69419P5211j94681j05908p0645r2248j11537j24638
12317a37846J66804J10460p2400L9249p4086j97445j23942Q5323J98215J93376
12307A87708R0541r4962P183J01462L3401j48563J26996q2380k4103M6498Q9754
12296C33535j3384o8377J5695J05354L8594n904J4556j02450j65124n4555o1125
12285C6815m8061Q0582N4229K6172O0269M9198q05j39261n1499o368M1644j3425
12273H9490j8069P8738J17070J41915j06005l0862r0154j04175n4477N7585J22381
12262B03437J64350K16808r5394j26086k9897p1749j01539R0688k0513j33860
12252I6245J42736M4999n6023M7644J19677L5894p9977j44377k4035P3047K191
$$ plain form
12327 268366 329004 317181 486600 561811 367130 261222 190577 98329 -13208 -137846
12317 -137846 28958 139418 67018 106267 32181 -165264 -289206 -203883 -5668 187708
12307 187708 278249 183287 190470 291932 325333 176770 303766 221386 197283 243781 333535
12296 333535 320151 251774 267469 372823 411417 405513 420069 317619 152495 97940 36815
12285 36815 -11246 69336 123565 149737 210006 259204 258399 119138 67639 61271 102915 89490
12273 89490 71421 150159 267229 409144 303139 272277 182123 77948 23471 81056 203437
12262 203437 367787 584595 489201 363115 333218 261469 159930 250618 230105 96245
12252 96245 238981 283980 227957 275601 395278 431172 351195 206818 182783 255830 258021
12241B58021m6207j06051K9792J04002j06591J88558J28517n9447O7898k3677
12231D34815P875j13301j47370J8366J58857n9843j93428L0783Q3876K46397o9463
12220C97564q9502L7847j63956O8091J16822L4564k157J11764M8826J30390J74129
12209H64382R7555n254j02797m8384K0424K13911K76569L39675J90968J06205
12199A953254J38943q6001k06294l8088j94001k09085p2696k6343J1455l5357
12189A235787k96989j54091j19714N5949P3024M193K7449r2167j10693n1741j9811
12178E51196r9240J02631N4675j42762r8166P7804N2408O2721O0768j13091l4865
12167D74079J5867n6543k6069N4320n6784J2891l8415l649N1016J18480O5482
$$ plain form
12241 258021 211814 105763 135555 239557 132966 321524 450041 390594 458492 434815
12231 434815 442690 329389 182019 200385 359242 299399 105971 136754 220630 467027 397564
12220 397564 308062 345909 181953 250044 366866 401430 399273 511037 559863 690253 864382
12209 864382 961937 956683 853886 805502 825926 1039837 1316406 1656081 1847049 1953254
12199 1953254 2092197 2006196 1799902 1761814 1567813 1358728 1286032 1259689 1271144 1235787
12189 1235787 938798 784707 664993 720942 793966 798159 825608 733441 622748 571007 551196
12178 551196 451956 554587 609262 466500 368334 446138 498546 561267 622035 508944 474079
12167 474079 489946 433403 407334 461654 404870 417761 379346 375697 426713 545193 610675
12156F10675j50419Q449J02107j61354K1120L6273N7563j32107n002K4018O9691
12145D81014o24j0987n4135N8231p1809j66881q243K14205J45359p6691l6893
12134D72546L3622J00536l1035j80643L0220Q6708J10721Q0850k7255l6594K614
12123F42290j25787j23923J75125J52756j40157M1628o478P3288O0293j09077
12113F39958J9125N8186j63j23054r296l826q1748L1603M0130m2804q2411L3589
12101D79289P172K2065J7597j5451K1626M9250O1574L4006N6814P3787r7076K9734
12089G40387Q8583L8795j2192K5058R7673O0466j31543j33452q7390K31377M1856
12078I59618j15385r1274Q1780R2542o101r5588J32053K85311J12351j55508o952
$$ plain form
12156 610675 460256 468705 570812 409458 430578 466851 524414 392307 387305 411323 481014
12145 481014 480390 469403 415268 473499 401690 234809 226566 440771 586130 509439 472546
12134 472546 506168 606704 575669 395026 425246 511954 622675 703525 676270 639676 642290
12123 642290 516503 392580 567705 720461 580304 621932 615454 688742 749035 639958
12113 639958 659083 717269 717106 594052 584756 580930 499182 530785 570915 528111 445700 479289
12101 479289 486461 508526 526123 510672 532298 581548 643122 677128 733942 807729 710653 740387
12089 740387 828970 867765 855573 880631 978304 1038770 907227 773775 686385 917762 959618
12078 959618 844233 752959 834739 927281 921180 825592 957645 1242956 1355307 1199799 1192847
12067A192847J56611J08502n8640M0638O1353P1816j55012j06520K8759J08260
12057A448614O7990o5811J14760Q3921q5596j52631n2057K6096K0853n7845J46457
12046A494751Q6384Q0566j6506J00125k0875L1545p5677o0944m162J95218N0389
12035A860814N0127k9582j2986J46273J66611K3904j05640j2580J58171R1575
12025B336687M1595k18217j00250J63300R1472q7607m3927J01021P0370R5710
12015B450154q0579j09029J33044J42576N6032Q5585o4390K16811K13462J2424
12005C056090J51716n8861l9820p563K56042J51687J85058J6259j4495P1424N5155
11994C822692j9326L8714J25738J85549K23592l8856j5192P3323L24185K64222
$$ plain form
12067 1192847 1349458 1457960 1399320 1439958 1501311 1573127 1418115 1311595 1340354 1448614
12057 1448614 1516604 1450793 1565553 1649474 1563878 1411247 1359190 1385286 1406139 1348294 1494751
12046 1494751 1581135 1661701 1645195 1745320 1724445 1755990 1680313 1619369 1615207 1810425 1860814
12035 1860814 1910941 1881359 1868373 2014646 2181257 2205161 2099521 2086941 2245112 2336687
12025 2336687 2378282 2160065 2059815 2223115 2314587 2226980 2183053 2284074 2354444 2450154
12015 2450154 2369575 2260546 2393590 2536166 2592198 2677783 2613393 2830204 3043666 3056090
12005 3056090 3207806 3148945 3109125 3101562 3357604 3509291 3694349 3710608 3696113 3767537 3822692
11994 3822692 3803366 3842080 3967818 4153367 4376959 4338103 4322911 4396234 4720419 4984641
11984D984641N767J41518J26200Q4216O2884K60869J40504J85897O382J56676
11974F155554K61563J65904J62785J91049K09685K69035L28382M47002K82186
11965H473145K83843K56300J88460L80480M11648N09321N98330M35460N36631
11956A2073618N29512N63013O15030N43948N40559P22741Q08255Q92674Q51534
11947A8140884P80924Q01804J045121J115645J322260J412697J549465J509321
11939B7678121J638663J919686K115428K179265K276749K667450L192101L471621
11931D7139084L466844L701602M190144M763302N078298N538735N897542O431847
11923H6207398P032696P530061P829776Q015530Q287963Q451261Q111298P582739
$$ plain form
11984 4984641 4990408 5131926 5258126 5342342 5405226 5666095 5806599 5992496 5998878 6155554
11974 6155554 6417117 6583021 6745806 6936855 7146540 7415575 7743957 8190959 8473145
11965 8473145 8756988 9013288 9201748 9582228 9993876 10503197 11101527 11536987 12073618
11956 12073618 12603130 13166143 13781173 14325121 14865680 15588421 16396676 17289350 18140884
11947 18140884 18921808 19723612 20768733 21884378 23206638 24619335 26168800 27678121
11939 27678121 29316784 31236470 33351898 35531163 37807912 40475362 43667463 47139084
11931 47139084 50605928 54307530 58497674 63260976 68339274 73878009 79775551 86207398
11923 86207398 93240094 100770155 108599931 116615461 124903424 133354685 141465983 149048722
11915A49048722O736133N572721M045203K117215K23525j550565l224621m601869
11907A58366464n975289o893503p335125p597245p891342p833647p617123p208794
11899A00014396p023760o360852n858221n544873n039143m767689m403516m005927
11891E7010415l478649l347976k816261k821241k671522k338242k156591k189538
11883C5190395k024006j716738j493201j366570j280331j276280j188000j006352
11875B3838917j068266j105649q99432q84784p82658q02556q49689o66434n87073
11866A6192376o29367o99416n96455p35582o21472m61692l08389l56810n07047
11857A1276146m21328l47873l04020n61273m10697m11520o21011l15119k57621
$$ plain form
11915 149048722 155784855 161357576 165402779 167519994 167743519 166192954 162968333 158366464
11907 158366464 152391175 145497672 138162547 130565302 122673960 114840313 107223190 100014396
11899 100014396 92990636 86629784 80771563 75226690 70187547 65419858 61016342 57010415
11891 57010415 53531766 50183790 47367529 44546288 41874766 39536524 37379933 35190395
11883 35190395 33166389 31449651 29956450 28589880 27309549 26033269 24845269 23838917
11875 23838917 22770651 21665002 20765570 19880786 19098128 18295572 17445883 16779449 16192376
11866 16192376 15563009 14863593 14267138 13531556 12910084 12448392 12140003 11783193 11276146
11857 11276146 10854818 10506945 10202925 9641652 9230955 8819435 8198424 7883305 7625684
11848G625684j60432K7574j52636k22320r2279k82669k92803j92002r0711j63251
11838F004155l35082k12019l16982k23897n9599p726l7599k77313j28474l4907
11828D370557J15252j44512k34556j4462O6090m867o0792k40577j90593n4307
11818C607233R9010j50123j03002o1839n8010k62559n1982R9146p1737R287j24849
11807B930575Q6306p8224K7039q5931j75740j33837m0664L0924K2900j06720j24251
11796B352377R660j38667m8946j4710j65845O7829K3268k26768j98745J62137
11786A821590J49963n2167j38526J12765j18978j73997P5488R2364m3117n9908
11776A665477R1281J49787q4105r0704p8968k9844j44704n5433J31027k9386l9494
$$ plain form
11848 7625684 7465252 7492826 7340190 7117870 7025591 6742922 6450119 6258117 6167406 6004155
11838 6004155 5669073 5457054 5140072 4916175 4856576 4848850 4811251 4533938 4405464 4370557
11828 4370557 4485809 4341297 4106741 4092279 4158369 4153502 4092710 3852133 3661540 3607233
11818 3607233 3706243 3556120 3453118 3391279 3333269 3070710 3018728 3117874 3046137 3055424 2930575
11807 2930575 3016881 2938657 2965696 2879765 2704025 2570188 2529524 2560448 2583348 2476628 2352377
11796 2352377 2362037 2223370 2174424 2159714 1993869 2061698 2084966 1858198 1659453 1821590
11786 1821590 1971553 1919386 1780860 1893625 1774647 1600650 1676138 1768502 1725385 1665477
11776 1665477 1756758 1906545 1822440 1731736 1652768 1622924 1478220 1422787 1553814 1524428 1484934
11765A484934J2601j817Q484J2246j2005P5632M075M4264j5160r0515n0093j6767
11753A455879o2969j50721k0201L5829r7931j3489O1290J68246q6255k07283j38404
11742I43991J94795J72205j25383j33633j52115L601N2913J3909J4146p1026K2007
11731I35410J733J5428r5055K425J38208J11253l8571j44328k37999o6554J2536
11720F34486R710q12R2824O1106L0640j10515p217J9226k40710J26455K39776
11709H54969m7730J42582n7070r5716Q6362J67434p9084j02065o3488n3214j7511
11698G35469J2296j35j20591L9925M6844J1199j32189j38195j5196J10664J50805
11687G00896J03088j15073j62092L2738J78857j36124J7950q8114j76107j2800
$$ plain form
11765 1484934 1497535 1495718 1504202 1516448 1504443 1580075 1584150 1628414 1613254 1522739 1472646 1455879
11753 1455879 1392910 1242189 1221988 1257817 1159886 1146397 1207687 1375933 1289678 1082395 943991
11742 943991 1138786 1310991 1185608 1051975 899860 903461 956374 970283 984429 913403 935410
11731 935410 937143 952571 857516 859941 998149 1109402 1070831 926503 688504 621950 634486
11720 634486 644196 643384 736208 797314 827954 717439 710222 729448 488738 615193 854969
11709 854969 807239 949821 892751 797035 883397 1050831 971747 869682 806194 752980 735469
11698 735469 747765 747630 627039 666964 713808 725007 592818 454623 439427 550091 700896
11687 700896 803984 688911 526819 559557 738414 602290 620240 532126 356019 343219
11677C43219J93857J20326O7467J31326l5259j44714j78061J55342O3751k10310
11667E06944j47226K2414j07481l1830K6937J81769L0553P1180J60182O9806p0195
11656G13053j82279j01401l0495M0500m3077O1622J10530K0558p0954q9277J1219
11645D39999J10611o80m493P0980q8815n9599j98842r5073N9870k9717M2953Q2816
11633C30010Q4628j18346j23716K2573Q7155K16281J9088j3993m2165q8614j7202
11622C55699J07451J58236K5449k07922j3243o9373o2651O0140N0658k3650k4270
11611C56524J53198N4520l9942m6298K8086j07331k15635j68815J8198J33299
11601A65804L2635j45890J28038J87357J07691j30981j32785J26118J6945k28831
$$ plain form
11677 343219 537076 657402 724869 856195 820936 676222 498161 653503 717254 506944
11667 506944 359718 382132 274651 242821 269758 451527 482080 553260 713442 783248 713053
11656 713053 530774 429373 398878 439378 396301 457923 568453 589011 518057 428780 439999
11645 439999 550610 549930 545437 616417 527602 468003 269161 174088 233958 204241 247194 330010
11633 330010 414638 296292 172576 195149 282304 498585 517673 503680 461515 372901 355699
11622 355699 463150 621386 646835 438913 425670 356297 293646 353786 404444 380794 356524
11611 356524 509722 564242 524300 478002 506088 398757 183122 14307 32505 165804
11601 165804 198439 52549 180587 367944 475635 344654 211869 337987 354932 126101
11591A26101N4478O0040o5231l7705j9098o8149L1582M5069N5002N2272J3713
11580B48074l8105k8889Q3529q4052K6028K7428p3899q1264R0082p5522M7544
11569A40954k074O6305k6079J02505n1385O7380j8153j31857J16491j0875n2266
11558B00946j15037L662L8038M6886n0253j12260m1350n7171J18893J77997J5177
11547B25528R0037k0124O7119K8512M6720l7631o7799k06197M0181R5653J45377
11536D07376J11602p312j01335j13092P8267M4280k49126k35586J95606J95250
11526C25930N628k9412j67392j45566n452N506o5772J61864O9353J11327L9311
11515C05325Q1455J10868l4358n5424p0492j09767J00134M5590k49190p8840o7051
$$ plain form
11591 126101 180579 240619 175388 137683 118585 50436 82018 127087 182089 234361 248074
11580 248074 209969 181080 264609 180557 206585 234013 160114 78850 168932 93410 140954
11569 140954 138880 205185 179106 281611 230226 297606 279453 147596 264087 253212 200946
11558 200946 85909 89571 127609 174495 124242 11982 -29368 -86539 32354 210351 225528
11547 225528 315565 295441 362560 391072 437792 400161 332362 126165 166346 261999 407376
11536 407376 518978 511666 410331 297239 375506 419786 170660 -64926 130680 325930
11526 325930 331558 302146 134754 -10812 -16264 -10758 -76530 85334 154687 266014 305325
11515 305325 386780 497648 463290 407866 337374 227607 327741 373331 124141 45301 -21750
11504b1750r9913J32028K49975O6912O794Q4102j4021J01625j91430k08654j22650
11493a6982j38849N0708J09109K2210k3161n9063J52890J34444O2001P7528J45531
11482E16366j13815j74917R7475J1076q5231j56098r9853r5448K4123J47462N0708
11471A21848J88407K512j21404N2699J17869J59148K5548j78502k54724J00238
11461B13639J46711j1810o0414m1573J86153j9790q7680J8752K9768j58978K8177
11450B42955o0399M8701m535r5610k4297k1287m7897O962j06905L7572Q5317K3290
11438H3867o4899P074M3j23376R4146J64165j22557k8617Q2072M4038p2762j24508
11426f1314m5387N6621n7392K7963P1714L2709n4750L9842Q0149K7887j14273
$$ plain form
11504 -21750 -121663 10365 260340 327252 334046 418148 404127 505752 314322 105668 -16982
11493 -16982 -155831 -105123 3986 26196 3035 -56028 96862 231306 293307 370835 516366
11482 516366 402551 227634 325109 336185 250954 94856 -4997 -100445 -76322 71140 121848
11471 121848 310255 312767 191363 244062 361931 521079 546627 368125 113401 213639
11461 213639 360350 348540 288126 246553 432706 412916 325236 343988 373756 214778 242955
11450 242955 182556 231257 226722 131112 106815 85528 37631 44593 -62312 -24740 60577 83867
11438 83867 18968 26042 26085 -97291 -3145 161020 38463 9846 91918 135956 63194 -61314
11426 -61314 -106701 -50080 -107472 -79509 -7795 24914 -29836 10006 90155 118042 3769
11415C769M6742J07341J36157M0312j4149P116r1713n2259m6055l2153L7109o9
11403A42148K6681P6583l2013j59145j76773n810Q6739L5639O9092o2990J23548
11392A23699Q9166L3069j2463j13023P6658M961l9288O0714J06865j53476j49964
11381B6918l4628J12312J1021p1290O846j24930J4861K9602M8571R7894o3670
11370E3507m3166k605M8924n1235n5389j36760r771m5101P9154J07231K98869
11359B43658l2226r7261J34787J05012K9537j57422j46387r0640J49821K94202
11349D33081M0586r8382M4716j01028L3301q0545m9638q8280j98013m961M9218
11338a9945K30634J26640p445p0008k18666j01273j09070M8100Q1765J13696N0097
$$ plain form
11415 3769 50511 157852 294009 334321 320172 327288 235575 183316 137261 105108 142217 142148
11403 142148 168829 245412 213399 54254 -122519 -128329 -41590 -5951 63141 151 123699
11392 123699 212865 245934 233471 120448 197106 202067 162779 223493 330358 176882 26918
11381 26918 -7710 104602 115623 44333 51179 -73751 -58890 -29288 19283 117177 53507
11370 53507 10341 7736 56660 5425 -49964 -186724 -196495 -241596 -162442 -55211 243658
11359 243658 211432 114171 248958 353970 383507 226085 79698 -10942 138879 433081
11349 433081 473667 375285 420001 318973 352274 271729 222091 133811 -64202 -69163 -19945
11338 -19945 210689 337329 329884 259876 41210 -60063 -169133 -121033 -39268 74428 124525
11327A24525l6724j11816J04116j54860O9627L17729K1207j31599R3541L768o2892
11316B36622P834l7216k47494j276J27243N6607M7290J5047K1134o9189j94126
11305c7524L9577p4398m6941j19628N7218q904L5508O2338O1669M9838r0930m3827
11293a16004J93650J11996j12610j01392J46701J62077Q6823M5863j99102j51391
11283F6611n2291k13615P3393J07844O456N8206l5115j20147p7250P486R1362
11272h7060J24754J11122j08160K72K34010q1544o3031K1387J64507j15858K7130
11261B27529j723j47894N981P8812j44247q8421P7242K4872k7198P0046J02736
11250A77735J0329R604j06870o934J5165m421J3431j58211k8695o1519O2820l353
$$ plain form
11327 124525 87801 -24015 80101 -74759 -5132 312597 333804 202205 295746 299514 236622
11316 236622 244456 207240 -40254 -41530 85713 142320 189610 204657 225791 156602 -37524
11305 -37524 2053 -72345 -119286 -238914 -181696 -190600 -155092 -92754 -31085 18753 -72177 -116004
11293 -116004 77646 189642 77032 -24360 122341 284418 371241 417104 218002 66611
11283 66611 14320 -199295 -125902 -18058 -11602 46604 11489 -108658 -185908 -178422 -87060
11272 -87060 37694 148816 40656 40928 274938 193394 130363 151750 316257 200399 227529
11261 227529 225806 77912 83893 162705 18458 -69963 7279 32151 4953 74999 177735
11250 177735 188064 197668 90798 83864 99029 94608 108039 -50172 -78867 -140386 -77566 -80919
11238h0919j97524o020L3626J10073K30020O4226k0111k1184m9868O9487J11479
11227B43285P4817n9076p8918k53719j56257q351n3914K7526K2822k4533J37007
11216a29311J31778O7624J21337J3559l1998q7825j04037m1808N6691P615l1655
11205b8030O7648O3576K4086L6606m9531r0001n7108R9392N96N3996j0936N1104
11193A61398N8132r8434j362q608J44868L5569o1899l2346p0210J41800o8188
11182B00720q0231N3792q3791j49739j16784o7831j03673J441Q6001Q2462R2781
11171h4852m3476N3199j6446L3217k0208l4082J42793R0451q3015k1587M2033
11160E8027k52960M1767k0434J5461j42722R9010K85106J93448q462k0934l694
$$ plain form
11238 -80919 -278443 -284463 -250837 -140764 89256 153482 133371 112187 62319 131806 243285
11227 243285 318102 259026 180108 -73611 -229868 -238219 -292133 -264607 -241785 -266318 -129311
11216 -129311 2467 70091 191428 204987 172989 85164 -18873 -60681 -3990 3625 -28030
11205 -28030 39618 103194 127280 163886 114355 24354 -32754 66638 67234 121230 110294 161398
11193 161398 219530 121096 119734 111126 255994 291563 229664 197318 127108 268908 200720
11182 200720 120489 174281 90490 -59249 -176033 -243864 -347537 -346096 -260095 -177633 -84852
11171 -84852 -128328 -75129 -91575 -58358 -78566 -112648 30145 120596 37581 15994 58027
11160 58027 -194933 -153166 -173600 -158139 -300861 -201851 83255 276703 268241 247307 243613
11149B43613J28294j79915j43228L6241K45718j11043j57753j56740M9679K9783
11139a5351j34665q6315J6269l714j23473L2859K8203J56615K16073J13765L40070
11128E40336j7127l09729j76986l3977Q774o1028j92564M9292M6620O8476Q3107
11117E194P7596J6147K9219K53763r7646o7297k3969J9852P778j54807n3723Q2093
11105I4200R4912M1351j01242j18234P1047j4785r6570k13618M3821J14297O3208
11094b1613o5709j9271J72364j7436j13436J61846J0946k61846k7364J32973J75368
11083A26822P7992J62247j40103N168j1417m30K2017q6912j28179o4186J4218
11072b2763O0815J10249p7024o8145l7313n9709j24277q1769J18200J12171J08823
$$ plain form
11149 243613 371907 191992 48764 85005 330723 219680 61927 -94813 -45134 -15351
11139 -15351 -150016 -236331 -220062 -223776 -347249 -314390 -286187 -129572 86501 200266 540336
11128 540336 523209 213480 36494 2517 11291 -49737 -242301 -193009 -146389 -77913 5194
11117 5194 82790 98937 128156 381919 284273 216976 193007 212859 220637 65830 12107 94200
11105 94200 189112 230463 129221 10987 82034 67249 -29321 -242939 -199118 -84821 -21613
11094 -21613 -87322 -106593 65771 48335 -65101 96745 107691 -154155 -181519 -48546 126822
11083 126822 204814 367061 226958 232126 220709 220279 242296 155384 27205 -36981 -22763
11072 -22763 38052 148301 71277 3132 -34181 -93890 -218167 -299936 -181736 -69565 39258
11061C9258Q436L6014K015R8308K09637J2392j39853j19055J14356J33684p5796
11050C19396j05409M594J77267J39902q864j0997J216K1557k2448O9333K6929
11039F12476O4971M1526N6153j0940L5734J97668J52851J76440o5984j20329m7968
11028A092598j8782J7388R4042J00536p7868q4023K29280K53200K08574m4456
11018A770489j10151j82892k30623j17890j21731p2564K67938L11431J17316J7091
11008A648414l19115r1142j79611j54895j04862Q2119J9647r2255j973j8480M77
10997G88324j81036j08225k0064o1225o8243r7865J02043J6093r1349K5125j70915
10986A32663j81902n166k3268K7545P504o0860R3848l8446J07484p9977q1687
$$ plain form
11061 39258 47694 83708 85723 184031 393668 406060 266207 147152 261508 395192 319396
11050 319396 213987 218581 395848 535750 526886 515889 517105 538662 516214 585547 612476
11039 612476 677447 718973 775126 764186 799920 997588 1150439 1326879 1260895 1140566 1092598
11028 1092598 1073816 1091204 1185246 1285782 1207914 1123891 1353171 1606371 1814945 1770489
11018 1770489 1660338 1477446 1246823 1128933 1007202 934638 1202576 1514007 1631323 1648414
11008 1648414 1329299 1238157 1058546 903651 798789 880908 900555 808300 806327 787847 788324
10997 788324 607288 499063 478999 417774 349531 251666 353709 369802 278453 303578 132663
10986 132663 -49239 -54405 -77673 -50128 -42624 -103484 -9636 -48082 59402 -20575 -102262
10975a02262J2370n2833j9209j8334J31785R4340Q4503O6394m5228j19806j01244
10964f9524Q3680M4973M274M0102j59122N7139j4714K8290N0547n4952Q2488J66548
10952B59729j616m0454q6952k04123M0096N352p497j7048n3363r102J21488r6793
10940i0283k80856k8126L41129J74662P5812j04920k10551j74817O4633R1796
10930a41521j8231R6539J10157l1786O1410J6354N2381k7741O745J4090o6034
10919G2363j64309J0202L2573J3522M0479K4479j48774P3063M7238K6868J9697
10908D7401m2829Q326K5564o5863l2457k0043K7813k8188l3891j36330j60760
10897d11257M4026J84884J12882N1162k55526j15407P3701J11324J41086J44474
$$ plain form
10975 -102262 -89892 -142725 -161934 -180268 -48483 45857 130360 196754 151526 31720 -69524
10964 -69524 14156 59129 63403 103505 -55617 1522 -13192 15098 65645 10693 93181 259729
10952 259729 258113 217659 130707 -73416 -33320 -27968 -35465 -52513 -105876 -114978 6510 -90283
10940 -90283 -371139 -399265 -58136 116526 192338 87418 -123133 -297950 -233317 -141521
10930 -141521 -159752 -63213 46944 15158 76568 92922 145303 117562 124307 138397 72363
10919 72363 -91946 -81744 -49171 -35649 4830 29309 -119465 -46402 836 27704 47401
10908 47401 4572 12898 38462 -27401 -59858 -79901 -52088 -80276 -114167 -250497 -411257
10897 -411257 -367231 -182347 -69465 -18303 -273829 -389236 -315535 -204211 -63125 81349
10887H1349p5763k0858j5273l2672k08214M2411O8283j29294Q9034J53450J86222
10876A38675m5557n9081k30823r5253J36615O9642o2848K6825R955L0898k2321
10865a03273K05991M0451j39461k06446O019Q5235m0981J0443k2426J12821J09030
10854E7403J17650L1832k15566k01161o4983J06810Q3039m8300J01831J56981
10844A25536p4029J03392N851k4159Q4951k307O6305l9990j95335j8644J5652
10833D7223o5559J01722J50Q5499l9161J52967k6229k47703l2119p0903L3667
10822f0446J79275J43422q113o0631k6039j20915o1957j32982q5491p2194J02904
10811b03167K42956J63020p3328j6294m7118n3027L6569L8559j31276J26592o6337
$$ plain form
10887 81349 5586 -15272 -30545 -63217 -271431 -229020 -160737 -290031 -200997 -47547 138675
10876 138675 93118 34037 -196786 -292039 -155424 -85782 -148630 -121805 -111850 -80952 -103273
10865 -103273 102718 143169 3708 -202738 -196719 -111484 -152465 -142022 -164448 -51627 57403
10854 57403 175053 206885 -8681 -209842 -274825 -168015 -84976 -133276 -31445 125536
10844 125536 51507 154899 160750 136591 221542 219235 285540 245550 50215 31571 47223
10833 47223 -18336 83386 83536 169035 129874 282841 256612 8909 -23210 -94113 -60446
10822 -60446 118829 262251 254138 193507 167468 46553 -15404 -148386 -233877 -306071 -203167
10811 -203167 39789 202809 129481 113187 66069 13042 49611 88170 -43106 83486 17149
10800A7149j64665j78014R3101K14472K2729N8561j10771J610J41889n0922P4833
10789A19972k7496M2518p7449k04978q5268m1959n7001J56597J87659M232j30428
10778a13601j6552J09963o470R5228L1216N0045k6621K5394l4444j32370r5998
10767a14210j0753n389j54881j4731N6187p2090L1879J33175J12971K7313L2203
10756B1674K5477K6578j18908N8960j3537L8737m3714m1662M137J77553k2992
10745A12303j60734m9148J59939m3999l1711O3906Q1036J83638J0190k7277j37878
10734A60265j679J23171l4491p4449N6706k8779K8127J64690n264J5767P3093
10723D77157p4705Q708j4576K1620l9113P9004J37643o5481j89087j63957K821
$$ plain form
10800 17149 -147516 -325530 -232429 -17957 4772 63333 -47438 -45828 96061 45139 119972
10789 119972 92476 134994 57545 -147433 -232701 -274660 -331661 -175064 12595 16827 -113601
10778 -113601 -130153 -20190 -26660 68568 99784 149829 123208 148602 114158 -18212 -114210
10767 -114210 -124963 -130352 -285233 -299964 -243777 -315867 -283988 -150813 -37842 -10529 21674
10756 21674 47151 73729 -45179 13781 244 38981 -4733 -46395 -42258 135295 112303
10745 112303 -48431 -97579 62360 18361 -13350 50556 131592 315230 325420 298143 160265
10734 160265 158586 281757 247266 172817 229523 200744 228871 393561 388297 404064 477157
10723 477157 402452 411160 396584 418204 379091 458095 595738 530257 341170 177213 180034
10712A80034O0333Q3194K82J68604R007M8681l63l5047M9421j38910o2573K3171
10700C85834o521j06957L4023J52175k3295N7196m1866j30766r108L1479K7743
10689C69937J67017l2941j4037j12488N5838M2639n5013M3506j9129K7402N007
10678D77738R1739j9651J1402M0860j04236K4632L2887o4306q3010J50944R4070
10667F53069M3738K6573J61819J93440K67496N3636k06174l0757j73140o1881
10657I27819K2574r9495J61931K95455L13140P8979n217R9203L8891R6069Q5803
10646B015152Q4904M8033J31370K53132L04839L13077K93503K42235L79031M15943
10636D481219M65192N40276R40001J017482J107664R60247O45603N01441O10078
$$ plain form
10712 180034 240367 323561 323843 492447 501454 550135 549772 514725 564146 425236 362663 385834
10700 385834 379313 272356 306379 458554 435259 492455 450589 319823 310715 342194 369937
10689 369937 536954 504013 489976 377488 433326 475965 420952 464458 445329 472731 477738
10678 477738 569477 549826 561228 602088 497852 522484 555371 491065 408055 558999 653069
10667 653069 696807 723380 885199 1078639 1346135 1399771 1193597 1162840 989700 927819
10657 927819 950393 850898 1012829 1308284 1621424 1700403 1695186 1794389 1833280 1929349 2015152
10646 2015152 2100056 2148089 2279459 2532591 2837430 3150507 3444010 3686245 4065276 4481219
10636 4481219 4946411 5486687 6426688 7444170 8551834 9512081 10157684 10659125 11269203
10627A1269203P80188J163043J642519K246425L148278M096643N574517P256314
10619C7177130R113856J0794640J2791980J4149149J2782706P881812K379988
10612A07071261j475171k278938m93697L058821P927575J3427940J9124800K5007414
10604A71370005K7917613K2946770R505642n663488j4256012j4584218r456648
10597A87779664k228545N631757J4580018K3760531L1457701L3143468K3561650
10590C17686244K186434j9850788l0673640l0125972k3740312j5491325p167526
10583A92823115J326998Q903340J4171255J4941588P278598p470519k1055397
10576B10918978k6754350k5167958j9811430j4146170q710150m079674n12440
$$ plain form
10627 11269203 12049391 13212434 14854953 17101378 20249656 24346299 29920816 37177130
10619 37177130 46290986 57085626 69877606 84026755 96809461 104691273 107071261
10612 107071261 105596090 103317152 102823455 105882276 113809851 127237791 146362591 171370005
10604 171370005 199287618 222234388 231740030 226076542 211820530 197236312 187779664
10597 187779664 185551119 191182876 205762894 229523425 260981126 294124594 317686244
10590 317686244 319872678 300021890 269348250 239222278 215481966 199990641 192823115
10583 192823115 194150113 203053453 217224708 232166296 239444894 231974375 210918978
10576 210918978 184164628 158996670 139185240 125039070 116328920 112249246 111736806
10569A11736806J921356J526385j768944p292127j2361885j4425818j3626217
10562F5709556j1515164r396980p461558n889442m838573l857907l022362k376894
10554A7350676k129300j761357j501355j333569j171113j010538p89554o80318
10546F973572n82347l97726k86407k85535j64984j93156n30581m46354l26995
10537C759487o1429j93678k13167k15584m9353j0146j29837r4268j49571k21712
10527B420742j67075m9927L2711j75050j09639l1567l1259k7904J18341M1193
10517B020566j10557p9144l3380p1485m7363n923n5981k31474k0874Q0880o8080
10506A377185j8028J29836k9995j04398m4568k5554k3876r1850r1033J8213o7098
$$ plain form
10569 111736806 113658162 115184547 113415603 106123476 93761591 79335773 65709556
10562 65709556 54194392 44797412 37335854 31446412 26607839 22749932 19727570 17350676
10554 17350676 15221376 13460019 11958664 10625095 9453982 8443444 7653890 6973572
10546 6973572 6391225 5993499 5707092 5421557 5256573 5063417 4532836 4086482 3759487
10537 3759487 3698058 3504380 3291213 3075629 3026276 3016130 2886293 2792025 2642454 2420742
10527 2420742 2253667 2203740 2236451 2061401 1951762 1920195 1888936 1861032 1979373 2020566
10517 2020566 1910009 1830865 1797485 1726000 1678637 1672714 1616733 1385259 1364385 1445265 1377185
10506 1377185 1359157 1488993 1458998 1354600 1310032 1284478 1260602 1168752 1077719 1095932 1028834
10495A028834o6677n0320O9228Q0313M1151R6857k0562L2056K3304o7337j48760
10484A018087o333K5443m4109j75186J5816J29008l7228J49293N6883j0959k04619
10473I16096r4585K1356R4729K0358q3400j01549J14617L4097o1680j23865J65398
10462I01572M7290r4895j01328J1066l2193O7504O8895k1268N1112o7018j30792
10451F99945k7806p0954O1739O8999j29851m2654J79058k6269p0024p7250j5862
10440E49071k08796J04004l1362P3921J13737K2391p7781P0244K243o8157M3838
10429E93353j888l7120Q7191r4641k42880J9133J3474P2924L7576l3087l2090
10418C81945N4473R1833L9342R355J01158j20685j51069J8361L3077p018K4907
$$ plain form
10495 1028834 962157 911837 981065 1061378 1102529 1199386 1178824 1210880 1234184 1166847 1018087
10484 1018087 1011754 1037197 993088 817902 833718 962726 925498 1074791 1131674 1120715 916096
10473 916096 821511 842867 937596 957954 874554 773005 887622 921719 860039 736174 901572
10462 901572 948862 853967 752639 763705 731512 799016 867911 846643 897755 830737 699945
10451 699945 672139 601185 662924 731923 602072 559418 738476 712207 642183 564933 549071
10440 549071 340275 444279 412917 486838 600575 622966 545185 615429 617672 549515 593353
10429 593353 591465 554345 641536 546895 304015 323148 336622 409546 447122 414035 381945
10418 381945 436418 528251 567593 576948 678106 557421 406352 424713 457790 450772 475679
10407D75679o2634j25317n8390j9316N7474j73127O632O8800M7112J9864R8569
10396C35346q7008J9430J35236n96k743J03779j23134j11341k6774N9820O2781
10385C64796K5166M5647j8588J3261M6619m790j17631n9239J13291j11673N8923
10374C55782m7957j05637J4624J6910J5935R7390L9706m7309N0648j3339N1762
10363D28515k8448r794O5293O554r0443J22895l1843l6170K9092o7931o1146J35829
10351D62403J7001p862j196j38808q9814L5458Q3110k09963j5407O6728p6062
10340A25588j4045R6817J43483M2263M9106r9268q2755J53518K0642k03567j81670
10329E0112j62886K08318J42360m2696j6499o2463N0443Q0523O5445r4777k09876
$$ plain form
10407 475679 413045 287728 229338 210022 267496 94369 101001 169801 216913 236777 335346
10396 335346 248338 267768 403004 402408 399665 503444 380310 268969 242195 302015 364796
10385 364796 389962 435609 417021 430282 476901 472111 354480 295241 408532 296859 355782
10374 355782 307825 202188 216812 233722 249657 347047 386753 339444 390092 376753 428515
10363 428515 400067 390273 455566 462120 371677 494572 462729 426559 455651 387720 326574 462403
10351 462403 479404 471542 470346 331538 241724 277182 360292 150329 134922 201650 125588
10340 125588 111543 208360 351843 394106 443212 343944 261189 414707 435349 231782 50112
10329 50112 -112774 95544 237904 195208 178709 116246 166689 247212 312657 217880 8004
10318H004l3716J08917J13512J23717P8158k18799j98699J0788J76963J83786
10308C52631j4581j11660p3636k5108m7534j4213p6294N4800M9619J38639o0797
10297A71866j21913j56575o4224J95670m00j63828Q0126K61237J51448j5811j45262
10286A92334K516P5419o899J31897j46850j51416O845J6658J37050K3545j4227
10275B66872P2315J17521p8754m8030j04832j14069o4392J4261q6650J8672J40783
10264A33697j33307k05884J59936J28104m044K5662K73282J1235o0717n063o3628
10253B59273M1346j4342k23219n8537R1233J54034n676j66737J45739J14432l1229
10242C06317O574j05603q0294R2360l2121J10284M7989N8534j17033q3775j9868
$$ plain form
10318 8004 -25712 83205 196717 320434 398592 179793 -18906 -8118 168845 352631
10308 352631 338050 226390 152754 127646 80112 65899 -10395 44405 94024 232663 171866
10297 171866 49953 -106622 -170846 24824 24424 -139404 -59278 201959 353407 337596 192334
10286 192334 194850 270269 263370 395267 248417 97001 103846 120504 257554 281099 266872
10275 266872 339187 456708 377954 329924 225092 111023 46631 60892 -25758 -7086 133697
10264 133697 390 -205494 -45558 82546 78502 104164 377446 388681 327964 322901 259273
10253 259273 300619 286277 63058 4521 95754 249788 244112 77375 223114 337546 306317
10242 306317 312891 207288 126994 219354 187233 297517 345506 404040 287007 203232 183364
10231A83364M8680k4421q6290N2839J1758j89328p0781k5719Q9465k5767Q0157
10220D3957q876k145J14589K29170J19398j41306j10245j23131q1960l8826J43309
10209A43934K0947j58560R9268J10061l0871N547L5319j7500q9913O0309m3517
10198A35024j36885P0581p0498K943O4448k3280k7026N8893J11566J39163J66339
10187D91268j50688p9497O3051L849J0492k5280m4691K58638K31889n8429P587
10176G08189q1357j00200j44268L0311J43774K52083K09773M9731j1349J74068
10166A230755K4460M0914j82919j50613j63366k31259Q4855K47689J27432K55862
10156A283810L24383J62089j02175O0842Q0350o9105k44390k74061j8893r995
$$ plain form
10231 183364 232044 207623 121333 174172 185930 -3398 -74179 -99898 -10433 -36200 43957
10220 43957 35081 32936 147525 376695 496093 354787 244542 121411 39451 625 143934
10209 143934 164881 6321 105589 215650 184779 190326 225645 208145 118232 178541 135024
10198 135024 -1861 68720 -1778 1165 65613 42333 15307 74200 185766 324929 491268
10187 491268 340580 261083 324134 327983 338475 313195 268504 527142 759031 700602 708189
10176 708189 626832 526632 382364 412675 556449 808532 1018305 1068036 1056687 1230755
10166 1230755 1255215 1296129 1113210 962597 799231 567972 652827 900516 1027948 1283810
10156 1283810 1608193 1770282 1668107 1728949 1809299 1740194 1495804 1221743 1202850 1192855
10146A192855L9593j7770N4871J02904P8965N3101o7358k58338k54634o5826j00090
10135G58273J1673j41697j35452J07333N9788j7875L8618j23720j01742q6758
10125C68441l4619K9604K3620q8320k8649l1304j17878Q625k077L5267J37900
10114C00610j28146j21387j19831L5285N6144K0922n1072Q6162P4177R5313P9867
10103C28044l1094k4186r3161j53072n1509K6908K02120N3993Q0554K7963k5636
10092C40924k16587r1973l3058j3863M4903J38363o816L6230m2261j8080q4809
10081E2973J04852K6320P8748K50794j30465j44143R9809k5903O196j15307k65884
10070f2010M6049J40508J96228P8194j4900j67587j0116J91962K4056r0020j84364
$$ plain form
10146 1192855 1232448 1214678 1269549 1372453 1451418 1504519 1437161 1178823 924189 858363 758273
10135 758273 769946 628249 492797 600130 659918 642043 680661 556941 455199 368441
10125 368441 333822 363426 387046 298726 270077 238773 120895 129520 127443 162710 300610
10114 300610 172464 51077 -68754 -33469 22675 43597 -7475 78687 152864 248177 328044
10103 328044 296950 272764 179603 26531 -24978 1930 204050 258043 338597 366560 340924
10092 340924 124337 32364 -694 -14557 30346 168709 161893 198123 155862 137782 52973
10081 52973 157825 184145 262893 513687 383222 239079 338888 312985 319181 203874 -62010
10070 -62010 -15961 124547 320775 398969 384069 216482 206366 398328 422384 332364 148000
10059A48000o150N8690Q9663r0008l3508j00345n4744p2058L6364K16144P2446
10048B64494J0614j53757p0759J51840J83673J7230j67625j9593K11249P0762
10038D98128m7201k56970j35753l9530N8716J22400J53915N3198o5338k52604
10028H8961r690J9120j12870j48594J67352P5164J23272N3775j35894R5939q6542
10017A29993q5355Q0892J3797J3678J7804O4638l3633r5769n9472J23691J45147
10006C15411k580k24594o1578O1743K17935L2760j38899K117R4249q9939J0019
9995B16644r4649j90190J3622K30062J93983K3241R9702j3058k63787k71342k14271
9984b70043j6986J71412K51262J52394o7533l7793O4487J04180m7134o0780q38
$$ plain form
10059 148000 141850 200540 290203 200195 166687 66342 11598 -60460 -24096 192048 264494
10048 264494 275108 121351 50592 202432 386105 403335 235710 216117 427366 498128
10038 498128 450927 193957 58204 18674 77390 199790 353705 406903 341565 88961
10028 88961 79271 98391 -14479 -163073 4279 79443 202715 256490 120596 216535 129993
10017 129993 44638 125530 139327 153005 170809 235447 201814 106045 46573 170264 315411
10006 315411 312831 88237 26659 88402 306337 339097 200198 202315 296564 206625 216644
9995 216644 121995 -68195 -54573 175489 369472 392713 492415 479357 215570 -55772 -270043
9984 -270043 -287029 -115617 135645 288039 220506 182713 247200 351380 304246 243466 242628
9973B42628j8211J15124j21246j45636m0081J14544J04275m6299r3652J5938J0245
9962A37629r7514K802M1744J02223j70090j75216q2212J37110J33833r9356K4134
9951d4913K24077Q2682J2789K0651k71907l9805K28095J4306j84868k16199P6155
9940i8937K39682J84433l0119r4747j05672j33160m1503R3407N568J04391J33505
9929B56848j31310j67756L4218K1686j4675k2639J1277l4358J86467J31663M0429
9918C11850N8500j76058j36673j0959J07576j5115p3622J0076J7657R3751N8011
9907B44994j51228j41502L9612J49618J54624R1663j91787j95446J9422r0633
9897g0663q2310q2841q4499J19139J02982l575n9194m1434m1609P3973J85167
$$ plain form
9973 242628 224417 339541 218295 72659 32578 147122 251397 205098 111446 127384 137629
9962 137629 40115 42917 84661 186884 16794 -158422 -240634 -103524 30309 -69047 -44913
9951 -44913 179164 261846 274635 295286 23379 -16426 211669 225975 41107 -175092 -98937
9940 -98937 140745 325178 295059 200312 94640 -38520 -80023 13384 18952 123343 256848
9929 256848 125538 -42218 -8000 13686 -989 -23628 -12351 -46709 139758 271421 311850
9918 311850 370350 194292 57619 46660 154236 139121 65499 75575 93232 186983 244994
9907 244994 93766 -47736 -8124 141494 296118 387781 195994 548 19970 -70663
9897 -70663 -152973 -235814 -320313 -201174 -98192 -101767 -160961 -202395 -244004 -170031 15136
9886A5136N1171k0300j28161J58j32547K3784O9626J9387J90529J878j52468r8849
9874a60656L5861N2817K472P3182K8183q4109Q2753o9004j3945J51561l7455j46975
9862h5315P730M7619k5622P3102J69759M557R6427J45909q0605n1662j24173j89410
9850a1684n9036j2899O8645j4637j42931k61590J39828K90438K67260J5775j29343
9839A49826R254j6609k0771K00374J78001p9130r1160j52882M1676m143r9607
9828A14829J92034J39983J05500m2974o3496j43166j18049N3024K7126N7890K03419
9817E26120l3344q0579M378k7646k706j00557m1080N2055J85065N5246n5180j13142
9805C68630O2398J95592L5736j74619J5991Q5463K7579j59887o2634J56464k6830
$$ plain form
9886 15136 66307 46007 -82154 -81996 -214543 -190759 -121133 -101746 88783 90661 -61807 -160656
9874 -160656 -124795 -71978 -69506 3676 31859 -52250 30503 -38501 -52446 99115 61660 -85315
9862 -85315 -77585 -29966 -55588 17514 187273 191830 288257 434166 353561 301899 177726 -11684
9850 -11684 -70720 -83619 -14974 -29611 -172542 -434132 -294304 -3866 263394 279169 149826
9839 149826 159080 142471 121700 322074 500075 420945 329785 176903 218579 214436 114829
9828 114829 306863 446846 552346 509372 445876 302710 184661 237685 264811 322701 526120
9817 526120 492776 412197 416575 388929 386223 285666 244586 296641 481706 536952 481772 368630
9805 368630 431028 626620 662356 487737 503728 589191 616770 456883 394249 550713 523883
9794E23883L4671J90801k9028o7020k67325l4921J39512n5635K77858J65488j9991
9783H58293j47353p3647P4878N0170j4528r6022R1273K60042J17364j20256o5819
9772I34395m691J79948o2125j54962J29470L90112N8824J70688K31445N1098k803
9761A921399j39382k25311j81797L6761J85155R3717J06465q0407M6234M6120
9751A808954K43288K13961q975N1978P0203M0911N1237J5809L7543J14504J80675
9740B820088J63708J38133K05282J88925J79856N082J31654L68468K03615L88771
9730D793582J19686J21037J12354M40139K27597K78059K80605K15435K07012k5468
9720F770038j89237j74051j13323J49900l4653j01656R4526K30699k9241j9828
$$ plain form
9794 523883 558554 749355 720327 653307 385982 351061 490573 434938 712796 878284 858293
9783 858293 710940 637293 712171 762341 747813 651791 743064 1003106 1120470 1000214 934395
9772 934395 929704 1109652 1047527 892565 1022035 1412147 1470971 1641659 1873104 1924202 1921399
9761 1921399 1782017 1556706 1374909 1411670 1596825 1690542 1797007 1716600 1762834 1808954
9751 1808954 2052242 2266203 2257228 2309206 2379409 2420320 2471557 2487366 2524909 2639413 2820088
9740 2820088 2983796 3121929 3327211 3516136 3695992 3701074 3832728 4201196 4404811 4793582
9730 4793582 4913268 5034305 5146659 5586798 5814395 6092454 6373059 6588494 6795506 6770038
9720 6770038 6580801 6406750 6293427 6443327 6408674 6307018 6401544 6632243 6603002 6583174
9710F583174J37621K70553L02058J12859l9857K70503L48493L54443J78240J84406
9700H702493J21397L4737Q5120K48415J86798J68056J22585J11811K67158K80149
9690A0328719J23839J1661k1521Q6242l0939K1526K3560m226J93344P6172j58646
9679A0649731j54887k9204l2153J13491J07936K15490K68464J46497M50371N20774
9669A2256510M97309N34781P30584P75019M94366N41805O77502O62493M80101
9660A7650470L32931K25973m9098J51075N67731N30271L31414N97639N23502L16538
9650B1178446L85533M33744M9703M0242j26111l49704m54309o14187o17902r33244
9640A8992211o70612o35997o97106l99695k39317l77409j97737l1347J94392N84173
$$ plain form
9710 6583174 6720795 6991348 7293406 7406265 7366408 7636911 7985404 8339847 8518087 8702493
9700 8702493 8823890 8858627 8943747 9192162 9378960 9547016 9669601 9781412 10048570 10328719
9690 10328719 10452558 10464219 10442698 10528940 10498001 10519527 10543087 10538861 10732205 10808377 10649731
9679 10649731 10494844 10465640 10433487 10546978 10654914 10870404 11138868 11285365 11735736 12256510
9669 12256510 12753819 13288600 14019184 14794203 15288569 15830374 16507876 17170369 17650470
9660 17650470 17983401 18209374 18160276 18311351 18879082 19409353 19740767 20338406 20861908 21178446
9650 21178446 21563979 21997723 22047426 22087668 21961557 21611853 21157544 20543357 19925455 18992211
9640 18992211 18321599 17685602 16988496 16588801 16349484 15972075 15774338 15742991 15937383 16521556
9630A6521556N96178O83371J005777R46296P44677P26704O67040M79995N00590
9621B2872184O89674P63650M86319M71258M52689P9072l8517l60272n95106m47466
9611B4373485l08459o0374L84991M78806L76340J40448p1957l04165o43405r18083
9601B3447627q74940p94432o39406p15847n88475n17181k89723k75335j76975
9592A8575313m26666m74686l31215l35096k59587J07295n38o5721J28264Q4419
9582A7001782R2410k59168m11172l46637k87336j58248j53555M732m3161j92068
9572A5247579n6213N6519K41497L43524K46085J83183O7038p5701k49000l15786
9562A5688725l36348l56015p4508p317j73777Q6132M12566L62241L38985J62077
$$ plain form
9630 16521556 17117734 17801105 18806882 19753178 20497855 21224559 21891599 22371594 22872184
9621 22872184 23561858 24325508 24811827 25283085 25735774 25814846 25776329 25416057 24820951 24373485
9611 24373485 24065026 24004652 24389643 24868449 25244789 25385237 25313280 25009115 24365710 23447627
9601 23447627 22572687 21778255 21138849 20423002 19834527 19317346 19027623 18752288 18575313
9592 18575313 18148647 17673961 17342746 17007650 16748063 16855358 16854820 16789099 16917363 17001782
9582 17001782 17094192 16835024 16423852 16077215 15789879 15631631 15478076 15482808 15439647 15247579
9572 15247579 15191366 15247885 15489382 15832906 16078991 16262174 16329212 16253511 16004511 15688725
9562 15688725 15352377 14996362 14921854 14914537 14740760 14826892 15239458 15601699 15940684 16102761
9552A6102761K42986J75068j50316l38009k68317m07415o87761m69500m30018
9543A3769479k95253l20533m90779m52942o43992n89777m84304n92319n06564
9534I393016m13126n75801n17780k31119k10822j24562p6812l46565l54333J2380
9524F554476L9641j56907l4460j4230J36312J75144J23261J58745J01553j3960
9514G069575P7676r8687k61248j72814r5242q9822j67072o7611j16142l2491o3544
9503E982578j9657J42408j88469k37518l08038j56946k32946j99448j41687k63691
9493D376586j11549j58002k275q5372j26770Q6134j54766l0874Q5509o5971P7567
9482C890217L2462r4959j82677j95165J886J05990j31504j47963l4207l7423K4416
$$ plain form
9552 16102761 16345747 16520815 16370499 16032490 15764173 15356758 14668997 14199497 13769479
9543 13769479 13474226 13153693 12662914 12209972 11565980 10976203 10491899 9899580 9393016
9534 9393016 8979890 8404089 7886309 7655190 7444368 7319806 7242994 6896429 6542096 6554476
9524 6554476 6594117 6437210 6402750 6388520 6524832 6699976 6823237 6981982 7083535 7069575
9514 7069575 7147251 7048564 6787316 6614502 6519260 6429438 6262366 6194755 6078613 6046122 5982578
9503 5982578 5962921 6105329 5916860 5679342 5371304 5214358 4981412 4781964 4640277 4376586
9493 4376586 4265037 4107035 4104760 4019388 3892618 3978752 3823986 3793112 3878621 3812650 3890217
9482 3890217 3922679 3827720 3645043 3449878 3451764 3557754 3426250 3278287 3244080 3206657 3231073
9471C231073k2910j92612q7795J7618r6551O2353J45063o7403M651m6741P3292
9460C020038N5406J46912K71112K67511K30550K16255K53206L91724M49806L75176
9450E677696N15291N11544M21635L32058N69299M91949K92727J99410J86668L49436
9440I547713M57058L69312J33813J57114N28020L06807J64679L32509L44327J75315
9430A2516667J30380m570j26768n4775p281J46805L97152L45664L63758N13217
9420A4220249P75877P98458P19418Q90237P64423P63546P06739L91855K43381
9411B0274183K14517J5749K55784N19718N85117M73264L85738O55077Q96303J061728
9401B5337178J089675J214901J004588P95569P16297N27198J71489j51055k90778
$$ plain form
9471 3231073 3208163 3015551 2927756 2945374 2848823 2911176 3056239 2988836 2993487 2946746 3020038
9460 3020038 3075444 3222356 3493468 3760979 3991529 4207784 4460990 4852714 5302520 5677696
9450 5677696 6192987 6704531 7126166 7458224 8027523 8519472 8812199 9011609 9198277 9547713
9440 9547713 10004771 10374083 10507896 10665010 11193030 11499837 11664516 11997025 12341352 12516667
9430 12516667 12647047 12642477 12515709 12460934 12453653 12600458 12997610 13343274 13707032 14220249
9420 14220249 14996126 15794584 16514002 17404239 18168662 18932208 19638947 20030802 20274183
9411 20274183 20488700 20504449 20760233 21279951 21865068 22338332 22724070 23379147 24275450 25337178
9401 25337178 26426853 27641754 28646342 29441911 30158208 30685406 30856895 30705840 30415062
9392C0415062n6823M3960n3848j37214N3244J62055L75452N73625J031440J404724
9382C3811677J213579J034293Q32989P37103R26194J073027R84560P11179L67638
9373D1692239J00742l638j47191j81818j5734k1552Q6083j84759m44317l42993
9363D0537062l49924l35387M1143J83478M56926N18225N39507P58789R68660J461529
9353D4780008J903161K007407K266851K704408K922441K485332J251841j34475
9345F0186974j507810k619221l110078k996866k486321j930103j403277j015312
9337D3117986p95529n39482m19608l53671o29024o15110m30470k0287J58858M29250
9327C9902913P03507Q13309Q08132Q00554Q62806J341718J794239J770186J450371
$$ plain form
9392 30415062 30358239 30402199 30348351 30211137 30264381 30426436 30801888 31375513 32406953 33811677
9382 33811677 35025256 36059549 36892538 37629641 38555835 39628862 40613422 41324601 41692239
9373 41692239 41792981 41789343 41642152 41460334 41444600 41423048 41509131 41324372 40880055 40537062
9363 40537062 40187138 39851751 39892894 40076372 40533298 41051523 41591030 42349819 43318479 44780008
9353 44780008 46683169 48690576 50957427 53661835 56584276 59069608 60321449 60186974
9345 60186974 58679164 56059943 52949865 49952999 47466678 45536575 44133298 43117986
9337 43117986 42322457 41782975 41363367 41009696 40380672 39765562 39335092 39314805 39473663 39902913
9327 39902913 40606420 41419729 42227861 43028415 43891221 45232939 47027178 48797364 50247735
9318E0247735J147649O65808L12936K4530l39426q27050r30108j233662j226700
9309D7841712j024123p05075m84847l38207j18407k23425j88280o03318j126857
9300D3029173j412755j378149j538877j425849j147026q76706q49999j013044
9292C3386768p84404q20597p00554k87487j07332j87152j16767K22424N95803
9283C1200702R23372J030468O55428K32674J95223j78642m19689k39923Q8343
9274C3487956J28777k0509l61840n58736p06441j210182j319583j042191j422620
9265B6974631j444752j227987j078037j087099p06018n71575l22633p1291J54484
9256B0619723R3022J5431J18422J29715j98082k77177l1580l33689m51501k68138
$$ plain form
9318 50247735 51395384 52061192 52374128 52398658 52059232 51232182 50302074 49068412 47841712
9309 47841712 46817589 46112514 45627667 45289460 45171053 44947628 44759348 44156030 43029173
9300 43029173 41616418 40238269 38699392 37273543 36126517 35249811 34399812 33386768
9292 33386768 32602364 31781767 31081213 30793726 30686394 30499242 30382475 30604899 31200702
9283 31200702 32124074 33154542 33809970 34042644 34237867 34059225 33639536 33399613 33487956
9274 33487956 33616733 33596224 33234384 32675648 31969207 30759025 29439442 28397251 26974631
9265 26974631 25529879 24301892 23223855 22136756 21430738 20859163 20536530 20465239 20619723
9256 20619723 20712745 20728176 20846598 20976313 20778231 20501054 20469474 20135785 19684284 19416146
9246A9416146k98081l96057m44577l47442l72965m80232j67048J65193L17707
9237A7392644L99074M38291N28125N98372M06087L22336N11081K03288P6743j86742
9227B0689299k40989m35567n68221n98032m92987o34666n34449m89471n33516
9218A6161401k11395J8946k0824n8241q6459K3830j44997j04148k03099r5045
9208A5279969J87410K11315L55007O61858N33200M45345J79545L99791N8349k55983
9198A8055806l42643j11992m6980j04921j03555m7664r8784J68323M25983M94928
9188A8288501N99750O94417N36269N51648O04530J53945j25344l33508l41632
9179B0628576m8181J92088J23015J72420K36079J09717j46338L125J40080K6157
$$ plain form
9246 19416146 19118065 18722008 18277431 17929989 17557024 17076792 16909744 17074937 17392644
9237 17392644 17791718 18230009 18758134 19356506 19762593 20084929 20596010 20799298 20876041 20689299
9227 20689299 20448310 20012743 19444522 18846490 18353503 17718837 17184388 16694917 16161401
9218 16161401 15950006 15968952 15948128 15889887 15803428 15827258 15682261 15578113 15375014 15279969
9208 15279969 15467379 15678694 16033701 16695559 17228759 17674104 17853649 18253440 18311789 18055806
9198 18055806 17713163 17601171 17554191 17449270 17345715 17298051 17199267 17367590 17793573 18288501
9188 18288501 18888251 19582668 20118937 20670585 21275115 21429060 21303716 20970208 20628576
9179 20628576 20580395 20772483 20895498 21067918 21303997 21413714 21267376 21270501 21410581 21436738
9169B1436738k69453k51195l08999k22217l06210l92140n00760n80737m17505
9160A8187522m53225m54571n08604m12548k04375r3599K44052O30658O26586M98371
9150A8060267O41163R00845R71059Q67823P32486J022510Q99403J232411J123737
9141B6451704O11111M32349K43431k29589k24703r1521k87243p6200J87727L49126
9131B7366192N08454N43638P89783L52860K55701L37796J34975j44222k42482
9122B9902695l58815l23430m51137p38813q54452n75166p13339q58369p54151
9113B4275023o12273o93310p29141o10414n66261o90294n90345n23181n52899
9104A8706905k83318l22599k73392n63517m97138l09452j98653n50287p30972
$$ plain form
9169 21436738 21167285 20916090 20607091 20384874 20078664 19686524 19185764 18605027 18187522
9160 18187522 17734297 17279726 16771122 16358574 16154199 16060600 16304652 16935310 17561896 18060267
9150 18060267 18701430 19602275 20573334 21441157 22173643 23196153 24095556 25327967 26451704
9141 26451704 27062815 27495164 27738595 27509006 27284303 27192782 26905539 26829339 27017066 27366192
9131 27366192 27874646 28418284 29208067 29560927 29816628 30154424 30289399 30145177 29902695
9122 29902695 29543880 29220450 28769313 28030500 27176048 26600882 25887543 25029174 24275023
9113 24275023 23662750 22969440 22240299 21629885 21063624 20373330 19782985 19259804 18706905
9104 18706905 18423587 18100988 17827596 17264079 16766941 16457489 16258836 15708549 14977577
9095A4977577o57056m36076l95886n25626k84188k26298l50295m43266l87348
9086A1271538k76755k65291j02244J68770p4379J13128J59949P5904J16465r9160
9076A1087925J8648L7934k83634l71311n21758k49791j24671k56495p9234m9110
9066I208503j60093o7011k14874k49974k31501k76670j38519l06783k65598j86212
9056G111268j43174j40071j36641j45939k18631k07967j86348j93691j23085J84703
9046E800424J98561p771k50600j84964k00671r743j09625k53460k15939j19650
9036D646562k54658j22673k03593r2705k78300o529P4076j12481m6637p5020r7820
9025C430222J3060N0700k02716j15571k38414j99504r929L5361j33926L098q0367
$$ plain form
9095 14977577 14320521 13884445 13488559 12962933 12678745 12452447 12102152 11658886 11271538
9086 11271538 10994783 10729492 10627248 10796018 10721639 10834767 10994716 11070620 11187085 11087925
9076 11087925 11106573 11144507 10860873 10489562 9967804 9718013 9593342 9336847 9257613 9208503
9066 9208503 9048410 8981399 8766525 8516551 8285050 8008380 7869861 7563078 7297480 7111268
9056 7111268 6968094 6828023 6691382 6545443 6326812 6118845 5932497 5738806 5615721 5800424
9046 5800424 5998985 5991214 5740614 5555650 5354979 5345236 5235611 4982151 4766212 4646562
9036 4646562 4391904 4269231 4065638 3972933 3694633 3688104 3762180 3649699 3603062 3528042 3430222
9025 3430222 3443282 3493982 3291266 3175695 2937281 2737777 2727848 2763209 2629283 2632381 2552014
9014B552014m9058j3149m2619m9623J45109l9335j94448j71123l13816k48938
9004A575014j37096l6012J24784j18813o6441m0247n807m7554j29218j63603R461
8993I64468N5581M6196J17463o3722j15322l0208N2124J09924K01555R0585k08439
8982A220205j22343k13122J11650J14683K240p7658l4330J1283O8692k1798p0558
8971I88944j76430k41792j44529J25222J834j08400J60358J54797r2269M736l7682
8960F34789O9037J07974M88j76949j61224n7161O0064J68159R0513J24754O3245
8949I23689r6553j29937q9907j06748j9586J7585o1394J77877Q2641o572k0054
8938F71041o7727r1804O380P1055N495j14467K9756Q8142p128O1347n1456j27981
$$ plain form
9014 2552014 2502956 2489807 2447188 2397565 2542674 2503339 2308891 2137768 1823952 1575014
9004 1575014 1437918 1401906 1526690 1407877 1341436 1301189 1295382 1247828 1118610 955007 964468
8993 964468 1020049 1066245 1183708 1119986 1004664 974456 1026580 1136504 1338059 1428644 1220205
8982 1220205 1097862 884740 996390 1111073 1113313 1035655 1001325 1012608 1081300 1059502 988944
8971 988944 812514 570722 426193 551415 553249 444849 605207 760004 667735 672471 634789
8960 634789 703826 811800 812288 635339 474115 416954 477018 645177 735690 860444 923689
8949 923689 827136 697199 607292 500544 480958 498543 437149 615026 697667 691095 671041
8938 671041 603314 511510 517890 588945 594440 479973 509729 597871 590743 652090 600634 472653
8926D72653M7245J44259R1252j55066M0209R6938j11217j49221O6980J86849L5820
8915G66701p3962R3996J1642k50492q2870L6165J69065M964q3969N5711J17937
8904G64888o2168j97559q7532j26682O6467Q7559O915K246J42859K6028j9801
8893F03220q2302r7569j2160j1608r3787r085J34479q9043n8919m4355O2804P0478
8881C72153R6684J27550k5445m0729J0857K1238j43140k54125J3917n5324J12344
8870B35980J09147o7294P0578K07370j53501J1787n9533l7800K0429K60113n829
8859E91447k47196j13222o7779N1954k15464j10386R744J25415J96182M6707l8150
8848B29252L2700L1208j14208o7297q6930P29P04m4038l4947j67127K7245K11420
$$ plain form
8926 472653 519898 664157 755409 600343 640552 737490 626273 477052 544032 730881 766701
8915 766701 692739 786735 798377 547885 465015 501180 670245 675209 591240 646951 764888
8904 764888 702720 505161 417629 290947 357414 444973 451888 454134 596993 623021 603220
8893 603220 520918 423349 411189 399581 305794 296709 431188 342145 283226 238871 301675 372153
8881 372153 468837 596387 570942 530213 541070 562308 419168 165043 178960 123636 235980
8870 235980 345127 277833 348411 555781 402280 414067 354534 316734 337163 597276 591447
8859 591447 344251 231029 163250 215204 -260 -110646 -100902 24513 220695 267402 229252
8848 229252 261952 293160 178952 111655 24725 25454 26158 -17880 -52827 -219954 -192709 18711
8836A8711J3643j0345J34458K20603J82222j66788L1226J1434j25232O2159L8021
8825D10112o36K9105J00042N8513J4748q9024q1194p2905j17786N2705l3844q7744
8813A82092J5376P8741j90328j27258Q9402J54138K2894n9099q188j27858q9035
8802e9123Q936J51547J92372j3106J75510p0031R569r1937m8088q8937P1511O4428
8790C02651j83995j47954L8869K4942K13545l930o4050Q9059r5308J5644N2286
8779B41759P7072J228q3120J17937j7916j75417o4181J40385J58664L3786j91466
8768B38731k55761j2973K84K4036J90157J67135N1876j05955J5068M024O007M6530
8756C69159n4371O2619k24214p0856K04403K9679Q3588l3405j52896j33044j08349
$$ plain form
8836 18711 32354 22009 156467 377070 559292 392504 423730 435164 309932 372091 410112
8825 410112 409476 438581 538623 597136 611884 522860 441666 368761 250975 303680 269836 182092
8813 182092 197468 276209 85881 -41377 48025 202163 225057 165958 157770 29912 -59123
8802 -59123 -50187 101360 293732 280626 456136 386105 395674 303737 255649 166712 238223 302651
8790 302651 118656 -29298 9571 34513 248058 244128 180078 269137 173829 189473 241759
8779 241759 318831 320059 236939 354876 336960 161543 97362 237747 396411 430197 238731
8768 238731 -17030 -30003 -29719 -5683 184474 351609 403485 297530 312598 316622 322629 369159
8756 369159 314788 377407 153193 82337 286740 316419 400007 366602 213706 80662 -27687
8745b7687M1126J77748J08051J05641o8040k8620m0516N262R1862o7122r7020
8734B00685J62710K1551j06759j63304M3251k03328L2829K00474j0526J1898N1753
8723B41234n2204K2707q3290q1082J2138K8511o3109O4144m6971P4112L5551P3784
8711B25525M5373m2121K29638j20755j17524L2817j57606p3864J88318J03425
8701C13226j26559L5527K11k7080m0448k7957j12958j435n4489K4660J18978J95701
8689B97377j20552j729K3071j86777k0916n4716P4371J45035L0419P2257P8875
8678C36715P2704Q0532j53241j3325q0966j60362j4078j56735Q2006J24640o8048
8667D9842N18O8317p3764n0730n4335J72243J5993J6596j54171l990O9871N5627
$$ plain form
8745 -27687 13439 191187 299238 404879 336839 308219 267703 272965 364827 297705 200685
8734 200685 363395 384946 278187 114883 158134 -45194 -12365 188109 177583 189481 241234
8723 241234 189030 211737 128447 47365 59503 88014 24905 89049 42078 116190 151741 225525
8711 225525 270898 228777 458415 337660 220136 252953 95347 21483 209801 313226
8701 313226 186667 222194 222405 195325 154877 126920 13962 12527 -41962 -17302 101676 297377
8689 297377 176825 175096 198167 11390 -9526 -64242 10129 155164 185583 257840 336715
8678 336715 409419 489951 336710 323385 242419 82057 67979 -88756 -6750 117890 49842
8667 49842 50360 118677 44913 -5817 -60152 112091 128084 144680 -9491 -13481 56390 112017
8655A12017m7335J48074J64661M6881k4992K3093M5698p0268r8109n5245p783
8644B36692K8301Q38o9190R2157M829p9063L9906J52585l6505k06709j41586j66602
8632a44347M976J8465N6433M8995M3335J06115j46634q1903J86892J87707P5505
8621C55539J1405j18576m0284J03204J92236M9118j0550j21528j96236k39651
8611a5323o4962J79993M3974m0485P7612o582j05293j9677J28703M0572q231j88463
8599B1838Q4303J90959j15628j4604P8503j16291k3767J80223l196m747j55674
8588A21919j59514K42665R7841j19250q2722j38092o9725J0114J02328Q3844q3050
8577F358q816J75303L8980k78499j30113J63520J52811J17038K6429r4289n8615
$$ plain form
8655 112017 64682 212756 377417 424298 399306 422399 468097 397829 299720 244475 236692
8644 236692 264993 265831 196641 288798 293627 214564 254470 407055 370550 163841 22255 -144347
8632 -144347 -139371 -120906 -64473 -15478 27857 133972 -12662 -94565 92327 280034 355539
8621 355539 366944 248368 208084 311288 503524 552642 542092 420564 224328 -15323
8611 -15323 -80285 99708 143682 103197 180809 174227 68934 49257 177960 218532 210301 21838
8599 21838 106141 297100 181472 166868 245371 129080 105313 285536 282340 277593 121919
8588 121919 -37595 205070 302911 183661 100939 -37153 -106878 -96764 5564 89408 6358
8577 6358 -2458 172845 211825 -66674 -196787 -33267 119544 236582 263011 168722 110107
8566A10107M6026R6418j60210j12144M4054p4893j00265P3525N0634J69161L7356
8555A79769j44224j44019J1244M5991K22273J196l8762o3829p5350P0221j589
8544F2921j36824K6680l780P1643r8275j14899K9M6142J4764N5452l6298M7626
8532f4819K46449J83810M0040k13057j38104J51134J27830n3207p4694L6469n3083
8521A88768L1530j56881j45724j17300Q0308Q5246J30619J1095J72568J30662
8511D10891l7960j94012j47458p7992J12187N1918J06029l7343r2756n7303L3100
8500F9301q357J32952k2044j84079p3669j8533K9097J08894k4916K1617j37419
8489a07156j0575q4686N3100P3599M8275J74659N7935j76163j59142j06162N3918
$$ plain form
8566 110107 156133 252551 92341 -19803 24251 -50642 -150907 -77382 -26748 142413 179769
8555 179769 35545 -108474 -97230 -51239 171034 172230 133468 69639 -5711 64510 62921
8544 62921 -73903 -47223 -51003 20640 -77635 -192534 -192505 -146363 -131599 -76147 -112445 -64819
8532 -64819 181630 365440 405480 192423 54319 205453 333283 280076 205382 241851 188768
8521 188768 220298 63417 -82307 -199607 -119299 -34053 96566 107661 280229 410891
8511 410891 372931 178919 31461 -46531 65656 117574 223603 186260 93504 36201 69301
8500 69301 60944 193896 171852 -12227 -85896 -104429 -75332 33562 8646 30263 -107156
8489 -107156 -117731 -202417 -149317 -75718 -27443 147216 205151 28988 -130154 -236316 -182398
8478a82398R9354J38279k0429J8842j42539P202R0125r4885j23132K9691K52050
8467G2160J92475p7389j77959r1336R897O0960J03739J96640k3203L1307j06619
8456A90672j90758j6837J94903R9867l7976k26496p6744n601Q8344k9552j21992
8445a32170R6366p988J6804J39298n64o893K5903k32795Q2087K35517M0413m7451
8433B08527j77597n2038J92364K8070p0793O4393M2916r2637j8369L8404k5284
8422A37956o9727p816L6887n4390k2014k4197o9587j32621K2896Q6615K5674J9390
8410e0934R3983R5441O4282m6586j9967q017q7412K8202O5788l4442r7423J7310
8398B0225M4364j5377j91516N7641L5317Q5393l5393R2221M6763j4900M1634R2010
$$ plain form
8478 -182398 -83044 55235 34806 53648 -88891 -81689 8436 -86449 -209581 -179890 72160
8467 72160 264635 187246 9287 -82049 -72152 -11192 92547 289187 265984 297291 190672
8456 190672 -86 -16923 177980 277847 239871 13375 -63369 -68970 19374 -10178 -132170
8445 -132170 -35804 -43792 -26988 112310 111746 104853 130756 -102039 -19952 215565 255978 208527
8433 208527 30930 -21108 171256 199326 128533 192926 235842 143205 124836 163240 137956
8422 137956 68229 60413 97300 42910 20896 -3301 -72888 -205509 -182613 -95998 -70324 -50934
8410 -50934 43049 138490 202772 156186 136219 128202 40790 68992 134780 100338 2915 20225
8398 20225 64589 49212 -142304 -84663 -49346 36047 654 92875 139638 124738 166372 258382
8386B58382m4318j46729j9509j80974L5405J21279K8459J25337m8447k17135k6750
8375a15000J00295p8136l4101J07146J198j16711M0813R3367R7611J08486q6880
8364A18088R1394Q3893j24838l1729J42631j7534j61774m0705Q4737R9649p7330
8353A66482j59274p7018o3151J4999Q0090k5215l3520R2717p658j908Q2186K34
8341F8964K808J184L1359k7760o4397M1472j11126p2226l2012L7134K84009O6262
8329B25671p0942J965O4375k9708j39315j07806p8843J1843J07956O1216q6315
8318c9903k1264J45118q4294j82679m8159K14515J5422M9575j3788n2634R199
8307h892J68019J49951K351q7342K9751n9260j68225J52059M669j79448j9723
$$ plain form
8386 258382 214064 67335 47826 -133148 -97743 23536 51995 177332 128885 -88250 -115000
8375 -115000 -14705 -92841 -126942 -19796 -18598 -135309 -94496 -1129 96482 204968 118088
8364 118088 209482 293375 168537 136808 279439 261905 100131 59426 144163 243812 166482
8353 166482 7208 -69810 -132961 -117962 -37872 -63087 -96607 -3890 -11548 -13456 68730 68964
8341 68964 71772 72956 104315 76555 12158 53630 -57496 -129722 -161734 -124600 159409 225671
8329 225671 154729 156694 221069 191361 52046 -55760 -134603 -122760 -14804 46412 -39903
8318 -39903 -61167 83951 -343 -183022 -231181 -16666 -1244 48331 34543 -18091 -8892
8307 -8892 159127 309078 311429 224087 253838 194578 26353 178412 183081 3633 -16090
8296a6090M7941N7503j22207k10463M5546J97245J46462O2978n4164j7781k9320
8285A07650P8199k17172Q8850p8201q9170J56533J42468r5659j84705J59788J54382
8274B22963j73904l2269K6218m6769M2010k266j80689j28456j35114J29340J69622
8263a09314Q3754O8756J06188J33431R4146Q0759l50j32570j92736l2586M3741
8252A43219p3529l90039k10410J50458R7216k8638k4819N5077L30390J33860J52382
8241C35167p7049j56267k28876N8757P9379n17M4572Q5874K7011j52751P8669
8230I3969O5192j10008j00247j2335M6462J39268P2039k3582k05560r4646r0813
8219b20261O9879J48211J7073K1562K8725k40997j16909N8731J63813N0416L7972
$$ plain form
8296 -16090 31851 89354 -32853 -243316 -197770 -525 145937 208915 154751 136970 107650
8285 107650 185849 -31323 57527 -20674 -109844 46689 189157 93498 -91207 68581 222963
8274 222963 49059 16790 43008 -3761 38249 35983 -144706 -273162 -408276 -278936 -109314
8263 -109314 -25560 43196 149384 282815 376961 457720 457370 324800 132064 99478 143219
8252 143219 69690 -320349 -530759 -380301 -283085 -311723 -336542 -281465 48925 182785 335167
8241 335167 258118 101851 -127025 -68268 11111 10594 55166 141040 168051 15300 93969
8230 93969 159161 49153 -51094 -63429 -16967 122301 194340 170758 -34802 -129448 -220261
8219 -220261 -150382 -2171 14902 36464 65189 -175808 -292717 -233986 -70173 -19757 18215
8208A8215o3610L5982N534P4665n3321o2168L0659m265N1243o3426J08474K3405
8196A01387J21418P2607p9109N2586K10918k2823p937j12673k73644k37705p4540
8185b49515j17281J96592Q3807n6915l8046n9201q390j29673L782J05977n080
8174b73943R0170m4156J62991J23475k1192l7959o5116M5895M948Q142K5972P8665
8162I7892r8620Q6667O4567J1068q8145m6634J18462K0668P0648K9162j80821
8151H4914k43812k2727J55821L1563n8359m9725P1077L767p662K2700r1973L9153
8139f5263J05002l6257k7032J56432J15226j00760J7558J30998p7430q0987P7059
8128B14546K3342r1053K9892J0959K3453J80347K5906q468o2135J508l7666R6018
$$ plain form
8208 18215 -45395 -9413 -3879 70786 17465 -44703 -14044 -18309 32934 -30492 77982 101387
8196 101387 222805 295412 216303 268889 479807 456984 449047 336374 62730 -174975 -249515
8185 -249515 -366796 -170204 -86397 -143312 -181358 -240559 -248949 -378622 -374840 -268863 -273943
8174 -273943 -183773 -227929 -64938 58537 37345 -614 -65730 -19835 -14887 -6745 19227 97892
8162 97892 -728 85939 150506 161574 73429 26795 145257 165925 236573 265735 84914
8151 84914 -158898 -181625 -25804 5759 -52600 -102325 -31248 -27481 -35143 -12443 -104416 -65263
8139 -65263 39739 3482 -23550 132882 248108 147348 164906 295904 218474 137487 214546
8128 214546 237888 146835 176727 187686 211139 391486 417392 408924 346789 348297 310631 406649
8116D06649j16720q8957l4216k14991k7648P0469P0278J27557M8294j27188j90032
8105g6505p2819K8882R5960j57407j57185M1041R7636K564J14959R1059P4206
8094H2391q8663L1464L7775p1641j1370J89459J89350n4553j38174j07815J0841
8083F9064j71581p8311o912M0828P9953J62028J02101P1607j67686j55039J42735
8072H8787Q3749j69319P4746n2257r5327P9098M1774J24144J51707L6746j05438
8061B58410m6057j16223j48344j68008O700Q4876J68408Q1693j78262p9810K0165
8050a16452r6923J99353J63224n5393n7820j6582j39760p513K1754j2623J10840
8039g895J84110J6554J5510r4250j67945K1631J25232J58270j33105O3383O4406
$$ plain form
8116 406649 289929 200972 166756 -48235 -75883 -5414 64864 192421 240715 113527 -76505
8105 -76505 -149324 -120442 -24482 -181889 -339074 -298033 -200397 -197833 -82874 8185 82391
8094 82391 -6272 25192 62967 -8674 -20044 169415 358765 304212 166038 58223 69064
8083 69064 -102517 -180828 -187740 -146912 -66959 95069 197170 268777 101091 -53948 88787
8072 88787 172536 3217 77963 25706 -69621 9477 51251 175395 327102 363848 258410
8061 258410 212353 96130 -52214 -220222 -213522 -128646 39762 121455 -56807 -136617 -116452
8050 -116452 -213375 -14022 149202 93809 35989 19407 -120353 -127866 -106112 -118735 -7895
8039 -7895 176215 192769 208279 114029 -53916 -32285 92947 251217 118112 181495 245901
8028B45901j58761l8685L7669r8972m590j19078M6051O5829k0628o6550k989L6461
8016g8342k2252N9706K36984N8900k0104o0552J16989J27219j54327j98280m2632
8005B3309k6408l1329o9544K8357r2640r0438K5720L1264J59087K4418o8167J72283
7993H5912L3032j37254K4642k1764J4366J33515l5647K5329n0358j8523j06930
7982e3680J46771J56263p0006k02202K4291k058p654o458P2142p4258j9050o2677
7970i8576Q7038P5296j67773k7005K7979n0960P1828j72722K2419K17465O9084
7959E4073M0218k3854M2224r9953Q0286k4833k5855J15370j23387O184J50216
7948A90689R540j03036k4529R8757l6568j56111j75707q9562J13622j7026P7139
$$ plain form
8028 245901 87140 48455 86124 -12848 -17438 -136516 -90465 -24636 -45264 -111814 -114803 -78342
8016 -78342 -100594 -40888 196096 254996 234892 174340 291329 418548 264221 65941 23309
8005 23309 -3099 -34428 -103972 -75615 -168255 -258693 -232973 -201709 -42622 -18204 -86371 85912
7993 85912 118944 -18310 6332 -15432 -1066 132449 96802 122131 71773 53250 -53680
7982 -53680 93091 249354 179348 -22854 1437 -621 -8275 -14733 57409 -16849 -35899 -98576
7970 -98576 -11538 63758 -104015 -131020 -103041 -154001 -82173 -254895 -232476 -15011 54073
7959 54073 94291 70437 112661 12708 92994 68161 42306 157676 34289 40473 190689
7948 190689 200229 97193 72664 171421 134853 -21258 -196965 -286527 -172905 -189931 -112792
7937a12792J50073O8295o7676j12949K6337P9763j2097n9366j13065M6209o2107
7926a69375j51288P8781K15422M1876K3220j30055J35365K55333k17305r7526
7916a5552j04075j2518K05954J15846L3988l7207p1269j0855l6335j0761j07978
7905e0762o041M7919p3195l636N8166J62947K2646k78012P7559R4353j71510j38901
7893b58467L3353J15882Q3948Q211k5400R5989p9072j05634J09309J57416N6342
7882A91877j19664j25926L0715j58709o564R7451j8516q0000r8926j3368P4021
7871b27609o1995N3677P6350k7434l6978K04073O0877O0276j6397n6487j84776
7860a56423j60255R0441N181j087J6960O7176J9844J49458k0855j25864O5197
$$ plain form
7937 -112792 37281 105576 37900 -75049 -48712 31051 18954 -40412 -153477 -107268 -169375
7926 -169375 -320663 -241882 -26460 15416 38636 -91419 43946 299279 81974 -15552
7916 -15552 -119627 -132145 73809 189655 223643 186436 115167 104312 67977 57216 -50762
7905 -50762 -56803 -8884 -82079 -85715 -27549 135398 158044 -119968 -42409 51944 -119566 -258467
7893 -258467 -225114 -109232 -25284 -17073 -42473 53516 -25556 -131190 -21881 135535 191877
7882 191877 72213 -53713 -22998 -181707 -188271 -90820 -109336 -189336 -288262 -301630 -227609
7871 -227609 -289604 -235927 -159577 -187011 -223989 -19916 40961 101237 84840 28353 -156423
7860 -156423 -316678 -226237 -221056 -222143 -205183 -138007 -118163 31295 10440 -115424 -50227
7849e0227P6679K9259P7444o6421l8207J73619j05589q3745o7443o2955m6025
7838a63611m0871M0867J74036q5603k8918k0465P4515J7347J6343L9727L0026
7827E3393N3757J25549n2320j63569M4724n7484l0701K5166K2429Q565L0719K020
7815F2248J7051o141J0431J22606n7751n1909j19394p8048O1001J48731R3346
7804B02171q1740r1413m3482K0188k5934L084p7629J64821J0827j30442j23538
7793a73087Q2967J35374p0026p1111j04262m0486J04920J11038J27181K2737o8268
7782E6977j46123j10302j27939J54848M5982P4864N7140l7345P732K24312r7539
7771A02607j43364O5229k8290K5902r8742j250J07680j1100j8699J4569J09062
$$ plain form
7849 -50227 26452 55711 133155 66734 28527 202146 96557 12812 -54631 -117586 -163611
7838 -163611 -204482 -163615 10421 -75182 -104100 -124565 -50050 -32703 -16360 23367 53393
7827 53393 107150 232699 180379 16810 61534 4050 -26651 -1485 20944 29509 60228 62248
7815 62248 79299 73158 83589 206195 148444 96535 -22859 -100907 -39906 108825 202171
7804 202171 120431 29018 -14464 5724 -20210 -17126 -94755 70066 80893 -49549 -173087
7793 -173087 -90120 45254 -24772 -95883 -200145 -240631 -135711 -24673 102508 125245 56977
7782 56977 -89146 -199448 -327387 -172539 -126557 -51693 5447 -31898 -24166 200146 102607
7771 102607 -40757 24472 -3818 22084 -76658 -77908 29772 18672 -27 14542 123604
7760A23604N458j11381r7635P3139J59821J21727j45065j45124K3393J66307l808
7749A70436Q882O86p3658o4647N2028m6458j33325k01953M1235J48772J04136
7738F134j04761m6423J4927P7324J5371p6868P1632o1030j63585q3078J54835
7727a95522J79701L4534Q1734j04352j26023r4265o1813n5302K2032q214p071
7716c34561n0281J49391J86073J16429m8205l5877k0381K31833J0880J5072j00374
7705A19999J32879n818j12608j47045M3715J3771j3588J1719j1874M0126J40849
7694B12125N6208k94346k709P8112J27267o2257p7896k13627m2164J36350N5035
7683b7902r4134P6211K70166M7169j14320K0355j38942k26412M126O5634O5401
$$ plain form
7760 123604 129062 17681 -79954 -6815 153006 274733 129668 -15456 7937 174244 170436
7749 170436 179318 180004 106346 41699 93727 47269 -86056 -288009 -246774 -98002 6134
7738 6134 -98627 -145050 -130123 -52799 -37428 -114296 -42664 -103694 -267279 -350357 -195522
7727 -195522 -15821 18713 100447 -3905 -129928 -224193 -286006 -341308 -319276 -327490 -334561
7716 -334561 -384842 -235451 -49378 67051 18846 -17031 -37412 194421 205301 220373 119999
7705 119999 252878 247060 134452 -12593 31122 44893 31305 43024 31150 71276 212125
7694 212125 268333 -26013 -28722 49390 176657 114400 36504 -177123 -219287 -82937 -27902
7683 -27902 -122036 -45825 224341 271510 157190 177545 38603 -187809 -183683 -118049 -52648
7672e2648P2932o4847j10355J8241n3505O2098P3611J140q9389K2351K0562m8353
7660a48162k82152k0833K96428J90185J33232n2881j30529j40203K0913J46751
7650A2749N5243n7724j52852O2422J25049m085K2830j208K8815j6487j76538J6649
7638h5137J14955m2610j11705j69131J81759K38016j73605J15418K0822j40899
7628e2117j721q7986o0589j4738J03727J44055J9474M9924p126j97216p5577K48332
7616F8442J19926j11048j25507L762J14879n3614r4189N8572o8552j73849J36764
7605a24414K03042j1535j3125j45141O2271k9104p4459j12207p9846O6755Q1537
7594a76226q042k0125P1580k6353J01577J53633j9667M1589K9414o0028Q6414
$$ plain form
7672 -52648 20284 -44563 -154918 -136677 -190182 -128084 -54473 -53333 -142722 -120371 -99809 -148162
7660 -148162 -430314 -451147 -154719 35466 168698 115817 -14712 -154915 -134002 12749
7650 12749 67992 10268 -142584 -80162 44887 40802 63632 62424 91239 74752 -101786 -85137
7638 -85137 29818 -12792 -124497 -293628 -111869 126147 -47458 67960 88782 -52117
7628 -52117 -53838 -141824 -202413 -217151 -113424 30631 50105 100029 92903 -104313 -179890 68442
7616 68442 188368 77320 -48187 -44425 70454 16840 -77349 -18777 -87329 -261178 -124414
7605 -124414 78628 67093 53968 -91173 -28902 -58006 -132465 -244672 -324518 -257763 -176226
7594 -176226 -184268 -204393 -132813 -159166 -57589 96044 76377 117966 147380 87352 173766
7583A73766O2383O60o2159q0322k2317J0663J03988J48436p3892l1875n5178o4801
7571A09352J9939n9406k1452J36134j76064j08877l5167J76396l409j12472m1559
$$ plain form
7583 173766 236149 236809 174650 94328 72011 82674 186662 335098 261206 229331 174153 109352
7571 109352 129291 69885 48433 184567 8503 -100374 -135541 40855 37446 -75026 -116585
$$ [...]
##END NTUPLES=NMR SPECTRUM
##END=
