##TITLE=Analysis number 326362
Compound Code mo 00686
Book Reference 510/26
Project Code adrs
Chemist Name jimp
##JCAMPDX= 6.0         $$ Bruker NMR JCAMP-DX V2.0
##DATA TYPE= NMR SPECTRUM
##DATA CLASS= NTUPLES
##ORIGIN= Bruker BioSpin GmbH
##OWNER= nmr
$$ XWIN-NMR		Version 3.5
$$ Mon Feb  5 12:22:55 2007 GMT Standard Time (UT+0h)  MAYBRIDGE\nmr@NMR_250MHZ
##.OBSERVE FREQUENCY= 250.131544655141
##.OBSERVE NUCLEUS= ^1H
##.ACQUISITION MODE= SIMULTANEOUS (DQD)
##.ACQUISITION SCHEME= undefined
##.AVERAGES= 16
##.DIGITISER RES= 18
##SPECTROMETER/DATA SYSTEM= dpx250
##.PULSE SEQUENCE= zg30
##.SOLVENT NAME= CDCl3
##.SHIFT REFERENCE= (INTERNAL, CDCl3, 0, 16.522)
##AUDIT TRAIL= $$ (NUMBER, WHEN, WHO, WHERE, WHAT)
$$ ##TITLE= Audit trail, XWIN-NMR		Version 3.5
$$ ##JCAMPDX= 5.01
$$ ##ORIGIN= Bruker BioSpin GmbH
$$ ##OWNER= nmr
$$ C:\u/data/dgb/nmr/ADRS/300/pdata/1/auditp.txt
$$ ##AUDIT TRAIL=  $$ (NUMBER, WHEN, WHO, WHERE, WHAT)
(   1,<2007-02-05 12:22:30.49 +000>,<MAYBRIDGE\nmr>,<NMR_250MHZ>,
      <created by zg, POWCHK disabled, PULCHK disabled
       configuration hash MD5:
       49 4B E0 1D 92 C2 6B 37 9F E6 65 BC 52 41 86 1D
       data hash MD5: 64K
       1E 4B E7 5B 1C 60 6E A8 96 B3 62 B6 D2 F0 BE 7E>)
(   2,<2007-02-05 12:22:43.94 +000>,<MAYBRIDGE\nmr>,<NMR_250MHZ>,
      <Start of raw data processing
       ef LB = 0.3 FT_mod = 6 PKNL = 1 SI = 32K 
       data hash MD5: 32K
       24 61 83 CD 56 DB CD 26 6F B7 A9 CF 18 3E 1F 30>)
(   3,<2007-02-05 12:22:46.10 +000>,<MAYBRIDGE\nmr>,<NMR_250MHZ>,
      <apk 
       data hash MD5: 32K
       BD 9E 39 5A D0 50 44 F0 79 6A 8E 14 BC F8 24 B3>)
(   4,<2007-02-05 12:22:46.97 +000>,<MAYBRIDGE\nmr>,<NMR_250MHZ>,
      <abs ABSG = 5 
       data hash MD5: 32K
       D4 0E 8D A5 44 F7 59 49 1E 5F 1D 4F 81 5E 90 C2>)
$$ ##END=
$$ 
$$ hash MD5
$$ CD 0D E8 30 65 43 7D 44 4E 82 6D 16 90 57 2A 13
##$RELAX= 
##$RELAX= 
##$RELAX= 
##$RELAX= 
##$RELAX= 
##$RELAX= 
##$RELAX= 
$$ Bruker specific parameters
$$ --------------------------
##$DU= <C:\u>
##$EXPNO= 300
##$NAME= <ADRS>
##$PROCNO= 1
##$TYPE= <nmr>
##$USER= <dgb>
##$AMP= (0..31)
100 100 100 100 100 100 100 100 100 100 100 100 100 100 100 100 100 100 
100 100 100 100 100 100 100 100 100 100 100 100 100 100 
##$AQSEQ= 0
##$AQ_mod= 3
##$AUNM= <au_zg>
##$AUTOPOS= <41 >
##$BF1= 250.13
##$BF2= 250.13
##$BF3= 250.13
##$BF4= 250.13
##$BF5= 500.13
##$BF6= 500.13
##$BF7= 500.13
##$BF8= 500.13
##$BYTORDA= 1
##$CFDGTYP= 0
##$CFRGTYP= 5
##$CHEMSTR= <none>
##$CNST= (0..31)
1 1 145 1 1 1 1 1 1 1 1 1 1 1 1 1 1 1 1 1 1 1 1 1 1 1 1 1 1 1 1 1 
##$CPDPRG= <>
##$CPDPRG1= <>
##$CPDPRG2= <>
##$CPDPRG3= <>
##$CPDPRG4= <mlev>
##$CPDPRG5= <mlev>
##$CPDPRG6= <mlev>
##$CPDPRG7= <mlev>
##$CPDPRG8= <mlev>
##$CPDPRGB= <>
##$CPDPRGT= <>
##$D= (0..31)
0 1 0 0 0 0 0 0 0 0.06 0 0 0 0 0 0 0.0002 0 0 0 0 0 0 0 0 0 0 0 0 0 0 
0 
##$DATE= 1170678149
##$DBL= (0..7)
120 120 120 120 120 120 120 120 
##$DBP= (0..7)
150 150 150 150 150 150 150 150 
##$DBP07= 0
##$DBPNAM0= <>
##$DBPNAM1= <>
$$ [...]
##$SUBNAM7= <"">
##$SUBNAM8= <"">
##$SUBNAM9= <"">
##$SW= 20.6930455092707
##$SWIBOX= (0..15)
0 0 3 0 0 0 0 0 0 0 0 0 0 0 0 0 
##$SW_h= 5175.983436853
##$TD= 65536
##$TD0= 1
##$TE= 294.16
##$TE2= 300
##$TE3= 300
##$TEG= 300
##$TL= (0..7)
0 120 120 120 120 120 120 120 
##$TP= (0..7)
150 150 150 150 150 150 150 150 
##$TP07= 0
##$TPNAME0= <>
##$TPNAME1= <>
##$TPNAME2= <>
##$TPNAME3= <>
##$TPNAME4= <>
##$TPNAME5= <>
##$TPNAME6= <>
##$TPNAME7= <>
##$TPOAL= (0..7)
0.5 0.5 0.5 0.5 0.5 0.5 0.5 0.5 
##$TPOFFS= (0..7)
0 0 0 0 0 0 0 0 
##$TUNHIN= 0
##$TUNHOUT= 0
##$TUNXOUT= 0
##$USERA1= <user>
##$USERA2= <user>
##$USERA3= <user>
##$USERA4= <user>
##$USERA5= <user>
##$V9= 5
##$VALIST= <valist>
##$VCLIST= <CCCCCCCCCCCCCCC>
##$VD= 0
##$VDLIST= <DDDDDDDDDDDDDDD>
##$VPLIST= <PPPPPPPPPPPPPPP>
##$VTLIST= <TTTTTTTTTTTTTTT>
##$WBST= 1024
##$WBSW= 4
##$XGAIN= (0..3)
0 0 0 0 
##$XL= 0
##$YL= 0
##$YMAX_a= 433840
##$YMIN_a= -339693
##$ZGOPTNS= <>
##$ZL1= 120
##$ZL2= 120
##$ZL3= 120
##$ZL4= 120
##$ABSF1= 16.522
##$ABSF2= -4.171173
##$ABSG= 5
##$ABSL= 3
##$ALPHA= 0
##$AQORDER= 0
##$ASSFAC= 0
##$ASSFACI= 0
##$ASSFACX= 0
##$ASSWID= 0
##$AUNMP= <proc_1d>
##$AZFE= 0.1
##$AZFW= 0.1
##$BCFW= 0
##$BC_mod= 0
##$BYTORDP= 0
##$COROFFS= 0
##$CY= 12.5
##$DATMOD= 1
##$DC= 0
##$DFILT= <>
##$DTYPP= 0
##$F1P= 14.0000005364418
##$F2P= -0.99999901652339
##$FCOR= 0.5
##$FTSIZE= 32768
##$FT_mod= 6
##$GAMMA= 0
##$GB= 0
##$INTBC= 1
##$INTSCL= 1
##$ISEN= 128
##$LB= 0.3
##$LEV0= 0
##$LPBIN= 0
##$MAXI= 10000
##$MC2= 0
##$MEAN= 0
##$ME_mod= 0
##$MI= 0
##$NCOEF= 0
##$NC_proc= -2
##$NLEV= 6
##$NOISF1= 0
##$NOISF2= 0
##$NSP= 0
##$NTH_PI= 0
##$NZP= 0
##$OFFSET= 16.522
##$PC= 1
##$PHC0= 83.91543
##$PHC1= -1.844118
##$PH_mod= 1
##$PKNL= yes
##$PPARMOD= 0
##$PSCAL= 4
##$PSIGN= 0
##$REVERSE= no
##$SF= 250.13
##$SI= 32768
##$SIGF1= 0
##$SIGF2= 0
##$SINO= 400
##$SIOLD= 32768
##$SREGLST= <1H.CDCl3>
##$SSB= 0
##$STSI= 32768
##$STSR= 0
##$SW_p= 5175.98343685301
##$SYMM= 0
##$S_DEV= 0
##$TDeff= 65536
##$TDoff= 0
##$TI= <Analysis number 999999
Compound Code 99
Book Reference 9
Project Code 9>
##$TILT= no
##$TM1= 0
##$TM2= 0
##$TOPLEV= 0
##$USERP1= <user>
##$USERP2= <user>
##$USERP3= <user>
##$USERP4= <user>
##$USERP5= <user>
##$WDW= 1
##$XDIM= 32768
##$YMAX_p= 276973935
##$YMIN_p= -13639
$$ End of Bruker specific parameters
$$ ---------------------------------
##NTUPLES= NMR SPECTRUM
##VAR_NAME=  FREQUENCY,     SPECTRUM/REAL,   SPECTRUM/IMAG
##SYMBOL=    X,             R,               I
##VAR_TYPE=  INDEPENDENT,   DEPENDENT,       DEPENDENT
##VAR_FORM=  AFFN,          ASDF,            ASDF
##VAR_DIM=   32768,         32768,           32768
##UNITS=     HZ,            ARBITRARY UNITS, ARBITRARY UNITS
##FACTOR=    0.157963299565203, 1,           1
##FIRST=     4132.6476996994, 0,             0
##LAST=      -1043.33573715361, 0,           0
##MIN=       -1043.33573715361, -13639,      0
##MAX=       4132.6476996994, 276973935,     0
$$ Real data points
##PAGE= N=1
##DATA TABLE= (X++(R..R)), XYDATA
$$ [...]
$$ plain form
16995 -910 1868 4304 2775 -127 -1981 -2892 2276 4214 4470 5904 7816 7143 6898 4076 319 -2936
16979 -2936 -2129 -4004 -1560 -936 -1935 -4585 -6619 -7820 -4735 -1815 -4794 -3739 -2901 -1142 953 -1307
16963 -1307 -499 -80 1914 867 -657 -2386 -2531 -1684 -2810 -6512 -8887 -4688 -1620 2607 4498 4776
16947 4776 3187 1062 1012 -2508 -4480 -1465 3000 3178 212 -2880 -5321 -3814 -623 865 -2674
16932 -2674 -6543 -5618 -7649 -4277 -3365 -5370 -5491 -4161 -3423 -2282 -4991 -4169 1155 4407 827 -514
16916 -514 -4343 -2065 -2266 -832 -749 382 884 1907 -2115 -822 930 2007 1535 819 -846 507
16900 507 -864 971 5105 4373 796 869 -649 -5785 -7661 -5685 -3847 -2694 605 1474 1804 3087
16884 3087 5150 3310 909 -3501 -5644 -6889 -5912 -5609 -961 2401 -2911 -7472 -5852 -4727 -3191
$$ packed form
16995i10K778K436j529k902j854r11N168J938K56J434J912o73k45k822l757l255
16979b936Q07j875K444O24r99k650k034j201L085K920k979J055Q38J759K095k260
16963a307Q08M19J994j047j524j729j45Q47j126l702k375M199L068M227J891K78
16947D776j589k125n0l520j972L015M465J78k966l092k441J507L191J488l539
16932b674l869R25k031L372R12k005j21J330P38J141k709Q22N324L252l580j341
16916e14l829K278k01J434Q3J131N02J023m022J293J752J077m72p16j665J353
16900E07j371J835M134p32l577P3j518n136j876J976J838J153L299Q69L30J283
16884C087K063j840k401m410k143j245R77L03M648L362n312m561J620J125J536
$$ plain form
16869 -3191 2414 4403 3952 1048 -1138 -1936 -255 -91 -279 1570 2140 3182 225 -2527 -2699 -4288
16853 -4288 -3898 -2152 -3444 -6108 -6328 -3168 -1453 -1657 -3343 -2292 -107 -995 41 661 -164 -5571
16837 -5571 -10508 -7391 -1767 1214 1731 1160 1918 -1229 -4759 -3445 -2306 -1215 1381 -559 -737 618
16821 618 2002 958 751 2334 2866 -387 119 1522 532 -40 759 2645 3309 1364 -654 192 311
16804 311 1061 1039 -448 -654 -1168 -2470 -3794 -4560 -5313 -2300 -2572 -1603 -86 207 1276 -730 424
16787 424 2511 2736 2456 4283 3376 1563 180 -1 748 1021 -1025 -4868 -6194 -6464 -5661 -3537 -1897
16770 -1897 -1312 -1558 -386 -717 -542 -775 540 -181 -2207 -2859 -2016 -876 -525 -2026 -3230 -2958 -1436
16753 -1436 322 1383 -2440 -2708 -2436 -3323 -1259 -388 2706 5592 1518 -559 -1711 1210 2172 6549
$$ packed form
16869c191N605J989m51k904k186p98J681J64j88J849N70J042k957k752j72j589
16853d288L90J746j292k664k20L160J715k04j686J051K185q88J036O20q25n407
16837e571m937L117N624K981N17n71P58l147l530J314J139J091K596j940j78J355
16821F18J384j044k07J583N32l253N06J403r90n72P99J886O64j945k018Q46J19
16804C11P50k2j487k06n14j302j324p66p53L013k72R69J517K93J069k006J154
16787D24K087K25k80J827r07j813j383j81P49K73k046l843j326k70Q03K124J640
16770a897N85k46J172l31J75k33J315p21k026o52Q43J140L51j501j204K72J522
16753a436J758J061l823k68K72q87K064Q71L094K886m074k077j152K921R62M377
$$ plain form
16737 6549 7912 6389 3185 -1053 -2115 -3115 -4712 -2145 90 2043 2958 -11 -4046 -2246 -707
16722 -707 -1553 -2247 1405 -999 -2729 -2440 -416 -1666 223 196 -2231 -5970 -4831 -1565 267 692
16706 692 1471 2467 976 -497 -673 1632 1277 -55 -4434 -3534 -3006 -5062 -6678 -3025 -1485 -2047 -4183
16689 -4183 -4386 -3581 -1191 -4585 -1186 1616 2026 4868 5613 7959 6408 4489 416 -1459 -526 -3257
16673 -3257 -5196 -4246 -1907 -4707 -5048 -3818 -3550 -6279 -8794 -6181 -3993 248 -1153 -2367 -518
16658 -518 682 -181 -894 -1338 -2183 -1131 3193 5526 840 -3003 -2997 -4875 -4523 -3299 -2906 -1584 -3010
16641 -3010 -4600 -2515 -2628 -6283 -7401 -6834 -6425 -4119 -1486 -1150 -2198 -3666 -4874 -4393 -863 -241
16625 -241 -4107 -8557 -7521 -5124 -3209 -344 28 -3706 -2949 981 3499 3195 763 912 -1280 -3916
$$ packed form
16737F549J363j523l204m238j062j000j597K567K235J953R15k969m035J800J539
16722g07q46o94L652k404j730K89K024j250J889k7k427l739J139L266J832M25
16706F92P79R96j491j473j76K305l55j332m379R00N28k056j616L653J540n62k136
16689d183k03Q05K390l394L399K802M10K842P45K346j551j919m073j875R33k731
16673c257j939R50K339k800l41J230K68k729k515K613K188M241j401j214J849
16658e18J200q63p13m44q45J052M324K333m686l843Oj878L52J224L93J322j426
16641c010j590K085j13l655j118N67M09K306K633L36j048j468j208M81L530O22
16625b41l866m450J036K397J915K865L72l734P57L930K518l04k432J49k192k636
$$ plain form
16609 -3916 -2373 -1445 -3167 -3304 -1547 -2845 -3546 -6527 -6109 746 -311 -2199 -2225 -1595 -3784 -7764
16593 -7764 -4696 965 3697 3797 3324 -192 -1371 302 411 -2867 -2412 -1081 -2142 -666 -81 650
16577 650 1336 46 -3395 -6560 -5871 -2919 -838 -1020 353 -271 -788 -202 333 -642 -114 -522 -3811
16560 -3811 -3588 -3863 -3963 -1763 -1614 -4065 -4341 -4269 -245 2534 2300 1036 2070 3564 4097 4101 6836 4396
16542 4396 226 -404 214 385 -3726 -6153 -4765 -2076 -1942 -2527 -6114 -4970 -3789 -4238 -5623 -2496
16526 -2496 -1706 587 2670 2907 2799 -669 -2192 -2278 -1681 4317 6954 3185 -810 -2192 605 2630
16510 2630 1345 458 1728 2791 1611 3710 5123 8952 6707 3221 686 -456 -3639 -7422 -6090
16495 -6090 -3203 -3026 -2401 -3252 -4061 -2941 349 968 736 -1367 -3379 -4624 -939 1954 1905 -1372 -2412
$$ packed form
16609c916J543R28j722j37J757j298p01k981M18O855j057j888k6O30k189l980
16593g764L068N661K732J00m73l516j179J673J09l278M55J331j061J476N85P31
16577F50O86j290l441l165O89K952K081j82J373o24n17N86N35r75N28m08l289
16560c811K23k75j00K200J49k451k76P2M024K779k34j264J034J494N33MK735k440
16542D396m170o30O18J71m111k427J388K689J34n85l587J144J181m49j385L127
16526b496P90K293K083K37j08l468j523q6N97N998K637l769l995j382K797K025
16510B630j285q87J270J063j180K099J413L829k245l486k535j142l183l783J332
16495f090K887J77O25q51q09J120L290O19k32k103k012j245L685K893m9l277j040
$$ plain form
16478 -2412 -4520 -6009 -5144 -4282 -2572 -119 3048 -267 -4351 -7342 -4825 -4687 -433 -732 97 -1179
16462 -1179 -616 2340 6530 3412 -1554 -2404 -1943 -3491 -4700 -4930 -3987 -4688 -7352 -7405 -6684 -5359 -4386
16445 -4386 -2745 -3597 -5911 -7176 -6392 -4038 -2304 -1484 -1446 -2873 -2032 -881 -2316 -4505 -3944 -2305
16429 -2305 -3263 -857 -2782 -7801 -6061 -3454 -872 -3592 -2668 -707 932 1877 501 -146 2189 -1102
16413 -1102 -1517 -723 828 1369 2274 1505 896 -2017 -2004 -5206 -5489 -1261 241 1984 1508 2328 3115 2535
16395 2535 -1840 -5176 -6102 -5808 -4791 -3614 -7196 -8010 -8180 -5357 -5809 -5727 -5557 -6685 -9434 -6005 -2761
16378 -2761 -3980 -4614 -4772 -4800 -6000 -5245 -3943 -4558 -3486 -1818 -2822 -1832 -853 1751 3092 2231 1001
16361 1001 719 185 -4752 -3109 691 33 -1963 -2824 -5343 -6731 -6233 -5208 -5912 -4965 -4578 -3426 -5490
$$ packed form
16478b412k108j489Q65Q62J710K453L167l315m084k991K517J38M254k99Q29j276
16462a179N63K956M190l118m966q50M61j548j209k30R43p01k664n3P21J325R73
16445d386J641q52k314j265P84K354J734Q20L8j427Q41J151j435k189N61J639
16429b305r58K406j925n019J740K607K582k720R24J961J639R45j376o47K335l291
16413a102m15P94J551N41R05p69o09k913J3l202k83M228J502J743m76Q20P87n80
16395B535m375l336r26K94J017J177l582q14j70K823m52Q2J70j128k749L429L244
16378b761j219o34j58k8j200P55J302o15J072J668j004R90R79K604J341q61j230
16361A001k82n34m937J643L800o58j996q61k519j388M98J025p04R47L87J152k064
$$ plain form
16344 -5490 -8183 -7173 -6651 -1349 904 -2800 -4002 -3289 -3618 -3318 -4156 -3596 -2481 -1178 -1849 -183
16328 -183 816 -203 -3211 -5028 -4913 -517 987 2196 144 -2864 -4520 -3390 -4265 -5052 -3314 -2907
16312 -2907 -1641 -2406 -1280 -3681 -4783 -4084 -1863 -1884 -5013 -5713 -3498 -221 123 -3364 -5120 -4162
16296 -4162 -1690 1771 879 3063 2814 1183 -2820 -2115 -462 -134 1796 272 -1131 -1303 -878 -3751
16280 -3751 -4650 -3162 -3522 -2353 -1265 -1211 1497 758 -1504 -1691 1410 775 -3303 -5511 -5085 -6532 -3778
16263 -3778 382 620 -4291 -5850 -5422 -5011 -4415 -5531 -3319 -3135 -5261 -2858 -2665 -3919 -6041 -4398
16247 -4398 -3742 -3542 -7385 -5906 -8012 -5928 -4584 -2230 -1807 -4741 -4848 -2313 -2795 -3664 -4390 -2442
16231 -2442 -1110 -1828 -1093 -2303 -2465 -971 -1653 -1011 -4911 -5046 -1853 221 3134 3387 3120 3526 3327
$$ packed form
16344e490k693J010N22N302K253l704j202P13l29L00q38N60J115J303o71J666
16328a83R99j019l008j817J15M396J504J209k052l008j656J130q75p87J738M07
16312b907J266p65J126k401j102O99K221k1l129p00K215L277L44l487j756R58
16296d162K472L461q92K184k49j631m003P05J653L28J930j524j403j72M25k873
16280c751q99J488l60J169J088N4K708p39k262j87L101o35m078k208M26j447K754
16263c778M160K38m911j559M28M11N96j116K212J84k126K403J93j254k122J643
16247d398O56K00l843J479k106K084J344K354M23k934j07K535m82q69p26J948
16231b442J332p18P35j210j62J494o82O42l900j35L193K074K913K53k67M06j99
$$ plain form
16214 3327 3151 196 -719 283 4437 3299 -817 -2953 -2605 -2205 -1989 713 1933 4058 1610 -1403
16198 -1403 -1024 -1634 -1634 153 1088 1063 -1251 -3601 -1182 1215 -2194 2164 4855 2205 -835 -1022 1985
16181 1985 -905 -767 -260 1168 1647 818 -950 182 826 -496 1491 -175 268 2834 1682 -1288
16165 -1288 -4143 -3999 -3383 -3229 -768 -928 933 1223 -156 2665 2655 -177 -2217 -5586 -3509 2257
16149 2257 5851 2955 191 -1218 1428 261 -1902 -2868 -2552 432 966 1501 1418 -1193 1575 5832
16133 5832 5287 2690 -23 -336 -2386 -1409 922 -770 380 2571 364 -2969 -3170 -5306 -8380 -7539
16117 -7539 -6101 -5719 -6881 -4661 245 1493 -2284 -2806 -2984 -2113 -652 404 2930 1090 -4680 -5113
16101 -5113 -3861 -3587 -2018 -1981 -4196 -6164 -5067 -3370 -5082 -4176 -2731 -4245 -5918 -3348 -2242 1878
$$ packed form
16214C327j76k955r15J002M154j138m116k136L48M00K16K702J220K125k448l013
16198a403L79o10%J787R35k5k314k350K419K397l409M358K691k650l040j87L007
16181A985k890J38N07J428M79q29j768J132O44j322J987j666M43K566j152k970
16165a288k855J44O16J54K461j60J861K90j379K821j0k832k040l369K077N766
16149B257L594k896k764j409K646j167k163r66L16K984N34N35q3k611K768M257
16133E832n45k597k713l13k050R77K331j692J150K191k207l333k01k136l074Q41
16117g539J438L82j162K220M906J248l777n22j78Q71J461J056K526j840n770m33
16101e113J252K74J569L7k215j968J097J697j712R06J445j514j673K570J106M120
$$ plain form
16085 1878 2733 2717 3558 2270 -1083 1850 4361 2999 3400 7798 7867 3155 2106 756 -1446 -2705
16069 -2705 -578 2826 1636 1433 2326 1282 -2535 -3945 -974 363 -3428 -7904 -8196 -8405 -6726 -3157
16053 -3157 -1058 -2333 -3519 -4745 -4476 -342 1516 3605 2548 493 -690 1742 3233 2116 1596
16038 1596 2868 1662 -1377 89 -1155 -1574 652 2027 3808 668 -3702 -6620 -3023 -1854 -1252
16023 -1252 -1416 -60 -675 -5090 -2319 2208 1016 -556 -1704 -4508 -6309 -6000 -5536 -4727 -5342 -1167
16007 -1167 -1198 -357 1718 -848 940 4436 3453 2006 -804 23 -60 -3554 -5771 -5188 -3642 -1843 -217
15990 -217 -3216 -2192 2434 5356 5642 1684 -270 721 3400 2189 -1559 -2764 -4257 -6060 -3014
15975 -3014 -1936 -2038 1432 3737 1854 -2650 -3362 -1357 -1251 -3189 -3992 -2889 -2053 -5370 -8433 -6768
$$ packed form
16085A878Q55j6Q41j288l353K933K511j362M01M398O9m712j049j350k202j259
16069b705K127L404j190k03Q93j044l817j410K971J337l791m476k92k09J679L569
16053c157K099j275j186j226K69M134J858K089j057k055j183K432J491j117n20
16038A596J272j206l039J466j244m19K226J375J781l140m370k918L597J169O02
16023a252j64J356o15m415K771M527j192j572j148k804j801L09M64Q09o15M175
16007a167l1Q41K075k566J788L496r83j447k810Q27q3l494k217N83J546J799J626
15990b17k999J024M626K922K86l958j954R91K679j211l748j205j493j803L046
15975c014J078j02L470K305j883m504p12K005J06j938q03J103Q36l317l063J665
$$ plain form
15959 -6768 -2770 2155 1186 -1905 -5141 -4196 -2339 467 783 318 380 2537 1593 1052 887 -1974 -1040
15942 -1040 2049 4466 2661 4263 6149 218 -3786 -3425 -241 653 161 -2808 -3539 -4072 -3168 -4352
15926 -4352 -5296 -3095 -1339 -1081 -356 3741 6543 5085 1762 508 900 -2193 -3748 -2227 -1920 -1114
15910 -1114 -21 856 -1867 -5987 -10794 -7926 -3290 -3293 -2680 264 3361 3466 460 -818 742 901
15894 901 1129 2763 3709 5315 798 -3882 -5948 -6535 -5237 -5930 -4692 -6007 -4729 -3745 -2084 -4515
15878 -4515 -2113 -357 -789 -1193 2150 2195 1360 347 308 -1780 -4599 -1091 4386 4374 282 -3683 -5679
15861 -5679 -4971 -3604 -4780 -4646 -1889 2204 1380 -476 1143 971 1175 3525 -1890 -1624 3797 5261
15845 5261 4091 42 536 -675 -1866 -5214 -8439 -5812 -4546 -3497 1256 2057 1403 3668 3505 171
$$ packed form
15959f768L998M925r69l091l236R45J857K806L16m65O2K157r44n41j65k861R34
15942a040L089K417j805J602J886n931m004L61L184Q94m92k969p31n33R04j184
15926d352r44K201J756K58P25M097K802j458l323j254L92l093j555J521L07Q06
15910a114J093Q77k723m120m807K868M636lO13K944L097J05l006j278J560J59
15894I01K28J634R46J606m517m680k066n87J298o93J238j315J278R84J661k431
15878d515K402J756m32m04L343M5q35j013l9k088k819L508N477j2m092l965j996
15861e679P08J367j176J34K757M093q24j856J619j72K04K350n415K66N421J464
15845E261j170m049M94j211j191l348l225K627J266J049M753Q01o54K265j63l334
$$ plain form
15829 171 1009 3455 1837 513 -464 -835 -3215 -3752 1134 2898 -507 -273 1030 1838 680 -3088
15813 -3088 -1068 1102 357 2992 5046 4450 6383 2399 472 326 -1243 -36 -5577 -5836 -544 -2363
15797 -2363 -3893 -4227 -4553 -393 728 381 -1363 -3423 -7675 -8826 -6249 -4976 -4091 -2177 -4074 -4939
15781 -4939 -2998 -2185 -442 1009 3569 440 -2676 -5559 -3791 -712 -1361 -4982 -3692 -4901 -3884
15766 -3884 -1282 -45 -2454 -3187 -1800 765 2359 632 113 300 1899 1906 -900 343 231 -5095
15750 -5095 -5542 -4838 -3934 -2244 -1874 -3941 -6512 -7182 -6095 -5922 -6759 -7169 -5290 -2132 642 2004 -1016
15733 -1016 -2746 -1704 -710 689 1455 918 1731 -1926 -4182 -4535 -5917 -3686 -3352 -1695 1186 -2490
15717 -2490 -5852 -5657 -5067 -7022 -8963 -6272 -3014 -7 1569 3654 -269 -3526 833 -347 -1741
$$ packed form
15829A71Q38K446j618j324r77l71k380n37M886J764l405K34J303Q08j158l768
15813c088K020K170p45K635K054n96J933l984j927j46j569J207n541k59N292j819
15797b363j530l34l26M160J121l47j744k060m252j151K577J273Q85J914j897q65
15781d939J941Q13J743J451K560l129l116k883J768L079o49l621J290j209J017
15766c884K602J237k409p33J387K565J594j727n19J87J599Pk806J243j12n326
15750e095m47P04R04J690L70k067k571o70J087J73q37m10J879L158K774J362l020
15733a016j730J042R94J399P66n37Q13l657k256l53j382K231L34J657K881l676
15717b490l362J95N90j955j941K691L258L007J576K085l923l257M359j180j394
$$ plain form
15702 -1741 191 1295 2771 5421 2701 -640 -923 2432 3789 3242 4474 2944 3641 3710 2857 2539
15686 2539 -1662 -3950 -2454 -2953 -1882 -2879 -3263 -1644 -2107 -5576 -6335 -5595 -5218 -4197 -3301 -4927 -5345
15669 -5345 -3442 -2622 -2124 -2356 -4594 -5505 -4837 -1479 -376 -2502 -4661 -8529 -8374 -4323 -4835 -4607 -8029
15652 -8029 -5751 -3338 -2224 -3521 -2001 -840 -1106 -3454 -5549 -4284 -3819 -2788 -3630 -4471 -1422 -2679
15636 -2679 -2422 1994 5441 -1066 -1727 -1423 -1069 -3827 -6647 -6676 -4829 -5234 -3039 -1174 -3451 -3863 482
15619 482 917 370 -702 -2646 -2414 -2417 -255 -3628 -8250 -6220 -2689 -714 -4516 -8110 -5690 -6944
15603 -6944 -8479 -7561 -2675 88 356 778 528 -918 2418 2626 -739 -391 784 -3216 -2968 -2265 -2378
15586 -2378 42 -1579 -2235 -1402 2717 2998 2694 4374 1663 -6027 -9889 -9113 -2878 3155 -162 -1583
$$ packed form
15702a741J932J104J476K650k720l341k83L355J357n47J232j530O97O9q53l18
15686B539m201k288J496m99J071r97l84J619m63l469p59P40L77J021Q96j626m18
15669e345J903Q20M98k32k238r11O68L358J103k126k159l868J55M051n12K28l422
15652h029K278K413J114j297J520J161k66k348k095J265M65J031q42q41L049j257
15636b679K57M416L447o507o61L04L54k758k820k9J847m05K195J865k277m12M345
15619D82M35n47j072j944K32lK162l373m622K030L531J975l802l594K420j254
15603f944j535R18M886K763K68M22k50j446L336K08l365L48J175m000K48P03j13
15586b378K420j621o56Q33M119K81l04J680k711p690l862P76O235O033l317j421
$$ plain form
15570 -1583 -1593 -2923 -6628 -7121 -6854 -8539 -6183 -7789 -7602 -7507 -8820 -6129 -3577 -934 127 1168
15554 1168 1392 1589 -1866 -5209 -5097 -6285 -3710 -636 225 -909 -2935 -2959 -293 852 -2508 -1696
15538 -1696 -4313 -5116 -4832 -4383 -3538 -980 -5554 -5056 -5099 -7307 -5644 -2730 -350 -2269 -2955 -5287 -4728
15521 -4728 -3476 -2596 -2465 -3651 -2776 -3825 -3402 -3750 493 3521 4277 1385 1854 3318 2294 1691 774
15504 774 -3059 -5607 -1108 1329 1622 -1379 -1727 -1040 -1821 -1673 -1048 2195 2219 -1321 -3089 974 2748
15487 2748 393 -1597 -2083 -3238 -1664 -3541 -7730 -10524 -9781 -6510 -7144 -6566 -5378 -5891 -7641 -7203
15471 -7203 -6677 -6149 -3547 -4468 -6991 -7151 -5197 -3350 -1668 -3425 -2805 -2235 745 143 -424 4117 6251
15454 6251 2852 1998 978 544 -652 340 731 -2384 -4421 -1949 -2270 -1398 -1247 -2779 -3284 -4061 -1145
$$ packed form
15570a583j0j330l705m93K67j685K356j606J87R5j313K691K552K643J061J041
15554A168K24J97l455l343J12j188K575L074Q61j134k026k4K666J145l360Q12
15538a696k617q03K84M49Q45K558m574M98m3k208J663K914K380j919o86k332N59
15521d728J252Q80J31j186Q75j049M23l48M243L028P56k892M69J464j024o03r17
15504G74l833k548M499K437K93l001l48O87p81J48O25L243K4l540j768M063J774
15487B748k355j990m86j155J574j877m189k794P43L271o34N78J188n13j750M38
15471g203N26N28K602r21k523j60J954J847J682j757O20N70K980o02n67M541K134
15454F251l399q54j020m34j196R92L91l115k037K472l21Q72J51j532n05p77K916
$$ plain form
15437 -1145 2382 3991 2610 2491 1715 2778 4299 4144 3935 6301 5777 2867 2409 3402 5330 4715 1630
15420 1630 1475 406 3320 6654 4518 -1410 -2398 -3115 -1596 -1894 -3099 -1821 326 -397 1331 2402
15404 2402 3110 3317 1153 1923 1036 1206 2120 1552 -11 497 1502 1517 -246 1563 3049 3526 6277
15387 6277 3843 -3030 -8183 -7239 -3325 -1890 -1170 -5753 -7817 -5678 -4799 -5230 -3682 -1613 -1610 -3725
15371 -3725 -5142 -5245 -3070 -2162 975 -609 -1490 -1788 -3710 -3466 -3793 -4143 -4534 -5887 -5844 -4233 287
15354 287 1552 73 -1429 -4309 -4595 -4670 -2048 -500 186 145 4688 5441 3167 1039 3714 3218 -1061
15337 -1061 -466 -185 -900 -5532 -4832 -1758 -1983 -1256 -8 -630 -3433 -2351 -1437 -657 -1199 -19 -270
15320 -270 -1219 -1243 -1680 -446 2300 1760 1208 1699 1112 -2129 -4595 -7115 -7364 -1374 2519 2262 -364
$$ packed form
15437a145L527J609j381j19p76J063J521j55k09K366n24k910m58R93J928o15l085
15420A630j55j069K914L334k136n928r88p17J519k98j205J278K147p23J728J071
15404B402P08K07k164P70q87J70R14n68j563N08J005J5j763J809J486M77K751
15387F277k434o873n153R44L914J435P20m583k064K139Q79m31J548K069Lk115
15371c725j417j03K175R08L137j584q81k98j922K44l27l50l91j353M3J611M520
15354B87J265j479j502k880k86p5K622J548O86m1M543P53k274k128K675m96m279
15337a061N95K81p15m632P00L074k25P27J248o22k803J082R14P80n42J180k51
15320b70r49k4m37J234K746n40n52M91n87l241k466k520k49N990L893k57k626
$$ plain form
15303 -364 -951 -325 -1355 -5758 -8510 -8365 -8964 -7669 -3224 1827 -284 -2364 -1018 -3225 -7345 -7770
15287 -7770 -9176 -9763 -8209 -3884 -1634 -1716 -4386 -3585 -722 497 1929 2063 -1276 -3532 -2834 1648
15271 1648 3332 3486 1588 -740 981 1480 -38 1056 1020 -479 -167 681 -63 -2562 -1475 -2796
15255 -2796 -1147 1127 168 384 3574 4338 -229 -5641 -6928 -8739 -7467 -4551 -2404 -1556 338 1099
15239 1099 -1740 -47 1067 1483 408 1162 3183 -164 -1997 -3616 -4665 -4622 -6676 -8030 -6549 -4143
15223 -4143 -2647 -2122 -3637 -1132 -676 -4796 -5078 -3093 -1869 -1931 -6439 -7933 -7807 -4519 -183 2426
15207 2426 -179 -2189 -2397 -3082 -1707 1460 -432 -5480 -7707 -6051 -3747 -19 -978 -46 2650 -922
15191 -922 -3198 -3132 -338 547 -3188 -4637 -5152 -8670 -7602 -5920 -7245 -9318 -6672 -1984 -4022 -5360
$$ packed form
15303c64n87O26j030m403k752J45n99J295M445N051k111k080J346k207m120m25
15287g770j406n87J554M325K250q2k670Q01K863J219J432J34l339k256O98M482
15271A648J684J54j898k328J721M99j518J094l6j499L12Q48p44k499J087j321
15255b796J649K274r59K16L190P64m567n412j287j811J272K916K147Q48J894P61
15239A099k839J693J114M16j075P54K021l347j833j619j049M3k054j354J481K406
15223d143J496N25j515K505M56m120k82J985J224o2m508j494J26L288M336K609
15207B426k605k010k08o85J375L167j892n048k227J656K304L728r59R32K696l572
15191i22k276O6K794Q85l735j449n15l518J068J682j325k073K646M688k038j338
$$ plain form
15175 -5360 -4358 -2730 -2875 -2034 491 1655 3155 4572 4599 6818 4402 1169 -5208 -3712 -2564 -3431
15159 -3431 -4239 -4020 -4172 -1172 762 -4016 -6845 -7346 -8840 -8021 -5281 -4010 -1293 1783 1268 -923
15143 -923 -3533 -4862 -4959 -308 1094 1619 2259 7019 10923 10122 4757 353 -4248 -3320 -1556 -3047
15127 -3047 -1280 -2096 -2706 -4561 -7376 -4494 -3544 -2691 -4461 -4093 -3416 -2232 -952 791 833 740 -2594
15110 -2594 -1446 136 2640 -239 -947 -1978 -1367 -363 -172 1532 -103 -1452 -3087 961 1908 -107
15094 -107 1214 3559 1249 -1859 -2591 -1264 2507 3240 2035 -557 451 501 -1304 -204 568 -929
15078 -929 -81 -333 -1040 -250 4392 5620 95 -2463 -3504 -2955 -3066 -3805 -4559 -2792 -5153 -4957 -4454
15061 -4454 -7210 -6039 -5327 -4631 -2684 -978 -153 -284 1716 3130 2964 786 -3390 -6637 -5070 -41
$$ packed form
15175e360J002J628j45Q41K525J164J500J417K7K219k416l233o377J496J148q67
15159c431q08K19j52L000J934m778k829n01j494Q19K740J271K717L076n15k191
15143i23k610j329r7M651J402N25O40M760L904q01n365m404m601R28J764j491
15127c047J767q16o10j855k815K882R50Q53j770L68O77J184J280J743M2r3l334
15110b594J148J582K504k879p08j031O11J004J91J704j635j349j635M048R47k015
15094a07J321K345k310l108p32J327L771P33j205k592J008N0j805J100P72j497
15078i29Q48k52p07P90M642J228n525k558j041N49j11p39p54J767k361J96N03
15061d454k756J171P12O96J947J706Q25j31K000J414j66k178m176l247J567N029
$$ plain form
15045 -41 -127 -2373 -1315 -287 -511 -1030 -4236 -3671 -1590 -2571 -1867 -1472 -115 146 -920 -1581 520 -850
15027 -850 -1879 -2907 -3059 -1962 -1967 -3981 -7390 -10410 -7318 -2853 -5018 -3233 2116 2252 307 -4113
15011 -4113 -6634 -4253 -2255 -4224 -5352 -4871 -2005 3148 3347 2403 1239 1798 818 -3460 -4717 -1350
14995 -1350 -1206 -1394 -1819 -6866 -7175 -3981 -692 -3718 -2577 -318 168 -774 -1854 -76 -3168 -4025
14979 -4025 -3141 99 1021 -1324 -5118 -5608 -1000 1822 3132 2713 1475 4773 4869 4583 2689 1470
14963 1470 1189 2403 3071 1851 -3024 -4780 -4084 -787 1158 -747 -1357 -2562 -1182 -1472 -2550 -5025
14947 -5025 -7684 -7427 -419 2495 -1414 -1857 -4027 -8174 -9195 -5922 -3201 -1771 -3695 -3193 -606
14932 -606 -3516 -3532 -6325 -3372 -427 2728 -121 -2943 -5128 -3837 -3264 -3991 -2999 -2750 -701 121 -1699
$$ packed form
15045d1q6k246J058J028k24n19l206N65K081r81P04L95J357K61j066o61K101j370
15027h50j029j028j52J097nk014l409l020L092M465k165J785N349J36j945m420
15011d113k521K381J998j969j128M81K866N153J99r44j164N59r80m278j257L367
14995a350J44j88m25n047l09L194L289l026J141K259M86r42j080J778l092q57
14979d025Q84L240R22k345l794m90M608K822J310m19j238L298R6k86j894j219
14963A470k81J214O68j220m875j756O96L297J945j905o10j205J380k90j078k475
14947e025k659K57P008K914l909m43k170m147j021L273K721J430j924N02K587
14932f06k910j6k793K953K945L155k849k822k185J291N73p27R92K49K049Q22j820
$$ plain form
14915 -1699 -3466 -4238 -1405 1979 4401 248 465 1973 591 -2711 -2763 -2255 -2315 -287 -155 -399 1901
14898 1901 758 32 -669 -879 -2688 -3677 -4738 -7962 -8284 -5925 -2363 -727 -1357 -1730 287 -936
14882 -936 -3784 -4427 -3931 -1518 377 1146 3287 2641 1401 -2083 -4202 -4968 -3896 -2176 512 3441
14866 3441 1858 66 177 -1441 -539 -1820 -2677 -2201 -1557 -1798 -474 4063 9011 7670 7021 7472 6508
14849 6508 4558 1681 -1556 466 1575 1249 -1330 -1861 -329 460 1582 2585 5039 462 -2428
14834 -2428 -2095 1143 1019 -2875 -2692 -1665 -3462 -4411 -36 810 112 1760 2877 146 -2054 -3500
14818 -3500 -322 2376 1458 -81 -226 -535 -1530 755 644 3088 2821 459 663 740 -349 -666 340
14801 340 3920 3554 2924 -143 -3511 -2759 3016 3558 2782 -3490 -8396 -7930 -7080 -4404 -2077 -1308 -3817
$$ packed form
14915a699j767p72K833L384K422m153K17J508j382l302n2N08o0K028J32k44K300
14898A901j143p26p01k10j809r89j061l224l22K359L562J636o30l73K017j223
14882i36k848o43M96K413J895P69K141o46j240l484k119p66J072J720K688K929
14866C441j583j792J11j618R02j281q57M76O44k41J324M537M948j341o49M51r64
14849F508j950k877l237K022J109l26k579n31J532P89J122J003K454m577k890
14834b428L33L238j24l894J83J027j797r49M375Q46o98J648J117k731k200j446
14818c500L178K698r18j539j45l09r95K285j11K444k67k362K04P7j089l17J006
14801C40L580l66o30l067l368P52N775N42p76o272m906M66Q50K676K327P69k509
$$ plain form
14784 -3817 -5290 -2965 -1186 2635 2618 262 1988 4575 3559 -532 -2758 -2081 518 1062 215 -805
14768 -805 2007 3428 3754 2885 426 900 4664 1426 2307 2459 379 -1448 -5724 -3724 -3529 -2438
14752 -2438 2170 5331 5453 3501 2001 186 621 1480 3680 1601 -211 2109 -906 -408 -541 602
14736 602 1194 -269 1552 1554 1929 1541 -293 873 -2223 -2417 -3478 -4043 -4645 -5837 -5243 -4333 -1751 -2069
14718 -2069 -1661 -889 -3588 -3675 1501 6841 7976 6534 7204 3442 5535 6259 4198 3738 1752 2498 4003
14701 4003 3106 1624 241 2797 3748 2332 -495 -2494 -1673 -4874 -3481 -2180 -1572 -2122 -2165 -1228 2089
14684 2089 1872 -601 -1319 69 1480 1841 2809 2842 3272 2185 2723 201 470 -3000 -4929 -7141 -6246
14667 -6246 -3442 -3867 -5042 -5812 -7071 -5051 -1968 877 2380 1577 1120 -737 -518 3025 4733 1523
$$ packed form
14784c817j473K325J779L821j7k356J726K587j016m091k226O77K599N44q47j020
14768h05K812J421L26q69k459M74L764l238Q81J52k080j827m276K000J95J091
14752b438M608L161J22j952j500j815M35Q59K200k079j812K320l015M98j33J143
14736F02N92j463J821KL75l88j834J166l096j94j061n65o02j192N94R10K582l18
14718b069M08P72k699q7N176N340J135j442O70l762K093P24k061m60j986P46J505
14701D003q97j482j383K556R51j416k827j999Q21l201J393J301O08n50m3R37L317
14684B089k17k473p18J388J411L61R68L3M30j087N38k522K69l470j929k212Q95
14667f246K804m25j175p70j259K020L083K845J503q03m57j857K19L543J708l210
$$ plain form
14651 1523 3931 4371 1873 907 2015 -1034 -847 -1001 -3993 -4743 -3942 -2462 -476 -280 60 1578 888
14634 888 -166 -3438 -5309 -7336 -6572 -4420 -1701 3075 3862 3884 2641 361 1888 -293 -823 2516
14618 2516 3168 1823 100 1593 3171 1444 -52 1188 23 3551 4891 2448 -633 -1223 1032
14603 1032 -537 389 -11 -424 -2330 -1285 130 -795 -1940 -1658 -2517 -2753 -1247 2794 2595 179 3430
14586 3430 5540 4754 3353 2406 469 1999 2978 2292 -768 -952 454 -66 -3114 -5619 -5933 -4680
14570 -4680 -940 1489 4146 7380 3250 215 -133 1928 4387 7315 7486 2713 30 -332 254 932
14554 932 3616 4335 3604 1000 -1150 694 459 2092 4111 4509 4903 7587 6752 4819 4507 850 -3608
14537 -3608 -1023 3322 6889 6683 405 -1417 604 775 1301 342 -3064 -8002 -7716 -6097 -2164 -2395
$$ packed form
14651A523K408M40k498r66J108l049J87j54k992p50Q01J480J986J96L40J518o90
14634H88j054l272j871k027P64K152K719M776P87K2j243k280J527k181n30L339
14618B516O52j345j723J493J578j727j496J240j165L528J340k443l081n90K255
14603A032j569R26m00m13j906J045J415r25j145K82q59k36J506M041j99k416L251
14586C430K110p86j401r47j937J530R79o86l060j84J406n20l048k505l14J253
14570d680L740K429K657L234m130l035l48K061K459K928J71m773k683l62N86O78
14554I32K684P19p31k604k150J844k35J633K019L98L94K684q35j933l12l657m458
14537c608K585M345L567k06o278j822K021J71N26r59l406m938K86J619L933k31
$$ plain form
14521 -2395 -4243 -1410 2592 2383 5305 4263 178 -1810 834 3764 3567 1514 759 -1200 -1726 228
14505 228 1916 4401 2534 1127 -719 3281 7184 1593 478 2082 3792 1357 -661 -240 1391
14490 1391 5040 3666 812 866 616 3060 3247 4289 3682 3332 3679 -478 -3341 -3221 161 1756 2205
14473 2205 986 3394 2690 3692 2017 1162 468 -719 256 2926 424 -129 1700 2091 2021 1334 134
14456 134 2300 1141 -449 -199 1044 831 2353 -106 365 1511 2135 4602 5219 3413 5488 6201
14440 6201 6984 5427 4825 6422 5280 3648 3748 3115 3667 2256 -453 -5166 -3835 -511 -182 649
14424 649 2407 3985 3562 11 -2604 -1642 -1864 -2554 -763 1266 3739 5117 4808 2054 483 -2528
14408 -2528 -3362 -394 841 1379 -721 463 -1286 -3581 -210 549 -1436 -4000 -4103 -918 2956 3694
$$ packed form
14521b395j848K833M002k09K922j042m085j988K644K930j97k053p55j959n26J954
14505B28J688K485j867j407j846M000L903n591j115J604J710k435k018M21J631
14490A391L649j374k854N4k50K444J87J042o07l50L47m157k863J20L382J595M49
14473B205j219K408p04J002j675q55o94j187R75K670k502n53J829L91p0o87j200
14456A34K166j159j590K50J243k13J522k459M71J146O24K467O17j806K075P13
14440F201P83j557o02J597j142j632J00o33N52j411k709m713J331L324L29Q31
14424F49J758J578m23l551k615R62k22o90J791K029K473J378l09k754j571l011
14408b528q34K968J235N38k100J184j749k295L371P59j985k564j03L185L874P38
$$ plain form
14392 3694 1730 -1171 -1958 1049 527 799 2605 4521 4106 3493 1572 921 397 -1290 -558 615 2442
14375 2442 3020 3326 3249 1381 1238 2521 1692 708 -1323 2155 4341 2573 -1397 -1829 2883 7877 7829
14358 7829 5088 2449 2863 -43 2622 6153 6458 3020 3331 4918 3879 6024 6096 6867 8317 7878
14342 7878 4731 2336 1795 3347 3482 2993 2745 4591 3387 1790 -1144 -3660 -670 -518 2547 5214
14326 5214 6619 9787 7737 4580 -627 -1263 956 -1909 -1230 177 -2696 -1587 1690 1955 544
14311 544 -1577 1654 2123 4535 4074 -1385 -3023 -2655 2408 899 1114 1357 190 210 236 -1063 1456
14294 1456 2019 2824 2996 3090 1248 2063 3651 1892 59 932 3477 1813 -3491 -3428 -4083 -797 -737 -1884
14276 -1884 -2439 -1957 -1340 -3024 -4589 -3693 -1004 -1233 182 -240 583 4409 2502 -3515 -5114 -3479
$$ packed form
14392C694j964k901p87L007n22K72J806J916m15o13j921o51n24j687P32J173J827
14375B442N78L06p7j868j43J283q29r84k031L478K186j768l970m32M712M994m8
14358G829k741k639M14k906K665L531L05l438L11J587j039K145P2P71J450m39
14342G878l147k395n41J552J35m89k48J846j204j597k934k516K990J52L065K667
14326E214J405L168k050l157n207o36K219k865O79J407k873J109L277K65j411
14311E44k121L231M69K412m61n459j638L68N063j509K15K43j167K0K6j299K519
14294A456N63Q05J72R4j842Q15J588j759j833Q73K545j664n304O3o55L286O0j147
14276a884n55M82O17j684j565Q96K689k29J415m22Q23L826j907o017j599J635
$$ plain form
14260 -3479 -2652 -4229 -3846 -3484 -1754 -171 -1054 -3471 -4571 -2710 1601 3739 4143 2728 566 -1255
14244 -1255 -3961 -4549 -6299 -3018 -2998 -4823 -1200 544 -1556 -5096 -7301 -3761 -1093 1031 2761
14229 2761 5447 6658 5006 3411 2797 4230 2841 690 2797 5510 8109 6388 1393 -3455 -3196
14214 -3196 -1686 -3275 -7886 -4389 -2665 -1592 916 1828 1285 -1534 -3919 -6608 -4707 -3022 -1307
14199 -1307 -1224 86 998 3706 3572 3688 6029 3636 5212 6233 5982 3074 1855 712 3574 7437
14183 7437 6860 1072 -1410 94 3009 2338 -847 -1975 -2266 -1339 -1765 -1419 1076 3845 1872 1575
14167 1575 1179 -397 -433 4826 7937 9764 8303 9199 9411 9871 8979 3432 2696 -867 705 3463 1387
14150 1387 1375 1526 -976 680 -90 -1176 882 3145 7076 6832 5890 4746 5922 7417 8475 6561
$$ packed form
14260c479Q27j577L83L62J730J583q83k417j100J861M311K138M04j415k162j821
14244a255k706n88j750L281K0j825L623J744k100l540k205L540K668K124J730
14229B761K686J211j652j595o14J433j389k151K107K713K599j721m995m848K59
14214c196J510j589m611L497J724J073K508R12n43k819k385k689J901J685J715
14199a307Q3J310R12K708j34J16K341k393J576J021k51k908j219j143K862L863
14183G437n77n788k482J504K915o71l185j128k91R27m26L46K495K769j973k97
14167A575l96j576l6N259L111J827j461Q96K12M60q92n547p36l563J572K758k076
14150A387j2J51k502J656p70j086K058K263L931k44r42j144J176J495J058j914
$$ plain form
14134 6561 4812 3713 4653 5656 3298 3878 6008 6822 8356 7111 9016 4227 2401 1265 2571
14119 2571 3759 3471 1378 -503 3434 3051 2164 3503 2093 877 2178 1830 5304 3469 1139 1162
14103 1162 678 1073 5251 7537 4228 2747 3221 2754 2092 2927 1055 29 -2130 -3226 -3435 -145
14087 -145 -1301 -2091 -292 1441 490 -4112 -1936 2813 -399 -619 -2577 -3857 -4812 -2827 -594 4035
14071 4035 4094 1581 -1569 -952 1307 1787 3129 3699 6363 6933 5571 608 -2142 -1396 -3378 -2084
14055 -2084 -666 676 1566 328 -1404 413 1218 1392 1394 67 -2553 -3109 -1624 -2428 -1482 -244 -818
14038 -818 -1529 -1020 1436 4281 2248 2395 2495 1099 -671 -2123 1564 251 -576 2384 2169 -2330
14022 -2330 -2174 -2752 -1751 -990 -2547 -5365 -5824 -7013 -8855 -7380 -7443 -3882 -2349 -2245 -3497 -5020
$$ packed form
14134F561j749j099R40J003k358N80K130Q14J534j245J905m789j826j136J306
14119B571J188k88k093j881L937l83q87J339j410j216J301l48L474j835k330K3
14103A162m84L95M178K286l309j481M74m67o62Q35j872j026k159j096k09L290
14087a45j156p90J799J733r51m602K176M749l212k20j958j280r55J985K233M629
14071D035N9k513l150O17K259M80J342N70K664N70j362m963k750P46j982J294
14055b084J418J342Q90j238j732J817Q05J74Kj327k620n56J485q04R46J238n74
14038h18p11N09K456K845k033J47J00j396j770j452L687j313q27K960k15m499
14022b330J56n78J001P61j557k818m59j189j842J475o3L561J533J04j252j523
$$ plain form
14006 -5020 -6993 -4530 -2795 -1110 2020 1592 -804 -1215 -2649 -3103 -2050 -4196 -8193 -7867 -6212 -7118
13990 -7118 -8371 -7838 -9258 -9513 -7900 -7407 -6413 -5234 -4251 -4836 -4460 -2154 -654 -1313 -1484 -920 -1060
13973 -1060 -272 -864 -2222 -2650 -2377 -3286 -55 695 -24 -553 -1235 1535 2019 -2937 -5909 -6355 -5042
13956 -5042 -4444 -3853 -1940 -3112 -3396 -3748 -6935 -5464 -3712 -4038 -7188 -5406 -594 1079 759 -4601
13940 -4601 -4345 -893 118 -1561 1384 2127 1646 1463 775 -1323 -2901 -5272 -7959 -2842 196 -1923
13924 -1923 -2369 -1273 -1547 -393 -85 -543 -2326 -1655 -1199 -3822 -1865 -914 -2948 -8167 -6317 -4767
13908 -4767 -6522 -10072 -9229 -6890 -7278 -8604 -7426 -5892 -2702 -1231 -1930 238 2383 2492 -1720 -3057
13892 -3057 -3556 -3432 -5074 -5780 -5824 -5621 -5021 -5832 -5316 -3696 -292 2392 1861 1350 1759 731 -1334 -4598
$$ packed form
14006e020j973K463J735J685L130m28k396m11j434m54J053k146l997L26J655r06
13990g118j253N33j420k55J613M93R94J179R83n85L76K306J500o59j71N64j40
13973a060P88n92j358m28K73r09L231P50p19n29o82K770M84m956k972m46J313
13956e042N98N91J913j172k84l52l187J471J752l26l150J782M812J673l20n360
13940d601K56L452J011j679K945P43m81j83o88k098j578k371k687N117L038k119
13924a923m46J096k74J154L08m58j783O71M56k623J957R51k034n219J850J550
13908d767j755l550Q43K339l88j326J178J534L190J471o99K168K145J09m212j337
13892c057m99J24j642p06m4K03O00q11N16J620L404K684n31n11M09j028k065l264
$$ plain form
13874 -4598 -7653 -3827 -1391 -1085 91 488 -12 -5098 -5483 -4916 -4709 -4428 -5571 -6169 -4114 -2578 -3641
13857 -3641 -6366 -4897 -2945 -2235 -2175 -3246 -3432 -2907 -331 1155 -1662 -2424 146 -1355 -1107 120
13841 120 -2732 -2687 -5842 -6245 -6189 -4155 -169 1149 3012 1567 -1888 -2569 506 1497 -596 -3271 -3582
13824 -3582 -5784 -7038 -2187 -3495 -4606 -5639 -4999 -4778 -5898 -6374 -4811 -1415 -1489 -2620 -3514 -1628
13808 -1628 -1874 -3292 -2541 -128 -1007 835 -1319 -4463 -904 1396 -2348 -2702 -4579 -7307 -5767 -4906
13792 -4906 -3068 -3213 -4344 -3441 -3254 -2739 -4513 -6110 -7378 -1138 3615 -661 -5562 -4823 -5261 -2651
13776 -2651 -1742 -767 -43 -2251 -5721 -4505 -2327 -2546 -1548 -575 -635 -892 619 1313 2303 2125 1451 4290
13758 4290 3667 1877 1641 1665 -124 -2270 -2271 -5058 -6828 -9562 -7368 -5186 -1235 -778 -1957 -3467 -1052
$$ packed form
13874d598l055L826K436L06J176L97n00n086l85N67K07K81j143n98K055J536j063
13857c641k725J469J952P10O0j071j86N25K576J486k817p62K570j501K48J227
13841A20k852M5l155m03N6K034L986J318J863j445l455o81L075R91k093k675l11
13824c582k202j254M851j308j111j033O40K21j120m76J563L396p4j131q94J886
13808a628k46j418P51K413q79J842k154l144L559K300l744l54j877k728J540Q61
13792d906J838j45j131R03J87N15j774j597j268O240M753m276m901P39m38K610
13776b651R09R75P24k208l470J216K178k19R98R73o0k57J511O94R90j78o74K839
13758D290o23j790k36K4j789k146jk787j770k734K194K182L951M57j179j510K415
$$ plain form
13741 -1052 -349 -1296 -923 -1161 -964 -1060 -1084 -481 -78 5705 4687 737 -2208 -386 -2631 -6224 -9806
13724 -9806 -9455 -7722 -3606 -96 1998 -1050 -2448 -742 -2627 -5241 -2858 -3855 -4058 -3804 -4619 -4217
13708 -4217 -2466 -3884 -6164 -5752 -2806 -1593 -4287 -5725 -3008 -1183 -3 -2198 -4087 -2505 1571
13693 1571 5399 3766 1342 -419 -422 932 -1872 -2258 -2624 -2068 -2118 1599 2988 -875 -390 854 364
13676 364 -2929 -3332 -2956 -3605 -4170 -5057 -5175 -2390 -161 2434 4178 2504 -1009 -3850 -6284 -3048
13660 -3048 -3165 -3213 -3824 -2511 -2121 -3982 -2027 1132 1128 -1003 -2418 -5136 -8959 -7676 -6478 -5107 -4937
13643 -4937 -5292 -5871 -6747 -6544 -4270 -5541 -7177 -7651 -10710 -10840 -7791 -7711 -6954 -3720 -2845 -2014 -2692 -3347
13625 -3347 -1710 -2373 -6693 -10633 -8660 -6886 -4482 -1601 -2020 -3221 -4083 -1489 -5650 -6480 -5166 -3136
$$ packed form
13741a052P03r47L73k38J97r6k4O03M03N783j018l950k945J822k245l593l582
13724i806L51J733M116L510K094l048j398J706j885k614K383r97k03K54q15M02
13708d217J751j418k280M12K946J213k694j438K717J825J180k195j889J582M076
13693A571L828j633k424j761lJ354k804l86l66N56n0L717J389l863M85J244m90
13676C64l293m03L76o49n65q87j18K785K229K595J744j674l513k841k434L236
13660c048j17m8o11J313L90j861J955L159mk131j415k718l823J283J198J371J70
13643d937l55n79q76K03K274j271j636m74l059j30L049Q0P57L234Q75Q31o78o55
13625c347J637o63m320l940J973J774K404K881m19j201q62K594m161q30J314K030
$$ plain form
13609 -3136 -1979 -417 -1897 -4527 -8248 -7398 -6681 -7489 -8565 -8988 -12251 -12912 -11889 -11578 -5557 -4038
13593 -4038 -5494 -7545 -7463 -2164 1817 1132 826 492 1031 466 458 234 1541 -25 840 1875 1922 1726
13575 1726 1497 3770 3542 -898 -2382 -1171 1737 3458 5952 2419 -580 -3606 -6448 -5578 -5276 -8101
13559 -8101 -6583 -1322 1685 -634 -3261 -3467 -3880 -1609 455 -540 -709 230 -2495 -2887 -3035 -2932 -2264
13542 -2264 -2482 -520 -923 -4714 -5344 -6406 -5978 -5716 -1658 1181 1055 3548 3838 989 -3561 -4035 -3926
13525 -3926 -3228 -2621 -3114 -4472 -3282 -1134 -1788 -3779 -3595 -5036 -3574 -4452 -1853 -1939 -2420 -4556 -3088
13508 -3088 403 376 2383 4930 6815 6698 4404 -858 -4402 -6091 -6668 -4646 -7944 -7207 -4673 -5485
13492 -5485 -3609 -1122 -575 1212 2044 4121 6679 4826 794 -469 -1276 2528 3921 1552 -1402
$$ packed form
13609c136J157J562j480k630l721Q50P17q08j076m23l263o61J023L11O021J519
13593d038j456k051Q2N299L981o85l06l34N39n65qk24J307j566Q65J035M7j96
13575A726k29K273k28m440j484J211K908J721K494l533k999l026k842Q70L02k825
13559h101J518N261L007k319k627k06m13K271K064r95j69R39k725l92j48J03O68
13542b264k18J962m03l791o30j062M28K62M058K839j26K493K90k849m550m74J09
13525c926O98O07m93j358J190K148o54j991J84j441J462q78K599q6m81k136J468
13508c088L491k7K007K547J885j17k294n262l544j689n77K022l298P37K534q12
13492e485J876K487N47J787Q32K077K558j853m032j263q07L804J393k369k954
$$ plain form
13477 -1402 366 1471 -273 -1491 -2343 596 1964 1273 -1394 -3113 -4989 -6692 -7531 -7224 -5963 -3318
13461 -3318 -2138 -4073 -6703 -11005 -10614 -5180 -3244 -3329 -2698 -749 2251 3030 5645 5466 7907 5548
13445 5548 2189 1373 3985 1569 2688 2932 4234 2360 1128 -686 -480 -2615 -1549 813 -1235
13430 -1235 -2914 -3357 -3228 -694 1743 1376 948 -113 2046 3561 2352 -1225 -2189 -1919 -2501 -1977 -2220
13413 -2220 -2949 -602 -278 -3556 -4609 -3252 -2242 -2540 -4129 -6327 -7282 -6161 -5842 -5534 -6013 -1311
13397 -1311 3799 3746 1816 -2957 -5778 -2811 -2011 -1825 -1018 -1870 -821 66 -2005 -1458 936 -1051 -3331
13380 -3331 -5825 -5013 -669 559 -1982 -3080 -3504 -3881 -6626 -7637 -6948 -6641 -5327 -5001 -5542 -2204
13364 -2204 -1008 -3283 -3368 -4317 -526 1276 -2403 -6129 -1767 -689 392 1013 812 758 -1376 -3627
$$ packed form
13477a402J768J105j744j218q52K939J368o91k667j719j876j703q39L07J261K645
13461c318J180j935k630m302L91N434J936q5O31J949L000P79K615j79K441k359
13445E548l359q16K612k416J119K44J302j874j232j814K06k135J066K362k048
13430a235j679m43J29K534K437l67m28j061K159J515j209l577r64K70n82N24k43
13413b220p29K347L24l278j053J357J010k98j589k198r55J121L19L08m79M702
13397a311N110n3j930m773k821K967Q00J86Q07q52J049Q87k071N47K394j987k280
13380c331k494Q12M344J228k541j098m24l77k745j011O89L07J314L26n41L338
13364b204J196k275q5r49L791J802l679l726M362J078J081O21k01n4k134k251
$$ plain form
13348 -3627 -2275 -3099 -5318 -2447 -396 982 469 -459 -2198 -1742 751 3777 2662 4396 5404 5174
13332 5174 7264 7443 4169 3181 1146 4 3872 5508 986 -2865 -5848 -5308 -2608 -1010 -2948
13317 -2948 -4137 -5533 -7365 -8901 -5859 -2210 -3374 -1868 -3778 -5205 -3156 -381 -2090 -4955 -1191
13302 -1191 1421 666 -1632 -3159 -1567 521 -665 -1879 312 4263 6832 4648 -68 1293 3034
13287 3034 2851 2263 2800 3026 4778 2831 -480 -763 459 3936 4689 3547 4031 2052 -1254 -3787
13271 -3787 -2936 -1759 -1356 -2541 -4423 -4279 -4200 -3535 -3234 -3469 -5937 -4144 -6063 -7731 -6061 -8169 -7579
13254 -7579 -5728 -6878 -8828 -6689 -4324 -3922 -5405 -5142 -3402 -5250 -3149 -1363 -3293 -2947 -1043
13239 -1043 3299 3350 2267 344 -989 -2316 -6155 -913 262 -494 2069 1553 101 3324 2530 -823
$$ packed form
13348c627J352q24k219K871K051J378n13r28j739M56K493L026j115J734J008k30
13332E174K090J79l274r88k035j142L868J636m522l851k983N40K700J598j938
13317b948j189j396j832j536L042L649j164J506j910j427K049K775j709k865L764
13302a191K612p55k298j527J592K088j186j214K191L951K569k184m716J361J741
13287C034j83n88N37K26J752j947l311k83J222L477P53j142M84j979l306k533
13271c787Q51J177M03j185j882J44P9O65L01k35k468J793j919j668J670k108N90
13254g579J851j150j950K139K365M02j483K63J740j848K101J786j930L46J904
13239a043M342N1j083j923j333j327l839N242J175p56K563n16j452L223p94l353
$$ plain form
13223 -823 -3471 -3910 -2824 -5056 -4054 -3920 -3813 -228 -182 1277 2405 3351 -1064 -494 1237 287 -48
13206 -48 -2486 -6460 -9838 -6643 -3225 -2579 -3397 -3960 -3530 -2494 -1007 -1379 42 2038 3322 4804
13190 4804 3058 1461 946 5029 7048 3896 1685 1132 2838 2885 3052 51 -3147 -2544 -210 2381
13174 2381 4274 9185 10362 3273 2675 5159 6612 9218 13162 18713 23843 28851 32765 33155 31413
13159 31413 28427 26071 27531 27961 28406 25071 18732 16834 19041 20457 18692 16376 12342 11559 17586
13144 17586 22485 25832 25300 25846 29443 30522 36123 38625 40657 46620 46992 47278 52734 54667 51793
13129 51793 48926 45035 43334 44666 41617 37653 32940 28796 25278 24239 23336 22882 19302 14651 12183
13114 12183 13189 14713 12418 14119 15653 15758 14124 13091 17068 24449 30648 30811 30802 31523 32669 31703
$$ packed form
13223h23k648m39J086k232J002J34J07L585M6J459J128R46m415N70J731r50l35
13206d8k438l974l378L195L418O46q18n63M30J036J487l72J421J996J284J482
13190D804j746j597n15M083K019l152k211n53J706M7J67l001l198O03K334K591
13174B381J893M911J177p089n98K484J453K606L944N551N130N008L914L90j742
13159C1413k986k356J460M30M45l335o339j898K207J416j765k316m034p83O027
13144A7586M899L347n32N46L597J079N601K502K032N963L72K86N456J933k874
13129E1793k867l891j701J332l049l964m713m144l518j039r03m54l580m651k468
13114A2183J006J524k295J701J534J05j634j033L977P381O199J63rP21J146r66
$$ plain form
13098 31703 32791 34034 35978 37204 34505 33325 36876 40142 40662 40014 41708 40803 41310 37187 33482
13083 33482 27647 23034 24866 25437 24052 21948 17150 17461 16947 14795 18278 22073 22138 22127 23477 29896
13067 29896 34439 37332 39138 45790 47061 49075 54642 59012 61546 69176 72536 71912 66813 58927 50966
13052 50966 42685 40477 36622 30870 30309 28039 24502 24394 18539 16924 18340 17815 16245 14007 14786
13037 14786 20391 21193 24020 25223 25133 28026 33655 39895 42591 42423 39739 37043 36493 35462 35152 33805
13021 33805 27994 22940 21078 17408 14020 12509 11402 9773 7969 6099 6546 5976 6960 10950 12284
13006 12284 10832 7937 8479 11028 13582 15971 18464 18223 23360 26935 32837 39689 45592 49811 53410
12991 53410 56205 57106 58862 62676 64416 64767 64927 68548 71607 71918 69656 68982 67996 65795 67282 63633
$$ packed form
13098C1703J088J243J944J226k699j180L551L266N20o48J694r05N07m123l705
13083C3482n835m613J832N71j385k104m798L11n14k152L483L795O5j1J350O419
13067B9896M543K893J806O652J271K014N567M370K534P630L360o24n099p886p961
13052E0966q281k208l855n752n61k270l537j08n855j615J416n25j570k238P79
13037A4786N605Q02K827J203r0K893N629O240K696j68k684k696n50j031l10j347
13021C3805n811n054j862l670l388j511j107j629j804j870M47n70R84L990J334
13006A2284j452k895N42K549K554K389K493k41N137L575N902O852N903M219L599
12991E3410K795R01J756L814J740L51J60L621L059L11k262o74r86k201J487l649
$$ plain form
12975 63633 59569 57199 56798 53814 52383 55839 59251 55279 54205 55776 60235 63194 66855 72218 68328
12960 68328 67283 67222 71765 75269 77341 80637 79760 78677 79891 78163 73021 69264 66416 61802 58619
12945 58619 58097 58924 56060 51901 46864 41985 38607 35412 31730 30216 26922 28757 29269 26789 26616
12930 26616 28606 26852 29032 36778 38275 38384 42328 46369 53726 57809 61225 66947 73343 76367 75964
12915 75964 76883 84105 87795 89417 92702 94642 97363 98216 96825 100230 107938 110052 112234 118422 121623
12900 121623 124978 124271 115446 108847 103718 100868 100882 100532 95536 92627 94275 98326 102931 106181 106031
12885 106031 107055 112140 118331 123404 130979 132509 135713 142682 148398 150928 151298 150788 150972 149330 144883
12870 144883 135678 120539 109517 97075 84706 73597 62106 52262 43828 39207 37971 37354 41423
$$ packed form
12975F3633m064k370m01k984j431L456L412l972j074J571M459K959L661N363l890
12960F8328j045o1M543L504K072L296q77j083J214j728n142l757k848m614l183
12945E8619n22Q27k864m159n037m879l378l195l682j514l294J835N12k480j73
12930B6616J990j754K180P746J497J09L944M041P357M083L416N722O396L024m03
12915G5964R19P222L690J622L285J940K721Q53j391L405P708K114K182O188L201
12900A21623L355p07q825o599n129k850J4l50m996k909J648M051M605L250j50
12885A06031J024N085O191N073P575J530L204O969N716K530L70n10J84j642m447
12870A44883r205j5139j1022j2442j2369j1109j1491r844q434m621j236o17M069
$$ plain form
12857 41423 45872 50424 51803 52140 56954 62181 64144 64535 62521 62488 59999 57289 54519 52938 53358 52017
12841 52017 44062 38003 35509 31342 30915 33599 37266 41434 39785 38175 43532 52853 62964 67812
12827 67812 68901 69745 70829 69774 70160 68641 65672 59424 50357 41085 35523 34477 35759 39598 43931
12812 43931 45979 43546 46916 52009 54848 58442 63859 67274 73671 84742 96520 104571 110366 113444
12798 113444 117422 112317 104861 96144 81845 68845 61080 55419 49476 45444 42823 42818 40619 42647
12784 42647 46585 52611 53974 55988 56328 60254 65500 69528 71077 75270 79159 79838 77784 74340 73845
12769 73845 73075 67561 56465 51265 46554 42519 39911 39748 35826 35359 38512 42744 42890 43275 43866 45864
12753 45864 49106 49885 52035 51787 54411 55891 57273 60658 64030 68895 73327 78649 83219 89686 95947
$$ packed form
12857D1423M449M552J379L37M814N227J963L91k014l3k489k710k770j581M20j341
12841E2017p955o059k494m167m27K684L667M168j649j610N357R321J0111M848
12827F7812J089Q44J084j055L86j519k969o248r067r272n562j046J282L839M333
12812D3931K048k433L370N093K839L594N417L415O397J1071J1778Q051N795L078
12798A13444L978n105p456q717j4299j3000p765n661n943m032k621nk199K028
12784D2647L938O026J363K014L40L926N246M028J549M193L889O79k054l444m95
12769G3845p70n514j1096n200m711m035k608j63l922m67L153M232J46L85N91J998
12753D5864L242P79K150k48K624J480J382L385L372M865M432N322M570O467O261
$$ plain form
12738 95947 100889 104901 117329 134411 145694 153832 165919 186520 209438 228166 250330 277105
12726 277105 310649 344027 380168 423857 482897 560831 662026 794386 954297 1136841 1342611
12715 1342611 1584864 1908093 2372970 3016125 3836815 4731495 5462424 5811031 5803373 5625513
12705 5625513 5373430 5003678 4461603 3810173 3164117 2595824 2150954 1833242 1629975
12696 1629975 1517935 1481506 1501616 1578385 1717140 1912862 2145579 2411630 2739115 3180249
12686 3180249 3769259 4537916 5499988 6578207 7586944 8348819 8870842 9257482 9494896
12677 9494896 9502229 9277354 8891950 8377147 7685117 6874693 6137349 5549047 5015740 4414181
12667 4414181 3749819 3142657 2674414 2349121 2138009 2002021 1923729 1909086 1954974 2071700
$$ packed form
12738I5947M942M012J2428J7082J1283Q138J2087K0601K2918J8728K2164K6775
12726B77105L3544L3378L6141M3689N9040P7934J01195J32360J59911J82544K05770
12715A342611K42253L23229M64877O43155Q20690Q94680P30929L48607p658j77860
12705E625513k52083l69752n42075o51430o46056n68293m44870l17712k03267
12696A629975j12040l6429K0110P6769J38755J95722K32717K66051L27485M41134
12686C180249N89010P68657R62072J078219J008737P61875N22023L86640K37414
12677I494896P333k24875l85404n14803o92030q10424p37344n88302n33307o01559
12667D414181o64362o07162m68243l25293k11112j35988p8292j4643M5888J16726
$$ plain form
12657 2071700 2260173 2522186 2854875 3260071 3742247 4288285 4818682 5256444 5645558
12648 5645558 6085887 6545044 6850852 6877722 6714948 6570100 6538830 6587715 6694295 6865408
12638 6865408 7103992 7413812 7801784 8154152 8238937 7923708 7362477 6799835 6312322 5778806
12628 5778806 5126502 4467853 3910994 3466920 3115375 2851732 2676445 2599406 2623234 2740245
12618 2740245 2944755 3233588 3628082 4172349 4892663 5775760 6713817 7583620 8394378
12609 8394378 9260463 10262072 11296011 12126931 12675048 13016960 13134758 12931047 12423233
12600 12423233 11775368 11008759 9930873 8507548 7015338 5753516 4830939 4188980 3737976
12591 3737976 3429073 3204878 3005229 2819646 2661187 2559143 2534144 2617518 2815492 3152032
$$ packed form
12657B071700J88473K62013L32689M05196M82176N46038N30397M37762L89114
12648E645558M40329M59157L05808K6870j62774j44848l1270M8885J06580J71113
12638F865408K38584L09820L87972L52368Q4785l15229n61231n62642m87513n33516
12628E778806o52304o58649n56859m44074l51545k63643j75287p7039K3828J17011
12618B740245K04510K88833L94494N44267P20314Q83097R38057Q69803Q10758
12609H394378Q66085J001609J033939Q30920N48117L41912J17798k03711n07814
12600A2423233o47865p66609j077886j423325j492210j261822r22577o41959m51004
12591C737976l08903k24195j99649j85583j58459j02044k4999Q3374J97974L36540
$$ plain form
12581 3152032 3642395 4303002 5115063 6010283 6872815 7561793 8004869 8283621 8444895
12572 8444895 8353745 7779781 6674671 5337334 4132832 3217216 2590696 2177539 1873700
12563 1873700 1621283 1401414 1215402 1067837 959431 880431 826012 797228 796083 815912
12553 815912 848068 892044 931296 941671 906842 834911 747035 663824 594473 537435 491337
12542 491337 453309 424303 404355 396310 402710 423684 456386 493101 539545 594979 653904 700414
12530 700414 718157 694661 623629 521939 426206 352700 300020 265199 241820 224208 210621
12519 210621 201485 191020 181843 176069 168842 161575 154446 149247 142519 132318 127853 128054 120985 119510
12505 119510 119748 116702 115769 115687 115675 116269 119599 118229 116744 111378 102341 98214 95557 92809 91326 88532
$$ packed form
12581C152032M90363O60607Q12061Q95220Q62532O88978M43076K78752J61274
12572H444895r1150n73964j105110j337337j204502r15616o26520m13157l03839
12563A873700k52417k19869j86012j47565j08406p9000n4419k8784j145J9829
12553H15912L2156M3976L9252J0375l4829p1931q7876q3211o9351n7038m6098
12542D91337l8028k9006j9948q045O400K0974L2702L6715M6444N5434N8925M6510
12530G00414J7743k3496p1032j01690r5733p3506n2680l4821k3379j7612j3587
12519B10621r136j0465r177n774p227p267p129n199o728j0201m465K01p069j475
12505A19510K38l046r33q2j2N94L330j370j485n366r037m127k657k748j483k794
$$ plain form
12489 88532 85129 82019 81406 78807 78516 78876 81724 81715 82856 79963 72348 69655 70797 72686 72332 71753
12473 71753 69945 66566 59616 63453 65471 63013 64010 61651 56935 56301 60087 62378 63040 62594 64161
12458 64161 68021 66213 64025 65625 64666 63899 58995 52331 49147 49108 48539 47429 46748 50763 50028 51765
12442 51765 54878 56162 55378 58674 53325 50460 51947 49776 48153 46313 45113 44478 44285 44287 44892 50624
12426 50624 55941 56744 55028 57478 57003 52284 50072 50025 49698 47910 42487 40295 36460 33099 33317 36461
12410 36461 35246 34325 36562 37111 39329 42111 44743 42715 42648 45416 47589 47512 49517 51542 53299 56794
12394 56794 55351 49744 47110 45449 46973 50676 53789 55456 55700 55649 56251 57266 56572 54561 57721 54543
12378 54543 48155 37880 39149 46280 50870 49117 46777 45505 44483 45363 49939 52577 53076 52454 51620
$$ packed form
12489H8532l403l110o13k599k91L60K848rJ141k893p615k693J142J889l54n79
12473G1753j808l379o950L837K018k458R97k359m716o34L786K291O62m46J567
12458F4161L860j808k188J600r59p67m904o664l184l9n69j110o81M015p35J737
12442E1765L113J284p84L296n349k865J487k171j623j840j200o35j93KO05N732
12426E0624N317Q03j716K450m75m719k212m7l27j788n423k192l835l361K18L144
12410C6461j215r21K237N49K218K782K632k028o7K768K173p7K005K025J757L495
12394E6794j443n607k634j661J524L703L113J667K44n1O02J015o94k011L160l178
12378E4543o388j0275J269P131M590j753k340j272j022Q80M576K638M99o22q34
$$ plain form
12363 51620 53297 52042 49954 49666 50123 48986 49446 48140 49936 51158 56931 68717 76711 81203 86685
12348 86685 91239 96306 104956 121415 139277 153259 152591 138721 114029 93616 80957 71930 66737
12335 66737 64314 58336 52359 51825 54758 59388 61867 63081 67545 72510 73089 74573 75506 79807 84405
12320 84405 85336 84637 86868 87765 89115 92191 99591 107413 110719 112735 119139 128807 140752 157348 175767
12305 175767 200679 236902 276157 299836 295085 263325 227823 199534 182362 169909 164959 165405
12293 165405 170189 173387 181174 192764 199230 204174 213537 226147 244430 266608 289653 318538 350156
12280 350156 397336 449579 511320 589072 685963 809077 959283 1140656 1354558 1605597
12270 1605597 1902420 2267248 2731228 3335064 4124514 5133487 6353025 7661097 8819856
$$ packed form
12363E1620J677j255k088k88M57j137M60j306J796J222N773J1786P994M492N482
12348H6685M554N067Q650J6459J7862J3982o68j3870k4692k0413j2659r027n193
12335F6737k423n978n977n34K933M630K479J214M464M965N79J484R33M301M598
12320H4405R31o99K231Q97J350L076P400P822L306K016O404R668J1945J6596J8419
12305A75767K4912L6223L9255K3679m751l1760l5502k8289j7172j2453m950M46
12293A65405M784L198P787J1590O466M944R363J2610J8283K2178K3045K8885L1618
12280C50156M7180N2243O1741P7752R6891J23114J50206J81373K13902K51039
12270A605597K96823L64828M63980O03836P89450J008973J219538J308072J158759
$$ plain form
12261 8819856 9564729 9639999 8939068 7679424 6265279 5027974 4109370 3520541 3208434
12252 3208434 3120099 3225358 3507261 3971150 4603040 5362326 6222021 7190058 8192404
12243 8192404 8991868 9303044 9026356 8243308 7142558 5946272 4796178 3797482 3016383
12234 3016383 2441944 2021586 1712977 1488120 1322908 1198858 1107841 1035562 978290 939660
12224 939660 918108 916628 934173 964188 1017333 1089476 1190584 1320271 1482822 1683489 1941056
12213 1941056 2258435 2649231 3138158 3745259 4490492 5401147 6497372 7723814 8887066
12204 8887066 9688275 9892955 9530615 8803730 7895840 6962681 6156688 5601785 5365001
12195 5365001 5456904 5873103 6611643 7661222 8990595 10516923 12096576 13517303 14533937
$$ packed form
12261H819856P44873P5270p00931j259644j414145j237305r18604n88829l12107
12252C208434q8335J05259K81903M63889O31890P59286Q59695R68037J002346
12243H192404P99464L11176k76688p83048j100750j196286j150094r98696p81099
12234C016383n74439m20358l08609k24857j65212j24050r1017p2279n7272l8630
12224I39660k1552j480J7545L0015N3145P2143J01108J29687J62551K00667K57567
12213A941056L17379L90796M88927O07101P45233R10655J096225J226442J163252
12204H887066Q01209K04680l62340p26885r07890r33159q05993n54903k36784
12195E365001R1903M16199P38540J049579J329373J526328J579653J420727J016634
$$ plain form
12186 14533937 14946138 14644589 13656800 12180844 10510228 8885769 7464301 6323644
12178 6323644 5499529 5004672 4819045 4924727 5298997 5871657 6488299 7000027 7304287
12169 7304287 7304865 6904004 6135521 5197097 4295752 3530359 2914194 2421397 2029168 1724552
12159 1724552 1486315 1297613 1146695 1030656 944052 875132 825864 793144 777126 778248 789353
12148 789353 811600 846822 895918 965563 1054682 1161812 1291121 1453167 1662201 1931345
12138 1931345 2280954 2750457 3368967 4152126 5042145 5920180 6633087 7015609 6976796 6529166
12128 6529166 5804767 5009675 4295041 3688723 3181047 2794072 2546664 2446794 2486494 2668404
12118 2668404 3019511 3573936 4354339 5340616 6392478 7229460 7538379 7220265 6432668
$$ packed form
12186A4533937M12201l01549r87789j475956j670616j624459j421468j140657
12178F323644q24115m94857j85627J05682L74270N72660O16642N11728L04260
12169G304287N78m00861p68483r38424r01345p65393o16165m92797l92229l04616
12159A724552k38237j88702j50918j16039q6604o8920m9268l2720j6018J122J1105
12148G89353K2247L5222M9096O9645Q9119J07130J29309J62046K09034K69144
12138A931345L49609M69503O18510P83159Q90019Q78035P12907L82522l8813m47630
12128F529166p24399p95092p14634o06318n07676l86975k47408r9870L9700J81910
12118B668404L51107N54425P80403R86277J051862Q36982L08919l18114p87597
$$ plain form
12109 6432668 5408943 4361397 3448762 2730353 2189864 1781759 1474498 1239876 1061854
12100 1061854 917880 791017 683383 595426 521119 460885 413734 377581 347852 326180 312907
12089 312907 307075 303173 303167 297219 283844 265158 247077 230696 216432 201793 190297 183087 177268
12076 177268 176335 178302 179177 180965 185659 192989 198339 195710 186577 175837 160262 143674 135426 131650
12062 131650 125278 120851 114936 110188 106497 106608 105223 104919 106073 100893 99248 96549 90510 89119 87972
12047 87972 89766 93402 94732 93535 91411 91522 88521 88709 87482 85571 83387 80821 85287 86956 89029
12032 89029 91718 88764 84839 84226 90152 95122 103854 116633 130921 141318 146700 148828 146140 142272
12018 142272 141879 139188 138089 141577 147468 155011 161536 162276 160428 159692 168904 177574 188478 195951 195523
$$ packed form
12109F432668j023725j047546r12635p18409n40489m08105l07261k34622j78022
12100A061854j43974j26863j07634q7957p4307o0234m7151l6153k9729k1672j3273
12089C12907n832l902on948j3375j8686j8081j6381j4264j4639j1496p210n819
12076A77268r33J967Q75J788M694P330N350k629r133j0740j5575j6588q248l776
12062A31650o372m427n915m748l691J11j385l04J154n180j645k699o039j391j147
12047H7972J794L636J330j197k124J11l001J88j227j911k184k566M466J669K073
12032H9029K689k954l925o13N926M970Q732J2779J4288J0397N382K128k688l868
12018A42272l93k691j099L488N891P543O525P40j848p36R212Q670J0904P473m28
$$ plain form
12003 195523 185214 172302 164684 160329 159785 166788 176585 190709 203145 216371 227792 229366 223700
11990 223700 213208 197272 179794 162374 150809 142748 138605 141405 155466 165330 171984 175027 172070
11977 172070 166120 160717 152551 143368 131333 116802 106372 98585 92640 89501 90466 88172 87530 88486
11963 88486 88133 82386 81106 87343 90896 91408 95688 104472 118487 136733 156840 172778 180908 178381
11949 178381 170185 160737 147622 136227 122048 108130 100894 89389 83215 83309 83785 83388 80617 83475
11935 83475 87244 92655 100400 108526 115754 112608 108233 102736 95998 91905 86682 88644 94999 102802
11921 102802 106381 116442 131666 150405 171135 185748 196581 205729 207496 206887 202222 196909 189783
11908 189783 181610 173242 170078 171221 175455 182570 184506 181141 170655 154739 137006 120977 104715
$$ packed form
12003A95523j0309j2912p618m355n44P003R797J4124J2436J3226J1421J574n666
11990B23700j0492j5936j7478j7420j1565q061m143K800J4061R864O654L043k957
11977A72070n950n403q166r183j2035j4531j0430p787n945l139R65k294o42R56
11963H8486l53n747j280O237L553N12M280Q784J4015J8246K0107J5938Q130k527
11949A78381q196r448j3115j1395j4179j3918p236j1505o174R4M76l97k771K858
11935H3475L769N411P745Q126P228l146m375n497o738m093n223J962O355P803
11921A02802L579J0061J5224J8739K0730J4613J0833R148J767o09m665n313p126
11908A89783q173q368l164J143M234P115J936l365j0486j5916j7733j6029j6262
$$ plain form
11895 104715 86744 71900 64570 58434 55174 50458 44375 42156 41340 41112 38039 38175 39265 36660
11881 36660 33867 34621 34252 29468 26663 31289 35566 34815 29980 27609 26395 27523 29972 33192 34345
11866 34345 34729 32817 28595 28502 31467 32561 33235 31895 29736 30808 32345 32062 32927 34432 37667 38912
11850 38912 36656 39140 44870 48665 50899 57113 64903 75766 90188 100856 104816 101327 92402 84285
11836 84285 76905 72100 67932 71531 74762 75975 80880 87314 87334 89804 95165 95388 92020 79168 65641
11821 65641 57611 53722 51900 49004 52072 56861 61495 64130 65287 67917 67714 63419 58799 53176 46418
11806 46418 39311 36532 37323 38779 38874 35782 36634 39104 46203 56146 65872 72196 75160 75941 70155 62976
11790 62976 54763 45258 40243 35809 33589 32418 28159 23838 23867 27266 24018 21918 21385 22209 24592
$$ packed form
11895A04715j7971j4844p330o136l260m716o083k219q16k28l073J36J090k605
11881C6660k793P54l69m784k805M626M277p51m835k371j214J128K449L220J153
11866C4345L84j912m222r3K965J094O74j340k159J072J537k83Q65J505L235J245
11850C8912k256K484N730L795K234O214P790J0863J4422J0668L960l489q925q117
11836H4285p380m805m168L599L231J213M905O434K0K470N361K23l368j2852j3527
11821F5641q030l889j822k896L068M789M634K635J157K630k03m295m620n623o758
11806D6418p107k779P91J456R5l092Q52K470P099R943R726O324K964P81n786p179
11790F2976q213r505n015m434k220j171m259m321K9L399l248k100n33Q24K383
$$ plain form
11775 24592 21814 21057 22519 21806 19876 16876 18902 21011 21628 24279 27134 28220 29418 34603 36747
11760 36747 40708 48682 54525 63410 70165 67712 65640 64383 59464 54987 51738 47949 43338 44850
11746 44850 46394 49782 55714 60634 69441 78175 85137 89450 94384 100178 96285 85667 75915 62548
11732 62548 54054 48534 45250 41798 40597 36928 37326 39934 41614 47667 49293 49653 49612 46620 43957
11717 43957 39249 36234 32793 26639 19928 17764 19518 20394 21348 20707 15073 19425 20017 17674 17176 18277
11701 18277 21388 22883 20886 20039 17748 16678 18874 20487 22474 20828 20565 22224 26383 32198 37454
11686 37454 45246 53648 58991 62894 67760 66818 63604 56562 49166 45928 43080 38072 38148 39677 39262
11671 39262 39113 40481 43884 46601 48171 51021 57953 64980 64889 58126 55076 47328 42601 36848 30698
$$ packed form
11775B4592k778p57J462p13j930l000K026K109O17K651K855J086J198N185K144
11760C6747L961P974N843Q885O755k453k072j257m919m477l249l789m611J512
11746D4850J544L388N932M920Q807Q734O962M313M934N794l893j0618r752j3367
11732F2548q494n520l284l452j201l669L98K608J680O053J626L60m1k992k663
11717D3957m708l015l441o154o711k164J754Q76R54o41n634M352N92k343m98J101
11701A8277L111J495j997q47k291j070K196J613J987j646k63J659M159N815N256
11686C7454P792Q402N343L903M866r42l214p042p396l238k848n008P6J529m15
11671C9262j49J368L403K717J570K850O932P027r1o763l050p748m727n753o150
$$ plain form
11656 30698 32534 30175 26470 23464 22082 24436 21343 17109 12834 12055 13395 16154 16262 14557 12152
11641 12152 10568 9707 9143 9372 11431 11659 9542 9870 12595 14925 17448 20829 20762 21870 20059 16346
11625 16346 15901 12880 12289 14246 12276 8323 10285 17254 22209 21302 20072 18544 16014 13432 11252
11610 11252 12359 15041 16064 19800 17480 14969 14145 13170 13364 13649 14085 14987 14518 13297 16436 17879
11594 17879 15989 19121 19669 19485 16948 17503 18319 19545 18314 15688 14994 16679 15092 11731 14622 18245
11578 18245 16051 13069 13784 19116 21042 17763 15210 17897 18103 16255 12694 11598 13115 13665 18522
11563 18522 22482 18252 15866 15461 16860 19235 19018 17336 16269 14329 15086 16785 20555 19127 17465
11548 17465 21848 25351 24573 20925 19893 21583 22865 19518 17663 17881 19297 19384 19919 18148 15790 15925
$$ packed form
11656C0698J836k359l705l006j382K354l093m234m275p79J340K759J08j705k405
11641A2152j584q61n64K29K059K28k117L28K725K330K523L381o7J108j811l713
11625A6346m45l021n91J957j970l953J962O969M955r07j230j528k530k582k180
11610A1252J107K682J023L736k320k511q24r75J94K85M36R02m69j221L139J443
11594A7879j890L132N48j84k537N55Q16J226j231k626o94J685j587l361K891L623
11578A8245k194k982P15N332J926l279k553K687K06j848l561j096J517N50M857
11563A8522L960m230k386m05J399K375k17j682j067j940P57J699L770j428j662
11548A7465M383L503p78l648j032J690J282l347j855K18J416Q7N35j771k358J35
$$ plain form
11532 15925 16478 16121 17651 16720 13678 13465 15409 17466 18467 17481 17422 19280 20248 20494 21589 24141 23933
11515 23933 24787 27115 28360 27708 24526 22025 24026 28743 30487 33430 38399 44112 48097 53941 65769
11500 65769 78593 90260 114518 142955 175218 224053 291627 360929 418008 433121 391644 315918
11488 315918 236520 174449 128001 98065 81752 67547 56582 50651 45511 39961 34647 29921
11476 29921 28508 28812 27573 24368 23822 20487 22806 25688 27651 27472 25741 21676 22042 21213 19074 17963
11460 17963 15423 13119 14700 14281 14763 17523 18083 18119 17017 19179 20699 17500 12555 9135 10877 13066
11444 13066 15012 15696 12979 14917 22550 23200 21294 18597 19833 20219 21368 22262 25505 27328 25429
11429 25429 19784 16379 13591 13108 14737 17418 15909 17008 16805 14278 12908 11104 10374 9469 9698 10185
$$ packed form
11532A5925N53l57J530r31l042k13J944K057J001r86n9J858R68K46J095K552k08
11515B3933Q54K328J245o52l182k501K001M717J744K943M969N713L985N844J1828
11500F5769J2824J1667K4258K8437L2263M8835O7574O9302N7079J5113m1477p5726
11488C15918p9398o2071m6448k9936j6313j4205j0965n931n140n550n314m726
11476B9921j413L04j239l205n46l335K319K882J963j79j731m065L66q29k139j111
11460A7963k540k304J581m19M82K760N60L6j102K162J520l199m945l420J742K189
11444A3066J946O84k717J938P633O50j906k697J236L86J149Q94L243J823j899
11429B5429n645l405k788m83J629K681j509J099k03k527j370j804p30r05K29M87
$$ plain form
11413 10185 12787 13980 11688 12902 12661 10530 8395 11163 14141 16412 19904 23481 26130 21876 21278
11398 21278 20093 17670 16070 14341 14716 17342 15876 15193 17420 20753 24052 20738 18973 15490 14998
11383 14998 12111 10901 14827 16517 15160 13364 13412 15601 18799 20925 21887 23901 23971 24219 23196 18292
11367 18292 13703 13089 15632 17329 19972 20815 20407 21270 21861 22484 27382 31064 28256 28971 31812 30002
11351 30002 25923 26119 24431 23819 23866 20466 18906 25599 28708 26202 23459 21681 23981 23231 24655 28323
11335 28323 31419 31555 34916 36573 40406 48650 60086 68029 76752 83637 88231 80971 69801 55739
11321 55739 44772 39171 33982 29136 27555 26755 24054 18658 18163 20123 23796 27334 27701 27117 25445
11306 25445 23283 23299 26953 29571 31374 28539 27324 28535 29438 29875 32670 36077 35808 36140 35603 34255
$$ packed form
11413A0185K602J193k292J214k41k131k135K768K978K271L492L577K649m254n98
11398B1278j185k423j600j729L75K626j466o83K227L333L299l314j765l483m92
11383A4998k887j210L926J690j357j796M8K189L198K126R62K014P0K48j023m904
11367A8292m589o14K543J697K643Q43m08Q63N91O23M898L682k808P15K841j810
11351C0002m079J96j688o12M7l400j560O693L109k506k743j778K300p50J424L668
11335B8323L096J36L361J657L833Q244J1436P943Q723O885M594p260j1170j4062
11321E5739j0967n601n189m846j581q00k701n396m95J960L673L538L67n84j672
11306B5445k162J6L654K618J803k835j215J211R03M37K795L407k69L32n37j348
$$ plain form
11290 34255 37161 34393 29283 29251 31554 29845 30233 31493 27234 23202 23077 25077 26519 27603 24947
11275 24947 27282 29780 28504 27259 26162 23000 17156 15665 18185 19875 19257 18591 21448 24414 23673
11260 23673 21591 23247 27402 24672 17014 14141 13998 12726 16790 24232 28041 28523 28695 26259 22641
11245 22641 21341 21433 21492 23002 19985 20499 18880 16074 17988 20736 20847 23529 24981 20087 19439 22421
11229 22421 22105 20200 17064 13502 9768 7936 6359 9633 16586 18376 24247 29069 30550 30697 34479
11214 34479 39529 38927 39351 45893 47661 47417 49015 50167 49071 45069 43310 43688 47200 54329 60691
11199 60691 67853 71520 70531 65249 56850 51210 48505 50253 50998 50526 53018 55539 54951 56642 59115
11184 59115 60779 55654 52133 49484 50519 53796 60789 61379 58737 60290 57460 57161 59353 65590 70009
$$ packed form
11290C4255K906k768n110l2K303j709L88J260m259m032j25K000J442J084k656
11275B4947K335K498j276j245j097l162n844j491K520J690o18o66K857K966p41
11260B3673k082J656M155k730p658k873j43j272M064P442L809M82J72k436l618
11245B2641j300R2N9J510l017N14j619k806J914K748J11K682J452m894o48K982
11229B2421l16j905l136l562l734j832j577L274O953J790N871M822J481J47L782
11214C4479N050o02M24O542J768k44J598J152j096m002j759L78L512P129O362
11199F0691P162L667r89n282q399n640k705J748P45m72K492K521n88J691K473
11184E9115J664n125l521k649J035L277O993N90k642J553k830k99K192O237M419
$$ plain form
11169 70009 74575 75601 78517 83948 86624 87338 91284 98611 100416 101351 102746 103533 102722 100178 98650
11154 98650 96687 97329 98088 102222 106550 108618 114693 117046 119669 119758 118714 115464 114233 120919 131197
11139 131197 139227 143673 144598 151559 154764 157472 155966 161453 173359 181487 193833 206766 216641 226727
11125 226727 238422 251160 259090 263686 267482 270165 272828 274441 278723 290025 304562 321521 341943
11112 341943 370103 398128 427705 462869 499412 538264 576798 614067 651859 695813 747599
11101 747599 803197 875546 962363 1060705 1174310 1302965 1454748 1636886 1847531 2083146
11091 2083146 2363095 2700363 3116097 3636543 4302650 5174676 6307884 7755862 9551976
11082 9551976 11738372 14440306 17972922 22906935 30083734 40419940 54099521 68943281
$$ packed form
11169G0009M566J026K916N431K676P14L946P327J805R35J395P87q11k544j528
11154I8650j963O42P59M134M328K068O075K353K623Q9j044l250j231O686J0278
11139A31197Q030M446R25O961L205K708j506N487J1906Q128J2346J2933R875J0086
11125B26727J1695J2738P930M596L796K683K663J613M282J1302J4537J6959K0422
11112C41943K8160K8025K9577L5164L6543L8852L8534L7269L7792M3954N1786
11101G47599N5598P2349Q6817R8342J13605J28655J51783J82138K10645K35615
11091B083146K79949L37268M15734N20446O66107Q72026J133208J447978J796114
11082I551976K186396K701934L532616M934013P176799J0336206J3679581J4843760
$$ plain form
11074 68943281 79659481 80658831 70884976 55042189 39458440 27617846 19756500 14790606
11066 14790606 11635109 9513580 7927849 6608864 5472949 4522461 3766144 3180960
11058 3180960 2724275 2359414 2065868 1830045 1642265 1491523 1367245 1262801 1170697 1085695
11048 1085695 1010649 942289 879906 817631 757364 706355 661308 618979 584840 556703 534507
11037 534507 513432 493716 474942 458098 442383 422654 400428 376958 358513 338843 320007
11026 320007 298120 278153 257032 241354 234152 233696 232887 228521 223808 218186 214039 208303 201141 194437
11012 194437 189420 185884 180544 174847 168237 164998 162458 158252 154269 148759 145305 139055 132110 126840
10998 126840 123833 123104 124488 126325 127256 127889 127921 123434 119704 119730 117501 114731 113221 112598 110126 106228
$$ packed form
11074F8943281J0716200R99350r773855j5842787j5583749j1840594p861346m965894
11066A4790606l155497k121529j585731j318985j135915r50488p56317n85184
11058C180960m56685l64861k93546k35823j87780j50742j24278j04444r2104q5002
11048A085695p5046o8360o2383o2275o0267n1009m5047m2329l4139k8137k2196
11037E34507k1075j9716j8774j6844j5715j9729k2226k3470j8445j9670j8836
11026C20007k1887j9967k1121j5678p202m56q09m366m713n622m147n736p162o704
11012A94437n017l536n340n697o610l239k540m206l983n510l454o250o945n270
10998A26840l007p29J384J837R31O33L2m487l730K6k229k770j510o23k472l898
$$ plain form
10982 106228 105265 103473 100529 99451 98060 91810 89268 92102 92528 91318 89197 86150 83391 80547 78132
10967 78132 81896 86711 86113 83756 83455 84101 82971 82537 84056 82564 84278 88659 89901 87801 84221
10952 84221 79217 78914 80332 79616 75905 78282 85980 97153 100708 94980 85641 78264 69816 64722 62705
10937 62705 62899 60521 60299 58180 59471 59670 62036 62929 63415 66135 71413 75882 82747 85589 85199 85518
10921 85518 83889 81341 78370 80644 87731 88964 90429 86949 77897 68825 64837 62219 58717 55549
10907 55549 53582 51426 49271 47826 44941 45253 47161 45170 44024 41076 40605 44893 46982 47246 48928
10892 48928 47369 46182 45668 43369 43326 40957 41382 48491 51734 51918 51896 47983 44834 44320 47305 44376
10876 44376 45329 43312 41063 44231 44776 48181 51369 52492 52285 49500 43905 40145 39906 38432 40429
$$ packed form
10982A06228r63j792k944j078j391o250k542K834M26j210k121l047k759k844k415
10967G8132L764M815n98k357l01O46j130m34J519j492J714M381J242k100l580
10952H4221n004l03J418p16l711K377P698J1173L555n728r339p377q448n094k017
10937F2705J94k378k22k119J291J99K366Q93M86K720N278M469O865K842l90L19
10921H5518j629k548k971K274P087J233J465l480r052r072l988k618l502l168
10907E5549j967k156k155j445k885L12J908j991j146k948m71M288K089K64J682
10892D8928j559j187n14k299m3k369M25P109L243J84k2l913l149n14K985k929
10876D4376R53k017k249L168N45L405L188J123k07k785n595l760k39j474J997
$$ plain form
10861 40429 41087 35377 33293 33951 31879 28817 25758 24089 22448 22220 21429 21460 21523 21633 24396 27370 26298
10844 26298 25869 27928 28878 30783 30357 30078 28637 29032 28006 27375 28311 28240 30119 30541 28696 24304 24049
10827 24049 27652 32097 33123 32096 29444 27672 28549 26879 25444 27412 31503 32202 32529 29542 27689
10812 27689 25380 23982 28119 29400 28472 30156 29840 29032 27790 22880 23674 27176 27733 26933 24886 23102
10796 23102 26763 27472 26751 24530 23371 22562 21615 23096 23246 23544 25531 26686 24088 26356 29518 29335
10780 29335 28415 27997 28348 29461 30324 27969 25218 26461 27615 28396 29681 34583 35357 34236 31026 30439
10764 30439 29769 29134 27736 28205 26453 26965 28075 29142 29481 29150 28062 29037 28905 30993 34279 34601 32822
10747 32822 32374 34270 36321 36217 37703 40029 42105 43714 44326 49631 53899 57654 60328 65759 69217
$$ packed form
10861D0429O58n710k084O58k072l062l059j669j641k28p91L1O3J10K763K974j072
10844B6298m29K059R50J905m26k79j441L95j026o31R36p1J879M22j845m392k55
10827B4049L603M445J026j027k652j772Q77j670j435J968M091O99L27k987j853
10812B7689k309j398M137J281r28J684l16q08j242m910P94L502N57q00k047j784
10796B3102L661P09p21k221j159q09r47J481J50K98J987J155k598K268L162j83
10780B9335r20m18L51J113Q63k355k751J243J154P81J285M902P74j121l210n87
10764C0439o70o35j398M69j752N12J110J067L39l31j088R75j32K088L286L22j779
10747C2822m48J896K051j04J486K326K076J609O12N305M268L755K674N431L458
$$ plain form
10732 69217 75071 84046 91541 99425 112515 128799 149640 179303 215405 258083 317913 401902
10720 401902 523638 712894 989614 1319417 1571968 1569803 1297040 941042 650693 457666
10710 457666 340657 263988 213121 181252 156780 137446 121032 103378 93418 88347 83359 76001
10698 76001 72122 68445 67724 68745 69554 73046 81673 91388 97548 86821 68322 55679 49590 45472
10684 45472 42890 40915 38089 39083 41092 42088 43843 44358 48710 49222 47654 49670 53744 59855 61347
10669 61347 63199 63277 63668 65929 67416 68877 72303 72287 71712 76000 84698 96915 114512 132728 155394
10654 155394 192109 247622 315842 394006 457745 475676 438561 366339 286336 220105 170053
10643 170053 138096 119356 112275 102811 91698 88926 88507 91035 101189 110650 113551 119733 128491
$$ packed form
10732F9217N854Q975P495P884J3090J6284K0841K9663L6102M2678N9830Q3989
10720D01902J21736J89256K76720L29803K52551k165k72763l55998k90349j93027
10710D57666j17009p6669n0867l1869k4472j9334j6414j7654r960n071m988p358
10698G6001l879l677p21J021Q09L492Q627R715O160j0727j8499j2643o089m118
10684D5472k582j975k826R94K009R96J755N15M352N12j568K016M074O111J492
10669F1347J852P8L91K261J487J461L426j6n75M288Q698J2217J7597J8216K2666
10654A55394L6715N5513O8220P8164O3739J7931l7115p2222q0003o6231n0052
10643A70053l1957j8740p081r464j1113k772m19K528J0154R461K901O182Q758
$$ plain form
10630 128491 143056 165223 198833 241396 295812 373760 473796 588342 714231 841581 947952
10619 947952 1004343 1011679 985553 909499 784493 648155 521145 407901 312030 241674 191915
10608 191915 160605 134825 119347 108910 95046 85512 77796 72841 71032 69789 65858 65374 66236
10595 66236 66853 66819 60863 56926 57462 59923 58199 55704 52971 47851 45534 45086 46638 45638 44312 46183
10579 46183 47777 49482 52734 53448 51402 48089 47453 45708 44923 43322 43314 44577 44326 43994 45779 44296
10563 44296 43578 47799 50279 49588 50754 51394 49464 44203 37563 34247 34249 34750 36815 34974 33791 35909
10547 35909 41865 44940 45195 42313 38492 32941 28982 26259 24366 25869 28733 29301 31183 33323 37364
10532 37364 42015 43715 43610 43364 42550 41649 42132 40765 36796 38849 39715 36038 32350 32022 34918 39334
$$ packed form
10630A28491J4565K2167L3610M2563N4416P7948J00036J14546J25889J27350J06371
10619I47952N6391P336k6126p6054j25006j36338j27010j13244r5871p0356m9759
10608A91915l1310k5780j5478j0437j3864r534p716m955j809j243l931m84Q62
10595F6236O17l4n956l937N36K461j724k495k733n120k317m48J552j000j326J871
10579D6183J594J705L252P14k046l313o36j745p85j601qJ263k51l32J785j483
10563D4296p18M221K480o91J166O40j930n261o640l316KN01K065j841j183K118
10547C5909N956L075K55k882l821n551l959k723j893J503K864N68J882K140M041
10532C7364M651J700j05k46q14r01M83j367l969K053Q66l677l688l28K896M416
$$ plain form
10516 39334 41577 41044 38050 34317 31992 33336 29934 29918 30277 29864 30579 27818 29572 37768 43529 41810
10500 41810 41073 39917 42274 44477 41261 37374 38672 39422 40507 42638 45352 46414 45057 44497 45461
10485 45461 48520 51494 54409 57731 62232 61635 58025 57109 58552 55234 51319 47560 46532 51716 56070
10470 56070 59790 56574 52246 54357 56101 56971 60444 64136 63206 70625 86014 107132 134844 166731
10456 166731 201018 228090 248509 255562 235886 199581 163885 131691 105727 89348 80918 71342
10444 71342 60988 59356 57276 57298 61352 64475 67640 68459 68334 72976 72580 69117 67854 67943 66247 69016
10428 69016 70352 70893 76124 82539 85980 85602 84286 83008 81163 79829 82423 77671 73020 71040 68907
10413 68907 70061 72709 72279 69523 62356 55756 53097 44678 43739 48714 55129 58915 66728 69739 63043
$$ packed form
10516C9334K243n33k994l733k325J344l402j6L59m13P15k761J754Q196N761j719
10500D1810p37j156K357K203l216l887J298P50J085K131K714J062j357n60R64
10485D5461L059K974K915L322M501n97l610r16J443l318l915l759j028N184M354
10470E6070L720l216m328K111J744Q70L473L692r30P419J5389K1118K7712L1887
10456A66731L4287K7072K0419P053j9676l6305l5696l2194k5964j6379q430r576
10444G1342j0354j632k080K2M054L123L165Q19j25M642l96l463j263Q9j696K769
10428F9016J336N41N231O415L441l78j316j278j845j334K594m752m651j980k133
10413F8907J154K648m30k756p167o600k659q419r39M975O415L786P813L011o696
$$ plain form
10398 63043 51580 48108 49451 50045 48776 47848 44577 42173 46057 50912 59937 65981 62866 60356 58994
10383 58994 56326 54284 55608 62959 74046 79682 79413 79016 79340 81134 78975 76563 73276 72435 66952
10368 66952 59392 53080 50261 52727 59049 61516 60384 60401 62019 61423 59071 59308 58474 53269 37068
10353 37068 15214 7919 15669 33095 51461 65685 77522 83921 87839 93230 100529 108169 117946
10340 117946 124686 132345 140425 143251 143584 143527 137212 128530 125550 128861 145298 172649 203143 223102
10326 223102 225723 207431 183253 168731 160812 155041 148985 144682 145059 147131 155214 160334 165637 167855
10312 167855 164606 161241 159855 164072 169498 169792 169575 168087 168817 174957 181340 182596 184834 194292 206248
10297 206248 214509 219264 222688 228654 235164 237123 236658 236596 241766 246817 249383 248469 250268 251958 259626
$$ packed form
10398F3043j1463l472J343N94j269r28l271k404L884M855R025O044l115k510j362
10383E8994k668k042J324P351J1087N636k69l97L24J794k159k412l287q41n483
10368F6952p560o312k819K466O322K467j132J7J618n96k352K37q34n205j6201
10353C7068k1854p295P750J7426J8366J4224J1837O399L918N391P299P640R777
10340A17946O740P659Q080K826L33n7o315q682k980L311J6437K7351L0494J9959
10326B23102K621j8292k4178j4522p919n771o056m303L77K072Q083N120N303K218
10312A67855l249l365j386M217N426K94k17j488P30O140O383J256K238R458J1956
10297B06248Q261M755L424N966O510J959m65o2N170N051K566r14J799J690P668
$$ plain form
10282 259626 266905 279637 301768 320943 334185 344203 353698 365959 375491 381512 378743 377654 383429
10269 383429 392916 412386 432199 440796 445774 453813 461723 473637 484955 502497 524174 557228
10257 557228 600325 642264 679535 715494 757061 803554 837279 847004 839387 827908 834813 861798
10245 861798 894293 927405 962104 1004078 1063219 1136232 1224792 1327171 1433947 1538344 1641119
10234 1641119 1752441 1875234 2010928 2154995 2311439 2494946 2727618 3014966 3348511
10225 3348511 3729981 4182172 4737338 5389988 6114930 6901691 7740792 8684104 9817777
10216 9817777 11208925 12959995 15253069 18227483 21838205 26057147 31314659 38401245
10208 38401245 48227722 62124935 82291461 112231986 156119667 213551831 266026380
$$ packed form
10282B59626P279J2732K2131J9175J3242J0018R495J2261R532O021k769j089N775
10269C83429R487J9470J9813Q597M978Q039P910J1914J1318J7542K1677L3054
10257E57228M3097M1939L7271L5959M1567M6493L3725R725p617j1479O905K6985
10245H61798L2495L3112L4699M1974N9141P3013Q8560J02379J06776J04397J02775
10234A641119J11322J22793J35694J44067J56444J83507K32672K87348L33545
10225C348511L81470M52191N55166O52650P24942P86761Q39101R43312J133673
10216I817777J391148J751070K293074K974414L610722M218942N257512P086586
10208C8401245R826477J3897213K0166526K9940525M3887681N7432164N2474549
$$ plain form
10201 266026380 276973935 233030378 167239357 112000010 75448385 52957544 38986587
10194 38986587 30032464 24152476 20200029 17421737 15191410 13115293 11266244 9802410
10186 9802410 8703635 7831211 7115328 6557146 6144790 5879001 5814302 5987014 6307171
10177 6307171 6384046 5783648 4801226 3933390 3310778 2872975 2564034 2356943 2219275 2138742
10167 2138742 2101992 2074399 2045791 2048212 2075212 2060382 1951756 1810789 1695916 1579848 1441808
10156 1441808 1303210 1171654 1049884 935799 847708 793258 764397 746151 729770 723784 729308
10145 729308 736946 722831 685780 643791 609176 583333 557482 529693 504990 486701 476671 475324
10133 475324 471843 457296 436589 416355 403824 396855 395558 388745 375172 358218 339285 333131
$$ packed form
10201B66026380J0947555m3943557o5791021n5239347l6551625k2490841j3970957
10194C8986587q954123n879988l952447k778292k230327k076117j849049j463834
10186I802410j098775q72424p15883n58182m12356k65789o4699J72712L20157
10177F307171P6875o00398r82422q67836o22612m37803l08941k07091j37668q0533
10167B138742l6750k7593k8608K421K7000j4830j08626j40967j14873j16068j38040
10156A441808j38598j31556j21770j14085q8091n4450k8861j8246j6381n986N524
10145G29308P638j4115l7051m1989l4615k5843k5851k7789k4703j8289j0030j347
10133D75324l481j4547k0707k0234j2531o969j297o813j3573j6954j8933o154
$$ plain form
10121 333131 335635 335369 334487 328485 319589 305620 294729 291637 291283 289428 285934 281472 276856 271228
10107 271228 264084 255739 248293 241832 237400 229781 220192 215769 216170 215283 210487 203892 201099 202389 199375
10092 199375 196508 193337 188126 189346 197700 207548 214900 225619 233705 233880 224498 215857 210904 205906
10078 205906 199442 182536 170931 177420 201768 244969 262113 240904 209839 182700 162597 146914
10066 146914 137641 135412 134584 130762 131371 131589 131781 130647 130808 137700 139047 144012 155833 168460 180806
10051 180806 187611 182369 161814 139047 129064 131724 135334 127947 118921 118840 117288 116031 115112 115906 118819
10036 118819 117886 114918 109336 102420 95126 92394 91939 90294 88609 90423 89680 83083 82398 90192 97597
10021 97597 101265 100862 97043 89583 80682 77117 80782 86634 93113 96922 93811 87474 85306 84581 84168
$$ packed form
10121C33131K504k66q82o002q896j3969j0891l092l54j855l494m462m616n628
10107B71228p144q345p446o461m432p619r589m423M01q87m796o595k793J290l014
10092A99375k867l171n211J220Q354R848P352J0719Q086J75r382q641m953m998
10078B05906o464j6906j1605O489K4348M3201J7144k1209l1065k7139k0103j5683
10066A46914r273k229q28l822O09K18J92j134J61O892J347M965J1821J2627J2346
10051A80806O805n242k0555k2767r983K660L610p387r026q1j552j257r19P94K913
10036A18819r33k968n582o916p294k732m55j645j685J814p43o597o85P794P405
10021I7597L668m03l819p460q901l565L665N852O479L809l111o337k168p25m13
$$ plain form
10006 84168 80234 73820 68939 63126 62802 64906 69129 70628 71834 70415 68670 67656 64838 56757 49045
9991 49045 45346 41055 36738 33799 35893 31355 31505 31622 30953 27566 26286 24685 24329 25734 27002 29877
9975 29877 33542 36506 39503 43490 47007 43714 40233 37384 40019 46297 49514 47146 45883 45187 49232
9960 49232 52291 51478 47338 42471 37056 38492 40771 37339 39907 45486 48836 50364 45967 46914 53818
9945 53818 54169 51921 49766 50045 51282 51071 51152 49405 49574 47850 43825 38924 33961 29341 28176 30868
9929 30868 28394 29625 29847 22184 22029 25602 30255 33741 35385 32629 29133 29754 32154 37716 38802
9914 38802 39146 37103 36952 38590 39776 37440 36597 41712 44464 45353 42976 42108 43366 44579 46224 51593
9898 51593 52951 48526 44726 42451 44267 45681 50372 49488 45015 39601 40198 44272 45093 50164 54282
$$ packed form
10006H4168l934o414m881n813l24K104M223J499J206j419j745j014k818q081p712
9991D9045l699m291m317k939K094m538J50J17o69l387j280j601l56J405J268K875
9975B9877L665K964K997L987L517l293l481k849K635O278L217k368j263o96M045
9960D9232L059q13m140m867n415J436K279l432K568N579L350J528m397R47O904
9945E3818L51k248k155K79J237k11Q1j747J69j724m025m901m963m620j165K692
9929C0868k474J231K22p663j55L573M653L486J644k756l496O21K400N562J086
9914C8802L44k043j51J638J186k336q43N115K752Q89k377q68J258J213J645N369
9898E1593J358m425l800k275J816J414M691q84m473n414N97M074Q21N071M118
$$ plain form
9883 54282 60751 65382 65963 63476 59651 58229 58763 59793 60651 58896 58646 59094 57783 56098 55134 53516
9867 53516 51891 51527 53486 54187 51298 47345 44982 48206 52112 50224 50156 56669 63315 64153 63298 61254
9851 61254 59561 58428 59531 60640 55613 47538 42946 39114 34801 31948 32644 32606 32226 30943 33202 34924
9835 34924 35171 35085 36383 38208 40036 42394 46168 47401 52764 55213 55452 56383 57585 56998 55639 56826
9819 56826 59408 62001 63418 57653 51212 47521 45495 47695 45773 48045 50047 50266 50895 56262 61548
9804 61548 63900 68323 71782 76576 84646 98636 110457 121438 130948 136157 141864 148250 160871 175717
9790 175717 196559 219294 244364 272228 319328 390485 483691 593957 713641 841447 952940
9779 952940 1009562 1010356 980185 905776 781517 646789 525306 421619 329695 257991 211693
$$ packed form
9883E4282O469M631N81k487l825j422N34J030Q58j755k50M48j311j685r64j618
9867E3516j625l64J959P01k889l953k363L224L906j888o8O513O646Q38q55k044
9851F1254j693j133J103J109n027q075m592l832m313k853O96l8l80j283K259J722
9835C4924K47q6J298J825J828K358L774J233N363K449K39R31J202n87j359J187
9819E6826K582K593J417n765o441l691k026K200j922K272K002K19O29N367N286
9804F1548K352M423L459M794Q070J3990J1821J0981R510N209N707O386J2621J4846
9790A75717K0842K2735K5070K7864M7100P1157R3206J10266J19684J27806J11493
9779I52940N6622P94l0171p4409j24259j34728j21483j03687r1924p1704m6298
$$ plain form
9768 211693 182860 164631 149734 140365 133144 125400 116116 106478 95378 86099 76315 67234 64256
9755 64256 67064 70442 71628 72600 68955 65528 63899 62688 59022 56666 58771 60826 63092 65602 64566
9740 64566 67390 71720 69091 67074 63890 64724 69667 65944 62718 63904 62181 55797 50942 44932 39792
9725 39792 42961 45810 46399 49320 49221 48335 44355 43511 46233 51008 60203 64442 67705 70371 73216 75074
9709 75074 71534 71007 69764 74324 75479 72981 69304 66588 62308 56725 52245 49608 50827 47159 40084
9694 40084 37209 34441 31434 32897 30164 26684 30630 31663 32464 35627 37784 37111 38421 38253 36132
9679 36132 35281 36835 37820 39160 40304 40337 39912 41605 39413 37170 37960 37151 35154 33121 30529 31605
9663 31605 29185 29518 33310 34382 37385 38125 36204 33586 35196 40764 44078 45743 43600 41033 39101
$$ packed form
9768B11693k8833j8229j4897r369p221p744r284r638j1100r279r784r081k978
9755F4256K808L378J186R72l645l427j629j211l666k356K105K055K266K510j036
9740F4566K824M330k629k017l184Q34M943l723l226J186j723o384m855o010n140
9725C9792L169K849N89K921r9q86l980q44K722M775R195M239L263K666K845J858
9709G5074l540n27j243M560J155k498l677k716m280n583m480k637J219l668p075
9694D0084k875k768l007J463k733l480L946J033Q01L163K157o73J310j68k121
9679C6132q51J554R85J340J144L3m25J693k192k243P90q09j997k033k592J076
9663C1605k420L33L792J072L003P40j921k618J610N568L314J665k143k567j932
$$ plain form
9648 39101 42052 45947 47683 43393 41567 43553 43116 45060 44198 41434 43065 43647 44166 46312 45726 47641
9632 47641 48195 48365 51561 51656 51475 54941 57202 56673 58657 60661 60963 63825 63840 64093 65156 63400 61977
9615 61977 63241 65492 70568 71813 73893 78823 82134 86599 86236 82075 78894 78567 80119 79478 76501
9600 76501 80020 80930 80582 84905 84079 81994 80224 83746 88739 92124 95850 96781 95252 90734 90307 89508
9584 89508 92165 96898 100673 101003 99591 96019 92304 88514 82705 82474 83899 84461 82038 79730 80754
9569 80754 82162 83680 83195 84668 84617 85052 84033 84818 90563 93549 93467 92590 89625 88626 92179 94568 96149
9552 96149 96670 95869 91801 89475 88222 89210 91637 91617 94352 99393 105840 108868 112134 115295 114707 113018
9536 113018 112639 113737 114545 119122 125514 130194 133935 141756 149633 155886 160397 161336 161597 161894 156222 152402
$$ packed form
9648C9101K951L895J736m290j826J986m37J944q62k764J631N82N19K146n86J915
9632D7641N54J70L196R5j81L466K261n29J984K004L02K862J5K53J063j756j423
9615F1977J264K251N076J245K080M930L311M465l63m161l181l27J552o41k977
9600G6501L519R10l48M323q26k085j770L522M993L385L726R31j529m518m27p99
9584H9508K657M733L775L30j412l572l715l790n809k31J425N62k423k308J024
9569H0754J408J518m85J473n1M35j019P85N745K986q2q77k965r99L553K389J581
9552I6149N21q01m068k326j253R88K427k0K735N041O447L028L266L161n88j689
9536A13018l79J098Q08M577O392M680L741P821P877O253M511R39K61K97n672l820
$$ plain form
9520 152402 151458 156573 166756 173065 180437 188037 195019 200105 204771 207121 213541 221919 236330 248025
9506 248025 263686 281027 295638 311499 337769 369153 402201 445103 493264 540683 593270 658482
9494 658482 740532 844287 977990 1139926 1327847 1551355 1824415 2179817 2647607 3255768
9484 3255768 3991283 4771754 5431030 5819921 5908022 5771702 5479246 5017546 4385092 3668808
9474 3668808 3003313 2473039 2070519 1777056 1573219 1447873 1386662 1382150 1428379 1521928
9464 1521928 1666909 1855275 2093414 2402309 2795847 3263167 3756428 4230246 4651700 4994209
9454 4994209 5226357 5305181 5245069 5072764 4779042 4344664 3825616 3296176 2801932 2370939
9444 2370939 2015078 1735870 1534391 1392228 1297475 1236758 1206720 1211056 1249100 1326304 1444715
$$ packed form
9520A52402r44N115J0183O309P372P600O982N086M666K350O420Q378J4411J1695
9506B48025J5661J7341J4611J5861K6270L1384L3048M2902M8161M7419N2587O5212
9494F58482Q2050J03755J33703J61936J87921K23508K73060L55402M67790O08161
9484C255768P35515P80471O59276L88891Q8101j36320k92456m61700o32454p16284
9474C668808o65495n30274m02520k93463k03837j25346o1211m512M6229R3549
9464A521928J44981J88366K38139L08895L93538M67320M93261M73818M21454L42509
9454D994209K32148P8824o0112j72305k93722m34378n19048n29440m94244m30993
9444B370939l55861k79208k01479j42163r4753o0717l0038M336L8044P7204J18411
$$ plain form
9433 1444715 1607837 1817850 2085252 2417025 2816248 3286072 3803821 4340140 4854450 5299679
9423 5299679 5605899 5700741 5556663 5224309 4769290 4223543 3647286 3126628 2720546 2436795
9413 2436795 2251555 2144077 2106513 2131647 2226706 2400695 2660756 3011820 3463930 4028605
9403 4028605 4721076 5548557 6498988 7548902 8649915 9766580 10860259 11821549 12453821
9394 12453821 12554427 12074472 11190797 10151779 9105413 8079265 7046145 6034327 5112963
9385 5112963 4339536 3732633 3278453 2950199 2729723 2612894 2588874 2653815 2804047 3040915
9375 3040915 3363651 3784840 4336613 5044733 5870640 6696517 7395302 7886025 8127525 8071408
9365 8071408 7703855 7092012 6340966 5530353 4722144 3978300 3341130 2827314 2433294 2144409
$$ packed form
9433A444715J63122K10013K67402L31773L99223M69824N17749N36319N14310M45229
9423E299679L06220R4842j44078l32354m55019n45747n76257n20658m06082k83751
9413B436795j85240j07478l7564K5134R5059J73989K60061L51064M52110N64675
9403D028605O92471Q27481R50431J049914J101013J116665J093679R61290O32272
9394A2453821J00606m79955q83675j039018j046366j026148j033120j011818r21364
9385E112963p73427o06903m54180l28254k20476j16829k4020O4941J50232K36868
9375C040915L22736M21189N51773P08120Q25907Q25877O98785M90723K41500n6117
9365H071408l67553o11843p51046q10613q08209p43844o37170n13816l94020k88885
$$ plain form
9355 2144409 1943899 1811914 1740672 1721141 1744235 1814519 1928698 2091507 2315533 2613812
9345 2613812 3004550 3482248 4043935 4677290 5363125 6063203 6695130 7172001 7451425 7548989
9335 7548989 7451317 7128417 6627218 6030250 5380856 4691891 4005332 3397027 2921518 2572979
9325 2572979 2328112 2161050 2059312 2021110 2053234 2162661 2359476 2650040 3047376 3566563
9315 3566563 4226251 5037249 5941846 6798272 7442964 7816667 7964563 7882400 7470141 6671792
9305 6671792 5604480 4505287 3566730 2853822 2338202 1963801 1676815 1440509 1244945
9296 1244945 1075461 934027 820891 729080 651674 589265 537363 486974 440791 403576 376307
9285 376307 353243 331790 308090 290951 276003 262622 250352 236080 223811 215768 204113 191479
$$ packed form
9355B144409k00510j31985p1242j9531K3094P0284J14179J62809K24026K98279
9345B613812L90738M77698N61687O33355O85835P00078O31927M76871K79424R7564
9335G548989r7672l22900n01199n96968o49394o88965o86559o08305m75509l48539
9325B572979k44867j67062j01738l8202L2124J09427J96815K90564L97336N19187
9315C566563O59688Q10998R04597Q56426O44692L73703J47896q2163m12259p98349
9305F671792j067312j099193r38557p12908n15620l74401k86986k36306j95564
9296A244945j69484j41434j13136r1811p7406o2409n1902n0389m6183l7215k7269
9285C76307k3064k1453k3700j7139j4948j3381j2270j4272j2269q043j1655j2634
$$ plain form
9273 191479 185118 183515 181282 180605 180857 177885 175650 170882 164106 159484 152605 147450 148175 147104 143920
9258 143920 142913 142885 142712 141291 134449 126954 123048 123061 121485 122493 122843 121135 120133 117811 119895 122940
9242 122940 118433 118127 119866 118565 119633 116366 116321 112560 106740 103451 108941 115792 120472 122135 123826
9227 123826 125362 125931 127177 123735 122144 125165 127732 125050 119470 111615 104392 99809 97031 97763 98744
9212 98744 97257 96047 94851 96781 94966 97138 100557 101960 99987 98891 92088 88066 90286 92009 88941
9197 88941 81966 79780 79149 80915 87096 91494 96728 101027 99213 101202 102039 102258 101098 102111 102900 97984
9181 97984 93330 86863 83844 82213 82229 83545 80026 78916 80734 81260 79146 80566 84494 88893 94414
9166 94414 94886 92943 98283 102802 102175 105145 105791 107701 110993 116548 124408 133141 144435 157099 177379
$$ packed form
9273A91479o361j603k233o77K52k972k235m768o776m622o879n155P25j071l184
9258A43920j007k8j73j421o842p495l906J3j576J008L50j708j002k322K084L045
9242A22940m507l06J739j301J068l267m5l761n820l289N490O851M680J663J691
9227A23826J536N69J246l442j591L021K567k682n580p855p223m583k778P32R81
9212I8744j487j210j196J930j815K172L419J403j973j096o803m022K220J723l068
9197H8941o975k186o31J766O181M398N234M299j814J989Q37K19j160J013P89m916
9181I7984m654o467l019j631J6J316l519j110J818N26k114J420L928M399N521
9166I4414M72j943N340M519o27K970O46J910L292N555P860Q733J1294J2664K0280
$$ plain form
9151 177379 194927 206211 205824 201714 193577 183828 177697 164632 145952 130356 120458 115495 112269
9138 112269 107349 102109 96806 97003 99577 99291 100989 105849 109482 117769 124720 130992 136797 143369 151774
9123 151774 159573 161737 162211 161780 155319 151497 150547 148820 151708 151799 154292 158886 165599 175544 182623 182241
9107 182241 177528 172401 170110 167012 167739 165193 158397 154122 156189 162245 169062 174204 181042 194263
9093 194263 209534 223011 233904 237286 232225 224458 214204 203218 199396 194411 189795 186104 181694
9080 181694 178591 180256 182694 185752 186683 190787 203816 221228 248181 277086 305082 328652 358123
9067 358123 382579 398533 392499 373721 359687 347789 343509 343277 337980 326033 307361 290385 278758
9054 278758 274345 276691 280440 288767 296247 303949 304930 305400 312243 316196 315740 314094 306834 297086 297633
$$ packed form
9151A77379J7548J1284l87m110q137r749o131j3065j8680j5596r898m963l226
9138A12269m920n240n303J97K574k86J698M860L633Q287O951O272N805O572Q405
9123A51774P799K164M74m31o461l822r50j727K888R1K493M594O713R945P079l82
9107A82241m713n127k291l098P27k546o796m275K067O056O817N142O838J3221
9093A94263J5271J3477J0893L382n061p767j0254j0986l822m985m616l691m410
9080A81694l103J665K438L058R31M104J3029J7412K6953K8905K7996K3570K9471
9067C58123K4456J5954o034j8778j4034j1898m280k32n297j1947j8672j6976j1627
9054B78758m413K346L749Q327P480P702R81M70O843L953m56j646p260r748N47
$$ plain form
9039 297633 292955 289621 289531 292671 296994 307458 323640 344422 373895 408554 443832 480471 518024
9026 518024 553866 586273 610796 619158 625952 646183 669886 697807 742007 797517 865736 939333
9014 939333 1024345 1124301 1252778 1425222 1645100 1919715 2247444 2618533 3030534 3499012
9004 3499012 4037146 4609968 5137695 5527561 5745946 5828628 5848520 5877223 5986200 6223959
8994 6223959 6550582 6849833 6976287 6856229 6513981 6090923 5739181 5571746 5620158 5855937
8984 5855937 6204111 6554159 6825064 6968310 6990068 6939323 6865386 6849479 7010784 7439245
8974 7439245 8103690 8861847 9517635 9923153 10013306 9775351 9266563 8591184 7895515 7338722
8964 7338722 7003236 6876362 6883498 6965296 7086688 7184101 7154520 6936579 6583020 6227343
$$ packed form
9039B97633m678l334r0L140M323J0464J6182K0782K9473L4659L5278L6639L7553
9026E18024L5842L2407K4523Q362O794K0231K3703K7921M4200N5510O8219P3597
9014I39333Q5012R9956J28477J72444K19878K74615L27729L71089M12001M68478
9004C499012N38134N72822N27727L89866K18385Q2682J9892K8703J08977K37759
8994F223959L26623K99251J26454j20058l42248m23058l51742j67435M8412K35779
8984E855937L48174L50048K70905J43246K1758n0745p3937j5907J61305M28461
8974G439245O64445P58157O55788M05518R0153k37955n08788o75379o95669n56793
8964G338722l35486j26874P136Q1798J21392R7413k9581k17941l53559l55677
$$ plain form
8954 6227343 5999801 5963944 6083693 6273306 6434174 6500156 6461781 6347395 6201223 6064332
8944 6064332 5975090 5922103 5868040 5815678 5771406 5691392 5490869 5135326 4646474 4079621 3509726
8933 3509726 2990524 2547670 2199736 1947412 1772069 1661603 1598270 1572083 1581101 1631138
8923 1631138 1732690 1902906 2149686 2472678 2856474 3279300 3707588 4078054 4333267 4441891
8913 4441891 4428383 4372080 4317965 4279553 4256540 4274989 4344234 4438924 4507698 4514768 4449235 4319986
8901 4319986 4187815 4120222 4175420 4355123 4614084 4866668 5012441 5016532 4938657 4862203 4816785
8890 4816785 4806417 4881461 5096882 5461096 5902997 6319771 6628526 6772283 6694934 6384410
8880 6384410 5895112 5344183 4875736 4590918 4503752 4541399 4611195 4661923 4657201 4564553 4379372
$$ packed form
8954F227343k27542l5857J19749J89613J60868O5982l8375j14386j46172j36891
8944F064332q9242n2987n4063n2362m4272q0014k00523l55543m88852n66853n69895
8933C509726n19202m42854l47934k52324j75343j10466o3333k6187R018N0037
8923A631138J01552J70216K46780L22992L83796M22826M28288L70466K55213J08624
8913D441891j3508n6303n4115l8412k3013J8449O9245R4690O8774P070o5533j29249
8901D319986j32171o7593N5198J79703K58961K52584J45773M091p7875p6454m5418
8890D816785j0368P5044K15421L64214M41901M16774L08755J43757p7349l10524
8880F384410m89298n50929m68447k84818q7166L7647O9796N0728m722r2648j85181
$$ plain form
8869 4379372 4144752 3922398 3782477 3778659 3925212 4187765 4487770 4721364 4807290 4715514
8859 4715514 4494576 4239727 4040453 3925728 3858573 3779374 3650095 3452784 3170805 2819879
8849 2819879 2451810 2114927 1828272 1588059 1390134 1239403 1139418 1081438 1055988 1060113
8839 1060113 1101794 1191090 1341884 1573618 1928705 2482725 3312344 4374229 5241652 5153447
8829 5153447 4107556 2913218 2022803 1457603 1105374 882447 732396 628403 552259
8820 552259 502364 464638 432527 398710 362101 335086 311846 287232 264344 246842 231606 217448
8808 217448 208017 202673 195831 188448 184692 182694 178921 175844 172518 170282 171503 173770 172131 170620
8794 170620 168077 164787 160326 157823 156651 154887 159297 163560 161702 161801 161296 160365 156688 153976 150135
$$ packed form
8869D379372k34620k22354j39921l818J46553K62553L00005K33594Q5926r1776
8859D715514k20938k54849j99274j14725o7155p9199j29279j97311k81979l50926
8849B819879l68069l36883k86655k40213j97925j50731r9985n7980k5450M125
8839A060113M1681Q9296J50794K31734L55087N54020Q29619J061885Q67423q8205
8829E153447j045891j194338q90415n65200l52229k22927j50051j03993p6144
8820E52259m9895l7726l2111l3817l6609k7015k3240k4614k2888j7502j5236j4158
8808B17448r431n344o842p383l756j998l773l077l326k236J221K267j639j511
8794A70620k543l290m461k503j172j764M410M263j858R9n05r31l677k712l841
$$ plain form
8779 150135 150124 151792 148469 143999 138092 138195 135316 131448 132968 138554 137394 135785 137703 132142 129733
8764 129733 127154 127882 129605 128009 127318 126410 127157 128039 130745 134461 140661 143926 148921 155615 157423 157609
8748 157609 156461 154539 152451 152812 155183 155846 158042 159587 161359 165905 170860 174334 177886 182440 188164
8733 188164 191123 190619 183638 177491 171508 168500 164244 159608 148113 137551 129623 122735 120387 119054
8719 119054 116900 115244 117028 114753 113269 114730 112053 114685 116122 117291 119014 120757 121091 124693 126282
8704 126282 130082 134222 133729 137220 144075 146853 143618 137469 134853 135190 135336 130510 128346 128279 128826 131457
8688 131457 132242 133138 134232 133523 135724 136515 135812 132910 125527 119983 118347 115016 114904 118082 117735 120038
8672 120038 120656 121659 122263 126559 124912 126980 129883 132567 133157 134467 137952 138451 141207 143937 147121
$$ packed form
8779A50135j1J668l323m470n907J03k879l868J520N586j160j609J918n561k409
8764A29733k579P28J723j596o91r08P47Q82K706L716O200L265M995O694J808J86
8748A57609j148j922k088L61K371O63K196J545J772M546M955L474L552M554N724
8733A88164K959n04o981o147n983l008m256m636j1495j0562p928o888k348j333
8719A19054k154j656J784k275j484J461k677K632J437J169J723J743L34L602J589
8704A26282L800M140m93L491O855K778l235o149k616L37J46m826k164o7N47K631
8688A31457P85Q96J094p09K201P91p03k902p383n544j636l331j12L178l47K303
8672A20038O18J003O04M296j647K068K903K684N90J310L485M99K756K730L184
$$ plain form
8657 147121 143047 143111 146631 148611 149179 146577 146701 145886 144903 144304 144739 142237 142434 140514 141503 139424 140108
8640 140108 141082 139811 139423 136994 137164 137551 135843 135417 136941 139015 136987 135634 137577 138959 140031 142114
8624 142114 142409 143530 144862 143016 140219 143722 147075 148910 151275 155529 158928 160524 159897 164478 165120
8609 165120 166028 167550 169468 171351 176829 181841 188202 192508 194304 195547 191419 190405 191392 190353 193880
8594 193880 196337 199435 202963 205951 210367 211649 213272 214311 215221 218931 225648 232629 235948 238986 242870
8579 242870 245482 245504 243833 246739 250934 253350 262785 270765 282733 295306 310971 330068 346825 361325
8565 361325 375241 390068 401725 404521 400011 391840 372106 354626 341921 324272 304765 292070
8553 292070 285561 282269 284897 286898 288749 292692 291860 283834 274327 274159 279009 280658 281993 281772 284549
$$ packed form
8657A47121m074O4L520J980N68k602J24q15r83n99M35k502J97j920R89k079O84
8640A40108R74j271l88k429J70L87j708m26J524K074k028j353J943J382J072K083
8624A42114K95J121J332j846k797L503L353J835K365M254L399J596o27M581O42
8609A65120R08J522J918J883N478N012O361M306J796J243m128j014R87j039L527
8594A93880K457L098L528K988M416J282J623J039R10L710O717O981L319L038L884
8579B42870K612K2j671K906M195K416R435P980J1968J2573J5665J9097J6757J4500
8565C61325J3916J4827J1657K796m510q171j9734j7480j2705j7649j9507j2695
8553B92070o509l292K628K001J851L943q32q026r507j68M850J649J335k21K777
$$ plain form
8538 284549 286597 288167 289703 293372 296027 293754 288714 284474 284159 287881 289416 289911 294021 294730 297549
8523 297549 304138 308442 311714 317927 325031 329602 337665 346721 352257 354247 358678 361725 367071 369809
8509 369809 372241 376365 382916 387083 392344 395859 398651 400487 404065 408720 415345 425884 434890 436635
8495 436635 439463 443771 445321 449905 451224 453596 458008 469001 480902 492608 503584 517223 530480
8482 530480 537799 542174 543277 546400 551042 553961 561715 565499 575519 588987 600419 614156 627331
8469 627331 636479 643875 656030 670737 692498 720238 749821 783675 815660 845912 873960 899667
8457 899667 923418 944402 949391 947135 939675 929040 917162 904062 895680 892546 894121 894847 901380
8444 901380 911320 920014 933133 949714 968309 988878 1007636 1022946 1038356 1057363 1078080 1101308
$$ packed form
8538B84549K048J570J536L669K655k273n040m240l15L722J535M95M110P09K819
8523B97549O589M304L272O213P104M571Q063R056N536J990M431L047N346K738
8509C69809K432M124O551M167N261L515K792J836L578M655O625J0539R006J745
8495D36635K828M308J550M584J319K372M412J0993J1901J1706J0976J3639J3257
8482E30480P319M375J103L123M642K919P754L784J0020J3468J1432J3737J3175
8469F27331R148P396J2155J4707K1761K7740K9583L3854L1985L0252K8048K5707
8457H99667K3751K0984M989k256p460j0635j1878j3100q382l134J575P26O533
8444I01380R940Q694J3119J6581J8595K0569J8758J5310J5410J9007K0717K3228
$$ plain form
8432 1101308 1124488 1147090 1169992 1192320 1212619 1234002 1259599 1285302 1311559 1341110 1371011
8421 1371011 1401735 1434140 1467054 1505486 1541360 1569346 1599792 1634863 1674545 1712632 1751323
8410 1751323 1793514 1839339 1884977 1928876 1978203 2033250 2087996 2142055 2201405 2264995 2327185
8399 2327185 2392075 2458523 2524574 2595394 2665836 2741367 2820667 2905649 2992396 3080513 3171899
8388 3171899 3265535 3368088 3472127 3580813 3693360 3804000 3919730 4047252 4177701 4306159
8378 4306159 4439832 4576417 4721676 4871775 5023461 5179269 5343005 5510042 5676475 5845026
8368 5845026 6018480 6196705 6374597 6554623 6730496 6905269 7081937 7257544 7430634 7598285
8358 7598285 7762319 7915220 8063958 8202187 8330398 8450796 8558845 8650948 8729653 8790408
$$ packed form
8432A101308K3180K2602K2902K2328K0299K1383K5597K5703K6257K9551K9901
8421A371011L0724L2405L2914L8432L5874K7986L0446L5071L9682L8087L8691
8410A751323M2191M5825M5638M3899M9327N5047N4746N4059N9350O3590O2190
8399B327185O4890O6448O6051P0820P0442P5531P9300Q4982Q6747Q8117R1386
8388C171899R3636J02553J04039J08686J12547J10640J15730J27522J30449J28458
8378D306159J33673J36585J45259J50099J51686J55808J63736J67037J66433J68551
8368E845026J73454J78225J77892J80026J75873J74773J76668J75607J73090J67651
8358G598285J64034J52901J48738J38229J28211J20398J08049R2103P8705O0755
$$ plain form
8348 8790408 8835833 8865064 8877245 8872429 8849380 8807678 8750863 8678460 8590773 8491749 8378526
8337 8378526 8254605 8116896 7967279 7811738 7651599 7483494 7308833 7131856 6951420 6769490
8327 6769490 6590044 6412533 6236979 6056620 5878591 5706331 5533982 5361230 5198722 5041064
8317 5041064 4885280 4734691 4585989 4439067 4301037 4167123 4039389 3913809 3792574 3674598
8307 3674598 3563950 3458375 3356734 3255137 3154116 3058970 2968945 2880233 2796955 2716510
8297 2716510 2634660 2559816 2488816 2422061 2353080 2288289 2228399 2172397 2116181 2059422 2001248
8286 2001248 1949431 1900030 1849090 1803081 1759093 1713171 1667859 1628424 1589094 1551250 1514600
8275 1514600 1479496 1447108 1414420 1382117 1349614 1320642 1293040 1261238 1230685 1207140 1184004
$$ packed form
8348H790408M5425K9231J2181m816k3049m1702n6815p2403q7687r9024j13223
8337H378526j23921j37709j49617j55541j60139j68105j74661j76977j80436j81930
8327F769490j79446j77511j75554j80359j78029j72260j72349j72752j62508j57658
8317E041064j55784j50589j48702j46922j38030j33914j27734j25580j21235j17976
8307C674598j10648j05575j01641j01597j01021r5146r0025q8712q3278q0445
8297B716510q1850p4844p1000o6755o8981o4791n9890n6002n6216n6759n8174
8286B001248n1817m9401n0940m6009m3988m5922m5312l9435l9330l7844l6650
8275A514600l5104l2388l2688l2303l2503k8972k7602l1802l0553k3545k3136
$$ plain form
8264 1184004 1157037 1131185 1109696 1089990 1068593 1046414 1021996 1000018 978045 956293 940471
8253 940471 926253 909969 891937 875525 863069 847369 830300 815941 797948 782339 769105 755369
8241 755369 739957 727028 716980 704208 693258 680398 672292 663741 653939 639496 628159 618127
8229 618127 608633 596830 590068 581323 571753 564151 555679 546405 539692 531590 524932 514760 505683 502236
8215 502236 496633 491178 487509 478575 468728 458272 452235 444525 434438 430513 425904 417476 414797 414205
8201 414205 412085 406423 398018 391865 386487 381282 376052 368161 366526 362691 360259 355008 348466 343001
8187 343001 338665 334839 332598 329028 322630 317756 313072 307637 301359 296562 293681 291823 285120 284786 283696
8172 283696 285089 281115 274781 274512 270556 263184 260042 256814 257537 255832 251800 250250 248459 246746 242702
$$ packed form
8264A184004k6967k5852k1489j9706k1397k2179k4418k1978k1973k1752j5822
8253I40471j4218j6284j8032j6412j2456j5700j7069j4359j7993j5609j3234j3736
8241G55369j5412j2929j0048j2772j0950j2860q106q551r802j4443j1337j0032
8229F18127r494j1803o762q745r570p602q472r274o713q102o658j0172r077l447
8215E02236n603n455l669q934r847j0456o037p710j0087l925m609q428k679n92
8201D14205k120n662q405o153n378n205n230p891j635l835k432n251o542n465
8187C43001m336l826k241l570o398m874m684n435o278m797k881j858o703l34j090
8172B83696J393l974o334k69l956p372l142l228P23j705m032j550j791j713m044
$$ plain form
8157 242702 236131 235920 234215 231107 227100 223861 221270 218341 218636 215863 212838 213894 215070 212409 211494
8142 211494 209552 203895 201091 195141 189966 186693 186474 186103 183831 183004 183362 184881 182948 180154 174461
8127 174461 172147 171432 169304 166702 165773 165878 165436 165185 163493 161486 158409 154849 153447 152330 151964 153442
8111 153442 154123 153023 149963 150993 154324 155420 153500 151205 149290 149245 153671 159174 164781 172409 178089
8096 178089 185285 205376 225150 240828 258604 271844 272955 258344 236161 210838 186600 170124
8084 170124 154768 146271 137471 130986 130162 129278 123605 120892 124666 124714 122524 125098 125667 126573 129609 133374
8068 133374 136063 139203 146231 155265 164206 168229 176868 185537 195395 198590 199606 194383 182526 167163
8054 167163 158427 154299 160456 170064 186879 212263 248428 290280 332137 368635 368966 335988 292013
$$ packed form
8157B42702o571k11j705l108m007l239k591k929K95k773l025J056J176k661r15
8142B11494j942n657k804n950n175l273k19l71k272q27L58J519j933k794n693
8127A74461k314p15k128k602r29J05m42k51j692k007l077l560j402j117l66J478
8111A53442O81j100l060J030L331J096j920k295j915m5M426N503N607P628N680
8096A78089P196K0091J9774J5678J7776J3240J111j4611k2183k5323k4238j6476
8084A70124j5356q497q800o485q24q84n673k713L774M8k190K574N69R06L036L765
8068A33374K689L140P028R034Q941M023Q639Q669R858L195J016n223j1857j5363
8054A67163q736m128O157R608J6815K5384L6165M1852M1857L6498L31l2978m3975
$$ plain form
8041 292013 244571 201447 167466 145307 131003 121421 112987 109043 109437 110441 108410 109671 110324 108616
8027 108616 104335 102608 105263 109409 113988 118746 128079 137542 152095 167164 179559 193921 210138
8014 210138 227295 238696 231427 211382 186528 161527 141380 131237 125378 125204 132713 143087 152095
8001 152095 158917 168002 171978 167980 155748 145847 136472 122227 106367 90696 78809 71168 66887
7988 66887 65946 62554 66399 69325 69203 70321 71355 68657 71316 73222 75704 77743 82225 83245 85599
7973 85599 92882 101936 111441 113839 111992 113386 111175 109488 106382 97171 90424 85540 78111 70140 64789
7958 64789 58950 56402 58577 58607 55499 51857 52440 54489 56306 53288 52088 52414 53648 53052 51551 50305
7942 50305 48696 46868 45668 46589 45491 45312 44631 43295 43980 46265 47886 46137 46481 47341 46837 48378
$$ packed form
8041B92013m7442m3124l3981k2159j4304r582q434l944L94J004k031J261O53j708
8027A08616m281j727K655M146M579M758R333R463J4553J5069J2395J4362J6217
8014B10138J7157J1401p269k0045k4854k5001k0147j0143n859j74P509J0374R008
8001A52095O822R085L976l998j2232r901r375j4245j5860j5671j1887p641m281
7988F6887r41l392L845K926j22J118J034k698K659J906K482K039M482J020K354
7973H5599P283R054R505K398j847J394k211j687l106r211o747m884p429p971n351
7958F4789n839k548K175L0l108l642N83K049J817l018j200L26J234n96j501j246
7942E0305j609j828j200R21j098j79o81j336O85K285J621j749L44Q60n04J541
$$ plain form
7926 48378 47823 45071 48565 48640 46134 46706 49524 50134 48562 47580 47870 46438 44598 46517 45897 42709 40069
7909 40069 39345 40864 43025 43493 45046 44419 45194 43848 40914 42619 43463 41500 41681 41638 40248 37528 36941
7892 36941 38252 37339 38205 37776 36540 35174 33158 32095 35568 41722 41002 34830 34250 34574 35952 36446
7876 36446 36500 36957 35415 36425 36372 33307 29878 31379 34687 34516 34365 31350 28479 32284 32747 34153 36445
7859 36445 33805 29642 28373 29709 28975 27087 26575 28352 24453 25344 24499 24512 24273 25813 26027 25323 29490
7842 29490 33921 32934 31694 31604 31267 31132 34614 33572 28100 25557 25785 29817 31557 32017 31085 27131 23719
7825 23719 24198 26071 27567 30187 26623 26494 27695 26710 27324 27645 27860 28183 29003 27795 27025 25999 24950
7808 24950 27419 28132 27633 28022 28313 30040 27276 25537 23914 22087 23793 26449 25784 22246 19945 22203
$$ packed form
7926D8378n55k752L494P5k506N72K818O10j572r82K90j432j840J919o20l188k640
7909D0069p24J519K161M68J553o27P75j346k934J705Q44j963J81m3j390k720n87
7892C6941J311r13Q66m29j236j366k016j063L473O154p20o172n80L24J378M94
7876C6446N4M57j542J010n3l065l429J501L308j71j51l015k871L805M63J406K292
7859C6445k640m163j269J336p34j888n12J777l899Q91q45J3k39J540K14p04M167
7842B9490M431r87j240r0l37j35L482j042n472k543K28M032J740M60r32l954l412
7825B3719M79J873J496K620l564j29J201r85O14L21K15L23Q20j208p70j026j049
7808B4950K469P13m99L89K91J727k764j739j623j827J706K656o65l538k301K258
$$ plain form
7792 22203 23923 22991 21245 22472 24007 22844 23561 23095 24659 25978 27085 26007 24697 22152 20927
7777 20927 22016 22099 23342 24310 25849 29058 28314 25519 23502 20057 18307 21182 21601 18845 18499 19170
7761 19170 18593 21375 23350 21266 22008 24116 21377 17276 13946 14815 15281 16006 15774 14211 12901 10237
7745 10237 10739 12694 14918 18464 19576 18489 18982 19709 15076 15169 17037 19770 18483 19568 24494 24591
7729 24591 24537 18689 16481 17158 15265 14939 16553 16587 16369 15654 15670 14154 10793 12870 14966 16104 17960
7712 17960 16063 14708 16374 16300 16393 14230 12088 13134 13521 14441 12647 14293 17878 16475 16234 18744
7696 18744 21008 17788 15154 19080 21448 18657 15490 14873 17845 16835 15492 14671 14724 11322 11953 12505
7680 12505 10600 9694 14074 15737 15914 16735 13068 8988 11241 13955 11684 9579 11651 14736 11515
$$ packed form
7792B2203J720r32j746J227J535j163P17m66J564J319J107j078j310k545j225
7777B0927J089Q3J243R68J539L209p44k795k017l445j750K875M19k756l46O71
7761A9170n77K782J975k084P42K108k739m101l330Q69M66P25k32j563j310k664
7745A0237N02J955K224L546J112j087M93P27m633R3J868K733j287J085M926R7
7729B4591n4n848k208O77j893l26J614L4k18p15J6j516l361K077K096J138J856
7712A7960j897j355J666p4R3k163k142J046L87R20j794J646L585j403k41K510
7696A8744K264l220k634L926K368k791l167o17K972j010j343q21N3l402O31N52
7680A2505j905r06M380J663J77Q21l667m080K253K714k271k105K072L085l221
$$ plain form
7665 11515 10227 9404 12609 16189 20402 19878 18358 14122 12341 12503 12628 11013 11632 12586 12390 14524
7649 14524 12638 15204 18950 19463 17763 16423 18588 18444 14902 12608 12894 10772 12219 13261 13306 14064
7633 14064 11418 8677 10928 10184 10428 11989 13343 12708 13637 13936 10221 8107 6718 7956 9053 9772
7617 9772 10118 7591 5775 7064 8650 10950 8298 7024 7578 6639 8220 8780 9731 7968 6777 8639
7601 8639 9688 9860 8325 9253 9129 9025 9734 9936 11557 12280 11358 10003 12319 17018 14693 11147 11170
7584 11170 14448 15307 15114 11278 7209 5796 6503 6724 6654 9868 9753 11866 11402 9501 9340 8546 7143
7567 7143 4841 6005 7350 8219 4957 6739 5379 5052 8261 8582 9877 7157 3915 1568 2497 7376
7551 7376 10240 8803 9877 10546 7479 6955 7932 8253 8569 11446 10511 10731 12576 11497 9783 7394 6720
$$ packed form
7665A1515j288q23L205L580M213n24j520m236j781J62J25j615O19R54j96K134
7649A4524j886K566L746N13j700j340K165j44l542k294K86k122J447J042M5P58
7633A4064k646k741K251p44K44J561J354o35R29K99l715k114j389J238J097P19
7617I772L46k527j816J289J586K300k652j274N54r39J581N60R51j763j191J862
7601H639J049J72j535R28j24j04P09K02J621P23r22j355K316M699k325l546K3
7584A1170L278Q59j93l836m069j413P07K21p0L214j15K113m64j901j61p94j403
7567G143k302J164J345Q69l262J782j360l27L209L21J295k720l242k347R29M879
7551G376K864j437J074O69l067n24R77L21L16K877r35K20J845j079j714k389o74
$$ plain form
7534 6720 6812 6367 6915 8793 6814 3413 5235 9271 12056 11060 13263 11571 6012 5408 3269 3011 2847
7517 2847 3926 5304 7841 6362 6977 9307 8940 11064 13345 12864 14257 16300 14404 12264 9689 7844
7501 7844 8997 8114 7446 7525 8331 6780 8249 6156 3587 4290 4272 7058 9192 9395 9312 10312 8321 8458
7483 8458 6225 2648 4297 7898 8391 5531 3442 3466 2320 5044 8089 6834 1079 3447 2768 5410
7467 5410 6765 4342 4930 7538 6486 5708 9969 8511 4166 2590 2829 5051 6002 7355 6635 2869
7451 2869 765 -1133 780 -497 875 575 2799 4963 4345 4237 2188 -855 -1055 1018 675 1381
7435 1381 3477 4350 4564 1742 -371 -1737 254 2116 4079 5987 6283 5278 6534 6861 9189 8076
7419 8076 6022 7460 8137 5818 5420 5954 12714 12348 9160 4569 2241 3721 5178 9613 9407 7590
$$ packed form
7534F720R2m45N48J878j979l401J822M036K785r96K203j692n559o04k139k58j64
7517B847J079J378K537j479O15K330l67K124K281m81J393K043j896k140k575j845
7501G844J153q83o68P9Q06j551J469k093k569P03j8K786K134K03q3J000j991J37
7483H458k233l577J649L601M93k860k089K4j146K724L045j255n755K368o79K642
7467E410J355k423N88K608j052p78M261j458m345j576K39K222R51J353p20l766
7451B869k104j898J913j277J372l00K224K164o18j08k049l043k00K073l43P06
7435A381K096Q73K14k822k113j366J991J862J963J908K96j005J256L27K328j113
7419H076k054J438O77k319l98N34O760l66l188m591k328J480J457M435k06j817
$$ plain form
7403 7590 7893 4317 1804 5608 8218 6548 4682 5645 7798 8453 8223 7380 7617 8690 7890 8033 6676
7386 6676 2545 4160 5376 3759 2547 4074 4935 2822 6789 6544 6030 8665 6494 3273 1263 2475
7370 2475 2207 6962 8059 8670 6077 2013 2653 4366 7979 10278 6212 5087 7185 6340 4366 5326
7354 5326 6434 5585 3819 2990 4700 3864 4339 3473 1488 1125 3114 775 -799 847 7215 11069
7338 11069 11957 8227 6503 8078 9975 11640 8924 6011 4589 4886 4751 602 -1555 -1915 -686 -488
7322 -488 1218 237 -1576 -3325 -258 6357 7130 7743 9156 5003 1755 3526 3034 4434 4951 5250 5266
7305 5266 3289 1105 1960 3462 5685 5646 6810 8715 7034 7020 6204 5738 9912 7207 4177 4293 5618
7288 5618 3663 3249 3973 4013 -407 -1225 455 -2350 -2407 -3209 -4813 -3882 830 2000 4413 4321 4169 3892
$$ packed form
7403G590L03l576k513L804K610j670j866R63K153O55k30q43K37J073q00J43j357
7386F676m131J615J216j617j212J527Q61k113L967k45n14K635k171l221k010J212
7370B475k68M755J097O11k593m064O40J713L613K299m066j125K098q45j974R60
7354E326J108q49j766q29J710q36M75q66j985l63J989k339j574J646O368L854
7338A1069Q88l730j724J575J897J665k716k913j422K97j35m149k157l60J229J98
7322d88J706r81j813j749L067O615P73O13J413m153l248J771m92J400N17K99J6
7305E266j977k184Q55J502K223l9J164J905j681j4q16m66M174k705l030J16J325
7288E618j955m14P24M0m420q18J680k805n7q02j604R31M712J170K413r2j52k77
$$ plain form
7270 3892 5617 4310 3598 5111 3854 5273 8381 8614 6271 2903 796 3354 4160 6747 7162 1735
7254 1735 -1352 -1600 -4494 -1734 1532 1871 1565 3227 2653 -2695 -5565 -4462 -1263 -1224 -1739 -1076 3919
7237 3919 2320 1056 2557 1789 5100 2982 1676 80 -1590 3 1416 3670 5375 5492 2240
7222 2240 73 -3824 -4580 504 3036 5556 7873 8974 7233 6891 4391 5062 1337 -2367 -964 1140
7206 1140 4123 2458 1643 4563 7277 4866 582 -421 -2932 -5093 -3266 -2088 -2432 -1165 419
7191 419 -1436 -2684 233 3195 159 -4245 -7405 -5589 -2743 -809 3714 3919 -102 -1623 -1468 -2112
7175 -2112 -391 2942 3894 3575 1236 2479 3360 3321 3607 2874 1930 111 2728 4190 3209 2708 1674
7158 1674 2741 78 -2861 -2949 -2227 605 2269 1105 2608 6774 6289 3119 1310 1570 4779 7302
$$ packed form
7270C892J725j307p12J513j257J419L108K33k343l368k107K558Q06K587M15n427
7254A735l087k48k894K760L266L39l06J662n74n348k870J103L199L9n15O63M995
7237C919j599j264J501p68L311k118j306j596j670J593J413K254J705J17l252
7222B240k167l897p56N084K532K520K317J101j741l42k500O71l725l704J403K104
7206A140K983j665q15K920K714k411m284j003k511k161J827J178l44J267J584
7191D19j855j248K917K962l036m404l160J816K846J934M523K05m021j521J55o44
7175b112J721L333R52l19k339J243Q81l9K86p33r44j819K617J462r81n01j034
7158A674J067k663k939q8P22K832J664j164J503M166m85l170j809K60L209K523
$$ plain form
7142 7302 3661 1528 4082 7914 10074 6109 468 -966 -904 21 -237 -2806 -2542 -2506 -3787 -1286 -762
7125 -762 2032 2888 1109 577 2225 470 -1952 -1364 -1775 -480 -187 552 -237 1390 2784 4899 4450
7108 4450 1626 -1317 -1619 -781 -1464 -954 -1185 -2095 354 3367 4467 4927 3910 4087 3717 3484 2876 2453
7090 2453 6082 3794 -1730 -2950 755 1081 2646 794 -1210 -1126 -3152 -791 -166 -2687 -2628 -1106
7074 -1106 842 3574 1603 -365 1301 4114 4427 4344 4651 5049 5457 5665 3940 1112 2199 -328 -6597
7057 -6597 -7909 -5620 -1692 -468 -2330 -1276 1632 4450 1168 -2669 -3189 -5202 -6112 -2110 2572
7042 2572 132 1584 1446 1063 2213 2572 179 -1333 -1145 932 -484 -427 -1490 -1281 -3898 -4980 -5113
7025 -5113 -7809 -8407 -8879 -7938 -4912 -921 1713 -931 -2100 1284 417 -1115 -1554 -125 997 -131
$$ packed form
7142G302l641k133K554L832K160l965n641j434O2R25k58k569K64L6j281K501N24
7125g62K794Q56j779n32J648j755k422N88m11J295K93P39p89J627J394K115m49
7108D450k824k943l02Q38o83N10k31r10K449L013J100M60j017J77l70k33o08m23
7090B453L629k288n524j220L705L26J565j852k004Q4k026K361O25k521N9J522
7074a106J948K732j971j968J666K813L13q3L07L98M08K08j725k828J087k527o269
7057f597j312K289L928J224j862J054K908K818l282l837n20k013r10M002M682
7042B572k440J452j38l83J150L59k393j512J88K077j416N7j063K09k617j082j33
7025e113k696n98m72R41L026L991K634k644j169L384q67j532m39J429J122j128
$$ plain form
7009 -131 1787 5537 4082 3107 1861 315 1153 -649 -315 -1264 -3009 -2684 766 2810 4871 5599 2822
6992 2822 1155 2191 4758 5116 4294 1248 764 2585 1023 2463 4259 5633 6154 4059 1504 2184
6976 2184 2211 4859 6209 5313 4581 2623 -801 -1421 3058 2744 60 1266 3571 -733 -3733 -2582
6960 -2582 -235 1483 67 -2256 -2342 -3170 -3744 -8081 -9346 -6958 -450 4153 3332 324 -358 -642 -406
6943 -406 509 75 3021 6331 6455 8701 6784 8035 6928 450 -1731 -1798 147 -957 -2837 -1002
6927 -1002 1996 3164 3931 3445 5737 5451 1722 -343 -2265 -741 3129 5554 2522 -434 -568 1089
6911 1089 1221 2452 1515 -80 -630 797 945 1228 707 -1343 -961 887 1924 2555 3428 1715 -979
6894 -979 -1557 -1142 -655 -9 -1128 -1429 -1476 29 -675 -849 -228 -707 -156 -536 -451 -326 -265 -1571 -3601 -3828
$$ packed form
7009a31J918L750j455r75j246j546Q38j802L34r49j745L25L450K044K061P28k777
6992B822j667J036K567L58q22l046m84J821j562J440J796J374N21k095k555O80
6976B184K7K648J350q96p32j958l424o20M479l14k684J206K305m304l000J151
6960b582K347J718j416k323q6q28n74m337j265K388O508M603q21l008o82k84K36
6943d06R15m34K946L310J24K246j917J251j107o478k181o7J945j104j880J835
6927a002K998J168P67m86K292k86l729k065j922J524L870K425l032k956j34J657
6911A089J32J231r37j595n50J427J48K83n21k050L82J848J037O31Q73j713k694
6894i79n78M15M87O46j119l01m7J505p04j74O21m79N51l80Q5J25O1j306k030k27
$$ plain form
6874 -3828 -966 2252 2812 5379 5921 4646 1515 1460 4060 8083 8113 7510 7455 3449 1545 2455 4237
6857 4237 2190 -366 -565 603 524 -463 -2064 -4266 -3350 -2184 -1164 360 4742 3561 3619 1898 -723
6840 -723 -3413 -1102 866 -291 268 1587 1945 1972 4809 4709 4804 1251 -2422 -1551 -1837 -2977 -2945 -641
6822 -641 -630 -2981 -1083 -1266 -940 382 1901 1958 -1275 -3012 -3218 -1107 -1691 -1601 -4064 -3647 514 2730
6804 2730 462 1766 3254 5045 8254 4788 3929 4335 4192 3591 3971 5356 3055 -506 -1757 -450
6788 -450 988 589 1939 1827 1952 -404 -1156 2832 3140 -34 1645 1819 -1640 -894 2030 3310 5401
6771 5401 2300 2202 1751 798 1182 722 743 -732 -723 -1898 -5341 -2717 4110 5646 4051 2049 885 1984
6753 1984 2720 6410 9281 8247 7305 4488 4706 4315 4100 447 -3445 -4298 -1737 -4437 -4793 -5490 -4995
$$ packed form
6874c828K862L218N60K567N42j275l131n5K600M023L0o03n5m006j904R10J782
6857D237k047k556j99J168p9r87j601k202R16J166J020J524M382j181N8j721k621
6840g23k690K311J968j157N59J319L58K7K837j00R5l553l673Q71k86j140L2K304
6822f41J1k351J898j83L26J322J519N7l233j737k06K111n84R0k463M17M161K216
6804B730k268J304J488J791L209l466q59M06j43o01L80J385k301l561j251J307
6788d50J438l99J350j12J25k356p52L988L08l174J679J74l459P46K924J280K091
6771E401l101r8m51r53L84m60K1j475Rj175l443K624O827J536j595k002j164J099
6753A984P36L690K871j034r42k817K18l91k15l653l892q53K561k700l56o97M95
$$ plain form
6736 -4995 -1219 901 383 -1302 2644 4554 2625 -2410 -2060 -242 1234 529 2109 4562 3598 1510
6720 1510 3810 1898 -1007 -3204 -1928 -393 340 891 -114 -1138 2379 4752 1799 -56 -417 -1701
6704 -1701 -3173 -266 2805 2012 2758 1079 -553 954 4560 6220 3118 -379 -2381 -453 3695
6689 3695 4093 2039 -83 100 1856 3562 1584 2094 872 -31 -1184 1293 3522 5031 7218 9216
6673 9216 8452 4246 1297 2110 2399 995 151 2045 626 -2876 -6071 -5848 -1571 732 429 2061
6657 2061 2266 3574 6232 9026 6982 6784 5025 3983 3767 1904 148 -1486 -1607 853 4838 5472
6641 5472 3901 3788 5142 7262 7534 5144 4270 6518 3375 1960 2781 6528 5164 5739 9165 8717
6625 8717 5930 678 -30 1966 -1053 -932 -1749 -1134 1026 1094 -880 -805 -820 -2818 658 4462 4166 653
$$ packed form
6736d995L776K120n18j685L946J910j929n035L50J818J476p05J580K453r64k088
6720A510K300j912k905k197J276J535P33N51j005j024L517K373k953j855l61j284
6704a701j472K907L071p93P46j679j632J507L606J660l102l497k002J928M148
6689C695L98k054k122J83J756J706j978N10j222r03j153K477K229J509K187J998
6673I216p64m206k949Q13K89j404q44J894j419l502l195K23M277K303l03J632
6657B061K05J308K658K794k044j98j759j042k16j863j756j634j21K460L985O34
6641E472j571j13J354K120K72k390q74K248l143j415Q21L747j364N75L426m48
6625H717k787n252p08J996l019J21q17O15K160O8j974P5j5j998L476L804k96l513
$$ plain form
6607 653 757 -1474 -3002 -1151 767 -1501 -381 -940 -242 -2363 -3986 -5607 -5329 -3143 355 858
6591 858 -1085 -4300 -5357 -1059 3240 2412 1615 2344 -631 160 2978 175 -982 299 3962 3154
6575 3154 3782 4634 1830 -264 -57 -1146 -3936 -3348 -116 978 830 942 -234 -1230 -1521 -1030 2181
6558 2181 4896 3916 2288 2293 1442 784 2163 2262 -216 -664 1495 3521 714 -723 -1194 -367 -125 -246
6540 -246 -360 -2061 -4214 -3011 -2417 -5431 -5738 -3979 -8677 -6103 -3442 -3131 -1927 25 2388 2161
6524 2161 2908 1325 79 -499 519 -1782 -972 -1503 -2948 -1814 -4633 -6370 -6395 -4403 -2307 -2735 -3310
6507 -3310 -2185 -4517 -5862 -2258 860 2159 4154 6509 6943 4378 1101 -308 2747 6434 7267
6492 7267 6876 3298 1541 1836 227 -1579 -1475 -666 -1514 -4141 -1360 1404 -136 -642 510 -1527
$$ packed form
6607F53J04k231j528J851J918k268J120n59O98k121j623j621K78K186L498N03
6591H58j943l215j057M298M299q28p97P29k975P91K818k803j157J281L663q08
6575C154O28Q52k804k094K07j089k790N88L232J094j48J12j176r96k91M91L211
6558B181K715r80j628Nq51o58J379R9k478m48K159K026k807j437m71Q27K42j21
6540b46j14j701k153J203N94l014l07J759m698K574K661L11J204J952K363k27
6524B161P47j583j246n78J018k301Q10n31j445J134k819j737k5J992K096m28n75
6507c310J125k332j345L604L118J299J995K355M34k565l277j409L055L687Q33
6492G267l91l578j757K95j609j806J04Q09q48k627K781K764j540n06J152k037
$$ plain form
6476 -1527 -1504 -309 876 3531 1669 -2045 -1900 -221 -4119 -3781 891 3785 1532 -851 -3141 -4817
6460 -4817 -3483 -768 -881 -941 -3066 1066 3825 4288 4320 3023 1544 1377 606 -3144 -7154 -4687 -142
6443 -142 1667 -1780 -2998 -764 -3383 -4452 -2493 219 3586 3751 77 -1034 -904 -1824 -1953 -3011
6427 -3011 -5381 -4373 566 4365 3434 3049 1328 1304 3873 3207 4055 5591 5299 5104 5822 4826 -151
6410 -151 -2237 -988 -903 -7004 -7434 -4383 -3055 -7235 -6290 -2644 -1566 -1332 -2043 -1094 -769 547 2345
6393 2345 2807 -441 -3500 -4780 -5054 -3514 1398 3859 1204 -4145 -5864 -9521 -8155 -271 2872
6378 2872 471 2069 6391 8441 7206 5005 1982 -482 -622 -623 -292 -574 1523 1622 143 -4331 -6367
6361 -6367 -6079 -3946 -1537 -1978 661 -1380 -480 1235 2079 3902 2555 1700 299 -1325 -3662 -620
$$ packed form
6476a527K3J195J185K655j862l714J45J679l898L38M672K894k253k383k290j676
6460d817J334K715j13o0k125M132K759M63L2j297j479j67p71l750m010K467M545
6443a42J809l447j218K234k619j069J959K712L367J65l674j111J30r20j29j058
6427c011k370J008M939L799r31l85j721k4K569o66Q48J536k92j95P18r96m977
6410a51k086J249Q5o101m30L051J328m180R45L646J078K34p11R49L25J316J798
6393B345M62l248l059j280k74J540M912K461k655n349j719l657J366P884L143
6378B872k401J598M322K050j235k201l023k464j40jL31k82K097R9j479m474k036
6361f367K88K133K409m41K639k041R00J715Q44J823j347q55j401j624k337L042
$$ plain form
6345 -620 2375 1025 -1196 466 -746 20 3482 5927 3913 1527 539 -3327 -6316 -3880 -396 -490
6329 -490 -103 2985 1083 254 1275 1359 902 1530 1295 -2236 -4194 -4857 -1645 574 -974 806 310
6312 310 3055 2330 2426 2468 -23 -2349 -2490 -2278 -172 -1681 -4621 -2923 -979 -2086 -2047 -1947 1432 4568
6294 4568 6121 4583 923 -591 1965 3061 -991 -2267 -225 3280 3955 1532 -2914 -3865 -6336
6279 -6336 -6476 -4757 -3627 -1850 -2480 -910 430 -3544 -5745 -2934 -869 -2596 -1444 -1744 -3916 -5781
6263 -5781 -5815 -2497 -1057 172 -2508 -3359 -3347 -5376 -7621 -6988 -2595 -2439 -5984 -4240 -2792 -517 -796
6246 -796 -920 2642 1159 -1983 -4441 -3504 3865 5583 2181 1011 2699 1825 301 508 -985 -3257
6230 -3257 -4635 -1437 -1513 -2753 -3420 -5768 -5246 -5609 -2910 -105 1912 1429 -1404 -3749 -1494 -2263 -3827
$$ packed form
6345f20K995j350k221J662j212P66L462K445k014k386r88l866k989K436L484r4
6329d90L87L088j902q29J021Q4m57O28k35l531j958o63L212K219j548J780m96
6312C10K745p25R6M2k491k326j41K12K106j509k940J698J944j107L9J00L379L136
6294D568J553j538l660j514K556J096m052j276K042L505O75k423m446r51k471
6279f336j40J719J130J777o30J570J340l974k201K811K065j727J152l00k172j865
6263e781l4L318J440J229k680q51J2k029k245O33M393J56l545J744J448K275k79
6246g96j24L562j483l142k458R37P369J718l402j170J688q74j524K07j493k272
6230c257j378L198p6j240o67k348N22l63K699K805K017m83k833k345K255p69j564
$$ plain form
6213 -3827 -4533 -3910 -5353 -4867 -4441 -6764 -6717 -4298 -3673 -2969 -2248 -572 282 1973 -393 -622 -1268 -2775
6195 -2775 -4391 -4956 -2832 553 2063 -251 -2266 -4636 -6400 -5170 -2348 1391 3902 1678 -2300
6180 -2300 -4659 -6255 -2269 -334 -4505 -4388 -4331 -2759 -4930 -5106 -3558 34 2866 2617 339 -100
6164 -100 -643 1106 286 -557 -1946 -4487 -3412 -2460 -3955 -4177 -2221 -2700 -1406 -490 2166 1463 -2440
6147 -2440 -3308 -3615 -1817 -268 -1094 -1849 -770 1114 6128 5171 1938 948 -3390 -2811 -551 -377 -1573
6130 -1573 -3255 -1561 1537 3682 3502 1790 -1331 -2047 -2729 -4050 -5688 -5067 -648 789 -1953 -4608
6114 -4608 -2695 -2728 -1217 -1902 -2294 -2286 -1018 413 -677 -2092 -4017 -5236 -3191 -1303 1966 2950 1841
6097 1841 3306 3870 1234 -2857 -448 -1407 -3794 -6730 -6946 -7959 -7584 -4504 -670 2393 141 -1510
$$ packed form
6213c827p06O23j443M86M26k323M7K419O25P04P21J676Q54J691k366k29o46j507
6195b775j616n65K124L385J510k314k015k370j764J230K822L739K511k224l978
6180b300k359j596L986J935m171J17N7J572k171j76J548L592K832k49k278m39
6164a00n43J749q20q43j389k541J075R52j495k22J956m79J294R16K656p03l903
6147b440q68l07J798J549q26p55J079J884N014r57l233r90m338N79K260J74j196
6130a573j682J694L098K145j80j712l121p16o82j321j638O21M419J437k742k655
6114d608J913l3J511o85l92QJ268J431j090j415j925j219K045J888L269R84j109
6097A841J465N64k636m091K409r59k387k936k16j013L75L080L834L063k252j651
$$ plain form
6081 -1510 97 1389 2640 2393 9 -3147 -2919 -3435 -4459 -5786 -5770 -3632 -2580 -118 22 -2063
6065 -2063 -2381 -4069 -946 -373 -1852 -319 -1508 -1896 962 -1211 -468 -464 2038 3228 1352 773 3156
6048 3156 2711 -1391 -4433 -3056 -1440 -1461 -2837 1496 965 -5950 -3675 -74 -423 -3449 -3584 -2802 -3302
6031 -3302 -3086 -1533 -2369 -715 5997 6915 1424 -957 -2364 -2018 -2324 -2836 -2077 819 846 -932 -1096
6014 -1096 2713 3214 3336 -977 -2383 -1996 -1729 -2335 -919 -2821 -7199 -6172 -3017 -1779 -2613 -2058 -1415
5997 -1415 2 2273 3201 2670 -1164 -2857 -4025 -3303 -4556 -4979 -6104 -3966 282 1720 748 647
5981 647 498 362 -554 926 1303 3574 3665 -1798 -656 820 2574 533 -1012 -3747 -5904 -5143 -1853
5964 -1853 2109 1358 1766 3521 3410 5447 2127 2500 2079 2705 3941 3226 4185 1672 -1139 -151 178
$$ packed form
6081a510J607J292J251k47k384l156K28n16j024j327J6K138J052K462J40k085
6065b063l18j688L123N73j479J533j189l88K858k173P43MK502J190j876n79K383
6048C156m45m102l042J377J616k1j376M333n31o915K275L601l49l026j35P82n00
6031c302K16J553q36J654O712R18n491k381j407L46l06n12P59K896K7j778j64
6014a096L809N01J22m313j406L87K67o06J416j902m378J027L155J238q34N55O43
5997a415J417K271R28n31l834j693j168P22j253m23j125K138M248J438r72j01
5981F47j49j36r16J480L77K271R1n463J142J476J754k041j545k735k157P61L290
5964a853L962p51M08J755j11K037l320L73m21O26J236p15R59k513k811R88L29
$$ plain form
5947 178 1196 1602 2259 -990 -3089 -2046 -1617 -1821 -236 -1319 2296 5856 2965 -1197 -1621 -2045 -2346
5930 -2346 -3598 -3070 2269 4092 4235 686 -3848 -2296 409 479 1729 3174 2056 3824 2492 3579
5914 3579 3462 3855 5337 5153 892 -3984 -2782 -1540 -2266 -974 -125 -869 1206 431 -3513 -5625 -6252
5897 -6252 -6492 -4942 -1924 -56 1950 2740 502 1009 -235 487 972 1689 2428 3245 2341 -1343 -2580
5880 -2580 -3516 -1284 -1566 -3545 -4357 -6143 -7212 -4024 -2172 961 -142 -6409 -3674 -2675 -5484 -6261
5864 -6261 -4405 -2811 -2019 -625 -1815 185 2807 4214 807 -4507 -7723 -2690 -2542 -3781 -5871
5849 -5871 -7853 -8093 -7799 -4186 -271 -14 209 -457 -2851 -2597 -410 -268 703 762 -821 264 2201
5832 2201 2713 1781 1484 662 -3707 -3987 -5400 -5413 -1823 -53 -1306 -753 1324 1627 1333 3157 25
$$ packed form
5947A78J018M06O57l249k099J043M29k04J585j083L615L560k891m162m24m24l01
5930b346j252N28N339J823J43l549m534J552K705P0J250J445j118J768j332J087
5914C579j17L93J482j84m261m876J202J242p26J292Q49p44K075p75l944k112o27
5897f252k40J550L018J868K006P90k238N07j244P22M85P17P39Q17r04l684j237
5880b580r36K232k82j979q12j786j069L188J852L133j103o267K735R99k809p77
5864f261J856J594P92J394j190K000K622J407l407n314l216N033J48j239k090
5849e871j982k40K94L613L915K57K23o66k394K54K187J42R71N9j583J085J937
5832B201N12r32k97q22m369k80j413j3L590J770j253N53K077L03k94J824l132
$$ plain form
5815 25 -4109 181 3249 -747 -2957 -1361 457 290 -3243 -3554 -1693 -1250 -1888 -2220 -4397 -6588 -4872
5798 -4872 -3473 -8441 -4304 1117 2895 3819 1978 -2043 1791 1266 -575 314 2984 -162 -3362 -2435
5782 -2435 1220 2605 2595 2672 1936 3918 3943 838 -685 591 -2177 -4437 -5098 -4935 -471 1882 -74
5765 -74 -2749 749 1087 1411 3346 4566 -893 -7014 -6637 -8049 -7273 -3858 -97 350 937 1014 981 -1805
5747 -1805 -4187 -5715 -4150 -311 -87 -1200 -2321 -3672 -3867 -5014 -4196 -1973 -3018 -1211 1982 1865
5731 1865 1749 122 2001 3529 3531 -1715 -4822 -2082 -2969 -6335 -5104 -5179 -1706 2249 3551 2783 2277
5714 2277 787 -1608 -1751 -3637 -1899 -2427 -322 1423 4250 6356 4833 1176 -1778 -4051 384
5699 384 2166 823 736 2207 3005 221 -1578 -4120 -5938 -1667 1197 1451 2547 1846 2011 3215 4302
$$ packed form
5815B5m134M290L068l996k210J596J818j67l533l11J861M43o38l32k177k191J716
5798d872J399m968M137N421J778R24j841m021L834n25j841Q89K670l146l200R27
5782b435L655J385j0P7p36J982K5l105j523J276k768k260o61J63M464K353j956
5765g4k675L498L38L24J935J220n459o121L77j412P76L415L761M47N87P7l3k786
5747a805k382j528J565L839K24j113j121j351j95j147Q18K223j045J807L193j17
5731A865j16j627J879J528Kn246l107K740q87l366J231p5L473L955J302p68n06
5714B277j490k395j43j886J738n28K105J745K827K106j523l657k954k273M435
5699C84J782j343q7J471P98k784j799k542j818M271K864K54J096p01J65J204J087
$$ plain form
5682 4302 3424 2866 4554 4663 3298 876 566 448 -928 -1512 -811 819 -218 -3017 -3029 -993 -792
5665 -792 -5432 -7075 -6321 -4332 -130 3879 4010 2601 4176 2443 -1317 -1234 -3530 -3082 -2873 -4600 -5813
5648 -5813 -1245 1996 -1036 -2076 -2409 -2809 -3063 -459 224 -979 -1498 -1039 -2000 1847 2349 1361 438
5631 438 -341 19 209 499 2076 1070 -1924 -4384 -6412 -5572 -4264 -239 2376 1396 1647 916 -134
5614 -134 -832 -2008 -3500 -3507 -282 -579 -970 -3891 -4668 -4275 -4652 -2876 -2346 -3819 -4162 -4988 -1471 -1409 47
5595 47 1606 1075 802 -3030 -6242 -6228 -5981 -3722 -4770 -4408 -4280 -3164 -1214 -2209 -3428 -2060 -4775
5578 -4775 -4400 -2746 -892 2212 3750 3611 5781 7429 8193 7137 1328 -423 3269 4320 -971 -3970
5562 -3970 -3099 -5285 -4830 -4579 -1041 -2982 -2878 -2962 -1896 -1559 -3051 -5093 -3646 -2701 -2019 -1926 -5028 -3528
$$ packed form
5682D302q78n58J688J09j365k422l10j18j376n84P01J630j037k799j2K036K01
5665g92m640j643P54J989M202M009J31j409J575j733l760Q3k296M48K09j727j213
5648e813M568L241l032j040l33m00k54K604O83j203n19M59r61L847N02r88r23
5631D38p79L60J90K90J577j006k994k460k028Q40J308M025K615r80K51p31j050
5614a34o98j176j492pL225k97l91k921p77L93l77J776N30j473l43q26L517O2J456
5595D7J559n31k73l832l212J4K47K259j048L62J28J116J950r95j219J368k715
5578d775L75J654J854L104J538j39K170J648P64j056n809j751L692J051n291k999
5562c970Q71k186M55K51L538j941J04q4J066L37j492k042J447R45O82R3l102J500
$$ plain form
5544 -3528 -2758 -531 2711 1574 -2713 -3341 1428 398 -989 -2015 -3302 -2192 -1673 2158 2718 2747
5528 2747 2277 3049 755 -1142 -2168 -3279 -3206 -4831 -6938 -7338 -7825 -7678 -9946 -7211 -4947 -3395 -6222
5511 -6222 -7390 -6588 -5494 -5967 -4772 -3271 2297 3193 933 -1095 372 3255 818 -1385 1491 2305
5495 2305 -2438 -3828 -1468 -1343 999 1733 3560 4900 6558 1001 -3087 -1191 -277 -2687 -1562 -803
5479 -803 -53 -2474 -2495 -5490 -6948 -1337 -1069 54 -252 1355 1024 -3735 -604 389 -19 -1490 -1256
5462 -1256 -3064 429 2632 651 -23 1564 2516 3759 3324 -2096 -977 727 -479 -1615 -20 391
5446 391 -470 343 -220 -2775 -219 2693 4989 4856 524 -467 459 176 1265 2653 2002 -1006 -1698
5429 -1698 -16 1862 -2634 -3645 -2377 -2487 -1951 -1757 -2282 -2377 -2905 -2414 -2991 -3187 -1372 -1326 -5144 -5398
$$ packed form
5544c528P70K227L242j137m287o28M769j030j387j026j287J110N19L831N60K9
5528B747m70P72k294j897j026j111P3j625k107m00m87J47k268K735K264J552k827
5511f222j168Q02J094m73J195J501N568Q96k260k028J467K883k437k203K876Q14
5495B305m743j390K360J25K342P34J827J340J658n557m088J896R14k410J125P59
5479h03P50k421k1k995j458N611K68J123l06J607l31m759L131R93m08j471K34
5462a256j808L493K203j981o74J587R52J243m35n420J119J704j206j136J595M11
5446C91q61Q13n63k555K556K912K296j33m332r91R26k83J089J388o51l008o92
5429a698J682J878m496j011J268j10N36J94n25r5n28M91n77j96J815M6l818k54
$$ plain form
5411 -5398 -2515 -3307 -3534 -6875 -7859 -4172 -3541 -1971 -2334 -4954 -5837 -6616 -6698 -6540 -6323 -5857 -5443 -5815
5393 -5815 -4994 -4332 -670 -1466 -3761 -2507 -4965 -7890 -4496 -3504 -2239 -2765 -1827 -464 -1153 805 2422
5376 2422 1519 758 1025 52 -1698 -713 -235 -2186 -194 525 -2208 -359 -1087 -1257 -3284 -4234 469
5359 469 2317 4243 5083 3992 1482 -1912 -1361 628 -225 2834 4547 1046 1002 906 -552 247 -1630
5342 -1630 -2368 -216 3087 4032 4470 2015 3502 2102 3352 2018 2185 2544 2714 1545 176 -2912
5326 -2912 -3338 -1590 -900 -1554 -5596 -7468 -5354 -2733 -2026 -27 2915 786 470 1339 -492 -5117
5310 -5117 -5738 -6097 -2054 -998 -3580 -4170 -3554 223 961 -783 -1933 -1355 -880 -1828 -872 -1013 -2852
5293 -2852 -2848 -733 -1216 401 2378 4074 5664 3763 1306 -3444 -6888 -9510 -10132 -6448 -2243 -1454
$$ packed form
5411e398K883p92k27l341r84L687O31J570l63k620q83p79q2J58K17M66M14l72
5393e815Q21O62L662p96k295J254k458k925L394R92J265n26R38J363o89J958J617
5376B422r03p61K67r73j750R85M78j951J992P19k733J849p28j70k027r50M703
5359D69J848J926Q40j091k510l394N51J989q53L059J713l501m4r6j458P99j877
5342a630p38K152L303R45M38k455J487j400J250j334J67L59J70j169j369l088
5326b912m26J748O90o54m042j872K114K621P07J999K942k129l16Q69j831m625
5310e117o21l59M043J056k582n90O16L777P38j744j150N78M75r48R56j41j839
5293b852MK115m83J617J977J696J590j901k457m750l444k622o22L684M205P89
$$ plain form
5277 -1454 1815 1483 1579 3254 292 -285 342 1164 3536 3384 647 -1358 -2041 -1560 -3127 -2222 1502
5260 1502 3828 2986 -96 371 3123 1218 1874 1149 -938 -1480 -3468 -2387 -2903 -2623 -3091 -3641 -471
5243 -471 -124 -871 -2114 -393 -1668 -3529 -3977 -5024 -5335 -5692 -3925 -4980 -1998 -2818 -5944 -6681 -6718
5226 -6718 -3679 -1504 -2958 -3115 -1386 -43 -522 -2309 -2690 -553 3150 712 -2876 -4146 -3095 -861
5210 -861 1946 2308 4468 6258 4782 1974 2503 2616 -30 767 2460 -1748 -823 141 -1360 -1583 -1690
5193 -1690 659 91 -590 124 1817 901 -3167 -8112 -8129 -4551 -175 -3116 -6067 -3707 -2934 -52 -278
5176 -278 -1143 -1042 -1572 61 -1641 -3314 -6515 -4879 -3411 -3279 -3733 -4359 -3498 -1731 -3984 -5069 -3827
5159 -3827 -3884 -3005 -5491 -6147 -4104 -4687 -4076 -3558 -3871 -4871 -2153 114 1942 -249 -2162 -2900 -3141
$$ packed form
5277a454L269l32R6J675k962n77O27Q22K372j52k737k005o83M81j567R05L724
5260A502K326q42l082M67K752j905O56p25k087n42j988J081n16K80m68n50L170
5243d71L47p47j243J721j275j861m48j047l11l57J767j055K982q20l126p37l7
5226f718L039K175j454j57J729J343m79j787l81K137L703k438l588j270J051K234
5210h61K807L62K160J790j476k808N29J13k646P97J693m208R25R64j501k23j07
5193a690K349n68o81P14J693r16m068m945j7L578M376k941k951K360P73K882k26
5176b78q65J01n30J633j702j673l201J636J468J32m54o26Q61J767k253j085J242
5159c827n7Q79k486o56K043n83O11N18l13j000K718K267J828k191j913p38k41
$$ plain form
5142 -3141 719 516 739 -615 -4121 -2887 -718 -1837 -4400 -4980 -1362 2977 4317 6609 8884 5091
5126 5091 -1202 -5892 -6745 -6194 -1862 -2029 -1604 -984 -46 1453 874 3055 2255 3270 4898 596 2254
5109 2254 3144 1177 2515 1788 -1907 -1602 -2192 -726 -3331 -2115 2138 651 2262 1277 3328 3742
5093 3742 3623 1716 2304 1392 2193 4102 4820 4935 4511 1712 732 -1657 -659 197 1544 2273 2141 1715
5075 1715 1652 -1491 -2422 -3932 -2259 -1724 -1440 737 749 744 699 -742 -314 -997 -2484 -3149 -2876 -2937 -709
5056 -709 -1555 -2359 527 -2025 -1303 -1283 -841 -432 1307 3786 3138 -1038 -2506 -1507 578 1409 384 -1106
5038 -1106 69 1151 1827 2104 1912 320 -2232 -2322 -515 2788 451 -4698 -1434 -1735 -2431 -1659 -1728
5021 -1728 -1310 845 31 -1090 -2816 -510 1025 -1005 -2003 -142 -1708 -1969 94 -2320 -4389 -3964
$$ packed form
5142c141L860k03K23j354l506J234K169j119k563n80L618M339J340K292K275l793
5126E091o293m690q53N51M332j67M25O20R38J499n79K181q00J015J628m302J658
5109B254Q90j967J338p27l695L05n90J466k605J216M253j487J611r85K051M14
5093C742j19j907N88r12Q01J909P18J15m24k799r80k389R98Q56J347P29j32m26
5075A715o3l143r31j510J673N35K84K177J2nm5j441M28o83j487o65K73o1K228
5056g09q46q04K886k552P22K0M42M09J739K479o48m176j468R99K085Q31j025j490
5038a106J175J082O76K77j92j592k552r0J807L303k337n149L264l01o96P72o9
5021a728M18K155q14j121j726K306J535k030r98J861j566k61K063k414k069M25
$$ plain form
5005 -3964 -1323 -1077 257 -2042 -5113 -2062 -1552 -3502 -2884 -3969 -4551 -7282 -7623 -6746 -8126 -11440
4989 -11440 -7341 -6254 -6179 -4127 312 765 -2493 -5559 -5449 -2076 -1488 -4001 -2983 1537 2883 1418
4973 1418 -302 -1628 -3959 -2711 -2451 -4347 -5658 -8469 -7676 -3774 -2239 -453 -125 -300 -2115 -3710
4957 -3710 -4959 -6156 -7038 -6852 -9197 -8949 -4292 2048 6260 5018 1623 990 105 -2946 -1283 -2114
4941 -2114 -1845 -920 -467 870 35 1185 -616 -4007 -5094 -5848 -8451 -8806 -8554 -4421 -1439 -2757 -3494
4924 -3494 -177 1332 -742 -2153 -297 2121 345 -1583 -1379 -4220 -5010 -1817 -827 -153 -1512 -4271
4908 -4271 -3753 -2932 -416 2512 2226 -1340 -2010 -158 1828 2346 1690 -362 -1340 -5270 -6967 -4357 -5427
4891 -5427 -5533 -2006 -1548 -1930 -661 338 72 -2186 -3021 -1476 -1225 -4023 -1521 -2671 -3342 1553 3127
$$ packed form
5005c964K641K46J334k299l071L051N10j950O18j085n82k731l41Q77j380l314
4989a1440M099J087P5K052M439M53l258l066J10L373N88k513J018M520J346j465
4973A418j720j326k331J248K60j896j311k811P93L902J535J786L28j75j815j595
4957c710j249j197q82J86k345K48M657O340M212j242l395o33q85l051J663q31
4941b114K69R25M53J337q35J150j801l391j087p54k603l55K52M133K982j318p37
4924c494L317J509k074j411J856K418j776j928K04k841p90L193R90O74j359k759
4908d271N18Q21K516K928k86l566o70J852J986N18o56k052r78l930j697K610j070
4891e427j06L527M58l82J269R99k66k258q35J545K51k798K502j150o71M895J574
$$ plain form
4874 3127 -2162 -6195 -6302 -2615 -704 -787 -292 -1091 -780 -849 -1527 351 80 -2237 -2138 -2575 -2609 -2663 -113
4855 -113 2261 4425 2377 -1068 127 -241 1673 4631 1294 -2246 -1244 29 946 280 754 362
4839 362 -1359 448 2998 4269 5411 5425 3849 4583 441 -5105 -3910 -938 407 1087 296 4324
4823 4324 2574 -2282 -4700 -2455 -3227 -5832 -9699 -12553 -9211 -11178 -11621 -9368 -7075 -5631 -4007
4808 -4007 -2790 -2389 -722 -3717 -3097 -2753 -1869 -876 462 142 191 3250 4076 565 -3235 -136 1108
4791 1108 -1116 -2515 -3844 -7138 -6112 -8402 -6218 -4944 -5378 -2710 -2155 -2518 -1466 -1899 -1944 -2788 -2344
4774 -2344 153 697 -1947 -6942 -4721 -290 -1405 -4942 -6031 -6636 -6167 -4933 -2611 -1180 -1983 -4701
4758 -4701 -2915 -4568 -4142 -4494 -4999 -3547 -1814 1549 -2380 -5226 -2595 -562 -2448 -3397 -2327 -2547
$$ packed form
4874C127n289m033j07L687J911q3M95p99L11o9o78J878k71k317R9m37l4n4K550
4855a13K374K164k048l445J195l68J914K958l337l540J002J273R17o66M74l92
4839C62j721J807K550J271J142J4j576P34m142n546J195K972J345O80p91M028
4823D324j750m856k418K245p72k605l867k854L342j967m43K253K293J444J624
4808d007J217M01J667k995O20L44Q84R93J338l20M9L059Q26l511l800L099J244
4791A108k224j399j329l294J026k290K184J274m34K668N55l63J052m33m5q44M44
4774b344K497N44k644m995K221M431j115l537j089o05M69J234K322J431q03k718
4758d701J786j653M26l52n05J452J733L363l929k846K631K033j886r49J070k20
$$ plain form
4742 -2547 -2191 -1199 1446 3651 4169 2903 -3663 -2875 -2105 -1157 2425 1016 76 3479 5624 7523 6621
4725 6621 1255 -4616 -4764 -4174 -2263 -2342 -4523 -3504 -2022 6 1301 3154 3962 1737 -636 -669 -3966
4708 -3966 -5440 -3504 -3664 250 2325 953 320 991 182 -3045 -5824 -6689 -5025 -3062 -1213 64
4692 64 -2736 -995 -12 -2450 -2567 -2201 -2469 -3264 -4352 -4170 -3711 -1189 229 -640 -3631 -5400 -4084
4675 -4084 -5997 -8038 -1793 605 896 547 1944 3680 -35 -2367 -2327 -2006 -3691 -3420 -2752 -974 -1164
4658 -1164 -1229 -3380 -4284 -5686 -4647 -3036 -1960 -211 1333 589 -1902 -3418 -1611 -1699 -1869 1870 423
4641 423 -3372 -5999 -7085 -5114 -3521 116 4028 8329 2990 3477 2787 -1679 616 2979 888 -1344
4625 -1344 1441 4173 3257 -540 1172 -813 -2630 -971 702 2441 767 -526 -2867 -4793 -4403
$$ packed form
4742b547L56R92K645K205N18j266o566P88P70R48L582j409r40L403K145J899r02
4725F621n366n871j48N90J911p9k181J019J482K028J295J853Q08k225k373l3l297
4708c966j474J936j60L914K075j372o33O71q09l227k779q65J664J963J849J277
4692F4k800J741R83k438j17L66k68p95j088J82M59K522J418q69k991j769J316
4675d084j913k041O245K398K91l49J397J736l715k332M0L21j685K71O68J778j90
4658a164o5k151r04j402J039J611J076J749J544p44k491j516J807q8j70L739j447
4641D23l795k627j086J971J593L637L912M301n339M87o90m466K295K363k091k232
4625a344K785K732r16l797J712j985j817J659J673J739j674j293k341j926L90
$$ plain form
4610 -4403 -2248 367 -949 492 1516 -2939 -5321 -4992 -1494 -1502 -2956 -2280 -2086 -3217 174 848 360
4593 360 -974 -2714 -393 -251 -3452 -6231 -3518 -580 1394 -133 -3515 -7025 -5117 -6271 -4007
4578 -4007 -2608 -586 997 -1914 -3947 -5510 -4633 -3021 -3439 -4035 -2649 -4974 -8959 -5899 -1078 -5579
4562 -5579 -9095 -7731 -4010 -1164 -2136 -1703 1887 2589 -1058 -5351 -2976 360 3062 4845 3457 2110
4546 2110 1760 3422 279 -621 3744 6929 6020 1710 -3560 -4608 -4675 -3380 -5188 -5005 -600 1522
4530 1522 93 -3246 -4522 -1427 -3685 -2183 25 1254 1831 1994 1738 -1534 -5423 -4146 -2832 -2592
4514 -2592 -4013 -5635 -5507 -4610 -4329 -5705 -5559 -3839 -788 231 868 4250 3516 -720 -2646 746
4498 746 1593 1816 2213 4130 4898 5079 2825 1888 -369 779 522 -1955 755 4336 2979 2366 3737
$$ packed form
4610d403K155K615j316J441J024m455k382L29L498qj454O76J94j131L391O74m88
4593C60j334j740K321J42l201k779K713K938J974j527l382l510J908j154K264
4578d007J399K022J583k911k033j563Q77J612m18n96J386k325l985L060M821m501
4562e579l516J364L721K846r72M33L590P02l647m293K375L336K702J783j388j347
4546B110l50J662l143r00M365L185r09m310n270j048o7J295j808J83M405K122
4530A522j429l339j276L095k258J502K208J229N77J63k56l272l889J277J314K40
4514b592j421j622J28Q97K81j376J46J720L051J019O37L382p34m236j926L392
4498G46Q47K23L97J917P68J81k254r37k257J148k57k477K710L581j357o13J371
$$ plain form
4481 3737 2094 857 1061 -892 -2321 -2093 -3353 -5532 -5825 -3703 574 -67 1472 1359 -760 -1122
4465 -1122 143 1438 266 -2040 -4491 -1907 2800 4085 4980 -65 -2229 -2424 -1064 74 628 393
4449 393 2107 43 380 -716 -830 -1795 -262 157 464 -1293 2638 2304 2263 3877 4048 1520 630 -789
4431 -789 -3231 -4297 -1536 2283 2102 928 2492 4006 2848 2256 4427 8635 9872 5489 4284 3488
4415 3488 3361 1018 1746 2120 1672 -581 -2639 -2795 -2187 -1940 -355 2056 3653 3482 4308 -1532 -2719
4398 -2719 450 565 -567 -2567 -3046 -479 43 668 221 307 798 -87 147 -610 -254 1079 1463 665
4380 665 -664 -209 -172 -3387 -2612 -2101 -3432 -3651 -2814 -1428 -292 -83 14 -651 -2040 -3382 -3322 -1131
4362 -1131 -974 -2123 148 1733 -3268 -4780 -5492 -5405 -7204 -4022 -1535 -2266 -3442 -1963 -2287 -66
$$ packed form
4481C737j643j237K04j953j429K28j260k179k93K122M277o41J539j13k119l62
4465a122J265J295j172k306k451K584M707J285Q95n045k164j95J360J138N54k35
4449C93J714k064L37j096j14r65J533M19L07j757L931l34m1J614J71k528q90j419
4431g89k442j066K761L819j81j174J564J514j158n92K171M208J237m383j205p96
4415C488j27k343P28L74m48k253k058j56O08K47J585K411J597j71Q26n840j187
4398b719L169J15j132k000m79K567N22O25m47Q6M91q85K34p57L56J333L84p98
4380F65j329M55L7l215P75N11j331k19Q37J386J136K09R7o65j389j342O0K191
4362a131J57j149K271J585n001j512p12Q7j799L182K487p31j176J479l24K221
$$ plain form
4346 -66 1619 730 2316 2844 1656 -2124 -4258 671 4212 2169 -114 -2756 -1603 -534 -1092 -4249
4330 -4249 -3720 2170 412 23 1212 898 956 622 -2114 -137 -1495 -1856 -1187 -2301 -2595 -4461 -3086
4313 -3086 -1889 -4920 -7397 -5589 -2649 -6325 -6699 -6607 -5303 -6350 -5844 -3301 -2378 -2896 -1395 237
4297 237 -280 2700 4507 3564 2547 -514 -3040 -3162 -3770 -4830 -7748 -7421 -4332 -1668 -2617 -1899 -5341
4280 -5341 -5738 -1435 -1105 -4837 -4489 -5646 -3129 1705 1842 -2089 -3674 -724 -2002 -4570 -4822 -1152
4264 -1152 1123 525 -997 -3741 -8280 -9653 -9629 -4857 -2673 275 336 1050 1359 -146 1848 2137 3069
4247 3069 2275 2745 1300 1851 3378 6317 5370 3030 182 -223 294 591 1950 2731 2345 1002 1139
4230 1139 825 1598 -2081 -7026 -9167 -6083 -6324 -4729 -1886 -2609 -4055 -2977 -2105 -1185 -2423 -591
$$ packed form
4346f6J685q89J586N28j188l780k134M929L541k043k283k642J153J069n58l157
4330d249N29N890j758l89J189l14N8l34k736J977j358l61O69j114k94j866J375
4313c086J197l031k477J808K940l676l74R2J304j047N06K543R23n18J501J632
4297B37n17K980J807r43j017l061k526j22o08j060k918L27L089K664r49P18l442
4280e341l97M303L30l732L48j157K517M834J37l931j585K950j278k568k52L670
4264a152K275n98j522k744m539j373K4M772K184K948O1P14L09j505J994K89R32
4247C069p94M70j445N51J527K939r47k340k848m05N17K97J359P81l86j343J37
4230A139l14P73l679m945k141L084k41J595K843p23j446J078Q72R20j238J832
$$ plain form
4214 -591 1438 -195 2288 1592 105 -1078 -2616 -5227 186 3479 1692 -158 -1252 -263 -1754 -353
4198 -353 4610 2709 1535 988 3336 300 1314 1028 3094 4005 3421 3713 4683 2614 2048 -370 -2697
4181 -2697 -1389 800 366 -871 3136 2451 -728 -3750 -1900 -2057 -1092 2626 694 -680 556 -464
4165 -464 -1962 -384 4206 2603 15 -2872 -4517 -5456 -6889 -1211 1814 2637 1855 4331 5249 4597
4149 4597 3304 -42 -785 512 2853 994 1772 865 -3171 -3825 -2762 -983 2048 -151 330 1818
4133 1818 946 -1467 1611 349 -1000 -689 -3681 -4596 -4267 -2519 -3324 -4830 -2803 -2278 411 196 -2449
4116 -2449 -4103 -5132 -5685 -2475 563 2446 1123 2363 -2302 -6882 -3789 1806 349 -3029 -4887
4101 -4887 19 3289 4337 4237 2845 2861 167 -1957 -4578 -2987 28 -977 -3984 -3925 -2870 -4609
$$ packed form
4214e91K029j633K483o96j487j183j538k611N413L293j787j850j094R89j491J401
4198c53M963j901j174n47K348l036J014k86K066R11n84K92R70k069n66k418k327
4181b697J308K189m34j237M007o85l179l022J850j57R65L718j932j374J236j020
4165d64j498J578M590j603k588k887j645r39j433N678L025Q23p82K476R18o52
4149D597j293l346p43J297K341j859P78r07m036o54J063J779L031k199M81J488
4133A818q72k413L078j262j349L11k992r15L29J748q05j506K027N25K689k15k645
4116b449j654j029n53L210L038J883j323J240m665m580L093N595j457l378j858
4101d887M906L270J048j00j392J6k694k124k621J591L015j005l007N9J055j739
$$ plain form
4085 -4609 -4487 -928 -2009 -1839 -1949 -2244 -3615 -5573 -5929 -6059 -3529 -2374 -3670 744 2215 1371 805
4068 805 -93 -3056 -2915 -798 -991 455 4973 4514 1289 -118 -3146 -1077 108 -1124 -4368 -2505
4052 -2505 -759 114 2339 1989 1746 324 1353 -2464 -5682 -2528 -2573 -5338 -4985 -6742 -6552 -2334 -202
4035 -202 1201 -1458 -2886 -2683 -2930 -4632 -3541 2196 2260 3386 4315 5602 1424 -3085 -981 9 122
4018 122 -1552 -2173 -776 -2260 -2440 -3642 -2057 -495 -467 26 2223 -290 -4317 -2150 2177 1704 -2246
4001 -2246 -4911 -2580 -867 -1276 1206 3928 1979 -270 -1395 211 -2720 -2876 -1540 1292 1040 116
3985 116 -79 -3708 -4216 -5573 -3331 312 1841 -55 -523 -24 -1168 -4069 -4561 -2427 1079 2499
3969 2499 3655 1650 1764 3006 3696 3096 -954 -2121 627 5746 5741 2668 -1022 -1579 -104 -1450 -1891
$$ packed form
4085d609J22L559j081J70j10k95j371j958l56j30K530J155j296M414J471q44n66
4068H05q98k963J41K117j93J446M518m59l225j407l028K069J185j232l244J863
4052b505J746Q73K225l50k43j422J029l817l218L154m5k765L53j757J90M218K132
4035b02J403k659j428K03k47j702J091N737O4J126R29J287m178m509K104R90J13
4018A22j674o21J397j484j80j202J585J562K8M93K197k513m027K167M327m73l950
4001b246k665K331J713m09K482K722j949k249j125J606k931j56J336K832k52r24
3985A16j95l629n08j357K242L643J529j896m68M99j144k901m92K134L506J420
3969B499J156k005J14J242O90o00m050j167K748N119nl073l690n57J475j346m41
$$ plain form
3952 -1891 -1549 517 2500 2082 2065 1445 -4776 -6735 -1688 -934 -285 2645 3685 4539 1718 1160 -459
3935 -459 -3335 -2150 -1028 2998 5605 4931 1299 643 31 -1846 -2851 -23 -1129 -2777 -2385 -2798
3919 -2798 -3554 -2396 1099 1810 252 -2681 -227 -328 -900 -4224 -5105 -3822 369 812 438 75 -1182
3902 -1182 -3472 -2243 -1596 -2740 -4200 -7322 -6227 -5447 -1994 -178 250 3932 1729 -716 1245 2060
3886 2060 40 -1343 91 4193 5774 3272 -343 -807 1368 2586 5174 5411 -467 -3485 -546
3871 -546 1535 4884 4519 176 -1498 2345 3663 -123 -3889 -5912 -5368 -5735 -5254 -1969 -1753 -5684
3855 -5684 -6145 -1824 -29 -805 1468 -1117 1021 4477 4113 2067 -781 869 4328 3747 2172 1979
3839 1979 3701 3503 2305 1599 -1781 -1958 -2161 -2866 -2695 -3545 -5567 -4698 -1316 4225 7206 6777 2040
$$ packed form
3952a891L42K066J983m18j7o20o221j959N047P54O49K930J040Q54k821n58j619
3935d59k876J185J122M026K607o74l632o56o12j877j005K828j106j648L92m13
3919b798p56J158L495P11j558k933K454j01n72l324q81J283M191M43l74l63j257
3902a182k290J229O47j144j460l122J095P80L453J816M28L682k203k445J961Q15
3886B060k020j383J434M102J581k502l615m64K175J218K588K37n878l018K939
3871e46K081L349l65m343j674L843J318l786l766k023N44l67M81L285K16l931
3855e684m61M321J795p76K273k585K138L456l64k046k848J650L459n81j575j93
3839A979J722j98j198p06l380j77k03p05J71q50k022Q69L382N541K981m29m737
$$ plain form
3822 2040 -972 953 167 761 916 1313 4823 4763 5291 6737 6878 6702 3610 1501 1910 -183 -3790
3805 -3790 -3940 -2354 -2359 -742 -742 -1162 608 535 2757 808 -2400 -450 28 2367 2635 -771 -3048 -4231
3787 -4231 -2803 -4635 -3720 326 438 -2170 -4265 -2518 2476 5924 6778 4309 1395 -41 -835 -2956
3771 -2956 -2497 -606 -1332 -2472 -3646 -3243 -2109 -3205 -5661 -5286 -4240 -1914 -1422 -873 -646 48 1917
3754 1917 816 645 558 565 -912 340 679 2774 4401 2793 2453 1942 510 1026 1641 5372 6263 3086
3736 3086 30 -628 3567 1631 633 1096 1328 3458 1770 592 285 -3395 -1458 2147 4177 2030
3720 2030 -1111 -2745 -4074 -4123 -3554 -4952 -3099 -1399 -1317 -976 -2052 -3178 -4363 -5115 -3686 1641 -787
3703 -787 -2612 -4798 -3141 -1554 -237 -231 -680 8 1939 2000 2578 1552 -1884 -1084 1636 1657 -28 562
$$ packed form
3822B040l012J925p86N94J55L97L510o0N28J446J41j76l092k109M09k093l607
3805c790j50J586nJ617%m20J770p3K222j949l208J950M78K339K68l406k277j183
3787d231J428j832R15M046J12k608k095J747M994L448Q54k469k914j436p94k121
3771b956M59J891p26j140j174M03J134j096k456L75J046K326M92N49K27O94J869
3754A917j101j71q7Pj477J252L39K095J627j608l40n11j432N16O15L731Q91l177
3736C086l056o58M195j936r98M63K32K130j688j178l07l680J937L605K030k147
3720B030l141j634j329m9N69j398J853J700Q2L41j076j126j185p52J429N327k428
3703g87j825k186J657J587J317Om49O88J931O1N78j026l436Q00K720K1j685N90
$$ plain form
3685 562 708 -1892 -2107 -1325 855 2270 -1161 -2270 -1496 -3189 -2981 -3292 -4827 23 2546 3553 5869
3668 5869 2856 3524 1703 1251 -662 -6459 -5819 -5293 -1045 -308 -184 1702 -1335 -3734 -4729 -2847 -513
3651 -513 -60 -678 -2811 -2154 -177 -240 -1486 -2651 -1821 -731 -772 4588 4769 100 -2179 -1605 -1657 -1748 -3041
3632 -3041 -2069 181 -396 -1690 -152 -1281 -3144 -2035 -5704 -3356 -162 2764 3641 2957 2304 -6123
3616 -6123 -10347 -9688 -7747 -4033 -3743 -6785 -4856 -2154 -30 373 -2326 -5678 -3080 -1526 1940 4926
3600 4926 5113 6811 5425 3999 882 2494 3354 1561 883 2288 2923 1838 502 -574 342 932
3584 932 3389 4850 1968 1704 1417 -944 263 -803 -1667 -1312 -151 -2418 -1261 -4185 -3744 -2613
3568 -2613 855 -8 -2510 -2606 -2610 -1497 -695 2244 3154 -659 -4236 -7753 -6772 -6452 -6613 -4944 -3814 -3640
$$ packed form
3685E62J46k600k15P82K180J415l431j109P74j693K08l11j535M850K523J007K316
3668E869l013O68j821m52j913n797O40N26M248P37J24J886l037k399r95J882K334
3651e13M53o18k133O57J977o3j246j165Q30J090m1N360J81m669k279N74n2r1j293
3632c041R72K250n77j294J538j129j863J109l669K348L194K926Q77o84o53q427
3616f123m224O59J941L714K90l042J929K702K124M03k699l352K598J554L466K986
3600D926J87J698j386j426l117J612Q60j793o78J405O35j085j336j076R16N90
3584I32K457J461k882k64k87k361J207j066q64L55J161k267J157k924M41J131
3568b613L468q63k502r6mJ113Q02K939R10l813l577l517R81L20j61J669J130J74
$$ plain form
3550 -3640 -3724 -2262 -5965 -4975 -4856 -2395 11 -386 -1036 561 1212 1374 1761 2934 4676 1843 84
3533 84 993 140 114 -182 -771 -2134 1724 1984 2121 1819 -3130 -4142 -1117 -222 -967 -579 1249 2412
3515 2412 2069 4267 6157 3285 1541 329 511 2931 2032 -1358 1446 3039 5208 691 412 -1005
3499 -1005 -2147 -1176 -843 -1805 -2513 -100 -3689 -5000 -2551 1265 2210 3413 4791 5357 3753 4108 4549
3482 4549 1776 -960 -2821 -2141 -4836 -2888 -247 860 3095 3310 1416 686 4153 4520 454 252
3466 252 2934 2860 3796 7293 5224 1294 575 1416 407 -1036 -4164 -4902 -5741 -6635 -5362 -1680 -89
3449 -89 -894 266 -1048 -1041 -216 57 1011 530 -2789 -2706 -1554 -1099 -3 3704 5760 6057 3569 1291
3431 1291 1216 554 2368 1161 -1383 -3881 -2599 -279 -1407 -3685 -4724 -3853 -2709 -1184 615 957
$$ packed form
3550c640q4J462l703R90J19K461K406l97o50J597O51J62L87J173J742k833j759
3533H4R09q53k6k96n89j363L858K60J37l02m949j012L025Q95p45L88J828J163
3515B412l43K198J890k872j744j212J82K420q99l390K804J593K169m517k79j417
3499a005j142R71L33r62p08K413l589j311K449L816R45J203J378N66j604L55M41
3482D549k773k736j861O80k695J948K641J107K235K15j894p30L467L67m066k02
3466B52K682p4R36L497k069l930p19Q41j009j443l128p38q39q94J273L682J591
3449h9q05J160j314PQ25K73R54m81l319Q3J152M55J096L707K056K97k488k278
3431A291p5o62J814j207k544k498J282K320j128k278j039Q71J144J525J799L42
$$ plain form
3415 957 -626 267 392 -430 -2664 -2640 -5285 -4867 -1847 -466 -2626 -1667 -679 -846 165 1271 3972
3398 3972 4311 3434 3184 2571 3946 2195 -223 829 1142 3659 3520 -42 -251 -724 -533 -2500 -1463
3381 -1463 -592 1301 4577 5123 3582 3585 1664 161 -356 -378 -636 423 1028 -346 -1733 -2061 -3088 -2648
3363 -2648 -2036 598 1369 -228 672 3550 4173 4231 1556 5336 6307 3085 371 -2762 -3141 -3190 -3469 -5808
3345 -5808 -5568 -8498 -6306 -5243 -4180 -1994 -2354 -4740 -4957 -3530 -4133 -2695 -1812 -1892 -1786 -1053 492
3328 492 2245 2691 940 743 -3241 -7759 -6912 -4546 -6163 -6790 -5940 -3087 -1667 -1421 2182 3504 2883
3311 2883 1294 -20 -2373 -4233 -3373 -2735 -1941 499 592 -675 -134 -1550 -93 -656 -17 29 -2045
3294 -2045 -952 2631 4252 -1810 -4357 -3730 -5003 -5273 -2029 -1163 -232 -3166 -3152 17 632 979 4111
$$ packed form
3415I57j583Q93J25q22k234K4k645M18L020J381k160R59R88j67J011J106K701
3398C972L39q77k50o13J375j751k418J052L13K517j39l562k09m73J91j967J037
3381a463Q71J893L276N46j541Lj921j503n17k2k58J059O05j374j387l28j027M40
3363b648O12K634P71j597R00K878O23N8k675L780R71l222k714l133l79m9k79k339
3345e808K40k930K192J063J063K186l60k386k17J427o03J438Q83q0J06P33J545
3328D92J753M46j751j97l984m518Q47K366j617o27Q50K853J420K46L603J322o21
3311B883j589j314k353j860Q60O38P94K440R3j267N41j416J457n63O39M6k074
3294b045J093L583J621o062k547O27j273k70L244Q66R31k934J4L169O15L47L132
$$ plain form
3277 4111 3921 2430 4156 1874 -2157 -1722 2547 3572 1589 -394 1013 448 3728 3727 3764 3738 1526
$$ packed form
3277D111j90j491J726k282m031M35M269J025j983j983J407n65L280jL7k6k212
$$ [...]
##END NTUPLES=NMR SPECTRUM
##END=
