##TITLE=Analysis number 326867
Compound Code mo 07018
Project Code adrs
Chemist Name spectrum
##JCAMPDX= 6.0         $$ Bruker NMR JCAMP-DX V2.0
##DATA TYPE= NMR SPECTRUM
##DATA CLASS= NTUPLES
##ORIGIN= Bruker BioSpin GmbH
##OWNER= nmr
$$ XWIN-NMR		Version 3.5
$$ Tue Feb 27 08:54:48 2007 GMT Standard Time (UT+0h)  MAYBRIDGE\nmr@NMR_250MHZ
##.OBSERVE FREQUENCY= 250.131544655141
##.OBSERVE NUCLEUS= ^1H
##.ACQUISITION MODE= SIMULTANEOUS (DQD)
##.ACQUISITION SCHEME= undefined
##.AVERAGES= 16
##.DIGITISER RES= 18
##SPECTROMETER/DATA SYSTEM= dpx250
##.PULSE SEQUENCE= zg30
##.SOLVENT NAME= CDCl3
##.SHIFT REFERENCE= (INTERNAL, CDCl3, 0, 16.522)
##AUDIT TRAIL= $$ (NUMBER, WHEN, WHO, WHERE, WHAT)
$$ ##TITLE= Audit trail, XWIN-NMR		Version 3.5
$$ ##JCAMPDX= 5.01
$$ ##ORIGIN= Bruker BioSpin GmbH
$$ ##OWNER= nmr
$$ C:\u/data/dgb/nmr/ADRS/2390/pdata/1/auditp.txt
$$ ##AUDIT TRAIL=  $$ (NUMBER, WHEN, WHO, WHERE, WHAT)
(   1,<2007-02-27 08:54:21.92 +000>,<MAYBRIDGE\nmr>,<NMR_250MHZ>,
      <created by zg, POWCHK disabled, PULCHK disabled
       configuration hash MD5:
       49 4B E0 1D 92 C2 6B 37 9F E6 65 BC 52 41 86 1D
       data hash MD5: 64K
       7E 18 CE 15 7F 75 39 3B C8 1E 7C 1C 1D D9 F4 6C>)
(   2,<2007-02-27 08:54:36.29 +000>,<MAYBRIDGE\nmr>,<NMR_250MHZ>,
      <Start of raw data processing
       ef LB = 0.3 FT_mod = 6 PKNL = 1 SI = 32K 
       data hash MD5: 32K
       D5 5E 40 7C 3A 47 47 6E F7 8C 7F 55 AC 4C 38 C4>)
(   3,<2007-02-27 08:54:37.92 +000>,<MAYBRIDGE\nmr>,<NMR_250MHZ>,
      <apk 
       data hash MD5: 32K
       47 31 77 F6 AF 41 0A FA 8F 11 32 B9 3D 68 64 6D>)
(   4,<2007-02-27 08:54:38.59 +000>,<MAYBRIDGE\nmr>,<NMR_250MHZ>,
      <abs ABSG = 5 
       data hash MD5: 32K
       9B B6 58 8D 64 35 8B 26 D7 EC 56 ED 4D 6D 51 A6>)
$$ ##END=
$$ 
$$ hash MD5
$$ 3C 3B 70 B4 72 95 FD 55 0A DA FE BA 25 DA 53 24
##$RELAX= 
##$RELAX= 
##$RELAX= 
##$RELAX= 
##$RELAX= 
##$RELAX= 
##$RELAX= 
$$ Bruker specific parameters
$$ --------------------------
##$DU= <C:\u>
##$EXPNO= 2390
##$NAME= <ADRS>
##$PROCNO= 1
##$TYPE= <nmr>
##$USER= <dgb>
##$AMP= (0..31)
100 100 100 100 100 100 100 100 100 100 100 100 100 100 100 100 100 100 
100 100 100 100 100 100 100 100 100 100 100 100 100 100 
##$AQSEQ= 0
##$AQ_mod= 3
##$AUNM= <au_zg>
##$AUTOPOS= <31 >
##$BF1= 250.13
##$BF2= 250.13
##$BF3= 250.13
##$BF4= 250.13
##$BF5= 500.13
##$BF6= 500.13
##$BF7= 500.13
##$BF8= 500.13
##$BYTORDA= 1
##$CFDGTYP= 0
##$CFRGTYP= 5
##$CHEMSTR= <none>
##$CNST= (0..31)
1 1 145 1 1 1 1 1 1 1 1 1 1 1 1 1 1 1 1 1 1 1 1 1 1 1 1 1 1 1 1 1 
##$CPDPRG= <>
##$CPDPRG1= <>
##$CPDPRG2= <>
##$CPDPRG3= <>
##$CPDPRG4= <mlev>
##$CPDPRG5= <mlev>
##$CPDPRG6= <mlev>
##$CPDPRG7= <mlev>
##$CPDPRG8= <mlev>
##$CPDPRGB= <>
##$CPDPRGT= <>
##$D= (0..31)
0 1 0 0 0 0 0 0 0 0.06 0 0 0 0 0 0 0.0002 0 0 0 0 0 0 0 0 0 0 0 0 0 0 
0 
##$DATE= 1172566460
##$DBL= (0..7)
120 120 120 120 120 120 120 120 
##$DBP= (0..7)
150 150 150 150 150 150 150 150 
##$DBP07= 0
##$DBPNAM0= <>
##$DBPNAM1= <>
##$DBPNAM2= <>
$$ [...]
##$SUBNAM7= <"">
##$SUBNAM8= <"">
##$SUBNAM9= <"">
##$SW= 20.6930455092707
##$SWIBOX= (0..15)
0 0 3 0 0 0 0 0 0 0 0 0 0 0 0 0 
##$SW_h= 5175.983436853
##$TD= 65536
##$TD0= 1
##$TE= 295.16
##$TE2= 300
##$TE3= 300
##$TEG= 300
##$TL= (0..7)
0 120 120 120 120 120 120 120 
##$TP= (0..7)
150 150 150 150 150 150 150 150 
##$TP07= 0
##$TPNAME0= <>
##$TPNAME1= <>
##$TPNAME2= <>
##$TPNAME3= <>
##$TPNAME4= <>
##$TPNAME5= <>
##$TPNAME6= <>
##$TPNAME7= <>
##$TPOAL= (0..7)
0.5 0.5 0.5 0.5 0.5 0.5 0.5 0.5 
##$TPOFFS= (0..7)
0 0 0 0 0 0 0 0 
##$TUNHIN= 0
##$TUNHOUT= 0
##$TUNXOUT= 0
##$USERA1= <user>
##$USERA2= <user>
##$USERA3= <user>
##$USERA4= <user>
##$USERA5= <user>
##$V9= 5
##$VALIST= <valist>
##$VCLIST= <CCCCCCCCCCCCCCC>
##$VD= 0
##$VDLIST= <DDDDDDDDDDDDDDD>
##$VPLIST= <PPPPPPPPPPPPPPP>
##$VTLIST= <TTTTTTTTTTTTTTT>
##$WBST= 1024
##$WBSW= 4
##$XGAIN= (0..3)
0 0 0 0 
##$XL= 0
##$YL= 0
##$YMAX_a= 211438
##$YMIN_a= -307571
##$ZGOPTNS= <>
##$ZL1= 120
##$ZL2= 120
##$ZL3= 120
##$ZL4= 120
##$ABSF1= 16.522
##$ABSF2= -4.171173
##$ABSG= 5
##$ABSL= 3
##$ALPHA= 0
##$AQORDER= 0
##$ASSFAC= 0
##$ASSFACI= 0
##$ASSFACX= 0
##$ASSWID= 0
##$AUNMP= <proc_1d>
##$AZFE= 0.1
##$AZFW= 0.1
##$BCFW= 0
##$BC_mod= 0
##$BYTORDP= 0
##$COROFFS= 0
##$CY= 12.5
##$DATMOD= 1
##$DC= 0
##$DFILT= <>
##$DTYPP= 0
##$F1P= 14.0000005364418
##$F2P= -0.99999901652339
##$FCOR= 0.5
##$FTSIZE= 32768
##$FT_mod= 6
##$GAMMA= 0
##$GB= 0
##$INTBC= 1
##$INTSCL= 1
##$ISEN= 128
##$LB= 0.3
##$LEV0= 0
##$LPBIN= 0
##$MAXI= 10000
##$MC2= 0
##$MEAN= 0
##$ME_mod= 0
##$MI= 0
##$NCOEF= 0
##$NC_proc= -4
##$NLEV= 6
##$NOISF1= 0
##$NOISF2= 0
##$NSP= 0
##$NTH_PI= 0
##$NZP= 0
##$OFFSET= 16.522
##$PC= 1
##$PHC0= 227.9854
##$PHC1= 10.57742
##$PH_mod= 1
##$PKNL= yes
##$PPARMOD= 0
##$PSCAL= 4
##$PSIGN= 0
##$REVERSE= no
##$SF= 250.13
##$SI= 32768
##$SIGF1= 0
##$SIGF2= 0
##$SINO= 400
##$SIOLD= 32768
##$SREGLST= <1H.CDCl3>
##$SSB= 0
##$STSI= 32768
##$STSR= 0
##$SW_p= 5175.98343685301
##$SYMM= 0
##$S_DEV= 0
##$TDeff= 65536
##$TDoff= 0
##$TI= <Analysis number 999999
Compound Code 99
Book Reference 9
Project Code 9>
##$TILT= no
##$TM1= 0
##$TM2= 0
##$TOPLEV= 0
##$USERP1= <user>
##$USERP2= <user>
##$USERP3= <user>
##$USERP4= <user>
##$USERP5= <user>
##$WDW= 1
##$XDIM= 32768
##$YMAX_p= 386432163
##$YMIN_p= -352188
$$ End of Bruker specific parameters
$$ ---------------------------------
##NTUPLES= NMR SPECTRUM
##VAR_NAME=  FREQUENCY,     SPECTRUM/REAL,   SPECTRUM/IMAG
##SYMBOL=    X,             R,               I
##VAR_TYPE=  INDEPENDENT,   DEPENDENT,       DEPENDENT
##VAR_FORM=  AFFN,          ASDF,            ASDF
##VAR_DIM=   32768,         32768,           32768
##UNITS=     HZ,            ARBITRARY UNITS, ARBITRARY UNITS
##FACTOR=    0.157963299565203, 1,           1
##FIRST=     4132.6476996994, 0,             0
##LAST=      -1043.33573715361, 0,           0
##MIN=       -1043.33573715361, -352188,     0
##MAX=       4132.6476996994, 386432163,     0
$$ Real data points
##PAGE= N=1
##DATA TABLE= (X++(R..R)), XYDATA
$$ [...]
17924 89934 72441 59582 128249 71943 52902 98885 127975 132110 146698 160392 131011 48004
17912 48004 92155 105417 66106 40659 48838 8418 52253 124779 155922 91056 -27504 -95609
17900 -95609 -69513 -54974 -52580 -37125 -31012 -14849 34330 -12262 -110796 -136697 -120324 -130497
17888 -130497 -133118 -155626 -153238 -84824 -59697 -29243 -52342 22647 43907 12092 -9620 -21173
17876 -21173 35583 115415 114898 213457 230268 216568 133352 43737 404 -45097 -158535 -204711
17864 -204711 -173983 -175885 -130504 -8294 9032 79755 117807 70006 35337 -34501 -14684
17853 -14684 -47827 -54691 8608 24962 -3632 34893 17822 -49183 -13571 59297 74369 74377 61499
17840 61499 -47779 -86746 -80789 -33260 81442 162703 153733 76095 22948 -14530 -67286 -7958
17828 -7958 50491 75458 7431 -119468 -64375 29318 26954 -41705 -90332 -3283 87112 47417
17816 47417 -63311 -104914 -85852 -50130 -9248 67428 67771 185535 187997 165618 81477 54522
17804 54522 62058 28900 -24954 25756 88703 36518 -22961 -30941 -58251 -29143 32766 -50316
17792 -50316 -80013 -75732 21841 -25495 -42705 15104 21818 44784 -12767 -34576 -77097 -110335
17780 -110335 -11339 20090 17654 18334 24605 35836 -28438 -114731 -147822 -149243 -164373 -134928
17768 -134928 -92513 -154378 -202231 -202450 -94531 49867 42532 11661 -9419 -56071 -95708 -62299
17756 -62299 -10519 42751 152182 207619 210448 85682 -4768 5128 -111706 -54778 -5653
17745 -5653 49391 102981 39748 -21142 -81881 -104666 -97762 -130581 -120347 -168528 -241206 -261963
17733 -261963 -198900 -159459 -185683 -94269 -36161 -112378 -76044 -109135 -145979 -60277 61804
17722 61804 81045 59622 64160 52208 -23948 20817 82435 102956 69763 54471 -17619 -109216
17710 -109216 -50677 -81312 -131333 -71927 -77714 -92922 -40564 70064 107791 201850 184507
17699 184507 47156 -39275 -61529 -38137 36447 33084 30396 -23166 -8553 51470 105177 62740
17687 62740 15507 3635 38971 8545 3700 -18659 59642 121336 83177 26424 54877 33585
17675 33585 -31073 -25545 -6407 -19571 -25693 -59022 -105020 39313 80550 78154 -7482 -62054
17663 -62054 2236 -17859 19521 86803 118216 88198 91277 124269 148763 270711 393190
17652 393190 455393 410474 387969 358190 193244 127578 118244 259290 407748 435734 529313
17641 529313 499732 481697 424304 311335 250302 212519 202507 133627 132424 213336 197645
17630 197645 147141 150657 74551 -32797 -55915 -31745 -4073 -33364 -34585 -64744 -158832 -110632
17618 -110632 -44408 -22611 -60259 -51707 -50671 -77669 -21777 41997 112613 195441 165823 208844
17606 208844 219078 165881 130624 81268 92892 141000 111194 48410 124387 330712 409627
17595 409627 279208 160426 239891 311119 318109 304157 174644 143225 144254 95491 182458
17584 182458 286928 417280 509901 344805 261914 228336 157067 122919 135162 253765 247220
17573 247220 201067 232092 264266 243719 339578 403184 349457 189359 151534 166068 170972
17562 170972 263234 422227 515987 486514 313363 190255 125675 95228 101093 113454 51463
17551 51463 -16607 9228 50312 46805 -8084 16445 114185 104352 95179 20854 -74420 -61119
17539 -61119 -66334 -33874 -44578 -104476 -102911 -127742 -145871 -53322 26400 31344 79928 84825
17527 84825 43693 11437 110970 291214 410887 416687 401443 373862 370986 370207 329873 252634
17515 252634 139394 73878 98707 9968 24482 65667 67459 94969 81862 174115 323749
17504 323749 443340 402037 302312 263727 205619 101875 12157 -55437 -90110 -63051 -63105 -55878
17492 -55878 19615 -12399 -72429 -48902 -92399 -108328 -94234 -72892 -128712 -114739 -119146 -62324
17480 -62324 -13491 -81247 -32777 38321 1563 -107924 -62175 -49499 -31949 -9811 6887
17469 6887 55003 105623 56634 -3284 -3222 -54143 -20243 73805 184237 122105 26617 -15217
17457 -15217 -56805 -82811 -72439 -78428 -127401 -121863 16071 37376 -28831 -98042 -108727 -40180
17445 -40180 80179 307241 774879 1161741 959077 543490 287236 227467 174837 101322
17435 101322 -8910 -36318 -28678 40924 22370 7176 -62585 -93400 -68245 -70003 -77745 -77866
17423 -77866 -28062 -7183 -62117 -63453 31370 101204 90165 135260 157526 101844 45291 90300
17411 90300 70899 -74459 -118571 -63286 -150531 -115221 -93801 -111668 -151044 -140096 -121891
17400 -121891 -88700 -44897 38994 83721 53652 39195 38265 -80798 -132171 -76743 -55910 -116527
17388 -116527 -122986 -188032 -83877 -26594 -69708 -58518 -12121 1269 -66051 -195159 -125568
17377 -125568 -42165 -43892 -76636 -46896 -41870 -139158 -112974 1705 35391 25039 43799 30319
17365 30319 64995 45276 6917 -29007 -73091 -127014 -182199 -138621 -59429 -30619 -31737 -74438
17353 -74438 -114075 -38273 25486 -41791 -53085 -62173 40560 119511 169222 98796 72597 82188
17341 82188 15575 -50462 18967 -42538 -30700 -28493 -10665 -5527 6832 -19576 -43125 61888
17329 61888 112829 56463 28533 91927 -25606 -104819 -60223 -27034 -76874 -61987 -70613 -164266
17317 -164266 -99291 -47049 -42093 -95048 -154104 -174419 -102624 -15251 12142 54040 45832 39711
17305 39711 -62168 -83108 -31309 -43297 1605 51926 62735 95218 81730 22843 -53655
17294 -53655 -112188 -36177 -60639 -64442 1895 60881 61239 24161 -54289 5949 128213 107410
17282 107410 20103 21912 98245 117699 77466 140516 140169 24779 -22888 -43486 -54614 -86947
17270 -86947 -91969 7171 52637 87377 75624 41440 8361 -39876 -25679 -58323 -96127 -148554
17258 -148554 -144799 -80786 -72831 -143262 -148060 -56044 23660 112374 174675 91506 100573 91222
17246 91222 53978 -12017 61393 139897 185129 158037 88794 13526 -14545 13371 -31155 5176
17234 5176 20628 70837 82519 56016 70120 48753 -2800 -104681 -115216 -142240 -174428 -187746
17222 -187746 -186358 -121516 -38051 -2920 41984 44907 39622 69106 130748 151306 211486 154839
17210 154839 84128 22651 42134 148627 135399 120089 65684 -9092 6758 62888 68006
17199 68006 86841 79473 10570 -64159 -13713 8491 -60138 -19885 48730 36673 60885 60653
17187 60653 -46541 -47675 -54732 -75738 -139658 -151248 -84539 -56621 -51871 -5035 10388 20898
17175 20898 21585 -30876 59911 171563 151673 83250 -7360 8698 -42716 -75765 -34575 -23150
17163 -23150 45145 15924 26476 43959 8081 -94928 -215826 -241886 -97698 -53865 -58342
17152 -58342 -21492 -2275 20595 56487 97178 112017 99951 68576 29242 19832 75138 20752
17140 20752 3764 -17565 32360 72134 64675 88345 132358 83799 14768 -21295 -15726 -63366
17128 -63366 -49789 -68146 -74767 -76462 -164751 -148577 -84154 -18422 -12484 -28434 -32965 -66619
17116 -66619 -58014 -3947 -9668 35769 35067 8501 13383 19517 -567 40624 -9474 -24811 -51602
17103 -51602 -14023 -7514 10250 -20711 -40940 -28265 66103 34999 34700 42121 80477 94118
17091 94118 58956 -3633 -21336 -48872 5515 5075 -81239 -136887 -125243 -106055 -106093 -79899 64485
17078 64485 132053 135884 99622 29494 -46222 -84123 -47223 -43661 -36645 -40350 40064 69012
17066 69012 41457 -24661 -22521 13112 20384 88906 89174 60551 -12706 -129635 -170879 -172573
17054 -172573 -154745 -132922 -53824 657 -68905 -28294 -62336 -83544 -92011 -29918 35112 102672
17042 102672 53131 -41267 -75779 -56563 -11490 92045 133849 90992 -22274 36307 107745
17031 107745 89358 51270 5754 -19337 31213 -17085 -8913 12200 -122 -21541 -37747 -61243
17019 -61243 -75077 -114133 -30731 17512 27881 27246 -7442 68330 17963 -66334 -63929 -39696
17007 -39696 32852 -46014 -71118 50861 85080 108823 117399 85242 15932 -10905 -8191 24714
16995 24714 -26074 -34988 -10888 -24866 -51902 -24340 35765 85754 4467 21896 -19130 -53449
16983 -53449 -8929 -69002 -41240 -59007 -76018 -118867 -162073 -105009 77556 152136 86685
16972 86685 81158 96162 4974 -137141 -116363 -110602 -108165 -60466 50767 71325 69305 4022
16960 4022 -16250 37528 49944 103673 117926 7081 15700 43070 53738 61391 55338 71844
16948 71844 112964 130621 124502 141105 166886 132487 151835 163581 91622 46251 51435 15294
16936 15294 -1138 17181 24253 108309 194333 188890 134024 44118 15497 6936 -41633 -93561
16924 -93561 -26020 33163 69789 87466 46003 18111 -26375 -20995 38259 11350 34040 33425
16912 33425 81597 57768 19143 30379 17133 61616 52452 35165 -79398 -93545 157 164604
16900 164604 213633 137925 56533 1484 -37636 37246 57570 -26664 -8350 -16305 76478 118496
16888 118496 136353 161086 90413 62938 107475 185334 167296 79930 22932 -20452 72342
16877 72342 130571 125277 104873 102181 123532 70981 42230 74077 89328 65738 71935 69566
16865 69566 42149 54914 144890 233751 250225 239298 131854 78182 55311 32840 43558
16854 43558 116360 128746 182582 142482 80100 120434 158093 224160 183739 114371 90834 45851
16842 45851 63454 45896 70718 94387 109972 147998 160946 155232 101744 57007 67983 44344
16830 44344 40251 40790 23038 59982 102457 121937 90067 63808 15922 22750 -11768 -31323
16818 -31323 -7398 -14155 28724 66258 73910 16280 18147 111034 88858 159712 171621 125573
16806 125573 117669 147150 64796 39484 22565 21389 82786 191242 277365 294108 253344 204079
16794 204079 232799 163911 115628 198976 247315 258648 275727 412250 605719 639375 715640
16783 715640 828388 900351 874464 803990 728709 571564 462076 390524 255224 222559 192848
16772 192848 117316 174707 210496 275295 301814 234386 184245 73322 51943 106464 147752
16761 147752 138599 146903 199688 168412 142104 154352 165894 125576 159017 185821 153849 96754
16749 96754 26680 17542 39681 48445 77286 107081 204606 173027 57932 -8541 1667 -51561
16737 -51561 -45925 -19243 30141 21824 19321 85514 43828 59152 75838 68365 103220 160866
16725 160866 140781 93933 124372 122623 117204 100623 58042 84085 156498 158086 138167 107570
16713 107570 85583 101574 125201 184546 197838 216667 244562 183390 121899 161346 187925
16702 187925 196514 229252 207016 162163 202005 189117 85114 16815 124027 131907 131254 124302
16690 124302 154495 171470 168149 154949 99673 66464 97073 161223 103260 154195 229818 277409
16678 277409 211149 263940 294889 266745 183585 157270 124782 172669 265545 228457 281536
16667 281536 257392 219083 223394 185693 234176 195520 208850 227311 231313 244644 285232 227576
16655 227576 174528 167615 232290 221160 156922 105481 120765 253413 323353 297728 312051
16644 312051 184299 131042 122585 143897 75552 61674 133239 212021 199541 204218 199542 326924
16632 326924 240800 174732 228540 265606 275572 239008 261668 263652 275989 226957 191287 179374
16620 179374 142817 59417 79661 117055 159529 177210 215668 200180 157066 131091 156616
16609 156616 208138 250761 341206 389138 419299 412228 371260 277495 274324 277117 323073 372770
16597 372770 284554 269813 197396 150479 193734 181411 168988 292845 334651 298520 268910
16586 268910 237060 316636 348598 392884 326709 265490 229778 192609 251021 285329 309684
16575 309684 252904 268809 245722 259019 275824 242515 170870 245719 313495 296773 331273
16564 331273 305097 293150 281667 369817 404751 481090 562130 511525 475208 481738 548917 656539
16552 656539 763353 766413 882471 918841 955238 996414 920471 793656 795669 776894 724694
16541 724694 699954 625989 487074 391944 390655 542134 505735 433355 410247 407620 445589
16530 445589 555364 577964 558719 532483 486175 396257 426059 488972 544132 634835 590233
16519 590233 537653 417714 421670 440144 430611 374119 292069 398404 484166 499331 493787 437747
16507 437747 412438 375776 432295 464801 516460 617291 649303 663387 705347 705800 571564
16496 571564 486788 482676 591556 596608 548498 568333 639962 749777 801884 766691 663292
16485 663292 575659 570584 611749 624495 598077 566941 573678 720108 776711 777138 775566 750406
16473 750406 728585 729249 713622 702032 675941 777451 914798 929866 882761 838773 782975
16462 782975 715884 788087 794262 748547 734596 822310 849271 732793 654289 731595 725066 664749
16450 664749 659461 694762 760317 804814 780242 872572 833175 806513 807343 844814 886981 887983
16438 887983 898542 959159 1051955 1053754 999182 985351 958106 1015479 1051101 1063262 1094382 1015579
16426 1015579 990358 1050820 1104487 1075151 1082769 1095693 1135642 1252375 1271186 1278273 1289752
16415 1289752 1268153 1272629 1238119 1231203 1339764 1434511 1367029 1321067 1297016 1302645 1276449 1263116
16403 1263116 1339982 1393592 1379955 1324916 1359833 1369890 1453609 1520160 1607490 1623489 1582175
16392 1582175 1653669 1684031 1658322 1640278 1691124 1831028 1864260 1888672 1958642 1976538 2033287
16381 2033287 2011292 2033089 2089232 2159215 2213428 2214198 2193861 2296047 2329988 2376129 2440584
16370 2440584 2505334 2578886 2678912 2789678 2848531 2841940 2874340 2846108 2792757 2928563 3071060
16359 3071060 3094323 3134722 3177133 3205159 3299477 3406440 3418831 3522737 3618137 3724444 3742786
16348 3742786 3813724 3956608 3979186 4013559 4109547 4263818 4393361 4486743 4648548 4767061
16338 4767061 4852307 4915621 5171342 5360900 5539576 5745714 5882923 6055148 6264551 6384730
16328 6384730 6512448 6693456 6929225 7189796 7384561 7642131 7860746 8121200 8407847
16319 8407847 8640008 8940531 9235508 9554586 9882462 10228251 10617763 11018041 11507049
16310 11507049 11869746 12359746 12924097 13417014 13938765 14448613 15022976 15679449 16259018
16301 16259018 16944173 17667353 18370310 19139384 20031189 20982051 21883841 22885076 23855614
16292 23855614 24860930 26032697 27206357 28358863 29621404 30839761 32156402 33460653
16284 33460653 34721948 36044164 37332478 38613627 39848019 41017201 42162967 43315887
16276 43315887 44355568 45117194 45709595 46239932 46683722 47014636 47066877 46990629 46814998
16267 46814998 46512242 46035441 45356542 44535243 43689186 42675054 41493834 40292597 39063631
16258 39063631 37846241 36506239 35194552 33920322 32678650 31422318 30154895 28889101
16250 28889101 27799424 26710297 25573376 24464229 23389913 22352324 21435840 20570997
16242 20570997 19760455 18955546 18058250 17312013 16608882 15929499 15345862 14817284 14302161
16233 14302161 13810480 13383177 13021875 12606798 12119817 11637466 11242052 10831775 10458039
16224 10458039 10176567 9854300 9471176 9279849 9001923 8772871 8684029 8542560 8404731
16215 8404731 8281161 8254430 8313495 8437136 8642606 8760884 8652502 8595311 8532741 8293310
16205 8293310 8030116 7885397 7834482 7866274 8017248 8366234 9033292 9863199 10934310 12428658
16195 12428658 14506724 17621149 22377600 30184830 43672984 65344821 92852552 117130956
16187 117130956 139397418 167572748 179858971 156671377 126285814 104088153 80061056
16180 80061056 55232802 37361150 26915880 20959737 17254000 14715113 12770859 11179628
16172 11179628 9796240 8562012 7561501 6674869 6087656 5623173 5321247 5088442 4976870
16163 4976870 5086920 5133253 4980199 4692022 4266812 3794900 3481777 3212476 2907137 2837157
16153 2837157 2735029 2605852 2504474 2428685 2345580 2305149 2235805 2197296 2091186 2087836 1975950
16142 1975950 1854197 1814542 1888815 1870308 1811650 1741566 1634384 1670219 1695368 1696164 1654542
16131 1654542 1593130 1589810 1596914 1497716 1444959 1336582 1268997 1211693 1209243 1278281 1285275 1311363
16119 1311363 1341552 1320258 1195721 1183644 1096845 1155491 1163101 1114188 1140712 1122816 1104194
16108 1104194 1123565 1148562 1092295 1043865 970859 972257 1037075 1042265 985992 922184 820155
16097 820155 816076 887059 866124 818669 812503 775527 768886 730885 677891 649106 605444 688041
16085 688041 728510 705288 849930 892868 822764 693577 685628 674313 662684 703951 739208
16074 739208 731881 610504 603086 657138 712416 700716 664253 633201 699368 744992 673707 692036
16062 692036 784656 818444 799863 827514 818392 770859 737061 662503 610078 569045 529117 494148
16050 494148 526744 528141 468727 417707 424800 428679 447222 386894 387620 426490 495893 620691
16038 620691 558319 444289 373765 366877 324933 315736 302090 288993 255059 237339 322173 377082
16026 377082 400147 414968 360268 322038 398582 458674 517129 553082 485777 394956 345881
16015 345881 363141 383891 419226 377349 439881 507670 556162 618299 574594 519906 420590
16004 420590 430362 466449 491058 442790 425440 377173 340441 380615 471016 549413 638735 745503
15992 745503 851897 886826 892736 826140 689869 608348 553714 538635 564791 488429 507037
15981 507037 510767 453007 401016 411154 378380 373691 332860 339823 264257 213459 174956 124378
15969 124378 96784 131220 114968 154543 236010 220148 200058 183964 124872 151446 165226
15958 165226 271752 364387 272082 236786 166805 102973 94283 176585 275945 360981 396685
15947 396685 308868 228249 238126 295732 151530 182100 242669 347075 309328 255374 235189
15936 235189 241082 162742 90334 132367 194540 138617 196723 163891 122378 62504 90804 121966
15924 121966 150187 244113 262820 242874 236633 189133 97812 68954 75753 88032 86353 92609
15912 92609 127370 49936 -15650 40188 119206 161539 216360 223668 196674 187173 180160 191727
15900 191727 151967 111442 204438 257829 214150 253140 290356 296390 311352 278861 281843 189842
15888 189842 183103 234308 200934 164298 201415 224622 292376 310305 286518 228849 245998 215463
15876 215463 126066 129456 216463 213164 132415 54115 43387 167051 124642 125502 144821 174997
15864 174997 158139 42661 19314 96337 181457 115707 98199 116084 77319 12359 31970
15853 31970 77943 168039 215161 199709 166344 103771 202216 241961 173468 141897 129959 174317
15841 174317 188353 109554 43812 48133 36298 90322 194809 97902 54545 99518 134125
15830 134125 148961 173491 162907 150590 185970 93945 52052 42767 109465 168173 116182 26685
15818 26685 4423 -5059 -29802 16973 7273 77657 187633 174533 200208 206277 203389 223653
15806 223653 214194 229294 265423 241189 155480 59523 50601 122976 99467 113660 121522 170022
15794 170022 122650 126049 136280 244731 242186 158010 135094 126465 106876 107054 13629 -99175
15782 -99175 -70115 -31238 12042 34419 15552 23271 62691 47804 65762 22632 45537 112966
15770 112966 111071 101344 27984 -6574 -8705 30220 59313 37641 108648 77625 -12534 -20897
15758 -20897 -11930 28557 95339 54423 -15312 -14750 113495 239072 228015 208111 179567 119371
15746 119371 119889 118727 46334 -44580 1992 52903 82614 119774 90267 -11987 -24562 774
15734 774 59187 66710 66286 9425 34691 128961 209817 209441 221898 239174 231486 260831 274595
15721 274595 195090 187827 219839 139835 72355 -9291 -34243 -15178 53290 90940 86306 108832
15709 108832 13849 4532 67415 157910 138449 99160 54357 70518 132314 91408 58971 118227
15697 118227 213490 239810 129510 42174 -25111 -16915 72788 142923 143749 180154 194178 136909
15685 136909 166851 147334 97400 102157 84160 54069 -3362 -16579 10724 37165 36908 8999
15673 8999 -29969 85 -31436 -4589 7434 73505 47058 2131 9874 19040 -4557 -2673
15661 -2673 11271 -2007 63294 12907 -31449 -77410 -36709 -26678 18536 62785 29631 -7381
15649 -7381 23103 52511 110852 151680 49565 17573 23027 -53097 -157607 -157847 -52802 -77720
15637 -77720 -40725 -63171 10855 101606 131775 62584 59438 123173 52624 10394 10900 -4042
15625 -4042 39644 134164 141899 20390 -94999 -60406 -69872 -56371 62424 128165 163874 137443
15613 137443 -32848 -61815 46624 118007 131106 138415 155825 161422 58627 39787 45597
15602 45597 126960 169320 65303 8040 31387 4380 43484 70224 30664 -39508 54309
15591 54309 94844 102330 156847 196687 315260 338132 428537 579361 743219 893367 914946
15580 914946 834618 670086 495781 324412 211495 146183 142613 128047 75865 33332 -31263
15569 -31263 62058 146002 123788 40600 15069 36805 6627 51592 71310 67972 30276 14288
15557 14288 -35048 -56368 -22231 83873 162448 71533 9037 80807 153423 148502 119183 86646
15545 86646 34431 7446 4595 14784 70073 -350 -79503 -45243 24936 -32657 -119221 -64560
15533 -64560 85432 141638 37403 -128242 -120686 -31230 22022 -19114 15844 114946 104311
15522 104311 -5560 -160845 -115894 -91009 -92222 45126 15059 -29780 -71697 -38397 39159
15511 39159 856 68494 -3677 -88421 -127413 5728 165915 144285 103080 104644 131100
15500 131100 137232 35465 114097 104506 3950 34591 26475 79929 79306 64628 20948 85108
15488 85108 132203 139703 159677 181404 199885 208643 114600 97776 157281 92205 7759 -5554
15476 -5554 77170 230161 234062 113845 41520 80157 43896 21878 382 62472 33041 -69257
15464 -69257 -78701 -86115 -22916 41213 158020 142280 124484 41919 13946 16483 -8282 -35257
15452 -35257 66779 104379 15380 -35654 -80029 -40127 68715 113417 109696 65036 36266
15441 36266 -9197 48613 57374 -60232 -159039 -92288 -17824 -27782 25664 80858 56687 -12790
15429 -12790 -57254 -70837 -18085 -10758 -51436 -20458 -5697 -45594 -36639 54716 172084 101305
15417 101305 71032 81071 111953 96999 -1233 10911 88737 130765 136225 118493 14362
15406 14362 -1889 -65491 -137117 -189345 -191191 -176446 -138524 -90963 -52865 19980 63058 -8623
15394 -8623 -352 -12899 -46460 -25194 -17167 9546 3708 -18433 -35307 4432 60725 113684
15382 113684 91247 45595 35132 89278 172182 120143 47758 62842 120594 174653 141200
15371 141200 119254 93220 78575 119908 82747 -502 -13043 -5858 63560 15724 -24720 -20827
15359 -20827 -17414 65754 128949 98189 104794 49425 -38434 -51943 -58466 37083 5284 -38935
15347 -38935 -15728 -36606 -108772 -190699 -203589 -121102 -105001 -127665 -60577 -6081 71486 152000
15335 152000 139093 166099 100146 -48445 -147991 -132644 -79023 -10935 22124 -38610 -103560
15324 -103560 -99261 -87881 -55233 -66867 -59497 -40125 -16144 37132 -16873 -55651 1173 49313
15312 49313 13156 -21060 -30724 -76220 -94903 9368 36136 32093 56336 52764 11031 16564
15300 16564 34677 42720 25126 27393 38305 38270 7761 12528 80369 136515 106420 94498 79170
15287 79170 28581 48743 12945 -45725 -64842 -87639 -69079 49704 94115 62511 -272
15276 -272 416 -16117 -43795 42424 36557 11701 5350 -2189 47296 31270 -9333 -67852 -23857
15263 -23857 24867 43068 -6705 -30961 5595 7088 11663 -17797 -75678 -132713 -170760 -140836
15251 -140836 -111175 -109933 -58676 11086 74224 116434 8217 44949 124619 113875 112379 60436
15239 60436 48667 144327 96198 63831 24309 -32894 -4084 75822 48466 24440 102340 43984
15227 43984 14812 -28060 37419 73415 42988 95031 132766 202119 152339 -5975 -35772
15216 -35772 -23403 -23646 -74090 -132238 -162730 -179945 -184492 -160705 -118015 -79999 -63683 -94135
15204 -94135 -73841 -49698 -50036 -52046 -4402 109058 119467 5071 -18013 -51107 -61515 -5122
15192 -5122 112236 135091 136366 75228 70863 115566 150644 180211 59594 -15111 -12421 -45334
15180 -45334 -42722 -6950 -20088 -25457 -8895 41675 75517 16171 16005 -27448 -56412 -19174
15168 -19174 62260 94162 129672 84703 52262 84975 7280 -120596 -167449 -97939 12893
15157 12893 61979 103855 178302 128878 46090 -2857 42369 30694 -126702 -106267 23633
15146 23633 99554 145791 104996 58371 76909 111952 39737 -1434 17143 -4442 47549 104163
15134 104163 83125 136687 91860 19595 62147 113106 81799 18773 33476 57033 -1617
15123 -1617 15364 18001 37527 126976 37018 13748 62035 181938 111413 20475 -27465 -81074
15111 -81074 44303 121949 108212 65290 19287 11058 3669 44227 90757 128686 176612 113896
15099 113896 112368 103394 -12206 -132766 -141566 -64446 -22393 -45362 -22792 60887 77187 45601
15087 45601 69475 109436 73281 30913 5509 19805 40558 -28508 -116246 -144290 -117337 -90125
15075 -90125 -89891 -50304 -30062 41177 47438 92708 52125 39847 -57037 -65441 -21799 22935
15063 22935 -17863 -29625 1743 9908 45483 1862 -68113 -9153 43657 -3614 -20451 -83909
15051 -83909 -65926 -89114 -51980 22748 -34782 -55646 -36217 81516 37042 -53576 -86922
15040 -86922 -148692 -165032 -111410 -74793 -61593 -49289 34681 13470 28174 31643 18603 -35028
15028 -35028 -19697 19326 7864 -14122 -4586 -903 -46064 -5460 -27622 18794 77291 48356
15016 48356 106014 61080 -116634 -265948 -282328 -246016 -141382 -27571 98262 147502 162106
15005 162106 147355 159321 96942 118316 145677 88469 75230 126887 130076 86314 -3375 -103714
14993 -103714 -109049 -134849 -104286 -110432 -110216 -45278 -90472 -94412 -139505 -71677 -11817 -22625
14981 -22625 -1298 48450 124486 130087 91102 38880 -19295 -19366 -11826 -25913 -82130 -46243 -17386
14968 -17386 -48620 -38801 -113252 -173586 -147312 -123271 -69247 -4109 -49483 -116188 -223172 -273737
14956 -273737 -167436 -82090 -25254 40161 88765 82233 140327 76589 -22197 15483 91147
14945 91147 135436 164199 174755 139828 127632 56694 10008 -4617 26969 27348 -380 28576
14933 28576 12891 9676 41998 69399 51369 20131 4008 -77189 -56831 42165 16810 -27878
14921 -27878 -75151 -57276 -29884 -33599 -100961 -128980 -74089 -65804 -108236 -94920 -34058 -21437
14909 -21437 -113449 -123234 -94636 -36506 -50713 -41975 -30397 4292 58289 69238 -19545 -85273
14897 -85273 -52521 -524 9163 -28121 -76078 -83640 11518 -28542 -200105 -276861 -126733 -67388
14885 -67388 -142865 -91214 -102508 -32517 -47567 -93910 -132400 -146636 -69403 -38400 -53750 21642
14873 21642 80346 56647 45567 61352 -10811 -110057 -67019 -69672 -22693 40609 -20960 -72686
14861 -72686 -71513 -95239 -55211 1044 2905 -16644 -81717 -142473 -155500 -100411 37550 132953
14849 132953 147468 93960 47314 91885 103744 75245 40600 -17213 3297 -69108 -70639 -9065
14837 -9065 14924 -14837 46028 132490 90841 -66135 -139006 -77310 -78438 -97871 -83638 -12847
14825 -12847 41319 39704 81326 63680 -32880 -126803 -123526 -45397 -20564 31120 72484 39695
14813 39695 44601 5117 3410 -2963 -32062 -56019 3420 34341 -33656 -23268 19328 4498
14801 4498 -57563 -152526 -82465 7375 96849 46205 -22666 -34492 -70474 20308 13966 -14880
14789 -14880 6755 -14546 -67666 -74990 -25243 -3392 -1550 -80893 -145954 -60386 60391 -41217
14777 -41217 -78554 -59389 9453 21783 -15724 3316 42532 69960 1414 -79198 -131641 -102022
14765 -102022 -81750 34855 74668 72246 100445 136477 156854 67707 -18517 -5211 -52894
14754 -52894 -71425 -53649 45134 7343 -441 70855 53138 -90459 -106327 -13841 87465
14743 87465 106332 94649 54272 54162 84478 232583 310273 221984 162066 162890 41103 -3131
14731 -3131 -47144 -57012 -38832 -36030 -39962 -55148 14312 10058 85935 139541 83193 50517 -23618
14718 -23618 -84923 -95522 -79400 -46387 -27314 16049 44323 52609 -26005 -107886 -182839 -155099
14706 -155099 -35759 65087 24095 48501 41655 76081 45579 32659 62729 35692 6584
14695 6584 -25412 -43641 -73759 -91764 -51940 -5171 66665 71958 36095 -48272 -54809 -100696
14683 -100696 -98929 -31473 9380 61932 33530 81444 87661 110959 79485 60094 69988 138063
14671 138063 256440 201502 -26110 -66870 -37351 -4411 -65977 -115557 -69079 -65360 -10722
14660 -10722 -24087 -40465 -95567 -88643 -104651 -65535 7993 19182 -16559 5735 -25350 -38683
14648 -38683 52167 143769 175870 110614 41496 57613 77563 103808 78578 42846 167 32965
14636 32965 -10018 34047 32029 -43079 -53431 -41415 40634 52110 49256 -29220 -124826 -14605
14624 -14605 4161 29867 75572 73623 66463 77857 42040 31065 67570 92907 84941 72924
14612 72924 33413 -48993 -70435 -5380 60537 79370 58635 82642 29767 60592 18964 -25672
14600 -25672 -60716 -50759 42065 108371 100595 39578 20171 58762 98670 52074 61225 161355
14588 161355 133077 46230 -38938 -52809 -56742 -17897 72913 94525 148864 123690 41843 -106811
14576 -106811 -167053 -82827 48037 144757 117635 106777 57443 49485 -29483 35400 78095
14565 78095 98856 138602 111647 101595 62786 19185 -127033 -174867 -145968 -83891 -48640
14554 -48640 -5178 65760 66703 -19892 -2588 22626 -25184 -34415 -30917 9592 -42363 9738
14542 9738 3712 11252 -19850 6386 -17974 -25529 42321 42763 -124801 -269337 -283269 -153209
14530 -153209 -41098 33500 46757 17367 6476 -60807 -63371 14590 37829 71440 5961
14519 5961 -48741 -20293 -19851 -74239 -74387 -44357 -34436 -2479 58293 -19186 -43629 -84473 -124407
14506 -124407 -127563 -16957 92329 86288 116625 76422 -5747 101585 224449 235806 149032
14495 149032 35084 -8260 -58761 -21026 11572 57873 84388 72304 60719 75702 14251
14484 14251 -138878 -172678 -143627 -87049 -3284 13119 16524 52716 131943 86457 7681 2532
14472 2532 114624 226860 254516 155830 131779 171549 127966 89512 58843 65794 35364 41184
14460 41184 73242 75871 56398 -33517 -68447 -56386 -41987 6158 67018 78932 92857 77163
14448 77163 69564 22838 -4855 37262 -29164 -92132 -112933 -60626 -42888 -26771 -72105 -10446
14436 -10446 9445 -40686 -7639 20728 4131 37423 -36601 -133984 -39736 70591 93488
14425 93488 32824 48704 45283 19338 -48472 -108211 -122549 -39963 62843 92681 89400 155935
14413 155935 174866 178568 80181 -45233 -87183 -141226 -123054 -70644 -94384 -132877 -80298
14402 -80298 -39052 52816 123660 140179 71481 85489 31020 17884 48993 49700 82091 106099
14390 106099 90172 88088 66255 125584 144698 83443 21900 39680 71730 78387 80055 143779
14378 143779 134307 171308 203331 144594 82747 77615 134439 62794 -25350 -53072 -114777 -162808
14366 -162808 -97216 -18014 -1457 -25736 -67618 -89990 -119119 -157132 -132666 -1861 36199
14355 36199 80021 142483 171998 181576 136508 111031 71494 76734 83883 152477 70459 -57578
14343 -57578 -31651 33458 2157 6434 36233 91940 54990 -76703 -118674 -69769 -12107 96178
14331 96178 102397 129431 119824 41915 -84373 -141583 -76285 -29781 -7537 17836 13975 -118231
14319 -118231 -254874 -133077 -22499 -114543 -138471 -158599 -203842 -140189 -101650 -77624 -92624
14308 -92624 -18199 93991 56015 -4490 29231 -20643 -44257 -12049 -29183 12699 44916
14297 44916 55425 -73803 -66170 -8618 15923 -5463 -42138 -13276 96323 145877 56528
14286 56528 -23757 -24696 20402 17864 75878 25512 -184 107198 152873 156891 103816 80008
14274 80008 86105 111189 133054 128214 107032 111377 134808 104408 84573 68844 28948 18531
14262 18531 44229 4461 29247 92773 118836 114175 32982 -13271 92458 151548 100295 76571
14250 76571 70260 80306 94859 132924 173066 118875 109577 165609 132584 75984 -8971 16785
14238 16785 120302 23899 -56598 -87123 7406 32205 -19971 27016 41294 32500 -46492 -14368
14226 -14368 9654 -15015 -11079 -13563 -16515 39181 17880 43410 47570 -15688 -3588 14528
14214 14528 34046 -20571 -64910 -110923 -74334 -11621 70381 65680 26714 -31055 10231 64283
14202 64283 90727 126025 118435 61249 44779 49392 46870 -22825 -36055 -89471 -81268 -30745
14190 -30745 36613 55505 65235 -25199 -7572 -52954 -38107 28640 87786 75909 54948 20711
14178 20711 -45125 20883 128072 133941 64227 82154 102797 114853 131224 92843 83354 106068
14166 106068 155199 154558 84632 43318 9425 9544 9397 41352 64783 129354 118925 100683 118881
14153 118881 99329 85092 74362 67536 31963 -11708 1365 -22244 -45090 -3553 13326 91363
14141 91363 145153 121607 125510 -2020 -48284 -80389 -123846 -105244 -36927 -49735 -89200 -134767
14129 -134767 -37138 47678 140552 63175 -1132 -63554 -19490 -102198 -155930 -75300 25739
14118 25739 -7752 -11935 29089 36365 66186 73239 34363 106140 83495 42013 82859 15443
14106 15443 -3556 67717 105081 157219 80593 48471 25891 -6502 13165 -5938 -56604 -104412
14094 -104412 -4021 57073 85516 54099 76785 80022 73376 72698 97403 83012 15814 -44592
14082 -44592 -89909 -31320 44278 41326 67314 126805 59912 -36995 -21172 -57669 -68697 -34137
14070 -34137 16774 -31426 26698 -7613 -112420 -138983 -56127 60842 67589 53802 -12834
14059 -12834 -70197 -32959 27369 -41732 -66025 4032 4526 92267 93024 19351 -69311 -85088
14047 -85088 26742 43335 3217 -22797 -65053 -4514 123916 55223 -4444 12130 94685
14036 94685 221843 250309 189931 176061 131657 105055 106543 28531 -56683 51672 150353
14025 150353 170878 166108 125158 59761 101911 71858 32157 -13207 8462 90933 106684 98612
14013 98612 94454 -16451 -105908 -33232 73617 68056 146981 119979 80145 76379 95965 84738
14001 84738 16482 -21247 31141 -8665 -27893 -26662 -37391 78006 171832 107278 -33787
13990 -33787 58348 141277 66563 -32636 -7893 -12353 20609 59424 74459 103553 8892 13918
13978 13918 100185 38089 29047 80208 111350 113677 123290 140561 147838 125964 47382 76077
13966 76077 67138 106936 116945 52921 90026 109164 185445 125325 127121 39478 18118 -2409
13954 -2409 -20551 -19274 -63133 -61369 5484 -8275 26836 56425 53323 88278 68635 23506
13942 23506 106410 111898 89951 37432 62399 49352 45487 35946 74177 10423 7022 23245
13930 23245 -6645 -153577 -154029 -72690 -48881 -40200 -6142 -43928 -60846 -60297 -36146 -54287
13918 -54287 -12331 -53591 -50875 -13033 -17673 -44003 -71454 -108775 -73630 -45680 -11786 -78429
13906 -78429 -91516 -13963 38219 -12591 -87373 -76668 -30919 -7 22199 34475 39002 22737
13894 22737 55674 51740 30671 14627 71628 123012 143295 188129 197577 212464 212125 125165
13882 125165 131430 176102 168127 134758 143483 130799 171956 196808 83135 24735 -1263 -16247
13870 -16247 1059 95905 129080 111990 31613 -31547 31689 139240 225301 285398 263080
13859 263080 146829 97845 130872 143330 80460 13773 -3726 12480 11122 36962 64265
13848 64265 7678 59772 71228 82801 58952 78123 87889 80489 -49830 -69319 -20282 11265
13836 11265 69821 28745 -14680 65660 2310 -36391 -8093 55963 43072 -13402 -62751 -50994
13824 -50994 -98676 -98072 -57489 9186 38097 48918 -49643 -139992 -108215 -110487 -78449 -105560
13812 -105560 -61111 17377 52666 120093 122650 135701 106305 113409 38525 14963 -2259 -46924
13800 -46924 -79949 -109545 -114995 -129450 4077 98260 77166 78293 66911 30274 -18069 -15224
13788 -15224 -57259 -108353 -54091 -97183 -111754 -40240 8871 -5678 35489 25394 -57908 -93047
13776 -93047 -52581 41043 147285 106182 27397 -29157 -54935 -48582 -107399 -87064 -42212 -62489
13764 -62489 -60629 -30801 -11178 -52278 -57765 -52153 8177 22087 -37550 -21326 -22775 18283
13752 18283 -25203 34497 10957 -14490 -7816 -12581 9551 8042 -11346 35883 67601 149260
13740 149260 236784 234935 103852 66011 38673 35081 70817 73421 66737 25159 79072 28304
13728 28304 -16686 -29934 47493 44413 19071 -63560 -45995 6812 -40671 -28244 -27088 -28032
13716 -28032 -35707 -29506 -1783 -29532 -46858 -45417 34565 44663 10312 -21578 -35884 -23895
13704 -23895 68954 80854 -60244 -99351 -111656 -88530 -104929 -64953 -1771 -33893 -25139 11844
13692 11844 47969 7395 -26733 -166 -22490 7154 61232 106598 137538 201459 158263 53139
13680 53139 10542 -12808 65634 53672 51467 95012 77753 18283 33037 43181 34673 52699
13668 52699 -34219 -5277 -316 -3268 -40519 1914 10750 33273 73773 136880 104735 90731
13656 90731 -26817 -115980 -119046 -81880 24654 14144 73769 55586 25764 -34319 -39527 -72717
13644 -72717 -118524 -122093 -79331 -92099 -101905 -99109 -94118 -129700 -177575 -61623 128827 168804
13632 168804 99424 -38283 -179038 -197276 -79187 -12737 -52898 -108331 -64680 -52255 50555
13621 50555 84117 97527 101325 125321 52475 -22851 -39345 -47026 32922 84438 38258 36813
13609 36813 74386 59738 -11150 -59162 -22424 -94011 -43628 -2623 -38317 -33034 44955 58475
13597 58475 23119 -32906 -37086 25291 70763 84784 43001 -25223 -58963 -120206 -63397 4582
13585 4582 -52488 17516 37658 36343 17072 8496 49803 113376 7975 -50014 -14668 96460
13573 96460 182657 118857 139331 192362 208889 223110 280810 384565 390058 303938 185745
13562 185745 164642 91740 44345 106673 114154 54335 78032 143482 149814 174192 226743 168119
13550 168119 178012 128487 71402 46470 27698 -6659 -55496 -62932 -34878 29147 91069 81289
13538 81289 79645 128553 103410 13223 -135835 -95753 22424 -11127 32933 81148 105803
13527 105803 244405 316630 330988 399751 505012 676542 950561 1029019 777950 488350
13517 488350 316595 261658 232629 214504 197018 108444 -3537 10122 107119 64907 173573
13506 173573 172772 192025 157427 129113 45880 22836 93804 70923 174402 234101 113633
13495 113633 -57845 -57249 -27465 -17924 -114141 -38746 48874 69221 112209 96543 46526 -26067
13483 -26067 12776 94582 145643 217715 299097 401764 628577 894276 898675 664547 373990
13472 373990 195699 86334 31821 59015 176453 229911 146806 -8523 -116985 -67523
13462 -67523 -84425 -43600 70982 79818 58766 835 25530 122609 119642 84704 90002 75324
13450 75324 7924 -27112 -19226 -38938 -14975 -85184 -130781 -123764 -60926 -18231 -25233 -21278
13438 -21278 -38482 -22915 -60252 -23302 45521 97707 200574 244459 221968 211255 143524
13427 143524 151676 167427 116185 47283 17223 15453 40515 -10075 13736 74857 76733 107432
13415 107432 113068 103370 90338 94777 99230 94755 63420 95962 126342 57012 135366 138196 94580
13402 94580 91771 25587 -31020 14433 -43644 -88911 -106386 -63119 -46203 -39337 22739 49170
13390 49170 -521 -8318 -32526 -38713 -49321 6724 58736 4342 4353 10973 -28473 7524 -51971
13377 -51971 -211416 -104534 14742 44879 18034 18297 -16289 3273 3315 -20062 -92839 -177815
13365 -177815 -135775 -23020 27300 -29569 -69609 25994 125120 156463 103840 129945 147469
13354 147469 115524 154545 249134 173183 142951 84694 77410 141198 70582 10857 -10559 -11088
13342 -11088 58521 129697 119366 32336 -6932 15907 62374 69586 79456 142366 122379 50952
13330 50952 -7388 -7163 11934 -26993 -10644 34495 30070 -82644 -47706 -40919 -74175 -31906
13318 -31906 31525 97375 23725 -16195 -51051 94143 66706 29044 14843 -32694 162
13307 162 -18661 -75347 78750 158368 78006 10602 32655 47149 18067 -16604 -26216 -44651
13295 -44651 -103594 -128786 -130287 -68090 23686 97078 102831 104766 131897 121878 148058 139370
13283 139370 37304 -30776 37832 42141 52846 144727 104890 123205 73117 72226 52453 93437
13271 93437 85373 131789 199215 144259 114307 131456 41378 -22770 -16679 28148 59700 54072
13259 54072 90743 120116 97168 72163 7229 2126 86859 59159 31448 63753 78449 47151
13247 47151 83444 170465 112093 11654 -30309 -51939 -32959 -4589 22044 50666 63351
13236 63351 127172 88488 125895 273527 269380 128551 -10388 -88207 -124451 -64127 -51911
13225 -51911 1830 29565 -32381 -9706 -9478 11318 44248 -34057 -80677 -76641 -105027 -49167
13213 -49167 15996 38931 76672 20017 16629 46934 64155 48749 59682 165302 192049 127692
13201 127692 37496 -31818 24184 127871 222407 225893 245582 195732 176229 88245 37436
13190 37436 -7571 -26104 5136 30196 50420 40919 43989 26999 42108 15569 52586 120173
13178 120173 117883 142324 137303 134141 151479 226488 237282 219401 160498 157000 169219 198448
13166 198448 214740 232846 252764 179480 156920 189460 132112 135363 170526 217718 303782 389471
13154 389471 291586 234433 223558 231036 202387 126264 191735 255477 243227 208612 177320 245165
13142 245165 337941 281033 261477 167293 130400 169158 177834 206027 158171 261385 357137
13131 357137 391542 338136 374137 418980 500430 555391 494830 558901 635900 773575 849903
13120 849903 953622 1131619 1321442 1511362 1782504 2117223 2603132 3170660 3922555 4948432
13110 4948432 6305380 8476471 12210012 18629879 29239015 44021912 55490879 52066374
13102 52066374 37870287 24950958 16880452 12058102 9013111 6991890 5825846 5206496
13094 5206496 4624346 3995021 3477416 3114344 2847506 2642422 2396039 2277828 2258072 2255842
13084 2255842 2230544 2176923 2137997 2180631 2266917 2426025 2713715 2906994 3096554 3271703
13074 3271703 3589872 3992540 4580702 5323159 6333692 7569251 9326249 11674529 14544201
13065 14544201 18246297 23958031 33870542 51390254 81528694 127468548 174534642
13058 174534642 175675688 126835721 79489543 51283540 35349201 25907811 20201079
13051 20201079 16743683 14531854 12803696 10925655 9120597 7776797 6784547 6085571
13043 6085571 5529931 4931772 4387535 3958720 3834163 3784925 3737547 3656832 3548982 3512145
13033 3512145 3634842 3816114 3922640 4102802 4361049 4721391 5248996 5913476 6858858
13024 6858858 8196948 10007700 12286460 15086439 18672241 24178710 33478710 49662620
13016 49662620 77716519 121894933 172022318 183582071 138356471 86944471 55164218
13009 55164218 37484659 27160922 20750363 16949739 14627380 12877573 10971785 9069771
13001 9069771 7505676 6379650 5431383 4643214 4104922 3681140 3335445 3099171 2878266
12992 2878266 2656018 2486161 2393818 2308198 2337213 2434171 2518241 2480434 2473556 2596014 2782718
12981 2782718 3066925 3313652 3748906 4370721 5064945 5905855 7084953 8904390 11872965
12972 11872965 16975273 25773855 39358278 54465006 59056363 47522484 31768647
12965 31768647 20640752 14115627 10256509 7832318 6274151 5328702 4688069 4012895
12957 4012895 3336009 2750818 2293738 1910812 1637581 1510702 1369201 1213055 1140207 1034959
12947 1034959 927079 809520 731431 698554 714686 662647 624949 708636 734949 701118 678326
12936 678326 559701 450766 550562 583356 605281 646797 591425 506140 476450 367210 324109
12925 324109 348588 341895 379744 425195 432801 377428 308550 258949 328399 281015 244810 176557
12913 176557 180316 240076 193671 149681 203366 197035 207946 174674 127632 181963 299878 300880
12901 300880 231092 162512 171802 137110 111596 91755 168147 169065 187506 170645 193584 262052
12889 262052 279309 289682 246343 265823 301964 180021 135943 136200 174291 155904 139635 147448
12877 147448 261461 355718 360188 344113 348094 300640 200475 76487 -35694 33825 73885
12866 73885 21470 27296 63260 89631 151764 144755 142546 185689 208388 124912 92530 168217
12854 168217 256516 299097 335428 316865 278964 160094 105948 83311 75201 133471 254808
12843 254808 313407 359846 336607 236583 196692 221383 194844 122291 98187 63144 26476
12832 26476 76151 118159 83424 97460 59420 56230 38993 116898 162502 80461 39507 93261
12820 93261 69254 34898 19327 -7183 -11096 139464 174960 180662 135415 162409 212922 171319
12808 171319 109991 72099 127293 113593 65605 50374 23716 -31443 -50591 25321 132964
12797 132964 165075 133193 100265 54053 -32760 -62527 -81835 -23282 69559 56427 35744
12786 35744 51187 43027 127337 78514 -33142 -120464 -53594 5019 78840 50038 78047 146041
12774 146041 138369 39401 -3358 75268 107239 195531 169373 102392 127213 155532 186975 107913
12762 107913 88649 67680 32422 -19650 -35262 -67793 -61551 -36796 -56738 -110030 -91238 19231
12750 19231 49326 44472 170966 181796 151814 51757 -519 -1917 16977 42280 75087 56062
12738 56062 68021 47615 7804 -42583 -13311 50249 67647 80244 -1944 575 -7960 1826
12726 1826 -625 -60674 -14030 -11385 -82013 -131550 -98617 -57099 -19613 17166 1311 -1100
12714 -1100 -70738 -77216 -82597 -123559 -99591 -99528 -53636 26689 62811 123566 126282 84071 148121
12701 148121 43314 -40872 -34063 -18966 9348 96937 124471 83714 92568 107549 24610 -41121
12689 -41121 53717 100410 33948 47196 85075 62237 112513 27432 13688 -53819 -72921 -11736
12677 -11736 29862 28267 9231 -37975 -46405 -131868 -166001 -141764 -43322 -63725 -61238 -134427
12665 -134427 -178838 -111459 -19990 -1014 -50462 3005 71849 41238 13143 49106 14503
12654 14503 -35709 -52103 -16864 98705 68265 85586 136758 126020 148716 164565 92004
12643 92004 69372 70190 79869 56334 89721 93779 111881 156629 239581 308841 439372 334306
12631 334306 196989 115659 63031 24367 87018 100903 23084 -30211 -37147 -41706 18992 -34646
12619 -34646 -77713 -85231 -104272 -161394 -171190 -147014 -92818 -57079 35189 87116 92217 55559
12607 55559 91469 129354 204248 156268 116127 51500 -57477 -98025 -38209 -69822 -113140
12596 -113140 -107546 36272 164220 180551 109130 325238 652719 855097 939691 825457
12586 825457 598562 341986 172157 67733 -33076 24719 23153 -30849 32074 31299 58107
12575 58107 114580 28546 -23883 -95604 -92135 -50915 32954 134519 128358 58408 -35440 -55733
12563 -55733 -65544 -83264 -21179 -34406 -97728 -159316 -133598 -68278 -104965 -169429 -16263 124388
12551 124388 156155 119575 106671 170129 248759 343429 542065 719095 873652 734522 475408
12540 475408 306344 185184 55756 -1528 57385 125344 161502 71742 77908 163014 106973
12529 106973 135524 162350 88614 18144 -6619 68952 165531 211965 134088 -4169 -47135
12518 -47135 -91467 -34974 58160 79296 -16014 -61875 -26775 -52486 -23759 7774 47483 15563
12506 15563 -44152 -27899 14117 143256 131452 162184 255197 284522 296569 253581 187374
12495 187374 162064 160358 102590 48558 32450 -23180 -57339 24649 53328 35047 60759 55241
12483 55241 101877 162791 129737 159436 225275 110789 20750 -54622 -116967 -100559 -43333
12472 -43333 -78783 -147506 -82946 -13273 15044 51466 -17321 -55444 -7920 -12888 -31436 -41739
12460 -41739 -11658 80004 196567 222897 119568 44655 7061 29382 79288 108968 131782
12449 131782 78905 -19869 -70164 -107234 -94881 11108 -23315 -40579 -90691 -72404 -24763
12438 -24763 -35889 -42426 7357 -2644 -41773 -68852 785 77267 61221 41246 91653 36340
12426 36340 78028 31258 370 29929 32874 41060 49409 -25958 -84714 -12659 19611 43526
12414 43526 82809 141575 60073 -18394 419 32034 6412 -15215 5598 10825 72550 70756
12402 70756 -90044 -206252 -145320 -46874 30204 55978 114150 114008 89341 19314 -23701 28166
12390 28166 -34662 -18538 6401 -45681 -6413 30534 48508 11312 23973 96450 69943 44727
12378 44727 85226 75126 -10372 -27246 70643 98349 89909 23383 -28117 14860 98058 51989
12366 51989 -4945 -18107 92676 93818 16108 553 9276 1099 -81975 -101408 -23713 -43010
12354 -43010 26946 -19802 6370 18013 -8065 -79684 -29991 -72247 -128288 -128966 -157233 -190819
12342 -190819 -85052 -56029 -53976 20366 64419 41644 51455 27878 -46239 -75551 -79356 -151284
12330 -151284 -152044 -118140 -113346 -66468 -88091 -38002 591 -5132 -4835 70549 105325 48591 57876
12317 57876 180604 158431 136468 124141 71913 7778 -32782 -41717 31930 37995 -44891 -90512
12305 -90512 -81994 -25433 10643 4270 99927 70946 10239 26951 80355 116586 90848 66964
12293 66964 26565 -68195 -15742 52422 30490 -22546 -68720 -96082 -124964 -130532 -149315 -11604
12281 -11604 97433 61763 49634 61048 76417 -15904 -57072 -73571 -80361 -145011 -180031 -126960
12269 -126960 -147834 -193292 -125926 -34188 -82985 -12109 57578 -6366 -15794 -39003 22085 -8937
12257 -8937 -34484 2391 11428 -49857 -85437 -41077 13590 73184 168799 197220 166910 98222
12245 98222 15223 -11555 2231 23380 80900 78178 44394 13777 87638 56670 63426 117475
12233 117475 130038 49513 42543 41674 -1041 63846 25976 -5983 -26077 -24388 -38365 -105475
12221 -105475 -80637 -84743 -102601 8132 40270 -13454 -91558 -118466 -68187 -2627 63445
12210 63445 132622 117195 24670 -98010 -139168 -114734 -58153 -56934 -42907 -58565 -43042 -602
12198 -602 9828 63706 16969 95186 113602 109844 126332 227679 199052 127950 45918 38154
12186 38154 63280 -27776 -120965 -162182 -166123 -144647 -169098 -106663 -34433 4593 -4507 -29868
12174 -29868 17181 88098 17227 -25579 -6454 2437 -13707 -1999 48712 47420 -21659 -13256
12162 -13256 12584 49139 80148 74355 62729 2383 1910 14561 -46122 -69615 -81899 -86649
12150 -86649 -67919 -21239 -15033 -59319 -63532 -122392 -134560 -55627 -25449 1765 32212 -8354
12138 -8354 -76752 -46118 12866 -4306 -54876 -19323 -6966 -103451 -124379 -38949 -45778 -79656
12126 -79656 -116732 -133044 -98634 -55108 27791 84483 -37200 -132930 -117041 -103145 -76872
12115 -76872 38959 67790 30791 86046 132906 124515 54519 -36255 -80654 -98038 -131884 -218587
12103 -218587 -99391 -23202 1086 12741 27897 77192 90330 63753 32258 104353 142506
12092 142506 98370 67098 51956 32006 8457 47675 58316 81353 84419 68641 16973 24589
12080 24589 3267 -33806 -61354 28723 40981 28144 100349 83006 7940 16116 50413 -27491
12068 -27491 -64183 -81744 -106500 -116624 -154534 -67936 -27467 39383 75347 -12689 -94350 -59879
12056 -59879 -108753 -42686 -58828 -119816 -171090 -83709 -69077 -47175 57870 121032 67015
12045 67015 74442 111629 99682 17855 -15347 -71673 -32152 -82289 -133569 -111089 -110621 -115361
12033 -115361 -161342 -233186 -284078 -203621 -95307 -55741 -186 918 -14354 35043 41806 47388
12021 47388 -23815 -91546 82735 136446 41219 -92389 -133781 -11703 -33761 -104235 -81467
12010 -81467 -30159 30192 55724 44155 33361 60246 87749 72600 77037 62465 117850 56374
11998 56374 -16482 -52031 -62525 47250 111548 74127 9274 -50126 -18978 -88174 -91433 -2647
11986 -2647 -60817 -84339 -27876 -10992 -16554 -316 -21293 46349 123933 151192 -25210 -36333
11974 -36333 72126 152344 92923 -2291 36058 30974 59421 12043 -42738 -100760 -101125 -70091
11962 -70091 -98988 -94235 -10861 18278 -46361 -17732 -25787 -68446 -34742 -142921 -176020 -75277
11950 -75277 -2515 22704 59628 133221 71735 -29947 -28269 34383 8551 12273 -12463 -73318
11938 -73318 -77244 39901 124694 73359 90356 29532 11529 102930 109105 110611 103785 111650
11926 111650 74886 29466 -52443 -83325 -107694 -95776 -49868 -68332 -21903 25595 12324
11915 12324 51863 114721 113640 65823 130058 137362 145197 88627 -8664 65227 91805 -40555
11903 -40555 3109 -2880 -71329 -181215 -130867 -135737 -100904 -40488 12987 7520 -41855 11937
11891 11937 25202 35838 61185 10758 5149 29007 -13838 -93857 -129119 -147651 -101864 2439
11879 2439 71802 110819 183046 212732 47259 -49 -2292 -1881 -28407 54453 30691 3930
11867 3930 -65453 -67395 -68308 9913 109591 145256 1454 -55191 -102487 -114039 -23485 41371
11855 41371 27154 -7406 -121406 -139029 -144784 -118874 -49148 -95452 -103163 -2656 -55631 -66347
11843 -66347 -118530 -217622 -156293 -96280 -95377 -18255 -11725 -65548 -107698 -163274 -145401 -138164
11831 -138164 -95031 -5850 -36309 -50037 -30018 8413 9369 9921 -35684 -13857 -52196 -34653
11819 -34653 -51075 -77337 -55328 -54286 -90832 -77956 -18902 -84553 -121955 -69093 45938 58657
11807 58657 86155 114662 38699 46345 46970 -18583 -103497 -88467 -70316 -138182 -103676 -73159
11795 -73159 -132033 -135873 22015 116984 106205 27860 2368 46802 19124 -70469 -117616 -168658
11783 -168658 -106340 -14120 -4909 25805 -15908 -44647 -88878 -193476 -135557 40294 159518
11772 159518 158926 76852 80449 101993 83206 32630 7556 -9978 -17387 -57626 -113171 -150685
11760 -150685 -69077 15737 109746 137654 79521 26008 -49988 -60292 -119063 -106402 -67078
11749 -67078 -36840 -3765 -7326 -79582 -103294 -149588 -153482 -77237 -32840 9724 92557 71739
11737 71739 30312 60999 16143 20555 23281 36362 71581 60414 44517 -44212 -77872 -92633
11725 -92633 -27647 48491 37243 -48814 -71992 -74798 -37693 -45387 -25447 -49305 55723 150433
11713 150433 137199 89313 76248 71458 60153 21849 11797 -1380 -10119 -34288 -60232 -77710
11701 -77710 -20521 30136 81585 49865 23739 13453 -19735 -108416 -72866 -84192 -93878 -183389
11689 -183389 -175291 -96578 -75055 -18782 59402 58977 81841 33923 -38302 -68101 -25539 40448
11677 40448 59711 22877 50630 132134 118983 109107 94648 38181 -76387 -99984 -38222 1868
11665 1868 61832 30937 -39920 -53127 -2766 8224 -697 -17570 -27067 31559 35085 -53478
11653 -53478 -184324 -152220 -58205 -60798 -86501 -53969 -7574 78564 70655 -12124 -78360 -56076
11641 -56076 -54765 -20914 109029 188358 117379 28401 -32570 -23154 6236 -5468 56482 84242
11629 84242 97627 -44464 -28794 21214 -66671 -149224 -171092 -62646 88909 284 -50035
11618 -50035 -46184 -23527 -37779 62852 55415 -41930 -48531 -59270 -50867 24011 41262 90702
11606 90702 91006 93556 34857 -11948 -2840 -82298 -114204 -64606 -22722 17198 39502 -21150
11594 -21150 -65558 -103039 -113445 -58957 -36484 -30982 4150 57538 15660 6485 31405 -759
11582 -759 -19457 -53554 -66098 -58241 -115279 -123351 -122014 -42490 37650 -92518 -128532 -103268
11570 -103268 -155644 -179346 -122879 -16869 68140 -14679 -31037 -42138 -54174 2868 -13494
11559 -13494 -38764 7332 6158 5204 -18535 -92647 -94059 -37692 -16815 17387 11325 64467 57471
11546 57471 55211 38288 64954 37007 35951 -35599 -45950 -62501 -58579 -25782 -24146 32323
11534 32323 -40613 -51283 -31952 -55035 -51694 -13379 -53616 -61595 -55596 -63035 -32649 -99429
11522 -99429 -101419 21850 31665 17838 60502 -31559 -111213 -18661 49960 35065 -34247 -93280
11510 -93280 -63984 3807 -37596 -79279 -4123 5947 -32016 -28400 -45115 -74012 -124681 -131461
11498 -131461 -168428 -156856 -157992 -33884 50647 103193 53658 -8268 -92325 -62118 -22788
11487 -22788 -22629 -26010 -19837 -48837 -108960 -96329 -18645 14397 15936 -47949 -31086 -77310 40882
11474 40882 85514 87324 132069 75478 69505 111095 100036 142589 151174 47571 -35608 -118974
11462 -118974 -101374 -44388 9913 -90485 -112505 -64057 -66283 -102393 -74867 20580 68537
11451 68537 69478 42946 138069 177921 99344 3289 -38067 -37343 -79273 -115550 -154735 -183746
11439 -183746 -229156 -113466 -94975 -56643 3530 52500 61427 46506 33992 107260 137825
11428 137825 37163 -33649 9471 86569 31935 -23563 33447 36703 28971 48824 43553 27234
11416 27234 61112 106976 139431 79046 41257 47486 86668 62004 42895 -9280 -47374 -62855
11404 -62855 -77376 -62795 -112100 -97807 -45441 -42756 -60091 -34615 -86268 -97891 -113279 -96241
11392 -96241 -119216 -21741 9746 59370 40275 -73025 -79836 -54617 -69666 6138 71949 67089
11380 67089 6050 43144 27997 28710 56808 -94266 -139039 6983 25144 -27425 -108336 -6702
11368 -6702 -36113 -81599 -117976 -16093 62500 26453 -81228 -112890 -150237 -139692 -169522
11357 -169522 -166014 -92691 -166551 -216192 -115796 -65223 -22555 -48257 -185193 -185977 -98876 -44832
11345 -44832 -29927 -47311 -88295 -171846 -163953 -91856 55376 93070 65194 -26519 -25619 14929
11333 14929 58854 39382 55525 50015 48544 54592 55499 75245 19261 -105129 -163743 -208904
11321 -208904 -185056 -195215 -189307 -107361 -95023 -117910 -124703 -121527 -180051 -129359 -78605 -129500
11309 -129500 -111963 -100021 -73049 -32711 -163625 -269590 -242120 -160375 12070 52514 -37229
11298 -37229 -38562 31170 173856 123062 33768 107310 198922 166548 74413 29902 -39896 -35577
11286 -35577 -20564 -57918 -77342 -79280 -66886 -125077 -97305 -12015 27109 -14991 -54563 -16975
11274 -16975 28072 100039 50768 73338 2305 -90669 -77399 -44537 -50763 -90508 -125966 -56470
11262 -56470 -1351 -4072 13052 -9769 -62873 -80394 -3152 -20501 -105032 -102891 -54640 -25438
11250 -25438 -55991 -1790 42870 87998 -22079 -42012 -80324 -126232 -130859 -78418 -42552 -41606
11238 -41606 -37927 -110545 -120082 -143408 -85366 -46365 -116067 -144250 -147293 -112438 -120542 -48397
11226 -48397 -22188 14211 -56995 -44941 -51327 -129049 -141405 -85675 -103084 -111613 -88195 -62732
11214 -62732 -46592 9637 -91612 -198073 -107242 -3638 -64153 -129127 -90735 -13827 25276
11203 25276 8290 6724 46259 22887 -84200 -97516 -145760 -166031 -95521 -70341 -79174 -107195
11191 -107195 -94880 -19674 42791 -13802 -36604 -51225 -127292 -184507 -198698 -168696 -217175
11180 -217175 -121326 -51109 -51775 -81813 -83445 -86071 -61429 -55130 -110525 -58761 -32474 -76762
11168 -76762 -62635 -47130 18697 19507 -2257 43705 14656 49991 26096 9009 -35630 -132150
11156 -132150 -63198 59937 8656 -29703 -1026 15491 45546 77689 11446 -12051 -23595
11145 -23595 69151 29607 -42106 -1324 34264 38249 -24901 -17731 -11022 -74515 -70442 -50066
11133 -50066 -44340 -36156 -52467 -37379 -95765 -85726 -140423 -45462 -1591 -103300 -145310 -188024
11121 -188024 -145513 -167711 -103182 -32726 -46668 -121382 -118315 -111455 -156650 -175645 -194892 -212146
11109 -212146 -188112 -132438 -106970 -87307 -54858 8477 -27777 5312 -59150 -66237 -11111 -24117
11097 -24117 21564 -17004 -81117 -93123 -179282 -200352 -89236 -61389 -61524 -13541 39336 -10601
11085 -10601 -27074 8998 47652 65285 39397 13015 -46912 -92691 -32819 -6862 -37703 -121531
11073 -121531 -107499 -99171 -51163 26552 -37081 -65683 -46680 -110709 -178657 -138465 -88811 -29436
11061 -29436 24036 14341 18998 57804 83519 38566 50407 36304 -19223 -81857 -81591 -69800
11049 -69800 -73121 40704 72587 61584 47975 57513 -41442 -129534 -97088 -84790 -58358 -139680
11037 -139680 -186663 -199059 -113084 -43186 -66147 -75498 -24622 76515 125624 121304 112290 36574
11025 36574 24878 22361 83595 83908 100695 20823 -67938 -96096 -138466 -196875 -175527 -172078
11013 -172078 -112212 7925 29829 -13530 -8797 49552 89853 123930 49174 -5480 -59773
11002 -59773 -37132 -26246 1282 3925 104189 146324 110563 61455 78845 168093 69891 -79818
10990 -79818 -79362 -141470 -126509 -178721 -180732 -178858 -188804 -120805 -17582 -53992 -170234 -182077
10978 -182077 -145234 -43547 12605 54116 47937 12629 -28693 -47905 -141645 -173766 -139686
10967 -139686 -20832 39887 8855 -55775 -107191 -126862 -113018 -24904 -15890 -88176 9765
10956 9765 152345 173724 58528 -40477 -76060 -110350 -120500 -72654 -104615 -31541 50364
10945 50364 73006 53714 47775 -29134 -58320 27253 102193 101715 41017 -32631 -33693 -11156
10933 -11156 -23587 -61325 -83875 -38374 -34203 -169190 -278842 -345283 -161635 8154 -18797
10922 -18797 -13253 -2393 -1718 10830 -3509 -86737 -152442 -111839 -31982 -25288 -27473 -93723 -105450
10909 -105450 -214894 -267161 -139909 -43335 -47832 -19738 -57276 -84837 -33449 -20671 25407
10898 25407 8681 -55645 -39755 18001 -20487 -4415 -33348 -163223 -163791 -183076 -136891 -92375
10886 -92375 -52613 -59693 -152087 -146103 -58176 -76718 -109016 -172180 -188678 -176884 -174060 -107399
10874 -107399 -32578 22893 -71605 -53274 -52828 -78718 -72505 -63081 -53912 -21219 -17898 16221 45603
10861 45603 49956 -6419 -92507 -57544 -11843 -52467 -101798 -22553 10483 17427 10236 16260
10849 16260 -36871 -52485 -19042 83360 122373 149063 78101 64093 31100 -10897 -26433
10838 -26433 -44259 28989 49011 35713 2131 14620 -11621 -20045 -1883 -26514 -24938 13911
10826 13911 33059 69413 112801 8663 -38399 17068 27835 -69484 -56757 6841 -67632
10815 -67632 -64416 -9019 47328 79211 78776 40561 39164 -45058 -113650 -183058 -178368 -54942
10803 -54942 45264 -36116 -100789 -71153 29610 69254 -27556 -103111 -51088 -97858 -100087
10792 -100087 -123245 -34795 -84588 -113127 -195294 -234063 -198155 -121306 -59302 -28849 51018
10781 51018 58241 75290 63371 50535 55490 27824 7061 6457 -47084 -49037 32278 78378 104105
10768 104105 50110 -8748 -921 -29307 -1041 60232 50162 45937 -17105 -52604 -29914 25209
10756 25209 8977 43981 1117 -11669 106090 132130 97777 14741 13962 -7052 24127 56373
10744 56373 58637 17430 -26243 2950 -8887 -25787 -38807 -46573 -4171 18768 35841 58539
10732 58539 -465 14814 -10367 -60760 -13902 13915 -51329 -136610 -132641 -105880 -25037 -58848
10720 -58848 -38693 -41848 -92131 -126876 -95720 -53584 -97907 -88437 -56356 -116783 -110053 -107685
10708 -107685 -90697 -63130 -34759 30377 8531 79327 84246 -34852 -97176 -98773 -148376 -90142
10696 -90142 -81049 -98503 -98473 -118077 -214493 -161505 -8000 13377 -27516 -105377 -79241 -70751
10684 -70751 22515 60880 -19604 6835 57853 6148 -52844 -40711 -6570 34323 71295 13122
10672 13122 -19104 -57586 -77824 -73573 -93154 -74421 -76701 -63440 -91416 -72462 -23703 -1888
10660 -1888 -61895 -39221 -121462 -203239 -84175 57452 20469 2156 35826 92600 89334 103602
10648 103602 64524 39141 20650 18075 21443 68527 22529 -16840 -66231 -76593 -74822 -20898
10636 -20898 -11661 -15119 -71269 -61295 101191 86438 82174 82022 70056 7140 29677 74879 44163
10623 44163 47456 80245 146980 111097 71261 83444 120802 99907 71099 19196 72901 86322
10611 86322 -9600 -68305 -103969 -102891 -73445 -121252 -71680 -19366 -57720 5916 -23763 -3412
10599 -3412 -20930 18312 55157 21225 -75714 -102088 -22069 44050 53408 69626 68320 93980
10587 93980 60788 -4930 -3037 48081 35179 -26393 -39108 -12628 36599 51722 37308 -5580
10575 -5580 43628 84256 74866 29572 21777 41087 67226 118092 124105 61901 68271 96640 126171
10562 126171 93154 21608 29835 34589 14243 18344 15594 24414 48572 28715 38863 -56842
10550 -56842 -47748 -48031 -28318 -58240 -95818 -58145 -42474 -28853 -14041 -44646 -42747 -19817
10538 -19817 -34403 -101377 -160786 -176228 -191533 -134798 -108538 -101294 -154587 -202939 -163856 -118557
10526 -118557 -47696 -35592 -40437 20040 -15354 -61465 32649 59055 56329 6397 -34602 1334
10514 1334 -12072 -125668 -183038 -178145 -116253 -49636 -50041 -54972 37138 -687 -12580 42998
10502 42998 13721 805 -2938 57858 53185 27822 80734 7351 -30477 -95459 -93389 -132628
10490 -132628 -117905 -112356 -123724 -153303 -136938 -36978 -12154 -48465 -31993 -16616 30314 63173
10478 63173 76352 46292 -9317 -40375 -118338 -125128 -72102 -60124 -29479 23667 69898 76883
10466 76883 20771 -18751 -5651 -6182 -97601 -126473 -83223 -72234 -89430 -78946 -47189 79108
10454 79108 25017 94957 117123 4513 -68987 -50916 -12071 8725 -118143 -66076 -52373
10443 -52373 -120351 -144028 -93989 -27253 6361 6530 -4941 -79047 -212396 -289734 -184149 -98669
10431 -98669 -45689 -3835 53882 106278 93158 33137 -9884 -49759 -42746 -43239 -3507 -6870
10419 -6870 -102784 -94961 -145453 -156304 -75290 60518 66115 70660 -2032 -92651 -106496 -135591
10407 -135591 -59425 -30292 35449 -3227 -99844 -90928 -118476 -134584 -129705 -140838 -89246 -37716
10395 -37716 44988 28705 12841 20532 9707 -9713 -43194 -70813 -75425 -15470 87557 43404
10383 43404 -17532 -40672 -85215 -8083 -1372 40036 74290 59136 137951 83285 73632 81568
10371 81568 -6843 -68030 -9953 -58147 -22198 25638 -14682 -39435 1651 -3893 -39135 -107753
10359 -107753 -114958 -101181 -42575 -16137 15030 69736 -36603 -69880 -37474 -40303 9056 64271
10347 64271 45290 23730 20858 -20944 -43025 -49448 -119517 -71207 -44434 -95540 -138202 -90512
10335 -90512 -54108 -20424 -6708 29335 -15661 -35307 70129 160600 95266 -120454 -79214
10324 -79214 -51120 -107529 -57383 -161 1196 -50080 2900 -36741 -90535 -132308 -115432 -101133
10312 -101133 -181325 -231774 -236717 -261083 -210700 -74179 12627 5897 32659 24516 -52918 -88099
10300 -88099 -53460 -23235 -42901 -68108 -79094 -159460 -184345 -71468 -8013 -20317 -38804
10289 -38804 -6536 -28880 -67803 -60904 -114233 -162260 -179740 -117975 4569 -12466 -81211 -30809
10277 -30809 48526 88190 162833 181327 84710 51992 87540 142441 108320 14131 -1800 -5977
10265 -5977 -61586 -56661 -103486 -94850 6571 77706 145537 168516 121988 -2814 -37918 -7840
10253 -7840 43528 36133 4 -89271 -208716 -130708 -79334 -137409 -176577 -187792 -128960 -167636
10241 -167636 -132349 -162212 -189219 -166752 -149600 -119959 -101981 -62139 15440 -20294 -91836
10230 -91836 -80678 -62050 -91341 -29252 -18667 -48519 -100325 -103818 -159796 -179631 -119317 -92978
10218 -92978 -49230 21402 83144 88300 60887 -42 -124315 -118698 -128817 -193161 -194888 -185420
10206 -185420 -143712 -86401 -44665 51069 99686 31924 -49949 -55740 -42506 -7117 -47969 -77944
10194 -77944 -3063 -15571 16247 12207 108998 96613 19759 79670 -38900 -128895 -156292 -97640
10182 -97640 11299 3207 21567 -38883 -108148 -93376 -43463 -16274 -64870 -131381 -158345 -95612
10170 -95612 -46415 -49183 -43375 -55954 -93529 -70431 -103722 -93402 -106352 -71578 16404 45376
10158 45376 78680 71222 109831 136692 88275 -16355 -21965 27456 46171 2746 30670 13659
10146 13659 -67056 6357 89035 161596 108864 63521 -31504 -40857 -79136 -79293 -78780 -60917 -125894
10133 -125894 -37996 5288 -39629 60547 142438 155238 146241 165082 130942 52075 22549
10122 22549 20067 -19137 -40081 -21061 -35716 -53218 -16082 -14802 -15326 -63191 -54709 -45886 -55208
10109 -55208 12046 30749 -6945 3891 38545 121998 119662 20256 -28754 -82261 -146519 -114848
10097 -114848 -53440 -110540 -121944 -34809 24325 54654 14061 28220 -3258 24167 47753
10086 47753 25544 -8976 53114 68030 -27811 -65377 -21883 -3100 -47983 -77084 -52607 -11103
10074 -11103 57998 26700 8606 -11302 -52405 -89199 -90414 -43511 1138 133981 147165 55603
10062 55603 17313 -27261 -45564 1998 133669 200332 274215 366593 501541 425557 179448
10051 179448 58539 20811 19999 46350 5925 34159 -23460 -35342 40882 109407 70486 13110
10039 13110 -49353 -140727 -131310 -34697 -103201 -178283 -125630 -26242 -15143 58263 2447 -25696
10027 -25696 47370 80668 103570 114255 78351 52161 -14742 -15157 -22890 -14949 -42503 -51338 -75790
10014 -75790 -79838 -20715 -39207 -32997 -62577 -97186 -119358 -69051 -70697 -165746 -276137 -212039
10002 -212039 -103566 -23666 -27860 -13403 -24557 -2164 39264 56291 42853 -44185 -117435
9991 -117435 -175346 -154469 -134995 -108654 -132439 -111987 -68999 22787 121063 135079 65763 98844
9979 98844 83014 -8625 -32103 -55674 -56032 -39476 25628 10075 -79422 -202921 -229107 -215316
9967 -215316 -222960 -107825 -167779 -172085 -116904 -122173 -87579 -57868 -82345 -74556 17832 138257
9955 138257 52891 -26544 -27289 -85516 -85735 -78629 -103193 -71201 13646 -11579 -50322 -80461 -74408
9942 -74408 -50635 -12846 32874 102409 77854 67443 50461 99886 95272 49868 44849 79015
9930 79015 49865 -21899 -46164 -39418 -78514 -17972 17467 217 -29346 -68082 -141879 -163585
9918 -163585 -159642 -93215 -1558 34816 -9369 95376 94509 64286 -36580 -150928 -213397 -109218
9906 -109218 -44149 -49090 -112397 -90607 -100614 -106707 -14514 23681 -7084 -57514 -42660 -71862
9894 -71862 -40639 -50048 -6775 58677 27441 -41981 -130806 -125521 -91002 -69456 2322 -6175
9882 -6175 83281 167360 75676 -92428 -124993 -183308 -161789 -107915 -31591 -21113 17011 -81395
9870 -81395 -43966 -15733 -15486 -39186 -71756 -35484 -11007 -37991 22834 17222 -63435 -66765 -150190
9857 -150190 -97074 -31248 -77781 -131537 -252327 -267214 -208549 -203790 -157553 -60119 -9338 87261
9845 87261 92063 90396 62804 -33462 -77342 -69154 -117556 -173574 -76393 -39521 -36671 -36058 20907
9832 20907 37747 -41865 -75177 -9657 29327 -18337 -78510 -111613 -53421 20154 -43143 -200152
9820 -200152 -199119 -164030 -117391 -123253 -115934 -116966 -143340 -123743 -83302 -29589 21307 -34710
9808 -34710 -7750 81279 86428 11484 -21925 -18658 -19840 -2508 -41469 -104206 -113312 -116150 -45362
9795 -45362 -23300 29335 12901 -10631 -107578 -1688 52444 -8652 37661 57475 77737 50883
9783 50883 -50016 -139952 -116207 -60378 -79901 -82771 -71491 7762 -22950 -59350 502 -516
9771 -516 36303 -37909 -128045 -134404 -95104 -155128 -167240 -87228 -47978 -74052 -110027 -129821
9759 -129821 -53839 -67196 -125617 -71917 -23681 65114 95969 92316 77231 -18820 39661 -18745
9747 -18745 -43945 21789 46855 8431 73312 37231 -45840 -101591 -32047 -18647 10988 20998
9735 20998 24137 5027 26483 21976 23003 14030 1412 35258 8144 -5073 -6628 13630 -20655
9722 -20655 -51297 46489 68796 28893 -32191 -139650 -110181 -41448 -92652 -113593 -73998 -68725
9710 -68725 -116071 -129368 -119450 -81166 -13883 -11505 -19547 -1250 -46983 -136887 -150704 -116178
9698 -116178 -103803 -78875 -72814 -114195 -134759 -182136 -196935 -189070 -159311 -119386 -104715 -80393
9686 -80393 -41606 -19032 -114161 -178228 -124594 -121860 -105616 -47789 25221 39476 8177 12377
9674 12377 -29393 -98878 -7499 30955 88004 86584 103342 69182 -3282 13843 27794 75964
9662 75964 57668 30783 91704 80982 110301 -258 -117507 -113679 -105630 -108433 -92825 -149613
9650 -149613 -137160 -110188 -97176 -140672 -140914 -40711 -90814 -178918 -103714 -42410 -12008 -54538
9638 -54538 -118128 -155810 -138108 -99961 -53946 -35699 -65952 -73876 -44737 -108166 -120416 -123284
9626 -123284 -135696 -133023 -119647 -107870 -94362 -73365 -7225 47410 26986 -55263 -77633 -57512
9614 -57512 -10530 -110345 -160869 -85432 -32190 -74263 -27391 4661 -35364 -37108 -2783 14249
9602 14249 -42760 3354 -7550 -28751 -78867 -49522 3095 -41481 -91462 -108474 -140198 -30991
9590 -30991 42188 45381 60448 72605 78789 48652 96300 113139 44843 -29173 -25735 -91201
9578 -91201 -147307 -110126 -86115 -18587 27503 48213 77301 70667 64124 26653 576 -111522
9566 -111522 -177074 -188202 -122397 -27387 -55161 -32031 -75752 -69019 -53372 -131062 -185485 -184374
9554 -184374 -151769 -96563 -80612 -104134 -90306 -7928 -62852 -139335 -80532 -99706 -92525 -55107
9542 -55107 -4840 -74092 -107510 -117311 -114577 -123917 -156773 -139298 -133942 -279728 -352188 -289958
9530 -289958 -208446 -186681 -91108 57505 79192 61791 7040 -26554 -29938 -16428 -4311 -28977
9518 -28977 -21712 -36619 -30249 -99589 -128101 -127568 -236076 -224117 -213395 -191462 -137628 -107203
9506 -107203 -37571 50239 -18342 -120231 -106250 -106257 -187473 -195478 -175277 -170669 -126763 29283
9494 29283 17060 -19674 3509 37985 -38910 -87197 -44929 -71662 -109272 -43459 -29123 -41118
9482 -41118 -49398 -71345 -1605 58016 15746 -78225 -188055 -243567 -174040 -92346 9216 11351
9470 11351 22684 -25515 -38269 -104537 -129892 -99641 -76098 15063 39406 10841 -25532 -60048
9458 -60048 -98737 -113670 -84762 -68367 -17563 -37218 -100705 -104432 -208739 -223800 -214688 -175706
9446 -175706 -111174 -24184 -12795 30604 64952 -38863 -143897 -133187 -72376 4719 -15987
9435 -15987 -1842 -61397 -89919 -78162 -63488 -71610 -94676 -114060 -86896 -11946 3617 10671
9423 10671 -6842 -7658 -32785 54012 83409 54245 -6973 -78588 -140687 -115452 -75450 34050
9411 34050 143513 91191 -2649 -122772 -147109 -53490 35810 -527 -26114 -24631 -2381 -7634
9399 -7634 -14504 -9555 30825 4376 -55670 -124801 -155770 -148198 -100818 -64474 -38602 44940 17550
9386 17550 -107120 -209055 -289512 -254896 -186510 -103611 -30297 7934 29322 48933 55040 102966
9374 102966 142770 127909 77310 46931 37277 -59225 -146971 -145635 -48881 9146 21293 88078
9362 88078 44902 -24544 38022 -45388 -154466 -200404 -210263 -186313 -99544 -43514 -79511 -105682
9350 -105682 -124828 -124128 -31609 24605 63281 83441 142235 96275 -318 -119096 -158063 -98065
9338 -98065 -101377 -47363 -86484 -184772 -165209 -43815 -28151 -47682 -41449 -40436 -67793 -100776
9326 -100776 -127688 -66181 -35576 -29832 -118734 -194301 -160845 -119562 -14266 12861 -7900 -95635
9314 -95635 -110379 -17663 52532 79203 136669 117053 17619 14440 -27427 18684 40818 29469
9302 29469 -59388 -118558 -76327 -56080 -30954 18797 -32726 -109213 -130425 -184527 -234180 -246316
9290 -246316 -214493 -137407 -87235 -85572 -37391 -29657 -40434 -50052 -44064 -52176 -71225 -141268 -118580
9277 -118580 -80451 -44588 6576 309 46275 -46552 -121748 -73936 -34883 3288 60798 54773
9265 54773 -51369 -12732 11513 10986 7270 -1865 -49234 -121345 -77783 69835 95571 16758
9253 16758 -67776 -71162 -23347 -49704 -64023 -3245 -90011 -126051 -93717 -30898 -59584 -29447
9241 -29447 669 -78797 -34270 50921 41024 59453 49237 -31324 -145112 -143264 -170453 -108457
9229 -108457 -89688 -22805 4499 -44623 -53630 -69152 -1276 -16333 44277 119050 157467 48433
9217 48433 -6324 -68772 -134488 -172829 -90136 -45766 -48666 -56790 -100982 -115980 -9970 26676
9205 26676 -27506 -45213 -100540 -188675 -262619 -269300 -211819 -242167 -250850 -183888 -61435 2709
9193 2709 12084 -54859 -101946 -67423 -71948 -66972 37349 124339 86173 95903 63941 89477 -9015
9180 -9015 -37917 -26795 -28030 -44691 -37723 12155 -1022 73413 55100 88813 57396 -48106
9168 -48106 9077 -4506 -39814 -71754 -24098 38458 38729 132936 110182 149873 100108 -6871
9156 -6871 -117031 -67128 -58877 -92350 -129028 -131445 -158207 -144794 -80071 -122957 -138363 -185281
9144 -185281 -103383 -33180 -54597 -33152 66754 -36605 -54308 -52791 -28870 -3793 20212 31916
9132 31916 45399 17182 10958 1315 40406 138872 179239 67126 -11880 -23639 -5778 -20956
9120 -20956 -16041 12423 -78734 -100284 -103485 10119 92200 139473 116180 122456 171522 123874
9108 123874 43869 -54584 34330 112491 105885 107046 205859 166184 204562 220279 278803 315047
9096 315047 315362 413857 517867 545655 580836 629797 767085 930217 1030403 1179491 1456475
9085 1456475 1821968 2349833 3007720 3925814 5378249 7829675 12107652 19595605 31185977
9076 31185977 42737083 42077861 29980344 18799596 12185339 8420485 6120203 4580778
9068 4580778 3616553 2983147 2438737 1944612 1536299 1258977 1188589 1162729 1024918 874426
9058 874426 713386 705602 679160 576408 562462 556172 510902 374629 303189 247225 233826
9047 233826 269671 261614 189635 167208 166533 169273 97968 196832 253193 214190 149872 77808
9035 77808 90699 134163 65955 77650 69059 68495 34310 92751 135095 98578 77265 90176
9023 90176 102343 47221 7520 30154 47846 31759 -59130 -30779 23842 108227 72674 52711
9011 52711 107993 90084 25394 -34796 -22884 -46697 11167 62716 65215 21143 37046 37782
8999 37782 29319 29729 59267 57198 -48144 -25630 -31293 -120173 -72010 -21627 -27987 45186 -13593
8986 -13593 -100523 6575 101614 51896 -18854 -77666 19453 23602 -108019 -163816 -111800 -181750
8974 -181750 -305819 -170660 -79204 -83169 -8847 15799 14519 -5765 76561 33669 30720 85312
8962 85312 80860 107125 47162 70787 1156 -36687 18006 85187 123626 51825 -32887 -21473
8950 -21473 25236 67092 120390 201463 232732 150523 110948 91357 121755 143349 119135 101883
8938 101883 51437 72296 23604 -94089 -110806 -133153 -73596 -47515 -61465 -59658 -63678 -66920
8926 -66920 -121292 -99263 -45685 -79361 -99185 -51120 -38731 -58200 18538 50919 71961 98637
8914 98637 58143 -15922 60091 70695 89426 57187 -45103 -65562 -64561 -127812 -141507 -126918
8902 -126918 -154439 -99054 -57394 -28471 -40531 -89950 -110739 -68428 78866 95631 82821
8891 82821 55226 96613 109693 17334 -58885 -75940 -45743 -4695 -11890 -23527 -13227 -2544
8879 -2544 26840 -14316 -38167 -5612 19080 -2949 73768 177776 64757 16220 33484 -29701
8867 -29701 -87134 -78298 26653 -47052 -61987 50600 58314 23073 -18282 113216 178566 161296
8855 161296 47360 -47832 16119 87209 117659 193309 119527 87610 150878 203775 224768
8844 224768 179440 143270 141987 146158 109318 121120 107025 62536 37197 98228 77118 79076
8832 79076 85166 110698 150923 96131 60009 91346 40658 -29394 -7767 -31767 -58022 -59667
8820 -59667 3495 8315 -16534 7110 -30892 42437 99582 48661 42727 67313 23372 -28456
8808 -28456 -105768 -42015 56664 129609 144979 94460 65774 60563 93521 33052 -22582 -9030
8796 -9030 50637 98989 93500 36549 29730 -3498 -57900 -112424 -179884 -162093 -47928 -13695
8784 -13695 -27427 25870 -9938 -35671 -57563 -46712 -34250 19983 31338 -53931 -119171 -43167
8772 -43167 -104748 -136484 -93564 -33205 -13877 -41007 20608 62495 55208 86910 74448 7778
8760 7778 -25865 22375 2758 -27906 19320 80141 120346 54817 17220 -29343 -53696 -96138
8748 -96138 -40101 5809 -8393 -47282 -79900 -51137 -39651 -5787 27296 20910 -35326 -20179
8736 -20179 31200 85097 22602 -3497 14870 64566 97547 28449 12398 39644 74511 65578
8724 65578 -32865 -19184 79755 97637 468 20292 12642 52891 112178 32851 72327 95948
8712 95948 80530 -5203 -139182 -127931 -116464 -144112 -95642 -48471 -28666 6927 77957 165994
8700 165994 157795 74537 64790 -48888 -120543 -130735 -152323 -119809 -140875 -123081 -56972 -12588
8688 -12588 9433 -35478 -26211 472 -22084 -145448 -220614 -123065 -10709 2818 -37321 -68770
8676 -68770 -50961 -15606 -78572 15045 -1166 -69515 -28978 -37619 -60949 12161 -67129 -49006
8664 -49006 60190 74108 2289 5312 42624 76864 36384 8392 72884 79582 51889 2638
8652 2638 -130836 -125364 -80924 42199 145993 72108 -5353 -102369 -92763 -43932 -45027 -22607
8640 -22607 -4236 -32098 11708 25471 14242 665 -16973 75186 127266 131646 99957 139981
8628 139981 231653 279104 303065 242022 133474 44500 17568 30471 81428 128761 126021 9942
8616 9942 113039 300302 392140 401897 642078 953722 987006 749775 450033 276683 186293
8605 186293 115214 146328 72483 72270 181494 255444 318370 285494 278779 210643 95240 87116
8593 87116 121636 151133 166037 117550 101734 80016 35195 60882 87759 40790 -22613 -45346
8581 -45346 -11964 28283 11585 2083 95278 154485 144232 123556 145622 203892 217286 286463
8569 286463 563300 877753 1332202 1835335 1897470 1494810 980689 685771 427682 264263
8559 264263 176732 73070 101772 201551 214683 285574 464215 643053 993596 1726930 2118615
8548 2118615 1540120 942500 575151 333362 196477 132170 126477 180995 154385 84763 73126
8537 73126 56533 99356 79442 27040 -81904 -47135 -19246 511 13165 91967 61532 58058
8525 58058 102737 153930 271789 526086 851777 980080 779004 562036 377049 337259
8515 337259 355519 447622 720822 1120794 1814695 2035788 1481027 842355 496627 362728
8505 362728 252265 148512 13199 2053 -29026 88425 153958 100742 9355 -34694 -43495
8494 -43495 -43345 -52531 -100461 -124518 -57934 38017 -2166 -49075 -113772 -70457 -32012 -49345
8482 -49345 -49652 -3055 48378 -23866 -19770 7696 74052 53718 -73508 -18501 58324 45539
8470 45539 50266 47874 3677 -19577 31059 55827 10739 -4780 44378 60170 58571 -41459
8458 -41459 -57754 378 13474 14229 -63437 -82506 -85994 -79401 -133496 -88398 -62964 -40942 -8647
8445 -8647 -12174 -70348 -103793 -64894 -92900 -94973 -79622 -72439 -80602 -114616 -115204 -26300 5103
8432 5103 -16648 -89533 -183416 -200300 -184862 -254587 -184225 -75936 39105 94439 144278 302198
8420 302198 418395 413423 369127 338803 260396 112468 22750 19683 -98613 -100074 15097
8409 15097 -40422 -74389 -53962 -121512 -194753 -150884 -75257 -3672 -25918 -9303 30673 55328
8397 55328 104042 110935 43821 35662 101489 64283 27851 51051 63842 77420 47656 41944
8385 41944 90861 63002 39518 -15732 -113119 -37049 -43902 -78813 -16934 19348 21061 68073
8373 68073 46214 -4880 -67669 -150676 -209552 -147866 -60693 -87560 -44928 -5402 -96490 -69380
8361 -69380 -70937 -181856 -157892 -138577 -184526 -74453 -93872 -68883 16390 81849 112795 80865
8349 80865 -13312 -4729 35426 53561 -12420 -81402 -51056 41608 -54828 -73899 -106977 -155411
8337 -155411 -138820 -75942 -107485 -174678 -181292 -161339 -105823 -86546 -109914 -116934 -92482 -131907
8325 -131907 -162418 -149496 -211715 -308783 -300177 -184071 -120739 -91561 -31164 -14513 -25230 26210
8313 26210 74396 78997 85646 44581 58836 46254 73825 107729 76477 143491 232225 202043
8301 202043 207803 188069 121439 118327 121272 81097 -86046 -118173 -46602 -138950 -103169 -89913
8289 -89913 -34024 -25268 -15199 22587 18739 62509 98141 -6548 -89403 -30989 -14460 7243
8277 7243 29180 32285 40385 62660 75752 121868 131622 60041 148592 210985 158192 143083 197487
8264 197487 214817 114692 112795 85209 130638 190464 214986 167398 182138 330470 380415
8253 380415 397963 352798 366660 279187 209800 231837 153230 223518 347064 412122 471306
8242 471306 550885 526442 536098 644934 750212 877762 1036218 1109678 1231620 1335128 1437882
8231 1437882 1629388 1874455 2040475 2306999 2731464 3360142 4089592 4850777 5374896 5939321
8221 5939321 7005464 8866131 11521291 15374569 21174493 30850490 47803316 77351431
8213 77351431 124363406 176419881 185700960 140759241 90672845 58751344 40376388
8206 40376388 29309910 22291041 17653304 14557540 12464836 10812966 9508116 8520906
8198 8520906 7780987 7274100 6803437 6122894 5555413 5259036 5069665 4905467 4770184 4650676
8188 4650676 4618729 4705293 4950829 5363917 5803020 6138218 6740421 7735289 9122423 10514841
8178 10514841 11423202 12468045 14354379 17479308 22116304 28874472 39164138 55900930
8170 55900930 85582966 139529454 232071479 349791661 386432163 295585125 187364290
8163 187364290 118643414 79996258 57222058 42916309 33673259 27577498 23331514
8156 23331514 19967130 17188086 15112935 13707086 12731982 11842671 10446221 8984636
8148 8984636 7894484 7161460 6591638 5998430 5525530 5159559 5004820 5058423 5191829 5330688
8138 5330688 5524767 5720197 5992565 6511050 7139668 7632267 8135095 9043275 10651197
8129 10651197 12934040 16162227 20960292 28753072 42190503 65929470 105378039 156820203
8121 156820203 183822091 153332125 101524506 64438045 43106641 30661714 22955942
8114 22955942 18017742 14642320 12330430 10457890 8907577 7725810 6957741 6489014
8106 6489014 6090445 5491652 4695223 3999319 3507959 3102552 2799366 2491803 2256363 2108060
8096 2108060 2036104 1973154 1855017 1770634 1696557 1646875 1512399 1406190 1456642 1410691 1487679
8085 1487679 1511977 1418159 1401209 1320850 1187784 1105209 1083859 1127636 1083377 1052821 995362
8074 995362 967132 958658 952315 926133 900670 866919 711039 599506 573619 598303 652045 608292
8062 608292 630582 622489 573693 613755 616729 604068 593466 624378 634783 561816 537212 557136
8050 557136 574550 632803 659730 618779 533879 551783 614946 576340 611707 702169 756337 757894
8038 757894 770261 701610 557054 565018 505870 466776 453077 462546 447187 395187 331839 309418
8026 309418 296470 407089 509329 479909 520537 504547 365890 325681 273333 261722 280792
8015 280792 220036 268558 439072 591223 641304 555141 477276 445498 409217 396251 456511
8004 456511 500147 483239 434938 383336 329300 341784 423639 396545 418254 490510 517520 464893
7992 464893 467099 463007 394501 376358 317808 237597 242290 266295 276506 233689 216136 275202
7980 275202 365554 431911 413136 369147 262353 331231 367496 293450 213629 260240 346083
7969 346083 335645 357253 441176 467672 441362 457304 474815 462173 428198 449586 471703 489554
7957 489554 399636 302204 303029 230516 180954 127492 169111 228902 216518 254852 302649 230640
7945 230640 123216 115620 132424 77767 140805 184708 194846 143707 147285 191164 239632 204172
7933 204172 177892 251060 240926 327909 305481 176716 138042 93964 27468 88378 164388
7922 164388 198155 245781 184967 146005 112238 175106 215734 290959 281942 275336 221063 192648
7910 192648 136005 152884 182406 192268 204316 219598 122142 108394 185678 205619 136862 78076
7898 78076 116946 144097 126849 120388 52868 -59444 -125572 63529 189881 234080 189243
7887 189243 169925 132660 93202 29783 111960 212907 236092 233752 196687 208093 186022 173712
7875 173712 139748 210874 278152 299014 262795 203363 148573 144538 194625 273595 259303 317296
7863 317296 328652 295736 181138 214204 365584 385819 324922 336034 264160 273145 247522
7852 247522 237542 351203 332509 228571 214774 200896 202628 244633 196887 114064 180105 204900
7840 204900 296877 258479 204415 229157 180820 152051 72927 53963 47503 58870 138494 148078
7828 148078 101195 159736 165044 183329 118496 33773 19822 83685 85701 14007 -72508 -93054
7816 -93054 -7785 75340 21372 28714 44786 -1682 72382 325054 629585 959679 1015625
7805 1015625 849590 532638 302275 226609 201939 247844 173833 133246 -10265 -9759 83831
7794 83831 114895 73630 87850 63743 49144 75581 126728 173810 159372 216853 274115 268927
7782 268927 165752 134704 147742 184276 171221 257259 254937 204714 164126 200722 234923 221169
7770 221169 232100 358814 479519 464668 423806 564870 893699 1343292 1927496 2072995
7760 2072995 1584359 1143309 835263 569168 458507 273285 207606 147840 202270 177509
7750 177509 138901 137019 115831 164027 211307 207620 232535 280432 272382 200840 215557 142822
7738 142822 23767 51444 87540 76385 52160 53058 44541 64353 68672 50188 43238 101378
7726 101378 97786 33956 10338 59983 90772 69800 209264 385461 610274 842265 953144
7715 953144 737119 521879 315010 272803 315584 307467 234485 127015 129913 96146 115537
7704 115537 161040 160813 77895 37945 75460 90381 29979 76352 87508 54407 109887 138966
7692 138966 89685 10489 42713 70139 57551 71244 -42643 -73522 -53468 6879 48623
7681 48623 102155 115673 95679 56527 49138 12248 15551 11506 29887 3255 18405 22924 10515
7668 10515 3972 -46634 -29879 -17617 15179 34963 61228 166887 122287 65656 18594 23713
7656 23713 69212 -8420 -47620 -158314 -108314 -73886 -45006 37851 -63690 -117620 -84978
7645 -84978 -39191 -10217 11857 135092 196873 101249 -31562 -101420 -117816 -57634 -107137
7634 -107137 -147410 -130487 -42899 95571 88620 -1923 25618 59925 84275 119811 103952 -65274
7622 -65274 -109102 -60921 -13774 -16029 28221 24707 12233 106686 3636 -10189 -84178 -164451
7610 -164451 -138107 -11139 97319 115211 70937 -12075 -4305 45845 65985 -5778 47534
7599 47534 71399 76867 41133 21081 52149 143219 120776 158802 180329 173711 122540 90145
7587 90145 80674 90796 -1565 42432 79892 91644 103970 88176 102819 12787 -38434 85588
7575 85588 90565 91624 34083 -9510 13051 -80577 -201786 -199802 -87144 32181 39543 71868
7563 71868 26049 -21530 85746 255830 172464 56322 41944 -8876 44233 75411 38225
7552 38225 29473 96740 107568 75282 24510 73148 103176 30539 89819 116638 172351 198780
7540 198780 234882 127467 62491 58017 26695 36371 51938 103812 146141 82650 51511 81102
7528 81102 72543 65070 59695 44457 59469 145255 169546 108093 28204 10146 59679 90853
7516 90853 64085 83473 84438 5289 27255 75584 129986 128497 98785 67623 106203 40715
7504 40715 54326 106482 95527 79936 61125 30684 -57182 -103641 -9883 55212 -7447 -121193
7492 -121193 -106022 -140080 -218576 -175863 -79223 -19839 62731 77989 118322 52096 14246 -3572
7480 -3572 -13565 -38921 -50527 -12212 23358 5025 -4296 45039 75606 90071 85663 118486 106488
7467 106488 90762 45712 -20744 -23150 -43578 -134914 -139279 -41095 59404 117597 110800 20698
7455 20698 -15798 -13313 8807 11599 57933 -7061 -4563 18397 -18771 -61711 61599 103617
7443 103617 122778 121855 126698 41809 -10791 55251 124305 123756 88302 99795 165474 172016 152694
7430 152694 44069 -142678 -145182 -118069 -50290 -15163 -5236 68485 15162 -94715 -75303
7419 -75303 39403 94486 139782 116612 114134 39426 17245 -27612 -35734 -60807 -70107 -15197
7407 -15197 -29367 -40476 -28652 -5336 16005 -34132 -82775 -44256 7456 -53341 -80491 -198
7395 -198 84462 17334 -74920 -94579 -73098 -96555 -24349 -53430 -9069 59781 96294 96693 141818
7382 141818 148953 137291 56581 -72234 -130363 -156393 -73360 -35705 10901 124501 206795
7371 206795 146138 47863 -76388 -115245 -77443 -625 23934 43251 61791 77471 97404
7360 97404 62000 26051 79959 151363 57855 10961 63906 130338 122215 107437 80447 68031
7348 68031 151205 134014 62926 -9056 -69295 -20517 102885 126331 41871 32062 -5082 6791
7336 6791 51645 18533 26779 -1939 -62920 2236 65832 63151 -41517 -26062 -15408 68046
7324 68046 111665 130824 84495 109244 110670 -1063 -36617 13035 54050 64428 22744 -29275
7312 -29275 -36894 -36665 -45720 -1999 14140 3570 -60424 -5320 39612 36991 -67253 -132225 -51682
7299 -51682 -16299 -11224 -68602 -89389 -45946 -2579 34072 25402 -81483 -71349 17082 109
7287 109 -97005 -89588 -110523 -120800 -66597 -7785 -94358 -157762 -160198 -137895 -62660 -73732 33516
7274 33516 34119 -10499 -30634 -28619 -51850 -72114 -51640 38257 124701 80121 10837 61749
7262 61749 60906 31483 8558 -31692 -18534 -2053 53817 111942 61396 52227 12166 -14861
7250 -14861 99624 118415 144187 91756 92323 55869 -4154 27998 24124 17196 -83037 -98420
7238 -98420 -16459 19405 26788 -5586 -25548 -22634 -48979 -29127 -40484 -17511 -97222 -125817
7226 -125817 -106625 -142508 -104258 -96193 -112707 -74635 -31849 8097 59434 31614 20071 64463
7214 64463 39504 30494 -12924 -21854 54343 98935 30875 8976 86101 135277 122097 185777
7202 185777 125250 76307 -6939 21040 25733 18060 -12149 -18253 27328 10511 -39174 -67730
7190 -67730 -61547 -67139 -39947 -32045 31104 89984 36167 -36634 -54033 -53119 17573 9580 -61734
7177 -61734 -103884 -100002 -97020 -36389 -35063 27998 93672 23778 -54004 -19636 -30734 -75645
7165 -75645 -72153 -102649 -65827 -1227 3576 -18046 -77048 -63825 -11709 -29628 -4496 95778
7153 95778 97299 111109 146544 135419 184499 211389 212720 181177 121600 6061 -60948 -33385
7141 -33385 -26604 -59855 49381 49432 8854 44264 75932 61839 77642 96199 114662 113240 118077
7128 118077 11825 56255 38518 -69796 -106594 -141190 -166993 -109027 -52012 -72149 -83343
7117 -83343 -72430 -7467 73712 80736 68877 109293 59381 79494 78931 15414 -65707 -123527
7105 -123527 -101544 -105270 -2111 49152 101122 108091 -22576 -11411 -69780 -16950 21774 -9287
7093 -9287 -21013 2534 21427 -20790 -67664 -101296 -98685 -121623 -138392 -128174 -148471 -129135
7081 -129135 -112384 -23464 86354 104438 5113 -67547 -51057 -28034 -10645 20656 62740
7070 62740 64142 107281 85903 138216 79464 46797 -99883 -77706 -76209 -59161 -36925 -7815
7058 -7815 -16414 2314 -34375 -54301 -121678 -65937 17979 10436 80046 106481 116629 64381
7046 64381 53136 80042 81553 -10605 -44832 -37571 -17321 43334 -10000 53882 35232 12220
7034 12220 13712 67838 133635 30596 -107083 -73789 -55552 -86112 -77440 -32826 56996 11784
7022 11784 -14722 -7088 -11379 -10385 22109 38187 20622 -110704 -182089 -67323 -61389 -84778
7010 -84778 -10932 22416 16200 61504 47368 -27137 -23649 34647 7530 -73657 -70071 -113306
6998 -113306 -182888 -152875 -9265 56656 36950 -48409 -145622 -130254 -137559 -162117 -157917 -171027
6986 -171027 -156162 -98686 -88311 3980 50849 -9016 -32532 70114 69048 101978 165535 94236
6974 94236 55804 103257 243777 163956 69762 1169 74023 153883 176921 100099 18961 -2477
6962 -2477 72706 75735 16005 -33964 41229 88823 32025 27610 -26557 -27151 -61178 -41478 -12157
6949 -12157 -55055 -133387 -117683 2466 42095 150045 168575 126520 82032 -867 -58523
6938 -58523 19668 -520 -27424 -13302 -13090 -36274 -68157 -68054 -35149 71871 54283 22533
6926 22533 -6873 12154 71227 113686 181771 157555 138669 145734 188638 178506 55357 -107426
6914 -107426 -40889 -35257 -79468 -86134 48061 100868 102179 69645 42735 2355 39523 58930
6902 58930 53456 61382 146451 150378 -27469 -139065 -202755 -199228 -138058 -166093 -125150 6422
6890 6422 82212 129370 -15192 -65895 -44460 -67230 -57033 -90589 -98302 -116901 -46876 -2728
6878 -2728 8739 -24042 -109830 -111842 -133467 -63286 -14456 -60165 -67325 -8121 64528 87435
6866 87435 77023 28922 10773 17026 -19462 -66501 -128812 -110942 -60839 -40384 35055 74222
6854 74222 21276 18151 -160 -27491 -33120 22521 116337 135279 139647 58636 90622 46235
6842 46235 59866 120563 96268 56461 70325 38895 51279 62838 136657 143746 78078 9562
6830 9562 38694 10188 -4054 -10851 33700 29682 72259 36778 -23889 -40390 -41656 7967 14090
6817 14090 -73478 -27995 120658 245208 210354 54201 -56326 -9929 30809 9446 32021
6806 32021 11072 -3560 2119 -64396 -120533 -172723 -74921 -77759 -104623 -104212 -10491 3130 -49540
6793 -49540 8248 45171 -5197 -87006 -164752 -172312 -89146 -106965 -132451 -34394 12974 -13094
6781 -13094 -18570 -18123 26775 35471 -3212 -54460 -63715 52163 159519 114281 -9550 -22928
6769 -22928 97635 137628 103111 164129 102859 5184 -15572 -54966 -48273 -13077 57722 171852
6757 171852 151847 100758 128061 113874 110254 105474 41280 -5515 -37222 -38402 25112 65764
6745 65764 81797 84566 145850 122137 -22228 -68215 -18265 15028 -6490 -27195 -54436 -20386
6733 -20386 30019 164190 168346 70810 -37025 -79015 -7528 41928 93243 6445 34605 84713
6721 84713 45413 -2941 99356 109545 59246 -11612 -16251 23932 -6333 -89196 -32253 -73616
6709 -73616 -74039 -56004 -31402 -765 -6376 44618 63540 136548 153040 59237 63911 17710 -2288
6696 -2288 -5486 44191 -39461 -56267 -86522 -70100 -23970 -46441 -38466 1776 36070 12631
6684 12631 -28042 -97367 -83583 -66180 -57002 -59325 -79709 -126403 -38766 -16476 -34428 -32276
6672 -32276 -24302 -23441 2975 -75187 -85896 -2561 -25639 -41199 -89576 -25337 36335 75746
6660 75746 30940 -34586 -106156 -52046 -71038 -72831 -73877 -24792 20954 44647 -3319 14849
6648 14849 101675 169400 165758 171264 116997 74309 55185 100021 79861 75066 -29749 -91074
6636 -91074 -25830 -63792 -131607 -76428 -65992 -108638 -55569 22122 21217 -12063 -65000 -39429
6624 -39429 -30039 -26114 -99325 -161002 -188952 -106985 -84270 -60144 -11315 52297 43227 9430
6612 9430 22049 69712 55161 8344 -28979 -85068 -56843 22453 7623 -73014 -78674 4844
6600 4844 24236 15547 22326 35100 3536 6491 12798 21747 53495 66569 45441 -1483 -108887
6587 -108887 -120328 -130063 -131898 -112320 -96951 -152588 -120429 -35202 35664 121260 178938 156619
6575 156619 85545 65186 51115 -16185 -9643 83055 41433 -12203 -10458 -79650 -45734 -23836
6563 -23836 -55125 -27052 -40088 -5957 50170 71922 60427 18666 38569 17832 -23280 -24072
6551 -24072 -614 -8089 9377 3528 73328 191718 199009 138113 56238 43715 14893 76306
6539 76306 11117 15100 42440 30674 -14014 -75574 -39918 6118 52420 7520 -26805 -24758
6527 -24758 -40038 -84710 -125947 -71737 -79612 -32253 -37044 -89992 -110849 -69312 62881 121735
6515 121735 174023 98554 -3911 -44309 -86807 -85738 -92684 -138021 -111402 -92450 -71697 -98268
6503 -98268 -164237 -107347 -61839 -38941 56949 76417 40989 77443 76759 115387 7038 -80993
6491 -80993 -126958 -92074 -52363 -37546 -61183 -14948 70886 76034 111738 84283 93557 137261
6479 137261 82981 122742 143731 139564 101959 51121 12126 -31510 -24031 -60250 -121629 -96702
6467 -96702 -21667 -30402 -87334 -17011 39242 24890 73776 115574 16420 -93167 -91290 -38967
6455 -38967 -36446 -35048 87908 102953 114158 111476 85665 205760 165817 131923 124129 142860
6443 142860 75720 -18598 -32868 -62942 -22207 2658 -554 58954 116051 123244 99320 94516
6431 94516 95565 58484 44321 67257 59548 35671 76097 60787 56746 72680 -26835 -89092
6419 -89092 -106410 42668 142722 23195 -24083 -86968 -182445 -172371 -61416 -17645 9761
6408 9761 10678 -10137 -41371 -54777 12315 -11517 -111296 -97474 -82155 -7014 77461 55416
6396 55416 80123 71168 21217 20465 23022 24896 46849 47097 73515 38159 -11288 -48778 -14582
6383 -14582 -6890 -2504 -78322 -103836 -106927 -31992 84546 94992 107519 21304 -76758 -73158
6371 -73158 -36404 -60824 -64271 -35574 -5561 25729 97553 114795 112794 108696 90529 117943
6359 117943 66170 23446 82234 101864 4347 -54234 -67619 18666 79584 92276 90844 -2959
6347 -2959 -14527 -51953 -80424 -43048 -9341 4088 11680 2554 36471 33590 21474 53658 86276
6334 86276 42935 17514 7359 17212 30058 13475 -57134 -29712 51605 62522 46209 24047
6322 24047 61785 61143 14051 26819 55353 93405 49181 104767 71272 25276 1436 75942
6310 75942 47023 15281 -19387 -8796 43233 46405 64766 90398 131989 74130 3569 -3875
6298 -3875 -33922 -27841 -37135 -53722 13780 48626 7286 -58302 -49054 -33415 -43008 48843 94786
6285 94786 44654 -58293 -82950 -33171 -72763 -155978 -138557 42883 164822 189326 185557
6274 185557 85599 35358 65164 20097 2232 -28758 -94311 -13544 59281 36660 43037 82174
6262 82174 54425 -52531 -140790 -94657 -159526 -175563 -59384 -23618 -34841 52828 60902 42537
6250 42537 51956 115986 180753 96071 37294 46128 -37685 -24796 27397 3434 25232 -5543
6238 -5543 -119879 -67790 -47715 42947 21329 -13084 -51690 -9796 -21837 19851 -84697 -110861
6226 -110861 -56276 -5901 61792 -25286 -173994 -173710 -115149 -87347 -60508 41101 38569 44165
6214 44165 -14154 -117068 -136634 -7697 38156 -52969 -31141 2571 21933 17866 -10194 -54641
6202 -54641 -68947 -58747 -83407 -64808 -926 25149 -15381 -15439 -19804 -58817 -119777 -89971 -43537
6189 -43537 67718 147160 144035 -16794 -72071 -61877 -31286 -26477 22342 13050 15206 7808
6177 7808 -36973 -26984 -58623 -9296 -27127 -58843 -83863 -55676 -20850 2738 65585 60524
6165 60524 33550 123576 133949 83439 19773 -41018 -101721 -68564 11476 132510 164921 75578
6153 75578 19188 22757 28265 -24517 -8004 10008 27368 12690 -43615 -23832 -68807 -47940
6141 -47940 24329 10656 -73972 -89410 -16462 55991 5009 26709 3552 -75259 -71807 -121170
6129 -121170 -41409 4101 -16231 -36056 -33168 -36996 -6811 -41899 -61794 -117755 -116266 -123659
6117 -123659 -37418 -27054 -36870 -138709 -44008 21628 52412 35450 -21128 -19096 -79909 -157991
6105 -157991 -208039 -191921 -200940 -192754 -88650 -52018 -57113 -58390 -28130 -4374 -34768 -100454
6093 -100454 -108299 -119809 -227992 -229941 -88235 -28941 -38714 -40253 -12584 5464 14610 68875
6081 68875 69798 11262 31396 45559 57979 73124 -13516 -19967 13606 -6353 -43707 -18997
6069 -18997 -51821 -26829 -59796 -58455 -131248 -177292 -167379 -134166 -106493 -89369 -30039 -24128
6057 -24128 -23164 9961 55793 32685 -47044 -147217 -164234 -191799 -140764 -100071 -73063 -107203
6045 -107203 -54843 -38246 -119555 -194064 -95496 13884 53122 123822 135296 144877 67347 64784
6033 64784 13801 -68739 -174388 -152045 -129484 -165003 -47697 62362 13834 -37295 -145354
6022 -145354 -155698 -69524 30800 80144 35730 -1410 -23528 -13243 37941 40847 81566 128058
6010 128058 78529 81183 60693 109591 26543 -52667 -57164 21397 64209 42014 12336 -34799
5998 -34799 -47265 23576 47328 2139 47517 43501 -4023 -28242 -74873 -27512 30560 -117287
5986 -117287 -184589 -50492 42984 -52600 -111547 4087 167929 159581 107169 17826 47861
5975 47861 99173 115353 215737 237819 137754 15882 -28811 52962 52351 39249 19592 3063
5963 3063 63705 68644 -12242 -56644 -6268 107888 196838 168533 119952 124308 22429 -34392
5951 -34392 -58389 62432 175148 133686 61175 76276 61712 74553 114161 36339 -25658
5940 -25658 -6493 25540 58806 -12244 -115367 -157424 -153740 -123364 -96062 -14513 -23622 -43740
5928 -43740 -88058 -9951 28250 -29828 -149530 -114328 -34677 -24970 37780 40509 -24654 52341
5916 52341 21459 -1796 44520 -21390 12300 74583 34546 36824 37511 109166 143178 119613
5904 119613 129949 29173 -26829 -23538 -13773 -2763 45085 57818 85106 116408 128601 126888
5892 126888 87399 6355 -20292 -31805 -155 -86751 -86009 -7839 136581 122800 -11178 -45307
5880 -45307 61777 180033 123377 57484 69372 101720 44456 51556 79979 140109 69747 85954
5868 85954 141085 123137 61926 40393 25139 28481 8712 -55263 -83496 -150235 -157358 -69889
5856 -69889 -98306 -50513 12184 55661 40091 5789 -30225 -12438 8610 49966 -15787 -110197
5844 -110197 -105259 -167340 -166438 -117552 -28722 57270 111316 97269 -19959 -52903 -9265 16967
5832 16967 44386 60127 79658 19589 -1260 -10 -24803 -130702 -91308 -45350 -57520 21796
5820 21796 24212 46810 91870 55656 51348 53322 82869 35036 -50166 -57146 23299 94077 100776
5807 100776 24815 -35223 -119055 -74340 28511 40808 58383 29004 12481 -7549 -3656 26042
5795 26042 27675 -12943 -17527 -36965 10955 50422 -42491 -96134 -72439 -17869 14428 22124
5783 22124 -20213 49890 43279 64332 40361 -4742 -64196 -115662 -156936 -84944 -18723 -29126
5771 -29126 -88380 -71162 -98497 -18794 15752 88380 122352 19867 -15116 -37239 11659 5487
5759 5487 25645 -3891 -112134 -210382 -185574 -118064 -88097 -102184 -101267 -168101 -180648 -116573
5747 -116573 -48782 -29410 -10701 -23768 -17127 32751 37887 44350 48111 28447 -10629 -113554
5735 -113554 -172151 -162032 -52828 14446 13672 -21931 -43752 -58841 5089 16138 26550 108471
5723 108471 95990 90210 178894 182118 119886 112242 58854 22090 34082 21773 35306 29741
5711 29741 -117717 -229679 -197715 -63962 21056 148000 143263 166342 71236 -4532 60856
5700 60856 68018 80114 67269 72857 53198 -5062 -6069 77177 117212 118519 120763 51349 33024
5687 33024 45760 89883 35379 -113221 -150794 -106335 -76930 -150277 -136985 -87420 -68408 -29198
5675 -29198 1651 28304 30295 6858 15316 52670 53628 19988 69852 50595 -34566 -45409 13764
5662 13764 -33277 -128139 -100262 -94292 -764 -21160 -76505 -88292 -72146 -131290 -154291 -85407
5650 -85407 49976 96592 54897 101158 61988 -11790 -34295 -72139 -103030 12689 15401 58575
5638 58575 30160 71415 84877 25638 -35588 11439 17468 21046 28046 -60381 -31917 -46742
5626 -46742 -25087 -15931 -12634 -33708 7714 64448 147139 172671 117514 94196 151982 135481
5614 135481 64018 26793 19139 -39289 -9779 9400 1722 76268 75919 83992 13055 39147 45537
5601 45537 78224 135701 63720 -5836 38882 7686 -75486 -192664 -141935 -105571 -87293 -56859
5589 -56859 -68404 -32670 -72923 -75414 -28089 -66566 -61615 -58258 -2099 75266 104841 207758
5577 207758 154914 50135 53548 59658 37975 42226 39261 103244 151333 -8001 -73522 -6802
5565 -6802 27940 -47795 -78763 -95847 -49410 -10818 -9218 73310 110998 97993 22523 -9385
5553 -9385 -17286 -15977 -16536 -42353 -34373 -56718 -96817 -57889 109704 170845 60332 22669 -39466
5540 -39466 -79615 -88196 -142122 -171903 -214201 -199085 -186213 -171045 -127829 -37557 19738 -1370
5528 -1370 -35184 -26306 -65409 -16054 33575 21226 15612 3301 -36162 -75184 -34211 41089
5516 41089 67537 66033 28579 -28445 37503 131177 71335 38927 106979 105568 -4928 -80709
5504 -80709 -156729 -138147 -127974 -174391 -162453 -124406 -44097 -13657 26687 9942 17534 39466
5492 39466 41975 76006 118228 140213 83902 98795 75012 -336 4228 32312 -274 4057
5480 4057 99807 63854 18041 23264 -76761 -81684 -41426 -30173 62629 97783 65227 25572
5468 25572 25957 -493 -29142 -11301 69538 32669 -51635 -11503 152805 154429 151401 100793
5456 100793 60878 80455 103905 149608 8850 -107121 -35856 -10691 42187 41458 12734 -56501
5444 -56501 -145123 -219128 -114421 52975 55969 85371 145537 123626 45473 -52475 -31967 -6558
5432 -6558 -7542 18511 -15373 -23247 -62233 -92417 -70516 48022 60680 68331 19340 -1214 -17137
5419 -17137 -66015 -5206 -7267 -20024 -38616 -30071 -74202 -49609 -36031 10346 36367 32401
5407 32401 -20388 -41504 9001 21011 23495 108068 85515 27254 46756 39118 42664 -61098
5395 -61098 -80618 -41268 5505 43748 73492 154108 210984 225224 172528 109760 69243 -6825
5383 -6825 -20036 47962 92683 59118 101986 151948 210908 211905 209607 99610 84904 50694
5371 50694 93940 98644 34152 3105 62023 72765 29844 59583 71304 13031 -47571 -143786
5359 -143786 -135143 -45617 -24128 -14362 -30787 -95295 -110521 -99326 -138068 -93998 -108707 -129151
5347 -129151 -103769 -50733 47127 123033 158778 89884 63999 33969 23722 61151 79298 113023
5335 113023 78516 -32246 -95605 -9229 -19295 -35478 26880 30926 -48965 -109966 -143013 -73400
5323 -73400 -14991 -68690 -66607 -44235 -90575 -105571 -97302 -91837 -54420 -46534 -32943 91819
5311 91819 89042 26475 -62658 -60627 -13290 2113 -91709 -150601 -172350 -92033 21671 -10762
5299 -10762 -35406 3816 32837 68087 -16991 -13100 80842 127944 168855 120383 75659 -41495
5287 -41495 -167668 -229616 -70474 48052 24995 -22429 -10267 3646 22240 70573 111755
5276 111755 104231 50180 -25971 -50473 -14574 -20287 -19705 18279 -12697 -47510 -185708 -153854
5264 -153854 -65504 -45064 -106570 -69491 11264 84219 -24586 -94211 4814 57010 49220 36705
5252 36705 32555 48051 57535 94221 133163 138745 87378 44316 -23373 -70720 -60954 -55767 -137448
5239 -137448 -56613 33136 80149 38073 83735 92183 76248 58846 82366 74977 54461 -11538
5227 -11538 -40387 11563 97239 120546 27187 2095 -86709 -83766 8663 11189 -120546 -139293
5215 -139293 -162751 -139459 -33985 74185 57349 135005 99928 69162 76172 201482 220501
5204 220501 176173 118027 112011 31082 19270 21763 36355 52512 -32379 -48161 76482 29036
5192 29036 6535 80527 78717 95619 28186 -28828 -18398 -11243 -37605 -84148 -84653 -15577 10979
5179 10979 -115079 -110601 -68148 -118596 -96257 -79229 -10672 2406 3154 4819 -20765 -41906
5167 -41906 -16584 -32379 -62466 -75650 -43979 -32747 -12323 -36272 -94852 -59036 -77912 -82305
5155 -82305 -123101 -155346 -116303 -96633 -11764 -10782 18181 92931 81052 71622 5858 -45877
5143 -45877 -92926 -92239 -65052 -82145 -32198 -2530 815 -2770 42404 53062 -24418 -27260 30817
5130 30817 19930 11378 66932 143070 141448 94264 45787 -37743 -105214 -6883 82197 52264
5118 52264 2608 38588 37243 309 -16804 52046 12621 -39189 -46425 -96206 -112757 -68549
5106 -68549 -59002 -68842 -4908 -32305 -95382 -63742 -51760 -64149 -39696 -21241 -2827 -107714
5094 -107714 -194974 -175876 -214767 -174507 -129349 -139352 -30182 69468 53055 28836 -9974
5083 -9974 -31465 14345 20446 33380 50883 68142 -5834 -43638 -43486 -38829 -85031 -140567 -129698
5070 -129698 -102988 -82362 -98835 -132400 -137736 -93732 -6835 -32518 -2320 -44327 -51451 -85408
5058 -85408 -103897 -59266 -56935 -67463 -105460 -122076 -75169 -54146 -7307 37155 22839 598
5046 598 -11494 30389 15174 -91482 -115600 -2976 -35711 -79517 -115188 -116821 -8646 45996
5034 45996 5660 -5634 -45582 -2970 41078 73218 58947 -297 22135 54020 63817 -37446
5022 -37446 -49925 -63556 -63841 -22962 -39875 -81015 -77175 -1365 121571 132088 104735 76778
5010 76778 45946 54849 80378 37670 51123 113934 95667 23486 -369 -16737 -23223 -47347
4998 -47347 3877 -52924 -86192 -31553 -1178 10543 70685 -8339 -79855 -42680 32508 42861
4986 42861 -4351 17898 6958 -9990 -25701 -83018 -32406 15912 28462 60415 59620 42605
4974 42605 79169 92375 112688 59813 -43861 -84579 -113527 -11085 80090 55899 69318
4963 69318 38311 34569 28844 46868 77156 79643 -36011 -91810 -70117 -124502 -86199 -6075
4951 -6075 60321 68174 18127 -56199 -7662 94129 106880 110480 71097 110483 121770 111638
4939 111638 159605 232195 143351 130771 164501 178942 134427 -11732 -11405 -71772 -92549 -45090
4927 -45090 24632 -56700 -103501 17842 59682 65276 9443 -52534 -82737 -53145 -45087 15739
4915 15739 90438 127166 51441 17505 69757 110878 80703 32909 7225 -28014 -84160 -92223
4903 -92223 -39362 99785 126941 149095 184830 125583 58600 -46481 -99898 -152206 -153121 -35673
4891 -35673 30151 21044 16157 19617 54601 5585 -21041 -1387 62893 94890 56218 1895
4879 1895 131775 158493 75955 -30080 -83490 -92721 -138126 -195467 -106576 -60452 -51871 -42229
4867 -42229 -75830 -126602 -124999 -117227 -109192 -26940 21917 38641 -23233 -136120 -262887 -208480
4855 -208480 -531 -27168 -81875 -24735 59445 25583 51682 133823 155308 99654 88705
4844 88705 -6836 -60189 -93658 -130500 -37105 -11610 -110897 -110779 -25454 20161 41093 52457
4832 52457 14238 19368 21699 -25510 7397 6338 -45633 -134516 -144793 -96952 -33409 -68204
4820 -68204 -131728 -157124 -37830 68427 113455 68295 88318 47847 25429 -33906 -36658 1920
4808 1920 24734 -16149 -19348 -43217 12875 62190 33565 49996 13114 -6469 20905 48895
4796 48895 73039 103404 -18520 -113534 -79588 14899 54236 47384 -79663 -47488 1967 98828
4784 98828 61409 31921 42269 3363 -26687 880 -22765 36210 55546 54409 65071 19287
4772 19287 -16889 -118483 -110554 -34141 -24964 60048 121028 99731 24829 72485 134394 98420
4760 98420 -17708 -43634 82262 150668 144773 78273 80703 46134 34355 43451 -42123 -120930
4748 -120930 -138350 -122347 -55728 -28089 -69897 -71886 -3599 69835 84709 79851 36464 -22562
4736 -22562 -1912 42356 -45952 -78862 -52340 -9216 -688 -70658 -116436 -143719 -78307 50422
4724 50422 90470 63387 -59079 -49547 -40039 -47133 18266 -12323 -20898 51802 140007 51630
4712 51630 -36960 -41855 -18854 56364 52811 96147 153774 152275 173144 201806 147336 176023
4700 176023 118154 46600 -49592 -85905 -62783 -38243 -2898 -541 -48510 2279 -35684 -35747
4688 -35747 45291 10092 -22691 -46007 -36141 -31295 42355 71526 82555 64955 26966 68195
4676 68195 150180 102688 74448 67523 29676 22184 -72836 -40872 -58351 -57886 12121 77582 69267
4663 69267 1057 15561 -17513 2799 -24014 13315 36709 22753 -19691 -91165 -105752 -50955
4651 -50955 -75771 -131397 -90754 -83905 -20598 -200 -941 11633 132207 90568 79986 56957
4639 56957 27531 -844 -16680 -34184 25899 -20337 -64684 -23954 47521 218 51496 66361
4627 66361 -16140 8119 34147 49270 148702 100462 50747 86850 90406 51616 82074 57433
4615 57433 108311 147435 25062 -68924 -77384 -17219 -211 6158 16944 -17461 11514 -16084
4603 -16084 -34780 2697 38405 9667 103123 77893 11899 -30012 -21379 -26051 34974 127018
4591 127018 95339 73524 88047 128719 104156 100926 115201 159371 168604 127024 85242 79088
4579 79088 64664 -19128 -78718 -20659 68645 123514 129036 90502 63408 20886 49082 -11076
4567 -11076 2102 29960 26142 44088 16487 -47112 25462 14837 -7886 -32191 -29940 -748
4555 -748 29427 48206 -33522 -63962 -19559 32050 -7009 23374 54182 47619 16909 83492
4543 83492 76607 78071 115475 68797 17355 -31292 -83590 -74656 -93522 -54625 12168 43832
4531 43832 -33449 -90503 -4699 60785 54384 28570 13375 -7784 13291 65434 99687 109164
4519 109164 83020 51357 68081 26351 10066 53510 100281 106374 39882 15292 81794 157181
4507 157181 73609 -13236 -7398 41208 103018 81562 40933 9948 -19682 -21866 -18297 11331
4495 11331 54600 33205 -21903 5862 -28864 -81588 -20027 -1465 -8968 46752 60515 -32147
4483 -32147 -84556 -19594 -69075 -64867 -13141 38259 33336 -9528 -41519 -22519 -48636 -52913
4471 -52913 -85254 -89309 -108118 -92289 -102214 -137644 -144504 -58926 27308 -19810 -55626 36049
4459 36049 -20564 -125493 -76241 635 41793 31421 9476 25469 74826 12654 -88330
4448 -88330 -120493 -77879 3169 20096 -70814 -122741 -101152 -46904 31071 9723 26538 16368
4436 16368 3681 -4069 -30138 -9248 20804 61405 49424 25771 56972 118514 189811 192739
4424 192739 145805 124418 96143 11836 -30372 -31896 -60207 16384 108244 82443 75236 -30586
4412 -30586 -28001 18543 36518 34178 99386 72534 53167 62263 127509 152123 145408 137968 62296
4399 62296 80900 96147 83951 -9517 -77815 -2698 44878 125881 97098 28772 -9891 26345
4387 26345 -3120 34644 11614 -19035 -19366 -50162 -76146 -44292 -69631 -112164 -124661 -84301
4375 -84301 -34171 -71426 -75985 -111957 -145089 -58731 59874 67737 -35381 -98314 -144535 -25522
4363 -25522 -28377 -39754 24609 37785 90635 73153 61625 36465 -4601 -20379 -86114 -22234
4351 -22234 9372 54826 64666 1891 22787 35839 4549 33826 67285 2597 -68455 -97094
4339 -97094 -124412 -113597 -105743 -84666 -86098 -58175 -9311 8818 -68144 -66232 -61500 -58135 -80873
4326 -80873 -84451 -33340 12840 72978 57654 98591 24811 18029 34356 62498 44158 38110
4314 38110 115663 56559 -72204 -77289 43638 42987 86233 127701 143592 57608 -36567 -15883
4302 -15883 43221 39194 -14933 -21460 -20162 68452 117182 148497 75075 58181 6703 17875
4290 17875 9524 5852 -7721 5956 87006 123396 49790 12252 35210 17301 -16956 -51290
4278 -51290 -24470 -32588 -33808 -79659 -61375 -23635 -40361 3723 -11378 -19029 10453 27252
4266 27252 -11775 -554 33661 57566 37996 -4691 -36473 -31498 -106671 -115236 -11471 51307
4254 51307 42072 -10589 -51292 29800 81795 25030 67967 52158 55727 -10915 -133499 -92324
4242 -92324 -5244 93515 178561 125703 47258 -28471 -67422 -104684 -60690 -84097 -69663 -63904
4230 -63904 -52578 -52533 -13321 10191 -27954 34355 -28744 -132409 -84703 -18121 34315 8181
4218 8181 -50757 27103 47551 33376 2873 48968 101440 48990 -49317 -97136 -43014 -9021
4206 -9021 28305 -70296 -82046 -146368 -98319 -61196 -71012 -67199 -9304 82766 127590 24270
4194 24270 -580 113194 107887 117146 137262 91058 -25118 -53130 -45928 -8418 -10101 -3618
4182 -3618 3537 -56333 -97489 -55697 9201 16371 -45080 -12460 55019 34725 -6240 75688
4170 75688 5966 70176 131827 63717 17627 41820 55254 103401 49099 -47719 -32615 118122
4158 118122 153509 108975 47852 41057 58804 13787 75981 95291 2565 -26305 -53230 -51393
4146 -51393 -17093 -33300 -40340 -69988 -31018 -71601 -105041 -74517 -60965 -67148 -87032 -123198
4134 -123198 -119744 -95433 -3707 42482 39374 -20170 12764 110581 132583 102285 41431 24879
4122 24879 77929 127668 102960 30615 -21999 -31411 -2845 71147 137625 165710 79528 -31950
4110 -31950 -18694 62240 78164 169598 194634 101561 18451 -8146 -25634 -18542 -25231 45299
4098 45299 70050 34085 -64962 -61646 -9974 61153 105142 74147 14726 -30840 -41391 -113743
4086 -113743 -118849 3310 125706 163462 106270 43384 61585 106327 112893 98857 88439 30363
4074 30363 45306 2905 -26595 6491 5485 3691 -21774 87858 116099 109428 82439 -16198
4062 -16198 62950 173638 124412 128351 134928 54790 -25779 -6845 -56405 -82716 -96349 -104444
4050 -104444 -100597 -76886 -92182 -66019 -127285 -65854 -1442 -33308 24252 7861 -3054 -38026
4038 -38026 -65754 15916 88704 112989 55191 24404 62431 144872 106271 27875 46466 -18297
4026 -18297 -57488 -2562 9364 22936 22375 27553 -6637 59952 30138 -68669 -124688 -41686
4014 -41686 -66841 -45449 5953 12146 11298 48266 41163 14609 -87791 -116424 -129502 -21886
4002 -21886 87451 41648 -18081 25580 46017 91025 49830 36792 57671 48559 71772 87909
3990 87909 102823 99909 -6678 -81642 17525 23827 -29812 -106344 -144763 -113080 -160156 -156040
3978 -156040 -138023 -151536 -156052 -164399 -118926 27245 -1968 -44455 1408 52216 47057 36126
3966 36126 19059 -53406 -48810 36058 74534 56700 52523 39419 61694 38064 -9064 -26500
3954 -26500 -84111 -84878 -104979 -83914 -65939 62885 142837 95045 23637 -4139 -61179 -128138
3942 -128138 -112890 -42851 38837 44202 76058 99771 66846 38042 123132 201869 201659 135343
3930 135343 117447 131101 124454 174403 189129 124304 51126 50412 124087 187153 199690 233021
3918 233021 216953 228769 259956 242995 114575 -19619 -47577 -12837 88256 87692 77048
3907 77048 86357 42716 50423 64661 64966 39700 -12097 -65795 -17338 -50513 -4607 5815 -24839
3894 -24839 27395 116254 131911 46622 -3570 18730 107259 86637 14531 -70055 -78304 -27491
3882 -27491 14924 49325 57979 127704 146535 134547 119219 78522 60894 -10242 -69170 -64616
3870 -64616 -81238 -50385 -42395 -13519 6950 46664 63458 46028 8295 63643 88895 57805
3858 57805 24353 19601 -30935 -4054 48427 50081 -51935 -98769 -66786 7967 46890 -17953
3846 -17953 -1954 44894 95079 80944 62672 34621 29904 -19951 -100812 -122322 -64585 -52861
3834 -52861 -45664 -105750 -91425 -33632 -16630 -13093 -69256 -46587 -14898 -8361 -13743 16123 35668
3821 35668 133144 160796 138259 126429 130597 129008 144982 129579 95062 15736 8527 50062
3809 50062 -69141 -115219 -159007 -202625 -95572 -40767 -42851 -37290 -26674 -35303 -73 -40616
3797 -40616 28232 101474 156784 52196 -15929 25157 35058 60254 35687 -15850 53228 112805
3785 112805 59381 -62534 -26629 23407 54784 41264 -22784 -54598 -48209 -35868 -31224 -26147
3773 -26147 -48916 -19167 60045 21714 -77233 -117760 -92060 -67681 -10837 -10776 17653 23542 -1073
3760 -1073 70529 88735 28245 22872 19994 -64221 -121378 -74721 -41163 17663 146097 111621
3748 111621 48947 81540 58954 62985 70895 19012 9517 1098 -14455 10650 93687 168792
3736 168792 117804 61427 34885 50174 -4346 31787 9332 27168 57682 49550 7698 -23752
3724 -23752 -28995 -110141 -106382 -7464 48288 6367 1278 -17715 -72894 -72209 -115610 -106554 -111092
3711 -111092 -86640 -86463 -147096 -130751 -89632 -96997 -100085 4556 40878 14391 8560 -20855
3699 -20855 48283 63166 2091 -16798 15940 -31823 22106 6215 56441 49179 23111 57277
3687 57277 42411 16904 75689 35393 32592 31867 -18656 -75208 -57030 1332 614 -62255 -77417
3674 -77417 -9217 -3462 -18174 -48786 -110674 -103392 -148247 -71053 1462 53433 88926 45458
3662 45458 -15262 -25354 -40202 4624 2773 33726 -7867 -32344 -74170 -67445 218 -34596
3650 -34596 -30257 88320 83168 21280 -66333 -72637 -75819 -114216 -106359 -32295 71492 130923
3638 130923 24535 -2778 -86945 -75965 -22775 -4154 37092 -17424 -60052 -63356 -78225 -68833
3626 -68833 -19147 5224 49063 119994 156021 107506 84473 56134 26313 -13364 -125667 -105533
3614 -105533 -80842 21258 11687 -34700 -45544 -93475 -85840 -42901 -99060 -133785 -18491 -53935
3602 -53935 -79684 6780 -29102 -103661 -17020 17017 36224 52366 -27692 -18708 -92386 -152283
3590 -152283 -159350 -180220 -117888 -65271 54682 149333 175632 138515 73321 -115803 -153973
3579 -153973 -53621 -70932 -39871 -50148 34776 85524 -1829 -62856 -46622 -10267 50753
3568 50753 105622 92784 -2206 -103497 -45207 -47143 -5761 61811 86479 143459 88476 46435
3556 46435 51978 90386 36443 17481 18465 -17182 -6900 35162 4203 19735 23257 54525 66851
3543 66851 6784 -15845 50944 58900 789 -20785 6460 31828 51675 42491 110205 117984
3531 117984 97037 116128 84463 149737 176754 197405 206618 161136 82724 60864 50243 -4796
3519 -4796 77082 144882 140219 132791 103992 69484 68175 -10322 16559 140204 159208 150572 84642
3506 84642 79482 -4517 -114924 -100428 -121577 -133862 -99163 -84688 -71270 -80979 19366 58691
3494 58691 9770 89194 67207 -29518 2204 30773 -20784 27132 29542 8573 9071 -6388
3482 -6388 22548 81197 22650 -36283 -8200 42396 6413 -17011 61298 57748 22833 -12362
3470 -12362 37003 57166 47832 28159 72382 1228 -77265 -69510 -22008 3098 11520 7569 -53224
3457 -53224 -99955 -118272 -99548 -91604 -43163 61731 142302 112155 38932 37820 39042 29626
3445 29626 -14800 64609 144562 194683 119140 44566 250 30410 4626 -6717 -10336 28273
3433 28273 67290 71564 34507 16417 24155 -28945 69722 34434 -70191 -115540 -66449 8895
3421 8895 33047 -82968 -79158 -48487 30104 41329 1657 15668 27776 69030 151758 125521
3409 125521 82735 24904 -45152 -64294 -74832 -16161 -19967 23948 93704 126035 153725 182467
3397 182467 177669 117592 17675 65708 55105 116088 143344 143838 113163 36442 54621 102227
3385 102227 59402 4685 -10751 -91943 -104984 -68110 -2437 -41855 -85668 -74241 -18505 -21291
3373 -21291 26929 92706 78598 -29500 -69907 -34985 -22961 -75697 -79031 -9995 49191 105105
3361 105105 34870 73011 109481 69609 3870 -55717 -51502 1126 -29021 -69122 -94106 -77921
3349 -77921 -49022 -72288 -12586 63671 49869 -28822 -92261 -25025 -26014 -25247 -61930 -68727 16023
3336 16023 32705 -33545 -47120 -1542 -52336 -89430 -116380 -64224 -70431 -54623 -83638 -124793
3324 -124793 -50656 -46805 -64064 10604 67527 59160 31424 42860 -958 -55306 -90949 -12304
3312 -12304 16234 -25585 -2268 57272 74035 -92205 -220564 -103813 -18030 -2992 26932
3301 26932 65642 81345 153691 169822 161359 28982 1883 -1007 -19854 -38877 -54071 -40528
3289 -40528 24931 -10200 15412 56119 15836 11169 38504 49372 136535 115266 83116 14399
3277 14399 -82429 -73435 -23219 27916 1334 87524 75872 90669 96033 152577 204282 167595
3265 167595 143694 132514 147401 82783 -73531 -102037 -93787 -94146 2163 77442 18960 35878
3253 35878 43093 84737 90653 -9251 -49613 -5936 65757 34653 -26017 -148791 -158173 -111378
3241 -111378 -138298 -171480 -69583 2833 35069 51354 54849 97611 14001 -45261 -13261 18150
3229 18150 15686 -40817 -3981 -14941 -34151 -45459 -75401 -24222 11146 -45242 -38511 3566
3217 3566 55087 37349 3525 5937 -12149 29550 6007 26425 65980 72200 45898 26872
3205 26872 27624 44373 102856 65243 78529 99376 80717 39556 -66195 -77341 -87635 -53530
3193 -53530 -3350 -65982 -46071 17522 16262 51403 85413 17091 15225 -10736 -50836 -40852
3181 -40852 43358 88681 61032 34332 126062 120053 92509 75117 -6025 -83226 -131227 -49653
3169 -49653 14541 -4918 -40562 14673 36816 121527 197455 202273 162145 149747 136566 75458
3157 75458 30316 -26071 -80473 -19363 49427 42778 23436 -5720 -46642 -82094 -108047 -40336
3145 -40336 -14756 -24301 -104607 -158651 -104228 42351 29169 -30485 19252 4011 2046 72254
3133 72254 98884 57143 18865 -23154 24995 58767 122655 134234 87432 69106 73931 60016
3121 60016 114967 63448 -33931 -60977 -23573 -345 -37473 -34689 -47873 -33512 -30289 -51500
3109 -51500 -123749 -113211 -40082 22671 115724 169124 110014 60031 48562 22550 46372 83118
3097 83118 24555 -51677 -58510 47797 78477 48556 6894 52464 14785 12432 42669 4617
3085 4617 4793 -12288 20506 46562 15893 -91928 -160329 -46464 53796 22544 -77974 -46534
3073 -46534 3074 -9050 -6393 -27794 -26819 -16563 -8938 -51443 21658 47337 2683 33633 -1642
3060 -1642 -75191 13911 129245 91134 41723 122793 178143 124260 22721 -41302 -23993 12347
3048 12347 -14007 -81856 -42689 7147 -20957 -53609 -122703 -119916 -133967 -113927 -57339 -51062
3036 -51062 -114654 -63541 -12016 -11672 -36848 -17668 -13792 -15506 -24159 14583 146142 80855 -6799
3023 -6799 314 -61562 -42538 -10898 -20694 -54921 -86567 -99712 -131004 -88153 -21649 -39997
3011 -39997 -78228 -87867 -141945 -146421 -151528 -25640 43400 41601 -67313 -118397 -76599 -39415
2999 -39415 -32268 16601 22185 58077 149300 58882 -23072 -62608 -77862 31322 108627 141680
2987 141680 139103 -19085 -52219 5265 -25061 -57909 -53582 -62228 -132376 -114898 -46170 50078
2975 50078 148528 122358 50941 -4831 17570 83055 27255 -25662 18591 30507 7459 38184
2963 38184 15378 -52425 -32528 -96716 -103852 -50248 35591 39951 -26239 -96572 -42540 -17893
2951 -17893 -19621 90437 70336 37433 -20034 -45714 -67613 -29252 50951 13816 7002 27204
2939 27204 176152 92718 72838 149584 37453 -27494 -32439 -27349 13345 -42270 -63943 6458
2927 6458 35340 -11853 -129248 -149428 -92564 -46297 21849 37421 -6369 36307 -34364 19211
2915 19211 5830 28467 2928 -80399 -144153 -54874 19324 73290 161454 102154 79029 46427
2903 46427 42415 42764 63467 13539 6498 -9861 -77556 -123404 -99782 -40844 29109 104591 126987
2890 126987 117366 89493 62524 85840 9798 1198 -7355 11452 -8279 1993 20521 83813
2878 83813 136069 146284 131645 87509 98062 82708 182434 188119 92412 10311 -22450 -60055
2866 -60055 -104919 -124682 -101663 -13112 46064 47951 -17517 -40434 -23154 -34560 -22696 22582
2854 22582 33997 -76994 -92623 -82114 29979 47566 28155 17063 -3561 -22685 51948
2843 51948 65396 51140 58426 126683 119513 81004 46548 4779 -16449 -35514 -37075 -63367
2831 -63367 -43643 -16216 25610 122305 138471 87379 11167 -17026 -76005 -119391 -98848 27781
2819 27781 81480 17601 -78166 -60286 21855 3471 -54807 -60780 -153916 -134517 -76422 -106389
2807 -106389 -78743 -84546 -55599 -3468 -14360 -33142 -33554 -14819 -75144 -58372 -2144 40322
2795 40322 -29492 -29335 74839 89272 -636 -41107 -62716 -22534 17328 88174 67356 85965
2783 85965 8296 -41905 42457 81853 65101 94458 57725 -1393 -114451 -23081 101977
2772 101977 45361 92960 62267 23306 126815 110704 65487 32958 -30528 -80874 -43045
2761 -43045 -23883 -9385 21074 -37993 -77470 -78406 -65617 56085 83061 28480 40671 87547
2749 87547 35777 -7126 12731 -24509 -10348 -4749 -1612 62110 78526 55369 92087 117282
2737 117282 76209 54953 64085 117485 156228 207773 182142 138820 81784 71163 -36168 -113615
2725 -113615 -162862 -174212 -152158 -103719 -106953 -64911 -15286 88056 73671 20859 11549 -43665
2713 -43665 51706 80771 109173 144861 96037 12611 -50917 -107837 -75865 -18234 -4209 -36578
2701 -36578 3885 26412 -23159 -46894 -24353 6477 94508 147929 34819 -49854 -3562 34841
2689 34841 41378 65744 37133 43284 32228 41086 11399 32384 102918 135814 -6941 -111475
2677 -111475 -4747 46912 21817 -34888 -76558 -70460 -52434 -119126 -51865 -10839 15771 63235
2665 63235 11150 -52242 3676 49923 69066 132463 152346 86893 77564 15742 30040 35791
2653 35791 50718 93045 110772 37060 -28837 -56955 -66423 -132411 -75082 16037 53050 18150
2641 18150 25439 81615 61193 7143 43602 28078 6965 40120 117981 114130 -3870 -24326
2629 -24326 5356 -5235 -7980 7278 -47928 -70599 -75732 -53656 -39221 -10157 8078 46630
2617 46630 8480 -73818 -159788 -154361 -114049 -123260 -87715 -92436 -35860 7442 -25441 -75734
2605 -75734 -127069 -179471 -224260 -123058 -46593 -106239 -121875 -42491 -50298 -36738 -49057 -58022
2593 -58022 -62108 18112 93661 31677 47037 58000 26924 39895 -43313 -92705 -96868 -116529
2581 -116529 -3770 60316 154195 124770 78905 96547 82233 49476 46740 93281 82075 84888
2569 84888 26190 31412 85949 135525 123806 33592 1208 45679 45276 -81805 -106096 -62126
2557 -62126 -14500 -11411 -79052 -147160 -148933 -120316 -67210 25590 20938 27717 97713 55202 23055
2544 23055 -16216 -1133 -15294 56223 85496 17092 27951 124227 124069 93838 3633 -5225
2532 -5225 29009 -64918 -35603 -29412 -46931 -113838 -158253 -196969 -87815 -14375 -6961 10370
2520 10370 -3497 -86445 -126190 -35169 46037 105346 77667 50926 12059 -20998 -19807 -114393
2508 -114393 -121858 -47197 74178 120441 4118 -42130 -49770 -50803 -95240 -100510 -96616 -100101
2496 -100101 -169019 -134111 -89416 -133270 -267450 -273894 -193091 -76487 -46149 8979 5589 -27606
2484 -27606 -56231 -139776 -148222 -143692 -185480 -116782 -47093 28762 49526 7173 403 40867
2472 40867 71012 -69019 -81784 23850 84740 123075 140534 114513 136800 126107 125942 119289
2460 119289 106834 78522 64369 61181 9123 72254 48004 14063 -26734 -81673 -87675 -97876
2448 -97876 -116658 -79133 14634 -15710 -3130 -22686 -15101 -70383 -128493 -157022 -159166 -116611
2436 -116611 -143293 -138625 -90399 28110 53870 76127 34152 -75078 -99325 -86997 9534
2425 9534 72200 -25192 -116016 -138938 -81247 -55009 56876 46141 3480 -30806 -24366 -1736
2413 -1736 24055 76136 136555 50348 -11057 -8591 27330 69520 56706 42894 90161 86336
2401 86336 57222 3356 -7452 1090 56873 101482 26988 21271 -4973 -32602 -42517 2642
2389 2642 44344 105614 93078 114798 90610 63697 75268 144019 19738 -74213 -39575 -28076
2377 -28076 -39775 -73108 -61907 -27072 -61149 21220 33140 53629 102329 10829 -51090 -96746
2365 -96746 -37099 96523 68498 32586 -10445 -11672 5990 -5798 -115656 -147281 -131272 -91031
2353 -91031 -39271 -39726 -10437 9607 95901 221683 239828 109872 62451 41954 -118971 -99879
2341 -99879 -76565 -29840 22551 -2647 9348 13238 -36948 -99964 -109991 -101895 -36886 -17386
2329 -17386 -46266 -53224 -38510 -17860 -11531 -12004 50837 46567 29965 -40055 -43503 -82887 -50930
2316 -50930 -12461 -68319 -33095 -10913 13237 70002 -13447 -89708 -142253 -158528 -182703 -154349
2304 -154349 -69692 -48500 -58919 -47118 -105544 -163740 -80599 11794 23203 -4178 10601 15973
2292 15973 70600 68551 26756 -14970 -98799 -83912 -56214 -53516 -56788 -51193 -39085 -39723 -27927
2279 -27927 9072 -68159 -68311 -125208 -131369 -68867 -54622 -28794 -83203 -118171 -84969 7061
2267 7061 -24356 -80545 -125268 -94152 -56237 -19562 21490 -52475 -65099 -17798 -30907 -15213
2255 -15213 38785 2072 93393 161220 16314 -28806 -48481 -51531 -73381 -88497 -33535 37908
2243 37908 -13409 -67707 -10952 59354 89145 85860 90391 66053 49757 76425 99275 27356
2231 27356 53173 67129 -25595 -11662 -27961 -63814 28614 -10696 24260 81169 131908 115741
2219 115741 -3618 -119934 -69976 3163 2561 27355 107939 84913 29698 36068 33 16503
2207 16503 60222 -38162 -51930 -52336 -40357 39998 23247 -92307 -140572 -205763 -96859 -90312
2195 -90312 -127726 -140371 -80739 -28441 27426 24452 -13646 -58093 -29307 1251 -53588 -95924
2183 -95924 -126147 -104529 -80809 -94068 -63934 33152 40877 47016 40559 4382 -15773 6365
2171 6365 66377 682 -14638 -25954 -79654 -82076 19676 130786 35704 -26246 20837 40421
2159 40421 -47307 -54478 -160724 -160185 -87214 -60598 -134642 -183045 -176494 -73270 -71150 -128643
2147 -128643 -142478 -139755 -83027 -34904 -60578 -95587 -35908 54976 94059 78210 42030 -24548
2135 -24548 45463 110433 11642 -95715 -139175 -84074 -66698 -18487 -22444 -10996 49077 69190
2123 69190 23158 143248 161504 84237 42552 46707 72196 -44049 -109158 -104087 -34249 -24668
2111 -24668 -112642 -69881 -28056 -1088 23549 6118 -32044 -14103 17334 -25623 -40835 59129
2099 59129 47598 17104 -11382 -12288 -15466 16791 28108 21161 9413 65116 24584 -49287 -103511
2086 -103511 -53474 46368 105727 96441 82587 92340 145140 78848 8681 -64393 -95618 2584
2074 2584 41662 -27931 -22346 -8203 38590 75614 -32897 -109241 -125956 -57623 65999 90774
2062 90774 50616 12115 -77940 -172779 -82315 -88880 -106685 5559 35857 -622 -7533 -122249
2050 -122249 -164860 -89759 -37697 16280 694 -11111 6317 58241 69783 4489 37576 -17495
2038 -17495 10122 64004 93763 117371 -35572 -126198 -28137 -1509 -12666 24064 19178 -14641
2026 -14641 16132 -128157 -237238 -190934 -106586 -43576 -120980 -99356 -43442 64703 74405
2015 74405 56353 15239 69871 97203 72406 85224 104332 113624 113121 134207 76018 -6124
2003 -6124 -45439 -50960 -33432 -62058 -68785 -21787 43447 96877 53548 62143 43526 69254 104245
1990 104245 67573 33855 65095 60979 -34933 -40731 -34750 -13465 -20561 -17179 -26712 55145 94134
1977 94134 122971 28909 -64720 945 126746 229201 160307 84563 130542 147106 26667
1966 26667 -17071 13953 65719 74691 31215 28720 -43951 -28093 14862 -78958 -92248 -46039
1954 -46039 -44551 -32654 -70269 -94893 -56092 -77100 20568 52497 35356 37744 -7708 39680
1942 39680 51989 47213 87057 92118 158562 188348 127837 114533 112152 129133 197178 171554
1930 171554 91535 45585 -34466 -48281 1133 -43005 -72515 -41856 803 71186 83290 31602
1918 31602 -39066 -12520 50629 791 56250 87422 76135 16226 -3738 -20823 -12358 41821
1906 41821 58247 12223 44792 81378 103889 133970 123243 68308 12540 -10615 -53918 -45895
1894 -45895 -45977 -55074 -53147 -31855 21435 12391 25898 -1774 56508 6478 -69469 -146410 -105655
1881 -105655 -80858 -125828 -78221 -38955 25 85447 150061 54344 -21446 -65663 -68628 53781
1869 53781 74278 58137 60133 -16255 -50469 -66856 -78982 -73790 -15461 -8646 -105474 -71172
1857 -71172 21961 -3400 -30686 -42953 -72797 -57915 38456 72896 36584 -68383 -120843 -29511
1845 -29511 4631 -22871 -48568 -43864 -31579 16665 77643 52431 33344 11023 12936 45382
1833 45382 -21818 -136505 -158050 -118998 -26253 49058 10753 18786 24245 62638 65346 88439
1821 88439 86357 98026 16427 25165 8567 -55154 -47531 -80877 -1839 24916 -66086 -96951
1809 -96951 -37768 86368 120845 163695 145528 111712 21610 -31650 -10294 -58268 -120095 -135956
1797 -135956 -62286 23393 10942 63594 138182 90808 -12104 -9771 -51074 -39572 82710
1786 82710 42967 -20963 -42181 -3779 40887 695 -43474 13179 46225 -58684 -110018 -48731
1774 -48731 -31850 -20185 -66457 -13910 86538 132601 95582 -10577 8442 -44789 -104216
1763 -104216 -102620 -88664 -74153 -57846 -57272 -72955 -100662 -57179 -99763 -89095 -90349 -81928 1163
1750 1163 89187 104632 50450 15258 44197 89288 63179 31849 68312 173729 169363 67242
1738 67242 71063 160988 138684 38077 -50437 17558 26091 15824 35549 -66722 -79206 -87151
1726 -87151 -112521 -3975 139290 120475 24103 24494 52838 -16683 -47449 1092 -77741 -123480
1714 -123480 -75344 -89174 -45320 -5901 -18224 -56793 -41394 22758 8044 485 -46414 665
1702 665 3092 16742 -26056 21278 80772 -2834 -39867 30845 8144 5051 -41978 -41029 70321
1689 70321 87710 52214 37767 -20704 -49919 -22632 -64261 -79084 -1761 17002 -73729 -54472
1677 -54472 -100124 -74948 -72769 -90308 -112950 -201455 -199254 -265625 -215744 -163634 -60598 -70723
1665 -70723 -115820 -46761 47074 39080 -39778 -71152 -30155 53441 117622 4277 35569 85250
1653 85250 70581 -21162 -24562 -68606 -25934 -50941 -51236 -20565 -11194 -71434 -77994 -110741 -104729
1640 -104729 -45044 -18916 44801 35769 -12851 -57462 -40602 -25288 -8420 -134929 -201241 -199158
1628 -199158 -144007 -170058 -216317 -90628 10126 6856 10170 -6282 -50643 -73877 -68116 -39870
1616 -39870 -73633 -189720 -183370 -147961 -106529 -63716 -64114 -34475 15554 27890 35044 -11986
1604 -11986 -19991 46526 16220 13647 -43562 -79517 -70184 -43144 -73441 -75087 -56893 4194 -23571
1591 -23571 -12617 -66070 -52661 -41840 19126 -689 -31264 38529 75047 29242 29006 26978
1579 26978 27386 -14599 -108074 -157456 -80953 -3704 34680 34872 84047 62272 61909 4204 -40491
1566 -40491 -96237 -92403 12561 130363 65388 35468 69454 92036 52544 32812 34415 89557
1554 89557 193963 183374 138875 122106 70755 5265 39666 63885 75523 80058 152461 82277
1542 82277 -4250 -105631 -124320 -103513 -114231 -33315 -138724 -248808 -216342 -57763 62058
1531 62058 95204 -18046 -36490 -25206 -82205 -62848 -69397 16412 70868 77739 63116 31014
1519 31014 -12034 -7254 -7890 16701 67572 136001 170139 148310 64496 -21021 -43931 -2626
1507 -2626 -32539 -60640 -30417 -796 -13404 44073 40278 -57835 -76404 -18280 57956 46969
1495 46969 59125 54533 6877 8195 23570 -48022 -59515 -111240 -120918 -28083 -32427 -50792 -39858
1482 -39858 -128789 -100309 -54948 3938 -27325 -93480 -67631 -20028 76837 60992 32429 -24032
1470 -24032 -76306 -58452 18359 -32130 -36672 17436 30067 43709 -7052 -48973 59508 114037
1458 114037 65021 32602 19004 54033 16692 51304 10263 -60775 -134584 -119183 3029
1447 3029 74912 66038 -11792 -90192 -63834 36149 124704 128567 56350 -30638 -102666 -16996
1435 -16996 2805 -73871 -107079 -68168 -19690 23351 43070 17766 -46547 -53910 -110072 -114566
1423 -114566 -61116 7889 37524 -32500 -28568 -16713 65475 61338 -53264 17414 45543 40927
1411 40927 85081 124695 50454 -26474 281 79501 57269 -33330 -59023 -7319 8753 -51041
1399 -51041 -104380 -127419 -136165 -112696 -51944 -63494 -128959 -48637 -54637 -39206 -51622 -80921
1387 -80921 -143501 -158533 -158631 -162675 -77725 -121397 -128532 -125217 -132629 -201448 -197076 -52216 3579
1374 3579 -81582 -133315 -70180 35926 1220 -21827 -13617 -49568 10025 30663 84485 88575
1362 88575 80089 41769 -8719 -41172 -69223 -127916 -103189 -63123 -54359 43777 17120 -39647
1350 -39647 -38414 -7351 14570 35051 17726 -19269 -29535 -13849 69769 85258 48598 10867
1338 10867 1203 6951 -33689 6437 44976 54634 102750 103508 47166 -44741 -30606 -12748 -12753 -90713
1324 -90713 -104788 -54935 -86396 -50998 -103579 -158217 -103104 -86655 -90384 -76382 -86829 -71989
1312 -71989 -51179 -82219 -30141 28405 107129 25313 -98923 -123588 -44395 30453 41996 80777
1300 80777 45765 98021 155595 125221 112300 25066 -23178 58826 86639 40477 11677 36863
1288 36863 78595 15549 -15629 -23735 -71877 -12988 -37391 -32933 -149226 -122767 -61692 -83314
1276 -83314 -61337 -44449 -62210 -96445 -7402 26723 -88928 -140818 -75249 40991 51857
1265 51857 1117 -8463 76830 90682 15707 -58403 -20184 -71882 -13017 18065 24634 30196
1253 30196 50338 130486 120216 94089 124264 104430 55924 54321 44298 31521 78402 78718
1241 78718 63302 38527 19349 2332 -17199 -39221 -75150 -93563 -99509 -72570 -76159 -63584
1229 -63584 12705 14220 -11191 -79676 -103634 -54457 -114398 -184372 -124810 966 67563 35793
1217 35793 -51994 -91010 -34001 -2115 12900 -19462 -88350 -79637 9842 46023 114804 55858
1205 55858 -13410 16689 27194 61834 93865 42700 54849 76726 55151 103056 115972 60059
1193 60059 -58824 -64073 -35192 -49388 66998 159907 63968 -80633 -169380 -102462 -52986
1182 -52986 -37099 46389 3798 -125492 -126732 -16208 15705 60713 95359 108313 12666 -115715
1170 -115715 -49579 59481 77588 55272 133664 145072 45649 -4037 71780 124364 93290
1159 93290 47077 18193 15964 65886 71714 46334 59893 42077 104273 124449 70819 -18848
1147 -18848 -52203 -44378 4296 -8163 -22147 -74361 -25736 40339 64323 5617 -23318 -46944
1135 -46944 38465 101146 33711 -39462 23413 135506 136131 104713 84179 138009 124614 96095
1123 96095 130160 70038 141814 122319 18245 -69560 -32636 57053 21241 -64415 -100112 -63072
1111 -63072 -37715 -126363 -164492 -124496 -109627 -100272 -73230 -33832 -11845 1975 48737 137082
1099 137082 149872 109286 123993 131961 77572 67562 76200 102779 158315 80887 28993 -25420
1087 -25420 -109596 -98745 48978 58482 -7427 -58294 -47588 -7513 -51264 -20245 -43291 -48527
1075 -48527 -65970 -66876 -62425 11057 74804 34289 -18479 -94414 -108770 -69775 50748 48128
1063 48128 57061 13672 -23539 80995 84380 66979 42928 7352 -83903 -55284 -39880 -109951
1051 -109951 -94020 -22592 -21672 -100021 -168755 -163588 -150509 -114791 -43682 -41538 -38442 42323 110525
1038 110525 127065 -19531 -54362 -50263 -58719 50264 169012 169294 165416 53061 -20574 -17921
1026 -17921 -59656 -106195 12524 64419 -67549 -85626 -91158 -60295 -40002 -48546 -38042 -27103
1014 -27103 11647 59654 -80647 -157775 -113537 -25031 -36262 -15849 34588 51766 57346 72767
1002 72767 99459 126525 151642 188116 142737 98810 -42782 -105880 -118380 -72777 -69859 -106414
990 -106414 -177867 -195281 -179775 -157890 -121801 -63553 -63470 -5690 22605 83530 63720 13046
978 13046 18334 81921 157826 151308 -1243 -78796 -104820 -23937 -37322 -37814 -6947 8108 -31170
965 -31170 -89864 -86690 -55938 18221 112220 59840 21287 21845 -25849 -72855 18319 79255 -9884
952 -9884 -42722 12031 -1509 -64802 -85327 -26995 23212 98364 128027 115033 63524 9324
940 9324 -56111 -55811 -110275 -179998 -80733 31050 46542 22400 31245 19570 -42772 -50161 -77797
927 -77797 -58367 -51904 59080 71132 133378 165086 176970 152036 58880 36896 -12147 18960
915 18960 78510 92360 127907 126872 111210 8010 23628 58008 72236 6665 48403 91966
903 91966 30153 -38455 6012 42468 63374 102203 117606 58702 55057 63964 17188 -35253
891 -35253 -95484 -27820 -2366 -89380 -159806 -95439 -64371 -4421 26030 -4823 -34668 -115030
879 -115030 -173476 -70301 36999 46635 50156 75435 47356 84644 151200 149904 73931 7679
867 7679 5200 -12673 -31295 -86295 -68170 -14500 -33886 -25385 -9106 -41579 -65084 -51155 29239
854 29239 -62424 -142634 -139431 -145209 -97459 -39655 -77458 -52367 -20445 -78666 -65216 -59138 -39540
841 -39540 -32498 -53858 -7715 89695 113899 93916 430 -53190 -145133 -147671 -142644 -46169 66985
828 66985 92886 115780 61858 45981 71826 46684 29663 -25100 19456 96812 210638 143087
816 143087 76711 56363 93327 122764 74075 13991 -72654 -147070 -160938 -57345 36155 81939
804 81939 103272 60876 -23318 -109155 -138590 -56540 -114227 -100803 -50959 73845 108668 47435
792 47435 -46034 -28316 60949 51795 31895 3402 -42456 24096 19227 -28314 -13760 -17794 -44459
779 -44459 11084 55643 -58857 -55209 55719 2929 -68614 -31471 -61639 -50196 9684 80326
767 80326 58369 70973 112372 67871 -13021 -33295 2063 24930 82051 123467 48389 49134
755 49134 36805 109795 125570 103288 -39419 -125986 -109443 -182808 -224673 -204678 -78599 32679
743 32679 56376 -23321 -117798 -66573 -68615 -22062 27721 77323 78320 19266 64505 153003 176389
730 176389 201868 129855 54083 42628 91511 46136 -13136 35955 6650 -39525 15027 -39226
718 -39226 -8019 -13199 -4003 61325 137568 111423 35949 45462 69420 113158 104867 81694 151670
705 151670 149696 176116 224020 179094 73335 82114 167579 226838 185328 137167 119798 78397
693 78397 106336 162362 110513 34518 -70821 -92198 -45988 -88363 -197575 -130568 8415
682 8415 -38536 -55250 7550 -15396 -7565 51431 20297 -20837 -19272 25459 -10450 -58420 -101295
669 -101295 -44605 34960 28913 57172 69716 31470 -34875 -23456 -50397 -22198 -51786 -88590
657 -88590 -146582 -76724 11733 100694 121066 131560 125428 145647 123777 59324 71334 77006
645 77006 32424 13523 -330 -17077 -82975 -125054 -100753 -48650 -20121 17166 27156 15541
633 15541 73640 72958 -5223 -23372 73505 78288 69186 175188 167251 67581 51551 98232 8236
620 8236 -46062 -10467 -62455 -28565 5897 22081 -49760 -16037 26790 16433 -1068 -35734
608 -35734 -70514 -84916 6535 39886 30580 -73881 -107999 -35715 64788 71989 112354 107016
596 107016 13827 -5376 26078 23212 34210 83392 110536 89480 9690 -109518 -163241 -126390
584 -126390 -8057 53769 -25319 9253 -28472 30160 90040 58378 48589 -2595 -98538 -130722
572 -130722 -109092 -151224 -102584 -48181 -49508 -44926 -26929 -31378 -51346 -10170 37174 88258
560 88258 25744 35082 -6553 33032 6366 -4278 -25476 -96445 -109410 -53717 17396 -35463
548 -35463 30271 129605 176500 182732 70470 50961 88345 109823 153202 37774 17750 9601
536 9601 86846 102119 66042 60911 27369 -3715 -12196 -51356 -8940 -2871 15471 -2038 -24131
523 -24131 -6109 -17089 30847 35239 -20055 -33512 -21655 -859 -12601 -9499 22727 20332 -39760
510 -39760 -36771 -45116 -8543 51047 117267 126959 115611 80151 -7369 -49675 16590 130799
498 130799 113583 52094 99258 155358 93480 48530 32459 34968 299 -28193 -11734 65220
486 65220 21558 62204 108162 55003 -5810 -66551 -48944 -12800 40194 79921 18292 30572
474 30572 29464 41485 93676 137080 142800 104035 75228 23068 7209 73432 141187 103854
462 103854 3632 -27163 -54205 38858 149460 157162 136405 178035 205024 234053 148070 36244
450 36244 -3802 -34795 -2375 56042 60259 86822 78687 1343 -26337 32178 68325 74873 40623
437 40623 -5357 -48535 -84291 -136215 -140953 -144571 -96864 -108248 -73833 -78099 -114438 -54258 55312
424 55312 64552 65493 18086 -5930 61973 57654 39561 63037 22262 19270 70178 63780 59039
411 59039 25790 32705 48827 25396 58431 28253 -22823 22857 95823 143359 194055 201107
399 201107 38043 -78141 -53923 27557 7075 -6493 -34891 41573 56163 -26797 44295
388 44295 20498 -1531 37896 -35036 -108593 -54424 99639 142083 122202 105362 39230 14146
376 14146 89697 109667 37037 70092 50214 75159 143503 59314 -27902 -96662 -37149 1118
364 1118 -5997 46098 50453 35315 37213 27780 10112 -23375 -23411 50066 57638 59085 44566 -2661
350 -2661 -8022 70898 133823 36580 -66588 14242 33439 76579 194767 122991 114061 73137
338 73137 19364 2172 23798 44977 -58090 -42324 -38770 -78499 -7682 57781 120543 108746
326 108746 7836 15093 22926 63445 56568 41449 34383 11920 32735 -10094 -28802 -19965 -30645
313 -30645 -82879 2471 28457 69252 69204 110309 63895 53782 51703 37627 126599 110414 64605
300 64605 114390 39178 -21340 -14963 -42341 -33545 66743 44866 -3112 -47476 -38249 -13412
288 -13412 20637 119828 141440 -18227 -86115 -120726 32506 60969 22452 41188 2084 -57104
276 -57104 -119564 -95354 39578 78377 -18345 -69264 -55459 -29872 14737 -16109 22027 16277
264 16277 6945 11787 26962 71580 107961 98058 140079 158973 86874 81638 80035 25639 -27303
251 -27303 -76212 -27014 74976 63538 55703 63394 16008 -32005 -44765 -21459 -16806 14054
239 14054 25947 40033 100336 41132 -29607 -36161 -23146 28487 59010 116726 135148 65456
227 65456 45743 52965 43284 -46268 -68907 -56586 9057 37021 399 -32669 -32262 -39722 -25383
214 -25383 -3707 -21345 10907 51186 83427 65069 31496 10979 -33076 -34711 10156 25914
202 25914 31045 33142 52478 72434 76636 42493 85878 138631 65891 85396 110782 118263 140044
189 140044 58706 41318 52844 58963 49747 72042 16369 -13625 -44293 -35574 -60325 -68419 -66868
176 -66868 -74282 2446 55227 -7480 -60804 -87365 -104744 -119564 -27497 29822 40606 106602
164 106602 105699 107652 93311 51108 40561 56002 61035 44699 63739 77405 93348 93211 74544
151 74544 69145 92089 156319 143919 101368 53149 54888 96254 45041 57169 126393 115968
139 115968 52379 -22830 6502 80308 117971 44929 60620 102368 104995 23952 -26388 -88220
127 -88220 -79377 -15228 5107 -13452 75825 52551 -37770 -46778 -11567 -31941 -9069 98972
115 98972 47029 -44456 -40460 -37489 -14823 -40921 -55892 -35471 23658 20992 34133 68984 101886
102 101886 86044 57272 57375 66463 86671 69996 26246 -6015 59029 118871 151383 102897
90 102897 61816 61905 54931 87894 105691 62161 73028 123161 171155 125407 71146 53175 40733
77 40733 -31852 -98427 -70065 14580 90390 165477 113011 33330 36001 39702 11527 32142 87535
64 87535 48755 58220 7313 -12974 5099 50350 85134 7982 -23194 70070 77397 24732 1796
51 1796 7305 9276 -13239 -58657 -83539 -98952 -92426 -57512 -34096 -36980 -47603 -39996 -37077 27899
37 27899 51614 41224 8976 4233 5422 -37546 -19710 28378 66630 86964 61328 49894 101804
24 101804 116436 72396 40104 23083 23169 59295 125025 171837 158145 177446 122680 73819 35977
11 35977 -464 20223 30504 92638 57379 21428 17840 -19526 -70080 -60789 8035
0 8035
$$ Imaginary data points
##PAGE= N=2
##DATA TABLE= (X++(I..I)), XYDATA
32767 86470 102890 126679 149174 136508 104632 165871 190037 124925 -19772 -33545 -11015
32756 -11015 -32979 33778 42712 17750 -11045 -28559 13862 52048 105158 149853 176146 187510
32744 187510 142939 143784 127267 144586 133003 91418 77279 97539 157772 165162 119893 139435
32732 139435 150893 114694 85999 112242 100703 37355 8335 57399 39434 86744 158798
32721 158798 126059 95453 133454 185817 230347 186020 210048 219035 209806 131464 168294 192995
32709 192995 193835 192401 192200 131164 140465 99362 46560 84754 121426 130397 137607 152610 145989
32696 145989 150102 120117 123557 116558 86498 41011 52392 152984 230080 241691 173316 178706
32684 178706 184742 178834 159789 152114 140370 182647 227134 235228 221478 249045 259836 197440
32672 197440 241841 285353 246149 220674 247604 275459 238434 212658 232977 230012 268548 245984
32660 245984 243147 271542 280806 272623 242703 207068 233348 257565 333250 358737 297455 289628
32648 289628 290137 176968 144782 157420 197052 298625 357191 372686 339597 302835 213938
32637 213938 208308 238275 238833 296421 275135 270355 305376 301496 274804 240560 222978 277020
32625 277020 257259 196033 189678 230525 235310 267645 364906 316484 314132 333064 319044 283100
32613 283100 322637 304630 317382 400521 454007 376571 323180 315956 294725 322193 363150 355205
32601 355205 310800 284372 308077 306320 330410 305903 283638 303704 414263 468952 465929 385884
32589 385884 369393 394787 435430 395089 399035 280580 256567 353243 430583 387606 340922
32578 340922 318963 352063 385806 344125 320026 286001 251838 305655 311506 325683 314502 254935
32566 254935 242962 357970 369533 390675 375375 302909 216211 179500 198742 249821 351267
32555 351267 358820 331642 337684 341184 364246 414191 391286 388362 467367 508979 482714 361943
32543 361943 277640 221932 227220 244662 280671 308690 347844 339863 336729 386962 409322 446339
32531 446339 449810 431699 377086 361396 428617 450208 409950 378047 376621 427546 438143 418242
32519 418242 423654 324872 252420 277004 319587 343466 395713 450284 421970 374846 325100 353953
32507 353953 448814 466604 379920 346584 359822 358644 369528 456022 488501 424697 367012 348458
32495 348458 317805 373316 428687 463149 473569 470723 486363 506697 436121 389752 362402 337829
32483 337829 404319 409877 480569 486016 430166 418944 483484 524399 479298 470723 477209 408956
32471 408956 437550 434489 443854 432583 470003 471174 507838 517217 528662 518722 522019 431667 389994
32458 389994 437917 416003 413958 403406 401530 435664 412939 358257 336868 353670 365807 448195
32446 448195 450337 457143 439222 443590 443439 357523 347686 374460 433561 441675 502189 574796 520594
32433 520594 427255 460258 470221 500182 505914 544077 547701 531338 509715 513773 545891 523431
32421 523431 405322 398175 374894 370588 386428 371673 424988 380345 369906 425130 359020 408028
32409 408028 430921 508924 528510 521533 539296 484198 446869 471900 507556 570145 574106 552839
32397 552839 542817 505553 448555 432736 445236 479636 530180 550308 624178 657925 600422
32386 600422 580179 493305 505911 528751 490461 458652 448484 477544 559498 553175 495911 447777
32374 447777 389679 400503 419976 448169 499441 481711 478483 471938 478147 500541 540242 487782
32362 487782 472207 448367 446886 437720 510341 632345 580517 531775 495815 518743 599273 566895
32350 566895 526260 497171 500703 582148 638856 530322 450470 479815 464828 419153 420072 436529
32338 436529 459002 461014 503213 627027 632375 591030 593571 579434 556849 628589 604670 528851
32326 528851 491589 467544 451476 439234 453148 472330 479108 497949 548064 594409 549420 519736
32314 519736 481468 500154 506479 517944 480035 490611 522151 546537 606367 579484 496340 382660
32302 382660 396327 484032 505105 499838 532558 547512 560638 562045 560707 651388 672191 608965
32290 608965 525583 529442 535947 502936 562276 564993 579150 563778 552905 547775 559181 528277
32278 528277 524034 464939 332221 368500 446867 530019 558954 504929 544119 534816 499621 503931
32266 503931 530200 521304 455735 438526 398276 393470 505302 519804 513613 513604 529699 604052 591973
32253 591973 538795 511880 527375 488735 516737 556432 610596 518355 419606 453496 537286
32242 537286 540946 537898 552713 510094 532069 544441 495001 484434 520946 504617 516079 526465
32230 526465 532582 540976 511601 480498 531921 560044 560737 522185 469005 419232 436578 442122
32218 442122 447757 466473 497924 580971 565959 491927 380695 377363 428361 504768 536000 534577
32206 534577 460026 433758 423253 429755 544479 686248 710392 664044 589617 550298 497864
32195 497864 507230 490674 513209 498714 435533 397204 406633 464227 563678 649120 595350 590412
32183 590412 574999 530542 443357 424435 474109 567652 574684 605576 649921 553252 486768 519035
32171 519035 455050 454646 510532 421358 442073 488851 597910 667883 656431 658175 650343 607376
32159 607376 560371 595222 587093 470100 507707 605735 609958 576973 600544 610602 559709 541991
32147 541991 553538 570418 623312 630053 532578 439536 381758 454659 552284 554569 497740 514949
32135 514949 521742 516088 522063 512633 541358 598304 629255 624662 577017 591214 659583 624863
32123 624863 561398 590666 622485 597027 537600 445425 428224 460775 507644 489434 481218 488531
32111 488531 510521 564821 546514 552032 605211 592853 690954 739533 644422 556508 514056 526531
32099 526531 497628 539594 591760 588573 648829 638785 568099 534430 456142 437484 507831 616668
32087 616668 608983 534468 503568 481442 532366 549968 575449 638646 634582 524180 618263 704219
32075 704219 710533 723857 614180 559372 606056 569888 517839 534490 553293 579008 602322
32064 602322 630253 677102 611538 551720 469393 501994 591678 654109 631117 569151 668060
32053 668060 700535 749307 709621 646484 603600 554859 565546 520430 445265 405036 441796
32042 441796 488552 524749 467991 482077 543000 552815 508671 503879 546289 618901 630122 630472
32030 630472 670892 615680 550348 458366 452365 485139 474717 485697 515525 505856 501426 494886
32018 494886 452018 437840 486778 474333 429900 474864 505048 566493 627150 598313 581328
32007 581328 566489 568593 559602 548281 512974 589276 672016 654216 660630 634284 575198 626251
31995 626251 629366 617926 609143 495180 438226 453646 483223 518643 536462 598388 637292 610414
31983 610414 590424 608456 618211 496699 496828 459746 454105 518904 486213 470677 521340 555079
31971 555079 589032 581774 570963 501487 506817 574195 625285 611642 643390 737752 698957 626316
31959 626316 650980 702119 747966 748154 712689 664546 663472 650224 604834 608432 718338 666375
31947 666375 573723 583829 593068 558075 563936 675367 685281 643257 579459 487284 475375 550501
31935 550501 559699 506263 467407 432331 394334 381265 467253 410457 407323 476921 547852 618123
31923 618123 631031 520857 418966 430356 533492 500793 518886 567060 624666 608691 578349
31912 578349 521480 523785 538200 548027 538926 493431 419807 464439 607304 683764 672340 589243
31900 589243 582158 622640 679736 639792 580075 566173 580624 528938 500752 435814 478926 514871
31888 514871 524405 708601 751517 666645 640365 615349 586332 519678 501228 537412 636439
31877 636439 624941 490876 489374 509982 535047 561438 603103 585350 540010 498211 470659
31866 470659 454005 447264 471332 467827 501402 470157 458256 520385 569914 545154 581776 661594
31854 661594 614789 600528 576421 557047 472467 336448 401037 443466 452398 483163 539239
31843 539239 533714 500837 544767 609046 565132 526031 579766 529635 550917 614318 728579
31832 728579 726474 757411 670947 611360 647192 650167 629166 611764 583934 556754 550151 581956
31820 581956 578447 576464 513036 493989 508073 465294 389031 421949 458285 511975 491872 419319
31808 419319 366939 376367 444579 496902 571615 632465 680987 687871 634418 522817 401103
31797 401103 330537 272484 332575 460218 493891 535695 508854 486643 525162 555050 539962
31786 539962 547273 526297 525848 543378 520669 614561 644710 632262 611235 609680 662667 651972
31774 651972 617456 673439 687786 614765 519263 529245 489946 448737 508078 504586 461065 409862
31762 409862 406612 432651 524297 459099 494473 602741 640564 603753 609909 636580 601850 581400
31750 581400 584478 632769 567941 578757 598327 559664 570130 582668 615688 629817 578462 627029
31738 627029 686693 696283 657510 523597 592478 631555 597692 595698 653437 697649 689473 694607
31726 694607 744313 702884 721967 701765 636778 677086 669405 602893 547077 576510 502253 466489
31714 466489 467547 575518 678334 701180 684133 655861 661831 610915 563996 508299 522852
31703 522852 594773 702869 661476 593790 518997 507272 511404 545539 549571 592693 627088 508553
31691 508553 481347 541139 546573 565134 565309 543251 478561 434937 437948 488558 419814 421867
31679 421867 413074 402533 421578 447773 512334 474190 430417 472967 529546 499189 482283 491049
31667 491049 597941 686011 686411 574906 527950 572721 656662 720335 658670 569108 544480
31656 544480 540258 511548 512535 476127 443952 488579 555966 526607 501964 545201 616144 697373
31644 697373 794810 737253 683483 531628 508848 521525 532005 531721 583807 650398 613687 566601
31632 566601 528967 554650 575344 661306 707154 655078 583382 605072 638652 699640 633506
31621 633506 625326 567518 544644 576314 539280 551110 613856 692915 686231 613113 614217 526172
31609 526172 541653 544376 519017 512194 542235 525593 590896 683168 718610 620860 543781 512965
31597 512965 486014 506467 523752 558736 525907 497282 451594 485147 545656 541785 479194 534189
31585 534189 563265 503597 538451 543722 597104 575089 582669 604359 606462 573218 486379 431035
31573 431035 450530 421777 453199 528225 612402 626061 618485 591359 573994 594513 582188 565591
31561 565591 654831 649447 630138 604491 565343 562174 589489 764948 799814 786325 730017 669382
31549 669382 611549 539535 516568 548936 564796 577853 525890 526117 494913 476024 479685 516213
31537 516213 496123 539687 543157 587153 586792 556614 550759 565416 551003 504568 549029 574920
31525 574920 592927 549178 505247 440835 469867 377226 468084 575088 637908 655979 555664
31514 555664 502199 527259 599467 579236 520292 436070 432097 489153 510925 431085 456860 513973
31502 513973 509177 516156 451183 470986 554676 574857 619168 650825 622977 646756 595537 448346
31490 448346 358578 397150 462724 567043 638437 701700 704108 586088 546546 515721 555297
31479 555297 651481 658177 580159 521395 392604 388098 447594 438923 460498 431042 461376 454495
31467 454495 429414 405494 447359 434093 413413 430476 496712 556955 641108 558320 454816
31456 454816 396659 364482 396861 462871 479524 556572 617231 664422 621253 580257 595554
31445 595554 633949 494854 471188 484819 468301 447306 494323 509933 517542 469276 507216
31434 507216 555417 582574 595145 550320 532009 527526 589015 617729 565019 551527 521922 486179
31422 486179 496137 590378 569638 578655 513891 472669 429182 467812 472464 422448 524334 606162
31410 606162 535062 480948 494279 515143 546877 454429 440259 445846 447725 470404 473276 536987
31398 536987 597407 572842 546577 538073 573737 586393 569285 574524 581606 595425 630365 651960
31386 651960 660711 675855 642611 714331 717864 657149 631571 611959 613689 613865 581316 521388
31374 521388 526168 555014 553265 483188 489736 527477 482694 500079 632862 678990 608792 529387
31362 529387 543701 683018 715986 627890 609504 570573 612257 562917 492689 518524 467905
31351 467905 484856 512089 514509 451209 447690 467084 566045 619095 570934 573202 601675 531955
31339 531955 518210 511348 494850 528488 584163 614392 609418 612289 674974 784288 832421 793828
31327 793828 727267 757982 761752 683616 643652 659774 688103 615212 616366 638348 641195 618321
31315 618321 667183 638733 526097 486220 540569 561320 580439 594585 663045 670405 647499
31304 647499 594437 561940 543484 562972 660293 604234 543529 547633 450927 402797 454790 585625
31292 585625 650903 548065 559685 579807 640467 658887 555029 531052 539058 584855 560498
31281 560498 569759 588584 580565 581808 550905 481382 433875 463319 479943 512131 490969 473063
31269 473063 505053 558192 583132 620241 612219 593201 518643 498174 492301 593968 507014 536389
31257 536389 557358 611292 601736 516020 515228 589247 666510 601845 563612 534137 501375 549893
31245 549893 523223 514117 524184 575255 649062 667816 703180 741407 797214 798416 726809 711057
31233 711057 689283 573215 563300 570854 510549 338805 279241 449223 547049 570803 583735
31222 583735 552488 534986 533156 477634 539161 482919 503605 542850 534657 483694 468966 496492
31210 496492 587201 541978 423794 415969 427568 418028 474619 558202 611282 658490 655265 554742
31198 554742 484215 558602 684111 694996 639324 608438 629512 690700 722885 625797 597256
31187 597256 553016 529644 614586 633293 614688 645451 667954 636553 639021 695035 600146 516534
31175 516534 553644 560573 616140 607362 614294 644005 695000 684160 671339 609546 582391 537057
31163 537057 551528 613659 601780 607024 610015 574927 564899 535782 544291 640964 661854 704801
31151 704801 657814 563823 555902 571000 576939 530035 586080 659057 640629 606034 606854 685503
31139 685503 711532 664440 595484 609253 592165 610560 610068 577528 623354 605672 531482 519742
31127 519742 562281 562246 573706 574181 571954 581062 595941 642246 597791 584971 546699 595464 524867
31114 524867 496739 511890 486139 550157 593423 614279 633629 634535 707883 729618 618147 567052
31102 567052 621173 647932 670899 645325 609986 554861 521589 544727 624664 630625 543968 427237
31090 427237 383092 435037 538940 699289 708615 639772 697720 664408 598759 599822 601324 630080
31078 630080 633726 573786 541801 517454 560954 618454 554759 469937 549462 636421 656767 669972
31066 669972 614900 500223 434007 477153 569180 588250 549788 487325 490902 484646 529957 599160
31054 599160 600116 498940 523085 519025 523146 460118 458349 571588 580865 563335 525265 557071
31042 557071 588980 520658 415601 356363 431201 522844 619826 663996 674431 639238 539366
31031 539366 531935 546628 549501 610433 713054 646970 568923 534427 510400 563029 514319 465967
31019 465967 433036 420214 499815 598130 585026 654922 688508 696081 652268 623377 609881 620239
31007 620239 526623 444983 437583 420305 528637 608111 650553 723021 756853 732308 739454 756260
30995 756260 687441 539929 589113 660140 602327 528726 478002 461029 467483 411957 375452
30984 375452 405555 336429 323901 447624 565152 590053 591968 601038 582562 563018 625626
30973 625626 633073 604484 650795 730427 693017 665478 599258 582218 583120 546618 576756 600345
30961 600345 594777 574605 624041 642918 669553 660236 678673 600913 515635 573834 584636 626365
30949 626365 576653 538898 557301 542009 523933 480124 501039 572062 548517 592666 724443
30938 724443 731198 635350 481304 526116 591593 599414 531007 536572 579536 647383 642525 634660
30926 634660 683164 677730 635606 577919 604965 642416 672018 684654 638943 612326 593555 645767
30914 645767 696028 678028 620880 651293 652621 652288 586935 507400 482596 550092 614579 593378
30902 593378 593074 573703 596363 616560 558191 530607 561828 590067 609628 580440 554667 543122
$$ [...]
##END NTUPLES=NMR SPECTRUM
##END=
