##TITLE=Analysis number 326311
Compound Code mo 07321
Project Code adrs
Chemist Name aci
##JCAMPDX= 6.0         $$ Bruker NMR JCAMP-DX V2.0
##DATA TYPE= NMR SPECTRUM
##DATA CLASS= NTUPLES
##ORIGIN= Bruker BioSpin GmbH
##OWNER= nmr
$$ XWIN-NMR		Version 3.5
$$ Thu Feb  1 11:20:29 2007 GMT Standard Time (UT+0h)  MAYBRIDGE\nmr@NMR_250MHZ
##.OBSERVE FREQUENCY= 250.131544655141
##.OBSERVE NUCLEUS= ^1H
##.ACQUISITION MODE= SIMULTANEOUS (DQD)
##.ACQUISITION SCHEME= undefined
##.AVERAGES= 16
##.DIGITISER RES= 18
##SPECTROMETER/DATA SYSTEM= dpx250
##.PULSE SEQUENCE= zg30
##.SOLVENT NAME= DMSO
##.SHIFT REFERENCE= (INTERNAL, DMSO, 0, 16.522)
##AUDIT TRAIL= $$ (NUMBER, WHEN, WHO, WHERE, WHAT)
$$ ##TITLE= Audit trail, XWIN-NMR		Version 3.5
$$ ##JCAMPDX= 5.01
$$ ##ORIGIN= Bruker BioSpin GmbH
$$ ##OWNER= nmr
$$ C:\u/data/dgb/nmr/ADRS/70/pdata/1/auditp.txt
$$ ##AUDIT TRAIL=  $$ (NUMBER, WHEN, WHO, WHERE, WHAT)
(   1,<2007-02-01 11:20:07.61 +000>,<MAYBRIDGE\nmr>,<NMR_250MHZ>,
      <created by zg, POWCHK disabled, PULCHK disabled
       configuration hash MD5:
       49 4B E0 1D 92 C2 6B 37 9F E6 65 BC 52 41 86 1D
       data hash MD5: 64K
       F7 76 48 30 8E E3 A9 76 39 BE 42 31 3B 0D 68 0D>)
(   2,<2007-02-01 11:20:22.22 +000>,<MAYBRIDGE\nmr>,<NMR_250MHZ>,
      <Start of raw data processing
       ef LB = 0.3 FT_mod = 6 PKNL = 1 SI = 32K 
       data hash MD5: 32K
       1C EA 8F 0D 79 A8 85 5F 06 78 FB 8B CB 9A 1C F6>)
(   3,<2007-02-01 11:20:23.89 +000>,<MAYBRIDGE\nmr>,<NMR_250MHZ>,
      <apk 
       data hash MD5: 32K
       FC 02 4D C8 69 AB 7D EC 35 85 16 78 B9 02 E4 C4>)
(   4,<2007-02-01 11:20:24.60 +000>,<MAYBRIDGE\nmr>,<NMR_250MHZ>,
      <abs ABSG = 5 
       data hash MD5: 32K
       19 A5 CA 37 F3 B8 EF EF E0 CA 46 71 16 EE 17 78>)
$$ ##END=
$$ 
$$ hash MD5
$$ F2 97 E0 A2 99 32 68 67 3C 1D 0D BA A0 5E FF 60
##$RELAX= 
##$RELAX= 
##$RELAX= 
##$RELAX= 
##$RELAX= 
##$RELAX= 
##$RELAX= 
$$ Bruker specific parameters
$$ --------------------------
##$DU= <C:\u>
##$EXPNO= 70
##$NAME= <ADRS>
##$PROCNO= 1
##$TYPE= <nmr>
##$USER= <dgb>
##$AMP= (0..31)
100 100 100 100 100 100 100 100 100 100 100 100 100 100 100 100 100 100 
100 100 100 100 100 100 100 100 100 100 100 100 100 100 
##$AQSEQ= 0
##$AQ_mod= 3
##$AUNM= <au_zg>
##$AUTOPOS= <49 >
##$BF1= 250.13
##$BF2= 250.13
##$BF3= 250.13
##$BF4= 250.13
##$BF5= 500.13
##$BF6= 500.13
##$BF7= 500.13
##$BF8= 500.13
##$BYTORDA= 1
##$CFDGTYP= 0
##$CFRGTYP= 5
##$CHEMSTR= <none>
##$CNST= (0..31)
1 1 145 1 1 1 1 1 1 1 1 1 1 1 1 1 1 1 1 1 1 1 1 1 1 1 1 1 1 1 1 1 
##$CPDPRG= <>
##$CPDPRG1= <>
##$CPDPRG2= <>
##$CPDPRG3= <>
##$CPDPRG4= <mlev>
##$CPDPRG5= <mlev>
##$CPDPRG6= <mlev>
##$CPDPRG7= <mlev>
##$CPDPRG8= <mlev>
##$CPDPRGB= <>
##$CPDPRGT= <>
##$D= (0..31)
0 1 0 0 0 0 0 0 0 0.06 0 0 0 0 0 0 0.0002 0 0 0 0 0 0 0 0 0 0 0 0 0 0 
0 
##$DATE= 1170328806
##$DBL= (0..7)
120 120 120 120 120 120 120 120 
##$DBP= (0..7)
150 150 150 150 150 150 150 150 
##$DBP07= 0
##$DBPNAM0= <>
##$DBPNAM1= <>
##$DBPNAM2= <>
##$DBPNAM3= <>
$$ [...]
##$SUBNAM7= <"">
##$SUBNAM8= <"">
##$SUBNAM9= <"">
##$SW= 20.6930455092707
##$SWIBOX= (0..15)
0 0 3 0 0 0 0 0 0 0 0 0 0 0 0 0 
##$SW_h= 5175.983436853
##$TD= 65536
##$TD0= 1
##$TE= 294.16
##$TE2= 300
##$TE3= 300
##$TEG= 300
##$TL= (0..7)
0 120 120 120 120 120 120 120 
##$TP= (0..7)
150 150 150 150 150 150 150 150 
##$TP07= 0
##$TPNAME0= <>
##$TPNAME1= <>
##$TPNAME2= <>
##$TPNAME3= <>
##$TPNAME4= <>
##$TPNAME5= <>
##$TPNAME6= <>
##$TPNAME7= <>
##$TPOAL= (0..7)
0.5 0.5 0.5 0.5 0.5 0.5 0.5 0.5 
##$TPOFFS= (0..7)
0 0 0 0 0 0 0 0 
##$TUNHIN= 0
##$TUNHOUT= 0
##$TUNXOUT= 0
##$USERA1= <user>
##$USERA2= <user>
##$USERA3= <user>
##$USERA4= <user>
##$USERA5= <user>
##$V9= 5
##$VALIST= <valist>
##$VCLIST= <CCCCCCCCCCCCCCC>
##$VD= 0
##$VDLIST= <DDDDDDDDDDDDDDD>
##$VPLIST= <PPPPPPPPPPPPPPP>
##$VTLIST= <TTTTTTTTTTTTTTT>
##$WBST= 1024
##$WBSW= 4
##$XGAIN= (0..3)
0 0 0 0 
##$XL= 0
##$YL= 0
##$YMAX_a= 210983
##$YMIN_a= -270924
##$ZGOPTNS= <>
##$ZL1= 120
##$ZL2= 120
##$ZL3= 120
##$ZL4= 120
##$ABSF1= 16.522
##$ABSF2= -4.171173
##$ABSG= 5
##$ABSL= 3
##$ALPHA= 0
##$AQORDER= 0
##$ASSFAC= 0
##$ASSFACI= 0
##$ASSFACX= 0
##$ASSWID= 0
##$AUNMP= <proc_1d>
##$AZFE= 0.1
##$AZFW= 0.1
##$BCFW= 0
##$BC_mod= 0
##$BYTORDP= 0
##$COROFFS= 0
##$CY= 12.5
##$DATMOD= 1
##$DC= 0
##$DFILT= <>
##$DTYPP= 0
##$F1P= 14.0000005364418
##$F2P= -0.99999901652339
##$FCOR= 0.5
##$FTSIZE= 32768
##$FT_mod= 6
##$GAMMA= 0
##$GB= 0
##$INTBC= 1
##$INTSCL= 1
##$ISEN= 128
##$LB= 0.3
##$LEV0= 0
##$LPBIN= 0
##$MAXI= 10000
##$MC2= 0
##$MEAN= 0
##$ME_mod= 0
##$MI= 0
##$NCOEF= 0
##$NC_proc= -4
##$NLEV= 6
##$NOISF1= 0
##$NOISF2= 0
##$NSP= 0
##$NTH_PI= 0
##$NZP= 0
##$OFFSET= 16.522
##$PC= 1
##$PHC0= 215.7836
##$PHC1= 7.374141
##$PH_mod= 1
##$PKNL= yes
##$PPARMOD= 0
##$PSCAL= 4
##$PSIGN= 0
##$REVERSE= no
##$SF= 250.13
##$SI= 32768
##$SIGF1= 0
##$SIGF2= 0
##$SINO= 400
##$SIOLD= 32768
##$SREGLST= <1H.DMSO>
##$SSB= 0
##$STSI= 32768
##$STSR= 0
##$SW_p= 5175.98343685301
##$SYMM= 0
##$S_DEV= 0
##$TDeff= 65536
##$TDoff= 0
##$TI= <Analysis number 999999
Compound Code 99
Book Reference 9
Project Code 9>
##$TILT= no
##$TM1= 0
##$TM2= 0
##$TOPLEV= 0
##$USERP1= <user>
##$USERP2= <user>
##$USERP3= <user>
##$USERP4= <user>
##$USERP5= <user>
##$WDW= 1
##$XDIM= 32768
##$YMAX_p= 406766129
##$YMIN_p= -303568
$$ End of Bruker specific parameters
$$ ---------------------------------
##NTUPLES= NMR SPECTRUM
##VAR_NAME=  FREQUENCY,     SPECTRUM/REAL,   SPECTRUM/IMAG
##SYMBOL=    X,             R,               I
##VAR_TYPE=  INDEPENDENT,   DEPENDENT,       DEPENDENT
##VAR_FORM=  AFFN,          ASDF,            ASDF
##VAR_DIM=   32768,         32768,           32768
##UNITS=     HZ,            ARBITRARY UNITS, ARBITRARY UNITS
##FACTOR=    0.157963299565203, 1,           1
##FIRST=     4132.6476996994, 0,             0
##LAST=      -1043.33573715361, 0,           0
##MIN=       -1043.33573715361, -303568,     0
##MAX=       4132.6476996994, 406766129,     0
$$ Real data points
##PAGE= N=1
##DATA TABLE= (X++(R..R)), XYDATA
$$ [...]
$$ plain form
17612 79456 64220 37772 57459 61011 42687 -39378 -70936 -4128 26677 -23319 -74609 -110009
17600 -110009 -123525 -74092 -16027 28921 70376 35585 30982 63654 31628 -23945 -17442 -66092
17588 -66092 -112604 -90750 -22934 27809 41398 11441 41698 73238 33429 7696 12614 33221
17576 33221 -12843 -50164 -29192 -74065 -55480 -13250 -13876 -15041 -5553 14157 26984 14718
17564 14718 65399 72520 86778 68219 33082 88966 109906 28004 39606 10536 -47767 -69483
17552 -69483 -94028 -115882 -97519 -86320 -123150 -55311 -5690 52601 23589 -53069 -76919 -29466
17540 -29466 1805 6744 23065 12498 47978 20131 4710 -62880 -38009 -28075 -30339 -9879
17528 -9879 22430 -11677 -15933 22470 44398 23487 -49275 -56207 -32506 -54434 -52317 13873
$$ packed form
17612G9456j5236k6448J9687L552j8324q2065l1558O6808L0805m9996n1290l5400
17600a10009j3516M9433N8065M4948M1455l4791m603L2672l2026n5573O503m8650
17588f6092m6512K1854O7816N0743J3589k9957L0257L1540l9809k5733M918K0607
17576C3221m6064l7321K0972m4873J8585M2230o26j165R488J9710J2827j2266
17564A4718N0681P121J4258j8559l5137N5884K0940q1902J1602k9070n8303k1716
17552f9483k4545k1854J8363J1199l6830O7839M9621N8291k9012p6658k3850M7453
17540b9466L1271M939J6321j0567L5480k7847j5421o7590K4871R934k264K0460
17528i879L2309l4107m256L8403K1928k0911p2762o932K3701k1928K117O6190
$$ plain form
17516 13873 28774 64753 22557 -34462 -48312 -34467 -19092 -67070 -84765 -61503 -34093 2819
17504 2819 14838 -3665 48760 112984 100582 -325 -3409 65069 70250 102302 95292 69205
17492 69205 75228 2358 -45508 -34318 -32621 -15006 84050 88832 60018 28053 25436 90049
17480 90049 56284 24521 17814 -8107 -11982 -29651 -2204 17387 -1101 -15856 -36702 -55271
17468 -55271 -44955 -2493 41175 106129 139018 113835 68494 58069 45455 59371 24173 30310
17456 30310 30485 44923 45443 -9317 -32642 -82703 -81313 -46441 -11794 -228 82809 4951 -72870
17443 -72870 -78077 -21759 3230 -39767 -65922 -67958 -36422 -50970 -20289 -53652 -90103 -48614
17431 -48614 -6771 13990 -5650 -1606 -3949 38342 70211 45972 -22842 -65882 -69582 -18166
$$ packed form
17516A3873J4901L5979m2196n7019j3850J3845J5375m7978j7695K3262K7410L6912
17504B819J2019j8503N2425O4224j2402j00907l084O8478N181L2052p010k6087
17492F9205O023p2870m7866J1190J697J7615R9056M782k8814l1965k617O4613
17480I0049l3765l1763o707k5921l875j7669K7447J9591j8488j4755k0846j8569
17468e5271J0316M2462M3668O4954L2889k5183m5341j0425j2614J3916l5198O137
17456C0310J75J4438N20n4760k3325n0061J390L4872L4647J1566Q3037p7858p7821
17443g2870n207N6318K4989m2997k6155k036L1536j4548L0681l3363l6451M1489
17431d8614M1843K0761j9640M044k343M2291L1869k4239o8814m3040l700N1416
$$ plain form
17419 -18166 13784 44670 4128 11774 1698 -27938 -84892 -139936 -67993 -46054 -53741 29764
17407 29764 9636 -25917 -35183 -11052 -12675 14472 53876 -1278 42570 9681 -41364 -16784
17395 -16784 -41145 -39007 -67065 -32572 -2154 -67257 -102663 -89397 4577 41667 129674 78054
17383 78054 956 -7112 9302 29864 53815 67749 72334 47086 72866 63204 36779 53787
17371 53787 -21524 -83061 -78873 -122695 -142514 -98549 -68508 -40756 11301 -6617 37292 37113
17359 37113 150 -2737 36946 29549 -14 -10503 -20865 -31516 -38569 6651 86897 161680
17347 161680 175131 143720 77723 39251 34436 -14132 13874 70129 92997 43154 27162 11242
17335 11242 -30647 -38022 -98103 -131869 -172075 -150768 -72924 -57207 -93986 -154951 -216083 -174128
$$ packed form
17419a8166L1950L0886m0542P646j0076k9636n6954n5044P1943K1939p687Q3505
17407B9764k0128l5553r266K4131j623K7147L9404n5154M3848l2889n1045K4580
17395a6784k4361K138k8058L4493L0418o5103l5406J3266R3974L7090Q8007n1620
17383G8054p7098q068J6414K0562K3951J3934M585k5248K5780r662k6425J7008
17371E3787p5311o1537M188m3822j9819M3965L0041K7752N2057j7918M3909j79
17359C7113l6963k887L9683p397k9563j0489j0362j0651p053M5220Q0246P4783
17347A61680J3451l1411o5997l8472m815m8568K8006N6255K2868m9843j5992j5920
17335A1242m1889p375o0081l3766m0206K1307P7844J5717l6779o0965o1132M1955
$$ plain form
17323 -174128 -56197 5652 -8493 -7857 -50001 -41177 16749 73412 37901 17790 16642 -8984
17311 -8984 32749 131447 55022 -80030 -147537 -76055 -2576 64529 124077 83882 2740 -68807
17299 -68807 -78636 -143660 -25727 52213 -8512 -18255 -34624 -26677 -94359 -48639 14489 -62228
17287 -62228 -139162 -81904 -85822 -134330 -167326 -185559 -102951 -26627 -4689 -21775 -7003 38474
17275 38474 67050 60736 63673 29116 -21900 -40248 -53378 -14962 62 -18073 -28155 -41829
17263 -41829 -32775 -14400 23393 71589 70583 47880 54282 -42057 -93373 -101053 -23246 9858
17251 9858 11105 83615 90977 36171 -41276 -73722 -42003 -90629 -69430 -73880 -82714 -64990 -14089
17238 -14089 73975 109344 126974 153050 95230 4298 -62841 -19038 -13977 -25211 -11396 -52436
$$ packed form
17323a74128J17931O1849j4145O36m2144Q824N7926N6663l5511k0111j148k5626
17311h984M1733R8698p6425j35052o7507P1482P3479O7105N9548m0195q1142p1547
17299f8807r829o5024J17933P7940o0725r743j6369P947o7682M5720O3128p6717
17287f2228p6934N7258l918m8508l2996j8233Q2608P6324K1938j7086J4772M5477
17275C8474K8576o314K937l4557n1016j8348j3130L8416J5024j8135j0082j3674
17263d1829R054J8375L7793M8196j006k2703O402r6339n1316p680P7807L3104
17251I858J247P2510P362n4806p7447l2446L1719m8626K1199m450q834J7724N0901
17238a4089Q8064L5369J7630K6076n7820r0932o7139M3803N061j1234J3815m1040
$$ plain form
17226 -52436 -43681 -23653 -42706 -100514 -72324 39506 84152 88230 95535 92996 93987 104059 138928
17213 138928 148899 168401 86860 53759 78347 102099 45119 28045 -12335 -6415 1553 37646
17201 37646 -1661 10338 -3555 3052 21675 53352 57388 84214 56142 21363 6723 79562
17189 79562 84296 43092 38246 22944 -11763 -63270 -22027 -15629 -34784 -49400 -86087 -55377
17177 -55377 -25381 25717 -46115 -142893 -166371 -136733 -88687 -78836 -66879 -17904 56164 96831
17165 96831 105504 83435 97312 126510 12080 -111714 -99246 -120812 -142826 -141433 -138802 -116745
17153 -116745 -33525 -56374 -97099 -92776 -54739 -4212 19333 111103 62340 -32368 -81191 -113572
17141 -113572 -49732 33958 45353 43143 19897 -26462 -38587 -16450 -45158 -98716 -48215 27613
$$ packed form
17226e2436Q755K0028j9053n7808K8190J11830M4646M078P305k539R91J0072L4869
17213A38928R971J9502q1541l3101K4588K3752n6980j7074m0380N920P968L6093
17201C7646l9307J1999j3893O607J8623L1677M036K6826k8072l4779j4640P2839
17189G9562M734m1204m846j5302l4707n1507M1243O398j9155j4616l6687L0710
17177e5377K9996N1098p1832r6778k3478K9638M8046R851J1957M8975P4068M0667
17165I6831Q673k2069J3877K9198j14430j23794J2468k1566k2014J393K631K2057
17153a16745Q3220k2849m0725M323L8037N0527K3545R1770m8763r4708m8823l2381
17141a13572O3840Q3690J1395k210k3246m6359j2125K2137k8708n3558N0501P5828
$$ plain form
17129 27613 -3113 -1336 61787 142275 161414 75139 49400 59378 17480 -65229 -77651 -31152
17117 -31152 -45452 -11088 84289 3183 -45224 -63700 -34366 -32724 588 30226 74983 71509
17105 71509 35759 117238 72638 28702 53150 39831 -24367 -38761 14340 10806 -16031 -13110
17093 -13110 24963 -12499 -72630 -89004 -66475 -59493 -89912 -64797 -22894 -7454 64354 61342
17081 61342 -40721 -89345 -80184 -77208 -88823 -42964 -60452 -736 80714 80230 62299 -29383
17069 -29383 -56882 -60413 -57540 23694 33558 40592 -2079 -50513 -64119 -42707 22504 33883
17057 33883 21310 -44620 25327 88365 105146 126964 29327 -7329 -14102 -17269 -82257 -118589
17045 -118589 -101701 -62270 -83557 -72082 -9926 27185 30825 27361 52648 -12107 -36362 -33557
$$ packed form
17129B7613l0726J777O3123Q0488J9139q6275k5739R978m1898q2709j2422M6499
17117c1152j4300L4364R5377q1106m8407j8476K9334J642L3312K9638M4757l474
17105G1509l5750Q1479m4600m3936K4448j3319o4198j4394N3101l534k6837K921
17093a3110L8073l7462o0131j6374K2529O982l0419K5115M1903J5440P1808l012
17081F1342j02063m8624R161K976j1615M5859j7488N9716Q1450m84j7931r1682
17069b9383k7499l531K873Q1234R864P034m2671m8434j3606K1412O5211J1379
17057C3883j2573o5930O9947O3038J6781K1818r7637l6656o773l167o4988l6332
17045a18589J6888L9431k1287J1475O2156L7111L640l464K5287o4755k4255K805
$$ plain form
17033 -33557 -33597 -78716 -56247 -23640 -40370 -126864 -172904 -92508 -45370 -38129 -56768 5972
17021 5972 -23937 -48606 -70277 -72982 -128181 -181229 -196457 -92388 -48989 -1888 21956 64342
17009 64342 31906 -37572 -54937 -3918 609 -40802 -87158 -40629 42744 63786 26484 -36309
16997 -36309 -30675 -22458 -9058 30466 49082 260 8099 16852 17962 18296 -19619 59287 104054
16984 104054 43426 21299 11050 43568 54395 24060 1114 25295 88304 56708 -13041
16973 -13041 12453 -24033 -10893 2568 -31733 -74170 -118331 -153410 -116228 -76861 -44352 -64852
16961 -64852 -39276 -33245 -101930 -70429 3231 23024 2153 19399 18744 13065 17843 28482 32980
16948 32980 2057 39251 113486 58110 -15976 34209 62730 71194 8501 -11122 -22197 -44606
$$ packed form
17033c3557m0m5119K2469L2607j6730q6494m6040Q0396M7138P241j8639O2740
17021E972k9909k4669k1671k705n5199n3048j5228J04069M3399M7101K3844M2386
17009F4342l2436o9478j7365N1019M527m1411m6356M6529Q3373K1042l7302o2793
16997c6309N634Q217J3400L9524J8616m8822P839Q753J110L34l7915P8906M4767
16984A04054o0628k2127j0249L2518J0827l0335k2946K4181O3009l1596o9749
16973a3041K5494l6486J3140J3461l4301m2437m4161l5079L7182L9367L2509k0500
16961f4852K5576O031o8685L1501P3660J9793k0871J7246o55n679M778J0639M498
16948C2980l0923L7194P4235n5376p4086N0185K8521Q464o2693j9623j1075k2409
$$ plain form
16936 -44606 -86072 -73226 -86705 -40501 -60377 -125469 -125333 -107176 -102443 -152436 -136726 -55699
16924 -55699 -28076 -2221 18302 -61135 -108483 -111136 -128421 -56862 -15410 -54309 -62249 -57603
16912 -57603 -47689 22553 79025 55576 42436 20107 -57368 17455 66457 78086 114654 112394
16900 112394 4068 -8643 37275 63282 87238 97496 87686 32021 43654 86987 27875
16889 27875 -40224 -37301 -27628 -33337 -20464 -70468 -44073 -9388 -5212 -13563 -32555 -43235 -25501
16876 -25501 3326 5452 3764 -56358 -99014 -90959 -38518 -13773 21538 39329 39308 30389 -8891
16863 -8891 1484 61915 97938 75130 7019 269 25112 52343 53960 -67657 -95780 -60496
16851 -60496 10440 55047 51491 41969 35940 22837 -10549 -18859 -17319 -23804 -63893 -54321 14389
$$ packed form
16936d4606m1466J2846j3479M6204j9876o5092J36J8157M733m9993J5710Q1027
16924e5699K7623K5855K0523p9437m7348k653j7285P1559M1452l8899p940M646
16912e7603R914P0242N6472k3449j3140k2329p7475P4823M9002J1629L6568k260
16900A12394j08326j2711M5918K6007K3956J0258r810n5665J1633M3333n9112
16889B7875o8099K923R673n709J2873n0004K6395L4685M176q351j8992j0680J7734
16876b5501K8827K126j688o0122m2656Q055N2441K4745L5311J7791k1q919l9280
16863h891J0375O0431L6023k2808o8111o750K4843K7231J617j21617k8123L5284
16851f0496P0936M4607l556r522o029j3103l3386q310J540o485m0089R572O8710
$$ plain form
16838 14389 54697 103405 80226 47095 -5254 -97356 -140018 -103765 -146368 -128081 -17450
16827 -17450 -22245 -46565 -28023 -12076 -6641 -3077 -21714 -64590 -84713 -88017 -108243 -58023
16815 -58023 -30081 -93850 -110811 -66835 -31817 -70415 -66939 -105573 -42606 -37059 -18390 -26962
16803 -26962 -12683 13904 -1225 -4403 -46777 -55226 -36097 -57847 -65226 -35966 -44165 -61653
16791 -61653 -28858 -12158 76394 81847 20306 -28760 -49627 -4365 35688 39429 89021 150298
16779 150298 84177 50779 111618 114223 55055 10673 -32315 -62710 -48772 -28986 -88507 -107120
16767 -107120 -60115 -19823 13669 78685 98146 98369 61526 89475 88047 64005 98377 150479
16755 150479 101391 4120 -28921 -6960 -67624 -23907 -13860 -56079 -56209 -59438 -53719 -49225
$$ packed form
16838A4389M0308M8708k3179l3131n2349r2102m2662L6253m2603J8287J10631
16827a7450m795k4320J8542J5947N435L564j8637m2876k0123l304k0226N0220
16815e8023K7942o3769j6961M3976L5018l8598L476l8634O2967N547J8669q572
16803b6962J4279K6587j5129l178m2374q449J9129k1750p379K9260q199j7488
16791f1653L2795J6700Q8552N453o1541m9066k0867M5262M0053L741M9592O1277
16779A50298o6121l3398O0839K605n9168m4382m2988l0395J3938J9786n9521j8613
16767a07120M7005M0292L3492O5016J9461K23l6843K7949j428k4042L4372N2102
16755A50479m9088r7271l3041K1961o0664M3717J0047m2219j30l229N719M494
$$ plain form
16743 -49225 -10520 -19861 44454 54393 8010 27370 24764 106179 86312 60748 73724 67314
16731 67314 29765 -4439 -6401 73479 52158 -15011 -26406 -20327 -83383 -49545 -60885 -115664
16719 -115664 -64591 -37396 -39474 -57136 -14035 94595 116092 43916 11088 -17178 -42882
16708 -42882 -2731 4345 46452 91046 26983 -1342 54768 100454 73805 33322 29842 82279
16696 82279 116170 110412 146991 119747 15961 7711 1835 1666 -38139 -90052 -77552 -9934
16684 -9934 33697 23948 -35908 -119652 -55366 31128 13973 -47574 -119283 -98258 -75791 -80630
16672 -80630 -31510 13322 -24484 -54842 -49756 -74612 -52686 -10932 -1620 -33732 -34885 -19115
16660 -19115 38650 102010 60068 2941 -17544 -14748 6294 -29835 -11177 -4037 -2661 -16213
$$ packed form
16743d9225L8705r341O4315R939m6383J9360k606Q1415j9867k5564J2976o410
16731F7314l7549l4204j962P9880k1321o7169j1395O079o3056L3838j1340n4779
16719a15664N1073K7195k078j7662M3101J08630K1497p2176l2828k8266k5704
16708d2882M0151P076M2107M4594o4063k8325N6110M5686k6649m0483l480N2437
16696H2279L3891n758L6579k7244j03786q250n876j69l9805n1913J2500O7618
16684i934M3631r749n9856q3744O4286Q6494j7155o1547p1709K1025K2467m839
16672h0630M9120M4832l7806l0358N086k4856K1926M1754R312l2112j153J5770
16660a9115N7765O3360m1942n7127k0485K796K1042l6129J8658P140J376j3552
$$ plain form
16648 -16213 -45735 -12965 33080 111278 141887 120263 74076 40509 30470 21310 88174 121622
16636 121622 119940 125335 45203 -3418 24552 19753 -19434 -2218 1672 -32281 -12895 13176
16624 13176 70175 81052 68632 59178 -20741 -41481 -83499 -27560 -39686 -50942 -2185 -4099
16612 -4099 -1771 37919 74415 70047 35594 -2862 -13313 -3511 24796 45822 36953 -13578 -4270
16599 -4270 3934 -51265 -65205 -11586 17340 -21323 -55822 -77515 -73730 -33377 -22681 -61018
16587 -61018 -35342 -5592 26609 72235 44594 16208 10362 25231 44498 25060 -4000 45126
16575 45126 71581 51711 -31687 -73455 6560 77860 67402 51391 29587 6807 7408 -11849
16563 -11849 23639 22603 -134 15404 -16452 -23935 8343 25843 29098 16787 29788 -20615
$$ packed form
16648a6213k9522L2770M6045P8198L0609k1624m6187l3567j0039r160O6864L3448
16636A21622j682N395q0132m8621K7970m799l9187J7216L890l3953J9386K6071
16624A3176N6999J0877j2420r454p9919k0740m2018N5939j2126j1256M8757j914
16612d099K328L9690L6496m368l4453l8456j0451R802K8307K1026q869n0531R308
16599d270Q204n5199j3940N3619K8926l8663l4499k1693L785M0353J0696l8337
16587f1018K5676K9750L2201M5626k7641k8386n846J4869J9267j9438k9060M9126
16575D5126K6455j9870q3398m1768Q0015P1300j0458j6011k1804k2780O01j9257
16563a1849L5488j036k2737J5538l1856p483L2278J7500L255j2311J3001n0403
$$ plain form
16551 -20615 -38229 8949 69518 44077 46743 100154 131363 113604 94042 68037 49198 55141
16539 55141 36327 59858 37900 8592 -34437 9440 34459 43539 45063 90321 139176 105492
16527 105492 93842 80952 84968 57893 25330 59514 64872 88908 119806 130896 134683 169259
16515 169259 166107 154640 150216 165483 146610 132735 114628 112204 112581 52849 24904 63501
16503 63501 33778 32762 67943 64636 57159 41588 -81262 -115413 -62150 -14942 -17449 35482
16491 35482 69809 2855 -23563 43607 20731 16469 88411 85961 81261 104944 94871 113092
16479 113092 142228 103202 123583 161309 133006 111913 90413 121794 192907 205180 133074
16468 133074 46614 37455 21725 62412 79617 94727 77741 23770 -36650 4125 41986 83712
$$ packed form
16551b0615j7614M7178O0569k5441K666N3411L1209j7759j9562k6005j8839N943
16539E5141j8814K3531k1958k9308m3029M3877K5019R080J524M5258M8855l3684
16527A05492j1650j2890M016k7075l2563L4184N358K4036L0898J1090L787L4576
16515A69259l152j1467m424J5267j8873j3875j8107k424L77n9732k7945L8597
16503F3501k9723j016L5181l307p477j5571j22850l4151N3263M7208k507N2931
16491C5482L4327o6954k6418O7170k2876m262P1942k450m700K3683j0073J8221
16479A13092K9136l9026K0381L7726k8303k1093k1500L1381P1113J2273p2106
16468A33074q6460r159j5730M0687J7205J5110j6986n3971o0420M0775L7861M1726
$$ plain form
16456 83712 136883 115752 42929 -19393 14291 79435 96604 111458 67970 20714 -44422 -10880
16444 -10880 32128 66733 102302 92466 69084 -6935 -4405 61834 30828 20200 -30414 -35323
16432 -35323 -8787 48827 34945 38677 18745 8188 46526 44277 86060 65938 41938 37744
16420 37744 20542 5634 38675 105365 97993 37565 -19552 25325 72808 142566 126627 94911
16408 94911 131870 127573 92219 41082 54665 67380 21647 18467 60898 71480 19852 17393
16396 17393 -8061 -37387 25543 48367 44064 28826 21121 25353 76901 122633 86195 116831
16384 116831 102036 66176 54599 73383 57935 46269 75399 108902 161613 190277 146802
16373 146802 78512 34412 8014 -33462 -35864 25753 15765 80325 91790 74866 93653 144319
$$ packed form
16456H3712N3171k1131p2823o2322L3684O5144J7169J4854m3488m7256o5136L3542
16444a0880M3008L4605L5569r836k3382p6019K530O6239l1006j0628n0614m909
16432c5323K6536N7614j3882L732j9932j0557L8338k249M1783k0122k4000m194
16420C7744j7202j4908L3041O6690p372o0428n7117M4877M7483O9758j5939l1716
16408I4911L6959m297l5354n1137J3583J2715m5733l180M2431J0582n1628k459
16396A7393k5454k9326O2930K2824m303j5238p705M232N1548M5732l6438L0636
16384A16831j4795l5860j1577J8784j5448j1666K9130L3503N2711K8664m3475
16373A46802o8290m4100k6398m1476k402O1617r988O4560J1465j6924J8787N0666
$$ plain form
16361 144319 97267 88771 121832 25274 -5157 51758 100963 82649 120749 160783 163513 141353
16349 141353 134604 85056 59735 117509 122430 134595 118863 68221 76576 144542 216837 179791
16337 179791 127051 110557 48877 31362 113298 136228 177692 159491 68258 62860 112487 155659
16325 155659 133725 148979 159473 118219 72878 107546 170143 213468 196313 226482 243684
16314 243684 214108 206290 217616 258130 210871 190989 224649 227176 183360 164958 182313 163916
16302 163916 148215 118211 123796 169814 160775 100828 109965 150172 172649 159999 179204 188114
16290 188114 246861 223676 202639 248296 270286 332824 385225 372020 432810 483025 500181
16279 500181 513389 524436 497591 441848 364704 395439 411656 371549 380761 379278 380992 341809
$$ packed form
16361A44319m7052q496L3061r6558l0431N6915M9205j8314L8100M0034K730k2160
16349A41353o749m9548k5321N7774M921J2165j5732n0642Q355O7966P2295l7046
16337A79791n2740j6494o1680j7515Q1936K2930M1464j8201r1233n398M9627M3172
16325A55659k1934J5254J0494m1254m5341L4668O2597M3325j7155L0169J7202
16314B43684k9576p818J1326M0514m7259j9882L3660K527m3816j8402J7355j8397
16302A63916j5701l0004N585M6018r039n9947R137M0207K2477j2650J9205Q910
16290A88114N8747k3185k1037M5657K1990O2538N2401j3205O0790N0215J7156
16279E00181J3208J1047k6845n5743p7144L0735J6217m0107R212j483J714l9183
$$ plain form
16267 341809 337605 328938 297662 271967 299231 366666 415075 340849 281566 223232 245935 237968
16255 237968 272585 262750 281808 357269 356092 367727 343176 282806 261895 294953 294218 262015
16243 262015 297124 360032 375661 333297 288292 337511 293419 301520 351614 348262 275631 196483
16231 196483 196749 200380 244086 209022 181571 181290 218073 197043 218673 269275 308200 310473 305599
16218 305599 361556 427514 467717 388698 273796 284291 352859 382713 324768 250827 333836
16207 333836 372799 412721 427294 371525 311618 313922 292962 316736 303765 362314 427094 418249
16195 418249 335844 330921 354263 352004 339037 308030 378271 424091 450800 423345 439315 429645
16183 429645 481142 506888 486095 468614 457691 429760 451363 583673 621330 607064 566427
$$ packed form
16267C41809m204q667l1276k5695K7264O7435M8409p4226n9283n8334K2703p967
16255B37968L4617r835J9058P5461j177J1635k4551o0370k0911L3058p35l2203
16243B62015L5109O2908J5629m2364m5005M9219m4092Q101N0094l352p2631p9148
16231A96483K66L631M3706l5064k7451k81L6783k1030K1630N0602L8925K273m874
16218C05599N5957O5958M0203p9019j14902J0495O8568K9854n7945p3941Q3009
16207C33836L8963L9922J4573n5769n9907K304k0960K3774j2971N8549O4780q845
16195D18249q2405m923K3342k259j2967l1007P0241M5820K6709k7455J5970r670
16183D29645N1497K5746k0793j7481j0923k7931K1603J32310L7657j4266m0637
$$ plain form
16172 566427 545129 560741 594682 639340 632722 677155 719299 751390 775638 740585 706519 731356
16160 731356 747831 690408 682278 766577 819550 844827 795030 698822 752032 798053 814786 883944
16148 883944 853517 852839 895584 923566 919696 811316 785489 780074 808992 879131 935771 1024275
16136 1024275 1061883 1052411 965838 879286 885137 910168 968459 992914 1022315 1046559 995873 1052548
16124 1052548 1046153 1003183 1005735 1045974 1076918 1055030 1009363 1020585 1065646 1073935 1069806 1114296
16112 1114296 1184598 1269080 1250920 1232898 1303508 1356629 1413914 1523194 1521801 1494214 1499837
16101 1499837 1554261 1490336 1490334 1560587 1604097 1618238 1699063 1784377 1859831 1908719 2000894 2045398
16089 2045398 2019702 2030900 2026886 2050936 2162554 2274336 2313888 2400377 2481519 2612353 2668772
$$ packed form
16172E66427k1298J5612L3941M4658o618M4433M2144L2091K4248l5053l4066K4837
16160G31356J6475n7423q130Q4299N2973K5277m9797r6208N3210M6021J6733O9158
16148H83944l0427o78M2745K7982l870j08380k5827n415K8918P0139N6640Q8504
16136A024275L7608r472q6573q6552N851K5031N8291K4455K9401K4244n0686N6675
16124A052548o395m2970K552M0239L0944k1888m5667J1222M5061Q289m129M4490
16112A114296P0302Q4482j8160j8022P0610N3121N7285J09280j393k7587N623
16101A499837N4424o3925kP0253M3510J4141Q0825Q5314P5454M8888R2175M4504
16089B045398k5696J1198m014K4050J11618J11782L9552Q6489Q1142J30834N6419
$$ plain form
16078 2668772 2740002 2724001 2727034 2836486 2921343 3029454 3095377 3129650 3282257 3402260 3512972
16067 3512972 3648380 3814488 3961641 4071581 4237233 4377892 4499506 4649786 4834511
16058 4834511 5040173 5209306 5406245 5728405 5980195 6159447 6358737 6687347 7026674
16049 7026674 7293385 7503810 7818758 8170191 8500451 8825521 9159551 9597279 10052068
16040 10052068 10606290 11160710 11636981 12285968 13002188 13767517 14513719 15296778 16187749
16031 16187749 17174778 18177753 19272249 20477373 21776702 23110166 24596360 26240189
16023 26240189 27963256 29787019 31752462 33874361 36194240 38728893 41412313 44207707
16015 44207707 47155289 50194059 53339403 56510293 59694597 62796622 65713072 68312975
$$ packed form
16078B668772P1230j6001L033J09452Q4857J08111O5923L4273J52607J20003J10712
16067C512972J35408J66108J47153J09940J65652J40659J21614J50280J84725
16058D834511K05662J69133J96939L22160K51790J79252J99290L28610L39327
16049G026674K66711K10425L14948L51433L30260L25070L34030M37728M54789
16040A0052068N54222N54420M76271O48987P16220P65329P46202P83059Q90971
16031A6187749R87029J002975J094496J205124J299329J333464J486194J643829
16023B6240189J723067J823763J965443K121899K319879K534653K683420K795394
16015D4207707K947582L038770L145344L170890L184304L102025K916450K599903
$$ plain form
16007 68312975 70562203 72365614 73670905 74383475 74393037 73845048 72698811 71063086 68991266
15998 68991266 66410831 63613866 60706751 57787618 54762692 51705820 48710200 45838884
15990 45838884 43154294 40486715 37918276 35592126 33402052 31383365 29471839 27702541
15982 27702541 26173307 24710627 23281630 21927290 20670705 19586401 18592961 17612617
15974 17612617 16687078 15815828 14985844 14309472 13694231 13004890 12354080 11722610 11226379
15965 11226379 10825428 10329664 9964625 9620721 9215748 8739403 8305246 7973476 7704177
15956 7704177 7448199 7235298 7017657 6817376 6540323 6273698 6050988 5818711 5641729
15947 5641729 5484265 5304712 5115056 4919667 4846297 4692999 4585419 4463454 4306083 4176890
$$ packed form
16007F8312975K249228J803411J305291P12570R562n47989j146237j635725k071820
15998F8991266k580435k796965k907115k919133l024926l056872k995620k871316
15990D5838884k684590k667579k568439k326150k190074k018687j911526j769298
15982B7702541j529234j462680j428997j354340j256585j084304r93440r80344
15974A7612617r25539q71250q29984o76372o15241o89341o50810o31470m96231
15965A1226379m00951m95764l65039l43904m04973m76345m34157l31770k69299
15956G704177k55978k12901k17641k00281k77053k66625k22710k32277j76982
15947E641729j57464j79553j89656j95389p3370j53298j07580j21965j57371j29193
$$ plain form
15937 4176890 4068877 3994611 3888715 3808210 3714631 3645251 3579749 3372006 3245615 3216855
15927 3216855 3130077 3051200 2990749 2975418 2923877 2822792 2733252 2674907 2676835 2560496 2481363
15916 2481363 2406204 2318841 2256957 2258183 2261605 2251665 2163355 2117552 2145288 2117576 2013969 2018665
15904 2018665 2048474 1999810 1898417 1842990 1771764 1723826 1680231 1711466 1716940 1674478 1659117
15893 1659117 1669315 1690822 1710111 1626680 1579524 1544269 1594803 1590941 1529627 1478176 1472093 1426278
15881 1426278 1391396 1386012 1432431 1361494 1339634 1345663 1287987 1251951 1188352 1167343 1207114 1158556
15869 1158556 1037837 1000938 986475 961554 897269 950085 928851 877706 798883 772557 793430
15858 793430 819749 816297 763887 748107 730674 745281 734510 717503 741947 702358 674626 647153
$$ packed form
15937D176890j08013p4266j05896q0505r3579o9380o5502k07743j26391k8760
15927C216855q6778p8877o0451j5331n1541j01085q9540n8345J928j16339p9133
15916B481363p5159q7363o1884J226L422r940q8310m5803K7736k7712j03607M696
15904B018665K9809m8664j01393n5427p1226m7938m3595L1235N474m2462j5361
15893A659117J0198K1507J9289q3431m7156l5255N0534l862o1314n1451o083m5815
15881A426278l4882n384M6419p0937k1860O029n7676l6036o3599k1009L9771m8558
15869A158556j20719l6899j4463k4921o4285N2816k1234n1145p8823k6326K0873
15858G93430K6319l452n2410j5780j7433J4607j0771j7007K4444l9589k7732k7473
$$ plain form
15846 647153 628513 650214 721020 708641 724821 742372 674737 684683 696768 687521 672820 623697
15834 623697 641301 684244 710336 751254 713255 681102 630277 605625 581052 597474 634228
15823 634228 598013 603122 656894 636948 600929 584626 540879 544500 618446 587185 622225 584688
15811 584688 491514 421083 457273 481170 472098 475704 513649 541141 505393 475102 522147 576366
15799 576366 533793 527180 565010 530200 466826 445870 435335 368048 335897 366376 370244 343368
15787 343368 330787 318962 303144 357840 424640 473291 471609 430773 396473 410218 346290 306313
15775 306313 383754 436797 495429 489670 416284 387060 405431 389668 366060 399928 394118 420594
15763 420594 446949 429154 504721 465722 454218 548883 531415 424353 497491 773645 1176684
$$ packed form
15846F47153j8640K1701P0806j2379J6180J7551o7635R946J2085r247j4701m9123
15834F23697J7604M2943K6092M0918l7999l2153n0825k4652k4573J6422L6754
15823F34228l6215N109N3772j9946l6019j6303m3747L621P3946l1261L5040l7537
15811E84688r3174p0431L6190K3897r072L606L7945K7492l5748l0291M7045N4219
15799E76366m2573o613L7830l4810o3374k0956j0535o7287l2151L0479L868k6876
15787C43368j2581j1825j5818N4696O6800M8651j682m0836l4300J3745o3928l9977
15775C06313P7441N3043N8632n759p3386k9224J8371j5763k3608L3868n810K6476
15763D20594K6355j7795P5567l8999j1504R4665j7468j07062P3138K76154M03039
$$ plain form
15752 1176684 1704663 2163715 1711905 1071995 741448 592375 520505 468278 394727 325342
15742 325342 283238 306104 312408 270894 238857 243053 320149 352048 396145 454465 461845 455858
15730 455858 418617 446717 579153 655544 597826 636738 663106 669518 595080 477194 362578
15719 362578 364171 389103 335641 286760 222899 258670 307290 301608 289950 311546 293590 297225
15707 297225 273234 265016 186439 149378 173727 154481 157043 165536 158710 225591 266142 236028
15695 236028 216712 211304 240412 238523 188666 171980 111290 31987 10428 103162 144162 191200
15683 191200 207374 234686 245253 237548 156675 81568 93214 99690 158023 166315 183613 275229
15671 275229 284365 224384 102248 6136 65823 129457 153992 48863 40318 125420 198952
$$ packed form
15752A176684N27979M59052m51810o39910l30547j49073p1870n2227p3551o9385
15742C25342m2104K2866O304m1514l2037M196P7096L1899M4097N8320P380n987
15730D55858l7241K8100J32436P6391n7718L8912K6368O412p4438j17886j14616
15719C62578J593K4932n3462m8881o3861L5771M8620n682j1658K1596j7956L635
15707B97225k3991q218p8577l7061K4349j9246K562Q493o826O6881M0551l0114
15695B36028j9316n408K9108j889m9857j6686o0690p9303k1559R2734M1000M7038
15683A91200J6174K7312J0567p705q0873p5107J1646O476N8333Q292J7298R1616
15671B75229R136n9981j22136r6112N9687O3634K4535j05129q545Q5102P3532
$$ plain form
15660 198952 115586 111899 183422 204665 181941 124361 126035 153348 184336 202647 214090 203265
15648 203265 233085 204380 216148 209366 157234 93407 121037 122703 153641 129968 141198 151365
15636 151365 106048 126359 130660 91273 95211 71000 889 44814 100195 136565 145611 122456
15624 122456 161864 140867 115432 74647 49331 -6094 -47171 -26992 31152 58691 78250
15613 78250 62444 99863 149529 141699 122960 129360 123463 133865 219780 236623 185071 146209
15601 146209 189804 147674 132599 171060 120457 26893 -47502 -98415 -82832 -56876 -36258
15590 -36258 -61541 -49778 -10910 -16414 86642 156525 157595 166216 85841 39316 97224 105654
15578 105654 93049 79085 54264 47861 66509 132007 166753 152508 177798 237775 215314 112343
$$ packed form
15660A98952q3366l687P1523K1243k2724n7580J674K7313L0988J8311J1443j0825
15648B03265K9820k8705J1768o782n2132o3827K7630J666L0938k3673J1230J0167
15636A51365m5317K0311M301l9387L938k4211p0111M3925N5381L6370R046k3155
15624A22456L9408k0997k5435m0785k5316n5425m1077K0179N8144K7539J9559
15613G8250j5806L7419M9666p830j8739O400n897J0402Q5915J6843n1552l8862
15601A46209M3595m2130j5075L8461n0603r3564p4395n0913J5583K5956K0618
15590c6258k5283J1763L8868n504J03056O9883J070Q621q0375m6525N7908Q430
15578A05654j2605j3964k4821o403J8648O5498L4746j4245K5290N9977k2461j02971
$$ plain form
15566 112343 56609 46927 133390 167721 146534 164863 161976 139462 53254 19838 10387 -26792
15554 -26792 43102 71785 51732 85071 88041 62913 46984 73709 72795 43654 33593 51716
15542 51716 70531 70663 71298 91339 110615 110943 137949 119739 109279 114342 120633 159057 130979
15529 130979 143772 94775 14001 -21653 23793 71976 65500 118094 137036 108472 101891 79034
15517 79034 23120 74352 122149 169158 159677 150116 215907 193154 216884 276821 206645 167290
15505 167290 173337 162115 111215 111082 46522 60397 69632 75825 129370 162900 60433 35053
15493 35053 58011 55569 40893 72075 50799 9349 -8634 -15791 -18469 24570 29904 -3794
15481 -3794 49456 110508 100814 126378 135905 99847 162786 224216 228647 203387 209841 146843 145309
$$ packed form
15566A12343n5734r682Q6463L4331k1187J8329k887k2514q6208l3416r451l7179
15554b6792O9894K8683k0053L3339K970k5128j5929K6725r14k9141j0061J8123
15542E1716J8815J32O35K0041J9276L28K7006j8210j0460N063O291L8424k8078
15529A30979J2793m8997q0774l5654M5446M8183o476N2594J8942k8564o581k2857
15517G9034n5914N1232M7797M7009r481r561O5791k2753K3730N9937p0176l9355
15505A67290O047j1222n0900j33o4560J3875R235O193N3545L3530j02467k5380
15493C5053K2958k442j4676L1182k1276m1450j7983p157k678M3039N334l3698
15481c794N3250O1052r694K5564R527l6058O2939O1430M431k5260O454o2998j534
$$ plain form
15468 145309 172293 182235 191549 123335 63365 14379 28036 29315 18771 79217 88143 47996
15456 47996 65578 54537 41939 63207 45182 39470 27668 84209 94981 73633 81913 96874
15444 96874 101062 82386 66316 46124 36584 57566 119513 18464 -48741 23990 59348 3529
15432 3529 61498 106652 128056 88186 46987 71456 76574 48280 57690 46687 964 2564
15420 2564 44860 26315 61737 129860 150189 40076 -31968 -42139 -40309 -52752 -48322 28295
15408 28295 95389 128751 119585 139503 114595 101326 117816 117274 94625 141297 152993 185639
15396 185639 133750 86758 92662 34603 41042 85669 44940 8331 50740 129254 79959 7214
15384 7214 -59468 -36471 73761 115815 99232 32677 23938 7074 -5226 14801 13380 -26124
$$ packed form
15468A45309K6984R942R314o8214n9970m8986J3657J279j0544O0446Q926m0147
15456D7996J7582j1041j2598K1268j8025n712j1802N6541J0772k1348Q280J4961
15444I6874M188j8676j6070k0192r540K0982O1947j01049o7205P2731L5358n5819
15432C529N7969M5154K1404l9870m1199K4469N118k8294R410j1003m5723J600
15420B564M2296j8545L5422O8123K0329j10113p2044j0171J830j2443M430P6617
15408B8295O7094L3362r166J9918k4908j3269J6490n42k2649M6672J1696L2646
15396A85639n1889m6992N904n8059O439M4627m0729l6609M2409P8514m9295p2745
15384G214o6682K2997J10232M2054j6583o6555q739j6864j2300K0027j421l9504
$$ plain form
15372 -26124 -29220 -18834 6843 67459 59082 75044 107452 139222 103739 75653 49312 99888
15360 99888 125076 112493 79197 47227 -27779 -39465 -41696 7277 -5153 843 -384 16830
15348 16830 38631 116502 98306 114745 104695 41981 23666 -6687 -55453 -47223 -9004 -3480
15336 -3480 -353 24696 49195 92426 96003 48304 29109 46044 53667 8567 21372 13175 -6881
15323 -6881 -66970 -7862 32949 51108 91393 111010 109017 111614 116416 58265 63388 118644 117115
15310 117115 27334 -20955 20429 69887 74281 74136 71332 70026 -15119 -61378 -27512 38638
15298 38638 70789 174168 149198 49764 15790 -72270 -92678 -46994 -26327 11008 46342
15287 46342 46756 -52986 -26029 -42516 -49998 -10711 60159 93980 50403 37387 63015 105823
$$ packed form
15372b6124l096J0386K5677O0616q377J5962L2408L1770l5483k8086k6341N0576
15360I9888K5188j2583l3296l1970p5006j1686k231M8973j2430N996j227J7214
15348A6830K1801P7871j8196J6439j0050o2714j8315l0353m8766Q230L8219N524
15336c480L127K5049K4499M3231L577m7699j9195J6935P623m5100J2805q197k0056
15323f881o0089N9108M0811J8159M0285J9617j993K597M802n8151N123N5256j529
15310A17115q9781m8289M1384M9458M394j45k804j306q5145m6259L3866O6150
15298C8638L2151J03379k4970r9434l3974q8060k0408M5684K0667L7335L5334
15287D6342M14r9742K6957j6487p482L9287P0870L3821m3577j3016K5628M2808
$$ plain form
15275 105823 95211 79311 56585 87180 75383 -8059 -131629 -108743 -84211 -56478 -39657
15264 -39657 -65189 -43620 16925 82698 68593 80407 83567 109504 146779 116658 59900 22453
15252 22453 51981 87362 71143 -10593 36062 56232 -20004 -54689 -77307 -15902 -20139 -76823
15240 -76823 -83575 -49739 9336 58825 723 27986 11982 -13533 -45563 -86050 -100699 -41392
15228 -41392 3842 43022 62840 82922 91549 98338 110713 99440 95849 75446 85722 96669
15216 96669 44946 7304 -61603 -156736 -133628 -93504 -74591 -14374 -4919 -32474 23991 78971
15204 78971 93112 79503 4675 -46117 -26674 44426 43311 45755 16141 -27962 -31769 -28903
15192 -28903 -56632 -35296 -39573 -78167 24533 121945 103396 106708 94181 47690 86511 53471
$$ packed form
15275A05823j0612j5900k2726L0595j1797q3442j23570K2886K4532K7733J6821
15264c9657k5532K1569O0545O5773j4105J1814L160K5937L7275l0121n6758l7447
15252B2453K9528L5381j6219q1736M6655K0170p6236l4685k2618O1405m237n6684
15240g6823o752L3836N9075M9489n8102K7263j6004k5515l2030m0487j4649N9307
15228d1392M5234L9180J9818K0082Q627O789J2375j1273l591k0403J0276J0947
15216I6669n1723l7642o8907r5133K3108M0124J8913O0217R455k7555N6465N4980
15204G8971J4141j3609p4828n0792J9443P1100j115K444k9614m4103l807K866
15192b8903k7729K1336m277l8594J02700R7412j8549L312j2527m6491L8821l3040
$$ plain form
15180 53471 68443 112965 118009 10142 -51170 12357 -22958 -29659 9417 2024 -40200 2505
15168 2505 95896 131693 146535 126961 75937 54395 61498 62450 24807 20671 37900 48507 54450
15155 54450 17009 21039 44233 55500 50400 73709 106983 158294 139419 127853 188713 193616
15143 193616 121725 12991 92536 153787 131508 137562 78419 29453 1310 61853 8794
15132 8794 9364 -12231 14699 -18898 -77000 -44184 -6072 -9686 673 -27477 -16976 28065
15120 28065 105393 120036 115645 81212 32246 5525 -12438 -58689 -43614 24337 82886 98849
15108 98849 69526 65080 143649 237843 217396 126611 66005 102207 80235 83045 131630 148549
15096 148549 153749 129389 108331 61453 107506 61432 2014 -1729 -15340 -24555 14434 56850
$$ packed form
15180E3471J4972M4522N044j07867o1312O3527l5315o701L9076p393m2224M2705
15168B505R3391L5797J4842j9574n1024k1542P103R52l7643m136J7229J0607N943
15155E4450l7441M030K3194J1267n100K3309L3274N1311j8875j1566O0860M903
15143A93616p1891j08734P9545O1251k2279O054n9143m8966k8143O0543n3059
15132H794N70k1595K6930l3597n8102L2816L8112l614J0359k8150J0501M5041
15120B8065P7328J4643m391l4433m8966k6721j7963m6251J5075O7951N8549J5963
15108I8849k9323m446P8569R4194k0447r0785o0606L6202k1972K810M8585J6919
15096A48549N200k4360k1058m6878M6053m6074n9418l743j3611r215L8989M2416
$$ plain form
15084 56850 57838 56588 52107 -27946 -20963 38011 107644 140881 111237 81153 61753 -1291 -70102
15071 -70102 -44332 -37126 34725 -23978 -36116 -63590 -14359 17838 80982 91935 86102 110801
15059 110801 116002 28351 19471 79373 89100 47152 -6997 51539 98304 101809 71027 -21032
15047 -21032 -35533 -16833 -87485 -123545 -138022 -38455 -23216 -50117 -35565 -51005 -12936 17884
15035 17884 44880 -2410 -16555 1085 25257 34517 56573 16841 -99988 -116492 -35742 53834
15023 53834 83489 71472 22039 20637 32307 44913 52788 19837 59285 126717 54332 -3388
15011 -3388 -38912 -6545 -29623 -69140 -34232 -26179 -9171 -63236 -26817 59828 58669 20405
14999 20405 -44365 -91525 -56865 -65999 -37903 -38629 -91278 -92719 -115654 -134336 -101381 -68077
$$ packed form
15084E6850R88j250m481q0053O983N8974O9633L3237k9644l0084j9400o3044o8811
15071g0102K5770P206P1851n8703j2138k7474M9231L2197O3144J0953n833K4699
15059A10801N201q7651q880N9902R727m1948n4149N8536M6765L505l0782r2059
15047b1032j4501J8700p0652l6060j4477R9567J5239k6901J4552j5440L8069L0820
15035A7884K6996m7290j4145J7640K4172R260K2056l9732j16829j6504Q0750Q9576
15023E3834K9655j2017m9433j402J1670J2606P875l2951L9448O7432p2385n7720
15011c388l5524L2367k3078l9517L4908Q053J7008n4065L6419Q6645j159l8264
14999B0405o4770m7160L4660r134K8096p26n2649j441k2935j8682L2955L3304
$$ plain form
14987 -68077 -83876 -40650 13405 -48237 -6015 -23788 -56419 -62012 -71450 -98211 -132872 -137409
14975 -137409 -94715 -102230 -91950 -78988 -35974 -34186 -12231 -34420 -70192 -65678 -110179 -118884
14963 -118884 -48576 89216 192473 170026 53641 -91041 -71602 -94154 -93303 -8044 67988
14952 67988 27688 33940 -21550 -83997 27579 75509 104929 90462 26277 65268 97281 37446
14940 37446 12799 46643 30143 84304 137468 121450 73372 51411 60311 83955 117968 101020
14928 101020 62316 -20094 -40448 -60672 -58552 -54524 19490 76364 70035 59325 -19583 -55262
14916 -55262 16385 19575 19573 4410 553 46027 21213 -14806 31925 40634 41190 14496 8542 62951
14902 62951 69332 34496 -7964 -44445 -14298 52864 68487 43600 62090 21254 -30116 -16337
$$ packed form
14987f8077j5799M3226N4055o1642M2222j7773l2631n593r438k6761l4661m537
14975a37409M2694p515J0280J2962M3014J788K1955k2189l5772M514m4501q705
14963a18884P0308J37792J03257k2447j16385j44682J9439k2552Q51Q5259P6032
14952F7988m0300O252n5490o2447J11576M7930K9420j4467o4185L8991L2013n9835
14940C7446k4647L3844j6500N4161N3164j6018m8078k1961Q900K3644L4013j6948
14928A01020l8704q2410k0354k0224K120M028P4014N6874o329j0710p8908l5679
14916e5262P1647L190kj5163l857M5474k4814l6019M6731Q709N56k6694n954N4409
14902F2951O381l4836m2460l6481L0147O7162J5623k4887J8490m0836n1370J3779
$$ plain form
14890 -16337 -15033 -67000 -153784 -94187 -114721 -136144 -79803 -42155 -72731 -106839 -76896 -63564
14878 -63564 -48868 -39721 -34550 17313 49238 82497 111312 164098 171134 142515 104040 79509
14866 79509 37726 -29758 -15077 33757 9826 10732 35182 -1995 -20296 -61877 -75892 -74920
14854 -74920 -105428 -67109 -411 22021 81078 157931 168278 158193 214156 193709 149849 114768
14842 114768 83501 49334 -16028 -37608 -58192 -99087 -129897 -139790 -90167 -58752 -39709 -47348
14830 -47348 9766 3740 -68316 -94951 -78176 -55467 -37489 -96827 -50222 50621 60382 924
14818 924 5671 41753 -3919 -12249 -42981 -21613 -33112 -51157 -76719 -45509 -98492 -77640
14806 -77640 -27380 -35811 -68805 -84928 -122412 -109293 -59931 -35599 -44480 -14951 43751 76224
$$ packed form
14890a6337J304n1967q6784N9597k0534k1423N6341L7648l0576l4108K9943J3332
14878f3564J4696R147N171N1863L1925L3259K8815N2786P036k8619l8475k4531
14866G9509m1783o7484J4681M8834k3931R06K4450l7177j8301m1581j4015R72
14854g4920l0508L8319O6698K2432N9057P6853J0347j0085N5963k0447m3860l5081
14842A14768l1267l4167o5362k1580k0584m0895l0810r893M9623L1415J9043p639
14830d7348N7114o026p2056k6635J6775K2709J7978n9338M6605J00843R761n9458
14818I24M747L6082m5672q330l0732K1368j1499j8045k5562L1210n2983K0852
14806g7640N0260q431l2994j6123l7484J3119M9362K4332q881K9529N8702L2473
$$ plain form
14794 76224 117253 59952 -15020 -51254 -68105 -63954 -18116 41301 93280 94998 90980 109604
14782 109604 78743 19421 -22704 -70719 -222650 -237837 -194194 -151921 -125639 -44373 -33887
14771 -33887 -64035 10820 -10683 -50978 -63769 -3095 28375 40458 -45785 -57948 -37784 -42723
14759 -42723 -73127 55139 150216 173285 120495 24829 20373 -22352 -25958 30581 32177 -54482
14747 -54482 -94952 -55411 19509 395 -36927 -25715 -43194 -40601 -6420 -2762 17125 -10138
14735 -10138 -30836 -43345 -71000 -46592 -39303 22505 6910 -27447 -54881 -38838 -36207 -40179
14723 -40179 4561 3123 37862 33621 48053 27691 22226 -4666 -42590 -5825 -60528 -72814
14711 -72814 -49245 14702 69214 77177 75022 61511 55391 55071 9168 -26795 -60568 -42560 29337
$$ packed form
14794G6224M1029n7301p4972l6234j6851M151M5838N9417N1979J718m018J8624
14782A09604l0861n9322m2125m8015j51931j5187M3643M2273K6282Q1266J0486
14771c3887l0148P4855k1503m0295j2791O0674L1470J2083q6243j2163K0164m939
14759d2723l0404J28266R5077K3069n2790r5666m456m2725l606N6539J596q6659
14747e4482m0470L9541P4920j9114l7322J1212j7479K593L4181L658J9887k7263
14735a0138k0698j2509k7655K4408P289O1808j5595l4357k7434J6043K631l972
14723d0179M4740j438L4739m241J4432k0362n465k6892l7924L6765n4703j2286
14711g2814K3569O3947N4512P963k155j3511o120l20m5903l5963l3773J8008P1897
$$ plain form
14698 29337 33133 12840 44382 139291 58530 -30446 -19149 35707 28155 -8036 -35491 -12506
14686 -12506 43214 60271 17009 42431 56452 50662 41340 52325 58407 94999 98235 27622
14674 27622 -91307 -64395 13956 51967 15719 18054 35250 16258 64527 29406 58212 71013
14662 71013 102721 149261 123707 72060 -30214 -78886 -61615 -65559 -137981 -131444 -133535 -172027
14650 -172027 -155639 -71167 58855 90879 29459 -2804 12309 30435 -34744 -50735 -63714
14639 -63714 -35581 58230 55824 16018 -61461 -109341 -68878 -44566 -41435 -23589 -69014 -81098
14627 -81098 20797 37520 25203 -31969 -63420 -77239 9258 58818 28808 67107 16536
14616 16536 -69750 -48472 3030 25619 -10353 49027 110130 127990 111347 77392 88190 80229
$$ packed form
14698B9337L796k0293L1542R4909q0761q8976J1297N4856p552l6191k7455K2985
14686a2506N5720J7057m3262K5422J4021n790r322J0985O082L6592L236p0613
14674B7622j18929K6912P8351L8011l6248K335J7196j8992M8269l5121K8806J2801
14662G1013L1708M6540k5554n1647j02274m8672J7271l944p2422O537k091l8492
14650a72027J6388Q4472J30022L2024o1420l2263J5113J8126o5179j5991j2979
14639f3714K8133R3811k406l9806p7479m7880M0463K4312L131J7846m5425j2084
14627h1098J01895J6723j2317n7172l1451j3819Q6497M9560l0010L8299n0571
14616A6536q6286K1278N1502K2589l5972N9380O1103J7860j6643l3955J0798p961
$$ plain form
14604 80229 -16366 -108950 -176001 -138305 -77875 -61865 -60937 -48776 -65733 -54931 -46097 -42328
14592 -42328 -6298 -4234 29951 103957 67616 33438 -15184 -29297 -42578 -126892 -106297 -63093
14580 -63093 -79095 -126039 -141516 -134822 -99067 -50168 12653 54574 63232 -7821 -77539 -97725
14568 -97725 -84527 -64867 -47777 2592 50316 38132 5872 3009 33246 90411 74696 48287
14556 48287 -3585 -9482 -39853 -39610 43429 68943 -13861 -79956 -63559 -33959 -84964 -56900
14544 -56900 -81260 -4542 22867 22022 -243 -40203 -44589 -44061 -204 -11483 -16885 -52024 -21269
14531 -21269 -2035 -33747 -71818 -49497 -9208 -2125 -57089 -35542 -63612 -8820 40786 104563
14519 104563 56778 -46984 -50140 2622 3493 -46857 -44978 -33722 -55662 -47691 -116905 -126616
$$ packed form
14604H0229r6595r2584o7051L7696O0430J6010R28J2161j6957J0802Q834L769
14592d2328L6030K064L4185P4006l6341l4178m8622j4113j3281q4314K0595M3204
14580f3093j6002m6944j5477O694L5755M8899O2821M1921Q658p1053o9718k0186
14568i7725J3198J9660J7090N0369M7724j2184l2260k863L0237N7165j5715k6409
14556D8287n1872n897l0371K43Q3039K5514q2804o6095J6397K9600n1005K8064
14544e6900k4360P6718K7409q45k2265l9960m386N28M3857j1279n402l5139L0755
14531b1269J9234l1712l8071K2321M0289P083n4964K1547k8070N4792M9606O3777
14519A04563m7785j03762l156N2762Q71n0350J879J1256k1940P971o9214r711
$$ plain form
14507 -126616 -78786 -77187 -128342 -136984 -158023 -121876 -102489 -120614 -164120 -178490 -126648 -98369
14495 -98369 -47351 -24929 -36791 -31789 -43536 -8596 28944 35988 75615 47660 69503 121325
14483 121325 83337 30670 32837 25202 13528 30467 2972 64602 92871 97629 76648 65592
14471 65592 56035 24101 69467 57833 38254 3143 40865 34579 -44951 -69026 -109511 -98074
14459 -98074 -59696 34047 56967 41081 -60793 7029 51360 56691 15008 53586 48246 -69162
14447 -69162 -62294 34492 13657 -43878 -52485 -74160 -103656 -27168 32721 -1527 29968 149056
14435 149056 95329 14620 -39357 -128321 -128127 -81455 -46639 24233 16725 -20125 -19370 -10902 -13456
14422 -13456 -88339 -96162 -92599 -64678 -22297 6787 -9579 -26586 -2701 -24403 -64462 -74613
$$ packed form
14507a26616M7830J599n1155q642k1039L6147J9387j8125m3506j4370N1842K8279
14495i8369N1018K2422j1862N002j1747L4940L7540P044L9627k7955K1843N1822
14483A21325l7988n2667K167p635j1674J6939k7495O1630K8269M758k0981j1056
14471F5592r557l1934M5366j1634j9579l5111L7722o286p9530k4075m0485J1437
14459i8074L8378R3743K2920j5886j01874O7822M4331N331m1683L8578n340j17408
14447f9162O868R6786k0835n7535q607k1675k9496P6488N9889l4248L1495J19088
14435A49056n3727q0709n3977q8964J94M6672L4816P0872p508l6850P55Q468k554
14422a3456p4883p823L563K7921M2381K9084j6366j7007K3885k1702m0059j0151
$$ plain form
14410 -74613 -65773 -44323 -34980 14764 70095 72364 31326 -13637 13653 60048 64725 43815
14398 43815 40561 -12052 30963 21210 -17789 -39577 -34950 -48041 -89811 -98420 -63098 -48955
14386 -48955 -35501 14834 68227 87977 70998 81909 124995 106722 43183 -644 53868 50089
14374 50089 -37792 7697 -10909 -50105 -22989 35467 110874 127346 102127 13072 -36288 -20905
14362 -20905 36917 89111 36097 88091 97747 82876 5110 45264 83480 100423 75344 4455
14350 4455 -55524 9174 52321 51669 -35983 -100353 -120415 -134377 -87907 -96719 -117799 -85469
14338 -85469 -71459 -40568 -38204 -18585 1711 40419 70320 58039 21623 -2091 -47390 -54548
14326 -54548 16674 21543 16317 41212 37344 -12441 -11302 -17543 -58622 -91518 -158033 -158803 -152041
$$ packed form
14410g4613Q840K1450R343M9744N5331K269m1038m4963K7290M6395M677k0910
14398D3815l254n2613M3015r753l8999k1788M627j3091m1770q609L5322J4143
14386d8955J3454N0335N3393J9750j6979J0911M3086j8273o3539m3827N4512l779
14374E0089q7881M5489j8606l9196K7116N8456P5407J6472k5219q9055m9360J5383
14362b0905N7822N2194n3014N1994R656j4871p7766M0154L8216J6943k5079p0889
14350D455n9979O4698M3147o52q7652o4370k0062j3962M6470q812k1080L2330
14338h5469J4010L0891K364J9619K0296L8708K9901j2281l6416k3714m5299p158
14326e4548P1222M869n226K4895l868m9785J139o241m1079l2896o6515p70O762
$$ plain form
14313 -152041 -128526 -164762 -134690 -60347 -104099 -106133 -93639 -93147 -698 105340 113567 48371
14301 48371 -31828 -14559 24402 3229 53418 107462 135371 96630 55322 20331 13399 59241
14289 59241 81718 59983 55198 19920 9369 498 11604 8973 -40827 11012 41564 48071
14277 48071 5943 -27342 -99074 -106718 -79586 -43218 -86449 -131395 -141172 -119211 -27058 -17442
14265 -17442 -11785 -42237 -12648 11173 -19141 -81451 -55907 18943 36904 66578 19229 -27890
14253 -27890 22167 14729 62658 46791 42840 12813 64174 114694 115238 134429 94800 33747
14241 33747 30235 22422 56354 49415 77028 59554 33067 32956 44958 80630 38284 -1720 -19018
14228 -19018 -69631 -57073 -17095 33452 21665 -16749 -43021 -49655 -65139 -55542 5378 55615
$$ packed form
14313a52041K3515l6236L0072P4343m3752k034J2494M92R2449J06038Q227o5196
14301D8371q0199J7269L8961k1173N0189N4044K7909l8741m1308l4991o932M5842
14289E9241K2477k1735m785l5278j0551q871J1106k631m9800N1839L0552O507
14277D8071m2128l3285p1732p644K7132L6368m3231m4946r777K1961R2153R616
14265a7442N657l0452K9589K3821l0314o2310K5544P4850J7961K9674m7349m7119
14253b7890N0057p438M7929j5867l951l0027N1361N0520N44J9191l9629o1053
14241C3747l512p813L3932o939K7613j7474k6487j11J2002L5672m2346m0004j7298
14228a9018n0613J2558L9978N0547j1787l8414k6272o634j5484R597O0920N0237
$$ plain form
14216 55615 19016 2840 16494 -496 -13172 -14956 22498 62451 37552 43909 44497 103446
14204 103446 131248 155334 123831 53754 -21478 10617 31480 50435 33605 47868 85391
14193 85391 52459 34859 39420 19857 28408 32178 -7199 -26262 -6288 -42068 -64088 -85324
14181 -85324 -77247 -45289 -36785 -40669 -73797 -38260 -31549 -81770 -44990 -86561 -131463 -203845
14169 -203845 -215053 -120096 -37856 -13537 -15959 -59758 -47760 -51697 -17092 -5771 -47979 -47690
14157 -47690 -55931 -23847 55565 100177 64589 71521 19949 -49245 -31389 -43568 -68430 -97227
14145 -97227 -6653 57721 20243 28435 24288 -12911 -11345 21809 25193 14071 -27902 -60107
14133 -60107 -39900 2609 -42783 -59587 -63531 -51542 -49802 -70026 -93050 -102580 -116597 -68982
$$ packed form
14216E5615l6599j6176J3654j6990j2676j784L7454L9953k4899O357N88N8949
14204A03446K7802K4086l1503p0077p5232L2095K0863J8955j6830J4263L7523
14193H5391l2932j7600M561j9563Q551L770l9377j9063J9974l5780k2020k1236
14181h5324Q077L1958Q504l884l3128L5537O711n0221L6780m1571m4902p2382
14169b03845j1208R4957Q2240K4319k422m3799J1998l937L4605J1321m2208K89
14157d7690q241L2084P9412M4612l5588O932n1572o9194J7856j2179k4862k8797
14145i7227R0574O4374l7478Q192m147l7199J566L3154L384j1122m1973l2205
14133f0107K0207M2509m5392j6804l944J1989J740k0224k3024r530j4017M7615
$$ plain form
14121 -68982 -36929 -19215 43129 42391 -19267 -55102 -91520 -22124 10886 -36171 -41673 -69874
14109 -69874 -40163 -5166 44255 7127 -32936 -27364 -25569 -2560 -13798 -24595 -74810 -120297
14097 -120297 -122064 -120489 -100378 -51483 -16277 -12088 -75647 -34988 2889 -16777 -3884 -8022
14085 -8022 -2749 -2557 -114492 -184149 -195657 -173345 -122448 -48358 -21082 52396 -16889 -71220
14073 -71220 -60397 -28006 -72144 -105109 -82147 -40955 -45595 -105072 -113435 -18055 82743 43085
14061 43085 79102 100976 70781 71423 49038 59752 43912 14259 42 -26224 -32850 -61685
14049 -61685 -36911 -41909 -98114 -69422 -96927 -40286 -11596 -53041 -59954 -50830 -57200 -66031 -94066
14036 -94066 -127832 -79070 -42811 -33312 -41216 -55464 -52283 -42390 -30944 -35339 -1900 32096 16517
$$ packed form
14121f8982L2053J7714O2344p38o1658l5835l6418O9396L3010m7057n502k8201
14109f9874K9711L4997M9421l7128m0063N572J795K3009j1238j0797n0215m5487
14097a20297j767J575K0111M8895L5206M189o3559M0659L7877j9666J2893m138
14085h022N273J92j11935o9657j1508K2312N0897P4090K7276P3478o9285n4331
14073g1220J0823L2391m4138l2965K2962M1192m640n9477q363R5380J00798l9658
14061D3085L6017K1874l0195O42k2385J0714j5840k9653j4217k6266o626k8835
14049f1685K4774m998n6205K8692k7505N6641K8690m1445o913R124o370q831k8035
14036i4066l3766M8762L6259R499p904j4248L181R893J1446m395L3439L3996j5579
$$ plain form
14023 16517 6142 39244 35841 6880 -18745 -53480 -89125 -80331 -40134 -2031 57568 63681
14011 63681 19960 18147 34167 43736 31534 10389 35860 33174 65444 58618 18991 -25133
13999 -25133 16186 122 -11068 -29192 -51536 8289 -15270 -23321 -12341 40292 49885 18510
13987 18510 64407 70741 56649 26809 -5200 19561 19063 79164 120944 43630 52509 91444
13975 91444 94644 59221 21671 23114 -8108 -38854 -122288 -126905 -51833 -38115 -29049 13680
13963 13680 72290 49609 19222 20372 -30412 -27895 -25989 -20132 -40361 -50774 -24601 27149
13951 27149 40766 1603 3639 -40120 -10589 -25572 -23685 47190 51299 37464 -84842 -127932
13939 -127932 -88251 -63119 -60168 -106837 -79748 -76933 -62684 -17745 -45790 -63287 -50097 1637
$$ packed form
14023A6517j0375L3102l403k8961k5625l4735l5645Q794M0197L8103N9599O113
14011F3681m3721j813J6020R569j2202k1145K5471k686L2270o826l9627m4124
13999b5133M1319j6064j1190j8124k2344N9825k3559q051J0980N2633R593l1375
13987A8510M5897O334j4092k9840l2009K4761m98O0101M1780p7314Q879L8935
13975I1444L200l5423l7550J443l1222l0746q3434m617P5072J3718R066M2729
13963A3680N8610k2681l0387J150n0784K517J906N857k0229j0413K6173N1750
13951B7149J3617l9163K036m3759K9531j4983J887P0875M109j3835j22306m3090
13939a27932L9681K5132K951m6669K7089K815J4249M4939k8045j7497J3190N1734
$$ plain form
13927 1637 -17748 -49898 -42869 -29001 -27546 -84512 -59253 -9586 19343 21444 793 19578
13915 19578 -79790 -177600 -123967 -71221 -10225 -13217 -3903 96683 71012 -39192 -34897 -11203
13903 -11203 -6656 23716 -7096 6509 -7864 -10799 -53693 -48254 -69640 -27366 -29878 -66765
13891 -66765 -174509 -160801 -76983 -58228 194 18000 11384 34507 26902 32291 11068 -33525
13879 -33525 -30538 -47364 -64166 -84527 -36814 1829 -26341 -112889 -101729 -78176 -117556 -69093
13867 -69093 -28418 23216 24616 -38102 -54711 -50189 -34071 -15565 -13731 -3819 7602 86697
13855 86697 34465 9303 41568 128719 112214 50931 36528 12216 72456 66805 26058 41297
13843 41297 63749 100568 102687 16011 -48498 -91805 -48890 18367 29083 31086 22892 3111
$$ packed form
13927A637j9385l2150P029J3868J455n6966K5259M9667K8929K101k0651J8785
13915A9578r9368r7810N3633N2746O0996k992R314J00586k5671j10204M295K3694
13903a1203M547L0372l0812J3605j4373k935m2894N439k1386M2274k512l6887
13891f6765j07744J3708Q3818J8755N8422J7806o616K3123p605N389k1223m4593
13879c3525K987j6826j6802k0361M7713L8643k8170q6548J1160K3553l9380M8463
13867f9093M0675N1634J400o2718j6609M522J6118J8506J834R912J1421P9095
13855H6697n2232k5162L2265Q7151j6505o1283j4403k4312O0240n651m0747J5239
13843D1297K2452L6819K119q6676o4509m3307M2915O7257J0716K003q194j9781
$$ plain form
13831 3111 -69810 -72739 -59688 -120741 -52608 66907 81385 42045 -17103 -116689 -187812 -110987
13819 -110987 -52165 -63686 -80326 -180561 -158263 -75302 -49574 -14038 3315 47273 60497
13808 60497 48967 60879 78054 4912 3526 12023 7443 -6512 17128 58706 58357 -3688 -55441
13795 -55441 -67765 -31732 -4549 -49057 -17979 -10481 -27055 -43254 -67474 -154318 -196782 -121257
13783 -121257 -56021 17799 71146 63389 56581 13522 -36696 -101688 -128990 -64539 -48236 -108641
13771 -108641 -112918 -51077 -212 -40053 -102314 -64436 8878 64796 79999 30540 20020 -3158
13759 -3158 -13945 16479 11388 -16918 58866 114318 66949 4256 4415 48889 36338 -21465
13747 -21465 -135942 -146017 -120676 -111549 -87053 -62180 -52757 -58204 -20572 -18443 -32544 34919
$$ packed form
13831C111p2921k929J3051o1053O8133J19515J4478l9340n9148r9586p1123P6825
13819a10987N8822j1521j6640j00235K2298Q2961K5728L5536J7353M3958J3224
13808F0497j1530J1912J7175p3142j386Q497m580j3955K3640M1578l49o2045n1753
13795e5441j2324L6033K7183m4508L1078P498j6574j6199k4220q6844m2464P5525
13783a21257O5236P3820N3347p757o808m3059n0218o4992k7302O4451J6303o0405
13771a08641m277O1841N0865l9841o2261L7878P3314N5918J5203m9459j0520k3178
13759c158j0787L0424n091k8306P5784N5452m7369o2693J59M4474j2551n7803
13747b1465j14477j0075K5341R127K4496K4873R423n447L7632K129j4101O7463
$$ plain form
13735 34919 88949 38247 -36050 -84529 -67378 1347 -5956 40785 48376 72399 89180 69121
13723 69121 80431 70068 37608 -37032 -60123 -78203 -121059 -112786 -7732 52548 8129 237
13711 237 -2194 1307 34870 37201 38807 87089 71523 33043 -8800 23243 -16422 32519 5415
13698 5415 -99076 -119064 -105797 -42648 13911 22125 23997 -11003 1104 14205 2412 -32197
13686 -32197 -7345 46521 40400 79322 51548 -4719 -41108 3889 -3838 -47257 -1344 46284
13674 46284 24582 44153 49758 60775 69471 -21195 -92544 -102968 -16485 -97437 -71730 -26237
13662 -26237 1771 -10105 7106 56330 76157 116479 71126 70771 74367 45062 55523 64146
13650 64146 38015 -15517 -32989 -10804 -52130 -35499 4978 -35050 -79605 -71847 -85725 -66034
$$ packed form
13735C4919N4030n0702p4297m8479J7151O8725p303M6741P591K4023J6781k0059
13723F9121J1310j0363l2460p4640k3091j8080m2856Q273J05054O0280m4419p892
13711B37k431L501L3563K331J606M8282j5566l8480m1843L2043l9665M8941k7104
13698E415j04491j9988J3267O3149N6559Q214J872l5000J2107J3101j1793l4609
13686c2197K4852N3866o121L8922k7774n6267l6389M4997p727m3419M5913M7628
13674D6284k1702J9571N605J1017Q696r0666p1349j0424Q6483q0952K5707M5493
13662b6237K8008j1876J7211M9224J9827M0322m5353l55L596k9305J0461Q623
13650F4146k6131n3532j7472K2185m1326J6631M0477m0028m4555P758j3878J9691
$$ plain form
13638 -66034 -13238 13933 -35868 -26627 7118 -27926 -14402 11552 53423 8762 -13783 -29811
13626 -29811 18006 60426 52034 121447 45960 62523 17024 -55341 -103564 -141665 -112908 -165456
13614 -165456 -240308 -208950 -131799 -134496 -71460 -40117 -36042 12295 -8876 -24521 40010 140843
13602 140843 120523 81414 48530 58875 -1727 -43316 10440 16818 45062 1365 -12798 -1585
13590 -1585 -2401 -25628 30628 41801 11620 202 3624 999 -3209 -14967 1504 -4111 -67896
13577 -67896 11387 96800 1011 -83494 -150037 -144676 -188651 -184379 -27573 7763 25835 41250
13565 41250 39365 35547 38521 -7863 22194 50055 50600 33869 5753 -45501 -82949 -66206 29656
13552 29656 45950 -51622 -78105 -54076 -71071 -76121 -66222 -83868 -99255 -93358 -17347 26863
$$ packed form
13638f6034N2796K7171m9801R241L3745l5044J3524K5954M1871m4661k2545j6028
13626b9811M7817M2420q392O9413p5487J6563m5499p2365m8223l8101K8757n2548
13614a65456p4852L1358P7151k697O3036L1343M075M8337k1171j5645O4531J00833
13602A40843k0320l9109l2884J0345o0602m1589N3756O378K8244m3697j4163J1213
13590a585q16k3227N6256J1173l0181j1418L422k625m208j1758J6471n615o3785
13577f7896P9283Q5413r5789q4505o6543N361m3975M272J56806L5336J8072J5415
13565D1250j885l818K974m6384L0057K7861N45j6731k8116n1254l7448J6743R5862
13552B9656J6294r7572k6483K4029j6995n050R899j7646j5387N897P6011M4210
$$ plain form
13540 26863 -19040 -35169 8427 85427 136941 108647 57581 -83 -59731 -40521 9592 7341
13528 7341 -22320 19660 48848 23533 -28831 -51106 -67938 -55139 -1239 -31507 -11629 15537
13516 15537 3346 -26328 3327 26062 -18863 -63479 -104984 -43799 52860 116146 64847 1656
13504 1656 3785 40151 75977 74938 77429 125742 136791 89145 37335 -32490 -13646 3199
13492 3199 -24997 -26967 -36159 -86219 -55075 -18145 -6676 -8245 -73551 -87934 -46689 -49092 14259
13479 14259 4119 20506 47710 4705 -9663 -17513 -60130 -28374 19182 25574 -12095 5853
13467 5853 39956 -14433 -98302 -10770 16766 -26491 -42974 11046 11547 -15892 -15103 31503 80786
13454 80786 83597 65159 75279 51116 -31323 -45518 -31431 -18560 -41661 -14230 -38020 -81359
$$ packed form
13540B6863m5903j6129M3596P7000N1514k8294n1066n7664n9648J9210N0113k251
13528G341k9661M1980K9188k5315n2364k2275j6832J2799N3900l0268J9878K7166
13516A5537j2191k9674K9655K2735m4925m4616m1505O1185R6659O3286n1299o3191
13504A656K129L6366L5826j039K491M8313J1049m7646n1810o9825J8844J6845
13492C199k8196j970r192n0060L1144L6930J1469j569o5306j4383M1245k403O3351
13479A4259j0140J6387K7204m3005j4368p850m2617L1756M7556O392l7669J7948
13467E853L4103n4389q3869Q7532K7536m3257j6483N4020N01k7439P89M6606M9283
13454H0786K811j8438J0120k4163q2439j4195J4087J2871k3101K7431k3790m3339
$$ plain form
13442 -81359 -50201 44878 83878 31035 -16009 5658 -4517 -19310 23246 31645 17862 -7580
13430 -7580 -28753 -120212 -150528 -88264 -57957 -52761 -80256 -58619 -2205 -75145 -78519 -40790
13418 -40790 6440 64518 65785 103860 48707 7478 -15089 -12595 -44779 40100 44991 10470
13406 10470 -23887 -37565 -18674 -955 38226 115151 42406 -80905 -146709 -133269 -57248
13395 -57248 -11642 -43078 -118452 -117706 -152108 -102947 -23430 -65080 -107072 -113251 -87251 4510
13383 4510 33064 59892 71598 -1418 -22518 -29009 20404 43118 -23142 -90786 -74670 -86397
13371 -86397 -108935 -126055 -86145 2035 7352 -14066 -37883 -283 38540 60100 1849 -40621
13359 -40621 -83821 -78264 -25142 459 25981 9208 51787 96908 124844 70078 3337 55790
$$ packed form
13442h1359L1158R5079L9000n2843m7044K1667j0175j4793M2556Q399j3783k5442
13430g580k1173r1459l0316O2264L0307N196k7495K1637N6414p2940l374L7729
13418d0790M7230N8078J267L8075n5153m1229k2567K494l2184Q4879M891l4521
13406A0470l4357j3678J8891J7719L9181P6925p2745j23311o5804J3440P6021
13395e7248M5606l1436p5374P46l4402M9161P9517m1650m1992o179K6000R1761
13383D510K8554K6828J1706p3016k1100o491M9413K2714o6260o7644J6116j1727
13371h6397k2538j7120L9910Q8180N317k1418k3817L7600L8823K1560n8251m2470
13359d0621m3200N557N3122K5601K5522j6773M2579M5121K7936n4766o6741N2453
$$ plain form
13347 55790 96414 44653 10034 9524 3312 40001 70169 35255 18627 -13353 4180 95160
13335 95160 113916 114546 73932 69887 7183 -25715 -63326 -38503 -30011 -71443 -86537 -42177
13323 -42177 -11145 -35706 -40504 21021 84977 -4395 -84747 -125892 -94588 -55606 9728 10845
13311 10845 -52763 -77717 -153041 -152495 -100574 -39966 9047 5524 -26114 -50262 -1695 55606
13299 55606 70963 57444 96366 47574 -54173 -19756 -11327 -4055 -66999 -93039 -74559 -63726
13287 -63726 -118054 -113481 -22512 18040 101578 99119 75420 43359 -4016 -37300 -3220 20082
13275 20082 36338 39123 69613 98249 128791 100315 74442 64855 49577 26378 -41407 -41499 14439
13262 14439 595 19832 -5058 -24679 -49312 -46888 -55552 -33899 10428 -46 -11078 -34376
$$ packed form
13347E5790M0624n1761l4619n10o212L6689L0168l4914j6628l1980J7533R0980
13335I5160J8756O30m0614m045o2704l2898l7611K4823Q492m1432j5094M4360
13323d2177L1032k4561m798O1525O3956q9372q0352m1145L1304L8982O5334J117
13311A0845o3608k4954p5324N46N1921O0608M9013l523l1638k4148M8567N7301
13299E5606J5357j3519L8922m8792j01747L4417Q429P272o2944k6040J8480J0833
13287f3726n4328M573R0969M0552Q3538k459k3699l2061m7375l3284L4080K3302
13275B0082J6256K785L0490K8636L0542k8476k5873r587j5278k3199o7785r2N5938
13262A4439j3844J9237k4890j9621k4633K424q664K1653M4327j0474j1032k3298
$$ plain form
13250 -34376 -38104 -70347 -52672 -45554 -5859 51070 4451 -10295 1949 92130 128981 119315
13238 119315 42238 -34263 -31421 -6561 -1378 -50471 -54480 -26662 -57945 -85002 -91154 -954
13226 -954 11650 -16481 37976 23652 31740 38299 30983 3993 1418 33410 -4739 -25275 18279
13213 18279 45862 49083 21138 67492 14815 -49845 -80248 -119304 -120970 -69295 -18444 -40682
13201 -40682 -50916 -81423 -56701 9258 12048 -28428 -55297 -39048 -52790 -62430 -10189 49410
13189 49410 901 -36379 -33409 -46803 -21491 24299 55721 56151 69492 71796 51106 52195 21821
13176 21821 -4876 46854 36444 -12379 -14530 99320 98065 64041 97725 120176 145225 119671
13164 119671 41418 9190 15752 -38733 -29570 -59416 -42243 -46355 -46489 5849 69299 63871 6213
$$ packed form
13250c4376l728l2243J7675P118L9695N6929m6619j4746J2244R0181L6851r666
13238A19315p7077p6501K842K4860N183m9093m009K7818l1283k7057o152R0200
13226i54J2604k8131N4457j4324Q088O559p316k6990k575L1992l8149k0536M3554
13213A8279K7583L221k7945M6354n2677o4660l0403l9056j666N1675N0851k2238
13201d0682j0234l0507K4722O5959K790m0476k6869J6249j3742r640N2241N9599
13189D9410m8509l7280K970j3394K5312M5790L1422M30J3341K304k0690J089l0374
13176B1821k6697N1730j0410m8823k151J13850j255l4024L3684K2451K5049k5554
13164A19671p8253l2228O562n4485R163k9846J7173m112j34N2338O3450n428n7658
$$ plain form
13151 6213 -26265 -34142 -15814 -9203 -3966 -26534 -50167 -87527 -89540 -118463 -90189 -46102 -17329
13138 -17329 -49559 -98495 -137422 -67390 -13892 44459 -22847 -78092 12370 21777 -21128 -30926
13126 -30926 -34148 18462 111362 78719 11921 -64401 -26910 47393 20796 -11693 -15061 -17563
13114 -17563 478 16295 -14157 -14432 -17869 34208 40437 -3896 74 49263 58892 76358 -869
13101 -869 7882 39443 50130 66577 47727 11343 6001 -12982 -675 -7591 -40059 -46602 -63582
13088 -63582 -27081 -25905 37633 29514 -17184 -45768 -41423 35838 54425 -14568 10319 46637
13076 46637 67209 42916 44152 20710 34200 -11122 -61146 -41813 -50059 -494 31043 -22136
13064 -22136 -4579 17079 -2400 -32017 -36076 -3042 22807 18029 -49564 -121626 -78489 -86115
$$ packed form
13151F213l2478p877J8328O611N237k2568k3633l7360k013k8923K8274M4087K8773
13138a7329l2230m8936l8927P0032N3498N8351o7306n5245R0462R407m2905r798
13126c0926l222N2610R2900l2643o6798p6322L7491P4303k6597l2489l368k502
13114a7563J8041J5817l0452k75l437N2077O229m4333L970M9189R629J7466p7227
13101h69Q751L1561J0687J6447j8850l6384n342j8983J2307o916l2468o543j6980
13088f3582L6501J176O3538q119m6698k8584M345P7261J8587o8993K4887L6318
13076D6637K0572k4293J236k3442J3490m5322n0024J9333q246M9565L1537n3179
13064b2136J7557K1658j9479k9617m059L3034K5849m778o7593p2062M3137p626
$$ plain form
13052 -86115 -53284 -25907 -47056 -37090 -36423 -47478 -22602 -56076 -26790 26749 19542 -13715
13040 -13715 19183 38723 -8473 -33530 -55429 -36074 -37395 -56666 -22661 -53567 -67838 -32059
13028 -32059 -22620 -30505 -19939 -56371 -109055 -55101 10695 41553 38651 55343 62102 47547
13016 47547 100504 117055 59863 -20799 -3167 53757 66152 -2527 27925 42824 -39380 -51801
13004 -51801 44217 59783 26526 21634 -14165 -58061 -37462 -26694 -30850 12611 47280 9409
12992 9409 13960 -4268 -7911 26787 -15646 -22997 36730 48913 29949 -22132 6048 102445
12980 102445 19207 -44620 741 84900 40984 31793 43527 56316 71253 92150 40126 -66002
12968 -66002 -7605 8234 -46797 -26930 -52018 -83916 -83818 -62580 -24306 9161 -55312 -78699
$$ packed form
13052h6115L2831K7377k1149R966O67j1055K4876l3474K9286N3539p207l3257
13040a3715L2898J9540m7196k5057k1899J9355j321j9271L4005l0906j4271L5779
13028c2059R439p885J0566l6432n2684N3954O5796L0858k902J6692O759j4555
13016D7547N2957J6551n7192q0662J7632N6924J2395o8679L0452J4899q2204j2421
13004e1801R6018J5566l3257m892l5799m3896K0599J0768m156M3461L4669l7871
12992I409M551j8228l643L4698m2433p351N9727J2183j8964n2081K8180R6397
12980A02445q3238o3827M5361Q4159m3916r191J1734J2789J4937K0897n2024j06128
12968f6002N8397J5839n5031J9867k5088l1898R8K1238L8274L3467o4473k3387
$$ plain form
12956 -78699 -35005 -16051 -5901 -30083 -86464 -110290 -118997 -105687 -81603 -36587 -70139 -28169
12944 -28169 27347 11879 46581 118135 131145 88836 63449 99829 90783 12631 21551 40067
12932 40067 40445 4805 -8104 -9543 -1122 -18685 -77967 -84935 -50453 -21685 -32166 -85646 -66010
12919 -66010 -53897 -17558 24462 53564 70640 76641 31643 25150 91673 50475 57070 63169
12907 63169 100871 83075 97997 45623 -4789 58354 137502 103888 -7144 -61215 -27894
12896 -27894 -33044 -38418 44695 73382 77965 22482 2797 71055 74787 -5039 -37997 -55690
12884 -55690 -31527 70907 108613 11833 -61668 13839 9180 -1071 -42231 26814 69165 78749
12872 78749 96843 71977 11451 -29650 -22034 -28996 -35880 -71740 -36286 -1892 6197 36604
$$ packed form
12956g8699M3694J8954J0150k4182n6381k3826q707J3310K4084M5016l3552M1970
12944b8169N5516j5468L4702P1554J3010m2309k5387L6380r046p8152Q920J8516
12932D0067L78l5640j2909j439Q421j7563n9282o968L4482K8768j0481n3480J9636
12919f6010J2113L6339M2020K9102J7076O001m4998o493O6523m1198O595O099
12907F3169L7702j7796J4922n2374n0412O3143P9148l3614j11032n4071L3321
12896b7894n150n374Q3113K8687M583n5483j9685O8258L732p9826l2958j7693
12884e5690K4163J02434L7706r6780p3501P5507m659j0251m1160O9045M2351R584
12872G8749J8094k4866o0526m1101P616o962o884l5860L5454L4394Q089L0407
$$ plain form
12860 36604 3538 -71080 -126069 -92294 22175 64943 88781 59713 -54121 -58785 -3385
12849 -3385 9861 18034 40275 54787 69585 24491 19830 -9978 -51218 6669 63466 51720
12837 51720 30353 -14560 15975 69085 37938 78278 44490 -12670 -6057 -54890 -66180 -17861
12825 -17861 15272 31131 60555 36455 48460 70961 43987 7429 6843 -13298 -49350 -6068
12813 -6068 -20606 17161 63728 78766 56166 -15339 -9834 -29043 -88561 -109589 -56649 -34567
12801 -34567 -50072 -85880 -46740 -6570 25809 40741 -9491 -53090 -58485 -43339 -19530 -31694
12789 -31694 -58420 -59774 -79624 -56428 7624 -7505 -19045 -31361 -12368 3812 23086 -17025
12777 -17025 2306 -1177 -53095 -87992 -157867 -172473 -128987 -34631 -66777 -55370 34584 47647
$$ packed form
12860C6604l3066p4618n4989L3775J14469M2768K3838k9068j13834m664N5400
12849c385J3246Q173K2241J4512J4798m5094m661k9808m1240N7887N6797j1746
12837E1720k1367m4913L0535N3110l1147M0340l3788n7160O613m8833j1290M8319
12825a7861L3133J5859K9424k4100J2005K2501k6974l6558n86k0141l6052M3282
12813f068j4538L7767M6567J5038k2600p1505N505j9209n9518k1028N2940K2082
12801c4567j5505l5808L9140M0170L2379J4932n0232m3599n395J5146K3809j2164
12789c1694k6726j354j9850K3196O4052j5129j1540j2316J8993J6180J9274m0111
12777a7025J9331l483n1918l4897o9875j4606M3486R4356l2146J1407Q9954J3063
$$ plain form
12765 47647 91105 127646 110441 80281 136335 164714 230476 199560 91650 88201 84809 36907
12753 36907 -27955 -56469 -39359 -32637 20534 64190 40216 4826 10625 -19600 -66219 -11138
12741 -11138 2414 -36690 -7781 -18548 -56202 -41969 -45668 -69155 -128679 -129744 -108468 -54846
12729 -54846 -73988 -77334 -74465 -13929 63096 76729 60300 -4900 9266 32428 48446 112729
12717 112729 115704 59744 44953 38050 -16846 36584 69359 77621 22646 -9641 23408 32651
12705 32651 1689 -9626 -79511 -64186 -6878 39139 73443 -29493 -67067 -45375 -1268
12694 -1268 62857 113928 84699 30006 -5928 -16620 -44638 -94174 -61968 -115336 -182286 -156723
12682 -156723 -62496 64126 72478 12537 17777 35000 70723 54559 -2572 13942 22888 31533
$$ packed form
12765D7647M3458L6541j7205l0160N6054K8379O5762l0916j07910l449l392m7902
12753C6907o4862k8514J7110O722N3171M3656k3974l5390N799l0225m6619N5081
12741a1138J3552l9104K8909j0767l7654J4233l699k3487n9524j065K1276N3622
12729e4846j9142l346K869O0536P7025J3633j6429o5200J4166K3162J6018O4283
12717A12729K975n5960j4791o903n4896N3430L2775Q262n4975l2287L3049R243
12705C2651l0962j1315o9885J5325N7308M6017L4304j02936l7574K1692M4107
12694a268O4125N1071k9229n4693l5934j0692k8018m9536L2206n3368o6950K5563
12682a56723R4227J26622Q352n9941N240J7223L5723j6164n7131J6514Q946Q645
$$ plain form
12670 31533 -2965 1807 -100012 -104387 -33939 18635 23261 -4085 -49039 -94717 -117583 -123095
12658 -123095 -30719 53600 87121 81002 38123 38623 15166 2523 9545 41025 3596 -14087
12646 -14087 -7590 44337 -968 -5456 61154 37323 63341 55522 14999 -39008 -875 10811
12634 10811 31115 85684 105324 87253 69544 23649 8642 3973 21138 66196 -3747 39642
12622 39642 42396 13224 81925 72723 -3765 -38169 7447 23294 -65134 -161901 -143853 -51617
12610 -51617 -24052 -65330 -42380 -32990 21468 11203 -51859 11862 14078 -22363 45072 97759
12598 97759 24578 7474 26792 -28242 -73023 -62769 5767 74699 79118 9980 47776 71618
12586 71618 23003 32441 23163 -38676 -71438 -43591 33666 1425 5488 25236 -26072 -40284
$$ packed form
12670C1533l4498M772j01819m375P0448N2574M626k7346m4954m5678k2866n512
12658a23095R2376Q4319L3521o119m2879N00k3457j2643P022L1480l7429j7683
12646a4087O497N1927m5305m488O6610k3831K6018p819m0523n4007L8133J1686
12634A0811K0304N4569J9640j8071j7709m5895j5007m669J7165M5058o9943M3389
12622C9642K754k9172O8701r202p6488l4404M5616J5847q8428r6767J8048R2236
12610e1617K7565m1278K2950R390N4458j0265o3062O3721K216l6441O7435N2687
12598I7759p3181j7104J9318n5034m4781J0254O8536O8932M419o9138L7796K3842
12586G1618m8615R438r278o1839l2762K7847P7257l2241M063J9748n1308j4212
$$ plain form
12574 -40284 -17526 -2434 -28540 17564 53874 58768 10497 -21118 37003 92049 126375 105906
12562 105906 42477 -6504 19504 -36657 -50501 48434 136244 172747 129774 71911 -14969
12551 -14969 -13781 -41332 -58329 -19231 -45298 -83815 -93562 -30616 -1338 1822 -18010 -48756
12539 -48756 -32953 14673 53947 47758 -38593 -52463 19006 11600 44787 5484 -27430 7978
12527 7978 43223 -49504 -92444 -40445 41862 48649 -71383 -65930 -87448 -43596 27255 18238
12515 18238 -4620 9773 41529 -6839 -67604 -107071 -72283 -75343 -84378 -46268 -1625 8987
12503 8987 -66337 -56408 8665 -3712 12202 -7071 19327 -8502 -61075 -83718 -109268 -139377
12491 -139377 -69055 -63309 -90016 -125832 -48821 25708 44304 -11638 20682 25913 11401 1868
$$ packed form
12574d0284K2758J5092k6106M6104L6310M894m8271l1615N8121N5046L4326k0469
12562A05906o3429m8981K6008n6161j3844R8935Q7810L6503m2973n7863q6880
12551a4969J188k7551j6997L9098k6067l8517r747O2946K9278L160j9832l0746
12539d8756J5803M7626L9274o189q6351j3870P1469p406L3187l9303l2914L5408
12527G978L5245r2727m2940N1999Q2307O787j20032N453k1518M3852P0851r017
12515A8238k2858J4393L1756m8368o0765l9467L4788l060r035L8110M4643J0612
12503H987p5324R929O5073j2377J5914j9273K6398k7829n2573k2643k5550l0109
12491a39377P0322N746k6707l5816P7011P4529J8596n5942L2320N231j4512r533
$$ plain form
12479 1868 10506 -25410 -126401 -117612 -70988 -3540 -30371 -15178 72274 58555 -9570 12144
12467 12144 -49997 -74521 -9241 1193 -50104 -37287 -61430 -52341 -144528 -140368 -121009 -110535
12455 -110535 -34965 -33219 13825 33666 51408 38193 10073 -21781 -24546 4786 45534 51493
12443 51493 15425 -62675 -39289 35080 48890 29027 13647 -17355 62347 73641 42489 54707
12431 54707 -19809 -45808 -25748 -47348 -8955 -34723 -565 -81724 -155683 -124140 -42064 -29669
12419 -29669 -72341 -34647 -5676 -40181 -64619 -23982 -68015 -70413 -72439 -112933 -49033 -19409
12407 -19409 -33159 -4549 22793 7095 11344 10655 -18503 -55012 -22235 -13512 54485 65929
12395 65929 32330 10702 16534 -12625 -53857 -29861 -8019 45643 -17578 -86433 -5553 -27069
$$ packed form
12479A868Q638l5916j00991Q789M6624O7448k6831J5193Q7452j3719o8125K1714
12467A2144o2141k4524O5280J0434n1297J2817k4143R089r2187M160J9359J0474
12455a10535P5570J746M7044J9841J7742j3215k8120l1854k765K9332M0748N959
12443E1493l6068p8100K3386P4369J3810j9863j5380l1002P9702J1294l1152J2218
12431E4707p4516k5999K0060k1600L8393k5768L4158q1159p3959L1543Q2076J2395
12419b9669m2672L7694K8971l4505k4438M0637m4033k398k026m0494O3900K9624
12407a9409j3750K8610K7342j5698M249o89k9158l6509L2777Q723O7997J1444
12395F5929l3599k1628N832k9159m1232K3996K1842N3662o3221o8855Q0880k1516
$$ plain form
12383 -27069 -30395 -86723 -65246 -55203 -75501 -90287 -75355 -20350 17668 -41719 -110739 -153250
12371 -153250 -104065 -30091 26901 13447 -8315 -115546 -112387 -91476 -161363 -177582 -191335
12360 -191335 -118335 -81573 -57486 -36875 26195 12425 -46855 -43782 24295 35168 56112 -3414
12348 -3414 -112466 -101059 -90569 -79735 -68204 -122389 -67542 9791 4300 -55052 -105108 -80212
12336 -80212 -130437 -161366 -171975 -163693 -122923 -107579 -109839 -135071 -109492 -80834 -117030 -115695
12324 -115695 -44854 5263 -16639 -65279 -61103 24484 51976 74338 3307 -26978 -68925 -89775
12312 -89775 -11833 20792 3015 -14450 -8444 -90760 -83836 -21823 -10737 -91556 -101480 -32202
12300 -32202 17411 38969 36221 58806 29155 7609 17498 -34352 -108095 -111975 -68506 1111
$$ packed form
12383b7069l326n6328K1477J0043k0298j4786J4932N5005L8018n9387o9020m2511
12371a53250M9185P3974N6992j3454k1762j07231L159K0911o9887j6219j3753
12360a91335P3000L6762K4087K0611O3070j3770n9280L073O8077J0873K0944n9526
12348c414j09052J1407J0490J0834J1531n4185N4847P7333n491n9352n0056K4896
12336h0212n0225l0929j0609Q282M0770J5344k260k5232K5579K8658l6196J335
12324a15695P0841N0117k1902m8640M176Q5587K7492K2362p1031l0285m1947k0850
12312h9775P7942L2625j7777j7465O006q2316O924O2013J1086q0819r924O9278
12300c2202M9613K1558k748K2585k9651k1546R889n1850p3743l880M3469O9617
$$ plain form
12288 1111 -34134 -35874 -95728 -90191 -22812 7564 2966 -20637 -26221 1703 -13349 38300 29057
12275 29057 -46918 -64199 62315 58681 -5659 13233 -4823 7006 27204 27890 2561 54738
12263 54738 18186 -33230 -70527 -68661 -23553 19525 43976 26604 -43929 -24153 -6646 -62078
12251 -62078 -35691 -44113 -68456 -68808 -63778 -37714 6258 26432 -4526 -7610 -27032 4608 86625
12238 86625 114943 96577 65171 34152 66136 92035 169508 177081 142168 66864 -43914 -83750
12226 -83750 -70154 -48596 -8261 -60443 -119743 -101344 -89191 -105818 -159289 -124766 -122521 -100352
12214 -100352 -111017 -15319 26664 36498 -9387 68437 107281 42666 89 -65076 -23492 66996
12202 66996 35066 -47715 -20377 8352 -13418 -49555 9796 59159 59782 2523 -67363 -89396
$$ packed form
12288A111l5245j740n9854N537O7379L0376m598k3603n584K7924j5052N1649r243
12275B9057p5975j7281J26514l634o4340J8892j8056J1829K0198O86k5329N2177
12263E4738l6552n1416l7297J866M5108M3078K4451j7372p0533J9776J7507n5432
12251f2078K6387q422k4343l52N030K6064M3972K0174l0958l084j9422L1640Q2017
12238H6625K8318j8366l1406l1019L1984K5899P7473P573l4913p5304j10778l9836
12226h3750J3596K1558M0335n2182n9300J8399J2153j6627n3471L4523K245K2169
12214a00352j0665R5698M1983R834m5885P7824L8844o4615m2577o5165M1584R0488
12202F6996l1930q2781K7338K8729k1770l6137N9351M9363O23n7259o9886k2033
$$ plain form
12190 -89396 -72240 -57615 -121151 -115647 -91186 -19654 8087 -6273 -1364 37391 75297 183631
12178 183631 202786 224815 203241 159147 126592 75398 -16000 -6960 26432 30183 48993 49686
12166 49686 1143 -21329 61700 84067 99572 136904 77262 15950 -1045 -93012 -113610 -73209
12154 -73209 -42040 -55097 -43889 -20011 -29018 -55203 -70294 -47608 -26947 -18920 25122 40445
12142 40445 30310 47966 79030 65438 2263 -4118 -61499 -163276 -141957 -116578 -90924 -53681
12130 -53681 -41745 -33156 -69770 -132774 -80724 -61238 -41309 -75672 -162014 -168848 -125022 -161767
12118 -161767 -182881 -141259 -115214 -118505 -152544 -183671 -119217 -81530 -48676 -46081 -56593 31755
12106 31755 146821 105256 55772 58164 68358 72159 53494 43005 50296 46379 78859 106215
$$ packed form
12190h9396J7156J4625o3536N504K4461P1532K7741j4360M909L8755L7906J08334
12178A83631J9155K2029k1574m4094l2555n1194r1398R040L3392L751J8810O93
12166D9686m8543k2472Q3029K2367J5505L7332n9642o1312j6995r1967k0598M0401
12154g3209L1169j3057J1208K3878r007k6185j5091K2686K0661Q027M4042J5323
12142D0445j0135J7656L1064j3592o3175o381n7381j01777K1319K5379K5654L7243
12130e3681J1936Q589l6614o3004N2050J9486J9929l4363q6342o834M3826l6745
12118a61767k1114M1622K6045l291l4039l1127O4454L7687L2854K595j0512Q8348
12106C1755J15066m1565m9484K392J0194L801j8665j0489P291l917L2480K7356
$$ plain form
12094 106215 131131 113418 79091 67713 -605 -50269 -91123 -80187 8716 -14971 -96635
12083 -96635 -106070 -73597 -39991 -45077 -8337 43171 111247 161046 192772 179114 186828 210266
12071 210266 189534 156752 115918 78558 70338 53128 120712 211774 207990 129180 111651 56701
12059 56701 105340 166658 217040 281316 337482 417389 540968 639816 652630 501108 252700
12048 252700 -67785 -230433 -278160 -303568 -290357 -248497 -187632 -152783 -175662 -221660 -202506
12037 -202506 -174699 -148265 -124689 -139053 -140621 -119306 -109405 -83458 -91719 -57942 -36158 -50160
12025 -50160 -23625 -43559 -66875 -66188 -80893 -52283 -107565 -164765 -170545 -76100 -39072 -31934
12013 -31934 -55709 -104851 -123584 -122741 -73135 -48164 14304 49412 -4586 -44329 52477 124104
$$ packed form
12094A06215K4916j7713l4327j1378o8318m9664m0854J0936Q8903k3687q1664
12083i6635r435L2473L3606n086L6740N1508O8076M9799L1726j3658P714K3438
12071B10266k0732l2782m0834l7360q220j7210O7584R1062l784p8810j7529n4950
12059E6701M8639O1318N0382O4276N6166P9907J23579R8848J2814j51522k48408
12048B52700l20485j62648m7727k5408J3211M1860O0865L4849k2879m5998J9154
12037b02506K7807K6434K3576j4364j568K1315R901K5947q261L3777K1784j4002
12025e0160K6535j9934k3316O87j4705K8610n5282n7200n780R4445L7028P138
12013c1934k3775m9142j8733Q43M9606K4971O2468L5108n3998l9743R6806P1627
$$ plain form
12001 124104 112519 84619 86391 41053 42338 68732 59066 124048 70596 -18039 -26541 -3021
11989 -3021 49914 104946 106345 85672 121418 56536 -36374 10935 36793 54892 167302 186718
11977 186718 219753 314559 353447 239098 257388 260200 364842 457238 431417 429873 437665 472611
11965 472611 556895 627817 661833 742683 826182 891031 916466 1064175 1153689 1137246 1131851
11954 1131851 1151676 1207598 1284519 1451154 1659593 1826179 1885126 2046208 2235954 2403927
11944 2403927 2629571 2989493 3455105 3968305 4469484 5081651 5926323 6904128 8094001
11935 8094001 9490816 11100012 13185067 15947462 19806103 25397788 33544310 45828765
11927 45828765 65065153 96222131 147355685 229121817 339113199 406766129 339111024
$$ packed form
12001A24104j1585k7900J772m5338J285K6394r666O4982n3452q8635q502K3520
11989c021N2935N5032J399k0673L5746o4882r2910M7309K5858J8099J12410J9416
11977A86718L3035R4806L8888j14349J8290K812J04642R2396k5821j544P792L4946
11965D72611Q4284P0922L4016Q0850Q3499O4849K5435J47709Q9514j6443n395
11954A131851J9825N5922P6921J66635K08439J66586N8947J61082J89746J67973
11944B403927K25644L59922M65612N13200N01179O12167Q44672R77805J189873
11935H094001J396815J609196K085055K762395L858641N591685Q146522J2284455
11927D5828765J9236388L1156978N1133554Q1766132J09991382O7652930o7655105
$$ plain form
11920 339111024 223437229 143346069 96808307 69251118 51932306 40447569 32410606
11913 32410606 26550941 22121991 18633128 15770722 13476680 11774757 10356887 9184007
11905 9184007 8187603 7407425 6616252 5992015 5565381 5126946 4692331 4368071 4089015
11896 4089015 3824153 3539809 3285163 3066863 2855609 2691500 2556834 2387202 2284323
11887 2284323 2158502 2049370 1972172 1904550 1839171 1750507 1652019 1568076 1526730 1437694 1361612
11876 1361612 1308871 1260333 1193970 1134729 1156630 1140744 1091480 1097973 1060652 1003941 989046
11865 989046 920348 959437 986314 990236 899574 868510 839074 840275 859243 841226 837940 834733
11853 834733 753166 749921 776464 748997 752433 766349 681995 631211 595561 560181 515603 511645
$$ packed form
11920C39111024j15673795q0091160m6537762k7557189j7318812j1484737q036963
11913C2410606n859665m428950l488863k862406k294042j701923j417870j172880
11905I184007r96404p80178p91173o24237m26634m38435m34615l24260k79056
11896D089015k64862k84344k54646k18300k11254j64109j34666j69632j02879
11887B284323j25821j09132p7198o7622o5379q8664r8488q3943m1346q9036p6082
11876A361612n2741m8538o6363n9241K1901j5886m9264O493l7321n6711j4895
11865I89046o8698L9089K6877L922r0662l1064k9436J201J8968j8017l286l207
11853H34733q1567l245K6543k7467L436J3916q4354n0784l5650l5380m4578l958
$$ plain form
11841 511645 536651 534292 556348 504157 545292 593864 509693 459010 464394 481269 489538 506060
11829 506060 518200 439348 413905 429961 405936 377111 365711 357118 388467 386160 430748 392025
11817 392025 319836 398888 404103 395117 374722 405971 376962 378218 462975 461330 409929 405107
11805 405107 493720 532062 556917 612490 650423 713243 781762 828410 896110 852651 584862
11794 584862 242785 24556 -33743 -41244 -24398 -9909 27771 39069 36536 64856 66152 25633
11782 25633 14169 -12620 22052 35776 54819 44190 47576 15268 -3259 -68013 -99990 -120749
11770 -120749 -95612 -135615 -109679 13438 26484 -2227 24482 3028 12087 38949 71553
11759 71553 88075 107497 75170 57036 66947 33019 24633 27143 11643 10572 102054 81126
$$ packed form
11841E11645K5006k359K2056n2191M1135M8572q4171n0683N384J6875Q269J6522
11829E06060J2140p8852k5443J6056k4025k8825j1400q593L1349k307M4588l8723
11817C92025p2189P9052N215q986k0395L1249k9009J256Q4757j645n1401m822
11805D05107Q8613L8342K4855N5573L7933O2820O8519M6648O7700m3459k67789
11794E84862l42077k18229n8299p501J6846J4489L7680J1298k533K8320J296m0519
11782B5633j1464k6789L4672J3724J9043j0629L386l2308j8527o4754l1977k0759
11770a20749K5137m0003K5936J23117J3046k8711K6709k1454R059K6862L2604
11759G1553J6522J9422l2327j8134R911l3928q386K510j5500j071R1482k0928
$$ plain form
11747 81126 44834 75510 111054 155568 183808 174289 56973 -10152 -23937 -17386 57098 152931
11735 152931 252296 265624 256961 207611 165071 177761 205255 184891 112122 100153 137934 164276
11723 164276 192516 144414 109200 183040 202454 150369 120599 82599 119309 106919 44471
11712 44471 57726 85938 85517 87306 92348 158003 138570 122674 116214 129427 112173 51634 83389
11699 83389 105820 62515 30593 81423 139590 127317 42180 62362 103522 112744 113138 97996
11687 97996 179752 144560 14184 78461 167719 185808 126109 73159 77654 114142 164086 188995
11675 188995 208387 116894 101534 118529 95152 54376 26163 30555 54432 71881 92358 71349
11663 71349 1734 -18197 61361 105005 113941 95500 80274 84757 67975 65046 89193 156894
$$ packed form
11747H1126l6292L0676L5544M4514K8240r519j17316o7125j3785O551P4484R5833
11735A52931R9365J3328q663m9350m2540J2690K7494k0364p2769j1969L7781K6342
11723A64276K8240m8102l5214P3840J9414n2085k9770l8000L6710j2390o2448
11712D4471J3255K8212m21J789N042O5655j9433j5896o460J3213j7254o0539L1755
11699H3389K2431m3305l1922N0830N8167j2273q5137K0182M1160R222L94j5142
11687I7996Q1756l5192j30376O4277Q9258J8089n9699n2950M495L6488M9944K4909
11675A88995J9392r1493j5360J6995k3377m0776k8213M392K3877J7449K0477k1009
11663G1349o9615j9931P9558M3644Q936j8441j5226M483j6782k929K4147O7701
$$ plain form
11651 156894 156643 147193 145520 82911 50053 51758 43977 112548 24394 1020 41936 43857 57925
11638 57925 50935 19084 53500 132706 141762 134626 115886 79764 48754 -6052 8981 40601
11626 40601 42920 79878 81197 73899 139062 181190 151270 125362 161587 170283 92691 -59278
11614 -59278 -187313 -197866 -171525 -152168 -162349 -70599 -52146 -130166 -87000 -29711 -9803
11603 -9803 -9973 -1679 -3869 2168 -12080 -59069 -37946 -2470 23317 16874 -1127 59040 113365
11590 113365 18052 -6881 -13846 -27188 -46424 -82162 -71933 40182 -1416 -57339 9410
11579 9410 94160 50498 45652 135518 183311 171835 124689 63128 80883 59348 93254 90995
11567 90995 -2759 -28853 -17132 39980 106356 58989 81156 140520 120367 95492 36429 -22730
$$ packed form
11651A56894k51r450j673o2609l2858J705p781O8571q8154k3374M0916J921J4068
11638E7925o990l1851L4416P9206R056p136j8740l6122l1010n4806J5033L1620
11626D0601K319L6958J319p298O5163M2128k9920k5908L6225Q696p7592j51969
11614e9278j28035j0553K6341J9357j0181R1750J8453p8020M3166N7289J9908
11603i803j70Q294k190O037j4248m6989K1123L5476K5787o443j8001O0167N4325
11590A13365r5313k4933o965j3342j9236l5738J0229J12115m1598n5923O6749
11579I410Q4750m3662m846Q9866M7793j1476m7146o1561J7755k1535L3906k259
11567I0995r3754k6094J1721N7112O6376m7367K2167N9364k0153k4875n9063n9159
$$ plain form
11555 -22730 -36496 -42154 -3098 51384 89424 55333 5820 53664 51756 72443 113859 71473
11543 71473 47609 51020 58086 73332 50862 44624 40006 44514 29758 20579 -11477 -76046 -56542
11530 -56542 -59978 -56946 -53027 -64628 -92741 -86880 -54503 15170 29928 -8365 -27225 -6496
11518 -6496 -22763 -60361 -116612 -106850 1297 4195 -31029 -56001 -107562 -93317 -64913 -74811
11506 -74811 -18871 -20610 -8355 26259 46723 4915 -63235 7113 55196 57037 -5742 -70225
11494 -70225 -65259 15724 51235 4599 -22576 -3217 65074 161352 245532 235476 124300 11206
11482 11206 46603 103213 59758 -5611 -32622 -40103 -70728 -15615 9166 -20776 714 33141
11470 33141 4681 4131 16561 43582 77739 108354 66334 31472 37473 -16895 -127492 -137538
$$ packed form
11555b2730j3766n658L9056N4482L8040l4091m9513M7844j908K0687M1416m2386
11543G1473k3864L411P066J5246k2470o238m618M508j4756r179l2056o4569J9504
11530e6542l436L032L919j1601k8113N861L2377O9673J4758l8293j8860K0729
11518f496j6267l7598n6251R762J08147K898l5224k4972n1561J4245K8404r898
11506g4811N5940j739J2255L4614K0464m1808o8150P0348M8083J841o2779o4483
11494g0225M966Q0983L5511m6636k7175J9359O8291R6278Q4180j0056j11176j13094
11482A1206L5397N6610m3455o5369k7011p481l0625N5113K4781k9942K1490L2427
11470C3141k8460n50J2430K7021L4157L0615m2020l4862O001n4368j10597j0046
$$ plain form
11458 -137538 -162175 -102081 -14671 -1351 47149 83718 65554 44868 30964 63261 98094
11447 98094 149820 99385 40289 45410 10669 821 -21141 -31448 -33815 -73865 -98052 -85053
11435 -85053 -58513 -40477 -89035 -115207 -31768 -3599 -24552 13130 -10306 27186 61510 33143
11423 33143 52390 -32365 -53193 -25147 33499 -689 -48637 -48655 474 13989 41220 65394
11411 65394 53335 -16839 -24168 24333 -5120 26401 119862 102871 38343 50692 48545 -88
11399 -88 27337 29859 -60882 -108999 -69568 -6119 -5623 -40345 -12868 -18469 21743 25514 58265
11386 58265 54003 -21849 -74198 -68127 -61886 29166 118465 145709 107941 65653 21968 -17493
11374 -17493 -40210 -29760 10902 19453 34774 11957 -9630 -49203 -34124 -684 -10778 -62604
$$ packed form
11458a37538k4637O0094Q7410J3320M8500L6569j8164k0686j3904L2297L4833
11447I8094N1726n0435n9096N121l4741r848k1962j0307k367m0050k4187J2999
11435h5053K6540J8036m8558k6172Q3439K8169k0953L7682k3436L7492L4324k8367
11423C3143J9247q4755k0828K8046N8646l4188m7948j8M9129J3515K7231K4174
11411F5394j2059p0174p329M8501k9453L1521R3461j6991o4528J2349k147m8633
11399h8K7425K522r0741m8117L9431O3449M96l4722K7477n601M0212L771L2751
11386E8265m262p5852n2349O071O241R1052Q9299K7244l7768m2288m3685l9461
11374a7493k2717J0450M0662Q551J5321k2817k1587l9573J5079L3440j0094n1826
$$ plain form
11362 -62604 -77925 -52839 -41466 -62585 -45387 -15523 -17300 -90693 -123019 -34459 47285 81488
11350 81488 35922 -19664 -74285 -111482 -97631 -91764 -51936 5158 39351 14672 44918 94308
11338 94308 55590 30885 25916 10924 31118 45600 60950 35466 39012 34058 -21914 -38751
11326 -38751 -11682 39559 32185 -31720 -38762 -9852 35498 -13324 -90342 -83492 -93119 -90444 -81956
11313 -81956 -69527 -22179 -23598 21175 77134 15004 -42538 -47544 -19986 41317 49291 27223
11301 27223 -12798 -82287 -66436 -11154 76008 79966 38668 3338 -32749 -15180 31575 63638
11289 63638 111720 117581 36289 -12836 -55329 20070 82715 55079 30138 26728 18740 61069
11277 61069 47716 -43986 -6716 -9579 -33886 -37095 -100164 -194275 -212131 -97201 -81651 -99448
$$ packed form
11362f2604j5321K5086J1373k1119J7198K9864j777p3393l2326Q8560Q1744L4203
11350H1488m5566n5586n4621l7197J3851N867L9828N7094L4193k4679L0246M9390
11338I4308l8718k4705m969j4992K0194J4482J5350k5484L546m954n5972j6837
11326c8751K7069N1241p374o3905p042K8910M5350m8822p7018O850r627K675Q488
11313h1956J2429M7348j419M4773N5959o2130n7542n006K7558O1303P974k2068
11301B7223m0021o9489J5851N5282Q7162L958m1298l5330l6087J7569M6755L2063
11289F3638M8082N861q1292m9125m2493P5399O2645k7636k4941l410p988M2329
11277F1069j3353r1702L7270k863k4307l209o3069r4111j7856J14930J5550j7797
$$ plain form
11265 -99448 -101472 -97704 -113101 -121766 -99188 -90507 2341 100857 119294 135521 117161 124645 82626
11252 82626 71640 63287 74731 58512 59829 85043 77060 106744 129659 100042 51197 -20936
11240 -20936 -71238 -37485 31356 72575 56923 30113 -49016 -101183 -84190 -78163 -59856 -27093
11228 -27093 11760 44354 28518 22929 16004 65048 82472 88053 38695 -2511 -87667 -86780 -3030
11215 -3030 -23319 -31099 -22570 -25124 5142 66024 83819 49213 13010 -16703 -59901 -13905
11203 -13905 52891 104289 75383 -7655 -12346 -38846 -47753 -83280 -72888 -27288 -5226 67691
11191 67691 49998 5460 57918 51441 -70007 -129279 -98838 -26180 42137 85418 68418 62541
11179 62541 40967 42684 4941 -30584 -68362 -24578 -34226 -72517 -80529 -89689 -86346 -86774 -103194
$$ packed form
11265i9448k024L768j5397q665K2578Q681R2848R8516J8437J6227j8360P484m2019
11252H2626j0986q353J1444j6219J317K5214p983K9684K2915k9617m8845p2133
11240b0936n0302L3753O8841M1219j5652k6810p9129n2167J6993O027J8307L2763
11228b7093L8853L2594j5836n589o925M9044J7424N581m9358m1206q5156Q87Q3750
11215c030k0289p780Q529k554L0266O0882J7795l4606l6203k9713m3198M5996
11203a3905O6796N1398k8906q3038m691k6500q907l5527J0392M5600K2062P2917
11191F7691j7693m4538N2458o477j21448n9272L0441P2658O8317M3281j7000n877
11179F2541k1574J717l7743l5525l7778M3784r648l8291q012r160L343m28j6420
$$ plain form
11166 -103194 -17584 -28238 62329 111997 77414 65680 -28617 -90825 -96454 -120711 -117421 -72524
11154 -72524 23107 1806 -31461 -128869 -145650 -47034 -60387 -121329 -124184 -121732 -71022 -29264
11142 -29264 -4681 -35071 -89985 -80198 1799 34166 24604 33618 17269 -29200 -88261 -80407
11130 -80407 -44960 -30437 -4150 -16124 -47151 -13266 -74182 -95051 -41371 -31100 -141213
11119 -141213 -181614 -94422 -66720 -39469 -69479 -80231 -89877 -45415 10742 22509 -41607 -20157
11107 -20157 -23525 -41681 2572 -42600 -63863 -24401 31698 -14725 -9155 -60232 -77691 -100893
11095 -100893 -155245 -218787 -119367 -25014 17460 -27479 13724 72284 73794 46741 -29565 -60029
11083 -60029 -6718 45501 27376 1981 -23275 -22285 36511 124551 104868 -9791 39403 51577
$$ packed form
11166a03194Q5610j0654R0567M9668l4583j1734r4297o2208n629k4257L290M4897
11154g2524R5631k1301l3267r7408j6781R8616j3353o0942k855K452N0710M1758
11142b9264K4583l0390n4914R787Q1997L2367r562R014j6349m6469n9061P854
11130h0407L5447J4523K6287j1974l1027L3885o0916k0869N3680J0271j10113
11119a41213m0401Q7192K7702K7251l0010j0752r646M4462N6157J1767o4116K1450
11107b0157l368j8156M4253m5172k1263L9462N6099m6423N570n1077j7459k3202
11095a00893n4352o3542R9420R4353M2474m4939M1203N8560J510k7053p6306l0464
11083f0029N3311N2219j8125k5395k5256R90N8796Q8040j9683j14659M9194J2174
$$ plain form
11071 51577 57214 19203 -11876 -55874 -61396 25430 38076 -922 2290 16437 43663 53882
11059 53882 11976 -36393 -56958 -49562 -18427 52589 59131 87332 129464 105479 146282 202246
11047 202246 188495 211707 248460 282440 263430 197918 189877 200914 120419 78984 211729
11036 211729 285412 418905 554674 718718 799838 777359 668442 473742 393668 385427 414571
11025 414571 501315 576189 671198 806738 901497 896933 797911 708976 636970 545491 460037
11014 460037 408197 462691 504472 504105 618441 691079 763152 684747 553667 400998 306682
11003 306682 281212 323968 307056 248973 203458 265105 288202 263089 157287 104580 75545
10992 75545 8250 -66294 -69764 -36472 -7525 73810 108438 71376 3216 -12152 43900 20766
$$ packed form
11071E1577N637l8011l1079m3998n522Q6826J2646l8998L212J4147K7226J0219
11059E3882m1906m8369k0565P396L1135P1016O542K8201M2132k3985M0803N5964
11047B02246j3751K3212L6753L3980j9010o5512q041J1037q0495m1435J32745
11036B11729P3683J33493J35769J64044Q1120k2479j08917j94700q0074q241K9144
11025D14571Q6744P4874R5009J35540R4759m564r9022q8935p2006r1479q5454
11014D60037n1840N4494M1781l67J14336P2638P2073p8405j31080j52669r4316
11003C06682k5470M2756j6912n8083m5515O1647K3097k5113j05802n2707k9035
10992G5545o7295p4544l470L3292K8947Q1335L4628l7062o8160j5368N6052k3134
$$ plain form
10980 20766 -29993 -50104 -48536 -19076 -10658 -77420 -658 24136 36859 15805 725 4971
10968 4971 -62492 -31720 83825 107132 104044 149491 109323 32532 -17426 -112867 -169076 -143006
10956 -143006 -108706 -96359 -56636 7188 -54698 -67643 -1426 43677 52906 81784 85115 66499
10944 66499 73655 39345 14418 -2350 -79946 -65808 -43281 -57058 26190 47114 34888 18329
10932 18329 -893 -20748 -6013 2898 -91575 -61903 -16122 21658 51475 20699 -25313 -43104
10920 -43104 -34286 16532 111429 177844 222726 189210 133703 115896 84506 87887 107268 43599
10908 43599 13901 18407 58372 30573 59266 135146 93183 42744 -17549 11658 26467 -392
10896 -392 -4662 -97816 -53347 37162 38868 -69586 -110703 -99472 -40653 19318 36316 41933
$$ packed form
10980B0766n0759k0111J568K9460Q418o6762P6762K4794J2723k1054j5080M246
10968D971o7463L0772J15545K3307l088M5447m0168p6791m9958r5441n6209K6070
10956a43006L4300J2347L9723O3824o1886j2945O6217M5103R229K8878L331j8616
10944F6499P156l4310k4927j6768p7596J4138K2527j3777Q3248K0924j2226j6559
10932A8329j9222j9855J4735Q911r4473K9672M5781L7780K9817l0776m6012j7791
10920d3104Q818N0818R4897O6415M4882l3516n5507j7807l1390L381J9381o3669
10908D3599k9698M506L9965k7799K8693P5880m1963n0439o0293K9207J4809k6859
10896c92m270r3154M4469R0509J706j08454m1117J1231N8819N9971J6998N617
$$ plain form
10884 41933 -67566 -101216 -154787 -133158 -66926 -28646 -60917 -87556 -76986 -48780 -53500 -50803
10872 -50803 2984 11032 -39400 -55791 -72980 -39717 -19860 -36889 -23569 -13970 -46131 -102928
10860 -102928 -125194 -10817 101892 49944 -1842 24009 13801 -22211 10606 -52509 -67262
10849 -67262 -13448 -8438 -34859 1893 71188 61711 45060 64110 39994 33929 71007 76631
10837 76631 32589 36019 57153 -255 -4593 -9668 69293 97095 81158 2925 -91623 -136265
10825 -136265 -130273 -153224 -75841 -35302 -135084 -153586 -152815 -174760 -84050 -67968 -62475 -311
10813 -311 -10589 -8798 1740 -5217 -23239 26900 -14706 -197767 -248014 -175963 -93420 -81831
10801 -81831 -137435 -162297 -167858 -119217 -43153 -69473 -60991 -76473 -95800 -145222 -175596 -200012
$$ packed form
10884D1933j09499l3650n3571K1629O6232L8280l2271k6639J0570K8206m720K697
10872e0803N3787Q048n0432j6391j7189L3263J9857j7029J3320R599l2161n6797
10860a02928k2266J14377J12709n1948n1786K5851j0208l6012L2817o3115j4753
10849f7262N3814N010k6421L6752O9295r477j6651J9050k4116o065L7078N624
10837G6631m4042L430K1134n7408m338n075P8961K7802j5937p8233r4548m4642
10825a36265N992k2951P7383M0539r9782j8502P71k1945R0710J6082N493O2164
10813c11j0278J791J0538o957j8022N0139m1606j83061n0247P2051Q2543J1589
10801h1831n5604k4862n561M8641P6064k6320Q482j5482j9327m9422l0374k4416
$$ plain form
10789 -200012 -183115 -67044 -111132 -143460 -143162 -121129 -109901 -117628 -101563 -114195 -97531 -34200
10777 -34200 -43292 -32447 -26399 -61605 -102242 -64951 -20647 -10558 -60981 -103809 -96466 -51024
10765 -51024 -59518 -53961 -26428 4460 -29254 -55658 16114 43537 94735 86960 92673 132351
10753 132351 192772 248303 261119 185542 168137 161709 140532 141719 78230 124182 225436 212055
10741 212055 160175 120088 63161 87996 98368 78128 161095 237842 205778 195907 218335 194924
10729 194924 188507 147833 42376 61611 121581 147628 162367 205060 200027 217720 193112 110140
10717 110140 65381 -47631 -106480 -138797 -111737 -105862 -131800 -92585 -7340 7866 9309 -20708
10705 -20708 -170659 -249214 -270763 -262916 -297864 -244944 -159542 -140849 -184224 -195780 -163455 -177542
$$ packed form
10789b00012J6897J16071m4088l2328K98K2033J1228p727J6065j2632J6664O3331
10777c4200r092J0845O048l5206m0637L7291M4304J0089n0423m2828P343M5442
10765e1024q494N557K7533L0888l3714k6404P1772K7423N1198p775N713L9678
10753A32351O0421N5531J2816p5577j7405o428k1177J187o3489M5952J01254j3381
10741B12055n1880m0087n6927K4835J0372k0240Q2967P6747l2064r871K2428k3411
10729A94924o417m0674j05457J9235N9970K6047J4739M2693n033J7693k4608q2972
10717A10140m4759j13012n8849l2317K7060N875k5938L9215Q5245J5206J443l0017
10705b0708j49951p8555k1549P847l4948N2920Q5402J8693m3375j1556L2325j4087
$$ plain form
10693 -177542 -233472 -214908 -195547 -140767 -91745 -87185 -144458 -181326 -209966 -238336 -277563 -257394
10681 -257394 -266429 -233483 -119540 -103927 -136263 -179742 -189511 -189114 -197595 -189240 -119612 -110114 -130816
10668 -130816 -120612 -171776 -198163 -186581 -198853 -169063 -122854 -141751 -156818 -163656 -121447 -131557
10656 -131557 -54239 -28980 -9843 9626 -1804 59604 111633 121020 215390 212889 184011 225602
10644 225602 248684 312575 385380 430541 532268 689924 783524 864065 978662 1197432 1532387
10633 1532387 1855125 2272982 2646939 3006965 3205636 3403511 3713224 4114121 4604071
10624 4604071 5394894 6659604 8336530 10755218 14089035 18605928 24642412 32503653
10616 32503653 41995593 51274163 57064418 57491123 54082956 49956240 47288301 47073466
$$ packed form
10693a77542n5930J8564J9361N4780M9022M560n7273l6868k8640k8370l9227K0169
10681b57394r035L2946J13943J5613l2336m3479r769L97q481Q355O9628R498k0702
10668a30816J0204n1164k6387J1582j2272K9790M6209j8897j5067o838M2209j0110
10656a31557P7318K5259J9137J9469j1430O1408N2029R387R4370k501k8878M1591
10644B25602K3082O3891P2805M5161J01727J57656R3600Q0541J14597K18770L34955
10633A532387L22738M17857L73957L60026J98671J97875L09713M00897M89950
10624D604071P90823J264710J676926K418688L333817M516893O036484P861241
10616C2503653R491940R278570N790255M26705l408167m126716k667939k14835
$$ plain form
10608 47073466 49966855 56579471 67563884 83642989 103877210 123024580 131945706
10601 131945706 126287567 112214932 98270821 88787481 84906270 86776396 94748987 109417990
10593 109417990 131134391 157471737 180047789 185772155 170035108 143910986 119695667
10586 119695667 102198082 91737061 87592951 89156393 96328590 108403180 122905274
10579 122905274 133483332 131863520 116467025 95561150 77210536 64082181 55925224
10572 55925224 51757869 50773822 52407919 55913013 59752444 61468021 58197506 50074135
10564 50074135 40129559 31202399 24192861 19023387 15369612 12753705 10754130 9206207
10556 9206207 8025278 7073043 6347131 5753998 5236480 4765905 4309116 3949547 3649655
$$ packed form
10608D7073466K893389O612616J0984413J6079105K0234221J9147370Q921126
10601A31945706n658139j4072635j3944111r483340l881211J870126P972591J4669003
10593A09417990K1716401K6337346K2576052N724366j5737047k6124122k4215319
10586A19695667j7497585j0461021m144110J563442P172197J2074590J4502094
10579A22905274J0578058j619812j5396495k0905875j8350614j3128355q156957
10572E5925224m167355r84047J634097L505094L839431J715577l270515q123371
10564E0074135r944576q927160p009538n169474l653775k615907j999575j547923
10556I206207j180929r52235p25912n93133n17518m70575m56789l59569k99892
$$ plain form
10547 3649655 3445191 3216102 3036066 2811920 2658005 2498569 2332229 2244403 2140934 2013746
10537 2013746 1984762 1876782 1816872 1795232 1769779 1764418 1727939 1611705 1553244 1435550 1313394
10526 1313394 1338008 1321159 1270028 1229827 1197668 1173522 1140411 1075830 993896 992537 1017632
10515 1017632 1053440 1078954 1075031 1106582 1100725 1023815 1016941 963784 895439 964474 957360 910055
10503 910055 811399 782208 842746 865799 872116 781386 766590 845545 890334 877331 829620 753667
10491 753667 736616 711251 740112 718162 749631 777522 803159 801863 723037 714052 738315 737965
10479 737965 776867 773891 808580 796878 714428 682909 627376 543538 503240 567157 640858 650301
10467 650301 703910 672335 627505 533513 505624 437169 395693 403167 399475 460263 441085 450867
$$ packed form
10547C649655k04464k29089j80036k24146j53915j59436j66340q7826j03469j27188
10537B013746k8984j07980n9910k1640k5453n361l6479j16234n8461j17694j22156
10526A313394K4614j6849n1131m0201l2159k4146l3111o4581q1934j359K5095
10515A017632L5808K5514l923L1551n857p6910o874n3157o8345O9035p114m7305
10503I10055r8656k9191O0538K3053O317r0730j4796P8955M4789j3003m7711p5953
10491G53667j7051k5365K8861k1950L1469K7891K5637j296p8826q985K4263l50
10479G37965L8902k976L4689j1702q2450l1519n5533q3838m0298O3917P3701R443
10467F50301N3609l1575m4830r3992k7889o8455m1476P474l692O0788j9178R782
$$ plain form
10455 450867 478819 467509 421141 339678 306704 308709 215419 110402 144006 237244 268874
10444 268874 252531 240394 169282 89063 118736 112875 163027 196192 111670 70149 65219 34888
10432 34888 1297 -16341 32459 12735 19641 74067 114251 122696 156162 152702 134268 131698
10420 131698 92518 150267 231438 246431 289695 294134 259617 171546 164514 123214 95288 67275
10408 67275 125708 187321 229785 246509 252909 250265 181410 175819 252445 315131 384476 434381
10396 434381 420415 314701 171939 194721 238016 273713 297011 292559 336546 363989 376948
10385 376948 370212 415652 442350 462924 494243 461256 371073 278429 280222 293677 311560 312218
10373 312218 334351 294010 273243 256505 246230 239466 220564 227874 204116 185428 204391 212935
$$ packed form
10455D50867K7952j1310m6368q1463l2974K005r3290j05017L3604R3238L1630
10444B68874j6343j2137p1112q0219K9673n861N0152L3165q4522m1521m930l0331
10432C4888l3591j7638M8800j9724O906N4426M0184Q445L3466l460j8434k570
10420A31698l9180N7749Q1171J4993M3264M439l4517q8071p032m1300k7926k8013
10408F7275N8433O1613M2464J6724O400k644o8855n591P6626O2686O9345M9905
10396D34381j3966j05714j42762K2782M3295L5697K3298m452M3987K7443J2959
10385C76948o736M5440K6698K0574L1319l2987r0183r2644J793J3455J7883O58
10373C12218K2133m0341k0767j6738j0275o764j8902P310k3758j8688J8963Q544
$$ plain form
10361 212935 199685 172031 110856 161328 153598 181991 209605 197588 157230 105879 76021 82771
10349 82771 176451 148958 85790 60250 119496 169793 163983 194515 142948 168789 199454 189226
10337 189226 116812 117637 154637 129071 76064 104249 128881 142951 165498 195684 200424 177693
10325 177693 197362 164127 127870 160225 96053 128013 180000 190325 160354 170977 204731
10314 204731 270997 262637 300335 277770 211330 161661 170193 199073 203699 135670 65162 75818
10302 75818 93329 112448 151391 135336 72236 109859 141693 107525 87024 77296 151272 193436
10290 193436 148408 139994 139568 71288 87430 103450 88814 -6915 -73408 -33459 9851 60545
10278 60545 80155 79741 77378 96940 73426 74011 128175 168226 200295 179901 170763 91949 67005
$$ packed form
10361B12935j3250k7654o1175N0472p730K8393K7614j2017m0358n1351k9858O750
10349H2771R3680k7493o3168k5540N9246N0297n810L0532n1567K5841L0665j0228
10337A89226p2414Q25L7000k5566n3007K8185K4632J4070K2547L0186M740k2731
10325A77693J9669l3235l6257L2355o4172L1960N1987J0325k9971J0623L3754
10314B04731O6266q360L7698k2565o6440m9669Q532K8880M626o8029p0508J0656
10302G5818J7511J9119L8943j6055o3100L7623L1834l4168k0501r728P3976M2164
10290A93436m5028q414m26o8280J6142J6020j4636r5729o6493L9949M3310N0694
10278F0545J9610m14k363J9562k3514N85N4164M0051L2069k0394r138p8814k4944
$$ plain form
10265 67005 44873 12594 29941 39478 37133 40857 -47805 -109150 -142558 -68059 -11209 77569
10253 77569 144419 166892 139555 38709 43586 97792 119768 147588 111493 29982 -29005 4891
10241 4891 103982 118246 159246 130263 100995 116663 89658 80269 18699 -11047 -40285 14826
10229 14826 113431 147588 97955 96758 57512 121398 147317 153013 148424 135253 114966 116138
10217 116138 144913 94607 76870 127848 113378 82593 53549 152654 220960 154511 91183
10206 91183 47276 78305 94789 83573 128252 114870 91754 46385 68159 132379 146513 82866
10194 82866 60829 90230 83625 86459 79398 85214 49907 28622 -47398 -57535 29076 125364
10182 125364 212628 298266 322581 356587 439047 379638 324471 332538 297126 228881 263027 366127
$$ packed form
10265F7005k2132l2279J7347R537k345L724q8662o1345l3408P4499N6850Q8778
10253G7569O6850K2473k7337j00846M877N4206K1976K7820l6095q1511n8987L3896
10241D891R9091J4264M1000k8983k9268J5668k7005r389o1570k9746k9238N5111
10229A4826R8605L4157m9633j197l9246O3886K5919N696m589j3171k0287J172
10217A16138K8775n0306j7737N0978j4470l0785k9044R9105O8306o6449o3328
10206I1183m3907L1029J6484j1216M4679j3382k3116m5369K1774O4220J4134o3647
10194H2866k2037K9401o605K834p061N816l5307k1285p6020j0137Q6611R6288
10182A25364Q7264Q5638K4315L4006Q2460n9409n5167Q067l5412o8245L4146J03100
$$ plain form
10170 366127 510082 571433 627887 748376 898609 957572 851851 727486 672678 629704
10160 629704 604579 581412 674993 785934 867432 966224 1077576 1098269 1019440 934715 802571
10149 802571 665208 582458 584793 635968 707999 831585 865123 875812 784877 671972 628139
10138 628139 488890 372057 308303 297642 360063 486549 612874 692824 530420 390575
10128 390575 307525 211450 106687 56410 100319 155769 140539 100630 88180 87034 99889
10117 99889 90066 89048 133133 156692 129809 19661 -13453 -4361 12678 114561 171140 152450
10105 152450 141226 118188 29169 -77899 -123653 -66528 -46364 16434 33072 22956 23730 53774
10093 53774 41010 149542 191716 82236 29909 16417 1964 -39055 -18859 92353 105199
$$ packed form
10170C66127J43955O1351N6454J20489J50233N8963j05721j24365n4808m2974
10160F29704k5125k3167R3581J10941Q1498R8792J11352K0693p8829q4725j32144
10149H02571j37363q2750K335N1175P2031J23586L3538J0689r0935j12905m3833
10138F28139j39249j16833o3754j0661O2421J26486J26325P9950j62404j39845
10128C90575q3050r6075j04763n0277M3909N5450j5230l9909j2450j146J2855
10117I9889r823j018M4085K3559k6883j10148l3114R092J7039J01883N6579j8690
10105A52450j1224k3038q9019j07068m5754N7125K0164O2798J6638j0116P74L0044
10093E3774j2764J08532M2174j09480n2327j3492j4453m1019K0196J11212J2846
$$ plain form
10082 105199 73586 44318 63493 107266 94416 81639 49336 23727 31724 -11039 -18192 -42927
10070 -42927 -29362 -21279 7205 62812 49890 53198 57144 47424 16697 -27774 10901 90059
10058 90059 85168 61489 41199 48339 1430 -43184 -40096 3291 62677 -1763 -21027 67815
10046 67815 110068 93033 99537 90580 58844 18500 26144 66540 104463 33162 31117 -5056
10034 -5056 -81720 -79484 -34248 -11701 -19125 14186 89982 78860 86508 85436 84868 148473 187025
10021 187025 129464 35937 -21889 -9033 7967 11225 15826 13355 48046 42808 20565 -17844
10009 -17844 31830 36709 -641 29944 -5039 -64275 -100182 -70450 -17100 53334 48287 75701
9997 75701 56251 106658 105161 36886 8597 33310 48651 18250 18330 69290 74645 91909 96436
$$ packed form
10082A05199l1613k9268J9175M3773j2850j2777l2303k5609P997m2763p153k4735
10070d2927J3565Q083K8484N5607j2922L308L946r720l0727m4471L8675P9158
10058I0059m891k3679k0290P140m6909m4614L088M3387N9386o4440j9264Q8842
10046F7815M2253j7035O504q957l1736m0344P644M0396L7923p1301k045l6173
10034e056p6664K236M5236K2547p424L3311P5796j1122P648j072n68O3605L8552
10021A87025n7561r3527n7826J2856J7000L258M601k471L4691n238k2243l8409
10009a7844M9674M879l7350L0585l4983n9236l5907K9732N3350P0434n047K7414
9997G5701j9450N0407j497o8275k8289K4713J5341l0401Q0N0960N355J7264M527
$$ plain form
9984 96436 71612 35096 -13751 -36731 -81289 -60979 -23177 -48067 -116659 -97860 -25592 -42628
9972 -42628 -27625 -54296 -74459 -70051 -19887 64856 104594 56733 -4317 23312 14968 -28393
9960 -28393 -2779 62326 35190 43687 58928 43078 58633 81993 124487 113099 38173 -3530
9948 -3530 -34505 -31596 -22297 -2584 45009 -33971 -52327 -68122 -58046 -35516 42455 22185
9936 22185 63069 111075 111207 72761 59495 12376 10514 -36973 -49101 -50555 -47351 -46481 -33706
9923 -33706 3424 4937 31298 33813 61508 58407 -1091 -40448 23803 86198 103624 86570
9911 86570 58062 40339 17751 21206 152523 167332 62464 118358 158997 176201 129036 123256
9899 123256 69641 82664 133163 155759 201576 141055 68654 4746 -72139 -86968 -62165 -37893
$$ packed form
9984I6436k4824l6516m8847k2980m4558K0310L7802k4890o8592J8799P2268j7036
9972d2628J5003k6671k0163M408N0164Q4743L9738m7861o1050K7629q344m3361
9960b8393K5614O5105k7136Q497J5241j5850J5555K3360M2494j1388p4926m1703
9948c530l0975K909R299J9713M7593p8980j8356j5795J0076K2530P7971k0270
9936B2185M0884M8006J32l8446j3266m7119j862m7487j2128j454L204Q70J2775
9923c3706L7130J513K6361K515K7695l101n9498l9357O4251O2395J7426j7054
9911H6570k8508j7723k2588L455J31317J4809j04868N5894M0639J7204m7165n780
9899A23256n3615J3023N0499K2596M5817o0521p2401o3908p6885j4829K4803K4272
$$ plain form
9887 -37893 24737 27167 37745 8282 11473 74898 131106 50668 20579 45368 98223 107782
9875 107782 50648 34168 66253 56135 57812 46793 64035 78621 26534 21188 1695 22826
9863 22826 71002 63619 43959 4852 -18160 7546 13048 36377 59364 -9544 -53789 -87446
9851 -87446 -6081 65455 36401 -74340 -102867 -52224 -65531 18571 68065 128063 130384 126087
9839 126087 76163 42201 14793 21456 55635 35715 10437 -7054 12978 9698 -10768 -2045
9827 -2045 57099 73240 25890 -3364 -42507 -127818 -162795 -104522 -71213 -46998 -43670 -6789
9815 -6789 -26617 -72525 -23811 -17550 -73695 -84420 -18317 -2862 -41752 -87977 -80989 -5172
9803 -5172 -29641 -71104 -110410 -81329 -55832 -86423 -87548 -94166 -109585 -116015 -85009 -3941 71608
$$ packed form
9887c7893O2630K430J0578k9463L191O3425N6208q0438l0089K4789N2855R559
9875A07782n7134j6480L2085j0118J677j1019J7242J4586n2087n346j9493K1131
9863B2826M8176p383j9660l9107k3012K5706N502K3329K2987o8908m4245l3657
9851h7446Q1365P1536k9054j10741k8527N0643j3307Q4102M9494N9998K321m297
9839A26087m9924l3962k7408O663L4179j9920k5278j7491K0032l280k0466Q723
9827b045N9144J6141m7350k9254l9143q5311l4977N8273L3309K4215L328L6881
9815f789j9828m5908M8714O261n6145j0725O6103J5455l8890m6225O988P5817
9803e172k4469m1463l9306K9081K5497l0591j125o618j5419o430L1006Q1068P5549
$$ plain form
9790 71608 70094 69823 76726 35269 30976 22854 58241 86619 126016 123068 61541 25619 37867
9777 37867 88154 71147 119377 94048 93720 170694 168808 84213 34606 -8133 819 32487 37700
9764 37700 -11877 -21258 37204 86854 47383 36291 36607 1405 -10125 -71747 -39063 -29601 43929
9751 43929 83259 55834 68274 19828 -11440 -17162 4741 -21559 16826 96582 140112 128948
9739 128948 46981 5300 44776 74259 104159 37658 -14874 -31515 -4392 -61476 -100592 -13374
9727 -13374 27927 35845 75082 86631 53937 35963 38759 -1831 -18141 64494 95847 98600
9715 98600 118746 112531 24060 -21891 -21398 38543 26831 -44296 -24027 17850 62020 89833
9703 89833 85622 54409 -5726 -26371 -32965 2763 -25227 -75255 -64077 -55476 28646 43570
$$ packed form
9790G1608j514k71O903m1457m293q122L5387K8378L9397k948o1527l5922J2248
9777C7867N0287j7007M8230k5329l28P6974j886q4595m9607m2739Q952L1668N213
9764C7700m9577r381N8462M9650l9471j1092L16l5202j1530o1622L2684R462P3530
9751D3929L9330k7425J2440m8446l1268n722K1903k6300L8385P9756M3530j1164
9739A28948q1967m1681L9476K9483K9900o6501n2532j6641K7123n7084l9116Q7218
9727a3374M1301P918L9237J1549l2694j7974K796m0590j6310Q2635L1353K753
9715I8600K0146o215q8471m5951M93N9941j1712p1127K0269M1877M4170K7813
9703H9833m211l1213o0135k0645o594L5728k7990n0028J1178Q601Q4122J4924
$$ plain form
9691 43570 14891 -25627 -102210 -60574 -56018 -50795 -90656 -92766 -28810 21029 70927 64203 42850
9678 42850 -23039 -104694 -112439 -64777 -38108 8296 -7354 -28980 -41071 -54363 -74976 -89598
9666 -89598 -16935 60795 66799 59273 -7405 -54865 75486 89117 70267 30549 -31404 -26178
9654 -26178 3816 -633 25197 40470 90055 83154 67054 7487 42370 12569 -29363 -47359
9642 -47359 -70182 -100157 -106918 -61441 -43866 -45218 -78233 -53805 -16638 -35674 10800 14113
9630 14113 43516 36383 27720 15911 71186 21919 -51175 -19089 -11158 14137 -12336 -22519
9618 -22519 -15955 -13634 -36366 -85345 -104212 -124715 -84552 -67000 -7301 54048 7996 -5164
9606 -5164 -2517 -71714 -145128 -130688 -126919 -111090 -123925 -113364 -134976 -105945 -84234 -25477
$$ packed form
9691D3570k8679m0518p6583M1636M556N223l9861k110O3956M9839M9898o724k1353
9678D2850o5889q1655p745M7662K6669M6404j5650k1626j2091j3292k0613j4622
9666h9598P2663P7730O004p526o6678m7460J30351J3631j8850l9718o1953N226
9654b6178K9994m449K5830J5273M9585o901j6100n9567L4883k9801m1932j7996
9642d7359k2823k9975o761M5477J7575j352l3015K4428L7167j9036M6474L313
9630A4113K9403p133q663j1809N5275m9267p3094L2086P931K5295k6473j0183
9618b2519O564K321k2732m8979j8867k0503M0163J7552N9699O1349m6052j3160
9606e164K647o9197p3414J4440L769J5829j2835J0561k1612K9031K1711N8757
$$ plain form
9594 -25477 45389 25342 5486 55701 70123 125582 120473 90931 38247 11655 -22962 -36568
9582 -36568 -52471 -29482 -83005 -52022 -80041 -70219 -38895 3329 -25471 -56826 -9311 60050
9570 60050 63043 15949 24963 31623 5534 -12835 -55060 -71590 -42222 -98048 -105625 -68840 -80135
9557 -80135 -39033 66799 128589 162522 116555 73739 49847 43553 52651 34864 64529 48306
9545 48306 -43836 -42566 -48717 -113436 -141130 -95400 -72437 -24081 37182 5635 -36804 4026
9533 4026 35407 15881 46831 52548 61252 45868 53852 -32138 -70780 -90834 -54724 -67392 -67631
9520 -67631 -112341 -77786 -77839 -44379 33672 91502 95164 76963 97073 73795 -4977 -12158 56558
9507 56558 24886 -3172 57848 119642 107538 114195 130870 128603 89829 13496 15355 -22210
$$ packed form
9594b5477P0866k0047j9856N0215J4422N5459n109k9542n2684k6592l4617j3606
9582c6568j5903K2989n3523L0983k8019R822L1324M2224k8800l1355M7515O9361
9570F0050K993m7094R014O660k6089j8369m2225j6530K9368n5826p577L6785j1295
9557h0135M1102J05832O1790L3933m5967m2816k3892o294R098j7787K9665j6223
9545D8306r2142J270o151o4719k7694M5730K2963M8356O1263l1547m2439M0830
9533D026L1381j9526L0950N717Q704j5384P984q5990l8642k0054L6110j2668k39
9520f7631m4710L4555n3L3460P8051N7830L662j8201K0110k3278p8772p181O8716
9507E6558l1672k8058O1020O1794j2104O657J6675k267l8774p6333J859l7565
$$ plain form
9495 -22210 -32793 42960 39298 -55632 -85611 4130 39273 89102 103203 23601 26691 80320
9483 80320 154644 169952 90212 11557 -24243 -2143 45853 -2526 -34933 -43965 -957 140766
9471 140766 208197 130595 21678 21085 -17264 -16624 44336 50340 58408 15417 25681 15022 -19073
9458 -19073 -91354 -50950 24242 84485 93805 49742 30895 43741 141386 161995 80568 -8618
9446 -8618 -19253 -46547 -81544 -76485 33457 69499 -35 34225 111532 34735 12638 19129
9434 19129 37364 100062 54491 10017 -2807 -55699 -12770 55849 41902 63586 38264 55729
9422 55729 88392 111654 112214 72003 109974 70727 40174 59439 -3273 -47979 43433 52530
9410 52530 80404 152536 140546 42331 -4889 24164 -25242 -40458 -5693 -52268 -18182 10262
$$ packed form
9495b2210j0583P5753l662r4930k9979Q9741L5143M9829J4101p9602L090N3629
9483H0320P4324J5308p9740p8655l5800K2100M7996m8379l2407r032M3008J41723
9471A40766O7431p7602j08917n93l8349O40O0960O004Q068m2991J0264j0659l4095
9458a9073p2281M0404P5192O0243R320m4063j8847J2846R7645K0609q1427q9186
9446h618j0635k7294l4997N059J09942L6042o9534L4260P7307p6797k2097O491
9434A9129J8235O2698m5571m4474j2824n2892M2929O8619j3947K1684k5322J7465
9422E5729L2663K3262N60m0211L7971l9247l0553J9265o2712m4706R1412R097
9410E2530K7874P2132j1990r8215m7220K9053m9406j5216L4765m6575L4086K8444
$$ plain form
9398 10262 19977 78944 79389 68135 44918 29953 45246 -23222 -40481 1470 -34065 -33782 50270
9385 50270 67846 52953 3451 -4781 -8970 -15207 11049 5253 14575 -53967 -89677 -58742 -41931
9372 -41931 -6732 39263 22727 -25061 -4522 10726 42210 29930 -425 -32594 -58299 -28372
9360 -28372 1522 -13490 -38725 -29651 -30067 17133 93390 36058 -3462 46295 50110 -9026 -32082
9347 -32082 -63965 -41953 -42262 -16966 54302 134074 166522 136011 84591 104223 62212 32349
9335 32349 4885 -4658 -6109 72131 30875 -34053 -1964 56896 30017 15577 2548 13245
9323 13245 -17367 46270 59502 5610 -4136 -45512 -39599 5493 3049 -44070 -78228 -24084
9311 -24084 -56050 -77682 23643 -7763 -71945 -99680 -73949 2381 48107 26769 49892 26150
$$ packed form
9398A0262R715N8967M45j1254k3217j4965J5293o8468j7259M1951l5535K83Q4052
9385E0270J7576j4893m9502q232m189o237K6256n796R322o8542l5710L0935J6811
9372d1931L5199M5995j6536m7788K0539J5248L1484j2280l0355l2169k5705K9927
9360b8372K9894j5012k5235R074m16M7200P6257n7332l9520M9757L815n9136k3056
9347c2082l1883K2012l09K5296P1268P9772L2448l0511n1420J9632m2011k9863
9335C2349k7464r543j451P8240m1256o4928L2089N8860k6879j4440j3029J0697
9323A3245l0612O3637J3232n3892r746m1376N913M5092k444m7119l4158N4144
9311b4084l1966k1632J01325l1406o4182k7735K5731P6330M5726k1338K3123k3742
$$ plain form
9299 26150 9372 18841 7025 -9386 -595 52666 25802 -16311 -22161 -4376 -11045 -47650 -27224
9286 -27224 -34856 -6981 -73724 -8223 130322 222060 156817 86100 106070 70842 42897 11498
9274 11498 -47326 -127176 -115402 -98311 -127274 -33747 15509 151 -28455 -75443 -43406 -27592
9262 -27592 23248 55973 70210 -57758 -123637 -117210 -80922 -38038 14696 53148 51568 9907
9250 9907 2245 4935 8384 -22112 -51314 30339 86957 119760 117793 104593 -3284 -41662 -34792
9237 -34792 -20951 -17930 -34666 -74480 -91125 -144181 -136001 -61874 -32087 7583 53844 10391
9225 10391 -26919 -4649 15471 39022 168817 209514 143886 97527 100947 3473 7004 -44144
9213 -44144 -54371 -85225 -68029 50066 97565 135169 137326 105032 46305 -38353 -1473 82551
$$ packed form
9299B6150j6778R469j1816j6411Q791N3261k6864m2113n850J7785o669l6605K0426
9286b7224p632K7875o6743O5501J38545R1738o5243p0717J9970l5228k7945l1399
9274A1498n8824p9850J1774J7091k8963R3527M9256j5358k8606m6988L2037J5814
9262b7592N0840L2725J4237j27968o5879O427L6288M2884N2734L8452j580m1661
9250I907p662K690L449l0496k9202Q1653N6618L2803j967j3200j07877l8378O870
9237c4792J3841L021j6736l9814j6645n3056Q180P4127K9787L9670M6261m3453
9225A0391l7310K2270K0120K3551J29795M0697o5628m6359L420r7474L531n1148
9213d4144j0227l0854J7196J18095M7499L7604K157l2294n8727q4658L6880Q4024
$$ plain form
9201 82551 67225 109212 91778 79412 99973 163286 141556 72151 60959 126304 183801 180946
9189 180946 116736 -33098 6665 115759 98468 76233 15688 -34674 -3730 -43121 -12301
9178 -12301 -217 -41299 -6195 17123 43720 47327 42288 76145 10767 -155410 -236659 -144079
9166 -144079 -83868 -50015 -86221 -66465 -23954 -4741 -99007 -116085 -92221 -66601 -56099 26527
9154 26527 30990 2917 54146 104362 83218 31875 -33140 -84270 21467 56278 13387 -1711
9142 -1711 22270 11612 -3834 -28911 -3768 -46940 -91464 -24692 40757 61139 34769 4667
9130 4667 -8262 19005 -17416 1551 21844 -28346 -30177 -80512 -79164 -53805 -72245 -92541
9118 -92541 -56152 -51798 -77798 -64698 -16677 22185 44616 55189 75358 52629 29965 -16166
$$ packed form
9201H2551j5326M1987j7434j2366K0561O3313k1730o9405j1192O5345N7497k855
9189A80946o4210j49834L9763J09094j7291k2235o0545n0362L0944l9391L0820
9178a2301J2084m1082L5104K3318K6597L607n039L3857o5378j66177q1249R2580
9166a44079O0211L3853l6206J9756M2511J9213r4266j7078K3864K5620J0502Q2626
9154B6527M463k8073N1229N0216k1144n1343o5015n1130J05737L4811m2891j5098
9142a711K3981j0658j5446k5077K5143m3172m4524O6772O5449K0382k6370l0102
9130D667j2929K7267l6421J8967K0293n0190j831n0335J348K5359j8440k0296
9118i2541L6389M354k6000J3100M8021L8862K2431J0573K0169k2729k2664m6131
$$ plain form
9106 -16166 35986 105789 16468 -21404 60141 46190 63856 70650 38323 539 12140 63096
9094 63096 15762 -47001 -93908 12301 72849 90375 66496 26515 58594 21078 -46741 1762
9082 1762 5609 -14064 558 2426 78018 119489 117855 61275 49062 69591 56288 -19495 -40661
9069 -40661 -16121 15962 38492 70509 67375 56 -66670 -8001 62800 33364 -135450 -198028
9057 -198028 -119399 -89944 -59928 7316 -16020 -20408 15373 46588 59191 35847 18784 -32991
9045 -32991 -82402 -60666 -30479 17869 34865 -25172 -29402 -300 -24822 4287 28435 100692
9033 100692 60078 63207 50635 38645 -11858 -15418 35066 13569 44403 82402 77048 101056
9021 101056 89037 6298 -68074 8842 60739 58728 24096 -27124 -77041 -100797 -96513 -43016
$$ packed form
9106a6166N2152O9803q9321l7872Q1545j3951J7666O794l2327l7784J1601N0956
9094F3096m7334o2763m6907J06209O0548J7526k3879l9981L2079l7516o7819M8503
9082A762L847j9673J4622J868P5592M1471j634n6580j2213K0529j3303p5783k1166
9069d0661K4540L2083K2530L2017l134o7319o6726N8669P0801k9436j68814o2578
9057a98028P8629K9455L0016O7244k3336m388L5781L1215J2603k3344j7063n1775
9045c2991m9411K1736L0187M8348J6996o0037m230K9102k4522K9109K4148P2257
9033A00692m0614L129j2572j1990n0503l560N0484k1497L0834L7999n354K4008
9021A01056j2019q2739p4372P6916N1897k011l4632n1220m9917k3756M284N3497
$$ plain form
9009 -43016 -71539 -31342 28780 55828 53917 5705 -3499 38001 59222 17311 -26038 -33945
8997 -33945 -28655 -16527 24586 2648 66947 68967 52459 -14742 -5782 -35306 5961 2930 60900
8984 60900 -29707 -92375 -66371 -51756 -52566 -6951 -25284 -19827 12331 -19078 -27249 -38147 -16884
8971 -16884 -44375 -94357 -59419 -59570 -95600 -80708 -95839 -17825 -2157 -20030 -46192 -62958
8959 -62958 -55866 -6737 -30727 -123815 -52833 -35366 -20882 -17961 -6718 -15157 -7465 -20412 -46204
8946 -46204 -32421 -44535 -47816 -154 33144 89955 97814 21213 11912 -772 -940 22552 25413
8933 25413 8528 -15638 -43189 -5956 51937 22432 -35761 -41249 4400 13182 14953 11032 -30253
8920 -30253 -50646 -125510 -137110 -102345 -75787 -59029 -33066 -37927 -81445 -115704 -95234 -100072
$$ packed form
9009d3016k8523M0197O0122K7048j911m8212r204M1500K1221m1911m3349p907
8997c3945N290J2128M1113k1938O4299K020j6508o7201Q960k9524M1267l031N7970
8984F0900r0607o2668K6004J4615q10M5615j8333N457L2158l1409q171j0898K1263
8971a6884k7491m9982L4938j51l6030J4892j5131P8014J5668j7873k6162j6766
8959f2958P092M9129k3990r3088P0982J7467J4484K921J1243q439P692j2947k5792
8946d6204J3783j2114l281M7662L3298N6811P859p6601r301j2684j68K3492K861
8933B5413j6885k4166k7551L7233N7893k9505n8193n488M5649Q782J771l921m1285
8920c0253k0393p4864j1600L4765K6558J6758K5963m861m3518l4259K0470m838
$$ plain form
8908 -100072 -61281 -12805 38477 -3221 1559 1273 -5809 -43145 -137695 -128664 -93935 -65219 -20791
8895 -20791 22894 -15105 20987 70794 69129 29771 1618 23114 100157 113769 22979 -9784
8883 -9784 9757 10851 23668 -24886 -104916 -93440 -88613 -57724 3138 74331 38128 52796
8871 52796 71862 13695 -76173 -37775 -352 -45651 -42305 35106 27066 -14709 -65995 -73147
8859 -73147 -27471 15686 62529 -3805 -57594 -36086 19129 34239 23760 53275 156882 57576
8847 57576 30859 23750 -32637 -98875 -71160 -51427 -64475 -81342 -110600 -34310 10895 -37574
8835 -37574 -39328 -45632 -7682 25155 -13633 -42330 -26435 3863 22020 9587 9675 -300 40392
8822 40392 44613 44440 117566 83328 59328 51401 22674 12755 -7392 -5288 43292 37831 39472
$$ packed form
8908a00072L8791M8476N1282m1698M780k86p082l7336r4550R031L4729K8716M4428
8895b0791M3685l7999L6092M9807j665l9358k8153K1496P7043J3612r0790l2763
8883i784J9541J094J2817m8554q0030J1476M827L0889O0862P1193l6203J4668
8871E2796J9066n8167q9868L8398L7423m5299L346P7411q040m1775n1286p152
8859g3147M5676M3157M6843o6334n3789K1508N5215J5110j0479K9515J03607r9306
8847E7576k6717p109n6387o6238K7715J9733j3048j6867k9258P6290M5205m8469
8835c7574j754o304L7950L2837l8788k8697J5895L0298J8157j2433Q8r975M0692
8822D0392M221j73P3126l4238k4000p927k8727r919k0147K104M8580n461J641
$$ plain form
8809 39472 -28393 -59939 -15575 41867 15695 -22152 7751 -34192 -32960 -45359 -32352 -41145
8797 -41145 -53228 -53486 -9085 22825 56327 42284 49625 26749 40699 37992 -3735 12495 61435
8784 61435 25535 -15015 -19579 -15842 -38633 -77093 -25485 36901 19424 2952 -23980 -58467
8772 -58467 -43147 -59930 -66895 21874 36030 8135 -26889 -32981 -1753 34304 81073 123195
8760 123195 107066 102372 60217 -14079 -34084 -51742 -71604 -59969 -26056 27339 38948 111283
8748 111283 129000 141345 198061 192700 129746 81550 26494 5282 -23473 38822 91225 61261
8736 61261 75159 109586 151324 137932 92982 88928 58390 23136 53932 37574 -33074 -62286
8724 -62286 -67076 -48890 -22099 -21270 -1419 -45321 -98402 -9268 12238 7932 14909 -41403 -64019
$$ packed form
8809C9472o7865l1546M4364N7442k6172l7847K9903m1943J232j2399J3007q793
8797d1145j2083k58M4401L1910L3502j4043P341k2876J3950k707m1727J6230M8940
8784F1435l5900m0550m564L737k2791l8460N1608O2386j7477j6472k6932l4487
8772e8467J5320j6783o965Q8769J4156k7895l5024o092L1228L6057M6769M2122
8760A23195j6129m694m2155p4296k0005j7658j9862J1635L3913N3395J1609P2335
8748A11283J7717J2345N6716n361o2954m8196n5056k1212k8755O2295N2403k9964
8736F1261J3898L4427M1738j3392m4950m054l0538l5254L0796j6358p0648k9212
8724f2286m790J8186K6791Q29J9851m3902n3081Q9134K1506m306O977n6312k2616
$$ plain form
8711 -64019 -49243 -17226 40023 25541 -29470 -50064 -14305 4090 62695 73622 86502 24354
8699 24354 31374 15696 14009 -22689 -49113 -68745 -52530 -26332 27922 61883 18029 -56461
8687 -56461 -54188 12256 65702 43078 45901 46498 19239 27349 11778 3446 -1098 -702 -9600 -8412
8673 -8412 -3041 26902 10301 -23259 -37269 -49246 -69993 -132693 -168199 -153155 -83535 14250
8661 14250 158373 152872 88661 11500 -29571 -9320 59745 57510 95509 108214 106081 115093
8649 115093 103291 42042 64945 31095 -6301 -22067 -31466 -80736 -93176 -46567 4204 1489
8637 1489 -19434 4890 48139 66226 -17629 -112833 -80499 -23332 11650 -17193 502 -35165
8625 -35165 -26425 8403 73468 19799 -36965 -64968 -30355 528 -74015 -53532 93 47365
$$ packed form
8711f4019J4776L2017N7249j4482n5011k0594L5759J8395N8605J0927J2880o2148
8699B4354P020j5678j687l6698k6424j9632J6215K6198N4254L3961m3854p4490
8687e6461K273O6444N3446k2624K823N97k7259Q110j5571q332m544L96q898J188
8673h412N371K9943j6601l3560j4010j1977k0747o2700l5506J5044O9620R7785
8661A4250J44123n501o4211p7161m1071K0251O9065k235L7999J2705k133R012
8649A15093j1802o1249K2903l3850l7396j5766r399m9270j2440M6609N0771k715
8637A489k0923K4324M3249J8087q3855r5204L2334N7167L4982k8843J7695l5667
8625c5165Q740L4828O5065n3669n6764k8003L4613L0883p4543K0483N3625M7272
$$ plain form
8613 47365 26818 32156 16415 -7486 -11642 870 7430 18077 -36894 -10414 23667 14398 62237
8600 62237 54279 -48931 -77107 -95133 -47816 -77724 -78299 -67009 -76121 -33831 16007 20408 34100
8587 34100 23530 28744 60451 85970 122076 214490 184034 130493 41435 77037 112516 34001
8575 34001 24825 50366 43487 60230 19272 26065 83892 76213 948 -20013 -14140 -27776 -16213
8562 -16213 13470 -1491 -53496 -72078 5568 52633 113787 89000 5131 8238 42440 108903
8550 108903 61721 7648 -12105 25377 8068 -8410 -16860 64135 97132 37600 40048 48448
8538 48448 31619 73604 74059 93871 107498 175648 150155 119297 88973 87318 27337 -17750
8526 -17750 -9305 15255 34611 -33858 -52837 -29191 -59545 -54700 -71763 -40633 -10270 -47366
$$ packed form
8613D7365k0547N338j5741k3901m156J2512O560J0647n4971K6480L4081r269M7839
8600F2237p958j03210k8176j8026M7317k9908n75J1290r112M2290M9838M401J3692
8587C4100j0570N214L1707K5519L6106R2414l0456n3541q9058L5602L5479p8515
8575C4001r176K5541o879J6743m0958O793N7827p679p5265k0961N873j3636J1563
8562a6213K9683j4961n2005j8582P7646M7065O1154k4787q3869L107L4202O6463
8550A08903m7182n4073j9753L7482j7309j6478q450Q0995L2997n9532K448Q400
8538D8448j6829M1985M55J9812J3627O8150k5493l0858l0324j655n9981m5087
8526a7750Q445K4560J9356o8469j8979K3646l0354M845j7063L1130L0363l7096
$$ plain form
8514 -47366 -84109 -55008 13176 27672 -28782 -57594 -54275 -16589 13175 -6847 27267 59671
8502 59671 49021 100192 131790 199637 185756 172280 206878 152982 42240 53615 99691 80890
8490 80890 78034 4667 -95190 -119442 -83313 -52784 -12716 -40949 -59320 -88463 -38584 -65743
8478 -65743 -141348 -157706 -126331 -114733 -79612 -66773 -74265 -126913 -79162 -16527 20365 19221
8466 19221 -56308 -24871 -2263 -7810 16581 -9598 22612 33162 20224 -7583 -79695 -91815
8454 -91815 -39504 -50944 9608 23799 30721 86665 77160 18333 -16599 -5363 -41128 6291
8442 6291 91243 106062 109797 176602 194964 97461 2637 -28983 -9446 12989 -14098 -46407
8430 -46407 -58460 -51922 -35217 -24819 -27245 37808 17863 -26541 -95519 -119986 -75267 -71460
$$ packed form
8514d7366l6743K9101O8184J4496n6454k8812L319L7686K9764k0022L4114L2404
8502E9671j0650N1171L1598O7847j3881j3476L4598n3896j10742J1375M6076j8801
8490H0890k856p3367r9857k4252L6129L0529M0068k8233j8371k9143M9879k7159
8478f5743p5605j6358L1375J1598L5121J2839p492n2648M7751O2635L6892j144
8466A9221p5529L1437K2608n547K4391k6179L2210J0550j2938k7807p2112j2120
8454i1815N2311j1440O0552J4191O922N5944r505n8827l4932J1236l5765M7419
8442F291Q4952J4819L735O6805J8362r7503r4824l1620J9537K2435k7087l2309
8430d6407j2053O538J6705J0398k426O5053j9945m4404o8978k4467M4719L807
$$ plain form
8418 -71460 -66935 -116654 -63764 -66856 -72763 -103652 -142157 -140302 -63679 -47316 -60505 -120984 -114206
8405 -114206 -79450 -97859 -83179 -37226 -40674 -25742 -8278 68309 134829 99135 38467 -31564
8393 -31564 -88570 -31232 24002 -3917 -52353 -93162 -21957 -58979 -80945 -49956 28577 85696
8381 85696 70087 50282 85175 42752 -33722 -11834 -825 -18334 15757 29479 -5666 4813
8369 4813 46116 73623 117706 61593 42504 11243 13397 -1513 41622 92796 40689 7298
8357 7298 20996 49587 26965 -79357 -123973 -67986 -38625 -13801 91131 118413 115939 37071
8345 37071 52832 56568 25240 64374 66088 33746 12045 25920 83329 38753 67468 7233
8333 7233 -14842 -925 20637 17186 16691 31466 33443 1934 -6905 -34373 -52132 11315 54376
$$ packed form
8418g1460M525m9719N2890l092n907l0889l8505J855P6623J6363j3189o0479O778
8405a14206L4756j8409J4680M5953l448J4932J7464P6587O6520l5694o0668p0031
8393c1564n7006N7338N5234k7919m8436m0809P1205l7022k1966L0989P8533N7119
8381H5696j5609j9805L4893m2423p6474K1888J1009j7509L4091J3722l5145J0479
8369D813M1303K7507M4083n6113j9089l1261K154j4910M3135N1174n2107l3391
8357G298J3698K8591k2622j06322m4616N5987K9361K4824J04932K7282k474p8868
8345C7071J5761L736l1328L9134J714l2342k1701J3875N7409m4576K8715o0235
8333G233k2075J3917K1562l451m95J4775J977l1509q839k7468j7759O3447M3061
$$ plain form
8320 54376 3784 -105408 -109253 -148887 -133443 -124579 -82423 -28771 -74596 -113787 -110975 -84325
8308 -84325 -67324 -52860 -41145 13056 14445 19250 62456 41465 75188 87297 102018 69894
8296 69894 49084 66098 54111 -12371 -35385 -30339 -107668 -126471 -1263 36952 -20021 -63097
8284 -63097 10616 55640 77405 98809 89404 41537 71841 23889 1099 -36543 -59540 5529
8272 5529 -51378 -129415 -85608 -122657 -201411 -137756 -82885 -70494 -44686 -34943 -67915 -58350
8260 -58350 -46262 -45722 -41501 -63453 36464 109070 109280 52181 24313 2258 -18781 21675 24389
8247 24389 -19628 -55247 -83773 -4230 -3390 -88022 -82213 10145 -29694 -49847 -1542 -2246 -10224
8234 -10224 9571 14760 -13612 32210 23440 32739 31528 -15461 -49326 -75567 -124554 -195779 -235523
$$ packed form
8320E4376n0592j09192l845l9634J5444Q864M2156N3652m5825l9191K812K6650
8308h4325J7001J4464J1715N4201J389M805M3206k0991L3723J2109J4721l2124
8296F9894k0810J7014j1987o6482k3014N046p7329j8803J25208L8215n6973m3076
8284f3097P3713M5024K1765K1404r405m7867L0304m7952k2790l7642k2997O5069
8272E529n6907p8037M3807l7049p8754O3655N4871J2391K5808R743l2972R565
8260e8350J2088N40M221k1952R9917P2606K10n7099k7868k2055k1039M0456K714
8247B4389m4017l5619k8526P9543Q40q4632N809R2358l9839k0153M8305p04p978
8234a0224J9795N189k8372M5822q770R299j211m6989l3865k6241m8987p1225l9744
$$ plain form
8221 -235523 -140567 -31540 -30942 -68521 -63693 -48538 -63928 -83655 -8117 32037 22295 -58899
8209 -58899 -66613 -80027 -80337 -25780 10560 39529 78744 59326 28297 9304 -4774 -19465
8197 -19465 -63849 -75056 -8415 96762 63636 60413 -33858 -92622 -127031 -57487 -12578 -18639
8185 -18639 9314 2323 6578 -57009 -62198 -101983 -91202 -44563 -29059 -32576 -50611 -13024 5269
8172 5269 -13724 3481 42643 46409 -25111 -44439 -74887 -104856 -93533 -72821 -42394 -70893
8160 -70893 -25292 -3634 -43633 -95525 -140240 -119163 -75718 -5995 -15751 28987 49129 67383
8148 67383 13504 -41120 -15505 -7742 -66074 -61720 -119595 -165508 -143881 -80239 -30506 -7397
8136 -7397 6555 32030 -13393 -38835 4323 -5144 -32504 -31967 -17380 -6460 -26846 -62044 -56517
$$ packed form
8221b35523R4956J09027N98l7579M828J5155j5390j9727P5538M0154r742q1194
8209e8899p714j3414l10N4557L6340K8969L9215j9418l1029j8993j4078j4691
8197a9465m4384j1207O6641J05177l3126l223r4271n8764l4409O9544M4909o061
8185a8639K7953o991M255o3587n189l9785J0781M6639J5504l517j8035L7587J8293
8172E269j8993J7205L9162L766p1520j9328l0448k9969J1323K0712L0427k8499
8160g0893M5601K1658l9999n1892m4715K1077M3445O9723r756M4738K0142J8254
8148F7383n3879n4624K5615P763n8332M354n7875m5913K1627O3642M9733K3109
8136g397J3952K5475m5423k5442M3158r467k7360N37J4587J0920k0386l5198N527
$$ plain form
8123 -56517 -58614 -40889 -75619 -78047 -39389 -1734 19116 5860 10489 3639 -2669 2459 28398
8110 28398 37192 70647 23005 -679 -2554 69847 82732 72022 25643 31314 24510 9302 -57108
8097 -57108 -69463 37 11249 -66036 -134373 -160288 -111956 -42814 -8641 29121 69142 57307
8085 57307 8844 -79942 -134226 -75785 -49704 -28774 -57115 -81894 -84734 -39682 -20941 53312
8073 53312 63252 70047 85738 25818 -58305 -26530 1574 39470 6096 42811 124198 64584
8061 64584 -22564 -40005 30171 10700 36132 66948 75550 72218 29606 -15666 -50341 -71329
8049 -71329 -101519 -65113 7251 -42456 -85307 -74007 -90236 -165459 -112387 -78694 -78813 -94170
8037 -94170 26213 91500 66933 33618 -45747 -112300 -87790 -35681 -77162 -93110 -148166 -157766
$$ packed form
8123e6517k097J7725l4730k428L8658L7655K0850j3256M629o850o308N128K5939
8110B8398Q794L3455m7642k3684j875P2401J2885j0710m6379N671o804j5208o6410
8097e7108j2355O9500J1212p7285o8337k5915M8332O9142L4173L7762M0021j1835
8085E7307m8463q8786n4284N8441K6081K0930k8341k4779k840M5052J8741P4253
8073E3312R940O795J5691n9920q4123L1775K8104L7896l3374L6715Q1387n9614
8061F4584q7148j7441P0176j9471K5432L0816Q602l332m2612m5272l4675k0988
8049g1329l0190L6406P2364m9707m2851J1300j6229p5223N3072L3693j19j5357
8037i4170J20383O5287k4567l3315p9365o6553K4510N2109m1481j5948n5056r600
$$ plain form
8025 -157766 -49050 -21588 -70736 -90795 -54138 -2845 33581 25445 -6925 -11460 9128 41136
8013 41136 139094 119253 109202 37699 -17222 -38071 -39145 -61019 -45104 -89259 -110898 -99750
8001 -99750 -131257 -83833 -28550 93348 132189 118895 87354 81344 71727 87988 91166 39267
7989 39267 -31554 -31385 -6612 41249 41552 13036 35794 36191 8190 -30223 -68070 -13959 25453
7976 25453 966 -31859 -85640 -120608 -72936 418 -31886 11612 15982 20875 7193 -3674
7964 -3674 -26905 -32053 -34141 11088 43599 31305 -29668 -10944 65704 82211 87452 75508 2878
7951 2878 -35360 -57152 -28907 -21366 24488 14053 -48730 969 71121 64128 38009 -7716
7939 -7716 9161 33029 67812 22808 -13507 -12501 -2710 -41601 -121671 -78270 -56990 -12759
$$ packed form
8025a57766J08716K7462m9148k0059L6657N1293L6426q136l2370m535K0588L2008
8013D1136R7958j9841j0051p1503n4921k0849j074k1874J5915m4155k1639J1148
8001i9750l1507M7424N5283J21898L8841j3294l1541o010r617J6261L178n1899
7989C9267p0821J69K4773M7861L03k8516K2758L97k8001l8413l7847N4111L9412
7976B5453k4487l2825n3781l4968M7672P3354l2304M3498M370M893j3682j0867
7964c674k3231n148k088M5229L2511j2294o0973J8724P6648J6507N241j1944p2630
7951B878l8238k1792K8245P541M5854j0435o2783M9699P0152o993k6119m5725
7939g716J6877K3868L4783m5004l6315J006R791l8891q0070M3401K1280M4231
$$ plain form
7927 -12759 -19711 -2035 14454 22564 24231 -13831 -1312 -9776 9643 -7038 36240 52859 42771
7914 42771 19872 -1829 -10164 -12898 -12691 43333 94503 42766 9583 -40197 10568 54602 32642
7901 32642 58530 128609 172581 142207 64646 50887 58177 136502 109747 75598 72986 14304
7889 14304 3239 -44706 -5785 90437 133414 176167 199244 189086 92857 41782 12325 -6484
7877 -6484 -5349 55241 95435 48094 11404 -17849 7358 -5913 -23284 -53662 -53079 -34509 -9698
7864 -9698 -60572 -116855 -152765 -196973 -206806 -149852 -24884 29702 79279 116019 92349 30047
7852 30047 -28190 -67642 -86312 -104203 -110407 -103772 -60803 -12654 69501 88846 -67433 -106287
7840 -106287 -31608 1655 44764 62135 34789 -2812 6627 22636 38363 -75944 -61301 65499
$$ packed form
7927a2759o952J7676J6489Q110J667l8062J2519q464J9419j6681M3278J6619j0088
7914D2771k2899k1701q335k734K07N6024N1170n1737l3183m9780N0765M4034k1960
7901C2642K5888P0079M3972l0374p7561j3759P290P8325k6755l4149k612n8682
7889A4304j1065m7945L8921R6222M2977M2753K3077j0158r6229n1075k9457j8809
7877f484J135O0590M0194m7341l6690k9253K5207j3271j7371l0378N83J8570K4811
7864i698n0874n6283l5910m4208r833N6954J24968N4586M9577L6740k3670o2302
7852C0047n8237l9452j8670j7891o204O635M2969M8149Q2155J9345j56279l8854
7840a06287P4679L3263M3109J7371k7346l7601R439J6009J5727j14307J4643J26800
$$ plain form
7828 65499 118152 170796 152181 56277 -8365 4000 -15527 901 3783 -19769 11583 -75334
7816 -75334 -74263 -74534 -552 30250 38253 -1618 7048 14325 -7466 43297 71265 68594 88196
7803 88196 74178 81654 59736 5249 59385 56637 19088 -3291 -39095 5460 -14752 -21027
7791 -21027 -55261 -56081 -33924 5075 43762 -3260 26666 88668 70968 65488 42534 -39923
7779 -39923 -73884 -63453 -105627 -146758 -113109 2256 22038 -20835 -12601 60050 31335 17204
7767 17204 41305 68825 54582 16411 -1902 730 -1139 -51164 -39010 1410 41910 73322
7755 73322 62106 71368 56261 19424 3009 64921 90942 25778 28827 63727 59167 44893
7743 44893 65422 -11031 -80727 -78988 -73408 -1376 -25521 -55424 -72074 -52882 -16116 -35195
$$ packed form
7828F5499N2653N2644j8615r5904o4642J2365j9527J6428K882k3552L1352q6917
7816g5334J071k71P3982L0802Q003l9871Q666P277k1791N0763K7968k671J9602
7803H8196j4018P476k1918n4487N4136k748l7549k2379l5804M4555k0212o275
7791b1027l4234q20K2157L8999L8687m7022K9926O2002j7700n480k2954q2457
7779c9923l3961J0431m2174m1131L3649J15365J9782m2873Q234P2651k8715j4131
7767A7204K4101K7520j4243l8171j8313K632j869n0025J2154M0420M0500L1412
7755G3322j1216R262j5107l6837j6415O1912K6021o5164L049L4900m560j4274
7743D4893K0529p6453o9696J739N580P2032k4145k9903j6650J9192L6766j9079
$$ plain form
7731 -35195 -31949 20022 35197 39096 -32451 -97948 -5212 18626 -10673 -42473 -43776 -22082
7719 -22082 -39883 -70539 -65582 7615 37051 25098 -56348 -87952 -45908 -10732 32064 64832
7707 64832 110844 115902 94189 61283 106326 73417 66593 124876 178481 107380 64300 83079
7695 83079 141907 114991 66886 8058 18569 48190 48204 79458 19650 5065 44094 78381
7683 78381 52162 15311 -28280 -62848 -51362 -60091 -19474 -39569 -60891 -93252 -72322 -34686
7671 -34686 -14898 -19327 -47215 -57549 -16875 -18777 -30979 -22044 -56352 -10431 -23057 -38373
7659 -38373 20439 93590 106710 91786 65210 3980 -74834 -114941 -137279 -103105 -77135 2848
7647 2848 -26185 -70919 -42923 57163 28388 -16511 -27058 -27875 -80069 -71321 -27058 12245
$$ packed form
7731c5195L246N1971J5175L899p1547o5497R2736K3838k9299l1800j303K1694
7719b2082j7801l0656M957P3197K9436j1953q1446l1604M2044L5176M2796L2768
7707F4832M6012N058k1713l2906M5043l2909o824N8283N3605p1101m3080J8779
7695H3079N8828k6916m8105n8828J0511K9621J4L1254n9808j4585L9029L4287
7683G8381k6219l6851m3591l4568J1486q729M0617k0095k1322l2361K0930L7636
7671c4686J9788m429k7888j0334M0674j902j2202Q935l4308M5921j2626j5316
7659c8373N8812P3151J3120j4924k6576o1230p8814m0107k2338L4174K5970P9983
7647B848k9033m4734K7996J00086k8775m4899j0547q17n2194Q748M4263L9303
$$ plain form
7635 12245 -9264 -90169 -86400 30416 7124 -75898 -94902 -60831 -15638 -48501 -43497 -40687
7623 -40687 -34004 -10608 -17075 -24504 -58090 -73673 -59180 -46454 52700 40976 63661 -10762
7611 -10762 -89764 -80335 -87526 -70860 -4953 24245 35909 28312 30304 337 -23100 65606 19264
7598 19264 -35503 -46291 -66792 -139525 -102927 -58576 4566 51284 73325 20304 -225 -38790
7586 -38790 -72849 -90875 -87589 -16605 -10421 34617 81758 58762 34546 21133 -14400 23821
7574 23821 13264 -35394 -37709 -86458 -97297 -39780 7674 28140 19488 -34116 -31375 47824
7562 47824 46618 52302 -27735 -82254 -56020 -12316 726 -45813 13413 110 -24378 -32629
7550 -32629 -86870 -83402 -62352 -59534 -20879 26765 -6388 -74315 -46331 -34899 -790 42128
$$ packed form
7635A2245k1509q0905L769J16816k3292q3022j9004L4071M5193l2863N004K810
7623d0687O683K3396o467p429l3586j5583J4493J2726R9154j1724K2685p4423
7611a0762p9002R429p191J6666O5907K9198J1664p597J992k9967k3437Q8706m6342
7598A9264n4767j0788k0501p2733L6598M4351O3142M6718K2041n3021k0529l8565
7586c8790l4059j8026L286P0984O184M5038M7141k2996k4216j3413l5533L8221
7574B3821j0557m8658k315m8749j0839N7517M7454K0466q652n3604K741P9199
7562D7824j206N684q0037n4519K6234M3704J3042m6539N9226j3303k4488q251
7550c2629n4241L468K1050K818L8655M7644l3153o7927K7984J1432L4109M2918
$$ plain form
7538 42128 45641 65809 406 20692 51419 16931 14996 -12208 2329 62466 69245 6121
7526 6121 -5653 29608 51145 43375 48050 -41721 -19397 4444 -7904 -12099 17799 -15936 16590
7513 16590 42063 -41230 -19123 38672 35407 46180 90458 52304 -972 -42162 -85625 -152921
7501 -152921 -140361 -37417 -23132 -71159 -105707 -135315 -117808 -70651 9681 46816 -8828
7490 -8828 -10494 -17195 -81332 -115098 -99355 -46940 -53874 -33716 -17097 35748 17736 21903 -69040
7477 -69040 -157328 -156934 -56821 20715 36160 40077 -18151 -34157 19904 52896 21243 -6718
7465 -6718 -13478 -14946 -38191 11577 6669 39886 100237 93203 42224 42505 115616 139215 91897
7452 91897 34444 -11090 -48859 -83472 -23548 103509 83723 80523 108829 96801 69873 89691
$$ packed form
7538D2128L513K0168o5403K0286L0727l4488j935k7204J4537O0137O779o3124
7526F121j1774L5261K1537p770M675q9771K2324K3841j2348m195K9898l3735L2526
7513A6590K5473q3293K2107N7795l265J0773M4278l8154n3276m1190m3463o7296
7501a52921J2560J02944J4285m8027l4548k9608J7507M7157Q0332L7135n5644
7490h828j666o701o4137l3766J5743N2415o934K0158J6619N2845j8012M167r0943
7477f9040q8288L94J00113P7536J5445L917n8228j6006N4061L2992l1653k7961
7465f718o760j468k3245M9768m908L3217O0351p034n0979K81P3111K3599m7318
7452I1897n7453m5534l7769l4613N9924J27057j9786l200K8306j2028k6928J9818
$$ plain form
7440 89691 97337 94706 103301 33254 -58532 -97621 -101415 -138553 -177386 -130653 -113161 -82381 -18126
7427 -18126 19060 40036 68394 42060 -32617 -81414 -107264 -78624 -19870 -84485 -111091 -92984
7415 -92984 -68453 -1170 -8971 -5849 43876 -25652 2439 25508 -36010 -54735 -20452 -22439
7403 -22439 -36749 4943 17257 -40586 -30856 33029 54344 52945 52146 38841 28616 38622 59669
7390 59669 10851 -54858 -93525 -46651 -74921 -112610 -121136 -107299 -58670 -20608 5957 -15055
7378 -15055 -34962 -51920 -50538 -54668 -56079 -40254 -43148 -47872 -31061 -34741 -7543 -5928 -1609
7365 -1609 -6502 48485 93879 147824 96176 40868 30726 4182 -28500 -34974 -41520 -31930 -49527
7352 -49527 -71192 -33169 -6223 27436 -40165 16724 59823 71978 85651 47059 2605 -42938
$$ packed form
7440H9691P646k631Q595p0047r1786l9089l794l7138l8833M6733J7492L0780O4255
7427a8126L7186K0976K8358k6334p4677m8797k5850K8640N8754o4615k6606J8107
7415i2984K4531O7283p801L122M9725o9528K8091K3069o1518j8725L4283j987
7403b2439j4310M1692J2314n7843R730O3885K1315j399p99j3305j0225J0006K1047
7390E9669m8818o5709l8667M6874k8270l7689q526J3837M8629L8062K6565k1012
7378a5055j9907j6958J382m130j411J5825k894m724J6811l680K7198J615M319
7365a609m893N4987M5394N3945n1648n5308j0142k6544l2682o474o546R590j7597
7352d9527k1665L8023K6946L3659o7601N6889M3099J2155J3673l8592m4454m5543
$$ plain form
7340 -42938 -53404 -46873 -36387 11574 -4245 -39029 -41922 11264 -3879 -6706 -10981 -15345 34323
7327 34323 39045 -25973 -63772 -48218 -81134 -67813 14182 55643 77779 23231 -704 65236
7315 65236 66200 -12547 -61167 -113828 -153185 -100673 -70891 -44656 -16705 -80659 -82307 -140190
7303 -140190 -120495 -54330 -98469 -111623 -57874 -31770 5353 11627 21055 -8337 13330 60249
7291 60249 18926 37182 18552 2220 10833 62686 60723 -54767 -89630 -72871 -26875 57674
7279 57674 121773 29371 32024 43452 100746 70293 -9461 -103304 -121314 -109121 -125054 -154631
7267 -154631 -111364 -48738 13103 35208 11467 65824 94187 111965 57791 37835 35938 5170
7255 5170 -47548 -66230 -38962 7436 32636 17655 25506 99830 84865 18054 -34529 -37959
$$ packed form
7340d2938j0466O531J0486M7961j5819l4784k893N3186j5143k827m275m364M9668
7327C4323M722o5018l7799J5554l2916J3321Q1995M1461K2136n4548k3935O5940
7315F5236R64p8747m8620n2661l9357N2512K9782K6235K7951o3954j648n7883
7303a40190J9695O6165m4139j3154N3749K6104L7123O274R428k9392K1667M6919
7291F0249m1323J8256j8630j6332Q613N1853j963j15490l4863J6759M5996Q4549
7279E7674O4099r2402K653J1428N7294l0453p9754r3843j8010J2193j5933k9577
7267a54631M3267O2626O1841K2105k3741N4357K8363J7778n4174j9956j897l0768
7255E170n2718j8682K7268M6398K5200j4981P851P4324j4965o6811n2583l430
$$ plain form
7243 -37959 -28099 -11829 25185 90580 69673 69133 33070 -20668 -18173 -5005 -11701 -42917 48103
7230 48103 64857 -25011 -63577 -25908 -17201 -26641 -49255 -102326 -111840 -144648 -157085 -116699
7218 -116699 -63711 -16703 58663 45142 -13279 26614 31300 10237 -26408 -41549 -15504 -9801
7206 -9801 -13018 -3081 -72147 -28809 -5661 10152 -19287 345 28369 354 -8309 4241 -3485
7193 -3485 -15613 -628 99970 125262 128283 64722 -49177 -102279 -70197 -42128 -23162 -67085
7181 -67085 -110593 -51865 16441 60756 87839 73512 54931 27841 -35648 -66987 -117649 -141867
7169 -141867 -143529 -18062 -2657 -15453 -45859 -21330 47278 98099 108938 84442 98453 105054
7157 105054 41418 14784 88725 94050 53942 23534 -5167 11282 7399 -42440 -57712 24179
$$ packed form
7243c7959R860J6270L7014O5395k0907n40l6063n3738K495J3168o696l1216R1020
7230D8103J6754q9868l8566L7669Q707r440k2614n3071r514l2808j2437M0386
7218a16699N2988M7008P5366j3521n8421L9893M686k1063l6645j5141K6045N703
7206i801l217R937o9066M3338K3148J5813k9439J9632K8024k8015q663J2550p726
7193c485j2128J4985J00598K5292L021o3561j13899n3102L2082K8069J8966m3923
7181f7085m3508N8728O8306M4315K7083j4327j8581k7090o3489l1339n0662k4218
7169a41867j662J25467J5405j2796l0406K4529O8608N0821J0839k4496J4011O601
7157A05054o3636k6634P3941N325m0108l0408k8701J6449l883m9839j5272Q1891
$$ plain form
7145 24179 -4187 -83063 -91810 -24097 -78089 -140007 -105756 -1121 3474 28806 7409 -824
7133 -824 -68512 -122978 -122292 -103953 -91880 -108874 -123990 -100713 -37908 -25064 -50862 -71796 -65586
7120 -65586 -27000 45334 82463 -42974 -83160 -47879 17003 31536 -24931 -105875 -84806 -56935
7108 -56935 -957 -84322 -157868 -155346 -121811 -93903 -116597 -72248 -32361 -45689 -45798 -65528
7096 -65528 -44801 532 19744 34547 27831 -52219 -65678 -74932 -69433 -25309 -63034 -91529
7084 -91529 -115664 -155976 -174190 -145009 -113642 -80774 -78871 -110352 -80431 -40036 -33227 1080
7072 1080 15978 37318 3928 -21779 15674 10727 -38018 -70719 -45309 20941 41218 10234
7060 10234 29741 36412 -5012 -70633 -126903 -82140 -14523 6923 38011 41771 68317 67794 26613
$$ packed form
7145B4179k8366p8876q747O7713n3992o1918L4251J04635M595K5332k1397q233
7133h24o7688n4466O86J8339J2073j6994j5116K3277O2805J2844k5798k0934O210
7120f5586L8586P2334L7129j25437m0186L5281O4882J4533n6467q0944K1069K7871
7108e6935N5978q3365p3546K522L3535K7908k2694M4349L9887j3328j09j9730
7096f5528K0727M5333J9212J4803o716q0050j3459r254N499M4124l7725k8495
7084i1529k4135m0312j8214K9181L1367L2868J903l1481K9921M0395O809L4307
7072A080J4898K1340l3390k5707L7453m947m8745l2701K5410O6250K0277l0984
7060A0234J9507O671m1424o5621n6270M4763O7617K1446L1088L760K6546n23m1181
$$ plain form
7047 26613 43908 158830 145632 127210 109853 61241 28798 -14284 -46420 -2308 -41943 -65734
7035 -65734 -21593 -107837 -155794 -97934 -55160 -25957 20072 -11835 55461 93388 45397 -6321
7023 -6321 -16568 -40280 -37303 -77392 -32023 29424 43287 113066 56577 55010 87737 112454
7011 112454 61531 -22356 -96618 -65909 -67891 -40004 -19326 -8042 -86454 -109082 -87516 -35209
6999 -35209 -19556 -77204 -78161 -76078 -99335 -81156 -86404 -87446 -42544 -11428 -56142 -26878 940
6986 940 7555 -7495 -11941 -39444 -82958 -100775 -120700 -72333 -38371 -74359 -129784 -75255 3634
6973 3634 -4916 -45001 -79403 -88130 -50061 -30835 20428 19749 -16543 -59825 -59425 -24623 -13577
6960 -13577 -42486 -29776 -6990 49739 52346 -30877 -50185 -41491 -697 28337 133579 112963
$$ packed form
7047B6613J7295J14922j3198j8422j7357m8612l2443m3082l2136M4112l9635k3791
7035f5734M4141q6244m7957N7860M2774K9203M6029l1907O7296L7927m7991n1718
7023f321j0247k3712K977m0089M5369O1447J3863O9779n6489j567L2727K4717
7011A12454n0923q3887p4262L0709j982K7887K0678J1284p8412k2628K1566N2307
6999c5209J5653n7648r57K083k3257J8179n248j042M4902L1116m4714K9264K7818
6986I40O615j5050m446k7503m3514j7817j9925M8367L3962l5988n5425N4529P8889
6973C634q550m0085l4402q727L8069J9226N1263o79l6292m3282M00L4802J1046
6960a3577k8909J2710K2786N6729K607q3223j9308Q694M0794K9034J05242k0616
$$ plain form
6948 112963 60586 77352 25941 32227 23268 34884 -32521 21567 42112 24983 9144 32147
6936 32147 -38534 -54835 -33437 -86078 -55088 -1639 35572 69524 65211 93834 66987 37785
6924 37785 16396 -23875 -24873 11067 92509 65854 29404 41269 58610 87646 40973 21396
6912 21396 29676 16359 -21041 -24794 -18328 35084 55649 -10990 -43992 -68750 -51527 -49938 4453
6899 4453 37148 -30600 18430 37498 -23062 -81386 -31823 -84949 -94012 -49174 -7483 -18826
6887 -18826 -67308 -71355 -16254 -34294 -60356 -3774 -67366 -129566 -124322 -84085 -58288 -37983
6875 -37983 -20 13638 -49884 -92202 -28848 -39055 -54623 -14027 5585 -93321 -102096 -44638
6863 -44638 -17459 3108 -70220 -93412 -34346 -39488 -79257 -105424 -93363 -113294 -97227 -76298
$$ packed form
6948A12963n2377J6766n1411O286q959J1616o7405N4088K0545j7129j5839K3003
6936C2147p0681j6301K1398n2641L0990N3449L7211L3952m313K8623k6847k9202
6924C7785k1389m0271r98L5940Q1442k6655l6450J1865J7341K9036m6673j9577
6912B1396Q280j3317l7400l753O466N3412K0565o6639l3002k4758J7223J589N4391
6899D453L2695o7748M9030J9068o0560n8324M9563n3126r063M4838M1691j1343
6887a8826m8482m047N5101j8040k6062N6582o3592o2200N244M0237K5797K0305
6875c7983L7963J3658o3522m2318O3354j0207j5568M0596J9612r8906q775N7458
6863d4638K7179K0567p3328k3192N9066n142l9769k6167J2061j9931J6067K0929
$$ plain form
6851 -76298 -26258 -26716 6025 -31806 -73213 -57082 -81173 -53837 49931 82834 89251 141854
6839 141854 171748 214242 137553 48305 46411 13106 -58441 -87604 -81482 9119 45985 24584
6827 24584 295 45405 -30509 -92212 -33544 -773 39421 64693 96829 115801 71423 32592
6815 32592 -25794 -27669 1515 -13620 2601 14696 13569 -40520 -85123 -36006 -21153 -117984
6803 -117984 -135391 -45564 24975 -2789 -87191 -101828 -43329 -15944 16566 19276 39277 46014
6791 46014 33831 37534 9476 -110006 -89396 -19457 28753 43409 18916 21931 -40745 -13197
6779 -13197 27568 51938 71122 34891 15591 75587 12344 30020 68550 55672 14494 -746
6767 -746 20506 -10782 -19589 -22494 -18519 32909 78431 114609 121502 81393 31112 30797 19296
$$ packed form
6851g6298N0040m58L2741l7831m1407J6131k4091K7336J03768L2903O417N2603
6839A41854K9894M2494p6689q9248j894l3305p1547k9163O122R0601L6866k1401
6827B4584k4289M5110p5914o1703N8668L2771M0194K5272L2136J8972m4378l8831
6815C2592n8386j875K9184j5135J6221J2095j127n4089m4603M9117J4853r6831
6803a17984j7407Q9827P0539k7764q4402j4637N8499K7385L2510K710K0001O737
6791D6014j2183L703k8058j19482K0610O9939M8210J4656k4493L015o2676K7548
6779a3197M0765K4370J9184l6231j9300N9996o3243J7676L8530j2878m1178j5240
6767g46K1252l1288q807k905L975N1428M5522L6178O893m0109n0281l15j1501
$$ plain form
6754 19296 1886 -43004 -17370 -10300 -27124 -12685 19251 -18143 -86459 -78525 -2267 19713
6742 19713 21282 74081 86823 8582 11462 -423 -65413 -78149 4868 40389 44609 25663
6730 25663 7150 62635 49258 27883 44208 27396 -5444 -43983 -45094 -55035 -3463 56582
6718 56582 27896 -41023 -33541 -43131 -38666 -36934 -27214 -75088 -107971 -22345 -27836 -1509 107312
6705 107312 125116 136240 96168 72414 60774 14252 4136 14164 39927 57948 28271 -839
6693 -839 -62817 -46305 -75115 -50146 -30198 13486 28340 61081 126075 76151 31994 58979
6681 58979 49500 81788 118156 28471 -29802 -51985 -42097 -7834 1481 -23643 3398 -1443 -1713
6668 -1713 9538 66225 55330 11078 -21089 -947 -58546 -92028 -66430 -31943 -58177 -35943
$$ packed form
6754A9296j7410m4890K5634P070j6824J4439L1936l7394o8316P934P6258K1980
6742A9713J569N2799J2742p8241K880j1885o4990j2736Q3017L5521M220j8946
6730B5663j8513N5485j3377k1375J6325j6812l2840l8539j111r941N1572O0045
6718E6582k8686o8919P482r590M465J732R720m7874l2883Q5626n491K6327J08821
6705A07312J7804J1124m0072k3754j1640m6522j0116J0028K5763J8021k9677k9110
6693h39o1978J6512k8810K4969J9948M3684J4854L2741O4994m9924m4157K6985
6681E8979r479L2288L6368q9685n8273k2183R888L4263R315k5124K7041m841k70
6668a713J1251N6687j0895m4252l2167K0142n7599l3482K5598L4487k6234K2234
$$ plain form
6656 -35943 50870 15038 -11359 3880 41178 15819 -93424 -178948 -88388 -23 44833 62358
6644 62358 30516 80505 103549 32489 -30405 -16901 -31191 22526 68026 65285 -19867 -27248
6632 -27248 64414 128869 38280 15570 -15993 -30007 -105372 -54353 2323 26198 47725 75843
6620 75843 20462 -71327 -49607 -28121 -19945 -12246 -19022 -51975 -42851 -93604 -77208 -5794 10754
6607 10754 48072 28883 -23923 9423 49744 62418 71854 56938 50132 39296 -2127 -47699
6595 -47699 -49964 -43871 -62154 -99127 -41422 55143 66237 36173 3705 -28946 -29680 10476 73952
6582 73952 74008 66808 53863 -2928 29455 15232 -3580 8147 7344 -42922 -65996 -45619 -25711
6569 -25711 -40119 -61256 -26735 -29772 -30068 -20470 -39527 -29268 -25969 -70780 -47869 -30036 -77499
$$ packed form
6656c5943Q6813l5832k6397J5239L7298k5359j09243q5524R0560Q8365M4856J7525
6644F2358l1842M9989K3044p1060o2894J3504j4290N3717M5500k741q5152p381
6632b7248R1662O4455r0589k2710l1563j4014p5365N1019N6676K3875K1527K8118
6620G5843n5381r1789K1720K1486Q176P699o776l2953R124n0753J6396P1414J6548
6607A0754L7318j9189n2806L3346M0321J2674R436j4916o806j0836m1423m5572
6595d7699k265O093j8283l6973N7705R6565J1094l0064l2468l2651p34M0156O3476
6582G3952N6p200j2945n6791L2383j4223j8812J1727q03n0266k3074K0377J9908
6569b5711j4408k1137L4521l037k96R598j9057J0259L299m4811K2911J7833m7463
$$ plain form
6556 -77499 -23267 -49389 -100969 -99771 -85759 -54674 -16665 24027 4890 -33695 -70205 -80098
6544 -80098 -73465 -135700 -91885 -65842 -81194 96 39574 -361 -30236 -47394 -61086 -70940
6532 -70940 -7976 20860 17506 -20827 -76431 -30971 41348 72667 62107 58450 9854 5999
6520 5999 -22055 -14524 27035 57344 108132 131509 73549 19151 -47232 -99874 -71011 -19378
6508 -19378 -7621 26933 123179 177429 96625 61759 71937 151952 168640 125500 139225 137015
6496 137015 159827 163972 133568 54469 33080 34187 -19775 -17767 36560 62212 168428 163445
6484 163445 201368 152362 96294 57921 59942 86764 101851 30242 -34169 -67702 -68704 -71218
6472 -71218 -34651 29979 32645 4139 -4041 50260 39332 -82684 -51171 69220 54263 -6970
$$ packed form
6556g7499N4232k6122n1580J198J4012L1085L8009M0692j9137l8585l6510r893
6544h0098O633o2235M3815K6043j5352Q1290L9478l9935k9875j7158j3692r854
6532g0940O2964K8836l354l8333n5604M5460P2319L1319j0560l657m8596l855
6520E999k8054P531M1559L0309N0788K3377n7960n4398o6383n2642K8863N1633
6508a9378J1757L4554R6246N4250q0804l4866J0178Q0015J6688m3140J3725k210
6496A37015K2812M145l0404p9099k1389J107n3962K008N4327K5652J06216m983
6484A63445L7923m9006n6068l8373K021K6822J5087p1609o4411l3533j002k514
6472g1218L6567O4630K666k8506q180N4301j0928j22016L1513J20391j4957o1233
$$ plain form
6460 -6970 -10893 -50898 -36754 -46806 -37835 15399 30116 59281 98383 100068 133407 126134 108675
6447 108675 87509 4720 -37977 -38361 20937 56956 5566 -24438 69598 128743 92338 82635
6435 82635 48106 10115 14268 -26365 -42368 -85462 -74338 -64284 -50170 -18718 -50062 -90459
6423 -90459 -57294 8599 -33359 -31090 18664 263 -15440 -44345 -10116 -2601 12803 7748
6411 7748 -7732 -78756 -59334 1144 11366 -34631 -13432 -28757 -31264 45768 73790 52783
6399 52783 -4604 2200 31517 10488 -29850 -32210 51932 38517 -9795 -21870 -81056 -92552
6387 -92552 -40846 -40004 -61051 -52190 7211 -6076 22161 42406 46085 -38823 -29144 -14719 658
6374 658 -7980 -57324 -58684 -36275 -24400 41290 23007 12960 58315 111763 71965 17023 18802
$$ packed form
6460f970l923m0005J4144j0052Q971N3234J4717K9165L9102J685L3339p273j7459
6447A08675k1166q2789m2697l84N9298L6019n1390l0004R4036N9145l6405r703
6435H2635l4529l7991M153m0633j6003m3094J1124J0054J4114L1452l1344m0397
6423i0459L3165O5893m1958K269M9754j8401j5703k8905L4229P515J5404n055
6411G748j5480p1024J9422O0478J0222m5997K1199j5325k507P7032K8022k1007
6399E2783n7387O804K9317k1029m0338k360Q4142j3415m8312j2075n9186j1496
6387i2552N1706Q42k1047Q861N9401j3287K8237K0245L679q4908R679J4425J5377
6374F58q638m9344j360K2409J1875O5690j8283j0047M5355N3448l9798n4942J779
$$ plain form
6361 18802 -2873 -27029 -59998 -90461 -88042 -7305 -2999 7312 12007 -18661 -5822 -12259 -59152
6348 -59152 -19242 18144 -26914 -57759 -72920 -117464 -74070 -31402 28785 52375 105712 101031
6336 101031 -9360 -65020 -17468 -74784 -77589 -51815 -17356 3213 -32971 -38125 -29356 -17087
6324 -17087 -23386 -17157 -38803 -79083 -108566 847 80989 65433 32895 15103 -28065 -54008
6312 -54008 -91522 -57443 -95287 -9792 10820 -31847 -28839 -51465 -7626 76443 4906 2738
6300 2738 69671 124994 100615 26942 3838 14125 18096 63636 84288 87831 34115 49861
6288 49861 34629 -30651 -106863 -177683 -200326 -157372 -105225 -82902 -59975 -52933 -47897 -20501
6276 -20501 -62036 -98750 -75134 -72136 -84950 -111030 -66950 14071 27847 14467 19683 7301
$$ packed form
6361A8802k1675k4156l2969l0463K419Q0737M306J0311M695l0668J2839o437m6893
6348e9152L9910L7386m5058l0845j5161m4544M3394M2668O0187K3590N3337m681
6336A01031j10391n5660M7552n7316k805K5774L4459K0569l6184n154Q769J2269
6324a7087o299O229k1646m0280k9483J09413Q0142j5556l2538j7792m3168k5943
6312e4008l7514L4079l7844Q5495K0612m2667L008k2626M3839Q4069p1537k168
6300B738O6933N5323k4379p3673k3104J0287L971M5540K0652L543n3716J5746
6288D9861j5232o5280p6212p0820k2643M2954N2147K2323K2927P042N036K7396
6276b0501m1535l6714K3616K998j2814k6080M4080Q1021J3776j3380N216j2382
$$ plain form
6264 7301 40440 -14083 -29133 -23788 16789 5472 67580 88244 100563 -10193 -69922 -39369
6252 -39369 -47725 -95435 -92619 -86172 -101910 -73278 520 28573 -13234 36362 2078 -38222
6240 -38222 -91413 -152814 -113201 -63000 -43547 -24723 17893 14418 -13657 -13205 -8511 -35021 -97043
6227 -97043 -79100 -16029 60053 58787 30637 74007 43738 9647 -30049 -56587 -33275 -37594
6215 -37594 2285 -29253 -103133 -80876 -83654 -72138 -62346 -45454 -67206 -8913 -41689 -57069
6203 -57069 -39897 -15709 -6119 -8092 -33989 -90385 -101126 -90532 -34135 58301 30637 -43225
6191 -43225 -20986 -9420 72287 63170 3651 -4376 43693 21378 33745 37723 4177 23188
6179 23188 75299 89889 110592 130173 82972 67555 20692 10369 46674 16880 -6127 -7229
$$ packed form
6264G301L3139n4523j5050N345M0577j1317O2108K0664J2319j10756n9729L0553
6252c9369q356m7710K816O447j5738K8632P3798K8053m1807M9596l4284m0300
6240c8222n3191o1401L9613N0201J9453J8824M2616l475k8075M52M694k6510o2022
6227i7043J7943O3071P6082j266k8150M3370l0269l4091l9696k6538K3312m319
6215c7594L9879l1538p3880K2257k778J1516R792J6892k1752N8293l2776j5380
6203e7069J7172K4188R590j973k5897n6396j0741J0594N6397R2436k7664p3862
6191d3225K2239J1566Q1707r117n9519q027M8069k2315J2367L978l3546J9011
6179B3188N2111J4590K0703J9581m7201j5417m6863j0323L6305k9794k3007j102
$$ plain form
6167 -7229 -35697 17954 11380 4587 53780 88830 129142 154908 135736 71536 34486 34317 -32208
$$ packed form
6167g229k8468N3651o574o793M9193L5050M0312K5766j9172o4200l7050j69o6525
$$ [...]
##END NTUPLES=NMR SPECTRUM
##END=
