##TITLE=Analysis number 326262
Compound Code mo 07862
Book Reference 451/199
Project Code adrs
Chemist Name evam
##JCAMPDX= 6.0         $$ Bruker NMR JCAMP-DX V2.0
##DATA TYPE= NMR SPECTRUM
##DATA CLASS= NTUPLES
##ORIGIN= Bruker BioSpin GmbH
##OWNER= nmr
$$ XWIN-NMR		Version 3.5
$$ Tue Jan 30 11:07:46 2007 GMT Standard Time (UT+0h)  MAYBRIDGE\nmr@NMR_250MHZ
##.OBSERVE FREQUENCY= 250.131544655141
##.OBSERVE NUCLEUS= ^1H
##.ACQUISITION MODE= SIMULTANEOUS (DQD)
##.ACQUISITION SCHEME= undefined
##.AVERAGES= 16
##.DIGITISER RES= 18
##SPECTROMETER/DATA SYSTEM= dpx250
##.PULSE SEQUENCE= zg30
##.SOLVENT NAME= CDCl3
##.SHIFT REFERENCE= (INTERNAL, CDCl3, 0, 16.522)
##AUDIT TRAIL= $$ (NUMBER, WHEN, WHO, WHERE, WHAT)
$$ ##TITLE= Audit trail, XWIN-NMR		Version 3.5
$$ ##JCAMPDX= 5.01
$$ ##ORIGIN= Bruker BioSpin GmbH
$$ ##OWNER= nmr
$$ C:\u/data/dgb/nmr/ADRS/2260/pdata/1/auditp.txt
$$ ##AUDIT TRAIL=  $$ (NUMBER, WHEN, WHO, WHERE, WHAT)
(   1,<2007-01-30 11:07:17.20 +000>,<MAYBRIDGE\nmr>,<NMR_250MHZ>,
      <created by zg, POWCHK disabled, PULCHK disabled
       configuration hash MD5:
       49 4B E0 1D 92 C2 6B 37 9F E6 65 BC 52 41 86 1D
       data hash MD5: 64K
       F8 4F 1B 52 35 8F D5 DE 5A A0 45 E1 83 53 B1 0E>)
(   2,<2007-01-30 11:07:34.62 +000>,<MAYBRIDGE\nmr>,<NMR_250MHZ>,
      <Start of raw data processing
       ef LB = 0.3 FT_mod = 6 PKNL = 1 SI = 32K 
       data hash MD5: 32K
       BD 6E 0C B2 DA FA 56 25 50 B2 C2 CA 31 57 5C D9>)
(   3,<2007-01-30 11:07:38.58 +000>,<MAYBRIDGE\nmr>,<NMR_250MHZ>,
      <apk 
       data hash MD5: 32K
       94 CE A1 7C 64 EE 14 3C 03 B5 0A 87 BF 06 E9 38>)
(   4,<2007-01-30 11:07:39.87 +000>,<MAYBRIDGE\nmr>,<NMR_250MHZ>,
      <abs ABSG = 5 
       data hash MD5: 32K
       D2 46 3E 9B CD A0 AA F5 05 EE 40 F0 D1 B5 0C 08>)
$$ ##END=
$$ 
$$ hash MD5
$$ 7E DC F6 95 F5 D2 0B D0 5D 97 68 07 D6 CA B6 EB
##$RELAX= 
##$RELAX= 
##$RELAX= 
##$RELAX= 
##$RELAX= 
##$RELAX= 
##$RELAX= 
$$ Bruker specific parameters
$$ --------------------------
##$DU= <C:\u>
##$EXPNO= 2260
##$NAME= <ADRS>
##$PROCNO= 1
##$TYPE= <nmr>
##$USER= <dgb>
##$AMP= (0..31)
100 100 100 100 100 100 100 100 100 100 100 100 100 100 100 100 100 100 
100 100 100 100 100 100 100 100 100 100 100 100 100 100 
##$AQSEQ= 0
##$AQ_mod= 3
##$AUNM= <au_zg>
##$AUTOPOS= <35 >
##$BF1= 250.13
##$BF2= 250.13
##$BF3= 250.13
##$BF4= 250.13
##$BF5= 500.13
##$BF6= 500.13
##$BF7= 500.13
##$BF8= 500.13
##$BYTORDA= 1
##$CFDGTYP= 0
##$CFRGTYP= 5
##$CHEMSTR= <none>
##$CNST= (0..31)
1 1 145 1 1 1 1 1 1 1 1 1 1 1 1 1 1 1 1 1 1 1 1 1 1 1 1 1 1 1 1 1 
##$CPDPRG= <>
##$CPDPRG1= <>
##$CPDPRG2= <>
##$CPDPRG3= <>
##$CPDPRG4= <mlev>
##$CPDPRG5= <mlev>
##$CPDPRG6= <mlev>
##$CPDPRG7= <mlev>
##$CPDPRG8= <mlev>
##$CPDPRGB= <>
##$CPDPRGT= <>
##$D= (0..31)
0 1 0 0 0 0 0 0 0 0.06 0 0 0 0 0 0 0.0002 0 0 0 0 0 0 0 0 0 0 0 0 0 0 
0 
##$DATE= 1170155236
##$DBL= (0..7)
120 120 120 120 120 120 120 120 
##$DBP= (0..7)
150 150 150 150 150 150 150 150 
##$DBP07= 0
##$DBPNAM0= <>
##$DBPNAM1= <>
$$ [...]
##$SUBNAM7= <"">
##$SUBNAM8= <"">
##$SUBNAM9= <"">
##$SW= 20.6930455092707
##$SWIBOX= (0..15)
0 0 3 0 0 0 0 0 0 0 0 0 0 0 0 0 
##$SW_h= 5175.983436853
##$TD= 65536
##$TD0= 1
##$TE= 294.16
##$TE2= 300
##$TE3= 300
##$TEG= 300
##$TL= (0..7)
0 120 120 120 120 120 120 120 
##$TP= (0..7)
150 150 150 150 150 150 150 150 
##$TP07= 0
##$TPNAME0= <>
##$TPNAME1= <>
##$TPNAME2= <>
##$TPNAME3= <>
##$TPNAME4= <>
##$TPNAME5= <>
##$TPNAME6= <>
##$TPNAME7= <>
##$TPOAL= (0..7)
0.5 0.5 0.5 0.5 0.5 0.5 0.5 0.5 
##$TPOFFS= (0..7)
0 0 0 0 0 0 0 0 
##$TUNHIN= 0
##$TUNHOUT= 0
##$TUNXOUT= 0
##$USERA1= <user>
##$USERA2= <user>
##$USERA3= <user>
##$USERA4= <user>
##$USERA5= <user>
##$V9= 5
##$VALIST= <valist>
##$VCLIST= <CCCCCCCCCCCCCCC>
##$VD= 0
##$VDLIST= <DDDDDDDDDDDDDDD>
##$VPLIST= <PPPPPPPPPPPPPPP>
##$VTLIST= <TTTTTTTTTTTTTTT>
##$WBST= 1024
##$WBSW= 4
##$XGAIN= (0..3)
0 0 0 0 
##$XL= 0
##$YL= 0
##$YMAX_a= 444777
##$YMIN_a= -490704
##$ZGOPTNS= <>
##$ZL1= 120
##$ZL2= 120
##$ZL3= 120
##$ZL4= 120
##$ABSF1= 16.522
##$ABSF2= -4.171173
##$ABSG= 5
##$ABSL= 3
##$ALPHA= 0
##$AQORDER= 0
##$ASSFAC= 0
##$ASSFACI= 0
##$ASSFACX= 0
##$ASSWID= 0
##$AUNMP= <proc_1d>
##$AZFE= 0.1
##$AZFW= 0.1
##$BCFW= 0
##$BC_mod= 0
##$BYTORDP= 0
##$COROFFS= 0
##$CY= 12.5
##$DATMOD= 1
##$DC= 0
##$DFILT= <>
##$DTYPP= 0
##$F1P= 14.0000005364418
##$F2P= -0.99999901652339
##$FCOR= 0.5
##$FTSIZE= 32768
##$FT_mod= 6
##$GAMMA= 0
##$GB= 0
##$INTBC= 1
##$INTSCL= 1
##$ISEN= 128
##$LB= 0.3
##$LEV0= 0
##$LPBIN= 0
##$MAXI= 10000
##$MC2= 0
##$MEAN= 0
##$ME_mod= 0
##$MI= 0
##$NCOEF= 0
##$NC_proc= -3
##$NLEV= 6
##$NOISF1= 0
##$NOISF2= 0
##$NSP= 0
##$NTH_PI= 0
##$NZP= 0
##$OFFSET= 16.522
##$PC= 1
##$PHC0= 228.8586
##$PHC1= 7.834137
##$PH_mod= 1
##$PKNL= yes
##$PPARMOD= 0
##$PSCAL= 4
##$PSIGN= 0
##$REVERSE= no
##$SF= 250.13
##$SI= 32768
##$SIGF1= 0
##$SIGF2= 0
##$SINO= 400
##$SIOLD= 32768
##$SREGLST= <1H.CDCl3>
##$SSB= 0
##$STSI= 32768
##$STSR= 0
##$SW_p= 5175.98343685301
##$SYMM= 0
##$S_DEV= 0
##$TDeff= 65536
##$TDoff= 0
##$TI= <Analysis number 999999
Compound Code 99
Book Reference 9
Project Code 9>
##$TILT= no
##$TM1= 0
##$TM2= 0
##$TOPLEV= 0
##$USERP1= <user>
##$USERP2= <user>
##$USERP3= <user>
##$USERP4= <user>
##$USERP5= <user>
##$WDW= 1
##$XDIM= 32768
##$YMAX_p= 404712114
##$YMIN_p= -118868
$$ End of Bruker specific parameters
$$ ---------------------------------
##NTUPLES= NMR SPECTRUM
##VAR_NAME=  FREQUENCY,     SPECTRUM/REAL,   SPECTRUM/IMAG
##SYMBOL=    X,             R,               I
##VAR_TYPE=  INDEPENDENT,   DEPENDENT,       DEPENDENT
##VAR_FORM=  AFFN,          ASDF,            ASDF
##VAR_DIM=   32768,         32768,           32768
##UNITS=     HZ,            ARBITRARY UNITS, ARBITRARY UNITS
##FACTOR=    0.157963299565203, 1,           1
##FIRST=     4132.6476996994, 0,             0
##LAST=      -1043.33573715361, 0,           0
##MIN=       -1043.33573715361, -118868,     0
##MAX=       4132.6476996994, 404712114,     0
$$ Real data points
##PAGE= N=1
##DATA TABLE= (X++(R..R)), XYDATA
$$ [...]
24803 -4975 -7065 -11834 -21929 -16368 -6102 20709 28376 30809 34558 34947 72164 63035 11017 7784
24789 7784 37900 27526 13157 -1807 -14224 -3617 9788 14596 -12939 5422 22343 24325
24777 24325 33797 17901 20953 8748 -6762 -22379 -27706 3056 8926 6329 12616 22056 15961
24764 15961 15556 -25962 -37114 -30936 -37010 -37996 -42182 -23468 -7289 -5348 -41674 -42285 -23071 -4039
24750 -4039 -18442 -26729 -35827 -35251 -23373 -17612 -20370 -22764 -44044 -59320 -60081 -45615 -20307 1354
24736 1354 3807 -37497 -32367 8114 9424 20246 31951 27084 37295 24499 14540 -521 -10959
24723 -10959 -26650 -3865 8284 23968 29564 40679 17022 3826 -784 -19824 -3322 37967
24711 37967 25343 15957 -2358 -6377 -5697 -21385 -9195 -3022 4558 5797 3568 48 -11727
24698 -11727 -11018 -5778 -14600 -20101 -9719 -22418 -52008 -72879 -39344 6448 18258 3700 -19505
24685 -19505 -52161 -39387 -26473 -6876 -19750 -2123 -9459 -15806 8060 11641 14885 25011
24673 25011 14317 -29653 -56437 -39851 -41183 -30281 7404 33763 10111 15172 25338 6993
24661 6993 11245 6176 8492 25848 28841 17851 17167 18961 6672 11964 20435 4024 17068 60278
24647 60278 39915 18518 22714 10641 31801 36307 9313 -11802 -25274 -41753 -29641 -15682
24635 -15682 -13617 -28398 -51416 -50614 -33221 -38283 -50872 -52025 -37770 -27838 18601 5707 -33826
24622 -33826 -1073 58753 49281 53552 61672 72317 77000 60157 47011 16286 6952 25029 32635
24609 32635 28799 -25555 -75228 -52930 -37070 23693 15083 -12913 -7588 -14153 -6739 9328 -23319
24596 -23319 -35315 -39559 -43595 -4801 -14146 -40127 -27259 1659 15780 2131 -8193 -14747
24584 -14747 -10529 28940 37552 44119 12660 -15644 -24978 -28411 -9149 7756 18785 6589 -6444
24571 -6444 -728 3091 13870 6784 2845 4951 -19159 -21514 -28017 -17219 -25770 -38554 -24558
24558 -24558 2987 -1680 -11623 -9305 -30046 -46173 17757 34541 63525 20404 -24873 -20224
24546 -20224 10415 52130 34818 22610 -511 -33929 -41020 -36778 -33328 -33951 -35887 -46687 -40231
24533 -40231 -28406 -53855 -52706 -22469 -21019 -45658 -21225 -11248 -23949 5789 2003 5734 24380
24520 24380 41921 9856 -24694 6628 2297 -10097 -31628 -37972 -11697 -17793 9863 15760
24508 15760 -12889 -19042 -19272 -20605 -21064 -31245 -7860 -7599 26665 34621 37046 4760 17450 31882
24494 31882 44714 53313 76052 85452 83534 62714 54530 18298 -6817 1706 -11532 -32140 -4737
24481 -4737 37135 10494 -763 -704 2222 -270 -29164 -54153 -29813 -24693 -14195 -865 2479
24468 2479 -14368 -17371 2101 5136 19345 6676 2397 27389 18434 12287 33799 41851 25505
24455 25505 19466 30242 36263 14116 -7444 12548 37818 32546 44940 6644 -28429 -26207
24443 -26207 -10886 16813 -2906 -31109 -15426 -7902 8982 6184 -8469 1550 -3607 -36684
24431 -36684 -24747 -19914 -40469 -32706 -31798 -10684 -19068 -4567 -5922 -31444 -24198 -1099 1229
24418 1229 -11140 -7281 1769 36532 14207 7243 1324 -3663 17421 -21140 -46987 -44542 -53420
24405 -53420 -39287 -4887 15737 -13802 -1239 10762 7729 23546 17947 15764 -5887 -14138
24393 -14138 -2517 7767 1582 -8034 -18168 -8185 126 9403 7881 26663 30146 -24144 -33614
24380 -33614 -31408 -30764 -6312 8617 -4595 708 17136 22767 21892 30912 35724 17206 -7731
24367 -7731 -23380 9590 36920 17419 -16812 525 19431 37750 -8519 -55167 -27388 11061
24355 11061 21048 7546 14941 26830 -3845 -51982 -58407 -15678 19928 27332 32938 50677 39852
24342 39852 20794 802 -12722 -18023 302 -19619 -32039 -23811 -11874 -19064 -37775 -24743
24330 -24743 22410 33893 39164 37814 2685 -20793 -14055 9484 7530 -36335 -55542 -20998
24318 -20998 -7748 -11888 13682 53154 33173 48078 58956 20265 -12603 -19130 -7095 -3865
24306 -3865 39688 63867 66428 67418 37388 16981 16911 8756 11233 36740 19586 2315 -12774
24293 -12774 -21318 3107 -8375 -23040 -24270 -12581 -4844 -18542 -14734 12337 52041 22152
24281 22152 -522 -6591 -25494 -41192 -35452 -17133 500 9162 13421 980 -11564 2704
24269 2704 2432 -28461 -40687 -35666 -11791 -10922 -16516 -13684 1950 13811 9604 52007 65953
24256 65953 46469 3734 -30071 -28909 -31834 -45262 -7005 2382 -31284 -70582 -68491 -42927
24244 -42927 -34432 -48666 -49949 -19466 858 -22680 -69487 -76080 -64613 -55024 -54753 -68578 -73358
24231 -73358 -84303 -44589 16696 26756 41721 25826 12606 38423 49652 26029 -711 2381
24219 2381 15096 6781 -19917 -45029 -40222 -45080 -60315 -55924 -39646 -17669 -17178 -18069 1583
24206 1583 14953 -6946 4268 -13175 -37329 -35167 -39689 -53067 -26436 5866 18532 21902
24194 21902 1272 -3029 21473 30110 6345 3791 -1005 -17577 -5624 2290 17880 45738 31867
24181 31867 2122 -11775 -14551 1433 3785 -389 24231 2984 -19366 -24381 -18393 -21828 -11310
24168 -11310 -6351 -20650 -11832 -4881 13610 10161 3178 -3165 -10145 -21197 -9101 -17423 -40254
24155 -40254 -18622 23675 19556 10761 -2279 -2439 14977 30890 40829 52315 55466 54993 52401
24142 52401 34308 28976 39701 38186 1093 -5302 -14829 -32006 3437 19014 3189 4278 6408
24129 6408 15377 851 1532 13383 -15732 -8763 -7652 -8067 7924 -3364 -41816 -18141 25505
24116 25505 25590 -7385 -33159 -34913 -24783 -15870 -15297 -23576 -29391 1765 15568 -1093 7579 10809
24102 10809 12865 21924 57710 41650 -13530 -32579 986 24652 21460 9281 -15399 -31817
24090 -31817 -29322 -11685 -17734 5554 2424 -8821 3585 -16987 -4764 7454 -14638 -11118
24078 -11118 -3997 -8931 7655 11521 15585 25478 36226 57284 55348 35703 17334 6655 11380
24065 11380 9810 -12953 -15156 6130 9501 8719 1675 -14663 6682 29255 33601 49665 60639
24052 60639 28330 7277 11130 4448 5818 17215 21798 28369 17002 16383 20377 16853 7378 17078
24038 17078 7000 21257 41212 57521 27076 3031 -14334 -20354 -14954 8741 -3565 -6062
24026 -6062 14541 8786 15450 26340 13865 -4399 -4776 -13188 -38370 -12100 -9797 -25614 -44326
24013 -44326 -26239 -24471 -3251 -527 -16294 -18510 -13527 8576 3851 -35992 -46109 -47777 -51575
24000 -51575 -46341 -23972 -7199 -17072 -33121 -32608 -56570 -62394 -34452 8273 30160 -2439 -27154
23987 -27154 -11071 -19657 6197 13569 17502 28817 6611 10737 13800 22336 8868 -29741 -55561
23974 -55561 -44641 -32338 -51744 -53589 -43812 -32043 -18278 -27816 -35685 -17332 10548 -1971
23962 -1971 -1315 -22282 -31078 1287 26160 -650 -36253 -38013 -1730 10215 24109 -3841 -11376
23949 -11376 -16467 -17795 -7634 16247 35775 31270 35923 38536 37365 38944 39595 20222 -6358
23936 -6358 3679 13347 16814 -4709 -10796 -8575 8753 21428 6753 14704 9353 12963 37638
23923 37638 12040 -2413 -12102 -12868 -35875 -74414 -66743 -39247 -2037 -21162 -76983 -94750
23911 -94750 -85075 -67965 -46782 -30575 -32910 -14454 -16763 12514 7375 10347 13123 -14102 -15633
23898 -15633 25309 16561 34499 14010 -4164 -15103 -3607 18818 27661 3874 1475 5881
23886 5881 -1150 -8294 -25479 -18925 17881 20932 27362 47895 51173 32835 -6995 -10898 -18382
23873 -18382 -12348 4686 -6823 695 2002 -17509 -13496 578 4773 5353 -14589 -36939 -50185
23860 -50185 -37691 -14883 -9758 -19013 -5171 2192 -10147 -16511 17545 25875 42894 45180 24648
23847 24648 1002 -2148 -17697 -21823 -27491 -62064 -49664 -31923 -15099 -6518 33456 60070
23835 60070 47029 -7045 18600 37304 16368 -11184 -38290 -40093 -4958 33746 38931 33842
23823 33842 56204 44829 1080 -14865 -1846 -4991 -34487 -40553 -19809 -4710 -7321 -10670
23811 -10670 -22549 -18916 -1924 20093 2029 -1748 7892 3351 -5869 -11042 585 28074 29417
23798 29417 63665 36784 9023 9784 -3502 25962 33326 23546 33960 41859 29900 36912 41738
23785 41738 10202 -5633 -38154 -54014 -44415 3343 -3362 -14282 -2243 9653 -19253 -48943
23773 -48943 -76552 -55627 -27289 1675 2661 -25981 -29182 -56057 -11457 22457 19790 19983 15943
23760 15943 1854 -22483 -6946 22479 20793 4684 14883 55660 82454 70824 -10423 -35289
23748 -35289 -5291 12918 9163 1635 20521 -836 -34464 -51618 -49564 -25126 -12428 -40788
23736 -40788 -47091 -3659 -1652 -32641 -50001 -50594 -33808 -4722 20048 1802 -35976 -44178 -33844
23723 -33844 -29548 -25220 -16381 -13389 -21117 -52605 -49690 -56711 -62253 -41305 -22029 -19661 -25335 1541
23709 1541 29587 38272 -17486 1899 15526 1079 -15078 17009 -3521 -9244 -8840 9357 23259
23696 23259 3993 -4666 -18132 -12342 -6302 -21063 -14466 -3860 -18508 25003 18987 18623 10892
23683 10892 -26038 -32752 -681 17665 17661 -6753 37948 46880 34043 17520 21336 15539 -20814
23670 -20814 -17387 -646 5946 -23589 -35848 14752 -1182 5368 9719 -572 3252 23238 3642
23657 3642 -14267 -20982 -23975 12845 23354 -3675 -8733 24703 54688 58285 30987 4164 -28300
23644 -28300 -18415 -44640 -65561 -56374 -22198 12338 9719 -8962 -36656 -60041 -57094 3197
23632 3197 41184 34149 12686 -1693 3214 15234 29812 10219 -5118 7984 8369 -4579 8548
23619 8548 17648 17612 17471 28974 2677 1127 -11143 -38311 1370 20674 -16950 -17482 23310 47200
23605 47200 28846 17723 1744 -8911 -32725 -50918 -37193 -55453 -28194 -25002 -12871 25842
23593 25842 42853 12635 3302 18645 -32061 -47068 -38340 -17116 4840 18333 33160 43859
23581 43859 15853 15906 23141 16165 13745 11887 -10371 -38547 -45594 -27934 -5015 -8153 -17943 -19141
23567 -19141 -30965 -4370 23811 41499 29618 24765 40060 8836 -14318 -19776 -46973 -7827
23555 -7827 18655 8886 -15241 -26794 -36903 -24631 -15335 -11035 -1896 1628 5351 11483 16309
23542 16309 34860 19057 20840 4249 -13291 -30441 -32153 -29835 -25626 -5307 3873 11195 2286
23529 2286 -2483 46 4274 18315 14852 -9581 -8887 -52155 -31073 -2351 -14907 -16071 -11593
23516 -11593 -9576 -974 -14306 10270 9267 -8571 17278 21683 30252 34455 -2293 -44535 -45887
23503 -45887 -23641 -16191 -3443 25874 45514 54714 35359 -1136 -16293 -26748 -4109 8081
23491 8081 4635 -11399 -1971 32389 24383 10755 14267 10024 6563 -9255 -1370 18300 26889
23478 26889 -10699 -34168 -43984 -42105 -23040 -1178 9872 13043 -18630 -19106 13252 29505 9496
23465 9496 -1161 -25831 -27461 -13205 -1157 -26060 -50243 -33276 18255 53453 28875 -7456
23453 -7456 -16814 -8865 -23934 -27018 -38166 -32218 -40758 -6749 16903 4636 25424 29361 8058
23440 8058 36596 59338 38740 -19031 -38697 -28384 -43201 -30008 -22216 -43630 -49373 -54531
23428 -54531 -47106 -40455 -23498 -34480 -25924 -60901 -68793 -40634 -32657 15140 47078 2596 -5458
23415 -5458 -29269 -56256 -45772 -18861 24851 6431 32529 42469 41644 52047 47169 7537 -11912
23402 -11912 -26124 -13502 -19310 -16854 -13023 -14689 6556 6090 -750 7825 37511 23389 9147
23389 9147 -3303 -24460 -19207 -11579 -14924 7575 8378 -5023 -6174 2928 -5694 11180 13986 16306
23375 16306 17538 4137 -15829 613 7678 -7695 -22333 -10201 11195 27480 7693 -48694
23363 -48694 -79603 -57372 -40377 -41303 -35615 -21934 -19973 6049 -7970 -24952 -47474 -70809
23351 -70809 -78106 -54566 -39549 -14066 -22039 -25935 -10668 -5846 -9778 -36932 -25042 -25621 -34061
23338 -34061 -32537 -20389 -23492 -21058 -51504 -32023 14542 -15030 -22245 -15204 11708 812 19800
23325 19800 15926 15886 25887 17046 15170 24892 13979 -12155 -13933 -3726 4222 19135 39873
23312 39873 26227 17471 27753 29958 8587 -29164 -39690 -31461 -13840 4439 -7830 -32154
23300 -32154 -30590 -9082 -13138 9473 14546 -21362 -34220 -44589 -35948 -32870 -26795 19967 26164
23287 26164 128 -28723 -11682 -2990 -8009 -36693 -29442 -15067 -21075 -32271 -44766 -37921 -23960
23274 -23960 -5557 14232 2268 -15134 -19615 -18133 -17425 -10283 -2560 33955 30229 35831 28093
23261 28093 29973 5627 7132 22727 23276 30616 33105 28631 15943 22941 19259 11621 17146 -10079
23247 -10079 -10376 -6132 -2020 7929 14236 -8260 -22890 4584 38747 -13722 -52219 -28615 -3491
23234 -3491 16840 1541 -22826 -33017 -42372 -29281 -45867 -42930 -36986 2597 15598 26405
23222 26405 21303 8796 5341 -5667 -34978 -36400 -25046 -43033 -24347 339 6600 -11186
23210 -11186 -2683 37628 26426 5534 -16544 -10520 4260 9587 21392 -12410 -10583 1404
23198 1404 -4880 -10997 27601 28988 22169 67589 60574 20348 11165 21585 49603 38476 3939
23185 3939 6770 -25206 -49828 -46512 -52698 -67116 -78612 -38677 4444 -17312 -5232 -7982 -2075
23172 -2075 6258 37738 65544 58143 13216 -7525 -9178 2900 34398 44788 22694 12943 22539
23159 22539 45579 18888 9928 -12429 -15144 -20492 -16851 -15965 -45477 -32371 -31054 -21308 -6840
23146 -6840 -8177 -16436 -7441 3750 -12234 124 -22690 -51764 -27469 -19940 -7612 8963 52112
23133 52112 70518 49310 38386 14091 15291 -9224 -19179 -46856 -34752 -27287 -42191 -61766
23121 -61766 -41497 -19604 -14850 -47901 -38847 -31349 -19064 -552 22300 39136 45289 59955
23109 59955 51368 26856 12785 29988 14092 -9027 -29970 -47511 -27256 -22163 -23908 -36248
23097 -36248 -31570 -20448 -21480 -23832 557 -16628 -26548 -38137 -36866 -8221 -4604 -17233 -18007
23084 -18007 -19529 -10756 -7151 -21744 -47381 -61506 -66514 -47505 -21775 9442 -16082 -61247
23072 -61247 -82337 -80972 -59468 -28606 -764 2343 4856 21242 -5847 10274 12390 -414
23060 -414 1969 20151 39885 70062 45234 -13792 -26626 -2917 14658 26361 12769 2881
23048 2881 12731 33402 12190 1512 6413 -37174 -43742 -26851 15991 -1701 -41559 -37433 -15822
23035 -15822 39475 29414 -24672 -52511 -43673 -14706 -18839 -8473 -5290 -10191 5250 21992
23023 21992 11977 4094 12225 -5522 -22228 2626 -638 -17466 -49942 -39077 -8857 25084
23011 25084 24172 61175 44138 35510 50435 37925 30406 25738 21736 18001 8170 35815 36999
22998 36999 40475 45659 14248 -13696 -33989 -22132 958 8183 7586 -7460 -41235 -43075 -52069
22985 -52069 -32921 -28269 -13799 353 -3947 18190 29515 42172 41605 -10937 -27601 -30657 -9183
22972 -9183 -18636 -53221 -39384 -10355 -9238 -3131 -9815 -30051 -954 27644 -10309 -39620 -21530
22959 -21530 -45542 -46650 -6247 -3842 11079 9804 -33989 -39194 -24358 3962 41153 64383
22947 64383 55646 22807 1677 -34726 -56894 -60587 -29198 -9853 -29283 -16343 -6163 3885
22935 3885 18898 6260 31626 33879 3321 -5961 15337 24779 18264 30990 11693 500 4254
22922 4254 -924 6629 5437 -15240 -11958 -21542 -1976 2795 -21462 -53332 -41440 -28992 3680
22909 3680 38473 32319 14005 -22375 -47338 -29497 8256 41480 49312 28052 -20952 -31200
22897 -31200 -11104 -16471 -12961 -36479 -35720 -33483 -35536 -27665 18826 15737 -1761 -21358 -43815
22884 -43815 -20007 -5358 -3150 504 -27755 -34674 -19450 25005 35491 7025 898 -15494
22872 -15494 4054 -20416 -15674 -10420 -32188 -2026 8351 6196 10918 13845 32043 31920 61897
22859 61897 82859 94443 77045 73733 50242 -7315 -29546 -26630 -38454 -36857 -11268 22476
22847 22476 23943 -8785 -11753 -4089 2462 30206 35660 10 -9394 14423 24675 18331 17285
22834 17285 16513 25332 27773 23012 -5673 -18350 -9731 2739 -15207 -10408 -14140 -7664 5080
22821 5080 12247 -2091 19478 54307 55565 25527 38413 38357 45781 40686 26333 13426 1387
22808 1387 -9903 -15441 5070 33159 33916 -18363 -43463 -44946 -47422 -26272 -32053 -39524 9510
22795 9510 35462 40682 15138 -8436 -21719 -5659 -26202 -17774 6324 25501 22118 28794 21110
22782 21110 -3210 -14430 -28608 -45943 -44292 -59281 -30056 9926 -181 18978 2906 -25030
22770 -25030 -5713 33078 69910 67082 15108 -6707 653 -16037 -22330 -19366 -16752 3378 22346
22757 22346 -1534 -33040 -45235 -52675 -49369 -87970 -90825 -37781 -14446 5245 -30470 -34265
22745 -34265 -5323 22213 31037 19525 21206 23892 4516 -31919 -40816 -37249 -7314 -28538 -13781
22732 -13781 30257 22515 -29032 -58892 -68938 -39048 -38468 -14433 -31955 -32968 -15925 13195
22720 13195 9595 415 -18091 -31103 -56326 -57304 -32994 -34082 -58951 -84662 -65673 -58755 -34998
22707 -34998 -26584 -25249 -33903 -21336 -903 1374 -9658 -19063 -13454 -1531 1512 -694 -35300
22694 -35300 -48178 22491 26874 -3316 -29696 -22219 -6896 18739 15399 -16368 12079 5214
22682 5214 16598 39083 24239 18232 22651 14584 -1342 -6599 -36320 -16149 -9975 -13311 9619
22669 9619 29375 21360 -910 17491 26235 963 14243 10385 -33789 -33747 -8877 -797 35818
22656 35818 38455 14559 -8834 -33393 -27236 -11731 -3773 8284 -215 -8243 -33775 -35434 -30904
22643 -30904 -47921 -67966 -55464 -32955 -16171 23104 37236 50707 29944 8269 19178 -2241
22631 -2241 -20034 -12362 1738 11669 6599 -5529 -10599 2645 -20332 -39605 -29355 -15027 8671
22618 8671 55783 43497 40025 55871 35323 11836 -8313 -43474 -81344 -82105 -61505 -42602
22606 -42602 4733 42770 34346 35005 46185 -4403 -14929 15921 -443 7052 2902 -21848 -7823
22593 -7823 2657 -15340 -13965 -28211 -62601 -51904 -31604 -10427 -7055 -7259 -2026 1679 28701
22580 28701 50771 71506 52410 30497 30131 34938 43732 47724 45178 9103 -7403 3123 5883
22567 5883 -10153 12308 14480 -10057 -14412 -22688 -54449 -61141 -52684 -32727 -42627 -31357 -21326
22554 -21326 -13003 -12788 16768 4653 -18201 -39391 -29016 -30133 -30256 5306 30562 38922 14765
22541 14765 911 34996 31193 36000 34455 27116 36995 42909 27714 -1391 -5271 -10644 10331
22528 10331 724 -36049 -24932 -22039 -34883 -29722 -24672 -15482 16038 6736 -23861 -36370 -23472
22515 -23472 19558 40828 25977 7686 695 -596 -6172 22888 11981 -4506 -3513 -40862 -55322
22502 -55322 -47233 -31979 -37580 -20812 21742 66020 45496 20959 5003 6021 1645 -14750
22490 -14750 21574 43549 29852 29208 28960 7713 29147 48035 38790 51368 29027 26966 24177
22477 24177 30484 19516 -4941 -21916 -61371 -28800 -3284 -14839 6436 9927 14059 18596
22465 18596 4253 -36048 -49201 -39229 -47130 -54604 -54534 -56946 -23122 -19497 -29165 -30009 -12626 -17632
22451 -17632 -15233 -26382 -26610 -20230 -31812 -11564 5643 -4199 -7000 17438 59951 56800 45862
22438 45862 49984 29699 20432 6669 24747 34474 25109 17097 23362 25441 22594 31748 35332 5896
22424 5896 4543 -3157 -11930 -6069 -31133 -26294 -35796 -29797 1408 22985 26750 -2883 -22280
22411 -22280 -29403 -58266 -32871 25624 2949 10090 -2306 -44030 -57406 -35516 -12995 -774
22399 -774 5336 -12626 -24813 -44482 -46636 -19163 20339 4680 11872 13147 32418 31110 -23199
22386 -23199 -20691 -15025 -25036 -38313 -32371 -12561 2474 1044 -21866 -25691 -42587 -7427 15490
22373 15490 1957 -50908 -59330 -26912 -15515 11930 20613 -7421 -13745 -12278 -16800 -43851 -82500
22360 -82500 -118595 -95108 -35151 7034 -6472 -15636 -27275 -34127 -40779 -52842 -45590 -38110 -54831
22347 -54831 -16131 21426 39676 39243 35194 13168 -15823 2310 25256 8329 -21847 -23073
22335 -23073 5014 23286 23742 18081 -6415 -25207 -5410 7823 -4911 -9286 188 -3554 -26370
22322 -26370 -25685 -22272 -31021 -13493 6600 -2692 -19127 -21687 -1400 10860 28274 25553 22060
22309 22060 16558 -5777 5218 2011 27108 18857 4778 11715 -62 -24967 -3233 -26189
22297 -26189 -54982 -22498 -16756 5369 44302 64777 47748 45658 26685 4759 -28236 -15560
22285 -15560 -20824 -18553 -25294 -24251 -14388 -13354 -23149 -35700 -23193 -24276 -5457 -691 3424 -1072
22271 -1072 1548 -3987 -7662 -32536 -15371 15403 31208 20859 2542 7009 27835 40190 12507
22258 12507 -17627 -13200 -12038 -9957 31722 30177 20444 -7367 -6927 17144 44915 49344 37583
22245 37583 39780 13435 -9742 -43345 -44246 -10412 -22866 -44332 -45070 -55032 -46951 -52194 -32360
22232 -32360 -41907 -28676 -53719 -59294 -48969 -39758 -12098 4823 -5063 -5704 -3687 -21854 -17913
22219 -17913 3864 -9972 18469 33730 42178 29005 7066 -24857 -55269 -59364 -57290 -49088
22207 -49088 -25616 -161 -5227 8092 -20137 -49192 -50243 -55356 -31788 -44178 -37838 -36726 -43107
22194 -43107 -55108 -65172 -59737 -38641 -32568 -9888 -18917 -12827 1553 13781 4118 -9119 -15917
22181 -15917 -29836 -18925 6524 3663 -14735 -34452 -21136 -27487 -43074 -60964 -46802 -16728
22169 -16728 -26969 905 44549 24577 -3414 -9888 -22550 -36758 -33995 -21110 -9827 -16025
22157 -16025 -33460 -33601 -28736 -35548 -45743 -18672 -19149 -4765 33663 47984 47076 37128 10177
22144 10177 -10741 -13069 -7543 -26964 -10080 19369 4292 8541 -11649 -25678 -11168 -91
22132 -91 13271 22336 1264 -17001 -27847 -9914 -300 -22545 -61336 -50355 -66344 -71388 -41176
22119 -41176 -42168 -5763 15841 32976 19104 -8278 -232 2536 -3628 -12174 3960 10437 14033
22106 14033 -9962 -35029 -39462 -33069 -15661 -6525 20208 37096 14139 -12197 -21030 -19631 1654
22093 1654 15726 6246 -12028 -12077 -1714 14660 15406 -3280 -4183 16494 9270 -28647 -17092 7746
22079 7746 -25686 -1424 41820 26465 -15100 -39525 -37965 -32770 -28745 -21019 8506 30230 37385
22066 37385 48651 35511 -618 -8652 -19322 2080 -6918 -24574 -1540 -14103 -33170 -38169
22054 -38169 -13859 -21277 -8301 -20986 -19382 -8578 13512 24699 21670 1097 -12647 -24859
22042 -24859 -39024 -8707 9634 21647 11023 4183 -12041 4433 14028 -4861 -4715 11193
22030 11193 21539 13365 -34033 -56346 -58456 -64407 -48801 -23980 -20566 -14817 -6511 -31919 -21242
22017 -21242 -21989 -23417 -32756 -48516 -43614 -14273 -19573 -38180 3938 11048 1056 -1982 14982
22004 14982 20761 16994 46678 72143 72015 64056 41674 3334 -9192 7532 8294 3162 17146
21991 17146 28324 18920 16110 7562 -8035 -2475 -1877 -5597 -16407 -31255 -28434 -12530 -4615
21978 -4615 2197 -4446 -4214 29197 31004 6112 -44432 -55174 -12624 -32902 -36260 -48661 -48608 -16818
21964 -16818 7626 -1444 5390 15828 12373 -7909 15170 38744 70812 45436 26397 58094
21952 58094 35299 -1614 -42269 -35966 -41872 -33761 -4112 -10508 -20536 -28503 -23558 -4771 -1059
21939 -1059 11208 25344 -9221 -29910 -13228 -46465 -61978 -55997 -7584 35781 34344 11363
21927 11363 14893 4431 -30903 -24818 -2315 1474 -9211 -5076 16445 18506 27105 20409 5008
21914 5008 -6905 -16940 -19340 117 -1576 16155 23219 -25910 -48073 -39749 -67151 -48725 -26917
21901 -26917 -17011 -29808 -44845 -75379 -61124 -29254 -7550 7270 -5136 1587 3137 5132
21889 5132 -27612 -34733 -40169 -7171 -10546 -20209 2537 -9154 -13574 -8692 2663 -18383 -40743
21876 -40743 -45554 -21647 -18592 -30529 -52043 -42251 -64 -15071 -41898 -71840 -70133 -85343
21864 -85343 -71960 -38285 -36218 -17792 -10031 -16801 -24239 -22502 5810 -5372 12277 52442 47582
21851 47582 6584 -15308 -23281 -36012 -38154 -16009 -7681 -18180 -30133 -59464 -80494 -95047
21839 -95047 -84271 -71316 -35995 -41419 -40038 -8859 -6060 2722 26029 10874 6 12269
21827 12269 13951 19307 -13601 -26186 -16956 -29618 -42466 -35235 -11625 12285 -10386 -32594
21815 -32594 -20074 16125 7924 6887 18579 5092 -21409 -27726 5546 36415 30911 2675
21803 2675 698 -26069 -58131 -33476 -7114 23104 24577 2498 -13048 -16203 -17899 -7689 28262
21790 28262 49252 42694 30412 6739 -34832 -23897 9737 43020 19537 -2378 -1668 -22736
21778 -22736 -24970 -8665 228 -19407 -29440 -24274 -44237 -56825 -34531 -32966 -24513 -35586 -7047
21765 -7047 12538 22194 21071 18745 16898 335 -20336 -6547 11321 19500 15041 53835 40568
21752 40568 14125 -11420 -20552 -15447 4135 30355 16035 11701 11102 -4790 -24691 -28145 -8602
21739 -8602 21120 -853 -24259 -26502 -29884 -53963 -66160 -47046 1835 39502 44051 29193
21727 29193 12770 -4936 -3381 -1813 -12249 -9733 17376 16702 23336 13051 12606 12450 44384 53875
21713 53875 9255 -6534 11418 24180 26024 27825 14247 -5671 -15714 -14681 -30989 -21928
21701 -21928 -2 -12103 -32622 -45188 -31561 -20601 -34211 -47810 -39425 -51409 -47338 -73471
21689 -73471 -107463 -101500 -74616 -33819 -4848 30231 54310 26288 9758 2309 8971 2554
21677 2554 8712 -16855 -21985 -11726 -9812 -18738 -22935 -15006 -272 5146 -4285 6116 -12720
21664 -12720 -20468 -15137 -7078 -31209 -30493 -33985 -19018 12811 408 -13098 -323 31078 37901
21651 37901 14801 1180 -446 7270 17398 44081 43411 61147 54989 -16548 -69070 -75695 -40637
21638 -40637 -18115 -7288 27057 36845 27367 33158 27436 -8601 -1920 -14259 -30302 -2477 -21910
21625 -21910 -25786 -25908 -18951 -9638 7451 13623 -10066 -13700 4987 30913 25566 -18681 -30340
21612 -30340 -35486 -34076 -14184 -14181 -7069 4532 24547 10077 2156 8294 4111 4920 14485 44981
21598 44981 48195 45944 33142 6722 11950 -10545 -21789 5780 50631 53029 12364 -7868
21586 -7868 -28786 -48654 -21002 -13383 -38454 -32136 18631 45119 42373 38201 51723 55822 30791
21573 30791 -11146 -22589 -36514 -49613 -31654 -23530 -18437 -31008 -48323 -28091 -5646 -8715
21561 -8715 -9216 -1828 -13503 -4270 5416 16327 -13277 -68908 -77914 -54922 -39853 -17379 1377
21548 1377 3073 3718 -10105 -31860 -28952 -5221 -43349 -29138 -23399 -38867 -40640 -26242 -26741
21535 -26741 -25751 -26644 2370 10667 7412 -11200 -17045 -22537 -6200 143 1244 43130 8762 -32578
21521 -32578 -75139 -64467 -7961 40913 73992 69788 52929 59493 22233 -14648 -17321 -6245
21509 -6245 6611 26522 40022 44951 29107 -13505 -36623 -25120 -12602 3361 -2546 -311
21497 -311 -13285 -8031 8714 7077 2053 9868 25192 13171 10535 -7648 -25554 -33335 -24597
21484 -24597 5343 23519 11834 -2452 13186 22326 10532 -38573 -30285 5623 22069 -13269
21472 -13269 -28213 -30544 -45538 -8781 -3538 -14717 -7601 -15619 -7483 -4506 16801 29854 20684
21459 20684 18561 3872 -17609 -38108 -18681 -17201 -11630 7992 4084 -11969 -2927 7332 20344
21446 20344 17438 19938 -1247 -15700 -21232 -9821 11699 8438 9190 18930 -6599 -5446 -11161
21433 -11161 1273 -9572 19009 33975 30027 13329 -21473 8090 8850 -21205 -14608 -17604 243
21420 243 -887 -22091 -12258 7281 1652 -24410 -16755 11797 25242 21224 8022 39 22319
21407 22319 7618 -9732 -1353 -1535 -10213 -43905 -38592 3337 41836 49281 22597 -4603 -36702
21394 -36702 -36381 -12733 21469 4109 -28805 -14096 13473 35725 19392 -11477 5396 5456 -19315
21381 -19315 -27671 -39614 -32722 -39468 -46127 -35502 -14615 -10269 -33767 -21049 32945 34975 36243
21368 36243 33687 19464 8516 4154 -6512 12458 32517 25249 26166 45973 50711 43899 15290
21355 15290 6738 7871 23836 35667 25692 11958 -13024 -28087 -13130 8653 34503 33077
21343 33077 30611 45761 19653 23404 26567 5755 -1405 -29716 -33479 -27526 -47478 -53510 -46772
21330 -46772 -30035 -31970 -48885 -36575 -25976 -16426 -18147 2462 11933 19031 28167 22173 9457
21317 9457 -9756 -10178 -9013 -15969 -5681 -5431 -7299 -2013 8668 19702 27146 24404 12167 7103
21303 7103 -22294 -11194 -5203 -5276 13466 32169 40106 40970 58303 52142 30812 30152 25524 12331
21289 12331 -4238 -39905 -60971 -49608 -11118 11940 22032 9937 -32451 -37575 3290 26006
21277 26006 31157 13250 17382 31989 19054 -2595 -13036 8671 26579 33547 24030 25869 -3716
21264 -3716 -17294 -59555 -48375 5174 46561 39750 6964 7835 39501 36020 18943 32675 36570
21251 36570 17827 15004 3820 -7593 8911 -9539 -19770 301 3021 18302 10996 11600 2587
21238 2587 6674 4617 2353 12760 21496 37298 38343 2565 -21170 -3419 -11465 -23615 -35920
21225 -35920 -38311 -15813 11406 10049 8464 -3718 -9525 -3313 -8484 -4215 -1332 -13797 -30552
21212 -30552 -8437 11332 -12871 -7470 -16358 -9846 -1343 -15720 -42389 -75110 -46902 -21921
21200 -21921 -10189 345 7261 3976 -26318 -44302 -44962 -30787 -20096 10793 11740 10052 -4879
21187 -4879 -19562 -30311 -2370 7529 18127 7389 -12986 17146 14801 26489 23130 11483
21175 11483 22584 23844 6551 -365 -258 1134 10113 523 -26557 -26939 -5711 11701 -5057
21162 -5057 -18588 8731 6980 -6214 8353 18425 34398 36240 14020 2498 -7574 7266
21150 7266 -8252 -33788 -59625 -42062 -42612 -45459 -49651 -47046 -41592 -14392 -26862 -50737 -58224
21137 -58224 -48872 -22570 -2555 10300 -18175 -34474 -22911 12570 20912 29144 13636 -7111
21125 -7111 -165 10271 -22562 -26448 5221 37577 54465 17039 3317 13313 18541 19574 20763
21112 20763 21816 26521 33722 43599 52519 33907 16270 10257 12753 9290 -286 -22121 -25768 -47707
21098 -47707 -62321 -36835 -28348 -10613 20180 45799 55213 39960 23841 -14736 -54541 -39921
21086 -39921 -29574 -57506 -65002 -47798 -16640 822 15888 20976 19025 8570 -11322 -19608
21074 -19608 2773 -24560 -61596 -49954 -20638 15466 39620 50489 10621 -6445 -6772 12300
21062 12300 19024 17529 13397 6729 10003 -28908 -26839 9258 -3978 16586 20174 28554 27789 15936
21048 15936 28684 17798 8451 -10632 -25058 -13154 15451 13237 748 28770 62248 71802
21036 71802 47678 47525 86732 75926 37212 19119 4176 -35090 -23402 -10594 -29235 -25100
21024 -25100 -54191 -51570 -55383 -28607 -23159 -7653 20090 10986 -7261 -11921 8185 17639 37489
21011 37489 5339 -16986 -1365 -9461 -13386 11919 24729 29975 34004 20879 681 -4204 -7855
20998 -7855 18571 34143 9603 -12963 -18025 -39907 -9303 3311 -1106 15368 31518 22698
20986 22698 -21220 -16747 2636 -8128 -37340 -22740 -34491 -32688 -10389 3527 -31912 6521
20974 6521 17620 29460 -5405 -26576 -16518 -14742 -43492 -30316 -22762 -41485 -41008 -51474 -56146
20961 -56146 -62562 -41058 -17374 9087 -17019 -47290 -48606 -47472 -42531 -39261 -7111 40471 38071
20948 38071 3667 -14673 -10431 3162 2886 949 2089 6989 -2413 -14043 -2568 24018 49475
20935 49475 47589 13452 6789 -8424 -16684 -13997 -8856 8301 -2507 -22656 -33586 -19033 -19996
20922 -19996 -14734 3745 -908 -19131 -26079 -35819 -36462 -25875 -20069 19641 8278 4840 -4789
20909 -4789 -27888 -34608 -43463 -23458 -6934 -7881 19639 34312 28265 43406 69932 81940 37198
20896 37198 13715 17919 36134 16384 2710 -4166 3838 38366 17494 6417 9803 -5736
20884 -5736 -20118 -36878 -43451 -48000 -45514 -50652 -48970 -12251 6169 7785 16599 13767 19828 41920
20870 41920 32077 23464 23400 3477 924 47654 34732 8536 -5411 -9995 -10490 18370 26442 2954
20856 2954 23425 30413 39337 36044 19017 18441 15730 -4039 -1551 -32502 -29465 -27925 -6521 23080
20842 23080 32496 29038 10765 -10176 13679 25471 7441 1566 25214 -2932 -12336 -5251 16399
20829 16399 29420 16416 20241 16243 2099 -3968 -44664 -37164 -30048 -35797 -31796 -7243 7009
20816 7009 -19986 -9592 -13609 -30429 -9103 671 -25472 -7432 -4683 3960 -8884 -9250 -2412
20803 -2412 -13283 -11196 -22208 -27997 -10398 4781 6020 -14082 -23348 -9746 6373 8615 20600
20790 20600 22767 -12207 -23119 -27893 -43366 -58921 -42058 -47365 -62275 -54269 -56144 -51392 -16536
20777 -16536 -1603 31648 44915 49653 38669 -1951 -38103 -55170 -53277 -37997 -36237 -33903
20765 -33903 14509 25083 32097 26234 19139 2887 17554 9248 39667 66832 58245 46577 24273
20752 24273 41990 58802 79659 84677 67293 54354 41226 31881 48177 50123 28400 37504
20740 37504 29759 -18067 -30387 -11232 -32552 -17965 -2873 7640 33512 29348 4627 5926
20728 5926 3695 14398 17653 17395 11755 -25050 -32219 -43385 -28613 -1550 17280 26993 26988 -2224
20714 -2224 3778 -11337 -6365 -520 -1121 -18685 -26058 -14900 22586 41478 12671 427 18348
20701 18348 13854 -21338 -8090 -439 28346 39704 33519 41087 34181 20695 275 -29519 -13227
20688 -13227 -11159 -11210 -9307 -26222 -21460 10197 -5247 -2339 -15629 -48131 -37524 -21142 22073
20675 22073 12366 -10428 -5055 30505 20508 -6373 -7808 24243 16313 -9202 -40004 -38891 -21917
20662 -21917 -1108 22049 27307 12766 -19924 -3643 -14741 -23454 -17624 -6996 -12387 2559
20650 2559 6670 29760 43365 11045 -31504 -30877 5757 29972 26106 10829 16996 -14541 -44783
20637 -44783 -57325 -801 24467 16635 -8153 -14691 8917 20644 52646 22504 -9722 -8636
20625 -8636 -9996 -7887 -6414 -4443 2038 -21592 -48270 -34855 -7982 23332 20552 38384 20153
20612 20153 35962 49195 32347 16371 -1430 13579 20000 5761 5763 10156 33446 3475 -15360
20599 -15360 -10908 -20172 -29469 -30256 -39459 -41477 -22620 -10482 -6457 -14975 -33114 -10310 24705
20586 24705 3222 -12007 -15184 13185 17369 18817 19880 10738 7009 -16264 -366 3459 12067
20573 12067 22393 25497 29712 21950 10969 10180 -12059 -5215 18599 12948 926 -18363 -17014
20560 -17014 1396 38238 54543 47447 40866 32291 58209 31917 -12188 -8388 182 -14825 5550
20547 5550 -828 24670 33226 7203 -17806 -27435 -17256 15909 17840 -4089 13691 12917 7556
20534 7556 -5944 -6251 -11332 11600 22124 20321 29534 -4566 -47511 -42655 -57437 -33460 -15289
20521 -15289 -8260 -4923 -23079 -21124 -38062 -37082 -23247 2859 10776 -1699 26842 37621 22188
20508 22188 35053 12475 18271 15053 4563 -6545 -23907 -3287 -4229 -12438 -12192 9674 -24060
20495 -24060 -79008 -55129 -1074 5457 20181 26779 14689 7910 -1033 9749 -4867 -3489 -18447
20482 -18447 -23050 6514 31625 36133 21325 -443 4691 -2345 2500 36189 32882 -5072 3312
20469 3312 5820 9768 11272 -900 6918 13167 -15643 -8848 10757 4405 -9978 -6800 -4861 12253
20455 12253 30679 25667 8374 -5768 -8565 25969 20859 15689 36202 28257 20148 21234 8061
20442 8061 17515 32668 18806 -45783 -42460 -15626 10970 43898 40851 20931 7651 44822
20430 44822 49232 37728 44030 44788 17331 12186 7580 27677 31297 27317 3922 -7478 -7710 20075
20416 20075 32392 17112 -7126 -687 -8952 -46961 -30791 -33213 -63716 -80371 -73138 -68402 -44469
20403 -44469 -26011 -19147 16252 35415 31808 16380 13239 29606 -423 -11985 5246 9509
20391 9509 18551 11771 -1373 -8705 -24604 -43532 -31016 -40505 -21783 373 6928 2974 8269
20378 8269 2690 -1312 -29568 -16333 -3275 23193 35521 32588 7052 10724 17891 -3516 -27612
20365 -27612 -10578 -9130 -3009 1354 -7051 26564 29850 36392 39055 19417 19038 5845 10239 -11334
20351 -11334 -18912 -21198 15573 43382 33958 1033 8189 -6084 -18650 -5813 34425 26119 16520
20338 16520 10305 -14880 -3278 1562 -6682 7698 21037 23193 29355 45415 19012 -25699 -9304
20325 -9304 7893 8179 8654 14141 3690 -14811 -28436 -40598 26190 64812 54340 36496 1427
20312 1427 -2651 28987 34695 5779 6417 22757 31921 19896 38483 29096 56050 44528 38413
20299 38413 4738 -14093 -28550 -28324 -44923 -63304 -86186 -69543 -40047 -24409 -3569 -12425
20287 -12425 -5848 2239 26544 8406 14394 25877 30070 16370 19538 1006 -16383 -17832 -28577
20274 -28577 -11372 16685 20808 37859 15594 10759 22892 28158 17092 -3626 -9485 9973
20262 9973 -7487 11774 25538 33826 40644 21065 4034 6072 26306 41518 -1108 -3071 13761
20249 13761 23640 34710 27441 24140 19488 5864 3559 23941 32198 38500 19227 21745 30681
20236 30681 39346 40727 7701 7247 15933 38759 65983 9289 9792 10114 8829 21580 22541 12517
20222 12517 -12419 -38990 -31783 -35879 -17279 -18487 -15906 370 -9882 13920 12303 -4784 -8697
20209 -8697 -8228 2192 36355 19832 1604 7305 21324 12334 20537 7330 20150 9088 8998
20196 8998 -946 2779 -642 -596 -22252 2451 2390 5990 10352 -21908 -42260 -26758 177 51566
20182 51566 51410 18140 10843 43204 29905 43174 31019 12929 4089 835 -6236 -18732 -12163
20169 -12163 15145 28191 29468 25287 8781 -7841 20934 18864 30334 15502 11527 -5047
20157 -5047 -9717 6234 22640 16080 -2262 -35008 -46880 -36106 -25977 -36597 -49824 -24833
20145 -24833 -25596 -16321 6869 19708 10108 6320 -493 18984 30377 21915 32455 40394 32244
20132 32244 46127 63216 41581 30305 7310 -20406 2111 23180 24988 18125 31017 29255
20120 29255 -11687 -34368 -19039 11653 23146 20431 7282 -10989 -26962 -11411 -14654 -1936
20108 -1936 -1536 -104 -1921 13937 24704 23231 49832 40223 43101 27313 20873 43457 41435 35044
20094 35044 33141 9626 4783 -6164 33054 28173 9169 -25209 -47329 -12037 27093 12197
20082 12197 9335 513 -17481 -49496 -33445 846 36776 46297 30272 25370 16835 23038 20653
20069 20653 7784 -18455 -24645 24531 44663 44036 31023 -7244 -13895 17414 -13893 -53783
20057 -53783 -52924 -56341 -14503 14896 22074 36908 14058 20243 38073 34907 30795 38934 -14094
20044 -14094 -42730 4202 15071 7028 15203 5124 -24060 -33791 16496 24416 7227 3074 -3595
20031 -3595 -30960 -23732 5534 36442 30365 25097 22020 52630 78236 69526 60210 47220 66541
20018 66541 55252 -4229 -31854 -38403 -10853 -1988 16846 37201 67185 80603 54474 22897
20006 22897 12706 4217 -13905 -29071 -16620 -4581 21322 7709 15343 15965 28970 51116
19994 51116 61489 26778 23013 10553 7129 -1890 2225 14859 47892 27466 26612 18290 38719
19981 38719 75614 66279 25827 30907 35341 28749 654 -1892 844 -17142 -3246 21509 16049
19968 16049 16378 32799 52433 67288 72563 39705 -17037 -19344 -4230 -7952 -2793 -5702 17954
19955 17954 37677 19177 11443 5879 -16732 -31351 -1409 10180 15012 24924 -6127 9615
19943 9615 9379 -10343 -12889 -22253 -10030 2846 -4815 -228 22817 32158 42916 15481 23117
19930 23117 38395 43470 31640 12253 8354 -2623 -10450 -25147 -14784 -27358 -47769 -29565
19918 -29565 -24253 -23960 6303 38515 51089 43382 8919 -17165 -27493 -22454 -18587 -30945 -2130
19905 -2130 42952 67653 65392 58619 26307 3556 -22010 -18369 -40141 -27443 -15132 -18235 -5446
19892 -5446 578 -3928 -16820 -20819 -3018 -11037 2161 41532 41714 30485 28895 38257 24457
19879 24457 6933 -13350 -12793 -19554 -22705 -9297 8513 -3079 20302 8677 36341 57491
19867 57491 31317 27998 16907 21044 32153 48253 23063 -19740 -6918 9610 -32763 -13797
19855 -13797 -4382 -14130 5388 10660 10993 -3722 -18630 -17307 -31096 -5200 122 -21303 7640
19842 7640 43963 29768 -6885 -14304 -21375 -25630 -13321 626 -2272 -3779 -9908 7018 20979
19829 20979 -1575 8456 5244 28737 36365 43067 49756 42022 37301 43280 17012 -15947 1145
19816 1145 3593 13819 12426 12053 6796 42650 50259 48786 62765 32207 25587 3778 5890 9569
19802 9569 6476 15250 13113 22653 34385 23496 41516 82749 69179 36581 38294 54250 30786
19789 30786 12809 -15608 -12184 10984 50428 70670 44799 26681 33223 25633 33827 44429
19777 44429 55380 85113 81006 89903 71729 71847 68010 8770 -17547 -23730 -9122 -7344 -13937
19764 -13937 -6130 19083 12271 5305 -237 -18106 -9840 34389 67144 61388 38415 21853 41751
19751 41751 61423 100211 110229 86016 73969 64213 83024 87516 45841 6496 11752 49286
19739 49286 54662 17245 19010 48853 77578 96712 82294 44221 27299 6063 13189 10836
19727 10836 -9290 -21312 -7024 23007 23711 29033 14683 -8017 -7217 10788 33674 19545 6527
19714 6527 11269 28724 35007 34185 41366 16646 -16533 -7675 -1451 8552 18229 -2827 1735 14861
19700 14861 18448 9288 -1424 7081 23462 30034 5519 19544 32066 41923 67297 62535 36051
19687 36051 39995 40273 27982 12811 27823 34444 14708 16144 915 -16492 -22382 2899 48993
19674 48993 53270 61155 51272 20606 -1249 10198 2524 7053 -15228 -4475 15992 33063 42073
19661 42073 38466 43276 33356 41369 65577 54265 3768 17890 51082 62558 74703 86677
19649 86677 84495 55526 55886 66764 24580 9665 49834 27096 15092 28996 23771 17558 46682
19636 46682 49675 40483 46548 62903 46020 62240 62622 49175 35127 34566 56585 77811 94822
19623 94822 73214 35150 33630 8646 -18275 -8038 -9951 25946 49912 49744 69893 55035
19611 55035 24461 28597 43953 40925 22589 -23569 -31485 3884 7635 3315 11862 20780 45259
19598 45259 51812 59858 61269 55525 51395 27805 14465 -4223 -11766 -19716 -16519 -5280 -3835
19585 -3835 -1881 4326 6959 -1847 15293 -18758 -45650 -11867 6482 30613 38203 28395 58163
19572 58163 59314 61930 55587 53756 48304 21651 6180 -18110 -263 -3062 -2396 -4549 33702
19559 33702 9119 23972 13963 4838 -10271 18856 76988 79407 57629 51089 67568 60037
19547 60037 76269 84933 94255 72955 63094 42217 43470 42074 34867 51664 72897 51139 37315
19534 37315 26267 22177 39010 57157 45843 22057 17160 2062 3131 15887 49720 53318
19522 53318 40249 22072 28330 41499 8948 17714 -1146 3070 42195 45938 25056 -1177
19510 -1177 29923 48005 30400 16254 5082 20979 51532 59677 82573 130164 161062 158895
19498 158895 153521 160211 123684 110414 83464 78194 96795 103457 115063 108723 119744 121552 103664
19485 103664 128553 131748 105586 108163 112329 161206 220461 260341 334098 436723 529453 591652
19473 591652 569904 510079 422280 366938 307256 286752 277486 299747 367843 431659 513345 578673
19461 578673 593219 564994 522484 508253 476336 457864 462606 424873 352357 261337 215055 196833
19449 196833 190678 221614 196261 159934 152044 140366 156306 175999 191019 177515 162375 174657
19437 174657 164087 168580 196769 238361 302154 312710 271491 259781 208528 178087 176607 158481
19425 158481 164152 198959 276591 369584 496169 635062 722351 756186 737908 730865 691428
19414 691428 646788 579263 504988 486225 484142 500736 513812 481151 429944 362210 312052 275520
19402 275520 242994 244166 206482 161134 156608 135526 113619 95374 80397 92168 107448 97606
19390 97606 92890 70577 86107 87606 77044 32189 2091 23461 27827 31034 95126 83128
19378 83128 70166 84365 87554 56349 44576 64046 53169 32151 42325 81899 88861 84344
19366 84344 73986 76688 67405 53992 70094 76085 65444 53080 59100 73912 67532 60567 77141
19353 77141 92790 80451 56216 53037 75746 100947 109110 111010 102081 92189 69012 38903 53103
19340 53103 55824 55068 53165 55126 32529 57551 104982 109404 112513 139486 157182 143916 111189
19327 111189 83088 67548 70123 50619 56031 82649 69908 51678 47911 34349 39026 56373
19315 56373 81494 101446 100778 85000 69237 43570 61131 73576 93425 96508 60742 47492
19303 47492 61059 85957 102086 112874 115086 118009 110711 79592 44665 53200 88409 81025 68621
19290 68621 72932 74139 60526 68137 83129 80537 83913 121742 137723 118772 121628 114362 107090
19277 107090 98738 92381 108173 117577 111073 128657 128320 139726 143588 116321 95298 92717 105443
19264 105443 94795 103712 117965 126849 139035 137099 126163 127418 132868 156789 174767 204681
19252 204681 222120 221735 215704 226954 261424 337677 413682 440195 449552 438807 439092 397335 366373
19239 366373 341114 389220 429022 478827 517431 555396 540753 555368 536000 488712 424340
19228 424340 361586 350880 339541 359488 381173 387475 379138 357452 345829 312405 260038 235394
19216 235394 217368 229513 210572 163316 102817 104319 146828 157789 166146 150921 166665 209557
19204 209557 226341 244180 259475 304210 324890 368678 441163 461890 471162 462069 486490 530758
19192 530758 586854 652357 758507 840085 875693 887398 838278 735912 660910 610545 554569
19181 554569 529020 551643 605348 663152 716867 692515 655443 600284 525520 429885 347570
19170 347570 277924 239885 251051 291190 288686 279268 248708 244005 254943 245882 217797 238304
19158 238304 246082 220066 222105 219437 247634 282131 294609 320764 375224 494175 613367 696560
19146 696560 768175 804843 808408 809626 774831 712189 622285 546746 509714 450783 418537 406412
19134 406412 411449 411549 412564 375935 339965 331475 331301 279292 268857 249159 245040 266500 238995
19121 238995 236859 233396 243936 260193 268989 276789 275382 216273 205085 218258 248721 287568
19109 287568 307681 336917 350450 364444 394708 401679 381103 397431 452389 490222 506020 511001
19097 511001 579207 675565 763096 866014 931351 966898 939114 857134 736465 641971 565766
19086 565766 524772 479288 452239 447931 458545 489624 492725 467998 460268 466531 452587 426845
19074 426845 413335 417210 413586 393351 357189 321859 273190 223596 203981 218784 210646 190410
19062 190410 195571 201448 189207 202878 226580 235577 239776 230105 196884 184914 222144 237329
19050 237329 224602 209144 207242 213321 224863 229508 251370 257228 276227 310313 321682 330977
19038 330977 348418 350075 320866 335212 353108 323308 313791 328715 376068 415885 418098 394208
19026 394208 388119 427970 473308 492123 515676 542698 546889 562596 527674 481235 395935 322978
19014 322978 300983 290976 238191 211981 209115 265655 325381 352595 354616 385427 390365 401653
19002 401653 392293 437153 492099 512093 500492 538176 599066 637723 671384 663794 657841 673157
18990 673157 691394 750048 799493 822183 825797 829546 867347 898030 954127 1055216 1107495 1176578
18978 1176578 1283040 1352375 1435566 1541973 1704553 1881004 2101554 2383213 2720413 3055429
18968 3055429 3296694 3422520 3484918 3605656 3849382 4152559 4601775 5174677 5909409 6839409
18958 6839409 8040035 9755131 12199248 15188892 18160610 20046041 20449438 20271809
18950 20271809 20711182 22925851 27721528 36245737 50403226 71219502 95515662 115846343
18942 115846343 122701268 118118046 108918961 99751625 89275495 75784625 61627065
18935 61627065 49921843 43172339 41793735 44548466 48604937 50096620 46408807 39120061
18927 39120061 30721608 23483687 18144562 14577773 12375530 11009605 10185314 9724205
18919 9724205 9561758 9605195 9648402 9645368 9678421 9723916 9769367 9918708 10274096 11018739 12282427
18908 12282427 14272775 17210889 21491364 27828347 36641258 47009643 56179559 60003323
18900 60003323 57618338 52063380 47235336 46053732 50058514 60582037 78912656 104230818
18892 104230818 133260880 160922619 185094053 202807405 205607680 186662036 152694295
18885 152694295 115267623 84072074 62579258 49825947 43807238 42244819 42409710
18878 42409710 41125396 36691671 30429273 24099231 19008243 15376999 12822857 10926340
18870 10926340 9412196 8216062 7335635 6669148 6241212 5964269 5709024 5449645 5118182
18861 5118182 4665008 4115583 3623704 3220232 2942047 2726623 2525258 2351426 2215310
18852 2215310 2070150 1953583 1836014 1735394 1660833 1608043 1529992 1433038 1365176 1271519
18842 1271519 1168775 1097149 1023223 959178 898558 859435 802344 755889 747853 755901 759351 754824
18830 754824 773651 786947 807073 817251 824108 837679 840633 844399 837790 818751 848317 872993
18818 872993 881003 893810 881682 851343 817174 768596 709995 667692 635175 620744 664095 689931
18806 689931 681201 693619 692927 664792 630646 624633 632678 662507 666254 658791 680103 704768 694977
18793 694977 679419 635583 594282 568145 569085 558655 578584 607370 585430 557990 582843 616116
18781 616116 646408 659243 698213 713996 764117 819273 877845 930034 935906 932551 977334 1067054
18769 1067054 1193658 1373361 1553692 1614017 1532791 1434279 1368569 1323653 1299709 1287750 1277401
18758 1277401 1293284 1334860 1420198 1540612 1671201 1776382 1869077 2012851 2154024 2294830
18748 2294830 2487686 2778795 3124514 3489042 3846125 4175060 4413934 4587954 4733843
18739 4733843 4832896 5009039 5344075 5808137 6465413 7414612 8698057 10365718 12592547
18730 12592547 15683423 19775504 24189073 28606393 33531930 37288182 39547480 42705244
18722 42705244 47845026 56893625 72689396 95022519 119273653 145354900 171867443
18715 171867443 184278299 181631681 174393825 158549188 133788539 109697881 89154490
18708 89154490 72360347 61087928 55583270 54120980 54566731 56360421 56681222 52748052
18700 52748052 46783418 39826289 32192323 25361902 20084130 16371961 13902141 12316020
18692 12316020 11309702 10679462 10262778 10033497 9902697 9742695 9581129 9561162 9639141
18683 9639141 9878949 10398626 11389100 13018129 15586203 19542013 24893561 30550104 36222314
18674 36222314 41891422 44870551 45147099 45393644 46458993 49616095 55166975 62881330
18666 62881330 74313690 87339033 97564508 104649241 110725299 113306292 104958001 91116524
18658 91116524 76588473 60393616 45725943 35046683 28335218 24594780 22561223
18651 22561223 21701117 20729361 18839506 16809970 14588809 12216007 10134909 8458512
18643 8458512 7170769 6180146 5433049 4917863 4522373 4189829 3891329 3670523 3470746
18634 3470746 3292474 3122123 2903127 2676588 2504931 2358344 2255906 2168832 2117063 2082817
18624 2082817 2030701 1970430 1858298 1750773 1577523 1414744 1261087 1126407 1015492 933800
18614 933800 869317 845659 847970 813844 786752 769570 732234 704550 681970 655681 619621 611856
18602 611856 621904 616953 639257 672029 693767 678708 655311 642521 656083 685235 702929 696636
18590 696636 690119 690284 656814 617889 564100 538325 508736 485676 436319 403071 399583 435763
18578 435763 435435 397740 399610 387174 343540 328851 316936 321801 344349 343811 326760 312057 313242
18565 313242 286538 260362 286841 308171 295437 299805 281254 256263 259045 283772 261043 245680
18553 245680 231349 251054 264022 253232 266138 282471 279345 298113 291606 271091 259802 266274
18541 266274 277336 296055 342341 319604 309009 283832 263326 221885 195506 149108 122496
18530 122496 94383 80287 90352 106059 129344 119827 98646 84505 36282 -2004 6018 58974
18518 58974 98737 95750 93379 100554 114145 101658 93520 94374 101201 96265 79723 72201 82522
18505 82522 83366 88954 78532 89773 102036 94631 117318 121803 103051 102858 107767 83601 62306
18492 62306 35099 34799 44661 45495 57278 64367 50924 58847 67828 64614 34237 6489 9425 32883
18478 32883 46068 27526 15425 44610 81761 97734 88612 58537 30813 19083 45569 60046
18466 60046 55461 29848 41776 81383 81387 73818 85661 122604 125988 105639 108034 95171 99927
18453 99927 115726 115813 115337 115326 97313 83526 71280 73364 69464 54994 63474 101062 87369 70617
18439 70617 56274 57600 88328 113612 95789 66516 52364 89455 101822 100444 85805 81819
18427 81819 95052 66552 56951 73267 108055 121772 151156 151564 144721 178122 200713 217542
18415 217542 238564 283883 369950 447677 487141 505032 523973 517993 479100 445123 440829 526956
18403 526956 609578 720484 820695 853330 868145 836968 722082 523670 364501 325205
18393 325205 301321 267514 259229 253970 250348 275810 261482 243891 225493 185135 157597 134564
18381 134564 134019 161001 149079 94594 76525 71851 100849 115998 146644 156216 116975 74894
18369 74894 51126 70522 92102 127362 172527 246467 294247 315326 309532 303135 320626 350457
18357 350457 367856 400041 451568 500760 487897 437980 398373 339449 305256 272025 270967 299447
18345 299447 359015 422724 457548 432244 370377 267326 192533 157333 83933 23017 -2380
18334 -2380 4806 23340 48495 42340 23432 37298 66182 69268 59549 36337 25629 32082 45358
18321 45358 49593 36106 4719 -15791 -9236 21230 15376 15626 15006 -4100 15591 39945 31620
18308 31620 10050 -8185 6862 14395 32789 18426 27211 42477 28549 62037 63182 58747
18296 58747 61397 68972 63331 50214 28137 3889 3434 28193 17430 26715 15582 23909 -7201
18283 -7201 -19088 13765 47883 61159 90607 92528 89309 68648 52620 17732 -17618 -11016
18271 -11016 6138 9448 579 1652 5655 3439 1464 -7444 -19925 -15137 9911 42678 33433
18258 33433 6785 6362 -3507 -27810 -40062 -31257 -54274 -53875 -30232 -27812 -4234 29671 58253
18245 58253 48596 49639 64719 41488 12639 1777 -15465 -27544 -26466 -32297 -39302 -67553 -80917
18232 -80917 -67079 -39861 -65826 -99529 -108572 -80713 -75837 -70828 -24888 -6605 35355 39606
18220 39606 37808 59446 90289 85239 59997 59842 62619 69949 71164 91030 108269 119659 143562
18207 143562 165769 197511 241606 304916 362458 394938 393722 416168 414798 480759 505089 520086
18195 520086 519793 508357 505832 531750 570233 610164 651071 604413 543084 504603 394798 299807
18183 299807 240343 217263 205332 166113 170989 174880 168707 169923 188021 176333 192256 150207
18171 150207 120771 120466 135160 157988 152000 140757 118406 118762 108815 120008 115949 133848 169247
18158 169247 210593 218547 230543 292471 348109 436425 493991 520659 548992 594930 619629 632284
18146 632284 646890 642859 597300 512144 484460 493861 491511 511027 567609 666647 726685 769886
18134 769886 815129 804928 784227 781121 750374 720950 747097 814576 883427 947266 1039823 1182095
18122 1182095 1304145 1467776 1723851 2053952 2479018 3093723 4004957 5364782 7305653
18113 7305653 10235028 14755406 22220655 36045361 59772586 74858217 62174547 43431710
18105 43431710 27661192 17264626 11495028 8224105 6178041 4841651 3929774 3263308
18097 3263308 2741533 2353729 2044221 1716378 1479867 1297168 1127658 977759 883015 818341
18087 818341 771144 750165 658115 562501 497251 466219 435549 417228 378177 331954 282921
18076 282921 231999 193382 201398 226029 219320 203765 198842 177621 154644 149978 137367 133088
18064 133088 111742 111617 101303 92343 102548 49805 55413 80194 63542 40021 37473 26748
18052 26748 21912 24215 39098 33922 40651 49354 75988 81252 93218 91081 82313 62706 69988
18039 69988 34558 23725 56100 76160 50339 4585 -2604 16789 52651 46621 68121 68339
18027 68339 35070 33866 42035 31960 44381 63386 62891 31454 23272 31197 23239 10156 23717
18014 23717 25618 48022 5097 -9788 14877 35297 58483 43728 35153 6272 21750 12389
18002 12389 -3795 -55908 -64047 -36946 -31413 -13969 -1033 -4601 8647 20663 31355 47818
17990 47818 66576 78180 89401 56350 26827 46866 107767 156776 151208 66366 22570 4141
17978 4141 -2061 -22172 -38221 -39195 -14926 3005 -10473 -30874 -39995 -20697 -14332 -23234 -9745
17965 -9745 -13791 -19483 -3209 14716 2269 -10141 -8001 11204 7663 -45212 -62193 -31017 -3137
17952 -3137 -22064 -39728 -43297 -59300 -82618 -64449 -55011 -20347 9998 -20612 -67937 -65577
17940 -65577 -57094 -32479 4629 12082 -7284 -49686 -56364 -31304 -33696 -55728 -67639 -71410 -29362
17927 -29362 9545 14037 -4479 -1515 394 -12774 -19794 -35525 -47872 -34159 -26214 -50479 -27084
17914 -27084 4219 -11198 -9085 -3934 2120 -1887 -33080 -30921 -18208 3424 -32183 -68666 -59057
17901 -59057 -52379 -50240 -69994 -101182 -93085 -49294 -26528 -28581 -63498 -57014 -18892 2876 -8280
17888 -8280 -53682 -68259 -67504 -41921 -31530 -18462 -17034 -30738 -47702 -49129 -46208 -43479 -50785
17875 -50785 -55337 -72567 -43904 -16528 9156 3285 -10688 8930 -4572 -15331 -31959 -24678
17863 -24678 -2998 7916 -6235 -56075 -73689 -55222 -22965 35841 41599 44234 32093 37875
17851 37875 41371 18316 -10971 -26840 -46664 -61473 -71986 -47592 -27864 -4552 7747 12326
17839 12326 -5771 -34186 -49227 -42662 -33212 -12517 -5337 -9717 -10348 3069 338 -12000 -7981
17826 -7981 -1164 8817 8897 -6530 4664 18469 -2364 -26443 -7449 5922 15428 9487 -6263
17813 -6263 -29035 -24722 -8042 -32525 -27843 -21262 -21226 -17247 -46158 -45766 -29392 -37379 -48490 -45492
17799 -45492 -37937 -39335 -39453 -41044 -49429 -38223 -11334 10031 31398 38524 45481 24076 5940
17786 5940 14823 31231 11258 9119 21343 26991 8885 13057 -369 2152 916 29799 35877
17773 35877 36086 6649 -17194 -23447 -16224 -10726 -48201 -30308 -22909 -19886 -20779 -19238 -22580 -37572
17759 -37572 -72983 -58753 2180 18234 9299 21415 1992 -7592 -13970 -21828 -48694 -41518 -13597
17746 -13597 -6193 -8195 -9450 -27953 -54885 -56752 -34021 -17987 -22012 -26104 -25190 -4355 12102
17733 12102 18391 -17424 -80634 -96649 -68838 -41794 -7928 10370 -30051 -18370 884 25395
17721 25395 32199 17286 35823 11181 -14914 -2766 11179 28567 40188 24199 28782 23947
17709 23947 14291 -149 -11023 5666 20567 13439 1202 -35559 -20699 10888 26796 12401
17697 12401 10574 31883 20002 -19780 -16540 -39531 -60171 -53871 -47389 -41292 -26677 -30610 -44861
17684 -44861 -11806 2365 -7661 10653 28761 -3723 -618 -5841 -9502 -12124 -19859 -18114 -9828
17671 -9828 4351 9870 25694 -738 -31323 -26035 -31096 -19619 -8601 -24237 -25384 -5299 -6721
17658 -6721 6331 33913 44256 -11192 -22414 -14827 -1448 20624 26892 4307 5686 -10144
17646 -10144 -34807 -31158 -22329 -4411 -3717 -11752 -44524 -71237 -45629 -40597 -47324 -37071 -65911
17633 -65911 -54564 -32558 3312 13053 -20345 -28474 -8146 -33514 -65180 -68391 -77488 -58321
17621 -58321 -48621 -52049 -65818 -43357 -18607 2156 1645 13870 41300 48623 46376 33431 1851
17608 1851 -31238 -23261 19885 26371 48060 25647 7774 -2148 -1072 22372 11324 -21229 -10127
17595 -10127 -447 -17350 -19986 -20858 -18028 -25037 -33154 -43283 -27909 -32853 -30936 -5125 -10301 7641
17581 7641 18971 22225 3669 -14545 -21117 -23346 -23524 -10371 3957 -7069 -17448 -1092 -10380
17568 -10380 -18959 -48848 -46695 -29132 -28453 -18109 -12402 -23403 -1442 -24198 -54014 -54040 -63010
17555 -63010 -58330 -60260 -57047 -48984 -50058 -18511 -30912 -29466 -9825 -38148 -64289 -50783 -46430
17542 -46430 -39250 -16609 -16144 -10743 5240 13811 -6477 -43393 -41110 -18818 1060 7250 5063
17529 5063 30353 37194 24940 8915 2170 -18175 -47033 -47372 -43309 -30726 22068 48773 21982
17516 21982 -11355 -12181 -8129 -17114 -32251 -41221 -1747 12257 9860 12407 -1638 3756 9607
17503 9607 27362 58223 42648 12845 11397 15205 6972 29400 86344 75906 31681 19396
17491 19396 6357 -37677 -57429 -40526 -35316 -42160 -38408 -49570 -39840 -42100 -58838 -81870 -62079
17478 -62079 -54313 -27337 -3952 6779 -16971 -14530 -22587 -24747 -29342 -19511 -20164 -21376 -34291
17465 -34291 -17570 5029 47475 51999 26220 21136 31388 19180 17374 4416 -24053 2480
17453 2480 8799 -4038 -13799 -10286 -1926 35693 91830 125312 161873 220796 287160 364622 353810
17440 353810 272022 207486 156044 119068 98714 90100 51158 28803 13872 12615 28003 15534
17428 15534 16426 23488 44805 47706 23155 10202 34733 33212 20826 -25489 -51707 -36901 -9658
17415 -9658 -2516 -27194 -16519 -17720 -6701 24290 59601 80213 54576 35585 53085 73710
17403 73710 87527 80568 87340 73468 39111 32092 30386 20001 16538 38536 63293 75893 63680
17390 63680 71927 56483 52574 36697 2408 -27203 -55018 -34273 -20791 259 -8998 -25356
17378 -25356 -38637 -29871 -15059 14593 29621 -8741 -16389 -9921 -26300 -1153 31308 40657
17366 40657 46761 48078 38411 21661 5239 14312 23892 -13005 -43227 -19975 -17116 -11033 -3594
17353 -3594 -11312 5679 -11111 -15141 -16259 -35970 -19190 -6518 26696 56117 57694 30304 1045
17340 1045 5786 33532 19169 8437 -7237 7888 38130 36964 5883 1697 750 3599 15433
17327 15433 39642 20705 -12669 -30071 -40152 -52272 -38603 -1928 8803 12705 525 -2349
17315 -2349 1435 18180 -8959 -24734 -32061 -6659 14107 8098 -3416 -1751 -33136 -31112 9588
17302 9588 18174 32448 12494 -16689 -29710 12311 17686 14440 19623 15715 12963 17374 -5453
17289 -5453 -18342 -16951 -2043 25095 51018 85257 83063 51519 12610 7430 16351 47863 59332
17276 59332 51808 22021 3771 18117 50233 71138 13903 -10826 5035 17109 138 -1114
17264 -1114 -33458 -49746 -33601 -9350 -3842 -18884 17039 33731 42543 19658 13652 -15734
17252 -15734 -40780 -27343 -17027 -10352 -9572 -24705 -35739 -36798 4255 13256 39424 39573 32634
17239 32634 37783 43617 62620 68768 72125 42162 21080 23263 18841 8491 7536 -5353 11646
17226 11646 4206 -7300 -27785 -29171 11217 -14366 -32814 -32189 -61309 -102166 -82006 -38087
17214 -38087 11453 14868 -20934 -27985 4086 40060 62640 39226 20781 26262 34369 26956 27636
17201 27636 15420 116 -1606 13822 30299 65989 83486 51195 44816 65628 45725 16682
17189 16682 -27109 -20224 -11447 -50193 -47409 -36413 -49277 -41820 -20142 -10255 -7799 -13943 5299
17176 5299 7287 -8923 -18101 13121 26625 19822 -3673 28774 34852 21818 29404 45471 20618
17163 20618 23108 26529 12538 -19401 -55890 -57700 -48144 -50045 -26007 -19312 -5893 4759 -2237
17150 -2237 -16633 -15587 -43136 -40689 -9788 25197 -9610 -37160 -53317 -53395 -35620 -20361 -47193
17137 -47193 -29196 -17557 -15002 -1456 20976 34783 28411 37523 41236 37949 34437 18054 4713
17124 4713 1177 -6562 -37749 -57463 -58689 -54763 -19445 -1202 7798 282 -26694 -24575 -5499
17111 -5499 -24181 -19217 6154 -14008 -43549 -63105 -26689 -28843 -5222 -31042 -54667 -21438
17099 -21438 9322 -12916 -28204 -6484 6648 29814 2141 68 15965 17011 -3410 -14406
17087 -14406 -346 32052 12714 -10355 -14312 -53014 -70311 -50380 -46534 -34314 -1063 13966
17075 13966 7488 -7533 -43119 -23207 -3338 -10735 -29934 -26566 -31174 -51942 -68040 -52061
17063 -52061 -27024 4076 14680 -10669 -31704 3624 -16734 -16962 300 24455 20545 -6630
17051 -6630 -29536 -26660 -27138 -22575 -3306 25924 6649 -11429 -27577 -61274 -60455 -48531 -29944
17038 -29944 -11173 -18730 -21978 -43268 -6373 19316 10521 3409 3011 -3682 10452 10894 -5308
17025 -5308 1822 6788 4294 -15638 -12671 -40632 -35488 -22768 -22812 -13363 -7264 -8860 31831 66336
17011 66336 53465 18990 34638 34207 12211 -5378 -26126 -47531 -38621 -43896 -1679 28837
16999 28837 29275 28281 5928 11389 -5097 -8482 -3566 -5511 -10498 -1913 -2919 15561 38306 18830
16985 18830 868 31031 53157 23805 -15395 -35762 -24903 -29434 -43806 -28859 -16683 -1969
16973 -1969 -14888 -41410 -63536 -60220 -43782 -33389 -35294 -28570 -32465 -37504 -48883 -32059 -28067
16960 -28067 1547 -10552 -48867 -38848 -19551 -30644 -2971 -9875 -37927 -44806 -26011 -27081
16948 -27081 -38205 -28863 -8449 -6199 -1076 3586 9770 10573 -12240 -19604 -15907 -24228 -26697 -6161
16934 -6161 2432 -15238 -45336 -66308 -47732 -19753 -10781 -14513 7535 12045 4325 -19372 -56426
16921 -56426 -32903 -29813 -4763 23599 -8220 -9706 706 15341 9549 -12420 -9836 -9264 -17022
16908 -17022 -48804 -40695 -33615 -16668 -5683 -7626 19580 39922 16378 -7632 -14009 -38643
16896 -38643 -35450 -4165 2341 7460 9341 19249 25446 49822 46261 64042 63433 28456 22445 24258
16882 24258 43193 39975 15474 16799 31252 3595 -11053 -40951 -57300 -59625 -24142 -4807
16870 -4807 -8345 17678 40639 29863 20336 27992 -3868 -60361 -71876 -39922 -46966 -30695 -15727
16857 -15727 -14536 -22758 -37404 -7758 33596 30663 -19064 -9305 33964 436 -31092 -44101
16845 -44101 -28853 -27971 -45096 -33124 -5849 15554 7976 10498 11947 10054 13604 -14601 -40173
16832 -40173 -27447 -28408 -30967 -7140 -7183 2539 31723 32105 21071 19353 -24843 -26277 20032 24041
16818 24041 -13239 -9512 -13115 -37016 -48700 -43583 -42530 -9002 18524 5365 -7084 -27073
16806 -27073 -48950 -31589 -23663 -37688 -33419 -19325 -34737 -46233 -45431 -3992 8537 -41190
16794 -41190 -68052 -65517 -59080 -44954 -13226 9119 18019 23772 21087 -12051 -26677 -17536 14611
16781 14611 26531 15285 9613 -8362 9949 305 -2381 -3141 362 3303 -23172 -17335 5265
16768 5265 -2379 -16537 -12448 -7997 9470 -11273 -969 7818 9008 41235 23048 12445 13608
16755 13608 27073 10403 -13399 -4130 9309 -7104 -2244 3930 12372 -14551 -10018 11413 11383
16742 11383 -1358 -10521 -37411 -12969 -19793 -1971 8504 9641 12986 -6782 -22220 -20427 -1674
16729 -1674 -21158 -57924 -66026 -41639 -12920 -8123 -11373 -12727 -7779 -1115 -14614 -16044 17091
16716 17091 14044 -1313 -598 25839 17762 16086 18768 -5416 -34850 -45891 -67976 -46066 -33257
16703 -33257 -48298 -38745 -30331 -18655 -2149 12249 9009 -25786 -35527 -28171 -29541 -1047 5916
16690 5916 6624 -3553 9219 40443 37890 10468 -13373 -9328 -30489 433 5491 -20658 -9289
16677 -9289 -11531 -2073 -9229 -38788 -25047 -318 -13942 -37530 -34803 -24617 -2485 7569 23891
16664 23891 33486 39071 20718 -18835 -17648 5866 38096 30077 -4235 -6445 29178 -2661 -1385
16651 -1385 -18511 -18633 9998 30335 -3688 -22208 -29950 -42115 -45996 -71882 -53805 -24190 -39464
16638 -39464 -37007 -16556 -404 16289 13598 -1907 -10014 1723 2232 19364 23322 23968 28626
16625 28626 24502 14766 18146 11478 18465 31588 17653 -2166 -26418 -12219 -321 18091 5341
16612 5341 -17625 -21735 -35420 -54704 -53316 -50996 -12317 10544 -13529 -21265 24783 14960 11492
16599 11492 27198 12629 17878 4709 -221 -16956 -40973 -78195 -71434 -72168 -54459 -38603 -37769
16586 -37769 -48012 -33537 -18985 2359 -11034 -15475 11894 35785 53111 38668 12314 -7791
16574 -7791 -13434 -9170 6402 -775 -2557 -21174 -11446 5862 7207 -25712 -74330 -75428 -84703
16561 -84703 -51156 -46205 -58225 -47288 -52909 -49668 -29550 -6829 -19291 -39880 -36219 -46788
16549 -46788 -52077 -45865 -59761 -97264 -67983 -43373 -42885 -19141 -5826 -17857 -38704 -39895 -69679
16536 -69679 -87404 -41709 -1019 18444 10321 -25478 -36066 -9152 5150 -12847 -9182 -29187
16524 -29187 -1463 18410 6645 -8936 -56664 -76491 -65149 -72111 -72727 -53536 -30232 -43662
16512 -43662 -54759 -57239 -19504 -8599 -23263 -20621 -7326 -12828 -519 7062 17770 -4483
16500 -4483 -40330 -43645 -25897 -22827 -32780 -2119 21407 17841 -2676 -8609 2808 7779 16470
16487 16470 -2779 -13411 -11615 7640 11250 22503 8239 -18640 -42235 -14102 -6840 -16427
16475 -16427 -22455 -22191 -29091 -15264 -16054 -18316 -12122 624 11870 -22074 -42854 -25193 -25322 -43906
16461 -43906 -44257 -20638 -2617 12489 -4015 -22922 -20876 -39857 -40585 -31756 -7058 17333 21697
16448 21697 -11078 -68594 -104230 -87467 -51453 -5568 -12734 -41249 -52329 -48855 -27899 -15134
16436 -15134 3732 34064 13490 8174 12503 283 14540 2780 -43218 -20808 1708 -26725
16424 -26725 -52132 -38253 -31555 -17153 -17093 -6371 2273 10750 4210 29901 47484 62895 72889
16411 72889 49596 -3638 -28191 -901 14266 8427 3714 -37500 -15375 17850 37138 55207
16399 55207 25066 8125 -3851 22523 43112 19544 33485 27070 168 -1313 -20749 -21639
16387 -21639 -20478 -32316 -54613 -44712 -26792 -15592 -33740 -62082 -28003 3548 10808 10872 36805
16374 36805 34935 -2637 -18941 -26292 -35056 -13703 7456 16789 17192 24573 33506 13462 2874
16361 2874 -1019 -2797 3269 -2114 -18367 -8024 -3783 8806 29002 23526 22942 17433 11906 5787
16347 5787 -9546 -10845 -1090 -6930 3285 -8388 6097 37944 24188 -6032 -19860 -10872 24584
16334 24584 41886 28674 8441 3340 -2027 -26127 -46137 -43631 -32347 -15000 12214 3980
16322 3980 6890 -13934 -1261 -7827 4238 1765 25795 45373 50055 41256 23400 -19934 -60583
16309 -60583 -60396 -30499 -10869 -15021 -8350 -2400 3733 -6094 -5711 2263 7382 -12312 -10520 16829
16295 16829 29380 32284 -13443 -11301 14507 11716 -8439 -41657 -49497 -53455 -13961 16558 13342
16282 13342 574 -22706 -29967 -16946 -15337 -6459 -8005 -14260 -26967 -28648 -42627 -31360 -919
16269 -919 -6682 -42263 -32595 -22970 -28567 -12972 34863 35090 -4710 -18330 -19461 -23699 -14594 -24553
16255 -24553 -60161 -50865 -64693 -53249 -38120 -23762 -15435 6562 21905 -13095 -38401 -42852
16243 -42852 -34547 8185 22626 4029 6190 13104 34594 22277 32192 50886 37483 3783
16231 3783 -10472 -8373 -22501 -21912 -15153 -25370 3029 27858 11875 10247 3179 16891 10992
16218 10992 -11501 -3402 -5620 -31475 -43019 -30345 -8446 18210 -1654 7831 14084 14613 19901
16205 19901 -12178 -12372 -31090 -45386 -36842 -15364 27079 39501 19751 14523 32679 63097
16193 63097 13934 -16766 -13563 5229 15318 31929 28001 28406 -16064 -28309 -20737 -32088 -27693
16180 -27693 -28784 3537 2958 -9475 -7838 -3387 -3032 1419 -4255 -188 -12812 -15288 20819 61469
16166 61469 71742 98344 86484 50904 -1795 -25465 -35514 -54472 -54431 -59716 -32868 -43884
16154 -43884 -14264 -3757 -6160 -24922 -22804 -49963 -39548 -25008 -25359 -29913 -37698 -31110 -25243
16141 -25243 -18748 -12025 -7544 -32942 -45405 -17719 -18951 -5791 -12828 -25941 -4259 -4534 -31331
16128 -31331 -26274 -11828 -6196 -723 -10159 -30803 -41284 -43149 -56897 -59731 -40409 -27838 -46542
16115 -46542 -79258 -85904 -58357 -9601 -18725 -15162 20774 18382 8998 21202 12220 -10560 -5485
16102 -5485 -857 -16075 -39811 -25951 -15174 -16660 13677 31724 10871 12019 10076 7243 12068
16089 12068 -1442 -22853 -20917 -21734 -41479 -41729 -7252 -19750 -38837 -18933 -27743 -34320 -22946
16076 -22946 -43889 -30416 -1193 -1422 -15491 -12521 15176 23060 29373 36961 6880 24095 18094
16063 18094 -129 -7825 -5897 21353 -2719 -27316 -16052 -10127 -15047 -11602 -720 -640 -29202
16050 -29202 -36221 -18080 -27648 -26572 -32063 -36400 -43914 -28816 21905 14747 -24328 -3889 -7446
16037 -7446 -25056 9203 29854 18525 -5906 -43485 -38272 -30380 -46948 -58864 -58432 -50375 -66346
16024 -66346 -71297 -51170 -27462 -12236 24783 33388 13373 -15698 -24280 -28378 -44176 -48372 -33629
16011 -33629 -27189 -3006 -137 -1643 -8576 -21806 -44331 -41701 -28965 -26064 -44694 -49694 -46137
15998 -46137 -25464 -14039 -25913 -25194 -23454 -12809 -7685 -27928 -30459 -7392 6533 7376 -18498
15985 -18498 -54782 -63003 -33959 -36440 -50268 -63519 -61596 -75228 -98072 -66588 -10007 13954
15973 13954 22925 12385 4149 4554 14433 29804 46666 12210 -373 12503 -10891 -20792 12528
15960 12528 29455 33634 43396 37684 28637 8115 -19973 -6789 7631 -18654 -39243 -40132 -23834
15947 -23834 -16886 -24991 6944 13720 25844 36836 27688 13160 23442 24310 20720 30193 24898
15934 24898 44798 72405 52947 37541 46525 10182 -31303 -61598 -80163 -72145 -62852 -53569
15922 -53569 -52020 -24024 5761 -5114 -35330 -38644 -23713 -26511 -31244 -44562 -50947 -36764 -38275
15909 -38275 -46475 -32457 -26770 -41316 -47598 -51623 -13566 -7632 -15522 10621 25717 22721 -3040
15896 -3040 -6604 -7208 -16464 -5434 -22458 -49687 -64043 -54148 -37242 -37827 -28332 -5186 3330 3963
15882 3963 7484 28252 39579 11169 4560 48821 56431 38869 59000 52798 58561 44695 52624
15869 52624 42425 6078 -34374 -39154 -44073 -44131 -30915 -40037 -50027 -33898 1579 31106 18122
15856 18122 -49852 -62394 -44069 -54465 -48402 -52549 -25663 -5989 45922 52478 35619 -2099
15844 -2099 -19116 -34464 -22785 -2008 7401 33089 38874 33619 1596 -9537 22370 40028
15832 40028 49905 26200 24563 16808 5098 4029 24832 38198 18536 1165 -18858 9703
15820 9703 15911 21429 39438 30154 436 3286 -5332 -389 2599 1250 19441 -20262 -43327
15807 -43327 -45795 -16908 28395 25073 29249 41156 28174 31796 21583 19341 33459 24905 5953
15794 5953 6965 -10848 -13661 15581 20005 24242 27139 8929 5688 -3677 -5214 -14985 -14431 -1694
15780 -1694 8256 17539 47642 61155 70950 65300 44096 20704 -68 -1024 -16952 -35405 -31765
15767 -31765 -7988 25568 149 -31257 -44708 -50521 -32565 -20653 -553 1693 27642 44376
15755 44376 60432 55159 49752 10059 16435 16205 9697 10816 30040 15071 -25577 -45312 -23609
15742 -23609 -1239 19244 19442 -5555 -22922 -20614 -24275 -28069 -14131 11065 19704 25528 28957
15729 28957 38925 -8042 -14716 15901 18731 -2889 -14366 -209 -7681 -15177 3285 -4197 -34773
15716 -34773 -66850 -71295 -50678 -46110 -17525 13876 20512 18425 12978 -10236 2150 16673 -17989
15703 -17989 -19872 -24161 -23982 -8248 -23416 -18695 -11720 -44396 -73086 -89703 -48172 -30672 -41696
15690 -41696 -51324 -11820 21502 -2638 -27028 -61044 -39445 -4068 -10164 -20507 -9070 37172
15678 37172 40344 181 -8772 4373 -23511 -33230 -8959 9021 -23471 -31775 -21901 -31770 -27721
15665 -27721 -32673 -43568 -24936 -6248 1041 5773 30221 38984 -5708 -16613 -13640 -1167 12667
15652 12667 17209 17747 -346 -29273 -24648 -33523 -39852 -30051 -23669 -26554 19675 29918 33657 41959
15638 41959 34985 18306 -15848 -27796 -24409 -55584 -63314 -29369 41939 35100 2311 -8235
15626 -8235 -9801 7061 15978 10470 3976 7088 7505 2330 19237 9981 10579 -14515 3414 11535
15612 11535 17755 52537 13705 -43848 -35680 3099 35137 32242 34552 30836 58636 49066 20699
15599 20699 28937 35333 41463 36356 -172 -33656 -10660 17926 17815 7576 34995 38611 40881
15586 40881 39222 43371 35949 35937 3706 1360 32782 19826 -13630 -28688 -6957 14696 17434
15573 17434 22852 28182 47703 46968 27086 10854 12908 7438 24285 32895 37495 48284 49484
15560 49484 36217 38240 36472 41701 30643 14443 -4505 -44303 -59877 -63764 -57237 -61650 -37853
15547 -37853 7313 26180 25313 26470 3808 -1271 -30401 -22512 2482 -4906 364 22438 15489
15534 15489 25277 36108 36409 6010 -10197 23984 5148 -31072 -9302 12605 24301 13185
15522 13185 -13565 -57113 -57009 -16753 -3816 -546 -2582 -19788 -20199 4648 25449 7832 -2311
15509 -2311 -977 -29785 -55661 -46565 -35016 -9843 46121 39573 20218 -28662 -38862 -14978
15497 -14978 -22001 -56168 -76630 -79127 -68088 -45682 -32433 -25724 -29465 -19783 -4271 10021 18126
15484 18126 8827 -4471 -7274 -11429 9483 -6085 -18487 -13593 -11619 -21986 -24539 -25661 -7194
15471 -7194 26138 18198 7113 -35359 -24783 -12224 8045 7237 -22729 -29277 -23181 4899 21840
15458 21840 -3865 4446 246 -7299 -13600 -10637 -22707 923 23239 19248 -13011 -29576 -13769
15445 -13769 -7075 -1556 -9578 -11027 -8918 19027 19268 24045 8372 -11387 -16892 -34989 -50418
15432 -50418 -34152 -14693 -11566 11711 10198 13036 36342 43895 25679 13247 32093 45242
15420 45242 59384 49808 55633 80841 45379 16047 -9607 -17540 -26753 -24660 -21726 -1758 6936
15407 6936 41858 38688 10561 13247 -8125 -35942 -18608 -8906 -10922 1315 42 17320 19682
15394 19682 23815 52814 67361 77855 56528 33275 43218 43106 3510 -7312 -40297 -43442 -26905
15381 -26905 1528 50083 45649 26368 36604 24395 30067 5933 8128 1600 2724 -11537 -24085
15368 -24085 -31145 -32138 13984 43376 46023 27036 15342 15333 11904 23137 5837 3111 13846 31779
15354 31779 34880 47515 44092 40554 15515 30373 34012 30820 33882 12795 -17644 -19746 3607
15341 3607 -26055 -21574 -19697 9143 36158 24826 282 18786 53927 54459 38754 7813 8788
15328 8788 10091 -21269 -18023 6138 16649 33173 36534 41554 26422 11926 16684 30643 9749
15315 9749 -18223 -52864 -46521 -29699 -13894 -34995 -37074 -12884 2240 10828 20903 23627 22854
15302 22854 21348 47742 36852 18656 40172 60983 41917 56839 49019 19770 4161 -18501
15290 -18501 -38323 -40272 -44868 -37522 -24397 6543 16632 45752 38998 26877 25238 13807 33992
15277 33992 13366 -16495 -12414 -10706 22705 27752 4232 -46116 -57598 -32240 3310 27440
15265 27440 8769 -24809 -20416 -20797 -32902 -16184 -626 17435 -6531 -12894 11130 7041 7976
15252 7976 -1442 -13004 -19446 -33025 -32106 -28876 -7319 4373 -195 10446 33368 36690 -1370
15239 -1370 -31156 -17661 -12970 -4183 -13023 6430 62415 59804 52715 12923 7978 -11400 -3889
15226 -3889 5367 128 -234 -23129 -26725 14472 23033 15030 29423 23348 35759 44424 6949 -3757
15212 -3757 13322 42633 27387 30720 12640 16051 -3896 17014 26074 9127 -5117 4988
15200 4988 31384 29328 17842 12030 -3914 7542 25369 9108 9379 22269 16981 38215 48991
15187 48991 36213 17996 16873 15331 3159 15701 9775 -701 8938 44423 29500 21478 30217
15174 30217 45386 52882 20257 18919 23943 23309 11121 6298 19291 50925 49344 -4267 -46793
15161 -46793 -59410 -70377 -56167 -10896 12483 30635 27686 39481 17386 -20452 -16933 -13751
15149 -13751 -30348 -3650 4951 -3474 -7733 -5958 -11743 12692 54340 63528 73230 42866 49949
15136 49949 21936 7880 10496 35321 64398 56959 45290 53675 12369 23419 40811 22299
15124 22299 -7620 -17911 -24718 -31874 -9787 3638 5050 12000 25407 16893 27449 23999 34643
15111 34643 55958 61190 26319 2716 -6374 21067 4850 23621 23847 9907 36284 30775 7455
15098 7455 2869 2709 -18791 -4618 7260 12802 -1564 -23046 -20918 20536 40211 36892 19329
15085 19329 -11169 -6143 -2884 -17384 -28213 -31720 -41049 -44299 -20310 -19715 -17639 -8104 -10595 -27631
15071 -27631 -52381 -45359 -10854 43744 25696 8594 29138 47329 38502 15103 19451 15198
15059 15198 26162 29081 29033 44468 77447 64862 21893 33661 49855 33824 26273 14459 34263
15046 34263 55760 70510 56264 22872 26494 21532 -6847 -14189 31042 55972 42521 33768
15034 33768 9452 -5774 10138 10859 13513 16956 10400 12975 3191 39233 95475 90891 74708
15021 74708 62974 44508 19384 20356 52116 41201 13607 7034 1734 20118 18037 6969 24315
15008 24315 36304 18464 -7039 -19701 9282 -5401 -11856 1633 33740 46996 48682 39714
14996 39714 42345 35209 22165 18762 15741 32749 10231 1539 -19413 -25175 -9565 21678 9111
14983 9111 2258 21507 15895 5571 16834 29156 28638 41665 34886 40409 34064 45948 18934
14970 18934 -25253 -11435 -10842 -15156 3854 -177 -20530 -10896 -23794 -16501 18438 17658 -8736
14957 -8736 -56106 -38777 -7218 -15290 16300 34540 22939 13533 23362 19037 8268 14358 1580
14944 1580 1063 34209 23092 -553 -3727 16380 27978 35095 38310 40400 73116 75895 43090
14931 43090 13571 -15842 22388 23500 45795 37255 29182 22089 42427 37779 28601 43138 39280
14918 39280 28570 11268 6061 2858 -7324 -11834 7995 28970 50140 42060 54293 41746
14906 41746 27308 34086 41642 32878 24178 42373 58202 40742 -7024 8710 28725 28943 17469
14893 17469 46576 72740 52486 14313 13439 3255 13107 9072 7078 -9482 6908 9574 34881
14880 34881 49609 47475 57941 61246 40469 49594 48282 44693 44381 64387 60787 68662 95954
14867 95954 107537 124097 115121 136841 157847 144818 134969 137099 139147 154132 146705 137935 144669
14854 144669 159418 191989 210072 211614 240966 322009 459625 599777 809466 1119846 1479227
14843 1479227 1756060 2021165 2095750 2029283 1862565 1626461 1349268 1035673 741988 520197
14833 520197 385832 321066 295437 262887 222648 198179 170528 158345 149030 120783 123102 115146
14821 115146 84617 62390 72496 80092 85404 69368 83699 63008 64980 99822 124286 120626
14809 120626 100834 76348 70522 46349 31839 2534 -85 4587 15995 34036 10517 748
14797 748 -1831 -18681 1218 4328 12575 43461 54220 31982 11060 8634 -884 -3897 19534
14784 19534 17543 -2365 7335 321 17431 59937 83574 68571 64849 78388 93514 76090
14772 76090 44988 38146 41620 36653 40498 36976 76533 87597 60985 41904 31077 25729 35957
14759 35957 47824 34374 23335 13915 28905 41165 48913 98819 87504 76705 83157 37218
14747 37218 45730 40867 30750 55661 82695 71058 57563 89213 119846 105405 71237 73104
14735 73104 92286 98826 86755 84490 77303 61155 39190 65235 57648 45559 44246 55985 46189
14722 46189 4846 -8258 28687 49654 19490 17406 30561 11187 38196 76186 77924 65809
14710 65809 73917 86114 79833 82180 58945 62315 68640 77627 64546 53779 87793 115851 145976
14697 145976 124994 90335 40439 41643 36726 43306 36337 45183 47320 46685 24649 29040 56158
14684 56158 59747 77422 84856 65523 53645 45890 32870 16727 48346 60698 71041 55755
14672 55755 64921 77433 62918 55245 51231 59039 74087 99076 102597 87804 71726 78700 103222
14659 103222 120337 93311 48079 23479 40108 56073 70247 66046 77816 95185 140285 204896
14647 204896 252723 294457 314949 330717 319708 314790 279866 255157 214414 163041 117226 91195
14635 91195 84127 95215 133635 130316 136120 136545 118776 120379 135525 124106 127458 127680 140748
14622 140748 137549 132845 114306 105207 91068 132088 159339 152660 152487 143311 116345 90256 93909
14609 93909 58451 19202 32773 62055 63787 100690 109212 74208 76049 75785 75615 64217 70700
14596 70700 103656 121205 120510 158398 179569 205809 214732 226021 265730 242530 227616 200680
14584 200680 210620 229959 211137 218108 243132 242285 233899 227517 228668 217205 212710 170321 136628
14571 136628 141940 159579 146292 165682 202394 199120 248631 254774 252185 226015 181595 176735
14559 176735 190550 182746 198105 199724 177745 148618 120144 112450 95321 74364 65034 70634
14547 70634 86592 85859 102896 132527 140992 144209 195343 234905 219283 235858 266292 271323 295874
14534 295874 302783 301010 318210 362609 392585 418348 460293 503877 539740 559674 590935 633767
14522 633767 620454 570910 565199 518461 432938 366840 282189 203885 152309 102310 72154 71912
14510 71912 91018 124314 114794 110489 134584 141050 139727 177354 207054 222554 233653 241297 277380
14497 277380 305990 299856 293395 318467 336794 323423 336453 340052 354624 332399 329635 328622
14485 328622 320858 325309 303310 300977 333702 323337 313642 317401 352109 374994 389927 406905
14473 406905 414771 430127 432041 455036 470295 484738 513379 524341 524558 572547 581550 563751
14461 563751 508787 506423 502719 472325 443678 454657 507566 587025 678174 740983 783047 835252
14449 835252 916567 1009340 1059898 1115323 1202616 1248426 1275906 1306498 1332257 1359181 1387745
14438 1387745 1439525 1535585 1654984 1757885 1855884 1956204 2074236 2219675 2403427 2661603
14428 2661603 2964553 3329563 3696285 4030309 4359169 4647846 4877264 4997645 5098739
14419 5098739 5244339 5397387 5620921 6020501 6603060 7417493 8520088 9953232 11678053
14410 11678053 13616627 15642152 17530325 19279078 20937196 22708715 24995781 28348792
14402 28348792 33447958 41240082 53014181 70934833 98431103 139044943 192391326
14395 192391326 254651200 317299809 369243305 401508050 404712114 379578450 332008939
14388 332008939 271475288 209932170 154627893 111664307 81681294 61793281 48834259
14381 48834259 40251346 34413508 30335888 27400920 25105164 23068107 21041012 18951855
14373 18951855 16786305 14664890 12709211 11025108 9612018 8463533 7532405 6761280
14365 6761280 6082762 5518415 5068097 4657952 4286428 4002257 3740766 3509371 3297994
14356 3297994 3077269 2860129 2697910 2577325 2425171 2310807 2233956 2122075 1992262 1887586
14346 1887586 1795886 1704961 1631031 1564510 1512224 1465639 1367836 1295942 1239715 1179625 1127888
14335 1127888 1070984 1067249 1061167 1026820 1031468 1069539 1073604 1082134 1076288 1061445 1030246 941067
14323 941067 861874 770115 697782 684403 686139 656664 634518 637180 647924 617846 617848 621106 594360
14310 594360 582413 585919 565718 587343 612882 626990 618770 591227 581823 583473 580464 571253 556760
14297 556760 543757 493837 481850 466541 457019 440559 423757 413620 383002 360226 361469 355520
14285 355520 370727 363368 365921 397395 429863 441498 464551 469528 468082 518338 563435 612341
14273 612341 651532 685224 754170 858498 888722 900184 900154 803119 665901 534203 365171
14262 365171 266121 226912 162321 124692 122254 105730 103966 91170 83167 110062 130590 123294
14250 123294 114500 108282 133472 159302 127710 114744 122247 144461 163394 159925 185722 203137
14238 203137 225871 218734 211792 217281 209553 165969 147337 161483 131827 112616 103124 101224 108931
14225 108931 77810 100258 118272 115014 109728 90798 71258 85700 121411 143739 156765 146597
14213 146597 122633 129898 111978 76625 68318 60445 53370 54240 27879 5163 -18547 -49825 -27094
14200 -27094 -13453 -26570 -28776 -42966 -38369 -19712 15067 6029 -4746 31119 45524 56717
14188 56717 63399 81367 82613 61404 71962 86334 101419 112354 86867 92453 115434 88221
14176 88221 102972 135202 148476 162424 152223 112359 108511 95592 81853 94791 128058 148594
14164 148594 133508 115215 102955 79929 36998 37364 68659 85742 82378 61858 60227 68051
14152 68051 55524 41144 53914 60683 60659 31973 43428 69908 51093 39769 64981 86558
14140 86558 101559 136111 129608 125902 139089 154117 127916 93836 115164 138991 121310 100568
14128 100568 71354 69888 63929 87861 108703 105846 99811 89559 73773 67284 71676 52887 34872
14115 34872 25907 41008 13873 37585 75653 89315 86128 64754 78551 84390 88905 99008
14103 99008 85302 87809 83318 84716 99069 102917 123681 142912 120827 100807 102226 84915 65099
14090 65099 59118 49301 21995 -6216 -7204 -15807 9441 22712 6978 25599 39195 3601 17386
14077 17386 22267 48217 52869 56710 53177 18081 19413 36865 61185 85539 86660 60603 67286
14064 67286 40182 23466 19278 24888 38347 15903 -23582 -21180 11904 35372 52674 41712
14052 41712 17054 -2290 6871 -19480 -17626 -9854 -4393 10598 36737 38032 22152 29036 45002
14039 45002 15077 -12635 5088 13310 -6803 17883 12360 -13291 9870 17359 33273 74307
14027 74307 43316 -8085 -43544 -30519 1447 -7690 -25370 -28451 -8057 34867 18828 -136
14015 -136 -11489 19540 39077 52188 20154 15216 14333 16174 -1496 -4995 -1639 3397 6478 2045
14001 2045 3775 42599 49139 19640 38946 65629 53561 55120 20092 7973 3604 20038 25199
13988 25199 33846 37502 42512 36872 37424 30305 18226 15542 27738 13598 14601 43753 70132
13975 70132 86029 117074 115519 89100 75368 66383 39182 28052 20728 9853 11990 4388 10701
13962 10701 29356 60561 97714 98590 82623 95277 109442 117985 114071 107700 123792 169406 195433
13949 195433 222409 222622 225911 255350 333819 435156 510959 652715 862446 1161440 1466894
13938 1466894 1764041 2007124 2131110 2119208 1951954 1715364 1381872 1063917 795000 615328
13928 615328 483935 370054 273280 236463 219377 165747 130428 106007 92892 100542 94193
13917 94193 38429 7505 11001 12558 54067 77654 84794 109081 98788 114059 164768 169012
13905 169012 161562 184800 224098 251989 254814 236638 215159 177202 167373 143208 89274 57750
13893 57750 55868 35825 34317 55485 51745 34001 25761 25114 35246 38364 54772 60190 59099
13880 59099 51230 71340 68557 25693 27444 33545 29639 25450 33994 32169 24304 -23 11858
13867 11858 48350 25929 8609 24964 46861 34424 30062 34563 52257 50949 25881 13500
13855 13500 8587 1488 22839 30772 12879 21999 27423 -12653 -15055 11313 36458 25205 -2290
13842 -2290 32333 54917 65436 42035 -1662 -32387 -32934 -31086 -19956 29476 56925 43350
13830 43350 16452 18410 48414 40910 25876 39654 22418 5352 -18878 -39161 -34323 -30725
13818 -30725 -23144 -13075 -6287 20042 29079 46490 46726 30296 31786 8380 6753 21491 -8889
13805 -8889 -29110 -23149 -32849 -45925 -42967 -34816 -35158 -682 34694 14370 5883 28220 43375
13792 43375 55103 31804 23465 18642 -16447 -34619 -4297 16817 32535 34751 43164 23926
13780 23926 36722 49334 64681 38164 35273 70052 67701 65809 37605 4335 7040 8666 2384
13767 2384 5046 -3767 -14489 5602 40237 36706 40413 44421 40723 17635 20322 31037 17718
13754 17718 22163 1340 11094 15807 7469 -23019 -27366 -25149 277 14226 17639 12208 51455
13741 51455 34345 28999 9865 -13512 -27061 -44226 -32024 -25569 -31797 -64889 -54435 -38233
13729 -38233 -19394 17880 14180 11149 19668 34310 15236 -15683 -24154 -32193 -12555 -31022 -50022
13716 -50022 -59643 -20683 -1300 2254 26871 62215 50090 49486 42078 4470 -21507 -19504 1856
13703 1856 5360 792 36343 28462 3796 -3250 22519 9296 3595 19546 20039 27818 37107 9363
13689 9363 -16023 -6376 10319 32391 32446 26374 -6403 -22300 12204 26534 7722 12139 -1092
13676 -1092 -3779 -5985 -13349 6024 19058 -6297 -8837 -36847 -24014 -3300 -17810 -15573 -27054
13663 -27054 -13450 -35163 -55100 -59055 -67635 -63117 -37971 -11809 454 8969 10077 -21508 -26139
13650 -26139 -20741 -15278 -26579 -6850 7996 19960 12483 13855 -5773 -22525 -34396 -19290
13638 -19290 13962 27988 6134 29271 37260 34090 13188 18644 9254 -4709 -7334 5450 -11057
13625 -11057 -32154 -28197 -36380 -17065 -212 405 -21185 4632 17025 -19074 -40885 -21733
13613 -21733 1043 7748 3111 13802 5138 21652 52833 32748 46708 67582 59674 14960
13601 14960 -20825 -27298 -14081 -14163 -35069 -7211 20072 8276 8318 9249 -1249 -11828 -26091
13588 -26091 2715 3300 18101 15439 8335 18891 28789 18479 2159 -3095 2764 -6473 -13835
13575 -13835 -41680 -15623 12495 48339 67051 36465 13281 -9399 -9070 5593 27621 -22050
13563 -22050 -29639 -39440 -52640 -41443 -36293 -8171 11384 10502 37097 46999 34483 36105 70179
13550 70179 87208 78803 50096 56447 62947 59870 47967 48548 61646 43018 4980 2023 3279
13537 3279 8532 17217 12368 -25000 -14088 12345 19935 17158 2356 -620 -9785 17276 41268
13524 41268 56948 50239 33510 14201 9795 17481 46975 30131 17715 35984 46769 45982 44493
13511 44493 40774 30624 28633 26263 6137 6394 6592 -15704 -41277 -32243 -35873 -17602 18113
13498 18113 34879 15568 14695 15111 41913 20585 -268 -5910 -148 -809 -15997 912 13245
13485 13245 43349 73381 79109 69882 88228 80076 41611 52719 99284 141332 136774 144638 190095
13472 190095 244368 310027 349942 425455 486391 604982 703245 771037 794904 748563 700645
13461 700645 588905 462498 365525 296016 284574 198089 146774 101129 90316 135075 121830
13450 121830 122601 131126 99542 78550 89374 73546 80296 105027 102740 54524 26321 38059
13438 38059 63456 66231 71315 47061 44448 59353 34392 6711 56173 74952 69300 60814 48911
13425 48911 45237 57395 31363 27913 28182 3120 -12336 2160 8935 2226 -2810 -26574 -3423
13412 -3423 12557 32843 25640 21402 22979 36223 62265 38539 12533 1946 7961 7897 -5748
13399 -5748 -8730 16469 5925 14990 35301 14393 26075 51725 56496 29755 35674 38904 37355
13386 37355 40474 35545 3899 -22310 -30283 -27167 -42206 -37137 -24293 -41182 -61956 -66542 -49493
13373 -49493 -50437 -45568 -33073 -23649 -22660 18819 23402 32102 42331 32925 -3874 812 -25379 -50797
13359 -50797 -54840 -57304 -68208 -43294 -24439 -9184 -12037 -26315 -23721 -399 -3576 13666 17583
13346 17583 8798 -7907 15860 40257 29478 14524 23530 35657 -10207 -34435 -24561 -14461
13334 -14461 -11480 -17453 -30743 12956 -6465 -49891 -43386 -5444 7347 -9548 -48352 -71683
13322 -71683 -52513 -27201 -31541 -38207 -16817 -3541 27675 18584 -33148 -16784 7844 18550
13310 18550 33488 14930 17155 -2041 -12104 15106 41631 53777 62752 55257 54303 67697 35010
13297 35010 5786 -15709 -7183 -13587 1387 4157 -1845 30456 22515 23257 32424 12452 32105
13284 32105 24931 -13931 -9796 -6632 -1881 -12362 600 -1677 -22018 -8316 -11352 -25582 -19936
13271 -19936 -2388 3414 -40716 -46060 -34565 -51957 -57189 -27944 -15178 -31588 -19211 -9855
13259 -9855 25380 36451 14839 757 -8683 -14187 -18930 -21770 9589 47593 68524 53964 67270
13246 67270 64857 63070 52366 38995 41267 53842 58189 55500 13818 -31210 -33794 -12198 -4948
13233 -4948 -10695 4731 3318 865 -6438 -1238 15077 3511 11027 -619 3927 18515 7549
13220 7549 -10429 -10681 -3904 -6685 25511 40419 19404 28402 34547 25326 -1495 10997 21049
13207 21049 16387 2521 3977 -22302 -10370 20540 17254 -9658 -408 12285 28542 23316 -23541
13194 -23541 -29379 6447 29699 19925 -3666 30177 27780 14908 10444 3308 33200 25400 -4018
13181 -4018 -13579 -37382 -57751 -54037 -36675 -23146 -17362 -34059 -18572 4322 32007 31056 7865
13168 7865 -39614 -52493 -27775 -24756 -24525 -19454 18411 64060 73428 44893 28058 9241 -6167
13155 -6167 -26220 -22215 -26534 -15486 -10510 -21021 -13300 17330 16494 2620 -8348 4012 6036
13142 6036 17057 -7131 -32872 -43476 -21229 7134 -4110 -36177 -43152 -14793 22004 32161
13130 32161 28929 22483 11133 -14462 -24809 -16043 -9233 -5959 -4142 2883 -15280 12193 29562
13117 29562 18759 -38028 -21609 28528 13115 9532 32025 35435 25164 -11330 -42781 -58640
13105 -58640 -58045 -48080 -15276 11502 10756 13797 -7136 -34450 -71440 -56218 -36371 -19533 6112
13092 6112 -16304 -23087 -26433 9903 17562 25929 39150 28057 24150 29709 30815 12196 15145
13079 15145 10476 1600 4955 44376 56586 55457 53680 29695 24220 15635 7712 16075 10623 362
13065 362 -282 -9399 -29178 -26499 -27250 -17261 -6043 -20280 -28110 -8207 20554 28270 45567 52182
13051 52182 61630 23016 13626 30471 -5162 -14070 -9680 -87 -7668 1072 -12973 2167 10412
13038 10412 8684 22262 40988 25951 23254 29873 34428 15806 -15841 -45185 -26859 24482
13026 24482 31685 27669 66444 63988 40387 39914 2827 -14153 3230 -5414 -3872 11236 -9586
13013 -9586 -6661 -15745 -13859 -32941 -42368 -43338 -34900 -29879 -3657 -10575 5995 20782 61101 60081
12999 60081 32623 15558 22044 8435 9120 2650 2409 -3090 -5444 -1715 -177 -4049 -19231 -71051
12985 -71051 -73012 -69738 -66518 -69862 -53527 -38267 -16151 -8091 -13528 -9977 6745 16217 1143
12972 1143 -26919 -20171 15798 55190 36152 8977 5175 5140 -20858 -26292 -10750 -6878 -4922
12959 -4922 -2914 19042 10795 -12255 -12284 -17097 -20519 -24398 -12130 16044 26644 17122 7300 -37935
12945 -37935 -47469 -23121 140 22397 48493 33057 -4621 -23392 -43312 -35899 988 12849
12933 12849 3797 1687 -16755 -18037 -13886 3693 -6794 -19178 3589 -2137 1099 11419 9896
12920 9896 10014 -2354 -32655 -32266 -5423 35414 68643 50670 29944 22421 8003 -3328 16053
12907 16053 29762 25437 28631 26235 27398 16253 21521 48675 31563 10400 5901 -12139 -2292
12894 -2292 7632 31308 17688 9535 15353 41137 54061 17739 -24477 -27966 -6296 10558 28037
12881 28037 42261 37897 15428 -8292 -1787 23990 59315 78952 77840 38697 26081 -5751
12869 -5751 -32314 -24113 10315 26588 28346 30963 46951 77276 89092 90789 133284 153976 211144
12856 211144 246785 229120 210665 191009 123160 68602 49801 16714 17621 28331 21810 -4533
12844 -4533 8652 13670 21275 52943 56554 39823 44342 25262 1342 27257 4857 -18641 -968
12831 -968 16405 3561 -4348 -17795 -35365 -15845 -23657 -613 4592 -7450 1047 36593 36794
12818 36794 42299 29004 24642 -3001 -23278 -31845 -59091 -43680 1161 18050 24484 10686
12806 10686 8691 -6330 -15389 -6486 4212 33257 -3412 -22899 10481 -15401 -56699 -48004
12794 -48004 -47078 -42793 -41406 -33164 -14502 -4310 -1242 8285 20813 42677 51987 14415 -15967
12781 -15967 -28897 -18799 -3501 -4378 -17625 -22575 -29498 -40846 -22489 -3407 26913 14196
12769 14196 8411 -23864 -40969 -61391 -43194 -21304 -17126 -35077 -37584 -28333 -32787 -27627 -12792
12756 -12792 -33585 -59855 -47695 -18204 6053 30880 56862 38114 17125 -4474 -128 12080
12744 12080 15434 21289 2328 -6884 -2301 -6886 2821 10992 -9718 -9883 -32341 -36050 9684 37701
12730 37701 40274 56030 21002 -1170 -14001 -28675 -9760 2875 6276 26210 26437 9239
12718 9239 22574 -5055 -14262 1468 10530 5336 -13028 9409 41153 33207 54735 61684 53078
12705 53078 21334 -7171 38800 33759 2398 -9824 -575 604 -750 11635 8855 15096 19906
12692 19906 32927 7266 1255 -3093 16531 9902 -4085 -21787 -62066 -68308 -17232 24667
12680 24667 49407 32498 27705 36808 34452 20827 32404 35729 22258 20120 12779 9054 24506
12667 24506 20312 24752 9525 -7908 -755 15113 20465 -2673 8470 16669 13749 -14774 -32812
12654 -32812 -3425 7215 -23397 -38974 -29239 -5040 -25161 -66793 -64313 -21647 -9715 -5738
12642 -5738 7308 8429 26595 43024 36060 -7877 -23665 -1737 -25872 -59135 -61138 -36583
12630 -36583 -6573 -575 -11825 -35041 -45073 -46496 -27274 -40414 -12165 17226 6825 13865
12618 13865 18582 -23386 -53337 -39932 -16182 -30430 -35810 6662 28757 28974 1512 4501 5975
12605 5975 -6193 -18849 -48879 -41624 -13140 14361 18120 12142 -23015 -36923 -13030 30074
12593 30074 27314 3244 -7879 -3180 -6366 15752 37930 42899 47994 37129 1729 -4803 -20150
12580 -20150 -31878 -32555 -35124 -50633 -57009 -58466 -57157 -35914 -32332 -19584 -34768 -46388 -40774
12567 -40774 -19254 5559 29093 49562 28401 -2228 -6891 -3992 25772 30983 43823 23632
12555 23632 13666 -17664 -33273 -12588 16696 50126 34909 -21373 -20119 1543 13226 43984
12543 43984 7056 9442 11755 12801 -8640 -23749 -374 1522 3554 7127 -4770 6397 27315
12530 27315 45578 30722 20105 30273 37740 17620 -6684 -18478 -33331 -17228 -1599 28040
12518 28040 37255 10367 -23091 -23832 -43247 -49309 -22264 23108 10578 -12713 -22107 -10094 -10704
12505 -10704 -11920 -170 24385 12433 1771 17468 3493 -11655 -25857 -24124 -24345 -27266 -19967
12492 -19967 6084 25197 15855 22895 17544 7966 14046 12866 10905 12630 -16629 -26230 -26477 -21092
12478 -21092 556 2891 14195 -6114 -22696 -57532 -73602 -32300 69 -2500 7908 -3505
12466 -3505 -19628 -16063 25759 22983 -24794 -44068 -10570 5544 2480 -2266 -19826 -13582 -2607
12453 -2607 -6952 163 18460 13718 40625 51114 15414 11498 7645 28135 52499 64345 53400
12440 53400 38365 8063 8340 -14718 -17061 -3310 22987 48048 6687 6238 9270 14198 8538
12427 8538 2719 4220 13559 4279 4281 -10250 -3952 -7669 5568 15377 38697 30522 1516 -11042
12413 -11042 -29562 -42693 -40281 -49950 -27944 -44011 -46271 -31208 -4535 -9675 -31529 -31529 -26262
12400 -26262 -12168 18150 26827 1052 -18645 -6456 1593 3986 -17677 -53241 -29435 5383
12388 5383 -17580 -33946 -20331 9907 823 -2127 -10872 -17532 -8456 -17274 -43287 -72550 -69534
12375 -69534 -48606 -17332 -41263 -51083 -24681 786 5421 5420 4762 21404 3820 -9191 -52053
12362 -52053 -101212 -110445 -75906 -39926 -30613 -31362 -19542 1363 2278 478 35595 31077 -13033
12349 -13033 -33144 -42698 -44286 -63195 -58702 -60722 -48717 -17349 -12084 6383 5352 -26437 -55389
12336 -55389 -29334 3186 7914 -2991 -7844 -10928 -1053 -8700 924 14155 5885 -34172 -71709
12323 -71709 -35312 -17204 -8775 10312 30074 34572 14434 -23274 -27467 -9389 12841 13457 38572
12310 38572 28594 22555 9185 898 5520 19505 20594 12884 24151 24049 35722 25825 0
12297 0 7317 13604 13510 907 -2244 -4839 -31478 -39506 -12024 -18157 -11434 -22774 -40794 -40166 -20836
12282 -20836 1496 420 -563 -24238 -10747 -463 -8436 -7022 -10446 -49132 -64149 -38502 -20868
12269 -20868 -10531 -9496 3544 1971 250 -21392 -2260 -316 -16885 -5980 -13366 -12159 -37427
12256 -37427 -44165 -36425 -25386 -24205 -56720 -35840 -36595 -27880 2633 3802 -11680 -21884 -14782
12243 -14782 -37806 -33822 -8831 -19296 -58449 -76052 -92887 -77547 -58672 -33881 -6141 11224
12231 11224 -39 21350 31927 19169 -1879 -12844 -11690 -26613 -29318 -13818 -27500 -37381
12219 -37381 -14388 6806 17006 25200 17246 1052 -10784 -13570 -11285 13289 29230 9536
12207 9536 154 5970 -432 -29 11469 -29022 -47801 -31663 -32504 -20428 -16085 10131 18822 3245
12193 3245 5897 9450 20779 13233 -11983 -14856 -33959 -4865 29943 49721 8699 -782 5084
12180 5084 -12972 -23018 14989 5635 16422 31959 49552 14450 -10471 -14911 -36610 -24760
12168 -24760 -4799 -12878 -25052 -34933 -22330 15592 -16684 4185 19175 -15957 -36348 -19701
12156 -19701 -25418 -46997 -30298 1310 -8835 -11222 1073 2398 -19522 -26668 -28847 -42790 -27085
12143 -27085 -24582 -11324 22018 27878 2276 11024 24430 1848 -16022 -31916 -13669 14099
12131 14099 43222 51149 50194 23310 -2275 -2842 -3 -19235 -25008 -12693 -15127 -51905 -79957
12118 -79957 -44677 -38501 -21175 -37760 -67297 -65473 -48754 -24381 -35790 -35036 -35252 -23628 -38917
12105 -38917 -55631 -37267 -31800 -29771 -31417 -19279 -25136 -29166 -20151 -15720 -21165 -20236 5217 -3661
12091 -3661 1038 34747 50298 11691 5082 28263 31964 11340 743 9032 7601 -10530 -10570
12078 -10570 -12979 -23987 -10461 867 14044 36729 43664 40576 25278 5521 -14640 -39369
12066 -39369 -17662 -16655 -4132 7060 5647 2639 -16328 -48236 -56558 -49729 -34671 17149 59062
12053 59062 61037 31525 -12910 -28685 -17836 -36095 -73337 -79457 -62968 -66284 -47877 -23987
12041 -23987 -24333 -31706 -31912 -15055 2071 -18321 -21492 -10989 6328 319 -12088 -25393 -27319
12028 -27319 -23496 -18445 -26865 -10267 -6609 -12608 -19987 -2768 -11017 -16927 -33582 -13019 -18484
12015 -18484 -26007 -22117 -6536 3094 -5815 -22420 -46110 -67314 -63105 -64078 -53097 -17407 -2004
12002 -2004 28108 48805 43712 14088 3366 -13545 9321 6933 3979 433 -5081 -27807 -46583
11989 -46583 -46728 -58176 -51675 -26915 -41027 -21814 19798 34551 56751 69352 40312 17179
11977 17179 -5199 -43481 -40617 -75058 -69345 -40299 -8564 -12088 -28773 -60325 -62832 -64492 -29796
11964 -29796 20557 44410 42999 16317 18756 -13971 -33929 -26592 -46856 -23639 1326 916 -7555
11951 -7555 22405 4380 25371 37460 14654 22410 27182 27912 3336 4529 -8102 -8187 -528 -30070
11937 -30070 -24694 -11039 -11152 -464 -19711 -10717 559 19708 -407 -15136 -37201 -17097
11925 -17097 -4956 -18043 -24442 -27103 -18980 -28184 -32168 -23466 -5953 -16304 2148 20229 9065
11912 9065 16100 11534 -3874 -6457 8661 4182 -9000 4930 8596 -4294 -17958 -44992 -22506
11899 -22506 29153 45177 38730 38764 25022 9006 37104 40374 -1494 -12506 -15908 -10027 -22225
11886 -22225 -4411 38041 30899 17808 21878 18514 17670 19792 24312 1670 -2689 17158 35069
11873 35069 45049 27226 -1618 -21078 -2761 -26672 -40824 -51361 -553 20412 13634 -1200
11861 -1200 -11165 -7286 -5989 15848 23264 -2516 -17408 -14635 -46013 -73361 -34237 -3927 2075
11848 2075 9293 5075 11722 -13388 -24272 -35000 -20730 -27482 -20888 7931 3086 10164 10089 435
11834 435 -8693 -54953 -61164 -19655 -17495 -5974 20848 22793 4496 4590 -28288 -51650 -42262 -28091
11820 -28091 -55639 -39814 -33140 -54321 -72214 -26338 16560 24428 14484 -2661 -10201 6234
11808 6234 9358 23035 5782 4954 -13111 -55 9997 31285 18705 -15238 -51786 -59632 -38874
11795 -38874 -30360 -9910 -12552 898 17487 23464 32301 39264 18534 -441 14902 -13660 -21429
11782 -21429 -15312 -20183 -17561 -9618 -35502 -42062 -48859 -28512 -8679 -20937 -65349 -37781 -22462
11769 -22462 -41605 -38548 -23701 -5349 8944 -2246 -12161 -25561 -25043 -26340 3995 32492 34958
11756 34958 -4370 -21270 -15695 -4668 -42049 -71804 -61187 -46389 -6051 3451 3502 14331 20400
11743 20400 46358 34360 -8130 -14785 -7289 -18639 -24723 -25296 -23389 -16091 -9432 2859 -8321
11730 -8321 -41249 -37503 230 -5594 -37300 -20927 -33282 -28648 -37513 -60989 -23849 32502 55896
11717 55896 47734 27849 13500 15897 8846 12434 -2285 -44790 -75248 -82288 -76116 -60321 -47317
11704 -47317 -48441 -49645 -19594 7667 -18364 -28667 -22952 -11403 17223 201 -19859 -33112
11692 -33112 -47406 -58994 -34936 -10046 -2731 8452 16213 15713 1849 5502 32 -13995 -11836
11679 -11836 6165 6352 24732 37365 18268 9345 10789 12193 20326 -18147 -23579 -25253 -24522 -2137
11665 -2137 -4737 -29918 -13093 11388 -3985 -43880 -71805 -59948 -57853 -36825 -10369 -4771
11653 -4771 7833 20777 8188 -19137 -22639 -42627 -60158 -28901 -12401 -5356 -13516 -21976 -33226
11640 -33226 -63529 -53191 -17375 -11250 -2312 -24541 -14514 271 6932 11780 5921 9600 33787
11627 33787 24046 2076 -43887 -58457 -40900 -4683 25865 -9234 -18324 -29377 -34782 3469
11615 3469 10891 40161 32988 27076 25019 21086 34380 57849 55754 44402 22395 -13675 -30547
11602 -30547 -29525 3688 27368 64766 49785 49430 44311 35461 1834 -10566 -21874 -15215 -26403
11589 -26403 -18716 -9357 -3184 10160 3949 -10934 29550 46612 43727 33107 24553 -377 18048
11576 18048 22374 34948 13150 -16057 10137 38317 38766 15364 10332 4089 -16233 15451 382
11563 382 -10160 -527 24591 17890 18175 20757 23054 20385 24378 35742 8690 -10700 6250 35906
11549 35906 13181 -38890 -14749 865 -80 1603 -583 538 -6091 -14714 -39842 -44369 -34811
11536 -34811 -47339 -47497 -20174 7165 -10255 414 -12445 -12721 17400 22762 24654 -1316 -4020
11523 -4020 -10511 -17930 10170 47610 40815 -781 -12182 -14320 -1308 18100 -7378 -28463 -19393
11510 -19393 -26401 -49901 9325 55455 39351 26134 140 -24176 -44764 -64313 -67626 -25956
11498 -25956 -1775 -43924 -64959 -44192 -30845 -62907 -48694 -17603 18634 47147 27818 12385
11486 12385 17868 -15864 -12424 -7228 -15516 10925 16828 -458 -20428 -15788 -7009 -8457 -25792
11473 -25792 -20530 -10499 -18277 -34454 -26053 14639 23480 10978 -2813 31153 75041 42257
11461 42257 9682 -2350 -22844 -17756 5872 -5367 13206 69210 54799 36824 30546 -4382
11449 -4382 -31792 -30544 -19335 -32472 -27623 33185 72016 57215 34714 14378 17724 30241
11437 30241 16810 2552 844 10493 24965 23198 9073 -3955 35211 46992 25903 -13828
11425 -13828 -55318 -47228 -42799 -24901 2777 17977 19333 6589 -18541 -21488 -17755 22112 47605
11412 47605 31807 19173 41983 31942 23356 30605 46165 46990 32234 51377 55180 48258 41646
11399 41646 51264 67788 54436 23328 40213 53496 49460 34249 5058 -14689 -1502 5047
11387 5047 12245 -10856 -38227 -36889 -18742 7094 -17238 -38234 -43020 -38777 -22400 -25129 -8162
11374 -8162 -25057 4175 22898 1756 -3998 -27026 -20162 -1035 7690 157 2716 28373 9758
11361 9758 139 1318 -5683 1086 2083 -3652 -80 45749 46932 34371 22682 -6054 -47035 -66002
11347 -66002 -81232 -71745 -37671 -21811 -38833 -38652 -38244 -16921 15594 -4172 2282 10782 16723
11334 16723 -267 18624 23057 15940 5472 -9704 -13321 -2860 -3718 -30347 -32743 -41437 -36538
11321 -36538 -27851 -71610 -50790 -12247 27540 35118 15620 -8235 13205 8680 -4583 1536
11309 1536 5789 -30917 -38892 -12810 -14869 -30944 -15734 10722 26678 18600 -5613 -20329 -32646
11296 -32646 -56508 -82143 -81371 -70757 -58065 -33452 -1601 -31408 -44071 -50588 -52513 -75252
11284 -75252 -79268 -57620 -42279 -61730 -86344 -85389 -51072 -25331 -12723 -24199 -11337 24516
11272 24516 24802 -9108 -2606 -35125 -61288 -69275 -37396 -43349 -60340 -57513 -41328 -19320 -14175
11259 -14175 -40431 -47299 -34043 -18260 -40972 -29345 3866 8089 984 13279 15156 36716
11247 36716 47242 22287 19760 26037 5217 -41150 -51757 -37563 -30033 -16900 11567 33064
11235 33064 6436 26163 39352 38262 17340 6794 -28519 -37530 -4829 34103 19294 9856
11223 9856 -11441 -15544 -22283 -48310 -65381 -31770 -16485 -16309 -20073 -17023 -15221 -34079 -18227
11210 -18227 -20512 -24506 -24343 -30448 -13799 -7096 -25948 -17089 -47489 -66122 -56740 -35291 -7350
11197 -7350 -863 -6214 9700 30164 66571 85797 57678 11437 15940 17243 -7268 -17277 -25676
11184 -25676 -30225 10424 30135 21633 12174 -7129 5444 -4694 -1513 39868 63172 51191
11172 51191 17521 463 5041 20835 11996 888 7 -23487 -2088 40167 33976 12798 22549
11159 22549 52136 53412 30303 28756 5107 9857 21209 1113 -2243 -16372 -46342 -49413 -32942
11146 -32942 -29423 -17689 -23777 -15627 -7742 -6940 23404 37386 29209 14190 22364 41379 29475
11133 29475 41306 30659 17710 -16980 -44298 -52694 -48900 -33362 -41245 -66492 -45846 -32104
11121 -32104 -51357 -45431 -25726 -9162 -25309 -35918 -13942 14257 4286 -16030 -15376 -20216 -25442
11108 -25442 -37109 -15599 -19473 -35068 -13775 11246 -13244 -71709 -67657 -47165 -31474 -19283
11096 -19283 -12270 -12457 -18876 -14547 -16586 1062 17069 13392 -677 -344 -8231 383 13589 21474
11082 21474 46506 21465 20835 15844 -12633 11504 40712 63915 57925 16992 14782 15609 -4410
11069 -4410 12183 -7771 -31408 -10596 21586 3688 -21749 -44195 -28514 -17444 -13105 -9795
11057 -9795 -16063 -20808 -2546 1174 6493 8815 -7353 -10722 -20079 -16237 -13859 -4491 -2290 19372
11043 19372 -18174 -27001 -22690 -17509 -18651 -4637 3799 -30109 -28875 -16584 -21050 -24993 -9103
11030 -9103 -4942 -9651 -19115 -17058 -18709 -26500 -16410 -2828 99 -9713 -6650 10283 17650 15971
11016 15971 39925 28136 11874 -13160 -18204 -29333 -12138 -2151 14012 -5159 6964 28184
11004 28184 16925 -8286 -24174 -16421 -30677 -43587 -21136 -21593 -36784 -66657 -63786 -92949
10992 -92949 -93057 -48474 -16579 -17135 7953 226 -23975 -27618 7122 -3911 -40887 -73319 -52661
10979 -52661 -37710 -32985 -6293 18332 38614 32267 7164 -5531 -5931 -41074 -71113 -51264
10967 -51264 -43486 -36727 -26819 -23393 -7965 -15322 -17561 -19927 -30478 -22890 3828 19085 23467
10954 23467 16925 -4851 -13564 -15595 -29572 -13586 -5895 4707 -5018 13964 20588 24927 25241
10941 25241 12370 -5229 -10524 4817 9326 -14759 -17395 2871 -17083 9167 -2235 -773
10929 -773 17987 -727 -10743 -1414 5774 1476 11079 18238 22190 38406 36130 18737 30237
10916 30237 48089 55265 23057 807 14155 62071 63253 49083 9487 -37754 -41288 -36985
10904 -36985 -32437 -43172 -17941 -3452 -20982 -25867 -16289 1120 22866 30684 7596 9194 7976
10891 7976 22362 13741 23872 9524 -35101 -6782 -10159 -18663 -2330 3814 6268 25559 4303
10878 4303 -20397 5709 23127 13027 7459 11699 20133 41120 52380 40274 22224 9879
10866 9879 8723 9393 25717 28762 15261 -2663 -8196 -1243 8334 17533 41867 35564 21104 23404
10852 23404 40599 16809 -10404 31976 40348 26524 -6670 -3608 12964 28307 45386 53567
10840 53567 36630 8186 -1664 -5056 11038 19190 14893 42611 70883 64263 34600 -6307 -12105
10827 -12105 -1998 -13086 -16797 -393 1274 -17599 -9528 -21483 -37130 -54967 -66782 -53629
10815 -53629 -18668 10898 27789 19923 24393 18946 26832 6903 17748 35130 22006 18996 21561
10802 21561 51702 45406 26038 38051 40686 34986 9462 11225 -7976 -10831 19737 22968 34559
10789 34559 27499 32572 31692 16128 35252 65549 62486 14153 -9077 13161 38872 50244 29345
10776 29345 32315 19902 -3175 -9794 -3380 1962 -23920 -32363 -30689 -9852 -73 24135 52144
10763 52144 61021 54599 25339 22930 66570 86719 47303 40927 30215 36772 14127 12146 45443
10750 45443 48760 53944 52380 17027 37638 62863 50199 13392 16811 -19990 -73330 -90340
10738 -90340 -59510 -34592 -52454 -67083 -48455 -55858 -37135 -24756 -25970 -126 11943 9642
10726 9642 -8325 3623 5420 -20945 -25145 -11433 -12399 -32143 -18865 -40399 -38680 -5559 16699
10713 16699 -5308 -5033 34149 45604 27333 21577 32582 46465 44976 35587 12823 20143 14975
10700 14975 26678 47656 42954 39712 13408 -752 4158 -1088 -15151 3531 1246 9963 6370
10687 6370 1704 6466 383 -9155 -9203 793 19188 10723 -27458 -2214 2621 8372 18359 41544
10673 41544 48988 37564 15889 -3097 -2178 4286 12265 33180 45434 24541 19101 -18993 -20826
10660 -20826 -19809 -29278 -5966 4244 -897 4451 21851 44396 72498 65120 40630 47191 36677
10647 36677 45995 46964 27405 -12216 -27109 -22457 -13231 2142 10410 22128 -4571 -27485 -8950
10634 -8950 3088 10418 29974 21106 -6476 -29179 -49061 -36971 -21131 -23946 -26915 16653 40775
10621 40775 45996 47759 40270 34981 26010 38224 35609 19557 7108 37697 18242 2629 -16908
10608 -16908 -23595 -25255 -28520 -32514 -35421 -26823 -3797 16258 48796 28181 -9043 17122 39233
10595 39233 26873 816 -35574 -30601 -16954 7320 15008 16155 -834 -617 22262 46447 27066
10582 27066 8264 12920 44114 45136 27921 5394 -18447 -36328 -27852 14578 19524 39059
10570 39059 40719 13884 -24395 -32594 -7759 8058 4289 4776 -9086 -6036 -3352 14316 6024
10557 6024 25929 56511 43808 19112 -10869 -12946 7853 34073 43567 66673 46757 -18356
10545 -18356 -21707 -19557 16624 3097 5400 17175 -18857 -27363 7987 32572 8454 -27567
10533 -27567 -15284 -6200 28802 16075 7276 23655 -1219 18196 31783 43614 11779 20336
10521 20336 14290 11619 -44 11295 21129 18720 27970 29066 21339 53657 42250 17304 27663
10508 27663 40394 -1370 1109 -1427 -9643 -7738 -18660 -40246 -26544 -2972 -9588 4708 48424
10495 48424 70176 62937 52708 37923 42877 36617 38957 34823 48246 60767 35611 34009 52836
10482 52836 26186 -333 -35960 -19138 -5270 3294 -18995 -1690 -14752 -11652 32952 30621
10470 30621 -1498 -27252 -42600 6186 48723 47865 34739 7945 -9897 12983 46395 52913
10458 52913 -1588 -13571 -9810 -6665 -5074 66 11169 32035 48792 35205 15022 16189 16161
10445 16161 11416 -8928 19248 12866 6500 -3066 3760 31307 45107 33828 11614 12459 31638
10432 31638 38169 50222 47456 41205 20283 33559 26582 -88 28079 73283 81831 90679 58176
10419 58176 50477 46325 29033 13958 -1620 -12216 -20759 -6035 5919 -4127 -4247 8013 31393
10406 31393 60490 64485 62748 42492 42542 53658 66560 63125 52895 25323 31955 49540 76117
10393 76117 88491 41701 28885 15122 1595 5368 28551 42256 51570 33133 42536 51286
10381 51286 36443 27682 28271 16328 -18291 -27698 4474 -5728 -26732 -13793 40331 63847
10369 63847 45343 15483 18432 52709 108907 130495 117164 120610 103694 65899 52275 37970
10357 37970 35772 43160 31842 20197 32975 56284 53215 28983 24592 40989 38873 -6998 -15044
10344 -15044 28402 63561 73200 41245 53421 86717 73093 91162 105171 116641 102983 72849
10332 72849 62534 94903 102891 74848 62944 57713 32078 55202 40579 29016 42452 29514
10320 29514 29557 77053 64822 38110 57317 92891 78174 78313 99409 115823 107390 104202 99390
10307 99390 117887 84054 53859 65418 96931 97173 90522 64025 59724 47442 13370 -1294
10295 -1294 285 33201 42144 41533 37606 35164 53883 69813 79027 69983 67558 60897 45275 57109
10281 57109 82101 94104 104852 123435 135997 115739 124428 119649 103212 126780 127796 113010
10269 113010 79674 65300 82290 101833 104087 85748 109749 136005 156471 177801 149723 111328
10257 111328 106938 106156 111618 97540 88658 86430 63528 80014 114229 141517 146860 138252 119495
10244 119495 94960 56326 75516 109101 130585 150359 169207 142177 142826 145001 107518 112255
10232 112255 117620 118136 145330 152111 162763 187624 213128 193625 186698 181706 163704 167265 191280
10219 191280 236054 270015 255016 242525 218470 194730 223315 213899 211651 230092 232895 261751
10207 261751 257555 255823 234677 242201 243260 287275 337828 305875 246304 195544 207909 236701
10195 236701 232561 248001 277856 273753 276598 283852 269307 280691 287120 303277 301864 305808 313033
10182 313033 311958 318427 305508 277629 270780 285162 263125 245665 254360 279607 298574 302862
10170 302862 310684 305359 300401 315212 311254 323071 377025 441970 462907 432455 420709 408235
10158 408235 367698 357676 374541 371737 401881 414158 391098 398589 408985 391024 399484 404887
10146 404887 427261 445940 450865 445072 427570 457974 465282 467244 449085 442820 451862 442906 430079
10133 430079 442549 455773 493377 494443 479200 482769 486496 467762 458126 450981 466683 476561 493302
10120 493302 500341 496157 485045 501357 527839 526503 500203 516778 530878 547236 521119 514869
10108 514869 503342 502680 492302 498747 493715 483136 503031 535054 548476 541559 528751 526104 515099
10095 515099 521524 532644 552940 545051 550054 522518 478146 453645 463912 475926 454816 442529
10083 442529 433016 447036 482844 484702 471107 471438 466894 457938 469281 491733 526610 531593 540842
10070 540842 553201 538022 543693 522586 524558 520688 501019 478465 472382 482898 485133 463514
10058 463514 452930 413873 428580 420820 400891 427428 460667 447568 480142 517586 533444 493258
10046 493258 451037 425182 389425 385649 384878 373700 372037 345577 338956 319655 317154 318791 329400
10033 329400 332069 361093 350938 338762 329403 299326 262051 255591 279752 282605 287740 305590
10021 305590 305288 293921 294308 295632 303667 322655 340551 311930 283425 283844 282739 256509 247000
10008 247000 226920 206650 207566 229279 229967 218624 212500 179129 146793 143258 173108 199706 194854
9995 194854 181376 190964 208913 210831 214244 215635 196465 156504 125465 133247 144528 143334 145139
9982 145139 175770 169334 156154 159021 160467 146690 148229 153411 147302 130263 112779 137797 148050
9969 148050 137087 137971 127751 132704 164759 157506 172131 175825 159793 176677 148848 130853 109258
9956 109258 88746 98289 111972 120075 111702 117911 166053 162779 108117 91518 85584 77245 89254
9943 89254 99939 100886 93883 111845 141396 142072 139662 122308 124917 131220 162303 171578 161762 112170
9929 112170 101730 100590 102992 104305 103745 96290 94350 104378 99144 105734 111434 96803 72387 50236
9915 50236 56585 42021 35454 66367 72136 58170 56848 78403 86752 85852 97984 83039 70872
9902 70872 78868 64335 63628 63836 74227 100301 142132 163643 162203 140281 127743 115192 98861
9889 98861 81891 77009 83864 90599 101119 118104 81218 60105 38034 31782 67128 103644 84861
9876 84861 54813 47101 59691 61759 82845 88620 88064 100284 106296 97983 91109 67799 34369
9863 34369 45788 59727 57539 50470 76010 65637 76411 78126 57966 45882 66046 58812 72347
9850 72347 54461 56052 70266 69062 61722 35034 27867 54246 45989 49042 55516 35757 39280
9837 39280 68597 60411 41696 37811 42601 46721 50381 72388 40085 61502 86285 107546 123607
9824 123607 95656 103904 147426 147421 120540 112806 118051 130090 98746 61893 78377 113920 147890
9811 147890 155917 153973 180051 204817 242978 262406 284189 311332 356355 430835 523265 637121
9799 637121 802990 1077405 1493896 2134807 3065822 4611765 7481962 11796162 13168052
9790 13168052 10409704 7200761 4599642 2983387 2095144 1538491 1195294 950995 752605
9781 752605 610830 531109 444142 389994 368367 348114 300399 256546 224354 178248 177153 170487
9769 170487 150595 187079 200512 161747 147287 117317 108682 115259 146934 188242 183224 142494
9757 142494 133642 119379 84430 49521 22893 41834 65885 64451 73136 67742 68636 31835 48328
9744 48328 62534 69771 81472 101417 114817 102847 92402 76993 28089 7841 4672 9007
9732 9007 8877 5989 34640 52370 59383 84766 81726 79556 80573 60307 16534 -13044 -8335 8856
9718 8856 48526 42926 28137 8038 13553 17892 6046 7746 24952 23372 -13617 -29615 -30689
9705 -30689 -1196 47976 41232 38486 50833 57374 68599 47435 49662 35313 17691 853 -2379
9692 -2379 -20870 -6395 13095 890 -1141 247 -11631 -9495 -24866 -28515 463 11834 3806
9679 3806 6963 17957 4942 -5141 -15779 -41905 -72540 -85130 -42692 -24795 12433 -15587
9667 -15587 -19037 17398 42219 37964 24710 -6343 1752 -8227 -22874 -25946 -8828 8968 39271
9654 39271 34968 13605 4177 -18860 -42201 -38931 -6024 12707 37084 54034 44359 42430 46579
9641 46579 27038 20361 15148 24014 47039 76035 62001 46003 33774 27708 7454 -19551 -55549
9628 -55549 -48902 -43353 -42521 -10722 -3738 -18768 -29221 -33779 -43517 -14750 -23023 -15026 6615 24057
9614 24057 46449 54675 55755 43242 37289 32822 1341 -49876 -34906 -8326 7008 9205 -20053
9601 -20053 -60091 -56145 -30086 18392 36677 41192 39889 25458 29118 29513 31938 11563 -2966
9588 -2966 -20934 -27193 -17222 37905 38637 26454 49314 34002 27437 32216 44123 29546 27553
9575 27553 35380 32950 32377 49201 24770 4205 24662 17489 23807 -4505 -20373 -42525 -7189
9562 -7189 32692 51975 40242 26566 24601 21416 -14784 -12609 -13329 -7605 19511 31247 33364
9549 33364 38327 64505 72658 45347 32631 12297 8843 3047 -326 23314 41395 12153 -8284
9536 -8284 -6349 -3246 19505 7096 -9302 -10035 -25792 -42455 -47069 -18813 -9928 -11036 -25304
9523 -25304 -33625 -8332 -13077 -2230 18657 21297 21177 24919 29693 59276 62628 56672 58377 59292
9509 59292 44732 14092 16611 27176 16433 -1842 -4672 -17481 -34548 -27321 -46717 -49383 -32704
9496 -32704 -20423 -29137 -6408 10994 -6 -7639 -5986 -30615 -29641 -19772 -4401 16001 34526
9483 34526 30682 36996 40458 34129 41315 47119 20413 23729 59146 38318 4889 17632 4435
9470 4435 -4393 -2945 11592 -20060 -20749 -589 -5532 4623 -20186 -16696 -18447 -15080 -16004 -16046 -5049
9455 -5049 39532 45920 26638 19233 3743 -13321 20467 38891 19115 5805 -2715 8450 34109
9442 34109 15085 9710 4884 -14621 -17493 -3259 -1986 -25647 -48431 -44642 -28040 -24995 -19696
9429 -19696 -15010 -17624 -11533 -3923 -5496 -6390 -28796 -62153 -35795 -33590 -39239 -41456 -42970 -28183
9415 -28183 -4878 959 9765 3545 20476 44244 32436 12999 -4572 -8267 20254 25279 21189
9402 21189 -8930 -47921 -40655 -48125 -50857 -18652 1738 -10400 -14226 1286 5475 -17274 6652
9389 6652 18888 -6135 2737 12595 15167 15372 27032 21023 7464 -11906 10905 12678 -5875
9376 -5875 12480 31093 21337 27941 38304 5752 -10367 -18656 -39972 -21596 15247 34645 29865
9363 29865 25692 19402 28145 52851 56843 60100 77066 56050 4232 -24618 -12861 -21679 -27762
9350 -27762 -23922 -5847 895 19103 12910 -13711 -9006 2509 36047 58653 28410 11117 45021
9337 45021 63695 50439 8078 -14843 -32312 -14873 -7305 10202 17660 -4629 -11811 -12314 5484
9324 5484 3159 -8725 -15929 -9794 1196 14477 4603 -21600 -35397 -52334 -35129 -9036 16525
9311 16525 16798 -18750 -9806 11995 12510 30937 38945 55268 53173 38401 28134 19074 382
9298 382 -25329 -33668 -24295 -46723 -27327 -5887 -3292 15383 10301 -15881 -31482 -36233 -47824
9285 -47824 -17263 -5786 -2574 41881 34611 9929 4780 -12161 -720 5266 -26758 -9562 -5602
9272 -5602 -23433 -19295 -25324 -53049 -88632 -67309 -40238 -34971 -48337 -81824 -89160 -62995 -27309
9259 -27309 -8653 -7125 -22636 -23793 -33443 -48342 -21547 -9694 -7762 -24527 -13516 4420 -5092
9246 -5092 -312 12591 11483 25062 -1839 -6104 696 -2433 -4006 7708 5609 35097 62862
9233 62862 66967 52393 35751 32807 28850 18575 -20078 -29513 -43695 -33729 -18868 110 27638
9220 27638 20681 -10833 -37532 -32510 -9254 5244 14397 25222 41751 61045 66488 52992 58013
9207 58013 62869 34265 11216 -21405 -30063 -16919 -5396 5883 -18812 -29417 -28344 -34129 -38537
9194 -38537 -49658 -65602 -34540 2418 4370 19596 12354 -19118 -39859 -17524 6860 19689
9182 19689 -5250 -5853 -7866 -17699 -13980 -11785 -242 -13192 -28946 -6107 19421 59115 61073
9169 61073 55736 42345 33574 33341 706 -1243 -14111 -13894 20901 -6719 -26689 -12233 15357
9156 15357 31873 49909 4739 -19729 4623 22598 29703 37776 41496 47447 44857 39748 40353
9143 40353 44579 45893 22388 31809 42041 53004 19127 6560 22565 14833 5541 15535 13612
9130 13612 19439 2137 -3899 -20417 -29869 -14302 -11411 7331 5854 -2406 -4755 8297 18319
9117 18319 -5221 -24911 -7385 3021 -21153 -21049 -16724 57 -19693 -9426 21499 41201
9105 41201 36023 13450 -11551 1455 6741 23812 33599 20187 7900 -30265 -34104 -9037 23749
9092 23749 19165 -2882 -19140 -19358 -22862 -16149 -19462 -10109 12000 3738 -23251 -33005 -15825 1223
9078 1223 -9518 -34995 -33079 25558 -3984 -8371 9621 -15150 -19918 14602 12975 -7528 -19664
9065 -19664 -21841 -26317 4683 16138 19301 33880 10200 -10772 8954 25154 27393 35217 42156
9052 42156 28951 6660 -22914 -27565 -52931 -62465 -47504 -30747 18373 42114 34371 44244 61936
9039 61936 73828 45290 13395 -19628 -8465 12573 9595 -8721 -11 -15603 -10841 -4308 2892
9026 2892 44271 53857 15628 -8545 -7729 9822 -1485 -11341 2978 -4288 2498 22679 26876
9013 26876 7727 10252 13437 -1055 9467 27734 36875 54264 26768 7022 5197 22065 21051
9000 21051 22071 2031 -10518 -21915 -23707 -20001 -13938 -32556 -22724 -21738 -28208 -29322 -61032 -80055
8986 -80055 -68677 -53512 -21718 6622 -2212 -7973 -9967 3336 4417 -31661 -39206 -41257 -28689
8973 -28689 -19375 -12424 4209 14325 8341 -10878 -24661 -25150 -41445 -31524 -37094 -49567 -48878 -15388
8959 -15388 18397 32763 -3890 -39640 -21812 -30515 -32872 1460 -22834 -23349 -1920 22854 -4554
8946 -4554 -3926 -24812 -18607 -19314 -14889 4956 17535 -11873 -2884 13446 1029 12844 -11947
8933 -11947 -5918 -5887 -14854 -305 -3120 9887 38682 22999 -2664 -24976 -15909 -4900 -20538
8920 -20538 -53250 -57156 -21466 7883 29994 46284 46471 51687 10321 -12279 -13541 -33621 -25189
8907 -25189 -13340 7799 26553 31131 23733 11394 30088 14619 -7782 -23364 3639 15884
8895 15884 -10107 -14108 -3361 -12062 -26016 -5423 35735 56501 56606 30239 14509 26637 -2389
8882 -2389 -12426 7462 15226 -3690 -32699 -47035 -54913 -29156 -6901 -25027 -21519 -5918 18904
8869 18904 35862 38825 44600 23014 5837 30611 34894 28070 17662 14139 11565 -14611 -4547
8856 -4547 28653 27761 21958 30599 32566 22480 -1283 -14063 -28849 -11724 -23071 -12309 -7117
8843 -7117 -9519 -14905 -4370 13991 25915 44172 70969 70554 60491 23957 -14279 5635 9956
8830 9956 5182 31435 21412 23448 -2566 -36349 -22632 -11145 -6610 7688 6419 10237 13303
8817 13303 -7085 -16496 -22999 -19253 -30670 -3135 25644 4549 1240 13094 22722 11285 24750
8804 24750 41862 18565 17225 24067 43131 47087 8785 -16342 -10423 -20086 -33635 -28480 -25737
8791 -25737 -20498 -48917 -53687 -20040 16664 38831 37051 23809 18322 58552 72027 34182 11626
8778 11626 18457 28872 26465 9287 15039 47727 32141 30336 44216 72945 51378 -7679 1710
8765 1710 11328 6542 35979 64699 31904 15094 32778 52753 28431 2180 -19476 -28004 -31465
8752 -31465 -17959 907 -22282 -14677 -22384 -47168 -13029 -7223 -31258 -29009 -11351 6289 12277
8739 12277 14922 30989 20362 9367 35535 9341 1840 -9345 7967 -3915 16179 53484
8727 53484 77919 95133 103418 77146 48350 6871 -6856 9755 5634 -16034 -15128 -27518 -41961
8714 -41961 -42110 -45109 -39543 -46283 -30011 -42415 -6053 30780 1496 5355 16238 4265 30629
8701 30629 46832 8085 -19017 -25638 39 27475 20256 39305 61017 49202 8902 -9184
8689 -9184 -30609 -3292 17467 17571 -1372 -25799 -45037 -33353 -3728 16512 -3243 -17861
8677 -17861 398 33701 11792 13618 16876 -13682 -27579 -17816 -18446 -17698 -16851 3941 10824 6889
8663 6889 11110 17239 21541 12602 7684 22843 8037 20321 3287 -6099 -8724 -19214 -20357 -14592
8649 -14592 -12636 -8857 -11636 26928 27954 12386 3108 28251 21565 6283 -17968 -38525 -27848
8636 -27848 -16553 -49887 -62040 -40291 -39579 -52932 -43791 -18171 6951 -4170 15178 -4450
8624 -4450 -27977 -11263 -35583 -16888 -2265 -3139 7302 906 -4247 -2705 -2976 15534 44381
8611 44381 45642 26246 3411 7702 20887 13760 4880 15120 8685 13235 14833 -12450 -13866
8598 -13866 18802 37496 36127 24214 24959 54001 56349 32443 32182 42246 52748 57465 42886
8585 42886 29118 6581 -21447 -17956 34431 66103 85379 72018 46677 35904 14853 9846
8573 9846 26096 16705 -2518 851 37043 37541 21289 12774 37007 18791 5264 12261 23910
8560 23910 19184 -4614 -33507 -40169 753 -8410 -28222 -29031 -44342 -39633 -42850 -43085 -62833 -66857
8546 -66857 -60451 -46602 -10113 -28 -13287 9894 21608 -9552 3771 -10514 -46341 -22397
8534 -22397 -6029 -4773 5598 -9311 -14216 -4795 9379 12652 -13170 -20382 -23879 -21751 -13605
8521 -13605 -35785 -53630 -21299 2061 -4693 12689 42309 12923 33772 35306 -11156 -29952
8509 -29952 -30120 -27072 -40812 -52825 306 17753 24372 7260 17060 17986 8333 11437 -7157 -32787
8495 -32787 -26660 -16547 -19227 -22065 -56975 -95058 -74060 -45057 -37280 -19841 -2166 19387 15623
8482 15623 -3687 -44582 -26819 -9483 -8351 -6674 -7473 -9276 -29545 -21798 -8509 -1250 23676
8469 23676 6719 -4900 -6227 11892 -13772 -38354 -16883 39183 44057 11541 7583 3502 24830
8456 24830 3248 -15646 -24285 -26189 -15966 -12809 -45998 -66176 -26828 -6651 -3853 -5525 32331
8443 32331 44411 46431 48933 33332 25527 22559 11614 11005 2258 14092 28770 14700 33451
8430 33451 33250 30726 24485 39286 35030 44860 23919 3522 -2402 -556 15341 1960 -19660
8417 -19660 -14206 -20359 -6372 12827 29108 17444 -3380 -18425 -11949 -2133 24323 54312 23913
8404 23913 -18386 -11441 -6346 -21435 -39515 -10302 -19956 -23924 -13053 18813 20936 -2961 -40334
8391 -40334 -80280 -56248 -25194 -19951 -8144 33688 55283 53664 26009 9788 -6006 -12491
8379 -12491 17243 28886 12814 -2817 -23597 -31887 -33227 -17428 -5522 -8212 -11825 -23279 -20251
8366 -20251 2971 -3353 -14495 -43662 -20306 -2230 2553 -506 -12188 -11192 -31253 -16772 20364
8353 20364 22685 45124 56076 40928 30294 35172 25613 -10794 -42220 -44404 5404 -2220 -48419
8340 -48419 -29995 -7240 -11799 -24824 -13267 8375 7221 -22342 -18457 -26651 7052 30226 23567
8327 23567 16825 24862 11341 -6036 -27566 -31583 -40577 -41299 -34064 -42362 -40140 -39719 -31225 -7980
8313 -7980 952 3221 4180 -25739 -26855 -1352 16520 -21579 -32871 -38583 14523 44226 -11625
8300 -11625 -18176 -2790 -22232 -50410 -45020 -38811 -10656 -2128 21406 24855 5357 -16065 -11167
8287 -11167 -3397 -5028 -18579 -19829 -13079 110 -17535 -25724 -8149 14565 18268 15761 4950
8274 4950 -9664 11068 15557 10014 -3643 3119 -15755 -12476 5884 3573 -4240 12810 6634
8261 6634 -43189 -46762 -27568 -48931 -31583 14216 597 -11108 -13035 -24496 10798 16759 -8100
8248 -8100 1742 -6679 -6035 10319 -257 7450 -29107 -57995 -32421 -17976 -3769 -44 -10706
8235 -10706 -12150 -22162 -36935 -31654 -15413 -19198 2527 28744 -904 -27057 -36941 -14749 -18494
8222 -18494 -18588 31320 51332 50326 30030 3214 -6829 -10514 -53814 -65839 -51138 -43340 -43686
8209 -43686 -40046 -14134 -19484 -30127 -710 36706 65215 46692 49826 28883 -5059 161 21520
8196 21520 26766 -7679 -60953 -67044 -55571 -45797 -22081 -11 -11426 -22151 -11916 -13997 -24638
8183 -24638 -3332 5501 -4168 -26128 -35451 -18029 -20197 2099 4113 -11796 -4636 15193 37073
8170 37073 7191 -15112 -5878 13732 30493 20068 9242 3793 -18174 -33661 -21606 -43050
8158 -43050 -61942 -49380 -31581 -21187 -42742 -35763 -16505 -26771 -60016 -61300 -13517 28694
8146 28694 3835 4811 -4706 3144 -19872 3618 25337 655 24224 26584 21403 -2973 -3300
8133 -3300 17877 36376 65423 70729 44586 12111 5664 -7560 -31037 -39874 2784 -27504 -58862
8120 -58862 -9427 14957 13666 10020 -1886 40452 57900 47179 29276 -5454 -9266 -11124 -17528
8107 -17528 -8290 -27052 -30553 -38146 -15444 35282 50419 44155 13348 3350 22559 9552 -20195
8094 -20195 -21462 -6405 -9474 -6214 -28017 -29522 -15039 -32439 -11171 8738 -9936 -46936 -49458
8081 -49458 -13562 13998 23287 -3945 5517 25204 16200 9232 11307 22811 23591 3353 -2817
8068 -2817 13738 26808 16980 3444 12218 11698 -7191 -6315 -19071 -42316 -44439 -28577 17013
8055 17013 1349 -34339 -89760 -94528 -53272 -23867 -13136 -2672 4872 -18538 10095 15749
8043 15749 -8635 -13074 -90 -3002 -1683 26670 10032 -12964 -23595 -68738 -66592 -78320 -71468
8030 -71468 -51807 -38511 -17319 -4285 -14906 -29835 -53111 -68788 -30009 27849 38493 29437
8018 29437 21414 28510 24820 24065 26620 22297 -2573 16007 50537 19533 -4738 9158 5186
8005 5186 -12113 27898 69460 55672 32355 33946 46200 18844 4918 34371 19475 17223
7993 17223 -6381 -27157 -14903 -15776 -25005 -48784 -38400 -33946 -36423 -21462 -17107 -23959 -32796
7980 -32796 -38170 -38709 -17437 38082 68078 36476 32662 -282 21060 52535 50608 33907 19386
7967 19386 -13229 -28338 -13468 -8739 10444 7574 16387 -8594 -14048 -281 35311 60754 34350
7954 34350 11571 24161 71029 57456 14830 7182 18904 21753 40255 21568 -6219 -11914
7942 -11914 -8554 -331 -30512 -21288 -23559 6785 -7791 -14180 -20820 -9431 -30592 -43859 -40674
7929 -40674 -2046 15537 -4487 -5660 10935 -19367 -37259 -36260 17024 55813 39914 -10603
7917 -10603 -24784 -23011 -21582 -13324 -1780 6933 10393 26599 47196 18993 -13800 -22100 -13874
7904 -13874 1467 26472 65295 91690 58014 5239 -15665 -22878 -4559 6643 -17029 -51366
7892 -51366 -53259 -32588 -28543 -11339 25342 17110 32524 28645 -845 11150 20058 -2640 -24925
7879 -24925 -20164 -30483 -3243 17507 32338 24698 4684 6924 12851 41055 36481 4347 -5109
7866 -5109 -2301 10524 27409 -5581 805 41720 72217 63186 48594 51327 55812 68648 7958
7853 7958 -24808 -19290 75 -33292 -58729 -50201 -44426 -45895 -47982 -14397 15827 2254 6600
7840 6600 22139 57136 32932 15816 1480 -10736 -19571 14004 9758 -57 12881 17759 14407
7827 14407 5551 30952 36321 13444 4112 10078 31392 37296 12692 -5330 -7935 2079 -9047
7814 -9047 -11111 -10328 -19795 -38038 -69795 -81705 -37977 -19039 -43857 -38606 4865 13336 -2207
7801 -2207 -2552 -19806 -46419 -62423 -68102 -42613 -1890 -15203 -31477 -40161 -69799 -91796 -79720
7788 -79720 -10919 -3410 -1384 21520 18476 -635 -37611 -57489 -45712 -5350 1239 -6075 -41483
7775 -41483 -39212 14021 69087 39009 -4353 -18800 -25946 -13099 -4675 -10248 -20022 -1681 687
7762 687 -4616 40659 85830 85571 44281 2434 13820 1096 -14010 -3593 -12436 -36519 -59922
7749 -59922 -31051 -2977 1239 -16203 -25671 -16309 -34515 -52574 -56407 -53032 -27801 -30301 -61385
7736 -61385 -40202 -9829 -825 -5039 7008 3485 28198 12900 -18271 -13199 -12016 2956 -651
7723 -651 33938 6664 2907 25715 16979 9831 16742 -434 3209 13803 22585 15741 5606 21477
7709 21477 13207 2085 -20886 -27166 -9308 2598 17154 21082 19593 16345 -1006 5101 9532
7696 9532 2741 -13965 22951 39395 26967 4416 -8188 -4697 -32242 -47729 -32173 -24789 -26946
7683 -26946 -27652 -20769 -10682 -4064 -17834 -12925 13296 5226 -22662 -40866 -56705 -51893 -15155
7670 -15155 5595 -35559 -26818 -10401 -23801 -19043 -31167 -35030 -45317 -70959 -56322 -36968
7658 -36968 -24621 -25588 -40863 -3563 14564 377 -16684 -7605 -18687 -30907 -24949 -25748 -9531
7645 -9531 -25261 -28717 -17798 -24208 2485 11603 10159 -22102 -43517 -21796 -23134 -10540 -7384
7632 -7384 -3201 -19153 -40167 -41466 -10573 1443 17077 53499 46845 17002 12344 12105 -13251
7619 -13251 -10033 -12672 -22342 -31999 -23032 -14483 6627 32453 50399 48883 53853 51953 37579 35569
7605 35569 18229 -5592 -1771 -9656 -13854 -8883 -1746 -9634 -21005 -16098 13474 39321 -2772
7592 -2772 -26602 -51839 -20417 -22800 -39415 -50651 -21001 -19923 -39375 -49918 -26330 -8310
7580 -8310 4979 17973 33031 31725 16400 3556 -43006 -34899 -20489 -33352 -25743 -9768 978
7567 978 14410 10115 34380 34848 13459 29946 15138 10864 15917 -1295 6549 -15777 -19585 -20379
7553 -20379 2843 8592 -11671 11779 28481 4172 -19399 -27403 -19628 9086 -13611 -2209
7541 -2209 -6590 -10628 -8891 -11789 12871 -9262 -20756 -15739 -6101 -13599 -22715 -4232 -4077 -12090
7527 -12090 5390 -10144 -9144 -4825 -22446 -39028 -15463 -18356 -29273 -15386 -17159 -24578 2786
7514 2786 -2510 6930 43870 17231 -29117 -55964 -61347 -53198 -39682 -34212 -11399 11605 -2156
7501 -2156 -775 56 -26867 -33695 -47533 -35222 -13007 18072 20389 48319 73263 28050 -19536
7488 -19536 -11440 7309 -431 -21058 -39614 -8050 12037 17137 -2472 -8020 -5394 11290 19884
7475 19884 31981 22554 -4538 8790 56459 52160 57990 50069 51957 28073 13671 -7659 -16285
7462 -16285 -9266 21534 29756 8141 -4633 6163 -10903 -23707 -5502 18399 -253 -9368
7450 -9368 -19460 -13452 -37028 -32155 -4762 10812 17490 -623 -1046 -9688 -5282 11772 37431
7437 37431 27059 13893 21453 28644 -3094 18743 34063 34889 19799 -17990 -29432 -27795 -25503
7424 -25503 -12295 -24256 -22403 -21082 -59458 -42542 -11008 -4227 -29358 -44604 -46930 -27396 -7142
7411 -7142 -9427 -42423 -43211 -21167 -20713 -23154 -25578 -47764 -62966 -40900 -41892 -21033 22126 -641
7397 -641 -4101 -8814 -5313 2566 -24439 -38292 -32704 -28059 -24320 -17845 -3685 28373 56140 49103
7383 49103 10774 -7839 9181 12399 -4182 -8505 -10359 -32929 -53308 -47199 -22907 -11593 -19254
7370 -19254 -27328 2 7984 4773 -16353 -49813 -73307 -86059 -58430 -25162 -8976 -16986 811
7357 811 11245 6692 6292 -8793 -11723 -9546 -22731 -33891 -38643 -28865 -29403 -35943 -7349 -16075
7343 -16075 -43312 -35839 -21502 -21805 -22194 -21857 -10452 8347 5585 -30671 -18793 -6963 -21045
7330 -21045 -36605 10209 24662 16560 25246 45754 59845 91045 74470 40945 35523 -5569
7318 -5569 -23512 -8905 -20728 -32363 -23548 -2787 -28275 -41415 -21571 -22358 -40149 -48289 -16624
7305 -16624 10806 -4713 -10093 -10474 -19344 -36158 -26744 -25524 -12880 3871 -7485 -16804 -33803
7292 -33803 -16196 19023 18409 -9808 3063 41532 48005 25036 11451 -2272 -29493 -43727
7280 -43727 -37345 14627 40893 9167 18677 38061 29981 3682 -7032 -41279 -38256 -11168 9037
7267 9037 16009 15294 14488 -8149 -32876 -37241 -27980 -21697 -18469 -31221 -51733 -57689 -48302 -59975
7253 -59975 -57443 -40921 -20829 9665 13751 -16049 -16071 1347 3498 15799 -5081 -10024 -35382
7240 -35382 -43405 -3256 20130 7813 -13095 -56171 -50238 -35783 -41006 -26332 -12441 16335
7228 16335 18727 -19864 -48048 -50898 -56425 -52884 -21841 -8056 9303 -11816 -25742 -17364 16185
7215 16185 37797 37776 50215 61535 57336 52737 34172 33131 34893 29703 11824 13561 205 -23456
7201 -23456 -34382 -23578 14148 39880 23145 1520 27260 17827 43154 31493 24230 17705
7189 17705 13631 28143 13552 422 -8167 -8640 -24187 -35346 -6161 -14135 -11978 -168 -17228
7176 -17228 -50096 -44171 -37025 -19194 -18448 -44216 -31608 -42153 -47230 -25158 9001 11970 13757
7163 13757 16478 14533 11314 -4184 -10308 -1284 433 12952 18148 11855 19563 42535 32998 21598
7149 21598 37196 38562 29239 7397 2886 12075 22365 22668 -2899 19062 24796 32119 55065
7136 55065 54979 19428 17197 877 -19072 -19365 -18924 5997 13079 -10556 -6736 -12856 1406 11915
7122 11915 -1491 -37423 -59197 -43249 8458 26714 24931 3407 -15684 -27121 -16140 -7073
7110 -7073 -25898 -39807 -10358 -5745 -22673 -23562 -29127 -5161 11523 4399 10076 12341 -7339
7097 -7339 -27112 -39758 -38581 -16771 -16467 -22056 -21337 -12281 -36887 -56668 -41898 -22386 3256
7084 3256 29644 14411 -2873 -27655 -19166 -9291 5894 9750 20658 -1638 6540 14346 -7258
7071 -7258 -14975 -11285 -37419 -62694 -52232 -12587 -33476 -43786 -36905 -17088 -27971 -60679 -45035
7058 -45035 -17426 -14409 -30857 -29069 -34484 -29760 -30306 -17743 -6307 4883 -19973 -17346 852
7045 852 -22746 -32571 -28208 -16315 -21846 -13187 4377 26035 38926 20464 5657 -2080 8829
7032 8829 -6477 -44543 -38982 -28464 -37050 -25796 11940 27824 23895 15838 13633 34729 12266
7019 12266 -27863 -30592 -41197 -40359 -43960 -30715 -8999 12414 29121 16484 -27592 -43327 -32923
7006 -32923 -34513 -39123 -26994 -24506 -1990 15038 25200 -7385 -16334 -12539 -10418 -35510 -52182
6993 -52182 -69337 -76323 -94859 -94856 -97203 -81599 -56523 -39975 -52331 -46271 5762 -2543 -5228 -10510
6979 -10510 -12207 3233 521 -4960 -9018 -3544 8871 -4075 -33963 -6083 18948 16200 8375
6966 8375 -3603 -21493 -35171 3585 34697 38460 17627 -14818 -21259 -15592 -21212 -14182 -35668
6953 -35668 -41792 -23808 -11775 -9482 -8654 -34428 -35169 -43245 -24028 -31528 -41653 -43726 -47341 -27717
6939 -27717 -15401 -26189 -31386 -45480 -36969 -13632 -18439 -21616 -20055 -13049 -5779 -13548 -6029 21660
6925 21660 40170 39916 35417 38622 24198 -14546 10111 32266 32312 -1303 -30499 -37954 -27774
6912 -27774 -27719 -29171 -21756 -20898 4204 26402 37369 46006 36641 10871 4368 -17646 -32473 -35447
6898 -35447 -2666 10190 -1062 -11385 964 18577 37782 43862 12980 -21202 -24542 -42518
6886 -42518 -32359 -28781 -38791 -41291 -39092 -26024 10210 13915 9582 10802 7072 1420 -5984 -855
6872 -855 2450 -19037 -28209 -26733 -30929 -45286 -32676 2092 20552 18534 -2416 -9785 -47478
6859 -47478 -42318 -31558 -13488 -4139 -4526 5397 8627 4849 -24747 -23074 -15806 -2831 -20117 -9668
6845 -9668 16018 28031 17305 27884 52831 39924 29210 32535 7393 7575 19331 17780 5836
6832 5836 -11473 -15172 -30759 -33618 -33154 -40500 -39268 -57575 -47011 -33762 -22890 -28531 -23474 -28129
6818 -28129 -29455 -17513 -19469 -21604 -44403 -21136 -10210 -12653 -20467 -1359 9536 -15140 -13019
6805 -13019 -9674 -11649 -7850 9354 3353 -1042 -22606 -27985 -17029 -7293 -9771 -11254 -22077 -7852
6791 -7852 -8704 -24099 13042 -7760 -43451 -44230 -11649 21417 37408 9828 -1537 18355 20849
6778 20849 17809 21889 34979 39194 11399 -3133 -14673 -10521 -5261 -2457 21189 45214 39834
6765 39834 28214 46134 22869 14755 6264 41881 43432 727 -5117 6320 -14944 -56845 -58176
6752 -58176 -39886 -20367 -16748 -12830 -27946 -44596 -58722 -19256 7736 -8483 -21408 -30198
6740 -30198 -134 16625 -197 -20344 -17526 1238 9133 -3257 -48151 -55198 -631 43471
6728 43471 33933 -6232 -24160 -12219 11183 15493 36637 65566 109163 110599 126748 150383
6716 150383 159962 132053 128409 115259 90235 98685 99101 45859 11387 12329 6314 -8505 -39946
6703 -39946 -55269 -55491 -25312 17730 -10675 -65544 -51868 -43244 -59363 -52678 -30629 -21039 -75059
6690 -75059 -99758 -92653 -77879 -36527 -34394 -26261 2352 17386 -8527 -20622 -28713 -46667 -35144
6677 -35144 22042 30478 15953 4526 23081 39222 24334 11482 -12588 -24839 -36207 -39899
6665 -39899 -24457 24633 56739 63541 19591 -2720 -9760 6835 4948 107 -15032 -23871 -25352
6652 -25352 -30171 -51000 -13915 -12312 -4208 40545 73836 38470 37348 59069 55820 28421 28140
6639 28140 17519 -739 -835 9659 2745 -2437 2232 18312 28793 -8789 -44281 -60522 -35606
6626 -35606 -37061 -48413 -28663 4220 10329 5036 -2218 -7124 -20355 -32043 -15696 -34355 -38414
6613 -38414 -41588 -41266 -22308 -1565 19678 6939 -24066 -30280 -6277 -14981 -48267 -35121 -3484
6600 -3484 7217 -12807 -10177 -1276 -20279 -27628 -8638 -24057 -12496 8122 29531 30621 -365
6587 -365 -42373 -59849 -57594 -1996 22592 7574 -22124 -21632 12245 35793 52029 4795 -3430
6574 -3430 7269 -5595 -26490 -5136 3384 13465 1886 -22441 -17102 19356 20935 13753 -3235
6561 -3235 -15544 11715 23332 6093 -909 -11272 -25563 -37765 -45636 -49260 -35541 -18581 -3479
6548 -3479 -5943 16200 31221 29958 12646 -8975 -6674 13792 27781 66470 53802 30704 -17678
6535 -17678 -9920 5588 12904 8291 -15922 -15966 -8787 12502 -6473 -50517 -55828 -59792 -74811 -45614
6521 -45614 -13242 -13129 -34815 -24776 -2973 26835 -224 -14311 -10687 -5811 17668 -19776 -63085
6508 -63085 -65112 -35587 -29952 -19168 974 12492 29175 42406 29696 9885 -6651 -18898
6496 -18898 -29773 -31424 -42902 -50869 -30761 -8068 7874 23735 14753 4185 1790 12726 5127
6483 5127 9006 20270 -5313 -52496 -53760 -66667 -19063 10074 21250 25406 19559 50561 76287
6470 76287 56086 17987 -4447 -40176 -49037 -24507 -19735 24002 53806 51371 39066 3231
6458 3231 -13943 5906 20521 26043 -18223 -4065 22923 14077 -27126 -21255 3580 -13999 -10718
6445 -10718 -4884 7379 26948 48345 46413 8289 -11450 1738 10627 270 -33494 -24095 -12996
6432 -12996 -15012 -28988 -4058 4619 1999 12164 -535 17319 28815 5311 -4860 -6724 -23554
6419 -23554 -3141 -8209 3112 21799 19600 -11963 -29464 -20122 -19196 8833 67314 71557 24652
6406 24652 -10770 -11362 5035 24759 8060 -15847 -2026 5636 23256 59526 25304 1535
6394 1535 6290 -1345 -9816 -23313 -5502 6911 13144 10265 18856 16075 21684 17925 -2687 -34899
6380 -34899 -60763 -46407 -8841 3023 19094 10497 28972 24265 10696 -8634 -33670 -39624
6368 -39624 -15323 -29786 -45786 -30029 -41545 -45394 -41231 -21461 -14551 1380 -4904 -17813 -8
6355 -8 -29399 -4411 3993 3795 7201 -19879 -8618 6447 -7129 -23204 -10202 1168 -10003
6342 -10003 -14899 -9177 -1403 24593 15018 -24903 -23463 -4600 -9990 1589 2992 18941 -7359
6329 -7359 194 -9876 -16456 -247 32918 25321 9890 -9731 -21305 -5777 -22767 -28927 -32934
6316 -32934 -33312 -4830 6548 13717 -21612 -60332 -40441 -8235 16023 16110 23758 4204 353
6303 353 -8296 -37822 -6162 4662 17680 18142 10770 16019 24159 46442 38299 19211 -5757 -15750
6289 -15750 -38353 -38188 -21623 17264 36144 20183 13482 35239 59052 52506 56664 44962 34133
6276 34133 -7780 -2106 23864 23852 16212 556 -22008 -3901 14242 -162 -26354 -59929 -59491
6263 -59491 -53961 -72062 -88979 -63060 -19645 -1483 -2597 22399 51006 23322 29199 50401
6251 50401 37215 18740 21471 3682 4912 -19976 -33489 -5104 -8022 -2061 -31256 -48495 -26081
6238 -26081 -5929 -19544 -11958 -14079 -23048 -31793 -24873 -25943 -26477 -39756 -43985 -27082 -5927 -1543
6224 -1543 2981 29384 52823 74100 55892 22567 -13827 -41419 -27282 -15448 -9710 -31152
6212 -31152 -19396 -22052 -69558 -82006 -44227 -22142 1420 -6982 -17179 -12463 2160 11317 18833
6199 18833 20787 20772 11997 15255 33875 31043 11966 -4923 11561 13132 3170 32818 38972 44997
6185 44997 28861 17779 7908 19474 40195 35266 51657 46165 37967 58100 36659 43481 32715
6172 32715 7196 22504 25952 -4240 -10596 -2097 -14186 -9102 -11437 -3632 4806 3642 15588
6159 15588 30281 27251 9261 7282 -13242 -16404 -26555 -29480 -32300 -19371 -13240 -22086 -19713
6146 -19713 -14126 8713 14604 38450 37503 6158 26693 44006 18319 1973 12762 23655 24950
6133 24950 13108 -27797 -42793 -16691 410 -13360 -19063 -5833 7545 17476 -9362 -28574
6121 -28574 -8168 -22626 -24283 -28267 -3364 -3281 -16438 -23369 -50078 -93505 -89440 -69479 -30273
6108 -30273 10137 46570 35329 19017 -7499 -16193 -31222 -33380 9323 31907 30560 24594 17923
6095 17923 17556 17786 -5913 -17793 -23153 -12965 2006 -191 8330 -11462 -3912 -13454 -1221 -16773
6081 -16773 -33067 -22552 4643 15280 14617 -18478 -31013 10559 3547 -21980 -15436 -34853 -41020
6068 -41020 -9460 -14660 -37108 -24461 21995 43668 53377 36119 28017 17982 2421 15282
6056 15282 21333 41033 58991 75628 53889 63458 53335 45657 48633 31030 -13 12984 14279
6043 14279 25649 27548 32163 23853 8551 -3087 -7850 -165 -5553 16163 20011 13094 6723 12000
6029 12000 13073 13763 20042 17542 -5425 -26483 -38135 -52781 -28429 -37078 -41044 9239 22738
6016 22738 -9090 -14321 -12556 7300 6484 14321 19327 37397 50628 37625 -1648 31472 45382
6003 45382 51895 26802 22236 29408 21432 53199 59240 40697 62035 58555 25879 32866 20883
5990 20883 14426 25045 -3104 807 16224 9507 27852 10636 -2220 21707 -2346 -21237
5978 -21237 10194 23817 21281 27895 34566 36482 34583 10853 21182 49139 62512 63031 48914
5965 48914 15686 -9699 -11425 -32522 -12513 1329 9297 3890 -33044 -25984 -10276 -11277 -6530
5952 -6530 -3940 -37764 -46238 -21288 6987 11282 -5983 -23610 -26694 -18170 -1219 -8746 -40033
5939 -40033 -61876 -38240 -22299 -23638 -33544 -27216 -42158 -29218 -33954 -44270 -37233 -50796 -48723
5926 -48723 -5112 3399 -24241 -32478 3258 29856 30202 14734 26327 18014 25689 22289 12905
5913 12905 3758 811 29479 47326 37174 17353 7096 19902 16241 -18440 -24052 -26283 -19857
5900 -19857 -12897 -1737 587 -4491 -17393 -45854 -63645 -46341 -24980 -22932 -40574 -44782 -28094
5887 -28094 -17948 7288 21977 15566 13170 9254 5952 -23726 6164 20657 1239 -2643 -3352
5874 -3352 22033 11111 -21687 -42725 -48078 -43693 -41081 -43044 -42676 -21605 -33992 -66728 -74258
5861 -74258 -67233 -62973 -27595 14267 26356 20630 4724 -33091 -78273 -103014 -79928 -35691
5849 -35691 2955 7200 6079 -31436 -34199 -46151 -61563 -58268 -45622 -44113 -37461 -42093 -30350
5836 -30350 -22595 -51934 -29064 -33034 -18765 5954 -4189 3912 -14126 -17370 -49100 -33923 -14941
5823 -14941 -17208 -28268 -22491 -24448 -11591 32654 36560 -2519 -6176 7666 30739 -7322 -72217
5810 -72217 -77924 -41609 -24868 -35553 -23000 -19734 -8698 -17612 -35356 -82478 -86571 -64373 -19405
5797 -19405 -6340 -5842 -11970 3298 1989 -17743 -20678 -9099 -27867 -75455 -106394 -111648 -118868
5784 -118868 -102303 -68121 -47323 -47099 -36933 -29422 -14704 17384 26170 32487 17348 342 3687
5771 3687 7139 6680 -14479 -17565 -25535 -26643 -10374 9601 37595 77847 64756 45605 8017
5758 8017 -175 24359 48502 25232 11197 8279 13436 18189 18634 27853 -16413 -26258 -17426 -16425
5744 -16425 -20646 -43277 -56880 -46936 -40953 -45196 -63252 -20901 19932 -8987 -26912 -35235 -23594
5731 -23594 -2279 4370 15054 22602 31820 54382 30996 27452 14951 16663 14087 -2648 -27191
5718 -27191 -12233 -10773 21651 33340 27693 15169 19683 7371 -9178 645 11781 34527 3326
5705 3326 -28905 -43656 -14545 -10875 -4668 28428 20024 9140 13849 17244 11156 -31927 -56465
5692 -56465 -42218 -47512 -48572 -46697 -51548 -43897 -46313 -60147 -72406 -40880 -17037 1724 6549
5679 6549 5636 -5496 -21318 -5266 1362 1209 23875 7780 17308 17289 36888 51825 38600 50237
5665 50237 39774 39631 53680 51568 33216 8382 22406 31381 23778 9531 -10873 7468 -633
5652 -633 25493 38604 16292 -25259 -56423 -26426 -37910 -37305 -40421 -5129 -23649 -18947 -46
5639 -46 -6709 -48212 -39058 -13625 17009 29651 37968 31953 -1047 -6290 -3343 10563 -7292 -36219
5625 -36219 -43228 -36914 -9003 13500 16213 39 -5886 23390 47888 12423 -16994 -17783 13074
5612 13074 50780 57032 44084 14863 -15244 -23284 -35384 -22724 9860 54446 75449 54892
5600 54892 15437 8175 23153 11661 -4448 -8872 -20045 -5626 -22094 -63900 -70034 -70533 -61566
5587 -61566 -53002 -46790 -34340 -3214 -1290 11974 25862 49035 53095 29370 14783 4814 -17340
5574 -17340 -17476 -17461 -38901 -47549 -25242 -38968 -21820 -37017 -28519 4287 -3144 -37313 -53482
5561 -53482 -80628 -93279 -94499 -78229 -72082 -59760 -17071 5982 -665 -41507 -56205 -48763 -39833
5548 -39833 -5395 20692 13813 -19305 -18468 -1215 -21575 -33891 -26184 -42223 -62710 -16000 22967
5535 22967 -1061 -14297 -3540 16555 29657 10487 -21388 -29952 -10902 -18326 -34862 -11614
5523 -11614 -9099 8368 -2202 9126 28782 31565 6794 -8595 4935 -2148 -13516 -3436
5511 -3436 -24899 -26767 -47426 -59091 -50016 -46485 -17719 -30093 -36987 -37715 -29355 1690 12455
5498 12455 10570 -41657 -62778 -44060 -31573 -23501 15316 22841 -6511 8799 3039 -11016 -25462
5485 -25462 -18380 -8498 -6335 -349 -16026 -64439 -64070 -34300 -28381 9745 43611 60029 80692
5472 80692 76814 39280 11972 -3575 3996 712 108 7909 -9858 -9520 4698 -2160 32895 35564
5458 35564 32233 18457 -3815 24226 32931 -11409 7501 24521 7367 1600 565 38862 37259
5445 37259 31752 33938 24696 6650 21411 37719 48621 55885 25591 23070 10351 -6137 -3675
5432 -3675 31733 33237 35878 11453 -4571 4237 22152 66195 58558 46239 56595 38940 39836
5419 39836 47290 17505 3232 -35254 -59282 -62470 -72994 -53412 -20487 16649 38630 15925
5407 15925 -9526 11939 32640 25175 14305 -8904 -21491 2032 53123 74059 30843 16833
5395 16833 26917 17872 -11674 13738 33208 28963 23146 45272 38726 27881 7264 -3225 -2457
5382 -2457 -12760 -42297 -43878 -12789 -18834 -5520 -5708 -28669 -30516 -43009 -53084 -31485 17360
5369 17360 23902 32840 39676 25380 37587 57040 30731 20489 -4998 -28427 -26051 -9363 -9380
5356 -9380 -3525 7776 -1814 6175 13974 15816 24965 29112 10786 -17688 -13398 -36589 -23514 -20596
5342 -20596 -24802 -23890 6517 38491 15510 3931 2614 3051 1181 30828 42889 40339 27482
5329 27482 14288 21698 6106 -21134 -36490 -14222 -16464 -50468 -43347 -36410 -59917 -65274 -45673
5316 -45673 -49610 -35403 -26416 2780 -8023 -13535 1844 20686 12330 -20809 -542 29857 26930
5303 26930 8042 9065 -21388 -26882 -35705 -37894 -41082 -8932 8894 10252 831 -3988 -884 -4612
5289 -4612 7368 -1402 10781 2911 15908 19715 2642 21133 8842 3466 38200 57069 38308
5276 38308 39981 38636 13192 24602 36732 15370 -4750 -8985 13608 25436 38537 11771
5264 11771 -10172 -22323 -27466 -9622 255 -16201 -24652 -16784 -24232 -14426 1193 -8305 -12244
5251 -12244 9472 -1580 -5901 -15725 -27330 -25630 -21916 -22338 -36999 -13585 15749 63977 42111
5238 42111 1991 -17694 -23820 -22371 -20699 -1106 -8761 -17756 -1809 19636 29848 35999 245
5225 245 -28010 -8032 36256 12096 -5392 -11930 -30964 -32475 -11913 10200 40957 39915 49697
5212 49697 8322 -10296 -13843 -37859 -24802 -5655 21461 -6484 -13822 -18167 -12716 5180 -955
5199 -955 -28037 -65388 -72142 -60956 -59478 -40057 -46540 -46153 -46288 -8114 8915 -3339 -50635 -34348
5185 -34348 -41491 -16133 -9982 -11594 -16667 -32742 -40694 -10568 43012 40454 18278 -3270 -36251
5172 -36251 -59784 -54190 -32216 -17003 -25645 -33070 -19692 -16601 -23648 -44239 -48365 -11493 22270
5159 22270 28667 26510 41181 41865 18827 15150 -17932 -46136 -10287 28213 29052 -791 -27553
5146 -27553 -48529 -20694 -10591 10251 33963 42966 26573 33691 44305 28796 50068 40616
5134 40616 36009 -12764 -25907 -8067 -6272 -11202 -9664 -21871 -23814 14914 28840 22597 6783
5121 6783 19692 31234 31186 32531 47493 56072 24291 35160 42612 38229 50582 29998 -10075
5108 -10075 -10119 -24725 -2749 8178 24300 38746 55018 42284 40044 34793 3053 13526 1810
5095 1810 -7825 21772 20610 27778 24410 31356 35746 39806 19569 -9323 -941 8524 35645 32743
5081 32743 16911 8315 -1335 26551 51577 21454 -605 -16535 -18395 -6175 8998 -574 -8743
5068 -8743 -13357 -19771 -15838 4333 108 -19833 -14427 -29277 -47179 -35509 -15645 -7770 1346
5055 1346 4411 4121 2315 -14164 -17869 17430 28962 48363 30891 -11105 -41757 -54885 -66148
5042 -66148 -45066 -35843 -2593 36520 27666 24801 7270 -19507 -6289 37212 50965 17798
5030 17798 -933 -8709 -3530 -13662 -11221 51302 68613 34561 8557 -5329 -1714 3902 22145
5017 22145 26611 -5283 -26838 -24885 -7456 16673 29945 7969 -23901 -10219 -8148 -13074 9539
5004 9539 3303 4231 9820 12555 20536 18722 44385 41844 14241 178 -16813 -11144 6752 -4972
4990 -4972 3102 8705 -5572 3493 25329 23995 -18232 -38436 -10032 10714 -13185 -6562 197
4977 197 16338 7207 -5070 -3173 6354 35375 23148 2315 470 6295 44178 39645 7408
4964 7408 -9006 18819 33022 12895 -4623 10829 19656 9986 -3535 -8758 7833 8358 -15406
4951 -15406 -5818 14010 10899 15343 42019 19215 -3471 -31429 -48609 -36458 -21013 8194
4939 8194 39486 8249 29522 38738 2134 -27825 -589 31659 9342 -12185 21539 13070
4927 13070 -4305 -1956 -96 8861 12280 10340 -25844 -29652 21231 35768 25996 25127 30554 31587
4913 31587 5586 -6141 -347 20451 3871 -4043 -12896 -26155 -16247 -17585 -17444 -19542 -14962 -7519
4899 -7519 -1302 -11485 10862 13742 576 -55432 -66907 -40647 -6521 36491 51665 17709
4887 17709 7590 1987 437 3197 18791 11369 14829 35525 24683 -1758 2653 4671 7097
4874 7097 27663 33128 23310 6646 3789 -7515 14553 21982 14754 45921 42943 2910 5622
4861 5622 -331 15365 26134 28047 23742 18311 -8619 -18203 -11916 -8654 -16595 -2300 -4761 20871
4847 20871 39282 15525 2686 -2868 -13096 -13193 162 4769 1013 3969 11090 -1307 -28920
4834 -28920 -49053 -28754 -15006 -8540 -19349 -16440 -33928 -12474 8440 -26457 -28157 -23722 -36878
4821 -36878 -27693 -23460 -12208 14790 28210 -5964 6548 19830 -1692 -29000 -24378 -6389
4809 -6389 27598 36826 35689 38394 25621 -3473 -7196 -23975 -43188 -32897 19069 32454 28253
4796 28253 7973 -16379 -24184 -14882 -30722 -35207 -14956 3587 17596 31575 44481 48494 34554
4783 34554 25293 18862 11436 553 27259 41082 18434 -12398 -22720 -12313 -13357 -14494 7366
4770 7366 -5263 -5187 -10764 -44445 -11820 -7000 5493 36612 9623 -11019 -4445 -5702 8898
4757 8898 -6145 -34463 -34969 -6340 13629 4124 -3104 3800 17329 1228 -15806 -17214 7678
4744 7678 6081 -14796 -9268 -9890 5783 -2717 16730 13727 -12712 -16591 -21427 -7216 -239 16718
4730 16718 46332 53544 30436 -1410 -9387 3583 -2270 -1125 -4603 -20033 -31072 -42916 -29905
4717 -29905 -21413 -13556 -10751 28005 25111 25085 27083 33833 17034 16974 -2065 -8659 -3212 -7139 -14803
4702 -14803 -7323 4098 3542 18663 26430 -9873 -33825 -12578 -13102 -17322 -6810 -22797 -22081 15272
4688 15272 32593 40388 22398 1817 10922 13824 32830 22234 2106 -16636 -43597 -48113 7540
4675 7540 55236 35854 23846 22092 16087 4838 1307 -18022 -35885 -43620 -26545 -33715 -56572
4662 -56572 -73104 -64986 -42863 -36347 -23049 -33915 -30888 -16838 17928 27856 8080 9081 -6994
4649 -6994 -6229 23682 35337 9077 -33584 -46671 -25286 -10723 -34415 -55680 -31245 -8060
4637 -8060 -1606 -9080 7322 41810 39366 4790 -940 42595 12402 -293 10434 4206 7521
4624 7521 -7086 2482 33468 29267 2574 -12411 -3256 -6673 -6196 -9195 21696 27957 16206 18580
4610 18580 40474 22307 9804 29708 9271 18667 36265 21240 26710 27164 23206 18609 26623
4597 26623 31461 22926 9247 -6938 -10897 2578 6998 16354 24118 24744 -17917 -34952 -14855
4584 -14855 -5225 17021 16476 14606 10326 2111 -17890 756 36889 49304 48990 36873 10794
4571 10794 19193 43993 31285 -2068 -5425 1605 20019 -3097 -26928 -25311 -1256 18050 3511
4558 3511 -5330 -32413 -46462 -64448 -60990 -50065 -20730 7672 5835 -3806 10849 21503 23092
4545 23092 -11964 -26015 -4828 -10105 -9822 -1728 -13169 -18104 -34083 -25413 -20106 -20733 7189 35399
4531 35399 67004 74746 49743 29646 20067 34138 31743 26592 21327 -12488 -33707 -27859 -29487
4518 -29487 -15530 11530 28040 39276 21937 -20044 -7785 24550 37669 32473 48012 37982
4506 37982 50334 40740 12428 -20974 -14573 25706 34170 13803 -10637 -4036 13520 29934 27998
4493 27998 13593 560 6159 5630 -5547 -20160 -24307 80 7472 978 -5235 12744 963
4480 963 4088 -5848 -9183 -16276 -20057 1930 24758 1269 -35083 -42525 -12638 4388 17668
4467 17668 -11443 -14678 10624 -820 12250 6232 2407 -2091 -10961 4551 26825 27883 10088
4454 10088 -4419 -9960 -23189 -20718 -303 787 7391 3419 14994 12701 19960 48925 -1425
4441 -1425 -17532 -8016 10325 -1895 -13843 -35968 -55985 -46433 -19450 -11512 -21992 -32777 -36338
4428 -36338 -7294 32992 32305 4191 -3847 7219 20308 20733 -13599 -31489 4479 15866 31234
4415 31234 -6830 -44113 -26099 -38138 -25892 -25398 -29074 -36143 -27316 -7122 -11412 -19777 24151
4402 24151 37440 52027 54836 33489 42596 24126 -2232 6585 -10504 -12209 -29705 -14884 6247
4389 6247 35380 32831 9490 -1469 5539 26343 45259 59972 34963 13796 12499 19073 19805
4376 19805 7810 -9578 -26992 966 -20033 -23718 -6360 -19841 -42382 -33564 -18917 -18772 -9679
4363 -9679 10662 4996 -2299 23188 37040 3371 24942 49876 54885 37472 31767 28254 -14770
4350 -14770 -37495 -33695 7382 26802 12582 -12074 -34466 -31859 4415 24794 17277 -2932
4338 -2932 -38809 -44545 -42836 -52124 -24598 -26438 1413 -898 -26374 -35953 436 12492 -16793
4325 -16793 -27982 1459 -26320 -58357 -37399 -17987 -7668 -5045 -20203 -26478 -7541 31054
4313 31054 34469 29294 22874 -27646 -18358 -10417 -14479 -23753 -13635 -15393 11495 22669 -4989
4300 -4989 -22952 -6798 1322 -2055 -15376 -18854 -14921 -15725 -18602 -27615 -35962 -21991 -6092 549
4286 549 8334 34236 41283 30793 13520 18831 21669 38605 2103 -58702 -78067 -44671 -2268
4273 -2268 -6933 -28792 -15441 27687 24898 21793 19178 11522 4728 -13643 -24649 6156 24522
4260 24522 23416 29500 17366 -8062 -20869 -18230 -13585 -20378 -17486 83 -6103 33930 32846
4247 32846 -5666 684 22756 17671 21882 13153 16412 34937 20237 -24993 -35860 -12687 15840
4234 15840 2649 -2172 -807 5042 16699 34188 13940 -3279 -23491 -21833 -18211 -16900 12824
4221 12824 25285 25936 10563 912 -6850 -11172 5016 8221 6413 21025 9986 -775 -28141
4208 -28141 -33720 -34221 -23228 22768 41847 27953 37084 49153 19582 19202 20282 20699 44710 35804
4194 35804 1301 -19094 -19456 10462 14728 3942 32029 25941 -11879 -4686 -6342 -17641 -17234
4181 -17234 -4911 -8445 -25207 -26669 -13203 -7835 -1233 -18156 -29145 -20705 -33737 -69434 -43389
4168 -43389 -6158 21915 -19587 -21649 -40267 -39372 -2845 18745 -13286 -5161 10012 -13740 -37852
4155 -37852 -37658 -24384 -10761 28425 52540 28222 -10797 -30934 -44063 -14790 -18608 22620
4143 22620 30804 12792 44869 44148 56041 39101 32418 32388 18168 17882 24573 1518 -11252 -12426
4129 -12426 -11763 -14658 -11016 -700 19887 52379 31810 30323 46037 10512 -3870 12412 10789
4116 10789 17950 47695 39024 22830 38910 43184 20324 -9939 -42093 -50667 -62861 -52866 -63124
4103 -63124 -49456 -22648 -3435 4293 -7644 -3658 17107 15243 -12477 -33002 -18129 -29789
4091 -29789 -37451 -55172 -58417 -36204 -19574 5225 -9265 -18597 -21518 -15599 -10054 10458 21640
4078 21640 28825 -2544 -1191 -38582 -66124 -61167 -38359 32742 40140 20925 -3639 -19878 -30944
4065 -30944 -11942 -5961 -4139 23630 30223 12406 10046 -245 11155 9848 23179 42042 60775
4052 60775 32373 22946 23607 11327 8338 11366 15373 -4362 -31280 -52181 -57699 -30594 -46328
4039 -46328 -59882 -38976 -9384 12453 -11095 -29496 -26371 -16539 1766 10978 52469 30309
4027 30309 6076 33829 34083 30108 32191 24021 18200 -2747 -31132 -52273 -46548 -72662 -32458
4014 -32458 -18054 -37528 -33603 19844 34842 9766 27672 13184 -9028 -4258 1337 2150 -3745
4001 -3745 -15358 -14339 -6294 -8591 -7189 -4521 -31504 -25561 7475 -1343 -24194 -39790 -18871
3988 -18871 -3648 21481 38343 45115 42310 20859 -5479 3367 -23152 -46516 -47151 -44457 -46670
3975 -46670 -53914 -62397 -58583 -45208 -41651 -35077 -2336 6588 -5810 3466 9139 -25542 -28073 -10652
3961 -10652 6361 24422 44410 56082 29933 36616 40993 36801 33010 15947 -6528 -4642 6181
3948 6181 22064 46173 58768 68813 72301 54122 21303 3697 -14879 -30808 -12831 5919
3936 5919 874 -18258 -15992 17153 19719 9791 3662 -4250 -9729 -17922 -12096 941 6635 -220
3922 -220 -15550 -8937 -35265 -42831 -17391 26713 16510 25000 44288 33497 2065 -36179 -34089
3909 -34089 8551 26523 32351 11457 -12203 -14324 -17190 -48228 -40854 -12679 -16389 -34238 -24232
3896 -24232 -29654 -14395 -167 2810 8505 10060 3014 -38712 -44244 -31966 -9094 4554 11730
3883 11730 16740 8314 -336 9779 16125 22434 13553 -10337 -22878 -27756 -54507 -58220 -59617 -40537
3869 -40537 3285 23786 3230 37150 33240 15439 8277 22160 36144 24879 14950 -6427
3857 -6427 -35994 -10188 -22709 -9296 11714 24476 75719 49584 -1039 -26041 -16466 6059
3845 6059 27000 22894 1725 -36402 -13542 5100 -8717 -18681 -3009 7752 -11031 -50125
3833 -50125 -43678 -12152 6880 11049 -5403 -6406 822 -8689 -12721 -4827 -12569 -20855 -6260 6013
3819 6013 30564 50444 70572 49648 20120 -3254 7507 21332 24062 -29867 -47561 -27068
3807 -27068 -18319 -2205 -2564 -23596 -55332 -29890 7431 6156 9063 -28831 -23078 -7816 -23388
3794 -23388 14406 26746 28223 -10909 -5364 -3274 -933 15069 -16459 -33293 -38190 -25807 11689
3781 11689 6055 4160 18912 28338 12945 16791 39763 56986 38410 -5410 -23409 -5913 8414
3768 8414 26011 23427 14572 29672 39279 40354 46171 26576 11667 -24605 -7111 21264 209
3755 209 -11543 -15663 13326 24245 22700 9113 3252 31836 22949 -687 -25633 -39062 -35206
3742 -35206 -18390 -6515 -3447 -19508 -7373 4100 -4070 -27439 -29435 -41376 -39681 -51313 -32293
3729 -32293 2159 28661 40888 5622 -19770 -9274 -23193 -1728 5718 -8945 -29811 -37762
3717 -37762 -21067 -4087 -7828 -4314 -18460 -18850 -20330 -14504 -15482 -2170 -16208 -40461 -40363 -52803
3703 -52803 -43753 -6979 26181 31325 11256 12786 42071 4577 1076 29801 38458 36500 20730
3690 20730 23707 5285 -21035 -26364 -15868 14264 27889 26185 35199 20907 25393 10597 16717
3677 16717 17527 14040 -13560 -48169 -25138 -6935 30139 57687 52401 55662 42356 15691 6809
3664 6809 18164 30161 -17243 -16410 -18686 -51550 -51502 -41001 -44556 -41034 -37817 -23388 -26945 -28514
3650 -28514 -30572 -46074 -46611 -31998 -33329 -29849 -7051 -12180 -22729 -24918 -31522 -34393 -19935 12438
$$ [...]
##END NTUPLES=NMR SPECTRUM
##END=
