##TITLE=Analysis number 325817
Compound Code mo 08038
Project Code adrs
Chemist Name aci
##JCAMPDX= 6.0         $$ Bruker NMR JCAMP-DX V2.0
##DATA TYPE= NMR SPECTRUM
##DATA CLASS= NTUPLES
##ORIGIN= Bruker BioSpin GmbH
##OWNER= nmr
$$ XWIN-NMR		Version 3.5
$$ Mon Jan 15 15:27:11 2007 GMT Standard Time (UT+0h)  MAYBRIDGE\nmr@NMR_250MHZ
##.OBSERVE FREQUENCY= 250.131544655141
##.OBSERVE NUCLEUS= ^1H
##.ACQUISITION MODE= SIMULTANEOUS (DQD)
##.ACQUISITION SCHEME= undefined
##.AVERAGES= 16
##.DIGITISER RES= 18
##SPECTROMETER/DATA SYSTEM= dpx250
##.PULSE SEQUENCE= zg30
##.SOLVENT NAME= CDCl3
##.SHIFT REFERENCE= (INTERNAL, CDCl3, 0, 16.522)
##AUDIT TRAIL= $$ (NUMBER, WHEN, WHO, WHERE, WHAT)
$$ ##TITLE= Audit trail, XWIN-NMR		Version 3.5
$$ ##JCAMPDX= 5.01
$$ ##ORIGIN= Bruker BioSpin GmbH
$$ ##OWNER= nmr
$$ C:\u/data/dgb/nmr/ADRS/1110/pdata/1/auditp.txt
$$ ##AUDIT TRAIL=  $$ (NUMBER, WHEN, WHO, WHERE, WHAT)
(   1,<2007-01-15 15:26:49.62 +000>,<MAYBRIDGE\nmr>,<NMR_250MHZ>,
      <created by zg, POWCHK disabled, PULCHK disabled
       configuration hash MD5:
       49 4B E0 1D 92 C2 6B 37 9F E6 65 BC 52 41 86 1D
       data hash MD5: 64K
       84 5A 28 9C C0 61 B9 83 38 21 B4 3C 5F DF F9 4E>)
(   2,<2007-01-15 15:27:02.33 +000>,<MAYBRIDGE\nmr>,<NMR_250MHZ>,
      <Start of raw data processing
       ef LB = 0.3 FT_mod = 6 PKNL = 1 SI = 32K 
       data hash MD5: 32K
       9E AE 5F D9 D7 D9 91 AF 47 53 B1 FB 62 C7 F0 C0>)
(   3,<2007-01-15 15:27:04.17 +000>,<MAYBRIDGE\nmr>,<NMR_250MHZ>,
      <apk 
       data hash MD5: 32K
       D7 23 39 72 B2 B0 D8 61 CE 10 E7 73 C9 85 E3 36>)
(   4,<2007-01-15 15:27:04.92 +000>,<MAYBRIDGE\nmr>,<NMR_250MHZ>,
      <abs ABSG = 5 
       data hash MD5: 32K
       37 46 51 19 58 B8 92 5C E2 EE DE 53 92 5B 96 04>)
$$ ##END=
$$ 
$$ hash MD5
$$ DC 02 4A BB 25 F3 16 25 58 66 37 77 2D F8 9A B8
##$RELAX= 
##$RELAX= 
##$RELAX= 
##$RELAX= 
##$RELAX= 
##$RELAX= 
##$RELAX= 
$$ Bruker specific parameters
$$ --------------------------
##$DU= <C:\u>
##$EXPNO= 1110
##$NAME= <ADRS>
##$PROCNO= 1
##$TYPE= <nmr>
##$USER= <dgb>
##$AMP= (0..31)
100 100 100 100 100 100 100 100 100 100 100 100 100 100 100 100 100 100 
100 100 100 100 100 100 100 100 100 100 100 100 100 100 
##$AQSEQ= 0
##$AQ_mod= 3
##$AUNM= <au_zg>
##$AUTOPOS= <41 >
##$BF1= 250.13
##$BF2= 250.13
##$BF3= 250.13
##$BF4= 250.13
##$BF5= 500.13
##$BF6= 500.13
##$BF7= 500.13
##$BF8= 500.13
##$BYTORDA= 1
##$CFDGTYP= 0
##$CFRGTYP= 5
##$CHEMSTR= <none>
##$CNST= (0..31)
1 1 145 1 1 1 1 1 1 1 1 1 1 1 1 1 1 1 1 1 1 1 1 1 1 1 1 1 1 1 1 1 
##$CPDPRG= <>
##$CPDPRG1= <>
##$CPDPRG2= <>
##$CPDPRG3= <>
##$CPDPRG4= <mlev>
##$CPDPRG5= <mlev>
##$CPDPRG6= <mlev>
##$CPDPRG7= <mlev>
##$CPDPRG8= <mlev>
##$CPDPRGB= <>
##$CPDPRGT= <>
##$D= (0..31)
0 1 0 0 0 0 0 0 0 0.06 0 0 0 0 0 0 0.0002 0 0 0 0 0 0 0 0 0 0 0 0 0 0 
0 
##$DATE= 1168874808
##$DBL= (0..7)
120 120 120 120 120 120 120 120 
##$DBP= (0..7)
150 150 150 150 150 150 150 150 
##$DBP07= 0
##$DBPNAM0= <>
##$DBPNAM1= <>
##$DBPNAM2= <>
##$DBPNAM3= <>
$$ [...]
##$SUBNAM7= <"">
##$SUBNAM8= <"">
##$SUBNAM9= <"">
##$SW= 20.6930455092707
##$SWIBOX= (0..15)
0 0 3 0 0 0 0 0 0 0 0 0 0 0 0 0 
##$SW_h= 5175.983436853
##$TD= 65536
##$TD0= 1
##$TE= 294.16
##$TE2= 300
##$TE3= 300
##$TEG= 300
##$TL= (0..7)
0 120 120 120 120 120 120 120 
##$TP= (0..7)
150 150 150 150 150 150 150 150 
##$TP07= 0
##$TPNAME0= <>
##$TPNAME1= <>
##$TPNAME2= <>
##$TPNAME3= <>
##$TPNAME4= <>
##$TPNAME5= <>
##$TPNAME6= <>
##$TPNAME7= <>
##$TPOAL= (0..7)
0.5 0.5 0.5 0.5 0.5 0.5 0.5 0.5 
##$TPOFFS= (0..7)
0 0 0 0 0 0 0 0 
##$TUNHIN= 0
##$TUNHOUT= 0
##$TUNXOUT= 0
##$USERA1= <user>
##$USERA2= <user>
##$USERA3= <user>
##$USERA4= <user>
##$USERA5= <user>
##$V9= 5
##$VALIST= <valist>
##$VCLIST= <CCCCCCCCCCCCCCC>
##$VD= 0
##$VDLIST= <DDDDDDDDDDDDDDD>
##$VPLIST= <PPPPPPPPPPPPPPP>
##$VTLIST= <TTTTTTTTTTTTTTT>
##$WBST= 1024
##$WBSW= 4
##$XGAIN= (0..3)
0 0 0 0 
##$XL= 0
##$YL= 0
##$YMAX_a= 615202
##$YMIN_a= -475168
##$ZGOPTNS= <>
##$ZL1= 120
##$ZL2= 120
##$ZL3= 120
##$ZL4= 120
##$ABSF1= 16.522
##$ABSF2= -4.171173
##$ABSG= 5
##$ABSL= 3
##$ALPHA= 0
##$AQORDER= 0
##$ASSFAC= 0
##$ASSFACI= 0
##$ASSFACX= 0
##$ASSWID= 0
##$AUNMP= <proc_1d>
##$AZFE= 0.1
##$AZFW= 0.1
##$BCFW= 0
##$BC_mod= 0
##$BYTORDP= 0
##$COROFFS= 0
##$CY= 12.5
##$DATMOD= 1
##$DC= 0
##$DFILT= <>
##$DTYPP= 0
##$F1P= 14.0000005364418
##$F2P= -0.99999901652339
##$FCOR= 0.5
##$FTSIZE= 32768
##$FT_mod= 6
##$GAMMA= 0
##$GB= 0
##$INTBC= 1
##$INTSCL= 1
##$ISEN= 128
##$LB= 0.3
##$LEV0= 0
##$LPBIN= 0
##$MAXI= 10000
##$MC2= 0
##$MEAN= 0
##$ME_mod= 0
##$MI= 0
##$NCOEF= 0
##$NC_proc= -3
##$NLEV= 6
##$NOISF1= 0
##$NOISF2= 0
##$NSP= 0
##$NTH_PI= 0
##$NZP= 0
##$OFFSET= 16.522
##$PC= 1
##$PHC0= 75.74632
##$PHC1= 8.450065
##$PH_mod= 1
##$PKNL= yes
##$PPARMOD= 0
##$PSCAL= 4
##$PSIGN= 0
##$REVERSE= no
##$SF= 250.13
##$SI= 32768
##$SIGF1= 0
##$SIGF2= 0
##$SINO= 400
##$SIOLD= 32768
##$SREGLST= <1H.CDCl3>
##$SSB= 0
##$STSI= 32768
##$STSR= 0
##$SW_p= 5175.98343685301
##$SYMM= 0
##$S_DEV= 0
##$TDeff= 65536
##$TDoff= 0
##$TI= <Analysis number 999999
Compound Code 99
Book Reference 9
Project Code 9>
##$TILT= no
##$TM1= 0
##$TM2= 0
##$TOPLEV= 0
##$USERP1= <user>
##$USERP2= <user>
##$USERP3= <user>
##$USERP4= <user>
##$USERP5= <user>
##$WDW= 1
##$XDIM= 32768
##$YMAX_p= 454451144
##$YMIN_p= -162602
$$ End of Bruker specific parameters
$$ ---------------------------------
##NTUPLES= NMR SPECTRUM
##VAR_NAME=  FREQUENCY,     SPECTRUM/REAL,   SPECTRUM/IMAG
##SYMBOL=    X,             R,               I
##VAR_TYPE=  INDEPENDENT,   DEPENDENT,       DEPENDENT
##VAR_FORM=  AFFN,          ASDF,            ASDF
##VAR_DIM=   32768,         32768,           32768
##UNITS=     HZ,            ARBITRARY UNITS, ARBITRARY UNITS
##FACTOR=    0.157963299565203, 1,           1
##FIRST=     4132.6476996994, 0,             0
##LAST=      -1043.33573715361, 0,           0
##MIN=       -1043.33573715361, -162602,     0
##MAX=       4132.6476996994, 454451144,     0
$$ Real data points
##PAGE= N=1
##DATA TABLE= (X++(R..R)), XYDATA
$$ [...]
$$ plain form
20695 -10121 -4821 -1830 -4485 -6331 -16521 -23923 -26978 -9878 -5391 -7669 -6526 -2727 -3210 -8025
20681 -8025 -18510 -16346 -4683 5106 5038 4617 1079 -8782 -3066 -1073 4588 10767 14460 14192 12604
20666 12604 5032 5155 -2651 -7533 -5009 -10000 -18775 -14896 -9266 -13986 -12203 -5779 -9478 -7368 -1021
20651 -1021 6081 -2859 -5486 3250 2720 2147 263 -6430 -8145 -8489 -5806 -674 7274 3406 -3715
20636 -3715 -6533 -432 4680 -1175 -10470 -15718 -10447 -7151 -4137 -9685 -14683 -7897 73 -499 -4770
20621 -4770 -5019 -5155 -14778 -16665 -17960 -14192 -2061 11513 15261 4351 3831 6464 16054 15169 16263
20606 16263 11551 7198 -2429 -785 -3550 -7547 -8441 -3717 -6219 -13230 -9220 -3347 -7573 -12397 -13005
20591 -13005 -19114 -21092 -14754 -2993 2861 1862 -2386 -3903 -5718 -4664 -4308 -5794 -6272 -924 -3809
$$ packed form
20695a0121N300K991k655j846j0190p402l055J7100M487k278J143L799m83m815
20681h025j0485K164J1663R789o8m21l538r861N716J993N661O179L693k68j588
20666A2604p572J23p806m882K524m991q775L879N630m720J783O424l699K110O347
20651a021P102q940k627Q736n30n73j884o693j715l44K683N132P948l868p121
20636c715k818O101N112n855r295n248N271L296L014n548m998O786P970n72m271
20621d770k49j36r623j887j295L768J2131J3574L748j0910n20K633R590q85J094
20606A6263m712m353r627J644k765l997q94M724k502p011M010N873m226m824o08
20591a3005o109j978O338J1761N854r99m248j517j815J054L56j486m78N348k885
$$ plain form
20576 -3809 798 -579 -9406 -18675 -22342 -16826 -13790 -9172 -4711 -8209 -13578 -12254 -13014 -13948 -13306
20561 -13306 -7175 742 979 817 3585 932 -9103 -2538 -3365 -641 -3417 -5338 -5957 -2017 -10235
20546 -10235 -11439 -6085 -2830 -4336 -2889 -4008 -4862 -6403 -16235 -15463 1365 -2220 -5231 2370 2682
20531 2682 6425 499 677 -1985 521 -3871 -13258 -15525 -5572 11886 13479 831 -5102 3861
20517 3861 10501 -491 -11952 -11649 -2432 2610 1957 4549 5674 -3636 -658 6382 3910 1942 -7295
20502 -7295 -8423 -2113 3412 -2184 -3357 -10213 -11798 -11992 -8937 -8602 -12004 -21055 -10862 1856 3491
20487 3491 -4620 2403 4337 6822 2869 11035 25675 25378 17191 2676 -18602 -26263 -21724 -14695
20473 -14695 -14299 -16500 -14057 -13063 -16778 -13696 -18444 -14392 -905 -8930 -9824 -11416 -11470 -510 5070
$$ packed form
20576c809M607j377q827r269l667N516L036M618M461l498n369J324p60r34O42
20561a3306O131P917K37j62K768k653j0035O565q27K724k776j921o19L940q218
20546a0235j204N354L255j506J447j119q54j541r832P72J6828l585l011P601L12
20531B682L743n926J78k662K506m392r387k267R953J7458J593j2648n933Q963
20517C861O640j0992j1461L03R217N042o53K592J125r310K978P040k472j968r237
20502g295j128O310N525n596j173o856j585j94L055L35l402r051J0193J2718J635
20487C491q111P023J934K485l953Q166J4640k97q187j4515k1278p661M539P029
20473a4695L96k201K443R94l715L082m748M052J3487q025q94j592n4J0960N580
$$ plain form
20458 5070 4105 -1876 -9707 -11811 -11175 -7428 -4963 -7382 -11750 -15161 -11159 -8665 -206 -3831 -260
20443 -260 9341 4390 6103 1331 -5999 -6628 -2704 -9677 -15743 -16233 -8905 -874 2466 -803 99 3048
20427 3048 4655 12913 11251 8283 -2126 -9205 -10019 -7572 -13521 -6570 2308 -878 -4780 -6113 -7527
20412 -7527 -9686 -9461 -5880 -3961 2384 -3303 6245 13298 8349 -1078 -1722 -781 -2264 -7225 -16927
20397 -16927 -21543 -14578 -17770 -19111 -17743 1059 -353 -1326 1809 7667 8444 8612 2627 -3352 -4363
20382 -4363 3823 4415 4863 1623 2347 2160 -3081 2980 13705 17923 11904 7010 2947 -1277 -7284
20367 -7284 -9908 -11720 -14575 -11919 781 -600 -11198 -19259 -16983 -8309 -5515 -5849 -6313 -12233 -14795
20352 -14795 -16669 -16147 -10070 -7982 229 3260 3559 -1255 -751 567 -12403 -11018 -5593 -1697 4642
$$ packed form
20458E070r65n981p831k104O36L747K465k419m368l411M002K494Q459l625L571
20443b60R601m951J713m772p330o29L924o973o066m90P328Q031L340l269R02K949
20427C048J607Q258j662k968j0409p079q14K447n949O951Q878l186l902j333j414
20412g527k159K25L581J919O345n687R548P053m949r427o44R41j483m961r702
20397a6927m616O965l192j341J368J8802j412r73L135N858P77J68n985n979j011
20382d363Q186N92M48l240P24j87n241O061J0725M218o019m894m063m224o007
20367g284k624j812k855K656J2700j381j0598q061K276Q674K794l34m64n920k562
20352a4795j874N22O077K088Q211L031K99m814N04J318j2970J385N425L896O339
$$ plain form
20337 4642 3350 -823 -1956 -11656 -11138 382 7965 -580 -2832 -4264 -9714 -12266 -6580 1594 385
20322 385 -6488 -9254 -7787 -430 9556 2335 -9246 -12228 -9633 -4684 -3517 -9321 -9046 -24339 -22529
20307 -22529 -23900 -11986 -10592 -21686 -19459 -10460 -1403 5038 12012 10443 2927 -3049 4822 6283
20293 6283 13316 12122 4321 8458 4989 2420 4231 3974 4474 5715 2794 3422 410 -1274 -5358
20278 -5358 -5010 -2136 -1039 -8440 -345 2392 4700 3351 3786 3726 -6951 -12818 -7552 -3755 5422
20263 5422 5719 -5001 -3404 8772 4051 3188 5039 3077 6208 -1743 -9383 -4411 2491 4948 16350
20248 16350 11232 9907 14507 21602 15960 3857 -8711 -7311 -3409 -4553 -8718 -13169 -14990 -9093
20234 -9093 -4117 -3556 9727 16019 8837 5675 5712 7097 7611 1070 3568 -1670 4257 9545 9573 7745
$$ packed form
20337D642j292m173j133r700N18J1520P583q545k252j432n450k552N686Q174j209
20322C85o873k766J467P357R986p221j1581k982K595M949J167n804K75j5293J810
20307b2529j371J1914J394j1094K227Q999R057O441O974j569p516n976P871J461
20293F283P033j194p801M137l469k569J811k57N00J241k921O28l012j684m084
20278e358L48K874J097p401Q095K737K308j349M35o0j0677n867N266L797R177
20263E422K97j0720J597J2176m721q63J851j962L131p951p640M972O902K457J1402
20248A6350n118j325M600P095n642j2103j2568J400L902j144m165m451j821N897
20234i093M976N61J3283O292p182l162L7J385N14o541K498n238N927N288K8j828
$$ plain form
20218 7745 10165 7413 5099 7906 7407 7171 1545 2787 6734 14257 12711 22122 26709 13145 5388
20203 5388 -3338 -6184 7406 10512 1228 -12919 -21839 -31306 -25111 -11834 -9974 -5544 -3661 2315
20189 2315 4786 5608 -1034 7373 7658 2415 4744 -1532 1626 581 -4652 -2829 1203 8676 6712
20174 6712 -415 -4422 4449 8188 -3820 -5518 433 10699 12319 16939 19381 20574 19195 6682
20160 6682 -6623 -3456 3748 7174 7406 12581 12881 10756 13452 11143 15495 16699 11494 9759 11114
20145 11114 10249 14613 9990 9461 5144 8221 7451 -2391 -446 5427 4626 2817 -3463 1735 8741
20130 8741 9719 4943 -4799 -5793 3661 2114 -6306 -11436 2494 16822 13589 1129 5455 2420
20116 2420 5450 7954 -3708 -23057 -14084 -7305 -472 5260 8246 14510 18359 23999 23495 27627
$$ packed form
20218G745K420k752k314K807m99k36n626J242L947P523j546R411M587j3564p757
20203E388q726k846J3590L106r284j4147q920r467O195J3277J860M430J883N976
20189B315K471Q22o642Q407K85n243K329o276L158j045n233J823M032P473j964
20174F712p127m007Q871L739j2008j698N951J0266J620M620K442J193j379j2513
20160F682j3305L167P204L426K32N175L00k125K696k309M352J204n205j735J355
20145A1114q65M364m623n29m317L077p70r842J945N873q01j809o280N198P006
20130H741R78m776r742r94R454j547q420n130J3930J4328l233j2460M326l035
20116B420L030K504j1662j9349Q973O779O833N732K986O264L849N640n04M132
$$ plain form
20102 27627 28551 26374 29288 28954 17077 20946 18723 15165 13467 12541 577 -166 12870 16664 14928
20087 14928 19669 22553 21720 28292 29078 25714 20637 29184 40590 48220 65580 84159 117882 182694
20073 182694 288497 469987 728581 935817 951009 892886 1003177 1337280 1736034 1736302
20063 1736302 1314410 974174 881633 929921 916213 720049 479248 309380 195896 140522
20053 140522 105987 87174 68801 61492 50589 43142 38264 41600 42730 42091 23847 5870 -3115
20040 -3115 5630 814 -7250 -3025 9478 17543 17571 8500 8104 14853 18456 16757 21070 25591 19481
20025 19481 8356 -5582 -4299 -151 -2494 -2905 892 -2926 -4058 376 2565 -1677 2688 -8684
20011 -8684 -19099 -18447 -20996 -23297 -20307 -7988 1204 7733 1691 -4390 -788 3646 557 2929
$$ packed form
20102B7627R24k177K914l34j1877L869k223l558j698r26j1964p43J3036L794j736
20087A4928M741K884q33O572P86l364n077Q547J1406P630J7360J8579L3723O4812
20073A82694J05803J81490K58594K07236J5192n8123J10291L34103L98754K68
20063A736302m21892l40236r2541M8288j3708j96164k40801j69868j13484n5374
20053A40522l4535j8813j8373p309j0903p447m878L336J130o39j8244j7977q985
20040c115Q745m816q064M225J2503Q065K8r071l96O749L603j699M313M521o110
20025A9481j1125j3938J283M148k343m11L797l818j132M434K189m242M365j1372
20011h684j0415O52k549k301K990J2319R192O529o042o081L602M434l089K372
$$ plain form
19997 2929 -4232 -4479 -5190 -1765 -7141 -14703 -18190 -22690 -20726 -17747 -16569 -16138 -14896 -14741 -11580 -10605
19981 -10605 -5617 -2942 6401 1102 -1499 6363 12597 19794 10418 3063 -380 -3120 4 5267
19967 5267 2593 -1290 -5064 -4982 -14851 -16465 -12960 -2665 -4830 -11693 2184 11762 3614 -6725
19953 -6725 -18437 -20348 -7607 -6849 -13805 -12439 -3197 1694 8293 9889 13017 10522 2395 9108
19939 9108 4330 3369 8018 1109 -8732 -557 2847 -2686 158 6328 12657 9847 -9259 -20734
19925 -20734 -17762 -18992 -20231 -15049 -3300 -858 -4111 -3397 -5907 -13526 -16031 -11365 -14062 -10698
19911 -10698 -3086 5008 5154 -10627 -10996 -10309 -11495 -15047 -9315 -10568 -17404 -19990 -14279 -2360 -6582
19896 -6582 -9860 -10953 -15776 -17354 -3591 -1621 -6393 -20299 -26671 -21534 -7804 -4283 -5539 -11321
$$ packed form
19997B929p161k47p11L425n376p562l487m500J964K979J178M31J242J55L161R75
19981a0605M988K675R343n299k601P862O234P197r376p355l443k740L124N263
19967E267k674l883l774Q2r869j614L505J0295k165o863J3877R578q148j0339
19953f725j1712j911J2741P58o956J366R242M891O599J596L128k495q127O713
19939I108m778r61M649o909r841Q175L404n533K844O170O329k810j9106j1475
19925b0734K972j230j239N182J1749K442l253P14k510p619k505M666k697L364
19911a0698P612Q094J46j5781l69O87j186l552N732j253o836k586N711J1919m222
19896f582l278j093m823j578J3763J970m772j3906o372N137J3730L521j256n782
$$ plain form
19882 -11321 -13442 -19756 -24336 -11973 -7257 -589 11583 11671 -39 -6063 -10509 -5009 9845 2555
19868 2555 1746 -4493 -9382 -4514 -5382 346 7303 -7216 -17788 -20924 -28037 -23007 -14992 -7910 -14605
19853 -14605 -18469 -15829 -8952 2184 3732 -3408 -10488 -11355 -5886 797 1638 -6963 123 1812 6646
19838 6646 6050 1874 2981 2957 4825 800 1133 125 -8112 -12893 -8095 -2667 -3012 -3699 -5105 -11843
19822 -11843 3288 9157 10027 9167 10077 11949 7276 2192 -1893 1073 3140 43 -1886 4198 -728
19807 -728 -13174 -17177 -12138 -17730 -21632 -20212 -10754 -5087 -7104 -153 12234 19109 12564 -33
19793 -33 -5311 -10693 -7648 -1247 2091 4689 2051 -6813 -11086 -19039 -10365 128 3757 -3399 -7157
19778 -7157 -1164 630 -10389 -6305 -2832 -8769 -3115 982 7872 3041 -5788 -9547 -10959 -1286
$$ packed form
19882a1321k121o314m580J2363M716O668J2172Q8j1710o024m446N500J4854p290
19868B555q09o239m889M868q68N728O957j4519j0572l136p113N030Q015P082o695
19853a4605l864K640O877J1136J548p140p080q67N469O683Q41q601P086J689M834
19838F646n96m176J107k4J868m025L33j008q237m781M798N428l45o87j406o738
19822a1843J5131N869Q70q60R10J872m673n084m085K966K067l097j929O084m926
19807g28j2446m003N039n592l902J420R458N667k017O951J2387O875o545j2597
19793c3n278n382L045O401L338K598k638q864m273p953Q674J0493L629p156l758
19778g157N993J794j1019M084L473n937N654M097O890m831q829l759j412R673
$$ plain form
19764 -1286 2079 -4443 -21884 -30026 -29479 -24997 -9349 -1269 -3326 8374 10005 -6475 -18091 -9684
19750 -9684 -9331 -20039 -27353 -26394 -17807 -8169 -3323 319 3213 3638 3695 2697 2639 3326 640 -4909 -2332
19733 -2332 -11303 -13330 -9750 -6113 2796 5415 4424 -9875 -8017 -17600 -24595 -10490 -6009 -12045
19719 -12045 -1101 6907 674 -439 3980 6268 5877 -653 -11632 -20667 -25130 -23572 -16589 -3925
19705 -3925 3593 -1615 -10351 -15327 -15313 -16789 -15886 -13462 -6546 -8476 -20546 -23213 -25829 -26912 -21993
19690 -21993 -17144 -12446 -13216 -10897 -7028 9706 17099 9509 7512 10614 7511 4569 4041 -3262 -8567
19675 -8567 -4124 -10362 -12495 -11103 -9988 -8247 -7604 -7936 -6894 -5704 -3217 -7035 -7749 -3815 -1287
19660 -1287 -10538 -23759 -24882 -16649 -12106 -8212 -17336 -21317 -18186 -10183 -11085 -18268 -13276 -4396 5071
$$ packed form
19764a286L365o522j7441q142N47M482J5648Q080k057J1700J631j6480j1616Q407
19750i684L53j0708p314R59Q587R638M846L642K894M25N7r98n8O87k686n549K577
19733b332q971k027L580L637Q909K619r91j4299J858r583o995J4105M481o036
19719a2045J0944Q008o233j113M419K288l91o530j0979r035m463J558O983J2664
19705c925P518n208q736m976J4j476R03K424O916j930j2070k667k616j083M919
19690b1993M849M698p70K319L869J6734P393p590j997L102l103k942n28p303n305
19675h567M443o238k133J392J115J741O43l32J042J190K487l818p14L934K528
19660a287r251j3221j123Q233M543L894r124l981L131Q003r02p183M992Q880R467
$$ plain form
19645 5071 5396 5627 -9171 -17474 -8740 -5915 -829 -10781 -15836 -10767 -13594 -9623 -2322 -788 573
19630 573 -1329 -7634 -7718 -5025 -6298 -410 -1585 893 -1435 -8543 -1645 -1175 -9556 -7711 -5591 -9169
19614 -9169 -10192 707 5661 7440 4258 -7015 -3869 -2604 3714 7391 6482 -15 -1984 419
19600 419 -1952 -3244 -11026 -11560 -6314 7535 17849 7584 -4183 -36 832 -1128 -5502 -9748
19586 -9748 -3581 3975 11400 4631 8764 10706 16693 9637 7312 -1804 -8210 -2220 8868 7289
19572 7289 7769 8909 8756 -5851 -8142 -996 1962 3892 -1257 -8706 -9782 -1385 861 -8877 -9969
19557 -9969 160 3016 -2857 356 9909 8651 -3391 -4677 -4101 -4488 675 3474 -8838 -14961
19543 -14961 -8708 -7491 -15627 -13628 -6546 3906 2892 -6146 -12387 -11054 2245 1232 -6193 -11049
$$ packed form
19645E071L25K31j4798q303Q734K825N086r952n055N069k827L971P301J534J361
19630E73j902o305q4K693j273N888j175K478k328p108O898M70q381J845K120l578
19614i169j023J0899M954J779l182j1273L146J265O318L677r09o497j969K403
19600D19k371j292p782n34N246J3849J0314j0265j1767M147Q68j960m374m246
19586i748O167P556P425o769M133J942N987p056k325r116o406N990J1088j579
19572G289M80J140j53j4607k291P146K958J930n149p449j076Q397K246r738j092
19557i969J0129K856n873L213R553j258j2042j286N76l87N163K799j2312o123
19543a4961O253J217q136J999P082J0452j014r038o241J333J3299j013p425m856
$$ plain form
19529 -11049 -9687 -8435 -9348 2403 12670 2669 3869 9161 9302 12678 10147 352 -12652 -12754
19515 -12754 -15110 -12642 -24978 -36330 -29697 -23587 -6267 7933 9554 4971 3399 3533 -6480
19502 -6480 -12028 -8917 -13624 -23184 -16136 -11085 -12725 -11055 -10824 -11441 -12826 -20395 -14281 -10825 -11787
19487 -11787 -8358 -8980 -5491 -2203 473 -8433 -4454 5002 -2156 -8501 -13629 -18910 -17712 -19728 -18135
19472 -18135 -14582 -10964 -7897 -1033 4123 -660 2485 6520 16905 22095 17281 13113 6181 2845
19458 2845 -997 1277 -1300 4826 6106 14642 23714 40810 58459 67105 74055 63870 53889 70404
19444 70404 105774 139526 132717 100143 71030 59474 72334 75021 58479 33260 18243 7905
19432 7905 6775 2207 4059 -1656 84 3837 -6595 -5810 -3738 -6028 -3138 -8565 -8777 -4676 3413
$$ packed form
19529a1049J362J252r13J1751J0267j0001J200N292J41L376k531r795j3004j02
19515a2754k356K468j2336j1352O633O110J7320J4200J621m583j572J34j0013
19502f480n548L111m707r560P048N051j640J670K31o17j385p569O114L456r62
19487a1787L429o22L489L288K676q906L979R456p158o345n128n281J198k016J593
19472a8135L553L618L067O864N156m783L145M035J0385N190m814m168o932l336
19458B845l842K274k577O126J280Q536R072J7096J7649Q646O950j0185r981J6515
19444G0404L5370L3752o809l2574k9113j1556J2860K687j6542k5219j5017j0338
19432G905j130m568J852n715J740L753j0432P85K072k290K890n427k12M101Q089
$$ plain form
19417 3413 8964 5326 11227 15991 11872 17445 18023 16624 8380 2172 3589 -3929 -14491 -13554 -2788
19402 -2788 -1131 2286 2563 -5789 88 14807 5708 -7571 -1971 -4760 -2165 -3087 1150 -3147 -3487
19387 -3487 -2598 5304 7744 6196 2177 3105 5786 5566 5946 -4969 -12628 -7868 164 -1030 1412
19372 1412 3114 3756 10985 15545 8199 -1511 -8640 -9870 -3462 6558 4186 -2054 5556 5457 -2718
19357 -2718 -7138 -5445 6645 8907 3290 164 -5743 -860 1 -8438 -13917 -11338 -8092 -14617 -22525
19342 -22525 -19838 -11145 -4924 -7429 -13384 -2905 -2331 -11845 -13875 -9526 -5083 -6397 -9556 -9424 -4953
19327 -4953 2980 693 -625 -6791 -8573 -8663 -3997 -936 -4423 -7747 -8645 -13903 -19782 -14964 -3761
19312 -3761 -154 632 2674 5425 -1870 -1160 13279 5032 -3864 -4182 -3185 -87 1662 5382 1271
$$ packed form
19417C413N551l638N901M764m119N573N78j399q244o208J417p518j0562R37J0766
19402b788J657L417K77q352N877J4719r099j3279N600k789K595r22M237m297l40
19387c487Q89P902K440j548m019R28K681k20L80j0915p659M760Q032j194K442
19372A412J702O42P229M560p346r710p129j230O408J0020k372o240P610r9q175
19357b718m420J693J2090K262n617l126n907M883Q61q439n479K579L246o525p908
19342b2525K687Q693O221k505n955J0479N74r514k030M349M443j314l159J32M471
19327d953P933k287j318o166j782r0M666L061l487l324q98n258n879M818J1203
19312c761L607P86K042K751p295P10J4439q247q896l18R97L098J749L720m111
$$ plain form
19297 1271 -5606 -6573 -2237 5352 4938 5498 -5197 -4848 1408 4934 26 -5093 -9356 -5093 -853
19282 -853 -8096 -11332 -8368 -2542 -2883 -5712 -4334 -7612 -15854 -14937 -11260 -14860 -12552 -15236 -22361
19267 -22361 -13657 -8510 -11139 -6490 -1145 10101 10523 5123 10278 10522 12608 10477 8712 9107 10413
19252 10413 12501 10738 8827 3005 -5976 -1267 -3572 -3212 -7482 -8335 -6556 -6453 -3527 -6219 -7232
19237 -7232 -5076 -8452 -4211 -183 -4290 -3931 2037 5381 4416 5444 5203 7834 10937 1240 6123
19222 6123 6215 -841 -9391 -6179 1391 397 6717 8744 14789 3917 -958 5983 8034 -5947 -9883
19207 -9883 -4494 -2789 -3095 -3581 -3313 -7220 -3433 35 -11114 -2700 8675 8363 6011 6760 -9076
19192 -9076 -20988 -17722 -2500 -9038 -17128 -23745 -21733 -12806 -12657 -7343 -9688 -8472 -6876 -10881
$$ packed form
19297A271o877r67M336P589m14N60j0695L49O256L526m908n119m263M263M240
19282h53p243l236K964N826l41k829J378l278q242R17L677l600K308k684p125
19267b2361Q704N147k629M649N345J1246M22n400N155K44K086k131j765L95J306
19252A0413K088j763j911n822q981M709k305L60m270q53J779J03K926k692j013
19237g232K156l376M241M028m107L59N968L344r65J028k41K631L103r697M883
19222F123R2p056q550L212P570r94O320K027O045j0872m875O941K051j3981l936
19207i883N389J705l06m86K68l907L787L468j1149Q414J1375l12k352P49j5836
19192i076j1912L266J5222o538q090o617K012Q927J49N314k345J216J596m005
$$ plain form
19178 -10881 -12689 -4397 1851 2804 -8138 -12585 -15870 -8471 -3990 2895 2509 483 -8571 -1821 2325
19163 2325 757 8334 10219 2702 -2553 -252 10526 8920 -5417 -12345 -12169 -7567 -13413 -24238
19149 -24238 -18991 -17474 -11300 -7524 -8863 -10362 -6015 -2362 2488 679 -953 -513 2170 -1317 -668
19134 -668 3961 -4689 -6187 -7635 -2455 7222 6367 4892 2792 -10436 -12668 -8402 -12536 -3406 -10209
19119 -10209 -3277 46 -8444 -12527 -24138 -34948 -29102 -19757 -6239 2533 4044 2748 6575 10962
19105 10962 -644 -9156 -9251 -3695 -2976 -4183 -5418 -15954 -22148 -18467 -18150 -18278 -15577 -10926 -9633
19090 -9633 -9808 -9649 -9011 -4093 -6458 -3220 -277 -7921 -15142 -13470 -4239 -3578 -2592 -1657 2371 9774
19074 9774 12030 1400 538 3531 3377 -3529 -7046 -1569 2444 6232 15330 14357 9963 7901 9076
$$ packed form
19178a0881j808Q292O248R53j0942m447l285P399M481O885l86k026r054O750M146
19163B325j568P577J885p517n255K301J0778j606j4337o928J76M602n846j0825
19149b4238N247J517O174L776j339j499M347L653M850j809j632M40K683l487O49
19134f68M629q650j498j448N180R677q55j475k100j3228k232M266m134R130o803
19119a0209O932L323q490m083j1611j0810N846R345J3518Q772J511j296L827M387
19105A0962j1606q512r5N556P19j207j235j0536o194L681L17j28K701M651J293
19090i633j75J59O38M918k365L238K943p644p221J672R231O61R86R35M028P403
19074I774K256j0630q62K993j54o906l517N477M013L788R098r73m394k062J175
$$ plain form
19059 9076 4705 3790 15173 17531 8846 10721 120 472 -2433 -5133 4386 6170 343 -5786 -9651
19044 -9651 -5466 -7221 -187 -314 -11198 -14033 -2570 3857 4818 4215 -4083 -2994 -848 -4401 1511
19029 1511 9092 4301 6864 12537 9016 11848 3162 -4741 261 -2198 -1587 -1822 -1998 -3235 -11643
19014 -11643 -9579 -6102 -7077 -5921 4023 7218 314 -486 3648 8343 6485 -2674 -8826 -12555 -8370
18999 -8370 285 8214 13833 604 -3285 -2011 6521 3739 1287 -4456 -2898 4400 3455 -5231 -10700
18984 -10700 -10034 -10832 -16627 -14549 -11823 -4677 -7911 -13346 -5679 -7793 -16970 -11772 -14754 -2915 10809
18969 10809 7103 10457 10229 3699 2989 1805 4514 7517 5247 -75 1778 275 -1544 -2140 4668
18954 4668 -8114 -17018 -18147 -9528 -11282 -8807 -6594 -10562 -3681 1989 -4432 -2092 -6869 -6984 -6699
$$ packed form
19059I076m371r15J1383K358q685J875j0601L52k905k700R519J784n827o129l865
19044i651M185j755P034j27j0884k835J1463O427R61o03q298J089K146l553N912
19029A511P581m791K563N673l521K832q686p903N002k459O11k35j76j237q408
19014a1643K064L477r75J156R944L195o904q00M134M695j858r159o152l729M185
18999h370Q655P929N619j3229l889J274Q532k782k452n743J558P298r45q686n469
18984a0700O66p98n795K078K726P146l234n435P667k114r177N198k982J1839J3724
18969A0809l706L354k28o530p10j184K709L003k270n322J853j503j819n96O808
18954D668j2782q904j129Q619j754K475K213l968O881N670o421K340m777j15K85
$$ plain form
18939 -6699 -11320 -17106 -16601 -1442 -988 -2416 4267 8455 8529 11326 8968 11294 14839 14309 7716 -946
18923 -946 -8113 -13850 -9795 -3228 -5847 -11338 -14098 -12991 -16620 -10535 -6080 -8783 -9744 -5946 -2859
18908 -2859 -11779 -14012 -15874 -16303 -12923 -6341 1456 -8296 -5465 -2719 -6857 -9275 -6219 506 -1832
18893 -1832 1338 2421 -3595 -4139 4458 2244 -8586 -8687 -6853 -6818 -4269 6689 7050 2327 -6281
18878 -6281 -17045 -22138 -24824 -20229 -6876 -2359 -10107 -8514 -2411 -4438 -4385 3182 4998 -6517
18864 -6517 -6804 750 5415 4047 15058 10909 2481 4890 8926 4047 -5196 -4934 5489 1856 7319
18849 7319 7009 4491 6007 5411 7817 4547 3978 8370 8972 5519 -2544 -7701 3565 5572 -9437
18834 -9437 -13009 -12528 -10730 874 1588 -7942 -13728 -12888 -4792 -2763 -9472 -1768 -3238 -2016 -1482
$$ packed form
18939f699m621n786N05J5159M54j428O683M188P4K797k358K326L545n30o593q662
18923i46p167n737M055O567k619n491k760J107l629O085M455k703r61L798L087
18908b859q920k233j862m29L380O582P797r752K831K746m138k418L056O725k338
18893a832L170J083o016n44Q597k214j0830j01J834L5K549J0958L61m723q608
18878f281j0764n093k686M595J3353M517p748J593O103k027N3P567J816j1515
18864f517k87P554M665j368J1011m149q428K409M036m879r243K62J0423l633N463
18849G319l10k518J516n96K406l270n69M392O02l453q063n157J1266K007j5009
18834i437l572M81J798J1604P14r530n786Q40Q096K029o709P704j470J222N34
$$ plain form
18819 -1482 442 -4499 -9601 -3710 564 -3332 -703 -1469 4799 10782 5202 -2331 538 3124 -408
18804 -408 3781 5068 -6519 -13629 -13280 -21560 -33186 -31501 -18315 -12724 -8922 -2541 2133 -1820
18790 -1820 3761 1314 -4442 -9664 -20458 -23789 -22308 -24794 -16938 -13125 -13685 18 8587 6989
18776 6989 6703 -275 -99 10691 21870 27509 33380 50808 83456 119425 124486 77852 44780
18763 44780 31209 19170 16422 7421 -8717 -17861 -23453 -16423 -8290 -1204 -1881 -376 -2967 -7529
18749 -7529 -7795 -9810 -10555 -16577 -16842 -17070 -4098 -1625 -3300 -1750 -5880 -3124 -1455 -10191 -20618
18734 -20618 -21727 -17024 -16988 -18880 -15786 -19567 -17342 -12466 -17701 -13306 -8481 -135 7765 6369 9406
18719 9406 4121 1374 -7741 -9189 -5356 -1236 -3704 -7136 -5748 -1219 2528 -874 -14212 -5343
$$ packed form
18819a482J924m941n102N891M274l896K629p66O268N983n580p533K869K586l532
18804d08M189J287j1587p110L49q280j1626J685J3186N591L802O381M674l953
18790a820N581k447n756n222j0794l331J481k486P856L813n60J3703Q569j598
18776F989k86o978J76J0790J1179N639N871J7428L2648L5969N061m6634l3072
18763D4780j3571j2039k748r001j6138r144n592P030Q133P086o77J505k591m562
18749g529k66k015p45o022k65k28J2972K473j675J550m130K756J669q736j0427
18734b0618j109M703L6j892L094l781K225M876n235M395M825Q346P900j396L037
18719I406n285k747r115j448L833M120k468l432J388M529L747l402j3338Q869
$$ plain form
18705 -5343 -2003 -2475 5220 13104 11752 5279 -346 -4833 -3352 -6936 -15807 -33122 -33423 -17545 -14550
18690 -14550 -21529 -24379 -15437 -3442 1284 -3107 -6516 -13940 -3555 3193 5908 2518 -1939 -9399
18676 -9399 -4748 -6522 -9540 -19653 -18116 -7960 -14845 -13331 -6590 5173 -2966 -13104 -7996 -6987
18662 -6987 -13163 -4648 -3340 -11426 -10702 -8663 -13742 -3241 10802 7907 -1373 -4276 461 -3696
18648 -3696 -10455 -7588 -9154 -12823 -14816 -11693 -7689 -12412 -9755 -10787 -3071 -2666 1471 3351 340
18633 340 5129 5270 -600 -3626 -5487 -12586 -9515 -8095 -7757 -6828 -5719 3841 -1286 -517 -10780 -18948
18617 -18948 -9028 -3865 468 1017 4035 1017 -2047 -10573 -10698 -4595 -15401 -19916 -18427 -17235 -10120
18602 -10120 -2061 3617 10310 -5846 -18431 -26236 -22627 -19345 -25306 -19406 -7831 1398 5475 1111
$$ packed form
18705e343L340m72P695P884j352o473n625m487J481l584q871j7315l01J5878K995
18690a4550o979k850Q942J1995M726m391l409p424J0385O748K715l390m457p460
18676i399M651j774l018j0113J537J0156o885J514O741J1763q139j0138N108J009
18662f987o176Q515J308q086P24K039n079J0501J4043k895r280k903M737m157
18648c696o759K867j566l669j993L123M004m723K657j032P716M05M137J880l011
18633C40M789J41n870l026j861p099L071J420L38R29J109R560n127P69j0263q168
18617a8948R920N163M333N49L018l018l064q526j25O103j0806m515J489J192P115
18602a0120Q059N678O693j6156j2585p805L609L282n961N900J1575R229M077m364
$$ plain form
18588 1111 3576 -2766 -5857 -6787 -7829 -2893 -361 -7048 -9544 -6758 -1645 -4512 1534 8367 3430
18573 3430 -2239 -1294 7202 11018 3846 -1213 -841 -1173 13363 15311 13284 10412 8099 7710 -3780
18558 -3780 -4969 -2744 3571 9928 13994 6755 -9063 -2145 -2802 -12276 -12942 -8464 -7852 -5480 -1966
18543 -1966 -2537 5857 9402 11889 16647 15014 9796 926 -3182 -1666 1641 -1946 -18912 -19421 -9805
18528 -9805 -1893 3926 5132 -3164 223 9346 608 -4823 5025 7531 6413 3552 4838 2103 8999
18513 8999 2212 11245 18283 27609 29716 25510 10794 2259 -1565 -6344 -10981 -10678 -10854 -5524 -8220
18498 -8220 -13129 -12398 -6390 3404 5051 8428 3696 6799 14215 13641 17013 21283 19811 17960 15882
18483 15882 10506 14011 10055 9042 15582 9158 -2315 -11871 -6876 4011 2875 -677 3670 2778
$$ packed form
18588A111K465o342l091r30j042M936K532o687k496K786N113k867O046O833m937
18573C430n669R45Q496L816p172n059L72l32J4536J948k027k872k313l89j1490
18558c780j189K225O315O357M066p239j5818O918o57r474o66M478O12K372L514
18543a966n71Q394L545K487M758j633n218q870m108J516L307l587j6966n09R616
18528i805P912N819J206q296L387R123q738n431R848K506j118k861J286k735O896
18513H999o787R033P038R326K107m206j4716q535l824m779m637L03j76N330k696
18498h220m909P31O008R794J647L377m732L103P416n74L372M270j472j851k078
18483A5882n376L505l956j013O540o424j1473r556M995J0887j136l552M347q92
$$ plain form
18469 2778 -2371 642 8883 7879 15228 10779 5034 5087 -2611 -4496 -2740 -5294 -7957 -11046 -9872
18454 -9872 -10378 -14490 -9606 -3098 -4049 -12015 -13852 -11510 -5273 -9029 -9604 -7937 -8975 -9833 -4093 -628
18438 -628 -4620 -6188 -1632 5530 9694 -2098 -8455 -3144 483 -1541 -2685 -12786 -15630 -11734
18424 -11734 -6248 8915 5908 -5422 -10633 -23900 -20863 -10836 -6611 -759 3961 1850 1490 4865
18410 4865 654 -2948 2480 8628 845 -9263 -6687 360 4397 83 2552 2617 -3038 -13611 -11316
18395 -11316 -17068 -9568 -1333 -9176 -6267 -6331 -469 -5137 -7142 -5446 -9739 -9223 -2670 -3613 -8446
18380 -8446 -4891 -2504 5484 3329 -4480 -11695 -14299 1701 15392 12114 -1393 -8721 -9374 -2151
18366 -2151 10259 8152 5031 481 7464 14261 5782 5827 12109 8670 2479 914 4694 3439 5357
$$ packed form
18469B778n149L013Q241j004P349m449n745N3p698j885J756k554k663l089J174
18454i872n06m112M884O508r51p966j837K342O237l756n75J667j038q58N740L465
18438f28l992j568M556P162M164j1792o357N311L627k024j144j0101k844L896
18424a1734N486J5163l007j1330n211j3267L037J0027M225N852M720k111l60L375
18410D865m211l602N428O148p783j0108K576P047M037m314K469O5n655j0573K295
18395a1316n752P500Q235p843K909o4N862m668k005J696m293N16O553r43m833
18380h446L555K387P988k155p809p215k604J6000J3691l278j3507p328o53P223
18366b151J2410k107l121m550O983O797q479M5O282l439o191j565L780j255J918
$$ plain form
18351 5357 -1005 -4724 -7161 -6539 727 10317 3012 -680 -5585 -3409 -1185 -1493 4985 2272 2724
18336 2724 2407 2205 3536 3814 1560 -4762 -1945 7794 10552 6344 9340 5460 3358 5878 9071
18321 9071 13249 18068 17335 13681 6308 4317 5622 2947 5557 13813 10781 13666 21680 11044 -4239
18306 -4239 -2692 12641 10577 8264 1817 -5961 -6422 1667 6784 -6847 -8171 -9492 -11883 -4797
18292 -4797 5551 11426 12962 7775 4764 5449 -2347 587 3357 5699 16698 15427 9609 9629 2526
18277 2526 -2467 -18756 -12143 -5532 -11977 -9686 3737 11974 2084 -495 1143 -521 -6234 -18494
18263 -18494 -24850 -32117 -28004 -24177 -14938 -6401 -2595 4445 8963 3761 4344 3639 -1572 -6116 -17649
18248 -17649 -10060 -14397 -8599 912 1463 -6747 -10261 -14766 -8771 -8217 -20460 -27785 -29274 -18693
$$ packed form
18351E357o362l719k437O22P266R590p305l692m905K176K224l08O478k713M52
18336B724l17k02J331K78k254o322K817R739K758m208K996l880k102K520L193
18321I071M178M819p33l654p373j991J305k675K610Q256l032K885Q014j0636j5283
18306d239J547J5333k064k313o447p778m61Q089N117j3631j324j321k391P086
18292d797J0348N875J536n187l011O85p796K934K770K342J0999j271n818K0p103
18277B526m993j6289O613O611o445K291J3423Q237r890k579J638j664n713j2260
18263a8494o356p267M113L827R239Q537L806P040M518n202N83p05n211m544j1533
18248a7649P589m337N798R511N51q210l514m505N995N54j2243p325j489J0581
$$ plain form
18234 -18693 3204 24994 34080 24055 21074 21192 15164 5539 1556 4647 2583 9742 1952 2658
18220 2658 4624 5620 3528 -1132 -3297 -5332 -428 5407 10354 783 1505 1134 -8238 -9025 575 8126
18204 8126 -6474 -15711 -14511 -1922 -4737 -14589 -19537 -22984 -21743 -20385 -17975 -4308 -2547 1955
18190 1955 12227 9793 2240 -4482 -12220 -12179 -3604 5489 1058 -837 -826 3499 8784 5040 -5159
18175 -5159 -8755 -14767 -18055 -11854 -18 3767 -2579 -1877 11641 20963 25992 26676 15412 3948
18161 3948 1194 -2980 -8624 6137 10108 4895 14830 27748 40510 40214 29317 5054 -6983
18148 -6983 -593 7483 18586 27358 31696 43325 54928 62419 60438 53258 59147 73067 66873 59030
18134 59030 61161 62992 68310 75359 90794 112647 122580 128911 140692 147964 144532 160997 193067
$$ packed form
18234a8693K1897K1790R086j0025k981J18o028r625l983L091k064P159p790P06
18220B658J966R96k092m660k165k035M904N835M947r571P22l71r372p87R600P551
18204H126j4600r237J200J2589k815r852m948l447J241J358K410J3667J761M502
18190A955J0272k434p553o722p738M1Q575R093m431j895J1M325N285l744j0199
18175e159l596o012l288O201J1836L785o346P02J3518R322N029O84j1264j1464
18161C948k754m174n644J4761L971n213R935J2918J2762k96j0897k4263j2037
18148f983O390Q076J1103Q772M338J1629J1603P491j981p180N889J3920o194p843
18134E9030K131J831N318P049J5435K1853R933O331J1781P272l432J6465L2070
$$ plain form
18121 193067 235014 287291 350711 437885 556280 704058 951263 1336405 1905126 2843537
18111 2843537 4524414 7625815 13112780 20935946 24556856 18560505 10388070 5783903
18103 5783903 3591948 2445455 1784821 1395152 1137850 932195 760162 633785 554806
18094 554806 491706 425349 362810 327540 279174 229255 196909 165313 150585 140561 130510
18083 130510 117392 115454 107131 100826 85772 75536 71946 67252 52513 45784 44666 50944 60328
18070 60328 61033 59596 57710 53703 40671 31930 39330 41601 40127 36585 32777 24814 29220 31469
18056 31469 24623 17266 14232 17658 23922 22256 25201 27555 26441 24496 10727 11316 11410 14376 4113
18041 4113 -872 4539 12348 12317 14265 14593 16870 17799 6842 -13462 -20298 -17727 -8691 5593 11331
$$ packed form
18121A93067M1947N2277O3420Q7174J18395J47778K47205L85142N68721R38411
18111B843537J680877L101401N486965P823166L620910n996351q172435m604167
18103E783903k191955j146493o60634l89669k57302k05655j72033j26377p8979
18094E54806o3100o6357o2539l5270m8366m9919l2346l1596j4728j0024j0051
18083A30510j3118j938q323o305j5054j0236l590m694j4739o729j118O278R384
18070F0328P05j437j886m007j3032q741P400K271j474l542l808p963M406K249
18056C1469o846p357l034L426O264j666K945K354j114j945j3769N89R4K966j0263
18041D113m985N411P809l1J948L28K277R29j0957k0304o836K571R036J4284N738
$$ plain form
18026 11331 13310 5821 -1955 1291 -634 3278 4538 4 3085 8544 5265 -2246 4087 18569
18012 18569 15963 6949 4242 -5126 -9129 -5095 -1192 4443 5204 5327 5079 8319 11323 219 -80
17997 -80 2835 4093 -10304 -7776 -13315 -17489 -14635 -8865 -10177 -10894 -5229 -12703 -7516 -4615 -2553
17982 -2553 -6292 416 1552 216 14097 25389 25566 16859 7536 4917 16909 25369 16797 14376
17968 14376 13817 17074 21799 16505 8504 -3750 5144 11646 8593 3426 9133 1899 -3616 -9073
17954 -9073 -5847 1092 2733 5119 5848 7246 1241 807 -7526 -8636 -5132 -4130 -1992 804 7359
17939 7359 7175 7387 13530 7238 6844 9081 9076 2798 -2329 -884 4562 6166 -5260 -15962 -6404 -5361
17923 -5361 -5467 3029 7932 5512 -321 -3305 -1493 -3961 -9773 3237 -131 -5597 -2569 3301 5171
$$ packed form
18026A1331J979p489p776L246j925L912J260m534L081N459l279p511O333J4482
18012A8569k606r014k707r368m003M034L903N635P61J23k48L240L004j1104k99
17997h0K915J258j4397K528n539m174K854N770j312p17N665p474N187K901K062
17982b553l739O708J136j336J3881J1292J77q707r323k619J1992Q460q572k421
17968A4376n59L257M725n294q001j2254Q894O502l053n167N707p234n515n457
17954i073L226O939J641K386P29J398o005m34q333j110L504J002K138K796O555
17939G359j84K12O143o292l94K237no278n127J445N446J604j1426j0702R558J043
17923e361j06Q496M903k420n833k984J812k468n812J3010l368n466L028N870J870
$$ plain form
17908 5171 5998 99 -7114 -14445 -13030 -8642 -4597 -4483 -718 5320 8927 -5123 -14499 -3066 5451
17893 5451 -5536 -8871 -3035 -21554 -21073 -11004 -14543 -16553 -15621 -4413 1921 4697 1494 2145
17879 2145 -3615 -1044 -162 -7003 -5962 -7826 -15200 -25542 -27890 -20426 -4665 -1500 -6669 -8871
17865 -8871 -12095 -1886 534 1044 -1830 -10089 -11949 -10341 -16109 -8544 -8949 -11796 -10173 -5058 -11888
17850 -11888 -13036 -11362 -9171 -16307 -18998 -9061 227 5150 10521 11841 8472 5409 -14368 -11036
17836 -11036 -2633 8878 11560 602 -4584 -11010 -8002 -2770 -10218 -16525 -19103 -7763 3589
17823 3589 2411 3187 2952 1463 10749 8847 -542 3871 8644 6532 6895 3052 3427 6487 -5352
17808 -5352 -18292 -11147 -10260 -9991 -12171 -11034 -9040 -7545 -2307 12834 11608 6481 -4360 -13412
$$ packed form
17908E171Q27n899p213p331J415M388M045J14L765O038L607j4050r376J1433Q517
17893E451j0987l335N836j8519M81J0069l539k010R32J1208O334K776l203O51
17879B145n760K571Q82o841J041j864p374j0342k348P464J5761L165n169k202
17865h871l224J0209K420N10k874q259j860J608n768P565m05k847J623N115o830
17850a1888j148J674K191p136k691R937R288M923N371J320l369l063j9777L332
17836a1036Q403J1511K682j0958n186o426L008N232p448o307k578J1340J1352
17823C589j178P76k35j489R286j902r389M413M773k112L63l843L75L060j1839
17808e352j2940P145Q87K69k180J137J994J495N238J5141j226n127j0841r052
$$ plain form
17794 -13412 -16092 -12558 -9295 -12475 -22811 -16212 -7390 -5888 -5408 -5489 -5162 -4891 -2672 4294 -2346
17779 -2346 -1187 -10917 -8076 -6045 -2534 -7347 -4361 3156 4675 7833 19473 23325 22798 12492
17765 12492 14694 5121 -4615 -9610 -19653 -13508 -11451 -10241 -11147 -12213 -2116 8837 6700 5477
17751 5477 -4389 -3222 -3282 -1304 -4803 -11547 -13578 -701 4260 5977 2122 8 7466 14527 5070
17736 5070 6205 8045 13734 16151 4390 -7127 -1586 6347 4461 11674 14886 13088 13525 18245
17722 18245 20519 16411 28361 38628 45037 58030 75025 89077 101670 123166 174860 257313
17710 257313 382571 499272 560595 583569 646717 780106 947752 968211 812616 650617
17700 650617 576218 563874 523358 404939 285233 199816 134995 105376 84479 59320 51782
$$ packed form
17794a3412k680L534L263l180j0336O599Q822J502M80q1L27K71K219O966o640
17779b346J159r730K841K031L511m813K986P517J519L158J1640L852n27j0306
17765A2492K202r573r736m995j0043O145K057J210r06j066J0097J0953k137j223
17751E477r866J167o0J978l499o744k031J2877M961J717l855k114P458P061r457
17736E070J135J840N689K417j1761j1517N541P933j886P213L212j798M37M720
17722A8245K274m108J1950J0267O409J2993J6995J4052J2593K1496N1694Q2453
17710B57313J25258J16701O1323K2974O3148J33389J67646K0459j55595j61999
17700F50617p4399j2344m0516j18419j19706q5417o4821k9619k0897k5159p538
$$ plain form
17689 51782 48059 41903 32916 28713 26212 19922 27405 27225 22180 23453 18306 12451 11000 8755 2882
17674 2882 -3336 -4092 -3079 -614 -25 -7799 -16165 -7218 7645 12942 11701 3236 8268 5158 -7482
17659 -7482 -15012 -14304 -9643 1002 -5046 -13859 -18413 -21364 -12233 -28 5551 6036 -3077 -8074 -16301
17644 -16301 -10008 5601 5932 13182 8272 2712 -3641 -8681 1086 922 778 -4728 -5014 -7254 -2409
17629 -2409 -520 9348 7633 2686 -620 -3518 -7457 -2871 3268 1181 3052 9195 12813 10929 8719
17614 8719 9661 7431 7197 7553 9208 9567 15648 23082 25131 17812 13083 17895 21434 19218 16644 1219
17598 1219 -2143 2977 4576 1840 783 1854 1063 10727 5384 1587 -4123 -6902 2482 3742 -4009
17583 -4009 92 704 -361 2476 8652 6432 -2315 -7555 -2028 6925 15229 8418 960 -2739 -124
$$ packed form
17689E1782l723o156q987m203k501o290P483j80n045J273n147n855j451k245n873
17674B882o218p56J013K465N89p774q366Q947J4863N297j241q465N032l110j2640
17659g482p530P08M661J0645o048q813m554k951R131J2205N579M85r113m997q227
17644a6301O293J5609L31P250m910n560o353n040R767j64j44n506k86k240M845
17629b409J889R868j715m947l306k898l939M586O139k087J871O143L618j884k210
17614H719R42k230k34L56J655L59O081P434K049p319m729M812L539k216k574j5425
17598A219l362N120J599k736j057J071p91R664n343l797n710k779R384J260p751
17583d009M101O12j065K837O176k220q747n240N527Q953Q304o811p458l699K615
$$ plain form
17568 -124 3887 7013 8448 11581 2508 1127 -7495 -20945 -18847 -17237 -28308 -28820 -23213 -25201 -21624
17553 -21624 -17186 -20191 -18633 -10472 -12094 -8729 -5386 -729 6859 7825 11990 10232 5189 -2884 1802
17538 1802 -4928 -14318 -17965 -20891 -24642 -15104 -6223 -5053 -8253 -8773 -12763 -10900 3405 15570
17524 15570 11559 5169 -6762 -11147 -12005 -8655 3077 16902 20128 16969 11606 3169 -1074 -572
17510 -572 3020 1586 -10810 -9345 -14505 -15208 -4041 7440 10411 2097 1384 -2139 -6631 -2146 2562
17495 2562 -3206 -11554 -4998 8530 10605 11267 15905 18111 16206 15846 15882 14785 10072 1266 -911
17480 -911 -6974 6724 17728 19726 18803 21401 7647 4374 9357 7671 8830 337 343 -3446 2541
17465 2541 9915 5855 1152 -1048 -2404 -4681 -12083 -6641 -5792 533 8091 10273 22086 32435
$$ packed form
17568a24M011L126J435L133r073j381q622j3450K098J610j1071n12N607j988L577
17553b1624M438l005J558Q161j622L365L343M657P588R66M165j758n043q073M686
17538A802o730r390l647k926l751R538Q881J170l200n20l990J863J4305J2165
17524A5570m011o390j1931m385q58L350J1732J3825L226l159n363q437m243N02
17510e72L592j434j2396J465n160p03J1167J1481K971q314p13l523m492M485M708
17495B562n768q348O556J3528K075O62M638K206j905l60L6j097m713q806k177
17480i11o063J3698J1004J998r23K598j3754l273M983j686J159q493Ol789N987
17465B541P374m060m703k200j356k277p402N442Q49O325P558K182J1813J0349
$$ plain form
17451 32435 34760 32880 31868 37561 37776 27438 19649 32595 44287 65380 112744 151046 128425
17438 128425 74162 40646 37814 33272 25671 17192 22146 26721 37232 29949 28425 40709 46466
17425 46466 64698 89674 144224 220776 286089 330608 383183 456596 449010 374425 312560 273013
17413 273013 225885 173205 126152 95058 78160 58819 54997 43612 38039 41109 42155 50866
17401 50866 43430 40275 38077 38138 29545 40701 43292 44831 44050 37652 18124 15170 24028 27898 27892
17386 27892 18059 19615 25877 26298 26238 19456 18707 20893 22764 36739 43933 57138 66019 79139 83638
17371 83638 96962 116868 133628 136597 95003 97392 112731 111726 100668 73471 64102 61786 53758
17358 53758 40505 32741 36188 31402 27413 19385 20777 18232 17460 13649 8894 13826 18647 12814
$$ packed form
17451C2435K325j880j012N693K15j0338p789J2946J1692K1093M7364L8302k2621
17438A28425n4263l3516k832m542p601q479M954M575J0511p283j524J2284N757
17425D6466J8232K4976N4550P6552O5313M4519N2575P3413p586p4585o1865l9547
17413B73013m7128n2680m7053l1094j6898j9341l822j1385n573L070J046Q711
17401E0866p436l155k198O1q593J1156K591J539p81o398j9528k954Q858L870o
17386B7892r833J556O262M21o0o782p49K186J871J3975P194J3205Q881J3120M499
17371H3638J3324J9906J6760K969m1594K389J5339j005j1058k7197r369k316q028
17358E3758j3253p764L447m786l989q028J392k545p72l811m755M932M821n833
$$ plain form
17344 12814 7867 5408 5577 8037 16923 22441 37791 40511 49754 57820 76845 96441 104813 117427
17330 117427 146990 170643 162797 129952 107835 100844 88305 56976 35965 25143 18364 19970
17318 19970 36481 42711 34465 38570 48465 69212 86655 86822 91827 105321 142824 190794 221006
17305 221006 233388 246782 289821 346240 342314 259699 195814 188413 175273 133488 81698 55278
17293 55278 46138 37677 39531 49111 57178 59864 73545 98395 120592 140264 146731 161515 201766
17280 201766 211656 182374 137304 120904 114270 87355 58379 43702 38248 21195 1834 -20477
17268 -20477 -25064 -16169 -3643 1972 -11862 -20174 -19254 -11096 1061 4299 5246 4444 -6599 -17129
17254 -17129 -28953 -38103 -33347 -29269 -42306 -59690 -49828 -25744 -5290 15556 11330 11219 46073
$$ packed form
17344A2814m947k459J69K460Q886N518J5350K720R243Q066J9025J9596Q372J2614
17330A17427K9563K3653p846l2845k2117o991j2539l1329k1011j0822o779J606
17318A9970J6511O230q246M105R895K0747J7443J67N005J3494L7503M7970L0212
17305B21006J2382J3394M3039N6419l926q2615o3885p401j3140m1785n1790k6420
17293E5278r140q461J854R580Q067K686J3681K4850K2197J9672O467J4784M0251
17280B01766R890k9282m5070j6400o634k6915k8976j4677n454j7053j9361k2311
17268b0477m587Q895J2526N615j3834q312R20Q158J2157L238R47q02j1043j0530
17254a7129j1824r150M756M078j3037j7384R862K4084K0454K0846m226j11L4854
$$ plain form
17241 46073 123854 206445 212040 184900 171021 192923 226379 219743 195359 176271 166263 158566
17229 158566 169254 179930 183610 197963 208568 209218 208333 238533 274292 262577 222194 210037
17217 210037 228279 235938 218892 201285 190673 183794 179589 181429 177371 158515 143462 134511 139201
17204 139201 143748 141703 139199 140206 142778 149894 163758 172430 166966 172204 180442 191563 200708 222184
17190 222184 272242 358756 453932 533440 635722 725390 794733 893979 996124 1067817 1058110
17179 1058110 938471 823280 763853 731350 694780 612461 513415 438566 404089 393656 380740
17168 380740 376095 393328 419762 430541 413463 402503 434131 480585 495094 493313 465248 459102
17156 459102 508592 562640 603356 652587 728700 885063 1088796 1264198 1345461 1399363 1546623
$$ packed form
17241D6073P7781Q2591N595k7140j3879K1902L3456o636k4384j9088j0008p697
17229A58566J0688J0676L680J4353J0605O50q85L0200L5759j1715m0383j2157
17217B10037J8242P659j7046j7607j0612o879m205J840m058j8856j5053q951M690
17204A39201M547k045k504J007K572P116J3864Q672n464N238Q238J1121R145K1476
17190B22184N0058Q6514R5176P9508J02282Q9668O9343R9246J02145P1693r707
17179A058110j19639j15191n9427l2503l6570q2319r9046p4849l4477j0433j2916
17168C80740m645J7233K6434J0779j7078j0960L1628M6454J4509j781k8065o146
17156D59102M9490N4048M0716M9231P6113J56363K03733J75402Q1263N3902J47260
$$ plain form
17145 1546623 1813798 2074006 2096776 1949760 1890952 1969826 2094896 2164370 2210667 2318880
17135 2318880 2524210 2839890 3248448 3666716 4137708 4827861 5863069 7300604 9097871
17126 9097871 11507966 15289353 21608939 32331832 49877041 75055120 98766021 105801548
17118 105801548 104483782 117037723 151393068 187967206 181128157 138943592 108938246
17111 108938246 102677824 104847019 93661047 67592025 44033991 29708670 21402264
17104 21402264 16265335 13008489 10921359 9506292 8291293 7068802 5997883 5200492
17096 5200492 4616839 4119754 3607032 3121637 2756733 2502976 2329416 2212938 2167356 2114489
17086 2114489 1988487 1891576 1920859 2066840 2136361 1922995 1628202 1465684 1416210 1386269
$$ packed form
17145A546623K67175K60208K2770j47016n8808P8874J25070O9474M6297J08213
17135B318880K05330L15680M08558M18268M70992O90153J035208J437535J797267
17126I097871K410095L781387O319586J0722893J7545209K5178079K3710901P035527
17118A05801548j317766J2553941L4355345L6574138o839049m2184565l0005346
17111A08938246o260422K169195j1185972k6069022k3558034j4325321q306406
17104B1402264n136929l256846k087130j415067j214999j222491j070919p97391
17096E200492n83653m97085n12722m85395l64904k53757j73560j16478m5582n2867
17086B114489j26002r6911K9283J45981O9521k13366k94793j62518m9474k9941
$$ plain form
17076 1386269 1283599 1114181 942328 803231 733600 697148 655827 609073 539706 481522
17066 481522 452836 435978 432017 403287 365685 344280 328524 309086 309674 307898 295125 299932
17054 299932 294405 283149 268127 268983 279781 283921 279850 274123 274535 283220 292444 293480 288164 279415
17040 279415 288747 330701 377826 376378 331356 316655 338723 365269 328995 257565 209220 196524
17028 196524 173060 138399 111003 108016 112975 110252 109654 116735 113810 96799 90720 87301 76791
17015 76791 64123 64459 74110 82554 72865 51711 48996 51723 60981 64387 62354 63859 52955 45701
17001 45701 35599 42631 34227 21852 10322 721 -1900 10595 41054 64834 78070 66656
16989 66656 72537 132126 179740 191955 183727 166901 170015 172386 156587 141663 135166 136495 141984
$$ packed form
17076A386269j02670j69418j71853j39097o9631l6452m1321m6754o9367n8184
17066D81522k8686j6858l961k8730l7602k1405j5756j9438N88j776j2773M807
17054B99932n527j1256j5022Q56J0798M140m071n727M12Q685R224J036n316q749
17040B79415R332M1954M7125j448m5022j4701K2068K6546l6274p1430m8345j2696
17028A96524k3464l4661k7396k987M959k723n98P081k925j7011o079l419j0510
17015G6791j2668L36R651Q444r689k1154k715K727R258L406k033J505j0904p254
17001D5701j0102P032q404j2375j1530r601k621J2495L0459K3780J3236j1414
16989F6656N881N9589M7614J2215q228j6826L114K371j5799j4924o497J329N489
$$ plain form
16976 141984 136118 132178 123531 110086 92050 77287 73109 80336 102297 114117 115894 114821 119655
16963 119655 120909 117701 122691 116209 98553 83647 80941 81640 82513 66114 45905 37452 33873 40845
16949 40845 48541 48877 40638 42376 48842 51906 53158 60030 46507 40300 42643 43533 50697 62248
16935 62248 53316 40041 41679 50008 51420 52818 53669 40825 35329 39866 40891 41730 29819 25172
16921 25172 30542 29675 26796 20426 14307 17930 28004 34534 26568 18298 19652 23097 24835 26505
16907 26505 17436 11205 21810 25414 23742 26917 26691 22348 26993 35522 31551 25555 27592 21041
16893 21041 12071 5962 7101 6097 10908 20123 24028 26824 21787 17178 10246 3862 -2709 -4312
16879 -4312 -198 11696 22970 23509 19984 24616 21013 21347 28788 37830 35911 30331 27229 27991 28165
$$ packed form
16976A41984n866l940q647j3445j8036j4763m178P227K1961J1820J777j073M834
16963A19655J254l208M990o482j7656j4906k706O99Q73j6399k0209q453l579O972
16949D0845P696L36q239J738O466L064J252O872j3523o207K343Q90P164J1551
16935F2248q932j3275J638Q329J412J398Q51j2844n496M537J025Q39j1911m647
16921B5172N370q67k879o370o119L623J0074O530p966q270J354L445J738J670
16907B6505r069o231J0605L604j672L175k26m343M645Q529l971n996K037o551
16893B1041q970o109J139j004M811R215L905K796n037m609o932o384o571j603
16879d312M114J1894J1274N39l525M632l603L34P441R042j919n580l102P62J74
$$ plain form
16864 28165 35578 47206 45978 43095 27650 11349 8686 15316 14127 2230 -3892 -8493 -2790
16851 -2790 10472 14687 -4621 -17808 -21098 -12446 -9820 -6030 1979 12961 14261 6888 6220 1029
16837 1029 -6866 -2087 -3869 3950 18911 20819 14337 7928 4259 425 -3079 -3824 -5459 -11034 -13318
16822 -13318 -10963 -14005 -17386 -17077 -15058 -10849 -7178 -11595 -9575 -7368 -4392 448 2971 1584 6235
16807 6235 7714 19288 26729 27846 26212 28350 20586 15564 4082 -1350 3893 7791 6199 3383
16793 3383 8744 5682 1413 932 11556 14982 12853 9670 1423 1468 1420 -3473 -7879 -2491 409 10874
16777 10874 13166 10597 8839 17082 18944 17269 9527 -3640 519 2957 8137 4768 15334 10989
16763 10989 -2193 -8134 -644 3381 3661 2091 -2692 1829 4555 8100 3399 2544 3267 -12171 -19532
$$ packed form
16864B8165P413J1628j228k883j5445j6301k663O630j189j1897o122m601N703
16851b790J3262M215j9308j3187l290Q652K626L790Q009J0982J300p373o68n191
16837A029p895M779j782P819J4961J908o482o409l669l834l504p45j635n575k284
16822a3318K355l042l381L09K019M209L671m417K020K207K976M840K523j387M651
16807F235J479J1574P441J117j634K138p764n022j1482n432N243L898j592k816
16793C383N361l062m269m81J0624L426k129l183q247M5m8m893m406N388K900J0465
16777A0874K292k569j758Q243J862j675p742j3167M159K438N180l369J0566m345
16763A0989j3182n941P490M025K80j570m783M521K726L545m701q55P23j5438p361
$$ plain form
16748 -19532 -9136 -3386 6714 15138 14712 16161 12779 14083 12303 4341 -13289 -13546 -16787 -4626
16734 -4626 11223 10344 8025 3076 -2395 -8989 -3509 5029 4370 -8592 -7369 2211 -171 -2139 -863
16719 -863 -4317 -6741 2308 2853 2574 3176 -1865 -4922 -5536 11 -2212 1523 10169 7954 1424 5045
16703 5045 5716 -1078 2057 -1856 -12494 -18523 -17378 -14336 -7219 -10927 -17615 -16136 -13809 -12443 -3225
16688 -3225 -2561 -6532 -14689 -11882 2382 8845 13577 4295 -3767 -8175 -7182 1793 6410 5751 3682
16673 3682 2135 -74 -1109 -9309 -584 7331 550 -2573 -2938 -351 514 -4054 1278 -1349 -12753
16658 -12753 -21384 -16875 -19188 -19297 -14516 -24536 -27152 -11772 2985 -1687 -3116 -3574 -489 -13107
16644 -13107 -16903 -3152 2837 -1209 -2201 5039 -1534 -2004 -3640 3693 -271 2023 6517 -6741
$$ packed form
16748a9532J0396N750J0100Q424m26J449l382J304j780p962j7630k57l241J2161
16734d626J5849q79k319m949n471o594N480Q538o59j2962J223R580k382j968J276
16719h63l454k424R049N45k79O02n041l057o14N547k223L735Q646k215o530L621
16703E045O71o794L135l913j0638o029J145L042P117l708o688J479K327J366R218
16688c225O64l971q157K807J4264O463M732r282q062m408R93Q975M617o59k069
16673C682j547k209j035q200Q725P915o781l123l65K587Q65m568N332k627j1404
16658a2753q631M509k313j09M781j0020k616J5380J4757m672j429m58L085j2618
16644a3107l796J3751N989m046r92P240o573m70j636P333l964K294M494j3258
$$ plain form
16630 -6741 -16609 -15692 -17272 -21435 -22157 -26862 -22840 -9483 -7530 -10058 -13259 -18354 -15559 -13452 -4677
16615 -4677 5792 -5378 -9146 -1241 444 2173 2160 -76 -3171 -7426 -3543 2597 -1553 2560 6108
16600 6108 4021 4669 4530 8771 16213 11423 2547 -4928 -7418 -8733 -18941 -24461 -16787 -790 9870
16585 9870 7407 3832 -1125 -12903 -8396 -3034 3443 4937 -7486 -14361 -3677 5242 633 -3126
16571 -3126 -1381 -5216 -5092 7495 19386 16357 1505 -3739 -7468 -3349 -5134 -2731 -4012 2180
16557 2180 8308 -94 -3780 -7449 -13098 -8679 -1960 -5846 -7622 -8331 -9455 -5860 -7531 -8589 -730
16542 -730 5534 12419 17820 11508 10026 10006 9237 17520 21862 30182 42680 53834 79453 113630 168638
16527 168638 253218 380630 509211 574134 589346 650036 785342 940939 942144 777699 626054
$$ packed form
16630f741r868R17j580m163p22m705M022J3357J953k528l201n095K795K107Q775
16615d677J0469j1170l768P905J685J729j3k236l095m255L883O140m150M113L548
16600F108k087O48j39M241P442m790q876p475k490j315j0208n520P674J5997J0660
16585I870k463l575m957j1778M507N362O477J494j2423o875J0684Q919m609l759
16571c126J745l835J24J2587J1891l029j4852n244l729M119j785K403j281O192
16557B180O128q402l686l669n649M419O719l886j776p09j124L595j671j058P859
16542g30O264O885N401o312j482k0p69Q283M342Q320J2498J1154K5619L4177N5008
16527A68638Q4580J27412J28581O4923J5212O0690J35306J55597J205j64445j51645
$$ plain form
16516 626054 559991 546761 490175 375583 261217 180567 129852 105127 80105 68691 78473
16505 78473 68571 56075 47120 44059 42733 31174 26847 17059 1187 493 3487 3184 1592 3874
16491 3874 7465 9866 8967 11019 12159 12187 12927 7176 7724 12425 10669 4428 -6481 -11178 -4510 -1020
16475 -1020 -11769 -18959 -24403 -28892 -27229 -16537 -8529 -8954 -15545 -15349 -19320 -7769 -7420 -6186 -3875
16460 -3875 -11510 -9155 -16788 -17567 -11924 -8113 2618 981 -54 -4488 -9781 -9427 -6118 -1917 -2090
16445 -2090 720 -1182 6216 2467 -2089 -5118 -8340 -12094 -1759 -2770 -12576 -17821 -2155 5167
16431 5167 22 -13240 -11635 -8013 -9557 -13281 -14989 -17581 -14895 -4986 -8235 -9158 -4545 2178 2982
16416 2982 -3708 -557 -2875 -3839 -11211 -16131 -10688 -5576 -10472 -3263 -10086 -11226 -2500 -129 -4784
$$ packed form
16516F26054o6063j3230n6586j14592j14366q0650n0715k4725k5022j1414R782
16505G8473r902j2496q955l061j326j1559m327r788j5872o94K994l03j592K282
16491C874L591K401q99K052J140K8P40n751N48M701j756o241j0909m697O668L490
16475a020j0749p190n444m489J663J0692Q008m25o591J96l971J1551L49J234K311
16460c875p635K355p633p79N643L811J0731j637j035m434n293L54L309M201j73
16445b090K810j902P398l749m556l029l222l754J0335j011r806n245J5666P322
16431E167n145j3262J605L622j544l724j708k592K686R909l249r23M613O723Q04
16416B982o690L151k318r64p372m920N443N112m896P209o823j140Q726K371m655
$$ plain form
16401 -4784 -1558 -3674 -1606 -7176 -16704 -7539 -5625 -6940 -13701 -14785 -13329 -19754 -17368 -14907 -9053
16386 -9053 -5299 -4601 6767 11190 6710 3258 -6584 -12889 -14888 -14799 -15170 -10916 -9297 -12160 -5402
16371 -5402 -2298 -5467 -5562 -4646 -10274 -13115 -21131 -14564 -11170 -17134 -19487 -10943 4312 3765 3364 6395
16355 6395 3266 -5002 -8782 -7888 -7180 -1998 -7491 -11245 -16598 -18765 -16874 -20087 -14242 -17712 -21096
16340 -21096 -14068 -4183 -3028 -10743 -10177 -9165 -20994 -25331 -25503 -19088 -13291 -15387 -8788 -13214 -11230
16325 -11230 -8575 -12575 -17306 -18797 -22968 -26356 -23463 -22217 -19491 -22244 -30258 -35651 -25275 -12285
16311 -12285 -1365 597 2515 -88 -1598 -5327 -7649 -20459 -28502 -24060 -12975 -6317 -14846 -15456
16297 -15456 -14004 -11704 -13187 -17617 -13507 -3076 -14723 -29150 -27734 -19932 -10475 -15897 -19658 -13304
$$ packed form
16401d784L226k116K068n570r528R165J914j315o761j084J456o425K386K461N854
16386i053L754O98J1368M423m480l452r842o305j999Q9l71M254J619k863O758
16371e402L104l169r5R16n628k841q016O567L394n964k353Q544J5255n47m01L031
16355F395l129q268l780Q94P08N182n493l754n353k167J891l213N845l470l384
16340b1096P028R885J155p715N66J012j1829m337j72O415N797k096O599m426J984
16325a1230K655m000m731j491m171l388K893J246K726k753q014n393J0376J2990
16311a2285J0920J962J918k603j510l729k322j2810q043M442J1085O658q529o10
16297a5456J452K300j483m430M110J0431j1647j4427J416P802R457n422l761O354
$$ plain form
16283 -13304 -19845 -27048 -22751 -19121 -15783 -18534 -17712 -11371 -10306 -10025 -11320 -8616 -6312 -5832 -11989
16268 -11989 -13528 -2881 -3488 -5222 -9091 -10448 -11583 -4717 -2559 -4939 -6514 -6563 -3963 -7795 -15379
16253 -15379 -15719 -10141 -5451 -6896 -13155 -14922 -13858 -16248 -11176 -3547 -8863 -8085 791 3667 -3938
16238 -3938 -19787 -24323 -21591 -17222 -14322 -23360 -23370 -19033 -20455 -30344 -32019 -28841 -20735 -13737 -19452
16223 -19452 -24248 -24897 -24764 -27314 -27169 -28636 -19557 -9030 -16657 -16041 -11590 -5320 -6342 -8682 -10912
16208 -10912 -14651 -24523 -23760 -14551 -16594 -22226 -8926 1801 1877 2407 2539 -3477 -3777 -6405 -4854
16193 -4854 -9406 -12232 -19943 -23443 -17755 -14255 -15158 -20218 -22977 -33085 -27641 -14550 -11269 -8972
16179 -8972 -8422 -7896 -5013 -4647 -57 -9833 -15405 -9785 -7754 -7728 -14990 -18925 -13055 -17333 -17015 -10188
$$ packed form
16283a3304o541p203M297L630L338k751Q22O341J065K81j295K704K304M80o157
16268a1989j539J0647o07j734l869j357j135O866K158k380j575m9K600l832p584
16253a5379l40N578M690j445o259j767J064k390N072P629n316P78Q876K876p605
16238c938j5849m536K732M369K900r038j0M337j422r889j675L178Q106O998n715
16223a9452m796o49J33k550J45j467R079J0527p627O16M451O270j022k340k230
16208a0912l739r872P63R209k043n632J3300J0727P6N30J32o016l00k628J551
16193d854m552k826p711l500N688L500r03n060k759j0108N444J3091L281K297
16179h972N50N26K883L66M590r776n572N620K031K6p262l935N870m278L18O827
$$ plain form
16163 -10188 -8557 -8561 -3651 -5085 -10823 -12941 -8630 -10133 -4444 -7146 -13941 -20012 -22037 -28078 -26961
16148 -26961 -18058 -19163 -21183 -25057 -25885 -14427 -9322 -9761 -17767 -5754 2491 1997 -12368 -13993
16134 -13993 -15435 -12536 -12204 -20944 -20619 -10896 -8186 -13097 -9499 -17687 -29297 -27251 -28347 -28991 -32859
16119 -32859 -20280 -14782 -19661 -5938 7651 7536 -668 -12208 -8245 -560 -1276 -6803 -10929 -13947
16105 -13947 -14761 -17749 -32449 -29779 -17633 -15406 -15135 -19341 -20688 -27144 -16028 -69 5476 -660
16091 -660 -6261 -18613 -24075 -20402 -8739 -9642 -8610 -6814 -13863 -15930 -8682 -5135 -7338 -8621 -10024
16076 -10024 -5693 -5836 -4061 -4020 -6340 -5328 2742 2206 2138 1242 -3867 -14443 -14985 -9434 -3268 8486
16060 8486 17283 6740 -4568 -13606 -13122 -17369 -19043 -8528 -1935 1928 -1356 -11687 -13343 -10157
$$ packed form
16163a0188J631mM910j434n738k118M311j503N689k702o795o071k025o041J117
16148b6961Q903j105k020l874q28J1458N105m39q006J2013Q245m94j4365j625
16134a3993j442K899L32q740L25R723K710m911L598q188j1610K046j096o44l868
16119c2859J2579N498m879J3723J3589j15q204j1540L963P685p16n527m126l018
16105a3947q14k988j4700K670J2146K227K71m206j347o456J1116J5959N545o136
16091f60n601j2352n462L673J1663r03J032J796p049k067P248L547k203j283j403
16076a0024M331j43J775M1k320J012Q070n36o8q96n109j0576n42N551O166J1754
16060H486Q797j0543j1308r038M84m247j674J0515O593L863l284j0331j656L186
$$ plain form
16046 -10157 -1359 5048 4248 2722 -610 -9650 -710 1213 2808 -7488 -14458 -17212 -20241 -17389
16032 -17389 -20231 -16176 -11546 -21053 -26002 -16820 1902 6357 -5492 -17879 -19267 -11403 -14146 -26021
16018 -26021 -25750 -19303 -15157 -5767 -10089 -17915 -18198 -9541 -3032 -7301 -7502 -8756 -9380 -16250 -18832
16003 -18832 -13151 -7854 -11072 -11602 -19870 -34530 -26560 -17308 -16604 -18326 -22914 -22915 -20020 -8190 -16421
15988 -16421 -29145 -27522 -18007 -14976 -16281 -24031 -17471 -18724 -13626 -7815 -16720 -18203 -18411 -12544
15974 -12544 -12818 -9140 -19170 -23150 -25337 -19329 -3513 8380 4175 -5112 -12683 -11579 -2996 -3510
15960 -3510 -18515 -22594 -18917 -13491 -10375 -14340 -9559 -5187 -10617 -17564 -21899 -15519 -18480 -18565 -6762
15945 -6762 -1979 -6651 -4311 3033 -3500 -5386 -7218 -8314 -2000 -1678 -8396 -16073 -9800 273 -1682
$$ packed form
16046a0157Q798O407q00j526l332r040Q940J923J595j0296o970k754l029K852
16032a7389k842M055M630r507m949R182J8722M455j1849j2387j388P864k743j1875
16018b6021K71O447M146R390m322p826k83Q657O509m269k01j254o24o870k582
16003a8832N681N297l218n30q268j4660P970R252P04j722m588jK895J1830q231
15988a6421j2724J623R515L031j305p750O560j253N098N811q905j483k08N867
15974a2544k74L678j0030l980k187O008J5816J1893m205r287p571J104Q583n14
15960c510j5005m079L677N426L116l965M781M372n430o947m335O380k961q5J1803
15945f762M783m672K340P344o533j886j832j096O314L22o718p677O273J0073j955
$$ plain form
15930 -1682 3 -2992 -1585 2024 3117 -5288 -12917 -18384 -14931 -7685 -12861 -14575 -12118 -7982 -873
15915 -873 -6492 -19953 -23769 -18878 -9698 840 -7402 -14043 -8768 3861 9409 8191 5355 8308
15901 8308 4567 -1192 330 -4541 -9515 -7054 -6322 -14908 -14555 -10856 -12301 -16691 -32216 -31837 -32572
15886 -32572 -29651 -26254 -19285 -12845 -13582 -6836 -11942 -8520 -3737 -5745 -3315 8688 11309 5498
15872 5498 2085 548 -8461 -12279 -16437 -19518 -19828 -21021 -15899 -9533 -52 -2322 -9401 -16746 -8604
15857 -8604 -10029 -8669 -9997 -12197 -1965 -2601 -456 -911 -2681 -4672 -10651 -12991 -5075 -4821 -10199
15842 -10199 -5762 -2528 -8260 -21798 -15640 -8318 -8139 -12876 -8579 -7669 -9572 -6457 -3239 -6985 -7385
15827 -7385 -15121 -20320 -17665 -22228 -19035 -22616 -32911 -26343 -8060 939 1986 -7396 -10051 -12365
$$ packed form
15930a682J685k995J407L609J093q405p629n467L453P246n176j714K457M136P109
15915h73n619j3461l816M891R180J0538q242o641N275J2629N548j218k836K953
15901H308l741n759J522m871m974K461P32q586L53L699j445m390j5525L79p35
15886c2572K921L397O969O440p37O746n106L422M783k008K430J2003K621n811
15872E498l413j537r009l818m158l081l10j193N122O366R481k270p079p345Q142
15857h604j425J360j328k200J0232o36K145m55j770j991n979k340P916K54n378
15842a0199M437L234n732j3538O158P322J79m737M297R10j903L115L218l746m00
15827g385p736n199K655m563L193l581j0295O568J8283Q999J047r382k655k314
$$ plain form
15813 -12365 -3896 1548 -1386 -12370 -16460 -12100 -6998 -10248 -289 10149 4735 -2636 5178 9398
15799 9398 13 -832 6646 12030 8097 3669 -516 8866 761 -12728 -11487 -7017 -12278 -10528 -11411
15784 -11411 -13569 -11425 -4402 337 -684 -11891 -11752 376 2840 -779 -9818 -10218 -13370 -12336
15770 -12336 -11168 -27361 -26306 -21718 -8429 -7563 -8475 -3120 1801 -5807 -16475 -13982 -1588 1849
15756 1849 -2808 -17933 -17262 -22754 -24417 -27179 -29084 -25727 -17712 -8769 -3579 -8385 -11522 -20761 -29021
15741 -29021 -31846 -37188 -32100 -35290 -34955 -27216 -33620 -26624 -14489 -20377 -13463 -13281 -4358 -6579 -9870
15726 -9870 -16594 -7639 -3141 -4952 -8387 -14978 -21958 -30696 -29436 -14212 -12355 -12282 -14142 -3728 -2234
15711 -2234 -14351 -7569 -9869 -18432 -16906 -9194 -8360 -13900 -25839 -33196 -20013 -15532 -19374 -31389
$$ packed form
15813a2365Q469N444k934j0984m090M360N102l250R959J0438n414p371P814M220
15799I398r385q45P478N384l933m428m185R382q105j3489J241M470n261J750q83
15784a1411k158K144P023M739j021j1207J39J2128K464l619r039m00l152J034
15770a2336J168j6193J055M588J3289Q66r12N355M921p608j0668K493J2394L437
15756A849m657j5125O71n492j663k762j905L357Q015Q943N190m806l137r239q260
15741b9021k825n342N088l190L35P739o404O996J2135n888O914J82Q923k221l291
15726i870o724Q955M498j811l435o591o980q738J260J5224J857P3j860J0414J494
15711b234j2117O782k300q563J526P712Q34n540j1939p357J3183M481l842j2015
$$ plain form
15697 -31389 -34015 -28745 -19508 -16748 -9036 -6105 -9075 -18346 -17649 -15731 -14079 -2057 -1280 -7568 -16135
15682 -16135 -6542 -9404 -8912 -5553 -8905 -11675 -18410 -13212 106 -363 -12733 -20447 -24574 -15734
15668 -15734 -8123 -7357 -3620 -6898 -16191 -19638 -20352 -21965 -22935 -16003 -18620 -23383 -23544 -23105 -27010 -27322
15652 -27322 -25337 -18662 -18693 -19452 -22775 -24100 -22548 -8731 -4119 -7406 -10335 -11938 -4947 -1713 -3365
15637 -3365 -7264 -11990 -5136 -1536 553 -5657 -11297 -18413 -11580 -5559 603 2959 -10144 -11060 -16181
15622 -16181 -18707 -12501 -14082 -21399 -21781 -24328 -25236 -32720 -32200 -20495 -7650 -16111 -22523 -10100
15608 -10100 -11148 -13258 -22174 -17583 -9780 -8924 3907 3493 -1628 4011 -652 -514 2300 -8564 -14143
15593 -14143 -13304 -9860 -13459 -15645 -16987 -9357 -18051 -14489 -4535 1255 11174 11326 2663 3580 -1850
$$ packed form
15697c1389k626N270R237K760P712K931k970r271O97J918J652J2022P77o288q567
15682a6135R593k862M92L359l352k770o735N198J3318m69j2370p714m127Q840
15668a5734P611P66L737l278r293l447p14j613r70O932k617m763j61M39l905l12
15652b7322J985O675l1p59l323j325J552J3817M612l287k929j603O991L234j652
15637c365l899m726O854L600K089o210n640p116O833O021O162K356j3103r16n121
15622a6181k526O206j581p317l82k547r08p484N20J1705J2845q461o412J2423
15608a0100j048k110q916M591P803Q56J2831m14n121N639m663J38K814j0864n579
15593a4143Q39L444l599k186j342P630q694L562R954N790R919J52q663R17n430
$$ plain form
15578 -1850 8010 6590 -3046 -5051 -6287 -2146 -5535 -14010 -13876 -14094 -12349 -4256 -9206 -17865 -7815
15563 -7815 -10071 -9884 -4351 953 329 2332 3722 -4173 -13057 -16962 -19349 -5977 -3740 -14916 -23767
15548 -23767 -20585 -17334 -14788 -6672 -11110 -12257 -8903 -9823 -14212 -14897 -4096 -3857 -14619 -9492 -12099
15533 -12099 -13396 -11277 -6877 -871 1414 2662 2336 -3172 4763 6871 7572 5932 -2557 -18516 -21326
15518 -21326 -13598 309 -3342 -8061 -16750 -17883 -17341 -11698 -11027 -6828 249 -3865 -4772 98 6020
15503 6020 5403 -11226 -20151 -18231 -28419 -32059 -29045 -34108 -30203 -22839 -25324 -23555 -16103 -12853
15489 -12853 -5023 -5053 -11099 -2767 1652 1344 -5187 -8886 -7480 -7027 -6617 -7671 2896 7148 4416
15474 4416 5310 -5443 -12022 -16882 -16736 -19068 -16017 -15817 -11353 -4345 2510 -569 -6917 -5112 -1553
$$ packed form
15578a850R860j420r636k005j236M141l389q475J34k18J745Q093m950q659J0050
15563g815k256J87N533N304o24K003J390p895q884l905k387J3372K237j1176q851
15548b3767L182L251K546Q116m438j147L354r20m389o85J0801K39j0762N127k607
15533a2099j297K119M400O006K285J248l26n508P935K108P01j640q489j5959k810
15518b1326P728J3907l651m719q689j133N42N643O71M199P077m114r07M870N922
15503F020o17j6629q925J920j0188l640L014n063L905P364k485J769P452L250
15489a2853P830l0o046Q332M419l08o531l699J406M53M10j054J0567M252k732
15474D416Q94j0753o579m860J46k332L051K00M464P008O855l079o348J805L559
$$ plain form
15459 -1553 3834 -2043 -7837 -9206 879 10333 4015 4513 15292 22202 15926 12692 11994 -2610
15445 -2610 -17617 -11054 1033 2036 -6932 -7743 5531 13712 10587 634 2623 10517 10565 4560 4731
15430 4731 -1403 -4369 -627 2064 181 2789 1502 7239 6026 4196 -1689 -1886 6567 -6231 -8500
15415 -8500 -3593 198 12734 11616 8735 9300 79 -2340 -5527 -4124 526 4531 2071 980 4800
15400 4800 1359 -6974 -2259 10794 21111 23187 23391 22317 20334 13507 5843 -116 4974 3433
15386 3433 9543 19327 20428 21451 20718 16436 7099 3331 11489 2047 -4603 -224 -1462 -1389 387
15371 387 1087 506 6642 25989 40215 59290 52775 45478 43160 43701 36815 29516 17657 4219
15357 4219 -4282 -907 8691 6244 7868 11434 16637 14292 11686 4314 1301 10842 14834 14935 4985
$$ packed form
15459a553N387n877n794j369J0085R454o318M98J0779O910o276l234o98j4604
15445b610j5007O563J2087J003q968q11J3274Q181l125r953J989P894M8o005J71
15430D731o134k966L742K691j883K608j287N737j213j830n885j97Q453j2798k269
15415h500M907L791J2536j118k881N65r221k419l187J403M650M005k460j091L820
15400D800l441q333M715J3053J0317K076K04j074j983o827p664n959N090j541
15386C433O110R784J101J023p33m282r337l768Q158r442o650M379j238P3J776
15371C87P00n81O136J9347J4226J9075o515p297k318N41o886p299j1859j3438
15357D219q501L375R598k447J624L566N203k345k606p372l013R541L992J01r950
$$ plain form
15342 4985 -2562 -3924 1013 7903 15714 11070 -6615 -11402 -4210 5036 7445 15328 9322 12529
15328 12529 18741 18956 11567 15542 30798 43263 54791 70245 83077 101876 123761 130043 140828
15315 140828 140087 147699 151849 177670 209300 264841 367877 498756 619956 676237 674106 663590
15303 663590 660131 609136 496227 365618 253634 180935 146382 122776 102527 82233 67956
15292 67956 64328 57417 49736 43822 31270 28215 27938 25832 18531 10538 1937 1490 -2798 -5422 -11422
15277 -11422 -9734 -2748 4330 3778 4864 7221 12163 1826 3146 1486 2600 11773 5620 105
15263 105 4259 1760 1651 922 10534 12636 183 -9082 -8184 -6024 2878 15310 6591 -10041 -12738
15248 -12738 -13958 -12373 4167 10026 -401 -6109 -9628 -8003 -2640 -693 -5763 -9067 -6584 -10267
$$ packed form
15342D985p547j362M937O890P811m644j7685m787P192R246K409P883o006L207
15328A2529O212K15p389L975J5256J2465J1528J5454J2832J8799K1885O282J0785
15315A40828p41P612M150K5821L1630N5541J03036J30879J21200N6281k131j0516
15303F63590l459n0995j12909j30609j11984p2699l4553k3606k0249k0294j4277
15292F7956l628o911p681n914j2552l055k77k106p301p993q601m47m288k624o000
15277a1422J688O986P078n52J086K357M942j0337J320j660J114R173o153n515
15263A05M154k499j09p29R612K102j2453r265Q98K160Q902J2432q719j6632k697
15248a2738j220J585J6540N859j0427n708l519J625N363J947n070l304K483l683
$$ plain form
15234 -10267 -6394 -1125 -6801 -2921 -4335 3725 9850 7382 21 2206 1947 4522 1674 -378 -4329
15219 -4329 -264 2113 6431 1973 3763 -3037 2248 4195 3626 5844 5042 14002 12648 14624 16916
15204 16916 12664 2427 1558 -4137 -9879 -8150 -2591 2719 4202 6911 16249 11465 3048 -2313
15190 -2313 -9084 -9067 -13241 -7655 -476 -1442 5478 3131 -3101 -11183 -9846 -8409 -10128 -6767 -2901
15175 -2901 -9440 -5639 -1512 388 -2372 -5696 -9015 -8839 -11745 -9752 -9676 -7907 -1324 449 -1237
15160 -1237 -1372 -5193 -4163 -8375 -3621 -6513 -10851 -3451 -9122 -15987 -14792 -8771 -4088 1397 6289
15145 6289 3241 11186 14443 17679 18935 19337 9526 3536 -1906 -7367 -7246 -3542 1695 4768 5558
15130 5558 6053 2503 -988 -12418 -8189 5525 13308 8456 -3178 -2422 -7236 -7728 -5179 4602 2055
$$ packed form
15234a0267L873N269n676L880j414Q060O125k468p361K185k59K575k848k052l951
15219d329M065K377M318m458J790o800N285J947n69K218q02Q960j354J976K292
15204A6916m252j0237q69n695n742J729N559N310J483K709R338m784q417n361
15190b313o771J7m174N586P179r66O920k347o232q082J337J437j719L361L866
15175b901o539L801M127J900k760l324l319J76k906J993P6J769O583J773j686
15160a237j35l821J030m212M754k892m338P400n671o865J195O021M683N485M892
15145F289l048P945L257L236J256M02r811n990n442n461J21L704N237L073P90
15130E558M95l550l491j1430M229J3714P783m852j1634P56m814m92K549R781k547
$$ plain form
15115 2055 5599 2293 -2220 -7118 -10415 -10442 -5875 -2940 -11029 -20650 -16549 -10484 -5668 -4864 -1549
15100 -1549 -6793 -16293 -13988 -17078 -20291 -11102 -7756 -13687 -15434 -19819 -26377 -19813 -22189 -13658 -1213
15085 -1213 8330 -704 -6472 131 944 -4098 -297 5 -11130 -12387 -10107 -6062 -664 -3447 -8935
15070 -8935 -14392 -15772 -15940 -8212 1127 5046 3417 2518 5103 5663 -5355 -6147 -6362 -9374 -5843 3229
15054 3229 -2911 -13045 -11506 -4428 -7914 -10282 -17777 -10339 1812 6086 9853 5080 -918 3557
15040 3557 -3601 -11427 -8633 4750 6652 11880 10036 6137 16276 20753 14138 4870 7571 19605
15026 19605 26936 17509 21042 38414 59889 83051 94168 95873 86185 78047 73878 56298 44446
15013 44446 41992 33307 37425 47804 57330 59312 54947 59979 78713 108483 142963 187390 198765
$$ packed form
15115B055L544l306m513m898l297k7M567K935q089r621M101O065M816Q04L315
15100a549n244r500K305l090l213R189L346n931j747m385o558O564k376Q531J2445
15085a213R543r034n768O603Q13n042L801L02j1135j257K280M045N398k783n488
15070h935n457j380j68P728R339L919j629q99K585N60j1018p92k15l012L531R072
15054C229o140j0134J539P078l486k368p495P438J2151M274L767m773n998M475
15040C557p158p826K794J3383J902N228j844l899J0139M477o615r268K701J2034
15026A9605P331r427L533J7372K1475K3162J1117J705r688q138m169j7580j1852
15013D4446k454q685M118J0379R526J982m365N032J8734K9770L4480M4427J1375
$$ plain form
15000 198765 184843 201232 236455 256829 244130 213527 186134 177289 175991 152675 108358 70451
14988 70451 45411 33156 36523 43098 38994 38075 54906 79979 115000 170207 219568 261775 252175
14975 252175 236926 249470 261393 219803 159485 113962 92944 77559 57554 39409 31620 26925
14963 26925 24620 25492 16216 13301 13737 15438 22734 12468 -1329 -7223 -9346 2041 11986 15836
14949 15836 10732 2919 6187 4438 3680 -4747 -8655 -2258 -730 2832 4392 -4353 -6268 -4403 6856
14934 6856 10116 17018 14822 15180 22313 21320 23621 25212 28548 34249 37761 51028 58217 57288 53898
14919 53898 52976 53803 52985 69597 86662 100271 128840 200400 315586 452210 568160 585012
14907 585012 547911 559951 587517 511018 360670 228446 151887 110342 82799 69757 60327
$$ packed form
15000A98765j3922J6389L5223K0374j2699l0603k7393q845j298k3316m4317l7907
14988G0451k5040j2255L367O575m104r19J6831K5073L5021N5207M9361M2207r600
14975B52175j5249J2544J1923m1590o0318m5523k1018j5385k0005j8145p789m695
14963B6925k305Q72r276k915M36J701P296j0266j3797n894k123J1387R945L850
14949A5836n104p813L268j749p58q427l908O397J528L562J560q745j915J865J1259
14934F856L260O902k196L58P133r93K301J591L336N701L512J3267P189r29l390
14919E3898r22Q27q18J6612J7065J3609K8569P1560J15186J36624J15950J6852
14907E85012l7101J2040K7566p6499j50348j32224p6559m1545k7543j3042r430
$$ plain form
14896 60327 53105 48179 47242 42480 41268 42673 40046 30323 20882 16267 9762 880 -5098 -281 9696
14881 9696 18322 8003 -5671 -14375 -8050 2462 11420 8373 7351 335 4371 6091 -2866 -8368
14867 -8368 -1684 3461 7132 12087 20632 17924 16747 7707 -1104 670 -2673 -4474 -731 1469 -503
14852 -503 1756 4233 9007 15652 23249 17647 13089 16475 17874 17836 20678 26081 36554 40267 44243
14837 44243 39679 34811 38191 52929 86136 129018 180613 232491 258245 254143 256576 267028 264995
14824 264995 227376 166078 103386 66306 51377 38678 27549 24714 25390 16019 6394 7891 2037
14811 2037 3216 1075 1424 12213 15000 17145 19776 31147 24230 15319 7116 8798 14373 -436
14797 -436 -9728 -13834 -6511 -220 -6249 -10753 -3909 -1589 5521 4595 3674 -1205 -5612 -2859 -5034
$$ packed form
14896F0327p222m926r37m762j212J405k627r723r441m615o505q882n978M817R977
14881I696Q626j0319j3674q704O325J0512Q958l047j022p016M036J720q957n502
14867h368O684N145L671M955Q545k708j177r040q811J774l343j801L743K200j972
14852e03K259K477M774O645P597n602m558L386J399l8K842N403J0473L713L976
14837D4243m564m868L380J4738L3207M2882N1595N1878K5754m102K433J0452k033
14824B64995l7619o1298o2692l7080j4929j2699j1129k835O76r371r625J497n854
14811B037J179k141L49J0789K787K145K631J1371o917q911q203J682N575j4809
14797d36r292m106P323O291o029m504O844K320P110r26r21m879m407K753k175
$$ plain form
14782 -5034 -7054 -11291 -18212 -19229 -17399 -8528 2020 8875 117 5133 3819 -4292 -6390 -3763
14768 -3763 -6832 -6467 -4635 -511 2691 9249 14515 8400 7869 20551 27565 27156 28437 21127 7368
14753 7368 5344 6039 9813 17317 15357 15061 6981 7189 10391 9459 3141 4190 5216 6931 17506
14738 17506 28816 31366 35192 41374 44666 47892 33019 16474 12617 21937 24563 21952 22315 9956
14724 9956 2119 4140 4840 -251 870 -4085 6417 16400 10560 8732 9299 6032 8565 8388 21844
14709 21844 25910 26794 29598 29151 17554 11960 22770 31960 21861 11162 21822 23138 26133 32199
14695 32199 41132 48760 50024 50530 45843 44360 45308 43773 47172 54238 55453 59776 56827 52892 61939
14680 61939 69145 72719 81299 90188 82971 92089 106380 116289 126914 141237 171860 203341 236926
$$ packed form
14782e034k020m237o921j017J830Q871J0548O855q758N016j314q111k098K627
14768c763l069L65J832M124L202O558N266o115n31J2682P014m09J281p310j3759
14753G368k024O95L774P504j960k96q080K08L202r32o318J049J026J715J0575
14738A7506J1310K550L826O182L292L226j4873j6545l857R320K626k611L63j2359
14724I956p837K021P00n091J121m955J0502R983n840j828N67l267K533j77J3456
14709B1844M066Q84K804m47j1597n594J0810R190j0099j0699J0660J316K995O066
14695C2199Q933P628J264N06m687j483R48j535L399P066J215M323k949l935R047
14680F1939P206L574Q580Q889p217R118J4291R909J0625J4323L0623L1481L3585
$$ plain form
14667 236926 283031 337863 407744 501396 608969 735262 892661 1057293 1184526 1264134
14657 1264134 1300221 1302455 1299332 1270247 1185373 1049230 884656 729587 601577 495025 409587
14646 409587 347747 294650 250793 213702 194116 166805 131754 116674 114432 103961 82973 75451
14634 75451 63403 56580 55375 59754 60096 57923 46663 45044 49210 44315 39935 40781 39312 40575
14620 40575 42076 44515 40067 45454 56608 57522 50571 56305 61725 56271 54068 49288 46473 44791
14606 44791 54779 56426 46511 40944 39296 36416 43392 44853 45374 40919 38478 37166 32230 23336 14235
14591 14235 12741 15194 15452 7801 14800 17454 22707 24186 28190 30284 24799 21693 25719 37224
14577 37224 46157 56468 56375 46237 45548 43612 44880 52707 51255 53219 49104 50292 51148 44823 43082
$$ packed form
14667B36926M6105N4832O9881R3652J07573J26293J57399J64632J27233P9608
14657A264134L6087K234l123k9085q4874j36143j64574j55069j28010j06552q5438
14646D09587o1840n3097m3857l7091j9586k7311l5051j5080k242j0471k0988p522
14634G5451j2048o823j205M379L42k173j1260j619M166m895m380Q46j469J263
14620D0575J501K439m448N387J1154R14o951N734N420n454k203m780k815j682
14606D4791R988J647r915n567j648k880O976J461N21m455k441j312m936q894r101
14591A4235j494K453K58p651O999K654N253J479M004K094n485l106M026J1505
14577C7224Q933J0311r3j0138o89j936J268P827j452J964m115J188Q56o325j741
$$ plain form
14562 43082 42128 44546 42201 38992 36773 31117 28074 22322 27793 32733 27689 19688 15615 13009 15971
14547 15971 19562 13818 5571 12697 16324 14861 13517 5175 9832 13719 15603 17560 26357 35158
14533 35158 28505 25095 32032 31413 35376 38241 46753 48255 50603 53105 51833 40655 34103 32987
14519 32987 27371 24403 25683 23767 24844 24396 17911 11451 13235 13469 6022 -673 10242 25353
14505 25353 32404 33357 34408 40090 45168 52662 55338 62623 52288 43947 51693 53502 53485 51034 54855
14490 54855 60349 61750 69002 62635 62285 56391 48275 42446 40700 42464 40570 44405 39628 46483 49678
14475 49678 45838 55774 60724 65289 73547 71021 74524 79904 79757 77916 76921 79910 82643 88727 88913
14460 88913 105581 121093 131191 153510 181022 196941 206782 204054 203291 211489 218396 215003 196992
$$ packed form
14562D3082r54K418k345l209k219n656l043n752N471M940n044q001m073k606K962
14547A5971L591n744q247P126L627j463j344q342M657L887J884J957Q797Q801
14533C5158o653l410O937o19L963K865Q512J502K348K502j272j1178o552j116
14519C2987n616k968J280j916J077m48o485o460J784K34p447o695J0915J5111
14505B5353P051R53J051N682N078P494K676P285j0335q341P746J809j7k451L821
14490E4855N494J401P252o367l50n894q116n829j746J764j894L835m777O855L195
14475D9678l840R936M950M565Q258k526L503N380j47j841r95K989K733O084J86
14460H8913J6668J5512J0098K2319K7512J5919R841k728p63Q198O907l393j8011
$$ plain form
14447 196992 175269 156989 140204 125699 123926 116255 107967 106037 108384 112886 122651 126509 130482
14434 130482 120095 121708 126453 134685 151951 184996 229013 324855 496508 766220 1085286
14423 1085286 1194327 970306 663213 463890 358685 297284 262202 247189 240543 252496
14413 252496 283389 338292 436896 627261 921049 1205760 1183794 853862 547772 371009
14403 371009 271094 215386 186341 165833 156535 159516 159449 160741 166223 167692 153999 136356 123306
14390 123306 102679 90211 92211 95999 95967 94010 101903 107861 107743 101367 96225 99685 105160 106185
14376 106185 105006 103654 93656 100530 105297 112044 119388 124487 120774 118682 122838 127199 134095 130049
14362 130049 129678 125944 124517 114082 92432 75400 57268 54805 46151 43253 45357 48869 54194
$$ packed form
14447A96992k1723j8280j6785j4505j773p671q288j930K347M502R765L858L973
14434A30482j0387J613M745Q232J7266L3045M4017R5842J71653K69712L19066
14423A085286J09041k24021l07093j99323j05205o1401l5082j5013o646J1953
14413B52496L0893N4903R8604J90365K93788K84711k1966l29932l06090j76763
14403C71009r9915n5708k9045k0508r298K981o7J292N482J469j3693j7643j3050
14390A23306k0627j2468K000L788l2j957P893N958j18o376n142L460N475J025
14376A06185j179j352r998O874M767O747P344N099l713k092M156M361O896m046
14362A30049l71l734j427j0435k1650j7032j8132k463q654k898K104L512N325
$$ plain form
14349 54194 48725 49992 52944 61751 79044 85599 84069 88898 95629 103071 96357 93149 99024 93867
14335 93867 89015 94531 92378 89599 91756 104385 131213 180173 236884 285807 327708 367906 410190
14322 410190 456592 491922 516372 512880 507120 483104 470038 468135 459827 456991 448797 444885 447025
14309 447025 453295 446905 449515 452744 451050 458828 463009 467832 478997 484730 498954 508283 511878 525765
14295 525765 537023 549527 561676 580925 610233 648379 665908 648695 619344 615695 624590 648888
14283 648888 658520 671451 678169 674027 687332 706581 713250 722530 748243 755603 760040 779937 799267
14270 799267 831745 869961 903256 951559 1012242 1069620 1106525 1134770 1181525 1249913 1331044
14259 1331044 1419169 1499994 1543776 1574582 1604803 1637683 1679481 1732483 1799620 1859100 1936939
$$ packed form
14349E4194n469J267K952Q807J7293O555j530M829O731P442o714l208N875n157
14335I3867m852N516k153k779K157J2629K6828M8960N6711M8923M1901M0198M2284
14322D10190M6402L5330K4450l492n760k4016j3066j903q308k836q194l912K140
14309D47025O270o390K610L229j694P778M181M823J1165N733J4224R329L595J3887
14295E25765J1258J2504J2149J9249K9308L8146J7529j7213k9351l649Q895K4298
14283F48888R632J2931O718m142J3305J9249O669R280K5713P360M437J9897J9330
14270G99267L2478L8216L3295M8303O0683N7378L6905K8245M6755O8388Q1131
14259A331044Q8125Q0825M3782L0806L0221L2880M1798N3002O7137N9480P7839
$$ plain form
14248 1936939 2046081 2148847 2246896 2336103 2424729 2526711 2641312 2756680 2871688 2998323
14238 2998323 3151710 3321469 3515683 3736126 3997384 4294287 4616668 4963568 5341789
14229 5341789 5757014 6211880 6717861 7280129 7910090 8606666 9389972 10262356 11251173
14220 11251173 12377610 13668166 15130442 16769309 18645583 20846176 23445142 26554263
14212 26554263 30345012 35036908 40941856 48456637 58110652 70702369 87179057 108486056
14204 108486056 135034011 165698271 196606750 221502416 235619328 240083878 240354051
14197 240354051 239413548 234201952 219368961 194031499 163311503 133571692 108369055
14190 108369055 88409550 73041926 61264943 52121886 44846732 38913413 34003737
$$ packed form
14248A936939J09142J02766R8049Q9207Q8626J01982J14601J15368J15008J26635
14238B998323J53387J69759J94214K20443K61258K96903L22381L46900L78221
14229E341789M15225M54866N05981N62268O29961O96576P83306Q72384R88817
14220A1251173J126437J290556J462276J638867J876274K200593K598966L109121
14212B6554263L790749M691896N904948P514781R654015J2591717J6476688K1306999
14204A08486056K6547955L0664260L0908479K4895666J4116912M464550K70173
14197B40354051r40503n211596j4832991k5337462l0719996k9739811k5202637
14190A08369055j9959505j5367624j1776983r143057p275154n933319m909676
$$ plain form
14183 34003737 29916195 26506488 23643622 21164731 18969256 17026424 15324274 13842788
14175 13842788 12561352 11457559 10497012 9654479 8904935 8247174 7653828 7123138 6655088
14166 6655088 6236912 5865393 5534520 5230571 4953927 4693615 4458522 4248611 4053338
14157 4053338 3869095 3702976 3533901 3363592 3199664 3070024 2944069 2817251 2671246
14148 2671246 2527925 2405739 2306292 2217419 2137610 2065049 2015497 1974870 1938149 1927627 1936413
14137 1936413 1963289 1933173 1837130 1734388 1655892 1590295 1549302 1523668 1493309 1463115 1433475
14126 1433475 1403219 1379604 1375667 1382013 1417480 1418721 1339216 1239647 1175026 1130477 1124447 1145504
14114 1145504 1186445 1223423 1206064 1123097 1039150 984682 947878 906276 863331 806741 760295
$$ packed form
14183C4003737m087542l409707k862866k478891k195475j942832j702150j481486
14175A3842788j281436j103793r60547q42533p49544o57761n93346n30690m68050
14166F655088m18176l71519l30873l03949k76644k60312k35093k09911j95273
14157D053338j84243j66119j69075j70309j63928j29640j25955j26818j46005
14148B671246j43321j22186r9447q8873p9809p2561m9552m0627l6721j0522Q786
14137A936413K6876l0116r6043j02742p8496o5597m0993k5634l0359l0194k9640
14126A433475l0256k3615l937O346L5467J241p9505r9569o4621m4549o030K1057
14114A145504M0941L6978j7359q2967q3947n4468l6804m1602m2945n6590m6446
$$ plain form
14103 760295 743576 735044 717981 697245 684794 676214 672959 652383 632377 616963 614681 619211
14091 619211 620261 608142 586416 563354 542477 536609 530200 526316 530947 523361 499770 489667 486193
14078 486193 508868 538689 574195 626414 693323 771154 857736 983514 1176606 1443102 1682309
14067 1682309 1740471 1561229 1292437 1069344 924760 834563 774797 737499 710429 697777
14057 697777 682946 662377 642585 642734 652138 665999 679183 691719 705602 723964 743473 759543
14045 759543 785128 815512 842822 867648 882349 900094 917369 926255 948223 969388 981514 992040
14033 992040 1009962 1040597 1068159 1112987 1169708 1221002 1302161 1417812 1579785 1814450 2070423
14022 2070423 2189898 2042815 1758217 1524364 1372370 1278553 1222735 1186454 1155636 1119671
$$ packed form
14103G60295j6719q532j7063k0736j2451q580l255k0576k0006j5414k282M530
14091F19211J050j2119k1726k3062k0877n868o409l884M631p586k3591j0103l474
14078D86193K2675K9821L5506N2219O6909P7831Q6582J25778J93092K66496K39207
14067A682309N8162j79242k68792k23093j44584r0197n9766l7298k7070j2652
14057F97777j4831k0569j9792J49R404J3861J3184J2536J3883J8362J9509J6070
14045G59543K5585L0384K7310K4826J4701J7745J7275Q886K1968K1165J2126J0526
14033I92040J7922L0635K7562M4828N6721N1294Q1159J15651J61973K34665K55973
14022B070423J19475j47083k84598k33853j51994r3817n5818l6281l0818l5965
$$ plain form
14012 1119671 1069179 1033671 1013806 983871 946604 906673 866177 818380 765519 717294 677777
14001 677777 643874 618292 581396 545717 524727 505655 478260 443212 415774 396107 378430
13990 378430 370964 360961 345256 330174 329436 333537 327881 317598 332806 368705 412867 471459
13978 471459 539848 582375 553289 472892 383655 319880 282196 254157 242300 234450 223793 214700
13966 214700 198531 188070 190648 188853 190550 179741 163874 158648 150773 148098 143020 143539 155350
13953 155350 161031 170767 163838 164447 157944 164871 156899 153085 153906 154487 148368 150721 147787 136343 130441
13938 130441 127005 132505 130172 128979 130951 128260 130467 130630 131210 133618 129419 119079 109643 94167
13924 94167 89949 98366 104833 107661 104027 109588 109070 110208 123617 119937 106419 97180 83733 71335
$$ packed form
14012A119671n0492l5508j9865k9935l7267l9931m0496m7797n2861m8225l9517
14001F77777l3903k5582l6896l5679k0990j9072k7395l5048k7438j9667j7677
13990C78430p466j0003j5705j5082p38M101n656j0283J5208L5899M4162N8592
13978D71459O8389M2527k9086q0397q9237o3775l7684k8039j1857p850j0657r093
13966B14700j6169j0461K578j795J697j0809j5867n226p875k675n078N19J1811
13953A55350N681R736o929O09o503O927p972l814Q21N81o119K353k934j1444n902
13938A30441l436N500k333j193J972k691K207J63N80K408m199j0340r436j5476
13924I4167m218Q417O467K828l634N561n18J138J3409l680j3518r239j3447j2398
$$ plain form
13910 71335 60868 50200 62735 82640 97125 104991 94246 87288 90573 109145 121556 110335
13898 110335 97610 89199 79058 77257 93722 91626 98136 111004 115433 115393 115052 107426 105368 93519
13884 93519 88292 89448 82543 74543 64837 53571 69424 71037 68377 68635 74594 82726 87225 87084
13870 87084 93855 101303 91247 71878 69602 69720 80114 92316 108979 122458 131177 135277 146714
13857 146714 167909 191493 202208 191291 159104 142195 139208 125971 114123 105123 92372 93355
13845 93355 96555 95222 93940 90279 91788 90471 84193 72343 73826 69766 56453 56702 66447 69790
13831 69790 73160 69544 59865 47563 35436 30320 40841 62176 78694 69030 55775 55569 60153
13818 60153 67952 79853 89971 93567 104910 126745 152386 164370 177292 185390 162785 158267
$$ packed form
13910G1335j0467j0668J2535J9905J4485P866j0745o958L285J8572J2411j1221
13898A10335j2725q411j0141j801J6465k096O510J2868M429m0l41p626k058j1849
13884I3519n227J156o905q000r706j1266J5853J613k660K58N959Q132M499j41
13870H7084O771P448j0056j9369k276J18J0394J2202J6663J3479Q719M100J1437
13857A46714K1195K3584J0715j0917l2187j6909k987j3237j1848r000j2751R83
13845I3355L200j333j282l661J509j317o278j1850J483m060j3313K49R745L343
13831F9790L370l616r679j2302j2127n116J0521K1335J6518r664j3255k06M584
13818F0153P799J1901J0118L596J1343K1835K5641J1984J2922Q098k2605m518
$$ plain form
13806 158267 158259 136986 110534 90631 74795 66711 69398 83225 98057 99052 93552 84394 80334 89226
13792 89226 87683 76516 66426 60518 61217 63143 69086 70126 66700 62360 58794 52993 53646 56402
13778 56402 64864 71084 76832 89894 106072 144471 181223 199052 196704 185528 184003 187345 189876
13765 189876 197365 203279 208159 200474 196277 196545 183385 158333 133865 107434 116030 142612 170092
13752 170092 197535 213475 218614 238742 257054 280718 301283 328580 368329 413563 476589 571379
13740 571379 686512 831214 995782 1157833 1287214 1368524 1416953 1429027 1445844 1466444
13730 1466444 1491270 1561520 1666217 1728522 1607221 1328514 1059590 869994 737060 641447
13720 641447 579379 525875 499066 483683 465021 441196 407740 374260 336677 309524 294060
$$ packed form
13806A58267qk1273k6452j9903j5836q084K687J3827J4832R95n500r158m060Q892
13792H9226j543j1167j0090n908O99J926N943J040l426m340l566n801O53K756
13778E6402Q462O220N748J3062J6178L8399L6752J7829k348j1176j525L342K531
13765A89876P489N914M880p685m197K68j3160k5052k4468k6431Q596K6582K7480
13752A70092K7443J5940N139K0128J8312K3664K0565K7297L9749M5234O3026R4790
13740E71379J15133J44702J64568J62051J29381Q1310M8429J2074J6817K0600
13730A466444K4826P0250J04697O2305j21301k78707k68924j89596j32934r5613
13720F41447o2068n3504k6809j5383j8662k3825l3456l3480l7583k7153j5464
$$ plain form
13709 294060 295586 325577 362536 406742 436866 461571 482943 499945 509001 516185 531675 556165
13697 556165 601596 647555 698161 756747 817583 889418 969474 1046993 1159280 1303947 1486564
13686 1486564 1751142 2181108 2847437 3751465 4650800 5090728 5081628 5186081 5679781 6479214
13676 6479214 7495691 8618404 9689447 10571702 11100277 11151568 10733046 9968430 9007281
13667 9007281 7987164 7044847 6278964 5737989 5490548 5596584 6036991 6541225 6636026
13658 6636026 6297363 6017998 6079900 6516442 7373815 8813591 11132683 14929759 21177093
13649 21177093 31180283 45654282 61360532 68036297 58930397 42227892 28446978
13642 28446978 19794433 14659238 11640169 9987445 9238281 8887569 8280236 7168713
$$ packed form
13709B94060J526K9991L6959M4206L0124K4705K1372J7002R056P184J5490K4490
13697E56165M5431M5959N0606N8586O0836P1835Q0056P7519J12287J44667J82617
13686A486564K64578M29966O66329R04028Q99335M39928r100J04453M93700P99433
13676F479214J016477J122713J071043Q82255N28575N1291m18522p64616r61149
13667I007281j020117r42317p65883n40975k47441J06036M40407N04234R4801
13658F636026l38663k79365O1902M36542Q57373J439776K319092L797076O247334
13649B1177093J0003190J4473999J5706250O675765r105900j6702505j3780914
13642B8446978q652545n135195l019069j652724p49164l50712o07333j111523
$$ plain form
13634 7168713 6005468 5142467 4565852 4179344 3905834 3689801 3538661 3491889 3554259 3715264
13624 3715264 3987758 4309535 4647103 5068314 5606623 6267575 7192764 8730466 11071813
13615 11071813 13804898 15436142 15068789 14288292 14566311 15965701 18538656 22672560
13607 22672560 29119718 39438716 56359699 83864746 125490521 177251446 212337019
13600 212337019 195432606 140850690 91266775 60524373 42733412 32095062 25574824
13593 25574824 21544538 18861079 16663447 14517813 12457881 10713787 9385512 8392998
13585 8392998 7621533 6976621 6435248 6043012 5819682 5746717 5831878 6040892 6289671 6577405
13575 6577405 6969729 7491141 8234519 9526222 11625268 14338901 16462914 16559908 15635682
$$ packed form
13634G168713j163245q63001n76615l86508k73510k16033j51140m6772O2370J61005
13624C715264K72494L21777L37568M21211N38309O60952R25189J537702K341347
13615A1071813K733085J631244l67353p80497K78019J399390K572955M133904
13607B2672560O447158J0318998J6920983K7505047M1625775N1760925L5085573
13600B12337019j6904413n4581916m9583915l0742402j7790961j0638350o520238
13593B5574824m030286k683459k197632k145634k059932j744094j328275r92514
13585H392998p71465o44912n41373l92236k23330p2965Q5161K09014K48779K87734
13575F577405L92324N21412P43378J291703K099046K713633K124013R6994r24226
$$ plain form
13566 15635682 15577442 16715375 18989850 22780344 28720020 38126357 53452381 78438174
13558 78438174 117142122 168513034 211971366 208161925 157074442 102380842 66767014
13551 66767014 46157750 33934385 26442800 21737440 18588707 16155953 13993009 11972571
13543 11972571 10199935 8800847 7734028 6900637 6183537 5552756 5051187 4662952 4368642
13534 4368642 4196714 4122676 4097658 4083251 4099568 4155788 4276573 4560383 5104541 5901237
13524 5901237 6612328 6795652 6591138 6548307 6879931 7579642 8733152 10558539 13457015
13515 13457015 18140954 25739379 37609639 53773166 68628939 70390178 56463904
13508 56463904 38583227 25566543 17674642 12937334 10013663 8171998 6943913 6009402
$$ packed form
13566A5635682n8240J137933K274475L790494N939676R406337J5326024K4985793
13558G8438174L8703948N1370912M3458332l809441n1087483n4693600l5613828
13551F6767014k0609264j2223365p491585m705360l148733k432754k162944k020438
13543A1972571j772636j399088j066819q33391p17100o30781n01569l88235k94310
13534D368642j71928p4038k5018j4407J6317N6220J20785K83810N44158P96696
13524E901237P11091J83324k04514m2831L31624O99711J153510J825387K898476
13515A3457015M683939P598425J1870260J6163527J4855773J761239j3926274
13508E6463904j7880677j3016684p891901m737308k923671j841665j228085r34511
$$ plain form
13500 6009402 5204442 4471192 3817576 3298800 2909691 2606791 2345641 2109445 1901769
13491 1901769 1729922 1570147 1433766 1337446 1260603 1201590 1135219 1073938 1008536 939108 858860
13480 858860 796779 771748 748594 730578 720334 734283 779556 805186 808091 794050 772323 754059
13468 754059 717542 678370 660568 643840 612261 586297 579327 581502 563554 546280 544541 548599
13456 548599 530442 500122 476872 440259 427355 423178 429160 452974 481497 495752 480254 447780
13444 447780 400439 366036 350491 329797 321811 317031 310913 303617 286454 275672 279442 288237 292510
13431 292510 294539 319214 379831 414229 423728 431654 436112 455730 476547 482774 483578 478148 446606
13418 446606 424718 407545 388624 378532 368551 376851 396597 398780 387304 366392 350675 356329
$$ packed form
13500F009402q04960p33250o53616n18776l89109l02900k61150k36196k07676
13491A901769j71847j59775j36381r6320p6843n9013o6371o1281o5402o9428q0248
13480H58860o2081k5031k3154j8016j0244J3949M5273K5630K905j4041k1727j8264
13468G54059l6517l9172j7802j6728l1579k5964o970K175j7948j7274j739M058
13456E48599j8157l0320k3250l6613j2904m177N982K3814K8523J4255j5498l2474
13444D47780m7341l4403j5545k0694p986m780o118p296j7163j0782L770Q795M273
13431B92510K029K4675O0617L4398R499P926M458J9618K0817O227Q04n430l1542
13418D46606k1888j7173j8921j0092r981Q300J9746K183j1476k0912j5717N654
$$ plain form
13406 356329 367534 371111 383573 396929 403699 380454 343396 294029 250496 233010 231345 227228
13394 227228 229706 242317 255195 260006 262564 251056 236986 231262 232997 238168 262815 271530 277378
13381 277378 273508 267655 271851 281825 296362 309252 322016 328777 308779 287444 266368 256648 255744
13368 255744 262042 264709 256321 252994 255076 258435 266162 283335 299392 315846 322015 310564 303359
13355 303359 289131 263167 233380 216639 221974 236524 245177 250500 257500 268382 262212 261920 268397
13342 268397 290974 311901 345784 404082 459379 542082 651167 760821 860784 918712 928036
13331 928036 879040 790636 702193 619302 560025 538793 544215 566609 603164 653425 733146 839821
13319 839821 948199 1035497 1067929 1046345 1007253 950943 836034 681451 558948 486841 448787
$$ packed form
13406C56329J1205L577J2462J3356O770k3245l7058m9367m3533j7486j665m117
13394B27228K478J2611J2878M811K558j1508j4070n724J735N171K4647Q715N848
13381B77378l870n853M196R974J4537J2890J2764O761j9998k1335k1076r720r04
13368B55744O298K667q388l327K082L359P727J7173J6057J6454O169j1451p205
13355C03359j4228k5964k9787j6741N335J4550Q653N323P000J0882o170k92O477
13342B68397K2577K0927L3883N8298N5297Q2703J09085J09654R9963N7928R324
13331I28036m8996q8404q8443q2891n9277k1232N422K2394L6555N0261P9721J06675
13319H39821J08378Q7298L2432k1584l9092n6310j14909j54583j22503p2107l8054
$$ plain form
13308 448787 408173 372712 342574 339198 350848 356740 364405 364246 369310 381094 380185 367512 340773
13295 340773 320249 305252 303855 307262 314282 324987 320837 331248 359258 411070 464128 502828
13283 502828 531305 542283 551691 570762 592571 610682 625373 649659 703641 810427 961454
13272 961454 1178964 1470059 1844825 2331942 2934303 3791059 5138398 7097758 9412132
13263 9412132 11563855 13517713 15221034 15448895 13820727 11676957 9560263 7288937
13255 7288937 5226738 3748374 2808487 2199870 1781926 1471690 1256943 1113167 996631
13246 996631 902012 835225 786842 739854 686265 648060 621603 586407 541287 493241 444908
13235 444908 404809 366886 332973 297459 270965 262231 256723 256118 257849 269056 291475 322738
$$ packed form
13308D48787m0614l5461l0138l376J1650N892P665j59N064J1784r09j2673k6739
13295C40773k0524j4997j397L407P020J0705m150J0411K8010N1812N3058L8700
13283E02828K8477J0978R408J9071K1809J8111J4691K4286N3982J06786J51027
13272I61454K17510K91095L74766M87117O02361Q56756J347339J959360K314374
13263I412132K151723J953858J703321K27861j628168k143770k116694k271326
13255G288937k062199j478364r39887o08617m17944l10236k14747j43776j16536
13246I96631r4619o6787m8383m6988n3589l8205k6457l5196m5120m8046m8333
13235D44908m0099l7923l3913l5514k6494q734n508o05J731J1207K2419L1263
$$ plain form
13223 322738 325471 288476 246136 213123 203431 204180 204293 201756 201444 195437 193159 192918 185347 176680
13209 176680 177287 184742 185309 172388 157417 155945 153288 167699 172929 166445 170235 169223 158709 142824
13195 142824 124848 105880 99921 108411 116449 112901 105663 104210 105339 113969 108666 106878 115516 126171
13181 126171 128571 120786 119379 128777 138955 153414 182950 233846 296250 372268 419995 397308
13169 397308 323918 255799 209722 174698 145595 126988 113462 102498 101705 104666 95398 85383
13157 85383 86117 93660 91118 96237 97279 96784 95896 96112 97129 98242 99392 107991 126225 165825 207340
13142 207340 246045 255148 222941 187194 172013 175507 181948 186595 194145 201438 229791 283122 373419
13129 373419 503497 692196 939291 1144102 1130718 893493 636961 455008 333119 262036
$$ packed form
13223C22738K733l6995m2340l3013r692P49J13k537l12o007k278k41p571q667
13209A76680O07P455N67j2921j4971j472k657J4411N230o484L790j012j0514j5885
13195A42824j7976j8968n959Q490Q038l548p238j453J129Q630n303j788Q638J0655
13181A26171K400p785j407R398J0178J4459K9536N0896O2404P6018M7727k2687
13169C97308p3390o8119m6077l5024k9103j8607j3526j0964p93K961r268j0015
13157H5383P34P543k542N119J042m95q88K16J017J113J150Q599J8234L9600M1515
13142B07340L8705R103l2207l5747j5181L494O441M647P550P293K8353N3331R0297
13129C73419J30078J88699K47095K04811j3384k37225k56532j81953j21889p1083
$$ plain form
13119 262036 227275 195635 167033 159137 149481 139667 124753 111600 112595 113634 102591 77904 76508
13106 76508 77425 78114 75341 77936 76396 74914 68838 63278 62124 63390 73543 93863 113263 129935
13092 129935 148581 160955 156894 149202 161836 195269 249088 322433 443538 629008 868272
13081 868272 1099085 1154893 957021 677801 472418 337259 257331 201762 166407 152160
13071 152160 142357 128665 116174 98585 86433 84872 69597 57795 65405 70878 67118 61956 54959
13058 54959 53294 53248 50651 46897 49686 59269 60517 61342 68883 67436 68632 68779 69862 72458 75747
13043 75747 78566 95803 116792 148733 181312 223734 282391 359781 392926 349237 260258 182901
13031 182901 133766 107673 84523 76126 70415 54070 46377 54115 58427 39684 28284 36256 41026
$$ packed form
13119B62036l4761l1640k8602p896r656r814j4914j3153R95J039j1043k4687j396
13106G6508R17O89k773K595j540j482o076n560j154J266J0153K0320J9400J6672
13092A29935J8646J2374m061p692J2634L3433N3819P3345J21105J85470K39264
13081H68272K30813N5808j97872k79220k05383j35159p9928n5569l5355j4247
13071A52160r803j3692j2491j7589j2152j561j5275j1802P610N473l760n162o997
13058E4959j665m6k597l754K789R583J248Q25P541j447J196J47J083K596L289
13043G5747K819J7237K0989L1941L2579M2422N8657P7390L3145m3689q8979p7357
13031A82901m9135k6093k3150q397n711j6345p693P738M312j8743j1400P972M770
$$ plain form
13018 41026 48999 42105 33082 31149 35708 30231 32132 33132 29479 20695 19545 20126 13363 10714 14515
13003 14515 30485 31373 23968 28240 30406 22240 21580 23476 20858 22374 22271 20709 28204 41163 43701
12988 43701 32909 27657 25514 29081 31498 30275 28407 25323 18226 22324 30776 26459 20254 18973
12974 18973 13195 9863 7654 11985 20406 18976 16049 13747 21864 14829 6228 2278 -2961 -3405 10786
12959 10786 24283 19225 15914 19590 19958 19911 21165 22378 26651 37900 47437 33492 15302 12377
12945 12377 14867 17897 12260 11927 11620 20870 25273 33219 29052 20649 29047 35400 29233 22650 25500
12930 25500 34960 43223 49137 39728 27924 25532 26043 28641 35583 25856 16063 11635 15018 18469
12916 18469 12448 2979 -3132 8088 14390 15771 22277 29905 33579 28362 13496 7315 2924 8910
$$ packed form
13018D1026P973o894r023j933M559n477J901J000l653q784j150N81o763k649L801
13003A4515J5970Q88p405M272K166q166o60J896k618J516j03j562P495J2959K538
12988D3701j0792n252k143L567K417j223j868l084p097M098Q452m317o205j281
12974A8973n778l332k209M331Q421j430k927k302Q117p035q601l950n239m44J4191
12959A0786J3497n058l311L676L68m7J254J213M273J1249R537j3945j8190k925
12945A2377K490L030n637l33l07R250M403P946m167q403Q398O353o167o583K850
12930B5500R460Q263N914r409j1804k392N11K598O942r727r793m428L383L451
12916A8469o021r469o111J1220O302J381O506P628L674n217j4866o181m391N986
$$ plain form
12902 8910 14920 24304 27754 31702 38885 40838 36411 31724 20499 16464 19126 22829 19379 3016
12888 3016 5811 24353 31614 25695 20268 13507 10486 13334 16068 20226 35417 47680 51273 48147
12874 48147 52198 47123 46623 45605 47171 52916 47417 35218 24391 23192 21650 15653 23040 28515
12860 28515 34728 35237 35260 39869 34091 34284 25142 31850 37871 41180 63632 97497 134416 159553
12846 159553 150305 132266 130356 123816 111493 103219 86656 74117 61714 36508 24596 18159
12834 18159 22359 31403 33804 33108 29421 23354 20795 20928 20364 15941 13191 7757 9009 9526 13308
12819 13308 21135 16355 8370 17015 25319 28040 19044 13138 19283 21865 21203 22923 28225 28996 21606
12804 21606 25827 33012 34608 40347 41145 33579 32097 40321 42473 41755 42309 38868 36535 23788 9405
$$ packed form
12902H910O010R384L450L948P183J953m427m687j1225m035K662L703l450j6363
12888C016K795J8542P261n919n427o761l021K848K734M158J5191J2263L593l126
12874D8147M051n075n00j018J566N745n499j2199j0827j199j542n997P387N475
12860B8515O213N09K3M609n778J93r142O708O021L309K2452L3865L6919K5137
12846A59553r248j8039j910o540j2323q274j6563j2539j2403k5206j1912o437
12834A8159M200R044K401o96l687o067k559J33n64m423k750n434J252N17L782
12819A3308P827m780p985Q645Q304K721q996n906O145K582o62J720N302P71p390
12804B1606M221P185J596N739P98p566j482Q224K152p18N54l441k333j2747j4383
$$ plain form
12789 9405 6069 13133 9051 5791 14786 21033 15782 6855 3802 12212 33144 28697 21233 25721
12775 25721 25508 25678 13644 10510 17883 32254 34239 24714 16107 16976 14098 15919 13638 4679 3983
12760 3983 13844 14342 19515 36454 46261 35726 23699 16843 -390 -1045 7285 11669 12470 7219
12746 7219 10923 22324 24051 31928 29333 32288 32104 33243 35832 29108 23075 25798 24298 22883 28515
12731 28515 23466 27199 29684 25704 33366 36945 33211 24064 16588 12351 18247 26781 22299 23737
12717 23737 28058 24925 16218 6177 7698 8777 1054 -4884 -1564 13339 17708 17155 16668 18210
12703 18210 19243 16323 9514 18517 27509 27620 8072 10786 14333 18071 10073 835 3233 5405
12689 5405 7559 18803 16016 10305 24280 23970 22399 29229 27221 19661 14939 14963 23731 17563 13002
$$ packed form
12789I405l336P064m082l260Q995O247n251q927l053Q410K0932m447p464M488
12775B5721k13J70j2034l134P373J4371J985r525q607Q69k878J821k281q959o96
12760C983R861M98N173J6939R807j0535j2027o856j7233o55Q330M384Q01n251
12746G219L704J1401J727P877k595K955j84J139K589o724o033K723j500j415N632
12731B8515n049L733K485l980P662L579l734r147p476m237N896Q534m482J438
12717B3737M321l133q707j0041J521J079p723n938L320J4903M369n53m87J542
12703A8210J033k920o809R003Q992J11j9548K714L547L738p998r238K398K172
12689E405K154J1244k787n711J3975l10j571O830k008p560m722K4Q768o168m561
$$ plain form
12674 13002 16734 22186 18334 9443 2476 4269 532 2426 11396 25944 37106 33026 23855 14916
12660 14916 3725 2161 11092 29780 25279 19575 30748 30814 32057 26995 25573 32245 32647 29753
12646 29753 34780 44850 49047 40909 37802 31016 28467 26872 26444 28597 21911 14451 -4438 -7738
12632 -7738 -8179 -7255 750 6963 9277 4047 5742 2371 5744 7068 9523 8704 18428 18777 11112 13756
12616 13756 12780 13098 7531 19996 29147 24478 20840 17620 21115 20248 16187 17397 17823 14063 17404
12601 17404 30229 23558 18509 26147 15254 16276 20735 14519 15473 11356 10530 12034 16108 19261
12587 19261 19172 19965 20630 27451 25246 14851 8162 11430 12400 13345 14074 18133 15741 9267 7150 5690
12571 5690 8689 5375 426 8338 18548 25356 20486 17527 26431 18898 21530 23101 19443 16866
$$ packed form
12674A3002L732N452l852q891o967J793l737J894Q970J4548J1162m080r171q939
12660A4916j1191j564Q931J8688m501n704J1173O6J243n062j422O672M02k894
12646B9753N027J0070M197q138l107o786k549j595m28K153o686p460j8889l300
12632g738m41R24Q005O213K314n230J695l371L373J324K455q19R724L49p665K644
12616A3756r76L18n567J2465R151m669l638l220L495q67m061J210M26l760L341
12601A7404J2825o671n049P638j0893J022M459o216R54m117q26J504M074L153
12587A9261q9P93O65O821k205j0395o689L268R70R45P29M059k392o474k117j460
12571E690K999l314m949P912J0210O808m870k959Q904p533K632J571l658k577
$$ plain form
12557 16866 18468 17715 14149 10180 16630 20191 8013 14923 14527 19607 18087 13935 7729 1945 13004
12542 13004 14285 8440 13628 19882 21304 23975 26468 22913 8254 2692 8520 2934 16808 20961
12528 20961 19191 20432 18009 19876 20970 24630 28279 32387 36153 39195 37679 41115 47643 50682
12514 50682 46648 56559 62039 53306 57466 62021 57469 51265 50280 53764 59603 55682 51480 46930 42532
12499 42532 47764 52551 53878 53735 52465 47485 29358 26094 31127 40457 36699 36626 44726 49502 59886
12484 59886 58224 50355 52391 53725 47542 47326 48941 57721 61587 77523 77873 88047 103587 115751
12470 115751 117106 112024 122006 134587 151606 159717 154203 148662 142104 132620 127641 117983 116636 107504
12456 107504 96633 85043 77007 72213 75303 70116 70813 71529 66139 51847 45079 53895 67936 66061
$$ packed form
12557A6866J602p53l566l969O450L561j2178O910l96N080j520m152o206n784J1059
12542A3004J281n845N188O254J422K671K493l555j4659n562N828n586J3874M153
12528B0961j770J241k423J867J094L660L649M108L766L042j516L436O528L039
12514E0682m034R911N480q733M160M555m552o204r85L484N839l921m202m550m398
12499D2532N232M787J327j43j270m980j8127l264N033R330l758p3Q100M776J0384
12484E9886j662p869K036J334o183k16J615Q780L866J5936L50J0174J5540J2164
12470A15751J355n082R982J2581J7019Q111n514n541o558r484m979r658j347r132
12456A07504j0871j1590q036m794L090n187O97P16n390j4292o768Q816J4041j875
$$ plain form
12442 66061 71567 70184 60181 57669 62266 57617 52501 49334 48841 50332 55375 58973 65110 75970
12428 75970 75833 85827 101167 113298 128374 129774 131003 141309 156566 164140 162292 149902 139621
12415 139621 127819 126428 117115 112785 112023 95172 76671 74961 76847 78392 75973 66599 59375 56051
12401 56051 61551 68475 60000 54660 57118 54952 54747 49164 51442 51666 47312 47509 55173 53896 57267
12386 57267 58165 55148 65611 65568 62542 52477 49218 65955 78336 81144 92442 99415 92247 78570
12372 78570 68016 58172 59206 63192 64617 65339 57683 65946 70072 69780 78103 74344 68382 62050 58075
12357 58075 53220 46564 54842 53249 39892 44469 56006 52540 39017 26966 36906 58562 65008
12344 65008 66586 62501 60967 65717 70165 61561 48060 44807 47167 40334 42975 38595 43404 46095
$$ packed form
12442F6061N506j383j0003k512M597m649n116l167m93J491N043L598O137J0860
12428G5970j37R994J5340J2131J5076J400J229J0306J5257P574j848j2390j0281
12415A39621j1802j391r313m330p62j6851j8501j710J886J545k419r374p224l324
12401E6051N500O924q475n340K458k166k05n583K278K24m354J97P664j277L371
12386E7267Q98l017J0463m3l026j0065l259J6737J2381K808J1298O973p168j3677
12372G8570j0554r844J034L986J425P22p656Q263M126k92Q323l759n962o332l975
12357E8075m855o656Q278j593j3357M577J1537l466j3523j2051R940K1656O446
12344F5008J578m085j534M750M448q604j3501l253K360o833K641m380M809K691
$$ plain form
12330 46095 47273 48830 46249 41843 39372 38312 39042 50139 61046 62769 52139 53003 57678 54149
12316 54149 47226 45861 49457 54267 47915 42834 34773 14902 14198 31567 51413 63399 63743 53917
12302 53917 56010 63789 73023 62289 57662 58714 42298 36043 40203 49533 58790 57480 62613 64257
12288 64257 70480 71742 63381 61781 57653 59028 56565 49234 41692 35809 45607 56201 61762 66390
12274 66390 71227 81203 90325 96117 100599 90884 77819 75892 64406 65815 81759 84321 74984 69268
12260 69268 64052 56088 49175 56094 60104 65159 67593 73314 80628 76653 80297 88841 91091 93692
12246 93692 82465 85232 98654 93191 77008 73841 75748 72990 75452 91761 96190 92321 92152 90926
12232 90926 80908 78394 77522 84249 99296 111510 110210 105838 110414 114473 109374 99632 91468 98504
$$ packed form
12330D6095J178J557k581m406k471j060P30J1097J0907J723j0630Q64M675l529
12316E4149o923j365L596M810o352n081q061j9871p04J7369J9846J1986L44r826
12302E3917K093P779R234j0734m627J052j6416o255M160R330R257j310N133J644
12288F4257O223J262q361j600m128J375k463p331p542n883R798J0594N561M628
12274F6390M837R976R122N792M482r715j3065j927j1486J409J5944K562r337n716
12260F9268n216p964o913O919M010N055K434N721P314l975L644Q544K250K601
12246I3692j1227K767J3422n463j6183l167J907k758K462J6309M429l869j69j226
12232I0926j0018k514q72O727J5047J2214j300m372M576M059n099r742q164P036
$$ plain form
12218 98504 110284 114022 114602 116613 126656 135904 128579 121481 116140 120297 130673 135243 139471 141901
12204 141901 134721 135887 144579 148567 142039 144852 148956 159909 162351 159324 159678 159142 161371 160724 154731
12189 154731 161543 161403 154284 147138 143263 139716 143703 143899 156759 167099 162946 165002 169633 169607 174547
12174 174547 172126 179594 187345 199599 196993 186529 182177 193115 201236 209521 211692 216869 224432
12161 224432 236719 255420 264303 271928 267315 256193 249152 240920 238969 251176 253256 246442 243768
12148 243768 242755 243405 250919 257470 260580 261272 270637 280358 275836 278371 295621 290986 282589 275934
12134 275934 274913 278835 294303 302813 303405 301407 301868 303585 315298 324267 331803 339091 343115 339492
12120 339492 339713 348718 358734 366230 381400 390190 387751 383500 383520 388188 390407 392073 403506 409857
$$ packed form
12218I8504J1780L738N80K011J0043R248p325p098n341M157J0376M570M228K430
12204A41901p180J166Q692L988o528K813M104J0953K442l027L54n36K229o47n993
12189A54731O812j40p119p146l875l547L987J96J2860J0340m153K056M631k6M940
12174A74547k421P468P751J2254k606j0464m352J0938Q121Q285K171N177P563
12161B24432J2287J8701Q883P625m613j1122p041q232j951J2207K080o814k674
12148B43768j013O50P514O551L110O92R365R721m522K535J7250m635q397o655
12134B75934j021L922J5468Q510N92j998M61J717J1713Q969P536P288M024l623
12120C39492K21R005J0016P496J5170Q790k439m251K0M668K219J666J1433O351
$$ plain form
12106 409857 415744 420075 417956 423327 427061 437722 434923 433524 430999 438776 443128 450316 467653 472513
12092 472513 484087 487181 490773 490980 499495 513496 524318 530247 534169 545910 561785 568605 568581 570578
12078 570578 582161 597921 621857 638102 653344 669987 681018 700569 725676 749906 760584
12067 760584 781120 805157 830851 867366 895028 926757 964018 1006063 1060297 1124498 1196755
12056 1196755 1286788 1397507 1505557 1616455 1719447 1792874 1836508 1834349 1775869 1696898 1612403
12045 1612403 1534086 1463105 1412103 1374358 1337160 1310312 1295570 1297242 1287150 1284343 1282636 1292198
12033 1292198 1314629 1331156 1337695 1354999 1370193 1398105 1418322 1442025 1478374 1507409 1537964
12022 1537964 1585840 1629881 1663673 1681321 1702094 1733732 1781709 1835524 1894260 1949659 2007769
$$ packed form
12106D09857N887M331k119N371L734J0661k799j399k525P777M352P188J7337M860
12092D72513J1574L094L592K07Q515J4001J0822N929L922J1741J5875O820k4J997
12078E70578J1583J5760K3936J6245J5242J6643J1031J9551K5107K4230J0678
12067G60584K0536K4037K5694L6515K7662L1729L7261M2045N4234O4201P2257
12056A196755R0033J10719J08050J10898J02992P3427M3634k159n8480p8971q4495
12045A612403p8317p0981n1002l7745l7198k6848j4742J672j0092k807j707R562
12033A292198K2431J6527O539J7304J5194K7912K0217K3703L6349K9035L0555
12022A537964M7876M4041L3792J7648K0773L1638M7977N3815N8736N5399N8110
$$ plain form
12011 2007769 2065437 2126563 2185299 2246177 2299227 2353121 2425848 2502866 2590329 2684664 2786419
12000 2786419 2884561 2981929 3084641 3199796 3320129 3448049 3580202 3712248 3856475 4000254
11990 4000254 4155519 4326536 4504407 4680734 4880314 5099957 5330368 5569398 5825925
11981 5825925 6103054 6394165 6702268 7024057 7378284 7761356 8184039 8621158 9075736
11972 9075736 9579655 10120551 10714334 11354152 12040289 12780095 13574618 14439543 15383803
11963 15383803 16394602 17487258 18673765 19936862 21286143 22721107 24250922 25876065
11955 25876065 27590773 29393526 31257843 33174080 35115031 37042964 38909405 40672370
11947 40672370 42280414 43653204 44766148 45587378 46063836 46178762 45929340 45326753 44413217
$$ packed form
12011B007769N7668O1126N8736O0878N3050N3894P2727P7018Q7463R4335J01755
12000B786419R8142R7368J02712J15155J20333J27920J32153J32046J44227J43779
11990D000254J55265J71017J77871J76327J99580K19643K30411K39030K56527
11981E825925K77129K91111L08103L21789L54227L83072M22683M37119M54578
11972I075736N03919N40896N93783O39818O86137P39806P94523Q64925R44260
11963A5383803J010799J092656J186507J263097J349281J434964J529815J625143
11955B5876065J714708J802753J864317J916237J940951J927933J866441J762965
11947D0672370J608044J372790J112944Q21230M76458J14926k49422o02587r13536
$$ plain form
11938 44413217 43219637 41808794 40223444 38499904 36696078 34860591 33033022 31227613
11930 31227613 29463286 27767284 26137598 24594947 23146410 21788076 20516564 19326768
11922 19326768 18221767 17186137 16216019 15304768 14471267 13702120 12975082 12283739 11642865
11913 11642865 11053726 10506919 10006503 9541829 9101645 8685517 8289940 7923515 7577124
11904 7577124 7258576 6959760 6678754 6419157 6160416 5914483 5697967 5494758 5295352
11895 5295352 5102197 4930017 4759046 4596861 4446018 4291749 4148785 4015550 3887779
11886 3887779 3767114 3658569 3556898 3452863 3351073 3259352 3176554 3089301 2988595 2905837
11876 2905837 2837060 2773681 2706406 2644377 2580012 2516385 2456982 2391981 2331041 2266639 2209830
$$ packed form
11938D4413217j193580j410843j585350j723540j803826j835487j827569j805409
11930C1227613j764327j696002j629686j542651j448537j358334j271512j189796
11922A9326768j105001j035630r70118r11251q33501p69147p27038o91343o40874
11913A1642865n89139n46807n00416m64674m40184m16128l95577l66425l46391
11904G577124l18548k98816k81006k59597k58741k45933k16516k03209j99406
11895E295352j93155j72180j70971j62185j50843j54269j42964j33235j27771
11886C887779j20665j08545j01671j04035j01790r1721q2798q7253j00706q2758
11876B905837o8777o3379o7275o2029o4365o3627n9403o5001o0940o4402n6809
$$ plain form
11865 2209830 2159176 2114645 2078874 2031340 1993286 1958230 1914535 1867472 1821979 1778520 1747181
11854 1747181 1723631 1689562 1663927 1646035 1626155 1604147 1577812 1549277 1512776 1480332 1450132
11843 1450132 1422590 1398176 1383331 1359652 1332227 1307878 1273107 1251954 1250230 1236698 1221502
11832 1221502 1206774 1192317 1172649 1151232 1144250 1129598 1112876 1099435 1075994 1057114 1038247
11821 1038247 1029973 1024836 1018624 1013949 1003970 1003275 996118 985300 975668 959938 958037 950151 932739
11808 932739 911191 894386 884150 873677 862149 848159 839491 827725 828596 829091 818070 798879
11796 798879 796819 806010 802076 794640 777521 768969 758216 743532 737866 741165 740880 733722 732320 742279
11782 742279 739815 725594 712192 707001 710305 709116 691699 674209 662517 649822 641506 639249 630226
$$ packed form
11865B209830n0654m4531l5771m7534l8054l5056m3695m7063m5493m3459l1339
11854A747181k3550l4069k5635j7892j9880k2008k6335k8535l6501l2444l0200
11843A450132k7542k4414j4845k3679k7425k4349l4771k1153j724j3532j5196
11832A221502j4728j4457j9668k1417o982j4652j6722j3441k3441j8880j8867
11821A038247q274n137o212m675r979o95p157j0818r632j5730j901p886j7412
11808I32739k1548j6805j0236j0473j1528j3990q668j1766Q71M95j1021j9191
11796G98879k060R191l934p436j7119q552j0753j4684n666L299k85p158j402R959
11782G42279k464j4221j3402n191L304j189j7417j7490j1692j2695q316k257r023
$$ plain form
11769 630226 628999 631417 622491 618368 616137 614955 613667 612896 608683 599631 588601 580409 579570 569108
11755 569108 564920 559603 556834 556440 544567 547323 548539 539211 540781 531633 530647 532413 528740 522920
11741 522920 516270 518958 520785 514354 504381 507242 507627 495301 482290 473356 474443 472535 458920 450097
11727 450097 454057 468949 469577 464161 460650 462725 465096 461975 464810 464765 464808 457906 439510 432482 433348
11712 433348 447655 459373 456156 435152 423808 410336 414374 414683 410331 403439 401495 398920 397557
11699 397557 399979 393617 386262 385698 386555 385741 377281 371440 365443 357023 353556 353296 360394 362166 362628
11684 362628 360162 342049 337073 332539 328487 339847 357903 354996 341682 336669 336076 328816 325488
11671 325488 326186 324185 318428 313454 309934 291283 288128 286786 287367 290739 298823 293379 281410 278261
$$ packed form
11769F30226j227K418q926m123k231j182j288p71m213r052j1030q192q39j0462
11755E69108m188n317k769l94j1873K756J216r328J570r148r86J766l673n820
11741E22920o650K688J827o431r973K861L85j2326j3011q934J087j908j3615q823
11727D50097L960J4892O28n416l511K075K371l121K835m5M3o902j8396p028Q66
11712D33348J4307J1718l217k1004j1344j3472M038L09m352o892j944k575j363
11699C97557K422o362p355n64Q57q14q460n841n997q420l467k60P098J772M62
11684C62628k466j8113m976m534m052J1360J8056k907j3314n013n93p260l328
11671C25488O98k001n757m974l520j8651l155j342N81L372Q084n444j1969l149
$$ plain form
11657 278261 265867 267820 270877 270465 269907 263129 256574 261496 258762 246998 237499 228595 224806 231500
11643 231500 227236 219830 219616 216840 210571 208621 216417 224584 226419 221287 214726 218071 224798 226322
11629 226322 220626 215027 214967 207796 193639 194848 195710 199944 202796 198733 198701 204637 209863 206693 194589
11614 194589 190687 190667 187601 188910 188591 183176 182445 176297 167345 169478 174452 174317 168831 172184 174479
11599 174479 170326 168576 166279 162670 162896 159129 158604 153148 153003 158613 157931 159434 147875 134233 134143
11584 134143 133861 126398 123457 123598 123381 127688 126119 133687 135300 133519 137036 137763 131839 127015 118391
11569 118391 117551 120378 130033 123137 116558 123610 127711 127993 128012 121482 116213 107588 101508 98674 99742
11554 99742 104221 99130 94127 92088 90954 104325 108354 106098 98429 101228 100828 97862 97974 98329 105587
$$ packed form
11657B78261j2394J953L057m12n58o778o555M922k734j1764r499q904l789O694
11643B31500m264p406k14k776o269j950P796Q167J835n132o561L345O727J524
11629B26322n696n599o0p171j4157J209Q62M234K852m063l2N936N226l170j2104
11614A94589l902k0l066J309l19n415p31o148q952K133M974j35n486L353K295
11599A74479m153j750k297l609K26l767n25n456j45N610o82J503j1559j3642r0
11584A34143k82p463k941J41k17M307j569P568J613j781L517P27n924m824q624
11569A18391q40K827R655o896o579P052M101K82J9o530n269q625o080k834J068
11554I9742M479n091n003k039j134J3371M029k256p669K799m00k966J12L55P258
$$ plain form
11539 105587 104729 106096 105812 112241 118195 108517 104688 102824 111039 122100 120805 109707 101723 99200
11525 99200 100713 95327 83293 78587 79037 91440 87353 87600 83236 79927 75806 68935 65482 65163 69156
11510 69156 72370 72000 64622 64630 77583 74965 74550 73960 66457 67561 66668 78420 85260 86120 74385 68099
11494 68099 62170 52783 60526 66447 63310 62729 71474 82847 83844 91320 93354 83693 76354 73870 80332
11479 80332 76805 68352 62335 62113 63055 66683 67273 58610 52847 60947 67883 60660 57285 56978 52820
11464 52820 52472 51862 56339 66457 64539 50322 41328 33899 35532 40299 37245 41970 37407 32432
11450 32432 46491 56414 56243 48929 49598 52533 48784 45450 55029 56073 49628 58881 57562 56347 64026
11435 64026 56498 55584 43420 34522 29630 40281 45620 41046 38017 39417 43471 46373 42568 25022
$$ packed form
11539A05587q58J367k84O429N954r678l829j864Q215J1061j295j1098p984k523
11525I9200J513n386j2034m706M50J2403m087K47m364l309m121o871l453l19L993
11510F9156L214l70p378QJ2953k618m15n90p503J104q93J1752O840Q60j1735o286
11494F8099n929r387P743N921l137n81Q745J1373R97P476K034r661p339k484O462
11479H0332l527q453o017k22R42L628N90q663n763Q100O936p223l375l07m158
11464E2820l48o10M477J0118j918j4217q994p429J633M767l054M725m563m975
11450C2432J4059R923j71p314O69K935l749l334R579J044o445R253j319j215P679
11435F4026p528r14j2164q898m892J0651N339m574l029J400M054K902l805j7546
$$ plain form
11421 25022 16302 17996 19084 20097 23740 29043 29709 26593 21648 26894 35766 41042 34141 24997 18327
11406 18327 23977 28522 28810 33045 31805 30060 24886 21580 16684 19538 33947 33985 26599 29086 29722
11391 29722 32512 32853 32480 29717 43273 52991 49258 37702 35007 40486 41010 35135 30916 38504 38786
11376 38786 47943 51102 45017 48570 51305 43239 41272 38683 31257 34686 44191 39223 32743 35602
11362 35602 33198 28159 19016 23545 43697 38737 34804 34036 32284 37405 38215 29214 32918 33556 37556
11347 37556 35499 27827 25190 23916 20467 23053 24285 28468 27493 27178 29750 31281 41095 35643 18685
11332 18685 9677 15955 19605 14997 6167 6930 10894 12525 4850 5087 6165 16171 21511 19811 29264
11317 29264 33442 31716 28513 34430 36132 27629 25385 22301 20622 19066 13363 15850 22288 28571
$$ packed form
11421B5022q720J694J088J013L643N303O66l116m945N246Q872N276o901r144o670
11406A8327N650M545K88M235j240j745n174l306m896K854J4409L8p386K487O36
11391B9722K790L41l73k763J3556R718l733j1556k695N479N24n875m219P588K82
11376C8786R157L159o085L553K735q066j967k589p426L429R505m968o480K859
11362C5602k404n039r143M529K0152m960l933p68j752N121Q10r001L704O38M000
11347C7556k057p672k637j274l449K586J232M183r75l15K572J531R814n452j6958
11332A8685r008O278L650m608q830P63L964J631p675K37J078J0006N340j700R453
11317B9264M178j726l203N917J702q503k244l084j679j556n703K487O438O283
$$ plain form
11303 28571 23857 20765 24973 28809 25031 21657 21780 18461 16966 25701 21086 19627 13199 9233 19480
11288 19480 30064 37826 40066 40112 27415 25794 29397 34589 30997 29222 27911 28852 29753 26795 17327
11273 17327 15948 27788 29099 19748 19564 14131 13492 20306 22163 21338 31744 34823 29382 36934 43015
11258 43015 32653 22348 22997 26156 25496 25754 29035 30459 18856 17181 17309 16069 13582 6815 -5915
11243 -5915 -5821 6030 14580 10394 8107 -2655 -10013 -8180 -4679 -2409 -6998 -2348 2474 8602 20414
11228 20414 23820 12222 11371 12942 17690 20405 18370 9148 10363 19867 15793 19711 18753 23232 28440
11213 28440 27949 22477 24359 20311 17425 11363 5762 14888 33800 26699 18434 10855 9694 9419 4627
11198 4627 4955 17218 36949 38925 34139 32996 22405 20618 20090 21440 20232 15274 13203 10543
$$ packed form
11303B8571m714l092M208L836l778l374J23l319j495Q735m615j459o428l966J0247
11288A9480J0584P762K240M6j2697j621L603N192l592j775j311R41R01k958r468
11273A7327j379J1840J311r351j84n433o39O814J857q25J0406L079n441P552O081
11258D3015j0362j0305O49L159o60K58L281J424j1603j675J28j240k487o767j2730
11243e915R4J1851Q550m186k287j0762p358J833L501K270m589M650M822O128J1812
11228B0414L406j1598q51J571M748K715k035r222J215R504m074L918r58M479N208
11213B8440m91n472J882m048k886o062n601R126J8912p101q265p579j161k75m792
11198D627L28J2263J9731J976m786j143j0591j787n28J350j208m958k071k660
$$ plain form
11184 10543 14832 22379 22263 21402 10401 3513 6115 11134 4653 -202 7455 18390 24644 15904
11170 15904 5580 6999 5621 4755 3707 5714 13049 17928 25837 18402 7305 14721 25584 23965
11156 23965 10909 4577 3052 8176 15180 8584 2315 3543 -1780 2889 10096 14681 20387 16446
11142 16446 19744 24140 20594 10949 5143 13552 10753 12629 13119 12936 8765 5302 265 7835 16985
11127 16985 23488 28273 32428 23572 15038 12233 10063 11443 13695 14802 19120 31626 37277 36470
11113 36470 27276 15029 3185 -1358 8266 12537 12908 8895 16923 8149 10337 7395 9189 25812
11099 25812 22985 12031 10848 12694 10143 7496 10534 13902 20133 19708 13540 10482 12682 16482
11085 16482 15885 14198 11017 5648 5819 3611 -3479 -2553 4013 4304 11980 14874 11756 9653 17878
$$ packed form
11184A0543M289P547j16q61j1001o888K602N019o481m855P657J0935O254q740
11170A5904j0324J419j378q66j048K007P335M879P909p435j1097P416J0863j619
11156B3965j3056o332j525N124P004o596o269J228n323M669P207M585N706l941
11142A6446L298M396l546r645n806Q409k799J876M90j83m171l463n037P570R150
11127A6985O503M785M155q856q534k805k170J380K252J107M318J2506N651q07
11113C6470r194j2247j1844m543R624M271L71m013Q028q774K188k942J794J6623
11099B5812k827j0954j183J846k551k647L038L368O231m25o168l058K200L800
11085A6482n97j687l181n369J71k208p090R26O566K91P676K894l118k103Q225
$$ plain form
11070 17878 13549 10806 4431 -1301 -260 -1354 4855 6897 12831 9770 3130 11149 17450 18097 12947
11055 12947 11668 19047 12853 13824 16215 18692 17619 14860 11002 6115 8541 6591 9454 17826 13347
11040 13347 8700 20820 20293 8623 5010 12697 19135 16728 13476 11963 9238 15813 1424 -12056
11026 -12056 -12967 123 8004 5675 6994 3907 7702 14813 13766 17156 10600 14856 12666 14000
11012 14000 9768 8693 14691 20200 15649 19969 24220 23540 23255 13726 -4708 1720 5264 5485 6137
10997 6137 -551 10451 22555 18684 8014 10850 16797 24588 24730 22316 21541 18579 24595 15057
10983 15057 7599 11584 15628 10040 4676 7955 12288 17739 18676 10735 7758 5331 3573 978 7794
10968 7794 6009 -4400 -11051 -4470 -3158 -1856 -1924 -1976 -1578 1675 7466 7284 5127 5670 6532 1166
$$ packed form
11070A7878m329k743o375n732J041j094O209K042N934l061o640Q019O301O47n150
11055A2947j279P379o194R71K391K477j073k759l858m887K426j950K863Q372m479
11040A3347m647J2120n27j1670l613P687O438k407l252j513k725O575j4389j3480
11026a2056r11J3090P881k329J319l087L795P111j047L390o556M256k190J334
11012A4000m232j075N998N509m551M320M251o80k85r529j8434O428L544K21O52
10997F137o688J1002J2104l871j0670K836N947P791J42k414p75k962O016r538
10983A5057p458L985M044n588n364L279M333N451R37p941k977k427j758k595O816
10968G794j785j0409o651O581J312J302o8n2L98L253N791j82k157N43Q62n366
$$ plain form
10952 1166 3960 12579 11796 21080 27628 29294 26197 17563 6112 7977 9476 17709 25913 25071 16828
10937 16828 1814 -272 10472 17180 13550 24847 38284 49417 71809 111292 149750 132778
10925 132778 90147 56847 37806 31206 18353 12304 11178 9375 12993 26630 27517 14594 7897
10912 7897 15885 20801 26957 29972 24148 10210 6318 4716 3893 8197 9905 7559 5816 2818 -3576
10897 -3576 -8644 -5600 3572 15007 16702 10134 8204 3677 2516 7103 11158 12146 11600 12252 21035
10882 21035 23786 33774 41907 33644 15141 598 -4333 -5934 -2306 758 1111 8539 32871 47978
10868 47978 39191 22254 15878 11719 12277 20984 19355 9589 260 -511 -4863 9564 23817 24792
10854 24792 13032 5735 8803 16262 19845 12103 6950 -6520 -4233 -5787 -1027 -900 -1043 571
$$ packed form
10952A166K794Q619p83R284O548J666l097q634j1451J865J499Q233Q204q42q243
10937A6828j5014k086J0744O708l630J1297J3437J1133K2392L9483L8458j6972
10925A32778m2631l3300j9041o600j2853o049j126j803L618J3637Q87j2923o697
10912G897P988M916O156L015n824j3938l892j602q23M304J708k346j743k998o394
10897c576n068L044R172J1435J695o568j930m527j161M587M055R88n46O52Q783
10882B1035K751R988Q133q263j8503j4543m931j601L628L064L53P428K4332J5107
10868D7978q787j6937o376m159N58Q707j629r766r329p71m352J4427J4253R75
10854B4792j1760p297L068P459L583p742n153j3470K287j554M760J27j43J614
$$ plain form
10840 571 2946 -1800 -2961 2163 11016 12657 8899 5755 2505 2067 10287 12981 10835 8958 12102
10825 12102 16093 15535 13942 16846 10678 6325 8827 6875 6221 8157 -31 1835 5456 16029 22623
10810 22623 17252 20839 15424 15294 19857 22910 15313 4779 -1859 2896 8314 5831 -850 535
10796 535 -3646 -3265 -576 5849 16091 18481 19496 19520 22656 22656 15874 13139 17458 11201 5172 -2755
10780 -2755 -1499 4891 10244 18554 16318 15318 16824 17205 12570 13355 15904 11636 5389 5970 14791
10765 14791 12364 8698 8536 9614 7649 7488 20648 27778 33872 23836 17603 14289 10479 9558 5660
10750 5660 796 -1313 -4374 114 7155 12467 15114 13469 4359 17093 33599 35765 37129 36932
10736 36932 37398 32275 32566 37230 36354 28582 20037 16105 10180 10439 15039 11982 18582 20087 12091
$$ packed form
10840E71K375m746j161N124Q853J641l758l144l250m38Q220K694k146j877L144
10825A2102L991n58j593K904o168m353K502j952o54J936q188J866L621J0573O594
10810B2623n371L587n415j30M563L053p597j0534o638M755N418k483o681J385
10796E35m181L81K689O425J0242K390J015K4L136%o782k735M319o257o029p927
10780b755J256O390N353Q310k236j000J506L81m635P85K549m268o247N81Q821
10765A4791k427l666j62J078j965j61J3160P130O094j0036o233l314l810r21l898
10750E660m864k109l061M488P041N312K647j645r110J2734J6506K166J364j97
10736C6932M66n123K91M664q76p772q545l932n925K59M600l057O600J505p996
$$ plain form
10721 12091 3117 5428 6316 5400 5920 5922 12085 14729 14670 8940 3537 2 3647 10853 12899 2630
10705 2630 -2193 -360 -7633 -1642 4014 6583 2292 3280 3482 10343 16565 11460 772 -6581 -3500
10690 -3500 9044 21809 18163 20253 16510 13127 14247 10863 17586 27563 27684 21294 40587 65268
10676 65268 73916 67942 62933 57822 59482 67931 69419 81322 117377 175913 260969 326505 300467
10663 300467 234719 202502 209738 200220 164989 131147 105747 98963 113984 139457 180522 255281
10651 255281 387010 569237 641437 505983 327460 227701 180368 145359 117710 101880 89274
10640 89274 86288 89945 97390 127225 173863 235989 311152 306210 214243 138697 100626 63243
10628 63243 36098 33549 28485 36111 36294 28518 17113 18655 27518 28788 31918 31234 34029 21163
$$ packed form
10721A2091q974K311Q88r16N20KO163K644n9n730n403l535L645P206K046j0269
10705B630m823J833p273N991N656K569m291R88K02O861O222n105j0688p353L081
10690c500J2544J2765l646K090l743l383J120l384O723R977J21o390J9293K4681
10676F5268Q648n974n009n111J660Q449J488J1903L6055N8536Q5056O5536k6038
10663C00467o5748l2217P236r518l5231l3842k5400o784J5021K5473M1065P4759
10651B55281J31729J82227P2200j35454j78523r9759m7333l5009k7649j5830j2606
10640H9274k986L657P445K9835M6638O2126P5163m942r1967p5546l8071l7383
10628F3243k7145k549n064P626J83p776j1405J542Q863J270L130o84K795j2866
$$ plain form
10614 21163 19620 28330 31674 25834 24873 28039 19148 16127 18361 20795 23676 36427 40194 39531 28819
10599 28819 25880 29883 30594 32683 29231 25672 30546 30030 27789 25503 29776 22803 29737 40000 45636
10584 45636 45288 40604 42361 38687 34531 28752 30923 32444 33872 30376 31472 39124 39976 34595 23095
10569 23095 15102 16621 26558 30922 33698 26647 18437 14942 11952 15440 27787 28077 15360 16220
10555 16220 24144 27419 30380 39892 52375 64720 70749 75978 66921 65360 59935 47708 47045 39123
10541 39123 27010 22674 25261 36503 40290 48935 67562 74905 73020 57943 48926 52357 47948
10528 47948 40779 35290 33180 36968 41319 44071 40259 39768 53253 47771 43609 29823 21179 25751
10514 25751 33700 38985 34970 35722 34256 37050 45718 49122 44082 38004 35216 37910 43224 44090 43148
$$ packed form
10614B1163j543Q710L344n840r61L166q891l021K234K434K881J2751L767o63j0712
10599B8819k939M003P11K089l452l559M874n16k241k286M273o973O934J0263N636
10584D5636l48m684J757l674m156n779K171J521J428l496J096P652Q52n381j1500
10569B3095p993J519R937M364K776p051q210l495k990L488J2347K90j2717Q60
10555A6220P924L275K961R512J2483J2345O029N229r057j561n425j2227o63p922
10541C9123j2113m336K587J1242L787Q645J8627P343j885j5077r017L431m409
10528D7948p169n489k110L788M351K752l812m91J3485n482m162j3786q644M572
10514B5751P949N285m015P52j466K794Q668L404n040o078k788K694N314Q66r42
$$ plain form
10499 43148 50974 47461 49947 58415 74766 75481 79045 84337 89837 90855 86172 106949 140618 190223
10485 190223 280600 356966 325203 221431 161345 138144 126474 135439 147204 154162 141227 141540
10473 141540 162575 211431 295827 460513 641163 635198 429260 259825 185118 142239 116215
10462 116215 104901 106539 102860 107707 118622 142025 178315 238340 324240 356216 276373 169547
10450 169547 104811 76006 53843 40119 32698 49902 49670 41387 44725 43392 49183 63547 68755
10437 68755 57641 46164 32115 24214 24891 23823 21590 14335 16917 24940 20359 20665 16224 20326
10423 20326 15983 15089 25073 23931 24019 11663 7438 8228 16556 14377 7199 9141 10002 2399 4683
10408 4683 6027 6675 24784 18334 10667 9150 10432 8150 7166 9648 12008 13855 9944 4339 3652
$$ packed form
10499D3148P826l513K486Q468J6351P15L564N292N500J018m683K0777L3669M9605
10485A90223R0377P6366l1763j03772o0086k3201j1670Q965J1765O958j2935L13
10473A41540K1035M8856Q4396J64686J80650n965k05938j69435p4707m2879k6024
10462A16215j1314J638l679M847J0915K3403L6290O0025Q5900L1976p9843j06826
10450A69547o4736k8805k2163j3724p421J7204k32q283L338j333N791J4364N208
10437F8755j1114j1477j4049p901O77j068k233p255K582Q023m581L06m441M102
10423B0326m343q94R984j142Q8j2356m225P90Q328k179p178J942Q61p603K284
10408D683J344O48J8109o450p667j517J282k282r84K482K360J847l911n605o87
$$ plain form
10393 3652 8383 8364 8071 12561 15784 23451 23492 21850 26371 32597 37914 30651 14130 12031 11798 18768
10377 18768 15914 11896 12378 10019 3059 2354 11916 15725 18906 12023 10794 14505 11760 7382 10125
10362 10125 9436 6737 9626 8526 2907 -1815 -7758 -11802 -12805 -7899 -4703 -2933 3127 19408
10348 19408 23047 25215 25620 24490 18227 14848 8467 6370 9326 13492 26593 30672 26990 10818
10334 10818 704 8974 11779 18242 16789 21026 27107 26259 37207 35782 32700 31810 38957 42552
10320 42552 37469 33942 42543 48329 46965 37280 34068 38863 45743 39157 28705 30512 22046 14379
10306 14379 13280 23349 29468 27847 31060 30282 34748 37391 44104 41145 32517 24386 28643 41167
10292 41167 40477 37434 33293 24743 23771 19767 14598 15502 22029 23223 19095 28325 38464 45408 48477
$$ packed form
10393C652M731j9k93M490L223P667M1j642M521O226N317p263j6521k099k33O970
10377A8768k854m018M82k359o960p05R562L809L181o883j229L711k745m378K743
10362A0125o89k699K889j100n619m722n943m044j003M906L196J770O060J6281
10348A9408L639K168M05j130o263l379o381k097K956M166J3101M079l682j6172
10334A0818j0114Q270K805O463j453M237O081q48J0948j425l082q90P147L595
10320D2552n083l527Q601N786j364r685l212M795O880o586j0452J807q466p667
10306A4379j099J0069O119j621L213p78M466K643O713k959q628q131M257J2524
10292D1167o90l043m141q550r72m004n169R04O527J194m128R230J0139O944L069
$$ plain form
10277 48477 41730 38414 37875 40983 34226 31372 32552 29601 34152 33885 35454 29805 18846 13114 23219
10262 23219 33286 32639 36815 44503 40482 32370 36839 31500 28010 31227 35842 36728 34041 40865 39752
10247 39752 41295 38512 37693 31693 20779 22881 24310 28415 36023 37979 34726 44926 47159 46018
10233 46018 49560 56872 60358 49590 48921 45558 51278 48687 45137 39626 38344 39313 42235 48969 56440
10218 56440 59925 56400 51480 40857 43898 54097 57539 57189 61081 66425 68463 60498 61862 61297
10204 61297 59295 61761 62358 73635 73440 73246 77084 80230 74936 69219 72166 85229 90960 91893 89006
10189 89006 89437 71558 66359 67706 67881 73935 80801 89935 88545 99421 95859 91340 93680 95368
10175 95368 93807 89758 93900 104439 104757 95882 100503 107087 105890 102429 110017 124559 136833 135072
$$ packed form
10277D8477o747l316n39L108o757k854J180k951M551k67J569n649j0959n732J0105
10262B3219J0067o47M176P688m021q112M469n339l490L217M615Q86k687O824j113
10247C9752J543k783q19o000j0914K102J429M105P608J956l253J0200K233j141
10233D6018L542P312L486j0768o69l363N720k591l550n511j282R69K922O734P471
10218E6440L485l525m920j0623L041J0199L442l50L892N344K038p965J364n65
10204F1297k002K466N97J1277j95j94L838L146n294n717K947J3063N731R33k887
10189H9006M31j7879n199J347J75O054O866R134j390J0876l562m519K340J688
10175I5368j561m049M142J0539L18q875M621O584j197l461P588J4542J2274j761
$$ plain form
10161 135072 128845 121304 118019 134393 147709 151077 142490 139241 140470 146976 143011 148487 155864 154997
10147 154997 160383 160590 164718 169401 165862 172493 176481 182815 175665 170717 176642 182625 187934 197121
10133 197121 215765 233825 247965 249075 249054 252918 245018 238436 250658 261709 277099 284081 270359
10120 270359 268177 284065 289750 287136 289743 300343 303862 300523 298820 304960 311663 314601 325640
10107 325640 327584 332680 336773 343863 358017 378900 388149 397114 414550 427017 429714 430017 434081
10094 434081 434842 440360 456926 479587 486987 492172 497310 503018 509843 525785 540393 551557 558690
10081 558690 572442 583891 594606 609368 618130 629177 639753 648616 652830 663641 674365 687304
10069 687304 701455 708384 713686 720031 724045 723377 734216 735008 731860 739447 743320 742824 750544 748647
$$ packed form
10161A35072o227p541l285J6374J3316L368q587l249J229O506l965N476P377q67
10147A54997N386K07M128M683l539O631L988O334p150m948N925N983N309R187
10133A97121J8644J8060J4140J110k1L864p900o582J2222J1051J5390O982j3722
10120B70359k182J5888N685k614K607J0600L519l339j703O140O703K938J1039
10107C25640J944N096M093P090J4154K0883R249Q965J7436J2467K697L03M064
10094D34081P61N518J6566K2661P400N185N138N708O825J5942J4608J1164P133
10081E58690J3752J1449J0715J4762Q762J1047J0576Q863M214J0811J0724J2939
10069F87304J4151O929N302O345M014o68J0839P92l148P587L873m96P720j897
$$ plain form
10055 748647 749947 753853 751385 753577 756363 754074 750497 742152 739345 730473 720610 706790 699466 700124
10041 700124 697022 690325 683292 676426 668478 660160 653882 658777 678689 710525 757011 811152 818364
10028 818364 762930 688782 626430 590891 559502 542063 524453 508328 500800 484088 476385 472206
10016 472206 461963 449931 449673 460992 489656 545330 630360 674497 598163 493898 425594 387221
10004 387221 366775 344249 339177 329589 308186 299289 292418 292212 295946 292508 279459 266305 259951
9991 259951 255264 250611 244424 221348 212289 220402 226947 227849 224556 219095 214354 212069 200196 184436
9977 184436 175068 174697 165096 165361 171891 170324 172967 170318 172498 176008 174136 166330 168792 168247 157745
9962 157745 160743 167204 163996 169040 176833 175800 179090 191685 207766 235182 290376 391988 561138
$$ packed form
10055G48647J300L906k468K192K786k289l577q345k807q872r863j3820p324O58
10041G00124l102o697p033o866p948q318o278M895J9912L1836M6486N4141P212
10028H18364n5434p4148o2352l5539l1389j7439j7610j6125p528j6712p703m179
10016D72206j0243j2032k58J1319K8664N5674Q5030M4137p6334j04265o8304l8373
10004C87221k0446k2526n072r588k1403q897o871k06L734l438j3049j3154o354
9991B59951m687m653o187k3076r059Q113O545R02l293n461m741k285j1873j5760
9977A84436r368l71r601K65O530j567K643k649K180L510j872p806K462n45j0502
9962A57745K998O461l208N044P793j033L290J2595J6081K7416N5194J01612J69150
$$ plain form
9949 561138 764902 858573 737203 512351 348740 254748 209638 175263 149365 126849 113636
9938 113636 107614 106229 91777 95001 102456 96993 108509 104892 95594 84012 78635 69932 66405 69579
9924 69579 68335 58623 53358 53412 49677 47956 46726 43449 46188 47507 51766 52120 55508 67252 72757
9909 72757 72735 65324 59983 56631 55787 54114 52670 57189 62389 53629 49715 50229 45373 43182 48148 44724
9893 44724 40550 33260 37469 41396 35105 39141 45580 39529 32898 28596 40022 38776 35900 41838
9879 41838 34175 28387 17499 24752 28062 31133 42786 46593 37702 22476 14136 3792 6445 6693
9865 6693 17067 28026 36019 34606 28248 22229 21064 20155 16955 6627 4895 4829 -10433 -5922 1457
9850 1457 8452 8414 15662 26864 28531 24465 17135 9442 1289 4562 15351 13900 13870 20391 26936
$$ packed form
9949E61138K03764R3671j21370k24852j63611r3992m5110l4375k5898k2516j3213
9938A13636o022j385j4452L224P455n463J1516l617r298j1582n377q703l527L174
9924F9579j244r712n265N4l735j721j230l277K739J319M259L54L388J1744N505
9909G2757k2p411n341l352q44j673j444M519N200q760l914N14m856k191M966l424
9893D4724m174p290M209L927o291M036O439o051o631m302J1426j246k876N938
9879D1838p663n788j0888P253L310L071J1653L807q891j5226q340j0344K653K48
9865F693J0374J0959P993j413o358o019j165r09l200j0328j732o6j5262M511P379
9850A457O995l8P248J1202J667m066p330p693q153L273J0789j451l0O521O545
$$ plain form
9835 26936 24731 30278 30468 18382 1050 -1762 -3725 1616 16277 25844 25790 19150 16299 9850 10523
9820 10523 3555 -7979 -1498 541 -7000 -8179 -3511 -201 121 -1064 -2869 4445 7521 19097
9806 19097 25434 25337 23875 22918 16049 13656 23960 33697 29665 25373 17474 15122 8277 -1973 -8119
9791 -8119 -1953 850 -3505 -12992 -5727 4882 13551 28547 40071 37670 35933 33988 31367 33046
9777 33046 32192 20118 19200 9176 -2344 -7278 -2174 -966 3195 7656 13976 4262 -6900 -11441
9763 -11441 -20437 -20142 -12163 -1260 -87 -7259 -776 -2253 -815 -1766 -1326 2623 -7797 -2880 8291
9748 8291 5651 3278 176 -7729 -7836 -9660 -10551 -8154 -11197 -7222 -1539 4575 16199 28929 25922
9733 25922 19081 16444 13366 14277 9245 -5254 -2979 -2230 1125 16128 17112 18369 12671 4899 2229
$$ packed form
9835B6936k205N547J90j2086j7332k812j963N341J4661R567n4o640k851o449O73
9820A0523o968j1534O481K039p541j179M668L310L22j185j805P314L076J1576
9806A9097O337r7j462r57o869k393J0304R737m032m292p899k352o845j0250o146
9791h119O166K803m355r487P265J0609Q669J4996J1524k401j737j945k621J679
9777C3046q54j2074r18j0024j1520m934N104J208M161M461O320r714j1162m541
9763a1441q996K95P979J0903J173p172O483j477J438r51M40L949j0420M917J1171
9748H291k640k373l102p905j07j824q91K397l043L975N683O114J1624J2730l007
9733B5922o841k637l078R11n032j4499K275P49L355J5003R84J257n698p772k670
$$ plain form
9718 2229 921 -13708 -12080 -6825 -1435 -3291 -3143 -8336 -9656 -6659 -12009 -4799 -6197 -9870 -11069
9703 -11069 -14580 -9379 -1605 7174 9093 3026 -1073 -11949 -17793 -5118 -611 6859 5881 13600
9689 13600 19353 13394 -820 -7260 -10205 -3813 323 -9034 -15850 -16556 -11177 48 4409 8519
9675 8519 12730 12451 -2293 -6438 -10550 -18370 -21721 -20123 -11825 -3253 -1556 -2052 2498 9901 9943 6813
9659 6813 991 11101 22972 24867 23541 18088 7057 -538 8223 3232 4125 13442 16764 13878
9645 13878 7338 9282 1149 -11777 -17703 -15810 -13295 -10235 -13275 -15029 -12040 -9214 -2505 4788
9631 4788 7942 7180 -252 -3556 -6145 -2978 -1953 956 -6430 -12369 -6506 -3861 -6871 -14063 -17254
9616 -17254 -10150 -1963 -3297 -8896 -7048 -15364 -20493 -21960 -12868 -11943 -6810 -15158 -13486 -11555 -1082
$$ packed form
9718B229j308j4629J628N255N390j856J48n193j320K997n350P210j398l673j199
9703a1069l511N201P774Q779J919o067m099j0876n844J2675M507P470r78P719
9689A3600N753n959j4214o440k945O392M136r357o816p06N379J1225M361M110
9675H519M211k79j4744m145m112p820l351J598Q298Q572J697m96M550P403M2l130
9659F813n822J0110J1871J895j326n453j1031p595Q761m991Q93R317L322k886
9645A3878o540J944q133j2926n926J893K515L060l040j754K989K826O709P293
9631D788L154p62p432l304k589L167J025K909p386n939N863K645l010p192l191
9616a7254P104Q187j334n599J848q316n129j467R092R25N133q348J672J931J0473
$$ plain form
9601 -1082 5739 6345 8199 14803 21958 14588 11301 10170 15760 14201 -1079 1650 1347 -4598 -11303
9586 -11303 -3799 -964 -4388 -8517 -16554 -14495 -10048 -8367 -3711 -6168 -7154 -85 3406 -6693 -23635
9571 -23635 -33406 -26971 -17287 -11973 -17749 -16642 -13748 -10049 -10499 -20487 -22039 -15249 -6996 466 -7045
9556 -7045 -8727 -3814 -18779 -19918 -14719 -10205 -10385 -14998 -19620 -15594 -12387 -20349 -17727 -17539 -10976
9541 -10976 -7361 -10462 -12675 -6791 -3260 5362 -547 -5794 -8955 -17357 -22058 -24368 -10886 -7463
9527 -7463 -12842 -9268 -6380 -2569 4902 -2538 -14439 -22015 -15688 -15392 -19827 -11677 -3966 -10005 -15905
9512 -15905 -16234 -17782 -23963 -20251 -19737 -16011 -10320 -11198 -24638 -20311 -9455 -4840 -4004 -3798 -4505 -10442
9496 -10442 -18185 -19118 -16174 -9262 -6023 -10044 -14013 -16125 -12610 -6022 -14731 -19442 -16254 -14261 -10740
$$ packed form
9601a082O821O06J854O604P155p370l287j131N590j559j5280K729l03n945o705
9586a1303P504K835l424m129q037K059M447J681M656k457r86P069L491j0099j6942
9571b3635r771O435R684N314n776J107K894L699m50r988j552O790Q253P462p511
9556g045j682M913j4965j139N199M514j80m613m622M026L207p962K622J88O563
9541a0976L615l101k213N884L531Q622n909n247l161q402m701k310J3482L423
9527g463n379L574K888L811P471p440j1901p576O327K96m435Q150P711o039n900
9512a5905l29j548o181L712N14L726N691q78j3440M327J0856M615Q36K06p07n937
9496a0442p743r33K944O912L239m021l969k112L515O588q709m711L188J993L521
$$ plain form
9481 -10740 -6188 -4845 -7598 -10359 -18802 -27928 -26054 -20989 -18630 -14023 -13310 -19162 -24980 -26189 -28475
9466 -28475 -17118 -20427 -26264 -24494 -26202 -30004 -30756 -30166 -30437 -32458 -29639 -19493 -12117 -19038 -25425
9451 -25425 -22446 -20611 -30846 -34562 -34382 -33121 -26228 -16494 -12449 -8676 -14089 -17824 -2896 9221
9437 9221 2336 -1239 -10331 -9414 638 6290 10355 -2587 -8944 -14639 -13257 -16759 -19514 -13194 -12002
9422 -12002 -19379 -19026 -23908 -28081 -37851 -34168 -41022 -33588 -32128 -34692 -28778 -29941 -22582 -20501 -23539
9407 -23539 -27413 -19212 -20187 -16499 -14061 -25254 -30954 -27193 -21868 -14270 -4412 -4463 -3338 -7879 -12203
9392 -12203 -3604 1378 -4132 663 14894 27535 33748 32409 27694 16968 -7153 -23539 -27296
9379 -27296 -17473 -16152 -15527 -22611 -26091 -14540 -7318 -18449 -33700 -26493 -10681 -9282 -1345 -9651
$$ packed form
9481a0740M552J343k753k761q443r126J874N065K359M607P13n852n818j209k286
9466b8475J1357l309n837J770j708l802p52N90k71k021K819J0146P376o921o387
9451b5425K979J835j0235l716J80J261O893R734M045L773n413l735J4928J2117
9437I221o885l575r092R17J0052N652M065j2942o357n695J382l502k755O320J192
9422a2002p377L53m882m173r770L683o854P434J460k564N914j163P359K081l038
9407b3539l874Q201r75L688K438j1193n700L761N325P598R858n1J125m541m324
9392a2203Q599M982n510M795J4231J2641O213j339m715j0726k4121j6386l757
9379b7296R823J321O25p084l480J1551P222j1131j5251P207J5812J399P937q306
$$ plain form
9365 -9651 -21788 -10905 5779 10115 2182 8366 9507 5448 -5517 -4993 4534 4636 1774 -925
9351 -925 6545 7279 3387 -6437 -5440 1541 -1985 816 4648 6742 5631 11728 10175 8729 13566 5882
9335 5882 2902 3811 4696 12536 16967 11549 7864 14160 11577 12066 6473 -8216 -5991 -4855 -11776
9320 -11776 -18541 -15505 -6327 -8814 -12068 -13357 -12953 -21371 -30838 -24877 -18549 -21858 -24259 -31227 -30785
9305 -30785 -23650 -26219 -28895 -18549 -9283 -1779 11280 16338 16997 14887 7480 3226 -978 6383
9291 6383 11212 5878 3961 9509 8396 7004 5407 4052 1136 -2299 -9202 -16563 -23865 -31172 -24946
9276 -24946 -16420 -18271 -20827 -25753 -25583 -23910 -25448 -29989 -24270 -23886 -19121 -11584 -13636 -21885 -25700
9261 -25700 -27009 -19514 -15517 -14869 -14327 -10752 4215 25564 38965 44799 49079 62018 80363 87959
$$ packed form
9365i651j2137J0883J6684M336p933O184J141m059j0965N24R527J02k862k699
9351i25P470P34l892r824R97O981l526K801L832K094j111O097j553j446M837p684
9335E882k980R09Q85P840M431n418l685O296k583M89n593j4689K225J136o921
9320a1776o765L036R178k487l254j289M04q418r467N961O328l309k401o968M42
9305c0785P135k569k676J0346R266P504J3059N058O59k110p407m254m204P361
9291F383M829n334j917N548j113j392j597j355k916l435o903p361p302p307O226
9276b4946Q526j851k556m926J70J673j538m541N719L84M765P537k052q249l815
9261b5700j309P495L997O48N42L575J4967K1349J3401N834M280J2939J8345P596
$$ plain form
9247 87959 104876 119518 139499 170282 205272 267400 375861 554891 787949 1032418 1110782
9236 1110782 927294 653002 436488 298453 213089 158766 122065 95060 74651 49036 36658
9225 36658 35467 37154 42418 41434 38503 31395 32732 32198 31930 28936 28493 23984 20523 15049 31068
9210 31068 37796 40179 52488 68362 68989 76442 95406 118940 148207 198509 250836 303076 364277
9197 364277 460614 640766 951909 1446897 2061449 2387393 2079156 1453985 937973 627781
9187 627781 437236 310434 233478 188098 151280 122244 94972 73909 55551 46857 47903 33460
9175 33460 20884 20159 19711 16554 5989 15698 25128 28386 24140 17949 13421 6325 8295 10149 16544
9160 16544 17386 29828 44957 64629 78277 96850 122417 157482 212223 289982 410881 598257
$$ packed form
9247H7959J6917J4642J9981L0783L4990O2128J08461J79030K33058K44469P8364
9236A110782j83488k74292k16514j38035q5364n4323l6701k7005k0409k5615j2378
9225C6658j191J687N264r84k931p108J337n34k68k994m43m509l461n474J6019
9210C1068O728K383J2309J5874O27P453J8964K3534K9267N0302N2327N2240O1201
9197C64277R6337J80152L11143M94988O14552L25944l08237o25171n16012l10192
9187F27781j90545j26802p6956m5380l6818k9036k7272k1063j8358q694J046j4443
9175C3460j2576p25m48l157j0565R709R430L258m246o191m528p096J970J854O395
9160A6544Q42J2442J5129J9672J3648J8573K5567L5065N4741P7759J20899J87376
$$ plain form
9148 598257 855841 1061126 1013673 751911 484797 313134 221854 159609 113964 92511 70004
9137 70004 61406 49754 35663 34061 38311 44138 52271 57662 67611 77006 109707 154498 219094
9124 219094 304621 386224 400449 321854 214306 145535 96499 59410 31985 20083 16707 12916
9112 12916 5604 6500 14248 17429 8502 -547 686 5038 2579 -13095 -36164 -53127 -62993 -48465
9098 -48465 -4821 22975 36226 44992 60686 80011 123434 160032 163576 130729 110028 110869 116725
9085 116725 121929 140824 194937 285726 378407 418402 360973 249787 145624 77330 44275
9074 44275 28779 20055 9699 -11173 -20629 -12334 -3589 -3449 -6829 -891 -9590 -15576 -19306 -17677
9060 -17677 -3754 7894 -4767 -11284 -21996 -33804 -10685 15577 21499 25044 32920 52611 95630
$$ packed form
9148E98257K57584K05285m7453k61762k67114j71663r1280o2245m5645k1453k2507
9137G0004q598j1652j4091j602M250N827Q133N391R949R395L2701M4791O4596
9124B19094Q5527Q1603J4225p8595j07548o8771m9036l7089k7425j1902l376l791
9112A2916p312Q96P748L181q927r049J233M352k459j5674k3069j6963r866J4528
9098d8465M3644K7796J3251Q766J5694J9325M3423L6598L544l2847k0701Q41N856
9085A16725N204J8895N4113R0789R2681L9995n7429j11186j04163o8294l3055
9074D4275j5496q724j0356k0872r456Q295Q745J40l380N938q699n986l730J629
9060a7677J3923J1648j2661o517j0712j1808K3119K6262N922L545P876J9691M3019
$$ plain form
9047 95630 157304 226576 257452 211730 144764 129317 107533 71454 33885 1819 -5081 -6717
9035 -6717 6624 19422 21691 19679 -3722 -22181 -28853 -26145 -42263 -56698 -54691 -47622 -43084
9022 -43084 -52644 -64207 -61661 -53735 -46498 -44809 -51243 -46217 -35088 -27278 -22231 -13418 -18054 -28469
9008 -28469 -20175 -11614 -17951 -13854 -1298 14910 31118 50355 70917 69402 41454 40108 47140
8995 47140 37207 9922 -32684 -79185 -98941 -81670 -42501 -15914 -6472 -6573 -3787 -6216 -24855
8982 -24855 -45666 -48319 -72847 -82086 -91472 -102705 -114920 -115863 -106962 -94591 -101579 -119933 -133074
8969 -133074 -144199 -149499 -148262 -140970 -111358 -43802 72394 196303 237028 204214 139733 104767
8957 104767 92728 70425 65221 74774 79221 82674 78894 58249 23436 -32945 -89422 -145155 -158475
$$ packed form
9047I5630O1674O9272L0876m5722o6966j5447k1784l6079l7569l2066o900j636
9035f717J3341J2798K269k012k3401j8459o672K708j6118j4435K007P069M538
9022d3084r560j1563K546P926P237J689o434N026J1129P810N047Q813m636j0415
9008b8469Q294Q561o337M097J2556J6208J6208J9237K0562j515k7948j346P032
8995D7140r933k7285m2606m6501j9756J7271L9169K6587R442j01K786k429j8639
8982b4855k0811k653k4528r239r386j1233j2215r43Q901J2371o988j8354j3141
8969a33074j1125n300J237P292K9612O7556J16196J23909M0725l2814o4481l4966
8957A04767j2039k2303n204R553M447L453l780k0645l4813n6381n6477n5733j3320
$$ plain form
8944 -158475 -114548 -56305 -17209 8673 16258 15334 14760 11217 -5130 -17771 -16696 -29348 -39585
8931 -39585 -56392 -72268 -80691 -90080 -95121 -94644 -83844 -77874 -103013 -141369 -162602 -118367 13276
8918 13276 226984 480428 581292 521346 437224 368893 328474 293152 239344 210032 213503
8907 213503 227867 239187 242261 238941 239230 235563 232116 256679 338202 463857 648814 936622
8895 936622 1376051 1975531 2495606 2443757 1876168 1310909 951684 751148 637723 546563
8885 546563 495147 502591 542625 569410 598021 588778 533884 481781 445168 435185 482909 596579
8873 596579 754203 936087 1073355 1124449 1157661 1209032 1253912 1285831 1290773 1298948 1336647
8862 1336647 1442848 1583744 1772066 2013583 2301309 2581498 2878168 3236231 3683771 4294108
$$ packed form
8944a58475M3927N8243L9096K5882P585r24n74l543j6347j2641J075j2652j0237
8931c9585j6807j5876q423r389n041M77J0800N970k5139l8356k1233M4235J31643
8918A3276K13708K53444J00864n9946q4122o8331m0419l5322n3808k9312L471
8907B13503J4364J1320L074l320K89l667l447K4563Q1523J25655J84957K87808
8895I36622M39429N99480N20075n1849n67589n65259l59225k00536j13425r1160
8885E46563n1416P444M0034K6785K8611r243n4894n2103l6613r983M7724J13670
8873E96579J57624J81884J37268N1094L3212N1371M4880L1919M942Q175L7699
8862A336647J06201J40896J88322K41517K87726K80189K96670L58063M47540O10337
$$ plain form
8852 4294108 5222262 6656669 8680953 11259090 14074108 16372183 18448486 21938852
8844 21938852 27394283 33495514 40344357 51691057 72770351 108656776 160866210 212628409
8836 212628409 222063643 177410140 119124194 77638491 52994075 38326469 29257904
8829 29257904 23429255 19437763 16473159 14215686 12562449 11415364 10625492 10060837
8821 10060837 9527949 8809530 7965283 7238487 6743143 6459047 6374879 6512644 6801120 7095029
8811 7095029 7399044 7776727 8265744 8950391 10076599 11875074 14425238 17487034 20868026
8802 20868026 24791156 29946631 37879700 49465961 62078339 74270617 92905397 128795432
8794 128795432 192950939 293768452 410650541 454451144 375970345 253353640 162723920
$$ packed form
8852D294108R28154J434407K024284K578137K815018K298075K076303L490366
8844B1938852N455431O101231O848843J1346700K1079294L5886425N2209434N1762199
8836B12628409R435234m4653503n8285946m1485703k4644416j4667606r068565
8829B9257904n828649l991492k964604k257473j653237j147085p89872n64655
8821A0060837n32888p18419q44247p26796m95344k84096q4168J37765K88476K93909
8811G095029L04015L77683M89017O84647J126208J798475K550164L061796L380992
8802B0868026L923130N155475P933069J1586261J2612378J2192278J8634780L5890035
8794A28795432O4155507J00817513J16882089M3800603p8480799j22616705r0629720
$$ plain form
8787 162723920 109005318 77420963 58102574 45778150 37395604 31153199 26314166
8780 26314166 22705937 20149442 18396038 17206224 16136299 14628039 12772012 11108777
8772 11108777 9871769 8976824 8346796 7970247 7794121 7672874 7557949 7453154 7406309
8763 7406309 7439469 7660810 8188455 9024632 10122896 11443790 13151770 15623466 19356040
8754 19356040 24725155 31110207 37520905 45909101 61022115 88033180 130972552 184749756
8746 184749756 217915097 196320133 139940994 90649652 60050719 42136809 31287475
8739 31287475 24430872 19840379 16482345 13873171 11894123 10474841 9491947 8815207
8731 8815207 8273889 7584594 6682493 5805648 5108926 4568345 4137490 3808957 3585233 3396214
$$ packed form
8787A62723920n3718602l1584355j9318389j2324424q382546o242405m839033
8780B6314166l608229k556495j753404j189814j069925j508260j856027j663235
8772A1108777j237008q94945o30028l76549j76126j21247j14925j04795m6845
8763G406309L3160K21341N27645Q36177J098264J320894J707980K471696L732574
8754A9356040N369115O385052O410698Q388196J5113014K7011065M2939372N3777204
8746A84749756L3165341k1594964n6379139m9291342l0598933j7913910j0849334
8739C1287475o856603m590493l358034k609174j979048j419282r82894o76740
8731H815207n41318o89295r02101q76845o96722n40581m30855l28533k23724j89019
$$ plain form
8721 3396214 3212369 3043339 2870252 2676284 2495311 2348920 2265529 2256189 2313274 2374743
8711 2374743 2412523 2424017 2322920 2170136 2024030 1881585 1730070 1594263 1511660 1462958
8701 1462958 1419608 1368543 1312322 1253412 1209959 1165251 1104279 1061211 1041382 1001665 950469
8690 950469 918258 903658 888524 892407 913804 948082 990680 1043776 1072963 1053009 976588 884021
8678 884021 807026 760909 746723 742686 762259 768663 767363 780401 826945 942412 1104200 1270179
8666 1270179 1447887 1639289 1631977 1443281 1265649 1137311 1026763 930863 848661 794903
8656 794903 762527 746327 736934 729373 726668 690216 654320 637436 609227 581101 576237 569058 555598
8643 555598 553963 552503 556548 581578 621809 678789 706876 687259 620795 551195 491194 442164
$$ packed form
8721C396214j83845j69030j73087j93968j80973j46391q3391r340N7085O1469
8711B374743L7780J1494j01097j52784j46106j42445j51515j35807q2603m8702
8701A462958m3350n1065n6221n8910m3453m4708o0972m3068j9829l9717n1196
8690I50469l2211j4600j5134L883K1397L4278M2598N3096K9187j9954p6421r2567
8678H84021p6995m6117j4186m037J9573O404j300J3038M6544J15467J61788J65979
8666A270179J77708J91402p312j88696j77632j28338j10548r5900q2202n3758
8656G94903l2376j6200r393p561k705l6452l5896j6884k8209k8126m864p179j3460
8643E55598j635j460M045K5030M0231N6980K8087j9617o6464o9600o0001m9030
$$ plain form
8631 442164 412446 408428 420263 439906 471583 493148 506842 537894 582800 652857 740203 837418
8619 837418 879247 808614 711915 648597 617040 598438 582946 562437 542532 514254 496806 484817
8607 484817 483165 472057 461779 456544 459410 457661 446106 422187 403248 392328 384401 367237 362048
8594 362048 381474 413380 446917 454471 409332 362459 332139 315001 323165 346605 383584 418437
8582 418437 456216 487919 494089 448769 411286 388017 360317 344049 329038 326144 318943 312048
8570 312048 307805 321250 331994 322355 324021 332686 347356 348328 340217 322200 315190 318117 324996 338900
8556 338900 331083 327264 347075 386051 433604 507612 638337 738932 685176 554626 458494
8545 458494 399206 356179 324416 314989 318096 321229 337623 360130 362154 351559 345361 332023 324358
$$ packed form
8631D42164k9718m018J1835J9643L1677K1565J3694L1052M4906P0057Q7346R7215
8619H37418M1829p0633r6699o3318l1557j8602j5492k0509j9905k8278j7448j1989
8607D84817j652j1108j0278n235K866j749j1555k3919j8939j0920p927j7164n189
8594C62048J9426L1906L3537P554m5139m6873l0320j7138Q164K3440L6979L4853
8582D18437L7779L1703O170m5320l7483k3269k7700j6268j5011k894p201o895
8570C12048m243J3445J0744r639J666Q665J4670R72q111j8017p010K927O879J3904
8556C38900p817l819J9811L8976M7553P4008J30725J00595n3756j30550r6132
8545D58494n9288m3027l1763r427L107L133J6394K2507K024j0595o198j3338p665
$$ plain form
8532 324358 307541 286919 276751 277752 285034 286334 267366 239112 225015 220198 213863 215622 224820
8519 224820 223570 224907 220063 218711 230823 238264 247959 254259 263827 290503 333924 412903 544013
8506 544013 762007 1020991 1036646 775277 520948 384251 328769 291336 257954 235397 216035
8495 216035 215200 221959 223865 207601 194067 190984 191571 195982 195340 198656 213356 234882 253321 254142
8481 254142 232303 207024 188119 170775 161363 159869 160823 159779 162497 167425 173794 174478 174554 190406
8467 190406 194355 200148 218166 243947 290038 383750 503758 587793 518896 373772 267395
8456 267395 206378 181898 177229 175241 176487 176478 175021 167442 162449 182086 193874 209563 221568 221554
8442 221554 213711 218422 237320 266199 297047 316891 352733 408668 483853 626055 850698 1124083
$$ packed form
8532C24358j6817k0622j0168J001P282J300j8968k8254j4097m817o335J759R198
8519B24820j250J337m844j352J2112P441R695O300R568K6676M3421P8979J31110
8506E44013K17994K58984J5655k61369k54329j36697n5482l7433l3382k2557j9362
8495B16035q35O759J906j6264j3534l083N87M411o42L316J4700K1526J8439Q21
8481B54142k1839k5279j8905j7344r412j494R54j044K718M928O369O84P6J5852
8467A90406L949N793J8018K5781M6091R3712J20008Q4035o8897j45124j06377
8456B67395o1017k4480m669j988J246rj457p579m993J9637J1788J5689J2005j4
8442B21554p843M711J8898K8879L0848J9844L5842N5935P5185J42202K24643K73385
$$ plain form
8430 1124083 1298170 1203998 923104 665518 492622 382254 320014 276265 244903 224330
8420 224330 205936 198460 186522 181535 186562 189011 183079 177007 182317 167022 161054 160170 161733 163677
8406 163677 165693 177308 197105 203025 210496 222974 221889 221102 227458 228120 244566 264839 293926
8393 293926 343616 427375 518952 626398 763387 1010159 1432499 2021893 2490012 2379755
8383 2379755 1781769 1194650 818017 601552 462140 381292 323448 288507 260809 226612
8373 226612 207015 197482 194031 188522 173122 169283 160151 147235 150613 165215 155918 149418 145366
8360 145366 142932 157582 173422 169269 165442 164093 167684 172524 172546 170658 193190 221542 261526 313415
8346 313415 368154 408311 444913 527773 687614 939531 1175823 1181637 956024 685060 484988
$$ packed form
8430A124083J74087r4172k80894k57586j72896j10368o2240m3749l1362k0573
8420B24330j8394p476j1938m987N027K449n932o072N310j5295n968q84J563J944
8406A63677K016J1615J9797N920P471J2478j085p87O356O62J6446K0273K9087
8393B93926M9690Q3759R1577J07446J36989K46772M22340N89394M68119j10257
8383B379755n97986n87119l76633k16465j39412q0848n7844l4941k7698l4197
8373B26612j9597r533l451n509j5400l839r132j2916L378J4602r297o500m052
8360A45366k434J4650J5840m153l827j349L591M840K2j888K2532K8352L9984N1889
8346C13415N4739M0157L6602Q2860J59841K51917K36292N814k25613k70964k00072
$$ plain form
8335 484988 356559 280268 229763 194679 181757 172804 145846 124703 118752 120841 108481 115613
8323 115613 126061 128989 130022 126949 121826 127323 119227 109117 109078 127754 135094 137796 134237 130041
8309 130041 123411 119280 104300 94116 95773 101632 108119 114900 115117 112244 102938 79679 78911 64219
8295 64219 64157 68805 59631 61178 62254 63626 65065 56087 55162 55247 58701 52638 46785 49755 53069 61649
8279 61649 74448 72917 78463 80585 76372 76060 77230 78424 71498 79583 89359 82507 82500 92701 86070
8264 86070 70641 74066 65816 57836 56619 57432 62880 70659 71284 62143 47164 47513 45155 42595 40847
$$ packed form
8335D84988j28429p6291n0505l5084j2922q953k6958k1143n951K089j2360P132
8323A15613J0448K928J033l073n123N497q096j0110l9J8676P340K702l559m196
8309A30041o630m131j4980j0184J657N859O487O781K17k873r306k3259p68j4692
8295F4219o2M648r174J547J076J372J439q978r25Q5L454o063n853K970L314Q580
8279F1649J2799j531N546K122m213l12J170J194o926Q085R776o852pJ0201o631
8264H6070j5429L425q250p980j217Q13N448P779O25r141j4979L49k358k560j748
$$ [...]
##END NTUPLES=NMR SPECTRUM
##END=
