##TITLE=Analysis number 326589
Compound Code sb 00609
Book Reference 521/25
Project Code adrs
Chemist Name evam
##JCAMPDX= 6.0         $$ Bruker NMR JCAMP-DX V2.0
##DATA TYPE= NMR SPECTRUM
##DATA CLASS= NTUPLES
##ORIGIN= Bruker BioSpin GmbH
##OWNER= nmr
$$ XWIN-NMR		Version 3.5
$$ Wed Feb 14 10:09:54 2007 GMT Standard Time (UT+0h)  MAYBRIDGE\nmr@NMR_250MHZ
##.OBSERVE FREQUENCY= 250.131544655141
##.OBSERVE NUCLEUS= ^1H
##.ACQUISITION MODE= SIMULTANEOUS (DQD)
##.ACQUISITION SCHEME= undefined
##.AVERAGES= 16
##.DIGITISER RES= 18
##SPECTROMETER/DATA SYSTEM= dpx250
##.PULSE SEQUENCE= zg30
##.SOLVENT NAME= CDCl3
##.SHIFT REFERENCE= (INTERNAL, CDCl3, 0, 16.522)
##AUDIT TRAIL= $$ (NUMBER, WHEN, WHO, WHERE, WHAT)
$$ ##TITLE= Audit trail, XWIN-NMR		Version 3.5
$$ ##JCAMPDX= 5.01
$$ ##ORIGIN= Bruker BioSpin GmbH
$$ ##OWNER= nmr
$$ C:\u/data/dgb/nmr/ADRS/850/pdata/1/auditp.txt
$$ ##AUDIT TRAIL=  $$ (NUMBER, WHEN, WHO, WHERE, WHAT)
(   1,<2007-02-14 10:09:33.25 +000>,<MAYBRIDGE\nmr>,<NMR_250MHZ>,
      <created by zg, POWCHK disabled, PULCHK disabled
       configuration hash MD5:
       49 4B E0 1D 92 C2 6B 37 9F E6 65 BC 52 41 86 1D
       data hash MD5: 64K
       B7 05 68 F7 BF 68 ED C2 91 D2 41 24 8A 90 A6 85>)
(   2,<2007-02-14 10:09:46.18 +000>,<MAYBRIDGE\nmr>,<NMR_250MHZ>,
      <Start of raw data processing
       ef LB = 0.3 FT_mod = 6 PKNL = 1 SI = 32K 
       data hash MD5: 32K
       20 7A 0E 3D 6F 4F EE 07 A9 AC 27 7B 93 B7 BF FB>)
(   3,<2007-02-14 10:09:47.84 +000>,<MAYBRIDGE\nmr>,<NMR_250MHZ>,
      <apk 
       data hash MD5: 32K
       C9 42 A3 FA 76 6B A6 8A 4F CC 2B B4 3A 32 0E 96>)
(   4,<2007-02-14 10:09:48.65 +000>,<MAYBRIDGE\nmr>,<NMR_250MHZ>,
      <abs ABSG = 5 
       data hash MD5: 32K
       92 0B C3 B3 43 07 51 CF 52 47 C3 01 9E 1C 4A 2E>)
$$ ##END=
$$ 
$$ hash MD5
$$ 56 93 02 3A F4 A4 F8 73 39 B9 27 64 D5 F2 32 BB
##$RELAX= 
##$RELAX= 
##$RELAX= 
##$RELAX= 
##$RELAX= 
##$RELAX= 
##$RELAX= 
$$ Bruker specific parameters
$$ --------------------------
##$DU= <C:\u>
##$EXPNO= 850
##$NAME= <ADRS>
##$PROCNO= 1
##$TYPE= <nmr>
##$USER= <dgb>
##$AMP= (0..31)
100 100 100 100 100 100 100 100 100 100 100 100 100 100 100 100 100 100 
100 100 100 100 100 100 100 100 100 100 100 100 100 100 
##$AQSEQ= 0
##$AQ_mod= 3
##$AUNM= <au_zg>
##$AUTOPOS= <36 >
##$BF1= 250.13
##$BF2= 250.13
##$BF3= 250.13
##$BF4= 250.13
##$BF5= 500.13
##$BF6= 500.13
##$BF7= 500.13
##$BF8= 500.13
##$BYTORDA= 1
##$CFDGTYP= 0
##$CFRGTYP= 5
##$CHEMSTR= <none>
##$CNST= (0..31)
1 1 145 1 1 1 1 1 1 1 1 1 1 1 1 1 1 1 1 1 1 1 1 1 1 1 1 1 1 1 1 1 
##$CPDPRG= <>
##$CPDPRG1= <>
##$CPDPRG2= <>
##$CPDPRG3= <>
##$CPDPRG4= <mlev>
##$CPDPRG5= <mlev>
##$CPDPRG6= <mlev>
##$CPDPRG7= <mlev>
##$CPDPRG8= <mlev>
##$CPDPRGB= <>
##$CPDPRGT= <>
##$D= (0..31)
0 1 0 0 0 0 0 0 0 0.06 0 0 0 0 0 0 0.0002 0 0 0 0 0 0 0 0 0 0 0 0 0 0 
0 
##$DATE= 1171447772
##$DBL= (0..7)
120 120 120 120 120 120 120 120 
##$DBP= (0..7)
150 150 150 150 150 150 150 150 
##$DBP07= 0
##$DBPNAM0= <>
##$DBPNAM1= <>
$$ [...]
##$SUBNAM7= <"">
##$SUBNAM8= <"">
##$SUBNAM9= <"">
##$SW= 20.6930455092707
##$SWIBOX= (0..15)
0 0 3 0 0 0 0 0 0 0 0 0 0 0 0 0 
##$SW_h= 5175.983436853
##$TD= 65536
##$TD0= 1
##$TE= 295.16
##$TE2= 300
##$TE3= 300
##$TEG= 300
##$TL= (0..7)
0 120 120 120 120 120 120 120 
##$TP= (0..7)
150 150 150 150 150 150 150 150 
##$TP07= 0
##$TPNAME0= <>
##$TPNAME1= <>
##$TPNAME2= <>
##$TPNAME3= <>
##$TPNAME4= <>
##$TPNAME5= <>
##$TPNAME6= <>
##$TPNAME7= <>
##$TPOAL= (0..7)
0.5 0.5 0.5 0.5 0.5 0.5 0.5 0.5 
##$TPOFFS= (0..7)
0 0 0 0 0 0 0 0 
##$TUNHIN= 0
##$TUNHOUT= 0
##$TUNXOUT= 0
##$USERA1= <user>
##$USERA2= <user>
##$USERA3= <user>
##$USERA4= <user>
##$USERA5= <user>
##$V9= 5
##$VALIST= <valist>
##$VCLIST= <CCCCCCCCCCCCCCC>
##$VD= 0
##$VDLIST= <DDDDDDDDDDDDDDD>
##$VPLIST= <PPPPPPPPPPPPPPP>
##$VTLIST= <TTTTTTTTTTTTTTT>
##$WBST= 1024
##$WBSW= 4
##$XGAIN= (0..3)
0 0 0 0 
##$XL= 0
##$YL= 0
##$YMAX_a= 455658
##$YMIN_a= -441587
##$ZGOPTNS= <>
##$ZL1= 120
##$ZL2= 120
##$ZL3= 120
##$ZL4= 120
##$ABSF1= 16.522
##$ABSF2= -4.171173
##$ABSG= 5
##$ABSL= 3
##$ALPHA= 0
##$AQORDER= 0
##$ASSFAC= 0
##$ASSFACI= 0
##$ASSFACX= 0
##$ASSWID= 0
##$AUNMP= <proc_1d>
##$AZFE= 0.1
##$AZFW= 0.1
##$BCFW= 0
##$BC_mod= 0
##$BYTORDP= 0
##$COROFFS= 0
##$CY= 12.5
##$DATMOD= 1
##$DC= 0
##$DFILT= <>
##$DTYPP= 0
##$F1P= 14.0000005364418
##$F2P= -0.99999901652339
##$FCOR= 0.5
##$FTSIZE= 32768
##$FT_mod= 6
##$GAMMA= 0
##$GB= 0
##$INTBC= 1
##$INTSCL= 1
##$ISEN= 128
##$LB= 0.3
##$LEV0= 0
##$LPBIN= 0
##$MAXI= 10000
##$MC2= 0
##$MEAN= 0
##$ME_mod= 0
##$MI= 0
##$NCOEF= 0
##$NC_proc= -3
##$NLEV= 6
##$NOISF1= 0
##$NOISF2= 0
##$NSP= 0
##$NTH_PI= 0
##$NZP= 0
##$OFFSET= 16.522
##$PC= 1
##$PHC0= 227.2642
##$PHC1= 7.308301
##$PH_mod= 1
##$PKNL= yes
##$PPARMOD= 0
##$PSCAL= 4
##$PSIGN= 0
##$REVERSE= no
##$SF= 250.13
##$SI= 32768
##$SIGF1= 0
##$SIGF2= 0
##$SINO= 400
##$SIOLD= 32768
##$SREGLST= <1H.CDCl3>
##$SSB= 0
##$STSI= 32768
##$STSR= 0
##$SW_p= 5175.98343685301
##$SYMM= 0
##$S_DEV= 0
##$TDeff= 65536
##$TDoff= 0
##$TI= <Analysis number 999999
Compound Code 99
Book Reference 9
Project Code 9>
##$TILT= no
##$TM1= 0
##$TM2= 0
##$TOPLEV= 0
##$USERP1= <user>
##$USERP2= <user>
##$USERP3= <user>
##$USERP4= <user>
##$USERP5= <user>
##$WDW= 1
##$XDIM= 32768
##$YMAX_p= 408332784
##$YMIN_p= -254441
$$ End of Bruker specific parameters
$$ ---------------------------------
##NTUPLES= NMR SPECTRUM
##VAR_NAME=  FREQUENCY,     SPECTRUM/REAL,   SPECTRUM/IMAG
##SYMBOL=    X,             R,               I
##VAR_TYPE=  INDEPENDENT,   DEPENDENT,       DEPENDENT
##VAR_FORM=  AFFN,          ASDF,            ASDF
##VAR_DIM=   32768,         32768,           32768
##UNITS=     HZ,            ARBITRARY UNITS, ARBITRARY UNITS
##FACTOR=    0.157963299565203, 1,           1
##FIRST=     4132.6476996994, 0,             0
##LAST=      -1043.33573715361, 0,           0
##MIN=       -1043.33573715361, -254441,     0
##MAX=       4132.6476996994, 408332784,     0
$$ Real data points
##PAGE= N=1
##DATA TABLE= (X++(R..R)), XYDATA
$$ [...]
18850a6290j4566j731M307J5878J6987J0672K2320j7649k3451K20P151p289J4301
$$ -16290 -30856 -32587 -28280 -12402 4585 15257 37577 19928 -3523 -3303 3848 -3441 10860
18837A0860l913j2447J1274p064J455j4817k2362l978J6142j9844N334K771Q209
$$ 10860 6947 -5500 5774 -1290 165 -14652 -37014 -40992 -24850 -44694 -39360 -36589 -28380
18824b8380j2807m289J485K3214L1571K1839J2264j4661k7955j5295Q805J5912
$$ -28380 -41187 -45476 -43991 -20777 10794 32633 44897 30236 2281 -13014 -4209 11703
18812A1703O06j2037L857n164j5477m621Q386J2512q804k988j7880n378R275O747
$$ 11703 12309 272 4129 -1035 -16512 -21133 -12747 -235 -9039 -12027 -29907 -35285 -26010 -19263
18798a9263j5800J1982R454m313J3655Q764O223P929p386p737j0023j5820L35
$$ -19263 -35063 -23081 -13627 -17940 -4285 4479 10702 18631 11245 3508 -6515 -22335 -22000
18785b2000Q057l79N393O29J6825j438j3444k724q236Q549K4610P677j187P841
$$ -22000 -13943 -14322 -8929 -8300 8525 7087 -6357 -9081 -17317 -8768 15842 23519 22332 30173
18771C0173K398J5727J0765N6671R4236P4280m5490q4365o9050m3362r052q83
$$ 30173 32571 48298 59063 115734 209970 284250 238760 154395 85345 41983 32931 32048
18759C2048L142q683k7360o509K2516P10n393P502m276J2347r584j4787K478L064
$$ 32048 35190 26507 -853 -7362 15154 15864 10471 17973 13697 26044 16460 1673 4151 7215
18745G215J2227j3841k990M029L959K491N848j030n673m095N667J1873K360j606
$$ 7215 19442 5601 2611 6640 10599 13090 18938 17908 12235 8140 13807 25680 28040 26434
18731B6434o440J1074j3329l4731o957k414L561L717j0956j3244l965K0501J440
$$ 26434 19994 31068 17739 -16992 -23949 -26363 -22802 -19085 -30041 -43285 -47250 -26749 -25309
18718b5309k546K3062K4396j7155k491J8620j610k1076j6479m252l499J331N372
$$ -25309 -27855 -4793 19603 2448 -43 18577 16967 -4109 -20588 -24840 -28339 -27008 -21636
18705b1636K6110P361j244j4076r739j2468M210Q739o0R556K0064J7453j1425
$$ -21636 4474 11835 10591 -3485 -13224 -25692 -21482 -12743 -12803 -3247 16817 34270 22845
18692B2845k6164J520j6809m100J9282o582N779N445L115M374J579r00o087M401
$$ 22845 -3319 -1799 -18608 -22708 -3426 -10008 -4229 1216 4331 8705 10284 9384 3297 7698
18678G698R181n747M35J2520o558K417l660j8138j030r811L475p919r56j2614
$$ 7698 16879 11132 11567 24087 17529 19946 16286 -1852 -2882 -12693 -9218 -17137 -18093 -30707
18664c0707K1477R877R580l54q226n511L251J1702M838j3659j0188j1082P373
$$ -30707 -9230 647 10227 9873 1647 -3864 -613 11089 15927 2268 -7920 -19002 -11629
18651a1629K0614m999j0605Q232J7533r748j6090J7668k025j1493m403o687L004
$$ -11629 8985 3986 -6619 1613 19146 9398 -6692 10976 8951 -2542 -6945 -13632 -10628
18638a0628o772k612M264J109M781J4461N254o05m348p410J1463r801j296K601
$$ -10628 -17400 -20012 -15748 -14639 -9858 4603 9857 9252 4904 -2506 8957 -844 -2140 461
18624D61N541p0p841j0736K0219O741j0976j4563p145M015M368Q920M194l015
$$ 461 6002 5932 -1909 -12645 7574 14315 3339 -11224 -18369 -14354 -9986 -1066 3128 113
18610A13J151j0093L828j1382K015J5340L415j7074j7307k8587m457K8372J8010
$$ 113 1264 -8829 -5001 -16383 -14368 972 4387 -12687 -29994 -58581 -63038 -34666 -16656
18597a6656l333n527J8329l544K6725J9231j7969q929k571j405N891J1984M625
$$ -16656 -19989 -25516 -7187 -10731 15994 35225 17256 8327 5756 4351 10242 22226 26851
18584B6851j4330j1020j7141m160N014o850J938J4079O949o313J0300O82K862
$$ 26851 12521 1501 -15640 -19800 -14786 -21636 -19698 -5619 1330 -4983 5317 5999 8861
18571H861P820J5173M956j2657j3884o439J4443J0526n2k1092k0715m945j507
$$ 8861 16681 31854 36810 24153 10269 3830 18273 28799 28747 7655 -13060 -18005 -19512
18558a9512r551k601j2023J091K3415K891M368J145J6679K2158Q298k5079j5624
$$ -19512 -29063 -31664 -43687 -42596 -19181 -16290 -11922 -10777 5902 28060 36358 11279 -4345
18545d345j7961k271K3845P796r853J0266K2903Q732k1181j2653Q954j6385k4707
$$ -4345 -22306 -24577 -732 7064 -2789 7477 30380 39112 17931 5278 14232 -2153 -26860
18532b6860n890R487R137J870o186j314M442k240J22J1905M731J0635N881j6241
$$ -26860 -32750 -23263 -14126 -12256 -18442 -19756 -15314 -17554 -17432 -5527 -796 9839 15720 -521
18518e21j3490Q181J5856J3956j0599k5939j2619Q59K2304K9163m863l0900J0249
$$ -521 -14011 -5830 10026 23982 13383 -12556 -25175 -24316 -2012 27151 22288 -8612 1637
18505A637R680M368M894p087j7348j2246m561J2128K5483R180r808j2654k3242
$$ 1637 11317 15685 20579 13492 -3856 -16102 -20663 -8535 16948 26128 16320 3666 -19576
18492a9576k580J4569l348j5575J3979J1818j6357J9811K2056p96l574J2062m952
$$ -19576 -22156 -7587 -10935 -26510 -12531 -713 -17070 2741 24797 24001 20427 32489 27537
18479B7537o423j493j4189j5820N70N114K144O327J7107q895r34r323o540l606
$$ 27537 21114 19621 5432 -10388 -9818 -4704 -2560 3767 20874 11979 11045 1722 -4818 -8424
18465h424L147J0979K654n038N900N849L34O675Q341p076q993q495K818M747L07
$$ -8424 -5277 5702 8356 3318 9218 15067 15401 22076 30417 23341 14348 5853 8671 13418 13725
18450A3725o505j1066j508j1245j4178L46N060J2682J2119K1560j0200n526J986
$$ 13725 7220 -3846 -5354 -16599 -30777 -30431 -25371 -12689 -570 20990 10790 5264 7250
18437G250J6307K1496k2381j5228j4659P644M3J3747K370j1124j5668P435J0032
$$ 7250 23557 45053 22672 7444 -7215 429 472 14219 16589 5465 -10203 -2768 7264
18424G264l393J3613M92k377M841o865N78r190j0300r077N165L712K481K805j3594
$$ 7264 3871 17484 17976 15599 20440 13575 14153 4963 -5337 -14414 -9249 -5537 -3056 -251 -13845
18409a3845Q856J7545M423l556n968j1680l910J6737Q28J2235J3840P630k293
$$ -13845 -4989 12556 16979 13423 7455 -4225 -8135 8602 9430 21665 35505 43135 40842
18396D0842j4951J0085j7140M460m889n093m168j0247n33q550r79O259J1352R825
$$ 40842 25891 35976 18836 23296 18407 13314 9146 -1101 -1634 -10184 -11163 -4904 6448 16273
18382A6273Q42j4563j2946L185l961J425K5909R467j4812M166R808p286M517j6122
$$ 16273 17115 2552 -10394 -7209 -11170 -9745 16164 25631 10819 14985 24793 17507 22024 5902
18368E902j4552m021q643q351m411K1179J7489r427M40P857l449R292Q172r51
$$ 5902 -8650 -12671 -21314 -29665 -34076 -12897 4592 -4835 -4395 3462 13 9305 17477 16526
18354A6526J6198R396m134j0811R44j0372j4235k088J1724J112P686R189j2713
$$ 16526 32724 42120 37986 27175 28119 17747 3512 1424 13148 14260 21946 31135 18422
18341A8422k267n307K220J3017J3181m264K338m417K3101r389k3180P79j1474
$$ 18422 16155 10848 13068 26085 39266 35002 37340 32923 56024 46635 23455 24234 12760
18328A2760j8603J0673J3003j4536l499J0248M227R084J1635j1550J0002J4497
$$ 12760 -5843 4830 17833 3297 -202 10046 14273 23357 34992 23442 33444 47941
18316D7941j4304k3446j8900r490K0390P078M092r050j9244o720j8661J21J0258
$$ 47941 33637 10191 -8709 -18199 2191 9269 13361 4311 -14933 -21653 -40314 -40193 -29935
18303b9935J387L880Q914Q941J2187j6896r399N259l081j3543l405J6180J5434
$$ -29935 -28548 -24668 -15754 -6813 5374 -11522 -20921 -15662 -18743 -32286 -35691 -19511 -4077
18290d077J3515m211j9481k3081p358J7920j998J1812K0222J1003j2089o222j2258
$$ -4077 9438 5227 -14254 -37335 -44693 -26773 -28771 -16959 3263 14266 2177 -4045 -16303
18277a6303j5901K3134N696j9821n366J8780L938j84Q297N216r795r715N214o802
$$ -16303 -32204 -9070 -3374 -23195 -28561 -9781 -5843 -6027 2270 7486 -2309 -12024 -6810 -13612
18263a3612o504k564O178J2293J2465j34j831J5463k1967k8450L320K1428l549
$$ -13612 -20116 -22680 -16502 -4209 8256 8122 6291 21754 -213 -28663 -25343 -3915 -7464
18250g464m842R357Q056k948O057N572P712K426j0466j1266N283J1932j5747j3319
$$ -7464 -12306 -2949 5107 2159 8216 13788 21500 23926 13460 2194 7477 19409 3662 -9657
18236i657j4726R158K3930K4788K4490L3243K094k7883j4385k5890k3664M384
$$ -9657 -24383 -15225 8705 33493 57983 91226 93320 65437 51052 25162 1498 5882
18224E882k593J698J0592M841p105j2663Q460K4032l542j3825p891M977K1245
$$ 5882 3289 4987 15579 20420 13315 652 9112 33144 29602 15777 7886 12863 34108
18211C4108J8842R132r834j7650j8381J616O611O904q443j4394p662J0901N64
$$ 34108 52950 62082 52248 34598 16217 17833 24444 31348 22905 8511 849 11750 12314
18198A2314P33o979o693P214J618j1317m844K316K3522K9687j2761R105o803r887
$$ 12314 13047 6068 -625 6589 8207 -3110 -7954 -5638 17884 47571 34810 43915 37112 27225
18184B7225N296J5568Q313n16r781Q289J21j1770k581J1779J3342j3794k2959
$$ 27225 32521 48089 56402 55886 46105 54394 54515 42745 40164 51943 65285 51491 28532
18171B8532l607Q162k005m694k616O700P049O266R809J153R395K894m780R859
$$ 28532 24925 33087 31082 26388 23772 30472 37521 43787 53596 54749 64144 67038 62258 72117
18157G2117L1871m9r977k6110l3674K495N813l22L0566O970K2410j3716K798J7081
$$ 72117 103988 103939 93962 67852 34178 36673 42486 42164 72730 79700 102110 88394 91192 108273
18143A08273o959q446J0518J1567J1364J1675J8848M031j6912J1368K7328K3393
$$ 108273 101314 92868 103386 114953 126317 137992 156840 160871 143959 155327 182655 206048
18131B06048J8164K4582N1055K4878K3570N2361N6018N1421P2234J06165J20687
$$ 206048 224212 248794 299849 324727 348297 400658 456676 508097 580331 686496 807183
18120H07183J13075J43559J87127K86330M11824N44616Q03315J257149K097292
$$ 807183 920258 1063817 1250944 1537274 1949098 2493714 3297029 4554178 6651470
18111F651470L896912P689563J4367319J6268088k106356j4667018j2825487p756859
$$ 6651470 10548382 18237945 32605264 48873352 46766996 32099978 19274491 11517632
18103A1517632m172832k349944j398867q60534n83043m09174k90296k38410j80894
$$ 11517632 7344800 4994856 3595989 2735455 2152412 1743238 1452942 1214532 1033638
18094A033638j38568j10046j17308q1753n0331o5119n2637l9240l2233k5681j6021
$$ 1033638 895070 785024 667716 585963 535632 470513 417876 378636 346403 320722 304701
18083C04701j6363R584k6560k5291l8925k7297j5447j4246l687k3429k0771m988
$$ 304701 288338 297922 271362 246071 207146 179849 164402 150156 146469 123040 102269 97281
18071I7281j3420o663N089o89k2l025j0908K939n00N913R87j1772r486M84j7984
$$ 97281 83861 77198 82287 81598 81576 78551 67643 70582 70082 75995 76982 65210 55724 56208 38224
18056C8224j609J4760J5895k1114j8425j2461N262J0830j2527o441r519l762O966
$$ 38224 36615 51375 67270 46156 27731 15270 20532 31362 18835 12394 2875 -887 6079
18043F079J0377j3041j5173M770K7761k6K123j1209r904p075R504N134O900P699
$$ 6079 16456 3415 -11758 -6988 20773 20747 22870 11661 1757 -5318 4186 9320 16220 23919
18029B3919J5568j9073k3314J3252O282r696r078m318J2950j1281r267K6068J8691
$$ 23919 39487 20414 -2900 10352 16634 6938 -2140 -6458 6492 -4789 -14056 12012 30703
18016C0703j6136j1181J21n27R670R56k688n056L513J6875L851q010O616l808
$$ 30703 14567 3386 3507 2980 12650 13606 10918 5862 9375 26250 30101 22091 28707 24899
18002B4899M50O724R305o201l218j9629j7669J5424L744l997j3970O249k0900
$$ 24899 25349 32073 41378 35177 31959 12330 -5339 10085 13829 9832 -4138 2111 -18789
17989a8789m518j3344J4149q43K7477J767r077L4804L2647J3214m774j5694j4745
$$ -18789 -23307 -36651 -22502 -23345 4132 5899 -3178 31626 64273 77487 72713 57019 42274
17976D2274j6715K658P965L625l2940q108M102J3572p406J1334N888j867J6307
$$ 42274 25559 28217 36182 39807 6867 -1241 2861 16433 9027 20361 26249 24382 40689
17963D0689j412o91N371j933k057j1490j2432k889K5338k1359j7905J0570M0585
$$ 40689 39277 38586 43957 42024 39967 28477 16045 13156 38494 17135 -770 9800 50385
17950E0385L509k964j708J8422K3511M954M794K4386L212q076r509P26p44l441
$$ 50385 53894 50930 49222 67644 91155 96109 100903 125289 128501 120425 110916 111642 110898 107457
17936A07457j5102J1979K6928J7287K8764M0111L3386L5850J4311J1669m660j9705
$$ 107457 92355 104334 131262 148549 177313 217424 250810 286660 300971 312640 307980 288275
17924B88275m3184n4212l0083j2654n364J5425J0260K321J2247R288J2971R713
$$ 288275 245091 190879 160796 148142 142778 158203 168463 170784 183031 192319 205290 215003
17912B15003k416j0274J6999J3522J3466L1160K9442K7839l599j8806k9971j5897
$$ 215003 212587 202313 219312 232834 246300 277460 306902 334741 331142 312336 282365 266468
17900B66468j0224m7289j2669j1860j3820J2339k971r424N682J3021r667j1032
$$ 266468 256244 208955 196286 184426 170606 182945 179974 170550 176232 189253 179586 168554
17888A68554j5821j3874j9007j1580j0324J5559K4141O309J4946K0920K3944L5027
$$ 168554 152733 138859 119852 108272 97948 113507 137648 143957 158903 179823 203767 238794
17876B38794K9237L4289J7888J4334q01l4141l8664p4712m8555n6728l7565j2921
$$ 238794 268031 302320 320208 334542 333741 299600 260936 186224 137669 80941 43376 30455
17864C0455P07j5593q95O58K291K8241k462k3709j4868K155j995r622q46J6925
$$ 30455 31162 15569 14674 15332 17623 45864 43402 19693 4825 6980 4985 -4637 -5483 11442
17850A1442K0998J2038k478r362n122J1419q65j3919K391P354K0775j5108k4710
$$ 11442 32440 44478 42000 32638 27516 38935 38070 24151 26542 33896 54671 39563 14853
17837A4853o598O104j917n701o275M618L45J744J0905O95o338m918J0660J2572
$$ 14853 8255 14359 12442 6741 466 5084 5429 7173 18078 18773 12435 7517 18177 30749
17823C0749p815K134k682L230M598j5580p874j2921L531j555m764p121r360K448
$$ 30749 22934 25068 22386 25616 30214 14634 6760 -6161 -2630 -4185 -8949 -16070 -25430 -22982
17809b2982J9060K6501K754k030o991m142o950O485M25J4216K0511j1082o837
$$ -22982 -3922 22579 25333 23303 16312 12170 5220 11705 12130 26346 46857 35775 28938
17796B8938j786k0728Q40k092j092R195q619j0085J1784l501l862k2975J2J9582
$$ 28938 27152 6424 7264 5172 4080 13275 4656 -5429 6355 2854 -1008 -23983 -23971 -4389
17782d389M676r523J070J7233j223k4408m864J1580K3677K1227Q06j6155n076
$$ -4389 287 -9236 -8166 9067 7844 -16564 -21428 -9848 13829 35056 35862 19707 14631
17769A4631j2760k0534J0195J7406P298M82j5709J05j973N692N678j147j7596
$$ 14631 1871 -18663 -8468 8938 16236 16718 1009 1114 -859 4833 10511 9364 -8232
17756h232K4952J3040j0250l481l16k9k578j6287j4539M802j0797p83K3352N020
$$ -8232 16720 29760 19510 16029 15713 15684 13106 -3181 -17720 -12918 -23715 -24498 -1146 3874
17742C874j3925p927R896m256l686M791R202j6235o027l808J179O135K3649q31
$$ 3874 -10051 -17978 -8082 -12338 -16024 -11233 -2031 -18266 -24293 -28101 -26922 -20787 2862 2031
17728B031M597j627M94l201n045Q6P906O600K829m819k577J3546n961j7768k4893
$$ 2031 6628 5001 5495 2294 -2751 -2665 5241 11841 14670 9851 7274 20820 14859 -2909 -27802
17713b7802L683L8542J7636k7322k0179J799J2977k103K835J802J7066J8555J8264
$$ -27802 -24119 14423 32059 4737 -15442 -13643 -666 -2769 66 1868 18934 37489 55753
17700E5753j0250J510m931j9103N02o620q211J0639K7329l530k2611j2663L833
$$ 55753 45503 47013 42082 22979 23481 16861 8650 19289 46618 43088 20477 7814 11647
17687A1647J3774K330j2515l0085K992J9045m693M833M567N204j1326m72J7263
$$ 11647 25421 27751 15236 -14849 -11857 7188 2495 7328 11895 17099 5773 5301 22564
17674B2564J2276L789n809J3324K5199l155J2295N826j3599q666N467M161J7223
$$ 22564 34840 38629 32820 46144 71343 68188 80483 86309 72710 64044 69511 73672 90895
17661I0895K8027J0904l349K595j6985l0612M71m669q952M063k1589l5987N567
$$ 90895 118922 129826 126477 129072 112087 81475 81946 77277 68325 72388 50799 14812 20379
17648B0379J549j968J3354K8891J4576l4681k5361J2657j79q959P201N705j7699
$$ 20379 21928 19960 33314 62205 76781 42100 16739 29396 29217 20258 27459 33164 15465
17635A5465k9160k9050Q476j516J7102K0918R693m261l350n768q361r2L013l816
$$ 15465 -13695 -42745 -34269 -35785 -18683 2235 11928 7667 4317 -1451 -9812 -9904 -6891 -10707
17621a0707j4318K2244J1202K0961N14j2027q66J8860L104O453j7565m274m274
$$ -10707 -25025 -2781 8421 29382 29896 17869 17003 35863 38967 45420 27855 23581 19307
17608A9307l2568m558o49p837L4772L7358R14K878L337j3019l218q470J0360J1106
$$ 19307 -13261 -17819 -18468 -26305 8467 45825 46739 49617 52954 39935 36717 28247 38607 49713
17594D9713n808j3074n73J5413j294p364M329J9915K22j8290l890P178L1436J8741
$$ 49713 43905 30831 30258 45671 44377 37013 41342 61257 61479 43189 39299 46477 77913 96654
17580I6654j316j7681k2317N184M965k6505j6713Q447J4549J2701J7515K467j3558
$$ 96654 95338 77657 55340 60524 65489 38984 22271 30718 45267 57968 75483 77950 64392
17567F4392n846J6514O237j4032k2708r399J074K2521m60r433L92J9044J7011
$$ 64392 58546 75060 81297 67265 44557 35158 36232 58753 58293 48860 49252 68296 85307
17554H5307J2766L6083R523m438l6371m2505k8555k3210k3864k1517O597O239
$$ 85307 98073 134156 143679 139241 102870 60365 31810 8600 -15264 -36781 -30184 -23945
17542b3945M1356M0883K9542M3067K5460O206j9975j2673j6874K9890M4025P4067
$$ -23945 17411 58294 87836 130903 156363 162569 142594 129921 113047 142937 186962 261029
17530B61029P4872M4161L232k3319J1443Q268j9450r991j1431j6724k7515j5259
$$ 261029 335901 380062 383294 359975 371418 379686 360236 350245 338814 322090 294575 279316
17518B79316m3j5890j3244j2655P86j075P761j0629O689N194j9238J7946K7305
$$ 279316 279273 263383 250139 237484 238270 237195 244956 234327 241016 246210 226972 244918 272223
17505B72223Q286k0636m64j4035p495L017p098j2379J1876P908K2697J7612N657
$$ 272223 280509 259873 259409 245374 237879 240896 233798 221419 233295 241203 263900 281512 287169
17492B87169n608J8115J3958O351J2777o760J0799K6192J4719r480N562J0847
$$ 287169 281561 299676 313634 319985 332762 326002 336801 362993 377712 368232 373794 384641
17480C84641L4718J8904k553L0490K6442K8328K4480J3250K0770J2644P642p750
$$ 384641 419359 438263 435710 466200 492642 520970 545450 558700 579470 592114 599756 592006
17468E92006p270L830K4667L2958M1560N0093J2882J2788L1763j165L6433M7152
$$ 592006 584736 588566 613233 646191 687751 737844 750726 763514 795277 794112 830545 877697
17456H77697L9989R3132J29459J29106J07660Q2674N2274M3199O5841J26766J13609
$$ 877697 917686 1010818 1140277 1269383 1377043 1459717 1511991 1555190 1621031 1747797 1861406
17445A861406P5475Q9115J27229J72609J61184J24561J75872K71426L81488M91558
$$ 1861406 1936881 2025996 2153225 2325834 2487018 2611579 2787451 3058877 3440365 3931923
17435C931923N94975P06638P65356Q64089J116269J556568K157411K717946L085668
$$ 3931923 4526898 5233536 5998892 6862981 7979250 9535818 11693229 14411175 17496843
17426A7496843L056279K714375K434630K329638K618408L304009M247874N295012
$$ 17496843 20553122 23267497 25702127 28031765 30650173 33954182 38202056 43497068
17418D3497068O366567P054600P219863P019385O640407O472979O287365P376476
$$ 43497068 49863635 56918235 64138098 71157483 77797890 84270869 90558234 97934710
17410I7934710J1298752J9310834K8700133L1240975J6129337j1521343k9633408
$$ 97934710 109233462 128544296 157244429 188485404 204614741 193093398 163459990
17403A63459990k9590902k0825660j4595255j2075772j0767575j0924171j2147953
$$ 163459990 133869088 113043428 98448173 86372401 75604826 64680655 52532702
17396E2532702j2122611j0034796p192524m774741l134795k148591j552836j250675
$$ 52532702 40410091 30375295 23182771 18408030 15273235 13124644 11571808 10321133
17388A0321133j050487q92365q33154q18301p63109o65458n72924m56221l60604
$$ 10321133 9270646 8378281 7545127 6726826 5963717 5298259 4725335 4269114 3908510
17379C908510l14075l13916k76736k22227j74507j33185j18870j05829j25419
$$ 3908510 3594435 3280519 3003783 2781556 2607049 2473864 2354994 2249165 2123746
17370B123746j16294r8839j07372j12496q6732j05044j15879j28938q6107p4020
$$ 2123746 2007452 1908613 1801241 1688745 1602013 1496969 1381090 1252152 1166045 1092025
17360A092025o8544o5151m1630j5696k9973k1041J1516L134q835m5067m9911m7510
$$ 1092025 1023481 958330 916700 901004 871031 849990 861506 864640 855805 810738 760827 713317
17348G13317m0501m8085m9329l0124l2022l3050j6768k1339j6641o593k1117j7292
$$ 713317 672816 624731 575402 545278 513256 480206 463438 442099 425458 418865 397748 380456
17336C80456N993O962l381o207m624k4834j9590j6143k7071j4820j8144j1424
$$ 380456 386449 393411 390030 383823 379199 354365 334775 318632 291561 276741 258597 247173
17324B47173p037m700m453r010M313j1154j2416r129J2604J5889L383k5853j9449
$$ 247173 240136 235436 230983 221973 226286 215132 202716 193587 206191 222080 225463 199610 180161
17311A80161j4935l380J5196J4020j9558k2265l0162j0743j0623o497k472j9812
$$ 180161 165226 161846 177042 191062 171504 149239 119077 108334 97711 91214 88742 68930
17299F8930p725J4743J1707q53j6524j2537K218N718N766J8183K9716Q417p453
$$ 68930 61205 75948 87655 86802 70278 57741 59959 65677 71443 89626 119342 127759 120306
17286A20306K787M488M627K0931M5183O2469O4877M9068L463j3318j3306R76m989
$$ 120306 123093 127581 132208 153139 198322 260791 325668 374736 378199 364881 351575 352551 347562
17273C47562J094q403j8990j7256K06k7163j2059Q23k1304q435L474q771j4948
$$ 347562 348656 340253 321263 304007 304213 277050 264991 265814 244510 236075 239549 230778 215830
17260B15830j5345j3136j7959N794L207j0320j3636O89o928P351Q681j3969k7123
$$ 215830 200485 187349 169390 175184 178391 168071 154435 155124 148196 155547 164228 150259 123136
17247A23136j2499J5245R916l304N458n627l2796k8533N369J6345J1568j4437
$$ 123136 110637 125882 135798 132494 137952 132325 99529 70996 76365 92710 104278 89841
17235H9841P355M720j155l452J1771J8936l817k382m269P549Q587j7931j4016
$$ 89841 97196 101916 100761 97309 109080 128016 124199 121817 117548 125097 133684 115753 101737
17222A01737P093M09k8053l0506J4024J0453j488M43K6333J5674L583o71o656
$$ 101737 108830 109239 81186 50680 64704 75157 73669 74112 100445 116119 119702 119031 112375
17209A12375M781n13J4114j8718q889q3j6568L150M447L086O920o870N868Q004
$$ 112375 117156 116643 130757 112039 103150 103067 86499 89649 94096 97182 104102 97232 103100 111104
17195A11104m237j5866R751O129k806j3900p997o357k257K3660J5881l764l366
$$ 111104 106867 91001 100752 106881 104075 90175 82178 75821 73564 97224 113105 109341 105975
17182A05975P893j5766k3713n949j0289J4305l610J9277j547k1468k052m158K344
$$ 105975 113868 98102 74389 68440 58151 72456 68846 88123 86576 65108 63056 58898 61242
17169F1242o608j693k829q306m347j6083J656J1061n289R670J1573J5409j615
$$ 61242 54634 52941 50112 41806 37459 21376 23032 34093 28804 38474 50047 65456 63841
17156F3841k2604K596R644K290n971n077N367P351n940j568j3223l2160L903K0260
$$ 63841 41237 43833 53477 55767 49796 44719 50086 57437 51497 49929 36706 4546 8449 28709
17142B8709Q018N885Q100j463o636j2717J141j3438J8142j5583j0546l206J5306
$$ 28709 36727 42612 50712 49249 42613 29896 31037 17599 35741 20158 9612 6406 21712
17129B1712J0719n21k74j0474N61J4303L641r269K3828K24j912J0350o83k6193
$$ 21712 32431 31910 31636 21162 21723 36026 39667 30398 54226 54450 52538 62888 62205 36012
17115C6012m315k9372j550J2883O156j7718l071R442P335q869J106M2765J7093
$$ 36012 31697 2325 775 13658 19814 2096 -975 8467 15802 6933 8039 50804 67897
17102F7897l110j7642j121n03o097r089m503N218K897J0846p926M098J6978N117
$$ 67897 64787 47145 46024 45521 39424 30335 25832 31050 33947 44793 36867 40965 57943 63060
17088F3060o510j0614l010j4325j1567L922O489j722Q46j2970k0722L232O675
$$ 63060 56550 45936 42926 28601 17034 20956 27445 25723 26569 13599 -7123 -3891 2784
17075B784j3906J5911l36q423O735J5875o579K0283J3378p958p865R207O078n54
$$ 2784 -11122 4789 4453 -3970 2765 18640 12061 32344 45722 37764 29899 39106 45184 44630
17061D4630q765N33l949N477J7862k3350j3840M578n350r418R102J0802k556M567
$$ 44630 35865 36398 32449 37926 55788 32438 18598 23176 17826 8408 17510 28312 25756 30323
17047C0323j3525q901O093k28J690J5187m864Q810j7529o764p780q024P704J329
$$ 30323 16798 7897 13990 13762 15452 30639 25775 34585 17056 10292 2512 -5512 2192 3521
17033C521J9613j1697r411j6J0330J3348J6723j6834p919q17J509m286M526R692
$$ 3521 23134 11437 2026 2010 12340 25688 42411 25577 17658 16841 18350 14064 18590 28282
17019B8282o926o996O249j2303n542j6244L139j4646k640K4387J9782j0248o948
$$ 28282 21356 14360 20609 8306 2764 -13480 -10341 -24987 -27627 -3240 16542 6294 -654
17006f54N616j213O75J4051J8032j4262k65j1723j8431k632j108J0639o193k0918
$$ -654 4962 3749 4424 18475 36507 22245 21980 10257 -8174 -10806 -11914 -1275 -7468 -28386
16992b8386L815K9916L1592n469j2069P482l928j9638N434j326j7376J9775O178
$$ -28386 -24571 5345 36937 31468 19399 26881 22953 3315 8749 7423 -9953 9822 16000
16979A6000K160m62L532M178Q528o184j4912N089J8821k664j3492o967K812j1247
$$ 16000 18160 17698 21230 25408 33936 27752 12840 17929 36750 34086 20594 13627 16439 5192
16965E192o468M684J1382J4790N828Q660L216j3244m366r072k0261r048P573J2674
$$ 5192 -1276 3408 14790 29580 35408 44068 47284 34040 29674 20602 341 -8707 -1134 11540
16951A1540K7708N772l057J7542l462R03o194k7746n024K2060K1320m188p392
$$ 11540 39248 45020 41963 59505 56043 56946 50752 23006 17982 40042 61362 57174 49782
16938D9782Q302q27P47Q735L6356L3643N5912L7610N9738O5905M5350M2853N2290
$$ 49782 58084 57257 58004 66739 103095 136738 192650 230260 289998 355903 401253 444106 496396
16925D96396K6149j3355k1662k7782k5701k0640j7338L181P387Q948J4475j3483
$$ 496396 522545 509190 487528 459746 434045 413405 396067 399248 406635 415583 430058 416575
16913D16575l1482l6008m4099l7622k6535n5883m9013j1453j5325J652J863R744
$$ 416575 385093 349085 304986 267364 240829 184946 135933 124480 109155 110807 112670 122414
16901A22414l2941j1933p595q425K115J062j2791k009J136L126J8900K282m250
$$ 122414 89473 77540 69945 61520 63635 64697 51906 49897 51033 54159 73059 75341 71091
16888G1091k769o486p509K4360M8521L5578j8911k4900j3928L2115J4265Q688
$$ 71091 68322 61836 54327 78687 127208 162786 143875 118975 105047 137162 151427 160115
16876A60115Q541M2338K4077J6843J762n139j9193l0485l5083j4706L298o621
$$ 160115 168656 210994 235071 251914 253676 248537 229344 198859 163776 149070 152368 145747
16864A45747k5548j423L320O102O707k6452k9155m6929k7972P386L981R314L296
$$ 145747 120199 118776 122096 128198 134905 108453 79298 32369 4397 11783 15764 25078 28374
16851B8374R473P818k2322q39J1312j4049o532k768m946P574p288r268M629J1339
$$ 28374 37847 45665 23343 22504 33816 19767 13235 10467 5521 13095 5807 -3461 1168 12507
16837A2507o769L790n504N963j1381L357K9400K996j7482k093J563O197l056n74
$$ 12507 5738 9528 4024 9987 -1394 1963 31363 34359 16877 14784 16347 22544 19488 18914
16823A8914l014j6299r050N800P833P273K995j2564p536N895j8434j36N865R623
$$ 18914 15900 -399 -9449 -3649 4184 11457 14452 1888 -5648 247 -18187 -18323 -12458 -2835
16809b835R712L662j2838r438j3868m914J4844j733N817K456J7016P301Q438k9987
$$ -2835 6877 10539 -2299 -11737 -25605 -30519 -15675 -17408 -11591 -9135 7881 15182 23620 -6367
16795f367o843K6376N778j317j2991n068l391R758R664l493k4748k8251J3083
$$ -6367 -13210 13166 18944 17627 4636 -432 -3823 5935 15599 12106 -12642 -40893 -27810
16782b7810K3610N398n074l429L0654k263j0031R864j315j2777j8696j2178n883
$$ -27810 -4200 1198 -3876 -7305 23349 21086 11055 20919 19604 6827 -11869 -24047 -29930
16769b9930J4828r75R309r756j5185l77J0942P05L317K7161J1072r720n899K321
$$ -29930 -15102 -16077 -6768 -16524 -31709 -32086 -21144 -20439 -17122 10039 21111 11391 5492 7813
16755G813K139n292J0881q549Q134K633O02j1125n086R602K8929P70o519J273
$$ 7813 9952 4660 15541 6992 15126 17759 18361 7236 2150 11752 40681 41451 34932 36205
16741C6205k4789o544j0615K357P600l506N964J0233M205j250j3631n532j0427
$$ 36205 11416 4872 -5743 -3386 4214 708 6672 16905 21110 19860 6229 697 -9730
16728i730J3479q284j5800J510m815p486J2336j657N961K816J3377P651k239j2017
$$ -9730 3749 -4535 -20335 -18825 -23640 -31126 -18790 -20447 -14486 -11670 1707 9358 7119 -4898
16714d898n489R480j9391p580P015j142n394K1658M304M180P032j1782j1385M974
$$ -4898 -10387 -907 -20298 -27878 -20863 -22005 -27399 -5741 -1437 2743 9775 -2007 -13392 -8418
16700h418M776j5637M512P756L070l998J7811l356O05k2326N823J1055p806J5866
$$ -8418 -3642 -19279 -14767 -7011 -3941 -7939 9872 6516 7121 -15205 -9382 1673 -6133 9733
16686I733P201K5k738j4398j7833J782J7933J0886p770j6109O40J348J3052J0860
$$ 9733 16934 16959 14221 -177 -18010 -16228 1705 12591 4821 -11288 -10648 -9300 3752 14612
16672A4612p054l176N579j283q74m286m522J6372L275p303j0604n790k108Q741
$$ 14612 7558 4382 9961 8678 7804 3518 -1004 15368 18643 11340 736 -5054 -7162 1579
16658A579K173Q587q796j8673r931N779m370q889L5260J4227L101k0267k7048
$$ 1579 3752 12339 3543 -15130 -25061 -19282 -23652 -32541 2719 16946 20047 -220 -27268
16645b7268r122Q096K4343K773j1898l723L511j3426N169R060K0560J7826r790
$$ -27268 -36390 -28294 -3951 -1178 -13076 -16799 -13288 -26714 -21545 -12485 8075 25901 16111
16632A6111j3677M699J026n319p836N769J653r759m22q91l612P347q877j4238
$$ 16111 2434 7133 8159 2840 -4996 773 2426 -7333 -7755 -8646 -12258 -4911 -13788 -28026
16618b8026J0861O063R850j814L327N867Q532n793j1927J0567n666k624J3529
$$ -28026 -17165 -11102 -1252 -3066 261 6128 14660 8867 -3060 7507 1841 -783 12746
16605A2746q759j1340k807j146J3550O559j2853k0557o625P372P748K781K429
$$ 12746 3987 -7353 -10160 -11306 2244 8803 -4050 -24607 -31232 -23860 -16112 -13331 -10902
16592a0902O662M900J6954J5264K798q482q005j1429o483j821j6072n845J9020
$$ -10902 -4240 660 17614 32878 35676 27194 19189 7760 1277 -544 -16616 -22461 -3441
16579c441J0729q833M513l389J4031J373M545J1188q029k4687O28j944j2225K7157
$$ -3441 7288 -1545 2968 -421 13610 14983 19528 30716 22687 -2000 -1372 -3316 -15541 11616
16565A1616M442O764R578k451j3679j979n69K943N238J302r317J019j100j3010
$$ 11616 16058 22822 32400 29949 16270 14291 13722 16665 21903 23205 13888 14907 13807 797
16551G97J5071K8687L926m0336k7054j401j0370J0914J4426M334J0018L036q490
$$ 797 15868 44555 48481 8145 -18909 -20310 -30680 -19766 -5340 -1006 9012 12048 3558
16538C558M821j3949j2813R63K0881K177J3103p191k6430j000m468J4813o40j548
$$ 3558 8379 -5570 -18383 -17420 3461 5638 18741 11550 -14880 -15880 -20348 -5535 -6175 -7723
16524g723J9618J2167P010k3518k492J1878J4963j5715k375k559k132K723O807
$$ -7723 11895 24062 31072 7554 5062 16940 31903 16188 13813 11254 9122 11845 18652
16511A8652l95J443q445j2176J1830m687q953p650m783P092J6983O1o662j5379
$$ 18652 18257 19700 11255 -921 10909 6222 -2731 -10381 -15164 -8072 8911 8972 2310 -13069
16497a3069k598q683O828k399r165Q041P788J6240K814j7380O344J9834J395j1146
$$ -13069 -15667 -24350 -17522 -19921 -29086 -21045 -13257 2983 5797 -11583 -5239 14595 15990 4844
16483D844n426j4774k0365K299j862J154J5704K2371o059n837M245J18K6208j3502
$$ 4844 -582 -15356 -35721 -33422 -35284 -34130 -18426 3945 -2114 -7951 -3706 -3588 22620 9118
16469I118j2313n41p712l77N373j385j0833L606J3983j2845n794J2808P571l98
$$ 9118 -3195 -3736 -11448 -11825 -6452 -7837 -18670 -15064 -1081 -13926 -19720 -6912 659 261
16455B61M773m797p717J736O610J765Q42R053o744J4128j8782r37L300O12L146
$$ 261 5034 237 -7480 -5744 866 2631 3473 12526 5782 19910 1128 191 3491 4103 7249
16440G249L078L234Q917M69K623P488q632l4675l218J4596O2N002L0015M331k0899
$$ 7249 10327 13561 22478 22947 25570 33058 24426 -10249 -13467 1129 1191 6193 36208 40539 19640
16425A9640j7636J5799R577m380j2485j70J2531K5053P250m975j5903j4121j0289
$$ 19640 2004 17803 27380 23000 10515 10345 22876 47929 55179 50204 34301 20180 9891
16412I891K2585J0817o326k5509k3103K206m104o584J5479Q298o780m579o851
$$ 9891 32476 43293 36967 11458 -11645 -9439 -13543 -20127 -4648 3650 -3130 -7709 -14560
16399a4560J746J0521m442m415N817r411L825R516K358j0472p166n744j542l698
$$ -14560 -12814 -2293 -6735 -11150 -5333 -14744 -10919 -1403 955 -9517 -16683 -22427 -23969 -27667
16385b7667K629J7424K4898m852q560J315m131o722l438j2007J591J1865J451
$$ -27667 -25038 -7614 17284 12432 3872 5187 1056 -5666 -9104 -21111 -19520 -7655 -6204
16372f204m513K515p105J8245K766j9856R956L311o879N805O320K6158J638j4981
$$ -6204 -10717 -8202 -15307 2938 5704 -14152 -4196 -885 -7764 -1959 4361 30519 32157 17176
16358A7176o905J1098J3341r428l0197r735j0144n90K2258j528J3446J3891k257
$$ 17176 10271 21369 34710 25282 -4915 -14650 -24794 -25384 -3126 -4654 8792 22683 20426
16345B0426R42p551k493j3626j5605K394P956J2083L073q309n047j3185J8168
$$ 20426 21368 13817 11324 -2302 -17907 -15513 -7557 4526 7599 -710 -5757 -18942 -774
16332g74K8548N92r866j1432p636k29L493r651Q538r266j3960J4254J832l902
$$ -774 27774 28366 18500 7068 -568 -797 2696 -6955 1583 -7683 -21643 -7389 -5557 -9459
16318i459j4831q182M975L864J6927K2894j1952q279j239K0111o998k8358k2627
$$ -9459 -24290 -32472 -27497 -23633 -6706 16188 4236 -4043 -5282 14829 7831 -20527 -43154
16305d3154P731J0697L3395J9333o146j2705j4141J8287K483j1451k4258L194
$$ -43154 -35423 -24726 8669 28002 21856 9151 -4990 13297 15780 4329 -19929 -16735
16293a6735L4808O482j864j3660p350K862J988o246J37j959n696j3926N892K349
$$ -16735 18073 24555 22691 9031 1681 4543 6531 285 422 -1537 -7233 -21159 -15267 -12918
16279a2918L126R493n125j0918Q284P644Q791O941J4036J2127l6251j5106l539
$$ -12918 -9792 -299 -5424 -16342 -8058 -414 8377 15318 29354 41481 5230 -9876 -13415
16266a3415m981J024J4298K2552J7683n98k4780k0037j7752q452j623O648Q071
$$ -13415 -18396 -17372 -3074 19478 37161 36563 11783 -8254 -26006 -34458 -36081 -29433 -21362
16253b1362O209J0344J3186o860r150K036j3124J1575R610j0806m858j1275J2207
$$ -21362 -15153 -4809 8377 1517 -7633 -5597 -18721 -7146 2464 -8342 -13200 -24475 -12268
16240a2268R483j4687m930R776k221l280q980J2807J6545r772M751J8729q41l3795
$$ -12268 -2785 -17472 -22402 -12626 -14847 -18127 -27107 -14300 2245 -7527 -2776 15953 15112 -18683
16226a8683k4202K0542J8358J2188l577O336j8065o097r137l498K2985L505K637
$$ -18683 -42885 -22343 -3985 8203 4626 10962 -7103 -13200 -22337 -25835 -2850 655 3292
16213C292J0895j9244j8344K092K2655K849O54N205J1315l414j2680R843l374
$$ 3292 14187 -5057 -23401 -21309 1346 4195 4849 10054 21369 17955 5275 15118 11744
16200A1744n921J2092n206l546o275j863n992l75m852j215q15Q025J9624M678
$$ 11744 5823 17915 12709 9163 2888 1025 -4967 -5342 -10194 -11409 -12224 -4199 15425 20103
16186B0103k6850j8352m576J2548J8918k747n676k2395j120Q959M914J7289p61
$$ 20103 -6747 -25099 -29675 -17127 1791 -956 -6632 -29027 -30147 -21188 -16274 1015 254
16173B54j602l41M876p523j177n995j692m707M583P637k55J512O119p046j1933
$$ 254 -1348 -1689 3187 -4336 -5513 -11508 -13200 -17907 -13324 -5687 -5942 -4430 1689 -5357 -17290
16158a7290O999M675m336P190Q722j7675q490j3569K942k699P89J4749J4966n387
$$ -17290 -10291 -5616 -9952 -2762 5960 -11715 -20205 -33774 -30832 -33531 -32742 -17993 -3027 -8414
16144h414k9546P475O921n509J7255J0319j417%o055j1244l447m414J0894j5722
$$ -8414 -37960 -30485 -23564 -29073 -11818 -1499 -2916 -2916 -8971 -20215 -23662 -28076 -17182 -32904
16130c2904k3989J1247j1625N378L3907L0203N416j6626l732O902P097O213j6704
$$ -32904 -56893 -45646 -57271 -51893 -17986 12217 17633 1007 -2725 4177 11274 17487 783
16117G83j5353K0670O845j7841J950O068n834P135p940j8268P556m101j8783R704
$$ 783 -14570 6100 12945 -4896 -2946 3122 -2712 4423 -3517 -21785 -14229 -18330 -37113 -27409
16103b7409O942J4589J3532P801j3219j6477J1230K8089n068j9817q643o930l849
$$ -27409 -20467 -5878 7654 15455 2236 -14241 -3011 25078 20010 193 -8450 -15380 -19229
16090a9229J695j074m824J4157j0575R713J7873P417j5394j9262m063L994L870
$$ -19229 -17534 -18608 -23432 -9275 -19850 -10137 7736 15153 -241 -19503 -23566 -19572 -15702
16077a5702r994P860J5217Q043J324n115j995q529k8198J2770K3922J3r05r707
$$ -15702 -25696 -17836 -2619 5424 6748 1633 -362 -8891 -37089 -24319 -397 -384 -1289 -10996
16063a0996L944J0626K0891j2370l2540j7317J6311R543K0411J2939N160j8247
$$ -10996 -7052 3574 24465 12095 -20445 -37762 -21451 -11908 8503 21442 26602 8355
16051H355k1471o427O267M456j3337M513j2002o814J6708Q892M96J1935P010k8938
$$ 8355 -13116 -19543 -13276 -8820 -22157 -17644 -29646 -36460 -19752 -10860 -10364 1571 8581 -20357
16037b0357J906K8000R308n767k1714j1312J5032O208K688l034j481q123o97J6566
$$ -20357 -18451 9549 18857 13090 -8624 -19936 -4904 1304 3992 958 -523 -8646 -9343 7223
16023G223J241k600j2922j6995q80K0217Q785j2092J3847L5205n380l0908k2904
$$ 7223 8464 5864 -7058 -24053 -24933 -4716 4069 -8023 5824 41029 35649 4741 -18163
16010a8163j8064Q30J3812J2445K2549K300r356o206Q300j4359j1821L325J1702
$$ -18163 -36227 -35397 -21585 -9140 13409 15709 6353 147 8447 -5912 -17733 -14408 -2706
15997b706K224q636K114j1872O377J4588J9506q326m458k5252m463K0400J0450
$$ -2706 -482 -9118 -7004 -18876 -12499 2089 21595 13269 8811 -16441 -20904 -504 9946
15984I946j3800R550J6526m841j8617j0077K449M7j0565j1396k437J6461K0237
$$ 9946 -3854 5696 22222 17381 -1236 -11313 -8864 -8817 -19382 -30778 -33215 -16754 3483
15971C483Q998O811j2465k5309j8531L030N193J7034N058k2039k1571J2321K8213
$$ 3483 12481 19292 6827 -18482 -37013 -33983 -28790 -11756 -6698 -28737 -50308 -37987 -9774
15958i774L1452J0409j5754k1545l009m191J580r64J478Q954q771m46n770j0695
$$ -9774 21678 32087 16333 -5212 -8221 -12412 -10832 -11796 -10318 -1364 -10135 -10581 -16351 -27046
15944b7046M342l131j1432p592L845O399J5534L8134k296L47N792j1608L255M02
$$ -27046 -22704 -25835 -37267 -44859 -41014 -34615 -19081 19053 16757 17104 22896 11288 14543 14945
15930A4945P070j768j8263Q801q38j1248j0706o302J4372J3926K109J224j67N069
$$ 14945 22015 20247 1984 10785 9947 -1301 -12007 -18309 -3937 9989 12098 13322 13155 18224
15916A8224n640j836K694K269q602n275M424l351j9410j0221Q977n645Q711P471
$$ 18224 12584 10748 13442 15711 7109 1834 6258 2907 -16503 -26724 -17747 -23392 -14681 -7210
15902g210j642q386n762m765k84P821M337M032J1582j1835O973L7655M968j4696
$$ -7210 -8852 -17238 -23000 -27765 -28049 -20228 -15891 -11859 -277 -12112 -5139 32516 37484 22788
15888B2788j8898k4242n301O676R722P537k5853K13J8855J9041j3068j8641J121
$$ 22788 3890 -20352 -25653 -18977 -9255 -1718 -27571 -27358 -8503 10538 -2530 -21171 -20050
15875b0050J5347J0851M714j1158K791R379k078j953L164l381j96M248J9942P342
$$ -20050 -4703 6148 10862 -296 2495 11874 9796 7843 11007 7626 7430 11678 31620 38962
15861C8962j1189j0193r309N553O32j1964r229J773J262M324m675j254j8196l914
$$ 38962 27773 17580 8271 13824 14456 2492 -6737 -4964 -3702 622 -4053 -5307 -23503 -27417
15847b7417J2200N591J111j812Q597N002j2461k0303l967j3279P548K4183K419
$$ -27417 -15217 -9626 -8515 -10327 -1730 3272 -9189 -29492 -33459 -46738 -39190 -15007 -12588
15834a2588p948j145R868m27J1392r006j2621j783l056L834r5r312p337K4239
$$ -12588 -20536 -21681 -11813 -12240 -848 -9854 -22475 -24258 -27314 -23480 -23575 -32887 -40224 -15985
15820a5985R125j2144Q736l719n341J5310K525J2137J1165K5293O44j8647o508
$$ -15985 -6860 -19004 -10268 -13987 -19328 -4018 -1493 10644 21809 47102 47746 29099 22591
15807B2591j313N85j020n909j270j9284j707Q081l93m825m381K576p293j0918
$$ 22591 21278 21863 20843 14934 13664 -5620 -7327 754 361 -4464 -8845 -6269 -13562 -24480
15793b4480K87n205J0194o568j1826R062K0972R894K035O591n761j3369j5427
$$ -24480 -24193 -29398 -19204 -25772 -37598 -28536 -7564 2330 4365 10956 5195 -8174 -23601
15780b3601K540Q363j2954r124R719J5562K0123K2117o383J890j0452j6424q617
$$ -23601 -21061 -12698 -25652 -34776 -25057 -9495 10628 32745 26362 28252 17800 1376 -7241
15767g241K0604J4979j4870j5243j0873O066O631n026p940O34J4892J4039j6048
$$ -7241 13363 28342 13472 -1771 -12644 -6578 53 -4973 -12913 -12279 2613 16652 604
15754F04n087R467Q834n16o863j306k1068J3579Q991J3970J865l2419j1501Q69
$$ 604 -4483 4984 13818 13302 6439 5133 -15935 -2356 6635 20605 22470 -9949 -21450 -20581
15740b0581p943J3559N268L732l183J1390p035R44P705K8015j5592L693k0270
$$ -20581 -28524 -14965 -9697 -5965 -9148 2242 -4793 -3849 3856 31871 16279 19972 -298
15727b98q112p938K48N414j1283k0242j632P600L6956Q002o365q689j9189o467
$$ -298 -8410 -16348 -16100 -10686 -21969 -42211 -43843 -36243 713 8715 2350 -6339 -25528 -31995
15713c1995K71r052k2466O337K4714J9185K3855K106l763k9139p849J6363n605
$$ -31995 -31724 -40776 -63242 -56905 -32191 -13006 10849 12955 9192 -19947 -27796 -11433 -17038
15700a7038o730p100J0373K713Q227j159m628K2984J1914m245m501M216l310Q07
$$ -17038 -23768 -30868 -20495 -17782 -9555 -10714 -15342 7642 19556 15311 10810 15026 11716 12523
15686A2523J4133j3122j7757K320O248m126L001L380J2255q754J234j506j2727
$$ 12523 26656 13534 -4223 -1903 4345 219 3220 6600 18855 10101 11335 9829 -2898
15673b898R518P676j949n769J8747P200j1505m218q535k0835O213K1693j1905
$$ -2898 6620 14296 12347 6578 25325 32525 21020 16802 8267 -12568 -6355 15338 3433
15660C433m46j4409j5908j4683K6895J8006Q369j3287N962J1907M643j4730J183
$$ 3433 2987 -11422 -27330 -42013 -15118 2888 11257 -2030 3932 15839 20482 5752 6935
15647F935n293n21j2554j4416J1635P762L194J217J3577N751j7782j1786K311
$$ 6935 1642 1121 -11433 -25849 -14214 -6452 -3258 -2041 11536 17287 -495 -12281 -9970
15634i970j1040j670l840l760O330K8216M115k929j1318J7853N150k5290k538
$$ -9970 -21010 -22680 -26520 -30280 -23950 4266 8381 5452 -5866 11987 17137 -8153 -10691
15621a0691k3067J3308J9117K969M915j9227j9508Q913j492j4828Q870J3407J268
$$ -10691 -33758 -20450 -1333 1636 6551 -12676 -32184 -23271 -24763 -39591 -30721 -17314 -16046
15608a6046p121j550l248r51R724k759K428K781J3212J1052l380K778J1859j1339
$$ -16046 -23167 -24717 -27965 -28916 -19192 -21951 -19523 -16742 -3530 7522 4142 6920 18779 7440
15594G440j5596q759J0680J6578J4955K142j1153j0602k1412L461N141j4386j3544
$$ 7440 -8156 -16915 -6235 10343 25298 27440 16287 5685 -15727 -12266 -7125 -21511 -35055
15581c5055J9356L8601O298p153j9308j9391j2442K553J8516K3378J3525k4769
$$ -35055 -15699 22902 29200 22047 2739 -16652 -29094 -26541 -8025 15353 28878 4109
15569D109j1725K7908Q351o519j0918k1006j5701n236J3680J5238o928j4241J452
$$ 4109 -7616 20292 28643 22124 11206 -9800 -25501 -30737 -17057 -1819 -8747 -22988 -21536
15556b1536Q926r449p291L0039J0186J2406K702j5956l394j0732n333M497L911
$$ -21536 -12610 -22059 -29350 689 10875 23281 25983 10027 6633 -4099 -9432 -4935 -1024
15543a024n249j908q21K388J3243K8698j8527r896k2918p762o751n972J8227J3710
$$ -1024 -6273 -8181 -9002 -6614 6629 35327 16800 6904 -16014 -23776 -30527 -36499 -18272 -4562
15529d562j9098J0516J8033j5956k2404J7580K0117k3k7q5p286n06q331n502K296
$$ -4562 -23660 -13144 4889 -11067 -33471 -15891 4226 4203 4176 4091 -3195 -3701 -12032 -17534 -15238
15514a5238J658j3725r361J3569J1623N835J4624m257m193r638r973k224N934
$$ -15238 -13580 -27305 -36666 -23097 -11474 -5639 8985 4728 535 -9103 -19076 -21300 -15366
15501a5366M25j1652p280O538K587k580j136j4099l097R324J775K3985M429M142
$$ -15366 -14941 -26593 -33873 -27335 -24748 -27328 -28464 -42563 -45660 -36336 -34561 -10576 -6147 -2005
15487b005j3663j1672J620M971j534J2653R921j0619k735K415P70J3923J0390
$$ -2005 -15668 -27340 -25720 -20749 -22283 -9630 291 -10328 -13063 -10648 -9878 4045 14435
15474A4435N901q908M39J2591k83L991j3599M308m215k539p452K054j4519l7355
$$ 14435 20336 11428 11867 24458 24175 28166 14567 18875 14660 12121 4669 6723 -7796 -45151
15460d5151j8230J262K8787J8014J4988R979p949K271J10J0101J0763l835r148
$$ -45151 -63381 -62119 -33332 -15318 -330 9649 1700 3971 4081 14182 24945 21110 11962
15447A1962j7478k4809J3738o680k1097K5039J0157J3251L5018L978k6848p200
$$ 11962 -5516 -30325 -16587 -23267 -44364 -19325 -9168 4083 39101 43079 16231 9031
15435I031M913m649J2845j3916p832J620j1123j308k037Q877M872o435P994K349
$$ 9031 13944 9295 22140 8224 392 2012 -9111 -10419 -12456 -3579 1293 -5142 2852 5201
15421E201M424j0818j9065J2521q127n994k784J6626K4777j00j5642o463p663
$$ 5201 9625 -1193 -20258 -7737 -15864 -21858 -24642 -8016 16761 16661 1019 -5444 -13107
15408a3107P795l867J2920N145J445N989P016k09j3583K896k434r046p394J7921
$$ -13107 -5312 -9179 3741 8886 10331 16320 23336 23127 9544 12440 10006 960 -6434 11487
15394A1487N808j2706J2495K7211j0666k3400K935k174k971K716j8118j0771k7795
$$ 11487 17295 4589 17084 44295 33629 10229 13164 10990 8019 10735 -7383 -18154 -45949
15381d5949O324J3013M057P872m646J443n165m332Q768O519j505j1086J018J2161
$$ -45949 -39625 -26612 -22555 -14683 -19329 -17886 -23051 -27383 -18615 -12096 -13601 -24687 -23669 -11508
15367a1508j869m805J3083j7990q21K3583L71J0777j1199L232O457P04J180J8657
$$ -11508 -13377 -18182 -5099 -23089 -23910 -327 44 10821 -378 2854 9311 10015 11195 29852
15353B9852L195k6384j8585l70L342K2840q996k5138r719J908R663L376m893j8783
$$ 29852 33047 6663 -11922 -12292 -8950 13890 4894 -20244 -29963 -28055 -18392 -15016 -19909 -38692
15339c8692Q448M786m672j53j855J8060P734R165M092n616O169O711j7545j4230
$$ -38692 -30244 -25458 -30130 -30283 -32138 -14078 -6344 2821 6913 1297 7466 14177 -3368 -17598
15325a7598l042R239J9065J415j1695n509p233M475j5167m951L970k893j88J6849
$$ -17598 -20640 -11401 7664 9079 -2616 -8125 -15358 -10883 -26050 -31001 -27031 -29924 -30112 -13263
15311a3263l012K869Q175J9120L231j3683r869J8487M906j7346L707N450k178
$$ -13263 -16275 -13406 -5231 13889 17120 3437 -6432 12055 16961 -385 3322 8772 6594
15298F594j3466N767N315O552p304o032N973k5688K481K3149q302j673r720J5073
$$ 6594 -6872 -1105 4210 10762 3458 -2574 3399 -22289 -19808 3341 -4961 -6634 -16354 -1281
15284a281J3149J107M959l0416p773j3548J0252K0835J6467J9068K92k2345j8212
$$ -1281 11868 12975 17934 -12482 -20255 -33803 -23551 -2716 13751 32819 33111 10766 -7446
15271g446j7746p0P386P028n06J4302R319q084M351M658M358q277K249Q999r943
$$ -7446 -25192 -25262 -17876 -10848 -11354 2948 12267 4183 8534 13192 17550 9273 11522 20521 10578
15256A0578k784N364k220J282n513j4705P379J1083o277o673N300J40K244O04
$$ 10578 7794 13158 10938 12220 6707 -7998 -619 10464 4187 -2486 2814 2954 5198 5802
15242E802m632j2845P543K948O137n388j2881j6288K1223J5847J819j0109j8859
$$ 5802 1170 -11675 -4132 -1184 4953 -435 -13316 -29604 -8381 7466 9285 -824 -19683
15229a9683r134P807j9328J413K5110J4326n802R961L018j5203k399q855L81J1441
$$ -19683 -28817 -21010 -40338 -38925 -13815 511 -5291 4670 7688 -7515 -9914 -18769 -18388 -6947
15215f947J3364j9554K0631J1334o216l3492k026J2369N460j2149j134K7108k997
$$ -6947 6417 -13137 7494 18828 12612 -20880 -22906 -10537 -5077 -17226 -18360 8748 5751
15202E751o471j4352K550M529j0387P941J6833j143j0461J5695Q12n536j221l680
$$ 5751 -720 -15072 -12522 -7993 -18380 -10439 6394 5251 -5210 10485 11297 5761 4540 860
15188H60L078k341l6813k000K1466l611m837j772J4999J2009j5911M337l741L347
$$ 860 3938 1597 -35216 -37216 -15750 -19361 -24198 -25970 -10971 1038 -14873 -10536 -14277 -10930
15174a0930m810j1398J2871K2792J0101j1197j1820J0780j6270p965K36o569J2888
$$ -10930 -15740 -27138 -14267 8525 18626 7429 -4391 6389 -9881 -17846 -17610 -24179 -11291
15161a1291n576p40J8414j1735r066R870L0482o67l619L910j2912l619n298m283
$$ -11291 -16867 -17607 807 -10928 -19994 -10124 20358 19691 16072 19982 7070 3451 -1847 -6130
15147f130n757j3K6726O734j8629k4547P930n472L587k990J6711J5300p774k1327
$$ -6130 -11887 -11900 14826 21560 2931 -21616 -13686 -19158 -15571 -18561 -1850 13450 5676 -15651
15133a5651r474k487J1993j3232N934R643j053l588P604r004M870O615q400K140
$$ -15651 -25125 -27612 -15619 -28851 -22917 -13274 -14327 -17915 -10311 -19315 -14445 -7830 -16230 -14090
15119a4090L514P311J5982o429r799O743k278o605J2234J957j7988j2030O095
$$ -14090 -10576 -3265 12717 6288 -3511 3232 954 -5651 6583 8540 -9448 -21478 -15383
15106a5383q876j3072J3781J3865J1191M550j0498o532J5104j568j9568n031L174
$$ -15383 -24259 -37331 -23550 -9685 1506 6056 -4442 -10974 4130 2562 -17006 -22037 -18863
15093a8863q334k641O503O488N929k851Q228m259j381M449J1407R395m710j0273
$$ -18863 -27197 -29838 -23335 -16847 -10918 -13769 -5541 -9800 -11181 -6732 4675 14070 9360 -913
15079i13O88j3852j4042J8555J6535J1442j8535k0975K681r475L279J0190J2227
$$ -913 -225 -14077 -28119 -9564 6971 18413 -122 -21097 -18416 -27891 -24612 -14422 -2195
15066b195J0596j420q575j142j3864L192O188L985O846J1537J0046K757L855J76
$$ -2195 8401 6981 -1594 -2736 -16600 -13408 -7220 -3235 3611 15148 25194 27951 31806 31982
15052C1982j3579L028n394K520J89k0043o405K4920J4989j085k5257j6386n170
$$ 31982 18403 21431 16037 18557 18746 -1297 -7702 17218 32207 31122 5865 -10521 -15691
15039a5691J8746K113j0310l526O917k474m560j1688m825J9881o519r284Q190
$$ -15691 3055 5168 -5142 -8668 -1751 -4225 -8785 -20473 -25298 -5417 -11936 -21220 -13030
15026a3030L941j005l994o568o151J214K330L0523K1170l577l309o251j2921j108
$$ -13030 -9089 -10094 -14088 -20656 -26807 -25593 -23263 7260 28430 24853 21544 15293 2372 1264
15012A264l855R24J1959j2060L469J605M765K1810K0778j0164j5866p409j2435
$$ 1264 -2591 -1667 10292 -1768 1701 3306 8071 29881 50659 40495 24629 17220 4785
14999D785o751k319j1559m760O735Q276m389K2693P868j0706o415k636q44J2635
$$ 4785 -1966 -4285 -15844 -20604 -13869 -5593 -9982 12711 20579 9873 3458 822 -22 12613
14985A2613k376m058r39n178m964p470J503J2382o13J1776j1903r884J0452R062
$$ 12613 10237 6179 5240 62 -4902 -12372 -10869 1513 900 12676 773 -9111 1341 10403
14971A0403J2190j2429j840p176j2472J2121J0193j0214R344j5540j0279r529
$$ 10403 22593 10164 8324 1148 -11324 797 10990 776 10120 -5420 -15699 -25228
14959b5228p949o085P645O79L6897k328l834K003J964j0241j0678l890o231j300
$$ -25228 -33177 -39262 -31617 -30938 5959 3631 -203 1800 3764 -6477 -17155 -21045 -27276 -28576
14945b8576j2787j3434L127K2406J0143J432N528j1833K0411q748j7404k023K6473
$$ -28576 -41363 -54797 -51670 -29264 -19121 -17689 -12161 -23994 -3583 -12331 -29735 -31758 -5285
14932e285r37o197J6979J3382J6950J3249k3158j3248n838l2528k3969J4923R747
$$ -5285 -6222 -12419 4560 17942 34892 48141 24983 11735 5897 -26631 -50600 -35677 -25930
14919b5930O962J2341K0423m615R148K648J5351J213l4735p853J854p955O738
$$ -25930 -18968 -6627 13796 9181 18329 20977 36328 37541 2806 -5047 -3193 -11148 -4410
14906d410M455q043R637R174R103J3281M245j6319k7970k3476J4328P435J364
$$ -4410 45 -7998 1639 10813 19916 33197 37442 21123 -6847 -30323 -15995 -8560 -7196
14893g196N816m020l282j621J0476J0742j4800j4451L1015J8053j5936k8428p406
$$ -7196 -1380 -5400 -8682 -10303 173 10915 -3885 -18336 12679 30732 14796 -13632 -21038
14880b1038J1360J0961j064O997n115o580r0j3306R799K0826o082j1266j7808
$$ -21038 -9678 1283 219 7216 2101 -4479 -4569 -17875 -8076 12750 6668 -4598 -22406
14867b2406R826k252j7434n586K833K4836J4590o402k8938o074M843J9522P658
$$ -22406 -12580 -14832 -32266 -37852 -35019 -10183 4407 -1995 -30933 -37007 -32164 -12642 -4984
14854d984j1649M579j0343Q214J6567r859p75J3124o131j5967J2747J676j3499
$$ -4984 -16633 -12054 -22397 -14183 2384 -7475 -8250 4874 -1257 -17224 -4477 -2801 -16300
14841a6300q074J1217J8544J6987J4100k208k2704j6618j8617o459O369R203J1460
$$ -16300 -24374 -13157 5387 22374 36474 34266 11562 -5056 -23673 -30132 -23763 -14560 -3100
14828c100l331o831j1399o022P0M857J422P588K6269J4034j6477n316K536o429
$$ -3100 -6431 -13262 -24661 -30683 -30613 -25756 -24334 -16746 9523 23557 7080 1764 4300 -2129
14814b129M295J0794q194p81J1920K0181L061j1510l018j3491j2451k0532j4122
$$ -2129 2166 12960 4766 3985 15905 36086 39147 27637 24619 11128 -1323 -21855 -35977
14801c5977J2256J1248J1958N709m763j8445j5245N253J0968l578K303L4656J6524
$$ -35977 -23721 -12473 -515 5194 431 -18014 -33259 -28006 -17038 -20616 -18313 16343 32867
14788C2867o651n92l61j6304n200j437O34L917j8363q998O156J1079j259K609
$$ 32867 26216 25624 25263 8959 3759 2322 2956 6873 -11490 -20488 -14332 -3253 -4512 -1903
14774a903L700j0648L288J8274j071m451j7464j920R063J0451q331j1959P403
$$ -1903 1797 -8851 -5563 12711 11640 7189 -10275 -12195 -3132 7319 -1012 -12971 -5568
14761e568p92O45J3399R442L962l143j8017K295k408K906k627l683J0430l428
$$ -5568 -6360 -5715 7684 17126 21088 17945 -72 2223 -185 2721 94 -3589 6841 3413
14747C413p698m392o880J7388K0332j1073k61J06j3568j2638J5538M613r18O284
$$ 3413 -4285 -8677 -15557 1831 22163 11090 10829 10935 -2633 -15271 267 4880 3962 10246
14733A0246K961j396r174j2588q072k350N730J6803M060m743j2049j5557O838
$$ 10246 13207 11811 2637 -9951 -18023 -20373 -14643 2160 6220 1477 -10572 -26129 -19291
14720a9291r093J5409K181j0040l526R525R489K4758L959j6306n130j8052j3681
$$ -19291 -28384 -12975 -10794 -20834 -24360 -14835 -5346 19412 23371 7065 1935 -16117 -29798
14707b9798N961K4859J4756j1614P482r879o479P105J1212o328j6259k0230L207
$$ -29798 -23837 1022 15778 4164 11646 1767 -4712 2393 13605 7277 -8982 -29212 -26005
14694b6005j4722J4024J9267J688m688j5880L789M585J592Q103L128Q327J0888
$$ -26005 -40727 -26703 -7436 -5748 -10436 -26316 -22527 -17942 -16350 -8247 -5119 3208 14096
14681A4096p709p488J16p157n893J037n094j680J0290k208j1407m596J5839K796
$$ 14096 6387 -1101 -985 -8142 -14035 -12998 -18092 -19772 -9482 -11690 -23097 -27693 -11854 -9058
14667i058j4606L464J6103Q357N504j2284L722r309j1614M782N676M406M271j3490
$$ -9058 -23664 -20200 -4097 4260 9764 -2520 1202 -8107 -19721 -14939 -9263 -4857 -586 -14076
14653a4076k7259m329J5299J0713l302J7487n412k0860k3238J9179o207n021J5755
$$ -14076 -41335 -45664 -30365 -19652 -22954 -5467 -10879 -31739 -54977 -35798 -42005 -47026 -31271
14640c1271K0459n411j935m775j530J4580J1033M531J8392N225j6147r642q769
$$ -31271 -10812 -16223 -18158 -22933 -24463 -9883 1150 5681 24073 29298 13151 3509 -5260
14627e260j0427M252r245n985R988Q490Q758m472r440J810J999P59L667M838j1015
$$ -5260 -15687 -11435 -20680 -26665 -16677 -8187 571 -3901 -13341 -11531 -9532 -8773 -5106 -268 -11283
14612a1283n475K019P177j8688M059L506o761q169N248K9029L2613J2484k1602
$$ -11283 -16758 -14739 -7562 -26250 -22191 -18685 -25446 -33615 -28367 662 33275 45759 24157
14599B4157j0053J107k604j7223j992J6405N181k5716k6922q750Q175k538K0943
$$ 24157 14104 15211 12607 -4616 -6608 9797 14978 -10738 -37660 -46410 -38235 -40773 -19830
14586a9830L780M624r657Q053Q876K887K258J3956o464l724K278q686k3228j9325
$$ -19830 -16050 -11426 -21083 -13030 -4154 -1267 991 14947 8483 4759 7037 -1649 -24877 -44202
14572d4202P766J7809J0265P072j226K492N034j4677o727m246N46j7037K495J4696
$$ -44202 -36436 -18627 -8362 -1290 -2516 -24 5010 -9667 -16394 -20640 -20094 -37131 -34636 -19940
14558a9940R183k772l5m666r018K984J8404j0045k3708r129J2526O965J9279L2125
$$ -19940 -10757 -13529 -13564 -18230 -27248 -24264 -5860 -15905 -39613 -48742 -36216 -29251 -9972 22153
14544B2153K462m2234k2022L910N573J0445l139O469n922j0564N622J2824l610
$$ 22153 24615 -17619 -39641 -35731 -30158 -19713 -22852 -16383 -22305 -32869 -27247 -14423 -18033
14531a8033j2778k872K2806K3937m306r56P235n795O492L166j8977k812n198k020
$$ -18033 -30811 -33683 -10877 13060 8754 7798 15033 9238 15730 18896 -81 -2893 -8091 -10111
14517a0111J1643J5416k60J030J699j0994o604P055O094J747P602l964j10j836
$$ -10111 1532 16948 16688 17718 19417 8423 1819 8874 14968 16715 24317 20353 20243 18407
14503A8407k6641j4875K179J9727O179j909K387R04r163j5125r614J1750r764
$$ 18407 -8234 -23109 -20930 -1203 4976 3067 5454 6358 -2805 -17930 -27544 -15794 -25558
14490b5558J868J5420J8442O798L281q034J141O198j0319N497j2607p973O103
$$ -25558 -23690 -8270 10172 16970 20251 12217 13358 19556 9237 14734 2127 -5846 257
14477B57n829J8166R821k9849k4728n360j3251J4618J7738J167k4050k519K6091
$$ 257 -5572 12594 22415 -7434 -32162 -37522 -50773 -36155 -18417 -17250 -41300 -43819 -17728
14464a7728J4227j2137k2135Q012J1157p739j595J2507l221j141J7208j92j6281
$$ -17728 -3501 -15638 -37773 -29761 -18604 -26343 -27938 -15431 -18652 -19793 -2585 -2777 -19058
14451a9058Q630J3518J1731M803j5070J863j534j2869J2265j418k0871j0839L688
$$ -19058 -10428 3090 14821 19624 4554 6417 4883 -7986 4279 2861 -18010 -28849 -25161
14438b5161K3552r057j4491j1712J7836l395l0773J6611L4432K2650o270l9390
$$ -25161 -1609 -10666 -25157 -36869 -19033 -22428 -53201 -36590 -2158 20492 14222 -25168
14426b5168k0277J1381J4833P867j4204k1146K7501Q84j0443O555M257Q436L53
$$ -25168 -45445 -34064 -19231 -11364 -25568 -46714 -19213 -18329 -28772 -22217 -17960 -9524 -9171
14413i171j6711L099P125J0088m269o409Q717o947j849M7J7333J113O062K628
$$ -9171 -25882 -22783 -15658 -5570 -9839 -16248 -7531 -14478 -16327 -16280 1053 2166 8228 10856
14399A0856M648l58Q198o771j1686q53j3722Q577L1338L36k0615j8068n118Q740
$$ 10856 15504 15146 23344 16573 4887 4034 -9688 -1111 30227 30563 9948 -8120 -13238 -4498
14385d498r009n987R253j0043J592J6099l364N150M507j7787J742L497j50n190
$$ -4498 -13507 -19494 -10241 -20284 -18692 -2593 -5957 -807 3700 -14087 -12345 -8848 -8998 -14188
14371a4188J0520m00m296p612m784j2261P173J8354L878R044m674n853J5186K3298
$$ -14188 -3668 -4068 -8364 -15976 -20760 -33021 -25848 -7494 -3616 5428 754 -5099 10087 33385
14357C3385N369j5008n996p751k5243l57k803J3265J8029j7750j0513N212O241
$$ 33385 38754 23746 17750 9999 -15244 -15601 -18404 -5139 12890 -4860 -15373 -10161 -3920
14344c920P381N013r22j6643j3574N426o024k768q286o622R301J4831J1510J5375
$$ -3920 3461 8474 7552 -9091 -22665 -17239 -23263 -26031 -34317 -40939 -31638 -16807 -5297 10078
14330A0078P248J6821o447k9487j6166R66J4064k530p967q288R418P226j340K0740
$$ 10078 17326 34147 27700 -1787 -17953 -16987 -2923 -5453 -13420 -21708 -12290 -5064 -6404 14336
14316A4336K208m068J1320R404j6075m562M95Q758R093j838q380K402q51J025
$$ 14336 16544 12476 23796 33200 17125 12563 13058 21816 30909 29071 20691 23093 22242 23267
14302B3267L917m251p607N362j8018r231j7116j6801P448R216L736K313J0681
$$ 23267 27184 22933 15326 20688 2670 -6561 -23677 -40478 -33030 -23814 -20078 -17765 -7084
14289g084J1050p014q824N737j1193L208K414l632J3364j906J4588Q934k3487
$$ -7084 3966 -3048 -11872 -6135 -17328 -14120 -11706 -15338 -1974 -3880 10708 19642 -3845
14276c845k888m755J2013J3253k776k8887n178J4911K2097j3291j7151J0408L158
$$ -3845 -6733 -11488 525 13778 11002 -17885 -23063 -8152 13945 654 -16497 -6089 -2931
14263b931j4409j2892M10l207J4500L0462J5250r794k5048M730J5663J3547Q496
$$ -2931 -17340 -30232 -29822 -33029 -18529 11933 27183 17389 -7659 -2929 12734 26281 34777
14250C4777k5212k1492J3369K429M322m712j580j9277p585q778M071K0684R679
$$ 34777 9565 -11927 1442 3871 8193 3481 1901 -17376 -24961 -33739 -29668 -8984 695
14237F95n682k3313j979N798l828l85J281K1224k053k167l431J4755Q807J9482
$$ 695 -4987 -28300 -30279 -24481 -28309 -28694 -27413 -6189 -8242 -10409 -13840 915 9722 29204
14223B9204j1091j6868K492k079j629o337M48m877j1354j1420j9975J644K514
$$ 29204 18113 1245 3737 1658 29 -6308 -5860 -10737 -22091 -33511 -53486 -51842 -49328
14210d9328J3333R886K5523N406N128j36j9486n432n233K3645k351j6938k687
$$ -49328 -35995 -26109 -586 4820 9948 9812 -9674 -15106 -20339 3306 955 -15983 -18670
14197a8670L930j8359L625J8400k534K197J4409j3829K034J2219J8857l682j2315
$$ -18670 -14740 -33099 -29474 -11074 -13608 -11411 2998 -10831 -8797 3422 22279 18597 6282
14184F282k8000j5620j0274J0247J4642J1103j8728o715J6818J1037K2318R12
$$ 6282 -21718 -37338 -47612 -37365 -22723 -11620 -30348 -37063 -20245 -9208 13110 14022
14172A4022N964Q968n420k0116o954l373M177J7522O796Q68m347k844l074r164
$$ 14022 19986 28954 23534 3418 -3536 -6909 -2732 14790 21586 22454 18107 15263 12189 3025
14158C025m030J746r351j7713r369J9338O798n792j7126J0220R216r679L863O65
$$ 3025 -1005 741 -8610 -26323 -35692 -16354 -9556 -15348 -32474 -22254 -13038 -22717 -18854 -18189
14144a8189j0324j2264o618K9926K482j8427j5654J3598J7024J6790J9433j8024
$$ -18189 -28513 -40777 -47395 -17469 -14987 -33414 -49068 -35470 -18446 -1656 17777 -247
14132b47j3016j2912P954J7891L828K1870O341k3324j3482n634K169m890J622
$$ -247 -13263 -26175 -18221 -330 3498 25368 31709 8385 -5097 -10731 -8562 -13452 -11830
14119a1830J5356p838j5837r217J6779O199O87P781J1696J5733n421j9731r203
$$ -11830 3526 -4312 -20149 -29366 -12587 -6388 -5701 2080 13776 29509 24088 4357 -4846
14106d846J5301j0836p382p294J5362O097P609m905j9139j1153k470J2684J0858
$$ -4846 10455 -381 -7763 -15057 305 6402 14011 9106 -10033 -21186 -23656 -10972 -114
14093a14j4895J5863N796J433j68j2183l869Q168Q42J477R100K059j337N850j1497
$$ -114 -15009 854 6650 8083 7915 -4268 -8137 31 873 2350 11450 13509 12172 18022 6525
14078F525j7808l405K2087M014k570j1732l426n595J5215R168j1193p563k979
$$ 6525 -11283 -14688 7399 11413 8843 -2889 -6315 -11910 3305 12473 1280 -6283 -9262
14065i262J21p648O406J0678N929P953o333k5024J306O103M452m622q157j3291
$$ -9262 -9141 -16789 -10383 295 6224 14177 7844 -17180 -15874 -9771 -5319 -9941 -18098 -31389
14051c1389R41k775k0821J839J5721J8617J5474l174q121j3779o803J0168J153
$$ -31389 -30448 -33223 -54044 -52205 -36484 -17867 -2393 -5567 -13688 -27467 -34270 -24102 -22949
14038b2949J6294R176j2633j2133j4678j1072k669J4175J4220M429J0114j4297
$$ -22949 -6655 2521 -10112 -22245 -36923 -47995 -50664 -36489 -22269 -17840 -7726 -22023
14026b2023P260R114j389q168j8945j2020O717k242R537l455J9682K9659K748
$$ -22023 -14763 -5649 -7038 -15206 -34151 -46171 -39454 -41696 -32159 -35614 -15932 13727 16475
14013A6475J317q979j5097j1906M104M347K0587p005q497O086j1170l730n083
$$ 16475 17792 8813 -6284 -18190 -14086 -9739 10848 3843 -4654 1432 -9738 -13468 -18551
14000a8551k3361j4443J9348K006K815O722o73R762J6704n784J1970O189O208
$$ -18551 -41912 -56355 -37007 -35001 -32186 -25464 -26137 -16375 329 -5455 6515 12704 18912
13987A8912K129J172j3553o743j0746j7141K5051K2773k982j3676j1716J063r41
$$ 18912 21041 22213 8660 1917 -8829 -25970 -919 21854 18872 5196 -6520 -5457 -6398
13974f398M785P450q865l672J867j909j4555L866M955J1446K267k7568l832m971
$$ -6398 -1613 5837 -3028 -6700 -4833 -6742 -21297 -17431 -12476 -1030 1237 -26331 -30163 -35134
13960c5134j7074J1425p873Q280K9356K4521n867N983J4241j0888O56R502p623
$$ -35134 -52208 -40783 -48656 -40376 -11020 13501 7634 13617 27858 16970 17626 27128 19505
13947A9505r472P53J5704l0516j2949j3270j9156j9543J8764O277p846K0271K0761
$$ 19505 10033 10786 26490 -4026 -16975 -30245 -49401 -68944 -50180 -43903 -51749 -31478 -10717
13934a0717K182j6953r163O693J8541M269j727K187Q21j9142J761N884J5313J4998
$$ -10717 -8535 -25488 -34651 -27958 -9417 -5148 -6875 -4688 -3867 -23009 -21248 -15364 -51 14947
13920A4947N131L706k0519k2664K567J9454J2744j0199n630J7381K667j0908J3921
$$ 14947 20078 23784 3265 -19399 -16832 2622 15366 5167 -463 16918 19585 8677 22598
13907B2598m555k1032j297P405N213J4320l74J568m954j2309k7533P986J0430
$$ 22598 18043 -2989 -4286 3119 8332 22652 22278 23846 18892 6583 -20950 -12964 -2534
13894b534J7524Q778P688J4k2299j3990p503m130p670K698J5637M109J3180J1392
$$ -2534 14990 23768 31456 31470 9171 -4819 -12322 -16452 -24122 -21424 -5787 -1678 11502 22894
13880B2894j3630k3338m286k646L01n961J4066J446r809j7157k47J1771K991j1103
$$ 22894 9264 -14074 -18360 -21006 -20705 -26666 -12600 -11154 -20963 -38120 -38367 -26596 -23605 -34708
13866c4708j1334J7109K3340J5470L21j8865j250J2995R770R131J369j2420p373
$$ -34708 -46042 -28933 -5593 9877 10198 -8667 -9917 3078 12848 21979 23348 10928 3555
13853C555K705o889L28l342O803J1855R221q498r439m70o548j7974q361j4753
$$ 3555 6260 -629 -301 -3643 3160 15015 24236 15738 6299 5829 -719 -18693 -27054 -41807
13839d1807L3137J2894j2935m662l515p289q322J2299J7080Q784L190M31o078
$$ -41807 -8670 4224 -8711 -13373 -16888 -24177 -32499 -20200 -3120 5664 8854 9285 3207
13826C207j8122J989J215j7514M572N638R250J4367J722j858r835M832J1404P765
$$ 3207 -14915 -12926 -11711 -29225 -24653 -19015 -9765 4602 6324 4466 -5369 -537 10867 18632
13812A8632o001q718K953j1908j1042j3826J751l826L596N896j2929J21L860q349
$$ 18632 12631 3913 6866 -5042 -16084 -29910 -28159 -31985 -28389 -22493 -35422 -35301 -31441 -39790
13798c9790j2132j4168J4240J7537O780J0651j0209r782J4778K785P351K0238
$$ -39790 -51922 -66090 -51850 -34313 -27533 -16882 -27091 -36873 -22095 -19310 -11959 8279
13786H279Q885Q810R180o935j3925O595n424r776J0786L880r461j6318L052j1483
$$ 8279 17164 25974 35154 28219 14294 20889 15465 5689 16475 20355 10894 -5424 -2372 -13855
13772a3855K424K2991j3510l1714J7777J2628J4353M51k077r876k0468J609J2275
$$ -13855 -11431 11560 -1950 -33664 -15887 -3259 11094 11545 9468 -408 -20876 -19267 -6992
13759f992l952J8109o887k3331j161J6669l581m87k091l889m464p505j2863K220
$$ -6992 -10944 7165 278 -23053 -24214 -7545 -11126 -11613 -13704 -17593 -22057 -29562 -42425 -40205
13745d0205r519q217J1814K101K949J8473J405R428J0497Q75j9318k082o282l14
$$ -40205 -49724 -57941 -46127 -44026 -41077 -22604 -21199 -11771 -1274 -399 -19717 -21799 -28081 -28395
13731b8395k138J0592P334j0242O773J9070M5q153j2054l742J5950J8196M839
$$ -28395 -30533 -19941 -12607 -22849 -16076 2994 3039 -5114 -17168 -20910 -4960 13236 18075
13718A8075J5603k5548j2374J1274J9594K5009J3662J9650L6522J6594o464k1454
$$ 18075 33678 8130 -4244 7030 26624 51633 65295 84945 121467 138061 131597 110143
13706A10143l4473k0951q479k7812n043J6605J7632k6922l8386j0330P947J6964
$$ 110143 75670 54719 46240 18428 13385 29990 47622 20700 -17686 -28016 -20069 -3105
13694c105J9812N252j8491K49l933j260q103j7309J0941k673M961k521p20J2740
$$ -3105 16707 21959 3468 3717 -216 -1476 -9579 -26888 -15947 -18620 -13659 -16180 -16900 -4160
13680d160N137q284R901J3597J829K3280j0625o934m434j0205K5686L4570L7981
$$ -4160 977 -7307 2594 16191 18020 41300 30675 23741 19307 9102 34788 69358 107339
13667A07339O7997J24340J52443N9269m4992r9723r5564q5307p7875l9225l752
$$ 107339 175336 299676 452119 511388 466396 366673 271109 185802 107927 68702 64950
13656F4950K882O023j1916k2332q224P84o735m50j8899n997P683J4108o719k151
$$ 64950 67832 73855 61939 39607 31383 32167 25432 24982 6083 86 7769 21877 15158 13007
13642A3007Q964J9068m139k5053j768J8595P457j5768N888M119M645P042q525
$$ 13007 21971 41039 36900 11847 10079 28674 36131 20363 26251 30370 35015 42057 33532
13629C3532J6003L071k5269j4294J0875K5966O2479Q0579J05076J32901P1166
$$ 33532 49535 52606 27337 13043 23918 49884 112363 192942 298018 430919 502085
13618E02085k6814j07745j03413r0951m2893m6982l5196j0430J2774o967j3562
$$ 502085 475271 367526 264113 173162 130269 83287 48091 37661 50435 43468 29906
13607B9906j1105k1659P500K875R0M332J8588j3624j8714l999R71j0684N625J7337
$$ 29906 18801 -2858 4642 7517 7607 11939 30527 16903 -1811 -5810 -4839 -15523 -9898 7439
13593G439p817j4612n477J7093K2406j1463k455L194J5977p334j7349j5773o502
$$ 7439 -378 -14990 -20467 -3374 19032 7569 5114 8308 24285 16951 -398 -16171 -22673
13580b2673J2412K8350M3410K4717J5006L7661K3785k2776j8718l2246j2306o479
$$ -22673 -10261 18089 61499 86216 101222 138883 162668 139892 121174 88928 76622 70143
13568G0143k7050k2270j2891l298J2619J6819k0085j8822m973R816l721j0005
$$ 70143 43093 20823 7932 4634 17253 34072 13987 -4835 -9808 8 -3713 -13718
13556a3718J5203j1599Q300J5202J4175J7699k247p116k8447j1241l985K899K014
$$ -13718 1485 -10114 -1814 13388 27563 45262 43015 35899 7452 -3789 -7774 -4875 -2861
13543b861r686K582R10j7373J0639P184j775J0064N071L462K791j5777J574O225
$$ -2861 -12547 -9965 -9055 -26428 -15789 -8605 -10380 -316 4755 8217 11008 -4769 -3195 3030
13529C030j2143j919k483J15k530J776J8884J7630J0447j2351q421j47r612k9997
$$ 3030 -9113 -11032 -13515 -13400 -15930 -14154 4730 22360 32807 20456 12035 11888 2276 -27721
13515b7721j0126q961j1967J6794J3698p216k3422j1335P154M0267J8408O581
$$ -27721 -37847 -46808 -58775 -41981 -28283 -35499 -58921 -70256 -63102 -22835 -4427 2154
13503B154N261K220R509J5027K091K2038l0275j7179j5580j4346Q986J1168K969
$$ 2154 7415 9635 19144 34171 36262 58300 28025 10846 -4734 -19080 -10094 1074 4043
13490D043J8750P444l593j9089q595K3998J160P61j5920p952l3877j4999l854
$$ 4043 22793 30237 26644 7555 -1040 22958 24118 24879 8959 1007 -32870 -47869 -51723
13477e1723M109n59J9690J3932O391K0102K2876P248L914J738k7528k2705p840
$$ -51723 -47614 -48173 -28483 -14551 -8160 11942 34818 42066 45980 47718 20190 -2515 -10355
13464a0355o019L300K1088k511r676L646K2931J5312L3887P970j6276k6965j8528
$$ -10355 -16374 -13074 8014 5503 -4173 -527 22404 37716 71603 79573 63297 36332 17804
13451A7804o562K2439J7022j3302j4219r04J3068j1872l8166o861R189L044J6617
$$ 17804 11242 33681 50703 37401 23182 22278 35346 23474 -14692 -21553 -12364 -9320 7297
13438G297O374k5815Q220J9873n162j2400n90n956j883J8666J0961k4543j8263
$$ 7297 13671 -12144 -3924 15949 10787 -1613 -2203 -8159 -10042 8624 19585 -4958 -23221
13425b3221J959J150K0891J550n939K0724p432j6294k5679N240N0119J6705j4343
$$ -23221 -21262 -20112 779 2329 -3610 17114 9682 -6612 -32291 -27051 23068 39773 25430
13412B5430J3174J5103o489r177j1426j7794n294j0576j5554L861J1015Q129j4459
$$ 25430 38604 53707 47218 38041 26615 8821 3527 -7049 -22603 -18742 -7727 402 -14057
13399a4057j6934Q962J2137Q867O766o514j7182N343J5839J7883O49j4284k471
$$ -14057 -30991 -22029 -9892 -1025 5741 -773 -17955 -12612 3227 21110 21759 7475 5004
13386E004m501l783j0914j1866N122Q12j0335k609k4800K0752L131K0996R075
$$ 5004 503 -3280 -14194 -26060 -20938 -20126 -30461 -33070 -57870 -37118 -33987 -12991 -3916
13373c916J1836Q795J1212K9005O159j6347j0179j6819j4732M622M819J8602k067
$$ -3916 7920 16715 27927 56932 63091 46744 36565 19746 5014 9636 14455 33057 30990
13360C0990j9655k3975j4690j4345l612L3423K4700q509j797J4108m710j4301
$$ 30990 11335 -12640 -27330 -41675 -45287 -11864 12836 4327 2530 16638 11928 -2373
13348b373n036k1147r930K6200M309m384n493K87m157M209n192J3125o808k7638
$$ -2373 -7409 -28556 -38486 -12286 -7977 -12361 -17854 -17567 -21724 -17515 -22707 -9582 -16390 -44028
13334d4028o902j1383k677j3439Q805K9567M2415O5613N6008K1583j4108l0091
$$ -44028 -50930 -62313 -64990 -78429 -69624 -40057 2358 67971 123979 145562 131454 101363
13322A01363M124L679n479R55O8j4625j3674K299J1486j4934m309j3323m127K452
$$ 101363 105487 109166 103687 104642 104710 90085 76411 78710 90196 75262 70953 57630 53503 55955
13308E5955r982j4002K512J1320o283P798o954m228m830L336J7089N377J1124
$$ 55955 45973 31971 34483 45803 39520 47318 40364 36136 31306 34642 51731 57108 68232
13295F8232j1517J3056j0824r997O563P562R19j5311j9927o137r584L9024N1688
$$ 68232 56715 69771 58947 48950 55513 63075 63994 48683 28756 22619 13035 52059 103747
13282A03747P0550O9978L3818L82r420Q697j728J4836J7737Q064K2103K1205L8644
$$ 103747 174297 244275 278093 278475 269055 277752 276024 290860 308597 316661 338764 359969 398613
13269C98613N1521M0968K0014K8619L0379M9524P2361P3491J07799J26733J80877
$$ 398613 450134 491102 511116 539735 570114 619638 691999 765490 873289 1000022 1180899
13258A180899K26713L07926L68179M64917O21201Q92120J389423K335488L952654
$$ 1180899 1407612 1715538 2083717 2548634 3169835 4061955 5451378 7786866 11739520
13249A1739520O167965P473748M821302j497617o123721o664392n030837l250545
$$ 11739520 17907485 25381233 30202535 28704918 22581197 15916805 10885968 7635423
13241G635423k022097j277195p94214n06506l80993l02999k82133k33919j68682
$$ 7635423 5613326 4336131 3541917 3035411 2654418 2351419 2069286 1835367 1666685
13232A666685j31036q3645o6069n4067k9894J0868J7292N4147O1588O7120Q1232
$$ 1666685 1535649 1452004 1385935 1331868 1301974 1312842 1330134 1384281 1445869 1512989 1594221
13221A594221J05418J21098J36738J82742K33592L13944L90234N04606O57973
$$ 1594221 1699639 1820737 1957475 2140217 2373809 2687753 3077987 3582593 4240566
13212D240566Q66912J121304J359896J785563K568914L964640O561767J1123937
$$ 4240566 5107478 6228782 7588678 9374241 11943155 15907795 22469562 33593499
13204C3593499J7883980K3790809J9441988k00695j8758110k2780349j7633356
$$ 33593499 51477479 75268288 94710276 94509581 75751471 52971122 35337766
13197C5337766j1357603o897652m210944k588155j642778j164021j029376r38521
$$ 35337766 23980163 17082511 12871567 10283412 8640634 7476613 6447237 5508716
13189E508716p76328n92595m48804k98204j59420m8693J07417L00536M11852K44018
$$ 5508716 4732388 4139793 3690989 3392785 3233365 3184672 3292089 3592625 4004477 4248495
13179D248495j93539m34261m12898k82157j08566J9005P4916J27247K31112L13559
$$ 4248495 4054956 3620695 3207797 2925640 2817074 2836079 2910995 3038242 3269354 3582913
13169C582913M41170O09760Q05020J041646J295257J662698K327170L564697N845919
$$ 3582913 4024083 4633843 5438863 6480509 7775766 9438464 11765634 15330331 21176250
13160B1176250R945072J6330901K3063317K1726054M399031j6290274k3241370
$$ 21176250 31121322 47452223 70515540 92241594 96640625 80350351 57108981
13153E7108981j9106022j2559192p643581m634713k837224j788246j242238j040495
$$ 57108981 38002959 25443767 17800186 13165473 10328249 8540003 7297765 6257270
13145F257270r84307q75263o90082n19614l87656k91898k20617j95224j60792
$$ 6257270 5272963 4397700 3707618 3188004 2800348 2508450 2287833 2092609 1931817
13136A931817j37004r9889n7077m6079m8235n0232j5103N565J0249K1691N5184
$$ 1931817 1794813 1694924 1637847 1591768 1543533 1493301 1478198 1483763 1494012 1515703 1570887
13125A570887R3614J35365K01016K59148L31861M28091N46578P39155J129942
$$ 1570887 1664501 1799866 2000882 2260030 2591891 3019982 3566560 4305715 5435657
13116E435657J846864L126399N098147P290914P197912K275361m359044p344995
$$ 5435657 7282521 10408920 15507067 22797981 29995893 32271254 27912210 20567215
13108B0567215o530996m531538k838207j748643j097116p03954m69340l75156
$$ 20567215 14036219 9504681 6666474 4917831 3820715 3116761 2647421 2272265
13100B272265l55333k92031k44736j96518j55277j12633q5054q3505r3623o6600
$$ 2272265 1916932 1624901 1380165 1183647 1028370 915737 830683 747178 653555 586955
13090E86955m5472k7967j2311l7846k8868m2250l5355l8773j0648j3402j6816
$$ 586955 541483 513516 501205 463359 434491 392241 356886 318113 307465 294063 277247
13079B77247j3282n017J0053L1930L0138N850j92j7151Q439k098j9937m0304k0072
$$ 277247 263965 258948 269001 300931 331069 336919 336727 319576 328015 325917 305980 265676 245604
13066B45604j556j3113o382j0701m713j5667k0850k8231l7835o446K0020K0539
$$ 245604 244048 230935 224553 213852 209139 193472 172622 144391 106556 100110 120130 140669
13054A40669J0787J2866J5241l586k732q889j1453j3531j9778j739P466M616J4350
$$ 140669 151456 164322 179563 175977 173245 164356 152903 139372 119594 117855 125321 129937 144287
13041A44287M350k0105j2634q447j4158j1691l9057l0971J5272M4917O9158P6344
$$ 144287 148637 128532 115898 107451 93293 81602 42545 11574 26846 71763 140921 217265
13029B17265L2882M605j0769j9757j8927j9873m926j1286r789k2919p799J868
$$ 217265 250147 254752 243983 224226 205299 185426 180500 169214 159425 136506 128707 130575
13017A30575N244J3920M012Q315K8p451L881j176J1180R170L52M1827Q9474M3338
$$ 130575 135819 149739 153751 162066 162094 154643 158524 157348 168528 177698 178050 219877 309351 352689
13003C52689l733l0753m9827l2059l0578l1975n953j8795k3311J1238J2858J4585
$$ 352689 348956 318203 268376 236317 205739 173764 167811 149016 125705 136943 149801 164386
12991A64386J9498j6285k9665j0301q138j267K8809L9953J9947P4594P2096r106
$$ 164386 183884 167599 137934 127633 119495 118228 147037 186990 206937 281531 353627 344521
12979C44521m2429n7838l5371j8795m543l0295l0857r174j4129j5926p066r11
$$ 344521 302092 244254 208883 190088 185545 155250 124393 115219 101090 85164 78098 77187
12967G7187J3976M361k6247p931k2679L957Q605L241j305J104j6857j9246q194
$$ 77187 91163 95524 69277 61346 38667 42624 51229 54470 53165 54269 37412 18166 9972
12954I972L475J1718m351j0187O285J3042n254P966J7064J9779j3665j4472J1561
$$ 9972 13447 25165 20814 10627 16912 29954 24700 32666 49730 69509 55844 41372 52933
12941E2933J6200O710j04k568Q13N898J0907j2755Q455k25j4995j2793k3597j6678
$$ 52933 69133 75843 75739 73171 73984 79882 90789 78034 86489 86264 71269 58476 34879 18201
12927A8201o524J3391K5831m328P973J3438R329J2489J7511o204k3343J924K7054
$$ 18201 11677 25068 50899 46571 54544 67982 77311 89800 107311 101107 77764 79688 106742
12914A06742R921p468j6996K644m194j9299l295j6714j7643J3576K9181N1520
$$ 106742 116663 109195 92199 94843 90649 71350 68055 51341 33698 47274 76455 127975
12902A27975L2810K1992K2174k2184j6302j9656k4961m9904m1632l1708j1679
$$ 127975 160785 182777 204951 182767 166465 146809 121848 71944 30312 -1396 -13075
12891a3075j0679p265K2770R136k9081j2766n929k9974j3538k3855l5539m0952
$$ -13075 -23754 -31019 -8249 887 -28194 -40960 -46889 -76863 -90401 -114256 -149795 -190747
12879a90747o3694Q664J10810K08448K10779J59752N9298k4532l9928m7255n3371
$$ -190747 -254441 -245777 -134967 73481 284260 444012 503310 478778 438850 391595 338224
12868C38224o4160m3333j1614k722j362K5411L3511j9318l9061p6200j06591q7900
$$ 338224 274064 230731 219117 216395 215033 240444 273955 254637 215576 139376 32785 -55115
12856e5115j4076P0848J76043K59659K43419J00341m925n3396l9255k9909k1605
$$ -55115 -69191 1657 177700 437359 680778 781119 776194 722798 683543 653634 632029
12845F32029k1075o70M965K267L046j1488j9601k4164j6779o426m540k0104r351
$$ 632029 610954 610284 615249 617516 620562 609074 589473 565309 548530 542104 537564 517460 508109
12832E08109M192J2795J7486K69j4984r368m67j2526Q087Q608L6357L2940K2628
$$ 508109 512301 525096 542582 542851 527867 518499 518032 505506 513593 522201 558558 591498 614126
12819F14126J3740L0564L4095K9602N339J5549l006N429K3650L3110M8925L8951
$$ 614126 627866 658430 692525 722127 727466 743015 740009 745438 769088 802198 851123 890074
12807H90074M1611L5596k344J2667P84O568M124K5900L2727O9802L8002M2761
$$ 890074 931685 967281 964937 977604 978388 984956 989080 1014980 1047707 1117509 1155511 1198272
12795A198272N1213O6340M6467L6047M8617N5382M9913O9347R4310R7405J15692
$$ 1198272 1249485 1315825 1362292 1398339 1446956 1502338 1552251 1621598 1715908 1813313 1929005
12784A929005J15945J31743J30912J40836J37537J65144K05947K46762K70605
$$ 1929005 2044950 2176693 2307605 2448441 2585978 2751122 2957069 3203831 3474436
12775C474436K85969K86613L06168L86937M48816N23072O28338P67743R14120
$$ 3474436 3760405 4047018 4353186 4740123 5188939 5712011 6340349 7108092 8022212
12766H022212J119222J457280J803670J948189J999565K199097K991725M340726
$$ 8022212 9141434 10598714 12402384 14350573 16350138 18549235 21540960 25881686
12758B5881686O010320Q371567J2509623J9906116L3268214N5726864Q3518488
$$ 25881686 31892006 40263573 52773196 72679312 105947526 161674390 245192878
12751B45192878Q8577984M5637396k0249918p5183650q4519188o4352688m1224167
$$ 245192878 333770862 379408258 359158340 283974690 199455502 135102814 93878647
12744I3878647k4986733j5102070r018233n206041k989544j588609l39885J064781
$$ 93878647 68891914 53789844 44771611 39565570 36576026 34987417 34647532 35712313
12736C5712313K799507N058565Q457521J3540547K1600321L6415937O2903363
$$ 35712313 38511820 43570385 52027906 65568453 87168774 123584711 186488074
12729A86488074R7373337J00937983K3533390p1007558r8865148p9378808n1647967
$$ 186488074 283861411 384799394 408332784 337325226 238460078 159081270 107433303
12722A07433303l1793168j9907243j2852184q559627n876893m170709k933266
$$ 107433303 75640135 55732892 42880708 34321081 28444188 24273479 21340213
12715B1340213k184006k008259k097846j999151j644433j251702j031648q47197
$$ 21340213 19156207 17147948 15050102 13050951 11406518 10154816 9123168 8275971
12707H275971p11585n60132m99096n12759m85651m27996l44793l10656k86869
$$ 8275971 7564386 7004254 6505158 5992399 5506748 5078752 4733959 4423303 4136434
12698D136434k62390k47038j76907j47268j38471j24813q9008l2986K9729O4182
$$ 4136434 3874044 3627006 3450099 3302831 3164360 3039547 2950539 2917553 2947282 3011464
12688C011464K3197p6534j56552j88860k15415j95101j79166j73320j56326j06193
$$ 3011464 3034661 2958127 2801575 2612715 2397300 2202199 2023033 1849713 1693387 1587194
12678A587194n9349m1696n9138m9299o1993m5963n7035p0844m7900k8953j0342
$$ 1587194 1527845 1486149 1427011 1377712 1315719 1269756 1212721 1141877 1093977 1065024 1054682
12667A054682k6361k6566k4728l6113k7396o9132m9463j2893q796j3619P459Q381
$$ 1054682 1028321 1001755 977027 940914 913518 844386 794923 782030 773234 759615 767074 775455
12655G75455o04k868l3191l4513j422P961k6037j1013R485N559P124K82J8008
$$ 775455 774851 771983 738792 704279 702857 710818 684781 673768 683253 688812 695936 696218 714226
12642G14226M9003R1458J14550J33125J09078Q4996N2277j1248j10210j60667
$$ 714226 763229 854687 969237 1102362 1211440 1296436 1348713 1337465 1227255 1066588
12632A066588j68535j60836j33745j09720o1429m9012M680J05552J71388J47301
$$ 1066588 898053 737217 603472 493752 432323 383311 387991 493543 664931 812232
12622H12232N4773k7092o3520o3681o4514p4693m1281k8445j5290l801j4429l6013
$$ 812232 867005 839913 776393 712712 648198 573505 532224 503779 488489 484688 470259 434246
12610D34246k5731j9691k5351l5588j4599M698L994M3284J65557K42527J21892
$$ 434246 408515 388824 363473 327885 313286 317984 321978 365262 530819 773346 895238
12599H95238j7872q9174o1740l4505p804k9953p165K7536Q5753J35269J64715
$$ 895238 877366 788192 726452 691947 684143 654190 647025 674561 760314 895583 1060298
12588A060298r087j51279j43772j10595p8226p2754m8517m0825l2299j6354k315
$$ 1060298 1051211 899932 756160 645565 567339 494585 446068 405243 372944 356590 354275
12577C54275j2574k9476l2132L084K6546L6947J8098j0012l0552j2908o592j0134
$$ 354275 341701 312225 280093 283177 309723 346670 364768 354756 324204 311296 304704 294570
12565B94570k1495J1753p616j6062J2023O979q172j5487R311P217l898L240J4420
$$ 294570 273075 284828 277212 261150 273173 280152 271980 256493 265804 273021 269123 272363 286783
12552B86783K4729L4473N311j4805j4886j207k0664j1640j2935J0212p906k5025
$$ 286783 311512 345985 351296 336491 321605 320398 299734 288094 275159 285371 277465 252440
12540B52440l0634j0029l010R457J8423J4460Q02n23j525N548J3441L1840L507
$$ 252440 221806 211777 208767 218224 236647 251107 251909 251386 249861 255409 268850 300690 304197
12527C04197P742O872j4645j0776l042j3181j6162J1111P980k3532k0351M465
$$ 304197 311939 318811 304166 293390 290348 277167 261005 272116 280096 256564 236213 240678
12515B40678M973o067l1402j5935M156o649p864m242L164p798Q007L1427q97K6441
$$ 240678 245651 239584 208182 192247 196403 189754 181890 177648 180812 173014 181021 212448 211551 237992
12501B37992J1379r694K0202K4754k385k8732l2544j9571m08l96L964j6213P96
$$ 237992 249371 239677 259879 284633 282248 253516 220972 201401 200993 200597 204561 188348 189144
12488A89144p434r832Q47K9945L2410J3512J9900O329m636l760j5028l353P152
$$ 189144 181710 171878 172725 202670 235080 248592 268492 274821 270185 266425 251397 248044 255196
12475B55196J5495o55j0815l0581k0081l808J163L5244R102J3185J5562L1948
$$ 255196 270691 270036 259221 228640 208559 204751 205914 241158 250260 263445 279007 310955
12463C10955N1927R4018J83607L15085N18765O62032M07055k30330n85756n70040
$$ 310955 362882 456900 640507 955592 1474357 2136389 2543444 2313114 1727358 1157318
12453A157318m15024k37075j32007q5794l7603k8169Q753j1467j2122q101J438
$$ 1157318 742294 505219 373212 287418 249815 221646 230399 218932 206810 198709 200147
12442B00147l578j7716j5570l2826r308Q298Q897N998p099j7044k5778n960Q971
$$ 200147 196569 178853 163283 130457 121149 129447 138344 144342 137243 120199 94421 88461 97432
12429I7432O081q748k0313M118K8540K7918O253J2961k207k956m692K7389k1128
$$ 97432 103513 94765 74452 78570 107110 135028 141281 154242 152035 149079 144387 171776 150648
12416A50648k7136P208K1060m629j9867r831p436j3709k1005j9656l205K5307
$$ 150648 123512 130720 151780 147151 127284 117453 110017 96308 75303 55647 52442 77749
12404G7749K7652O2J5057K2523J1198q388j6868P077m58L278r568K660j2595Q868
$$ 77749 105401 105463 120520 143043 154241 145853 128985 136062 135604 138882 129314 131974 119379 128247
12390A28247J4411N830j5133m9439p607J5112J7292M387P41j6353P3j740J494
$$ 128247 142658 148488 133355 83916 76309 91421 108713 113100 113841 97488 97561 95821 97315
12377I7315m339l966r747q122p39J563k920k4313o941j1198K381Q059k133q717
$$ 97315 92976 89010 79263 71141 70402 71965 69045 44732 37791 26593 28974 37033 34900 26183
12363B6183k2941k6132q924j4414j2937R685J2589L8022P5110Q2309P7834P4163
$$ 26183 3242 -22890 -31814 -46228 -59165 -49480 -36891 1131 76241 158550 236384 310547
12351C10547N6896M596l518k7373l1005k4836j6655j8417r712k878n085J860N478
$$ 310547 367443 372039 368521 341148 310143 285307 268652 250235 240523 237645 232560 234420 239898
12338B39898J0223j1904p507N364R111L323J3275J6851M646K5640O994J8799L3225
$$ 239898 250121 238217 230710 236074 245185 248508 261783 278634 283280 308920 315914 334713 367938
12325C67938L1590O4717R5218J27907J96889K81928L15429K90686J41026m9680
$$ 367938 399528 464245 559463 687370 884259 1166187 1481616 1772302 1913328 1863648
12315A863648j73350k57554k97454k70284j84493r2050o7019o4416j312J6132
$$ 1863648 1690298 1432744 1135290 865006 680513 588463 521444 457028 455716 471848
12305D71848l397K734k542Q291J1093K9963L3788M4419L0543O0539J11717J17293
$$ 471848 468451 471185 468643 476934 488027 517990 551778 596197 626740 687279 798996 916289
12293I16289J88430L39446M56540L21345M1616k72448l69797l21759k16111j31079
$$ 916289 1104719 1444165 1900705 2222050 2263666 1991218 1621421 1299662 1083551 952472
12283I52472o9541m2170n383k2340j932J0791J9605K4575R933M6715R6898J28788
$$ 952472 882931 840761 835378 813038 811106 821897 841502 866077 876010 922725 1019623 1148411
12271A148411J82457L37526M92562N23934K43700j85076l04511k14885o2032Q8672
$$ 1148411 1330868 1668394 2160956 2684890 2928590 2743514 2439003 2224118 2162086 2250758
12261B250758J84787J87216J22848O4193O4998R6515K01315L08098L80319M20180
$$ 2250758 2435545 2622761 2745609 2809802 2874800 2971315 3172630 3480728 3861047 4281227
12251D281227M11217M31538M85929M47296M00601L79920L65831L35158L75461
$$ 4281227 4692444 5123982 5609911 6057207 6457808 6837728 7203559 7538717 7914178
12242G914178N20275P42812J102569J643594K403039L558302N358593Q263704
$$ 7914178 8434453 9177265 10279834 11923428 14326467 17884769 23243362 31507066
12234C1507066J3104087K0434514K9235046L5429969L4039651K3616354O915002
$$ 31507066 44611153 65045667 94280713 129710682 163750333 187366687 194281689
12227A94281689j1729769k7110713l4667794l3276229k6176586j8071610j1791944
$$ 194281689 182551920 155441207 120773413 87497184 61320598 43248988 31457044
12220C1457044p616878n025205l416032k374102j656280j199326q67463o42035
$$ 31457044 23840166 18814961 15398929 13024827 11368547 10169221 9301758 8659723
12212H659723m73040m28612m41208m63557m87135n21486m80438l99683l62599
$$ 8659723 8186683 7758071 7316863 6853306 6366171 5844685 5364247 4964564 4601965
12203D601965l59429l54620l91446l88780l74172l17389k60987j96078j42370
$$ 4601965 4242536 3887916 3496470 3107690 2733518 2416129 2155142 1959064 1816694
12194A816694j24616j13617j02797r6987q4015p7772o1303o0815m9509m5312l3451
$$ 1816694 1692078 1578461 1475664 1378677 1294662 1216890 1155587 1094772 1045263 999951 966500
12183I66500j9475j8852k3586m5164m5986l1733n4080n2502j6012l320m0640m7192
$$ 966500 947025 928173 904587 859423 813437 781704 727624 675122 659110 655790 615150 567958
12171E67958k7543k4681j4684j3007k2008j493o351q865j9322j3884l1648k7388
$$ 567958 540415 515734 501050 488043 466035 464542 458191 449326 430004 416120 384472 357084
12159C57084m965M921O583r155j6689P283N17k4955j2354j657P191k4655k6342
$$ 357084 352119 357040 363623 354468 337779 345062 345579 320624 308270 306613 313804 289149 262807
12146B62807r774j6087k9332K588K1275L436l060r721J3992O875n574j1550R572
$$ 262807 253033 236946 207614 210202 231477 234913 231853 222132 236124 242999 237425 225875 235447
12133B35447p478n396O150q78q768m899q168k0234j3311J4897J1174j8219k0313
$$ 235447 227969 222573 228723 227845 219077 214178 206010 185776 172465 187362 198536 180317 160004
12120A60004J2896j9296l2750M741j289q979k8295N216J0773j3784j3583j1190
$$ 160004 172900 153604 120854 125595 124306 115327 87032 92248 103021 89237 75654 64464
12108F4464j3519Q649R147L2166M2394P8982P2124N5759K4627M873k2956l3173
$$ 64464 50945 59594 68741 100907 143301 222283 294407 350166 374793 379666 356710 323537
12096C23537j6878l3812j2506r556j2582j3684R037J4105j1644k3367l744o470
$$ 323537 306659 272847 260341 250785 238203 224519 233556 247661 236017 212650 208906 202436
12084B02436J4057N737j9391j9624j9119j069k520K179j6239P743Q077Q79J1861
$$ 202436 216493 222230 202839 183215 164096 163027 160507 162686 146447 154190 162267 163146 175007
12071A75007j5097k515J0572l820k2122n418K885L291p75n83j9157r86n292J1704
$$ 175007 159910 157395 167967 164147 142025 136607 139492 142783 142008 141425 122268 121282 115990 127694
12057A27694q916j2013J0643j3852l583J7785j3239M69J9526j169j4164r81N610
$$ 127694 118778 106765 117408 103556 99973 117758 104519 104988 124514 123345 109181 108200 113810
12044A13810P910J6009j4268n173J5611J9516n499k0509k1450j5989Q469Q521
$$ 113810 121720 137729 123461 118288 133899 153415 147916 127407 105957 89968 98437 106958
12032A06958K6922K718O279K2116k299q75p558j9714j2757j4625j4447J3856J1667
$$ 106958 133880 136598 142877 164993 162694 161819 154261 134547 121790 107165 92718 106574 118241
12019A18241p177k896j146O889k527k3533R4M309J4374R520j0226R203l185P314
$$ 118241 111064 108168 107022 113911 111384 87851 87945 92254 106628 116148 105922 115125 111940 119254
12005A19254J3868j2562J760K441l0466k7094k871K2574K4808J7923K64k0224
$$ 119254 133122 120560 122320 124761 94295 67201 64330 86904 111712 129635 129899 109675
11993A09675r010l600m835p586m558K7572o13J149p786j5404o082j1370j671J111
$$ 109675 100665 97065 92230 84644 80086 107658 107045 108194 100408 85004 78922 67552 65881 66992
11979F6992M408J5325J5504m861J3272J6588k3856j9796J2715J998l282j5990
$$ 66992 71400 86725 102229 97368 110640 127228 103372 83576 96291 98289 95007 79017
11967G9017L597J0036M1L7M81o302r437L108o835j7243J1263M526j500j6656r829
$$ 79017 82614 92650 92691 92728 93209 86907 77470 80578 73743 56500 67763 72289 70789 54133 44304
11952D4304Q092P491j6713j6548n494K380K1177J1688J0919J024k708n727J1074
$$ 44304 52396 59887 43174 26626 21132 23512 44689 56377 67296 68320 65612 59885 70959
11939G0959q162j255l175k691K1714j974k8425J341p244k356j819K716K0616J4391
$$ 70959 62797 61542 58367 55676 77390 75416 46991 48332 41088 38732 36913 39629 60245 74636
11925G4636K099Q545r034k5096R549K0518j8549j2929j5069p943J5061J0774m543
$$ 74636 76735 85280 76246 51150 60699 81217 62668 49739 34670 26727 41788 52562 48019
11912D8019o908p184K905Q558J4968J2007Q806l0334j4671r324N455L0505R675
$$ 48019 41111 33927 36832 45390 60358 72365 81171 50837 36166 26842 32297 62802 72477
11899G2477k912p105j5117K333J1454j0224l673K2803o039o339p980k3252o392
$$ 72477 69565 62460 47343 49676 61130 50906 47233 70036 63997 57658 49678 26426 20034
11886B0034J4928J9135O948P18J1310p120j1073k8306r414K0006L856K966Q014
$$ 20034 34962 54097 61045 61763 73073 65953 54880 26574 17160 37166 41022 43988 52002
11873E2002k177J753l794N965k2867O84O959P508k519O264j0437r569K797m864
$$ 52002 49825 51578 47784 53749 30882 31566 38525 46033 43514 49778 39341 29772 32569 27705
11859B7705R27j624O002J6552L045J0721J3302m514L34O939l253j2781j867j354
$$ 27705 28632 27008 33010 49562 52607 63328 76630 72116 72450 79389 76136 63355 61488 60134
11845F0134p566p641O861O261o441j297P244J2826r104k546K4241J6774j3750
$$ 60134 52568 44927 51788 58049 51608 50311 57555 70381 61277 58731 82972 99746 85996
11832H5996j7825P589L645r766M597J7851M0752L1865K5771J1773K2923P6247
$$ 85996 68171 75760 79405 69639 74236 92087 132839 164704 190475 202248 225171 301418
11820C01418J30580J39170J72795J33076P4805r437j02284j44406j50447j57736
$$ 301418 431998 571168 743963 877039 951844 942407 840123 695717 545270 387534
11810C87534r8395o2063n2444k1021j6174k8182n018J47j6375k8696m299K9989
$$ 387534 289139 227076 174632 153611 137437 109255 104237 104384 88009 59313 55014 85003
11798H5003L0543p997k5115k3425J1310m009k7125R30K563k705q856J1815J4501
$$ 85003 115546 107549 82434 59009 70319 66310 39185 40115 42678 39973 31117 42932 57433
11785E7433P597Q213n148J4358r429k1052K484q165j8230l586K2783M58j7754
$$ 57433 65030 73243 68095 82453 73024 51972 54456 46291 28061 24475 47258 47716 29962
11772B9962j915O919J0276J2157l008m708m102k633J5884j4048j6171M509j433
$$ 29962 28047 34966 45242 57399 54391 49683 45581 42948 58832 44784 28613 33122 31689
11759C1689j5616O205L5282P616J0877k2209j7904m408j2442O195J2559R321j2190
$$ 31689 16073 22278 57560 65176 76053 53844 35940 31532 19090 25285 37844 47165 34975
11746C4975j8052o698O751J7111j2767r994q822R663K5707J3454K0361J0983j5531
$$ 34975 16923 10225 16976 34087 21320 11326 2504 12167 37874 51328 71689 82672 67141
11733F7141K854j170n293k2590j988J1294M961J3493J4031m059k2261j1552n143
$$ 67141 69995 68825 63532 40942 38954 50248 55209 68702 82733 78674 56413 44861 39718
11720C9718j95K026j2967r345N41k559j0596J1104J9853P52m296R65K0297K1237
$$ 39718 39523 41549 28582 19237 19778 17219 6623 17727 37580 38332 34036 35001 55298 76535
11706G6535j4522k3046j5248Q999J459j6404q874j234M888J5920j594J362N309
$$ 76535 62013 38967 23719 32718 34177 17773 8899 7665 12553 28473 26879 28241 33550
11693C3550q31j843j0728O183m185j1963m389j613J1741M015j806J2406N612J4620
$$ 33550 32719 30876 20148 26331 22146 10183 5794 4181 15922 19937 18131 30537 36149 50769
11679E0769n008k405l732L244l781J504K1198r633j4079k2143N958N966O768j1370
$$ 50769 45761 43356 39624 42868 39087 40591 61789 52156 38077 15934 21892 27858 34626 23256
11665B3256q143R475m10j1039J4369J252j0308L684K468j2605J6776K4286J1955
$$ 23256 15113 24588 24178 13139 27508 28760 18452 22136 24604 11999 28775 53061 65016
11652F5016j9188j6889K177o699J783l70k187J1792r272J320k487l019j208n569
$$ 65016 45828 28939 31116 24417 26200 25830 23643 35435 26163 27483 24996 21977 20769 15200
11638A5200J7564o96m499O646n250M189J5833l002q691J0495P80l827j3208j1824
$$ 15200 32764 32068 27569 34215 28965 33154 48987 45985 37294 47789 48569 44742 31534 19710
11624A9710j6750J0099k0500j7783M467P654K65P683O576Q066L5231J7420q48
$$ 19710 2960 13059 -7441 -25224 -20757 -13103 -12838 -5155 1421 9487 44718 62138 61290
11611F1290n031j9714k5547J222Q81J9990N65p601J4492P716J620K61j6974j7382
$$ 61290 56259 36545 10998 12220 13101 33091 33656 26055 40547 48263 49883 50144 33170 15788
11597A5788j76k583k145J943J3473M191j6820j6517M111J3995J4854J0120Q719
$$ 15788 15612 13029 10884 12827 26300 30491 13671 -2846 1265 15260 30114 40234 48953
11584D8953j3424m637J1279r737j4286m190j3980k580P991J0776J2379J7619j6760
$$ 48953 35529 30892 42171 32434 18148 13958 -22 -2602 5389 16165 28544 46163 29403
11571B9403j2994j3088p278K333J2401K8420q713M117j6336k412K197j8559r089
$$ 29403 16409 3321 -3957 -1624 10777 39197 30484 34601 18265 15853 18050 -509 -9598
11558i598J6031j4986N55J7919J1075l592j2487L375K1199m040m598j0919P068
$$ -9598 6433 -8553 -7998 9921 20996 17404 4917 8292 29491 25451 20853 9934 17002
11545A7002J4017P203o352p714J4806L431l576P50k327O314j3647j7470k8117
$$ 17002 31019 38222 31870 24156 38962 42393 38817 39567 37240 43554 29907 12437 -15680
11532a5680P780J1026o47N905J7115J6828l098p729J5226j5732l1666l500J2512
$$ -15680 -7900 3126 2479 8384 25499 42327 39229 31500 46726 30994 -672 -4172 8340
11519H340J8790l375Q605O475j5660m644Q858j738K819j6282l527m099J7832N215
$$ 8340 27130 23755 32360 38835 23175 18531 27389 25651 28470 12188 8661 4562 22394 27609
11505B7609k0267R701K1795l5j7405j1450r641J146J6261J8672J0726Q257M567
$$ 27609 7342 17043 38838 38803 21398 9948 307 1453 17714 36386 47112 55369 59936
11492E9936j0085j087R870j5955l2174j1999o052l704j3285J7497R079J2115J0950
$$ 59936 49851 48764 58634 42679 10505 -1494 -7546 -11250 -24535 -7038 2041 14156 25106
11479B5106p227Q072J7028M405p145j7247r48m923n635j1591L741l4P670P542
$$ 25106 17879 25951 42979 47384 40239 22992 22044 17121 11486 -105 3636 3602 11272 18814
11465A8814j5395k032O025L443k187J397p23q372J4064J9349J5575j9708R95K1901
$$ 18814 3419 1387 7412 10855 8668 10065 9342 970 15034 34383 49958 30250 31245 53146
11451E3146j1451m189k403j6182l486J3219l067o969l95p533o703l263J6352R32
$$ 53146 41695 37506 35103 18921 15435 28654 25587 18618 18223 10690 3987 724 17076 18008
11437A8008L513P836m892j0413j0942J0926M790p905N165L273J0594J0432k2808
$$ 18008 21521 29357 24465 14052 3110 14036 18826 10921 16086 19359 29953 40385 17577
11424A7577j6697O318O682j884J175m933M877J1748n483j2383r795l984k156K390
$$ 17577 880 7198 13880 11996 13171 8238 13115 24863 19380 6997 -2798 -6782 -8938 -6548
11410f548Q686J7106j335j7593j530K0848P575m352m522k974M38J5249R190J3231
$$ -6548 2138 19244 17909 316 -1214 19634 27209 22857 18335 15361 15799 31048 40238 53469
11396E3469R086j0975k165l122j6037M348k0642m997K4870M49k2545O55J0457
$$ 53469 62555 51580 49415 46293 30256 34604 13962 8965 33835 34284 11739 12394 22851
11383B2851q942j2116n192Q143K483J0175P097J2757J1442j2749j3163k016j5651
$$ 22851 13909 1793 -3399 4744 7227 17402 24499 37256 48698 35949 22786 20770 5119
11370E119J0456l287j7062l855k418J3051o924r203J1245P564j028J367Q877j182
$$ 5119 15575 12288 -4774 -8629 -11047 2004 -4920 -14123 -2878 4686 3658 5025 13902 12720
11356A2720j1080K397J0199P583q833J2666R226o075L086J2988j4752j7204k717
$$ 12720 1640 4037 14236 21819 12986 25652 34878 28803 31889 44877 30125 12921 10204
11343A0204P074L539m100J2531M376J372K31L517o744P756l873j1337J5058J1245
$$ 10204 17278 20817 16717 29248 33624 34996 35227 38744 32000 39756 35883 24546 39604 50849
11329E0849p333j5488j2206j3450j4328P516L712R796K0959K1783M864P358j5666
$$ 50849 43516 28028 15822 2372 -11956 -4440 -728 9068 30027 51810 56674 64032 48366
11316D8366k3171k2175J3788O718j512k011j6668k676J6813l186q765q795n746
$$ 48366 25195 3020 16808 23526 22014 20003 3335 659 17472 14286 5521 -3274 -9020
11303i020J2762K4100Q313j5634l0537J8505K901N0J1341J6827J640j6903o848
$$ -9020 3742 27842 36155 20521 -10016 8489 11390 11440 22781 39608 41248 24345 17497
11290A7497j3068J0235K6248L158J794p086O100K2410K838j1689J5448N467k2624
$$ 17497 4429 14664 40912 44070 45864 38778 44878 67288 70126 58437 73885 79352 56728
11277E6728l916J3562N244j792j8061j2020K354k812l850N907j0701O442j0649
$$ 56728 52812 66374 71618 69826 51765 39745 42099 39287 35437 41344 30643 37085 26436
11264B6436r627J2161q019j823m64O612m962n5L773k457o340l319q39J4743j6244
$$ 26436 16809 28970 20951 19128 18664 25276 20314 20259 24032 21575 15235 11916 11077 25820 9576
11249I576k4990J066J2130K0073J9L219J2740j3091r739k0768q113k55K0985K392
$$ 9576 -15414 -14348 -2218 17855 17874 21093 33833 20742 11003 -9765 -17878 -18133 2852 5244
11235E244J5343R282P496O67p659k1926j4799M443P778P571M211Q916k5774n440
$$ 5244 20587 29869 37365 38032 30373 8447 -6352 -1909 5869 13440 17651 26567 793 -4647
11221d647Q577Q557O430J1239M183q70P052r19r474q066p182Q216l500r255k066
$$ -4647 3930 12487 18917 30156 34339 33469 40521 39602 30128 22062 14880 23096 19596 10341 8275
11206H275L796j4851K76J1282K32j2393k408J5063J087j2985o752K967K1860J1473
$$ 8275 12071 -2780 -2504 8778 9010 -3383 -5791 9272 10359 -2626 -9378 -6411 15449 26922
11192B6922j461P277l549N678P017p361j5594k549N421k060m490q173L231q727
$$ 26922 25461 32738 29189 34867 41884 34523 18929 16380 21801 19741 15251 7078 10309 1582
11178A582J0396l179j3525J4824N314M061L246J301K380p613m309n799j800L3480
$$ 1582 11978 8799 -4726 10098 15412 19473 22719 24020 26400 18787 14478 8679 6879 40359
11164D0359Q481p441j1840j4964k557p871J0750j1926j9472J1060J2737R738J4611
$$ 40359 48840 41399 29559 14595 12038 4167 14917 2991 -16481 -5421 7316 17054 31665
11151C1665N326j4864j1190j1254m087L262j22J3556M692k508o326J6136J5827
$$ 31665 36991 22127 10937 -317 -4404 -1142 -1264 12292 16984 14476 8150 24286 40113
11138D0113p496q658r288j6626m173J503r930r632o38j2552J1486L2053Q754N119
$$ 40113 32617 23959 14671 -1955 -6128 -4625 -14555 -24187 -24825 -37377 -25891 6162 14916 20035
11124B0035j0367l545K873N975Q185M034K080l697k1p845L463o068L197J020l845
$$ 20035 9668 6123 8996 14971 23156 27190 29270 25573 25552 17707 21170 15102 18299 19319 15474
11109A5474q405K4871M796l0114j1079r217R387Q988J341p94J2444J1574J1432
$$ 15474 7069 31940 36736 6622 -4457 -13674 -4287 4701 6042 5248 17692 29266 40698
11096D0698K323p931n324o087l234J647n533O44M293p268j8248j0195J1239N578
$$ 40698 43021 35090 29766 23679 20445 22092 16559 17203 21496 14228 -4020 -14215 -2976 2602
11082B602J7087J6095J0229k086j1660j1515N349O472q978N32Q261R932J0397
$$ 2602 19689 35784 46013 43927 32267 20752 26101 32573 23595 24127 32388 42320 52717
11069E2717o062j8121P259r997k241k9653j6665J6768J8870L809j3006J5750P451
$$ 52717 46655 28534 35793 25796 23555 -6098 -22763 -5995 12875 16684 3678 19428 26879
11056B6879j3427j656p113J171R879J372k625j4966Q140L088k2148j1826J2643
$$ 26879 13452 11796 4683 5854 15733 17105 14480 -486 7654 10742 -11406 -23232 -10589
11043a0589j736K382J5735J4764K7939L692k7330j9383J082K0089K4001p097q245
$$ -10589 -12325 -9943 5792 20556 48495 52187 24857 5474 6556 26645 50646 43549 35304
11030C5304l459k4200j3476n871R859M213r624j470n398j5252K1574L4139j582
$$ 35304 31845 7645 -5831 -11702 -1843 2370 -7254 -8724 -14122 -29374 -7800 26339 24757
11017B4757l3506p830l336o323R23J738O395R198L672n215q050J2154q6O072R352
$$ 24757 -8749 -16579 -19915 -26238 -25315 -23577 -17182 -7984 -4312 -9527 -17577 -5423 -5509 563 9915
11002I915J2872M279q271j377P162j7311p99o53R706Q741m370k810j87O594l241
$$ 9915 22787 27066 18795 17418 24580 7269 6470 5817 15523 24264 19894 17084 16897 23491 20250
10987B0250n422j6149o528J8568J0330j4117j0424p047q333J3353L6252J1618
$$ 20250 14828 -1321 -7849 10719 21049 6932 -3492 -10539 -18872 -5519 30733 42351
10975D2351j5716K3362m330l740k3339j4445J0019Q4j3562m428k390K3964q206
$$ 42351 26635 49997 45667 41927 18588 4143 14162 14246 684 -3744 -6134 17830 9624
10962I624k2318J3005J9540j2111m925K339k604K0461L709n171n228k3294r426
$$ 9624 -12694 311 19851 7740 2815 5154 2550 23011 26720 21549 16321 -6973 -16399
10949a6399J0531P474O373j620N21l318J498j5351m265l892j057J1368J7320J219
$$ -16399 -5868 1606 7979 6359 6880 3562 5060 -10291 -14556 -18448 -19505 -8137 9183 10402
10935A0402o082k47P214p728J1251O648q615J394l079p196j3602J2927J1615j4302
$$ 10402 4320 4073 11287 3559 14810 21458 12843 14237 11158 3962 -9640 3287 14902 600
10921F00j35k990q425J0748J7883N36k1884Q848L522L935O295K737J2248m307
$$ 600 465 -2525 -10950 -202 17681 18217 -3667 5181 8703 12638 18933 21670 33918 29611
10907B9611O335K022k8612j0622J5057n466K059Q288Q37k887O019K374j5218m43
$$ 29611 35946 37968 9356 -1266 13791 8325 10384 18672 19509 16622 22641 25015 9797 9354
10893I354J1957Q799j0309n60J0682p058j2666j774P971J2643J6896L839j1482
$$ 9354 21311 30110 19801 19241 29923 22865 10199 8425 16396 29039 45935 49774 38292
10880C8292n015j8430r483k481j009r79n811N165J9031j2564m784Q664j32j5217
$$ 38292 33277 14847 5364 2883 1874 895 -4916 249 19280 6716 1932 10596 10464 -4753
10866d753j2533n50k07J8237j3245q651L814J0863n120J030J6139q48R848o423
$$ -4753 -17286 -17836 -18043 194 -13051 -21702 -17888 -7025 -12145 -11115 5024 4176 14024 7601
10852G601R981n336j5107j4013J054Q821J2910L380J0692K1896r928k2626j4983
$$ 7601 17582 12246 -2861 -16874 -15820 -6999 5911 9291 19983 41879 31951 9325 -5658
10839e658J9698J1915j0398M195j851p930r759q801l287L414K0121j9797j2755
$$ -5658 14040 25955 15557 19752 17901 9971 212 -8589 -11876 -8462 11659 -8138 -20893
10826b0893j0407J5457J0410J2124r186L556K3973J0220J8115J910k0298r524
$$ -20893 -31300 -15843 -5433 6691 -2495 1061 25034 35254 53369 55279 34981 25457
10814B5457l551j1197j0075o611J1959p602J0268J5723J599R704r501j3593l694
$$ 25457 21906 10709 634 -5977 5982 -1620 8648 24371 25970 35674 26173 12580 8886
10801H886n47N914p756M136J9104j0246m112J1294J4157j6654j7555N686k079
$$ 8886 8339 14253 6497 10633 29737 19491 15379 26673 40830 24176 6621 12307 10228
10788A0228j1732j7219j186R815K495l88Q407j5113k1809q658K689J1912K0990
$$ 10228 -1504 -18723 -19909 -10094 -7599 -7987 420 -14693 -36502 -45160 -42471 -30559 -9569
10775i569J6381j0423L227J2732O761Q687K107o46j1199j0656k815N041J4352
$$ -9569 6812 -3611 -384 12348 19109 27796 29903 29257 18058 7402 4587 9628 23980
10762B3980J1124j773q401j4789R854r636l819j724k986j0103K679O456n485j6863
$$ 23980 35104 33331 24930 10141 19995 10359 6540 4816 1830 -8273 -5594 862 -4623 -21486
10748b1486J605O423L035J1163J5858j7638k534J3980m169L218J3286N525M618
$$ -21486 -19881 -13458 -10423 740 16598 -1040 -3574 10406 6237 9455 22741 28266 32884
10735C2884r598j8880k344O832J621j1601N300P680r414j0718R13K409K2487K4273
$$ 32884 23286 4406 2062 8894 10515 -1086 4214 11894 2480 -8238 -7325 -4916 17571 41844
10721D1844k9540j5317J1139N756p436Q619J1426m169j0713N276j1656j9544L032
$$ 41844 12304 -3013 8126 13882 6446 15065 26491 22322 11609 16885 5229 -14315 -11283
10708a1283j2144R790N568J3687O118p03r61J0532m744j3838k084M684o532K335
$$ -11283 -23427 -13637 -8069 5618 11736 11033 10072 20604 15860 2022 -62 4622 -1910 425
10694D25K0308L744k7514P003J0888j9027M574O61j6312r695J1917J2185K0876
$$ 425 20733 24477 -3037 3966 14854 -4173 401 1062 -15250 -24945 -13028 -843 20033
10681B0033J4622j587j4020j5310j7359j1490J7192M1387o041j3620p973R366
$$ 20033 34655 33068 19048 3738 -13621 -25111 -7919 33468 27427 13807 5834 15200
10669A5200O131o922j159k4714r491J0106K038k657O183J7565O263k846k859J8342
$$ 15200 21331 14409 13250 -11464 -20955 -10849 -8811 -11468 -5285 12280 18543 15697 12838 31180
10655C1180j8505J045J8803J017J186J2214j4201j0904J311j4592q611R084J638
$$ 31180 12675 13720 32523 33540 34726 46940 32739 21835 23146 8554 -57 9027 10665
10642A0665J956l942k2262N390Q912K323P933J5643M86j5300j8070o210o268J1739
$$ 10665 12621 8679 -13583 -8193 719 3042 10975 26618 27104 11804 -6266 -12476 -18744 -7005
10628g005K9173N131j4235j6958J4592j8822j6985K4115R731l817r146o048o920
$$ -7005 22168 27299 13064 -3894 10698 -8124 -25109 -994 8737 4920 -4226 -10274 -17194
10615a7194N560P855K616J4519K129k8107l395K581O197J6729M039p08n811j7025
$$ -17194 -11634 -3779 -1163 13356 15485 -12622 -16017 -13436 -7239 9490 13529 12821 7010 -10015
10601a0015p749k198J2953P642N041J5229O73J323N477M434j2733O23o754J9423
$$ -10015 -17764 -19962 -7009 633 5674 20903 21576 22899 28376 32810 20077 20700 13946 33369
10587C3369K3147N335j5491q268j3400o460k381L693o395P754O954p192p246m602
$$ 33369 56516 61851 46360 38092 24692 18232 15851 19544 13149 20903 27857 20665 13419 8817
10573H817k5012r584J5766K742o959Q550m624r818J0847M46Q772L9036j7363l740
$$ 8817 -16195 -25779 -10013 -7271 -14230 -5680 -10304 -20122 -9275 -8829 -57 38979 21616 17876
10559A7876j0039q271j1694m836j960o836R744Q328J4282p889k3553K781O334
$$ 17876 7837 -434 -12128 -16964 -18924 -25760 -16016 -7688 6594 -1295 -24848 -22067 -15733
10546a5733P074m207j4493J136R388R754j8492J1998J1720j2271j0057o288q801
$$ -15733 -8659 -12866 -27359 -26223 -16835 -7081 -25573 -13575 -1855 -14126 -24183 -30471 -39272
10533c9272J2426K2001o646j313K9220J4329J5585P673j3458j8960R304J216M727
$$ -39272 -26846 -4845 -11491 -12804 16416 30745 46330 54003 40545 21585 30889 32105 36832
10520C6832O370k0274j0870Q300j4977q294J6270Q140r917j0257J1589j1196j8711
$$ 36832 43202 22928 12058 20358 5381 -2913 13357 21497 11580 1323 12912 1716 -16995
10507a6995k7862P091K0855K1694L1535M644r088j2327q085O042L481L851j9733
$$ -16995 -44857 -37766 -16911 4783 36318 40962 31874 19547 11462 17504 20985 24836 5103
10494E103l1953R121J1726j1047O728r519k876j3255q044J0811J7048K585J5501
$$ 5103 -26850 -17729 -6003 -17050 -10322 -19841 -22717 -35972 -44016 -33205 -16157 -13572 1929
10481A929J8051J3308r607j6191O235j9854k3796L762M202L474N142J7311K6403
$$ 1929 19980 33288 23681 7490 13725 -6129 -29925 -26163 -21961 -18487 -13345 3966 30369
10468C0369P664j3622j2281k1722j881j1155J1449J6419l386r145k154p327p606
$$ 30369 38033 24411 12130 -9592 -11473 -22628 -11179 5240 1854 -7291 -9445 -16772 -24378
10455b4378j878j0808K4734O240k238R001j3447J3650J3321J5473J364l767j4751
$$ -24378 -26256 -37064 -12330 -6090 -8328 673 -12774 876 14197 29670 31034 27267 12516
10442A2516k1259P428J15q53K4166Q408j2853N76n229k6324o035J6513J9679J044
$$ 12516 -8743 -1315 -1200 -2053 22113 30521 17668 18244 13015 -13309 -19344 -2831 16848 17892
10428A7892p345k325o748j5940K925L130Q226j429J763R958R286j37j3210mk1689
$$ 17892 10547 8222 1474 -14466 -11541 -8411 -185 -1614 149 10107 19393 19256 6046 6042 -15647
10413a5647j1716K596J5596M672l482l543J0265P081J3710p360j6242j0100J15
$$ -15647 -27363 -24767 -9171 -4499 -7981 -11524 -1259 5822 19532 12172 -4070 -14170 -14055
10400a4055R724J5721O160k2582j3416p181K3316O220K356M964m456O50n375M962
$$ -14055 -4331 11390 17550 -5032 -18448 -25629 -2313 3907 6263 11227 6771 7421 2046 7008
10386G008J5688J5892j8686k2718k389J4063M026M248m240j0692j639O969q251
$$ 7008 22696 38588 19902 -2816 -5205 8858 12884 17132 12892 2200 561 7530 -721
10373g21n645J509R666J2655j9107j5617J6190r689l137J5381l653R440K780l411
$$ -721 -6366 -4857 4809 17464 -1643 -17260 -1070 -10759 -13896 1485 -2168 7272 10052 6641
10359F641j0207j5041j995R625J9814J1401L775j860l390r134j826j7918j1825
$$ 6641 -3566 -18607 -20602 -10977 8837 20238 24013 22153 18763 9629 7803 -10115 -21940
10346b1940O290j0463M380M698m583K0257P922j190J27N68o589j6307r131J1519
$$ -21940 -15650 -26113 -21733 -17035 -21618 -1361 6561 5371 5498 6066 -523 -16830 -25961 -14442
10332a4442O584K7769J0473J409Q607M280j3686j2882o710k4046k547m940J6275
$$ -14442 -7858 19911 30384 31793 40400 44680 30994 18112 11402 -12644 -15191 -20131 -3856
10319c856K8252m238j6268J3987l110p154P329m55j0083p990J0890J5960L060
$$ -3856 24396 20158 3890 17877 14767 7613 14942 14487 4404 -3586 7304 23264 26324
10306B6324Q758j118j488l3847k0306J2462r740j6475R426J1013k6026j292J8685
$$ 26324 35082 33964 32476 -1371 -21677 -9215 -18955 -35430 -26004 -14991 -41017 -42309 -23624
10293b3624K3432J753J293l43J7530r77N774J135j9953r174K4023K1072j6097
$$ -23624 -192 1561 2854 2511 20041 19064 24838 25973 6020 -3154 20869 41941 25844
10280B5844n243j9084q999J7053N139k2184j4949Q288K6164M1920q469j6522j4517
$$ 25844 20601 1517 -7482 9571 14710 -7474 -22423 -14135 12029 53949 45480 28958 14441
10267A4441K986O703k095P772o441r12j1459J0779J6308J6360o296k0835j7650
$$ 14441 17427 24130 22035 29807 23366 22454 10995 21774 38082 54442 48146 27311 9661
10254I661M057K7043o291j5104R782Q708J227p271m067N368k843L95P673J3429
$$ 9661 13718 40761 34470 19366 29148 37856 39083 31812 27745 33113 30270 30665 38338 51767
10240E1767J8660k4005l7453j1659k6949J378K6658J2357l165k557k58K637N377
$$ 51767 70427 46422 8969 -2690 -29639 -28261 -1603 10754 7589 5032 4774 7411 12788
10227A2788Q238J9540j372k2704k2167K1770J4463k0757j1508j7525n008L300
$$ 12788 21026 40566 39194 16490 -5677 16093 30556 9799 -1709 -19234 -24242 -20942
10215b0942j0094l56M786K6203K5991p548j8596R620P504Q090J482k2507o231
$$ -20942 -31036 -31392 -26606 -403 25588 18040 -556 9064 16568 24658 26140 3633 -2598
10202b598j382J079l0265O479K2292J8844P087j5947m465m555K324l460K358J4859
$$ -2598 -3980 -2901 -33166 -26687 -4395 14449 21536 5589 1124 -3431 -1107 -4567 -2209 12650
10188A2650J98J70J2563J200o10Q513l171Q328L1073m462k6647j8266l825j6600
$$ 12650 12848 13018 25581 26781 26171 34684 31513 39841 70914 66452 39805 21539 17714 1114
10174A114k102J5265j7326r557Q477J2365N843j0858M447J579K188k635J5602
$$ 1114 -988 14277 -3049 -12606 -4129 8236 14079 3221 7668 9247 11435 8800 24402
10161B4402L927j5752N992K1358o081R307R244r73P59L991j3024k7697k0880j2033
$$ 24402 28329 12577 18569 39927 33846 43153 52397 51424 52183 56174 43150 15453 -5427 -17460
10147a7460J6921n601M415N72m165K1731R615J1610j1620k5577N265K3031J2441
$$ -17460 -539 -6140 -1725 -1153 -5318 16413 26028 37638 26018 441 5706 28737 41178
10134D1178k5569m618J5958M99J7828J1007K332j0938K3742N7600O4015L2096
$$ 41178 15609 10991 26949 27448 45276 56283 58615 47677 71419 129019 193034 225130
10122B25130M8628N6092K6295o010j0978m7987o7905p0394m5146j9348q210k6977
$$ 225130 273758 329850 356145 350135 339157 291170 223265 152871 107725 88377 80167 53190
10110E3190r47o448J781m712J4678j8086o255j745j0640q275L95J0679r279N701
$$ 53190 52243 45795 47576 42864 57542 39456 33201 31456 20816 12541 12936 23615 14336 20037
10096B0037N382N281J2238j3861k714Q051K6921j4501k544r734j5488M883R11
$$ 20037 25419 30700 42938 29077 26363 34414 61335 46834 44290 34556 19068 23951 24862
10083B4862m772j8715k401K1202K9708J3749n12j2389j3230J6364L555m713q691
$$ 24862 20090 1375 -1026 20176 49884 63633 63121 50732 37502 53866 57421 52708 44017
10070D4017j2550p990K1K7308K7834J0463j6765j085J9401L9266L317k0777P360
$$ 44017 31467 23477 23498 50806 78640 89103 72338 71253 90654 129920 133237 112460 119820
10057A19820K7983K4816N272K197K8215N8790R1273J21938J16992J99332L59212
$$ 119820 147803 172619 177891 180088 208303 267093 358366 480304 597296 796628 1155840
10046A155840P00675J354373K537096K661659q31057k570349k050756j182005
$$ 1155840 1856515 3210888 5747984 8409643 7578586 5008237 2957481 1775476
10038A775476o35066l48450k03163j16847p8683p0073n7479m8947l3645l7111
$$ 1775476 1140410 791960 588797 471950 393267 323194 265715 216768 183123 146012
10028A46012l0530k8386L178L0374O878l1119k3258j0300J5456m907k1809k9368
$$ 146012 115482 87096 90274 120648 127526 96407 73149 62849 78305 73398 51589 22221
10016B2221J0600N028k2379P251J1845j2127n338L594K99l280l690J0007Q595
$$ 22221 32821 37849 15470 22721 34566 22439 17101 20695 20994 17714 14024 24031 32626
10003C2626K0168K1198q681l657M882q981j8229j2439J941q77j7922k2001K029
$$ 32626 52794 73992 65311 61654 66536 57555 39326 26887 28828 27951 10029 -11972 -9943
9990i943K1243L006j1205M951O968J6474R00q782N05j3430O160n517P845L983
$$ -9943 11300 14306 3101 8052 15020 31494 32394 23612 24117 10687 16847 11330 19175 23158
9976B3158n130m17k2762J265P247j2820O260J6868m092L496j038m267J5337P098
$$ 23158 18028 17611 -5151 -3886 3361 -9459 -3199 13669 9577 13073 12035 7768 23105 30203
9962C0203N710p279j1784j6072P47l414J1274q411K680l839j6710O546J9628N68
$$ 30203 35913 28634 16850 778 1525 -1889 9385 974 3654 -185 -16895 -10349 9279 9847
9948I847J5386J1868P680j2870m426K3269j8972m452m041j1005N295k4875N01
$$ 9847 25233 37101 44781 31911 27485 50754 31782 27330 23289 12284 17579 -7296 -6795
9935f795J0785r85j0581M49m095K744K8813R797j2004m304r011J11r1N443R742
$$ -6795 3990 3005 -7576 -7127 -11222 -8478 20335 30132 18128 13824 4813 4924 4833 10276 20018
9920B0018r903j1538l250M293J1719L618K1047J3361j3445j641q67o089k2905
$$ 20018 10115 -1423 -4673 -380 11339 14957 36004 49365 35920 34279 33412 27323 4418
9907D418k0131P13L051j899J2180P054J6742o60J964M653J0084L746n01j38j4855
$$ 4418 -15713 -15000 -11949 -13848 -1668 5386 22128 21468 23432 28085 38169 41915 41414 41276 26421
9892B6421R496k436k6949l5564P735k956J133q480m563J4620q520K139J7871n580
$$ 26421 35917 33481 6532 -29032 -21297 -24253 -23120 -31600 -36163 -21543 -30063 -27924 -10053 -15633
9878a5633j5795J1038L1497q042L352R768j7125Q402K897p349j411p70q469k18
$$ -15633 -31428 -20390 11107 3065 6417 16185 -940 7462 10359 3010 1599 829 -7640 -7858
9864g858j0708J7735K5618K795j0287r119P89m034j1981n629J6503K5127p57j0747
$$ -7858 -18566 -831 24787 27582 17295 8176 8965 4931 -7050 -12679 3824 28951 28194 17447
9850A7447J127j683j629O760L749l285r959K468K016K839m473j6900l764J4617
$$ 17447 18574 16891 15262 22022 25771 22486 12527 14995 17011 19850 15377 -1523 -5287 9330
9836I330K658J756q175P007J326n78K293j0868m85L230J5530K572k0129o462m136
$$ 9330 11988 13744 5569 12576 13902 13324 15617 4749 4264 7494 23024 25596 5467 -995 -5131
9821e131q062j308O171j0645j0581M312P75J9061P287j0428J237K0603Q304m129
$$ -5131 -13193 -14501 -8330 -18975 -29556 -25244 -24469 -5408 1879 -8549 -7312 13291 21595 17466
9807A7466J3771p049j898J1095J0149O586O758j7542l3932j2562J4162l489J375
$$ 17466 31237 24188 22290 33385 43534 50120 56878 39336 5404 -7158 7004 3515 4890
9794D890L302n657j3335O669j0324j6846K54L0785K5492p213r811j3118K464k371
$$ 4890 8192 2535 -10800 -4131 -14455 -31301 -31047 -262 25230 18017 8206 -4912 -2448 -4819
9780d819l318n610L777o80j4172M418M047J629o401j3299J077J7365K2996j0277
$$ -4819 -8137 -13747 -9970 -10650 -24822 -20404 -16357 -14728 -21129 -34428 -33351 -15986 7010 -3267
9766c267k0961J3365J178q383p820q81M288J561K1421L6903N052o408k3082p899
$$ -3267 -24228 -10863 -9685 -18068 -25888 -26769 -22481 -20920 501 37404 42456 36048 12966 5067
9752E067J4029R481o026m183q070L566J1614j0663J1505j2576j4753J7289O722
$$ 5067 19096 28577 22551 18368 10298 13864 25478 14815 26320 13744 -1009 16280 23002
9739B3002k4259k0027J8614K572J4261n941j207N578J1482m59J8j8758n183P674
$$ 23002 -1257 -21284 -2670 -98 14163 8222 7015 12593 24075 23616 23634 4876 -307 7367
9725G367K09j4094r225J3458O717r56R448j877J0240k423Q958K163k7448j3757
$$ 7367 7576 -6518 -15743 -2285 4432 3476 12924 11047 21287 18864 27822 29985 2537 -11220
9711a1220J914j122k858J0155l910o96J0331J1600N455J551j958n649J67r759
$$ -11220 -9306 -10428 -13286 -3131 -7041 -7737 2594 14194 19649 21200 19242 13593 13760 4001
9697D001P668M184j0408q932p362N214O70j1264N055K0749L257k3397n707l728
$$ 4001 11669 15853 5445 -3487 -10849 -5635 -4965 -16229 -11174 9575 12832 -10565 -16272 -20000
9683b0000J484K0095J6923Kj0102m178Q179n185j2900l825K458J8178K1416r96
$$ -20000 -18516 1579 18502 18504 8402 4224 12403 7218 -5682 -9507 -7049 11129 32545 31549
9669C1549L042Q77n544j0867m410q459R933K3776j16k9122j4887J4174N129R353
$$ 31549 34591 35468 29924 19057 14647 6188 16121 39897 39781 10659 -4228 9946 15075 24428
9655B4428J62j022o078r389r510j2902N328M213O291J6838o477J452N30o216J426
$$ 24428 24590 23568 17490 8101 -1409 -14311 -8983 -4770 1521 18359 11882 13334 13864 7648 9074
9640I074m26n749R391R159p319k9930k6256Q698K3475J2875J744j7905J3202J4547
$$ 9074 8648 2899 12290 21449 14130 -15800 -42056 -33358 -9883 2992 4736 -13169 33 14580
9626A4580l640j4398l144l886J2359J271o283J6817J1907r711r974J0315J3594
$$ 14580 10940 -3458 -6602 -10488 1871 3142 -3141 13676 25583 15872 5898 16213 29807
9613B9807j0711r993j025j301O448k978K699j4171n754J0237M364N944Q566j3514
$$ 29807 19096 9103 8078 6777 13225 10247 12946 -1225 -6979 3258 7622 13566 22132 8618
9599H618j5048M072M432K4449J1453m950K41m303m382j311j3954K644j0403r904
$$ 8618 -6430 -2358 2074 26523 37976 33026 33267 28964 24582 23271 9317 11961 1558 -8346
9585h346l100J1025j4865O93R329r987M00J0615j331L80j8254n810Q035K0639
$$ -8346 -11446 -421 -15286 -14593 -5264 -15251 -14851 -4236 -5567 -5187 -23441 -29251 -21216 -577
9571e77J6332K603J2483K2103Q905j3879l952j2030j4877L121m804N937l342r405
$$ -577 15755 18358 30841 52944 61849 47970 44018 31988 17111 20232 15428 21365 18023 8618
9557H618J0030J4487n005j0178o867j4630j374J7844R116p100o156J3128j1549
$$ 8618 18648 33135 28130 17952 11085 -3545 -4919 12925 22041 14941 8785 21913 10364
9544A0364r960l91K7412Q645n934k624J1314j1530j2762J5473M939q108j3407
$$ 10364 404 13 27425 36070 30136 27512 38826 27296 14534 30007 34946 26838 13431
9531A3431l475M762j0172J0910J1783k546o650j402j168J9594j2257r470M584
$$ 13431 9956 14718 4546 15456 27239 24693 18043 16641 15473 35067 22810 13340 17924
9518A7924Q819L213j3367O548K7564n444j4470l359j6000p959J8279K903j5851
$$ 17924 26743 29956 16589 23137 50701 45257 30787 27428 11428 3469 21748 24651 8800
9505H800o557j910J8598j435j5287j027L366J4882O875L167K3423p260n233k992
$$ 8800 2243 333 18931 17496 2209 1182 4548 19430 26305 29472 52895 45635 40402 37410
9491C7410j5417o455L748r10m097l158j797Q97o83M43n0k148o93J9461N103O370
$$ 37410 21993 15538 19286 18376 14279 11121 9324 10221 9538 9981 9931 7783 7090 26551 31654 38024
9475C8024q8q035R68K7987m437R87k0873j5296l563j437K74N704K253j743m145
$$ 38024 37936 29901 30869 58856 54419 55406 34533 19237 15674 14237 14511 20215 22468 20725 16580
9460A6580l811j3312M372J2789Q396m09Q11J9346p743m076K132j8022n087N242
$$ 16580 12769 -543 3829 16618 25014 24605 25416 44762 37019 32943 35075 17053 11966 17208
9446A7208o295j0486N597r389J6191M857r191J1119n902k678K769M707o62L575
$$ 17208 10913 427 6024 -3365 12826 17683 8492 19611 13709 11031 13800 18507 17845 21420
9432B1420R107l165l286J4369J3880M851r01j134k310j3520n1P033l273j7781
$$ 21420 30527 27362 24076 38445 52325 57176 56275 55141 52831 39311 39260 46293 43020 25239
9418B5239l210K2876L788k8540q586p622j7244j3375J1005J5205K3029K784Q000
$$ 25239 22029 44905 48693 20153 11567 3945 -13299 -26674 -15669 -464 22565 25349 33349
9405C3349P579k0050j3215K722j426J0902R824J0237L934P609n026K958j3041
$$ 33349 40928 20878 7663 10385 8959 19861 29685 39922 43856 51465 46439 49397 36356
9392C6356L839N085j4862j656j2255j5215Q187P388N05N304P994j523k720j788
$$ 36356 40195 45280 30418 28762 16507 1292 9479 16867 17372 22676 30670 29147 26427 24639
9378B4639Q393o59r859J9969j848q89L269j202j0802q532K5630J7432j282k124
$$ 24639 33032 32373 22514 42483 40635 39746 43015 41813 31011 22479 48109 65541 64259 62135
9364F2135R633L511n60j4601j6833K24K191m776J5130K3509j3800o220Q291L899
$$ 62135 71768 75279 74719 60118 43285 43509 45700 40924 56054 79563 65763 59543 67834 71733
9350G1733j1463n866j5887J4654J3282j5674j4380j927j1092J1484Q089j772J7310
$$ 71733 60270 54404 38517 53171 66453 50779 36399 34472 23380 34864 42953 41181 58491
9337E8491J5735K334k2522Q022R046P904j1751K508K106n897L039j2030R17m058
$$ 58491 74226 76560 54038 62060 71106 79010 67259 69767 71873 65976 69015 56985 57902 53844
9323E3844K8763Q140l7992j4621L2309K1901N635M050j1452j1577P418J1809J921
$$ 53844 82607 90747 52755 38134 70443 92344 97979 102029 90577 79000 86418 98227 100148
9310A00148l172J684J0813p680p093j0644l180l671j0203J2466J9530K3893J0045
$$ 100148 96976 98660 109473 101793 94700 84056 80876 77205 67002 79468 98998 122891 132936
9297A32936L452p730j2879J697q790j1268j7311K954o213L041K7651J7848R120
$$ 132936 136388 128658 115779 117476 108686 97418 80107 83061 76848 79889 107540 125388 134508
9284A34508Q078L069n102k7316p587l478J1626J0007J573r563Q507k360r097J0870
$$ 134508 142586 145655 140553 113237 105650 102172 113798 123805 125378 115815 124322 121962 112865 123735
9270A23735J1596L466k113N063r233J863M552J8845J7106J1997P3j1148j5469
$$ 123735 135331 138797 136684 141747 132514 134377 138929 157774 174880 186877 186950 175802 160333
9257A60333k252K077K930j594o612J430Q557L604J468J2302P987R368J3382n356
$$ 160333 158081 160158 163088 161494 154882 156312 164869 168473 169941 182243 190230 199598 212980 207624
9243B07624j5534K1193Q54O075%q049o267k536K5499J4193q134p401J0317N815
$$ 207624 192090 213283 214137 220212 220212 212163 205896 203360 228859 243052 234918 227517 237834 243649
9229B43649j511N188Q482K3477j3258k6489q332J4217n191R089J5271P491m512
$$ 243649 242138 247326 255808 279285 266027 239538 231206 245423 240232 249321 264592 272083 267571
9216B67571j0406j3810K6774K8705M738l647R652J04p733M499K4900K3374J0658
$$ 267571 257165 243355 270129 298834 303572 299925 309577 309681 301948 306447 331347 354721 365379
9203C65379K2133J2136j0862j8003j4904r910k868J9417J1706K3667K1826K0250
$$ 365379 387512 399648 388786 370783 355879 345969 343101 362518 374224 397891 419717 439967
9191D39967K253m437P570J0865j3019R096K3637R069j6376n037N971J8276J6284
$$ 439967 442220 437783 445353 456218 443199 452295 475932 485001 468625 463588 469559 487835 504119
9178E04119J0971l213l699N664L30m347J4290j3071Q260Q361o92K8178M648J3319
$$ 504119 515090 511877 508178 513842 514172 509825 524115 511044 519304 527665 526973 555151 559799 573118
9164E73118m998Q359K0624P033J7450J572J348j7132j0586p019m53l200q518M944
$$ 573118 568120 576479 597103 604136 621586 623158 624506 607374 596788 589769 589316 586116 577598 582542
9150E82542j209J0649N452J6355J9869j4870j0347p99l290o506R717J8403l543
$$ 582542 581333 591982 597434 613789 633658 618788 608441 607642 604352 597846 607563 625966 622423
9137F22423k0784p928n69J746J0966j4949m470l687R89L685m809j8623p719M25
$$ 622423 601639 593711 593142 594888 605854 590905 586435 582748 583737 587422 582613 563990 556271 556696
9123E56696j20j090j2797j6961j5700j1934j150Q364Q470k9383k4967j7215q124
$$ 556696 556576 555486 542689 525728 510028 498094 496944 505308 513778 484395 459428 442213 434089
9110D34089J2797J6407N363j0491j2103j6898j9062k831O386j1407p012l952k104
$$ 434089 446886 463293 468656 458165 446062 429164 410102 407271 413657 402250 395238 391286 389182
9097C89182M217q141j1106M94j776j7982l569r058q535N864k0232j7629J0319
$$ 389182 393399 385258 374152 374646 372870 354888 351319 342261 333726 339590 319358 301729 312048
9084C12048O40N237J939O246P004l006j7876j816p728l0574l745J3669K328j8006
$$ 312048 312688 317925 319864 326110 333114 330108 312232 310416 302688 272114 268369 282038 284366 266360
9070B66360n112P100j6954k0849k8566L324K6291l922m433N442J1222j994q637
$$ 266360 261248 268348 251394 230545 201979 205303 231594 227672 223239 228681 239903 237909 229272
9057B29272q015q776N736l357q460P12J852j0303r405J33J7168K2633R408K4676
$$ 229272 221257 212481 218217 214860 206400 207112 208964 198661 189256 189389 206557 229190 238598 263274
9043B63274L3670O5598J49247J53763N3617p5139j35582j20754q1031m8269l1166
$$ 263274 296944 362542 511789 665552 719169 644030 508448 387694 306663 258394 227228
9032B27228j6247j0884k3221k3251j6771O942M25j4939K3403J3141N682j8101
$$ 227228 210981 200097 176876 153625 136854 143796 144221 129282 152685 165826 171508 153407
9020A53407o301q521k0017j5185p555L031K2189K7691p718J7821O044J037J897
$$ 153407 147106 138585 118568 103383 95828 98859 121048 148739 141021 158842 164886 165923 167820
9007A67820j2887j2266M088L91J0173J2198J1531K6067N2240P9867J32806K45345
$$ 167820 154933 142667 146755 147146 157319 169517 181048 207115 259355 339222 472028 717373
8995G17373L28787J62078j49550k57390k32055j39266j14014n3968m2538l0265
$$ 717373 1046160 1208238 1058688 801298 569243 429977 315963 261995 219457 189192
8985A89192k5289j0137j2389k2117m075k231o194K172m206N254k1351r782K690
$$ 189192 163903 153766 141377 119260 115185 112954 106760 108932 104726 109980 88629 78847 81537
8972H1537j5757J982O770M552m236J1705K2141o500m267j954J4762O170M470q479
$$ 81537 65780 67762 74532 79084 74848 86553 108694 102194 97927 95973 110735 116905 121375 112896
8958A12896j0755J1325O837J5384L1196N4001N5552J09469J48248O9711o3544
$$ 112896 102141 113466 120303 135687 166883 220884 276436 385905 534153 603864 540320
8947E40320j17166j20692r1895o0311j6740n082j3396k3363k6232K2581P178l1256
$$ 540320 423154 302462 210567 150256 133516 128434 115038 91675 65443 88024 95202 63946
8935F3946j2048K487k981n785P746P280J215J805m866L108O335N745L482j5640
$$ 63946 51898 54385 51404 45619 53365 60645 61860 63665 58799 61907 68242 73987 77469 61829
8921F1829j1662k44K7435J3803k374K86k3459m084R277l792N176j598j0190J0557
$$ 61829 50167 49923 77358 91161 88787 89073 65614 61530 70807 67015 72191 70593 60403 70960
8907G0960R544l500j301j356j2515k8937o401J9908R209j7184L744K1184K5770
$$ 70960 80504 77004 75703 74347 61832 32895 26494 46402 55611 38427 42171 63355 89125
8894H9125J2388k162j7158o798M335n514j3270K07O089j2589j725J681K1919L828
$$ 89125 101513 99351 82193 75395 79730 74216 60946 61153 67242 54653 52928 54609 76528 80356
8880H0356j2702k2019l64j1548O289J0815J4095m243n458M575N863p247M807o913
$$ 80356 67654 45635 45271 33723 40012 50827 64922 60679 55221 59796 65659 58412 63219 56306
8866E6306k1291j744R269K1950J5848P119j2409m078k3085k6168p728J2744K3999
$$ 56306 35015 33271 42540 64490 80338 87457 75048 70970 47885 21717 13989 26733 50732
8853E0732J3691L2379J0273K649J1705N907K433l3826m2631m390r30k0920j612
$$ 50732 64423 96802 107075 109724 121429 127336 129769 95943 53312 48922 47992 27072 25460
8840B5460P996J5984K723J364n353q723J586M853j5079j9294k6097r886J1801
$$ 25460 33456 49440 52163 53527 48174 39451 41037 45890 30811 11517 -14580 -24466 -12665
8827a2665J5504J6405R33j1553K969Q313P121j0220j1613j8711l951k551J3735
$$ -12665 2839 19244 20177 8624 11593 19906 27027 16807 5194 -13517 -17468 -20019 -6284
8814f284J8665L827N59K6686K4462J2864M029J776K829o100j3318q289R763N410
$$ -6284 12381 16208 16767 43453 67915 80779 84808 86584 89413 83313 69995 61706 71469 76879
8800G6879k3321r893o709J2366J1591k947l0921k8847j0426m033L004P239K133
$$ 76879 53558 43665 36956 49322 60913 57966 27045 -1802 -12228 -16261 -13257 -6018 -3885
8787c885J4574j2686k2243K871N469P313O464K7704L742o432j1530p926k0497
$$ -3885 10689 -1997 -24240 -21369 -15900 -8587 -2123 25581 29323 22891 11361 3435 -17062
8774a7062k9133m801j2126j1715O847j3122q794L1320Q6886P6510N3052J5958
$$ -17062 -46195 -50996 -63122 -74837 -67990 -81112 -89906 -58586 28300 104810 157862 173820
8762A73820k8395l2439k2477m925q453j3190p920r863J5830R388p563o798j141
$$ 173820 145425 112986 90509 85584 77131 63941 56021 46158 61988 71376 63813 57015 55874
8749E5874l738j619M501M823j5186j8071Q241m647j2314k1461j0280m479J9394
$$ 55874 52136 50517 55018 59841 44655 26584 34825 30178 17864 -3597 -13877 -18356 1038
8736A038J0003p949n420j6696j4965J7121O572j0971j3154J3221k9498j3911k2047
$$ 1038 11041 3092 -2328 -19024 -33989 -16868 -10296 -21267 -34421 -21200 -50698 -64609 -86656
8723h6656j0372M3147J24516J43815R9103L4926k0347m0714j3057j1750k9009
$$ -86656 -97028 -53881 70635 214450 313553 348479 328132 287418 274361 262611 233602
8712B33602j7876j0411j9927k1748R015N970N660L1891L902j4994l1802j9957
$$ 233602 215726 205315 185388 163640 172655 178625 184285 216176 220078 205084 173282 153325
8700A53325p053p077K4760M4284M04j7787j2274n619P570P808M669J5812J3686
$$ 153325 146272 139195 163955 208239 208643 190856 178582 172963 180533 188341 193010 208822 222508
8687B22508j3191P551J3122p772N189R501N693J260M289J3447L8992N0125P3126
$$ 222508 209317 216868 229990 222218 227407 236908 242601 243861 248150 261597 300589 350714 423840
8674D23840O7279M1076K0177K8834r000m579M2753L9292O6160P9796N5411P6355
$$ 423840 491119 532195 552372 581206 572206 567627 610380 649672 715832 795628 851039 927394
8662I27394R6392J21729J16095J24442J54262K00957K41514L28114M56147M76008
$$ 927394 1023786 1145515 1261610 1386052 1540314 1741271 1982785 2310899 2767046 3243054
8652C243054L58746L99574N90489R29659J370009J952433K870051M505847P624143
$$ 3243054 3601800 4001374 4591863 5521522 6891531 8843964 11714015 16219862 23844005
8643B3844005J3468185K3020725L1127986J7590653j3928659k7387734k3221965
$$ 23844005 37312190 60332915 91460901 109051554 95122895 67735161 44513196
8636D4513196j5043817r060319n559396l521091k268851j564940j092226p88126
$$ 44513196 29469379 20409060 14849664 11328573 9059722 7494782 6402556 5614430
8628E614430n73829m04302k92965k37950k83408l06928k62173j65162o7122j4509
$$ 5614430 5040601 4636299 4343334 4105384 3821976 3515048 3252875 3087713 3020591 3006082
8618C006082j1393N8317Q9666J03352J72113K57679L43617M14558N73194P74315
$$ 3006082 2994689 3053006 3142672 3246024 3418137 3675816 4019433 4433991 5007185 5781500
8608E781500Q35624O66920O66480J023773J624072K427024L480841N094665P876321
$$ 5781500 6617124 7284044 7950524 8974297 10598369 13025393 16506234 21600899 29477220
8599B9477220J3217464K3615374M2467982O4521612M6185964k2104749n5808676
$$ 29477220 42694684 66310058 108778040 173299652 219485616 197380867 141572191
8592A41572191m9329484l2219547j9193054j1656148p358356m743660l184797
$$ 141572191 92242707 60023160 40830106 29173958 21815602 17071942 13887145
8585A3887145k283630j667791j208856q91474o14330m41021n75153p25974o72483
$$ 13887145 11603515 9935724 8726868 7835394 7221064 6780043 6204890 5478916 4806433
8576D806433m97436l21543k52275j86949j36567j38019j06520o022M9592Q4677
$$ 4806433 4308997 3987454 3735179 3548230 3411663 3273644 3167124 3161102 3210694 3295371
8566C295371J26318J93776K92908L53929L28152L24094M49542P31057J093005
$$ 3295371 3421689 3615465 3908373 4262302 4590454 4914548 5364090 6095147 7188152
8557G188152J603965K386342L675890N994287J0395945J8172521K7815968K4979052
$$ 7188152 8792117 11178459 14854349 20848636 31244581 49417102 77233070 102212122
8549A02212122k631676k4416908k5119409j7517204j0608751o390720l998855
$$ 102212122 99580446 75163538 50044129 32526925 21918174 15527454 11528599
8542A1528599k584879j739695j218729q99991o64001m95980l30498k24602k80482
$$ 11528599 8943720 7204025 5985296 5085305 4421304 3925324 3594826 3370224 3089742
8533C089742l74478l70501l05213k17974j77343j28792j00120j07042j25498p4360
$$ 3089742 2715264 2344763 2039550 1821576 1644233 1515441 1415321 1308279 1182781 1108421
8523A108421n6401n7606o2983p2408n6212n2974m4505k2951k575N3361L9619j1845
$$ 1108421 1052020 994414 931431 859023 802811 749837 705332 682381 679806 733167 772786 760941
8511G60941l4949o6222l8836j2014m1132m0062j2037K943k7586m944r767l2905
$$ 760941 725992 659770 620934 608920 567788 527726 515689 518632 491046 486102 476335 443430
8499D43430l741M952k1250l2259j3256l2664j7114M433k0641j5734J3891j0787
$$ 443430 439689 444641 423391 391132 377876 345212 328098 332531 311890 296156 310047 299260
8487B99260l1913k2735j1340j7383j8193L0774O966j3167k5208m066n28r874l0276
$$ 299260 267347 244612 233272 215889 197696 228470 235436 222269 197061 192995 192467 182593 152317
8474A52317l2277m04r306J7847O7011J23022J26826J277m4158l8080m1961j6039
$$ 152317 120040 119636 110330 128177 195188 318210 445036 446313 402155 364075 322114 306075
8462C06075Q423m99k0126k2508n257k2078P169L884r279j9568j0005r000K314
$$ 306075 314498 313999 293873 271365 266108 244030 251199 255083 245804 226236 216231 207231 209545
8449B09545j1496M029J0786l188P42j434j2360j2715j0538p912P891P567n405
$$ 209545 198049 202078 212864 209676 210418 208984 196624 183909 173371 165459 173350 180917 175512
8436A75512k260j1696N238J1711j6239p216m754k945j8349j0635J4099K4548O5101
$$ 175512 173252 161556 166794 178505 162266 155050 150296 147351 129002 118367 132466 157014 222115
8423B22115O9970J4645l7919j7394n16r916o162j4482k4585j1580j4964O279P879
$$ 222115 292085 306730 268811 251417 250901 240985 234823 220341 195756 184176 169212 175491 183370
8410A83370j1876l3232j3497N34J7492J7935k72j3188K870N686L848j3623n689
$$ 183370 171494 138262 124765 125299 142791 160726 160454 147266 150136 155822 159670 146047 140358
8397A40358Q429J4153Q009kk5063P793P142j1814J0242J2464K05O700j2009k2077
$$ 140358 148787 162940 170949 170947 145884 153677 160819 149005 159247 171711 171916 178616 166607 144530
8383A44530k3439j0657J2524J0443K495Q135k173j45j80J3267J4055J7287o358
$$ 144530 121091 110434 122958 133401 135896 144031 141858 141713 141533 154800 168855 186142 179784
8370A79784k7160j6619k5789j272N791P131n229k670K723O345o003n922p593k7146
$$ 179784 152624 136005 110216 108944 114735 121866 116637 113967 116690 123035 117032 111110 103517 76371
8356G6371J124M162N395q056p630K516J9626R111j196J4533o207m239J3844Q739
$$ 76371 77495 81657 87052 78996 71366 73882 93508 102619 101423 115956 109749 105510 119354 128093
8342A28093l597j3314j8070j0385N818o908P035J137N440J3330K477j2824j4028
$$ 128093 124496 111182 93112 82727 88545 81637 88672 89809 95249 108579 111056 98232 84204
8329H4204Q22j3782L552R782J1594j3909k3931n834m472J2286J8233J075p558
$$ 84204 85026 71244 74796 84578 96172 82263 58332 52498 48026 60312 78545 79620 72062
8316G2062j9912R035K790p642R747p831l081O968n17p595q641j395K362J5397
$$ 72062 52150 61185 63975 56333 66080 58249 55168 62136 61619 54024 45383 43988 46350 61747
8302F1747J8070n985Q029j5936q929J4327K246k1197q868J7920O096K1488J0895
$$ 61747 79817 73832 81861 65925 56996 71323 73569 52372 43504 61424 67520 89008 99903
8289I9903j7009o414O456R965m233k1816j6132j8734P585L7708J1084j7291j3681
$$ 99903 82894 76480 82936 92901 88668 66852 50720 31986 39571 77279 88363 71072 57391
8276E7391O452r341Q5J0414O091N6n844k950O455m921o605Q337n377j6597O451
$$ 57391 63843 54502 54587 65001 71092 71148 65304 62354 68809 63888 57283 65620 60243 43646 50097
8261E0097n893N727j1412J830r422p969J4420J4539L310m222m959R682k671N500
$$ 50097 44204 49931 38519 40349 30927 22958 37378 51917 55227 51005 46046 55728 53057 58557
8247E8557J8149L260j0459q67J2419K1886M916K6505L5638Q5875J39857J50871
$$ 58557 76706 79966 69507 68640 81059 102945 107861 134366 170004 255879 395736 546607
8235E46607N0058q5085j13752j17959q4770l4794r285j0064k5275o231j6733l5528
$$ 546607 596665 511580 397828 279869 195099 160305 151020 140956 115681 109450 92717 57189
8223E7189n106M423j5575J6630J9846O667l624j5006j6068l3405K7838K0016R653
$$ 57189 52083 56506 40931 57561 77407 84074 80450 65444 49376 15971 43809 63825 73478
8210G3478k0183n389L479O059M907J883j146N669p76J3845k58q620K2708N4432
$$ 73478 53295 47906 51385 57444 62351 64234 63088 68757 67981 81826 81568 72948 95656 150088
8196A50088N5609N2721P8628J30275K38925L36638J83633j69520k94807k47502
$$ 150088 205697 258418 337046 467321 706246 1042884 1226517 1056997 762190 514688
8186E14688j59743r8269m7903o6741m5763j5254k336J3289J0544j9267o285M966
$$ 514688 354945 256676 208773 142032 96269 81015 78679 91968 102512 83245 76960 81926
8174H1926J2418J8198K763q894j6903k1230J374l777q739r667J5369J726o351
$$ 81926 94344 112542 115305 106411 89508 68278 69652 65875 57136 47469 62838 64564 58213
8161E8213l847K0363J6837j4298L243J5649J944r452J023K0028L2248L1376K0479
$$ 58213 54366 74729 91566 77268 80511 96160 98104 88652 89675 109703 141951 173327 193806
8148A93806O6150J12642J47172R1195m9930j27408j25543j01689n1195l4226p352
$$ 193806 259956 372598 519770 610965 561035 433627 308084 206395 155200 120974 113622
8137A13622k9397j1085j8109r306n366N62J4177J5612J1376O147o471j1287q035
$$ 113622 84225 73140 55031 45725 40359 40921 55098 70710 82086 88233 81762 70475 62440
8124F2440K151j0096k5067j9332q60O899J5191J3315k329j5287k935N26J5237
$$ 62440 64591 54495 29428 10096 9236 16135 31326 44641 42312 27025 24090 24616 39853
8111C9853k3861j7724J2387L775N848J3950O777k244m782m407j7217k1240R481
$$ 39853 15992 -1732 10655 14430 20278 34228 41005 38761 33979 29572 12355 -8885 596
8098E96J3896K7409K5214J0770j1537j1349N664j2851J6057N657K110j3976r583
$$ 596 14492 41901 67115 77885 66348 54999 60663 47812 63869 69526 71636 57660 48077
8085D8077j220k4161k68J5111j4959O6J055k1809K964J5316J3281l981J4352K096
$$ 48077 46857 22696 22428 37539 22580 22646 23701 1892 4856 20172 33453 29472 43824 45920
8071D5920q959k0432j3817P909K4615R879k1J2602J028l1351j8511K835q096j667
$$ 45920 36961 16529 2712 10621 35236 45115 45094 57696 58724 27373 8862 11697 3601 1934
8057A934l46K1746O727q481l815j4648O541J4173Q566Q01m635n678J4005j4941
$$ 1934 1588 23334 30061 21580 17765 3117 9658 23831 32397 33198 28563 22885 36890 21949
8043B1949q178J5747m25q767j1347k687j0567q80n068J3310J2165Q265K3621J5288
$$ 21949 13771 29518 29093 20326 8979 6292 -4275 -5155 -10223 3087 15252 23517 47138 62426
8029F2426l384j5957k5947m482R016J2424N759k936J9863j9476j0158o018m421
$$ 62426 59042 43085 17138 12656 21672 34096 39855 36919 56782 37306 27148 21130 16709
8016A6709P194j49j2045P179J7869N323k703J1409J416o507l27k742k83l497O704
$$ 16709 23903 23754 11709 18888 36757 42080 39377 50786 52202 45695 45368 42626 42343 38846 45550
8001D5550P420o833n850j0274J4643K0521N826j0670q561N937m840j4352q989
$$ 45550 52970 46137 40287 30013 44656 65177 71003 60333 51772 57709 52869 38517 29528
7988B9528O185Q383L38k6723J1975J0350o01R665n635r943p351p915r945N457
$$ 29528 35713 44096 44434 17711 29686 40036 39435 49100 43465 33522 26171 18256 8311 13768
7974A3768L330Q415L829O936J9493k0777k3392R574P613j464L799j944m273J7587
$$ 13768 17098 25513 29342 36278 55771 34994 11602 21176 28789 27325 31124 29180 24907 42494
7960D2494J3585r069Q613l014j5537j6207m692R369n905K076J0635L808L390K563
$$ 42494 56079 47010 55623 52609 37072 20865 16173 25542 19637 21713 32348 36156 39546 42109
7946D2109o914N869J1342l699r530m195K4349J8877j2049j4875n116r28R142l397
$$ 42109 35195 41064 52406 48707 39177 34982 59331 78208 66159 51284 46168 45240 54382 50985
7932E0985k4003l816O211Q548m244j013J0435L930j1063k097M167L1184j0956
$$ 50985 26982 23166 29377 37925 33681 32668 43103 47033 35970 33873 38040 69224 58268
7919E8268k8016J1446j787q797J5125K342p446m129m434J286N863k6915j7006
$$ 58268 30252 41698 39911 31114 46239 48581 41135 37006 32572 33858 39721 12806 -4200
7906d200P821J4187J3052J1494P078j911j0695m953J6525J3547n370n349K885
$$ -4200 3621 17808 30860 42354 49432 47521 36826 31873 48398 61945 56575 51226 54111
7893E4111O913j7044l1868L993J402K371J940L020K911N546J2072L690k3983L916
$$ 54111 61024 43980 12112 16105 17507 19878 21818 24838 27749 33295 45367 49057 25074 28990
7879B8990n265j4866M203J5270M742k1944j3971O429r257j0582L856L1711J7018
$$ 28990 23725 8859 13062 28332 33074 11130 -2841 3588 -5669 -16251 -12395 19316 36334
7866C6334r575j4330r569o1J6420j665R049K4619j6163j1177j105j3598J1327
$$ 36334 26759 12429 2860 2799 19219 17554 26603 51222 35059 23882 22777 9179 20506
7853B0506l188O322O54n62K950N024j1218m355o609k492J9104O000p731Q768J1789
$$ 20506 17318 23640 24294 23732 26682 31706 20488 16133 9524 7032 26136 32136 24405 33173 44962
7838D4962R840j4543j8400O742j4433j1462R075J8795Q231q265j8876j230J4714
$$ 44962 54802 40259 21859 28601 14168 2706 11781 30576 38807 30542 11666 10436 25150
7825B5150J5204J5101L116j2193l0526o131O824q711j4378j0280J2556J664k999
$$ 25150 40354 55455 58571 46378 15852 9721 16545 7834 -6544 -16824 -4268 -2604 -5603
7812e603O724n065j0949J8611J0176q317m91N430J4733Q698L798r862j3163P74
$$ -5603 1121 -3944 -14893 3718 13894 5577 5086 10516 25249 33947 37745 27883 14720 15494
7798A5494n560m892j0608K3025K9403K6265j61r080j0735j9577j6251L791M768
$$ 15494 9934 5042 -5566 17459 46862 73127 72966 63886 53151 33574 17323 21114 25882
7785B5882j1049n874J7395j5773j0094Q893K078O955J3680L622p831k5256k5459
$$ 25882 14833 8959 26354 10581 487 9380 11458 18413 32093 35715 27884 2628 -22831
7772b2831l110K5863O298j5156L83L191N183q608N94J8209J0372n65O087j5440
$$ -22831 -25941 -78 6220 -8936 -8553 -5362 -179 -8787 -8193 10016 20388 19823 25910 10470
7758A0470R542J3093p227j0017j8338l639R978K240J4003M355j4260r721r081
$$ 10470 20012 33105 25878 15861 -2477 -6116 3862 6102 20105 24460 10200 479 -8602
7745h602L780J5536K5365R766M905q227k8386Q881J4862q997j4146J807J4581
$$ -8602 -4822 10714 36079 45845 50750 42523 14137 23018 37880 28883 14737 16544 31125
7732C1125k737O28K322n569j83j7351L1998J9268k1632m422o464q844k5486j0497
$$ 31125 28388 29016 31338 25769 25586 8235 40233 59501 37869 33447 26983 18139 -7347 -17844
7718a7844J5784K3201O997L759P207k146k5741j9170J9329j429k3633k857Q533
$$ -17844 -2060 21141 28138 31897 39104 36958 11217 -7953 11376 9947 -13686 -16543 -8010
7705h010J2270J3232j1267j506J808m390J4822O876j4992j429K420n197j0736
$$ -8010 4260 17492 6225 4719 6527 2137 16959 23835 8843 7414 9834 4637 -6099
7692f099q787Q894J0167p897M029K7001R307j5096j0674r969m587j5873q765N104
$$ -6099 -14886 -5992 4175 -3722 307 27308 36615 21519 10845 876 -3711 -19584 -28349 -23245
7678b3245o136N117J0958j5443q699R339J1980K7995N992J9792Q519j2883k1375
$$ -23245 -29381 -24264 -13306 -28749 -37448 -28109 -16129 11866 17858 37650 46169 33286 11911
7665A1911j4632q537o992J094K0041P156r683j4817o641j6697p052p208K3069
$$ 11911 -2721 -11258 -18250 -17156 2885 10041 358 -14459 -21100 -37797 -44849 -52057 -28988
7652b8988L5292K4169J1828r23j8433j0683p760j4245k6071O315J2682J450R464
$$ -28988 6304 30473 42301 41378 22945 12262 4502 -9743 -35814 -29499 -16817 -15367 -5903
7639e903Q725q766l117J1586L34l049o192q384Q604K299L1670L1994j797j6177
$$ -5903 2822 -5944 -9061 2525 2859 -190 -6382 -14766 -6162 -3863 27807 59801 58004 41827
7625D1827q985n136Q958l123J3170m388p242k402k0928o588L828O816l105M710
$$ 41827 32842 27706 36664 33541 46711 42323 35081 32679 11751 5163 8991 15807 12702 17412
7611A7412q80p632j5492o119J7121n97j1753j3003M325K73M222Q243J0679P495
$$ 17412 16532 8900 -6592 -12711 4410 3813 -7940 -20943 -16618 -16345 -12123 -3880 6799 14294
7597A4294O133j3509j0021Q10L829J3365J5199L799j4902l852k557l661J7068
$$ 14294 20427 6918 -3103 -2293 1536 14901 30100 33899 18997 15145 12588 8927 25995
7584B5995O682j7992j376l744K0651J031q183J070K999j0557O973N048O71J054
$$ 25995 32677 14685 13309 9565 30216 31247 23064 24134 27133 16576 23549 28597 29268 30322
7570C0322j1648k3168k356N313J3252J9987K203R540j0364k0766O86l562K2834
$$ 30322 18674 -4494 -6850 -1537 11715 31702 33905 43445 33081 12315 13001 9439 32273
7557C2273L451k6462l025J2186j226l3460M87K0766Q46k006J7307l121j0107Q527
$$ 32273 35724 9262 6237 18423 17197 -16263 -15776 4990 5836 3830 21137 18016 7909 16436
7543A6436Q552J3304j0532J7188p547k503R594N693j3629k5211j2550l527q958
$$ 16436 24988 38292 27760 44948 37401 34898 44492 50185 36556 11345 -1205 -4732 -13690
7530a3690j0933J0544M65o197J2626J7207N716j6356j9572p379j8073P749K6664
$$ -13690 -24623 -14079 -13614 -19811 -7185 10022 15738 -618 -20190 -27569 -45642 -37893 -11229
7517a1229R593M052L023m538K918O142P133J2955j3348L638N179l799j1896k165
$$ -11229 -1636 2416 5439 901 3819 9961 17094 30049 16701 20339 25518 21719 9823 7658
7503G658N612K487K1355K587k7804j412L771M848n568p271j2405O94R158J5627
$$ 7658 13270 15757 37112 39699 11895 10483 14254 19102 13534 6263 -6142 -5448 3710 19337
7489A9337M904P462j1081j8998j5036J3969Q975O150j964o090K3315o74j2789
$$ 19337 24241 31703 20622 1624 -13412 557 9532 15682 13718 7628 30943 30269 17480
7476A7480k862M537n14R566j0270k6594j1395n53l687j1613M042J6249k387l951
$$ 17480 14618 19155 18641 28207 17937 -8657 -20052 -20605 -24292 -35905 -31863 -15614 -18001 -21952
7462b1952L0171M380k8060N565J6745m711N660N435j9028o323O903j5405j02L667
$$ -21952 8219 12599 -15461 -9896 6849 2138 7798 13233 -5795 -12118 -5215 -20620 -20722 -17055
7448a7055o50K1089P014n918N233N54k559j722L648k2530P120L835l299j3056
$$ -17055 -17705 3384 10398 4480 9713 10267 7708 5986 9634 -12896 -5776 -1941 -5240 -18296
7434a8296m965K5707N412p430l670M444K2048K454j2816J1686J894j6858J4193
$$ -18296 -23261 2446 7858 428 -3242 1202 23250 25704 12888 24574 26468 9610 23803
7421B3803l976j8862K078J3908j3573j003J9773r906O174k48R738K425j0171o689
$$ 23803 19827 965 3043 16951 3378 2375 22148 12242 18416 18168 27906 30331 20160 13471
7407A3471m430j6558k894P376K4925J3970r143j56N26m0923j6683O219j163J3903
$$ 13471 9041 -7517 -10411 -3035 21890 35860 26717 26561 27087 -13836 -30519 -24300 -25463 -11560
7393a1560J3917K0436j225j4584j5962j1752K241K1363J8908l775j4965k952j4857
$$ -11560 2357 22793 21568 6984 -8978 -20730 -18489 2874 21782 18007 3042 90 -14767
7380a4767j746J6164J6109J5778l825q664r57j0524Q31M144q665o584K317P894
$$ -14767 -16513 -349 15760 31538 27713 19049 18092 7568 8399 12543 3878 -2706 -389 7505
7366G505r269j7248j7745r959K1145J1186n903r319Q026K3665J4260o275o865
$$ 7505 -1764 -19012 -36757 -46716 -25571 -14385 -20288 -29607 -21581 2084 16344 10069 3204
7353C204M0L399j8298j5719M843M505P67q80O790J9467J5505Q504Q958m81r003
$$ 3204 3244 6643 -11655 -27374 -22531 -18026 -17259 -18139 -11349 8118 23623 32127 41085 40604 31601
7338C1601j4162j0859l28R950k1788l591j1545j5906O746Q405J5561m233O543
$$ 31601 17439 6580 6252 16202 -5586 -9177 -20722 -36628 -29882 -21477 -5916 -10149 -3606
7325c606m110m803j7744K0210K0660k5416K321J112l903n161O682L910J9M458
$$ -3606 -7716 -12519 -30263 -10053 10607 -14809 -12488 -11376 -15279 -20440 -13758 -9848 -9829 -5371
7311e371j8061L672O337J356o989j4920J0809K0922k691j9240k689L021m07q421
$$ -5371 -23432 -19760 -13423 -12067 -19056 -33976 -23167 -2245 -4936 -24176 -26865 -23844 -24251 -32672
7297c2672J3251J9290P759r092j1986q243N398n94Q502L481Q988L0354q91J5j0971
$$ -32672 -19421 -131 7628 -1464 -13450 -21693 -16295 -16889 -8387 -4906 4082 34436 33545 33560 22589
7282B2589j3905m287Q096k0681k2131J3648J0955O323k058j6964K8027R616j0848
$$ 22589 8684 4397 12493 -8188 -30319 -16671 -5716 607 -1451 -18415 9612 19228 8380
7269H380p389j871n479l275l538K584J4212k380R186Q697k7510j3244P282J1186
$$ 8380 991 -880 -6359 -9634 -13172 -10588 3624 1244 10430 19127 -8383 -21627 -14345 -3159
7255c159M772K93J1274J0376J703M82J9285k720j0831q496j2980j2967p094N951
$$ -3159 1613 1906 13180 23556 25259 25741 45026 42306 31475 22979 9999 -2968 -10062 -4111
7241d111k470J5178k572l779k693J718m199J353j7047K008K686n719j3990j167
$$ -4111 -6581 8597 6025 2246 -447 1271 -2928 -1575 -18622 -16614 -13928 -19647 -33637 -34804
7227c4804K5156J6162q269l10J2738J325k8112Q976O081P265m98K710j6446l814
$$ -34804 -9648 6514 -1755 -2065 10673 11998 -16114 -7138 -1057 6208 5710 8420 -8026 -11840
7213a1840K572j4202J7368j192J0459Q199l7M755j821p886j1820p625j012r771
$$ -11840 -9268 -23470 -6102 -7294 3165 11364 11327 16082 14261 6375 -5445 -13070 -14082 -23853
7199b3853M970J6077O690j891l72q5j0708J932J333m070n386j3677R711r157N567
$$ -23853 -18883 -2806 3884 1993 1621 1536 -9172 -7240 -5907 -9977 -15363 -29040 -19329 -28486 -22919
7184b2919J4742J7428N605k622j3198P573n582Q29J8183n994k2638j6462k763
$$ -22919 -8177 9251 14856 12234 -964 6609 1027 1856 20039 14045 -8593 -25055 -27818
7171b7818k146k407Q452J1372k649l111L865k909L148J1952r351O026k486n410
$$ -27818 -29964 -32371 -23919 -12547 -15196 -18307 -14442 -17351 -14203 -2251 -11602 -5576 -8062 -13472
7157a3472O543Q004j7881P935O23J3643K9716m095j0798j4983r238O686j746R073
$$ -13472 -6929 1075 -16806 -8871 -8248 5395 35111 31016 20218 5235 -4003 2683 937 10010
7143A0010L503k295j9991j1111Q523J0367o423R424J8326M07Q106k5130j3930
$$ 10010 13513 11218 -8773 -19884 -11361 -994 -7417 2007 20333 20740 28846 3716 -10214
7130a0214K089j6669m886J5728P741q783J0615K612q71J2224J922k817Q632j006
$$ -10214 -8125 -24794 -29680 -13952 -6211 -14994 -4379 -1767 -2638 9586 11508 8691 17323 16317
7116A6317j583p62m506J274l421n033J0065L176j2905N864M498P621r237k0096
$$ 16317 14734 13972 9466 10740 7319 2286 12351 15527 2622 8486 12984 20605 11368 -8728
7102h728m739K2047n93o779j1495M542J3679R266n414m98J407j3503j089J6076
$$ -8728 -13467 8580 7987 1208 -10287 -5745 7934 17200 11786 11288 12695 -808 -1897 14179
7088A4179m235L98N695m0645k3028K1586J7095j268o456j7419r959L5739J3759
$$ 14179 9944 10342 16037 -24608 -47636 -26050 -8955 -10223 -16679 -34098 -44057 -8318 5441
7075E441j231j8753J1664K6191O993k2549j4823j3709m483n342P288R147n186
$$ 5441 4210 -14543 -2879 23312 30305 7756 -7067 -20776 -25259 -30601 -23313 -14166 -19352
7062a9352m592L459N116P660n467l419M75K258r59Q292n596j1589L25J3500M568
$$ -19352 -23944 -20485 -15369 -7709 -13176 -16595 -16120 -13862 -14821 -6529 -12125 -23714 -23389 -9889 -5321
7047e321L918J1597r289k23J2869q490j2702M461r094k1113K548K1518Q576j738
$$ -5321 -1403 10194 905 682 13551 5061 -7641 -3180 -12274 -33387 -30839 -9321 -745 -2483
7033b483O567J476K287n586n265j1934J6614K4072j0026k054J1169l343o970k3733
$$ -2483 4084 5560 7847 2261 -3004 -14938 1676 25748 15722 13668 24837 21494 14524 -9209
7019i209j5594K1173P600N579Q792o378O115J4794P658r447j3264j4957J9085
$$ -9209 -24803 -3630 3970 9549 18341 11963 18078 32872 40530 31083 17819 2862 21947
7006B1947j9706k497J2972n785k3974l727J2152M894j9243N794M866q384M324
$$ 21947 2241 -256 12716 6931 -17043 -20770 -8618 -3724 -22967 -17173 -12307 -20691 -16367
6993a6367o871J9200n694L159j2845L48J9116N327q684J1420q317J095R597j866
$$ -16367 -23238 -4038 -9732 -6573 -19418 -19070 46 5373 -3311 8109 -208 887 10484 8618
6979H618k6419k2639J2012M93q107N202J1796J2213O250n601k37M021j1453l883
$$ 8618 -17801 -40440 -28428 -27935 -36042 -30840 -19044 -6831 -581 -6182 -6419 -2398 -13851 -17734
6965a7734J1733J622L611j1820q025n825N431J2014P31J5374J1562K243j80L822
$$ -17734 -6001 -4379 -768 -12588 -20613 -26438 -21007 -8993 -8262 7112 18674 20917 20737 24559
6951B4559J4763j2923o662j2474k3524K7108L0252j8017p491k009j2134q039p047
$$ 24559 39322 26399 19737 7263 -16261 10847 41099 23082 15591 13582 1448 -6591 -13638
6938a3638j3362J1040J7268k749M405K3502K172J376N762k0865j339j2542j806
$$ -13638 -27000 -15960 1308 -1441 2964 26466 28638 30014 35776 14911 13572 1030 -776
6925g76r22j5154j38N048p335J5052K6327j0772m120J458q288j9152j1549L42
$$ -776 -1698 -16852 -16990 -11942 -19277 -4225 22102 11330 7210 8668 380 -18772 -30321 -29979
6911b9979J4327R907N244J058M862J0080N932P583l924k3416l127J5735k428j92
$$ -29979 -15652 -5745 -501 557 5419 15499 21431 29014 25090 1674 -1453 14282 11854 11662
6897A1662K8446p605q917j4466k8135n893J5281K5614J579j5005k0387J1043k541
$$ 11662 40108 32503 23586 9120 -19015 -24908 -9627 15987 17566 2561 -17826 -6783 -9324
6884i324l068r953R722Q351l019j8742j1061O610K9430K3858J7105j8129k8650
$$ -9324 -12392 -22345 -12623 -4272 -7291 -26033 -37094 -30484 -1054 22804 39909 21780 -6870
6871f870L046J6631K961R548r793j4137n159O74M015m104j8947J7385J3380k082
$$ -6870 -3824 12807 15768 25316 15523 1386 -3773 -3099 916 -3188 -22135 -4750 8630 6548
6857F548r584j831o482N287K1223J4998N074j6013j6511k7313j6680k052q892
$$ 6548 -3036 -4867 -11349 -6062 15161 30159 35233 19220 2709 -24604 -41284 -43336 -52228
6844e2228J2279K0101K9640P716k4701n803r42J7050p212K958l923R283J1414
$$ -52228 -39949 -19848 9792 17508 -7193 -12996 -13938 3112 -4100 -1142 -5065 4218 15632
6831A5632m307k1493r041n352j3881J9263J7573Q074j1036o007k6519M00J5485
$$ 15632 11325 -10168 -19209 -24561 -38442 -19179 -1606 6468 -4568 -10575 -37094 -36694 -21209
6818b1209K0348R196l03Q241o259m606O904J39l2728j0878Q498Q887j594J8815
$$ -21209 -861 8335 8032 16273 10014 5408 12312 12451 -20277 -31155 -22657 -13770 -15364 3451
6804C451K294j649P406K1239m91k7327j0427N924K093j0628Q701J2760J1929l201
$$ 3451 5745 4096 11502 32741 32250 4923 -5504 420 2513 -8115 586 13346 25275 22074
6790B2074q056o143l413N901l783j9843L896O660p761R165P369l384j5301k6669
$$ 22074 14018 7875 4462 10363 6580 -13263 -9367 -2707 -10468 -1303 6066 2682 -12619 -39288
6776c9288o829K38k25K1762K7917j7480K438J4541p436J1116o39m347j3660J664
$$ -39288 -46117 -45879 -46104 -24342 3575 -13905 -11467 3074 -4362 6754 6115 1768 -11892 -10228
6762a0228J5022J1341j4765L693J0186l381j4270N506M963k620j9006j6153j522
$$ -10228 4794 16135 1370 5063 15249 11868 -2402 3104 8067 5447 -13559 -29712 -31234
6749c1234P302k264J2182N925m499O365j1953p436K8220Q302o566j7972j4414
$$ -31234 -23932 -26196 -14014 -8089 -12588 -6223 -18176 -25612 2608 10910 4344 -13628 -28042
6736b8042l40M517L63k226o56J1634l954O457R835J5852J0624K1l800k448r663
$$ -28042 -28382 -23865 -23502 -25728 -26384 -14750 -18704 -12247 -2412 13440 24064 24085 20285 17837 8174
6721H174j5106j1164j1531K577J3935J9710l173j8949q832n232K635m37J4751
$$ 8174 -6932 -18096 -29627 -27050 -13115 6595 3422 -15527 -24359 -29591 -26956 -27393 -12642
6708a2642n844j1453J7654J0244r181n1R857M512J9823L511r142K525L973k8758
$$ -12642 -18486 -29939 -12285 -2041 -11222 -11273 -1416 3096 22919 26430 17288 19813 23786 -4972
6694d972k471O821k493R54K071r996L851j3628n361j3665j6297n88J6268K6176
$$ -4972 -7443 -622 -3115 -2161 -90 -10086 -6235 -19863 -25224 -38889 -55186 -55774 -39506 -13330
6680a3330J4696j3713r529K1279J799k7973j5961J6674M141o928J9890J6710j8752
$$ -13330 1366 -12347 -21876 -597 1202 -26771 -42732 -26058 -21917 -28845 -8955 7755 -10997
6667a0997K346k314j844j86J4457R56j5349p311J4294N937k686P332n367j5709
$$ -10997 -8651 -10965 -12809 -12995 1462 2418 -12931 -20242 -5948 -11 -2697 4635 -732 -16441
6653a6441j1228L11K740K6060r133l342k496j7348K6363K0901q88k204l93j4270
$$ -16441 -27669 -27358 -24618 1442 -7691 -11033 -13529 -30877 -4514 16387 15499 13295 12902 -1368
6639a368k140m217j044J0610J0235K231k943r207j2852k1480J6782K2442L692
$$ -1368 -3508 -7725 -8769 1841 12076 14307 11364 2157 -10695 -32175 -15393 7049 10741
$$ [...]
##END NTUPLES=NMR SPECTRUM
##END=
