##TITLE=Analysis number 326706
Compound Code sb 00929
Project Code adrs
Chemist Name fudan
##JCAMPDX= 6.0         $$ Bruker NMR JCAMP-DX V2.0
##DATA TYPE= NMR SPECTRUM
##DATA CLASS= NTUPLES
##ORIGIN= Bruker BioSpin GmbH
##OWNER= nmr
$$ XWIN-NMR		Version 3.5
$$ Tue Feb 20 08:38:06 2007 GMT Standard Time (UT+0h)  MAYBRIDGE\nmr@NMR_250MHZ
##.OBSERVE FREQUENCY= 250.131544655141
##.OBSERVE NUCLEUS= ^1H
##.ACQUISITION MODE= SIMULTANEOUS (DQD)
##.ACQUISITION SCHEME= undefined
##.AVERAGES= 16
##.DIGITISER RES= 18
##SPECTROMETER/DATA SYSTEM= dpx250
##.PULSE SEQUENCE= zg30
##.SOLVENT NAME= CDCl3
##.SHIFT REFERENCE= (INTERNAL, CDCl3, 0, 16.522)
##AUDIT TRAIL= $$ (NUMBER, WHEN, WHO, WHERE, WHAT)
$$ ##TITLE= Audit trail, XWIN-NMR		Version 3.5
$$ ##JCAMPDX= 5.01
$$ ##ORIGIN= Bruker BioSpin GmbH
$$ ##OWNER= nmr
$$ C:\u/data/dgb/nmr/ADRS/1230/pdata/1/auditp.txt
$$ ##AUDIT TRAIL=  $$ (NUMBER, WHEN, WHO, WHERE, WHAT)
(   1,<2007-02-20 08:37:42.33 +000>,<MAYBRIDGE\nmr>,<NMR_250MHZ>,
      <created by zg, POWCHK disabled, PULCHK disabled
       configuration hash MD5:
       49 4B E0 1D 92 C2 6B 37 9F E6 65 BC 52 41 86 1D
       data hash MD5: 64K
       B9 8E 61 AE 7D 9C 4B 08 A3 20 E5 9E 4F 5C CE A8>)
(   2,<2007-02-20 08:37:56.02 +000>,<MAYBRIDGE\nmr>,<NMR_250MHZ>,
      <Start of raw data processing
       ef LB = 0.3 FT_mod = 6 PKNL = 1 SI = 32K 
       data hash MD5: 32K
       2B C5 10 9E BD 13 45 FF CA 5C 0F 08 4B E0 FC E9>)
(   3,<2007-02-20 08:37:57.74 +000>,<MAYBRIDGE\nmr>,<NMR_250MHZ>,
      <apk 
       data hash MD5: 32K
       BB A8 A7 B1 77 59 17 15 E4 1C 71 6A C1 7F 85 7F>)
(   4,<2007-02-20 08:37:58.43 +000>,<MAYBRIDGE\nmr>,<NMR_250MHZ>,
      <abs ABSG = 5 
       data hash MD5: 32K
       26 C0 BB 1E 8B A8 42 92 33 9B 4B 7A 1A CB CD 5D>)
$$ ##END=
$$ 
$$ hash MD5
$$ 92 FE 26 84 C2 4B 62 13 B3 85 25 75 97 7B 4C 61
##$RELAX= 
##$RELAX= 
##$RELAX= 
##$RELAX= 
##$RELAX= 
##$RELAX= 
##$RELAX= 
$$ Bruker specific parameters
$$ --------------------------
##$DU= <C:\u>
##$EXPNO= 1230
##$NAME= <ADRS>
##$PROCNO= 1
##$TYPE= <nmr>
##$USER= <dgb>
##$AMP= (0..31)
100 100 100 100 100 100 100 100 100 100 100 100 100 100 100 100 100 100 
100 100 100 100 100 100 100 100 100 100 100 100 100 100 
##$AQSEQ= 0
##$AQ_mod= 3
##$AUNM= <au_zg>
##$AUTOPOS= <21 >
##$BF1= 250.13
##$BF2= 250.13
##$BF3= 250.13
##$BF4= 250.13
##$BF5= 500.13
##$BF6= 500.13
##$BF7= 500.13
##$BF8= 500.13
##$BYTORDA= 1
##$CFDGTYP= 0
##$CFRGTYP= 5
##$CHEMSTR= <none>
##$CNST= (0..31)
1 1 145 1 1 1 1 1 1 1 1 1 1 1 1 1 1 1 1 1 1 1 1 1 1 1 1 1 1 1 1 1 
##$CPDPRG= <>
##$CPDPRG1= <>
##$CPDPRG2= <>
##$CPDPRG3= <>
##$CPDPRG4= <mlev>
##$CPDPRG5= <mlev>
##$CPDPRG6= <mlev>
##$CPDPRG7= <mlev>
##$CPDPRG8= <mlev>
##$CPDPRGB= <>
##$CPDPRGT= <>
##$D= (0..31)
0 1 0 0 0 0 0 0 0 0.06 0 0 0 0 0 0 0.0002 0 0 0 0 0 0 0 0 0 0 0 0 0 0 
0 
##$DATE= 1171960660
##$DBL= (0..7)
120 120 120 120 120 120 120 120 
##$DBP= (0..7)
150 150 150 150 150 150 150 150 
##$DBP07= 0
##$DBPNAM0= <>
##$DBPNAM1= <>
##$DBPNAM2= <>
$$ [...]
##$SUBNAM7= <"">
##$SUBNAM8= <"">
##$SUBNAM9= <"">
##$SW= 20.6930455092707
##$SWIBOX= (0..15)
0 0 3 0 0 0 0 0 0 0 0 0 0 0 0 0 
##$SW_h= 5175.983436853
##$TD= 65536
##$TD0= 1
##$TE= 295.16
##$TE2= 300
##$TE3= 300
##$TEG= 300
##$TL= (0..7)
0 120 120 120 120 120 120 120 
##$TP= (0..7)
150 150 150 150 150 150 150 150 
##$TP07= 0
##$TPNAME0= <>
##$TPNAME1= <>
##$TPNAME2= <>
##$TPNAME3= <>
##$TPNAME4= <>
##$TPNAME5= <>
##$TPNAME6= <>
##$TPNAME7= <>
##$TPOAL= (0..7)
0.5 0.5 0.5 0.5 0.5 0.5 0.5 0.5 
##$TPOFFS= (0..7)
0 0 0 0 0 0 0 0 
##$TUNHIN= 0
##$TUNHOUT= 0
##$TUNXOUT= 0
##$USERA1= <user>
##$USERA2= <user>
##$USERA3= <user>
##$USERA4= <user>
##$USERA5= <user>
##$V9= 5
##$VALIST= <valist>
##$VCLIST= <CCCCCCCCCCCCCCC>
##$VD= 0
##$VDLIST= <DDDDDDDDDDDDDDD>
##$VPLIST= <PPPPPPPPPPPPPPP>
##$VTLIST= <TTTTTTTTTTTTTTT>
##$WBST= 1024
##$WBSW= 4
##$XGAIN= (0..3)
0 0 0 0 
##$XL= 0
##$YL= 0
##$YMAX_a= 412647
##$YMIN_a= -513681
##$ZGOPTNS= <>
##$ZL1= 120
##$ZL2= 120
##$ZL3= 120
##$ZL4= 120
##$ABSF1= 16.522
##$ABSF2= -4.171173
##$ABSG= 5
##$ABSL= 3
##$ALPHA= 0
##$AQORDER= 0
##$ASSFAC= 0
##$ASSFACI= 0
##$ASSFACX= 0
##$ASSWID= 0
##$AUNMP= <proc_1d>
##$AZFE= 0.1
##$AZFW= 0.1
##$BCFW= 0
##$BC_mod= 0
##$BYTORDP= 0
##$COROFFS= 0
##$CY= 12.5
##$DATMOD= 1
##$DC= 0
##$DFILT= <>
##$DTYPP= 0
##$F1P= 14.0000005364418
##$F2P= -0.99999901652339
##$FCOR= 0.5
##$FTSIZE= 32768
##$FT_mod= 6
##$GAMMA= 0
##$GB= 0
##$INTBC= 1
##$INTSCL= 1
##$ISEN= 128
##$LB= 0.3
##$LEV0= 0
##$LPBIN= 0
##$MAXI= 10000
##$MC2= 0
##$MEAN= 0
##$ME_mod= 0
##$MI= 0
##$NCOEF= 0
##$NC_proc= -2
##$NLEV= 6
##$NOISF1= 0
##$NOISF2= 0
##$NSP= 0
##$NTH_PI= 0
##$NZP= 0
##$OFFSET= 16.522
##$PC= 1
##$PHC0= 226.6415
##$PHC1= 4.969968
##$PH_mod= 1
##$PKNL= yes
##$PPARMOD= 0
##$PSCAL= 4
##$PSIGN= 0
##$REVERSE= no
##$SF= 250.13
##$SI= 32768
##$SIGF1= 0
##$SIGF2= 0
##$SINO= 400
##$SIOLD= 32768
##$SREGLST= <1H.CDCl3>
##$SSB= 0
##$STSI= 32768
##$STSR= 0
##$SW_p= 5175.98343685301
##$SYMM= 0
##$S_DEV= 0
##$TDeff= 65536
##$TDoff= 0
##$TI= <Analysis number 999999
Compound Code 99
Book Reference 9
Project Code 9>
##$TILT= no
##$TM1= 0
##$TM2= 0
##$TOPLEV= 0
##$USERP1= <user>
##$USERP2= <user>
##$USERP3= <user>
##$USERP4= <user>
##$USERP5= <user>
##$WDW= 1
##$XDIM= 32768
##$YMAX_p= 451560540
##$YMIN_p= -53870
$$ End of Bruker specific parameters
$$ ---------------------------------
##NTUPLES= NMR SPECTRUM
##VAR_NAME=  FREQUENCY,     SPECTRUM/REAL,   SPECTRUM/IMAG
##SYMBOL=    X,             R,               I
##VAR_TYPE=  INDEPENDENT,   DEPENDENT,       DEPENDENT
##VAR_FORM=  AFFN,          ASDF,            ASDF
##VAR_DIM=   32768,         32768,           32768
##UNITS=     HZ,            ARBITRARY UNITS, ARBITRARY UNITS
##FACTOR=    0.157963299565203, 1,           1
##FIRST=     4132.6476996994, 0,             0
##LAST=      -1043.33573715361, 0,           0
##MIN=       -1043.33573715361, -53870,      0
##MAX=       4132.6476996994, 451560540,     0
$$ Real data points
##PAGE= N=1
##DATA TABLE= (X++(R..R)), XYDATA
$$ [...]
19182D5061K2856l331m131J012j460j6718j273R605J0588M970j1863m793L482
19169E4005L08n564N680K246M12q915O624j1850j4809J8404R898m487r151k347
19155D0454P939R381r521n102O645P354P383J4578J106n12N941M947L317K950
19141I6860q254J3597J2866J5347J0484j3087j0462j1215r162J777p661j7233
19129G3857P475N923j2133j0259j282Q994L482N756O01K676m15N937J250j451
19115I0411P015K028q262k6647j462L430N763n604Q81M289Q822J3529N350M124
19101A03667J1141l86j0385K506p778o385K864J9283Q323q093q212O487O023n371
19087A13684o32J585N586L670m153Q415Q45N392k789j491o01k25J1573P834j205
$$ y = [45061, 67917, 64586, 60455, 61467, 60007, 43289, 42016, 51621, 62209, 67179, 55316, 50523, 54005, 54313, 48749, 54429, 56675, 57087, 48172, 54796, 42946, 28137, 46541, 56439, 51952, 42801, 40454, 48393, 57774, 48253, 43151, 49796, 57150, 64533, 79111, 80217, 79705, 85646, 90593, 93910, 96860, 88606, 102203, 115069, 130416, 140900, 127813, 117351, 106136, 96974, 98751, 91090, 73857, 81332, 87255, 75122, 64863, 63581, 72575, 76057, 81813, 82414, 85090, 84675, 90612, 91862, 90411, 97426, 99454, 91192, 64545, 63083, 66513, 72276, 66672, 67553, 71842, 80664, 94193, 99543, 103667, 114808, 114422, 104037, 106543, 98765, 92380, 95244, 114527, 122850, 114757, 106545, 113032, 119055, 113684, 113052, 114637, 120223, 123893, 119740, 128155, 129000, 134392, 131603, 130112, 129511, 129286, 140859, 148693, 147488]
19072A47488L144M324M284q925j6120L890J5828J2447L455j487k995n059J7302
19059A77576L115n24l359R928j658N761K930K054L245K173M115K3360J7711L3499
19045B79926N3418M3502J9845K046q852R907K4191K7588J7912L3388M5432O952
19033E55255l0772J896L2212P6278R9676J06008Q9432Q9449J64845L10471M71278
19022A966028O29430R86792J620612J793747m5085j369360j059493m06768J61183
19013D277086O25646J156776J811049P75576j611564j891773j226908p46168m65904
19004B703816l32306k71116k30326j73039j14233p7638m6727l6428j2090L2845
18994A442758Q0749J47768K46389L53006N42418Q01037J266811J765176J040244
$$ y = [147488, 150632, 154956, 159240, 150315, 134195, 138085, 153913, 166360, 169815, 168328, 165333, 160274, 177576, 180691, 180167, 176808, 186736, 185078, 190839, 193769, 195823, 199068, 201241, 205356, 228716, 246427, 279926, 333344, 376846, 396691, 398737, 389885, 399792, 423983, 451571, 469483, 502871, 548303, 555255, 524483, 526379, 558591, 634869, 734545, 840553, 929985, 1019434, 1184279, 1494750, 1966028, 2595458, 3582250, 5202862, 6996609, 6951524, 5582164, 4522671, 4115903, 4277086, 4902732, 6059508, 7870557, 8646133, 7034569, 5142796, 3915888, 3169720, 2703816, 2371510, 2100394, 1870068, 1697029, 1582796, 1505158, 1458431, 1422003, 1409913, 1442758, 1523507, 1671275, 1917664, 2270670, 2813088, 3614125, 4880936, 6646112, 7686356]
18985G686356q82491j368579q36001k98427R4733L96484L78473l05182o20615
18976D244751m09254j66737L0382K80903N81602R50941J472634K252569L452776
18967A2690567M020941J619866n61967P71123L810965N852004K557715j519642
18959B9241572n134422o125311m296509k632677j781324j358176j127115r14909
18951E871129o75003n19618n15074m52228l20242k64381j97852j20861n2936L8155
18941B791089O4133L9008Q8612J80869K49208L59993N60721Q51234J332184K068080
18931H585131L174728M810110P424293J0273329N798357n472187q049792n018051
18923B1525918k036555K37508K080419M160281P056563O501291l193067q680428
$$ y = [7686356, 6803865, 5435286, 4599285, 4300858, 4395591, 4792075, 5170548, 4865366, 4244751, 3835497, 3668760, 3699142, 3980045, 4561647, 5512588, 6985222, 9237791, 12690567, 16711508, 18331374, 17769407, 18540530, 22351495, 28203499, 30761214, 29241572, 24107150, 17981839, 13685330, 11052653, 9271329, 7913153, 6786038, 5871129, 5196126, 4676508, 4161434, 3709206, 3388964, 3124583, 2926731, 2805870, 2752934, 2791089, 2855222, 2894230, 2982842, 3163711, 3412919, 3772912, 4333633, 5184867, 6517051, 8585131, 11759859, 16569969, 23994262, 34267591, 40065948, 34593761, 26543969, 21525918, 19489363, 19726871, 21807290, 25967571, 33024134, 39525425, 36332358, 27651930]
18915B7651930o686758l973379k326302j472951j207918j367737j242462q72115
18907H502308n94906m34413k66136N6097K81012J46661J07904N19144J091574
18898I409245J828099K897369M552905O533431N255233J351993K599956P544535
18890D1972766J3441753J2584346p36736o433142j112318O835860J1461830L927152
18882H1941511m366304j0175143j5280730j2701353q274655n506120m031408l231786
18874A8374012k670012k154421j645919j146868q77894r96957r91550q51402o72782
18865F366207n18087l97932l39282k76451j38950Q790J82814L95546O36899R28326
18855F847880J485422K401524L896553O201701N492627j828930m195954j606178
$$ y = [27651930, 20965172, 16991793, 14665491, 13192540, 11984622, 10616885, 9374423, 8502308, 7907402, 7472989, 7206853, 7262950, 7543962, 7690623, 7798527, 8317671, 9409245, 11237344, 14134713, 18687618, 25221049, 30476282, 31828275, 34428231, 41972766, 55414519, 67998865, 67262129, 60828987, 59716669, 66552529, 78014359, 81941511, 77575207, 67400064, 52119334, 39417981, 31143326, 25637206, 21605798, 18374012, 15704000, 13549579, 11903660, 10756792, 9878898, 8881941, 7890391, 7038989, 6366207, 5848120, 5450188, 5110906, 4834455, 4695505, 4704295, 4887109, 5282655, 5919554, 6847880, 8333302, 10734826, 14631379, 20833080, 26325707, 24496777, 20300823, 18694645]
18847A8694645J434831L143302L25753j950476j521621j79978K259556N246590
18839B7452602O308639j48138n962539n176938k355556J95287J568405R59870
18831B2841632J594609J597262j955528k293032L36358J128629k586067m640219
18823A6023644l652145k409840j607612j167650r98188q51925p00064n73990m68107
18814C594123l93000k90551k29308j90641j55482j41104j39286j04213m8277j3963
18804A888298J1673M9960J63645L04159M75320P22722J143548J855571K992318
18795I607214L106785q61243l124079k285928j237461o31454l26324j45604Q7928
18786D189834M45371Q90871J589509K585858J920811j589449k767142j924377
$$ y = [18694645, 20129476, 23272778, 23598531, 21648055, 20126434, 19946456, 22206012, 27452602, 33761241, 33613103, 27650564, 22473626, 20118070, 20313357, 21881762, 22841632, 24436241, 26033503, 24077975, 21784943, 22121301, 23249930, 20663863, 16023644, 12371499, 9961659, 8354047, 7186397, 6188209, 5336284, 4636220, 4062230, 3594123, 3201123, 2910572, 2681264, 2490623, 2335141, 2194037, 2054751, 1950538, 1902261, 1888298, 1899971, 1949931, 2113576, 2417735, 2893055, 3615777, 4759325, 6614896, 9607214, 12713999, 11852756, 8728677, 6442749, 5205288, 4573834, 4247510, 4101906, 4189834, 4635205, 5526076, 7115585, 9701443, 11622254, 10032805, 7265663, 5341286]
18778E341286j167295p35975n28432m60008l67890k63699k11481j95669j73367
18769A237470j24347o0708l2216o6587j04395j11078p8211n3302l7552k8855k0815
18758E19404J7554O268J7201L5950L5552l2096q3657r7310o2912m2574k2991r072
18746B81317l426k683K73K711r308r839n627j652L149j1104k0272p698k0714k0101
18732A75026j8308k0135k917l739p817L102p17p446J5334Q798K105M818K3634
18719A71738J7835K5625K8143k2909k3300j8958p816J0423K8914J9075n494k6921
18707A96355j5092M103n912j0566K1010J6105K0340k158j6302k3452j7068j8170
18695A49193q896n442n351Q758J995q638L659k764o527l190k1497j3544l140L245
$$ y = [5341286, 4173991, 3438016, 2909584, 2449576, 2081686, 1817987, 1606506, 1410837, 1237470, 1113123, 1052415, 1020199, 953612, 849217, 738139, 659928, 606626, 569074, 540219, 519404, 536958, 543226, 560427, 596377, 631929, 599833, 516176, 418866, 355954, 313380, 290389, 281317, 277891, 275208, 275481, 278192, 268884, 259045, 253418, 251766, 254915, 243811, 223539, 215841, 195127, 175026, 156718, 136583, 133666, 129927, 122110, 125212, 124495, 117049, 132383, 141181, 143286, 148104, 171738, 189573, 215198, 243341, 220432, 197132, 178174, 170358, 180781, 209695, 228770, 223276, 196355, 181263, 185366, 179454, 168888, 189898, 206003, 226343, 224185, 207883, 184431, 167363, 149193, 140297, 134855, 129504, 138262, 140257, 131619, 135278, 132514, 125987, 122797, 101300, 87756, 84616, 87861]
18681H7861J1135J1343k122j0115j2349P739P105Q667P70K495J0717r95n184J0085
18667A27152n274j1258j351q850k2049j2535L857R494M654L488l608J0001J7531
18654A11252N481Q034R89r546k9298k5679j906J5495J1058O043j2823l548J1138
18641H6690J2286J8274j2676k1043j0782M775L223J0041K0103J576j8010k528
18629I1929j2317p088k265M862J1012R504m541r263m842j059Q824R44m262j2825
18615F8613M273O730P115p592j0392R534J7132J2352M003J3515J6682p794k3242
18602A10929k801j0415r883j175L980O10J0181J9115J6712J0993K762j6093j8090
18589A16825l682o579m796J5675J8728J2295O913J9056q42p202k2111k2788j5877
$$ y = [87861, 98996, 110339, 108217, 98102, 85753, 93492, 100597, 109264, 110034, 112529, 123246, 122251, 117067, 127152, 121878, 110620, 109269, 100419, 78370, 65835, 69692, 79186, 83840, 87328, 83720, 93721, 111252, 116733, 124767, 125756, 116210, 86912, 61233, 59327, 74822, 85880, 91923, 79100, 75552, 86690, 98976, 117250, 104574, 83531, 72749, 77524, 80747, 90788, 110891, 112467, 94457, 91929, 79612, 72524, 70259, 75121, 86133, 95637, 91096, 81833, 76991, 75932, 84756, 85700, 81438, 68613, 72886, 79616, 86731, 79139, 68747, 78281, 95413, 107765, 111768, 125283, 141965, 134171, 110929, 108128, 97713, 87830, 86655, 90635, 91245, 101426, 120541, 137253, 148246, 151008, 134915, 116825, 113143, 106564, 101768, 117443, 136171, 148466, 155379, 174435, 173593, 166391, 144280, 121492, 105615]
18576A05615j7052j7111j5684j5280n900K728J6962K9363J5136K9619M8715M8721
18564B25832L338m3399m7287j5585j8959k305o252j1648j3949m268n669o920K052
18551E4981J717Q649J9996L0541L3270K871k4571k1026k6788P48J2879P865K0091
18538A21223K9562o170k1200R81p243p922r216k368l705p011J1533J0255o937
18525A01782K781Q23o493k2542j8335k841O027q471j4585k4973k542J3262K359
18512B6252l814R29j1130P979R417R254j55N681l904r501p48j994M290j0974l393
18497A8189m63O858J5804K1249P850M216l179p164j9471J4678J6807J0590K2122
18484A08086K0898K9563J3441l446j7133k3592j8136Q985K4221J0990N148n550
$$ y = [105615, 88563, 71452, 55768, 40488, 34588, 37316, 54278, 83641, 98777, 128396, 177111, 225832, 229170, 185771, 138484, 122899, 103940, 101635, 95383, 83735, 69786, 65518, 59849, 52929, 54981, 56698, 65347, 85343, 115884, 149154, 152025, 127454, 106428, 79640, 80388, 93267, 101132, 121223, 150785, 144615, 123415, 124396, 117153, 109231, 100015, 97647, 93942, 86931, 98464, 108719, 101782, 104563, 105386, 98893, 76351, 58016, 55175, 61202, 52731, 38146, 13173, 10631, 23893, 26252, 22438, 23367, 12237, 20216, 29633, 38887, 38732, 44413, 40509, 31008, 30260, 28266, 32556, 21582, 18189, 17726, 24584, 40388, 61637, 69487, 73703, 70524, 63360, 43889, 58567, 75374, 85964, 108086, 128984, 158547, 171988, 168542, 151409, 127817, 109681, 118666, 142887, 153877, 159025, 153475]
18472A53475l3586k4066j7897p746K85K110j3375q991M214J0098j2227r579j0615
18459C2100L349J4935o120P47O519J0337Q611M293J3311K5514K337k4655p541
18446H3737o866j2832N533J6692K5977K4499K1575J5205J8651N0822L8575q384
18434B73184j391J5676J0500n278m8771k8932K1542L4059M0132n218k1672j5824
18422B68007k3799l8716k7228j7784j6588r145J0098J3473L0420K4985P368l864
18410B17227J5117J4897K4450J7810K6850O8079R4398m654j5921K8650Q4499J56539
18398G27941P0388n5715q9084p6075n9004q620L3886R3038J94131J78437R65r9960
18386I10328p5032j11353j48696j17872p5463m8543l7547j2921j5001l4047j0947
$$ y = [153475, 119889, 95823, 77926, 70180, 70465, 72575, 59200, 50209, 54423, 64521, 52294, 42715, 32100, 35449, 50384, 44264, 45011, 51530, 61867, 70478, 74771, 88082, 113596, 115933, 91278, 83737, 76871, 64039, 69572, 86264, 112241, 136740, 158315, 173520, 192171, 242993, 281568, 273184, 271793, 287469, 297969, 292691, 243920, 214988, 236530, 270589, 310721, 305503, 283831, 268007, 244208, 205492, 178264, 160480, 143892, 134747, 144845, 158318, 188738, 213723, 221091, 217227, 232344, 247241, 271691, 289501, 316351, 384430, 478828, 474174, 458253, 486903, 571402, 727941, 798329, 742614, 653530, 577455, 518451, 509831, 543717, 636755, 830886, 1009323, 1010288, 910328, 835296, 723943, 575247, 457375, 381912, 333369, 295822, 282901, 267900, 233853, 222906]
18375B22906j5146k1069p751R94j0100J4111L2524M3653Q489J8327K8678O838
18363C22454J1620J9244J0632J7673O3307J15590R2441l7246j03545q2274n1819
18352C78077k4448j8395j2871Q203L4563N3631J1840p4581r1550n3707l3076k3015
18340A54671j8589p727J555J469j8627p386q246j6471j437J2016l879l141r966
18327G4242j1933k52Q85K0694L2644K4219L1804O654K0937M6363K1109j7165j4088
18314B36113j0943K3983L6583J9476L225O829M5126J7366l6859n8348m1498j6016
18302B25037L197j424q167k2926l0309l302J3732p260m3512l9998k6451J494J578
18289F1689o31J2095Q69r403j4622k4209n710K560J3755R28J2678l141j1196j415
$$ y = [222906, 207760, 186691, 178940, 179934, 169834, 183945, 216469, 260122, 268611, 286938, 315616, 322454, 334074, 353318, 363950, 381623, 444930, 560520, 652961, 615715, 512170, 429896, 378077, 353629, 335234, 322363, 330566, 365129, 418760, 430600, 356019, 264469, 210762, 177686, 154671, 136082, 128355, 129910, 131379, 112752, 105366, 97120, 80649, 79212, 91228, 87349, 84208, 74242, 62309, 62057, 62942, 83636, 116280, 140499, 172303, 178957, 199894, 246257, 267366, 250201, 236113, 225170, 249153, 285736, 305212, 308437, 315266, 360392, 377758, 340899, 282551, 241053, 225037, 228234, 226810, 218643, 195717, 165408, 162106, 175838, 168578, 125066, 85068, 58617, 60111, 61689, 61058, 73153, 74022, 64619, 49997, 25788, 20078, 22638, 36393, 37321, 49999, 46858, 35662, 34247]
18275C4247o466m173N303M012J3480J6541J2568J2350K0721J4361o155k3365p873
18262H5551j1860k801L418J4306J548r723N315N088j8057N67J2295n377j4576
18249F5694j4407j6539o963J6277J0548r420J4084L8358M7574O7585P2442K731
18237B87964n5279m5254k3098k6685k6671j8139M608J281L492J8850K5961O1780
18225B08810N4158O657n8718n0450l6747l6388j4903m054K929j735j2745m316
18213E2498k299p31l452L564r09N8J5949J6792O0j0345p02J0484K7902L1740K4778
18198A65387J6889k2445k8084j6338J0284M7946L9143N0335L8770l6066n6112
18187B09709l1007j2449O041K9301L688k7837k5333J667J9350N4997L8515m4521
$$ y = [34247, 27781, 23608, 28911, 32923, 46403, 62944, 75512, 87862, 108583, 122944, 116789, 93424, 85551, 73691, 70890, 74308, 88614, 90162, 80439, 85754, 90842, 72785, 73352, 85647, 80270, 65694, 51287, 34748, 27785, 44062, 54610, 45190, 59274, 97632, 145206, 212791, 285233, 287964, 232685, 187431, 164333, 137648, 110977, 92838, 97446, 98727, 102219, 121069, 147030, 208810, 262968, 269625, 210907, 160457, 123710, 87322, 72419, 68365, 71294, 69559, 56814, 52498, 50199, 49468, 46016, 49580, 48671, 48729, 64678, 81470, 81530, 71185, 70483, 80967, 108869, 140609, 165387, 182276, 159831, 131747, 115409, 125693, 173639, 212782, 263117, 301887, 265821, 209709, 178702, 166253, 172294, 201595, 205283, 177446, 152113, 153780, 173130, 228127, 266642, 222121]
18175B22121n5817k1097j7430j9127j9380m638j1116j0648p933K961K454o040
18163E4310L082j020r366N987N678j5565j6508J7742R981j7938J8635L3506J7037
18150A05561J6558L4651K9073k7045l6217j3956m993J159Q808J5976P760O303
18138A43638J7315K4929L8032L4862j9088k5457M950J2146l053Q291J4204R002
18126B59771K3342L9034J5898K4870N1610O4596R1605J32881J63018K16873L04361
18115A387859M27859O96406J161637J881616K941967M909316Q495501O832146
18107B8734307n345604q126656m896767k554812j408843j005123r74469q79955
18099C542078o80768n12857l89289l13087k67175k17868j73341j41213j21327
$$ y = [222121, 166304, 145207, 127777, 108650, 89270, 84632, 73516, 62868, 54935, 57896, 60350, 54310, 57392, 56372, 47006, 52993, 58671, 43106, 26598, 44340, 54321, 36383, 55018, 88524, 105561, 122119, 156770, 185843, 158798, 122581, 108625, 103632, 104791, 113599, 129575, 137335, 143638, 160953, 185882, 223914, 258776, 239688, 214231, 219181, 231327, 228274, 236565, 250769, 259771, 283113, 322147, 338045, 362915, 414525, 479121, 570726, 703607, 866625, 1083498, 1387859, 1815718, 2512124, 3673761, 5555377, 8497344, 13406660, 21902161, 28734307, 23388703, 15262047, 10365280, 7810468, 6401625, 5396502, 4422033, 3542078, 2861310, 2348453, 1959164, 1646077, 1378902, 1161034, 987693, 846480, 725153]
18090G25153j04748r7409q1658n3302m9252l2427j6627l0285j9791M23j1159j8920
18078B09998k2033j2905j5862j3903j5021k3403j1716n649m96L833K566O84L83
18065I6476j0314L75j896j395m086j9503R133n401m193j033N86j2848l924L887
18051D5864j3668j637m777L397J0260J475j1894j3294p830N538J940J196J642
18038A8212o606O088K161n552j653N201k18j2702q489k481K167p910M279J1818
18024D315R479M563O369J5L957j0494r814j361N525M265r326k0737p728K0413
18010e59L954N412L492m001r827L61M715J4214j851p425j378R90M35k124p610
17995a202r612j1073Q758J4342m99K194J0212r003j6479M05O091K4435R473m448
$$ y = [725153, 620405, 522996, 441338, 388036, 338784, 306357, 289730, 259445, 239654, 240077, 228918, 209998, 187965, 175060, 159198, 145295, 130274, 106871, 95155, 89506, 89010, 92843, 95409, 96093, 96476, 86162, 86537, 84641, 83246, 79160, 59657, 68790, 63389, 59196, 58163, 58749, 45901, 41977, 45864, 32196, 30559, 25782, 29179, 39439, 40914, 29020, 15726, 7896, 13434, 15374, 16570, 18212, 11606, 17694, 19855, 14303, 12650, 17851, 17633, 4931, -3558, -6039, -3872, -11782, -7503, 4315, 13794, 18357, 24726, 24741, 28698, 18204, 8390, 7029, 12554, 16819, 7493, -13244, -20972, -559, 3395, 8807, 12299, 8298, -1529, -1168, 3547, 17761, 15910, 8485, 7107, 8097, 8532, 6408, -1202, -10814, -21887, -13129, 1213, 714, 2908, 13120, 4117, -12362, -11957, -5866, 18569, 28042, 23594]
17981B3594K873o956j6679j7647Q703R733J706K027L199O544j1742r584j305J0169
17967D635r423m112L820J433J1340J4871J78j1094j577o71n738j8342j3849N354
17953b3175p536j5696P013J1480J3098K6215m666k3530l009j6115R750P278L417
17940a5476L827M836M769J2603M580j3007p285n585p95J6656O542m910o532L687
17926C910K026m871j0579J746J4080m436m116l778m003o798o698P395J0418j1241
17912a6945j7223N850Q140k091k30K0539K504L853J183O741q362p236j0087k846
17898a6210Q954l553J333o262J475J2133J0588o167j5887n627J0602K800L944
17885a877K538q081r586L684P140q539J981J4696L742J2288l908j6990j1747O205
$$ y = [23594, 26467, 19511, 2832, -14815, -6112, 3621, 5327, 7354, 10553, 17097, 5355, -4229, -5534, 4635, -4788, -8900, -5080, -3647, 7693, 22564, 22742, 11648, 10071, 9400, 3662, -14680, -28529, -23175, -30711, -46407, -39394, -27914, -14816, 11399, 6733, -16797, -19806, -35921, -26171, -18893, -15476, -11649, -6813, -2044, 10559, 15139, 2132, -5153, -10738, -11533, 5123, 11665, 6755, 223, 3910, 5936, 1065, -9514, -7768, 6312, 1876, -2240, -6018, -10021, -16819, -23517, -16122, -5704, -16945, -34168, -28318, -20178, -22269, -22499, -1960, 544, 4397, 5580, 12321, 3959, -3277, -13364, -16210, -7256, -10809, -9476, -15738, -14263, -2130, 8458, 2291, -13596, -19223, -8621, -5821, -1877, 661, -7420, -17006, -13322, -6182, -14721, -12740, 1956, 5698, 17986, 14078, -2912, -14659, -8454]
17871h454O245K279j181l135M398J497m237k1809P797J9914J0630o596j9510j985
17857a4147k393J0176J500j3037K954N338O869L732O332m844j7605K549J1949
17844f27p114j350J0549O254L065n207N101p072j7986r460P898J0473m207n76
17830a0259Q461n670j2042N412N318J25J4012k248k3620L325q379O058J4370J5312
17816A0175l411l193l877q566n290M464k849r319J4926J4135O448o767q505P717
17802F088j932j5353r23P441N007j2300k476l464J3131O47J2038K149k26m153
17788E674J14n589J206o968j691j938p125J701o694Q694N042l315l097j1474R764
17773a5696J0062j753o584o82J4673J4539l331k457q211o962L23J0277j5917j0891
$$ y = [-8454, -2209, 70, -1111, -4246, 152, 1649, -2588, -24397, -16600, 3314, 13944, 7348, -12162, -14147, -16540, -6364, -4864, -17901, -14947, -9609, -2740, 992, 7324, 2480, -15125, -12576, -627, -7741, -9091, 1458, 7712, 10777, 5570, 10671, 3599, -14387, -23847, -15949, -5476, -9683, -10259, -1798, -7468, -19510, -14098, -8780, -8655, 5357, 3109, -20511, -17186, -25565, -19507, -5137, 10175, 6764, 3571, -306, -8872, -14162, -9698, -12547, -21866, -6940, 7195, 13643, 6876, -1629, 6088, 4156, -11197, -12120, -4679, 328, -11972, -14448, -17912, -4781, -4134, 7904, 10053, 9827, 5674, 5788, 199, 1405, -5563, -7254, -9192, -16317, -14616, -21310, -12616, -7574, -10889, -13986, -25460, -15696, -5634, -7387, -13971, -14653, 20, 14559, 11228, 8771, 560, -6402, -6079, 4198, -11719, -22610]
17759b2610k972O662Q193N274m934o086O653o857k350q299q730O669J0638J8174
17745e75m370M06n135P208j0339J245J4430m13j1439l442K16N949O498R629j7962
17730h094n486K225m856J680J3216n025j0299P535k289j640J6095M824o056n870
17716d040J266J1505K739K146m602k1773j09K291j984J134N750J978P94r209m086
17701a6200r112M978P864k121O942J5383m640m240Q434q788j2518j975O66N169
17687a0158P928J4054j0696k2696p90K587p126J1717Q546M232N10n728m718O924
17673e414J2274L529m900N948O360j4668j3026J769k502m310q814N924n472k907
17659b6209J9829J3401K259q557o987O839n924j312q4k811N16j398L487o586j3541
$$ y = [-22610, -25582, -18920, -10727, -5453, -10387, -16473, -9820, -16677, -19027, -27326, -36056, -29387, -18749, -575, -4945, -4539, -9674, -2466, -12805, -11560, 2870, 2457, -8982, -12424, -12208, -6259, 239, 9868, -8094, -13580, -11355, -16211, -14531, -1315, -6340, -16639, -9104, -11393, -13033, 3062, 7886, 1830, -4040, -2774, 8731, 11470, 13616, 9014, -12759, -12868, -10577, -12561, -11427, -5677, -3699, -2905, -12114, -16200, -25312, -20334, -12470, -14591, -7649, 7734, 3094, -1146, 7288, -1500, -14018, -15993, -15327, -10158, -2230, 11824, 1128, -21568, -22358, -19771, -26897, -15180, -6634, -2402, -1892, -7620, -12338, -5414, 6860, 10389, 5489, 11437, 17797, 3129, -9897, -8128, -10630, -14940, -23754, -17830, -23302, -26209, -6380, 7021, 9280, 723, -6264, 575, -5349, -6661, -6745, -9556, -9040, -10438, -6951, -13537, -27078]
17644b7078J0157J3266j392m716m972k969J940J0995J1936m938n655N300Q452
17631A0326n692K200N324K41m742n442q553Q68o374o086O091L22N296k221M578
17616c864r39J428l620m854L904K249m216q000o932P059J909K031l816N887J4737
17601B963P581r305j3796J36k036n05J3531Q886P03o281j1210J599L283o216j6521
17586b7188N367N097l647m992n275M36P724K2265N774N120N959o562n155L25R848
17571A5096L319r93m916l229o644q120J7091L628L08l599p939m017J698J469O915
17556A0067K437L14k340r978o126N191j0990M611P956K505j508m780o745m271
17542a3657j3144m251j350P511R297q657J6959J2461q536j6861P860O744l17l265
$$ y = [-27078, -16921, -3655, -5047, -9763, -14735, -17704, -15764, -4769, 7167, 2229, -3426, 1874, 10326, 4634, 6834, 12158, 12399, 7657, 2215, -6338, -5470, -11844, -17930, -11839, -11517, -6221, -8442, -3864, -4803, -3375, -6995, -11849, -7945, -5696, -9912, -17912, -24844, -17785, -15876, -13845, -17661, -11774, 2963, 10544, 1239, -12557, -12421, -14457, -14962, -1431, 7455, 8158, 1877, -9333, -7734, -4451, -10667, -27188, -21821, -16724, -20371, -25363, -30638, -30202, -22478, -213, 5561, 10681, 16640, 10078, 4923, 5248, 15096, 18415, 17422, 12506, 9277, 2633, -5487, 11604, 15232, 15540, 11941, 4002, -15, 1683, 3152, 10067, 12504, 12818, 10478, 500, -5626, -435, -11425, -6814, 1142, 3647, 2139, -2641, -9386, -13657, -26801, -31052, -32402, -24891, -15594, -24251, -7292, 5169, -3367, -20228, -12368, -5624, -5941, -9206]
17528i206k015J2730J0843n861j1760l564J4110q14j057N138J0931n470j4837
17515h32o882m367l564j380l796n57J0772J0284o809n778j811k549o28M456J331
17500a2110J305P376K807r569l755O039k525n646Q783J5698J4440R772j1465j3652
17486G498j5689o469O588Q567L510J676J915O777n092j3659j0268r168K569Q373
17472a2872K977k675J0290J362k545l723p347M335J6551J1451j112k801J123o27
17458A4387j288p630M466k012j1478j2284k658J2003J0022K3706k62M026J06R468
17444D0572K6539K6943L4249N343k1974j2262l0024l3214n659P222j5433j8440
17432C862k622O695L3p284j2021O386N311K903J506k360n930m783N343M217k715
$$ y = [-9206, -11221, 1509, 12352, 6491, -5269, -8833, 5277, 4463, 3406, 8544, 19475, 14005, -832, -7714, -12081, -15645, -17025, -20821, -21378, -10606, -322, -7131, -12909, -14720, -17269, -17897, -13441, -12110, -10805, -3429, -622, -10191, -13946, -7907, -10432, -16078, -7295, 8403, 22843, 32615, 21150, 7498, -8191, -14660, -8072, 495, 4005, 5681, 7596, 14373, 9281, -4378, -14646, -23814, -21245, -12872, -9895, -12570, -2280, -918, -3463, -7186, -14533, -10198, 6353, 17804, 16692, 13891, 15014, 14387, 13099, 5469, 9935, 7923, -3555, -15839, -18497, -6494, 3528, 27234, 26972, 30998, 31104, 40572, 67111, 94054, 128303, 133646, 111672, 99410, 69386, 36172, 30513, 37735, 22302, 3862, 1240, 7935, 7968, 684, -11337, -4951, 360, 3263, 4769, 2409, -3521, -8304, -2961, 1256, -1459]
17417a459r848Q347N917J0325l588m195J1899k584q849o211l010m209J05j1614
17403a8974J105J2831P028K43K02O713p760M322l769j0068R41k879K102m302J205
17388a1060J5450L970j359P15o535n394k528n092j323j236j5627K308Q585Q552
17374a0574R172n73r994p196L79n750n713j0847J4014K3546q742R34J1400m157
17360d101j9960j0135J3293j0736k202k835O228N624K853L112M290J2100j777
17347d246k118k358q430L540O141N293P703K022K094J686P69J819j6929o060L024
17332f050n179k138L329N50m64O593J0386k248j8112J4369J5744j559q652n880
17318F89p95n7J673R023l606p630l147j245p439r950n050j875L591K0092N573
$$ y = [-1459, -11307, -2960, 2957, 13282, 9694, 5499, 17398, 14814, 5965, -246, -3256, -7465, -7360, -18974, -17869, -5038, 1990, 2233, 2435, 9148, 1388, 5710, 1941, -8127, -7186, -10065, -7963, -12265, -11060, 4390, 8360, 7001, 7716, 1181, -4213, -6741, -11833, -13156, -14392, -30019, -27711, -19126, -10574, -1402, -1975, -11969, -19165, -18786, -24536, -30249, -41096, -27082, -3536, -12278, -11344, 56, -4101, -24061, -34196, -20903, -31639, -33841, -36676, -30448, -24824, -21971, -18859, -14569, -2469, -4246, -6364, -8722, -17152, -13612, -7471, -2178, 5525, 7547, 9641, 11327, 12096, 13915, -3014, -9074, -6050, -11229, -13367, -10038, -9488, -9952, -3359, 7027, 4779, -13333, 1036, 16780, 15221, 6569, 689, -106, -163, 1510, 10533, 6927, -703, -3850, -5095, -12534, -22484, -27534, -29409, -25818, -5726, -153]
17303a53m236L539l702j0080j3231k368O710J109j2842j753N280J0958K2731n015
17289c053j5000o33P884O147p899k459J5380N99J024j0674o15o480Q418L330m031
17274h062j409J1702J422k2980k0198o262J2258Q193L106P269M947n375J6291
17261I02L673p654j050k502l040Q536j612k316J2422N020j2857K568L938J322
17247G350j5603j3933j4178J3106K1341J3081M341j4432j2900j5588m389J2450
17235a9354K4036n968L997J1363j6013q619O721q709o411M736J5766J1367l97
17222A2515j1632o443K990J5413J0877j727n093j4971p401j1193m175J1985O035
17209b820O097R259O019L746j1432n354q540j1568L046J1541k923j9q64O381J616
$$ y = [-153, -4389, -850, -4552, -14632, -27863, -30231, -23521, -22412, -35254, -37007, -31727, -20769, 1962, -3053, -18053, -18686, -10802, -4655, -12554, -15013, 367, 966, 1990, -8684, -9299, -15779, -7361, -4031, -8062, -9471, 2231, 3653, -19327, -39525, -45787, -33529, -25336, -22230, -14961, -10014, -15389, 902, 4575, -3079, -4129, -6631, -9671, -1135, -2747, -5063, 7359, 12379, -478, 2090, 6028, 7350, -8253, -22186, -36364, -23258, -1917, 11164, 15505, 1073, -11827, -27415, -31804, -19354, 4682, -1286, 2711, 14074, -1939, -10558, -3837, -12546, -18957, -14221, 1545, 12912, 12515, 883, -5560, -2570, 12843, 23720, 21993, 16900, 1929, -5472, -16665, -20840, -8855, -2820, 3277, 12536, 18555, 22301, 10869, 5515, -3025, -14593, -11547, -6, -2929, -2948, -3812, 2569, 4185]
17194D185J2272R916l606n693j3571q611j1696l077P00k411M589n777O577Q048
17180h155m406J155J1459K182p318m571l261o787J191J3400P570m520r179j021
17166a2261l267k270O244j3562K1642P443n333J081l057j943p27P218J1945N336
17152A8489j1554j826q35L979K942o636j000K142O688j509l998q992K720J633
17138B243J5988O32k0901n281K567o565K089j470j0573K0245J7582J461j4699
17125C318O669J3855O50o196p861k060n547j1395L186N632l672l583K798P856
17111C650k966p795N484k362Q88L04n410k711O770J6854j2729j5964j163M500
17097a2650j0461n88J2712J2050q440o548K564J940O099p356O381O865k585j3946
$$ y = [4185, 16457, 26373, 22767, 17074, 3503, -5108, -16804, -19881, -19181, -21592, -17003, -22780, -16203, -8155, -12561, -11406, 53, 2235, -5083, -9654, -12915, -19702, -18511, -5111, 2459, -2061, -11240, -12261, -15528, -17798, -11554, -25116, -3474, 3969, -1364, -283, -3340, -5283, -6010, 1208, 13153, 18489, 6935, 5109, 4274, 8253, 11195, 4559, 3559, 5701, 12389, 10880, 6882, -2110, 610, 2243, 18231, 18863, -2038, -7319, -4752, -11317, -9228, -10698, -21271, -1026, 16556, 18017, 3318, 9987, 23842, 24492, 18296, 10435, 8375, 2828, -8567, -5381, 251, -3421, -7004, -4206, 3650, 684, -7111, -1627, -3989, -3101, -2797, -8207, -10918, -4148, 12706, -23, -15987, -17150, -12650, -23111, -23699, -10987, 1063, -7377, -13925, -11361, -9421, -3322, -10678, -4297, 2568, -17, -13963]
17083a3963o514J5015R948j0362J4929j205o697O147N189j6956j381N936Q221
17070H307p941q552O376o274q212L463K882j1835J861L486o049L262R859k465
17056a1832o33P44m910Q112Q515n89r216j7862R323J9307j0225m546o940p992
17042b8744P640J1337Q406L415j16j222O754M072j4026L819j675l814P40J5778
17028A2364K649k2941l718R008q606J0266q83l403O673M252m760O04m303o234
17014i032R247l785j6353J857J2700P195o46r85L169r651m107R407k835j4019
17000a7838J69J0428L830j492r510l052K965K439m417P347O834p804L631J833
16986d637j1009l494J184k104O915m967j3426Q907P195o441M898O882K208R151
$$ y = [-13963, -20477, -5462, 4486, -5876, 9053, 7848, 1151, 7298, 12487, -4469, -5850, 86, 8307, 366, -8186, -1810, -8084, -16296, -12833, -9951, -21786, -19925, -16439, -22488, -19226, -9367, -11832, -12465, -11721, -16631, -8519, -4, -593, -9809, -27671, -18348, 959, -9266, -13812, -20752, -28744, -21104, -9767, -1361, 2054, 1938, 716, 7470, 11542, -2484, 1335, -340, -4154, -3414, 12364, 15013, -7928, -11646, -2638, -11244, -978, -1861, -5264, 1409, 5661, 901, 1505, -2798, -9032, 215, -3570, -19923, -18066, -5366, 1829, 1183, 198, 3367, -6284, -10391, -984, -3819, -17838, -17669, -7241, -3411, -4903, -14413, -17465, -14500, -12061, -16478, -9131, -2297, -10101, -6470, -4637, -15646, -19140, -17956, -20060, -13145, -18112, -31538, -22631, -15436, -21877, -16979, -10097, -7889, 1262]
16972A262j5343J570q801P946Q31n54M031M795Q200j2686q718R312J0807K78q011
16957e081N480R503J049L689r562j7597k487O021j443n808J558q781k869O090
16943b0238M414L010J3943J1542j306j5005j4205O48R438J5953j56n593L572p666
16929a649K752m78M46J1633K855R93m274j3491j341j06p000j2950p931N866J5195
16914i480ll462j3148L131j0395o34O130J2137J4514Q638o046m590j765R433o33
16899C827K111n201P538O47j0976j130r649o858J0297J0013Q229r312j6540j3860
16885c0864O289J6909P30L125P74J6449J1588r703r307j0884N315l309p918m585
16871a5391r116Q284J0787Q954M592m471M408J1217L258R352j0615j8455l523
$$ y = [1262, -14081, -12511, -21312, -13366, -12535, -13089, -9058, -4263, 3937, -8749, -17467, -8155, 2652, 2930, -5081, 399, 9902, 10951, 14640, 5078, -12519, -15006, -8985, -10428, -16236, -14678, -23459, -26328, -20238, -15824, -12814, 1129, 12671, 11365, -3640, -17845, -17197, -7759, 8194, 8038, 2445, 6017, -1649, 1103, 625, 1071, 12704, 15559, 16552, 12278, -1213, -2554, -2660, -9660, -22610, -30541, -24675, -9480, -9483, -12945, -26093, -22962, -33357, -33991, -27861, -15724, -1210, 7428, 1382, -3208, -4973, 4460, 3827, 5938, 737, 8275, 8922, -2054, -3184, -12833, -19691, -9394, 619, 8848, -464, -17004, -30864, -24575, -7666, -6936, -3811, -3037, 13412, 25000, 15297, 5990, -4894, 421, -2888, -10806, -15391, -24507, -16223, -5436, 3518, 8110, 3639, 8047, 19264, 22522, 31874, 21259, 2804, -719]
16858g19N660P85Q021Q68j710r237p408K439K479k1816j4153J3931J189j1462
16844c1133J834k986P723R698j574j78O782J2147n112l201O782L020j755q364
16830f317j2322j984N394j0364P088o771J811J3409N808N866N139J496j848j0875
16816d470j8681l138K870l301O718J6397J2137j926O997N411k317n372L554r08
16802A3971n881K455j330j5077l910j437J094k814j5167j7Q960R984L559J241
16788d369P394K269J2564j1880j7057J780R788o614J65k14Q533j5118j3452J515
16774b4696R008J1953l451q436J218L022N172Q451O442j2317j3225k110J0297
16761h672K56N842P669j3201O773R283K872o627N948K830j3623j3557p013k170
$$ y = [-719, 4941, 5726, 13747, 14615, 12905, 3668, -3740, -1301, 1178, -20638, -34791, -20860, -19671, -31133, -29299, -32285, -24562, -14864, -16438, -16616, -9834, 2313, -2799, -6000, 782, 3802, 2047, -6317, -18639, -20623, -15229, -25593, -18505, -25276, -23465, -10056, -4248, 1618, 6757, 8253, 6405, -4470, -23151, -26289, -23419, -26720, -20002, -3605, 8532, 6606, 13603, 19014, 16697, 11325, 14879, 13971, 8090, 10545, 9215, -5862, -9772, -11209, -10115, -12929, -28096, -28113, -19153, -9169, -5610, -4369, 3025, 5294, 17858, 5978, -11079, -9299, 489, -6125, -5960, -6174, 2359, -12759, -26211, -24696, -15688, -3735, -7186, -15622, -14404, -11382, -6210, 2241, 8683, -3634, -16859, -18969, -8672, -8416, -2574, 5095, -8106, -1333, 7950, 10822, 4195, 10143, 12973, -650, -14207, -21220, -23390]
16747b3390K13m232L206J2781J2533P103J1415m803j240j0516l011l661q9o975
16733a0666n52L165j099Q425k363n388L753m372R575J6055m003Q940M75L646l451
16718B2140j4337j2258O711J000O959P834j1779p939Q391P671p518j5911K715
16705f321m43q197r80p64J0510N382p668n992J068J5919N701l393J665j2168K044
16690c637O323n282p320L583p290M369P379O248j1859j4044k162J7514J1929o1
16676E690n577k1194j1919J4415K259P881N555k835j492j7822M849Q611J4005
16663B426j75j582j311r985J0851m717j4071k1093K367J4704J4359J0832R367
16650A1972O737j2132q821r176k0505p535J3583k837J8106J3626R62r973n109
$$ y = [-23390, -23177, -27409, -24203, -11422, 1111, 8214, 19629, 14826, 13586, 3070, 59, -3602, -3691, -10666, -11218, -8053, -9152, -727, -3090, -8478, -4725, -9097, 478, 16533, 12530, 21470, 21945, 25591, 22140, 7803, -4455, 2256, 3256, 10215, 18049, 6270, -1669, 6722, 14393, 6875, -9036, -6321, -6764, -14961, -15941, -16705, -6195, -813, -8481, -14473, -13405, 2514, 8215, 4822, 6487, -5681, -3637, 2686, -2596, -9916, -6333, -13623, -9254, -1875, 4373, -7486, -21530, -23692, -6178, 5751, 5690, 113, -21081, -33000, -18585, -16326, -8445, -2890, -5725, -7217, -25039, -20190, -11579, 2426, 2251, 669, -642, -10627, 224, -4493, -18564, -39657, -37290, -22586, -8227, 2605, 11972, 18709, 6577, -2244, -11420, -31925, -39460, -25877, -28714, -10608, 3018, 3980, -5993, -11102]
16637a1102P270k661j3343L395J7235J4302j780q266J886m804r208P393R375j8517
16623h825m145J0695Q390n974j4803K865k085K900o019p135k97O605l584O727
16609a4685L664J1036Q994l351O937P824j3167k4601q283P775J1048O288R639
16596I118o262L021k105q263L278j0175k6483p114J0556O356M063j4735j0136
16583d8881L823J5362K3312j268n088N95K776P701Q804K218q18p251m431j0138
16569a3284M10L913N630O662m476j6995L24o204J2243R173M024k967j0972r866
16555b2385n005k615q878J5465P106J2417R917j49j485J254K953J066p373j184
16541A104o440j610j4513R13K203L886J0800o686j0357j951p776J0976M913J1728
$$ y = [-11102, -3832, -6493, -19836, -16441, 794, 15096, 13316, 5050, 6936, 2132, -7076, 317, 9692, -8825, -12970, -2275, 6115, 141, -14662, -11797, -13882, -10982, -17001, -24136, -24433, -17828, -21412, -14685, -11021, 15, 9009, 5658, 12595, 20419, 7252, -17349, -25632, -17857, -6809, -521, 9118, 2856, 5877, 3772, -4491, -1213, -11388, -37871, -44985, -34429, -28073, -24010, -38745, -48881, -45058, -29696, -6384, -7652, -12740, -12145, -9369, -1668, 7136, 9354, 8536, 1285, -3146, -13284, -12874, -8961, -3331, 3331, -1145, -18140, -17816, -24020, -11777, -2604, 1420, -1547, -12519, -22385, -27390, -30005, -38883, -23418, -16312, -3895, 6022, 5873, 4388, 5642, 8595, 9661, 2288, 1104, -5336, -6946, -21459, -20546, -18343, -14457, -3657, -10343, -20700, -22651, -30427, -19451, -14538, -2810]
16527b810J954n598k727j769M592N298j49J0871Q737O965L226j4615j4279n957
16513f261j0407m385k319j728J2333J6633M069K018m857q899r091K842o302L213
16499a3141K445Q916P450R415l356k1426j436k404l844M350o36K965M083M203
16485b416O050k695K86o041o477J592L457q7R78J631J646j1830j0495R504k973
16470a7870K463K0348k331j8785j3463J3296m29p97J0646J9131R996n002r744
16457G459l749R811O914j613K702q335j8651o709J3724k472O377O745j6418J78
16443d037L143k805n038Q863J2446k686j5337J262m440j0709N41L183J376j640
16429a5878J0950N69J754Q529R735P740j2829j3585K929M259j0263j6103j1606
$$ y = [-2810, -856, -6454, -9181, -10950, -6358, -1060, -1209, 9662, 18399, 25364, 28590, 13975, -304, -6261, -16668, -21053, -23372, -25100, -12767, 3866, 7935, 9953, 5096, -3803, -12894, -10052, -16354, -13141, -10696, -1780, 5670, 15085, 11729, -9697, -11133, -13537, -17381, -13031, -13667, -10702, -6619, -2416, 3634, 939, 1225, -4816, -11293, -9701, -6244, -6331, -5353, -3722, -2076, -13906, -24401, -14897, -17870, -15407, 4941, 2610, -16175, -29638, -16342, -16771, -17568, -6922, 12209, 22205, 17203, 7459, 3710, 13521, 20435, 18822, 21524, 13189, -5462, -12171, 1553, -919, 5458, 12203, -4215, -4037, -894, -3699, -8737, 126, 12572, 9886, -5451, -4189, -8629, -19338, -18797, -15614, -14238, -15878, -4928, -4359, -2605, 5924, 15659, 23399, 10570, -3015, -86, 4173, -6090, -22193, -33799]
16416c3799O293K5467O308l454o273p646J0256j704M065M873k965j0884K502m120
16402a1081j1237l470J248P65J0852J5356Rj750o131n925J25R92J3978n063j0880
16387a2212P891J0394m703N655j925o530j0689K365n77n438o026j402o909M085
16373b6021M233j80J200J1212J2505n566p791L272k318o782j922n419p175M605
16359b6147J4327q0j681Q670K858j2639q488m901J1945M196r62j0807k113J236
16345b4586J269j647P343m404P669l751j54L023o490N155O705Q016O726n868n031
16330f025K866j337o691j5149m099K2736k395j4684l500L32N477O548k569o655
16316b5145J2819J1277k511L074J1109m480o331m39L181N091N765j22n937k961
$$ y = [-33799, -27506, -2039, 4269, 815, -5458, -13104, -2848, -4552, -487, 4386, 1421, -9463, -6961, -11081, -22318, -25788, -24540, -23775, -12923, 2433, 2442, 692, -5439, -11364, -11239, -10247, 3731, -1332, -12212, -4321, 6073, 1370, 7025, 5100, -1430, -12119, -9754, -10331, -15769, -21795, -23197, -30106, -26021, -21788, -21968, -20768, -9556, 2949, -2617, -10408, -7136, -9454, -16236, -18158, -23577, -30752, -26147, -11820, -11900, -13581, -4911, -2053, -14692, -23180, -28081, -16136, -11940, -12902, -23709, -25822, -24586, -23317, -24964, -17621, -22025, -14356, -18107, -18261, -15238, -21728, -16573, -9868, -1852, 4874, -994, -6025, -3159, -4496, -11187, -26336, -30435, -7699, -10094, -24778, -28278, -27946, -22469, -15921, -18490, -25145, -12326, -1049, -3560, -486, 10623, 6143, -188, -627, 2554, 7645, 13410, 13288, 7351, 4390]
16302D390m6k161L286J2405k248m144n69J96m897q761L504P557K447n179o897
16287a117J1994L215j4279j3778m257J0869J5869o66q514j752R411L466R874L957
16273B4292n051o996j1185n105N406Q30j640j973m348R96r819L70j2452L848O739
16258a6088J2028M178R364m486r393R584J414m118l830o699j0640Q569L18n119
16244a4918J4448n319j801K809J820r766q989P791p850N854k002J6215q39j339
16230c886O566K1J837j0072K086M441j7467J480r399J411J2111j018J0248K2177
16216B0536j2255j4421R883R203j0954p294j73R388k228p031P821J5772L989j1201
16202A1035o592o149j375K860l078q076M724j634K023L847n427l006j3837r395
$$ y = [4390, 4344, 2183, 5469, 17874, 15626, 11482, 10913, 11109, 6212, -2549, 955, 8512, 10959, 5780, -1117, 10877, 14092, -187, -13965, -18222, -7353, 8516, 7850, -664, -2416, 6995, 10461, 20335, 24292, 19241, 12245, 1060, -4045, 1361, 2191, 551, -1422, -5770, -4774, -14593, -14223, -26675, -22827, -16088, -4060, 118, 9482, 4996, -4397, 5187, 6601, 2483, -1347, -8046, -18686, -10117, -9799, -14918, -470, -5789, -7590, -4781, -2961, -12727, -21716, -13925, -21775, -15921, -17923, -1708, -2547, -3886, 2680, 2701, 4538, -5534, -3448, 993, -16474, -14994, -24393, -22982, -10871, -11889, -1641, 20536, 8281, -6140, 3743, 12946, 1992, -5302, -5475, 3913, 1685, -5346, 2475, 18247, 22236, 11035, 4443, -1706, -3081, -221, -3299, -11375, -6651, -8285, -6262, -2415, -7842, -10848, -24685, -34080]
16188c4080j9790J8403J6301J7214M408j0389j5398L585J4624n138L429N641k156
16175c346j289L628j220q800j2249p11p129R017R471l925J244P932M705J453P432
16160F213m037k460J153J5997N603m693m959Q53j229J1023Q246q337j4528n220
16146C625m027j6034j605J3976R036m644P404J2394n154k1825j7018l520L379
16133b4013J2756J2823l049j0249N099N691j1423O593J3883Q854j3653j9889J694
16120a4883j0603q320P330N941J1369Q750j6530R21N217R743M617j938N483k664
16106D433r760o91J2975p961j485q360j0850J5871J1121j2408M423P066l60M296
16092H310L203j4106j0808J4225K514K20N801J658n091n817J316K507J2583l225
$$ y = [-34080, -53870, -35467, -19166, -1952, 2456, -7933, -23331, -19746, -5122, -10260, -6831, -1190, -3346, -4635, -1007, -2227, -11027, -23276, -23987, -31116, -22099, -12628, -16553, -15309, -7377, -2672, -1219, 6213, 2176, -284, 869, 16866, 22469, 17776, 12817, 13670, 12441, 23464, 31710, 23373, 8845, 3625, -402, -16436, -18041, -4065, 4971, 327, 7731, 20125, 14971, -6854, -23872, -27392, -24013, -11257, 1566, -1483, -11732, -6633, -942, -12365, -5772, 8111, 16965, 3312, -16577, -14883, -25486, -33806, -26476, -20535, -9166, -416, -16946, -16025, -10808, -1065, 3552, 1614, 7097, 4433, -5327, -6018, 6957, -1004, -2489, -10849, -21699, -5828, 5293, -7115, -2692, 4374, 4014, 8310, 11513, -2593, -13401, 824, 3338, 3558, 9359, 11017, 5926, 109, 1425, 3932, 16515, 13290]
16078A3290j4449N797J182p237o072P509L393R54m643o178m396k141j4024n057
16064c2072J358R211J10j254Q757l823o528J1053J4656q350m61l452m288K969
16050a2114l840j672J2683P710J0682Q778k732j0624m003j3617K45M087M370Q877
16036H830J3394o471n307n613N71L759K653L695M722j540r072j654p861m464j754
16021f112J1999J462K996L026o155j1269p803l218Q971O685J658L658N189m903
16007F184m911J8463O708j4919j0128J008O411L668N847R421l481j8564k2755
15994a7048r691J2762J6985l635L320p505m030o096j829K559L804p196N920R446
15980b234m368n778O584J4031l34p932j6244K608J2334R192l91l03J905q36Q120
$$ y = [13290, -1159, 4638, 5820, -1417, -7489, 20, 3413, 4367, -276, -6454, -10850, -12991, -27015, -32072, -30714, -21503, -21393, -22647, -13890, -17713, -24241, -13188, 1468, -6882, -7343, -10795, -15083, -12114, -15954, -17626, -4943, 2767, 13449, 22227, 19495, 8871, 4868, -8749, -8504, -4417, -47, 8830, 22224, 15753, 10446, 4833, 5404, 9163, 11816, 15511, 20233, 18693, 9621, 7967, 106, -4358, -6112, 5887, 7349, 10345, 13371, 7216, -4053, -11856, -15074, -6103, 582, 2240, 5898, 11087, 6184, 1273, 19736, 26444, 11525, 1397, 2405, 8816, 12484, 18331, 27752, 24271, 5707, -17048, -26739, -13977, 3008, -627, 2693, -4812, -8842, -14938, -16767, -14208, -10404, -17600, -11680, -2234, -6602, -12380, -5796, 8235, 7901, -31, -16275, -13667, -1333, 7859, 7468, 7165, 9070, 8234, 16354]
15965A6354M43j2699J26j2192n11Q100M508r030k549m424q54J0926M522L931j3815
15950g164j6665l320J2483N335k921R746j822J9627Q222q763n098L256M742K941
15936B0599l185j5326k995J5270m006r275r476N326p573j245J7283J0262j7713
15923b054j8976Q885J1906O281n071k318k957J1970J4493j0459N598K943j0566
15910I675p041q002o07l75N139l028p383j1165n303L583L649J3352q936o046m412
15895b6900l285n89J0739J368l370Q658J5905P399O49o636j1012j1380n103Q42
15881b2715j289J6934J5047r147j1221j2456J5215J3699l19j1997k152p3l68Q576
15867b266l65k043Q742O793L312n471n494p493L648l099M479L256m04o840O078
$$ y = [16354, 16797, 4098, 4224, -7968, -8479, -379, 4129, -4901, -7450, -11874, -12728, -1802, 2720, 6651, -7164, -23829, -27149, -14666, -9331, -12252, -2506, -4328, 15299, 23521, 14758, 9660, 12916, 17658, 20599, 17414, 2088, -907, 14363, 10357, 1082, -8394, -3068, -10641, -11886, 5397, 15659, -2054, -21030, -12145, -239, 6042, 971, -1347, -4304, 7666, 22159, 11700, 17298, 20241, 9675, 2634, -5368, -5975, -6350, -1211, -4239, -11622, -22787, -28090, -24507, -20858, -7506, -16442, -22488, -26900, -30185, -30774, -20035, -18667, -22037, -13379, 2526, 9925, 10574, 3938, -7074, -18454, -23557, -22715, -24004, -7070, 7977, -1170, -12391, -24847, -9632, 4067, 3748, -8249, -10401, -10474, -10842, -2266, -2631, -4674, 4068, 10861, 14173, 8702, 3208, -4285, -637, -3736, 743, 3999, 3595, -3245, 2833]
15852B833J1825j2654k3155M79J3823o1j119n568m491j38J6408l918j2726R944
15838h518J6846P347P76j703k0616q481J2805J6521l763o944N38n07r39Q763J5803
15823B7928m445j2845N391j0318j1538M490R669P956m233o940j972l762j2280
15810a2899K847j2j3743L43N89M2J1625J2257O900n246j3613j312m247P627M17
15795h425O491K665J0598J278K481n531j5739r587m97J6824Q376O473l18k128
15781A2961j6034j1447l845N918j867J460j2869m879Q924Q897N981Q078R992l651
15767G619j761j2146j3952O395M237j2788l971J8095M891K519J4207j948k5237
15754a3840l763Q404J1077q78m935M118R192m489r671j3781k33M979K891j251
$$ y = [2833, 14658, 2004, -21151, -20672, -6849, -6910, -8029, -13597, -18088, -18226, -1818, -5736, -18462, -8518, 8328, 15675, 16451, 14748, -5868, -14349, -1544, 14977, 11214, 4270, 4808, 4301, 3362, 12125, 27928, 23483, 10638, 16029, 5711, -5827, -1337, 8332, 16288, 12055, 5115, 3143, -619, -12899, -10052, -10064, -23807, -23464, -22875, -22833, -11208, 1049, 7949, 2703, -10910, -12222, -16469, -8842, -8425, -1934, 731, 11329, 12607, 15088, 9557, -6182, -15769, -16266, 558, 8934, 15407, 15089, 12961, -3073, -14520, -18365, -12447, -14314, -12854, -25723, -30602, -21678, -12781, -6800, 1278, 11270, 7619, 5858, -6288, -20240, -13845, -9608, -22396, -26367, -8272, -3381, -862, 13345, 11397, -13840, -17603, -9199, 1878, 1000, -3935, 183, 9375, 4886, -4785, -18566, -18799, -13820, -10929, -12180]
15740a2180O66J2919L755l664n326J464j4939L76O701n499M504J4487K716K362
15726H342Q109J1128l958l720p627j4787J2065J082r293k301j0760k19J2513M344
15712D918J1236o455j6969L308Q947K483j296q032K332n260k360L167P143J0820
15698A3982j4698N246R289j1702k429k080J185k49J1007O724N254n089j7482q493
15684i535k579P683j785l459J3346j1433r235P419N166k196K513k053j4857m885
15670b5890N412p135K877P891O720M423p483j0463R222Q291L918J573k163P187
15656D380k436r091p732Q801O60K662M705M910K191q26J729NL899q963k552M976
15640G318k389l601j154j2498J4740O819j4295j5701J3O795P440O953K915j6821
$$ y = [-12180, -11514, 1405, 5160, 1496, -3830, -2366, -17305, -16929, -10228, -15727, -11223, 3264, 5980, 8342, 16451, 27579, 23621, 19901, 12274, -2513, 9552, 10634, 1341, -960, -11720, -11939, 574, 4918, 16154, 9699, -7270, -3962, 4985, 7468, 6172, -1860, 472, -4788, -7148, -3981, 3162, 13982, -716, 4530, 13819, 2117, -312, -2392, -1207, -1456, 9551, 16275, 21529, 16440, -1042, -9535, -12114, -4431, -6216, -9675, 3671, -7762, -16997, -9578, -4412, -6608, -4095, -6148, -21005, -25890, -20478, -27613, -24736, -16845, -10125, -5702, -13185, -23648, -14426, -6135, -2217, -644, -2807, 4380, 1944, -7147, -14879, -6078, -5418, -2756, 1949, 6859, 9050, 8224, 9953, 9958, 13857, 4894, 2342, 7318, 4929, 1328, 174, -12324, 2416, 9235, -5060, -20761, -20748, -13953, -6513, 440, 3355, -13466]
15626a3466l770P315L328P20L293l926J3186J4480j303l965j0514J671Q125m328
15612A0846l940j1377K169k440P720n127r423L161J0144k88j0904l545m217l912
15598b1133j026L458K0845J2078m843p847j236K12r118n247J0329J3226k948p935
15584a185r688n654J4281P423o644J208n997K319J4618O943j2538k1204Q595L877
15570c646N964j453j939J411K609J4318O965l100j1348n111k972R92o90J4076
15556A6076Q60l946J0179l531p615o073n102j6115J1858J3716R751n603Q59j2854
15542B460Q177j601p417m613Q992j3761O022J0232Q487j229q488m486q372L853
15528a744J381n687m06J2890J5871n666j1340J0144l874r53J2690R838j5300l286
$$ y = [-13466, -17236, -9921, -6593, -5873, -2580, -6506, 6680, 21160, 19857, 15892, 5378, 7049, 15174, 10846, 6906, -4471, -2302, -4742, 2978, -2149, -11572, -8411, 1733, 1445, -9459, -13004, -17221, -21133, -22159, -18701, 2144, 14222, 9379, 1532, 296, 508, -8610, -13857, -3528, 9698, 6750, -1185, -10873, -16527, -2246, 5177, -1467, -259, -6256, -3937, 10681, 17624, 5086, -16118, -7523, -3646, 2318, 865, -1074, 337, 2946, 17264, 24229, 21129, 9781, 4670, 1698, 2690, 2000, 16076, 16936, 12990, 23169, 19638, 12023, 5950, 848, -15267, -3409, 10307, 20058, 14455, 15314, 2460, 10637, 9036, 1619, -2994, 5998, -7763, -1741, 8491, 16978, 15749, 7261, 2775, -5597, -1744, -363, -6050, -6456, 6434, 22305, 16639, 5299, 15443, 11569, 10616, 23306, 33144, 17844, 14558]
15514A4558L214K888j4160q512M266l529N213o812j0165j940l036o299r520R337
15500b4497O591J0386n802Q137Q109N823K358k081o693j0232l074J1447M967l819
15486A620r440r786K168n338n819J3142K5679l210j0486P469O15l079n245m813
15472f523l64P048J0658k284j970r635l728j205J1405j3899k899K1396l023k604
15458B373k21r053m270R783J1525r424j4230L336K504o714N518J8263J2260j1174
15444A0476r163n852K153M69J974k877k560m377j222m389p960r004j458J6633
15430a7157Q997J4741r960j4630M171J6228K913l576q67J675K546m175J690p694
15416e098p189j0289l066Q455O877j1192P10R677O24k51Q53K815J280k725R024
$$ y = [14558, 17772, 20660, 6500, -2012, 2254, -1275, 3938, -2874, -13039, -14979, -18015, -24314, -33834, -24497, -17906, -7520, -13322, -5185, 2924, 8747, 11105, 9024, 2331, -7901, -10975, 472, 5439, 1620, -7820, -17606, -15438, -20776, -26595, -13453, 12226, 9016, -1470, 5999, 6614, 3535, -1710, -6523, -6887, 161, 10819, 8535, 6565, -3070, -6798, -8003, 3402, -10497, -13396, 8000, 4977, 2373, 2152, -6901, -11171, -1388, 10137, 713, -13517, -10181, -7677, -14391, -8873, 9390, 21650, 10476, 1313, -4539, -2386, -1917, 57, -2820, -5380, -9757, -10979, -15368, -23328, -32332, -33790, -17157, -8160, 6581, -3379, -18009, -13838, 2390, 5303, 1727, 860, 2535, 5081, 906, 2596, -5098, -12287, -22576, -25642, -17187, -10310, -21502, -20792, -11115, -10491, -10742, -9889, -7074, -5794, -8519, 505]
15401E05J0350K435l952N880M912k060r301l686j2444l154N836J4482J3644J292
15387B4739j7214k2829M14P397O081M264p574k086Q463N009l044l467n415K967
15373b295L265L307j828J0188j619n797o453o012J2340J4816j3601j1023r260
15360a3972L571J0169k669K153J0582m457j5033o578M357J6699m725j339k344
15347c586Q258O996N716m549p341n566o263p343m014P741K237m549o024K667J2553
15332c067p292o662N982J065k568p041J791Q717J0739O500k574J1272M87r727
15318G622l031p859J2610Q608M254j3771l194J0988j1351j1050P980P392n473
15305C725k068m799M121Q393k019j2896n745M556J2778P049o389m398K858R312
$$ y = [505, 10855, 13290, 9338, 15218, 20130, 18070, 8769, 5083, -7361, -10515, -4679, 9803, 23447, 24739, 7525, -15304, -14890, -7493, -1412, 2852, -4722, -6808, 1655, 6664, 3620, 153, -5262, -2295, 970, 4277, 2449, 12637, 11018, 5221, -1232, -7244, 5096, 19912, 6311, -4712, -13972, -10401, -232, -2901, -748, 9834, 5377, -9656, -16234, -11877, 4822, 97, -1242, -3586, 4672, 11668, 17384, 12835, 5494, -72, -6335, -13678, -17692, -9951, -7714, -12263, -18287, -15620, -3067, -10359, -17021, -11039, -9974, -12542, -19583, -17792, -9075, 1664, 8164, 5590, 16862, 17349, 7622, 4591, -3268, 9342, 17950, 22204, 8433, 5239, 16227, 4876, -6174, 1806, 9198, 3725, 1657, -3142, 979, 9372, 7353, -5543, -11288, -6732, 6046, 13095, 6706, 2308, 5166, 14478]
15291A4478l022p896L603m994j1693k975K444N203O488N351M548N712j3247j0163
15277f163N320j903N092L678Q400k567K363N554p887O846j780j2963j3697N127
15263d580n518P859P097J429N626j3508m967L163K790J0588Q013J9149n210j2473
15249A9458j1900L209J5605n862l475q179k486J478R40K513J0166k458l036l142
15235A2831K434J9188M335r386n957j8443q939q154K705p33P566J6966J0929j060
15221B4282j9641k0642M273J5381O802N107k5431q038R015m884j578n202q173
15208b8729M397L553o364R622J3491N210N785N755j4608k140q60L76k307K505
15194d314O24Q2Q675n5j369n422J25O175n463J0066J1211J414j2839j8021j2274
$$ y = [14478, 11456, 3560, 7163, 2169, -9524, -12499, -10055, -4852, 1636, 6987, 11535, 17247, 4000, -6163, -843, -2746, 2346, 6024, 14424, 11857, 14220, 19774, 11887, 18733, 16953, 3990, -9707, -4580, -10098, -2239, 4858, 6287, 11913, -1595, -6562, -3399, -609, 9979, 17992, 37141, 31931, 19458, 7558, 10767, 26372, 20510, 17035, 8856, 6370, 7848, 8788, 11301, 21467, 19009, 15973, 12831, 15265, 34453, 38788, 29402, 23445, 5002, -3937, -12091, -9386, -10119, -2553, 14413, 25342, 24282, 4641, -16001, -11728, 3653, 10455, 15562, -9869, -17907, -8892, -13776, -15354, -20556, -28729, -24332, -20779, -27143, -17521, -4030, 1180, 6965, 12720, -1888, -4028, -4888, -4512, -6819, -4314, -3690, -3608, 5067, 5012, 3643, -1779, -1654, 4521, -942, 9124, 20335, 21749, 8910, -9111, -21385]
15179b1385J4891N152j088k465n53M524M935k315P942M554M07k766K961j766r083
15164C945k718L742k98K761J041j2175j008K97J371P160R184m092o709K359L159
15149H019Q233j3835N263L524M925J844r046L074Q221m214q953j1366J045P737
15135D471K96r187N74J3632J239M664P995J7312k126k8142j8724Q231J7768Q485
15121B6488O891k7076p636J3122R772j2089j1238N532Q539J3972J651j494j0871
15108A5563j0977o988J0179R842k687K693P87j2282j2088P333k365j2514K618
15095a0886Q728k350o222M555Q770J1234j3628o859R199O245j0215k870N570J0096
15081A1367Q152m959j0956l686Q191K581n093k203R889r76j3089o4o447j2030
$$ y = [-21385, -6494, -1342, -2430, -4895, -5448, -924, 4011, 1696, 9638, 14192, 14599, 11833, 14794, 13028, 3945, 1227, 4969, 4671, 7432, 8473, -3702, -4710, -4413, -3042, 4118, 13302, 9210, 2501, 4860, 8019, 16252, 2417, 7680, 11204, 16129, 17973, 8927, 12001, 20222, 16008, 7055, -4311, -3266, 4471, 4767, -4420, -3846, 9786, 11025, 15689, 23684, 40996, 38870, 10728, -7996, 235, 18003, 26488, 33379, 6303, -1333, 11789, 21561, 9472, -1766, 3766, 12305, 26277, 27928, 26434, 15563, 4586, -2402, 7777, 17619, 14932, 17625, 18412, 6130, -5958, 1375, -990, -13504, -10886, -2158, -4508, -10730, -6175, 2595, 13829, 201, -6658, 2541, 8786, -1429, -4299, 1271, 11367, 19519, 14560, 3604, -82, 8109, 10690, 5597, 3394, 13283, 12307, -782, -846, -7293, -19323]
15067a9323l223N486J6643Q167r163j4M380P413M29o309o508j054L938j292l12
15052g42o91j3028n12K182L924n029O508j4211l342J4156J1124J3533Q249q499
15038A3622j2800p30J5012j4831R77M930j6926j2888p185J2848J2058m092O377
15025c628M650M098k870l879R296L118j251Q67k491j2964l616Q584K985r759o952
15010a3812K616k754j696L287O739J552L598J2470J3396Q569O105K6538K7130
14997I3738J3353k2698l0458j8282r02n735k746l701N018j866l645r383o594J3500
14983A9599k916r890q026n272n008r593P802K517j031N831Q964J0661J3981J1136
14969C8755p155p901j1489K589p886p452q896K708N488l766o366N136J714O335
$$ y = [-19323, -22546, -17060, -417, 7750, -1413, -1427, 2953, 10366, 10795, 4486, -2022, -3076, 862, -430, -742, -1433, -14461, -14973, -12791, -8867, -13896, -7388, -21599, -24941, -10785, 339, 13872, 22121, 13622, 822, 92, 15104, 273, 1250, 6180, -10746, -23634, -30819, -17971, -5913, -10005, -3628, 1022, 5120, 2250, -1629, 7667, 10785, 9534, 10401, 7910, -5054, -8670, -86, 2899, -6860, -13812, -11196, -13950, -15646, -12359, -5620, -4068, -470, 12000, 25396, 33965, 40070, 66608, 93738, 107091, 84393, 53935, 35653, 34751, 29016, 26270, 22569, 27587, 25721, 22076, 12693, 6099, 19599, 16683, 6793, -1233, -6505, -11513, -21106, -13304, -10787, -11818, -5987, 2977, 13638, 27619, 38755, 31600, 23699, 12210, 14799, 6913, -539, -9435, -6727, -1239, -5005, -11371, -6235, -4521, 1814]
14955A814K167q847j087J2091K335l627q622K628J0654J0748r039j1996M107k975
14941C51J208J299l049M887K772k964m120O578M580K967J486J812k007O824j2330
14926A0294o580j2423J0502K5065J4479M206j0936j9410k0100k642K6078j034
14914A7499L539j628K661P119n489l871p160j0886K030J0216O728l140j1332n221
14900A065J4439J0013K217K567k4609k3723N222K0199K830j0953M071N994r488
14887a56m003N924K445J2286Q827q718j3864L117K699L3J968J4947O825m323j1794
14872A6213k001r103K574K624O147j162r167M914j608j2410J028J1685n623q593
14858d482L254J1524R957m163j2327o117N944J0771Q866j7988j3848K236P923
$$ y = [1814, 3981, -4866, -5953, 6138, 8473, 4846, -3776, -1148, 9506, 20254, 11215, -781, 3326, 351, 1559, 2858, -191, 4696, 7468, 4504, 384, 6962, 11542, 14509, 15995, 17807, 15800, 22624, 10294, 3714, -8709, 1793, 26858, 41337, 45543, 34607, 15197, -4903, -7545, 18533, 17499, 21038, 19410, 22071, 29190, 23701, 19830, 12670, 1784, 3814, 14030, 20758, 17618, 6286, 1065, 15504, 25517, 27734, 30301, 5692, -18031, -12809, 7390, 10220, -733, 3338, 9332, -156, -4159, 1765, 4210, 16496, 25323, 16605, 2741, 5858, 8557, 8590, 10558, 25505, 32330, 28007, 16213, 14212, 5109, 7683, 10307, 16454, 15292, 6125, 11039, 9431, -2979, -1951, 9734, 4111, -4482, -1228, 10296, 20253, 16090, 3763, -2354, 3590, 14361, 23227, 5239, -8609, -6373, 1550]
14845A550q691J61L917J0211P900m656J0375o603k890q396j4918J0636J4461J4000
14831B7057L34J913J211N395Q295j5539j3151q49R57k316j2392r837M433R575
14817E086q122j1658j4759J0667K2724L872k219j493j1674j1435J4843J5052j354
14804I530j3335l461J0333j123j0240k284j9Q480K110L681J6729k310J3066j0994
14790B0163l811M727M732Q714n718p122J429J5288o764j0264k479m790o341j588
14776F176o325m387m325R948R640J3195M908j0531j1456K934r872k846K863l75
14762d53J0173O086M213q087j044K512o841j630P869R614J372n665j883q035P23
14747H924J9674l534m374l873K028l102j67j6160j4027J539l022L804J2351J8931
$$ y = [1550, -7141, -6980, -3063, 7148, 15048, 10392, 20767, 14164, 11274, 2878, -12040, -1404, 13057, 27057, 27391, 29304, 30515, 35910, 44205, 28666, 15515, 14666, 15623, 13307, 915, -8922, -4489, 5086, -3036, -14694, -29453, -18786, 3938, 7810, 5591, 4098, -7576, -19011, -4168, 10884, 9530, -3805, -7266, 3067, 1944, -8296, -10580, -10599, -2119, -9, 3672, 20401, 18091, 31157, 20163, 16352, 21079, 25811, 34525, 28807, 21685, 23114, 38402, 31638, 21374, 18895, 14105, 7764, 6176, -149, -4536, -8861, 1087, 10727, 23922, 28830, 18299, 6843, 9777, -95, -2941, -78, -453, 9720, 15806, 20019, 11932, 10888, 13400, 6559, 4929, 12798, 22412, 23784, 18119, 16236, 8201, 8924, 28598, 25064, 20690, 16817, 18845, 15743, 15576, -584, -14611, -13072, -16094, -12290, 61, 18992]
14733A8992J2385j796q357k0182m030J3660K341k610j3480q836R310N141m011
14720a473j3023Q348L784m649J0863L353p219J3683J4746M546n385j7003j9810
14707i239P544M388l521M037J468j0529L009P888P35J4160Q475j0892k576j746
14693A3201m174O544J5546n520j5431r693J964j242m576K462O196Q798J3291j4443
14679A2923n163L554K0834m804q384J360j0689k0921Q447M024p906M006j0162
14666a2881J6048J7660l564n728O46J419L663M597q315j5849p953O3R042J7763
14652A6611J0594r934j0474l707j1631O53J2714J169o136j239R484N375Q124Q578
14638C0181P302j1973q716r299q44J2897o445q085m04J048p228j999K01m24P235
$$ y = [18992, 31377, 29581, 21224, 1042, -2988, 10672, 13013, 10403, -3077, -11913, -2603, 2538, -1473, -14496, -6148, -2364, -7013, 3850, 7203, -16, 13667, 28413, 32959, 27574, 10571, -9239, -1695, 2693, -828, 3209, 4677, -5852, -2843, 5045, 5780, 19940, 28415, 17523, 14947, 13201, 9027, 15571, 31117, 25597, 10166, 473, 2437, 1195, -3381, -919, 5277, 14075, 27366, 12923, 7760, 11314, 32148, 27344, 18960, 20320, 9631, -11290, -2843, 1181, -6725, -2719, -12881, 3167, 20827, 17263, 11535, 12181, 13600, 17263, 21860, 13545, -2304, -10257, -10194, -1152, 16611, 27205, 17271, 6797, 3090, -8541, -7888, 4826, 5995, -141, -1380, 8104, 13479, 21603, 30181, 37483, 25510, 16794, 7495, 6651, 19548, 13103, 5018, 4614, 5662, -1566, -3565, -3364, -3788, 3447]
14623C447J6542O84k3218p981J1816L915M104K840l466m651j4698k113J0972N108
14609C301j304jL221n72Q47o397m797L408p67r281P642K364M887K880n045M925
14593E311J2518k352o637o695N4n419n086J1356J0584M864L24m978J3289j3506
14579A3627j8014R772j203q366j299R933l419j287K738p092p95L067L670j0022
14565h690k267O233m03p335R260n49L489P538r12p536q605M228k348M962R881
14550F946j0778p33K396p315M556N873N539O28n903k348O756j792M282M617P508
14535B0232j1632o071L138j345r237O03J1144J7716l052j900J328k215n233j6470
14521b994k558K515j428J0433J3915J0865j0448L763m233j4545p162J7420J078
$$ y = [3447, 19989, 20673, -2545, -10526, 1290, 5205, 9309, 12149, 8683, 4032, -10666, -12779, -1807, 3301, 1997, 1996, 5217, 4645, 5492, -905, -5702, -2294, -3061, -12342, -4700, -2336, 2551, 5431, 386, 5311, 17829, 15477, 8840, 2145, 2199, -3220, -8306, 3050, 13634, 18498, 18822, 13844, 27133, 13627, -4387, 5385, 4182, -4184, -5483, 4450, 1031, -256, 2482, -4610, -5405, -2338, 1332, -8690, -10957, -4724, -5127, -12462, -3202, -3751, -262, 7276, 6364, -1172, -9777, -5549, -7897, -2935, 6946, -3832, -4565, -2169, -9484, -4928, 945, 6484, 7112, 1209, -1139, 5617, 3825, 8107, 12724, 20232, 8600, 2529, 5667, 4322, -4915, -4312, 6832, 24548, 21496, 19596, 20924, 18709, 13476, -2994, -5552, -3037, -4465, 5968, 19883, 30748, 20300, 24063, 19830, 5285, -1877, 15543, 16621]
14508A6621l342o906N744J1762K552o817r363j2005J560J501j9068P946J5924
14495F109m2R285Q3r225j3963m977P295J2005J6378q080j8525j1832O093N408
14481c988J464p34k662O306j010N163O831p180N719k78J2501R290L906j3971j6882
14466D475Q747Q437j168l358j826Q642k629j2913n763j0503M0k533o359o953n349
14451b9013J168J0725J1867R624r541p629n684L288Q111k346M491J0215m410p352
14437f486j78J1581P248p356K964M224j1424o032J2126J3287J033m178j7359o937
14423g487K042Q756L567p391O539m345j2532n595P658Q68P100l386m577m64m311
14408a3558j681J7778J8365O027m685J0741o967j5093L480J3079j3293j2618J0638
$$ y = [16621, 13279, 6373, 12117, 23879, 26431, 19614, 10251, -1754, -194, 1307, -17761, -9815, 6109, 6067, 15352, 15435, 6210, -7753, -12730, -5435, 6570, 22948, 14868, -3657, -15489, -9396, -3988, -2524, -3258, -5920, 386, -624, 4539, 11370, 4190, 9909, 9631, 22132, 31422, 35328, 21357, 4475, 13222, 21659, 20491, 17133, 15307, 23949, 21320, 8407, 2644, -7859, -7819, -10352, -16711, -23664, -29013, -27845, -17120, -5253, 4371, -5170, -12799, -18483, -15195, -7084, -9430, -4939, 5276, 866, -6486, -6664, 4917, 12165, 4809, 7773, 11997, 573, -5459, 6667, 19954, 20987, 16809, -550, -7487, -5445, 3311, 6878, -513, 6026, 1681, -10851, -16446, -8788, -7920, -820, -4206, -8783, -9247, -13558, -15239, 2539, 20904, 26931, 22246, 32987, 26020, 10927, 14407, 27486, 14193, 1575, 12213]
14395A2213O591L657J5673r182K549J764n206r665p03J737o814k291n884N404
14381I843Q650l941L711L84M537K053j288m396q365j0625j3439k325O087M464
14367d650P278P953K1662N885J86j0563J380l033o853q436J216P188j4307N613
14353A0519J2383j4855p831k286K532q330J4305K0793l068j5944q068J623M51
14340B224J0220j178o570q128j2829k951L408k294N976o782j523J8636J6686j035
14326A3860K038m496k3285l126J8335J946M089K116r84n550p051q25N408M040
14312F515q421l639k857K220M665N122L2Q366o06q859j340L644p967r621Q753
14297c993J8499L323n455p791j4051l238J5797P419M364J439M917J1249q636r907
$$ y = [12213, 18804, 22461, 38134, 28952, 31501, 33265, 28059, 18394, 17691, 19428, 12614, 10323, 4439, 9843, 18493, 14552, 18263, 18647, 23184, 25237, 23949, 19553, 11188, 563, -12876, -15201, -9114, -4650, 2628, 10581, 32243, 38128, 38314, 27751, 29131, 26098, 19245, 10809, 12025, 19213, 4906, 10519, 22902, 8047, 216, -2070, 462, -7868, 6437, 27230, 24162, 8218, 150, 1773, 2224, 12444, 11266, 4696, -3432, -16261, -19212, -15804, -18098, -12122, -18904, -20427, -1791, 14895, 13860, 15898, 11402, -11883, -15009, 3326, 5272, 9361, 11477, 10493, 4943, -2108, -2933, 2475, 6515, -1906, -5545, -8402, -6182, -1517, 3605, 3637, 12003, 11397, 2538, 1198, 4842, -3125, -12746, -3993, 14506, 17829, 12374, 4583, -9468, -12706, 3091, 10510, 14874, 16313, 21230, 32479, 23843, 13936]
14283A3936P595j0003n599O683o397K84n426j3393J318K046Q210r373O700R228
14269E809K653j2466l015J5841l477Q91j0282N286J2689K34j0649M782J2426Q434
14255B9156p831p430m716k222O678L386q06J086K553q849K625k98J234j1150o280
14240b864q456K245J2836R101o274J438N271M776l548q422q420n772J5832M418
14226A2161R773J0254q056r364q82l527P983J3865q43Q4q254j134j2548q612P967
14211H867l454q078o014k94N858R590Q460k096J299k527j6699l261Q835R481K3912
14196C3879k642o815K595j118k798K716n999o004p411P104J0930M952k374n220
14182B1795j648J322n513j1796j616n679L590m105k882m170R620K781p581n680
$$ y = [13936, 21531, 11528, 5929, 12612, 6215, 6499, 1073, -12320, -11002, -8956, -746, -10119, -3419, 5809, 8462, -4004, -7019, 8822, 5345, 6236, -4046, 1240, 13929, 14163, 3514, 8296, 20722, 29156, 21325, 13895, 9179, 6957, 13635, 17021, 16215, 17301, 19854, 11005, 13630, 13332, 14566, 3416, -2864, -11320, -9075, 3761, 12862, 6588, 8026, 13297, 18073, 14525, 6103, -2317, -8089, 7743, 12161, 21934, 32188, 24132, 14768, 13886, 10359, 18342, 32207, 31364, 31448, 23194, 22060, 9512, 900, 8867, 5413, -2665, -8679, -8973, -3115, 6475, 14935, 12839, 14138, 11611, -5088, -8349, 486, 9967, 33879, 31237, 24422, 27017, 25899, 23101, 25817, 19818, 13814, 6403, 13507, 24437, 29389, 27015, 21795, 20147, 21469, 15956, 4160, 2544, -3135, 455, -3650, -6532, -10702, -1082, 1699, -5882, -11562]
14168a1562Q230J5136j868N51k944n937J438L006R536P849m585j3147K720L677
14154A2100l563k612j786l146o156m629j4849J1813M915J774J515R032k830l155
14140a577J3443J2912j833q961O280L198J797j4124n723J0918p588J0417J881
14127B1040r499o900m801Q26m384J390q706o87k670k007L219J6l827J713O147
14112i130J296N959m437j389J5566n739m110K883Q008o465l966L530m707l123
14098e824J480k097J81J676k123Q313P665J117J4409J780k62K991j3993j3660
14084A653L193o822K021K036m918J347j814o541n52j61O675N208l308Q195Q127
14069A4339l230J101m753k843j0200P188N815J37Q94j582R30p97J0279m893m413
$$ y = [-11562, -3332, 11804, 9936, 10487, 7543, 1606, 3044, 6050, 15586, 23435, 18850, 5703, 8423, 12100, 8537, 5925, 4139, 993, -5163, -9792, -24641, -12828, -7913, -6139, -4624, 4408, 1578, -1577, 11866, 24778, 22945, 13984, 20264, 23462, 25259, 11135, 5412, 16330, 8742, 19159, 21040, 11541, 4641, -160, 666, -3718, -2328, -11034, -11721, -14391, -16398, -13179, -13163, -16990, -15277, -9130, -7834, -1875, -6312, -7701, 7865, 2126, -1984, 899, 8907, 2442, -1524, 2006, -2701, -5824, -4344, -6441, -6260, -4584, -6707, 1606, 9271, 10388, 24797, 26577, 26315, 29306, 15313, 1653, 4846, -1976, 45, 2081, -2837, -1490, -3304, -9845, -10397, -10558, -3883, 1325, -1983, 6212, 14339, 11109, 12210, 7457, 4614, -5586, 1602, 7417, 7554, 8448, 6866, 7796, 6999, 17278, 12385, 7972]
14054G972P094R178n830l621q706J5073N518n864o909K520j4820K724J2334K322
14040A8985J1609l787j7311m529J2872J365j3473j2669j8764j275Q604J1186M539
14027b648k434j086j2352P153K1823J0857n390m365N784J830L234R420j069j5411
14013A5346j2842R53P12q28M411J0687r458j2312J0019j710j6000J5692J1635
14000A6305O037K092K869K697j0304m558n424L330L866n338o862j395j2126l936
13986a2747J7925M473q075j4517p86Q663k058O248J5888N032q938q909J0464J3306
13972B5969R022L694k157K875O4p888r469n931M416n895j7595o388J6225R755
13958A6697r87L840p525j5486K910P501Q85o956J2424M110j1114k867n538r130
$$ y = [7972, 15066, 24244, 18414, 14793, 6087, 21160, 26678, 20814, 13905, 16425, 1605, 4329, 16663, 18985, 30594, 26807, 9496, 4967, 17839, 19204, 5731, -6938, -25702, -26977, -18373, -7187, -2648, -5082, -6168, -18520, -11367, 10456, 21313, 15923, 11558, 17342, 19172, 22406, 31826, 30757, 15346, 2504, 3457, 4169, 3341, 7752, 18439, 8981, -3331, 6688, 4978, -11022, 4670, 16305, 22342, 24434, 27303, 30000, 19696, 15138, 9714, 13044, 16910, 11572, 4710, 3315, -8811, -12747, 5178, 9651, 1576, -12941, -13727, -5064, -7122, -874, 15014, 20046, 11108, 2199, 12663, 25969, 34991, 38685, 36528, 39403, 39467, 31579, 22110, 16179, 20595, 14700, -2895, -9283, 6942, 16697, 15710, 19550, 12025, -3461, -551, 6950, 7835, 879, 13303, 17413, 6299, 3432, -2106, -11236]
13944a1236j070o48K0329R126n500j446K007O192J849r701K2615J7672j0813L102
13930D2478m127j4809r258m568R17R249q810j1907j2994l934J0882J2989k387
13917C721q487O96J3706L754J2873J3912j5174j7628j2354P362J2513l044P111
13904A8961K791k404M291j2803N47o716r50l576m859J0786L49n968J6857j958
13890A5348l845L542k7L774j0145J673J0679q354M577j255K266j0698m996P516
13876A0055p575J24l274L782N558J808P77o899J8285N860j396J013J2293Q938
13862D9349p980p924j1386l101p686o6q276o861N580q941j4643J3025R557L555
13848D202Q681J0117j025m219n085P295j0756j7408P404O227L847Q87r777n47
$$ y = [-11236, -12306, -12954, 7375, 16501, 11001, 9555, 11562, 17754, 19603, 9902, 32517, 50189, 39376, 42478, 38351, 23542, 14284, 9716, 10633, 19882, 11072, -835, -13829, -17763, -6881, 6108, 3721, -4766, -4070, 9636, 13390, 26263, 40175, 25001, 7373, -4981, 2381, 14894, 11850, 18961, 21752, 19348, 23639, 10836, 11383, 4667, 3717, 141, -4718, 6068, 6417, 449, 17306, 15348, 11503, 15045, 15018, 18792, 8647, 10320, 20999, 12645, 17222, 15967, 18233, 7535, 2539, 10055, 2480, 2604, -670, 3112, 8670, 10478, 11255, 4356, 22641, 28501, 27105, 28118, 40411, 49349, 41369, 33445, 22059, 18958, 11272, 11206, 2930, -3931, 1649, -7292, -21935, -8910, 647, 4202, 12883, 23000, 21975, 17756, 12671, 19966, 9210, -8198, -794, 5433, 9280, 10167, 390, -157]
13834a57k214O188J3662Q092k1600O433J4112J302O115j1356j2687J1015R37n81
13820A9261Q750q684q909p315m951p47N488O175r162m120j086N290m417m55J3683
13805H801M992j1501n116P890k988K067J982K802K733J692N023r671O526N544
13791B0776l11L911p689J136j461J74J1416n085n668n880k542M272M482m924o045
13776F562N62P450J0895O201j0403k25r686j4148p346K414O553J6789m639Q40
13762A1819K61j3810p27J4285J9852n468o685j2294r999q832r057l345K2477J2009
13748A0486L225O143J43j765k961j1739j0234R153m397J121O390Q565q247K404
13734H287P699k731o687r063K136J1343J0809p742r722N132k178n354j5673K717
$$ y = [-157, -2371, 3817, 17479, 25571, 3971, 10404, 24516, 25818, 31933, 20577, 7890, 18905, 19842, 19261, 28011, 19327, 10418, 3103, -1848, -2595, 2893, 9068, -94, -4214, -5300, -10, -4427, -4882, 8801, 13793, 2292, -2824, 5066, 2078, 4145, 6127, 8929, 11662, 13354, 18377, 8706, 15232, 20776, 20465, 24376, 16687, 17823, 16362, 16536, 27952, 22867, 17199, 11319, 8777, 13049, 17531, 12607, 6562, 7124, 14574, 25469, 31670, 21267, 21042, 11356, -2792, -10138, -7724, -1171, 15618, 10979, 11819, 12080, -1730, -2457, 11828, 31680, 26212, 19527, 7233, -2766, -11598, -20655, -24000, -1523, 10486, 13711, 19854, 19997, 18232, 15271, 3532, -6702, 2451, -1946, -825, 5565, 14130, 5883, 8287, 15986, 13255, 6568, -2495, -359, 10984, 21793, 14051, 4329, 9461, 7283, 1929, -13744, -11027]
13720a1027R797J2124M716n368q48r92p109n105J2141k860M403N713r80J5750
13706C0355P941j6772j7206p950j245J2227O998j4203K151O042M209L913m178
13693A2282l984N884N663J053p962j1332m018n434N161J1177P011J2232n027K374
13679B5080j773r968o583L972L494p843j027J0934l739J283P861n145j1758k1384
13665a6596M287J524J1666L354q93O275J0257N997R007j0011j5466r185j930K239
13651E25R689J1048j432R400R064K546q816j9866m734L264N865K105j730L094
13637B0022j3723k105l547N877P568o666N530j1010O147J0232R766k850m393k13
13623B0635R515j735j5850j0068j1066j742K8484J7004p969j3623r204M649K725
$$ y = [-11027, -1230, 10894, 15610, 10242, 9394, 8402, 1293, -3812, 8329, 5469, 9872, 15585, 14605, 30355, 38296, 21524, 4318, -3632, -4877, 7350, 14348, 145, 2296, 8338, 12547, 16460, 12282, 8298, 14182, 19845, 20898, 12936, 1604, -2414, -7848, -2687, 8490, 15501, 27733, 22706, 25080, 23307, 13339, 6756, 10728, 14222, 6379, 5352, 16286, 12547, 13830, 21691, 16546, 4788, -16596, -12309, -10785, 881, 4235, 3342, 9617, 19874, 25871, 34878, 24867, 9401, 216, -1714, 525, 10214, 21262, 19830, 29230, 38294, 40840, 32024, 12158, 7424, 10688, 16553, 18658, 16928, 20022, 6299, 4194, 647, 6524, 14092, 7426, 12956, 1946, 8093, 18325, 28091, 25241, 20848, 20635, 30150, 28415, 12565, 2497, -8569, -10311, 18173, 35177, 27208, 13585, 4381, 9030, 11755]
13610A1755J5568n637j367P530j061m278j791j3384Q701P054o706j2572n267R252
13596G797N475J407k652j031m502J032J5991o083j3143q290J570J5742N966j341
13582A7938N927n683L661O162P894o020k173k886r215J1539K046L184N723P575
13568D5672O302k523k541j680M98o014J325j2082j9934K185p143k800M980J5456
13554B1701j066p586j8558J262J3441R148N672J889k239J298K027j1929r006k113
13540C941o59j947o307J570K390J0735O630j184M314P406n584p570o871J5523
13526B2387M830M036l208K072K869p540m533m9j993J020p650j681J160j4376N739
13511C083N883O641J599p259k106K324J1168M983J734L615l4J252N89r254r356
$$ y = [11755, 27323, 21686, 20319, 27849, 26788, 22510, 20719, 7335, 16036, 23090, 16384, 3812, -1455, 7797, 13272, 14679, 12027, 10996, 6494, 7526, 23517, 17434, 4291, -3999, -2429, 13313, 19279, 17938, 23865, 18182, 21843, 28005, 35899, 29879, 27706, 24820, 15605, 27144, 29190, 32374, 38097, 45672, 51974, 49451, 46910, 45230, 45728, 39714, 41039, 28957, 9023, 11208, 4065, 1265, 6245, 21701, 20635, 13049, -5509, -4247, 9194, 18342, 24014, 25903, 23664, 24962, 26989, 15060, 6054, 3941, 3282, 1335, -4972, -3402, -1012, 9723, 16353, 15169, 19483, 26889, 21305, 13735, 6864, 22387, 27217, 31253, 28045, 30117, 32986, 25446, 20913, 20864, 18871, 19891, 12241, 10560, 11720, -2656, 3083, 8966, 15607, 17206, 9947, 7841, 10165, 21333, 26316, 28050, 31665, 31631, 32883, 33472, 24218, 14862]
13496A4862n142O352n639P581K0981k671l526j5266j0568m808J6586K3119o334
13483C5527j1291o315l850Q34O300k270J0994O050k078J405l520o308k070j2433
13469A0975P307O589k392m424k208k40K390J021N82R573J2280r446j0483o910
13455A4614K124K575J1353Q705L116n039q895k624K598j774J8827J2699o415N404
13441E7268q858n566m784J008Q744M300o593L010l396k919r699Q866r14R68O062
13426D7497J1375K73N400r289o722K037q795o997O891M72J857J8740J7510J2934
13412I3183J2165J5379J4217K2348L0098N0124O5993J02069J93952K98235M56893
13401A354656O83264L96501m37045o29674m16876k17912j28755q5579p6300p3790
$$ y = [14862, 9720, 16072, 10433, 18014, 38995, 36324, 32798, 17532, 6964, 2156, 18742, 41861, 35527, 24236, 17921, 14071, 14905, 21205, 18935, 29929, 35979, 33901, 35306, 31786, 25478, 23408, 10975, 18282, 24871, 22479, 18055, 15847, 15607, 17997, 19018, 19600, 29173, 41453, 32007, 21524, 14614, 16738, 19313, 30666, 39371, 42487, 37448, 28553, 25929, 28527, 26753, 45580, 58279, 51864, 57268, 48410, 42844, 38060, 39068, 47812, 52112, 45519, 48529, 45133, 42214, 32515, 41381, 40467, 41435, 47497, 58872, 59145, 64545, 55256, 48534, 50571, 41776, 34779, 41670, 42142, 43999, 62739, 80249, 93183, 105348, 120727, 134944, 157292, 187390, 237514, 303507, 405576, 599528, 897763, 1354656, 2037920, 2434421, 1997376, 1367702, 950826, 732914, 604159, 518580, 442280, 368490]
13391C68490n3610m4156l3573k2834j7819l3486k3098J496k7744k1894r955q313
13379G3504k939J1644m973j6150n044M020L908N59q80M926j5244j1908O509R627
13365E7559Q037K312q299m542j4870n035M181R081p764o197K849q075j8724r47
13351I566K4008n49j92p74P129P756R077j053k758q180j7438P613J2298j696J0273
13336E5080J263o123j5151m983K325P436m02M387p62K232P912j87n125n713j3566
13321B8623k988j5424J859J0280j2706J0764R889j0074J6693J4054o572j3744
13309C0654l351k413R121K940K835m216P456O597K688M661J5386Q433Q920k0171
13295F9540j4436M129J253j4284o237N152n78l457j5803j164J4688J594q070n709
$$ y = [368490, 314880, 270724, 237151, 214317, 196498, 163012, 139914, 141410, 113666, 91772, 81817, 73504, 70565, 82209, 77236, 61086, 56042, 60062, 63970, 64529, 63649, 68575, 53331, 41423, 47932, 57559, 65596, 67908, 59609, 55067, 40197, 35162, 39343, 48424, 40660, 34463, 37312, 29237, 10513, 9566, 33574, 33025, 32833, 32059, 39188, 46944, 56021, 54968, 52210, 44030, 26592, 34205, 46503, 44807, 55080, 56343, 50220, 35069, 30086, 32411, 39847, 39445, 43832, 43070, 45302, 53214, 53027, 47902, 42189, 28623, 25635, 10211, 12070, 22350, 9644, 20408, 30297, 20223, 36916, 50970, 44398, 30654, 27303, 24890, 34011, 36951, 39786, 35570, 43026, 49623, 52311, 56972, 72358, 80791, 89711, 69540, 55104, 59233, 60486, 46202, 39965, 45117, 44539, 41082, 25279, 24115, 38803, 40397, 32327, 26618]
13281B6618M361J0117k928j5021J398K6880J3727J245M005j3464m157J2136j0606
13268E4311j0366J633J3145P277J0281j0010j2466K163n98k709P474r3O42N937
13254F6621k147r451J595K361k171N231R817Q81Q963j289k5181r646j7275j1416
13240A6893k4092j6191M853J3547J0556M0926K9253o031r401p125J646P633j61
13227F2306r526j1167K503J4976O935r30j191P127m342L626J1320n798j2304L590
13213F7125O179l048j4179n208K0487J3479n824j5764l716J4354K8565j027L448
13200A04871j4407Q582l220o826j689P831Q97J7337M5350P1088N7986K4887l8692
13187B73995o3144l6048k5556N119M795L029k944j454j5632p551m036j8699l690
$$ y = [26618, 30979, 41096, 38168, 23147, 24545, 51425, 65152, 66397, 70402, 56938, 52781, 64917, 54311, 43945, 45578, 58723, 66000, 76281, 66271, 53805, 55968, 55370, 52661, 60135, 60042, 60684, 66621, 64474, 55023, 56618, 58979, 56808, 62039, 71856, 72737, 81700, 80411, 55230, 45584, 28309, 16893, -7199, -23390, -18537, -4990, 5566, 46492, 75745, 69714, 60313, 53188, 54834, 62467, 62306, 52780, 41613, 44116, 59092, 66027, 65097, 63906, 71033, 66691, 70317, 81637, 75839, 63535, 67125, 73304, 70256, 56077, 50869, 71356, 84835, 79011, 63247, 59531, 73885, 102450, 101423, 104871, 90464, 99046, 95826, 89000, 87311, 95142, 96039, 113376, 158726, 229814, 287800, 312687, 273995, 210851, 174803, 149247, 154366, 159161, 162190, 159246, 157792, 142160, 134609, 130573, 111874, 108184]
13174A08184p173k038p195J703j0183j4852j0060O628J420M741j4892j8492Q037
13161D5828K582L799p521j1194O860M109l744R322j164l569J4727J9636K272m800
13147G7143j4888j1530M55J3269p228m089l316R333m22l1555Q07L8733K5802O722
13133I9236K0889K2494J2447k7403l6106O09K4377N7429J3786j7119k0245P743
13121A58137J0946K651N622R161M351l350J1879J6444J5143K0451K4177L1822
13109C07434L4483O9336J11711J54832K39144L61489N33024N76264O7754m89201
13099A966270n07663l34287j83905j18953r1704q8574o7433l7957k7957m8081
13089D59756n2178l1590k0390m1520m4403l9465k4664n368q025o202l154j805
$$ y = [108184, 101011, 98973, 91778, 93481, 83298, 68446, 58386, 65014, 66434, 71175, 56283, 37791, 45828, 48410, 52209, 44688, 33494, 40354, 44463, 40719, 50041, 48877, 45308, 60035, 79671, 81943, 77143, 62255, 50725, 51180, 64449, 57221, 53132, 49816, 59149, 58727, 27172, 27979, 66712, 92514, 99236, 120125, 142619, 155066, 127663, 91557, 92166, 116543, 173972, 187758, 170639, 150394, 158137, 169083, 171734, 177356, 186517, 190868, 187518, 199397, 215841, 230984, 251435, 275612, 307434, 341917, 411253, 522964, 677796, 916940, 1278429, 1811453, 2387717, 2455471, 1966270, 1458607, 1124320, 940415, 821462, 729758, 641184, 573751, 535794, 507837, 459756, 407578, 375988, 355598, 314078, 269675, 230210, 205546, 200178, 192153, 185951, 182797, 180992]
13077A80992l868R811R053J8115J0628L767q089n343O337Q993Q203j026l302M418
13063B38689K2506J2657M291R634O764q132o829k266K190N294J7058M145j150
13050C04851J6726j004m623o803j2070j4129j7498N344p073j8417J185K3548J8736
13037B88773m050l833J351q15O240N136m825j083J914J1035J5232N388r273j3858
13023B97332O011J2631J4815J2979K2744K9305K4185K248p567o467r356j3476
13011C85384j7617j4904R334L5887J5515p146K5502L1816J7929P343K8028M7432
12999E64503M9296L5196K2276J8079M1466N3340M5906L354o938J884j2605m401
12987H11356K5815L2422K828k8751j1870K0188M6325N3936M3857K8635K2552N2353
$$ y = [180992, 177124, 186935, 195988, 214103, 224731, 228498, 220409, 215066, 221403, 230396, 238599, 237573, 234271, 238689, 261195, 273852, 278143, 287777, 294541, 286409, 279580, 277314, 279504, 284798, 301856, 306001, 304851, 321577, 320573, 315950, 309147, 297077, 282948, 265450, 270794, 263721, 245304, 246489, 270037, 288773, 284723, 280890, 282241, 281426, 287666, 292802, 287977, 286894, 288808, 299843, 315075, 320463, 311190, 297332, 303343, 315974, 330789, 343768, 366512, 395817, 420002, 422250, 414683, 408216, 398860, 385384, 367767, 352863, 362197, 398084, 413599, 406453, 431955, 463771, 481700, 489043, 517071, 564503, 613799, 648995, 671271, 689350, 730816, 784156, 830062, 833416, 826478, 828362, 815757, 811356, 837171, 869593, 872421, 843670, 831800, 851988, 898313, 952249, 996106, 1024741, 1047293, 1099646]
12975A099646Q8724J01035R6214R7444Q2519P4646J13523J29423J41374J52325
12965B176873J35866R8655J08518J91448K09577K00680K62518L55092L48071L37706
12955D425004L97190M98527O45636P64331Q29313J070995J509342J945317J894197
12946A3979852J671984K355852L720615N515462Q099441J2580893K0174000L1903086
12938A00001185M9423837P8979547J23816327R9339644o2932679j19983035q1892857
12931A86751969m5910368k6348178j8414132j6591931j4790875j1713361q926403
12924D4056721o838339n074185l995644m076194l832759l221806k707246k181631
12916A2128917j756001j446379j155029r33980p11968n46356m79530l93804l36493
$$ y = [1099646, 1188370, 1289405, 1385619, 1483063, 1565582, 1640228, 1753751, 1883174, 2024548, 2176873, 2312739, 2411394, 2519912, 2711360, 2920937, 3121617, 3384135, 3739227, 4087298, 4425004, 4822194, 5320721, 5966357, 6730688, 7560001, 8630996, 10140338, 12085655, 13979852, 15651836, 18007688, 21728303, 27243765, 35343206, 47924099, 68098099, 100001185, 149425022, 228404569, 352220896, 451560540, 388627861, 268644826, 186751969, 140841601, 114493423, 96079291, 79487360, 64696485, 52983124, 44056721, 37218382, 32144197, 28148553, 24072359, 20239600, 17017794, 14310548, 12128917, 10372916, 8926537, 7771508, 6837528, 6125560, 5579204, 5099674, 4705870, 4369377]
12907D369377k76923k71746l03805k62976j68522j17187l0449J12475K00591m9760
12897C201075m49407m42875k92559j92649j54519j28224j23830j20772r6506p1555
12887A128179o3738r9772r7389n8239m5279l1677o4664n7446p4353p4530k6722
12876D34370o388M704K803j8618j8409j1757j530J2093J6213j221J1171J0815
12864D34246K3277k4764p289J0184q045j5518k9996k6837j9656j4851l7444j9782
12852B63525p52K4892K2334J3387K3111J4220K3136K9770M3492N2293R5667J54515
12840G59590K54282M08175O71123J136070J430440o7672j324495j030292n56648
12831A680573k98255j92196j64639j61076j17819q4476p8574p9491n6611m5291
$$ y = [4369377, 4092454, 3820708, 3516903, 3253927, 3085405, 2968218, 2937769, 3050244, 3250835, 3201075, 2751668, 2308793, 2016234, 1823585, 1669066, 1540842, 1417012, 1296240, 1199734, 1128179, 1064441, 964669, 867280, 809041, 763762, 732085, 667421, 609975, 535622, 461092, 434370, 427982, 432686, 435489, 416871, 398462, 386705, 385175, 397268, 413481, 412260, 423431, 434246, 457523, 432759, 425470, 435654, 427609, 412091, 382095, 355258, 335602, 320751, 283307, 263525, 262773, 287665, 309999, 323386, 346497, 360717, 383853, 413623, 457115, 509408, 605075, 759590, 1013872, 1422047, 2093170, 3229240, 4659680, 4592008, 3267513, 2237221, 1680573, 1382318, 1190122, 1025483, 864407, 746588, 662112, 583538, 504047, 447436, 402145]
12821D02145m5103m5847k6951k4841j8890n13J3335K4448M388r049q244L169M2135
12808C10182P1333J3767l6857m6976m1924l0366j8665j2286P96k5182k2904L54
12796A61272J0431M489m77j2914j1016J387r770l878Q937l464j7457j4047j7217
12783I6276l9644j7106l915j9099j8263k0081J7947R051n483O865K536P561J4708
12770C1353K3061K627k801k650j5951p879p46J5064Q118j3839q536l272l786j708
12756A9055k125K207j4999n12N678K1538n397j2446J2381K1157n318k9536q252
12743C431K0220J5808N674k2627l4637m703Q363J2228K5596K6582K9993K1324
12731A07252p898o848n486q581j048k764J54O039j5299j6474R655o008J649j0143
$$ y = [402145, 357042, 311195, 284244, 259403, 240513, 240000, 253335, 277783, 282171, 273122, 264878, 268047, 310182, 381515, 395282, 358425, 311449, 269525, 239159, 220494, 208208, 209004, 183822, 160918, 161272, 171703, 176192, 175715, 162801, 151785, 153172, 143402, 139524, 148461, 144997, 127540, 113493, 96276, 56632, 39526, 35611, 16512, -1751, -21832, -3885, 5166, -317, 6548, 9084, 16645, 31353, 54414, 57041, 54240, 51590, 35639, 27760, 27014, 42078, 50196, 36357, 27821, 24549, 20763, 19055, 16930, 19137, 4138, 3626, 9304, 30842, 25445, 12999, 25380, 46537, 41219, 11683, 3431, 23651, 39459, 45133, 22506, -12131, -16834, -8471, 3757, 29353, 55935, 85928, 107252, 99354, 92506, 87020, 78439, 77391, 74627, 74781, 80820, 65521, 49047, 58702, 52694, 54343, 44200]
12717D4200k940J115J3391o118L566K1344P804j5436q876Q148K236m419l227J0516
12703G1304k646j6954j2221j7838J3902K533k4736p123n617j067N544L265j114
12690G232R14r342P89j2449K085J8677Q482J5852J6222o137j3131J3712J9246
12677F2152j3807j4004n805N273p305j2285j8363Q47j3577L9J1990M300J5454
12664A4909Q231J1127j4884k0622R917Q044j2357j195P140o81j032P020o823J181
12650I975m495j42L384J602j661L404L601O194l966N287M419N759k1535J764q40
12635A2750M361J9634J6992P256k715j2736r55r169r922m216l667J3672O059j761
12621C5583j1730k1310m321j535j5148l469J1934J9643K6r291L697k394n660M124
$$ y = [44200, 41260, 42375, 55766, 49648, 53214, 74558, 82362, 66926, 58050, 66198, 68434, 64015, 60788, 71304, 68658, 51704, 39483, 21645, 35547, 38080, 13344, 6221, 604, -463, 5081, 8346, 7232, 8146, -1196, -407, -12856, -10771, 7906, 16388, 32240, 48462, 42325, 29194, 42906, 62152, 48345, 34341, 28536, 33809, 26504, 14219, -4144, -3297, -16874, -16835, -4845, -545, 14909, 23140, 34267, 19383, -1239, 8678, 16722, 4365, 3170, 10310, 9629, 8597, 15617, 8794, 9975, 5480, 5338, 8722, 10324, 8663, 12067, 15668, 21862, 17896, 23183, 27602, 33361, 11826, 13590, 12750, 17111, 36745, 53737, 60993, 58278, 45542, 44587, 35418, 25496, 21280, 17613, 31285, 37344, 35583, 23853, 2543, -1778, -3313, -18461, -21930, -9996, 9647, 9673, 382, 4079, 1685, -3975, 149]
12607A49L714J5703K0033j176k5675j3781J901j3186m112K258o361L415J9373
12594B255M106M452j4940n327R256Q376K074j8j302J8638L707J679M981q431K481
12579C1987J179L249J927p19p197k2445O192M092n057r929j2284N248Q066J0043
12565A4352J2458o966K569m431n434m385p18N205K68m200j2j475O331o3M615p365
12549A0749N050J737M406K4099M308k902j4341l0178l32K449r935n318J846N246
12535c116P711J1240J2882j2848j3576p400n768P212J3286K1739j6756j8873l734
12522h001J8836k422O01j763q884o07J1600q968R676P852n212j342J625n72k924
12507I495J3810l443k0219l138N001J0343J680O809L223R510j757j0337p41J0327
$$ y = [149, 3863, 19566, 39599, 38423, 12748, -1033, 868, -12318, -16430, -14172, -20533, -17118, 2255, 6361, 10813, -4127, -9454, -198, 8178, 10252, 10234, 8932, 27570, 31277, 32956, 37937, 29506, 31987, 33166, 36415, 38342, 37623, 30426, 7981, 14173, 18265, 13208, 3279, -9005, -3757, 4309, 14352, 26810, 19844, 22413, 17982, 12548, 8163, 7445, 12650, 12918, 8718, 8706, 7231, 13562, 13499, 18114, 10749, 15799, 17536, 21942, 46041, 50349, 47447, 33106, 2928, 2596, 5045, -4890, -10208, -8362, -3116, 4595, 15835, 28717, 15869, 2293, -5107, -10875, -3663, 9623, 31362, 14606, -4267, -8001, 10835, 8413, 9014, 7251, -1633, -2240, 9360, 392, 10068, 17920, 12708, 11366, 12991, 12419, 9495, 23305, 19862, -357, -3495, 1506, 11849, 13529, 20338, 23561, 33071, 31314, 20977, 20236, 30563]
12493C0563J4024J0317J1669J814J0215J971J1006J5777L3899N7702P8474O8857
12481C46288k8505o8975n1990k8888k884Q4r021Q852j697P653O833J8840M0796
12468B37386O5830J06372J42745K37013L81172N97468O54239q9392o08314m77610
12458A246909k56008j12811m0226L4625J26546K35684L07171o153l49919l13618
12448H72200k13325j43257q8229n1634o0482n8917m0732l3882j8208j3924l1212
12437A18398k5696q436L443m584o712j4430k505l697p48o821j2895j760n47L465
12423C6475q108k092J4668K237R82j0424N430J4553K2469J9734J5415M2775P6496
12410B30610R3240J14704P1945k6362j06408j11179o2593k5840k9759k4943k3875
$$ y = [30563, 44587, 54904, 66573, 68387, 78602, 80573, 91579, 107356, 141255, 198957, 277431, 346288, 317783, 248808, 196818, 167930, 165046, 165130, 156109, 164961, 163264, 170917, 177750, 196590, 237386, 303216, 409588, 552333, 789346, 1170518, 1767986, 2422225, 2332833, 1724519, 1246909, 990901, 878090, 837864, 872489, 999035, 1234719, 1541890, 1535737, 1185818, 872200, 658875, 515618, 427389, 375755, 315273, 256356, 215624, 181742, 163534, 149610, 118398, 92702, 84266, 87709, 83125, 76413, 61983, 59478, 55781, 55033, 48212, 35317, 33557, 33010, 36475, 28367, 26275, 40943, 43180, 44162, 33738, 39168, 53721, 76190, 95924, 111339, 154114, 230610, 323850, 438554, 510499, 484137, 377729, 266550, 203957, 178117, 148358, 123415, 99540]
12399I9540j7581j9177j1977l36K486n308k139j0704k1262m381P555j1926j0675
12386e885n535N752M564O353K836m118n176J622O826l506M237N228J1650K100
12372B6948N584j623j0153j1647n960N088m007j74O616R052k292o798j0634k76
12358b76k737p89q365j251M309L676N366J3661M641j9407J2895J2495p269r414
12344G535J790k596j4682p117Q340R031k963n898n621N180R669J094O440J70J342
12329A1714R807K885o113p290o473o051R794O685l654q668j3131l240l536l606
12315b0877L106K6068J3944j644n353j97k935l019r006q314o58N988P47m95l931
12300f576J4951K4j2447q401N848R304Q09m05J87J3377Q938r319J401j0994k840
$$ y = [99540, 81959, 62782, 50805, 50469, 52955, 47647, 45508, 34804, 13542, 9161, 16716, 4790, -5885, -11420, -5668, -1104, 5249, 8085, 3967, -1209, 413, 7239, 3733, 7970, 13198, 24848, 26948, 32532, 30909, 20756, 9109, 3149, 8237, 4230, 4056, 10672, 19724, 17432, 10634, 0, -276, -3013, -3802, -12167, -13418, -9109, -5433, -67, 13594, 18235, -1172, 11723, 24218, 16949, 7535, 9325, 6729, -7953, -15070, -6730, 2301, -662, -6560, -12181, -7001, 2668, 3762, 10202, 10372, 11714, 21521, 24406, 18293, 11003, 4530, -1521, 8273, 14958, 11304, 2636, -10495, -13735, -17271, -20877, -17771, 8297, 22241, 20597, 15244, 15047, 12112, 9093, 87, -8227, -8885, -2897, -2150, -2645, -6576, 8375, 8399, -4048, -12449, -6601, 2703, 3512, 3107, 3294, 16671, 25609, 16290, 17691, 6697, 3857]
12285C857q02j3835o625J1814R722j0003n304p073Q183J3180K681r060o259K17
12271i307P747q84J2814j425j2395r201N566J8207N728o28M686k610j1158k84
12257F856l764l445j0421m164N651Q368L835J2228O417j057o76o534j1226m900
12243b832L903J468M209k033N96L946n453j124M562j4108j4847J7636P541K296
12229E760m822N867L557N150j1232r397k215p700J4137o560r816O071P348m518
12215h370k318J1962J137l312L190m979m423K55K88M968J623j972m777J1914L062
12200H248k0686r499L361J2517m099j6261k675r071M48J8746Q111M173j1390J177
12186a6900j783L746k958j1335P005J4307Q342j4011j0946K2022K0198j83o989
$$ y = [3857, 3055, -10780, -17405, -5591, 4131, -5872, -11176, -18249, -10066, 3114, 5795, -3265, -9524, -9307, -1560, -2444, 10370, 8945, -3450, -12651, -7085, 11122, 16850, 16222, 20908, 18298, 7140, 6856, 3092, -353, -10774, -14938, -9287, -919, 2916, 15144, 21561, 20504, 19828, 13294, 2068, -2832, 1071, 2539, 6748, 4715, 5311, 9257, 3804, 2680, 7242, -6866, -21713, -4077, 3464, 5760, 938, 6805, 10362, 15512, 4280, -5117, -7332, -15032, -895, -7455, -17271, -11200, -3852, -8370, -10688, 1274, 2411, -901, 2289, -2690, -7113, -6858, -6570, -1602, 21, -1951, -6728, 5186, 8248, -12438, -21937, -18576, -6059, -10158, -26419, -29094, -38165, -37717, -18971, -10860, -6687, -18077, -16900, -18683, -14937, -17895, -29230, -22225, -7918, 424, -13587, -24533, -2511, 17687, 17504, 10515]
12173A0515K704l747r533J200O390J0073k447m168K125L314l370l522j6081o928
12159a3475Q410J0495k367q856O214P244O151p342j7550l937O879Q13J0726J8718
12145B2123r197o841M960P609P696j1259j8102P306O0O167J4650N277o569j855
12131B2025L190J0794P456j0205k608r848j6470J683N759m255m435P954R693o486
12117A4247L74n523o075p359L087J6471K718p071j3887N310o151j3528m681J9241
12103b827P453J815r795j659p37n008J051M867n938K231K582K974J2961n641j3928
12088i599N829J0935J446k63l441l100q274l555m847q839J452J2312J4092K7504
12074C1652J3100p770j3276O22o68q541j0242M29o560P322Q523r856O91J2460
$$ y = [10515, 13219, 9472, -61, 1139, 7529, 17602, 15155, 10987, 13112, 16426, 13056, 9534, -6547, -13475, -5065, 5430, 3063, -5793, 421, 7665, 13816, 6474, -11076, -15013, -8134, -7321, 3405, 22123, 12926, 6085, 11045, 18654, 26350, 15091, -3011, 4295, 4355, 10522, 25172, 30449, 23880, 22025, 25215, 36009, 43465, 33260, 30652, 20804, 4334, 6017, 11776, 7521, 3086, 11040, 20733, 14247, 14621, 9098, 3023, -4336, -1249, 15222, 17940, 10869, -3018, 2292, -3859, -17387, -22068, -2827, 4626, 6441, -3354, -5013, -5750, -10758, -9707, -4840, -10778, -8547, -5965, -2991, 9970, 4329, -9599, -3770, 7165, 8611, 8348, 4907, 1807, -6467, -10022, -14869, -23708, -22256, -9944, 4148, 31652, 44752, 36982, 23706, 24328, 23660, 15119, 4877, 5306, -1254, 6068, 14591, 4735, 5426, 17886]
12060A7886o941k306J2887q800Q727P609j3241k383j438R542k427n169m94q105
12046E347P040j2251m244K946J4502j622K340K336J1461q748j1700L940J410p38
12032A2019j43n759j0048k6441J593O584M602J4697M180o72p827m133r32O972
12018e308J2650k239p876J456l326p562j594J9283N350j8700j6931l984J1755
12005a7026J2512J5650O87j5465l818k10j8212j1868R568M013p108M030j344O021
11991b2570K404o161k585J4002J0223L186p557l028m676O314P217O345k118n444
11977d448p053m433J6238K272r994L487J0506J5398J256k61J1368m012j0777j0424
11963I123m342k101p292M241j2756o322K463L436n03O022P627J6888M852n211
$$ y = [17886, 10945, 8639, 21526, 12726, 21453, 29062, 15821, 13438, 12000, 21542, 19115, 13946, 13452, 5347, 12387, 136, -4108, -1162, 13340, 11718, 14058, 16394, 27855, 19107, 7407, 11347, 12757, 12019, 11876, 6117, -3931, -30372, -28779, -22195, -17593, -2896, 1284, 612, -7215, -11348, -12280, -5308, 7342, 5103, -2773, -1317, -4643, -12205, -13799, 5484, 10834, -7866, -24797, -28781, -17026, -4514, 11136, 11823, -3642, -7460, -7670, -25882, -37750, -28182, -24169, -31277, -27247, -28591, -22570, -20166, -26327, -28912, -14910, -4687, -1501, -9058, -12086, -16762, -10448, -3231, 3114, 996, -4448, -11501, -15934, 304, 2576, -7418, -3931, 6575, 21973, 23229, 22968, 34336, 30324, 19547, 9123, 4781, 2680, -4612, -371, -13127, -19449, -16986, -13550, -14053, -8031, -404, 16484, 21336, 16125]
11949A6125j4766K305Q098m746M689K1405P265L651L77j9367k0461K701j677j1798
11935f199P318R08P209j30J334R573j0141k0479o407n164k531J8595J1432j206
11921D112P2j4779j7026K348J3604J905j0176n285P283J7536L209L308K902j0525
11907a512j5277j0253M719K1216J4592j733J9967R32j4209R772R69q356p803J36
11893A3160j5435k968L990K385p524M802k546p046l407Q180N219j528o337r364
11879a8419k539L259J2828O125j6025J1393J8842J1391k327j3758j1103k070Q855
11866F452r489m34k257P80N528n538N739l300k738K867J843j021j765k523j0069
11851a5925J928J3922O869l04m199L490N680o475n441m807m43R48Q640J2104M018
$$ y = [16125, 1359, 3664, 11762, 7016, 11705, 33110, 40375, 44026, 44403, 25036, 4575, 7276, 5599, -6199, 1119, 2027, 9236, 9106, 10440, 20013, 9872, -10607, -17014, -22178, -24709, -6114, 5318, 4112, 4184, -10595, -27621, -25273, -11669, -9764, -19940, -25225, -17942, -406, 2803, 6111, 9013, -1512, -16789, -27042, -22323, -1107, 13485, 11752, 31719, 32651, 18442, 28214, 29183, 20827, 13024, 13160, -2275, -5243, -1253, 1132, -6392, -1590, -4136, -11182, -14589, -6409, -1190, -2718, -9055, -18419, -20958, -17699, -4871, 1254, -14771, -3378, 15464, 26855, 24528, 10770, -333, -2403, 6452, -3037, -3471, -5728, -4948, 580, -4958, 781, -2519, -5257, -2390, -547, -1568, -3333, -5856, -15925, -13997, -75, 6794, 6490, 2291, 5781, 11461, 4986, -455, -5262, -5705, -4757, 3883, 15987, 20005]
11836B0005j9867j2775O774R70J0583K3136M792q892j6716j374J5052m813j5076
11823A799P524Q741L443j3568l400r560q475P548R233M232n365O120n7r238K0236
11808A9213P617k076n468m985k583o46l427q023l953l423O116m908n167R276J0453
11793H016j638J2619K351k1728O3J3960K422n6k394k239r108j2507K5215J7476
11779C2452M531k2367j5814J75L105M031Q270l120j1612j1158o437J2033Q801
11766B890J3441j879O435O56J077p963M859M548m113n342q019j5566l380L236
11752i120r59K420M30L443J0840K663p502J614K644L703Q958J2928k912r351n601
11737A4198o702m854P982J0123J442p929J705r123j250P920N437n101q358r80
$$ y = [20005, 138, -12637, -5863, -4893, 5690, 28826, 33618, 24726, 8010, 6636, 21688, 16875, 1799, 9323, 18064, 21507, 7939, 4539, -5021, -13496, -5948, 3285, 7517, 2152, 8272, 8215, -1023, 19213, 26830, 24754, 19286, 14301, 11718, 11072, 7645, -378, -4331, -7754, -1638, -6546, -11713, -2437, 8016, 6378, 18997, 21348, -380, -317, 13643, 16065, 16009, 13615, 11376, 2268, -10239, 14976, 32452, 36983, 14616, -1198, -1023, 2082, 6113, 14383, 11263, -349, -11507, -17944, -5911, 2890, 16331, 14452, 20887, 21543, 22620, 14657, 19516, 24064, 19951, 14609, 6590, -8976, -12356, -9120, -10079, -7659, -7229, -3786, 7054, 9717, 2215, 3829, 6473, 10176, 19134, 32062, 29150, 19799, 14198, 7496, 2642, 10624, 20747, 22189, 14260, 15965, 6842, 5592, 13512, 18949, 13848, 5490, 4510]
11723D510j4994Q53L463K701m827m325R879J6976M044L038j269l520N804L550
11709B5883M376j4770j5229O287R121j1083K523K914o528j1734Q039J0890r5P290
11695A7884M02q782k858l581K864J0663k037o685N391j1923j975m57J0908J7277
11681B7091l055m884J596p918m684k206j2123J1645Q119j5474r311P935R606n675
11667F62q075j0749j0121n98J1023L071N40k575R939k587M163l788p580K280P388
11652g007R676M481K223J597k752O432J54O350J2482N138p807n580n265N72N712
11637B6406O363j3287J2286R378k750N339R448j1586j8635l342j4465L703J4881
11624B3739R432J476j3481p7o870J277J6593n794m955L951J0520m398j2306J009
$$ y = [4510, -10484, -9631, -6168, -3467, -8294, -12619, -2740, 14236, 18280, 21318, 20049, 16529, 22333, 25883, 30259, 15489, 260, 6547, 15668, 4585, 7108, 10022, 3494, -8240, -201, 10689, 10594, 17884, 18286, 9504, 6646, 3065, 5929, 16592, 14555, 7870, 13261, 1338, -637, -1094, 9814, 27091, 24036, 19152, 20748, 12830, 8146, 5940, -6183, 5462, 13581, -1893, -11204, -3269, 6337, 662, -7413, -18162, -28283, -28881, -17858, -14787, -14247, -16822, -6883, -9470, -5307, -9095, -16675, -14395, -7007, 2669, 7150, 9373, 10970, 8218, 14650, 14804, 21154, 33636, 38774, 30967, 25387, 20122, 20694, 26406, 32769, 19482, 31768, 41146, 38396, 43735, 53183, 41597, 22962, 19620, 5155, 8858, 23739, 33171, 34647, 21166, 21089, 14219, 15496, 32089, 26295, 21340, 25291, 35811, 31413, 19107, 20116]
11610B0116P580N272M106j5298q783R968Q477K872m983R358n908r012p281q41
11596A5643j187K020p541j971N378J0859L548k129k879o372P736q533j5132p97
11582a357J2480J1899m212Q543J7959k187j8803k6256k64J5409n50J5530n79j6547
11568A1065L180J8287K623p400n909j5251J209M967K588j900o56o80j8204L24
11554e757R014P694Q815J4j309m507L768j487n416p640M631O65P497N465J4976
11539C6423P23J87j0590M214K785l550k932r954o809J0935O809j9032j0216L96
11525f11K152J0597O904O368p58J901m627M126k014l361K419L289m969M26k180
11510A9662L940J194M763K705p366j3182J570l702j4891L429J6607M234n212Q580
$$ y = [20116, 27696, 32968, 37074, 21776, 12993, 22961, 31438, 34310, 29327, 38685, 32777, 23765, 16484, 15643, 14456, 16476, 8935, 6964, 12342, 23201, 26749, 24620, 21741, 15369, 23105, 14572, -560, -1357, 11123, 23022, 18810, 27353, 45312, 43125, 24322, -1934, -2198, 13211, 12661, 28191, 27612, 11065, 14245, 32532, 35155, 27755, 21846, 6595, 7804, 12771, 15359, 13459, 12803, 12123, -6081, -5757, 3257, 10951, 19766, 19780, 18471, 13964, 17732, 16245, 10829, 3189, 7820, 8485, 15982, 21447, 36423, 37146, 37333, 26743, 30957, 33742, 30192, 27260, 17306, 10497, 21432, 28241, 9209, -1007, -611, 1541, 12138, 19042, 25410, 24652, 26553, 21926, 26052, 24038, 20677, 23096, 26385, 21416, 21842, 19662, 23602, 24796, 29559, 32264, 24898, 11716, 13286, 9584, -5307, -1878, 14729, 18963, 13751, 22331]
11496B2331K52o261K96M035L001l552n980k632N700J985j686M868j58l440O3P16
11480A9538m573n165j069O297j0479n385k337J9254J2629l185j4416L374K113
11467A6596n86O688R704J165K282j191j154p487L794J8319J5425N382j0239j6744
11453D1954K474k092k0590r113O964l911J2023J3026K570P619m981j5626j1965
11440A8352P177R552r44o66j960p723j528J6293J4293p286j5335M625N20l387
11426C1983L093K549N759n124j205p355j4209J2254J1310l81l99n031p782p2K0331
11411D5721J2027n637N95O524q97L109k966p956j0661j5732j2176J0848R786M372
11397C6957O925J0251J003Q888J108n427j3616j1819k048J3375n73P942N156L681
$$ y = [22331, 22583, 16322, 16618, 20653, 23654, 20102, 14122, 11490, 17190, 19175, 17489, 22357, 22199, 18759, 18822, 19538, 14965, 9800, 8731, 15028, 4549, -836, -3173, 16081, 28710, 25525, 11109, 14483, 16596, 16010, 22698, 32402, 33567, 35849, 34658, 33504, 26017, 29811, 48130, 63555, 68937, 58698, 41954, 44428, 42336, 21746, 12633, 19597, 15686, 27709, 40735, 43305, 50924, 45943, 30317, 18352, 25529, 35081, 34137, 33471, 31511, 23788, 22260, 38553, 52846, 45560, 30225, 34850, 35370, 31983, 35076, 37625, 43384, 38260, 37055, 29700, 15491, 27745, 39055, 38674, 38275, 33244, 25462, 25390, 45721, 57748, 52111, 52706, 59230, 58333, 61442, 58476, 50520, 39859, 24127, 11951, 22799, 32585, 36957, 43882, 54133, 55136, 64024, 65132, 59705, 46089, 34270, 32222, 45597, 45024, 52966, 58122, 61803]
11383F1803R667J0273O582k0921q016k267o294k956Q740k685O96p179k5965j0257
11369A1221N156K8630M849n50K810k000q508N262J7222M055l831q587j3393N3
11355D2389N452j7214J6458J3120J0336k881n942q82k136q719n009R399M400o
11341E8765m997m992k341j514R691n705rJ974L077J461K2817L167j1596j7018
11327E2780q074Q83m81N856R361R842m809r310J6098P726j500N406N97q564J5116
11312I0927P827q167k2946K532J3477J5326J0347o855l324o058o186L130j4828
11299G5202j6246J0930J2380P250M448j094M241P067k878p458R339J6814K288
11286A22283j7897j1429p024j3632Q469J7548k698r972J1364J1237m425L040R65
$$ y = [61803, 71470, 81743, 88325, 67404, 59388, 57121, 50827, 47871, 56611, 53926, 54622, 47443, 21478, 11221, 16377, 45007, 49856, 49306, 52116, 50116, 41608, 46870, 64092, 68147, 64316, 55729, 42336, 42389, 47841, 30627, 47085, 60205, 70541, 67660, 61718, 60836, 58700, 49981, 44972, 54371, 58771, 58765, 53768, 48776, 46435, 44921, 54612, 48907, 48898, 50872, 53949, 55410, 78227, 81394, 69798, 52780, 44706, 45589, 45108, 50964, 60325, 70167, 65358, 56048, 72146, 79872, 78372, 83778, 84375, 75811, 90927, 98754, 90587, 67641, 70173, 83650, 98976, 109323, 102468, 99144, 93086, 86900, 90030, 75202, 58956, 69886, 82266, 89516, 93964, 92870, 97111, 104178, 101300, 93842, 103181, 119995, 122283, 104386, 92957, 85933, 72301, 80770, 98318, 95620, 85648, 97012, 108249, 103824, 106864, 107829]
11273A07829Q207k586n401L564n842P074m956j7214j393M822R010L050L46O74
11259A07184k275N326M964l979r093m462m893J3662J8963J761m195m405m376N040
11245A19222J162j0912n435L881J4782J6026O237K778p808k309j0340M495J1868
11232A43647p236p746Q649J5042o347k0993n009J3701J4094J82j0849M469r174
11219A32430q175J3257L373o904j2318P397J8647Q625j162J1304J5894J4469l363
11206A93474j0077n270l38L724M053Q258j617j515j1203O03L865k558o4J168M636
11191A87139J3900j021o586j961l305J0677N894K136Q065Q871j906j947p989M632
11177B16599p6J2744P38o619q962r468j0781O514l134K1516J6913j0876M222R545
$$ y = [107829, 116036, 113450, 108049, 111613, 105771, 112845, 107889, 90675, 89282, 94104, 103114, 106164, 106510, 107184, 104909, 110235, 115199, 111220, 102127, 97665, 92772, 106434, 125397, 127158, 122963, 118558, 114182, 119222, 120384, 109472, 104037, 107918, 122700, 138726, 144963, 147741, 139933, 137624, 127284, 131779, 143647, 136411, 128665, 137314, 152356, 146009, 125016, 120007, 133708, 147802, 147984, 137135, 141604, 132430, 124255, 137512, 140885, 133981, 121663, 129060, 147707, 156332, 155170, 166474, 182368, 196837, 193474, 183397, 178127, 177789, 181513, 185566, 193824, 192207, 190692, 179489, 180092, 183957, 181399, 181335, 182503, 187139, 201039, 200018, 193432, 191471, 188166, 198843, 204737, 206873, 214938, 223809, 221903, 219956, 211967, 216599, 216523, 229267, 230005, 223386, 214424, 204956, 194175, 200689, 197555, 219071, 235984, 225108, 229330, 238875]
11163B38875P457P762Q195n502j7543O20Q396R268J5324L258k0377q926O169J0600
11149B63576m646L468j514r8N040J216J2634Q88Q000o07j4836r04J5664P120l855
11134B91146j3200J1113J9698k695n074J160K1417P428m588j09m323J408k353
11121C21028K561J9400O274j6867m163o565N965P955O637M146q794j759j666j0158
11107C23994R779R817k614N021Q300R021R815M192k147k395m935N651J4780J483
11093C89762j0726o665J6640J5826M10n373j6391m452k467M99M455l759p750m022
11079C65987L647J3238J1278l058N426k697k312J692n297l397k447N453N51N344
11065C93408N405l090j4718J3916J7027n137j1383m745m522l015K3672M44j2605
$$ y = [238875, 246332, 254094, 262289, 256787, 239244, 239864, 248260, 257528, 272852, 276110, 255733, 246807, 252976, 263576, 258930, 262398, 260884, 260786, 265826, 267042, 279676, 280564, 288564, 287957, 273121, 272217, 287881, 295001, 291146, 277946, 289059, 308757, 306062, 300988, 302148, 323565, 330993, 326405, 326296, 321973, 323381, 321028, 323589, 342989, 349263, 332396, 328233, 321668, 327633, 335588, 342225, 346371, 337577, 335818, 334152, 323994, 333773, 343590, 340976, 345997, 354297, 363318, 373133, 377325, 375178, 372783, 367848, 373499, 388279, 389762, 379036, 372371, 389011, 404837, 405247, 399874, 383483, 379031, 376564, 377063, 381518, 377759, 370009, 365987, 369634, 382872, 394150, 391092, 396518, 393821, 391509, 393201, 387904, 384507, 382060, 387513, 388064, 393408, 398813, 395723, 381005, 394921, 411948, 406811, 395428, 390683, 386161, 383146, 406818, 407262, 394657]
11052C94657j0272o283J121J1474P657r487Q724j924j1785p04R13k011M514j619
11038C84975L342p157L825n622k608m801j8n943j6639j0827j3135M021J0178L512
11024C43103j3214j566L930P002J300l340O905N207J0614j0692r00P42k916j0343
11010C35832l125K552j2154j5976Q648k479p515m260J403O429l376j0109q432
10997B87438K402M693J0501n778n615K874P614q634o255j1625L871o29j0074j165
10983B69618j6838j0042P667K098N840n633j8414p038R797K912l639J0355m36
10970B46247J878O547P923j0023j6318j3276L786Q992m114o777J075J2187P669
10957B45796n54k1648O555n930k6889m169J4143N12m489p263l620J4460J0689
$$ y = [394657, 384385, 378102, 379223, 390697, 398354, 388867, 397591, 395667, 383882, 383178, 384091, 382080, 386594, 384975, 388317, 381160, 384985, 379363, 376755, 371954, 371936, 365993, 349354, 338527, 325392, 329413, 339591, 343103, 329889, 328323, 332253, 339255, 340555, 337215, 344120, 349327, 359941, 349249, 348349, 349091, 346175, 335832, 332707, 335259, 323105, 307129, 315777, 313298, 305783, 301523, 302926, 309355, 305979, 295870, 287438, 289840, 294533, 305034, 299256, 293641, 296515, 304129, 295495, 289240, 277615, 281486, 280857, 270783, 269618, 252780, 242738, 250405, 252503, 258343, 252710, 234296, 227258, 237055, 239967, 236328, 246683, 246247, 248125, 254672, 262595, 252572, 236254, 222978, 226764, 235756, 231642, 224865, 225940, 238127, 245796, 245242, 223594, 230149, 224219, 197330, 193161, 207304, 207816, 203327, 196064, 192444, 206904, 217593]
10944B17593p881p293q722K657R133n84j463k681l5J03K969j1086j9073J2845
10930A86482N893n877k670Q54j5856l072L688Q42j0874l399Q49J3315o607j4270
10916A49298M159m263j828L581P044r199L486l007j3912J440j874J212K30R2N279
10901A41738O651P807n212r775j0691j1797Q112R895L424O197j0955l181J939
10888A34152j8631j3109j0980j236L014J0042N465N554R558q748k0285j2802l066
10875G8928P149M534O269J0751N719n285J134P398q391j4337j0245M520J0740
10862I8884o652J322k819K420o139J77N018r005M581Q862l733j4170k413R457
10848H5790J2185J618p5j5567j5214K44J4209J7304l570l43J610o890o021K4r66
$$ y = [217593, 209712, 202419, 193697, 196354, 205487, 204903, 203440, 200759, 200724, 200827, 203796, 192710, 173637, 186482, 192375, 186498, 183828, 184682, 168826, 165754, 169442, 170284, 159410, 156011, 156860, 170175, 163568, 149298, 153457, 149194, 147366, 150947, 157991, 148792, 152278, 149271, 135359, 136799, 134925, 136137, 136367, 136459, 141738, 148389, 156196, 150984, 141209, 130518, 118721, 126833, 136728, 140152, 146349, 135394, 132213, 134152, 115521, 102412, 91432, 90196, 93210, 103252, 108717, 114271, 123829, 115081, 94796, 81994, 78928, 86077, 90611, 96880, 107631, 113350, 108065, 109199, 116597, 108206, 93869, 83624, 88144, 98884, 92232, 93554, 90735, 93155, 87016, 87193, 92211, 83206, 87787, 96649, 92916, 78746, 76333, 85790, 97975, 99593, 99518, 83951, 68737, 68981, 83190, 100494, 96924, 96581, 98191, 91301, 85280, 85304, 84338]
10833H4338k489Q93l53J2320o41j1425j2489j2089R964J0937P59k550p846q797
10819F0532j1429O245O743R571P781o22L594M658O400j0001j5437l510Q153N347
10805G8025k461p745q213j5080K089J128J0944o510n885m393p770K844J5720n532
10791D7161L517M079q432L801L343l456p636j92N531K361J2746K865n025r571
10777E1092p604P784M829m499J122Q204o654J621N559n128k75l815J0043j3928
10763D8351r150R41j53L444J222k030J6295R03o678j0613L484J0211M216N63q536
10748E2470l111k2807j108K0231N256L948q478L933M404n411K206O568l450N180
10734E9831j32r971j1606j6336Q837L311p600R008J6381K34j4825j1783k192J5069
$$ y = [84338, 81849, 82742, 82389, 94709, 94068, 82643, 70154, 58065, 68029, 78966, 79725, 77175, 69329, 60532, 49103, 55348, 62091, 71662, 79443, 78821, 82415, 87073, 93473, 83472, 68035, 64525, 72678, 78025, 75564, 67819, 59606, 44526, 46615, 47743, 58687, 52177, 46292, 41899, 34129, 36973, 52693, 47161, 50678, 54757, 46325, 50126, 53469, 50013, 42377, 42185, 47716, 50077, 62823, 65688, 60663, 51092, 43488, 51272, 56101, 51602, 52724, 60928, 54274, 55895, 61454, 56326, 56051, 52236, 62279, 48351, 39201, 40142, 39989, 43433, 44655, 42625, 58920, 59823, 53145, 42532, 46016, 56227, 60443, 61006, 52470, 49359, 26552, 25444, 45675, 50931, 54879, 46401, 50334, 54738, 49327, 51533, 58101, 54651, 59831, 59699, 49728, 38122, 21786, 30623, 33934, 26334, 35342, 51723, 51957, 37132, 25349, 23157, 38226]
10720C8226P467O06j1582q241K248L787K43K226L281m220q905q53O198J2396O735
10705D9612k149K689M920n558j5568j037M544p965N111j293O010O443j0281P600
10691D3078M290q54q890q483m596P879J5476J681p362o189j1032J085n410r91
10677A9682J4031J1727K457m783l948k319J0526j6115p677J443k482r949K307
10664A4900k497J2093O937o77r608k52O866J237L212K66j0898j089r381N350Q922
10649B5381P687k859r193r800N263J0875K22M902Q372j0813j9301m821M660M158
10635A4733N301J48J818o103k937J1725m618k767P362m521J793n556M471K1947
10621D2796J1692m007k809p068n903j3400J219J1645P560O358o367j2999j026
$$ y = [38226, 45693, 46299, 34717, 26476, 28724, 32511, 32754, 34980, 38261, 34041, 25136, 24283, 30481, 42877, 49612, 47463, 50152, 55072, 49514, 33946, 32909, 37453, 29488, 34599, 33306, 39316, 45759, 35478, 43078, 47368, 46514, 37624, 29141, 24545, 32424, 47900, 49581, 42219, 36030, 24998, 26083, 20673, 19682, 33713, 45440, 47897, 43114, 39166, 36847, 47373, 31258, 23581, 25024, 22542, 12593, 14900, 12403, 24496, 31433, 30756, 21148, 20896, 27762, 28999, 32211, 32477, 21579, 20490, 11109, 16459, 25381, 33068, 30209, 21016, 11216, 16479, 27354, 27576, 32478, 40850, 30037, 10736, 5915, 10575, 14733, 20034, 20182, 22000, 15897, 12960, 24685, 20067, 17300, 24662, 20141, 21934, 16378, 20849, 42796, 54488, 50481, 47672, 40604, 34701, 21301, 22520, 34165, 41725, 48083, 41716, 28717, 27691]
10608B7691O168K117j5218j5722p715j068J5721J3212o840p010Q706O860j7635
10595I267l283j42J2083J110k479j0850o836Q281O794m761N848O522J1281J771
10581C4606o510k906j455Q32m415k4531K615J2595M931o29l806P074J209l169
10567A6441j1822p256K2625k06M102r97m085L417o797n278n31P531K227p066r042
10552C263q579n524L179J0538M985k748p681r07M718J1062J434j6421o860j448
10538a0989n994j894J856J8197J2525n177j686k255J5172K350K511l887k686o958
10524A1085p608P641J5968N513M042P033j7576m849P074Q415J985q573o894j935
10510B1321k564K904m505n308p184O361P944j845m021p170M008k786k83O171L380
$$ y = [27691, 33859, 35976, 20758, 5036, -2679, -3747, 11974, 25186, 18346, 11336, 20042, 26902, 9267, 5984, 5842, 17925, 19035, 16556, 5706, -1130, 7151, 13945, 9184, 15032, 21554, 32835, 34606, 28096, 25190, 23735, 24567, 20152, -4379, -1764, 10831, 15762, 15133, 11327, 18401, 19610, 16441, 4619, -2637, 19988, 19782, 23884, 22887, 18802, 22219, 15422, 10144, 9613, 17144, 19371, 12305, 3263, -5316, -10840, -7661, 2877, 7862, 5114, -2567, -3474, 1244, 12306, 13740, -2681, -9541, -10989, -16983, -18877, -17021, 1176, 13701, 8524, 6838, 4583, 19755, 22105, 24616, 20729, 18043, 11085, 3477, 11118, 27086, 32599, 36641, 43674, 26098, 21249, 28323, 36738, 38723, 30150, 23256, 21321, 18757, 21661, 17156, 11848, 4664, 11025, 18969, 17124, 13103, 5933, 9941, 7155, 6872, 13043, 16423]
10495A6423j0351o090R33R323K618j8799j1455Q910M508P203O803k446N717L279
10481A6576j913L808q5k552j2385l296l396L300O57j3414n342J7940J9499l51
10467A9046N238n34j2334k373j1738p183N382J9595N069J956q413J0176L435j4531
10453A2791l108Q32J6635Q686k018m344M381q709j3119n635J0021J1318K14m650
10439B3295r95Q745j972j5715j1944J1496J0789L36j0966m230m443j077P554j2494
10425a621L47J0766o116j1372J2142k887k308R182Q629L39N46O248R536j2005
10411B1426M349J3306k653j1776j4849L328k319k5355L007P271J3501O205O984
10398B2425q238m295n535n266k797J9477J264N578q01j128j0538m319O189m06
$$ y = [16423, 6072, -18, 915, 10238, 12856, -5943, -17398, -8488, -3980, 3223, 10026, 7580, 13297, 16576, 14663, 18471, 18386, 15834, 3449, 153, -3243, 57, 714, -12700, -18042, -102, 19397, 19046, 24284, 23750, 11416, 9043, -2695, -9878, -4496, 15099, 20168, 22124, 13711, 23887, 27322, 12791, 9683, 10515, 27150, 35836, 33818, 29474, 33855, 25146, 12027, 6392, 16413, 27731, 27945, 23295, 22300, 31045, 29073, 13358, 1414, 12910, 23699, 24035, 13069, 8839, 4396, 3319, 10873, -1621, -1274, 9492, 3376, -7996, 4146, 1259, -1049, 8133, 16762, 17101, 17647, 23895, 33431, 21426, 25775, 39081, 36428, 24652, 9803, 13131, 10812, -14543, -11536, -4265, 9236, 15441, 22425, 14187, 9892, 4357, -909, -3706, 15771, 17035, 22613, 21812, 20684, 10146, 5827, 12016, 11610]
10384A1610n99m054o128K427L293K247L958N105P370r183k2037J0030L316N026
10370A2381J3161M413R58j7382l935j2858M1q171J1633k891j608M239M410P269
10356A1660N12k297K401k753l830N144J1415q115j7852p756O412k152O457J6440
10342A5686m084M496M589J1934l574j5371P294L983M164M572r986j1435J733o974
10328G027O516J9022O653k8956j3758k014J0930J1589k451j1017l149O682J0450
10315A7524O61j063o029J700J0914L511j8394l941J54M672M517n845j0596m357
10301f572R277m751L86M587J654r037L589m91m357P009N963p578k2014N373K644
10286a4318R315l497j698J198n533J0211M232O572n978k75J0061M328m533o989
$$ y = [11610, 11011, 6957, 829, 3256, 6549, 8796, 12754, 17859, 25229, 16046, -5991, 4039, 7355, 12381, 25542, 29955, 30913, 13531, 9596, -3262, -3221, -11392, 241, -2650, -4258, -19, 4391, 11660, 12172, 9875, 12276, 9523, 5693, 10837, 22252, 14137, -3715, -11471, -5059, -7211, -754, 15686, 11602, 16098, 20687, 32621, 29047, 13676, 20970, 24953, 29117, 33689, 23703, 12268, 14001, 7027, 13543, 32565, 39218, 10262, -3496, -5510, 5420, 17009, 14558, 3541, 392, 7074, 17524, 18185, 17122, 11093, 12793, 23707, 27218, 8824, 4883, 5037, 9709, 14226, 8381, -2215, -6572, 2705, -2046, -1660, 2927, 4581, -4456, -867, -1358, -5715, 1294, 7257, -321, -22335, -16962, -14318, -5003, -8500, -10198, -9000, -14533, -4322, -90, 6482, 504, 229, 10290, 14618, 10085, 3096]
10272C096J012P774o17p703N42m722K510m385m019R27J2627P131n056j4709Q112
10257B520R665m391n598J1889r37Q288Q342p150m7q155j1034J0241P725j0643
10243A0715j9496j048O953j813P507J0475N65l738j5367o727o32J19Q923L537
10229b7r717K306R937M193r789r050Q990O572L700k370j782O671Q438r96o414
10214A0662r066o787O599L487m894o052p872L338P988J0904m432j3424K91J7607
10200H349k181J901m099K160O653l559j5954P794J735j6904k327J3647N047n194
10186b932J894J524j230K210L072P36j4985R816J7563j1114o93M518p004l779
10172d04M338j38j7451N602J3198L221Q247l950j353j101m622p101P800m83n880
$$ y = [3096, 4108, 11882, 11265, 3562, 4104, -618, 1892, -2493, -6512, -5585, 7042, 14173, 9117, -5592, 2520, 12185, 7794, 2196, 14085, 13148, 21436, 29778, 22628, 22581, 14426, 3392, 13633, 21358, 10715, -8781, -9829, -2876, -4689, 2818, 13293, 13858, 10120, -5247, -11974, -12606, -12487, -3564, -27, -9744, -7438, 2499, 6692, -3097, -12147, -3157, 3415, 7115, 4745, 2963, 9634, 18072, 17076, 10662, 1596, -5191, 1408, 4895, 1, -6051, -13923, -10585, -2597, 8307, 3875, -9549, -9258, 8349, 6168, 8069, 3970, 6130, 12783, 9224, -6730, 1064, 2799, -14105, -16432, -2785, 2262, -2932, -1038, 486, -744, 1466, 4538, 5274, -9711, 105, 17668, 6554, 5861, 10379, 3375, -404, 3934, 3796, -13655, -8053, 5145, 8366, 16613, 12663, 11310, 10209, 5587, -1514, 6286, 5803, -77]
10157g7O840M797o36R37l342k462P70j1401J031K727j4305m943M584M02R995J1517
10141F434m97j768q34O695l643R54L418L996J2382L07p519k3981l538J700j0410
10126a6304j7819M80j2J3140J5017m031k305P174p349k705J6176j9J0162L35j3257
10111a317l373o767p008N981J5480K365K360j541j2565L130J3383O179r302j0671
10097c666o967K006K378p80j0284J3344J3396l38o597N642l673j2508q342q487
10083b4876k925J1740p374K976N430J1396R321O664O290j1406l908q92K617K728
10069G781n042L590p256j7058P881l308j565L243J1933m116J0661O584m806j0327
10055a805P828k222j4384o29J2407o418q957J4904K2538J1821j3427k0861l177
$$ y = [-77, 6763, 11560, 10924, 11861, 8519, 6057, 6827, -4574, -3543, -816, -15121, -20064, -15480, -15078, -5083, 6434, 5937, 4169, 3335, 10030, 6387, 7341, 10759, 14755, 27137, 27444, 19925, -4056, -7594, -5894, -16304, -34123, -33643, -33655, -20515, -5498, -9529, -11834, -4660, -12009, -14714, 1462, 1443, 11605, 11940, -1317, -4690, -11457, -18465, -12484, 2996, 5361, 7721, 6180, -6385, -3255, 10128, 16307, 7005, -3666, -10633, -8627, -6249, -7029, -17313, -3969, 9427, 9089, 2492, 8134, 4461, -8047, -16389, -24876, -27801, -16061, -23435, -20459, -15029, -3633, 5688, 12352, 18642, 7236, 3328, 2436, 5053, 7781, 2739, 6329, -927, -17985, -10104, -13412, -14977, -11734, 199, -3917, 6744, 13328, 8522, -1805, 6023, 3801, -10583, -11212, 1195, -5223, -14180, 724, 23262, 35083, 21656, 795, -2382]
10042b382O681n407p658O591M051N794Q442l532r808L47p7j1383q202O353J8582
10027H392Q456n68j6267j5817M813l563m303R465O162K6k2451J981N844J3281
10013d549O553q990j1647j5395R744P77J4738J2604j3481j0246L30N010P622M907
9999b023J4571J760j4063o97J126j089k018O325J2574M333Q106n122q945O29J365
9984A6832J0217J553N632K91j031j1556k899q855k005m671r587N604J2085M672
9970A6282J075M820K580P269o846q875j4879l043J0803k532K518L570R333R946
9956C2021l103J1030j1064j1801J2362K0183R076O533J4266J668k1752n105J2254
9943F6568N004J728L106l215m11K2381M3697M2616M7539J9964O4671J24782K02496
$$ y = [-2382, 4299, -1108, -8766, -2175, 1876, 7670, 16112, 12580, 2772, 3119, 3042, -8341, -16543, -10190, 8392, 16848, 16280, 13, -15804, -10991, -14554, -18857, -9392, -3230, -3204, -25655, -23674, -17830, -4549, 2004, -6986, -18633, -34028, -24284, -23507, -8769, 3835, -9646, -19892, -19562, -14552, -6930, -2023, 12548, 14308, 245, -452, 674, -415, -2433, 3892, 16466, 20799, 28905, 23783, 14838, 15467, 16832, 27049, 28602, 34234, 34525, 33494, 21938, 19039, 10184, 8179, 3508, -6079, -475, 11610, 16282, 17357, 22177, 24757, 32026, 25180, 16305, 1426, -1617, 9186, 6654, 9172, 12742, 22075, 32021, 28918, 39948, 28884, 17083, 29445, 49628, 58704, 65237, 79503, 81171, 59419, 54314, 66568, 71572, 73300, 76406, 73191, 72780, 95161, 138858, 181474, 229013, 248977, 313648, 438430, 640926]
9930F40926L20287M88041P57540J033909M68382p03389r20600n94822l29438k01871
9920I58965j65171j38721j19536j07231q5436n7836l9533m2294m2976k9798j6595
9909A13838j0047j697j250M598j4826p166m021n725l853j2425M9j8724j640o491
9895C0620m442P624n395j3866J0831K971j553j5598j7492M72l40Q863q93N563
9881G365N689j00J287o14j2247l853J2561J2391k224j901K0301K5636j57J4828
9867G8962L1729O6589Q8796Q9208M4630k3086p3236q1105o4522l3223j7282p412
9855A00048j7651j4666r739k0013j2473k745j5300j617K3209J5563j8093j6067
9843A0456k087M769j1136M866J8253J66k1844RQ589m561J715J0311m381n913N276
$$ y = [640926, 961213, 1449254, 2206794, 3240703, 3709085, 3005696, 2085096, 1490274, 1160836, 958965, 793794, 655073, 535537, 428306, 342870, 285034, 245501, 203207, 160231, 130433, 113838, 103791, 102094, 100844, 105442, 90616, 83450, 79429, 73704, 69851, 57426, 57475, 38751, 37111, 30620, 26178, 33802, 28407, 14541, 25372, 28343, 26790, 11192, -6300, -5828, -6168, 2695, 1802, 7365, 13054, 12954, 14241, 13627, 1380, -2473, 10088, 22479, 20255, 18354, 38655, 64291, 64134, 78962, 110691, 177280, 266076, 355284, 399914, 376828, 303592, 222487, 157965, 124742, 107460, 100048, 82397, 67731, 57992, 37979, 25506, 22761, 7461, 5844, 29053, 44616, 26523, 10456, 8369, 13138, 2002, 6868, 25121, 25287, 3443, 3452, 12041, 7480, 9195, 19506, 15125, 9212, 14488]
9828A4488L308q821L881n248m831K165P607K07K99l640k004M452M110j8530j0565
9813a3122P414N116o64M632O111j0730l43Q213j2936m497Q455R318J0029o169
9799A0827j247m691m216j4600K780J4181Q272k271j385J203q56o947r843k873
9785a1666O358L091K827p958j3438p534K0402P615n975K761p910n947j644n021
9771b4039J1836J0404J3832Q837J813q638j1084j0666j892R223J6528m589m549
9758G016L850m963m419K479Q090o169l009Q155J934Q452p218k278l354r568k604
9743c606M721J510k796j205K291m237m680p79k111J0387j110j4170n191J7783
9729c193O764j974k4134K978K996R252O591j768J571q04K979n96J0285L075J429
$$ y = [14488, 17796, 8975, 12856, 7608, 2777, 4942, 12549, 12756, 13055, 9415, 7411, 11863, 15973, -2557, -13122, -5708, -592, -1256, 3376, 9487, -1243, -1586, 6627, -6309, -10806, -2351, 6967, 16996, 10827, 9580, 4889, 673, -13927, -11147, 3034, 11306, 9035, 7650, 8853, 7997, 1050, -8793, -11666, -5308, -2217, 610, -7348, -20786, -28320, -7918, -303, -6278, -3517, -11427, -17374, -19018, -24039, -12203, -1799, 12033, 20870, 22683, 14045, 2961, -7705, -9597, -374, 16154, 11565, 7016, 10866, 5903, 1484, 3963, 12053, 5884, 2875, 11030, 12964, 21416, 14198, 11920, 8566, -1002, -3606, 1115, 2625, -171, -1376, 915, -3322, -8002, -8781, -10892, -505, -1615, -15785, -20976, -3193, 3571, 1597, -22537, -19559, -16563, -7311, -720, -2488, -917, -1721, 1258, 662, 10947, 14022, 15451]
9714A5451k779j508k645p9j0050M48K986n827J4224k645o811M012L355j4550k845
9699i263q367o971R446m006Q291j0347Q519K290M88J1505J399J546J0234M749
9685A9513q531j4653L196Q068M727p248p114o060r358Q181O701k84L488J3264
9671A3890l912j1353J684j0467k735L50o59J1959o272k955M955N373M716K865
9657G439m266J2939r067j6752k453J772N795o352K806J126L671K252k412l803
9643g305j6353j969N051J288l096q790O084K2891J0906k183l50l610n477n202
9629h115o187p133K230L040J1270n82P284k253o176J2344J6351l31k2289j4720
9615a5267p320l73J0547K267N573N873K057n662p497n995L400R981j8051j0433
$$ y = [15451, 12672, 11164, 8519, 8440, -1610, -1162, 1824, -4003, 10221, 7576, 765, 4777, 8132, -6418, -9263, -17630, -24601, -15155, -19161, -10870, -21217, -12698, -10408, -9920, 1585, 2984, 4530, 14764, 19513, 10982, -3671, -475, 7593, 12320, 5072, -2042, -8102, -17460, -9279, -2578, -2862, 626, 13890, 9978, -1375, 309, -10158, -12893, -12543, -13202, -1243, -7515, -10470, -5515, -142, 4574, 7439, 3173, 16112, 7045, -9707, -12160, -10388, -4593, -10945, -8139, -7013, -3342, -1090, -3502, -7305, -23658, -25627, -20576, -19288, -22384, -31174, -25090, -2199, 8707, 6524, 6174, 2564, -2913, -8115, -14302, -21435, -19205, -16165, -4895, -5477, 1807, -446, -6622, 5722, 22073, 21742, -547, -15267, -22587, -22960, -12413, -10146, -4573, 1300, 3357, -2305, -9802, -15797, -12397, -2416, -20467, -30900]
9601c0900N608P71L831Q302J0728J1714k503l664k380l334R751K3978n623k3816
9587B463j6572o45J155M904m422J919l844j533J3364J0677K272j910n956L542
9573E414J842J648p012l656K376O797P206N964r83J0222j1024j8620J982N55j5427
9558a2716j835O792m79K189j348Q431N16M439k337k181M31l175J0140n347Q138
9543A1658P199j8496j8002m568J4432n403m756n819R0J4837N760J0405J5297o679
9529A5955j2410j1675o546m511J4804Q912j3996Q62o115l303J5442N573l631R526
9515H887Q154m400j874l042r801L715Q678O11l406n572O935p096r454q25J4902
9500F412o379j1857N514r894p554J0383K4684k252p287j6150p793J4842M731k175
$$ y = [-30900, -25292, -24521, -20690, -12388, -1660, 10054, 7551, 3887, 1507, -1827, 7924, 31902, 26279, 2463, -14109, -14754, -13599, -8695, -13117, -11198, -15042, -16575, -3211, 7466, 9738, 7828, 1872, 5414, 7256, 8904, 1892, -1764, 612, 7409, 14615, 20579, 19596, 29818, 18794, 174, 2156, 2711, -12716, -14551, -7759, -8238, -6049, -7397, 1034, 1550, 5989, 3652, 1471, 1902, -1273, 8867, 3520, 11658, 18857, 361, -17641, -22209, -7777, -13180, -17936, -23755, -23665, -8828, -3068, 7337, 22634, 15955, 3545, -8130, -14676, -19187, -4383, 4529, -9467, -8605, -14720, -18023, -2581, 2992, -639, 8887, 17041, 12641, 10767, 7725, -2076, 1639, 10317, 10928, 7522, 1950, 8885, 1789, -7665, -8490, 6412, 33, -11824, -6310, -16204, -23758, -13375, 11309, 9057, 1770, -14380, -22173, -7331, -2600, -4775]
9486d775P514N782l507M30J975p21m754J408k526j27N874K68r771p549L56o344
9470a6467j062O413J803N940J2669J0667j851j2526j139J796P202n122j0541J3185
9456A0967O729k341k0898r876N360L663Q032L996j6603n852n305N526O809m741
9442a4534J1019J1663j171o919j2124L398R769K870J0407L351l10k696l451q882
9428B390Q31n64J277m441M379o538k575o806K728o79m257J879J909O495j097m293
9412i362l025q046p9N583N162J177N27N204q079L833P91K253Q863N567j5595j1111
9396a6337J1477J1508p120J945J3556O615J374j7410j1859J374m401j179M946
9383e511r557K825J6228J4156o044o020n268k693n212K853j276R248O869q641
$$ y = [-4775, 2739, 8521, 5014, 5444, 7419, 6698, 1944, 3352, 826, 699, 6573, 6841, -2930, -10479, -10123, -16467, -17529, -11116, -9313, -3373, 9296, 19963, 18112, 5586, 4447, 6243, 13445, 8323, -2218, 10967, 17696, 15355, -5543, -15419, -10059, -6396, 1636, 5632, -10971, -16823, -22128, -16602, -9793, -14534, -3515, 8148, 6977, 58, -12066, -8668, 1101, 3971, 14378, 17729, 17419, 14723, 11272, 2390, 3221, 2657, 3934, -507, 3872, -2666, -5241, -12047, -9319, -9998, -14255, -12376, -10467, -3972, -5069, -9362, -12387, -20433, -20512, -14929, -9767, -8590, -8063, -2859, -10938, -7105, -6314, -4061, 4802, 10369, -5226, -16337, -4860, 6648, -472, 1473, 15029, 21644, 23018, 5608, -6251, -4877, -9278, -10457, -5511, -15068, -12243, 3985, 18141, 12097, 6077, 809, -1884, -7096, -4243, -5519, 3729, 10598, 1957]
9369A957j2821j0780P273J3315M167P191p284O258l004l315K603j3279n541P276
9355e984l159M001K77L150l87j885q403L917O407K810Q558N26M305R741L727j7739
9339I862j6098l944J0274K968Q433J4607p172p610J3160m416l835j4745m863J628
9325a751L794l661q674k913j3870M812M272m17K324R043O500j1346O450r737n08
9310a5682R88M889m03j2249m786J909J0051L243l918P762J0855K906j754j785
9296B026o147J9987K428m425o307p471R165L403r838j5429l792o4J7051J7172
9282A7759m65p517o057p271k553l192N412K396J0709P751l631j1936K194j2996
9268i397r286J1959J2002K344L494r18n795J1j1155J1269J2078q891l612l970
$$ y = [1957, -10864, -21644, -14371, -1056, 3111, 10302, 3018, 9276, 6272, 2957, 5560, -7719, -13260, -5984, -9143, -5142, -4865, -1715, -2102, -3987, -12390, -8473, -2066, 744, 9302, 9828, 14133, 23874, 27601, 9862, -6236, -10180, 94, 3062, 11495, 26102, 18930, 11320, 24480, 20064, 16229, 1484, -3379, -1751, 2043, -1618, -10292, -13205, -27075, -22263, -17991, -18408, -16084, -7041, -541, -11887, -5437, -15174, -15682, -14694, -9805, -10208, -22457, -27243, -25334, -15283, -12040, -15958, -8196, 2659, 5565, 3811, 2026, -4121, 15866, 18294, 13869, 7562, 91, 9256, 12659, 2821, -12608, -16400, -16464, 587, 17759, 17294, 9777, 3720, -3551, -6104, -9296, -3884, -1488, 9221, 16972, 13341, 1405, 3599, -9397, -18683, -6724, 5278, 7622, 11116, 10198, 4403, 4414, -6741, 4528, 16606, 7715, 4103, 133]
9254A33p569k033p085o216K508R765Q220J202q467K708J296K400k320k153o893
9239a4504q205J6279J2525n978J681j2151j0656O256J3780L554j2832j2882k191
9226b5324K487L414J7562M165k463j2392J1564R213j0832j2051n797Q665J1970
9213A81J1479l587j4287q966j2629J960J2157J9090K286l043Q58m444m253j23
9199c321M539M435k97J087j2552j2698K621Q14J0368J9375j5535n730O960J865
9185A931r950L933N314L707j0960J812o358n542q927n855R268K0854M135j683
9171A679R513j648j269L435k694l6l878r819O901R326P421m213o079q802l658
9156c821J1931m009n328n190m293k083o276Q49N788Q469J3198j305j1348n107
$$ y = [133, -7436, -9469, -16554, -22770, -20262, -10497, -2277, -1075, -9542, -6834, -5538, -3138, -5458, -7611, -14504, -22709, -6430, 6095, 117, 1798, -10353, -21009, -14753, -973, 2581, -10251, -23133, -25324, -22837, -19423, -1861, 2304, -159, -12551, -987, 8226, -2606, -14657, -20454, -11789, 181, 11660, 8073, -6214, -15180, -27809, -25849, -13692, 5398, 7684, 4641, 5499, 1055, -3198, -3321, 1218, 5653, 5356, 6443, -6109, -18807, -16186, -15372, -5004, 14371, -1164, -6894, 66, 1931, -8019, -4086, 1228, 4935, -6025, -4213, -10571, -16113, -25040, -30895, -21627, -773, 3362, 1679, 11192, 9544, 8275, 11710, 9016, 8980, 5102, -4717, 2184, 11510, 18931, 14718, 8639, -163, -3821, 8110, 4101, -1227, -6417, -10710, -12793, -19069, -18220, -12432, -3963, 9235, 7930, -3418, -8525]
9142h525m529O666j1320j7432J47J3004K0831M109k2050p494J2407M705M721O669
9128A909J188K194m174P090q28o273P178M92o597n506R5J2372j086j4738j1294
9113a7978J3613K419K241o412P052N455m446N208J448j4991L70P793m872n074
9099h174p857j5040M698J7329R064p530J636J0964K3245M621m235o299k494O078
9085B6006J95M690q905n554q847k860j2905N164k97r016o962K676J9733J2067
9071A5185R363j7804q824O72o633o794k070O7j0532O363r714n596M807N051m740
9056c1199K631Q936J1120J0643R535r357m850Q554M480L258Q419J858k1508o242
9042c722N701O437j4303N962J0401l396p915j7318K182J401k914M848M57M567
$$ y = [-8525, -13054, -6388, -17708, -35140, -34993, -21989, -1158, 2951, -19099, -26593, -14186, -9481, -4760, 1909, 3097, 5291, 1117, 8207, 7379, 1106, 8284, 8776, 2179, -3327, -3232, 9140, 8054, -6684, -17978, -4365, -1946, 295, -6117, 935, 6390, 1944, 7152, 8600, -6391, -6021, 1772, -3100, -8174, -16031, -31071, -26373, -9044, 20, -7510, -5874, 5090, 28335, 32956, 28721, 22422, 19928, 26006, 26201, 30891, 21986, 16432, 7585, 4725, -8180, -3016, -3313, -12329, -19291, -16615, 3118, 15185, 24548, 6744, -2080, -1408, -8041, -14835, -16905, -16838, -27370, -21007, -30721, -36317, -31510, -26459, -31199, -28568, -19632, -8512, 2131, 11666, 2309, -2541, 6013, 10493, 13751, 22170, 24028, 2520, -3722, 1979, 8416, -5887, 75, 10476, 7080, -835, -18153, -15971, -14570, -17484, -12636, -12179, -7612]
9028g612J2890q384j1397J141J3905J2061j3283j2777o520l507O45J0047P636
9015e155J643o705O674N041j073q785j3578m351L128K823N070J2364q999J0132
9001a771M245q377j053l412J3254p95p803j883O19R78Q749j3273j0040J410R906
8986i246l78j0182j1199m8L853J0348R31k0142J4036J6687O579r496L800P99N504
8971A846j3261j3247L622Q676O162K500o11j191n921N821O756j1428k746L380
8957i642q527O146J0474o674r100K197L90O43M058K0197K585k980m578N408J0292
8942B0889q982j445j1640n710R944J433L553j1707M617J4889j8212j8809L173
8929a8007N470O589P021O261j7551o736k6k496R144J9657R12J2148l406j4484
$$ y = [-7612, 5278, -3106, -14503, -13362, 543, 12604, -679, -13456, -19976, -23483, -22838, -12791, -5155, -3512, -10217, -3543, 1498, 425, -8360, -21938, -26289, -23161, -20338, -15268, -2904, -11903, -1771, 2474, -5903, -6956, -10368, 2886, 2091, -5712, -7595, -6976, -5998, 2751, -10522, -20562, -19152, -9246, -9624, -19806, -31005, -31053, -27200, -16852, -15921, -36063, -22027, -5340, 1239, -8257, -4457, -3658, 1846, -11415, -24662, -21040, -12364, -6202, -3702, -4313, -5504, -11425, -5604, 1152, -10276, -13022, -9642, -18169, -12023, -1549, -8223, -17323, -15126, -14736, -14093, -10035, 10162, 12747, 9767, 5189, 10597, 20889, 11907, 10462, -1178, -6888, 3056, 4489, 8042, -3665, 952, 15841, -2371, -21180, -18007, -12537, -5948, 1073, 7334, -10217, -16953, -16979, -19475, -10331, 9326, 10238, 22386, 18980, 4496]
8915D496j8514J1297J5750n370p089K43q019o684j7039J437M896J415J9648M948
8901A415j2434q834K287J889K926N929M638j4424r189O075R778N172n786Q223
8887b335J2962K06k23m897j2729J1847o016r356P059R434J144k342j0878L902
8873b222Q047o253o211M853P762k562L080j372j425p821R227j114J171j4105L481
8858e464Q33J0133k1745j2857J0020J693l747m772J9293P336k780m171n433k646
8844a4307R368l040m652j715J5385k81q385J425M984L62j49m856N742P408j0137
8829b848j9000q741J5535J844l550P828j448q956L669J7847o557L383P345j5443
8815i092m462m353r653j681J2627O875K011M125R69J0024L845l289q257J472J396
$$ y = [4496, -14018, -2721, 13029, 7659, 570, 813, -7206, -13890, -30929, -29492, -24596, -23181, -3533, 1415, -11019, -19853, -17566, -15677, -12751, -6822, -2184, -16608, -25797, -19722, -9944, -4772, -10558, -2335, 10627, 10833, 10610, 5713, -7016, 4831, -1185, -10541, -3482, 5952, 7096, 4754, -6124, -2222, 5825, -428, -6639, -1786, 5976, 3414, 6494, 5122, 3697, -4124, 5103, 3989, 5160, -8945, -5464, -4631, 5502, -16243, -29100, -19080, -17387, -21134, -25906, -6613, 723, -2057, -6228, -11661, -14307, -4939, -7979, -12631, -14346, 1039, 758, -7627, -6202, -1218, -856, -1005, -5861, -119, 7289, -2848, -21848, -30589, -15054, -13210, -16760, -8932, -10380, -19336, -15667, 2180, -4377, -994, 6351, -9092, -13554, -17907, -27560, -29241, -16614, -9739, -7728, -3603, -2634, 7390, 11235, 7946, -311, 1161, 2557]
8800B557j264M007r105q606l04J7760R033r115r095N916l894l371K476N326P743
8785A0064P994r811m674r794J1320J766N117k899j3775j4808O590J01L632P724
8771a453l203r407p801n766Q355J5293R161j4358j9164M753N989K0737J4373j1963
8757E546n054J833l559n945P255n322L693k975m474p276r67K541J3426J479Q24
8742A025l247m952P67P842P194k507n999p140Q2K995o628J0712K92P406p435q038
8726g631L453k884k980o094J291J3933J1525J68k544r893r402L270K458j008M001
8711b337M276j319j2392n309K728J0933Q819P80o217k059J3189p213j0689N102
8697a708K525M446l371K184L285q24R507r648N712N085l386j7137J503K482P36
$$ y = [2557, 1293, 5300, -3805, -12411, -12715, 5045, 14078, 4963, -4132, 1784, -2110, -5481, -3005, 2321, 10064, 18058, 8247, 3573, -6221, 5099, 6865, 11982, 9083, -4692, -19500, -12910, -12809, -9177, -1453, -4656, -14063, -21864, -27630, -19275, -3982, 5179, -9179, -28343, -23590, -17601, 3136, 17509, 5546, 492, 2325, -1234, -7179, 76, -5246, -1553, -4528, -9002, -16278, -17245, -14704, -1278, 201, 1025, -2222, -7174, -6407, 1435, 8629, 6122, 123, -7017, -6935, -3940, -10568, 144, 436, 7842, 407, -7631, -4178, -7062, -10042, -16136, -14845, -912, 10613, 10781, 8237, -1656, -11058, -7788, -5330, -6338, -2337, 1939, 620, -11772, -17081, -14353, -3420, 5399, 6179, -38, -2097, 11092, 3879, -6810, -1708, 817, 5263, 1892, 4076, 7361, 6537, 16044, 6396, 12108, 17193, 13807, -3330, -1827, 655, 1391]
8682A391R580m849k861r181j40O919K12j6381n089J1602N370l139N56L280o23
8667c353p58l974J900k450k2J2772M654P72N504J980l272n000p505j2288L700
8652g340J5600J8349P124j0788q448N285l025q572j4235r777J0856J1281m726
8639A584q111O827J1226N41k0458M63Q546K046L302p393J2039l197j4813q325
8625a5723J0133P905k57j958r581r35J890J60J06o073L063j220J588p102J0110
8610g894k194L426R539q035Q979L30N139J5640j8953j6944Q471j028L11O008N470
8595H265M214J186J01p764p826R949j308r121L59R654K678O04k043Q626l962N768
8579A9380J6227p054j5956R33p527o289k825O829L641k84P139j7155o936L834
$$ y = [1391, 10971, 6122, 3261, -5920, -6060, 859, 1071, -15310, -20399, -8797, -3427, -6566, -6010, -2730, -3353, -4111, -8085, -6185, -8635, -8657, 4115, 8769, 9541, 15045, 17025, 13753, 8753, 1248, -11040, -7340, 8260, 26609, 33733, 22945, 14497, 19782, 16757, 8185, -6050, -15827, -4971, 6310, 1584, -6527, 300, 11526, 12067, -8391, -7928, 618, 2664, 5966, -1427, 10612, 7415, -7398, -15723, -5590, 2315, 2058, 100, -9481, -10416, -8526, -8366, -8260, -14333, -11270, -12490, -10902, -18004, -7894, -10088, -6662, 2877, -5158, 3821, 4151, 9290, 24930, 5977, -10967, -2496, -3524, -3213, 2795, 8265, 12479, 13665, 13766, 6002, -1824, 8125, 6817, -2304, -1945, 7709, 10387, 10991, 8948, 17574, 13612, 19380, 35607, 28553, 12597, 13530, 6003, -286, -3111, 3718, 7359, 7075, 14214, -2941, -9877, -6043]
8565f043p373M471J107q045J5998L399r230m330M072K2957j4115p731P114J0396
8551A2647L338k1119o403J9679J9477M310J461M610q298k3585J762m363j063J652
8537D105J2617J675N0k825j6735o727J6730m184K343J78P02O450J2912o757n270
8522A5264j965n509n30k394n734n823M524l411J156o350r40j1700R98J1217K7711
8507A6514m009p463R1k2L134J438k006q140o086K89o87j031K093Q923j0439J4938
8491G537q364j6832l863n219L834L362K074K528K0142j7034j7513m00J8108N762
8477e878j6308N170K9405L9K259J3121j927r349J52Q241k257k310N269L239N783
8462C4649k871l63j1672j6134m550l592O434J0424J365m231p948J167R73J1316
$$ y = [-6043, -13416, -8945, -7838, -15883, 115, 3514, -5716, -10046, -5974, 16983, 2868, -4863, 2251, 12647, 15985, -5134, -11537, 8142, 27619, 31929, 33390, 38000, 29702, 6117, 7879, 3516, 2453, 4105, 16722, 18397, 18447, 15622, -1113, -7840, 8890, 4706, 7049, 7227, 7929, 14379, 27291, 20534, 15264, 13299, 7790, 7260, 4866, -868, -6691, -2167, -5578, -4422, -10772, -11712, -23412, -22414, -11197, 16514, 12505, 5042, 5133, 5111, 8245, 9683, 7677, -463, -6549, -6260, -6947, -7978, -5885, 3038, -7401, 7537, -827, -17659, -21522, -26741, -22907, -19545, -17471, -14943, 5199, -11835, -29348, -29748, -11640, -5878, -22186, -17016, 12389, 12428, 14687, 27808, 25881, 16532, 16684, 24925, 22668, 20358, 25627, 28866, 34649, 31778, 31415, 19743, 3609, -941, -4533, 1901, 12325, 13690, 9459, 1511, 2678, 3651, 14967]
8448A4967Q217o694j7266J109K875J35J039M885K043J0364J2982k0891j1627j4317
8434a2179k626j303O97M004O279J1663K325J731N67o962j8610P677k678n845n891
8419b1151K962J773j875r85n778R61L574J5546L753o401j3626m006p340L326J3779
8404a5488J8261o231o33l104L909L352p014K222P00q185p594J970p326J8305R712
8389B856l187l297J1673q75k437j0052R7K773q25P300k540O59J230o107n173J904
8373f001J4356R373j5796o717q692K010O470K261k293k034J0516J727j8219l852
8359a6891J2284J4316m39o167j999r622K210R610O733K1421O46j8195m627o443
8345B837J50R84J757o485P693j2627o35K090l462P264J3315j3409m915N826J9
$$ y = [14967, 23184, 16490, -776, 333, 3208, 3343, 4382, 9267, 11310, 21674, 34656, 13765, 2138, -12179, -14805, -16108, -15411, -11407, -5128, 6535, 8860, 10591, 11158, 4196, -14414, -6737, -9415, -15260, -21151, -18189, -16416, -18291, -19276, -25054, -24093, -20519, -4973, -1220, -7621, -21247, -25253, -32593, -29267, -15488, 2773, -3458, -4091, -7195, -3286, 66, -6948, -4726, -4026, -12211, -19805, -17835, -25161, -6856, 2856, -331, -3628, 8045, 7170, 4733, -5319, -5222, -2449, -3274, 4026, 1486, 2145, 3375, -2732, -7905, -6001, 8355, 17728, 1932, -4785, -13477, -11467, -4997, -2736, -5029, -7063, 3453, 5180, -13039, -16891, -4607, 9709, 9270, 3103, 1104, -8518, -6308, 3302, 10035, 31456, 32102, 13907, 9280, 2837, 2987, 3971, 5728, -757, 6936, -5691, -6326, -4236, -7698, -434, 12881, -528, -5443, 383, 402]
8330D02j600J066p995p436K398j066n195J0819L527n642j6401r328K189J1370
8316b2892J3150M353J2937l5k386k633r03J6529k998j7854J590M275j5772q493
8302b1132J0775K2402j1597n340m715P815J7307L879n648j9026o593Q08n648P192
8288i521J0524Q766m977j7550n861J786O061M661j2603N87m411j200Q838J4377
8274e23Q335O523o286m95L51L166J585L760Q181p283p303j6769q433m965k828
8259b2984o006J574L333Q001P246m158J5880J4975j5949j1963P864q031p053K931
8245a4340P025Q941p237p860O645K947R799J7842p903n570o600m734j347p785
8231a0177N800J227N889K555J42o082j512L465J9583k73n504k284j1814q364m38
$$ y = [402, -1198, -132, -8127, -15563, -13165, -14231, -19426, -8607, -5080, -10722, -27123, -36451, -34262, -22892, -9742, -5389, 7548, 7513, 5127, 2494, 1591, 18120, 15122, -2732, -1142, 3133, -12639, -21132, -10357, 12045, 448, -4892, -9607, -1792, 15515, 19394, 13746, -5280, -11873, -11065, -16713, -9521, 1003, 9769, 4792, -12758, -18619, -16833, -10772, -6111, -18714, -18127, -22538, -23738, -14900, -523, 7812, 14335, 8049, 7554, 7905, 11071, 12656, 16416, 24597, 17314, 10011, -6758, -15191, -20156, -22984, -28990, -27416, -24083, -16082, -8836, -12994, 2886, 17861, 1912, -10051, -2187, -10218, -17271, -14340, -7315, 1626, -5611, -13471, -6826, -3879, 5920, 23762, 15859, 10289, 3689, -1045, -2392, -10177, -4377, -3150, 2739, 5294, 5436, -646, -2158, 1307, 20890, 20617, 15113, 12829, 1015, -7349, -7787]
8216g787Q556N923K76m761M952J63j2931j2505M792J5209m260o541J284N466k3981
8201b6145j725L711K238M691J2829J871J100l248Q344P402o324q793r467R60K2046
8186I490J883N949J083N247n939J97L939L920K747q82j0193k0458j5142o041N264
8171a8936K2442J6188j943q389j0494j107K411k17o955l493j3769R390n872k72
8157b1016J0891m613Q927J1068m734m146J2425j6944j1926J6905J1176m942j2624
8144i553R996O952r333N87p042m014o740L154o922M312J7892J7858q800r722m773
8129f148J4038N325l856n645Q688J0483o232j9095k282L126q609p950J2089K846
8115c222j0030j0630R726J3988O068J042j4352p990O566Q218Q938k157j3641n110
$$ y = [-7787, 769, 6692, 6968, 2207, 7159, 7322, -5609, -18114, -13322, 1887, -2373, -8914, -7630, -2164, -26145, -27870, -24159, -21921, -17230, -4401, -2530, -1430, -4678, 3666, 11068, 4744, -4049, -13516, -12556, 9490, 11373, 17322, 18405, 23652, 17713, 17910, 21849, 25769, 28516, 27634, 17441, -3017, -18159, -24200, -18936, 3506, 19694, 17751, 9362, -1132, -2239, 172, -45, -7000, -10493, -24262, -14872, -20744, -21016, -10125, -14738, -5811, 5257, 523, -3623, 8802, -8142, -20068, -3163, 8013, 3071, -9553, 443, 7395, -1938, -1351, -8393, -12407, -19147, -15993, -22915, -18603, -711, 17147, 8347, -1375, -6148, 7890, 13215, 9359, 3714, 12402, 22885, 16653, -2442, -4724, -1598, -10207, -18157, -6068, -3222, -13252, -23882, -14156, -168, 5900, 6942, -7410, -15400, -8834, -616, 8322, 6165, -7476, -12586]
8101a2586Q954N008q837j3068p059m840M796M009Q911R220p485N17J4740o774
8087d494q644R834L143j8354J5843J1587j1964m665R60K030m253J2859j647j0493
8073h258m483q905K070J6102o507k0814j087J7307P462K373M033J0495r229j8817
8059a8258o304k934L600l863j329K2899Q804o622k966o379J2962R166q145p365
8045f734O185K215l115k771J1204Q786m491j6106j1220P265J0966J0243j5075
8032b648n782J1677M888o86j83J746j816q588k294m639p009K417K536m24N907
8017d898O404q267M550j2585K379m623o093m03J4264J0409N10p28l623J690J0375
8002I361K3698r407k7466j3413R535J1780J114p279j028k90J1362J6520J895j3178
$$ y = [-12586, -3632, 1376, -7461, -20529, -27588, -32428, -27632, -23623, -14712, -5492, -12977, -12460, 2280, -4494, -13138, -3304, -161, -18515, -2672, 8915, -3049, -7714, -6754, -4724, -8977, 3882, 2235, -8258, -12741, -21646, -19576, -3474, -9981, -30795, -31882, -14575, -7113, -4740, -707, 9788, 559, -18258, -24562, -27496, -23896, -27759, -29088, -6189, 2615, -4007, -6973, -13352, -390, 8776, 631, -6734, -549, 1666, -1449, -4220, 6984, 15770, 11279, -4827, -16047, -8782, 2184, 12427, -2648, -8430, 3247, 8135, 7449, 7266, 9012, 7196, -1392, -3686, -8325, -15334, -12917, -10381, -10805, -4898, 1506, -6761, -2211, -14796, -12417, -17040, -23133, -23536, -9272, 1137, 1647, 919, -2704, -1014, 9361, 33059, 23652, -3814, -17227, -7692, 4088, 5202, -2077, -3105, -3395, 7967, 24487, 26382, 13204]
7988A3204q42J535q060m462L71N993K152l075j568l988j0631q026R683N337N846
7973C469P531K819o243l800r295Q44J994Q037K796p052p992n734K433R150K015
7958I72j583J879L50L993m087K430O991j929O268k364O813j42o805k223K131n515
7942G179l820Q474R182J785j5824k181j0737m145N422m895R09k394k861k262O608
7927i560J4780J1280J1405n456j524k410j0193o770N978l770j5920J059J4488
7914C387J4808j550p074N814K976j7512j8541l046N677J0926J1416l848J33R87
7900D553n755l810o104Q2J1375O536r94P119m882j3396k772J0752P126Q137p521
7885A0446J68l923j6219m343K809l467L912J4730K628k75R477k0821j0149P524
$$ y = [13204, 12362, 13897, 5837, 1375, 1746, 7739, 9891, 6816, 5248, 1260, -9371, -17397, -7714, -2377, 3469, 11000, 13819, 7576, 3776, -5519, -4675, -2681, 5356, 8152, 1100, -6892, -12626, -10193, -1043, 972, -611, 1268, 1618, 5611, 1524, 3954, 10945, 9016, 15284, 12920, 19733, 19591, 12786, 10563, 12694, 7179, 3359, 11833, 21015, 22800, 6976, 4795, -5942, -10087, -4665, -9560, -8651, -11045, -13906, -16168, -9560, 5220, 16500, 27905, 22449, 20925, 18515, 8322, 1552, 7530, 3760, -12160, -11101, 3387, 18195, 16645, 9571, 15385, 18361, 849, -17692, -20738, -15061, -4135, 7281, 3433, 3566, 4553, -1202, -5012, -11116, -11034, 341, 6877, 5883, 13002, 8120, -5276, -8048, 2704, 9830, 17967, 10446, 10614, 6691, -9528, -13871, -11062, -14529, -10617, 4113, 6741, 6466, 15943, -4878, -15027, -7503]
7871g503O61K6408N00j4878j0943Q354j965N597J0005k898j3690j3671l828L937
7857a3914k722J4884K896j2176j0152J4576L892m771K751o594N50O258m514q986
7843a8022L499P281J259K543M633Q067P86n678k288j2788l71N342l657K005K095
7828e294m75M581o405N917Q181j3278r123k001J2578L70m387k0293m412J4231
7814a9810J5330J6990j1250m401J1093j3072K334J1529J6753O17m695j2142l345
7801E931l798j1416N529m296k370j901L297M822N479L203j6423k545O226p695
7787a5957j0892J1362J4775n03l436O547J6564o110m051j3093j3419Q886K1175
7774A1848j527l240Q067p363l310J1311j2268j4575N649M958N926J0002l319j3397
$$ y = [-7503, -6842, 19566, 20066, 5188, -5755, 2599, 634, 6231, 16236, 13338, -352, -14023, -17851, -13914, -16636, -1752, 1144, -11032, -21184, -6608, -2716, -7487, -4736, -11330, -10780, -4522, -9036, -18022, -14523, -7242, -5983, -3440, 1193, 9260, 10046, 4368, 2080, -10708, -11079, -5737, -9394, -7389, -5294, -5769, -1188, -7593, -1676, 6505, -6773, -15896, -17897, -5319, -4949, -9336, -29629, -34041, -19810, -4480, 12510, 1260, -3141, 7952, -5120, -2786, 8743, 25496, 26113, 21418, 9276, 5931, 2133, -9283, -3754, -8050, -10420, -12321, -9024, -4202, 1277, 4480, -11943, -14488, -8262, -15957, -26849, -15487, -712, -1215, -4651, 1896, 18460, 12350, 8299, -4794, -18213, -9327, 11848, 10321, 7081, 15148, 7785, 4475, 15786, 3518, -11057, -5408, -450, 5476, 15478, 12159, -1238]
7760a238j124k122p446m392J3862L9451N335k3588r223J174j2153j0404Q334J043
7746b491j1899j1239J1804J2318N011R998j848j0113n50j681k539r919k600R540
7732f208M049j366N402j331R91p270R107J3632j6843j0992P139M487o654J846
7718d011j415m591J458M189L412K520o340R244n254J1260K140n804p490Q762p387
7703F93m015p743P310p042J0477m65r217R726N610M227l508j3621L836J0745L286
7688A0299j7306j4923L207p154o378k048j478M87J0092M456R193m905j0934J1853
7674a5539R205o014J3759R789o722k2208j7041R680Q526N819L956K518J156m357
7660g473M954j887K29R735J190j55L709R707p309q024r520K702R853k6r690r248
$$ y = [-1238, -2362, -4484, -11930, -16322, -2460, 36991, 42326, 18738, 9515, 10689, -1464, -11868, -3534, -2491, -14390, -25629, -13825, -1507, 3504, 13502, 11654, 1541, 991, -690, -3229, -13148, -15748, -6208, -2159, -3525, 1877, 546, 1537, -5733, 3374, 17006, 163, -10829, -3690, 797, -5857, -4011, -5426, -10017, -8559, -4370, -958, 1562, -4778, 4466, -788, 10472, 12612, 6808, -682, 8080, 693, -3322, -11065, -3755, -10797, -320, -785, -10002, -276, 5334, 9561, 6053, -7568, -3732, 7013, 10299, -7007, -21930, -18723, -25877, -32255, -34303, -35781, -35294, -25202, -20746, -11553, -16458, -27392, -15539, -6334, -12348, 1411, 11200, 4478, -17730, -34771, -25091, -16565, -10746, -6790, -4272, -3116, -7473, -2519, -4406, -4177, 5558, 6748, 6593, 10302, 20009, 12700, 4676, -4844, -2142, 7711, 7685, -2005, -11253]
7644a1253Q227n29l534r219j059O897L839Q804k074j579l547M102m850o357J672
7629a0460K473O500J2465M972o025L422n279J8296P46m179m025j6002n759k538
7615e393O602n484L92q953j3194N940P13Q10L318O353J2509Q349j9642J056J2011
7600E387O678o204o881j2628k019J5340M626m494O779O933l71k83r465l659j14
7585c75l507q17J564n287L988L08n33J727R647L757k095k415k690j2172J235N527
7569b138M433L589k939L756o418n246L278Q379j234l561l745M149o722k94K058
7554b655J170l988M984L810R415q399K354J540m352J671M491r590K287p762K002
7539c022M697M785L475J042r24j1991l79j757j777k695j124J201k732J5069k456
$$ y = [-11253, -3026, -3555, -7089, -16308, -17367, -10470, -6631, 2173, 99, -1480, -5027, -925, -5775, -12132, -10460, -7987, -1487, 10978, 15950, 9925, 13347, 8068, 26364, 27110, 22931, 18906, 2904, -2855, -5393, 1209, -4275, -3883, -12836, -26030, -20090, -19377, -18567, -15249, -8896, 3613, 11962, -7680, -6624, 5387, 12065, 5861, -1020, -13648, -15667, -327, 4299, -195, 6584, 13517, 13146, 12863, 3398, -261, -375, -3882, -4699, -3135, -8422, -4434, -4126, -4659, -2932, 6715, 10472, 8377, 5962, 3272, -8900, -7665, -2138, 2295, 5884, 2945, 6701, 283, -4963, -1685, 6694, 5460, 1899, -1846, 2303, -4419, -4713, -2655, -1485, -5473, -489, 3321, 12736, 4337, 6691, 8231, 3879, 5550, 10041, 451, 2738, -5024, -3022, 1675, 6460, 9935, 10977, 10053, -1938, -2317, -4074, -5851, -8546, -9670, -8469, -11201, 3868, 1412]
7524A412j1898L071J223m663J521n448j529N615l955k327n764J1544J6911k797
7510B916n397J929j0758j2022N806J0023Q934j071r054K34J0604J531l844p908
7496h077m436k131k278N779Q393R491J511M862p613j2411q554K952j486O603J174
7481f221M303L226M780p491l616j1134n947J2820J4069N956q257n627q357P157
7467d339R633l670R342M259J426m641j0129J266n674j1819J539J3139K0002l777
7453A6557j5426q16J1405J359r300j6156k825R388Q651N326O94N175o239j0168
7439b375R914J240j49J2313J2909j9527o635J261O161n018r410q718P531L808
7425C305M307r285m515J602J0973M386n12k771j2592O025j383r741n06K858M523
$$ y = [1412, -10486, -7415, -6192, -10855, -9334, -14782, -16311, -10696, -14651, -16978, -22742, -11198, 5713, 2916, -2481, -552, -11310, -23332, -17526, -7503, 1431, 360, -8694, -8460, 2144, 3675, -169, -8077, -12513, -14644, -16922, -11143, -2750, 6741, 8252, 13114, 5501, -6910, -15464, -12512, -13998, -7395, -6221, -1918, 1308, 6088, -1403, -5019, -16153, -22100, -9280, 4789, 10745, 2488, -3139, -11496, -4339, 5294, 1624, 10966, 15225, 16651, 12010, 1881, 3147, -2527, -14346, -12807, 332, 20334, 16557, 1131, 315, 11720, 13079, 3779, -12377, -15202, -5814, 2837, 8163, 8857, 14032, 7793, -2375, 7539, 8779, 8630, 20943, 33852, 14325, 7690, 8951, 15112, 10094, 684, -8034, -503, 3305, 7612, -1673, -6188, -4586, 6387, 10773, 10261, 7490, -5102, 923, -460, -10201, -10707, -7849, -3326]
7410c326R232M712q58n786k16o486j2003j91Q189J3247M575J12m249j2977j1106
7395a7131L890l233L423R478M099l543q214p79m379k245r487J0564O627o20L302
7380h248L203q470o380o26J2389K019n356K193J011q759L941l63J7224P321r502
7365A597m775p865L904N238j0285J939J307N207k806n012n977k217O355M584L082
7350e724J2703L633q306Q289j4835j584M531J0337P321j0250k9212J222K2110
7337B35J5798J076j4394j3828l261O899Q389J538o584m646K293L106K486L423
7323B530q832n611j49N6N881K2679Q562p376n459Q990l410j4333j0900L11P093
7308C2p52m920q250P0K526j0057k167N901N209J9154N771j2279o544J353n859
$$ y = [-3326, 5906, 10618, 9760, 3974, 3758, -2728, -14731, -14922, -6733, 6514, 11089, 11201, 6952, -6025, -17131, -13241, -16474, -13051, -3573, 526, -3017, -11231, -12010, -16389, -18634, -28121, -17557, -10930, -11550, -8248, -5045, -13515, -19895, -20521, -8132, -6113, -11469, -9276, -8265, -17024, -13083, -13446, 3778, 11099, 1597, -3178, -11043, -7139, -1901, -12186, -10247, -8940, -3733, -6539, -11551, -17528, -19745, -13390, -8806, -5724, 6979, 10612, 2306, 10595, -4240, -5824, -1293, 9044, 16365, 6115, -23097, -21875, 235, 16033, 17109, 2715, -11113, -14374, -7475, 914, 2452, -4132, -8778, -6485, -3379, -893, 2530, -6302, -11913, -12062, -12006, -6125, 16554, 25116, 17740, 12281, 21271, 17861, 3528, -7372, -7061, 32, -720, -5640, -13890, -13820, -11294, -21351, -23518, -17617, -12408, 6746, 12517, 238, -6306, -4953, -10812]
7293a0812n655J114J2629k675j2802Q96N486N311j91R363M606Lq932P08j457m054
7277f462J02J7393J0206o081l906n12o826m497q412j0208k695Q723J3788J3225
7263A3838J2236L16L133j4088k7871L844J9194J0803p971j8504p585o430K674
7250a6411R551K633M387J2024m90P744M476n101r872j0368P972N466p544R227
7236A3694P446j1156k1040J731P859P907L169n644j3687j052n990O532K0991J4873
7222B5633L300j0044j3133N547R760l064r170r713o704l599j638n463L296J072
7208a3920J957J6156N635r021p5M397n833K75K224k132P630p078j2342J0321P970
7193F164K905l446k43J748J1887j617j6538p042n529N815j1155J0742J2060p451
$$ y = [-10812, -16467, -15353, -2724, -5399, -18201, -17305, -11819, -6508, -6699, 2664, 7270, 7273, -1659, -951, -2408, -6462, -6360, 11033, 21239, 15158, 11252, 10740, 3914, -583, -8995, -19203, -21898, -13175, 613, 13838, 26074, 26390, 29523, 15435, -12436, -8592, 10602, 21405, 13434, -5070, -12655, -19085, -16411, -6860, -4227, 160, 12184, 11694, 19438, 23914, 18813, 8941, -1427, 6545, 12011, 4467, 13694, 21140, 9984, -11056, -9325, -1466, 6441, 9610, 3966, -9721, -10773, -16763, -10231, 10760, 25633, 28933, 18889, 5756, 11303, 21063, 17999, 8829, -884, -7588, -11187, -12825, -18288, -14992, -13920, -11963, 4193, 9828, 807, 732, 5129, -704, -429, 1795, -337, 7293, 215, -12127, -1806, 6164, 9069, 5623, 5380, 7128, 19015, 17398, 860, -6182, -11711, -5896, -17051, -6309, 5751, -1700]
7179a700N85L539k015o835O319r868j0691L940p204K597R179K0267L446l250k169
7164F140P595L876j662j0963n628m806N911j967K668j3228O617K217o725o830
7150a6785J0888l014K782Q364m471r855J278Q988K185Q042M579j4958n399n913
7136a3289k663N019l960J7717O152n008P435J4181p066p310o165l029Q479L336
7122A3829K185p003j8618o116Q394P631Q635j1956p874Q057m282p880j2080j448
7108b8526O531J256m084J2893J0340M078Q08P09j0299M744R529L260q788j2273
7094i822k647N5j1050j933J7580K1629J6798j5669q78J1821p840k9342m892K1202
7080E012J2254j548o729j8329j1113q336j117K0549N98m310L897O098l842L944
$$ y = [-1700, -1115, 2424, 409, -6426, -107, -9975, -20666, -16726, -23930, -21333, -12154, 8113, 11559, 8309, 6140, 13735, 17611, 15949, 4986, -642, -5448, 463, -1504, 1164, -12064, -5447, -3230, -9955, -16785, -5897, -8911, -6129, 2235, -2236, -12091, -10813, -1825, 360, 8402, 12981, -1977, -7376, -13289, -15952, -10933, -14893, 2824, 8976, 3968, 11403, 25584, 18518, 11208, 5043, 2014, 10493, 13829, 16014, 9011, -9607, -15723, -7329, 302, 8937, -3019, -10893, -2836, -7118, -14998, -27078, -28526, -21995, -20739, -24823, -11930, -1590, 2488, 3296, 4005, -6294, -1550, 7979, 11239, 2451, -9822, -12469, -12414, -23464, -25397, -7817, 13812, 30610, 14941, 14063, 25884, 18044, -11298, -16190, 5012, 17266, 15718, 8989, -9340, -20453, -28789, -29906, -9357, -8759, -13069, -9172, -3074, -6916, -2972]
7066b972j0042N08J2210l340M478q256j2268l136J759N462P087M699R218L788
7052I195q708N067L760K546k282n27j238l725J1690o00q453N757P848k220p397
7037A0713j3108j1210P362K532K261M152l573j975L741m607K462j7032K70j263
7023a9275j3242K108J1009J3363J0538n747L621J3202j398k4776j3414N093j5794
7010c4712o618J0650J7922J3650l236O289k907m179q950J1324P239n118j6089
6997a4735M667J6818m499k115J6128N536k6111l128J0543N704J8185o79r762j6045
6983E07r557k163R853M874L160L928j70o764m229j808k856l274N175J1989R352
6968A8017j2804j1331N001j0726r521K910J3703J4023j0180j0680M040k098J7003
$$ y = [-2972, -13014, -12506, -296, -3636, 842, -7414, -19682, -22818, -21059, -15597, -8510, -3811, 5407, 9195, 487, 5554, 9314, 11860, 9578, 9051, 7813, 4088, 15778, 15178, 6725, 12482, 20330, 18110, 10713, -2395, -13605, -6243, -3711, -1450, 2702, -871, -2846, 895, -3712, -1250, -18282, -18012, -19275, -32517, -30409, -19400, -6037, 4501, -1246, 2375, 15577, 14179, -10597, -24011, -18918, -34712, -41330, -30680, -12758, 892, -2344, 3945, 1038, -3141, -12091, -767, 6472, 1354, -14735, -10068, 6750, 2251, 136, 16264, 21800, -4311, -7439, 3104, 8808, 26993, 26314, 16552, 507, -9050, -11213, -1360, 3514, 6674, 10602, 10432, 3668, -561, -2369, -5225, -8499, -3324, 8665, 18017, 5213, -6118, -1117, -11843, -21364, -18454, -4751, 9272, -908, -11588, -7548, -9646, 7357]
6955G357J1486M142J0017R664k3428j9337j82p497r005k27K906Q693Q503j518
6941A574r366m611n062P653J988R93m330m325P412M931j0566r419R976o060l382
6926b2594L860o192k197J2254m736K42P441p314o751j972Q953P821N006o160j1328
6911b3667P343J7824Q012Q018k982L666j1815j5360j8039k96L522N31J7160N050
6897a033r766q36m50k230O799r074M700p972m340J4657K0694m588n730N821M83
6882G135n219m685K132K3j2933K268L359J1782N637m924M913n033j546k672k3018
6867b2781p413j713K999K789M103p584K0052J0165k431l336M691J257j2043j512
6853a2757P423M368J466q571N98M100P999l2k775N927j1212o402L604J145m610
$$ y = [7357, 18843, 22985, 33002, 42666, 19238, -99, -281, -7778, -16783, -17010, -14104, -5411, 3092, 1574, -7792, -12403, -17465, -9812, -7824, -6831, -11161, -15486, -8074, -3143, -13709, -23128, -13152, -19212, -22594, -18734, -24926, -27123, -14869, -19605, -19363, -11922, -19236, -25987, -27959, -19006, -11185, -6179, -12339, -23667, -16324, 1500, 9512, 17530, 14548, 18214, 6399, -8961, -27000, -27296, -23774, -23243, -6083, -1033, -10799, -11635, -12085, -14315, -7516, -16590, -11890, -19862, -24202, -9545, 11149, 6561, 831, 6652, 7135, 1916, -2769, -637, -614, -13547, -11279, -7920, 3862, 9499, 4575, 9488, 4455, 2909, 237, -22781, -30194, -31907, -28908, -26119, -22016, -29600, -9548, 617, -1814, -5150, -459, 798, -11245, -12757, -5334, -966, 500, -8071, -7473, -3373, 4626, 4594, 1819, 7746, -3466, -9868, -6264, -5119, -9729]
6838i729P507J1370p905j1026K012M884j308k277K6k305N689M914K520l930J4863
6823A5305Q005m073l108j5468q170j358k86J2837o151r526m075P016j842N513
6809e381j208m550R713l20L851P00J0532K0728K647l027j2577o619m780r053j348
6794f92o829O42J1254J5739j2458l58p970j4667j509J4368j0888r647Q359K45
6780a4411o575J1641M994l81m695m988P297J662R65P134o922j9443L451J0410
6766i861J857M156q34n367j293Q444o963P206M52j0317J951L328M265k743j7530
6751b3249p472m695j18Q424R335l100j0287p476M981J4548K7416J6357O774j4558
6737A6880n661j1009q376o799K324l606M50J1764J947q357m42M613J3871k289
$$ y = [-9729, -2222, 9148, 1243, -9783, -7771, -2887, -4195, -6472, -6446, -8751, -3062, 1852, 4372, 442, 15305, 23310, 19237, 16129, 661, -7509, -8867, -9153, 3684, -2467, -11993, -16068, -9052, -10894, -5381, -6589, -11139, -1426, -1746, 2105, 2805, 13337, 34065, 36712, 33685, 21108, 14489, 9709, 656, -692, -7521, -6879, 4375, 20114, 7656, 7298, -672, -15339, -16848, -2480, -13368, -23015, -14656, -14411, -20986, -9345, -4351, -4732, -9427, -14415, -7118, -5456, -4491, 2643, -4279, -23722, -20271, -9861, -8004, -3848, -4682, -10049, -11342, -2898, -9861, -2655, -2203, -12520, -10569, -7241, -2976, -5719, -23249, -30721, -35416, -35534, -27110, -17775, -20875, -31162, -38638, -33657, -19109, 8307, 24664, 31438, 16880, 11219, 210, -8166, -14965, -12641, -16247, -15797, -4033, -2086, -10443, -10885, -6272, 7599, 5310]
6723E310l921P146j3485M238J4057j748k1j0609j5547k43N317L350N933j840R392
6708G329L34n51K914O145J0556j65r128r465j6630j1027J1075K5476k83j6636
6694e6j2814n708M081j0587j1159K7157R863K122m988j5660k266Q632J1576o138
6680e945j3782M772j79J6757O805m255l245N039j5226r532L423P452Q937J378
6666B399p11L416m638l05j047n237N827L317j4064n990m64K152N698N125j172
6651e694j0294r852J3017K2131k0651j7730J5164J469J2633J3047J119r323j0574
6638e538m106M699q629j288n189l828Q954J2032N270q426j2216Q678j431j2328
6624b3346M082R925l583n724J1394J4332j6378k44M267P610J045j037j284J0784
$$ y = [5310, 1389, 8535, -4950, -712, 13345, 11597, 11576, 967, -14580, -14823, -9506, -6156, -223, -2063, 7329, 7663, 7112, 10026, 16171, 26727, 26562, 17434, 7969, -8661, -19688, -8613, 16863, 16580, -56, -12870, -18578, -14497, -25084, -36243, -9086, 777, 2899, -2089, -17749, -20015, -11383, 193, -5945, -19727, -14955, -15134, 1623, 8428, 4173, 928, 5967, -9259, -18791, -15368, -7916, 1021, 2399, 1688, 5104, 466, 161, -886, -6123, -296, 3021, -11043, -17033, -17497, -15345, -9647, -4522, -5694, -15988, -25840, -12823, 9308, -11343, -29073, -13909, -12440, 193, 13240, 14359, 5036, -5538, -9644, -4945, -13574, -14862, -20051, -23879, -14925, -2893, 2377, -6049, -18265, -9587, -11018, -23346, -19264, -9339, -12922, -18646, -7252, 7080, -9298, -9542, -5275, 2335, 3380, 2343, 1059, 11843]
6610A1843M802p927M562K14l466M071j0293j1246r387M402p663n960J4068j660
6596a3640p043J2158n402l988R97N794K381N005n356M20N329J004l030r757j1311
6581b6439k23N111l882k377J2707J051P99M149J1334n065J7727J641j3958j2580
6567a0005r512n360J0885L265N711J051P66p502J377j53J728j7132k499Q45J533
6552b5002M685P324m187l273n715j757p28R861J5665j0634L157Q035q631o16J2483
6537F67J1340M486O389j3364L982J4288j3320j3658L754M870O783j1487n102J3283
6523A2911J3724j6988q883j434J672k18J417N9p722M603q622p010o726L356J9887
6508B6J5882M055j8210m319j849O78R755N481n676j917P756K815k926j571O830
$$ y = [11843, 16645, 8718, 13280, 13494, 10028, 14099, 3806, -7440, -16827, -12425, -20088, -26048, -11980, -13640, -20683, -8525, -13927, -17915, -16918, -11124, -8743, -3738, -9094, -8674, -3345, -2341, -5371, -15128, -26439, -26662, -21551, -25433, -27810, -15103, -14052, -13253, -9104, 2230, -2835, 14892, 16533, 2575, -10005, -19517, -24877, -13992, -10727, -5016, -3965, -3199, -10701, -9324, -9477, -7749, -24881, -27380, -26535, -25002, -20317, -12993, -17180, -20453, -26168, -27925, -28653, -18792, -3127, -13761, -10604, -2569, -11200, -11816, 667, 12007, 16493, 22882, 9518, 13500, 27788, 14468, 810, 4564, 9434, 16217, 4730, -372, 12911, 26635, 9647, 764, -670, 1002, 784, 2201, 2260, -5462, -859, -9481, -16491, -23217, -19861, 26, 15908, 19963, 1753, -2566, -4415, -3737, 6018, 11499, 5823, 3906, 11662, 14477, 11551, 9980, 16810]
6493A6810k00M223K892j0356K273o011k918L855J2338p058j4678j714R830N694
6479A4980K211m733o343p461p074P212p080q085L646K23N207M530J0162J0161
6465A7556n590j1485p83l506q072J66J65r25J963J802p778Q798J268N364m529
6450e586o042L08L408m70m46L333R21o34N537O559l699q391n902n571r41j998
6434a9614m210J3770K1035k94j0201m490O321K329K905Q358p015m348k931o072
6420d457N536N535j332L066R710L828j8j4037j7426p162j066N058O482N049o539
6405g773K078L271J0828Q319r09j2946j331K421L090l812K096o306J17K972r04
6390A211j0400M109N046J283k2421q118n221l821J2075M745J7108R353q354j2755
$$ y = [16810, 16610, 20833, 23725, 13369, 15642, 9631, 6713, 10568, 22906, 15848, 1170, -544, 9286, 14980, 17191, 12458, 6115, -1346, -8420, -1208, -8288, -16373, -12727, -12504, -7297, -2767, 7395, 17556, 11966, 481, -302, -3808, -11880, -11714, -11549, -12474, -10511, -8709, -16487, -7689, -6421, -1057, -5586, -11628, -11320, -7912, -8382, -8828, -5495, -4574, -5208, 329, 6888, 3189, -5202, -11104, -16675, -17616, -19614, -23824, -10054, 10981, 10687, 486, -4004, 2317, 4646, 7551, 15909, 8894, 4546, 1615, -4457, 1079, 6614, 5282, 8348, 18058, 21886, 21868, 7831, -9595, -16757, -17823, -12765, -6283, -1234, -7773, -5695, -2424, 8404, 16723, 15814, 2868, 1537, 3958, 7048, 3236, 5332, -974, -857, 2115, 1211, -9189, -5080, -34, 1249, -21172, -29290, -34511, -38332, -26257, -21512, -4404, 4949, -3405, -16160]
6376a6160N955N860j0139K752J7700J2924l617r8p915j4464O261N218j293k718
6362B66k755n396j0390k146J972O897Q543J012n838M423N486o544m626O160J5395
6347A2459O892j0095o033J0014j29l907p186p029j3129N991O671J732r80L437
$$ y = [-16160, -10205, -4345, -14484, -11732, 5968, 18892, 15275, 15177, 7262, -7202, -941, 4277, 2984, 266, -2489, -7885, -18275, -20421, -18449, -11552, -3009, -1997, -7835, -3412, 2074, -4470, -9096, -2936, 12459, 19351, 9256, 3223, 13237, 13108, 9201, 2015, -5014, -18143, -12152, -5481, -3749, -4729, -1292]
$$ [...]
##END NTUPLES=NMR SPECTRUM
##END=
