##TITLE=Analysis number 326556
Compound Code sew 01045
Project Code adrs
Chemist Name stores
##JCAMPDX= 6.0         $$ Bruker NMR JCAMP-DX V2.0
##DATA TYPE= NMR SPECTRUM
##DATA CLASS= NTUPLES
##ORIGIN= Bruker BioSpin GmbH
##OWNER= nmr
$$ XWIN-NMR		Version 3.5
$$ Tue Feb 13 11:09:39 2007 GMT Standard Time (UT+0h)  MAYBRIDGE\nmr@NMR_250MHZ
##.OBSERVE FREQUENCY= 250.131544655141
##.OBSERVE NUCLEUS= ^1H
##.ACQUISITION MODE= SIMULTANEOUS (DQD)
##.ACQUISITION SCHEME= undefined
##.AVERAGES= 16
##.DIGITISER RES= 18
##SPECTROMETER/DATA SYSTEM= dpx250
##.PULSE SEQUENCE= zg30
##.SOLVENT NAME= DMSO
##.SHIFT REFERENCE= (INTERNAL, DMSO, 0, 16.522)
##AUDIT TRAIL= $$ (NUMBER, WHEN, WHO, WHERE, WHAT)
$$ ##TITLE= Audit trail, XWIN-NMR		Version 3.5
$$ ##JCAMPDX= 5.01
$$ ##ORIGIN= Bruker BioSpin GmbH
$$ ##OWNER= nmr
$$ C:\u/data/dgb/nmr/ADRS/750/pdata/1/auditp.txt
$$ ##AUDIT TRAIL=  $$ (NUMBER, WHEN, WHO, WHERE, WHAT)
(   1,<2007-02-13 11:09:12.92 +000>,<MAYBRIDGE\nmr>,<NMR_250MHZ>,
      <created by zg, POWCHK disabled, PULCHK disabled
       configuration hash MD5:
       49 4B E0 1D 92 C2 6B 37 9F E6 65 BC 52 41 86 1D
       data hash MD5: 64K
       25 D2 77 6F F8 79 56 7F 15 35 CA 18 FE 74 2F 1B>)
(   2,<2007-02-13 11:09:27.95 +000>,<MAYBRIDGE\nmr>,<NMR_250MHZ>,
      <Start of raw data processing
       ef LB = 0.3 FT_mod = 6 PKNL = 1 SI = 32K 
       data hash MD5: 32K
       28 EB 5F 6F 8B F2 09 D7 91 D6 D3 1C 48 D5 04 99>)
(   3,<2007-02-13 11:09:29.56 +000>,<MAYBRIDGE\nmr>,<NMR_250MHZ>,
      <apk 
       data hash MD5: 32K
       1B B3 22 DB 00 90 67 C8 FA DC 84 29 AE E6 28 02>)
(   4,<2007-02-13 11:09:30.23 +000>,<MAYBRIDGE\nmr>,<NMR_250MHZ>,
      <abs ABSG = 5 
       data hash MD5: 32K
       8D 4C 5A D5 49 3F D6 89 09 A9 8A 53 00 34 C1 94>)
$$ ##END=
$$ 
$$ hash MD5
$$ A6 9C AA 1B A2 6B EB 90 32 B0 07 BD CB 57 F2 5C
##$RELAX= 
##$RELAX= 
##$RELAX= 
##$RELAX= 
##$RELAX= 
##$RELAX= 
##$RELAX= 
$$ Bruker specific parameters
$$ --------------------------
##$DU= <C:\u>
##$EXPNO= 750
##$NAME= <ADRS>
##$PROCNO= 1
##$TYPE= <nmr>
##$USER= <dgb>
##$AMP= (0..31)
100 100 100 100 100 100 100 100 100 100 100 100 100 100 100 100 100 100 
100 100 100 100 100 100 100 100 100 100 100 100 100 100 
##$AQSEQ= 0
##$AQ_mod= 3
##$AUNM= <au_zg>
##$AUTOPOS= <40 >
##$BF1= 250.13
##$BF2= 250.13
##$BF3= 250.13
##$BF4= 250.13
##$BF5= 500.13
##$BF6= 500.13
##$BF7= 500.13
##$BF8= 500.13
##$BYTORDA= 1
##$CFDGTYP= 0
##$CFRGTYP= 5
##$CHEMSTR= <none>
##$CNST= (0..31)
1 1 145 1 1 1 1 1 1 1 1 1 1 1 1 1 1 1 1 1 1 1 1 1 1 1 1 1 1 1 1 1 
##$CPDPRG= <>
##$CPDPRG1= <>
##$CPDPRG2= <>
##$CPDPRG3= <>
##$CPDPRG4= <mlev>
##$CPDPRG5= <mlev>
##$CPDPRG6= <mlev>
##$CPDPRG7= <mlev>
##$CPDPRG8= <mlev>
##$CPDPRGB= <>
##$CPDPRGT= <>
##$D= (0..31)
0 1 0 0 0 0 0 0 0 0.06 0 0 0 0 0 0 0.0002 0 0 0 0 0 0 0 0 0 0 0 0 0 0 
0 
##$DATE= 1171364951
##$DBL= (0..7)
120 120 120 120 120 120 120 120 
##$DBP= (0..7)
150 150 150 150 150 150 150 150 
##$DBP07= 0
##$DBPNAM0= <>
##$DBPNAM1= <>
##$DBPNAM2= <>
##$DBPNAM3= <>
$$ [...]
##$SUBNAM7= <"">
##$SUBNAM8= <"">
##$SUBNAM9= <"">
##$SW= 20.6930455092707
##$SWIBOX= (0..15)
0 0 3 0 0 0 0 0 0 0 0 0 0 0 0 0 
##$SW_h= 5175.983436853
##$TD= 65536
##$TD0= 1
##$TE= 295.16
##$TE2= 300
##$TE3= 300
##$TEG= 300
##$TL= (0..7)
0 120 120 120 120 120 120 120 
##$TP= (0..7)
150 150 150 150 150 150 150 150 
##$TP07= 0
##$TPNAME0= <>
##$TPNAME1= <>
##$TPNAME2= <>
##$TPNAME3= <>
##$TPNAME4= <>
##$TPNAME5= <>
##$TPNAME6= <>
##$TPNAME7= <>
##$TPOAL= (0..7)
0.5 0.5 0.5 0.5 0.5 0.5 0.5 0.5 
##$TPOFFS= (0..7)
0 0 0 0 0 0 0 0 
##$TUNHIN= 0
##$TUNHOUT= 0
##$TUNXOUT= 0
##$USERA1= <user>
##$USERA2= <user>
##$USERA3= <user>
##$USERA4= <user>
##$USERA5= <user>
##$V9= 5
##$VALIST= <valist>
##$VCLIST= <CCCCCCCCCCCCCCC>
##$VD= 0
##$VDLIST= <DDDDDDDDDDDDDDD>
##$VPLIST= <PPPPPPPPPPPPPPP>
##$VTLIST= <TTTTTTTTTTTTTTT>
##$WBST= 1024
##$WBSW= 4
##$XGAIN= (0..3)
0 0 0 0 
##$XL= 0
##$YL= 0
##$YMAX_a= 357833
##$YMIN_a= -344467
##$ZGOPTNS= <>
##$ZL1= 120
##$ZL2= 120
##$ZL3= 120
##$ZL4= 120
##$ABSF1= 16.522
##$ABSF2= -4.171173
##$ABSG= 5
##$ABSL= 3
##$ALPHA= 0
##$AQORDER= 0
##$ASSFAC= 0
##$ASSFACI= 0
##$ASSFACX= 0
##$ASSWID= 0
##$AUNMP= <proc_1d>
##$AZFE= 0.1
##$AZFW= 0.1
##$BCFW= 0
##$BC_mod= 0
##$BYTORDP= 0
##$COROFFS= 0
##$CY= 12.5
##$DATMOD= 1
##$DC= 0
##$DFILT= <>
##$DTYPP= 0
##$F1P= 14.0000005364418
##$F2P= -0.99999901652339
##$FCOR= 0.5
##$FTSIZE= 32768
##$FT_mod= 6
##$GAMMA= 0
##$GB= 0
##$INTBC= 1
##$INTSCL= 1
##$ISEN= 128
##$LB= 0.3
##$LEV0= 0
##$LPBIN= 0
##$MAXI= 10000
##$MC2= 0
##$MEAN= 0
##$ME_mod= 0
##$MI= 0
##$NCOEF= 0
##$NC_proc= -4
##$NLEV= 6
##$NOISF1= 0
##$NOISF2= 0
##$NSP= 0
##$NTH_PI= 0
##$NZP= 0
##$OFFSET= 16.522
##$PC= 1
##$PHC0= 216.3175
##$PHC1= 7.258005
##$PH_mod= 1
##$PKNL= yes
##$PPARMOD= 0
##$PSCAL= 4
##$PSIGN= 0
##$REVERSE= no
##$SF= 250.13
##$SI= 32768
##$SIGF1= 0
##$SIGF2= 0
##$SINO= 400
##$SIOLD= 32768
##$SREGLST= <1H.DMSO>
##$SSB= 0
##$STSI= 32768
##$STSR= 0
##$SW_p= 5175.98343685301
##$SYMM= 0
##$S_DEV= 0
##$TDeff= 65536
##$TDoff= 0
##$TI= <Analysis number 999999
Compound Code 99
Book Reference 9
Project Code 9>
##$TILT= no
##$TM1= 0
##$TM2= 0
##$TOPLEV= 0
##$USERP1= <user>
##$USERP2= <user>
##$USERP3= <user>
##$USERP4= <user>
##$USERP5= <user>
##$WDW= 1
##$XDIM= 32768
##$YMAX_p= 468878432
##$YMIN_p= -142779
$$ End of Bruker specific parameters
$$ ---------------------------------
##NTUPLES= NMR SPECTRUM
##VAR_NAME=  FREQUENCY,     SPECTRUM/REAL,   SPECTRUM/IMAG
##SYMBOL=    X,             R,               I
##VAR_TYPE=  INDEPENDENT,   DEPENDENT,       DEPENDENT
##VAR_FORM=  AFFN,          ASDF,            ASDF
##VAR_DIM=   32768,         32768,           32768
##UNITS=     HZ,            ARBITRARY UNITS, ARBITRARY UNITS
##FACTOR=    0.157963299565203, 1,           1
##FIRST=     4132.6476996994, 0,             0
##LAST=      -1043.33573715361, 0,           0
##MIN=       -1043.33573715361, -142779,     0
##MAX=       4132.6476996994, 468878432,     0
$$ Real data points
##PAGE= N=1
##DATA TABLE= (X++(R..R)), XYDATA
$$ [...]
15868D9208j0059l7808K792n097Q165J5457k9502j1778n326J3641P003K9039O51
$$ 49208 39149 1341 4133 -964 7201 22658 -6844 -18622 -23948 -10307 -3304 25735 26386
15855B6386j2612k0156j7533J5971M875j4645k6297O6736O1955l5106l7397J2627
$$ 26386 13774 -6382 -23915 -7944 -3069 -17714 -44011 22725 84680 49574 12177 24804
15843B4804J7624k6402l757K3070O035l410j3981k2619j7242j0023Q941K1099
$$ 24804 42428 16026 12269 35339 41374 37964 23983 1364 -15878 -25901 -16960 4139
15831D139L9738N68J4305j8733k3524N034j3313j6776K5654Q294k8262P666l5017
$$ 4139 43877 44445 58750 40017 16493 21527 8214 -8562 17092 25386 -2876 4790 -30227
15818c0227r313L9728L9779M181n729j4391j9721k9834l3386k3046p041K1688
$$ -30227 -39540 188 39967 44148 38419 24028 4307 -25527 -58913 -81959 -89000 -67312
15806f7312L1596j1887K4171M2631k3111l1106J4472J0349l6173k333M5307l2345
$$ -67312 -35716 -47603 -23432 19199 -3912 -35018 -20546 -10197 -46370 -48703 -3396 -35741
15794c5741l3379K4094l1198K0593P8758j5519p0982k4144L6045M5126J7171N172
$$ -35741 -69120 -45026 -76224 -55631 23127 7608 -63374 -87518 -51473 -6347 10824 15996
15782A5996J0089R27J3213K4207p018o8428j9482l1116l228M2224M9717K0496
$$ 15996 26085 27012 40225 64432 57414 -11014 -30496 -61612 -64840 -22616 27101 47597
15770D7597p4077n157J771M961K6860J0656O453N095J8956k8639n7472L026l966
$$ 47597 -26480 -31637 -29866 -24905 1955 12611 19064 24159 43115 14476 -42996 -39970 -43936
15757d3936j2101K941r99Q158M57j2663q739L4312K2836p236K1294j8843m2843
$$ -43936 -56037 -53096 -54095 -45937 -45480 -58143 -66882 -32570 -9734 -16970 4324 -14519 -57362
15744e7362Q214P420j3047j2638O739p285J2644o28M316K2135p685R442K3767
$$ -57362 -49148 -41728 -54775 -67413 -60674 -67959 -55315 -55943 -51627 -29492 -37177 -27735 -3968
15731c968j5115J0020j1765R933l4297j7981j9709J9296L7820M5207k7941j0298
$$ -3968 -19083 -9063 -20828 -10895 -45192 -63173 -82882 -63586 -25766 19441 -8500 -18798
15719a8798J2172L9765l8101l1665J0222K5054K6764J1046k9885n8175j8249M6717
$$ -18798 -6626 33139 -4962 -36627 -26405 -1351 25413 36459 6574 -51601 -69850 -23133
15707b3133M8378j5550J0124J9389L179l2433j4109j5173M8165j2011k8655n097
$$ -23133 25245 9695 19819 39208 42387 9954 -4155 -19328 28837 16826 -11829 -16926
15695a6926K4239J822n9279J3384L9760L7828M624k8469m4636N721K8027Q591
$$ -16926 7313 9135 -50144 -36760 3000 40828 45452 16983 -27653 -21932 6095 14686
15683A4686j2846k2152Q668j5791m8138j3689M0984M7867k3778l7968n318k3167
$$ 14686 1840 -20312 -11644 -27435 -75573 -89262 -48278 -411 -24189 -62157 -67475 -90642
15671i0642k6295K2007O4835L5469j042K4908o475l1377K2149L0175k7608r629
$$ -90642 -116937 -94930 -30095 5374 4332 29240 22765 -8612 13537 43712 16104 6475
15659F475o077k3525k0811j6505J3849j2221O776m812q154J2464K3052J1964j5496
$$ 6475 398 -23127 -43938 -60443 -46594 -58815 -52039 -56851 -65005 -52541 -29489 -17525 -33021
15646c3021k4005j8509K3111L3365q774k8129j8556L2423O1833P173k6388O09
$$ -33021 -57026 -75535 -52424 -19059 -27833 -55962 -74518 -42095 19738 26911 523 1132
15634A132J3760k9000j0081k0861k1897N523J8356J8562K4947j3856m5323J1996
$$ 1132 14892 -14108 -24189 -45050 -66947 -61424 -43068 -24506 441 -13415 -58738 -46742
15622d6742Q977R498K3825J6248j560k2633n5904m6205M3717L7361J0944L1282
$$ -46742 -37765 -28267 -4442 11806 10246 -12387 -68291 -114496 -70779 -33418 -22474 8808
15610H808j3432k3732q55n861j0784q312K8943P766m108j3438j0251J2134k6718
$$ 8808 -4624 -28356 -29211 -35072 -45856 -54168 -25225 -17459 -21567 -35005 -45256 -33122 -59840
15597e9840L165J8192l773k0354J2592L9384J9904k0723j9162m669M2360J4329
$$ -59840 -56675 -38483 -42256 -62610 -50018 -10634 9270 -11453 -30615 -35284 7076 21405
15585B1405l2929l2297K4934M1905j4139N352O125j8894j8927O113J4506K1019
$$ 21405 -11524 -43821 -18887 23018 8879 14231 20356 1462 -17465 -11352 3154 24173
15573B4173j2740J6110R536m802m8811q57j320m125N1985l096R149M740j8287
$$ 24173 11433 27543 37079 32277 -16534 -17391 -18711 -22836 29149 26053 35202 39942 21655
15560B1655K0476k5164o4410L198N5872n746j8623K4045L0093o518j3368k1335
$$ 21655 42131 16967 -47443 -44245 11627 5881 -12742 11303 41396 34878 21510 175
15548A75l6608k8750k5289j271R319P496L1534N3180L1746j7361m7000j582m044
$$ 175 -36433 -65183 -90472 -91743 -82424 -74928 -43394 9786 41532 24171 -22829 -24411 -28455
15535b8455r674k0250l428q080K0973j342q704m993q795P526N7635K491K462J4538
$$ -28455 -38129 -58379 -61807 -69887 -48914 -50256 -58960 -63953 -72748 -65222 -7587 -5096 -2634 11904
15521A1904l635K1706L501j2549j0322q454J9585l7445P807k473j3694J9227J2976
$$ 11904 8269 29975 33476 20927 10605 2151 21736 -15709 -7902 -10375 -24069 -4842 8134
15508H134N728l4764l3450R469K0580N570R401J8333J3507k2256j5685J9099J1533
$$ 8134 13862 -20902 -54352 -44883 -24303 -18733 -9332 9001 22508 252 -15433 3666 15199
15495A5199k5111r906L0526L1513o634N409O737j5129K6131J0129l7971l8443
$$ 15199 -9912 -19818 10708 42221 35587 40996 47733 32604 58735 68864 30893 -7550
15483g550j9077l2915L4013M1435J2189m6549K4424Q985j732R814q091k3007K1523
$$ -7550 -26627 -59542 -25529 15906 28095 -18454 5970 14955 13223 23037 14946 -8061 13462
15470A3462j926j1704k1681L1980M074k726L6881J8125j2795K9448L3700k7227
$$ 13462 11536 -168 -21849 10131 14205 11479 48360 66485 53690 83138 116838 89611
15458H9611m3562l7987M4528l544k1101j5715J2640K600Q829P546k4962n0967
$$ 89611 46049 8062 52590 49046 27945 12230 24870 27470 36299 43845 18883 -32084
15446c2084j2409j625K7586q157R962L7824r46j2428m4978j623j0936O6378O6132
$$ -32084 -44493 -46118 -18532 -26689 -16727 21097 20151 7723 -37255 -38878 -49814 16564 82696
15433H2696k719K8800j2936m9202P62j5312j1297l0622j6282J2923K2134K8259
$$ 82696 79977 108777 95841 46639 47401 32089 20792 -9830 -26112 -13189 8945 37204
15421C7204k6044j0962J1871k2176n4568J4908N4841p627j8066k264Q677k3704
$$ 37204 11160 198 12069 -10107 -64675 -49767 5074 -2553 -20619 -22883 -14206 -37910
15409c7910J6377k7296J1642l5886j0051J3042L7251J5779l337r144k11J9503
$$ -37910 -21533 -48829 -37187 -73073 -83124 -70082 -32831 -17052 -20389 -29533 -29744 -10241
15397a0241l625R511O779M102p32J2504K5182J2332J7459m001j0843j4158k5607
$$ -10241 -13866 -4355 2424 6526 5794 18298 43480 55812 73271 69270 58427 44269 18662
15384A8662L976l259j7195l3222M384J4107O797K1145l5003q255mJ9786k2963
$$ 18662 22638 19379 2184 -31038 -26654 -12547 -5750 15395 -19608 -27863 -27867 -8081 -31044
15371c1044L0698k490L0565j8991j0178M254J6136j4255k123j113J6851L8215
$$ -31044 -346 -2836 27729 8738 -1440 2814 18950 4695 2572 1459 18310 56525
15359E6525L148P6j7744k2029l4114o233l3954j5261K3432K8024K9811p908k3113
$$ 56525 59673 59749 42005 19976 -14138 -20371 -54325 -69586 -46154 -18130 11681 3773 -19340
15346a9340N044m5608J7913L6175M917L7259J368j5627k7849k2353r926k4942
$$ -19340 -14296 -59904 -41991 -5816 -899 36360 37728 22101 -5748 -28101 -38027 -62969
15334f2969M3636K2774o135j8766j1516j1242m32M746K172K5502j4971l8220j768
$$ -62969 -19333 3441 -2694 -21460 -32976 -44218 -44650 -39904 -37732 -12230 -27201 -65421 -67189
15321f7189q589l2099M2842P1590N520L0630n2645m2106j7015M7547J8774J1984
$$ -67189 -75778 -107877 -65035 6555 12075 42705 -9940 -52046 -69061 -21514 -2740 9244
15309I244J6182j8721l3649J2233k22j7920r387P467l1074N825M2517J7580J4854
$$ 9244 25426 6705 -26944 -14711 -14933 -32853 -42240 -34773 -65847 -60022 -17505 75 14929
15296A4929K119J6820r503m150r098r063J2500K8470k6042l3811K6954l0607m1535
$$ 14929 17048 33868 24365 20215 11117 2054 14554 43024 16982 -16829 10125 -20482 -62017
15283f2017j552K484q062K5727K6466L5286K6414n2062l6273j2611N03P751J0514
$$ -62017 -63569 -61085 -69147 -43420 -16954 18332 44746 -7316 -43589 -56200 -55697 -47946 -37432
15270c7432L895L358K0595j9341k4310N1035l331K568l2047k4338r327L3963M3533
$$ -37432 -33537 -30179 -9584 -28925 -53235 -2200 -5531 -2963 -35010 -59348 -68675 -34712 8821
15257H821R300k9216o148J3589J4234r544m1639r212K1626J5713J8245K1335M1906
$$ 8821 18121 -11095 -17243 -3654 10580 1036 -40603 -49815 -28189 -12476 5769 27104 69010
15244F9010J5702o950n9703k8806J0339P358L341M716K0251m2515n2089j5067
$$ 69010 84712 77762 18059 -10747 -408 6950 10291 15007 35258 -7257 -59346 -74413
15232g4413K9792L8559O657k9842j3337K1889K5552K2186j2474J35J3588Q827
$$ -74413 -44621 -6062 595 -29247 -42584 -20695 4857 27043 14569 14704 28292 37119
15220C7119k3903m5678K1921Q583J0506N361k6960k373k1355J156q294J4352L8868
$$ 37119 13216 -32462 -10541 -1958 8548 13909 -13051 -15424 -36779 -35623 -43917 -29565 9303
15207I303K0634l3398K612J2950k4166p29K8206M955O180L445j7732k8502l2537
$$ 9303 29937 -3461 -849 12101 -12065 -12794 15412 20367 26547 29992 12260 -16242 -48779
15194d8779j6444K4360J2534K7967J2927o254l0758j403j3918k0455M0094j7312
$$ -48779 -65223 -40863 -28329 -362 12565 6311 -24447 -25850 -39768 -60223 -20129 -37441
15182c7441k6512N1367J1671j6176l4627N657K4844L8978j5557l1562j9048k1321
$$ -37441 -63953 -12586 -915 -17091 -51718 -46061 -21217 17761 2204 -29358 -48406 -69727
15170f9727M273j2797l0343L4013O1416M3887J9669M946O323l1130K443K3493
$$ -69727 -65454 -78251 -108594 -74581 -13165 30722 50391 55337 61660 30530 32973 56466
15158E6466r187l6673j0108p626k9797k3178M8222K8352J2092l0923j3626m4869
$$ 56466 47279 10606 498 -7128 -36925 -60103 -11881 16471 28563 -2360 -15986 -60855
15146f0855k0095J8454L6143k0710o956j1394K093j9902l5564M3013O0085K5336
$$ -60855 -80950 -62496 -26353 -47063 -54019 -65413 -63320 -83222 -118786 -75773 -15688 9648
15134I648J3271L2607q629o4574m9058J9676K3734J3520m666k2196K2539r788
$$ 9648 22919 55526 46897 -17677 -66735 -47059 -23325 -9805 -14471 -36667 -14128 -23916
15122b3916n107l661k53M797K2153q831K1317K0759k8573l077j9599J2935K64
$$ -23916 -29023 -32684 -32937 -28140 -5987 -14818 6499 27258 -1315 -4392 -23991 -11056 -10792
15109a0792L423j728Q666J2237j8677k9777l5905j9158K3079J1488L964K7001
$$ -10792 -7369 -9097 -431 11806 -6871 -36648 -72553 -91711 -68632 -57144 -53180 -26179
15097b6179K4936j6922r187k1697r571J5484J0912J3983j5735J1373L606q804
$$ -26179 -1243 -18165 -27352 -49049 -58620 -43136 -32224 -18241 -33976 -22603 -18997 -27801
15085b7801j2834M918N2578K1567j8742J3103l3m1189k2610J2407j6623J5792
$$ -27801 -40635 -35717 16861 38428 19686 32789 32756 -8433 -31043 -18636 -35259 -19467
15073a9467k0949m7820k0160K7665O1090K1198R386l619j5303R623N643J0519
$$ -19467 -40416 -88236 -108396 -80731 -19641 1557 10943 7324 -7979 1644 7287 17806
15061A7806k0169k2873N231K6226Q298K7790p076j7467k7344k9901M155L6545
$$ 17806 -2363 -25236 -20005 6221 14519 42309 35233 17766 -9578 -39479 -35324 1221
15049A221J9391j1484l5336l3797K903M0496J8802j588K846j1132O695J558K2768
$$ 1221 20612 9128 -26208 -60005 -57102 -16606 2196 608 3454 -7678 -983 575 23343
15036B3343k2378j0359j6183o26j3004L5372M2948l3726j9131j2252l026K5793
$$ 23343 965 -9394 -25577 -26203 -39207 -3835 39113 5387 -13744 -25996 -29022 -3229
15024c229j3928L6043N677k2104K6905k7735l4606P25j1624K9538n4114M319M6121
$$ -3229 -17157 18886 24563 2459 29364 1629 -32977 -32252 -43876 -14338 -68452 -64133 -18012
15011a8012n671k3608m790L0685L5812L1929M553j8428j2854k9593P565j654q879
$$ -18012 -23683 -47291 -52081 -21396 14416 46345 50898 32470 19616 -9977 -2412 -4066 -12945
14998a2945K8601l7092m6653K4614L608R153L7924j1307k5455J3357J3391j5692
$$ -12945 15656 -21436 -68089 -43475 -39867 -30714 7210 -4097 -29552 -16195 -2804 -18496
14986a8496j4183k9599P250J5347P371K2692J9263J799l017j3091k9326K3149
$$ -18496 -32679 -62278 -55028 -39681 -32310 -9618 9645 11444 8427 -4664 -33990 -10841
14974a0841K3801k3749m6500J0107J0723K9625J6944j3196j7801J2735R219J35
$$ -10841 12960 -10789 -57289 -47182 -36459 -6834 10110 -3086 -20887 -8152 1067 1202
14962A202j2027j7032J8741J3273L711O335j0059J4869j4091k7133j1771J8637
$$ 1202 -10825 -27857 -9116 4157 7868 14203 4144 19013 4922 -22211 -33982 -15345
14950a5345K9339O376j2701Q027k9092j6888P629p179j8171J3679L0043J4228
$$ -15345 13994 20370 7669 15696 -13396 -30284 -22655 -29834 -48005 -34326 -4283 9945
14938I945q784j4426l6310m384O983l808K0570j4161j1438L0139M366k5052k2727
$$ 9945 1161 -13265 -49575 -53959 -46976 -50784 -30214 -44375 -55813 -25674 -21308 -46360 -69087
14925f9087Q864L2405K2144Q059k2828j7186P1417L1711l2277o3216j5523J6350
$$ -69087 -60223 -27818 -5674 2385 -20443 -37629 33788 65499 33222 -29994 -45517 -29167
14913b9167P303N931K9234J2556k7946m3399k3054n11K1221M079m182j7880M445
$$ -29167 -21864 -15933 13301 25857 -2089 -45488 -68542 -69053 -47832 -43753 -47935 -65815 -61370
14900f1370J0510n096J5148J6646r527l2135L826K2834j4795M2634M2820K948
$$ -61370 -50860 -55956 -40808 -24162 -33689 -65824 -61998 -39164 -53959 -11325 31495 34443
14888C4443j9398l1006j1561m139j5341m849j1215J7312J2016m3127L8199L5122
$$ 34443 15045 -15961 -27522 -31661 -47002 -51851 -63066 -45754 -33738 -76865 -38666 -3544
14876c544N793k632q869r929J2560K4236J3872K3256J7770r463M505j7883j5172
$$ -3544 2249 -383 -9252 -19181 -6621 17615 31487 54743 72513 63050 67555 49672 34500
14863C4500l1907k9071j6756M7165R901j4393k3933j3172n747j1193j6152M5411
$$ 34500 2593 -26478 -43234 3931 13832 -561 -24494 -37666 -43413 -54606 -70758 -25347
14851b5347L1345J6207j5235q079o384l8767K5453P82k5145K4811l03k7079L0127
$$ -25347 5998 22205 6970 -1109 -7493 -46260 -20807 -20025 -45170 -20359 -20662 -47741 -17614
14838a7614J8073j0045m1809k2082K3920K9281m219l1099J0490J9436k5426l466
$$ -17614 459 -9586 -51395 -73477 -49557 -20276 -24495 -55594 -45104 -25668 -51094 -54560
14826e4560M6111J8856J4337j3663k4516J3891J3430N632k8719m2825P959L2505
$$ -54560 -8449 10407 24744 11081 -13435 456 13886 19518 -9201 -52026 -44067 -11562
14814a1562j2770j3136J5751j0318J0208o025R763P652K1838l3019k7137P83K1609
$$ -11562 -24332 -37468 -21717 -32035 -21827 -27852 -18089 -10437 11401 -21618 -48755 -47972 -26363
14801b6363L322J7901J3824N680k842r756M804N357O081k468N423q545n287m9823
$$ -26363 -23041 -5140 8684 14364 11522 1766 6570 11927 18008 15540 20963 12418 7131 -42692
14787d2692L3225J6335m7864J737J0598M9377K3783J1816j6927j0715K2787M324
$$ -42692 -9467 6868 -40996 -39259 -28661 20716 44499 56315 39388 28673 51460 55784
14775E5784o7145k6982O2K0990J150k402J1277k7322j6871J7446K2947k2560K4949
$$ 55784 -11361 -38343 -38281 -17291 -16141 -18543 -7266 -34588 -51459 -34013 -11066 -33626 -8677
14762h677k2257l3689J7804O613k78K6147L5687l3061j7474J1701J401q986k2267
$$ -8677 -30934 -64623 -46819 -40206 -40484 -14337 21350 -11711 -29185 -17484 -16083 -25069 -47336
14749d7336K2806J0929j8569o563q465P414J9103M7328J1626k711q378j9246K548
$$ -47336 -24530 -13601 -32170 -38733 -47198 -39784 -20681 26647 38273 35562 27184 7938 10486
14736A0486M1090l7917m7755J8047K2397K657l9159k1729K3276j9962K5003K386
$$ 10486 51576 13659 -34096 -16049 6348 9005 -30154 -51883 -28607 -48569 -23566 -21180
14724b1180J9031K067n942n5561n4939M9495M3193J1072J1277q451K3453K139
$$ -21180 -2149 -82 -6024 -61585 -116524 -67029 -23836 -12764 -1487 -9938 13515 15654
14712A5654q557M2015m4359k6973j1780o621J5391M4693Q07m1790O377j5406K81
$$ 15654 7097 49112 4753 -22220 -34000 -40621 -25230 19463 20270 -21520 -15143 -30549 -30268
14699c0268O558R811L5148M0148o027J1887l256l1475m2378K744p853k0094j3358
$$ -30268 -23710 -13899 21249 61397 55370 67257 64001 32526 -9852 -7108 -14961 -35055 -48413
14686d8413r494k5777J2598N4719L8263l43k182k2285l313L9326J687k4504j2664
$$ -48413 -57907 -83684 -71086 -16367 21896 21553 19371 -2914 -6227 33099 34786 10282 -2382
14673b382O664l8731k4025J284r805M610k8442J1756L1167M3259k2406j5527J1007
$$ -2382 4282 -34449 -58474 -57190 -66995 -62385 -90827 -79071 -47904 -4645 -27051 -42578 -31571
14660c1571L4787L365K302l294j0799J497L6691R632j1739k2820o620J4602J4979
$$ -31571 3216 6581 8883 5589 -5210 -3713 32978 42610 30871 8051 1431 16033 31012
14647C1012k774m1704K100K898l093J8876K397j8950l1695J4060K71k4717J42
$$ 31012 28238 -13466 -11366 -8468 -11561 7315 9712 -9238 -40933 -26873 -26602 -51319 -51177
14634e1177L2538r05j5995p982J4491M6011J4899n452j7835J8614l5716l1636
$$ -51177 -18639 -19544 -35539 -43521 -29030 16981 31880 26428 8593 27207 -8509 -40145
14622d0145m006j4210j0662L5742K8374M0760L6598k0961l7923m1821n52J9544
$$ -40145 -44151 -58361 -69023 -33281 -4907 35853 72451 51490 13567 -28254 -28806 -9262
14610i262m0288N83J9345J9744K1562J3079l6129l4175k5229M808L895K9310M2397
$$ -9262 -49550 -48967 -29622 -9878 11684 24763 -11366 -45541 -70770 -65962 -62067 -32757 9640
14597I640Q044p181k6866k4997J1979L2465q813l6798k9541N1787L3379l372o618
$$ 9640 17684 10503 -16363 -41360 -29381 3084 -5729 -42527 -72068 -20281 13098 9726 3108
14584C108P874n221l0393p304r706q760L0107L170J2796K9848K1507k1452m0126
$$ 3108 10982 5761 -24632 -31936 -41642 -50402 -20295 -17125 -4329 25519 47026 25574 -14552
14571a4552j3669m0877l828R085J2827K5361K7369l7769K167J6115j7791J8407
$$ -14552 -28221 -69098 -72926 -63841 -51014 -25653 1716 -36053 -33886 -17771 -35562 -17155
14559a7155j2924j4578m163K3859J0359j0817m4794N5397J8067o026l919P412
$$ -17155 -30079 -44657 -48820 -24961 -14602 -25419 -70213 -14816 3251 -2775 -6694 718
14547G18J1438J869m3278J1219J4723K9445m1603J1516J5463J5601J229k1586
$$ 718 12156 14025 -29253 -18034 -3311 26134 -15469 -3953 11510 27111 28340 6754
14535F754j4561j6242j4506L7395L2474r19k574J5827l697k5492r613O214P879
$$ 6754 -7807 -24049 -38555 -1160 31314 30395 27821 43648 39951 14459 4846 11060 18939
14522A8939P270J3543o955l102q732m827k6645j102n711J9385k9852n763N6401
$$ 18939 26209 39752 32797 29695 20963 16136 -10509 -11611 -17322 2063 -27789 -33552 22849
14509B2849K5334N339k9113p936M398k7473j4481M680j5729k1708N720J8822J4588
$$ 22849 48183 53522 24409 16473 20871 -6602 -21083 -16403 -32132 -53840 -48120 -29298 -14710
14496a4710k014J6184K5373O100l9257j845j8856J9385K8887n670k2101J5562
$$ -14710 -16724 -540 24833 30933 -8324 -10169 -29025 -9640 19247 13577 -8524 7038
14484G038o713l0371k9829J1717R475O311n10Q040K7008L757N063N793K1406j1375
$$ 7038 325 -30046 -59875 -48158 -38683 -32372 -32882 -24842 2166 5923 10986 16779 38185 26810
14470B6810k8768o659j2106J5616M5259J839k8002m255k7082q548n518P053k4037
$$ 26810 -1958 -8617 -20723 -5107 40152 41991 13989 9734 -17348 -25896 -31414 -24361 -48398
14457d8398r115K2026j0592j4573j6797J7948M183J7738K3220j4510n0524L4976
$$ -48398 -57513 -35487 -46079 -60652 -77449 -59501 -55318 -37580 -14360 -28870 -79394 -44418
14445d4418M3599j8391Q130J75R758l1187k7017O5944k616j6210l469M328m071
$$ -44418 -819 -19210 -11080 -10905 -1147 -32334 -59351 6593 3977 -12233 -15702 -11374 -15445
14432a5445J0060j042j1673j9422r688L0638L7043q254j6033K7982L725j3519
$$ -15445 -5385 -6427 -18100 -37522 -47210 -16572 20471 12217 -3816 24166 27891 14372
14420A4372J3752o273Q177n454j0024n451J3832P603K255k4370j5223K4050j8395
$$ 14372 28124 21851 30028 24574 14550 9099 22931 30534 32789 8419 -6804 17246 -1149
14407a149j4885j8916j4233o970J0332l8244k7088K131M1391L7449L8492j2600
$$ -1149 -16034 -34950 -49183 -56153 -45821 -84065 -111153 -109022 -67631 -30182 8310 -4290
14395d290J007o27j7332j3548K4694j1488l0811k660K2644K7049m893J2636R404
$$ -4290 -3283 -3910 -21242 -34790 -10096 -21584 -52395 -55055 -32411 -5362 -10255 2381 11785
14382A1785k2426j2508M2179J9127q484q778q522r018m640M677j6104J3579J5428
$$ 11785 -10641 -23149 19030 38157 29673 20895 12373 3355 -1285 3392 -12712 867 16295
14369A6295K4274K2019j3613o1342j3440K3599J4283l035k981Q234K1365J009
$$ 16295 40569 62588 48975 -12367 -25807 -2208 12075 9040 6059 14293 35658 36667
14357C6667l3528J934j8890k5253K2485j4466Q304L926j6969J2239j5020L3199
$$ 36667 3139 5073 -13817 -39070 -16585 -31051 -22747 -18821 -35790 -23551 -38571 -5372
14345e372j806j5100R753M303p631k1870K4328M6746J5594l620m6981k9744K7089
$$ -5372 -7178 -22278 -12525 -8222 -15853 -37723 -13395 33351 48945 45325 -1656 -31400 -4311
14332d311K2432K1129k58n2791k9461J582j5036L1198j5446k7693K2597L3371
$$ -4311 18121 39250 38992 -13799 -43260 -41678 -56714 -25516 -40962 -68655 -46058 -12687
14320a2687K3251K1591k522m1425q369p115j3203j4800J9953R920m663l320p344
$$ -12687 10564 32155 29633 -11792 -20161 -27276 -40479 -55279 -35326 -25406 -30069 -33389 -40733
14307d0733O891M912q739l0690N874K4363r456K5904J3461j1214L08J4640m8846
$$ -40733 -33842 -28930 -37669 -68359 -62485 -38122 -47578 -21674 -8213 -19427 -19119 -4479 -53325
14294e3325J4872J4112m700k5506N872k0606n923J5877j9364L5028O9627K8642
$$ -53325 -38453 -24341 -29041 -54547 -48675 -69281 -75204 -59327 -78691 -43663 25964 54606
14282E4606k5413P490k9813k2789M990m734m0341J420K3704J4413O597m61j1182
$$ 54606 29193 36683 6870 -15919 -10929 -15663 -56004 -54584 -30880 -16467 -9870 -10331 -21513
14269b1513n147o050J0197q084p720J1909K6042J2197j8130o0958j698M6760K4534
$$ -21513 -26660 -32710 -22513 -30597 -38317 -26408 -366 11831 -6299 -67257 -68955 -22195 2339
14256B339j7239O887J4060l912r354l8618R580N088K7703k1962J2050O557o738
$$ 2339 -14900 -8013 6047 2135 -7219 -45837 -36257 -31169 -3466 -25428 -13378 -6821 -13559
14243a3559k8996n300k095J6450J4498j5355J5900M5431j601n9918k9076K8873
$$ -13559 -42555 -47855 -49950 -33500 -19002 -34357 -18457 26974 25373 -34545 -63621 -34748
14231c4748K7192J7167l2584l1419J3279M814J0747p40Q79P546L6158J3438j9748
$$ -34748 -7556 9611 -22973 -54392 -41113 -36299 -25552 -26292 -25413 -17867 18291 31729 11981
14218A1981j5631k3983l9186k6405K588K3060M384L8645l664N72L1537o603m7472
$$ 11981 -3650 -27633 -66819 -93224 -90636 -67576 -63192 -24547 -28211 -27639 3898 -2705 -50177
14205e0177r985K3172J7432j5511p93L6753J8258o266k5101K3513J892k4060K546
$$ -50177 -60162 -36990 -19558 -35069 -35862 891 19149 12883 -12218 11295 13187 -10873 -8327
14192h327j5414K4842J3603N028k3136N444o515j6306j562q42k5220L2233K7193
$$ -8327 -23741 1101 14704 19732 -3404 2040 -4475 -20781 -22343 -23185 -48405 -16172 11021
14179A1021j5908K637j4299l615L167K9730m1940k955J4930K4838K5369l2458
$$ 11021 -4887 -2250 -16549 -20164 -16997 12733 -29207 -32162 -17232 7606 32975 517
14167E17J0050k152J0034K5661j2360o031K136k0751k3235K7675J7935j1160O387
$$ 517 10567 8415 18449 44110 31750 25719 27855 7104 -16131 11544 29479 18319 24706
14154B4706K2941q094J7087K693m7948k4016R996j8978r273J7949M767j7297j5857
$$ 24706 47647 39553 56640 59333 11385 -12631 -2635 -21613 -30886 -12937 -8170 -25467 -41324
14141d1324K0799K5932K0497K5169m202o4272j6823k1323K8273K4524j9367k5891
$$ -41324 -20525 5407 25904 51073 46871 -17401 -34224 -55547 -27274 -2750 -22117 -48008
14129d8008O437J6423k4583l9802J2780M3309J9172j4460L710J0220L4523p122
$$ -48008 -41571 -25148 -49731 -89533 -76753 -33444 -14272 -28732 -25022 -14802 19721 12599
14117A2599m2191k3701j9638L1443M2810J0106j8879m6429K0543J5903J9150J0387
$$ 12599 -29592 -53293 -72931 -41488 1322 11428 -7451 -53880 -33337 -17434 1716 12103
14105A2103O715J8268J1509J3361q493K338k6237o6028j2497J5129J2512K1543
$$ 12103 18818 37086 48595 61956 53463 55801 29564 -36464 -48961 -33832 -21320 223
14093B23k468l1545l888K894J88l92l516J1746L128K5782J4777J7339J2604K107
$$ 223 -2245 -33790 -37678 -34784 -34596 -34988 -38504 -26758 -23630 2152 16929 34268 46872 48979
14079D8979K010l000m3998l2427m648K3401l2178j1813K8909K7085L4499J6147
$$ 48979 50989 47989 3991 -28436 -33084 -9683 -41861 -53674 -24765 2320 36819 52966
14067E2966N686n4592l5154J8206M2226P068j2644K5243L6596n4101l7288Q91
$$ 52966 58652 4060 -31094 -12888 29338 36406 23762 49005 85601 31500 -5788 -4897
14055d897J6106O123K828n67j1053l5814M3762J811j4602k5144L3431M9854K0569
$$ -4897 11209 17332 20160 19593 8540 -27274 16488 18299 3697 -21447 11984 61838 82407
14042H2407l8130k2066j4516q74k4608K5102J7017J8971J1339m4400j3488p113
$$ 82407 44277 22211 7695 6821 -17787 7315 24332 43303 54642 10242 -3246 -10359
14030a0359j7941L136q727Q117k0833O164L6924J6466k0279q480j6217p228J6906
$$ -10359 -28300 -25164 -33891 -25774 -46607 -40443 -3519 12947 -7332 -15812 -32029 -39257 -22351
14017b2351j8234J8082K9673L0890m4612l3336K2586K6563j2192m028l222k983
$$ -22351 -40585 -22503 7170 38060 -6552 -39888 -17302 9261 -2931 -6959 -10181 -13164
14005a3164K5681J1337J6898j677j4239m4095k717j921M379K480j7731M976j3837
$$ -13164 12517 23854 40752 39075 24836 -19259 -21976 -23897 -19518 -17038 -34769 -29793 -43630
13992d3630J1785j99J3566M0629j156j7958j0708j9546j0237n57K0448m051j3746
$$ -43630 -31845 -32044 -18478 22151 20995 3037 -7671 -27217 -37454 -38011 -17563 -21614 -35360
13979c5360O841J586L1227L3383J9393p86j7029o944K464J7910J966m0102K0K6477
$$ -35360 -28519 -26933 4294 37677 57070 56284 39255 32311 34775 52685 54651 14549 14569 41046
13965D1046n555l0442k9641J8317J3944J504J1315P550J1837j2320j7204J098
$$ 41046 35491 5049 -24592 -6275 7669 9173 20488 28038 39875 27555 10351 11449
13953A1449j5019q398L7403K994j2447j3596j0262K3998k9887k9757l8O214R2
$$ 11449 -3570 -11968 25435 28429 15982 2386 -7876 16122 -13765 -43522 -43560 -37346 -37254
13940c7254J7497J0586O103J6339K9198J1404l1477j3431n78j9201J927p182K293
$$ -37254 -19757 -9171 -3068 13271 42469 53873 22396 8965 8387 -10814 -8887 -16069 -13776
13927a3776K1995K0745J1964l8323j23k7471k4738K2479k166q796p199j8864M4465
$$ -13776 8219 28964 40928 2605 2482 -24989 -49727 -27248 -29414 -38210 -45409 -64273 -19808
13914a9808J4006J419J6411K8018K268k7791q547J375J3658N5379j8559k7960
$$ -19808 -5802 -4383 12028 40046 42314 14523 5976 7351 21009 76388 57829 29869
13902B9869O368j2650O675p237j5663m8569J7939L5290J62m2706o906J9250J048
$$ 29869 36237 23587 30262 23025 7362 -41207 -23268 12022 12184 -30522 -37428 -18178 -17130
13889a7130j2347R579L8199J1348J2173j178n050j5577L470j2148m9477r032j7586
$$ -17130 -29477 -19898 18301 29649 41822 40644 35594 20017 23487 11339 -38138 -47170 -64756
13876f4756N318o46J4076k6168K7600L8121N3066l3191n0016l6488M9363k2565
$$ -64756 -59438 -60084 -46008 -72176 -44576 -6455 46611 13420 -36596 -73084 -23721 -46286
13864d6286j3845L7505J4443O408k908J8393j717l0807j4202K754J705J7904L4158
$$ -46286 -60131 -22626 -8183 -1775 -4683 13710 11993 -18814 -33016 -30262 -28557 -10653 23505
13851B3505L4359j6820j5909k7989O831j7135m1938L3244K4359m3009l532K6078
$$ 23505 57864 41044 25135 -2854 3977 -13158 -55096 -21852 2507 -40502 -44034 -17956
13839a7956O070L1311K5287j1409l9949l1765K3282J6867j3303K4060r663j8568
$$ -17956 -11886 19425 44712 33303 -6646 -38411 -15129 1738 -11565 12495 2832 -15736
13827a5736l84j0210l3937K0098J6973J5758l52j1461k2286j0936l403q456M6977
$$ -15736 -16120 -26330 -60267 -40169 -23196 -7438 -7790 -19251 -41537 -52473 -55876 -64332 -17355
13814a7355K9544l44p01k249K9145K1649k0680k0357J0414l1601p941j3820j1706
$$ -17355 12189 11845 11144 8895 38040 59689 39009 18652 29066 -2535 -10476 -24296 -36002
13801c6002r184q602J2401J7416J4734j4304k0779L994K7357J5260n1919l4200
$$ -36002 -45186 -53788 -41387 -23971 -9237 -23541 -44320 -40326 -12969 2291 -49628 -83828
13789h3828j947K8093K2949J1388K4681k12k0672r757K887j9451o8M1783o1O884
$$ -83828 -85775 -57682 -34733 -23345 1336 1124 -19548 -29305 -26418 -45869 -45937 -4154 -4215 2669
13775B669m2551j7042K5649K2983M6544L277k0011N781K9413j840j3292m516J5539
$$ 2669 -39882 -56924 -31275 -8292 38252 41529 21518 27299 56712 54872 41580 37064 52603
13762E2603K6522J2025j7279l3636n1278l2064N919L3962l66j5059j3631J772
$$ 52603 79125 91150 73871 40235 -11043 -43107 -37188 -3226 -3592 -18651 -32282 -30510
13750c0510M599j568M50M2104J2881j2413j1531J9901l37K3687l0876j2607m417
$$ -30510 -25911 -27479 -27029 15075 27956 15543 4012 23913 23576 47263 16387 3780 -637
13737f37M597j2440p537Q567Q127m9998j5020K2224m1435K6252Q150L8077L2484
$$ -637 3960 -8480 -16017 -7450 677 -49321 -64341 -42117 -83552 -57300 -49150 -11073 21411
13724B1411J4897n0317j0123L283k2874p098J1629P013L1101R63j4455q36L6181
$$ 21411 36308 -14009 -24132 -20849 -43723 -50821 -39192 -32179 -1078 -115 -14570 -15406 20775
13711B0775m33j076k2126J0234m190N054K0179M7187J1629k8097l2792k5642j2927
$$ 20775 20342 19266 -2860 7374 3184 8238 28417 75604 87233 59136 26344 702 -12225
13698a2225K4561L386L710k736m1417N785J9883L0379J2081m4570k174L7910J3769
$$ -12225 12336 15722 19432 16696 -24721 -18936 947 31326 43407 -1163 -3337 34573 48342
13685D8342l76k8006k3300k0181J3659L3498l0869j8508k9513o708J6706M6127
$$ 48342 47966 19960 -3340 -23521 -9862 23636 -7233 -25741 -55254 -61962 -45256 871
13673H71J8070K0263J912O86K318n8944k7731J2212K2472J1436q715P161J4080
$$ 871 18941 39204 41116 41802 44120 -14824 -42555 -30343 -7871 3565 -5150 2011 16091
13660A6091j624j427j4839R563O36L9041L7393p791k4335l1124l7270j2995J4300
$$ 16091 14467 13040 -1799 7764 8400 47441 84834 77043 52708 21584 -15686 -28681 -14381
13647a4381K121J6520M3754k3952o907j1855j8768j2391K4433K998l5808K0625
$$ -14381 -12260 4260 48014 24062 17155 5300 -13468 -25859 -1426 1572 -34236 -13611
13635a3611K0594l3125r650J2135Q0q026l3341j3685J4070N7881M5271o5l5144
$$ -13611 6983 -26142 -35792 -23657 -23577 -31603 -64944 -78629 -64559 -6678 38593 38528 3384
13622C384o6265j8765J25K1309M4853J6004K9007L74Q303K93J3702o800m9751
$$ 3384 -62881 -81646 -81521 -60212 -15359 645 29652 30026 38329 38622 52324 45524 -4227
13609d227q495N3677J4882k4375m2976P65L2923j5917q321j2460N137L341J739
$$ -4227 -12722 40955 55837 31462 -11514 -10749 22174 6257 -2064 -14524 -9387 -6046 -4307
13596d307J5313L1489m777K252K6014j8723l7969k0529Q291J553M4321K3371j4972
$$ -4307 11006 42495 37718 39970 65984 47261 9292 -11237 -2946 -1393 42928 66299 51327
13583E1327m1589o055k5970j9148J5199L758L802O2513l4720m9293j2363Q770
$$ 51327 9738 3683 -22287 -41435 -26236 -22478 -18676 43837 9117 -40176 -52539 -43769
13571d3769l2577r019L9821K5287L0732K474m860k5428j2451o996L6730K1275
$$ -43769 -76346 -85365 -45544 -20257 10475 12949 8089 -17339 -29790 -36786 -56 21219
13559B1219k6803k1934R514J5851J3728M693m1009j6626N5440L6757j4851l9728
$$ 21219 -5584 -27518 -18004 -2153 11575 16268 -24741 -41367 14073 50830 35979 -3749
13547c749K5472R340J4905L0659J9477l5113m3467j0816l4280L9595K3439j0608
$$ -3749 21723 31063 45968 76627 96104 60991 17524 6708 -27572 12023 35462 24854
13535B4854l7320J0489O2772M3044k5932j9070q516k2265k0670K4080k5168l7569
$$ 24854 -12466 -1977 60795 103839 77907 58837 50321 28056 7386 31466 6298 -31271
13523c1271j7329j0156o648Q467J1124M3954l965N730M94j8150J6133l687l6935
$$ -31271 -48600 -58756 -65404 -56937 -45813 -1859 -5824 -94 400 -17750 -1617 -5304 -42239
13510d2239N1673M5494m500j7785K3914J2120k6841o0745n0919N378N3903J3389
$$ -42239 9434 54928 50428 32643 56557 68677 41836 -18909 -69828 -64450 -10547 2842
13498B842j7041K0709O621K709l276j4386k9662o159N608R317J5166R45m12j9494
$$ 2842 -14199 6510 13131 15840 12564 -1822 -31484 -37643 -32035 -22718 -7552 -6607 -7019 -26513
13484b6513O53J1255m80K5431K0912J226J5242j4144o898J536m294n796l1142
$$ -26513 -25860 -14605 -15085 10346 31258 32484 47726 33582 26684 28220 23926 18130 -13012
13471a3012q739J5336K7782j9202j0373K9850r811j2656J0087k2941j2221K6562
$$ -13012 -21751 -6415 21367 2165 -8208 21642 11831 -825 9262 -13679 -25900 662
13459F62j9713j0221L4264j2574j1897N821j9681j8518Q206k5540k3963J3904
$$ 662 -19051 -29272 4992 -7582 -19479 -13658 -33339 -51857 -43651 -69191 -93154 -79250
13447g9250K4505J4700M088J4733m424k7087l261L2256M8037O788j0377l976k0717
$$ -79250 -54745 -40045 -35957 -21224 -25648 -52735 -55996 -23740 24297 31085 20708 16732 -3985
13434c985k8719K1560j7072J0193J1401L601q380J5096K7604L277j0334k8123
$$ -3985 -32704 -11144 -28216 -18023 -6622 -3021 -11401 3695 31299 34576 24242 -3881
13422c881q961L6863j4532Q876J7862j7666j8022l923N589O75R92K0913L943k6887
$$ -3881 -12842 24021 9489 18365 36227 18561 539 -3384 2205 2880 3872 24785 28728 1841
13408A841J1346J8274J600k431l0614m4721l9894L0829K3871L1942n347J9881
$$ 1841 13187 31461 33061 30630 16 -44705 -84599 -53770 -29899 2043 -3304 16577
13396A6577Q590J5581j4657q088n8616n9646K2027N6190j8216k168K9046Q669
$$ 16577 25167 40748 26091 18003 -40613 -100259 -78232 -22042 -40258 -42426 -13380 -4711
13384d711j639l1475k2148K4917p693j4426j6767K0540q058K2323K5062q255k4205
$$ -4711 -6350 -37825 -59973 -35056 -42749 -57175 -73942 -53402 -61460 -39137 -14075 -22330 -46535
13371d6535K522K101J5116J9509K5796J5603J2964k8372o087N433k3408l5789
$$ -46535 -44013 -41912 -26796 -7287 18509 34112 47076 18704 12617 18050 -5358 -41147
13359d1147j7505M8204K007j4643p733J0230k1041o834M168M4925P839m2606k1812
$$ -41147 -58652 -10448 -8441 -23084 -30817 -20587 -41628 -48462 -44294 631 8470 -34136 -55948
13346e5948L1637K553M5367j2923l3480j2795o927J4454J976J8125J3874J4318
$$ -55948 -24311 -21758 23609 10686 -22794 -35589 -42516 -28062 -26086 -7961 5913 20231
13334B0231j3357j9920J0211J5561N277K5753l5992k815P200j7768k7006q364
$$ 20231 6874 -13046 -2835 12726 18003 43756 7764 4949 12149 -5619 -32625 -40989
13322d0989J8619K0397o36J2949J505j915J8710J7342j2506l16n558L694Q246
$$ -40989 -22370 -1973 -2609 10340 11845 9930 28640 45982 33476 33160 27602 31296 39542
13309C9542k1053k1982M048J7360L2816j6336l6220J153K4236J997K2300J4834
$$ 39542 18489 -3493 555 17915 50731 34395 -1825 -672 23564 25561 47861 62695
13297F2695r701Q509o067m289M641N126k0008m461J5249m320r464L332J8824j5558
$$ 62695 52994 61503 55436 51147 55788 60914 40906 36445 51694 47374 37910 41242 60066 44508
13283D4508n144l0564k0490J1088K0508R918J6229k711l4495j2862l9568k1163
$$ 44508 39364 8800 -11690 -602 19906 29824 46053 43342 8847 -4015 -43583 -64746
13271f4746J4064K7256p978l8406J5371J89J2830k3674M3159r117K6969K4126
$$ -64746 -50682 -23426 -31404 -69810 -54439 -54250 -41420 -65094 -21935 -31052 -4083 20043
13259B0043m368J1748m615k0032K5599k5740J98M008j8554K2112K7640J8195k4433
$$ 20043 15675 27423 22808 2776 28375 2635 2833 6841 -11713 10399 38039 56234 31801
13246C1801k4040J2277Q861l401p970r38j2521l4875n625L0949L3566m960k212
$$ 31801 7761 20038 28899 25498 17528 16590 4069 -30806 -36431 -5482 28084 23124 20912
13233B0912N433J344n107J3447l887J328j5305j4961r681K14k1596L4956L2729
$$ 20912 26345 27689 22582 36029 32142 33470 18165 3204 -6477 -6263 -27859 7097 39826
13220C9826L5271n1087m6421O877J7313q416j0603r710K09J580J2959J8031n694
$$ 39826 75097 24010 -22411 -15534 1779 -6637 -17240 -26950 -26741 -25161 -12202 5829 135
13207A35J2885J6914M0132K2591J6908j0402l0963r665J5488M309k8789j9225
$$ 135 13020 29934 70066 92657 109565 99163 68200 58535 74023 78332 49543 30318
13195C0318k0592J1100K0003K6707k8814K764k950O634J1053K5119l424P892M241
$$ 30318 9726 20826 40829 67536 38722 41486 38536 45170 56223 81342 77918 85810 90051
13182I0051q110J3049L6027J1004n2196l0587j8620M7939L4654j405k4573n1634
$$ 90051 81941 94990 131017 142021 89825 59238 40618 88557 123211 121806 97233 45599
13170D5599l8117J0831q362j7941J9998N494L6269K7784k4600k50L647P915r838
$$ 45599 7482 18313 9951 -7990 12008 17502 53771 81555 56955 56705 60352 68267 58429
13157E8429j1646l4414K7458K8691j686k076j5956l8986Q25L6696J4507j0862
$$ 58429 46783 12369 39827 68518 66832 64756 48800 9814 10639 47335 61842 50980
13145E0980L6100J5322k9016n1550M951L4367j3855K3682O588J798m389j3485
$$ 50980 87080 102402 73386 21836 26787 61154 47299 70981 77569 79367 74978 61493
13133F1493j6545l0089R862K9532j4365j5549k1125K0003K6501Q390p483j96K3955
$$ 61493 44948 14859 24721 54253 39888 24339 3214 23217 49718 58108 50625 50429 74384
13120G4384k3293q926q861K4806L7796k0595m1996m0954L5405O964N177K0264
$$ 74384 51091 42165 33304 58110 95906 75311 33315 -7639 27766 34730 39907 60171
13108F0171K4603j4166J890j609j6985k5304n000J8608j0466K8660L0678k309
$$ 60171 84774 70608 72498 70889 53904 28600 23600 42208 31742 60402 91080 88771
13096H8771n728K5461R798k3095k3744k4749j1352j010r343J0357J4032J0767
$$ 88771 83043 108504 118302 95207 71463 46714 35362 34352 25009 35366 49398 60165
13084F0165k0834M6051n459M71J0178k3526l962J468m6202j0242N097J8088N722
$$ 60165 39331 85382 79923 80394 90572 67046 63084 64552 18350 8108 13205 31293 37015
13071C7015L0040l073k8374J1509k0725K2273J5983J1333p995O694K5905R601
$$ 37015 67055 63982 35608 47117 26392 48665 64648 75981 67986 74680 100585 110186
13059A10186K4106k145o635m477j0493m1870k524J2344n066K5479K2653j1429
$$ 110186 134292 132147 125512 121035 110542 68672 66148 78492 73426 98905 121558 110129
13047A10129j4871M7783K6764L1323m6992n8893j6857j2125J5285r410K3889o03
$$ 110129 95258 143041 169805 201128 154136 95243 78386 66261 81546 72136 96025 95422
13035I5422l528j9736j9106l5804k8443J5479J3035K2071m194O690r846j146R19
$$ 95422 91894 72158 53052 17248 -11195 4284 17319 39390 35196 41886 32040 30894 31813
13022C1813k6150K4801P265J4043J129m7939j234j8244j1848J7609L1889P756
$$ 31813 5663 30464 37729 51772 52901 4962 3728 -14516 -26364 -8755 23134 30890
13010C0890J023R372r718J2713n576M1697j9337m4306L1832j4830Q597p909j7251
$$ 30890 31913 41285 31567 44280 38704 80401 61064 16758 48590 33760 42357 34448 17197
12997A7197n4087K4919J5611N422j6870l82J2861P87j569J0679k6728J8165L2394
$$ 17197 -36890 -11971 3640 9062 -7808 -8190 4671 5458 3889 14568 -12160 6005 38399
12984C8399l0952l0458K4205J5856O287N0724r926k0607K443L055j3202j6251
$$ 38399 7447 -23011 1194 17050 23337 74061 64135 43528 45971 49026 35824 19573
12972A9573l7873m2131K1144L7240o07o51M0081K9329m319p022p603l1509J7741
$$ 19573 -18300 -60431 -39287 -2047 -2654 -3305 36776 66105 61786 54764 47161 15652 33393
12959C3393j0971j2797K749j6316l777K4043j4001j5299J483r540J596J5413J2966
$$ 33393 22422 9625 12374 -3942 -7719 16324 2323 -12976 -11493 -21033 -19437 -4024 8942
12946H942J1869K4947k1853l6139m6163J5715K7079J7691M275j7054j8934J5103
$$ 8942 20811 45758 23905 -12234 -58397 -42682 -15603 2088 6363 -10691 -29625 -14522
12934a4522Q315m495R173P594J0547k7044j2209L466k66k463K6666p14k781J8746
$$ -14522 -6207 -10702 -1529 6065 16612 -10432 -22641 -19175 -19441 -21904 4762 4048 1267 20013
12920B0013J82p981K5002j1248m8468j8028L0458J8576K0284K0877o7842m7307
$$ 20013 20195 12214 37216 25968 -22500 -40528 -10070 8506 28790 49667 -18175 -65482
12908f5482L4026N9535K532K5226K1212Q950m4517r884L9567J506j3277m40o3543
$$ -65482 -31456 28079 30611 55837 77049 85999 41482 31598 71165 72671 59394 58954 -4589
12895d589k7537M705J0244j7431J6700K454K5543J5572p02j777j8550l894j3147
$$ -4589 -32126 -27421 -17177 -34608 -17908 -15454 10089 25661 24959 23182 4632 738 -12409
12882a2409r152K3107m532j0803K2037K6537J5758K8350M467k568j026l9939j3341
$$ -12409 -21561 1546 -2986 -13789 8248 34785 50543 78893 83360 80792 79766 39827 26486
12869B6486j5588j6907j6993K0263L4548L406l0323k7281J6274l618O98N826J5638
$$ 26486 10898 -6009 -23002 -2739 31809 35215 4892 -22389 -6115 -9733 -9035 -3209 12429
12856A2429K0591J7612P931J238k7550l8375K4771J4587M226p554J3147j1052
$$ 12429 33020 50632 58563 59801 32251 -6124 18647 33234 37460 29906 43053 32001
12844C2001j7671J2499j5266L0630q335O950O057k8673M998M0304j5412P619P40
$$ 32001 14330 26829 11563 42193 33858 40808 46865 18192 23190 63494 48082 55701 56441
12831E6441j1522k1208J7305k8388l9415K0242N9234o819j1376N783P319K07l2731
$$ 56441 44919 23711 41016 12628 -26787 -6545 52689 45870 34494 40277 47596 47803 15072
12818A5072J3748q272n6034j4061M0308J7602K299j8244P125J617J5704J0766
$$ 15072 28820 20548 -35486 -49547 -9239 8363 10662 -7582 -457 1160 16864 27630
12806B7630n169Q462j8719j3289n419O23k2972m411L6645K2339K9496P670j0632
$$ 27630 22461 30923 12204 -1085 -6504 -5881 -28853 -33264 3381 25720 55216 62886 52254
12793E2254j3121L7398Q970k1127k0115j4160M987K3745K3280m855n062p653o084
$$ 52254 39133 76531 85501 64374 44259 30099 35086 58831 82111 77256 72194 64541 58457
12780E8457j2397k4906j4831j566Q390L6531P3j1653j6965l2792J6769M7747j4305
$$ 58457 46060 21154 6323 4757 13147 49678 49751 38098 21133 -11659 5110 52857 38552
12767C8552k3036L1308k498J7298K312k6645P946J2953l1733k4506r866Q727K1543
$$ 38552 15516 46824 44326 61624 63936 37291 45237 58190 26457 1951 -7915 812 22355
12754B2355j7320j5555k019J8275J3324k6381j0275J6774l6056J103R0682j868
$$ 22355 5035 -10520 -12539 5736 19060 -7321 -17596 -822 -36878 -35775 54907 53039
12742E3039k3356j8535j5333j4880l5313L1782M0127l627J6294M0891R828O216
$$ 53039 29683 11148 -4185 -19065 -54378 -22596 17531 13904 30198 71089 80917 87133
12730H7133j1510n099J2417k9418J3888j190m6861k5066j127k61j6366M5769L1145
$$ 87133 75623 70524 82941 53523 67411 66221 19360 -5706 -6833 -7094 -23460 22309 53454
12717E3454o163J395L3137L0513n7975j6016J2606j2834j0810K58k0495K6346
$$ 53454 47291 48686 81823 112336 54361 38345 50951 38117 27307 27565 7070 33416
12705C3416O897O535L1585J1011j4956q576m2282j4197K8132j9464j1702o56K190
$$ 33416 40313 46848 78433 89444 74488 65912 23630 9433 37565 18101 6399 5743 7933
12692G933R298R269J089m154K3954P597l791j176j3870j5599J1229K014J0877
$$ 7933 17231 26500 27589 23435 47389 54986 51195 50019 36149 20550 31779 33793 44670
12679D4670K0293k041k8176J9131j4536j4522k9439K791K253L7563L0626k9419
$$ 44670 64963 62922 34746 53877 39341 24819 -4620 -1829 424 37987 68613 39194
12667C9194l926K139J2370K4597r510l1550k2385l3831j2842o236K3484L4097
$$ 39194 35268 37407 49777 74374 64864 33314 10929 -22902 -35744 -41980 -18496 15601
12655A5601j4703P868Q853l120J2569K0507M0276k1516o4549P188M0438M021j9685
$$ 15601 898 8766 17619 14499 27068 47575 87851 66335 1786 8974 49412 53433 33748
12642C3748M844L3258J7706O678J8764k4149l3496j1868k2991O48J4399P913k8804
$$ 33748 38592 71850 89556 96234 114998 90849 57353 45485 22494 23142 37541 45454 16650
12629A6650q597K8924J6627J3996P120L3k8934n796l3394J0920m706J3480K1069
$$ 16650 8053 36977 53604 67600 74720 74753 45819 40023 6629 17549 12843 26323 47392
12616D7392l044K2477q422l4233M805l5847j139L5276K8993J8809J0794L6k4370
$$ 47392 44348 66825 58403 24170 28975 -6872 -8011 27265 56258 75067 85861 85897 61527
12603F1527j7586j4526Q900K8739j7436k4190j8753K871L942L3532N9609K305
$$ 61527 43941 29415 38315 67054 49618 25428 6675 9546 13488 47020 106629 108934
12591A08934k5000j7027K4068n608j7380J8171J455M0740Q031k7366J0439J8781
$$ 108934 83934 66907 90975 85367 67987 86158 87613 128353 136384 109018 119457 138238
12579A38238k4674n2234N2549J6130m6567O922l637J163k611J0477n173q866Q08
$$ 138238 113564 61330 113879 130009 83442 90364 86727 87890 85279 95756 90583 81717 82525
12566H2525J938k3379j1753j015J6794K003k017o203K9007j1987J5065j076R081
$$ 82525 84463 61084 49331 48316 65110 67113 65096 58893 87900 75913 90978 89902 98983
12553I8983m8383j1697P399K1303J0523j4493j2751O819K3356K4001J4155R026
$$ 98983 50600 38903 46302 67605 78128 63635 50884 57703 81059 105060 119215 128241
12541A28241k0966K681J0190J5446k4077j3092K0257j4410r659K2914k3713k1190
$$ 128241 107275 109956 120146 135592 111515 98423 118680 104270 94611 117525 93812 72622
12529G2622l844J7067O072N8165K03k9107j2837P138M133m9784j9485K0937J764
$$ 72622 68778 85845 91917 150082 150285 121178 108341 115479 119612 69828 50343 71280 73044
12516G3044p765l0725K6004P067j9211M6505P070J3700j9845j3864L4550L1004
$$ 73044 65279 34554 60558 67625 48414 94919 101989 115689 95844 81980 116530 147534
12504A47534k8641n4586k2964j1704N994O020K3577O285J1905K3179J3173O817
$$ 147534 118893 64307 41343 29639 35633 41653 65230 71515 83420 106599 119772 126589
12492A26589K256l19l6694L1236L6319l6860k4655l080j19L5563Q087k0217K305
$$ 126589 128845 128526 91832 123068 159387 122527 97872 94792 94673 130236 138323 118106 120411
12479A20411j0556m3033j7051q494N1700J051q65M1850R331K246N017k285k0198
$$ 120411 109855 66822 49771 41277 92977 94028 93163 135013 144344 146590 151607 149322 129124
12466A29124j7559L7829P853m3681j2019K668N542Q799L2983J8837j2505r517
$$ 129124 111565 149394 157247 113566 101547 104215 109757 118556 151539 170376 157871 148354
12454A48354k1850j6464j0733J5772j9k0124m1321K8559L7717J0705k8966r353
$$ 148354 126504 110040 99307 115079 115060 94936 53615 82174 119891 130596 101630 92277
12442I2277N229O807M150l616J1795L386p239K516J8572ok4288k6051J2400N6376
$$ 92277 97506 104313 108463 104847 116642 120028 112789 115305 133877 133871 109583 83532 95932 152308
12428A52308l0908l7251L7229K927j7273O303R044n523l336L8323K3226J508K8482
$$ 152308 121400 84149 121378 124305 107032 113335 122379 116856 113520 151843 175069 176577 205059
12415B05059L713n9669j7623N500J8118l906m090M820k4025n775j9956N97k8483
$$ 205059 208772 149103 131480 136980 155098 151192 147102 151922 127897 122122 102166 102763 74280
12402G4280K1526K0162K2002N2081J5973k2846m440o210k7172j085J3697r295
$$ 74280 95806 115968 137970 190051 206024 183178 178738 172528 145356 144271 157968 148673
12390A48673L2123q035J0595L0002k1473l3946J5718J6282L5453n08l7397j9840
$$ 148673 180796 172761 183356 213358 191885 157939 173657 189939 225392 224884 187487 167647
12378A67647j8234j8705k3304L6223K4118k0216K6023J7756L3250O419j819k4682
$$ 167647 149413 130708 107404 143627 167745 147529 173552 191308 224558 230977 229158 204476
12366B04476L697j0928j9356j4457j8834L8358j1846Q910J7980l2931K4165L4324
$$ 204476 208173 197245 177889 163432 144598 182956 171110 180020 198000 165069 189234 223558
12354B23558j6105l1273l788O13R722l901K95j6723N365L2110L0832j6765j9119
$$ 223558 207453 176180 172392 173005 182727 178826 179121 162398 167763 199873 230705 213940 194821
12341A94821M837L3310j2443j7442k1355m7137L3136M2666r651k2354k4389K3357
$$ 194821 199658 232968 220525 203083 181728 134591 167727 210393 200742 178388 153999 177356
12329A77356J1750J3625L4751K6534P820j6201l2601l344J6017m237K9731K0395
$$ 177356 189106 202731 237482 264016 271836 255635 223034 219690 235707 231470 261201 281596
12317B81596l3130K5415J0224J2202P940l122m7715L709J411j8879L9397J3585
$$ 281596 248466 273881 284105 296307 304247 301125 253410 257119 258530 239651 279048 292633
12305B92633l386l7885k4026L0766M758j388J4010K0041J5685M419l5846K2129
$$ 292633 289247 251362 227336 258102 262860 261472 275482 295523 311208 315627 279781 301910
12293C01910M552k8593M365n156l056r89j8167N978K0972n707k0231K8320J7169
$$ 301910 306462 277869 282234 277078 274022 273033 254866 260844 281816 276109 255878 284198 301367
12280C01367j9786n0983J0238N5816J9879J1845j6918l449k785M1606L8396j1667
$$ 301367 281581 230598 240836 296652 316531 328376 311458 308009 305224 346830 385226 373559
12268C73559m7237K030M2019j4221o680L784L5721M512k3498n3056k2703J996
$$ 373559 326322 328352 370371 356150 349470 353254 388975 393487 369989 316933 294230 296226
12256B96226L2466L1361j4363l4508j434j001K1313j3693j433j5751K860L6444
$$ 296226 328692 360053 345690 311182 309748 308747 330060 316367 314934 299183 302043 338487
12244C38487K4847j21k048p701J6007J3173L897J6784L5161J3048k5423k7611
$$ 338487 363334 363213 361165 353464 369471 382644 386541 403325 438486 451534 426111 398500
12232C98500o649K1041M9493J6368k5612J0824J5830L6534j0024j5378P372l8332
$$ 398500 391851 412892 462385 478753 453141 463965 479795 516329 506305 490927 498299 459967
12220D59967k8934j887J0611L1333j9349o779K8428K0657K6113J9247k7488k486
$$ 459967 431033 429146 439757 471090 451741 444962 473390 494047 520160 539407 511919 509433
12208E09433M6719J5972L107j9059j1773L2566K5988n06R212O712J6313j7831
$$ 509433 556152 572124 575231 556172 544399 576965 602953 602447 611659 618371 634684 616853
12196F16853l5656J6359k769r197l2216J2367N37L0109K7466K1148L7787j67j0789
$$ 616853 581197 597556 594787 585590 553374 565741 566278 596387 623853 645001 682788 682621 671832
12183F71832J5259l3642j350J3621j4454j9479k223K7532O294L2823J7487m225
$$ 671832 687091 653449 652099 665720 651266 631787 629564 657096 663390 696213 713700 709475
12171G09475N802L1150J2943k9128q16J2533j1448m4666J1859M0657K3020K9264
$$ 709475 715277 746427 759370 730242 729426 741959 730511 685845 697704 738361 761381 790645
12159G90645o054J061R957K1843k7865j0005j3389j7609K6046N7799R937j5758
$$ 790645 784591 785652 795609 817452 789587 779582 766193 748584 774630 832429 842366 826608
12147H26608p711M3017K3604k1818L2302L6092l5232p798k5177m5382j6814L5589
$$ 826608 818897 861914 885518 863700 896002 932094 896862 889064 863887 818505 801691 837280
12135H37280N8470O1203L104j2717J4690K1259J0216K4551r352m882l00J6034
$$ 837280 895750 956953 960057 947340 962030 983289 993505 1018056 1008704 1003822 1003522 1019556
12123A019556M6791K1322r31J6496N0665k3434M338O481Q23M28L2546L8572L1184
$$ 1019556 1066347 1087669 1086738 1103234 1153899 1130465 1134803 1141284 1142107 1142535 1175081 1213653 1244837
12110A244837K6599j6731J2975M5796L6204M5553j1729j8152r551j5977j5595
$$ 1244837 1271436 1254705 1267680 1313476 1349680 1395233 1383504 1365352 1355801 1339824 1324229
12099A324229M9739K1847J7639P8296J8474K9128k106L212O520o054J0575J6091
$$ 1324229 1373968 1395815 1413454 1491750 1510224 1539352 1537246 1540458 1546978 1540924 1551499 1567590
12087A567590P7299P0632K9035k4622m011L9786K6882K87L6807Q0118N5221j4928
$$ 1567590 1644889 1715521 1744556 1719934 1715923 1755709 1782591 1782878 1819685 1899803 1955024 1940096
12075A940096M445J0122L3741M0229P773K3560K2420J7887M2792L3070O2552N3529
$$ 1940096 1944541 1954663 1988404 2028633 2036406 2059966 2082386 2100273 2143065 2176135 2238687 2292216
12063B292216N3733L769J1278N6520M1347L6868N893M420J1869J09455P3333N1371
$$ 2292216 2345949 2349718 2360996 2417516 2458863 2495731 2501624 2506044 2517913 2627368 2700701 2752072
12051B752072O3775M2748L4000J0870N2570N0826O1653P9497O5446M6154N9833
$$ 2752072 2815847 2858595 2892595 2903465 2956035 3006861 3068514 3148011 3213457 3259611 3319444
12040C319444R2038P7537O5571P5358O5334N5855O7307O3630L2466P8586R8974
$$ 3319444 3411482 3489019 3554590 3629948 3695282 3751137 3818444 3882074 3914540 3993126 4092100
12029D092100Q7558J09033R1438R8994R9218O5043M5968Q2203J50320J62358R7576
$$ 4092100 4179658 4288691 4380129 4479123 4578341 4643384 4689352 4771555 4921875 5084233 5181809
12018E181809J11626J17615R7889J30467J34519J64319J75240J57257J72553J20465
$$ 5181809 5293435 5411050 5508939 5639406 5773925 5938244 6113484 6270741 6443294 6563759
12008F563759J26556J56671K16224K02842J97598J89060J58985K13817K27583
$$ 6563759 6690315 6846986 7063210 7266052 7463650 7652710 7811695 8025512 8253095
11999H253095K27779K44267K53482K67758K98204K60814K66365L13444K86265
$$ 8253095 8480874 8725141 8978623 9246381 9544585 9805399 10071764 10385208 10671473
11990A0671473L47111L71346L97448L56860L69883M37401L74264M30380M71359
$$ 10671473 11018584 11389930 11787378 12144238 12514121 12951522 13325786 13756166 14227525
11981A4227525M75529M81967N31091N27082O17770O11766O18202O58305O95781
$$ 14227525 14703054 15185021 15716112 16243194 16860964 17472730 18090932 18749237 19445018
11972A9445018P32955P44627P39551Q45357Q84830Q74650Q84818R84312R82415
$$ 19445018 20177973 20922600 21662151 22507508 23392338 24266988 25151806 26136118 27118533
11963B7118533J062794J079520J108188J141615J207454J250034J206932J244752
$$ 27118533 28181327 29260847 30369035 31510650 32718104 33968138 35175070 36419822
11955C6419822J309480J335897J357304J350233J269308J263492J272635J271696
$$ 36419822 37729302 39065199 40422503 41772736 43042044 44305536 45578171 46849867
11947D6849867J255096J175922J042477R66856Q86079P61814O04126M83095L91383
$$ 46849867 48104963 49280885 50323362 51290218 52176297 52938111 53542237 54025332 54416715
11938E4416715K24153O2938p3383j68856l76514n12857o25976p28741q36716r42521
$$ 54416715 54640868 54703806 54630423 54461567 54085053 53572196 52946220 52217479 51380763 50438242
11928E0438242j041507j106473j169057j186456j236181j254940j286216j281839
$$ 50438242 49396735 48290262 47121205 45934749 44698568 43443628 42157412 40875573
11920D0875573j267784j284854j279242j232688j196527j209691j183345j130481
$$ 40875573 39607789 38322935 37043693 35811005 34614478 33404787 32221442 31090961
11912C1090961j085810j047310j058683r96377r11442r03281q61522q25788q35613
$$ 31090961 30005151 28957841 27899158 26902781 25991339 25088058 24226536 23400748 22565135
11903B2565135q15370q04767p08828o75643o51329o02367o40271o40748n95647
$$ 22565135 21749765 20944998 20236170 19560527 18909198 18306831 17666560 17025812 16430165
11894A6430165n14882m73813m86015m64043m64253m34459m02612m00139l59171
$$ 16430165 15915283 15441470 14955455 14491412 14027159 13592700 13190088 12789949 12430778
11885A2430778l77589l54549l24096l22500l38507l23998l11558k60804k18419
$$ 12430778 12053189 11698640 11374544 11052044 10713537 10389539 10077981 9817177 9598758
11876I598758k17363k71858k64004k52489k20070k49062k08019j80593j72836
$$ 9598758 9381395 9109537 8845533 8593044 8372974 8123912 7915893 7735300 7562464
11867G562464j94696j69799j82602j34385j48235j64984j64503j44389j23146
$$ 7562464 7367768 7197969 7015367 6880982 6732747 6567763 6403260 6258871 6135725
11858F135725j40145j65220j04746j34131j47454j15743j01367q3290j00915j29120
$$ 6135725 5995580 5830360 5725614 5591483 5444029 5328286 5226919 5143629 5042714 4913594
11848D913594j01571p3116r5938n5340n7704j04730j09269p9959q2031o9031r0720
$$ 4913594 4812023 4738907 4642969 4587629 4529925 4425195 4315926 4235967 4153936 4084905 3994185
11837C994185q7405j02606l3336m4524q3324l7876p9148o9732o3132n6227m0968
$$ 3994185 3906780 3804174 3770838 3726314 3642990 3605114 3525966 3456234 3393102 3336875 3295907
11826C295907l1065n5921l8400p7612r4195n0722l0448m5538m9804o4677j5945
$$ 3295907 3264842 3208921 3170521 3092909 2998714 2947992 2917544 2872006 2822202 2757525 2741580
11815B741580k8672o5610o4811j696l8662n7790l7754j9657j7510l8048q5658
$$ 2741580 2712908 2647298 2582487 2580791 2542129 2484339 2446585 2426928 2409418 2371370 2285712
11804B285712l2625l0902l1410M798j6101n2230j5896k7459o1202l4039j016k870
$$ 2285712 2253087 2222185 2190775 2195573 2179472 2127242 2111346 2083887 2022685 1988646 1987630 1984760
11792A984760l4830k5494j8169j0601L150m2366m7366j6664q027m1025j8663l0924
$$ 1984760 1949930 1924436 1906267 1895666 1898816 1856450 1809084 1792420 1784393 1743368 1724705 1693781
11780A693781l1157l8807l9333k3817j1638o634k2561M068j584j2616l0721m2546
$$ 1693781 1662624 1623817 1584484 1560667 1549029 1542395 1519834 1523902 1522318 1509702 1478981 1436435
11768A436435l6266n1361r14J0040l1569j621J4326K0386k4923l0348l4322l3089
$$ 1436435 1400169 1348808 1347894 1357934 1326365 1324744 1339070 1359456 1334533 1304185 1269863 1236774
11756A236774m0424o289j1857l9729n6J2844K9816J406J7224m9120l5084j6881
$$ 1236774 1196350 1190061 1178204 1138475 1138419 1151263 1181079 1182485 1199709 1150589 1115505 1098624
11744A098624j1124k2842R077R700j7778l3731k1739K412n412Q739N16j3648r653
$$ 1098624 1087500 1064658 1073735 1083435 1065657 1031926 1010187 1012599 1007187 1015926 1016442 1002794 993141
11731I93141k9335p800j9344k5716L3036o963l7704j2793n9572j8137Q675J7453
$$ 993141 963806 956006 936662 910946 943982 937019 899315 886522 826950 808813 817488 834941
11719H34941L0635n3802k6838K2197J404k5110J9140J1768L220k0905N187R683
$$ 834941 865576 811774 784936 807133 808537 783427 802567 814335 817555 796650 801837 811520
11707H11520O793l0316m1772k517K9640P797n1993m0271O005K0948J4178J496
$$ 811520 818313 787997 746225 743708 773348 781145 729152 688881 694886 715834 730012 731508
11695G31508q078K170k8561J2954j6874N029Q430q813m247n233L1354k107j2116
$$ 731508 723430 725600 697039 709993 693119 698148 706578 697765 693518 688285 719639 717532 705416
11682G05416j9278m7636j0810n807K5287K8008k42p037J3830j580k3951j1796
$$ 705416 686138 638502 627692 621885 647172 675180 674938 667901 681731 680151 656200 644404
11670F44404M2809K2330j6221k877K7800K4136n1334n028M5507N5895K602K1552
$$ 644404 687213 709543 693322 690445 718245 742381 691047 686019 731526 787421 790023 811575
11658H11575L9091L4760L4107P0261N8156R2423J18602J05126J65910K73545K22001
$$ 811575 850666 885426 919533 989794 1047950 1140373 1258975 1364101 1530011 1803556 2025557
11647B025557J91467K14173J49192O9952k9245j01238j79827k19469j97380k00761
$$ 2025557 2217024 2431197 2580389 2650341 2621096 2519858 2340031 2120562 1923182 1722421
11637A722421j71756j86387j36106r2070j02438q8439o8611o0939l8564n935q714
$$ 1722421 1550665 1364278 1228172 1136102 1033664 945225 876614 815675 777111 771176 762462
11626G62462m3652p0466p8429K1289K8770n8089k6437q611j8954M596L6063M195
$$ 762462 718810 648344 569915 591204 619974 561885 535448 526837 507883 512479 548542 552737
11614E52737m7459k4686j9480l0293j6755K6047K0296m952j6499k7855l6054j9167
$$ 552737 505278 480592 461112 430819 414064 440111 460407 455455 438956 411101 375047 355880
11602C55880L7526K4812j5652j3065K113p636K0194M1145k2935n4241k8558j3656
$$ 355880 393406 418218 402566 389501 391614 383978 404172 445317 422382 368141 339583 325927
11590C25927j84j0973j601N0052J5923l4202L079l2273L6462K9826l036k7864
$$ 325927 325743 314770 313169 363221 379144 344942 348021 315748 352210 382036 379000 351136
11578C51136j1742l1698l5140j9104J4756O649O441l325K1312J7702K4193j7793
$$ 351136 339394 307696 272556 253452 268208 274857 281298 277973 299285 316987 341180 323387
11566C23387j9922J7478n358n1721q930j7401l0183L7906J4827k7092j1300J9275
$$ 323387 303465 320943 315585 263864 254934 237533 207350 245256 260083 232991 221691 240966
11554B40966K0506K2347L224j2710K3553L0291j0870J0998k080l7216l97j1015
$$ 240966 261472 283819 287043 274333 297886 328177 317307 328305 326225 289009 288612 277597
11542B77597m0438J8144r959k3118j5344J6996K8177J5772J7019j7135J7052j4835
$$ 277597 237159 255303 245344 222226 206882 223878 252055 267827 284846 267711 284763 269928
11530B69928k503J4340j8639N209R134p421l6761l6667k3459J3623M9846j0434
$$ 269928 267425 281765 263126 268335 277469 270048 233287 196620 173161 186784 236630 226196
11518B26196n722k5576j6193K5710k0933j5125q878L2953K1728j6571J278l1999
$$ 226196 220474 194898 178705 204415 183482 168357 159479 192432 214160 197589 198867 166868
11506A66868N5768J7319j6623l5308K4284J1248k4436j145l9552j7328J8530L3913
$$ 166868 222636 239955 223332 188024 212308 223556 199120 197975 158423 141095 159625 193538
11494A93538M592k7229l5470j5786K4868J9425k2750r588K579M6122K6819m0398
$$ 193538 198130 170901 135431 119645 144513 163938 141188 131600 134179 180301 207120 166722
11482A66722o225j0356n123K4422J3966p592l3409p405K7086K0265l2874k0954
$$ 166722 160497 150141 145018 169440 183406 175814 142405 135000 162086 182351 149477 128523
11470A28523M429J8538J3839L513J6251J267j9016k1851J3263Q399q199L9806
$$ 128523 132952 151490 165329 168842 185093 186360 167344 145493 158756 167155 158956 198762
11458A98762j9866o0937l2424J0948L6246M5645N545j6632l0172N840K8838K6288
$$ 198762 178896 117959 85535 96483 132729 178374 183919 167287 137115 142955 171793 198081
11446A98081j4933o2094k4982O078K7500p625j4460M3211L6987p434j3744k9628
$$ 198081 183148 121054 96072 102150 129650 122025 107565 150776 187763 180329 166585 136957
11434A36957r765J9253J5543L3464O167M4429O6002M4643k2543o3638o5098j811
$$ 136957 127192 146445 161988 195452 201619 246048 312050 356693 334150 270512 205414 203603
11422B03603j6635p094L4085k367k1636k4426p309j1692K7935j2357L2493J2267
$$ 203603 186968 179874 213959 211592 189956 165530 158221 146529 174464 162107 194600 206867
11410B06867m934L0774L1374N2980J34492L5909n2008r8341q6928k8248q258j534
$$ 206867 201933 232707 264081 317061 451553 487462 435454 337113 250185 221937 213679 212145
11398B12145n5983k7056J6744J1005k5362j7430Q270J286L5348n398j0079k8427
$$ 212145 156162 129106 145850 156855 131493 114063 122333 123619 158967 153569 143490 115063
11386A15063j5357K1106K4433q027k242p736n7927m570j0851O1892K7526Q895
$$ 115063 99706 120812 145245 137218 134976 127240 69313 64743 53892 115784 143310 152205
11374A52205P080P23k4378N771n355j6303R906k418j4973p06k2833l0124J7089
$$ 152205 159285 160008 135630 141401 136046 119743 129649 127231 112258 111552 88719 58595 75684
11361G5684M7046K2960k5460j7884J7444J8904l2306k3881J3682J784K7243j3207
$$ 75684 122730 145690 120230 102346 119790 138694 106388 82507 96189 97973 125216 112009
11349A12009j9662K9507L1637M705q33m1731l2723k7693K7823J3722r790j1894
$$ 112009 92347 121854 153491 158196 157363 115632 82909 55216 83039 96761 86971 75077
11337G5077k571J71o507k4151J5749J0726J2803Q652J8998J1539M0734J0840j9000
$$ 75077 72506 72677 66170 42019 57768 68494 81297 89949 108947 120486 161220 172060 153060
11324A53060J553k3936m1973k3868R308J7486l015J0314l2032q144J8748N0316
$$ 153060 154613 130677 88704 64836 74144 91630 88615 98929 66897 58753 77501 127817
11312A27817M251j1882n691j1092l0889j8367K2498k2784L1696j0237k2972j4454
$$ 127817 132068 120186 114495 103403 72514 54147 76645 53861 85557 75320 52348 37894
11300C7894Q718m232m698l13J64j559R618K2625n953j4759J5704R591J6423K7745
$$ 37894 46612 42380 37682 37369 37533 35974 45592 68217 62264 47505 63209 72800 89223 116968
11286A16968k9285m6421K5043L9071n885m5577r346P6759M956n408J480j4835
$$ 116968 87683 41262 66305 105376 99491 53914 44568 121327 126283 120875 122355 107520
11274A07520K2381J4776J1204L217K960k0307r956k3612J4274j3509j6829l1214
$$ 107520 129901 144677 155881 159098 162058 141751 131795 108183 122457 108948 92119 60905
11262F0905k9324j6331L3907k2996j9839K2789K7831j6371n518j7375l0807J2300
$$ 60905 31581 15250 49157 26161 6322 29111 56942 40571 35053 17678 -13129 -829
11250h29J5069L2481J8001j1442k4847k2852M694N5561L1051j9779l6580R173
$$ -829 14240 46721 64722 53280 28433 5581 10275 65836 96887 77108 40528 49701
11238D9701r225J3252J1057N907J2320Q579k565K4701p111k1581l7088j1816k3162
$$ 49701 40476 53728 64785 70692 83012 91591 89026 113727 106616 85035 47947 36131 12969
11225A2969k77K6086M992P88j2743l7803J2372M698j0652j1487L5504M138j4586
$$ 12969 12692 38778 43770 44558 31815 -5988 6384 11082 430 -11057 24447 28585 13999
11212A3999j1669k1563j0901K9892k2472o707M414j709N0100K6862M3640R883
$$ 13999 2330 -19233 -30134 -242 -22714 -29421 -25007 -26716 23384 50246 93886 103769
11200A03769m1724l7542l215Q983k659k4977J6889L1632N580K1161j744j3442
$$ 103769 62045 24503 21288 30271 27612 2635 19524 51156 56736 77897 76153 62711
11188F2711k0049m79M3815r515k0279j8823n220K5015J7143K9612l250j1410q956
$$ 62711 42662 42183 85998 76483 56204 37381 32161 57176 74319 103931 100681 89271 80315
11175H0315J4272k5312m4656N997M13R484N112O59l0334j4471L4229K9274n5241
$$ 80315 94587 69275 24619 30616 31029 40513 45625 46284 15950 1479 35708 64982 9741
11162I741m546K3065K5929J5378J2661J638l9057l2429K0442J3135k5333j3984
$$ 9741 5195 28260 54189 69567 82228 83866 44809 12380 32822 45957 20624 6640
11150F640O0717J3520k4064N03n254j0412J8116J0655r140j1061J499o338k4671
$$ 6640 67357 80877 56813 57316 52062 41650 59766 70421 61281 50220 51719 45381 20710
11137B0710m4201J496N402P919L4519J4976m609J1285L0192Q95K0987R22J8356
$$ 20710 -23491 -21995 -16593 -8674 25845 40821 36212 47497 77689 78584 99571 100493 118849
11124A18849J2444l5014o4398l4967K8807J5711j6366j2471j5297M0424M666k7749
$$ 118849 131293 96279 31881 -3086 25721 41432 25066 12595 -2702 37722 42388 14639
11112A4639K2968j4230m8835J8185k331J048L0728J5491J8623K1458o920J172
$$ 14639 37607 23377 -25458 -7273 -9604 -8556 22172 37663 56286 77744 70824 71996
11100G1996j9038k0736j635J4275L4477m119l0574j9214K2194R842l8020k1034
$$ 71996 52958 32222 30587 44862 79339 75220 44646 25432 47626 57468 19448 -1586
11088a586J6527K4631J0455O03j0175j4568R393L9387m3557n1311J2041L0149
$$ -1586 14941 39572 50027 50630 40455 25887 35280 74667 31110 -20201 -8160 21989
11076B1989J6048J4226J6121j0533j0944k3074j6886l0362O292K8338L689p934
$$ 21989 38037 52263 68384 57851 46907 23833 6947 -23415 -17123 11215 14904 6970
11064F970l966j036j8700m134L0109N5738n095l7135k500k7196k5543m908K0289
$$ 6970 3004 1968 -16732 -20866 9243 64981 59886 22751 20251 -6945 -32488 -37396 -17107
11051a7107J8988M3688L157j0210M2950L9695N7377L8260k1310k6700N593j1896
$$ -17107 1881 45569 48726 38516 81466 121161 178538 216798 195488 168788 174381 162485
11039A62485r41J4990L4645k99N9808O8436J7233k6540n257j9275j9133n9656
$$ 162485 161544 176534 211179 210880 270688 339124 356357 329817 324560 305285 286152 226496
11027B26496o419N6492L3436L1302P6395P1538M1556n7971m5087r4281m1188k670
$$ 226496 220077 276569 310005 341307 417702 489240 530796 472825 427738 333457 292269 289599
11015B89599k9328k3154J1211J9807K5225N1437M9012R414n8681l7704l1015q0756
$$ 289599 260271 237117 248328 268135 293360 344797 393809 403223 344542 306838 275823 195067
11003A95067j9386Q893o100m920L1838j3679j7778N14k7248k7087k5925o203L215
$$ 195067 175681 184574 178474 173554 205392 191713 173935 174449 147201 120114 94189 87986 91201
10990I1201L2409J7099k8994q4957k3538l6334l0517L4933K6722J0951K6062j0388
$$ 91201 123610 140709 111715 26758 3220 -33114 -63631 -28698 -1976 8975 35037 24649
10978B4649j7736K4221j817k0696o543j9693J5654J6963K1366R089q42J6920L71
$$ 24649 6913 31134 29317 8621 2078 -17615 -1961 15002 36368 45457 44615 61535 61906
10965F1906J1913j4965l1733l2767k5738k4276N3481L7811K6913L973K0324m1697
$$ 61906 73819 58854 27121 -5646 -31384 -55660 -2179 35632 62545 66518 86842 45145
10953D5145m4663J7606J883k5972Q526j698L2441J4047O188J9802j6580l1769
$$ 45145 482 18088 19971 -6001 2525 827 33268 47315 53503 73305 56725 24956
10941B4956k2047K0905J9423j0721k4710P645K0480L38j0226o498k3733k5770
$$ 24956 2909 23814 43237 32516 7806 15451 35931 36269 26043 19545 -4188 -29958
10929b9958J8491L2208O011O546l0413J0597k5550J9220J2618K382l906L524L0728
$$ -29958 -11467 20741 26752 33298 2885 13482 -12068 7152 19770 22152 18246 21770 52498
10916E2498M287k1016j527K7317k1699K1715n691j5283Q89O501M908k144K017
$$ 52498 56785 35769 34242 61559 39860 61575 55884 40601 41490 47991 52899 50755 52772
10903E2772l3857k797k114q948P860l3470m4652r213M3139L3480q842j0786k4616
$$ 52772 18915 16118 14004 5056 12916 -20554 -65206 -74419 -31280 2200 -6642 -17428 -42044
10890d2044J6350R528O51k95L4633r855q839K8089m724J1872j7213l2551M687
$$ -42044 -25694 -16166 -15515 -15810 18823 8968 129 28218 23494 35366 18153 -14398 -9711
10877i711j0231L2335j991J3932j1995J1880J4654m036O59M2865P001J8487R48
$$ -9711 -19942 12393 10402 24334 12339 24219 38873 34837 35496 78361 85362 103849 104797
10864A04797k1276l729K1023J3600m1634l7654J3629K5907O260j7755n663M890
$$ 104797 83521 79792 100815 114415 72781 35127 48756 74663 80923 63168 57505 62395
10852F2395j3013K667L2349l516l4946O490o697n329p523j9261n142J101J5682
$$ 62395 49382 52049 84398 80882 45936 52426 45729 40400 32877 13616 8474 9575 25257
10839B5257n4512R062K0021K0153j210R906K2019J2497J0270l0249n9735K7430
$$ 25257 -29255 -20193 -172 19981 18771 28677 50696 63193 73463 43214 -16521 10909
10827A0909L0311q276l0866n617j9425j0578j833K9054k5301L5668N2217r954
$$ 10909 41220 32944 2078 -3539 -22964 -33542 -35375 -6321 -31622 4046 56263 46309
10815D6309k3558k5505j6744J3686J2859K4236k3742k4698M588K3432K7258n979
$$ 46309 22751 -2754 -19498 -5812 7047 31283 7541 -17157 -12569 10863 38121 32142
10803C2142J250R165k3275o949M656N352k5705j0894L1229K7481J4345k251k2562
$$ 32142 33392 42557 19282 12333 16989 22341 -3364 -14258 16971 44452 58797 56546 33984
10790C3984j3859K9498k8761l5147K2269M3495j0672r270m400Q511K213Q989l0878
$$ 33984 20125 49623 20862 -14285 7984 51479 40807 31537 27137 35648 37861 46850 15972
10777A5972k299J5758l5459m0911N029O932k6374o748J1419M8178L865j8972J5374
$$ 15972 13673 29431 -6028 -46939 -41910 -34978 -61352 -68100 -56681 -8503 -4638 -23610 -8236
10764h236K0852k955j4809l4803j1363O7829K5661l2951M294q109k5897n108m7509
$$ -8236 12616 9661 -5148 -39951 -51314 16515 42176 9225 13519 5410 -20487 -25595 -73104
10751g3104n753R147M7037K1127j7997k5101j6390N0258L5442j7121l4053l4405
$$ -73104 -78857 -69710 -22673 -1546 -19543 -44644 -61034 -10776 24666 7545 -26508 -60913
10739f0913M0214K3146K1678L2298k9137Q715J2941j6227m8773p136J121k06R389
$$ -60913 -20699 2447 24125 56423 27286 36001 48942 32715 -16058 -23194 -22073 -22279 -12890
10726a2890L3520o313r660L0474K9146r683l0130K5415J7209n444o528j3304L3430
$$ -12890 20630 14317 4657 35131 64277 54594 24464 49879 67088 61644 55116 41812 75242
10713G5242r805m0056j3516p804O8581L4859l3798q61J1427l8878k5658J6320
$$ 75242 65437 25381 11865 4061 72642 107501 73703 72842 84269 45391 19733 36053
10701C6053J3369L972l5472l849J759j1179J2726K9877m681k9114l489K4405k7369
$$ 36053 49422 53394 17922 14073 15832 4653 17379 47256 42575 13461 9972 34377 7008
10688G008n536P080r489j8156R973M4526j651P665L6688K1767m4839j7296J2224
$$ 7008 1472 8552 -937 -19093 -9120 35406 33755 41420 78108 99875 55036 37740 49964
10675D9964j1059j489r616N963Q291Q018J4737J1327K0995j7401m42K064j4451
$$ 49964 38905 37416 27800 33763 42054 50072 64809 76136 97131 79730 79288 81352 66901
10662F6901K9364J6856j7002J1907J0528K7343N4078L4483J3471J6490L1648M3959
$$ 66901 96265 113121 96119 108026 118554 145897 199975 234458 247929 264419 296067 340026
10650C40026P645L499K0638j8658N64j7354L1653M8749P2345L0785P587m477M2282
$$ 340026 347671 351170 371808 353150 353714 336360 368013 416762 489107 519892 527479 523002 565284
10637E65284Q7158J04019J22436J46675J86758K27268K19199J54805J27921J29191
$$ 565284 652442 756461 878897 1025572 1212330 1439598 1658797 1813602 1941523 2070714
10627B070714K00164K60760L51597M96645O30007Q82484J225069J731576K262883
$$ 2070714 2270878 2531638 2883235 3379880 4009887 4892371 6117440 7849016 10111899
10618A0111899K960373L732102M143390L746309K388097O01596p84016j277966
$$ 10111899 13072272 16804374 20947764 24694073 27082170 27683766 26899750 25621784
10610B5621784q50102J73692J570439L335331N393114P359278Q383794P114429
$$ 25621784 24771682 24945374 26515813 29851144 35244258 42603536 50987330 58101759
10602E8101759L240908j284951m439833n275987l997373j675930J061357L918414
$$ 58101759 61342667 60057716 55617883 50341896 46344523 44668593 45729950 49648364
10594D9648364O950410R562864J0442018P719081J570756n010564r249206r966525
$$ 49648364 56598774 66161638 76603656 84322737 85893493 80882929 71633723 61667198
10586F1667198q049639n174016k241774N14434L051945M985686N310591L028458
$$ 61667198 53617559 48443543 46201769 46716203 49768148 54753834 60064425 63092883
10578F3092883j280808n489620p846408p917405o315902m217662k292629p50483
$$ 63092883 61812075 56322455 48476047 40558642 34242740 30025078 27732449 26981966
10570B6981966M59018J204978J082740L1144j665449l186749m022636m036917
$$ 26981966 27440984 28645962 29728702 29759846 28094397 24907648 20885012 16848095
10562A6848095l401279k613991j958858j457873j083822q50657o53624n28166
$$ 16848095 13446816 10832825 8873967 7416094 6332272 5481615 4827991 4299825
10554D299825l79530l55350l09128k40569k02394k28481j97804j70063j42203
$$ 4299825 3920295 3564945 3255817 3015248 2812854 2584373 2386569 2216506 2074303
10545B074303j21799j45464j32418p6914q9706q4592o7020p7460o2751q5073n7783
$$ 2074303 1952504 1807040 1674622 1597708 1508002 1423410 1356390 1278930 1216179 1131106 1073323
10534A073323j8914n0221p2742j2016K4163m3579j3238L2562K8940K7434j0636
$$ 1073323 1054409 1004188 931446 919430 943593 900014 886776 919338 948278 975712 965076
10523I65076M2976J12373J51690J72286K26291K87748K99197L09728K18570M0477
$$ 965076 1008052 1120425 1272115 1444401 1670692 1958440 2257637 2567365 2785935 2826412
10513B826412r2548j98022k50772k95031k99670k55266k55171k12612j24491q9968
$$ 2826412 2733864 2535842 2285070 1990039 1690369 1435103 1179932 967320 842829 752861
10503G52861l1013n621j0673l628p8468o7621k3174m3966l5005o7240n162M2083
$$ 752861 721848 716227 705554 701926 623458 555837 532663 488697 453692 386452 381290 423373
10491D23373o1372j2703L7279l3474K257J6216n0935j0011K8980M3364k0060p455
$$ 423373 362001 349298 386577 353103 355360 371576 320641 310630 339610 382974 362914 355459
10479C55459K0984O571k1865m6289k5367j8513N14J381J8547j7974j6056l5234
$$ 355459 376443 383014 361149 314860 289493 270980 271494 272875 291422 273448 257392 222158
10467B22158j3703k0652L8925J8206P22l1790r43j4128n330K2045J1499k0140
$$ 222158 208455 187803 226728 244934 245656 213866 212923 198795 193465 215510 227009 206869
10455B06869k9928L041j6035l0432K8004L0689O781J6307m454j3881j4118r605
$$ 206869 176941 179982 163947 133515 161519 192208 198989 215296 210842 196961 182843 173238
10443A73238L5011o004j5973m932N100p929k8986p79J3262K1557O560o903R584
$$ 173238 208249 202245 186272 181340 186440 178511 149525 148746 162008 183565 190125 183222 192806
10430A92806n4242j7815L942J9430m7153j5966J3894j4189n377J0757k8779o549
$$ 192806 138564 120749 124691 144121 96968 81002 94896 80707 75330 86087 57308 50759
10418E0759J2134j5210K9227J4528J9802k2835r29J8420l223j6322l0517j2208
$$ 50759 62893 47683 76910 91438 111240 88405 87476 105896 102673 86351 55834 43626
10406D3626R590j2351j2715l825M1057J7188N857K1873J4472J2993K3731n162
$$ 43626 53216 40865 28150 24325 65382 82570 88427 110300 124772 137765 161496 156334
10394A56334j8878j2828j3267J2474k951j3818k0668R316j749l30n4P828K925
$$ 156334 137456 124628 111361 123835 120884 107066 86398 95714 93965 93635 93581 101409 104334
10381A04334k0261L7482J5006l4138k8716l8961k040L2093L9617K9941j2050L9489
$$ 104334 84073 121555 136561 102423 73707 34746 32706 64799 104416 134357 122307 161796
10369A61796K9605q266L8341M6551O3966P6654M2247K1776r24l6483n8057l4367
$$ 161796 191401 183135 221476 268027 331993 408647 450894 472670 471746 435263 377206 342839
10357C42839n1944n1881o258K2387l146m9012p1605R30k5456n4291J7213M9663
$$ 342839 290895 239014 232756 255143 251997 202985 131380 132310 106854 52563 69776 119439
10345A19439j8254n5311J5876K2593K1749J3547K3304Q198k8599K1810P268l7099
$$ 119439 101185 45874 61750 84343 106092 119639 142943 151141 122542 144352 151620 114521
10333A14521J9239J2395j5290j9602o865N129P03j3811K2182K2696J3175k8654
$$ 114521 133760 146155 130865 111263 104398 109527 110230 96419 118601 141297 154472 125818
10321A25818n5736l2127k3302K4591J3567p251J0264K4618j3857J0582J2204K0862
$$ 125818 70082 37955 14653 39244 52811 45560 55824 80442 66585 77167 89371 110233
10309A10233j244K7013J1051j1750k3900l597J3261j5919q339L149K0872k6583
$$ 110233 108989 136002 147053 135303 111403 107806 121067 105148 96809 99958 120830 94247
10297I4247m099j3202K4673K2766o055l307l2394K4266n943J6473J9254K914m2581
$$ 94247 90148 76946 101619 124385 118330 115023 82629 106895 100952 117425 136679 139593 97012
10284I7012J3519L7416O623J5659K9674j4026j9697N591Q289j5849n159l9229
$$ 97012 110531 147947 154570 170229 199903 185877 166180 171771 180060 164211 159052 119823
10272A19823K619K0772J2245m673j0167O151k7920j6529J49p446n6576m948L4940
$$ 119823 122442 143214 155459 150786 140619 146770 118850 102321 102470 95024 38448 33500 68440
10259F8440L9077L9583J9456j2616O022J9885J4655n125J4634L5806L8975N434
$$ 68440 107517 147100 166556 153940 159962 179847 194502 189377 204011 239817 278792 284226
10247B84226K7222k159K8058M0851J9681K6769L6754N9081M804o2m6349m2695
$$ 284226 311448 309289 337347 378198 397879 424648 461402 520483 525287 525225 478876 436181
10235D36181p7821o8936j3788K2890j8296o254j543j7073J3453Q035k4201J6932
$$ 436181 358360 289424 275636 298526 280230 273976 272433 255360 268813 276848 252647 269579
10223B69579L3760K8529M250p894K1527J8498j6090j9327j4539M692m874K1406
$$ 269579 303339 331868 336118 328224 349751 368249 352159 332832 318293 322985 318111 339517
10211C39517n489k1516n420L2627q045j0752q904J6625K9561M9649M6977j714
$$ 339517 334028 312512 307092 339719 331674 320922 312018 328643 358204 407853 454830 453116
10199D53116k297j9126m3927k1565K6511N2716M4868K8643K8942J0001J6020J6586
$$ 453116 450819 431693 387766 366201 392712 445428 490296 518939 547881 557882 573902 590488
10187E90488M5362N0622M0751L0120j731K6369O8427K1490R3847O1455L6202M9426
$$ 590488 635850 686472 727223 757343 755612 781981 850408 871898 965745 1027200 1063402 1112828
10175A112828K7116K9302O0744J2743L2133P2615R5756R6610P5865O0518P1116
$$ 1112828 1139944 1169246 1229990 1242733 1274866 1347481 1443237 1539847 1615712 1676230 1747346
10164A747346Q4121Q1010L1106K9685O0287J15536J24369J59394J64668K12446
$$ 1747346 1831467 1912477 1943583 1973268 2033555 2149091 2273460 2432854 2597522 2809968
10154B809968K23212J49212J19751J31354J15630J24937J71648J53438J58105
$$ 2809968 3033180 3182392 3302143 3433497 3549127 3674064 3845712 3999150 4157255
10145D157255J98454K04733K74589L20024L12780K93747L91116M77562N72526
$$ 4157255 4355709 4560442 4835031 5155055 5467835 5761582 6152698 6630260 7202786
10136G202786P00320Q41597R81066J142341J245206J261289J266489J332582J421194
$$ 7202786 7903106 8744703 9725769 10868110 12113316 13374605 14641094 15973676 17394870
10127A7394870J608135K025958K522431L209388M049249N068772O396472Q184970
$$ 17394870 19003005 21028963 23551394 26760782 30810031 35878803 42275275 50460245
10119E0460245J0629158J4105161J9023151K6107611L5707977M7632991O0105390
$$ 50460245 61089403 75194564 94217715 120325326 156033303 203666294 263771684
10112B63771684O8723845O6480337M8882999K1019567j2415763m3413389o1584063
$$ 263771684 332495529 398975866 447858865 468878432 456462669 413049280 351465217
10105C51465217o6470226o0191145m8373347l6704288k7268158k0242898j5309824
$$ 351465217 284994991 224803846 176430499 139726211 112458053 92215155 76905331
10098G6905331j1869269r426322p591865o122677m939539l984049l212931k624436
$$ 76905331 65036062 55609740 48017875 41895198 36955659 32971610 29758679 27134243
10090B7134243k120264j721406j470782j306306j246185j267691j294790j251490
$$ 27134243 25013979 23292573 21821791 20515485 19269300 18001609 16706819 15455329
10082A5455329j082965q97393p48449o70490n77818n48249m95040m90962m98694
$$ 15455329 14372364 13474971 12726522 12056032 11478214 10929965 10434925 9943963 9445269
10073I445269m48007m39642m58120n20755m89455m52257m11154l57716l65373
$$ 9445269 8997262 8557620 8099500 7578745 7089290 6637033 6225879 5868163 5502790
10064E502790k92818k88899k94756k66774j99606j84896j72301j93874j73160
$$ 5502790 5209972 4921073 4626317 4359543 4159937 3975041 3802740 3608866 3435706
10055C435706j47506j01560j17880j24741q9455j23894j25639j07947r6665n6888
$$ 3435706 3288200 3186640 3068760 2944019 2854564 2730670 2605031 2497084 2400419 2343531
10045B343531l6990n4275q0879j11042j12280o6118n3812m9142n5487n5592k9695
$$ 2343531 2306541 2252266 2171387 2060345 1948065 1881947 1828135 1778993 1723506 1667914 1638219
10034A638219n2213n5187n1444n2734k3927J231L2573k0571l1065k7438q630k1798
$$ 1638219 1586006 1530819 1479375 1426641 1402714 1403945 1436518 1415947 1384882 1357444 1348814 1327016
10022A327016p5413m1777j1683j8765l8978k380j9982l3090o224l2753m1740J4966
$$ 1327016 1251603 1209826 1198143 1179378 1140400 1138020 1118038 1084948 1078724 1045971 1004231 1019197
10010A019197j0321l1359n2856K3422o410j3794q11k3025j0931M543j1642l8288
$$ 1019197 1008876 977517 924661 948083 941673 927879 927068 904043 893112 897655 886013 847725
9998H47725l0315K1361j654R653K7165k5554o697L2605K7429L1834J9386P704
$$ 847725 817410 838771 837117 846770 873935 848381 841684 874289 901718 933552 952938 960642
9986I60642j2980l5667R124P214m6310o5144q8588m4104n2693n2730r473j4624
$$ 960642 947662 911995 921119 928333 882023 816879 728291 684187 631494 578764 569291 554667
9974E54667k8408K041P069j7934m384l5077k0806M398q437N2420R869k3276K2515
$$ 554667 526259 528300 535369 517435 513051 477974 457168 461566 453129 505549 515418 492142 514657
9961E14657J8412r377K6745N5362M1824l4377k1698K3359j7248l7347k0373o588
$$ 514657 533069 523692 550437 605799 647623 613246 591548 614907 597659 560312 539939 533351
9949E33351j2022j7882o0913m4741j8999j6763J4528K09k3056J9019L5813M585
$$ 533351 521329 503447 442534 397793 378794 362031 376559 376768 353712 372731 408544 413129
9937D13129O8732K7495J5672K0776p571L5124N2244N0983K9309O914n106l0301
$$ 413129 481861 509356 525028 545804 538233 573357 625601 676584 705893 712807 707701 677400
9925F77400N179K7091l1723m179m3660l4992p6684l0505J386n0149m1563j8107
$$ 677400 682579 709670 677947 673768 630108 595116 518432 487927 489313 439164 397601 379494
9913C79494j6777J4561l0550n863L1976n4445j5724K5161K8642J5412J179Q485
$$ 379494 362717 377278 346728 340865 372841 318396 302672 327833 356475 371887 373066 381551
9901C81551J4145J2841k6046r720K0322p562l2092m1960k5533q903j6260K6133
$$ 381551 395696 408537 382491 372771 393093 385531 353439 311479 285946 277043 260783 286916
9889B86916K321k106j8979o945K8597M682K3865j2154n056o523l7379n755k0930
$$ 286916 289237 287131 268152 261207 289804 294486 318351 306197 301141 294618 257239 251484 230554
9876B30554J9054M930l3584k440J5599K670O785j702J7143J9770R104J0016K3421
$$ 230554 249608 254538 220954 218514 234113 236783 243568 241866 259009 278779 287883 297899 321320
9863C21320p629m1867j8871k619k4236R182J8764j084Q411o462j2762l1283l1347
$$ 321320 313691 271824 252953 250334 226098 235280 254044 252960 261371 254909 242147 210864 179517
9850A79517J8271M0950J8994K5057J1040j981Q368J4890J443J3912j3604J6153
$$ 179517 197788 238738 257732 282789 293829 291848 300216 315106 316549 330461 316857 333010
9838C33010K3917l1859O893j7713k619j3653k9479r923M003j7244j1012j5922
$$ 333010 356927 325068 331961 314248 311629 297976 268497 258574 262577 245333 234321 218399
9826B18399L0692J2217k2501R083J8386j3019L178K4140L9516J7427L8562L3770
$$ 218399 249091 261308 238807 247890 266276 253257 256435 280575 320091 337518 376080 409850
9814D09850k6122o14J0900M0006L7253l293L2419N7542R14r13J8692j7803l157
$$ 409850 383728 383114 394014 434020 471273 467980 500399 557941 558855 557942 576634 558831 555674
9801E55674k3972l3049o504K7001p359m9051n454j1212k6661r400Q542j0457j3603
$$ 555674 531702 498653 492149 519150 511791 462740 457286 446074 419413 410013 418555 408098 394495
9788C94495M0850O0566j16j0290k7704N138P456j1792J5090l259L8498J8915m9668
$$ 394495 435345 495911 495795 485505 457801 462939 470395 458603 473693 470434 508932 527847 478179
9775D78179J4170L4717J9990P932j2002l5227j5569J8345K6403N1659N8391K8569
$$ 478179 492349 527066 547056 554988 542986 507759 492190 510535 536938 588597 646988 675557
9763F75557j2477n2764m3638J4509O0502L0765k5056J5228K9207M3303M7465q539
$$ 675557 663080 610316 566678 581187 641689 672454 647398 662626 691833 735136 782601 774062
9751G74062J8256K6331J5009N8348M2331L9997N4425O4241j241L712L9603M7193
$$ 774062 792318 818649 833658 892006 934337 974334 1028759 1093000 1091759 1095471 1135074 1182267
9739A182267M810J1247N4246L5498K1515P3935P2823R2934Q9777O8207O9289P4778
$$ 1182267 1187077 1198324 1252570 1288068 1309583 1383518 1456341 1549275 1639052 1707259 1776548 1851326
9727A851326J15593J13255M2751R1044J49873J15354J25493J33050J28607J49546
$$ 1851326 1966919 2080174 2122925 2213969 2363842 2479196 2604689 2737739 2866346 3015892
9717C015892J26815J69154J67686J22425J80926K31167K48550K91022L29123L69625
$$ 3015892 3142707 3311861 3479547 3601972 3782898 4014065 4262615 4553637 4882760 5252385
9707E252385M04320M95302O03975P00535P85616R35548J091621J141502J090347
$$ 5252385 5656705 6152007 6755982 7456517 8242133 9177681 10269302 11410804 12501151
9698A2501151J100650J077756J087980J177795J317894J628623K004887K481830
$$ 12501151 13601801 14679557 15767537 16945332 18263226 19891849 21896736 24378566
9690B4378566L011973L656914M432964N630509P351722R609090J2795126J7050194
$$ 24378566 27390539 31047453 35480417 41110926 48462648 58071738 70866864 87917058
9682H7917058K2340494K8513353L4448954L8189045L7017257L0247513K2215907
$$ 87917058 110257552 138770905 173219859 211408904 248426161 278673674 300889581
9675C00889581J2785565N799965K267983l88343n324998j2545516k1342051l0976269
$$ 300889581 313675146 319475111 321743094 321354751 316029753 303484237 282142186 251165917
9667B51165917l6100383l7001717l3276966k7295084k1347447j6381905j2548171
$$ 251165917 215065534 178063817 144786851 117491767 96144320 79762415 67214244
9660F7214244r687716p566573o024211m869852l985833l384756k947733k554774
$$ 67214244 57526528 49959955 43935744 39065892 35080059 31695303 28747570 26192796
9652B6192796k213418j939919j663874j504934j391040j233287j191444j145785
$$ 26192796 23979378 22039459 20375585 18870651 17479611 16246324 15054880 13909095
9644A3909095j048505r18363p98005p52631o48113n66134m95899m75374m74871
$$ 13909095 12860590 11942227 11144222 10391591 9743478 9177344 8681445 8206071 7731200
9635G731200m14197l91732l76703l24541k92315k84625k58836k37713k28611k33859
$$ 7731200 7317003 6925271 6548568 6224027 5931712 5647087 5388251 5150538 4921927 4688068
9625D688068j81578j37395k02099k02823j62558j61888j69883j47972q8401j20102
$$ 4688068 4506490 4369095 4166996 3964173 3801615 3639727 3469844 3321872 3233471 3113369
9615C113369j17107j04415j07560r2238q8748j00908q7412q7497p0065l2684n0431
$$ 3113369 2996262 2891847 2784287 2692049 2603301 2502393 2414981 2327484 2257419 2224735 2174304
9604B174304p9009l1619l4595m6142k8398n6052q3994n2683n4917n4028l8348
$$ 2174304 2095295 2063676 2029081 1982939 1954541 1898489 1814495 1761812 1706895 1652867 1614519
9593A614519k2571l8742m2157k6246K889j6928l9111j3210j5420k448M656K6681
$$ 1614519 1591948 1553206 1511049 1484803 1487692 1470764 1431653 1418443 1403023 1400575 1405231 1431912
9581A431912m1008j8542k7263j8967l1738p0993q9971l9468j4427j3324n9194
$$ 1431912 1390904 1372362 1345099 1326132 1294394 1223401 1133430 1093962 1079535 1066211 1007017
9570A007017j2826K6155K6419q606n0099j2178l592J9556j6084k6657j7223k8300
$$ 1007017 994191 1020346 1046765 1038159 988060 975882 972290 991846 975762 949105 931882 903582
9558I03582j9323L4400L3374N149N3826J9636P932k4662j0248k0332m7582n0245
$$ 903582 884259 918659 952033 957182 1011008 1030644 1038576 1013914 1003666 983334 935752 885507
9546H85507o3263J4065J2248l7089n4488q4219m7970K7833n902n0363J4899L875
$$ 885507 822244 836309 848557 811468 756980 672761 624791 652624 646722 596359 611258 615133
9534F15133R874K3898n057j0886L399J0670J317L0427j8698k7767J0749k7741
$$ 615133 625007 648905 643848 632962 636361 647031 648348 678775 660077 632310 643059 615318
9522F15318r302J9645J9796j8256m5039O530k5867n5210M293k814k5070j0660
$$ 615318 606016 625661 645457 627201 582162 588692 562825 507615 511908 509094 484024 473364
9510D73364k9820l3781j2069o514L1479P371j2517q527J1557J1973k4298j6497
$$ 473364 443544 409763 397694 391180 422659 430030 417513 408986 420543 432516 408218 391721
9498C91721k0912K8620j3993o350j2519K3397L3020j1580k9036j9486L1997J5322
$$ 391721 370809 399429 385436 379086 366567 389964 422984 411404 382368 362882 394879 410201
9486D10201j5486k2783K2094K0125k5280J2981j7490r820k0577j2455J5488l0334
$$ 410201 394715 371932 394026 414151 388871 401852 384362 374542 353965 341510 356998 326664
9474C26664l1056K0783M6395K7820m413l0812K0980q318J2832o795n229k2894
$$ 326664 295608 316391 362786 390606 386193 355381 376361 368043 380875 374080 368851 345957
9462C45957k8868m2741k0243j1662K4946J7573r392k2002j7561J4428J9478J3191
$$ 345957 317089 274348 254105 242443 267389 284962 275570 253568 236007 250435 269913 283104
9450B83104J4940m31m5358j0176K2227J8983q692J3192J0080Q527p922P744j4851
$$ 283104 298044 297613 252255 242079 264306 283289 274597 287789 297869 306396 298474 306218 291367
9437B91367N65R318K4498J3543m3027m582P233k502m091J1166j0484j4389r630
$$ 291367 291932 301250 325748 339291 296264 291682 298915 296413 292322 303488 293004 278615 268985
9424B68985K1830j3836l0989J2491k0305k2682l577L6510K921k0433k5631K51
$$ 268985 290815 276979 245990 258481 238176 215494 211917 248427 251348 230915 205284 205535
9412B05535J1703j1542j2534j322M730Q60l994J1051l2711L1344m263j6845L5211
$$ 205535 217238 205696 193162 191840 196570 197430 193436 204487 171776 203120 198857 182012 217223
9399B17223L4252l448l4335l0924J3889N860r305K2300N245m177l192k1556p541
$$ 217223 251475 248027 213692 182768 196657 202517 193212 215512 220757 216580 213388 191832 184291
9386A84291k1531N713k662J4466j0770L8393M281Q726J4642o882j9874M25P821
$$ 184291 162760 168473 165811 180277 169507 207900 212181 220907 235549 228667 208793 209218 217039
9373B17039j4016p532q505r031K0034k1869l1472j2978J7428J8662J3123J614
$$ 217039 203023 195491 186986 177955 197989 176120 144648 131670 149098 167760 180883 182497
9361A82497k2613o679Q289j6928J6589K980j9574j5005j8771j7029K299J1227
$$ 182497 159884 153205 161494 144566 161155 164135 144561 129556 110785 93756 96055 107282
9349A07282q910K6924O612K1063m573m555k1747j881J2064j0037l346r4L2169
$$ 107282 98372 125296 131908 152971 148398 143843 122096 120215 132279 122242 118896 118802 150971
9336A50971j13k5090k0617K1274K8595J279r833J5251j804k9386j7831J4472L2162
$$ 150971 150858 125768 105151 126425 155020 156299 146466 161717 159913 130527 112696 127168 159330
9323A59330J2380j4482J1281k2923l0512k448J4524R6J8282M461J6846n9015q245
$$ 159330 171710 157228 168509 145586 115074 112626 127150 127246 145528 149989 166835 107820 99575
9310I9575L5688M8981Q1p4817l7890q968O7080N7207k6607P970m215j2256l0854
$$ 99575 135263 184244 184325 109508 71618 62650 129730 186937 160330 168300 164085 151829 120975
9297A20975j041M5058R040l0398n1L3095J0688K5576J6418L1780K7775K4203r433
$$ 120975 119934 164992 174032 143634 143583 176678 187366 212942 229360 261140 288915 313118 303685
9284C03685K7008p591m536O368k395J9554L7066J11556J06925R9257R1051J56731
$$ 303685 330693 323102 318566 324934 322539 342093 379159 490715 597640 696897 787948 944679
9272I44679K03749J94058J79101J39174N5656L5106L7572J3515n238q5764r4268
$$ 944679 1148428 1342486 1521587 1660761 1716417 1751523 1789095 1802610 1797372 1711608 1617340
9261A617340j14843j19117j70029k06812j62366j14432j47008r6880o3279n8551
$$ 1617340 1502497 1383380 1213351 1006539 844173 729741 582733 485853 422574 364023
9251C64023l7909r958l9746k343n839n156m0176q703K5184N9487N601n3311j2928
$$ 364023 326114 316156 276410 274067 268228 263072 222896 214193 239377 298864 304465 251154 238226
9238B38226L1660J6896m7944k7067j3622j2030q949l3180L2307J0981n4081m1368
$$ 238226 269886 286782 238838 211771 198149 186119 177170 143990 176297 187278 133197 91829
9226I1829j4339K1641J7557p066j2498j9706l6853J6567M8586J344j7406K1263
$$ 91829 77490 99131 116688 109622 97124 77418 40565 57132 105718 107062 89656 110919
9214A10919k0034m7282l3372K6248O6360L4224Q18j3296l2903n956j6293j003
$$ 110919 90885 43603 10231 36479 102839 137063 137881 124585 91682 85726 69433 68430
9202F8430K7069J70l6354J7635J2387n582k1089K493J4604R783j2683j5371j9767
$$ 68430 95499 95669 59315 76950 89337 83755 62666 65159 79763 89546 76863 61492 41725
9189D1725j185P594K7939K2106M737o280p542J0014m796J4631M097l2953l1817
$$ 41725 40540 48134 76073 98179 102916 96636 89094 99108 94312 108943 113040 80087 48270
9176D8270j9996O3356M1886j3546k601j2998J062K0324j6757k2029O492j2849
$$ 48270 28274 91630 133516 119970 117369 104371 105433 125757 109000 86971 93463 80614
9164H0614m9840n036M5459L6659m982l1226k6763j3708L1589K2759K7158O143
$$ 80614 30774 25738 71197 107856 102874 71648 44885 31177 62766 85525 112683 118826
9152A18826k775J2474k0334l3k4816k1641J7140J547k5550l869P59j4930j893
$$ 118826 116051 128525 108191 108158 83342 61701 78841 80388 54838 50969 51728 36798 34905
9139C4905N575j8519j7074J8066j1697O153R307L3364J5069K2033L6513J8882
$$ 34905 40480 21961 4887 22953 11256 17409 26716 60080 75149 97182 133695 152577
9127A52577l8940l6161j1425n030L8580r360k5757k54M281J2051k3468j6721K5826
$$ 152577 113637 77476 66051 61021 99601 90241 64484 64230 68511 80562 57094 40373 66199
9114F6199L8018j2924l7821r224N359p070j3531K5756J06m160J4768P12L111o21
$$ 66199 104217 91293 53472 44248 49607 42537 29006 54762 54868 50708 65476 66188 69299 68678
9100F8678R787J2212O604j6580J9144m046j0816K8613K3428m0501j5895P207K330
$$ 68678 78465 90677 97281 80701 99845 95799 84983 113596 137024 96523 80628 87835 90165
9087I0165k5966j4025R480l457K1128J5044l7344j615K2408P327p624M336j5613
$$ 90165 64199 50174 59654 56197 77325 92369 55025 53410 75818 83145 75521 79857 64244
9074F4244N765K0254J5477l5244M571Q060O302j7330M735o231J1511r465j0117
$$ 64244 70009 90263 105740 70496 75067 83127 89429 72099 76834 70603 82114 72649 62532
9061F2532j1008O653K0918j498J3279j2789r852K0194L3690j185k3551j8142j9522
$$ 62532 51524 58177 79095 77597 90876 78087 68235 88429 122119 120934 97383 79241 59719
9048E9719Q669M159l007K7685J8172k4309k5520l0225K4642M4278N536m4247l4696
$$ 59719 68388 72547 69540 97225 115397 91088 65568 35343 59985 104263 109799 65552 30856
9035C0856K1081J9244J13K0307k2474j7030Q445J9035j2027j5829N072k1099j3492
$$ 30856 51937 71181 71294 91601 69127 52097 60542 79577 67550 51721 56793 35694 22202
9022B2202L8061J1649J563l2741j9635N8188L5590n9590p580m662j5609K8807
$$ 22202 60263 71912 73475 40734 21099 79287 114877 55287 47707 43045 27436 56243
9010E6243N891K6214K2304j4570o875O788k8305r198p209R994k0670M1691K6297
$$ 56243 62134 88348 110652 96082 89207 95995 67690 58492 51283 61277 40607 82298 108595
8997A08595k1818n112n71k8759k9174p728J3980L6579L1380K4829k4139n1412
$$ 108595 86777 81665 81094 52335 23161 15433 29413 65992 97372 122201 98062 46650
8985D6650P055R362Q598J6059J078K4602K1704n4962m2430K4758M4516j9891j5927
$$ 46650 53705 63067 71665 87724 88802 113404 135108 80146 37716 62474 106990 87099 71172
8972G1172m500J1384k7000J481J4669N696j3601R851k1021j6639J1155j1061k3423
$$ 71172 66672 78056 51056 52537 67206 72902 59301 69152 48131 31492 42647 31586 8163
8959H163K391L5963K0026M1013J5663j5062m1630K0411j194k5765l600J7733l8524
$$ 8163 10554 46517 66543 107556 123219 108157 66527 86938 85744 59979 56379 74112 35588
8946C5588L302j317K8697P515l7222L79p641o5908J6283K7516J3364L3449K9691
$$ 35588 38890 37573 66270 73785 36563 36942 29301 -36607 -20324 7192 20556 54005 83696
8933H3696k3413k4r09l657k2303j6993M2359Q914J4645r417n292j4042j0566j0788
$$ 83696 60283 60259 59350 55693 33390 16397 58756 67670 82315 72898 67606 53564 42998 32210
8919C2210Q721j0607l0521n370q440j1272m587K8720L5204R034K3780j7408k7735
$$ 32210 40931 30324 -197 -5567 -14007 -25279 -29866 -1146 34058 43092 66872 49464 21729
8906B1729j4206J2697J4646J4899J3829J5696J0744k1976o891k0939l1703n765
$$ 21729 7523 20220 34866 49765 63594 79290 90034 68058 61167 40228 8525 2760
8894B760m496j4321J8478Q64J4710J309K901k6213j4118n700j6143n053J5911
$$ 2760 -1736 -16057 2421 3285 17995 19304 22205 -4008 -18126 -23826 -39969 -45022 -29111
8881b9111J9538M5357L1621M792j3089Q29J6783k3208N9086K5511q329l6275j4009
$$ -29111 -9573 35784 67405 72197 59108 59937 76720 53512 112598 138109 129780 93505 79496
8868G9496k2477k7053K8515J2364K1421m458m604k4917j3605j4579j1730K7937
$$ 79496 57019 29966 58481 70845 92266 87808 83204 58287 44682 30103 18373 46310
8856D6310M6502J0829j5437j4311R505Q583L6242m805o2363m6285J9048M4876
$$ 46310 92812 103641 88204 73893 83398 91981 128223 123418 61055 14770 33818 78694
8844G8694k4718j6735l1696n249r658K4114L3189k4359q703O9417L976l9948j0519
$$ 78694 53976 37241 5545 296 -9362 14752 47941 23582 14879 84296 88272 48324 37805
8831C7805J9939j3877p478k2119K5383J3509J4197q985j3584J724k6999K4704
$$ 37805 57744 43867 36389 14270 39653 53162 67359 58374 44790 46514 19515 44219
8819D4219K307K5463J3558k3210j9195l53j39K7371K4852j1277L0418k4249j842
$$ 44219 46526 71989 85547 62337 43142 42789 42650 70021 94873 83596 114014 89765 87923
8806H7923J322j4217l0064l6101L998l6306P324K3541N0534k0862k7782l8115
$$ 87923 89245 75028 44964 8863 12861 -23445 -16121 7420 57954 37092 9310 -28805
8794b8805J6246K9314K5598R152m2054k882L4643L731J5901j05j9032K7792j688
$$ -28805 -12559 16755 42353 51505 9451 6569 41212 44943 60844 60739 41707 69499 67811
8781F7811j7520l0379p27K421j385K2184J5882j6973P875P630K4319n7611m7567
$$ 67811 50291 19912 19185 21606 20221 42405 58287 41314 49189 56819 81138 23527 -24040
8768b4040L3138K4958j2483L799j8427l5450m156l666l114K2287J3982o71l0221
$$ -24040 9098 34056 21573 25372 6945 -28505 -32661 -36327 -39441 -17154 -3172 -3843 -34064
8755c4064J2172N4814J7464o573J9021j3748l2257J5448j6223j1275j0302O201
$$ -34064 -21892 32922 50386 43813 62834 49086 16829 32277 16054 4779 -5523 678
8743F78j2763l0547k0771J9475L2570K1683L7418k4567k1252K370j8140o249J9957
$$ 678 -12085 -42632 -63403 -43928 -11358 10325 47743 23176 1924 4294 -13846 -20095 -138
8730a38L040o545J0787J515J4811L0541J8128k3364m5335j572K5127k2789k065
$$ -138 2902 -3643 7144 8659 23470 54011 72139 48775 3440 1868 26995 4206 2141
8717B141J6801K7640K2791j6904J8949j6977k0125J7951J072k5597M6Q72j6649
$$ 2141 18942 46582 69373 52469 71418 54441 34316 52267 53339 27742 27788 28660 12011
8704A2011k9126l5803J7462K2894J4131J0090K9141J3095j6285q93q541n890n953
$$ 12011 -17115 -52918 -35456 -12562 1569 11659 40800 53895 37610 36717 28176 22286 16333
8691A6333l3570Q094J9755K749Q461o814J7259J6151j4020o206j4326q182K5539
$$ 16333 -17237 -9143 10612 13361 21822 15008 32267 48418 34398 28192 13866 5684 31223
8678C1223j8114j028J6030m753j3502k272j1695P729J2837m468J6617L3032j7984
$$ 31223 13109 12081 28111 23358 9856 7584 -4111 3618 16455 11987 28604 61636 43652
8665D3652j4388J6621O1595L420l3231q924l1203P657K2314L1588j6475j7104
$$ 43652 29264 45885 107480 110900 77669 68745 37542 45199 67513 99101 82626 65522
8653F5522k8018p262J2040M8118L1522k444L015j084k3861k1912k264K617l1643
$$ 65522 37504 30242 42282 90400 121922 119478 122493 121409 97548 75636 73372 75989 44346
8640D4346P890K6436k8165j4904j961k2133l1686j334Q862J280k0882j1488J0082
$$ 44346 52236 78672 50507 35603 33642 11509 -20177 -21511 -12649 -11369 -32251 -43739 -33657
8627c3657L444K6436M1529L5188j1574j3856p966K8866J0686L193k9569k9520
$$ -33657 -30213 -3777 37752 72940 61366 47510 39544 68410 79096 82289 52720 23200
8615B3200J5198L6695J66l4958J1687L6922p862k1685l674N6312K0965J9355L9602
$$ 23200 38398 75093 75259 40301 51988 88910 81048 59363 55689 112001 132966 152321 191923
8602A91923J3851n1886n2278n4133j7910q171J5393j5512o383l6167j7000L9510
$$ 191923 205774 153888 101610 47477 29567 21396 36789 21277 14894 -21273 -38273 1237
8590A237l813K1123N740J9808k8339p999j4660j263K2439k148L6686K253r753
$$ 1237 -2576 18547 24287 44095 15756 7757 -6903 -8166 14273 12125 48811 51064 41311
8577D1311k1543k1809j1262K7187P9J8108k5925r349J7764l7472n302M0873O4234
$$ 41311 19768 -2041 -13303 13884 13963 32071 6146 -3203 14561 -22911 -28213 12660 76894
8564G6894Q027k6301j3652N599o848J2485j3023l6116o465K9807O481l9795j3590
$$ 76894 84921 58620 44968 50567 43719 56204 43181 7065 600 30407 36888 -2907 -16497
8551a6497Q1371J4348n9991K4144l8487j5472p393j7829O1950N3990L751m2282
$$ -16497 64874 79222 19231 43375 4888 -10584 -17977 -35806 26144 80134 83885 41603
8539D1603k8308k1662N6132J2959j2901k8082K8332O680k4156j6955J9051N3386
$$ 41603 13295 -8367 47765 60724 47823 19741 48073 54753 30597 13642 32693 86079
8527H6079k029J647j5062l8707j4668J9698L4357j302l6948j8313N118J0021j2203
$$ 86079 84050 85697 70635 31928 17260 36958 71315 70013 33065 14752 19870 29891 17688
8514A7688k4623k5135j844P6177n558k0714O725J617N627j5327J2984J1208r524
$$ 17688 -6935 -32070 -33914 42263 36705 15991 22716 24333 29960 14633 27617 38825 29301
8501B9301J7449J6202l8778q37L9731k1738l4476J8809K2598k0565l6210L6639
$$ 29301 46750 62952 24174 23337 63068 41330 6854 25663 48261 27696 -8514 28125
8489B8125K2180O367j0970o926l256k9482R969j0969l8940l1759j0798K5900J1583
$$ 28125 50305 56672 45702 38776 35520 6038 16007 5038 -33902 -65661 -76459 -50559 -38976
8476c8976J9845M877L795J5694J3696p519R72j2577j2990M4061k3801j6507J4073
$$ -38976 -19131 -14254 -10459 5235 18931 11412 12384 -193 -13183 30878 7077 -9430 4643
8463D643K958p533J9709j42J1953M9889l643k3838k6389k2532K7961k1969j4275
$$ 4643 7601 68 19777 19635 31588 81477 77834 53996 27607 5075 33036 11067 -3208
8450c208r822l7626J2355M5601o334M404j3504j8323K475j3055k3335P005K3193
$$ -3208 -13030 -50656 -38301 7300 966 5370 -8134 -26457 -23982 -37037 -60372 -53367 -30174
8437c0174L8271K1727j9667j3396m279r714R859M8885M931j6002r016J2559k0830
$$ -30174 8097 29824 10157 -3239 -7518 -17232 -7373 41512 46443 30441 21425 33984 13154
8424A3154j6762K6543k1064j5907M070J1552j8914K7480Q897j418L7589r083j5794
$$ 13154 -3608 22935 1871 -14036 -9966 1586 -17328 10152 19049 17631 55220 46137 30343
8411C0343k7781k4739p002J0957j0048n890K065J2669K1450M6423J7331j6498
$$ 30343 2562 -22177 -29179 -18222 -28270 -34160 -32095 -19426 2024 48447 65778 49280
8399D9280O276K3177l5701l9927R55K5696k988k1787r227Q678J908l480j2103
$$ 49280 55556 78733 43032 3105 4060 29756 26768 4981 -4246 4432 6340 2860 -9243
8386i243Q99J2712K4310j6173l8181k4834j0545J8099L3216K2937K3458J3391
$$ -9243 -8344 4368 28678 12505 -25676 -50510 -61055 -42956 -9740 13197 36655 50046
8374E0046k8439k8553k9369L7332j0480j1207J9055J116j8062Q261J1081O136
$$ 50046 21607 -6946 -36315 1017 -9463 -20670 -1615 -499 -18561 -10300 781 6917
8362F917O39k391Q271r468J7676L0913J997k6544l7682k530L1008K7738k4915
$$ 6917 7556 5165 13436 3968 21644 52557 54554 28010 -9672 -12202 18806 46544 21629
8349B1629j791J0032N739j3759m976N039j4415k8838Q957M5624M3565k7760k5201
$$ 21629 19838 29870 35609 21850 16874 21913 7498 -21340 -12383 33241 76806 49046 23845
8336B3845J4413J396r879K7533L350l7684N952K4390J8990K097m583m5228n4857
$$ 23845 38258 39654 29775 57308 60658 22974 28926 53316 72306 74403 69820 24592 -30265
8323c0265m86M1683J9251j3450j721K151j856o540k5804m3895K5025M4380n597
$$ -30265 -30751 10932 30183 16733 15012 17163 15307 8767 -17037 -60932 -35907 8473 2876
8310B876m5443j3315L1913K8228K9154O481k618K6871J1341n517O637K5194j8891
$$ 2876 -42567 -55882 -23969 4259 33413 39894 37276 64147 75488 69971 76608 101802 82911
8297H2911j1946k9186k0586j0337L5746P194L569l1088k3480K924J7174J7143
$$ 82911 70965 41779 21193 10856 46602 53796 57365 26277 2797 5721 22895 40038
8285D0038K8858r65j1438N98P91l2450p07J7701k4177K3200J1675Q06K4998L819
$$ 40038 68896 67931 56493 57091 57882 25432 24725 42426 18249 41449 53124 53930 78928 82747
8271H2747j8025j3907R631k9321J6476m2930j0054L9466J1235j8663j6271K6975
$$ 82747 64722 50815 60446 31125 47601 4671 -5383 34083 45318 26655 10384 37359
8259C7359M0098n2875k7451K6202L5378k9775l1655J685Q731j2763L8599K1880
$$ 37359 77457 24582 -2869 23333 58711 28936 -2719 -1034 7697 -5066 33533 55413
8247E5413J5947o029j6586k1959J7546J5323j4088Q461j3881l6901Q037L6485
$$ 55413 71360 65331 48745 26786 44332 59655 45567 54028 40147 3246 11283 47768
8235D7768k2914j3774j5320J3577M2760K9989J8558k1307k5410n6170k3724K3690
$$ 47768 24854 11080 -4240 9337 52097 82086 100644 79337 53927 -2243 -25967 -2277
8223b277k773L749N113k51k7002k321p466L5305k2727J0401M102L0246J4515j1033
$$ -2277 -5050 -1301 3812 3561 -23441 -25762 -33228 2077 -20650 -10249 -6147 24099 38614 27581
8209B7581N508k819J0925n908p6143O558J2723J521L2999J2564l7719J5052K3231
$$ 27581 33089 30270 41195 35287 -40856 -34298 -21575 -20054 12945 25509 -12210 2842 26073
8196B6073p847R072j2052m165q862l5796K7130K2953Q119J8463k1571k7356m37
$$ 26073 18226 27298 15246 11081 2219 -33577 -6447 16506 24625 43088 21517 -5839 -6276
8183f276K8860J5812J6530K882l0073m5936J0291L4554J773K0194L4637j1961
$$ -6276 22584 38396 54926 57808 27735 -18201 -7910 26644 28417 48611 83248 71287
8171G1287l1614j249m770j2235j3552J0977J9909j7481m8816p455Q0170p014j7086
$$ 71287 39673 38424 33654 21419 7867 18844 38753 21272 -27544 -34999 45171 38157 21071
8158B1071L012J6942P535K7207J0180l0845l6011Q261L2855J6096k6703J2898
$$ 21071 24083 41025 48560 75767 85947 55102 19091 27352 60207 76303 49600 62498
8146F2498J5961J1360j9164l3511l2309o133l567j4382j0523P282K7143j5577
$$ 62498 78459 89819 70655 37144 4835 -1298 -4865 -19247 -29770 -22488 4655 -10922
8134a0922k5739K6434O4678K5019k0148m8926L3533j0775o457L309N707K0057
$$ -10922 -36661 -10227 54451 79470 59322 10396 43929 33154 26697 30006 35713 55770
8122E5770k208k7856l3316l4468L8637J0461q985j4250M845J4800J9380L2733
$$ 55770 53562 25706 -7610 -42078 -3441 7020 -1965 -16215 -11370 3430 22810 55543
8110E5543k0880l0115l292J4710K7241N86j3946k7838k2059K1736J1383L25j3381
$$ 55543 34663 4548 1256 15966 43207 43793 29847 2009 -20050 1686 13069 13394 13
8097A3k2847N5942L5283j0965m8352L8829M7860K382m9341j4057Q676j4769k4566
$$ 13 -22834 33108 68391 57426 9074 47903 95763 98145 48804 34747 43423 28654 4088
8084D088O42J0319K3466k2161l7163J922J3126k9399j0867L9500L488k4495M087
$$ 4088 4730 15049 38515 16354 -20809 -18887 -5761 -35160 -46027 -6527 -3039 -27534 -23447
8071b3447Q694n958K1341K4952l9597k1064Q874K8529q850l3813J2539M711l697
$$ -23447 -14753 -20711 630 25582 -14015 -35079 -26205 2324 -6526 -40339 -27800 -23089 -26786
8058b6786L509J7246L1359K803q765k0874j0306P712j0737L3089K4377j4105p787
$$ -26786 -23277 -6031 25328 28131 19366 -1508 -11814 -4102 -14839 18250 42627 28522 20735
8045B0735K0498r429l1905J4856J6348k3109j324q269j7223j4602K9211J6115
$$ 20735 41233 31804 -101 14755 31103 7994 6670 -1599 -18822 -33424 -4213 11902
8033A1902J9636j8558k1546j2935J0460M1937O349j6755J1717l2412k3528p629
$$ 11902 31538 12980 -8566 -21501 -11041 30896 37245 20490 32207 -205 -23733 -31362
8021c1362O796K691q969L8985M237k8376r212M4858j1707n7524l437K6390j3922
$$ -31362 -24566 -21875 -30844 8141 12378 -15998 -25210 19648 7941 -49583 -53020 -26630 -40552
8008d0552L1194M80k5062k7224m0443j3519O4997K8254M132k4071j2648L2971
$$ -40552 -9358 -8878 -33940 -61164 -101607 -115126 -50129 -21875 -17743 -41814 -54462 -21491
7996b1491J8780p876L5094N4674J4292o0330m9198J4559k6316l882P349M5120
$$ -21491 -2711 -10587 24507 79181 93473 33143 -16055 -1496 -27812 -31694 -24345 20775
7984B0775R835l5320n0477l2113K6273K8402J1039J8716K6631M8941j4815l5867
$$ 20775 30610 -4710 -55187 -87300 -61027 -32625 -21586 -2870 23761 72702 57887 22020
7972B2020m7871n340L4192J7322R347q703k7271O317n497P96Q900o297k4586J0940
$$ 22020 -25851 -31191 3001 20323 29670 20967 -6304 13 -5484 -4688 4212 -2085 -26671 -15731
7958a5731J1695J8958j4158l5487k7877M1087L9754j1651J1549l452J12j4520
$$ -15731 -4036 14922 764 -34723 -62600 -21513 18241 6590 18139 14687 14799 279
7946B79J4655K3015j1520n3759k8535N565L7290O2465J6080j7849k9575j4463
$$ 279 14934 37949 26429 -27330 -55865 -50300 -13010 49455 65535 47686 18111 3648
7934C648K9075k953k7552k4159k5183k706L167M2255J8856K0953L1960m692l6696
$$ 3648 32723 29770 2218 -21941 -47124 -49830 -46663 -4408 14448 35401 67361 62669 25973
7921B5973j3203r54L321k6805J9702J1403k4198j0092J4228j7112Q57j0609n808
$$ 25973 12770 11816 15137 -11668 8034 19437 -4761 -14853 -625 -17737 -16880 -27489 -33297
7908c3297p267J244o572j960O4757M7075l6417l2351j048K1189L734j085K4371
$$ -33297 -40564 -39320 -45892 -47852 16905 63980 27563 -4788 -5836 15353 19087 18002 42373
7895D2373J4648l0889m0943K4793J7925q738j7572K0022q083k5676j9981j93L7869
$$ 42373 57021 26132 -14811 9982 27907 19169 1597 21619 13536 -12140 -32121 -32314 5555
7882E555K508j5720j1553o903K4985N299j9551N751K5032N237r4J979L9315O143
$$ 5555 8063 -7657 -19210 -26113 -1128 4171 -15380 -9629 15403 20640 20546 22525 61840 67983
7868F7983n6578j7286J8933J2301j2748j7337r443j9272j3470K108J6293p650
$$ 67983 11405 -5881 13052 25353 12605 -4732 -14175 -33447 -46917 -44809 -28516 -36166
7856c6166j038K3596O9537M420l2047n367j7804m2939L6792K3125n90m329K2833
$$ -36166 -37204 -13608 55929 60349 28302 22935 5131 -37808 -1016 22109 21519 17190 40023
7843D0023J7551J9416m5996l4741j4074l4548K2413L2348K2028J5521j9491L29
$$ 40023 57574 76990 30994 -3747 -17821 -52369 -29956 2392 24420 39941 20450 20779
7831B0779K8918j4978q084l963n004L385j7181P312n918k4384l3174j3140O242
$$ 20779 49697 34719 26635 22672 17668 21053 3872 11184 5266 -19118 -52292 -65432 -59190
7818e9190K2961K648J2858M261k4347j7648J3886L1798L1530p797k1466j7542
$$ -59190 -36229 -33581 -20723 -16462 -40809 -58457 -44571 -12773 18757 10960 -10506 -28048
7806b8048J8361J0969L0567o258L6298k960n5182n6866K6772R302J8209M7943
$$ -28048 -9687 1282 31849 25591 61889 58929 3747 -53119 -26347 -17045 1164 49107
7794D9107K319n0802K606O501j0346N2149J2985l0637j6391K5085L335k6703K4224
$$ 49107 51426 624 3230 9731 -615 51534 64519 33882 17491 42576 45911 19208 43432
7781D3432L5033k567p5577m78P2075o677j1670j2650j0205M104j5293k0371Q976
$$ 43432 78465 75898 321 -157 71918 65241 53571 40921 30716 34820 19527 -844 8132
7768H132K7546j8190m660q144k863j9177l3783j816L568J6704J6725n782j593
$$ 8132 35678 17488 12828 4684 1821 -17356 -51139 -52955 -49387 -32683 -15958 -21740 -23333
7755b3333P622L9288J9858l6799p096K181m2568l57N6127M9427J3707j1950k2041
$$ -23333 -15711 23577 43435 6636 -460 1721 -40847 -41204 14923 64350 78057 66107 44066
7742D4066L577p741m2524m2634P622L907j3757q769J2725L2278L7064J9615j1841
$$ 44066 47643 39902 -2622 -45256 -37634 -33727 -47484 -56253 -43528 -11250 25814 45429 33588
7729C3588k1863o85L1482K1215J7445N677k8599r701M0080m3011o1732j1322N451
$$ 33588 11725 11040 42522 63737 81182 86859 58260 48559 88639 45628 -16104 -27426 -21975
7716b1975p813J5049M2665N925k4026k0591J7955j4684k1604p171l975L1146J7878
$$ -21975 -29788 -14739 27926 33851 9825 -10766 7189 -7495 -29099 -36270 -40245 -9099 8779
7703H779R512r207K1098R956M25j9349j7743k7110M504J4242J1464j5890k3881
$$ 8779 18291 9084 30182 40138 40563 21214 3471 -23639 -19135 -4893 6571 -9319 -33200
7690c3200j647L9008J6037j9543l3577q013M0096L7861R931k6052j4633j4158
$$ -33200 -34847 4161 20198 655 -32922 -40935 -839 37022 46953 20901 6268 -7890
7678g890k0216p047J6362L2703p2j2750N599q337J7003n062k8322o582j7030J1955
$$ -7890 -28106 -35153 -18791 13912 13840 1090 6689 -1648 15355 10293 -18029 -24611 -41641 -29686
7664b9686O36N476l154J1496L2476J9226K4409j7936k2871k5248M4949j3200m1683
$$ -29686 -29050 -23574 -26728 -15232 17244 36470 60879 42943 20072 -5176 39773 26573 -15110
7651a5110l776J6258j045K242J0394j4085J3418L2609J4949L69l776m772n6754
$$ -15110 -18886 -2628 -3673 -1431 8963 -5122 8296 40905 55854 56223 52447 47675 -9079
7638i079k5550j492J1500k3429l8678J1148M8459L8086K9072k868k4666k8781
$$ -9079 -34629 -36121 -24621 -48050 -86728 -75580 -27121 10965 40037 37169 12503 -16278
7626a6278k0065K3619p951K4137L3811k4867k1386k6501j3366r18l1933j257R017
$$ -16278 -36343 -12724 -20675 3462 37273 12406 -8980 -35481 -48847 -49765 -81698 -82955 -73938
7613g3938O8879L0323o2326J0995J5839L2414L0479K1782j9060l517k7662k623
$$ -73938 -5059 25264 -37062 -26067 -10228 22186 52665 74447 55387 51870 24208 21585
7601B1585L3919m687j4336j2257L0825J1577j6248j0526j3127k0006k9584J4801
$$ 21585 55504 50817 36481 24224 55049 66626 50378 39852 26725 6719 -22865 -8064
7589h064l247k2034Q788k2707k6593m415N732P255M0060L3849j5003J1630j0356
$$ -8064 -11311 -33345 -24557 -47264 -73857 -78272 -72540 -65285 -25225 8624 -6379 5251 -5105
7576e105J7596M354m1240j2007J8891k1363m968J6467L9264p846Q330J4939K121
$$ -5105 12491 16845 -24395 -36402 -17511 -38874 -43842 -27375 11889 4043 12373 27312 29433
7563B9433j0994q709J5322J1196K146P422J3N884K717J1712l2007l9953l2608
$$ 29433 18439 9730 25052 36248 38394 45816 45829 51713 54430 66142 34135 -5818 -38426
7550c8426k1596M5472L5621J9004l6990l2643j7905j5086Q623K6387L0924j4085
$$ -38426 -60022 -14550 21071 40075 3085 -29558 -47463 -62549 -53926 -27539 3385 -10700
7538a0700p253O016p844P495j1799k1348J3251K6918K1704l4968j3787J3254o0634
$$ -10700 -17953 -11937 -19781 -12286 -24085 -45433 -32182 -5264 16440 -18528 -32315 -19061 -79695
7525g9695J7171K7583l468K3803K9350M740k509L7732K9024r497k0846k4811n101
$$ -79695 -62524 -34941 -38409 -14606 14744 19484 16975 54707 83731 74234 53388 28577 23476
7512B3476m454J5417L312j5142l013J4598j8221m425j0704k8455p004J1093J9128
$$ 23476 19022 34439 37751 22609 19596 34194 15973 11548 844 -27611 -34615 -23522 -4394
7499d394j5701j3114R099l0765k896K4560K3439M347p0171r541J5309M9329J7051
$$ -4394 -20095 -33209 -24110 -54875 -57771 -33211 -9772 -5425 -75596 -85137 -69828 -20499 -3448
7486c448J2158Q391l2901l0270L4079K5806J107j0277K9927p993J0191L308o486
$$ -3448 8710 17101 -15800 -46070 -11991 13815 14922 4645 34572 26579 36770 40078 33592
7473C3592j1051j2302M019Q209j3201l7538l6739O637K3004J8927K7987J2831
$$ 33592 22541 10239 14258 22467 9266 -28272 -65011 -58374 -35370 -16443 11544 24375
7461B4375m294l4467j9551J4071K6234K0371j164k9863k9890L2089L569L439p695
$$ 24375 20081 -14386 -33937 -19866 6368 26739 25575 -4288 -34178 -2089 1480 4919 -2776
7448b776J5826k5045j8252M0516j5541k8178r054Q999M0387L4461l2234l0824
$$ -2776 13050 -11995 -30247 10269 -5272 -33450 -42504 -33505 6882 41343 9109 -21715
7436b1715J51j710L93l128l401L5525L6983j1962n5372l797M478j628J9439j4266
$$ -21715 -21564 -23274 -22881 -26009 -29410 6115 43098 31136 -24236 -28033 -23555 -25183 -5744 -20010
7422b0010j2632K2273K9505j0133P263Q382k4436k1061J5077K8148p285m795P384
$$ -20010 -32642 -10369 19136 9003 16266 24648 212 -20849 -5772 22376 15091 10296 17680
7409A7680J6846k3640j5104J9928j6109n825k2143j8463J5889R953p99M896J440
$$ 17680 34526 10886 -4218 15710 -399 -6224 -28367 -46830 -30941 -20988 -21787 -16891 -15451
7396a5451J697J2968k0037j9157k6201L736L526j2621J397k7104k0515P7888L1195
$$ -15451 -13754 -786 -20823 -39980 -66181 -62445 -58919 -71540 -70143 -97247 -117762 -39874 -8679
7383h679J1766K0533J3321j2349l5606j118P922l8655j2853J8463K7408m1852
$$ -8679 3087 23620 36941 24592 -11014 -12132 -4210 -42865 -55718 -37255 -9847 -51699
7371e1699k860J3836J729J1212J2359K0682M410j0140J922K2022L3395q360j8658
$$ -51699 -54559 -40723 -38994 -27782 -15423 5259 9669 -471 1451 23473 56868 48508 29850
7358B9850l8347j4708K6825N648m8281l206p959j8081K3193L2324r364K1630M3667
$$ 29850 -8497 -23205 3620 9268 -39013 -42219 -50178 -68259 -45066 -12742 -22106 -476 43191
7345D3191j355k753M504k3365n6681l815J4033k7403k8740J3495L7809j4205k0135
$$ 43191 41836 39083 43587 20222 -36459 -40274 -26241 -53644 -82384 -68889 -31080 -45285 -65420
7332f5420J6063J5948J0205J2509L7854P788K044l2603J1907M1991j5249j2388
$$ -65420 -49357 -33409 -23204 -10695 27159 34947 36991 4388 16295 58286 43037 30649
7320C0649l9678N653j5632K5460l505k843j2K947K404j2158k687k7907j4946J762
$$ 30649 -9029 -3376 -19008 6452 2947 104 92 3039 5443 -6715 -9402 -37309 -52255 -50493
7306e0493J4343K7565n696N168J4186P764R080k5716n078R367j1956K8133J5974
$$ -50493 -36150 -8585 -14281 -9113 5073 12837 21917 -3799 -8877 490 -11466 16667 32641
7293C2641K7933J899n4095n5296J8013J4749k1886n5820J2099K6787K8013N14
$$ 32641 60574 62473 8378 -46918 -28905 -14156 -36042 -91862 -79763 -52976 -24963 -24449
7281b4449r029J5131K3478J2303j4079k1533K4652J0038K5401k6791n6633m447
$$ -24449 -33478 -18347 5131 17434 3355 -18178 6474 16512 41913 15122 -41511 -45958
7269d5958k1156Q065K9312L7215O155L366k2595r773J0250J168P909q886j6173
$$ -45958 -67114 -59049 -29737 7478 13633 16999 -5596 -15369 -5119 -3951 3958 -4928 -21101
7256b1101j6526K4K0256K1224k0990m0636J0613L9724k960k1778J4155k3128J2155
$$ -21101 -37627 -37603 -17347 3877 -17113 -57749 -47136 -7412 -10372 -32150 -17995 -41123 -28968
7243b8968M4880K9129j7212l7278n468L8685L2998K1190l2985l1426k0547l5101
$$ -28968 15912 45041 27829 -9449 -14917 23768 56766 77956 44971 13545 -7002 -42103
7231d2103j061K1051K3434J9091R418j1058N125j4787m3385l0728q639J3573L8129
$$ -42103 -43164 -22113 1321 20412 29830 18772 23897 9110 -34275 -65003 -73642 -60069 -21940
7218b1940K9031L4877k4603n1169n554P648n631k5815L511M2868L7862j6358k4699
$$ -21940 7091 41968 17365 -33804 -39358 -31710 -37341 -63156 -59645 -16777 21085 4727 -19972
7205a9972L8490L2505r560k324p075k6190l9678k5627P837J3020j0082K7888q025
$$ -19972 18518 51023 41463 39139 32064 5874 -33804 -59431 -51594 -38574 -48656 -20768 -28793
7192b8793k7572L4230J7006j3534j7796K9861N64k4707j6153m347J8739n158L2629
$$ -28793 -56365 -22135 -5129 -18663 -36459 -6598 -6034 -30741 -46894 -51241 -32502 -37660 -5031
7179e031M7542P148l2903L699n924k6350l057j610K4984M6274K8130j7498m6211
$$ -5031 42511 49659 16756 20455 14531 -11819 -14876 -16486 8498 54772 82902 65404 19193
7166A9193l5935N646J758j2050k0840J4802L3342J5636n061k976K4881K924K514
$$ 19193 -16742 -11096 -9338 -21388 -42228 -27426 5916 21552 16491 13515 38396 41320 43834
7153D3834j0532k2618k2789K512J1255J6336J6870J0603m1512j8818j464N942
$$ 43834 33302 10684 -12105 -9593 1662 17998 34868 45471 3959 -14859 -16323 -10381
7141a0381k0324k2583K4632M1204K155K4789j8371m3578j4507L7002J3612j1653
$$ -10381 -30705 -53288 -28656 12548 14703 39492 21121 -22457 -36964 38 13650 1997
7129A997O735J0243j946J8767p685q049n90j1262K1804j9839k7381K1253J3946
$$ 1997 8732 18975 17029 35796 28111 20062 19472 8210 30014 10175 -17206 4047 17993
7116A7993m6148r649M370J6381K4945K4362J9891Q71k0948l4762l8493J2441L1639
$$ 17993 -28155 -37804 -33434 -17053 7892 32254 52145 53016 32068 -2694 -41187 -28746 2893
7103B893P316n2255l083J9346j5606j3792J5564k0537j9743R962M0658R117l5031
$$ 2893 10209 -42046 -45129 -25783 -41389 -55181 -39617 -60154 -79897 -69935 -29277 -20160 -55191
7090e5191m1551l8320L428J3005J7517M1823J5953J3727p892J4936N528Q594j0785
$$ -55191 -96742 -135062 -131634 -118629 -101112 -59289 -43336 -29609 -37501 -22565 -17037 -8443 -19228
7077a9228L942R837n541m444M4918j8769j7375J0279L0488q952l4643l0692j6996
$$ -19228 -15286 -5449 -10990 -15434 29484 10715 -6660 3619 34107 25155 -9488 -40180 -57176
7064e7176m450M029J6950J1496L213l577M1687K3502M579l908l083k8259n210
$$ -57176 -61626 -57597 -40647 -29151 -25938 -29515 12172 35674 40253 36345 33262 5003 -207
7051b07l432J6865p853P503M0883k2393m1376k0150p267J563l2988J0857M8453
$$ -207 -3639 13226 5373 12876 53759 31366 -10010 -30160 -37427 -35864 -68852 -57995 -9542
7038i542L4527j7069m641k6785l0266P29j2905K9100L6609K0994J8070J5175m0634
$$ -9542 24985 7916 3275 -23510 -53776 -53047 -65952 -36852 -243 20751 38821 53996 13362
7025A3362l7503K3795M365r398r4j8211l463J5388J967k7455p351r270O048K2851
$$ 13362 -24141 -346 4019 -5379 -5473 -23684 -27147 -11759 -9792 -37247 -44598 -53868 -47820 -24969
7011b4969L4124R116J4535P24k4833j9662o199O499J9187j4736j7613K25j6907
$$ -24969 9155 18271 32806 33530 8697 -10965 -17164 -10665 8522 -6214 -23827 -23602 -40509
6998d0509j4990L3406L2289J6942k2249K437M8082p5j9594m6951n417K9500L0987
$$ -40509 -55499 -22093 10196 27138 4889 7326 55408 55333 35739 -11212 -16629 12871 43858
6985D3858o888k6371k7298l42n90J8762k0215k9048p551M0295K0454n944k4317
$$ 43858 36970 10599 -16699 -17041 -17631 1131 -19084 -48132 -55683 -15388 5066 -878 -25195
6972b5195j3033K2561J9920l3449l0040n442J9038J5184m315k4747J1629J0864
$$ -25195 -38228 -15667 4253 -29196 -59236 -64678 -45640 -30456 -34771 -59518 -47889 -37025
6960c7025j2803o087M0487J9231j1489J9769n89l1925j2203K5164k551j7389k2860
$$ -37025 -49828 -55915 -15428 3803 -7686 12083 11494 -20431 -32634 -7470 -10021 -27410 -50270
6947e0270L1220L7324J300m3340m8699k4209k7992N507l731j440K3887M1675p9
$$ -50270 -19050 18274 19574 -23766 -72465 -96674 -124666 -119159 -122890 -124330 -100443 -58768 -58847
6934e8847N084o439J2028L5304L9613J3928m7661p194j1107k6267q043L478L7371
$$ -58847 -53763 -60202 -48174 -12870 26743 40671 -6990 -14184 -25291 -51558 -59601 -56123 -18752
6921a8752K3515l117M648n4225j5826O3044J2258K5405j3260k1686j7100K059
$$ -18752 4763 1646 6294 -47931 -63757 -713 11545 36950 23690 2004 -15096 -13037
6909a3037j0745j5036k15q677M5592j4715m9379j9740L9127q74k1832p810L7712
$$ -13037 -23782 -38818 -39033 -47710 -2118 -16833 -66212 -85952 -46825 -47699 -69531 -77341 -39629
6896c9629Q449n213K272M381L549J1755K9766l7684l3204k106O0335J7975j2586
$$ -39629 -31180 -36393 -34121 -29740 -26191 -14436 15330 -22354 -55558 -57664 2671 20646 8060
6883H060J1597k4411o332R745n054J3096J1135j1188k6785J8359j5036j7430o529
$$ 8060 19657 -4754 -11086 -1341 -6395 6701 17836 6648 -20137 -1778 -16814 -34244 -40773
6870d0773K2379L7563j3959J7968O549j3452J329O656j5105k2888p598q403K1129
$$ -40773 -18394 19169 5210 23178 29727 16275 17604 24260 9155 -13733 -21331 -29734 -8605
6857h605J0691K830l366o134K4729O001j0950k6649K1523L2771j2433M819L0084
$$ -8605 2086 4916 1550 -4584 20145 26146 15196 -11453 10070 42841 30408 35227 65311
6844F5311k384M387l3843N135k4086j4453j6715k1168L3260j2866j2675j0090
$$ 65311 62927 67314 33471 38606 14520 67 -16648 -37816 -4556 -17422 -30097 -40187
6832d0187j201K146L808n430J3609M168M273k926J020m542O18M790N469J2075
$$ -40187 -41388 -39242 -35434 -40864 -27255 -23087 -18814 -21740 -20720 -25262 -24644 -19854 -14385 -2310
6818b310Q10l0026J8206J9138k2009l0055J5795j907j84L0080m0028j8661L131
$$ -2310 -1500 -31526 -13320 5818 -16191 -46246 -30451 -32358 -32542 -2462 -42490 -61151 -58020
6805e8020K2743M910k6023K2293K2701J5398k2300m1712j039J1013M0028Q786
$$ -58020 -35277 -30367 -56390 -34097 -11396 4002 -18298 -60010 -61049 -50036 -10008 -1222
6793a222l0597J3756j907j0442k746L5479M8232J5801m7268k192K5837J2410l4318
$$ -1222 -31819 -18063 -19970 -30412 -33158 2321 50553 66354 19086 16894 42731 55141 20823
6780B0823m2989R428r930j0532K4341k5390j9467n960L1269L698L2921m06K3191
$$ 20823 -22166 -12738 -22668 -33200 -8859 -34249 -53716 -59676 -28407 -24709 8212 7806 30997
6767C0997J5904j1766k2958j3930k0908N1199K1888p564n5562k7133J0232K884
$$ 30997 46901 35135 12177 -1753 -22661 28538 50426 42862 -12700 -39833 -29601 -26717
6755b6717q136J4704L3492j0088O66K4351Q847j5989J5581K4921k9169k7606K038
$$ -26717 -34853 -20149 13343 3255 3921 28272 37119 21130 36711 61632 32463 4857 6895
6742F895j9616J2795K0814k6427m5052J7900J0693k4574k7971J3042J6569j2502
$$ 6895 -12721 74 20888 -5539 -50591 -32691 -21998 -46572 -74543 -61501 -44932 -57434
6730e7434k6511j0457K5961L2139J0301K2486L809l9443n6774n722L7148o899
$$ -57434 -83945 -94402 -68441 -36302 -26001 -3515 294 -39149 -95923 -101645 -64497 -71396
6718g1396N659k4085L0132O61J1741p652J2153J8869J1289j4599o004K6705J0216
$$ -71396 -65737 -89822 -59690 -59029 -47288 -54940 -42787 -23918 -12629 -27228 -33232 -6527 3689
6705C689n304o301J3443K2280k7853r531J2452o804O052L7548K980k3603k8211
$$ 3689 -1615 -7916 5527 27807 -46 -9577 2875 -3929 2123 39671 42651 19048 -9163
6692i163j9538J9572L6853J3888j0889r374j018L6037K3907l1408l808j2486l976
$$ -9163 -28701 -9129 27724 41612 30723 21349 20331 56368 80275 48867 45059 32573 28597
6679B8597j5567l2063r26K093L3119K6192r364m2773k1930j1391n959j3963o158
$$ 28597 13030 -19033 -19959 -17866 15253 41445 32081 -10692 -32622 -44013 -49972 -63935 -70093
6666g0093K6389M6283o08p872K2489n748k4839l0218j319K8430J7986J7232J3929
$$ -70093 -43704 2579 1971 -5901 16588 10840 -13999 -44217 -45536 -17106 880 18112 32041
6653C2041j8499q903m1173l6231J8447j332L9682M6526O580k9218Q820j4797j2281
$$ 32041 13542 4639 -36534 -72765 -54318 -55650 -15968 30558 37138 7920 16740 1943 -10338
6640a0338n956n286k6929P559K2110J3908k1035M955L3154j0305l6030j3358k7799
$$ -10338 -16294 -21580 -48509 -40950 -18840 -4932 -25967 -21012 12142 1837 -34193 -47551 -75350
6627g5350r138n12M6607O078P101L7569j7170K2523M4782J1621n2804k3098R433
$$ -75350 -84488 -85000 -38393 -32315 -25214 12355 -4815 17708 62490 74111 21307 -1791 7642
6614G642K6049J3513J702k7575j6311K7968j9448l5117K380J9783J4247J242j2997
$$ 7642 33691 47204 48906 21331 5020 32988 13540 -21577 -19197 586 14833 16075 3078
6601C078j6461m592K28L5440J3146J8913l9152m1787j3331K4557j616Q751K823
$$ 3078 -13383 -17975 -17747 17693 30839 49752 10600 -31187 -44518 -19961 -21577 -12826 -10003
6588a0003J2408K913j1298k2045j2111J8622L5384l8245P941j5468k0461j2899
$$ -10003 2405 5318 -5980 -28025 -40136 -21514 13870 -24375 -16434 -31902 -52363 -65262
6576f5262P922L7808Q363k4915l3044q132K4613K2970L1359M132j7031p399J0043
$$ -65262 -57340 -19532 -11169 -36084 -69128 -77260 -52647 -29677 1682 5814 -11217 -18616 -8573
6563h573L403P129k2901J4048j0433M0163M1357J3615l3307k2100j5379l7799
$$ -8573 -5170 1959 -20942 -6894 -17327 22836 64193 77808 44501 22401 7022 -30777
6551c0777n870R868J7362L734k9601r751N719K3369j824k836O881L3118j9227
$$ -30777 -36647 -26779 -9417 -5683 -35284 -45035 -39316 -15947 -17771 -20607 -13726 19392 165
6538A65k1641j7799J2254P923j2941l099J6792q059J8790M960k2816M61L5858
$$ 165 -21476 -39275 -27021 -19098 -32039 -35138 -18346 -26405 -7615 -2655 -25471 -25010 10848
6525A0848L8765l8772j5100Q487q375k054J2516O52j1252L48p230l668L3052j865
$$ 10848 49613 10841 -4259 4228 -4147 -6201 6315 6967 -4285 -3937 -11167 -14835 18217 16352
6511A6352k2319j2572m763l377R396M477P384J9051j6113L3300J4650m2908m3120
$$ 16352 -5967 -18539 -23302 -26679 -17283 -12806 -5422 13629 -2484 30816 45466 2558 -40562
6498d0562J0149J8170l0935q741j1300j6516k1164J544j3061L2527M2422r904
$$ -40562 -30413 -12243 -43178 -51919 -63219 -79735 -100899 -99355 -112416 -79889 -37467 -47371
6486d7371k2007K3407L0756J0301J7049K3866j5212p375l4138l9560K5918L1532
$$ -47371 -69378 -45971 -15215 -4914 12135 36001 20789 13414 -20724 -60284 -34366 -2834
6474b834m0l069k64K9502J7255k5688n845J932o159l195J6196M333l7301n747
$$ -2834 -2874 -5943 -6207 23295 40550 14862 9017 10949 4790 1595 17791 22124 -15177 -20924
6460b0924m837k6988k1367O5L1337K8456l5937p946N401o232K8950M079J7437
$$ -20924 -25761 -52749 -74116 -74051 -42714 -14258 -50195 -58141 -52740 -58972 -30022 -25943 -8506
6447h506K5803n0060k7820J4805o297l2336J7981J7844L5531K1214j1404m5201
$$ -8506 17297 -32763 -60583 -45778 -52075 -84411 -66430 -48586 -13055 8159 -3245 -48446
6435d8446m979L4580j0706j4121N61K1414L7925K5191m1924K46O986J5583J0684
$$ -48446 -53425 -18845 -29551 -43672 -43111 -21697 16228 41419 -505 -259 6727 22310 32994
6422C2994J2407L5740p09l1541l2313J4830J8566L5499r914n6227m1231j1970
$$ 32994 45401 81141 80432 48891 16578 31408 49974 85473 75559 19332 -21899 -33869
6410c3869J1312K0783j4650l6832J7459M0188k295r956J6223J658J008P772N31
$$ -33869 -22557 -1774 -16424 -53256 -35797 4391 2096 -7860 8363 10021 11029 18801 19332
6397A9332k0580K6376L1071J3606j6767j2267K4783q302j3856k2821j8084L2121
$$ 19332 -1248 25128 56199 69805 53038 40771 65554 57252 43396 20575 2491 34612
6385C4612k7821j9594j0906J2755K6865p296j041K4260M154n352m5590k5747R220
$$ 34612 6791 -12803 -23709 -10954 15911 8615 7574 31834 35988 30636 -14954 -40701 -31481
6372c1481R895o5358l5039M8557L6369j2164L614K8462J0657l0370L219j0362
$$ -31481 -21586 -86944 -121983 -73426 -37057 -49221 -45607 -17145 -6488 -36858 -33639 -44001
6360d4001K2400K3478J4325l868k9943O11J8383j4705j6858L3344j0531k9008
$$ -44001 -21601 1877 16202 12334 -17609 -16998 1385 -13320 -30178 3166 -7365 -36373
6348c6373N896N1820m322j1082j1750J9725k5652j7724J0746J0444J38k0512j5206
$$ -36373 -30477 21343 17021 5939 -5811 13914 -11738 -29462 -18716 -8272 -8134 -28646 -43852
6335d3852j2479L7566K2756o318j5885K1416j6991j9618M413Q385l3612J5310
$$ -43852 -56331 -18765 3991 -2327 -18212 3204 -13787 -33405 -28992 -20607 -54219 -38909
6323c8909L2165J5385J9993l967p747k8838k0574L5665j2731J5935m178J427j9700
$$ -38909 -6744 8641 28634 24667 16920 -11918 -32492 3173 -9558 6377 2199 3626 -16074
6310a6074o160J5865N477J487r16P452K0376j1354l2625o604J0377l6060Q562
$$ -16074 -22234 -6369 -892 595 -321 7131 27507 16153 -16472 -23076 -12699 -48759 -40197
6297d0197L016J5746k329j2010k0279J7377N0971J6467p00K3112k1710l1535Q990
$$ -40197 -37181 -21435 -23764 -35774 -56053 -38676 12295 28762 28062 51174 29464 -2071 6919
6284F919L1359k1356m2073j4178L9743J2339R406N474l2071j4998J9075l831k642
$$ 6919 38278 16922 -25151 -39329 414 12753 22159 27633 -4438 -19436 -361 -4192 -6834
6271f834j4806k3041M3040K1433L4574l6577l4498j2024n923K3309K605M514K3019
$$ -6834 -21640 -44681 -1641 19792 54366 17789 -16709 -28733 -34656 -11347 -8742 -4228 18791
6258A8791j5081j1323J0203K7185k0561j4787k7244L5850j0200j6453l990K9295
$$ 18791 3710 -7613 2590 29775 9214 -5573 -32817 3033 -7167 -23620 -27610 1685
6246A685L4716k1268k9769k7754J2257m021P02R043J4229K9426j6673j5021J7933
$$ 1685 36401 15133 -14636 -42390 -30133 -34154 -33452 -24409 -10180 19246 2573 -12448 5485
6233E485K8531M2083j7389p4075P872K1087K8452k9133j0147k3285J1079k1468
$$ 5485 34016 76099 58710 -15365 -7493 13594 42046 12913 2766 -20519 -9440 -30908
6221c0908j7588L4730k259n122L8984p089m176K9830j1987q545j6104j4738Q006
$$ -30908 -48496 -13766 -16025 -21147 17837 10748 6572 36402 24415 15870 -234 -14972 -6966
6208f966P252p325R96P346j3086J7987O738O127j8991j7005L6028J0499k7436
$$ -6966 286 -7039 -6043 1303 -11783 6204 12942 19069 78 -16927 19101 29600 2164
6195B164k411j8226J2516L896K4439L5323l5068q940P199q23J5815q685k8893
$$ 2164 -247 -18473 -5957 -2061 22378 57701 22633 13693 20892 20069 35884 27199 -1694
6182a694J1268R306n930p355m1453j6759K5598K8734m147k0937m143O422L6347
$$ -1694 9574 18880 12950 5595 -35858 -52617 -27019 1715 -2432 -23369 -27512 -21090 15257
6169A5257k667L5914l084k5603j5338J6876l0182j5864j1955J7310M6262K5082
$$ 15257 12590 48504 45420 19817 4479 21355 -8827 -24691 -36646 -19336 26926 52008
6157E2008m2284m0139q874K6497j4368K616r569Q50R046K9006K9412k8749l582
$$ 52008 9724 -30415 -39289 -12792 -27160 -24544 -34113 -33263 -24217 4789 34201 5452 1870
6144A870K9775o788o116j0309m9187j1457j0902M573K5757L1503N392j4854m721
$$ 1870 31645 24857 18741 8432 -40755 -52212 -63114 -58541 -32784 -1281 4111 -10743 -15464
6131a5464K5511r143N4694M2928k5411m1417r963l1019p320J8322m2715L301M0984
$$ -15464 10047 904 55598 98526 73115 31698 21735 -9284 -16604 1718 -40997 -37696 3288
6118C288l230j2229l081J2615K4140L6903L3679k8428k1915l0583l8264K3703
$$ 3288 58 -12171 -15252 -2637 21503 58406 92085 63657 41742 11159 -27105 -3402
6106c402l685P560M3124P29q593K275J8891j3402o1329j6807L4317K0326j0358
$$ -3402 -7087 473 43597 44326 35733 38008 56899 43497 -17832 -34639 -322 20004 9646
6093I646K1688K212o0954l2464L7624n772l1113j377J0885M0907J8693k506m1154
$$ 9646 31334 33546 -27408 -59872 -22248 -28020 -59133 -60510 -49625 -8718 9975 7469 -33685
6080c3685N61N520k750K383K5132J951J3860r352Q689L739O436l2497m3507K1758
$$ -33685 -33124 -27604 -30354 -27971 -2839 -888 12972 3620 12309 16048 22484 -10013 -53520 -31762
6066c1762K2946k7694M3272L2909j2913r75k2651l8573k7901K7971J1331r968
$$ -31762 -8816 -36510 6762 39671 26758 25783 3132 -35441 -63342 -35371 -24040 -34008
6054c4008l73O610l5016K517K2666L6825Q973j2837j3385l7790J2110J1417J2346
$$ -34008 -34381 -27771 -62787 -60270 -37604 -779 8194 -4643 -18028 -55818 -43708 -32291 -19945
6041a9945R296j3786j3879L6580N9795j1979n3338j0913j0954K2201j0778j475
$$ -19945 -10649 -24435 -38314 -1734 58061 46082 -7256 -18169 -29123 -6922 -17700 -19175
6029a9175M812K2586p491J5572L631k7999K2564L2839k961m0755J4150o021k7601
$$ -19175 -14363 8223 732 16304 19935 -8064 14500 47339 44378 3623 17773 11752 -15849
6016a5849q222j4027j6838J9496L3836M3852j2772j1889k7879M2666J2094j4515
$$ -15849 -24071 -38098 -54936 -35440 -1604 42248 29476 17587 -10292 32374 44468 29953
6004B9953k7462k5979K1009L5956k285m5721k2447j0456o794j2396J9381K1551
$$ 29953 2491 -23488 -2479 33477 31192 -14529 -36976 -47432 -54226 -66622 -47241 -25690
5992b5690K7597L290k7361P995L3925p36n968p374K2155j116n291L979k6954j5651
$$ -25690 1907 5197 -22164 -14169 19756 19020 13052 5678 27833 26717 21426 25405 -1549 -17200
5978a7200J155K4235N751j86k3437k7023j9466J7053K3434N1308L3096r932m1453
$$ -17200 -16045 8190 13941 13755 -9682 -36705 -56171 -39118 -15684 35624 68720 58788 17335
5965A7335k1269l1450K5343j1719L0148O460l5580K5263L014k352r309O407j4608
$$ 17335 -3934 -35384 -10041 -21760 8388 14848 -20732 4531 7545 5193 -4116 2291 -12317
5952a2317o767P122M3388J5980q2066p4793J0574N3317L4301J005M2801M2015
$$ -12317 -19084 -11962 31426 47406 -34660 -109453 -98879 -45562 -11261 -10256 32545 74560
5940G4560o296l6564k51J5754k9892j2287k5019k3793r374K0119J6209J2892j5581
$$ 74560 68264 31700 31449 47203 17311 5024 -19995 -43788 -53162 -33043 -16834 -3942 -19523
5927a9523R625K0592j3185k893K7524j9463n993n5854l7494L1738K6936K710K4546
$$ -19523 -9898 10694 -2491 -5384 22140 2677 -3316 -59170 -96664 -64926 -37990 -35280 -10734
5914a0734J6338j73J886j5938M9438J9466k2578k1699j2488K5429j6915k8426
$$ -10734 5604 5431 7317 -8621 40817 60283 37705 16006 3518 28947 12032 -16394
5902a6394J2913j5415O310l362K1189j8688j1381j4741K5074j5603l0407K4046
$$ -16394 -3481 -18896 -12586 -15948 5241 -13447 -24828 -39569 -14495 -30098 -60505 -36459
5890c6459M5637J9681k2116o50L640r939K8871l244q573p719j7553K1726r148
$$ -36459 9178 28859 6743 6093 9733 -206 28665 25421 16848 9129 -8424 13302 4154
5877D154j3078K7097k6569J4359K3730J3852P240n1305k0722J4000k421k5555
$$ 4154 -8924 18173 -8396 5963 29693 43545 50785 -520 -21242 -7242 -9663 -35218
5865c5218J3049R770L062J1011l496j7635q755q07q849K5692R837k7618q081M2152
$$ -35218 -22169 -12399 -9337 1674 -1822 -19457 -28212 -29019 -37868 -12176 -2339 -29957 -38038 4114
5851D114K2790j6064m1398k0526K1724j2468j0663k483j3598M4889L7635K0139
$$ 4114 26904 10840 -30558 -51084 -29360 -41828 -52491 -54974 -68572 -23683 13952 34091
5839C4091P428k6061P926k2469k0840M912K0878M251M611K549o720l4341O233
$$ 34091 41519 15458 23384 915 -19925 -15013 5865 10116 14727 17276 10556 -23785 -17552
5826a7552K0686k6801j5940J8154J1376K8762l6891l0965l6969j429M6797L0975
$$ -17552 3134 -23667 -39607 -21453 -10077 18685 -18206 -49171 -86140 -87569 -40772 -9797
5814i797J5825j5684L4247J3031l737l885J4161l3252j5539J0845k4810j3675
$$ -9797 6028 -9656 24591 37622 33885 30000 44161 10909 -4630 6215 -18595 -32270
5802c2270M062J9180J7267j2094l345J2625k880n112J8093J170L449m539m5079
$$ -32270 -28208 -9028 8239 -3855 -7200 5425 2545 -2567 15526 16696 20145 15606 -29473
5789b9473k678K3839r750K4795k5966m5534J0729K8068o151o284J5503o994r642
$$ -29473 -32151 -8312 -18062 6733 -19233 -64767 -54038 -25970 -32121 -38405 -22902 -29896 -39538
5776c9538N642J014j4982K0430L4586P971k64k510K5063l8163q821N373J81J0131
$$ -39538 -33896 -32882 -47864 -27434 7152 15123 14859 12349 37412 -751 -9572 -4199 -4018 6113
5762F113j6685j1071N620q555r636k156k3457K162M3415N033N07l5415l7380N919
$$ 6113 -10572 -21643 -16023 -24578 -34214 -36370 -59827 -57665 -14250 -9217 -8710 -44125 -81505 -75586
5748g5586K0651J3680J2338K2788K3417j1936l5808J185K0619J9146k368l200
$$ -75586 -54935 -41255 -28917 -6129 17288 5352 -30456 -29271 -8652 10494 8126 4926
5736D926l2950l1180l3514n0061K8198J3553J394P5372K4223q017J9301j4188
$$ 4926 -28024 -59204 -92718 -142779 -114581 -101028 -99634 -24262 -39 -8056 11245 -2943
5724b943l2448k4800j6463m583N130m844J4272m5136m348M0880K5699J459J3692
$$ -2943 -35391 -60191 -76654 -81237 -76107 -80951 -66679 -111815 -116163 -75283 -49584 -48125 -34433
5711c4433J8024J9190J0377k0604J8767k2420m1325J7248K4330j7967o131j2855
$$ -34433 -16409 2781 13158 -7446 11321 -11099 -52424 -35176 -10846 -28813 -34944 -47799
5699d7799N892r834M1260L1118N819l2764l2227J3257K4697k0905m0808J2620
$$ -47799 -41907 -51741 -10481 20637 26456 -6308 -38535 -25278 -581 -21486 -62294 -49674
5687d9674J7694Q588L8456K1744j1693l265J059l7220J223P258k1985K052N0473
$$ -49674 -31980 -23392 15064 36808 25115 21850 22909 -14311 -13088 -5830 -27815 -25763 24710
5674B4710J0315j3805j752K5029r247j0961j4481j9189J0341K7837J4859j0077
$$ 24710 35025 21220 19468 44497 35250 24289 9808 -9381 960 28797 43656 33579
5662C3579n595j9522j2350L161j5064k5744J5794O528k2044O257N834q875k9850
$$ 33579 27984 8462 -3888 -727 -15791 -41535 -25741 -19213 -41257 -35000 -29166 -38041 -67891
5649f7891L9111m31k8492j8119M565P809O2886L7476j8439l5728l0315n0688N141
$$ -67891 -28780 -29211 -57703 -75822 -71257 -63448 -562 36914 18475 -17253 -47568 -98256 -93115
5636i3115N2895J1103P332J0939J6964K3998J7651k4113l2628J5882K1512l1467
$$ -93115 -40220 -29117 -21785 -10846 6118 30116 47767 23654 -8974 6908 28420 -3047
5624c047j7228L5767J6870m3485j4745O059j4406j112K7684L2391m366k1275j8464
$$ -3047 -20275 15492 32362 -11123 -25868 -19809 -34215 -35327 -7643 24748 20382 -893 -19357
5611a9357k382J8528K5981m7893q828J307r656n613L4311J0881l9888k3852J0790
$$ -19357 -21739 -3211 22770 -25123 -33951 -32644 -42300 -47913 -13602 -2721 -42609 -66461 -55671
5598e5671K3432J6594M127k783J8089K0629j5392R133J1868J0349k87n083m1709
$$ -55671 -32239 -15645 -11518 -14301 3788 24417 9025 18158 30026 40375 40088 35005 -6704
5585f704o460L2424k2785q875J2327j5929K4987O965j3254n0924P511K6768J4597
$$ -6704 -13164 19260 -3525 -12400 -73 -16002 8985 15950 2696 -48228 -40717 -13949 648
5572F48n106k7310k8644J1822K3574M9993M930J0513o118k7128k7211q734l800
$$ 648 -4458 -31768 -60412 -48590 -25016 24977 29907 40420 34302 7174 -20037 -28771 -32571
5559c2571r620j1967L4334N1496j3839j9477j6678j03k633j6576J3277K2845j715
$$ -32571 -42191 -54158 -19824 31672 17833 -1644 -18322 -18425 -21058 -37634 -24357 -1512 -3227
5546c227K891l1909k3599K12J460J2321K7081J4302r446q073m3782J7854K6744
$$ -3227 -336 -32245 -55844 -55632 -54172 -41851 -14770 -468 -9914 -17987 -61769 -43915 -17171
5533a7171l034J601J5796k1579P302K221p343J0230O58j5109J578o04J913J7634
$$ -17171 -20205 -18604 -2808 -24387 -17085 -14864 -22207 -11977 -11319 -26428 -24850 -25454 -23541 -5907
5519e907l3529j4360J0754l894J6636p896j0530Q480o237n311J7924J387p674
$$ -5907 -39436 -53796 -43042 -46936 -30300 -38196 -48726 -40246 -46483 -51794 -33870 -32483 -40157
5506d0157l0156J9519M1223n836O368L2505N826k6045k3350q407k5097j5947l0401
$$ -40157 -70313 -50794 -9571 -15407 -9039 23466 29292 3247 -20103 -28510 -53607 -69554 -99955
5493i9955K9732K3294J6874J6120k2339K0799J1347P882n759J7758K2283j2415
$$ -99955 -70223 -46929 -30055 -13935 -36274 -15475 -4128 3754 -2005 15753 38036 25621
5481B5621k4244L1559j7564k0018l4390m5163N1495K1010J8882N615j0422K620
$$ 25621 1377 32936 15372 -4646 -39036 -84199 -32704 -11694 7188 12803 2381 5001
5469E001o24o701L850L0212j8942j8891m757M1136q22k9986k011J91O31J4196
$$ 5001 4377 -2324 1526 31738 12796 -6095 -10852 30284 29462 -524 -2535 -2344 -1713 12483
5455A2483n4924J4686r313r770J833j8716J2831J0277J4958M9071P671p875R646
$$ 12483 -42441 -27755 -37068 -46838 -45005 -63721 -50890 -40613 -25655 23416 31087 23212 32858
5442C2858R751k6304p694L7397k5850j9655k2231j4465O247j0980j8903K2643
$$ 32858 42609 16305 8611 46008 20158 503 -21728 -36193 -29946 -40926 -59829 -37186
5430c7186J0249L2257M9969l609l1404l6172r163J5500P219J5168k5158N11o439
$$ -37186 -26937 5320 55289 51680 20276 -15896 -25059 -9559 -2340 12828 -12330 -11819 -18258
5417a8258J7206K908l687J9870j20Q186n8762k6981m040K932J1562K7524K3394
$$ -18258 -1052 1856 -1831 18039 17919 26105 -32657 -59638 -63678 -60746 -49184 -21660 1734
5404A734L1832K969m6280J23L744l1921l1560J6461r479M8018K6708k5263J799
$$ 1734 33566 36535 -9745 -9622 -5878 -37799 -69359 -52898 -62377 -14359 12349 -12914 -11115
5391a1115K1357L571j4813m2266o688n059O442J3400N549M692j7158K7223K3039
$$ -11115 10242 13813 -1000 -43266 -49954 -55013 -48571 -35171 -29622 -24930 -42088 -14865 8174
5378H174o966k394K9733J3658R998L050j8087r305j6098l333Q288J3063M101r107
$$ 8174 1208 -1186 28547 42205 52203 55253 37166 27861 11763 8430 16718 29781 33882 24775
5364B4775k0803L834j4771o2860O64J0706K9951J9089n264J9346M9245K2697k6916
$$ 24775 3972 7806 -6965 -69825 -69161 -58455 -28504 -9415 -14679 4667 53912 76609 49693
5351D9693m4118k0933n897K037j6953K3209j3869j8695L2728K7641L7621J7552
$$ 49693 5575 -15358 -21255 -19218 -36171 -12962 -26831 -45526 -12798 14843 52464 70016
5339G0016j5365J2196J2869l595j0470K857q168k022n3590N301M2307j6440m1912
$$ 70016 54651 66847 79716 76121 65651 68508 60340 58318 4728 10029 52336 35896 -6016
5326f016o722j7142L8820L8111p23m2511r850L6379j823l0134J1016M1663k8641
$$ -6016 -12738 -29880 8940 47051 46328 3817 -6033 30346 28523 -1611 9405 51068 22427
5313B2427p295K3070k5271m8220J4835m04m312q016Q626K0321j4912n673l1381
$$ 22427 15132 38202 12931 -35289 -20454 -20858 -25170 -33186 -24560 -4239 -19151 -24824 -56205
5300e6205J700J6266J2006R990k8884k89j4095K5935K0258K476K688K9236J5782
$$ -56205 -54505 -38239 -26233 -16243 -45127 -45416 -59511 -33576 -13318 -10842 -8154 21082 36864
5287C6864O953K993j1989n0124k3595L538K2317O310k1413k3960K7701k195J8973
$$ 36864 43817 46810 34821 -15303 -38898 -35360 -13043 -6733 -28146 -52106 -24405 -26600 -7627
5274g627J4328J8415j8810k305m5233j1713L3304K7592K7881k1681K4457k1858
$$ -7627 6701 25116 6306 4001 -41232 -52945 -19641 7951 35832 14151 38608 16750
5262A6750j6824M87J2165K233k9920N174J2002r041n193L5943M328K943K9833
$$ 16750 -74 413 12578 14811 -15109 -9935 2067 -6974 -12167 23776 28104 31047 60880
5249F0880m5096p6026K1484L7189p213K0951o728j7280k6027N0806Q646R986k5913
$$ 60880 15784 -60242 -38758 -1569 -8782 12169 5441 -11839 -37866 12940 21586 31572 5659
5236E659m5444k5734J6007M8212j0010j6095l633l410J0955J7657K7616j2137
$$ 5659 -39785 -65519 -49512 -1300 -11310 -27405 -31038 -34448 -23493 -5836 21780 9643
5224I643j5927k3921r225K5555J2774k0415l117J6330J6381k3623N931J5743O1099
$$ 9643 -6284 -30205 -39430 -13875 -1101 -21516 -24633 -8303 8078 -15545 -9614 6129 67228
5211F7228K5584n3817r402l299k2806p779O419r833M3891K0229o7364l7286J620
$$ 67228 92812 38995 29593 26294 3488 -4291 2128 -7705 36186 56415 -10949 -48235 -46615
5198d6615J4283J6803M6000k292j9447K0783j7664j0412J5716J7116j9106r442
$$ -46615 -32332 -15529 30471 28179 8732 29515 11851 1439 17155 34271 15165 5723
5186E723l5667k1801L9506J5880n209p943j1923O137P139k7661n4572J9403O1463
$$ 5723 -29944 -51745 -12239 3641 -1568 -9511 -21434 -15297 -8158 -35819 -90391 -70988 -9525
5173i525k1310l3930J8964M2489r681m025L767J2339L3589j7996m3010p290J0824
$$ -9525 -30835 -64765 -45801 -3312 -12993 -17018 -13251 -912 32677 14681 -28329 -35619 -24795
5160b4795k3532mJ6837N553K882J0500j1970k7359J7203m317R473J3901m1664
$$ -24795 -48327 -48331 -31494 -25941 -23059 -12559 -24529 -51888 -34685 -39002 -29529 -15628 -57292
5147e7292k9823L2715M5551L9701K5934j2029j9813l3782k4636J4840J1060j2979
$$ -57292 -87115 -54400 -8849 30852 56786 44757 24944 -8838 -33474 -18634 -7574 -20553
5135b0553J103M8862L7242k0880k6910O019o266o33m496P279k5134j4206K4302
$$ -20553 -19450 29412 66654 45774 18864 24883 18617 17984 13488 20767 -4367 -18573 5729
5122E729j4747l698l916J9314J9751k0381J3764j3297J4621K351j1531K3586L5135
$$ 5729 -9018 -12716 -16632 2682 22433 2052 15816 2519 17140 19491 7960 31546 66681
5109F6681l991l8575k117k1873m1548n466L7963M2098m147j1360j4423K5307l3169
$$ 66681 62690 24115 21998 125 -41423 -46889 -8926 33172 29025 17665 3242 28549 -4620
5096d620Q772K2938k2455k6563L4912L2035l0558J8398m195j8450j7135Q908J5428
$$ -4620 4152 27090 4635 -21928 12984 45019 14461 32859 28664 10214 -6921 1987 17415
5083A7415N426j3296j1789Q233K483k3622k6844k0160K9296R447J3925L199R472
$$ 17415 22841 9545 -2244 5989 8472 -15150 -41994 -62154 -32858 -23411 -9486 -6287 3185
5070C185J7145K4363l4024m9158J3405J7653L8784L9593l980j5905l2985l3342
$$ 3185 20330 44693 10669 -38489 -25084 -7431 31353 70946 66966 51061 18076 -15266
5058a5266l3576Q969j8604p001M026K0412J2432O170J7542M358K827Q265k8357
$$ -15266 -48842 -39873 -58477 -65478 -61452 -41040 -28608 -22438 -4896 -538 2289 10554 -17803
5045a7803j2721j6697J5723J1642j5184L966R809j4145L2609O7059K8659l3826
$$ -17803 -30524 -47221 -31498 -19856 -35040 -31074 -21265 -35410 -2801 64258 92917 59091
5033E9091j1545j2792j639m2358j5272k0339M487L1975J1247J1109Q183j160M358
$$ 59091 47546 34754 33115 -9243 -24515 -44854 -40367 -8392 2855 13964 22147 20987 25345
5020B5345j7199m4432j260L7371M1323l764j2707N49J8585K6190j9256k9504q265
$$ 25345 8146 -36286 -37546 -175 41148 37384 24677 25226 43811 70001 50745 21241 12976
5007A2976N98j2103P366L0863j8552l4984j0832j2534M5123J0083l1903P487k754
$$ 12976 13574 1471 8837 39700 21148 -13836 -24668 -37202 7921 18004 -13899 -6412 -9166
4994i166p218j6350K70J5016N082j7300L697o539p502L0912j1074m036J2465L1552
$$ -9166 -16384 -32734 -32464 -17448 -12366 -29666 -25969 -32508 -40010 -9098 -20172 -24208 -11743 19809
4980A9809L224l1009k279O124j1265r3J3487j2567k8395l1216J1536K1400K3538
$$ 19809 23033 -7976 -10255 -4131 -15396 -15489 -2002 -14569 -42964 -74180 -62644 -41244 -17706
4967a7706k1912k3047q750J1424k781J5860K1211j0569j290K239M5075K1390K212
$$ -17706 -39618 -62665 -71415 -59991 -62772 -46912 -25701 -36270 -37560 -35321 9754 31144 33356
4954C3356J631o359m749K8323K0599J0290m1818m1941j4317J0589m6934k0990
$$ 33356 34987 28628 23879 52202 72801 83091 41273 -668 -14985 -4396 -51330 -72320
4942g2320K3165L9429K9236n081k2451l3896j4668L0696j0743L2797M0445l0264
$$ -72320 -49155 -9726 19510 14429 -8022 -41918 -56586 -25890 -36633 -3836 36609 6345
4930F345o4792k720L8982L3669P157o976k8650n9363K8467J7254K2606M7518Q925
$$ 6345 -58447 -61167 -22185 11484 18641 11665 -16985 -76348 -47881 -30627 -8021 39497 48422
4917D8422m7383l2116l043J3813O978K1069K237j2504Q11k7745J5693K4813l0911
$$ 48422 1039 -31077 -34120 -20307 -13329 7740 9977 -2527 -1716 -29461 -13768 11045 -19866
4904a9866Q634J5960K4241j0981k6360m5617n175J3870N2340K5730j6713k8227
$$ -19866 -11232 4728 28969 17988 -8372 -53989 -59164 -45294 7046 32776 16063 -12164
4892a2164l7993o285J9435O402j4791o09K3038j7287j5783r78l894L0804J4236
$$ -12164 -50157 -56442 -37007 -30605 -45396 -46005 -22967 -40254 -56037 -57015 -60909 -30105 -15869
4879a5869p445L3836j2470o1789o370J4636P58M7140K4041M9639j5075K582r439
$$ -15869 -23314 10522 -1948 -63737 -70107 -55471 -54713 -7573 16468 66107 51032 53614 44175
4866D4175R556j8023O973O533O627j3685k9233q885L817m987P860j4624k9442
$$ 44175 53731 35708 42681 49214 55841 42156 12923 4038 7855 2868 10728 -3896 -33338
4853c3338k9502K3275j7458J005P721J7868j0275J1357J1877M3068J6127o571
$$ -33338 -62840 -39565 -57023 -56018 -48297 -30429 -40704 -29347 -17470 25598 41725 35154
4841C5154j7859L1916L1883K533L7432j4205p3835m7422j1353k4071Q439J8745
$$ 35154 17295 49211 81094 83627 121059 106854 33019 -14403 -25756 -49827 -41388 -22643
4829b2643J9095K7158N760m916O65j6225l4193n723k6847k5968K595K2584K609
$$ -22643 -3548 23610 29370 24454 25119 8894 -25299 -31022 -57869 -83837 -81242 -58658 -56049
4816e6049kK0820O2952J9767m4072k3483J7555l0248q790K4180M6411J1842j1858
$$ -56049 -56051 -35231 27721 47488 3416 -20067 -2512 -32760 -41550 -17370 29041 40883 29025
4803B9025n496Q079j1624m6203l3466j1128L7809N5917J5032k0819k2189N082
$$ 29025 23529 31608 19984 -26219 -59685 -70813 -33004 22913 37945 17126 -5063 19
4791A9J4449k4808l693q925k6394M759M6588l308l1844l6011K2570L0552l04Q896
$$ 19 14468 -10340 -14033 -22958 -49352 -44593 1995 -1313 -33157 -69168 -46598 -16046 -16350 -7454
4777g454J2294r465m5333l868L557J2608N2769o659m4560j1965L8003r536l9523
$$ -7454 4840 -4625 -49958 -53826 -50269 -37661 15108 8449 -36111 -48076 -10073 -19609 -59132
4764e9132K8755L2735K8831k3952r972j7351J2060l040J2579j1699O058K0427
$$ -59132 -30377 2358 31189 7237 -2735 -20086 -8026 -11066 1513 -10186 -4128 16299
4752A6299M681j4935J9338k453k6170n384j1144J0469J3137K1556k5806k4622
$$ 16299 20980 6045 25383 22930 -3240 -8624 -19768 -9299 3838 25394 -412 -25034
4740b5034l0288j9520K7963N1093j3053p88l3578j021P144K2201k9606m606K0927
$$ -25034 -55322 -74842 -46879 4214 -8839 -9627 -43205 -44226 -37082 -14881 -44487 -49093 -28166
4727b8166J2654J9207k2869m8101m18K8512K0368N3368Q191J9117k1527n2468
$$ -28166 -15512 3695 -19174 -67275 -67693 -39181 -18813 34555 42746 61863 40336 -12132
4715a2132k4859K0482k2288l3987j5641L7670j098j2953j3338j6613P977N747
$$ -12132 -36991 -16509 -38797 -72784 -88425 -50755 -51853 -64806 -78144 -94757 -86780 -81033
4703h1033m319j8827L8088O1144J0305m0531m499q529k0379j5575J8919k5556
$$ -81033 -85352 -104179 -66091 -4947 5358 -35173 -39672 -48201 -68580 -84155 -65236 -90792
4691i0792j2857O7868J7782K1884K6320r662j6733l3516l5001Q59J9352k280J3419
$$ -90792 -103649 -35781 -17999 3885 30205 20543 3810 -29706 -64707 -63848 -44496 -46776 -33357
4678c3357J1873L5495L3275J7222J4742j2054m1865n0899j6314O598j7263J3992
$$ -33357 -21484 14011 47286 64508 79250 67196 25331 -25568 -41882 -35284 -52547 -38555
4666c8555M0980k2073k1369k3705l1239L279M5898P7587K479k0892N935j1970
$$ -38555 2425 -19648 -41017 -64722 -95961 -92682 -46784 30803 33282 12390 18325 6355
4654F355l0902k279r009k3290J0142Q941k578K3431K6759J6129m0353j0234j2388
$$ 6355 -24547 -26826 -35835 -59125 -48983 -40042 -42620 -19189 7570 23699 -16654 -26888 -39276
4641c9276Q274j1903J6295j9645k6473k9072M9684M1304l287m804r196p07L6358
$$ -39276 -31002 -42905 -26610 -46255 -72728 -101800 -52116 -10812 -14099 -18903 -28099 -28806 7552
4628G552R324N189K112O998M607j258m6630l7735L569K0378N3325K0006m216l9822
$$ 7552 16876 22065 24177 31175 35782 34524 -12106 -49841 -46272 -25894 27431 47437 43221 3399
4614C399l1589K33q411L974K4231j2130p04K838k0153j1395M561K6319J3503j8109
$$ 3399 -28190 -27957 -36368 -32394 -8163 -20293 -20997 -18159 -38312 -49707 -45146 -18827 -5324 -23433
4600b3433N604J0085P94L0500l010j5702O0j4053P760j8053J9778k3586j3591
$$ -23433 -17829 -7744 -6950 23550 20540 4838 4898 -9155 -1395 -19448 330 -23256 -36847
4587c6847L2131L5784L8462N609j2877m9909n0693k0265L936Q002K912k121n006
$$ -36847 -4716 31068 69530 75139 62262 12353 -38340 -58605 -54669 -46667 -43755 -45876 -50882
4574e0882k5956J4091L6987K6228P782j7280j5589r226L618J7805M724K1067l6901
$$ -50882 -76838 -62747 -25760 468 8250 -9030 -24619 -33845 -30227 -12422 -7698 13369 -23532
4561b3532m685K0732P346K7982J0265k0440j3626L090j709N722j2109J3606L3483
$$ -23532 -28217 -7485 -139 27843 38108 17668 4042 7132 5423 11145 -964 12642 46125
4548D6125J587l3154l4577M0872K5778L426m0581p180j0346O743K2091L2989l5577
$$ 46125 47712 14558 -20019 20853 46631 50057 9476 2296 -8050 -1307 20784 53773 18196
4535A8196n2532m5460J2928M9502K9285J4389J3942k0365L152J884k0722m3903
$$ 18196 -34336 -79796 -66868 -17366 11919 26308 40250 19885 23037 24921 4199 -39704
4523c9704R834J6036l4033j7885K4931J1447O9681J9602m1125k0105K6040Q745
$$ -39704 -29870 -13834 -47867 -65752 -40821 -29374 40307 59909 18784 -1321 24719 33464
4511C3464j1295j445p996K2575j5817q640N185J2799j7003l1197O642L1406O059
$$ 33464 22169 20724 12728 35303 19486 10846 16031 28830 11827 -19370 -12728 18678 24737
4498B4737j6206K6818n914l9354m9963k3218j0007J8180J2591j423L568J4848
$$ 24737 8531 35349 29435 -9919 -59882 -83100 -93107 -74927 -62336 -63759 -60191 -45343
4486d5343O591K4432J4592N066l9202o815P910J8341K003j5259J3159M7458k8484
$$ -45343 -38752 -14320 272 5338 -33864 -40679 -32769 -14428 -12425 -27684 -14525 32933 4449
4473D449p228K308q182K1418J5545l1466o1986k0593K7009M7191K3396j9216J1491
$$ 4449 -2779 -471 -8653 12765 28310 -3156 -65142 -85735 -58726 -11535 11861 -7355 4136
4460D136p02L356K0107J3137k9588j1347j3895P30M5742M0663n2530o3023K892
$$ 4136 3434 6790 26897 40034 10446 -901 -14796 -14066 31676 72339 19809 -43214 -40322
4447d0322j0501k0202K7161L3032N5186K7887k3735l9950k6348J5234Q241j2376
$$ -40322 -50823 -71025 -43864 -10832 44354 72241 48506 8556 -17792 -2558 5683 -6693
4435f693M811L1286O931l0637m2506j6132R448O120k0149Q637O832J9259L823
$$ -6693 -1882 29404 36335 5698 -36808 -52940 -43492 -37372 -57521 -48884 -42052 -22793 -18970
4422a8970n0657k0096L0927M8869R301K7191Q947m4503J66l9017m47n360O163
$$ -18970 -69627 -89723 -58796 -9927 -626 26565 35512 -8991 -8825 -47842 -48289 -53649 -47486
4409d7486K2015L213n003j6535J5675O5178k1682k8286k6564k5075k2293p483
$$ -47486 -25471 -22258 -27261 -43796 -28121 37057 15375 -12911 -39475 -64550 -86843 -94326
4397i4326R624L2390K6125L5544j8272m7367K2432M2295p973Q207J4595l4883
$$ -94326 -84702 -52312 -26187 9357 -8915 -56282 -33850 8445 472 8679 23274 -11609
4385a1609m119p062J4799L4294N243m0005q791N352j966n1493R554O0036L8251
$$ -11609 -15728 -22790 -7991 26303 31546 -8459 -17250 -11898 -13864 -65357 -55803 4233 42484
4372D2484l2684n2589l9496P093K5483K7412M899M138R66j2374k6357K1210J0333
$$ 42484 9800 -42789 -82285 -75192 -49709 -22297 -17398 -13260 -12294 -24668 -51025 -29815 -19482
4359a9482j0415J5787k8136j834N5701M7631j3364k7798K7475K256j2978R979
$$ -19482 -29897 -14110 -42246 -44080 11621 59252 45888 18090 45565 47821 34843 44822
4347D4822j6392j7982j186j285N654k6886K2955K0042n365k5611k9246J1934O47
$$ 44822 28430 10448 9262 7977 13631 -13255 9700 29742 24377 -1234 -30480 -18546 -17899
4334a7899J3029R22L935R042p998m022K1379K4405j4178j9860j9191J7418K7323
$$ -17899 -4870 -3948 -13 9029 1031 -2991 18388 42793 28615 8755 -10436 6982 34305
4321C4305j1550k5326k9777k153M833Q459q893L981L2518J2913j6243J5090O540
$$ 34305 22755 -2571 -32348 -34501 -29668 -21209 -30102 -26121 6397 19310 3067 18157 24697
4308B4697J6639Q558K3302j161k9604j5530j1626K3802r197l9461l9334m264k708
$$ 24697 41336 49894 73196 72035 42431 26901 15275 39077 29880 -9581 -48915 -53179 -55887
4295e5887K2944k4361m3973J5843L6199M3008j2063k2313j3205K6632K7509j1980
$$ -55887 -32943 -57304 -101277 -85434 -49235 -6227 -18290 -40603 -53808 -27176 333 -11647
4283a1647K7114O922o596K7659j5476k8003K765j142M763J7737M189J2741j9121
$$ -11647 15467 22389 15793 43452 27976 -27 2738 1596 6359 24096 28285 41026 21905
4270B1905m143J6064k1241n2295q336P620j5003K5393J1865o848j3044K396J4501
$$ 21905 17762 33826 12585 -39710 -48046 -40426 -55429 -30036 -18171 -25019 -38063 -35667 -21166
4257b1166K9979j7683R470l878l8638M312K7208r835k1394j8697L5293K3392O653
$$ -21166 8813 -8870 600 -3278 -41916 -37604 -10396 -20231 -41625 -60322 -25029 -1637 5016
4244E016K6307o995J3903p021j7083k2233M3758K919l663J2110L776r896L143
$$ 5016 31323 24328 38231 31210 14127 -8106 35652 38571 34908 47018 50794 40898 44041
4231D4041J3171p801o0708k0168L7126N0318J6839l7245J21k395j3840J5464q033
$$ 44041 57212 49411 -11297 -31465 5661 55979 72818 35573 35694 33299 19459 34923 26890
4218B6890L091m2236j5170R029O177j3272j5726J9369K0724K9187L1162L0618
$$ 26890 29981 -12255 -27425 -18396 -12219 -25491 -41217 -21848 -1124 28063 59225 89843
4206H9843k7155n0639k0907o138J5277q528l4278j6371M4321J5567m512K6302
$$ 89843 62688 12049 -8858 -14996 281 -8247 -42525 -58896 -14575 992 -3520 22782
4194B2782J9564K35k6660o692J1882L0386j6487n34K995l774l3993k9864k761
$$ 22782 42346 42581 15921 9229 21111 51497 35010 34476 37471 33697 -296 -30160 -32921
4181c2921J6582Q572Q01j4599j684J0832P584J1098j4325j1378j6593J6737J7814
$$ -32921 -16339 -7767 -6966 -21565 -23249 -12417 -4833 6265 -8060 -19438 -36031 -19294 -1480
4168a480j1417L3865l2188l8238n622J5857J3317K435K7373o849m0025o695J9382
$$ -1480 -12897 20968 -11220 -49458 -55080 -39223 -25906 -23471 3902 -2947 -42972 -49667 -30285
4155c0285j1291J7581R963L971j0509K6669J5326j7393m297j1019j0442K139J5277
$$ -30285 -41576 -23995 -14032 -10061 -20570 6099 21425 4032 -265 -11284 -21726 -19587 -4310
4142d310Q009j6196j5299L52j1442K1433J5015q933Q791J9447q58l4407k5695
$$ -4310 3699 -12497 -27796 -27444 -38886 -17453 -2438 -11371 -2580 16867 16009 -18398 -44093
$$ [...]
##END NTUPLES=NMR SPECTRUM
##END=
