##TITLE=Analysis number 326312
Compound Code sew 02031
Project Code adrs
Chemist Name aci
##JCAMPDX= 6.0         $$ Bruker NMR JCAMP-DX V2.0
##DATA TYPE= NMR SPECTRUM
##DATA CLASS= NTUPLES
##ORIGIN= Bruker BioSpin GmbH
##OWNER= nmr
$$ XWIN-NMR		Version 3.5
$$ Thu Feb  1 11:28:11 2007 GMT Standard Time (UT+0h)  MAYBRIDGE\nmr@NMR_250MHZ
##.OBSERVE FREQUENCY= 250.131544655141
##.OBSERVE NUCLEUS= ^1H
##.ACQUISITION MODE= SIMULTANEOUS (DQD)
##.ACQUISITION SCHEME= undefined
##.AVERAGES= 16
##.DIGITISER RES= 18
##SPECTROMETER/DATA SYSTEM= dpx250
##.PULSE SEQUENCE= zg30
##.SOLVENT NAME= CDCl3
##.SHIFT REFERENCE= (INTERNAL, CDCl3, 0, 16.522)
##AUDIT TRAIL= $$ (NUMBER, WHEN, WHO, WHERE, WHAT)
$$ ##TITLE= Audit trail, XWIN-NMR		Version 3.5
$$ ##JCAMPDX= 5.01
$$ ##ORIGIN= Bruker BioSpin GmbH
$$ ##OWNER= nmr
$$ C:\u/data/dgb/nmr/ADRS/80/pdata/1/auditp.txt
$$ ##AUDIT TRAIL=  $$ (NUMBER, WHEN, WHO, WHERE, WHAT)
(   1,<2007-02-01 11:27:51.60 +000>,<MAYBRIDGE\nmr>,<NMR_250MHZ>,
      <created by zg, POWCHK disabled, PULCHK disabled
       configuration hash MD5:
       49 4B E0 1D 92 C2 6B 37 9F E6 65 BC 52 41 86 1D
       data hash MD5: 64K
       60 4D 10 5B F7 DA E1 76 42 11 A9 47 0A F5 32 8A>)
(   2,<2007-02-01 11:28:03.31 +000>,<MAYBRIDGE\nmr>,<NMR_250MHZ>,
      <Start of raw data processing
       ef LB = 0.3 FT_mod = 6 PKNL = 1 SI = 32K 
       data hash MD5: 32K
       9A FD 17 90 89 FC 28 D1 6C B1 F0 5D 5C 8F 22 53>)
(   3,<2007-02-01 11:28:04.95 +000>,<MAYBRIDGE\nmr>,<NMR_250MHZ>,
      <apk 
       data hash MD5: 32K
       75 BF 5C 87 BC 52 62 C1 FC 61 EF 9A BA A6 2D F9>)
(   4,<2007-02-01 11:28:05.66 +000>,<MAYBRIDGE\nmr>,<NMR_250MHZ>,
      <abs ABSG = 5 
       data hash MD5: 32K
       18 19 28 05 13 B6 83 63 A2 67 1F 92 AE A6 79 0B>)
$$ ##END=
$$ 
$$ hash MD5
$$ D5 78 40 CB 62 F1 11 39 A1 A4 57 06 24 EF 87 C0
##$RELAX= 
##$RELAX= 
##$RELAX= 
##$RELAX= 
##$RELAX= 
##$RELAX= 
##$RELAX= 
$$ Bruker specific parameters
$$ --------------------------
##$DU= <C:\u>
##$EXPNO= 80
##$NAME= <ADRS>
##$PROCNO= 1
##$TYPE= <nmr>
##$USER= <dgb>
##$AMP= (0..31)
100 100 100 100 100 100 100 100 100 100 100 100 100 100 100 100 100 100 
100 100 100 100 100 100 100 100 100 100 100 100 100 100 
##$AQSEQ= 0
##$AQ_mod= 3
##$AUNM= <au_zg>
##$AUTOPOS= <50 >
##$BF1= 250.13
##$BF2= 250.13
##$BF3= 250.13
##$BF4= 250.13
##$BF5= 500.13
##$BF6= 500.13
##$BF7= 500.13
##$BF8= 500.13
##$BYTORDA= 1
##$CFDGTYP= 0
##$CFRGTYP= 5
##$CHEMSTR= <none>
##$CNST= (0..31)
1 1 145 1 1 1 1 1 1 1 1 1 1 1 1 1 1 1 1 1 1 1 1 1 1 1 1 1 1 1 1 1 
##$CPDPRG= <>
##$CPDPRG1= <>
##$CPDPRG2= <>
##$CPDPRG3= <>
##$CPDPRG4= <mlev>
##$CPDPRG5= <mlev>
##$CPDPRG6= <mlev>
##$CPDPRG7= <mlev>
##$CPDPRG8= <mlev>
##$CPDPRGB= <>
##$CPDPRGT= <>
##$D= (0..31)
0 1 0 0 0 0 0 0 0 0.06 0 0 0 0 0 0 0.0002 0 0 0 0 0 0 0 0 0 0 0 0 0 0 
0 
##$DATE= 1170329270
##$DBL= (0..7)
120 120 120 120 120 120 120 120 
##$DBP= (0..7)
150 150 150 150 150 150 150 150 
##$DBP07= 0
##$DBPNAM0= <>
##$DBPNAM1= <>
##$DBPNAM2= <>
##$DBPNAM3= <>
$$ [...]
##$SUBNAM7= <"">
##$SUBNAM8= <"">
##$SUBNAM9= <"">
##$SW= 20.6930455092707
##$SWIBOX= (0..15)
0 0 3 0 0 0 0 0 0 0 0 0 0 0 0 0 
##$SW_h= 5175.983436853
##$TD= 65536
##$TD0= 1
##$TE= 294.16
##$TE2= 300
##$TE3= 300
##$TEG= 300
##$TL= (0..7)
0 120 120 120 120 120 120 120 
##$TP= (0..7)
150 150 150 150 150 150 150 150 
##$TP07= 0
##$TPNAME0= <>
##$TPNAME1= <>
##$TPNAME2= <>
##$TPNAME3= <>
##$TPNAME4= <>
##$TPNAME5= <>
##$TPNAME6= <>
##$TPNAME7= <>
##$TPOAL= (0..7)
0.5 0.5 0.5 0.5 0.5 0.5 0.5 0.5 
##$TPOFFS= (0..7)
0 0 0 0 0 0 0 0 
##$TUNHIN= 0
##$TUNHOUT= 0
##$TUNXOUT= 0
##$USERA1= <user>
##$USERA2= <user>
##$USERA3= <user>
##$USERA4= <user>
##$USERA5= <user>
##$V9= 5
##$VALIST= <valist>
##$VCLIST= <CCCCCCCCCCCCCCC>
##$VD= 0
##$VDLIST= <DDDDDDDDDDDDDDD>
##$VPLIST= <PPPPPPPPPPPPPPP>
##$VTLIST= <TTTTTTTTTTTTTTT>
##$WBST= 1024
##$WBSW= 4
##$XGAIN= (0..3)
0 0 0 0 
##$XL= 0
##$YL= 0
##$YMAX_a= 285421
##$YMIN_a= -392056
##$ZGOPTNS= <>
##$ZL1= 120
##$ZL2= 120
##$ZL3= 120
##$ZL4= 120
##$ABSF1= 16.522
##$ABSF2= -4.171173
##$ABSG= 5
##$ABSL= 3
##$ALPHA= 0
##$AQORDER= 0
##$ASSFAC= 0
##$ASSFACI= 0
##$ASSFACX= 0
##$ASSWID= 0
##$AUNMP= <proc_1d>
##$AZFE= 0.1
##$AZFW= 0.1
##$BCFW= 0
##$BC_mod= 0
##$BYTORDP= 0
##$COROFFS= 0
##$CY= 12.5
##$DATMOD= 1
##$DC= 0
##$DFILT= <>
##$DTYPP= 0
##$F1P= 14.0000005364418
##$F2P= -0.99999901652339
##$FCOR= 0.5
##$FTSIZE= 32768
##$FT_mod= 6
##$GAMMA= 0
##$GB= 0
##$INTBC= 1
##$INTSCL= 1
##$ISEN= 128
##$LB= 0.3
##$LEV0= 0
##$LPBIN= 0
##$MAXI= 10000
##$MC2= 0
##$MEAN= 0
##$ME_mod= 0
##$MI= 0
##$NCOEF= 0
##$NC_proc= -3
##$NLEV= 6
##$NOISF1= 0
##$NOISF2= 0
##$NSP= 0
##$NTH_PI= 0
##$NZP= 0
##$OFFSET= 16.522
##$PC= 1
##$PHC0= 227.5017
##$PHC1= 8.541764
##$PH_mod= 1
##$PKNL= yes
##$PPARMOD= 0
##$PSCAL= 4
##$PSIGN= 0
##$REVERSE= no
##$SF= 250.13
##$SI= 32768
##$SIGF1= 0
##$SIGF2= 0
##$SINO= 400
##$SIOLD= 32768
##$SREGLST= <1H.CDCl3>
##$SSB= 0
##$STSI= 32768
##$STSR= 0
##$SW_p= 5175.98343685301
##$SYMM= 0
##$S_DEV= 0
##$TDeff= 65536
##$TDoff= 0
##$TI= <Analysis number 999999
Compound Code 99
Book Reference 9
Project Code 9>
##$TILT= no
##$TM1= 0
##$TM2= 0
##$TOPLEV= 0
##$USERP1= <user>
##$USERP2= <user>
##$USERP3= <user>
##$USERP4= <user>
##$USERP5= <user>
##$WDW= 1
##$XDIM= 32768
##$YMAX_p= 388065281
##$YMIN_p= -175009
$$ End of Bruker specific parameters
$$ ---------------------------------
##NTUPLES= NMR SPECTRUM
##VAR_NAME=  FREQUENCY,     SPECTRUM/REAL,   SPECTRUM/IMAG
##SYMBOL=    X,             R,               I
##VAR_TYPE=  INDEPENDENT,   DEPENDENT,       DEPENDENT
##VAR_FORM=  AFFN,          ASDF,            ASDF
##VAR_DIM=   32768,         32768,           32768
##UNITS=     HZ,            ARBITRARY UNITS, ARBITRARY UNITS
##FACTOR=    0.157963299565203, 1,           1
##FIRST=     4132.6476996994, 0,             0
##LAST=      -1043.33573715361, 0,           0
##MIN=       -1043.33573715361, -175009,     0
##MAX=       4132.6476996994, 388065281,     0
$$ Real data points
##PAGE= N=1
##DATA TABLE= (X++(R..R)), XYDATA
$$ [...]
18686B28542K2188l943k260J0824N5198Q5804M6679R455J7677J5332P957L4898
$$ 228542 250730 246787 244527 255351 310549 396353 443032 452487 470164 485496 493453 528351
18674E28351J4038j2443k8180J41M8589O8438R4356J04774J02841J27979J58314
$$ 528351 542389 529946 501766 501907 550496 618934 713290 818064 920905 1048884 1207198
18663A207198J81444K06746K26541K31913K51725L79336M78076O25278Q70488
$$ 1207198 1388642 1595388 1821929 2053842 2305567 2684903 3162979 3788257 4658745
18654D658745J192629J658289K276854K867325K878478J413716j615347l490371
$$ 4658745 5851374 7509663 9786517 12653842 15532320 16946036 15330689 11840318
18646A1840318k837243j466053m89244J03372P06404J441391K176909K569932
$$ 11840318 9003075 7537022 7047778 7151150 7857554 9298945 11475854 14045786
18638A4045786J894807p14359l460061l731227k493283j406743q11615n39279
$$ 14045786 15940593 15226234 11766173 8034946 5541663 4134920 3323305 2784026
18630B784026l95136k40129j51397j14758q6320m7807j1008q842K8608P4970J20853
$$ 2784026 2388890 2148761 1997364 1882606 1796286 1748479 1737471 1728629 1757237 1832207 1953060
18619A953060J19823J55628K00400K21019K49692L00926L81364M60812N69022
$$ 1953060 2072883 2228511 2428911 2649930 2899622 3200548 3581912 4042724 4611746
18610D611746P44205R59940J194703J510761K110437K933070L789534L951606
$$ 4611746 5355951 6315891 7510594 9021355 11131792 14064862 17854396 21806002
18602B1806002K465712o91094k362536r56841J399616L008419K833313K09387
$$ 21806002 24271714 23580620 21218084 20261243 21660859 24669278 27502591 27711978
18594B7711978l051400l641346j769860M98423K300197K993744J671998j533814
$$ 27711978 24660578 21019232 19249372 19747795 22047992 25041736 26713734 25179920
18586B5179920l899517m278736l647595k559307j403498o04204m62975j046507
$$ 25179920 21280403 17001667 13354072 10794765 9391267 8787063 8324088 7277581
18578G277581j515997j284016q69880n48862l16707k33665j94425j33285q3179
$$ 7277581 5761584 4477568 3607688 3058826 2742119 2508454 2314029 2180744 2097565
18569B097565l8377j0158M7493Q9115J06348J18013J34394J79341J96215K69242
$$ 2097565 2059188 2049030 2096523 2185638 2291986 2409999 2544393 2723734 2919949 3189191
18559C189191L42809M14634N04131O77293R03910J274978J792755K516819L370010
$$ 3189191 3532000 3946634 4450765 5128058 6031968 7306946 9099701 11616520 14986530
18550A4986530L854453K957416k06917l809824m477431k856448j227035k09687
$$ 14986530 18840983 21798399 21591482 17781658 13304227 10447779 9220744 9011057
18542I011057N85945J372537K328867L105563K895939P64540l037783n041317
$$ 9011057 9597002 10969539 13298406 16403969 19299908 20064448 17026665 11985348
18534A1985348m055221k463223j437069r07005o19036m55012l42352k36521j50851
$$ 11985348 7930127 5466904 4029835 3122830 2503794 2048782 1706430 1469909 1319058
18525A319058j33115r7425p6784m5678j0555p3913r2106r3081q8411m8708r310
$$ 1319058 1185943 1088518 1011734 966056 955501 881588 789482 696401 607990 559282 549972
18514E49972k9308J3486L3803j803l4101l8928l8005l3559l5219m3407K581k7468
$$ 549972 520664 534150 567953 566150 532049 493121 455116 421557 386338 342931 345512 318044
18502C18044j3602r989k3716j7883k7116k4028j8757J0855L2041K1397J5203K050
$$ 318044 304442 294453 270737 252854 225738 201710 182953 193808 225849 247246 262449 264499
18490B64499n1407r285m552k1276k9368K2444M3411k0924q738J3242k5073l4955
$$ 264499 213092 203807 199255 177979 148611 171055 214466 193542 184804 198046 172973 138018
18478A38018l4335k5115N992j762O301J6164J2754J0356L4302p389l0714r266
$$ 138018 103683 78568 84560 82798 89099 105263 118017 128373 162675 155286 124572 115306
18466A15306J8908j1117l784M354r350J0014K2440k9887m8867M9689L8150j3434
$$ 115306 134214 123097 119313 123667 114317 124331 146771 116884 68017 117706 155856 142422
18454A42422k9384m4948k6217M9445L2320j7879j6921j7202j9236J4977J4458
$$ 142422 113038 68090 41873 91318 123638 105759 88838 71636 52400 67377 81835
18443H1835k0460j1731m597k1582l957R049J0283P108M917K6270J6148J2484l5598
$$ 81835 61375 49644 45047 23465 19508 28557 38840 45948 50865 77135 93283 105767 70169
18430G0169K6295J3320j2979j5520k5599O402P357p102o8641l99l20K9874L7623
$$ 70169 96464 109784 96805 81285 55686 62088 69445 62343 -6298 -6697 -7017 22857 60480
18417F0480k3231k7242n919J1438J288R719j7752j71O7711K3696J975J7202K1575
$$ 60480 37249 10007 4088 15526 16814 26533 8781 8610 76321 100017 101992 119194 140769
18404A40769L123k8986k3123k8167P227K4912J1926o768j3355j6950l792n28j2883
$$ 140769 143892 114906 91783 63616 70843 95755 107681 100913 87558 70608 66816 66288 53405
18391E3405k5346N284m4238k5840K1719m820Q70K8599M7875P059q451J9757r787
$$ 53405 28059 33343 -10895 -36735 -15016 -19836 -18966 9633 57508 64567 56116 75873 66086
18378F6086j4796k879J8713J3690N995m0509j6068L1162J9333m178j9044O85J2735
$$ 66086 51290 48411 67124 80814 86809 46300 30232 61394 80727 76549 57505 58190 70925
18365G0925K5535M4769K2720k4421j7521K8257O7401M0462J0297K7608p893l2479
$$ 70925 96460 141229 163949 139528 122007 150264 217665 258127 268424 296032 288139 255660
18353B55660o070j7737L6653R049J3984M7845K5718j7229k6316l2485m1697k1175
$$ 255660 249590 231853 268506 277555 291539 339384 365102 347873 321557 289072 247375 226200
18341B26200N3717R916l7954k0386j6302m5126m8857o761J5963j2300n0475r755
$$ 226200 279917 289833 251879 231493 215191 170065 121208 114447 130410 118110 67635 57880
18329E7880J1945J2113k1577n5940p572L4388K6298j422n127J4145o961k8836
$$ 57880 69825 81938 60361 4421 -3151 31237 57535 56113 50986 65131 58170 29334
18317B9334J2525L3347J0642m574j4609R902n080j73K4642J6309J2934J6578j558
$$ 29334 41859 75206 85848 81274 66665 76567 71487 71314 95956 112265 125199 141777 140219
18304A40219O249K0250j888J5869j3660J7737m3469j4119J0293k1913n821J6281
$$ 140219 146468 166718 164830 180699 167039 184776 141307 127188 137481 115568 109747 126028
18292A26028M0854K3659L2701J2886n1099m130P922p527r467l4942R486m4654
$$ 126028 166882 190541 223242 236128 185029 180899 188821 181294 171827 136885 146371 101717
18280A01717K819o553k2561m4058o737o240P758N14m0379P886k1531L053j1206
$$ 101717 104536 97983 75422 31364 24627 18387 26145 26659 -13720 -5834 -27365 -24312 -35518
18267c5518l9321L0250K3037J2861K6528P172K966J0528J7603J2329m3327j0668
$$ -35518 -74839 -44589 -21552 -8691 17837 25009 27975 38503 56106 68435 25108 14440
18255A4440R04p107J522J7733K9294K1556L42K4707k6420R535j7864L4132J211
$$ 14440 15344 8237 9759 27492 56786 78342 78684 103391 76971 86506 68642 102774 103985
18242A03985J0247j2563n195O689J1163l0647k0911J1421N509K7670J8303l1974
$$ 103985 114232 101669 96474 103163 114326 83679 62768 74189 79698 107368 125671 93697
18230I3697j5555l9171o758J3846N003l3710l8395P551M965N502K2990j5276j0753
$$ 93697 78142 38971 32213 46059 51062 17352 -21043 -13492 -8527 -3025 19965 4689 -6064
18217f064o646M874K3818j2926k4850J9678K11N480J6560j5209J8900J1960p376
$$ -6064 -12710 -7836 15982 3056 -21794 -2116 -1905 3575 20135 4926 23826 35786 28410
18204B8410J1033P611r396j5272J5050J4773O902m3509J8346K1057J7929j8659
$$ 28410 39443 47054 37658 22386 37436 52209 59111 15602 33948 55005 72934 54275
18192E4275j2362M878L2875k7953n8463J4429L5675K0604n990M0067K7745l3827
$$ 54275 41913 46791 79666 51713 -6750 7679 43354 63958 57968 98035 125780 91953
18180I1953n0733k465K1550l9079k2360L7784J2210L178M425M6806J1377j3192
$$ 91953 41220 38755 60305 21226 -1134 36650 48860 52038 56463 103269 114646 101454
18168A01454L208m6510n230k389K4324R995k5368N019M156k3678P188M8918K3185
$$ 101454 104662 58152 52922 50533 74857 84852 59484 64503 68659 44981 52169 101087 124272
18155A24272K5922M515j0401J0446K9358j1799l5315p213K7527M3719K2548L2563
$$ 124272 150194 154709 144308 154754 184112 172313 136998 129785 157312 201031 223579 256142
18143B56142L9023M8765K0526P973N73r528L2279K5663L9351L9507K750P3918
$$ 256142 295165 343930 364456 372429 373002 363474 395753 421416 460767 500274 503024 576942
18131E76942Q1679N9466P7619J04475J51412J93386K31483L74830N43548O48093
$$ 576942 658621 718087 795706 900181 1051593 1244979 1476462 1851292 2394840 3042933
18121C042933O21224N87573O65351Q31421R94568J253438J493650J844779K627943
$$ 3042933 3664157 4251730 4917081 5748502 6743070 7996508 9490158 11334937 13962880
18112A3962880L766987N646397Q506401J2280421J4394069R765566q677112k2010807
$$ 13962880 17729867 23376264 31882665 44163086 58557155 68322721 59645609 37634802
18104C7634802j6091928q176443m252469k490668j539625r99983p78360n68604
$$ 37634802 21542874 13366431 9113962 6623294 5083669 4083686 3305326 2736722
18096B736722l87202l17949k71465k00200j25647j23968j06523r4456r1634r4597
$$ 2736722 2349520 2031571 1760106 1559906 1434259 1310291 1203768 1109312 1017678 923081
18086I23081p1936p1224l3508n7107q3409o4884o1708l3949k1429k7547N910K1615
$$ 923081 851145 779921 746413 689306 605897 541013 479305 445356 423927 396380 402290 423905
18074D23905j391J1783J0802k5584m3957o1621p1363k9776K099q870o3995r543
$$ 423905 422514 434297 445099 419515 375558 313937 242574 212798 214897 206027 142032 132489
18062A32489J4833L1276N278K8505J5566k5004l9408l3369k0860J7772J0646k0750
$$ 132489 147322 178598 183876 212381 227947 202943 163535 130166 109306 127078 137724 116974
18050A16974j75M6554J8118n678k7633k4064J0481J6238L6281P4340Q396l0841
$$ 116974 116799 163353 181471 175793 148160 124096 134577 150815 187096 261436 269832 238991
18038B38991r199k6674L2606J3829k8825m0400j2225J9389K5255K4469J6799m8265
$$ 238991 229792 203118 235724 249553 220728 180328 168103 187492 212747 237216 254015 205750
18026B05750m7450k2003l035k7312R596J2690n167r907j301J8399R228Q718K985
$$ 205750 158300 136297 133262 105950 115546 128236 123069 113162 111861 130260 139488 148206 151191
18013A51191n484k1098j7897j7008m819K1423k378J3710Q045r312l3785j1751
$$ 151191 145707 124609 106712 89704 84885 106308 103930 117640 125685 116373 82588 70837
18001G0837j6827k9499L4460k4496r618M3817N6521J7766K469L323k0366K1460
$$ 70837 54010 24511 58971 34475 24857 68674 125195 142961 145430 148753 128387 149847
17989A49847K7378K1586p24K3410m954l5825p856J4728J7907j8923q213N013k3389
$$ 149847 177225 198811 198087 221497 216543 180718 172862 187590 205497 186574 178361 183374 159985
17976A59985j2340L27M921q71K754J8405N390J9165k8063K3144M193j6643r156
$$ 159985 147645 147972 152893 152022 154776 173181 178571 197736 169673 192817 197010 180367 171211
17963A71211K3327M2539o560l4704l0480J216j9330k3228J2877J2595J0381K0047
$$ 171211 194538 237077 230517 195813 165333 166549 147219 123991 136868 149463 159844 179891
17951A79891L7912j721l3959k3890R627K3952J207l3455K6204M3679L8352O3326
$$ 179891 217803 216082 182123 158233 167860 191812 193019 159564 185768 229447 267799 331125
17939C31125L3934q124M2125J2487j6263J4093J9026j4491L689j408p157k8562
$$ 331125 365059 356935 399060 411547 395284 409377 428403 413912 417601 416193 409036 380474
17927C80474j0219J5212J6603n507P413K2205K3855J2900K3028M7279N6973N2544
$$ 380474 370255 385467 402070 396563 403976 426181 450036 462936 485964 533243 590216 642760
17915F42760O8956O3536L1744J7786M6062N2542P5391N7099M7192J05667J55844
$$ 642760 711716 775252 806996 824782 870844 923386 998777 1055876 1103068 1208735 1364579
17904A364579J69399K11408K25498K36851L18817M69887N46557O63229P55503
$$ 1364579 1533978 1745386 1970884 2207735 2526552 2996439 3542996 4206225 4961728
17895D961728R33297J263766J680444K306428L038044L669911L322983R14850
$$ 4961728 5895025 7158791 8839235 11145663 14183707 17853618 21176601 22091451
17887B2091451j913166j668885N36345K470037K981764Q25377l964147o423163
$$ 22091451 20178285 18509400 19045745 21515782 24497546 25322923 21358776 14935613
17879A4935613m853737k868296j666686r98137o18865m37910k95320k39659j67081
$$ 14935613 10081876 7213580 5546894 4548757 3929892 3491982 3196662 2957003 2789922
17870B789922j03719j1832O2970Q4837J03030J38374K15628K66177K77474K59287
$$ 2789922 2686203 2674371 2737341 2822178 2925208 3063582 3279210 3545387 3822861 4082148
17860D082148K70650L44310M64931N98679P36682R01202J075658J403778J801532
$$ 4082148 4352798 4697108 5162039 5760718 6497400 7398602 8474260 9878038 11679570
17851A1679570K260136K728588L388388M328124N407369O501561P264967P501398
$$ 11679570 13939706 16668294 20056682 24384806 29792175 36293736 43558703 51060101
17843E1060101P384051P117214N812933N142941P197372Q491373N107988k860353
$$ 51060101 58444152 65561366 71374299 76517240 83714612 92205985 97313973 94453620
17835I4453620j3084383k0131802j8978793j2931250p795962m863036l299860
$$ 94453620 81369237 61237435 42258642 29327392 21531430 16668394 13368534
17828A3368534k461916j850064j326021r86344p52465n45067m32549l30542k21212
$$ 13368534 10906618 9056554 7730533 6744189 5991724 5446657 5014108 4683566 4462354
17819D462354j55093j33733m7209q8856j09740q8039k5010J9505J8956L1848M9862
$$ 4462354 4307261 4173528 4126319 4037463 3927723 3839684 3814674 3834179 3853135 3884983 3934845
17808C934845O2073J39612K60542L81276N04549O82439Q51506J012548J174962
$$ 3934845 3996918 4136530 4397072 4778348 5282897 5965336 6816842 7829390 9004352
17799I004352J397183J752416K295098K925453L801768M795215N526652N806189
$$ 9004352 10401535 12153951 14449049 17374502 21176270 25971485 31498137 37304326
17791C7304326O190656P062036Q068049P819118M513872k976809j0599638j2270298
$$ 37304326 43494982 50557018 58625067 66444185 70958057 67981248 57381610 45111312
17783D5111312r762446p189772n568872m480657l623893k980459k428236j893615
$$ 45111312 35348866 28159094 22590222 18109565 14485672 11505213 9076977 7183362
17775G183362j314954r42208o70580m78533l68741l05061k06480j28273j47126
$$ 7183362 5868408 4926200 4255620 3777087 3408346 3103285 2896805 2768532 2621406
17766B621406j40599j39260j00138j22661j93046j99077j76123j34941j19995
$$ 2621406 2480807 2341547 2241409 2118748 1925702 1726625 1550502 1415561 1295566
17757A295566j00612j03943o5744o5888r4318r3435n1270l2344k8021m3127k1805
$$ 1295566 1194954 1091011 1025267 959379 865061 771626 720356 688012 659991 616864 595059
17746E95059k3568m0238k6438L785N967l2304l7507l0995j9024J0949j4689J0257
$$ 595059 571491 531253 504815 508600 514567 482263 444756 413761 394737 405686 390997 401254
17734D01254l833j9765l6536k5158M7953N6357J3346N11q012o4428k6269J3647
$$ 401254 397421 377656 341120 315962 363915 420272 433618 434129 426117 361689 335420 349067
17722C49067J4503j7413J1207J8596j4251K0295K3517k25j9998k9086k7138l3866
$$ 349067 363570 346157 357364 375960 361709 382004 405521 405296 385298 356212 329074 295208
17710B95208o94J5606j5678j3036l3972j9392j7210K843j5123R779k6356r873
$$ 295208 294514 310120 294442 281406 247434 228042 210832 213675 198552 208331 181975 172102
17698A72102k797J6156L2095l897l9852J545K4536p736m643j9839j233M635P807
$$ 172102 169305 185461 217556 213659 173807 175352 199888 192152 187509 167670 166437 171072 178879
17685A78879K6650J3586K0876o164P48k5281m2524J4218L0602j2928j6132O177
$$ 178879 205529 219115 239991 233827 234575 209294 166770 180988 211590 198662 182530 188707
17673A88707L5471J0689k1455P121j8986k1469J1855k3107m8445k902j1701o0070
$$ 188707 224178 234867 213412 220533 201547 180078 191933 168826 120381 117479 105778 45708
17661D5708J0240K9208K9809k223j5360q271n15K953J1139j4720K341o824q547
$$ 45708 55948 85156 114965 112742 97382 89111 88596 91549 102688 87968 90309 83485 74938
17648G4938Q8Q574K2813K42m7979j0819M4503l234j5460m200n600J1886K2625
$$ 74938 75026 83600 106413 106655 58676 47857 92360 89126 73666 69466 63866 75752 98377
17635I8377Q859j7891j3639N497N771j9008l1225J0028K7091P704j5111j8348
$$ 98377 107236 89345 75706 81203 86974 67966 36741 46769 73860 81564 66453 48105
17623D8105j2693M2944M1755l4893l7444M065N773L455J2409J2755J505O220m559
$$ 48105 35412 78356 120111 85218 47774 51839 57612 61067 73476 86231 87736 93956 89397
17610H9397j3373m3225J2098J9998J0960J336q863j0904k1023M693J1959K758
$$ 89397 76024 32799 44897 64895 75855 77191 68328 57424 36401 41094 53053 55811
17598E5811J0348J6651J9700M141k7759k6802l96J7340k9041J1856J5371j1412
$$ 55811 66159 82810 102510 106651 78892 52090 51694 69034 39993 51849 67220 55808
17586E5808l0057l951O244R532K2811K8713Q881M407r146n7215r322J3568j7541
$$ 55808 25751 21800 28044 37576 60387 89100 97981 102388 93242 36027 26705 40273 22732
17573B2732l6853k5583o603o66R593R830K4732K4177K445M0746K4936k7877l8772
$$ 22732 -14121 -39704 -46307 -46973 -37380 -27550 -2818 21359 23804 64550 89486 61609 22837
17560B2837l3922K189K2028J1132l372k98j1397p90k0180r544L200P784K5365
$$ 22837 -11085 -8896 13132 24264 20892 20594 9197 8407 -11773 -21317 -18117 -10333 15032
17547A5032j6165j2598J3688j7593Q22L9717M1569J870k0483P267K8819J5557
$$ 15032 -1133 -13731 -43 -17636 -16814 22903 64472 66342 45859 53126 81945 97502
17535I7502L3789m403j5043k0786J0833K498r192K0666K1101k0034n0299k5913
$$ 97502 131291 126888 111845 91059 101892 104390 95198 115864 136965 116931 66632 40719
17523D0719Q358r046r403J8880K2420J835P805J3015j5758j7059m3804k2590k3165
$$ 40719 49077 40031 30628 49508 71928 73763 81568 94583 78825 61766 17962 -4628 -27793
17510b7793o755M2902J1850K2722n443l3494l4026M6989L4947n827q098k0508
$$ -27793 -34548 8354 20204 42926 37483 3989 -30037 16952 51899 46072 37974 17466
17498A7466K4009o044k3754l2845m3015n91J6431M6229J279l6898M9623M4125
$$ 17466 41475 35431 11677 -21168 -64183 -64774 -48343 -2114 -835 -37733 11890 56015
17486E6015R15j259k1558k2060o591K2904K0364M948q185l2079k4350J3220N091
$$ 56015 56930 55671 34113 12053 5462 28366 48730 53678 45493 13414 -10936 2284 7375
17473G375j2603K2932P010j3266r55P60m001l660l695j7374l072J2985P753K0989
$$ 7375 -5228 17704 24714 11448 10493 11253 7252 3592 -103 -17477 -20549 -7564 189 21178
17459B1178J1324K7930J4683r897k8947N398j2892K6842K8032q301J2003L881
$$ 21178 32502 60432 75115 65218 36271 41669 28777 55619 83651 75350 87353 91234
17447I1234j8771J2576M3104M4895M2725Q4346R5409m4821j38592q9181j6774
$$ 91234 72463 85039 128143 173038 215763 300109 395518 350697 212105 122924 106150
17436A06150Q240n064l5198k7776J239k3539J0809J8519j1340Q860J969j4986
$$ 106150 114390 109326 74128 46352 47591 24052 34861 53380 42040 50900 52869 37883
17424C7883O666K1799l0022l3706k8091m135o062Q628K0915K3639j8852l932J3398
$$ 37883 44549 66348 36326 2620 -25471 -29606 -35668 -27040 -6125 17514 -1338 -5270 8128
17411H128K1760k225k644n06j0912j6010N1j096k4322k4045L7580K6041M897j6459
$$ 8128 29888 27663 25019 24513 13601 -2409 -2358 -3454 -27776 -51821 -14241 11800 16697 238
17397B38J9533n524j5578j423o843K293L4668j5484K0635K5058k1170n8260K749
$$ 238 19771 14247 -1331 -2754 -9597 -7304 27364 11880 32515 57573 36403 -21857 -19108
17384a9108k4666p035K4194K6288K0916j567J9806J382l5383q108j6608N991J0460
$$ -19108 -43774 -50809 -26615 -327 20589 19022 38828 40210 4827 -3281 -19889 -13898 -3438
17371c438K8756J1330O476J7581L8010k9208k5834M4433J2451j588j2849K174
$$ -3438 25318 36648 43124 60705 98715 69507 43673 88106 100557 98969 86120 88294
17359H8294K2996j4591m5011m8551O724L4587j7261k8989K6880J5103J1363L3051
$$ 88294 111290 96699 51688 3137 9861 44448 27187 -1802 25078 40181 51544 84595
17347H4595k3344m4442J0908j7082j3896r625J3946K1646k921J6285K9145M0766
$$ 84595 61251 16809 27717 10635 -3261 -12886 1060 22706 19785 36070 65215 105981
17335A05981M5411K6950L1238K4040K935n107j5143j5315K7925j0295j7032k3393
$$ 105981 151392 178342 209580 233620 236555 231448 216305 200990 228915 218620 201588 178195
17323A78195J4564L5257k8126r559K3542J2350J7344q469n1464k4902l335J1738
$$ 178195 192759 228016 199890 190331 213873 226223 243567 235098 183634 158732 155397 167135
17311A67135J8785K0898k2711k6458m8792o3422m1363j5768R519J9103L6336Q320
$$ 167135 185920 206818 184107 157649 108857 45435 4072 -11696 -2177 16926 53262 61582
17299F1582l2317L32P443N626j2566n927K5150l1400j9141M2813J1873J22K8529
$$ 61582 29265 29597 37040 42666 30100 24173 49323 17923 -1218 41595 53468 53590 82119
17286H2119J4585J766J8569J4926K4912M9595K0778L1269r692l2261J948M365
$$ 82119 96704 98470 117039 131965 156877 206472 227250 258519 248827 216566 218514 222879
17274B22879J0271M7983K350k3989j5835j0685l7140m4692l2555k5626j8537P296
$$ 222879 233150 281133 283483 259494 243659 232974 195834 151142 118587 92961 74424 81720
17262H1720j0789n439o803n599l310q112k7784l7655J9676P515P478o040j7288
$$ 81720 70931 65492 58689 53090 49780 41668 13884 -23771 -4095 3420 10898 4858 -12430
17249a2430K5629J5750j8231l3668j8428O463k4709l791k54N265J2926l760P002
$$ -12430 13199 28949 10718 -22950 -41378 -34915 -59624 -63415 -63669 -58404 -45478 -49238 -42236
17236d2236j9359O07J5342J3992J8599J9532k7159Q482p59j4795K745k6815j2200
$$ -42236 -61595 -60988 -45646 -31654 -13055 6477 -20682 -12200 -12959 -27754 -25009 -51824 -64024
17223f4024L0334K5922l2735l73L2711K5220J269j1592p88K9413K2301k0638q469
$$ -64024 -33690 -7768 -40503 -40876 -8165 17055 18324 6732 5944 35357 57658 37020 28551
17210B8551J1194J0630j9984l8184l639j0549p023P345k532Q627j8967j3314J8921
$$ 28551 39745 50375 30391 -7793 -11432 -21981 -29004 -21659 -24191 -15564 -34531 -47845 -28924
17197b8924J8285j6193O044n342L5964j5955K1650J7034k9685k7244J5323M3756
$$ -28924 -10639 -26832 -20788 -26130 9834 -6121 15529 32563 2878 -24366 -9043 34713
17185C4713R112j0512j5554l0500k640j3890R409N1598L7205L361j8431p603L348
$$ 34713 43825 33313 17759 -12741 -15381 -29271 -19862 31736 68941 72302 53871 46268 49616
17172D9616k4325o386k3034j7815L2896J5050j0898k1927M569j8692k6847K9190
$$ 49616 25291 18905 -4129 -21944 10952 26002 15104 -6823 -2254 -20946 -47793 -18603
17160a8603L3191l5596j7405L3882q745N024j4440l1480j7144O181J1637K4959
$$ -18603 14588 -21008 -38413 -4531 -13276 -8252 -22692 -54172 -71316 -65135 -53498 -28539
17148b8539J7330J162l1062L3480J0702l4575k1750K2392M9136K505j9630j2562
$$ -28539 -11209 -10047 -41109 -7629 3073 -31502 -53252 -30860 18276 20781 1151 -11411
17136a1411K3496j2721l9622j7833j7624j1263L7293L6175k0165L070j630j2823
$$ -11411 12085 -636 -40258 -58091 -75715 -86978 -49685 -13510 -33675 -30605 -32235 -45058
17124d5058n25J065j0646j4646K3066R049K6286j5514q436M4157K5352k4050l3551
$$ -45058 -45583 -44518 -55164 -69810 -46744 -37695 -11409 -26923 -35359 8798 34150 10100 -23451
17111b3451J567j1420m686L7851J9243M386m2486j6889J0154l4394k4851L8543
$$ -23451 -21884 -33304 -37990 -139 19104 23490 -18996 -35885 -25731 -60125 -84976 -46433
17099d6433O29l3587J8947M184J4561o49r904j1226L596L1727J9944J0213M424
$$ -46433 -45804 -79391 -60444 -56260 -41699 -42348 -52252 -63478 -59882 -28155 -8211 2002 6426
17086F426n5450j7022m19m022j17K790J1305K4670L936j6029J193M7296J0175
$$ 6426 -49024 -66046 -66465 -70487 -70604 -67814 -56509 -31839 -27903 -43932 -42739 4557 14732
17073A4732k7080j9996l263j3863j3499J121M6012j7439j8088J5432P606k4085
$$ 14732 -12348 -32344 -35607 -49470 -62969 -61848 -15836 -33275 -51363 -35931 -28325 -52410
17061e2410r039p29J9529J0242J347N934K8085J6830J299j6428O692J0680L256
$$ -52410 -61449 -62178 -42649 -32407 -31060 -25126 2959 19789 21088 4660 11352 22032 25288
17048B5288j0869r541l6551k437K794J4030L741j6266N55J7665j4211L796O358
$$ 25288 14419 4878 -31673 -34110 -31316 -17286 -13545 -29811 -29256 -11591 -25802 -22006 -15648
17035a5648j0168L847L2335l738k7077o946L584P153k7955j374J5731J2818k5446
$$ -15648 -25816 -21969 10366 6628 -20449 -27395 -23811 -16658 -44613 -45987 -30256 -17438 -42884
17022d2884J0705J6397l444N745Q314p372k7724k4229M12J201J3666Q868M626
$$ -42884 -32179 -15782 -19226 -13481 -5167 -12539 -40263 -64492 -64080 -62879 -49213 -40345 -35719
17009c5719N634M3676J1671J5357j0061j011k5735l8515k3913N925L3828l560
$$ -35719 -30085 13591 25262 40619 30558 29547 3812 -34703 -58616 -52691 -18863 -22423
16997b2423n934L6967J8205l335l5569L3062Q552R47M678k2618m9755K2408M6571
$$ -22423 -28357 8610 26815 23480 -12089 20973 29525 30472 35150 12532 -37223 -14815 31756
16984C1756k3477n2803l8133P403K5156J7175m678O419K9946r251q371k5605q248
$$ 31756 8279 -44524 -82657 -75254 -50098 -32923 -37601 -31182 -1236 -10487 -18858 -44463 -52711
16971e2711J7693J0249r871J4238l357p909k1182j4543J9947K2802L617j0272
$$ -52711 -35018 -24769 -34640 -20402 -23759 -31668 -52850 -67393 -47446 -24644 -21027 -31299
16959c1299k217J4983m670Q585m965J0264k8298J3600J4734K6138Q371k361J1083
$$ -31299 -33516 -18533 -23203 -14618 -19583 -9319 -37617 -24017 -9283 16855 25226 22865 33948
16946C3948k0262k4525J5078J0777p608M381J5292j2824n2371j2236k1537q198
$$ 33948 13686 -10839 4239 15016 7408 11789 27081 14257 -38114 -50350 -71887 -80085
16934h0085M6967J6534L366N381L6979J2332k2793k8737N036J2803P073m0516
$$ -80085 -33118 -16584 -13218 -7837 29142 41474 18681 -10056 -5020 7783 14856 -25660
16922b5660m219M1956k4346n994m258p943M4240j3225j3771M2571n253l0752l206
$$ -25660 -29879 12077 -12269 -18263 -22521 -30464 13776 551 -13220 29351 24098 -6654 -9860
16909i860J2865K9776J7961l5631K0422j4357j0661k4919q388j1657M045L0910
$$ -9860 3005 32781 50742 15111 35533 21176 10515 -14404 -22792 -34449 -30404 506
16897E06J1222m574j9296l9911J9869J9626K4359J56p451j2196p207J1715J2857
$$ 506 11728 7154 -12142 -52053 -32184 -12558 11801 11957 4506 -7690 -14897 -3182 9675
16884I675K5453J2498l8865j9941o041J0158p080J3601r92j0400k0741P787P005
$$ 9675 35128 47626 8761 -11180 -17221 -7063 -14143 -542 -1534 -11934 -32675 -24888 -17883
16871a7883L2174P645k1877K9244j1497j3304J1975j3520l7742J6903L2319K565
$$ -17883 14291 21936 59 29303 17806 4502 16477 2957 -34785 -17882 14437 17002
16859A7002k5266k1259q214l015n053m2666Q823Q818J4567L5760K7656j9367j8892
$$ 17002 -8264 -29523 -37737 -40752 -45805 -88471 -79648 -70830 -56263 -20503 7153 -12214 -31106
16846c1106j4605O031L0807n625m54M920R057j522o68j2395n1971q641M1272K1266
$$ -31106 -45711 -39680 -8873 -14498 -14952 -10032 -975 -2497 -3165 -15560 -67531 -76172 -34900 -13634
16832a3634J4263J9964m482l3515k0217M97J1981K5290j9116m3839Q682K4761
$$ -13634 629 20593 16111 -17404 -37621 -37124 -25143 147 -18969 -62808 -54126 -29365
16820b9365P718m508j3481K0569L1040k3639m4866l70J0282j6357L1381L8010
$$ -29365 -21647 -26155 -39636 -19067 11973 -11666 -56532 -56902 -46620 -62977 -31596 6414
16808F414k9817P348o460M905k739j881k4302j3520J333L3419K5021m579q078
$$ 6414 -23403 -16055 -22515 -17610 -20349 -22230 -46532 -60052 -58719 -25300 -279 -4858 -12936
16795a2936j8035k576J1610k540k9981K9619R060j5213J9875N632M354M65k0318
$$ -12936 -30971 -33547 -21937 -24477 -54458 -24839 -15779 -30992 -11117 -5485 -1131 -666 -20984
16782b0984j6301k7916j9287k6495L4867L5888l038J509j4932J5867j7898J8287
$$ -20984 -37285 -65201 -84488 -110983 -76116 -40228 -43266 -41757 -56689 -40822 -58720 -40433
16770d0433L0407J330J2510l017p782L8614l985k9483k0336l0855P748J7360M8167
$$ -40433 -10026 -8696 3814 797 -6985 31629 27644 -1839 -22175 -53030 -45282 -27922 20245
16757B0245m206N74J6920j0542k9953J4748J5772p31o8907k7908L7825j0674K7930
$$ 20245 16039 16613 33533 22991 -6962 7786 23558 22827 -46080 -73988 -36163 -46837 -18907
16744a8907J6802k5432q757q158m328k2891K8206K4312J520k6452K8501K6930
$$ -18907 -2105 -27537 -36294 -44452 -48780 -71671 -43465 -19153 -17633 -44085 -15584 11346
16732A1346O355r351k6784O892K0319K8690k8313j2868J5535j2584K4458k110
$$ 11346 17701 8350 -18434 -11542 8777 37467 9154 -3714 11821 -763 23695 21585
16720B1585k5344n7473K018L4265J1053k9262m018J0995o389j2218J2810L2975
$$ 21585 -3759 -61232 -59214 -24949 -13896 -43158 -47176 -36181 -42570 -54788 -41978 -9003
16708i003K5379J0446M193M941j8466l2462J3572L2737J1760l8343k2278j2643
$$ -9003 16376 26822 31015 35956 17490 -14972 -1400 31337 43097 4754 -17524 -30167
16696c0167p958j581K1879q174k3323J9893K2945L4402j202k6204L79R637qK008
$$ -30167 -38125 -39706 -17827 -26001 -49324 -29431 -6486 27916 26714 510 889 10526 10518 12526
16682A2526M569q24j7553k4448L3345M684q486k566q593r635j841k6916L5307
$$ 12526 17095 16271 -1282 -25730 7615 12299 3813 1247 -7346 -16981 -18822 -45738 -10431
16669a0431N3606m1573m6171K8927J1922M2808L0197o0515m6586m490J2735J3207
$$ -10431 43175 1602 -44569 -15642 -3720 39088 69285 8770 -37816 -42306 -29571 -16364
16657a6364K8076r80m6467m4511j0230L1905L9530k87M2511J2028l944J621r97
$$ -16364 11712 10732 -35735 -80246 -90476 -58571 -19041 -19328 23183 35211 31267 32888 31891
16644C1891M637k941n410q3k5453l932J0920R382k1274l830k7749o661K0263N068
$$ 31891 36528 33587 28177 28094 2641 -1291 9629 19011 -2263 -6093 -33842 -40503 -20240 -15172
16630a5172J9328K2364n0888j9381L0140p740k3669K3485L3397l911j1585j7452
$$ -15172 4156 26520 -24368 -43749 -13609 -21349 -45018 -21533 11864 7953 -3632 -21084
16618b1084l150l1232q298L7506K6094l0826M17J0775J0970j2084J4758Q8873
$$ -21084 -24234 -55466 -63764 -26258 -164 -30990 -30573 -19798 -8828 -20912 -6154 82719
16606H2719M698p8772j5789J9880j0449Q53K5110k4367k8058q939j1669k9641
$$ 82719 87417 8645 -7144 12736 2287 3140 28250 3883 -24175 -33114 -44783 -74424
16594g4424J7032K6760L467r109Q517J3547r186j9272L6134K7395k4577J795M201
$$ -74424 -57392 -30632 -27165 -36274 -27757 -14210 -23396 -42668 -6534 20861 -3716 -1921 2280
16581B280j9768M594M9607J6528q445l2316k7170L1708J1652j0065n904n896r117
$$ 2280 -17488 -12894 36713 53241 44796 12480 -14690 17018 28670 18605 12701 6805 -2312
16568b312j378j1069r61j7242K1594L0327J5613k3706p995M694J1203R830M411
$$ -2312 -3690 -14759 -15720 -32962 -11368 18959 34572 10866 2871 7565 18768 28598 33009
16555C3009J3971k3003j6932n924k1867k0511K9451M1197r003k0574r173m528
$$ 33009 46980 23977 7045 1121 -20746 -41257 -11806 29391 20388 -186 -9359 -13887
16543a3887k0226K8031j5248j5139j537J8437J2103J5067k4001J2880N704J1721
$$ -13887 -34113 -6082 -21330 -36469 -38006 -19569 -7466 7601 -16400 -3520 2184 13905
16531A3905j3788j7769k9907j6649K4124K4752p583r103N2o766J3539L9179J913
$$ 13905 117 -17652 -47559 -64208 -40084 -15332 -22915 -32018 -31966 -38732 -25193 13986 15899
16518A5899J5319l559l4091N245J1472n732N264J0228M804k1744k4098k0369K4238
$$ 15899 31218 27659 -6432 -1187 10285 4553 9817 20045 24849 3105 -20993 -41362 -17124
16505a7124J4018q950J270O073J9672j3292j2842M031Q756M72M943M3363R075
$$ -17124 -3106 -12056 -10786 -4713 14959 1667 -11175 -7144 1612 2084 7027 50390 59465
16492E9465P494k1909k2759K747l02J1049j4224l9819L462q942J6805r475K380
$$ 59465 66959 45050 22291 25038 24736 35785 21561 -18258 -14796 -23738 -6933 -16408 -14028
16479a4028M0653J5189l5058n61R444k3585J3981K4511J5633j3889k8750J4171
$$ -14028 26625 41814 6756 6195 15639 -7946 6035 30546 46179 32290 3540 17711
16467A7711K7967k373k3699j9678m3347j5216J5602K8200J7231m373m614K8010
$$ 17711 45678 43305 19606 -72 -43419 -58635 -43033 -14833 2398 -1975 -6589 21421
16455B1421K2927q616l1408j4610K441j2798K9522J4224j3314K0702j195k3866
$$ 21421 44348 35732 4324 -10286 -7845 -20643 8879 23103 9789 30491 29296 5430
16443E430k4736k4475j3314j3092M2195K7096K4153k0170J2302k0475k0098k6310
$$ 5430 -19306 -43781 -57095 -70187 -27992 -896 23257 3087 15389 -5086 -25184 -51494
16431e1494J0065J3196o099J6189P969r196j6678l408j9940j498M399Q440J1756
$$ -51494 -41429 -28233 -34332 -18143 -10174 -19370 -36048 -39456 -59396 -60894 -56495 -48055 -36299
16418c6299k3348k3650j474K9419L839K9908K6189j4504k9554n464N152l143L6905
$$ -36299 -59647 -83297 -84771 -55352 -51513 -21605 4584 -9920 -39474 -44938 -39786 -42929 -6024
16405f024N94n42r899J4333l2545J299L8868L683J4607L6002l4609l3885q185
$$ -6024 -5430 -5972 -15871 -1538 -34083 -32784 6084 9767 24374 60376 25767 -8118 -16303
16392a6303p196l6137q03J9497K9490K1684k835l155J6440J9466r083m6285j9505
$$ -16303 -23499 -59636 -60439 -40942 -11452 10232 7397 4242 20682 40148 31065 -15220 -34725
16379c4725O329K5509L3018l2817j6255J3855L3785l403k5714n500j620L9588
$$ -34725 -28396 -2887 30131 -2686 -18941 -5086 28699 25296 -418 -5918 -7538 32050
16367C2050M965j4058j7855P093Q050K889j2471j9026Q450l9878j9523J1058Q590
$$ 32050 37015 22957 5102 12195 20245 23134 10663 -8363 87 -39791 -59314 -48256 -39666
16354c9666J5857K1473L5553j598j3813O673K6417P771k6696K18p727l5597J0805
$$ -39666 -23809 -2336 33217 31619 17806 24479 50896 58667 31971 32189 24462 -11135 -330
16341c30k623p692J6350o473p513O193J051l1512p274J5923j8546N473O036J3099
$$ -330 -2953 -10645 5705 -768 -8281 -2088 -1037 -32549 -39823 -23900 -42446 -36973 -30937 -17838
16327a7838K5424J1160J4867J6085L347j823o302l9577l996L3815r862m7367k8759
$$ -17838 7586 18746 33613 49698 53045 51222 44920 5343 1347 35162 25300 -22067 -50826
16314e0826M260L7127K9236j4498l057k729q924Q689M5688r325k3228p438J1308
$$ -50826 -46566 -9439 19797 5299 2242 -487 -9411 -722 44966 35641 12413 4975 16283
16301A6283J3358k4683j3044n48j4111k3552o067j8940p064K7419N72R984J3213
$$ 16283 29641 4958 -8086 -8634 -22745 -46297 -52364 -71304 -78368 -50949 -50377 -40393 -27180
16288b7180L2696J4240j7781p341j0676m0504J9010L9966M4162K316m4599k129
$$ -27180 5516 19756 1975 -5366 -16042 -56546 -37536 2430 46592 48908 4309 2180
16276B180q253J364k123r712k0847K2147R291L6485p471k4442L472l78j1965j1216
$$ 2180 -6073 -4709 -6832 -16544 -37391 -15244 -5953 30532 23061 -1381 2091 1713 -10252 -21468
16262b1468M868N1567M5919L698l3319k5559q919P008M213k757J3850p511J0571
$$ -21468 -16600 34967 80886 84584 51265 25706 16787 23795 28008 25251 39101 31590 42161
16249D2161J7645n2421l0349j7792J4584J4424j2077j2531l9670P005J8784P15
$$ 42161 59806 7385 -22964 -40756 -26172 -11748 -23825 -36356 -76026 -69021 -50237 -49522
16237d9522L2611J9308K5955M353j2434n651k282j9307L0065K2275l1472R749
$$ -49522 -16911 2397 28352 32705 20271 14620 12338 -6969 23096 45371 13899 23648
16225B3648l4242j8354r531J7430K6340l797k5536l1971k793N7227K3899k8521
$$ 23648 -10594 -28948 -38479 -21049 5291 1494 -24042 -56013 -58806 -1579 22320 -6201
16213f201l5830m0114j1618N450K8662M3918J3540j0078K1447m30l4546K3895
$$ -6201 -42031 -82145 -93763 -88313 -59651 -15733 -2193 -12271 9176 8746 -25800 -1905
16201a905O3877p605O025N472l0586N858j6650m1793n063k9781M101o51R769O319
$$ -1905 61972 54367 60392 65864 35278 41136 24486 -17307 -22370 -52151 -48050 -48701 -38932 -32613
16187c2613n496k875O764o747J9455l2323k6248R411L2144L5408L7977J1543n6272
$$ -32613 -38109 -40984 -34220 -40967 -21512 -53835 -80083 -70672 -38528 -3120 34857 46400 -9872
16174i872l6779J8945p359N636K5441J1609j536j9858l890k9118j847J2859J3204
$$ -9872 -46651 -27706 -35065 -29429 -3988 7621 6085 -13773 -17663 -46781 -48628 -35769 -22565
16161b2565R934J697O581j0021k3130j4517P978j0007J070J4767J5183L1628J3303
$$ -22565 -12631 -10934 -4353 -14374 -37504 -52021 -44043 -54050 -52980 -38213 -23030 8598 21901
16148B1901O88K2727j9522n4061O811O67m414K3594n298L7262K9889l7095j6343
$$ 21901 22589 45316 25794 -28267 -21456 -20789 -25203 -1609 -6907 30355 60244 23149 6806
16135F806J7342k3905k8872o970L2734j0933J4922j519o648R699J0334k1687l7758
$$ 6806 24148 243 -28629 -35599 -2865 -13798 1124 -395 -7043 2656 12990 -8697 -46455
16122d6455m861j676K1401K4583j1732q684l7208n0430M8206M4829J6291m7867
$$ -46455 -51316 -52992 -31591 -7008 -18740 -27424 -64632 -115062 -66856 -22027 -5736 -53603
16110e3603j4415L0431J5390j5750J6849K7206Q952j5778O931J4863j74l7483
$$ -53603 -68018 -37587 -22197 -37947 -21098 6108 15060 -718 6213 21076 20902 -16581
16098a6581N32J6833Q801j025K940l960j09o616J399l3122K515J2775J1514P052
$$ -16581 -16049 784 9585 8560 11500 7540 7431 815 2214 -30908 -28393 -15618 -4104 2948
16084B948J1835l066N707M89n461L786K5882j9905j7401m416j963j9903m8510
$$ 2948 14783 11717 17424 17913 12452 16238 42120 22215 4814 398 -1565 -21468 -69978
16071f9978j1351j821K8320M0070L2849j6505k4540n050K3866L411j6601L5832
$$ -69978 -81329 -83150 -54830 -14760 18089 1584 -22956 -28006 -4140 -729 -17330 18502
16059A8502K0963J8011J8800k7347l1331j1347p509J701R070j3349l1209J9416
$$ 18502 39465 57476 76276 48929 17598 6251 -1258 443 9513 -3836 -35045 -15629
16047a5629K9071o501n28l1874j9177K6910J4553k7332k8236j3144J4832k0645
$$ -15629 13442 6941 6413 -25461 -44638 -17728 -3175 -30507 -58743 -71887 -57055 -77700
16035g7700K4169M1472J7499j1439k9026j7431m67J765K3117K1837l0549R318
$$ -77700 -53531 -12059 5440 -5999 -35025 -52456 -52923 -51158 -28041 -6204 -36753 -27435
16023b7435M2889M199J876k2116l7468J1097J6671j8716K0425k327j6667K0420
$$ -27435 15454 19653 21529 -587 -38055 -26958 -10287 -29003 -8578 -10905 -27572 -7152
16011g152l03Q246j5262j1070j0742J6798L2234r767k803J6905l4876j3533K35
$$ -7152 -7455 791 -14471 -25541 -36283 -19485 12749 2982 179 17084 -17792 -31325 -31090
15998c1090j4036O34Q678R405J2897R239k8366l1913J023J8688N0544J3967k1379
$$ -31090 -45126 -44492 -35814 -26409 -13512 -4273 -32639 -64552 -63529 -44841 5703 19670 -1709
15985a709k2401J0530r275M748J4291K950M902K4353l5973J6291q058O405J2745
$$ -1709 -24110 -13580 -22855 -18107 -3816 -866 4036 28389 -7584 8707 649 7054 19799
15972A9799j9255j7566j4747K4610J7517M4349j8100l0572l312k0206l5418m680
$$ 19799 544 -17022 -31769 -7159 10358 54707 36607 6035 2723 -17483 -52901 -57581
15960e7581L5647J2287m937R155K2871J2422k9093j3949j041J8592k6715m695
$$ -57581 -21934 -9647 -14584 -5429 17442 29864 771 -13178 -14219 4373 -22342 -27037
15948b7037p255m970J5714O898k5793L004P1471J4861n689k9051j4058K5559J3395
$$ -27037 -34292 -39262 -23548 -16650 -42443 -39439 32032 46893 41204 12153 -1905 23654 37049
15935C7049j3659j3779k4240k9659k022p336k6581K9754L6366j1334r491o107
$$ 37049 23390 9611 -14629 -44288 -46310 -53646 -80227 -50473 -14107 -25441 -34932 -41039
15923d1039J3454k0627j4369K3667K9511O732J3826k989K202j7836j6296k858
$$ -41039 -27585 -48212 -62581 -38914 -9403 -2671 11155 8166 10368 -7468 -23764 -26622
15911b6622m62J1871l8420j4916M205J1880J9957J7868n243J3823K5564j2003
$$ -26622 -27084 -15213 -53633 -68549 -64344 -52464 -32507 -14639 -19882 -6059 19505 7502
15899G502M845J494j6038j7912Q157j0923r158R123K5349J6406O023o338J511
$$ 7502 12347 13841 -2197 -20109 -11952 -22875 -32033 -22910 2439 18845 24868 18530 20041
15886B0041j7491j2227N476m652P603k4659k9112M028M8857L0630j1870m0773
$$ 20041 2550 -9677 -4201 -8853 -1250 -25909 -55021 -50993 -2136 28494 16624 -24149
15874b4149l7527k9695J9204L9859l6976M261M1170J5010j3797M025M4053L225
$$ -24149 -61676 -91371 -72167 -32308 -69284 -65023 -23853 -8843 -22640 -18615 25438 28663
15862B8663m6821k1229j6834k802J7007J3335J0787k2664J2426K1799K2402m2146
$$ 28663 -18158 -39387 -56221 -59023 -42016 -28681 -17894 -40558 -28132 -6333 16069 -26077
15850b6077m5650J3733K2210L8847O605l435r020n4054n710J9882J4518L35K1033
$$ -26077 -71727 -57994 -35784 3063 9668 6233 -2787 -56841 -62551 -42669 -28151 -27816 -6783
15837f783j1114M811k5281j7121L0550j5842l6798J5029K7338P796o58P174l795
$$ -6783 -17897 -13086 -38367 -55488 -24938 -40780 -77578 -62549 -35211 -27415 -28073 -20899 -24694
15824b4694n560J9476j0930M211L0638j1772l6741k0982J7021K4774j0395l5341
$$ -24694 -30254 -10778 -21708 -17497 13141 1369 -35372 -56354 -39333 -14559 -24954 -60295
15812f0295k6157J8923L2261K5431Q936L1922L90j5789J20J7222J123R009r837
$$ -60295 -86452 -67529 -35268 -9837 -901 31021 31411 15622 15742 32964 34087 43096 33259
15799C3259M779J432r83k7222m9066m376L9904J4043J8512L2616L79j3424K417
$$ 33259 38038 39470 38487 11265 -37801 -42177 -2273 11770 30282 62898 63277 49853 52270
15786E2270j6878J474p966O697J4103k7949m5402j976j9837L3173J7129j5746
$$ 52270 35392 36866 28900 35597 49700 21751 -23651 -25627 -45464 -12291 4838 -10908
15774a0908n184j5472N129J5663J3057k2070K312k0984Q765K9147J0816j5924
$$ -10908 -16092 -31564 -26435 -10772 2285 -19785 -17473 -38457 -29692 -545 10271 -5653
15762e653l1063M62R795O974k0598j328O829K1453K8552j8326n118j928l4501
$$ -5653 -36716 -36254 -26459 -19485 -40083 -41411 -34582 -13129 15423 -2903 -8021 -9949 -44450
15749d4450n351L3656J2168N325O078J361j2341J215M1243j578k8324j6585k183
$$ -44450 -49801 -16145 -3977 1348 7426 8787 -3554 -2339 38904 37326 9002 -7583 -9766
15736i766K7228J4850l272l4752k8777K4197J7074j9908j110J9812n643o074o422
$$ -9766 17462 32312 29040 -5712 -34489 -10292 6782 -13126 -14236 5576 -67 -6141 -12563
15723a2563j6585j4830K8245K446R104O060j76j0491K5803J6223P374j9377l5766
$$ -12563 -29148 -43978 -15733 -13287 -4183 1877 1701 -8790 17013 33236 40610 21233 -14533
15710a4533p759J8365l075k415j6542m8533j2687K1626M7157P54j7825L7835L2102
$$ -14533 -22292 -3927 -7002 -9417 -25959 -74492 -87179 -65553 -18396 -17642 -35467 2368 34470
15697C4470k516j6862J2057j2692p244J0989k4895o805K8315j7229j8892k4570
$$ 34470 31954 15092 27149 14457 7213 18202 -6693 -13498 14817 -2412 -21304 -45874
15685d5874N789O628r896j2465J4310J4959K1376J6L6661j2771k2767O918L9115
$$ -45874 -40085 -33457 -43353 -55818 -41508 -26549 -5173 -5157 31504 18733 -4034 2884 41999
15672D1999N878k0281l8751k0948j276M746M1234j2258l491J240k4327j7634m849
$$ 41999 47877 27596 -11155 -32103 -33379 -28633 12601 343 -3148 -1908 -26235 -43869 -48718
15659d8718J7304Q646j0127J8087o892j8271k38L6249J6341j2092Q792k3397L061
$$ -48718 -31414 -22768 -32895 -14808 -21700 -39971 -40209 -3960 12381 289 9081 -14316 -11255
15646a1255L4490k5413m885n421k1328q717Q049j123J4359o880L2395j8285J9740
$$ -11255 23235 -2178 -7063 -12484 -33812 -42529 -34480 -35603 -21244 -28124 4271 -14014 5726
15633E726J7616j217m191k0412j261k1338J3901P744j924q485k3447K686J2410
$$ 5726 23342 22125 17934 -2478 -3739 -25077 -11176 -3432 -5356 -13841 -37288 -34602 -22192
15620b2192k4012j825K1173O834L175J4521k019j3600J33j1692Q641J934q701
$$ -22192 -46204 -48029 -26856 -20022 -16847 -2326 -4345 -17945 -17812 -29504 -20863 -18929 -27630
15607b7630R944K5205j9042r786N481l4301J9599R384J4097j5418r061J1029J632
$$ -27630 -17686 7519 -11523 -21309 -15828 -50129 -30530 -21146 -7049 -22467 -31528 -20499 -18867
15594a8867J764K473l767M5448J2168q575j5723j3002M539J1443o580l2225r087
$$ -18867 -17103 -14630 -18397 27051 39219 30644 14921 1919 6458 17901 11321 -20904 -29991
15581b9991R924j8333k1427K4554q34j2990j022J9884k2012N670K4020K1261M031
$$ -29991 -20067 -38400 -59827 -35273 -36107 -49097 -50119 -30235 -52247 -46577 -22557 -1296 2735
15568B735J3238J5699R384l2453k3249n710k2836m73M906K6557l6089P698J2245
$$ 2735 15973 31672 41056 8603 -14646 -20356 -43192 -43665 -38759 -12202 -48291 -40593 -28348
15555b8348O293O170J3850r355o87l2579m114j3221M0643J9695j9091O018j6045
$$ -28348 -22055 -15885 -2035 -11390 -12077 -44656 -48770 -61991 -21348 -1653 -20744 -14726 -30771
15542c0771j7958j1699L6185l475M097K1521J5932K9008j2985o5527p23M7143
$$ -30771 -48729 -60428 -24243 -27718 -23621 -2100 13832 42840 29855 -35672 -36395 10748
15530A0748J7929O85j4273L762p896m962j2480j1142J0818J9272o875l2486J656
$$ 10748 28677 29362 15089 18851 10955 5993 -6487 -17629 -6811 12461 5586 -26900 -25244
15517b5244J8579K1735J4512p684O359q39k7144r799k1630j4348J4271L6295o468
$$ -25244 -6665 15070 29582 21898 28257 27418 274 -9525 -31155 -45503 -31232 5063 -1405
15504a405l8250o482R784Q208p408P631k5767J7090J1241M1024K4903p564k004
$$ -1405 -39655 -46137 -36353 -28145 -35553 -27922 -53689 -36599 -25358 15666 40569 33005 31001
15491C1001j9670j3420Q872m074J2294J5548j4203l707m3472k7032r400m35J4303
$$ 31001 11331 -2089 6783 2709 15003 30551 16348 12641 -30831 -57863 -67263 -67698 -53395
15478e3395M8754L2253O84j8392r410n527n4491l4814K9657K3341M7517K851J0542
$$ -53395 -4641 27612 28296 9904 494 -5033 -59524 -94338 -64681 -41340 6177 9028 19570
15465A9570N595r831M5485J551l2454l4462M620o831j7843k234P622J2317K4681
$$ 19570 25165 15334 60819 62370 29916 -4546 74 -6757 -24600 -26834 -19212 -6895 17786
15452A7786N333r685k7985J1086j3479j7488J9444J4526k2416j6848k2537l1796
$$ 17786 23119 13434 -14551 -3465 -16944 -34432 -14988 -462 -22878 -39726 -62263 -94059
15440i4059k5537R230M9470L2660L5438R422O138j6471l1050k547M5851K2133
$$ -94059 -119596 -110366 -60896 -28236 7202 16624 22762 6291 -24759 -27306 18545 40678
15428D0678K395j6539P62j4218k7739J0917k924J3873J3422k783k69j424r817
$$ 40678 43073 26534 27296 13078 -14661 -3744 -6668 7205 20627 17844 17575 16151 6334
15415F334j0959k531J2097j87p501J1158k3918k8849j0960K7421K1591K3049L485
$$ 6334 -4625 -7156 4941 4754 -2747 8411 -15507 -44356 -55316 -27895 -6304 16745 20230
15402B0230k618j0256p05k4663j5728J347M376o690p238J5895o24J704J7874J7468
$$ 20230 17612 7356 6651 -18012 -33740 -32393 -28017 -34707 -41945 -26050 -26674 -24970 -7096 10372
15388A0372k8136j6112P5j135J5669L1010K8942J6949n9187l5548L2781K6024
$$ 10372 -17764 -33876 -33801 -34936 -19267 11743 40685 57634 -1553 -37101 -4320 21704
15376B1704L9224j1541o7841K410J9934l8157L111J8030R584j5197J3813J4421
$$ 21704 60928 49387 -18454 -16044 3890 -34267 -31156 -13126 -3542 -18739 -4926 9495
15364I495j0300p518l598j3717j2009K6960N809j933r473j1637L5346L4095l9493
$$ 9495 -805 -8323 -11921 -25638 -37647 -10687 -4878 -6811 -16284 -27921 7425 41520 2027
15351B027o822P854j92p932o283L370l882J7427j1339j2791j8403K3799L3228
$$ 2027 -4795 3059 2867 -5065 -11348 -7978 -11860 5567 -5772 -18563 -36966 -13167 20061
15338B0061j0553k4625K519Q588O779K1025M7639k5226j7848k0504k0145K3941
$$ 20061 9508 -15117 -12598 -4010 2769 23794 71433 46207 28359 7855 -12290 11651
15326A1651J1699j4693N785J8256N591k0659p605j9618K0479l557l7278j449R648
$$ 11651 23350 8657 14442 32698 38289 17630 10025 -9593 10886 7329 -29949 -31398 -21750
15313b1750j8800j4687O930J8324L3283L0242l6429k6364k5699R980J649K454
$$ -21750 -40550 -55237 -48307 -29983 3300 33542 -2887 -29251 -54950 -44970 -43321 -40867
15301d0867k6367j3658k9183r153J4524N1320J139j315J8500o705o515m688J4417
$$ -40867 -67234 -80892 -110075 -119228 -104704 -53384 -52245 -53560 -35060 -41765 -48280 -52968 -38551
15288c8551L0509r55J8913K3648j4731l8289l4972m160L8643P687P448q672k6132
$$ -38551 -8042 -8997 9916 33564 18833 -19456 -54428 -58588 -19945 -12258 -4810 -13482 -39614
15275c9614j7849K4018n368M855M7542J0912k6819k9051J1281J4172O794K3648
$$ -39614 -57463 -33445 -38813 -33958 13584 24496 -2323 -31374 -20093 -5921 873 24521
15263B4521L5212J2644k1062k8229Q425J1599l6307k0571k1028p648J8733K8405
$$ 24521 59733 72377 51315 23086 31511 43110 6803 -13768 -34796 -42444 -23711 4694
15251D694J6246J4296K876m3366k1878J4293j9469M7928r830J876J0028K282P21
$$ 4694 20940 35236 38112 -5254 -27132 -12839 -32308 15620 5790 7666 17694 19976 20697
15238B0697j536K327j9588l863j0140k6816j4917K7884l1770J4368P363j1845
$$ 20697 19161 21488 1900 -1963 -12103 -38919 -53836 -25952 -57722 -43354 -35991 -47836
15226d7836K7232K2761K4425p479j7367j3554k3088Q885r679J6698J7770l781
$$ -47836 -20604 2157 26582 19103 1736 -11818 -34906 -26021 -35700 -19002 -1232 -5013
15214e013L1686p642r293J367l3324P03L0364L0234o026j9167m6451k6055q720
$$ -5013 26673 19031 9738 11105 -22219 -21516 8848 39082 33056 13889 -32562 -58617 -67337
15201f7337M497j6188K8737K8272J8292K1716j1276m004O871K0177j3157m0162
$$ -67337 -62840 -79028 -50291 -22019 -3727 17989 6713 2709 9580 29757 16600 -23562
15189b3562J1569L281r392l0266J9894K2251L6730J3310J0577Q471j5156m0223
$$ -23562 -11993 -8712 -18104 -48370 -28476 -6225 30505 43815 54392 62863 47707 7484
15177G484l1263J4766L0358M970j269j144K3762j9570j6963j8237J6907Q265K0575
$$ 7484 -23779 -9013 21345 26315 25046 23902 47664 28094 11131 -7106 9801 18066 38641
15164C8641j1551k9287p341K1954M8934L3857O646j7042n3586O89j9936k2039
$$ 38641 27090 -2197 -9538 12416 61350 95207 101853 84811 31225 31914 11978 -10061
15152a0061J102j8187o019k4586M9352K7931Q009j9913m4156K0942K0638q800
$$ -10061 -8959 -27146 -33165 -57751 -8399 19532 27541 7628 -36528 -15586 5052 -3748
15140c748j0696L0873L673O826k4065n3532J8482p144J1180J7896K5279L3745
$$ -3748 -14444 16429 20102 26928 2863 -50669 -32187 -39331 -28151 -10255 15024 48769
15128D8769J8977j6471l51m760j7105k131K3720j719k2613r233J1204j1326n1057
$$ 48769 67746 51275 50924 46164 29059 26928 50648 48929 26316 17083 28287 16961 -34096
15115c4096P407M1580j7118l1242L9528L0122J0917j6613l3544j9817m745J6333
$$ -34096 -26689 14891 -2227 -33469 6059 36181 47098 30485 -3059 -22876 -27621 -11288
15103a1288J0882J541j8848M571K0284j5251n36J1199j5329J477L5210j683k5477
$$ -11288 -406 1135 -17713 -13142 7142 -8109 -8645 2554 -12775 -11298 23912 22229 -3248
15090c248K490j615j4215R684j740J1577o802j4028k76M2812J4453p156j4414
$$ -3248 -758 -2373 -16588 -6904 -8644 2933 -3869 -17897 -18173 24639 39092 31936 17522
15077A7522J420k5945j6343p025K1848L1372o288j5864j4976M4189l6600j6119
$$ 17522 18942 -7003 -23346 -30371 -8523 22849 16561 697 -14279 29910 -6690 -22809
15065b2809J9951K8484m748l3552J937L2587n064K1188o914l1072J8393K9191
$$ -22809 -2858 25626 20878 -12674 -10737 21850 16786 37974 31060 -12 18381 47572
15053D7572l1374k3423q562J0181o132K6261K0208j4047P014K2036M562k3699
$$ 47572 16198 -7225 -15787 -5606 -11738 14523 34731 20684 27698 49734 54296 30597
15041C0597j4106n485j9605j0253M7613K4160R320r278j5803p699K8246J272Q583
$$ 30597 16491 11006 -8599 -18852 28761 52921 62241 52963 37160 29461 57707 58979 67562
15028F7562j8527n381J4681j1318j7666l0357l2028j5318o205J3879M2630j6224
$$ 67562 49035 43654 58335 47017 29351 -1006 -33034 -48352 -54557 -40678 1952 -14272
15016a4272J1779n831j0992K5813M4848k7973r244k4537k6578m753o182p585K4842
$$ -14272 -2493 -8324 -19316 6497 51345 23372 14128 -10409 -36987 -41740 -47922 -55507 -30665
15003c0665K5989K1700k5867J1377J0944L3143j629n746L7766M0953K8643P997
$$ -30665 -4676 17024 -8843 2534 13478 46621 44992 39246 77012 117965 146608 154605
14991A54605k7577j244K8065L4205L7530L5113k1851l2715k8224o0050m9405l138
$$ 154605 127028 125784 153849 188054 225584 260697 238846 206131 177907 117857 68452 65314
14979F5314k594L4457k2571n772J4709l3292j5588q600k2319k6351O117K5541
$$ 65314 62720 97177 74606 68834 83543 50251 34663 26063 3744 -22607 -16490 9051
14967I051j5781l2836K4122K2673p358J5476J2683k4562R65O18l555J1096R386
$$ 9051 -6730 -39566 -15444 7229 -129 15347 28030 3468 4433 5051 1496 12592 21978
14954B1978k3109m7910J0495M9657j8890j0652l6318J0278L3541L1764j870l088
$$ 21978 -1131 -49041 -38546 11111 -7779 -18431 -54749 -44471 -10930 20834 18964 15876
14942A5876J9961j4017l2084p80k1602K82K8318L8622k1491k531j3184k4559O610
$$ 15876 35837 21820 -10264 -11044 -32646 -32364 -4046 34576 13085 10554 -2630 -27189 -20579
14929b0579j0616M3197K5494k4916j695O429N075o597j3711k895O1l3721j2708
$$ -20579 -31195 12002 37496 12580 10885 17314 22389 15792 2081 -814 -753 -34474 -47182
14916d7182L512L2633L0427m351k9853j3955n0246N86L4839K0750K1288L8298
$$ -47182 -43670 -11037 19390 15039 -14814 -28769 -79015 -78429 -43590 -22840 -1552 36746
14904C6746P464j6350n6010j0824r002Q794J5715L6082j9312P923j0544k7460
$$ 36746 44210 27860 -28150 -38974 -47976 -39182 -23467 12615 -6697 1226 -9318 -36778
14892c6778P976K2540J6140L8057l61m0844k2777l8201j4839J4991L5916J9589
$$ -36778 -28802 -6262 9878 47935 47574 6730 -16047 -54248 -69087 -54096 -18180 1409
14880A409L1687j2544l7349j857j8194R002K8887J1479J8549q729j4300k1857
$$ 1409 33096 20552 -16797 -18654 -36848 -27846 1041 12520 31069 22340 8040 -13817
14868a3817k0668J0215l105l5880k644M524J5624P662o655J7255J5771n157q176
$$ -13817 -34485 -24270 -27375 -63255 -65899 -61375 -45751 -38089 -44744 -27489 -11718 -16875 -25051
14855b5051J5431N963k9874j646L1874j4411k7507R890L8102K5639J7855R567
$$ -25051 -9620 -3657 -33531 -35177 -3303 -17714 -45221 -35331 2771 28410 46265 55832
14843E5832p516o584k736k4995J0827k899j0633J3768Q840L3331K0400j0026k294
$$ 55832 48316 41732 38996 14001 24828 21929 11296 25064 33904 67235 87635 77609 75315
14830G5315K0472j7085m6826j0430J6109Q565o1772Q385r179j6615O217K5031
$$ 75315 95787 78702 31876 21446 37555 46120 -15652 -7267 -16446 -33061 -26844 -1813
14818a813K8635l990J5007m410k2622k6561r313L1800J2785L5466P342j9831P478
$$ -1813 26822 22832 37839 33429 10807 -15754 -25067 6733 19518 54984 62326 42495 49973
14805D9973q520l0093l5091n0r962j3751K7715L9130j2983m4J0319N765k2382
$$ 49973 41453 11360 -23731 -23781 -33743 -47494 -19779 19351 6368 6324 16643 22408 26
14792B6l3974K6018K716jm270p447j0542J5914K5070J5586j8955O73K718m930
$$ 26 -33948 -7930 -5214 -5215 -9485 -16932 -27474 -11560 13510 29096 10141 10814 13532 8602
14778H602k667J2438j8357K0226l4556M743K3363J1505m620J4212J430k2345K2837
$$ 8602 5935 18373 16 20242 -14314 -9571 13792 25297 20677 34889 36319 13974 36811
14765C6811M1170K04l2347l9916k3444R860K3752k7851r809M406J8774L6238k339
$$ 36811 77981 78185 45838 5922 -17522 -7662 16090 -11761 -21570 -17164 1610 37848 35509
14752C5509k109k3402J0753L3615J6944k5063j3948k739J270m094J0472k5504
$$ 35509 33400 9998 20751 54366 71310 46247 32299 29560 30830 26736 37208 11704
14740A1704j812j1750M731O039p630k7783j8961l037n853p024R093k66J2998K6315
$$ 11704 9892 -1858 2873 8912 1282 -26501 -45462 -48499 -54352 -61376 -52283 -52549 -39551 -13236
14726a3236J3068M1768n904o893j9413L0280o435m7257j1254J593O028P687k980
$$ -13236 -168 41600 35696 28803 9390 39670 33235 -14022 -25276 -23683 -17655 -9968 -12948
14713a2948l1720L676K5865r994j317K4860j1995k4981j637L7728n6635l7492
$$ -12948 -44668 -40992 -15127 -25121 -26438 -1578 -13573 -38554 -40191 -2463 -59098 -96590
14701i6590L4028L8326K0618M4069P495p011m4125l3489o321l2501J596K2658
$$ -96590 -62562 -24236 -3618 40451 47946 40935 -3190 -36679 -43000 -75501 -73905 -51247
14689e1247M4728K0971k536j3208J450o672J2291K1037r882K527Q082J1570J7815
$$ -51247 -6519 14452 11916 -1292 158 -6514 5777 26814 16932 19459 27541 39111 56926
14676E6926Q212o274o113J0764j1333k30k1871P675k0093l7030L348M1218J4370
$$ 56926 65138 58864 52751 63515 52182 51952 30081 37756 17663 -19367 -16019 25199 39569
14663C9569J3260M857m5262j871K7599k285l9737J0484L8034J1575m1612k8672
$$ 39569 52829 57686 12424 10553 38152 35867 -3870 6614 44648 56223 14611 -14061
14651a4061l74J9052j3448J8624J3588k7158q102r044m1590j4261J4961K5119
$$ -14061 -14435 4617 -8831 9793 23381 -3777 -11879 -20923 -62513 -76774 -61813 -36694
14639c6694L6831K5982j3261k62P448n860k7436k9516K2373l4770j1864M3596
$$ -36694 137 26119 12858 12596 20044 14184 -13252 -42768 -20395 -55165 -67029 -23433
14627b3433N1219L5555n0004l9088K4133j7075k9778J7102K6400j1313j0709k0854
$$ -23433 27786 63341 13337 -25751 -1618 -18693 -48471 -31369 -4969 -16282 -26991 -47845
14615d7845J5170L8705K0428j326j463k0067m9119J0402p570J1245N865J1436
$$ -47845 -32675 6030 26458 25132 23669 3602 -45517 -35115 -42685 -31440 -25575 -14139
14603a4139M389k0631R820L4015l3983k0298J5360Q146q79J0147m465j621J6287
$$ -14139 -9750 -30381 -20561 13454 -20529 -40827 -25467 -17321 -18200 -8053 -12518 -14139 2148
14590B148p599j2707p370j8910J5136j2887k9858L2022M3726j3768K0229L2046
$$ 2148 -5451 -18158 -25528 -44438 -29302 -42189 -72047 -40025 3701 -10067 10162 42208
14578D2208K659q467k4793k7513J829p50p46J1617k238L868K3354r308j8526M604
$$ 42208 44867 36400 11607 -15906 -14077 -14827 -15573 -3956 -6194 -2326 21028 11720 -6806 -2202
14564b202L3283p821j9529P418O474j6503Q11l060L6319J6661k1546l1898j306
$$ -2202 31081 23260 3731 11149 17623 1120 1931 -1129 35190 51851 30305 -1593 -2899
14551b899J5154J7578J6146r690j8888J186M149L515l3985r419L1320L7507K9544
$$ -2899 12255 29833 45979 36289 17401 18587 22736 26251 -7734 -17153 14167 51674 81218
14538H1218K8879J3524p322J3646L3561K5159O0410N8955P1691J02356J44149
$$ 81218 110097 123621 116299 129945 163506 188665 249075 308030 379721 482077 626226
14527F26226J83398K72786K74844J78825j10926m03306l70672k28901j23157p0640
$$ 626226 809624 1082410 1357254 1536079 1425153 1021847 651175 422274 299117 228477
14517B28477n5622l5689l9084r980L4694j0711J1896J9399J531k5895j8451J284
$$ 228477 172855 137166 98082 88102 122796 112085 123981 143380 144911 119016 100565 101849
14505A01849l0396l6413m4565k3652j5585J8229N0976J2701Q23Q177K4886P090
$$ 101849 71453 35040 -9525 -33177 -48762 -30533 20443 33144 33967 42144 67030 74120
14493G4120m4361l1787k449J4271J2210l587k7954o762J3241k6043l4527M036
$$ 74120 29759 -2028 -4477 9794 22004 18417 -9537 -16299 -3058 -29101 -63628 -59592
14481e9592K6756n17r33o926j5745k0403l263L8187J4002k1790l205J4292L0332
$$ -59592 -32836 -33353 -34286 -41212 -56957 -77360 -80623 -42436 -28434 -50224 -53429 -39137 -8805
14468h805R913j1234Q245j3986j5323j9692k477o058J4086L250k5213j4650m006
$$ -8805 1108 -10126 -1881 -15867 -31190 -50882 -53359 -59417 -45331 -42081 -67294 -81944 -85950
14455h5950L0531K9290n130l4584n199j1262K9749M7593j618l471o165k3522K2319
$$ -85950 -55419 -26129 -31259 -65843 -71042 -82304 -52555 -4962 -6580 -10051 -16216 -39738 -17419
14442a7419M5479N308m2592p137P814K1999L1149M0941q635n3703j3101J0707
$$ -17419 28060 33368 -9224 -16361 -8547 13452 44601 85542 76907 23204 10103 20810
14430B0810J40q37k0629K6953J8081k4347k9467J5891j2787j9004N970L8913J0406
$$ 20810 20950 20113 -516 26437 44518 20171 -9296 6595 -6192 -25196 -19226 19687 30093
14417C0093p745K2390j6378k2742k1527K5619K9742J4560n281K4627r208k8464
$$ 30093 22348 44738 28360 5618 -15909 9710 39452 54012 48731 73358 64150 35686
14405C5686k8047j8788m253N371J1929l9823R734l2109k0763R932J2757J2642
$$ 35686 7639 -11149 -15402 -10031 1898 -37925 -28191 -60300 -81063 -71131 -58374 -45732
14393d5732J9958j4537Q706K0010J5621J2382K9289M005j4158j2619k7007q132
$$ -45732 -25774 -40311 -31605 -11595 4026 16408 45697 49702 35544 22925 -4082 -12214
14381a2214J684l276j5738R478K5727M4142j9181j5644j292K1815r170k8395k7663
$$ -12214 -10530 -13806 -29544 -20066 5661 49803 30622 14978 13686 35501 26331 -2064 -29727
14368b9727q80j2119R481J0184N215j9016q723j2261q929Q151J0195j270n309
$$ -29727 -30607 -42726 -33245 -23061 -17846 -36862 -45585 -57846 -66775 -58624 -48429 -49699 -55008
14355e5008J776J0681K3701n978n9539n9811K5496Q704J8461K4259M4185L1656
$$ -55008 -53232 -42551 -18850 -24828 -84367 -144178 -118682 -109978 -91517 -67258 -23073 8583
14343H583l29J379P102p644K78J1818J285k6285j4414J5375L1521o754j1816K4406
$$ 8583 8254 9633 16735 9091 9369 21187 22472 -3813 -18227 -2852 28669 21915 10099 34505
14329C4505p503r101j1881j5658K9788J0307l6085k718L0726K4860j0889k47o896
$$ 34505 27002 17901 6020 -9638 20150 30457 -5628 -8346 22380 47240 36351 36104 29208
14316B9208p515K215j9740J7234o935l2274r132P622K7925o197l8179J4081J3479
$$ 29208 21693 23908 4168 21402 14467 -17807 -26939 -19317 8608 2411 -35768 -21687 -8208
14303h208N4522K2640j7582M213j0009k9138L0365N2356P7115N3210m121l5913
$$ -8208 46314 68954 51372 55585 45576 16438 46803 99159 176274 229484 225363 189450
14291A89450j9923k9178l9996m0995j1642l1780L760j1368r67J1363K0881l4676
$$ 189450 169527 140349 100353 59358 47716 15936 19696 8328 7361 18724 39605 4929
14279D929K788P122J0923k6908k324N78k765P156k0615j2393j1770j4103n503
$$ 4929 7717 14839 25762 -1146 -3470 -2892 -5657 1499 -19116 -31509 -43279 -57382 -62885
14266f2885K5311N4772L3320p988j7742J632N856J5295m600j6791Q794J9101j7688
$$ -62885 -37574 17198 50518 42530 24788 26420 32276 47571 42971 26180 34974 54075 36387
14253C6387k4228k4164m287K5650J8477m123l4662p304j81J1816J8947J2691k1740
$$ 36387 12159 -12005 -16292 9358 27835 23712 -10950 -18254 -18435 -6619 12328 25019 3279
14240C279j3423l52j4821J1619Q497K5218K6843k9335p950O570n620K3994Q928
$$ 3279 -10144 -10496 -25317 -13698 -5201 20017 46860 17525 9575 16145 10525 34519 43447
14227D3447j8007K5754Q157r996k3397j9884j745J9110L1001r208n8682j0458
$$ 43447 25440 51194 59351 49355 25958 6074 4329 23439 54440 45232 -13450 -23908
14215b3908R766j5613l2910j7559J7588M6712L4846J6845L3173M381k4635j8668
$$ -23908 -14142 -29755 -62665 -80224 -62636 -15924 18922 35767 68940 73321 48686 30018
14203C0018j9799l0457P312j2378j7867o391l2790j4619J5511L3071J9905J6859
$$ 30018 10219 -20238 -12926 -25304 -43171 -49562 -82352 -96971 -81460 -48389 -28484 -11625
14191a1625K4014J8467J5249k3555m8701o12L2255K1154K3565R603K3525L8246
$$ -11625 12389 30856 46105 22550 -26151 -26763 5492 26646 50211 59814 83339 121585
14179A21585N1730L907k7731Q88K3629K4115J364q618J543L1417O5857L8229M0502
$$ 121585 173315 177222 149491 150379 174008 198123 199487 190869 192412 223829 289686 327915 368417
14166C68417K8823m5403r9984j04414m6712j4729J2556K6269q65P46k9317q757
$$ 368417 397240 351837 251853 147439 100727 85998 98554 124823 123958 124704 95387 86630
14154H6630j0901l748L3294L2023J9548k1436K72l0992j1662k694K312J6224O872
$$ 86630 75729 71981 105275 137298 156846 135410 135682 104690 93028 90334 92646 108870 115742
14141A15742R330K6609j5159m1075k4500J7201K8772L8726J0727j007K2708j3768
$$ 115742 125072 151681 136522 95447 70947 88148 116920 155646 166373 165366 188074 174306
14129A74306k5773J4861n892j4436J1819J9736l298k3690k072L728M1041N0017
$$ 174306 148533 163394 157502 143066 154885 174621 171323 147633 145561 149289 190330 240347
14117B40347J5516j9800m688K6381k1990l2094n271J4410L2871M9650K2532k3793
$$ 240347 255863 236063 231375 257756 235766 203672 198401 212811 245682 295332 317864 294071
14105B94071k020L9378j1441Q641L0628M2712n767j4796J5219K434N8049P7293
$$ 294071 292051 331429 319988 328629 359257 401969 396202 381406 396625 399059 457108 534401
14093E34401L9339q702o86K4380K1470N1865L7805M3465R3875N4906M5325J5684
$$ 534401 573740 565038 564352 588732 610202 662067 699872 743337 837212 892118 937443 953127
14081I53127r1O9001Q1075R9521R3931Q1649N2697N3008J18628J86277J89883
$$ 953127 953036 1022037 1103112 1202633 1296564 1378213 1430910 1483918 1602546 1788823 1978706
14070A978706K12071K06295K28094K95063L03144L57221M50788N47517P01547
$$ 1978706 2190777 2397072 2625166 2920229 3223373 3580594 4031382 4578899 5280446
14061E280446R67164J330797J821750K444945K939891K890684K520345K762425
$$ 5280446 6247610 7578407 9400157 11845102 14784993 17675677 20196022 22958447
14053B2958447L486651M552058N647001O761524Q123525J0771461J5033083K1847748
$$ 22958447 26445098 30997156 36644157 43405681 51529206 62300667 77333750 99181498
14045I9181498L2319007M6928628O0414181N6078403P786182p0124060q7885121
$$ 99181498 131500505 178429133 238843314 294921717 302707899 232583839 144698718
14038A44698718n5539408k9850243j6778931j0219669o753611m842876l724939
$$ 144698718 89159310 59309067 42530136 32310467 25556856 20713980 16989041
14031A6989041k805382k047884j549331j166590q87291o19599l90627l82457o73305
$$ 16989041 14183659 12135775 10586444 9419854 8532563 7912964 7522337 7139880 6466575
14022F466575r38415q25487o41771m60233k97159k35848k55916k43096j72848
$$ 6466575 5528160 4702673 4060902 3600669 3303510 3067662 2811746 2568650 2395802
14013B395802j46257j17990j25199j14106j01895j07849j07445j10211p7779m1501
$$ 2395802 2249545 2131555 2006356 1892250 1790355 1682506 1575061 1464850 1387071 1345570
14003A345570m8531k2415l7638l9298j04924j02783o6946l9621k7809k4480K2533
$$ 1345570 1297039 1274624 1236986 1197688 1092764 989981 923035 883414 855605 831125 853658
13992H53658m0013m0303m3950j262m705k0696k4533k7717J560l6882j7637P03
$$ 853658 813645 773342 729392 728130 723425 702729 678196 650479 652039 615157 597520 598223
13980E98223j1256J716j8576n2353l7561k3904K0383M058K7293k496o0957n4048
$$ 598223 586967 588683 570107 517754 480193 456289 476672 480730 508023 505527 444570 390522
13968C90522k5190n446j5702j7278l0517l4130j3072K7155L1402K8786K7878J1276
$$ 390522 365332 359886 344184 326906 296389 262259 249187 276342 307744 336530 364408 375684
13956C75684m2414j6843K0762l765m8557m613l7393L075j1648J1950j5236j4876
$$ 375684 333270 316427 337189 333424 284867 280254 242861 245936 234288 246238 231002 216126
13944B16126J5962K1114L8924q976m423M544j6382J5840J7233j5726m7757j0351
$$ 216126 232088 253202 292126 283150 278727 283271 266889 282729 299962 284236 236479 226128
13932B26128J2178m64L1409k2678l6966R626j3131p834n001k1718j4430o907N131
$$ 226128 238306 237842 269251 246573 209607 219233 206102 198268 193267 171549 157119 150212 155343
13919A55343l8906p9693k9706P6865L187n5214J0119L1590J9590q368J2429R509
$$ 155343 116437 36744 7038 83903 87090 31876 41995 73585 93175 84807 97236 106745
13907A06745n676m2986J6988K4589J6771K9244K9398j0775K7124p823l9972K8453
$$ 106745 101069 58083 75071 99660 116431 145675 175073 164298 191422 183599 143627 172080
13895A72080O301n602k7096j9203M847J3665N4332P855J8881j0162k3662j2978
$$ 172080 178381 172779 145683 126480 131327 144992 199324 207179 226060 215898 192236 179258
13883A79258n3464k2104Q910j9342N4093M4344L958j4487j9285J9943r08J6633
$$ 179258 125794 103690 112600 93258 147351 191695 195653 181166 161881 181824 180916 197549
13871A97549j8366j5665m609j2390j0941l1554j8438j0944J9637k947J298J7354
$$ 197549 179183 163518 158909 146519 135578 104024 85586 74642 94279 91332 92630 109984
13859A09984j4830R936M7309K2114l4023m8714k5366p3397J2136L4278J1008k1049
$$ 109984 95154 105090 152399 174513 140490 91776 66410 -6987 5149 39427 50435 29386
13847B9386K3192K9586k117n428J0659K047L764m7384n595K5166J9608L354k8086
$$ 29386 52578 82164 80047 74619 85278 87325 91089 43705 38110 63276 82884 86238 58152
13834E8152r024J2007n320j2268l652L0050R980K698J0901j519j0853j6959Q368
$$ 58152 49128 61135 55815 43547 39895 69945 79925 82623 93524 92005 81152 64193 72561
13821G2561R907j7241k3598J3280J2680J7984m826Q30k6232N768k9965O780L5179
$$ 72561 82468 65227 41629 54909 67589 85573 80747 81577 55345 61113 31148 37928 73107
13808G3107m982j6420j295j6202J5906M1905j740l2131J278k792j6024k1884O184
$$ 73107 68125 51705 50410 34208 50114 92019 90279 58148 59426 56634 40610 18726 24910
13795B4910J5000J3121L032j561J1070j2069n725J8368j7103l3125l099P163J2394
$$ 24910 39910 53031 56063 54502 65572 53503 47778 66146 49043 15918 12819 19982 32376
13782C2376K3414k1886K159K4232M2993J6844k0034j8118j358j0667l8566k5952
$$ 32376 55790 33904 36063 60295 103288 120132 100098 81980 80622 69955 31389 5437
13770E437Q388K9222P162k0280J2248L0436j6609j308J1493L2855O443k1051r021
$$ 5437 13825 43047 50209 29929 42177 72613 56004 54696 66189 99044 105487 84436 75415
13757G5415M754j205k2632L2491J5262l986q364m7216m9835p525J5067J3059K7753
$$ 75415 80169 78964 56332 88823 104085 100099 91735 44519 -5316 -12841 2226 15285 43038
13744D3038N160K085M391K6831l790k7827l7421j432M5820M6156M8702n728j5735
$$ 43038 48198 50283 54674 81505 77715 49888 12467 11035 56855 103011 151713 145985 130250
13731A30250l4399l9309o756j4272Q013j7945L2528j3902k54j6226j0555R032
$$ 130250 95851 56542 49786 35514 43527 25582 58110 44208 43954 27728 17173 26205
13719B6205K777K6490p757k5735j4415o216K4299K7541m5254k2041K7188o006
$$ 26205 28982 55472 47715 21980 7565 1349 25648 53189 7935 -14106 13082 7076
13707G076j9234N645m707J0163K444N0035J6791j3031J328j2850M86J4277N151
$$ 7076 -12158 -6513 -11220 -1057 1387 51422 68213 55182 56510 43660 44146 58423 63574
13694F3574j7755r103J549N516k8140k2239r903J9128M3355J0119k5298k7102
$$ 63574 45819 36716 38265 43781 15641 -6598 -16501 2627 45982 56101 30803 3701
13682C701K4022N742o015K3481j4629J1656J0349j5183l7950r356L519L7338Q962
$$ 3701 27723 33465 27450 50931 36302 47958 58307 43124 5174 -4182 -663 36675 45637
13669D5637m2586k6746k0958J7034M8494J8535O110Q356N574j6872J7776o201
$$ 45637 3051 -23695 -44653 -27619 20875 39410 45520 53876 59450 42578 60354 54153
13657E4153n0307j0823K4165n037j3709P198J3391k7213J5887Q043n322j4087
$$ 54153 3846 -6977 17188 12151 -1558 5640 19031 -8182 7705 15748 10426 -3661
13645c661J4603J37j0665j3486J7096J566k8939J184M1570r186L878j7821M607
$$ -3661 10942 11079 414 -13072 4024 5590 -23349 -22165 19405 10219 14097 -3724 883
13632H83j9396j4863J3161k0636k4318J1685L8298j6661L1133K6714j9766j4021
$$ 883 -18513 -33376 -20215 -40851 -65169 -53484 -15186 -31847 -714 26000 6234 -7787
13620g787P694J7021p270k4133k1087j4102P694J4476L5019K7009P037J7686K534
$$ -7787 -93 16928 9658 -14475 -35562 -49664 -41970 -27494 7525 34534 41571 59257 61791
13607F1791l1456o927m5442k2341K3224O3799L4418P147n8128k9086l72J0872
$$ 61791 30335 23408 -22034 -44375 -21151 42648 77066 84213 26085 -3001 -3373 7499
13595G499M1787j1989N288k4694k181j030l0886p384M642q738M034K473L4087
$$ 7499 49286 37297 42585 17891 15710 14680 -16206 -23590 -18948 -27686 -23652 -21179 12908
13582A2908N5801n244j0358j7011M736R676J3298k8347j9693M801m45J7040L944
$$ 12908 68709 63465 53107 36096 40832 50508 63806 35459 15766 20567 20122 37162 41106
13569D1106k955L8869L3022L6551L8981J4197P34J3016J1479L6660N5401Q9766
$$ 41106 38151 77020 110042 146593 185574 199771 200505 213521 225000 261660 317061 406827
13557D06827R3757J35363J91846L01850L25545J21922k04534m39218l47385j86466
$$ 406827 500584 635947 827793 1129643 1455188 1577110 1372576 933358 585973 399507
13547C99507j06488r1075n8281j992k0318l2589m977k798K1528j3054j2947o284
$$ 399507 293019 201944 143663 141671 121353 88764 83787 80989 102517 89463 76516 70232
13535G0232L1474j8037j7351K6574j2828o8464l1986J5766M1638J4848j0499J5456
$$ 70232 101706 83669 66318 92892 80064 11600 -20386 -4620 37018 51866 41367 56823
13523E6823j3367l5972J6553N988n6267l1192K1643O441J4474J2408K3300o59
$$ 56823 43456 7484 24037 30025 -26242 -57434 -35791 -29350 -14876 -2468 20832 20173
13511B0173j5678j7799J3301L886n5671q792J2213M0191N1512J2860m2164m8678
$$ 20173 4495 -13304 -3 3883 -51788 -60580 -48367 -8176 43336 56196 14032 -34646
13499c4646P582L8973L1783k742J0463j6898l112Q551p735j3146l8902R241N8555
$$ -34646 -27064 11909 43692 40950 51413 34515 31403 39954 32219 19073 -19829 -10588 47967
13486D7967K8906k4772J1489k0382R11M0033L677l7120q856j1806J1415k458j337
$$ 47967 76873 52101 63590 43208 44119 84152 87829 50709 41853 30047 41462 39004 37667
13473C7667J8544J449l5437o9923l7685N428J7940K4782O35O151J2150o46J2751
$$ 37667 56211 57660 22223 -47700 -85385 -79957 -62017 -37235 -36600 -30449 -18299 -18945 -6194
13460f194j2733J476q384L7264J0529l0057j800J8823J0859P086J6502L2773p791
$$ -6194 -18927 -17451 -25835 11429 21958 -8099 -9899 8924 19783 26869 43371 76144 68353
13447F8353k8141q366j3784l1762k5140J3002J3963L3891J3768j4901K0594M498
$$ 68353 40212 31846 18062 -13700 -38840 -25838 -11875 22016 35784 20883 41477 45975
13435D5975k5418j6200k1553r525J8809k186K068J8675K4796M0621k1917k6802
$$ 45975 20557 4357 -17196 -26721 -7912 -10098 -8030 10645 35441 76062 54145 27343
13423B7343M736j6981K8724L6414k2160k5616l4451j5771J7001J7720o279j5874
$$ 27343 32079 15098 43822 80236 58076 32460 -1991 -17762 -761 16959 10680 -5194
13411e194J2837k2451o353K6033K2927P390R184K0920j661J9752q902r468K8445
$$ -5194 7643 -14808 -21161 4872 27799 35189 44373 65293 63632 83384 74482 65014 93459
13398I3459J6736J2229K241K746K3908N6534J3548Q371N4317O0910R1093Q6028
$$ 93459 110195 122424 124665 127411 151319 207853 221401 229772 284089 344999 436092 522120
13386E22120J18234K19005K62636L38606L27409J83495n5998l07603m26842l87783
$$ 522120 640354 859359 1121995 1460601 1788010 1971505 1915507 1607904 1181062 793279
13376G93279k47266r7675j11619q3372n1887l9693j6558m8441k4938K66j3163
$$ 793279 546013 448338 336719 253347 201460 161767 145209 96768 71830 72096 58933
13365E8933r575Q820m339j1804J9895N140J2900M310N844J2333j0912J6100K9314
$$ 58933 49358 58178 53839 42035 61930 67070 79970 84280 90124 102457 91545 107645 136959
13352A36959K1764j4930j058n069J9286O9045R7324Q6727N0828k2508p6295j15174
$$ 136959 158723 143793 142735 137666 156952 225997 323321 410048 460876 438368 362073 246899
13340B46899q6845m0431k0259n2094k7107K519Q477j0434O525L4951P502j9781
$$ 246899 160054 119623 99364 47270 20163 22682 31159 20725 27250 62201 69703 49922
13328D9922l0814j4099L1173K7983k5683k2588j4424M1733L9903m3610l3284k0809
$$ 49922 19108 5009 36182 64165 38482 15894 1470 43203 83106 39496 6212 -14597
13316a4597j0712O700J3426J1936K8013k1666k3170j1816j7757l6547r282K0733
$$ -14597 -25309 -18609 -5183 6753 34766 13100 -10070 -21886 -39643 -76190 -85472 -64739
13304f4739N1167L7582l6870n010K9363J7229j1824j9573j8027J332J3363p522
$$ -64739 -13572 24010 -12860 -17870 11493 28722 16898 -2675 -20702 -19370 -6007 -13529
13292a3529M5502j7033m3952n125K4443j4134r43J4450K9302N025k2421j3635
$$ -13529 31973 14940 -29012 -34137 -9694 -23828 -24771 -10321 18981 24006 1585 -12050
13280a2050J7095J3994Q83m9257K097k106J5523K2802O822n1272l3480n6o219
$$ -12050 5045 19039 19922 -29335 -27238 -29344 -13821 8981 15803 -35469 -68949 -69005 -75224
13267g5224M0899L9188r747L2319Q919k060k1581o311R557l2135m0412k511J550
$$ -75224 -34325 4863 -4884 27435 36354 34294 12713 6402 15959 -16176 -56588 -59099 -57549
13254e7549M2918J1393m0154k3415J5920P015k545j5997N3001j1192j9882j2492
$$ -57549 -14631 -3238 -43392 -66807 -50887 -43872 -46417 -62414 -9413 -20605 -40487 -52979
13242e2979m324J4205j6381k069N654j5967j7661k9491m9911o085L8395M9756
$$ -52979 -57303 -43098 -59479 -61548 -55894 -71861 -89522 -119013 -168924 -175009 -136614 -86858
13230h6858k491K224N851J0468L1135M6007J2305j159p015N701M854r523J3386
$$ -86858 -89349 -87125 -81274 -70806 -39671 6336 18641 17482 10467 16168 21022 11499 24885
13217B4885K2340J1980q063l837k4817j2743l1205Lk9886Q809L3359M9511j2997
$$ 24885 47225 59205 51142 47305 22488 9745 -21460 -21457 -51343 -42534 -9175 40336 27339
13204B7339j329K0K5534m9l8862J7815L723r323m1473J1885K5528L0796R029j8187
$$ 27339 26010 26030 51564 51515 12653 30468 34191 24868 -16605 -4720 20808 51604 60633 42446
13190D2446r315K2096L5670M7449L3005j4051L0226L0049L234J5827m369K9556
$$ 42446 33131 55227 90897 138346 171351 157300 187526 217575 220809 236636 232267 261823
13178B61823K0721Q71J159m5784p2101n939l866l2042o7359l7061J1844j659K237
$$ 261823 282544 283415 284574 238790 166689 160750 156884 124842 57483 20422 32266 30607 32844
13165C2844L1215k8268j9988j3726j8551L0675J076J109j5631q767j7204P043
$$ 32844 64059 35791 15803 2077 -16474 14201 15277 16386 755 -8012 -25216 -18173
13153a8173l783j8537j1601J9129Q341k8264J9174K2207J7851m582J2200K9138
$$ -18173 -21956 -40493 -52094 -32965 -24624 -52888 -33714 -11507 6344 1762 13962 43100
13141D3100j4585J8672J2154L703j2010J75K6618O36L190O799j5754k6456j9232
$$ 43100 28515 47187 59341 63044 51034 51209 77827 78463 81653 88452 72698 46242 27010
13128B7010o997K0714j1397Q254R754k8486p208k2858K4532M8098M9716J3082
$$ 27010 20013 40727 29330 37584 47338 18852 11644 -11214 13318 61416 111132 124214
13116A24214J6388o9o4159m9294j2717n664q586L0838N7492K0470j541J5715L5498
$$ 124214 140602 140533 76374 27080 14363 8699 113 30951 88443 108913 107372 123087 158585
13103A58585O3965K6857J7630j0816l0768m2230n3798m1063K8714L5119L4335
$$ 158585 222550 249407 267037 256221 225453 183223 129425 88362 117076 152195 186530
13092A86530M6772O2355L7356K1779Q7315Q2589J23864K01837K79260L73456M01654
$$ 186530 233302 295657 333013 354792 442107 524696 648560 850397 1129657 1503113 1904767
13081A904767K33606j60130m61879m97957l79676k26892j37741o2887l9878k5044
$$ 1904767 2138373 1978243 1516364 1018407 638731 411839 274098 211211 171333 146289
13071A46289j8089r549K4978L0841K1500M5931J681J9838K2283j1936j611J0158
$$ 146289 128200 118651 143629 174470 195970 241901 243582 263420 285703 273767 272156 282314
13059B82314K6559K2983O5908P3235O0041P7579J03245J27177J18647K6292j16219
$$ 282314 308873 331856 397764 470999 531040 608619 711864 839041 957688 983980 867761
13048H67761j78328j25579j17146j06519p6466l4705l5027k1224Q480k2871L726
$$ 867761 689433 563854 446708 340189 263723 229018 193991 172767 181247 158376 162102
13037A62102J5609K280L5555l9639k0691J5509j4136j2208K2693J3882K9667K8188
$$ 162102 177711 179991 215546 175907 155216 170725 156589 144381 167074 180956 210623 238811
13025B38811k9368k2290l225K9454K6835k6885L187o532m645M278K3746j5975
$$ 238811 209443 187153 183928 213382 240217 213332 216519 209987 205342 209620 233366 217391
13013B17391j3549j07L3103M9307m863j3863J4141M5238L9293j505K1233P413
$$ 217391 203842 203735 236838 286145 281282 267419 281560 326798 366091 364586 385819 393232
13001C93232n1707j1143J7475j12J7590L7936J8680k2464K6224K8365L0269K3955
$$ 393232 341525 330382 347857 347745 365335 403271 421951 399487 425711 454076 484345 508300
12989E08300M2350k6780n1400J1379R5722P6699O460K6564L9251M1129N6755P1979
$$ 508300 550650 523870 472470 483849 579571 656270 662730 689294 728545 769674 826429 898408
12977H98408K2425R005L5212K9845J8259N3468N2060J14489J28760J02822R0633
$$ 898408 920833 929838 965050 994895 1013154 1066622 1118682 1233171 1361931 1464753 1555386
12966A555386R2156Q6421J00235R8645R9931J23975O7560P2505J07976J83828
$$ 1555386 1647542 1733963 1834198 1932843 2032774 2156749 2224309 2296814 2404790 2588618
12956B588618J97522K70774L45658L63603L77510M54085N29054N08986O48652
$$ 2588618 2786140 3056914 3402572 3766175 4143685 4597770 5126824 5635810 6284462
12947F284462Q63186J043313J357794J853252K493698L363814M237348M813643
$$ 6284462 7147648 8190961 9548755 11402007 13895705 17259519 21496867 26310510
12939B6310510N007625N032693N434714O455266Q023667R982377J2674934J6782538
$$ 26310510 31318135 36350828 41785542 48240808 56264475 66246852 78921786 95704324
12931I5704324K3268505L2974331M6417451O1451405O9172716N3379487N697062
$$ 95704324 118972829 151947160 198364611 259816016 328988732 382368219 388065281
12924C88065281m9936860q3952399q2195824n7376120l4567161k0836666j3292759
$$ 388065281 338128421 254176022 171980198 114604078 80036917 59200251 45907492
12917D5907492q993786o409323m751624l478253k550637k102247j960970j898367
$$ 45907492 36913706 30504383 25752759 22274506 19723869 17621622 15660652 13762285
12909A3762285j724954j431695j135839r33934q26923p64326o62130n73977m86890
$$ 13762285 12037331 10605636 9469797 8535863 7708940 6944614 6282484 5708507 5221617
12900E221617l76745l57385l32610k37952k21540k10568j75060j79777j88074
$$ 5221617 4844872 4487487 4154877 3916925 3695385 3484817 3309757 3129980 2941906
12891B941906j66370j42801j53116j49215r6659j17507j03209o4322o2762n4886
$$ 2941906 2775536 2632735 2479619 2330404 2233745 2116238 2013029 1948707 1885945 1831059
12881A831059r5948l9449J7754K3008P417M10l2313Q915J6536P274n3999j30413
$$ 1831059 1735111 1695662 1713416 1736424 1743841 1744251 1711938 1720853 1737389 1744663 1690664 1560251
12869A560251j43213j52337n9102m9354l1677m9531p0897l9555m8868M871l9000
$$ 1560251 1417038 1264701 1205599 1156245 1124568 1075037 1004140 964585 915717 920588 881588
12858H81588j7428l578K3132L143p7066o0588k4161j1456l8350m3715j9742J8194
$$ 881588 864160 860582 883714 886857 809791 749203 725042 713586 675236 631521 611779 629973
12846F29973q507N050n89J2270o704L1898m550j9365M6965Q27j5413L1332m58
$$ 629973 621466 626516 625927 638197 631493 663391 658841 639476 686441 687268 671855 703187 702729
12833G02729K7626M4438N6755J12826J26430J19202M6526n4950j52203j64263
$$ 702729 730355 774793 831548 944374 1070804 1190006 1236532 1181582 1029379 865116
12823H65116j42309r1237p0193k0039j7577k8928J3509J588l486J4910p526j4663
$$ 865116 722807 631570 561377 541338 523761 494833 508342 509930 506444 521354 513828 499165
12811D99165l6928k9826k5531q342Q447K895J89p5089q3503l6818M5989j2719
$$ 499165 462237 432411 406880 398538 406985 409880 410069 334980 251477 214659 260648 247929
12799B47929k5553J3205n739J1400K9738L6528j0995n088J0293l012O539k6241
$$ 247929 222376 235581 229842 241242 270980 307508 296513 291425 301718 298706 305245 279004
12787B79004k6350K3996L2779K3642k0208q089l991O666P629L951k4603k9697
$$ 279004 252654 276650 309429 333071 312863 304774 300783 307449 315078 319029 294426 264729
12775B64729M0509O1666L2750N192k5173l4223q169m9819m9440P127J9040J8193
$$ 264729 305238 366904 399654 404846 379673 345450 337281 287462 238022 245149 264189 282382
12763B82382r838l6827Q514L6767L6174j0652l6381J3731k3585j6471k5157J2802
$$ 282382 272544 235717 244231 280998 317172 306520 270139 283870 260285 243814 218657 231459
12751B31459K7637l3876l4895J6841k153L477m418j2907M3J0282Q31J0815j7226
$$ 231459 259096 225220 190325 207166 205013 208490 204072 191165 191208 201490 202321 213136 195910
12738A95910n5339m5463l1341l3807P607N3264N2599L0199k816j989J1568K7400
$$ 195910 140571 95108 63767 29960 37567 90831 143430 173629 170813 168824 180392 207792
12726B07792J3589j6042m6P311K6774J4086k8314L318r493K4368k8786q3321k9295
$$ 207792 221381 205339 205293 212604 239378 253464 225150 228468 218975 243343 214557 131236 101941
12713A01941m001J607J7715L0956L3031K5970R05k0721n362j045L626j2906k989
$$ 101941 97940 99547 117262 148218 181249 207219 208124 187403 182041 180996 184622 171716 168727
12700A68727K602R602J3540K387j1613k0082M818L4712k4060k3743j3746j83Q081
$$ 168727 171329 180931 194471 196858 185245 165163 169981 204693 180633 156890 143144 142961 151042
12687A51042J669j086k4454p633M045j5150Q590L6713l7394j0971K2601R551j4500
$$ 151042 152711 151625 127171 119538 123583 108433 117023 153736 116342 105371 127972 137523 123023
12674A23023J2615Q968q585k2860j7587L767j4638k5842P116J6518j8744J1106
$$ 123023 135638 144606 136021 113161 95574 99341 84703 58861 65977 82495 63751 74857
12662G4857J1134J1364K995Q929j6123R642M0127j6060m1157p116k2120j1946
$$ 74857 85991 97355 100350 109279 93156 102798 142925 126865 85708 78592 56472 44526
12650D4526J9134J2550J4021K1817J7473l0722r744J7099K2322K790k3229j6520
$$ 44526 63660 76210 90231 112048 129521 98799 89055 106154 128476 131266 108037 91517
12638I1517N08K4886k16k4235k6732J296p628j0833m339K0297p951m906j1005
$$ 91517 92025 116911 116695 92460 65728 67024 59396 48563 44224 64521 56570 51664 40659
12625D0659L7589L9296J9942k1727J1924K5256M1447K4874j2351k5860m3140j7294
$$ 40659 78248 117544 137486 115759 127683 152939 194386 219260 206909 181049 137909 120615
12613A20615j9400o0738k2539J6612l992K7555O0833M4486j5871k5376k8291k1957
$$ 120615 101215 40477 17938 34550 30558 58113 118946 163432 147561 122185 93894 71937
12601G1937k1163L6278M1244r089k3409J890k2706k2580M091K8588r169J2309
$$ 71937 50774 87052 128296 119207 95798 97688 74982 52402 56493 85081 75912 88221
12589H8221j3251N725O10j097j2418r130K155j2457R537K9707m1299J6393M8474
$$ 88221 74970 80695 81305 80208 67790 58660 60815 48358 57895 87602 46303 62696 111170
12576A11170j6159l3851P704K2753j4362j3931K5805R12R561j3691p942N618P758
$$ 111170 95011 61160 68864 91617 77255 63324 89129 90041 99602 85911 77969 83587 91345
12563I1345l0039j3273j6808j7640j5218L3208N9322o57j1857K9626j1946m3315
$$ 91345 61306 48033 31225 13585 -1633 31575 90897 90240 78383 108009 96063 52748
12551E2748l690J7166J2527j0787n462L620L1687K8022o364k323K461J5204j6793
$$ 52748 49058 66224 78751 67964 62502 66122 97809 125831 119467 117144 119605 134809 118016
12538A18016j4506p915k7657n739K6041P044k040J7064j8678j8482K4296K9746
$$ 118016 103510 95595 67938 62199 88240 95284 93244 110308 91630 73148 97444 127190
12526A27190k0079n3322k1958j280J3305L82j5416K532M151J1704K8724j5168
$$ 127190 107111 53789 31831 30551 43856 44238 28822 31354 35505 47209 75933 60765
12514F0765M32M538l5346k20K3440k7860j4564j7769J1404K5163K4212J8259l5612
$$ 60765 61197 65735 30389 30169 53609 25749 11185 -6584 4820 29983 54195 72454 36842
12501C6842j9137K7664o278P614R347Q454K621j7534j9359J3911N044k1010M4468
$$ 36842 17705 45369 39091 46705 56052 64506 67127 49593 30234 44145 49189 28179 72647
12488G2647O604J060k1760j4607N0587L592m9896k0056M4074M5413n091Q663q292
$$ 72647 79251 80311 58551 43944 94531 98123 48227 28171 72245 117658 112567 121230 112938
12475A12938L1409K8155O3638N8678N9355M0634O8071J19954J95270K87845L54545
$$ 112938 144347 172502 236140 294818 354173 394807 462878 582832 778102 1065947 1420492
12464A420492L19269K03070j6883k87173m21083l43737k42959j91085j39658r8634
$$ 1420492 1739761 1942831 1925948 1638775 1217692 873955 630996 439911 300253 201619
12454B01619k2916m2597l5985J1610N943O255l8886j5591n210J0425L6041k1302
$$ 201619 178703 136106 100121 111731 117674 123929 85043 69452 64242 74667 110708 89406
12442H9406K2339o990j3671m84j0622j7501k1932L100J8107Q496p825l2908O220
$$ 89406 111745 104755 91084 90600 79978 62477 40545 43645 61752 70248 62423 29515 35735
12429C5735J9109M31l5875j1584K0425K3092j2818j4631K7720J1089j6502K1030
$$ 35735 54844 55275 19400 7816 28241 51333 38515 23884 51604 62693 46191 67221
12417F7221N95j9335j3633J8399K2478k4780K545K4914K0035k8442l0498j554
$$ 67221 67816 48481 34848 53247 75725 50945 53490 78404 98439 69997 39499 37945
12405C7945k5182k7886J9534J2692j9284j0179R831K0999j2204N926N905L637
$$ 37945 12763 -15123 4411 17103 -2181 -12360 -2529 18470 6266 12192 18097 21734
12393B1734n459k8991P433K8281o910M934K7857Q153J689o005N198k5243J0828
$$ 21734 16275 -12716 -5283 22998 16088 21022 48879 57032 58721 52716 57914 32671 43499
12380D3499L6399Q496N522q835k0999m30K1116O092j4908p860k1181j1499K6760
$$ 43499 79898 88394 93916 85081 64082 63652 84768 90860 75952 68092 46911 35412 62172
12367F2172r173l3104J4494K8057k6751k810L0986k9232k3956k2853k999L7027
$$ 62172 52999 19895 34389 62446 35695 32885 63871 34639 10683 -12170 -15169 21858
12355B1858j3391m530k4875k774K1736k0106Q417L3817K2584Q363N25j869N507
$$ 21858 8467 3937 -20938 -23712 -1976 -22082 -13665 20152 42736 51099 51624 49755 55262
12342E5262l3313l7327k3940K8937M3561J9677j1319k8760l278M3867M2897o3851
$$ 55262 21949 -15378 -39318 -10381 33180 52857 41538 12778 9500 53367 96264 32413
12330C2413l2062J5283J4681R439K1320L2573O981L188j2507o082k683l8819K829
$$ 32413 351 15634 30315 39754 61074 93647 100628 103816 91309 85227 82544 43725 46554
12317D6554Q667J535K2034j2973K588m1800j9897J5485j9717k6251m675L270j0053
$$ 46554 55221 56756 78790 65817 68405 26605 6708 22193 2476 -23775 -28450 -25180 -35233
12304c5233L4573K1825L424O347o251K8916L04k9875M514J4168l98j6365J5064
$$ -35233 -660 21165 24589 30936 24685 53601 53905 24030 28544 42712 42314 25949 41013
12291D1013L314O642L2078J3558m0181n5067Q400L897j4403j8483j9886j4415
$$ 41013 44327 50969 83047 96605 56424 1357 9757 13654 -749 -19232 -39118 -53533
12279e3533J6277L4836L0586Q775K2531j3422j0017K355j3865M260J1580p847
$$ -53533 -37256 -2420 28166 36941 59472 46050 36033 38388 24523 28783 40363 32516
12267C2516k2469Q725K2656j3651k815J1419J6489j3729m0160k0001M3397K9095
$$ 32516 10047 18772 41428 27777 24962 36381 52870 39141 -1019 -21020 22377 51472
12255E1472j2192M894j0307N423j8757k5860j2352p677K0836l603K8395l706K8253
$$ 51472 39280 44174 33867 39290 20533 -5327 -17679 -25356 -4520 -8123 20272 16566 44819
12242D4819J0121J4682j3216J0559K0238k1641J1345j006j1203l855K1076j1830
$$ 44819 54940 69622 56406 66965 87203 65562 76907 75901 64698 60843 81919 70089
12230G0089m3695j2733M373n4408j3662M0771n024L7071L9194Q316K443k8325
$$ 70089 26394 13661 18034 -36374 -50036 -9265 -14289 22782 61976 70292 72735 44410
12218D4410n762M216n633j2695j4873J8670p525j1890J939P577J7081M0148J7292
$$ 44410 38648 42864 37231 24536 9663 28333 20808 8918 10857 18434 35515 75663 92955
12205I2955k5668J3302J1563k1901o043j5568k4250Q392k467L3176m834j0616
$$ 92955 67287 80589 92152 70251 64208 48640 24390 32782 30315 63491 58657 48041
12193D8041K3684J258o789J1542j9881l9135j287L6937o620L3472N2924M8980
$$ 48041 71725 72983 66194 77736 57855 18720 17433 54370 47750 81222 134146 183126
12181A83126L3169l4918k2236l4087n1553r745J6320l3693K7473J2919k1377M225
$$ 183126 216295 181377 159141 125054 73501 63756 80076 46383 73856 86775 65398 69623
12169F9623L0967j417J210l5983k9392j7077N191r527k821L728K0076O211J8977
$$ 69623 100590 99173 100383 64400 35008 17931 23122 13595 10774 14502 34578 40789 59766
12156E9766j98L361r491n4929k4538j2121J434R515J0446j0125J6238j109N925
$$ 59766 59568 62929 53438 -1491 -26029 -38150 -36716 -27201 -16755 -26880 -10642 -11751 -5826
12143e826K8049j79M479j904J976Q535p718j0442K390j0442Q030J0963M953J0835
$$ -5826 22223 22044 26523 24619 26595 35130 27412 16970 19360 8918 16948 27911 32864 43699
12129D3699k4711m0687m26J1956J3560K6600J7220M305N240m223L492n4425j9605
$$ 43699 18988 -21699 -22125 -10169 3391 29991 47211 51516 56756 52533 56025 1600 -18005
12116a8005L831K6353m476j6158K7019o370M833Q557j2445j9542r776j0693L0067
$$ -18005 -14174 12179 7703 -8455 18564 12194 17027 25584 13139 -6403 -16179 -26872 3195
12103C195K0815r14K150j4581j5851J9316L3990N090j3428J5749M101n803l1559
$$ 3195 24010 23096 25246 10665 -5186 14130 48120 53210 39782 55531 59632 53829 22270
12090B2270j1828k2593l184r752L922j0838m067K4052J525j5646k0340j8163K8931
$$ 22270 10442 -12151 -15335 -25087 -21165 -32003 -36070 -12018 -10493 -26139 -46479 -64642 -35711
12077c5711j5656J3942q146N086J9192O045K1676J8195N0929k332r588j0088j386
$$ -35711 -51367 -37425 -45571 -40485 -21293 -15248 6428 24623 75552 73220 63632 53544 52158
12064E2158q470n006m2173k2870K3903K4527K7888o632j2745j4825K2120p153
$$ 52158 43688 38682 -3491 -26361 -2458 22069 49957 43325 30580 15755 37875 30722
12052C0722K360k6o015J5613Q708k4155j9508n064j0013J7408K2911j6965l0421
$$ 30722 33082 33056 27041 42654 51362 27207 7699 2635 -7378 10030 32941 15976 -14445
12039a4445R989j5078j334J0706K1555J5732m4655j1023K1711L5077R481m0594
$$ -14445 -4456 -19534 -20868 -10162 11393 27125 -17530 -28553 -6842 28235 37716 -2878
12027b878k3511Q618P73M0191R606j8563L897K6464k4815J0430p875l466L962
$$ -2878 -26389 -17771 -16998 23193 32799 14236 18133 44597 19782 30212 22337 18871 22833
12014B2833j8534k8371L6136N009l313k426L6609K2999J0432j687l3786k8616
$$ 22833 4299 -24072 12064 17073 13760 11334 47943 70942 81374 79687 45901 17285
12002A7285n352J3425P741k167j1638N877j463j5790j5944J8857r942k2113K0949
$$ 17285 11933 25358 33099 30932 19294 25171 23708 7918 -8026 10831 889 -21224 -275
11989b75L4896Q225P323l283l001O842K508k2282q297l570J779N778R157j234
$$ -275 34621 42846 50169 46886 43885 50727 53235 30953 22656 19086 20865 26643 35800 34566
11975C4566k2171k6975J8100K2800k3948k2753J6410K0174K1297p376j9432j9150
$$ 34566 12395 -14580 3520 26320 2372 -20381 -3971 16203 37500 30124 10692 -8458
11963h458K5467O006j4022l4589k0009K3342J1181j851j2627p177K0396K7469
$$ -8458 17009 23015 8993 -25596 -45605 -22263 -11082 -12933 -25560 -32737 -12341 15128
11951A5128J9162O364N133l3922o070k60k0755r080P951K4442K4889J9987l6850
$$ 15128 34290 40654 45787 11865 5795 5535 -15220 -24300 -16349 8093 32982 52969 16119
11938A6119k3254j676J6198J0080l6291j1097L1869J0097J3858L4304K806j7380
$$ 16119 -7135 -8811 7387 17467 -18824 -29921 1948 12045 25903 60207 63013 45633
11926D5633l7023J282J4629K1645M5649m4308k9262J786O371M60k5783m328J3447
$$ 45633 8610 9892 24521 46166 91815 47507 18245 20031 26402 26862 1079 -3249 10198
11913A0198r820l9377J1230N3839L0020L935j5290k7430k6932k7702j0213n59
$$ 10198 378 -38999 -27769 26070 56090 60025 44735 17305 -9627 -37329 -47542 -48101
11901d8101J552l31l972l961K9277K7834L3066O967R21J0202r223p874k0788k4465
$$ -48101 -46549 -46880 -50852 -54813 -25536 2298 35364 42331 43252 53454 44231 36357 15569 -8896
11887h896O484J033j1945k471K8581j110m1909J0327M4851J2113l3042J5296j0171
$$ -8896 -2412 -1379 -13324 -15795 12786 11676 -30233 -19906 24945 37058 4016 19312 9141
11874I141o1080l3911L3431J6245L6009K8385J008M209k931l6466j8628R021k546
$$ 9141 -51939 -85850 -52419 -36174 -165 28220 29228 33437 30506 -5960 -24588 -15567 -18113
11861a8113j8095j8583j0212k2389J0099p919J124J7431L1248K055j5727J0642
$$ -18113 -36208 -54791 -65003 -87392 -77293 -85212 -84088 -66657 -35409 -33354 -49081 -38439
11849c8439K9036J7535j3760O451J257Q551j1584n762K4222L923j4408j8924j233
$$ -38439 -9403 8132 -5628 823 2080 10631 -953 -6715 17507 21430 7022 -11902 -13135
11836a3135R604l1138J5149J4226r371L5395l392k1376l4547R260J5139k8458
$$ -13135 -3531 -34669 -19520 -5294 -14665 20730 17338 -4038 -38585 -29325 -14186 -42644
11824d2644M167K5006J1930J6975O505R287j7242k563n649Q861L353J0456M1099
$$ -42644 -38477 -13471 -1541 15434 21939 31226 13984 11421 5772 14633 17986 28442 69541
11811F9541K5100M732j0236k7669k5304k763l8063m3447K7024M7922J1023k683
$$ 69541 94641 99373 89137 61468 36164 33401 -4662 -48109 -21085 26837 37860 35177
11799C5177j2225P873k6300j6723k3497K408J4636l82r477N646J0675L62K330
$$ 35177 22952 30825 4525 -12198 -35695 -33287 -18651 -19033 -28510 -22864 -12189 -11827 -9497
11786i497K1330j5748J3553l463k2270m7675J213L1765M2430K6894l3859k0334
$$ -9497 11833 -3915 9638 6175 -16095 -63770 -62557 -30792 11638 38532 4673 -15661
11774a5661J3565J159L551l345M423P07K1864L7020k5471k7312J3595q596j8632
$$ -15661 -2096 -937 2614 -731 3692 4399 26263 63283 37812 10500 24095 15499 -3133
11761c133n25p736j2011K4641P650m742K9313K6257p03j4606r945l0231j6596
$$ -3133 -3658 -11394 -23405 1236 8886 4144 33457 59714 59011 44405 34460 4229 -12367
11748a2367K2756J2902j024Q25l1549p689K6535O91L72j8892q897J1971O453K5719
$$ -12367 10389 23291 22267 23092 -8457 -16146 10389 11080 11452 -7440 -16337 -4366 2087 27806
11734B7806k857k4332k1069O45K4099K8688J2673k1747n989J6774J7836j3466
$$ 27806 24949 617 -20452 -19807 4292 32980 45653 23906 17917 34691 52527 39061
11722C9061j5177J56l6368r829p69J6488j5363n761k467J569o813J2048K6045
$$ 39061 23884 24040 -12328 -22157 -22926 -6438 -21801 -27562 -30029 -28460 -35273 -23225 2820
11709B820J0352k6735R642N781N258k5398N785L527Q802J8807m154j9145k3201
$$ 2820 13172 -13563 -3921 1860 7118 -18280 -12495 -8968 -166 18641 14487 -4658 -27859
11696b7859j4009K3470M5905L2890n1279j9116J8605P274l810Q37J8611j6189
$$ -27859 -41868 -18398 27507 60397 9118 -9998 8607 15881 12071 12908 31519 15330
11684A5330m833M2301K2334l0288l9195k4934K8113K0296J0719j8193k6348l9744
$$ 15330 10497 52798 75132 44844 5649 -19285 8828 29124 39843 21650 -4698 -44442
11672d4442j611L5994L3063j7948l0077l7694K264K4733J8146k7528J0710j7596
$$ -44442 -46053 -10059 23004 5056 -25021 -62715 -60451 -35718 -17572 -45100 -34390 -51986
11660e1986P639O449K2959L561j3235j3738l4427j723L4587K0964j5803k365O749
$$ -51986 -44347 -37898 -14939 -11378 -24613 -38351 -72778 -74501 -39914 -18950 -34753 -37118 -30369
11647c0369K7343J258r332k6070l8998J1607L1361l1516k0242J7145K5003j1570
$$ -30369 -3026 -1768 -11100 -37170 -76168 -64561 -33200 -64716 -84958 -67813 -42810 -54380
11635e4380k0374N714J6354K2511K0433j6216j1293p268J5865M018L9040j7224
$$ -54380 -74754 -69040 -52686 -30175 -9742 -25958 -37251 -44519 -28654 -24636 14404 -2820
11623b820n533K8087K2298K5799j5844J3148m0677m7532n532K9677j0783l3324
$$ -2820 -8353 19734 42032 67831 51987 65135 24458 -23074 -28606 1071 -9712 -43036
11611d3036L1970j7547j5561p276K3919L4056J2958J6519J8438m6921j8447N560
$$ -43036 -11066 -28613 -44174 -51450 -27531 6525 19483 36002 54440 7519 -10928 -5368
11599e368j5699l694J4481j1831j9608K3965P702L4476L861k7584O049m399l4747
$$ -5368 -21067 -24761 -10280 -22111 -41719 -17754 -10052 24424 28285 701 6750 2351 -32396
11586c2396m36N7093J7439j0270k03P061K1514j7590r78K0378k4494l2405J4936
$$ -32396 -32832 24261 41700 31430 31227 38288 59802 42212 41234 61612 37118 4713 19649
11573A9649J0676k582J4660J6502j3043j5174n1120O43M3440M3312R92j6672l4099
$$ 19649 30325 27743 42403 58905 45862 30688 -20432 -19789 23651 66963 67955 51283 17184
11560A7184j2461R266P522j9824j9799L6832O402L0347P817P31j4522k8301J4808
$$ 17184 4723 13989 21511 1687 -18112 18720 25122 55469 63286 64017 49495 21194 36002
11547C6002J1324l1794r514O461o008k6978k493R466K1029K843j1064k2312J110
$$ 36002 47326 15532 6018 12479 6471 -20507 -23000 -13534 7495 10338 -726 -23038 -21928
11534b1928j721k0057J0974J7020k0062k2874L0831L5354j8287j9556N2782J6549
$$ -21928 -23649 -43706 -32732 -15712 -35774 -58648 -27817 7537 -10750 -30306 22476 39025
11522C9025j2304L40r219j2072j8961L986M6239j797j9533O904j6704j1964K910
$$ 39025 26721 27061 17842 5770 -13191 -9205 37034 35237 15704 22608 5904 -6060 -3150
11509c150J5583j6538k582o663P004l464l4241P093M3090J3217l6643k3778Q069
$$ -3150 12433 -4105 -6687 -13350 -6346 -9810 -44051 -36958 6132 19349 -17294 -41072 -33003
11496c3003K3776L2264k8070j2567J332k9527k6884L6840J8532J0094L276j1145
$$ -33003 -9227 23037 -5033 -17600 -16268 -45795 -72679 -35839 -17307 -7213 -3937 -15082
11484a5082L0777l16L548L4697K177j7483l0196k3917l1244j0102K2352l090o570
$$ -15082 15695 15379 18927 53624 55801 38318 8122 -15795 -47039 -57141 -34789 -37879 -44449
11471d4449n408K2347K1094q50j9961k7059k9562L417J7186j6043j419O0117O938
$$ -44449 -49857 -27510 -6416 -7266 -27227 -54286 -83848 -80431 -63245 -79288 -80707 -20590 -13652
11458a3652K4799J5976m0504J2328J8839J9511j122j4851m3268j9136J9889O440
$$ -13652 11147 27123 -13381 -1053 17786 37297 36175 21324 -21944 -41080 -21191 -14751
11446a4751J7263J7114j6573J1177J3554L5798m7599j7273k1226k543K7387l433
$$ -14751 2512 19626 3053 14230 27784 63582 15983 -1290 -22516 -25059 2328 -1105
11434a105j3996o921l151K9838L3872j5118j2715j5080q314K8696K3894j2761
$$ -1105 -15101 -22022 -25173 4665 38537 23419 10704 -4376 -12690 16006 39900 27139
11422B7139l2996j7584k223J1144J6528k9300j8800R86K1933L3373p611R388k1705
$$ 27139 -5857 -23441 -25664 -14520 2008 -27292 -46092 -45106 -23173 10200 2589 11977 -9728
11409i728k3640q513K3682K580j830j0675j0620M616J4164J1797j5285L849L8367
$$ -9728 -33368 -41881 -18199 -15619 -17449 -28124 -38744 -34128 -19964 -8167 -23452 -19603 18764
11396A8764K5400k2907j3625j4552l91p892J84J957L2720k3687p181L6109k108
$$ 18764 44164 21257 7632 -6920 -7311 -15203 -15019 -13062 19658 -4029 -11210 24899 22791
11383B2791l8540L697j0030J0952L5894O882l647J0264j0705n266J074j8432J4527
$$ 22791 -15749 -12052 -22082 -11130 24764 31646 27999 38263 27558 22292 23366 4934 19461
11370A9461J2270K9302Q775j173j6926l7801K2625j9699l9108O605J3263j099
$$ 19461 31731 61033 69808 68635 51709 13908 36533 16834 -22274 -15669 -2406 -3505
11358c505O293K12p313o16j0989j4508l2773M0276K3615r707j9866r45L3258K2227
$$ -3505 2788 3000 -4313 -4929 -15918 -30426 -63199 -22923 692 -9015 -28881 -29826 3432 25659
11344B5659K0544K1997l069j2432J5804k6243k3714P535J0353j1008j5360k7903
$$ 25659 46203 68200 65131 52699 68503 42260 18546 26081 36434 25426 10066 -17837
11332a7837k6519J2845L384m5888o313J042M2479J6067O584N0919R581r428L548
$$ -17837 -44356 -31511 -28127 -74015 -80328 -79286 -36807 -20740 -14156 36763 46344 36916 40464
11319D0464J087j9919l378p888q116R763j626j3134l5241K9052M1890j417j1072
$$ 40464 41551 21632 18254 10366 2250 12013 10387 -2747 -37988 -8936 32954 31537 20465
11306B0465l8927j6147o41J2264L016J8861j3500l5357J5589O3627J033k1370
$$ 20465 -18462 -34609 -35250 -22986 -19970 -1109 -14609 -49966 -34377 29250 30283 8913
11294H913m603K6961L047l9013m1636p787K8344J2176J6780P061j377k872j6735
$$ 8913 4310 31271 34318 -4695 -46331 -54118 -25774 -13598 3182 10243 8866 5994 -10741
11281a0741k7895l3092J2997J540l1562K9142L2821r346J7399j0108K4431K7015
$$ -10741 -38636 -71728 -58731 -57191 -88753 -59611 -26790 -36136 -18737 -28845 -4414 22601
11269B2601m1M671j2562j2815j7996j9640o801N900j280k074K1088r149j845J6808
$$ 22601 22560 27231 14669 1854 -16142 -35782 -42583 -36683 -37963 -40037 -18949 -28098 -29943 -13135
11255a3135K4589r6Q587j2496l4473K5474N629k4821m9670J6749M9640J3215J5903
$$ -13135 11454 11358 19945 7449 -27024 -1550 4079 -20742 -70412 -53663 -4023 9192 25095
11242B5095K417m969Q685J911J631k4627K356j6943j2611L0200j869l884j6564
$$ 25095 27512 22543 31228 33139 34770 10143 12499 -4444 -17055 13145 11276 7392 -9172
11229i172K6473J9885N985L837j3363m586m101j8504n66N6p717K1995j0147J325
$$ -9172 17301 37186 43171 47008 33645 29059 24958 6454 5888 5944 -1773 20222 10075 11400
11215A1400J0935n98j8238j0610J8021P282l8139k8427J4688K5731k6357M474
$$ 11400 22335 21737 3499 -7111 10910 18192 -19947 -48374 -33686 -7955 -34312 -29838
11203b9838L6636K1533k6484k1104j7424R228L2670J9757o919p248K8332k232
$$ -29838 6798 28331 1847 -19257 -36681 -27453 5217 24974 18055 10807 39139 36907
11191C6907k1033j1939j4167j7063M114N423K7514O900r089J1820j0080r061K1555
$$ 36907 15874 3935 -10232 -27295 -23181 -17758 9756 16656 7567 19387 9307 246 21801
11178B1801N716j0165k7532j196o540k8883R786J1528K9090J2424m0415j59M789
$$ 21801 27517 17352 -10180 -11376 -17916 -46799 -37013 -25485 3605 16029 -24386 -24545 -19756
11165a9756K2866j1828O872K3601O793p714j9818j8307j5099j3436m64K6920L4710
$$ -19756 3110 -8718 -1846 21755 28548 20834 1016 -17291 -32390 -45826 -46290 -19370 15340
11152A5340o859l0655j2903J4416K4733J3280k6159J7153K8628R556j6304j4806
$$ 15340 8481 -22174 -35077 -20661 4072 17352 -8807 8346 36974 46530 30226 15420
11140A5420j4771j6037l8123K5913M9692M1740K4088k9575k2745R223j3888l4728
$$ 15420 649 -15388 -53511 -27598 22094 63834 87922 58347 35602 44825 30937 -3791
11128c791k4834k333K7860K1685o324n024K0992K699k511O672L702k0159J0953
$$ -3791 -28625 -30958 -3098 18587 12263 7239 28231 30930 28419 35091 38793 18634 29587
11115B9587K6541J030r956l298m3702K23j0086j4245J0503K016j2176R836k306
$$ 29587 56128 57158 47202 43904 202 425 -9661 -23906 -13403 -11387 -23563 -13727 -16033
11102a6033N183q677l781Q476J1634L3335K0634Q63l2739p091L181L6421m344
$$ -16033 -10850 -19527 -23308 -14832 -3198 30137 50771 51634 18895 11804 14985 51406 47062
11089D7062k7560l7021j1422L0557J3737J246R377k9358l1636j029M1474L0288
$$ 47062 19502 -17519 -28941 1616 15353 16599 25976 -3382 -35018 -36047 5427 35715
11077C5715j9652l7147J0086J0860n4308M8788M3956k2259K0286Q450m2633p772
$$ 35715 16063 -21084 -10998 -138 -54446 -5658 38298 16039 36325 44775 2142 -5630
11065e630J3063L4936J2334o900k5810l2245q435N412R377n153j0573l1242k657
$$ -5630 7433 42369 54703 47803 21993 -10252 -18687 -13275 -3898 -9051 -19624 -50866 -53523
11052e3523K5091J8384l680O055J4301l7753k7727R827o636J0932k1576q498L5182
$$ -53523 -28432 -10048 -13728 -7673 6628 -31125 -58852 -49025 -55661 -44729 -66305 -74803 -39621
11039c9621M756L1363K8595j2668j0744J0596k8495k9416n69M6532j8082k86K4528
$$ -39621 -34865 -3502 25093 12425 1681 12277 -16218 -45634 -46203 329 -17753 -18039 6489
11026F489L4366m637J3616l0572m0361l608J8997R961J3858J7509K0225l0331
$$ 6489 40855 36218 49834 19262 -21099 -24707 -5710 4251 18109 35618 55843 25512
11014B5512j2066J2220j5105k1851m1382j2087J8384r548j2953J9421J8293p485
$$ 25512 13446 25666 10561 -11290 -52672 -64759 -46375 -55923 -68876 -49455 -31162 -38647
11002c8647r354J3122K0755K3555N2070J6424k8887l5649l8434j238m223l168
$$ -38647 -48001 -34879 -14124 9431 61501 77925 49038 13389 -25045 -26283 -30506 -33674
10990c3674K2369j9864j5580K0271K3808J489j1827P387r436J3250R084k4857
$$ -33674 -11305 -31169 -46749 -26478 -2670 -1181 -13008 -5621 -15057 -1807 7277 -17580
10978a7580J8483K7683L3068j5693M298k5514j2954k7715k5148l1954j97K7281
$$ -17580 903 28586 61654 45961 50259 24745 11791 -15924 -41072 -73026 -73223 -45942
10966d5942J576L675K4203K0151l7267j2944l737K4847l207Q912M0454J6877m6120
$$ -45942 -44366 -40691 -16488 3663 -33604 -46548 -50285 -25438 -28645 -19733 20721 37598 -8522
10953h522m5086o570k283J2676N4244K5325K4484k6699r459l25J73K585q33j5071
$$ -8522 -53608 -60178 -62461 -49785 4459 29784 54268 27569 18110 17785 17958 20543 19710 4639
10939D639k7412k3781J066L3185L6063L378m3999J4309j0122j1467N035M0520
$$ 4639 -22773 -46554 -45488 -12303 23760 27138 -16861 -2552 -12674 -24141 -19106 21414
10927B1414j720l2192j7818l87J0354N431M0876l624m2400K9021O900o247q784
$$ 21414 19694 -12498 -30316 -30703 -20349 -14918 25958 22334 -20066 8955 15855 9608 824
10914H24j6336O157O305M707p882Q209p511k7107K5327J9384k4529l0323k0567
$$ 824 -15512 -9355 -3050 1657 -6225 1984 -5527 -32634 -7307 12077 -12452 -42775 -63342
10901f3342n015N2808N786n4266j0527j31M5913r192j9894k9198j0183J4884L6094
$$ -63342 -68357 -15549 -9763 -64029 -74556 -74687 -28774 -37966 -57860 -87058 -97241 -82357 -46263
10888d6263L4496J8349m9229m218K9874N624K348m458O377l6192k294l678j1755
$$ -46263 -11767 6582 -42647 -46865 -16991 -11367 -9019 -13477 -7100 -43292 -45586 -49264 -61019
10875f1019K9761O371K4456M3183r34j2695m412j4894J8195J7786j7537n219j3157
$$ -61019 -31258 -24887 -431 42752 41818 29123 24711 9817 28012 45798 28261 23042 9885
10862I885k6092p402K1184J9024l1025j8777k9342J6517Q796k3143J0688J5934
$$ 9885 -16207 -23609 -2425 16599 -14426 -33203 -62545 -46028 -37232 -60375 -49687 -33753
10850c3753Q543R682O530O457J5960M415m584k6226p85Q657k9744K216M1241k4892
$$ -33753 -25210 -15528 -8998 -2541 13419 17834 13250 -12976 -13761 -5104 -34848 -32632 8609 -16283
10836a6283l0450L7477L6940J4540k377N483k832r980l2418j6591J6414j8239
$$ -16283 -46733 -9256 27684 42224 39847 45330 42498 32518 100 -16491 -77 -18316
10824a8316M715O770M119q762j0859o291K0385l7210J891J1094n962j579K7916
$$ -18316 -13601 -6831 -2712 -11474 -22333 -28624 -8239 -45449 -43558 -32464 -38426 -40005 -12089
10811a2089L0778n9468l1270J7934j831j310M828M6323J3602L739J8662n071J9961
$$ -12089 18689 -40779 -72049 -54115 -55946 -57256 -52428 -6105 7497 11236 29898 24827 44788
10798D4788J3922k4014l6439J6129J4218k5472j6794o731L7441J8886j7744J8828
$$ 44788 58710 34696 -1743 14386 28604 3132 -13662 -20393 17048 35934 18190 37018
10786C7018j3673m874k3676J6430k8445J7837M4409j8506J1119j9556p1436M442
$$ 37018 23345 18471 -5205 11225 -17220 617 45026 26520 37639 18083 -53353 -48911
10774d8911L6330K1214k140n8251m116M0683O448M1482J1409L1511N185k6799
$$ -48911 -12581 8633 6493 -51758 -55874 -15191 -8743 32739 44148 75659 80844 54045
10762E4045j1804R995n683j1148m1198m467J4558k7205L470M1733K6331k2437
$$ 54045 42241 52236 46553 35405 -5793 -10260 4298 -22907 -19437 22296 48627 26190
10750B6190m2915J9778J0949L2158J8719j076k705j1269R09k2645o526q589l1147
$$ 26190 -16725 3053 14002 46160 64879 63803 61098 49829 50738 28093 21567 12978 -18169
10737a8169R614J007J8581P716k3858k3444M776p389p627j966J0400r357K460
$$ -18169 -8555 -7548 11033 18749 -5109 -28553 -23777 -31166 -38793 -40759 -30359 -39716 -37256
10724c7256q490j9001O929J9728M10j2373q846P798n186r500k418o16l1630p686
$$ -37256 -45746 -64747 -57818 -38090 -37680 -50053 -58899 -51101 -56287 -65787 -68205 -68821 -100451 -108137
10710a08137M7157M6109L2977j1962j8814J4122J9425Q350K0017j9530j8739l6254
$$ -108137 -60980 -14871 18106 6144 -12670 1452 20877 29227 49244 29714 10975 -25279
10698b5279j8325j0731J6935j752j6182L96r588L0466n683j786K1062K9259J3054
$$ -25279 -43604 -54335 -37400 -39152 -55334 -54938 -64526 -34060 -39743 -41529 -20467 8792 21846
10685B1846j9454k0726J2528J3517o634L8871j3516j6346k2104q586P213n740
$$ 21846 2392 -18334 -5806 7711 1077 39948 26432 10086 -12018 -20604 -13391 -19131
10673a9131o846j4129m94K8519L0849J8776K465K3238k1200l1782j1641K1379
$$ -19131 -25977 -40106 -40600 -12081 18768 37544 40009 63247 42047 10265 -1376 20003
10661B0003L268j0696J050J395K024J8217j3177k0489m009R53R906K1563O700
$$ 20003 23271 12575 13625 15020 17044 35261 22084 1595 -2414 -1461 8445 30008 36708
10648C6708j9698j4688Q052n675m595J9471m017l0075O674k5609k4243L5613J6436
$$ 36708 17010 2322 10374 4699 104 19575 15558 -14517 -7843 -33452 -57695 -22082 -5646
10635e646n802j945J2470M847O037N677K2232k4428k4447L061j0174J1531R248
$$ -5646 -11448 -13393 -923 3924 9961 15638 37870 13442 -11005 -7944 -18118 -6587 2661
10622B661j6903j0013j2324M727n350l3124L8145L3527j717R599J0416L0556k8990
$$ 2661 -14242 -24255 -36579 -31852 -37202 -70326 -32181 1346 -371 9228 19644 50200 21210
10609B1210k9467j7813q914K2635J2982J301j1168k7754j3609R626J9615K3935
$$ 21210 -8257 -26070 -34984 -12349 633 1934 -9234 -36988 -50597 -40971 -21356 2579
10597B579j0718P085j8548k9986j3985J0915N6657P821J709r625J2231j4957P056
$$ 2579 -8139 -1054 -19602 -49588 -63573 -52658 3999 11820 13529 3904 16135 1178 8234
10584H234n781k7987m1453j831J4915M1455M3285O597k7540r642k4788j5229J9935
$$ 8234 2453 -25534 -66987 -68818 -53903 -12448 30837 37434 9894 252 -24536 -39765 -19830
10571a9830j2760O842K7058k82j8562j8765q941n895Q829J0130r439J9076j1900
$$ -19830 -32590 -25748 1310 1028 -17534 -36299 -45240 -51135 -42306 -32176 -41615 -22539 -34439
10558c4439j5985n352N1088K1511N078k1225J0416J944p692l7672L401n925r123
$$ -34439 -50424 -55776 -4688 16823 21901 676 11092 13036 5344 -32328 -28927 -34852 -43975
10545d3975k763P475J9241K8226j2411j3245m1738J2590L6813q662q1L5405K4
$$ -43975 -46738 -39263 -20022 8204 -4207 -17452 -59190 -46600 -9787 -18449 -18530 16875 16899
10532A6899m0788j4253j0420J5832j2321P719j9257j7938Q123M1849L4572k2035
$$ 16899 -23889 -38142 -48562 -32730 -45051 -37332 -56589 -74527 -66404 -24555 10017 -12018
10520a2018j9408L0526K2276J7933k2643j7987N50r158j5925j5161M7677L2769
$$ -12018 -31426 -900 21376 39309 16666 -1321 -771 -9929 -25854 -41015 6662 39431
10508C9431K3880J5289o7316k7251N399L305J0316l3666l8801o225R98O689L3710
$$ 39431 63311 78600 11284 -15967 -10568 -7263 3053 -30613 -69414 -75639 -74641 -67952 -34242
10495c4242L5016k142r328J7322J9499l431n009k0149q956k9944j2096R93O306
$$ -34242 774 -1368 -10696 6626 26125 22694 17685 -2464 -11420 -41364 -53460 -52467 -46161
10482d6161L3987M2278l3344q983k093j1744J7648M576o3706m591L2594K9359
$$ -46161 -12174 30104 -3240 -12223 -14316 -26060 -8412 -3836 -67542 -72133 -39539 -10180
10470a0180K3426n469r160k6069n360l0142K8018K5835k503j7176r091K9509J6422
$$ -10180 13246 7777 -1383 -27452 -32812 -62954 -34936 -9101 -11604 -28780 -37871 -8362 8060
10457H060j8939O065L2218j7083k497m440n9062j638M8457O383j4964J6174M07
$$ 8060 -10879 -4814 27404 10321 7824 3384 -55678 -57316 -8859 -2476 -17440 -1266 -859
10444h59j4448k9107l3737K1182R717L1782K9583K9299R993k6814k0247k0484
$$ -859 -15307 -44414 -78151 -56969 -47252 -15470 14113 43412 53405 26591 6344 -14140
10432a4140K1367n671j7856l91m25M452J9988J0052m4055r683Q816j682Q329l132
$$ -14140 7227 1556 -16300 -16691 -17116 -12664 7324 17376 -26679 -36362 -27546 -29228 -20899 -24031
10418b4031n875P266M4096N803k2796n3986p141P943J8J6753J7153r083N031p84
$$ -24031 -29906 -22640 21456 27259 4463 -49523 -56664 -48721 -48703 -31950 -14797 -23880 -18849 -19633
10404a9633Q150o021J2096L0165o75j0760P911o839k8522k4829k3886N4198K5425
$$ -19633 -11483 -17504 -5408 24757 24082 13322 21233 14394 -14128 -38957 -62843 -8645 16780
10391A6780l8538l0105r270q51q924j9213J4359M0252L3116K052j7677k0789K058
$$ 16780 -21758 -51863 -61133 -61984 -70908 -90121 -75762 -35510 -2394 -342 -18019 -38808 -36750
10378c6750N652L475K0303Q030L8033j800P751j2213l605j8357l2443j44J7790
$$ -36750 -31098 -27623 -7320 710 38743 36943 44694 32481 28876 10519 -21924 -22068 -4278
10365d278K8240J224j7763l5085L493J5645K2614J2587l196R056j345k3211j8757
$$ -4278 23962 25186 7423 -27662 -24169 -8524 14090 26677 23481 32537 31192 7981 -10776
10352a0776j0434L2665k5863K869Q838K7244q238P261J2159L819l5589J433J8284
$$ -10776 -21210 11455 -14408 -11539 -2701 24543 16305 23566 35725 39544 3955 5388 23672
10339B3672j393k226m8180j5810K8233j9503Q551K3172J2522j965m772j0936K5597
$$ 23672 22279 20053 -28127 -43937 -15704 -35207 -26656 -3484 9038 7073 2301 -8635 16962
10326A6962M228m947m5050j1405L1987M259K5838l7093p775K5297j8622L427K975
$$ 16962 21190 16243 -28807 -40212 -8225 -3966 21872 -15221 -22996 2301 -16321 -12894 -9919
10313i919o857J4143o000O233J8108L6660j5075r420k5635m8995K0431J4743j2637
$$ -9919 -16776 -2633 -8633 -2400 15708 52368 37293 27873 2238 -46757 -26326 -11583 -24220
10300b4220j2016K2392K6650M491K4528J4002k3253m6281l708r389q668j1339
$$ -24220 -36236 -13844 12806 17297 41825 55827 32574 -13707 -17415 -26804 -35472 -46811
10288d6811K9823K6889n8608m719P4954L3550p942k0891k127J6241n450m5417
$$ -46811 -16988 9901 -48707 -53426 21528 55078 47136 26245 24118 40359 34909 -10508
10276a0508m900L115n0870k6160K5715O0835K9368k131M206J3516P17l029L3661
$$ -10508 -15408 -12293 -63163 -89323 -63608 -2773 26595 24464 28670 42186 42903 39874 73535
10263G3535j2247n5349k8007L104M542J4643K2647J638l43m568o85j1288l1611
$$ 73535 61288 5939 -22068 -18964 -14422 221 22868 24506 24163 19595 18910 7622 -23989
10250b3989N28j046K4362j2432m2766O858J4868M359m943k0109m894M6803L8529
$$ -23989 -23461 -24507 -145 -12577 -55343 -48485 -33617 -29258 -34201 -54310 -59204 -12401 26128
10237B6128K5009P791l6738k400J1153j9885j8452l0004p444l036r627J802K3866
$$ 26128 51137 58928 22190 19790 30943 11058 -7394 -37398 -44842 -47878 -57505 -55703 -31837
10224c1837K361J9685M4945P746k7393j9231K558r176j4675j3830J6600M540l2160
$$ -31837 -29476 -9791 35154 42900 15507 -3724 -1166 -10342 -25017 -38847 -22247 -17707 -49867
10211d9867R968N2416L6904j8138j9899j9001k6717j7825R842M768L6599J5884
$$ -49867 -39899 12517 49421 31283 11384 -7617 -34334 -52159 -42317 -37549 -950 14934
10199A4934j7884J7447P780J1078r231k9734L659L937l3132n776j499Q641M2575
$$ 14934 -2950 14497 22277 33355 24124 -5610 -1951 1986 -31146 -36922 -38421 -29780 12795
10186A2795J2668j8004l932q112m4946j3051L2673K985J159k291j7951J6661J5064
$$ 12795 25463 7459 3527 -4585 -49531 -62582 -29909 -26924 -25765 -28056 -46007 -29346 -14282
10173a4282j8702r238J5353J2473L5519J811l5670n062o810j9200k0526K8431
$$ -14282 -32984 -42222 -26869 -14396 21123 22934 -12736 -17798 -24608 -43808 -64334 -35903
10161c5903J4324r309k0562M548n302L1195Q708Q535p578N21J6450j7828K78k3372
$$ -35903 -21579 -30888 -51450 -46902 -52204 -21009 -12301 -3766 -11344 -10823 5627 -12201 -11923 -35295
10147c5295J1066J4016l6233j5894k569K0657M0540K9081k85J1302q049k146K2177
$$ -35295 -24229 -10213 -46446 -62340 -64909 -44252 -3712 25369 25084 36386 28337 26191 48368
10134D8368J5296Q149k1162n6817m239J0944j2007l53j0725j6275J3670P344K7238
$$ 48368 63664 71813 50651 -6166 -10405 539 -11468 -11821 -22546 -38821 -25151 -17807 9431
10121I431k639j1893j5526j6374K526J2531O089J0395R016K5685L0104R870j5997
$$ 9431 6792 -5101 -20627 -37001 -34475 -21944 -15855 -5460 3556 29241 59345 69215 53218
10108E3218m5612l2500L0910J6165j341J6548k5525n9017j2624L7000M3540J5510
$$ 53218 7606 -24894 6016 22181 20840 37388 11863 -47154 -59778 -22778 20762 36272
10096C6272j4337l083j6227k8349j2290J5458j8451L5475K5942j6886j6407o5
$$ 36272 21935 18852 2625 -25724 -38014 -22556 -41007 -5532 20410 3524 -12883 -12948
10084a2948L0223K2716j9312K5387r915n755q633j0244J0565L9973L1860r144
$$ -12948 17275 39991 20679 46066 36151 30396 21763 11519 22084 62057 93917 84773
10072H4773k626J0421Q919L6671K1935J3853N6382J14856J20089P6651r319q3915
$$ 84773 82147 92568 101487 138158 160093 173946 230328 345184 465273 541924 532605 448690
10060D48690r1981l8899r194K1695M3321J8709R4450P7843R0069J09005K22849
$$ 448690 356709 317810 308616 330311 373632 392341 486791 564634 654703 763708 986557
10049I86557L66261N38027O63279L90643m83140r90741o18798k91618j98168j11887
$$ 986557 1352818 1890845 2554124 2944767 2461627 1470886 852088 560470 362302 250415
10039B50415m3275j9683j00672n7690R598K7635j3202j8686j2711J7923J5565
$$ 250415 207140 187457 86785 29095 38693 66328 53126 34440 21729 39652 55217
10028E5217j4188k9125K0201k7351l6378r33Q4J9490o188j0521k3106L4352L7525
$$ 55217 41029 11904 32105 4754 -31624 -32557 -32473 -12983 -19171 -29692 -52798 -18446 19079
10015A9079P517j9041k5616l2261o965L705K8802J9769J791k492j9906r559P688
$$ 19079 26596 7555 -18061 -50322 -57287 -53582 -24780 -5011 -3220 -5712 -25618 -35177 -27489
10002b7489j543J3876j2931j364k231L0674N25m115J3536m826P387L1450R338
$$ -27489 -29032 -15156 -28087 -29451 -31682 -1008 -483 -4598 8938 4112 11499 42949 52287
9989E2287l7343O561m0505M869J8933j3726N673K248L7096j9072l7943p741L1666
$$ 52287 14944 21505 -19000 -14131 4802 -8924 -3251 -1003 36093 17021 -20922 -28663 3003
9976C003j0002M62J3021q682j0476r945l7131q368J5288L8136k8705l345J6343
$$ 3003 -6999 -6537 6484 -2198 -12674 -22619 -59750 -68118 -52830 -14694 -43399 -46744 -30401
9963c0401N194K746M884L402M3736q735j7126J2000J1373j8468o428M568L9068
$$ -30401 -25207 -22461 -17577 -14175 29561 20826 3700 15700 27073 8605 2177 6745 45813
9950D5813L5926K6038K6264q463L1088L1063L4387M8318J24519J24908J62753
$$ 45813 81739 107777 134041 125578 156666 187729 222116 270434 394953 519861 682614
9939F82614K42277K29728J13847j72347l78262k89068j16124o2590m4070q000
$$ 682614 924891 1154619 1268466 1096119 717857 428789 312665 250075 206005 198005
9929A98005l6735o4828l3497j647j0795j1920j7412l0099J2703K7538L8303K4388
$$ 198005 161270 96442 62945 61298 50503 38583 21171 -8928 3775 31313 69616 94004
9917I4004M444j9442l6195m4504K209j4053j78L0497J8393J9346j3348k8133l3113
$$ 94004 98448 79006 42811 -1693 516 -13537 -13715 16782 35175 54521 41173 13040 -20073
9904b0073k905j4621J0711m322P40p410J2138J2198P141j6105j7511L5979J4642
$$ -20073 -22978 -37599 -26888 -31210 -30470 -37880 -25742 -13544 -6403 -22508 -40019 -4040 10602
9891A0602n301k0114l5274n354N9340P076l978P345k0328k2169n5o643J961L2983
$$ 10602 5301 -14813 -50087 -55441 3899 10975 6997 14342 -5986 -28155 -28210 -34853 -32892 91
9877I1L555l973j5072j4485K1960j229O54j1759J8880J5253Q636o263k3090P989
$$ 91 3646 -327 -15399 -29884 -7924 -9153 -8499 -20258 -1378 13875 22511 16248 -6842 1147
9863A147J826L7206j8026j171L2506J395l0286N659r557J2585j3513j1379j7861
$$ 1147 2973 40179 22153 20982 53488 54883 24597 30256 20699 33284 19771 8392 -9469
9850i469K4542K041k3807m4600J6471O568M5520J073n3339k5607J5259K467J2545
$$ -9469 15073 17114 -6693 -51293 -34822 -28254 17266 18339 -35000 -60607 -45348 -42881 -30336
9837c0336K0315j5549j4530K5738R100k2514J1245n072J175N647K266K7748j000
$$ -30336 -10021 -25570 -40100 -14362 -5262 -27776 -16531 -21603 -20428 -14781 -12515 15233 14233
9824A4233j1013k8122j4104j865R281Q749P306M494J0480J8202L381j3568l3414
$$ 14233 3220 -24902 -39006 -40871 -31590 -22841 -15535 -11041 -561 17641 21022 7454 -25960
9811b5960m4292J1579J6063L899L383j0390J2747J4697J7768j3457k1524J1232
$$ -25960 -70252 -58673 -42610 -38711 -35328 -45718 -32971 -18274 -506 -13963 -35487 -24255
9799b4255l7j381L6686j8718j1170j8017p775K1958K2336k9558P420M959N882
$$ -24255 -24292 -25673 11013 -7705 -18875 -36892 -44667 -22709 -373 -29931 -22511 -17552 -11670
9786a1670J6870J0002N993J7119m2800n353L9605M4503l5015l2765j3484J0325
$$ -11670 5200 15202 21195 38314 -4486 -9839 29766 74269 39254 6489 -6995 3330
9774C330K378m0447p144J6951L953o986P028J3050Q000j880J7553O277M909j3322
$$ 3330 5708 -34739 -41883 -24932 -20979 -27965 -20937 -7887 113 -1767 15786 22063 26972 13650
9760A3650l594k590J5698l6957l1082N3346O9803r216p3097k5391n202J8511M1484
$$ 13650 10056 7466 23164 -13793 -44875 8471 78274 69058 -4039 -29430 -34632 -16121 25363
9747B5363k5986j7294k312l8680J1369j4689j4521J8134P606J5838O330j7902
$$ 25363 -623 -17917 -20229 -58909 -47540 -62229 -76750 -58616 -51010 -35172 -28842 -46744
9735d6744m743J7478k2807j6992m060L4152j3547L818J5221K3451J6397K3200
$$ -46744 -51487 -34009 -56816 -73808 -77868 -43716 -57263 -53445 -38224 -14773 1624 24824
9723B4824K217j9467l3190J2716m565k4689j4408k5736K6331M948K0874j7477
$$ 24824 27041 7574 -25616 -12900 -17465 -42154 -56562 -82298 -55967 -51019 -30145 -47622
9711d7622j8071K0307j32l588R18K8851j7355K7219k2523k0288J175J356m661
$$ -47622 -65693 -45386 -45518 -49106 -48188 -19337 -36692 -9473 -31996 -52284 -51109 -49753 -54414
9698e4414K3727R901K082J4890J1984m2800J2737L5151r16P511R18q183m812m414
$$ -54414 -30687 -20786 -18704 -3814 8170 -34630 -21893 13258 12342 19853 20771 12588 7776 3362
9684C362j991m1311l2096L2333p108r816K7148K2154J8714J020K230k1560q497
$$ 3362 1371 -39940 -72036 -39703 -46811 -56627 -29479 -7325 11389 12409 14639 -6921 -15418
9671a5418K4571J0728N699m4628l1211j5589J4823M0150j841J9802k779J7345
$$ -15418 9153 19881 25580 -19048 -50259 -65848 -51025 -10875 -12716 7086 4307 21652
9659B1652n802n227r617j9187J5736m352j7358j9472K6385K4839k550L865p034
$$ 21652 15850 10623 1006 -18181 -2445 -6797 -24155 -43627 -17242 7597 5047 8912 1878
9646A878j1720L1735K0352M7067J3943l6279j4373K668l5395q971L7202j7782
$$ 1878 -9842 21893 42245 89312 103255 66976 52603 55271 19876 10905 48107 30325
9634C0325m6551j3127j2345J6046j066q660K5818J5934k058J3100j7639J9564
$$ 30325 -16226 -29353 -41698 -25652 -26718 -35378 -9560 6374 4316 17416 -223 19341
9622A9341N335j3518j2857J13K4541j409l0480J4653j581k1473O047L055J7817
$$ 19341 24676 11158 -1699 -1586 22955 21546 -8934 5719 4138 -17335 -11288 -8233 9584
9609I584k176k0842j3137L7693K0825k4503j7785K4551L5084K799l7987k2671
$$ 9584 7408 -13434 -26571 11122 31947 7444 -10341 14210 49294 52093 14106 -8565
9597h565J7247Q545j8190k6904l7875k986K7603K3772L9545k6745k83J120n798
$$ -8565 8682 17227 -963 -27867 -65742 -68728 -41125 -17353 22192 -4553 -4836 -3716 -9514
9584i514M499j3956j9947O74M1009M6992p236k4426k5778j0196M885o207k1249
$$ -9514 -5015 -18971 -38918 -38244 2765 49757 42521 18095 -7683 -17879 -12994 -19201 -40450
9571d0450Q604J0648J4103Q634J0914J6992J9469M052M706k8653k9158n72J3779
$$ -40450 -31846 -21198 -7095 1539 12453 29445 48914 52966 57672 29019 -139 -711 13068
9558A3068p874P007j5k0713l52K3795r558l5582j2848k1679J1757r112K556K1041
$$ 13068 5194 12201 12186 -8527 -8879 14916 5358 -30224 -43072 -64751 -52994 -62106 -59550 -38509
9544c8509L0385J7002j371k0058k3325l7862J0973N6369N0520K0238m4389n4941
$$ -38509 -8124 8878 7507 -12551 -35876 -73738 -62765 -6396 44124 64362 19973 -34968
9532c4968J408K5243K5729J7992p961l903j0639j3056J0062k7218j3723L4779
$$ -34968 -33560 -8317 17412 35404 27443 23540 12901 -155 9907 -17311 -31034 3745
9520C745L4100l3182k6768j6719j4170o88R692j0888J1613J2146J0796q388k6275
$$ 3745 37845 4663 -22105 -38824 -52994 -53682 -43990 -54878 -43265 -31119 -20323 -28711 -54986
9507e4986Q964J9616L4988K1163k7461m2715p783l041j7707K3848M3469j05j0824
$$ -54986 -46022 -26406 8582 29745 2284 -40431 -48214 -51255 -68962 -45114 -1645 -1750 -12574
9494a2574J3068j3300l7246R148K7848L4840j3656j2693l9185k550L3454J1664
$$ -12574 494 -12806 -50052 -40904 -13056 21784 8128 -4565 -43750 -46300 -12846 -1182
9482a182K950N900l065l1141k476N9424K4789l1651k1303m144J5134k860R442
$$ -1182 1768 7668 4603 -26538 -29014 30410 55199 23548 2245 -1899 13235 10375 19817
9469A9817L4931k043m4805n189J0381k4917j4925k3456J0083K4370J8902n077
$$ 19817 54748 52705 7900 2711 13092 -11825 -26750 -50206 -40123 -15753 3149 -1928
9457a928O104n121l7767l5011N949n06k192L5176M6923P854j1667j6378P437R459
$$ -1928 4176 -945 -38712 -73723 -67774 -68280 -70472 -35296 11627 19481 7814 -8564 -1127 8332
9443H332r567J9019J244J0165k1508j4072L7315J8740P46m7641Q453J0288k973
$$ 8332 -1235 17784 19028 29193 7685 -6387 30928 49668 50414 2773 11226 21514 18541
9430A8541M173l1894j7891P372k3987J2013M572k8784K4383R848J9502M963l2640
$$ 18541 22714 -9180 -27071 -19699 -43686 -31673 -27101 -55885 -31502 -21654 -2152 2811 -29829
9417b9829l428j949j383J1766Q95J9368N300K0167J9620n503p566m2253J3507
$$ -29829 -33257 -35206 -36589 -24823 -23928 -4560 740 20907 40527 35024 27458 -14795 -1288
9404a288J8763j0787l007k189m832l9883o379K868K4178N208n907J3733p436l3523
$$ -1288 17475 6688 3681 1492 -3340 -43223 -49602 -46734 -22556 -17348 -23255 -9522 -16958 -50481
9390e0481K4214M0547K2081K220l8M28j4394K00K0190k7623l9877r078O037M230
$$ -50481 -26267 14280 36361 38581 38543 38971 24577 24777 44967 17344 -22533 -31611 -25574 -21344
9376b1344j7336J600K1497j6274N669O262p086Q211l3355n438M2247K4877R576
$$ -21344 -38680 -37080 -15583 -31857 -26188 -19926 -27012 -18801 -52156 -57594 -15347 9530 19106
9363A9106j1639J9934p498K797K2631M139J9996j5801k8421M717j9812j379J0037
$$ 19106 7467 27401 19903 22700 45331 49470 69466 53665 25244 29961 10149 8770 18807
9350A8807K1439J2026j6611j2796k4930l550j6693m003r748L7058L421L337n574
$$ 18807 40246 52272 35661 22865 -2065 -5615 -22308 -26311 -36059 999 4420 7757 2183
9337B183k0011K8113L1672k5950L582M890k70K6895R357m4834J8120M5319p197
$$ 2183 -17828 10285 41957 16007 19589 24479 24209 51104 60461 15627 33747 79066 71869
9324G1869m9748J2802M729l2781j3052k819L6680N201j549l980L629L8665J8943
$$ 71869 22121 34923 39652 6871 -6181 -9000 27680 32881 31332 27352 30981 69646 88589
9311H8589l716p614l8454J5097J2101j2339l5573l9699q947q542K3428L9967M5440
$$ 88589 84873 77259 38805 53902 66003 53664 18091 -21608 -30555 -39097 -15669 24298 69738
9298F9738q575j611p464k9866K8747j2377K0260j8825l0741P459K1379L5225k0880
$$ 69738 61163 59552 52088 22222 50969 38592 58852 40027 9286 16745 38124 73349 52469
9285E2469l929R456J3265K0287p252j8401k5983P496R138k0799l1477N872L5666
$$ 52469 48540 57996 71261 91548 84296 65895 39912 47408 56546 35747 4270 10142 45808
9272D5808O62M948k740j677Q681M395k0457k0116j1288k618J0920K1274P385J2130
$$ 45808 46470 51418 48678 47001 55682 60077 39620 19504 8216 5598 16518 37792 45177 57307
9258E7307k101l2122n7069j582K0933O896J7549K1192l132R713k1054r045J0512
$$ 57307 55206 23084 -33985 -35567 -14634 -7738 9811 31003 27871 37584 16530 7485 17997
9245A7997k1955M1477J1530Q534Q385l9546K4595L3567R989k7895j2341p562L8948
$$ 17997 -3958 37519 49049 57583 65968 26422 51017 84584 94573 66678 54337 46775 85723
9232H5723L3684l4112j4181m309m303K6196J9468M623o755K118Q740l4434L3446
$$ 85723 119407 85295 71114 66805 62502 88698 108166 112789 106034 108152 116892 82458 115904
9219A15904K5133j4953j3140J6534L0898K0463n114j4696j3785j2051q893l509
$$ 115904 141037 126084 112944 129478 160376 180839 175725 161029 147244 135193 126300 122791
9207A22791Q705K3135K2446j6814k1426J9931M9823K8670K7269n997N187K7125
$$ 122791 131496 154631 177077 160263 138837 158768 208591 237261 264530 258533 263720 290845
9195B90845M7073J7564k4540K9657O4848K9861J0909R706N2795K7666L1705N9534
$$ 290845 337918 355482 330942 360599 425447 455308 466217 475923 528718 556384 588089 647623
9183F47623R2904M8217K7971J07877J10060Q4910J13407J18636J52516K15388
$$ 647623 740527 788744 816715 924592 1034652 1119562 1232969 1351605 1504121 1719509
9173A719509K25851K62427K47838L02133L76677M37874N10396N64637O15515O96659
$$ 1719509 1945360 2207787 2455625 2757758 3134435 3572309 4082705 4647342 5262857 5959516
9163E959516Q11818Q66994Q49942P99964O69847L51256l5367l80563p44922r90005
$$ 5959516 6771334 7638328 8488270 9288234 9958081 10309337 10273970 9893407 9148485 8158480
9153H158480j004494j002810q86109p31535o14926n42202m46049l46377k77364
$$ 8158480 7153986 6151176 5265067 4533532 3918606 3376404 2930355 2583978 2306614
9144B306614k45771k15731j87855k00544j29637j04162j27654r4562n0221o2704
$$ 2306614 2060843 1845112 1657257 1456713 1327076 1222914 1095260 1000698 950477 887773
9134H87773q5096l0107P494m0981o3189q3185q9210j6501k3218q705l3987j2445
$$ 887773 802677 772570 780064 739083 675894 592709 503499 486998 463780 455075 421088 408643
9122D08643J817j1134n2797l9799J6868j5057j4366q699k2152p100p765n733n665
$$ 408643 410460 399326 346529 306730 323598 308541 294175 285476 263324 256224 248459 242726 237061
9109B37061j0025o421l8211l5098j0537J4585J8082m819N028N517k7662j3989
$$ 237061 227036 220615 182404 147306 136769 151354 169436 164617 169645 175162 147500 133511
9097A33511j4078J9889K4200J0291j0319M236m3890j8424J4157l565j8284R338
$$ 133511 119433 139322 163522 173813 163494 167730 123840 105416 119573 116008 97724 107062
9085A07062M2129J812k7560l7551q373K099M70m259K094N5658q685j4385l5886
$$ 107062 149191 151003 123443 85892 77519 79618 80088 75829 77923 133581 124896 110511 74625
9072G4625k8672Q072Q495J400J9709J9435J1218j0153k3106J1467n127k0468j5675
$$ 74625 45953 54025 62520 63920 83629 103064 114282 104129 81023 92490 87363 66895 51220
9059E1220j8466j7077l183L6458J0404j5168k023L905m329k1126r167L5604R102
$$ 51220 32754 15677 12494 48952 59356 44188 42165 46070 41741 20615 11448 47052 56154
9046E6154k214M5364n957k2913k1172j1581M805R643L54j5169J0718J5141J4913
$$ 56154 53940 99304 93347 70434 49262 37681 42486 52129 52483 37314 48032 63173 78086
9033G8086k759k8730j6166o73P534k1114k907j6172j6851k0415R643M2343l6529
$$ 78086 75327 46597 30431 29758 37292 16178 13271 -2901 -19752 -40167 -30524 11819 -24710
9020b4710j6208M6023O2735m0399n8603K8732N5630N0978j2480l7445r156o716
$$ -24710 -40918 5105 67840 27441 -31162 -2430 53200 104178 91698 54253 45097 38381
9008C8381J7102j726R442K2977K8452J8515j2057l0496k9061n835j209L9600q759
$$ 38381 55483 53757 63199 86176 114628 133143 121086 90590 61529 55694 54485 94085 85326
8995H5326k1045J0106l0068P835K6674j8641k8282m225m469j7467m3699K5875
$$ 85326 64281 74387 44319 52154 78828 60187 31905 27680 23211 5744 -37955 -12080
8983a2080J8126M8950K6203J1073k3738l8985k1419O056K1084J1012K1226M0809
$$ -12080 6046 54996 81199 92272 68534 29549 8130 14186 35270 46282 67508 108317
8971A08317R540l6852k6143j2577l0872n057j3779M421K7211K8606j0014j6249
$$ 108317 117857 81005 54862 42285 11413 6356 -7423 -3002 24209 52815 42801 26552
8959B6552K1083Q92K515l0132J853k658L70p218K8872J8552r935j8675k628O105
$$ 26552 47635 48527 51042 20910 22763 20105 20475 13257 42129 60681 50746 32071 29443 35548
8945C5548j0021J3774r604k7093n660L913n157o558J1214J2142l2080k8078K0929
$$ 35548 25527 39301 29697 2604 -3056 857 -4300 -10858 356 12498 -19582 -47660 -26731
8932b6731O4691K927J140L048R851r312j4056J1268J466j9168j4877o821J3685
$$ -26731 37960 40887 42027 45075 54926 45614 31558 42826 44292 25124 10247 3426 17111
8919A7111k1796R221K7334J9888j1247k075L016K6580j8033j1943q358k4315j666
$$ 17111 -4685 4536 31870 51758 40511 38436 41452 68032 49999 38056 29698 5383 3717
8906C717L2405J1224k0062Q868p210K05k3621k0962j6647L9379K6049Q74m1762
$$ 3717 36122 47346 27284 36152 28942 29147 5526 -15436 -32083 7296 33345 34219 -7543
8893g543k8477L8282J0334K5443l183M534P95p949J1627l671l6829j5829Q529
$$ -7543 -36020 2262 12596 38039 34856 39390 40185 32236 43863 40192 3363 -12466 -3937
8880c937k5646J1021J2240j2045L0810J9106N346J1946K2633k0403k2363r320
$$ -3937 -29583 -18562 -6322 -18367 12443 31549 36895 48841 71474 51071 28708 19388
8868A9388k6071P961K1328M977R903K5904K535k4173j4723j0509K180K0444J4534
$$ 19388 -6683 1278 22606 27583 37486 63390 65925 41752 27029 16520 18700 39144 53678
8855E3678j8027l489k1497j331P912j2902K2472m263j8306q528j9418K9117J2687
$$ 53678 35651 32162 10665 9334 17246 4344 26816 22553 4247 -4281 -23699 5418 18105
8842A8105J1389j9317K5561K4006k1741l7367p659J1856J1572K8851J0247j0420
$$ 18105 29494 10177 35738 59744 38003 636 -7023 4833 16405 45256 55503 45083
8830D5083j0335l5946o936J8437j6910J1453K0710r938l3772N715J3458K7736
$$ 45083 34748 -1198 -8134 10303 -6607 4846 25556 15618 -18154 -12439 1019 28755
8818B8755k1715k9950p400J1158J3478J3678j8230J0658j5082j9904j1k978J9629
$$ 28755 7040 -22910 -30310 -19152 -5674 8004 -10226 432 -14650 -34554 -34565 -37543 -17914
8805a7914J1831j6263m970N2588K9905o712j4573K4049k6255j8074k2884L2577
$$ -17914 -6083 -22346 -27316 25272 55177 48465 33892 57941 31686 13612 -9272 23305
8793B3305M892j2309K038J8708P98l2444k657J113M91L372j2477M976L0369l529
$$ 23305 28197 15888 17926 36634 37432 4988 2331 3444 3935 7307 -5170 -194 30175 26646
8779B6646m304m0224m8581K3341p666K0599L4784r190k1392j3225J3888L3107
$$ 26646 22342 -17882 -66463 -43122 -50788 -30189 4595 -4595 -25987 -39212 -25324 7783
8767G783M4018J1334m578r84m800n5395k0353q53L9224M6263j4088l3391j8912
$$ 7783 51801 63135 58557 57573 52773 -2622 -22975 -23828 15396 61659 47571 14180 -4732
8754d732k6466J4112K7071K0600J2079K4265J3706K2256k3811k4855j8472K3658
$$ -4732 -31198 -17086 9985 30585 42664 66929 80635 102891 79080 54225 35753 59411
8742E9411o100j1723l1019J0345J9744k843l6069J7974K315Q439m09l3064R585
$$ 59411 53311 41588 10569 20914 40658 37815 1746 19720 22035 30474 30065 -2999 6586
8729F586Q020k1484n119J8627J0398M334k444j836l2516k8312n431K0428M2374
$$ 6586 14606 -6878 -11997 6630 17028 21362 18918 17082 -15434 -43746 -49177 -28749 13625
8716A3625K6293L4054j9551J279j2013k6883j2705k3167J2451J7362J2417L3707
$$ 13625 39918 73972 54421 55700 43687 16804 4099 -19068 -6617 10745 23162 56869
8704E6869k2742l172K5287O229l5478k7221L6980k2444J1431L4731K1264j1155
$$ 56869 34127 30955 56242 62471 26993 -228 36752 14308 25739 60470 81734 70579
8692G0579l4442n2168j7874J4214l55j9993j769L3416L9720L1315L9118j1785
$$ 70579 36137 -16031 -33905 -19691 -20046 -40039 -41808 -8392 31328 62643 101761 89976
8680H9976k0192J7592k4685j3196J2653p530r446k721J9225r329n500q174k061
$$ 89976 69784 87376 62691 49495 62148 54618 45172 42451 61676 52347 46847 38673 36612
8667C6612k2947l748Q314M411J0885o984j1862k7374M552M0160j1592Q60J8580
$$ 36612 13665 9917 18231 22642 33527 26543 14681 -12693 -8141 32019 20427 21287 39867
8654C9867M847J1338K6737m3299j9757K6643M082O471k1091k7547P829L3191J3792
$$ 39867 44714 56052 82789 39490 19733 46376 50458 56929 35838 8291 16120 49311 63103
8641F3103k5240o674N6121J4606n982j5713l369q803k5071J6680O1090J8444J0854
$$ 63103 37863 31189 87310 101916 95934 80221 76852 68049 42978 59658 120748 139192 150046
8628A50046p262j4189l9241R31K5647P997n0816k8625K5730L8883J3010l7520
$$ 150046 142784 128595 89354 90285 115932 123929 73113 44488 70218 109101 122111 84591
8616H4591K179K1278k9586j8283K0886K9222K2464K1484j86K166l8600k7422J5432
$$ 84591 86770 108048 78462 60179 81065 110287 132751 154235 154049 156215 117615 90193 105625
8603A05625K0642J3149r704M378L4260K6529L0394P263k1718N594K3605M6028
$$ 105625 126267 139416 129712 134090 168350 194879 225273 232536 210818 216412 240017 286045
8591B86045K7769j793k1140J3065r405k4989j9418l4641m4132o124j3081q255
$$ 286045 313814 312021 290881 303946 294541 269552 250134 215493 171361 165237 152156 143901
8579A43901j3154J8395J3808o2205k9779k777J7813L5649j874J80k9577M749M1004
$$ 143901 130747 149142 162950 100745 70966 68189 86002 121651 119777 119957 90380 95129 136133
8566A36133O01k594j1595k8462l9586n780o070j472r239j4272J6407L7081J1088
$$ 136133 136734 134140 122545 94083 54497 48717 42647 41175 31936 17664 34071 71152 82240
8553H2240j1134O814K1008j6202m1233Q466L2181k5285q179k264K2500k5616K7442
$$ 82240 71106 77920 98928 82726 41493 49959 82140 56855 48676 46412 68912 43296 70738
8540G0738n093k7224j5615O295J9183J3750J2841k2831k9116n995J1131J5623
$$ 70738 65645 38421 22806 29101 48284 62034 74875 52044 22928 16933 28064 43687
8528D3687j5568J9208K8773l5643l1872k2784L4367J1681J4414k4645l2117J7092
$$ 43687 28119 47327 76100 40457 8585 -14199 20168 31849 46263 21618 -10499 6593
8516F593J6589n154L5203J0422k7799l6234j6753J4650J2602K1116K9990m1193
$$ 6593 23182 18028 53231 63653 35854 -380 -17133 -2483 10119 31235 61225 20032
8504B0032l2072Q238K0557j292J8374p774j437M477k3525j6577J4069K2543l108
$$ 20032 -12040 -3802 16755 15463 33837 26063 24626 29103 5578 -10999 3070 25613 22505
8491B2505j877P598J0782q488k1256l2709K0759J8468N4374p193o1444j9568K0110
$$ 22505 20628 28226 39008 30520 9264 -23445 -2686 15782 70156 62963 1519 -18049 2061
8478B061J4460R937J5918J6850J1805l3190j9288j5789J7621K8524K3020p769
$$ 2061 16521 26458 42376 59226 71031 37841 18553 2764 20385 48909 71929 64160
8466F4160n430n008K5894P226n3795l69j2284j0220N046N232r791r427k6944J5991
$$ 64160 58730 53722 79616 86842 33047 32678 20394 10174 15220 20452 10661 1234 -25710 -9719
8452i719L2783k2983J1925K0707L6703k1987l512j4040k2249k3619k9921L678
$$ -9719 23064 81 12006 32713 69416 47429 43917 29877 7628 -15991 -45912 -42234
8440d2234J7779m68P886o283J7041J0401j1990J8884n54m0829K1702M4225K763
$$ -42234 -24455 -24923 -17037 -23320 -6279 4122 -7868 11016 10462 -30367 -8665 35560 38323
8427C8323j5914j1318P542J132j0253j271J4926k0245j1334J0823l6079J8328
$$ 38323 22409 11091 18633 19765 9512 8241 23167 2922 -8412 2411 -33668 -15340
8415a5340K1217j4261j4031j9108o946L4072K0943J3470L1058l1005k6531L343
$$ -15340 5877 -8384 -22415 -41523 -48469 -14397 6546 20016 51074 20069 -6462 -3119
8403c119l9685L4495K3146K083l4050J1454J8988j0263l9163J2264L7344R179
$$ -3119 -42804 -8309 14837 16920 -17130 -5676 13312 3049 -36114 -23850 13494 22673
8391B2673j7499j3946l5863K7012K8958j8097m198K5927Q724K479n440Q467J8343
$$ 22673 5174 -8772 -44635 -17623 11335 -6762 -10960 14967 23691 26170 20730 29197 47540
8378D7540j2227j0311J392m876q275J6125K1731J0887p108l6394m7313o048L0674
$$ 47540 35313 25002 26394 21518 13243 29368 51099 61986 54878 18484 -28829 -34877 -4203
8365d203J436l7444m41R646Q184p619M783j5831K0037K6281k1408L00K8261k5310
$$ -4203 -2767 -40211 -40652 -31006 -22822 -30441 -25658 -41489 -21452 4829 -16579 -16279 11982 -13328
8351a3328j0603m249r924N7210L5356l6567J020j0554k7342j6937J7288o987J2016
$$ -13328 -23931 -28180 -38104 19106 54462 17895 18915 8361 -18981 -35918 -18630 -25617 -13601
8338a3601J8820j3089j2544K1427J3250K5699j3093K003j3575k5671j2933K3894
$$ -13601 5219 -7870 -20414 1013 14263 39962 26869 28872 15297 -10374 -23307 587
8326E87K3813j1842r466J0139n733k7099j0767M5360K4957L276L242o793l3459
$$ 587 24400 12558 3092 13231 7498 -19601 -30368 14992 39949 43225 46467 39674 6215
8313F215n099K5104l5562p0479j2117K0306J8242K3084K6294J9231o646J4297
$$ 6215 1116 26220 -9342 -79821 -91938 -71632 -53390 -30306 -4012 15219 8573 22870
8301B2870n665J1811r910l5127n064J4254N3938k4492j1088k2079k4030k221K2870
$$ 22870 17205 29016 19106 -16021 -21085 -6831 47107 22615 11527 -10552 -34582 -36803 -13933
8288a3933J6885P337k4357k2234J5501O193N9187P376n2347N784n381m96N010
$$ -13933 2952 10289 -14068 -36302 -20801 -14608 44579 51955 -392 5392 11 -485 4525
8275D525K1192J3129j5192j0985o616p073l2992l355k2357K953K2326L8168l999
$$ 4525 25717 38846 23654 12669 6053 -1020 -34012 -37367 -59724 -56771 -34445 3723 -276
8262b76j9540j7571K0996J5586P647k0671j807p444R473J5558N133j8140k9421
$$ -276 -19816 -37387 -16391 -805 6842 -13829 -15636 -23080 -13607 1951 7084 -11056 -40477
8249d0477j6095K6286N208K6842j3747J1152M1047J2575j6054k1035L1372J4624
$$ -40477 -56572 -30286 -25078 1764 -11983 -831 40216 52791 36737 15702 47074 61698
8237F1698j0310n1530k2941O942m924J0832N806k2658q281n965k079p634L0299
$$ 61698 51388 -142 -23083 -16141 -21065 -10233 -4427 -27085 -35366 -41331 -43410 -51044 -20745
8224b0745L1359p536j549K9476j9013l2364l205k307L456Q095L8306m6825O547
$$ -20745 10614 3078 1529 31005 11992 -20372 -23577 -25884 -22428 -14333 23973 -22852 -16305
8211a6305K7468K0339j116k37j113J8452n645k4913p789n315k8634n459J2681
$$ -16305 11163 31502 30386 30149 29036 47488 41843 16930 9141 3826 -24808 -30267 -17586
8198a7586L7829O797L375K3691k9464J4397L8179l5944R070m0827m7432q132q88
$$ -17586 20243 27040 30415 54106 24642 39039 77218 41274 50344 9517 -37915 -46047 -46935
8185d6935N312J0515J3940K3455P688K343l819j0015k9993l5180J6721K9817K722
$$ -46935 -41623 -31108 -17168 6287 13975 16318 12499 2484 -27509 -62689 -45968 -16151 -13429
8172a3429J0788J8051n135n27q250N358J6095l3574O549M7114j4181j5648J1741
$$ -13429 -2641 15410 10275 9748 1498 6856 22951 -10623 -4074 43040 28859 13211 24952
8159B4952K253k4322j2750k7545j0579Q701K4390J4274k0555k8591j157j2720
$$ 24952 27205 2883 -9867 -37412 -47991 -39290 -14900 -626 -21181 -49772 -50929 -63649
8147f3649j009J7839K5671N9308j1234n045J807j1137J0975O4k0247l741K715
$$ -63649 -64658 -46819 -21148 38160 26926 21881 23688 12551 23526 23590 3343 -398 2317
8134B317N886R780R632j4797j4357J311j2971K3295J8790j1531k2578J6267J2292
$$ 2317 8203 17983 27615 12818 -1539 -228 -13199 10096 28886 17355 -5223 11044 23336
8121B3336j2975j8754j5063n341J7989J4170J2398o348M57K3663M099j5072P414
$$ 23336 10361 -8393 -23456 -28797 -10808 3362 15760 9412 9869 33532 37631 22559 29973
8108B9973k0982J1285K1926m2650k0827K9545K2624k7412l5591p223O676L5354
$$ 29973 8991 20276 42202 -448 -21275 8270 30894 3482 -32109 -39332 -32656 2698
8096B698L1345n022j8789j3593M031j504O647L700J6115M2493j6374k0927l998
$$ 2698 34043 29021 10232 -3361 670 -834 5813 9513 25628 68121 51747 30820 26822
8083B6822j8671l0992R155K2784o681O843j1278o917k3266q816J6487J6284L540
$$ 26822 8151 -22841 -13686 9098 2417 9260 -2018 -8935 -32201 -41017 -24530 -8246 -4706
8070d706K0708M5232J2155j7475k1803R671L2635P153o6699o6299J1758L1260
$$ -4706 16002 61234 73389 55914 34111 43782 76417 83570 16871 -49428 -37670 -6410
8058f410R233K4244P153k5066j243l748K0186J8601M938p289p363j7925j7023
$$ -6410 2823 27067 34220 9154 7911 4163 24349 42950 47888 40599 33236 15311 -1712
8045a712q124K8435K5153l0511K8038K285k7256j3196n566l3166J3334M1168M5409
$$ -1712 -9836 18599 43752 13241 41279 43564 16308 3112 -2454 -35620 -22286 18882 64291
8032F4291K825m6858k9557r461j6304J5575R387j1105J3626K9742Q51j5655J2936
$$ 64291 67116 20258 -9299 -18760 -35064 -19489 -10102 -21207 -7581 22161 23012 7357 20293
8019B0293L000m219j0556l268K9749m821o425O769L7185j1210N227p460q404o472
$$ 20293 23293 19074 8518 5250 34999 30178 23753 30522 67707 56497 61724 54264 45860 39388
8005C9388J8909L4798M539l857L0337K6271j883l7359q439K5168N090k5868k6217
$$ 39388 58297 93095 97634 93777 124114 150385 148502 111143 102704 127872 132962 107094 80877
7992H0877J5561K8648j8213k1976j1847K1591j7983j4876k019k3699k2755n921
$$ 80877 96438 125086 106873 84897 73050 94641 76658 61782 59763 36064 13309 7388
7980G388n673k8428n152l067L0466L1377J5369l8556K0993J3658J0530L3571K6483
$$ 7388 1715 -26713 -31865 -34932 -4466 26911 42280 3724 24717 38375 48905 82476 108959
7967A08959O637l8237j195K5393l0552l6054K1690K9634J8410J0565Q642K8936
$$ 108959 115596 77359 76164 101557 71005 34951 56641 86275 104685 115250 123892 152828
7955A52828l720q0505k4828K284J2854l892l866J8972J118j3018O016o300k4078
$$ 152828 149108 68603 43775 46059 58913 55021 51155 70127 71245 58227 64243 57943 33865
7942C3865j6156J8932l300j4154K5485K8159j1875K909p943j9971q537N867R987
$$ 33865 17709 36641 33341 19187 44672 72831 60956 63865 55922 35951 27414 33281 43268
7929D3268K2148p413n3681j5750L0458J5835j0039J0983j2285J5359j1193P946
$$ 43268 65416 58003 4322 -11428 19030 34865 24826 35809 23524 38883 27690 35636
7917C5636k9020k5934j4847K2472L1061R423l3637q191L2378R1260K56k6243j0156
$$ 35636 6616 -19318 -34165 -11693 19368 28791 -4846 -13037 19341 110601 110857 84614 74458
7904G4458l6115j9503J1304K4972L0865l999l9396m5319r761n849J3784J5180
$$ 74458 38343 18840 30144 55116 85981 81982 42586 -2733 -12494 -18343 -4559 10621
7892A0621R844P645J6646j5215l6075k5840q163K3395K5828J0964j7773k717M176
$$ 10621 20465 28110 44756 29541 -6534 -32374 -40537 -17142 8686 19650 1877 -840 3336
7879C336p594k5028M8867L0286K870r690j1217K388j9005n703L3118j2329l0842
$$ 3336 -4258 -29286 19581 49867 52737 43047 31830 34218 15213 9510 42628 30299 -543
7866e43m451J729L3801r498l7597P936J5787j80j8431j3523M0465O703k5539k5013
$$ -543 -4994 -3265 30536 21038 -16559 -8623 7164 6984 -11447 -24970 15495 22198 -3341 -28354
7852b8354J4314M1009L9186l494J536j2108l0814l5576m4791m687j141K4415L5565
$$ -28354 -14040 26969 66155 62661 64197 52089 21275 -14301 -59092 -63779 -64920 -40505 -4940
7839d940J5183R557k8291r144m261K093K1412L8278j7565l8855k6277J6484K9943
$$ -4940 10243 19800 -8491 -17635 -21896 -19803 1609 39887 22322 -16533 -42810 -26326 3617
7826C617L1581j4212K8026J5358k2312P435j4054p880K9295j2350j6796k197J0689
$$ 3617 35198 20986 49012 64370 42058 49493 35439 27559 56854 44504 27708 25511 36200
7813C6200k3981k4714j2846J2127L257j2107j5003R058P03j1264O839K5679L7695
$$ 36200 12219 -12495 -25341 -13214 -9957 -22064 -37067 -28009 -27306 -38570 -31731 -6052 31643
7800C1643K2952k7045j2576j4255k205J9002m890j1830l9886N079J8368l992j4290
$$ 31643 54595 27550 14974 719 -1486 17516 12626 796 -39090 -34011 -15643 -19635 -33925
7787c3925K1368O0066J6659l3303k935O034l7559j5336k7898j7416J9504L6670
$$ -33925 -12557 47509 64168 30865 27930 33964 -3595 -18931 -46829 -64245 -44741 -8071
7775h071J486P114k417k7989J9716m865M3424J6978k0395j7591K2147p084j3443
$$ -8071 -6585 529 -1888 -29877 -10161 -15026 28398 45376 24981 7390 29537 22453 9010
7762I010j1160j3783k9081k0671M9453K2932J2725j5004j6743L2936o177k568
$$ 9010 -2150 -15933 -45014 -65685 -16232 6700 19425 4421 -12322 20614 14437 11869
7750A1869j1906q059K02l866n524K563L242j4494J2011L1721j2166k1929J6199
$$ 11869 -37 -8096 -7894 -11760 -17284 -14721 -11479 -25973 -13962 17759 5593 -16336 -137
7737a37J5783J5579J9126m922k1151j1991J1115k2034l5278r596M1120m401r982
$$ -137 15646 31225 50351 45429 24278 12287 23402 1368 -33910 -43506 -2386 -6787 -16769
7724a6769r859j6089k3150J1581J6814Q800j355n056J6751J8470J5840l25R03
$$ -16769 -26628 -42717 -65867 -54286 -37472 -28672 -30027 -35083 -18332 138 15978 15653 16556
7711A6556k930k8862p003O668M428j5889L9298J3301K1702K2352M390j9564k1171
$$ 16556 13626 -15236 -22239 -15571 -11143 -27032 12266 25567 47269 69621 74011 54447 33276
7698C3276K6406M341q561n810o725j8333j1392J1246L377n531r99j5948j2279
$$ 33276 59682 64023 55462 49652 42927 24594 13202 24448 27825 22294 21295 5347 -6932
7685f932j1376j8850J3252J2614J446n852J4201L2719L3159p672k2660j7009k8371
$$ -6932 -18308 -37158 -23906 -11292 -9846 -15698 -1497 31222 64381 56709 34049 17040 -11331
7672a1331p063n239J8117J4445J0749j2679k1566k1588j0906K0586J4640j470
$$ -11331 -18394 -23633 -5516 8929 19678 6999 -14567 -36155 -47061 -26475 -11835 -13305
7660a3305J2608J2867m7733k8697m065L329J5004K0230l3353M370N991j4686R659
$$ -13305 -697 12170 -35563 -64260 -68325 -64996 -49992 -29762 -63115 -58745 -52754 -67440 -57781
7647e7781M1652l75j0408J7780O478K4200j8214J5997j2995j3311j0196o447O802
$$ -57781 -16129 -16504 -26912 -9132 -2654 21546 3332 19329 6334 -6977 -17173 -23620 -16818
7634a6818M623J1454l0701j5865j5206K6783o980r429K9132J0991m261P500K0232
$$ -16818 -12195 -741 -31442 -47307 -62513 -35730 -42710 -52139 -23007 -12016 -16277 -8777 11455
7621A1455j6577j0462k4377J6475P647K0124L6827Q984j4739j0078m4586J2292
$$ 11455 -5122 -15584 -39961 -23486 -15839 4285 41112 50096 35357 25279 -19307 -7015
7609g015o452k0583N8660L5447k1466j5714j1438K836K5876l2910p985K4483r021
$$ -7015 -13467 -34050 24610 60057 38591 22877 11439 14275 40151 7241 -744 23739 14718
7596A4718P856q813o2321j544L2120p434l4042j4367J2057j2480M8024L4880L5022
$$ 14718 22574 13761 -48560 -50104 -17984 -25418 -59460 -73827 -61770 -74250 -26226 8654 43676
7583D3676j9533k9443r633o704J1857J2949l959j4704o662M785n096k0989k065
$$ 43676 24143 -5300 -14933 -21637 -9780 3169 -790 -15494 -22156 -17371 -22467 -43456 -45521
7570d5521K3295L1457M5931J8144J655k0257j2230L013k2404j8904m9439N496
$$ -45521 -22226 9231 55162 73306 74961 54704 42474 45487 23083 4179 -45260 -39764
7558c9764L7103n74K6655K7459j5378k6979o1943l7398P476J0565K7975M0492
$$ -39764 -2661 -3235 23420 50879 35501 8522 -53421 -90819 -83343 -72778 -44803 -4311
7546d311P745k7560R28J9187K2205M5051K8098l4534j2925k0621N979p886j3000
$$ -4311 3434 -24126 -23198 -4011 18194 63245 91343 56809 43884 23263 29242 21356 8356
7533H356p3L258J1816R554P090J7417k2619l7864j7449j6027M7715K0447l6893
$$ 8356 8283 11541 23357 32911 40001 57418 34799 -3065 -20514 -36541 11174 31621 -5272
7520e272L1488j0648j2437k0882j8938J7488K6799n520j5965K3173K3936l1385
$$ -5272 26216 15568 3131 -17751 -36689 -19201 7598 2078 -13887 9286 33222 1837
7508A837J80k0855k7192L5484J6530n346l2950P813J8115J4371p884m842l392
$$ 1837 2017 -18838 -46030 -10546 5984 638 -32312 -24499 -6384 7987 103 -4739 -8131
7495h131j8495J5748j2159l5989N992j0065M387J3948J1761Q416L5720p546p762
$$ -8131 -26626 -10878 -23037 -59026 -53034 -63099 -58712 -44764 -33003 -24587 11133 3587 -4175
7482d175p993j0065j0452K4567k604k1236j8809J5583J0911j5784j3464J869J4324
$$ -4175 -12168 -22233 -32685 -8118 -10722 -31958 -50767 -35184 -24273 -40057 -53521 -51652 -37328
7469c7328p859J4955L3779k936k5205L9549M738M258l3376R787O756k4320k5585
$$ -37328 -45187 -30232 3547 611 -24594 14955 19693 23951 -9425 362 7118 -17202 -42787
7456d2787q173J2522N65k9891J278L0001J2916j3059J0037L0052o126K5795J8311
$$ -42787 -50960 -38438 -37873 -67764 -66486 -36485 -23569 -36628 -26591 3461 -2665 23130 41441
7443D1441q366n0997j8061M672r555K9811K7214P37k2411n102K1035j000k7250
$$ 41441 33075 -17922 -35983 -31311 -40866 -11055 16159 16896 -5515 -10617 10418 9418 -17832
7430a7832m403j7837J8677J9265k6388l456J2466L3482J6472K8184r324J5552
$$ -17832 -22235 -40072 -21395 -2130 -28518 -31974 -19508 13974 30446 58630 49306 64858
7418F4858k20j7354K83p897k4465K3079R23r627k8204j5375l216l294l109J2338
$$ 64858 64638 47284 47567 39670 15205 38284 39207 29580 1376 -13999 -17215 -20509 -23618 -11280
7404a1280L0411j2972n9870j8611k0562q809l837P656K5194L5042K8961J38K6683
$$ -11280 19131 6159 -53711 -72322 -92884 -101693 -105530 -97874 -72680 -37638 -8677 -8539 18144
7391A8144P003k2503Q461K92J1164j6803l0720L887R224o906J5948j3435m4338
$$ 18144 25147 2644 11105 11397 22561 5758 -24962 -21075 -11851 -18757 -2809 -16244 -60582
7378f0582j7435M4171L9914j3632k7653J5734K394j4897J45J4457j049j2064K6973
$$ -60582 -78017 -33846 6068 -7564 -35217 -19483 -17089 -31986 -31841 -17384 -18433 -30497 -3524
7365c524L398j1748m556r724M147Q511j0746j54J6j0402n260K3065J4105J2459
$$ -3524 -126 -11874 -16430 -26154 -22007 -13496 -24242 -24396 -24380 -34782 -40042 -16977 -2872 9587
7351I587j6486j664j0650j0735J4862J0654J8444j8248j1169j5295m589j3601
$$ 9587 -6899 -8563 -19213 -29948 -15086 -4432 14012 -4236 -15405 -30700 -35289 -48890
7339d8890M558L75k7433K3373N025R091K3829M207O39K8524r328k4011N415l8597
$$ -48890 -44332 -43957 -71390 -48017 -42992 -33901 -10072 -5865 -5226 23298 13970 -10041 -4626 -43223
7325d3223p988J3574r818N076j3005j1290l729M1556Q490l6130j4087j2294Q832
$$ -43223 -51211 -37637 -47455 -42379 -55384 -66674 -70403 -28847 -20357 -56487 -70574 -82868 -74036
7312g4036l492m3094M4342N5471k2684J8119L6620J2267Q282j1384k0531P845
$$ -74036 -77528 -120622 -76280 -20809 -43493 -25374 11246 23513 31795 20411 -120 7725
7300G725K6361j9038l0544j2895K7538r01k9499m3558j7319K3910N887J5302L168
$$ 7725 34086 15048 -15496 -28391 -853 -1754 -31253 -74811 -92130 -68220 -62333 -47031 -43863
7287d3863L092K5295M2419J7170P508k9780k0670J95J1585J6383K2218O991k9411
$$ -43863 -40771 -15476 26943 44113 51621 21841 1171 1366 12951 29334 51552 58543 29132
7274B9132l5354q135j7431l4503O707q249J3543N7506N0840m255j5194l8804n737
$$ 29132 -6222 -14357 -31788 -66291 -59584 -67833 -54290 3216 54056 49801 34607 -4197 -9934
7261i934P232k0909m9769O692J3404j1175M368J9081M0330j2339l167n948j603
$$ -9934 -2702 -23611 -73380 -66688 -53284 -64459 -60091 -41010 -680 -13019 -16186 -22134 -23737
7248b3737J9657p281j1154j716j8868j7049r1K8924L0773J4931k5316m6745j3112
$$ -23737 -4080 -11361 -22515 -24231 -43099 -60148 -60239 -31315 -542 14389 -10927 -57672 -70784
7235g0784J6981P1106Q254k575L351m254J5743k4457q463j6941j2480K3022j3876
$$ -70784 -53803 17303 25557 22982 26333 22079 37822 13365 4902 -12039 -24519 -1497 -15373
7222a5373j565j722J1611L5134K9838j845l9845j3160l4274m054N850K4058j5923
$$ -15373 -16938 -18660 -7049 28085 57923 56078 16233 3073 -31201 -35255 -29405 -5347 -21270
7209b1270j8772K0738M4363L7202j8954k239P357Q522l7601m6728P384o280J0529
$$ -21270 -40042 -19304 25059 62261 43307 41068 48425 56947 19346 -27382 -19998 -26278 -15749
7196a5749N263N1j6203J3586m567j5025K9675J7285p547l8523j4219K0961m92
$$ -15749 -10486 -10435 -26638 -13052 -17619 -32644 -2969 14316 6769 -31754 -45973 -25012 -25504
7183b5504p616J3688L0499K589k775r261J5458j1674k1348P383K0274j4511r080
$$ -25504 -33120 -19432 11067 13656 10881 1620 17078 5404 -15944 -8561 11713 -2798 -11878
7170a1878j4829K3865K5544j689j1642J8305j2583k8433J8890p28r726j2552k8573
$$ -11878 -26707 -2842 22702 21013 9371 27676 15093 -13340 5550 4822 -4904 -17456 -46029
7157d6029J4492R691M0460j9086j5798M0930K2683k2044l1483j4771j991P268
$$ -46029 -31537 -21846 18614 -472 -16270 24660 47343 25299 -6184 -20955 -22946 -15678
7145a5678M8459K6299l2186m4496k3682m537q168L6405M673P255k6253k1434L1019
$$ -15678 32781 59080 26894 -17602 -41284 -45821 -53989 -17584 -12911 -5656 -31909 -53343 -22324
7132b2324L8724L058j4456j5050k4535L521p505Q9r358P034M5597J7198m4551
$$ -22324 16400 19458 5002 -10048 -34583 -31062 -38567 -38478 -47836 -40802 4795 21993 -22558
7119b2558j3235j8999J4629K6270M0144J1997k874j8374j3040J6117m738j4501
$$ -22558 -35793 -54792 -40163 -13893 26251 38248 35374 17000 3960 20077 15339 838
7107H38j9140k2934J4354N438J5976M540K5127r918J1764j4175l6694j1364K3498
$$ 838 -18302 -41236 -26882 -21444 -5468 -928 24199 14281 26045 11870 -24824 -36188 -12690
7094a2690L7710m877m9966k1598j5508O59J2178K4271L4445J9274l0442k9942
$$ -12690 25020 20143 -29823 -51421 -66929 -66270 -54092 -29821 4624 23898 -6544 -36486
7082c6486J6190K5012K6043J372m2546k0240O452J3208K37r606J1208j2616N17
$$ -36486 -20296 4716 30759 32131 -10415 -30655 -24203 -10995 -10758 -20364 -9156 -21772 -21255
7069b1255r407l9677o286K9618M3824Q209J2078n957J9777j214j9021K1238J120
$$ -21255 -30662 -70339 -76625 -47007 -3183 5026 17104 11147 30924 29710 10689 31927 33047
7056C3047k765k6137J7191L4790Q442k6565J294k0463l4625q032j3382r300P997
$$ 33047 30282 4145 21336 56126 64568 38003 39297 18834 -15791 -23823 -37205 -46505 -38508
7043c8508L435p484K5719N6572J4465n6642J0243P591j8085J0347L5726l5639
$$ -38508 -35073 -42557 -16838 39734 54199 -2443 7800 15391 -2694 7653 43379 7740
7031G740j4432K9184j8070L625P87J344L8491K37j2278m1440l1129j273O174r618
$$ 7740 -6692 22492 4422 8047 8834 10178 48669 48906 36628 -4812 -35941 -37214 -31040 -40658
7017d0658j5749J425J0319K4744J6010j861k1270l1058k6866J2394K4976Q910
$$ -40658 -56407 -54982 -44663 -19919 -3909 -5770 -27040 -58098 -84964 -72570 -47594 -38684
7005c8684Q754J6289J298N776J0721J0536j06l2517k6093M1098J5292K6224Q402
$$ -38684 -29930 -13641 -12343 -6567 4154 14690 14584 -17933 -44026 -2928 12364 38588 46990
6992D6990k5395j6442P69j6582J0614M6539J0505j8395k0357K738k849N914m2460
$$ 46990 21595 5153 5922 -10660 -46 46493 56998 38603 18246 20984 18135 24049 -18411
6979a8411j5502P862l580K0664R299o336j9190q794o37J757J675k5972j8472K7739
$$ -18411 -33913 -26051 -29631 -8967 332 -6004 -25194 -33988 -34625 -32868 -31193 -57165 -75637 -47898
6965d7898M47p669K7561l090P364K6734j8472M583K9780r43j8042j4002K022J5270
$$ -47898 -47451 -55120 -27559 -30649 -23285 3449 -15023 -10440 19340 18397 355 -13647 -11625 3645
6951C645j2892j3293j554J3611M0168j4017l3013m046n298J7765J3894P309j6246
$$ 3645 -9247 -22540 -24094 -10483 29685 15668 -17345 -21391 -26689 -8924 4970 12279 -3967
6938c967l350j1570j3514K7448K5266m379q894K1692K0081J339l3267k6756J5341
$$ -3967 -7317 -18887 -32401 -4953 20313 15934 7040 28732 48813 50152 16885 -9871 5470
6925E470K1445j2974L832J3370R438K270k6427l0439j0996j9855J3805K2601l713
$$ 5470 26915 13941 17773 31143 40581 42851 16424 -14015 -25011 -44866 -31061 -8460 -12173
6912a2173Q926K6K5130K3640j6934j1840K5513K2570L484j5472m3404k9043l622
$$ -12173 -3247 -3221 21909 45549 28615 16775 42288 64858 68342 52870 9466 -19577 -23199
6899b3199j1464j3329J8797k1049j6913Q790L4834K2748K1478J811m4524j2733
$$ -23199 -34663 -47992 -29195 -50244 -67157 -58367 -23533 -785 20693 22504 -22020 -34753
6887c4753N579K6362M4765P191j2621j0121k0945j7959K965j0372k5157q644N4647
$$ -34753 -29174 -2812 41953 49144 36523 26402 5457 -12502 -9537 -19909 -45066 -53710 937
$$ [...]
##END NTUPLES=NMR SPECTRUM
##END=
