##TITLE=Analysis number 326795
Compound Code spb 02646
Project Code adrs
Chemist Name aci
##JCAMPDX= 6.0         $$ Bruker NMR JCAMP-DX V2.0
##DATA TYPE= NMR SPECTRUM
##DATA CLASS= NTUPLES
##ORIGIN= Bruker BioSpin GmbH
##OWNER= nmr
$$ XWIN-NMR		Version 3.5
$$ Thu Feb 22 11:29:17 2007 GMT Standard Time (UT+0h)  MAYBRIDGE\nmr@NMR_250MHZ
##.OBSERVE FREQUENCY= 250.131544655141
##.OBSERVE NUCLEUS= ^1H
##.ACQUISITION MODE= SIMULTANEOUS (DQD)
##.ACQUISITION SCHEME= undefined
##.AVERAGES= 16
##.DIGITISER RES= 18
##SPECTROMETER/DATA SYSTEM= dpx250
##.PULSE SEQUENCE= zg30
##.SOLVENT NAME= CDCl3
##.SHIFT REFERENCE= (INTERNAL, CDCl3, 0, 16.522)
##AUDIT TRAIL= $$ (NUMBER, WHEN, WHO, WHERE, WHAT)
$$ ##TITLE= Audit trail, XWIN-NMR		Version 3.5
$$ ##JCAMPDX= 5.01
$$ ##ORIGIN= Bruker BioSpin GmbH
$$ ##OWNER= nmr
$$ C:\u/data/dgb/nmr/ADRS/1520/pdata/1/auditp.txt
$$ ##AUDIT TRAIL=  $$ (NUMBER, WHEN, WHO, WHERE, WHAT)
(   1,<2007-02-22 11:28:53.91 +000>,<MAYBRIDGE\nmr>,<NMR_250MHZ>,
      <created by zg, POWCHK disabled, PULCHK disabled
       configuration hash MD5:
       49 4B E0 1D 92 C2 6B 37 9F E6 65 BC 52 41 86 1D
       data hash MD5: 64K
       77 BA 06 CA 65 8C 60 71 17 6A CA 36 28 38 B4 CB>)
(   2,<2007-02-22 11:29:07.71 +000>,<MAYBRIDGE\nmr>,<NMR_250MHZ>,
      <Start of raw data processing
       ef LB = 0.3 FT_mod = 6 PKNL = 1 SI = 32K 
       data hash MD5: 32K
       C0 81 BE D8 2A 99 72 CE 33 DC 6B 3B 61 0D 09 A0>)
(   3,<2007-02-22 11:29:09.68 +000>,<MAYBRIDGE\nmr>,<NMR_250MHZ>,
      <apk 
       data hash MD5: 32K
       3C 4D CA 08 1A 1C EB 63 A3 9D 63 93 C7 34 E8 44>)
(   4,<2007-02-22 11:29:10.46 +000>,<MAYBRIDGE\nmr>,<NMR_250MHZ>,
      <abs ABSG = 5 
       data hash MD5: 32K
       A9 F8 6D 89 7E BD B2 BD C7 C6 11 A8 63 0D 2D 3C>)
$$ ##END=
$$ 
$$ hash MD5
$$ E8 79 A6 1C B8 8E A9 2C F5 15 F1 08 F7 92 79 1F
##$RELAX= 
##$RELAX= 
##$RELAX= 
##$RELAX= 
##$RELAX= 
##$RELAX= 
##$RELAX= 
$$ Bruker specific parameters
$$ --------------------------
##$DU= <C:\u>
##$EXPNO= 1520
##$NAME= <ADRS>
##$PROCNO= 1
##$TYPE= <nmr>
##$USER= <dgb>
##$AMP= (0..31)
100 100 100 100 100 100 100 100 100 100 100 100 100 100 100 100 100 100 
100 100 100 100 100 100 100 100 100 100 100 100 100 100 
##$AQSEQ= 0
##$AQ_mod= 3
##$AUNM= <au_zg>
##$AUTOPOS= <3 >
##$BF1= 250.13
##$BF2= 250.13
##$BF3= 250.13
##$BF4= 250.13
##$BF5= 500.13
##$BF6= 500.13
##$BF7= 500.13
##$BF8= 500.13
##$BYTORDA= 1
##$CFDGTYP= 0
##$CFRGTYP= 5
##$CHEMSTR= <none>
##$CNST= (0..31)
1 1 145 1 1 1 1 1 1 1 1 1 1 1 1 1 1 1 1 1 1 1 1 1 1 1 1 1 1 1 1 1 
##$CPDPRG= <>
##$CPDPRG1= <>
##$CPDPRG2= <>
##$CPDPRG3= <>
##$CPDPRG4= <mlev>
##$CPDPRG5= <mlev>
##$CPDPRG6= <mlev>
##$CPDPRG7= <mlev>
##$CPDPRG8= <mlev>
##$CPDPRGB= <>
##$CPDPRGT= <>
##$D= (0..31)
0 1 0 0 0 0 0 0 0 0.06 0 0 0 0 0 0 0.0002 0 0 0 0 0 0 0 0 0 0 0 0 0 0 
0 
##$DATE= 1172143732
##$DBL= (0..7)
120 120 120 120 120 120 120 120 
##$DBP= (0..7)
150 150 150 150 150 150 150 150 
##$DBP07= 0
##$DBPNAM0= <>
##$DBPNAM1= <>
##$DBPNAM2= <>
##$DBPNAM3= <>
$$ [...]
##$SUBNAM7= <"">
##$SUBNAM8= <"">
##$SUBNAM9= <"">
##$SW= 20.6930455092707
##$SWIBOX= (0..15)
0 0 3 0 0 0 0 0 0 0 0 0 0 0 0 0 
##$SW_h= 5175.983436853
##$TD= 65536
##$TD0= 1
##$TE= 294.16
##$TE2= 300
##$TE3= 300
##$TEG= 300
##$TL= (0..7)
0 120 120 120 120 120 120 120 
##$TP= (0..7)
150 150 150 150 150 150 150 150 
##$TP07= 0
##$TPNAME0= <>
##$TPNAME1= <>
##$TPNAME2= <>
##$TPNAME3= <>
##$TPNAME4= <>
##$TPNAME5= <>
##$TPNAME6= <>
##$TPNAME7= <>
##$TPOAL= (0..7)
0.5 0.5 0.5 0.5 0.5 0.5 0.5 0.5 
##$TPOFFS= (0..7)
0 0 0 0 0 0 0 0 
##$TUNHIN= 0
##$TUNHOUT= 0
##$TUNXOUT= 0
##$USERA1= <user>
##$USERA2= <user>
##$USERA3= <user>
##$USERA4= <user>
##$USERA5= <user>
##$V9= 5
##$VALIST= <valist>
##$VCLIST= <CCCCCCCCCCCCCCC>
##$VD= 0
##$VDLIST= <DDDDDDDDDDDDDDD>
##$VPLIST= <PPPPPPPPPPPPPPP>
##$VTLIST= <TTTTTTTTTTTTTTT>
##$WBST= 1024
##$WBSW= 4
##$XGAIN= (0..3)
0 0 0 0 
##$XL= 0
##$YL= 0
##$YMAX_a= 263211
##$YMIN_a= -395315
##$ZGOPTNS= <>
##$ZL1= 120
##$ZL2= 120
##$ZL3= 120
##$ZL4= 120
##$ABSF1= 16.522
##$ABSF2= -4.171173
##$ABSG= 5
##$ABSL= 3
##$ALPHA= 0
##$AQORDER= 0
##$ASSFAC= 0
##$ASSFACI= 0
##$ASSFACX= 0
##$ASSWID= 0
##$AUNMP= <proc_1d>
##$AZFE= 0.1
##$AZFW= 0.1
##$BCFW= 0
##$BC_mod= 0
##$BYTORDP= 0
##$COROFFS= 0
##$CY= 12.5
##$DATMOD= 1
##$DC= 0
##$DFILT= <>
##$DTYPP= 0
##$F1P= 14.0000005364418
##$F2P= -0.99999901652339
##$FCOR= 0.5
##$FTSIZE= 32768
##$FT_mod= 6
##$GAMMA= 0
##$GB= 0
##$INTBC= 1
##$INTSCL= 1
##$ISEN= 128
##$LB= 0.3
##$LEV0= 0
##$LPBIN= 0
##$MAXI= 10000
##$MC2= 0
##$MEAN= 0
##$ME_mod= 0
##$MI= 0
##$NCOEF= 0
##$NC_proc= -4
##$NLEV= 6
##$NOISF1= 0
##$NOISF2= 0
##$NSP= 0
##$NTH_PI= 0
##$NZP= 0
##$OFFSET= 16.522
##$PC= 1
##$PHC0= -136.5817
##$PHC1= 15.48662
##$PH_mod= 1
##$PKNL= yes
##$PPARMOD= 0
##$PSCAL= 4
##$PSIGN= 0
##$REVERSE= no
##$SF= 250.13
##$SI= 32768
##$SIGF1= 0
##$SIGF2= 0
##$SINO= 400
##$SIOLD= 32768
##$SREGLST= <1H.CDCl3>
##$SSB= 0
##$STSI= 32768
##$STSR= 0
##$SW_p= 5175.98343685301
##$SYMM= 0
##$S_DEV= 0
##$TDeff= 65536
##$TDoff= 0
##$TI= <Analysis number 999999
Compound Code 99
Book Reference 9
Project Code 9>
##$TILT= no
##$TM1= 0
##$TM2= 0
##$TOPLEV= 0
##$USERP1= <user>
##$USERP2= <user>
##$USERP3= <user>
##$USERP4= <user>
##$USERP5= <user>
##$WDW= 1
##$XDIM= 32768
##$YMAX_p= 266266846
##$YMIN_p= -288768
$$ End of Bruker specific parameters
$$ ---------------------------------
##NTUPLES= NMR SPECTRUM
##VAR_NAME=  FREQUENCY,     SPECTRUM/REAL,   SPECTRUM/IMAG
##SYMBOL=    X,             R,               I
##VAR_TYPE=  INDEPENDENT,   DEPENDENT,       DEPENDENT
##VAR_FORM=  AFFN,          ASDF,            ASDF
##VAR_DIM=   32768,         32768,           32768
##UNITS=     HZ,            ARBITRARY UNITS, ARBITRARY UNITS
##FACTOR=    0.157963299565203, 1,           1
##FIRST=     4132.6476996994, 0,             0
##LAST=      -1043.33573715361, 0,           0
##MIN=       -1043.33573715361, -288768,     0
##MAX=       4132.6476996994, 266266846,     0
$$ Real data points
##PAGE= N=1
##DATA TABLE= (X++(R..R)), XYDATA
$$ [...]
19239I14885L6409P892R130J27425O3294m7698m4549r318K3994k2931q4129n5865
$$ 914885 951294 959186 968316 1095741 1159035 1111337 1066788 1057470 1081464 1058533 974404 918539
19227I18539M558Q7977L1334R295N9965m169n5970p355Q964P5217R383j4268J1731
$$ 918539 923097 1011074 1042408 1051703 1111668 1107499 1051529 1044174 1053138 1128355 1137738 1123470 1135201
19214A135201l8348k9964n4808n0997O405J00322M9o3424o678M2486N6001M1684
$$ 1135201 1096853 1066889 1012081 961084 967489 1067811 1067860 1004436 997758 1040244 1096245 1137929
19202A137929k8199j912j4692l0599J9389M9649J9539J5026l9860l7565R6045
$$ 1137929 1109730 1107818 1093126 1062527 1081916 1131565 1151104 1166130 1126270 1088705 1184750
19191A184750J66651K4121j6308O466p2901k5612J6889m1702J5424N3620N5973
$$ 1184750 1351401 1375522 1359214 1365680 1292779 1267167 1284056 1242354 1257778 1311398 1367371
19180A367371m1326o9381q6084j1343L5971O8427j6691K883L0701M496L425p4744
$$ 1367371 1326045 1256664 1170580 1159237 1195208 1263635 1246944 1249827 1280528 1285024 1288449 1213705
19168A213705L115J2614P7740Q3968P7070K96n2546l5199L0715n1345j2882N0230
$$ 1213705 1216820 1229434 1307174 1391142 1468212 1468508 1415962 1380763 1411478 1360133 1347251 1397481
19156A397481n9191m6711k8090L897k6586P9886K4593N356J6921J5279M9176K3491
$$ 1397481 1338290 1291579 1263489 1267386 1240800 1320686 1345279 1350635 1367556 1382835 1432011 1455502
19144A455502l5553m2699P2052O5584L299q0836K5509M736p446K2676p1802m949
$$ 1455502 1419949 1377250 1449302 1514886 1518185 1437349 1462858 1467594 1460148 1482824 1411022 1406073
19132A406073P2815N1873N9510M2847j35842o345J0610l4200K1718L7006O727
$$ 1406073 1478888 1530761 1590271 1633118 1497276 1490931 1501541 1467341 1489059 1526065 1532792
19121A532792J4702n1776j435l813J878k222j7195Q230M2027K8075J6589J863
$$ 1532792 1547494 1495718 1494283 1490470 1492348 1490126 1472931 1481161 1523188 1551263 1567852 1569715
19109A569715J0324J1189L5977O3628K0775l9187o7515O7162O1744k1767n9395
$$ 1569715 1580039 1591228 1627205 1690833 1711608 1672421 1604906 1672068 1733812 1712045 1652650
19098A652650j2419J066m202l3681Q6634J09767L6104J0256n0480m2343l1817
$$ 1652650 1640231 1641297 1637095 1603414 1690048 1799815 1835919 1846175 1795695 1753352 1721535
19087A721535J2952N0482q919j8190K2237j8991j3506m7478K404k2239o876Q0171
$$ 1721535 1734487 1784969 1776050 1757860 1780097 1761106 1747600 1700122 1702526 1680287 1673411 1753582
19075A753582j9315n7084J7894L5892K2247j9380k9565j2839L1047L824k7113
$$ 1753582 1734267 1677183 1695077 1730969 1753216 1733836 1704271 1691432 1722479 1726303 1699190
19064A699190L2866O0145O3709k8121k6834K3444O7161J8883j2469Q798J6714
$$ 1699190 1732056 1792201 1855910 1827789 1800955 1824399 1891560 1910443 1897974 1906772 1923486
19053A923486k3270o7223K702K9800l795j8302K0995L3449k614L6301L0412J0203
$$ 1923486 1900216 1832993 1835695 1865495 1861700 1843398 1864393 1897842 1895228 1931529 1961941 1972144
19041A972144M1363K5576P4314K8992l3141j711r298m3033k7563j118j5755o2352
$$ 1972144 2013507 2039083 2113397 2142389 2109248 2107537 2098239 2055206 2027643 2026525 2010770 1948418
19029A948418q037N4744O279j1318j5437L6821O174m061M5374M0858L4952l6975
$$ 1948418 1940381 1995125 2001404 1990086 1974649 2011470 2017644 2013583 2058957 2099815 2134767 2097792
19017B097792k5293k0561l4537l3643j4300P749J9951m2240K956K7876Q8866K9546
$$ 2097792 2072499 2051938 2017401 1983758 1969458 1977207 1997158 1954918 1957874 1985750 2074616 2104162
19005B104162k4952L728l8817J4447M3722M7430k8021l5619M3690M8339n1848
$$ 2104162 2079210 2082938 2044121 2058568 2102290 2149720 2121699 2086080 2129770 2178109 2126261
18994B126261k3777J7320K8836K218k7154K6607l1240P043N5696M7237N2556J8483
$$ 2126261 2102484 2119804 2148640 2150858 2123704 2150311 2119071 2126114 2181810 2229047 2281603 2300086
18982B300086n8449n3784r543M3264J9274l657Q5064k5227j7710L2949K4604k3897
$$ 2300086 2241637 2187853 2178310 2221574 2240848 2237191 2322255 2297028 2279318 2312267 2336871 2312974
18970B312974L7966k1989l1317o552q767j8727j1546K4888N4803L8655J4397m9024
$$ 2312974 2350940 2328951 2297634 2291082 2282315 2263588 2252042 2276930 2331733 2370388 2384785 2335761
18958B335761o8530N106J9998N3502M0780n0828p9167K8479N2033q388j6854k0245
$$ 2335761 2267231 2272337 2292335 2345837 2386617 2335789 2256622 2285101 2337134 2328746 2311892 2291647
18946B291647K2435J1969j5842N2753N4049o9523j0567p464N5208J9989n667K1209
$$ 2291647 2314082 2326051 2310209 2362962 2417011 2347488 2336921 2329457 2384665 2404654 2398987 2420196
18934B420196J0597n3950L4672P38p4352l7751M0981n2327l8173p5418L2170p867
$$ 2420196 2430793 2376843 2411515 2412253 2337901 2300150 2341131 2288804 2250631 2175213 2207383 2199516
18922B199516j3683M8471J11945M3562k0848j3376n775l7287k4102L5060R4855
$$ 2199516 2185833 2234304 2346249 2389811 2368963 2355587 2349812 2312525 2288423 2323483 2418338
18911B418338P767K9631K9501j3185Q669m9756k6347K3934J8229M1863J4205j7019
$$ 2418338 2426105 2455736 2485237 2472052 2480721 2430965 2404618 2428552 2446781 2488644 2502849 2485830
18899B485830o2250L734N0200K5432Q6728l501q2003j5330J1489o84o2914o3078
$$ 2485830 2423580 2427314 2477514 2502946 2589674 2586173 2504170 2488840 2500329 2499645 2436731 2373653
18887B373653J5442n187k8177n987l345Q5798J5934K3741L783J1865K5372L6896
$$ 2373653 2389095 2383908 2355731 2349744 2346399 2432197 2448131 2471872 2475655 2487520 2512892 2549788
18875B549788K7877k6253K1506K5983n3510p4538k2119K2656j1234J3881k6331
$$ 2549788 2577665 2551412 2572918 2598901 2545391 2470853 2448734 2471390 2460156 2474037 2447706
18864B447706j2618l2434l5012J2727M3349L5791N1676j1565n2667k7589k9741
$$ 2447706 2435088 2402654 2367642 2380369 2423718 2459509 2511185 2499620 2446953 2419364 2389623
18853B389623M0987J3247K2060k1108k7944M5477o288K111J0595K8248n9130o4742
$$ 2389623 2430610 2443857 2465917 2444809 2416865 2462342 2456054 2458165 2468760 2497008 2437878 2373136
18841B373136n3728j0321O6741N7528p6900m5710o059K8514K6534l2095l340k3791
$$ 2373136 2319408 2309087 2375828 2433356 2356456 2310746 2304687 2333201 2359735 2327640 2324300 2300509
18829B300509M1979P0461K7449p6204n3761J4814k2203k2544j3250l7128r916
$$ 2300509 2342488 2412949 2440398 2364194 2310433 2325247 2303044 2280500 2267250 2230122 2220206
18818B220206L1848Q0456N2726l952n4820p7794o816l5493k7672O7171O2369J7503
$$ 2220206 2252054 2332510 2385236 2381284 2326464 2248670 2241854 2206361 2178689 2245860 2308229 2325732
18806B325732K4006n8501q1628L9726Q9064M3433l3687k1982m4430p1607k3701
$$ 2325732 2349738 2291237 2209609 2249335 2338399 2381832 2348145 2326163 2281733 2210126 2186425
18795B186425M2528M9424K0165K9466P7519J900o7369p2994n782k8839R5081K8468
$$ 2186425 2228953 2278377 2298542 2328008 2405527 2407427 2340058 2267064 2261282 2232443 2327524 2355992
18783B355992q642q4565O5K4160l128o8445j8660l9695R792j7901O1912O0952
$$ 2355992 2347350 2262785 2262850 2287010 2283882 2215437 2196777 2157082 2166874 2148973 2210885 2271837
18771B271837k2419L8496K6299l3542J1823K0840K9852P9473P6469n7378o1361
$$ 2271837 2249418 2287914 2314213 2280671 2292494 2313334 2343186 2422659 2499128 2441750 2380389
18760B380389q6448j51212j13304j6424K2053O7153k28N2257k6953m3624k0951
$$ 2380389 2293941 2142729 2029425 2013001 2035054 2102207 2101979 2154236 2127283 2083659 2062708
18749B062708j6049l0352J6220k7176p7878l182J1232O0204j3245J8225J8243
$$ 2062708 2046659 2016307 2032527 2005351 1927473 1924291 1935523 1995727 1982482 2000707 2018950
18738B018950m8354Q743N2489J4908k62k0763l2140L3911M9890M7004J5449n9620
$$ 2018950 1970596 1979339 2031828 2046736 2046474 2025711 1993571 2027482 2077372 2124376 2139825 2080205
18726B080205l1247J3433o51J2855l987n3198q403M8621p2239n2493N7024Q5200
$$ 2080205 2048958 2062391 2061740 2074595 2070608 2017410 2009007 2057628 1985389 1932896 1989920 2075120
18714B075120M1201o4331q0428M7495M6334m8089m1343O765P9167k5934q0627
$$ 2075120 2116321 2051990 1971562 2019057 2065391 2017302 1975959 1982724 2061891 2035957 1955330
18703A955330n9847m0222l1803L1857K3766R081J7385m158k9159K8838m5305j2281
$$ 1955330 1895483 1855261 1823458 1855315 1879081 1888162 1905547 1901389 1872230 1901068 1855763 1843482
18691A843482Q0283M1699j2347p4787p5447J8147O3190M7179M650j9257K6281
$$ 1843482 1923765 1965464 1953117 1878330 1802883 1821030 1884220 1931399 1936049 1916792 1943073
18680A943073N1463N7340K8166l6849k5915O6994K990K384K5137K6639k929j7230
$$ 1943073 1994536 2051876 2080042 2043193 2017278 2084272 2087262 2089646 2114783 2141422 2138493 2121263
18668B121263k1854m3916j2884p9766n7912P35j0900l2285k3345q5782r2268M858
$$ 2121263 2099409 2055493 2042609 1962843 1904931 1905666 1894766 1862481 1839136 1753354 1661086 1665944
18656A665944O8808P005o4286m5679q0151J0371M1111j3171n8580P4847N2078
$$ 1665944 1734752 1741757 1677471 1631792 1551641 1562012 1603123 1589952 1531372 1606219 1658297
18645A658297L4584n723o9797k2202n4226k7909J581l609L8088R5552O999m9964
$$ 1658297 1692881 1687158 1617361 1595159 1540933 1513024 1514605 1510996 1549084 1644636 1651635 1601671
18633A601671j6994L1496R9483M9129J8432k6507l8259P664Q519l8116l5234M9715
$$ 1601671 1584677 1616173 1715656 1764785 1783217 1756710 1718451 1726115 1734634 1696518 1661284 1710999
18621A710999o1530j6637l9807J353N2490N4839J8370l074p7785o3828J226n9548
$$ 1710999 1649469 1632832 1593025 1594378 1646868 1701707 1720077 1717003 1639218 1575390 1576616 1517068
18609A517068j03054n9278N578N7766J3160K5402j1739j7690M84n9313O4402P3529
$$ 1517068 1414014 1354736 1360314 1418080 1431240 1456642 1444903 1427213 1427697 1368384 1432786 1506315
18597A506315M0971o2653j35585o2639K9828L4111m2570r1655m1555N5541Q6126
$$ 1506315 1547286 1484633 1349048 1286409 1316237 1350348 1307778 1216123 1174568 1230109 1316235
18586A316235k4634q182q179j5367k9237K7637K19L481j0395M142q8678j1031
$$ 1316235 1291601 1283419 1275240 1259873 1230636 1258273 1258492 1261973 1251578 1255720 1167042 1156011
18574A156011R531M2228K7472M419O2436K671r6280n9806l0741p293k6508J6110
$$ 1156011 1165542 1207770 1235242 1239661 1302097 1304768 1208488 1148682 1117941 1110648 1084140 1100250
18562A100250M4196N1525m5972p126J3892k0033M945k1063L81J2425M4378R385
$$ 1100250 1144446 1195971 1149999 1142873 1156765 1136732 1141677 1120614 1120995 1133420 1177798 1187183
18550A187183k8153J0617O6559j2304j8419o8804n9888M0296L7797j1438N0026
$$ 1187183 1159030 1169647 1236206 1223902 1205483 1136679 1076791 1117087 1154884 1143446 1193472
18539A193472L6619n67m4395k6868p6382K6135k29K5701k2030o6580J8304O3923
$$ 1193472 1230091 1229524 1185129 1158261 1081879 1108014 1107785 1133486 1111456 1044876 1063180 1127103
18527A127103O1396p901j6223k9774q1810K6402p1275M0221K8284L2131J5570
$$ 1127103 1188499 1180598 1164375 1134601 1052791 1079193 1007918 1048139 1076423 1108554 1124124
18516A124124k9999l0579m5216j508J8168l064Q302M3601m1461Q1164M592j05873
$$ 1124124 1094125 1063546 1018330 1016822 1034990 1031926 1040228 1083829 1042368 1123532 1128124 1022251
18504A022251m2211K4773j132K7422N3073k3621o6103p8650m2102K4933Q4921
$$ 1022251 980040 1004813 1003681 1031103 1084176 1060555 994452 915802 873700 898633 983554
18493I83554P2389K9875L7780L7069n207r9311m4745j1287P8869N0229j6748p150
$$ 983554 1055943 1085818 1123598 1160667 1155460 1056149 1011404 1000117 1078986 1129215 1112467 1105317
18481A105317o4854J1437L8809o010k5826p9105o009k3366J5436j2631k1749L407
$$ 1105317 1040463 1051900 1090709 1084699 1058873 979768 973759 950393 965829 953198 931449 934856
18469I34856K8825K3404J5425m2544j05515R211R9043K5577l8570l8124l7041
$$ 934856 963681 987085 1002510 959966 854451 863662 962705 988282 949712 911588 874547
18458H74547o5862p745K1130R220N4179N4201k1398n5793L1931O4058o7510m6730
$$ 874547 808685 800940 822070 831290 885469 939670 918272 862479 894410 958468 890958 844228
18446H44228L8812Q955J9991R893l9551m8581K8574O2336m0280j9486O2838r169
$$ 844228 883040 891995 911986 921879 882328 833747 862321 924657 884377 864891 927729 918560
18434I18560m5743J3513k1892o4446J2842m73J1621q518J3219m9933J252R1763
$$ 918560 872817 886330 864438 799992 812834 812361 823982 815464 828683 778750 780002 871765
18422H71765J6770k14l3496j9250l8228R327O264l292r727N8167Q835J02756m2270
$$ 871765 888535 888321 854825 835575 797347 806674 812938 809646 799919 858086 866921 969677 927407
18409I27407m3900j5577n0263j9876L5739k7023N459k9430J2974R399M1816M7872
$$ 927407 883507 867930 817667 797791 833530 806507 811966 782536 795510 804909 846725 894597
18397H94597K505l6443m7604j11562O355L3818K9334J3840P659k0488k5584L0337
$$ 894597 897102 860659 813055 701493 707848 741666 771000 784840 792499 772011 746427 776764
18385G76764N2541m7978N5800J5480L8740l835p2993j8186L5471k8461j0622m8946
$$ 776764 829305 781327 837127 852607 891347 887512 814519 796333 831804 803343 792721 743775
18373G43775l1204r647J8369O0940L9136J6189K2510N3845J4270m7732p6151J4900
$$ 743775 712571 702924 721293 782233 821369 837558 860068 913913 928183 880451 804300 819200
18361H19200K5787K233q259K3198K3238M1043j5692m4690k7734J9198j6549J8694
$$ 819200 844987 847220 838961 862159 885397 926440 910748 866058 838324 857522 840973 859667
18349H59667N871L4140L4141l6750q254K6275l0455j8051K8557O6109j34782k9506
$$ 859667 865538 899678 933819 897069 888815 915090 884635 866584 895141 961250 826468 796962
18337G96962m8455n7485j2119O1818N7284P8023l162O758J7792K9464m7582K4658
$$ 796962 748507 691022 678903 740721 798005 876028 872866 879624 897416 926880 879298 903956
18325I03956r920l7785K6894O5586P1184l2276o1517j3601O6712K6163o2048q144
$$ 903956 894036 856251 883145 948731 1019915 987639 926122 912521 979233 1005396 943348 935204
18313I35204n945m2338l0717l7440Q357N5214Q2956J4046j3564J21804k5992J6215
$$ 935204 929259 886921 856204 818764 827121 882335 965291 979337 965773 1087577 1061585 1077800
18301A077800p2m9759N590k3686K1578P3654K0231R864m528j3218k1637k2703
$$ 1077800 1077728 1027969 1033559 1009873 1031451 1105105 1125336 1135200 1130672 1117454 1095817 1073114
18289A073114n046J4981Q1417M8362J1724O805Q130q47N2522N0713l1263m9383
$$ 1073114 1068068 1083049 1164466 1212828 1224552 1231357 1239487 1238640 1291162 1341875 1310612 1261229
18277A261229P0159L6610J3130L3972J3456O3136P5186M6152Q9622O3909M9117
$$ 1261229 1331388 1367998 1381128 1415100 1428556 1491692 1566878 1613030 1702652 1766561 1815678
18266A815678L8827J12498O9757J95982J21196J02952J44100J36265J34298J58783
$$ 1815678 1854505 1967003 2036760 2232742 2353938 2456890 2600990 2737255 2871553 3030336
18256C030336J52529L40758K72169K53656L71155K92038K73265K00556K35009
$$ 3030336 3182865 3523623 3795792 4049448 4420603 4712641 4985906 5186462 5421471
18247E421471L56777L90140M21941M93557O30917O01487O10538N51606O15728
$$ 5421471 5778248 6168388 6590329 7083886 7714803 8316290 8926828 9478434 10094162
18238A0094162O14893P01963Q11114Q97909Q20804R13292J112012J395747J766730
$$ 10094162 10709055 11411018 12222132 13120041 13940845 14854137 15966149 17361896 19128626
18229A9128626K108587K321121K218133K144591K180143K692686L226279L230091
$$ 19128626 21237213 23558334 25776467 27921058 30101201 32793887 36020166 39250257
18221C9250257K253205Q50954j264326l232638l770856l529819k786314k061180
$$ 39250257 41503462 42354416 41090090 37857452 34086596 30556777 27770463 25709283
18213B5709283j566636j382305j404032j182482n47127K53551M69181K7008m10887
$$ 25709283 24142647 22760342 21356310 20173828 19626701 19880252 20349433 20376441 19965554
18204A9965554q97294j348667j359533r16807k77220K22425M85523P07118P86505
$$ 19965554 19068260 17719593 16360060 15443253 15166033 15388458 15873981 16581099 17367604
18195A7367604R38043J033654J237036J429633J719125J891109J796562J735098
$$ 17367604 18305647 19339301 20576337 22005970 23725095 25616204 27412766 29147864
18187B9147864J812571J709597K124501K817577L737966M565842M952318M316506
$$ 29147864 30960435 32670032 34794533 37612110 41350076 45915918 50868236 55184742
18179E5184742L221349K778534L095026M043382N271817N186617L569264J701463
$$ 55184742 58406091 61184625 64279651 68323033 73594850 78781467 82350731 84052194
18171H4052194j169852l646734l886324k702863j322007q25693j618322l493372
$$ 84052194 82882342 79235608 75349284 72646421 71324414 70498721 68880399 65387027
18163F5387027n194024o279263p259161p308253n954484m753714m046634l243330
$$ 65387027 60193003 53913740 46654579 39346326 33391842 28638128 24591494 21348164
18155B1348164k130260j074731m70727l05022k39351k07858l11922m83876l43984
$$ 21348164 19217904 18143173 17672446 17367424 17128073 16920215 16608293 16124417 15780433
18146A5780433p4446J98593N14383Q51989J179143J475335J727885J788836J675387
$$ 15780433 15705987 15904580 16418963 17270952 18450095 19925430 21653315 23442151 25117538
18137B5117538J503562J512653J980416K598794L031654K907808K324391J891160
$$ 25117538 26621100 28133753 30114169 32712963 35744617 38652425 40976816 42867976
18129D2867976J537818J594467K475078L348938L563053K890926K210205K337828
$$ 42867976 44405794 46000261 48475339 51824277 55387330 58278256 60488461 62826289
18121F2826289K543663K117961J117000p1525k168965l717685l626873k674524
$$ 62826289 65369952 67487913 68604913 68533388 66364423 62646738 59019865 56345341
18113E6345341r21042K91397j06030M4625J659499M113763P320054Q154733J429437
$$ 56345341 55424299 55715696 55609666 55654291 57313790 61427553 68747607 76902340 78331777
18104G8331777l758551p498836j4030347j6341938j2654927q002113m711417k866161
$$ 78331777 74573226 67074390 53044043 36702105 24047178 16045065 11333648 8467487
18096H467487j795375j163983q33272n98735m07084l37079k46024k72954k63333
$$ 8467487 6672112 5508129 4674857 4076122 3669038 3331959 3085935 2812981 2549648
18087B549648j44644j21745j77128j85305j24849j14695q7621j75192j03611o2139
$$ 2549648 2405004 2283259 2106131 1920826 1795977 1681282 1593661 1418469 1314858 1252719
18077A252719K6556k8473J0180n8787n7259k140o0654r1032J5706o7796l9280
$$ 1252719 1279275 1250802 1260982 1202195 1144936 1142796 1082142 991110 1006816 939020 899740
18066H99740J854j3708l7677L825R154l4707n92q4559j05435k8991L6561J0206
$$ 899740 901594 887886 850209 854034 863188 828481 827889 743330 637895 608904 645465 655671
18054F55671m9232J2185r03m731O084n7394J7048J6222M102m8476l5250Q843M4249
$$ 655671 606439 618624 617721 612990 619074 561680 578728 594950 599052 550576 515326 524169 568418
18041E68418l6646k8978k5193m5622o9979K2082N52P057N8191k3631k6888K2725
$$ 568418 531772 502794 477601 431979 362000 384082 384634 391691 449882 426251 399363 422088
18029D22088P851l5832p1629p044N3962J08547J9591J978o0277q5596p231j078
$$ 422088 429939 394107 322478 315434 369396 477943 497534 499512 439235 353639 346408 345330
18017C45330j6150K1576j3399l3009Q271o256j6169l1084J8582K3119P7081L3950
$$ 345330 329180 350756 337357 304348 312619 306363 290194 259110 277692 300811 377892 411842
18005D11842k6838p533k0210J2420m2147k9567K9367L7583Q1951j5508n2400K0642
$$ 411842 385004 377471 357261 369681 327534 297967 327334 364917 446868 431360 378960 399602
17993C99602p9958l9442j5281Q9802M9292n1722m2817N140n4741k2396N5368P7307
$$ 399602 319644 280202 264921 354723 404015 352293 309476 314616 259875 237479 292847 370154
17981C70154J009l4865J738n1926L7699J6278o047K2461o3106n5293Q605N182
$$ 370154 371163 336298 338036 286110 323809 340087 334040 356501 293395 238102 246707 251889
17969B51889k6804M1464K0739M639M1364J6427o3055l1919P5831M3549K9176J6710
$$ 251889 225085 266549 287288 291927 333291 349718 286663 254744 330575 374124 403300 420010
17957D20010k6847o9369o1520K2160Q5923O9685n0063r0030n6217q790M3963J7760
$$ 420010 393163 323794 262274 284434 370357 440042 389979 299949 243732 234942 278905 296665
17945B96665n4653J7431L2796j3325k9604O098N8629P0399p088m3840p327N367
$$ 296665 242012 259443 292239 278914 249310 255408 314037 384436 377348 333508 326181 331548
17933C31548p8602J5209P7855M2658P103k2968n7966K22N4733M0410m6485o3028
$$ 331548 252946 268155 346010 388668 395771 372803 314837 315059 369792 410202 363717 300689
17921C00689l1647k1283K2382n610k585O0666m5596k455J4611m4817O3902K7845
$$ 300689 269042 247759 270141 264531 261946 322612 277016 274561 289172 244355 308257 336102
17909C36102l2260J6110O5424o1434l7357J6290o073J1525n560J326L068k5790
$$ 336102 303842 319952 385376 323942 286585 302875 296802 308327 302767 304093 307161 281371
17897B81371n764K2328L0254l3683P1324N6071p9919l4109M315N2415M0707J8999
$$ 281371 275607 297935 328189 294506 365830 421901 341982 307873 312188 364603 405310 424309
17885D24309m9259r6832j4574N1323Q7080l2496q664L1606M0490n4595n5037O0455
$$ 424309 375050 278218 263644 314967 402047 369551 360887 392493 432983 378388 323351 383806
17873C83806M9210n9012m4684k8671K5229M5028L3952n2161m6025n487K6422N0911
$$ 383806 433016 374004 329320 300649 325878 370906 404858 352697 306672 301185 327607 378518
17861C78518K4508L168k2679L938j3805k5295l9476k7111m600M2072K19O768k784
$$ 378518 403026 406194 383515 387453 373648 348353 308877 281766 277166 319238 319457 326225 323441
17848C23441M9858M9023m0200o6099P1420O4863N1203K8345l4252O2242Q1450
$$ 323441 373299 422322 382122 316023 387443 452306 503509 531854 497602 559844 641294
17837F41294l8581o7157R4544L4061n5243j00508l9577J8300O24j5745O5650n222
$$ 641294 602713 535556 630100 664161 608918 508410 468833 487133 487757 472012 537662 532440
17825E32440m8377L8317J2413n4868J7928J4721j3689J2632L2394L8708k7057
$$ 532440 484063 522380 534793 479925 497853 512574 498885 511517 543911 582619 555562
17814E55562l3237K4869o178M9414O9512m0035Q391J38825N5017l8087r1256m8569
$$ 555562 522325 547194 541016 590430 659942 619907 628298 767123 822140 784053 692797 644228
17802F44228k4207k7776M3379j1969k1241L9594J0890N9631O4891L0796M9946
$$ 644228 620021 592245 635624 623655 602414 642008 652898 712529 777420 808216 858162
17791H58162L9057K353n953K1575K7953M4403J09042Q8423R9232N4280L2936Q4400
$$ 858162 897219 899572 893619 915194 943147 987550 1096592 1185015 1284247 1338527 1371463 1455863
17779A455863J45845R0146J91026J11149J82590J59707J93145J95473J55040J61407
$$ 1455863 1601708 1691854 1882880 1994029 2176619 2336326 2529471 2724944 2879984 3041391
17769C041391J88199K51356K48032K41500K53892L05068K51213K92857L57821
$$ 3041391 3229590 3480946 3728978 3970478 4224370 4529438 4780651 5073508 5431329
17760E431329L90350L22930M03744M97169P16806Q32304R32135J037864J064921
$$ 5431329 5821679 6144609 6548353 7045522 7762328 8594632 9526767 10564631 11629552
17751A1629552J064740J094783J436330J863058K285201K480834K063771J270739
$$ 11629552 12694292 13789075 15225405 17088463 19373664 21854498 23918269 25189008
17743B5189008P27446M78637P38254J487086J757660R43637m53797j588907k386537
$$ 25189008 25916454 26395091 27133345 28620431 30378091 31321728 30867931 29279024 26892487
17734B6892487k628180j877889j120373j186397j452673j765721k386804k429923
$$ 26892487 24264307 22386418 21266045 20079648 18626975 16861254 14474450 12044527
17726A2044527j809627j025654l96997n8713Q9318K51518L44325L40218N19712
$$ 12044527 10234900 9209246 8812249 8753536 8842854 9094372 9438697 9778915 10298627
17717A0298627O90574P13664O84503P02079Q67881J011887J148618J320716J419684
$$ 10298627 10989201 11702865 12387368 13089447 13957328 14969215 16117833 17438549 18858233
17708A8858233J549903J710583J821941J926918K481556L167402L775850L984444
$$ 18858233 20408136 22118719 23940660 25867578 28349134 31516536 35292386 39276830
17700C9276830L805069L734582L524910L236345L694429M411513M510791L874771
$$ 39276830 43081899 46816481 50341391 53577736 57272165 61683678 66194469 70069240
17692G0069240K778398J324812J59613n51110j422084j980900j053701Q3502M63200
$$ 70069240 72847638 74172450 74332063 73780953 72358869 70377969 69324268 69407770 69870970
17683F9870970P46922Q20108R21382J447409K478844M448856O472134O746606
$$ 69870970 70617892 71438000 72359382 73806791 76285635 80734491 87206625 93953231
17675I3953231M503739P46129k505202m330799m027316j642692K50794n27149
$$ 93953231 98456970 99203099 96697897 92367098 88339782 86697090 86947884 86420735
17667H6420735k536975m717920o791926p605102o577346n070001l984977l641218
$$ 86420735 83883760 79165840 72373914 64768812 58191466 53121465 49136488 45495270
17659D5495270l728154l528361k583764j262872J28093R84888J127232P02588
$$ 45495270 41767116 38238755 35654991 34392119 34520212 35505100 36632332 37334920
17651C7334920j64654q92850j103734p25350J47862J158203J287417P09899K61239
$$ 37334920 37170266 36277416 35173682 34448332 34596194 35754397 37041814 37751713 38012952
17642C8012952k51536n48888j4597Q88380J292621J271901J382860J413505J327694
$$ 38012952 37761416 37212528 37197931 38086311 39378932 40650833 42033693 43447198 44774892
17633D4774892J289370J214036J340588J769732K396887L275274L581087K859441
$$ 44774892 46064262 47278298 48618886 50388618 52785505 56060779 59641866 62501307
17625F2501307J705487J011783J217300K329090L648105L245606R26816j692512
$$ 62501307 64206794 65218577 66435877 68764967 72413072 75658678 76585494 74892982
17617G4892982m286249o037286n900525m937256m621969m910414n602719o461702
$$ 74892982 70606733 64569447 58668922 53731666 49109697 44199283 38596564 32134862
17609C2134862o648809n596007m005131k660192j857755j465863j222484r89585
$$ 32134862 25486053 19890046 15884915 13224723 11366968 9901105 8678621 7689036
17601G689036q24306n23574k41100o0342o3357j10560k35073m75270p07870q18073
$$ 7689036 6864730 6341156 6100056 6039714 5976357 5865797 5630724 5155454 4447584 3629511
17591C629511o48008n22802l74298k54401j22542j60381j99043j64956j26049
$$ 3629511 2981503 2458701 2084403 1830002 1707460 1547079 1348036 1183080 1057031
17582A057031J4845K518L1131m1436p2255r8279j6959k1407o3917n2695K2403
$$ 1057031 1071876 1074394 1105525 1064089 991834 893555 876596 855189 791272 738577 760980
17571G60980o669l4337k9750j3644j9768k3516p026m9890o0679p2480m5885L6740
$$ 760980 754311 719974 690224 676580 656812 633296 626270 576380 515701 443221 397336 434076
17559D34076q626l261l6164J7797l2405l7964L0263j0922r2235o0681k7969J9959
$$ 434076 425450 422189 386025 403822 371417 333453 363716 352794 260559 199878 171909 191868
17547A91868M4650n739j0406L1852p307l9229q3974m5800l1280K0030L0793J2057
$$ 191868 236518 230779 220373 252225 244918 205689 121715 75915 44635 64665 95458 107515
17535A07515P4736m1914k8100K7621r122J642j2231m7474l8160m3797N8135L3726
$$ 107515 182251 140337 112237 139858 130736 132378 120147 72673 34513 -9284 48851 82577
17523H2577j5169l892L4278K6799o100o3652k8591M5611r430M3204k8018P762
$$ 82577 67408 63516 97794 124593 118493 54841 26250 71861 62431 105635 77617 85379
17511H5379L2759J2749L5265k7446n3043o9271K1015M6986J7527k0070n8919l4283
$$ 85379 118138 130887 166152 138706 85663 16392 37407 84393 101920 81850 22931 -11352
17499a1352K2198L9323K5173L6341m3753l1123o2764O7981J0230o2359l65j0340
$$ -11352 10846 50169 75342 111683 67930 36807 -25957 42024 52254 -10105 -10470 -20810
17487b0810K3514P5403O6551m8707q3645o2012k611M7249P1060N0743l9189n8667
$$ -20810 2704 78107 144658 95951 12306 -49706 -52317 -5068 65992 116735 77546 18879
17475A8879M7946M1579o051M211N0377m6505l9240P1153j6799l6070o834m1964
$$ 18879 66825 108404 102353 106564 156941 110436 71196 142349 125550 89480 82646 40682
17463D0682M5257R996K6975J5654K8715k2748l1070k3717p818j4187J3968J8589
$$ 40682 85939 95935 122910 138564 167279 144531 113461 89744 81926 67739 81707 100296
17451A00296j5050k9232N0322K0747O5414J17843N3593k2542r8916j7771P5661
$$ 100296 85246 56014 106336 127083 192497 310340 363933 341391 242475 224704 300365
17440C00365O2115P5542k2813p5133o5543j26434n3020K4258j5214m0296M273
$$ 300365 362480 438022 415209 340076 274533 148099 95079 119337 104123 63827 68100
17429F8100O2924j9397j8588n426m9323Q291P625o2342n686M1733O5724m5487
$$ 68100 131024 111627 93039 87613 38290 46581 54206 -8136 -13822 27911 93635 48148
17417D8148l1342L4266l4422N712k8288j1576N5762J8510N642J4074K6075k4782
$$ 48148 16806 51072 16650 22362 -5926 -17502 38260 56770 62412 76486 102561 77779
17405G7779L100o3850p2788K7492m2675L5869m6938k0812K8904J13298j4921k8448
$$ 77779 80879 17029 -55759 -28267 -70942 -35073 -82011 -102823 -73919 39379 24458 -3990
17393c990J7578J8200M1395L2239J2314p0775k6700J2195n3825m941M961J4914
$$ -3990 13588 31788 73183 105422 117736 46961 20261 32456 -21369 -26310 -21349 -6435
17381f435L5643M9860J1167k9918K4400K9958l315o9817l5354M008k1613m6332
$$ -6435 29208 79068 90235 60317 84717 114675 111360 41543 6189 10197 -11416 -57748
17369e7748k0171R228M4645Q443K8253K3046M4760J78r455M0656K7127m6233k0953
$$ -57748 -77919 -68691 -24046 -15603 12650 35696 80456 80634 71179 111835 138962 92729 71776
17356G1776J4268L8089R1354P580p8985o7230q9579m0190k6156j1007N9959J958
$$ 71776 86044 124133 215487 223067 144082 76852 -12727 -52917 -79073 -90080 -30121 -28163
17344b8163P7880J26677J6904j42164r5247M1729M5636M999J0199k7043k2907
$$ -28163 49717 176394 193298 51134 -44113 -2384 43252 48251 58450 31407 8500
17333H500k2718o2351J5653M268K2415M2630K1735m9885P65M0943M7658j6355
$$ 8500 -14218 -76569 -60916 -56648 -34233 8397 30132 -19753 -18988 21955 69613 53258
17321E3258k0395K2911K9294l5143q3725J6054L9735L5595L6884m0439o294J0576
$$ 53258 32863 55774 85068 49925 -33800 -17746 21989 57584 94468 54029 47735 58311
17309E8311J9278N8056k8232q354j4497p6155m6132r99K7831K5455J6073J5523
$$ 58311 77589 135645 107413 99059 84562 8407 -37725 -38724 -10893 14562 30635 46158
17297D6158o0065J4725l5560l8715L6690k7515L8143M0928M0020J5464j5768k5402
$$ 46158 -13907 818 -34742 -73457 -36767 -64282 -26139 14789 54809 70273 54505 29103
17285B9103K243M8222j469k3845p9246k1495L2400L4234L1943n6418p4628L0771
$$ 29103 31346 79568 78099 54254 -24992 -46487 -14087 20147 52090 -4328 -78956 -48185
17273d8185K3088L5938k3569l5963J8291J905J4610K4017O3205K3334j2401j085
$$ -48185 -25097 10841 -12728 -48691 -30400 -28495 -13885 10132 73337 96671 84270 83185
17261H3185k3385O118M2134j3716m5302p289K8567P493J3833n8755n7285L8300
$$ 83185 59800 65918 108052 94336 49034 41745 70312 77805 91638 32883 -24402 13898
17249A3898J1642K4966j2672l7782L7857P4490K8737n2217l8697j6643K1019j4654
$$ 13898 25540 50506 37834 52 37909 112399 141136 88919 50222 33579 54598 39944
17237C9944K7931N0238j2760J5280K2265L4485k1612r2666L0009J5442n221J0431
$$ 39944 67875 118113 105353 120633 142898 177383 155771 63105 93114 108556 103335 113766
17225A13766O0674k9605j11467n1766M4836R171O2415K2981j4181p2420p399L5817
$$ 113766 174440 144835 33368 -18398 26438 35609 98024 121005 106824 34404 27005 62822
17213F2822p2724k9948p855P412J9826P0285l664J7646k4703J335K0384R956r36
$$ 62822 -9902 -39850 -47705 -40293 -20467 49818 46154 63800 39097 40432 60816 70772 69836
17200F9836j0021N830l593N8757k5146m5615P7036K6419q735J7300M6983O841
$$ 69836 59815 65645 62052 120809 95663 50048 127084 153503 144768 162068 209051 215892
17188B15892K1841R1267Q0695Q9817L9201n5166l1409N0306L0986n4083n279K8328
$$ 215892 237733 329000 409695 499512 538713 483547 452138 502444 533430 479347 474068 502396
17176E02396K6036K081n5158L3306m646o5693n5454O983p686n780J1645k0965
$$ 502396 528432 530513 475355 508661 504015 438322 382868 389851 382165 376385 388030 367065
17164C67065l1966p1564P299J7286j6753P1812k7420j3813K5213n5097q8345M1982
$$ 367065 335099 263535 270834 288120 271367 343179 315759 301946 327159 272062 183717 225699
17152B25699P3394m1526o9998l5677J3938j4016q4573O727R6383N8573K4886l0422
$$ 225699 299093 257567 187569 151892 165830 151814 67241 73968 170351 228924 253810 223388
17140B23388J1022K7936K9994k561q9188L859L9313K9062k0070J4878j1266j4953
$$ 223388 234410 262346 292340 289779 200591 204450 243763 272825 252755 267633 256367 241414
17128B41414O8729Q1769l7642m3477N9309O7754l2262l1010l1108L8675k8489
$$ 241414 310143 391912 354270 310793 370102 437856 405594 374584 343476 382151 353662
17117C53662o8105o6501N6772K4563j2400l2619P4198n7913j1569k1282m1709
$$ 353662 285557 219056 275828 300391 287991 255372 329570 271657 260088 238806 197097
17106A97097j1481R0459K4343l1252o1056k3230j8476J0885K2177j8494L8206
$$ 197097 185616 276075 300418 269166 208110 184880 166404 177289 199466 180972 219178
17095B19178J7935r4261j7821j5716q4924k3568k6047q5458K9123J6146q1940
$$ 219178 237113 142852 125031 109315 24391 823 -25224 -110682 -81559 -65413 -147353
17084a47353l3750K4873M3323Q5186L7898K1716n3033L5884j58n9737N1825K6085
$$ -147353 -181103 -156230 -112907 -27721 10177 31893 -21140 14744 14586 -45151 6674 32759
17072C2759M4397k6228m9847j3852N7111N1591k8925p1381j0677j0848o414m0269
$$ 32759 77156 50928 1081 -12771 44340 95931 67006 -4375 -15052 -25900 -32314 -72583
17060g2583M6688K0918J1640K4644k3391N6817k2962r4910l9174M857L2816O4820
$$ -72583 -25895 -4977 6663 31307 7916 64733 41771 -53139 -92313 -87456 -54640 10180
17048A0180l153L0398K4826l7702m5724J7414M4170J7577k3439o2845n7729L1545
$$ 10180 7027 37425 62251 24549 -21175 -3761 40409 57986 34547 -28298 -86027 -54482
17036e4482Q3829L8090n7814l8323n1292K8553p989L2793M4934K0655j6726j4539
$$ -54482 29347 67437 9623 -28700 -79992 -51439 -59428 -26635 18299 38954 22228 7689
17024G689Q4025j0526n8010n7832N0235M7741o8096Q100K6209k2415L254p259
$$ 7689 91714 81188 23178 -34654 15581 63322 -4774 3326 29535 7120 10374 3115
17012C115l2189j7028J5920L3360O2671K9j08430l9597O1537L6656r1540j825
$$ 3115 -29074 -46102 -30182 3178 65849 65878 -42552 -82149 -20612 16044 -75496 -77321
17000g7321M6906o1538r252J1540O8630K3587n877J5530L130n2416o363L3948
$$ -77321 -30415 -91953 -101205 -89665 -21035 2552 -3325 12205 15335 -37081 -43444 -9496
16988i496M1240J6615q228q5795q2279m5918l2021M1200J14443J06439L1898m1935
$$ -9496 31744 48359 40131 -45664 -127943 -173861 -205882 -164682 -50239 56200 88098 46163
16976D6163n9693K2245p8983K8030R7955P665p5784N85P779l3555j8726N0041
$$ 46163 -13530 8715 -70268 -42238 55717 63382 -12402 -11817 -4038 -37593 -56319 -6278
16964f278L2530K7629N3810k4311o5332n4304n6856Q695K2298J0500l6340j5769
$$ -6278 26252 53881 107691 83380 18048 -36256 -93112 -84417 -62119 -51619 -87959 -103728
16952a03728m924M4227L1695m6092n8480k7259Q5361J9711L4384M0445n6835j4282
$$ -103728 -108652 -64425 -32730 -78822 -137302 -164561 -79200 -59489 -25105 15340 -41495 -55777
16940e5777L275p079N5043k5506K816J4437m3131k1500k3706N0457N1414p3499
$$ -55777 -52502 -59581 -4538 -30044 -27228 -12791 -55922 -77422 -101128 -50671 743 -72756
16928g2756k7052m1491L2478K1419l3107k943m7773l8994L1031L7575J7784L5277
$$ -72756 -99808 -141299 -108821 -87402 -120509 -123452 -171225 -210219 -179188 -141613 -123829 -88552
16916h8552k6569q781k5961K4348l7739l3953L4761M9978q6562k0216J39364Q9198
$$ -88552 -115121 -123902 -149863 -125515 -163254 -197207 -162446 -112468 -199030 -219246 -79882 9316
16904I316m1981p4955p834M7112K1750m5129J2518l52l0230k7191M0995j3192
$$ 9316 -32665 -107620 -115454 -68342 -46592 -91721 -79203 -79555 -109785 -136976 -95981 -109173
16892a09173k2650K7178Q4203O2671l9090j04046o8494L1033L7867M01N6965N5851
$$ -109173 -131823 -104645 -20442 42229 3139 -100907 -169401 -138368 -100501 -100100 -43135 12716
16880A2716j723m635m7283O423j5007l6419L458j4860K5959n0266q096J29307
$$ 12716 10993 6358 -40925 -34502 -49509 -85928 -82470 -97330 -71371 -121637 -129733 -426
16868d26P4291q2419o7687p3254k322Q3124R245K72J5875J2674J3253k425M1481
$$ -426 73865 -8554 -76241 -149495 -151817 -68693 -59448 -59176 -43301 -30627 -17374 -19799 21682
16855B1682M4811K6059o9754l1482l050K6227L6088k9409N158J7276q478K3018
$$ 21682 66493 92552 22798 -8684 -11734 14493 50581 21172 26330 43606 35128 58146
16843E8146k8470j6331k98L9941K6662l3180j3874j8403m2380m798k1389K5794
$$ 58146 29676 13345 13047 52988 79650 46470 32596 14193 -28187 -32985 -54374 -28580
16831b8580P5919q811j03954p7133M2871J04748K0937j41k1936o8256n9897K328
$$ -28580 47339 38528 -65426 -142559 -99688 5060 25997 25856 3920 -64336 -124233 -121905
16819a21905M8080M6656L6303L2327M4509l0424M2616N2221l7966o7915l3986
$$ -121905 -73825 -27169 9134 41461 85970 55546 98162 150383 112417 44502 10516
16808A0516K887J0099M2571K5340N5602q8577o4370J0817n0844o131N6524K1022
$$ 10516 13403 23502 66073 91413 147015 58438 -5932 4885 -45959 -52090 4434 25456
16796B5456k4759K8660K8947M9415k6663k4182j7971m927l4153L6539N42j8570
$$ 25456 697 29357 58304 107719 81056 56874 38903 33976 -177 36362 36904 18334
16784A8334j4858L2125M106r9610p2818K3604k1592j3777K461L6913L9944K6128
$$ 18334 3476 35601 39707 -59903 -132721 -109117 -130709 -144486 -142025 -105112 -65168 -39040
16772c9040j2404o3820j461Q6527O7789k7634l4976R077O1184J02254K3892j23420
$$ -39040 -51444 -115264 -116725 -30198 37591 9957 -25019 -15942 45242 147496 171388 47968
16760D7968k8069L8753K0176O9269n0635r626o1229p4191n7439K5174Q793Q2795
$$ 47968 19899 58652 78828 148097 97462 87836 26607 -47584 -105023 -79849 -71056 11739
16748A1739l2787k4059L866j954m5393j3078p16l109k1161N4958L2575K9233L0902
$$ 11739 -21048 -45107 -41241 -43195 -88588 -101666 -102382 -105491 -126652 -71694 -39119 -9886 21016
16735B1016J5099j3722p1939N540m574o4239j5383L384n6364Q418K307K0124l1919
$$ 21016 36115 22393 -49546 -44006 -48580 -112819 -128202 -124818 -181182 -172764 -170457 -150333 -182252
16722a82252K7331J32923K5742M1785N7068k5825k1908k052j1578l0955n76J3425
$$ -182252 -154921 -21998 3744 45529 102597 76772 54864 52812 41234 10279 9703 23128
16710B3128J7198J27l1971l056l8605l1224j8950n0956j9528q8849O1816K0381
$$ 23128 40326 40453 8482 5426 -33179 -64403 -83353 -134309 -153837 -242686 -180870 -160489
16698a60489O1838k2835q4301m1576P3376j474l86L4625R978L8292P0828j7093
$$ -160489 -98651 -121486 -205787 -247363 -173987 -175461 -175847 -141222 -131244 -92952 -22124 -39217
16686c9217j8862K0639N9389N1159l321l6802n4632j2983j3230O6883r831q7652
$$ -39217 -58079 -37440 21949 73108 69787 32985 -21647 -34630 -47860 19023 9192 -78460
16674g8460J4190P976n5516l984l6110K0029k5984q01J8605P3875R1060O8939
$$ -78460 -64270 -56294 -111810 -115794 -151904 -131875 -157859 -158660 -140055 -66180 24880 93819
16662I3819m7628m2488k647Q9128k3403q1660l7032j0856J8029p84j5067R5653
$$ 93819 46191 3703 1056 90184 66781 -14879 -51911 -62767 -44738 -45522 -60589 35064
16650C5064K4452j35975p0003K7265N0727N6258j3113k3845j781p654o7877M8229
$$ 35064 59516 -76459 -146462 -119197 -68470 -12212 -25325 -49170 -50951 -58605 -126482 -78253
16638g8253J7655M3460L5188N0669r418j31142n3274P5859O8239K9994j4438m990
$$ -78253 -60598 -17138 18050 68719 59301 -71841 -125115 -49256 18983 48977 34539 29549
16626B9549K019m9557L2506m2450N90j0587m648J6751q969l2350N969M4750J8859
$$ 29549 31568 -17989 14517 -27933 -27343 -37930 -42578 -25827 -34796 -67146 -61177 -16427 2432
16613B432P071n8505j0785R079o2438L3420O3768l6679j6032J8674k6042k8897
$$ 2432 9503 -49002 -59787 -50708 -113146 -79726 -15958 -52637 -68669 -49995 -76037 -104934
16601a04934J2799L8169l7265K7708J4653R4011P578j2367j00850j7302m8093
$$ -104934 -92135 -53966 -91231 -63523 -48870 45141 52719 40352 -60498 -77800 -125893
16590a25893n5675o793P0837P0266o5793L3609j4710o254J9353l9540k3013Q058
$$ -125893 -181568 -188361 -117524 -47258 -113051 -79442 -94152 -100406 -81053 -120593 -143606 -135548
16578a35548n8520K8204O0349K5891K0827M5788l2121o7929O937j6713N8432J8263
$$ -135548 -194068 -165864 -105515 -79624 -58797 -13009 -45130 -113059 -106122 -122835 -64403 -46140
16566d6140j6444j8843n88m9774m6060O1497J6670M4635r679J3308M4748o0682
$$ -46140 -62584 -81427 -82015 -131789 -177849 -116352 -99682 -55047 -64726 -51418 -6670 -67352
16554f7352K7699k6473O067K000K9962q059l1379j6569Q6k9655q3217P5382M3543
$$ -67352 -39653 -66126 -60059 -58059 -28097 -36156 -67535 -84104 -84018 -113673 -196890 -121508 -77965
16541g7965K8531J8102k1167k5206K7J1972J4938M5576o6880o5085J2671K4367
$$ -77965 -49434 -31332 -52499 -77705 -77678 -65706 -50768 -5192 -72072 -137157 -124486 -100119
16529a00119Q4123N9022j5995L829l3308O5580Q3260k9777j9982k181o2511j20968
$$ -100119 -15996 43026 27031 30860 -2448 63132 146392 116615 96633 94452 31941 -89027
16517h9027m3725N677J7050j2791O3707M8336K236q632l7221J6776k4O011k7897
$$ -89027 -132752 -127075 -110025 -122816 -59109 -10773 -8537 -17169 -54390 -37614 -37638 -31627 -59524
16504e9524l8536o3523P4956N7492L9616k1199j554p641j1573L883j1453j4875
$$ -59524 -98060 -161583 -86627 -29135 10481 -10718 -12272 -19913 -31486 -27603 -39056 -53931
16492e3931j4765L490J7858m8242N2960Q431j5878N2552K2742p1991n4671R838
$$ -53931 -68696 -65206 -47348 -95590 -42630 -34199 -50077 2475 25217 -46774 -101445 -91607
16480i1607L3650K0855M490k8594o1738k0542P6976K2063j1956P0813J2885j15745
$$ -91607 -57957 -37102 -32612 -61206 -122944 -143486 -66510 -44447 -56403 14410 27295 -88450
16468h8450k6414r081M6980R0670P8728k2455m1694K1897J2739m3779q345m137
$$ -88450 -114864 -123945 -76965 13705 92433 69978 28284 50181 62920 19141 10796 6659
16456F659k3239j08M2748M8243N472j8825p6434J5359j2466K8920K9950r853k2835
$$ 6659 -16580 -16688 26060 74303 79775 60950 -15484 -125 -12591 16329 46279 36426 13591
16443A3591K5070J695o7155p6963K9820R4128Q542j9671m4644m1939K456k267
$$ 13591 38661 40356 -26799 -103762 -73942 20186 28728 9057 -35587 -77526 -75070 -77337
16431g7337n9478K7783J12435L9425L2338k0316o0954K8347M3137n5122q5988
$$ -77337 -136815 -109032 3403 42828 75166 54850 -6104 22243 65380 10258 -75730
16420g5730O09N1232M177K7709n239Q6081N3430j4925m3856o4475m6512j4121
$$ -75730 -75121 -23889 -19712 7997 2758 88839 142269 127344 83488 19013 -27499 -41620
16408d1620J0077J2795O4835q816k6615l5210p1872J2130N7977N1784J6458n100
$$ -41620 -31543 -18748 46087 37271 10656 -24554 -96426 -84296 -26319 25465 41923 36823
16396C6823n3345l5580P787P6694O9928p0925o1966j7861M786L73m6268j9688
$$ 36823 -16522 -52102 -44315 32379 102307 31382 -30584 -48445 -43659 -43286 -89554 -109242
16384a09242M6390q840k6006L4459l173L7093P813M0054L6579j4533o2377q082
$$ -109242 -62852 -71692 -97698 -63239 -66412 -29319 -21506 18548 55127 40594 -21783 -29865
16372b9865Q2087m1541P849L8552N636l5425j0904J4586K9551K6968n1942j10902
$$ -29865 52222 10681 18530 57082 62718 27293 16389 30975 60526 87494 35552 -75350
16360g5350L6020N1715l8929m7477j5574L7751J6448K1154o865L9670J3743q8723
$$ -75350 -39330 12385 -26544 -74021 -89595 -51844 -35396 -14242 -21107 18563 32306 -56417
16348e6417j1899k563J9913J12742N0237j0181p7433q5806n102K1105j301J025
$$ -56417 -68316 -70879 -50966 61776 112013 101832 24399 -61407 -66509 -45404 -46705 -45680
16336d5680p309M7183M7075O551R020J5756P0743l5089m5306p3396k7448K8240
$$ -45680 -52989 -5806 41269 47820 56840 72596 143339 108250 62944 -10452 -37900 -9660
16324i660N2120r448q7263j7941R275P9779k6310M12p2887j9256J574k2937L8414
$$ -9660 42460 33012 -54251 -72192 -62917 16862 -9448 -9036 -81923 -101179 -99605 -122542 -84128
16311h4128N292K0085K1607J6980o807O7109O5466j3207l3477l4360J468p8060
$$ -84128 -78836 -58751 -37144 -20164 -26971 40138 105604 92397 58920 24560 26028 -52032
16299e2032q9111l5493L3773Q765n394p80N7592K8876L3173n3196l7117k0362
$$ -52032 -141143 -176636 -142863 -134098 -139492 -140272 -82680 -53804 -20631 -73827 -110944 -131306
16287a31306r152k0901l939L3834J0590k971j4710O2642L7741n6328K1873N9694
$$ -131306 -140458 -161359 -165298 -131464 -120874 -123845 -138555 -75913 -38172 -94500 -72627 -12933
16275a2933l051R659n447j1932N6801N2594p0040r6647j7599O9780P3967Q1365
$$ -12933 -15984 -6325 -11772 -23704 33097 85691 15651 -80996 -98595 -28815 45152 126517
16263A26517M6412l4710k9662q1170k4758K9636j7815k6576n8443m6660N4262
$$ 126517 172929 138219 108557 27387 2629 32265 14450 -12126 -70569 -117229 -62967
16252f2967J0963M420L1529M4487o5146P896k4238K7982O7605n147J2279P270
$$ -62967 -52004 -47584 -16055 28432 -36714 -28818 -53056 -25074 42531 37384 49663 56933
16240E6933m8279m5922k1064L8701M6301K0293l3911j6162n6294r8383j4560J3976
$$ 56933 8654 -37268 -58332 -19631 26670 46963 13052 -3110 -59404 -157787 -172347 -158371
16228a58371k1754O6746J7858m4970N3019Q6181P125o3837m6567j512O2430K6542
$$ -158371 -180125 -113379 -95521 -140491 -87472 -1291 5834 -58003 -104570 -106082 -43652 -17110
16216a7110r6n185j8254k8722k7295K6758l7282N2317Q5678m371M1824K3212k3039
$$ -17110 -17206 -22391 -40645 -69367 -96662 -69904 -107186 -54869 30809 26438 68262 91474 68435
16203F8435k1842j15422k4954R1313O3185m0668j570N572N6416M2258l5339m778
$$ 68435 46593 -68829 -93783 -2470 60715 20047 18477 24049 80465 122723 87384 82606
16191H2606K5557J0359K441l5237q3786o2566k4857L692p8708K9007J04384K7821
$$ 82606 108163 118522 120963 85726 1940 -60626 -85483 -81791 -160499 -131492 -27108 713
16179G13r548k8174R625J1972M7941k0378l1690P7411j8925l90k8766l6890k6814
$$ 713 -8835 -37009 -27384 -15412 32529 12151 -19539 57872 38947 38557 9791 -27099 -53913
16166e3913j4017N2361P716k2265j2822L9747L4288k4868k8885m7330m0373J3057
$$ -53913 -67930 -15569 -7853 -30118 -42940 -3193 31095 6227 -22658 -69988 -110361 -97304
16154i7304L8901J08263P4513l2018l1355p5792o050J9018Q179P072o9j6023j6392
$$ -97304 -58403 49860 124373 92355 61000 -14792 -20842 -1824 6355 13427 13358 -2665 -19057
16141a9057J6780M3258P9150p4191j23720m40n3015J7995j0421n43K9924Q2829
$$ -19057 -2277 40981 120131 45940 -77780 -78220 -131235 -113240 -123661 -124204 -94280 -11451
16129a1451N3538n3144Q646K0731k9639P0449O1790j8975r8336m4589O830n7811
$$ -11451 42087 -11057 -2411 18320 -11319 59130 120920 101945 3609 -40980 -34150 -91961
16117i1961P100N5470L3091L0185M1265n5152n5162p328j1894r054R909O6593
$$ -91961 -84861 -29391 3700 33885 75150 19998 -35164 -42492 -54386 -63440 -53531 13062
16105A3062N5304p1536n7493p6426l0817Q8963l735j6622N6235L0004N880k8808
$$ 13062 68366 -3170 -60663 -137089 -167906 -78943 -82678 -99300 -43065 -13061 -7181 -35989
16093c5989l0563m7361o126m635m5902j3975P0249J06076k6917m4350P183m5225
$$ -35989 -66552 -113913 -120039 -124674 -170576 -184551 -114302 -8226 -35143 -79493 -72310 -117535
16081a17535m2165Q7874O5792q849L5628K555k6764k1297j4453Q081K2317o2154
$$ -117535 -159700 -71826 -6034 -14883 20745 23300 -3464 -24761 -39214 -31133 -8816 -70970
16069g0970l2937P7445K0108o7398O337Q6882J1220k9490J1177m5893k8282l6541
$$ -70970 -103907 -26462 -6354 -73752 -67415 19467 30687 1197 12374 -33519 -61801 -98342
16057i8342K7015N390j5997K8921K0971K032p891j5986P671n659p8482n3188J06823
$$ -98342 -71327 -65937 -81934 -53013 -32042 -30010 -37901 -53887 -46216 -51875 -130357 -183545 -76722
16044g6722O9011l3407K4319j4915l9947m147M7739M469L2465L6801L3893o055
$$ -76722 -7711 -41118 -16799 -31714 -71661 -75808 -28069 -23600 8865 45666 79559 73504
16032G3504l2153k8308k0976K727O691k4546k0668O9672J16664j5590p9833l4432
$$ 73504 41351 13043 -7933 -5206 1485 -23061 -43729 25943 142607 127017 47184 12752
16020A2752j1940K1485J0478n6035m1266j28817n7286J5327J07042J51481n3837
$$ 12752 812 22297 32775 -23260 -64526 -193343 -250629 -235302 -128260 23221 -30616
16009c0616l1336L9380K9978m9158J8581q004o240p3620L7628R4783Q1907k1530
$$ -30616 -61952 -22572 7406 -41752 -23171 -31175 -37415 -111035 -73407 21376 103283 81753
15997H1753p5798o6189j5671j7588K3627L9209L9503L107o9524m1024j0205K0914
$$ 81753 5955 -60234 -75905 -93493 -69866 -30657 8846 11953 -57571 -98595 -108800 -87886
15985h7886k2044L1028J0506L5349k5109J5712L690k3361M5307L2533k1407n0392
$$ -87886 -109930 -78902 -68396 -33047 -58156 -42444 -38754 -62115 -16808 15725 -5682 -56074
15973e6074l7666k8047l9584Q328N845L2972R1971k0724j3410k0200j6140m211
$$ -56074 -93740 -121787 -161371 -153043 -147198 -114226 -22255 -42979 -56389 -76589 -92729 -96940
15961i6940M526n8223j6054P5930L3532L0803m8476q129L1897J0993k9525M346
$$ -96940 -92414 -150637 -166691 -90761 -57229 -26426 -74902 -83031 -51134 -40141 -69666 -65320
15949f5320m1726r9938q1784O7398O2233l057K4866J6569l548J00776L3060l178
$$ -65320 -107046 -206984 -288768 -221370 -159137 -162194 -137328 -120759 -124307 -23531 9529 6351
15937F351k6059k4499K2081L0004J4514p5319O8268L9842l9355r784L6216k617
$$ 6351 -19708 -44207 -22126 7878 22392 -52927 15341 55183 15828 6044 42260 39643
15925C9643n8123l1668Q2067J9933m767n285p270j668o4722O0892K1067r4317
$$ 39643 -18480 -50148 31919 51852 47085 41800 34530 32862 -31860 29032 50099 -44218
15913d4218j7834j2116l7756M9609L6456q0751j6267K2605P1119L874m0029k5161
$$ -44218 -62052 -74168 -111924 -62315 -25859 -106610 -122877 -100272 -29153 -25279 -65308 -90469
15901i0469O4498N1217j4453R162o1300L895q0662L3146Q2423J6617k6482M6939
$$ -90469 -25971 25246 10793 19955 -41345 -37450 -118112 -84966 -2543 14074 -12408 34531
15889C4531q3639l3780j0322P3853P4955k96k6164k4262N546N4012M1503k4248
$$ 34531 -49108 -82888 -93210 -19357 55598 55302 29138 4876 10422 64434 105937 81689
15877H1689m758j5653k6514K234Q3187Q0033j7167n1075L147k4158q817o4897
$$ 81689 76931 61278 34764 36998 120185 200218 183051 131976 135123 110965 102148 37251
15865C7251n5355l3409m4450N0967M8370j5960k2266L3595P8926N3856J8533j03755
$$ 37251 -18104 -51513 -95963 -44996 3374 -12586 -34852 -1257 77669 131525 150058 46303
15853D6303j31032l6218L2310N6182O314K6787L2942L680K9374O5474K0624m8622
$$ 46303 -84729 -120947 -88637 -32455 -26141 646 33588 37268 66642 132116 152740 104118
15841A04118n2021K5566n3621M684m4286n2191r38q223j0747K7842j0542j9646
$$ 104118 52097 77663 24042 28726 -15560 -67751 -68689 -76912 -87659 -59817 -70359 -90005
15829i0005M313k852L9503m8295n0179N7102J2097J1136L2661P856L2895N2652
$$ -90005 -85692 -88544 -49041 -97336 -147515 -90413 -78316 -67180 -34519 -26663 6232 58884
15817E8884j1887p0200M4264m0353m9313k0511J2912N7131K481k925J0192k8125
$$ 58884 46997 -23203 21061 -19292 -68605 -89116 -76204 -19073 -16592 -19517 -9325 -37450
15805c7450l4737j7074N8709j5477j2298J2033l3736k9354Q2681Q9584P3529o7198
$$ -37450 -72187 -89261 -30552 -46029 -58327 -46294 -80030 -109384 -26703 62881 136410 69212
15793F9212p2506k4626k4125l567m3293J0966K4902r476O1859M390j281k2020
$$ 69212 -3294 -27920 -52045 -55612 -98905 -87939 -63037 -72513 -10654 -6264 -7545 -29565
15781b9565L5136M7779J1422q5786m4540R6642P0897m2242q4087o4335j4783N567
$$ -29565 5571 53350 64772 -21014 -65554 31088 101985 59743 -24344 -88679 -103462 -97895
15769i7895K3606P7578J7847J8123m957n9897n5280k4936P433J4620J9991N2496
$$ -97895 -74289 3289 21136 39259 34302 -25595 -80875 -105811 -98378 -83758 -63767 -11271
15757a1271k6137n3628m6518l1834K6743N213M3465Q4087j7033M674K6540L7853
$$ -11271 -37408 -91036 -137554 -169388 -142645 -137432 -93967 -9880 -26913 -22239 4301 42154
15745D2154K401k7495j14920o0734O8763P2185l8912p612Q5969K1765k1135p325
$$ 42154 44555 17060 -97860 -158594 -89831 -17646 -56558 -64170 21799 43564 22429 15104
15733A5104K9932k7495q1775k0231m992j8724r806N5010L4472K9389j070L8852
$$ 15104 45036 17541 -64234 -84465 -89457 -108181 -117987 -62977 -28505 884 -186 38666
15721C8666J4525J4696k9654l5552j8051J1078j0429j2014k1677q2284L489K6706
$$ 38666 53191 67887 38233 2681 -15370 -4292 -14721 -26735 -48412 -130696 -127207 -100501
15709a00501j3166j8596N3939K7877K6770j8772N911l2531j9044M5333M2806l3911
$$ -100501 -113667 -132263 -78324 -50447 -23677 -42449 -36538 -69069 -88113 -42780 26 -33885
15697c3885l241J843O953L796l1727R155j8428m3932m5326Q1274L0272l4627J2047
$$ -33885 -37126 -35283 -28330 -24534 -56261 -47106 -65534 -109466 -154792 -73518 -43246 -77873 -65826
15684f5826L6036j00693l7482Q5943O566r605J7865J3131l60J761L5404n0467
$$ -65826 -29790 -130483 -167965 -82022 -75456 -85061 -67196 -54065 -54425 -52664 -17260 -67727
15672f7727l4260P3002M734o6707j5100N9470O8207K5004J7333o9232j4415j793
$$ -67727 -101987 -28985 -24251 -90958 -106058 -46588 21619 46623 63956 -5276 -19691 -21484
15660b1484j5926M273J332k9494J7412J4345L0257o977J7433J1412R026p740J5996
$$ -21484 -37410 -33137 -31805 -61299 -43887 -29542 715 -6262 11171 22583 31609 23869 39865
15647C9865l1637l4324M157j9241k0941Q756N1828n557k5397M3565M5622n6848
$$ 39865 8228 -26096 -21939 -41180 -62121 -53365 -1537 -7094 -32491 11074 56696 -152
15635a52k4674j14628K7008P0549K4854n0226m7684j7923O1303k316l7913l1524
$$ -152 -24826 -139454 -112446 -41897 -17043 -67269 -114953 -132876 -71573 -73889 -111802 -143326
15623a43326N0375j6099p860L4513L7162P5029n140o0754M3515L15o0507k1838
$$ -143326 -92951 -109050 -116910 -82397 -45235 29794 24654 -36100 7415 7730 -52777 -74615
15611g4615J0067o7930N6178O0751l5307n167J1021l4611n6796n9810N1320O0740
$$ -74615 -64548 -132478 -76300 -15549 -50856 -56023 -45002 -79613 -136409 -196219 -144899 -84159
15599h4159o4903J2288K7247k5000o9103P9455R5081K0232m8684q8645K3947M5314
$$ -84159 -149062 -136774 -109527 -134527 -203630 -124175 -29094 -8862 -57546 -146191 -122244 -76930
15587g6930R762j5735k4614J674j1965K4727N4378j2218K7925q8183n528Q5102
$$ -76930 -67168 -82903 -107517 -105843 -117808 -93081 -38703 -50921 -22996 -111179 -116707 -31605
15575c1605L8111K007m1890K3586L5880O3310o5083r74Q3997M8498o0346n7831
$$ -31605 6506 8513 -33377 -9791 26089 89399 24316 23342 107339 155837 95491 37660
15563C7660J9210k7110m6745k5420j10205k448N3479K3958k2314r789n0337K2246
$$ 37660 56870 29760 -16985 -42405 -152610 -155058 -101579 -77621 -99935 -109724 -160061 -137815
15551a37815M8586L9676P819Q618k2213K833M7832J2660k6560J9691j9986J4090
$$ -137815 -89229 -49553 -41734 -33116 -55329 -52496 -4664 7996 -18564 1127 -18859 -4769
15539d769l2243k6491P7l4956L8729N4692l6705o99K9592j1844j0106L2995M7938
$$ -4769 -37012 -63503 -63426 -98382 -59653 -4961 -41666 -42365 -12773 -24617 -34723 -1728 46210
15526D6210j0084l5855N6746m1297m0328l3774l9464l4582k0868J7427L5018J8663
$$ 46210 36126 271 57017 15720 -24608 -58382 -97846 -132428 -153296 -135869 -100851 -82188
15514h2188q679M5425L5934k7024l3709k58L4679N1983o8571l5701K9576l2597
$$ -82188 -90867 -45442 -9508 -36532 -70241 -70499 -35820 16163 -52408 -88109 -58533 -91130
15502i1130p4289j9862N5860L7228j6598p885j5462n527Q3971Q3535j2252k8542
$$ -91130 -165419 -185281 -129421 -92193 -108791 -116676 -132138 -137665 -53694 29841 17589 -10953
15490a0953K244K6034J4420k5767j9240j667M8587Q7416J2616n5497m3461j9910
$$ -10953 -8709 17325 31745 5978 -13262 -14929 33658 121074 133690 78193 34732 14822
15478A4822J178m5139R172j751L692j0557K0492J5470K9920k6981J958R7362m2549
$$ 14822 16000 -29139 -19967 -21718 -18026 -28583 -8091 7379 37299 10318 12276 109638 67089
15465F7089n2341N5353N9214n554m3988k8845j5822o071K5005L5716m6555k9414
$$ 67089 14748 70101 129315 123761 79773 50928 35106 29035 54040 89756 43201 13787
15453A3787j4085M783j2001Q898N0051K1249K5602J4389m573j9741n1091M768
$$ 13787 -298 4485 -7516 1382 51433 72682 98284 112673 108100 88359 37268 42036
15441D2036j1839M0433p733j03324j8623J28236N393j6282J4916n1811m4908K8515
$$ 42036 30197 70630 62897 -40427 -59050 69186 74579 58297 73213 21402 -23506 5009
15429E009j2433j5029j5265j6657n5872M7345k692N4865m9690p3187N1229K8759
$$ 5009 -7424 -22453 -37718 -54375 -110247 -62902 -65594 -10729 -60419 -133606 -82377 -53618
15417e3618L5624L0002K0857O713n7992m9659N342P3405l288p965J6604n475k2263
$$ -53618 -17994 12008 32865 39578 -18414 -68073 -62731 10674 7386 -579 16025 10550 -11713
15404a1713N69J9770N5232j0743k6223K6216l1393l2341M7212J0305j400o7484
$$ -11713 -11144 8626 63858 53115 26892 53108 21715 -10626 36586 46891 45491 -21993
15392b1993k6517L9772J04243N3499o008l3572o8006n9099N901k766K7144N7447
$$ -21993 -48510 -8738 95505 149004 142996 109424 41418 -17681 -11780 -14546 12598 70045
15380G0045J4868q1702j0302L9408l1404J7862L7728J0262r6698o3358J2945L2982
$$ 70045 84913 3211 -7091 32317 913 18775 56503 66765 -29933 -93291 -80346 -47364
15368d7364Q6093o2221m3259k2429N0843N4044j6549p893J8840L5262l5757l5601
$$ -47364 38729 -23492 -66751 -89180 -38337 15707 -842 -8735 10105 45367 9610 -25991
15356b5991q7431k1615J7156Q1530K5276l3256k2656L3626L698j2624k2196M1614
$$ -25991 -113422 -135037 -117881 -36351 -11075 -44331 -66987 -33361 -29663 -42287 -64483 -22869
15344b2869j8599K7185m308k351M5942K7240r808J0007Q715J1415m5130J7936
$$ -22869 -41468 -14283 -18591 -20942 25000 52240 42432 52439 61154 72569 27439 45375
15332D5375K1793j8474Q353k3915j8627K9530N0041q712n5373o3433K4645K9512
$$ 45375 67168 48694 57047 33132 14505 44035 94076 85364 29991 -33442 -8797 20715
15320B0715j8683k1867j3524k1545j3924O1730J42837q064p4848p2923l3173J669
$$ 20715 2032 -19835 -33359 -54904 -68828 -7098 135739 127675 52827 -20096 -53269 -51600
15308e1600L8851l7500k661M9078j0284n6152N8367L7639J4496n4904k7295K2393
$$ -51600 -12749 -50249 -52910 -3832 -14116 -70268 -11901 25738 40234 -14670 -41965 -19572
15296a9572l6007m3L4900m921k0269O7678M4775l6591j8890N9211Q7856o8936
$$ -19572 -55579 -55622 -20722 -25643 -45912 21766 66541 29950 11060 70271 158127 89191
15284H9191m7245j4387l1558J9149k8487K4787K8601j9883k8902M599P5262J8808
$$ 89191 41946 27559 -3999 15150 -13337 11450 40051 20168 -8734 -4135 71127 89935
15272H9935q6098L7735K2320k0203J0953M9878L4253K4770p0107j43388q0162
$$ 89935 3837 41572 63892 43689 54642 104520 138773 163543 93436 -49952 -130114
15261a30114J9876O9708L1969j4343R344J2960j950K5023M5370p290k4578j8842
$$ -130114 -110238 -40530 -8561 -22904 -13560 -600 -2550 22473 67843 60553 35975 17133
15249A7133r1737K1318O3906J6724j64k4754P958J9513N158K5157l2763k5488
$$ 17133 -74604 -53286 10620 27344 27180 2426 10384 29897 35055 60212 27449 1961
15237A961L188l3073m1607M3056M8291J7675l3507k8j07530k8611Q1341K6151
$$ 1961 5149 -27924 -69531 -26475 21816 39491 5984 5956 -101574 -130185 -48844 -22693
15225b2693K7091M4281J7132M2115O0208l8460p0403q170j7238M4412K7684p3610
$$ -22693 4398 48679 65811 107926 168134 129674 59271 51101 33863 78275 105959 32349
15213C2349K0635L688l219j6088q5340O2638J5769m814M8845m796k6490L6661
$$ 32349 52984 56672 53453 37365 -47975 14663 30432 25618 74463 69667 43177 79838
15201G9838L5944p4543p9573l9080j2374K1849J9496j8053j2522p6800j9960J25679
$$ 79838 115782 41239 -38334 -77414 -89788 -67939 -48443 -66496 -79018 -155818 -175778 -50099
15189e0099P2618l6312j7438L2698J188Q669j7191l4013k2443m3778o5557K3058
$$ -50099 22519 -13793 -31231 1467 2655 11324 -5867 -39880 -62323 -106101 -171658 -148600
15177a48600J9511Q2581M1020l9500k7431K293L1614l7552k2192Q9425M1860m6361
$$ -148600 -129089 -46508 -5488 -44988 -72419 -70126 -38512 -76064 -98256 -8831 33029 -13332
15165a3332n2811m8762J7973k3902L4856P0014O4898k8787R862J580R471l8522
$$ -13332 -66143 -114905 -96932 -120834 -85978 -15964 48934 20147 30009 31589 41060 2538
15153B538l017Q857r3112j7572L6287O4480j210l2125k2345M3820K3455J6011
$$ 2538 -479 8378 -84734 -102306 -66019 -1539 -2749 -34874 -57219 -13399 10056 26067
15141B6067k7688K0621K0919p1468N3462J9550j002j4716l3821K0434K0825j9467
$$ 26067 -1621 19000 39919 -31549 21913 41463 40461 25745 -8076 12358 33183 13716
15129A3716q276J8891k3305j7339J0294j6127j6989K5098o097n5305L3655L8889
$$ 13716 5440 24331 1026 -16313 -6019 -22146 -39135 -14037 -20134 -75439 -41784 -2895
15117b895j0O8310J6144j2500J6216M4244o084Q287o500m9021o8639l6310J2992
$$ -2895 -2905 65405 81549 69049 85265 129509 123425 131712 125212 76191 7552 -28758 -15766
15104a5766L7178O0706N1686L0150q7479r1381M4081O8193l5210n8639o1352P108
$$ -15766 21412 82118 133804 163954 76475 -14906 29175 97368 62158 3519 -57833 -50725
15092e0725K4099K9599k8913j6665K4366L6750J2931J1706M1233M6993l6463j01684
$$ -50725 -26626 2973 -25940 -42605 -18239 18511 31442 43148 84381 131374 94911 -6773
15080f773k1170L6584K1562k8616j232L2041K9470O7829j5377J2427l964k3186
$$ -6773 -27943 8641 30203 1587 355 32396 61866 129695 114318 126745 122781 99595
15068I9595k7193l23K4193L6297M135J7911n4776p9164M992O4382K7906O062P962
$$ 99595 72402 72079 96272 132569 136704 154615 99839 20675 25667 90049 117955 124017 131979
15055A31979M1927n4161p3342P9229J1335o0515m5521m4076R2315L2609j0042
$$ 131979 173906 119745 46403 125632 136967 76452 30931 -13145 79170 111779 101737
15044A01737o7784k8093r440O904J11359L230k6095o1450o5570M9082J12674J3303
$$ 101737 33953 5860 -3580 3324 114683 117913 91818 30368 -35202 13880 126554 139857
15032A39857j7781J1707J115p7170j1390K9137M821j8707p554o636j5666K6744
$$ 139857 122076 133783 134898 57728 46338 75475 80296 61589 54035 47399 31733 58477
15020E8477M0329N5966r0436q151N3792J1618R574J6326l7063r9456j15226P242
$$ 58477 98806 154772 64336 56185 109977 121595 131169 147495 110432 10976 -104250 -97008
15008i7008O9559L9103K8308M5923L7764m189j244n25k8115k9776l4411q721O412
$$ -97008 -27449 11654 39962 85885 123649 119460 118216 117691 89576 59800 25389 16668 23080
14995B3080O438L1161M6693p5130R076k5437o2365J34221L0930q0907l3851R448
$$ 23080 29518 60679 107372 32242 41318 15881 -46484 87737 118667 37760 3909 13357
14983A3357P5039J8816o4226j0626L0183L8927M0466K7261n8362p0361O2692M5753
$$ 13357 88396 107212 42986 32360 62543 101470 141936 169197 110835 40474 103166 148919
14971A48919k4139L2511k9042M4128K1258J294j22670n0625O9598j3034K823P293
$$ 148919 124780 157291 128249 172377 193635 194929 72259 21634 91232 78198 81021 88314
14959H8314j8698K5024J01586L4713n1024k4928k6170j6046k8342O4459j5696
$$ 88314 69616 94640 196226 230939 179915 154987 128817 112771 84429 148888 133192
14948A33192L9374R735j00336r7182l841J8023m2031N8276J05089j4879K7487
$$ 133192 172566 182301 81965 -15217 -19058 -1035 -43066 15210 120299 105420 132907
14937A32907k486J3589m72l6275j5384L2152J2631l2972j9004M811j7469O5377
$$ 132907 130421 144010 143538 107263 91879 124031 136662 103690 84686 89497 72028 137405
14925A37405J5378j6451Q081m2807r7474l1209k010Q6143J29185K0406q1706l7536
$$ 137405 152783 136332 144413 101606 4132 -27077 -29087 57056 186241 206647 124941 87405
14913H7405K6708L3931L23n2059j0489N7502M1238K5943j4882j8477k3303P279
$$ 87405 114113 148044 148367 96308 85819 143321 184559 210502 195620 177143 153840 161119
14901A61119j1046m3454j0216L3205k9729m2188K8635M4552m8987k7044M6929
$$ 161119 150073 106619 96403 129608 99879 57691 86326 130878 81891 54847 101776
14890A01776K2727L4860K3389l8169r2986m3825N3470k5000j0803J5198L0263
$$ 101776 124503 159363 182752 144583 51597 7772 61242 36242 25439 40637 70900
14879G0900K7993K7488K8516j7244J8984J193M1175K962n0280l3088m77K9953
$$ 70900 98893 126381 154897 137653 156637 157830 199005 201967 151687 118599 118122 148075
14867A48075J5345j1869L6520M9071l3128k0481m5117Q402j2255p4284j533P2416
$$ 148075 163420 151551 188071 237142 204014 183533 138416 146818 134563 60279 58746 131162
14855A31162Q848M5204j1556j3867n4365l6114M467N2629J0248k526L7001j5412
$$ 131162 140010 185214 173658 159791 105426 69312 73779 126408 136656 134130 171131 155719
14843A55719m4898L781m898m4932m133N9711Q6215O1231k6522n3372n4574M641
$$ 155719 110821 114602 109704 64772 60639 120350 206565 267796 241274 187902 133328 137969
14831A37969k9377j4926l5248l5559Q7386K29l6599Q9950Q6455j6787j4964m3510
$$ 137969 108592 93666 58418 22859 110245 110474 73875 163825 250280 233493 218529 175019
14819A75019k8380j46M3784k9304j9345J0303J5660J18849k5756j7699m1981k7096
$$ 175019 146639 146493 190277 160973 141628 151931 167591 286440 260684 242985 201004 173908
14807A73908l6883J8903R4445m4778n3375Q7380R657q4272J1895O2759k020K2597
$$ 173908 137025 155928 250373 205595 152220 239600 249257 164985 176880 239639 237619 260216
14795B60216O5035j06828n4193J0865r15n4041l0836J03674M8233P6683k6525
$$ 260216 325251 218423 164230 175095 174180 120139 89303 192977 241210 317893 291368
14784B91368l4113J5K0848M2751K0308l6137j7304j6567n5261M6395J02635j0971
$$ 291368 257255 257270 278118 320869 341177 305040 287736 271169 215908 262303 364938 353967
14772C53967J0078n3092k4941k2212n1558J1387L5430p951K6072M4503L1820o6888
$$ 353967 364045 310953 286012 263800 212242 223629 259059 251108 277180 321683 353503 286615
14760B86615m6772m6130M5428J2598p7070J7326l308J2152N1516R2336m6573p0498
$$ 286615 239843 193713 239141 251739 174669 191995 188687 200839 252355 344691 298118 227620
14748B27620J142k3869j3507J30801L5763l2730j4901l5425k5537j249m8K817
$$ 227620 228762 204893 191386 322187 357950 325220 310319 274894 249357 248108 248060 250877
14736B50877K1976N411k8003k0678m5078q406j0591K7004k2549r6884j8778Q7944
$$ 250877 272853 278264 250261 229583 184505 176099 165508 192512 169963 73079 54301 142245
14724A42245K7564J9813P5169J8055n9801k4285M703K3508Q7267M0608J9514l7505
$$ 142245 169809 189622 264791 282846 223045 198760 203463 226971 314238 354846 374360 336855
14712C36855p937k487j8193k7878M6863l855j352K4193L174n4220K0608R364J6232
$$ 336855 328918 326431 308238 280360 327223 323368 322016 346209 349383 295163 315771 325135 341367
14699C41367L2919n8968q9709J4354L7651N6503N8576J1052L0895j0993J3302
$$ 341367 374286 315318 225609 239963 277614 334117 392693 403745 434640 423647 436949
14688D36949j7401n8076j1557k1M3242J8543L6604K3281K6090r6354k8501j809
$$ 436949 419548 361472 349915 349894 393136 411679 448283 471564 497654 401300 372799 370990
14676C70990k1679K2643P1327j1573k3014P867k250j085K1705M4597K3401m901
$$ 370990 349311 371954 443281 431708 408694 416561 414311 413226 434931 479528 502929 498028
14664D98028m929j0265m5801k5532n4200J2846N2481R1J9394K9223J3114n0555
$$ 498028 493099 482834 437033 411501 357301 370147 422628 422719 442113 471336 484450 433895
14652D33895k1222M1763M8609l5004k8178K3325N9506k0000R266K3485k7687k3146
$$ 433895 412673 454436 503045 468041 439863 463188 522694 502694 511960 535445 507758 484612
14640D84612M1343M6363K8067J5058J3311j069K074N7420K6440J0132M558M9159
$$ 484612 525955 572318 600385 615443 628754 627685 629759 687179 713619 723751 728309 777468
14628G77468J5603p523l0177L4529J9660J8615M8123P5375J4895P0166J15622
$$ 777468 793071 785548 755371 789900 809560 828175 876298 951673 966568 1036734 1152356
14617A152356o4919r8070k0320K1231O2504m3639j08547n3351M27o005q0874l4142
$$ 1152356 1087437 989367 969047 990278 1052782 1009143 900596 847245 847672 841667 760793 726651
14605G26651J630K8675P2555l1112n9868q2115k8810J9789R7928K9093Q520L4257
$$ 726651 728281 756956 829511 798399 738531 656416 627606 647395 745323 774416 782936 817193
14593H17193K9609P6198n2272q9081q323K1773p949O7846L4535l3346k1109P9322
$$ 817193 846802 923000 870728 781647 773324 795097 787148 854994 889529 856183 835074 914396
14581I14396J3945n3052k5372J422L9002K3623o9139m4023r612O0175Q8035K9073
$$ 914396 928341 875289 849917 851339 890341 913964 844825 800802 791190 851365 939400 968473
14569I68473R752N8192J933O7443n5479k6604K4995J5618J5346l839J7891k7985
$$ 968473 978225 1036417 1038350 1105793 1050314 1023710 1048705 1064323 1079669 1075830 1093721 1065736
14557A065736K165K0071M397J5189N8832N8061j6828k5398m6076Q42Q1973L8482
$$ 1065736 1067901 1087972 1092369 1107558 1166390 1224451 1207623 1182225 1136149 1136991 1218964 1257446
14545A257446J946K2632l878j4035j4578P3136L1507J2505K7544J2536l9326k9500
$$ 1257446 1259392 1282024 1278146 1264111 1249533 1322669 1354176 1366681 1394225 1406761 1367435 1337935
14533A337935j1977N9480N6475m6315o044P1164J14306J6531J8843M6738P7323
$$ 1337935 1325958 1385438 1441913 1395598 1389554 1460718 1575024 1591555 1610398 1657136 1734459
14522A734459P9218L1790j2719n5037L565n0769O6442J3991l3668l4133l0118
$$ 1734459 1813677 1845467 1832748 1777711 1781276 1730507 1796949 1810940 1777272 1743139 1713021
14511A713021l115N7382M5012O3360J8147L157J4341M0507O6273N2696J09981
$$ 1713021 1709906 1767288 1812300 1875660 1893807 1896964 1911305 1951812 2018085 2070781 2180762
14500B180762K2316m9274M1044M3553m0884L8080J4019M00p5447l1728N5608P0033
$$ 2180762 2203078 2153804 2194848 2238401 2197517 2235597 2249616 2250016 2174569 2142841 2198449 2268482
14488B268482q864N6246m008J12404N0114k31k0664L8561J65542Q8443n9037l8321
$$ 2268482 2259618 2315864 2311856 2424260 2474374 2474143 2453479 2492040 2657582 2746025 2686988 2648667
14476B648667O3671R4164Q1814L5597k4851M7694J04910J9387N5491N5776J3007
$$ 2648667 2712338 2806502 2888316 2923913 2899062 2946756 3051666 3071053 3126544 3182320 3195327
14465C195327J318N79K6176J87046J38568J19372J49691K2953n4452R538O3990
$$ 3195327 3196645 3197224 3223400 3410446 3549014 3668386 3818077 3841030 3786578 3796116 3860106
14454C860106N8484m039J06747J06559M9474Q8629J12668O1146K1718O8661J01220
$$ 3860106 3918590 3914551 4021298 4127857 4177331 4265960 4378628 4439774 4461492 4530153 4631373
14443D631373J9686M6227J62052N5025P3134J97686J94442M7472n1005R2553J67869
$$ 4631373 4651059 4697286 4859338 4914363 4987497 5185183 5379625 5427097 5376092 5468645 5636514
14432E636514R9016n279Q1367J75233J50026J96126Q9507R5459J69342J60288
$$ 5636514 5735530 5730251 5811618 5986851 6136877 6333003 6422510 6517969 6687311 6847599
14422F847599J25558J17412K13251K08178J08992K02015J88076J72783K42756
$$ 6847599 6973157 7090569 7303820 7511998 7620990 7823005 8011081 8183864 8426620
14413H426620J83466J10312J71989K15371J67526J68414K63608L48331K84647
$$ 8426620 8610086 8720398 8892387 9107758 9275284 9443698 9707306 10055637 10340284
14404A0340284J56876J97096L08644L68728K42190K85231L02526K56369L30983
$$ 10340284 10497160 10694256 11002900 11371628 11613818 11899049 12201575 12457944 12788927
14395A2788927M06991L51588L23596K92269L42939L33402M06744L67371M04466
$$ 12788927 13195918 13547506 13871102 14163371 14506310 14839712 15246456 15613827 16018293
14386A6018293M53571M84516M34080M80920N08805M19085M14951N20403O04458
$$ 16018293 16471864 16956380 17390460 17871380 18380185 18799270 19214221 19734624 20339082
14377B0339082N40927N01387N65659N72278M97830N61658N88621N86717N90936
$$ 20339082 20880009 21381396 21947055 22519333 23017163 23578821 24167442 24754159 25345095
14368B5345095P01009O34771N72526O36954O28756N92504O23925N93606N45362
$$ 25345095 26046104 26680875 27253401 27890355 28519111 29111615 29735540 30329146 30874508
14359C0874508N65022N70506N63363N57588N70927O17036M61889M01354L96109
$$ 30874508 31439530 32010036 32573399 33130987 33701914 34318950 34780839 35182193 35578302
14350C5578302K89294L39831L69720L59095K74398K58289K25601J13146Q6368
$$ 35578302 35867596 36207427 36577147 36936242 37210640 37468929 37694530 37807676 37894044
14341C7894044M616j8227l1154r5466k01047j93451k27575k65133k71960l13833
$$ 37894044 37898660 37880433 37849279 37753813 37552766 37359315 37131740 36866607 36594647 36280814
14331C6280814m63119m45132m94018n11581m87995n22652o37595o54161o04027
$$ 36280814 35817695 35372563 34878545 34366964 33878969 33356317 32718722 32064561 31460534
14322C1460534n90332o35896o78099n92248n77803n89344o24575o15704n82729
$$ 31460534 30870202 30234306 29556207 28963959 28386156 27796812 27172237 26556533 25973804
14313B5973804o11742n86998n30089m98893n15359n27125n33391m26388m57534
$$ 25973804 25362062 24775064 24244975 23746082 23230723 22703598 22170207 21743819 21286285
14304B1286285m27193m29107m41744m46646m59054n41743n85611n91277o41824
$$ 21286285 20859092 20429985 19988241 19541595 19082541 18540798 17955187 17363910 16722086
14295A6722086n52783m68563m78706m54431m74440m59634l53208k68975l70111
$$ 16722086 16169303 15700740 15222034 14767603 14293163 13833529 13480321 13211346 12841235
14286A2841235l11853l18779l22157k51337l07682k89865k87012k37885k19581
$$ 12841235 12529382 12210603 11888446 11637109 11329427 11039562 10752550 10514665 10295084
14277A0295084k03550k21140k18356j55435k16726k30947k68071k14757j95753
$$ 10295084 10091534 9870394 9652038 9496603 9279877 9048930 8780859 8566102 8370349
14268H370349j82288j52665j70531k08693j55540j19610j59296j21082j17522
$$ 8370349 8188061 8035396 7864865 7656172 7500632 7381022 7221726 7100644 6983122
14259F983122j14419j12549j17684m6810q5273j78552j44339q4220j20320j75353
$$ 6983122 6868703 6756154 6638470 6591660 6506387 6327835 6183496 6099276 5978956 5803603
14249E803603j21693j35217o5665j24193j05356L288j7654o1936r3929j00844
$$ 5803603 5681910 5546693 5481028 5356835 5251479 5254767 5237113 5175177 5081248 4980404
14239D980404n0010n4270q7242o5861J6106j5936o082k3638p2948n6167q0723
$$ 4980404 4930394 4876124 4788882 4723021 4739127 4723191 4717109 4693471 4620523 4564356 4483633
14228D483633k7903K7309J02598O6053J12306J46311M1695P3827J45283J14674
$$ 4483633 4455730 4483039 4585637 4651690 4763996 4910307 4952002 5025829 5171112 5285786
14218E285786O1119Q1567M6797q2857j27787k67731m28619m27968l07918j52482
$$ 5285786 5346905 5428472 5475269 5392412 5264625 4996894 4568275 4140307 3832389 3679907
14208C679907j84752k77983j25327j8445l3835j00978j00315r825m2725q6187
$$ 3679907 3495155 3217172 3091845 3073400 3039565 2938587 2838272 2828447 2785722 2699535
14198B699535p5705l562O688o855m4379o8513q4206j04355o8399j3042K1518J9041
$$ 2699535 2623830 2620268 2626956 2620101 2575722 2507209 2423003 2318648 2250249 2237207 2258725 2277766
14186B277766k7705p0975m9644k0130M705n436k6298J4435m5282l2865n7606n9366
$$ 2277766 2250061 2179086 2129442 2109312 2114017 2108581 2082283 2096718 2051436 2018571 1960965 1901599
14174A901599K203L9023K6767p635l6394r5819l3963K9919l0325p983J7553m4234
$$ 1901599 1903802 1942825 1969592 1961957 1925563 1829744 1795781 1825700 1795375 1787392 1804945 1760711
14162A760711o8285M493J4731j7224r3540m5526O8635n5705p5081j975O2085K2631
$$ 1760711 1692426 1696919 1711650 1694426 1600886 1555360 1623995 1568290 1493209 1491234 1553319 1575950
14150A575950o6651L882K2814l1975m0792l2634o862k7913o9780L4638q857k5555
$$ 1575950 1509299 1513181 1535995 1504020 1463228 1430594 1423732 1395819 1326039 1360677 1351820 1326265
14138A326265m0334M1647k2341m1229p914j1747p0348m6101J3252L8934n214j6147
$$ 1326265 1285931 1327578 1305237 1264008 1256094 1244347 1173999 1127898 1141150 1180084 1174870 1158723
14126A158723Q141l3859k4637k8390O096J538m8337n181k8250K0858M0538k4241
$$ 1158723 1166864 1133005 1108368 1079978 1086074 1087612 1039275 1034094 1005844 1026702 1067240 1042999
14114A042999p3754l4470k9852K414L3798J9171J6248n920O467l705l6837k3789
$$ 1042999 969245 934775 904923 907337 941135 960306 976554 970634 977101 973396 936559 912770
14102I12770P002N9859M3593p7075l6692m2396l5162J4061M1867k8061Q081j1781
$$ 912770 919772 979631 1023224 946149 909457 867061 831899 845960 887827 859766 867847 856066
14090H56066M073j5883R56N7851O8056J8936k0667m1072l9693m4542o065O2800
$$ 856066 860139 844256 845212 903063 971119 990055 969388 928316 888623 844081 838016 900816
14078I00816j7948k5439l4943k158n510o8452L0277J18733P4450n737q1698n8623
$$ 900816 882868 857429 822486 820328 814818 746366 776643 895376 969826 964089 882391 823768
14066H23768p36m03L650M1211M3214l7900M6851J12593J7280P7663L2177j08960
$$ 823768 823032 822629 826279 867490 910704 872804 919655 1032248 1049528 1127191 1159368 1050408
14054A050408j09318o251r827m2171m7204o5051n5823k9737k6852n9310n0836
$$ 1050408 941090 934839 925012 882841 835637 770586 714763 685026 658174 598864 548028
14043E48028j26547j5539L2932N4744O8240O5968l2576r547Q6973N6678r389j1273
$$ 548028 421481 405942 438874 493618 561858 627826 595250 585703 672676 729354 719965 708692
14031G08692l758j007j5690o7024l8874K4408M8378o1765J1789j4406n9282j2682
$$ 708692 704934 703927 688237 621213 582339 606747 655125 593360 605149 590743 531461 518779
14019E18779O4283M4317n6054q655q4421J2280J10488P2041k7124n0789p5276
$$ 518779 583062 627379 571325 562670 478249 490529 601017 673058 645934 595145 519869
14008E19869k9822K2455n314j6666N090Q7334k2882m9984k1767M4886k666M951
$$ 519869 490047 512502 507188 490522 495612 582946 560064 510080 488313 533199 530533 535484
13996E35484P1141L1298r0279k0837o7778j8380j3177l0531P284Q7309N9464J0814
$$ 535484 606625 637923 547644 526807 459029 440649 427472 396941 404225 491534 550998 561812
13984E61812N4893J3463J0246k9362K0013M4292m3156N721k3449o9227J2997J2848
$$ 561812 616705 630168 640414 611052 631065 675357 632201 637922 614473 545246 558243 571091
13972E71091Q495P8708L0044o4631j05003k748J756N5097P2393n998K0442k9499
$$ 571091 579586 658294 688338 623707 518704 515956 517712 572809 645202 639204 659646 630147
13960F30147K1590L9442l2808l0273M2628l6900o7327r9364k7093j403K4825K5266
$$ 630147 651737 691179 658371 628098 670726 633826 566499 467135 440042 438639 463464 488730
13948D88730j567m0563r936K3937O8368P177J07931j4800l1759k8793l8691J5905
$$ 488730 487163 446600 436664 460601 528969 536146 644077 629277 597518 568725 530034 545939
13936E45939J1984J02707L1194j3872n3649N234P3227O5144j7269k6955M0063
$$ 545939 557923 660630 691824 677952 624303 629537 702764 767908 750639 723684 763747
13925G63747j9194l2313m0712N2078O0168o1611k1070K5918P197M5981J6008j047
$$ 763747 744553 712240 671528 723606 783774 722163 701093 727011 734208 780189 796197 795150
13913G95150N0833K5113K5839k1844j3626n6765j9213k3857O1373N5740J0554
$$ 795150 845983 871096 896935 875091 861465 804700 785487 761630 823003 878743 889297
13902H89297J5174K7767j9601M8627J3218P9985P6956M9433J28384J00148O3374
$$ 889297 904471 932238 912637 961264 974482 1054467 1131423 1180856 1309240 1409388 1472762
13891A472762R7936J71075J28903J73086J54051K01885J91635J52761K16410L16312
$$ 1472762 1570698 1741773 1870676 2043762 2197813 2399698 2591333 2744094 2960504 3276816
13881C276816L81687M47434N34328O41653O91599O72200Q82316R60554R68119
$$ 3276816 3658503 4105937 4640265 5281918 5973517 6645717 7528033 8488587 9456706
13872I456706J102977J179697J200859J206218J194676J217294J380265J467071
$$ 9456706 10559683 11739380 12940239 14146457 15341133 16558427 17938692 19405763
13864A9405763J533282J685464J806589K003546K235441K505942K839090L054312
$$ 19405763 20939045 22624509 24431098 26434644 28670085 31176027 34015117 37069429
13856C7069429L249029L414053L593805L917959M450182N335561O971743R510955
$$ 37069429 40318458 43732511 47326316 51244275 55694457 61030018 68001761 77512716
13848G7512716J2909520J6424047J8976144J9413340J7303923J4188684J2773119
$$ 77512716 90422236 106846283 125822427 145235767 162539690 176728374 189501493
13841A89501493J4696659J8701391K1454758J7302633M609912j1785297k7787171
$$ 189501493 204198152 222899543 244354301 261656934 266266846 254481549 226694378
13834B26694378m0701840m5548905m0253835k9687660j9679578j2608847q179188
$$ 226694378 185992538 140443633 100189798 70502138 50822560 38213713 30034525
13827C0034525n515507l990244k895229k239913j712786j454748j268106j103476
$$ 30034525 24519018 20528774 17633545 15393632 13680846 12226098 10957992 9854516
13819I854516j084180r84797r04069p53630o02773n13712m16305k87229j98709
$$ 9854516 8770336 7785539 6881470 6127840 5525067 5011355 4595050 4307821 4109112
13810D109112r3368k17465k39094j84422k03987j07164j09716q4987p8092j57167
$$ 4109112 4015744 3798279 3559185 3374763 3170776 3063612 2953896 2868909 2790817 2633650
13800B633650j17949m4801m6983l1958J8819l3543r6678k5447q5137p4564l1394
$$ 2633650 2515701 2470900 2423917 2391959 2410778 2377235 2280557 2255110 2169973 2095409 2064015
13789B064015q9687j36916m6544r5382o8977j2193k2528Q813Q759o9867o1200
$$ 2064015 1974328 1837412 1790868 1695486 1626509 1614316 1591788 1600601 1609360 1539493 1478293
13778A478293j9530j7370m4483m5500M0850m7071l6421q1749j10691M1356K3450
$$ 1478293 1458763 1441393 1396910 1351410 1392260 1345189 1308768 1227019 1116328 1157684 1181134
13767A181134k6883m3923l6983o7018n2517j01087o6512l8445k8480l2948q907
$$ 1181134 1154251 1110328 1073345 1006327 953810 852723 786211 747766 719286 686338 677431
13756F77431m8477J3287M1921K3213j0641j6239J0146P96P950J1436K2893Q4151
$$ 677431 628954 642241 684162 707375 696734 680495 690641 691437 699387 710823 733716 817867
13744H17867m3014p1758k7210o2922N9718M3899p644m6607M6527K7944m4020p8584
$$ 817867 774853 703095 675885 612963 672681 716580 708936 662329 708856 736800 692780 614196
13732F14196l3231k6284p3899j2584N6846J6698p678J448p0594m2147k6834m7934
$$ 614196 580965 554681 480782 468198 525044 541742 534064 535512 464918 422771 395937 348003
13720C48003n563M7000K3533J7646J4509j013J5173o7694q2201L0893K1981m1327
$$ 348003 342440 389440 412973 430619 445128 444115 459288 391594 309393 340286 362267 320940
13708C20940N0843M4810L5748k0815j5740q7384o3340M701k24N4103R2779Q4649
$$ 320940 371783 416593 452341 431526 415786 328402 265062 269763 269539 323642 416421 501070
13696E01070O1913r8740o1123l5385M7059O2734m0427k3439j3062q829P2195J9356
$$ 501070 562983 464243 403120 367735 414794 477528 437101 413662 400600 391771 463966 483322
13684D83322k4164P693o5235n5422o9669K1942L5820l0113K5247J6914j1210L2382
$$ 483322 459158 466851 401616 346194 276525 298467 334287 304174 329421 346335 335125 367507
13672C67507k9015N722K8600N768l4364m765J4746J09K0289n5366m6817l2900
$$ 367507 338492 344214 372814 378582 344218 339453 354199 354308 374597 319231 272414 239514
13660B39514J1944l8997N2538K5583k9539p9518M3037l0391l4520L5428L2947
$$ 239514 251458 212461 264999 290582 261043 181525 224562 194171 159651 195079 228026
13649B28026K4955j3771j5364n2741k1046j9440N2223Q3844j1254l9950Q06R7863
$$ 228026 252981 239210 223846 171105 150059 130619 182842 266686 255432 215482 216288 314151
13637C14151M8818k63j930k886m6407p1863J6775K1368k4936J1143j08667q1715
$$ 314151 362969 362706 360776 357890 311483 239620 256395 277763 252827 263970 155303 73588
13625G3588K4508J7601P4878k154M256K9234j3698p2313j9763L7214k9722O139
$$ 73588 98096 115697 190575 188421 192677 221911 208213 135900 116137 153351 123629 129768
13613A29768j8653o8618M174O9668R3593L1518n273k4603P1101L6474N982J1485
$$ 129768 111115 42497 46671 116339 209932 241450 236177 211574 282675 319149 325131 336616
13601C36616k3758l0755o8099l5548K540K7320J8813o3932O357l444O1512j71
$$ 336616 312858 282103 214004 178456 180996 208316 227129 163197 169554 166110 227622 227451
13589B27451k8630n353o4793m0344m372J04056K6482o7750p6568R578j6226p6795
$$ 227451 198821 193468 128675 88331 83959 188015 214497 146747 70179 79757 63531 -13264
13577a3264L4574L6030R0150O140J3315K8663k2341l2933J7474K7397K370n5109
$$ -13264 21310 57340 147490 153630 166945 195608 173267 140334 157808 185205 187575 132466
13565A32466J9825P0800J9085n9663l9342L0325r934j3074K7928k328j8503M9700
$$ 132466 152291 223091 242176 182513 143171 173496 163562 150488 178416 176088 157585 207285
13553B07285q2117o8281N7537N6090j2726o8301n454O853M3264k8074k0944K6497
$$ 207285 125168 56887 114424 170514 157788 89487 84033 90886 134150 106076 85132 111629
13541A11629J5746r3743k1130j761q531R823R309P504Q001L3255m1270m0278j49
$$ 111629 127375 33632 12502 10741 2210 12033 21342 28846 36847 70102 28832 -11446 -11595
13528a1595J50387M7525o9415l6128J24175J07042p0130q5578M8283L1304J933
$$ -11595 138792 186317 116902 80774 204949 311991 241861 156283 204566 235870 237803
13517B37803m7775N317k9740N99J6823J7259j7544K2787j7527k6291j6410n3114
$$ 237803 190028 195345 165605 166204 183027 200286 182742 205529 188002 161711 145301 92187
13505I2187n2876o847Q5004J7478m4985o722M6197N8678m0610l1273j3428j174
$$ 92187 39311 32464 117468 134946 89961 83239 129436 188114 147504 116231 102803 101629
13493A01629k1495l8101M0378J12207N0630j9413l254p8408k6745N5553N1034
$$ 101629 80134 42033 82411 194618 245248 225835 222581 144173 117428 172981 224015
13482B24015j5499n4920k1302K4349Q6330M4858k5038m8506l2058k6797L3203
$$ 224015 208516 153596 132294 156643 242973 287831 262793 214287 182229 155432 188635
13471A88635o9266Q14M9245K1878n5808J902j4875o8656J3273O0350p2669n6569
$$ 188635 119369 120183 169428 191306 135498 137400 122525 53869 67142 127492 54823 -1746
13459a746L0762L9900L7777N1648n105K0620k2533m5846L356j6397K0455J7200
$$ -1746 29016 68916 106693 158341 153236 173856 151323 105477 108833 92436 112891 130091
13447A30091k5981j8910k175k5210r1086M1263K1608k4422n5446J6074K7043K6160
$$ 130091 104110 85200 83025 57815 -33271 7992 29600 5178 -50268 -34194 -7151 19009
13435A9009L5061k5645J9625L5394M4244L5869o8639O922M8114L9656l2652K3148
$$ 19009 54070 28425 48050 83444 127688 163557 94918 101840 149954 189610 156958 180106
13423A80106q7594o6532k052p329j9319M0425L6289l4795l6870J9932M0171j3806
$$ 180106 92512 25980 23928 16599 -2720 37705 73994 39199 2329 22261 62432 48626
13411D8626o5077M883M5608j0044n285N9334J26651m359j37742p5490K5294Q1478
$$ 48626 -16451 -11568 34040 23996 18711 78045 204696 200337 62595 -12895 12399 93877
13399I3877l1577O1982L6857L5862N671K867l4993m3450N1028P0884O0294K7584
$$ 93877 62300 124282 161139 197001 202672 205539 170546 127096 178124 249008 309302 336886
13387C36886k8153o5153J8416M8887O2675J18633L4469k8603m814K7605J28072
$$ 336886 308733 243580 261996 310883 373558 492191 526660 498057 493243 520848 648920
13376F48920Q0341J00271J35315O5053M1170N1052Q2395R8117J09896P1013r5963
$$ 648920 729261 829532 964847 1029900 1071070 1122122 1204517 1302634 1412530 1483543 1387580
13365A387580j56420k08003j67125j24865j71561j38429p2088q0569j20997r8617
$$ 1387580 1231160 1023157 856032 731167 559606 421177 349089 268520 147523 48906
13355D8906o074N8885k087N5732N6339L6209K154k7381m7246L7909L8359L4418
$$ 48906 42832 101717 99630 155362 211701 247910 250064 222683 175437 213346 251705 286123
13343B86123l9669q6450n0173J3887m509K993j2371k5240K9046K562k3132K7994
$$ 286123 246454 160004 109831 123718 119209 122202 109831 84591 113637 116199 93067 121061
13331A21061M0592M2048l5112m0357k5823P1317m4416m2384l3010Q854N2885k2079
$$ 121061 161653 203701 168589 128232 102409 173726 129310 86926 53916 62770 115655 93576
13319I3576j2936O1698j2384k946j307r223n154o8174j6655J7128q188L2572L9050
$$ 93576 80640 142338 129954 127008 125701 116478 111324 43150 26495 43623 35435 68007 107057
13306A07057r499n0996r296L172J3012M7860r2n6716m2515R400k024l4151N6587
$$ 107057 97558 46562 37266 40438 53450 101310 101218 44502 1987 11387 9363 -24788 31799
13293C1799M6275M3977J1862l5727Q570k3385K7877j05871j09999Q947K8749K0538
$$ 31799 78074 122051 133913 98186 106756 83371 111248 5377 -104622 -95675 -66926 -46388
13281d6388n249k760O6542L1390K4918J1524N5788K0969m4700o288p1389m4087
$$ -46388 -51637 -54397 12145 43535 68453 79977 135765 156734 112034 105746 34357 -9730
13269i730J0798k1594L8599O7206J5313J1867m8415r2628L855M9019l2207K59
$$ -9730 1068 -20526 18073 85279 100592 112459 64044 -28584 -24729 24290 -7917 -7658
13257g658j4800j397M8367O605j9645J7081L2083j3825n9438K4650L4489j4273
$$ -7658 -22458 -23855 24512 31117 11472 28553 60636 46811 -12627 12023 46512 32239
13245C2239N4673L424j4396K86K6941p5580m7737k9262O9554L653k6111J7250
$$ 32239 86912 90336 75940 76226 103167 27587 -20150 -49412 20142 23795 -2316 14934
13233A4934l5936j0409k0515k6805M7873J04223k0554o3110K8487J6653j0066
$$ 14934 -21002 -31411 -51926 -78731 -30858 73365 52811 -10299 18188 34841 24775
13222B4775k1073P5806K8221j0610j13542k4567R7400K7530j4938m8965l6423
$$ 24775 3702 79508 107729 97119 -16423 -40990 56410 83940 69002 20037 -16386
13211a6386m038J400j9113r608q36K1416J3095o671L4833Q3682j1237m6921M2260
$$ -16386 -20424 -19024 -38137 -47745 -48581 -27165 -14070 -20741 14092 97774 86537 39616 81876
13198H1876L3972k0458L8426K48k1282j2942O3607M9198p5603r1365k9859J8532
$$ 81876 115848 95390 133816 134064 112782 99840 163447 212645 137042 45677 15818 34350
13186C4350M2300N3937K1904o523j3932P723n9616q134M6888j7566p5128l2778
$$ 34350 76650 130587 152491 145968 132036 139759 80143 72009 118897 101331 26203 -6575
13174f575n8415k38j3927O3960K5126k6472l0033J6080q68j6800o1678Q829O9852
$$ -6575 -64990 -65228 -79155 -15195 9931 -16541 -46574 -30494 -31362 -48162 -109840 -101011 -31159
13161c1159O2794L3015K4539k2745n60j9576K3890P468n318m1131m7119J1108
$$ -31159 31635 64650 89189 66444 65884 46308 70198 77666 72348 31217 -15902 -4794
13149d794N65j3049k3221P2087N0132m753j8064l0671R283j3034j796M8902m4737
$$ -4794 -4229 -17278 -40499 31588 81720 76967 58903 28232 37515 24481 22685 71587 26850
13136B6850O1474N034O4636M670j23899q8105K397o397p469N7135K9390L6105
$$ 26850 88324 93358 157994 162664 38765 -49340 -46943 -53340 -60809 -3674 25716 61821
13124F1821l1992M361L7219R8747n8332m7874k0772n748K4182m8018n1644J1975
$$ 61821 29829 34190 71409 170156 111824 63950 43178 37430 61612 13594 -38050 -26075
13112b6075M1596O535m9720K3925P3774N946k8229n1201M0961L8789R568l6657
$$ -26075 15521 22056 -27664 -3739 70035 75981 47752 -3449 37512 76301 85869 49212
13100D9212R459m6294p2678L9677O6022j4424n3789o0588j1378J7274O2637M6744
$$ 49212 58671 12377 -60301 -20624 45398 30974 -22815 -83403 -94781 -77507 -14870 31874
13088C1874j587l7188j4259j0054n9589L8221j8774M966M9448N7802J8715k1320
$$ 31874 30287 -6901 -21160 -31214 -90803 -52582 -71356 -66390 -16942 40860 59575 38255
13076C8255k0619j362M926J4434M1140J0356n8252n4671M0804Q0928J00032r4456
$$ 38255 17636 16274 21200 35634 76774 87130 28878 -25793 15011 95939 195971 101515
13064A01515k0865M3758o2738m7423K4117r325k5045j2330N5804K716J3334k5868
$$ 101515 80650 124408 61670 14247 38364 29039 3994 -8336 47468 50184 63518 37650
13052C7650n6232M9480M7310L147q3029J3941M206Q8271k5356n4455j5710p735
$$ 37650 -18582 30898 78208 81355 -1674 12267 16473 104744 79388 24933 9223 1488
13040A488k0589m3229J7940N1099p679q2072r5401P9795J25675O1383k3392n2870
$$ 1488 -19101 -62330 -44390 6709 -970 -83042 -178443 -98648 27027 88410 65018 12148
13028A2148m7554J22361m56j1389j8324j2275M6339l9303J717q8326K4920M0042
$$ 12148 -35406 86955 86499 75110 56786 44511 90850 51547 53264 -35062 -10142 29900
13016B9900m433K3923k3738n6763K5951P1001o0665J9580l289m5865k4030L1942
$$ 29900 25467 49390 25652 -31111 -5160 65841 5176 24756 21467 -24398 -48428 -16486
13004a6486Q168j4450N4449k3751j825j0009J0130l1651m8010k0361j0680m204
$$ -16486 -8318 -22768 31681 7930 6105 -3904 6226 -25425 -73435 -93796 -104476 -108680
12992a08680L9351j7328m9565L7678L2863m1116N7121M5972k6420l9191l6056
$$ -108680 -69329 -86657 -136222 -98544 -65681 -106797 -49676 -3704 -30124 -69315 -105371
12981a05371L5438Q423L9070O3257J7337o3689k2275N3260j4505J0467K5107n4558
$$ -105371 -69933 -61510 -22440 40817 58154 -5535 -27810 25450 10945 21412 46519 -8039
12969h039l2667r325O9383N1765k8290l6348L391p757L7830O4486P554n5588m5377
$$ -8039 -40706 -50031 19352 71117 42827 6479 9870 2113 39943 104429 111983 56395 11018
12956A1018l2572l5892M6843Q6439k9527m8359K9203p1584q1419J064Q1195Q0778
$$ 11018 -21554 -57446 -10603 75836 46309 -2050 27153 -44431 -125850 -124786 -43591 37187
12944C7187M4764L3010j4398l7519j2873M3677N69j3245J9602Q669p387k0437
$$ 37187 81951 114961 100563 63044 50171 93848 94417 81172 100774 109443 102056 81619
12932H1619o7175L885K5559j1449m650o3909J7875p55o8988o6278K5325J7061
$$ 81619 14444 18329 43888 32439 27789 -36120 -18245 -19000 -87988 -154266 -128941 -111880
12920a11880R264j9256j1389P830L1941J4535O8181l038k8656L8976N7650M2870
$$ -111880 -102616 -121872 -133261 -125431 -93490 -78955 -10774 -13812 -42468 -3492 54158 97028
12908I7028k1600l9221l4039m5920L7397L1409m6127o928o9915J1876N5878J0639
$$ 97028 75428 36207 2168 -43752 -6355 25054 -21073 -28001 -97916 -86040 -30162 -19523
12896a9523j9172L3274J2092n4364j08118J1667N1623L8940r859N572Q4654J1939
$$ -19523 -38695 -5421 6671 -47693 -155811 -144144 -92521 -53581 -63440 -57868 26786 38725
12884C8725j5455p0536O982N9082O7731l1874l1075l1294o9878Q7120N8887N6286
$$ 38725 23270 -47266 -40284 18798 86529 54655 23580 -7714 -77592 9528 68415 124701
12872A24701J7336j09844l1877J7515Q153R749o1525n6157N4469j8432k5426K1160
$$ 124701 142037 32193 316 17831 25984 35733 -25792 -81949 -27480 -45912 -71338 -50178
12860e0178J4617q045l2582K0989N8395L545J28n4985J4923j1185k9753o045O1195
$$ -50178 -35561 -43606 -76188 -55199 3196 6741 6869 -48116 -33193 -44378 -74131 -80176 -18981
12847a8981O6577n0662k5335L4317M3839K2963k0459n5567k1789k0248L0371N7842
$$ -18981 47596 -3066 -28401 5916 49755 72718 52259 -3308 -25097 -45345 -14974 42868
12835D2868q960n2432j4695l4625k6353o8229K2244o62m5863M8536P9088O6719
$$ 42868 33908 -18524 -33219 -67844 -94197 -162426 -140182 -140844 -186707 -138171 -59083 7636
12823G636P2740J7808k7888q675j03757j2518K8181J1029O874n6603K4088K0322
$$ 7636 80376 98184 70296 61621 -42136 -54654 -26473 -15444 -8570 -65173 -41085 -20763
12811b0763j3389K4918K5896p432o8179M0853M3110K2007k9901j2394j5219p11
$$ -20763 -34152 -9234 16662 9230 -58949 -18096 25014 47021 17120 4726 -10493 -11204
12799a1204q253L2718j2760j7841l0162P883j8937N4773J3607k5724k1496L5791
$$ -11204 -19457 13261 501 -17340 -47502 -39619 -58556 -3783 9824 -15900 -37396 -1605
12787a605J5648M4447l0249p7386o050M1220L7103k7045J4812L073k525k0599
$$ -1605 14043 58490 28241 -49145 -55195 -13975 23128 -3917 10895 13968 11443 -9156
12775i156k066k9237P04k3525K0334l0237n7770L8365P0443L4261M2182l5762
$$ -9156 -11222 -40459 -39755 -63280 -42946 -73183 -130953 -92588 -22145 12116 54298 18536
12763A8536j4938L8914J7966q575o0395K0824L2034o5688j5646K4810M8595m1718
$$ 18536 3598 42512 60478 51903 -8492 12332 44366 -21322 -36968 -12158 36437 -5281
12751e281k8475J0788L7642k2628k0159K661K1318P751k1199m7717n7115O4093
$$ -5281 -33756 -22968 14674 -7954 -28113 -25452 -4134 3617 -17582 -65299 -122414 -58321
12739e8321l1067n0825K0620N0337L8398k8027j9922M4261l8864n2841N3731J8947
$$ -58321 -89388 -140213 -119593 -69256 -30858 -58885 -78807 -34546 -73410 -126251 -72520 -53573
12727e3573k7977O8396N0701r6453n892j9677K7346j7880l7870M5727n825k5612
$$ -53573 -81550 -13154 37547 -58906 -64798 -84475 -57129 -75009 -112879 -67152 -72977 -98589
12715i8589n712L8656L4199k8066N646P5965O535j9757K3411j692o6374J4150
$$ -98589 -104301 -65645 -31446 -59512 -53866 22099 28634 8877 32288 30596 -35778 -21628
12703b1628J8599k1225l052O7553Q0853l2093m3635n7711J3731p9682K0848k332
$$ -21628 -3029 -24254 -27306 40247 121100 89007 45372 -12339 1392 -78290 -57442 -59774
12691e9774k4941o4594L3587L8107N4464P4411j232m7220m8956M343Q3679K3034
$$ -59774 -84715 -149309 -115722 -77615 -23151 51260 50028 2808 -46148 -41805 41874 64908
12679F4908l9200J3888L93l938P800j4336P890N195n013k8407m554k5012M8171
$$ 64908 25708 39596 39989 36051 43851 29515 37405 42600 37587 9180 4626 -20386 27785
12666B7785M7470q111p8940K1864M1175k6607r924l8396q83k794k4893m7523L730
$$ 27785 75255 67144 -11796 10068 51243 24636 14712 -23684 -24567 -27361 -52254 -99777 -96047
12653i6047O2974M1803k0013Q69R648l8529j8654O7052M1244q32J8318l3560m0268
$$ -96047 -33073 8730 -11283 -10414 -766 -39295 -57949 9103 50347 49515 67833 34273 -5995
12640e995k3875j921J3246K2001L9790M5667l8197l7852o908k7782O49m0095r771
$$ -5995 -29870 -31791 -18545 3456 43246 88913 50716 12864 5956 -21826 -21177 -61272 -71043
12627g1043P684J1580Q198j9424J9440j2590j3873k0260n798n0480K4040L5869
$$ -71043 -63359 -51779 -43581 -63005 -43565 -56155 -70028 -90288 -96086 -146566 -122526 -86657
12615h6657M296L614j9902K6140k1374K7052k444L7921j3953k6389N6293l4366
$$ -86657 -82361 -78747 -98649 -72509 -93883 -66831 -69275 -31354 -45307 -71696 -15403 -49769
12603d9769l3540K1781N2685L7722l1565p159j5085j4039k142J4150j4929l4629
$$ -49769 -83309 -61528 -8843 28879 -2686 -9845 -24930 -38969 -41111 -26961 -41890 -76519
12591g6519l304l2742L8188J2896K3041M6443M0123N7721L2402n8354o7107r000
$$ -76519 -79823 -112565 -74377 -61481 -38440 8003 48126 105847 138249 79895 12788 3788
12579C788m5379k8083Q5571L2560K275K3947L420K3537l92k7064q1092r0618L0423
$$ 3788 -41591 -69674 15897 48457 50732 74679 78099 101636 101244 74180 -6912 -97530 -67107
12566f7107q405L792k1972o068Q6018k913k4166k2155N8403l058k8204l1957J117
$$ -67107 -75512 -71720 -93692 -99760 -13742 -16655 -40821 -62976 -4573 -7631 -35835 -67792 -66675
12553f6675K0944K1536N7762n8656m0528L6662O3245m8230j2775n240L3193K4236
$$ -66675 -45731 -24195 33567 -25089 -65617 -28955 34290 -13940 -26715 -31955 1238 25474
12541B5474Q458j5610K5074l4118o3672L2263L622L3549J1768j9052J0077r0464
$$ 25474 33932 18322 43396 9278 -54394 -22131 -18509 15040 26808 7756 17833 -72631
12529g2631j555P5326m9779j3837n2254j1837O0441R0184M9341q3804l6955j2702
$$ -72631 -74186 1140 -48639 -62476 -114730 -126567 -66126 24058 73399 -10405 -47360 -60062
12517f0062P812n3051j5257k2019N0150J8116J1333K133N4847P693J8882n8426
$$ -60062 -52250 -105301 -120558 -142577 -92427 -74311 -62978 -60845 -5998 1695 20577 -37849
12505c7849j8909N2849l4024r0857j5823K0671N5364N3941P967O3666K8111r165
$$ -37849 -56758 -3909 -37933 -128790 -144613 -123942 -68578 -14637 -6670 56996 85107 75942
12493G5942j0670l6763J7055L4733q868p22m4609k6157j7249M3385m0433p6815
$$ 75942 65272 28509 45564 80297 71429 70707 26098 -59 -17308 26077 -14356 -91171
12481i1171N66J0199k4128j4M9761Q6261N319k5848n7232m6705l6103R4778M1147
$$ -91171 -90605 -80406 -104534 -104548 -54787 31474 36793 10945 -46287 -92992 -129095 -34317 6830
12468F830J1034r340K8370N5285k3467k4351q192l3275n0545k4173n7896o174
$$ 6830 17864 8524 36894 92179 68712 44361 36169 2894 -47651 -71824 -129720 -135894
12456a35894J3062L9343P8224P3366l8906l1340k0705R761j9567k6468L7842j9097
$$ -135894 -122832 -83489 -5265 68101 29195 -2145 -22850 -13089 -32656 -59124 -21282 -40379
12444d0379O764L0999J5149j2211o814O5926n5613P525p608l7897M8502M5625
$$ -40379 -33615 -2616 12533 322 -6492 59434 3821 11346 3738 -34159 14343 59968
12432E9968M368n2435k5695l6258p8488m6912L836K4989Q5629P6952O362J7759
$$ 59968 64336 11901 -13794 -50052 -128540 -175452 -171616 -146627 -60998 15954 22316 40075
12420D0075q5181L636L0024J2309Q130O3729l6156j3245l085o2465L33J01183
$$ 40075 -45106 -41470 -11446 863 8993 72722 36566 23321 20236 -42229 -41896 59287
12408E9287r92O85j83m6177k8623K047L5155O2425n184J5949m1785j12986m0544
$$ 59287 58295 58980 58797 12620 -16003 -13956 21199 83624 78440 94389 52604 -60382 -100926
12395a00926J8059J29708L01q855J5595q7415l798j7045m6817J5587O2455Q7290
$$ -100926 -82867 46841 47142 38287 53882 -33533 -37331 -54376 -101193 -85606 -23151 64139
12383F4139L0394j2255l5301L4109M0084l1404j25079K288L7108N4461n3323m5866
$$ 64139 94533 82278 46977 81086 121170 89766 -35313 -33025 4083 58544 5221 -40645
12371d0645k4714J6657M5895O9764R096J1833l1275n9205p3799l5193O8363K6500
$$ -40645 -65359 -48702 -2807 66957 76053 87886 56611 -2594 -76393 -111586 -43223 -16723
12359a6723j6630M3139r354k472J0195j2144n0976K172K064j6696p456K9439L5069
$$ -16723 -33353 9786 432 -2040 8155 -3989 -54965 -52793 -50729 -67425 -74881 -45442 -10373
12346a0373J1808K9177J0138n0491J5727n5583j1863O1133P33k6179N1904P4884
$$ -10373 1435 30612 40750 -9741 5986 -49597 -61460 -327 406 -25773 26131 101015
12334A01015L066j0722j7233k0003L4549p4984r1658o623K4068L2581P3178N3489
$$ 101015 104081 93359 76126 56123 90672 15688 -75970 -82593 -58525 -25944 47234 100723
12322A00723l8969n0378j4454J07569K0708o9050l896O0985m8849m022J4833K006
$$ 100723 61754 11376 -3078 104491 125199 56149 52253 113238 64389 60367 75200 77206
12310G7206j3423o243j04217n8867k2838J0609L8571L0603L5317j7681L0205K7720
$$ 77206 63783 57540 -46677 -105544 -128382 -117773 -79202 -48599 -13282 -30963 -758 26962
12298B6962o2699n7238m0647l9438R220P6063O2291l29m0061k2142p955j386N5048
$$ 26962 -35737 -92975 -133622 -173060 -163840 -87777 -25486 -25815 -65876 -88018 -95973 -97359 -42311
12285d2311j6154J08080L6724p2089l1622j9942L4677M3694M1460k7016m0194
$$ -42311 -58465 49615 86339 14250 -17372 -37314 -2637 41057 82517 55501 15307
12274A5307j9314J0011N9785q2012l9933r170K9808Q0839n7685q0866O044K6248
$$ 15307 -4007 6004 65789 -16223 -56156 -65326 -35518 45321 -12364 -93230 -87186 -60938
12262f0938Q952P524J5992l8754k0657q093J412K4447O1536K8268L8700j0382
$$ -60938 -51986 -44462 -28470 -67224 -87881 -95974 -94562 -70115 -8579 19689 58389 48007
12250D8007o2254p009M5208n8804l3583O0936p8531N3432k284o680N8397j0507
$$ 48007 -14247 -21256 23952 -34852 -68435 -7499 -86030 -32598 -34882 -41562 16835 6328
12238F328j8225R860J9744L8016J4750o6265o0725j6131M2985m9640l8277J7914
$$ 6328 -11897 -2037 17707 55723 70473 4208 -56517 -72648 -29663 -79303 -117580 -99666
12226i9666J3182K0033L7029L8811M3066j4522N0371k3466l7428r292N0332o8363
$$ -99666 -86484 -66451 -29422 9389 52455 37933 88304 64838 27410 18118 68450 87
12214H7o7467J517P9645k6710N872m9304J7409Q2264N0161k8719r9926o6730j6927
$$ 87 -67380 -65863 13782 -12928 -7056 -56360 -38951 43313 93474 64755 -35171 -101901 -118828
12201a18828k0724M2998K2344m9715j1444K8153L5179L2382m8824K1575J3814
$$ -118828 -139552 -96554 -74210 -123925 -135369 -107216 -72037 -39655 -88479 -66904 -53090
12190e3090j784j9248n901N8787O1357j5979n8599l8555q9881J8386N3622N3171
$$ -53090 -54874 -74122 -80023 -21236 40121 24142 -34457 -73012 -162893 -144507 -90885 -37714
12178c7714J4180r710q591m1585o0952j7563Q3836J01489J7616J8508K9080K2012
$$ -37714 -23534 -33244 -41835 -83420 -144372 -161935 -78099 23390 41006 59514 88594 110606
12166A10606L3550M2355M2148m916l817O4030j4019J7398p4415m2775R6702M4
$$ 110606 144156 186511 228659 223743 219926 283956 269937 287335 212920 170145 266847 266891
12154B66891P458O6375M9174J2392J5303o551J00086R0893K00284K26803J53186
$$ 266891 274349 340724 389898 402290 417593 411042 511128 602021 802305 1029108 1182294
12143A182294K18324J24327M0738J03385K01270K56803K14830j6982r8769k74007
$$ 1182294 1400618 1524945 1565683 1669068 1870338 2127141 2341971 2324989 2226220 1952213
12133A952213m19446n60216m20524k00915j18084m9193m6407q9125j6210n6591
$$ 1952213 1532767 972551 552027 351112 233028 183835 137428 48303 32093 -24498
12123b4498k4327J12651O236k6411N669J6783N449K852l3309k3386L7850J3918
$$ -24498 -48825 63826 70062 43651 49320 66103 71552 74404 41095 17709 55559 69477
12111F9477m293K2833o545o4512J4525n9602p3310N1878N7434P616j7144N3898
$$ 69477 65184 88017 81472 16960 31485 -28117 -101427 -49549 7885 15501 -1643 52255
12099E2255Q227k9371K122J1523J8024o0065l1332o2880m3515m677K9318Q5836
$$ 52255 60482 31111 33233 44756 62780 2715 -28617 -91497 -135012 -139689 -110371 -24535
12087b4535p465O5673j21428n7178p211N5242O2932j4674M319l9076m3835N9709
$$ -24535 -32000 33673 -87755 -144933 -152144 -96902 -33970 -48644 -44325 -83401 -127236 -67527
12075f7527M4934N912N6863p2105l4454N6870O2017j5191p1806l7011k2927L8764
$$ -67527 -22593 -16681 40182 -31923 -66377 -9507 52510 37319 -34487 -71498 -94425 -55661
12063e5661l6148O716K7381K9928k1744j3685M0498R949p1812N419O090M6571
$$ -55661 -91809 -85093 -57712 -27784 -49528 -63213 -22715 -12766 -84578 -79159 -73069 -26498
12051b6498J1246O949j9892J8531j576l1655o0707l1378L7169q738L5113j792
$$ -26498 -15252 -8303 -28195 -9664 -11240 -42895 -103602 -134980 -97811 -106549 -71436 -73228
12039g3228l0808n8419n5770O3727J36980N2093j0541p5296n21j7204p882o7627
$$ -73228 -104036 -162455 -218225 -154498 -17518 34575 24034 -51262 -51783 -68987 -76869 -144496
12027a44496R854N8248K5963R521J6036l9109m1914k1370l436J7165M61k8595
$$ -144496 -134642 -76394 -50431 -40910 -24874 -63983 -105897 -127267 -130703 -113538 -113077 -141672
12015a41672R1213K8967M0330N815k9276k3311M2260M9396L1748n634m6791N8771
$$ -141672 -50459 -21492 18838 24653 -4623 -27934 14326 63722 95470 89836 43045 101816
12003A01816K6520j3307j6864n1569l1o1182l3086K1672Q752N7120J9772m3811
$$ 101816 128336 115029 98165 46596 46565 -14617 -47703 -26031 -17279 39841 59613 15802
11991A5802K6382K0624J9550k2641n7798j8859j991l6347L8252j2084P740j1762
$$ 15802 42184 62808 82358 59717 1919 -16940 -18931 -55278 -17026 -29110 -21370 -33132
11979c3132J2574N2378J3730k6404K1227L2097m1453M3994n9408n6815M2640K7548
$$ -33132 -20558 31820 45550 19146 40373 72470 31017 75011 15603 -41212 1428 28976
11967B8976k1747l6415l0468l3944j0708J1773O0160L0998L473J3546P494L0517
$$ 28976 7229 -29186 -59654 -93598 -104306 -92533 -32373 -1375 2098 15644 23138 53655
11955E3655O514J4971l4666l1745N095k9467k8866M0769K7856j8448N681m6644
$$ 53655 60169 75140 40474 8729 13824 -15643 -44509 -3740 24116 5668 11349 -35295
11943c5295q539J1448Q1165n5676r8209n677O7491M2324P4521K7090o340r8648
$$ -35295 -43834 -32386 48779 -6897 -105106 -110783 -43292 -968 73553 100643 94303 -4345
11931d345m7958K8931K4603q2828J7996O4306N834J3468j34164r977M4179O1443
$$ -4345 -52303 -23372 1231 -81597 -63601 705 6539 20007 -114157 -124134 -79955 -18512
11919a8512K6435M5808j5675k6860M1545l655k902L9929k8m2411k6340j1175J8810
$$ -18512 7923 53731 38056 11196 52741 49086 46184 86113 86085 43674 17334 6159 24969
11906B4969l5975q6818M0783p349L7348J8845k7592M4388K3395p6881j1778l8458
$$ 24969 -11006 -97824 -57041 -64390 -27042 -8197 -35789 8599 31994 -44887 -56665 -95123
11894i5123l2990Q6023N5453j9808j9304P5094M4732j17163n8383M1894N0025
$$ -95123 -128113 -42090 13363 -6445 -25749 49345 94077 -23086 -81469 -39575 10450
11883A0450k4564M96K478N3458q3587L4727J3852m5270k3837K8J8887J3321N0546
$$ 10450 -14114 -13618 -11140 42318 -41269 -6542 7310 -37960 -61797 -61769 -42882 -29561 20985
11870B0985l8867o914J6169j5272J1903l2821K7025L7796l252p0322j3609p6488
$$ 20985 -17882 -24796 -8627 -23899 -11996 -44817 -17792 20004 16752 -53570 -67179 -143667
11858a43667k5822J5939N2619M615l67M2456P4298o8991p132J977m982M7507m984
$$ -143667 -169489 -153550 -100931 -96316 -96683 -54227 20071 -48920 -56052 -54075 -59057 -11550 -16534
11845a6534J8607L4592n3094J7518J371k962J314j7964l3800k7625R553o4418
$$ -16534 2073 36665 -16429 1089 2460 -502 812 -17152 -50952 -78577 -69024 -133442
11833a33442j2575O9852J8633n9l6394m1547M7199L1259N6785N2995j353k8296
$$ -133442 -146017 -76165 -57532 -57591 -93985 -135532 -88333 -57074 -289 52706 51353 23057
11821B3057r612l5321J0576L1847k5489N1683p159o2916K8162m836r2881o4239
$$ 23057 13445 -21876 -11300 20547 -4942 46741 39582 -23334 4828 -8 -92889 -157128
11809a57128N4640n989l1567J3392M2614j0500K4114M3657R901n1149K6817L4541
$$ -157128 -102488 -108477 -140044 -126652 -84038 -94538 -70424 -26767 -16866 -68015 -41198 -6657
11797f657J2195M631n919L1356J8772q4831J0040J1606k3002Q8799M1650r5803
$$ -6657 5538 10169 4250 35606 54378 -30453 -20413 -8807 -31809 56990 98640 2837
11785B837J6987J792m7753l6317k3768L7468N2156N0479M7248m1109n4191o5465
$$ 2837 19824 21616 -26137 -62454 -86222 -48754 3402 53881 101129 60020 5829 -59636
11773e9636K4446j3308K0917J14730K588J721k719p3952J3275J3431J6825q3239
$$ -59636 -35190 -48498 -27581 87149 89737 91458 88739 14787 28062 41493 58318 -24921
11761b4921J2551k4364K9506M0486j6029J1306j59k0406m1814j554L2542J0900
$$ -24921 -12370 -36734 -7228 33258 17229 28535 28376 7970 -33844 -35398 -2856 8044
11749H044L0513j1049r3602n3123J6482N7558O4516M8472l2549l4818l1303K9127
$$ 8044 38557 27508 -66094 -119217 -102735 -45177 19339 67811 35262 444 -30859 -1732
11737a732o459m0948k5435P227O865L0326q729j438k5338j34770L6647O2485J9032
$$ -1732 -8191 -49139 -74574 -67347 -60482 -30156 -38885 -40323 -65661 -200431 -163784 -101299 -82267
11724h2267j6164K9160J02737L4764o8288j38298k9822N3454N7649P3991m8839
$$ -82267 -98431 -69271 33466 68230 -58 -138356 -168178 -114724 -57075 16916 -31923
11713c1923l9825M5221J3229K3866l7891k5947k9925k9981L8O8128P1389P4537
$$ -31923 -71748 -26527 -13298 10568 -27323 -53270 -83195 -113176 -113138 -45010 26379 100916
11701A00916J1281m4523o293r596o7269q467O5728K3895k8729P6359q279m1023
$$ 100916 112197 67674 61381 51785 -15484 -23951 41777 65672 36943 113302 105023 64000
11689F4000q996k6986K0453L7507m3418k3268n539q976M4314L9432J485n5916
$$ 64000 55004 28018 48471 85978 42560 19292 13753 4777 49091 88523 90008 34092
11677C4092m5132j4520K5033O2061m4151p3657K1349N6109r61l5649L2244L1861
$$ 34092 -11040 -25560 -527 61534 17383 -56274 -34925 21184 20223 -15426 16818 48679
11665D8679J3318j4377M8932l625q0407m5501o184j3216L0071L2963O202N757
$$ 48679 61997 47620 96552 92927 12520 -32981 -39165 -52381 -22310 10653 16855 22612
11653B2612K1177O9685L3954l7752k6108k0993n9915k8591J5315L6410o2003o5041
$$ 22612 43789 113474 147428 109676 83568 62575 2660 -25931 -10616 25794 -36209 -101250
11641a01250l2600P6702K5747l4295L9936n0888r6730O906K2126O3264q42L278
$$ -101250 -133850 -57148 -31401 -65696 -25760 -76648 -173378 -166472 -144346 -81082 -81924 -78646
11629g8646N9844K8463P3175M3868l6531k2295o3663r7114l0155q980k3085L6871
$$ -78646 -18802 9661 82836 126704 90173 67878 4215 -92899 -123054 -132034 -155119 -118248
11617a18248k4481L3006P4238L3759M3293l688k5269l5265k7728K8338M0932k2216
$$ -118248 -142729 -109723 -35485 -1726 41567 37879 12610 -22655 -50383 -22045 18887 -3329
11605c329k3902K297J8108m649k0067M3133N5996j9556q1501p719P4093M5734
$$ -3329 -27231 -24934 -6826 -11475 -31542 11591 67587 48031 -33470 -41189 32904 78638
11593G8638m1272L6024n6678j0024Q0202j1116q7223M7325l4706p9154m241m658
$$ 78638 37366 73390 16712 6688 86890 75774 -11449 35876 1170 -77984 -82225 -86883
11581h6883n1689j1896l975p8048K2849R2904L3569J17354M4309M5178k5171j15950
$$ -86883 -138572 -150468 -154443 -232491 -209642 -116738 -83169 34185 78494 123672 98501 -17449
11569a7449n7599Q066p153K3399J9173r808O1450l1154j9632j787O266Q7172N6433
$$ -17449 -75048 -66982 -74135 -50736 -31563 -41371 20079 -11075 -30707 -32494 -26228 60944 117377
11556A17377j5983j0765l6038p5963m8487P6529m263m6760j9806M1241P9130J963
$$ 117377 101394 90629 54591 -21372 -69859 6670 2407 -44353 -64159 -22918 56212 58175
11544E8175J4823j315m1058j7606O8706J2140l9537l1875j4471j4973m4754p654
$$ 58175 72998 71683 30625 13019 81725 93865 54328 22453 7982 -6991 -51745 -59399
11532e9399j7349P1774q401M1783M0116p2922l1245J1534P4064K859j8119m7728
$$ -59399 -76748 -4974 -13375 28408 68524 -4398 -35643 -24109 49955 52814 34695 -13033
11520a3033O4892N1576n848n8931m6218k6144o9506j6263K4185m6807J04704K0290
$$ -13033 51859 103435 97587 38656 -7562 -33706 -103212 -119475 -95290 -142097 -37393 -17103
11508a7103p576K7634J0292m5200k8848l938N4254K6425j4387K4058K8912k1895
$$ -17103 -24679 2955 13247 -31953 -60801 -64739 -10485 15940 1553 25611 54523 32628
11496C2628j7446o999l358K6203K4505m0381n2813j0499P247L1274M8226O1760
$$ 32628 15182 8183 4825 31028 55533 15152 -37661 -48160 -40913 -9639 38587 100347
11484A00347m2864j17655r4326J4911R7328O0718o2494k0178K9090L3783n6435
$$ 100347 57483 -60172 -154498 -139587 -42259 18459 -44035 -64213 -35123 -1340 -57775
11473e7775m968R750L5417P0813M0383j8683k8224m0045n2209p5002j9236O2300
$$ -57775 -62743 -52993 -17576 53237 93620 74937 46713 6668 -45541 -120543 -139779 -77479
11461g7479J6063P06k2460l1744Q9609R4258n5391m5997J6242O7904N4148K0114
$$ -77479 -61416 -60710 -83170 -114914 -25305 68953 13562 -32435 -16193 51711 105859 125973
11449A25973n3819o4252J647R560k0490J965L0463m0700O77J1963k9581l4442
$$ 125973 72154 7902 9549 19109 -1381 584 31047 -9653 -8976 2987 -26594 -61036
11437f1036R945L7051M7520l9154J5780k242J6190o2958N2831K0506m1303l3518
$$ -61036 -51091 -14040 33480 -5674 10106 7864 24054 -38904 13927 34433 -6870 -40388
11425d0388r61K0031j3745M4861J1769L7136L1347N487n2852n8724J7212L7455
$$ -40388 -41349 -21318 -35063 9798 21567 58703 90050 95537 42685 -16039 1173 38628
11413C8628j8947m6438J9278k6278k7509k1278m4054O4600K1658j5483L9523M5263
$$ 38628 19681 -26757 -7479 -33757 -61266 -82544 -126598 -61998 -40340 -55823 -16300 28963
11401B8963j7601J473o7896l2375J7087J06067q9146p7905M3617M5753l8628n7243
$$ 28963 11362 12835 -55061 -87436 -70349 35718 -53428 -131333 -87716 -41963 -80591 -137834
11389a37834J5748Q2247O3383p5436P718Q8541K8849m5840r1035P488J8949J3367
$$ -137834 -122086 -39839 23544 -51892 -44174 44367 73216 27376 -63659 -56171 -37222 -23855
11377b3855L6048j1048k1336K4873N0529l7100K1615L142r136n8032j0188O4612
$$ -23855 12193 1145 -20191 4682 55211 18111 39726 42868 33732 -24300 -34488 30124
11365C0124N355m1774n822j5254M2660q6q943J5880L2676r511K0992l4572q3982
$$ 30124 35479 -6295 -12117 -27371 15289 15203 6260 22140 54816 45305 66297 31725 -52257
11352e2257q009J9664m576O2944J09044J0186K9963K2240l8183J3028j5663q3687
$$ -52257 -60266 -40602 -45178 17766 126810 136996 166959 189199 151016 164044 148381 64694
11340F4694q5952l8376P5284O2092K7255k9945j15433k7278J1669L3625J89K9513
$$ 64694 -21258 -59634 15650 77742 104997 75052 -40381 -67659 -55990 -22365 -22176 7337
11328G337K6199J9434K8444L8570k1963n2735q7733k6816o901P0899L7974L5821
$$ 7337 33536 52970 81414 119984 98021 45286 -42447 -69263 -76164 -5265 32709 68530
11316F8530j2868j4553q5571o2561k9823O3398l0564Q790M7932l0108m1777L3940
$$ 68530 55662 41109 -44462 -107023 -136846 -73448 -104012 -95222 -47290 -77398 -119175 -85235
11304h5235L8039M700N60L0681L7358r58m845K8709j4915M241k5908K3292l5565
$$ -85235 -47196 -42496 -41936 -11255 26103 25145 20300 49009 34094 38335 12427 35719 154
11291A54l0694J2544q5297M581j654M7645R401K167N019J22301r287J6376l0742
$$ 154 -30540 -17996 -103293 -98712 -100366 -52721 -43320 -41153 -36134 86167 76880 93256 62514
11278F2514k9748J6499m7584k4125L2604P4368J7735o0802q081K8844M2661L0116
$$ 62514 32766 49265 1681 -22444 10160 84528 102263 41461 33380 62224 104885 135001
11266A35001J5327o409o0526o6996k0454J2538L4841p590o3236l1396K2745R860
$$ 135001 150328 143919 83393 16397 -4057 8481 43322 35732 -27504 -58900 -36155 -26295
11254b6295O666R884l3390j3955M6881N9895L322n9735n7148J7268J5082J9126
$$ -26295 -19629 -9745 -43135 -57090 -10209 49686 53008 -6727 -63875 -46607 -31525 -12399
11242a2399l8947N2510O4003K6923k6576l7202J5169K2613p518K09k3881K0046
$$ -12399 -51346 1164 65167 92090 65514 28312 43481 66094 58576 58785 34904 54950
11230E4950k6257M458J472n0278j7457M9325l249O1105M2894j12434l4426j1858
$$ 54950 28693 33151 34623 -15655 -33112 16213 12964 74069 116963 4529 -29897 -41755
11218d1755L0900k0321Q410L673O1400N3850P555q6223j0678L087j6219n175M4846
$$ -41755 -10855 -31176 -22766 -19093 42307 96157 103712 17489 6811 9898 -6321 -11496 33350
11205C3350j2691j45L5074N1657n8476p1158j99J9999P4268j053r8427l0336J9006
$$ 33350 20659 20514 55588 107245 48769 -22389 -22588 -2589 71679 70626 -27801 -58137 -39131
11192c9131P5659l1652k6653K1622L6318J8465j7355p4944K1333Q5753q459l3983
$$ -39131 36528 4876 -21777 -155 36163 54628 37273 -37671 -16338 69415 60956 26973
11180B6973n3505K1761m6082j13310m6030o871n695L1191P0392O1629Q5159L4259
$$ 26973 -26532 -4771 -50853 -164163 -210193 -217064 -222759 -191568 -121176 -59547 25612 59871
11168E9871L512n8255m7339j8790l9013q484k122P99n0255r526O3289j0741p586
$$ 59871 63383 5128 -42211 -61001 -100014 -108498 -110620 -109821 -160076 -169602 -106313 -117054 -124640
11155a24640O8977k740K6466Q2355J5533p9712o6794R939K7718N2483N1149J7366
$$ -124640 -55663 -58403 -31937 50418 65951 -13761 -80555 -70616 -42898 9585 60734 78100
11143G8100n9524L2397K3907m4623l165L141l6317K2902K7060k2070k9045m3098
$$ 78100 18576 50973 74880 30257 27092 30233 -6084 16818 43878 21808 -7237 -50335
11131e0335l8689o958j2956j0986K4087O1815N5102O2376K7686p6246p9703k5408
$$ -50335 -89024 -95982 -108938 -119924 -95837 -34022 21080 83456 111142 34896 -44807 -70215
11119g0215N219j1021J971j3722K7773M7991R511j2265l8906L2284N7658K6727
$$ -70215 -64996 -76017 -74046 -87768 -59995 -12004 -2493 -14758 -53664 -21380 36278 63005
11107F3005o6122q4605k5367P4064J5230j6141l2383q427j4323K811p7637P4566
$$ 63005 -3117 -87722 -113089 -39025 -23795 -39936 -72319 -80746 -95069 -92258 -169895 -95329
11095i5329P7527K861K23K8152N7468k3369o4199o674p1096n0285N5618l4595
$$ -95329 -17802 -14941 -14718 13434 70902 47533 -16666 -23340 -94436 -144721 -89103 -123698
11083a23698N026M1089P5325j6431M7765j8312m2599q937p345k1025L8791o424
$$ -123698 -118672 -77583 -2258 -18689 29076 10764 -31835 -40772 -48117 -69142 -30351 -36775
11071c6775m3844M0637J829l0149M7287m0656o8718L6329L4013N0200J6898J845
$$ -36775 -80619 -39982 -38153 -68302 -21015 -61671 -130389 -94060 -60047 -9847 7051 8896
11059H896J2806L2120L3058N7920m7374r444J3227m7715k5888l2906l6418N995
$$ 8896 21702 53822 86880 144800 97426 87982 101209 53494 27606 -5300 -41718 -35723
11047c5723k0150j3927J08118M9283j1179l5347m6800L226P8394m5374k2989K2588
$$ -35723 -55873 -69800 38318 87601 76422 41075 -5725 -2499 75895 30521 7532 30120
11035C0120l1916l9867J8399K1509M6083j6184j7392j4804r9028m3445K4790M8599
$$ 30120 -1796 -41663 -23264 -1755 44328 28144 10752 -4052 -103080 -146525 -121735 -73136
11023g3136N2785K769K5630N2366j3326l3492K2454n446j4701m7430q152K1715
$$ -73136 -20351 -17582 8048 60414 47088 13596 36050 30604 15903 -31527 -39679 -17964
11011a7964O3560p888l5545K5917J9784l3179n2752K7400K5807L8627J3355j8138
$$ -17964 45596 37708 2163 28080 47864 14685 -38067 -10667 15140 53767 67122 48984
10999D8984l9345m9609j6931J4446Q865K222K3475J7165l8903l5899L2152J9338
$$ 48984 9639 -39970 -56901 -42455 -33590 -31368 -7893 9272 -29631 -65530 -33378 -14040
10987a4040l3771O5570L13l2750j299N4338J3399l2765K6828K6397m8900j9293
$$ -14040 -47811 17759 18072 -14678 -15977 38361 51760 18995 45823 72220 23320 4027
10975D027n0238K0672R0975L1451J3336l4797k8866O715M1086K2495l4150M3618
$$ 4027 -46211 -25539 65436 96887 110223 75426 46560 53275 94361 116856 82706 126324
10963A26324m1573n1092L0978r2443j9834N6643J4547K9316J2373n1251n5936
$$ 126324 84751 33659 64637 -27806 -47640 9003 23550 52866 65239 13988 -41948
10952d1948L4475O7097P1399j8392k7709k4193k0129j8748n9502k6604P887J2200
$$ -41948 -7473 59624 131023 112631 84922 60729 40600 21852 -37650 -64254 -56367 -44167
10940d4167M6225J9278M374j2201j2789P791k9929n5460K2036J07347K6055m5523
$$ -44167 2058 21336 25710 13509 720 8511 -21418 -76878 -54842 52505 78560 33037
10928C3037m8511k7748K8868M3220L2707o513l5000O1633k5032k0679k6688M1852
$$ 33037 -15474 -43222 -14354 28866 61573 55060 20060 81693 56661 35982 9294 51146
10916E1146j8203k3736m873Q86J2940n55Q975J8443N8132J9829l5667m3169m2490
$$ 51146 32943 9207 4334 5220 18160 17605 26580 45023 103155 122984 87317 44148 1658
10903A658L7685j1375n664m7716k1546L0360r950l1677L7570M9560n5797J0906
$$ 1658 39343 27968 22304 -25412 -46958 -16598 -26548 -58225 -20655 28905 -26892 -15986
10891a5986k0845k7720K686K0865m1681L8051Q6349m3482r018M1693m7995P805
$$ -15986 -36831 -64551 -61865 -41000 -82681 -44630 41719 -1763 -10781 30912 -17083 -9278
10879i278K9755k799N6561M788m7486k9541M713L7955j8634J4362k5555j8669
$$ -9278 20477 17678 74239 79027 31541 2000 6713 44668 26034 40396 14841 -3828
10867c828L5259m1780P009J1369j3914l8614M454M2294L0363J209J9588K6034
$$ -3828 31431 -10349 -3340 8029 -5885 -44499 -40045 2249 32612 33821 53409 79443
10855G9443K3902p8838j58742j0344K7941J8480O0061M9682K0417n4927p1545
$$ 79443 103345 24507 -134235 -144579 -116638 -98158 -38097 11585 32002 -22925 -94470
10844i4470K5797k3211P80k6986J7403N0737J5390n2351j669j3995j0810L3136
$$ -94470 -68673 -91884 -91104 -118090 -100687 -49950 -34560 -86911 -88580 -102575 -113385 -80249
10832h0249j4899k5562K7622R9847O3153Q8986M2059p5642r2508k8423l5509J2438
$$ -80249 -95148 -120710 -93088 6759 69912 158898 200957 125315 32807 4384 -31125 -18687
10820a8687N7338n698M09M0249j1186P307r2249n491J20608j2287o1475j4398
$$ -18687 38651 32953 33362 73611 62425 69732 -22517 -28008 92600 80313 18838 4440
10808D440o8464J268O1443K2897r954K4186o3503L6845N3283j0337m0437q277
$$ 4440 -64024 -62756 -1313 21584 11630 35816 -27687 9158 62441 52104 11667 3390
10796C390j3072k8076K2215L6322q2399K6726J4488k2494L8678j4115j2208N8067
$$ 3390 -9682 -37758 -15543 20779 -61620 -34894 -20406 -42900 -4222 -18337 -30545 27522
10784B7522m0787j24974l9827Q0852N0123N9234O1177k9972j19758j2851P3882
$$ 27522 -13265 -138239 -178066 -97214 -47091 12143 73320 43348 -76410 -89261 -15379
10773a5379J5352k0926J4571j0295k3778J3174M8459m991J3773L5799l2912l2959
$$ -15379 -27 -20953 -6382 -16677 -40455 -27281 21178 16187 29960 65759 32847 -112
10761a12M4174K6993P0854k1522p9740j5959k0120n8562L81p350M150j9077j4262
$$ -112 44062 71055 141909 120387 40647 24688 4568 -53994 -53613 -60963 -56813 -75890 -90152
10748i0152K8584J6140N9329n8347K6773j421k2649l882M6449J8825p7942k6219
$$ -90152 -61568 -45428 13901 -44446 -17673 -19094 -41743 -45625 824 19649 -58293 -84512
10736h4512m4634j4872J5084L2646N2235J6815l4788k1851M8030P599j8391p191
$$ -84512 -129146 -144018 -128934 -96288 -44053 -27238 -62026 -83877 -35847 -28248 -46639 -53830
10724e3830j9757J0525M6292O9326Q439j1288l8969j1743k6051J1025M424O6329
$$ -53830 -73587 -63062 -16770 52556 60995 49707 10738 -1005 -27056 -16031 -11607 54722
10712E4722K170l6454p957n878Q776p0048n646j5816K0369k4502M146r0571q052
$$ 54722 56892 20438 12481 6603 15379 -54669 -60315 -76131 -55762 -80264 -76118 -166689 -174741
10699a74741N3710J1269m2707m938L1139N1357J1046L4320K4112r122J4107L0382
$$ -174741 -121031 -109762 -152469 -157407 -126268 -74911 -63865 -29545 -5433 -14555 -448 29934
10687B9934l6143k9978J4011J6002R927J1054K3138K7900J5528j5243m533L8525
$$ 29934 -6209 -36187 -22176 -6174 3753 14807 37945 65845 81373 66130 61597 100122
10675A00122M8196N5099m3551p1155j9948Q490p325k4431l8052m6434L9836P3830
$$ 100122 148318 203417 159866 88711 68763 77253 69928 45497 7445 -38989 847 74677
10663G4677K4953l9124J7657L7203j8885n1180j4695K7830J6800o7421p72M6906
$$ 74677 99630 60506 78163 115366 96481 45301 30606 58436 75236 7815 7043 53949
10651E3949L4512J721k8965L1874k193j1184J3497j3919L2292q2355k0354j1202
$$ 53949 88461 90182 61217 93091 90898 79714 93211 79292 111584 29229 8875 -2327
10639b327o2622J0533k084j6503M1626N4059k632J5591N952n8088m6436M8345
$$ -2327 -64949 -54416 -56500 -73003 -31377 22682 20050 35641 41593 -16495 -62931 -14586
10627a4586M1326L4148m0745L5391j5275l6107p9058L9500K7973O6537P8632N4166
$$ -14586 26740 60888 20143 55534 40259 4152 -74906 -35406 -7433 59104 137736 191902
10615A91902n0783r7974O932j4803j1591k2358j4548K3765o676n965J7574N1699
$$ 191902 141119 43145 50077 35274 23683 1325 -13223 10542 3866 -2099 15475 67174
10603F7174J3163O618r2202l0376L8553L772O354K5118n5154j6171K3726N100
$$ 67174 80337 86955 -5247 -35623 2930 6702 13056 38174 -16980 -33151 -9425 -4325
10591d325j8175k955j9788l6739N011P0670M2666m3208k00J5385r807p9666j7878
$$ -4325 -22500 -25455 -45243 -81982 -76971 -6301 36365 -6843 -7043 8342 -1465 -81131 -99009
10578i9009P9730N9254k9728l6053M1886J8007J0732J6382j8453m2919l2686K3705
$$ -99009 -19279 39975 10247 -25806 16080 34087 44819 61201 42748 -171 -32857 -9152
10566i152L2520o834R5297J26691K5313k5716k7026m9820p0020k0054J060p0377
$$ -9152 23368 16534 111831 238522 263835 238119 211093 161273 91253 71199 72259 1882
10554A882l0442k4033N753J2935J6268K3641N6506K2597o3165q3935p1737L8876
$$ 1882 -28560 -52593 -46840 -33905 -17637 6004 62510 85107 21942 -61993 -133730 -94854
10542i4854J11486J899k0845j7863M6056J5841p2128n0303j810J12759n2804j8339
$$ -94854 16632 18531 -2314 -20177 25879 41720 -30408 -80711 -82521 30238 -22566 -40905
10530d0905K0553L3370K1723j9036n4861L2065L7596J1300k2983r806M9896M2730
$$ -40905 -20352 13018 34741 15705 -39156 -7091 30505 41805 18822 9016 58912 101642
10518A01642l845o7171p8326o3078o6641j6313P7022L0433K8638Q5048j6794n1709
$$ 101642 97797 30626 -47700 -110778 -177419 -193732 -116710 -86277 -57639 27409 10615 -41094
10506d1094N6359N3671K5014j6440l0239l0196Q5680J5719n1613p2537k0220Q0001
$$ -41094 15265 68936 93950 77510 47271 17075 102755 118474 66861 -5676 -25896 54105
10494E4105N624j4627O5886P0036k7357j07731p8939p3205K4950q412P2011L6758
$$ 54105 59729 45102 110988 181024 153667 45936 -33003 -106208 -81258 -89670 -17659 19099
10482A9099o6589l1989L2718N0051k6429j6696k2220m0234J6965O1381N6057O0619
$$ 19099 -47490 -79479 -46761 3290 -23139 -39835 -62055 -102289 -85324 -23943 32114 92733
10470I2733j7284m8124p6812n6042M9644P1315L4260K8002o1941o136k2806j0572
$$ 92733 75449 27325 -49487 -105529 -55885 15430 49690 77692 15751 9615 -13191 -23763
10458b3763r355k6638Q3320P0333L7688j6318p6061n5143L628N2927k8702k8607
$$ -23763 -33118 -59756 23564 93897 131585 115267 39206 -15937 -12309 40618 11916 -16691
10446a6691K7847J8409j5700m8893m0861K9887k5709k4178L5690K3543J4187l8393
$$ -16691 11156 29565 13865 -35028 -75889 -46002 -71711 -95889 -60199 -36656 -22469 -60862
10434f0862J9451L190J5116k7069N1190J8381m5885L5239K5279j3442k0898L3706
$$ -60862 -41411 -38221 -23105 -50174 1016 19397 -26488 8751 34030 20588 -310 33396
10422C3396J0494j4845j00430m2993m2143J19008J024k51M9693K2437L8557L2823
$$ 33396 43890 29045 -71385 -114378 -156521 -37513 -36489 -36740 12953 35390 73947 106770
10410A06770L961k0111j7975l1400L0398r1563Q603j5592p1q865J0819L0454m4927
$$ 106770 110731 90620 72645 41245 71643 -19920 -11317 -26909 -26980 -35845 -25026 5428 -39499
10397c9499l4516Q7085Q5117L9585N563l6008Q037k674J286o6840m6089L9874
$$ -39499 -74015 13070 98187 137772 143335 107327 115364 112690 113976 47136 1047 40921
10385D0921k635o7343K2802J3841K394J2010J3953J0332Q0998p014J1057N0251
$$ 40921 38286 -29057 -6255 7586 9980 21990 35943 46275 127273 120259 131316 181567
10373A81567q650r2946r2687R371K3325o9579o891M5456q1447l350P7782Q1246
$$ 181567 172917 79971 -12716 -3345 19980 -49599 -56490 -11034 -92481 -95831 -18049 63197
10361F3197J5779K371l7303m2764O2043l4180J4444K0878m5974N7309N7100l1510
$$ 63197 78976 81347 44044 1280 63323 29143 43587 64465 18491 75800 132900 101390
10349A01390p3828o827o995K4095N2715J6696j7591m6096O0109l2826K0822J07898
$$ 101390 27562 20735 13740 37835 90550 107246 89655 43559 103668 70842 91664 199562
10337A99562j07200j6019L321j3174k6990r199q1520o6312K4964R0998L5118n002
$$ 199562 92362 76343 79664 66490 39500 30301 -51219 -117531 -92567 -1569 33549 28547
10325B8547J0786l296k415P472P2890l275l3413q7412k9556J5689l0366L611R0229
$$ 28547 39333 36037 33622 41094 113984 110709 77296 -10116 -39672 -23983 -54349 -50738 39491
10312C9491N0202n0931j01623M1902P3172O0820P3922l2851q3230l7294M32j651
$$ 39491 89693 38762 -62861 -20959 52213 113033 186955 154104 70874 33580 34012 32361
10300C2361n809l8171M4404Q852l7030m1339J4509M3795J6388k888r33K3139k8109
$$ 32361 26552 -11619 32785 41637 4607 -36732 -22223 21572 37960 35072 34139 57278 29169
10287B9169j1665J1948K6386M8983l3889o7239L8604M9376Q539J6374J8432n0629
$$ 29169 17504 29452 55838 104821 70932 3693 42297 91673 100212 116586 135018 84389
10275H4389J2526j2694K0187j4097p2171j1584K9051n0502N2268q81K0795K7191
$$ 84389 96915 84221 104408 90311 18140 6556 35607 -14895 37373 36492 57287 84478
10263H4478K6392l4007J3975k9603L7226L2304j9671k267l9199K1691n7237l8810
$$ 84478 110870 76863 90838 61235 98461 130765 111094 108827 69628 91319 34082 -4728
10251d728n399M3781O7893k294K5415j7968L9076L8489n4918m5830k0013L380
$$ -4728 -10127 33654 101547 99253 124668 106700 145776 184265 129347 83517 63504 66884
10239F6884q821m6606k9468K1196O2814L458k6695J3814m4119q8912L765M3004
$$ 66884 58063 11457 -18011 3185 65999 69457 42762 56576 12457 -76455 -72690 -29686
10227b9686n3278K6954Q0299r316P861R72J2773q250n847K251P483M519N1136
$$ -29686 -82964 -56010 24289 14973 22834 23806 36579 28329 22482 24733 32216 36735 87871
10214H7871k2079n2115l3051j2929K720k18m2524o2533J33188Q6155n1310n7356
$$ 87871 65792 13677 -19374 -32303 -29583 -29801 -72325 -134858 -1670 84485 33175 -24181
10202b4181l9288L0403l4842Q922K984j301p500j871O8202m5128m2799n887N470
$$ -24181 -63469 -33066 -67908 -58986 -56002 -57303 -64803 -66674 1528 -43600 -86399 -92286 -86816
10189h6816K501N3903J7479N8220J4731p4762l7798M8493P3522n941L1521p3907
$$ -86816 -84315 -30412 -12933 45287 60018 -14744 -52542 -4049 69473 63532 95053 21146
10177B1146j28688n0891R6239K2708m14O4109M4108n1246j8361j3147n320k8217
$$ 21146 -107542 -158433 -62194 -39486 -39900 24209 68317 17071 -1290 -14437 -19757 -47974
10165d7974j11M3168P1060k4027l0818J2609j4629k2403M2488J4892j1943l0123
$$ -47974 -48085 -4917 66143 42116 11298 23907 9278 -13125 29363 44255 32312 2189
10153B189j5559K5371J0506J3748L1135k3830j8667k8765j1724M8760m3160n2189
$$ 2189 -13370 12001 22507 36255 67390 43560 24893 -3872 -15596 33164 -9996 -62185
10141f2185n4210N3971P5497K0263M1269P652k2179l2276k9295K4814N2484O9315
$$ -62185 -116395 -62424 13073 33336 74605 82257 60078 27802 -1493 23321 75805 145120
10129A45120M0345q8190j1224j8952K0175l628r5481k4010L3774O9474p9420o8213
$$ 145120 185465 97275 86051 67099 87274 83646 -11835 -35845 -2071 67403 -12017 -80230
10117h0230N644L3430k849qP56n5742L809L8042o880n9534j6817K6334Q7747N8985
$$ -80230 -74586 -41156 -44005 -44013 -43257 -98999 -95190 -57148 -64028 -123562 -140379 -114045 -26298 32687
10103C2687M8036K6608p5481n0422L6488O6953N0018O2247L3107L4977L061m3639
$$ 32687 80723 107331 31850 -18572 17916 84869 134887 197134 230241 265218 268279 224640
10091B24640j5334J2474l9589J0537M1261m6602n7086j8042L2130Q9197l3074
$$ 224640 209306 221780 182191 192728 233989 187387 130301 112259 144389 233586 200512
10080B00512R5160R0709Q3237R9829L8291L7014O7855M7813M0162M4014J6592
$$ 200512 295672 386381 469618 569447 607738 644752 712607 760420 800582 844596 861188
10069H61188k685N6085J10006J82022K65981L82585N08948N67941N26870L15285
$$ 861188 858503 914588 1024594 1206616 1472597 1855182 2364130 2932071 3458941 3774226
10059C774226Q6876J24486K73781N23039Q14116M46771j15305m01875r49247j404047
$$ 3774226 3861102 3985588 4259369 4782408 5596524 6043295 5927990 5526115 4576868 3172821
10049C172821j209311p20505m09672k33533k4060o8641q7732p3290n2525n5413
$$ 3172821 1963510 1243005 833333 599800 575740 507099 419367 346077 293552 238139
10039B38139l0755l3308p3236K0212M5566N0635L0136L7139j8140j523k2521m8418
$$ 238139 207384 174076 100840 121052 166618 217253 247389 284528 266388 264865 242344 193926
10027A93926K5167L53k2347k0162J7052m9116K4217L7563o2100p094R5869J2225
$$ 193926 219093 219446 197099 176937 193989 144873 169090 206653 144553 137459 233328 245553
10015B45553n5612o1745r403k5823m648p4692k3470M1352N2593L8214M4186j0422
$$ 245553 189941 128196 118793 92970 88322 13630 -9840 31512 84105 122319 166505 156083
10003A56083K0099l9421j19880j8366L85J3104l7705L7022O1733N1387r514p0979
$$ 156083 176182 136761 16881 -1485 -1100 12004 -25701 11321 73054 124441 114927 43948
9991D3948q4584N4365N0542m80j5025k0073l7587P3742P6390j8679l7810k6614
$$ 43948 -40636 13729 64271 63791 48766 28693 -8894 64848 141238 122559 84749 58135
9979E8135q6753j1210J27174M1796M5466J9910q3933p0864Q008k4352K9630J3749
$$ 58135 -28618 -39828 87346 129142 174608 194518 110585 39721 47729 23377 53007 66756
9967F6756n6444K3880K1266k096n1224j7810l560K3737q700M0932j0446j8479
$$ 66756 10312 34192 55458 53362 2138 -15672 -19232 4505 -4195 36737 26291 7812
9955G812K9288L6036M9827j6822k7620n495L2085J3083j2966m4863K674O5228
$$ 7812 37100 73136 122963 106141 78521 73026 105111 118194 105228 60365 63039 128267
9943A28267K0266m3826k8210q0861P970J8612J5699J7826k8303n160J6761K3993
$$ 128267 148533 104707 76497 -4364 3606 22218 37917 55743 27440 22280 39041 63034
9931F3034l0796j6630L0780O7491m8192k479l0568k8067K7551K7375O8931J2541
$$ 63034 32238 15608 46388 113879 65687 63208 32640 4573 32124 59499 128430 140971
9919A40971k9813m9541q5596n2527O0566M6831j6959k5682M7341K7442J5455j535
$$ 140971 111158 61617 -23979 -76506 -15940 30891 13932 -11750 35591 63033 78488 76953
9907G6953m1446P5826M3973m3119Q334m656l407n1302p6349J6880R5151M5908
$$ 76953 35507 111333 155306 112187 120521 115865 112458 61156 -15193 1687 96838 142746
9895A42746J6672k9751p5882m2213J477O4230j047p240l9304l5177J2810O5086
$$ 142746 159418 129667 53785 11572 13049 77279 76232 68992 29688 -5489 7321 72407
9883G2407K0699j3921O3046K656m6919K517l7175l2614j8835O4678N9583l6467
$$ 72407 93106 79185 142231 144887 97968 100485 63310 30696 11861 76539 136122 99655
9871I9655R722k8682o7097M316Q2255M6296l3683l731J4795j13475k7924P443
$$ 99655 109377 80695 13598 17914 100169 146465 112782 109051 123846 10371 -17553 -10110
9859a0110N702K0812o115K5333m1849M563L4417j3408K898k1196L6322P9404j4290
$$ -10110 -4408 16404 10289 35622 -6227 -1664 32753 19345 22243 1047 37369 116773 102483
9846A02483n0976j3466k4299N6890Q34l192j0275m0869j509O0997N9627K2741
$$ 102483 51507 38041 13742 70632 71466 68274 57999 17130 15621 76618 136245 158986
9834A58986o9526r1182l4477R8161O6265p8159J3926O0002k3935q183K6351O547
$$ 158986 89460 -1722 -36199 61962 128227 50068 63994 123996 100061 91878 118229 124776
9822A24776R681j3803k6131j3880Q086j15888M988L5648R225j7046l2518P7812
$$ 124776 134457 120654 94523 80643 88729 -27159 -22171 13477 22702 5656 -26862 50950
9810E0950K6485o8670n5764J4289M7230M0633m0960Q644l3210r132P0708J3831
$$ 50950 77435 8765 -46999 -32710 14520 55153 14193 22837 -10373 -19505 51203 65034
9798F5034k9857l3043m822M4413O6431P0800o278j3074p7261l1232k650J1413
$$ 65034 35177 2134 -2688 41725 108156 178956 172678 159604 82343 51111 48461 59874
9786E9874L9530l6279j001l14J7272M1264L9539n4808j08173l1374J30709P0388
$$ 59874 99404 63125 62124 61810 79082 120346 159885 105077 -3096 -34470 96239 166627
9774A66627p2012r4261k8970K4206L1808j0257M9378O3063k6133j5957p2035N7330
$$ 166627 94615 354 -28616 -4410 27398 17141 66519 129582 103449 87492 15457 72787
9762G2787M5816k2059O378J0949k4288k832L5814l4069m2585J07861O305m0473
$$ 72787 118603 96544 102922 113871 89583 86751 122565 88496 45911 153772 160077 119604
9750A19604K2597k6345J7280j6252k8618M9296j9741o3595R753j6893n0277j2579
$$ 119604 142201 115856 133136 116884 88266 137562 117821 54226 63979 47086 -3191 -15770
9738a5770K9810R878n3382J0774M3902k4091J8121K0251m0837l130M76L9222M5079
$$ -15770 14040 23918 -29464 -18690 25212 1121 19242 39493 -1344 -4474 -3998 35224 80303
9725H0303J7517K5881J9974l236k5827l0339l8115l3538O3010K6839K0752l9475
$$ 80303 97820 123701 143675 140439 114612 84273 46158 12620 75630 102469 123221 83746
9713H3746K7993m2760l933L7014L0495l2310o4256J1772L0709k7437l76J344l175
$$ 83746 111739 68979 65046 102060 132555 100245 35989 47761 78470 51033 50657 52001 48826
9700D8826K1011M2119L1677r655l5978l1067N0998L636m0518M0487k9748K7249
$$ 48826 69837 111956 143633 133978 98000 66933 117931 121567 81049 121536 91788 119037
9688A19037M1508n7295j86M0728O05M7005J2500m5913j0447m3499p4900j4903
$$ 119037 160545 103250 103064 143792 144397 191402 203902 157989 147542 104043 29143 14240
9676A4240K7366J1450N3723K8134l5802R925k6262K3737M0510K4657j6518N343
$$ 14240 41606 53056 106779 134913 99111 109036 82774 106511 147021 171678 155160 160503
9664A60503o7602L434m956k2889o1676N256K5661l5044Q116M3572L6750l8516
$$ 160503 92901 96335 91379 68490 6814 12070 37731 2687 10803 54375 91125 52609
9652E2609j4547J1655O2483L2170k3857K071K6291M4173j9766o681l961m4519
$$ 52609 38062 49717 112200 144370 120513 122584 148875 193048 173282 166601 162640 118121
9640A18121N0453K6577r9965k1026Q6587K5558N272j1170r399j6668L1669K2569
$$ 118121 168574 195151 95186 74160 160747 186305 191577 180407 171008 154340 186009 208578
9628B08578L2529j5441O6606M4291l9425K393j632o050n9894m0023k9248m1140
$$ 208578 241107 225666 292272 336563 297138 299531 297899 291849 231955 191932 162684 121544
9616A21544O6668K2710K6448l41n4962k9549j8710r07M8665J9569L3027l1101
$$ 121544 188212 210922 237370 237029 182067 152518 133808 132901 181566 201135 234162 203061
9604B03061p860P0313n141Q165p8181k4554m1726j2322k7847l9332l745Q4585
$$ 203061 195201 265514 260373 268538 190357 165803 124077 111755 83908 44576 40831 125416
9592A25416J7967l628M2445l4132j0363K4529m5068k9568L8723M109k7692n2155
$$ 125416 143383 139755 182200 148068 137705 162234 117166 87598 126321 130430 102738 50583
9580E0583j5694n795K4379L0553j4117Q8089J23907j4855r6533p388k5079M3017
$$ 50583 34889 29094 53473 84026 69909 157998 281905 267050 170517 163129 138050 181067
9568A81067J0282r7095q474J22899L5807j01365q0747K1114K6215l5863N8919
$$ 181067 191349 94254 85780 208679 244486 143121 62374 83488 109703 73840 132759
9557A32759L9627p2473l7409J2131M5745q2660k2989n2041N7649O0225L9855o6057
$$ 132759 172386 99913 62504 74635 120380 37720 14731 -37310 20339 80564 120419 54362
9545E4362n9734k2714M245J2741n6911m7828O4446O5952L7123o334J0603m7125
$$ 54362 -5372 -28086 -23841 -11100 -68011 -115839 -51393 14559 51682 45348 55951 8826
9533H826K3734K1951O3598l7321O101M0603K7247l1045J0515M3893n1775m4090
$$ 8826 32560 54511 118109 80788 86889 127492 154739 123694 134209 178102 126327 82237
9521H2237m4715k3513L0726K517L0357O26K0992Q8273j8096p9972j5068r109m4397
$$ 82237 37522 14009 44735 47252 77609 78235 99227 187500 169404 89432 74364 65255 20858
9508B0858O116N185k895M6908j6316p8152J5055N3980K9438q789k8651l8611Q632
$$ 20858 26974 32159 29264 76172 59856 -18296 -3241 50739 80177 71388 42737 4126 12758
9495A2758r65J6146j7209O092M3247p218l0471L735j1022l0741N8187O8316M5803
$$ 12758 11793 27939 10730 16822 60069 52851 22380 26115 15093 -15648 42539 110855 156658
9482A56658J0418j6052l2922j5607m084n841K356k0583n0844M7598J5444J5259
$$ 156658 167076 151024 118102 102495 98411 92570 94926 74343 23499 71097 86541 101800
9470A01800Q654m0090k0134r756M9718J4967m1568q414J7804L410P2086R818q4395
$$ 101800 110454 70364 50230 40474 90192 105159 63591 55177 72981 76391 148477 158295 73900
9457G3900m5620L8067M6191J0753l6427O783J0708l5781k0602L0861O088m1671
$$ 73900 28280 66347 112538 123291 86864 93647 104355 68574 47972 78833 84921 43250
9445D3250k6280n71l8034Q084q747O0132K3261l0253K0813L1173M072l689L0342
$$ 43250 16970 16399 -21635 -13551 -22298 37834 61095 30842 51655 82828 86900 83211 113553
9432A13553o1733L6299M636o6965J2357J7799l0024p5433l168j5194L0641L6403
$$ 113553 51820 88119 92755 25790 38147 55946 25922 -49511 -52679 -67873 -37232 -829
9420h29O3966N8929m3965l4116o4793K2570Q5173J9289K5749o502m5151o4381
$$ -829 63137 122066 78101 43985 -20808 1762 86935 106224 131973 125471 80320 15939
9408A5939N963j0474k5834K0913l5333K6102N3239Q2736N0661L7143p167l4331
$$ 15939 21902 11428 -14406 6507 -28826 -2724 50515 133251 183912 221055 213888 179557
9396A79557l7769m6761l0022L4672m7320o1781K283K3012O4446k3429n766m6051
$$ 179557 141788 95027 65005 99677 52357 -9424 -7141 15871 80317 56888 51122 5071
9384E071n0909k004L9065R5429j2953o4122J0935M4153M4771m1019O19K968J5385
$$ 5071 -45838 -47842 -8777 86652 73699 9577 20512 64665 109436 68417 69036 72004 87389
9371H7389j3528J011p729J737l7714K713o8994L5890P3180M5118k8376J0253J4364
$$ 87389 73861 74872 67143 68880 31166 33879 -35115 775 73955 119073 90697 100950 115314
9358A15314n988j0430L3845N2626j19567n7611M5133o210J7880l6975K3559P1951
$$ 115314 109326 98896 132741 185367 65800 8189 53322 47112 64992 28017 51576 123527
9346A23527j2653n7338j0541M498O7760M9257k0933k8504m7145J6444P322r575
$$ 123527 110874 53536 42995 47493 115253 164510 143577 115073 67928 84372 91694 82119
9334H2119k3983J8519N8170o3510K9380O0990q0557l6910n9214j2729M7345L9327
$$ 82119 58136 76655 134825 71315 100695 161685 81128 44218 -14996 -27725 19620 58947
9322E8947o899M3754O1173l1502k8349k4641N565K2338n8945j5463J3274n2286
$$ 58947 52048 95802 156975 125473 97124 72483 78048 100386 41441 25978 39252 -13034
9310a3034o2O4608K5345K3367P892n027l7971m607J3167O4405L3450Q318k8800
$$ -13034 -13096 51512 76857 100224 108116 103089 65118 60511 73678 138083 171533 179851 151051
9297A51051J3190K4553m1046r0108n3262r510Q844L5954J5847k4500l0761l4876
$$ 151051 164241 188794 147748 57640 4378 -5132 3712 39666 55513 31013 252 -34624
9285c4624J9405K1540j2323j2160K9027N0267j8085p513J9472n1411q1725N7314
$$ -34624 -15219 6321 -6002 -18162 10865 61132 43047 35534 55006 3595 -78130 -20816
9273b0816Q5712N6896M2402o2696m781M5365N5958j102k5404r3294l9723M1845
$$ -20816 64896 121792 164194 101498 96717 142082 198040 196938 171534 78240 38517 80362
9261H0362K4530j4724O724J19755K2684j13196n2261k527j0988k9511m6375J4871
$$ 80362 104892 90168 96892 216647 239331 126135 73874 71347 60359 30848 -15527 -656
9249f56K0290J341N2843K7035j529k2463k547Q269J3780o3511j187M8958p1110
$$ -656 19634 20975 73818 100853 99324 76861 74314 82583 96363 32852 31665 80623 9513
9236I513P090Q4455K7422k8042p0969n6365M0439O5409P3588o2109l1261l8647
$$ 9513 16603 101058 128480 100438 29469 -26896 13543 78952 152540 90431 59170 20523
9224B0523L82J1993J6084J3323J5312K3373j4015L6578n2379K286o8297m69J3310
$$ 20523 20905 32898 48982 62305 77617 100990 86975 123553 71174 73460 5163 4694 18004
9211A8004P2101J3906j9737O874j21456K0059j775j3747j5647L8221J5738l8382
$$ 18004 90105 104011 84274 91148 -30308 -10249 -12024 -25771 -41418 -3197 12541 -25841
9199b5841L3659O357J0479J0578j16991J9114Q1490O9948r250p2091K3610O8413
$$ -25841 7818 14175 24654 35232 -81759 -62645 18845 88793 79543 7452 31062 99475
9187I9475k9679L5513Q930n0566l1403M0101Q4282l7945n7449K2648k4209n1511
$$ 99475 69796 105309 114239 63673 32270 72371 156653 118708 61259 83907 59698 8187
9175H187j2870n573L4565N6441j409J3902l8422k1214j7700q8545m1191P0150
$$ 8187 -4683 -10256 24309 80750 79341 93243 54821 33607 15907 -72638 -113829 -43679
9163d3679Q9946M6113K8045K2882n5017j1111N9237M5540j3593o1384k0891J5267
$$ -43679 46267 92380 120425 143307 88290 77179 136416 181956 168363 106979 86088 101355
9151A01355n833M3721m2123K6460q5282q3960k5585M0544L5080K1901J4964R938
$$ 101355 95522 139243 97120 123580 38298 -45662 -71247 -30703 4377 26278 41242 51180
9139E1180L2483K9473k7710K4006l5299m8381K2178L4870K4051j3910l9557j6366
$$ 51180 83663 113136 85426 109432 74133 25752 47930 82800 106851 92941 53384 37018
9127C7018L0242N1669n5777j6612K7726j0996K8517Q952O216o459J4234K3489
$$ 37018 67260 118929 63152 46540 74266 63270 91787 100739 106955 100496 114730 138219
9115A38219j6247M950l2427k826N0788l5208k7275K2008K4842o6237p0397O3409
$$ 138219 121972 126922 94495 91669 142457 107249 79974 101982 126824 60587 -9810 53599
9103E3599O3057K1339q0289m39P3949o764k6853M8639L891k3694j82k938m6927
$$ 53599 116656 137995 57706 57267 131216 124452 97599 146238 150129 126435 126253 123315 76388
9090G6388k8377L4365K1595r1491n5091K6271L0753P3328L5238n6759l3956m4374
$$ 76388 48011 82376 103971 12480 -42611 -16340 14413 87741 122979 66220 32264 -12110
9078a2110L4497L6826N2023N3606n2050k9157k8634N9243M0807k7070q023j4116
$$ -12110 22387 59213 111236 164842 112792 83635 55001 114244 155051 127981 119958 105842
9066A05842o2532l7027J7973L6828J8316P0698K7683k838J6561k1429k2963m2511
$$ 105842 43310 6283 24256 61084 79400 150098 177781 174943 191504 170075 147112 104601
9054A04601N768r602K2734J1135j7175J6704l0957n9181K6821J34681N4718l8507
$$ 104601 110369 100767 123501 134636 117461 134165 103208 44027 70848 205529 260247 221740
9042B21740j34814m9086P6980K9993k6263m3138p6583m4340P5060K2226n9964
$$ 221740 86926 37840 114820 144813 118550 75412 -1171 -45511 29549 51775 -8189
9031h189m5882k5496O0190O0905N9052K2714r3302l9156O7291n3787J0514j578
$$ -8189 -54071 -79567 -19377 41528 100580 123294 29992 -9164 58127 4340 14854 13276
9019A3276j4840m1673q462J2306J30623Q163k1624m4575n9632M1741O7766n7594
$$ 13276 -1564 -43237 -51699 -39393 91230 99393 77769 33194 -26438 15303 83069 25475
9007B5475n2628L9939K4410M1844J9417R891L8531J3692j6853j1428j7046p7384
$$ 25475 -27153 12786 37196 79040 98457 108348 146879 160571 143718 132290 115244 37860
8995C7860k4117K2103L2571R052l6573j3506o495k8399n6048K1978K6945j3643
$$ 37860 13743 35846 68417 77469 40896 27390 20895 -7504 -63552 -41574 -14629 -28272
8983b8272p6697l473l5489L5658O2212L3940N5958K1736L7814M7370j8138k2690
$$ -28272 -104969 -108442 -143931 -108273 -46061 -12121 43837 65573 103387 150757 132619 109929
8971A09929R079m1868o5538l9428N417K0119M2659J4526P946o192M3838n8418
$$ 109929 119008 77140 11602 -27826 -22409 -2290 40369 54895 62841 56649 100487 42069
8959D2069J6484M0881o6664O616J799l1675n5012N2113J3661j8888l6032L7639
$$ 42069 58553 99434 32770 39386 41185 9510 -45502 6611 20272 1384 -34648 2991
8947B991k2668j293J3566N027M8025J3559K0472m5320P812J9391Q926k1275k7053
$$ 2991 -19677 -20970 -7404 -2377 45648 59207 79679 34359 42171 61562 70488 49213 22160
8934B2160O7375K7731K8704J8173l6800o7591o033k6852p319J7326K1959N090
$$ 22160 89535 117266 145970 164143 127343 59752 53719 26867 19548 36874 58833 63923
8922F3923r895n0803L2841k0342J7854K2663k9056n8581q804N3448l4583p3941
$$ 63923 54028 3225 36066 15724 33578 56241 27185 -31396 -40200 13248 -21335 -95276
8910i5276N1798K5912k5965J5685M3949J4515j3429p153Q936L9531j8846L2203
$$ -95276 -43478 -17566 -43531 -27846 16103 30618 17189 10036 18972 58503 39657 71860
8898G1860k344j4372o0031j6197K8517l0366p488J7605k8223K9630N9107P6848
$$ 71860 69516 55144 -4887 -21084 7433 -22933 -30421 -12816 -41039 -11409 47698 124546
8886A24546J2825l4788m5513J1646K4537N950k5699K4505Q3209j5674j3204o7123
$$ 124546 137371 102583 57070 68716 93253 99203 73504 98009 181218 165544 152340 85217
8874H5217q8244K1269j266o489k905K6029l7112n2515K9302k3072O8236M8178
$$ 85217 -3027 18242 16976 10487 7582 33611 -3501 -56016 -26714 -49786 18450 66628
8862F6628j6637q4987k859M4631L0659l472k7306k1913J5308M0781k5909k3163
$$ 66628 49991 -34996 -37855 6776 37435 33963 6657 -15256 52 40833 14924 -8239
8850h239k384M9610M3665j9200m127m3933j3537Q982j8556j7322L246n084M5986
$$ -8239 -10623 38987 82652 63452 59325 15392 1855 10837 -7719 -25041 -21795 -26879 19107
8837A9107K743K4376j3066K7451k1888l5452K1863J1452r464J3003J1839j3653
$$ 19107 21850 46226 33160 60611 38723 3271 25134 36586 27122 40125 51964 38311
8825C8311r04n5825J8876K4750L7502m8792K1416O6828j354p9636j5730k3188
$$ 38311 37407 -18418 458 25208 62710 13918 35334 102162 100808 21172 5442 -17746
8813a7746J8387K8559L2653j4366m3098k9051l3197N2570K4639n8480J5575N4152
$$ -17746 641 29200 61853 47487 4389 -24662 -57859 -5289 19350 -39130 -23555 30597
8801C0597m9320l3198k9823m988M2644K6305K9930P8359m6127j7131j7542R114
$$ 30597 -18723 -51921 -81744 -86732 -44088 -17783 12147 90506 44379 27248 9706 18820
8789A8820k2112j2243j719k2040j8194Q3791O0960q4193k0181O9413J01503P139
$$ 18820 -3292 -15535 -17254 -39294 -57488 26303 87263 3070 -17111 52302 153805 160944
8777A60944q6258n4260P5582O4138o6715l5562l3220o5011K4200P0312J8777O2026
$$ 160944 74686 20426 96008 160146 93431 57869 24649 -40362 -16162 54150 72927 134953
8765A34953m551K9541j3958o294m029k6542q856k149L8233J0378L4935M486j07815
$$ 134953 130402 159943 145985 139691 135662 109120 100264 98115 136348 146726 181661 186147 78332
8752G8332r3294P152J7032q429l9982j5053L5739O0045o0575P2683M1133K9833
$$ 78332 -14962 -7810 9222 793 -39189 -54242 -18503 41542 -19033 53650 94783 124616
8740A24616m864m3815n8495m7486P6729O3225m5678O712O477m5314J4069N7433
$$ 124616 119752 75937 17442 -30044 46685 109910 64232 70944 77421 32107 46176 103609
8728A03609L2686o3057j3855l4042n685k2842P7815N850l1393P614J832k6174
$$ 103609 136295 73238 59383 25341 19656 -3186 74629 80479 49086 56700 58532 32358
8716C2358N7450l8271k4003m0084K6248J5826m2779Q751O4515O8220K1167m0998
$$ 32358 89808 51537 27534 -12550 13698 29524 -13255 -4504 60011 128231 149398 108400
8704A08400n0027l3772r2153M2823N1931j10421o4686N7709L7438L9163J9496
$$ 108400 58373 24601 -67552 -24729 27202 -83219 -147905 -90196 -52758 -13595 5901
8693E901J727M2589M2475M9693l3883k2620n5433J5472N4661L4145l9967L8639
$$ 5901 7628 50217 92692 142385 108502 85882 30449 45921 100582 134727 94760 133399
8681A33399q5930n1908J19856k4537q0079j3175j1042N1991K2268m930K0441m8934
$$ 133399 47469 -4439 115417 90880 10801 -2374 -13416 38575 60843 55913 76354 27420
8669B7420k2338M9005M7994l884k4165J0962J2j7428n1391o696j9078L7733m362
$$ 27420 5082 54087 102081 98197 74032 84994 85006 67578 16187 9491 -9587 28146 23784
8656B3784K2102N7475n3405n8510O4763L3823r138j325J0125j7635J0132n3244
$$ 23784 45886 103361 49956 -8554 56209 90032 80894 79569 89694 72059 82191 28947
8644B8947l1788k605Q4m2908J9674k0451N5482M3729q585J1446o0652J9281J06817
$$ 28947 -2841 -5446 -5362 -48270 -28596 -49047 6435 50164 41579 53025 -7627 11654 118471
8631A18471K6482o9509m6587N6543j2773L9295N678q1746k3237L5603L9705K9536
$$ 118471 144953 75444 28857 85400 72627 111922 117600 35854 12617 48220 87925 117461
8619A17461L5899M0624J2619p640k0739l0695L6870m2663O058K9343O3103P372
$$ 117461 153360 193984 206603 198963 178224 147529 184399 141736 147794 177137 240240 247612
8607B47612k0778K0751l7173J7558M4245L3276k3633N7592J06008J7697m8068
$$ 247612 226834 247585 210412 227970 272215 305491 281858 339450 445458 463155 415087
8596D15087k0008j8937n5638l9765j8588q5324n4818J1900j4858l6303L1501j1049
$$ 415087 395079 376142 320504 280739 262151 176827 122009 133909 119051 82748 114249 103200
8584A03200n3032j29820P6573Q4726L7666M007p7352l8262n6805p677l9043R4493
$$ 103200 50168 -79652 -3079 81647 119313 123320 45968 7706 -49099 -56776 -95819 -1326
8572a326Q2282m5117n9916L5817J30104j4652o3095J2719Q084j6651r004P160
$$ -1326 80956 35839 -24077 11740 141844 127192 64097 76816 84900 68249 59245 66405
8560F6405k9035L739O7599L3464K271K4424k0422m8545q1791j01005l486M0787
$$ 66405 37370 41109 108708 142172 144443 168867 148445 99900 18109 -82896 -86382 -45595
8548d5595O6245M2743J1572j1475J7380m5927N904N7456M5322J587l2212k3914
$$ -45595 20650 63393 74965 63490 80870 34943 40847 98303 143625 145212 113000 89086
8536H9086K3695J5557q5441n8126p7189K7596O9207p420j4492k6028j0806o202
$$ 89086 112781 128338 42897 -15229 -92418 -64822 4385 -3035 -17527 -43555 -54361 -60563
8524f0563L1937M0207q009j0848N9314m687o1090k0926M9964j9549k6857M070
$$ -60563 -28626 11581 3572 -7276 52038 47351 -13739 -34665 15299 -4250 -31107 -27037
8512b7037k194n4969L742j2892L9508Q7890L6232r5320K4723l6680r671k1126
$$ -27037 -29231 -84200 -80458 -93350 -53842 34048 70280 -25040 -317 -36997 -46668 -67794
8500f7794L5356k142O9620M3555p7277m4848N987R0195Q3128n835n0859o4081
$$ -67794 -32438 -34580 35040 78595 1318 -43530 -37543 52652 135780 129945 79086 15005
8488A5005J1284J8438p6807l4556m076O6373o4478n4649J10957M9189l4899j0570
$$ 15005 26289 44727 -32080 -66636 -70712 -4339 -68817 -123466 -12509 36680 1781 -8789
8476h789L6457K7670L75j467K2209j2679N543m164K7813K5318p3368n6214j9555
$$ -8789 27668 55338 55713 54246 76455 63776 69319 65155 92968 118286 44918 -11296 -30851
8463c0851K8483l1822J9272K8534L7282q421n1814n6396J7181J7331p969R756
$$ -30851 -2368 -34190 -14918 13616 50898 42477 -9337 -65733 -48552 -31221 -39190 -29434
8451b9434L8407k6154N942M1324l5358J9198j8198J1317J9052M1873O142l0036
$$ -29434 8973 -17181 -11239 30085 -5273 13925 -4273 7044 26096 67969 74111 44075
8439D4075N8490k8504l1387K4064j6024n4411O5321O0381M7855q9022o2219K3377
$$ 44075 102565 74061 42674 66738 50714 -3697 61624 122005 169860 80838 18619 41996
8427D1996J6706k0152L0171k1371n2111J479k0532K5897K1634n0515m6096L0837
$$ 41996 58702 38550 68721 47350 -4761 -3282 -23814 2083 23717 -26798 -72894 -42057
8415d2057L6987Q0309L2077l5218o2695N2182Q9158j5681j9492k8250M268o8587
$$ -42057 -5070 75239 107316 72098 9403 61585 150743 135062 115570 87320 91588 23001
8403B3001j080N361n3219j6281N0746K9259O6012L6246k4940l3060o4562l3868
$$ 23001 21921 27282 -25937 -42218 8528 37787 103799 140045 115105 82045 17483 -16385
8391a6385l3021k8710k6864O1353M8252l8360L4156K996j7460M5056M3645l1607
$$ -16385 -49406 -78116 -104980 -43627 4625 -33735 421 3417 -14043 31013 74658 43051
8379D3051o2999Q3800K4443N065k9828p1572k0663N6445k4970n3667p20J6198
$$ 43051 -19948 63852 88295 93360 63532 -8040 -28703 27742 2772 -50895 -51615 -35417
8367c5417k5024J3704R466Q783M8235O5715L2224j2672k0181L1500K8100r076
$$ -35417 -60441 -46737 -37271 -28488 19747 85462 117686 105014 84833 116333 144433 135357
8355A35357p1511o7136n0918n6438j6380O4316J39328m1028K6090J3733o3444
$$ 135357 63846 -3290 -54208 -110646 -127026 -62710 76618 35590 61680 75413 11969
8344A1969m8015L0995M0972M9017J5731q203n0762k6493J5878N6493N3410r638
$$ 11969 -36046 -5051 35921 84938 100669 92466 41704 15211 31089 87582 140992 131354
8332A31354j1466K1736J0169l4370j2467k3529p1261q435L7139N900m602o1539
$$ 131354 119888 141624 151793 117423 104956 81427 10166 1731 38870 44770 40168 -21371
8320b1371n614J9191J3672J8872Q743p201j8641L2108K5207l845n3191M1758J4254
$$ -21371 -26985 -7794 5878 24750 33493 26292 7651 39759 64966 61121 7930 49688 63942
8307F3942K7532l125n2061k7447l5448K314M3355L7411j226m3437J4844k4386
$$ 63942 91474 88349 36288 8841 -26607 -24293 19062 56473 55247 11810 26654 2268
8295B268K48l6546n0435o747q498L9096k2438j3957P0416R3051l3487r4668j17601
$$ 2268 2516 -34030 -84465 -91212 -99710 -60614 -83052 -97009 -26593 66458 32971 -61697 -179298
8282a79298l3112R8011Q3267m659K2732n1843m465K8782K7997l565M8622K1443
$$ -179298 -212410 -114399 -31132 -35791 -13059 -64902 -69367 -40585 -12588 -16153 32469 53912
8270E3912l64L0787j3381L793p1354q7083K4540Q790q772N9840n579N9706k1893
$$ 53912 53548 84335 70954 74747 3393 -83690 -59150 -50360 -59132 708 -4871 54835 32942
8257C2942K327p0971l8449J04690j3911l8780N2767N0693Q845j2111K7025l4919
$$ 32942 35269 -35702 -74151 30539 16628 -22152 30615 81308 90153 78042 105067 70148
8245G0148Q762k114k3282j8084p375j5496j6443P677o1310l4080K2900M539j0305
$$ 70148 78910 76796 53514 35430 28055 12559 -3884 3793 -57517 -91597 -68697 -64158 -74463
8232g4463J8423P7985j9150m5175j1593P5293N3812K8046J968L4242N5112N561
$$ -74463 -56040 21945 2795 -42380 -53973 21320 75132 103178 105146 139388 194500 200061
8220B00061j23268n6782n2792n2121r828K6452J7731P0307j5173l9702j6200M6331
$$ 200061 76793 20011 -32781 -84902 -94730 -68278 -50547 19760 4587 -35115 -51315 -4984
8208d984M3876L5845O552n9770N19L0324O3927l3523k6169K7348J6517K7427P683
$$ -4984 38892 74737 81289 21519 22038 52362 116289 82766 56597 83945 100462 127889 135572
8195A35572k9428K0675o2030j3842j2367K012o8314j4037j796o1241M2140J4765
$$ 135572 106144 126819 64789 50947 38580 40592 -27722 -41759 -43555 -104796 -62656 -47891
8183d7891L8809L7742L8262m0977L897J4843o7959j493m0023J0602K8407K1335
$$ -47891 -9082 28660 66922 25945 29842 44685 -23274 -24767 -64790 -54188 -25781 -4446
8171d446o250n9804j4983j6098k6869k6942L8000K3096L156M0918R246j330M7781
$$ -4446 -10696 -70500 -85483 -101581 -128450 -155392 -117392 -94296 -91140 -50222 -40976 -42306 5475
8158E475L9029k3664p3274J0326L0515K84m2682O3928M7134p0153o969O9121J6372
$$ 5475 44504 20840 -52434 -42108 -11593 -11309 -53991 9937 57071 -13082 -20051 49070 65442
8145F5442m4481j6123l2836m4561L2969p690p7688j3761N0051k453L7597P1323
$$ 65442 20961 4838 -27998 -72559 -39590 -47280 -124968 -138729 -88678 -91131 -53534 17789
8133A7789l3168L282O0481L704n3033k6573K7097K5367K3247o3956q3545k0494
$$ 17789 -15379 -12097 48384 52088 -945 -27518 -421 24946 48193 -15763 -99308 -119802
$$ [...]
##END NTUPLES=NMR SPECTRUM
##END=
