##TITLE=Analysis number 326890
Compound Code tl 00171
Project Code adrs
Chemist Name apollo sci
##JCAMPDX= 6.0         $$ Bruker NMR JCAMP-DX V2.0
##DATA TYPE= NMR SPECTRUM
##DATA CLASS= NTUPLES
##ORIGIN= Bruker BioSpin GmbH
##OWNER= nmr
$$ XWIN-NMR		Version 3.5
$$ Tue Feb 27 14:46:31 2007 GMT Standard Time (UT+0h)  MAYBRIDGE\nmr@NMR_250MHZ
##.OBSERVE FREQUENCY= 250.131544655141
##.OBSERVE NUCLEUS= ^1H
##.ACQUISITION MODE= SIMULTANEOUS (DQD)
##.ACQUISITION SCHEME= undefined
##.AVERAGES= 16
##.DIGITISER RES= 18
##SPECTROMETER/DATA SYSTEM= dpx250
##.PULSE SEQUENCE= zg30
##.SOLVENT NAME= CDCl3
##.SHIFT REFERENCE= (INTERNAL, CDCl3, 0, 16.522)
##AUDIT TRAIL= $$ (NUMBER, WHEN, WHO, WHERE, WHAT)
$$ ##TITLE= Audit trail, XWIN-NMR		Version 3.5
$$ ##JCAMPDX= 5.01
$$ ##ORIGIN= Bruker BioSpin GmbH
$$ ##OWNER= nmr
$$ C:\u/data/dgb/nmr/ADRS/2500/pdata/1/auditp.txt
$$ ##AUDIT TRAIL=  $$ (NUMBER, WHEN, WHO, WHERE, WHAT)
(   1,<2007-02-27 14:45:56.73 +000>,<MAYBRIDGE\nmr>,<NMR_250MHZ>,
      <created by zg, POWCHK disabled, PULCHK disabled
       configuration hash MD5:
       49 4B E0 1D 92 C2 6B 37 9F E6 65 BC 52 41 86 1D
       data hash MD5: 64K
       D9 91 D3 13 74 02 E0 C9 2E 0A 9A A9 C7 D7 73 28>)
(   2,<2007-02-27 14:46:15.48 +000>,<MAYBRIDGE\nmr>,<NMR_250MHZ>,
      <Start of raw data processing
       ef LB = 0.3 FT_mod = 6 PKNL = 1 SI = 32K 
       data hash MD5: 32K
       E5 40 83 3E 7A 6D 70 96 C0 D6 EF BF 97 09 5B 1C>)
(   3,<2007-02-27 14:46:18.34 +000>,<MAYBRIDGE\nmr>,<NMR_250MHZ>,
      <apk 
       data hash MD5: 32K
       DF 25 EA 95 2C 78 8B A4 01 E8 66 6F BA 95 22 25>)
(   4,<2007-02-27 14:46:19.03 +000>,<MAYBRIDGE\nmr>,<NMR_250MHZ>,
      <abs ABSG = 5 
       data hash MD5: 32K
       D8 C6 E8 09 79 B9 F2 0C DF 6F 2D 7A 27 70 2A E4>)
$$ ##END=
$$ 
$$ hash MD5
$$ 73 5D 1D 20 68 41 EA 1C 30 69 73 90 66 54 AD A6
##$RELAX= 
##$RELAX= 
##$RELAX= 
##$RELAX= 
##$RELAX= 
##$RELAX= 
##$RELAX= 
$$ Bruker specific parameters
$$ --------------------------
##$DU= <C:\u>
##$EXPNO= 2500
##$NAME= <ADRS>
##$PROCNO= 1
##$TYPE= <nmr>
##$USER= <dgb>
##$AMP= (0..31)
100 100 100 100 100 100 100 100 100 100 100 100 100 100 100 100 100 100 
100 100 100 100 100 100 100 100 100 100 100 100 100 100 
##$AQSEQ= 0
##$AQ_mod= 3
##$AUNM= <au_zg>
##$AUTOPOS= <37 >
##$BF1= 250.13
##$BF2= 250.13
##$BF3= 250.13
##$BF4= 250.13
##$BF5= 500.13
##$BF6= 500.13
##$BF7= 500.13
##$BF8= 500.13
##$BYTORDA= 1
##$CFDGTYP= 0
##$CFRGTYP= 5
##$CHEMSTR= <none>
##$CNST= (0..31)
1 1 145 1 1 1 1 1 1 1 1 1 1 1 1 1 1 1 1 1 1 1 1 1 1 1 1 1 1 1 1 1 
##$CPDPRG= <>
##$CPDPRG1= <>
##$CPDPRG2= <>
##$CPDPRG3= <>
##$CPDPRG4= <mlev>
##$CPDPRG5= <mlev>
##$CPDPRG6= <mlev>
##$CPDPRG7= <mlev>
##$CPDPRG8= <mlev>
##$CPDPRGB= <>
##$CPDPRGT= <>
##$D= (0..31)
0 1 0 0 0 0 0 0 0 0.06 0 0 0 0 0 0 0.0002 0 0 0 0 0 0 0 0 0 0 0 0 0 0 
0 
##$DATE= 1172587553
##$DBL= (0..7)
120 120 120 120 120 120 120 120 
##$DBP= (0..7)
150 150 150 150 150 150 150 150 
##$DBP07= 0
##$DBPNAM0= <>
##$DBPNAM1= <>
##$DBPNAM2= <>
$$ [...]
##$SUBNAM7= <"">
##$SUBNAM8= <"">
##$SUBNAM9= <"">
##$SW= 20.6930455092707
##$SWIBOX= (0..15)
0 0 3 0 0 0 0 0 0 0 0 0 0 0 0 0 
##$SW_h= 5175.983436853
##$TD= 65536
##$TD0= 1
##$TE= 295.16
##$TE2= 300
##$TE3= 300
##$TEG= 300
##$TL= (0..7)
0 120 120 120 120 120 120 120 
##$TP= (0..7)
150 150 150 150 150 150 150 150 
##$TP07= 0
##$TPNAME0= <>
##$TPNAME1= <>
##$TPNAME2= <>
##$TPNAME3= <>
##$TPNAME4= <>
##$TPNAME5= <>
##$TPNAME6= <>
##$TPNAME7= <>
##$TPOAL= (0..7)
0.5 0.5 0.5 0.5 0.5 0.5 0.5 0.5 
##$TPOFFS= (0..7)
0 0 0 0 0 0 0 0 
##$TUNHIN= 0
##$TUNHOUT= 0
##$TUNXOUT= 0
##$USERA1= <user>
##$USERA2= <user>
##$USERA3= <user>
##$USERA4= <user>
##$USERA5= <user>
##$V9= 5
##$VALIST= <valist>
##$VCLIST= <CCCCCCCCCCCCCCC>
##$VD= 0
##$VDLIST= <DDDDDDDDDDDDDDD>
##$VPLIST= <PPPPPPPPPPPPPPP>
##$VTLIST= <TTTTTTTTTTTTTTT>
##$WBST= 1024
##$WBSW= 4
##$XGAIN= (0..3)
0 0 0 0 
##$XL= 0
##$YL= 0
##$YMAX_a= 475469
##$YMIN_a= -597588
##$ZGOPTNS= <>
##$ZL1= 120
##$ZL2= 120
##$ZL3= 120
##$ZL4= 120
##$ABSF1= 16.522
##$ABSF2= -4.171173
##$ABSG= 5
##$ABSL= 3
##$ALPHA= 0
##$AQORDER= 0
##$ASSFAC= 0
##$ASSFACI= 0
##$ASSFACX= 0
##$ASSWID= 0
##$AUNMP= <proc_1d>
##$AZFE= 0.1
##$AZFW= 0.1
##$BCFW= 0
##$BC_mod= 0
##$BYTORDP= 0
##$COROFFS= 0
##$CY= 12.5
##$DATMOD= 1
##$DC= 0
##$DFILT= <>
##$DTYPP= 0
##$F1P= 14.0000005364418
##$F2P= -0.99999901652339
##$FCOR= 0.5
##$FTSIZE= 32768
##$FT_mod= 6
##$GAMMA= 0
##$GB= 0
##$INTBC= 1
##$INTSCL= 1
##$ISEN= 128
##$LB= 0.3
##$LEV0= 0
##$LPBIN= 0
##$MAXI= 10000
##$MC2= 0
##$MEAN= 0
##$ME_mod= 0
##$MI= 0
##$NCOEF= 0
##$NC_proc= -4
##$NLEV= 6
##$NOISF1= 0
##$NOISF2= 0
##$NSP= 0
##$NTH_PI= 0
##$NZP= 0
##$OFFSET= 16.522
##$PC= 1
##$PHC0= 220.7604
##$PHC1= 13.81783
##$PH_mod= 1
##$PKNL= yes
##$PPARMOD= 0
##$PSCAL= 4
##$PSIGN= 0
##$REVERSE= no
##$SF= 250.13
##$SI= 32768
##$SIGF1= 0
##$SIGF2= 0
##$SINO= 400
##$SIOLD= 32768
##$SREGLST= <1H.CDCl3>
##$SSB= 0
##$STSI= 32768
##$STSR= 0
##$SW_p= 5175.98343685301
##$SYMM= 0
##$S_DEV= 0
##$TDeff= 65536
##$TDoff= 0
##$TI= <Analysis number 999999
Compound Code 99
Book Reference 9
Project Code 9>
##$TILT= no
##$TM1= 0
##$TM2= 0
##$TOPLEV= 0
##$USERP1= <user>
##$USERP2= <user>
##$USERP3= <user>
##$USERP4= <user>
##$USERP5= <user>
##$WDW= 1
##$XDIM= 32768
##$YMAX_p= 328986731
##$YMIN_p= -156019
$$ End of Bruker specific parameters
$$ ---------------------------------
##NTUPLES= NMR SPECTRUM
##VAR_NAME=  FREQUENCY,     SPECTRUM/REAL,   SPECTRUM/IMAG
##SYMBOL=    X,             R,               I
##VAR_TYPE=  INDEPENDENT,   DEPENDENT,       DEPENDENT
##VAR_FORM=  AFFN,          ASDF,            ASDF
##VAR_DIM=   32768,         32768,           32768
##UNITS=     HZ,            ARBITRARY UNITS, ARBITRARY UNITS
##FACTOR=    0.157963299565203, 1,           1
##FIRST=     4132.6476996994, 0,             0
##LAST=      -1043.33573715361, 0,           0
##MIN=       -1043.33573715361, -156019,     0
##MAX=       4132.6476996994, 328986731,     0
$$ Real data points
##PAGE= N=1
##DATA TABLE= (X++(R..R)), XYDATA
$$ [...]
23209A55m896k603k292J3475k8739j0757j0726M3565K1795r591k810l0013N073
$$ 155 -4741 -7344 -9636 3839 -24900 -35657 -46383 -2818 18977 9386 6576 -23437 -18364
23196a8364j8729K065L1394K7539m8048j8751N1563L7118M2629J14m8744j4595
$$ -18364 -37093 -35028 -3634 23905 -24143 -42894 8669 45787 88416 88530 39786 25191
23184B5191j0501l5444J6248J2523O224N312l1230j6865j6084k5950K0143K9230
$$ 25191 14690 -20754 -4506 8017 14241 19553 -11677 -28542 -44626 -70576 -50433 -21203
23172b1203k5386j5149K5739K0595M3346J6009m5864n5954P93m593L6998m615
$$ -21203 -46589 -61738 -35999 -15404 27942 43951 -1913 -57867 -57074 -61667 -24669 -29284
23160b9284L985K4505R026l3060J1953J9400J2072j4621p012L1696N26j0099K572
$$ -29284 -25299 -794 8232 -24828 -12875 6525 18597 3976 -3036 28660 29186 19087 21659
23147B1659o213r555j6657j576J0525K5898k5837j0228Q742l0168J0363Q39j698
$$ 21659 15446 5891 -10766 -12342 -1817 24081 -1756 -11984 -3242 -33410 -23047 -22208 -23906
23134b3906K4097k525L6285O1279k1906o2998k4393k4489l704K9698j6426k8490
$$ -23906 191 -2334 33951 95230 73324 10326 -14067 -38556 -42260 -12562 -28988 -57478
23122e7478N1712Q142l3993k7905j2850J6099J4024K3071j1583O209K6834R268
$$ -57478 -5766 2376 -31617 -59522 -72372 -56273 -42249 -19178 -30761 -24552 2282 11550
23110A1550k3050j5300J3095J4540n8160o026L6624R810l2056m5666j458Q183
$$ 11550 -11500 -26800 -13705 835 -57325 -63351 -26727 -16917 -48973 -94639 -96097 -87914
23098h7914M9055J8676P225O763K3850j3797k1716k9010J199J6461j0936J4311
$$ -87914 -38859 -20183 -12958 -6195 17655 3858 -17858 -46868 -45669 -29208 -40144 -25833
23086b5833J4581k5343N544K6020k1413j7743j603J7986n218J8325J6201O51k7586
$$ -25833 -11252 -36595 -31051 -5031 -26444 -44187 -45790 -27804 -33022 -14697 1504 2155 -25431
23073b5431K7361L302k6177l2567l3265O8666P957M158K88L36L0218K1391j2825
$$ -25431 1930 5232 -20945 -53512 -86777 -18111 -10154 -5996 -5708 -5372 24846 46237 33412
23060C3412q362J0219M0039k2443L101P063K2397M715k8729l3420J5054J5573
$$ 33412 25050 35269 75308 52865 55966 63029 85426 90141 61412 27992 43046 58619
23048E8619R640J922r910M775k5980j4469P2K623K273K921l2903l1249j3584J9985
$$ 58619 68259 70181 60271 65046 39066 24597 24669 27292 29565 32486 -417 -31666 -45250 -25265
23034b5265M7453L3435j3495j7661k704Q253j3022j7972o3956k0991L1696M5597
$$ -25265 22188 55623 42128 24467 21763 30016 16994 -978 -64934 -85925 -54229 -8632
23022h632r693L9609K8818m168k8538k6006j1533k5211j5329K5755K4030O5778
$$ -8632 -18325 21284 50102 45934 17396 -8610 -20143 -45354 -60683 -34928 -10898 54880
23010E4880K5946k8536j4280k2845P412j7365n5158J3888M3899m8286l4847L7895
$$ 54880 80826 52290 38010 15165 22577 5212 -49946 -36058 7841 -40445 -75292 -37397
22998c7397j1593k4761j1316K0113N2451M6627k0514k5410k9374J8032L4228L859
$$ -37397 -48990 -73751 -85067 -64954 -12503 34124 13610 -11800 -41174 -23142 11086 14945
22986A4945M386p362m8553M327J9750L744K534m2201l3877J1633M6769K4278L51
$$ 14945 19331 11969 -36584 -32257 -12507 -8763 -6229 -48430 -82307 -70674 -23905 373 724
22973G24K218J0966J2749o455k3384k119K684j218L3571K761R810k5033J4230
$$ 724 2942 13908 26657 20202 -3182 -5301 -2617 -3835 29736 32497 42307 17274 31504
22960C1504K9958r596j7709m0363l6773l9711J047L1973J9477K2135J8945K9145
$$ 31504 61462 51866 34157 -6206 -42979 -82690 -81643 -49670 -30193 -8058 10887 40032
22948D0032l4559n771J2770M2575Q115K7416M1737m7291n6904l7699l3920K0636
$$ 40032 5473 -298 12472 55047 63162 90578 132315 85024 28120 -9579 -43499 -22863
22936b2863P8208K0345j9217p713k5709k0506J0027Q850l6950M301J8376J6973
$$ -22863 55345 75690 56473 48760 23051 2545 12572 21422 -15528 -11227 7149 24122
22924B4122j4321k0907j9289M096K154j5708r362k732j5647k9825L1866K3105
$$ 24122 9801 -11106 -30395 -26299 -24145 -39853 -49215 -51947 -67594 -97419 -65553 -42448
22912d2448O943J9665m924J5002J2039K5421J1153l1828k1045L2606Q628j004
$$ -42448 -35505 -15840 -20764 -5762 6277 31698 42851 11023 -10022 22584 31212 30208
22900C0208j0714m1K6782M32l7560j8771M786L1677K4196Q424J0714j1738k1294
$$ 30208 19494 19453 46235 46667 9107 -9664 -4878 26799 50995 59419 70133 58395 37101
22887C7101k8131j1018R790J4283M2614P509J5981l7515n5987J1390L3052l6405
$$ 37101 8970 -2048 7742 22025 64639 72148 88129 50614 -5373 6017 39069 2664
22875B664j3401K8339J7746k5138n0370J5443J1058j5287J3767J7324J2574j4887
$$ 2664 -10737 17602 35348 10210 -40160 -24717 -13659 -28946 -15179 2145 14719 -168
22863a68K2802m825n8543o4483M374R325j7030j727J4986N7802O9131M9464k4478
$$ -168 22634 17809 -40734 -105217 -100843 -91518 -108548 -110275 -95289 -37487 31644 81108 56630
22850E6630n9512j3018l815j0190j7776K1717R570k7382J8775M5915j3068k6978
$$ 56630 -2882 -15900 -19715 -29905 -47681 -25964 -16394 -43776 -25001 20914 7846 -19132
22838a9132j3096k1634K4701L325m858J7795K1071L3439n919k6920Q534n573k688
$$ -19132 -32228 -53862 -29161 -25836 -30694 -12899 8172 41611 35692 8772 17306 11733 9045
22825I045q449j6371j1722K339j5364L6744K680K1562P18K3633m672J4584J0649
$$ 9045 596 -15775 -27497 -25158 -40522 -3778 -1098 20464 21182 44815 40143 54727 65376
22812F5376j1214L1449k6760m5273m3978m8043J3447M3999J7836K5872M562j5888
$$ 65376 54162 85611 58851 13578 -30400 -78443 -64996 -20997 -3161 22711 27273 11385
22800A1385l723K117j5474M957J1352L2706k8294j7769j8105J2625L1993K8942
$$ 11385 7662 9779 -5695 -738 10614 43320 15026 -2743 -20848 -8223 23770 52712
22788E2712K8639k8918K809M1266j6278m8762l4505J3909o044k6026j8128j426
$$ 52712 81351 52433 55242 96508 80230 31468 -3037 10872 4828 -21198 -39326 -40752
22776d0752J5970o777R118L5738K6697O981r25k2134j2777j9540l5037P754R567
$$ -40752 -24782 -31559 -22441 13297 39994 46975 46050 23916 11139 -8401 -43438 -35684 -26117
22763b6117O145l521J3631K9742j8705j4634O165j5550M381J2667K7003j2363
$$ -26117 -19972 -23493 -9862 19880 1175 -13459 -7294 -22844 -18463 -5796 21207 8844
22751H844j5174j1119J1367l191l827K6199P866k4848J5838J6633L567j7337J0480
$$ 8844 -6330 -17449 -6082 -9273 -13100 13099 20965 -3883 11955 28588 32155 14818 25298
22738B5298J6983r101p152j1863n077j9509K5693k6369l3213k7191K0649J5184
$$ 25298 42281 33180 26028 14165 9088 -10421 15272 -11097 -44310 -71501 -50852 -35668
22726c5668M934r319L6710j1090k2977K514J5739K1475o288L2995r679k5052j9792
$$ -35668 -30734 -40053 -3343 -14433 -37410 -34896 -19157 2318 -3970 29025 19346 -5706 -25498
22713b5498J9019L9506l4011m2562p720K2145j0808m6023J5819M5869k399o503
$$ -25498 -6479 33027 -984 -43546 -51266 -29121 -39929 -85952 -70133 -24264 -26663 -33166
22701c3166J0066K5669K0826j5296j4593R280R347l5293j660J8249N455K5005
$$ -33166 -23100 2569 23395 8099 -6494 2786 12133 -23160 -24820 -6571 -1116 23889
22689B3889K2054o317o801j1668k272j1128M124K6250m8567j7674K5211M1468
$$ 23889 45943 39626 32825 21157 18885 7757 11881 38131 -10436 -28110 -2899 38569
22677C8569J6488O232l7659j8344p884j1949j86o573k9693R815j4184J0766L1982
$$ 38569 55057 61289 23630 5286 -2598 -14547 -14733 -21306 -50999 -41184 -55368 -44602 -12620
22664a2620N0768j6722k7014k977J8811j7084R513K7259Q272j4719P770k1141
$$ -12620 38148 21426 -5588 -8565 10246 -6838 2675 29934 38206 23487 31257 10116
22652A0116J6858N493k4649k8563j2621R874j3133K5584k3260k3172L6271M1847
$$ 10116 26974 32467 7818 -20745 -33366 -23492 -36625 -11041 -34301 -57473 -21202 20645
22640B0645L6416k9644m2764r872j2033n300J9892J7697l4859J2966L2698k238
$$ 20645 57061 27417 -15347 -25219 -37252 -42552 -22660 -4963 -39822 -26856 5842 3604
22628C604k2316m305j5878J4216k5193l1060p903J0978K9025j32n524j5914J5671
$$ 3604 -18712 -23017 -38895 -24679 -49872 -80932 -88835 -77857 -48832 -48964 -54488 -70402 -54731
22615e4731L9100R996L75n527k4367Q763r294L2201K2873n089k413k7526r501
$$ -54731 -15631 -5635 -5260 -10787 -35154 -26391 -35685 -3484 19389 14300 11887 -15639 -25140
22602b5140R121M3475j3998l3513j028r755l206L7853K2551j0964k7813J3788
$$ -25140 -16019 27456 13458 -20055 -21083 -30838 -34044 3809 26360 15396 -12417 1371
22590A371L440k863o805l5015k4056R747J9078J2003j0370K2983J5699k4992N740
$$ 1371 4811 1948 -4857 -39872 -63928 -54181 -35103 -23100 -33470 -10487 5212 -19780 -14040
22577a4040o964J4411J3953L873K8866n794l3065m0879O915K9533J2241J1573
$$ -14040 -21004 -6593 7360 11233 40099 34305 1240 -39639 -32724 -3191 9050 20623
22565B0623l3487n412J4501J5890j0947k9581j2225K4853J4953j0424q787K9642
$$ 20623 -12864 -18276 -3775 12115 1168 -28413 -40638 -15785 -832 -11256 -20043 9599
22553I599J6681k4090j9477q827L0319K4048m7161Q541J0586l9190L3078P935
$$ 9599 26280 2190 -17287 -26114 4205 28253 -18908 -10367 219 -38971 -5893 2042
22541B042P002L822n7460l8234L4938N0219K9349k7736J3754Q121p01j2840K8184
$$ 2042 9044 12866 -44594 -82828 -47890 2329 31678 3942 17696 25817 25116 12276 40460
22528D0460L0766j1292m5969j1912J538J1210j2499o538l4166j389o457k3057
$$ 40460 71226 59934 13965 2053 3591 14801 2302 -4236 -38402 -39791 -46248 -69305
22516f9305M338O0074J7225j8012l1369M411K0325K1535L5582L002k3109o160
$$ -69305 -64967 -4893 12332 -5680 -37049 -32638 -12313 9222 44804 47806 24697 18537
22504A8537K310j9832l0702l2571Q823N4342K1945p457j4668j2444l886M7096
$$ 18537 20847 1015 -29687 -62258 -53435 907 22852 15395 727 -11717 -15603 31493
22492C1493N3423l4019k4100r524m113j4602N677k4413l1386K9864N0281M0125
$$ 31493 84916 50897 26797 17273 13160 -1442 4235 -20178 -51564 -21700 28581 68706
22480F8706k9074k4618K3809n653j1477K1679J1582q220m7477l2499o56K2311
$$ 68706 39632 15014 38823 33170 21693 43372 54954 46734 -743 -33242 -33898 -11587
22468a1587K312J8604k1049J6117O2391J6989m9879m6469j9130K0250J2204j0714
$$ -11587 -9275 9329 -11720 4397 66788 83777 33898 -12571 -31701 -11451 753 -9961
22456i961L4964N279m706j0924l400l3971J206O009P530j5331m0342K5383J7543
$$ -9961 25003 30282 25576 14652 11252 -22719 -21513 -15504 -7974 -23305 -63647 -38264 -20721
22443b0721j2488j0036o428N3133K0512p836n0687k9564P1193L9373n6264l4637
$$ -20721 -33209 -43245 -49673 3460 23972 16136 -34551 -64115 7078 46451 -9813 -44450
22431d4450k5783J998K7977k1135m2405L5572L0642L6290n51J4738J4214k6531
$$ -44450 -70233 -68235 -40258 -61393 -103798 -68226 -37584 -1294 -1845 12893 27107 576
22419E76k0910k7330l323K5723J073K1855M653l9821M409j7246k4495J0580N0188
$$ 576 -20334 -47664 -50987 -25264 -24191 -2336 2317 -37504 -33095 -50341 -74836 -64256 -14068
22406a4068M4333j7054n5003J6432M066J7412K6054j3038j4696Q192L299L3148
$$ -14068 30265 13211 -41792 -25360 -21294 -3882 22172 9134 -5562 2630 5929 39077
22394C9077L4450M843l1410j5942O957J1231O542l6530O816R543j9646q115j6322
$$ 39077 73527 78370 46960 31018 37975 49206 55748 19218 26034 35577 15931 7816 -8506
22381h506M1648J3813l970j7463r800o143M488L082r938j2865j6291J7982j772
$$ -8506 33142 46955 42985 25522 15722 9579 14067 17149 7211 -5654 -21945 -3963 -5735
22368e735j0323l5191j0434K7997J7884q95m603K3460R915k3356l4863J5650L0419
$$ -5735 -16058 -51249 -61683 -33686 -15802 -16697 -21300 2160 12075 -11281 -46144 -30494 -75
22355g5K5268n130l1691k2580J2876p978K9433N032J9171K2914K6743J3770l2860
$$ -75 25193 20063 -11628 -34208 -21332 -29310 123 5155 24326 47240 73983 87753 54893
22342E4893l1408k1309j9125JL4537K5170K575m622k1204j6031j9203J8268n161
$$ 54893 23485 2176 -16949 -16948 17589 42759 45334 40712 19508 3477 -15726 2542 -2619
22329b619R527K2271l860j7686k546N8743J0363n9706l0626J7081j226j3103l7426
$$ -2619 6908 29179 25319 7633 5087 63830 74193 14487 -16139 942 -284 -13387 -50813
22316e0813l710K9895N8040L0056j1636L1477O966k9328k5916j2843n7129l4715
$$ -50813 -54523 -24628 33412 63468 51832 83309 90275 60947 35031 22188 -34941 -69656
22304f9656L9349p330j8609J3225K8301p124n34p560K1181K3573l299j9649k8730
$$ -69656 -30307 -37637 -56246 -43021 -14720 -21844 -22378 -29938 -8757 14816 11517 -8132 -36862
22291c6862K4784J8185k766o179M576J0669N70j4189j1912j1919m5619j3925J8729
$$ -36862 -12078 6107 3341 -2838 1738 12407 12977 -1212 -13124 -25043 -70662 -84587 -65858
22278f5858K9285k298K110J1580j8183k125L1619J6107l6798k5122L1244Q191
$$ -65858 -36573 -38871 -36761 -25181 -43364 -45489 -13870 2237 -34561 -59683 -28439 -20248
22266b0248l7778r139L417R429q967J9503O307L5695L1105J0798k7676m5717j8153
$$ -20248 -58026 -67165 -63748 -54319 -63286 -43783 -37476 -1781 29324 40122 12446 -33271 -51424
22253e1424L2878K6660r063k2638M156J0919j2330k1209k645J5364K1713J1379
$$ -51424 -18546 8114 -949 -23587 -19431 -8512 -20842 -42051 -44696 -29332 -7619 3760
22241C760K7275q158j633P332J8089j6915Q107j6780l0886k1356m730P92J3436
$$ 3760 31035 22877 21244 28576 46665 29750 37857 21077 -9809 -31165 -35895 -35103 -21667
22228b1667N863P160P327K228j1870J0273J0012M999p964j8213j3042J8726L944
$$ -21667 -15804 -8644 -1317 911 -10959 -686 9326 14325 6361 -11852 -24894 -6168 -2224
22215b224k6656n0916L568J1482L8201L0047K120K315J4852p892j5080J7030j5099
$$ -2224 -28880 -79796 -76228 -64746 -26545 3502 5622 7937 22789 14897 -183 16847 1748
22202A748j7220j0061n304Q865N1910N2406J3756k1976j7206k037J507p540k0032
$$ 1748 -15472 -25533 -30837 -21972 29938 82344 96100 74124 56918 54881 56388 48848 28816
22189B8816l9508J875M217K718k5785K5151M2337k40J9235L333m9628j5592N1517
$$ 28816 -10692 -8817 -4600 -1882 -27667 -2516 39821 39581 58816 62149 12521 -3071 48446
22176D8446q945J5374n1789N625L4885j1418j8041Q563K753K8177P822l35l9721
$$ 48446 39501 54875 3086 8711 43596 32178 14137 22700 25453 53630 61452 61117 21396
22163B1396j9125J2175J7457L400j7154j799K0114l85l7053J1625j1093k3501
$$ 21396 2271 14446 31903 35303 18149 16350 36464 36079 -974 10651 -442 -23943
22151b3943j9347j2401J5159j7069L8478K9192j0543m5355M22O3555K2346l1742
$$ -23943 -43290 -55691 -40532 -57601 -19123 10069 -474 -45829 -45407 18148 40494 8752
22139H752j904J406j8411p154Q429K1700K7929j3589j267k723j6370j2096j9195
$$ 8752 6848 8254 -10157 -17311 -8882 12818 40747 27158 25891 23168 6798 -5298 -24493
22126b4493J5973j4061k7662k6078J9422K1686k1052j4797N299K5962j2139j0022
$$ -24493 -8520 -22581 -50243 -76321 -56899 -35213 -56265 -71062 -65763 -39801 -51940 -61962
22114f1962L160K0202P965M1449L1875j5678n039l547J1048k0465p608J9759J9543
$$ -61962 -58802 -38600 -30635 10814 42689 27011 21972 18425 29473 9008 1400 21159 40702
22101D0702j6015j0829j1994J3273n324P167J4206n747R374J2420k6667k9157
$$ 40702 24687 13858 1864 15137 9813 16980 31186 25439 34813 47233 20566 -8591
22089h591k0720L1138j6791l1469j8850p016Q487J1571n30L1122Q027J2435k9766
$$ -8591 -29311 1827 -14964 -46433 -65283 -72299 -63812 -52241 -52771 -21649 -13622 -1187 -30953
22076c0953N114l0402P191M5865N5967K7123m1765k2435J700j2372P662P916n566
$$ -30953 -25839 -56241 -49050 -3185 52782 79905 38140 15705 17405 5033 12695 20611 15045
22063A5045l775N863r498L236L300k1316K0224L4518j8008l3608J3929L356J5347
$$ 15045 11270 17133 7635 10871 14171 -7145 13079 47597 29589 -4019 9910 13266 28613
22050B8613j243l4581l2849R579L369j9430o482j3261L987l400K1013L9779N804
$$ 28613 27370 -7211 -40060 -30481 -27112 -46542 -53024 -66285 -62298 -65698 -44685 -4906 898
22037H98r804J9133o2714k0112O23m98L803K2161J7710j4889j8181j3012L4328
$$ 898 -8906 10227 -52487 -72599 -71976 -72474 -68671 -46510 -28800 -43689 -61870 -74882 -40554
22024d0554Q745J6009p334J192k3322R412n41K3219O000n889J2547L1625j1933
$$ -40554 -31809 -15800 -23134 -21942 -45264 -35852 -36393 -13174 -7174 -13063 -516 31109 19176
22011A9176k1209j2404J8568J3894r343m0377j4337K6525Q812r318l5159n578
$$ 19176 -2033 -14437 4131 18025 8682 -31695 -46032 -19507 -10695 -20013 -55172 -60750
21999f0750L4752R286k6152J2415m96N300J4052k725K1612k192K2172k686n5656
$$ -60750 -25998 -16712 -42864 -30449 -30945 -25645 -11593 -14318 7294 5102 27274 24588 -31068
21986c1068p123m05J7181L5586j8902j6602J931j1420J2922q651j9403J7589J5151
$$ -31068 -38191 -38596 -21415 14171 -4731 -21333 -19402 -30822 -17900 -26551 -45954 -28365 -13214
21973a3214J4406J9752M5398j5245n6502j0864Q31j9874j7469j8581O051K4786
$$ -13214 1192 20944 66342 51097 -5405 -16269 -15438 -35312 -52781 -71362 -65311 -40525
21961d0525K5936K373J4762j9307m0404K9458M0835L3004q245l7762K6778M0702
$$ -40525 -14589 -12216 2546 -16761 -57165 -27707 13128 46132 37887 125 26903 67605
21949F7605l9504n1348N547K2210K0076K52J0884J6421J4880m6114k2077j3393
$$ 67605 28101 -23247 -17700 4510 24586 24838 35722 52143 67023 20909 -1168 -14561
21937a4561J1737r211K508k1390m3183M1283K2269m739j2587l186J1465j7481
$$ -14561 -2824 -12035 -9527 -30917 -74100 -32817 -10548 -15287 -27874 -31060 -19595 -37076
21925c7076p665O281j4457j9437j5594Q543j2514m56K1172j2719m959m695k7452
$$ -37076 -44741 -38460 -52917 -72354 -87948 -79405 -91919 -92375 -71203 -83922 -88881 -93576 -121028
21912a21028J8972M4130L0192R009J0408l3k3087N956J3555l6854M365J4268J7161
$$ -121028 -102056 -57926 -27734 -18725 -8317 -8350 -31437 -25481 -11926 -48780 -44415 -30147 -12986
21899a2986J5244L6717N9078m1212l0230l035J3806o953J0274j437m1597p88K2336
$$ -12986 2258 38975 98053 56841 26611 23576 37382 30429 40703 39266 -2331 -3119 19217
21886A9217J2392p56J7617K714l1757j9202K0387M3077J3251L447m9772k5457
$$ 19217 31609 30853 48470 51184 19427 225 20612 63689 76940 80387 30615 5158
21874E158Q772o770j9765J9291j5080k593k4860J9520R340p676j0079J1252J6620
$$ 5158 13930 7160 -12605 6686 -8394 -10987 -35847 -16327 -6987 -14663 -24742 -13490 3130
21861C130J7945o913o024r52j5944R189K4223o711J1209k8841J6225J4667r622
$$ 3130 21075 14162 8138 7186 -8758 431 24654 17943 29152 311 16536 31203 21581
21848B1581k0933k3976k8081P534L664K1207K0416k4791j0240j004Q656J2740
$$ 21581 648 -23328 -51409 -43875 -40211 -19004 1412 -23379 -33619 -34623 -25967 -13227
21836a3227J4309L675j2942M3975l408K0769r152r317k9963n350R52l2508l295
$$ -13227 1082 4757 -8185 35790 32382 53151 43999 34682 4719 -631 321 -32187 -35482
21823c5482M3724J5245N617J5755J28M299L7125J7918o8745p0944j4243N6861
$$ -35482 8242 23487 29104 44859 44987 49286 86411 104329 35584 -35360 -49603 7258
21811G258L9342k3074j7855J2N771N1707p111R52K9395l4592n5765J6090m788
$$ 7258 46600 23526 5671 5683 11454 63161 56050 57002 86397 51805 -3960 12130 7342
21798G342k1836k7937R087K7148M7976j7988L925N874q607o2776r918O0159J4815
$$ 7342 -14494 -42431 -33344 -6196 41780 23792 27717 33591 24984 -37792 -47710 12449 27264
21785B7264k6022k2481K761K6114K0523j8217l8343j4934l083L4904K1949k8817
$$ 27264 1242 -21239 -18478 7636 28159 9942 -28401 -43335 -46418 -11514 10435 -18382
21773a8382j2006O088L5002N7600K2397n7015j9433o576n157l3001j354O545j2161
$$ -18382 -30388 -24300 10702 68302 90699 33684 14251 7675 2518 -30483 -31837 -25292 -37453
21760c7453J4317J1865M203L7349J5241r743j8181k1127m0676N529P169L1226
$$ -37453 -23136 -11271 -7068 30281 45522 35779 17598 -3529 -44205 -38676 -31507 -281
21748b81K8015P003K429j0711j403o066K721k3165k8103m603K0240K0394J5519
$$ -281 27734 34737 37166 26455 25052 18986 21707 -1458 -29561 -34164 -13924 6470 21989
21735B1989P039N237J5787j4444k8804J3353p750m2095k8001Q546J4833M1898
$$ 21989 29028 34265 50052 35608 6804 20157 12407 -29688 -57689 -49143 -34310 7588
21723G588K4168j3604j9567J8011K5031Q802J314l1910k6288J320J4535K0118
$$ 7588 31756 18152 -1415 16596 41627 50429 51743 19833 -6455 -5135 9400 29518
21711B9518J3060n414L832n2813j9441P177j0611L0137J4916J076l0190Q849j8682
$$ 29518 42578 37164 40996 -11817 -31258 -24081 -34692 -4555 10361 11437 -18753 -9904 -28586
21698b8586m3138j6694K0223L070L4516K9685K3672m748K5494j0025J2615n124
$$ -28586 -71724 -88418 -68195 -65125 -30609 -924 22748 18000 43494 33469 46084 40960
21686D0960m6833l5775p105p541K9979j2844Q616j7020O946M0122K8896q911l3293
$$ 40960 -5873 -41648 -48753 -56294 -26315 -39159 -30543 -47563 -40617 -495 28401 19490 -13803
21673a3803j5864K5789K558j9214l745L7970k6163k9095N686J4732L1748J4807
$$ -13803 -29667 -3878 -1320 -20534 -24279 13691 -12472 -41567 -35881 -21149 10599 25406
21661B5406j9908k1086Q011J3722j4912j6625j240J0738K0222k0861k4489K0722
$$ 25406 5498 -15588 -7577 6145 -8767 -25392 -26632 -15894 4328 -16533 -41022 -20300
21649b0300k8j622K9792K2437j3838K7130o903m3924j0217N3888J4584o255J7865
$$ -20300 -20328 -21950 7842 30279 16441 43571 36668 -7256 -17473 36415 50999 44744 62609
21636F2609J312m2019P237r992k441N428j6214J0161k510j5639J3526K4524L148
$$ 62609 63921 21902 29139 19147 16706 22134 5920 16081 13571 -2068 11458 35982 39130
21623C9130k0535j9698Q624l5841q981J5572J3996J5550L5533R043L0240l3568
$$ 39130 18595 -1103 7521 -28320 -37301 -21729 -7733 7817 43350 52393 82633 49065
21611D9065m1870J4188N139M735J4942j0265q945j1631k7851j7108q174M2425
$$ 49065 7195 21383 26522 31257 46199 35934 26989 15358 -12493 -29601 -37775 4650
21599D650J9736l6487K1082m1469j2908k5679M5043L6365N2509L362k2035l7427
$$ 4650 24386 -12101 8981 -32488 -45396 -71075 -26032 10333 62842 66204 44169 6742
21587F742l251J0031J7462j2540Q739j1618J981j168K3993J8757n6907k4272K11
$$ 6742 3491 13522 30984 18444 27183 15565 17546 16378 40371 59128 2221 -22051 -21840
21574b1840J2600L0940k3448l8265n2133j1643J3063L3392M9049J9686m2527K4032
$$ -21840 -9240 21700 -1748 -40013 -92146 -103789 -90726 -57334 -8285 11401 -31126 -7094
21562g094K839J0473m128k2511K3137K9393J3140R409R024J273m9261N210O198
$$ -7094 -4255 6218 2090 -20421 2716 32109 45249 54658 63682 64955 15694 20904 27102
21549B7102m831o698o91m924o585J094J0079q481p972O876j5319M9785P136O710
$$ 27102 22271 15573 14882 9958 3373 4467 14546 6065 -1907 4969 -10350 39435 46571 53281
21535E3281j1894q875k7145k0659M673k7959L898Q616K9322J9839K289j409K3027
$$ 53281 41387 32512 5367 -15292 -10619 -38578 -34680 -26064 3258 23097 25386 23977 47004
21522D7004J0865K3110r34l5330k3790J502L013l843l5686O137K6185J7800j1206
$$ 47004 57869 80979 80045 44715 20925 22427 25440 21597 -14089 -7952 18233 36033 24827
21509B4827k8444p924q312O563k0219J0842N6243r480p4791n415J2602r295K6033
$$ 24827 -3617 -11541 -19853 -13290 -33509 -22667 33576 24096 -50695 -56110 -43508 -52803 -26770
21496b6770Q140o225M572R284K6995K0332Q228J2254k7037l0581m197O2196J7902
$$ -26770 -18630 -24855 -20283 -10999 15996 36328 44556 56810 29773 -808 -5005 57191 75093
21483G5093j3711k7392J3226k172o7463k6720j1460M1990M6246j9222j2025N115
$$ 75093 61382 33990 47216 45044 -22419 -49139 -60599 -18609 27637 8415 -3610 1505
21471A505l1005J0302L7196J3744j6338J4074J4303l0479k7037L8181R113j1397
$$ 1505 -29500 -19198 17998 31742 15404 29478 43781 13302 -13735 24446 33559 22162
21459B2162j4804j8685p949J9987L9570k5905j3742r34J4452l4892j6893m580
$$ 22162 7358 -11327 -19276 711 40281 14376 634 -300 14152 -20740 -37633 -42213
21447d2213J539Q857M1887K6909R459k7834j4925p469K7838R188j0075j3621n01
$$ -42213 -40674 -31817 10070 36979 46438 18604 3679 -3790 24048 33236 23161 9540 9039
21434I039L9938j0959k6627O606Q139K6902j4003k2252K3414p809r218k0770k4700
$$ 9039 48977 38018 11391 17997 26136 53038 39035 16783 40197 32388 23170 2400 -22300
21421b2300K9158L7802k0481j2982R979M2998K3325J2304k4229j5325j8338j2705
$$ -22300 6858 44660 24179 11197 21176 64174 87499 99803 75574 60249 41911 29206
21409B9206k2783m3247l7495L1312M5901K861J1772l7662k6140J9445L7311J7065
$$ 29206 6423 -36824 -74319 -43007 2894 5755 17527 -20135 -46275 -26830 10481 27546
21397B7546j510j5373R807L1504P295k8572l2323J1340m056j3240J0832J516Q085
$$ 27546 26036 10663 20470 51974 59269 30697 -1626 9714 5658 -7582 3250 4766 12851
21384A2851O301J1010J193k2113L6936L6896J4581j2314k8582k6214l9853j5468
$$ 12851 19152 30162 31355 9242 46178 83074 97655 85341 56759 30545 -9308 -24776
21372b4776k6989J7659k390k3111N474M2196N893l4972J8939L3271J4404j292
$$ -24776 -51765 -34106 -36496 -59607 -54133 -11937 -6044 -41016 -22077 11194 25598 24306
21360B4306j9453j2264j7401j2689K671P863p6254j3891M4898K796l1166N880
$$ 24306 4853 -7411 -24812 -37501 -34830 -26967 -103221 -117112 -72214 -69418 -100584 -94704
21348i4704N7686P5794k2269L5405l092o418n989m0868m8628q989N5818L0200
$$ -94704 -37018 38776 16507 51912 48820 42402 36413 -4455 -53083 -62072 -6254 23946
21336B3946N8419P525j3614k7911q976j3873l8721k0583o432r828J7191M2850
$$ 23946 82365 89890 76276 48365 39389 25516 -13205 -33788 -40220 -50048 -32857 9993
21324I993L893p933J671L092l8861J1043K19j6284J4010j728k4271k238L2604
$$ 9993 13886 5953 7624 10716 -28145 -17102 -16883 -33167 -19157 -20885 -45156 -47394 -14790
21311a4790o907J9786Q734K5782M0986J4576k8080m2880M754J3910L99j6538j837
$$ -14790 -21697 -1911 6823 32605 73591 88167 60087 17207 21961 35871 36270 19732 17895
21298A7895K2095J6371J2246l7311l6544k8957k8615k2926K5131O8922M9044K1483
$$ 17895 39990 56361 68607 31296 -5248 -34205 -62820 -85746 -60615 8307 57351 78834
21286G8834p881n4718R022P106k7429j6202l734J4574J0112j445r546L1330K4723
$$ 78834 70953 16235 25257 32363 4934 -11268 -15002 -428 9684 8239 -1307 30023 54746
21273E4746j5175L5268N9136n6421m8145l6785k2705N8095o80k6763N3159j0118
$$ 54746 39571 74839 133975 77554 29409 -7376 -30081 28014 27334 571 53730 43612
21261D3612k1870J8112j2179J20J3026l1097m9251l7403P07j469M5071P108K5624
$$ 43612 21742 39854 27675 27795 40821 9724 -39527 -76930 -76223 -77692 -32621 -25513 111
21248A11L6143L1046j899j0113l6868k6715J811j2518m112K5747o687L619N634
$$ 111 36254 67300 65401 55288 18420 -8295 -6484 -19002 -23114 2633 -4054 -435 5199
21235E199j3139j2886J4937L8006K8749j3509j7088j9259p879O715q144K0974
$$ 5199 -7940 -20826 -5889 32117 60866 47357 30269 11010 3131 9846 1702 22676
21223B2676K5059n1122l6754N6755l134k8595L0193J800r088m2689K1714K8128
$$ 22676 47735 -3387 -40141 16614 13480 -15115 15078 16878 7790 -34899 -13185 14943
21211A4943m322k1550J0849K2815k5138m1226L5617L1144J0417J3987k4410j5381
$$ 14943 10621 -10929 -80 22735 -2403 -43629 -8012 23132 33549 47536 23126 7745
21199G745j9896J3737L1203j5767K808Q252K9222j5928k9593N404J1173j2924
$$ 7745 -12151 1586 32789 17022 19830 28082 57304 41376 11783 17187 28360 15436
21187A5436j6642j7736N095N73L0890L3105L6704j927k5066k5620o951l7744L9967
$$ 15436 -1206 -18942 -13847 -13274 17616 50721 87425 85498 60432 34812 27861 -9883 30084
21174C0084N91m2008J1737L0771k4136N353R031l78J084J328L046K9527K1983
$$ 30084 30675 -11333 404 31175 7039 12392 21423 21045 22129 23457 26503 56030 78013
21161G8013j9112k7154l1334l4426Q295k6499O444O2378L1656q27K0684l7542
$$ 78013 58901 31747 413 -34013 -25718 -52217 -45773 16605 48261 47434 68118 30576
21149C0576P539N418R673N741l1854l3382k7678N413M671K7322N7252R918o172
$$ 30576 38115 43533 53206 58947 27093 -6289 -33967 -28554 -23883 3439 60691 70609 64437
21136F4437l9586k2268K6080L4381K1138k6995P673n397l9791m6730J0619m991
$$ 64437 24851 2583 28663 63044 84182 57187 64860 59463 19672 -27058 -16439 -21430
21124b1430M609K3143R12r779k129J4903K6729j1875p609k7567q309M8235Q202
$$ -21430 -16821 6322 7234 -2545 -4674 10229 36958 25083 17474 -10093 -18402 29833 38035
21111C8035k5376K096L5471j505K2710k0402l4454p09R77j2277k843K0865K2388
$$ 38035 12659 14755 50226 48721 71431 51029 16575 15866 16843 4566 1723 22588 44976
21098D4976j7092k9391k0158K8957J3487k6168L151K4842k8560l2569L5876L9371
$$ 44976 27884 -1507 -21665 7292 20779 -5389 -2238 22604 -5956 -38525 -2649 36722
21086C6722P462j6578j2579L8595K316K931k143j2645j1961J4429k0204M9168
$$ 36722 44184 27606 15027 53622 55938 58869 56726 44081 32120 46549 26345 75513
21074G5513J36J6324l2843j9023j2818R74M057r403J5765M410j938J1919o328
$$ 75513 75649 91973 59130 40107 27289 28263 32320 22917 38682 43092 41154 53073 46745
21061D6745K563j8680J7839N628J2494n337p792j6015l7622k9446K7900J5188
$$ 46745 49308 30628 48467 54095 66589 61252 53460 37445 -177 -29623 -1723 13465
21049A3465J1398k840k6894j1703m374j656L9719K1771j6073l0100J7008N3588
$$ 13465 24863 22023 -4871 -16574 -20948 -22604 17115 38886 22813 -7287 9721 63309
21037F3309K6635k3546j1553l8079m057J6690n2682o54M4781L6883P214k793q861
$$ 63309 89944 66398 54845 16766 12709 29399 -23283 -23937 20844 57727 64941 62148 53287
21024E3287K433K9641j9995j0025K7289l5783j5076n4800j4231K022j1764J1739
$$ 53287 55720 85361 65366 55341 82630 46847 31771 -23029 -37260 -35238 -47002 -35263
21012c5263J2921k1311N4264Q865m5958L3098J664K3608k38j8992m294k117o780
$$ -35263 -22342 -43653 10611 19476 -26482 6616 8280 31888 31650 12658 8364 6247 -533
20999e33j8362J6961r766r754L8628J6123J3285K7839j8137J0859K081k1633J843
$$ -533 -18895 -1934 -11700 -21454 17174 33297 46582 74421 56284 67143 69224 47591 49434
20986D9434l9785o052K4395j0061k3034J8922J8926m45J3984J5459O83R658j1769
$$ 49434 9649 3597 27992 17931 -5103 13819 32745 32300 46284 61743 62426 72084 60315
20973F0315r759J2061j2686k4023J2284j8549l2415m677l455K9203n384p741K1817
$$ 60315 50556 62617 49931 25908 38192 19643 -12772 -17449 -20904 8299 2915 -4826 16991
20960A6991j742r335K7551J1845j0257q9147k2342L8777O8877J3047j955k8095
$$ 16991 15249 5914 33465 45310 35053 -54094 -76436 -37659 31218 44265 42310 14215
20948A4215m2570n136K5146N606j4960r689q13K2476M9313L0322k5767k3932Q518
$$ 14215 -28355 -33491 -8345 -2739 -17699 -27388 -28201 -5725 43588 73910 48143 24211 32729
20935C2729k9970l4860K0842K7066L3978k3088j1915J8024J8742k4994l3693L1365
$$ 32729 2759 -32101 -11259 15807 49785 26697 14782 32806 51548 26554 -7139 24226
20923B4226n58j0999Q899J2965n428n722J0985J1241p505k7808j4036R449J8929
$$ 24226 23668 12669 21568 34533 29105 23383 34368 45609 38104 10296 -3740 5709 24638
20910B4638j4284j6110l3188N948o823J6522J0141N155K6940J6657l4884m7623
$$ 24638 10354 -5756 -38944 -32996 -39819 -23297 -13156 -8001 18939 35596 712 -46911
20898d6911K7131m9J4573j2165J5372J315j611J9568M8418j7219l3033m631J980
$$ -46911 -19780 -19829 -5256 -17421 -2049 -734 -2345 17223 65641 48422 15389 10758 12738
20885A2738j876n708m2411J3609k9457l562K3967K2627J5789J7630j8187m8539
$$ 12738 10862 5154 -37257 -23648 -53105 -56667 -32700 -10073 5716 23346 5159 -43380
20873d3380j7816L6403l0968q353J4967r790K6390J1224R791J8271R740K1564
$$ -43380 -61196 -24793 -55761 -64114 -49147 -58937 -32547 -21323 -11532 6739 16479 38043
20861C8043k808P291o1032k6595R773K0478J4989j3467k6157l832Q275J2714K6145
$$ 38043 35235 42526 -18506 -45101 -35328 -14850 139 -13328 -39485 -43317 -35042 -22328 3817
20848C817J9730k9019o447K6254L3758J1549j2978m446J5226j2173m5898J466
$$ 3817 23547 -5472 -11919 14335 48093 59642 46664 42218 57444 45271 -627 839
20836H39J793l5999K2420M4594K8484j2620k7856j3560K3525L9282l701o1983
$$ 839 2632 -33367 -10947 33647 62131 49511 21655 8095 31620 70902 67201 5218
20824E218j5462K3200L8565r052Q54k3454j0424M1565M422Q047k005j4821q532
$$ 5218 -10244 12956 51521 42469 43323 19869 9445 51010 55432 63479 61474 46653 38121
20811C8121q307j6176J4179L6432M5811k3593K999L782l2175K0092J8755n718
$$ 38121 29814 13638 27817 64249 110060 86467 89466 93248 61073 81165 99920 94202
20799I4202k5268o339l5195l4748n5964L2333O1218j2787n7228k5459K6650L0333
$$ 94202 68934 62595 27400 -7348 -63312 -30979 30239 17452 -39776 -65235 -38585 -8252
20787h252J8849n649k0595J1844l6250J7326J1439K464l83J3432L2418L3565J4071
$$ -8252 10597 4948 -15647 -3803 -40053 -22727 -11288 -8824 -9207 4225 36643 70208 84279
20774H4279O739m028l7087l1937L7617L5245j517j8921J7518R452j7754k088k0518
$$ 84279 91018 86990 49903 17966 55583 90828 89311 70390 87908 97360 79606 77518 57000
20761E7000o304P172J3803l3595q582L1758j16m1749l4916K6591j2066l3407m4799
$$ 57000 50696 57868 71671 38076 29494 61252 61136 19387 -15529 11062 -1004 -34411 -79210
20748g9210J0429L7404L9524L1719l3795m761k1061O733j8237K6681j2088j224
$$ -79210 -68781 -31377 8147 39866 6071 1310 -19751 -13018 -31255 -4574 -16662 -17886
20736a7886j3818L4038M5215J8244L1787J1664j6231k630k3988j5999l3083L22
$$ -17886 -31704 2334 47549 65793 97580 109244 93013 90383 66395 50396 17313 17635
20724A7635K2094p135j3084J5834J4007N104l8112k9571K7723K482j9852R916
$$ 17635 39729 32594 19510 35344 49351 54455 16343 -13228 14495 16977 -2875 7041
20712G041k5856k6304j821P543L8409K6960L428j3091N159K4246j2068j9081r137
$$ 7041 -18815 -45119 -46940 -39397 -988 25972 29400 16309 21468 45714 33646 14565 5428
20699E428J9627P430P415k1794j7365K2819O191Q581k1534J3328O603j044R798
$$ 5428 25055 32485 39900 18106 741 23560 29751 38332 16798 30126 36729 35685 45483
20686D5483j2772K2045J7242k081j5355l9960k9957K6J0587K9240J8212n1518
$$ 45483 32711 54756 71998 69917 54562 14602 -15355 -15329 -4742 24498 42710 -8808
20674h808l2627L2364K748K3324L1310j6446m759k6059q785J2777P22J1098l5631
$$ -8808 -41435 -9071 -6323 17001 48311 31865 27106 1047 -7738 5039 5761 16859 -18772
20661a8772j0032M0613K5750Q992m4949j1837Q656J0155r793L1957J4399l862
$$ -18772 -28804 11809 37559 46551 1602 -10235 -1579 8576 -1217 30740 45139 41277
20649D1277j7252O537L4233r367L3697M5709l5811q36J2360k2464j7817q783k8964
$$ 41277 24025 30562 64795 55428 89125 134834 99023 98187 110547 88083 70266 61483 32519
20636C2519l176j0393m4784Q849o511n438M781M9341K9847J9944J1977l6502r119
$$ 32519 29343 18950 -25834 -16985 -23496 -28934 -24153 25188 55035 74979 86956 50454 41335
20623D1335O889M976m117j0604j8712j3554L0129L158q221M245k4948j0052Q159
$$ 41335 48224 53200 49083 38479 19767 6213 36342 39500 31279 35524 10576 524 8683
20610H683O108K7644m518o577q707K8304M672m1478j9949M796J550j0355L0122
$$ 8683 14791 42435 37917 31340 22633 50937 55609 14131 -5818 -1022 528 -9827 20295
20597B0295L8706M925j0639l191J0155j2810O281L230j2805q874J4869K406N6
$$ 20295 59001 63926 53287 50096 60251 47441 53722 56952 44147 35273 50142 52548 52604
20584E2604j8481j092l561q8M1583L5930q93n5804m6105J3033L0732J7590J279
$$ 52604 34123 33031 29470 29382 70965 106895 106002 50198 4093 17126 47858 65448 66727
20571F6727l0617j8353j1133k9146K4386J9585j5793K0263L0110J8090k3139j9200
$$ 66727 36110 17757 6624 -22522 1864 21449 5656 25919 56029 74119 50980 31780
20559C1780m500J7356K874j2031J1263K3340J704l3788M161J5905L4391J3512
$$ 31780 27280 44636 47510 35479 46742 70082 71786 37998 42159 58064 92455 105967
20547A05967l3193l1810J3688J5798K790J4562J435j3296N810k011m6425l60R88
$$ 105967 72774 40964 54652 70450 73240 87802 89237 75941 81751 79740 33315 32955 33943
20534C3943j6280R008M1195J1406k8765l7735k1971l796J4723L7458r343J686
$$ 33943 17663 26671 67866 79272 50507 12772 -9199 -12995 1728 39186 29843 31529
20522C1529j8689k1786K0136L964O2789J1726o4747N858m523j0917R28R371K2464
$$ 31529 12840 -8946 11190 15154 77943 89669 24922 30780 26257 15340 16268 25639 48103
20509D8103q055q05K1090M171p463k8927J851j744K4445L1502j7958r703L590
$$ 48103 40048 39243 60333 64504 57041 28114 29965 28221 52666 84168 66210 56507 60097
20496F0097l793K9155R215k45O328R062p763n7020l0913K7640O0626m360o1530
$$ 60097 56304 85459 94674 94429 100757 109819 102056 45036 14123 41763 102389 98029 36499
20483C6499k7487J7671L2212Q309J085J1144l815J9639j7090j0990m0328k3886
$$ 36499 9012 26683 58895 67204 68289 79433 75618 95257 78167 67177 26849 2963
20471B963J2608J1941J7806K5400K065k0718o15j6854r99q801K2111K1083O545
$$ 2963 15571 27512 45318 70718 72783 52065 51450 34596 33597 24796 46907 67990 74535
20458G4535J0876M046k0043O871l4761K8599K8849L704l3304l3043j1965K0268
$$ 74535 85411 89457 69414 76285 41524 70123 98972 102676 69372 36329 24364 44632
20446D4632Q174N6449j5661M32j3292N881j4029k744j4095M598J6510L909k700
$$ 44632 52806 109255 93594 94026 80734 86615 72586 69842 55747 60345 76855 80764 78064
20433G8064l3638K2317N304k3320o124L7566j0554J936K5854L308k1400J2093
$$ 78064 44426 66743 72047 48727 42603 80169 69615 71551 97405 100713 79313 91406
20421I1406K7617r57l2581k3179m8900K5584L3655K1338K2093k7619m5347n572
$$ 91406 119023 118066 85485 62306 13406 38990 72645 93983 116076 88457 43110 37538
20409C7538o8856L929N7592L7678j1918l0530k2389p611K2359L0834O451K1237
$$ 37538 -31318 -27389 30203 67881 55963 25433 3044 -4567 17792 48626 55077 76314
20397G6314K3162m761l8111j9956q027k3903J9768N836j4749L1766j73k7533L1024
$$ 76314 99476 94715 56604 36648 28621 4718 24486 30322 15573 47339 47166 19633 50657
20384E0657L6251m229r993k6290Q618M7559K1299k1497n0575J9468j0897l8021
$$ 50657 86908 82679 72686 46396 55014 102573 123872 102375 51800 71268 60371 22350
20372B2350k1429o316j9272J4835J3648P945Q977J9990k1895N3051K9763l9558
$$ 22350 921 -5395 -24667 -9832 3816 11761 20738 40728 18833 71884 101647 62089
20360F2089K329J2177k0324L8126J3558Q807R637K47k8066k2491J1186J7392j583
$$ 62089 64418 76595 56271 94397 107955 116762 126399 126646 98580 76089 87275 104667 103084
20347A03084l5750n5733m2442N7287L6580o732l691L2999L1606k9043l5292K1326
$$ 103084 67334 11601 -30841 26446 63026 56294 52603 85602 117208 88165 52873 74199
20335G4199J0252j9687j1591J9002O778P228m5278o364j4695j921R270o745J2026
$$ 74199 84451 64764 53173 72175 78953 86181 40903 34539 19844 17923 27193 20448 32474
20322C2474J9794K6331P51j6175j0270n777J8326j4348N419J5776k2769l110P817
$$ 32474 52268 78599 79350 63175 52905 47128 65454 51106 56525 72301 49532 46422 54239
20309E4239R546l1178l303L69j8112m467K9113P77L320K1930k9396J631K6428
$$ 54239 63785 32607 29304 29673 11561 7094 36207 36984 40304 62234 32838 34469 60897
20296F0897P886Q677K8916K331P620j2566j7217j5450k2348m1584l6616Q274L7064
$$ 60897 68783 77460 106376 108707 116327 103761 86544 71094 48746 7162 -29454 -21180 15884
20283A5884N5375R611j45m329j1546J6761n4490l2011Q463O2801M9114r580o4034
$$ 15884 71259 80870 80725 76396 64850 81611 27121 -4890 3573 66374 115488 105908 41874
20270D1874O890M3449J1963P941l5420j2341J1114j0216k380K8573M6720K891
$$ 41874 48764 92213 104176 112117 76697 64356 75470 65254 62874 91447 138167 141058
20258A41058n0708J0148j8096k8112O143K9974K5813K3606m08r089o839o1506
$$ 141058 90350 100498 82402 54290 60433 90407 116220 139826 139418 130329 123490 61984
20246F1984l2090J7446j806M7224L423K611j0731l0272k9457K8764N6545L487
$$ 61984 29894 47340 45534 92758 96181 98792 88061 57789 28332 57096 113641 117128
20234A17128k7348J1708o466n696M455J5386J8649J0269j8441K1023L9837n193
$$ 117128 89780 101488 95022 89326 93781 109167 127816 138085 119644 140667 180504 175311
20222A75311k1640p868n4783j9971o289j0654n776j3355K1775M5270j5877n2584
$$ 175311 153671 145803 91020 71049 64760 54106 48330 34975 56750 102020 86143 33559
20210C3559J64p53M827L8967J3952J7567J6860j3845j6187m160K1745m791j5985
$$ 33559 33723 32970 37797 76764 90716 108283 125143 111298 95111 90951 112696 107905 91920
20197I1920M903J8641L6167K3482m494l8951n106P807n2625Q010N7519N3117J1339
$$ 91920 96823 115464 151631 175113 170619 131668 126562 134369 81744 89754 147273 200390 211729
20184B11729Q7l5565k4876l9291l7937M691J0157K1857M2438K7223K1360O4027
$$ 211729 211816 176251 151375 112084 74147 78838 88995 110852 153290 180513 201873 265900
20172B65900N4264P4083J45469K45706J34132M0046L1513j36151k37235j98971
$$ 265900 320164 394247 539716 785422 919554 959600 991113 854962 617727 418756
20162D18756j26642m7016l8389o856N094L6585j7442n4115j2261J5192Q297k8634
$$ 418756 292114 245098 206709 199853 204947 241532 224090 169975 157714 172906 181203 152569
20150A52569p416N163j9779j1683K6961K1442N829j0568q477K5283N732j9161
$$ 152569 145153 150316 130537 118854 145815 167257 173086 162518 154041 179324 185056 165895
20138A65895K0247P000k0657L2157L5631O2058J64133K02423K35584J61825M258
$$ 165895 186142 193142 172485 204642 240273 302331 466464 668887 904471 1066296 1070554
20127A070554o2512j46998k07288j29552n3823n4524j0944K2699R0482J84258
$$ 1070554 1008042 861044 653756 524204 470381 415857 404913 427612 518094 702352
20117G02352K81504K30940J04141l1675n6945L2320P3560J1489j39139k03650
$$ 702352 983856 1214796 1318937 1287262 1230317 1262637 1336197 1347686 1208547 1004897
20107A004897k48820j74849j56213j08820l7606J2219j5542k157J2746K251P46
$$ 1004897 756077 581228 425015 316195 278589 290808 275266 273109 285855 288106 288852
20096B88852Q659J6169l4344j7514l4226j0113j8639p438j1413L1694l328K5764
$$ 288852 297511 313680 279336 261822 227596 217483 198844 191406 179993 211687 208359 234123
20084B34123L0913J8198K4314Q0915J29698J66468K39782K41470J51643R285n3121
$$ 234123 265036 283234 307548 388463 518161 684629 924411 1165881 1317524 1326809 1273688
20073A273688K8809N4434m0671j54063j99629k04116j35315j10899q2712J863
$$ 1273688 1302497 1356931 1316260 1162197 962568 758452 623137 512238 429526 431389
20063D31389L1863P7319J64697K35665J79981Q1815j23001k57827k00943j78209
$$ 431389 463252 540571 705268 940933 1120914 1202729 1079728 821901 620958 442749
20053D42749j09816p5945k6790q611j7698k5573M0681K2928j7255o684M26J1009
$$ 442749 332933 256988 230198 221587 203889 178316 218997 241925 224670 217986 218412 229421
20041B29421K5129R825L2767k7418J3109q386j9509m7071l9209J3065J5820J2990
$$ 229421 254550 264375 297142 269724 282833 274447 254938 207867 168658 181723 197543 210533
20029B10533K2826K906K6414M8927J0090K0285R9327J70738K47405K18112N8198
$$ 210533 233359 236265 262679 311606 321696 341981 441308 612046 859451 1077563 1135761
20018A135761q4299k10139k26480j73748q2979m8040q3642j0138L266l9977N784
$$ 1135761 1051462 841323 614843 441095 358116 310076 226434 216296 219562 179585 185369
20007A85369K5706m8693m7393J9476L4575J4770L7450j5747j9837O142J97j388
$$ 185369 211075 162382 114989 134465 169040 183810 221260 205513 185676 191818 192015 190627
19995A90627J2941k7885J7393J0057J2887q542m055J6581J4684K7568j0576n1556
$$ 190627 203568 175683 193076 203133 216020 207478 203423 220004 234688 262256 251680 200124
19983B00124k5483N6005o456k7748k281J7580K4852n8707k7713p126J8275j3331
$$ 200124 174641 230646 224190 196442 194161 211741 236593 177886 150173 143047 161322 147991
19971A47991j7292l521o420N700n0820j1080J2993R478K9692M510J7319K8100
$$ 147991 130699 127178 120758 126458 75638 64558 77551 87029 116721 121231 138550 166650
19959A66650k9695n745R029L0312k385j3463J6845K8222J6312j2439n0722K0055
$$ 166650 136955 131210 140239 170551 168166 154703 171548 199770 216082 203643 152921 172976
19947A72976K0161k1188J6319O307K2120J873m3603k9018l4215q191J2523N4872
$$ 172976 193137 171949 188268 194575 216695 218568 174965 145947 111732 103541 116064 170936
19935A70936L6377j992m2218l0598O701k46K0884L5039J5872M597k012j3530k4113
$$ 170936 207313 205321 163103 132505 139206 138960 159844 194883 210755 215352 213340 199810 175697
19922A75697j2564K610J0761J3409m1045k244L9702K6239k9142l5007j9073L8541
$$ 175697 163133 165743 176504 189913 148868 146624 186326 212565 183423 148416 129343 167884
19910A67884M610L0087K5723L0316J7519m4304m9362K7979k63P368o01J207l213
$$ 167884 172494 202581 228304 258620 276139 231835 182473 210452 210189 217557 216956 218163 214950
19897B14950j0129j9639M1690Q6408N988j9888L7119L4575l0930l5912k6206j664
$$ 214950 204821 185182 226872 313280 319268 299380 336499 371074 340144 304232 278026 276362
19885B76362j6167k959m024K5695L943l5644l5507k202P573q887j3413L2981L7653
$$ 276362 260195 257236 253212 278907 282850 247206 211699 209497 217070 208183 194770 227751 265404
19872B65404j0212k2377J357K8029l641l7288P882o750k8968K133j0777N906K7508
$$ 265404 255192 232815 234172 262201 258560 221272 229154 222404 193436 195569 184792 190698 218206
19859B18206j5767m0283M1114Q5322R3817N8866k154j2078m9178l8762K2439K6022
$$ 218206 202439 162156 203270 288592 382409 441275 439121 427043 377865 339103 361542 387564
19847C87564m3322n4846l2248M6425M040K6715M0170L9531L1410J4661J0164j0400
$$ 387564 344242 289396 257148 303573 307613 334328 374498 414029 445439 460100 470264 459864
19835D59864l4400m7442j0768n0232N211J0861k3420n1486m0652J1979K3772k4206
$$ 459864 425464 378022 367254 317022 322233 333094 309674 258188 217536 229515 253287 229081
19823B29081p207J0337o318j8927j9117j0326J3818P5261L8794L2056Q443j2324
$$ 229081 221874 232211 225893 206966 187849 177523 191341 266602 305396 337452 345895 333571
19811C33571j2383j3223Q831n573n693j847K2073N846p622Q12M9409P9094K6656
$$ 333571 321188 307965 316796 311223 305530 303683 325756 331602 323980 324792 374201 453295 479951
19798D79951K2146J9605K995q2249m7539l7151j1578L4563K3272N50N8m439k7965
$$ 479951 502097 521702 524697 442448 394909 357758 346180 380743 404015 404565 404623 400184 372219
19785C72219L8778K6820l2248q543K7201k5145J1013l579k278k3722R8K714l8324
$$ 372219 410997 437817 405569 397026 424227 399082 410095 406516 404238 380516 380614 383328 345004
19772C45004m3849l3013Q424K2625J1453L2237l481L9408l3642M621Q359m533
$$ 345004 301155 268142 276566 299191 310644 342881 339400 378808 345166 349787 358146 353613
19760C53613j1887Q337J7367O402k8K7279J1362K0316J7676k073n675k0144J9329
$$ 353613 341726 350063 367430 373832 373804 401083 412445 432761 450437 448364 442689 422545 441874
19747D41874K8628K3741K9596J8573l1943r598n1668j0576R963P680o386K1429
$$ 441874 470502 494243 523839 542412 510469 500871 449203 438627 448590 456270 449884 471313
19735D71313P0997Q0169J5524L14j8945m466J0711J1044j2923J3259L4198m1541
$$ 471313 542310 622479 638003 638317 619372 614906 625617 636661 623738 636997 671195 629654
19723F29654m541O5671K3190j8443k5783m2180m9310o03K3638m5752r354N0982
$$ 629654 625113 690784 713974 695531 669748 627568 578258 577655 601293 555541 546187 597169
19711E97169Q5072M1553m191O814k7017k8962J538K7362J8298q724L8340J9806
$$ 597169 682241 723794 719603 726417 699400 670438 671976 699338 717636 708912 747252 767058
19699G67058J0430P317M3294P8003R5023J17983P9387J8482l7183j210J2255P0201
$$ 767058 777488 784805 828099 906102 1001125 1119108 1198495 1216977 1179794 1178584 1190839 1261040
19687A261040N4203N4031J11809J63770K11896K55422J85543P7705o6566j10610
$$ 1261040 1315243 1369274 1481083 1644853 1856749 2112171 2297714 2375419 2308853 2198243
19677B198243l287J27794J30190M9078j1985j39022k18034j90629o9757q992P4948
$$ 2198243 2194956 2322750 2452940 2502018 2490033 2351011 2132977 1942348 1872591 1863599 1938547
19666A938547J06806J06956J26909J73209K70084L49706K99121K20206J48753
$$ 1938547 2045353 2152309 2279218 2452427 2722511 3072217 3371338 3591544 3740297
19657C740297Q1570J43308K83358L80745M69001N32679O45355Q53672J096283
$$ 3740297 3821867 3965175 4248533 4629278 5098279 5630958 6276313 7129985 8226268
19648H226268J502141K081420K892312M326653O639960J0630565J8110905L1024158
$$ 8226268 9728409 11809829 14702141 19028794 25668754 36299319 54410224 85434382
19640H5434382M3287643L0482716R004887j2261076l5206748l8846251k7530040
$$ 85434382 128722025 159204741 168209628 155948552 120741804 81895553 54365513
19633E4365513j6172862r719740o119039l991359k694960j887248j383121r29799
$$ 54365513 38192651 28472911 22353872 18362513 15667553 13780305 12397184 11467385
19625A1467385n35802k68808j45701j31383k04219j86758l9751l0352r8827q3808
$$ 11467385 10931583 10662775 10517074 10385691 10181472 9994714 9954963 9924611 9825784 9741976
19615I741976j14907r6950J71299N09653Q70035J327825J831163K355962L089313
$$ 9741976 9627069 9530119 9701418 10211071 11081106 12408931 14240094 16596056 19685369
19606A9685369M370692O678058J0637618J7796098L0361298M3830077L3421698
$$ 19685369 24056061 30734119 41371737 59167835 89529133 133359210 166780908
19599A66780908J0805797j0395442l3612747l7594018k5728131j2921696m476610
$$ 166780908 177586705 167191263 133578516 95984498 70256367 57334671 52858061
19592E2858061K190912R567921K0339140L6421686M7966869L3003973J4026816
$$ 52858061 55048973 64616894 84956034 121377720 169344589 202348562 216375378
19585B16375378n495501o760911R241912N488132o325158k4927111m4610659m3997723
$$ 216375378 210879877 204118966 213360878 218849010 212523852 187596741 142986082 98988359
19577I8988359l0141484j8102278j1406747p476111n021315l393201k371971j683321
$$ 98988359 68846875 50744597 39337850 31861739 26840424 23447223 21075252 19391931
19569A9391931j250712p56851l36456r9846n5518j72957k82218k14484q3778L20728
$$ 19391931 18141219 17384368 17047912 16948066 16892548 16719591 16437373 16222889 16139111 16459839
19559A6459839Q43421J227057J693241K415879L429634N277799Q380370J3396590
$$ 16459839 17303260 18530317 20223558 22639437 26069071 31346870 39727240 53123830
19551E3123830K2310467L7139859M9762914L5952095J5782449m257768p885243
$$ 53123830 75434297 112574156 162337070 198289165 214071614 209813846 201928603
19544B01928603Q828534Q336465m452498k2370897m2674035m3098169k8955739
$$ 201928603 210757137 219093602 214641104 192270207 149596172 106498003 77542264
19537G7542264j5414042o726818n4874P198404J7831767L3870036M5688662K8322776
$$ 77542264 62128222 55401404 55346530 62544934 80376701 114246737 159935399 188258175
19529A88258175L606768k5879697m4106508l9788232k5633351j5284367r667160
$$ 188258175 191864943 165985246 121878738 82090506 56457155 41172788 31505628
19522C1505628o415802m434062l212209k409466j818662j386198r72129n20202
$$ 31505628 25089826 20655764 17443555 15034089 13215427 11829229 10857100 10336898
19514A0336898j44187K7813l1367j37560q1352p3796l8182O3828o8939j40408
$$ 10336898 10192711 10220524 10189157 10051597 9970245 9896449 9858267 9922095 9853156 9712748
19504I712748l5979K19247P32813J169825J570540K157147K940307M442332P146643
$$ 9712748 9676769 9896016 10628829 11798654 13369194 15526341 18466648 22908980 30055623
19495C0055623J1807594K0340500L4742187M7293410L1887133O264508k3004751
$$ 30055623 41863217 62203717 96945904 144239314 176126447 182390955 159386204
19488A59386204m3014431m0151994k6186027j5284993r437698o165169m161043
$$ 159386204 116371773 76219779 50033752 34748759 25311061 19145892 14984849
19481A4984849k830242k027926j469557j207626r49249p53688o03837m48985l35286
$$ 14984849 12154607 10126681 8657124 7449498 6500249 5746561 5142724 4693739 4358453
19472D358453k42103j21722j74028k23343l24245m43048m17472l13243k08686
$$ 4358453 4116350 3994628 3820600 3597257 3273012 2829964 2412492 2099249 1890563
19463A890563j21918o5697l1595k6180J6331R0589K01937J50735L0313j13687
$$ 1890563 1768645 1702948 1671353 1645173 1661504 1752093 1954030 2104765 2135078 2021391
19453B021391k65489k40202j04485Q1340N4025O664j54289k12308k32824j93691
$$ 2021391 1755902 1515700 1411215 1492555 1546580 1553244 1398955 1186647 953823 760132
19443G60132r1194k8595m7514o7686m9513l2493j3208j9709k0552m2831r7K6790
$$ 760132 668938 640343 592829 525143 475630 443137 429929 410220 389668 346837 346740 373530
19431C73530l1760L194K3021J1325j5964l0981o27k1316K9115J2859K9088J3709
$$ 373530 341770 344964 367985 379310 363346 332365 331738 310422 339537 352396 381484 395193
19419C95193J9147k9194m6677J3622J6103m4743n0196m5944m6923l159M6734j1633
$$ 395193 414340 385146 338469 352091 368194 323451 273255 227311 180388 177229 223963 212330
19407B12330l6191K6854L9251j3003K3026J6130j4425j8974J2955j9049n8404
$$ 212330 176139 202993 242244 229241 252267 268397 253972 234998 247953 228904 170500
19396A70500m1225k3023O450M6477K7237j4059l6906J7812K2305k2749M212J8757
$$ 170500 129275 106252 112702 159179 186416 172357 135451 153263 175568 152819 157031 175788
19384A75788R350j8427p0356j1463j0632l5945p086M0025J5779M4935K8739M2806
$$ 175788 185138 166711 96355 84892 74260 38315 31229 71254 87033 131968 160707 203513
19372B03513N0713m5126o8630k4777J3534N758j2078M2620Q1193L642m8282m3186
$$ 203513 254226 209100 140470 115693 129227 134985 122907 165527 246720 250362 202080 158894
19360A58894l5323K1020N8482N798l8825k8138j5699n874K7536k1106m4508l4063
$$ 158894 123571 144591 203073 208871 170046 141908 126209 120335 147871 126765 82257 48194
19348D8194M8463K0535J0927l8818l6457j0438J251j66k6659j9368R339J4816
$$ 48194 96657 117192 128119 89301 52844 42406 43657 43491 16832 -2536 6803 21619
19336B1619M1415N7405M2264p355n2799p9747j1980K5597L3086L0744k0855j7802
$$ 21619 63034 120439 162703 155348 102549 22802 10822 36419 69505 100249 79394 61592
19324F1592N162j3170M1790K6348n5879n2545l221P926J3635K1575K1312p0325
$$ 61592 66754 53584 95374 121722 65843 13298 10077 18003 31638 53213 74525 4200
19312D200k7826j2613J0642M2932L6350j9158j4945j147l3528K1891Q918k689
$$ 4200 -23626 -36239 -25597 17335 53685 34527 19582 18435 -15093 6798 15716 13027
19300A3027L1811L4208K690k8190j41j5998p0020k8470j6259M438J5605M5127
$$ 13027 44838 79046 81736 53546 53405 37407 -32613 -61083 -77342 -72904 -57299 -12172
19288a2172k96J4494K1564n47r223k9582o4486j1383R067L6065N6856k3273m6375
$$ -12172 -12468 2026 23590 23043 13820 -15762 -80248 -91631 -82564 -46499 10357 -12916 -59291
19275e9291Q855L0230O5777K4359L159j4093r529j4096l2822K3124k0193n6280
$$ -59291 -50436 -20206 45571 69930 73089 58996 49467 35371 2549 25673 5480 -50800
19263e0800J2406k3880k714J0268L0546k1121k4419J6085K4146K5117o74m523
$$ -50800 -38394 -62274 -64988 -54720 -24174 -45295 -69714 -53629 -29483 -4366 -5040 -9563
19251i563j3416j3154k1839M192O789N465K4445n4893j3544k5865k329K6063R224
$$ -9563 -22979 -36133 -57972 -53780 -46991 -41526 -17081 -71974 -85518 -111383 -113712 -87649 -78425
19238g8425L2901l1389l4843K478K3514K1668K1334K796K4482l236q163L7588
$$ -78425 -45524 -76913 -111756 -109278 -85764 -64096 -42762 -39966 -15484 -18720 -26883 10705
19226A0705l577l2813k1907l1575k7478K2121L6790K5888J826K2769N235k4385
$$ 10705 7128 -25685 -47592 -79167 -106645 -84524 -47734 -21846 -20020 2749 7984 -16401
19214a6401J3607J8685p006L2790K587l3601q387J871k1397l3717K7231J8718
$$ -16401 -2794 15891 8885 41675 44262 10661 2274 4145 -17252 -50969 -23738 -5020
19202e020k70N087K0997m650l727k7005k6517M113m568Q324J6467J5512k918J4750
$$ -5020 -5290 -203 20794 16144 12417 -14588 -41105 -36992 -41560 -33236 -16769 -1257 -4175 10575
19188A0575K2739p103o5324l0001k763L6125K6625K7688J393n895j8670n9423
$$ 10575 33314 26211 -39113 -69114 -71877 -35752 -9127 18561 19954 14059 -4611 -64034
19176f4034l279N4930n426k8446j8919j5319Q575M9002k2009m3003P591N1608
$$ -64034 -67313 -12383 -17809 -46255 -65174 -80493 -71918 -22916 -44925 -87928 -80337 -28729
19164b8729O4358j6244L754n793l3879j5469k2810J1005J7631L6465k2582l4592
$$ -28729 35629 19385 23139 17346 -16533 -32002 -54812 -43807 -26176 10289 -12293 -46885
19152d6885j2057k1085o528j3983m4169j1312K7505L4052J5682L1454J0105k8970
$$ -46885 -58942 -80027 -86555 -100538 -144707 -156019 -128514 -94462 -78780 -47326 -37221 -66191
19140f6191j6376q232M8787K4669j1413J4890k6887j2718n4693J4191J1617M139
$$ -66191 -82567 -90799 -42012 -17343 -28756 -13866 -40753 -53471 -108164 -93973 -82356 -78217
19128g8217K0604j627P595L6017k0550n0787k3264K9724K4459O712K5594J6877
$$ -78217 -57613 -59240 -51645 -15628 -36178 -86965 -110229 -80505 -56046 -49334 -23740 -6863
19116f863j2437k4440L7652K3765P762Q794K8512K5059J08947J55357K05015K08011
$$ -6863 -19300 -43740 -6088 17677 25439 34233 62745 87804 196751 352108 557123 765134
19104G65134Q1676O062j24851j77260j52894j20614j00757o4755j3355l0692l2471
$$ 765134 846810 852872 728021 550761 397867 277253 176496 111741 98386 67694 35223
19093C5223k9861l21j6037j8012j6112J0515L0627K4676L0848m585o3571J556
$$ 35223 5362 5041 -10996 -29008 -45120 -34605 -3978 20698 51546 46961 -16610 -15054
19081a5054J0456j4152J5673K1473j8047N2328J8173P888J7787J6971K3502K8985
$$ -15054 -4598 -18750 -3077 18396 349 52677 70850 78738 96525 113496 136998 165983
19069A65983R5810J07568J78018K31762J42288R308j07485k00584j69262j12621
$$ 165983 261793 369361 547379 779141 921429 930737 823252 622668 453406 340785
19059C40785q1981J0035N8495R7919J51841K18624K41857J31724O566n8003K5131
$$ 340785 258804 268839 327334 425253 577094 795718 1037575 1169299 1175865 1117862 1142993
19048A142993L9549m2587n8025j68680k59023k23325j56381p5120k8164l8695
$$ 1142993 1182542 1139955 1081930 913250 654227 430902 274521 199401 171237 132542
19038A32542o7986o0678k965J8188m894m2935k164Q882K2701O856P422M0997L9235
$$ 132542 64556 3878 913 19101 14207 -28728 -30892 -22010 691 7547 14969 55966 95201
19025I5201j9801l1562P265J9928K3227M0486L2251P9201J42688J55617K31377
$$ 95201 75400 43838 51103 71031 94258 134744 166995 246196 388884 544501 775878
19014G75878K29940J24122L9508l2305j1173M4240K112p9354j67382k64476k13623
$$ 775878 1005818 1129940 1169448 1137143 1125970 1170210 1172322 1092968 925586 661110 447487
19003D47487j12854n5716j7310J4990P9288J42738K34234K44688R2560o5146j85582
$$ 447487 334633 278917 261607 276597 355885 498623 732857 977545 1070105 1004959 819377
18992H19377k31271j52859j29729r9729m1616o4548k7517j4357M402j0659k1622
$$ 819377 588106 435247 305518 205789 164173 99625 72108 57751 62153 51494 29872
18981B9872m6078N637L7793Q0711M2426k6565k0136k8781M721J2494m8379k6150
$$ 29872 -16206 -10569 27224 107935 150361 123796 103660 74879 79600 92094 43715 17565
18969A7565N5268J7255k1506k0727k670K5649k429P4508P6945Q6675J08657J92643
$$ 17565 72833 90088 68582 47855 45185 70834 68405 142913 219858 306533 415190 607833
18957F07833K38888J50086j7932k01515k55044k03439j01402p4317o8744l4627
$$ 607833 846721 996807 978875 777360 522316 318877 217475 143158 74414 39787
18947C9787N2560L268j8580m1234P216Q605J0280k7341l5685n213m0400J6236
$$ 39787 92347 95615 77035 35801 43017 51622 61902 34561 -1124 -6337 -46737 -30501
18935c0501L1112r439J7460r64J4014j7509k767O417K789m6183j6882N4204N3357
$$ -30501 611 -8828 8632 7668 21682 4173 1406 7823 10612 -35571 -52453 1751 55108
18922E5108K7333J2619L2016j9274l044l3943l1766p054j475L7622L47m018N548
$$ 55108 82441 95060 127076 107802 104758 70815 39049 31995 30520 68142 68489 64471 70019
18909G0019J3074l367l3762j5365m1831M238M666k4101k9300O318m685k776N0652
$$ 70019 83093 79726 45964 30599 -11232 -6994 -2328 -26429 -55729 -49411 -54096 -56872 -6220
18896f220K6402j97j7700J2709L2283o403o8362j5618L4992J3672l2405j0601
$$ -6220 20182 19985 2285 14994 47277 40874 -27488 -43106 -8114 5558 -26847 -37448
18884c7448k0244O161L5527L2042P415n678P021N527J2191r317l7529j7155L6856
$$ -37448 -57692 -51531 -16004 16038 23453 17775 24796 30323 42514 33197 -4332 -21487 15369
18871A5369K6681j0168q539K294j2063K9660K807n30k4035J509J385J7194J6335
$$ 15369 42050 31882 23343 25637 13574 43234 46041 45511 21476 22985 24370 41564 57899
18858E7899j6321n1264j9539L0394J8140o627j9257L2771L1092k2054J232L0j2011
$$ 57899 41578 -9686 -29225 1169 19309 12682 -6575 26196 57288 35234 36466 36496 24485
18845B4485l592p164K849j3459o033j5627j3636J6851K1711N354j2076p3M22P586
$$ 24485 20893 13729 16578 3119 -2914 -18541 -32177 -15326 6385 11739 -337 -410 12 7598
18831G598L917J0371R200k0028R886M073L5559l509k4055K3506K4956L2117L4213
$$ 7598 11515 21886 31086 11058 20944 25017 60576 57067 33012 56518 81474 113591 147804
18818A47804k1417m4004K8469K8480N8900J39371K25782J24735q0815j02631j03048
$$ 147804 126387 82383 110852 139332 198232 337603 563385 688120 607305 504674 401626
18807D01626m3113L1362R2007L4978j07513j32241r9394m6942N603n7431k8188
$$ 401626 358513 389875 481882 516860 409347 277106 177712 130770 136373 78942 50754
18796E0754l784n303j222K6388M8600p068j3421J0687l031N291K9240j3271k6141
$$ 50754 46970 41667 40445 66833 115433 108365 94944 105631 102600 107891 137131 123860 97719
18783I7719m0324K03R33L1553N9133N030L8634J14984J52916K16450O8464n1853
$$ 97719 57395 57598 58531 90084 149217 154247 192881 307865 460781 677231 745695 693842
18771F93842o4652N7661K12180K49930K30335J66045J1188r0177m9598o6198r5444
$$ 693842 629190 686851 899031 1148961 1379296 1545341 1556529 1466352 1416754 1350556 1255112
18760A255112k02351k40585j89736j26327l2703J23039J86657k7233j40496j81621
$$ 1255112 1052761 812176 622440 496113 463410 586449 773106 745873 605377 423756
18750D23756j40516o0574l1646j0512l307O4544L3347o9310n6205j3124J0566
$$ 423756 283240 222666 191020 180508 177201 241745 275092 205782 149577 136453 147019
18739A47019K5643k2676m1080K0743K1423K5881Q476L7999J1162R0498J61001
$$ 147019 172662 149986 108906 129649 151072 176953 185429 223428 234590 325088 486089
18728D86089K75859K50251J03691k204j08304q7891K6940l5979j89762j17543
$$ 486089 761948 1012199 1115890 1113686 1005382 917491 944431 908452 718690 601147
18718F01147N7625J31731J10318n9592j37453n2088K6639J72095K29242M8527
$$ 601147 658772 790503 900821 841229 703776 651688 678327 850422 1079664 1128191
18708A128191l1709j29565k05534k00639j51311j25457q7709n4373m0568K154
$$ 1128191 1096482 966917 761383 560744 409433 283976 196267 141894 101326 103480
18698A03480j5923k5610K1572M7494k2440k1691L399j5676j5111j279M2946k4911
$$ 103480 87557 61947 83519 131013 108573 86882 90281 74605 59494 58215 101161 76250
18686G6250m2317r170k204J9661N903j4161L4294O2344O1876K2794M3600J45376
$$ 76250 33933 24763 22559 42220 48123 33962 68256 130600 192476 215270 258870 404246
18674D04246J96638K78200J58714J7348l0905j68459k34947k16175j23150q1361
$$ 404246 600884 879084 1037798 1055146 1024241 855782 620835 404660 281510 200149
18664B00149m2173k3646j3568N007l5773j9627k0221k2225N190J2407J4659J7754
$$ 200149 157976 134330 120762 125769 89996 70369 50148 27923 33113 45520 60179 77933
18652G7933J1265k9935K580k9116r501J5298J4643k1408n5644j3676N8856L5951
$$ 77933 89198 59263 61843 32727 23226 38524 53167 31759 -23885 -37561 21295 57246
18640E7246J0269m0518k2734j535k4805k1272J6935L1238J073l368K3628o122
$$ 57246 67515 26997 4263 2728 -22077 -43349 -26414 4824 5897 2529 26157 20035
18628B0035l4866L828J7241k6150j7178q16Q879K3891L5800L503M676Q095l5883
$$ 20035 -14831 -11003 6238 -19912 -37090 -37906 -29027 -5136 30664 34167 38843 46938 11055
18615A1055m734k4736n8707M102O3292K0603J9592K2193j6185n1182k7231r211
$$ 11055 6321 -18415 -77122 -73020 -9728 10875 30467 52660 36475 -14707 -41938 -51149
18603e1149J6752m017M2044K5537q037m3887R630J2691j2908J4011L6635j3647
$$ -51149 -34397 -38414 3630 29167 21130 -22757 -13127 -436 -13344 667 37302 23655
18591B3655n080M6984J2650j9195j5520q739k9485r744J725K821j123n757J8814
$$ 23655 18575 65559 78209 59014 43494 34755 5270 -4474 -2749 72 -1051 -6808 12006
18578A2006M2533k0716k4299n812k593O187J0561K706Q885J8383k071k390K3309
$$ 12006 54539 33823 9524 3712 1119 7306 17867 20573 29458 47841 45770 43380 66689
18565F6689q814k0419j9440N682j4465j0776k870N0447M6616j1548k7209J546
$$ 66689 57875 37456 18016 23698 9233 -1543 -4413 46034 92650 81102 53893 55439
18553E5439J2978j6114k2339j7066j6590k8802m083L3543L0731j5288l2952J1039
$$ 55439 68417 52303 29964 12898 -3692 -32494 -36577 -3034 27697 12409 -20543 -9504
18541i504M9117K921J331O079M6295K7078l0177m2544o935k2264k6882R988K4366
$$ -9504 39613 42534 43865 49944 96239 123317 93140 50596 43661 21397 -5485 4503 28869
18528B8869r921J5597L8125j3764j3413R026K662m824j1569k1729n980o742L6819
$$ 28869 18948 34545 72670 58906 45493 54519 57181 52357 40788 19059 13079 6337 43156
18515D3156K6228k9121j2151N7794j986k9601k7980l149q221k6860P289J5754
$$ 43156 69384 40263 28112 85906 83920 54319 26339 23190 14969 -11891 -4602 11152
18503A1152j0019Q484K2972j761l0046m2792k0781J8593M6503n683n301K2925
$$ 11152 1133 9617 32589 30828 782 -42010 -62791 -44198 2305 -3378 -8679 14246
18491A4246L4001l0667j5196N902L3570M6987j4698k3670o0230K955j170j1185
$$ 14246 48247 17580 2384 8286 41856 88843 74145 50475 -9755 -6800 -7970 -19155
18479a9155K9839M4064Q992m141l7661j2101o638k1994O6442L0226M19K3809k734
$$ -19155 10684 54748 63740 59599 21938 9837 3199 -18795 47647 77873 78292 102101 99367
18466I9367k4506m5342j2930L3363L4286k6063l1897j5872l5179o715K6118K5504
$$ 99367 74861 29519 16589 49952 84238 58175 26278 10406 -24773 -31488 -5370 20134
18454B0134J4897Q06J4727J5676r194j6726K0417P575k0970J4447r251K484p619
$$ 20134 35031 35837 50564 66240 57046 40320 60737 68312 47342 61789 52538 55022 47403
18441D7403K5931k5826k4025Q214k6709J1300M641l469J2706J8707j0923J633
$$ 47403 73334 47508 23483 31697 4988 16288 20929 17460 30166 48873 37950 39583
18429C9583L21K720M0765j3541k0129k5293k4278J9014K6647K1416n056l0841
$$ 39583 39904 42624 83389 69848 49719 24426 148 19162 45809 67225 62169 31328
18417C1328J2764J0318K1306N179J9391n137l3177l0272l73O322K7404j8892J9818
$$ 31328 44092 54410 75716 80895 100286 95149 61972 31700 31327 37649 65053 46161 65979
18404F5979L043j2926r115J2218j2201O197j7390j5618K6351L2139k457j8229
$$ 65979 69022 56096 46981 59199 46998 53195 35805 20187 46538 78677 76220 57991
18392E7991j113J0176j1592k5782p403L004J7099M4901k4126r471j2621J8286
$$ 57991 56878 67054 55462 29680 22277 25281 42380 87281 63155 53684 41063 59349
18380E9349J5271j2983J9459j0304J0666L4428l936L69M419N056o828k1605K4899
$$ 59349 74620 61637 81096 70792 81458 115886 111950 112319 116738 121794 114966 93361 118260
18367A18260k5824J1950L5392M2356L3122j8698J1678M578M608P725k6712M5875
$$ 118260 92436 104386 139778 182134 215256 196558 208236 212814 217422 225147 198435 244310
18355B44310J20253J56473J32423P9067q6264j43263o9665k7326N0454J13970
$$ 244310 364563 521036 653459 732526 646262 502999 433334 406008 456462 570432
18345E70432J35163N2821j18084j37538r7369m1665L9254J46921J73474R947j11942
$$ 570432 705595 758416 640332 502794 405425 363760 403014 549935 723409 733356 621414
18334F21414j19704o2718N903N7291J37120J39153n0577j69430j73269r2841k0984
$$ 621414 501710 438992 444895 502186 639306 778459 727882 558452 385183 292342 271358
18323B71358n6145m3139l6378j143K2322j6794k9892j3705K1326O4406L1421j6299
$$ 271358 215213 172074 135696 134553 156875 140081 110189 96484 117810 182216 213637 197338
18311A97338N396J7071P0089R3651J10319J76640J33092o36j12668j04481m0213
$$ 197338 202734 219805 289894 383545 493864 670504 803596 802960 690292 585811 545598
18300E45598L5929Q5490J60172K51246J16222o1097j49813j31622m1785J1417
$$ 545598 581527 667017 827189 1078435 1194657 1133560 983747 852125 810340 821757
18290H21757J61333K25928R6276j03354j75744j33031r3232M9958J53727J90148
$$ 821757 983090 1209018 1305294 1201940 1026196 893165 799933 849891 1003618 1193766
18280A193766P9816j12401k11800k23700j65816j04572M7705J13385J24788J1789
$$ 1193766 1273582 1161181 949381 725681 559865 455293 502998 616383 741171 752960
18270G52960j53538j62820q9531q3226m0671j2904j069K1325J0867J0576o530
$$ 752960 599422 436602 347071 263845 223174 210270 209201 230526 241393 251969 245439
18259B45439K0976R038q305L527l6136L855J7412M160P1708P8898J10645J08882
$$ 245439 266415 275453 267148 270675 234539 238394 255806 259966 331674 410572 521217 630099
18247F30099J3290p7015o6596l9595j7833L7210R1050J35720J0644j31730j18669
$$ 630099 643389 566374 499778 460183 442350 479560 570610 706330 716974 585244 466575
18236D66575n1024l555N1222J37716J68412k2109j42619j04778o1572L0584O0164
$$ 466575 415551 411996 463218 600934 769346 747237 604618 499840 438268 468852 529016
18225E29016Q9942R3919o814j03294j23387n6938k7147l9183o8812j2180k7548
$$ 529016 618958 712877 706063 602769 479382 422444 395297 356114 287302 275122 247574
18214B47574l5171j0633L3332M3634O0327N0146Q9964J27920K61570J86354L9368
$$ 247574 212403 201770 235102 278736 339063 389209 479173 607093 868663 1055017 1094385
18203A094385o0960j62921k27134j73394p8342m6078O496L985K3419K7001N0601
$$ 1094385 1033425 870504 643370 469976 391634 345556 352052 356037 379456 406457 457058
18192D57058J00456J78822K29075J82454N2642j04695k36366k44690j63839o0476
$$ 457058 557514 736336 965411 1147865 1200507 1095812 859446 614756 450917 390441
18182C90441p2928r0699m1320M5697O0679K6255l303l7492j1792J2728m481j2906
$$ 390441 317513 226814 185494 231191 291870 318125 314822 277330 265538 278266 273785 260879
18170B60879K517J3471P706m034l882K3106K0135J2202L083O005N048J4584J491
$$ 260879 263396 276867 284573 280539 276657 299763 319898 332100 335183 341188 346236 360820 362311
18157C62311j7273K1782P1541J48810J85662K06341J98156J13952m3040j66768
$$ 362311 345038 366820 438361 587171 772833 979174 1177330 1291282 1248242 1081474
18147A081474j93163j03353q0441K524P12Q44K3106R0765K15492L53511M23515
$$ 1081474 888311 784958 704517 707041 707753 708597 731703 822468 1037960 1391471 1814986
18136A814986L71758J16379j66702l64930l61889k75847r3740n2260p289P6784
$$ 1814986 2186744 2303123 2136421 1771491 1409602 1133755 1040015 987755 980466 1057250
18126A057250J28402J45426K41286L73520M13118L28541K20997J34623J40473
$$ 1057250 1185652 1331078 1572364 1945884 2359002 2687543 2908540 3043163 3183636
18117C183636K93703N30367Q80567J340819K121143L612136O785928J3300410
$$ 3183636 3477339 4007706 4888273 6229092 8350235 11962371 18748299 32048709
18109C2048709K4898325L0085707j573989k6571683k5029597j3652479o855114
$$ 32048709 56947034 87032741 85458752 58887069 33857472 20204993 13349879
18102A3349879l814605k372627j596587j077085p72188n51039m18565l25867k97721
$$ 13349879 9535274 7162647 5566060 4488975 3716787 3165748 2747183 2421316 2123595
18093B123595k54684j90450j85058j74968n7978m8878j3490j0596Q3886J50405
$$ 2123595 1868911 1678461 1493403 1318435 1260457 1211579 1198089 1187493 1271379 1421784
18083A421784O6790k7990j22142j85588k03524j05427q8773o5341m9225J1560
$$ 1421784 1488574 1460584 1338442 1152854 949330 843903 755130 689789 640564 652124
18073F52124M9169L4100N0508J12987J89147K20350J05348o48k00153k28683j41573
$$ 652124 701293 735393 785901 898888 1088035 1308385 1413733 1413085 1212932 984249 842676
18062H42676j08488j05942q3999l5737K1534L1975M104M4943J4304m5695m4888
$$ 842676 734188 628246 544247 508510 530044 562019 566123 611066 625370 579675 534787
18051E34787n9631R632M4608m0776j8863N566m1735l0607k118k7560o2616K630
$$ 534787 475156 484788 529396 488620 469757 475323 433588 402981 400863 373303 310687 313317
18039C13317l8814n2380j1144j2152K3290j3224M569M264l9489J0222L6937R918
$$ 313317 274503 222123 210979 198827 222117 208893 213462 217726 178237 188459 225396 235314
18027B35314k6988K6317L5060L3590j2210J3869j5278o616L3463K2977L681P682
$$ 235314 208326 234643 269703 303293 291083 304952 289674 283058 316521 339498 343179 350861
18015C50861L3468j1011L403M041O011L503k351l7109M0336O1902K4085J9746
$$ 350861 384329 373318 376721 380762 386773 390276 387925 350816 391152 453054 477139 496885
18003D96885J3430k984m4489k5777J4313J5216j6214l9896J5822J3028k0760o5101
$$ 496885 510315 507331 462842 437065 451378 466594 450380 410484 426306 439334 418574 353473
17991C53473m2147Q473M4305l6692n2795l1981k7129K6806K6794J7908N3072M6286
$$ 353473 311326 319799 364104 327412 274617 242636 215507 242313 269107 287015 340087 386373
17979C86373J5890K151p537p4877j5086r676j2109J5323J4794L8760K0744r068
$$ 386373 402263 404414 396877 322000 306914 297238 285129 300452 315246 354006 374750 365682
17967C65682l4534l0061L9373O6404N6376k4611k4290O680l0462l7489M361K0773
$$ 365682 331148 301087 340460 406864 463240 438629 414339 421019 390557 353068 357429 378202
17955C78202j2953M806Q970O3110q908J2959N1320M1433J3252m364J2045m3670
$$ 378202 365249 370055 379025 442135 433227 446186 497506 538939 552191 547827 559872 516202
17943E16202n207L217j1118j2939l6681l5982o3610l4117P315j0417K6364J1364
$$ 516202 510995 514212 503094 490155 453474 417492 353882 319765 327080 316663 343027 354391
17931C54391r400k6367l546L9918Q6483O7204M4374L9190m1596o5420l4429J5124
$$ 354391 344991 318624 315078 354996 441479 508683 553057 592247 550651 485231 450802 465926
17919D65926k4744K206M3658L7369K0577K635L8132M273K9649L1770L6001K908
$$ 465926 441182 443388 487046 524415 544992 547627 585759 590032 619681 651451 687452 690360
17907F90360n1397n4810l59l2979l7210r362o337M9344M5971o948K224L9813L3564
$$ 690360 638963 584153 583794 550815 513605 504243 497906 547250 593221 586273 588497 628310 661874
17894F61874R010R248J5607p360o4975L976J7520M8109N9360m881P118l284m4264
$$ 661874 670884 680132 695739 688379 623404 627380 644900 693009 752369 747488 754606 751322 707058
17881G07058n4107q344N3276R9586J00713L6132m182j6009J0596M3748L6355P7949
$$ 707058 652951 644607 697883 797469 898182 934314 930132 914123 924719 968467 1004822 1082771
17869A082771J6045K0951K6239k9693l9757k3090K6537Q7148R3042J34817J62484
$$ 1082771 1098816 1119767 1146006 1116313 1076556 1053466 1080003 1167151 1260193 1395010 1557494
17858A557494P5828M9188n528l8058j2936R0P1682J21091L3462K2481O7603J37698
$$ 1557494 1633322 1682510 1676982 1638924 1625988 1626078 1697760 1818851 1852313 1874794 1942397 2080095
17846B080095K23109K49623J62100M799l1750N7418J10608J87135L43151L67451
$$ 2080095 2303204 2552827 2714927 2719726 2687976 2745394 2856002 3043137 3386288 3753739
17836C753739K28607K46852L82059O15512O25894N15896N49330P24424R10868
$$ 3753739 3982346 4229198 4611257 5226769 5852663 6368559 6917889 7642313 8553181
17827H553181J206921J810123K717581L955461N986224J0190206J7976737K8961069
$$ 8553181 9760102 11570225 14287806 18243267 24229491 34419697 52396434 81357503
17819H1357503K7564806k092606k2596702k0287069q697917K273651J3887233
$$ 81357503 108922309 106829703 84233001 63945932 55248015 57521666 71408899
17812G1408899K5548425J8767928j0263317k3968468j7690457n783561N435601
$$ 71408899 96957324 115725252 105461935 81493467 63803010 58019449 63455050
17805F3455050J8406590L1388337K2686534j1539682k8189632k1287222p420357
$$ 63455050 81861640 113249977 135936511 124396829 96207197 74919975 67499618
17798F7499618N723755J9892163L0677771J2510955k2972075l4504912k5581015
$$ 67499618 73223373 93115536 123793307 136304262 113332187 78827275 53246260
17791E3246260j4693129q273523m873077l160601k160898j329248q36752p96337
$$ 53246260 38553131 30279608 25406531 22245930 20085032 18755784 17919032 17122695
17783A7122695n54423R2617P45811J017773J153470J684916K768112M360714P161841
$$ 17122695 16568272 16660889 17406700 18424473 19577943 21262859 24030971 28391685 35553526
17774C5553526J2594951K2175672L2185558J9263070j1647619k2623582j4174272
$$ 35553526 48148477 70324149 102509707 121772777 110125158 87501576 73327304
17767G3327304j437787J1404809K7437867M2621251L4236037P316182k4012024
$$ 73327304 71889517 83294326 110732193 153353444 187589481 194905663 170893639
17760A70893639l3518688k0600209J427897K5355109M4543497L2188946q240713
$$ 170893639 137374951 116774742 118202639 143557748 188101245 220290191 212049478
17753B12049478l9127254l6509975j6370516O673580L0399678M5874277K8821348
$$ 212049478 172922224 136412249 120041733 126715313 157114991 202989268 231810616
17746B31810616o108732m1173237m7779678l2770766j3806677K520805J8670967
$$ 231810616 225701884 184528647 136748969 103978203 90171526 92692331 111363298
17739A11363298K8429120N622487k7685725l5094667k4528284j4172564q333873
$$ 111363298 139792418 145414905 117729180 82634513 58106229 43933665 35599792
17732C5599792n260586l420006k218183j477364j318322j681889j650948r84523
$$ 35599792 30339206 26919200 24701017 23223653 21905331 20223442 18572494 17587971
17724A7587971k00413J67405O10498J245167K143735L276679N558383J0418782
$$ 17587971 17387558 17554963 18165461 19410628 21554363 24831042 30389425 40808207
17716D0808207J8868435K8366251J8509614j0140354k2124921j5793247m903887
$$ 40808207 59676642 88042893 106552507 96412153 74287232 58493985 53590098
17709E3590098N463830J6678710K2748134M471798j7451633j9989353j0508672
$$ 53590098 59053928 75732638 98480772 102952570 85500937 65511584 55002912
17702E5002912m17895R742806K2402369L1623978J2667916j8423080k6309715
$$ 55002912 54585017 64327823 86730192 118354170 131022086 112599006 86289291
17695H6289291j5584771j748971J1919344K6459380K7688265m733672l0970510
$$ 86289291 70704520 68955549 80874893 107334273 135022538 130288866 99318356
17688I9318356l0704658j9461323j1148102o555788l969135k183261o85451N26010
$$ 99318356 68613698 49152375 38004273 31448485 27479350 25296089 24610638 25136648
17680B5136648J454329K771788M949561Q308420J4166059K4763969M1044969M9125809
$$ 25136648 26590977 29362765 34312326 42620746 56786805 81550774 122595743 171721552
17672A71721552K8142257O970272k2932825m6670536m4178599k7890565j5135577
$$ 171721552 199863809 206834081 183901256 137230720 93052121 65161556 50025979
17665E0025979q135879m348149j626560J168607M891934J0729418K0512130L3794913
$$ 50025979 41890100 37541951 35915391 37083998 41975932 52705350 73217480 107012393
17657A07012393L3930299J3142775l636621k4511388l5188083k9440903j8078721
$$ 107012393 140942692 154085467 150448846 125937458 90749375 61308472 43229751
17650D3229751j0740988o905986m738236l258558k108209j271839p76977n47903
$$ 43229751 32488763 25582777 20844541 17585983 15477774 14205935 13428958 12881055
17642A2881055m66498m80310l86737j12905L90335P24421N93052M65171K08021
$$ 12881055 12414557 11934247 11547510 11434605 11824940 12549361 13142413 13607584 13815605
17633A3815605j79319k25591o1929K09739O90124J313938K059821L049731M447917
$$ 13815605 13636286 13410695 13348766 13558505 14248629 15562567 17622388 20672119 25120036
17624B5120036O636489J0134272J6304983K7805779M4577733M9233448K6054763
$$ 25120036 31756525 41890797 58195780 86001559 130579292 179812740 205867503
17617B05867503M185686k7676563m7114532m0629955k3377350j0764028l077327
$$ 205867503 210053189 182376626 135262094 94632139 71254789 60490761 57413434
17610E7413434K779999R411869J9680321L6624549N9404650O6314793N4187694
$$ 57413434 60193433 69605302 89285623 125910172 185314822 251629615 305817309
17603C05817309K3169422k8191348n2099546o0575267n4239564l8115414k2146008
$$ 305817309 328986731 300795383 248695837 188120570 133881006 95765592 73619584
17596G3619584j2467394o372943j336007M585028J3309259K6764654M0256844
$$ 73619584 61152190 54779247 53443240 58028268 71337527 98102181 138359025
17589A38359025L0695206P970585j7366616l8269394l8013121k5435273j4748430
$$ 138359025 169054231 177024816 159658200 121388806 83375685 57940412 43191982
17582D3191982r334060o444102m803606l526175k445304j598356r89908o53674
$$ 43191982 33857922 27413820 22610214 19084039 16638735 15040379 14050471 13396797
17574A3396797n88529n79891m84736j98478L34411N82077L94890J71843j79730
$$ 13396797 12808268 12228377 11743641 11545163 11879574 12461651 12856541 13028384 12848654
17565A2848654l83788k45937j66741M6993N65409J233822J975776K854964M206609
$$ 12848654 12464866 12218929 12052188 12099181 12664590 13898412 15874188 18729152 22935761
17556B2935761O491440J0683281J8576321L2399621M8617506M1977803J6637357
$$ 22935761 29427201 40110482 58686803 91086424 139703930 181681733 198319090
17549A98319090j2876825m2120968m5738042l1516844j7360134r314362m863996
$$ 198319090 185442265 143321297 97583255 66066411 48706277 39391915 34527919
17542C4527919j942296O74930L751879Q491089J6624913K9747891M1345720K8797411
$$ 34527919 32585623 33260553 37012432 45503521 62128434 91876325 133222045 162019456
17534A62019456O068158j9974576l8683941l6491785k3748164j3755137q661606
$$ 162019456 168087614 148113038 109429097 72937312 49189148 35434011 26772405
17527B6772405n878110m124539k871772j932468j291506q42716n83818o84709
$$ 26772405 20894295 16769756 13897984 11965516 10674010 9831294 9247476 8562767
17519H562767p54564p36930n44003k79496k33421l75425n96032p36829o76155
$$ 8562767 7808203 7071273 6527270 6247774 6014353 5638928 5042896 4306067 3629912
17510C629912n06701l44084k86877k15195j81652j55910j24771q8411p3895p0063
$$ 3629912 3123211 2779127 2492250 2277055 2095403 1939493 1814722 1726311 1652416 1582353
17500A582353l4170o7622j02884r4374p9622k0267k1480O551P639j1030o7421
$$ 1582353 1548183 1480561 1377677 1283303 1203681 1183414 1161934 1168485 1176124 1165094 1097673
17489A097673r0237q1365N007R436j0965j454k0283n998P178L5324o08k450K3348
$$ 1097673 1007436 926071 931078 940514 929549 928095 907812 901814 908992 944316 943708 941258 964606
17476I64606R034l6972m6991q5601q6835k2355K2094l0576m1660N916j4854l2384
$$ 964606 973640 936668 889677 804076 717241 694886 716980 686404 644744 650660 635806 603422
17464F03422o206N0382O6944P7065j8228o4976p0568r3073p0606r216K892J9713
$$ 603422 597216 647598 714542 791607 773379 708403 637835 544762 474156 464940 467832 487545
17452D87545L0173L647m0384m4857J6695L2923O5705O4470K4530L5893O5826O5334
$$ 487545 517718 521365 480981 436124 452819 485742 551447 615917 640447 676340 742166 807500
17440H07500n5129j15963j04571m2763j3637J695k108j6518m5298J2466l4313
$$ 807500 752371 636408 531837 489074 475437 477132 475024 458506 413208 425674 391361
17429C91361l1080k2618q50M3954M5193M4533l532J2862q64n2182J1899m7762
$$ 391361 360281 337663 336813 380767 425960 470493 466961 479823 478959 426777 438676 390914
17417C90914l2161k555L4681P675o186j5596j7742K8255L5002R638k1146o982
$$ 390914 358753 356198 390879 398554 392368 376772 359030 387285 422287 431925 410779 403797
17405D03797j7008j5408j0343n3332n4097l3633J7260M1477L2205j607O0588N005
$$ 403797 386789 371381 361038 307706 253609 219976 237236 278713 310918 309311 369899 374904
17393C74904j4599J002j5340m0833k9114l8305J5736M1275k4794p9299p047L2744
$$ 374904 360305 361307 345967 305134 276020 237715 253451 294726 269932 190633 183586 216330
17381B16330J8539K6120n208L1331J3359r824j377m5794n7967j0090r615L461
$$ 216330 234869 260989 255781 287112 300471 290647 289270 243476 185509 175419 165804 169265
17369A69265j1984J9289l3485j9666q7147j709M3505N0917N4949M8527k5395q091
$$ 169265 157281 176570 143085 123419 36272 34563 78068 128985 183934 232461 207066 198975
17357A98975k8572l5452l0222l2293r130K7374m3870j5437K3922K8525J3566M9434
$$ 198975 170403 134951 104729 72436 63306 90680 46810 31373 55295 83820 97386 146820
17345A46820L7566K1790l8489p5437n2881l9804N693M5567M8632m3k1159N747
$$ 146820 184386 206176 167687 92250 39369 -435 5258 50825 99457 99414 78255 84002
17333H4002j6853K1990N540l605m2251n320J7078j193j5278L3764J6915M053l603
$$ 84002 67149 89139 94679 91074 48823 43503 60581 59388 44110 77874 94789 98842 95239
17320I5239k13k622l1485n465N772j5746l4142l1920O748j2947O843r931L1347
$$ 95239 95026 92404 60919 55454 61226 45480 11338 -20582 -13834 -26781 -19938 -29869 1478
17307A478J871O7238L8188m1619n5087o757J6394p357L675k5925l4341K4481M6201
$$ 1478 3349 70587 108775 67156 12069 5312 21706 14349 18024 -7901 -42242 -17761 28440
17294B8440K3534L8570M0013q051j5504o058m6351q222L2402M9656J0815L658
$$ 28440 51974 90544 130557 122506 107002 100944 54593 46371 78773 128429 139244 142902
17282A42902R4569J02617J77669J30884k9706j06315m5517m1325O266J14014K10325
$$ 142902 237471 340088 517757 648641 618935 512620 467103 425778 432044 546058 756383
17271G56383R9116r5083j65499j74933q5846N8539Q9182J47972P8881q9279j28095
$$ 756383 855499 760416 594917 419984 334138 392677 481859 629831 708712 619433 491338
17260D91338p9586k9922P588P2348J46121P301j35537j30626q8912l9925k0813
$$ 491338 411752 381830 389418 461766 607887 615188 479651 349025 260113 220188 199375
17249A99375K14j2823k6612p4401k7108j2714o908J4871p293K803M6819N2469
$$ 199375 199589 186766 160154 85753 58645 45931 39023 53894 46601 49404 96223 148692
17237A48692o558P1361O0000O6729J51999J89776M4955j11412j65754r5673L2916
$$ 148692 142134 213495 273495 340224 492223 681999 726954 615542 449788 354115 387031
17226C87031J14369K02466K94306K19262M6025j59344k48722j34910j4400J13406
$$ 387031 501400 703866 998172 1217434 1263459 1104115 855393 720483 706083 819489
17216H19489J92841J47372R311j40231k01173j31510K4019J59270K08456J08678
$$ 819489 1012330 1159702 1169013 1028782 827609 696099 720118 879388 1087844 1196522
17206A196522o6087j83051k26998j96186o1044J935P9908J10970L8806j25039
$$ 1196522 1130435 947384 720386 524200 463156 465091 544999 655969 694775 569736
17196E69736j55702j02858m9703k3731P591j5533l2762l5780l8245j5176Q199
$$ 569736 414034 311176 261473 237742 245333 229800 197038 161258 123013 107837 116036
17185A16036R700L15L439L1719L6676j9425K8523P3903O1745J19905J53407O5621
$$ 116036 125736 126051 129490 161209 197885 178460 206983 280886 342631 462536 615943 681564
17173F81564q2955j64716j01164j3603K4817J19874J42332N2749q5288j20000
$$ 681564 598609 433893 332729 319126 343943 463817 606149 658898 573610 453610
17163D53610j00493n3692K5497J17442J45335N658j10379j06493m1288m352N5899
$$ 453610 353117 299425 324922 442364 587699 593357 482978 376485 335197 330845 386744
17152C86744J01061R7643l212j36126j42472p8218r3916l2063k4151N674M5507
$$ 386744 487805 585448 582236 446110 303638 225420 131504 99441 75290 80964 126471
17141A26471K6687O0662J24884J70784K28030J99783J12597p9747k28206k54580
$$ 126471 153158 213820 338704 509488 737518 937301 1049898 970151 741945 487365
17131D87365j74413j22436l4972L1284R493J5987L3242O4822R3769J45813J86709
$$ 487365 312952 190516 155544 186828 196321 212308 245550 310372 404141 549954 736663
17120G36663J94471K2727j49531k12097j75161j53127j00472m9299j8797l2682
$$ 736663 931134 953861 804330 592233 417072 263945 163473 114174 95377 62695
17110F2695k620K0060P613j6103m5112j6591K9927K2623j7127J1851k493p534
$$ 62695 60075 80135 87748 71645 26533 9942 39869 62492 45365 57216 54723 47189
17098D7189l595M1078m931n83j4763J3304K4736M567q93k1945K6037P1068O3170
$$ 47189 43594 84672 79741 79158 64395 77699 102435 107002 106109 84164 110201 181269 244439
17085B44439J03808J83555K82434K08304M4312j24724k58934j99080j50287p7026
$$ 244439 348247 531802 814236 1022540 1066852 942128 683194 484114 333827 256801
17075B56801m0301m428L0216Q9185J39415K66373L78813L73467L22349P1954k06382
$$ 256801 216500 212072 242288 331473 470888 737261 1116074 1489541 1811890 1883844 1677462
17064A677462l81816l70750l02066j94768j05635k1907N955K7152M1788O3889
$$ 1677462 1295646 924896 622830 428062 322427 300520 306475 333627 375415 439304
17054D39304J58860K37052J81477K0458j95291k44797j58686j13216q8580r3812
$$ 439304 598164 835216 1016693 1037151 841860 597063 438377 325161 236581 142769
17044A42769n5914r783j380L2177J9452m0486M01L79k0289k1293K5201K6713j9227
$$ 142769 86855 77072 75692 107869 127321 86835 87236 87615 67326 46033 71234 97947 78720
17031G8720m1661K0183J3178L150K1279j1873K6982Q309P511l1959R447M2520
$$ 78720 37059 57242 70420 73570 94849 82976 109958 118267 125778 93819 103266 145786
17019A45786N0308Q7634Q9792J66572K81330J72154J1330j50202k41032k04346
$$ 145786 196094 283728 373520 540092 821422 993576 1004906 854704 613672 409326
17009D09326r8888n6178q334k8762j5493O51M5141Q1134J03509J72912K55278
$$ 409326 310438 254260 245926 217164 201671 202322 247463 328597 432106 605018 860296
16998H60296J43052n0157j80683k44858j79477j05610l5789m4516n3590r427o833
$$ 860296 1003348 953191 772508 527650 348173 242563 206774 162258 108668 99241 92408
16987I2408r007J8176j0327j1737k8865R914k1081K032M696K3930o587j2768n9165
$$ 92408 83401 101577 91250 79513 50648 60562 39481 41513 46209 70139 63552 50784 -8381
16974h381l3730N937j133j0714L0225L8329N11j0395O134m228k803l7129k0227
$$ -8381 -42111 -36174 -37307 -48021 -17796 20533 21044 10649 16783 12555 9752 -27377 -47604
16961d7604m264J9409j2152J0430m59m0389R224M6583N1903J0796k1202n055k3834
$$ -47604 -51868 -32459 -44611 -34181 -34640 -75029 -65805 -19222 32681 43477 22275 17220 -6614
16948f614k1916R182K6842L1501j1995J6578l0178m1898N219J3962J7798k9289
$$ -6614 -28530 -19348 7494 38995 27000 43578 13400 -28498 -23279 -9317 8481 -20808
16936b0808j5090J3869j0658k9933M186J9956K2946j1430M646J7068l2415P266
$$ -20808 -35898 -22029 -32687 -62620 -58434 -38478 -15532 -26962 -22316 -5248 -37663 -30397
16924c0397K8537K2256j441P26k2205j8512R884p227L5119N010J6234M214n8200
$$ -30397 -1860 20396 18955 19681 -2524 -21036 -11152 -18379 16740 21750 37984 42198 -16002
16911a6002l1172J1834J5365j9615J105M1237L7184o925p465j0753l2375j6072
$$ -16002 -47174 -35340 -19975 -39590 -38485 2752 39936 33011 25546 14793 -17582 -33654
16899c3654j6032J8776J1345J7930P03k861K1466J5563j0165m8312k3561l561
$$ -33654 -49686 -30910 -19565 -1635 -932 -3793 17673 33236 23071 -25241 -48802 -52363
16887e2363k4030L4903N710j1580K444J3041k3404r662O279J5491J8773J8321
$$ -52363 -76393 -41490 -35780 -47360 -44916 -31875 -55279 -64941 -58662 -43171 -24398 -6077
16875f077J7017J934j4178K4447j9638k0178K9447j830l0555M153k2491j8557
$$ -6077 10940 12874 -1304 23143 3505 -16673 12774 10944 -19611 -15458 -37949 -56506
16863e6506n765k8372L7141K8217J1155k7825j5122l349Q870K9508J6083l3457
$$ -56506 -62271 -90643 -53502 -25285 -14130 -41955 -57077 -60426 -51556 -22048 -5965 -39422
16851c9422r405j3212J203q367M990L484K556L913L1411N3064L492k7289k6191
$$ -39422 -48827 -62039 -60836 -69203 -64213 -60729 -58173 -54260 -22849 30215 33707 6418 -19773
16838a9773L1671R385l4490j4358L6662q121k7308j5421n63o088L937q763k115
$$ -19773 11898 21283 -13207 -27565 9097 976 -26332 -41753 -42316 -48404 -44467 -53230 -55345
16825e5345J8726K2633k1814q2j3384K7933J4316o667j0465j8195J2934L2512
$$ -55345 -36619 -13986 -35800 -35882 -49266 -21333 -7017 -13684 -24149 -42344 -29410 3102
16813C102n161J5050k7512n986k718M3225Q077l4417j2628j8687R964J7396k4464
$$ 3102 -2059 12991 -14521 -20507 -23225 20000 28077 -6340 -18968 -37655 -27691 -10295 -34759
16800c4759l9430N183J0038P965k3802r315M1009L3822J3262r770l5939k2010
$$ -34759 -74189 -69006 -58968 -51003 -74805 -84120 -43111 -9289 3973 -5797 -41736 -63746
16788f3746K05j8977J9779M3299L6230N314l2772p682O855L0036J7115K7467k8932
$$ -63746 -63541 -82518 -62739 -19440 16790 22104 -10668 -18350 -11495 18541 35656 63123 34191
16775C4191j7674j0660J6814J1325n111Q78R39m097j1579k3502J4633M536l4490
$$ 34191 16517 5857 22671 33996 28885 29763 30702 26605 15026 -8476 6157 10693 -23797
16762b3797J6001J9104N5194P58l5372o7160k3516J4707J5666M3567J2319M233
$$ -23797 -7796 11308 66502 67260 31888 -35272 -58788 -44081 -28415 15152 27471 31704
16750C1704M167m9146k7480o244l1904k682K0940N0038K5648k2554o78j8580k0105
$$ 31704 35871 -13275 -40755 -46999 -78903 -81585 -60645 -10607 15041 -7513 -8191 -26771 -46876
16737d6876K321k0367o58K5507J9590q446j1098L0143R663N721k9343l4633K2830
$$ -46876 -44555 -64922 -65580 -40073 -20483 -28929 -40027 -9884 -221 5500 -23843 -58476 -35646
16724c5646k0578l86K0550J8922K1868K4616M4959R466J111l3343m9459j5361
$$ -35646 -56224 -56610 -36060 -17138 4730 29346 74305 83771 84882 51539 2080 -13281
16712a3281J1184K0098P639j3279j8531m211l638J2118J0519J2370n31l9184l5181
$$ -13281 -2097 18001 25640 12361 -6170 -10381 -14019 -1901 8618 20988 20457 -18727 -53908
16699e3908j0080J3286p035k1383J4357J6558P183o041M1160J2216l843l0374
$$ -53908 -63988 -50702 -57737 -79120 -64763 -48205 -41022 -47063 -5903 6313 2470 -27904
16687b7904M559j0901M684R480j1793o924L1012L7151K2176j1712l9804k3599
$$ -27904 -23345 -34246 -29562 -20082 -31875 -38799 -7787 29364 51540 39828 24 -23575
16675b3575j931p539K4355J1246m9327j6502k432L4685J4395J8898J4503j1749
$$ -23575 -25506 -33045 -8690 2556 -46771 -63273 -65705 -31020 -16625 2273 16776 5027
16663E027k0706Q276k9547j2863R703L5141L7498k9293l8728J5878M0625n237
$$ 5027 -15679 -7403 -36950 -49813 -40110 -4969 32529 3236 -35492 -19614 21011 15774
16651A5774j2038m2173j374J2776j5613R58K8088P1376k8m3501j8315J5248k346
$$ 15774 3736 -38437 -39811 -27035 -42648 -41690 -13602 57774 57746 14245 -4070 11178 8832
16638H832j0081P560K3489k6681n501J3084l854j2750Q195m868k4049k4075l95
$$ 8832 -1249 6311 29800 3119 -2382 10702 6848 -5902 2293 -2575 -26624 -50699 -51094
16625e1094M4087q454j902o474k4075R355N5842J9797l6412k1334l1771k4533
$$ -51094 -7007 -15461 -17363 -23837 -47912 -38557 17285 37082 670 -20664 -52435 -76968
16613g6968k2638J7821L5562J6710k2157J8461L6552J5108j8436j3938K428m275
$$ -76968 -99606 -81785 -46223 -29513 -51670 -33209 3343 18451 15 -13923 -11495 -15770
16601a5770n71j0943l3943j7656K2992K3402J9811L4349o131m0457j9701K2770
$$ -15770 -16341 -27284 -61227 -78883 -55891 -32489 -12678 21671 15540 -24917 -44618 -21848
16589b1848K1312j312k1494l7313K7536K9888j5361p612P925j8002k9185K043
$$ -21848 -536 -1848 -23342 -60655 -33119 -3231 -18592 -26204 -18279 -36281 -65466 -63423
16577f3423L8728O7818r309n1580j5728L2086l515M619J0408k5547o515L2470
$$ -63423 -24695 43123 33814 -17766 -33494 -1408 -4923 -304 10104 -15443 -21958 10512
16565A0512J7649J4022K0063k3863l5669j8048J0244L46p096L2150K5682l518
$$ 10512 28161 42183 62246 38383 2714 -15334 -5090 -4744 -11840 20310 45992 42474
16553D2474L146k8723m1297k2205K584L0237K2740J4043N565l737j6861k0087
$$ 42474 45620 16897 -24400 -46605 -44021 -13784 8956 22999 28564 24827 7966 -12121
16541a2121K207l1654l0067K8968M8260O853j6014k9946R315J4878K4450m053
$$ -12121 -9914 -41568 -71635 -42667 5593 12446 -3568 -33514 -24199 -9321 15129 11076
16529A1076P278k8354J9025K2568l0921J8968L7137l3221l1147o188J7842J7441
$$ 11076 18354 -10000 9025 31593 672 19640 56777 23556 -7591 -13779 4063 21504
16517B1504k6711n3661k5800J8436J4898r162k5638K595N9718J26m3779J867J7706
$$ 21504 -5207 -58868 -84668 -66232 -51334 -60496 -86134 -83539 -23821 -23695 -67474 -65607 -47901
16504d7901K0180k5913j3937J4646J8344j3422Q373L5737N904j6399L799m0167
$$ -47901 -27721 -53634 -67571 -52925 -34581 -48003 -39630 -3893 2011 -14388 -10589 -50756
16492e0756m0275K1496P7826k656N37R608j5702j2858L290l0649J3606J788L968
$$ -50756 -91031 -69535 8291 5635 6172 15780 78 -12780 -9490 -40139 -26533 -24745 -20777
16479b0777J2595k4538Q91K5978Q5q806m892l2317R773j0597M2825M5010J5760
$$ -20777 -8182 -32720 -31829 -5851 -5766 -14572 -19464 -51781 -42008 -52605 -9780 35230 50990
16466E0990m0422j1330J8871j9728k6733K1410j2199Q371Q42k6104j1586L2481
$$ 50990 10568 -762 18109 -1619 -28352 -6942 -19141 -10770 -9928 -36032 -47618 -15137
16454a5137J7418K4400k7580J5622j9442k8282k7397P7R342J3611N03J3290q464
$$ -15137 2281 26681 -899 14723 -4719 -33001 -60398 -60321 -50979 -37368 -36865 -23575 -32039
16441c2039n137n742r425M7017j3015l0423K2869J1283M8475M905n5494k5403
$$ -32039 -37176 -42918 -52343 -5326 -18341 -48764 -25895 -14612 33863 38768 -16726 -42129
16429d2129k3741j6592K993r231L3137J6263P610n817j0915j0644J3025j1387
$$ -42129 -65870 -82462 -79469 -88700 -55563 -39300 -31690 -37507 -48422 -59066 -46041 -57428
16417e7428p557k468J4889L4157j0421p350j6067M1970N756o440k26K9714l1013
$$ -57428 -64985 -67453 -52564 -18407 -28828 -36178 -52245 -10275 -4519 -10959 -11185 18529 -12484
16404a2484p113q485k3311Q75J4719L0089k3555K34O047k3770j1096L0570N9660
$$ -12484 -19597 -28082 -51393 -50518 -35799 -5710 -29265 -29031 -22984 -46754 -57850 -27280 32380
16391C2380o350k2071L0708L2797j6084r793k1755o946j4164k243L4853j495k1783
$$ 32380 26030 3959 34667 67464 51380 41587 19832 12886 -1278 -3521 31332 29837 8054
16378H054L83l4630o785P225J0645r307j3127J948M3877L8476J4058p2106m1556
$$ 8054 8437 -26193 -32978 -25753 -15108 -24415 -37542 -35594 8283 46759 60817 -11289 -52845
16365e2845K4647J2909l8870j5319p604J4090L2344k3868J0589M2460J0586j0593
$$ -52845 -28198 -15289 -54159 -69478 -77082 -62992 -30648 -54516 -43927 -1467 9119 -1474
16353a474m6123J3450m09j450K1427J295k6360j9829L1388L4453K8060k4713j7537
$$ -1474 -47597 -34147 -34556 -36006 -14579 -13284 -39644 -59473 -28085 6368 34428 9715 -7822
16340g822q750J9002j9910k9341J1936j8925J9542J9808K2026j2936q845N124
$$ -7822 -16572 2430 -17480 -46821 -34885 -53810 -34268 -14460 7566 -5370 -14215 -9091
16328i091j5898l1547N6038L409l0062k0311Q606K841k7374k5121r717M9900L4472
$$ -9091 -24989 -56536 -498 2911 -27151 -47462 -38856 -36015 -63389 -88510 -98227 -48327 -13855
16315a3855L474L7734K9562j229k3852k8215l849j8306k2621k670J6230j1674
$$ -13855 -10381 27353 56915 55686 31834 3619 -230 -18536 -41157 -43827 -27597 -39271
16303c9271Q470o11r943J4557j3805l4296N0046J9151j602K834P345K7087q369
$$ -39271 -30801 -31412 -41355 -26798 -40603 -74899 -24853 -5702 -7304 -4470 2875 29962 21593
16290B1593l4092k1075J1765K1169O411l167n666j5541J496r878l0915j0904K6891
$$ 21593 -12499 -33574 -21809 -640 5771 2604 -3062 -18603 -17107 -26985 -57900 -68804 -41913
16277d1913K6090j9943j6679M118J4046K5211J849k1851j486K7138k5484k0505
$$ -41913 -15823 -35766 -52445 -48327 -34281 -9070 -7221 -29072 -30558 -3420 -28904 -49409
16265d9409L6632k1522k7266J9685j8468Q732N179j0091P28J6116K6057N040J2947
$$ -49409 -12777 -34299 -61565 -41880 -60348 -51616 -46437 -56528 -55800 -39684 -13627 -8587 4360
16252D360K6643j0197k6881l519j0879j6117L782J9927L487k2163J919L5971J9803
$$ 4360 31003 20806 -6075 -9594 -20473 -36590 -32808 -12881 -9394 -31557 -29638 6333 26136
16239B6136P642r57m4864K7644j6783k1322j3100K0352R878j8843L337j1927j4859
$$ 26136 33778 32821 -12043 15601 -1182 -22504 -35604 -15252 -5374 -24217 -20880 -32807 -47666
16226d7666m832M6166K5605j9824j3107m111J6624k2244k9153J0312K5011K1091
$$ -47666 -52498 -6332 19273 -551 -13658 -17769 -1145 -23389 -52542 -42230 -17219 3872
16214C872m3388k1985M094J245l609J0595j4887M2613J5372m9787P150m659K7775
$$ 3872 -39516 -61501 -57407 -56162 -59771 -49176 -64063 -21450 -6078 -55865 -48715 -53374 -25599
16201b5599R382m197M2902K5302l9046j5946n2727q286N746K3730M7963O1795
$$ -25599 -16217 -20414 22488 47790 8744 -7202 -59929 -68215 -62469 -38739 9224 71019
16189G1019p08q7849l7536M320M4978M0387j6103k3996n3706p604k882L854J3793
$$ 71019 70311 -17538 -55074 -50754 -5776 34611 18508 -5488 -59194 -66798 -69680 -65826 -52033
16176e2033M536R773M3496J2034o0597j187O2524K1650L5235K883m7568j6437
$$ -52033 -47497 -37724 5772 17806 -42791 -43978 18546 40196 75431 78314 30746 14309
16164A4309j8546J8402J3410M2927K6999l66l4058n8122j8998M833j4958j6830
$$ 14309 -4237 14165 27575 70502 97501 97135 63077 4955 -14043 -9210 -24168 -40998
16152d0998J2487K7119P932J1661k871j2438K452J5720K065j4361J4238k8049
$$ -40998 -28511 -1392 6540 18201 15330 2892 5344 21064 23129 8768 23006 -5043
16140e043l6840j4871O000K6141Q942l325K8252K5660J441M9029k3513l3985j7854
$$ -5043 -41883 -56754 -50754 -24613 -15671 -18996 9256 34916 36357 85386 61873 27888 10034
16127A0034K2869j4907n4612k2414l4624J8061K0498J0800J2212J160L5311o626
$$ 10034 32903 17996 -36616 -59030 -93654 -75593 -55095 -44295 -32083 -30923 4388 -2238
16115b238j4295j1394J4954J2927J9668J6781P575J0364r94l9229j4646j1511
$$ -2238 -16533 -27927 -12973 -46 19622 36403 43978 54342 53348 14119 -527 -12038
16103a2038j1546m643L3959N196k8061p348P439O93M9841K2753J9701m2804n0032
$$ -12038 -23584 -28227 5732 10928 -17133 -24481 -17042 -16349 33492 56245 75946 33142 -16890
16090a6890k7582j7978o318L1356k212K6424K8588k2648j2217l7564m5393M593
$$ -16890 -44472 -62450 -68768 -37412 -39624 -13200 15388 -7260 -19477 -57041 -102434 -97841
16078i7841L3761J1771N742M020p579n002j2815K9140K1280K1689k4162j2629
$$ -97841 -64080 -52309 -46567 -42547 -50126 -55128 -67943 -38803 -17523 4166 -19996 -32625
16066c2625M3280L8500q51l9596j2431K5597N213J3799J8096k6859m6447L171
$$ -32625 10655 49155 48304 8708 -3723 21874 27087 40886 58982 32123 -14324 -11153
16054a1153L6873J9452n0364m7317K1084L2901L1716j4250n425N641J9420r373
$$ -11153 25720 45172 -5192 -52509 -31425 1476 33192 18942 13517 19158 38578 29205
16042B9205k8216j2862j546K1548L4134l4657k7319L1431j3462r312K951K6319
$$ 29205 989 -11873 -13419 8129 42263 7606 -19713 11718 -1744 -11056 -8105 18214
16030A8214n601k9529j7019R951K2245J112k913J4707N262P16k1311J1497j6055
$$ 18214 12613 -16916 -33935 -23984 -1739 -627 -3540 11167 16429 17145 -4166 7331 -8724
16017h724J973j0027j2118R143K2770N902j3625K6642J0496j8524M79l5781p345
$$ -8724 -6751 -16778 -28896 -19753 3017 8919 -4706 21936 32432 13908 14387 -21394 -28739
16004b8739k2008j7529K3986J6282j3128O996J292j2917R111j8403j6985m1813
$$ -28739 -50747 -68276 -44290 -28008 -41136 -34140 -32848 -45765 -36654 -55057 -72042 -113855
15992a13855K9721K7913L3504n141j1334p896M940K4184l156m2881N307K3620
$$ -113855 -84134 -56221 -22717 -27858 -39192 -47088 -42148 -17964 -21120 -64001 -58694 -35074
15980c5074K2984L1153j7026j0054k3383n6520k1419O077O917J3943K9907J5244
$$ -35074 -12090 19063 2037 -8017 -31400 -87920 -109339 -103262 -96345 -82402 -52495 -37251
15968c7251J8817L148M909l850J3867J0363R63K4626o057K3894j3602m2267q868
$$ -37251 -18434 -15286 -10377 -14227 -360 10003 10966 35592 29535 53429 39827 -2440 -11308
15955a1308K3548L5184K9287l7027j267m039k6447j9133j6117l0655M250m2571
$$ -11308 12240 47424 76711 39684 38417 34378 7931 -11202 -27319 -57974 -53724 -96295
15943i6295Q038J3526M1499k740K2313O251L7535K6894K1881r412m3324Q574j3539
$$ -96295 -88257 -74731 -33232 -35972 -13659 -7408 30127 57021 78902 69490 26166 34740 21201
15930B1201j1797j0516k0025j4810l427m9480l9101M5591P5032N9771O768k9810
$$ 21201 9404 -1112 -21137 -35947 -39374 -88854 -127955 -82364 -7332 52439 59207 29397
15918B9397m9457j0824J9650R107K599K6890j1639O883J5610m5342j8987L7126
$$ 29397 -20060 -30884 -11234 -2127 472 27362 15723 22606 38216 -7126 -26113 11013
15906A1013R153j0780m0932l1074q732M7709J1253L801r563k318m0948L0329J9513
$$ 11013 20166 9386 -31546 -62620 -71352 -23643 -12390 -8589 -18152 -20470 -61418 -31089 -11576
15893a1576L0467K9882m5334j4056P197J0708n623K0504M46K6049K7311k7687
$$ -11576 18891 48773 3439 -10617 -3420 7288 1665 22169 22615 48664 75975 48288
15881D8288k2404O760o781n7102k0951q062J3501M4371j6821l2789k4869K9511
$$ 48288 25884 32644 25863 -31239 -52190 -60252 -46751 -2380 -19201 -51990 -76859 -47348
15869d7348K4097j2566k1880O858L2416K8214L3124j246m4928j0464K781J733
$$ -47348 -23251 -35817 -57697 -50839 -18423 9791 42915 41669 -3259 -13723 -10942 -9209
15857i209j8496j5214K1274l053R207O515L8422P847m7267m1639j4964J9641M626
$$ -9209 -27705 -42919 -21645 -24698 -15491 -8976 29446 37293 -9974 -51613 -66577 -46936 -42310
15844d2310k3907kK5641J4286J0101M3646O317j6502P103p865l1196j3933r78
$$ -42310 -66217 -66219 -40578 -26292 -16191 27455 33772 17270 24373 16508 -14688 -28621 -29599
15831b9599j1769L179J8513L753j7193Q882L3579J8487m6137l4758J0444p574
$$ -29599 -41368 -38189 -19676 -15923 -33116 -24234 9345 27832 -18305 -53063 -42619 -50193
15819e0193J3993K728M265K5753q857L907K1330k3551J271J2417J931Q433K4507
$$ -50193 -36200 -33472 -29207 -3454 -12311 -8404 12926 -10625 -9354 3063 4994 13427 37934
15806C7934n1273m4784L9595m464J0480L631J5080K0763L3631j1442k0217k9000
$$ 37934 -13339 -58123 -18528 -22992 -12512 -8881 6199 26962 60593 49151 28934 -66
15794f6l4707l7017j6250j3077p932L0902L0313O808J0355J3704j2940K4492k591
$$ -66 -34773 -71790 -88040 -101117 -109049 -78147 -47834 -41026 -30671 -16967 -29907 -5415 -8006
15781h006k8440J86r935K0947m606P61n278j3053J3891k1768N754L60j0263j3282
$$ -8006 -36446 -36260 -46195 -25248 -29854 -29093 -34371 -47424 -33533 -55301 -49547 -49187 -59450 -72732
15767g2732L4747J563m702N970K7976M9446r362q639m417k2711l2090K6032J0900
$$ -72732 -37985 -36422 -41124 -35154 -7178 42268 32906 24267 19850 -2861 -34951 -8919 1981
15754A981k701j0784J163k4190j1401k1085M371n500j9697K1799K1000M5218o844
$$ 1981 -720 -11504 -10341 -34531 -45932 -67017 -62646 -68146 -87843 -66044 -45044 174 -6670
15741f670j8222N3057o057k7308M694P371K908J2443k4757l94K9798K2626p913
$$ -6670 -24892 28165 22108 -5200 -506 6865 9773 22216 -2541 -2935 26863 49489 41576
15728D1576n4506J2099j0437l0707n442p586J3513J7713L330K3352j4329l2236
$$ 41576 -12930 -831 -11268 -41975 -47417 -55003 -41490 -23777 -20447 2905 -11424 -43660
15716d3660L7791j1912k3609J1246n661J4180L3965j7893J4665J0986K016j9117
$$ -43660 -5869 -17781 -41390 -30144 -35805 -21625 12340 -5553 9112 20098 22114 2997
15704B997R938k2379R94J4492P257j8082L504l3836m281J5335o577K5975R526
$$ 2997 12935 -9444 -8450 6042 13299 -4783 -1279 -35115 -39396 -24061 -30638 -4663 4863
15691D863j2753k2424k6725N286J5887j432N470r397J9004j554L3074j4031q057
$$ 4863 -7890 -30314 -57039 -51753 -35866 -37298 -31828 -41225 -22221 -23775 9299 -4732 -12789
15678a2789M4185p266L87k3963m3135J6698O8043L8014k0621n0680j2509K641
$$ -12789 31396 24130 24517 554 -42581 -25883 42160 80174 59553 8873 -3636 -995
15666i95L2090P838k4527J1972O719j2804j1220j843j7406K2399J5611J519k2132
$$ -995 31095 38933 14406 26378 33097 20293 9073 7230 -10176 12223 27834 29353 7221
15653G221K28m5779l7741j7025N0503K2053L801N189j9972l3114j3153L1413O1852
$$ 7221 7449 -38330 -76071 -93096 -42593 -20540 -16739 -11550 -31522 -64636 -77789 -46376 15476
15640A5476L1032n661L894L7986L6206l6201J282j0627l7930l0953k8848k4044
$$ 15476 46508 40847 44741 82727 118933 82732 84014 73387 35457 4504 -24344 -48388
15628d8388J8155J5323K5001J6262R626J854q241J1400p53n121o619k2383l1342
$$ -48388 -30233 -14910 10091 26353 35979 37833 29592 40992 40239 35118 28499 6116 -25226
15615b5226l878K4053M609J16n451J6540P803J3350k6297p945M580j3474k4712
$$ -25226 -29104 -5051 -442 -326 -5777 10763 18566 31916 5619 -2326 2254 -11220 -35932
15602c5932p836K6017J6894l2525k4413L8217j821R866L0452n952k8757q252J8289
$$ -35932 -43768 -17751 -857 -33382 -57795 -19578 -21399 -11533 18919 12967 -15790 -24042 -5753
15589e753j1558l7687m59j1276J0908K437K1347J3195j7349J659j6041J3730M294
$$ -5753 -17311 -54998 -55457 -66733 -55825 -53388 -32041 -18846 -36195 -34536 -50577 -36847 -32553
15576c2553K0084O452j9136M0088n04j6372l3406P983K9226R060K4862O488k2588
$$ -32553 -12469 -6017 -25153 14935 14431 -1941 -35347 -27364 1862 10922 35784 42272 19684
15563A9684J5361j2992p540k2126l890J3616j5961m1686j1890k8497n563K1605
$$ 19684 35045 22053 14513 -7613 -11503 2113 -13848 -55534 -67424 -95921 -101484 -79879
15551g9879N8357K7672r599R462k387L1071q718O15j9091J2464l831L3530j1491
$$ -79879 -21522 6150 -3449 6013 3626 34697 25979 26594 7503 19967 16136 49666 38175
15538C8175n975L2496n607l0799m721l4939k9996J7626N3554O708n1733l6833
$$ 38175 32200 64696 59089 28290 23569 -11370 -41366 -23740 29814 36522 -15211 -52044
15526e2044R443L304L1654k5816m225L9294o055K190j9829J8120K8971k9651k6850
$$ -52044 -42601 -39297 -7643 -33459 -37684 1610 -4445 -2255 -22084 -3964 25007 -4644 -31494
15513c1494k9534K4283K4353J3913q818J3048P919k9914j6513k1242J3308K8735
$$ -31494 -61028 -36745 -12392 1521 -7297 5751 13670 -16244 -32757 -53999 -40691 -11956
15501a1956j7099k8204j276J6237Q808p408j0582k145K2354K9778p17o290L075
$$ -11956 -29055 -57259 -58535 -42298 -33490 -40898 -51480 -53625 -31271 -1493 -2210 -8500 -5425
15488e425k5032m9042o793m684k808L6331L1584J1030q522L369K784j6062j8099
$$ -5425 -30457 -79499 -86292 -90976 -93784 -57453 -25869 -14839 -23361 -19992 -17208 -33270 -51369
15475e1369n202r890J6580l85j1096R548K3071o367k064M429j6813L417N6772
$$ -51369 -56571 -66461 -49881 -50266 -61362 -51814 -28743 -35110 -37174 -32745 -49558 -46141 10631
15462A0631k6210l9428K2960L1721k18j5245O896j8999M377K3509j3314k6109
$$ 10631 -15579 -55007 -32047 -326 -544 -15789 -8893 -27892 -23515 -6 -13320 -39429
15450c9429j1794J2273K1869n123p284L7255k0122Q177o664r760j1389m7209M506
$$ -39429 -51223 -38950 -17081 -22204 -29488 7767 -12355 -4178 -10842 -20602 -31991 -79200 -74694
15437g4694L9934J6585N287j6758M633K2044k718n5646k0835K3702L9975K70R568
$$ -74694 -34760 -18175 -12888 -29646 -25013 -2969 -5687 -61333 -82168 -58466 -18491 -18221 -8653
15424h653K541k4886j4046M1793M3017k1863L051J0351j6121j2593J1572j8699
$$ -8653 -6112 -30998 -45044 -3251 39766 17903 20954 31305 15184 2591 14163 -4536
15412d536j9241J2556L0558J196k6649k6245k4484j862O33L159J056j9860K8872
$$ -4536 -23777 -11221 19337 20533 -6116 -32361 -56845 -58707 -58074 -54915 -53859 -73719 -44847
15399d4847M2552J7652M712J3704J1267j3090j3913j1877J0903J7849j3800k82
$$ -44847 -2295 15357 20069 33773 45040 31950 18037 6160 17063 34912 21112 20830
15387B0830r163N876J3717K7249j1910o2921j4454O8182P046m9383l1229l962
$$ 20830 11667 17543 31260 58509 46599 -16322 -30776 37406 44452 -4931 -36160 -40122
15375d0122K2435q338J9541K9071J1294j6339j254K286k5063n992k3222q961P275
$$ -40122 -17687 -26025 -6484 22587 33881 17542 16288 18574 -6489 -12481 -35703 -44664 -37389
15362c7389M1911J2679J0315k498M4568J235j2402m9779k2696K2079j8564J8809
$$ -37389 4522 17201 27516 25018 69586 70821 58419 8640 -14056 8023 -10541 8268
15350H268k6734k4443J7514L9023J0401j4727K0437K0169J182L193j8675p538
$$ 8268 -18466 -42909 -25395 13628 24029 9302 29739 49908 51090 54283 35608 28070
15338B8070m8181L187j2333m45K030K9540L1955K472k8136M74j1677q918k880
$$ 28070 -20111 -16924 -29257 -29702 -27672 1868 33823 36295 8159 8633 -3044 -11962 -14842
15325a4842J0897R203l9520j1403N550O3070K2188J6559j6670l7486J2559L2616
$$ -14842 -3945 5258 -34262 -45665 -40115 22955 45143 61702 45032 7546 20105 52721
15313E2721N707l8856k0641K732j9314l9707O331K7177Q700J0286k186j4874L5133
$$ 52721 58428 19572 -1069 1663 -17651 -57358 -51027 -23850 -15150 -4864 -7050 -21924 13209
15300A3209R050n721N7512m522r245k6294j505K3195k3636l9189l1899k7654K2658
$$ 13209 22259 16538 74050 69528 60283 33989 32484 55679 32043 -7146 -39045 -66699 -44041
15287d4041L1561J15j6089J1008L9172J0062l3429j6191k5513j0158J3422L240
$$ -44041 -12480 -12365 -28454 -17446 21726 31788 -1641 -17832 -43345 -53503 -40081 -36841
15275c6841J4843K3122J1546l6838J6518M2301L5000o956k6693j0220k0042K1073
$$ -36841 -21998 1124 12670 -24168 -7650 34651 69651 62695 36002 25782 5740 26813
15263B6813K4228j8782j6933m917J4256o658k1373j7341m330M9308J6840p281
$$ 26813 51041 32259 15326 10409 24665 18007 -3366 -20707 -25037 24271 41111 33830
15251C3830L189L610j0353j2748k3201M389l4120m5486N4563R0395q242l6271
$$ 33830 37019 40629 30276 17528 -5673 -1284 -35404 -80890 -26327 64068 55826 19555
15239A9555j6394j5951P024N49m1046K6473J966N451J6771L3795j7280j5440P407
$$ 19555 3161 -12790 -5766 -5217 -46263 -19790 -17824 -12373 4398 38193 20913 5473 12880
15226A2880K1251J3662k3371J3153p205j1259j2129k6971J5441J3594l110K405
$$ 12880 34131 47793 24422 37575 30370 19111 6982 -19989 -4548 9046 5936 8341
15214H341J2084m678k0951j4482K434J3969K6913K1639M64J3341k1214j6715P79
$$ 8341 20425 15747 -5204 -19686 -17252 -3283 23630 45269 45733 59074 37860 21145 21924
15201B1924J5146k7341j7355L9724L7481J2613j2105l3721l9230l1620J6947K2621
$$ 21924 37070 9729 -7626 32098 69579 82192 70087 36366 -2864 -34484 -17537 5084
15189E084N291j0354k6285M0197J8473K0067N44l885j9099k5455N223k8730q222
$$ 5084 10375 21 -26264 13933 32406 52473 53017 49132 30033 4578 9801 -18929 -27151
15176b7151l79M2305L6215k2741K0987M5125j2307k7700l7788k875L7555k7837
$$ -27151 -27530 14775 50990 28249 49236 94361 82054 54354 16566 13691 51246 23409
15164B3409j4581j6760k6509k3982J1736L4961L2686J0943R199M650J9558J5707
$$ 23409 8828 -7932 -34441 -58423 -46687 -11726 20960 31903 41102 45752 65310 81017
15152H1017j3948j6454l8636n246m412p623J3848J5346N055K3261k0730l5107
$$ 81017 67069 50615 11979 6733 2321 -5302 8546 23892 28947 52208 31478 -3629
15140c629l318K2980o64L3311N723O447K0263k6137k5519m1499l5702M8543K4980
$$ -3629 -6947 16033 15369 48680 54403 60850 81113 54976 29457 -12042 -47744 799 25779
15127B5779n214j6260R762N759j6355o136j6088R165N543k9549k0367K2692K8769
$$ 25779 20565 4305 14067 19826 3471 -2665 -18753 -9588 -4045 -33594 -53961 -31269 -2500
15114b500l9002n36M4382R253k7004l9295J7852L921K1017J5017K6202j2183o631
$$ -2500 -41502 -42038 2344 11597 -15407 -54702 -36850 -32929 -11912 3105 29307 17124 10493
15101A0493r719j714j6857K7931K3687k8057p677j0988m340Q991M119k8410J0273
$$ 10493 774 -940 -17797 10134 33821 5764 -1913 -12901 -17241 -8250 -4131 -32541 -22268
15088b2268k27k0353l2811J2090L4482K1457N268j2924J9821j9446J15n626j7429
$$ -22268 -22495 -42848 -75659 -63569 -29087 -7630 -2362 -15286 4535 -14911 -14796 -20422 -37851
15075c7851k6584k8563o703L0481L4430J2413j4264k6968j654o000K8456K5728
$$ -37851 -64435 -92998 -99701 -69220 -34790 -22377 -36641 -63609 -65263 -71263 -42807 -17079
15063a7079k2134K5500N8551k735l4831K204R810L2819L438o693o773l1172j7700
$$ -17079 -39213 -13713 44838 42103 7272 9476 19286 52105 55543 48850 42077 10905 -6795
15050f795j5765j183J2560L8152M304j3231M069l3531k6459K4110J7639l031J0195
$$ -6795 -22560 -23743 -11183 26969 31273 18042 22111 -11420 -37879 -13769 3870 839 11034
15037A1034l551j0272K4485J4136O883O841m110j1453K618k638J7951j0988k2015
$$ 11034 7483 -2789 21696 35832 42715 49556 45446 33993 36611 33973 51924 40936 18921
15024A8921J2527K2221m149j0634n1352j0022M5043O96J1929j899l005N785J2976
$$ 18921 31448 53669 49520 38886 -12466 -22488 22555 23251 35180 33281 30276 36061 49037
15011D9037j7779j8244R172M619k1009K0306Q962l2351j9851j7023J0770J0432
$$ 49037 31258 13014 22186 26805 5796 26102 35064 2713 -17138 -34161 -23391 -12959
14999a2959J8027j2630j5148n650j2811K1514K0080o426J0995k4784o59P582N700
$$ -12959 5068 -7562 -22710 -28360 -41171 -19657 423 -6003 4992 -19792 -20451 -12869 -7169
14986g169j0296J4579J0510M062k1737K472K3653J4636k6997k1279O375K7266
$$ -7169 -17465 -2886 7624 11686 -10051 -7579 16074 30710 3713 -17566 -11191 16075
14974A6075R595J4073l4282j5515R882K1090j3467J5110P697m0131m355j7291
$$ 16075 25670 39743 5461 -10054 -172 20918 7451 22561 30258 -9873 -14228 -31519
14962c1519j3706l89k3345Q480K5643Q843q104n0573L0444M4138J3831K4544L834
$$ -31519 -45225 -45614 -68959 -60479 -34836 -25993 -34097 -84670 -54226 -10088 3743 28287 32121
14949C2121j7516q324O278K8434j0226m814j3964k2826k7035J8648J5635J2248
$$ 32121 14605 6281 12559 40993 30767 25953 11989 -10837 -37872 -19224 -3589 8659
14937H659J7273J8034m679k8733l7737l591K8698L4402L1513n757o2784l58L0307
$$ 8659 25932 43966 39287 10554 -27183 -30774 -2076 32326 63839 58082 -4702 -5060 25247
14924B5247J5684J6226j8041l0140L273k6374K1156K2575P150P281K9484K7350
$$ 25247 40931 57157 39116 8976 12249 -14125 7031 29606 36756 44037 73521 100871
14912A00871K9923K3348l5546q9965k1252O322o198J1084J9172o066K0855O608
$$ 100871 130794 154142 118596 28631 7379 13701 7503 18587 37759 31693 52548 59156
14900E9156k9735k5826l257R0M000l2827L706K8240p711j5024K0874M7453J485
$$ 59156 29421 3595 338 428 4428 -28399 -24693 3547 -4164 -19188 1686 49139 50624
14887E0624l9605j6264j6600L653m200J4319K5688j5848J3294k746M059L8426
$$ 50624 11019 -5245 -21845 -18192 -22392 -8073 17615 1767 15061 12315 16374 54800
14875E4800O1432j1644m6103n3010m6207k1711J5548K9633p200P702l7555j3789
$$ 54800 116232 104588 58485 5475 -40732 -62443 -46895 -17262 -24462 -16760 -54315 -68104
14863f8104L8243O08J6431J4847M159j038J6998j0963k6306n530m7Q478J2113
$$ -68104 -29861 -29253 -12822 2025 6184 5146 22144 11181 -15125 -20655 -20702 -12224 -111
14850a11R027K4007K6400k204k8169k6179O594J5494j6875k3510j7409K3707Q645
$$ -111 8916 32923 59323 57119 28950 2771 9365 24859 7984 -15526 -32935 -9228 -583
14837e83M235P179o023o630l1097k3050K8398K6923K2908r504P556K3825k56J2643
$$ -583 3652 10831 4808 -1822 -32919 -55969 -27571 -648 22260 12756 20312 44137 43881 56524
14823E6524k4189n6770J0264L5869J606k7219O206J4874p631k0269j4265j2340
$$ 56524 32335 -24435 -14171 21698 23304 -3915 2291 17165 9534 -10735 -25000 -37340
14811c7340K4071K4662l5489L428L9125q05r117j9835k0218j6598K9822M7112
$$ -37340 -13269 11393 -24096 -20668 18457 17652 8535 -11300 -31518 -48116 -18294 28818
14799B8818l121l3029l0173J4355J0866J0472L3803l0033l6243l1576J7531L6748
$$ 28818 25697 -7332 -37505 -23150 -12284 -1812 31991 1958 -34285 -65861 -48330 -11582
14787a1582L4127K2512j8882k1624K2811K371P18K2033L2625k5386m5919r671
$$ -11582 22545 45057 26175 4551 27362 29733 30451 52484 85109 59723 13804 4133
14775D133Q28L5498j5127K988k7013l9329J3606M5889J8108M757K1880n139j3273
$$ 4133 4961 40459 25332 28320 1307 -38022 -24416 21473 39581 44338 66218 61079 47806
14762D7806o487m7860l1090K4229Q629L729J1019O958j0757O422J4886k0746J4389
$$ 47806 41319 -6541 -37631 -13402 -4773 -1044 9975 16933 6176 12598 27484 6738 21127
14749B1127j0821k9490O192K031K3030j3917K1631q354r892j5326j422k3822o141
$$ 21127 10306 -19184 -12992 -10961 12069 -1848 19783 11429 1537 -13789 -15211 -39033 -45174
14736d5174L8790M932J8779j5881j9675r332j4477J1647j1024j2584J9082L1538
$$ -45174 -6384 -1452 17327 1446 -18229 -27561 -42038 -30391 -41415 -53999 -34917 -3379
14724c379k2216M627O8815N640k9071m6343j6427Q650Q153M1795j0580m7170j8106
$$ -3379 -25595 -20968 47847 53487 24416 -21927 -38354 -29704 -21551 20244 9664 -37506 -55612
14711e5612l0987L0083J1954L5874K1990k8713o555J2726M384J4030J668l1302
$$ -55612 -86599 -56516 -44562 -8688 13302 -15411 -21966 -9240 -4856 9174 10842 -20460
14699b0460k1999Q163J8407O284J3304J3498J1612k6983r9K37J0927K4692K7339
$$ -20460 -42459 -34296 -15889 -9605 3699 17197 28809 1826 1727 1964 12891 37583 64922
14686F4922K8267n4775j6491J7570N720j2566j4273J080L4477J0021L2791j0730
$$ 64922 93189 38414 21923 39493 45213 32647 18374 19454 53931 63952 96743 86013
14674H6013j4057l7892k9798M535j8184r185J8855O412L1756J3001l9400j6391
$$ 86013 71956 34064 4266 8801 -9383 -18568 287 6699 38455 51456 12056 -4335
14662d335Q262l424j1729K3808J9278P473J8407k7728J6323j71R583k0510l4277
$$ -4335 3927 503 -11226 12582 31860 39333 57740 30012 46335 46164 55747 35237 960
14649I60M18K6732P672m6j3837n328p274k7554J6990O4252j1024l0276J0335l193
$$ 960 1378 28110 35782 35736 21899 16571 9297 -18257 -1267 62985 51961 21685 32020 28827
14635B8827l4259j5503p202l5325L1374K9620p462j1462K362M3593j4714m6066
$$ 28827 -5432 -20935 -28137 -63462 -32088 -2468 -9930 -21392 -19030 24563 9849 -36217
14623c6217j3856o188J0413J1625o223J9638L3633K4619m548l4286n8627r953
$$ -36217 -50073 -56261 -45848 -34223 -40446 -20808 12825 37444 32896 -1390 -60017 -69970
14611f9970R57L8138K4418r729J2761L155m26J7763J1429J9681j9301j7133m3538
$$ -69970 -69013 -30875 -6457 -16186 -3425 -270 -696 17067 28496 48177 28876 11743 -31795
14598c1795j1456O987J4578k5224L2174L670l110k2339N848J4052k2635M774j8104
$$ -31795 -43251 -36264 -21686 -46910 -14736 -11066 -14176 -36515 -30667 -16615 -39250 -34476 -52580
14585e2580p456M1137j814J5415j9752r876O1370l632j0708J9908q835l1824L985
$$ -52580 -60036 -18899 -20713 -5298 -25050 -34926 26444 22812 12104 32012 23177 -8647 -4662
14572d662J7226m572j167L211m997n927l6917j3276O71M2711p439K57J4342J787
$$ -4662 12564 7992 6825 10036 5039 -888 -37805 -51081 -50410 -7699 -15138 -14881 -539 1248
14558A248k5940K9111L6153j5755L2073j7165R772Q63K0120J338j9510q258m0728
$$ 1248 -24692 4419 40572 24817 56890 39725 49497 50360 70480 71818 52308 44050 3322
14545C322l3896N800J5323M3163J2111m3664k5311j201l4525K7015l2866N882
$$ 3322 -30574 -24774 -9451 33712 45823 2159 -23152 -24353 -58878 -31863 -64729 -58847
14533e8847K9244K481K1422J2324K9949j6898m2805m4004O030P427K1789O3k7377
$$ -58847 -29603 -27122 -5700 6624 36573 19675 -23130 -67134 -61104 -53677 -31888 -31825 -59202
14520e9202l2108L306J4727K3136K4416K3212J2855P017m2630k0403j5518J2497
$$ -59202 -91310 -88004 -73277 -50141 -25725 -2513 10342 17359 -25271 -45674 -61192 -48695
14508d8695M9654K1217O883k6316k5635J9124Q175k1885k4354l3168J6568L4374
$$ -48695 959 22176 29059 2743 -22892 -3768 4407 -17478 -41832 -75000 -58432 -24058
14496b4058J1271n37Q681m196k3315j4814J6025J4634K9323L8351K868k5362j3335
$$ -24058 -12787 -13324 -4643 -8839 -32154 -46968 -30943 -16309 13014 51365 54233 28871 15536
14483A5536J3544q685j4604k3926m0791j4597M3703r57m3649n279L1303J8815
$$ 15536 29080 20395 5791 -18135 -58926 -73523 -29820 -30777 -74426 -79705 -48402 -29587
14471b9587K4717K0266k4582J0963J9629m986J4889N182M904k8496j3152q40o843
$$ -29587 -4870 15396 -9186 1777 21406 16420 31309 36491 41395 12899 -253 -1093 -7936
14458g936P016r501R502K4648m3639j4025J7509p435J3968N554K1864k546R390
$$ -7936 -920 -10421 -919 23729 -19910 -33935 -16426 -23861 -9893 -4339 17525 14979 24369
14445B4369L2746K2935m1101m5700p626n808k1039o277p056k9590K1385j7588
$$ 24369 57115 80050 38949 -6751 -14377 -20185 -41224 -47501 -54557 -84147 -62762 -80350
14433h0350L2252M1507M310Q8J7086N086l093J8640k2419k9643l887k2624m034
$$ -80350 -48098 -6591 -2281 -2193 14893 19979 16886 35526 13107 -16536 -20423 -43047 -47081
14420d7081L0416K6747P982n731j361K751l4933K8822K4608p387k7918j6922j4049
$$ -47081 -16665 10082 18064 12333 10972 13723 -21210 7612 32220 24833 -3085 -20007 -34056
14407c4056j9745J4215J3136k2016k4031p05l356p166J3820j1799M91N0642K0820
$$ -34056 -53801 -39586 -26450 -48466 -72497 -73202 -76558 -83724 -69904 -81703 -81212 -30570 -9750
14394i750J4218K4268q106P84p405k4466m143p186K470J8684L7900k0401n7387
$$ -9750 4468 28736 20630 21414 14009 -10457 -14600 -21786 -19316 -632 37268 16867 -40520
14381d0520m360K5035j1030J5932M5050P536q185k127m3566J3084K6862J0130
$$ -40520 -44880 -19845 -30875 -14943 30107 37643 29458 27331 -16235 -3151 23711 33841
14369C3841l0757j311n091l1941N074p867K3542L3476J7121j8R420j9623n861
$$ 33841 3084 1773 -3318 -35259 -30185 -38052 -14510 18966 36087 36069 45489 25866 20005
14356B0005J9594J0569k2553k0632L2534J1740j7456j2260k8827j734K4960j8916
$$ 20005 39599 50168 27615 6983 39517 51257 33801 21541 -7286 -9020 15940 -2976
14344b976j3502j1937Q515K4430j3678J2343J8229k4312k7102K4880L4104p770
$$ -2976 -16478 -28415 -19900 4530 -9148 3195 21424 -2888 -29990 -5110 28994 21224
14332B1224j5468J4899o483L112R76j6963K5745J298L792k185k9169K2991k8250
$$ 21224 5756 20655 14172 17284 18260 1297 27042 28340 32132 29947 778 23769 -4481
14319d481j4685M0547j1721l412l686N232J3208k2047o343K9922J398M5245L852
$$ -4481 -19166 21381 9660 6248 2562 7794 21002 -1045 -7388 22534 23932 69177 73029
14306G3029n841k9819l815j1416m1192j0562j2247P381N0788J2592l9293j7874
$$ 73029 67188 37369 33554 22138 -19054 -29616 -41863 -34482 16306 28898 -10395 -28269
14294b8269L0175L7652l9340j4841L3073J1170j1556K622J3048j4022m7641K3754
$$ -28269 1906 39558 218 -14623 18450 29620 18064 20686 33734 19712 -27929 -4175
14282d175J6521J321k664L545J3861K7393Q012o878k0423j7020J069j1316J8020
$$ -4175 12346 13667 11003 14548 28409 55802 63814 56936 36513 19493 20562 9246 27266
14269B7266J5849r705J2062k7502J4532K0663L452P881o945j0129l6177l3399
$$ 27266 43115 33410 45472 17970 32502 53165 56617 64498 57553 47424 11247 -22152
14257b2152l1469J3975K3224K0761M5632J6585l6650J2221j154l859K8511K0489
$$ -22152 -53621 -39646 -16422 4339 49971 66556 29906 42127 40973 37114 65625 86114
14245H6114k5945k4340p723m503m1947J6053J4183j451j1011l558M540k6748N554
$$ 86114 60169 35829 28106 23603 -18344 -2291 11892 10441 -570 -4128 412 -26336 -20782
14232b0782J7487j4587M009M459M400J3695M3460J0538N037l0852l1629k9453
$$ -20782 -3295 -17882 -13873 -9414 -5014 8681 52141 62679 67716 36864 5235 -24218
14220b4218j6344r473R762L26k7640N8140O8940K7258k3496o5954l1845O0234
$$ -24218 -40562 -50035 -40273 -39947 -67587 -9447 59493 86751 63255 -2699 -34544 25690
14208B5690O5892l0771j0296J9029K2038k8399p3486j5110L8996K4159j2232l6106
$$ 25690 91582 60811 50515 69544 91582 63183 -10303 -25413 13583 37742 25510 -10596
14196a0596j1421K4284L7281k2976l3847L3636L1098j9676m563r568k5007L0975
$$ -10596 -22017 2267 39548 16572 -17275 16361 47459 27783 23220 13652 -11355 19620
14184A9620L1525L7809J4554l7550o3835L589L3751j4425N566J6046Q857j8400
$$ 19620 51145 88954 103508 65958 2123 5712 39463 25038 30604 46650 55507 37107
14172C7107k0979j287J8857J2292J1367K577q684J7375o889j1300j9848m107L8724
$$ 37107 16128 14841 33698 45990 57357 59934 51250 68625 61736 50436 30588 26481 65205
14159F5205K1917j5326n1483o68K0736p813k5467J9030P42o779q937k2630J7826
$$ 65205 87122 71796 20313 19645 40381 32568 7101 26131 26873 20094 11157 -11473 6353
14146F353L445k3539O017J2827n904l2856O341J7624K5556J5182K9875J0322j8492
$$ 6353 9798 -13741 -7724 5103 -801 -33657 -27316 -9692 15864 31046 60921 71243 52751
14133E2751j5420k9252q721M2958j8640k5168j7365M2020N3076j6525j8050k0032
$$ 52751 37331 8079 -642 42316 23676 -1492 -18857 23163 76239 59714 41664 21632
14121B1632j2521K8367J8430k0623j7123Q206l842j0481k1054J0209J4979o194
$$ 21632 9111 37478 55908 35285 18162 26368 22526 12045 -9009 1200 16179 9985
14109I985j0606o0o254j0185J473Q337j8795j6762k6230K5097M4110m2759p804
$$ 9985 -621 -681 -6935 -17120 -15647 -7310 -26105 -42867 -69097 -44000 110 -42649 -50453
14096e0453O6073K7218j0604j6099n433l6107L4802O7939p642j7134m0309l0803
$$ -50453 15620 42838 32234 16135 10702 -25405 9397 77336 69694 52560 12251 -18552
14084a8552l4471K0084L0125O781j3068k6850l400L0286L0702k1252j8286J7434
$$ -18552 -53023 -32939 -2814 3967 -9101 -35951 -39351 -9065 21637 385 -17901 -467
14072d67J552o235j8481K1013j4438J840M6553Q126K0118J0198n153n2251r204
$$ -467 1085 -5150 -23631 -2618 -17056 -15216 31337 39463 59581 69779 64626 12375 3171
14059C171M9842K7870m666k2570l3584j3182m931k814K6924p520M595O113j0251
$$ 3171 53013 80883 76217 53647 20063 6881 1950 -864 26060 18540 23135 29248 18997
14046A8997J8476j6380k0887L5529P143j3121l3825j1611J865j923K1739J2346
$$ 18997 37473 21093 206 35735 42878 29757 -4068 -15679 -13814 -15737 6002 18348
14034A8348p438n670L8099M4121j8565m6138l7857J8621L2662L720o905o87R640
$$ 18348 10910 5240 43339 87460 68895 22757 -15100 3521 36183 39903 32998 32311 41951
14021D1951k9969r1k102J3392k4435J1852Q180k7040K6414L6807R434j5670o827
$$ 41951 11982 11891 9789 23181 -1254 10598 18778 -8262 18152 54959 64393 48723 41896
14008D1896j0445k2466l0303J1471k710J9513J0350n2649k5542J0844Q611J4775
$$ 41896 31451 8985 -21318 -9847 -12557 6956 17306 -35343 -60885 -50041 -41430 -26655
13996b6655K8573K7225k2730m8128K9439K4744K9400n078k1289k484J7311q747
$$ -26655 1918 29143 6413 -41715 -12276 12468 41868 36790 15501 13017 30328 21581
13984B1581p487k9974N842J3267j7246o662k1505j8322K6967j5533r1J3093Q124
$$ 21581 14094 -15880 -10038 3229 -14017 -20679 -42184 -60506 -33539 -49072 -49163 -36070 -27946
13971b7946L108J2263L7365J4555j3440o281K2006o937l320q881j2761J1356L0163
$$ -27946 -24838 -12575 24790 39345 25905 19624 41630 34693 31373 22492 9731 21087 51250
13958E1250Q533p542l7978k3860j0152Q662K021l0349P915M9421j3330o5621o699
$$ 51250 59783 52241 14263 -9597 -19749 -11087 -9066 -39415 -31500 17921 4591 -61030 -67729
13945f7729O511M9851O517K9806J8846m2301q062J129M800N1673m98n2383j2319
$$ -67729 -61218 -11367 -4850 24956 43802 1501 -6561 -5432 -632 51041 50543 -1840 -14159
13932a4159r137J413K1452K0972K773j0094K279J0390L5184J5392k0371r249p277
$$ -14159 -23296 -21883 -431 20541 23314 13220 15499 25889 61073 76465 56094 46845 39568
13919C9568o4546j7713J0628J099P264m813J1172j1439O229L0865J4940K7324
$$ 39568 -24978 -42691 -32063 -30964 -23700 -28513 -17341 -28780 -22551 8314 23254 50578
13907E0578k5957k5244k9356j7416J3357j4945L7299L3795o661j4417J998m7983
$$ 50578 24621 -623 -29979 -47395 -34038 -48983 -11684 22111 15450 1033 3031 -44952
13895d4952j8068L0466J7939J2896j9631j0620o064J9997P524k6479k3157K4596
$$ -44952 -63020 -32554 -14615 -1719 -21350 -31970 -38034 -18037 -10513 -36992 -60149 -35553
13883c5553K9253J0296K1026k0901k1360P165N262J3591n546k1231M4018n209
$$ -35553 -6300 3996 25022 4121 -17239 -10074 -4812 8779 3233 -17998 26020 20811
13871B0811j8466J6801M8612K1435p027l2550n333K7212j231j5395k7453o471
$$ 20811 2345 19146 67758 89193 82166 49616 44283 71495 70264 54869 27416 20945
13859B0945K5327q441l1555K5473M4272J8231k9630n416r634j0783k9467j3767
$$ 20945 46272 37831 6276 31749 76021 94252 64622 59206 49572 38789 9322 -4445
13847d445l483O361m2638k6654L3556M2037k5424j4269Q702j2023P560l687K3540
$$ -4445 -7928 -1567 -44205 -70859 -37303 4734 -20690 -34959 -26257 -38280 -30720 -34407 -10867
13834a0867J9661k4945K0590K256m291M174J0015J3635R00m7948J7766J4168r507
$$ -10867 8794 -16151 4439 6695 2404 6578 16593 30228 31128 -16820 946 15114 5607
13821E607l688j5361j1774L9900O229o220N035K1174J167j0419L678j4622L726
$$ 5607 1919 -13442 -25216 14684 20913 14693 19728 40902 42069 31650 35328 20706 24432
13808B4432M685k1392l086K4196k6861k6463l4361K7018M6103n243j0925m521
$$ 24432 29117 7725 4639 28835 1974 -24489 -58850 -31832 14271 9028 -1897 -6418
13796f418l1447q001J0754k1434K1638L0938J8529j5145J2638L9349k1297n9161
$$ -6418 -37865 -45866 -35112 -56546 -34908 -3970 14559 -586 12052 51401 30104 -29057
13784b9057j5348L0692M4603j0527k9864Q363o601q394j0919L3609L1478l5391
$$ -29057 -44405 -13713 30890 20363 -9501 -1138 -7739 -16133 -27052 6557 38035 2644
13772B644l3651j8766n777j937l968L8512K5219J4404N667P093l9195k2775p751
$$ 2644 -31007 -49773 -55550 -57487 -61455 -22943 2276 16680 22347 29440 -9755 -32530 -40281
13759d0281p804j7679O942M2681R842j7259J9480K1770J6734M747J9909n4500
$$ -40281 -48085 -65764 -58822 -16141 -6299 -23558 -4078 17692 34426 39173 59082 4582
13747D582k7039M8641k855k6833o945N954n535L270M5602k0884q769J9122J916
$$ 4582 -22457 26184 23329 -3504 -10449 -4495 -10030 -6760 38842 17958 9189 28311 30227
13734C0227J1693P34j3509m181o476M894k1026p627j3504N024L324l8602l454
$$ 30227 41920 42654 29145 24964 18488 23382 2356 -5271 -18775 -13751 -10427 -49029 -52483
13721e2483K139L5681K2800J3699M2945q660n2795K21M218j6910k6943J8929q843
$$ -52483 -50344 -14663 8137 21836 64781 56121 3326 3547 7765 -9145 -36088 -17159 -26002
13708b6002M1040l345O741O294n0426l014P031K5838M439p226m4873j8299K8796
$$ -26002 15038 11693 18434 24728 -25698 -28712 -21681 4157 8596 1370 -43503 -61802 -33006
13695c3006R308L7521K4897K0479j2258j2882k4512J1488J691M757j9295l0696
$$ -33006 -23698 13823 38720 59199 46941 34059 9547 21035 22726 27483 8188 -22508
13683b2508l766K0632P9173L632l1238j6355J2618P041j4137m4434J6116J6997
$$ -22508 -26274 -5642 73531 77163 45925 29570 42188 49229 35092 -9342 6774 23771
13671B3771K2337j1852k5360n977J9077M1220l1170k2202o770j2969K351K23k4552
$$ 23771 46108 34256 8896 2919 21996 63216 32046 9844 3074 -9895 -7544 -7321 -31873
13658c1873K069L3532m2772R298K5499k598J8985K849J1753j5460k8097K5523
$$ -31873 -29804 3728 -39044 -29746 -4247 -6845 12140 14989 26742 11282 -16815 8708
13646H708L7935m0583l5683r411L249K4454L862L490L8413M2612K0204j6026m8419
$$ 8708 46643 6060 -29623 -39034 -35785 -11331 -7469 -3979 34434 77046 97250 81224 32805
13633C2805P998P568j9654r487k0110j3327Q805j4769J8107J5601J509J6319P517
$$ 32805 40803 48371 28717 19230 -880 -14207 -5402 -20171 -2064 13537 15046 31365 38882
13620C8882k7231j1451Q594K5653j8467N231L093M847n5351Q341R279J4877k9883
$$ 38882 11651 200 8794 34447 15980 21211 24304 29151 -26200 -17859 -8580 6297 -23586
13607b3586j4427J8925l763m414J0765j1870L7843J1589J6873k7767m0809J0956
$$ -23586 -38013 -19088 -22851 -27265 -16500 -28370 9473 21062 37935 10168 -30641 -19685
13595a9685J8008l539o271m552L9586L8834j387k6477n4061r328j4149J3440L7612
$$ -19685 -1677 -5216 -11487 -16039 23547 62381 60994 34517 -19544 -28872 -43021 -29581 8031
13582H031J3582J7088J1796K0459J391j1425j3834k4727j3238l6272k1619K5320
$$ 8031 21613 38701 50497 70956 72347 60922 47088 22361 9123 -27149 -48768 -23448
13570b3448R110J2823j1368L01J1269k8982k0523N3764J5265k9842n2387P969
$$ -23448 -14338 -1515 -12883 -12582 -1313 -30295 -50818 2946 18211 -11631 -64018 -56049
13558e6049q092J5332j4433J1493N221q057l085k7497k7465J4967L2615N882K2976
$$ -56049 -64141 -48809 -63242 -51749 -46528 -54585 -57670 -85167 -112632 -97665 -65050 -59168 -36192
13545c6192L7893J558J1858j2538J4603L7057K8219K2332m3628n0398k778K6409
$$ -36192 1701 3259 15117 2579 17182 54239 82458 104790 61162 10764 7986 34395
13533C4395m4291j3424K7586l1147K9950K7353n780N1183j8901o3257O554P885
$$ 34395 -9896 -23320 4266 -26881 3069 30422 24642 75825 56924 -6333 221 8106
13521H106k5766R80k0024J4955j922J2421j2349j4034j0829j1038K6077O6788
$$ 8106 -17660 -16680 -36704 -21749 -23671 -11250 -23599 -37633 -48462 -59500 -33423 33365
13509C3365l4911l9161J4540J1903j121p127K7929J1932r255m0635j998M2482
$$ 33365 -1546 -40707 -26167 -14264 -15385 -22512 5417 17349 8094 -32541 -34539 7943
13497G943m0108J2608M1271L6919j2799m0782n995j0976k610L9119K8694n107
$$ 7943 -32165 -19557 21714 58633 45834 5052 -943 -11919 -14529 24590 53284 48177
13485D8177j8247K0026L1420L323o1236j5183Q51M229l2464l0775k2512P083L0032
$$ 48177 29930 49956 81376 84699 23463 8280 9131 13360 -19104 -49879 -72391 -65308 -35276
13472c5276J507m655m5364P1M4455q50l6384L1071J3808J1282j2452j7927R63
$$ -35276 -33769 -38424 -83788 -83717 -39262 -40112 -76496 -45425 -31617 -20335 -32787 -50714 -49751
13459d9751J7618L1154K2530Q115J4130J4506k8000j3377M7159k986l2848R324
$$ -49751 -32133 -979 21551 29666 43796 58302 30302 16925 64084 61098 28250 37574
13447C7574J1686Q118J785l7707j1251r324J9338j2943K3794k916j9959o406Q21
$$ 37574 49260 57378 59163 21456 10205 881 20219 7276 31070 28154 8195 1789 2610
13434B610K632r062l1940k2093N0948K1665m984mk3608N85o50l2682q471K0479
$$ 2610 5242 -3820 -35760 -57853 -6905 14760 9776 9772 -13836 -13251 -13901 -46583 -55054 -34575
13420c4575O621L3871k5723j1740m456M018L7505j4725K8060J8155j2847Q547
$$ -34575 -27954 5917 -19806 -31546 -36002 -31984 5521 -9204 18856 37011 24164 32711
13408C2711J3452k252j9971j2311k0122j509j9337k5869J6869L9368K6299K0025
$$ 32711 46163 43911 23940 11629 -8493 -10002 -29339 -55208 -38339 1029 27328 47353
13396D7353L3802j0736j7396j4656K5655J4288k8143J8677q814o610n515j5551
$$ 47353 81155 70419 53023 38367 64022 78310 50167 68844 60030 53420 47905 32354
13384C2354l1139l4343l083K0064M9758Q045l8677l37L8286r229k2111j8649m8584
$$ 32354 1215 -33128 -36211 -16147 33611 41656 2979 2642 40928 31699 9588 -9061 -57645
13371e7645L995J3745j6050J2629M9734N4659K3351l1443k8554l8989k2345K785
$$ -57645 -53650 -39905 -55955 -43326 6408 61067 84418 52975 24421 -14568 -36913 -34128
13359c4128L9608L2373l3708k608L8868Q672k8025q090J949j1570r232R146J3314
$$ -34128 5480 37853 4145 1537 40405 49077 21052 12962 14911 3341 -5891 3255 16569
13346A6569n8832p197J7096m191L603K5694L8288R944k628J2904J4137m834k6849
$$ 16569 -42263 -49460 -32364 -36555 -32952 -7258 31030 40974 38346 51250 65387 60553 33704
13333C3704M018J1748L968j4942j4823k011j2365K3746k8084l1920J1000Q00K443
$$ 33704 37722 49470 53438 38496 23673 21662 9297 33043 4959 -26961 -15961 -15161 -12718
13320a2718m1300r008M1119J9853m995L948J4069R170p324j6294m725K760l799
$$ -12718 -54018 -63026 -21907 -2054 -7049 -3101 10968 20138 12814 -3480 -8205 -5445 -9244
13307i244K4407m9k7319P090j8527L133O635J5249K2422j0441r600J3865Q999
$$ -9244 15163 15114 -12205 -5115 -23642 -20509 -13874 1375 23797 13356 3756 17621 26620
13294B6620K5039Q72k564o9528J5260L8409n896L181J9752m347j8816k1286k6420
$$ 26620 51659 52531 49967 -19561 -4301 34108 28212 31393 51145 46798 27982 6696 -19724
13281a9724O671n156j1760J656M1110J2796K3031j357j691k0778m9773m637L3405
$$ -19724 -13053 -18209 -29969 -28313 12797 25593 48624 47267 45576 24798 -24975 -29612 3793
13268C793K9151k7552j7017L095k3170n46P137L3485j0865n874q88n081L786l584
$$ 3793 32944 5392 -11625 -8530 -31700 -32246 -25109 8376 -2489 -8363 -9251 -14332 -10546 -14130
13254a4130j9185o524K2368N7500M2672k5664k2362k218M205l8778j4997J7368
$$ -14130 -33315 -39839 -17471 40029 82701 57037 34675 32457 36662 -2116 -17113 255
13242B55J6957J0812L631J0950k8869o4791K793J4431L5644j2505R983r483K2857
$$ 255 17212 28024 31655 42605 13736 -51055 -48262 -33831 1813 -10692 -709 -10192 12665
13229A2665K2304K6251J1995k9295J13J3418o0785j5059J8428M8916j1598n831
$$ 12665 34969 61220 73215 43920 44033 57451 -3334 -18393 35 48951 37353 31522
13217C1522P119O84k2840J6453j355J4264L802N30n4035m1413j320N0530K9932
$$ 31522 38641 39325 16485 32938 31583 45847 49649 50179 -3856 -45269 -46589 3941 33873
13204C3873j449j4774k8168j858K4084J9964l7963k8746Q503R925j3838k084Q201
$$ 33873 32424 17650 -10518 -12376 11708 31672 -6291 -35037 -26534 -16609 -30447 -32531 -24330
13191b4330K5808p860R441O23j7024p865Q6P195m355j2897N225Q847L5711j3654
$$ -24330 1478 -6382 3059 3682 -13342 -21207 -21121 -13926 -18281 -31178 -25953 -17106 18605 4951
13177D951k8303k3735L4208m076K1653k0063l5022J3058P13P036O9608M4713J3213
$$ 4951 -23352 -47087 -12879 -16955 4698 -15365 -50387 -37329 -36616 -29580 40028 84741 97954
13164I7954l4933j2320J3344n8658M897j0948l7166K8108K2729L806K0446J6588
$$ 97954 63021 50701 64045 5387 10284 -664 -37830 -9722 13007 16813 37259 53847
13152E3847l8860k4537l2391R124K7554k9053j3804K4345R3J2185J5910m0499
$$ 53847 14987 -9550 -41941 -32817 -5263 -34316 -48120 -23775 -23682 -11497 4413 -36086
13140c6086l1479J3752j755j4625K3634L2320N9818m701j8550j0463j6911k1156
$$ -36086 -67565 -53813 -55568 -70193 -46559 -14239 45579 40878 22328 11865 -5046 -26202
13128b6202J6483J2009n185K2654J252K3059k8566K0963q451k7767M684j7737
$$ -26202 -9719 2290 -2895 19759 21011 44070 15504 36467 28016 249 4933 -12804
13116a2804j909O447K733K5460m796J1908k1253n2905j7390j1065J8544q722L1944
$$ -12804 -14713 -8266 -5533 19927 15131 27039 5786 -47119 -64509 -75574 -57030 -65752 -33808
13103c3808L402J2065j3844K9095Q093O140K6356J7031K802q160L8691R717M321
$$ -33808 -30406 -18341 -32185 -3090 5003 11143 37499 54530 57332 49172 87863 97580 101901
13090A01901N483p0641m699Q68m8515j7178p203N7184L3519m2413M512J4637J399
$$ 101901 107384 36743 32044 32912 -15603 -32781 -39984 17200 50719 8306 12818 27455 28854
13077B8854j5763k2071n9897m0506L9084M2802K5003O455l0014j4593p662j8963
$$ 28854 13091 -8980 -68877 -109383 -70299 -27497 -2494 3961 -26053 -40646 -48308 -67271
13065f7271j0807J8507P0526L0601l1309J9945l4886l0572k427j8554j1408J2365
$$ -67271 -78078 -59571 10955 41556 10247 30192 -4694 -35266 -37693 -56247 -67655 -55290
13053e5290J1894l0479J5519j7947q987J8773J1171J5871M7580k0000j5231j2041
$$ -55290 -43396 -73875 -58356 -76303 -85290 -66517 -55346 -39475 8105 -11895 -27126 -39167
13041c9167K2570L671j1066J4834K4719j5016j8342J3168J5670j8065k8907j14
$$ -39167 -16597 -12926 -23992 -9158 15561 545 -17797 -4629 11041 -7024 -35931 -36045
13029c6045K6994J2448n919K5453p425j0658j858N578j5478j0217o070M495j0153
$$ -36045 -9051 3397 -2522 22931 15506 4848 2990 8568 -6910 -17127 -23197 -18702 -28855
13016b8855N4386K6848j6388j5230L290J902j0335n2116m7711L1354N0329k6310
$$ -28855 25531 52379 35991 20761 24051 25953 15618 -36498 -84209 -52855 -2526 -28836
13004b8836K5681M6352J7762R048m6259l0628J5919J3374L2221N209j8016p943
$$ -28836 -3155 43197 60959 70007 23748 -6880 9039 22413 54634 59843 41827 33884
12992C3884j1541k5061l0448k9083M4921O2685J5303M550l2255m5742k960K2018
$$ 33884 22343 -2718 -33166 -62249 -17328 45357 60660 65210 32955 -12787 -15747 6271
12980F271J3833K0785K0051k6093m2926J1415q987j4011J7938N5919k5945m9679
$$ 6271 20104 40889 60940 34847 -8079 3336 -5651 -19662 -1724 54195 28250 -21429
12968b1429k7473M161M9888L1890k7056j5550K638K5496J4844m7762k6032J8162
$$ -21429 -48902 -44741 5147 37037 9981 -5569 -2931 22565 37409 -10353 -36385 -18223
12956a8223K6510j5774k1260l2478N1533L2232j8261l3449j4032L1760P957L036
$$ -18223 8287 -7487 -28747 -61225 -9692 22540 4279 -29170 -43202 -11442 -3485 -449
12944d49M169k0672j9971J7831L552k4486L4371K2031Q157P927J2352j4417k4857
$$ -449 3720 -16952 -36923 -19092 -15540 -40026 -5655 16376 24533 32460 44812 30395 5538
12931E538k8254k6653P266M7493L481J401R446J9839j0905J4724N344l1462P574
$$ 5538 -22716 -49369 -42103 5390 8871 10272 19718 39557 28652 43376 48720 17258 24832
12918B4832J4257J3374k0610m5708p940J5830K2522M1970K0847j7963l4591p137
$$ 24832 39089 52463 31853 -13855 -21795 -5965 16557 58527 79374 61411 26820 19683
12906A9683j433l6930M4081L8648j9684J3212r214k013j7321l1041n0840K144
$$ 19683 18250 -18680 25401 64049 44365 57577 48363 46350 29029 -2012 -52852 -50708
12894e0708P7322J9454K677m5016m7678J2451M063k5591K5220L1303K0562k3637
$$ -50708 26614 46068 48745 3729 -43949 -31498 -27435 -53026 -27806 3497 24059 422
12882D22n657M26L5665J2883P567R314J6137L4559O8834k1785n8159m9949p615
$$ 422 -5235 -4809 30856 43739 51306 60620 76757 111316 180150 158365 100206 50257 42642
12869D2642J5797L3458j9243j9549P481j3290l4859l0728r58J2038k2396k3955
$$ 42642 58439 91897 72654 53105 60586 47296 12437 -18291 -19249 -7211 -29607 -53562
12857e3562N7193q457k2126j866m092M7807N3239J4800k1548n2517k3787n817
$$ -53562 3631 -4826 -26952 -28818 -32910 14897 68136 82936 61388 8871 -14916 -20733
12845b0733j7884J2584K6510O486p804k5362J7227M3388K586r887N04j8438o821
$$ -20733 -38617 -26033 477 6963 -841 -26203 -8976 34412 36998 27111 27615 9177 2356
12832B356K6000k4776m9253j742J8085K3862L4669q733k6160P929j1348l504K7104
$$ 2356 28356 3580 -45673 -47415 -29330 -5468 29201 20468 -5692 2237 -9111 -12615 14489
12819A4489j0903R902n67j4928K2409N960j7284k9284j511J2359J757J0727j641
$$ 14489 3586 13488 12921 -2007 20402 26362 9078 -20206 -21717 -9358 -7601 3126 1485
12806A485L705j2553M852l8603l8872J6233L2419P1907M8752j9498m0588l2091
$$ 1485 5190 -7363 -2511 -41114 -79986 -63753 -31334 40573 89325 69827 29239 -2852
12794b852j5068j5266Q267O284J9360J6848M172j9097Q165k9002J542J6351j5049
$$ -2852 -17920 -33186 -24919 -18635 725 17573 21745 2648 10813 -18189 -16647 -296 -15345
12781a5345k1509j2053J0763l9488O380L1349J4963P838K3716j1731K6827j9732
$$ -15345 -36854 -48907 -38144 -77632 -71252 -39903 -24940 -17102 6614 -5117 21710 1978
12769A978j023K266K2321K691k088j5391j0736k0822l2737P85M0385L4022j5285
$$ 1978 955 3221 25542 28233 26145 10754 18 -20804 -53541 -52756 -12371 21651 6366
12756F366k6240Q372J8392r704j2358K0949J2499J4472L0837M7686K667l2573
$$ 6366 -19874 -11502 6890 -2814 -15172 5777 18276 32748 63585 111271 113938 81365
12744H1365k5878Q482q275l380J9217n977O257o373j2542n654J1946p800l0275
$$ 81365 55487 63969 55694 52314 71531 65554 71811 65438 52896 47242 59188 51388 21113
12731B1113J6276k0993q877Q309J8899R115j7684k1843J308k1350P802l0191l3271
$$ 21113 37389 16396 7519 15828 34727 43842 26158 4315 5623 -15727 -7925 -38116 -71387
12718g1387O138K5770L8904L7897n827m6715n3494K8731K4429k0266J9303J8596
$$ -71387 -65249 -39479 -575 37322 31495 -15220 -68714 -39983 -15554 -35820 -16517 2079
12706B079N270j4748j6296N2787P927j3451L440l1948L86J3253q432Q503m3514
$$ 2079 7349 -7399 -23695 29092 37019 23568 27008 -4940 -4554 8699 267 8770 -34744
12693c4744K1909j652m9613j9837K7787J8954J1961M371l2999j1293L3772L9101
$$ -34744 -12835 -14487 -64100 -83937 -56150 -37196 -25235 -20864 -53863 -65156 -31384 7717
12681G717k681j5347J4076j5159J6226L668m1210l0478j0367M2654M0350J9918
$$ 7717 5036 -10311 3765 -11394 4832 8500 -32710 -63188 -73555 -30901 9449 29367
12669B9367J0239k5293j9837j7218j9389k7696J6748L50L8445R976j1447J726
$$ 29367 39606 14313 -5524 -22742 -42131 -69827 -53079 -52729 -14284 -4308 -15755 -14029
12657a4029j4669K4803k3831P745J4421m674J801L922J7591j504k850K202k3088
$$ -14029 -28698 -3895 -27726 -19981 -5560 -10234 -8433 -4511 13080 11576 8726 10928 -12160
12644a2160j4300k6234M6696R607l4720R967n518P797K3898m4602j6672q485N018
$$ -12160 -26460 -52694 -5998 3609 -31111 -21144 -26662 -18865 5033 -39569 -56241 -64726 -59708
12631e9708j53J8317k998O203M0073K3399k0558J2556L7815m939o5013j2322R279
$$ -59708 -59861 -41544 -44542 -38339 1734 25133 4575 17131 54946 50007 -15006 -27328 -18049
12618a8049K3432K3963j5263J5388Q165l9790k8804l5603o414J5108J8708O5512
$$ -18049 5383 29346 14083 29471 37636 -2154 -30958 -66561 -72975 -57867 -39159 26353
12606B6353J2100P939L4710n31j1886m0267l6500J2226k6059J3044J2593J0873
$$ 26353 38453 46392 81102 80571 68685 28418 -8082 4144 -21915 -8871 3722 14595
12594A4595J7192j300j4501L27J4597k4266k6174K5106k1977N2934M1654J2542
$$ 14595 31787 30487 15986 16313 30910 6644 -19530 5576 -16401 36533 78187 90729
12582I0729l0197j6063n245j3663Q337N147l3516O829j4158j9575j8486L123o47
$$ 90729 60532 44469 39224 25561 33898 39045 5529 12358 -1800 -21375 -39861 -36738 -37385
12569c7385R972M0256k4490J283l7959M9515J8657R42l4783P771k5267o761K7795
$$ -37385 -27413 12843 -11647 -10364 -48323 1192 19849 20791 -13992 -6221 -31488 -38249 -10454
12556a0454J1704l980n695L3868j9800n1274L038M3587R204j3425R838l1519j1949
$$ -10454 1250 -2730 -8425 25443 5643 -45631 -42593 994 10198 -3227 6611 -24908 -36857
12543c6857M635L3739J3182m5559j4588J3830L5191l27P633j0663n5834j5182
$$ -36857 -32222 1517 14699 -30860 -45448 -31618 3573 3246 10879 216 -55618 -70800
12531g0800q589L4342K9144J0882k011O090j50j4767l893P20j0445K4535O393
$$ -70800 -79389 -45047 -15903 -5021 -7032 -942 -1092 -15859 -19752 -19032 -29477 -4942 1451
12518A451j897M2337J3886k3314k5184j8988L5111P240J510O68k6188m86Q590
$$ 1451 -446 41891 55777 32463 7279 -11709 23402 30642 32152 32820 6632 6146 14736
12505A4736M061N995N12J8410q281j0257r320P55j1099Q028j7922j1422M465L8835
$$ 14736 18797 24792 25304 43714 35433 25176 15856 16611 5512 13540 -4382 -15804 -11339 27496
12491B7496k0932k1182o366p950L985R878l1869m1545L0916L9042M9823q636R471
$$ 27496 6564 -14618 -20984 -28934 -24949 -15071 -46940 -88485 -57569 -18527 31296 22660 32131
12478C2131j1184l7438J0859J3292j6788P568l92L9075K7031l9914J2062K6950
$$ 32131 20947 -16491 -5632 7660 -9128 -1560 -1952 37123 64154 24240 36302 63252
12466F3252J198K5472l4965r65j5908n5914o837J6936M1808J2988l0783j5278
$$ 63252 64450 89922 54957 53992 38084 -17830 -24667 -7731 34077 47065 16282 1004
12454A004R009j4484k7326N408K7482O421k6633k1669L7416O0387K766k1272m9753
$$ 1004 10013 -4471 -31797 -26389 1093 7514 -19119 -40788 -3372 57015 59781 38509 -11244
12441a1244n0366j1487L8270O3691j476m7121k8110K0231J530k2130L3435Q886
$$ -11244 -61610 -73097 -34827 28864 27388 -19733 -47843 -27612 -26082 -48212 -14777 -5891
12429e891K275Q44J0450J9139J0916J3035n3750p174k572l4548j778N53Q017k943
$$ -5891 -3616 -2772 7678 26817 37733 50768 -2982 -10156 -12728 -47276 -49054 -48501 -40484 -43427
12415d3427J3822K7749N263l9733j3853P425M4696J3010N50K589K7945J3100l2620
$$ -43427 -29605 -1856 3407 -36326 -50179 -42754 1942 14952 15502 18091 46036 59136 26516
12402B6516l2675J1877K8109k4693j3653l2337n309L576j6700N998K0993k1335
$$ 26516 -6159 5718 33827 9134 -4519 -36856 -42165 -38589 -55289 -49291 -28298 -49633
12390d9633K6084L675o793M60J5263L3258k0895j5327K8429j8595M426O996R184
$$ -49633 -23549 -19874 -26667 -26207 -10944 22314 1419 -13908 14521 -4074 352 7348 16532
12377A6532J9269N30J2786m284k9958m221N710j0200j3769J677M5553J6520k5682
$$ 16532 35801 36331 49117 44833 14875 10654 16364 6164 -7605 -5928 39625 56145 30463
12364C0463l0986J2060k5958n6676o893Q739J3599N2145J8770n3636n503M50k9200
$$ 30463 -523 11537 -14421 -71097 -77990 -69251 -55652 -3507 15263 -38373 -43876 -43426 -72626
12351g2626R09M2014K6659l083l3059k2690L4915j7464N7858K1447j71J3103l067
$$ -72626 -71717 -29703 -3044 -6127 -39186 -61876 -26961 -44425 13433 34880 34709 47812 44745
12338D4745J41o264j7069k4942K8079P646m8016p403K8877P992K9801l7812m1982
$$ 44745 44886 38622 21553 -3389 24690 32336 -15680 -23083 5794 13786 43587 5775 -36207
12325c6207L2527J9477l1694k8288K8870L2636q932L4972L183k7927l4647k5012
$$ -36207 -3680 15797 -15897 -44185 -15315 17321 8389 43361 46544 18617 -16030 -41042
12313d1042m557O046J0361j8046J9195P162q266J3611J4728Q38j1122K7995J3608
$$ -41042 -45599 -39553 -29192 -47238 -28043 -20881 -29147 -15536 -808 30 -11092 16903 30511
12300C0511r682q332o50k3543L6695N1037r548k6626l4404k1092N78K650L1962
$$ 30511 20829 12497 11847 -11696 24999 76036 66488 39862 5458 -15634 -15056 -12406 19556
12287A9556q516j627J2642K4725P859r973p701R3K2640k3920r297K3854o713l6643
$$ 19556 11040 9413 22055 46780 54639 44666 36965 37058 59698 35778 26481 50335 43622 6979
12273F979k5000J5978J1836k2153k2917J6722L5600N0226j8023l3764j5400j1144
$$ 6979 -18021 -2043 9793 -12360 -35277 -18555 17045 67271 49248 15484 84 -11060
12261a1060J7393l965K940K38K364L093j3829r455l6842J6171J4323m385K6786
$$ -11060 6333 2368 5308 5546 7910 11003 -2826 -12281 -49123 -32952 -18629 -23014 3772
12248C772o0010J4369O1461M0124l8052m2502l0551K3415Q110K0720J0973j4656
$$ 3772 -56238 -41869 19592 59716 21664 -20838 -51389 -27974 -19864 856 11829 -2827
12236b827p078m424J9675L612J1301l3595o2919J6390K1073J4181r096k4157L0685
$$ -2827 -9905 -14329 5346 8958 20259 -13336 -76255 -59865 -38792 -24611 -33707 -57864 -27179
12223b7179k7429l7347N883K761n278Q473L965J1518M0414J5477j3401j3313m323
$$ -27179 -54608 -91955 -86072 -83311 -88589 -80116 -76151 -64633 -24219 -8742 -22143 -35456 -39779
12210c9779k793N1641N4967M1110k5612l175j0432j7824l9709n778q537J61k1877
$$ -39779 -42572 9069 64036 105146 79534 76359 65927 48103 8394 2616 -5921 -5760 -27637
12197b7637L1729J6308L124l3936J9465K8886L1828K6662n2609n7391k5016k0836
$$ -27637 4092 20400 23524 -10412 9053 37939 69767 96429 43820 -13571 -38587 -59423
12185e9423Q213M4602J5804j6946J461p158J2844N798L0816o8218l8721J2693
$$ -59423 -51210 -6608 9196 -7750 -6289 -13447 -603 5195 36011 -32207 -70928 -58235
12173e8235L2775K8368O163j7065o49k9527n0860j6817J3573K5452M1134M3143
$$ -58235 -25460 2908 9071 -7994 -8643 -38170 -89030 -105847 -92274 -66822 -25688 17455
12161A7455J3516l2992k7456M458o01K7308o09K0233P367k4689j9119k5551j2447
$$ 17455 30971 -2021 -29477 -25019 -25620 1688 1079 21312 28679 3990 -15129 -40680 -53127
12148e3127N442L648j3666J0801o181J6455M1821J6012m1520k9031L545k5362
$$ -53127 -47685 -44037 -57703 -46902 -53083 -36628 5193 21205 -20315 -49346 -45801 -71163
12136g1163L5750M3537J0027N767M274r024j5064J5367r891j4269r312k5779j4591
$$ -71163 -35413 8124 18151 23918 28192 19168 4104 19471 9580 -4689 -14001 -39780 -54371
12123e4371N267J2206N912O863O5000k4029j6022K784L464J7235K3359L278Q384
$$ -54371 -49104 -36898 -30986 -24123 40877 16848 826 3610 7074 24309 47668 50946 59330
12110E9330Q45l4254o939l0757j6284R16J9656J6082J546j0537k1562M0268K1868
$$ 59330 60175 25921 18982 -11775 -28059 -27143 -7487 8595 10141 -396 -21958 18310 40178
12097D0178k9138J040l766j9839k8207J9728J4134l946r492K2208q001j6259K3185
$$ 40178 11040 12080 8314 -11525 -39732 -20004 -5870 -9816 -19308 2900 -5101 -21360 1825
12084A825J8622K9410l6231l3651j5904M504q862J1392O1565J402k5127k99q575
$$ 1825 20447 49857 13626 -20025 -35929 -31425 -40287 -28895 32670 34072 8945 8646 71
12071G1J6441k4082j7821K7368k8531O529j8813J0038K00N476m4M7353L9052k2356
$$ 71 16512 -7570 -25391 1977 -26554 -20025 -38838 -28800 -28600 -23124 -23168 24185 63237 40881
12057D0881j2265K2913k6496k7467J4218M1866l1342j0057l198J4599K0370M0459
$$ 40881 28616 51529 25033 -2434 11784 53650 22308 12251 9053 23652 44022 84481
12045H4481M971o4336m5869L4053L5279j9228q225k2756K798J8964M3665j7129
$$ 84481 89452 25116 -20753 13300 48579 29351 21126 -1630 1168 20132 63797 46668
12033D6668j4234K9309j6671k7698q573j269k0144n5845m566N0777j2098M550
$$ 46668 32434 61743 45072 17374 8801 7532 -12612 -68457 -73023 -22246 -34344 -29794
12021b9794Q4o0352J0068J1921l3K4441J6878j6252J983K353J1113l730j4463
$$ -29794 -29710 -90062 -79994 -68073 -68106 -43665 -26787 -43039 -41056 -38703 -27590 -31320 -45783
12008d5783Q648K0595K7621K048J1851J2567M3836k8850Q920J8625k7706j3739
$$ -45783 -37135 -16540 11081 13129 24980 37547 81383 52533 61453 80078 52372 38633
11996C8633m6332m257n411k1725j639K5369P960k5206J4350J6527l0372k7178
$$ 38633 -7699 -11956 -17367 -39092 -40731 -15362 -7402 -32608 -18258 -1731 -32103 -59281
11984e9281L1980K4559k5973Q970K5501o472j1733k0362K8297L6146N949m8978
$$ -59281 -27301 -2742 -28715 -19745 5756 -716 -12449 -32811 -4514 31632 37581 -11397
11972a1397j1962J5184Q437l3500o0654N66K347k7926K4812N6205K484j3124j2027
$$ -11397 -23359 -8175 262 -33238 -93892 -93326 -90979 -118905 -94093 -37888 -35404 -48528 -60555
11959f0555M6350J5523j5383J4417J4517p303K9561j7631j6017j0649J390j3468
$$ -60555 -14205 1318 -14065 352 14869 7566 37127 19496 3479 -7170 -5780 -19248
11947a9248J4197P924O38l7952l4987K766K3825K495r485p111K4398J0917J4197
$$ -19248 -5051 2873 3511 -34441 -69428 -66662 -42837 -40342 -49827 -56938 -32540 -21623 -7426
11934g426j7106j9057l286k291J8888R898o55J2738J3266k1365j6128j8542P823
$$ -7426 -24532 -43589 -46875 -49166 -30278 -20380 -21035 -8297 4969 -16396 -32524 -51066 -43243
11921d3243j0R721L717M6002j3591n464N548J2215K6799K7427M825m7407m5217
$$ -43243 -43253 -33532 -29815 16187 2596 -2868 2680 14895 41694 69121 73946 26539 -18678
11908a8678k4994l975L9119K0719m1819j2174P959P6529M8516J0243j0112l3004
$$ -18678 -43672 -47647 -8528 12191 -29628 -41802 -33843 42686 91202 101445 91333 58329
11896E8329L883r460j432k9879r809k213j1325K531k6167J0354J2816k201k0722
$$ 58329 62212 52752 51320 21441 11632 9419 -1906 625 -25542 -15188 -2372 -4573 -25295
11883b5295k8576K078l2468M818j1841L1117K1960j7167L261q918M419l5026n866
$$ -25295 -53871 -51793 -84261 -79443 -91284 -60167 -38207 -55374 -52113 -61031 -56612 -91638 -97504
11870i7504M963L3774l546Q624M4579L8546M514K759k4800j5422K9976J4978j2379
$$ -97504 -92541 -58767 -62313 -53689 -9110 29436 33950 36709 11909 -3513 26463 41441 29062
11857B9062P625j842m2849Q636J2412J9276J5129l8593m2340J2262j9308L0453
$$ 29062 36687 34845 -8004 632 13044 32320 47449 8856 -33484 -21222 -40530 -10077
11845a0077L1452k544J5618J0332k1617l9042N367L0147J4486m107K297N349l1073
$$ -10077 21375 18831 34449 44781 23164 -15878 -10511 19636 34122 30015 32312 37661 6588
11832F588k0808O134m0889p94P979j7878N2718N702j5017M2680k4714p446J9201
$$ 6588 -14220 -8086 -48975 -49769 -41790 -59668 -6950 -1248 -16265 26415 1701 -5745 13456
11819A3456K6731R248j7579j4588J434l1045j1275l379K4270j784J4230K516K7224
$$ 13456 40187 49435 31856 17268 18702 -12343 -23618 -26997 -2727 -4511 9719 12235 39459
11806C9459n144N70n018k7408l1505L998m344k1111J3066p790l736J5887J2569
$$ 39459 34315 34885 29867 2459 -29046 -25048 -29392 -50503 -37437 -45227 -48963 -33076 -20507
11793b0507k1252j5816N2489K9061k5047K2151O446m9280l5118O3331K1317O845
$$ -20507 -41759 -57575 -5086 23975 -1072 21079 27525 -21755 -56873 6458 27775 34620
11781C4620R881k3217l1765m742M2168L1991M777k5629j1637K3297M098K0305
$$ 34620 44501 21284 -10481 -15223 26945 58936 63713 38084 26447 49744 53842 74147
11769G4147j0837J2414J8156k3763j3799j4821k6249k1611J69M415r228l3105
$$ 74147 63310 75724 93880 70117 56318 41497 15248 -6363 -6194 -1779 -11007 -44112
11757d4112L7064J8896K190J0464J764n732r179J2559J9917m1029k9014n261J7442
$$ -44112 -7048 11848 14038 24502 26266 20534 11355 23914 43831 2802 -26212 -31473 -14031
11744a4031k4130l59L3213l830l7389l4151J9902L9596N181j1342n9906q287Q4034
$$ -14031 -38161 -38520 -5307 -9137 -46526 -80677 -60775 -21179 -15998 -27340 -87246 -95533 -11499
11731a1499J2426k7930M589L7484q234k5558L77j4766k8729J9447J7502j98j5776
$$ -11499 927 -27003 -22414 15070 6836 -18722 -18345 -33111 -61840 -42393 -24891 -25089 -40865
11718d0865q853J3397L3306M662j5542J7290j6379k4919Q3K8209L8802q964l1591
$$ -40865 -49718 -36321 -3015 1647 -13895 3395 -12984 -37903 -37820 -9611 29191 20227 -11364
11705a1364j3598J4190j4872n949K5230J5138m4590l4946Q267J6746j7005l2315
$$ -11364 -24962 -10772 -25644 -31593 -6363 8775 -35815 -70761 -62494 -45748 -62753 -95068
11693i5068n787K1856L8129K7511L4280K0286K6474l9126l3038j5538L2300k4944
$$ -95068 -100855 -78999 -40870 -13359 20921 41207 67681 28555 -4483 -20021 12279 -12665
11681a2665J3952K9521P647n9073p407J0414J0653J2348j5094j2036M832J9231
$$ -12665 1287 30808 38455 -20618 -28025 -17611 -6958 5390 -9704 -21740 -16908 2323
11669B323K4558L2975j0830l7095q736L3491p547m2370k7880J086m062J2187n697
$$ 2323 26881 59856 49026 11931 3195 36686 29139 -13231 -41111 -40025 -44087 -31900 -37597
$$ [...]
##END NTUPLES=NMR SPECTRUM
##END=
