##TITLE=Analysis number a0162654
Compound Code ac 11871
Book Reference a0162654
Project Code qc-fl flro3
Chemist Name jom
##JCAMPDX= 6.0         $$ Bruker NMR JCAMP-DX V2.0
##DATA TYPE= NMR SPECTRUM
##DATA CLASS= NTUPLES
##ORIGIN= Bruker BioSpin GmbH
##OWNER= nmr
$$ XWIN-NMR		Version 3.5
$$ Wed Apr 11 17:08:35 2007 GMT Daylight Time (UT+1h)  MAYBRIDGE\nmr@NMR_250MHZ
##.OBSERVE FREQUENCY= 250.131544655141
##.OBSERVE NUCLEUS= ^1H
##.ACQUISITION MODE= SIMULTANEOUS (DQD)
##.ACQUISITION SCHEME= undefined
##.AVERAGES= 16
##.DIGITISER RES= 18
##SPECTROMETER/DATA SYSTEM= dpx250
##.PULSE SEQUENCE= zg30
##.SOLVENT NAME= CDCl3
##.SHIFT REFERENCE= (INTERNAL, CDCl3, 0, 16.522)
##AUDIT TRAIL= $$ (NUMBER, WHEN, WHO, WHERE, WHAT)
$$ ##TITLE= Audit trail, XWIN-NMR		Version 3.5
$$ ##JCAMPDX= 5.01
$$ ##ORIGIN= Bruker BioSpin GmbH
$$ ##OWNER= nmr
$$ C:\u/data/dgb/nmr/ADRS/1080/pdata/1/auditp.txt
$$ ##AUDIT TRAIL=  $$ (NUMBER, WHEN, WHO, WHERE, WHAT)
(   1,<2007-04-11 17:08:13.22 +100>,<MAYBRIDGE\nmr>,<NMR_250MHZ>,
      <created by zg, POWCHK disabled, PULCHK disabled
       configuration hash MD5:
       49 4B E0 1D 92 C2 6B 37 9F E6 65 BC 52 41 86 1D
       data hash MD5: 64K
       49 04 12 20 F4 1D 18 98 F5 88 F0 AB 32 7E C2 8C>)
(   2,<2007-04-11 17:08:25.86 +100>,<MAYBRIDGE\nmr>,<NMR_250MHZ>,
      <Start of raw data processing
       ef LB = 0.3 FT_mod = 6 PKNL = 1 SI = 32K 
       data hash MD5: 32K
       2F 97 66 9B 8A 07 C2 30 AC A9 79 15 11 13 D6 67>)
(   3,<2007-04-11 17:08:27.52 +100>,<MAYBRIDGE\nmr>,<NMR_250MHZ>,
      <apk 
       data hash MD5: 32K
       E9 09 ED D8 5D DD E7 25 0A 5D 23 AF F0 91 13 74>)
(   4,<2007-04-11 17:08:28.31 +100>,<MAYBRIDGE\nmr>,<NMR_250MHZ>,
      <abs ABSG = 5 
       data hash MD5: 32K
       4B 5B AA DB 79 EC F3 75 26 B4 4B 4F 3A B9 6B C6>)
$$ ##END=
$$ 
$$ hash MD5
$$ FD 53 F1 52 FB 03 35 31 F7 1A 24 00 9B 7D FF 55
##$RELAX= 
##$RELAX= 
##$RELAX= 
##$RELAX= 
##$RELAX= 
##$RELAX= 
##$RELAX= 
$$ Bruker specific parameters
$$ --------------------------
##$DU= <C:\u>
##$EXPNO= 1080
##$NAME= <ADRS>
##$PROCNO= 1
##$TYPE= <nmr>
##$USER= <dgb>
##$AMP= (0..31)
100 100 100 100 100 100 100 100 100 100 100 100 100 100 100 100 100 100 
100 100 100 100 100 100 100 100 100 100 100 100 100 100 
##$AQSEQ= 0
##$AQ_mod= 3
##$AUNM= <au_zg>
##$AUTOPOS= <48 >
##$BF1= 250.13
##$BF2= 250.13
##$BF3= 250.13
##$BF4= 250.13
##$BF5= 500.13
##$BF6= 500.13
##$BF7= 500.13
##$BF8= 500.13
##$BYTORDA= 1
##$CFDGTYP= 0
##$CFRGTYP= 5
##$CHEMSTR= <none>
##$CNST= (0..31)
1 1 145 1 1 1 1 1 1 1 1 1 1 1 1 1 1 1 1 1 1 1 1 1 1 1 1 1 1 1 1 1 
##$CPDPRG= <>
##$CPDPRG1= <>
##$CPDPRG2= <>
##$CPDPRG3= <>
##$CPDPRG4= <mlev>
##$CPDPRG5= <mlev>
##$CPDPRG6= <mlev>
##$CPDPRG7= <mlev>
##$CPDPRG8= <mlev>
##$CPDPRGB= <>
##$CPDPRGT= <>
##$D= (0..31)
0 1 0 0 0 0 0 0 0 0.06 0 0 0 0 0 0 0.0002 0 0 0 0 0 0 0 0 0 0 0 0 0 0 
0 
##$DATE= 1176307692
##$DBL= (0..7)
120 120 120 120 120 120 120 120 
##$DBP= (0..7)
150 150 150 150 150 150 150 150 
##$DBP07= 0
##$DBPNAM0= <>
$$ [...]
##$SUBNAM7= <"">
##$SUBNAM8= <"">
##$SUBNAM9= <"">
##$SW= 20.6930455092707
##$SWIBOX= (0..15)
0 0 3 0 0 0 0 0 0 0 0 0 0 0 0 0 
##$SW_h= 5175.983436853
##$TD= 65536
##$TD0= 1
##$TE= 683.16
##$TE2= 300
##$TE3= 300
##$TEG= 300
##$TL= (0..7)
0 120 120 120 120 120 120 120 
##$TP= (0..7)
150 150 150 150 150 150 150 150 
##$TP07= 0
##$TPNAME0= <>
##$TPNAME1= <>
##$TPNAME2= <>
##$TPNAME3= <>
##$TPNAME4= <>
##$TPNAME5= <>
##$TPNAME6= <>
##$TPNAME7= <>
##$TPOAL= (0..7)
0.5 0.5 0.5 0.5 0.5 0.5 0.5 0.5 
##$TPOFFS= (0..7)
0 0 0 0 0 0 0 0 
##$TUNHIN= 0
##$TUNHOUT= 0
##$TUNXOUT= 0
##$USERA1= <user>
##$USERA2= <user>
##$USERA3= <user>
##$USERA4= <user>
##$USERA5= <user>
##$V9= 5
##$VALIST= <valist>
##$VCLIST= <CCCCCCCCCCCCCCC>
##$VD= 0
##$VDLIST= <DDDDDDDDDDDDDDD>
##$VPLIST= <PPPPPPPPPPPPPPP>
##$VTLIST= <TTTTTTTTTTTTTTT>
##$WBST= 1024
##$WBSW= 4
##$XGAIN= (0..3)
0 0 0 0 
##$XL= 0
##$YL= 0
##$YMAX_a= 322391
##$YMIN_a= -431967
##$ZGOPTNS= <>
##$ZL1= 120
##$ZL2= 120
##$ZL3= 120
##$ZL4= 120
##$ABSF1= 16.522
##$ABSF2= -4.171173
##$ABSG= 5
##$ABSL= 3
##$ALPHA= 0
##$AQORDER= 0
##$ASSFAC= 0
##$ASSFACI= 0
##$ASSFACX= 0
##$ASSWID= 0
##$AUNMP= <proc_1d>
##$AZFE= 0.1
##$AZFW= 0.1
##$BCFW= 0
##$BC_mod= 0
##$BYTORDP= 0
##$COROFFS= 0
##$CY= 12.5
##$DATMOD= 1
##$DC= 0
##$DFILT= <>
##$DTYPP= 0
##$F1P= 14.0000005364418
##$F2P= -0.99999901652339
##$FCOR= 0.5
##$FTSIZE= 32768
##$FT_mod= 6
##$GAMMA= 0
##$GB= 0
##$INTBC= 1
##$INTSCL= 1
##$ISEN= 128
##$LB= 0.3
##$LEV0= 0
##$LPBIN= 0
##$MAXI= 10000
##$MC2= 0
##$MEAN= 0
##$ME_mod= 0
##$MI= 0
##$NCOEF= 0
##$NC_proc= -4
##$NLEV= 6
##$NOISF1= 0
##$NOISF2= 0
##$NSP= 0
##$NTH_PI= 0
##$NZP= 0
##$OFFSET= 16.522
##$PC= 1
##$PHC0= 231.8703
##$PHC1= 3.820247
##$PH_mod= 1
##$PKNL= yes
##$PPARMOD= 0
##$PSCAL= 4
##$PSIGN= 0
##$REVERSE= no
##$SF= 250.13
##$SI= 32768
##$SIGF1= 0
##$SIGF2= 0
##$SINO= 400
##$SIOLD= 32768
##$SREGLST= <1H.CDCl3>
##$SSB= 0
##$STSI= 32768
##$STSR= 0
##$SW_p= 5175.98343685301
##$SYMM= 0
##$S_DEV= 0
##$TDeff= 65536
##$TDoff= 0
##$TI= <Analysis number 999999
Compound Code 99
Book Reference 9
Project Code 9>
##$TILT= no
##$TM1= 0
##$TM2= 0
##$TOPLEV= 0
##$USERP1= <user>
##$USERP2= <user>
##$USERP3= <user>
##$USERP4= <user>
##$USERP5= <user>
##$WDW= 1
##$XDIM= 32768
##$YMAX_p= 491843445
##$YMIN_p= -100936
$$ End of Bruker specific parameters
$$ ---------------------------------
##NTUPLES= NMR SPECTRUM
##VAR_NAME=  FREQUENCY,     SPECTRUM/REAL,   SPECTRUM/IMAG
##SYMBOL=    X,             R,               I
##VAR_TYPE=  INDEPENDENT,   DEPENDENT,       DEPENDENT
##VAR_FORM=  AFFN,          ASDF,            ASDF
##VAR_DIM=   32768,         32768,           32768
##UNITS=     HZ,            ARBITRARY UNITS, ARBITRARY UNITS
##FACTOR=    0.157963299565203, 1,           1
##FIRST=     4132.6476996994, 0,             0
##LAST=      -1043.33573715361, 0,           0
##MIN=       -1043.33573715361, -100936,     0
##MAX=       4132.6476996994, 491843445,     0
$$ Real data points
##PAGE= N=1
##DATA TABLE= (X++(R..R)), XYDATA
$$ [...]
15953E911j9441j2748Q435q844R036J0711J018J0022K4891m949n146l608l807
15940A1481j1597J2893K9902O193k2602M119K0259q97j8031m2537k95Q034J6614
15927A3536p143l2479M11M1634J8385l8422j0153M566K4315k764J2513J775j3311
15914A2863j2744R77J1378K7812Q324j7194J2208r588j7526m799o888J9356K5709
15901D9888k7061k8681o169K6254K2054j9016n398p388l262R36J3369j195O217
15888B0548R801o326n404m205k5260O650l616J6774K1856k1730j1467O120k0991
15875a7250o369j9424r407K1621J0959r132j401J7758J3058J9176o495J7061j9579
15862A0576M054k393k3942n630o949K431n886J0351n145K136M0559K2581k7706
$$ plain form
15953 5911 -13530 -26278 -17843 -26687 -17651 -6940 -5922 4100 28991 24042 18896 15288 11481
15940 11481 -116 12777 42679 48872 26270 30389 50648 49751 31720 -10817 -11112 -3078 13536
15927 13536 6393 -26086 -25675 15959 34344 -4078 -14231 -9665 14650 11886 24399 26174 12863
15914 12863 119 1096 12474 40286 48610 31416 43624 34036 16510 11711 4823 24179 49888
15901 49888 22827 -5854 -12023 14231 36285 17269 11871 4483 1221 2157 15526 14331 20548
15888 20548 30349 24023 18619 14414 -10846 -4196 -7812 8962 30818 9088 -2379 3741 -17250
15875 -17250 -23619 -43043 -52450 -30829 -19870 -29002 -30403 -12645 413 19589 13094 30155 10576
15862 10576 14630 12237 -11705 -17335 -24284 -21853 -27739 -17388 -22533 -20397 20162 42743 15037
15849A5037j6600j0395p794P743O468L4473J0887m4199j4715n321P77J949J4661
15836g029J4007l8968k166J5800k2159R551j1979R158j2520L0997J1914R813K339
15823H758j5454k1249J1595P37r79J3140K1456O932n3387L141K0001J4904K497
15810A2092m1261J707K9477O779J49j6077l0586J4782P413k016K1855K2727K8894
15797E5935j3118j455q754r011k2506O407O262l1628l2744j0525K0940K2108K7963
15784I874M1649j4711o034m3459j078K0014J2299k4224j2310P828j330J1428K6648
15771B6594J5043k065p690k0040j580j9679k2507l891J07K2062O285J4359j4481
15758g483q924O423o665j402J5806J8535j8820l0392Q319N865K7991J9808k6940
$$ plain form
15849 15037 -1563 -11958 -19752 -12009 -5541 28932 39819 -4380 -19095 -24416 -23639 -21690 -7029
15836 -7029 6978 -31990 -34156 -18356 -40515 -30964 -42943 -33785 -46305 -15308 -3394 6419 8758
15823 8758 -6696 -27945 -16350 -15613 -16592 -3452 18004 24936 -28451 -25310 -5309 9595 12092
15810 12092 -29169 -27462 2015 8794 8943 -7134 -37720 -22938 -15525 -17541 4314 27041 55935
15797 55935 42817 41362 32608 23597 1091 7498 13760 -17868 -50612 -61137 -40197 -18089 9874
15784 9874 51523 36812 30778 -12681 -13759 6255 18554 -5670 -17980 -10152 -11482 -54 26594
15771 26594 41637 39572 31882 11842 10262 -9417 -31924 -35815 -35708 -13646 -7361 6998 -7483
15758 -7483 -16407 -9984 -16649 -18051 -2245 16290 -2530 -32922 -24603 -18738 9253 29061 2121
15745B121k4502k5719K4946M7519J2954k0961L305J7910L2109j0305n1091j2897
15733d611k2587l569J7053K9478Q002j3205j9906Q467J0918J1133o201R213k0060
15720D125l156K748K1279j1693J8543J5015J8107k2040k6725j2451p804j9589
15708b3641J3536L7160P205j9013Q224J3429K3973j3238j4613N278j1508Q470
15696C5262k4963r741O788j4733r725Q902j6390N024J4238J5794K4722j7939k4206
15683f967k5046Q608M451r668K1156m034l5949J322q079N789J7379O745J550K7955
15669E212j3857J7013L656K1257j4507l1628j7428j300M822Q178J1388k0774j8810
15656d6778J5060J991k463J7043J3714n836J770p802M384J3786Q421j2910M997
$$ plain form
15745 2121 -22381 -48100 -23154 24365 37319 16358 19663 37573 69682 59377 8286 -4611
15733 -4611 -27198 -30767 -13714 15764 23766 10561 -9345 -878 10040 21173 14972 24185 4125
15720 4125 969 3717 24996 13303 31846 46861 64968 42928 16203 3752 -4052 -23641
15708 -23641 -10105 27055 34260 15247 23471 36900 60873 47635 33022 38300 26792 35262
15696 35262 10299 558 7346 -7387 -17112 -8210 -24600 -19576 -5338 10456 35178 17239 -6967
15683 -6967 -32013 -23405 -18954 -28622 -7466 -11500 -47449 -46127 -54206 -48417 -31038 -24293 -22743 5212
15669 5212 -8645 8368 12024 33281 18774 -12854 -30282 -31582 -26760 -18582 -7194 -27968 -46778
15656 -46778 -31718 -29727 -32190 -15147 -1433 -7269 -5499 -13301 -8917 4869 13290 380 5377
15643E377l330q206p458J3465O998K1020j2902k8356j6603L4249J6160L2771l482
15630D9703j7882j5885J589m073K1428r592k6693Q691p720o292p972K7J6073K4607
15616B6009O077J5854N84q784P39q641l797k3658J8988J5969M572k5490k6202
15603g780k1893J4644K0982j617j0131k2790o303L231K8864K3091J5478r235l1677
15590e136K9660Q034j1479q684k5260P891Q945Q239J0126M436R948j1008l8770
15577a3058J4496L9399K0542j1762j8108q694j9719j2410j313q52Q39K8829O634
15564B4823j9661o388j96P973o958P990J5325p435l359j1787j0558K1987k778
15551H978l7688R778L2432j4297l4644m202M3178R045k4517m214J7033P347r477
$$ plain form
15643 5377 2047 -6159 -13617 -152 6846 27866 14964 -13392 -29995 4254 20414 53185 49703
15630 49703 31821 15936 17525 13452 34880 25288 -1405 7286 -434 -6726 -14698 -14671 1402 26009
15616 26009 32086 47940 48524 39740 40479 31838 28041 4383 23371 39340 43912 18422 -7780
15603 -7780 -29673 -15029 5953 4336 -5795 -28585 -34888 -31657 -2793 20298 35776 26541 -5136
15590 -5136 24524 32558 21079 12395 -12865 -4974 3971 12210 22336 26772 36720 25712 -13058
15577 -13058 1438 40837 61379 49617 31509 22815 3096 -9314 -10627 -11479 -10640 18189 24823
15564 24823 5162 -1226 -1422 6551 -407 7583 22908 15473 12114 327 -10231 11756 8978
15551 8978 -28710 -18932 13500 -797 -35441 -39643 3535 12580 -11937 -16151 882 8229 -1248
15538a248j871k5607k1665P806K4862m436J0101K8020K2094j4228j2519p25l0880
15525b0296J6627j3584k5386j38N678K0297j10p577K1307J613Q890j477j6739
15512a0895k1109q526j3666K1293O356j5555K4366n042M297J9697J070l5266n296
15499c8276K9458k872k563k0335Q793K1702R154L087J3536J0155p713k6647O961
15486D440k528m690M478n158j0975R78R187j3413r960P1j3539j1478Q381J2083
15472c2123l751J025L1051L2566l3569l3118l3315K53N221K4542K2033k0331K5154
15459a4362k67m70j3149J7074Q89J0349j469N332j7296j9812J4612M107J89k2514
15445c6787l415J2525J4423j1J0562K2016J6602j3958p215k089K00K3151k0442
$$ plain form
15538 -1248 -3119 -28726 -50391 -42585 -17723 -22159 -12058 15962 38056 23828 11309 10584 -20296
15525 -20296 -3669 -17253 -42639 -42777 -37099 -16802 -16912 -24489 -3182 -1569 7321 5844 -10895
15512 -10895 -32004 -40530 -54196 -32903 -26547 -42102 -17736 -22778 -18481 1216 2286 -32980 -38276
15499 -38276 -8818 -11690 -14253 -34588 -25795 -4093 5061 8148 21684 31839 24126 -2521 4440
15486 4440 1912 -2778 1700 -3458 -14433 -13455 -4268 -17681 -27641 -27570 -41109 -52587 -44206 -32123
15472 -32123 -35874 -34849 -3798 28768 -4801 -37919 -71234 -70981 -65760 -41218 -19185 -39516 -14362
15459 -14362 -14629 -15099 -28248 -11174 -10285 64 -1405 3927 -13369 -33181 -18569 -14462 -14273 -36787
15445 -36787 -40202 -27677 -13254 -13265 -2703 19313 35915 21957 14742 12653 12853 36004 15562
15432A5562j1130N151J4977J4743m182o497n785N841l626r869L301K6406m0591
15419D301n5817J3681R586J8901K4045L879R320j3031k5877K382J9974q21Q26
15406A1349K457j7298P681P930J1032j175l6137j8101N055L345J8386j042n952
15393a2470j700J341J1899J5530j6873r247j1359K5478Q573k0923k7337l0921
15381f8009j341M020o136J8991M8751K0074k3433q292J780J232K827J3973p26
15368C711k6385J629J6669j832M527J3236J305J0449m515j4857k2292n61n577
15355b4493J0650P397K5337j797J0933o414j5603J2250K8263j7676k9724k0754
15343b1631j9655J6396kK5867J3730J0067P114J0146k4123J2748J1173r76J0593
$$ plain form
15432 15562 4432 9583 24560 39303 35121 28624 22839 28680 25054 15185 18486 44892 4301
15419 4301 -51516 -37835 -28249 -9348 14697 18576 27896 14865 -11012 -8630 11344 10523 11349
15406 11349 13806 -3492 4189 12119 23151 21976 -14161 -32262 -27207 -23862 -5476 -6518 -12470
15393 -12470 -14170 -12829 -930 14600 -2273 -11520 -22879 2599 11172 -9751 -37088 -68009
15381 -68009 -69350 -65330 -71466 -52475 -3724 16350 -7083 -15375 -13595 -12363 -9536 4437 3711
15368 3711 -22674 -21045 -4376 -6208 -1681 11555 12860 23309 18794 3937 -18355 -18916 -24493
15355 -24493 -13843 -6446 18891 17094 28027 21613 6010 18260 46523 28847 -877 -21631
15343 -21631 -41286 -24890 -24892 975 14705 24772 31886 42032 17909 30657 41830 40854 51447
15330E1447j4829j9971j0868q506o891p632j7535R19K2298J0034l1909n169J2596
15317b6016Q369K1525J2798j7863l0063R404M0127q3J8987K9464k1645l2511P139
15304A9632J4973j2697l2828j1652k67J8410l361l4300q245J3874m778J2347K0964
15291g928J0793k2500R354J3130k1580j3702K2491O497J3132m1723j0364L5795
15279f605Q212j5872j9138p950J0254k491j484K4734J0659J1855q194o866K011
15266h75m523j362L0476R114k0806j0531M655J1025o997M564J0Q550J6019j6693
15252B2626j4625J4017j2066m4662l479J6275L714r984l78R215R576O15L548k1087
15238b6695j0889K967R715r939M348J0325j1058p440Q384J2096R289j750m073
$$ plain form
15330 51447 36618 16647 5779 -2727 -9618 -17250 -34785 -33866 -11568 -1534 -33443 -38612 -26016
15317 -26016 -17647 3878 16676 -1187 -31250 -21846 18281 18198 37185 66649 45004 12493 19632
15304 19632 34605 21908 -10920 -22572 -22839 -4429 -7790 -42090 -50335 -36461 -41239 -28892 -7928
15291 -7928 2865 -19635 -10281 2849 -18731 -32433 -9942 -3445 9687 -32036 -42400 -6605
15279 -6605 1607 -14265 -33403 -41353 -31099 -33590 -35074 -10340 319 12174 3980 -2886 -875
15266 -875 -5398 -6760 23716 32830 12024 1493 6148 17173 10176 14740 14750 23300 39319 22626
15252 22626 8001 22018 9952 -34710 -38189 -21914 -18200 -28184 -28562 -19347 -9771 -9156 -5608 -26695
15238 -26695 -37584 -34617 -24902 -34841 -30493 -20168 -31226 -38666 -30282 -18186 -8897 -10647 -14720
15225a4720J0852J9444j1843k732L316j2335J5586N980k4535M276J3112k3061
15213a6660L753J8525K7014K2528j6304l594J6619K379l324j3204n5332k7934
15201d5534o213j4164r29K9112K4097R962J3676j2605J3881o423k4959n392J0640
15188a4851j1494M062J0295J2594r293k534K8864J1025K638p767j9500j9067j17
15175a5145j1250J8095j4503k95K4743M876k862j4382L1959J9885J2776l920j2257
15162C7720N459j8795j2551P274p234j3476J8650q405q811p229R421R545q480
15149C088R764J996J408k9469Q725N444k4178K6243L6676j719N565k1230j8038
15136D275k908J488J4207j0597K825R75l2142j6873L9809M210k6111K1041P720
$$ plain form
15225 -14720 -3868 15576 3733 1001 4317 -8018 7568 13548 -10987 -6711 6401 -16660
15213 -16660 -12907 5618 32632 55160 38856 35262 51881 54260 50936 37732 -17600 -45534
15201 -45534 -51747 -65911 -66840 -37728 -13631 -3669 10007 -2598 11283 4860 -20099 -25491 -14851
15188 -14851 -26345 -22283 -11988 606 -8687 -11221 17643 28668 31306 23539 4039 -15028 -15145
15175 -15145 -26395 -8300 -22803 -23098 1645 6521 3659 -10723 21236 41121 53897 49977 37720
15162 37720 43179 24384 11833 19107 11873 -1603 17047 8642 -169 -7398 2023 11568 3088
15149 3088 12852 14848 16256 -13213 -4488 956 -23222 3021 39697 37978 43543 22313 4275
15136 4275 1367 2855 17062 6465 9290 10265 -21877 -38750 1059 5269 -20842 199 7919
15123G919j1750k1684J7774N466J057J084P27q144O591J9316j5075k3796j5512
15110c6027M413J2194p628J1415k0992j730J5015j1184M980L1575K4810j5243
15098A1598j7562J4568j5090l2697L0193K3947l9856p161K1095K154P773P124
15086F086k229j3558j4450p468J5785J368J4987N962r731Q460R064n694m46k618
15072E518k80Q949P562L341Q700j3444k2576j1058k7221J3376L9768J7936j6482
15059A4089q672J082Q039L973K2628N589J816l224J9649j4640j5325k1107q892
15046E005J7197O165K174J1908P682J3005J769j5259o925k6373j8827O649N908
15033A0078J2155K4615j3180j8187P871j0715j2051L147L789j9018p945k453K0451
$$ plain form
15123 7919 -3831 -25515 -7741 -2275 -1218 -134 593 -7551 -960 18356 3281 -20515 -36027
15110 -36027 -31614 -19420 -27048 -15633 -36625 -38355 -23340 -34524 -29544 2031 26841 11598
15098 11598 -5964 8604 -6486 -39183 -8990 14957 -24899 -32060 -10965 -8811 -1038 6086
15086 6086 3857 -9701 -24151 -31619 -15834 -14466 521 6483 -3248 5212 14276 8582 8136 5518
15072 5518 5238 14187 21749 25090 33790 20346 -2230 -13288 -40509 -27133 12635 30571 14089
15059 14089 5417 6499 14538 18511 41139 46728 48544 45320 64969 50329 35004 13897 5005
15046 5005 22202 28367 30541 42449 50131 63136 64905 49646 42721 16348 -2479 4170 10078
15033 10078 22233 46848 33668 15481 23352 12637 586 3733 7522 -11496 -19441 -21894 -1443
15020a443J7812l551J0103J720j9346J3084J5614n666j3943j5523j8213j1544
15008c0896K9210J9799K7592j333k6486j6370L289L3647J6512j9273l6152k045
14996b506M1384J5289k0337k8108k1065k489K0643J6808l817K0530j3467r239
14984A3626l2537R341K4770K609R447r488j7210M618J0484Q748r777Q226J422
14971B4279N268p499j5034m628J7234P495K7360L76l2504N801J6020j736l6065
14958F367o96J99l6772n203K8059M412j8543J2869K1170J0556M0785J2569q800
14945F6972k1473l782j3550j2572P965j9871N794M100n914K5444L2298j6743l4289
14932A4379p180J9961R44l082k0764K5371j2741l5167K533R839j455J456J2482
$$ plain form
15020 -1443 16369 12818 22921 24641 5295 18379 33993 28327 14384 -1139 -19352 -30896
15008 -30896 -1686 18113 45705 44372 17886 1516 4805 38452 54964 35691 -461 -2506
14996 -2506 38878 54167 33830 5722 -15343 -17832 2811 19619 15802 36332 22865 13626
14984 13626 -18911 -9570 15200 17809 27256 17768 558 5176 15660 24408 14631 22857 24279
14971 24279 29547 22048 7014 2386 19620 27115 54475 54851 22347 28148 44168 42432 6367
14958 6367 5671 5870 -30902 -36105 -8046 -3634 -22177 -9308 11862 22418 63203 75772 66972
14945 66972 45499 41717 28167 15595 23560 3689 9483 13583 7669 33113 65411 48668 14379
14932 14379 7199 27160 28104 25022 4258 29629 16888 -18279 -15746 -5907 -7362 -5906 6576
14919F576J645j0376R173L0460J1998r507K670K5779J003m2469l5676k2405j6366
14906d7495K6340J8801O497j0605j0539L2072K2507k0441l3464r413K4436J7239
14894A5935j426p127j0587J2347J2297l234J1893j2720j0782K638K6063q507j5309
14881A1481J4k0868l695L5318j4499p395J421L9202K1882k5338k2633K7873n631
14868C7132k7790R9p737J093J1147J0840l010k655J2172p518l9078k297n273K667
14854b0208J6269J7864Q255P615l937J942K1809J6297r963n0416l8702K3143N016
14841e016l704Q897j7967j6971j4719J8090J7892j3240M198K9186m874J3044K9698
14828D4514j7509j6695L511N760J893P287J7252L24r957k2075l9563N25J6677
$$ plain form
14919 6576 8221 -2155 7018 37478 49476 39969 42639 68418 69421 26952 -8724 -31129 -47495
14906 -47495 -21155 -2354 4143 -6462 -17001 15071 37578 17137 -16327 -25740 -1304 15935
14894 15935 14509 7382 -3205 9142 21439 18205 30098 17378 6596 9234 35297 26790 11481
14881 11481 11495 -9373 -13068 22250 7751 356 1777 40979 62861 37523 14890 42763 37132
14868 37132 9342 9441 1704 2797 13944 24784 21774 19119 31291 23773 -15305 -17602 -22875 -20208
14854 -20208 -3939 13925 22180 29795 25858 27800 49609 65906 55943 5527 -33175 -10032 -5016
14841 -5016 -8720 177 -17790 -34761 -49480 -31390 -13498 -26738 -22540 6646 1772 14816 44514
14828 44514 27005 10310 13821 19581 21474 28761 46013 46337 36380 14305 -25258 -24733 -8056
14815h056r401L2885k752p137J2997J7801j1156k5926l0155j3453K8081M4515
14803B8243J0611j7257o21j6973k1386j985J15K1470M424O130R98L700l3917J8174
14789A726o609m0016k2092K91J2743L5526L259K046K74K2884j0198l384p88o675
14775a1013j2397J2949O497j470O115Q600O016L912m216J1591j8862j2729J5806
14762A0799k716k7676l0414J7997J8285l355j7063K2590N651k4595p072m789J552
14749d0806J5443J0541m180J9427q275j4599Q736j514K1053J8520K3l941n879
14736A4549k9451N857Q881J5788j2368L886l09r190q737l167J3491k4512o109
14723c1391j678J1036K1883n643l0386o529J1007K7283N133J7498Q646Q304j5691
$$ plain form
14815 -8056 -17457 15428 12676 5539 18536 36337 25181 -745 -30900 -44353 -16272 28243
14803 28243 38854 21597 20976 4003 -17383 -19368 -19253 2217 6641 12771 13769 17469 -16448 1726
14789 1726 -4883 -44899 -66991 -66700 -53957 -18431 -15172 -13126 -12852 10032 -166 -3550 -4338 -11013
14775 -11013 -23410 -10461 -3964 -5434 681 9281 15297 19209 14993 26584 7722 -5007 10799
14762 10799 8083 -19593 -50007 -32010 -13725 -17080 -34143 -11553 -5902 -30497 -37569 -42358 -40806
14749 -40806 -25363 -14822 -19002 425 -7850 -22449 -13713 -15227 5826 24346 24369 20428 14549
14736 14549 -14902 -9045 -164 15624 3256 7142 6833 -2357 -11094 -14261 -770 -25282 -31391
14723 -31391 -33069 -22033 -150 -5793 -36179 -42708 -31701 -4418 715 18213 26859 35163 19472
14710A9472j2702k39N967k0095j2057J2104l088M982k2871k0975j4842J5268K1493
14697b7583j569n646J2259L549J2421J7405L723J1731J0348j3313l0249K0767
14685A3843r849j2776M350J9699O896k659k1429R99K457M5479J4681j9908N897
14672D7680m940k4411j013J4353m959k7873k1750J4794J0383J0736k3103j6951
14660b7054p701R001K2511R373l177J0364J1185j1073l043j4050j7087K5534J8200
14647B2983K713o077k1975k4496N083M276j608j0803L2346J2843K86j3526k816
14634g71o364J0107J2029r594n839L0435L4338R85j2433m5609N227j8623k2183
14621b8295n118n790P274j102Q3r685q489K1376K6291j0057j5630J7771O810o98
$$ plain form
14710 19472 6770 6531 12498 -7597 -19654 -7550 -10638 -5656 -28527 -49502 -64344 -49076 -27583
14697 -27583 -29152 -34798 -22539 -18990 -6569 10836 14559 26290 36638 23325 -6924 13843
14685 13843 3994 -8782 -4432 15267 22163 19504 -1925 -926 1531 47010 61691 41783 47680
14672 47680 42740 18329 17316 31669 26710 -1163 -22913 -8119 2264 13000 -10103 -27054
14660 -27054 -34755 -25754 -3243 6130 2953 13317 24502 13429 10386 -3664 -20751 4783 22983
14647 22983 25696 19619 -2356 -26852 -21769 -17493 -19101 -29904 2442 15285 15571 2045 -771
14634 -771 -7135 2972 15001 5407 -432 30003 64341 65326 52893 7284 12511 -6112 -28295
14621 -28295 -33413 -39203 -31929 -33031 -32948 -42633 -51122 -29746 -3455 -13512 -29142 -11371 -4561 -5259
14607e259M498K4468L4346K1685j6396k1772j9347m582J0513k2805j4489o685
14595a5825o907J6419j309n590j894J8372p023o209j0728M399J1619k261J9428
14582A2491J1528p110q561J3526m231K9707K6830k4566j5276k3240K5002n727
14570C0373n578j705r177K4282j1322l9143K323L1638o770l3301j4289R208K0648
14557b813J8332q374j9285r823J52K8299L587M488M649j8917j9959k4014J2484
14544c1194K1979k753l122O840J8231p335k1883K897J6186N039J5397J079j6218
14531E143j997K7682L825M401j6153j7799o448r554n678m266O79n47R699p7O491
14516d599J4163J8693o59j297l1231j0680J632N46k4291l1765J5620l964J1056
$$ plain form
14607 -5259 -761 23707 58053 79738 63342 41570 22223 17641 28154 5349 -9140 -15825
14595 -15825 -22732 -6313 -7622 -13212 -15106 3266 -3757 -9966 -20694 -16295 -4676 -6937 12491
14582 12491 24019 16909 8348 21874 17643 47350 74180 49614 34338 11098 36100 30373
14570 30373 24795 23090 13913 38195 26873 -12270 -9947 21691 14921 -18380 -32669 -23461 -2813
14557 -2813 15519 7145 -12140 -21963 -21811 6488 10075 14563 19212 295 -19664 -43678 -31194
14544 -31194 -9215 -11968 -15090 -8250 9981 2646 -19237 -16340 -154 4885 20282 21361 5143
14531 5143 3146 30828 34653 39054 22901 5102 -1346 -10900 -16578 -20844 -20165 -20712 -11013 -11090 -4599
14516 -4599 9564 28257 27598 26301 -4930 -15610 -13978 -13432 -37723 -69488 -53868 -57832 -46776
14503d6776N534K4389K5887J5775k0101j8939j5135r434k0597J889Q784N301P799
14490c5624K9200J2876J3324n883k5336j7879K4375J8914j0076q627k215m944
14478a1895L4515r299j1065n974L2026n327j4021l854J7907k315j7197l641Q005
14465G865P673j650k310J2525m107J200J5754m0420l0585Q740K7309M001j2484
14452f489K031j5654j4624J1569K5992J0479L144k248R531k4106J3753k336q654
14439B388R386J079k3989m231P873m961K0197r491o070m779M322k6937l216J5815
14425b2614J35J7731J865J4809Q944m67k4070L5081K3408j3907P98L955j4893
14412C0775j3862r329n151P279j6248O502N801J2649K3632l3786k4802j228j7226
$$ plain form
14503 -46776 -41242 -16853 9034 24809 4708 -14231 -29366 -38800 -59397 -57508 -48724 -43423 -35624
14490 -35624 -6424 6452 19776 13893 -11443 -29322 -4947 13967 3891 -4736 -6951 -11895
14478 -11895 22620 13321 2256 -3718 28308 22981 8960 5106 23013 20698 3501 -140 7865
14465 7865 15538 13888 11578 24103 19996 21196 36950 -3470 -34055 -25315 1994 5995 -6489
14452 -6489 -4458 -20112 -34736 -23167 2825 13304 16448 14200 23731 -375 13378 11042 2388
14439 2388 11774 12853 -11136 -15367 -7494 -12455 7742 -1749 -7819 -12598 -8276 -35213 -38429 -22614
14425 -22614 -22479 -4748 -2883 11926 20870 20403 -3667 31414 54822 40915 41713 45668 30775
14412 30775 16913 7584 2433 9712 -6536 -34 5767 18416 42048 8262 -16540 -17768 -34994
14399c4994R317M574J073J1615J0905j2518L811J96j174P274m362j4683K1313
14386B347R079J2680r565P498J2260j1956R44j8824J2481k8946n234L1826J0911
14373B5501J9055p914q914j2279j894K3644J2597l099J2851r888j7044j7990n372
14360I254m391k306k1171K5785N880j4188m279K3336K1479O833l0151o789k467
14347F825n401l419j7547R646K4399M464j5108l3440j764J7251N756l3351j7315
14334e9004K8291K1926P426J2220l3731J992K7367n130J34L8416R936j6799j3259
14321A9785j3681j0464m0277k5975J3239M80j66m783K6879L4353K597j4889j4991
14308b7893j3421K7451L5829J3009j0782K6096N762p263l3408j24N885K6771J2293
$$ plain form
14399 -34994 -25677 -21103 -20030 -8415 2490 -10028 -6217 -6021 -7195 79 -4283 -18966 2347
14386 2347 11426 24106 14541 22039 34299 22343 23287 4463 16944 -12002 -17236 14590 25501
14373 25501 44556 36642 27728 15449 13555 37199 49796 46697 59548 49660 32616 14626 9254
14360 9254 4863 2557 -18614 7171 13051 -1137 -5416 17920 39399 46232 16081 9292 6825
14347 6825 1424 -1995 -19542 -9896 14503 18967 3859 -29581 -31345 -14094 -8338 -41689 -59004
14334 -59004 -30713 -8787 -1361 10859 -22872 -20880 6487 1357 1491 39907 49843 33044 19785
14321 19785 6104 -4360 -44637 -70612 -57373 -56893 -57059 -61842 -34963 -610 1987 -12902 -27893
14308 -27893 -41314 -13863 21966 34975 24193 50289 56051 48788 15380 15256 21141 47912 60205
14295F0205j2709J0044j6085j9333o139k0424o744P008J8207l230l453m4063N995
14282c0721K7300n905q853K8176J4240J485o144j2398k2903M971j206J4207J2003
14269A4252j29l854k5103k5328m980k0433j2828Q703K2991Q369J199j6528l364
14256e7033K1037K0160K7050J0749J1429P844L504k4227k0136k3327j8494K4675
14244a6769J9949R889J1730j821l122j8906p339J5802J7655J152M389o379k4254
14231A976P380J6051m022k9957k160P309j254j7899n258o55j0152j460n885L4011
14217a1975J2751J30n882K6155l500j5625K5625N137j2455Q379J3138J802p720
14204C5960j1880k2823j1094k4552J3592J3463J7648M773j9682l9976P105L2534
$$ plain form
14295 60205 47496 57540 41455 22122 15983 -4441 -11185 -4177 14030 10800 7347 -36716 -30721
14282 -30721 -3421 -9326 -18179 9997 24237 25722 19578 7180 -15723 -10752 -11958 2249 14252
14269 14252 14123 10269 -14834 -40162 -45142 -65575 -78403 -69700 -46709 -38340 -37141 -53669 -57033
14256 -57033 -35996 -15836 11214 21963 33392 41236 44740 20513 377 -22950 -41444 -16769
14244 -16769 3180 13069 24799 22978 19856 950 -6389 9413 27068 28220 32609 26230 1976
14231 1976 9356 25407 21385 -8572 -10732 -3423 -4677 -22576 -27834 -28489 -38641 -40101 -45986 -11975
14217 -11975 776 906 -4976 21179 17679 2054 27679 32816 20361 28740 41878 43680 35960
14204 35960 24080 1257 -9837 -34389 -20797 -7334 10314 15087 -4595 -44571 -37466 -4932
14192d932l515j4499l630j2761J212K8323K9358L093o610k5355l0012q157q091
14179e5576l179L9978J4240k1360J9192N367j1108n071K5513k257j6600k913j5284
14166b9058J7302M117o527R106J816k1605j3606M583j980j1053J182J5207L0761
14153B45K5007l729k1026k4397j1037M253J7202o929k5150j9602J1403L6216K8765
14140A1221m0774l3496M65K588J7804k393K1098o854r672K6900N923k2709J4943
14127a4956K1960J2064j6011j8963M442n118K4535J3822N627K031R267R663O934
14114E5297n149k5024k8818J6170N112J693j6659l7892j7545n280J86k0810M751
14101g3968K2352K1496K8474j317j1522K2293O22j0606K4016j3595k6991R316
$$ plain form
14192 -4932 -8447 -22946 -26576 -39337 -38125 -9802 19556 22649 16039 -9316 -39328 -47485 -55576
14179 -55576 -58755 -18777 -4537 -25897 -6705 -1338 -12446 -17517 7996 5739 -10861 -13774 -29058
14166 -29058 -11756 -7639 -14166 -5060 -3244 -24849 -38455 -33872 -35852 -46905 -45723 -30516 245
14153 245 25252 21523 497 -23900 -34937 -30684 -13482 -20411 -45561 -65163 -53760 -17544 11221
14140 11221 -29553 -63049 -62584 -59996 -42192 -44585 -23487 -30341 -40013 -13113 -7190 -29899 -14956
14127 -14956 7004 19068 3057 -15906 -11464 -16582 7953 21775 27402 29433 38700 48363 55297
14114 55297 50148 25124 -3694 12476 17588 19281 2622 -35270 -52815 -58095 -57909 -78719 -73968
14101 -73968 -51616 -30120 -1646 -2963 -14485 7808 8430 -2176 21840 8245 -18746 -9430
14089i430p007q069m468O017P521Q853J2403J696r84P61m413K2222L599k3928
14075D773k9776K2191J9468l0724J2227P027J7052j6402k7683q214K0411K1006
14063A1356L907J8913j3081j3787j2353O641J6223L396K035j6993l3011j610L721
14050b4643l362K2184J3698N477l316K1336J2734q33n154J402k2556k7879N416
14037e496M054N15L514P837j545j2402m846J0859K1891j0387j0559o22J6535Q569
14023B7917j3567J3292n088j9385j8873P409J0828l6962L583L6025K1694J1542
14011C8415L493q045k5018J3759j1046k6190p377M329L28L609J136q720N432J4104
13997a791N694J9469J5232J4361J5585k8474k5836J6218J3051j7358j4431j6387
$$ plain form
14089 -9430 -16437 -24506 -28974 -22957 -15436 -6583 5820 7516 6532 7293 2880 25102 28701 4773
14075 4773 -25003 -2812 16656 -14068 -1841 5186 22238 5836 -21847 -30061 -9650 11356
14063 11356 15263 34176 21095 7308 -5045 1596 17819 21215 23250 6257 -26754 -28364 -24643
14050 -24643 -28005 -5821 7877 13354 10038 31374 44108 43275 38121 39523 16967 -10912 -5496
14037 -5496 -1442 -927 2587 10424 8879 -3523 -8369 2490 24381 13994 3435 2813 19348 27917
14023 27917 14350 27642 22554 3169 -15704 -8295 2533 -34429 -30846 5179 26873 38415
14011 38415 41908 33863 8845 22604 11558 -14632 -22009 -17680 -17352 -13743 -12607 -21327 -15895 -1791
13997 -1791 3903 23372 38604 52965 68550 40076 14240 30458 43509 26151 11720 -4667
13985d667j5588J9690J5490M651k0371J0951j7441j6353Q499J5557J1382J9809
13973C1609k6496j0371j3011Q75J1969N035P963p196k9898N987J8592J1022l3865
13960b7785j5680M5927L6263j7411j4650j8582k4250j5995N062N014J5149K3346
13948c592J6378K6364k022j8601k6560n262L1856K707R704k5266q183k1853q531
13935c2861N000K037j2088L308K5593r613k0667P035Q329K468J9209K500m7584
13922d7334q840L5551m788k2722k393K3727j5375o152K4939J3698j514k0724q117
13909d0044K1471M576k330k953P622j9446p617o798J0951J5694j4108K67K849
13896b9866Q608q594n00j1019l459J6850J3124J0561j3579r524k7064J8304N1170
$$ plain form
13985 -4667 -20255 -565 14925 19576 -795 10156 -7285 -23638 -15139 418 11800 31609
13973 31609 5113 -5258 -18269 -17394 -5425 -390 7573 377 -29521 -23534 -4942 6080 -27785
13960 -27785 -43465 2462 38725 21314 6664 -11918 -36168 -52163 -47101 -42087 -26938 -3592
13948 -3592 12786 39150 37128 18527 -8033 -13295 18561 21268 30972 5706 -2477 -24330 -32861
13935 -32861 -27861 -25824 -37912 -34604 -9011 -18624 -39291 -32256 -23927 -21459 -2250 250 -47334
13922 -47334 -56174 -20623 -25411 -48133 -50526 -26799 -42174 -48326 -23387 -9689 -11203 -31927 -40044
13909 -40044 -18573 -13997 -16327 -19280 -11658 -31104 -38721 -45519 -34568 -18874 -32982 -32715 -29866
13896 -29866 -21258 -29852 -30352 -41371 -44830 -27980 -14856 -4295 -17874 -27398 -54462 -36158 15012
13883A5012j4863j3080J5110j0080j8023K9687p978n606P460j459M824O608n1574
13870d3962j5708J6026J25P797k2465j866O993n952k1109J402J6687L950Q067
13857e0015K5551l113j8948J3850M0688M145K143j9814m154j0362r137P467j8482
13844d0181L022J1643J0541K9199J8849r984k355L374j0166l7962j5420J4679
13832b4761J1736P482K95P226j3033K516N46J4003j0570j5477K356N233K735R562
13818a51j7375o697K63J3375j668j6391l583K1340J6549m551p849K881j4253l5904
13804e4014R162L6136P146k1228m011J665K619k3619J3238J1329p474k990R713
13791b2328O064k1966J9463J0583k4386k1875M812K0670J7061K586L24J3671j548
$$ plain form
13883 15012 149 -12931 2179 -7901 -25924 3763 -4215 -9821 -2361 -3820 1004 7612 -43962
13870 -43962 -59670 -43644 -43519 -35722 -58187 -60053 -53060 -59012 -80121 -78719 -62032 -58082 -50015
13857 -50015 -24464 -27577 -46525 -32675 8013 12158 14301 -5513 -9667 -20029 -29166 -21699 -40181
13844 -40181 -37159 -25516 -14975 14224 33073 23089 20734 24108 13942 -24020 -39440 -24761
13832 -24761 -13025 -5543 -5248 1978 -11055 -8539 -7993 6010 -4560 -20037 -17681 -12448 -9713 -151
13818 -151 -17526 -24223 -23960 -10585 -12253 -28644 -32227 -10887 5662 1111 -6738 -3857 -18110 -54014
13804 -54014 -44852 -8716 -1570 -22798 -26809 -25144 -22525 -46144 -32906 -21577 -29051 -32041 -22328
13791 -22328 -16264 -38230 -18767 -8184 -32570 -54445 -49633 -28963 -11902 -9316 -8992 4679 3131
13778C131O710O781N874J0089J4559k9402l1734j090P414j888J7974j0454j9033
13765b1069j5351P910m995O941r229J3763p554k3868J0567R157J4975J1287J5897
13752H431k1027j1575q191r603Q146j0563K2268K5233M537m6615O027K1522j4754
13739b6164o105j9405L280J2357J3647j9193j287Q84J658N381P525L675k0112
13726d3859j1492P200M207M8086L1291k3391j0123k0646r795R186k077j7201o437
13713d5051J0155K3833j5892j8817j704K2758J1834J0996k6777J7777L7748N300
13701C2160k1270j9793L5000j517n928K240q958m5661k7498L6253M2955j3175
13689D808k4548j0292J8882K6830R061L110o214l3664l7492Q188J2045P298m0272
$$ plain form
13778 3131 9841 16622 22496 32585 47144 17742 -13992 -15082 -7668 -9556 8418 -2036 -21069
13765 -21069 -36420 -28510 -33505 -26564 -35793 -22030 -29584 -53452 -42885 -33728 -18753 -7466 8431
13752 8431 -12596 -24171 -32362 -41965 -33819 -44382 -22114 3119 7656 -38959 -32932 -11410 -26164
13739 -26164 -32269 -51674 -48394 -36037 -22390 -41583 -42870 -41986 -40328 -34947 -27422 -23747 -43859
13726 -43859 -55351 -48151 -43944 4142 35433 12042 1919 -18727 -28522 -19336 -21413 -38614 -45051
13713 -45051 -34896 -11063 -26955 -45772 -47476 -24718 -12884 -1888 -28665 -10888 26860 32160
13701 32160 10890 -8903 26097 24580 18652 20892 11934 -33727 -61225 -24972 17983 4808
13689 4808 -19740 -30032 -11150 15680 24741 27851 21637 -12027 -49519 -41331 -29286 -21988 -62260
13676f2260k7868J4957m74K1199J1093J2157K7075j154j1087N519K922L571o461
13663a0811M381J5572J1619m063j5602j3021o269j2844r874R733J9057K8061N775
13650B1714k3009J0631j1814j4937K5258j4309k5720r744L4562L1086Q276l9115
13638g121l3369j4119N383j2224L486J7758L0967l544k9914N238p391o755L350
13625d8255J3888K3013L5817k1005j6926k9153j2118J8691J9806J3596j0188k8940
13613d1774m267k301m897K1222M843j3126O583R378K403R506l335J6399m386O790
13599C038j6169l5932L2658J5244j5811N651o855L762N209o595p949Q396N066
13586a0287J1401j4622j7167j7411r894L83J3390j2886K8271K1734j2740L873
$$ plain form
13676 -62260 -90128 -75171 -75645 -54446 -43353 -31196 -4121 -5275 -16362 -10843 -7921 -4350 -10811
13663 -10811 -6430 9142 20761 16698 1096 -11925 -18194 -31038 -40912 -31179 -12122 15939 21714
13650 21714 -1295 9336 -2478 -17415 7843 -6466 -32186 -41930 -7368 23718 31994 -7121
13638 -7121 -40490 -54609 -49226 -61450 -57964 -40206 -9239 -12783 -42697 -37459 -44850 -51605 -48255
13625 -48255 -34367 -11354 24463 3458 -13468 -42621 -54739 -36048 -16242 -2646 -12834 -41774
13613 -41774 -46041 -48342 -53239 -32017 -27174 -40300 -33717 -24339 -21936 -12430 -15765 634 -3752 3038
13599 3038 -13131 -49063 -16405 -1161 -16972 -11321 -18176 -14414 -9205 -15800 -23749 -15353 -10287
13586 -10287 1114 -13508 -30675 -48086 -57980 -57597 -44207 -57093 -28822 -7088 -19828 -15955
13574a5955J0538o142p217j4551j190K5306j9250l707J3751Q937l612j5091J4288
13561a3895J9263N428N889k9j8054n70J1873J1971j1617l554K013k064q308j1153
13547a2807j7776N125J35k3199j7946J5258K6544K8041p45j9067j9183J3428J1806
13534a0386K2232j727l7419M800j1140j2600L585K5011R771n33K31k0161r422
13521c7758J8510J1509J9822J3505j4144j6135k8299K2061O772l852p482k418
13509a7909J5897N344j5621j1718J816j258J3102j1970m347O14L8846j764j1791
13496g59J494j3194m988l1901J2285O569j0996J2141J7625j613J1665j5967O51
13483a6988K4740J4036j5210j3557J4457R893l0117j1937l6506j0088N2874M938
$$ plain form
13574 -15955 -5417 -11559 -18776 -33327 -34517 -9211 -28461 -32168 -18417 -9480 -13092 -28183 -13895
13561 -13895 5368 10796 16685 16656 -1398 -1968 9905 21876 10259 6705 8718 6654 -1654 -12807
13547 -12807 -30583 -25458 -25323 -48522 -66468 -51210 -24666 3375 2630 -16437 -35620 -22192 -10386
13534 -10386 11846 10119 -27300 -22500 -33640 -46240 -42655 -17644 -7873 -8406 -8175 -28336 -37758
13521 -37758 -19248 -7739 12083 25588 11444 -4691 -32990 -10929 -4157 -8009 -15491 -17909
13509 -17909 -2012 3332 -12289 -24007 -22191 -23449 -10347 -22317 -26664 -26050 12796 11032 -759
13496 -759 735 -12459 -17447 -49348 -37063 -30494 -41490 -29349 -11724 -13337 -1672 -17639 -16988
13483 -16988 7752 21788 6578 -6979 7478 17371 -12746 -24683 -61189 -71277 -18403 -13465
13471a3465j7526P431k1960j8712l945M317J844K5926O055j4179j1478J0716K3611
13458b1365J4567Q282l8366p305Q779L8751j0454l2459l715N3972K4648k3895
13446A1440k8877o501M828q673j5682r497K4648j571Q309N1123K1406k5087o534
13433A9332p274m502o530j1810q851J6064J7214j1024p231J878R170J228N654
13420A3318m2989q728P228l263R734K7l133K0434M118K2220o775j3239j4581j0707
13406b6336K482m21J009K7579O375l781j996k5887k4382L552K822K3972K221j3704
13392b6495k2695j7265N645K5716j2807L452J9752j2870P398M627q716K1307J3485
13379E34R386j884j7299J6622N681k0970j0059N755n610l457J5331n632J3922
$$ plain form
13471 -13465 -30991 -23560 -45520 -64232 -68177 -63860 -62016 -36090 -30035 -44214 -55692 -44976 -21365
13458 -21365 -6798 1484 -36882 -44187 -35408 3343 -7111 -39570 -43285 10687 35335 11440
13446 11440 -17437 -23938 -19110 -27783 -43465 -52962 -28314 -29885 -21576 29547 50953 25866 19332
13433 19332 12058 7556 1026 -10784 -19635 -3571 13643 2619 -4612 -2734 6436 7664 13318
13420 13318 -29671 -38399 -31171 -34434 -24700 -24673 -27806 -7372 -3254 18966 12191 -1048 -15629 -26336
13406 -26336 -23854 -24275 -23266 4313 10688 6907 4911 -20976 -45358 -41806 -38984 -15012 -12791 -26495
13392 -26495 -49190 -66455 -60810 -35094 -47901 -44449 -24697 -37567 -30169 -25542 -34258 -12951 534
13379 534 9920 8036 -9263 7359 13040 -7930 -17989 -12234 -17844 -21301 -5970 -11602 2320
13366B320j1593Q653M320o824J068K285k8879q28K8326r190k395N38J2575k2627
13352b2251j7656n41J1578q53L472K6446K4978j5667m7876J013J3762L3192J5555
13339B5152r36j8918k3612j5700O326J6855j5367j9999k5538m799N863L0629L1473
13326h571K5333m905j2098k6365p045N933Q546K1742k755j7879k1140K6635n78
13313a3147J6747J2375K2004J9980n571q83q649j8708k3167j0705J7547q195k709
13300c081m816N294j2100k0739l394J8135J866N0201L0710o995j9598q830j430
13287B5223l7365k690J1318j0499m223R100J0533J8692K1161k278k8030j7790
13275f848j8747Q194J4929K5126J0660m8370j798O817j7636l50L3969k944k5906
$$ plain form
13366 2320 -9273 -620 3700 -3124 -2056 229 -28650 -29478 -1152 -10342 -12737 -12199 376 -22251
13352 -22251 -39907 -40448 -28870 -29723 -26251 195 25173 9506 -38370 -37357 -23595 9597 25152
13339 25152 24216 5298 -18314 -34014 -27688 -10833 -26200 -46199 -71737 -76536 -70673 -40044 -8571
13326 -8571 16762 11857 -241 -26606 -33651 -27718 -19172 2570 -185 -18064 -39204 -12569 -13147
13313 -13147 3600 15975 37979 57959 52388 51505 42856 24148 981 -9724 7823 -372 -3081
13300 -3081 -7897 -2603 -14703 -35442 -38836 -20701 -18835 31366 62076 55081 35483 26653 25223
13287 25223 -12142 -14832 -3514 -14013 -18236 -9136 1397 20089 41250 38972 10942 -6848
13275 -6848 -25595 -17401 -2472 22654 33314 -15056 -16854 -10037 -27673 -28023 5946 3002 -22904
13262b2904n005P72L9198j0651M814J0424j6634l202J855L816M574o202k867M690
13248B678L198M593K2384J7444j629l7556l7905q02p90R611N078M014M153l897
13234i426o039l2474p472J5265N404J6346K95N531L93j42j5595j1297J0177J9971
13220i063J5646k0542J2447K0363M868m785q438n3846J2699L7741J3273Q436M467
13207C3266J358j3771k7391m580k740p283J7496P628K6716M141k9780l5467l6746
13194f7153L7456M532j9766P805R304N433L2947O581K4127O661N585N488l0947
13181B8053K83j7280r653k938J5178m811K0402K3926j4356j6855n443p915J609
13168A0200k1956m081J3152J8262o766j8402j6049K5391j0453P410J6112l0447
$$ plain form
13262 -22904 -27909 -27137 12061 1410 6224 16648 14 -3188 -1333 2483 7057 855 -2012 2678
13248 2678 5876 10469 32853 50297 48668 11112 -26793 -27595 -28385 -18774 -13696 -9682 -5529 -9426
13234 -9426 -15465 -47939 -55411 -40146 -34742 -18396 -18101 -12570 -12177 -12319 -27914 -39211 -29034 -9063
13220 -9063 6583 -13959 -1512 18851 23719 18934 10496 -43350 -30651 7090 20363 28799 33266
13207 33266 34624 20853 -6538 -11118 -13858 -21141 -3645 3983 30699 34840 5060 -30407 -67153
13194 -67153 -29697 -25165 -44931 -37126 -27822 -22389 10558 17139 41266 47927 53512 59000 28053
13181 28053 28336 11056 1403 -1535 13643 8832 29234 53160 38804 21949 16506 8591 10200
13168 10200 -11756 -15837 -2685 15577 8811 -9591 -25640 -249 -10702 -3292 12820 -17627
13156a7627k364N569Q017K342J082L204M297k550K2232j2091n179K6368l819k5319
13142D162q97J7450j4876k5017R159K9738o070j137m114o775K048k3179N964j9530
13128c3074j2267K5700k0056r130K3774J5309J8256m0734m2564o540K3222J1726
13116d6378K5232K5158k175k209Q91m1830k0727K608J1942K549n702J081K8054
13103b1506K2543J5763J2961O249j8162m827K9771P254l6296m5902r164J1981
13091b9335J085j1051J3425J802Q373K1711P654j597m688J6460K0190R749j2731
13078D1047m0737k4904j1274j5118j710j1564K8434M3900j0499j3090M123J2993
13066A601J6765m580J4463r42j9313m974J3227j8295M713k3930k7321J2255n876
$$ plain form
13156 -17627 -19991 -14422 -6405 -4063 -2981 223 4520 1970 24202 12111 6932 33300 29481 4162
13142 4162 3265 20715 5839 -19178 -10019 19719 13649 12512 8398 1623 3671 -19508 -13544 -33074
13128 -33074 -45341 -19641 -39697 -48827 -25053 -9744 8512 -32222 -74786 -81326 -58104 -46378
13116 -46378 -21146 4012 1837 -372 519 -41311 -62038 -59430 -47488 -44939 -50641 -49560 -21506
13103 -21506 1037 16800 29761 36010 17848 13021 42792 50046 13750 -32152 -41316 -29335
13091 -29335 -28250 -39301 -25876 -24074 -15701 6010 13664 12067 7379 23839 44029 53778 41047
13078 41047 310 -24594 -35868 -50986 -52696 -64260 -35826 8074 -2425 -15515 -11392 1601
13066 1601 18366 13786 28249 27307 7994 3020 16247 -2048 2665 -21265 -48586 -36331 -42207
13053d2207J0593K4934j1466J7780o114J587K0286J4897j2183l0457L440p787
13041a6697p511p148r221l0175P756L5787O945j121P109q94O905J3406j2718J8906
13027A1329L1441n371m0719k1037l056j550K5435k6418j4761L6214J1824j0474
13015g143J567j3115J5878M861n1035k1184L7212M5300J6286n564l5893j2982
13003b5812J532l387j2585K9298k7292j7868J8840J3553j5281J1475M1927L14
12991A4714o746q114q911p776l980K305O480L6227j305K763k4359J484p662J9981
12977A5101J7603n464j4807k160j915R317J1411m813k3311l852R469r150M208
12964A637p604L72j6024q340Q199l650o950L2163n2l7212j4213j5522J3360R51
$$ plain form
13053 -42207 -31614 -6680 -18146 -366 -6480 -4893 15393 30290 18107 -12350 -8910 -16697
13041 -16697 -24208 -31356 -40577 -70752 -62996 -27209 -20264 -21385 -14276 -15170 -8265 5141 -7577 11329
13027 11329 42770 37399 -3320 -24357 -27413 -28963 -3528 -29946 -44707 -8493 3331 -7143
13015 -7143 -5576 -18691 -2813 2048 -48987 -70171 -32959 12341 28627 23063 -12830 -25812
13003 -25812 -24280 -27667 -40252 -10954 -38246 -56114 -37274 -23721 -39002 -27527 14400 14714
12991 14714 7968 -146 -9057 -16833 -20813 -18508 -12028 24199 22894 25657 1298 2782 -4880 15101
12977 15101 32704 27240 12433 10273 8358 17675 29086 24273 962 -2890 6579 -2571 1637
12964 1637 -5967 -5595 -21619 -29959 -21760 -25410 -32360 -197 -249 -37461 -51674 -67196 -53836 -52885
12950e2885L7313M0126J0461k8147K0417R206j9715o155J6311J4676j0868L757
12938C4497J659k8997j5582K1513m69j8184k547R51l4957j7467J1618j58P95k1994
12924f9322j2894j8720P898J1959N2554P593M023l5943j2239K2192J2992O437
12912b3470o852j782P958L882L2770K429j9022j9657K1356j838k080n172p137
12899a8615J9438J1130m172j030O094J766k6724n866O183j3557l1750o085K1210
12886d1978J9774O613j5303l35K3281J8470j3304J7610J8428k3926j4495k538
12874g703k303J7485j3427k0085N235J3411L8262j4941o982k154P250j4508m3858
12861d4318K8782J2862n978M509j4730N653q076L862r82M379N398K1193N962J3377
$$ plain form
12950 -52885 -15572 24554 35015 6868 27285 36491 16776 10621 26932 41608 30740 34497
12938 34497 36156 7159 -8423 13090 12621 -5563 -8110 -7159 -42116 -59583 -47965 -48123 -47328 -69322
12924 -69322 -82216 -100936 -93038 -81079 -28525 -20932 -16909 -52852 -65091 -42899 -29907 -23470
12912 -23470 -30322 -32104 -24146 -20264 12506 14935 -4087 -23744 -2388 -4226 -6306 -11478 -18615
12899 -18615 823 11953 7781 6751 12845 14611 -12113 -17979 -11796 -25353 -57103 -63188 -41978
12886 -41978 -22204 -15591 -30894 -31229 -7948 10522 -2782 14828 33256 9330 -5165 -7703
12874 -7703 -10006 7479 -5948 -26033 -20798 -7387 30875 15934 8952 6798 14048 -460 -44318
12861 -44318 -15536 -2674 -8652 -4143 -18873 -13220 -21296 -17434 -18416 -14037 -8639 12554 18516 31893
12847C1893n185j2947j1322J16j2952j5693n104K937J1372l0326j6978R76L5052
12834b8161J25k221j1069j8198L2128J8550R877K099j1893j8825K2963K1545n7067
12821d0147j213L0990r392j8043O220r602k9444K1531J6955K268j3637k0879q917
12808g3310J0011K7484M390k3618J949J9144K9915J5202j8206r619k1257K2848
12796a5067K338J0035P60Q383j7233m392n51K5937J9984j9841n183q257k3357
12783b6444K460J7108R334k9354j3253l849p562j775Q810K1141J513k1484j0105
12770e3460K573M929K3477J5909L959k9045k1447J169Q731J4301L924J4529m411
12757a4862K322j1903j8796L975N100m332J1606L575J2276J0495k6049j119j5111
$$ plain form
12847 31893 26708 13761 2439 2555 -10397 -26090 -31194 -28257 -16885 -47211 -64189 -63213 -28161
12834 -28161 -28036 -30257 -41326 -59524 -27396 -8846 1031 3130 -8763 -27588 -4625 16920 -40147
12821 -40147 -41360 -10370 -19762 -37805 -31585 -41187 -70631 -49100 -32145 -29877 -43514 -64393 -73310
12808 -73310 -63299 -35815 -31425 -55043 -53094 -33950 -4035 11167 -7039 -16658 -37915 -15067
12796 -15067 -12729 -2694 -1934 6449 -10784 -15176 -15727 10210 30194 10353 5170 -3087 -26444
12783 -26444 -23984 -6876 2458 -26896 -40149 -43998 -51560 -53335 -44525 -23384 -21871 -43355 -53460
12770 -53460 -50887 -45958 -22481 -6572 -2613 -31658 -53105 -51936 -43205 -28904 -24980 -10451 -14862
12757 -14862 -12540 -24443 -43239 -39264 -34164 -38496 -26890 -23315 -11039 -544 -26593 -27712 -42823
12744d2823J1523L8145J2239O392m383q590k0902J4168m414k9718J33j3917Q319
12731c3828L3762K3535k3729o402J8965L7063k140P058m868j2041j9610j7482
12719B83O20J2971J5450J835j879J0965o563m3086J9167K8148m723j7045M774
12706B0917j9292l2651J459k7685k7131P696M2860J8314m20o79r86p599j5765
12693d0962J9687J5713m19n728j4890Q071L779R391J9305J1300Q387k923l2063
12680a352k1572J1668o900j0265K6184j9294J286j2191k2095k0500K4523M1617
12668h891r990n175L236r631m924k3766L432L2483Q362j7381j3119J3487J4910
12655a6967o214k2175k4502J8520L3974J7184K315p218J0981k939K2946j0055
$$ plain form
12744 -42823 -31300 6845 19084 25476 21093 12503 -8399 5769 1355 -28363 -28230 -42147 -33828
12731 -33828 -66 23469 -260 -6662 12303 49366 47226 54284 49416 37375 17765 283
12719 283 903 13874 29324 31159 29280 40245 33682 -9404 9763 37911 33188 16143 20917
12706 20917 1625 -31026 -29567 -57252 -84383 -76687 -33827 -15513 -15933 -16612 -17598 -25197 -40962
12693 -40962 -21275 -5562 -5981 -11709 -26599 -18528 -14749 -5358 13947 25247 33634 30711 -1352
12680 -1352 -22924 -11256 -18156 -28421 -2237 -21531 -20245 -32436 -54531 -75031 -50508 -8891
12668 -8891 -18881 -24056 -20820 -30451 -35375 -59141 -55709 -23226 -14864 -32245 -45364 -31877 -16967
12655 -16967 -23181 -45356 -69858 -51338 -17364 -180 2135 -5083 5898 2959 25905 15850
12643A5850j8605l796l6701k5640K8131j3018k6559K6308J4222J5348R418J664
12631a3378n533m953o721K1651J3959l3128j0520k553L6330N937j6546j7104o62
12618c3221R284j0461p361L0474K1840L052p785J0791j8158j4532P702L472O476
12605A573j553M49K4228Q006j7620k1218J1127J324j2710j2137j3J1200p450j1553
12591b6347J0861M841k796K6431l862K1949K215J7701k3491k8187l48l6j0556
12578a1625j388K3119j3198k4287K5848J3395j323R157N699k3814j8884J6724
12566e77k646R266R359J5370J0078K326n679k1695j0988l7781q830j5260J0441
12553d6616J4900n419O330Q852o026n0423o695J2976L4231L3257p056J420K9695
$$ plain form
12643 15850 -2755 -6551 -43252 -68892 -40761 -53779 -80338 -54030 -39808 -24460 -15042 -13378
12631 -13378 -18911 -23864 -30585 -8934 5025 -28103 -38623 -41176 -4846 1091 -15455 -32559 -33221
12618 -33221 -23937 -34398 -41759 -11285 10555 13607 5822 16613 -1545 -16077 -8375 -4903 1573
12605 1573 20 469 24697 32703 15083 -6135 4992 6316 -6394 -18531 -18544 -7344 -14794 -26347
12591 -26347 -15486 -10645 -13441 12990 9128 31077 33292 50993 27502 -685 -1033 -1069 -11625
12578 -11625 -13013 10106 -3092 -27379 -1531 11864 10541 19698 25397 1583 -17301 -577
12566 -577 -3223 6043 15402 30772 40850 43176 37497 15802 4814 -32967 -41797 -57057 -46616
12553 -46616 -31716 -37135 -30805 -21953 -27979 -78402 -85097 -72121 -37890 -4633 -11689 -10269 19426
12540A9426K713O27J6749O904j6339q040j5027J4653J8181j8438M633J4740p657
12527C3125k3514k336j664r096k7409j6357k352K2335K4555j5632q256P252P148
12514a2201k8748J778L1351R62K896j1034k3013j828P452l913j7185j7396M1586
12501b9293J9935k7466j1622J1036k732k821O086M930L4267j0027k7249J6690
12489a8266P15j2676q232K8244N4369J927k9124J131J6053k3397l7338q15K7811
12476D02M98k9919r902N635P242M450J5820N134k8593r616P177J0773J8063n773
12462h609N068J3163j3158J0127k9312j6430J622n308k024N622K4959Q858k3801
12449b9223l283J2916J2561m707j7845J2001r637m8772L221L2730J0990K3369
$$ plain form
12540 19426 22139 22766 39515 46419 30080 22040 7013 21666 39847 21409 26042 40782 33125
12527 33125 9611 7275 5611 -3485 -30894 -47251 -49603 -27268 -2713 -18345 -26601 -19349 -12201
12514 -12201 -40949 -39171 -7820 -6858 -3962 -14996 -38009 -39837 -32385 -36298 -53483 -70879 -29293
12501 -29293 -9358 -36824 -48446 -37410 -40142 -42963 -36877 -31947 2320 -7707 -34956 -18266
12489 -18266 -17551 -30227 -38459 -10215 44154 46081 16957 18088 34141 10744 -26594 -27409 402
12476 402 900 -29019 -38921 -33286 -26044 -21594 -5774 -640 -29233 -38849 -31672 -20899 -2836 -8609
12462 -8609 -3541 9622 -3536 6591 -22721 -39151 -37529 -42837 -44861 -39239 -14280 -5422 -29223
12449 -29223 -32506 -19590 -7029 -11736 -29581 -17580 -27217 -75989 -72768 -40038 -29048 -5679
12437e679o501j2639n133j0421n909l4983l463K7867L9341J7585k6865o148K0468
12424a2480R552p649j4829k0361m225J2118J1665m366J726m94J2373K2847k9977
12411b4100n626L0992n074q956j5401L826j3728L703J8671l157J2538j2956K0179
12398I11M3563M9102q300q885m6388l690M43O0j0118k7097k5095J4757o71j4006
12384c5414q485J395N941M078j562J1920k5679K812J1714k1218R272K7886K8479
12371A1139J0097k3198R981J0463k6493j4975N894r213m107P109j2586q371k9958
12358g4218k863J2005K7850p554o88K2329L128k317R607J2852L4792J0422K091
12345D7436l60k8541N773p47j3205l210J627K3555n529m2057l3995j5095j8262
$$ plain form
12437 -5679 -12180 -24819 -29952 -40373 -46282 -81265 -84728 -56861 -17520 65 -26800 -32948 -12480
12424 -12480 -2928 -10577 -25406 -45767 -49992 -37874 -26209 -30575 -28849 -29343 -16970 5877 -24100
12411 -24100 -29726 1266 -3808 -12764 -28165 -24339 -38067 -34364 -15693 -18850 -6312 -19268 911
12398 911 44474 93576 85276 76391 30003 26313 26756 26816 16698 -10399 -35494 -20737 -21408 -35414
12384 -35414 -43899 -42504 -36563 -32485 -34047 -22127 -47806 -44994 -33280 -54498 -45226 -17340 11139
12371 11139 21236 -1962 8019 18482 -8011 -22986 -17092 -26305 -30412 -23303 -35889 -44260 -74218
12358 -74218 -77081 -65076 -37226 -44780 -45468 -23139 -20011 -22328 -12721 131 34923 45345 47436
12345 47436 47076 18535 24308 23561 10356 7146 8773 32328 26799 -15258 -49253 -64348 -82610
12332h2610N367K2734K9406M0859O562p980k599j451K9095J0876k3287j390q430
12319A7152n261p237j1997N692J0768j5014O902M0050J3715n2548j6621K2136
12307G737m698k9952j469K2459J3178J5237J0145j6995j4354k2374k2921K2025
12295b1982K3891J3389j4199R28K9028J990j6923k811k7262k1696N149R194P587
12282a3717J6281o926J4626L42k4636R671J365J1000p126k3979j4222L57J3461
12269b3503O568J9184K2312Q270j5096O773j466k2056m532P647J371j531J9985
12256B3926k038q828m000n089n446k7330N724P21j280K682J1519Q39j7614k102
12242b8316J848J531J2143P189K2822J135k950k3219j5395m219L051L1399m4154
$$ plain form
12332 -82610 -77243 -54509 -25103 15756 22318 14338 11739 10288 39383 50259 26972 25582 17152
12319 17152 11891 4654 -7343 -1651 9117 -5897 1005 41055 54770 2222 -14399 7737
12307 7737 3039 -26913 -28382 -5923 7255 22492 32637 15642 1288 -21086 -44007 -21982
12295 -21982 1909 15298 1099 2027 31055 33045 16122 13311 -13951 -35647 -30498 -21304 -13717
12282 -13717 2564 -4362 10264 10606 -14030 -4359 -2994 8006 880 -23099 -37321 -36964 -23503
12269 -23503 -16935 2249 24561 32831 17735 24508 23042 986 -3546 4101 5472 3941 23926
12256 23926 21888 13060 9060 3971 -1475 -28805 -23081 -22360 -23640 -20958 -9439 -8600 -26214 -28316
12242 -28316 -26468 -24937 -12794 -5605 17217 18352 15402 -7817 -23212 -27431 -24380 7019 -37135
12229c7135m968N8191K293N823P45k8706m7638n803J4988N040K1572R710j973
12216g861k882l297j8071j0150J7571J0201j1425L596J1076K0582J08J9265l203
12203B5510k5780R5N542j8097j6981L12j4011m405K9873J0941l4470j0965J4896
12190c7540M632n498o820J3844J4130j177L391J5884R9n176Q204j0244J4503M379
12176A2611j9950k0471l3499J5707J5339n666L0478J5793n269l779r588o661M289
12163a0666j471K2753J0456j3107l5876j947J4824J4749L621q21J4067L893m5389
12150b4914k1328Q14j0552J6230L535j1363J1715n55k9734J4100M9059K0832O387
12137B4226j4155j4630K089r824Q022Q265j861j2188J0793J9545j1089l0126m426
$$ plain form
12229 -37135 -42103 16088 18381 24204 24949 -3757 -51395 -57198 -42210 -37170 -15598 -5888 -7861
12216 -7861 -10743 -14040 -32111 -42261 -24690 -14489 -25914 -22318 -11242 9340 9448 28713 25510
12203 25510 -270 -175 5367 -12730 -29711 -29399 -43410 -47815 -17942 -7001 -41471 -52436 -37540
12190 -37540 -32908 -38406 -45226 -31382 -17252 -18429 -15038 846 945 -4231 3973 -6271 8232 12611
12176 12611 -7339 -27810 -61309 -45602 -30263 -35929 -5451 10342 5073 1294 -8294 -14955 -10666
12163 -10666 -12137 10616 21072 7965 -27911 -29858 -15034 -285 3336 2515 16582 20475 -24914
12150 -24914 -46242 -45428 -55980 -39750 -36215 -47578 -35863 -36418 -66152 -52052 -2993 17839 24226
12137 24226 10071 -4559 -2470 -12294 -4272 3993 2132 -10056 737 20282 9193 -20933 -25359
12124b5359J8505K8876q168J3299Q263k3986P2l614k5997j6665J3964K5726J0976
12111A5892n782l4008o111m716k963J7829K2435K0625l533j4715N662k1340o838
12098a7563J515N914N316M205L279k4173J1541L944K397k1995k1639Q680P054
12085c1525N367N717k892K156o231p372j4235K8311N706k9960k041J6049n169
12072c6119n030J3370j4083m399N904J5348K2862K0365r977k9411l0395K320L1134
12059a8111k0608k5951K9700o786j1950J976N776K3082l848j9403N557k081J0939
12046c1708J0792j1020j331n11K6279M1138k968j1328k9373k6751Q07K4195j1262
12033b3041j0192K0288L3074M369k984m781J9577l3576j5982j6129k2319J5509
$$ plain form
12124 -25359 -6854 22022 13854 27153 35416 11430 11502 7888 -18109 -34774 -20810 4916 15892
12111 15892 10110 -23898 -30009 -34725 -37688 -19859 2576 23201 19668 4953 10615 -10725 -17563
12098 -17563 -16048 -10134 -4818 -613 2666 -21507 -9966 -6022 -3625 -25620 -47259 -38579 -31525
12085 -31525 -26158 -20441 -23333 -21177 -27408 -34780 -49015 -20704 -14998 -44958 -46999 -30950 -36119
12072 -36119 -41149 -27779 -41862 -46261 -40357 -25009 -2147 18218 8241 -21170 -51565 -49245 -18111
12059 -18111 -38719 -64670 -34970 -41756 -53706 -51730 -45954 -22872 -26720 -46123 -40566 -42647 -31708
12046 -31708 -20916 -31936 -33267 -33778 -7499 33639 30671 19343 -10030 -36781 -35974 -11779 -23041
12033 -23041 -33233 -12945 20129 24498 21514 16733 36310 2734 -13248 -29377 -51696 -36187
12021c6187N514j080p938j2484K1378K5921m445m13o87n655K106P895J7513r753
12007A685j4942j399M999j2340Q968K0181n426J3951o145j5975j1138q199j0655
11994c6435J5713Q681R134P199q962K112M821k7160k6123M740L3543L0145j4480
11981B928j3795M674M977k1657k0522M6139J8733j0565L2752J4935m7505l7867
11969b6773k8984n40j7846J8893L5210o96k4898j1260M3982J7535j4734j6796
11957b6907N977j0346J499L7405j1521J1392L789m3647l9916J2163J8730o421
11945d7803Q95O298K0561O987o775L809K8569J9791j7430p312J827m134J3369
11932A8652l1473r744p133J0733j76L86o509J7784l312j5549j2445l405M183k4330
$$ plain form
12021 -36187 -30673 -31753 -39691 -52175 -30797 -4876 -9321 -9734 -10421 -16076 -13970 -6075 11438 1685
12007 1685 -13257 -14656 -9657 -21997 -13029 7152 1726 15677 9532 -6443 -17581 -25780 -36435
11994 -36435 -20722 -12041 -2907 4292 -4670 -2558 2263 -24897 -51020 -46280 -12737 17408 2928
11981 2928 -10867 -6193 -1216 -22873 -43395 2744 21477 10912 43664 58599 11094 -26773
11969 -26773 -55757 -56297 -74143 -55250 -20040 -20736 -45634 -56894 -12912 4623 -10111 -26907
11957 -26907 -20930 -31276 -29777 7628 -3893 7499 11288 -32359 -72275 -60112 -41382 -47803
11945 -47803 -46908 -40610 -20049 -13062 -19837 -16028 12541 32332 14902 7590 9417 5283 18652
11932 18652 -12821 -22565 -29698 -18965 -19141 -18755 -25264 -7480 -10792 -26341 -38786 -42191 -38008 -62338
11918f2338j6223Q842O045l280K2590o900K161J3973r260K597J2058J1021q475
11905b7189N377J4147Q29O272k210r664j2569K6045K752J1908l560k4172O583
11892e451k736j9778k0349K5147J7444J6336P623q086Q497j0926j5401q832k746
11879a9258K6900L4568J2455k3321P852q184l4408j9934p45l909J2528P544l5459
11866d3371P101J7408J9065j1202j8874J3592N259j603J1265j3647j0296p454
11854c2757K0258J8385j891k1571j932J1290N406l839O133J6914j899l1385k8572
11841d5460P0315K2950m2933o398J1404j4458p427k0480j9272J6355K9139J5474
11829I209m664k04k3381j0909o203K6613L5752K2650R862l1927k2860k5598j179
$$ plain form
11918 -62338 -78561 -69719 -63674 -66954 -44364 -51264 -49103 -35130 -44390 -41793 -29735 -18714 -27189
11905 -27189 -21812 -7665 -6836 -564 -2774 -12438 -25007 1038 3790 15698 12138 -12034 -5451
11892 -5451 -8187 -27965 -48314 -23167 -5723 10613 18236 10150 18647 7721 -7680 -16512 -19258
11879 -19258 7642 42210 54665 31344 39196 31012 -3396 -23330 -24075 -27984 -15456 -7912 -43371
11866 -43371 -36270 -18862 203 -10999 -29873 -16281 -11022 -12625 -1360 -15007 -25303 -32757
11854 -32757 -12499 5886 3995 -17576 -19508 -8218 -2812 -6651 -518 16396 14497 -16888 -45460
11841 -45460 24855 47805 4872 -1526 9878 -4580 -12007 -32487 -51759 -35404 -6265 9209
11829 9209 4545 4341 -19040 -29949 -36152 -9539 26213 48863 58725 26798 3938 -21660 -22839
11816b2839J6506K542P461j0719k2812K748J1438J3956j7573n88N712J9330O518
11803A1680J2217j0453k7941R06L3535M507p445J667k210j341R207r821j423Q064
11789B1149j5317n596J581J897J4307K1858J1172j4210P110k072j1647j523j2294
11776A6415k2659J6213J8410K496j9991o761l928j4190j6907k487M781J0200M312
11763a4096j118m187k744N29j3393J6986L998J6039J9150k8139k3098J3408J5259
11750a406k5808m577J1727J1021J4568l044j4919j3814K8986K0672n234l479Q020
11737B2713q140N865l5153l317O147K9624m1k9655k1820J7462N117j7197l0908
11724e9303K8269P059k4075r655j9563J2022J7854k792L611L3012P925k807q924
$$ plain form
11816 -22839 -6333 -3791 3670 -7049 -29861 -27113 -15675 -1719 -19292 -19880 -14168 5162 11680
11803 11680 23897 13444 -14497 -13591 19944 24451 17006 18673 16463 15122 24329 14508 13085 21149
11789 21149 5832 236 1817 3714 18021 39879 51051 36841 43951 41879 30232 28709 16415
11776 16415 -6244 9969 28379 30875 10884 4123 195 -13995 -30902 -33389 -28608 -18408 -14096
11763 -14096 -15214 -19401 -22145 -21616 -35009 -18023 -14025 2014 21164 -6975 -30073 -16665 -1406
11750 -1406 -27214 -31791 -20064 -9043 5525 2481 -12438 -26252 2734 23406 18172 14693 22713
11737 22713 14573 20438 -14715 -18032 -11885 17739 17698 -11957 -33777 -16315 -11198 -28395 -59303
11724 -59303 -31034 -23975 -48050 -57705 -77268 -65246 -47392 -50184 -46573 -13561 -5636 -8443 -17367
11711a7367L443J5631j6305J1068J4673L99o447n624r723k3969m319J93Q440l734
11697c3641L2684O578j0451j8146k1896L993K647j2336M199R812N422k425n098
11684c8658R477r034L1702K5075j5629p488M232l833n216O130K8093k8631k3164
11671b6944Q480K1770Q198q272N662j9003o580J2035k0305J2650k4698j4999K3395
11658b8611K5532K3449j38l2447j5497N256K2163M2912r614k7880J202K2918j8036
11645A1209k7384j4452L1929k9049k1895r922J6805j1823M74R911l870Q809L576
11632c5682P126J5742j488k3813J6368J400j3438K4674J6076n993j8582n921j3126
11619c6657J770J6987K4917n089R792L117M2985J9812j1858j5099J2m6645k708
$$ plain form
11711 -17367 -13924 1707 -14598 -3530 11143 11542 5095 -529 -10252 -34221 -38540 -38347 -29907 -33641
11697 -33641 -957 5621 -4830 -22976 -44872 -40879 -38232 -50568 -46369 -36557 -31135 -33560 -38658
11684 -38658 -29181 -38215 -6513 18562 2933 -4555 -323 -4156 -9372 -3242 24851 -3780 -26944
11671 -26944 -18464 3306 11504 3232 8894 -10109 -16689 -4654 -24959 -12309 -37007 -52006 -28611
11658 -28611 -3079 20370 20232 -12215 -27712 -22456 -293 42619 33005 5125 6327 29245 11209
11645 11209 -16175 -30627 1302 -27747 -49642 -59564 -42759 -54582 -54108 -44197 -48067 -39258 -35682
11632 -35682 -28556 -12814 -14302 -38115 -21747 -20347 -33785 -9111 6965 972 -17610 -23531 -36657
11619 -36657 -34887 -17900 7017 1928 11720 14837 57822 77634 65776 50677 50689 4044 1336
11606A336J2117l981N761L525q348J7330K1932j7229N228q0q610l4515q741L10
11592a3965M347n414j6008J1701J3083O022K743N558K3681o123l905k4530j0255
11579a3065o730k747J7664K8432J4749M756q412L0243O985M392l432J2351k1692
11566F3494j8478N425J6156K7685O79k4436j3351k2487m9627j6958M1332Q235
11554A7669O018R75l2056k2302k6428L3789J8461K68P543J4194k6914o378m969
11541b0130L5584r381j1179q41j1239j0477M49K2402o084k2522J3013Q610J6366
11528D571M332l367O027J0719J3204K3389P961k3790j4247L032j7298j8291k0455
11515b4213O914J5626J9914J5368k1251l6663Q205J0915j6463q781P016J0117
$$ plain form
11606 1336 13453 9472 15233 18758 10410 27740 49672 32443 37671 37591 28981 -5534 -14275 -13965
11592 -13965 -9618 -15032 -31040 -19339 -6256 -234 2509 8067 31748 25625 21720 -2810 -13065
11579 -13065 -19795 -22542 -4878 23554 38303 43059 34647 64890 71875 76267 72835 85186 63494
11566 63494 45016 50441 66597 94282 94961 70525 57174 34687 -14940 -31898 9434 17669
11554 17669 23687 24662 -7394 -29696 -56124 -22335 -3874 -3606 3937 18131 -8783 -15161 -20130
11541 -20130 15454 6073 -5106 -5947 -17186 -27663 -27214 -4812 -10896 -33418 -20405 -11795 4571
11528 4571 8903 5536 11563 22282 35486 58875 66836 43046 28799 31831 14533 -3758 -24213
11515 -24213 -17299 -1673 18241 33609 12358 -24305 -16100 -5185 -21648 -30429 -23413 -13296
11503a3296N004r567L0021q102j483L90N160q80J965J4007j5666j0879J865J0200
11489H739m503j0381j4737K0142K1232K626m054k0004K1107K4769J1046j2439
11477D3543j1969j4771l5821M231K978p877j5008P481J7193j1208j6669K387j594
11464c7104j9238J1355K3177K8369K2215K1489R066Q951K482j7811p59p772K7836
11451G2256j3611k3512j3300K841K2456k1932l790j9307k3666K0961P606J0717
11439A7719J3K1408j0747k3563J1921K9480j5932l5818J474J9882P612J9159J1391
11426E3999j4687l3504K885L256L030J2294o646j3521J8410j7175J0637P932k0346
11413F564J2005J616Q792j8321j4908r073K3021J9229j2338n058j8958J7429L1230
$$ plain form
11503 -13296 -8292 -17859 12162 4060 2577 2967 8127 7247 9212 23219 7553 -3326 -1461 8739
11489 8739 4236 -6145 -20882 -740 20492 23118 19064 -940 20167 44936 55982 43543
11477 43543 31574 16803 -19018 -14787 -11809 -19686 -34694 -27213 -10020 -21228 -37897 -35510 -37104
11464 -37104 -56342 -44987 -21810 6559 28774 50263 59329 68280 70762 52951 52192 44420 72256
11451 72256 58645 35133 21833 24674 47130 25198 21408 2101 -21565 -604 7002 17719
11439 17719 17732 39140 28393 4830 16751 46231 30299 -5519 -4045 15837 23449 42608 53999
11426 53999 39312 5808 8693 11949 14979 27273 20627 7106 25516 8341 18978 26910 6564
11413 6564 18569 20185 28977 10656 -4252 -13325 9696 28925 16587 11529 -7429 10000 41230
11400D1230r047j499J5849l0830m009o462L646R061j125J3752m702P945R012J6535
11386E9356o779j2286J4803K4650L2133J7609n945j624L3464L0497L1539K3786
11374B41203K9872J5812J1147p733m5371o3247k7898l0939l3344j6165o950l5722
11362C0665r146M2040r094k6650K4677j678j0768R219K584J4859j6150n936K4703
11349F9325j1328r567J1744J867j8485M129L3137J6868K2886P774j329L417Q685
11336A39123J6328J831L1410O8596M1833M4388P8131R8134P9769N4635O1632P1460
11324G87270N4626K2731r0315j28279j42470j07697p8815o2271l5939j6564q03
11313B01474j1196m187r0j9247l4057j5715q642J2116J4848N045j7887m685j8169
$$ plain form
11400 41230 32183 30684 46533 15703 11694 5232 8878 17939 16814 30566 25864 33809 42821 59356
11386 59356 52577 40291 55094 79744 111877 129486 123541 121917 155381 185878 217417 241203
11374 241203 271075 286887 298034 290301 244930 181683 153785 122846 89502 73337 66387 30665
11362 30665 21519 63559 54465 27815 52492 50814 40046 49265 51849 66708 50558 44622 69325
11349 69325 57997 48430 60174 62041 43556 47685 80822 97690 120576 128350 127021 130438 139123
11336 139123 155451 157282 188692 257288 299121 343509 421640 519774 599543 654178 715810 787270
11324 787270 841896 864627 774312 646033 503563 395866 317051 254780 218841 202277 201474
11313 201474 190278 186091 186001 166754 132697 116982 108340 120456 135304 140349 122462 117777 99608
11300I9608J3616M665k4442J9679J3771N862J9126j399J7828J3385n681K2671
11288A98689K2858K3960J1632J2397L0028J8125M2275Q0072J00097J04780R7674
11277G42587J33882N9151l0960m4558j26928j83361j46199p7186m8704j9776J3541
11266B71489j2760k5150l573l3558m1868o804j0579k4907K0773n648l7951M03
11254H9867R772J9127K8131J4405K140j1738L637j6691M872n086L437J3969J8791
11241A74633J6997J2012J7786J29k3500J030J5720k4577j2169J36o44N2146L6292
11228B65991M8050L1109n600k6030n3622n6510n0996k2233o326m3166j6615L577
11216F7629L94j3351k8797J8497o165n05p40J4428L3131Q405O147j3912J2600
$$ plain form
11300 99608 113224 117889 93447 113126 126897 132759 151885 150486 168314 181699 176018 198689
11288 198689 221547 245507 257139 269536 299564 317689 359964 440036 540133 644913 742587
11277 742587 876469 935620 904660 860102 733174 549813 403614 326428 277724 257948 271489
11266 271489 258729 233579 230006 196448 154580 147776 137197 112290 133063 127415 89464 89867
11254 89867 99639 118766 146897 161302 163442 151704 155341 138650 143522 138436 141873 155842 174633
11241 174633 191630 203642 221428 221557 198057 199087 214807 190230 178061 178197 177553 229699 265991
11228 265991 314041 345150 339550 313520 259898 203388 152392 130159 123833 80667 64052 67629
11216 67629 68023 54672 25875 44372 38207 37702 36962 51390 84521 92926 99073 85161 97761
11203I7761J1719j3376l01J3256p735J4373j2656j126J6594l486j4808J5800R053
11190A25068k1887O615O328j1705j5624K2424j7924m8632J1513l773l5238l17
11178A6848O554P085J3552j0179Q495l146j5372M767j1163R483p000j7519J2897
11165A5302J9768K1888n705J7554j8219j8398Q456l294j3024K653K9830L4493
11153I1304p590j2716Q782K2481N536l585J2999J8294j1008n095j1983j5613j7590
11140G4216N809J5562K3090j4753k8237l5716m5909o044K1163L8223J4691Q326
11128G0421J092M272J3099J5233l529n372J3837K3439K7921J2543K4292M0798
11116B38046K0711q469j4560l567J522q642m116p996R64M074j229k057J8133J3257
$$ plain form
11203 97761 109480 96104 95803 109059 101324 115697 103041 101915 118509 115023 100215 116015 125068
11190 125068 103181 109796 116124 104419 88795 111219 93295 44663 56176 52403 17165 16848
11178 16848 23402 30487 44039 33860 42355 39209 23837 28604 17441 26924 19924 2405 15302
11165 15302 35070 56958 51253 68807 50588 32190 40646 37352 24328 26981 56811 91304
11153 91304 83714 70998 79780 102261 107797 104212 117211 135505 124497 119402 107419 91806 74216
11140 74216 80025 95587 118677 103924 75687 39971 -5938 -11982 9181 47404 62095 70421
11128 70421 71513 75785 88884 104117 100588 95216 109053 132492 160413 172956 197248 238046
11116 238046 258757 250288 235728 232161 233683 225041 220925 212929 213893 217967 216738 214681 232814 246071
11102B46071P40j5585m3844m4810j9072O774K1178j8674j5560J3661Q072k3898
11090A15053r944l444Q400O067J668J5580K5206J7922M396Q819J7696P637m252
11077B10804L1550O3827M0943M2289L8441L8747L3598l296N36K0796K6610k4983
11065E19862J9025N0940K677n050K4248J6011m7035l6410j496J1528k7456j3746
11053E13098K046l4998n7306K8562p550k9779m1534j9035l4127r94M1810K974
11041C63167k8484l7687j0356K2356K7916Q374L8425N5591M32k326M3360M6235
11029E27003N2003N2058M6061P8446P1709N6066L5464M2261J3277L0748k551K4023
11017A026568M1174Q829j0228k107K8815K455L0097L7386K2575j9367o496K1561
$$ plain form
11102 246071 246811 231226 187382 142572 123500 130274 151452 132778 117218 130879 138951 115053
11090 115053 105109 101665 110065 116132 117800 133380 158586 176508 180904 189723 207419 215056 210804
11077 210804 242354 306181 347124 389413 427854 466601 500199 496903 497439 518235 544845 519862
11065 519862 538887 589827 592504 587454 611702 627713 580678 544268 542772 554300 526844 513098
11053 513098 515144 480146 422840 451402 443852 414073 372539 353504 319377 318383 360193 363167
11041 363167 334683 296996 286640 308996 336912 345286 383711 439302 439734 437408 480768 527003
11029 527003 579006 631064 677125 755571 827280 883346 918810 961071 974348 1005096 1002545 1026568
11017 1026568 1067742 1076571 1066343 1064236 1093051 1095506 1125603 1162989 1185564 1166197 1159701 1181262
11005A181262M0533K9068Q3693R1751O2112P6825R4310O4523R9169J70992K10105
10994B204343K42257K95884L03689L16236L64322M28916N30442O41437O89098
10985F016624P74681R26011J112811J348820J747849K196637K744750L403416
10977B0271599M213280M955371N536005N728904N319035L988464J207278l152721
10969D8067215p352313r129496p899806n473573l531485k320735j580350j076378
10961I703079p98288o17140m31974l20434k45651j87625j18350m3813K7992J12284
10951G080080J92087K41825L39889M24130M77330N63464O92724P63009Q54894
10942A1629432R36722J148803J399859J693075J972247K234727K583341L121442
$$ plain form
11005 1181262 1221795 1250863 1334556 1426307 1488419 1565244 1659554 1724077 1823246 1994238 2204343
10994 2204343 2446600 2742484 3046173 3362409 3726731 4155647 4686089 5327526 6016624
10985 6016624 6791305 7717316 8830127 10178947 11926796 14123433 16868183 20271599
10977 20271599 24484879 29440250 34976255 40705159 46024194 50012658 51219936 48067215
10969 48067215 40714902 31585406 23685600 18212027 14680542 12359807 10779457 9703079
10961 9703079 8904791 8287651 7855677 7535243 7289592 7101967 6983617 6939804 6967796 7080080
10951 7080080 7272167 7513992 7853881 8278011 8755341 9318805 10011529 10774538 11629432
10942 11629432 12566154 13714957 15114816 16807891 18780138 21014865 23598206 26719648
10934B6719648L818101M857980O083385P671881R627150J1939589J4496468J6721498
10926A01935700J7823761J7232439J4445146Q106280k819018j7504318k9681178
10919A09538812k9469559k0828293j3092123q436165n709741m032249k942107
10912B5028575k193313j665479j292461j061788q88554o56028m91910l57456l03161
10903A6118425k17727q8508L2778J38210K29775K91136L59483M49775N70360P61140
10893A8644847R67306J197257J466238J774225K058938K368054K846290L587579
10885C4910734M519365N725703P289790R173754J1406641J3993283J6555871J8164712
10877A21739853J8173093J6213816J1092291J352498j2712280k7567239l2554297
$$ plain form
10934 26719648 30537749 35395729 41479114 49150995 58778145 70717734 85214202 101935700
10926 101935700 119759461 136991900 151437046 159543326 156724308 139219990 109538812
10919 109538812 80069253 59240960 46148837 37712672 32002931 27970682 25028575
10912 25028575 22835262 21169783 19877322 18815534 17926980 17270952 16779042 16421586 16118425
10903 16118425 15900698 15812190 15844968 15983178 16212953 16504089 16863572 17313347 17883707 18644847
10893 18644847 19612153 20809410 22275648 24049873 26108811 28476865 31323155 34910734
10885 34910734 39430099 45155802 52445592 61619346 73025987 87019270 103575141 121739853
10877 121739853 139912946 156126762 167219053 168571551 155859271 128292032 95737735
10870I5737735k5340582j6218311j0298820o918522m849293l500194k590046j953253
10862B4068714j548557j284020j071856q96407p02895n65214n00129m88526l77809
10853A6633301k90636k52391k13932j87738j64774j35216r0178k3589P6958J59535
10843A5511340K45725L45443M26649N37204O87544R01393J219407J652675K140990
10834B3668370K759170L550484M465460N326727N959740O199516N798626M382805
10826F2110898J377179l468650q377281j0645529r348668o541923m284656k866950
10818A7954420k004241j469205j050974q11558o43828n50490m59610l85222k97934
10809A0281358k79358k71457k32684k06325j79499j64299j57170j32767j47295
$$ plain form
10870 95737735 70397153 54178842 43880022 36961500 32112207 28612013 26021967 24068714
10862 24068714 22520157 21236137 20164281 19267874 18564979 17999765 17499636 17011110 16633301
10853 16633301 16342665 16090274 15876342 15688604 15523830 15388614 15298436 15274847 15351805 15511340
10843 15511340 15757065 16102508 16529157 17066361 17753905 18655298 19874705 21527380 23668370
10834 23668370 26427540 29978024 34443484 39770211 45729951 51929467 57728093 62110898
10826 62110898 63488077 60019427 51642146 40996617 31647949 25106026 20821370 17954420
10818 17954420 15950179 14480974 13430000 12618442 11974614 11424124 10964514 10579292 10281358
10809 10281358 10002000 9730543 9497859 9291534 9112035 8947736 8790566 8657799 8510504
10800H510504j25515j28741j48021j73006k09689k26638k13641k42175k51697
10791F791381k32401k43124k15288k02411j95912j81337j84289j54212j37770
10782E044637j13086j25948j23479j22567j38153j22138r4411r0979q8360n7041
10772C968475p0231o1780m4332m8612n3534m3572o7091n2203n7502p7057p1106
10761C321455l5420p747K0716j0881n7274k4316k9646j8802l7748k6631p498j5999
10749C070209p4460o7942o8048r4961p6892o1393p4967j02464r5134r0451j08348
10738B155149n4783k2441m2691l4536k2486n1742o2203p1349q0735q2054Q468
10727A638597M6073K5937J8803K6619J0301L1602K9472j5246q3450j39790j31635
$$ plain form
10800 8510504 8384989 8256248 8108227 7935221 7725532 7498894 7285253 7043078 6791381
10791 6791381 6558980 6315856 6100568 5898157 5702245 5520908 5336619 5182407 5044637
10782 5044637 4931551 4805603 4682124 4559557 4421404 4299266 4204855 4113876 4025516 3968475
10772 3968475 3898244 3836464 3792132 3743520 3689986 3646414 3579323 3527120 3469618 3392561 3321455
10761 3321455 3286035 3278288 3299004 3288123 3230849 3206533 3176887 3158085 3120337 3093706 3086208 3070209
10749 3070209 2995749 2927807 2859759 2764798 2687906 2626513 2551546 2449082 2353948 2263497 2155149
10738 2155149 2100366 2077925 2035234 2000698 1978212 1926470 1864267 1792918 1712183 1630129 1638597
10727 1638597 1684670 1710607 1729410 1756029 1766330 1797932 1827404 1812158 1728708 1588918 1457283
10716A457283r1549l4805m0482m0982k4661k9895j2763p497M705o395j3936l958
10704A155065m3732J610j1313m0020l1676k3244l324M97j2690l6958k9489j0059
10692I14667j2728r38k386l2610j5784q848j1723k2971j3164j753r802j2488O651
10679G76123Q401n338m8m227J4817k4253j0964J9077Q331k8492j8904J92j117
10666G33598o928O015l4048L062k645K239l6800N556Q109k0857L0956J609j8184
10653F71682j8925J7135J2852P993J5331Q457Q069j3971k0512J025J368k534o839
10640F81131K4868k062M898l0438j7413K293P916L1469K852k2708n821p437l756
10627F65792J8509R204j3006J2152q144o368k1273j3162M948J5593o764m9417
$$ plain form
10716 1457283 1365734 1330929 1290447 1249465 1224804 1194909 1182146 1174649 1179354 1172959 1159023 1155065
10704 1155065 1111333 1112943 1101630 1061610 1029934 1006690 1003366 1003863 991173 954215 924726 914667
10692 914667 901939 901001 898615 866005 850221 841373 829650 806679 793515 791762 781960 769472 776123
10679 776123 784524 779186 779138 774911 789728 765475 754511 773588 781919 753427 734523 734715 733598
10666 733598 726670 732685 698637 701699 699054 701293 664493 670049 678158 657301 688257 689866 671682
10653 671682 652757 669892 682744 690737 706068 714525 722594 708623 688111 689136 690504 687970 681131
10640 681131 705999 703937 708835 678397 660984 663277 671193 702662 705514 682806 676985 669548 665792
10627 665792 684301 693505 680499 692651 684507 678139 656866 643704 648652 664245 657481 608064
10615F08064l0479j4665m0648k2644R522K0299O805k3375N89j3469K442P72O135
10602E09348m737K8271J0247J4244P135R337j5593r865j3003j4855J8434k609
10590E36354m6791R403J4103l4205j8330R343K2671J1329J440l3949r754J3784
10578D75398Q56k4036k7282j989L1363M7671L2422K7011o142M308J8836K2679
10566F01095K8579j7162m8105n4111n0102m5972k8027l2612k0267j9725O201J9361
10554C39153R621p30J0076J6437J989k4645l094m466J0225J3340K763Q375L7664
10541D16708N072l6358l7863j9879j3597L3057L7706K2834J0781j0473p46M6481
10529D53723N0678M1447K8096K8898K0986L0517M6155P8631J10107J12283J17318
$$ plain form
10615 608064 577585 562920 522272 499628 509150 529449 536254 512879 513468 499999 502441 503213 509348
10602 509348 504611 532882 543129 557373 564508 573845 558252 548387 535384 520529 538963 536354
10590 536354 489563 498966 513069 478864 460534 469877 492548 503877 505317 471368 461614 475398
10578 475398 476254 452218 424936 422947 454310 501981 534403 561414 555272 559580 578416 601095
10566 601095 629674 612512 564407 510296 460194 414222 386195 353583 333316 313591 319792 339153
10554 339153 348774 348044 358120 374557 376546 351901 348807 344341 354566 367906 370669 379044 416708
10541 416708 421780 385422 347559 327680 314083 347140 384846 407680 418461 407988 407242 453723
10529 453723 504401 545848 573944 602842 623828 654345 700500 779131 889238 1001521 1118839
10518A118839J16931O1998K1885M591q1181j62516j29336q2427j3275L4407L8700
10507I28616M1342R4991J22572J23605J71118J96133K51330K97502K84548K55431
10497B767188J95025Q2810q0275j95541r2732J0976K1732o8396k06807l97636
10487B036344m02962k70467j82114j10592p0738n8566m9580n0169p713J412M58
10476H35313K5933L9804O9208R4553O9336M6937O2649P2164K1488n4809q6862
10465A195714j43571j29323q6815l5049m5018p0491l1502l0191k3218L145l4535
10454E69146k8853j9044j1057k7042o519n539K3846L3570k879n913k3867Q532
10442E04381j0194o336r153l3349j0571P212o410j4106j622j0992j0683M1148
$$ plain form
10518 1118839 1235770 1297768 1319653 1324244 1243063 1080547 951211 868784 855509 889916 928616
10507 928616 969958 1064949 1187521 1311126 1482244 1678377 1929707 2227209 2511757 2767188
10497 2767188 2962213 3045023 2964748 2769207 2676475 2687451 2709183 2640787 2433980 2036344
10487 2036344 1633382 1362915 1180801 1070209 999471 940905 891325 841156 833443 834855 835313
10476 835313 861246 901050 970258 1064811 1134147 1181084 1243733 1315897 1337385 1282576 1195714
10465 1195714 1052143 922820 836005 800956 755938 685447 653945 623754 600536 603681 569146
10454 569146 540293 521249 510192 483150 476631 471092 494938 528508 525629 519716 495849 504381
10442 504381 494187 487851 478698 445349 434778 441990 435580 421474 419852 408860 398177 439325
10430D39325J9147J6492q064L325K246L9705O2599J6182K4425M2430l554j7730
10418F36528l0977l4758m1486m0900j370R756k9959k2013n3345k8561l2091j7788
10406C13036k8124o5389n6881q073q626l9383k9883m8922j7324K1359K6573N3566
10394A11929N1413J2194K2971J6370q099q361K1620j6772l7727N120K5114L0837
10382B26609J2919M68K962K6480R403r938L6431L1617J5392R239J1225M5979N1045
10369D69831N69J7410J5331k3382J1728R347O614L0383K1232L579J3547K2765
10357E98954K6326O327L3255L0469L1344L8153L6952R211L4607J00478J10442
10346A056518J02605J01251J31142K16379K79291L51062M43442N47566O99252
$$ plain form
10430 439325 458472 474964 466900 470225 472471 512176 574775 590957 615382 657812 654258 636528
10418 636528 605551 570793 529307 488407 487037 496793 466834 444821 391476 362915 330824 313036
10406 313036 284912 219523 162642 154569 145943 106560 76677 27755 10431 31790 58363 111929
10394 111929 163342 175536 198507 214877 206778 198417 220037 203265 165538 170658 195772 226609
10382 226609 239528 239996 242958 269438 278841 268903 305334 336951 352343 361582 372807 418786 469831
10369 469831 470400 487810 503141 479759 491487 500834 507448 537831 559063 562642 576189 598954
10357 598954 625280 631607 664862 695331 726675 764828 801780 810991 845598 946076 1056518
10346 1056518 1159123 1260374 1391516 1607895 1887186 2238248 2681690 3229256 3928508
10337C928508Q52278R40616R37077Q28243O23738J20202r66188j851904j633950
10328C778620j013416n95723l77755k47595j60226j12794r8665j08530o8133k7236
10318I68547n3376o4921n7948o2976m2044P631J5989o965k4251l3440j9368k3864
10306F03014k1826k2172o529J9442p005R301k3037J3891j6746j886j1044k8532
10294E06871J1242M3503j0266K1320m647j6199n888k0593N787J1785L0776M3618
10282F17309O0795Q0578P7670N3767j841k4201j6318l1012l1107J3248l8003m9037
10270G11848m7502p3508k8770j4575j2725j7326k1893K2261J2523m052j2878L060
10258E16463R56m542O582J3857M5842N9155R9318R8719R4819R6669R5620J00269
$$ plain form
10337 3928508 4780786 5721402 6658479 7486722 8110460 8230662 7264474 5412570 3778620
10328 3778620 2765204 2169481 1791726 1544131 1383905 1271111 1172446 1063916 995783 968547
10318 968547 915171 850250 792302 729326 687282 694913 710902 703937 679686 646246 626878 603014
10306 603014 581188 559016 552487 571929 564924 574225 551188 565079 548333 546447 535403 506871
10294 506871 518113 561616 551350 572670 568023 551824 545936 525343 531130 542915 573691 617309
10282 617309 678104 758682 836352 890119 888278 864077 847759 816747 785640 798888 760885 711848
10270 711848 664346 590838 562068 547493 534768 517442 495549 517810 530333 526281 513403 516463
10258 516463 517419 512877 519459 533316 579158 638313 737631 836350 931169 1027838 1123458 1223727
10246A223727J17018J45450J20765J23042J43482J21586J10400Q0479P6328N4675
10236B316952J8037P796P316K6171M182J6576k6306n4626n4246q4561q5307n1784
10224B040200m1252m0454m9956o7075o5065n4069n7830l0017K2553M3249P2472
10213A772756J21086J20392J78131K58050L37096M29006N36569O56919P96103
10204E206108Q62921R41446R07503P10628K72927m54903o69050k49788K4513L6781
10194G589086k29140r89704j481960j170466p16198l98760k91368k41982j48451
10185A921057r9101n9812m0793j3026J217o96J3726k9010k4536R029M9049K5539
10173A752643M6349L9355l913k2039J1303O869J7906J7039J0661L2781P2823O1574
$$ plain form
10246 1223727 1340745 1486195 1606960 1730002 1873484 1995070 2105470 2185949 2262277 2316952
10236 2316952 2334989 2342785 2350101 2376272 2380454 2397030 2370724 2316098 2261852 2177291 2091984 2040200
10224 2040200 1998948 1958494 1908538 1841463 1776398 1722329 1664499 1634482 1657035 1700284 1772756
10213 1772756 1893842 2014234 2192365 2450415 2787511 3216517 3753086 4410005 5206108
10204 5206108 6069029 7010475 7917978 8628606 8901533 8446630 7777580 7527792 7552305 7589086
10194 7589086 7359946 6370242 4888282 3717816 3001618 2602858 2311490 2069508 1921057
10185 1921057 1821956 1762144 1721351 1708325 1709542 1708846 1722572 1693562 1669026 1678055 1727104 1752643
10173 1752643 1798992 1838347 1834434 1812395 1823698 1830567 1848473 1865512 1876173 1908954 1981777 2043351
10161B043351P0873M6700M8196L8183M9986Q0144P8977O5615O3114N2825J18330
10150B756294J60112J45448J55035J14521J31572J20626Q5628J61404K12584J72203
10140D215427J89153K23616K29498K49314K25585K46030K84662L45674L73014
10131F581973M10638M64528N52740O47138P21682Q05605Q85073J085850J346780
10122A3502007J617978J890050K239321K537767K824383L125370L482323M109143
10114C5328342M946889N779211O638057P611000Q708025J0257791J2660267J5970783
10106A07900365J9857819K4627859L0974021L8598450M5600082N0425599N3087183
10099C71071378N2227552M4268123K4276392j4160558l7919798k3237862k108675
$$ plain form
10161 2043351 2114224 2160924 2209120 2247303 2297289 2377433 2456410 2522025 2585139 2637964 2756294
10150 2756294 2916406 3061854 3216889 3331410 3462982 3583608 3669236 3830640 4043224 4215427
10140 4215427 4404580 4628196 4857694 5107008 5332593 5578623 5863285 6208959 6581973
10131 6581973 6992611 7457139 8009879 8657017 9378699 10184304 11069377 12155227 13502007
10122 13502007 15119985 17010035 19249356 21787123 24611506 27736876 31219199 35328342
10114 35328342 40275231 46054442 52692499 60303499 69011524 79269315 91929582 107900365
10106 107900365 127758184 152386043 183360064 221958514 267558596 317984195 371071378
10099 371071378 423298930 467567053 491843445 477682887 439763089 416525227 414416552
10092D14416552N617389k893134l0759572p2226706q2166916n8840351l6415863
10085A36731399k3583878j6751567j2411280r233751o965365n348051m286103
10078E8151404l563615l109241k799901k678212k593513k400064j996475j635437
10070C7374946j425650j340098j420353j573696j541862j342122j196140j073310
10062B6461715r50613q33394p16723p16471o83830o09341o04544n72163m67187
10053B0307449l81453l32681l12781l22418l19680l00920k87229k36043k31465
10044A7582779k17431k11092j98857k31503k38136k21104j81729j46243r2536
10035A5844148j01627r8872q7370q5417k5430m8030n8508j7184n252j61P4299
$$ plain form
10092 414416552 420033941 417140807 386381235 314154529 231987613 173147262 136731399
10085 136731399 113147521 96395954 83984674 74750923 67785558 62437507 58151404
10078 58151404 54587789 51478548 48678647 46000435 43406922 41006858 39010383 37374946
10070 37374946 35949296 34609198 33188845 31615149 30073287 28731165 27535025 26461715
10062 26461715 25511102 24677708 23960985 23244514 22560684 21951343 21346799 20774636 20307449
10053 20307449 19925996 19593315 19280534 18958116 18638436 18337516 18050287 17814244 17582779
10044 17582779 17365348 17154256 16955399 16723896 16485760 16264656 16082927 15936684 15844148
10035 15844148 15742521 15643649 15556279 15470862 15445432 15397402 15338894 15321710 15316458 15316297 15390596
10024A5390596J39310J51107R4507K7479J5326m0343p2863p8930n6233j04124
10014A5465832k06844l03813l50760l49288l91591l99081l95165m47182m43528
10005A2178580m00997m03192m02102l52644l24541l25644l29118l11459k69035
9996I059848k35249k74691k17970j83197k06010j91892j62110j27754j48999j67117
9986G144859j34148p6901r7112j23955r2977r9217p9213n4003m4991m1122p8396
9975F222824r3654j14564j07214j02875j66790j68297j84759j89740k15804k30366
9965D648761j84310k04477k06511k16534k03660k04121k12697k08717j79316j14438
9955B713980j11577r9676q3429n8926m0777l9966n0676n5230l3586k9845n0523
$$ plain form
10024 15390596 15529906 15681013 15775520 15802999 15818325 15777982 15705119 15626189 15569956 15465832
10014 15465832 15258988 14955175 14604415 14255127 13863536 13464455 13069290 12622108 12178580
10005 12178580 11777583 11374391 10972289 10619645 10295104 9969460 9640342 9328883 9059848
9996 9059848 8824599 8549908 8331938 8148741 7942731 7750839 7588729 7460975 7311976 7144859
9986 7144859 7010711 6933810 6836698 6712743 6619766 6520549 6441336 6387333 6342342 6301220 6222824
9975 6222824 6129170 6014606 5907392 5804517 5637727 5469430 5284671 5094931 4879127 4648761
9965 4648761 4464451 4259974 4053463 3836929 3633269 3429148 3216451 3007734 2828418 2713980
9955 2713980 2602403 2502727 2419298 2360372 2319595 2279629 2228953 2173723 2140137 2110292 2059769
9944B059769m0947l1614q4536r8618o2320m6263r554l4433m7948p4105r5673j00102
9932A333656r1541n8185o7096o3856l7086k2093r960l7227m5925k4582k7875j3719
9920H34511k0498j9350J0020j4429j8622j349M1514P384j2189j798J0019J2960
9908H28173M671J4456N0319L3963J6211K4638K2176K6461M0886M6720M4189Q4562
9896A237425J33883J11673J28478J58524J04717O7756m4064j90415k11511j02995
9886A393471q5379o2285P691J7962n804N961r606K4576o442J0051K0384L0311
9874A340891N5116k3835k1417k2487k4882j480l3067o686N016M837m014k6543
9862A241449m249P857P91O908N2124J755K754j524j2895r461J3955J2683J1278
$$ plain form
9944 2059769 2018822 1987208 1902672 1804054 1741734 1695471 1685917 1651484 1603536 1529431 1433758 1333656
9932 1333656 1242115 1183930 1116834 1052978 1015892 993799 983839 946612 900687 876105 848230 834511
9920 834511 814013 794663 804683 790254 771632 770283 811797 819181 806992 805194 815213 828173
9908 828173 832844 847300 897619 931582 947793 972431 994607 1021068 1061954 1108674 1152863 1237425
9896 1237425 1371308 1482981 1611459 1769983 1874700 1942456 1898392 1707977 1496466 1393471
9886 1393471 1308092 1245807 1253498 1271460 1265656 1271617 1262011 1286587 1280145 1290196 1310580 1340891
9874 1340891 1396007 1372172 1350755 1328268 1303386 1301906 1268839 1262153 1267169 1272006 1267992 1241449
9862 1241449 1237200 1245057 1245848 1252756 1304880 1306635 1309389 1307865 1294970 1285509 1299464 1312147 1323425
9849A323425L6099J5892k173P898k1081k7424l2395m4336j7397k3143j4551J282
9837A202096r581k1574o389N875k7684l7836M103m435k6560m6928l7747k2423
9825I70917m3201l7512P265l1521j0980J6485n664k8337k630q708j7073L349Q054
9812H20444J3293N394o449j060J7372O456J0180N2260O1911K0316J6091O5125
9800A081333P6608N5084K5126q263k9156n2726p7838q1961p4087o0348n2608m3269
9788G57895n3420o5398o7787j8116l6631n5017k1157n9361q543l296l7131k1841
9776C10197L214j2732K0804J2179l675o265N092q873L286j96Q723j2380j9896
9763B99478r406l236J351m320M742j4485j3555J0560j899k5663L745J0031j9060
$$ plain form
9849 1323425 1359524 1375416 1373243 1381141 1360060 1332636 1300241 1255905 1238508 1215365 1200814 1202096
9837 1202096 1192515 1170941 1164552 1170427 1142743 1104907 1109010 1104575 1078015 1031087 993340 970917
9825 970917 927716 890204 897469 865948 854968 871453 865789 837452 834822 826114 809041 812390 820444
9812 820444 833737 839131 832682 831622 848994 855450 865630 917890 979801 1000117 1016208 1081333
9800 1081333 1157941 1213025 1238151 1229888 1200732 1148006 1070168 988207 914120 853772 801164 757895
9788 757895 704475 639077 571290 553174 516543 461526 440369 381008 372465 369169 332038 310197
9776 310197 313411 300679 321483 333662 329987 323722 328814 319941 323227 323031 331754 319374 299478
9763 299478 290072 286836 288187 283867 288609 274124 260569 271129 269230 243567 247312 257343 238283
9750B38283m733R021K1269J4484J4119j868P460M629j6546k1915k719L8640M4222
9737C44346k448j8721K4442K0953K6091J5435k394q729N824K2127R35J1651J3351
9724D52863k257K7910J169k5531j013P030K9527L3738J3941J0766O746o53J2612
9711E66848M9751K9113K1052K3423K5124K7221K7883P2622N6871Q8719J10998
9700A099625J36246J90417K09869K44944K68122K95220K83534J71153O5286r7264
9690B867152j45390o7847j0054j3929o4449k27233l83781m05352l03538k08717
9680A036862j18674o3364l3775m3575p2349l3134l7567j4426k7881l6514k9240
9669E26363j474j6717j8668j054J5083k3910o309k265j739k7192j9402j9372o413
$$ plain form
9750 238283 233550 242571 263840 278324 292443 290575 298035 302664 286118 264203 261484 300124 344346
9737 344346 341898 323177 347619 368572 394663 410098 407704 398975 404799 426926 427861 439512 452863
9724 452863 450606 478516 479685 454154 453141 460171 489698 523436 537377 548143 554889 554236 566848
9711 566848 616599 645712 666764 690187 715311 742532 770415 843037 899908 988627 1099625
9700 1099625 1235871 1426288 1636157 1881101 2149223 2444443 2727977 2899130 2964416 2867152
9690 2867152 2721762 2653915 2643861 2629932 2565483 2338250 1954469 1549117 1245579 1036862
9680 1036862 918188 854824 821049 777474 705125 671991 634424 619998 592117 555603 526363
9669 526363 524889 508172 489504 488450 503533 479623 473314 471049 469310 442118 422716 403344 396931
9656C96931J4541J6770k6317k2404j2853j0954j634j9097j4751j6993P556k592
9644C08203l020j6332j1474j3194P104K881k347J1375K038J6898j7342J2808K2378
9631C19976P93j1301O073J0714j8681k0065k3235k7421M869j7965r746O016j168
9618B18859o28q121j4580J7925l914j1163L515l073j900K246J9397J3742m800
9605B27505j0589k5125o827o851O413R42K0351M663O683k3768K61m022K609N288
9591A97533L770j5581p704N4K2878K2936M091J1354j7386k0331j3438L203J3654
9578B05033L0320m546Q654j3281j3481j5880N684L387j1789l4872j1236R165L0101
9565A87259R428L4480k874j1614j540k435j1255j0929L3347R009j6542k2868j7547
$$ plain form
9656 396931 411472 428242 401925 379521 366668 355714 354080 334983 320232 303239 310795 308203
9644 308203 305183 288851 277377 264183 271287 274168 271821 283196 285234 302132 284790 297598 319976
9631 319976 320769 309468 315541 326255 307574 287509 264274 236853 241722 223757 214011 220027 218859
9618 218859 218231 210110 195530 213455 209541 198378 201893 198820 196920 199166 218563 232305 227505
9605 227505 216916 191791 184964 178113 184526 185468 205819 210482 217165 193397 193658 189636 192245 197533
9591 197533 201303 185722 178018 178072 200950 223886 227977 239331 221945 201614 188176 191379 205033
9578 205033 235353 230807 239461 226180 212699 196819 202503 205890 194101 159229 147993 157158 187259
9565 187259 196687 231167 228293 216679 215139 212704 201449 190520 223867 232876 216334 193466 175919
9552A75919j3293J3159k09K5138K3295o711o966j7201k9694R498J7269J1922K5478
9539B27604l345j5017k3399m841M2321N226K3814J765j7353k7540j035K6388J0627
9526B45215k7631k9411j0764K4177n053N616J8669M164N459j0821j047m743L182
9513B17012r709l1201K7604L5223q960l7222m220J0025K1344j1428j5928j959
9501A90581k3202L127N066m585j6695J528j1609Q119L870j3201j2656k9421J6686
9488A17608K2683L740P267k0885r649l208J371p573l1362k0212K7320K9366N652
9475A22118o437l5985q018J0459K6174k4105o288L0926L981J4282N434j890J2924
9462A43575q421J7475J7615L819K887l7753k7374j6667j3541Q811K2944M8396
$$ plain form
9552 175919 162626 175785 175576 200714 224009 217298 210332 193131 163437 172935 190204 202126 227604
9539 227604 224259 209242 185843 181002 223323 228549 252363 254128 236775 209235 208200 234588 245215
9526 245215 217584 188173 177409 201586 196533 202149 220818 224982 230441 219620 218573 213830 217012
9513 217012 207303 176102 203706 238929 229969 192747 188527 198552 219896 208468 192540 190581
9501 190581 167379 170506 175572 170987 154292 155820 144211 152330 156200 142999 130343 100922 117608
9488 117608 140291 144031 151298 130413 120764 117556 118927 111354 79992 59780 87100 116466 122118
9475 122118 115681 79696 71678 82137 108311 84206 77918 108844 112825 127107 132541 130651 143575
9462 143575 135154 152629 170244 174063 176950 139197 111823 95156 81615 90426 113370 161766
9450A61766J5373m6743m9193O525J7470j4022R989j6174j8449r29J4834K7374
9438A07821K3211J3060r720j1108n447n851J5092J5965p074k0852L5017J1210
9426A61324k7775q973l1890l0723R685K0336q521J9703M085L920J3970L6292j80
9413A61253j4745l517k1799j8282Q689J480J8964J2098K2021r827L954J3925M001
9400A78215R394l8894m8122P552L1958p070l7759k4776K5233n704K4265K1617
9388A35909O621l1996q281K7150J4267o320n907j0807J3395k78j6660j0677n517
9375A00899J7957L3386J398o546m2322n742K8526P656l4272R016J0629L0204j9885
9362A30904k0234M34J9885k9095k649J5088J4958j369j6526O337K1938J9664k1906
$$ plain form
9450 161766 177139 130396 81203 87728 105198 91176 101165 84991 66542 65613 80447 107821
9438 107821 131032 144092 134372 123264 117817 111966 127058 143023 135949 115097 150114 161324
9426 161324 133549 124576 92686 61963 71648 91984 83463 103166 107251 111171 125141 161433 161253
9413 161253 146508 142991 121192 102910 111599 113079 132043 144141 166162 156335 160289 174214 178215
9400 178215 187609 148715 100593 108145 140103 133033 95274 70498 95731 90027 114292 135909
9388 135909 142530 110534 102253 129403 143670 137350 131443 120636 134031 133753 117093 106416 100899
9375 100899 118856 152242 153640 147094 104772 99030 127556 135212 100940 109956 120585 150789 130904
9362 130904 110670 111104 130989 101894 99245 114333 129291 127922 111396 117733 139671 159335 137429
9349A37429j693K4162n575j8537p236N810n453J67K3747L538k0308l7574J4589
9336A13066M428j3715k8122j3424K3465L1224J862J810k8359l849K2737n120j1470
9323I4533K44q147k703J7872J3753K281Q800o431j9553j1006j8724P66K7596L62
9309I9643k8767j2292L1827L3400K232r133l8758O390k277p0J593R366p653J882
9295H7383J5405l0873P247N910r293J3006K681K442J1881N959r001J5664J3427
9282A31838R536j038k4587l7816k6358j216M1510K6590j3611n040J4200r192j6812
9269H8004j1622O205J2749J8004q260K9494K1383j194j6319k2771k616n510k2787
9256H4760k2682j1051K6068K0080m299j1500K1967j386j757J3869l828J4206P399
$$ plain form
9349 137429 135736 159898 154323 135786 128550 134360 128907 129074 152821 156359 136051 98477 113066
9336 113066 117494 103779 75657 62233 85698 116922 118784 120594 92235 88386 111123 106003 94533
9323 94533 94777 86630 83927 101799 115552 117833 126633 120202 100649 89643 70919 71685 99281 99643
9309 99643 70876 58584 90411 123811 126043 116910 78152 84542 82265 82195 83788 93154 85501 87383
9295 87383 102788 71915 79162 85072 75779 88785 91466 93908 105789 111748 102747 118411 131838
9282 131838 141374 140336 115749 77933 51575 50359 91869 118459 104848 99808 114008 104816 88004
9269 88004 76382 82587 95336 113340 105080 134574 155957 154763 138444 115673 113057 107547 84760
9256 84760 62078 51027 77095 97175 92876 81376 103343 101957 100200 114069 110241 124447 131846
9243A31846k4255R591N16o274K333j0597L371K4211j177r241P129L176k6333n386
9229I8910J4650J0166j3350N067j9560M628M0029n741k8228Q114K1041m0904j7282
9216G7540J6122R976J2186J6388J6615l794j5803m1605r62L392l5364J0007K4880
9203H9578j6172j4277J7049r768k3527n453L314K9508r540o811J0706K2432J9981
9190A07020j0394m2830k6806P053L3247K5938J3454J3221k0706j1383N569K9609
9178A22992l505j0865j3904K4396J011j446J3642R836j5528j1103K3424j872j6869
9165A20209J5715j0555L003k0069m5882j5670o43J3978L0101J2278J0469J4541
9153A27475q850q138o729q621j4494Q01J0473j1523q993k7265j8884K4571O417
$$ plain form
9243 131846 107591 117182 117698 111424 113757 103160 106531 130742 129565 120324 127453 130629 104296 98910
9229 98910 113560 123726 110376 115443 95883 100511 140540 134799 106571 114685 135726 94822 77540
9216 77540 93662 103638 115824 132212 148827 145033 129230 87625 86663 90055 54691 64698 89578
9203 89578 73406 59129 76178 66410 42883 37430 40744 70252 60712 53901 64607 87039 107020
9190 107020 96626 53796 26990 34043 67290 93228 106682 119903 99197 87814 93383 122992
9178 122992 119487 108622 94718 119114 120125 118679 132321 142157 126629 115526 138950 137078 120209
9165 120209 135924 125369 128372 108303 62421 46751 46108 60086 90187 102465 112934 127475
9153 127475 118625 110487 103758 95137 80643 81444 91917 80394 71401 44136 25252 49823 56240
9140E6240L4805M7241r921q69R202j7045K760R593j1158j3142J0453J9559K3122
9127A60840J3183k7079k5209k6659j5528K267K9986J18j1086k113o957r402j990
9114H0371L721J755r063N648J3712J4254O686k378K764K991N683J0392o224q70
9100A29442O78l380l0068J4521K3887N016k2836p059L1483L8604K2303L5749K7993
9087B66333L2103J3541M1793L9446L2348K6081N7913Q3069J16161J21563J16784
9076I47135Q0154M2721l2473j20679j75193j56602r6427p4061m6574l8685l7727
9065B91589l7335p685j7521l3743k4256J3957K7034r227J048J3521k4947R57J04
9052A93496K5335L3525N404k6791j6403J6181M5533K0130J6012K1276L85r888
$$ plain form
9140 56240 91045 138286 128365 127496 136698 119653 122413 132006 120848 107706 118159 137718 160840
9127 160840 174023 146944 121735 95076 79548 81815 111801 111919 100833 98720 91763 82361 80371
9114 80371 84092 85847 76784 82432 96144 110398 117084 114706 117470 120461 126144 136536 130312 129442
9100 129442 130120 126740 96672 111193 135080 140096 117260 110201 141684 180288 202591 238340 266333
9087 266333 298436 311977 353770 393216 425564 451645 509558 592627 708788 830351 947135
9076 947135 1027289 1070010 1037537 916858 741665 585063 488636 414575 368001 329316 291589
9065 291589 254254 246569 229048 195305 171049 185006 212040 202813 203861 217382 192435 193392 193496
9052 193496 218831 252356 257760 230969 214566 230747 276280 296410 312422 333698 334083 324195
9040C24195J2432K4888M3308O1796R8437R3689R3866J17705J67949J76663K20163
9029A435091K30723K40468J48055K0561k38466m03127l67762k52119j55075j31959
9019E26390o0142n1961m3567j0507j3446m5261j0503Q775j9068k6495n472O690
9007B55433k0698k2329p208j60K1390K3613J4314j229J0805Q845j6123j64K980
8994B69469o246J7484K7842L7o970K3564N4467K1344K7659L9173M5693M9768P6152
8981F39436J01819J06492Q3148J7333n0965j10999j66544j23673p4615q1298j9669
8970C20465J0875l2550j9732j4137j2540k9759j3474R596R454p084N753R221l0597
8957B05491Q443J5638L3327K8936J71l3108R145J2149j4570J3222p80k430k4922
$$ plain form
9040 324195 336627 361515 404823 466619 565056 658745 752611 870316 1038265 1214928 1435091
9029 1435091 1665814 1906282 2054337 2074898 1836432 1433305 1065543 813424 658349 526390
9019 526390 466248 414287 370720 360213 346767 301506 291003 299778 280710 254215 248743 255433
9007 255433 234735 212406 205198 205038 226428 250041 264355 263126 273931 282776 266653 266489 269469
8994 269469 263223 280707 308549 308586 301616 325180 379647 400991 428650 467823 513516 563284 639436
8981 639436 741255 847747 930895 948228 897263 786264 619720 496047 421432 340134 320465
8970 320465 331340 298790 279058 264921 252381 222622 209148 218744 228198 221114 226867 236088 205491
8957 205491 213934 229572 262899 291835 292006 258898 268043 280192 265622 278844 278064 275634 250712
8944B50712j3070J3256L2688k1984l4576l2265j0938m0801k4552k8384m8298j4617
8932B7171j2405J1130J6206j3908K200M6884K4749J1473K384q038l460K8893J01
8919A33380R475M282q956O433j3347j19J3752L344p468j8643K173K2851J0051
8906A57208K3282k64l740J2042k949Q340J2337J2767J7832j2214l224l5176k4204
8893A62037M599J1242J6092O233j0808k1600l7907k6770l413N127l392J5670K844
8880A19954n366L785l128k7269k6730Q981K6495O114O682P638M708J1979L4744
8867A68587N738j3556j6003j1605J1221J8375n309J2309L7744n062l4626l315
8855A64498l878M6K3252J7235K2797l749J457J2032r57k783P322k1502k2062j0118
$$ plain form
8944 250712 237642 250898 283586 261602 227026 194761 183823 143022 118470 90086 41788 27171
8932 27171 14766 25896 42102 28194 30394 77278 102027 113500 115884 107846 104386 133279 133380
8919 133380 142855 147137 138181 144614 131267 131148 144900 148244 140776 122133 124306 147157 157208
8906 157208 180490 180226 176486 188528 185579 193919 206256 219023 236855 224641 221417 186241 162037
8893 162037 166636 177878 193970 200203 189395 167795 129888 103118 99705 104832 101440 117110 119954
8880 119954 114588 118373 115245 87976 61246 70227 96722 102836 109518 117156 121864 133843 168587
8867 168587 174325 160769 144766 133161 144382 162757 157448 169757 207501 202439 167813 164498
8855 164498 160620 160666 183918 201153 223950 220201 221658 233690 232733 229950 237272 215770 193708 183590
8841A83590j530j2465j2556Q67j699J0389J2187L4866L5622q265M861p539J7949
8828B56277P1753L4792L5230O2393N9860N3255N992K110L7475L7237L6099J8483
8816G10956P125j2136j840n557l4501k5774r432J3209j6478r032j6277k8709n3693
8803E17861j7061l7105j4416k6646n1661k6624j3783j6774k268q805k1645j4657
8791B66416o641l0948Q327N229K1611j077J6694M6674M7308K4897M2146O8718
8779E09354R8227J31241R1840O0744P5066Q8807O6091K5652L8763J5261K4373
8768A225419M6838J6276J144N128J7988m71j4205l0715m9757q2020p2659k1895
8756A041071l6095o1525m4362l9907k8947n3378n5045k2638j6628M350Q234m1928
$$ plain form
8841 183590 182060 169595 157039 157906 156207 166596 178783 213649 249271 241006 245867 238328 256277
8828 256277 328030 362822 398052 460445 520305 573560 579552 581662 619137 656374 692473 710956
8816 710956 718081 705945 704105 698548 664047 638273 628841 642050 625572 616540 600263 571554 517861
8803 517861 500800 463695 449279 422633 370972 344348 330565 313791 311523 302718 281073 266416
8791 266416 259775 228827 237154 242383 263994 262917 279611 326285 373593 398490 440636 509354
8779 509354 607581 738822 830662 891406 966472 1055279 1121370 1147022 1185785 1201046 1225419
8768 1225419 1272257 1288533 1289677 1294805 1312793 1312322 1298117 1267402 1217645 1135625 1062966 1041071
8756 1041071 1004976 943451 899089 859182 830235 776857 721812 699174 682546 686896 695130 653202
8744F53202j0177J6292J0095L140O0205M2656K4044M9387M7190L3808J6009K5182
8732I71033M5570O1030Q7628J33702J40291J10923R4646R1194P2796L8073K4711
8721A871597J8896n535k0437N998K2123N7085P3107Q4987R1114R9088O6870N0262
8709B415155Q4172J00256J21234J64315K07551K44627K55687K78164L40018M12148
8699D623327N20334O28611P79228R12150J091675J254168J409864J621317J829919
8690A4670593J984227K160364K497084K959085L589705M401620N604996P196148
8682D5063822R162059J1695199J4947740J8214475K0401836K1050382J9872260
8675A60407773J5411611M959620j4009870l3455612l7159445k7213971j6812688
$$ plain form
8744 653202 643025 659317 669412 672552 732757 775413 799457 848844 896034 929842 945851 971033
8732 971033 1016603 1077633 1165261 1298963 1439254 1550177 1644823 1736017 1808813 1846886 1871597
8721 1871597 1890493 1884958 1864521 1870519 1892642 1949727 2022834 2107821 2198935 2298023 2364893 2415155
8709 2415155 2499327 2599583 2720817 2885132 3092683 3337310 3592997 3871161 4211179 4623327
8699 4623327 5143661 5772272 6551500 7463650 8555325 9809493 11219357 12840674 14670593
8690 14670593 16654820 18815184 21312268 24271353 27861058 32262678 37867674 45063822
8682 45063822 54225881 65921080 80868820 99083295 119485131 140535513 160407773
8675 160407773 175819384 180779004 166769134 133313522 96154077 68940106 52127418
8668E2127418j0403577o815743m629161l210162k314098j737021j302417j032318
8660B0682921q31611o36996m97775m11265l40723k86296k04958m5503J23992M11220
8650A7963006O50758R30731J279740J624823J956819K348725K764354L138458
8642C2657414L435370L647199M127617M961655O019895P408997R557265J2467749
8634H4283161J5849076K0349183K6779804L4119249L9289236M1637354M1637687
8627C03944750L6501145K2934916j2742586o8151406q1426211n9755503l6489026
8620A04816079k2296441j4506795r811617o779678m871574l609360k780643k244551
8612C7915420j843827j513222j305497j317008j300503j334407j283357j009996
$$ plain form
8668 52127418 41723841 34908098 30278937 27068775 24754677 23017656 21715239 20682921
8660 20682921 19851310 19214314 18716539 18305274 17964551 17678255 17473297 17427794 17551786 17963006
8650 17963006 18613764 19544495 20824235 22449058 24405877 26754602 29518956 32657414
8642 32657414 36092784 39739983 43867600 48829255 54849150 62258147 71815412 84283161
8634 84283161 100132237 120481420 147261224 181380473 220669709 262307063 303944750
8627 303944750 340445895 363380811 350638225 282486819 201060608 141305105 104816079
8620 104816079 82519638 68012843 58201226 51421548 46549974 42940614 40159971 37915420
8612 37915420 36071593 34558371 33252874 31935866 30635363 29300956 28017599 27007603
8604B7007603p54920n19326l07870r7465J09915L66279N65000P38905R19431J101070
8594B9128622J251124J357805J521041J822139K352568L083496L987250N239319
8586D9743364O783613Q696102J1215577J4244595J7011840J8594884J8732978
8579A45022953J6973088J1570575k26238j9295936l4171676l2750175k2351299
8572F4771292j3688860q634492n761262l989089k819083k107467j595053j274913
8564B4901073j067340r19439p84055p34831p62604p48816p47538o79154o02647
8555A7854649m67183l95026k95257k07362j63536k04370k63424l20382l77050
8546A5161059m06158m39806m60033m81422m39482l89858l78883l48859l57337
$$ plain form
8604 27007603 26252683 25733357 25425487 25328022 25437937 25804216 26369216 27108121 28027552 29128622
8594 29128622 30379746 31737551 33258592 35080731 37433299 40516795 44504045 49743364
8586 49743364 56526977 65223079 76438656 90683251 107695091 126289975 145022953
8579 145022953 161996041 173566616 173340378 154044442 119872766 87122591 64771292
8572 64771292 51082432 42447940 36686678 32697589 29878506 27771039 26175986 24901073
8564 24901073 23833733 22914294 22130239 21395408 20632804 19883988 19136450 18457296 17854649
8555 17854649 17387466 16992440 16697183 16489821 16326285 16121915 15858491 15538109 15161059
8546 15161059 14754901 14315095 13855062 13373640 12934158 12544300 12165417 11816558 11459221
8537A1459221l21699l06992k88166k79116k69542k49746k20875k05172j89074
8528I128839k16006j99368j93011k08854j99224j32131j04124j20915r1831r0574
8518G572801j13230p9213q7202p0311m3256n8987n8390m0658n0260l8367m4136
8507F888791n4641n4522n084J9410K1863n035p3091j21895j83977k14420k58139
8496E959260k47690k17026k33409k20897j79357j79415j69624j27043j45029j51826
8486D087944j63229j47638j79470j44107j14384q0206r4171q1986m0541o8752
8476B973460o2852l1741l3789k1305J4196p863m1578r1567q0000k5061P585k498
8464B596987j4589r687n5656o0645l4731q7332p8106m8302m1274k1848n471n747
$$ plain form
8537 11459221 11137522 10830530 10542364 10263248 9993706 9743960 9523085 9317913 9128839
8528 9128839 8912833 8713465 8520454 8311600 8112376 7980245 7876121 7755206 7663375 7572801
8518 7572801 7459571 7380358 7293156 7222845 7179589 7120602 7062212 7021554 6971294 6932927 6888791
8507 6888791 6834150 6779628 6774544 6793954 6815817 6810782 6737691 6615796 6431819 6217399 5959260
8496 5959260 5711570 5494544 5261135 5040238 4860881 4681466 4511842 4384799 4239770 4087944
8486 4087944 3924715 3777077 3597607 3453500 3339116 3258910 3164739 3082753 3042212 2973460
8476 2973460 2910608 2878867 2845078 2823773 2837969 2830106 2788528 2696961 2616961 2591900 2599485 2596987
8464 2596987 2582398 2572711 2517055 2456410 2421679 2334347 2256241 2207939 2166665 2144817 2139346 2133599
8452B133599l022p2224j03547j23595p7984o6447p4792r6628p1427n7401n3416
8441A333116l0820k955j8569k552k5102o3562p525j7337j0987j7153q812k3098
8429A104644q875J8194J8269j0515J6869M7937M2728O378k2419m9703l5437Q025
8417A136095n479k0383J2654J2467m0l0332m0087k0354J7562J0859j0174q554
8405A054234K3269k5942m1454N061j7696k2226k150K818j0668Q176O474p940J4938
8392I86894J1112p25l766N679K571n931Q212l834k8703j9618j445n454K5528J5570
8378I86090l2994j6763N88K4159O539R548K634j5842O941r018l5602l0090k3545
8365H72645N780L95k2005q389j4434p728j5369q227j549k5275k4306j6376k5318
$$ plain form
8452 2133599 2130577 2058353 1954806 1831211 1753227 1686780 1611988 1515360 1443933 1386532 1333116
8441 1333116 1302296 1299341 1280772 1278220 1253118 1189556 1182031 1164694 1153707 1136554 1127742 1104644
8429 1104644 1095769 1113963 1132232 1121717 1138586 1186523 1229251 1235629 1213210 1163507 1128070 1136095
8417 1136095 1130616 1110233 1122887 1135354 1135314 1104982 1064895 1044541 1062103 1072962 1062788 1054234
8405 1054234 1077503 1051561 1010107 1015168 997472 975246 973096 975914 965246 973422 979896 971956 986894
8392 986894 998006 997281 993515 999194 1001765 995834 1004046 1000212 971509 951891 950446 944992 970520 986090
8378 986090 953096 936333 936921 961080 967619 977167 979801 963959 970900 961882 926280 896190 872645
8365 872645 878425 878820 856815 848426 833992 826264 810895 802668 801119 775844 751538 735162 709844
8352G09844j9324k183K3294K4612k012j2475k4139L959N690M766L282O316j4131
8339G07499M163m134j0187j5872k186k0977k1696O839L3833r568j3465l7805J6854
8326F33298J8909P41J5144K4165R236J950j4732k9194m1444k8373j4297l4190
8314E41213m5226m3960m0756J2509N619j3180j7834j5294j2643O425K1152j1843
8302C86182l192L0526K98o728O20l727j5j1399j0268J161K474J1598j2688J678
8288C86520j1970J7903L1554Q408K4791j9835O72j3849J3033K9469N3515M4266
8276E64477K9639P1080Q5122J07614J17651J15699J17433R2453J7731p7438j67029
8265A074432k10629j51505j03334q2181m3374l7409j5099m48k6634m1518k0147
$$ plain form
8352 709844 690520 688337 711631 736243 734231 721756 697617 701576 707266 712032 715314 721630 707499
8339 707499 711662 707528 697341 681469 679283 658306 636610 643449 677282 667714 654249 616444 633298
8326 633298 652207 652948 668092 692257 701493 703443 688711 659517 618073 589700 575403 541213
8314 541213 495987 452027 411271 423780 429399 416219 398385 383091 370448 376873 398025 386182
8302 386182 382990 413516 413814 407086 407706 403979 403964 392565 382297 383458 385932 397530 384842 386520
8288 386520 374550 392453 424007 432415 457206 437371 438043 424194 437227 466696 520211 564477
8276 564477 594116 665196 750318 857932 975583 1091282 1208715 1301168 1318899 1241461 1074432
8265 1074432 863803 712298 608964 526783 483409 446000 430901 430453 403819 362301 342154
8254C42154K9859L548Q1j9719k1637O937K942K3605K8956K2745J8696Q226j9177
8241D27216K6191o591K128K0987R535O814n560j3988J6913L5665L6660P3855P2118
8228G01943R4797J01612J41117J67664K14946K33167J81860K07095J17421r358
8218B152264l01115m32868l13922k03692j64848r9692r1704m8619k8813J0504
8208D77495k1123j5991n061J4612R674j864j9627j3439j5127m4615k7314K9152
8196C66772J0334k8016l4434J6593K8626J7842K9215j1715l4714K6824J2056K1354
8184D20737K5172L0082k911J9876N8351K7035K3864K2467P2398J34401J41497
8173I72969R2563M5360J5681q5167j83873j76701r6734n5852n7754o8417l2284
$$ plain form
8254 342154 372013 375561 375642 355923 334286 341223 344165 367770 396726 419471 438167 446393 427216
8241 427216 453407 446816 448944 469931 479466 486280 480720 466732 483645 519310 555970 629825 701943
8228 701943 796740 898352 1039469 1207133 1422079 1655246 1837106 2044201 2161622 2152264
8218 2152264 1851149 1418281 1104359 900667 735819 636127 544423 495804 466991 477495
8208 477495 456372 440381 435320 449932 459606 457742 438115 424676 409549 364934 337620 366772
8196 366772 377106 349090 314656 331249 359875 377717 406932 395217 360503 387327 399383 420737
8184 420737 445909 475991 473080 492956 551307 578342 602206 624673 697071 831472 972969
8173 972969 1065532 1110892 1126573 1041406 857533 680832 584098 528246 470492 402075 369791
8162C69791l3490k1005r516R53m549p685l648K4547J6533Q859j2051k7711k6732
8149B74296o148m69j0850k014j4444k6840K0136J2449P260R848k2250k5458o98
8136B14818K1502M148R883j7298j6118j5144l1680p637K7801K2564Q72J2395r236
8123B16870k7419q794J7349K6967Q908j377j6136j4222k826r33J6068R550k8077
8110A95928M689J3067K3532k4533k8389k541k5549J226K6508M586n832k7499J17
8097A55310J3971J4435L526l6533k5466O291K562L120Q363J4064L008J2121Q883
8084A83655j0978k051j4012j8090p675K625P507K9068R686k8209K135p540j1857
8071A34264j2304J8634L8007M104l5466j6788M870L0143J3579j3767o766k4809
$$ plain form
8162 369791 336301 315296 305780 306733 302184 294499 290851 315398 331931 340790 328739 301028 274296
8149 274296 268148 267679 256829 254815 240371 213531 233667 246116 253376 263224 240974 215516 214818
8136 214818 236320 240468 250351 233053 216935 201791 170111 162474 190275 212839 213711 226106 216870
8123 216870 189451 180657 198006 224973 233881 232504 216368 202146 199320 198387 214455 224005 195928
8110 195928 200617 213684 237216 212683 184294 181753 156204 157430 183938 188524 182692 155193 155310
8097 155310 169281 183716 187242 150709 125243 131534 134096 137216 145579 159643 162651 174772 183655
8084 183655 172677 170626 156614 138524 130849 133474 140981 170049 179735 151526 153661 146121 134264
8071 134264 121960 140594 178601 182705 147239 130451 135321 165464 179043 165276 158510 133701
8059A33701n76j2252k4403M2054K5265P608J1450J0163m4920k5851k6772j7152
8047G8315j2900j0777k459M0508J6644J9536j760j0008K9247J3827l5575j8384
8035A06214P044J0313l270j0043l161K4425M71k3902j4004K5234K5184j4679j6212
8022A13614p90l27j0670p620m133M2450K3737P33k9753l3424N802k910j4638R622
8008I1693J5119n762k0210j7015J1196J2094j2049o935L6209P617p739j6468j5496
7995G2254K112K4054K4002N745N38J098J2061j6332j2951j8428k218J1631p646
7982I5920M904n963k0970k4653j1747M4243N273P554l125N509n462l909J9642
7969A07216L28L582m105K244j2617j11P248m509j7925K5669L5155j2216O662K279
$$ plain form
8059 133701 133125 120873 96470 138524 163789 171397 182847 193010 148090 122239 95467 78315
8047 78315 65415 54638 52179 92687 109331 128867 127107 117099 146346 160173 124598 106214
8035 106214 113258 123571 120301 110258 107097 131522 131993 108091 94087 119321 144505 129826 113614
8022 113614 112824 112497 101827 94207 90074 132524 156261 156994 127241 93817 99619 96709 82071 91693
8008 91693 106812 101050 80840 63825 75021 87115 75066 68131 104340 111957 104218 87750 72254
7995 72254 74366 98420 122422 128167 128705 129803 141864 125532 112581 94153 91935 103566 95920
7982 95920 100824 94861 73891 49238 37491 81734 87007 94561 91436 96945 91483 87574 107216
7969 107216 107544 111126 107021 109265 96648 96537 103785 99276 81351 107020 142175 129959 136621 138900
7955A38900n76L132j5540o748Q015j231k4732o842K1728Q569P384J171k563k6887
7941A03780j9103J7297Q957l0581L0219J5758k7104j7653J8520q156j1697J3948
7929I4185o192o35K643J4822K2649L1457R0k3871k1998k4332L73J2507J5631l714
7915A13615k50p589R552J9409m816k3713j4236p983n442J1121K4587M6265q076
7902A52444r792j2993k6437q083j1516J7960q45J1734j1134k415j0834k452j874
7889H3763m352p904j4757p870l1706J9193J7354J8123k8098K816J0690j0763J2158
7876E8647O04n877K5029J6197j3903q014n760k1447L107j0753P615m901J643l72
7862D1815k672J8201L2418N580j4304l934N781q27N692j490J9004L2022j5745
$$ plain form
7955 138900 138324 141456 125916 119168 127183 125952 101220 94378 116106 124675 132059 133230 130667 103780
7941 103780 84677 101974 110931 80350 110569 126327 99223 81570 100090 91934 80237 94185
7929 94185 87993 87358 90001 104823 127472 158929 159019 135148 113150 88818 89191 101698 117329 113615
7915 113615 113365 105776 115328 134737 129921 106208 91972 83989 78547 89668 114255 160520 152444
7902 152444 142652 129659 103222 95139 83623 101583 100738 112472 101338 98923 88089 85637 83763
7889 83763 79411 71507 56750 48880 17174 36367 53721 71844 43746 46562 57252 46489 58647
7876 58647 59251 53374 78403 94600 80697 72683 66923 45476 48583 37830 45445 40544 42187 41815
7862 41815 39143 57344 89762 95342 81038 77104 82885 82058 87750 86260 105264 137286 121541
7849A21541j7415j2444j3260j7191j0582K3973N228j3870k8801N152k505k910
7837C6916O049J0959j1286P234J6482n073j9471M084K827n148l608l0936J2238
7824B1267K9758R151r25j2668Q368J5996N527j6013j3539n279j251J8053J5194
7811G3639M12j0839Q538J2946L151J1818L0029J505o685J1693P110k2054j496
7798A19767Q026l1493n3116K4381K904j2050r599j3503M069q682J5874M235L180
7785E3993J2994M629k5231k7201Q223R33o234R311N473L2389j6428m232p064j9591
7771B1964l154j81q290P328n170k2283K3619J1724J8573J0296J2375j8401p308
7758D1092n204r951J7133P880j6272k1142J8441Q54J1812k925J45J778J0504J7434
$$ plain form
7849 121541 104126 91682 78422 61231 50649 74622 79850 65980 37179 42331 39826 36916
7837 36916 42965 53924 42638 49872 66354 61281 41810 45894 48721 43573 39965 9029 21267
7824 21267 51025 60176 59251 46583 54951 70947 76474 60461 46922 41643 40392 58445 73639
7811 73639 74051 63212 71750 84696 87847 99665 129694 131199 124514 136207 143317 121263 119767
7798 119767 127793 96300 43184 67565 70469 58419 48820 35317 39386 30704 46578 50813 53993
7785 53993 66987 71616 46385 19184 27407 28340 22106 31417 36890 69279 52851 48619 41555 21964
7771 21964 18810 18629 10339 17667 12497 -9786 13833 25557 44130 54426 66801 48400 41092
7758 41092 35888 25937 43070 50950 34678 13536 31977 32831 44643 41718 41863 43641 54145 71579
7744G1579K610l2959j0933M899M257J0443k0042r640j4042P352P185J8653K7864
7731F7226l184p306J2533l2091k2437K5133J1157J6010P690k2924k7321j3818
7719A0668J3034o549j428m612L288K2616o774m71J8511j5204q985n758Q70K4782
7705D3988j1845N325J7067r85M221o688J1548k0128k84l400j2259Q176P427p110
7691C5053k4383J0679J3941j7714J72R058j1297k364J9749M0273p610m476J6878
7678G7959k133j7935P570R341k2879J120j660N033P188j6875j6776O238n841j9071
7664A1279j406M300O224J9184J9010J0951N96n562J5535l5909k3167Q433K0675
7651E0143j2625k6245j0828j20J4273q213j5441J1553m660M486m077K8670j0656
$$ plain form
7744 71579 74189 41230 30297 35196 39453 49896 29854 20214 6172 13524 20709 39362 67226
7731 67226 64042 56736 69269 37178 14741 39874 51031 67041 74731 51807 24486 10668
7719 10668 23702 17153 15725 11113 14401 37017 30243 29772 48283 33079 24094 18336 19206 43988
7705 43988 32143 37468 54535 53550 57771 51083 62631 42503 42219 38819 26560 34736 42163 35053
7691 35053 10670 21349 35290 17576 17748 26806 15509 13145 32894 73167 65557 61081 77959
7678 77959 75826 57891 65461 74802 51923 53043 51383 56416 63604 46729 29953 36191 30350 11279
7664 11279 9873 14173 20397 39581 58591 69542 70138 64576 80111 44202 21035 29468 50143
7651 50143 37518 11273 445 325 14598 6385 -9056 2497 -2163 2323 -1754 26916 16260
7638A6260P161K4496J3700N630j5074j5877m355J2559k0245p960P335q815n2226
7625c7411J1137K5470M658K1725J9948m483n676J6663J4338J4994O053j1595j6366
7612E9455l0190J0334K3279l667k9081J2029J434j5500K9604R137M43k9670j0643
7599B6964N386J2894Q404k1404k3580O917K6521K3241j0280k253m9971o441K0392
7586A6790j2441j0258q163L1727m556m977n90J6149J6943j2439l4766J9869R223
7573B2511j321j3080j2365o730M515k362Q378J1937Q624K2497K920q629o002M0941
7559G1834j5637m4052r544J8292J0967j5400J7086L0628K1774j6556o767K7923
7547I0548p893n8978k3159K1937O545r857k6572L656M0412J6677J8658R851j0406
$$ plain form
7638 16260 23421 47917 61617 67247 52173 36296 31941 44500 24255 16295 23630 14815 -37411
7625 -37411 -26274 -804 3854 25579 45527 41044 35368 52031 66369 81363 87416 75821 59455
7612 59455 29265 39599 62878 59211 30130 42159 43593 28093 57697 66834 67277 37607 26964
7599 26964 32350 45244 53648 32244 8664 15581 42102 65343 55063 52810 2839 -3602 16790
7586 16790 4349 -5909 -14072 17655 13099 8122 7532 23681 40624 28185 -6581 13288 22511
7573 22511 21190 8110 -4255 -10985 -6470 -8832 -454 11483 20107 42604 45524 36895 30893 71834
7559 71834 56197 12145 2601 20893 31860 16460 33546 64174 85948 69392 62625 90548
7547 90548 82655 23677 518 22455 29000 19143 -7429 -3773 36639 53316 71974 81825 71419
7534G1419j6310p896p850l095L5617K2865j7451l4151l660J1853r641l6019j9476
7521a3795J1563K8385k1062j1031R126O058K733K685N352K189r910J605J6591
7508C0489m564J9638M381J065J5714q019l1746P903M008o347J439L2520K4949
7495I1430l0357k465k1134j0537j1044R035K9195k6106j4552N145p730r097J02
7482A885n333K0567L1858j366J4916j9706J3744J0414m264n4794k1957n001J8356
7469f81M372j2522J4418L545J9636r942j3732N756K5076K3719n84k3996j85l1967
7455B913k3498J0185K8528j2311R103K3988k544m559P044o041L1R359J1565j2344
7441D1419k1451l316J2099j5717q973j3193j4833N113J248j7141r586M7357L1408
$$ plain form
7534 71419 55109 47213 39363 36268 71885 94750 77299 43148 39488 51341 41700 5681 -13795
7521 -13795 -2232 26153 5091 -5940 3186 9244 11977 14662 20014 22203 12293 13898 30489
7508 30489 25925 45563 49944 51009 66723 58704 26958 34861 38869 32522 33961 66481 91430
7495 91430 61073 58608 37474 26937 15893 24928 54123 28017 13465 18610 10880 1783 1885
7482 1885 -3448 17119 48977 47611 62527 42821 56565 66979 62715 7921 -14036 -19037 -681
7469 -681 3691 -8831 5587 9132 28768 18826 5094 10850 35926 59645 59061 35065 34880 2913
7455 2913 -20585 -10400 18128 5817 14920 38908 36364 31805 38849 32808 32839 42198 53763 41419
7441 41419 19968 16652 28751 13034 4061 -9132 -23965 -18852 -17604 -34745 -44331 3026 34434
7428C4434o639M478J2724L421j0108j7170j6713J9000K2787m317l405m099j7642
7415A6751k4310M073K7847K4446J443k3620l6390P240K6738L5749L741j1083n451
7402D7174j4792j0066m413M632N229J0196k810l460j2521j2947Q708n929j6357
7389g356N185N021J5816k78m459M968k013q80L079k266O634q357j1890q841K1436
7374A5799k124J2798L1776J2774k9699k2175j025J3607p757K1209j3101n083N18
7361B7517j0031J8722j2124j1800o077k6176J5224k717J1171K313O521j6708M63
7348c702j3449r06K5812K1140M8376K1254j3195L820k3117m9198J266N893M71
7335B4465k3719j4794J5366j2955j4497K8460J6995j6477j2516J1699J2064J2175
$$ plain form
7428 34434 27795 32273 44997 48418 38310 21140 4427 23427 46214 41897 38492 34393 16751
7415 16751 -7559 -3486 24361 48807 50250 26630 -9760 -2520 24218 59967 63708 52625 47174
7402 47174 32382 22316 17903 22535 27764 37960 35150 31690 19169 6222 14930 9001 -7356
7389 -7356 -2171 2850 18666 18388 13929 18897 16884 16004 19083 16817 23451 15094 3204 -5637 15799
7374 15799 13675 26473 58249 71023 41324 19149 18124 31731 23974 45183 32082 26999 27517
7361 27517 17486 36208 24084 12284 6207 -19969 -4745 -7462 3709 6022 12543 -4165 -3702
7348 -3702 -17151 -18057 7755 28895 77271 98525 85330 89150 66033 16835 18101 23994 24465
7335 24465 746 -14048 1318 -11637 -26134 2326 19321 2844 -9672 2027 14091 26266
7323B6266l318M196Q279P054p21l4969j0712K423K338J0642R936J1873n079p340
7309B0868K509J389J0693k5381k0547R745K5370m2234l1607L0742K2819l80j0884
7296f898L754J2947K9176J821k5824O420J8279M084J7383j0798k0169p363J8407
7283D1219l544l1217J781j922k2313J3049J3569J2238L825k4653j4882n055J3559
7270d346P030K0969J4148J4109p096k078K863n207j7872R68N136K298M18k4594
7256F746j4297M224J4931j1433K707k6879K15J5521j920j32L8336j2378k3116
7243g475L085n0J3129J2168J0770r33l0906P716l0487j1939r83n026J852K6254
7229a2825K1900K229L7838J9654j6786r13j3506j3596J8737r242n876j7577k2196
$$ plain form
7323 26266 22948 27144 35423 42477 41756 6787 -3925 -1502 836 11478 21414 33287 28208 20868
7309 20868 23377 24766 35459 10078 -10469 -724 24646 -17588 -49195 -18453 4366 3986 -6898
7296 -6898 -3144 9803 38979 40800 14976 21396 39675 43759 61142 50344 30175 22812 41219
7283 41219 37675 6458 8239 6317 -15996 -2947 10622 22860 26685 2032 -12850 -17905 -4346
7270 -4346 2684 23653 37801 51910 44814 42736 45599 40392 22520 23488 28624 30922 31340 6746
7256 6746 -7551 -3327 11604 171 2878 -24001 -23786 -8265 -10185 -10317 28019 15641 -7475
7243 -7475 -4390 -4440 8689 20857 31627 30694 -212 7504 -22983 -34922 -35905 -40931 -39079 -12825
7229 -12825 9075 11304 49142 68796 52010 51097 37591 23995 42732 33490 27614 10037 -12159
7216a2159L6843L1711j4285n509O369j4649j9726m103J3403J7102k222J8292K372
7203E3439M460k6j181j0871l8486j8364J9690J5629j2404R381L2412l056l2625
7190A7998k5183K801J7138J5472k3540p879J945L018p315j7048L5339K7800j5710
7177B4836l7597m4638l596N4188L2136n321m801j4668J0244Q197k1680r445K1187
7164I042J0002K9319K5126j9048k3861k6544J5703J4924K6088n827j7021J881
7152C9784o945l5936m2949L91L345J0817Q310P648J9590P977N138L7658j3633
7139D1195l1380P407J2943j2470j2592j9778j2998J022j3418L9782K7862J778
7127B9353J623k1217J0792k0166l7258J6506J6563J4218J9994P679n721k850k7803
$$ plain form
7216 -12159 24684 56395 42110 36601 42970 28321 8595 4492 17895 34997 32775 51067 53439
7203 53439 57899 57873 56692 45821 7335 -11029 8661 24290 11886 21267 53679 50623 17998
7190 17998 -7185 -4384 12754 28226 4686 -3193 -1248 1770 -5545 -22593 12746 40546 24836
7177 24836 -12761 -57399 -60995 -6807 25329 20008 15207 539 10783 18980 -2700 -12145 9042
7164 9042 19044 48363 73489 54441 30580 4036 19739 34663 60751 54924 37903 39784
7152 39784 32839 -3097 -46046 -45655 -42310 -31493 -23183 -15535 4055 12032 17170 54828 41195
7139 41195 9815 17222 30165 17695 5103 -14675 -27673 -26651 -40069 -287 27575 29353
7127 29353 30976 9759 20551 385 -36873 -20367 -3804 10414 30408 38087 32366 29516 1713
7114A713J7428M0102Q550l4329q773l960j3257K846K3463J9135J2943j4722O1
7101E1200m012l3655j6777K8155l940k9002j200k028j7379k2368K4428L3108L93
7088F923J9018M094Q743p594j2026M714Q527l6010j3298k435J5708K6035L483
7075B5882J5994m337l833q067J5182K8872p026l552k6531q719n337j5187j8924
7062a5583r511k313j2878N629L16R519J3434R162j0097j829n105J972J2212N787
7048G15j3013P636J209k5879k6524M805K6284L4636n90M211p241N274J1551j1421
7034A1653p527R600k1356J7040K4903m595k448M127K263L877k4725m616K0387
7021B8583j4102k719j6681n716q411k1299q723L119N797M0394J7949K407R384
$$ plain form
7114 1713 19141 59243 67793 33464 24691 20731 7474 10320 33783 52918 65861 51139 51200
7101 51200 47188 13533 -3244 24911 20971 -8031 -9231 -11259 -28638 -51006 -26578 6530 6923
7088 6923 25941 30035 38778 31184 19158 23872 32399 -3611 -16909 -19344 -3636 22399 25882
7075 25882 41876 37539 33706 25639 40821 69693 62667 59115 32584 23865 18528 3341 -15583
7062 -15583 -25094 -27407 -40285 -34656 -34340 -24821 -11387 -2225 -12322 -14151 -19256 -17284 -5072 715
7048 715 -12298 -4662 -3453 -29332 -55856 -51051 -24767 9869 9279 13490 6249 11523 23074 11653
7034 11653 4126 13726 -7630 9410 34313 29718 27270 31397 33660 37537 12812 8196 28583
7021 28583 14481 11762 -4919 -10635 -19046 -40345 -49068 -45949 -40152 242 18191 20598 29982
7008B9982R97j9929j4372k4214J3913K4272J1174k154J2614J0976l081K5057K0031
6995H5266j5663m6523o153J2655j8579K874J5499l810J3088l0470q571o804L815
6982c376k729J0245O4P525R12n638K80o496k8264J2800K4806N934k8666q96J9026
6967E527o365m319O155J863J1293J752n426j8656N771k583k493J7685J9915K6415
6953E6534r197n293j0347k3745j227Q972o029N863j0084j3489j324l270k636K3962
6939H690J9762J6153J2913K6242q691n5204p033N841q500p49n149r397L0200K6718
6925E1796L702l2677N1L734J252J330J385j1779k943j1246j4123n84P574P380
6911D852J2943n948K7799j5947p175K2413q498k2886R485l080k5138J2136O950
$$ plain form
7008 29982 30979 11050 -3322 -27536 -13623 10649 21823 19669 32283 43259 40178 65235 85266
6995 85266 69603 23080 16927 29582 11003 13877 29376 25566 38654 8184 -387 -7191 -3376
6982 -3376 -6105 4140 4204 11729 12641 7003 7283 787 -27477 -14677 10129 16063 -12603 -13499 5527
6967 5527 -838 -5157 998 2861 14154 15906 10480 -8176 -2405 -4988 -7481 10204 30119 56534
6953 56534 47337 42044 31697 7952 6725 15697 9668 15531 5447 -8042 -9366 -12636 -15272 8690
6939 8690 28452 44605 57518 83760 75069 19865 12832 18673 10173 9424 4275 -5122 25078 51796
6925 51796 55498 22821 22872 26606 27858 29188 30573 18794 15851 4605 -9518 -10102 -2528 4852
6911 4852 17795 11847 39646 23699 16524 38937 30439 7553 17038 13958 -11180 956 7906
6898G906q841Q274P896o921N21j3973R678q69j7651P978R705O797l948j6112P508
6883b052K9837L9710J8321k2904r350j1279j6684j172m388l9631N852J928P112
6870d700J0443q820l73J2421J6576j5980j1363K6185P021P086k0460l9291K1160
6857i5m657r479M765j5420N669j7191j3536j3873J6043K7764O225J724K3370P741
6843A9050o556k943k2441R645Q229P113Q155m057l100N168Q886Q492k7689l5033
6829b7081k657o227j0840k4813N148J6185J6401J5187j8641J1168J4367J4314
6817B511o717K1696P320j7959L211J7576J1459o997k2210J0883J8645J9734Q456
6804F7608J5945l3012m6543j1541K4132J5295j9851k6462r363K673j30Q770K7455
$$ plain form
6898 7906 -935 7339 15235 8314 8835 -5138 4540 3671 -13980 -6002 3703 10500 6552 -9560 -2052
6883 -2052 27785 67495 85816 62912 53562 42283 25599 24427 20039 -19592 -13740 -11812 -4700
6870 -4700 5743 -3077 -3450 8971 25547 9567 -1796 24389 31410 38496 18036 -21255 -95
6857 -95 -4752 -14231 -9466 -24886 -19217 -36408 -49944 -63817 -47774 -20010 -13785 -12061 11309 19050
6843 19050 12494 9551 -12890 -3245 4984 12097 20252 16195 13095 18263 27149 35641 7952 -27081
6829 -27081 -29738 -35965 -46805 -71618 -66470 -50285 -33884 -18697 -37338 -26170 -11803 2511
6817 2511 -4206 17490 24810 6851 10062 27638 39097 32100 9890 20773 39418 59152 67608
6804 67608 83553 50541 3998 -7543 16589 31884 12033 -14429 -23792 -21119 -21249 -12479 14976
6791A4976n194k955J0531L015k5080k6154j5217J0751K6250l944j0715l667K4525
6778b878K7769j3196k0971K065J8254j5645k1520J0553J3029L2357J4764P196
6766E1777L3323P890r208l4163q674n864j8604j362l730k1398j3717N333K0566
6753B169O702k0714p354l166j7528N110J7906n689r74N015O097L721p37O175L2782
6738B9515R736j0813q536j990K4421L885j1748j3972Q497p420k4361k8927L058
6725b8655P655k5723J7911M0664M8898J8155k5019j8507J4280l474m847J5839
6713E7177n410j4484J4223J8884n000l4030K9436q133p240l5722o12m972j180
6700B937L965j1419r046K1J733l69K4911P325m143j7439J4954j0153k7148j5086
$$ plain form
6791 14976 9782 6827 17358 20373 -4707 -30861 -46078 -35327 -9077 -13021 -23736 -27403 -2878
6778 -2878 24891 11695 -9276 -7211 11043 -4602 -26122 -15569 -2540 29817 44581 51777
6766 51777 85100 92990 83782 49619 40945 35081 16477 15115 11385 -10013 -23730 -18397 2169
6753 2169 8871 -11843 -19197 -22363 -39891 -34781 -16875 -22564 -23538 -18523 -12426 -8705 -9442 -3267 29515
6738 29515 39251 28438 19902 17912 42333 46218 34470 20498 28995 21575 -2786 -31713 -28655
6725 -28655 -21000 -46723 -28812 11852 60750 78905 53886 35379 49659 46185 41338 57177
6713 57177 51767 37283 51506 70390 65390 31360 60796 52663 45423 9701 9089 4117 2937
6700 2937 6902 -4517 -13563 -13542 -11809 -12178 12733 20058 15915 -1524 13430 3277 -23871 -38957
6686c8957P371K9712J9989P263K0890J3611l1720j4302m002L736Q652j6501l9581
6673c3839o780R527J9186k526n714K245L0784L2391n006j8775l2905J8386Q533
6660A5507j4797J4187o184j0339l829J203K0665K3964M28l4494n860J9799K4277
6647D4527J7376P567p18j6650J6752J5500j1800j5439m989j0629j290N31j6627
6634B4111p162R284m858j8988k9222O873L1719l482l7237K350K9863j848P425
6621H828j8611k3436M172J2000J2901p381k2566K2142P060r326k0430K444K0037
6608a2166J4317J6990n065K0402l601J1875j1993Q724L2364k8948m2584j5613
6596a5298J2085J1078L223L4821K7284j4585k7932k8840l991j1191M1J0575K1398
$$ plain form
6686 -38957 -31586 -1874 18115 25378 46268 59879 28159 13857 9855 13591 22243 5742 -33839
6673 -33839 -40619 -31092 -11906 -14432 -20146 -17901 12883 45274 40268 21493 -11412 6974 15507
6660 15507 710 14897 8713 -1626 -5455 -4252 16413 40377 40805 6311 451 20250 44527
6647 44527 61903 69470 68752 52102 68854 84354 72554 57115 52126 41497 40207 40738 24111
6634 24111 16949 26233 21375 2387 -26835 -19962 11757 8275 -28962 -26612 3251 1403 8828
6621 8828 -9783 -33219 -29047 -17047 -4146 -11527 -34093 -11951 -4891 -14217 -34647 -32203 -12166
6608 -12166 2151 19141 14076 34478 30877 42752 30759 39483 71847 42899 315 -15298
6596 -15298 -3213 7865 11088 45909 73193 58608 30676 1836 -2155 -13346 -13305 -2730 18668
6583A8668p473p971j600k7273l857N322K360K7006J1337K821K5651J9116k7697
6570C6410j3004r93J5871k4973k0888r006k5416J678L4840N3023J8622m1111l5581
6557a0528k9868M699J8596K2100J1257l0390k5543K3375K5872j0669j3429p159
6545b1687o972J7009L2669J1689J7215j234Q69k1266j4760j6062k382q674j0209
6532b3795K3482L1085J0337j1239j3739k8929K0415O959k7205K1879K1982R910
6520D1142j6014k2562K886p223J5555J5317P197m054J1980k950r192j2986j2284
6507F812j3894j2203j6438K3941K7717M915l6398K946K2016j3087m856j564J9038
6494H945L269k1621J6468j5192j6404P374j3381j3025K1354J9603K0183J7551
$$ plain form
6583 18668 11195 3224 1624 -25649 -29506 -24184 -21824 5182 16519 19340 44991 64107 36410
6570 36410 23406 22413 38284 13311 -7577 -16583 -41999 -40321 -5481 47542 66164 25053 -10528
6557 -10528 -40396 -35697 -17101 4999 16256 -14134 -39677 -16302 9570 -1099 -14528 -21687
6545 -21687 -28659 -11650 21019 32708 49923 48689 49558 28292 13532 -2530 -4912 -13586 -23795
6532 -23795 -313 30772 41109 29870 16131 -12798 7617 14576 -12629 9250 31232 41142
6520 41142 25128 2566 5452 -1771 13784 29101 36298 32244 44224 41274 32082 19096 6812
6507 6812 -7082 -19285 -35723 -11782 15935 20850 -15548 -12602 9414 -3673 -8529 -10093 8945
6494 8945 12214 -9407 7061 -8131 -24535 -17161 -30542 -43567 -22213 -2610 17573 35124
6482C5124j7843p185J3630J6385m410o493l627L043k6229K570K1312J31j1144
6469A5264j6640k1204K01J3229q24r58K0522P322K4494n145r536P615j2502J6296
6455C8134J082R966M885J8476j8205l5892k8547Q113R504M549O742j2550k8430
6442b2173o623J1251K4991K89n093L081K446J0915P522q265k3486j3094J1438
6429f801J7076K3949J2320j1124k3762k3218p119L602j927N410J2910K646o09
6416C353q150j2939n857K3227J1428K888n505r473j882n239j6351o422j4674L9878
6402e718L3450j461j8659j8719K718J1421K164J8661o46p539n063k5576J105M937
6388h925n690k1066l4130j3247K6730K2894J8110N2684K0514M403L1948l6247
$$ plain form
6482 35124 17281 10096 23726 40111 35701 29208 25581 28624 2395 4965 26277 26408 15264
6469 15264 -1376 -22580 -22379 -9150 -9974 -10932 9590 16912 41406 36261 26725 34340 21838 38134
6455 38134 39216 49182 54067 72543 54338 18446 -10101 -1988 7516 12065 18807 6257 -22173
6442 -22173 -28796 -17545 7446 7735 2642 5723 8169 19084 26606 18341 -5145 -18239 -6801
6429 -6801 10275 34224 46544 35420 11658 -11560 -18679 -15077 -17004 -11594 1316 3962 3353
6416 3353 -4797 -17736 -23593 -366 11062 13950 8445 -1028 -2910 -8149 -24500 -30922 -45596 -5718
6402 -5718 27732 26271 7612 -11107 -8389 3032 5196 23857 23211 15672 10609 -14967 -13862 -8925
6388 -8925 -14615 -35681 -69811 -83058 -56328 -33434 -15324 37360 57874 62277 94225 57978
6376E7978m1605k0331k9971j1903n577O698L2026J0351m824Q741J0216k31j571
6363I997O452j7248q838j9556j726R044k782p677J5934M2330J0692l2487r830
6350e695L1366p003p503j929o304M41J7145o916j5488n934J4694J5509K559j1874
6336A3068l9840k8651J2366L7555K8119R20j2012j2655k278r13P336p813m936
6323i734k2897j5536j117K907L0422J4743K01J8675J4468M267J0351M565r714
6310D1601m346J4795l9732j0926K0855q494j6898r994j8905O477J4448K4167j0458
6297B590k5320J1887J2139J5002j9443j0251P457Q979j4998k6595j0451J2912
6285c6092M1561L1603L9332J3439j6579L581M026n6496k9286K7269Q201J4315
$$ plain form
6376 57978 16373 -3958 -33929 -45832 -51409 -44711 -12685 -2334 -7158 1583 11799 11568 9997
6363 9997 16449 -799 -9637 -29193 -30919 -21875 -24657 -32334 -16400 25930 36622 4135 -5695
6350 -5695 25671 18668 11165 9236 2932 3373 20518 13602 -1886 -7820 6874 22383 24942 13068
6336 13068 -26772 -55423 -43057 -5502 22617 23537 11525 -1130 -3408 -4321 3015 -4798 -9734
6323 -9734 -32631 -48167 -49284 -46377 -15955 -1212 -1011 17664 32132 36399 46750 51315 41601
6310 41601 37255 52050 12318 1392 22247 13753 -3145 -13139 -32044 -25567 -11119 13048 2590
6297 2590 -22730 -10843 1296 16298 -3145 -13396 -5939 3040 -11958 -38553 -49004 -36092
6285 -36092 5469 37072 76404 89843 73264 76845 80871 24375 -4911 22358 30559 44874
6273D4874j6822k4150j2225j7003R583L516j567q686J33J7421l817j0899J236
6260a8406q051N714J6310j5672K365K4742O299J6029K925l3504k2510R265K356
6247a2138o821J5116K0367k0042J8158Q907k3781j1432Q273J1434J6720j4219
6235A0542p058O371K4742J6862o480k3113k4462j5108j3582J2834J1245m799K8081
6222A6075k333o118P029j6110J7620R795J55j5322l4771J0439K7159L104j9486
6209b764k1279j1222K0690m429j7440P239J1162J2498L786O791K4416j9460m7144
6196c7156J0811J3354L872J6987J5905k0730l6328j2555k090J3766K4599Q960
6184f05Q770J4532M510l0798j7712M155n64K7653N221j9417J4457L6729K3309
$$ plain form
6273 44874 28052 3902 -8323 -25326 -15743 -12227 -13794 -22480 -22347 -4926 -8743 -19642 -18406
6260 -18406 -26457 -20743 -4433 -20105 -17740 7002 13301 29330 32255 -1249 -23759 -14494 -12138
6247 -12138 -18959 -3843 16524 -3518 14640 23547 -234 -11666 -3393 8041 24761 10542
6235 10542 3484 9855 34597 51459 44979 21866 -2596 -17704 -31286 -18452 -7207 -12006 16075
6222 16075 13742 7624 14653 -1457 16163 25958 26113 10791 -23980 -13541 13618 16722 -2764
6209 -2764 -24043 -35265 -14575 -19004 -36444 -29205 -18043 -5545 -1759 5032 29448 9988 -37156
6196 -37156 -26345 -12991 -9119 7868 23773 3043 -33285 -45840 -47930 -34164 -9565 -605
6184 -605 8165 22697 27207 -3591 -21303 -17148 -17712 9941 15162 -4255 10202 46931 70240
6171G0240l8116j3897l15l948R664q415l633J0866J258k2043j2824L3711j3146
6158I402r223K2801K0592k5730j6196L737L207k899l4364j1644m374M478K863
6145c7350J3735K7704q50k757l817k1099N219k2236J0784J1281j4596Q003L6738
6132A0759k457k918P203k8670k917O465N197Q898j9926Q169L2919L04k4885k2582
6118b4441o056O065l982K4128J7451J9793l364j7333k6501j6901J4696J7820K3907
6105B5282K5384k2113m0993l063O157M363p360O815J1278p932j1913J598J041
6092a1456J0158K226m429q301K4805q222J124k824L054K0413P397j0531J0199
6079C3613Q132j3110k8256j5038j86K54K0495k390K0852P243l285j5663k5451
$$ plain form
6171 70240 32124 18227 17912 13964 23628 15213 11580 22446 23704 1661 -11163 22548 9402
6158 9402 179 22980 43572 17842 1646 5383 8590 5691 -28673 -40317 -44691 -40213 -37350
6145 -37350 -23615 4089 3239 482 -3335 -24434 -19215 -41451 -30667 -19386 -33982 -25979 10759
6132 10759 8302 5384 12587 -16083 -19000 -12535 -7338 1560 -18366 -10197 22722 23026 -1859 -24441
6118 -24441 -30497 -24432 -28414 -4286 13165 32958 29594 12261 -14240 -31141 -16445 1375 25282
6105 25282 50666 28553 -12440 -15503 -9346 -4983 -12343 -5528 5750 -2182 -14095 -12497 -11456
6092 -11456 -1298 928 -3501 -11802 13003 4781 5905 3081 6135 26548 33945 23414 33613
6079 33613 41745 28635 379 -14659 -14845 -14591 5904 3514 24366 31609 28324 12661 -12790
6066a2790J7946K5732k112j5706k1573k2757L300M503P959J7203M975l1742p36
6053b5798j0414j9962J0889K7943Q14k2481o208K5391K883J4000j1669L850J543
6040i219J8388K216J5738o644J7754L91k0742K252j5411j6859k0391O086L4968
6027H527P2j48o586j4635J2409J8066o312P68r462k2833K8024K1195O220N814
6013D1119j5083j9594Q52j4456J808m0J8097R294l5058m9032L1053L6320J7068
6000B2348n233N884J6613r361k9016k5436O77J5559J4680K787K4408m361K3352
5987E2901k3061l9599N67o854R292J2673J2175k21k562J1108q165q629j8641J4066
5973E050J4524K3092J5385m7198k9812j2776M549j661M632J2321R586j8456j0301
$$ plain form
6066 -12790 5156 30888 28776 13070 -8503 -31260 -27960 -23457 -15498 1705 6680 -25062 -25798
6053 -25798 -36212 -56174 -45285 -17342 -16528 -39009 -45217 -19826 -16943 -2943 -14612 -10762 -9219
6040 -9219 9169 11385 27123 20479 38233 38624 17882 20134 4723 -12136 -32527 -26441 8527
6027 8527 8599 8451 1865 -12770 -361 17705 11393 12161 2699 -20134 7890 29085 35305 41119
6013 41119 26036 6442 7294 -7162 -5354 -5394 12703 21997 -13061 -62093 -31040 5280 22348
6000 22348 17115 22999 39612 30251 1235 -24201 -23524 -7965 6715 9502 33910 29549 52901
5987 52901 29840 -9759 -9192 -16046 -6754 5919 18094 17873 15311 26419 18254 9625 -9016 5050
5973 5050 19574 42666 58051 10853 -18959 -31735 -27186 -28847 -24215 -11894 -2308 -20764 -31065
5960c1065L5869j6062j3800k469M400k1116M283J6847q683j7323n431O873J214
5947d6463K4713o228k3066J7820L0515o028l879k148M677Q859J9830J2872N473
5934C6947k152M423p684p217N815j3265r980p369j6328M775K153J1240r330j3295
5920b1267N360J6146J1519Q05Q824j6918k3234K643P508K025L243o132l996J7707
5906D233o814l4360j3069L6441J3751k5291M462J3812r439P199o803j1554L648
5893b3784J0186K566o823J1395L4238N990j1171O263k3646k2427J4509J620j4053
5880a5137j0308L06L3032Q113j8344p362q699k0728j1040J5124K1852L5269K1606
5867D3684K7934q034k8492k7293j0247k773J18R043K783n183j5640n850K5500
$$ plain form
5960 -31065 4804 -11258 -25058 -27527 -23127 -44243 -39960 -23113 -31796 -49119 -54550 -47677 -46463
5947 -46463 -21750 -27978 -51044 -33224 -2709 -8737 -12616 -14764 -10087 -1228 18602 31474 36947
5934 36947 34795 39218 31534 24317 30132 16867 6887 -482 -16810 -12035 -9882 1358 -7972 -21267
5920 -21267 -15907 239 11758 12563 21387 4469 -18765 -16122 -8614 -6589 -3346 -9478 -13474 4233
5906 4233 -2581 -36941 -50010 -13569 182 -25109 -20647 -6835 -16274 -9075 -15878 -27432 -23784
5893 -23784 -13598 -11032 -17855 -6460 27778 33768 22597 28860 5214 -17213 -2704 -1084 -15137
5880 -15137 -25445 -25139 7893 16006 -2338 -9700 -18399 -39127 -50167 -35043 -13191 22078 43684
5867 43684 71618 63584 35092 7799 -2448 -5221 -5103 3940 6723 1540 -14100 -19950 5550
5854E550k044K0419M43l688k4378k6097j2014l183R284P614J0313j7615K9870
5841e526K5457J4557n505K0922l2745k5389p117J4939R869j1019N554m540O231
5828E688K4294j0771r368Q736J0795j316j5853j4647j4500Q275J0011j6798p311
5815b2765p446L659J7128K7687K6677o806m0057j1112J7710J6298N802K8455j4347
5802D0883j6269k4253l1712J0136K2233K6848j2584n867K4947K2584j3210j2672
5790C1064k233j6314J94j2115m062J0139M077m576P951r804k7509l272J0785K7776
5776A2101P441m7089j0778J9920k1567J63J7932R252L3961J0777n502N687O322
5763C8620j8927j766O585j7581r340R975j8650j3837L1975J4906j6658n402l320
$$ plain form
5854 5550 3506 23925 24368 20680 -3698 -29795 -41809 -44992 -35708 -28094 -17781 -35396 -5526
5841 -5526 19931 34488 28983 49905 17160 -8229 -15346 -407 9462 -1557 3997 -543 5688
5828 5688 29982 19211 9843 18579 29374 28058 12205 -2442 -16942 -8667 1344 -15454 -22765
5815 -22765 -30211 -26552 -9424 18263 44940 38134 -1923 -13035 4675 20973 26775 55230 40883
5802 40883 24614 361 -31351 -21215 1018 27866 15282 9415 34362 56946 43736 31064
5790 31064 28831 12517 12711 596 -3466 6673 10750 6174 14125 4321 -23188 -26460 -15675 12101
5776 12101 19542 -27547 -38325 -18405 -39972 -39809 -21877 -12625 21336 32113 26611 32298 38620
5763 38620 19693 17927 24512 6931 -2409 7566 -11084 -24921 7054 21960 5302 -100 -3420
5750c420r674p283j8693O2R319k639J1462j1675R791n058o291j7362j8953m756
5736g5170p011k556O827M3216L0380R099K3497L373k5603j3678K172J0475J6403
5723B1424o889j9695j7068l0j8127k605K2296L1972K547O255l7345k0248L6938
5710e75J6054j4144l1322j8666O699K3284K3794k47j4769M75J1748j6233j953
5697a5855q02K711J0432R526J0120N394J0824j3014j8153k4120o107K022Q799
5684a8223P32P161r232m806K0056L3132K7410p527k5593j3834J3646j920J4684
5671C5686k3635j7803j1798M464J3681J9419r949k4906r510J8334J7286J3673
5659B4942n764k1218l2128O335K0956J2028l7198m452R570m961l4129J5099M7315
$$ plain form
5750 -3420 -13094 -20377 -39070 -39008 -29689 -32328 -20866 -32541 -22750 -27808 -34099 -51461 -70414 -75170
5736 -75170 -82181 -84737 -77910 -34694 -4314 4785 28282 31655 6052 -7626 -5454 5021 21424
5723 21424 14535 -5160 -22228 -22258 -40385 -42990 -20694 11278 13825 20080 -17265 -37513 -575
5710 -575 15479 1335 -29987 -48653 -41954 -18670 5124 4877 -9892 -9417 2331 -13902 -15855
5697 -15855 -16657 -13946 -3514 6012 16132 21526 32350 19336 1183 -22937 -29044 -27022 -18223
5684 -18223 -17491 -10330 -19562 -24368 -4312 28820 56230 48703 23110 9276 22922 21002 35686
5671 35686 12051 -5752 -17550 -13086 595 20014 10065 -14841 -24351 -6017 11269 24942
5659 24942 19178 -2040 -34168 -27833 -6877 5151 -32047 -36499 -26929 -31890 -66019 -50920 -3605
5646c605M9471P82l9313n0358k1795J5930K5209K600r443J0136J5212J9240J2906
5633B6972p031P449q156N65N342p297k7922m288r021M5991L7532k2130k3239j0163
5619D604p030k017k0324K524K6003J0088j9882N958K8740K8200k3469j8210K503
5606A7688R202k4418j8338r094J1834J9039j7833j459L6833J3448q592j7310K371
5593A3371K2525J6706M567j6069K96j4380k1131R205K2952J508j3690q533j0873
5580F454O269N485l455j2990N788m588j1128q628L830K4085o38k0774O149j6979
5566b1120p278j3959o056R881J2249Q628L098j5232k3113J0377J4342l810J1290
5553b0703K6168L3936J4783m3007j5591r208k1090P637K2712L9329j3525l0098
$$ plain form
5646 -3605 45866 46648 7335 -43023 -64818 -48888 -23679 -21079 -30522 -20386 -5174 14066 26972
5633 26972 19941 27390 19234 19799 25141 17844 -10078 -14366 -23387 22604 60136 38006 14767 4604
5619 4604 -2426 -4443 -24767 -22243 3760 13848 -6034 -76 28664 56864 33395 15185 17688
5606 17688 26890 2472 -15866 -24960 -13126 5913 -11920 -13379 23454 36902 28310 11000 13371
5593 13371 35896 52602 57169 41100 41396 27016 5885 15090 38042 39550 25860 17327 6454
5580 6454 12723 18208 14753 1763 7551 2963 -8165 -16793 -12963 11122 10484 -10290 -4141 -21120
5566 -21120 -28398 -42357 -48413 -38532 -26283 -17655 -14557 -29789 -52902 -42525 -28183 -31993 -20703
5553 -20703 5465 39401 54184 11177 -4414 -13622 -34712 -27075 -4363 34966 21441 -8657
5541h657J2142j435j0328K5505J2392m1578k6434P912L1010K1748l4478l3126
5529d5327Q627L4972K3380k253m589k3692k3145J1559j9695n448J0113L4416j2310
5516a3392j1865K5304N862k1629Q0J8021O01p085q097M5191L4349l1693l2244
5503C403k5118k6878O159Q970J1171L530j1171R088L9660K5767M230j6952j2451
5490A9408J0723J376l0156k3927L830P555J1217m4193J4661J0905J836J138j387
5477a7014J134M800J2201L240J1775j105j9308j366K2118l487j5470N577K2582
5464B5677P499p55N518N381j5450k3557l1244j249L238M616j946o66K1041k873
5450d770l333o565J0829j8289r228K4054J0166O489j8350k1825O483K6453N211
$$ plain form
5541 -8657 3485 2050 -8278 17227 29619 -11959 -38393 -30481 529 22277 -12201 -45327
5529 -45327 -36700 -1728 21652 19399 14810 -8882 -32027 -20468 -40163 -45611 -35498 -1082 -13392
5516 -13392 -25257 47 5909 -15720 -15640 2381 2982 -4103 -12200 32991 67340 35647 3403
5503 3403 -21715 -48593 -42434 -33464 -22293 -18763 -29934 -20846 18814 44581 48811 31859 19408
5490 19408 30131 31507 1351 -22576 -18746 -11191 26 -44167 -29506 -18601 -16765 -15627 -17014
5477 -17014 -15880 -11080 1121 4361 16136 15031 -4277 -5643 16475 12988 -2482 3095 25677
5464 25677 33176 32421 37939 43320 27870 4313 -26931 -28180 -24942 -20326 -22272 -22938 -1897 -4770
5450 -4770 -8103 -14668 -3839 -22128 -31356 -7302 2864 9353 -8997 -30822 -24339 2114 7325
5437G325O974r172k4724M917P139l715j3813q251J4249M714q088j0196K0655K6134
5423A4148J6777k644j867j7935l073K5255P585J277p033m4195o706l118j500m079
5409b7108j9600l567J9719J7230K2104j0177K098l2627J8099J3163J3445J8676
5397C1455k2316q078Q141K731j2326k2306k637l36L3396J9142L215n205J85j8
5383B5043J4384j2054m430P563l3761j8342j4218j5929P508Q141j8443l418K0482
5370c7474K1327l901o888K15J0088N224P425J4856l550r591J3435M492L728k2858
5356c472k5883k2913K4933K856Q194p556N031N1J6830J4174j644p273j9867j9515
5342c6054L9216k0360n0072J1725Q010L0118P532M956J8851J7354q81j0910k0443
$$ plain form
5437 7325 14299 5127 -19597 -14680 -7541 -11256 -25069 -33320 -19071 -14357 -22445 -32641 -11986 14148
5423 14148 30925 28281 26414 8479 5406 30661 38246 39523 32490 -11705 -18411 -21529 -23029 -27108
5409 -27108 -46708 -50275 -30556 -13326 8778 -1399 699 -31928 -13829 -666 12779 31455
5397 31455 9139 1061 9202 11933 -393 -22699 -25336 -25672 7724 26866 30081 24876 25061 25043
5383 25043 39427 27373 22943 30506 -3255 -21597 -35815 -51744 -44236 -36095 -54538 -57956 -37474
5370 -37474 -16147 -20048 -26936 -26721 -16633 -11409 -3984 10872 7322 -2269 11166 15658 19386 -3472
5356 -3472 -29355 -52268 -27335 -24479 -16285 -23841 -18810 -18759 -1929 12245 10601 3328 -16539 -36054
5342 -36054 3162 -17198 -67270 -55545 -47535 -17417 -9885 -4929 13922 31276 30395 19485 -958
5329i58L049j7363L2703J2316l7149l391j4446j271N324r865j3165Q264K6645
5316i307J6065j9836k2993R643J0797j944q97J8917m570j2929R693k0067L317
5303b4111n138J295m937Q859j648P086r730P650K2850r023l6099K1850M8074Q560
5289C5538l429m476k591l436j8496k8728M710K1921q006j1306l47J5474p430j8488
5275b9090K1284L8063J4954k935j3298j3532m880J3658m048k0615j9487k0115
5263d0041j4316J9065K5607j1939j585J2121J961J409J8217J392L255k2839k7932
5250c5625q441j06P557K066j5990J4121L548K3953J133Q903j9055j860k64L6729
5236A6669K4361L65J689o422l1205K90j5252J2502P545J122J3403J0620o220k3122
$$ plain form
5329 -958 2091 -15272 17431 29747 -7402 -10793 -25239 -26510 -21186 -31051 -44216 -35952 -9307
5316 -9307 6758 -13078 -36071 -26428 -15631 -17575 -18472 445 -4125 -17054 -7361 -27428 -24111
5303 -24111 -29249 -27954 -32891 -24032 -25680 -18594 -28324 -20674 2176 -6847 -42946 -21096 26978 35538
5289 35538 32109 27633 25042 21606 3110 -25618 -20908 1013 -6993 -18299 -18646 -3172 -10602 -29090
5275 -29090 -7806 30257 45211 42276 28978 15446 10566 24224 20176 -439 -19926 -40041
5263 -40041 -54357 -35292 -9685 -21624 -23209 -11088 -9127 -7718 10499 11891 15146 -7693 -35625
5250 -35625 -44066 -44172 -36615 -34549 -50539 -36418 -32870 -8917 -7784 1119 -17936 -19796 -20060 16669
5236 16669 41030 41395 43084 36662 5457 5747 -9505 2997 10542 11664 25067 35687 29467 6345
5222F345n811K3237K0061o262j9491m245k2233k4229m806M0083J8429k6092l6461
5209d1475q754P02q149K648K6529K4732l032j8451j2085k686m14p344J7623j4918
5195d5074k1279K704J6677K7514K2966q47R581k3368J7370j438q740K1734m460
5182A3340n299o193o787k2721J3491o073m0689P221J1743L815L6263K8091O291
5169C2493n772j6374l4781m4090O061J7856K7553K1219J284J369O485L948k905
5156A4346j4233l4613j4619K625J555Q254K1276K1662J3000o953l6877m003J6389
5143a2191q856L2914Q087r944j4979J0670J3826p248k6426j438P440j0738O956
5130a1927J201L2324K0903p318j5987p944J53n80o923P958k5570k2073m717J7548
$$ plain form
5222 6345 534 23771 43832 37570 18079 13834 -8399 -32628 -37434 2649 21078 -5014 -41475
5209 -41475 -50229 -49527 -57676 -55028 -28499 -3767 -6799 -25250 -37335 -40021 -40435 -47779 -30156 -45074
5195 -45074 -66353 -63649 -46972 -19458 3508 2661 12242 -11126 6244 4806 -3934 17800 13340
5182 13340 8041 1848 -4939 -27660 -14169 -20242 -60931 -53710 -41967 -38152 -1889 26202 32493
5169 32493 26721 10347 -24434 -68524 -62463 -44607 -17054 4165 5449 6818 13303 17251 14346
5156 14346 113 -34500 -49119 -46494 -44939 -36685 -15409 6253 19253 12300 -24577 -28580 -12191
5143 -12191 -21047 11867 19954 10010 -4969 5701 19527 12279 -14147 -15585 -8145 -18883 -11927
5130 -11927 -10726 21598 42501 35183 19196 11252 11405 10825 3902 11860 -13710 -35783 -40500 -22952
5116b2952K0615j4123r89M273P818L953k1416Q078J1643k9416J1300J3556q100
5103a5760M805o472M242J8417o614N077j6219k8146K811K1030K5257J3671j6147
5090E952j228P696O535j2062r039n319l66n380M796L0527J4733j633j6546q966
5076I700P934L202j5657K082j1757p659J2298N1321J3429l1120j8641P251r859
5063A2524J4561O659j0291j4892K890N991j4599k6017l687M408j4389o961k1890
5050f5693J8242J9691L0003P655K8114j2055l3307j8783M041j2582M2390M8290
5038E6006Q315k7619k0522Q164r531r42j4627k3385J0624Q080k4365N379L4306
5025I883R455j1286m3618j3260j526J452M2172M2995k5667j6974J8598P480l594
$$ plain form
5116 -22952 -2337 -16460 -17449 -13176 -5358 -1405 -22821 -14743 -3100 -32516 -21216 -7660 -15760
5103 -15760 -10955 -17427 -13185 5232 -1382 3695 -12524 -40670 -37859 -16829 8428 22099 5952
5090 5952 4724 12420 18955 6893 -2146 -7465 -7831 -13211 -8415 22112 36845 35212 18666 9700
5076 9700 17634 20836 5179 7261 -4496 -12155 143 51464 64893 33773 15132 22383 12524
5063 12524 27085 33744 23453 8561 11451 17442 2843 -23174 -26861 -22453 -36842 -43803 -65693
5050 -65693 -47451 -27760 2243 9898 38012 25957 -7350 -26133 -22092 -34674 7716 56006
5038 56006 64321 36702 16180 24344 14813 13871 -756 -24141 -13517 -5437 -29802 -24423 9883
5025 9883 19338 8052 -35566 -48826 -50352 -48900 -6728 36267 10600 -6374 12224 19704 16110
5012A6110j588l5496l6211j2837J8289K1821J0717j5076l772K1937K7486j5411
5000d031P089K133j3505L994K184J6151K1509j1938k3538l2368j9130L0965j7258
4987c7743k0477K5141K5087j5520j2716N0987K406j4336K9737M759k9259O12J4996
4974B3674J5983l4671P84Q439k856k5092q790J8638M1970J4583k4964m2268j3781
4961b8351J6736J5661J4980J8708K877Q464J3143j6826k6493l0954l404j4706
4949c0165R973K5734L8082r492l6236r867l299j7779n876N744J304J8156j6343
4936c0064j8126L291P645j6417J003K8981L1823J6873J8489j5451k7211O937j465
4923F308L8549L302k6721J330o393j5256Q061J0866j6490Q349J3421M033J617
$$ plain form
5012 16110 14522 -20974 -57185 -70022 -51733 -29912 -19195 -34271 -38043 -16106 11380 -4031
5000 -4031 3058 5191 -8314 -4320 -2136 14015 35524 23586 48 -32320 -51450 -20485 -37743
4987 -37743 -58220 -33079 -7992 -23512 -36228 14759 17165 2829 32566 37325 8066 8678 23674
4974 23674 39657 4986 5770 14209 11353 -13739 -22529 -3891 38079 52662 27698 -14570 -28351
4961 -28351 -11615 4046 19026 37734 40611 49075 62218 45392 18899 -12055 -15459 -30165
4949 -30165 -20192 5542 43624 34132 -2104 -11971 -15270 -33049 -38925 -33181 -31877 -13721 -30064
4936 -30064 -48190 -44899 -37254 -53671 -52668 -23687 8136 25009 43498 28047 836 7773 6308
4923 6308 44857 48159 21438 22768 16375 1119 9180 20046 3556 11905 25326 29359 30976
4910C0976j9211j2644m100k1095P871L735J7400J7297j3854J4783R691m332L333
4897B9850l0518l5088k3012M919n6L2745J5111k4928j996J1988j0328J5436O209
4884i668R929J0560R572n72r70j9500n980J1648l4281N559K9680J411j2080l50
4870e042L600j3729N682o400R946o918k518J7907L1790n349k2202j6795K0823
4857A0795o868j6972J5305M616K016J3283J2682l8733m1204O77R082J4440O367
4844a4514K7460J557j7073j4976L7759K1347l5530O702L365j8030L048P351j9098
4831a0632k9235j0260Q635J7260M5567J5941N16J5712j1810j02R381R996k3420
4818C7549j5903J161R03o594p930M242j8833j269J8664J4777P895K263L9667M385
$$ plain form
4910 30976 11765 -879 -4979 -26074 -18203 -14468 2932 20229 6375 21158 30849 26517 29850
4897 29850 -668 -35756 -58768 -53849 -53905 -21160 -6049 -30977 -32973 -20985 -31313 -15877 -9668
4884 -9668 261 10821 20393 19821 18851 -649 -6629 5019 -29262 -23703 5977 7388 -4692 -5042
4870 -5042 -1442 -15171 -9489 -15889 -5943 -12861 -15379 2528 34318 28969 6767 -10028 10795
4857 10795 3927 -13045 2260 6876 8892 22175 34857 -3876 -45080 -44403 -35321 -20881 -14514
4844 -14514 12946 14503 -2570 -17546 20213 41560 6030 12732 16097 -1933 1115 8466 -10632
4831 -10632 -39867 -50127 -41492 -24232 21335 37276 37792 53504 41694 41592 50973 60969 37549
4818 37549 21646 22807 23710 17116 9186 13428 -5405 -6674 11990 26767 34662 36925 76592 80977
4804H0977j6118m6973o504k0136j6451J4653k68j4560P009K9515J7713k1445m681
4791B731Q238j0546j4444K7433L468m364m437k0536K962J9081K2862j0923L751
4778B5276m160k554R800j0600o203N046k7518k4455N873J1533J5627k0378k5046
4765d7759k9879J353J7535J6704K609M0299J1645j378j7908j5890n738M2043j1218
4752B418k7683Q423j1196R224K3794k0373j0010j6503l053M405J1442L4880J5166
4739B0934L734k7517r891L248j794J6205k242K3129M521r36l2211j4094L367n152
4725a8699R833J8645k2831J2057J6984K3155L011k0632L829j0744n557p613j3220
4712a1782k3620r222J7533K5670k79p787k9101O81k944J1250R229Q342j0093M36
$$ plain form
4804 80977 64859 17886 11382 -8754 -25205 -10552 -10820 -25380 -18371 11144 28857 7412 2731
4791 2731 10969 423 -14021 13412 16880 12516 8079 -12457 -9495 9586 32448 21525 25276
4778 25276 21116 18562 28362 17762 11559 16605 -10913 -35368 -29495 -17962 -2335 -22713 -47759
4765 -47759 -77638 -76285 -58750 -42046 -39437 862 12507 11129 -6779 -22669 -28407 13636 2418
4752 2418 -25265 -16842 -28038 -18814 4980 -15393 -25403 -41906 -44959 -40554 -29112 5768 20934
4739 20934 24668 -2849 -12740 -9492 -11286 4919 2677 25806 30327 29391 -2820 -16914 -13547 -18699
4725 -18699 -8866 9779 -13052 -995 15989 39144 42155 21523 25352 14608 9051 1438 -11782
4712 -11782 -35402 -44624 -27091 -1421 -1700 -9487 -38588 -37907 -40851 -29601 -20372 -12030 -22123 -21687
4698b1687j9342K462K6525J7258K7128P077k5543K376j060j7372j5483k2585j0229
4685e0475M257J4368O860p817K0867K9590p950K403J158p260M302o15L223j0780
4671B131j4112K2066R399j1757o082k4616k95N366J4165j9730n348q137j7806
4658e4756J2361L3092j3400K532j611j8545J7012Q521k6867Q358J4678J7651J0744
4645I770n489j220K8683o631j0428j8238o172n419n988M877K9375K464j4695K4684
4631B5573K0463j3303J275j4338k9567j6251P303K4988J0168q071r171l729K3932
4618A9272R017k9648k9945J1885N129j358K4851P29M034p823m782l466j0550N72
4604a2083J9621K0057q644j2759O835q812n419J7753n754j2969k5463j1756p559
$$ plain form
4698 -21687 -41029 -38567 -12042 5216 32344 39421 13878 16254 15194 -2178 -17661 -40246 -50475
4685 -50475 -46218 -31850 -24990 -32807 -11940 17650 9700 12103 13261 6001 10303 9688 12911 2131
4671 2131 -11981 10085 19484 7727 1645 -22971 -23266 -17900 -3735 -23465 -28813 -36950 -54756
4658 -54756 -42395 -9303 -22703 -20171 -21782 -40327 -23315 -14794 -41661 -33303 -18625 -974 9770
4645 9770 4281 3061 31744 25113 14685 -3553 -9725 -15144 -21132 -16255 13120 15584 889 25573
4631 25573 46036 32733 34008 19670 -9897 -26148 -18845 6143 16311 8240 -931 -4660 19272
4618 19272 28289 -1359 -31304 -19419 -14290 -15648 9203 9932 13966 6143 1361 -2105 -12655 -12083
4604 -12083 7538 27595 18951 6192 13027 4215 -1204 16549 10795 -2174 -27637 -39393 -46952
4591d6952R932J0111K6650P292k4311k4586k4322J0057J3808K9554N8063J017
4579D6313l2727k4562k640J4057O64O506K1876J778j0468J210k4719j2268J2793
4566b187J2593j3586j4602P585K8695J1301k9283l6668J327j819N403J1452J9057
4553g32J0925J0042K529k3363o944j6083J5730J6315k2265k0070l677N818L506
4540b8269K5707K1383k2274J4104K9487J8188L073j2733Q226r650j6213o261m139
4527B0629l3236k3115N736J7731q33q763L3748K259m61L199j3510r645K27K0466
4513A4432L1578M721j7003j9723l066N718N524j9283l995L706K321j3640R51J9590
4499A1831J3316r989j9188l033j582J190J8415M698k245l673J1072J6899j4149
$$ plain form
4591 -46952 -37020 -26909 -259 7033 -17278 -41864 -66186 -56129 -42321 -12767 45296 46313
4579 46313 13586 -10976 -13616 441 1105 7611 29487 31265 20797 22007 -2712 -14980 -2187
4566 -2187 10406 -3180 -17782 -10197 18498 29799 516 -36152 -34825 -36644 -31241 -19789 -732
4553 -732 10193 20235 22764 -599 -7543 -23626 -7896 8419 -13846 -33916 -37593 -31775 -28269
4540 -28269 -2562 18821 -3453 10651 40138 58326 61399 48666 56892 47242 31029 24768 20629
4527 20629 -12607 -35722 -29986 -12255 -13088 -21851 11897 14156 13695 16894 3384 -6261 -6034 14432
4513 14432 46010 50731 33728 14005 10939 16657 22181 2898 -1097 2609 4930 -8710 -7759 11831
4499 11831 25147 15158 -4030 -7063 -8645 -7455 10960 15658 13413 9740 20812 37711 23562
4486B3562l9694o656j289J314N051J9806m508j6211j806J709l225k183J0296L2654
4472A8820p97k4292o111k243q318k033J3088p00j5510k8710j8078K147o831n169
4458h4737O221K4165M3757L4618k6856j866J4422K9457P400k7522j5568k060o54
4445G77O131l906P228L9734j953r182k2049k2777j2820j7178n882J237K7360K7255
4431A3975J9171j9156k2092o710p851j0147l498n77Q143M7412j1245k4327n081
4418b1983J1181J5998k748j8392K1203o643R362J882N420m712k606N510M945l1888
4404a3471j2165J9471j7629J8838J7787J6664j4019j1171k1034m0742l376K4641
4392c6206K2423L1816L4074q186q334l535r053p116m629j3646n783k593J9859
$$ plain form
4486 23562 -16132 -22788 -24077 -22763 -17712 2094 -2414 -18625 -20431 -18722 -21947 -24130 -13834 18820
4472 18820 18023 -6269 -12380 -14623 -22941 -24974 -11886 -12586 -28096 -56806 -74884 -72737 -79568 -84737
4458 -84737 -78516 -54351 -10594 24024 -2832 -4698 9724 39181 46581 19059 3491 1431 777
4445 777 6908 3002 10230 49964 48011 38829 16780 -5997 -18817 -35995 -41877 -40640 -13280 13975
4431 13975 33146 13990 -8102 -14812 -22663 -32810 -36308 -36885 -28742 18670 7425 -16902 -21983
4418 -21983 -10802 5196 2448 -15944 5259 -1384 7978 9860 15280 10568 7962 13472 18417 -13471
4404 -13471 -25636 -6165 -23794 -4956 12831 29495 15476 4305 -16729 -57471 -60847 -36206
4392 -36206 -13783 18033 52107 43921 35587 32052 22999 15883 11254 -2392 -8175 -10768 9091
4379I091J0923k3358l919Q767j3646q8K827K4455J4523K544k8779m030L598j5150
4365a2242j3886j3855j6640n969J2430J0934N805J6917k012j134j0564j1350k1888
4352f3454j7869K4157K6904K7926R345j6196j5220P512L4418K4560j641N221Q515
4339E4178K0794k2185q441j7244J9900J1504L390L29k4816k6467j1230j507j437
4326c232j7778N716J6185J224r742K3886k4956l5493j809P090K2695O843K4945
4313A5574O592k4411j4720K1228K2912Q724l4038k2624K4109R905j761P702o785
4300A2407j910O55L575m589r138k7499l7192j0856K4358J9754r733J237j2059
4287e0990J2629k5425l1305K8582M4586K1994m294m0720l174j1895J9621m774
$$ plain form
4379 9091 20014 -3344 -7263 1504 -12142 -12230 -9403 15052 29575 32119 3340 -690 2908 -12242
4365 -12242 -26128 -39983 -56623 -62592 -50162 -39228 -33423 -16506 -18518 -19652 -30216 -41566 -63454
4352 -63454 -81323 -57166 -30262 -2336 7009 -9187 -24407 -16895 17523 42083 40442 45663 54178
4339 54178 74972 52787 44346 27102 47002 58506 61896 62225 37409 10942 -288 -1795 -3232
4326 -3232 -21010 -15294 891 2115 -7627 16259 -8697 -44190 -45999 -38909 -16214 -9371 15574
4313 15574 22166 -2245 -16965 4263 27175 35899 1861 -20763 3346 13251 11490 19192 12407
4300 12407 10497 11152 14727 10138 1000 -26499 -63691 -74547 -50189 -30435 -40168 -38931 -50990
4287 -50990 -38361 -63786 -95091 -66509 -21923 71 -4223 -44943 -48117 -60012 -40391 -45165
4275d5165K7956N699o254P135J3595p720r408j3389J800R663l99q200L3762K3767
4261C2842j8847k0507p78L510j1190P113J179J4381R609j6398j242K3251J5576
4248C8499p065k9947m660k294l2650o111J8086L0135l5100j5228J5916J6374J5219
4235A174K976j9361l080j7064r477J9062K1721L862K743j7968k5435M867L4857
4222a123l27r750l781j1159J544j926J3692l761q003K271R372P631q012j658j919
4207a6909n437j1675R217Q14j8999J5146J0975J3824K3184R205Q297j8107k2722
4194c187k987J6115m507Q27j4822J6585K986Q66K3737K456p101k4663m970L64
4180A699o333j448Q183J806J2767j1305K0876j2157p819k0259l9649j5978J2312
$$ plain form
4275 -45165 -17209 -11510 -17764 -10629 2966 -4754 -14162 -27551 -25751 -16088 -16487 -24687 9075 32842
4261 32842 13995 -6512 -7290 -3780 -14970 -7857 -6678 7703 17312 914 -328 22923 38499
4248 38499 31434 1487 -3173 -5467 -38117 -44228 -26142 3993 -31107 -46335 -30419 -14045 1174
4235 1174 4150 -15211 -18291 -35355 -44832 -25770 -4049 -187 2556 -15412 -40847 -35980 -1123
4222 -1123 -1450 -11200 -14981 -26140 -24596 -26522 -12830 -16591 -24594 -22323 -12951 -5320 -13332 -14990 -16909
4207 -16909 -22346 -34021 -24804 -23990 -42989 -27843 -16868 -3044 20140 29345 37642 19535 -3187
4194 -3187 -6174 9941 5434 6261 -8561 8024 11010 11876 35613 38069 30968 6305 1335 1699
4180 1699 -4634 -6082 2101 3907 16674 5369 26245 14088 6269 -13990 -53639 -69617 -57305
4167e7305N388L4202N598k3293R712K7606J8533N56P60j8887q421l3381q240L6608
$$ plain form
4167 -57305 -51917 -17715 -12117 -35410 -25698 1908 20441 20997 21757 2870 -5551 -38932 -47172 -10564
$$ [...]
##END NTUPLES=NMR SPECTRUM
##END=
