##TITLE=Analysis number 319980
Compound Code ac 33410
Book Reference b
Project Code adrs
Chemist Name new century
##JCAMPDX= 6.0         $$ Bruker NMR JCAMP-DX V2.0
##DATA TYPE= NMR SPECTRUM
##DATA CLASS= NTUPLES
##ORIGIN= Bruker BioSpin GmbH
##OWNER= nmr
$$ XWIN-NMR		Version 3.5
$$ Tue Jun  6 12:05:56 2006 GMT Daylight Time (UT+1h)  MAYBRIDGE\nmr@NMR_250MHZ
##.OBSERVE FREQUENCY= 250.131544655141
##.OBSERVE NUCLEUS= ^1H
##.ACQUISITION MODE= SIMULTANEOUS (DQD)
##.ACQUISITION SCHEME= undefined
##.AVERAGES= 16
##.DIGITISER RES= 18
##SPECTROMETER/DATA SYSTEM= dpx250
##.PULSE SEQUENCE= zg30
##.SOLVENT NAME= DMSO
##.SHIFT REFERENCE= (INTERNAL, DMSO, 0, 16.522)
##AUDIT TRAIL= $$ (NUMBER, WHEN, WHO, WHERE, WHAT)
$$ ##TITLE= Audit trail, XWIN-NMR		Version 3.5
$$ ##JCAMPDX= 5.01
$$ ##ORIGIN= Bruker BioSpin GmbH
$$ ##OWNER= nmr
$$ C:\u/data/dgb/nmr/ADRS/340/pdata/1/auditp.txt
$$ ##AUDIT TRAIL=  $$ (NUMBER, WHEN, WHO, WHERE, WHAT)
(   1,<2006-06-06 12:05:30.48 +100>,<MAYBRIDGE\nmr>,<NMR_250MHZ>,
      <created by zg, POWCHK disabled, PULCHK disabled
       configuration hash MD5:
       E2 DF 36 D8 04 B2 41 60 5A D7 A3 38 5A 4B D0 FE
       data hash MD5: 64K
       47 39 5A 92 D1 75 3C 88 A5 51 A6 01 81 1B 4F AA>)
(   2,<2006-06-06 12:05:47.56 +100>,<MAYBRIDGE\nmr>,<NMR_250MHZ>,
      <Start of raw data processing
       ef LB = 0.3 FT_mod = 6 PKNL = 1 SI = 32K 
       data hash MD5: 32K
       A4 D7 85 F0 A2 01 00 75 CF F6 57 B3 CB A8 1B 5E>)
(   3,<2006-06-06 12:05:49.18 +100>,<MAYBRIDGE\nmr>,<NMR_250MHZ>,
      <apk 
       data hash MD5: 32K
       5B 38 95 2A BE 84 0A D5 66 3B 11 BF 5E 50 4D 59>)
(   4,<2006-06-06 12:05:49.93 +100>,<MAYBRIDGE\nmr>,<NMR_250MHZ>,
      <abs ABSG = 5 
       data hash MD5: 32K
       B1 00 8C CF 66 D8 93 6E 29 9A 57 47 59 EE E3 25>)
$$ ##END=
$$ 
$$ hash MD5
$$ 5C 83 72 5A 2E FE C5 83 7D 56 9F 80 42 96 83 0B
##$RELAX= 
##$RELAX= 
##$RELAX= 
##$RELAX= 
##$RELAX= 
##$RELAX= 
##$RELAX= 
$$ Bruker specific parameters
$$ --------------------------
##$DU= <C:\u>
##$EXPNO= 340
##$NAME= <ADRS>
##$PROCNO= 1
##$TYPE= <nmr>
##$USER= <dgb>
##$AMP= (0..31)
100 100 100 100 100 100 100 100 100 100 100 100 100 100 100 100 100 100 
100 100 100 100 100 100 100 100 100 100 100 100 100 100 
##$AQSEQ= 0
##$AQ_mod= 3
##$AUNM= <au_zg>
##$AUTOPOS= <10 >
##$BF1= 250.13
##$BF2= 250.13
##$BF3= 250.13
##$BF4= 250.13
##$BF5= 500.13
##$BF6= 500.13
##$BF7= 500.13
##$BF8= 500.13
##$BYTORDA= 1
##$CFDGTYP= 0
##$CFRGTYP= 5
##$CHEMSTR= <none>
##$CNST= (0..31)
1 1 145 1 1 1 1 1 1 1 1 1 1 1 1 1 1 1 1 1 1 1 1 1 1 1 1 1 1 1 1 1 
##$CPDPRG= <>
##$CPDPRG1= <>
##$CPDPRG2= <>
##$CPDPRG3= <>
##$CPDPRG4= <mlev>
##$CPDPRG5= <mlev>
##$CPDPRG6= <mlev>
##$CPDPRG7= <mlev>
##$CPDPRG8= <mlev>
##$CPDPRGB= <>
##$CPDPRGT= <>
##$D= (0..31)
0 1 0 0 0 0 0 0 0 0.06 0 0 0 0 0 0 0.0002 0 0 0 0 0 0 0 0 0 0 0 0 0 0 
0 
##$DATE= 1149591929
##$DBL= (0..7)
120 120 120 120 120 120 120 120 
##$DBP= (0..7)
150 150 150 150 150 150 150 150 
##$DBP07= 0
##$DBPNAM0= <>
##$DBPNAM1= <>
$$ [...]
##$SUBNAM7= <"">
##$SUBNAM8= <"">
##$SUBNAM9= <"">
##$SW= 20.6930455092707
##$SWIBOX= (0..15)
0 0 3 0 0 0 0 0 0 0 0 0 0 0 0 0 
##$SW_h= 5175.983436853
##$TD= 65536
##$TD0= 1
##$TE= 296.16
##$TE2= 300
##$TE3= 300
##$TEG= 300
##$TL= (0..7)
0 120 120 120 120 120 120 120 
##$TP= (0..7)
150 150 150 150 150 150 150 150 
##$TP07= 0
##$TPNAME0= <>
##$TPNAME1= <>
##$TPNAME2= <>
##$TPNAME3= <>
##$TPNAME4= <>
##$TPNAME5= <>
##$TPNAME6= <>
##$TPNAME7= <>
##$TPOAL= (0..7)
0.5 0.5 0.5 0.5 0.5 0.5 0.5 0.5 
##$TPOFFS= (0..7)
0 0 0 0 0 0 0 0 
##$TUNHIN= 0
##$TUNHOUT= 0
##$TUNXOUT= 0
##$USERA1= <user>
##$USERA2= <user>
##$USERA3= <user>
##$USERA4= <user>
##$USERA5= <user>
##$V9= 5
##$VALIST= <valist>
##$VCLIST= <CCCCCCCCCCCCCCC>
##$VD= 0
##$VDLIST= <DDDDDDDDDDDDDDD>
##$VPLIST= <PPPPPPPPPPPPPPP>
##$VTLIST= <TTTTTTTTTTTTTTT>
##$WBST= 1024
##$WBSW= 4
##$XGAIN= (0..3)
0 0 0 0 
##$XL= 0
##$YL= 0
##$YMAX_a= 284670
##$YMIN_a= -463540
##$ZGOPTNS= <>
##$ZL1= 120
##$ZL2= 120
##$ZL3= 120
##$ZL4= 120
##$ABSF1= 16.522
##$ABSF2= -4.171173
##$ABSG= 5
##$ABSL= 3
##$ALPHA= 0
##$AQORDER= 0
##$ASSFAC= 0
##$ASSFACI= 0
##$ASSFACX= 0
##$ASSWID= 0
##$AUNMP= <proc_1d>
##$AZFE= 0.1
##$AZFW= 0.1
##$BCFW= 0
##$BC_mod= 0
##$BYTORDP= 0
##$COROFFS= 0
##$CY= 12.5
##$DATMOD= 1
##$DC= 0
##$DFILT= <>
##$DTYPP= 0
##$F1P= 14.0000005364418
##$F2P= -0.99999901652339
##$FCOR= 0.5
##$FTSIZE= 32768
##$FT_mod= 6
##$GAMMA= 0
##$GB= 0
##$INTBC= 1
##$INTSCL= 1
##$ISEN= 128
##$LB= 0.3
##$LEV0= 0
##$LPBIN= 0
##$MAXI= 10000
##$MC2= 0
##$MEAN= 0
##$ME_mod= 0
##$MI= 0
##$NCOEF= 0
##$NC_proc= -5
##$NLEV= 6
##$NOISF1= 0
##$NOISF2= 0
##$NSP= 0
##$NTH_PI= 0
##$NZP= 0
##$OFFSET= 16.522
##$PC= 1
##$PHC0= 162.6075
##$PHC1= 11.95767
##$PH_mod= 1
##$PKNL= yes
##$PPARMOD= 0
##$PSCAL= 4
##$PSIGN= 0
##$REVERSE= no
##$SF= 250.13
##$SI= 32768
##$SIGF1= 0
##$SIGF2= 0
##$SINO= 400
##$SIOLD= 32768
##$SREGLST= <1H.DMSO>
##$SSB= 0
##$STSI= 32768
##$STSR= 0
##$SW_p= 5175.98343685301
##$SYMM= 0
##$S_DEV= 0
##$TDeff= 65536
##$TDoff= 0
##$TI= <Analysis number 999999
Compound Code 99
Book Reference 9
Project Code 9>
##$TILT= no
##$TM1= 0
##$TM2= 0
##$TOPLEV= 0
##$USERP1= <user>
##$USERP2= <user>
##$USERP3= <user>
##$USERP4= <user>
##$USERP5= <user>
##$WDW= 1
##$XDIM= 32768
##$YMAX_p= 304937085
##$YMIN_p= -858993
$$ End of Bruker specific parameters
$$ ---------------------------------
##NTUPLES= NMR SPECTRUM
##VAR_NAME=  FREQUENCY,     SPECTRUM/REAL,   SPECTRUM/IMAG
##SYMBOL=    X,             R,               I
##VAR_TYPE=  INDEPENDENT,   DEPENDENT,       DEPENDENT
##VAR_FORM=  AFFN,          ASDF,            ASDF
##VAR_DIM=   32768,         32768,           32768
##UNITS=     HZ,            ARBITRARY UNITS, ARBITRARY UNITS
##FACTOR=    0.157963299565203, 1,           1
##FIRST=     4132.6476996994, 0,             0
##LAST=      -1043.33573715361, 0,           0
##MIN=       -1043.33573715361, -858993,     0
##MAX=       4132.6476996994, 304937085,     0
$$ Real data points
##PAGE= N=1
##DATA TABLE= (X++(R..R)), XYDATA
$$ [...]
26951 336039 237367 317498 289691 294595 111904 -64112 -69950 -5237 -66184 56258 108594
26940 108594 128650 197539 235308 191648 346253 350430 38925 -212584 -108984 238457 27472
26929 27472 -15069 46730 -79251 -196187 -164253 -143302 -124719 54329 191415 3555 -63161
26918 -63161 93439 236617 274408 465112 449140 437317 155933 -101291 -172255 -279448
26908 -279448 -201718 -44704 -6425 1013 161154 226429 -13038 -240933 -360723 -131056
26898 -131056 19051 -98172 -18599 82618 164851 199042 265670 164679 58473 279571
26888 279571 142143 -19194 122081 220031 260260 224780 252161 -29070 -3908 136935
26878 136935 245530 162554 190445 79123 -84003 -123388 -130713 -152399 58962 333872 111070
26867 111070 -21588 -73229 131086 382054 266008 32794 -185768 -79900 111778 51102
26857 51102 18351 242496 437454 330584 186275 65943 -249818 -159973 145071 190592
26847 190592 -191495 -89568 53799 -80345 -168592 -206979 -57207 275097 223979 -135001
26837 -135001 -249326 46624 136608 52532 86907 139038 2605 165636 88203 44232 -54054
26826 -54054 -235545 -337056 -598682 -473605 -84195 434053 353122 49329 -10515 106577
26816 106577 158173 74617 -32538 -70460 -23314 -179998 -237918 -125937 -208746 2951 159026
26805 159026 253333 333734 249613 150849 79402 70180 177140 58653 -222318 -169947 -170631
26794 -170631 -125313 -134771 -370641 -457371 -174839 26784 27903 -8267 -157989 -304741 -385447
26783 -385447 -278088 -295706 20417 213253 198172 229799 111454 -40998 34860 96905
26773 96905 -172539 -201910 -59812 -205069 -296455 -164239 -71939 -215728 -166949 -261688 -253941
26762 -253941 -126053 -80707 -169894 -116200 -12624 96025 180377 78860 188384 5892
26752 5892 -87758 73963 226145 224132 242133 200670 -12613 20695 237786 213235 399426
26741 399426 306763 273806 449139 341043 187962 290347 212752 298933 224279 156796 248777
26730 248777 436865 408600 437364 390971 348727 249044 282383 450120 360177 430413 405855
26719 405855 246185 23446 -179177 91102 41560 -335617 -69295 236180 340205 208074
26709 208074 95231 74156 176216 269736 499832 440398 392442 670381 672537 492876 466106
26698 466106 353150 411864 225109 -318212 -307070 -47731 -77792 124633 322462 226133
26688 226133 44124 19740 137814 192322 231065 108799 115471 -84136 -372217 -206703
26678 -206703 15912 -86261 -281555 -496033 -246658 -41881 -93477 -70742 232497 378926
26668 378926 413797 277928 277816 104714 -185105 -152472 26805 126193 214119 -93608 -325007
26657 -325007 -317652 -257740 -255478 -299187 -225263 -279958 -185960 -7614 92325 -74414 -53279
26646 -53279 259867 51382 -224538 -336260 -323490 -204925 -164464 95199 -3222 18419
26636 18419 12867 -23190 40543 37788 -168699 -144866 -28694 -24010 160363 130503 228333 204789
26624 204789 192361 172857 220897 208538 -117112 -405786 -360641 101623 443416 400194 220414
26613 220414 48460 49415 86761 146447 57045 29769 245132 189945 150141 489607 611935
26602 611935 399229 173339 7600 -334104 -384460 -172534 -187679 925 241238 378341
26592 378341 422791 427374 465258 356539 238923 77544 166728 210440 2627 -72911 -6171
26581 -6171 -37011 -66984 38771 168877 218278 43126 -33794 23759 -116836 -110656 45463
26570 45463 3278 -61526 58584 165285 211109 76700 -24321 108683 101978 84358 124110
26559 124110 161808 76368 -142650 120099 227081 1539 3947 300148 484781 410891
26549 410891 452161 609790 596106 -28838 -194249 1896 151911 371976 326809 261486
26539 261486 173324 -4021 -190319 -248558 -192040 -136839 -175283 -13898 183254 -33986
26529 -33986 -121429 -41835 31938 306802 207482 73801 -11748 96128 37969 149328 175396
26518 175396 30720 103983 256619 291169 309392 131193 -13982 215179 260912 127774
26508 127774 -174463 -56204 33679 -68326 -223425 -212613 -154699 -312034 -228882 52365
26498 52365 -8967 156521 161542 100779 -140107 -84925 223560 139652 -29176 -21317 52614
26487 52614 189058 236891 52436 -87917 71282 40843 -23686 -214964 -248707 -47362
26477 -47362 -200125 -265794 -309630 -286244 -306241 -53981 99800 19972 -36327 63190 108009
26466 108009 139990 38110 -112109 -124662 -237408 -365343 -358467 -55650 -24578 -84943 149642
26455 149642 358213 274681 330176 154838 1222 110142 149855 340796 443910 345563
26445 345563 344331 301966 -61211 -188968 -26156 -51741 15188 124115 138560 174794 174359
26434 174359 46070 289136 391104 544146 640755 388233 293018 273620 361902 340872
26424 340872 332818 305769 277509 49934 -108103 -220459 -173599 222857 404291 127281
26414 127281 43326 173154 253827 135208 120423 26033 10995 90119 194383 153620 130887
26403 130887 225412 263141 334400 218584 37146 -43316 -66415 122816 165030 183432 352790
26392 352790 495133 206264 -52893 166711 252706 374641 365305 178504 9573 -142100
26382 -142100 -268926 11104 3011 -173137 -104907 -61787 -101245 174627 80140 124596 107768
26371 107768 186022 189831 147498 49888 255749 328360 225492 370404 226631 6689 -232531
26360 -232531 -120179 -67118 -48895 27852 -85153 -242777 -340411 -417698 -458392 -309538 -475874
26349 -475874 -563812 -412964 -340342 -185191 -2255 81543 8913 -85963 -104664 -71340 -36233
26338 -36233 -65182 -170719 -69490 67858 71419 -99284 -194619 -253475 -209458 -55902 170202
26327 170202 -2033 -278190 -9241 275403 103710 -155002 -302967 -147995 -140063 -285735
26317 -285735 -463676 -654417 -723462 -586191 -313399 -370654 -276099 -289595 -254347 -259691 -100057
26306 -100057 110337 87362 129224 -19337 129799 292142 424520 231695 149724 177006
26296 177006 241124 321840 154547 76878 -4016 -244769 -235817 -245016 -118757 125408 439280
26285 439280 237265 80521 236910 -67264 -277404 -513445 -454245 -154415 8059 -65246
26275 -65246 41797 174827 239484 338054 134164 22775 -42946 -68213 46747 83384 44439
26264 44439 140493 332532 378569 417664 361405 176926 26384 -26890 61313 83649 45212
26253 45212 -315647 19229 -26074 -192513 -63765 -58231 -40047 38143 265655 448001 544484
26242 544484 346320 319546 196997 174082 383823 337150 463161 329863 58879 -136039
26232 -136039 -183906 -111534 18323 -24910 18022 22012 -7936 -120472 -20529 62920 215421
26221 215421 70459 -114554 69364 253018 102158 245943 523663 626735 747951 527547
26211 527547 339115 347461 123283 -53020 -156956 -108853 -144299 14868 -322753 -348904
26201 -348904 -226115 -196848 -252129 -301618 -269056 -330984 -90474 -25024 20874 84546 172075
26190 172075 11505 -130677 -1333 182971 262600 354990 112312 -237165 -274793 -184222
26180 -184222 -40958 -254470 -122089 -107851 -430958 -264995 -124073 -256027 -256251 -251832 -130771
26169 -130771 48682 158836 93695 48815 198345 28248 166657 53481 101225 -8818
26159 -8818 57272 56718 102443 48904 104288 6326 -267955 -369690 -307531 -178866 -44814
26148 -44814 -39553 233651 -20404 -142938 32715 -117463 -223507 -112243 -91452 -113380
26138 -113380 -165150 -110171 -293438 -272318 44830 87140 48974 71596 123385 106869 -56128
26127 -56128 44136 -148199 52947 264273 239564 -60222 -244999 -215578 -416977 -315081
26117 -315081 20770 -75817 -258308 -192529 355 320015 251209 116058 123360 -5432
26107 -5432 -168701 -138697 77925 437195 168131 -72162 -118722 -232419 -14581 180978
26097 180978 243178 152510 250429 367393 447485 343195 278965 455751 345269 245786 352853
26086 352853 182785 49788 54634 -156433 -215885 -64366 -66989 -159387 -181521 -115695 786
26075 786 115354 56250 203970 225367 44477 -142273 -176230 -32910 74280 124225 161784
26064 161784 361212 441778 394660 204221 -282007 -224771 -9348 -65625 -147240 158000
26054 158000 188261 148084 169215 397764 618897 649741 491341 315844 212358 143316
26044 143316 246857 297263 75429 12137 -14790 102700 270841 184409 194558 193038 179505
26033 179505 67897 -118176 -181303 -240185 -67660 -61162 -175651 -218367 -288729 -248920 -91069
26022 -91069 -12677 110662 263739 337759 225397 219920 171104 231157 27853 14444 196328
26011 196328 232992 130073 -16504 171146 113270 -75435 -240537 -180105 -155754 59275
26001 59275 123212 73053 -8652 207895 341518 563671 253924 105075 -101089 45052
25991 45052 -88671 -85566 -147751 -228500 -252362 -131385 -147966 6177 23876 -37967 -256312
25980 -256312 -291355 -378888 -211700 -67212 7077 3029 -9864 99255 181845 326667 220644
25969 220644 124278 132326 165144 264148 243894 -73736 -264532 -48488 -144447 -341910 -235495
25958 -235495 -179902 -114712 -111306 -97108 50444 190192 311696 162727 163820 26323 140126
25947 140126 262531 338783 456825 338186 238205 302024 294227 318157 350243 379083 90687
25936 90687 61252 -20900 -351510 -457564 -295401 -30995 -173888 -116254 244042 220594
25926 220594 202021 -4369 39199 110347 238978 285020 166634 -37449 -109687 82294
25916 82294 37639 116959 140219 72741 35058 97430 122156 148965 224308 249485 195843 151968
25904 151968 277007 276899 71704 69323 -50915 -202418 -112051 -91174 -147623 23638 244468
25893 244468 374931 185247 39146 239544 257966 144878 11007 -207682 -222226 89724
25883 89724 262398 253917 93957 -131172 -245910 -165747 90603 -4024 -144210 142453
25873 142453 316824 172258 46372 170891 116350 11626 -162375 -283425 -194968 -71138
25863 -71138 -119682 182136 569524 487740 378514 295680 343009 379044 262052 -18333 -96140
25852 -96140 -29611 58214 -65796 -179015 -223804 -263601 -114188 -70853 48846 85240 147075
25841 147075 11084 -200426 -222011 -234839 -87965 101923 42815 229495 508411 376505
25831 376505 12431 -305158 -110859 -10670 -18608 5079 314236 340746 139036 169981
25821 169981 204066 187590 359364 478552 237988 79556 10403 173963 74111 66478 85048
25810 85048 -71799 -309284 -17449 -66032 9704 50341 102999 -59136 126733 330047
25800 330047 193351 68584 -7417 22237 510184 641085 436807 64565 -114218 97465
25790 97465 117001 108633 98955 77402 124951 41544 80173 -103246 -162711 -153768 -50866 -22980
25778 -22980 62019 79395 16863 -31403 170126 -27628 -171201 65025 273807 415254
25768 415254 244209 -53298 100870 196457 201484 481265 583587 467738 444839 476439
25758 476439 491509 338166 -31980 -385180 -390466 -118109 -273857 -205802 -15457 -10088 99660
25747 99660 69558 169171 273729 482417 271888 45694 -166480 15794 -91239 -61821
25737 -61821 139914 -15955 -63616 -1152 36982 -92154 -110877 -204290 -224812 -106416 42171
25726 42171 76454 -142515 -272218 -79150 32414 -15988 -3304 17582 -122947 -31851 22737
25715 22737 51355 177674 196130 152861 275962 43262 -142744 -103774 42983 82193 112388
25704 112388 157963 194060 168976 68150 198625 235813 471008 345598 239715 115605
25694 115605 107951 344863 219939 188267 121710 22253 -201559 -374315 -586652 -422499
25684 -422499 -291427 -550176 -452615 -163184 -24749 63650 -202034 -217884 -76872 53549
25674 53549 111408 23477 -19107 -179253 -475699 -333724 -183238 -173640 -157745 -140265 220080
25663 220080 303194 218558 160693 -151331 -209748 50174 414311 503962 359668 215313
25653 215313 210079 -46155 -278154 -267776 -240444 -279183 -53920 34160 94411 20195 -79971
25642 -79971 49989 -58185 88123 97394 -9489 81867 176545 100577 -156177 -381993 -195817
25631 -195817 -119828 101570 257680 172815 19957 -71792 -166093 -266774 -186300 97518
25621 97518 280400 229872 19318 -113251 -282500 -360050 -301365 -141648 36039 29636 -13471
25610 -13471 11902 134466 218373 2520 2139 120840 81391 -27214 48422 277817 215350
25599 215350 25375 -143270 27498 106546 215541 345165 361158 194533 -10113 11604
25589 11604 435069 628226 736134 529484 364552 399485 317931 212893 -109074 -218340
25579 -218340 -143933 -12230 -140877 -323893 -161941 -60949 -28680 15533 36482 -21947
25569 -21947 -85485 18661 -3455 -145847 -122073 -28661 -136329 -101256 6364 39186 -44141
25558 -44141 -50226 -97503 -321263 -164176 -514 168349 21318 2068 -48486 -9041 -64532
25547 -64532 -96995 -228522 -79011 -275 280840 520459 245375 151882 383619 443146
25537 443146 251420 165998 291489 232835 156377 163207 371075 155878 -50575 83966
25527 83966 243474 229748 39335 42902 -54197 -156746 -156955 -196728 -239193 -54036 192249
25516 192249 -47648 -264554 -332820 -335155 -339928 -109535 -64235 -31618 -34889 29021 244330
25505 244330 167230 93071 124541 115375 -42604 -38952 -92068 44448 188248 122637 125742
25494 125742 168136 110197 -202422 -119634 48677 -65063 -352794 -364736 -5599 -41562
25484 -41562 -17508 -73251 -132524 -85335 -82984 -244122 -136856 49012 54394 -219918 -233748
25473 -233748 -195617 -52201 -44098 -252687 -353084 -187071 -92874 163946 -34176 -406375
25463 -406375 -483493 -353336 -346266 -387310 -289537 -255797 -304085 -450963 -499947 -585088 -289913
25452 -289913 27023 52365 61452 -60025 -454709 -454693 -247537 146226 228009 20067 52387
25441 52387 382561 437613 15173 -187433 -194632 -213547 -145120 -11907 98037 -174846 -253861
25430 -253861 -306240 -155249 -175036 -106681 -5133 -36862 -98579 89743 115240 135841 220551
25419 220551 306964 246340 64534 10019 27645 189477 392936 353692 145785 -145276
25409 -145276 -215055 -168601 53039 116988 10152 -60209 -89483 -69782 -93362 -305963 -74751
25398 -74751 45103 -142599 -169519 -165412 -240523 -186243 -198316 -171333 -82178 -202096 -245450
25387 -245450 -77698 -177192 -292133 -404506 -54735 -1873 36859 199766 390428 480131
25377 480131 183886 16355 -141777 -35068 166432 38506 31367 67592 -51412 93034
25367 93034 125243 -30819 -267699 -144123 215783 308164 167463 -37570 -75096 -161504
25357 -161504 -296241 -50505 124681 -284046 -555743 -324043 -3938 -91284 -75993 103672
25347 103672 121943 97751 -4606 149098 455891 217679 36626 -65840 -99960 -42552
25337 -42552 -125878 -200722 -275818 -25167 -40946 -324009 -222945 37654 98680 128503 -136863
25326 -136863 -219937 -133328 -97962 79857 144658 -36823 142461 253480 249941 165884 497326
25315 497326 538447 399014 219176 77246 -66491 -116181 -236340 -143818 32902 246155
25305 246155 295622 296689 262775 188427 -82865 -76359 -66393 -274062 -423003 -312430 -56881
25294 -56881 -42264 26546 -141291 -176850 -57175 21387 39386 189956 328080 67748 -121614
25283 -121614 -53051 186394 168380 -61563 -125826 -190901 -163939 -271849 -279476 -212231 -131969
25272 -131969 3177 -56811 -144579 -228138 -159899 157657 246036 274451 178617 -168543 -391472
25261 -391472 -463433 -434007 -507486 -387893 -220030 9534 96695 -49901 -193552 -53915
25251 -53915 -16771 -153988 -282686 -236532 -186262 -214250 -237091 -155955 19377 282173 302964
25240 302964 260421 281869 196053 210294 196459 -43150 -287053 -147515 -24349 177778
25230 177778 208995 144388 -41385 -79813 10161 106051 111027 156057 7709 -231925 -156844
25219 -156844 50773 230397 284825 207443 -13513 -251617 -343857 -73188 28734 -291899
25209 -291899 -256457 -48010 58527 6171 150949 220373 285118 200777 -137759 -188091 -76664
25198 -76664 -17106 -18611 -210032 -300787 -374770 -311232 -45878 53944 -80813 -139623 -314197
25187 -314197 -346869 -171471 -265729 -418493 -211745 193784 261693 312973 264330 134525
25177 134525 285482 460609 258175 53076 166105 312755 224128 323460 317814 392392
25167 392392 326375 78105 -31355 -157732 -50496 -32585 -139159 -350681 -506103 -625971
25157 -625971 -358594 -170025 -188783 84610 257567 218833 209309 128118 -31570 -220497
25147 -220497 -387150 -401530 -252130 -109537 93429 133597 35525 -25728 -69631 -143581 -140044
25136 -140044 89019 107442 -6606 -142525 -10083 41529 88084 -135561 -223611 -137693
25126 -137693 -64096 205300 187002 179897 202516 145592 209746 165401 325223 210597 200430
25115 200430 176985 -158469 -515690 -533326 -431418 -329200 -283438 -59058 -138800 -45348
25105 -45348 198066 142520 207561 270014 68816 -151094 -168027 59089 -158912 -237186 -223273
25094 -223273 -223088 -409728 -370335 23895 199762 49363 68486 -2616 -181368 -272908 -367846
25083 -367846 -232427 -163235 -121696 -195743 -20021 19123 41895 86287 -47358 -250469 -420145
25072 -420145 -393151 -182311 -106788 -177121 -277256 -62514 174779 239350 -66208 9546
25062 9546 17067 -250775 -190307 -99951 -127341 -182214 97606 304328 477208 385964 317141
25051 317141 322456 533298 624370 532140 11750 -190702 -181156 -214323 -142048 69134 76546
25040 76546 -83551 -323987 -363130 -180102 -33858 -297407 -178207 -57725 -85228 -161382
25030 -161382 -180416 -170217 -267053 -331487 -460564 -307415 -1336 211967 319747 31187
25020 31187 -185341 -130536 -7985 279646 502844 440813 118201 -59514 -143917 73124
25010 73124 52490 -190129 -287217 -97637 102971 60251 -65536 -99672 45648 76358 158488
24999 158488 129518 18313 -10204 99005 30281 57931 122050 -116574 -125440 -228634 -89499
24988 -89499 36306 75052 95033 172248 264713 238465 140417 182146 72797 167228 146928
24977 146928 87512 -6485 -191372 -176433 8095 -27317 -69321 28646 165501 257281 -9576
24966 -9576 183041 191090 149151 301343 435565 462066 375695 119247 -18394 95752 -109959
24955 -109959 -8466 50896 -305340 -402553 -333922 -227557 -61477 77021 50551 299386
24945 299386 448836 243507 121258 96750 -116755 -21116 41214 -62107 51804 122646
24935 122646 209113 317255 216127 91968 18571 -28084 -3782 -207816 -80266 -84753 -1670
24924 -1670 19756 -155324 -79323 -72175 -47817 57111 141467 -41085 71149 -48109 -298000
24913 -298000 -155843 42488 130051 178684 149596 75178 -35463 -144039 52067 133074
24903 133074 -151343 45027 325481 190978 390587 367989 233797 -49127 -189590 -157549
24893 -157549 -361315 -213843 -227088 -338187 -385040 -120044 83717 33820 134421 201638
24883 201638 60098 -87588 -72930 -25634 -146150 -227595 -240385 92664 219869 120679
24873 120679 81077 242170 321812 365980 247412 170877 124743 346411 411377 183456 378296
24862 378296 662107 508082 122654 -122459 -272632 -163640 -328640 -260313 -90067 -106492
24852 -106492 -232930 -137887 5901 -51627 -242204 -271090 -217621 -79788 -172590 -296482
24842 -296482 -36031 101348 110721 -58517 -91236 -292481 -207739 23280 133775 43066
24832 43066 138351 177739 -13771 -103643 -389178 -185499 -83161 38516 -221131 -163570
24822 -163570 -37114 -27338 1555 -34296 -193791 -280607 -148726 -95495 -219310 -382525 -485251
24811 -485251 -427390 -411953 -223423 -240182 -360155 -555465 -168946 66514 -132121 -96235
24801 -96235 -65278 54888 81466 -2879 -84366 -219304 -158631 -11048 -150366 749 120666
24790 120666 8454 -166371 -193819 -338222 -231391 46932 138325 229899 464226 404981
24780 404981 106217 -130490 -15427 -38804 -48785 134018 126616 380254 458748 463233 296660
24769 296660 116721 167114 163150 138337 104175 100834 -129122 -142065 48771 118092 -107362
24758 -107362 -165307 -139120 -283492 -140580 -94324 -300206 -388591 -495819 -475799 -685663
24748 -685663 -356925 261 -45756 -112007 -113504 -161743 -102349 191052 433772 278414 -74571
24737 -74571 -139403 -120725 68725 189811 -32913 -8153 24807 -82088 -123180 -49156 -164977
24726 -164977 -86422 -177350 -160997 -162223 33930 181782 -3329 208034 361982 401112 335549
24715 335549 384725 452746 268611 192747 238695 304575 164316 -171861 -89088 -127470 -271201
24704 -271201 -300215 -500486 -450344 -199092 -291065 -6918 286183 131182 -96971 -438468
24694 -438468 -408687 -413664 -315412 -36254 -75874 -277070 -219323 -108513 132915 137886 153812
24683 153812 361034 245772 67174 140678 156183 115177 -25170 -79280 -61352 -44033 -147760
24672 -147760 -81871 36582 90915 -108079 -174543 -172711 -432911 -668201 -664714 -669386 -641839
24661 -641839 -515016 -266504 -321463 -213489 29286 141726 -105306 -121261 -149858 37846
24651 37846 39178 -141118 -84778 15401 -89696 -98968 -175785 -332155 -77818 155066 -47911
24640 -47911 -204289 -435985 -325625 4744 131011 201466 -24111 -104288 -146288 -223237
24630 -223237 15228 40609 -165705 -261068 -354076 -292523 -181261 169965 297765 282551
24620 282551 223461 339680 408367 337436 85031 200829 196854 -66834 -37932 -95693 -261432
24609 -261432 -159871 -368563 -215762 130453 -705 -44778 11058 -22953 -207288 -340312
24599 -340312 -355090 -371870 -204329 -262687 -426757 -146937 -11589 26936 124468 156256 323550
24588 323550 143358 -83147 -18740 -133605 -19409 4760 -9090 117588 98391 -136284
24578 -136284 -448481 -523956 -239951 -19955 -54885 30427 65448 30884 -57177 -52544 -122401
24567 -122401 -219196 -144694 -253753 -356483 -72170 247198 358859 -11965 -138917 -14869
24557 -14869 -98963 -240640 -201581 -38461 -2864 19491 67875 -127684 -158221 -224499 -381531
24546 -381531 -337192 -304180 -172671 -44899 -8882 180516 337057 366488 224782 12441
24536 12441 -69921 -76950 33465 41380 -87153 -460055 -516051 -207625 -232934 -312104 -141973
24525 -141973 50222 166867 207790 393213 472285 526934 141620 -39033 -233092 -143421
24515 -143421 -36550 126655 170817 141264 414073 341347 90769 7521 58005 58411 -119059
24504 -119059 10985 67947 203696 265985 204819 -43521 -62513 -64501 23330 -275145 -472737
24493 -472737 -393900 -40771 77208 19302 -71208 73019 -32922 -149356 -216832 -128077
24483 -128077 -208704 -347119 -416645 -348154 10236 190084 169882 193542 184254 198165 186161
24472 186161 114458 -150407 -199722 -73499 48271 163726 172242 275351 399360 319484
24462 319484 -114214 -480598 -532331 -285442 -167293 -11134 -4519 -19612 -66124 -331298
24452 -331298 -230538 -4705 -177807 -7290 108885 150338 35262 -137663 -86981 73850
24442 73850 -134209 -201489 -80499 21757 140764 146391 260180 248547 212522 162254 283977
24431 283977 396713 376313 383814 360985 308659 486271 527562 500838 374934 -39497 -445182
24420 -445182 -321530 -183991 -291869 -136342 143652 441824 319989 198211 41706 -164951
24410 -164951 -125818 -149813 -104091 -81154 87240 274321 -72836 56 175992 247616 128541
24399 128541 -51050 -266072 -216253 -289946 -525853 -471232 -46714 -14803 -167631 -231036
24389 -231036 16828 21652 -144968 -508265 -559277 -464656 -386937 -164451 -192785 -127505 83791
24378 83791 267248 393131 507834 530809 487205 46245 -42411 -112883 -63647 -147121 -155751
24367 -155751 -148783 111003 169252 -3122 105563 -7047 -169213 -362370 -468005 -554293
24357 -554293 -554827 -370151 -153959 -157911 -192511 41186 -28988 15535 -102533 28181 265020
24346 265020 31766 -220361 -69644 -89789 -167098 -286933 -332214 -245120 -142459 -6424
24336 -6424 67062 125694 93491 304242 210731 43150 114409 -41077 -254770 -325142 -252146
24325 -252146 -336481 -336108 39458 66742 30884 135875 430209 668286 460063 52930 -187891
24314 -187891 -143137 33649 161544 139794 202509 286263 250772 79835 161724 430970 506936
24303 506936 314808 213442 -96762 -52598 177587 313541 193730 250937 259852 297101
24293 297101 476467 442847 162169 -69486 45995 66289 -165542 -347181 -425234 -343832
24283 -343832 -195005 134416 75569 25367 142104 183821 232754 100145 87119 248907
24273 248907 181122 562191 569179 344688 110339 -20206 -38215 -42211 -115858 70416 199850
24262 199850 59307 -264105 -280245 -106937 24770 36869 -52170 61677 260431 275979
24252 275979 371575 336958 261619 16616 -49225 117967 489716 471675 22297 -172667
24242 -172667 -24110 -86073 -40903 -204643 4542 -40930 -297822 -94941 278554 474888
24232 474888 647812 640053 451151 272636 233683 129249 -61769 -29202 -71020 942 -14962
24221 -14962 34778 -127401 -199982 -209611 -238600 -133453 -21099 122285 221846 164560 97865
24210 97865 31607 42824 57366 -17642 189 -63195 -87496 -61869 -125310 -212862 -234666 -266010
24198 -266010 -306450 -673917 -840334 -476888 -420619 -265582 -266516 -252842 -200609 -168639 -61142
24187 -61142 1991 148581 -6419 -10658 161295 133384 156222 449014 290623 232538 231866
24176 231866 53493 -445530 -644768 -560052 -236096 -14855 -97546 -48540 -6047 -270915
24166 -270915 -446387 -278733 -131028 -98105 -250550 -130577 -200009 -202757 -38862 6913
24156 6913 -140566 -202585 -107827 -144044 -242446 -314647 -215272 -43723 -71072 -209719 -127314
24145 -127314 37149 72015 -49016 15902 194371 160163 176606 37910 -40222 -92839 211545
24134 211545 410835 146181 29463 -73019 -189775 106495 -27885 -332405 2920 139825
24124 139825 48354 232108 204293 -135890 16021 -38350 21303 202005 334444 365997
24114 365997 107615 -276717 -381534 -38594 283051 220997 -89046 -96791 116128 318449
24104 318449 327795 57051 64691 3168 -80112 160802 281083 194279 -155799 -261315 -356012
24093 -356012 -230154 188679 280081 34461 16246 -85732 -9233 103901 105838 160824 58068
24082 58068 245415 545820 368385 277775 135192 -121844 -251697 -35887 -382 305591
24072 305591 434998 362633 304979 -134483 -354416 -409241 -282729 38711 239914 190075
24062 190075 74535 96406 72223 -53518 -88745 -78214 -255238 -297848 -259474 -100179 -30953
24051 -30953 -202651 -179481 -97519 -69032 4153 50866 290142 128294 -55631 -159783 -208147
24040 -208147 -42703 224745 338393 311146 371816 236225 -85966 -348997 -198446 -167937
24030 -167937 -249901 -4973 5700 -169952 1606 221750 211252 221477 110958 102863 199829
24019 199829 191485 125276 -8708 -238797 -257879 -455602 -444161 -438739 -420552 -473264 -522222
24008 -522222 -414881 -409236 -226809 -169007 -201150 4278 42722 -183145 -100431 13832 -113500
23997 -113500 -254028 -57167 26846 77060 150533 81573 55671 31742 11884 -48501 -162723
23986 -162723 -152302 -104502 -210778 -65613 22038 -52457 -244139 -405271 -267653 -105089
23976 -105089 -327342 -37654 38055 -17033 -274969 -339913 -165464 166993 274090 28666
23966 28666 -173987 -281208 -325064 -192862 78858 391467 354458 295174 177611 211860
23956 211860 284748 157359 170309 249097 334778 193566 -16925 -217509 -285069 -311830 -141443
23945 -141443 12758 220951 136222 101954 95809 -62575 -75748 -71064 -157351 -118735 -93860
23934 -93860 -123057 -71916 -101792 -20252 -37093 53849 -18099 -236512 -355076 -198949 -158789
23923 -158789 -217910 -236197 -255341 -212744 -177746 -173453 -47544 57995 117570 19556 -178502
23912 -178502 -175434 -93610 -94653 -250242 -266129 -301854 -587604 -517361 -199224 -170148 -129914
23901 -129914 -161282 -47908 126112 194879 510889 522411 287065 173448 216219 132237
23891 132237 -182443 -357334 -336956 -280667 -326111 -327159 -408871 -351284 -333771 -318954 -191577
23880 -191577 -159533 -290821 -328488 -31616 -98839 -124693 68997 306046 248848 210549 31575
23869 31575 -116491 -218217 -379563 -466240 -519967 -383586 -450537 -270304 -201904 -247561 46543
23858 46543 82682 110182 12680 10296 69614 47355 47499 83929 59250 42664 -126837 69393
23846 69393 164311 76935 -29532 -351946 -346974 -204072 -195429 -380724 -336948 -189788 -66543
23835 -66543 -9448 240095 238663 266332 417649 308092 443702 141966 -162750 -304408
23825 -304408 -335034 52558 301599 356715 54236 -288465 -232743 -295225 -323601 -359770 -95779
23814 -95779 -116702 52046 -50490 -161836 -72141 135697 97187 -72052 -82285 37865
23804 37865 222287 314377 245400 244222 142195 -144542 -55189 -90261 -32640 203417 151464
23793 151464 302237 312627 132043 185050 245611 241829 199743 20208 -51034 235053 378704
23782 378704 248501 88283 -14807 -13256 58722 -2719 -188311 -137322 -100223 -332186 -374909
23771 -374909 -284015 -298459 -392588 -480678 -361979 -333905 -114970 -186933 -153372 13216 119679
23760 119679 193162 44775 230600 280474 60396 -13025 111132 161906 167201 95090 -102533
23749 -102533 -215009 -226753 -244497 -100370 88920 146850 59068 82787 125670 85805 -512
23738 -512 -19484 -51621 8684 107248 105485 -169161 -238095 -164184 -141159 -132531 -98049 219855
23726 219855 261292 281174 263650 111516 -125691 -287027 -191007 -52976 76927 181566
23716 181566 200989 418666 310943 418054 304245 67315 -86275 169920 248353 407924
23706 407924 409813 208829 165514 -168540 -411032 -463915 -283266 45244 -194516 -204365 12287
23695 12287 -116192 -238456 -127450 -97083 -177782 -285288 -322331 -87862 -24191 -4803 171153
23684 171153 428978 388657 267746 505849 524061 170984 219806 318183 164540 34604
23674 34604 142858 261364 187068 25526 16419 102093 266616 350128 443828 257741 127043
23663 127043 -173689 -265029 -364489 -212019 -20483 175864 174454 131690 76188 -233120 -638490
23652 -638490 -827638 -780788 -579523 -273630 -162635 -138875 -149526 -198821 -200558 -194721 -323489
23641 -323489 -450808 -458019 -298025 -198890 -260770 -251647 -191267 -270774 -298868 -221261 -106694
23630 -106694 -6001 -98214 -201725 -344204 -375780 -361836 -263678 -8220 89102 -4973 -48946
23619 -48946 -146041 45866 194405 -2808 -167442 -49249 68283 -238097 -195116 22617
23609 22617 100697 10820 14471 8176 223388 284186 388371 342042 449348 238404 49677
23598 49677 -135235 -253241 -244938 -259289 -363050 -264237 -103509 32106 120636 -24202 81425
23587 81425 26647 44771 104645 -155692 -237743 -12893 262128 564535 530176 111835 126533
23576 126533 223921 167735 43950 17550 240087 266668 315106 36247 -320547 -492609
23566 -492609 -340465 -132493 -37717 104967 108309 -127888 -254505 -347427 -338058 -222157 -63954
23555 -63954 -121639 -131316 -177235 -58852 -42308 -132491 -21101 9622 52516 323 -259950
23544 -259950 -107945 26288 -186071 -171922 -143697 -101249 -139227 -202073 -155009 -325911 -193937
23533 -193937 -136736 -117996 62165 193183 257861 120310 194778 445809 533899 200308
23523 200308 -63860 -25764 169701 117117 -7985 43752 107311 263395 89625 -240840
23513 -240840 -268218 -247114 2052 100719 -97006 -3201 -88310 -96456 60676 27834 135345
23502 135345 283566 -31840 -212239 -108097 24170 -279726 -196744 -222261 -270791 -382348
23492 -382348 -198055 -78560 -54428 -25947 115178 261237 332401 187195 -6137 173601
23482 173601 378982 213262 39412 -144415 -81079 110835 209114 111383 -47051 -172976
23472 -172976 -167247 -70380 -91127 -218334 -461268 -363749 -259158 -187743 87915 116625 11415
23461 11415 33150 -131677 15138 228529 -75422 -211385 -199043 -116073 -153395 70326
23451 70326 224277 98080 -384125 -428415 -231622 17052 -4350 14022 -151455 -62726
23441 -62726 -27406 -124181 53041 50990 -76823 -73090 -55150 -181892 -130384 -20013 129533
23430 129533 -58591 -199217 -274746 7339 326966 521946 451068 311159 152966 50266
23420 50266 106334 263992 260650 270938 484842 352825 202783 109575 286063 98322 -49239
23409 -49239 -240805 17975 18696 -75465 -217140 -125425 -45570 78803 190483 -81544 -110102
23398 -110102 -50627 -122913 -204304 -70393 -103879 14312 -64826 -15240 28366 -57873 -172935
23387 -172935 -320449 -545425 -535494 -378480 -11102 173218 282529 282996 215648 142211 25160
23376 25160 7357 -8785 125169 146677 -72980 -217118 -79217 45787 142450 82241 -5112
23365 -5112 3773 72507 241557 92304 5898 215365 103383 -60182 -3143 123220 108671
23354 108671 101549 159642 -41654 -264011 -436678 -666666 -584781 -338188 -133089 101094
23344 101094 294843 304294 451458 166163 -206137 -452583 -458788 -294577 -101024 137110
23334 137110 12167 93848 224489 46495 -94144 -30517 -167821 -315627 -306434 -375802
23324 -375802 -164380 52086 49315 -47681 -162990 -350887 -215507 62419 200528 147240
23314 147240 93987 -158348 -130903 -117259 -204426 -140226 -172358 -57884 85992 -75409 -168984
23303 -168984 -277701 -206646 45094 194055 178467 -118275 -179122 -169793 -272265 -129009
23293 -129009 109800 -23740 -141231 70268 61589 -68002 -143742 27692 167175 125713
23283 125713 57993 25383 58960 -215334 -243448 -236473 -150344 -14554 328944 463445 169608
23272 169608 -50778 96591 35114 -38528 -49142 -104397 -129752 -9001 -127053 -212970 -222914
23261 -222914 -398154 -185234 -205374 151949 399836 391654 226268 12255 -146594 -176933
23251 -176933 40114 72420 57113 8833 90326 -58020 -33847 -127443 -37640 105388 142716
23240 142716 136910 182021 198419 76126 -171161 -224250 -100566 11811 163274 145104 28506
23229 28506 -8676 264246 418769 325707 18047 -24811 173893 211711 44201 28670 -409747
23218 -409747 -607006 -594835 -550161 -370136 -149646 -385401 -315421 -114012 4576 -222446
23208 -222446 -149589 591 47046 295329 134539 2415 198382 -20886 -230065 -361913
23198 -361913 -336374 -30284 44860 129892 140864 62044 -105025 -120612 173947 -3040 -19765
23187 -19765 -158809 -234641 -101356 -174435 -208439 -74917 -54656 -87914 -52243 76531 255326
23176 255326 333031 350379 391755 150137 178515 341272 347508 59073 -366704 -454279 -158205
23165 -158205 -96196 -286411 -413545 -254945 -356717 -116980 -3729 -21952 -280252 -437963
23155 -437963 -110189 -219938 -144199 115071 50054 52707 45288 -16944 -194972 97952 364237
23144 364237 267224 172167 375592 708076 616056 404952 365347 535134 519599 412872
23134 412872 149051 -12072 -58105 -148811 -292132 -340047 -226509 33112 132387 74739
23124 74739 47394 -40939 131599 290969 253142 191533 17386 -294501 -287988 -306227 -177952
23113 -177952 -160277 39148 153523 154032 268309 86067 -92094 -140164 -204915 -192027 -355443
23102 -355443 -282168 -73585 -22378 -61448 28885 214055 265892 295186 177350 138644 100739
23091 100739 90728 43465 -5110 -49048 -11756 -66070 -146649 -104390 -251472 -255200 -460000
23080 -460000 -642575 -700952 -317224 -98879 -65096 -300656 -276867 -101512 -125934 27036
23070 27036 29287 147191 63309 -65443 -44603 83376 102922 68659 87297 23839 -90031
23059 -90031 -36114 -49891 -166877 -9564 158913 -26676 -53315 -257989 -196783 -245090 -71606
23048 -71606 93664 -21775 -116711 -82866 -72117 -153925 -251551 10910 -61083 -315031 -316502
23037 -316502 -303336 -169010 279178 301999 17319 49070 500648 426901 67494 -97894
23027 -97894 -287001 -250719 -349984 -262791 -65518 -48170 153027 300064 111820 70773 127315
23016 127315 84373 81749 251513 109511 -79074 -290455 -318334 -279743 -360039 -454658 -493201
23005 -493201 -248531 -19009 -85586 -152622 -36511 186762 374129 370232 367943 278411 -31257
22994 -31257 -152214 -171462 -105008 -130935 -49964 -18512 -26755 -84208 -364106 -276335 -177356
22983 -177356 31885 -38129 -271037 -137135 117038 82134 172667 152030 183464 226433 86560
22972 86560 -48374 189713 273580 172809 1123 -310461 -471135 -156329 122793 324946
22962 324946 524765 413727 361257 330359 263628 230633 68861 38293 106911 262572 -93196
22951 -93196 -243640 -246929 218269 390595 217537 83695 -129832 -145906 -301166 -292708 39856
22940 39856 96474 -2470 -277150 -242734 -378265 -451976 -346870 -109998 151152 107968 80234
22929 80234 78275 95308 8872 56643 11986 -60773 -34391 -117331 -113947 123003 262946 414165
22917 414165 224820 362907 573462 439396 304251 75643 385994 522358 552765 331895
22907 331895 67476 46196 298734 432023 137843 -218873 -89877 -109847 -432106 -345968
22897 -345968 -239959 -98839 136881 222205 309625 150518 113553 118974 -21295 -160950
22887 -160950 -187415 -27042 104876 22183 -200677 -111215 39366 53601 -19806 220023
22877 220023 369175 414857 392350 330020 89570 41091 192053 22560 -95966 -195916
22867 -195916 -315182 -4469 326124 244114 40908 98505 29255 -110980 -169719 -249526
22857 -249526 -313241 26074 -89819 -269318 -84569 237583 225584 47245 -206538 49364
22847 49364 27830 -173059 -185849 -88077 -130453 -217223 -245622 -228150 -252061 -216847 -189207
22836 -189207 -156958 -64604 -67328 -76146 -216706 -287753 -40108 355529 378575 428396 164926
22825 164926 38041 -45368 22109 65479 2029 13408 190755 372728 445972 429960 394058
22814 394058 260779 68073 -14108 -33630 32406 307865 222404 208002 -37916 -187300
22804 -187300 -237117 -174347 -128680 -354558 -418776 -302753 57780 187206 66920 -51133
22794 -51133 -17615 -185040 -363235 -494909 -484131 -573221 -446629 -174550 -185466 -137375 -241104
22783 -241104 -283927 -385252 -255306 -19994 44368 26154 121424 155452 144901 -80945 -177084
22772 -177084 -60772 89453 69392 -56693 126592 142155 -69025 93182 190258 370315
22762 370315 362283 373853 412095 104712 10717 123737 -121943 -316673 -154509 -82862 -92649
22751 -92649 -269166 -596279 -483714 -354176 -196614 -47075 50663 133267 35091 -144520
22741 -144520 -200429 -203326 -134654 -53109 -41857 -193564 -222681 -54532 -179019 -334645 -103901
22730 -103901 397184 427079 149595 79788 4110 199422 526462 389323 71986 -149585
22720 -149585 -266360 -292717 -129191 -110517 20433 127890 98256 48092 162601 479052
22710 479052 456221 258138 251747 277904 299133 207000 28771 -85919 -57587 -155840 -126379
22699 -126379 -264438 -388113 -209864 -36834 -23691 -133467 -331745 -280115 -118772 -122793
22689 -122793 -303085 -177836 84533 206081 294119 -6602 -82469 -36507 -121697 -382225
22679 -382225 -381914 -200754 64691 -10374 -165551 8886 42478 71110 -26817 99193 380654
22668 380654 239815 -41742 -83708 -24554 108360 140676 74210 29255 -29488 -73783 -147181
22657 -147181 -97546 -39152 -173036 -26197 254957 297921 382261 262222 200775 179701 165350
22646 165350 103548 121070 60928 -1200 -203088 -148686 15056 -39195 -306734 -443595 -297393
22635 -297393 -342514 -349200 -251252 12990 -105678 -277716 -22975 -109156 -43842 -6023 -129154
22624 -129154 -389403 -173691 -133654 -206626 -323685 -272818 -222720 -263755 -82006 178756
22614 178756 137749 -105468 -295696 -299201 -292374 -270100 -511 83263 -42221 -687 110376
22603 110376 117302 51319 -38509 -91527 9072 42166 129539 289892 269020 109078 174295
22592 174295 153697 -95102 -194659 -157552 -27231 37418 -89926 -30095 32985 160355 333812
22581 333812 373694 297068 217959 111200 39621 -20287 -76176 -29307 -81025 -136032 -40882
22570 -40882 247239 162343 136331 111333 -7477 -380809 -476274 -131349 -22390 17471 -156853
22559 -156853 -43770 -132777 31465 152974 -45944 -70730 1550 78379 10602 173714
22549 173714 207722 -47411 -171048 49963 -76433 -153445 -222855 -350763 -473962 -349956
22539 -349956 -94917 289001 117692 -106056 107553 322453 398766 175300 87809 -21462
22529 -21462 162265 176253 360941 98684 -215474 -271061 -268942 -284197 -203248 -261992 -202643
22518 -202643 -147574 -147311 34406 -45755 21317 -3983 -178319 -340130 -444784 -227079 -109511
22507 -109511 -28500 -39465 -136955 -281256 70347 173427 2559 276897 345313 213485
22497 213485 149291 92442 -65243 -15564 -47232 -130260 -493 235863 288892 106246 87738
22486 87738 44314 -169776 -80547 250711 350950 455744 553578 540202 241066 -147856
22476 -147856 -337019 -30553 226194 17660 -74908 -386731 -430175 -164143 -179879 -329336
22466 -329336 -276096 -90218 -212431 11603 149043 112703 80005 82847 -127586 -269177
22456 -269177 -286866 -249416 -72909 -47687 34229 26316 198405 59746 87130 -79118 -80189
22445 -80189 214477 135778 -223988 -250638 -55689 -103923 -221439 -186830 -122255 -62230 -29573
22434 -29573 -158503 -140606 -60021 -392168 -395079 -200579 -179883 -184382 1621 145981 472603
22423 472603 759113 564936 226251 66403 -101906 -27137 3764 213951 173676 115662
22413 115662 90863 -14434 -47707 -94142 87343 199344 41818 60621 181514 265854
22403 265854 323953 93022 1498 -221953 -320088 -296482 -72303 26238 172298 342376
22393 342376 217905 24489 -245461 -456734 -385164 -293216 -319116 -386168 -444605 -152555
22383 -152555 140426 281488 203370 203629 -14518 38425 53486 -158259 -209083 3058 102432
22372 102432 -77052 -128613 19248 -79048 28781 -343891 -405291 -258514 -342068 -400091
22362 -400091 -305671 -352012 -488068 -338330 -82638 53682 175878 343603 453299 426044
22352 426044 505893 424480 381326 397167 80509 -6340 33772 3882 -209545 -403660 -454348
22341 -454348 -231418 -124346 -124532 43028 22497 -233613 -381757 -349740 -335876 -275146 -347319
22330 -347319 -385733 -318883 -304977 -120895 149593 -15235 -35842 61992 129199 25830 -199645
22319 -199645 152308 86131 61180 112138 -95136 -199030 -113220 -96327 91779 190168 158804
22308 158804 142626 30126 145735 141429 126720 145969 103580 -26316 -46827 186595 282485
22297 282485 246390 334053 320189 201233 121291 100742 170217 190642 14610 -335219 -116657
22286 -116657 58505 6333 116326 87716 -50390 -138286 -112010 -170784 -134351 93122 146959
22275 146959 -193289 -343277 -293947 -75654 -141780 -268860 -257870 -341111 -340113 -318186 -387492
22264 -387492 -250092 1068 -90717 -284282 -214325 -10261 -52133 -112370 26365 -27210
22254 -27210 181201 124588 33771 -44406 -160577 -220764 284726 519741 370390 45145
22244 45145 -78785 -43336 -170156 -129433 246547 255522 87239 24037 286349 362534 -37350
22233 -37350 -267981 -173670 -132132 -300119 -547271 -472624 -322278 -69912 219130 264620
22223 264620 69972 -12060 137895 159638 -118628 -357574 -207663 -41714 -39096 -165277
22213 -165277 -122046 22897 111119 230006 345799 200775 135759 57098 15060 16710 -10195
22202 -10195 -8386 227735 351132 55052 -60209 145760 184857 107977 -11453 -109509 -72092
22191 -72092 -82754 -110336 -123006 -202052 -287929 -289682 -87344 -8869 -581 132737 250725
22180 250725 48339 16865 129759 262636 500037 540825 322433 165837 -11114 -11252
22170 -11252 -164214 -156891 -107008 -153656 -48494 15778 88978 294994 151534 53688 349561
22159 349561 285802 136316 71742 125782 -46583 -632083 -697013 -363105 -229767 -537
22149 -537 274165 373599 260834 14740 -7563 26104 -80259 153354 200721 274015 -87002
22138 -87002 -420744 -578578 -449758 -303444 -89433 -58231 -388187 -388706 -75597 -13566 65940
22127 65940 122256 95041 156607 -101863 -306945 -192605 -189944 -64656 103584 231757 225724
22116 225724 85293 -88576 83840 152375 231503 -136487 -131141 131153 263762 413654
22106 413654 265626 257966 149149 -21101 75961 -13031 68807 104411 -126452 -70816 41989
22095 41989 -100383 -247542 -342086 -369664 -39712 283959 240280 201023 127462 175354 101877
22084 101877 -62437 -161712 -347363 -440269 -303038 -193985 -41040 -96163 -327537 -578795
22074 -578795 -375551 -167162 -143287 -192096 -158529 -300845 -334996 -266048 130658 136586 89989
22063 89989 223482 284633 87630 111 9094 133663 240758 5750 -155764 -228571 -174936
22052 -174936 -37937 -158797 -144976 -187224 -195333 -126684 -1245 68200 143139 -25047 -43388
22041 -43388 -57377 -148845 -460262 -640993 -510701 -261278 -189903 -160095 49209 -20688 -236152
22030 -236152 21345 201524 175405 310541 468750 306932 34000 -100789 -152651 -130064
22020 -130064 -17672 -4353 -25413 -134209 -270449 -374688 -119186 119396 158138 104312
22010 104312 -15269 -15905 47758 179944 143017 -9332 24461 -90536 -104158 -148212 -99410
21999 -99410 104168 194856 134066 146712 91244 -49923 -212431 -16832 167545 192287 195400
21988 195400 84657 -102750 74752 -27963 -143525 -125347 -89514 -8019 75931 82315 18757
21977 18757 -20496 -12689 -110404 100190 223779 185714 139749 13251 -25276 -38879 -12383
21966 -12383 133416 164061 326240 209369 120641 -54513 -126926 -248168 -251743 -10629 -68398
21955 -68398 56024 365499 382245 114709 -154073 -138187 -145939 -87250 21399 -186074 -375306
21944 -375306 -543643 -569806 -215170 212761 312549 213445 8762 32810 152724 289511
21934 289511 255266 69608 16257 71157 416170 372289 224140 -146493 -292227 -154153
21924 -154153 29078 20187 126364 401205 368273 -75910 -142465 -27419 -304517 -375943
21914 -375943 -259170 -353175 -350191 -175205 -112526 33664 105924 -94916 -290726 -69902
21904 -69902 201511 315002 273352 69735 -169816 -266089 -202812 -50110 -69726 -138159 44214
21893 44214 279981 405404 530431 393005 231110 146182 145911 -106789 -81175 -139812 -290532
21882 -290532 -428823 -313880 -119736 22106 -95071 -225512 -324810 -113527 -59973 82427
21872 82427 104424 103302 -125427 -380713 -479601 -490677 -343474 3891 32591 -369480 -436051
21861 -436051 -475670 -448112 -338979 -281739 -152089 -398 -153076 -128886 -142659 -291570
21851 -291570 -300713 -118470 -88478 66705 -76751 -213068 -428512 -322044 -212738 -291745
21841 -291745 -253230 -105571 -310325 -509263 -376534 -298464 -163292 -90582 329661 398675
21831 398675 329712 359211 155801 329721 5719 -508305 -498721 -234231 191026 261511
21821 261511 91872 42974 -60005 13501 121739 323752 527169 257979 57449 35746
21811 35746 -29929 36354 13567 71072 78096 239572 136915 -24540 68275 69810 69043 132136
21799 132136 -71407 -179372 -185789 6783 42052 168716 339385 365368 146678 156659 114559
21788 114559 197297 100199 109598 184345 158506 17036 -44592 -171986 -384926 -162495 52774
21777 52774 144785 196450 178573 -57234 -99215 -102503 -2230 -29282 -56701 99270 159820
21766 159820 215990 37619 -86469 -142196 -41794 -26158 177810 237634 68256 139390
21756 139390 -45197 9883 200719 143096 -97169 -98055 334910 404806 277433 103208 82628
21745 82628 -48074 -36194 -185362 -297427 -517150 -533662 -455075 -378265 -446493 -379349 -74518
21734 -74518 -54596 -106668 -117333 -85179 66333 170733 -80625 -89188 -47987 147096 -6243
21723 -6243 112916 287280 184416 49529 261782 356360 -14148 -438032 -563408 -588743
21713 -588743 -605956 -434618 -278022 -170393 -271707 -204463 167959 280777 307315 278339
21703 278339 261803 65898 170513 183338 107069 101948 72398 37968 -321516 -333004 -226274
21692 -226274 -323745 -338306 -225755 -235255 -161334 -144706 -132884 -290165 -262060 -161941 61355
21681 61355 51688 24296 -111823 -310773 -309455 -37217 30163 -63576 -172678 -114079 -256457
21670 -256457 -255828 6770 151582 98303 102891 133866 -5739 5493 -180709 -59155 -112789
21659 -112789 -159645 -174114 -240409 -415826 -429608 -381332 -230367 -268341 -238344 44184 136621
21648 136621 125441 230530 356494 361351 362648 230383 208168 239084 238947 437154 571284
21637 571284 411334 114991 -84941 -101601 -188091 -271142 -432347 -365405 103372 450461
21627 450461 469847 212619 217800 262293 19595 -8018 89370 218302 340901 465990 440554
21616 440554 423345 156223 33997 148219 50386 62166 117418 194899 139664 236220 73365
21605 73365 -271103 -372500 -133133 -22692 103223 -24014 -222192 -267464 -408038 -313465
21595 -313465 -17176 143616 166133 131394 46303 127639 -29458 -373072 -342817 -48907
21585 -48907 12445 -22064 100416 -186079 6110 528906 653076 490808 497592 617394
21575 617394 452729 203281 609598 602446 194859 103095 115820 -124373 -112731 -71969 -54213
21564 -54213 -73239 -12028 101708 99683 -181995 -163295 -254352 -237053 -218469 -194772 -355466
21553 -355466 -326483 -200280 -100342 -100064 -170288 -179853 -349418 -522374 -233538 -74935 47957
21542 47957 86091 40176 -165571 20654 222115 190139 96357 177167 111241 100242 343698
21531 343698 136950 -58786 -22299 62579 66133 96720 146241 78586 21229 -114267 -283910
21520 -283910 -340926 -291978 -223673 -220354 -247364 -170938 -162482 -140042 1833 267387 128038
21509 128038 -140094 -77926 -120685 -321815 -254668 -146842 -445876 -240617 27595 -69291
21499 -69291 -137530 -76281 -63114 -119562 -191820 -101619 -100709 -322878 -333922 -266321 -206038 -215524
21487 -215524 -274973 -274286 -527959 -417425 -369340 -257971 -138694 -186974 -52499 164975 276559
21476 276559 384686 69949 -53382 105923 42269 56824 10310 -37543 -180470 -204402
21466 -204402 -84824 -146174 15495 26737 -24892 -166605 -172973 -198247 -230488 -37704 -199535
21455 -199535 -153954 12201 -163273 -259786 -244586 -486314 -398636 52886 329039 -87323
21445 -87323 -279392 -243451 -59220 -94216 -95438 -72198 147855 104313 83042 -69426 -186933
21434 -186933 -20959 -65532 -55370 -443364 -418606 -287796 -174056 -256716 -395683 -595686
21424 -595686 -464562 -355554 -322436 -162862 81271 27292 -75144 -211713 -308040 -274762
21414 -274762 -283330 -320956 -284510 -298730 -151465 -288625 -545976 -247051 -157695 -289826 -167375
21403 -167375 -47378 -42039 -151409 -179265 -8181 -66618 -107780 145151 97570 16110 175482
21392 175482 327845 256858 319663 377478 152616 112013 294872 329660 154275 74879 150589
21381 150589 21850 40291 113438 -62871 -49814 -36964 -41358 -220584 -379100 -422566 -405756
21370 -405756 -265528 -231406 -214847 -137021 -165372 -61823 81530 16924 30668 235701 73128
21359 73128 -94566 -204546 -269442 -510575 -554118 -239796 -55935 -8278 -90268 -177088 -256108
21348 -256108 2676 392046 446107 210759 72014 10484 67279 45638 142466 421691
21338 421691 188065 205937 325695 285404 122031 -220444 -439537 -737097 -723359 -491175
21328 -491175 -239232 -18040 58996 -86916 75571 50409 26172 49606 114238 137552 265595
21317 265595 104917 -86380 -45667 -30602 244871 353222 233665 15359 -61041 8600
21307 8600 132904 108254 46364 -217625 -50051 142666 394240 317867 167587 52270
21297 52270 -209533 -447642 -269025 -208451 -268223 -47779 62563 -23954 -46672 39093 -132166
21286 -132166 -403886 -297858 -240862 -234113 -232270 -45626 -251471 -306903 -212654 -491816 -527479
21275 -527479 -367605 -409221 -446520 -284171 -286487 -283716 -409459 -393368 34529 108892 -47282
21264 -47282 42888 -39247 -96817 -2761 -70080 -206142 -257590 -187075 -17535 5853 -53042
21253 -53042 -170630 -390698 -452128 -428435 -144433 -306625 -496284 -528295 -411909 -322341
21243 -322341 -156508 -73463 -319897 -232699 -230035 -314614 -167498 -46768 -22924 -155332 -189962
21232 -189962 -140528 -148056 -262587 -9270 100730 -44742 -76624 259554 356525 211208
21222 211208 260911 129699 -165395 -165817 -90552 -137135 52344 114722 97030 101263 91942 -45332
21210 -45332 -23305 -163485 -378602 -506795 -362559 -148849 13633 84680 75209 154625 275591
21199 275591 456759 592586 478944 333590 22643 82854 175525 -6831 55010 60430
21189 60430 -91030 -108352 -169538 -265173 -285370 -116552 -66020 -33156 5322 -62958 -79789
21178 -79789 -137151 -154440 -67644 11741 46391 -22005 45841 -169394 18613 104531 38943
21167 38943 -102464 -202792 -101681 36751 -9742 -170669 -75817 -8326 49341 -145382
21157 -145382 -242060 -259701 -158192 -205397 -264549 -95812 -188017 -57680 31875 -100869 75185
21146 75185 290823 503659 203732 -135623 -119535 44004 310756 263918 306645 409292
21136 409292 447731 450456 529885 581091 483603 421551 56717 -73423 -144782 -195651 -465018
21125 -465018 -820107 -832343 -535319 -166610 -78582 -102637 -245234 -406849 -594597 -517647
21115 -517647 -255421 -211817 -501403 -597894 -551472 -194425 356684 292949 -73469 -158930
21105 -158930 -140665 -44190 -169456 -102646 -45721 195495 182504 -59884 -174633 -322715
21095 -322715 -293472 -148189 -218330 -132943 86606 55843 105994 55335 -95447 -168923 157527
21084 157527 310766 342659 119876 201578 105184 178363 -59708 -102527 -180208 -269459 -395179
21073 -395179 -286805 -266039 -247023 -412443 -172814 -109838 -53016 172483 209837 117173 21136
21062 21136 92422 107344 99099 265463 340243 78684 -375047 -450828 -321753 -105119 34698
21051 34698 68302 140674 310947 288748 89452 -33063 24899 -5609 91121 179151 204853
21040 204853 365764 380634 232621 -41702 -102497 -70501 73416 -21145 -36207 28174 -129282
21029 -129282 -221983 -424686 -485726 -124482 185924 230813 119972 -126937 -201767 -245500
21019 -245500 -145492 -114973 -126496 -50449 197166 305724 9444 -16565 106730 167549
21009 167549 128846 213116 132670 132119 -114790 -91807 185792 32656 -337432 -72523 94073
20998 94073 -29201 204274 313634 357567 106315 -94664 -68617 64228 9364 -135105
20988 -135105 -125745 -565 52277 -225237 -116837 119086 193503 259348 112947 157877 473872
20977 473872 479940 322797 320608 443061 312375 48076 -108978 -93814 -512 119443 49801
20966 49801 -393750 -524182 -371749 -75511 -28529 114880 313230 348352 425086 313722
20956 313722 225457 378684 598219 715073 507451 646268 902051 794146 588635 537223
20946 537223 447733 468163 606461 680124 939820 955611 731549 823259 882507 799504 830013
20935 830013 913559 706551 801557 1109381 1073186 926625 785534 688460 346780 246987
20925 246987 399644 209312 30938 28876 96969 282104 381447 332635 274167 250404 17193
20914 17193 -176289 982 221688 184979 149739 326120 490592 460969 299731 152784
20904 152784 -27233 -79170 -10901 -172800 -269386 -222939 -101344 -108026 -78896 -170509 -303260
20893 -303260 -238948 -170557 -218553 -57072 95217 -218678 -329650 -326248 -424915 -294689 29039
20882 29039 -30603 -392003 -555381 -464183 -204840 11935 153430 215031 226702 77837
20872 77837 -46591 -179574 -396229 -431641 -365255 -66662 98055 154171 9995 -59795
20862 -59795 -160806 21268 267425 320958 185681 -20601 29726 254847 116843 -25327
20852 -25327 -39848 -218498 -159598 -196877 -305606 -314502 -227245 -238665 -190599 -93958 -156858
20841 -156858 -246078 -254304 -333085 -116444 -141688 -21741 -50729 118711 309376 71065 -66530
20830 -66530 54622 212873 98405 194375 290500 132686 135163 29134 -71174 20504 196180
20819 196180 221428 30489 -131991 -149524 59653 297180 195598 -40183 -178928 -221762
20809 -221762 -259053 -185144 -233649 -364175 -428462 -491631 -307504 -249950 -218271 -107149 90395
20798 90395 210562 271292 284640 289729 201504 -85645 -142662 -45281 -82232 -28442 9443
20787 9443 80058 -150286 -264702 -254468 -185570 -313656 -183082 -13173 52315 -151581 -85182
20776 -85182 136947 114536 -1852 56658 -5158 -190093 -1474 66912 114464 -89998 -9250
20765 -9250 -112179 -98521 -152928 28279 -45394 -181855 -87562 -190497 -246027 -163554 -165958
20754 -165958 -296227 -220763 -299875 -193566 -16451 -84531 47160 -109906 -114835 25647
20744 25647 123419 129124 82662 83855 42112 -158577 -7524 114953 200580 99652 207741
20733 207741 279906 -168279 -287071 -55290 -156000 -132770 -121726 51881 217627 160819
20723 160819 -42962 -156885 -290049 -262472 -249945 -344156 -362261 -38768 66204 150996
20713 150996 -325 -66062 22608 298173 152561 187539 292682 271271 153033 54569
20703 54569 12289 -141311 -109973 -195702 -172098 -25962 59371 110290 131690 -39964 -271492
20692 -271492 -100367 -58379 -95817 -297623 -299922 -154480 -180743 -192151 -262336 -127051 6872
20681 6872 118413 15954 -209217 47832 105925 169236 84295 23057 110650 165886 228382
20670 228382 262829 144785 -124922 -221228 -109538 24139 186139 182435 296414 442189
20660 442189 405192 342587 275691 -145136 -45179 -19034 54151 121518 245797 125991 -47503
20649 -47503 -326194 -341131 -203640 -191490 -29535 -21371 -26124 209972 225495 38732 -118866
20638 -118866 -131942 118502 36990 -4827 -110757 -95690 -27679 29472 233819 357964 544267
20627 544267 254653 48074 103829 65526 149652 286188 286313 456750 337622 92921 240096
20616 240096 218891 324528 236743 377941 357102 39978 -304578 -121523 54451 209899
20606 209899 460715 375954 33086 -118187 -246148 -263438 -6500 -85860 55587 68054
20596 68054 261053 402605 317213 131859 -3071 -260909 -172788 36365 -123166 -33386
20586 -33386 -162798 -282855 -129771 -91135 115668 287472 315319 71669 45768 155931
20576 155931 195775 277395 248445 113747 33511 26443 151362 76107 22261 98971 103633
20565 103633 -39016 -343540 -356727 -320033 -105190 -22634 54769 -7660 -35207 -92338 -155546
20554 -155546 -160983 -345617 -386345 -4674 155455 231750 319119 385910 70731 -153638 -157856
20543 -157856 -4887 -124444 -126393 -24277 193512 137497 -15804 -87897 -228113 -347335
20533 -347335 -234880 -235816 -149450 -250721 -347044 -268051 -266406 -432189 -465955 -274953 -15152
20522 -15152 220698 158106 56478 -51099 -57040 -62685 -52598 -194113 -181372 -315670 -116427
20511 -116427 206218 260286 51506 -122102 -116131 -422 4194 -224660 -371580 -453770 -445477
20500 -445477 -361129 -222077 59598 311786 434543 376599 431147 347721 161268 -7028
20490 -7028 227972 -27317 -293737 -252120 -31452 170916 224553 181046 130259 328675 376122
20479 376122 260468 157551 -176038 -150442 222483 291371 104716 31194 61820 75272
20469 75272 58494 -61088 -154920 -92309 -196752 -264069 -284528 -180615 -172483 154531 90175
20458 90175 11185 -219454 -176102 -99827 -14356 41614 -31424 -123605 -154765 -160559 32768
20447 32768 -19137 -62756 -230412 -322595 -29848 147372 46031 19351 -97361 13050
20437 13050 364236 446806 446269 193400 99975 -42693 -148211 -50859 81063 -143698 -405780
20426 -405780 -377735 -28979 245445 162428 12703 -30065 60842 185341 175486 -32617 -159524
20415 -159524 -256770 -150822 -172408 -121457 -177431 -130365 -121413 -242134 -271461 -290607 -378736
20404 -378736 -385006 -385879 -521440 -727162 -656876 -408079 -155662 -13702 211398 312162 321036
20393 321036 132629 -125955 -113150 16395 163076 250386 213798 222390 199251 93100 -100013
20382 -100013 -96542 -345199 -292515 -138603 -14482 69981 -9585 -30734 85369 76732 77928
20371 77928 -92930 66882 96782 -6561 348878 674206 447513 325687 326502 386196 364639
20360 364639 209165 330032 282832 174171 268413 220973 105401 80121 160763 152107 194003
20349 194003 107665 218592 285328 383362 472637 415181 127781 221002 66162 -63288 138696
20338 138696 274681 112051 171566 140898 300611 -10866 -158783 -252671 -181973 136469
20328 136469 43876 140690 183333 155198 22958 58002 176763 101054 -77573 72600 63813
20317 63813 18879 202669 445274 554432 444713 210075 187707 185809 305357 292383 240711
20306 240711 107427 126570 145347 296325 324828 222113 313379 202454 52861 50884 280656
20295 280656 339749 298506 183415 189447 87123 10791 -17136 -175623 -189440 -51756 -27152
20284 -27152 5219 76801 88331 197198 92098 164461 176069 -40567 -37390 -44533 53356
20273 53356 -8147 -130705 -143438 -109111 -42516 -93614 124007 228580 452463 379600 167614
20262 167614 137701 287064 333094 112173 3839 81776 162588 422530 313075 170895
20252 170895 -7966 -97695 70597 5375 62095 12158 542 73346 -7151 -240774 -374793
20241 -374793 -176521 37387 213978 248568 110688 -104664 -77187 -11711 286754 329806
20231 329806 406456 431476 319995 344030 98913 189240 -5985 -279877 -192037 -162638 -150167
20220 -150167 -121112 -231865 -76131 38386 97304 307920 342192 403488 200346 -25230
20210 -25230 -91243 -75161 -108381 -230670 -374780 -450624 -71171 306072 207693 163103 227038
20199 227038 292686 89200 214495 133859 -101811 -208988 25171 123832 58629 -74005
20189 -74005 -18520 -8331 10287 -119508 -349388 -169225 36122 307097 183255 49897
20179 49897 -81667 -404750 -444961 -257733 -91855 29762 310101 161894 22193 -84648
20169 -84648 -47519 -152945 -99577 32563 291216 344341 163922 -102161 -306635 -261586
20159 -261586 -44714 33144 -9287 70448 154964 111793 100799 182641 29265 25162 303840
20148 303840 358732 394625 473735 508152 250725 -58874 -290827 -281351 -39153 323264 470493
20137 470493 417511 157771 152892 18151 -1885 -280134 -422862 -320684 -91068 19158
20127 19158 151974 101176 12852 -1890 -60311 -127156 -59271 -67167 88193 -43111 -233281
20116 -233281 -107733 -55871 -15313 -11665 -24844 170888 209874 28595 -50461 -19783 -85282
20105 -85282 20663 25987 79688 229383 178942 154789 6811 -132304 23477 59018 -146973
20094 -146973 -11851 335965 247253 208679 334874 252683 -32569 -319192 -217721 70047
20084 70047 293981 273907 25295 73047 281448 238471 61664 200859 372256 470239
20074 470239 357469 98414 80378 144875 160302 310200 537243 496922 242633 322050
20064 322050 506282 615647 524391 377435 360627 270813 261969 278631 289239 113132 63861
20053 63861 108469 285830 503732 273828 -83161 -204184 -307138 -232529 -367555 25381
20043 25381 210840 -42681 -25484 -140820 -177649 -199049 -256229 -177411 -277351 -188998 -162867
20032 -162867 -124563 -249609 -19666 -27398 -84044 -87040 130590 220448 5749 -52621 117167
20021 117167 195780 300922 176190 -163893 -348967 -339967 -155536 -104458 46060 227915
20011 227915 98772 -25395 -148626 10586 211264 208520 127649 -43074 124863 218893
20001 218893 171747 153194 162764 235627 226699 -31672 -99272 -7968 20880 33942 183030
19990 183030 445158 573502 302785 276554 205591 88749 -89499 -5688 78480 269896
19980 269896 316230 454619 501005 277885 86938 -177056 -225834 -122985 49660 -35825
19970 -35825 -23898 210165 257926 282956 135970 -148756 -354142 -104288 -45067 -163235
19960 -163235 -181480 -147503 -177432 -194266 -166409 153831 246979 295585 314249 258090 300500
19949 300500 301451 91807 -111623 -93838 -250694 -322608 10093 214740 199397 264657 381650
19938 381650 468990 310411 98897 394544 608986 475629 289362 359936 272303 341424
19928 341424 430061 416285 375875 331157 515990 560322 484844 310427 219586 36862 -82641
19917 -82641 30418 362697 529394 649185 621003 645078 740231 713270 564829 670970
19907 670970 666864 598026 456760 313015 297644 369536 267616 300022 319817 267080 325395
19896 325395 308753 291193 554983 514335 384705 326178 216232 161607 106370 73158 34042
19885 34042 9170 44661 125001 -126411 -17571 160924 308842 309560 271453 82760 300026
19874 300026 750115 668948 659420 566409 535589 698618 501028 267265 442808 448566 391965
19863 391965 373036 323610 218528 79886 3065 -136084 -195674 -103117 -152906 4765 129169
19852 129169 330121 501260 570381 496124 441862 481767 756537 915650 990041 764009
19842 764009 643655 815377 866894 741342 685950 652064 459387 277042 18839 260936
19832 260936 563571 522116 559618 367379 50225 64562 149390 63203 308541 547516
19822 547516 550870 441325 551577 736325 686391 714994 628068 520255 640816 567012 550303
19811 550303 544227 468402 376917 537712 697066 736202 816360 896067 765356 584210 684535
19800 684535 552141 342881 552591 496033 261649 -52882 60672 410987 643986 668163
19790 668163 610484 446165 377316 394592 349082 350875 240301 411112 296075 354422 557270
19779 557270 388453 300279 347539 550059 873020 784187 750590 532625 559580 618144 811031
19768 811031 774080 827461 820835 648308 706676 697831 451210 352339 488694 669775 451774
19757 451774 193781 107280 255377 453419 444054 740590 810246 747843 719214 710825 808764
19746 808764 850612 589614 662842 516142 444936 494420 538207 476416 311161 574389 943138
19735 943138 879391 924573 766122 795622 837491 946834 624742 585582 863760 1052844
19725 1052844 971097 794657 727401 573415 535966 873897 1071508 1180287 865441 865174
19715 865174 1089935 1440813 1786742 1716544 1437804 1426486 1462582 1461092 1339237 1465555
19705 1465555 1446998 1455200 1659565 1803046 2182644 2186068 1881707 1963215 1901779 1718540 1581975
19694 1581975 1605797 1809262 1816479 1588494 1500751 1681031 1718313 1594284 1327543 1332824 1449424
19683 1449424 1621908 1749387 1816846 1837395 1741665 1861903 1881837 1645820 1834049 1699820
19673 1699820 1654444 2011383 2349298 2522014 2523117 2102304 2111422 2196568 2167862 2076351 2416424
19662 2416424 2512558 2273609 2220396 2214302 2162519 1980102 1892603 1979051 2123055 2311687 2396208
19651 2396208 2200666 1946089 1940352 1802576 1775703 1973273 2258175 2202513 2008186 1801705
19641 1801705 2058287 2100243 2181289 2140833 2045164 2134091 2050521 1838740 1561482 1658183 2060528
19630 2060528 2081708 2083058 2103873 2293072 2372501 2172347 2111196 1999474 2148915 2230251 2331968
19619 2331968 2397833 2361414 2339719 2238413 2315412 2562613 2785522 2717640 2428925 2464953
19609 2464953 2641121 2610639 2591132 2619498 2430977 2543105 2542993 2533791 2584474 2737186 2777867
19598 2777867 2741426 2791561 2890362 2831798 2903771 2998583 2937243 2989414 2784954 2806504 2893672
19587 2893672 3022442 3090091 3128217 3116604 2981978 3058232 2987086 2963499 3109449 3124423 3290515
19576 3290515 3514662 3746511 3661772 3592867 3465469 3533959 3527149 3496165 3454253 3339830 3322702
19565 3322702 3486862 3526173 3580218 3776221 3929079 3953648 4229043 4401661 4573193 4526253
19555 4526253 4560403 4603927 4590697 4511172 4386668 4491881 4588572 4825016 4980254 4874626
19545 4874626 4996221 4863952 4974691 5172952 5085917 5265407 5460607 5522006 5757306 6047528
19535 6047528 6353626 6403389 6216443 5989864 6325043 6656812 6732655 6751122 6890236 7069014
19525 7069014 7355279 7717165 7919686 7978366 8136884 8323822 8543741 8745506 9077735 9147318
19515 9147318 9230548 9251130 9463422 9613108 9637775 9875200 10034917 10150378 10155306 10649183
19505 10649183 11373487 11705369 12179125 12339906 12852337 13270219 13359665 13554196 14068407
19496 14068407 14682536 15169006 15729548 16190702 16528461 17029520 17721510 18373492 19120702
19487 19120702 19673078 20260482 21002583 21839579 22542347 23360763 24202146 24807558 25569194
19478 25569194 26459679 27355110 28530159 29581299 30540865 31490064 32492221 33748255 34775657
19469 34775657 35800324 36835451 37970809 39236161 40264165 41657293 42979260 44094398
19461 44094398 45075429 46206290 47336209 48315091 49079520 49986957 51052651 51974884 52281299
19452 52281299 52618338 52906053 53359867 53538802 53377388 53423738 53454522 53369617 52974502 52564220
19442 52564220 52174850 51439226 50528714 49736737 49055284 48233447 47172127 45935666 44822651
19433 44822651 43756105 42706717 41777913 40892953 39750086 38621042 37605057 36504143
19425 36504143 35786978 34573388 33511906 32417817 31512048 30536084 29407732 28545076 27642943
19416 27642943 27166074 26483967 25713738 25048646 24662138 23891491 23077533 22537965 21728123
19407 21728123 21102829 20463360 19676890 19150286 18775344 18344388 17813782 17181705 16756746
19398 16756746 16439264 15890580 15464549 15249202 14748494 14225689 14076373 13829278 13450049
19389 13450049 13339487 13129459 12728219 12217465 11972098 11751068 11451702 11114919 11019100
19380 11019100 10812771 10307465 9992701 9904790 9946017 9859616 9519878 9150366 8976046 8881205
19370 8881205 8870257 8804543 8516615 8396887 7885508 7530635 7523629 7538754 7728100 7640783
19360 7640783 7205414 6880895 7070702 7028577 6845243 6736989 6568276 6526564 6501658 6242462
19350 6242462 6235632 6274190 6311693 6232678 6000561 5902939 5821956 5641188 5455314 5220501 5098398
19339 5098398 5118896 5113079 5204110 5173414 5156481 5460602 5500848 5475860 5329584 5202445 5181115
19328 5181115 5251252 5251028 5141833 4981590 4839105 4835916 4763882 4305468 4309362 4583314 4731894
19317 4731894 4780716 4990299 5152963 5156945 5049218 4856626 4723637 4804843 4923694 4912982
19307 4912982 4803958 4596444 4415152 4337805 4328189 4188827 4075369 4068520 4058536 4115197 4212695
19296 4212695 4013517 4059837 4298362 4353777 3988020 4026971 4257954 4309241 4062039 4128815
19286 4128815 4329861 4475925 4472890 4460161 4495485 4654485 4825394 4695159 4842188 5180938
19276 5180938 5218644 5311380 5559655 5841376 5574751 5344975 5520917 5508422 5405186 5396189
19266 5396189 5278351 5200946 5390948 5540870 5378441 5469935 5471571 5636262 5963545 5846572
19256 5846572 5554866 5725065 5918932 5963852 5590872 5455824 5573365 5358462 5187415 5377262
19246 5377262 5614946 5675245 5997220 6378275 6800930 6735048 6746525 7264025 7429004 7797210
19236 7797210 8008988 8227368 8703237 9095818 9302494 9503791 10219192 10968169 11701840
19227 11701840 12791025 14001754 15330697 16751464 18157008 19939568 22034094 24353451
19219 24353451 26543514 28834045 31097039 33819955 36440681 39577984 43746718 48709214
19211 48709214 54566945 61961825 71116115 81651541 93660750 106000653 118060872
19204 118060872 129081535 138137153 144958103 149742292 151344760 149429564 144102389 136345913
19196 136345913 127608450 119475120 111861241 104900022 98529399 92803415 87741928 83328702
19188 83328702 79447645 75645151 71854612 68222757 64830138 61534150 58888737 56976738
19180 56976738 55814860 55498018 55633982 56392709 57603063 59419237 62084934 65404859
19172 65404859 69755602 75563994 83311436 93126240 105002348 119007013 135046133 152454240
19164 152454240 170177042 186960610 201970826 215138714 225989768 233836794 238518118
19157 238518118 239489890 237369146 235057992 234492133 235613326 237873127 240101282 241698058
19149 241698058 241536562 238808907 233562572 225325587 213953135 199104526 181054013 161780917
19141 161780917 143692268 127893929 114564212 103501073 94623890 88028074 83420909
19134 83420909 80066266 77455622 75331008 73499657 72105543 71269092 71020937 71390157
19126 71390157 72196988 74069770 76711794 79859560 83673495 87969101 92805409 98082533
19118 98082533 103691206 109534433 115883413 122657850 129969698 138048876 146463040 155097918
19110 155097918 163487460 170725940 175768919 177463640 176331648 172671686 165990228 156846859
19102 156846859 145088243 131882751 119091443 108282814 99944809 93881441 90127576
19095 90127576 88833259 89478764 91356159 93139350 94098341 94197515 93304048 91810090 88907152
19086 88907152 84246776 77652752 70466292 64364284 59753719 56346331 53239315 50344024
19078 50344024 47841662 45774742 43860851 42094276 40494306 38600314 36496053 34282431
19070 34282431 32370486 31015177 30025528 29352529 29049691 29015612 29076130 29138781 29234293 30126518
19060 30126518 31336732 32589503 34516904 37382781 41161564 45810314 51223812 57397888
19052 57397888 64309287 70550824 75294432 78904012 81570611 83622642 84794979 83796012
19044 83796012 80708343 77585470 75848659 75940372 77178352 79236883 81973719 84150594
19036 84150594 85021472 84253716 82132034 78715723 74386789 68661517 60513605 51438115
19028 51438115 43569899 37818590 33853722 31138979 29478457 28208006 27387943 27070150
19020 27070150 26933777 26685956 26414398 26259967 26311220 26591288 26727257 26854713 27103229
19011 27103229 28068384 29469697 30718739 32161034 33896801 35530297 37246820 39509251
19003 39509251 40996295 42837229 45235137 47863286 50999723 54550074 57960816 60907060
18995 60907060 62381886 61931341 59995806 57549318 54428070 49677587 43189171 36160854
18987 36160854 30406519 26388468 23669774 22101687 20937477 20043935 19330897 18608440
18979 18608440 17759959 16969892 16534753 16062836 15119572 13932961 12845148 11800815 10846062
18970 10846062 10337393 10112594 9870259 9397350 9076554 8904685 8820849 8562190 8189721
18961 8189721 7835862 7551420 7173354 6927400 6622462 6192669 5873615 5775689 5653085 5635720
18951 5635720 5514858 5525131 5567239 5460439 5383139 5317932 5236021 5232206 5166547 5063764 4817223
18940 4817223 4209862 4074192 4024185 3892720 3996996 3987898 3889499 3742992 3580242 3647169
18930 3647169 3929892 4366052 4611093 4850738 4585369 4240543 4421992 4388925 4460285 4423765
18920 4423765 4255950 4107187 3921633 3641901 3385546 3231506 3316139 3509849 3583314 3968314
18910 3968314 4586039 5091527 5776388 6279189 6777081 7120836 7207983 7233559 7329570 6948427
18900 6948427 6514354 5671677 4780011 4223176 3901006 3705112 3439119 3164821 3367061
18891 3367061 3543576 3644251 3752001 3544276 3086032 3028839 3187972 3115622 3151947 3029250
18881 3029250 2813306 2560416 2265337 1972501 1851837 2004908 2230731 2374300 2265957
18872 2265957 2027125 1820574 1513220 1473493 1410074 1384799 1478562 1547760 1410068 1474022
18862 1474022 1269185 1144704 1356780 1370559 1379979 1496841 1613322 1515894 1428323 1231989
18852 1231989 1362523 1449090 1168932 1048386 1247858 1504690 1442324 1514811 1530640 1572371
18842 1572371 1430675 1493214 1692108 1817717 2152643 2196891 1989678 1666520 1651732 1813742
18832 1813742 1788149 1790150 1808251 1744953 1503789 1746869 1892796 1903880 1805292 1428448 1257593
18821 1257593 1296371 1110803 991568 1175168 1158548 1160014 970232 671435 448990 686305
18811 686305 888634 777354 560382 688610 778936 848529 888102 891246 897634 991787 1097137
18800 1097137 967223 999992 937163 1181678 1113610 1132929 1112567 1213006 1343566 1433237
18790 1433237 1704665 1566041 1319955 1208463 1080735 1013040 1004580 1016576 991965 1045355
18780 1045355 970200 850913 939364 864548 855243 881216 976861 956049 627430 520079 560736
18769 560736 453991 360745 435038 662499 616216 634143 715477 568452 569714 623797 324400
18758 324400 311379 304282 188325 333553 515095 254404 265151 230601 122343 5486
18748 5486 221898 336814 372063 479873 412595 311626 463756 439698 428380 414281 377103
18737 377103 203046 179517 581682 469521 251645 -73153 74954 -60199 -12600 -5386
18727 -5386 -154659 -174737 117808 188376 387610 455820 475642 411855 338783 223585 122619
18716 122619 94637 65670 273704 259888 368099 222393 132547 180363 189944 223381 315483
18705 315483 672620 616323 552266 825265 952408 1117907 863627 785999 758402 792543
18695 792543 943847 902823 869704 844880 957543 1179675 1155774 951798 882589 896093 745663
18684 745663 699651 818365 1066359 1098402 926888 727151 608929 939116 894527 803080
18674 803080 787102 705813 610072 505646 567773 758860 770600 919256 938125 1160898 1094572
18663 1094572 1011826 963821 959900 919692 1005824 1108358 999044 947413 1171490 1179786 1250705
18652 1250705 1359969 1285709 1289324 1115558 1016614 1000032 706586 604848 523470 688678
18642 688678 994632 846745 1063539 1433913 1300001 1251198 1065007 1042029 1263362 1381372
18632 1381372 1366633 1449640 1359701 1121710 925784 826532 757703 747418 629066 707621 877146
18621 877146 716199 501123 580293 854243 963179 994277 1029147 1002513 946661 784236
18611 784236 745422 593717 520505 571541 680754 653644 652150 638008 719641 748478 893456
18600 893456 787437 750587 963687 1219829 1350827 1376826 1429150 1381091 1208598 1128021
18590 1128021 954502 837066 821695 1173807 1234207 1206619 892509 786386 946782 969436
18580 969436 841973 1049200 1112528 1176324 1369980 1394086 1450460 1240806 1142200 1069663 886734
18569 886734 749061 776312 954621 1121419 1065454 810918 865669 1014133 1009107 1130941
18559 1130941 1147600 969563 838183 996493 1142542 1076432 1000502 956293 1035738 887997
18549 887997 1028972 1039349 825707 642937 507294 751002 883825 979778 1052227 1090157
18539 1090157 1315003 1320206 1224596 1381893 1464820 1407210 1339189 1454340 1465942 1570605 1740117
18528 1740117 1496207 1381787 1552192 1740007 1960511 2070427 1898411 1802338 2026731 1990637
18518 1990637 1743039 1529898 1580024 1548331 1577567 1602798 1799167 1863179 1711821 1587463
18508 1587463 1544512 1442080 1414683 1389542 1416128 1346970 1173914 1147777 1283225 1298185 1148805
18497 1148805 1121169 1367901 1706801 1931111 1517576 1280955 1098728 1097306 1119982 1209128
18487 1209128 1076722 747593 396633 457978 552720 697430 815745 780726 814891 873443
18477 873443 1079425 1394417 1525177 1474511 1235615 1119046 1146110 1179305 978727 756460
18467 756460 950253 981371 856356 832752 1005123 1288317 1212175 1329193 1454431 1221041
18457 1221041 1171399 1159546 1083152 1098076 1250643 1150053 1243823 1310361 1243505 967409 742813
18446 742813 660781 738510 922843 1178824 1043944 788296 600813 446827 238116 170328
18436 170328 191652 207261 80815 -160667 -188101 -8472 191427 367144 276244 351145
18426 351145 309689 326144 417712 465247 521824 510716 420279 298844 343881 283878 293307
18415 293307 334297 366947 525707 802228 735684 328291 230981 376047 363464 604961
18405 604961 900683 971823 814318 434791 199421 287194 315467 422451 521696 411603
18395 411603 346903 359717 292722 333037 356216 485080 441307 497797 575370 437049 435732
18384 435732 587392 795948 908081 959829 874792 785585 654533 763334 783221 556277
18374 556277 425897 349051 295985 216105 370348 714600 533118 338156 213182 -13012
18364 -13012 22837 134991 256029 158694 -40354 -49411 51342 150930 321424 429141 564707
18353 564707 452197 135649 61216 147731 178159 490072 602351 393560 397593 510605
18343 510605 332530 304352 340248 415789 314111 178818 55572 -19418 -26101 154731 309282
18332 309282 459471 477888 349968 342817 494917 589908 785254 875686 772424 467657
18322 467657 355985 427742 422787 613949 620714 545642 622278 610071 635197 908672 888713
18311 888713 851550 888400 875800 852430 842683 788368 724315 595452 586799 605119 425525
18300 425525 216912 201018 147164 250189 311614 408081 661446 832220 810139 993827
18290 993827 901011 1025986 1008687 868671 907684 885158 820335 834421 798800 714742 630819
18279 630819 928480 1262142 1308449 1673897 1865666 1899726 1865567 1927153 1693748 1553114
18269 1553114 1742971 1688840 1432000 1203302 1015296 1097831 1038661 970766 889514 908164
18259 908164 867466 848279 964209 1024773 954016 799340 683790 694978 689050 823540 610161
18248 610161 380630 475128 700669 907406 974840 877808 1155926 1225921 1022033 980327
18238 980327 770765 960184 1054101 1038400 1377192 1633637 1544191 1410830 1399357 1403055 1410753
18227 1410753 1495012 1367343 1638952 1794447 2028800 2395602 2501829 2442370 2265217 2319476
18217 2319476 2372778 2565134 2972658 3140437 2940970 2787583 2411414 2238853 2046760 1835852
18207 1835852 1559816 1547260 1586550 1597112 1575007 1451703 1244784 1218483 1286628 1424700
18197 1424700 1362784 1471173 1344679 1228623 1405142 1380003 946389 853854 895559 1130448
18187 1130448 1266610 1097206 1191617 1532327 1529382 1311596 1190985 1272200 1161879 1169063
18177 1169063 1116752 1167116 1267292 1284061 1679549 1606623 1465651 1717354 1740358 1707807
18167 1707807 1684538 1799062 1759062 1863723 1960921 1983047 2042356 2171737 2322674 2227020
18157 2227020 2036815 1940313 2028317 2053877 1866957 1652713 1548089 1762143 1864000 1882196
18147 1882196 2096585 1905839 1734024 1791611 1755635 1643824 1627984 1950642 2134365 2412431
18137 2412431 2394462 2264844 2202260 2241111 2148414 2095372 2166051 2226915 2381175 2257669 2173274
18126 2173274 2137816 2037161 2022376 1978533 1913992 2050553 2238927 2171257 2329410 2556218
18116 2556218 2641232 2635165 2681937 2831236 2890385 2722993 2905863 2870954 3091977 3136521 3103721
18105 3103721 3086860 3117855 3274166 3751884 3869758 4084534 4116387 4180631 4444815 5025789
18095 5025789 5419295 5866355 6147660 6297264 6877896 7704598 8728829 9509541 10150661
18086 10150661 11176173 12294652 13695998 15350902 17272236 19288134 21774596 24211145
18078 24211145 26665831 29265241 31798351 34573869 37557431 40739493 44487912 49059536
18070 49059536 55260154 62977832 72872539 85093102 98956758 114330554 129814107
18063 129814107 144230561 155923297 164317322 169850698 172061709 170029432 162640606 150417019
18055 150417019 136708116 124356756 114092247 106163425 99636301 93954880 88804490
18048 88804490 84210670 79775358 75426357 70692275 65229842 59566751 54373022 49490842
18040 49490842 45538880 42633007 40842914 39543835 38589798 38095073 38215087 38947428 40071883
18031 40071883 41495287 43376492 46100484 49256828 53399182 57883249 63015666 69137770
18023 69137770 76329215 84080173 92485884 101807152 112323132 123522008 136063749 149845757
18015 149845757 164757575 180329521 196198684 212370856 228444606 244998450 261516205
18008 261516205 276486537 287720360 294015467 298044134 302174079 304937085 302918997 295182929
18000 295182929 284714975 274155014 263671343 251997713 236761091 218536909 199673751
17993 199673751 182795279 168510703 156547053 146308083 137138001 129130533 121377588
17986 121377588 113667195 106004367 98330676 90892855 83418739 76500795 70524694 66027159
17978 66027159 62694565 60284380 59106563 58596849 58744007 59637341 61119136 63270208
17970 63270208 65980547 69115617 72560129 76392446 80918609 86508105 92838995 99810021
17962 99810021 107664399 116648179 126990367 138749180 150514966 161952849 172750978
17955 172750978 182935365 193416987 204304922 213958686 220532113 224826621 229953872
17948 229953872 235215473 237884404 234612291 225408530 213642502 201250444 187665463
17941 187665463 170655499 151303911 132479659 116324227 103798780 94066557 86572528
17934 86572528 80520530 75267045 69950841 64961150 60684872 56690473 53199202 49924425
17926 49924425 46662957 43511172 40390510 37632277 35049433 32901464 31661746 30543374
17918 30543374 29512140 29123454 28968880 28792685 29471412 30331277 31278785 32547631 33959889
17909 33959889 35278407 36533874 37696898 39033227 40777252 42381702 43859088 45634866
17901 45634866 47998152 50811092 54271523 58191516 61282420 62412703 61786650 60305335
17893 60305335 58242077 55605380 51458360 44705126 37237099 31098344 27126352 24579348
17885 24579348 22759203 21714733 20730106 19810993 19169757 18719801 18130684 17621166 16951691
17876 16951691 15812016 14734809 13726090 12899455 11935482 11050907 10227605 9564167 8969587
17867 8969587 8686131 8420668 8049981 7858706 7555345 7048673 6732135 6525835 6278089
17858 6278089 6037358 6142403 6227708 5832529 5502876 5261492 5173567 5103827 5030094 4834501
17848 4834501 4617607 4329606 4020811 3837303 3729699 4044110 4023276 3852749 3933704 3954942
17838 3954942 3965995 4050127 3871786 3686510 3536958 3493719 3319019 3235930 3217899 3039499
17828 3039499 3214190 3285406 3380690 3347674 3228736 3271338 3131624 3031812 3008354 2985545 2878873
17817 2878873 2654353 2632259 2594756 2374121 2089434 2038001 1937478 1877258 1832284 1903454
17807 1903454 1859879 1615323 1362570 1428226 1637484 1835715 1896397 1961633 1990295 1765831
17797 1765831 1790520 1674710 1497583 1183484 1298406 1290314 1268839 1151081 1283982 1478476
17787 1478476 1651573 1430310 1215572 1218342 1135605 1165752 1313156 1551579 1503515 1267861
17777 1267861 1294026 1412871 1298956 1202777 844498 677216 901403 876920 659601 914976
17767 914976 1047728 1201836 1134124 1139113 1261519 1416648 1443750 1413086 1267668 947302
17757 947302 954118 972672 960720 894069 950897 879765 735778 751110 712764 659568 828486
17746 828486 1012421 896219 769498 657139 669129 597182 368557 346711 380481 455568
17736 455568 568742 511165 321003 476699 633793 583418 578125 536054 415114 824603
17726 824603 1076205 898323 724988 547964 342307 442982 680554 769046 736859 865086
17716 865086 866199 563714 262633 229470 256121 386565 203018 235027 263718 61799 133571
17705 133571 247313 425623 518663 337089 296319 458761 568787 741815 495577 481682
17695 481682 760579 732258 459505 391728 558271 536004 507876 349777 117369 3342
17685 3342 85264 281492 287279 388396 447865 294683 92330 8577 -161408 -97292 110779
17674 110779 252971 331988 390402 465823 330662 115608 29590 -183247 -65515 239162
17664 239162 115138 112809 288179 259619 120092 115165 38268 -28226 80364 3094 32129
17653 32129 43389 219279 266115 186436 221549 134949 133910 319730 367559 148882 -75286
17642 -75286 -230565 -284609 -264484 -254855 -145146 203053 370589 584317 388650 141765
17632 141765 201761 89465 -10049 45549 162782 284365 370532 111164 -24826 160974
17622 160974 486267 586876 489135 295424 87392 22749 -184815 -234289 -78881 -110595
17612 -110595 -68690 -130193 -130284 134819 311891 305071 143431 -23528 213102 312487 121738
17601 121738 152331 197348 -27931 -42537 -24604 44111 353853 734411 494039 226322
17591 226322 -47650 -201964 -78886 214089 228713 135506 145438 43233 81705 -56319
17581 -56319 -46620 73859 274466 537621 672985 257453 20297 -17777 56031 155524 180696
17570 180696 318492 355598 456746 537393 555617 237726 113101 158355 153005 249048 82708
17559 82708 98301 382635 421089 251191 261310 276970 377527 347331 436010 736727 907454
17548 907454 845780 800538 913214 903480 862920 891659 1056553 967135 1049113 863646 641577
17537 641577 520694 636614 733427 401606 311546 416821 657964 625172 645019 455005
17527 455005 365232 227871 196635 99966 96076 154391 142304 51106 -33383 200231 199396 192603
17515 192603 459365 643343 599703 720164 675205 462616 497952 559229 818815 1023009
17505 1023009 1123616 1119369 1137610 1082755 682004 852617 1180914 1138889 1077174 1192660
17495 1192660 1208654 1083383 1110240 1209378 1121713 1120690 818632 646632 715659 1009622 1172972
17484 1172972 1227888 1205338 1199531 1353477 1256358 1165334 1143781 1215553 1193620 924611 876330
17473 876330 761607 684879 664011 757398 842473 901180 724001 619703 516008 368855
17463 368855 374549 139181 60433 266096 243289 356307 312792 356060 430785 492585 583305
17452 583305 679996 755283 871751 863261 875003 825489 916968 913461 750285 798196 649784
17441 649784 804486 847950 627723 575217 620001 555355 424811 323247 423577 641832
17431 641832 950536 1029702 953812 865893 778579 486437 456848 623844 614491 468483 545291
17420 545291 777047 715180 769451 685763 486532 589821 514308 406819 385400 445608 330110
17409 330110 391341 448762 299921 317078 460992 99521 -199996 -426868 -442969 -324368
17399 -324368 -346938 -198539 -114185 112842 215037 152904 261709 146441 372137 255664
17389 255664 -25844 94831 27361 143358 305276 471413 485511 351522 265343 140975
17379 140975 -37361 234135 306768 199375 362136 513868 533525 444342 548269 518940
17369 518940 441137 152980 102656 93673 181192 373062 576767 646140 723753 614465 484942
17358 484942 289280 182087 166858 246636 214679 -191497 -379758 -93591 -12852 -223229
17348 -223229 -130353 -55680 -298394 -364036 -258139 -99478 93858 401951 243280 152101
17338 152101 202477 26156 -143108 -78183 88897 182460 59173 -83063 -41103 24330
17328 24330 -266690 -251900 -119723 52191 60676 -13976 34124 217036 186343 134203 68297
17317 68297 -44724 66397 34761 -9560 -308747 -240727 -136974 -80222 -123125 62479 362283
17306 362283 532956 383875 14529 -37937 -69536 -82875 -68190 -22493 -111091 -303227 -436003
17295 -436003 -184788 342362 399310 340739 92049 -58503 8920 -22591 -76076 -237259
17285 -237259 -271534 -380606 -391110 13786 401417 381216 245918 165753 403492 631488
17275 631488 635463 548934 231538 190867 268980 382474 566292 520507 74335 3787 219592
17264 219592 233147 158969 142305 201212 172988 92685 81688 55549 -42570 -166937 192702
17253 192702 579278 451026 410595 278440 315450 279731 242194 197715 35793 9303 -61602
17242 -61602 -172753 -310555 -490743 -129352 49004 50921 -17119 -107519 -316253 -396812 -162196
17231 -162196 -191950 -53160 -257858 -479303 -673705 -413044 -205165 -279769 -562189 -507562
17221 -507562 -313940 -146015 -170399 17757 51335 50282 -97870 -338052 -213499 -264909
17211 -264909 -218573 -82627 -58699 6717 -14320 166437 267202 93230 80179 50173 78753
17200 78753 60557 -58912 -264845 -202557 -24507 6000 -119742 -167953 245354 521210
17190 521210 585647 319201 65418 -66828 -175763 -329350 -491139 -514579 -379597 -135440
17180 -135440 -122766 -233150 -69318 42790 120731 58227 230440 -72893 -211890 32602
17170 32602 28999 91169 -79797 -42416 17410 210208 42716 -101102 85855 18543 -45714
17159 -45714 -210163 -167130 91634 85839 98624 437564 470537 313676 234636 229551 561746
17148 561746 698254 514302 104793 -83837 21333 -68071 -63935 -33663 32585 24159 222651
17137 222651 137127 44739 89445 95461 96414 -9737 -105485 -52192 190262 263660 141764
17126 141764 191147 248907 143738 143935 280750 213294 238954 282735 259985 221436 99607
17115 99607 112063 84191 42750 182467 56223 -195980 -218528 -61511 -46345 68109 198736
17104 198736 335068 291510 54261 56671 76625 82268 147157 150825 82831 -29972 77074
17093 77074 74884 172995 300784 285790 158309 271620 323333 232128 299891 71446 -122759
17082 -122759 38289 36741 210207 -41240 -208595 -174644 -211905 -337857 -388480 -160347
17072 -160347 31608 90879 188829 380181 338572 214586 114408 -112365 -8446 102624
17062 102624 122824 66456 123932 381380 342278 42584 -186591 -150418 -238274 -286161 101562
17051 101562 291958 296019 207030 58818 -130637 128932 132829 -71013 -74160 -19591 -49096
17040 -49096 13549 195163 133859 67926 -8991 20562 -409268 -442250 -203949 -107325 -55722
17029 -55722 881 19302 142633 340486 277594 -93500 -123678 -25879 -7933 8886 -117087
17018 -117087 -258873 -266120 -253512 -34128 44478 -268177 -432674 -517535 -349711 -177351
17008 -177351 -85072 -180250 -158916 -196662 6185 37622 -5268 43467 42902 -220306 -437516
16997 -437516 -488439 -309537 -455920 -451032 -186970 -298630 -206234 -16566 17967 -200664
16987 -200664 -118911 -26336 21325 -250793 -138438 -144021 -101219 -121108 -99841 -60494 -268180
16976 -268180 -360557 -448585 -112612 48934 -94768 59972 -8968 -162568 -229459 -212927
16966 -212927 -57488 110437 -19232 -113853 -153974 16614 -45921 -171295 -395449 -507492
16956 -507492 -394860 -221657 -357891 -565470 -350655 -162662 -211970 -172947 -260336 -78751
16946 -78751 23543 -293289 -163973 -190410 -212761 -116799 66904 83659 -48380 -6286 -147444
16935 -147444 -209627 -146014 24976 164460 299010 492555 253231 152220 142920 280389
16925 280389 397876 568108 689518 472306 237590 222707 174228 224398 219256 163144 -42692
16914 -42692 -201111 -161505 -131910 -137273 -44831 84956 44079 -284371 -190815 -10663 -53281
16903 -53281 -70905 -62723 25826 365084 600003 444368 292247 -31102 34992 155526 193672
16892 193672 231571 104741 186827 51249 84604 282067 317124 498574 336191 37713
16882 37713 -92130 -145834 -124009 -37844 196092 304128 246532 311883 384951 161079 298739
16871 298739 512648 362208 104391 -193796 -340052 -66961 -205035 -70458 -188101 122472
16861 122472 127987 102114 106423 57155 -1262 49956 289944 309114 -84455 -168462 -150230
16850 -150230 -170693 -177384 -62780 18531 -57989 -89724 -9371 -47517 -56548 -38658 57432 -87193
16838 -87193 -304464 -136267 83144 218631 170056 -75409 -260439 -257245 36436 13696
16828 13696 38799 -134864 -267045 -391581 -169192 7601 -69496 120266 213389 214949 254089
16817 254089 63481 -110371 -302848 -251265 -202894 -199242 -219747 -122801 -48451 -111228 -76710
16806 -76710 -105353 -57769 172682 113485 1502 44187 -87524 -275187 -271075 -153760 -57024
16795 -57024 -92304 -156479 -182386 -212609 -229285 -131504 84859 445882 433618 113909 -79615
16784 -79615 -110151 -234070 -37546 66274 33448 270153 319738 50307 -332 -62637 -122737
16773 -122737 -100445 5166 76865 395616 391076 246193 174981 122572 122435 204679 178538
16762 178538 6834 3015 -5256 -70135 -224018 -145115 100468 -181020 -181327 -272078 -96670
16751 -96670 66361 46467 50747 -34728 -9455 228386 203619 61619 -307303 -237542 -265685
16740 -265685 -429844 -156811 27594 13639 -198429 -72014 41056 155215 -1358 -191803
16730 -191803 -150612 -188973 -287065 -78268 172767 62689 33402 -53993 -61106 179324 270778
16719 270778 68528 -189912 76843 216992 103289 107191 156002 -55052 27775 10534
16709 10534 -10296 -8503 33749 68014 1370 -77206 -319011 -228042 -29033 132786 126349
16698 126349 -33471 -150235 53499 5122 -184542 -178830 -69331 194545 171822 -57044
16688 -57044 -6615 -2827 8937 -122726 -127333 -25404 212782 348525 470268 428521 195133
16677 195133 252742 113541 55975 -67299 68747 481025 705882 638170 503811 227019
16667 227019 4848 27195 -20791 -147579 -231972 -409789 -505320 -290497 -12199 179106
16657 179106 240607 162348 93135 161507 145082 -83525 -250611 -60017 128983 19150
16647 19150 156020 25327 -47641 109534 -1229 -311170 -403563 -442998 -426815 -397233 -409363
16636 -409363 -238638 -38192 -76999 -280696 -392641 -173817 -16655 -405325 -506139 -265655
16626 -265655 -125552 56571 -162071 -249250 -329709 -231140 -92034 -144294 -84625 -333769
16616 -333769 -240040 -29625 45338 28691 235480 336087 283260 262668 127182 238796
16606 238796 264191 -175121 -245177 -59798 14825 448 96467 59912 27943 192730 68117
16595 68117 -135909 -239464 -287405 -414613 -380889 -168393 -100278 -124555 -139625 -3879 -28410
16584 -28410 -182662 -211558 -231207 -248059 -454323 -470774 -137619 -313849 -242378 -76760 28289
16573 28289 145099 222806 65629 111923 179273 189575 55387 58781 120936 66173 10797
16562 10797 76157 164508 -34844 2514 136909 294514 140523 -72222 -222680 -290847
16552 -290847 -117895 35447 -69859 -119135 -145305 -127537 41421 178507 137486 115654
16542 115654 18512 1304 137205 171123 -47170 -305709 -279872 61032 -49109 -245107
16532 -245107 18950 -39876 -82170 -232903 -241915 -461798 -390626 -221623 -170505 -169047 -34813
16521 -34813 -49650 -58729 -87230 -167849 -80495 190994 363963 108647 -152067 -332124 -240662
16510 -240662 -75593 -129481 -265797 -18378 189101 192230 181321 368422 380425 373387 340989
16499 340989 128626 86257 111577 186984 182190 -61934 -355764 -363059 -440506 -418233 -403320
16488 -403320 -631845 -621277 -427104 -239356 -5196 86631 31005 49573 218829 114489
16478 114489 192490 204882 362169 253299 20737 -66198 -85943 -140981 -281412 -187135 -41578
16467 -41578 175228 130760 52801 61764 61325 40174 70552 248573 250797 221557 393840 230904
16455 230904 108624 40321 -36885 284518 399224 231456 210804 155401 153373 287774 456971
16444 456971 225525 97200 12152 -324 -7284 -28355 -334385 -320616 -223835 -115809 93427
16433 93427 248364 279205 438712 354203 221438 321338 257438 201004 -201684 -349324 -254030
16422 -254030 -223773 -322781 -394420 -293538 -139594 -185206 -192483 23243 -49099 -144422 51727
16411 51727 174603 130934 22579 100193 161176 10347 43424 18191 -46310 -84992 -57177
16400 -57177 -111535 -141424 -245894 -222401 -175663 -126428 51832 164054 322885 239660 139907
16389 139907 318453 226336 112875 -5604 8275 -274406 -526937 -425277 -244986 -245204
16379 -245204 36796 116121 -23495 -335921 -299717 -91073 -292791 -185286 191762 376047
16369 376047 249858 87607 -88734 -130368 -67811 -188258 -230085 -67132 20870 -51999
16359 -51999 30551 138078 234309 262641 164821 55915 -33657 -67546 -132812 -153857 -299498
16348 -299498 -292341 -483912 -299110 -220851 -286524 -456788 -481601 -187672 -283733 -530590 -500140
16337 -500140 -324492 -77848 -70011 -26714 54155 119521 -217221 -154231 -12390 -224199 -414077
16326 -414077 -556695 -507939 -490679 -332047 -218064 -84937 -132031 85857 201454 76574
16316 76574 125797 210260 39712 -218299 -97142 -16680 -129701 -122568 -332890 -371518 -266645
16305 -266645 -64965 -148133 -81679 146180 200351 44128 -42439 -95202 -38331 2374 -68493
16294 -68493 -123547 -240840 -213656 -319573 -247612 -124062 -121784 -211988 -462630 -422478 57090
16283 57090 131217 6637 -89104 -337596 -345447 -480802 -495230 -233485 -195686 -336981 -542216
16272 -542216 -356987 -184418 -26152 52146 106911 310512 273078 267943 268387 39584 -76904
16261 -76904 -48593 -239407 -82611 154265 150773 233089 197829 166592 22895 52891 118660
16250 118660 162880 59669 81930 1383 86439 -62203 -174918 -133062 -15692 -202700
16240 -202700 157890 201043 114208 116932 2755 176946 210525 209663 190480 215865 320489
16229 320489 128493 78656 211599 272441 375353 374281 244605 118589 63656 324025
16219 324025 368451 101359 -139598 -24301 -204310 -447164 -408212 -138318 -171479 62881
16209 62881 20612 -223743 -294960 -205343 -21084 -132630 -224304 -185575 56261 -177774 -440297
16198 -440297 -458998 -251347 30907 192708 297781 366754 322724 209834 -101923 -68513
16188 -68513 -90378 -250890 -182878 -123163 -224822 -293745 -384270 -476508 -420978 -370011 -387278
16177 -387278 -264670 -138085 -6007 65199 10203 -191305 -185122 -70653 -207006 -377300
16167 -377300 -538154 -532545 -400540 -183823 -292439 -437304 -227253 -88449 -100192 -121804
16157 -121804 9978 336731 420161 440332 309217 418230 90678 -313874 -277691 -188039
16147 -188039 -253486 -230403 -196661 -86336 -64851 -79257 -167431 -410369 -331006 -57260 -4007
16136 -4007 161500 207228 15134 -24831 42922 -91925 -181138 -200539 -200532 -269941 -202412 -98678
16124 -98678 -5042 323509 335936 128166 27127 -35098 94562 144483 308361 296295 175638
16113 175638 46961 120635 396733 454545 437325 304578 485484 493630 253514 212747 -21438
16102 -21438 -157591 -52720 -85399 -359805 -248941 -318164 -446782 -372140 -176094 20730
16092 20730 236323 244982 107922 30470 -40502 -7550 62162 165976 214784 17608 -176748
16081 -176748 -114531 16970 -123040 18523 160111 -144987 -221507 -172863 44213 167688
16071 167688 227059 251689 192107 336289 454959 265382 118512 70056 83092 -61668
16061 -61668 -67429 -185160 -315626 -144071 102272 -23868 -108715 -286371 -205523 -237651 -146185
16050 -146185 -112963 -147575 -212471 -214552 -189601 4706 108595 -14636 -52332 -1300 281146
16039 281146 347901 36106 -135351 -51957 -17151 -27738 -175110 -163019 -49768 -43126 -35720
16028 -35720 26704 42654 108688 282440 292467 76274 92972 7777 106584 237696 282860
16017 282860 28707 -235170 -178507 176875 339542 181159 157426 -17421 -133335 -18936
16007 -18936 -83331 26288 -46358 41149 108262 111257 103886 -12161 -213561 -345208 -21092
15996 -21092 230491 -25682 17011 157561 -25874 -183160 -195792 -182262 -208750 -99876
15986 -99876 48590 253007 309261 153984 -7161 -443435 -666710 -303395 -272159 -202035
15976 -202035 -81209 61329 304144 367500 322434 219238 16840 46445 -92092 -45412
15966 -45412 161515 2160 -263719 -329778 -149276 52721 1533 -67428 123775 -167430
15956 -167430 -270313 -150975 220452 345070 365612 224610 143876 217662 28852 -160459
15946 -160459 -262937 -220638 -81006 -137918 26088 95132 140854 349525 389982 316822 -9783
15935 -9783 -62568 -709 109611 -273945 -433724 -417799 -489377 -359614 -473293 -422013 -216537
15924 -216537 -7073 -88883 -220157 -445485 -649571 -605745 -515576 -320363 -262854 -129358
15914 -129358 -251588 -432375 -402592 -422729 -372066 -112116 -22317 161983 150318 223565 130044
15903 130044 -169105 -291904 -228421 -140731 -295010 -325315 -96509 -41128 -188304 -121882
15893 -121882 139920 262122 49200 -280359 -309193 -255308 -201524 -252361 -299780 -302621 -27122
15882 -27122 60558 -77640 -64428 145850 217737 23383 14072 186930 133222 3575 125040
15871 125040 237240 189980 52868 -80433 111 282923 193548 206737 66326 -109993
15861 -109993 -162672 -93916 -94395 -156900 -272059 -314898 -236243 -232749 -70423 57124 72429
15850 72429 -3669 64238 -8100 -91189 -170152 -484226 -417130 -237417 -217531 -275241 -266232
15839 -266232 -158302 -58823 182392 83325 72134 24894 125018 -76027 -266824 -106198
15829 -106198 -12484 -10678 130366 229158 198161 5678 -207840 -314117 -309540 -169956 50353
15818 50353 152648 214727 -23127 -96047 -112974 143655 199028 120130 60327 -139675 -329186
15807 -329186 -423979 -221522 2832 -60557 -30503 130479 96685 235487 130752 -232308
15797 -232308 -509536 -269748 -228696 -355718 -479292 -300477 -123818 44775 -98150 -169568
15787 -169568 -161472 -483547 -492012 -313147 -269401 -161477 -204044 -53592 -110024 -192003 -51937
15776 -51937 -24388 -21631 5462 116396 116557 263396 278392 349601 208366 -38110 -167888
15765 -167888 -116216 -137325 -336139 -455771 -469658 -350392 -104113 -231410 -84885 -58650
15755 -58650 -312285 -360270 -313223 -235168 -200729 -270717 -71240 -28016 63666 125848 -51236
15744 -51236 46819 89285 -110480 -339222 -389872 -365369 -180723 -44182 79338 -116063
15734 -116063 -94017 -21647 -145515 -239666 -187433 -106539 71302 -253538 -515101 -497447 -461843
15723 -461843 -111189 -172897 -201348 -222561 -229084 -199703 -170241 -226936 -33424 176016 109816
15712 109816 185597 16024 40192 -82522 -218947 -103741 115455 208241 107348 47816
15702 47816 31649 312647 241899 118215 127657 14835 -108500 46735 274689 100841
15692 100841 -150006 -176509 -257809 -335571 -180799 -139196 -86201 -138955 -105776 -60649 -81421
15681 -81421 -136497 -39393 183084 186518 165129 81604 -41754 -117718 -156095 -71018 -316452
15670 -316452 -226209 131389 258968 250928 243362 160362 317714 243563 484371 399972 168779
15659 168779 164393 178510 187145 196563 56558 -266880 -445883 -258017 -385780 -179473 46024
15648 46024 56388 82765 63773 218446 48487 109780 137015 149166 228323 239089 325611
15637 325611 174301 -129878 34237 172282 108850 77453 62072 102145 56397 200689
15627 200689 93593 109883 50845 -217802 -434477 -219310 -338249 -491705 -353467 -340425
15617 -340425 -332802 -255890 -151129 -170169 -7684 -216984 -443700 -330013 -326103 -437661 -373429
15606 -373429 -314109 -465534 -389516 -224819 -107351 -96370 -43245 -156397 -187431 75983
15596 75983 188821 159345 175928 27288 -72397 -127679 -125175 -133579 129032 239909 181893
15585 181893 191585 150147 34987 147505 158106 119437 77962 3343 -536 1108 52710 209573
15573 209573 231051 269476 228990 210306 21588 -237128 -246152 -72476 -17776 116387 268393
15562 268393 453570 268428 -210200 -66566 146664 245873 259585 264520 186471 148712 46288
15551 46288 -1917 28833 75289 -8220 -21795 -205506 -148572 5978 229256 136247 -121420
15540 -121420 -411100 -421235 -262882 -379767 -535977 -426715 -249377 -165378 -255946 -86022
15530 -86022 148850 62686 -156422 -165874 -291603 -218647 -137574 -140034 -273111 -125681 55613
15519 55613 583 -101254 -350120 -398683 -505257 -508270 -294893 -118910 39754 -206249
15509 -206249 -511864 -675942 -392975 -82288 -154801 -248607 -396980 -426354 -482700 -548897
15499 -548897 -473052 -129179 -105270 -45061 -169051 -5025 -177896 -203318 -64116 103502
15489 103502 41119 2953 67124 70551 129398 224174 -25180 -198485 -62294 -222988 -200788
15478 -200788 -176513 -512404 -585099 -264475 -123393 -68892 -65815 -170814 -270978 162517
15468 162517 246281 246011 269438 27394 -113761 -101765 -116119 -168060 -87958 83754 104458
15457 104458 -39582 -314695 -533495 -705248 -574623 -403880 -366964 -281735 -354868 -281716
15447 -281716 -399925 -364367 -82345 189299 118500 17674 -98545 22984 166294 391241
15437 391241 206737 12247 -74977 -215644 -283409 -216963 -104156 -40753 -83528 -88101 -98387
15426 -98387 92583 345197 63885 24744 73477 -108258 10407 254306 505911 603539
15416 603539 550678 268419 6874 -344433 -437560 -283963 -142689 -68672 -98777 -106095 -101370
15405 -101370 24793 58783 94652 245277 211815 290876 389526 337051 65085 121910 213581
15394 213581 305060 214682 248459 366870 448480 -83119 -614349 -542860 -565209 -358231 -253295
15383 -253295 -182447 -238831 -120398 -152710 -605855 -459927 -326019 -465951 -460189 -318378
15373 -318378 -183770 16048 -47057 -258698 -293294 -262359 -283025 -250487 -358782 -458413 -249193
15362 -249193 -246570 -226031 -255892 -171259 200220 340807 69920 -79125 56756 225129
15352 225129 97560 -82302 -85850 -419373 -536917 -424934 -374480 -320802 -306363 -621542
15342 -621542 -498409 -242069 -79484 -94667 -280491 -311231 29411 145113 124065 -21819
15332 -21819 -309458 -213026 21754 96914 -197018 -129066 -299224 -257760 -429432 -168365
15322 -168365 98371 149321 124733 -129020 -144315 -100862 186671 420978 360164 237390
15312 237390 180811 74806 -49032 -292461 -130132 -135938 -168761 -96233 -218924 -249854 -81704
15301 -81704 -201891 -366983 -286497 -69 -125006 -26355 -100177 -76658 15870 28786 -66690
15290 -66690 36012 37985 11877 -43437 -61153 -51052 50845 -38221 -3755 102120 -125200
15279 -125200 -208224 -113819 -99687 -93185 -143545 -538807 -631238 -580280 -500301 -118263 -103856
15268 -103856 -5304 -22105 -177269 127999 241493 178048 -60966 -147933 -191516 -280573 -131252
15257 -131252 64685 12599 -156863 -210676 -160170 -137610 -123615 -194604 -266831 -361008 -107427
15246 -107427 -150380 -287571 -117907 -197581 -279344 90385 20144 -268523 -216288 123011
15236 123011 485051 271386 128314 221809 404199 619121 711719 342207 169398 91048
15226 91048 -22126 -85720 -215170 -539231 -638593 -637393 -297062 25663 16250 42575 -66257
15215 -66257 -12991 225459 270312 146244 -52192 -205035 86668 156275 -122438 -218633
15205 -218633 -258863 -203714 -184636 26470 29333 -8186 -190926 -233021 -221405 -72856 142420
15194 142420 277898 203967 175117 22427 -158558 -337916 -191206 26 68589 174727
15184 174727 66120 -116009 -258255 -276314 -211783 -141522 -240584 -505896 -438626 -253953
15174 -253953 -209142 -79491 119370 161662 51277 -47893 -154909 -229024 -330555 -565987
15164 -565987 -607396 -451091 -390224 -375656 -239980 -48616 -142480 -155690 -235333 -298984 -226988
15153 -226988 -147628 110194 169413 149473 110276 -31105 117933 366178 403033 263403
15143 263403 129462 22892 -331846 -385088 -384576 -209882 92849 402794 444453 373547 158732
15132 158732 272242 335053 101375 64327 165052 218176 -25698 -288214 -240269 60420
15122 60420 298715 146277 -71223 -169143 -344129 -421406 -215931 -78882 -28731 -49479
15112 -49479 -172441 -244092 -331834 -97541 97129 -38072 -24649 44839 62610 -127039 -281734
15101 -281734 -269141 -225312 -160756 -235710 -332908 -178069 -96043 -99534 -200779 -296344 -197765
15090 -197765 -88495 -165615 -38952 -57528 69283 -25228 -54504 -24704 11372 114382 22995
15079 22995 104904 58436 -131258 -161447 -69176 -47908 56579 -34384 -13189 33972 47917
15068 47917 -24442 139738 386076 299634 80047 -332374 -395962 -249508 -89280 -111170
15058 -111170 -19800 143729 155388 134891 247474 105092 -4943 -95312 -104102 -94152 9610
15047 9610 -52839 66993 -54579 -135261 -281272 -50003 129470 188780 130663 379888 449073
15036 449073 -170966 -510075 -524887 -322985 -89130 -130368 -293526 -244961 -249381 -358614
15026 -358614 -184737 182224 169583 -57051 64279 107879 -97012 -123996 -128348 -68936 -233484
15015 -233484 -534862 -415019 -154664 -146935 20869 124561 141486 -76373 -184910 -210487
15005 -210487 -177401 -195675 -166726 -269908 -215967 -515871 -725373 -747614 -415531 -251154
14995 -251154 -317070 -235030 46030 269785 122140 57346 39095 -16864 -4419 214739 266015
14984 266015 135105 108010 85437 49471 120487 -57868 -68027 -24839 67919 -6133 40409
14973 40409 70641 -178359 -42207 1417 -90295 -184996 -129098 119043 13196 127673 52829
14962 52829 64824 117627 129636 153105 -96776 -237703 -203761 -229136 -403871 -553523 -211557
14951 -211557 -51596 -195833 -276334 -194324 -203761 -37446 5209 -40182 107801 110016 10022
14940 10022 85077 116527 81719 182762 237993 209507 44121 -187936 -149748 -177811 -6402
14929 -6402 70900 73328 161349 193961 11112 -127556 -169394 -420836 -209048 -270877 -213951
14918 -213951 -71462 -92295 -337091 -351005 -201759 -19110 -7131 -254157 -228105 -132960
14908 -132960 -224392 -296583 -168599 -229009 -277872 -284405 -368440 -213282 -22839 -103049 -108854
14897 -108854 -196331 -292685 -309211 -152278 -37592 295994 448465 184729 -4099 -15864
14887 -15864 170595 263752 333185 352539 48580 -18190 117257 191093 134772 251708 294815
14876 294815 -89451 -30617 82862 233450 37033 -100508 -358323 -490894 -570413 -789306
14866 -789306 -681580 -256429 -148880 -114743 -6227 -181179 -255464 -230911 -160078 72971
14856 72971 78212 -42796 86530 -26666 -90207 174698 76598 -64276 -143773 -135105 -444508
14845 -444508 -540037 -481442 -409271 -125851 42679 -68071 -179486 -110503 -127881 100789
14835 100789 136624 -32629 -83746 -240148 -400386 -5252 196975 130006 -55267 47821
14825 47821 76059 -59702 -120576 -92382 -50512 22624 -38018 -180535 -176991 -108243 -136078
14814 -136078 -192688 51224 122033 -16997 76371 64545 5145 88317 16514 76900 100337
14803 100337 190168 169958 56607 17027 192490 109989 -21961 -299414 -251763 86881
14793 86881 162693 96602 375344 494846 434243 345774 57037 -19039 6511 -50909 -89296
14782 -89296 103965 184850 3217 48864 249713 219000 220970 441070 552677 496126 373954
14771 373954 219328 -221063 -495044 -441853 -210961 107466 234337 157418 121101 147442
14761 147442 152937 -7968 50594 10708 -158076 -143430 -147437 -142061 -194310 -165154 52056
14750 52056 139402 79319 40118 -376072 -469339 -309554 -78794 217870 312573 29638 -55193
14739 -55193 -3804 18633 195492 211982 -185355 -237672 -254302 -282712 -327420 -295632 -262044
14728 -262044 -87432 -124682 -282573 -268575 -272033 -329725 -315851 -217648 -115984 58865 63410
14717 63410 106294 -66818 51655 246693 80634 64343 144382 134399 71648 -4729 -129954
14706 -129954 -154073 -14675 -94889 -57310 -44754 -143169 -98760 -85042 154059 -84036 -481575
14695 -481575 -399241 -7467 43187 -50359 -143331 -4818 192309 282102 -44337 -162758
14685 -162758 -106619 8199 96388 223004 496566 437182 274723 233345 296235 132296
14675 132296 66358 73020 -200188 -185521 -102301 -214330 -76192 -89864 -189020 -125549 41813
14664 41813 -142103 -200855 -134684 -303954 -415369 -360496 -336027 -449053 -403861 -216649 -166385
14653 -166385 -105845 105160 238476 208275 425123 382520 419143 298432 142435 209191
14643 209191 131122 -48434 -222066 -440211 -450883 -437066 -172936 214589 158021 79690
14633 79690 47422 -120145 -104057 -385690 -500121 -176817 94291 228887 289706 400341
14623 400341 151971 -72641 -150632 -76510 29144 -6099 39056 112918 -167599 -391357
14613 -391357 -406005 -275196 -210301 -150148 -33809 -32525 -14643 -53031 -82176 -1692 19411
14602 19411 -73271 -275546 -219382 95975 377616 262508 92418 -16390 -104344 -278604
14592 -278604 -265413 -171996 -102880 -31357 -28535 11449 48697 205734 387552 336527 119484
14581 119484 143952 222907 112475 -94553 -316168 -371151 -242737 -22256 30572 -285363
14571 -285363 -581613 -447100 -409973 -455642 -258213 -5522 203744 137274 81779 -54027
14561 -54027 -325992 -241881 -102049 138474 256592 65599 29697 142043 -112403 -437061
14551 -437061 -288446 -20061 170528 96671 -8180 204667 183440 165310 303391 187318
14541 187318 170388 104284 -175360 -123248 -284255 -387399 -305401 -239949 -32478 162543
14531 162543 89916 230200 169725 418017 405404 160497 -66883 3034 65397 68688 70268
14520 70268 51062 182916 135072 36031 -94779 -317316 -335376 -248139 -289247 -232564 -108173
14509 -108173 -51707 -176676 -388086 -373339 -515111 -431668 -294625 -61344 65059 747
14499 747 79054 119138 -191871 -435000 -390955 -193597 65688 17068 -70487 -255496 -243145
14488 -243145 -141242 -65307 11174 -45120 -42871 54494 237028 224674 -12722 -346053 -221993
14477 -221993 -164756 20301 3448 22250 48900 135821 400873 260068 92427 44879 -97500
14466 -97500 -122961 -221278 -335484 -443682 -358816 -288264 -287901 -379146 -220377 -76223 76049
14455 76049 -73555 -149758 -74941 25442 -29534 98026 196423 108610 -352337 -313229 -234334
14444 -234334 -113665 -102223 -109604 -49046 36884 157002 179063 121556 103103 201813 96646
14433 96646 -156189 -24488 398947 285464 222338 131703 81089 -309682 -172189 -152800
14423 -152800 -255967 -256798 -281040 -242684 -43369 136897 245824 289025 131463 99626 177852
14412 177852 114443 -41335 -146911 -430422 -546623 -410838 -376892 -371531 -194216 -66193
14402 -66193 -13969 255105 313998 238640 150718 -71017 -171638 -267746 -364993 -453674 -215377
14391 -215377 143931 245169 134180 17511 -47870 -146258 -120659 -49315 74734 43636
14381 43636 -202471 -234916 -90959 -27039 -22745 -32543 -27708 -63576 -145786 -132747 -207138 -314655
14369 -314655 -166587 -18393 39872 12968 -72413 7012 165550 306646 136812 -168716
14359 -168716 -232588 -164099 15233 160116 156721 119359 -167641 -48497 6791 -240235 -164907
14348 -164907 -247648 -118063 -71859 -316374 -330094 -327551 -376570 -242383 -201280 91285 406156
14337 406156 483867 450340 366329 203085 137734 -28845 -32460 -114445 -120044 53509 -108959
14326 -108959 -170620 -215256 -272132 -51855 31269 118298 18144 -7331 36367 150052 21366
14315 21366 -37763 -290024 -171608 206910 261903 142383 313988 457016 236297 121458
14305 121458 152913 -30727 72690 171152 40796 -154240 -221996 -134292 -261501 -343889
14295 -343889 -198256 110655 -42536 -271314 -226266 -283858 -411419 -216010 -39358 -106395
14285 -106395 -71495 191249 227634 216038 188133 82529 -3965 143397 189871 140997 -260900
14274 -260900 -200644 48367 -15555 -372469 -341141 -41762 39016 675 18662 56616 118849
14263 118849 156076 24484 -215884 -236192 -229132 -31522 -21825 -307418 -253587 -163678 -249677
14252 -249677 -365725 -87746 82909 72103 81096 172381 346735 252004 122975 -54328
14242 -54328 -80985 -111895 -39654 44408 64883 -100103 -7046 294910 295227 299499 11396 -87436
14230 -87436 -244049 -406473 -321557 -141586 -73524 26875 139429 370190 460696 508782
14220 508782 98547 -74908 -474104 -542531 -428956 -411366 -478981 -464277 -360667 -454029
14210 -454029 -308426 -154385 65049 199899 45448 10496 80112 109813 -543 -127007
14200 -127007 -313325 -418912 -208090 -107967 759 90795 -136174 -315901 -159738 -53369
14190 -53369 -11755 160647 118050 -25374 20077 65061 242091 111136 -39488 -127706 -61211
14179 -61211 -62694 -106593 -206072 -206375 -141666 193358 110477 -55987 -152945 -291988 -520133
14168 -520133 -306766 -96822 -10512 -6990 11470 -140802 -138526 -112891 -220521 -468513 -394909
14157 -394909 -205875 104516 329545 62591 -352626 -416503 -215721 -90707 -101918 -211955
14147 -211955 -99185 83028 84879 -19766 -63106 -48422 -402438 -564084 -381929 -288045
14137 -288045 -432500 -416367 -159605 56171 171935 146755 4380 -56987 -175304 -74262
14127 -74262 60280 -19838 25014 -75862 -60379 -199102 -113944 -35563 -138222 -248933 -344896
14116 -344896 -31059 4996 83945 146579 394742 674065 651772 449091 177130 53309
14106 53309 33015 62591 103917 -96609 -150443 -177614 -161777 29413 132711 189143 301853
14095 301853 292424 128198 50723 47791 -81593 -65718 74272 108829 34751 -11072 -151250
14084 -151250 -288518 -484335 -567487 -274088 -50302 -176368 -132924 148167 153276 82877
14074 82877 -38712 3617 63697 184075 48455 -102816 -225316 -175432 -106145 -30892 -32255
14063 -32255 5906 227753 180541 112370 176985 343973 202267 146566 266969 389116 370327
14052 370327 449431 268013 52175 -53302 -57840 166244 44882 -120487 -296627 -278985
14042 -278985 -291765 -134678 -59531 120417 180544 141090 -145682 -68184 43404 -54226 -185207
14031 -185207 -219518 -222650 -49160 119259 128695 -41855 -135296 -161310 69994 358367 354976
14020 354976 305041 329582 227599 -61005 -20844 -44953 -182570 -36329 -114660 -94497 8607
14009 8607 -15430 128582 89247 -31150 17835 51023 63667 -238507 -325163 -298640 -38076
13998 -38076 -15854 -10854 71919 228291 570794 605675 323455 95944 -134305 -236124 -334803
13987 -334803 -452134 -254004 -156080 -87002 -37873 -81238 -26222 130891 235778 329285 259026
13976 259026 159282 1146 43311 128144 -66035 31853 155839 -40026 -233879 -294205
13966 -294205 -205013 -36060 19156 21827 96481 169296 55431 -104578 -324807 -418755 -314783
13955 -314783 -63485 86230 88649 -233874 -258190 -63128 -4864 81781 152332 379994 216580
13944 216580 158923 204224 4737 138769 233155 202347 126805 177183 -51536 -84674 4872
13933 4872 20653 222505 107903 59151 -112884 -222542 -25335 153248 62174 74721 24212
13922 24212 -34253 -48293 -171645 -88449 -145459 -195450 -91599 -37126 -159686 -139585 41957
13911 41957 123571 -211245 -299231 -121926 47709 153161 -76425 -337826 -475500 -141061
13901 -141061 31161 -219049 -335726 -492006 -210488 47433 3522 -89700 -172662 -293720
13891 -293720 -220068 -159928 94195 -172699 -364826 -220223 -202394 -289370 -418296 -259877
13881 -259877 -225859 -365800 -569208 -620077 -649941 -384986 -171823 -352432 -548322 -705575
13871 -705575 -434462 -44098 -222032 -284014 -27174 37387 -132907 -122505 23366 -119537
13861 -119537 28640 48191 -129520 -268169 -190298 -287562 -212944 -231133 -505559 -522214 -248261
13850 -248261 60698 113145 54046 64411 -189738 -208943 -81190 50883 247016 377233
13840 377233 115522 196975 397881 333895 179463 77665 15014 14607 79672 -103401 -148012
13829 -148012 -34963 13702 -136127 -108758 -345203 -236985 37714 -38681 -37748 -30648 -70113
13818 -70113 -65441 25426 188463 12673 -186655 -346716 -263381 -119287 -184994 -105912 -67585
13807 -67585 -237843 -141306 -41796 -82630 105719 83824 -21351 153927 249081 7486 -475963
13796 -475963 -556153 -592402 -607799 -253674 -96596 1453 57634 -62958 -218983 -102116
13786 -102116 130130 21740 189246 172015 307501 383463 510153 187836 -104738 -118113
13776 -118113 -141302 142975 182138 228894 168844 -26912 91581 26245 -416501 -350505 -266136
13765 -266136 -256438 -248515 -80592 -27030 18557 -4196 -319924 -170060 14592 -876 223327
13754 223327 193984 -119203 -261163 -190657 -345452 -193680 9384 -71982 -412251 -305496
13744 -305496 -433914 -548824 -354396 -263334 -243528 -179402 -173341 -176931 23597 102633 50285
13733 50285 -62921 42501 122157 27888 -57037 -34258 28331 89715 -38848 -71532 5563
13722 5563 -20507 -53641 -121580 -94928 -106626 143430 204216 89607 -102223 -268227 -441458
13711 -441458 -536015 -474377 -483944 -516753 -376125 -177913 70125 128229 -40463 -65898 115801
13700 115801 202733 176340 98036 237025 83337 2932 -189060 -227490 -220391 -96407 -168551
13689 -168551 -54545 70219 111090 -115494 -228709 -119646 63056 138355 -68417 -268997
13679 -268997 -119388 -40308 -81928 -55148 -79800 22505 -170941 -184161 -150184 -57093 -84670
13668 -84670 -99865 -207330 -223084 -106670 -156529 -57110 -15467 74700 135569 156548 -25442
13657 -25442 3156 -11747 298938 336004 127534 -33336 -54119 -251860 -313212 -178008 10330
13646 10330 132022 28278 -62731 132963 123839 180281 12640 -87671 -228202 -235923 -258113
13635 -258113 30663 70137 9264 -68301 -124549 101465 192040 261786 324335 43849 -21984
13624 -21984 -139239 -247656 -218733 -179434 -186948 -48799 -179281 -196257 -156058 -21665 -122028
13613 -122028 -384549 -485554 -300090 -10755 224235 357879 225217 33321 -93064 -199375
13603 -199375 -45526 -19570 -136864 71759 157570 270019 207678 141886 175204 287763
13593 287763 315008 64919 -156289 89493 329967 135633 -124475 -227110 -63619 96074
13583 96074 185631 133990 181959 210557 211322 175419 240778 83047 -115452 -21543 -202955
13572 -202955 -582159 -645639 -482905 -264433 -152077 -127644 -323260 -159646 -49476 87487
13562 87487 178289 55743 -13985 -11557 -80108 -185961 -110153 -97259 -319831 -375002 -306193
13551 -306193 -154483 102868 76523 190758 299972 238696 210236 205708 256838 206244 -23794
13540 -23794 -260426 44867 323735 218277 -35468 -247234 -357547 -336444 -360443 -210665
13530 -210665 -89555 105119 379142 416674 370168 195391 -122168 2494 54897 684
13520 684 -158657 16875 225175 117338 -80724 116219 194471 261997 127739 95941 11943
13509 11943 5276 117262 123071 -41419 -18867 -11530 -278253 -316729 -46671 -96960 -449012
13498 -449012 -308065 -335540 -156492 -76739 -162038 -62192 -32337 -80329 -15714 100432 -63607
13487 -63607 -121171 -195738 -150941 -30790 -46795 33578 -525 -60472 42372 -20170 -123158
13476 -123158 -95191 -40490 -116482 4843 114889 122142 131934 216957 225402 296736 247625 247978
13464 247978 132646 -218639 -198962 -251511 -126941 150776 -3037 -194395 -224643 -216336
13454 -216336 -130031 -152180 -147460 -247222 -129430 15613 -129950 -290352 -332042 -383602 -267642
13443 -267642 -203465 -128275 -72601 -199898 -402508 -397365 -76815 -169128 -231546 -124403 139847
13432 139847 278041 204514 309999 354027 226266 -83119 54007 -48343 -123121 -69856
13422 -69856 -94824 -249193 -502602 -394680 -177581 -213404 -360850 -285967 -122049 74378
13412 74378 98714 -44284 -87638 -156768 -214552 87149 362651 314385 291732 121072 9131
13401 9131 -252846 -107545 142988 234363 219096 -155401 -298341 -217801 -188338 -294354 -256088
13390 -256088 -132085 57005 -41232 -100746 -191982 -150119 -255684 -323762 -401563 -599738 -668602
13379 -668602 -421902 -56129 122190 164508 -123962 -361336 -200714 -145407 -88263 17871
13369 17871 -103657 -240001 -411466 -415082 12492 120463 74217 80709 -139821 -327517 -346884
13358 -346884 -313723 -11331 120752 266855 65983 163679 37385 -188438 -208801 69890
13348 69890 137601 2200 153837 63779 6900 331626 652821 609606 241846 -314810
13338 -314810 -434108 -233055 -162989 -80211 160739 88874 -257006 -205043 -190971 -181733 -138259
13327 -138259 -68417 105885 64597 -499549 -436059 -144548 108757 8699 -147457 -157482
13317 -157482 -70702 -109740 -7262 206635 161254 122869 -5110 22328 85566 88647 -201827
13306 -201827 -160199 71432 -18824 -38991 -198348 -57505 -137865 -176484 -360904 -358796 -122191
13295 -122191 74343 -91888 -209177 -217447 -409980 -516757 -518778 -449001 -404747 -445102 -591220
13284 -591220 -599587 -495109 -146498 66386 16428 -57906 -23657 199751 20066 -103246
13274 -103246 -137147 -268223 -242549 -229984 -102808 -120953 -56848 -354640 -262879 -192569 -147460
13263 -147460 14672 133748 93545 -39864 -35361 -44035 -90761 -216690 -211262 -193120 -280004
13252 -280004 -206453 -101027 -10412 -22252 -11066 54253 22550 -117133 -283534 -190976 -179413
13241 -179413 -132749 82028 63607 36000 -76489 -42394 -180751 -47290 -29601 -232330
13231 -232330 -96073 13824 -129433 -219742 -442759 -431735 -275505 -202036 62533 71576
13221 71576 41885 -24435 -140406 -335128 -445930 -158878 -199460 -334866 -106578 -119347
13211 -119347 -232571 -223158 -135340 -140259 -37821 -182251 -174408 -392353 -321997 -131834 -348065
13200 -348065 -390691 8155 157742 263343 356558 195603 247135 368319 405926 173338
13190 173338 -99453 -272815 -66340 31228 198718 -6687 -14609 54272 154699 113312
13180 113312 122654 172494 15925 -264482 -406676 -563172 -379892 -171557 -14423 -67613
13170 -67613 -62571 42807 23358 160012 88516 -28481 -130046 -80783 -140180 -18909 -139072
13159 -139072 -335715 -330764 -167561 -103940 -160347 -124799 65893 247542 431015 425109 92270
13148 92270 95664 200171 57260 -243097 -232060 -109068 124075 210506 122246 -46785 -81923
13137 -81923 -81156 -47854 40042 119303 147251 56742 -146610 -261041 -276576 35849 173023
13126 173023 44377 23582 276670 334939 133893 6101 -165038 -253586 -173931 -173969 -38102
13115 -38102 70835 79713 372478 344613 272025 137878 -77946 -289119 -148024 -235037 -299118
13104 -299118 -193837 -244020 -174922 -287902 -24563 187518 285273 59749 -185964 -39062
13094 -39062 133786 54890 -108997 -157586 -21879 9517 -34124 43371 147063 42827 -13621
13083 -13621 -96899 -311121 -448163 -324812 -110812 69948 8981 12719 67886 327778 378555
13072 378555 299066 140942 226762 240324 97061 222161 212064 129196 67782 -70970 -117522
13061 -117522 -260133 -179657 37646 145515 559824 674385 586768 429237 305125 263078
13051 263078 353182 402491 201403 330274 419942 103917 -46068 -96327 11267 168880
13041 168880 303006 301467 397988 303406 498754 604493 399953 346527 356715 545630 516961
13030 516961 218389 -84645 20723 116242 105847 6435 -162786 -185626 -364033 -141340
13020 -141340 -2679 224423 219662 470987 354180 155116 81993 -136601 -484868 -445830
13010 -445830 -410093 -155443 3803 7876 -30376 -68158 -150788 41723 447092 291705 157861
12999 157861 25230 21940 224670 612213 475026 391379 268335 149455 107928 459365
12989 459365 643349 678830 623917 488801 387520 264328 228203 129419 377456 400629
12979 400629 270656 193915 231182 435163 451805 189036 -179742 -361891 -573401 -258977
12969 -258977 161143 -114645 121634 380349 456685 309162 81008 62960 -2759 130593
12959 130593 154101 109513 157979 201915 123657 180875 112029 184961 309199 50265 -137284
12948 -137284 -227869 -116755 189332 220769 200051 308073 229293 145662 150327 18552 31597
12937 31597 194758 317648 221749 97837 -21887 -278859 -68485 25008 96951 174778
12927 174778 151347 -34435 -234505 -273114 24721 75604 87476 57881 47175 58851 45596
12916 45596 148276 127000 32994 43117 110863 -67198 -76970 -41819 -165397 -168285 31620
12905 31620 -154659 -199431 17025 19989 269838 340208 290506 233309 78476 -134549 -410248
12894 -410248 -284482 -71290 -2616 -43288 -83042 24160 215696 -10262 -26591 52100
12884 52100 108820 173339 -13540 -51061 48807 181655 139971 -174455 -65671 5659 -118452
12873 -118452 -238525 -133337 -72644 -96186 -15377 87317 11678 -345788 -590635 -337449
12863 -337449 -181194 -150441 -87214 33521 -82415 -839 -167892 -6598 -56065 21472
12853 21472 -140524 -167338 -190861 -142318 49294 57970 -23364 -58298 -92662 116249 249171
12842 249171 148333 64317 -48705 -162393 -291397 -394153 -423134 -357915 -417502 -507854
12832 -507854 -455809 -308851 -98809 5653 53182 -97508 97489 424498 406466 209079
12822 209079 57513 -106415 -182649 78466 130944 278415 354759 271231 123263 147489
12812 147489 333378 239586 143537 88359 71433 126383 219799 149628 255256 394164 181504
12801 181504 110800 149316 86287 28265 8565 -99459 -126535 -123158 -143175 -34848 -171023
12790 -171023 -48036 167340 172603 138184 111971 344616 304443 120315 -28236 -114488 -372372
12779 -372372 -446381 -59139 135558 -58664 -358215 -120159 -57525 41690 151168 14024
12769 14024 -149827 -380456 -452958 -137464 -222651 -422850 -351270 -115233 147606 328693
12759 328693 253993 -15129 53886 16929 -36171 42353 130446 361136 488559 348539 26084
12748 26084 -36871 -37118 -47018 123628 18545 -274258 -357253 -320815 -162576 49710 159988
12737 159988 250519 -26027 -125170 -159773 36639 -15370 69029 48604 -43277 22911 -61282
12726 -61282 -169954 -201269 -279120 -97756 232297 323015 173907 19386 -95072 23183
12716 23183 339406 266428 164402 -57808 -61733 -211545 -177754 -286730 -381048 -366241 -243655
12705 -243655 -227244 -118474 108760 209953 157113 -97479 134110 351185 496647 646961
12695 646961 421326 401574 319192 388461 344231 236364 185204 418642 464103 358811 181208
12684 181208 80236 100869 174402 37015 -14692 -120051 -77255 41849 83087 -128162
12674 -128162 -89882 -146672 -59249 -80360 -173021 -53536 30819 -127865 -86189 38846 33892
12663 33892 181493 383944 164571 124207 135922 203652 198216 -1164 2142 157996 136307
12652 136307 -78626 -150064 -165630 40856 209741 -7804 -76231 218090 156350 128992
12642 128992 -227699 -356450 -187329 -154492 -76890 -258052 -481219 -399121 -316482 -14062
12632 -14062 321082 372788 394277 179554 184056 317951 452527 184361 86940 104222 -58494
12621 -58494 -284585 -230803 -33218 214424 227235 194328 300332 349737 426402 522940 451996
12610 451996 313286 385902 58386 -107077 -47063 -38828 139579 199273 269926 258949 151499
12599 151499 91218 -19353 -68095 -260180 -252946 -105754 122379 247531 361760 302664
12589 302664 91304 42664 32464 97398 156948 333963 263826 193758 256908 285705 215076
12578 215076 -72842 -278137 63154 434376 349411 237454 227910 223041 316424 357245 398531
12567 398531 254255 62441 9651 80606 52389 65739 5097 -118636 -164911 -106673 -154327
12556 -154327 -49868 348992 393655 304659 264507 507329 337943 240434 515977 733414
12546 733414 514968 384015 347744 197798 -9170 -48886 21864 102834 243002 385588
12536 385588 312752 277311 78620 164270 315176 483877 515079 337346 260482 423117
12526 423117 231320 6591 243549 354963 300855 189725 130427 254531 392617 206425
12516 206425 151344 191999 274083 43894 -124361 -43480 -11355 31699 -19500 82739 193674
12505 193674 262954 233018 353344 371106 530386 460035 234275 448227 673625 518322
12495 518322 329286 85960 -23329 45799 281127 315758 282346 -137856 11377 181677
12485 181677 14449 -217543 -145896 -125868 -2116 -26170 -38760 206157 528804 397294
12475 397294 186888 278403 271161 91654 308784 185223 136369 261662 221048 274615 344486
12464 344486 219948 60923 233733 407952 291062 183845 -13888 59419 63186 -108083
12454 -108083 -40869 21672 259258 442057 338105 14715 -158924 -56402 218857 78355
12444 78355 130014 259319 377721 494502 428431 297715 270855 379249 396578 277600
12434 277600 141610 229562 349474 362017 271353 147927 197171 261680 298070 200216 234501
12423 234501 455883 290106 42247 -35619 -31674 -63148 33738 141570 132595 342057 338086
12412 338086 368425 418465 309143 183625 257670 579452 292894 121598 140895 80119
12402 80119 205906 467393 723734 970643 926228 714280 305308 159580 273983 442938
12392 442938 588984 642389 702485 608828 499821 444744 159349 278411 212952 88482
12382 88482 217831 587978 653117 272831 130503 228095 88974 -2158 100278 227052
12372 227052 252819 67244 189862 252309 80567 128386 94361 57339 263937 268618 151437
12361 151437 40065 40910 226924 349433 433497 547351 436415 481177 426420 242612 371614
12350 371614 438757 357620 304244 374363 470751 510914 559521 246064 421204 625139 326307
12339 326307 82616 248919 284543 175902 93494 191006 106855 50702 33455 -121056 -121861
12328 -121861 215342 446982 587876 620403 590576 503303 312402 252063 279578 202396 252838
12317 252838 475442 752429 711568 574788 479125 372896 320678 352289 603472 660089
12307 660089 628751 317026 250974 223144 332999 345987 270305 295696 351093 483079 855791
12296 855791 778697 771731 763616 560056 639628 631362 518410 426481 309484 431410 525448
12285 525448 519473 285529 247730 592083 813547 615893 710051 844811 876043 741906
12275 741906 873532 932232 802555 650580 735972 767130 752350 657039 899066 1204706
12265 1204706 1171716 1093564 1094953 1009222 990722 1015169 945786 994127 884444 627510 699168
12254 699168 885017 1081336 1091264 1181721 975564 896820 871596 844819 756350 753949 729910
12243 729910 681997 745594 815006 928622 1040906 902071 657368 633399 591823 557782 744616
12232 744616 982868 1059225 1123854 1212954 1155422 1186468 1146680 1208513 1203668 1065123 1291499
12221 1291499 1483061 1335168 1381941 1555316 1480138 1662569 1619420 1545934 1372783 1315699
12211 1315699 1479534 1509831 1404259 1184221 1062803 1097303 1150962 988996 973349 1131301
12201 1131301 1040223 994236 1291386 1531390 1429970 1348915 1310237 1514173 1568719 1569952 1747234
12190 1747234 1536704 1418675 1233676 1195445 1239321 1301503 1306980 1337457 1371477 1704367 1766856
12179 1766856 1739845 1720667 1852773 1943569 2039853 1937729 1849233 1979814 2279340 2492453
12169 2492453 2369248 2332024 2218265 2047837 2170695 2227936 2207804 2123587 2077398 2234239
12159 2234239 2050428 2036524 2267402 2224361 2215874 2251179 2606096 2794666 2439400 2452707
12149 2452707 2660495 2623305 2395043 2620578 2757904 2620058 2646120 2824811 3064409 2914098
12139 2914098 2652067 2701714 2989981 3201848 3313191 3420465 3573552 3500598 3371202 3427662
12129 3427662 3620486 3719669 3650817 3847468 4240780 4351266 4476255 4521911 4212117 4040448
12119 4040448 4059014 4095554 4303598 4432387 4622841 4776912 4557330 4555115 4908776 5280379
12109 5280379 4949865 4650095 4844011 4975940 4976975 5199892 5339922 5634921 5977606 6141179
12099 6141179 6075471 6188915 6101047 6146780 6404176 6524058 6539702 6448972 6411683 6361122 6758899
12088 6758899 7296193 7446848 7618615 7744492 7668954 8012048 8315221 8328506 8540048 8732698
12078 8732698 8887593 9026532 9448978 9730896 9700471 9538959 9569656 9670328 9983311 9920773
12068 9920773 9957899 9846434 9803824 9926792 10250100 10528523 10936290 11049246 11149081 11328820
12058 11328820 11598842 11938604 12063034 12276132 12362746 12287267 12312092 12597787 12954618 13034089
12048 13034089 13234023 13569902 13664985 13778316 13800411 13897086 13997891 13884694 13579636 13374603
12038 13374603 13583297 13909230 14202596 14099765 14095551 14324933 14395141 13983705 14006433 14031831
12028 14031831 14057317 14142946 14066969 14053002 13933205 13770848 13881371 13941700 13857103 13562375
12018 13562375 13326093 13382658 13580279 13682264 13680306 13861717 13680440 13369190 12784688 12441989
12008 12441989 12455853 12576690 12591888 12490968 12199390 11991373 11949240 11570095 11296423 11372837
11998 11372837 11284984 11125059 10999427 10847959 10781562 10539925 10445134 10375155 10153792 10083455
11988 10083455 9852792 9459767 9441766 9104550 8830326 8922290 8926549 8809207 8579891 8258978
11978 8258978 7885327 7703621 7886211 7859166 7469250 7266381 7366483 7305326 7153612 6946462
11968 6946462 6748811 6586585 6496846 6443227 6438456 6246153 6213838 6069811 5769750 5721268
11958 5721268 5544604 5677148 5661247 5476337 5520346 5652744 5267047 4886437 5021832 5358338
11948 5358338 5340257 5404793 5435378 5262250 4964519 4915525 4597758 4423164 4270799 4081371
11938 4081371 4021064 4125939 4166194 4234363 4310703 4206242 4093701 3896120 3801676 3756787
11928 3756787 3492174 3292859 3379030 3393181 3511201 3351438 3171603 3093490 2999805 3122073
11918 3122073 3178204 2747758 2598730 2723414 2976576 3041047 3058446 3111497 2877046 2889914
11908 2889914 2865966 2730633 2494787 2567518 2565475 2433315 2186589 2497751 2675640 2592233
11898 2592233 2385055 2514953 2579887 2485847 2640509 2917084 2923405 2610369 2362897 2393417
11888 2393417 2149626 2103960 1972335 1921237 1868306 1834606 1913817 1674649 1637721 1752716
11878 1752716 1669957 1590335 1692117 1769457 1794067 1827976 1759626 1661158 1622589 1536787 1409552
11867 1409552 1308704 1585888 1984954 1939098 1836569 1573432 1653548 1767841 1595335 1572652
11857 1572652 1498848 1388155 1677307 1968070 1792697 1642584 1413921 1457638 1488434 1693495
11847 1693495 1524513 1151454 1108624 916709 900690 1227817 1284940 1152882 1126591 1377993
11837 1377993 1434812 1403504 1228210 1166026 1223774 1339407 1128646 1030023 1100684 1162354 1149878
11826 1149878 1210892 1186050 1038757 1119185 1129941 1225547 1305597 1389777 1142899 861514 796495
11815 796495 868523 925992 1022905 861796 584090 569332 593523 638614 589607 757831 1065034
11804 1065034 1261200 1212463 1200528 1129718 1148909 1066057 993066 954930 946874 1025863 930924
11793 930924 882787 1105828 1144497 1124986 1215633 941698 832871 766806 966903 859837
11783 859837 861509 887293 824550 945913 781252 623101 682437 533095 635157 841493
11773 841493 560526 470512 604020 732197 724234 698208 544120 690447 583728 385366
11763 385366 537753 815972 817741 890730 939459 909428 858234 802197 794234 632612 499723
11752 499723 385512 345724 316362 331000 401275 605305 486473 178616 294140 387438
11742 387438 373670 410362 460890 571615 488979 438653 505510 437867 381748 303690 295037
11731 295037 552462 714954 649451 586379 410716 260576 252490 244377 390370 195158 69729
11720 69729 344438 487395 509890 667043 526677 403968 393382 69221 248760 497854
11710 497854 572094 503550 323300 293730 318737 294974 68280 232594 290349 403818 287931
11699 287931 262725 299110 203743 378975 546733 298246 183028 55732 40556 379190
11689 379190 539545 441397 206955 235141 317037 382153 354705 382669 479548 348177 -184826
11678 -184826 -214243 67322 158630 246991 327050 242160 184849 182348 189929 251530 133371
11667 133371 -23572 69679 26312 -27626 60053 29750 -128633 109270 366187 229796
11657 229796 219063 295885 270601 193507 358121 244086 226445 350151 214943 273163 201684
11646 201684 242464 363326 90081 -192522 -184279 70607 67947 134619 123480 33412 -17041
11635 -17041 -65123 -3451 65916 -6858 19782 -108967 -33087 154795 -126125 -303843 -360406
11624 -360406 -302779 18176 199385 283646 348533 151836 -174214 -177822 -45547 224292
11614 224292 154612 114464 6198 161191 425061 774374 729306 722689 666599 492914 259276
11603 259276 179469 266672 338971 334603 505694 303428 247492 290845 220074 199596 223577
11592 223577 145536 238501 214875 24583 -101460 -49967 -77094 -93932 -180666 41102 279824
11581 279824 440390 586203 422635 420859 414985 161243 -35817 -218928 -207070 -12344
11571 -12344 -108612 -193927 -337154 -150743 260475 291822 103153 -33830 101394 30113
11561 30113 161531 201714 19208 101974 194859 -79990 -134163 -180888 -213192 -188822 105501
11550 105501 -54321 -181281 -19053 56936 273415 394288 323279 144800 302344 402186
11540 402186 138839 -147007 26017 39456 -90512 6507 124470 139431 374152 134281
11530 134281 165204 72169 -75510 -206071 -298466 -392512 -325876 -126576 -18610 78796 234908
11519 234908 10839 18543 128776 136932 102968 -35011 -69147 91032 326895 326955 205586
11508 205586 103605 10470 -50645 85424 282523 491899 624742 532486 430795 189927
11498 189927 53987 181786 85823 28670 -9606 129282 103590 248458 149361 -101901
11488 -101901 -48990 259827 405647 751856 861993 417174 345321 156951 121682 184761
11478 184761 361748 409965 344151 275292 251098 337298 57824 117287 130511 335170 407844
11467 407844 167561 -8603 225166 388853 239199 215032 275909 366557 358835 427596 184896
11456 184896 177341 148068 49312 71071 351026 384979 216753 130911 -15406 -128910 -149065
11445 -149065 -70705 -175480 -268568 -321677 -89175 272506 309865 326752 270791 335065 157219
11434 157219 67036 118104 151696 240594 139867 -146588 -278907 -19881 277839 264317
11424 264317 185847 92144 106781 259874 252515 192517 140260 87732 -169854 -237595 -314608
11413 -314608 -154576 7550 109350 212142 239565 315315 176938 62025 54033 13805
11403 13805 -180231 56615 135633 158687 153592 81018 -19308 141429 407245 488886 504481
11392 504481 478198 505952 597728 271716 4978 115613 194610 -25600 -285614 -442709
11382 -442709 -679473 -656146 -607846 -350397 -307671 -387294 -166441 32174 187140 353317
11372 353317 353212 318941 476878 642906 654672 481111 521011 195937 132450 312004 119595
11361 119595 127905 64035 93698 74234 -155143 -253738 -432705 -562478 -199688 85575 -74644
11350 -74644 -311505 -297532 -247349 -419638 -173071 24424 -37787 -319780 -122320 114630
11340 114630 -18752 21941 -242674 -444715 -169036 -143701 -71806 181302 151954 79539
11330 79539 -132289 -83449 191419 342410 180316 249341 256273 416928 502793 119792 85675
11319 85675 135701 156345 -131097 -546771 -379355 -303920 -297699 -215708 -78128 229006 158628
11308 158628 136771 118438 158272 126154 233854 359976 622680 567357 203762 -17892
11298 -17892 -19412 59153 158697 181206 236482 320295 92505 -40364 -10703 -111794 -230602
11287 -230602 -226995 -206251 -632 84840 54821 -134862 -46923 10744 -73308 -223354 -378973
11276 -378973 -116559 -130045 -425034 -440096 -304938 -365799 -412306 -158331 -106192 -147221 -92505
11265 -92505 -215774 -209039 -210228 -101385 41820 -2738 25566 116759 -71422 3752 51085
11254 51085 202405 226001 91834 45001 87341 157047 84222 -86942 -94518 -346318 -670802
11243 -670802 -493415 -133025 170594 169010 103160 167155 315234 32846 -124345 -141990
11233 -141990 150280 -73860 -306261 -291775 -107810 -31771 47932 147360 -68994 -148847
11223 -148847 55249 216173 -63710 -87478 29791 92315 399430 229870 130184 68280
11213 68280 -239872 -219919 -235203 -256646 -257587 -252505 -275596 -200398 -216491 -237712 -513501 -396272
11201 -396272 -66061 118282 132962 -87483 -139578 -25270 77786 -63023 -48601 -77423
11191 -77423 -55388 -55139 78137 -8257 40177 -64431 -224010 -191307 -168636 -192403 -295254
11180 -295254 -447247 -390289 -164681 -22508 11626 117830 54293 66048 192026 29859
11170 29859 -47461 -236007 -438535 -214929 -113099 -148626 -229912 -206058 -107801 -128648 -38241
11159 -38241 -80464 -232262 -221272 -160940 98128 198535 200179 150632 -144695 -247051 -227408
11148 -227408 -116723 -220219 -59524 95986 97764 47468 -196040 -356475 -176126 -170138
11138 -170138 -58284 53946 -60413 -257793 -210260 -232118 -308966 -316006 -290027 -304380 -127729
11127 -127729 -126400 -217174 -305029 -336446 -90940 -55987 -73104 -148428 -26199 -26180 -17874 -101472
11115 -101472 -225550 -367249 -413739 -221163 -251016 -92335 73297 163277 147879 -132871
11105 -132871 -270415 -23219 161916 393554 271926 -38144 -222917 -215478 -144623 -108208
11095 -108208 -89467 -101176 -202530 -183963 -195378 -113688 -301573 -368627 -383250 -586194 -623979
11084 -623979 -485525 -431771 -238530 -137127 -393311 -349280 -434584 -337490 -197550 -378219
11074 -378219 -647051 -651678 -655172 -451992 -55414 27863 -113963 -221326 -426830 -409715 167894
11063 167894 117837 -20025 -115583 -70001 -49498 -120410 -144237 90909 85837 148587 378748
11052 378748 540395 543429 415954 374319 541514 608032 491063 558205 734553 671745 467170
11041 467170 511596 524801 801445 866823 1135341 1261908 1265565 1255384 1394353 1567223 1758626
11030 1758626 1656623 1606596 1521841 1437831 1306435 1312810 1481087 1513467 1534293 1532461 1340974
11019 1340974 1037206 972493 1237283 1352552 1380601 1187163 1033523 1031115 762911 558751
11009 558751 523081 565101 631509 645868 464892 470752 545091 359421 73485 -122328 -102243
10998 -102243 -168940 -33337 148225 359591 179550 5251 -30952 -1995 187009 -16782
10988 -16782 103045 83573 -151427 -95891 -112278 -144706 -146756 -72082 -11077 41044 -45603
10977 -45603 -11749 -49060 -175322 -241818 -174218 -311194 -270112 -226578 -607327 -452883 -258147
10966 -258147 -257144 -382333 -322968 -259112 -7883 -35715 -257573 -338671 -167983 -45423 203806
10955 203806 230286 179598 241914 352485 298880 69897 10024 51513 20389 -177666 -148394
10944 -148394 -29247 5713 8980 -197371 -70431 144057 140286 -256932 -483622 -628996
10934 -628996 -626824 -453280 -269707 -296174 -281765 -307275 -346500 -260447 -309452 -154710 -269170
10923 -269170 -539177 -738251 -598938 -533760 -525285 -277271 -223050 -497455 -555278 -309009
10913 -309009 -215589 -469800 -464009 -299833 -164098 -294857 -415520 -449578 -244687 -191529
10903 -191529 -78473 -115093 -209889 -605322 -465623 -344611 -396968 -436896 -449614 -427286 -319986
10892 -319986 -567775 -323260 -125961 -18098 -208715 -128163 18401 -271711 -272239 -200034
10882 -200034 -210396 -334404 -334758 -413853 -312608 -341332 -222365 -55136 78458 -127524 -331937
10871 -331937 -367989 -299736 -43997 125269 177856 27475 -223177 -394502 -350469 -87494
10861 -87494 9035 -126506 -383255 -297816 -79803 -83618 105778 183766 109099 87795 -14420
10850 -14420 206239 337858 95190 93858 186796 -42617 -357573 -591061 -335550 -207531
10840 -207531 -57796 -223854 -116970 212044 124292 13874 -171325 -291720 -434076 -448223
10830 -448223 -376694 -238071 -222728 -30973 159944 -22837 -171399 -92013 -250364 -426303
10820 -426303 -381867 -452902 -575426 -416911 -170751 -22907 -89266 -348413 -276982 -313836
10810 -313836 -329032 -401685 -486194 -521449 -293502 -79583 253715 96069 -42077 -281520
10800 -281520 -409052 -306130 -78349 20250 -181131 -323516 -164009 -210169 -317531 -410552
10790 -410552 -337010 -316344 -628909 -541117 -543968 -251255 -351496 -326935 -119400 -9726 -45478
10779 -45478 -184065 -255515 -172202 -174757 -143679 -64457 -64640 -314369 -352184 -272331 -351377 -334210
10767 -334210 -162364 -234325 -253834 -211900 -72404 -40250 -232954 -384229 -607991 -527001
10757 -527001 -447696 -322352 -148874 91736 67658 -148034 -151059 -102192 -21588 139695 -19498
10746 -19498 102695 144364 92783 43118 -185727 -118533 -54301 152906 128695 96960 230092
10735 230092 380945 365700 86255 73463 169920 129674 52819 103750 -131835 -27342 191077
10724 191077 311376 245158 283190 181200 306729 402837 478245 535418 573874 582546 604668
10713 604668 385946 415687 470182 478610 661896 723603 713059 532792 421872 553774 236923
10702 236923 284179 485641 311023 456758 496440 457351 614431 616702 414042 411132 507484
10691 507484 506244 356195 280929 370458 407827 398944 474711 365395 185836 247258 480502
10680 480502 420294 401721 48739 -174572 2947 194859 178766 211037 389502 588745
10670 588745 666156 494729 397911 341506 404138 673939 924276 1285727 1447005 1581323
10660 1581323 1771861 1754152 1840582 1950292 2029534 1838760 1869135 1838648 1926766 2034975
10650 2034975 2069693 2099224 2165996 2135382 2359684 2759935 3136960 3605491 4290824 5067738
10640 5067738 5935470 6732990 7669621 8683513 9660586 11007867 12884524 14917065 17438654
10631 17438654 20473524 24384783 29722232 36154147 43598078 51913415 61245925 71095080
10623 71095080 80605598 89350147 97602538 105255694 112552267 119845453 126392875 132465630
10615 132465630 139895567 150282869 163406430 177996609 191886872 204208600 214675661
10608 214675661 223701032 231133735 236483845 238200547 237783399 239260556 245839020 257492629
10600 257492629 271426160 284116642 293386452 298830804 300932420 299863112 294009322 281382166
10592 281382166 263928277 248394820 239159084 235884524 236042739 236445664 235546585 232649677
10584 232649677 227800817 220520175 209889170 194703420 176996451 160843705 149280909
10577 149280909 141828390 136992565 132626898 127886320 122532060 116433146 109204861 100280247
10569 100280247 89646144 78085576 67547372 58961379 52242607 47062268 42840169
10562 42840169 39584932 36992513 34763667 32880989 30888244 29095591 27891153 26558995
10554 26558995 25141134 23775807 22788263 21810518 20782375 19855171 19062267 18340662 17675179
10545 17675179 17218041 16713195 16128163 15582633 15015344 14494150 14318556 13976743 13611226
10536 13611226 13224132 12742563 12216829 11740721 11261469 11046677 11218483 10956229 10681423
10527 10681423 10364611 9997246 9585019 9380481 9197420 8663692 8356321 8454334 8254327
10518 8254327 8024747 7724974 7386518 7319261 7026124 6519711 6421803 6462326 6453167 6208075
10508 6208075 6209569 6304488 6041820 5858029 5770814 5621311 5311677 5077964 5036708 4903480
10498 4903480 4814171 4574196 4536693 4455509 4152393 4110051 4123826 4208528 4049068 3767769
10488 3767769 3581510 3574805 3658229 3571004 3452677 3082140 2731713 2837082 2958977 2987219
10478 2987219 3005346 2956841 2755393 2695962 2771327 2973881 3013374 2914411 2825944 2788643 2452592
10467 2452592 2314170 2188868 2109613 2142564 2130811 2089685 1902378 1885107 2091541 2341161
10457 2341161 2340732 2083270 1986756 2062705 1890580 1850649 1828300 1830844 1747658 1923756 1964416
10446 1964416 1913261 1761412 1542632 1419205 1415795 1509721 1554145 1488921 1526550 1338063 1280257
10435 1280257 1436951 1499525 1582006 1675676 1622100 1648234 1623096 1471242 1093306 1108077 1146260
10424 1146260 1047705 1029363 865543 850612 1219549 1350535 1104129 1110136 1396827 1551342
10414 1551342 1549227 1471061 1252187 1287967 1087619 1077786 1042288 1070504 951567 894716 1096374
10403 1096374 1035327 825119 921110 890084 994638 1151763 1258339 1083063 1087003 1231235
10393 1231235 1151901 972796 1038953 1106309 1183306 1123861 797514 1015868 1100227 1152104 1069011
10382 1069011 857888 648338 592874 907548 935469 963715 984478 1120296 1332737 1345151
10372 1345151 1186690 1173764 1279638 1089978 981012 977705 746476 700596 577354 567399
10362 567399 549429 143367 85063 209732 439456 798567 856302 827512 907177 924640 657268
10351 657268 720731 736690 759745 577663 578325 488366 496426 553552 294047 415621 645695
10340 645695 609506 484525 637258 618234 522152 504577 634355 452780 545142 787567
10330 787567 547857 407948 537243 696673 827930 630290 406531 583839 520481 469446
10320 469446 432927 315918 551863 600232 646071 540290 362853 146371 192983 216216
10310 216216 -52078 12629 315320 412892 764937 766679 760203 472639 206216 153566 304285
10299 304285 582914 597019 434295 464293 492386 432320 244893 274830 335264 574523 668539
10288 668539 784872 843551 888582 769431 755240 610117 515069 611964 510324 418817 520754
10277 520754 633730 911186 919667 661103 536713 513882 697029 921373 905133 760608
10267 760608 529162 363984 444385 459080 445724 319850 268923 191791 28452 -181341
10257 -181341 10209 594132 723186 619669 505327 552846 498495 223658 164678 30805
10247 30805 228298 437807 479435 435303 209380 199538 312101 289374 280200 217244 216941 201957
10235 201957 192660 18909 34851 -111241 -14019 131187 250841 420825 264451 538208
10225 538208 600110 516310 384404 474903 339015 144150 -139391 -128514 -200477 -377373
10215 -377373 -61445 280319 261692 364003 382953 212029 471384 438327 313903 418540
10205 418540 376851 405981 486574 677284 1009589 1027346 841609 503286 431206 543272
10195 543272 820936 927307 723248 531954 491585 388789 581354 750673 1081287 1249864
10185 1249864 1255309 1304859 1113410 680257 573606 622567 749429 688045 559889 637968
10175 637968 531865 716772 955962 1530669 1630141 1859701 1833801 1426933 1169843 1262671
10165 1262671 1368272 1613990 1688219 1648080 1505007 1655566 1811339 1861338 1796340 1771909
10155 1771909 1722925 1768807 1726277 1471945 1346190 1554881 1436536 1565291 1447865 1338169
10145 1338169 1304085 1149045 1018329 1046967 922086 1002913 1273284 1336694 1345252 1249750 1155257
10134 1155257 1201322 924794 654510 482456 429211 444958 595650 409626 357658 374384
10124 374384 443578 442872 534161 617918 591535 773317 849292 832863 572303 521219 587488
10113 587488 510278 620316 429016 474645 677753 502633 448072 635018 676265 620142
10103 620142 628792 384469 209447 328145 661448 458130 263791 296779 181002 155224
10093 155224 471245 348761 365844 429468 456485 570301 513534 433844 278555 71360
10083 71360 -95622 8363 273070 449938 339077 22197 -97093 -70690 201734 99519
10073 99519 268721 537244 460099 486210 364048 359850 253047 -13332 -150680 173322
10063 173322 554682 463758 391118 493102 486953 808858 546589 305160 286038 370785 245924
10052 245924 135720 187523 427966 203907 -19821 -168181 111973 72333 136479 254061
10042 254061 25381 555 298220 653431 708551 501357 495612 699326 539055 286752
10032 286752 382792 371941 371829 391705 323062 310246 464942 556232 235713 95822 129655
10021 129655 136593 358356 243277 339463 359357 420667 168221 54232 266580 432283
10011 432283 273907 275550 214466 -183 -59122 84846 -131152 -29305 -127778 -55509 8120
10000 8120 119452 35646 40492 226039 631049 524967 202560 68464 169601 162943 105264
9989 105264 168778 89728 -35803 -46756 -8212 -85609 108425 315481 364522 288945 109994
9978 109994 340417 652188 724331 621589 399304 277365 295194 393385 464585 521889 602873
9967 602873 546642 734119 709679 567263 564065 680643 585291 178539 -8384 -151549 -4418
9956 -4418 20558 -36556 -211893 -7955 112143 262836 472053 437728 367488 211201 416747
9945 416747 595998 285306 48012 -51710 76116 175375 185186 307737 442999 162576
9935 162576 48258 118626 -25031 77152 79556 -201535 -277557 -254497 -200203 -84059 23094
9924 23094 194727 227040 46669 -68447 -31882 27679 -186610 -280624 -563 321957 272209
9913 272209 396185 426912 282241 297745 359023 622676 692697 403121 192863 87692
9903 87692 14707 157336 210976 52841 198873 466028 281425 92833 210105 147031
9893 147031 -160213 -129691 57200 332814 301422 370241 318634 383461 484681 430794 466330
9882 466330 729150 415069 1009 15374 11032 -22419 -92144 -31872 240140 282408 126623
9871 126623 54387 151341 350904 443990 220678 61014 53485 281507 223938 296956 355329
9860 355329 477237 545146 246984 -113668 -162318 -154578 -290497 -457996 -439128 -207870 76602
9849 76602 193861 305137 311711 80871 -52915 -7014 7511 171677 83653 36179 86566
9838 86566 136884 334231 245706 261535 325812 261601 250673 202694 169726 -20335 -160846
9827 -160846 -129422 -109588 -149759 -114747 -57 167832 333601 216311 -99215 -214923
9817 -214923 -78221 -94199 -216938 60495 211720 80020 172485 -5071 -308506 -233047
9807 -233047 28410 101031 247212 310535 333285 632577 583643 265160 156133 127329 481288
9796 481288 622266 283169 196747 325157 197426 202085 508456 760870 967597 1056528
9786 1056528 1427576 1589087 1632328 1714797 1644494 1614494 1516137 1287354 899950 688734
9776 688734 575295 553657 591372 324874 221994 577903 430369 192995 112754 412054
9766 412054 535946 500382 353292 305108 71684 -94564 -131325 -67260 -22284 -132676 -156616
9755 -156616 -2536 299605 479630 657642 482447 311182 200120 153976 191623 106739
9745 106739 223896 297759 267609 322341 348714 329107 212094 100832 105905 173166 130843
9734 130843 183815 38877 155596 69496 101867 38514 -28742 -117001 -116477 98781 197200
9723 197200 -53223 37538 124832 259879 209998 170426 95044 69698 -14160 168672 382242
9712 382242 137005 -62405 18417 45116 -70697 157888 263077 153225 180392 271763
9702 271763 320414 326487 500224 301852 203356 116908 251188 258763 -223967 -599710 -483010
9691 -483010 -426618 -418558 -224685 -258967 27437 169846 64299 64743 -269052 -224935 -123996
9680 -123996 24465 71284 6311 44638 101935 159617 106891 374522 428675 367998 364642
9669 364642 498419 478070 207497 112865 336934 369118 534343 493220 509392 580928 699784
9658 699784 901536 771755 904850 880915 599496 562158 329791 -10572 -162937 -149104
9648 -149104 -54676 -124155 17894 124762 56924 212175 381259 260744 191891 337937
9638 337937 333816 4685 -49003 92311 92106 57242 54189 152682 242330 218403 187310 45679
9626 45679 -27604 -136798 -147130 -315027 -319593 -347253 -246880 1697 168450 71252 215137
9615 215137 288226 329740 361459 262313 313653 204537 -15186 -176029 72778 253659 265317
9604 265317 282397 210249 39892 -65591 238855 357677 214151 143500 80199 339309
9594 339309 432014 240309 214227 126418 234143 145892 90295 63118 11578 -16234 -172485
9583 -172485 -316296 -292082 -87774 28884 17876 -143220 -209868 -464241 -373768 55981
9573 55981 -80498 -99342 -154278 -99357 220942 449715 525900 726390 471432 323665 465802
9562 465802 644888 466188 285366 148269 -96239 142828 292933 379158 252075 135219
9552 135219 173249 373957 379560 254727 -7722 -20727 55816 82175 -29758 -207930 -525169
9541 -525169 -500591 -312290 -249383 -362053 -421321 31420 220485 307176 370667 87629 -98918
9530 -98918 -254399 -320145 -73334 -177 133705 465227 546749 156729 -116343 -155331 14705
9519 14705 141239 13572 62083 23264 41931 15530 30598 62979 -49783 -270 275683
9508 275683 376216 127586 100182 83246 80482 -43185 -223448 -348561 -79799 164112
9498 164112 7765 -103819 -88861 -181967 -480811 -435392 -272586 119023 1131 -45691
9488 -45691 52485 117693 185750 153248 26724 78431 -146845 -405171 -510072 -406040 -90370
9477 -90370 44330 177521 176191 -138975 -257906 -36774 -29680 65967 -147989 -106273 -8201
9466 -8201 42930 96233 115238 84288 7399 189686 281646 87540 -78274 -52136 49111
9455 49111 112165 189640 155030 222612 339161 393604 422211 656030 638511 560175 475396
9444 475396 403366 388028 497383 528310 384245 61312 -293282 -375654 -184770 -152597 -126522
9433 -126522 -129803 -325444 -204858 -152274 -125919 -63664 129863 27850 -214048 -133807 67189
9422 67189 92834 -10289 -40092 -53786 -127081 -180338 -57539 12240 225435 260418 182827
9411 182827 125024 -59481 -215737 -138672 -212702 -235105 -149361 67918 198320 192787 117542
9400 117542 255648 365138 210257 78361 165171 187357 252351 248679 343604 281266 172616
9389 172616 182566 -68094 293076 301869 243618 128426 48321 27220 165417 239294 4306
9378 4306 -185190 -183017 17029 -107171 -105232 -101877 -163563 -219472 -264766 -299514 -232195 61785
9366 61785 256214 171258 1578 8636 162140 183159 95801 31371 147650 212576 84163
9355 84163 -70351 -179307 81173 24097 46738 62802 -192812 -390636 -457734 -365346 -318988
9344 -318988 -271261 23691 139253 70593 199019 372880 521657 578348 542391 130863
9334 130863 -159614 -121452 6318 -70592 9473 -102986 53160 133601 140972 167681 234847
9323 234847 218972 127572 276427 373346 298226 397060 379617 309947 366651 339556 219118
9312 219118 6828 -99143 98823 115107 -131172 -244146 -204942 -210946 -137244 113069 155742
9301 155742 231672 115632 -29529 -88091 -104057 -44731 -112234 117650 126738 197120 -48522
9290 -48522 -46908 -52985 36165 37949 207990 103869 90117 42116 120348 266037 535083 684363
9278 684363 566762 341573 629203 554408 306959 59651 -156229 -432838 -557122 -413764
9268 -413764 -185221 81613 103452 110292 75687 106053 -36874 -43425 61093 -126857 -213339
9257 -213339 -104865 24826 323376 270950 87219 116538 322533 312479 -10749 -232235
9247 -232235 -351132 -307483 -125355 -16491 -140278 -177553 -247342 -222689 -140921 -140641 -195339
9236 -195339 -246468 32568 264924 203563 87529 94523 303737 81186 207826 88935
9226 88935 252939 320387 94145 -7129 117478 131716 1645 10387 -107763 -106944 -301168
9215 -301168 -269418 -232159 -160064 -297068 -181777 -89422 -111864 -14143 167492 345109 226979
9204 226979 160356 194085 6327 -36911 -216427 -198929 -118838 -228239 -232544 -232395 -170835 56548
9192 56548 178783 403986 536792 119418 113150 297717 317784 146591 -108764 -355864
9182 -355864 -12173 48911 -61338 218318 123330 -3259 -45012 -43923 79804 358212 335602
9171 335602 179300 28727 99137 62743 -273954 -304214 -144925 -204151 215879 291135 343085
9160 343085 306178 179895 258095 324210 42492 -239947 -450601 -325859 -121291 48223
9150 48223 85101 -18757 24913 -680 -67540 124828 168204 63784 74550 -175602 -201610
9139 -201610 78772 11227 9792 82884 25230 -214604 -414116 -451815 -217915 -95633 -137272
9128 -137272 -170136 -82708 -202182 -191619 -38419 -23844 -119642 -270112 -336902 -201082 -283543
9117 -283543 -311943 -384960 -155537 11809 -108725 -164195 -288800 -204481 -163591 -217340 -207976
9106 -207976 65794 -152282 -131619 -51405 -118030 -226791 -166407 -66688 139741 5017 -166206
9095 -166206 -264188 -230182 -350853 -396639 -229317 -187379 -152725 -106821 -107691 -174859 54703
9084 54703 198455 -28115 -111254 -325132 -382744 -316816 -132379 106040 173257 -107560 -154101
9073 -154101 -22483 -73935 98229 263845 224713 7745 66166 156403 131356 204056 357002
9062 357002 318688 -171376 -106324 79838 64292 -106320 -135196 -267090 -157616 63292
9052 63292 -27265 -237633 -283605 -9279 -20869 -125038 -339075 -508398 -446470 -536120 -437249
9041 -437249 -162564 -215207 -356372 -275410 -99529 60841 72307 87306 49330 16692 -15872
9030 -15872 104941 83468 191891 157621 -3627 -117816 -18492 243008 269716 228861 232836
9019 232836 325590 95283 159379 -24283 -405291 -10229 310536 324678 138110 287130
9009 287130 371234 357870 293252 121041 -253317 -368686 -190708 -95394 20513 129189
8999 129189 101369 -119439 -207147 -135223 56175 297698 405531 333874 317704 14234 -89348
8988 -89348 -105647 40888 111006 151632 -105359 -239156 -8154 112414 61134 -42005 193533
8977 193533 562610 552562 466600 160752 78509 316909 401809 212357 378601 464037 513001
$$ [...]
##END NTUPLES=NMR SPECTRUM
##END=
