##TITLE=Analysis number 326966
Compound Code ac 35928
Project Code adrs
Chemist Name frontier sci
##JCAMPDX= 6.0         $$ Bruker NMR JCAMP-DX V2.0
##DATA TYPE= NMR SPECTRUM
##DATA CLASS= NTUPLES
##ORIGIN= Bruker BioSpin GmbH
##OWNER= nmr
$$ XWIN-NMR		Version 3.5
$$ Mon Mar  5 12:11:52 2007 GMT Standard Time (UT+0h)  MAYBRIDGE\nmr@NMR_250MHZ
##.OBSERVE FREQUENCY= 250.131544655141
##.OBSERVE NUCLEUS= ^1H
##.ACQUISITION MODE= SIMULTANEOUS (DQD)
##.ACQUISITION SCHEME= undefined
##.AVERAGES= 16
##.DIGITISER RES= 18
##SPECTROMETER/DATA SYSTEM= dpx250
##.PULSE SEQUENCE= zg30
##.SOLVENT NAME= DMSO
##.SHIFT REFERENCE= (INTERNAL, DMSO, 0, 16.522)
##AUDIT TRAIL= $$ (NUMBER, WHEN, WHO, WHERE, WHAT)
$$ ##TITLE= Audit trail, XWIN-NMR		Version 3.5
$$ ##JCAMPDX= 5.01
$$ ##ORIGIN= Bruker BioSpin GmbH
$$ ##OWNER= nmr
$$ C:\u/data/dgb/nmr/ADRS/250/pdata/1/auditp.txt
$$ ##AUDIT TRAIL=  $$ (NUMBER, WHEN, WHO, WHERE, WHAT)
(   1,<2007-03-05 12:11:27.67 +000>,<MAYBRIDGE\nmr>,<NMR_250MHZ>,
      <created by zg, POWCHK disabled, PULCHK disabled
       configuration hash MD5:
       49 4B E0 1D 92 C2 6B 37 9F E6 65 BC 52 41 86 1D
       data hash MD5: 64K
       4F 62 6A 1B 2F F3 D8 7F 2B 1C 08 45 52 2D 2C B1>)
(   2,<2007-03-05 12:11:41.56 +000>,<MAYBRIDGE\nmr>,<NMR_250MHZ>,
      <Start of raw data processing
       ef LB = 0.3 FT_mod = 6 PKNL = 1 SI = 32K 
       data hash MD5: 32K
       F5 10 1E 7D 73 96 DF EE 76 B5 2A 31 E8 EF 36 BE>)
(   3,<2007-03-05 12:11:43.53 +000>,<MAYBRIDGE\nmr>,<NMR_250MHZ>,
      <apk 
       data hash MD5: 32K
       CE 1A E2 EE 5A 50 7B F0 BB DD 1B C4 7C B5 C0 97>)
(   4,<2007-03-05 12:11:45.31 +000>,<MAYBRIDGE\nmr>,<NMR_250MHZ>,
      <abs ABSG = 5 
       data hash MD5: 32K
       42 AA 76 29 BF D7 E9 95 32 F3 B9 35 00 91 A9 C3>)
$$ ##END=
$$ 
$$ hash MD5
$$ 02 C7 69 F5 2D 0A E9 81 61 19 A9 A7 35 BB A3 26
##$RELAX= 
##$RELAX= 
##$RELAX= 
##$RELAX= 
##$RELAX= 
##$RELAX= 
##$RELAX= 
$$ Bruker specific parameters
$$ --------------------------
##$DU= <C:\u>
##$EXPNO= 250
##$NAME= <ADRS>
##$PROCNO= 1
##$TYPE= <nmr>
##$USER= <dgb>
##$AMP= (0..31)
100 100 100 100 100 100 100 100 100 100 100 100 100 100 100 100 100 100 
100 100 100 100 100 100 100 100 100 100 100 100 100 100 
##$AQSEQ= 0
##$AQ_mod= 3
##$AUNM= <au_zg>
##$AUTOPOS= <21 >
##$BF1= 250.13
##$BF2= 250.13
##$BF3= 250.13
##$BF4= 250.13
##$BF5= 500.13
##$BF6= 500.13
##$BF7= 500.13
##$BF8= 500.13
##$BYTORDA= 1
##$CFDGTYP= 0
##$CFRGTYP= 5
##$CHEMSTR= <none>
##$CNST= (0..31)
1 1 145 1 1 1 1 1 1 1 1 1 1 1 1 1 1 1 1 1 1 1 1 1 1 1 1 1 1 1 1 1 
##$CPDPRG= <>
##$CPDPRG1= <>
##$CPDPRG2= <>
##$CPDPRG3= <>
##$CPDPRG4= <mlev>
##$CPDPRG5= <mlev>
##$CPDPRG6= <mlev>
##$CPDPRG7= <mlev>
##$CPDPRG8= <mlev>
##$CPDPRGB= <>
##$CPDPRGT= <>
##$D= (0..31)
0 1 0 0 0 0 0 0 0 0.06 0 0 0 0 0 0 0.0002 0 0 0 0 0 0 0 0 0 0 0 0 0 0 
0 
##$DATE= 1173096685
##$DBL= (0..7)
120 120 120 120 120 120 120 120 
##$DBP= (0..7)
150 150 150 150 150 150 150 150 
##$DBP07= 0
##$DBPNAM0= <>
##$DBPNAM1= <>
##$DBPNAM2= <>
$$ [...]
##$SUBNAM7= <"">
##$SUBNAM8= <"">
##$SUBNAM9= <"">
##$SW= 20.6930455092707
##$SWIBOX= (0..15)
0 0 3 0 0 0 0 0 0 0 0 0 0 0 0 0 
##$SW_h= 5175.983436853
##$TD= 65536
##$TD0= 1
##$TE= 295.16
##$TE2= 300
##$TE3= 300
##$TEG= 300
##$TL= (0..7)
0 120 120 120 120 120 120 120 
##$TP= (0..7)
150 150 150 150 150 150 150 150 
##$TP07= 0
##$TPNAME0= <>
##$TPNAME1= <>
##$TPNAME2= <>
##$TPNAME3= <>
##$TPNAME4= <>
##$TPNAME5= <>
##$TPNAME6= <>
##$TPNAME7= <>
##$TPOAL= (0..7)
0.5 0.5 0.5 0.5 0.5 0.5 0.5 0.5 
##$TPOFFS= (0..7)
0 0 0 0 0 0 0 0 
##$TUNHIN= 0
##$TUNHOUT= 0
##$TUNXOUT= 0
##$USERA1= <user>
##$USERA2= <user>
##$USERA3= <user>
##$USERA4= <user>
##$USERA5= <user>
##$V9= 5
##$VALIST= <valist>
##$VCLIST= <CCCCCCCCCCCCCCC>
##$VD= 0
##$VDLIST= <DDDDDDDDDDDDDDD>
##$VPLIST= <PPPPPPPPPPPPPPP>
##$VTLIST= <TTTTTTTTTTTTTTT>
##$WBST= 1024
##$WBSW= 4
##$XGAIN= (0..3)
0 0 0 0 
##$XL= 0
##$YL= 0
##$YMAX_a= 449831
##$YMIN_a= -370795
##$ZGOPTNS= <>
##$ZL1= 120
##$ZL2= 120
##$ZL3= 120
##$ZL4= 120
##$ABSF1= 16.522
##$ABSF2= -4.171173
##$ABSG= 5
##$ABSL= 3
##$ALPHA= 0
##$AQORDER= 0
##$ASSFAC= 0
##$ASSFACI= 0
##$ASSFACX= 0
##$ASSWID= 0
##$AUNMP= <proc_1d>
##$AZFE= 0.1
##$AZFW= 0.1
##$BCFW= 0
##$BC_mod= 0
##$BYTORDP= 0
##$COROFFS= 0
##$CY= 12.5
##$DATMOD= 1
##$DC= 0
##$DFILT= <>
##$DTYPP= 0
##$F1P= 14.0000005364418
##$F2P= -0.99999901652339
##$FCOR= 0.5
##$FTSIZE= 32768
##$FT_mod= 6
##$GAMMA= 0
##$GB= 0
##$INTBC= 1
##$INTSCL= 1
##$ISEN= 128
##$LB= 0.3
##$LEV0= 0
##$LPBIN= 0
##$MAXI= 10000
##$MC2= 0
##$MEAN= 0
##$ME_mod= 0
##$MI= 0
##$NCOEF= 0
##$NC_proc= -4
##$NLEV= 6
##$NOISF1= 0
##$NOISF2= 0
##$NSP= 0
##$NTH_PI= 0
##$NZP= 0
##$OFFSET= 16.522
##$PC= 1
##$PHC0= 212.8146
##$PHC1= 10.40499
##$PH_mod= 1
##$PKNL= yes
##$PPARMOD= 0
##$PSCAL= 4
##$PSIGN= 0
##$REVERSE= no
##$SF= 250.13
##$SI= 32768
##$SIGF1= 0
##$SIGF2= 0
##$SINO= 400
##$SIOLD= 32768
##$SREGLST= <1H.DMSO>
##$SSB= 0
##$STSI= 32768
##$STSR= 0
##$SW_p= 5175.98343685301
##$SYMM= 0
##$S_DEV= 0
##$TDeff= 65536
##$TDoff= 0
##$TI= <Analysis number 999999
Compound Code 99
Book Reference 9
Project Code 9>
##$TILT= no
##$TM1= 0
##$TM2= 0
##$TOPLEV= 0
##$USERP1= <user>
##$USERP2= <user>
##$USERP3= <user>
##$USERP4= <user>
##$USERP5= <user>
##$WDW= 1
##$XDIM= 32768
##$YMAX_p= 371400144
##$YMIN_p= -222027
$$ End of Bruker specific parameters
$$ ---------------------------------
##NTUPLES= NMR SPECTRUM
##VAR_NAME=  FREQUENCY,     SPECTRUM/REAL,   SPECTRUM/IMAG
##SYMBOL=    X,             R,               I
##VAR_TYPE=  INDEPENDENT,   DEPENDENT,       DEPENDENT
##VAR_FORM=  AFFN,          ASDF,            ASDF
##VAR_DIM=   32768,         32768,           32768
##UNITS=     HZ,            ARBITRARY UNITS, ARBITRARY UNITS
##FACTOR=    0.157963299565203, 1,           1
##FIRST=     4132.6476996994, 0,             0
##LAST=      -1043.33573715361, 0,           0
##MIN=       -1043.33573715361, -222027,     0
##MAX=       4132.6476996994, 371400144,     0
$$ Real data points
##PAGE= N=1
##DATA TABLE= (X++(R..R)), XYDATA
$$ [...]
15826D0252L2808l5583r7333l433M6700K7083Q183J071K929K7224j4695n6909
15814b1703j0895K7934O3190L9083l296j08401j096L459m7684L849K5335M2377
15802A2152J4394k0099l7565O58N7586n884p5800N496L3474J3330P028j1404k9272
15789c5906j5574L1050K1880k7842J179J2440j4303o4277N185J7467M375M4221
15777b0105J7564m2590j2201q925j0941k8258M1230N8766J423j3188j1376P805
15765b0796J8848n946j0941l6387k6694j3933j9902k1542R2297J0172J1019K3759
15753d6l8401k8088n4107l2037N780P5765L5251k3793o283L6991J4569k9120J0506
15740c3013k5597K2671K3343L7024K335J394j4179l5934j4876j0091m6883j558
$$ plain form
15826 40252 73060 37477 -59856 -63289 -16589 10494 18677 19748 22677 49901 35206 -21703
15814 -21703 -32598 -4664 58526 97609 94313 -14088 -15184 -11725 -59409 -55560 -30225 12152
15802 12152 26546 6447 -31118 -30460 27126 21242 -54558 -49062 -15588 -2258 4770 -6634 -35906
15789 -35906 -51480 -20430 1450 -26392 -25213 -12773 -27076 -91353 -86168 -68701 -64326 -20105
15777 -20105 -2541 -45131 -57332 -66257 -77198 -105456 -64226 -5460 -4037 -17225 -28601 -20796
15765 -20796 -1948 -7894 -18835 -55222 -81916 -95849 -115751 -137293 -44996 -34824 -23805 -46
15753 -46 -38447 -66535 -120642 -152679 -146899 -71134 -35883 -59676 -65959 -28968 -14399 -43519 -33013
15740 -33013 -58610 -35939 -12596 24428 26763 28157 13978 -21956 -36832 -46923 -93806 -95364
15728i5364l6811M388L5243j6774j1759M3180Q9749P4536J3750j9634j2841j5443
15716E2220p5380l5614L9320m036Q34L1001j1432n0707l9742J8954l249m238m32
15703h2501R408J8833K1588K3744k3729k8857k7136J2673K3569J5505m687p116
15691d8706j3552J2014k3054l4634j3796K5412J9828m995J2788O796j0207k7745
15679i9851J1064K9214n170L7240j909n030M3082N2863k574l7636L449o1151l8565
15666g4974L1638P7866J3919k0022K2470L8056m4909o2435m5448j0134j0071J5591
15654f8453L4403k9481R804n0525k4380N4704K2240p897J1343J4975j3363K3313
15642b3317J1715k9328l026j3591n7067L667O4752O505j4198N7320j7776o3400
$$ plain form
15728 -95364 -132175 -127787 -92544 -109318 -121077 -77897 11852 86388 100138 80504 67663 52220
15716 52220 -23160 -58774 -19454 -23490 -22656 8345 -3087 -53794 -93536 -74582 -77831 -82069 -82501
15703 -82501 -73093 -54260 -32672 -8928 -32657 -61514 -88650 -75977 -52408 -36903 -41590 -48706
15691 -48706 -62258 -50244 -73298 -107932 -121728 -96316 -76488 -81483 -68695 -61899 -72106 -99851
15679 -99851 -88787 -59573 -64743 -27503 -29412 -34442 8640 61503 58929 21293 24742 -36409 -74974
15666 -74974 -43336 34530 48449 28427 50897 88953 44044 -18391 -63839 -73973 -84044 -68453
15654 -68453 -34050 -63531 -53727 -104252 -128632 -73928 -51688 -59585 -48242 -33267 -46630 -23317
15642 -23317 -11602 -40930 -43956 -57547 -114614 -110947 -46195 -39690 -53888 3432 -14344 -77744
15630g7744M7281K8961K186L3476k1590o4902J365J7926j8213J3307M4150j9319
15618a3116n8443k6418K4676J4773J0207M0977J5485n5749k7188N664O4637j538
15606f033K677m6033N6891J7206j8671l7980j2984q718K5266m2076m7630M8148
15594f9937L0200j8004l638j5339N864J0064j5412m0819J0183L3614M8335L5087
15582A0198N772K2874K3171M098R558m7265j9611o5352Q854N6481M1573J8112
15570F8463m0398n5431o086j1710k8276K2298N7329L130n4895l6381Q915O9997
15558c045Q329k3455k4151j4627K0381J4182l0385K6299p00J5530K1233j9186
15546i595K3366J6395p1763o5183J197L0123o2k3857k709N8455M5376k1278K157
$$ plain form
15630 -77744 -30463 -1502 684 34160 12570 -52332 -50967 -33041 -51254 -37947 6203 -13116
15618 -13116 -71559 -97977 -73301 -58528 -48321 -7344 8141 -47608 -74796 -69132 -4495 -6033
15606 -6033 -3356 -49389 7502 24708 6037 -31943 -44927 -53645 -28379 -70455 -118085 -69937
15594 -69937 -39737 -57741 -61379 -76718 -70854 -60790 -76202 -117021 -106838 -73224 -24889 10198
15582 10198 15970 38844 62015 66113 75671 28406 8795 -56557 -47703 8778 50351 68463
15570 68463 28065 -27366 -33452 -45162 -73438 -51140 6189 9319 -45576 -81957 -73042 -3045
15558 -3045 5284 -18171 -42322 -56949 -36568 -22386 -52771 -26472 -27172 -11642 9591 -9595
15546 -9595 13771 30166 -41597 -106780 -105583 -75460 -75522 -99379 -102088 -43633 1743 -19535 -17378
15533a7378l7500j7874L3057l1197j4576k9205p2070K7851O6033K203N4553N8309
15521B2206j7853n6880j2119K7725K1547k7733K645R990m4908P328M6497L888
15509a7667K0928m4795L2293j747M0158L430n18k2834k3574J3365m1205l6600
15497g8766L1725M9776J8657j0406j0178l2585r495q694O307J6947M3283P630
15485B4201j6442j0778J1847j9392q247J3297N741m1068j7809L826j3149j1508
15473g9481O1199p971l6234q543L3523L6118K719j1958p6264L1959Q0811n6933
15461c1055l3866M0714J9084K7298j1098J8082j439k3886o3607N083l934J5459
15449d3165O1663o019o7421P662K6305n5715l9625L374L285L2853J6169k7309
$$ plain form
15533 -17378 -54878 -72752 -39695 -70892 -85468 -114673 -186743 -158892 -92859 -90656 -36103 22206
15521 22206 4353 -52527 -64646 -36921 -15374 -43107 -40462 -30472 -75380 -68052 -21555 -17667
15509 -17667 3261 -41534 -9241 -10988 29170 32600 32082 9248 -14326 -961 -42166 -78766
15497 -78766 -47041 2735 21392 10986 808 -31777 -41272 -49966 -43659 -26712 16571 24201
15485 24201 7759 -3019 8828 -10564 -18811 -5514 227 -40841 -58650 -54824 -67973 -79481
15473 -79481 -18282 -26253 -62487 -71030 -37507 -1389 1330 -10628 -86892 -54933 25878 -31055
15461 -31055 -64921 -24207 -5123 22175 11077 29159 27720 3834 -59773 -54690 -58624 -43165
15449 -43165 18498 12479 -54942 -47280 -20975 -76690 -116315 -112941 -109656 -76803 -60634 -87943
15437h7943m0030k2803r390J4249N1164N2934K2483J3303K8480L6713o9171q3964
15425i3975q2436M0575N80k9542L3378M4023K5113k8108j9852J5056P3042J7576
15413d570j6134m4727k5650j0369K892r478N459k6650J494K3326Q6612m8763p3779
15400a40337M315R8110P1326K8389Q251L8991k7800p1329l8667J40j1389K7597
15388a2403L4913k9366Q200l3762p7229q675P0740q497p24l096q211l1208k1642
15375a20960J6592J274J8876m0872l9629N7060K1606p75k0634K4229J9981k1377
15363h4629J7300K5533J331k3895J6029L802L442K8658o1788r563O0390K0285
15351c105n6806O371N7829N2663l0390p539j04644m9057N7895J8962K0000K9942
$$ plain form
15437 -87943 -127973 -150776 -160166 -145917 -94753 -41819 -19336 -6033 22447 59160 -10011 -93975
15425 -93975 -176411 -135836 -135256 -164798 -131420 -87397 -62284 -90392 -110244 -95188 -22146 -4570
15413 -4570 -20704 -65431 -91081 -101450 -98558 -108036 -102577 -129227 -127733 -104407 -17795 -66558 -140337
15400 -140337 -136022 -37912 33414 61803 70054 109045 81245 9916 -28751 -28611 -40000 -12403
15388 -12403 22510 -6856 1344 -32418 -109647 -118322 -47582 -56079 -56803 -59899 -68110 -99318 -120960
15375 -120960 -104368 -103094 -84218 -125090 -164719 -107659 -86053 -86828 -107462 -83233 -63252 -84629
15363 -84629 -67329 -41796 -40465 -64360 -48331 -44529 -41087 -12429 -74217 -83780 -23390 -3105
15351 -3105 -59911 -53540 4289 56952 26562 19023 -85621 -134678 -76783 -57821 -37821 -7879
15339g879K1804O932n0958O802J4401m2314m8057j8267k785n044r16M4490N88
15326h1203J9189M1376j5361n5264J3387R4224l3007k7891R102L4564m650j4339
15314a9873m7571M7260q644k3402k5169q998R750M8314K3229j9795K4911j3651
15302a3639J7009J3525M1207l7534o2759L548M5200j3090k1596n763J0654j705
15290b4943J9679J4239n0776j0093k8524L6473M1841m6403l5259L7833K0693k8501
15278e3741q838K8157K813j1624J903J8159n1160k8973M850m1218L8752L5745
15266f5175Q46J6096N8728k582l7000M6955L3693k860l4015j4012p484l5527J8754
15253b3583K5326R584m814o294n8436q145K5613j1855M7978L4375l6749o132P147
$$ plain form
15339 -7879 13925 20857 -30101 -23299 -8898 -51212 -99269 -117536 -120321 -125365 -126281 -81791 -81203
15326 -81203 -62014 -20638 -35999 -91263 -77876 16348 -16659 -44550 -35448 -884 -5534 -19873
15314 -19873 -67444 -20184 -28828 -52230 -77399 -86397 -76647 -28333 -5104 -24899 12 -13639
15302 -13639 3370 16895 58102 20568 -42191 -38643 6557 -6533 -28129 -33892 -23238 -24943
15290 -24943 -5264 8975 -41801 -51894 -80418 -43945 -2104 -48507 -83766 -45933 -25240 -53741
15278 -53741 -62579 -34422 -31609 -43233 -41330 -23171 -74331 -103304 -98454 -139672 -100920 -65175
15266 -65175 -64329 -48233 10495 7913 -29087 17868 51561 48701 14686 674 -6810 -42337 -23583
15253 -23583 1743 11327 6513 219 -58217 -66362 -40749 -52604 -4626 29749 -7000 -13132 -5985
15240e985J6395j967m0134l3901q948P544M5204m7440l4382J697k925O1081L7420
15227f341K5474N0716n074J3876o5546k7460R398n502j3092n5066K3854n217l0126
15214i0106k586M4012O509o828r690K2705J2938J1314M6238J6173m0849k884K1831
15201B8777p5246m0080r045J8206j1015k761K7331N1571L0806j7282j7996j2722
15189b9456m1220N5781P301l7712K2074J9231n228k0384n538j1845K6204M7489
15177B6697L2664O109n3561n3693j6598j86M7145L2218k0841p126R098j5843j1868
15164b5785k5987L9602P542k8119l504K1872K6628k4297l0718j6647j8858M2945
15152c5326N3180o452p2665l0858j5751K0757J3379L1795K7839k0865L696O826
$$ plain form
15240 -5985 10410 8443 -31691 -65592 -74540 -66996 -21792 -69232 -103614 -101917 -104842 -43761 -6341
15227 -6341 19133 69849 64775 78651 13105 -14355 -4957 -10459 -23551 -78617 -54763 -59980 -90106
15214 -90106 -92692 -48680 -42171 -48999 -58689 -35984 -23046 -11732 34506 50679 9830 6946 28777
15201 28777 -46469 -86549 -95594 -77388 -88403 -91164 -63833 -12262 18544 1262 -16734 -29456
15189 -29456 -70676 -14895 -7594 -45306 -23232 -4001 -9229 -29613 -35151 -46996 -20792 26697
15177 26697 59361 65470 11909 -41784 -58382 -58568 -11423 20795 -46 -7172 1926 -13917 -25785
15164 -25785 -51772 -12170 -4628 -32747 -36251 -14379 12249 -12048 -42766 -59413 -78271 -35326
15152 -35326 17854 11402 -61263 -92121 -107872 -87115 -73736 -41941 -14102 -34967 -31271 -24445
15140b4445j6795l4934j2818R936Q422j2534m6048K7994P1949o798J3641m1380
15128f3810k4550L6905N6291M1881O736o0158n8417K1185j9060l4779L0822K0078
15116d6876N9227J5754k7094K3714j1085k0653n6161m3375J4503N1957k3970j0748
15104g4807O1190M4275K7337L9298j5206j799m0132k5495j0793M6941M1912K4655
15092A17376k9515j2198O022j8376p4165j5198o214Q566k2819J9681M5583r998
15080H745N243Q668r71m0252k2492m2233l9928o63p697j1335j6630J3908K0267
15067a25370Q261J204J5370K8890M7679L6624K7716n1928l4821r157J0169k7514
15055g2877m869L6656O2205J5484k0951k9911m301J6591j4821k6065j6987K5886
$$ plain form
15140 -24445 -41240 -76174 -88992 -79056 -70634 -83168 -129216 -101222 -29273 -36071 -22430 -63810
15128 -63810 -88360 -51455 4836 46717 53453 -6705 -65122 -43937 -62997 -97776 -66954 -46876
15116 -46876 12351 28105 1011 24725 13640 -7013 -63174 -106549 -92046 -40089 -64059 -74807
15104 -74807 -13617 30658 57995 97293 82087 80288 40156 14661 3868 50809 92721 117376
15092 117376 87861 75663 81685 63309 -10856 -26054 -32268 -23702 -46521 -26840 18743 8745
15080 8745 13988 22656 21685 -18567 -41059 -83292 -123220 -123883 -131580 -142915 -159545 -145637 -125370
15067 -125370 -117109 -115905 -100535 -71645 -23966 12658 40374 -11554 -46375 -55532 -45363 -72877
15055 -72877 -77746 -41090 21115 36599 15648 -14263 -18564 -1973 -16794 -42859 -59846 -33960
15043c3960j8357K2128M91O344k5554q6569n512k4379M5413K4485l610L5148R176
15030e4756j3855P8433R4068l894m7946q4826j1271M6841j6299k7025j9052J7516
15018d2066j0942K5082j9140j3478N1932j2423o2202k9282K9085k5529M4337q238
15006g2864p2092o1183J8120P560L2447K9437J5874k0656O3342N7699L3380j1034
14994B0030l9410k4750J890L5884Q64k1593j3414k3376j3204m1031N0329R310
14982e8471K7566J4712k8810k3330J5543j389N4389O3362j5913n5749l0266l12
14970c8668J0501k6709J6657M4829J0501l1404o0356O140M0650K2662M9729j3574
14958C0958k8664n633J7298K8264j8095J623J0399k5085p4432l558M8188Q7649
$$ plain form
15043 -33960 -52317 -30189 -29698 -23354 -48908 -135477 -140989 -165368 -119955 -95470 -99080 -63932 -54756
15030 -54756 -68611 9822 103890 99996 52050 -32776 -44047 2794 -13505 -40530 -59582 -42066
15018 -42066 -53008 -27926 -47066 -60544 -8612 -21035 -83237 -112519 -83434 -108963 -64626 -72864
15006 -72864 -144956 -206139 -188019 -180459 -148012 -118575 -102701 -123357 -60015 -2316 31064 20030
14994 20030 -19380 -44130 -42240 -6356 -5492 -27085 -40499 -63875 -77079 -118110 -67781 -58471
14982 -58471 -30905 -16193 -45003 -68333 -52790 -54179 210 63572 47659 -8090 -38356 -38668
14970 -38668 -28167 -54876 -38219 6610 17111 -14293 -74649 -68509 -27859 -5197 44532 30958
14958 30958 2294 -3339 13959 42223 24128 25751 36150 11065 -63367 -66925 -18737 68912
14946F8912j0897m5142l311o607l2904l2953m3288l3039K6417j44m633Q0579L6716
14933b94L1898j4056j103J6627k9440o2152p5072J7960M336L3220M5148M5273
14921A2345k6795K3501J3719m543k4484K6987M1983j9228r428j7141N5727n6601
14909A6042m3018m7334m8200J571O6744K4013j1077L23R884k8303j8355j0256
14897h7966k7288j476M5755M1260m586k4495K3883R832j2650l9944q1767N5564
14885a03878O1374L2886K746m032k9852j4235L2111j6244q3579j535L0566J0626
14873h3046N011M2825K9866o252K4526k2393p2410k6473M5489N6980O734m3621
14861d2764k9900m6881L7209N5025l6780l6797J3147L0763Q662J00273J1094p1602
$$ plain form
14946 68912 58015 12873 9562 2955 -29949 -62902 -106190 -139229 -112812 -112956 -117589 -37010 -294
14933 -294 31604 17548 16445 33072 3632 -58520 -133592 -115632 -111296 -78076 -32928 12345
14921 12345 -14450 9051 22770 18227 -6257 20730 62713 43485 34057 16916 72643 16042
14909 16042 -26976 -74310 -122510 -120939 -54195 -30182 -41259 -40936 -31052 -59355 -77710 -87966
14897 -87966 -115254 -116730 -70975 -29715 -34301 -58796 -34913 -25081 -37731 -77675 -159442 -103878
14885 -103878 -42504 -9618 -6872 -10904 -40756 -54991 -22880 -39124 -122703 -124238 -93672 -83046
14873 -83046 -78035 -35210 -5344 -11596 12930 -9463 -81873 -108346 -62857 -5877 857 -42764
14861 -42764 -72664 -119545 -82336 -27311 -64091 -100888 -87741 -56978 -48316 51957 63051 -8551
14849h551m0694o422K4616k5147K4482J2939J6079K0173j994O851R247k9436O47
14836B790K469K4107p7055o2573P248K6233K8525K2395p204N182M100J5883r937
14823a7837L0767k4650j5579r910j1052j6309l89J2341J4429K3493M9721P476
14811D2501l774J1109q409n4436k1670K5035L2830k8580p6L5580M694j6063m6566
14798b7825m320p09l6331j5198j5386Q0760J7703J5453M8132K8095o2909l3128
14786e663L4364M8456J4557o9305j7343K5137J1646L5962J653J3609m7986p9218
14774c4131m0664M830K0067k2907m0310k535P1760N4156m9111k6655k7775k0864
14762a14139p11Q198J0611O3455K7166n2769N932m0885l1764L8048M0031M9134
$$ plain form
14849 -8551 -49245 -55667 -31051 -56198 -31716 -18777 -2698 17475 15481 22332 31579 2143 2790
14836 2790 5259 29366 -47689 -110262 -103014 -76781 -48256 -25861 -33065 -27883 -23783 -7900 -17837
14823 -17837 12930 -11720 -27299 -37209 -48261 -64570 -64959 -52618 -38189 -14696 35025 42501
14811 42501 38727 49836 41427 -13009 -34679 -9644 23186 -5394 -5470 30110 34804 18741 -27825
14798 -27825 -32145 -32854 -69185 -84383 -99769 -19009 -1306 14147 62279 90374 27465 -5663
14786 -5663 28701 77157 91714 22409 5066 30203 41849 77811 79464 93073 45087 -34131
14774 -34131 -74795 -69965 -49898 -72805 -113115 -115650 -43890 10266 -38845 -65500 -93275 -114139
14762 -114139 -114850 -106652 -96041 -32586 -5420 -58189 -52257 -93142 -124906 -86858 -46827 2307
14750B307K4130p809r2019n8676J9979n1360k3660K3018M0542K2031j9196K8388
14738i2325Q2467J03885l506p0751j2236K2626K7784Q29m1308j7884j9851k5685
14726d5955M5037j824n9678p2821N251K6846l683q740K0003K7739J5909j77k6726
14713g8819K6266K0354l429k9198j1362q101j2778O7580o299j0169k5419j500
14701g2874L6627K6763j6487O9254L9964j3835n4665M450j9291p960O467k3715
14689b5302r2115l076O6606M3527J8144j3984j5800j7773r2647n6831O7828O9832
14677e1591l360J2026K6303j1638K95j2869J1005K2671m7415j2748k2125o320
14665i5766M8914L4305l5305J9270K9909N2706J0855n5691l9630L8574O170k2139
$$ plain form
14750 2307 26437 18628 -73391 -132067 -112088 -163448 -187108 -164090 -123548 -101517 -120713 -92325
14738 -92325 -9858 94027 90521 19770 7534 30160 57944 58773 17465 -419 -20270 -45955
14726 -45955 -918 -2742 -62420 -135241 -129990 -103144 -106827 -115567 -95564 -67825 -51916 -52093 -78819
14713 -78819 -52553 -32199 -35628 -64826 -76188 -84289 -97067 -29487 -35786 -45955 -71374 -72874
14701 -72874 -36247 -9484 -25971 43283 83247 69412 14747 19197 -94 -8054 -1587 -25302
14689 -25302 -117417 -120493 -53887 -10360 7784 -6200 -22000 -39773 -132420 -189251 -121423 -51591
14677 -51591 -54951 -42925 -16622 -28260 -27965 -40834 -29829 -7158 -54573 -67321 -89446 -95766
14665 -95766 -46852 -12547 -47852 -28582 1327 54033 64888 9197 -30433 8141 14311 -7828
14653g828j5083r715k997L636J7286K7883L2204L028K370j3578k2632m9033n3495
14640h7954M6250L3327j9678l4783K8982k4673L980K1474l3901O62J0471K6083
14628b9760k381j1856L2424J8415J515L8125J9742l2877n9910q656J4973O456
14616a3790L5809O0511J2212k7847l3647p275m8315L6254K0946k1121J8141n1382
14604a9504n655M6006l2739n1993k0499j3596Q1860L4151Q859m1922n0189k5811
14592i1032M546L0970O1537k4639N0366j050m3412m4891K5839n397k1601j6406
14580g5170P136L9918l9324j1124R844K0183M9505Q929r0207k8063N8692P7627
14568B7946R368q0220k8007k5249N6122P9820J3789m8507n3269j2914M8005P905
$$ plain form
14653 -7828 -22911 -32626 -35623 -31987 -14701 13182 45386 48414 50784 37206 14574 -34459 -87954
14640 -87954 -41704 -8377 -28055 -62838 -33856 -58529 -54549 -33075 -66976 -66314 -55843 -29760
14628 -29760 -32141 -43997 -11573 6842 8357 46482 66224 33347 -26563 -35219 -20246 -13790
14616 -13790 22019 82530 94742 66895 33248 25973 -22342 13912 34858 13737 31878 -19504
14604 -19504 -25159 20847 -11892 -63885 -84384 -97980 -16120 18031 26890 -15032 -65221 -91032
14592 -91032 -86486 -55516 6021 -18618 31748 30698 -12714 -57605 -31766 -37163 -58764 -75170
14580 -75170 -68034 -28116 -67440 -78564 -68720 -48537 968 9897 -80310 -108373 -49681 27946
14568 27946 37314 -42906 -70913 -96162 -40040 39780 53569 5062 -48207 -61121 -13116 -5211
14556e211k3879k7878J3272K5618J0420o0093J1491O989k2586K2925L6975n136
14544a7093k7299k8834L0862N3405K6461M7949o114M5129j8018o6534q0202M1732
14532A444J9742k4935P561J7899K1591K1158j6028o2789k2727J0374M5834j5388
14520C736l6026r114k9830K2922Q945n701O1954M8185j4618k6285k2626L6900
14508C8442O597P537o9506K0863j5002m6335j5283L5830L2598K5778p858p5123
14496f1462j7543N8109L9788o5601l5821L1109o223k6478M6477N4205l4846k1504
14484c9790j0979j6782J5902M7930r3746m2533O3221K0775l101O958K2649K2705
14472f791M4991K5307K0450n3487l6592l3811j0578j2978l7713k3951N2039L6216
$$ plain form
14556 -5211 -29090 -56968 -43696 -18078 -7658 -67751 -56260 -49271 -71857 -48932 -11957 -17093
14544 -17093 -44392 -73226 -42364 11041 37502 85451 79337 124466 106448 39914 -40288 1444
14532 1444 21186 -3749 3812 21711 43302 64460 48432 -14357 -37084 -26710 19124 3736
14520 3736 -32290 -41404 -71234 -48312 -39367 -45068 16886 65071 50453 24168 1542 38442
14508 38442 45039 52576 -16930 3933 -11069 -57404 -72687 -36857 -4259 21519 13661 -61462
14496 -61462 -79005 -20896 18892 -46709 -82530 -51421 -57644 -84122 -37645 16560 -18286 -39790
14484 -39790 -50769 -67551 -51649 -3719 -97465 -139998 -76777 -56002 -59103 -52145 -29496 -6791
14472 -6791 38200 63507 83957 30470 -6122 -39933 -50511 -63489 -101202 -125153 -73114 -36898
14460c6898J4653l4155l1950J3875M0533k301L7566N3614L2644P732K2190n2957
14448F4546n3601L289J4223k0993l8960j239l5581K4843M1045r077m2386j3599
14436f7490L0375m400l4082r727K1009M6272q987j3075K9335M9513O7480j9973
14424H6250n0451m8720P949n2781q6410L1065Q2586M4161L552j7453o2015m3943
14412a06210J9075L5615P240P758L643N5835j205o2118K2932O076q309J7911j8865
14399b0622J0627J0522o6687j010M7223M7165N2886J4745j8626j7578j2938P1358
14387A17065K2276p1924n4172K0971K8186k9613m3730n1573R68M2274M0111k0534
14375C05k6563o8250j9492L2190j7113O798M9182j504j3598j4755k9438K5600
$$ plain form
14460 -36898 -22245 -56400 -88350 -74475 -33942 -36243 1323 54937 87581 95313 117503 64546
14448 64546 10945 14234 28457 7464 -31496 -32735 -68316 -43473 -2428 -11505 -53891 -67490
14436 -67490 -37115 -41515 -75597 -85324 -64315 -18043 -27030 -40105 -10770 38743 106223 86250
14424 86250 35799 -12921 -4972 -57753 -144163 -113098 -30512 13649 17201 -252 -62267 -106210
14412 -106210 -87135 -51520 -44280 -36522 -32879 22956 21751 -40367 -17435 -11359 -19668 -1757 -20622
14399 -20622 -9995 527 -66160 -67170 -19947 27218 80104 94849 76223 58645 45707 117065
14387 117065 139341 67417 13245 34216 62402 32789 -10941 -62514 -61546 -19272 20839 305
14375 305 -26258 -94508 -114000 -81810 -98923 -92125 -42943 -44447 -58045 -72800 -102238 -76638
14363g6638K6388l6335O2974M3396l8049m7688J0207L2503l7343j8502o848j1879
14351i7814L757O9217N5186j9936R099K7374l1577K7490L7760n282o6293o8097
14339e9116L028J0577M2215N676k6463J0092M0136N3603k588m7757m3901k4063
14327c8561O223K6890Q4536j5611l4038k104k8670L6797M032j1759m0619m6512
14315e9396L0512K4715l0524M761m250K3817k411k951L29R498m6933n2215L5257
14302f9791J3214m628K2771n4168m9436L4611K2541m918R595k1332J8496L4054
14290d8991L884J6690O026L265j5473N889K8504l824k7535K1245j0562J2533j6527
14277b4876o940j4093L916L2880k9135m5643M1688P3754j7215k8487k3969m1913
$$ plain form
14363 -76638 -50250 -86585 -23611 19785 -18264 -65952 -55745 -23242 -60585 -79087 -85935 -97814
14351 -97814 -94057 -24840 30346 10410 19509 46883 15306 42796 80556 75274 8981 -59116
14339 -59116 -56088 -45511 -3296 2380 -24083 -13991 26145 79748 77160 29403 -14498 -38561
14327 -38561 -32338 -5448 79088 63477 29439 27335 -1335 35462 39494 27735 -12884 -59396
14315 -59396 -28884 -4169 -34693 -29932 -34182 -10365 -12776 -15727 -15398 -5900 -52833 -105048 -69791
14302 -69791 -56577 -61205 -38434 -92602 -142038 -107427 -84886 -89804 -80209 -101541 -83045 -48991
14290 -48991 -45107 -28417 -22391 -19126 -34599 -28710 -206 -4030 -31565 -10320 -20882 -8349 -24876
14277 -24876 -31816 -45909 -41993 -9113 -38248 -83891 -42203 31551 14336 -14151 -38120 -80033
14265h0033K7553O5311K9061j7428r203j9545K9198k9968l1881K7863J7908j0030
14253a194L3272j4113R810K7717m854j30P662j9939j951o543J800q380k0131J3497
14239A6523l8938L019Q109K6892L0831o3848l3450R15k8301k715k0939m467M5452
14226f0917M7903o181j3136O627j0959m9243J4158K6975k8435R30j8645k8153
14214a19076j0392K9210K5094M4333L0490j2766K6259k1108N405m0789m0106m5700
14202a29146J5328L5098L6858L884j6735l3597j7716P8476j821m1209j8262M6677
14190d2165M5416j1165l3157O5208K3161m2254j0006J869K5765L4229l1336m0354
14178a4789k7392J1611K2886m2854j0666m34J2482Q5240L8682l5726m8056j3995
$$ plain form
14265 -80033 -52480 12831 41892 24464 15261 -4284 24914 -5054 -36935 -9072 8836 -1194
14253 -1194 32078 17965 27775 55492 50638 50508 58170 38231 36280 29737 31537 23157 3026 16523
14239 16523 -22415 -19396 -11287 15605 46436 -17412 -50862 -49947 -78248 -80963 -101902 -106369 -60917
14226 -60917 -13014 -19195 -32331 -25704 -36663 -85906 -71748 -44773 -73208 -72278 -90923 -119076
14214 -119076 -129468 -100258 -75164 -30831 -341 -13107 13152 -7956 -2551 -43340 -83446 -129146
14202 -129146 -113818 -78720 -41862 -37978 -54713 -88310 -106026 -27550 -29371 -70580 -88842 -42165
14190 -42165 3251 -7914 -41071 24137 47298 5044 -4962 -3093 22672 56901 25565 -14789
14178 -14789 -42181 -30570 -7684 -50538 -61204 -61638 -49156 36084 74766 39040 -9016 -23011
14166b3011L4800J0655J9747n5047j0597J2040J5523o8975n3598J1639n000j5836
14154a27660J3131M2687J0474K9884L4150L0668N9712n9609n6772J5330k9100
14143c7105m5118K0098j4026K6686L6939j3148k7805J0759j5138J5143L0515L6110
14131B3910J2207K3028K9329l5523r250p0173Q340P6756K1172n3084k0567n5583
14119d9438J6341Q9063J2782n6173k3023j0108J185m1510J0336K3999L0016M4409
14107D7879O41j6399k7785k4148L1485K3226k6654m5876O755P010k0802N8784
14095A4116K2076j5300Q255l0024o934Q986j9342P316J3365J1365j0555l3289
14083b9965J1850k274L3233j016j7629m2249m079M6148p932n9658l0528P266K3055
$$ plain form
14166 -23011 11789 22444 42191 -12856 -23453 -11413 4110 -64865 -118463 -106824 -111824 -127660
14154 -127660 -114529 -71842 -61368 -31484 2666 33334 93046 33437 -23335 -8005 -37105
14143 -37105 -82223 -62125 -76151 -49465 -12526 -25674 -53479 -42720 -57858 -42715 -12200 23910
14131 23910 36117 59145 88474 52951 43701 -26472 -18132 58624 79796 26712 6145 -49438
14119 -49438 -33097 55966 68748 12575 -10448 -20556 -19371 -60881 -50545 -26546 3470 47879
14107 47879 48520 32121 4336 -19812 11673 34899 8245 -37631 -30876 -23866 -44668 14116
14095 14116 36192 20892 29147 -877 -7811 1175 -18167 -10851 2514 13879 3324 -29965
14083 -29965 -18115 -20389 12844 11828 -5801 -48050 -52129 -5981 -13913 -73571 -104099 -96833 -73778
14070g3778M6338j5585r458n502q513J3431J8770p723L3990K8737M2656K3477
14058H6840p957J1533m4653l0497R944j6072q7224Q842Q8913M578k8039j1183
14046a4975n22l408j096j3091M0022N8209k1536j2712J3960j1970K1003l8759
14034A5125J5839n9864k8024J9426M6469L6043K8780r961j3430k8507k6235k4079
14022b8418N063L8967k579j7632n1840O375j0751m1755n2717K061K7190M4511
14010h1525n9638n14M4612M8365M8995m45m4539R745j3685M337Q145P940N0852
13997B2645K6661l2538k7349l241K2667O0771q313n0686j1260J4018J3473m1940
13985a5092m3999q468K6216O9112j3306o8084m245L9622O9897k7119l3908K0492
$$ plain form
14070 -73778 -27440 -43025 -52483 -57985 -66498 -53067 -34297 -42020 -8030 20707 63363 86840
14058 86840 78883 90416 45763 15266 25210 9138 -78086 -69244 19669 24247 -3792 -14975
14046 -14975 -15497 -18905 -20001 -33092 6930 65139 43603 30891 44851 32881 53884 15125
14034 15125 30964 -28900 -56924 -37498 8971 45014 73794 63833 50403 21896 -4339 -28418
14022 -28418 -23355 15612 13033 -4599 -56439 -50064 -60815 -102570 -155287 -153226 -126036 -81525
14010 -81525 -141163 -141677 -97065 -48700 295 -150 -44689 -34944 -48629 -44292 -36147 -28207 22645
13997 22645 49306 16768 -10581 -13822 8845 69616 61303 10617 -643 13375 26848 -15092
13985 -15092 -59091 -67559 -41343 27769 14463 -53621 -57866 -18244 51653 24534 -9374 11118
13973A1118J138M8626J9640n3443p4624R853J2375M6976n750k5041J9558J4974
13961B5400k2141K8453M0629J0024k3140o0670J1024K222K6658O3283k7800m4435
13949B9507N068l400l4153m740J6390k0541j1262O6268k334j1075J831o595m2288
13936a7324l9267o85N167k4264L2371n1993k1415M8840j2358J3072K0292Q698
13924c8866L6143L0418r070j7324K1373k961m6310K1573J5356k2135j7914J2448
13912a7269O5835K2070r2640q0325j4342L5431L1365R393K0735K2391l8070j7568
13900e2994J3195j1521L9349J7473n0336k248P5561k6146k3635m964K6747M9768
13888E0249o095k2663l8138K9526M8239m0700m9762J838m8972m03L1354L3004
$$ plain form
13973 11118 12256 60882 80522 27079 -47545 -37692 -25317 21659 15909 -9132 10426 25400
13961 25400 3259 31712 72341 82365 59225 -1445 9579 11801 38459 101742 73942 29507
13949 29507 34575 31175 -2978 -7718 8672 -11869 -23131 43137 40803 29728 31559 24964 -17324
13936 -17324 -56591 -57276 -52109 -76373 -44002 -95995 -117410 -68570 -80928 -67856 -47564 -38866
13924 -38866 -2723 27695 18625 1301 22674 19713 -26597 -5024 10332 -11803 -29717 -17269
13912 -17269 48566 70636 -22004 -102329 -116671 -81240 -49875 -40482 -19747 2644 -35426 -52994
13900 -52994 -39799 -51320 -11971 5502 -44834 -47082 28479 2333 -21302 -26266 481 50249
13888 50249 44154 21491 -16647 12879 61118 20418 -29344 -27506 -76478 -76881 -45527 -12523
13876a2523J0177P501l2892m7760N471N6541j3399o9312K366N2662K1925L5290
13864A6047L7476k3374n6707r337L4783p101k3392k2715k643L8710j3640l9494
13852g1387q736R201K4798K2836k8519O6350N807m7371L8640l5891K5719O2320
13840F3767J6602j6085P86k8697n8042j7998N0908j391l2088k4221M6168M0910
13828D0619J022N340J4240N7084J3408N718q259n8908n1590l242R175K2217k768
13815D4056m8717N4013L3881p820k0177N379M4786k289p6778o578J2143J4357
13803D6256j5509J0091o257K2238L660k7957k6533m7004m002j622M2277j3318
13791a7680j959k687Q794j670J13q636J0311L8803k7236k2590j0530l838m3643
$$ plain form
13876 -12523 -2346 5155 -27737 -75497 -70026 -13485 -26884 -96196 -93830 -41168 -19243 16047
13864 16047 53523 30149 -26558 -35895 -1112 -8213 -31605 -54320 -56963 -18253 -31893 -71387
13852 -71387 -80123 -70922 -46124 -23288 -51807 14543 20350 -27021 11619 -24272 1447 63767
13840 63767 80369 64284 65070 36373 -21669 -39667 11241 9850 -22238 -46459 -291 40619
13828 40619 41641 46981 61221 118305 131713 137431 129172 70264 18674 15432 24607 46824 44056
13815 44056 -4661 49352 83233 75413 55236 60615 105401 103112 26334 19756 31899 46256
13803 46256 30747 40838 34581 56819 60479 32522 5989 -41015 -45017 -46639 -4362 -17680
13791 -17680 -19639 -22326 -13532 -15202 -15089 -23725 -13414 25389 -1847 -24437 -34967 -38805 -82448
13778h2448L8447M3708j0768j6508k1042l5074j494N0401j6198K7780L5741o883
13766E662j8329k1234J461j1069J9519M5472J3629m8402l0703r513k4846k883
13754h1236N5324N5275L2482N6025l583r1983j8141N0891k363J2853k0863k1155
13742B3526k4246m5103j1533j8521M8366O5368j9450p4020n1224L2455J2078k92
13730f2596m157p922N6106N0101m1505m031j9434k8462K1437O8952Q849l4249
13718C089j5171J0105L538M0458k6343m5183O633N146o2401q463J9714O6476K2123
13705A9721N8567Q322r457r149j390l8378R326J5001l0816k5167j0486M290O3739
13692E4123K9615n4513o1748J3453M896J2378P8934K3571k7589n7518o673l4677
$$ plain form
13778 -82448 -44001 -293 -11061 -27569 -48611 -83685 -85179 -34778 -50976 -23196 12545 5662
13766 5662 -12667 -33901 -32440 -43509 -23990 21482 35111 -13291 -43994 -53507 -78353 -81236
13754 -81236 -25912 29363 61845 117870 114287 22304 4163 55054 52691 65544 44681 23526
13742 23526 -720 -45823 -57356 -75877 -27511 37857 18407 -55613 -106837 -74382 -62304 -62596
13730 -62596 -66753 -74675 -18569 31532 -9973 -14004 -33438 -61900 -40463 28489 37338 3089
13718 3089 -12082 -1977 1561 42019 15676 -29507 -22874 -17728 -80129 -88592 -68878 -2402 19721
13705 19721 78288 86610 77153 68004 66614 28236 37562 52563 21747 -3420 -13906 -9616 54123
13692 54123 83738 29225 -32523 -19070 -14174 -1796 77138 100709 73120 15602 8929 -25748
13680b5748L2746k5780j3135m745K4157J7633N0036J6573J862L2453n175n0353
13668E0524j0482L1259j7512j0234k3606n0845O737J8394k1902o938J2370J5579
13656f656j1517j5008J339J0504J698J2541J1491m0660r251K4808K9116k8089
13644a9684j3155q519k5734J9700K2140M2204J4855l5622j5712K4451J5816K2931
13632D3671j0746R853K8699N795J9449m0308l4653j6300M8174j3436J0436L1228
13620H1862O798n2516J6094k6440j2332N847k4356l6344J0680N8357k4977j4820
13608a2147P2780k8316l6559N370J6313k8807k4524k7649Q0795J8075l6775k7844
13596b9288O0924K2988j6939o4246K7955m2358k5896j2391O4919N5451N800j5557
$$ plain form
13680 -25748 6998 -18782 -31917 -36662 -12505 5128 55164 71737 73599 106052 100877 50524
13668 50524 40042 71301 53789 43555 19949 -30896 -24159 -5765 -27667 -34605 -22235 -6656
13656 -6656 -18173 -33181 -31842 -21338 -19640 -7099 4392 -36268 -45519 -20711 8405 -19684
13644 -19684 -32839 -41358 -67092 -47392 -25252 16952 31807 -3815 -19527 4924 20740 43671
13632 43671 32925 42778 71477 77272 96721 56413 21760 5460 53634 40198 50634 81862
13620 81862 88660 36144 52238 25798 13466 19313 -5043 -41387 -30707 27650 2673 -12147
13608 -12147 60633 32317 -4242 1128 17441 -11366 -35890 -63539 17256 35331 -1444 -29288
13596 -29288 31636 54624 37685 -26561 1394 -40964 -66860 -79251 -14332 41119 46919 31362
13584C1362m6003R026P056K2263l6910l0715K5812K8657j3620j9250K110M2151
13572B1939n319m5996J2974L655l8527m6036K8301K6379L7348N5700q2631j1745
13560d3958M2296L3003L5464L335m7914o1748L8093L8250j9635o5346k7776L1405
13548d4531P9822M5257o036l9380n2135K3172L0195K1473m9096l4964N597L8406
13536A7780J7151m162J1515l8102n7672j435P8703L7686m3965k4088j4920O389
13524a5120r162J9416K3984Q142r01J5269K7036n9512l0570J4302L8885k853j0600
13511A8316K1549K9857N158l3956l8463j2650j9106K7731M949l5699p92N8112
13499B5006J8616K5944j4233m7931j1062K4296o61j2232k0114o399M5536N0840
$$ plain form
13584 31362 -14641 -5615 1441 23704 -13206 -43921 -18109 10548 -3072 -22322 -20212 21939
13572 21939 16620 -29376 -16402 -12747 -51274 -97310 -69009 -42630 -5282 50418 -32213 -43958
13560 -43958 -1662 31341 66805 70140 22226 -39522 -1429 36821 17186 -48160 -75936 -44531
13548 -44531 35291 80548 74512 35132 -17003 6169 36364 57837 8741 -26223 -20626 17780
13536 17780 34931 30769 42284 4182 -53490 -54925 23778 61464 17499 -6589 -21509 -15120
13524 -15120 -24282 -4866 19118 27260 26359 41628 68664 9152 -21418 -7116 31769 28916 18316
13511 18316 39865 69722 74880 40924 2461 -10189 -29295 -1564 3385 -32314 -33106 25006
13499 25006 43622 69566 55333 7402 -3660 20636 19975 7743 -12371 -18770 26766 77606
13487G7606k7946m8312J8805J3040l9358l6935L762L6737M8232l0875n315J1571
13475B1012R349K1200k5150j9939O7965P5885M335m8567j22469j6580N2299K5239
13463D4579k1009l5428K6103j304O263R639j1375m2615m477l3439n4805J1112
13451a06756O9160K0073J0966L4655l2629o12J4258J4960k0855P501K2126L8290
13439G1137n1495j8275k064k603j6481m1208M202Q0584P3194n4289o0437K4395
13427F660K6708K1384m0843l0783R40l978J6521N0043L7066j6867J5735j6023
13415F6563p4584m5500J7492M5971n6193j5821M288M2595K4381L6367k0555k8397
13403c393j6511j168Q221N520l2844K5002j892q2228l051N3378L3135K0161M2536
$$ plain form
13487 77606 49660 1348 20153 33193 -6165 -43100 -39338 -2601 45631 14756 9441 21012
13475 21012 30361 51561 26411 6472 74437 150322 154657 106090 -16379 -32959 19340 44579
13463 44579 23570 -11858 14245 12941 19204 28843 17468 -25147 -29624 -63063 -117868 -106756
13451 -106756 -37596 -17523 -6557 28098 -4531 -5143 9115 24075 3220 10721 32847 71137
13439 71137 19642 1367 -697 -3300 -19781 -60989 -56787 23797 96991 42702 -17735 6660
13427 6660 33368 54752 13909 -16874 -15934 -19912 -3391 46652 83718 66851 82586 66563
13415 66563 -8021 -53521 -36029 9942 -46251 -62072 -57784 -15189 9192 45559 25004 -3393
13403 -3393 -19904 -21072 -12851 -7331 -40175 -15173 -17065 -99293 -102344 -48966 -15831 4330 46866
13390D6866K4644k7681L8836J5086j2347j3660O057j689J6275j8798K554j6240
13378E9903P915p0325l0649L1554L4101O9944K0526J1018L6044M9583l6097p3880
13366A09637M29j7608j391l4909m1587j7908M0222O999K535K6532o0491m212j5990
13353g742j6640k0503M9093p24M43q411j2105j594l6242o302M4089M6559N2817
13340H2738M2320p1787n7542J9580k1314n0561J6251j3257J8803O3205L7530m6004
13328A9962m3259p175N7062M6585j2524q1657l4421P234K3031M6870N641M7606
13316G4955L5503J1124l4277q199J5158K4605j9820J5944n5244l6681N680j1154
13304A7594K0296q039P608L0041L7841k47p4934j2674k002M5304K0600Q926l375
$$ plain form
13390 46866 71510 43829 82665 97751 85404 71744 77801 76112 92387 73589 76143 59903
13378 59903 67818 -2507 -33156 -1602 32499 102443 122969 133987 170031 219614 183517 109637
13366 109637 110066 92458 91067 56158 14571 -3337 36885 43884 46419 72951 12460 8248 -7742
13353 -7742 -24382 -44885 4208 3484 3927 -4484 -16589 -18183 -54425 -60727 -16638 29921 82738
13340 82738 125058 53271 -4271 15309 -6005 -56566 -40315 -53572 -34769 28436 65966 19962
13328 19962 -23297 -30472 26590 73175 60651 -21006 -55427 -48193 -25162 21708 27349 74955
13316 74955 110458 121582 87305 79106 94264 118869 99049 114993 59749 23068 28748 17594
13304 17594 37890 29851 37459 67500 105341 105094 30160 17486 15484 60788 81388 90314 86939
13291H6939n3902j1414K4494l511k7931n2580Q525J9212L1871q961M5886N4091
13279A12719m3915J4078J1077n6475J5042N5040J78k4834J0566k3648o9376j5162
13267a4710n5783J4975M5837N5150K3884k1241K7412m7495o2728N3479J7852l5718
13255I14j3327J5717M795j4355j5684m8517j6834L9123N9111n145l911J8600L3902
13242E4389m9219m1351L5133J6478J9461L5535j0062m9761k127l587k5266L7821
13230A7444L3448M8538O961l7094L679P47r7037j7030L5291P5356N3319l6469
13218H7153o5851R676m6210M2757J6791k7375L4392L7026O415J52k2172K1400
13206I4154N764l1529l8854J2861L2643M37L3444k3290p1337N451P6828j4468
$$ plain form
13291 86939 33037 21623 46117 42606 14675 -37905 -29380 -10168 21703 12742 58628 112719
13279 112719 68804 82882 93959 37484 52526 107566 107744 82910 93476 69828 452 -14710
13267 -14710 -70493 -55518 -9681 45469 69353 48112 75524 28029 -34699 18780 36632 914
13255 914 -12413 3304 8099 -6256 -21940 -70457 -87291 -48168 10943 5798 1887 20487 54389
13242 54389 5170 -36181 -1048 15430 34891 70426 60364 10603 8476 4889 -20377 17444
13230 17444 50892 99430 106391 69297 72976 73723 -23314 -40344 -5053 70303 123622 87153
13218 87153 21302 30978 -15232 27525 44316 16941 51333 88359 94774 94926 72754 94154
13206 94154 99918 68389 29535 42396 75039 75476 108920 85630 14293 19744 96572 82104
13194H2104q562K2237r917K2023K559l6702l701l7576j8196n726k745o464k4238
13181b4904J6059L5190M3187R270J3704l3145J1341k146j5958J1989R711R859
13169H4157j9903k5197k7103p164J9992j3878P4621L4581P908m2462n5385L5199
13157F5366q572j9964l1326J7161P4538M7169o404k1904j3674j9216l618Q692
13145H8248j0295k0322k5112j4055q502Q827k0818k2126k9119J7431N4268O5765
13133H4190L0546n5458p8504k9277o454M7609N8194m205o0051J7970O5826k2235
13121D8151L673l3852J6218P943j3727k155j8207k7939R266m449N1619L9033M6634
13108A22208j2794n5011r473j0612J2909p658k8217j8274j2618L188J8257R701
$$ plain form
13194 82104 73542 95779 85862 107885 110444 73742 70041 32465 14269 8543 5798 -666 -24904
13181 -24904 -8845 26345 69532 78802 92506 59361 70702 68556 52598 64587 74298 84157
13169 84157 64254 39057 11954 4790 24782 10904 85525 120106 128014 85552 30167 65366
13157 65366 56794 36830 5504 22665 97203 144372 137968 116064 102390 83174 79556 88248
13145 88248 77953 57631 32519 18464 9962 18789 -2029 -24155 -53274 -35843 18425 84190
13133 84190 114736 59278 -19226 -48503 -54957 -7348 50846 46641 -13410 4560 70386 48151
13121 48151 51824 17972 34190 42133 28406 26251 8044 -19895 -10629 -15078 36541 75574 122208
13108 122208 109414 54403 44930 34318 47227 39569 11352 -6922 -19540 -16352 1905 11606
13096A1606k7424J9920J01500j5871q593j7269N893J3350J7764K2187K247k9460
13084I5850j2475m1569k5140o607m3508M0527J8470m7919J3399K0636k5906J374
13072a2868L0136P940j0955n677m3523Q02O2521N4081j1403j4635L7794j2669
13060H1544n1799q603L7256L2130p777k6825j6253j2460m4497l3884K4403J2215
13048a4550J9507l4634k6355K4252L1861K4817K2474k026m3449K4054P6074K9443
13036A31468o6257o225J33k1084l1408K7652L0160K8019k7889J5096P4876J0934
13024A65475l9720J5075J4110m4803M0680p588k545P120n1332J3690k7384l8438
13012D4340j2342k6767J087k7555L6002Q679K4776K0030P1810P010k5939O413
$$ plain form
13096 11606 -15818 4102 105602 89731 81138 63869 69762 83112 100876 123063 125310 95850
13084 95850 83375 41806 16666 10059 -33449 7078 25548 -22371 -8972 11664 -14242 -12868
13072 -12868 17268 25208 14253 8576 -34947 -34145 28376 82457 71054 56419 94213 81544
13060 81544 29745 21142 58398 90528 82751 55926 39673 27213 -17284 -51168 -26765 -14550
13048 -14550 4957 -29677 -56032 -31780 81 24898 47372 45346 1897 25951 102025 131468
13036 131468 65211 58986 59119 38035 6627 34279 64439 92458 64569 79665 154541 165475
13024 165475 125755 140830 154940 110137 150817 143229 140684 147804 96472 110162 82778 44340
13012 44340 31998 5231 6318 -21237 14765 23444 48220 68250 140060 147070 121131 127544
13000A27544J7829N6338q3868l4080L0150K1026m772l0256n0071K9401q342j06
12988G0793K2148Q053N050o07L287O9339L1861l0484m6428o0378m2016l9046M8991
12975D0563K5466L9770P831l0859M429J5026L2435p796L053o2352K517K0751P1867
12962A62701k367j4463k4131l7921m0193N266J3060k4495l7747m6484K4937N7193
12950C5356N8879K6637k1075k8984j5937M0244N3894K365K6015k4579o4046l6004
12938E2765J3348L945o1r3320l1636O7837P2786K503o2964J6298J3263k9478N5280
12925H0566j713k8173J3131l3372K34r038j1116k3053M9703n0039J1578M9867
12913D8575N2272P113K931o4528p576Q7495J2597k7751j6160n4881k6507O023
$$ plain form
13000 127544 145373 201711 117843 83763 113913 134939 130167 99911 49840 79241 70899 70793
12988 70793 92941 100994 106044 105437 108724 178063 209924 179440 133012 72634 30618 -8428 40563
12975 40563 66029 105799 113630 82771 87200 102226 134661 126865 129918 67566 70083 90834 162701
12962 162701 160334 145871 121740 83819 43626 48892 61952 37457 -290 -46774 -21837 35356
12950 35356 94235 120872 99797 70813 54876 95120 149014 151379 177394 152815 88769 52765
12938 52765 66113 70058 69997 -23323 -54959 12878 85664 88167 25203 41501 54764 25286 80566
12925 80566 78853 50680 63811 30439 30673 21635 10519 -12534 37169 -12870 -1292 48575
12913 48575 100847 107960 110891 46363 38787 126282 138879 111128 94968 40087 13580 19603
12901A9603O6254L9617l2990O217O4682N6074K8582k6420o8730n3395j1623O367
12889I4238K9639O361k4552l4078o986L9509J5693K4457o4111q90r355o337j2797
12876E0791K1159L3908m0441l7711K9872J8240J0186n2124j2772j3398j1901N6342
12864E2151l931L350m4585L1019L3696J8307J339J1514K0551j7592n6860R729
12852E8688L8423L5027K5051M3953Q75j7477l4819j9369J6839L8151j0103o2039
12840A13200O271J2092l6030J7159k2871J0213K7608m069r622j3913o1923J705
12828C9820K6333J0819j2346n8664L2126L5662r680l670j5141O972M4286j1441
12816H5076k7487k6822K3793R9158K7207q755k7196p0112l4157K6617K7577J8429
$$ plain form
12901 19603 85857 125474 92484 98701 163383 219457 248039 221619 152889 99494 87871 94238
12889 94238 123877 130238 105686 71608 64622 104131 119824 144281 80170 79280 69925 63588 50791
12876 50791 71950 105858 65417 27706 57578 75818 86004 33880 21108 7710 -4191 52151
12864 52151 48220 51570 6985 38004 71700 90007 91346 102860 123411 105819 48959 58688
12852 58688 97111 132138 157189 201142 202017 184540 149721 130352 147191 185342 175239 113200
12840 113200 119471 131563 95533 112692 89821 100034 127642 123573 113951 100038 38115 39820
12828 39820 66153 76972 64626 5962 38088 73750 64070 60400 45259 52231 96517 85076
12816 85076 57589 30767 54560 153718 180925 172170 144974 74862 40705 67322 94899 113328
12804A13328r445j000n509j0481j4097r417P815j0925L6315M3121r067k6053l7137
12791F7448m1341N824k3387m304M5467L2014j2398n085k2395J9912R1823R473
12779A63051m8027k3533l7048l8871n7816j1907K5530J9811L9916N9140K0115
12768A10361l2459p3846M9819P1530m1085J7453K6698J5430m712k1785j3088L8941
12756A43257Q39k6245j0862k4766l5923M8087L6081k5863o7379L8320K3419J2167
12744A11132J0526m2745l7864J1238M1014q246k328L3107l5761n1039l238P1436
12732I7232K2166P453m4707m6153K4982L4574M5787O179m1717j3842r470k1801
12720F0683j0981n780R720M5809n4453o525K8222K5612J2455m0379m149O3718
$$ plain form
12804 113328 103883 102883 97374 86893 72796 63379 71194 60269 96584 139705 130638 104585 67448
12791 67448 26107 31931 8544 4240 49707 81721 69323 64238 41843 61755 153578 163051
12779 163051 115024 91491 54443 15572 -42244 -54151 -28621 -8810 31106 90246 110361
12768 110361 77902 4056 53875 125405 84320 101773 128471 143901 139189 117404 104316 143257
12756 143257 144096 117851 106989 82223 46300 94387 130468 104605 37226 75546 98965 111132
12744 111132 121658 78913 41049 52287 93301 85055 82727 115834 80073 29034 25796 97232
12732 97232 119398 126851 82144 35991 60973 95547 141334 147513 105796 91954 82484 60683
12720 60683 49702 43922 53642 99451 44998 38473 66695 92307 104762 64383 60234 123952
12708A23952K5424P288j7252J2421Q246p7741q336Q141L4491J8738k6335l7753
12696G1284l444K8538L9017l0895m2016l6627m21P6594Q289k154M1579L1676j064
12683A80356n069l4387l7052l8855j5084K5202L5783J8706j1330m7609l2513L4907
12671G3055n684m075K674O1902j866m0338M372M4376K0506l1284L296J7264L1072
12658A75270K5167l3014m6059L3629k3590k1364M4650O9571l1222j6967m7597
12647A28474o0813k5286K8943K5775J7334N005m0368l3302M2910L3655o438K0736
12635A36625l5049l2273K3389M9425M2274n398K2123k7720p4150m627J1737L5573
12623A41929P750J8495P019j4356l7044n1499l9056N6961L4058L495m8678k7326
$$ plain form
12708 123952 149376 156664 139412 151833 160079 82338 74002 82143 116634 135372 109037 71284
12696 71284 67840 96378 135395 104500 62484 25857 25436 102030 110319 108165 149744 181420 180356
12683 180356 175287 140900 103848 64993 49909 75111 110894 129600 118270 70661 38148 73055
12671 73055 67371 63296 65970 127872 126006 85668 90040 134416 154922 123638 126934 144198 175270
12658 175270 200437 167423 121364 154993 131403 110039 154689 224260 193038 176071 128474
12647 128474 67661 42375 71318 97093 114427 119432 79064 45762 88672 122327 115889 136625
12635 136625 101576 69303 92692 142117 184391 178993 201116 173396 99246 94619 106356 141929
12623 141929 149679 168174 175193 160837 123793 72294 33238 90199 124257 127752 79074 51748
12611E1748J3190J3967K4897j2194j1048K9227K5494K3921j1687L8673m082l6310
12599A45796J9888k4223J6118K3809q2750K9207O3435O653j8674m7926m3868L70
12587H7835P190k5422p7112L1737J04841N3370P037o1268J863k802m7685p385
12575G2199N445M0366q904n3507k4544J714L3798O1632k4426j5282J4133M0438
12563A43062k3543j699P19n414l7709K04O8891L6017o8603J617j3716J6352N5364
12550A71542K541k0709K9962k8781p4071K059j194M3311k9611l0926k3499J480
12538D2104k8128l620K3171J8608o4869j2848N5019J5304O490K639l3668K3809
12526D4011J8848n160J7797o133m9134k3430k6473M1898O4263J4423k1571k4338
$$ plain form
12611 51748 64938 78905 103802 91608 80560 109787 135281 159202 147515 186188 182106 145796
12599 145796 165684 141461 157579 181388 98638 127845 191280 197933 179259 131333 87465 87835
12587 87835 95025 69603 -7509 24228 129069 182439 189476 128208 130071 127269 79584 72199
12575 72199 77644 118010 109106 55599 31055 32769 66567 128199 103773 88491 102624 143062
12563 143062 119519 117820 118539 113125 75416 75620 144511 180528 111925 113542 99826 116178 171542
12550 171542 174083 153374 183336 154555 80484 82543 81349 124660 95049 64123 40624 42104
12538 42104 13976 10356 33527 52135 -12734 -25582 29437 44741 51231 53870 20202 44011
12526 44011 62859 57699 75496 69363 20229 -3201 -29674 12224 76487 90910 69339 45001
12514D5001j781M35J5621m0232m595N6093O6652M8957j4718m6513q5939k148L0630
12501F7463k038K6750L7791K2387K3514J3948l4620m7229j8247L7193R330l3395
12489A02847l4713J5206K3273J9583k5792J2750N2670M580j3919j7722J3888L8976
12477A91627j6412k8895k6565j8511m6106P425q717K8308m602m0234K406N8021
12465I7745J2387k1014O7884K9021m1943k3294J3607j1791o088k8182m264K2883
12453A06951l2007J0325J8097L146K5941n979L859l913j2816O775l455o2846L1715
12440H5793M0850k3037M919k9526p279j7653O574O5115P8457n9527k9776K628
12428A17538l7575m3816j8794L8959J0972K9680L2974M4519J347l8658J7695J601
$$ plain form
12514 45001 43220 43655 59276 19044 14449 70542 137194 186151 171433 124920 38981 36833 67463
12501 67463 65425 92175 129966 152353 175867 189815 155195 107966 89719 126912 136242 102847
12489 102847 68134 83340 106613 126196 100404 113154 165824 170404 156485 138763 152651 191627
12477 191627 175215 146320 119755 101244 55138 62563 53846 82154 77552 37318 39724 97745
12465 97745 110132 89118 157002 186023 144080 120786 134393 122602 116514 88332 84068 106951
12453 106951 74944 85269 103366 106512 132453 126474 130333 126420 113604 120379 116924 54078 85793
12440 85793 126643 103606 108525 78999 71720 54067 60641 125756 204213 144686 114910 117538
12428 117538 79963 36147 17353 56312 67284 96964 129938 174457 175804 137146 154841 156442
12416A56442N312n58m0901M258l1725K6065L0813K1221k7631j3902N768m0224
12404I4938l293L6065L4705K244n3855l4393O6548M3315q380j6887L0327o6274
12392A25060l116L3880J2642J2092L5345o7776p1592m4620j1468J7332m192J8820
12380E2407K2960K4120J2008l1318K9942K9211p312l4187J5360K9813K8307k3829
12368A47482R798j6762j998L8014L0523Q624o379l5139j5340n572m0521k2672
12356I0058k666L0699Q49j2954m755m434J1651k8197P979J0382L9537J0387k3320
12343A25216k5035m0645m886k5027M4748L0327K2622L4375M7717n0943o8369p6934
12331A3166J7797K8127K6274n131J6698Q593k6135k1081j2089R400K0812K9841
$$ plain form
12416 156442 161754 161196 120295 124553 92828 118893 149706 170927 143296 129394 135162 94938
12404 94938 91645 127710 162415 164659 110804 76411 142959 186274 177894 161007 191334 125060
12392 125060 121944 155824 168466 180558 215903 148127 76535 31915 20447 37779 33587 52407
12380 52407 75367 99487 111495 80177 110119 139330 132018 97831 113191 143004 171311 147482
12368 147482 157280 140518 138520 176534 207057 215681 209302 174163 158823 153251 112730 90058
12356 90058 87392 118091 118940 105986 101231 96797 108448 80251 88230 98612 138149 148536 125216
12343 125216 100181 59536 54650 29623 74371 104698 127320 161695 209412 158469 90100 13166
12331 13166 30963 59090 85364 80233 96931 105524 79389 58308 46219 55619 76431 106272
12319A06272J872q946K9409m254O827o9500L645M848L693J7141K5577n183K4423
12306A35824O801K931l784P023N39k6970n7947L2915J4979J8257L4681m571n2706
12293A07972k9480J1499J0142m1631k5203J9625R027K3588k6512l7661J0170J9869
12281E1405l283l5705K826M9668K1979K8334M7617l80j02451L287j2563O681K5584
12268H2999j2166j6983Q627k0407k7302k3590j1944J3822k4747K1473N3918j9513
12256B4187K3906N6110p6530j5465J5860K2363j8307K7045M6321M5714m6382l8528
12244F6294r991K3249M3465l6554m1685j9448j0560N7622Q358K55m5861r980K1247
12231D6411O1095K7j1948j8875l611j9668m1489N952O822P599K7551j7117K6366
$$ plain form
12319 106272 108144 99198 128607 124353 131180 61680 65325 70173 73866 91007 116584 111401 135824
12306 135824 142625 145556 141772 148795 149334 122364 64417 97332 112311 130568 165249 160678 107972
12293 107972 78492 89991 100133 58502 33299 52924 61951 85539 59027 21366 31536 51405
12281 51405 48122 12417 15243 64911 86890 115224 162841 162461 60010 63297 50734 57415 82999
12268 82999 70833 53850 62477 42070 14768 -8822 -20766 -6944 -31691 -10218 43700 24187
12256 24187 48093 104203 27673 12208 28068 50431 32124 59169 105490 151204 104822 66294
12244 66294 56303 79552 123017 86463 44778 25330 14770 72392 80750 81005 35144 25164 46411
12231 46411 107506 107533 95585 76710 73099 53431 11942 17894 24716 32315 59866 42749 69115
12218F9115p044k6481R715j8607L2999j9032L4151N698k9350k0265O0486l38J0059
12205A01106L5502Q4265l0120m7150m5005n6146q7J670p634k3326Q702K6191N384
12192E3352n9587j4180M9362N0238j0583J9603j5717j6731R129j8680M2225P3318
12180A61749J4376m9029k6697l6812l0808L1134O621m424n6550j6190M5758K9964
12168F9092M9675r51j3853M6186K7617O796k1365l9996m2282L7212j4657k4228
12156G9246M360L8530N975N5040k4960n7413J7240N0532j7699n7112J6713L2281
12144A42733l8850m4741K78n886K5171l4042J0507K7287N1121m7539j8118L71
12132F8292k2081J3031m5176m46L5358P4046l5476m0218M4663J0919p200m7567
$$ plain form
12218 69115 62071 35590 45305 26698 59697 40665 74816 80514 51164 30899 91385 91047 101106
12205 101106 136608 220873 190753 143603 98598 42452 42365 44035 36401 13075 21777 47968 53352
12192 53352 -6235 -20415 28947 79185 68602 88205 72488 55757 64886 46206 88431 161749
12180 161749 176125 127096 100399 63587 32779 63913 70534 66110 9560 -6630 39128 69092
12168 69092 118767 117816 103963 150149 177766 184562 163197 123201 80919 118131 103474 79246
12156 79246 83606 122136 128111 183151 158191 100778 118018 168550 150851 93739 110452 142733
12144 142733 103883 59142 59420 53534 78705 44663 55170 82457 133578 86039 67921 68292
12132 68292 46211 59242 14066 13620 48978 123024 87548 47330 91993 102912 95712 48145
12120D8145k2516l9822K7682j3592l8804L3951L6418j7289l2409J944J6476O6899
12108F7083J8009l1501l0793m1775M270M704L9060j1K4091L5097K569R741O710
12095A07254j9330N873j9898N613r902m2924O456K6715K597l7403J3699J1413
12083E0163k6859J0345L7458K6325m701m4098k1797k1117p828L7946M0855J1528
12071H8220l6986k0628K4398k923k5398l0803J398m58J0464l2254L4998O7415
12059G7443K0802l2227l9486J15K0560O2156m480k1237k5507n608Q0339J4113
12047A46983n3606n289k0028l4647n0803J7410J3069Q393k220L0808P0793R174
12035A30037N944k1940l9304n9900k5626O4628R0379N6498m2869n240l1317n2079
$$ plain form
12120 48145 25629 -14193 13489 -103 -38907 -4956 31462 14173 -18236 -16292 184 67083
12108 67083 85092 53591 22798 -18977 -14707 -10003 29057 29046 53137 88234 90803 100544 107254
12095 107254 87924 93797 73899 79512 69610 26686 33142 59857 62454 25051 38750 50163
12083 50163 23304 33649 71107 97432 92731 48633 26836 5719 -2109 35837 76692 88220
12071 88220 51234 30606 55004 52081 26683 -4120 -2722 -3180 7284 -24970 10028 77443
12059 77443 98245 66018 26532 26647 47207 109363 104883 83646 58139 52531 132870 146983
12047 146983 93377 88088 68060 33413 -17390 20 13089 21482 19262 50070 120863 130037
12035 130037 135981 114041 74737 14837 -10789 53839 144218 200716 157847 152607 121290 69211
12023F9211l6377Q012K8122M6830m3987q1608L7612P7535j4815l1588L0550O372
12011I5869o0247j2882J3815L1845M2058N1176L6388j5462q7121n8088l0684J7517
11999B4184J2158J5848J6028m7898k6711P860L5632Q9989J666k8952j3803M1140
11987A27141L2048l487L0754o4261m6948O0646J7935j1398q733O169j0751L8292
11975A67407K0166p7357p8480m6248Q0923l9540m1452k2881k1275L3488L6714
11964A1465N8274j7449j0348L6359j4407J361k7494j9217J5268L4150l6011J3826
11952D5777j0869k8045M7875j341j0960K375Q666j2221j540J5215R219m1081o294
11939A6776N1723L0753J9324K4187J8090n1949k6104j9924j6336N459j4777j4804
$$ plain form
12023 69211 32834 40846 68968 115798 71811 -9797 27815 105350 90535 58947 89497 95869
12011 95869 35622 22740 36555 68400 110458 161634 198022 182560 95439 37351 6667 24184
11999 24184 36342 52190 68218 20320 -6391 1469 37101 127090 128756 99804 86001 127141
11987 127141 159189 155702 186456 122195 75247 135893 153828 142430 133697 139866 129115 167407
11975 167407 187573 110216 31736 -14512 66411 26871 -14581 -37462 -58737 -25249 11465
11964 11465 69739 52290 41942 78301 63894 65255 37761 18544 33812 67962 31951 45777
11952 45777 34908 6863 54738 53397 42437 44812 53478 41257 39717 54932 64151 23070 16776
11939 16776 68499 99252 118576 142763 160853 108904 82800 62876 46540 51999 37222 22418
11927B2418k4666j4216M4435K8586m849j2088l7522l1417K6753J499L9134J0179
11915D8246j862M122l1780O929p883l3933M2030R758l1878J2896j841k3915k2777
11902c1888k581J9776l9387m2462M5716J0554K8961j9161P226M1825N7656L4393
11890A10628m1657k9084j5307J2478M047l6808J5429J7012j102J5556p118l1545
11878A2529l6820j8842K7146O4698J8516r076J7058L4509l9894m9479m425o64
11866A5256n9535q931L5236K7550N2867K1020J4145K4657j3949k1652p748n565
11854G3351K6365j5531p471j762J8443M17k9231m8122l0686p693J8461k141L8465
11841C2865J9622o5641l5565M7732l0331O589M872M7893N5969j365K1917K4401
$$ plain form
11927 22418 -2248 -16464 27971 56557 51708 39620 2098 -29319 -2566 -1067 38067 48246
11915 48246 46384 50506 18726 25655 17772 -16161 25869 35627 3749 16645 14804 -9111 -31888
11902 -31888 -34469 -14693 -54080 -96542 -50826 -40272 -11311 -30472 -23246 18579 76235 110628
11890 110628 68971 39887 24580 37058 41105 4297 19726 36738 35636 51192 44074 12529
11878 12529 -24291 -43133 -15987 48711 67227 58151 75209 109718 69824 20345 15920 15256
11866 15256 -44279 -53210 -17974 9576 62443 83463 97608 122265 108316 86664 78916 73351
11854 73351 99716 84185 76714 74952 93395 93812 64581 16459 -14227 -21920 -3459 -5600 32865
11841 32865 52487 -13154 -48719 -987 -31318 -24729 -19857 28036 84005 82640 104557 128958
11829A28958j9591k2483p937o7738k8475N0496L3534l822l5907p68P0157J5070
11817A11494m5465m5741p458K925j0289o7059J9452M9186L1500J7861k4932Q5
11805C1559n069k156J7443m575j863K5259M3072j4849m5539J6937j1970J6150
11793F4399j471o831J4377m2053k0922m203J3088k745k089M1054O110l8222n6362
11780c5870k567P3817K9780p8984j5796M0401J3889n202Q1455N392p1234k5649
11768I432l2375O733p650k2859M8527L6438m3414m7208K9731K1040J970K5608
11756B5973L6352j2201o0502M0939K1238k1265J3164j2640O924J9737n1747j9694
11744a3722J4119j3430J0385L1839R103l9099L123n2244m0189j814L3103L9078
$$ plain form
11829 128958 109367 86884 78947 11209 -17266 33230 66764 62942 27035 26267 96424 111494
11817 111494 66029 20288 12830 15755 5466 -61593 -42141 7045 38545 56406 31474 31559
11805 31559 26490 24334 41777 37202 35339 60598 103670 88821 43282 60219 48249 64399
11793 64399 62928 56097 70474 28421 7499 3296 16384 13639 11550 52604 58714 20492 -35870
11780 -35870 -38437 35380 65160 -13824 -29620 10781 24670 19468 100923 106315 35081 9432
11768 9432 -22943 -16210 -23860 -46719 1808 38246 -5168 -52376 -22645 -1605 365 25973
11756 25973 62325 50124 -10378 30561 51799 30534 43698 31058 37982 57719 5972 -13722
11744 -13722 397 -13033 -2648 29191 38294 -805 2318 -49926 -90115 -91929 -58826 -19748
11732a9748O172P873J4513P674o262J6997m387M8714L2100n4083P542m0939n0877
11719c4711k1523M2301N0043O949n616q065m3045l6329L0266k1845j0538J1977
11707d0136k974J9813M66k4328p467j9059K3481J0022n7220O5010J5306r694k8927
11694e5707K7734M5130m729r588j2535l24K8598J2242J3941L853k7351K1942K6282
11681F9488k1034l6579K580J9568q600r261q408K5309R747m052K6225k6877p555
11668C0551J1391j2592N6269M3378K1332q994r7488k8338N3782L938O301R674
11656H9204j0284j6030o0610o4372L997J8565K3457k9821o315L4761J6816J3280
11644A2648k867q9245J197k395o28J6189j0313M2431O5760k2064o1322k9984q654
$$ plain form
11732 -19748 -13576 -5703 8810 16484 10222 27219 22832 71546 103646 49563 57105 16166 -34711
11719 -34711 -56234 -13933 36110 43059 37443 29378 -13667 -49996 -19730 -41575 -52113 -40136
11707 -40136 -43110 -23297 -22831 -47159 -54626 -73685 -50204 -40182 -97402 -32392 -17086 -26780 -55707
11694 -55707 -27973 17157 12428 2840 -9695 -10019 18579 30821 44762 48615 21264 43206 69488
11681 69488 48454 11875 14455 34023 25423 16162 7754 33063 42810 38758 64983 38106 30551
11668 30551 41942 29350 85619 128997 150329 141335 43847 15509 69291 73229 79530 89204
11656 89204 78920 62890 2280 -62092 -58095 -39530 -16073 -45894 -52209 -17448 -632 12648
11644 12648 9781 -79464 -78267 -80662 -81290 -65101 -75414 -32983 32777 10713 -50609 -80593 -89247
11631h9247P4042J4951p623L3537Q44n3207L3067k6330l8291k1418p454j86O2294
11618b5021K6467j1115k8823m964P88J2361q777l517J0556l8080J9991L2029N7232
11605C9127n1281L1736M9538J2654m1079k3569m664o059Q10l3092N6330L2788
11593F3239k520R208l3154m7832j6619J6634N760o6091M5436K4674J085M546p903
11580c537K6342m058j1649j5050l1806j4032K2259k898L8832M4723K9408J1259
11568H9793l5313m6327J4198K0603l0484m035j4946P795J4278M2271J7254k4228
11556E0859l005J3785K40M057O655r260l7354o3139j2513L3654N6254L9386l676
11543G5943n2810r884j7744J8564K3194K0210r208k4198m4604m6393m6729L4291
$$ plain form
11631 -89247 -15205 -254 -7877 25660 26504 -26703 6364 -19966 -58257 -79675 -87129 -87315 -25021
11618 -25021 1446 -9669 -38492 -43456 -42668 -30307 -39084 -42601 -32045 -70125 -50134 -18105 39127
11605 39127 -12154 19582 69120 81774 40695 17126 12462 6403 7213 -25879 30451 63239
11593 63239 60719 69927 36773 -11059 -27678 -11044 -5284 -71375 -25939 -1265 -180 4366 -3537
11580 -3537 22805 18747 7098 -7952 -39758 -53790 -31531 -34429 4403 49126 78534 89793
11568 89793 54480 8153 22351 42954 12470 8435 -6511 1284 15562 57833 75087 50859
11556 50859 47854 61639 61879 65936 72591 63331 25977 -37162 -49675 -16021 40233 79619 75943
11543 75943 23133 13249 -4495 14069 37263 57473 48265 24067 -20537 -66930 -113659 -79368
11531g9368Q6715P6337j8614j8596j8162k2978J8439K8408k2257k5508L3085l219
11519C4282M0600j5307J6276K1523k5586m0323m7914k8312p251L5234M9301k1167
11507A1356k1470J9482j1498N612K1071k4499k1087J7805p7823j1668M4381p634
11495e5972J9945K1605l6892K1718M6021M6025j4713l4035p1630P45M7259K4623
11483A4699o195M6111m5048n566K4490j1256p0714l9267m1041r243M8794k2187
11471a16423j2738N0405N5552l8524k2960M5824K0450k5741J9306N766k9133O365
11459d1851M0232J8617k2142m1488m7362J3448M8849n2245M9329K7131K3378l9642
11447b3746o9384L3441m510P032K7436m5152R927K116k8077M8169N2662J2582
$$ plain form
11531 -79368 7347 83684 65070 46474 28312 5334 23773 52181 29924 4416 37501 34282
11519 34282 74882 59575 75851 97374 71788 31465 -16449 -44761 -52012 -16778 32523 11356
11507 11356 -10114 9368 -2130 3482 24553 54 -21033 -3228 -81051 -92719 -48338 -55972
11495 -55972 -36027 -14422 -51314 -29596 16425 62450 47737 13702 -57928 -57183 -9924 14699
11483 14699 8504 54615 9567 4001 28491 17235 -53479 -92746 -133787 -143030 -94236 -116423
11471 -116423 -129161 -78756 -23204 -61728 -84688 -38864 -18414 -44155 -24849 -19083 -48216 -41851
11459 -41851 -1619 16998 -5144 -46632 -93994 -80546 -31697 -83942 -34613 -7482 15896 -23746
11447 -23746 -93130 -59689 -64199 -57167 -29731 -74883 -64956 -62840 -90917 -42748 9914 22496
11435B2496j2828l2445j9955J6134l6528j4571l5746j9803K7753L7397r309j8346
11423i5751n632L8351J090l7692j1186N8366K0096l7738M8894L5680N3401L0210
11411I8089n4346l8704j9252q63n6197k7304K4647r747l1547j9744N2161J25554
11399D2747J5766o3823K9162j4846l5803M211J3279M8914J8719l6872k9221k3790
11387c1557J4606L6158r630J7582O139m3379n4933q090K5120J5670k4395p698
11375f4407k6127k8865j5777j1651N1757P2000j4745M1320J8910m2672l2098m9509
11363a01864j0044K7023K9916J04527k100k0657j7378k6808J5021J8111j1770
11352C977m1723k9711p250L9856P5683L0832m2864n3767Q363J9969m2146l2382
$$ plain form
11435 22496 9668 -22777 -42732 -26598 -63126 -77697 -113443 -133246 -105493 -68096 -77405 -95751
11423 -95751 -101383 -63032 -61942 -99634 -110820 -52454 -32358 -70096 -21202 14478 67879 98089
11411 98089 43743 5039 -14213 -15076 -71273 -98577 -73930 -83677 -115224 -134968 -82807 42747
11399 42747 58513 -5310 23852 9006 -26797 -22586 -9307 39607 58326 21454 -7767 -31557
11387 -31557 -16951 19207 9577 27159 33298 -10081 -65014 -73104 -47984 -32314 -56709 -64407
11375 -64407 -90534 -119399 -135176 -146827 -95070 -23070 -37815 3505 22415 -20257 -52355 -101864
11363 -101864 -111908 -84885 -54969 49558 47458 26801 9423 -17385 -2364 15747 3977
11352 3977 -37746 -67457 -74707 -34851 40832 71664 28800 -24967 -16604 3365 -38781 -71163
11340g1163q3737K9124L0321K9896O5418J4710j00573l3172J2091J9652L950k6603
11328a10086P833N2393J2079N514j3830K4662k0767m381r805L1874K6201J0465
11316A2152l4297K4735m2800l2073N4119N7865o7711m9853K1133O606o9616M568
11304a15172R2318j7369l9827n36N2279k466n983M677j1463k9869j683P800J4567
11291e2727J2162j982K9170K4634K3059K4193r536m5930n2471K8251K885k6415
11279d4707o1460J5995K6456k0235N2804N0565l0138j8547m5001m9033O597J4525
11267a02179J6807J3828P278O0549O3759m7100o2504k9494j1576N2156o905K1679
11255b3702j5728L0896k9976J0022K0716J4421k7124j1208j408K3607M8156K4640
$$ plain form
11340 -71163 -154900 -125776 -95455 -65559 -141 14569 -86004 -119176 -107085 -87433 -83483 -110086
11328 -110086 -102253 -49860 -37781 -32267 -46097 -21435 -42202 -46583 -56388 -24514 1687 12152
11316 12152 -22145 2590 -40210 -72283 -18164 39701 -28010 -77863 -56730 -50124 -119740 -115172
11304 -115172 -22854 -40223 -80050 -80586 -28307 -30773 -36756 -32079 -43542 -73411 -75094 -67294 -52727
11291 -52727 -40565 -42547 -13377 11257 34316 58509 48973 3043 -49428 -21177 -18292 -44707
11279 -44707 -106167 -90172 -63716 -83951 -31147 19418 -10720 -29267 -74268 -123301 -116704 -102179
11267 -102179 -85372 -71544 -64266 -3717 60042 12942 -49562 -79056 -90632 -38476 -45381 -23702
11255 -23702 -39430 -8534 -38510 -28488 -7772 6649 -20475 -31683 -33091 -9484 38672 63312
11243F3312J7011k901k1830m5640n2800l7555m889K3993K0115j1474J815N4646
11231C803J3618Q707M647M100m4284j0154k749l3794J6895Q120j8862R110R474
11218c1369J7126j6691j7966r771M2582M3669k332p254k5673J7691r404l875P903
11205D636j9160J3931R558j7230q25k3378j0532k2544L2983M9638q432l1490l5396
11192e8241l4972J5346L2681j6879K7657L6490M3142l9397l4206j4811K868K9444
11180a0878L5014j0696K0202l9621j0777j797j1523j8671l4309J7000N7037R1842
11168H2823L077l3903j3212j5159k2310k0334j7112N5462P4025K1706k1795j5642
11156G7626k0119n9679r5014j6561K6002K2585j6498J3146P210R181p224j8909
$$ plain form
11243 63312 80323 77422 55592 9952 -42848 -80403 -85292 -61299 -41184 -52658 -50843 3803
11231 3803 17421 26128 30775 34875 -9409 -19563 -22312 -56106 -39211 -31091 -49953 -40843 -31369
11218 -31369 -14243 -30934 -48900 -58671 -16089 27580 25248 17994 -7679 10012 608 -3267 4636
11205 4636 -14524 -593 8965 -8265 -9090 -32468 -43000 -65544 -32561 17077 8645 -22845 -58241
11192 -58241 -93213 -77867 -45186 -62065 -34408 2082 45224 5827 -28379 -43190 -40322 -10878
11180 -10878 24136 13440 33642 -5979 -16756 -18553 -30076 -48747 -83056 -66056 -9019 82823
11168 82823 85900 51997 38785 23626 1316 -19018 -36130 19332 93357 115063 93268 77626
11156 77626 57507 -2172 -97186 -113747 -87745 -65160 -81658 -68512 -61302 -52121 -59345 -78254
11144g8254J1153l6722m1330L7795O9332J8924M1668J8406J2501m3983m4310J8357
11132a6463n9317J0750K7818l5820o7242K3744O1803L8943J7800P478J5173k4842
11120a75l7658p4869j4837L7262K8876K4188Q824l4439l1599L2951k6381J2392
11108g5465n4755M1067n5079n8979M3941O5248K6630j4798j8472J5964Q178K5065
11096e1455L8907l1604l6085k630N8787m7640m0405O1620R202r159J7173k8654
11084f1943k1282L45M0662O61k8050J4229j2238o8118J1238M3157K639k4688L1593
11071g1795M2726M9741J707L2482k9537l2707k8174m2359R6J617M2824J5660J6822
11058h97J7832m5218m8080l0033J0370K1202L6383J3313m832l3297J5300J03115
$$ plain form
11144 -78254 -67101 -103823 -145153 -107358 -38026 -19102 22566 40972 53473 9490 -34820 -16463
11132 -16463 -75780 -65030 -37212 -73032 -140274 -116530 -54727 -15784 2016 9494 24667 -175
11120 -175 -37833 -112702 -127539 -90277 -61401 -37213 -28389 -62828 -94427 -61476 -87857 -75465
11108 -75465 -130220 -89153 -144232 -203211 -159270 -94022 -67392 -82190 -100662 -84698 -76520 -51455
11096 -51455 -12548 -44152 -80237 -82867 -24080 -71720 -112125 -50505 -41303 -50462 -33289 -61943
11084 -61943 -83225 -82880 -42218 -41557 -69607 -55378 -67616 -135734 -124496 -81339 -78700 -103388 -71795
11071 -71795 -29069 20672 22379 54861 25324 -7383 -35557 -77916 -77820 -76203 -33379 -17719 -897
11058 -897 16935 -28283 -76363 -106396 -96026 -74824 -38441 -25128 -29960 -63257 -47957 55158
11046E5158O9566M1231M8753j5112j7417J6148K0676j6460l728L5969K227K0723
11034B57734P7030M7586O9614j3219n3783l7232o1346n8877L0423Q6265R3278
11023D37473J01320J02982Q3200k0303r7160l8693m2922J0719n7535l3620K9856
11012D75317j6500R952M6677N378j3676j6166q1418j01088q8096k1534o476k3293
11000A69077O9151J1446n4107p236L5204m5579p3137m4654k6870m9242K2605N48
10988G206k2461o003k0627N88K8604k1654p8548K2679K0708n0197J9228L3084
10976f7393K3070j3200p3301j3598M2945J4819P4476j339j7143k4609P342L2547
10964a5384j6087k0664m7858M4423K2123m0756l163N7590J3337K9138L0417J9300
$$ plain form
11046 55158 124724 165955 214708 199596 182179 198327 219003 202543 198815 234784 237011 257734
11034 257734 334764 382350 451964 438745 384962 347730 286384 227507 257930 344195 437473
11023 437473 538793 641775 724975 704672 607512 568819 525897 536616 479081 445461 475317
11012 475317 458817 468769 515446 520824 507148 490982 409564 308476 220380 198846 192370 169077
11000 169077 238228 249674 195567 188331 223535 177956 104819 60165 33295 -15947 6658 7206
10988 7206 -15255 -21258 -41885 -41297 -12693 -34347 -112895 -90216 -69508 -119705 -100477 -67393
10976 -67393 -44323 -57523 -130824 -144422 -101477 -86658 -12182 -13521 -30664 -55273 -47931 -15384
10964 -15384 -31471 -52135 -99993 -55570 -33447 -74203 -77366 -19776 -6439 22699 53116 72416
10952G2416L0813m5837l5571j4633m2882m638j3337K7381J274L010L758l4956
10940e3202J2367j9391o802K5065j6502k442J4403m0171l5192K7664p493k4338
10928a26034M4485O92j9997O749k6671N5220P032m0922m9036k3651L2541O0190
10916g9402J4962n6260k1141O7288J7051j8425M8857K2441j1377R646o4535j2528
10904h3423J9506O432l6730L3803K6840R197p882j2715m0700k0861j9306J7879
10892a07960j645L4777M7036m61l0114k4424J1536L3625L1737J181k7020k6913
10880e8645R238J0289j9501J2113m1637k0027N681m820k4913J0839k1007K1258
10868a21132R7717m2705L858l70k7076l7222J975K6520j6341J2776L5575J9497
$$ plain form
10952 72416 103229 57392 21821 7188 -35694 -40332 -53669 -26288 -25014 -22004 -18246 -53202
10940 -53202 -40835 -60226 -67028 -41963 -58465 -60907 -46504 -86675 -121867 -94203 -101696 -126034
10928 -126034 -81549 -80857 -100854 -94105 -120776 -65556 -58524 -99446 -148482 -172133 -139592 -79402
10916 -79402 -64440 -120700 -141841 -74553 -57502 -75927 -27070 -4629 -16006 -6360 -70895 -83423
10904 -83423 -63917 -57485 -94215 -60412 -33572 -24375 -32257 -44972 -85672 -106533 -125839 -107960
10892 -107960 -109605 -74828 -27792 -28253 -58367 -82791 -71255 -37630 -5893 -4712 -31732 -58645
10880 -58645 -49407 -39118 -58619 -46506 -88143 -108170 -102489 -107309 -132222 -121383 -142390 -121132
10868 -121132 -23415 -66120 -62262 -62632 -89708 -126930 -124955 -98435 -114776 -102000 -66425 -46928
10856d6928R911M421p588N4139J3448M689k11O818K9552m604l9022j6234k4045
10843a5654l4394l493k4461l32M2765J3288K9286j0506j4566N0230M242j5906
10831B0499m4022p6427L1644L4857J0864n4854k1140R415m4330N0103P0561O9984
10819E7154r3333m8162j1459j0141l9138R3614M3611k7057k5772j5715j8546l5408
10807a30352K8766K8275K3107j2129l0632K6863L1805j8618k3434n4046J0306
10796a20089L1566O1358k4708Q815K2291l9824o7327M774O0387J9997J1361L5893
10784D494J65r104J176O013J6392k2390j3232n6639K4202j4035j8601k1777J9308
10771h4028J6605k7179M2447K6866P233l8447r239J0029L9436j6060n2523j0687
$$ plain form
10856 -46928 -37017 -32596 -40184 13955 27403 32092 31881 38699 68251 63647 24625 8391 -15654
10843 -15654 -50048 -53541 -78002 -78334 -35569 -22281 7005 -3501 -18067 32163 36405 20499
10831 20499 -23523 -99950 -68306 -33449 -22585 -77439 -98579 -89164 -133494 -83391 -12830 57154
10819 57154 -36179 -84341 -95800 -105941 -145079 -51465 -7854 -34911 -60683 -76398 -94944 -130352
10807 -130352 -101586 -73311 -50204 -62333 -92965 -66102 -34297 -52915 -76349 -130395 -120089
10796 -120089 -88523 -27165 -51873 -43058 -20767 -60591 -127918 -123144 -62757 -42760 -31399 4494
10784 4494 4659 -4445 -3269 2744 19136 -3254 -16486 -73125 -48923 -62958 -81559 -103336 -84028
10771 -84028 -67423 -94602 -52155 -25289 -18056 -56503 -65742 -55713 -16277 -32337 -84860 -95547
10759i5547J4256R470N240m6069m3357K2099Q3481L7176j5481n139j9191N2999
10747f3m376n5061Q420K9518k4395m3164q689J9935M7802L1717J1728O182m694
10734A4860M626j4388n0940j303n2595l3381j5754M1295L1249K8775K8900N119
10722a3537O718Q93o9763o1122j8227l2110J7921M5507R9134N2297l9549l4422
10710d6260j818J8290l2612k9824R83K1691J5806O2795k3090l3050J1400J0903
10698b4786j7209j2551O1863J8802l6216r769Q247q790K4033J5510j7695M4536
10686D5975O0553K8848M4951K5877R909M3806K8263M7932P7420M5001M3642R1491
10674E93668R5851P7408J27358J33594J03631O6182L71M3445m235o6319p6381
$$ plain form
10759 -95547 -81291 -71821 -66581 -112650 -156007 -133908 -50427 -13251 -28732 -33871 -53062 -63
10747 -63 -4439 -59500 -51080 -21562 -45957 -89121 -97810 -77875 -30073 1644 13372 19554 14860
10734 14860 19486 5098 -45842 -47145 -99740 -133121 -148875 -107580 -76331 -47556 -18656 -13537
10722 -13537 -6819 -5926 -75689 -136811 -155038 -187148 -169227 -123720 -24586 27711 -11838 -46260
10710 -46260 -48078 -29788 -62400 -92224 -91241 -69550 -53744 9051 -14039 -47089 -35689 -24786
10698 -24786 -41995 -54546 7317 26119 -10097 -19866 -11619 -20409 3624 19134 1439 45975
10686 45975 106528 135376 180327 206204 216113 259919 288182 336114 413534 458535 502177 593668
10674 593668 689519 766927 894285 1027879 1131510 1197692 1198063 1241508 1237273 1170954 1094573
10663A094573q9677j12047j04085j62798r7938q2447P408P608Q5179N2710k4240
10652E74246o58k0536M3912l2560L9680M1579L582J3779N9594K6489Q7271Q5937
10640I22315J02351Q9620Q1039J05234J72069J89416J81041K50472K71794L60182
10630B725533K96866K62052K81757L64113N19915O30079P82626J081669J412852
10621H357462J897918K628235L533985M610338N908894O985031O986133M932732
10613D5840728J483154j372721k320006j661515P286K210703M865279Q078897
10605E7131805J1666757J4395149J3799626P825038j391415q116873r491962p059049
10597G8759076l295277R37595N442231J0245764J5080208J8145393J5830455N683209
$$ plain form
10663 1094573 1004896 892849 788764 625966 528028 445581 452989 460597 545776 598486 574246
10652 574246 573588 553052 596964 564404 604084 645663 649245 663024 722618 749107 836378 922315
10640 922315 1024666 1114286 1195325 1300559 1472628 1662044 1843085 2093557 2365351 2725533
10630 2725533 3022399 3284451 3566208 3930321 4450236 5080315 5862941 6944610 8357462
10621 8357462 10255380 12883615 16417600 21027938 26936832 33921863 40907996 45840728
10613 45840728 47323882 45951161 43631155 41969640 41976926 44187629 49052908 57131805
10605 57131805 68798562 83193711 96993337 104818375 103426960 95310087 85818125 78759076
10597 78759076 75463799 76401394 81843625 92089389 107169597 125314990 141145445 146828654
10589A46828654q042227j6765761j7647427j3998252r086652m323443Q0726M233639
10581H1279257P851668R543451P173864j09836r105163j4176802j3871139j0740910
10573E7844390p206164m149810j601984M44518J923843K319530R55818k107192
10565D8422949n365083p146917o942783n733346m409785l302559k465055j884879
10557A1172542j497045j166223r68030p95189n98707n24868m51785m23574m38886
10548D308235l84052l22299j99274k10002j74385j63706j21114j13360r0786l2592
10538B496665l7580q715N4180m919k3322L9844O7244J6958P0008K9231M4787P3662
10526B818043k2814n7912K3685J404m6711j09777r9226m9618j44232j27863j34827
$$ plain form
10589 146828654 138786427 122020666 104373239 90374987 81288335 76964892 77045618 81279257
10581 81279257 89130925 98674376 105848240 105738404 96633241 82456439 68585300 57844390
10573 57844390 50638226 46488416 44886432 45330950 47254793 49574323 50530141 48422949
10565 48422949 43057866 35910949 28968166 23234820 18825035 15522476 13057421 11172542
10557 11172542 9675497 8509274 7541244 6746055 6147348 5622480 5170695 4747121 4308235
10548 4308235 3924183 3601884 3402610 3192608 3018223 2854517 2733403 2620043 2529257 2496665
10538 2496665 2459085 2450370 2504550 2499631 2476309 2516153 2583397 2600355 2670363 2699594 2744381 2818043
10526 2818043 2795229 2737317 2761002 2762406 2715695 2605918 2506692 2457074 2312842 2184979 2050152
10515B050152j63781j65945j28492j22200j24868q2842m6279p7039k0490o7625
10505A050591l1856n4292r2097m5071k1457L035l6168k7359L048N5173q773k8050
10493G66724P702J6434j0047o5109l0694J178k7413Q154m1360O718L0068K1224
10481F83579j3508P5825M6409l7014j1861l650l2180k5414k1669j6813K9280j4756
10469F58228l986j5346J4977r205R694O0862k1763n5599j1286m2751Q139K7240
10457F19204M7327L0937N247q981k2580o2201O920K1933o0933k9345j3614k5925
10445E07989m1276K0790L4847j6416q199N9470J4292p2265l7960m3335m5378Q8279
10433D60838J1549m671j3455J2239j9496J4674k9299k8546J2483P392J6722J9302
$$ plain form
10515 2050152 1886371 1720426 1591934 1469734 1344866 1262024 1215745 1138706 1118216 1050591
10505 1050591 1018735 964443 872346 827275 805818 808853 772685 745326 748374 803547 794774 766724
10493 766724 774426 790860 780813 715704 685010 686188 658775 666929 625569 632287 662355 683579
10481 683579 670071 745896 792305 755291 743430 739780 707600 682186 660517 643704 672984 658228
10469 658228 654242 638896 653873 644668 654362 715224 693461 637862 626576 583825 591964 619204
10457 619204 666531 697468 702715 693734 671154 608953 615873 637806 576873 547528 533914 507989
10445 507989 466713 487503 522350 505934 497735 557205 571497 499232 461272 417937 372559 460838
10433 460838 472387 467716 454261 466500 447004 461678 432379 403833 416316 423708 440430 459732
10421D59732O270L6981n090r088l703k3940j5506J8066K1145l7893j2737K9489
10409D63726j5049J5071M8743j6185l8220m5656j0833p7064j4624L504L1184M3246
10397C87843r591k2702Q2067P0130j881J4162o4956j2938K6665N988J970K3003
10385D99760n771M9548M1492L9587M3471K2800M6087k1522p054l1403l6528n2503
10373E87964l8626j8379o0827k461R919j6608m4952K9587j6295m5004M4785oj0528
10360D18569J8010O477j8726j480K2414K8484r088m619Q178k9968k260P370O4342
10347E07703P5814k0819l0242n8936O651Q6988K5505m9125j1226k894J0671J9163
10335E59253j3983j5956j3957l0726n5173L3429K5142k3079k5488R012Q088O6329
$$ plain form
10421 459732 466002 502983 497893 488805 485102 461162 445656 463722 484867 446974 434237 463726
10409 463726 448677 463748 512491 496306 458086 412430 401597 324533 309909 313413 344597 387843
10397 387843 378252 355550 437617 507747 505866 520028 455072 442134 468799 474787 476757 499760
10385 499760 493989 543537 585029 624616 668087 690887 736974 715452 708398 676995 640467 587964
10373 587964 549338 530959 470132 467671 477590 460982 416030 445617 429322 384318 429103 429097 418569
10360 418569 436579 443056 424330 422850 445264 473748 464660 460041 468219 438251 435991 443361 507703
10347 507703 583517 562698 532456 473520 480171 567159 592664 543539 532313 529419 540090 559253
10335 559253 545270 529314 515357 484631 429458 462887 488029 464950 439462 448474 456562 522891
10323E22891K3474m8881l436n6664N3312N7743P031K0245k5500N657P7682N8935
10311F92489L6324L307K9529P7066K5472j1155j3821j6054M867N1987K6859P2588
10299I79458O295j0867k6393j5449l5264n6246j2025j9541L594Q1000O6013L6221
10287I96796K8633K2169M8755K9876O6061P6372M9035M0887j8408k87L6916J31474
10275A508279R5600P0103P0940L4899N4068O666R5280R4657K7828L1783R4184
10264B184287O7177j2311K8652J8532N0781O9905L9342J20689M5042N5535R8678
10253B766309J41029J67002J50284J68954J26897J15832J74071J64331K01410
10244D176119K09509K87643L08629J92343L11742L38227L21511L77871M53795
$$ plain form
10323 522891 546365 497484 494048 437384 490696 548439 555470 575715 550215 555872 633554 692489
10311 692489 728813 732120 761649 838715 864187 853032 839211 823157 828024 880011 906870 979458
10299 979458 985753 974886 948493 933044 897780 841534 829509 809968 813562 894562 960575 996796
10287 996796 1025429 1047598 1096353 1126229 1192290 1268662 1317697 1358584 1340176 1339889 1376805 1508279
10275 1508279 1603879 1673982 1744922 1779821 1833889 1840555 1935835 2030492 2058320 2090103 2184287
10264 2184287 2251464 2239153 2267805 2286337 2337118 2407023 2446365 2567054 2612096 2667631 2766309
10253 2766309 2907338 3074340 3224624 3393578 3520475 3636307 3810378 3974709 4176119
10244 4176119 4385628 4673271 4981900 5174243 5485985 5824212 6145723 6523594 6977389
10235F977389M47751M76078N30722O50720O79409Q40334R03916R90468J226655
10226A3723442J268117J438429J668491J894521K088890K306850K546401K868635
10218B9803776L254682L706012M385321N281328O359273P786768R411607J1242690
10210H1231457J3053443J4644458J5752233J6199904J5467612J3458160J0368167
10203A80175434O507479K053719k675337o872108j0186735j2567200j3804099
10196A42631153j3833170j2929837j1450979r751890p862042o136938m615360
10189G6050937l427566k507103j836621j433015j141842q78360n18391j3363O26327
10180F4921003J321537K196040L280713M523623N950444P482517R179266J0951059
$$ plain form
10235 6977389 7425140 7901218 8431940 9082660 9762069 10602403 11506319 12496787 13723442
10226 13723442 14991559 16429988 18098479 19993000 22081890 24388740 26935141 29803776
10218 29803776 33058458 36764470 41149791 46431119 52790392 60577160 69988767 81231457
10210 81231457 94284900 108929358 124681591 140881495 156349107 169807267 180175434
10203 180175434 186682913 188736632 186061295 179189187 169002452 156435252 142631153
10196 142631153 128797983 115868146 104417167 94665277 86803235 80666297 76050937
10189 76050937 72623371 70116268 68279647 66846632 65704790 64826430 64308039 64294676 64921003
10180 64921003 66242540 68438580 71719293 76242916 82193360 89675877 98855143 109806202
10172A09806202J2489091J3417111J3585204J2671261J0670700P520654L632312
10165A83792535o62956m948207q737044j1573431j3416833j4069568j3629209
10158A16755287j2461856j0877720r090151p316506n736765m418444l261189k209885
10150F1382771j231563k33886P47561J777605K918736M181724N680872P460402
10142H2684222R518751J1736418J4227887J6805942J8984476K0760754K1790522
10135A96508972K2229624K2554782K3349812K4848358K6707721K6679445K0940678
10128C63819392P580752q607249j9820314k4058304k4046842k2919159k2317480
10121B49630796k2239546k2656768k3279707k3080657k1560629j9383010j7046354
$$ plain form
10172 109806202 122295293 135712404 149297608 161968869 172639569 180160223 183792535
10165 183792535 183129579 178181372 169444328 157870897 144454064 130384496 116755287
10158 116755287 104293431 93415711 84325560 77009054 71272289 66853845 63592656 61382771
10150 61382771 60151208 59917322 60664883 62442488 65361224 69542948 75223820 82684222
10142 82684222 92202973 103939391 118167278 134973220 153957696 174718450 196508972
10135 196508972 218738596 241293378 264643190 289491548 316199269 342878714 363819392
10128 363819392 371400144 362792895 342972581 318914277 294867435 271948276 249630796
10121 249630796 227391250 204734482 181454775 158374118 136813489 117430479 100384125
10114A00384125j4356190j1810922r617302p842444o475168n393449m563261l909684
10106C6415705l451873l099371k708741k370142k054959j751503j604857j521929
10098A7852330j261550j078076r72413q40210p86222o82888n94351n56486m97095
10089A0583039n37165m42390l97748l86857l27931k99575k72784k96894k46238
10080G375457k43790k15321k03335k08895k06641j64132j24646j31058j67214
10071E710425j82184j68721j19329j02215q3325j27979j14497j55365j60002j28472
10061D368336p4405n9749r8151j37782j19773q8543m4710n6759q3081p1828k9654
10050C503901m4985l6699l9247p1764q3620k0012n1980M365J8210l166o1246p4061
$$ plain form
10114 100384125 86027935 74217013 64599711 56757267 50282099 44888650 40325389 36415705
10106 36415705 32963832 29864461 27155720 24785578 22730619 20979116 19374259 17852330
10098 17852330 16590780 15512704 14540291 13700081 12913859 12230971 11636620 11080134 10583039
10089 10583039 10045874 9603484 9205736 8818879 8490948 8191373 7918589 7621695 7375457
10080 7375457 7131667 6916346 6713011 6504116 6297475 6133343 6008697 5877639 5710425
10071 5710425 5528241 5359520 5240191 5137976 5054651 4926672 4812175 4656810 4496808 4368336
10061 4368336 4293931 4234182 4136031 3998249 3878476 3789933 3745223 3688464 3605383 3533555 3503901
10050 3503901 3458916 3422217 3382970 3311206 3227586 3207574 3155594 3159959 3178169 3175003 3113757 3039696
10038C039696k1049m2010o7376q8040j02267n7744m2278l6142l9057p5508j28596
10027B339629l6708k1853m2259k0064n587J5428o8315M2061N6584p9216j01567
10016B078133J5287n03j0854J3170l494O9375L2578k7984l6506K1950J04501j2026
10004B243627m4858N9443M9678m6399j21011j06403o9940k5215m8595k6357m6837
9993A817133m7387j02604n4292q1059n6142m2226k1321k0961j3361J0275J5919
9982A403974l220K5220m4674m0331l1347n8825Q631l8428J0305K6517L6610Q1829
9970A376261k3498m7464p7572p347O246l540n9043r178J2998p3036q2398l4735
9958I77694k94L0762k5812k9819L0178M649K0138k8971k9125M7358J1988O95m0161
$$ plain form
10038 3039696 3018647 2976637 2909261 2821221 2718954 2661210 2618932 2582790 2543733 2468225 2339629
10027 2339629 2302921 2281068 2238809 2218745 2213158 2228586 2160271 2202332 2258916 2179700 2078133
10016 2078133 2093420 2092917 2082063 2095233 2091739 2161114 2193692 2165708 2129202 2151152 2255653 2243627
10004 2243627 2198769 2258212 2307890 2261491 2140480 2034077 1964137 1938922 1890327 1863970 1817133
9993 1817133 1769746 1667142 1612850 1531791 1475649 1433423 1412102 1391141 1377780 1388055 1403974
9982 1403974 1400754 1425974 1381300 1340969 1309622 1250797 1259428 1221000 1231305 1257822 1294432 1376261
9970 1376261 1352763 1305299 1227727 1220380 1226626 1223086 1164043 1154865 1167863 1094827 1012429 977694
9958 977694 977400 1008162 982350 952531 982709 987358 1007496 978525 949400 996758 1008746 1009441 969280
9945I69280K9475J441k3887j4303J2617Q905m3436J1635Q547L3667l2475k3695
9933I37771o002O7690K5404J4741k0934p2189q9145n9486m0730j4707j1284j7131
9921G13998L8256l6272K544l7253m2930J0591k0303n530O722L3246N2598K4580
9909G40247J0667N221l8966l3632n119J2155k5391l8554K4068N845j5617K576
9897F43500R270M4988J1400K6006o4288m2811k0313K054K6299m3486M7894M0325
9885F80838o5589l4638Q365k4521q412l227l9970j748L76N1183L9156k746k1573
9872E77494M1365k1858p237K7862m5642M762K8731k019m2148m7477l4777k175
9860D76881K1898N422R81M0Q801L4739K4887j2782J5573m1101J7867m0891J2128
$$ plain form
9945 969280 998755 1000196 976309 962006 974623 983528 940092 951727 960274 993941 961466 937771
9933 937771 931769 999459 1024863 1039604 1018670 946481 857336 797850 757120 742413 731129 713998
9921 713998 752254 715982 718526 681273 638343 648934 628631 623101 629823 663069 715667 740247
9909 740247 750914 756135 717169 683537 678418 690573 665182 626628 650696 656541 640924 643500
9897 643500 652770 697758 709158 735164 670876 628065 607752 609806 636105 592619 640513 680838
9885 680838 615249 580611 588976 564455 556043 552816 512846 511098 511474 562657 601813 599067 577494
9872 577494 618859 597001 589764 617626 571984 576746 605477 603458 561310 513833 479056 476881
9860 476881 498779 504201 505182 505222 514023 548762 573649 560867 576440 535339 553206 512315 524443
9847E24443r29m7226o0958J9459K8797K8553l8757n48o200M7440k7218j0995L8239
9834D94100J3582N661l638l9893l9865j0968J8071J6679J1160L0820K9544M2280
9822E67533L585k0272K3226L9895J1298o3373j0901O4572N2683L1918Q8060O8474
9810H56698L7642J0965O7257L2208R7174J32503R8936k6799o529J4638r2991n9240
9798A162462k3172k0398n5872o2540j15048p3465q1080l8149m5477K3726K9629
9787G00616m9816K8974J7865k3714l1706K7093O09l4963K8292K9310J8075l279
9775G07356J1979L1839R1589J01561N4324Q9875M0802N5912N0064j0993l7998
9764A186310J1831O27l1714n6770m8607R383k4040p8466j00242o2320m3479n0271
$$ plain form
9847 524443 523514 476288 415330 434789 463586 492139 453382 452834 446634 494074 466856 455861 494100
9834 494100 507682 513343 509705 469812 429947 418979 437050 453729 464889 495709 525253 567533
9822 567533 571118 550846 574072 613967 625265 561892 550991 615563 668246 700164 788224 856698
9810 856698 894340 905305 972562 1004770 1101944 1234447 1333383 1306584 1300055 1314693 1221702 1162462
9798 1162462 1139290 1118892 1063020 1000480 885432 811967 730887 692738 647261 670987 700616
9787 700616 650800 679774 697639 673925 642219 669312 669921 634958 663250 692560 710635 707356
9775 707356 719335 751174 842763 944324 998648 1088523 1129325 1185237 1235301 1224308 1186310
9764 1186310 1198141 1198768 1167054 1110284 1061677 1071060 1047020 968554 868312 805992 762513 712242
9752G12242p4465o0472j230P491O3512L7496l439J0562J4843O067J1403O6666
9740G90676Q7641J9016J08311J07144Q5237J34629J09862Q4169R4656J16825P0928
9729A809094R2911P428j4078j426P96l2457l2719n6737o0999j10753j16288j39229
9717A345543j06165j43492j45000j16054m6546n2344q2889r9165p5256k279J8239
9706D94592J0896j1811m3332k5149N874k4733l8553L687j1217l8542l7515R841
9694B94038J57l3891j690j3885l487J8885k1157J2075L7374J0219m9061l1528
9682B18049M957J9066j4295K2879k889M1566N9305Q741J8694n1022J9480N0159
9670C94690N485j6204l8765q5986k4506L8151Q552m5454K2644K2690j365Q652
$$ plain form
9752 712242 637777 577305 576075 583566 647078 684574 681135 691697 706540 712607 724010 790676
9740 790676 878317 897333 1005644 1112788 1198025 1332654 1442516 1526685 1621341 1738166 1809094
9729 1809094 1902005 1909433 1895355 1893929 1894725 1862268 1829549 1772812 1711813 1601060 1484772 1345543
9717 1345543 1239378 1095886 950886 834832 788286 735942 653053 553888 478632 476353 494592
9706 494592 505488 493677 450345 425196 431070 406337 367784 371471 360254 321712 284197 294038
9694 294038 294195 260304 258614 244729 241242 260127 238970 251045 288419 298638 249577 218049
9682 218049 223006 242072 227777 250656 247767 289333 348638 357379 376073 325051 344531 394690
9670 394690 400175 383971 345206 259220 234714 272865 281417 235963 258607 281297 279932 288584
9658B88584O3815J60564J70816J76935R6186j73013j94918j42839o9028l7920
9648C39182l2202n6191m1643L123M5461O1901n822j6945m6829n5280K5532L2956
9636B53243o3699k952K3011r93l1723k9784N8868N6452j8310j3632l6816m204
9624A89461K5943M1444m5164n0042m3841q764K4827j9076K2950L8160L4737K8093
9612B38728r543j6147K2578l4140o1830j7197K5331O0779l5238p606P501J3361
9600A86577m325L959k8155j0890q843m1802J02687O0616k2982l3548J3088M3878
9588B60260j9919k7233P65J0814k9220k4722r490K1345n1002L0213M3741K4268
9576B29820k6176k5058j2750l4803L5918K9759m7578l6712M728P5313M7344k7350
$$ plain form
9658 288584 352399 512963 683779 860714 956900 783887 588969 446130 377102 339182
9648 339182 306980 250789 209146 212269 257730 319631 313809 296864 250035 194755 220287 253243
9636 253243 189544 186592 209603 208610 176887 147103 205971 262423 244113 230481 193665 189461
9624 189461 215404 256848 211684 161642 117801 109037 133864 114788 137738 175898 210635 238728
9612 238728 229185 213038 235616 201476 139646 122449 147780 208559 173321 165715 173216 186577
9600 186577 182252 186211 158056 147166 138323 96521 199208 259824 236842 203294 216382 260260
9588 260260 240341 213108 213873 224687 195467 170745 161255 182600 131598 161811 205552 229820
9576 229820 203644 178586 165836 131033 166951 196710 149132 112420 117148 192461 239805 212455
9564B12455l3883n529j7840n4609N709M5428o813N0117N0801J2866n8501r2151
9552A08050k0702L8536J11761k423o7810J8022L7493l142p475k4285m5461R442
9540A52006J4775M2420N1433k2254J5300J0774K2579m564o9697n7573k1723m3336
9528I0140j4636K2332R5731M339l7736J3991l1519k2813K1528l3356l0363M0748
9516A18386J5243m0271J2284L4174J7600q905k8680j6711k6880K9810r455J6974
9504A13569J2788J8406K4371N9211j832k149M3208k4366k3437n4056m3986K9361
9492A51088L9944n0757r127k7432l7088J3201J6549k1791j4619L6948j2966K3426
9480A07376J1502j1969o0217n1183L1636J7477L7078J6482k4652L7792k1366O2666
$$ plain form
9564 212455 178572 173043 155203 100594 106303 151731 144918 195035 245836 258702 200201 108050
9552 108050 87348 125884 237645 235222 167412 185434 222927 219785 212310 188025 142564 152006
9540 152006 166781 209201 260634 238380 253680 264454 287033 282469 212772 155199 133476 90140
9528 90140 75504 97836 193567 197906 160170 174161 142642 119829 141357 108001 77638 118386
9516 118386 133629 93358 105642 139816 157416 148511 119831 103120 76240 106050 96595 113569
9504 113569 126357 144763 169134 228345 226513 224364 267572 243206 219769 165713 121727 151088
9492 151088 191032 140275 131148 103716 66628 79829 96378 74587 59968 96916 83950 107376
9480 107376 118878 106909 46692 -4491 27145 44622 81700 98182 73530 111322 89956 152622
9468A52622J538j1562j736K3765k0568l5581j2129k247n735k3833r108P5346L9769
9455A70541k4766l6447N514P110L2447p839J487O380N0482l8410J730k0140K7022
9442A75111K0140j3554j0411M5394P494l1842m8580k5160J5253N9107K1658n8082
9430A56528o7093j1838K1817j1084P554q206J7988r766N5695k4817j0319K8735
9418A45194K6369j0432K9027J2791m2554l4203k4827J3767l9588k3710M641K1881
9406G8356M210l867L8405J7011l1703k7719k3822M0851Q234P025l221J1506L0300
9393A45566o07J0008j8719j1525K1770l1631m2901l0600q376L4015O6347j0068
9381A23279j7615q223m646J81k3077R246M6330l6317r9007j4837M4118L6012k2647
$$ plain form
9468 152622 154160 142598 140862 164627 144059 108478 96349 94102 88367 64534 55426 130772 170541
9455 170541 145775 109328 114842 121952 154399 146560 148047 154427 204909 166499 168229 148089 175111
9442 175111 195251 181697 171286 216680 224174 192332 143752 118592 133845 192952 214610 156528
9430 156528 89435 77597 99414 88330 95884 87678 105666 95900 151595 126778 116459 145194
9418 145194 171563 161131 190158 202949 160395 126192 101365 115132 75544 51834 56475 78356
9406 78356 82566 78699 117104 134115 102412 74693 50871 91722 99956 106981 103760 115266 145566
9393 145566 144959 154967 136248 124723 146493 114862 71961 41361 32985 67000 133347 123279
9381 123279 105664 97441 92795 92976 69899 79145 125475 89158 -9849 -24686 19432 55444 32797
9368C2797J0337k3605m2694o7365L8072Q7337j4594k9174J33J2118k0333N9581
9356D2610L0164J8162K0485l9332N099K813M2876J6623o9162j159M5199K2069
9344A36447N9554j0810p4979L696l3179k3008J5210M6734L7417j9100j1999j5210
9332A10773m3385l1433L2830K0397o8297j3107O6676Q1285K1087p0310j6986K9412
9320A18942L1893k9045n9740O404N4035l8333m9592N4219P0129K4657R991l1249
9308A62311l9565j1007l414J2253k4447k9020J5909N056K9639N7352N187j7808
9296A62446m2661l8575l2832P5659L9489r177j6990n6940n0491k6450n578L6934
9284C4834P0442p96J1295l0870K1898K9869K4748n146n0752L1522l1308L0741
$$ plain form
9368 32797 43134 19529 -23165 -90530 -52458 34879 20285 -8889 -8756 3362 -16971 42610
9356 42610 72774 90936 111421 72089 77188 80001 122877 139500 70338 69179 114378 136447
9344 136447 196001 185191 110212 113908 80729 57721 72931 119665 157082 137982 125983 110773
9332 110773 67388 35955 68785 89182 20885 7778 74454 155739 176826 106516 89530 118942
9320 118942 150835 121790 62050 68454 122489 84156 34564 88783 158912 183569 193560 162311
9308 162311 122746 111739 108325 120578 96131 67111 83020 88076 117715 175067 180254 162446
9296 162446 119785 81210 48378 124037 163526 154349 137359 80419 29928 3478 -2100 34834
9284 34834 105276 104480 115775 84905 106803 136672 161420 156274 105522 137044 105736 136477
9272A36477j3110L5801q52l9366m5150J4060m3013j2547N9974L7985m412K1416
9260A47263j1982o8519k9078j415j5245k3778k2695K280N4571O466j7848K4862
9248D4882M1945R102J7625l0180l3745m8272M4319K9725j8617k0112O926L4964
9236G8562K9231k451L1200r715k0461o575l7531k9731L561P204J9579j2078l3537
9223A7258l180K4982k0644j4118J7704O285K5768l1432K6023L5437J3188m1258
9211E6013m3664L8101M2638R226L9654n5616n6380j5921j2337K1870j1409K5181
9199C7356J9947j6820j4099J3387J4834J3377L191o832P064J3995j099j4305p7785
9186g789k1914L4312j2416M669N025K1994J7665l4562K6082K5037n068M7094K5278
$$ plain form
9272 136477 123367 159168 158316 118950 73800 87860 44847 32300 92274 130259 125847 147263
9260 147263 135281 66762 37684 36269 21024 -2754 -25449 -23169 31402 37868 20020 44882
9248 44882 86827 95929 113554 83374 49629 1357 45676 75401 56784 36672 43598 78562
9236 78562 107793 105342 136542 126827 106366 99791 62260 32529 36090 43294 62873 50795 17258
9223 17258 14078 39060 18416 4298 22002 28287 54055 22623 48646 84083 97271 56013
9211 56013 12349 50450 93088 102314 141968 86352 29972 14051 1714 23584 12175 37356
9199 37356 57303 40483 26384 39771 54605 67982 71173 64341 71405 85400 84301 69996 -7789
9186 -7789 -29703 4609 -7807 -3138 1887 23881 41546 6984 33066 58103 53035 100129 125407
9173A25407p0279K5661J6597l0994n412l4939J5261J1508K8422q84j2030l4499
9161C3819n2991O19L1280m7964P494N1743K9829j4284K1802N291J735K1889k192
9148H8070o0669M3029N7928R012m0825l5866K0267k590n061L1041K3225L575N196
9135A36332l2113l8967j1901J6095j9454O094N805J2750l1964l3212j2427K9872
9123B6910K2137J2174N0895M959n8445k394j1250K00L7174L3642J8606k8553J068
9110A07123m3947J5632l5649j1449k6985M426L9287j778M587k7194l234N0076
9098G0895L512k6268r851l6771K0709K9747J2886m5330m634J3792N913L2958J0654
9085G8212j5332L6907k5817o3280m7024j2500O2049P2755j951j62J5540L681j6291
$$ plain form
9173 125407 55128 80789 97386 66392 60980 26041 41302 52810 81232 80348 68318 33819
9161 33819 -19172 -18553 12727 -35237 -27743 24000 53829 39545 61347 66638 68373 90262 88070
9148 88070 27401 70430 128358 137370 96545 60679 80946 78356 73295 104336 127561 131136 136332
9135 136332 104219 65252 53351 69446 49992 56086 61891 74641 42677 9465 -2962 26910
9123 26910 49047 61221 112116 117075 58630 56236 44986 45186 82360 116002 134608 106055 107123
9110 107123 63176 78808 43159 31710 4725 9151 48438 46660 51247 24053 20819 70895
9098 70895 74407 48139 38288 1517 22226 51973 64859 19529 14895 28687 34600 67558 78212
9085 78212 62880 99787 73970 10690 -36334 -48834 13215 85970 84019 83857 99397 103078 86787
9072H6787j6744m6408K2607j202l8104J3615Q1258K0092k8753J3993l1165j24769
9060d8793j4846K2574O3395M9056r601k298l639m95L3840r295l4152o4109N3707
9047C5344M6979N649J3402j5046n919J8138k1977j2397L1285k8269J8360M7270
9035A32819k3405j1798j2592P842j0751m5619k7858k3746j4725K3986j629k528
9023a0004P1454K7064n4009k4664j2708J8008L3487K2666m0621J517K5342m7154
9011A0378k1621o727N1869L2040m6817l7166N781L6631L4649Q056k7023j0870
8999B9180l2821j3673L729k0398J1558K2685q45J9980P8155K3420j9000j3305
8987H8665L6635L4504l5024q069n4490p5023P845j946K1107K9464m4317j3206
$$ plain form
9072 86787 70043 23635 46242 45040 6936 20551 101809 121901 93148 107141 75976 -48793
9060 -48793 -63639 -41065 22330 71386 61785 59487 55848 55353 89193 79898 45746 -18363 35344
9047 35344 82323 87972 101374 86328 80409 98547 76570 64173 95458 67189 85549 132819
9035 132819 109414 97616 85024 92866 82115 36496 8638 -15108 -29833 -5847 -7476 -10004
9023 -10004 61450 88514 34505 9841 -2867 15141 48628 71294 30673 32190 57532 10378
9011 10378 -11243 -17970 33899 65939 19122 -18044 -12263 24368 59017 67073 40050 29180
8999 29180 -3641 -17314 -13585 -33983 -22425 260 -585 19395 97550 120970 101970 88665
8987 88665 125300 159804 124780 116711 62221 -12802 -4957 -6903 14204 43668 -649 -13855
8975a3855m3485J8534k1219n757J7660L3040M916m8537k2361K8357P3755J7427
8963C8475K9247N2251o7635q4457J0683K6734k1388R49L3702K5866k7042M24q521
8950I288k1720m1517J8554J5687m1649q022K173O5689O3525P0937l114m4231l5722
8937D9878j3262J4882L5075n0587k6789M8360n62k6257j4313j2719j5215J4559
8925C050o050o4408j5086J1216K1678N121L2637K5389M0888k2167K5115M7179
8913A04562L3565l8155m3647O866l3683O772j1399j5774K1062L4958J4382n2031
8901B7478m8822J9303K3102N6998k9623n542K9167k5988J2166l0673o026L7182
8889E8722J2387L7429L6540m7147k7969O977K1680k4262m4995p5935j4087j8448
$$ plain form
8975 -13855 -57340 -38806 -60025 -65782 -48122 -15082 -10166 -58703 -81064 -52707 21048 38475
8963 38475 67722 119973 52338 -32119 -21436 5298 -16090 -15141 18561 44427 17385 17809 9288
8950 9288 -12432 -53949 -35395 -19708 -61357 -69379 -67206 -1517 62008 132945 129831 85600 49878
8937 49878 36616 51498 86573 35986 9197 57557 56995 30738 16425 3706 -11509 3050
8925 3050 -3000 -67408 -82494 -71278 -49600 -44479 -11842 13547 54435 32268 57383 104562
8913 104562 138127 99972 56325 63191 29508 36280 24881 9107 30169 65127 79509 27478
8901 27478 -21344 -2041 21061 78059 48436 42894 72061 46073 58239 27566 21540 58722
8889 58722 71109 108538 145078 97931 69962 76939 98619 74357 29362 -46573 -60660 -79108
8877g9108N6808L6302M3876n884M940J5212K2766K2031q552j08191J6997J1007
8865B8204N6599L1509l8949q833l5891j9707j2333o855j1129j3074K2148K1944
8853A3633K3757J8294J8608l6600k5811j8354m345j7254j8149J4994J6285P666
8841g276N361q6112M4146P1624k9412k367J904q167L0530j2404M017J6456N9052
8828H7352O737k6330n4059J7353Q5611J5601j157n1300l200L0452L6705J044n1175
8815I3634r1325l8798K3327N5741K9425J8659j7101k2801j8177L0853K3835m3243
8803D4029J4369N7190O2658r597j5397j7366l5484l8578j5480P615J7212L5401
8791A06572k221l2753q034L6438J8857J3513k3209n2553j0829o8861J6694P0933
$$ plain form
8877 -79108 -22300 14002 57878 51994 56934 72146 94912 116943 108391 200 17197 28204
8865 28204 84803 116312 77363 68530 32639 12932 599 -6256 -17385 -30459 -8311 13633
8853 13633 37390 55684 74292 37692 11881 -6473 -10818 -28072 -46221 -31227 -14942 -7276
8841 -7276 -1915 -88027 -43881 27743 -1669 -4036 -2132 -10299 20231 7827 11844 28300 87352
8828 87352 94089 67759 13700 31053 116664 132265 131108 79808 76608 107060 143765 144809 93634
8815 93634 2309 -36489 -13162 42579 72004 90663 73562 50761 32584 63437 87272 44029
8803 44029 58398 115588 178246 168649 153252 135886 100402 61824 46344 53959 71171 106572
8791 106572 104351 71598 63564 100002 118859 132372 109163 56610 45781 -23080 -6386 64547
8779F4547N5705L2214j4186n5081M060j1256m1952o89J3249j8265N30M0236k1998
8766D7114j5063J7923O1R581J9739l4030j6921k8176K9867k504M0739L1178l2046
8753F7462J8506k232m3088o064J1714J1877j5614K8282l8050o2969o240J7608
8741a8808O4049j602J552L270J5352K6910R825k0205j1803j4608J63K1394k7667
8728D7822Q480J3891N412L186o6536k7928J8226M6798N276m9138O183J0396k217
8715A9851j7361J0873p068J7988l2948j6817J120K7046O8488k6099m8664K1645
8703A8054N1961J3453l4185k7649N2493k1229o4094l1992N366j1709l7499K4278
8691f2752L7618N7608N9873R881k2047k3593J788O4171O253o1591j4386r587J4426
$$ plain form
8779 64547 120252 152466 138280 83199 87259 76003 34051 33362 46611 28346 28876 69112 47114
8766 47114 32051 49974 50035 59616 79355 45325 28404 228 30095 27591 68330 99508 67462
8753 67462 85968 83736 40648 34584 46298 58175 42561 70843 32793 -30176 -36416 -18808
8741 -18808 45241 43639 45191 48461 63813 90723 100548 80343 68540 53932 54095 75489 47822
8728 47822 56302 70193 75605 78791 12255 -15673 2553 49351 54627 5489 11672 22068 19851
8715 19851 2490 13363 6295 24283 -8665 -25482 -24362 2684 71172 45073 -3591 18054
8703 18054 70015 83468 49283 21634 74127 52898 -11196 -43188 -37822 -49531 -87030 -62752
8691 -62752 -25134 32474 92347 102228 80181 56588 58376 122547 128800 67209 52823 43236 57662
8678E7662Q66O3875K9129k3130J4589n5021k6434l0205J0060J1348O2386j2713
8666A02412l8501M6634n0253m6644k4596K114K4327R180J9423q194M596K5417
8654F5915M1029k8302M1754m4546n736L3383L3240L0580p5045k7818K8202j2086
8642H0570J3283n1649p788M385l5860k8864N436J3788L097j1211M3358k0713r046
8629a214M4381J2973O485k4691m3443l6384K9635L7449j4697J4523n874J0905
8617C0048P2694k6427J97k6512J0140p735j9656M3194J4627m055P486M3386K6800
8604A64187J0847n9751m5302O257k1733m2359P618J5916K1685J6856J9622j2347
8592H1496j0026J2435J0863J8364N8859R217q456o839J0191M8523j0119k3022
$$ plain form
8678 57662 58528 122403 151532 128402 142991 87970 61536 31331 41391 52739 115125 102412
8666 102412 63911 110545 60292 13648 -10948 -8834 15493 24673 44096 35902 40498 65915
8654 65915 106944 78642 120396 75850 70114 103497 136737 167317 92272 64454 92656 80570
8642 80570 93853 42204 34416 38801 2941 -25923 -20487 -6699 -3602 -14813 28545 7832 -1214
8629 -1214 43167 56140 62625 37934 -5509 -41893 -12258 25191 10494 25017 19143 30048
8617 30048 102742 76315 76512 50000 60140 52405 32749 75943 90570 86515 94001 137387 164187
8604 164187 175034 115283 69981 76238 54505 12146 19764 35680 57365 74221 93843 81496
8592 81496 71470 83905 94768 113132 171991 181208 172752 165913 176104 224627 214508 191486
8580A91486M2207N2721J0016K1909k0539K3017O5090R539l5465m8639J7858K6797
8568C55997O1987J07335J19958J05748N3196j8351j19710j22194r2726j15944
8558C35296o3614l9513q18J9082L297p2726N315R117l5292M1089O0637P6232P7856
8545D15958Q9106J30529J05403J47535L8284j4049r7481j63601j21816p0030j3329
8534D46509q778n9178o2329m422O63k8514L9019K1291M343Q3946R0105J19415
8522F42070J29239K0413J3300k9095j21917q3971q3095r9804n3883l1370R51k9117
8510B73721k5358j3862p0927p1105N392N5471N8981R5946P7810N6059P8439R7731
8498F18298R5868O3172L3478j10291j61831j25349j25484J9181O813k9855j851
$$ plain form
8580 191486 233693 286414 296430 318339 297800 320817 385907 395446 359981 311342 329200 355997
8568 355997 417984 525319 645277 751025 804221 785870 666160 543966 451240 335296
8558 335296 271682 232169 231351 250433 253730 181004 186319 195436 160144 201233 261870 338102 415958
8545 415958 505064 635593 740996 888531 926815 912766 815285 651684 529868 459838 446509
8534 446509 437731 378553 316224 311802 312465 283951 322970 344261 348604 432550 522655 642070
8522 642070 771309 791722 805022 775927 654010 570039 486944 387140 333257 301887 302838 273721
8510 273721 248363 234501 163574 92469 97861 153332 212313 308259 386069 442128 520567 618298
8498 618298 714166 777338 810816 700525 538694 413345 287861 307042 313855 284000 282149
8487B82149j5773k6295r1n1148k4006k3203n1549j4369k1351K1361K1659N267
8475A02651q541l3604K4736M178K4250m534J1217K7991M421k2073j5237K362m4213
8462G3604k4959L588J7277o3530K440N463l428r452q598J9450M3943K0704j146
8449G5356j6065k4185M78M7443m4437N295M955J9990M0984j8026p3922J6792p817
8436B6841P497P6534J5829m6474j0376L060J5210k5035o943L3676k6215j4818
8424D8786K5785O4155K826o6790j7804K773j4275m4853K51P758J7959N027K6332
8411E7930n7679l4865M598O3741P583o662m8355j2327L7671J4677m9922K4314
8399G04O8373o8j7060L506l3915L2458L5420J952p963j9304m6984j8248l834L05
$$ plain form
8487 282149 266376 240081 239990 188842 164836 141633 90084 75715 54364 75725 97384 102651
8475 102651 94110 60506 85242 89420 113670 109136 120353 148344 152765 130692 115455 117817 73604
8462 73604 48645 52233 69510 5980 8420 13883 10455 1003 -7595 11855 55798 76502 75356
8449 75356 59291 35106 35584 83027 38590 43885 48840 68830 109814 91788 17866 34658 26841
8436 26841 34338 110872 126701 80227 69851 72911 88121 63086 56143 89819 63604 48786
8424 48786 74571 138726 141552 74762 56958 59731 45456 603 854 8612 26571 31598 57930
8411 57930 251 -34614 -30016 33725 41308 34646 -13709 -26036 11635 26312 -23610 704
8399 704 69077 69009 51949 55455 21540 53998 89418 91370 83407 64103 17119 -1129 -4963 -4658
8385d658N0946k4324o798q117k2700n512N4650K2041k2864j764P59L6734M9740
8372A18133k2171o003J1626o7278l7739j1704k6264K0353L8128Q573J16N6371
8360H2141p007k242k1315r8454l9558Q5425O2847j7970K1561J0533n3011j7471
8348E479J6210N678m4097L5266l1438K9771K8920n3813N278l8432l7870R2127
8336A3079J3346K527q579k7615j0352Q997N1326j1263j2942J1570j2883r435j709
8323F067k9630M188L1228K319p924m9821J4806L5343j3593j681q784K1699l3048
8310b8831l7853J5710J3102M092J7697K1291L1284k0249m2269J5123P755L8600
8298C5452J2839p4595j4209Q1354P1464J2411m2911l7629q122j9955L3283L1889
$$ plain form
8385 -4658 46288 21964 15166 7049 -15651 -21163 33487 55528 32664 30900 31659 68393 118133
8372 118133 95962 89959 101585 34307 -3432 -15136 -41400 -21047 17081 25654 25770 82141
8360 82141 75134 72892 51577 -46877 -86435 -1010 61837 43867 65428 75961 22950 5479
8348 5479 21689 27367 -16730 18536 -12902 16869 45789 -8024 -2746 -41178 -79048 13079
8336 13079 26425 28952 20373 -7242 -17594 -8597 42729 31466 18524 30094 17211 7776 6067
8323 6067 -23563 -19375 11853 14172 6248 -43573 -28767 6576 -7017 -8698 -17482 4217 -28831
8310 -28831 -66684 -50974 -37872 -33780 -16083 5208 36492 16243 -26026 -10903 -3148 35452
8298 35452 48291 -26304 -40513 40841 112305 124716 81805 44176 36054 16099 49382 81271
8286H1271K8618j1176J1821j5928m8796j5846J1832N3724J1013J349K120L4609
8274A44611L403n1848k7845O427M0284l9592l5917l5880n7380n711O2923L9497
8262D2972J5730l2388n2121N0518M5942P148m4738l1823k9838l5222O210R0394
8250C2784l221l7891R355N5444l2982j5555O7545L310k2337m0978M9684N5856
8238A21014K0062o618n3408m6162L3731P6822n3091m8703M0795J2104n8355k220
8226C5971k8413l2583l1293L4120J5641N0882J9501J3846l558J0304K3116o5300
8214D2234l9232L8890K16n4539N547N1337k9404p4235q526P4775J2222j1332J5877
8201B3830o0533J5035L6093n0922K2312k8006n1346J2466L7484N0647L105K1774
$$ plain form
8286 81271 109889 98713 110534 94606 45810 29964 41796 95520 106533 107882 110002 144611
8274 144611 148014 96166 68321 74748 115032 75440 39523 3643 -53737 -59448 3475 42972
8262 42972 58702 26314 -25807 24711 70653 77801 33063 1240 -28598 -63820 -57610 32784
8250 32784 29563 -8328 1027 56471 23489 7934 75479 78789 56452 15474 65158 121014
8238 121014 141076 134458 81050 34888 68619 145441 92350 43647 84442 96546 38191 35971
8226 35971 7558 -25025 -56318 -22198 -6557 44325 63826 77672 74114 84418 107534 42234
8214 42234 3002 41892 42108 -12431 -6884 44453 15049 -59186 -67712 7063 19285 7953 23830
8201 23830 -36703 -21668 14425 -36497 -14185 -42191 -93537 -81071 -43587 7060 10165 31939
8189C1939k0130K6862L1030l6292k429P6958K2031p340n9634l4321M0924Q350
8177G7948o2798m5469r963P8440K043m0335M2241K3284n1794M9228J3651m1816
8165C4660m1132K4997k8189m5876Q5003J7581l3123j4933K1442q443j3174L6621
8153C5434n4785l7622N1698J4850k5323N7176N2311k2140m5624K3071k8445K8036
8141D8637M9384L2073m3781o7100m0474J88K1273R886K5914o2603r058M8367j2437
8128B69k0111J2329J7255J3345N335M2966M2068k3662J215l4117m2194m1901P322
8115a9881J297j6065j4009j7339M890L913K9230K5166j2944k0921J4701L934m2723
8102f0751l640Q7550L4178k4877k1502N152m0111j7622N6675M8961k7924p3347
$$ plain form
8189 31939 11809 38671 69701 33409 30980 107938 129969 122629 62995 28674 69598 77948
8177 77948 15150 -30319 -40282 38158 40201 -134 42107 65391 13597 62825 76476 34660
8165 34660 -6472 18525 -9664 -55540 29463 47044 13921 -1012 20430 11987 -1187 35434
8153 35434 -19351 -56973 -5275 9575 -15748 41428 93739 71599 25975 49046 20601 48637
8141 48637 98021 130094 86313 19213 -21261 -21073 200 10086 36000 -26603 -35661 12706 269
8128 269 -19842 -7513 9742 23087 28422 71388 113456 89794 91009 56892 14698 -27203 -19881
8115 -19881 -18584 -34649 -48658 -65997 -61107 -57194 -27964 -2798 -15742 -36663 -21962 -18028 -60751
8102 -60751 -64391 23159 57337 32460 10958 16110 -24001 -41623 15052 64013 36089 -37258
8090c7258K345J05558P916q7831j8920L4446J6499L0707P801q949J5711k6089
8078D1936J2230Q492K4431O2156M7127N7251n4383r9756m7238J9422P929n8093
8066B1504n2467k7438J7310O3395L8443M5503k7647m6586J5868R94m4004p389
8054b514O319j0758J7509N2929M050k4150n0726j5361O4271K3572K997K95M269
8041G2702N2792k208q6089k9055K2136j6929k4792L2941j3134Q949L7123M4177
8029I8613K9577k5048q5041k313L2481N4897k590J097m7338o5400k4972O4929
8017B8892N7178j4679J6708L1636k3167l929j1837k9169M92L9571M9735L083j9510
8004A25004j6875k0502j8645r388L5037L3124R2130n383n8540p0606n80M557l2
$$ plain form
8090 -37258 -34913 70645 78561 -9270 -28190 6256 22755 53462 61263 52314 68025 41936
8078 41936 54166 62658 87089 149245 196372 253623 199240 99484 52246 71668 79597 21504
8066 21504 -30963 -58401 -41091 22304 60747 106250 78603 32017 47885 48879 4875 -2514
8054 -2514 3805 -6953 10556 63485 67535 43385 -7341 -22702 41569 65141 68138 68433 72702
8041 72702 125494 123286 37197 8142 30278 13349 -11443 21498 8364 17313 54436 98613
8029 98613 128190 103142 18101 15788 48269 103166 100576 101673 54335 -11065 -36037 28892
8017 28892 86070 71391 88099 119735 96568 92639 80802 51633 52125 91696 141431 144514 125004
8004 125004 108129 87627 68982 59594 94631 127755 219885 214502 155962 85356 84776 89333 89301
7991H9301M9459K1254n83j867m8499k5373j3161k8586k5687m0668m8627M0045
7979c2992M8018r386l7376J1504O9313L5331J6361j5261k4665m53M776m609Q0527
7966A41088O3423l7824n4023k815O457k8063m4078K0012L2974O706o208l3501
7954F4148m5328q337l1221j7750K0624N7640K4628k2246O739J5851K5299O786
7942I6833L959j5521J890l1133j00052o7519M7441N5461J2753L1626K33K9357
7930F5328q138l2576r944j6630K621J3391k5343L6847R457N64p907K3598M2595
7917I3863M3664j7825p0755j1802O546n497J8297M3104n8419r1805K252K1971
7905b6406J7279N7787l0303l8377N6730J1988k8506m3502k0808j0947K3986M5472
$$ plain form
7991 89301 138760 160014 159431 157564 109065 83692 70531 41945 16258 -24410 -73037 -32992
7979 -32992 15026 5640 -31736 -20232 49081 84412 100773 85512 60847 60394 65170 60561 141088
7966 141088 204511 166687 112664 109849 116306 88243 44165 64177 97151 103857 97649 64148
7954 64148 18820 10483 -20738 -38488 -17864 39776 64404 42158 48897 64748 90047 96833
7942 96833 100792 85271 87161 56028 -44024 -111543 -64102 -8641 4112 35738 35971 65328
7930 65328 57190 24614 14670 -1960 661 14052 -11291 25556 35013 35577 27670 51268 93863
7917 93863 137527 119702 48947 37145 43691 38194 56491 99595 41176 -50629 -48377 -26406
7905 -26406 -9127 48660 18357 -20020 36710 48698 20192 -23310 -44118 -55065 -31079 14393
7893A4393K5017L6603n5928o647J5660m6826J6691L1470R149K900k8133r769J5867
7880B0447J7436m1205M578j8829K126k026J9022L7820O050l364n5303k8511p08
7867d2467l6383K2290N0825J1158L8447J8476k5784l8919J9641j2570k1379j1504
7855b8169N163J3819K2470L2318k1961j8256J273k5082N442J9174l6150n7083
7843h7042P425L4924k922J6803o469K9947K7606Q003p798j9788j2224k6229R075
7830b8689K2393r839R832j0171k3438K1164j4154K3387O0518O7330k2678r0435
7818E220j4755R4981K1578o0518n9735k0908k4368J623m792L646J7212k9204O220
7805f3800K3688N2623K3257n2692k4000M8166L928K2554k6707k4739N3705m6147
$$ plain form
7893 14393 39410 76013 20085 13438 29098 -17728 -1037 30433 39582 42482 14349 4580 20447
7880 20447 37883 -3322 1256 -17573 -15447 -17473 1549 39369 45419 42055 -13248 -41759 -42467
7867 -42467 -78850 -56560 -5735 5423 43870 62346 36562 -2357 17284 4714 -16665 -28169
7855 -28169 -23006 -9187 13283 45601 23640 5384 6657 -18425 -12983 6191 -29959 -87042
7843 -87042 -79617 -44693 -47615 -30812 -37281 -7334 20272 28275 20477 689 -11535 -37764 -28689
7830 -28689 -6296 -16135 -6303 -16474 -39912 -18748 -32902 -9515 51003 118333 95655 5220
7818 5220 -9535 85446 107024 46506 -13229 -34137 -58505 -56882 -61674 -58028 -40816 -70020 -63800
7805 -63800 -40112 12511 35768 -16924 -40924 7242 11170 33724 7017 -17722 35983 -10164
7793a0164k3246K3926L3706J6681r895k7248K7994j4462l2433j598K2625o9814
7781f3928m77M6107J1932p3673J3106O2625o48L3645Q962m9664j0466j9100j1515
7768e3094j1960k0912k3500N4408N1804p542J0140J9238J1400K9300k1542n144
7756C2596J7925j0908k8904l5776J3332m6777K1017K8575j7892l4360P2176K5971
7744C6975j1392m1926K1069M2491L9222l059j4343J37N6174J5219m3767m2852
7732E3948K0811L6000l8888l1879p664K897m9951j0021J9628M108j9932p330L710
7719b4563m8063R954M1468K38M7211o033K2334q820L7261L0964J966m0459k5530
7706C7928J2203k3378l0163q0474n4351J3962O6620O0289j7007o0130k4844K8699
$$ plain form
7793 -10164 -33410 -9484 24222 40903 31008 3760 31754 17292 -15141 -16739 5886 -63928
7781 -63928 -64405 -18298 -6366 -80039 -66933 -4308 -4956 28689 37651 -12013 -22479 -41579 -53094
7768 -53094 -65054 -85966 -109466 -55058 -3254 -10796 -656 18582 29982 59282 37740 32596
7756 32596 50521 39613 10709 -25067 -11735 -58512 -37495 -8920 -26812 -61172 11004 36975
7744 36975 25583 -16343 4726 47217 86439 83380 69037 69174 125348 140567 96800 53948
7732 53948 74759 110759 71871 39992 32328 35225 -14726 -24747 -5119 -1011 -20943 -28273 -24563
7719 -24563 -72626 -62672 -21204 -20966 26245 20212 42546 33726 70987 101951 103917 63458 37928
7706 37928 50131 26753 -3410 -83884 -138235 -124273 -57653 2636 -14371 -74501 -99345 -70646
7694g0646l3701k1943l2157L7382M8533K851K422l1472M9632K859J4173N6813
7682B4746L2367j5284k7896m2743J0990J8495J4481p4062k4386J9019j8996p020
7670i0289K9270J0850q174M0739K5932o2960j27p43J7431n244j2081n1899k7067
7657a34362J8208Q7393N9970L3846Q210o2048j4364r07L2369k7041l5168N5338
7645B1444K4579l4564k5737m759j5798K3601J7800K1202J3243M166l1579n7834
7633d4236M8541J4536k4178k9715n1361n5972j2487N0174M7206n946j7061l4993
7621a15492N3033Q0085L1376M413j8543k2408o242j9234o170k4936L9216J8362
7609A3460K5204J1922o0694r295K101J8159K3385k3498m5124k7935j9441J385
$$ plain form
7694 -70646 -104347 -126290 -158447 -121065 -72532 -69681 -67259 -98731 -49099 -46240 -32067 24746
7682 24746 57113 41829 13933 -28810 -17820 675 15156 -58906 -83292 -64273 -83269 -90289
7670 -90289 -61019 -50169 -58343 -17604 8328 -54632 -54759 -55502 -38071 -43315 -55396 -107295 -134362
7657 -134362 -116154 -28761 31209 65055 73265 11217 -3147 -4054 28315 1274 -33894 21444
7645 21444 46023 11459 -14278 -19037 -34835 -11234 6566 27768 41011 45177 13598 -44236
7633 -44236 4305 18841 -5337 -35052 -86413 -142385 -154872 -104698 -57492 -63438 -80499 -115492
7621 -115492 -62459 17626 49002 53415 34872 12464 6222 -13012 -19182 -44118 -4902 13460
7609 13460 38664 50586 -10108 -19403 -17302 857 24242 744 -44380 -72315 -91756 -90371
7597i0371M5347J8650l2692k2526o793l6494K1869K5715K9787K2017j1656J210
7585c5937L0311K984o7541K7169J0020K6930q58m1998J0117J1478K1774J0200
7573D649k0012K2729K6176m9697k3910m838J5545M1912k5811r6531K3865K0207
7561f5716k0924n6175R288L5011O1819L233N913M1996J2244n890J9727K9823n3821
7548A6528o4j4716j7566N0083k76L127k9314K3611J877j0124r0334k0266K3986
7535f3448J7054K7315L7986j1885J9704j9538M0304N0136m3430n4414n2727k6823
7523g9766K4504L8246m052k0977l358K9040L8801J0844l8662K2208l9413P089
7511a5496K6517j8760K03M9765M3923m0068j3011j3230L78q750M5495k0389n3255
$$ plain form
7597 -90371 -45024 -26374 -59066 -81592 -88385 -124879 -103010 -77295 -47508 -25491 -37147 -35937
7585 -35937 -5626 -2642 -70183 -43014 -32994 -6064 -6922 -48920 -38803 -27325 -5551 4649
7573 4649 -15363 7366 33542 -16155 -40065 -44903 -29358 12554 -13257 -109788 -85923 -65716
7561 -65716 -86640 -142815 -133527 -98516 -36697 -33464 -27551 14445 26689 20799 40526 70349 16528
7548 16528 16464 1748 -15818 34265 33989 37116 7802 31413 33290 23166 -67168 -87434 -63448
7535 -63448 -46394 -19079 18907 7022 26726 7188 47492 97628 54198 -216 -52943 -79766
7523 -79766 -55262 -17016 -21068 -42045 -45403 -16363 22438 33282 -5380 16828 -22585 -15496
7511 -15496 11021 -7739 -7536 42229 86152 46084 33073 19843 20221 11471 56966 36577 -16678
7498a6678K7879P1221O6448k6992k0203O8o0221p0238p3546O853O3675M840M1709
7485A4815R521q558O991k8434Q821n424N410K4582M3874P484R329k9416p2398
7472a3403K9007J3089N082J3584M0624m6649R04j6455m3596k0968J1476J659J2717
7459a2929N8340J3475q36J5775l0996q4415j0094j596J5886K0614L6655k5578
7447e699J8128L4756Q867m6728k8444l2233j9216N9321O7329l7537p8329k389
7435f2174N0381p481l9739J0964M0634K2289J8248o2381j1585j0026n0861l3598
7423a35329L8925K9992M037k599m773N109M3467M4160K2077P226J3428l3166l9884
7410g330J590L7898o8543n9003K6896P5202j789m9565J4725j1695p3131j0853
$$ plain form
7498 -16678 11201 82422 148870 121878 101675 101743 41522 -28716 -102262 -95409 -31734 -26894 14815
7485 14815 24336 15778 22769 -5665 3156 -2268 3142 27724 71598 79082 88411 58995 -13403
7472 -13403 15604 28693 33775 47359 87983 41334 42238 25783 -17813 -38781 -27305 -25646 -12929
7459 -12929 45411 58886 58050 73825 42829 -41586 -51680 -53276 -37390 -16776 19879 -5699
7447 -5699 12429 47185 56052 9324 -19120 -51353 -70569 -11248 56081 18544 -59785 -62174
7435 -62174 -11793 -19274 -59013 -48049 -7415 14874 33122 -29259 -40844 -50870 -101731 -135329
7423 -135329 -96404 -66412 -62375 -64974 -69747 -64638 -21171 22989 45066 52292 65720 32554 -7330
7410 -7330 -5740 32158 -36385 -95388 -68492 6710 4921 -44644 -29919 -41614 -114745 -125598
7398a25598M6879J3858K8641L4271o675j1217L0899j9973m575r535J7350J0547
7386D872J233J2845p985L363J0257O34n916j4429J2551J3051J2721m6419l2111
7373c5333j1114N02J4099J1508m961l2110K488k7980L919N9858M8155k9578k3130
7360b3677k7957o249M1310P4073l0675n0371m603O312J7964O4561J7626j035o3252
7347A4027j7931k5193n567j9420l0759L9922M4479k6579M690L7777m3345k8453
7335e6352K5284k3700k2492L3845M1813N248J5334J2321k0261j1944j5068j5932
7323c1904L3945J4460M9015J1840l5344j2538j9737j9121J6776k628n9647j2905
7311f7788J5594L934m1954L3102r153p5563N265L0755n942L129J4342q102J2008
$$ plain form
7398 -125598 -78719 -64861 -36220 -1949 -8624 -19841 11058 -8915 -13490 -23025 -5675 4872
7386 4872 6105 18950 10965 14328 24585 25219 19303 4874 17425 30476 43197 -3222 -35333
7373 -35333 -46447 -45945 -31846 -20338 -25299 -57409 -54921 -82901 -78982 -19124 29031 -547 -23677
7360 -23677 -51634 -57883 -16573 57500 26825 -23546 -28149 -21837 -3873 60688 78314 77279 14027
7347 14027 -3904 -29097 -34664 -54084 -84843 -44921 -442 -27021 -22331 15446 -27899 -56352
7335 -56352 -31068 -54768 -77260 -43415 -1602 3646 18980 31301 11040 -904 -15972 -31904
7323 -31904 2041 16501 65516 77356 42012 29474 9737 -9384 7392 4764 -54883 -67788
7311 -67788 -52194 -48260 -90214 -57112 -66265 -141828 -136563 -105808 -111750 -108621 -94279 -102381 -90373
7298i0373J6142K8927M6295j0832l1199K3993m4163k3085J6731k9812n1482j214
7286a50072L0687J7684O8958N0426O3735L898l4082r026M932J5192L5275K0726
7274A18333j0364l9861J9196k2407m7603j7401k2100l6627q963P1514J5480l914
7262A5283k7721j4882K601Q769M2279j5784m8191L8158K4841J3364K5875N409
7250G0001j7174j4037p2928Q035L520k5370k2567P521N5242L4013o7714J4610
7238b6848O1629n4093k2615j1969L9223M1518K6490m4509m1530J7696L0851n2495
7226c6652Q965j2527J1718Q205j6030p86K4162K0318r998k6984m1758m3117L9558
7213g4926Q8159K10j5862q8845n3701J8169L7427J9761j3750j5836K2329K4617
$$ plain form
7298 -90373 -74231 -45304 991 -9841 -41040 -17047 -61210 -84295 -67564 -97376 -148858 -150072
7286 -150072 -119385 -101701 -32743 17683 81418 85316 51234 42208 47140 62332 97607 118333
7274 118333 107969 68108 87304 64897 17294 -107 -22207 -58834 -67797 3717 19197 15283
7262 15283 -12438 -27320 -24719 -15950 26329 10545 -37646 512 25353 38717 64592 70001
7250 70001 52827 38790 -34138 -26103 -22583 -47953 -70520 -62999 -7757 26256 -41458 -26848
7238 -26848 34781 -19312 -41927 -53896 -14673 26845 53335 8826 -32704 -15008 15843 -36652
7226 -36652 -27687 -40214 -28496 -20291 -36321 -37107 -12945 7373 -2625 -29609 -71367 -114484 -74926
7213 -74926 13233 13443 -2419 -91264 -144965 -126796 -89369 -69608 -83358 -99194 -76865 -52248
7201e2248j1457j6918k016L9474N8269r970K5947N8266K2485k8098m9418R806
7189D4122Q5264o4126l3205R531Q79k2465J0822K4691m4803m2634j7718K2210
7177b7432l4970k0071K6306j4125J3228l991Q945J6098K1054M373k4456J5456
7165a9585L2435l123l7013K8974j0022k0739j5789J8327o3883r902r26K1127K5920
7152e4199J624M4718q562p450n560K7966J4076p8966J3743J0096K699J3104K8409
7139A698r741m333j7458k838K5816J906J2578k3493J1298O3873N67n12J8243j4919
7125F2685j3654j7109l8804j9377j8024n2966O7499J6806O408j6081J5065k9050
7113c6602L714j0179N4436P5314O9119n6093n5918o555j5152o2263k0208L4677
$$ plain form
7201 -52248 -63705 -80623 -82639 -43165 15104 5134 31081 89347 111832 83734 34316 44122
7189 44122 129386 65260 32055 41586 42465 20000 30822 55513 10710 -31924 -49642 -27432
7177 -27432 -62402 -82473 -56167 -70292 -57064 -61055 -52110 -36012 -14958 -10585 -35041 -19585
7165 -19585 12850 9727 -27286 1688 -8334 -29073 -44862 -26535 -90418 -100320 -101246 -80119 -54199
7152 -54199 -52575 -7857 -16419 -23869 -29429 -1463 12613 -66353 -52610 -42514 -39815 -26711 1698
7139 1698 -8043 -12376 -29834 -32672 -6856 -4950 7628 -15865 -4567 59306 59873 59361 77604 62685
7125 62685 49031 31922 -6882 -26259 -44283 -97249 -29750 -12944 -6536 -22617 -7552 -36602
7113 -36602 -32888 -43067 11369 86683 155802 99709 43791 37236 22084 -40179 -60387 -25710
7101b5710n417J4359R501R390k063L6173k4810k9688n2897K2342M8579O8347J8499
7088H6605r2496l8902Q4235j4816n6100K999O0098J2941J533n5154j2118p187
7076b8362L2260K6869J9176j0065q030M139n603n3466K8845M6069k9083J8433
7064D1182k1296j4769L7598o172m7901k9590L3631K4503k3831l3581K3321J8999
7052B094R532J9736l9254l7896L499L798L8102N4436l7032k8073N82K1080J5315
7039B5919M744N356l6617K4251J3963J261k6321M181m1163n6300M8896J9680l677
7026a5827p0801m719P003K6220M1925j5093l8159L0504M8557k6823j0085K0757
7014f541j8373M707k9540l3077q467L7194l173M1427J3352O95k4164m5682j4167
$$ plain form
7101 -25710 -31127 -16768 -7267 2123 60 36233 11423 -18265 -71162 -48820 -241 68106 86605
7088 86605 -5891 -44793 39442 24626 -31474 -28475 31623 44564 46097 -9057 -21175 -28362
7076 -28362 3898 30767 49943 39878 31848 35987 30384 -23082 5763 51832 22749 41182
7064 41182 19886 5117 42715 36543 -11358 -40948 -7317 17186 -6645 -40226 -16905 2094
7052 2094 11626 31362 -7892 -45788 -42289 -38491 -389 54047 17015 -11058 -10476 10604 25919
7039 25919 30663 36019 -598 23653 37616 38877 12556 16737 -24426 -80726 -31830 -12150 -15827
7026 -15827 -86628 -91347 -84344 -58124 -16199 -31292 -69451 -38947 9610 -17213 -27298 -6541
7014 -6541 -24914 -20207 -49747 -82824 -91291 -54097 -57270 -15843 -2491 -1796 -25960 -71642 -85809
7001h5809K2812L243j0377o011K7266M4155m8491m2657o045k8235L9598K2135
6989f8416k8090K8610M2291K3655q171K6405J3215j1373J8011N3610Q945n0011
6977D8681l4762j5044n9963L1228J9997L6823j2901m1616l4225o4927l485L1160
6965i9034L4075K0816K9543L2292l639j4593m9328l9255Q185O7266l944j2091
6953b9707l7134k4866m3814q714o516K6472N0139k66K063K0788j767j8513j4665
6940h6500K3028J9387J4543j7888q662r426j573L187K7098L1495L5096q732M2227
6927F3280l642m6469K964k1360J7359J220N6278J5628o6077n0825j3045L0494
6915a4195K8230J3092j5832j334L4604k0577o4389j2774J473j5377k0508k599
$$ plain form
7001 -85809 -62997 -59754 -70131 -76142 -48876 -4721 -53212 -95869 -101914 -130149 -90551 -68416
6989 -68416 -96506 -67896 -25605 -1950 -10121 16284 29499 18126 36137 89747 98692 48681
6977 48681 13919 -1125 -61088 -29860 -9863 26960 14059 -27557 -61782 -126709 -130194 -99034
6965 -99034 -64959 -44143 -14600 17692 14053 -540 -49868 -89123 -80938 -13672 -17616 -29707
6953 -29707 -66841 -91707 -135521 -144235 -150751 -124279 -74140 -74406 -72343 -51555 -53322 -71835 -86500
6940 -86500 -63472 -44085 -29542 -47430 -56092 -65518 -67091 -63904 -36806 -5311 29785 21053 63280
6927 63280 59638 13169 16133 -5227 12132 13352 69630 85258 19181 -31644 -44689 -14195
6915 -14195 14035 27127 11295 9961 44565 23988 -40401 -53175 -51702 -67079 -87587 -90186
6903i0186K1732L8574J6743P600r247L781J1718l8690K2433j3966l0362j1042
6891g0912J6377R162n716M63K1377K8826K820k9859k5651Q045q074j0917M7304
6878a6755P6920j8362j6804J3611o227k426j3584m4014o9539j6228J8857k1189
6866a15740L7677J1575K8781L4292O104j3475K779r039r66K7425L3883L3786n1078
6853B6004j6262k2642j4033m1604p247J3825K5311L8555J9133l5595K7131J252
6841A3828n9678J0478O1046K0007R704k0835k5452j6032J742Q733k847K9764k32
6828C0226n7497L4536M1557n4288o6742k8126J2294J8522L2148M6438j3644k024
6816f600l7961J7563Q13M352p2919o1358N0704K1510Q061q709N0615J9716m3962
$$ plain form
6903 -90186 -68454 -29880 -13137 -5537 -14784 -11003 715 -37975 -15542 -29508 -59870 -70912
6891 -70912 -54535 -45373 -51089 -50626 -29249 -423 2397 -27462 -53113 -45068 -53142 -64059 -16755
6878 -16755 60165 41803 24999 38610 32383 29957 16373 -27641 -97180 -113408 -94551 -115740
6866 -115740 -78063 -66488 -37707 -3415 2689 -10786 -8007 -17046 -18012 9413 43296 77082 26004
6853 26004 9742 -12900 -26933 -68537 -75784 -61959 -36648 1907 21040 -14555 12576 13828
6841 13828 -45850 -35372 25674 45681 55385 34550 9098 -6934 -5192 3541 694 30458 30226
6828 30226 -27271 7265 48822 -5466 -72208 -100334 -88040 -69518 -37370 9068 -4576 -6600
6816 -6600 -44561 -26998 -26185 -21833 -94752 -156110 -105406 -83896 -75835 -84544 -33929 -14213 -58175
6803e8175j6169K5842K133l8745N4358M1974L2362k0140j4563N015j5154l1153
6791c2415k0623n2065O2899N2708J7942j3405M897J6785P853l8746J0471O2340
6779G8641K9829l5555j2651j4759l7592n1238p299M811n0545j2636j4564L4248
6767h9310M5264K4200j0403l0381k7203k0977k6497L7886N2391K5360K182m0866
6755e8354J2947J1854Q439k3521k6120L6392J3281k497k3990k01N102j0527M1811
6742a5384J04608J203l6698l0336m2025J9973J6885j8954K5353j0036R442j4852
6730I179m585N935m9851l6798J2318M0887P366l7452l6610K5457N4406M8485K0032
6717E8769m3352q3389L9048L7903L6985j7193j6338l650L656k6553l5724k3194
$$ plain form
6803 -58175 -74344 -48502 -46369 -85114 -30756 11218 43580 23440 8877 13892 -1262 -32415
6791 -32415 -53038 -105103 -42204 10504 28446 15041 19938 36723 44576 5830 16301 78641
6779 78641 108470 72915 60264 45505 7913 -43325 -50624 -45813 -96358 -108994 -123558 -89310
6767 -89310 -44046 -19846 -30249 -60630 -87833 -108810 -135307 -97421 -45030 -19670 -17488 -58354
6755 -58354 -45407 -33553 -25114 -48635 -74755 -38363 -25082 -27579 -51569 -51770 -46668 -57195 -15384
6742 -15384 89224 90427 53729 23393 -18632 1341 18226 -728 24625 14589 24031 9179
6730 9179 4594 10529 -39322 -76120 -63802 -22915 -15549 -53001 -89611 -64154 -9748 38737 58769
6717 58769 15417 -67972 -28924 8979 45964 28771 12433 8783 12439 -14114 -49838 -73032
6705g3032K073l350L7500m569j1841j5049L2118K72J7833j9055m003J7511k4003
6692d7595O903L6715M1627M5945l0376n2941k3884q925l8213J3134j8043j6571
6680i2224K8594N6094O258k3638j4890M2496J9544j9323j7888j2250J7227m9214
6668e9214j1063j3636K4166O073j2656m0420l475n209K7947K015k208J8994J7072
6655e1614M2346K0097p774N705k5850j1394n825N703K0530q794K682J0551m8252
6642e1889k1422P917m931K9784N3266K1274m8628o2063L9521K4849k3669M1441
6630E450M846j8282q550M572M436l8678o7703m2276M0176K4005o955M9381k052
6617e1630K9811K6879J5045M3331l1169o2535m8870M9378j7982P535K7620L5388
$$ plain form
6705 -73032 -70959 -74309 -36809 -41378 -53219 -68268 -36150 -35878 -18045 -37100 -41103 -23592 -47595
6692 -47595 -40692 -3977 37650 83595 53219 278 -23606 -32531 -70744 -57610 -75653 -92224
6680 -92224 -63630 -7536 -1278 -24916 -39806 2690 22234 2911 -14977 -27227 -10000 -59214
6668 -59214 -70277 -83913 -59747 -53674 -66330 -106750 -110225 -115434 -87487 -85472 -87680 -68686 -51614
6655 -51614 -9268 10829 3055 8760 -17090 -28484 -34309 -28606 -8076 -16870 -14188 -3637 -51889
6642 -51889 -73311 -65394 -70325 -40541 12725 33999 -14629 -76692 -37171 -12322 -35991 5450
6630 5450 10296 -7986 -16536 -11964 -7528 -46206 -113909 -156185 -116009 -92004 -98959 -49578 -51630
6617 -51630 -21819 5060 20105 63436 32267 -30268 -79138 -29760 -47742 -40207 -12587 22801
6605B2801O65N0596k3270o0916L3667K5618M756J1748k4401l6246k8876n276M5849
6592A6715l1433k8166J4818J7834j5650J4129M8210k6775M719j6660r081J0734
6580f06O8416K0210p3657o2726o359K7384J1003K3484P139j2526j4217J2748O40
6567I33M0390j5500m3123N3973J3006o399R641N460K9558l4348q8806j9986L5693
6554a9508m994P219K3708O7717k0264o0714k6179J6062k4074L0732o814l6226
6542e3335j1256P3601K4071r027K0948m6172k4024k0459K9808J00497L8018m3038
6530G9632l8426L5252k9910n1624k3956L739M142O9465N972P556L1605j3720l3070
6517D6657l1045k8312L2932M0019j0145n599m7581k8730J8117O0020j6151r0369
$$ plain form
6605 22801 23466 74062 50792 -10124 23543 49161 53917 65665 41264 5018 -23858 -29134 16715
6592 16715 -14718 -42884 -28066 -10232 -25882 -11753 36457 9682 14401 -2259 -11340 -606
6580 -606 67810 88020 14363 -48363 -54722 -27338 -16335 7149 14288 1762 -12455 293 933
6567 933 41323 25823 -17300 36673 49679 43280 52921 58381 87939 53591 -35215 -55201 -19508
6554 -19508 -24502 -17283 6425 74142 53878 -6836 -33015 -16953 -41027 -10295 -17109 -53335
6542 -53335 -64591 9010 33081 24054 45002 -1170 -25194 -45653 -15845 84652 122670 79632
6530 79632 41206 76458 46548 -5076 -29032 -25293 -21151 48314 54286 61842 93447 79727 46657
6517 46657 15612 -12700 20232 60251 50106 44507 -3074 -31804 -13687 46333 30182 -60187
6505f0187r3666n479J7167R4173M918m6955N3106N3879j6622j2151q4688M8518
6493d7987K7954M6060n4812l1282N8850L4345m9667m2090K2587Q090k6809j6503
6481g1264J7662q74l6602k9611O1726k9496j1083J0707O3593M2973j1873K2602
6469B8460n0239k8597k2283j8112k5567j5547P2409J8178k29L503J5871K3865
6457A712j7669l9757K9267L6044J9464K0688K0444n0569r9894k206M0002K066
6445d0408k0054M7959K6393q945m7949P782J3671j5868J3018P713j2059P975L9716
6432A8944J4471n3404K345o550p469k6465l917J4021L7349L6217J6583K3799k1450
6419D4474k7547m221n0376m6626O763M2156k537k7509m5904L3471L4028Q864K8032
$$ plain form
6505 -60187 -153853 -159332 -142165 -47992 -43074 -90029 -36923 16956 334 -11817 -96505 -47987
6493 -47987 -20033 26027 -28785 -60067 -1217 33128 -16539 -58629 -36042 -27952 -54761 -71264
6481 -71264 -53602 -54476 -91078 -120689 -58963 -88459 -99542 -88835 -25242 17731 5858 28460
6469 28460 -21779 -50376 -72659 -90771 -116338 -131885 -59476 -41298 -41527 -38024 -22153 1712
6457 1712 -15957 -55714 -26447 9597 29061 49749 70193 19624 -80270 -82476 -42474 -40408
6445 -40408 -60462 -12503 13890 4945 -43004 -35222 -21551 -37419 -24401 -16688 -28747 -20772 18944
6432 18944 33415 -19989 -17644 -24194 -31663 -58128 -62045 -48024 -10675 25542 42125 65924 44474
6419 44474 16927 12706 -37670 -84296 -77533 -35377 -37914 -65423 -111327 -77856 -43828 -34964 -6932
6406f932q9646o555O8644p332P849K6572m550L2989L9808J2188j2101n6304l7445
6393c2815K9854J1626J9632m0440L9352K2273K3816k9652k495N616Q439j8974
6381C6232K7949l3149l7156K949m5083m4406l3443N8257L4765K832N017j7997
6369d3233n303n3219j8609M0555L6146j1223j0455n6451L952P0089K6211J603
6357a9937R506K5189Q90m3741M2838K4675l3239j4362N722p769M6507K5660L0022
6344I1961k3434m2808j3262J5088o774m0231J3488J6453k5156k0288n182L7169
6332b976j3405k8687Q077m7793o283l7472K9464O8476l318J9323K708J9383K19
6319G716k9772l4900Q840m7856j5789K0436N9898K3492O468k7168k9321R20M0171
$$ plain form
6406 -6932 -96578 -103133 -34489 -41821 -33972 -7400 -11950 21039 60847 73035 60934 4630 -32815
6393 -32815 -2961 8665 28297 -12143 27209 49482 73298 43646 41151 46767 55206 36232
6381 36232 64181 31032 -6124 -3175 -48258 -92664 -126107 -67850 -33085 -30253 -25236 -43233
6369 -43233 -48536 -101755 -120364 -79809 -43663 -54886 -65341 -121792 -117840 -47751 -21540 -19937
6357 -19937 -10431 14758 15648 -28093 14745 39420 6181 -8181 -2459 -10228 36279 61939 91961
6344 91961 68527 25719 12457 27545 20771 -19460 -5972 10481 -14675 -34963 -40145 -2976
6332 -2976 -16381 -45068 -36991 -84784 -91067 -128539 -99075 -30599 -33917 -14594 -11886 7497 7716
6319 7716 -22056 -56956 -48116 -95972 -111761 -91325 -31427 -7935 -1467 -28635 -57956 -57036 -16865
6306a6865N9544J1650K1006k6021k7476J8681K4248j9540m5842k2005k496K0945
6294d171p166J6275k4399j2902L380M7918J2340r58K210o544j0762m0929k5802
6281e1510M465O620J6883j2706p788N2034J051m627m0814L0299N2116M6275M680
6268I6978K9962n351o3486n2833j960k0142J0097J7180L0620k6964o1171J1830
6256c5240J4950J6546M7847k392K6508j5500j8825m6980n0789K6200l7533j2109
6244h7317M2942L6266J2002M0592J0702J3307j8185K9442Q26j245k6230j1460
6232D1642j2282j6609j3331K3509m9225m0811j3751K0748N6394K4984p580j7160
6220c472J4275J4228n0397n6478L9793M0069M1577J8257l6506k4048j0023j1414
$$ plain form
6306 -16865 42679 54329 75335 49314 21838 40519 64767 45227 -615 -22620 -25116 -4171
6294 -4171 -11337 4938 -19461 -32363 -28983 18935 31275 30317 32527 25983 15221 -25708 -51510
6281 -51510 -47045 -40425 -23542 -36248 -44036 7998 9049 4422 -36392 -6093 46023 92298 96978
6268 96978 126940 121589 58103 5270 3310 -16832 -6735 10445 41065 14101 -47070 -35240
6256 -35240 -20290 -3744 44103 41711 68219 52719 33894 -13086 -63875 -37675 -75208 -87317
6244 -87317 -44375 -8109 3893 44485 55187 68494 50309 79751 80577 79332 53102 41642
6232 41642 29360 12751 -580 22929 -26296 -67107 -80858 -60110 -3716 21268 13688 -3472
6220 -3472 10803 25031 -25366 -81844 -42051 -1982 39595 57852 21346 -2702 -12725 -24139
6208b4139k9314k8317K8366M4812J1382K6089l4151m5461j2335L78M9326L3558
6196B0194o0967k13P0710K9546n2715k7438r941J6790l4358J586R835L4657K22
6183b092l3951L70L8739j9320j2864O3994N402j4502K4865r851j8169n0048p090
6170c4517K1946L5078j7365k2076j3535J9498j0889O393J3059J5314L3870k4383
6158B2393l978j7092q867K173M6080L3638q8737n5355J8813L0829M849J5224p26
6145g56Q516Q056l8520j912M0235l6956k9344K2932J7545l2635p7322N5819R7884
6132C3542j8205q393J9652n464k5272o4015k1644J1227K0909M5571j4381j4719
6120d1192M9494l331o4293l752j6814n859N0298L8826J9607j0981j9151m1142
$$ plain form
6208 -24139 -53453 -81770 -53404 -8592 2790 28879 -5272 -50733 -63068 -62690 -13364 20194
6196 20194 -40773 -40986 29724 59270 6555 -20883 -30824 -14034 -48392 -46806 -36971 -2314 -2092
6183 -2092 -36043 -35673 3066 -16254 -29118 34876 40278 25776 50641 40790 22621 -27427 -34517
6170 -34517 -12571 22507 5142 -16934 -30469 -10971 -21860 -15467 -2408 12906 46776 22393
6158 22393 18415 1323 -7544 -5371 40709 74347 -14390 -69745 -50932 -20103 -15254 -30 -756
6145 -756 7760 15816 -22704 -24616 15619 -21337 -50681 -27749 -10204 -42839 -120161 -64342 33542
6132 33542 15337 6944 26596 21132 -4140 -68155 -89799 -78572 -57663 -12092 -26473 -41192
6120 -41192 8302 4971 -59322 -63074 -79888 -85747 -35449 3377 22984 12003 -7148 -48290
6108d8290L8145k1968k0482N977N273K0218L4615K2836P048j4220m7694j6344
6096c4886j2982Q733j3413p666N3448J0940l0056m1286m2593M9016M9823Q259
6084b663j5220J6248J7644K9803m8216n0966K2572J264K006N0839J0785k4605
6072I491k3245j9669K4055j3756Q876k578J2286k2831N778K6607m4546k1261M1067
6059a9726N0586K0201l537j1553M9327J0813k9761j8167n949L3779k1682j6196
6047C8135m4143l1423L935M2732j0973R086J0165K8739L02k4181r978J4235J6244
6034D2875j0764m0744o798P068j3603l8314l0423K6446M3199K4321K6178J5065
6022D4506k5140k0021l8211j3238j4556l9359l753J3657K1161k8343M3868L1813
$$ plain form
6108 -48290 -10145 -32113 -52595 -46618 -41345 -21127 13488 36324 43372 29152 -18542 -34886
6096 -34886 -47868 -39135 -52548 -60214 -6766 4174 -25882 -67168 -109761 -60745 -10922 -2663
6084 -2663 -17883 -1635 16009 45812 -2404 -53370 -30798 -29534 -27528 23311 34096 9491
6072 9491 -13754 -33423 -9368 -23124 -14248 -16826 -4540 -27371 -21593 5014 -39532 -60793 -19726
6059 -19726 30860 51061 47524 35971 85298 96111 66350 48183 42234 76013 54331 38135
6047 38135 -6008 -37431 -33496 9236 -1737 7349 17514 46253 46555 22374 12396 26631 42875
6034 42875 32111 -8633 -15431 -8363 -21966 -60280 -90703 -64257 -21058 3263 29441 44506
6022 44506 19366 -655 -38866 -52104 -66660 -106019 -109772 -96115 -74954 -103297 -59429 -27616
6010b7616n6936k5830P184n021l9411M3130P0599l365k0910k7456R790J4163L514
5997e8165k583l7726r663K9842K1830M4873m7519k6816k8703M9525Q0989M1072
5985E6956J7075j4232r306l606n5521r0307l142K8147n218o19k516j3088M9111
5972d6266K5176n8882J8045Q1929K5339o2114o80M750K8654N9093J5213r5057
5960d800q8643j2925L1038j4506L7984N4670J6973j9211r323p252j8145N216l4196
5947f3120j3567O6935J02708j1678m3312q389Q411j8322l6812l3260j5079k3547
5935h9032L4560P995n2567j3122j4031M9381L6514P94J6059m6903l1059L1214
5923g0197j2787l4661R851N3969P822m059N7351N178r407L9089k9005j0780m0934
$$ plain form
6010 -27616 -84552 -110382 -103198 -108219 -147630 -104500 -33901 -37266 -58176 -85632 -75842 -61679 -58165
5997 -58165 -60748 -98474 -108137 -78295 -56465 -11592 -59111 -85927 -114630 -65105 15884 56956
5985 56956 74031 59799 50493 46887 -8634 -98941 -102083 -73936 -79154 -79773 -82289 -95377 -46266
5972 -46266 -21090 -79972 -61927 20002 45341 -16773 -17453 -12703 15951 75044 90257 -4800
5960 -4800 -93443 -106368 -75330 -89836 -51852 2818 19791 580 -8743 -15995 -34140 -28924 -63120
5947 -63120 -76687 -9752 92956 81278 37966 29577 37988 19666 -17146 -50406 -65485 -89032
5935 -89032 -54472 -46477 -99044 -112166 -126197 -76816 -40302 -39508 -23449 -70352 -101411 -70197
5923 -70197 -82984 -117645 -107794 -53825 -46003 -50062 7289 12467 3060 42149 13144 2364 -38570
5910c8570m0268J1152j4491k5489P092L1257P983j3981j6440J1722q311J9260
5898f9084L8495M7002K1394m1469q9566j4812J7402M7529R370K8996L81l7127
5886d1489k110o753l4310P380L0176l700L7211j6448m6255R308M1466J4228R788
5873a508l1943l6184J8075K077L413J7275l2875j5826L7153L3077j7685k2984
5861d7935p891N828J0329n635k4701K1842N0165J3417J596J3115o7563o3900M2305
5848e9028J9409n375m6143M475n51K4900M9192J2869k9029m704j3736K1142M5483
5835A8904K5994R413k086l0019N809m7664k5659M0064J0831l0697m166q861O182
5822c1955K5975j1745M8067J9767o2542j2068k9837m1733J9469m55j962p764K7584
$$ plain form
5910 -38570 -78838 -67686 -82177 -107666 -100574 -69317 -61334 -75315 -91755 -80033 -88344 -69084
5898 -69084 -30589 16413 37807 -3662 -93228 -108040 -90638 -43109 -33739 -4743 -4362 -41489
5886 -41489 -43599 -50352 -84662 -77282 -47106 -50806 -13595 -30043 -76298 -66990 -25524 -11296 -1508
5873 -1508 -33451 -69635 -51560 -49483 -46070 -28795 -61670 -77496 -40343 -7266 -24951 -47935
5861 -47935 -55826 -49998 -39669 -45304 -70005 -48163 2002 15419 17015 30130 -37433 -101333 -59028
5848 -59028 -39619 -44994 -91137 -86662 -87213 -62313 -13121 -252 -29281 -33985 -47721 -26579 18904
5835 18904 44898 54311 52225 22206 28015 -19649 -45308 -5244 5587 -25110 -29276 -38137 -31955
5822 -31955 -5980 -17725 30342 50109 -12433 -24501 -54338 -96071 -76602 -77057 -79019 -86783 -59199
5809e9199K2145L1553k2809n7713P994M3689l232k6267L930M8575L7987j5823
5797A0830m131M618L6915L9099l0607m5476K0024k2486l8524k2274j100L4160
5785a8952J5094L7335m696l7196K8591M4984k3869m42j9192Q26j2847k8904n7956
5772g7224q60J3962N0657M5636L7396M4243m6634R453r231n7981l941Q083R543
5759B3102J0499k6191p0549K0366P7683P0476l1907o6790p613j4628j3005m0429
5747f8986m800L2600n0933L5781M9002m4900K526J4176K5803M5517k0651l0351
5735a5216m8090j2008L542L5503K5587M1412N84l562L4586l2473n1255j1288k691
5722c5369K0931J7635m0032k2516j12K2177L1354j9793M7161M486o2548j4273
$$ plain form
5809 -59199 -37054 -5501 -28310 -86023 -78029 -34340 -37572 -63839 -59909 -11334 26653 10830
5797 10830 6699 11317 48232 87331 56724 11248 31272 8786 -29738 -52012 -53112 -18952
5785 -18952 -3858 33477 28781 -8415 20176 65160 41291 40849 21657 22483 9636 -19268 -77224
5772 -77224 -78084 -64122 -13465 32171 69567 113810 67176 76629 67398 9417 5476 13559 23102
5759 23102 33601 7410 -63139 -42773 34910 105386 73479 6689 -924 -15552 -28557 -68986
5747 -68986 -73786 -41186 -92119 -56338 -7336 -52236 -49710 -35534 -9731 35786 15135 -15216
5735 -15216 -63306 -75314 -71772 -36269 -10682 30730 31314 27752 62338 29865 -21390 -32678 -35369
5722 -35369 -14438 3197 -36835 -59351 -59463 -37286 -5932 -25725 21436 25922 -36626 -50899
5710e0899m47O9850P9085q081m5116m0963M6615n7124J1540N77o0277k5563L3362
5697d7441K6061j3037K6438N4896j6694O253k3971n9869K5702K2619J1363K9090
5685D1410j2116p983L1424m3663k6446j3888k0813L274m489n0200Q731K0601M2397
5672c1761J7388m7109m00Q136J2615k2413k5381k6852L370L3672L6741L7934O365
5659B305j5231K5957K3686n6753k1164M341L2548L087K9652L7588n3685n2692
5647d0361n7033L5466K4105r286J2404Q735P4572P6086j4281l6186k6300p7415
5635b9494l8129N037r617J91j0725L6906K3794K9307q4305k4453M0942N0659J4721
5622D834q120n673m223Q830l3953M9104M4488K7220J6422L363m572l6298j8720
$$ plain form
5710 -50899 -51346 18504 97589 89508 44392 3429 50044 -7080 4460 5037 -55240 -80803 -47441
5697 -47441 -21380 -34417 -7979 46917 30223 36476 12505 -47364 -21662 957 12320 41410
5685 41410 29294 21311 52735 9072 -17374 -31262 -52075 -48801 -53290 -103490 -94759 -74158 -31761
5672 -31761 -14373 -61482 -61882 -53746 -41131 -63544 -88925 -115777 -112407 -78735 -41994 -4060 2305
5659 2305 -12926 13031 36717 -20036 -41200 -36859 -4311 -1224 28428 66016 12331 -40361
5647 -40361 -97394 -61928 -37823 -47109 -34705 -25970 48602 124688 110407 74221 47921 -29494
5635 -29494 -67623 -62586 -72203 -72012 -82737 -45831 -22037 7270 -77035 -101488 -60546 -9887 4834
5622 4834 -3286 -8959 -13182 -4352 -38305 10799 55287 82507 98929 102292 97720 61422 42702
5609D2702N8156m7577r6034j5445K7241K7875J9801l2108l5625J3010r891L7739
5597a0156O3564k9428j0788j4392j9768J3845J1141l6226o6640L5703N5015p7924
5585h6054k0870K4503L6768K2918L565O055m7088p209n3188J9905N5994Q9109
5573D4408M8439l7181l0475o1558k6235K496M0499K7055k8758m1144j0986P072
5561f6368J5854K9005J9273N281P976N133n2721K3939l5109m5754O639M1309L5236
5548a0307O9960L5979j0790m2687l6593k3510k8409p310P7944K9485k2377l5445
5536d060m4129N1337R964n218o98l28N928n1280k9969L9781J08511m0540k9816
5523I483k0017M615k507j2993L7218M6919O976k3049m941n5156l0596k6679q438
$$ plain form
5609 42702 100858 53281 -42753 -58198 -30957 -3082 16719 -15389 -51014 -38004 -47895 -10156
5597 -10156 53408 23980 13192 -1200 -20968 -7123 4018 -32208 -98848 -63145 -8130 -86054
5585 -86054 -106924 -82421 -45653 -22735 -19170 -13115 -60203 -67412 -120600 -100695 -44701 44408
5573 44408 92847 55666 25191 -36367 -62602 -60106 -19607 7448 -21310 -62454 -73440 -66368
5561 -66368 -50514 -21509 -2236 3045 11021 16154 -36567 -12628 -47737 -93491 -86852 -45543 -10307
5548 -10307 59653 95632 84842 42155 5562 -17948 -46357 -53667 24277 53762 31385 -4060
5536 -4060 -48189 3148 13112 7894 7196 6868 12796 -38484 -68453 -28672 79839 39299 9483
5523 9483 -10534 -5919 -8426 -21419 15799 62718 69694 46645 41704 -13452 -44048 -70727 -79165
5510g9165p202J0344L6733J6078j2755L949Q962L343J7788o8532k0658K1585L5404
5497c4126O2959j4729n2355j1437K9986J4059M3301J1435k8425n8933K1376n532
5485b2421j8550M4959J7476R070K1135K3083N827l5756k2159K362K7976l6012
5473A6990l7759K933j3588k8574j5793O2402K4509L968n4457J0712J2452n2305
5461f8510l962J0366l588j5270L7003K7510l5805J9439r311l1032L0079K8326
5449a4755P740l8290K0802N7227q968j975L4379K3121l6291m0107l7015k8349
5437f2481M8970k5651m9807j3355O1385J1687J611j4244j1790J189L7891K0508
5425E913K3512P1320O603k1164n5832j9389M9167K8465l9358l4138K0818j981
$$ plain form
5510 -79165 -86367 -76023 -39290 -23212 -35967 -32018 -23056 -19713 -1925 -70457 -91115 -69530 -34126
5497 -34126 28833 14104 -38251 -49688 -19702 -5643 37658 49093 20668 -38265 -16889 -22421
5485 -22421 -40971 3988 21464 30534 51669 74752 80579 44823 22664 25026 53002 16990
5473 16990 -20769 -17836 -31424 -59998 -75791 -13389 11120 15088 -39369 -28657 -16205 -68510
5461 -68510 -72472 -62106 -65694 -80964 -43961 -16451 -52256 -32817 -42128 -73160 -43081 -14755
5449 -14755 -7015 -45305 -24503 32724 23756 21781 56160 79281 42990 2883 -34132 -62481
5437 -62481 -13511 -39162 -88969 -102324 -40939 -29252 -27641 -41885 -53675 -52486 -14595 5913
5425 5913 29425 100745 107348 86184 30352 10963 60130 88595 49237 15099 35917 33936
5413C3936j280m3701k1375k9608j6862j1696J5365m176L4095J801J167J4409j2914
5400d0839M0977N067k8604J2065R722n4230L940O039k6781J672M8206J9122P321
5387C677k0182M209K4421l7323l4538j3808M033M6226K902L6814L9452M255q444
5374E1694l6337K3453L6881k1984n440o8196n0438K3400j9698N2999M2449P486
5362C6269J9734l7126p64j8883J4571j5687L1546K094j831m4952k0405K0089k149
5349a7494L5017j1085L4605p814p7022p4664M5094M8728M0954k7943j6222K2677
5337e169j2052K7281r809j1284j9183L7104O1467K720k8042m9608K7364K2838
5325D3627l6172n6839J0294l9339k4660k9089R341M4159K2874Q448L5859J8488
$$ plain form
5413 33936 32656 -11045 -32420 -62028 -78890 -90586 -75221 -79397 -45302 -43501 -42334 -27925 -40839
5400 -40839 138 5205 -23399 -11334 -1612 -55842 -51902 -45863 -72644 -70972 -22766 -3644 3677
5387 3677 -16505 -12296 12125 -25198 -59736 -73544 -69511 -23285 -20383 16431 55883 60138 51694
5374 51694 15357 38810 75691 53707 48267 -19929 -70367 -46967 -66665 -13666 28783 36269
5362 36269 56003 18877 18113 -770 13801 -1886 29660 31754 29923 -15029 -35434 -15345 -17494
5349 -17494 17523 6438 41043 33229 -43793 -118457 -73363 -24635 16319 -11624 -27846 -5169
5337 -5169 -17221 10060 251 -11033 -30216 6888 68355 71075 43033 -6575 20789 43627
5325 43627 7455 -49384 -39090 -78429 -103089 -132178 -122837 -78678 -55804 -47356 -11497 6991
5313F991j1259o2957P2644P8367n168j6195n794j444K4393q009l0490p6618k0717
5300e6256J5353L0267O1665l1095m2266J969L6857K5921J063j8376m1065L7975
5288B2012K7524m2923o1080j4807j8825K6533J547P623M9377j477P652l3641m7678
5275g8163j6794K284j5022k638j4908m434K7441r229M516K4307O5811J7566m9795
5262d9058k0232L8532k7300J6909K3973L821k4065K3773r523K4079K0196M631
5250B5736J2803m1321J3350J3351j0707J3969n918l1354k321J0349j4301j0380
5238b6744K2188K381K0629j0940k8705K0809m7449j789M0164J1223j51J0877n5488
5225d2995k9954k0652M173K4670n4584M1635O4522R688k3402J9842j4795o1455
$$ plain form
5313 6991 -4268 -67225 5419 83786 78618 62423 56629 55185 79578 71569 41079 -35539 -56256
5300 -56256 -40903 -10636 51029 19934 -22332 -20363 16494 42415 43478 25102 -15963 22012
5288 22012 49536 6613 -54467 -69274 -88099 -61566 -60019 -52396 -3019 -4496 3156 -30485 -78163
5275 -78163 -94957 -92673 -107695 -110333 -125241 -129675 -102234 -111463 -106947 -82640 -16829 737 -49058
5262 -49058 -69290 -30758 -58058 -41149 -17176 -13355 -37420 -13647 -23170 909 21105 25736
5250 25736 38539 -2782 10568 23919 13212 27181 21263 -10091 -12412 -2063 -16364 -26744
5238 -26744 -4556 -2175 18454 7514 -21191 -382 -47831 -49620 -9456 1767 1616 12493 -42995
5225 -42995 -72949 -93601 -89428 -64758 -119342 -77707 -13185 -3497 -26899 -7057 -21852 -83307
5213h3307q115L0435N206j4587l3678K5160j2213J1210J8739r84J9395M12k0492
5200f2819M5172J2338o8973j991O460l720m1599K1939k706P1616j5315J5807N7404
5187C3613K9613j8508m1553k8323p965k3003j4474L510j188J7237K3695J7154
5175a0192K0577l5689O536N1503L1070k1265l837N0770J3814n2663n9313M6717
5163C8028l3430l9887k6015o72j4189K8637R354j7468j3837N7997J4782n0894
5151d7594p848J9599j1205N6098k3926k2613K2515N225K6962j1126k7657k2267
5139d3837n479M9109r89L326L9342L0246k6777q3877J0336K1210K7070o554j011
5126A2115j9718l9107m4109L4801K8248J6561J8813j9548j4410K6294j563L2448
$$ plain form
5213 -83307 -91422 -60987 -55781 -70368 -104046 -78886 -91099 -79889 -61150 -62134 -42739 -42327 -62819
5200 -62819 -17647 -5309 -74282 -76273 -69813 -73533 -115132 -93193 -95899 -24283 -39598 -23791 33613
5187 33613 63226 44718 3165 -25158 -33123 -56126 -70600 -67090 -68278 -51041 -27346 -10192
5175 -10192 10385 -25304 -18768 32735 63805 42540 38703 89473 103287 50624 -8689 38028
5163 38028 4598 -35289 -61304 -61976 -76165 -47528 -38174 -55642 -69479 -11482 3300 -47594
5151 -47594 -55442 -35843 -47048 9050 -14876 -37489 -14974 -9749 17213 6087 -21570 -43837
5139 -43837 -49316 -207 -1196 2130 41472 71718 44941 -38936 -28600 -7390 19680 13126 12115
5126 12115 -7603 -46710 -90819 -56018 -27770 -11209 7604 -11944 -26354 -60 -1623 30825
5114C0825J3345K2629p005N276k4722m778l4352k3934j7498J6171k087K566M1234
5101A7670q766p064M0330K5332J1809j7790p8903l3917rj6199M5061m649l6825
5088f3920p745L2260J5351J6987M7376k4208j5141j0911l4064l1700K6405K2550
5076b6760K79j1331N0077M2078k2654n2703n7592K2990j3542J2698J2037J218
5064d3205k3217L4939L5094L3470O996l7478j1263L1066p042n033o407o3726k6414
5051h2220M9431m0936K3043j7312M5707P7949K1511K1745j6631n5404k1086j9320
5039a3523K7145O929J5296k2354m9961M584m0196K8085M2914M2932j7946o5132
5027d1227J2798M0736J9875J101k1751m2117j7250K1947K7701j6549k1062j704
$$ plain form
5114 30825 44170 66799 59794 65070 40348 35570 1218 -22716 -40214 -24043 -26130 -23564 17670
5101 17670 8904 1840 42170 67502 79311 61521 -17382 -51299 -51308 -67507 -22446 -27095 -63920
5088 -63920 -71665 -39405 -24054 -7067 40309 16101 960 -9951 -44015 -75715 -49310 -26760
5076 -26760 -26481 -37812 12265 54343 31689 -21014 -78606 -55616 -69158 -56460 -44423 -43205
5064 -43205 -66422 -31483 3611 37081 44077 6599 -4664 26402 19360 14327 7920 -55806 -82220
5051 -82220 -32789 -73725 -50682 -67994 -22287 55662 77173 98918 82287 26883 5797 -13523
5039 -13523 13622 20551 35847 13493 -36468 -31884 -72080 -43995 -1081 41851 23905 -41227
5027 -41227 -28429 12307 32182 33283 11532 -30585 -47835 -25888 1813 -14736 -35798 -37502
5015c7502q254q854N3675K3412M1822j3601j3444k1704m2193l0872P4637m491
5003A2631j0210K9492m4763L0281O4603k45l1078k0219j6952J5647j09529o238
4991h6580J06402l8188r278M4572m9207j7060j2381r698M4383J4981L0078l0557
4979a2533k616J9526k858P1434L1359j8966l9297L488K2170o3521n0697q988j6195
4966f7694q917k0181P9279K0192K860L3843J4488l0589j0007o572J715k9037j2394
4953c3014O47j8689K9596J2414L2620J6014j3783k9666j8355K0048L5482K2051
4941E5365N273n8475m138n9124Q224O0299m231J5073p02j2213j8239j8788K970
4928b8706J8861N1223K6225k2780k3999j8685n3409m030j7528l2913k4876O5267
$$ plain form
5015 -37502 -45756 -54610 -935 22477 64299 50698 37254 15550 -26643 -57515 17122 12631
5003 12631 2421 31913 -12850 17431 82034 81789 50711 30492 13540 29187 -80342 -86580
4991 -86580 19822 -18366 -27644 16928 -32279 -49339 -61720 -71418 -27035 -12054 18024 -12533
4979 -12533 -15149 4377 1519 72953 104312 85346 46049 49537 71707 8186 -42511 -51499 -67694
4966 -67694 -76611 -96792 -17513 2679 5539 39382 53870 23281 13274 6702 8417 -20620 -33014
4953 -33014 -32367 -51056 -21460 -9046 23574 39588 25805 -3861 -22216 -2168 33314 55365
4941 55365 60638 2163 -1975 -61099 -52875 7424 3193 18266 17564 5351 -12888 -31676 -28706
4928 -28706 -9845 41378 67603 44823 20824 2139 -51270 -55300 -72828 -105741 -130617 -65350
4916f5350P3804j2793l8606j9188O6989K5138l3421m0815M4290M3656k8111r169
4904F424k0653o8892j812O8254M7424j33J4690k0278K4432l2876l4781J5169N426
4891B394q429n2719o4996j9028L2249N8120o706k0951J1521l6983J8117J2273
4879g5138l2466N1069Q0032J8746m4889o738j8450j0618p324L2728m15j8906L7950
4866E581N941R772k3095k7625k7959j9726K580j5101L6697L3059J025L4346M4488
4853E9983j3338l2565o9813l4366M8678j4224m7253O1418P5218k4480p0842m3169
4841a04753N185j5832q588P6244M9655k691O9688N5355o4106q7371o3810K9039
4829f1985L9950q790k2797j4037M6900N0917l6119m3658R0141J9866p8157k613
$$ plain form
4916 -65350 8454 -4339 -42945 -62133 4856 29994 -3427 -44242 48 43704 15593 6424
4904 6424 -14229 -83121 -84933 -16679 30745 30612 45302 25024 49456 16580 -18201 -3032 2394
4891 2394 -6035 -58754 -123750 -142778 -110529 -52409 -59115 -80066 -68545 -105528 -87411 -75138
4879 -75138 -107604 -56535 23497 42243 -2646 -9384 -27834 -38452 -45776 -13048 -13463 -32369 5581
4866 5581 11522 21294 -1801 -29426 -57385 -77111 -74531 -89632 -52935 -19876 -18851 15495 59983
4853 59983 46645 14080 -55733 -90099 -41421 -55645 -102898 -41480 33738 9258 -61584 -104753
4841 -104753 -99568 -115400 -123988 -47744 1911 -780 68908 124263 60157 -27214 -91024 -61985
4829 -61985 -22035 -30825 -53622 -67659 -20759 30158 -5961 -49619 40522 60388 -17769 -20382
4817b0382n933k8117m427M1823K4077l1002j4798J1812L9762n450l2469K9866
4805D762J266n3109J1901N3970n413l3719j4082m6680n71K6970R378k4768O696
4792f3399K7377M4405l6392k5860L5811n3J5238q367l040q370L8397L1l992p7431
4778f5645k2475M1337R22J7292q534N569k9456k8540K7755r822M58L2400L01J4183
4764b4255P760k6185K9846q152l7149L7816J4629k2909P78J7051M275l1512j7679
4751e5686L270L3084l4116l6425l4177N5230O7792j9022l4936j8830K9999j692
4739d5509k0171m0815j7716j0744j6872L8920M4744J9923k7521N98P588K51k392
4726f9716M996m7110k0001Q1017K8368M3693L3697J3512l4527j9446k7416L7633
$$ plain form
4817 -20382 -26315 -54432 -58859 -17036 7041 -23961 -38759 -26947 12815 7365 -25104 4762
4805 4762 6028 -47081 -35180 18790 13377 -20342 -34424 -81104 -81675 -54705 -45327 -70095 -63399
4792 -63399 -36022 8383 -28009 -53869 -18058 -18111 -2873 -11240 -14280 -22650 15747 15778 11786 -65645
4778 -65645 -88120 -46783 -45861 -28569 -37103 -31534 -60990 -89530 -61775 -71597 -71139 -38739 -38438 -24255
4764 -24255 -16495 -42680 -12834 -20986 -58135 -20319 -5690 -28599 -27821 -10770 -6495 -38007 -55686
4751 -55686 -52416 -19332 -53448 -89873 -124050 -68820 -1028 -20050 -54986 -73816 -43817 -45509
4739 -45509 -65680 -106495 -124211 -134955 -151827 -112907 -68163 -48240 -75761 -75163 -67575 -67324 -69716
4726 -69716 -64720 -111830 -131831 -50814 -22446 21247 54944 68456 33929 14483 -12933 24700
4714B4700m9232l5824k6385L6578L9042J7920O6855K2838n2017q4702o2730K3303
4702g9654K2949O834m825K795k1957L4203L7249J5493o0656q0179K0491O8956
4690c8301K0226J6319K6110j1927j6220K7488n0622j2830N0263j0942l9686O502
4678c3620Q937j484N0189M6299m8153k769j619k0883K9015n618k3735m560j2744
4665b0745N929M691K6436K8291j1384J6773J5384L3590L4198l19m7509m6042J758
4652D1051m966k1100O359J0015N698n0171l7761m368j4388J3614M6701k3030J0744
4639b1602M4940O3498k6789j7872l0828j8794L2053J7652j1097l1150J8033p8955
4627f0911L071P0047J9860m4333k3962M2516J9371K8482J8758j1576n8458J4579
$$ plain form
4714 24700 -24532 -60356 -86741 -50163 -11121 6799 73654 96492 44475 -40227 -102957 -79654
4702 -79654 -56705 -49871 -54696 -51901 -73858 -39655 -2406 13087 -47569 -127748 -107257 -38301
4690 -38301 -18075 -1756 24354 12427 -3793 23695 -26927 -39757 10506 -436 -40122 -33620
4678 -33620 -24683 -26167 24022 70321 22168 19399 17780 -3103 25912 20294 -3441 -8001 -20745
4665 -20745 -14816 -10125 16311 44602 33218 49991 65375 98965 133163 132844 85335 39293 41051
4652 41051 36085 14985 21344 31359 37057 -13114 -50875 -55243 -69631 -56017 -9316 -32346 -21602
4639 -21602 23338 86836 60047 42175 11347 -7447 24606 42258 31161 11 18044 -60911
4627 -60911 -57840 12207 32067 -12266 -36228 6288 25659 54141 72899 61323 2865 17444
4615A7444j5808k6498P016j2789J3359M1631K1144o7619j5505n1427L6280O7383
4603A4611L2623k249j9128l5954j4599n6000J3407J8393l1272K4670M1355J9302
4591E159M3983M837M100p854l2316l9043j3451J4710l580J172L6513J6892n7278
4578b6156l6545L1490j7077N792L4372N306J8214L819l3096K0838l2549j3815
4566c9407k1358N6435L9629P477J3024J2202m2840l8527L728o321j3775m9714
4554g9447J9741J5251J8364M6588n305k1740n9510L4908M0597M792K8512q015
4542C4736p874R536m3516K245O86O601J747P6095j1823j4201k1274m4358k6313
4529c7713j5150P304J6030K1028L384L0315j9917m8456j3684M3195J1613j1100
$$ plain form
4615 17444 1636 -24862 -17846 -30635 -17276 24355 45499 -22120 -37625 -89052 -52772 14611
4603 14611 47234 44985 25857 -10097 -24696 -80696 -67289 -48896 -80168 -55498 -14143 5159
4591 5159 49142 53979 58079 50225 17909 -21134 -34585 -19875 -23455 -22283 14230 31122 -26156
4578 -26156 -62701 -31211 -48288 -42496 -8124 -2818 15396 19215 -13881 6957 -25592 -39407
4566 -39407 -60765 -4330 35299 42776 55800 68002 25162 -13365 -9637 -15958 -29733 -79447
4554 -79447 -59706 -44455 -26091 20497 15192 -6548 -66058 -31150 9447 14239 42751 34736
4542 34736 26862 36398 -7118 -4873 -4187 2414 4161 80256 68433 54232 32958 -11400 -37713
4529 -37713 -52863 -45559 -29529 -8501 -5117 25198 5281 -43175 -56859 -13664 -2051 -13151
4517a3151P590J7702K9145n4617J074M0615J2397j4353k1097K3359j8773q204
4505A687J3510j5992l1611M3971k1381Q927Q393K6935L1655k4335l4192J1171
4493A8738k1434J714L4925L2926l2806m6216M326m6673n158L692K9941K2839K5719
4480B2533l5278n0743k4012M3241K3152n222J3460L0103K7344J9642k7095j1748
4468B5377j1551Q243K0817m9328k0580q398K0685q136j0791k2460K199l0729L2429
4455e2223J1385p995J05511P9692k9581k8206m9691n5026k0306K5212m558j8265
4443d4051R956J8963m099O0312K3569r114k1948L018K802k1985k2520J2604k1950
4430a4443K7236J131k6888j1978k0243J3448L1088N1534O4896J0271k6532l3652
$$ plain form
4517 -13151 -5561 12141 41286 -13331 -12257 28358 40755 26402 5305 28664 9891 1687
4505 1687 15197 -795 -32406 11565 -9816 -889 7504 34439 66094 41759 7567 18738
4493 18738 -2696 -982 33943 66869 34063 -12153 -7827 -54500 -59658 -55966 -26025 -3186 22533
4480 22533 -12745 -63488 -87500 -44259 -21107 -26329 -12869 17234 44578 64220 37125 25377
4468 25377 13826 22069 42886 -6442 -27022 -35420 -14735 -22871 -33662 -56122 -53923 -84652 -52223
4455 -52223 -40838 -48833 56678 136370 106789 78583 28892 -26134 -46440 -21228 -25786 -44051
4443 -44051 -34095 -15132 -19231 41081 64650 55536 33588 36606 39408 17423 -5097 7507 -14443
4430 -14443 12793 13924 -12964 -24942 -45185 -31737 -649 50885 115781 126052 99520 65868
4418F5868p8732l5874l1951J0988M5575O6705K3408M516n0771l0217J5821p67
4406D569m7129L8526J2872J2286n71l2137J4294k5139l704k6585M0639J76j3256
4393b5159k1830L4087J5413l1830k2897n740l7963k4765j3465n806L4625L5353
4381f9977j9930K8986M2499J6371o4739M2708l641l5118O0660P0040Q296r656
4369F6499n942m0785m53m477J3882J7507r8820r156Q4385L1813k3871l6269K6047
4356B0360L1034k1135n5130J3554k0115N575J4041K4452j3400l6128j6242K2824
4344c0310j2352K8104P2555L6303m6707l3711l2613l3443J3247m4654K7903r878
4332f5556P192L4209L851K3575o137o1851j5890J9714J9817M1570L2051j1486
$$ plain form
4418 65868 -12864 -48738 -80689 -69701 -24126 42579 65987 70503 19732 -10485 5336 4569
4406 4569 -42560 -4034 8838 21124 20553 -11584 2710 -22429 -26133 -52718 -12079 -11903 -25159
4393 -25159 -46989 -12902 2511 -29319 -52216 -57956 -95919 -120684 -134149 -139955 -105330 -69977
4381 -69977 -89907 -60921 -18422 -2051 -66790 -24082 -27723 -62841 -2181 67859 76155 66499
4369 66499 60557 19772 19319 14842 28724 46231 -52589 -61745 22640 54453 30582 -5687 20360
4356 20360 51394 30259 -24871 -11317 -31432 -25857 -11816 12636 -764 -36892 -53134 -30310
4344 -30310 -42662 -14558 57997 94300 47593 13882 -18731 -52174 -38927 -83581 -55678 -65556
4332 -65556 -58364 -24155 -20304 3271 -2866 -64717 -80607 -60893 -41076 494 32545 21059
4320B1059n1919K4592o992k6936L0366M6290l9300l1365n4547J844O4726J6359
4308e823m970k4297J7618M8949k6695k8783L837O790n407J8766m1909K9612J277
4295a1035l9492l1312N7811P352K7187K4872j04J052j3310K3924j2061J3468K8097
4282G6449l513k4571O818j0535l3520n524o5742m8479P0977M6796l0417j9875
4270d1136K9957j4661J0209j4003k2234l4485l5779O4788L2573N1674N7820n4796
$$ plain form
4320 21059 -30860 -6268 -13260 -40196 -9830 36460 -2840 -34205 -88752 -86908 -22182 -5823
4308 -5823 -10793 -35090 -17472 31477 4782 -24001 -20164 -13374 -18781 -15 -41924 -12312 -11035
4295 -11035 -50527 -81839 -24028 -16676 10511 35383 35279 36331 23021 46945 34884 48352 76449
4282 76449 72936 48365 55183 44648 11128 5604 -60138 -108617 -37640 9156 -21261 -41136
4270 -41136 -11179 -25840 -15631 -29634 -51868 -86353 -122132 -57344 -24771 26903 84723 29927
$$ [...]
##END NTUPLES=NMR SPECTRUM
##END=
