##TITLE=Analysis number 327457
Compound Code btb 03706
Book Reference 262512
Project Code adrs  flro3
Chemist Name jom
##JCAMPDX= 6.0         $$ Bruker NMR JCAMP-DX V2.0
##DATA TYPE= NMR SPECTRUM
##DATA CLASS= NTUPLES
##ORIGIN= Bruker BioSpin GmbH
##OWNER= nmr
$$ XWIN-NMR		Version 3.5
$$ Mon Mar 26 16:00:21 2007 GMT Daylight Time (UT+1h)  MAYBRIDGE\nmr@NMR_250MHZ
##.OBSERVE FREQUENCY= 250.131544655141
##.OBSERVE NUCLEUS= ^1H
##.ACQUISITION MODE= SIMULTANEOUS (DQD)
##.ACQUISITION SCHEME= undefined
##.AVERAGES= 16
##.DIGITISER RES= 18
##SPECTROMETER/DATA SYSTEM= dpx250
##.PULSE SEQUENCE= zg30
##.SOLVENT NAME= DMSO
##.SHIFT REFERENCE= (INTERNAL, DMSO, 0, 16.522)
##AUDIT TRAIL= $$ (NUMBER, WHEN, WHO, WHERE, WHAT)
$$ ##TITLE= Audit trail, XWIN-NMR		Version 3.5
$$ ##JCAMPDX= 5.01
$$ ##ORIGIN= Bruker BioSpin GmbH
$$ ##OWNER= nmr
$$ C:\u/data/dgb/nmr/ADRS/2010/pdata/1/auditp.txt
$$ ##AUDIT TRAIL=  $$ (NUMBER, WHEN, WHO, WHERE, WHAT)
(   1,<2007-03-26 15:59:59.41 +100>,<MAYBRIDGE\nmr>,<NMR_250MHZ>,
      <created by zg, POWCHK disabled, PULCHK disabled
       configuration hash MD5:
       49 4B E0 1D 92 C2 6B 37 9F E6 65 BC 52 41 86 1D
       data hash MD5: 64K
       C9 DF 18 1A A4 56 F4 71 F6 5A F0 6B D2 13 0A 99>)
(   2,<2007-03-26 16:00:11.71 +100>,<MAYBRIDGE\nmr>,<NMR_250MHZ>,
      <Start of raw data processing
       ef LB = 0.3 FT_mod = 6 PKNL = 1 SI = 32K 
       data hash MD5: 32K
       E1 E4 01 DD EA 4A 61 EA AA 8F 00 60 E6 C0 34 53>)
(   3,<2007-03-26 16:00:13.33 +100>,<MAYBRIDGE\nmr>,<NMR_250MHZ>,
      <apk 
       data hash MD5: 32K
       1B 89 88 CE 2B D5 CB FD 52 BA B3 9F 2C F1 D7 DB>)
(   4,<2007-03-26 16:00:14.07 +100>,<MAYBRIDGE\nmr>,<NMR_250MHZ>,
      <abs ABSG = 5 
       data hash MD5: 32K
       B2 C1 9D 39 E8 08 C9 BF A8 9D 01 42 3C 1F 97 F0>)
$$ ##END=
$$ 
$$ hash MD5
$$ F2 A3 21 DD 12 30 6D 2A 74 E1 E6 4D E1 45 76 77
##$RELAX= 
##$RELAX= 
##$RELAX= 
##$RELAX= 
##$RELAX= 
##$RELAX= 
##$RELAX= 
$$ Bruker specific parameters
$$ --------------------------
##$DU= <C:\u>
##$EXPNO= 2010
##$NAME= <ADRS>
##$PROCNO= 1
##$TYPE= <nmr>
##$USER= <dgb>
##$AMP= (0..31)
100 100 100 100 100 100 100 100 100 100 100 100 100 100 100 100 100 100 
100 100 100 100 100 100 100 100 100 100 100 100 100 100 
##$AQSEQ= 0
##$AQ_mod= 3
##$AUNM= <au_zg>
##$AUTOPOS= <50 >
##$BF1= 250.13
##$BF2= 250.13
##$BF3= 250.13
##$BF4= 250.13
##$BF5= 500.13
##$BF6= 500.13
##$BF7= 500.13
##$BF8= 500.13
##$BYTORDA= 1
##$CFDGTYP= 0
##$CFRGTYP= 5
##$CHEMSTR= <none>
##$CNST= (0..31)
1 1 145 1 1 1 1 1 1 1 1 1 1 1 1 1 1 1 1 1 1 1 1 1 1 1 1 1 1 1 1 1 
##$CPDPRG= <>
##$CPDPRG1= <>
##$CPDPRG2= <>
##$CPDPRG3= <>
##$CPDPRG4= <mlev>
##$CPDPRG5= <mlev>
##$CPDPRG6= <mlev>
##$CPDPRG7= <mlev>
##$CPDPRG8= <mlev>
##$CPDPRGB= <>
##$CPDPRGT= <>
##$D= (0..31)
0 1 0 0 0 0 0 0 0 0.06 0 0 0 0 0 0 0.0002 0 0 0 0 0 0 0 0 0 0 0 0 0 0 
0 
##$DATE= 1174921198
##$DBL= (0..7)
120 120 120 120 120 120 120 120 
##$DBP= (0..7)
150 150 150 150 150 150 150 150 
##$DBP07= 0
##$DBPNAM0= <>
##$DBPNAM1= <>
$$ [...]
##$SUBNAM7= <"">
##$SUBNAM8= <"">
##$SUBNAM9= <"">
##$SW= 20.6930455092707
##$SWIBOX= (0..15)
0 0 3 0 0 0 0 0 0 0 0 0 0 0 0 0 
##$SW_h= 5175.983436853
##$TD= 65536
##$TD0= 1
##$TE= 683.16
##$TE2= 300
##$TE3= 300
##$TEG= 300
##$TL= (0..7)
0 120 120 120 120 120 120 120 
##$TP= (0..7)
150 150 150 150 150 150 150 150 
##$TP07= 0
##$TPNAME0= <>
##$TPNAME1= <>
##$TPNAME2= <>
##$TPNAME3= <>
##$TPNAME4= <>
##$TPNAME5= <>
##$TPNAME6= <>
##$TPNAME7= <>
##$TPOAL= (0..7)
0.5 0.5 0.5 0.5 0.5 0.5 0.5 0.5 
##$TPOFFS= (0..7)
0 0 0 0 0 0 0 0 
##$TUNHIN= 0
##$TUNHOUT= 0
##$TUNXOUT= 0
##$USERA1= <user>
##$USERA2= <user>
##$USERA3= <user>
##$USERA4= <user>
##$USERA5= <user>
##$V9= 5
##$VALIST= <valist>
##$VCLIST= <CCCCCCCCCCCCCCC>
##$VD= 0
##$VDLIST= <DDDDDDDDDDDDDDD>
##$VPLIST= <PPPPPPPPPPPPPPP>
##$VTLIST= <TTTTTTTTTTTTTTT>
##$WBST= 1024
##$WBSW= 4
##$XGAIN= (0..3)
0 0 0 0 
##$XL= 0
##$YL= 0
##$YMAX_a= 452699
##$YMIN_a= -464212
##$ZGOPTNS= <>
##$ZL1= 120
##$ZL2= 120
##$ZL3= 120
##$ZL4= 120
##$ABSF1= 16.522
##$ABSF2= -4.171173
##$ABSG= 5
##$ABSL= 3
##$ALPHA= 0
##$AQORDER= 0
##$ASSFAC= 0
##$ASSFACI= 0
##$ASSFACX= 0
##$ASSWID= 0
##$AUNMP= <proc_1d>
##$AZFE= 0.1
##$AZFW= 0.1
##$BCFW= 0
##$BC_mod= 0
##$BYTORDP= 0
##$COROFFS= 0
##$CY= 12.5
##$DATMOD= 1
##$DC= 0
##$DFILT= <>
##$DTYPP= 0
##$F1P= 14.0000005364418
##$F2P= -0.99999901652339
##$FCOR= 0.5
##$FTSIZE= 32768
##$FT_mod= 6
##$GAMMA= 0
##$GB= 0
##$INTBC= 1
##$INTSCL= 1
##$ISEN= 128
##$LB= 0.3
##$LEV0= 0
##$LPBIN= 0
##$MAXI= 10000
##$MC2= 0
##$MEAN= 0
##$ME_mod= 0
##$MI= 0
##$NCOEF= 0
##$NC_proc= -5
##$NLEV= 6
##$NOISF1= 0
##$NOISF2= 0
##$NSP= 0
##$NTH_PI= 0
##$NZP= 0
##$OFFSET= 16.522
##$PC= 1
##$PHC0= 217.8726
##$PHC1= 8.235417
##$PH_mod= 1
##$PKNL= yes
##$PPARMOD= 0
##$PSCAL= 4
##$PSIGN= 0
##$REVERSE= no
##$SF= 250.13
##$SI= 32768
##$SIGF1= 0
##$SIGF2= 0
##$SINO= 400
##$SIOLD= 32768
##$SREGLST= <1H.DMSO>
##$SSB= 0
##$STSI= 32768
##$STSR= 0
##$SW_p= 5175.98343685301
##$SYMM= 0
##$S_DEV= 0
##$TDeff= 65536
##$TDoff= 0
##$TI= <Analysis number 999999
Compound Code 99
Book Reference 9
Project Code 9>
##$TILT= no
##$TM1= 0
##$TM2= 0
##$TOPLEV= 0
##$USERP1= <user>
##$USERP2= <user>
##$USERP3= <user>
##$USERP4= <user>
##$USERP5= <user>
##$WDW= 1
##$XDIM= 32768
##$YMAX_p= 375730032
##$YMIN_p= -485353
$$ End of Bruker specific parameters
$$ ---------------------------------
##NTUPLES= NMR SPECTRUM
##VAR_NAME=  FREQUENCY,     SPECTRUM/REAL,   SPECTRUM/IMAG
##SYMBOL=    X,             R,               I
##VAR_TYPE=  INDEPENDENT,   DEPENDENT,       DEPENDENT
##VAR_FORM=  AFFN,          ASDF,            ASDF
##VAR_DIM=   32768,         32768,           32768
##UNITS=     HZ,            ARBITRARY UNITS, ARBITRARY UNITS
##FACTOR=    0.157963299565203, 1,           1
##FIRST=     4132.6476996994, 0,             0
##LAST=      -1043.33573715361, 0,           0
##MIN=       -1043.33573715361, -485353,     0
##MAX=       4132.6476996994, 375730032,     0
$$ Real data points
##PAGE= N=1
##DATA TABLE= (X++(R..R)), XYDATA
$$ [...]
23704A54647k24499l028J00325M9240j14475j8110M3592J4257l5494r2301Q0621
23693d5225K77409m7481j40528n0807k1270N0741K0568k5176r9468r0678L8014
23682a33901J52501m0734q4358N6902Q7015k25703n7825Q1689J21801N5776L1150
23671D4313r4692N3774j0870n9838p2150M9048n63l8897P0483Q1118R0587m6774
23659F5539K8605R66n315q3014J59186j9085n2717l9957Q1460p0750p4631p0993
23647h0706l4895L9597j8460K0685K4252k8575p7489o6742p6517L5559N1705O0442
23635a51144N048Q4327J96782N8390O0865L4944j05157q4697Q8014n7715j27429
23624B228l2501Q2022j3163J0292J2865m3669j02600j07571L2813K5030L1924
$$ y = [154647, -69852, -72880, 27445, 76685, -37790, -55900, -12308, 1949, -33545, -125846, -45225, 232184, 184703, 44175, -6632, -27902, 22839, 43407, 18231, -81237, -171915, -133901, 18600, -22134, -106492, -49590, 37425, -188278, -246103, -164414, -42613, 13163, 44313, -50379, 3395, -7475, -67313, -139463, -90415, -90978, -129875, -59392, 21726, 112313, 65539, 94144, 95110, 89795, 6781, 165967, 146882, 94165, 54208, 135668, 64918, -9713, -80706, -115601, -76004, -94464, -73779, -49527, -78102, -155591, -222333, -298850, -263291, -211586, -151144, -146096, -61769, 135013, 193403, 254268, 289212, 184055, 99358, 187372, 129657, 2228, -30273, 51749, 38586, 48878, 61743, 18074, -84526, -192097, -159284, -134254, -102330]
23613a02330m7588j98502r984K05912K03595m9110n3446O6592k5987n0681n9412
23602a20941R007m9432o3909O7298J91759l8880n0430j0954l0707O2967N7053
23591B2831j9634k2518k2441K292j9970o3523n3202M037Q8349n4302L6047K0957
23579h1077j7058l3185Q5861J05091J0831M3623o7546j72076k31Q301r192N5456
23567g1202N4094K580n6288M0396J42800J32742n2937k02064P1300Q4188q5685
23556E9924q4662P5973M5410l6113l698P6870P9384J0534q5700k6617p5677L6825
23544G2453J2481J13649p1303j73486r1773J2827O0808J3627j799J2239J6750
23533b3527M6893j61175M2031R4741O2283J35235j05046j19291m8487L7505J34974
$$ y = [-102330, -149918, -348420, -358404, -152492, 51103, 1993, -51453, 15139, -10848, -61529, -120941, -111934, -161366, -225275, -157977, 33782, -5098, -55528, -66482, -97189, -34222, 22831, 3197, -19321, -41762, -39470, -59440, -122963, -176165, -172128, -83779, -138081, -102034, -81077, -98135, -131320, -45459, 59632, 70463, 114086, 46540, -125536, -125767, -117466, -126658, -71202, -17108, -14528, -70816, -30420, 112380, 245122, 192185, -9879, 61421, 145609, 59924, -24738, 51235, 96645, 60532, 56834, 133704, 213088, 223622, 137922, 111305, 35628, 72453, 84934, 198583, 127280, -46206, -137979, -125152, -64344, -50717, -52516, -40277, -23527, 23366, -137809, -95778, -1037, 61246, 196481, 91435, -27856, -76343, -38838, 96136]
23522I6136J2033j64718r6751J36038P2731p4177J7694o6386n2726M0466k3465
23511a03125m4602j6546Q2868L6681j6562R2266R6651K0220o1554J2183l9559
23500E8921p0040R121M6001M0957K2033O916j14662N9854Q6773P430j25862p5699
23488d8257p658L0237l2678p3458l0637J6943N4350K986N4773M6513L7853j37889
23476h6922l1575J08462O5299r8741Q7228K8359n8061K1573l2625P8947J10874
23465A92818p6061r4025q1143m4390n2142j0376j03356n8948J18526O1513J6089
23454a31495j6159O3995j7980M7096o2501P6837N9934Q1599r7170m3152k1621
23443f0617k699k9290O7414O2341r5333J3702J06585L1390n0908q0621N7315j16501
$$ y = [96136, 108169, -56549, -153300, -17262, 55469, -18708, -1014, -67400, -120126, -79660, -103125, -147727, -164273, -81405, -44724, -61286, 30980, 127631, 147851, 86297, 98480, 58921, -11119, -1998, 44003, 84960, 106993, 113909, -753, 59101, 145874, 153304, 27442, -48257, -55915, -25678, -58356, -131814, -162451, -145508, -91158, -88172, -33399, 13114, 50967, -86922, -118497, -10035, 55264, -43477, 43751, 72110, 14049, 35622, 2997, 81944, 192818, 116757, 22732, -58411, -102801, -154943, -165319, -268675, -327623, -209097, -147584, -131495, -147654, -83659, -101639, -54543, -117044, -40207, 19727, 101326, 4156, -38996, -60617, -63316, -92606, -25192, 37149, -58184, -44482, 62103, 93493, 42585, -38036, 19279, -97222]
23431i7222K8639j30394J6361Q8154N5303J19176m7924j29143M3216O4971P497
23420A8634M4356Q0139L9920o6472n7270J1668k1196n7075L952q8158J8933M7531
23408b5038n3621Q78J9285O6842L5318o0395Q589P7939m1876m4082O7195N194
23396E6228p0182J8958k9862K1087M6123m7121J26957M0632l888K5553m1731j31994
23384A0760K3062k6142N133r0085l6402Q4545r57j2794j56935n5958p573J8629
23372b44717J55488l0647J45274J23953L1870o603N515J20839p3860j28776j30797
23361c2461q068J2546O5466J7271L2883m1333q0491n188J7155P8341L5565p6418
23349A5268j3254m3165K6958l2087k3204M6572o6843r066M0619N7573M7423m6101
$$ y = [-97222, -68583, -198977, -182616, -94462, -39159, 80017, 32093, -97050, -53834, 11137, 18634, 62990, 143129, 183049, 116577, 59307, 70975, 49779, -7296, -3344, -91502, -72569, -25038, -78659, -77781, -58496, 8346, 43664, -16731, -8142, 69797, 27921, -16161, 51034, 56228, -13954, 5004, -24858, -3771, 42352, -4769, 122188, 162820, 158932, 184485, 142754, 10760, 33822, 7680, 12813, -77272, -113674, -29129, -30086, -42880, -199815, -255773, -263346, -244717, -89229, -119876, 25398, 149351, 181221, 174618, 180133, 300972, 227112, 98336, -32461, -40529, -27983, 37483, 54754, 87637, 46304, -34187, -39375, -22220, 56121, 91686, 15268, 2014, -41151, -14193, -46280, -69484, -22912, -89755, -98821, -58202, -629, 46794, 693]
23337F93q3271j51712J7515N5548M2391J06691k2617K9176K515K568m4014m2497
23325h7014j09106J32181O4302r0753j14597L970M3137J5806P3380l314K6931
23314d5077P6572R2856k4479j1676l9903q4176M5788N5844r5578j2692Q414J29943
23302I5836o5649j67743r1312P6585R7633R5568J2296l0657j0479M8126P8777
23291A38981k6290n7056k5321O1034P0241l9064j04251p2055Q188M8734L3147
23280C6288J00490K009r4721n2094r3357n0359N5354L5993M7558O2311P089m1096
23268A5465r4610N5975P3373j71068r0508R8584j2833k1604j9978M6770J11578
23257h856p30k4297m0691j7361J20210O8323J7337l1789Q66N4122N5784m6431
$$ y = [693, -82578, -234290, -216775, -161227, -118836, -12145, -34762, -5586, -3071, -503, -44517, -87014, -196120, -63939, 363, -90390, -204987, -201017, -157880, -142074, -68694, -72008, -45077, 31495, 124351, 99872, 88196, 48293, -35883, 9905, 65749, -29829, -42521, -34107, 95836, 30187, -137556, -228868, -152283, -54650, 40918, 53214, 22557, 12078, 60204, 138981, 112691, 55635, 30314, 91348, 161589, 122525, 18274, -53781, -45593, 3141, 36288, 136778, 138787, 44066, -8028, -101385, -151744, -96390, -60397, -12839, 49472, 56561, 15465, -79145, -23170, 50203, -120865, -211373, -112789, -125622, -147226, -167204, -120434, -8856, -9586, -33883, -74574, -91935, 28275, 96598, 113935, 82146, 83012, 137134, 192918, 146487]
23245A46487o5934r1113j0788J16544j36562N034N2665m0736O2941J63326K8769
23234B30633o9793j78101p3249J77957k8822o1585q7824k0820L1592R6718L7158
23223E3864j6722j43639O6550J09153m5703K4205q613r2366K0797J07237J7148
23212I1911p758j51237m704J25519L5291j018M271k2579O5008M9327L6102K7056
23200B47189j3215j27139m1516r0317L659L5045j19790j4375J45405L9425j4031
23189E0340l2820j54911o961O6480L847r689L4507K764l3945O7140M3527K6397
23177E6676L428j18141j9874O6449M9095j04045l817K8776J22725O5271L4287
23166A80830m0644j13468l0218M5791p7780j50630j4450O6080k3989R4967M3821
$$ y = [146487, 80553, -10560, -21348, 95196, -41366, -36332, 16333, -24403, 38538, 201864, 230633, 160840, -17261, -90510, 87447, 58625, -2960, -90784, -111604, -80012, 16706, 53864, 37142, -106497, -39947, 69206, 23503, 47708, 39095, -53271, -32474, 74763, 91911, 84153, -67084, -71788, 53731, 89022, 88004, 92275, 69696, 134704, 184031, 220133, 247189, 233974, 106835, 65319, -24998, -21339, 13706, -106084, -120459, 24946, 64371, 50340, 17520, -137391, -144352, -77872, -74025, -83714, -49207, -46443, -80388, -13248, 30279, 56676, 60104, -58037, -77911, -11462, 37633, -66412, -70229, -41453, 81272, 146543, 180830, 140186, 26718, -3500, 42291, -35489, -186119, -200569, -134489, -158478, -63511, -19690]
23155a9690j2117N6462R3608J5689J8135j36765n8854m0581L8771O1259K5360
23144D1277k9331q0233J51988J16226n9100o4483m8055n1445q8533q1018q810
23133b01517O5326Q4569j00414m3557J26332J19278M4401L7708r2122m4013J02039
23122I8030n45n6342K8408l3322q8201j36722M4829L356J3162P8556R0109R0548
23110A31866j20144q7522l2444N9166Q9158l0531r3636P7293J04008j1202j5605
23099G0407J2001o5732n4775k7853r240M1493m377p3786J2591P170j2913j1496
23087a16510L3079K5484j35648l3409J73304O7239n1076J4810j08101l478q057
23076a42363n5406J47484J25702p2932l4900O3205K0542l6372l9627O6087j9233
$$ y = [-19690, -31807, 24655, 118263, 133952, 152087, 15322, -43532, -84113, -45342, 15917, 41277, 11946, -68287, 83701, 199927, 140827, 76344, 28289, -23156, -111689, -192707, -201517, -136191, -51622, -152036, -195593, -69261, 50017, 94418, 132126, 40004, -4009, 98030, 97485, 41143, 69551, 36229, -51972, -188694, -143865, -140509, -127347, -48791, 41318, 131866, 11722, -75800, -108244, -49078, 40080, 9549, -84087, -6794, 97214, 86012, 70407, 82408, 16676, -38099, -65952, -75192, -33699, -38076, -111862, -99271, -92101, -105014, -116510, -83431, -57947, -193595, -227004, -53700, 13539, -37537, -22727, -130828, -134306, -142363, -197769, -50285, 75417, 2485, -32415, 30790, 51332, 14960, -24667, 41420, 22187]
23065B2187Q1533J19960r7566j22004l4417P1722J40119P2718o5791m8592n1638
23054H8231p6217j30956j1252J20384j28m979N3725k4607m1405k6435l4295j805
23042h9739k6801m4568o6017m2754J20061P9306p0777K1890N507n6207k6409l3606
23030b30114J8210R633Q1517R1240N703m915N557M0079o548m0519N6670P8429
23018A04942K4165n3995j9242K0239j06010M9365k274k0115M6222K4700O0902
23007A28899j4272j0304q6642l6342L8536J16837p06L9996k1119O5062m9727j30437
22995C9781k2307J0166Q240K002n2286K564r1511o2015R84Q4216J8165j61K1103
22982d1059N1775k9048j2161Q449M0131l9857L2162K2395l3379m37k1756l788
$$ y = [22187, 103720, 223680, 126114, 4110, -30307, 41415, 181534, 254252, 188461, 139869, 88231, 12014, -118942, -130194, -9810, -9938, -14917, 38808, 14201, -27204, -53639, -87934, -89739, -116540, -161108, -227125, -269879, -149818, -70512, -141289, -119399, -113892, -170099, -196508, -230114, -211904, -202271, -120754, -29514, -23811, -28726, -23169, 16910, 10362, -30157, 26513, 104942, 129107, 75112, 55870, 76109, -29901, 19464, 17190, -2925, 43297, 67997, 128899, 114627, 104323, 17681, -18661, 19875, 136712, 136006, 176002, 154883, 219945, 170218, 39781, 17474, 27640, 35880, 37882, -14404, -11840, -103351, -165366, -164382, -80166, -62001, -62162, -41059, 10716, -18332, -30493, -22044, 18087, -21770, 10392, 32787, -592, -1029, -22785, -26573]
22970b6573K3051O9173P7248q584o773o9872n4943n8174l2865M7396R6650q468
22958D7266K9176k5041r9179N7412J03909k8493o3554P9591N1196j23671j56605
22947a27993j0116J07048J58574O4456q351j56729p2127N0172L0047N6989k6718
22936F5252m9260J66508l7766m2969k2902q9902M6937p0840m8145J4527Q6873
22925A8313q3069j6326J2581O4244J7290P4276Q72K365j0839l2299j02560m5675
22913a00827R697J7419O5043Q1882M2718L3351L6786R4398o6263l7882m4888j64044
22901c2610o24N7445m9518n714p690M7646l363n4478L7776N6249k3883j28702
22889a07466n4517P6142M1996M8931l5245J80002l0007o7209q5732K3151J8447
$$ y = [-26573, -3522, 65651, 142899, 134315, 127542, 57670, 2727, -55447, -88312, -40916, 55734, 47266, 76442, 51401, -47778, 9634, 113543, 85050, 21496, 101087, 152283, 28612, -127993, -138109, -31061, 127513, 191969, 183618, 26889, -45238, 4934, 34981, 91970, 65252, 15992, 182500, 144734, 101765, 78863, -11039, 35898, -34942, -83087, -68560, 18313, -64756, -81082, -68501, -4257, 13033, 87309, 88181, 90546, 79707, 47408, -55152, -100827, -91130, -73711, -8668, 73214, 115932, 149283, 186069, 280467, 214204, 176322, 131434, -32610, -33234, 24211, -25307, -31021, -38711, 8935, 5572, -48906, -11130, 45119, 21236, -107466, -161983, -85841, -43845, 5086, -30159, 149843, 119836, 52627, -33105, -9954, 8493]
22878H493K2976p7062r5104m4300l0928J02646l1951P25K8170k0287j2648Q5341
22866f3929M2264k9784K3184p278L199J38754J00366j31681m8800j4582m4164
22855c2451k9806o3048K5840K8494M1699J03863K9686j19231j15503j50092P5309
22844b05240N2232O2686P6450j7448j4820o268n4304N6203R4869p0954n8472r9791
22832a84857k0021K0747L5317p4484Q6671O9586K5073K183O1727n1524O8696p8178
22820c9064o8889J06659J0315j5210o5928k590J05454K4638R9988r9776O6860
22809A22457m2099j13783J38193J03157o9523r771m4302l8599m6595j32489N709
22798a27645R4205M9346N4296o6975n1184j3251r5010J55468J12845n4803L5828
$$ y = [8493, 31469, -45593, -140697, -184997, -215925, -113279, -145230, -144505, -116335, -136622, -149270, -63929, -21665, -51449, -28265, -35543, -32344, 106410, 206776, 75095, 26295, 11713, -32451, -62257, -125305, -99465, -70971, -29272, 74591, 104277, -14954, -130457, -280549, -205240, -153008, -90322, -13872, -31320, -46140, -52408, -106712, -50509, 44360, -26594, -85066, -184857, -204878, -184131, -148814, -223298, -136627, -67041, -41968, -39785, 21942, -29582, 39114, -39064, -107953, -1294, 9021, -6189, -72117, -74707, 30747, 55385, 155373, 55597, 122457, 80358, -33425, 104768, 207925, 138402, 128631, 84329, 45730, -865, -133354, -127645, -33440, 15906, 70202, 3227, -47957, -61208, -156218, -750, 112095, 57292, 93120]
22787I3120J12718l710r8459o203m473q7998n352k3030m7123N9548m9174j68598
22775b28734N2252J02111O7024k8566j4076m2510j38417j08968K7085J25007J83815
22764c977J20868N491k9333J2289j4943o2571p0226L9783Q5019j6205M9252j0532
22752A04915L6277m0157n5570r0826P0078N3130o9767j1499o614J3768J4072m2902
22740b5095L2993R2723L5709k1813N5027N3497p2663j16541j49887J1436J27997
22729B3383p0033p5249J62827l7738p5606k8995q7432K4456R2391P8563K9365
22718C5932k375L6924Q4651O3374k9011k6483j84739J0097M0447j0898l3790R881
22706e990l6105J08291Q092j52563m1240O3354L0496P5660O8966Q1422J6834k14242
$$ y = [93120, 205838, 202128, 103669, 97466, 92993, 4995, -357, -23387, -70510, -10962, -60136, -228734, -176482, -74371, -7347, -35913, -49989, -92499, -230916, -339884, -312799, -187792, -3977, 116891, 122382, 93049, 105338, 90395, 27824, -42402, -2619, 82400, 66195, 115447, 104915, 141192, 101035, 45465, -45361, 24717, 77847, 8080, -3419, -10033, 3735, 17807, -25095, 7898, 100621, 136330, 114517, 169544, 223041, 150378, 33837, -116050, -104614, 23383, -46650, -121899, 40928, 3190, -72416, -101411, -188843, -164387, -71996, 6567, 35932, 33557, 70481, 155132, 218506, 189495, 163012, -21727, -11630, 28817, 17919, -15871, -5990, -42095, 66196, 74288, -78275, -119515, -56161, -25665, 49995, 118961, 200383, 217217, 2975]
22694B975L5273M516j44771o0784J20064K0143Q4719j9100j59892k0265k9720
22683a66842J14877J62390P507k07473p6750R939J45435L9788q7363N8454Q4359
22672H4321r2433p4691m3925j371n8319K6069J0573R4295R235L8848O871p2041
22660g2568m4943J36954K4502M2001n2367j09674j11173N6241J11085P8727j3282
22649D5503j13464m6241o8325L7382M7053j35082j2817M0051m0918P637J07841
22638a31380l4993q0969J18892k3414n9191M3518J489J39236L8456O8986J1485
22627I2115q5145r0302o3250l3783K8909J39987J08022Q5835l2715r4686q206
22616D6781J5417n3917J1828j02646n1111J7674J11008M8401K2276m3884j3718
$$ y = [2975, 38248, 42764, -102007, -162791, -42727, -22584, 62135, 43035, -116857, -137122, -166842, -51965, 110425, 117932, -89541, -166291, -156352, -10917, 28871, -58492, -38, 84321, -8112, -82803, -126728, -128099, -186418, -160349, -149776, -55481, -46246, -7398, -527, -72568, -117511, 19443, 43945, 85946, 33579, -76095, -187268, -131027, -19942, 58785, 45503, -67961, -114202, -182527, -145145, -98092, -233174, -245991, -205940, -246858, -239221, -131380, -166373, -247342, -128450, -151864, -211055, -167537, -166048, -26812, 11644, 80630, 92115, 6970, -83332, -146582, -180365, -151456, -11469, 96553, 182388, 149673, 54987, 46781, 62198, 8281, 20109, -82537, -133648, -115974, -4966, 43435, 65711, 21827, 8109]
22605H109M4747K768n5570L0075r131n9971L3118q9411j25236R8688N9717L020
22593e9077m5615O238p4575o7925N1P2262Q0680q610P4135N188p9290P946P3825
22580a4767J4638l898J46667j05298j46143N2088J28656Q6088K2581o5379j18612
22569c379m8435o5408p3669N7588M8299j47112n0743O3937L6287O5799L0300L654
22557h2882J4268M4660k2901l4971J3406O0385O4654J06162o3200N7898n2439
22546A05040J4255n3753k0448J5202r0526n3082J04198M9371J58n1218o4730M3858
22534a675M7214N5051r142J6906l9262q1738J5502p0029k1140m8770o9679j8922
22522b25684R4460R3071j6129n2914o6609M70J05033J74453K6964o2699j46772
$$ y = [8109, 52856, 55624, 54, 30129, 20998, -38973, -5855, -95266, -220502, -121814, -62097, -59077, -104692, -98454, -173029, -240954, -240903, -168641, -87961, -96571, -22436, -17248, -96538, -88592, -14767, -129, -4027, 142640, 37342, -108801, -56713, 71943, 158031, 180612, 115233, -3379, -51814, -117222, -190891, -133303, -85004, -232116, -282859, -218922, -182635, -116836, -86536, -82882, -68614, -23954, -46855, -81826, -68420, -8035, 56619, 162781, 99581, 157479, 105040, 119295, 65542, 45094, 60296, -30230, -83312, 20886, 70257, 70415, 19197, -45533, -1675, 45539, 100590, 91448, 108354, 69092, -12646, 2856, -67173, -88313, -137083, -206762, -225684, -131224, -38153, -54282, -107196, -173805, -173335, -68302, 106151, 133115, 70416, -76356]
22511g6356O719Q4843p7565M1238O1958l8442j65296Q279J34599K6266J0505K6303
22499D3051J00635J7024o1463L9715p1335l5590l6063j14411k1294J2568N0680
22488g6483K5767J18447q790R989p0794k4158J6070l8353K2915K8919O8197P0303
22476A42029O949p1474K3422j03240n4199n7777M2604O8096J5033o7364l0039
22465h5960J20041j07607p024M4757j18402J6813K0331j1173q2119Q5156Q3955
22454d1232r0043m0203J16602M7771j7989N9843N318l644N7017o8051j28562j2967
22442a16140j08823P607J33175m649M225p0438K9583M0258J07546J39097J01082
22431B62523l0103k29245n5536O6884J7678J30213M4741j12634k6011M8625J0386
$$ y = [-76356, -69637, 15206, -62359, -21121, 40837, 2395, -162901, -154622, -20023, 6243, 16748, 43051, 143686, 160710, 99247, 138962, 67627, 32037, -4026, -118437, -139731, -127163, -76483, -50716, 67731, 58941, 68930, -1864, -26022, -9952, -48305, -25390, 3529, 71726, 142029, 148978, 77504, 100926, -2314, -56513, -114290, -71686, -3590, 11443, -55921, -85960, 34081, -73526, -80550, -35793, -154195, -137382, -117051, -128224, -210343, -125187, -41232, -131275, -171478, -54876, -7105, -25094, 34749, 40067, 36423, 93440, 25389, -103173, -116140, -224963, -217356, -84181, -88830, -84605, -155043, -125460, -85202, 22344, 161441, 262523, 232420, 3175, -52361, 14523, 32201, 162414, 207155, 94521, 68510, 117135, 127521]
22420A27521o1592j10754m6486j7228M7641M5606J4748n0962j8756l9010K3691
22409h5581k7893j4314J4823P4430k9529n945J25533P0526K6879n6597n6855n5628
22397b0151l7902O8638L2543k4164o6595k7167j7565q4306K3399J00554m0921
22386i3637j50803k4563O8093O8740m225K3604L2714K201O6853k9287j20481m2545
22374b03336K2263J00468J42867P4927j11749j10284q8554K2164J03392l4856
22364h2698n2225q994J00964J3409j39416l7640Q4132M4230R3451P6762m287n7590
22352C0098M8025l4485M9620l375j54476n4819l1227O3249P2146K7406o5935m8751
22340a02524J62619R4554j38241j24081k8529R6015J39787R296l2092P461p9907
$$ y = [127521, 65929, -44825, -91311, -108539, -60898, -15292, -544, -51506, -70262, -109272, -85581, -113474, -127788, -112965, -38535, -68064, -74009, 51524, 122050, 148929, 92332, 35477, -20151, -58053, 10585, 43128, 18964, -47631, -74798, -92363, -176669, -153270, -52716, -93637, -244440, -269003, -200910, -132170, -136395, -112791, -80077, -77876, -11023, -40310, -160791, -203336, -181073, -80605, 62262, 137189, 25440, -84844, -173398, -151234, -47842, -82698, -134923, -143917, -42953, -29544, -168960, -206600, -122468, -78238, 15213, 91975, 87688, 30098, 78123, 43638, 93258, 89883, -64593, -119412, -150639, -87390, -15244, 12162, -53773, -102524, 60095, 154649, 16408, -107673, -136202, -40187, 99600, 108896, 76804, 84265, 4358]
22329D358n002j02837n5969M2799O2564Q3319r938j5727n2651P7026K933j27109
22317i6234p5441N1479M4503q0237k5766r4598r1455P6799J45451k0820M085N4234
22305a08000M1873J446p0939n4790J06478N3749J48065L5672l9797j15243o3823
22294f5309r37L9900l7460J4401L7702j43447j5531J39270J42541J30846j28101
22283A13875j39417p4709n6032J74494L1192n8525n4453k2226k6728L6016K6102
22272e0411Q8484L2313q524r5399L0569O5373J11448Q3828p7862p2526j5176Q108
22260A00225l6700n8187M9037p5804k7043J10181K1589R270l2357p8926J1833
22249f882K6564k1352l0007k271l0767j9376M6835Q203J1223J28890p6035j49455
$$ y = [4358, -644, -103481, -159450, -116651, -54087, 29232, 19294, 3567, -49084, 27942, 30875, -96234, -171675, -120196, -75693, -155930, -181696, -276294, -367749, -290950, -145499, -166319, -162234, -108000, -66127, -64681, -135620, -190410, -83932, -30183, 117882, 153554, 113757, -1486, -65309, -66246, -26346, -63806, -49405, -11703, -155150, -170681, -31411, 111130, 241976, 113875, -25542, -100251, -156283, 18211, 49403, -9122, -63575, -85801, -112529, -76513, -50411, 38073, 70386, 61862, -33537, -2968, 62405, 173853, 257681, 179819, 107293, 92117, 100225, 63525, 5338, 54375, -21429, -48472, 61709, 83298, 92568, 60211, -18715, -6882, 19682, -1670, -31677, -33948, -64715, -84091, -37256, -29053, -17830, 111060, 35025, -114430]
22237a14430P4357N6817J0814K4973m6262K3779M8530K294n3243M0035n7595j43134
22225a33065N9189m401j0957k7783k2408k8040J8220M12m1987p3852R8433O1546
22213a04693R6913J04367L5598N4945M1649o5149q7224l4181m0926M0277l2318
22202I258L5139j38274j26287J06805J2049k4382J8910m643J7348M9766J6038
22191b8273o6122n0750j02205J08280J09238O4509K4375p869l8155J4916J14201
22180A42145j4654R757n9794n3214o6241M8588J660o2821J696l9170o4429P382
22168a49095l0445K5751m8767J08049R755M7729J05579o4462m8101M3435L6623
22157C6051O7872m0492l470K3844p2610m2725j45382j28108J17997J12148L8752
$$ y = [-114430, -40073, 16744, 27558, 52531, 6269, 30048, 78578, 80872, 27629, 67664, 10069, -133065, -73876, -78277, -89234, -117017, -139425, -167465, -149245, -148833, -190820, -264672, -166239, -104693, -7780, 96587, 132185, 187130, 228779, 163630, 76406, 42225, 1299, 41576, 9258, 44397, -93877, -220164, -113359, -101310, -125692, -106782, -111425, -94077, -44311, -28273, -94395, -145145, -247350, -139070, -29832, 34677, 59052, 51183, 13028, 27944, 142145, 127491, 137248, 77454, 24240, -42001, 6587, 8247, -54574, -52878, -92048, -156477, -149095, -179540, -153789, -202556, -94507, -84752, -37023, 68556, 4094, -44007, -572, 36051, 103923, 63431, 59961, 83805, 11195, -31530, -176912, -305020, -187023, -74875, -36123]
22146c6123q9122J32519K18715N2561j22838p8927p2845m4669M8538O3783K8122
22135I9714L0815L5373k22757j02822O629O2070p6842j7129J82893Q0146l301
22124G4789q9749r1528q2562J35861Q1303N7399O7854n1360P3122J2687l8054
22113A49762k703k2552k8125J5604L1572l7353k3082n9336l1568j00846p7941
22102a86568M5048M7865J31269m3366J8617N166m9787j34980p9201o2871P9423
22091b29385J43287K0891J9590m4457j9160r092k3844r9665j2186O2130K0531
22080a71360M3522K1246J5859R7480L1771l3290N7921l6249p7456m2602L8966
22069e4192P4708J02553O4155r742k0216o6045P6560k0936r5852j48188L8255
$$ y = [-36123, -125245, 7274, 225989, 278550, 155712, 76785, 3940, -40729, 7809, 71592, 99714, 130529, 165902, -56855, -159677, -153048, -90978, -167820, -184949, -2056, 78090, 74789, -14960, -106488, -189050, -53189, 28114, 85513, 153367, 102007, 175129, 187816, 149762, 147059, 124507, 96382, 111986, 143558, 106205, 83123, 23787, -7781, -108627, -186568, -141520, -93655, 37614, -5752, 12865, 18031, -31756, -166736, -245937, -308808, -229385, -86098, -65207, -45617, -90074, -109234, -118326, -142170, -241835, -254021, -191891, -171360, -127838, -106592, -90733, 6747, 38518, 5228, 63149, 26900, -50556, -93158, -54192, 20516, 123069, 187224, 177482, 157266, 91221, 167781, 146845, 50993, -97195, -58940]
22058e8940L3616l1925J8110J42271P9686P884p4442j44348j778L0259k6047M2048
22046A6394k2448L3899k1402o7011j852O410k6383k8106K3900L8591r6204K0945
22034a23267Q9843m5842O3328J37659m3189k1232R6795n3817n5443K99n0539m7791
22022e3196n6464m740p1331j1993J06893j2213N5342q24p1428q4775L3623k7236
22010a98342Q831N1862m420J01630N7780J1457Q3199j5417o0981n828N8229k5754
21998F2246K3531j40613n4130m8616l8818R0128J01552N4481k3561j02901o5476
21987a42177j28533L2328Q7616J22812k8906J3005K1626k5392Q4458n1986k5730
21976d0879m5573N8620J9048m3957J4700j03440l4418O124L7788q528m7837N4442
$$ y = [-58940, -25324, -57249, -39139, 103132, 182818, 190702, 116260, -28088, -29866, 393, -25654, 16394, -6054, 27845, 6443, -60568, -62420, -56010, -82393, -110499, -86599, -48008, -144212, -123267, -33424, -79266, -15938, 121721, 78532, 57300, 154095, 100278, 44835, 45134, -5405, -53196, -109660, -114400, -185731, -197724, -90831, -103044, -47702, -48526, -119954, -204729, -171106, -198342, -189511, -137649, -142069, -40439, 17341, 28798, 111997, 96580, 35599, 29771, 88000, 62246, 85777, -54836, -108966, -157582, -196400, -106272, -4720, 49761, 26200, -76701, -142177, -270710, -238382, -150766, -27954, -56860, -43855, -22229, -47621, 36837, -15149, -40879, -86452, -27832, -8784, -52741, -38041, -141481, -175899, -169775, -131987, -140515, -188352, -133910]
21964a33910L0667j14596R4520P5018l3456P7275K11176j6637j64799k787l47
21953B2124k2107O1120q0645j1260M3197J0461l6158j40960j06767P9292R4024
21942h7679J07405L7849j2700l8222q0219j6359O3983l1532M2480R0099m0787
21931C4318j36126J8727R069k7065J1223j915p7497O938M0603R9741m0361r8066
21919a60411J7563k7962R1589M6040p6100L8552O5511m124L3090n2323J1314j3949
21907c1210K9948O2367j1969j09713n424j9479Q2116l2808L7657O1998N409o8840
21895E2N524p7319m7939M5371J04192P6343m1988k3439l9119J17011l4309j0160
21883G4220j0129L2996m261j08638N7426N3078k4148K7772N6469J7311r426j01458
$$ y = [-133910, -103243, -217839, -123319, -48301, -81757, -4482, 206694, 190057, 25258, 22471, 22124, 17, 61137, -19508, -30768, 12429, 22890, -13268, -154228, -260995, -181703, -87679, 19726, 57575, 44875, 6653, -73566, -89925, -25942, -57474, -14994, 75105, 34318, -101808, -83081, -74012, -101077, -89854, -91769, -169266, -162328, -121725, -21984, -62345, -160411, -142848, -170810, -79221, -33181, -109281, -70729, -5218, -9342, 23748, -28575, -17261, -31210, -1262, 61105, 49136, -60577, -66001, -85480, -3364, -36172, 1485, 63483, 68892, 52, 5576, -71743, -119682, -74311, 29881, 106224, 64236, 40797, 1678, 118689, 84380, 74220, 64091, 97087, 92826, -15812, 41614, 94692, 70544, 98316, 154785, 172096, 162670, 61212]
21871F1212j5596j28515j17426J44091R0847j5419K1126M9439j6972N2033K1730
21860A46550j08196k2259m5543l9316j13789R746J35976J60207m9891k20465N238
21849a41742l1271N3368N3030m1881n8013K9558M8731J14923J4245m4831n1604
21838e5487J48202j0358l7535M3305N5150O836L3306K5031o506N4837p9958l9448
21826A37375K3378r4577N9721n4383j22027L2257L8875m8127r1455N1045J06654
21815C8736K5957p6712J0890R4151O3662j5653j2940r0335q6185J8202J3874l3897
21803e0250k7814K1186Q7038J59171n8917j20085r1106p2486Q187M3469N0122
21792e1485j9798k2488m6916m2033J13871J0369N868J51007r4208K9012J15878
$$ y = [61212, 45616, -82899, -200325, -56234, 34613, 19194, 40320, 89759, 72787, 124820, 146550, 38354, 16095, -29448, -68764, -182553, -172807, -36831, 123376, 73485, -146980, -141742, -173013, -119645, -66615, -108496, -166509, -136951, -88220, 26703, 40948, -3883, -55487, 92715, 82357, 44822, 88127, 143277, 150113, 183419, 208450, 201944, 256781, 176823, 137375, 160753, 66176, 125897, 71514, -50513, -18256, 20619, -27508, -118963, -67918, 38736, 64693, -12019, -1129, 93022, 156684, 141031, 128091, 37756, -48429, -30227, -16353, -50250, -78064, -56878, 30160, 189331, 130414, 10329, -80777, -153263, -145076, -101607, -51485, -71283, -93771, -140687, -182720, -68849, -58480, -52612, 98395, 4187, 33199, 149077]
21781A49077r669j31967L8774q6421K8289R998J2346j1905L5867m7644K4813J25823
21769A37381m5581k3526j0805Q222n6884n7129M8434L5752l9659O6754L9282j72655
21757g0414l5651J3193J581r768L8300N2660m3300q138O2304j5913r4176n415
21745a14737P0798n5384j04703K082M0412J12602j5214M1291m5819o9838q6360
21734b24870O6938R1165K6748J1594n2994j5715N9426N9720q1045M4885N4225
21723D0077N1593m2219M664j4759q3214m8896r1755O4407L7582l8499n7829L2815
21711a46033K4600j6306j7864R8228k9134L0337M3294n6808P9193J16088j7742
21700A07853j15181o1686O7224l8334L6893l9024m3107l9382K1405Q0555M2866
$$ y = [149077, 139408, 7441, 46215, -40206, -11917, -1919, 10427, -1478, 34389, -13255, 11558, 137381, 91800, 68274, 57469, 65691, 8807, -48322, 112, 35864, -3795, 62959, 102241, -70414, -106065, -92872, -91291, -101059, -62759, -10099, -53399, -61537, 767, -15146, -109322, -114737, -43939, -99323, -204026, -201944, -161532, -48930, -64144, -22853, -68672, -138510, -224870, -157932, -66767, -40019, -28425, -81419, -97134, -37708, 22012, -59033, -14148, 40077, 91670, 49451, 54115, 39356, -43858, -92754, -184509, -120102, -82520, -121019, -178848, -146033, -121433, -137739, -155603, -57375, -86509, -56172, -12878, -69686, 9507, 125595, 107853, -7328, -69014, -1790, -40124, -3231, -42255, -85362, -124744, -103339, -22784, 20082]
21689B0082K9740L5155l388P3815M4963q4346j19671o2242j05049M7099k2451
21678a46293m1247N0739J06709J09406Q7625m3117j00625n9057Q1216r5485m3910
21667i4039l9644j9728j6735J19570n2856L8915J2005O9529m7129j07999M8786
21656h9325J04352N2779o9117o0189K6525r136O53j03441N9213J32100L6905m0441
21644D0878l0990M7514o059q5501q4124L7365L785j25400N0374L7960p5326L5007
21632a54517J06677L7380j0794J17054R2147M4942p9727o2771l657Q1659k3229
21621A45164q3433j08102o6584N0557K4607L2016K7764J2167M4833o012j63566
21610i0589l2557K471O7043J2463O9943L2736q3262q4297j08707j00503N1094
$$ y = [20082, 49822, 84977, 81589, 155404, 200367, 116021, -3650, -65892, -170941, -123842, -146293, -187540, -136801, -30092, 79314, 166939, 123822, 23197, -35860, 45356, -50129, -94039, -133683, -153411, -170146, -50576, -103432, -64517, -52512, 17017, -30112, -138111, -89325, 15027, 67806, -1311, -61500, -34975, -44111, -43458, -146899, -87686, 44414, 81319, 40878, 9888, 57402, 51343, -34158, -118282, -80917, -77132, -202532, -152158, -114198, -189524, -154517, -47840, -10460, -21254, 95800, 187947, 232889, 153162, 90391, 86734, 168393, 145164, 61731, -46371, -112955, -62398, -37791, -5775, 21989, 34156, 78989, 72977, -90589, -123146, -120675, -53632, -41169, 28774, 61510, -21752, -106049, -214756, -315259, -264165]
21599b64165M2728J09965J38211L3459O0094j00038j07281q2852o8517r110O5745
21588a81761J63378n9626j88423L9876O2116L0043M3299j072l1257P4421Q5519
21577C6513J0396N8609M5047q9324M562k1979J3970P9646m0573L1602M7781k3310
21565A52940N0515p7028J3056j9499q2147n0840o6463L8102L6384k7508j06259
21554a38747j09926O3659J19147J9119N697K1941L8817K5626J0311L0907M2367
21543A28918M2078j2011q3281L5832O7959J363l6374o4943m9213j3624k7584N915
21531d965j4842r2706m8300J0435P3313K3539k6385M2000p937J55452O2386j15282
21519E6708k3821n6055m0990j1534P5196N7262J15455O2793n8296J8732j35929
$$ y = [-264165, -221437, -111472, 26739, 60198, 120292, 20254, -87027, -169879, -238396, -247506, -181761, -18383, -78009, -266432, -226556, -164440, -134397, -91098, -92170, -123427, -49006, 36513, 46909, 105518, 150565, 61241, 65803, 43824, 57794, 137440, 96867, 128469, 176250, 152940, 203455, 126427, 139483, 119984, 37837, -13003, -79466, -41364, -4980, -32488, -138747, -248673, -185014, -65867, -46748, -41051, -19110, 19707, 45333, 55644, 86551, 128918, 170996, 158985, 75704, 111536, 179495, 180858, 144484, 79541, 30328, 16704, -10880, -4965, -19807, -112513, -160813, -150378, -77065, -53526, -79911, -37911, -45848, 109604, 171990, 56708, 32887, -23168, -64158, -75692, -496, 56766, 172221, 235014, 176718, 195450, 59521]
21508E9521j25669O8841N0067j13017r7446K5118Q8236N3070j02893Q782P9644
21497e746J7612o3278j6977J203L410P7958Q6568m2847k6880J24573K8560m6952
21485A37204J4588q8226R9458j1972k1300p7206q9859J1073l9401L3740J4546
21474a7355q24P9935m5887J1283J1089j538J19929k98J153j54470k7814j063N0713
21461B4853n0590k5485L5886P8827L4255J58287K0667m1913j04493j49276k1259
21450d0241o771M1534N1164n7379l6440p018K6745O530M6975O5913N204j095K3507
21437A18628O6258l3849m6657J1866o5366l6419n60R4187R209j6978J10276J8777
21425B29372o1927m1391n5203m5415p8658j3297N0219P6276Q5914J4246k6123
$$ y = [59521, -66148, 2693, 52760, -60257, -157703, -132585, -44349, 8721, -94172, -85390, -5746, 11866, -51412, -68389, -67186, -63776, 14182, 100750, 57903, 31023, 155596, 184156, 137204, 151792, 63566, 163024, 151052, 129752, 52546, -37313, -26240, -65641, -31901, -17355, -18179, 61756, 15869, 27152, 38241, 36703, 156632, 156334, 157487, 3017, -24797, -25860, 24853, -25737, -51222, -15336, 63491, 97746, 256033, 276700, 234787, 130294, -18982, -40241, -47012, -5478, 45686, -11693, -48133, -55151, -28406, -21876, 25099, 91012, 96216, 95121, 118628, 184886, 151037, 104380, 116246, 50880, 14461, 13901, 108088, 117297, 100319, 210595, 229372, 167445, 126054, 70851, 25436, -53222, -66519, -16300, 59976, 145890, 160136, 134013]
21414A34013l3846j05764Q3391L1928o6396o194n7759K8083r215N2625m9431m4159
21402d2724R205J01469J09087O830k1179o0531j33852R1795m305m4158K0804j09725
21390g7284m0636M4619l1979M0871J9994R2801P4794M3555l0779j39583j08867
21379a12494P7771J44324m1998k00178j03594o3068R1608K16334O9243K7769N4272
21368A59989L9454M144K4786j39957r5819J8869N9976r1593P833j532L565M8525
21356C8240j14483n377M9567J58317M9411l6968N316m0985m7852K1144j9543J0514
21344F7301O3728J1298l1318n8988k7031K7978r0054m3974J66189O3043R016J35954
21332B93142l5835j23939p0403p8898m5871j3983P9717l704l1617m3825M9818
$$ y = [134013, 100167, -5597, 77794, 109722, 43326, 37132, -20627, 7456, -1759, 50866, 1435, -42724, -33519, 67950, 177037, 183867, 162688, 102157, -31695, 60100, 55795, 11637, 32441, -77284, -117920, -73301, -105280, -64409, -44415, 48386, 123180, 166735, 135956, -3627, -112494, -34723, 109601, 67603, -132575, -236169, -299237, -207629, 8705, 77948, 105717, 159989, 199443, 203587, 228373, 88416, -7403, 11466, 71442, -20151, -12318, -13850, -10285, 38240, -76243, -81620, -32053, 126264, 175675, 138707, 144023, 103038, 55186, 76330, 56787, 67301, 131029, 142327, 111009, 52021, 24990, 52968, -37086, -81060, 85129, 148172, 157188, 293142, 257307, 133368, 62965, -15933, -61804, -75787, 3930, 226, -31391, -75216, -25398]
21321b5398M3012N2946L4915k4695j43769k6270N0006M7555j0693n1199k5218
21310g8808M1249m4113q0789M6528q0416n3617J44598J83597r3240R2027j8212
21299E8804O420N8898n7150L2354J4612m1353o5551L386R2870K337j5773R4344
21287A84198m4924q7546L38q2211j33129n0842J16498P8823n9864j74398R5236
21276a57821M2625L336l5611m1387K6449P540J04383J77997J57560J5653j38366
21265A62358o6993K9693K6921j00160J5613J4674M890Q8382o169M2249j9567j33137
21253E8754j41486q530R981P801M0326J24263O5118Q5630n4819q7792k8251o2635
21241H360O2319m735j8929j9719K8234n2066J013N2949J75991N6382p6766n9631
$$ y = [-25398, 17614, 70560, 105475, 80780, -62989, -89259, -39253, 8302, -2391, -53590, -78808, -37559, -81672, -162461, -115933, -196349, -249966, -105368, 78229, -15011, 77016, 58804, 65224, 124122, 66972, 99326, 113938, 72585, 7034, 10420, 103290, 105627, 89854, 184198, 139274, 51728, 52066, -30145, -163274, -214116, -97618, -18795, -78659, -253057, -157821, -115196, -111860, -147471, -188858, -162409, -154869, -50486, 127511, 285071, 300724, 162358, 95365, 125058, 151979, 51819, 67432, 82106, 86996, 175378, 169209, 211458, 191891, 58754, -82732, -91262, -81281, -73480, -33154, 91109, 156227, 241857, 187038, 99246, 70995, 8360, 70679, 65944, 47015, 27296, 55530, 3464, 4477, 57426, 233417, 289799, 213033, 153402]
21229A53402l7530l7849r0715L261L6547M4086p0721r229j14952j8413M3590j16852
21217b15375L6425J45717J04784M4825l8082j49549o3678N848J58069Q9506l4832
21206H3658j35357Q6163j6995J6238K2951l7697P5304J05162j92506r3780m4061
21195a30920q697R7951P6831Q9262L508k7002l3712J04556K7864j17863k524k8304
21183E0950J20174Q5411p6068o6536J1250N7044q7655r253Q5155j17146j07402
21172e4076L1660M4896O1534k2468M9429n2641p2000q4491M8770p991J11241N2470
21160A06333P683M0748L1797r8649J6589N6914L8384j28209j19027K7608J15476
21149I5647L0706r1047j00750P649j50496M4162j2443O1657M4878J22265P5388
$$ y = [153402, 115872, 78023, -12692, -9431, 27116, 71202, 481, -8748, -123700, -142113, -98523, -215375, -178950, -33233, 71551, 116376, 78294, -71255, -134933, -129085, 28984, 118490, 83658, -51699, 34464, 17469, 33707, 56658, 18961, 94265, 199427, 6921, -86859, -130920, -139617, -41666, 35165, 124427, 127935, 100933, 67221, 171777, 199641, 81778, 79254, 50950, 171124, 256535, 180467, 113931, 125181, 182225, 94570, 85317, 170472, 53326, -54076, -22416, 22480, 84014, 61546, 110975, 58334, -13666, -98157, -49387, -57378, 53863, 106333, 114016, 154764, 186561, 87912, 104501, 161415, 199799, 71590, -47437, -19829, 95647, 126353, 35306, -65444, -57795, -208291, -164129, -176572, -114915, -70037, 52228, 127616]
21138A27616m2158o4643r7243R2048p2745Q4710Q4571n3146m9228J7766J01983
21127A29531l6195j02681Q4062J17006N3257p4939j67938N2990k0362j13738q650
21116h7657Q0113Q228p9132k063p2422M1182j9024P1194P9565n0862j67272K1114
21104a77036J82026J11407J7590n6749K1236j15639j69778k2431R4204Q3600L5487
21093C917K1543l1705N7915O8850J023o8618l7505n4605l4773J16733N7192J22440
21081B22407q8150k33223q9532k5927J41123Q6735l2417q2832j6311J25493J28554
21070A35920K3743j31331j22766j3704J08070J1341m3645M1811O0933P7350j31331
21059A6391o6661J59562N8447O4771n7615j4492J18782q9728r8906j51264m3251
$$ y = [127616, 85458, 20815, -76428, 15620, -57125, 27585, 112156, 59010, 9782, 27548, 129531, 93336, -9345, 74717, 191723, 244980, 170041, 2103, 55093, 34731, -79007, -87657, -7544, 684, -78448, -80511, -152933, -111751, -130775, -59581, 19984, -30878, -198150, -177036, 4990, 116397, 133987, 77238, 98474, -17165, -186943, -209374, -115170, -31570, 3917, 25460, -6245, 51670, 120520, 121543, 52925, 15420, -39185, -73958, 42775, 99967, 222407, 134257, -98966, -188498, -214425, -73302, 13433, -18984, -101816, -118127, 7366, 135920, 159663, 28332, -94434, -108138, -68, 11273, -32372, 9439, 70372, 147722, 16391, -50270, 109292, 167739, 232510, 174895, 160403, 279185, 189457, 90551, -60713, -103964]
21048a03964L4416j5456J07000J09300k7789j00705r9202o706R1258j02132O3176
21037e0804P5903j16533l6614L6011J07833L7190Q7130O8912l6517j34184K3727
21026F2054j7194m5798L2607q6262N8262R2130j09435l1517J15390l238K8196
21015I5195p7492p5848j9373k4491l8616P8244K5509L6183L0189k1539N092m1626
21003b8573p9194J3358J54094J20803n1861q2942N2003M4380m4313J8564J1812
20992A28131m8211j553J25645N458k6027K4344p9558r2582J1753J2932k4619K4608
20980F0321J760r8818r976j24293n9809J58497R8315K5858M1906o7522j45729
20969a19490l1419p718J44062Q3339k3262l7669j051o2217K4510o6778R8339K00155
$$ y = [-103964, -69548, -85004, 21996, 131296, 103507, 2802, -96400, -103106, -11848, -113980, -50804, 25099, -91434, -128048, -92037, 15796, 52986, 140116, 209028, 172511, 38327, 62054, 44860, -938, 31669, -54593, 3669, 95799, -13636, -45153, 70237, 66999, 95195, 17703, -58145, -77518, -102009, -140625, -62381, -36872, -689, 29500, 7961, 13053, -28573, -107767, -94409, 59685, 180488, 128627, 45685, 97688, 142068, 97755, 116319, 128131, 79920, 78367, 204012, 209470, 183443, 207787, 128229, 35647, 47400, 60332, 35713, 60321, 62081, -36737, -46713, -171006, -230815, -72318, 25997, 51855, 93761, 26239, -119490, -150909, -158627, -14565, 68774, 45512, 7843, 6792, -55425, -30915, -97693, 646, 200801]
20957B00801N2737o7435j2174n6961j75827k3468Q2881R5757N4425l8136J07843
20946B20443o9305k4597J3932R087o6564j01794o9491J17853P3937r987N0699
20935A44213R3516K6715n5176j90839j68674O1059J71176J59169n1601j80482
20925I076R447l5905N1016j1887n5783k504L0056Q3630Q8341K4394j00714m8734
20913D0433P8228R97o3241j29371O7938j0792r7206O213N6145M0750O4715o7418
20901a2609p2385l4668M0504r2476l4920J52915L4001J19214L6738M6711j4849
20890A68176P539n9436j41650O1834Q8649K4310p2292q1309J3165K6859m8716
20879a2871p7688P2209J31973m2780k2181p799Q9743N8241N320j02162r5892N4820
$$ y = [200801, 253538, 186103, 173929, 116968, -58859, -82327, 554, 96311, 150736, 112600, 220443, 151138, 126541, 140473, 149560, 82996, -18798, -88289, 29564, 103501, 93514, 144213, 237729, 264444, 209268, 18429, -150245, -89186, 81990, 241159, 189558, 9076, 18523, -17382, 33634, 21747, -34036, -36540, -6484, 77146, 165487, 189881, 89167, 40433, 118661, 119658, 56417, -72954, -5016, -15808, -113014, -106801, -50656, -9906, 54809, -12609, -84994, -119662, -79158, -171634, -206554, -53639, -19638, 99576, 136314, 183025, 168176, 175715, 116279, -25371, 36463, 125112, 149422, 77130, -4179, 8986, 35845, -12871, -90559, -18350, 113623, 70843, 48662, 40863, 130606, 188847, 194167, 92005, -3887, 50933]
20867E0933N2518p4844m2576l6235O5977L7780O3202p994K6374m6917j4444m8125
20855B5649m0138L6258n2410j1787M6367j00944o0393J22400K5511k163J66894
20844A55244N316j3456k3847r7678p1018r7919R6234j8584q6671J59566r3061
20833h5874j53603K4501K15524J6920r8887P0450J34031O0742J420K8115m4931
20822A68408j02260j2082J0191L0653n3211l8735n4110P559j3576L2908L5972
20811A1717K6869J2654p1209r2655l793o9376j2271L6112Q5187n5329N5300M2467
20799c4327j8470J80501l2935q2351j48597J2549R0058R9586j21540J4217R879
20788c1430J05689N1724L5742O0165L1135n4326j35782O1596q6758j7131N8266
$$ y = [50933, 103451, 28607, -13969, -50204, 15773, 53553, 116755, 108761, 135135, 88218, 73774, 25649, -14489, 21769, -30641, -42428, 3939, -97005, -157398, -34998, -9487, -11650, 155244, 160560, 147104, 123257, 25579, -45439, -143358, -47124, -65708, -152379, 7187, -85874, -239477, -214976, 548, 17468, -81419, -10969, 123062, 183804, 185224, 213339, 168408, 66148, 54066, 64257, 94910, 41699, 2964, -51146, -43587, -57163, -24255, 11717, 38586, 51240, -19969, -112624, -116417, -185793, -198064, -161952, -76765, -132094, -76794, -34327, -52797, 127704, 94769, 12418, -136179, -123630, -33572, 66014, -55526, -41309, -31430, 74259, 125983, 161725, 221890, 253025, 198699, 62917, 124513, 37755, 20624, 78890]
20777G8890j651o0755o0488N2717P4772l5885L0259j7993p7845k1374O6811O3679
20765I1137L4841p0165j37893k037J403l2574K1951j56O1040l9297M2145P7253
20753D7648N0915j2344o8262L0502J4321j296r9702o2859j6331O1053J01759K8510
20741G3914P3095J24598K3604N788l7023p0791j4888J15511l4240q5836N8374
20730B32106J08117J1117j39843j03875j6911P9007J02922J09750j59639j9494
20720B03257j8136j15791J0016M7209K4175p600J07806j11994l6497J71685l4284
20709B39846J1254o1224k9730r8432P9256p6066p1090j2370O5654Q2942q4362
20698D5678l0597O3407Q621j7169j5472o628N2067l675J23557j7653o7005P18
$$ y = [78890, 77239, 16484, -44004, 8713, 83485, 47600, 77859, 59866, -17979, -39353, 27458, 91137, 125978, 55813, -82080, -84117, -82714, -115288, -93337, -93493, -32453, -71750, -29605, 47648, 98563, 86219, 17957, 48459, 62780, 61484, -38218, -101077, -117408, -56355, 45404, 73914, 147009, 271607, 295211, 300999, 263976, 193185, 178297, 293808, 259568, 173732, 232106, 340223, 351340, 211497, 107622, 90711, 169718, 272640, 382390, 222751, 203257, 185121, 69330, 79346, 126555, 150730, 143130, 250936, 138942, 102445, 274130, 239846, 251100, 189876, 160146, 61714, 140970, 64904, -6186, -18556, 47098, 130040, 45678, 15081, 78488, 87109, 69940, 54468, 47840, 99907, 96232, 219789, 202136, 135131, 135849]
20686A35849j8098j239j20448J22936J95410r8634l3807p5730J7169J33736P086
20675B64230j02678l4818l4938k3383r393j07418j9020M6083P866o3915Q6209
20664H825q5813q8050J18434J30373J00K4049l9542L9616Q822N1267m459L078
20652A66700M7580j01932q4777o8068Q1128O1033N4094n5298j11086k0113n0135
20641h0874J1638M2011L878o4162n5579K1376N2402N0175K0532N0084O4913M5821
20629A62215P9513K81r5719j27234k1780n7804O714j9595Q3865L9303M5977n7007
20617C8729L1548J6103k8820L3303k8511l3333K1339n5429N5941m3850p7348Q5836
20605A5508J33562q885j1866J35713l784n5694o1552J5142n2738p3506J8725n403
$$ y = [135849, 117751, 116512, -3936, 119000, 314410, 215776, 181969, 106239, 123408, 257144, 264230, 161552, 126734, 91796, 68413, 59020, -48398, -67418, -21335, -13469, -77384, 8825, -76988, -165038, -46604, 83769, 83869, 107918, 68376, 107992, 116814, 168081, 163622, 166700, 214280, 112348, 27571, -40497, 40631, 101664, 155758, 100460, -10626, -30739, -80874, -69236, -27225, -23347, -87509, -143088, -121712, -69310, -19135, 1397, 51481, 116394, 162215, 241728, 242009, 146290, 19056, -2724, -60528, -53814, -73409, 10456, 49759, 95736, 38729, 70277, 86380, 57560, 90863, 62352, 29019, 50358, -5071, 50870, 7020, -70328, 15508, 149070, 140185, 128319, 264032, 260248, 204554, 143002, 158144, 105406, 31900, 50625, 45222]
20593D5222q4382J35724J11266n8796m559j43677j19996J6399M4821L0758j7603
20582d4823J08384K35060l979k43870l9843M241j1509K8572P2551M4758j2134
20571A37408J06928m293l8494k296n8864p5580P2494Q0659m6783q443k9605o8501
20559F4630M0139J02337k8486j25250r324j5636k0545J21460J57540j7012r6836
20548A73017J8413R0689J4821k9281k5174j11940p8250l5474m1195J6085O0907
20537E2618k1829j21806M1130O5669k0359k8583j9661L3681n5746J2633Q5768
20526B3515J0147Q3979m8954k1045N7494j7977j20801J32366O2871j18887K7797
20515G0505k0654J03463O348p0307R7956J35702o1064j76047L8584M4707M536
$$ y = [45222, -39160, 96564, 207830, 149034, 144475, 798, -119198, -102799, -57978, -27220, -44823, 63561, 298621, 294642, 50772, 10929, 15170, 3661, 32233, 104784, 149542, 137408, 244336, 240043, 201549, 199253, 140389, 64809, 137303, 217962, 171179, 162736, 133131, 64630, 104769, 207106, 178620, 53370, 44046, 28410, 7865, 129325, 286865, 269853, 173017, 191430, 282119, 296940, 267659, 242485, 130545, 52295, 16821, -24374, -8289, 52618, 30789, -91017, -49887, 15782, -4577, -33160, -52821, -19140, -74886, -62253, 23515, 33662, 117641, 68687, 47642, 105136, 87159, -33642, 98724, 161595, 42708, 70505, 49851, 153314, 159662, 89355, 187311, 323013, 261949, 85902, 124486, 169193, 173729]
20504A73729k9011o84M4646m5387m8874L332R6479J23183r5792o5656k9143j1476
20492A15346k4344l4350J0689K4768O415P6742r4115l4683J99853J52404q7741
20481C10984m9746o8031p6953o0053j4851N1981L279j11993j06543L3591R2760
20470D425k224j16602o901J71218J07253J01676j17677j974K04221j7583p3794
20459B52038r0304Q0813P0029j5691M3300j528o6340p8405j30954j48545N8909
20448b6678J01679K8316k7271P5211j4331j0769J2026L5775m1201j10831J5897
20437C7823J04924J9908o0933K3065L1098k4201J08169l1694j41287n5770M9214
20426F0316O7023J60183p055r3666q0434J26636L1765J1663n9297n2642m2302
$$ y = [173729, 144718, 144034, 188680, 143293, 94419, 97751, 194230, 317413, 221621, 155965, 126822, 115346, 91002, 56652, 67341, 92109, 98524, 175266, 81151, 46468, 246321, 398725, 310984, 261238, 193207, 116254, 56201, 41350, 93331, 96610, -15383, -121926, -88335, 4425, 2201, -114401, -121302, 49916, 157169, 258845, 141168, 139194, 343415, 325832, 252038, 161734, 242547, 312576, 296885, 340185, 338657, 272317, 193912, 62958, -85587, -26678, 75001, 103317, 76046, 151257, 136926, 126157, 138183, 173958, 132757, 21926, 37823, 142747, 162655, 101722, 124787, 155885, 131684, 239853, 208159, 66872, 11102, 60316, 127339, 287522, 280467, 186801, 106367, 233003, 264768, 276431, 217134, 164492, 122190]
20415A22190J65531K940l4988j441L7318N9292n1219j07633k8868L6524J16755
20404C16401p4059j18180j16258q833J83756P8584J3828j9315j00627k0359j5743
20393A19195j08858j11617J2351Q5850J67192K6564R458l0970j4564O7518l7602
20382A84517j19695J8577L2585N351M9320j2987m934l9566O4955J04704J5553
20371B98380n9357q0050o407P7348k237r670q8218r8365J23410J78337J3282j09739
20359B36714j09173M1752K2077O1556O9150j71167j98185J8741R8941J36801j6657
20348A90550N2N828N2898j50733K3395R7086j37339j8452J38769m1445j8858O1683
20336B03434M5708j2016M0416P3673o2401r2717j807o065l2L8802J4800o3488
$$ y = [122190, 287721, 290661, 255673, 254232, 291550, 350842, 299623, 191990, 163122, 199646, 316401, 242342, 124162, 7904, -929, 182827, 261411, 275239, 255924, 155297, 134938, 119195, 10337, -101280, -88929, -3079, 164113, 190677, 200135, 169165, 154601, 222119, 184517, 64822, 83399, 115984, 121335, 170655, 157668, 152734, 113168, 178123, 282827, 298380, 239023, 158973, 152566, 229914, 227677, 218007, 129789, 31424, 154834, 333171, 346453, 236714, 127541, 169293, 191370, 252926, 322076, 150909, -47276, -28535, 70406, 207207, 190550, 190602, 196430, 249328, 98595, 121990, 219076, 81737, 63285, 202054, 160609, 141751, 203434, 249142, 237126, 277542, 351215, 288814, 196097, 194290, 188225, 188193, 226995, 241795, 178307]
20324A78307L760O7545O4542p0620o3933j536J2738o6849q2413L7895J49633m2580
20312A86489k1176K8147j06253m7715l9290k0840Q6888J03850K3496J7655P2165
20301B83416p0789k9081n0834k7129J5234M4788O5226K0301o8251K4351Q905k1555
20289A94582j3912p8614n6265M8736M5220J20170O1967P6723o0346J350m987j32747
20277B01877K1317P3140J7107j2605r2539o1608r461R2714Q5163J54285L0853
20266E00243j40526j15118o7609o3141L551K3427k811k6457j6589M3801M0785
20255A79556j9265k762k7353M4109j42629L1336m6264M8913J24048N0045R354
20244B49088k1158N3085o5476r1233j12536j1375O2144j3541J20349J48731Q2186
$$ y = [178307, 182067, 249612, 314154, 243534, 179601, 178065, 190803, 123954, 41541, 79436, 229069, 186489, 165313, 193460, 87207, 39492, 202, -20638, 66250, 170100, 193596, 211251, 283416, 212627, 183546, 132712, 105583, 120817, 165605, 230831, 251132, 182881, 207232, 216137, 194582, 180670, 102056, 45791, 94527, 139747, 259917, 321884, 398607, 338261, 339611, 334624, 201877, 223194, 296334, 313441, 300836, 208297, 146689, 137228, 229942, 315105, 469390, 500243, 359717, 244599, 176990, 113849, 117400, 140827, 138016, 111559, 94970, 138771, 179556, 160291, 157529, 130176, 174285, 31656, 62992, 16728, 65641, 189689, 239734, 249088, 227930, 281015, 215539, 124306, 11770, 395, 62539, 48998, 169347, 318078, 400264]
20233D00264p1863p4655r5079p4993J7116J17469J6153r4746o6522N8896L2185
20222A64225p5626P2245Q4986J0695P4870j38506J0047P1556O1461o4026j53246
20211A18681o485N9047l591k2540K4120k3979m0499o1653M7103J54127N9411m5458
20199B58284q0766L7316L2064q642J474M3074l8193p3684n9951r3700o1130J35143
20187I1289J75973m0375k8282k4013N314j988q883M6060O8412K3159p8208j72832
20175E5626j31070L2830M2800L0743L8222J03359n6798J1906N3608o0148O3178
20164A84256n1410K6760J9760k1999Q101J1998k4957o3626l5695O642O3842J0387
20152A34059j7373M3060N0054q6637L7078J59034Q4029r2055q3184m5218j965
$$ y = [400264, 328401, 253746, 158667, 83674, 100790, 218259, 234412, 139666, 73144, 132040, 164225, 88599, 160844, 245830, 256525, 331395, 192889, 202936, 274492, 335953, 271927, 118681, 112196, 171243, 167652, 145112, 169232, 145253, 104754, 43101, 90204, 244331, 303742, 258284, 177518, 214834, 246898, 238256, 239730, 282804, 244611, 170927, 110976, 17276, -43854, 91289, 267262, 226887, 198605, 174592, 179906, 177918, 169035, 215095, 283507, 306666, 228458, 55626, -75444, -42614, 186, 30929, 69151, 172510, 115712, 127618, 181226, 121078, 184256, 132846, 159606, 179366, 157367, 165468, 177466, 152509, 88883, 53188, 59830, 123672, 134059, 116686, 159746, 209800, 123163, 160241, 319275, 403304, 311249, 228065, 182847, 180882]
20141A80882m1126k05717J2709N8732Q5560M9010m297M1301j1365O8448q730M872
20129B30279l7476j29319n8378M1340J55300m900P5598K6143L6079Q5403j6914
20118D03155j7516j6933j7361J0757R1148l9516j39776k1490p2355j07963K2977
20107I5127J95895J45741q6076q4582p1505l7865J3998j7213J0617n5895j739
20096A06503J74429R8519R1992j5759q7328k14993p9583J29699J12320Q4429o1767
20085C38461L53j26835k6896L7216J17881N7490o0025o8571j0986n5709J3619
20074B15998N5776Q6554N8953l7223J8865r0899j12264j40948o2165M6956J16172
20063A55775O0640p2150P7658O5753j8139P8926m7171j5018J9150K5999j785M1567
$$ y = [180882, 139756, -65961, -53252, 5480, 91040, 140050, 135753, 177054, 165689, 234137, 225407, 230279, 192803, 63484, 5106, 46446, 201746, 196846, 272444, 298587, 334666, 420069, 403155, 385639, 368706, 351345, 362102, 453250, 413734, 273958, 252468, 180113, 72150, 95127, 291022, 436763, 350687, 266105, 194600, 156735, 170733, 153520, 164137, 108242, 106503, 280932, 379451, 471443, 455684, 368356, 153363, 73780, 203479, 315799, 400228, 338461, 338814, 211979, 185083, 222299, 340180, 397670, 337645, 269074, 258088, 202379, 215998, 271774, 358328, 417281, 380058, 398923, 308024, 195760, 54812, -7353, 39603, 155775, 216415, 144265, 221923, 287676, 269537, 348463, 301292, 286274, 305424, 331423, 329638, 371205]
20051C71205r1183L5862J07471L1395j02383j66086o6415J2629J16441J8230N255
20040B72421l241M0955o275O1798J0855k0963l5381m9322P5800J41195l681j1704
20028D72457j4472l8510n8257j6885K0439r3008L3052J07311j09828J2351l3792
20017B80858l7334O4876J2296o3532Q3089L0805N800n1741K6826M1606K0276n5143
20005C58682l7130k3740J05689J11980K6343N7921j12484k6634p5559j14911N3203
19994C23360J7337L8221J20639P0236R3869N068q815R3452J41156M6991N7676
19983I99190K23143Q6302r8768J3950J40296N8741n2866m9059p3452q1389j5073
19972A151015l0473J26714P0847J0040j401J19539N8020p2900n9336j20850l17351
$$ y = [371205, 280022, 315884, 423355, 454750, 352367, 186281, 119866, 132495, 248936, 267166, 272421, 269180, 310135, 303860, 365658, 376513, 355550, 320169, 270847, 346647, 487842, 484161, 472457, 457985, 419475, 361218, 344333, 364772, 271764, 304816, 412127, 302299, 314650, 280858, 243524, 308400, 320696, 257164, 340253, 371058, 376858, 325117, 351943, 393549, 413825, 358682, 321552, 297812, 403501, 515481, 541824, 599745, 487261, 460627, 385068, 270157, 323360, 340697, 378918, 499557, 569793, 663662, 668730, 659915, 753367, 894523, 941514, 999190, 1222333, 1308635, 1209867, 1223817, 1364113, 1422854, 1369988, 1320929, 1247477, 1166088, 1151015, 1120542, 1247256, 1318103, 1328143, 1326742, 1446281, 1504301, 1431401, 1372065, 1251215, 933864]
19961I33864k20302l4179L2238Q954L9070o638j39284K0652O770j0003J12739
19950G43881p608n728m6487k17N6091l552m9116m8864O9522K00912K40600J45435
19938A294869O4967j3998n6640J61559J02296j300l2108j03934k10684j3086N1266
19927A243207p6418O5721J23929O1817J54057Q1236N4674n6368l2962n8457l6536
19916A523900k30089j85062j54514J3610j7468P1747M5301j38011j06116n8530
19906G64768M508j12900k59596p6035J17474R4805j0156L2723O0741J52652j12043
19895F56941j13277k8180M4123N6878p7441J4291n8446N8224J15984Q4347n5026
19884F98418m7970J02035O3924j14159r5767R2976K8016J5812K5813M8072m7034
$$ y = [933864, 713562, 679383, 711621, 720575, 759645, 753007, 613723, 634375, 641145, 631142, 743881, 736273, 730545, 684058, 683841, 739932, 736380, 687264, 638400, 707922, 908834, 1149434, 1294869, 1359836, 1345838, 1289198, 1450757, 1553053, 1551753, 1519645, 1415711, 1205027, 1191941, 1243207, 1166789, 1232510, 1356439, 1418256, 1572313, 1653549, 1708223, 1651855, 1618893, 1560436, 1523900, 1293811, 1108749, 954235, 967845, 950377, 1022124, 1067425, 929414, 823298, 764768, 769276, 656376, 396780, 320745, 438219, 533024, 522868, 555591, 616332, 768984, 656941, 543664, 515484, 559607, 616485, 539044, 553335, 494889, 553113, 669097, 753444, 698418, 650448, 752483, 816407, 702248, 606481, 699457, 727473, 743285, 769098, 817170, 770136]
19873G70136r4976l52L5652O6230K9944J2454q6505p8311Q2702K0303J713j46376
19861F12614l8372N4807N6336J6823O999j69617L8843J0016k9839K6526P4548
19850F59684m9861l6793n1058M2849J06861K0486L5756q1847q3336N7733j9643
19839F00831K2981o099q8579n5703J12324m536j38503J54284N5360l6848Q1999
19828F97511r7791p0371M8504J87223M1426m9654J4299O6484J55870j9591p6834
19817H97076J39935j58468j41348K229L3363J5690Q6387o8485M5525P8814K5442
19806I56160n098K7470l2464K091j03151q7386M3105M5118J2514m6295O7366L3702
19794I13132J38711L9298J884K3059o0675l5965r9669J3937q1278j20054k087
$$ y = [770136, 675160, 674808, 710460, 776690, 806634, 819088, 732583, 654272, 736974, 757277, 758990, 612614, 574242, 629049, 685385, 702208, 709207, 539590, 578433, 588449, 558610, 585136, 659684, 609823, 573030, 521972, 564821, 671682, 692168, 727924, 646077, 562741, 620474, 600831, 623812, 617713, 529134, 473431, 585755, 581219, 442716, 597000, 652360, 615512, 697511, 599720, 529349, 577853, 765076, 806502, 756848, 771147, 837631, 993501, 973910, 897076, 1037011, 878543, 737195, 739424, 772787, 788477, 874864, 806379, 851904, 930718, 956160, 951062, 978532, 946068, 948159, 845008, 757622, 800727, 845845, 858359, 812064, 879430, 913132, 1051843, 1091141, 1093025, 1116084, 1055409, 1019444, 919775, 933712, 852434, 732380, 730293]
19783G30293L4591r394J00242N1912K3254J51916j263K2386r6215K9667L5542
19772A072931o103J7514P825M4693O6335m5785p1326N4276O0350j5247J00413
19761A285876l9274k9554J30860R6912n0323j46681m2342L7217l046J05754Q4301
19750A429700J22563P0595o9925l4053Q0108J29403J22024M3444J2984P1167L342
19739A981352K1772N9138J05580j5999j13332o9420n9502k8200m1361p3212q7447
19728A679369l0298n7670k0027L9564K9376M8087N6345J09317p9547j1359l4834
19717A728323L6496P5409L7085J8075J3765J23923R8770Q5677Q7964P5302o7477
19706B313312j04296m2222l6903n0918m6308J2738L8332Q9880O9321J49218J12848
$$ y = [730293, 764884, 755490, 855732, 907644, 930898, 1082814, 1081551, 1103937, 1007722, 1037389, 1072931, 1066828, 1084342, 1092167, 1136860, 1203195, 1157410, 1086084, 1140360, 1200710, 1185463, 1285876, 1246602, 1217048, 1347908, 1444820, 1394497, 1247816, 1205474, 1242691, 1239645, 1345399, 1429700, 1552263, 1622858, 1552933, 1518880, 1598988, 1728391, 1850415, 1893859, 1906843, 1978010, 1981352, 2003124, 2062262, 2167842, 2151843, 2038511, 1969091, 1909589, 1881389, 1840028, 1766816, 1679369, 1649071, 1591401, 1571374, 1610938, 1640314, 1688401, 1744746, 1854063, 1774516, 1763157, 1728323, 1764819, 1840228, 1877313, 1895388, 1909153, 2033076, 2131846, 2217523, 2305487, 2380789, 2313312, 2209016, 2166794, 2129891, 2078973, 2032665, 2045403, 2083735, 2173615, 2242936, 2392154, 2505002]
19695B505002L6853j4006j57322j36699n8497j931R6279J5956N4182Q4203P0497
19684B494517o8833J08365J167o7601n263p709M5457J321q2785k0873J1521P2191
19672B481475M9038j8410k7928o3690J10141K81860J24828P4381J3446n2795m5049
19661B927297k9911j5906O0466j5833L4982k3167J8490P0230P1995M9236K148
19650C150027N6854R6884q1884o479j03461N0723J35421M6473O9719R5758J73642
19639C683677L3000k4611k3550j09683k3853q7597R3297J31230M7612l9322O0098
19628C740298m422K3207K21446J64811n9834l4876K8598O7269o2591l5932J34726
19617D182700J29193O2024n5831J36586J31898O2279J34043J36071J60775J04145
$$ y = [2505002, 2541855, 2527849, 2370527, 2233828, 2175331, 2173400, 2269679, 2285635, 2339817, 2424020, 2494517, 2425684, 2534049, 2535216, 2467615, 2462352, 2454643, 2500100, 2501421, 2418636, 2397763, 2409284, 2481475, 2530513, 2512103, 2484175, 2420485, 2530626, 2812486, 2937314, 3011695, 3025141, 2972346, 2927297, 2897386, 2881480, 2941946, 2926113, 2961095, 2937928, 2956418, 3026648, 3098643, 3147879, 3150027, 3206881, 3303765, 3221881, 3215402, 3111941, 3162664, 3298085, 3344558, 3414277, 3510035, 3683677, 3716677, 3692066, 3668516, 3558833, 3534980, 3447383, 3540680, 3671910, 3719522, 3680200, 3740298, 3735876, 3759083, 3980529, 4145340, 4085506, 4050630, 4079228, 4146497, 4083906, 4047974, 4182700, 4311893, 4373917, 4318086, 4454672, 4586570, 4648849, 4782892, 4918963, 5079738, 5183883]
19607E183883m7485k8202o4942q5973n0640N0866k6561n6843J465k3365J07864
19596D960067K49868K68310J13634M1306J96715J95687Q1411n9826o9001k143
19586E976028O4149J74051R0906J4443j07053j5723J18304K05965J09302J73466
19576F803838J39998p1781o6275L9677l7208o5084l8934P1357K42271L02666K21744
19565G542269K50441K01658Q7244O2714J16857K8781o7776J96950K46572R2126
19555H757836J16736J67081N6820J76365J64992K31941K35195K33618J87626J54742
19545A0482952K21824J40628J31576J65301K32313K29685L26021J86001Q5196
19536A2201497L57443M26199K47709L77429L04583K83288L56934L18063L01384
$$ y = [5183883, 5136398, 5108196, 5043254, 4957281, 4906641, 4957507, 4930946, 4874103, 4875568, 4852203, 4960067, 5209935, 5478245, 5591879, 5633185, 5829900, 6025587, 6106998, 6047172, 5978171, 5976028, 6040177, 6214228, 6305134, 6319577, 6212524, 6196801, 6315105, 6521070, 6630372, 6803838, 6943836, 6872055, 6805780, 6845457, 6808249, 6743165, 6704231, 6775588, 7017859, 7320525, 7542269, 7792710, 7994368, 8081612, 8144326, 8261183, 8289964, 8222188, 8419138, 8665710, 8757836, 8874572, 9041653, 9098473, 9274838, 9439830, 9671771, 9906966, 10140584, 10328210, 10482952, 10704776, 10845404, 10976980, 11142281, 11374594, 11604279, 11930300, 12116301, 12201497, 12558940, 12985139, 13232848, 13610277, 13914860, 14198148, 14555082, 14873145, 15174529]
19527A5174529M11997L60571L12418K95982L77570M99261N50481N62434M77772
19518A9023015N67552N64035O22325N58781N53889O05530O64760O86883P52022
19509B4598792P85803Q33312Q49004Q77571J032847R59220J010031J178458J226328
19500C3351366J196679J197261J395380J429231J347900J469853J647329J705868
19492D4740867J880705J747910J758824K047001K136697K223744K356363K437925
19484F1330036K453994K622703K949942K985406L178221L345073L278278L118905
19476H5262558K937288L020574L182472L351702L327876L406285L552106L632811
19468A11673672L842074M029724M280434M525431M792356N315491O233581P762520
$$ y = [15174529, 15586526, 15947097, 16259515, 16555497, 16933067, 17432328, 17982809, 18545243, 19023015, 19590567, 20154602, 20776927, 21335708, 21889597, 22495127, 23159887, 23846770, 24598792, 25384595, 26217907, 27066911, 27944482, 28977329, 29936549, 30946580, 32125038, 33351366, 34548045, 35745306, 37140686, 38569917, 39917817, 41387670, 43034999, 44740867, 46621572, 48369482, 50128306, 52175307, 54312004, 56535748, 58892111, 61330036, 63784030, 66406733, 69356675, 72342081, 75520302, 78865375, 82143653, 85262558, 88199846, 91220420, 94402892, 97754594, 101082470, 104488755, 108040861, 111673672, 115515746, 119545470, 123825904, 128351335, 133143691, 138459182, 144692763, 152455283]
19460A52455283R790635J2229309J4692313J6776639J8649707K1675149K5790685
19453B72059720K8321810K1394211L889132j8199382l4649310l5780535k6270526
19446B10765120j3486037l118921M176990R137623J2949057J7500250K2859718
19439B60783800K6142509J8871164j877848k6059609m3613779m5652361l7371980
19432A51221896k6067030j7354829j1865705q512245o291320m764342l624781
19425G2741644k965963k548061k109011j727774j040547l83248K68221J208006
19417F3443267K406243L836319N683626Q365553J1385735J3982291J6135284J8635895
19409A43874213K2260839K7016884K8869080J9473614N6550k1682635l4684345
$$ y = [152455283, 162245918, 174475227, 189167540, 205944179, 224593886, 246269035, 272059720, 300381530, 321775741, 325664873, 307465491, 272816181, 237035646, 210765120, 197279083, 194160162, 198337152, 207474775, 220423832, 237924082, 260783800, 286926309, 305797473, 303919625, 277860016, 234246237, 188593876, 151221896, 125154866, 107800037, 95934332, 87422087, 81130767, 76366425, 72741644, 69775681, 67227620, 65118609, 63390835, 62350288, 61967040, 62235261, 63443267, 65849510, 69685829, 75369455, 83735008, 95120743, 109103034, 125238318, 143874213, 166135052, 193151936, 222021016, 241494630, 241551180, 219868545, 185184200]
19402A85184200l2773148k1998223r462512M95120P554108J2076679J5953249
19395A57029473K0934235K6282671K8596332J8005521n439608k9488661m4010148
19388A71909815m3312073l3774364k2752047j4758082r608355o453967m489114
19381C6761813l266977k424889k114485j987391j909047j686784j621407j416896
19373B0333937j229819r38429q36861o50475m27663l48115m50334m98487m43973
19364A4509781n94018o04542m94087n69695n61636m38872l55142k51483l63258
19355A0277048k04517j55115q8611q3372j72623k75273k63021j61148k03028k23579
19345H446761j90576j27889j75285j90665k18437j90493o9261M9616J026L2327
$$ y = [185184200, 152411052, 130412829, 120950317, 121445437, 128999545, 141076224, 157029473, 177963708, 204246379, 232842711, 250848232, 245408624, 215919963, 171909815, 128597742, 94823378, 72071331, 57313249, 47704894, 41250927, 36761813, 33494836, 31069947, 28955462, 26968071, 25059024, 23372240, 21750833, 20333937, 19104118, 18165689, 17328828, 16678353, 16250690, 15902575, 15452241, 14953754, 14509781, 13915763, 13311221, 12817134, 12247439, 11685803, 11246931, 10891789, 10640306, 10277048, 10072531, 9917416, 9828805, 9745433, 9572810, 9297537, 9034516, 8873368, 8670340, 8446761, 8256185, 8128296, 7953011, 7762346, 7543909, 7353416, 7284155, 7333771, 7334797, 7367124]
19335G367124R876j13836j65240j47743j39848j17221j30532k14402k20418k08368
19325E919392k1244Q6949J08889l2872q6743k1519r6299m4510j11402j22053k02267
19314E376321k47305o0027p9283m0039j60978q6849J73940J22490L5344k175l6392
19303D995047j13755j32635m1350M5247J30560K8468o1998r6777j42200j11187
19293D499420j26405n7896O9951M8127j38437j58905k0088Q4821K510M7662J06415
19282D357175j65583j03378j46000n1156r2055J2594J58135j1878L5036J35090
19272D127980n4533j75631j70016M3207N2215Q9446o0272j61206k20278j45967
19262C324945j0002J41502N0758r5889J5573P0937k4939Q1422J47996J2419q7316
$$ y = [7367124, 7377000, 7263164, 7097924, 6950181, 6810333, 6693112, 6562580, 6348178, 6127760, 5919392, 5898148, 5985097, 6093986, 6061114, 5974371, 5952852, 5856553, 5812043, 5700641, 5578588, 5376321, 5129016, 5068989, 4989706, 4949667, 4788689, 4701840, 4875780, 4998270, 5033614, 5031439, 4995047, 4881292, 4748657, 4707307, 4752554, 4883114, 4911582, 4849584, 4752807, 4610607, 4499420, 4373015, 4315119, 4385070, 4433197, 4294760, 4135855, 4115767, 4200588, 4203098, 4250760, 4357175, 4191592, 4088214, 3942214, 3891058, 3799003, 3811597, 3969732, 3957854, 3992890, 4127980, 4073447, 3897816, 3727800, 3771007, 3823222, 3912668, 3852396, 3691190, 3470912, 3324945, 3314943, 3456445, 3507203, 3411314, 3426887, 3497824, 3472885, 3554307, 3702303, 3714722, 3627406]
19251C627406r2133j21845J5612k0271l785O9794J04351M7356k6665l6473j20923
19240C442424j49576k9137k9952J04764J00844q4382m2787j0091k5796J17735
19230C394046J42314J70926l856o3620M7927j2453Q5343J62578M5057p6055r3239
19219C798968P2477j209J00945J01350K75834K90314K27578K09908J73961R6852
19209E346978P8076J11156J01128L6594K28075M60170N93496P98345R81505J200173
19199I935696J368491J970019K551013L345413M379338N663584P197277Q442590
19191D4853421R234990J0077771J2578101J5829972J6599573R204692p134892
19184A11243628j9070234k0146556j4006207p021108j947108J583203M011965
$$ y = [3627406, 3535273, 3413428, 3429040, 3408769, 3404984, 3474778, 3579129, 3626485, 3599820, 3563347, 3442424, 3292848, 3263711, 3233759, 3338523, 3439367, 3354985, 3312198, 3302107, 3276311, 3394046, 3536360, 3707286, 3703430, 3639810, 3687737, 3675284, 3760627, 3923205, 3968262, 3892207, 3798968, 3871445, 3870236, 3971181, 4072531, 4348365, 4638679, 4866257, 5076165, 5250126, 5346978, 5425054, 5536210, 5637338, 5673932, 5902007, 6362177, 6955673, 7754018, 8735523, 9935696, 11304187, 13274206, 15825219, 19170632, 23549970, 29213554, 36410831, 44853421, 54088411, 64166182, 76744283, 92574255, 109173828, 118378520, 111243628, 92173394, 72026838, 58020631, 50999523, 49052415, 50635618, 54647583]
19177E4647583N654051O924913R204840J2082813J2995513P395322o165710j7300283
19169H5439042j9360978j4450481q319309l687042m28970K213990M373908O253909
19161E2034069P791567Q865525J1052449J4535870J7069079J3909440r26537j7144359
19153A07187103k2554090j7909701r987552l572953O37196L369643N443657P297389
19145F9910692R519998J2937015J5621127J3948128L078533j0504545j4990042
19138I9520906j0282266k697452K907284P437479J2290460J6562963J6373703
19131A42113077M866507j3909716k4412672k2918047j4953521p134527j538725
19124F2112376K592765N357847P065568R017988J2242885J5367272J5191440N402722
$$ y = [54647583, 60301634, 67226547, 76431387, 88514200, 101509713, 108905035, 102739325, 85439042, 66078064, 51627583, 43308274, 39621232, 39192262, 41406252, 45780160, 52034069, 59825636, 68691161, 79743610, 94279480, 111348559, 125257999, 124331462, 107187103, 84633013, 66723312, 56735760, 53162807, 53800003, 57169646, 62613303, 69910692, 79430690, 92367705, 107988832, 121936960, 125015493, 114510948, 99520906, 89238640, 86541188, 89448472, 96885951, 109176411, 125739374, 142113077, 146979584, 133069868, 108657196, 85739149, 70785628, 63651101, 62112376, 64705141, 70062988, 77128556, 86146544, 98389429, 113756701, 128948141, 134350863]
19116A34350863j2500568k3653772k3197630j5828791q495454l417387L16768
19109D7574029L128889N689673P788025R276110J0609738J3070734J6485446J7553114
19101A31175758J0363381o742965k1052969k3805277j7571842r413504l284266
19094E9668316Q43966L774816N803412P493669R909790J3234696J4547127R005165
19086A24280957o543041k1238763k5219134k0553258j3699152q609274n750337
19079B2667998m017704k743439j951503j541135j459492j176970r22382o63990
19071H191383n32243n12960l86765l81627k48664j32081j72209k13627m19783
19062E191424m83189l54891k87555j57836o9800j7389l0544O1225m2773k3780
$$ y = [134350863, 121850295, 98196523, 74998893, 59170102, 50674648, 47257261, 47574029, 50702918, 56392591, 64180616, 73456726, 84066464, 97137198, 113622644, 131175758, 141539139, 134796174, 113743205, 89937928, 72366086, 62952582, 59668316, 60512282, 64287098, 70090510, 77584179, 87493969, 100728665, 115275792, 124280957, 117737916, 96499153, 71280019, 50726761, 37027609, 28418335, 22667998, 18650294, 15906855, 13955352, 12414217, 10954725, 9777755, 8855373, 8191383, 7659140, 7146180, 6759415, 6377788, 6129124, 5997043, 5824834, 5611207, 5191424, 4708235, 4353344, 4065789, 3907953, 3838153, 3820764, 3790220, 3851445, 3808672, 3784892]
19052C784892J57459K02684j9014j6583p2572j7202J00136M5874j11416l0661
19042D023597r7007l05019l02565j65138j19473l53434j71536J42870K87K7583
19032B680165L8399m0547p4475o7383r8406j33082q692q5862q8721Q7433J26780
19021B335609J67637K2663k1465j44638r4268m8449j20952j6913k3451l3952Q4623
19010B106444Q9457n4894j02940K703j03905n7379k2217k31K3279P8307K2330
18999A980954o5820j18281L9661N1756P6874q174J6847j57014j60045N80P3652
18988A730990J20125J8910M325j20321j11714Q5833n9438q4980l7506J1602J15636
18977A673462m6185k39661o7326l6305m0883l9903O6095O7649J64846O0559r9909
$$ y = [3784892, 3942351, 4145035, 4126021, 4109438, 4036866, 4019664, 4119800, 4165674, 4054258, 4023597, 3926590, 3621571, 3319006, 3153868, 3034395, 2680961, 2509425, 2652295, 2652582, 2680165, 2718564, 2678017, 2603542, 2536159, 2437753, 2304671, 2295979, 2210117, 2121396, 2208829, 2335609, 2503246, 2525909, 2504444, 2359806, 2265538, 2217089, 2096137, 2079224, 2055773, 2021821, 2106444, 2195901, 2141007, 2038067, 2040770, 1936865, 1879486, 1857269, 1857038, 1880317, 1958624, 1980954, 1915134, 1796853, 1836514, 1888270, 1965144, 1956970, 1973817, 1816803, 1656758, 1657338, 1730990, 1851115, 1870025, 1874350, 1754029, 1642315, 1728148, 1668710, 1583730, 1546224, 1557826, 1673462, 1627277, 1387616, 1320290, 1283985, 1243102, 1203199, 1269294, 1336943, 1501789, 1562348, 1462439]
18966A462439j76182o1592L1805k4032J6962j8931m3109m8176R2586J64179R6808
18955A492757J06667j02531j73404p7237J8718K8335j3521l179L5673k835O5383
18944A374826J70661J49533r1038j25071K585M4142J2141j30890l5135O2991L1663
18933A466408m668o333m4663j6287R8016J46233R3532N6204N128P1625J61680
18922B026875P9768J84270J95287K61801J22701q9107q6651J6243o5844k08121
18912B437222j02432k1625j0765N1023Q1540O0280O9885J76793j1942l6520n7875
18901B635584L838q1999j26947r1388j14373o4431n5194k4091p813R8754P8928
18890B250868Q3673J61841K1014J10769P9026J566p1963j5487N226J69855J77452
$$ y = [1462439, 1286257, 1224665, 1256470, 1232438, 1249400, 1230469, 1187360, 1139184, 1231770, 1395949, 1492757, 1599424, 1496893, 1323489, 1246252, 1264970, 1293305, 1279784, 1276605, 1312278, 1309443, 1374826, 1545487, 1695020, 1603982, 1478911, 1481496, 1525638, 1537779, 1406889, 1371754, 1434745, 1466408, 1461740, 1455407, 1410744, 1394457, 1492473, 1638706, 1732238, 1788442, 1793570, 1865195, 2026875, 2106643, 2290913, 2486200, 2748001, 2870702, 2781595, 2694944, 2711187, 2645343, 2437222, 2334790, 2313165, 2302400, 2353423, 2434963, 2495243, 2565128, 2741921, 2729979, 2693459, 2635584, 2639422, 2557423, 2430476, 2339088, 2224715, 2160284, 2105090, 2080999, 2073186, 2171940, 2250868, 2334541, 2496382, 2517396, 2628165, 2707191, 2708757, 2636794, 2621307, 2626533, 2796388, 2973840]
18879B973840j9746l3056L943J42346P9149j0079N3092J3126j04850p0098J24963
18868C152630O3803p913o8538J0155R3352J02303M3610j2964J8039Q608P615O3227
18856C473927j32516j73405j10374j65667k14645q4503k1979O5484o8953k7196
18846B540173o5501n2195m8161n3189R2790L0109n5776j62557l9215J01641n656
18835B282463J5262J37814J23021Q6326m1771j3752L649o675j03092K8280P8509
18824B590034r6978j18907L939O3685m9304j3135L3781J9595K8023N2119Q500
18813B521352K4568j9220l5929k2804p8331N8141J46435J12861j02047r5878M8685
18802B557833J88972Q0250M3532j1513N7074J9169R464m9763q9951K5715M9180
$$ y = [2973840, 2954094, 2921038, 2924981, 3067327, 3146476, 3136397, 3189489, 3202615, 3097765, 3027667, 3152630, 3216433, 3208520, 3139982, 3150137, 3243489, 3345792, 3389402, 3376438, 3394477, 3403085, 3410700, 3473927, 3341411, 3168006, 3057632, 2891965, 2677320, 2592817, 2570838, 2636322, 2567369, 2540173, 2474672, 2422477, 2374316, 2321127, 2413917, 2444026, 2388250, 2225693, 2186478, 2288119, 2282463, 2297725, 2435539, 2558560, 2644886, 2603115, 2589363, 2593012, 2586337, 2483245, 2511525, 2590034, 2493056, 2374149, 2378088, 2441773, 2392469, 2379334, 2413115, 2432710, 2460733, 2512852, 2521352, 2545920, 2526700, 2490771, 2467967, 2389636, 2447777, 2594212, 2707073, 2605026, 2509148, 2557833, 2746805, 2827055, 2870587, 2859074, 2916148, 2935317, 2944781, 2895018, 2805067, 2830782, 2879962]
18791B879962J60919O3524j75350o1482l6586Q7584P1015M1388K9146p898J3728
18780C065950Q2446p2583O9787J76539k2629n5935N0106J26196R6231J01961J35849
18769C753918J02604j09116j02442J57217N9570j71927p7523O5851P2923J17580
18759C868655N4000N1909J77345Q2034l0792J998J9298N5847P1778J57641L5661
18748D545374M42l2933N0265K4970l4052M8350P8851O8226J36989J51640l6125
18737E001997L6026J43102O7065Q7865J15771J93089J23376k7849J17419O1894
18727E919755k311R2837q4832j4506J67234J33929J85747J79511J80464J99303
18717F957131N6585J75911R9706Q9439J41910O3935j3978N0983N2145P5593K26100
$$ y = [2879962, 3040881, 3104405, 2929055, 2867573, 2830987, 2918571, 2989586, 3030974, 3060120, 3052222, 3065950, 3148396, 3075813, 3145600, 3322139, 3299510, 3243575, 3293681, 3419877, 3516108, 3618069, 3753918, 3856522, 3747406, 3644964, 3802181, 3861751, 3689824, 3612301, 3678152, 3751075, 3868655, 3922655, 3974564, 4151909, 4233943, 4203151, 4205149, 4224447, 4280294, 4352072, 4509713, 4545374, 4545816, 4512883, 4563148, 4588118, 4554066, 4602416, 4681267, 4749493, 4886482, 5038122, 5001997, 5038023, 5181125, 5248190, 5336055, 5451826, 5644915, 5768291, 5740442, 5857861, 5919755, 5917444, 6010281, 5925449, 5910943, 6078177, 6212106, 6397853, 6577364, 6757828, 6957131, 7013716, 7189627, 7289333, 7378772, 7520682, 7584617, 7570639, 7621622, 7673767, 7749360, 7975460]
18706G975460J09687P0802J59494K01750l0076Q8774R2991K18240K57312K02562
18696I346996J50449J60896J43465K87641K53614K31768L27829K03179L20148
18687A1425985L20187K24092K80309K04069K18134L72218M11074L00878K18168
18678A3975114K60286L22784K56663K34098L28539M15762K95883L53513L84005
18669A6826647M92615O40588N11040N91831N45106N48772N62064P69636O72532
18660B2160831O14281O64435P42450P78056Q05682P23809Q00890R12534R19846
18651B9122814R54578J115030J036612R65064J060759J117377J195609J452540
18643C8020383J265638J348413J486447J687418J736169J929518K041116K066479
$$ y = [7975460, 8085147, 8155949, 8315443, 8517193, 8487117, 8575891, 8668882, 8887122, 9144434, 9346996, 9497445, 9658341, 9801806, 10089447, 10343061, 10574829, 10902658, 11105837, 11425985, 11746172, 11970264, 12250573, 12454642, 12672776, 13044994, 13456068, 13756946, 13975114, 14235400, 14558184, 14814847, 15048945, 15377484, 15793246, 16089129, 16442642, 16826647, 17319262, 17959850, 18470890, 19062721, 19607827, 20156599, 20718663, 21488299, 22160831, 22775112, 23439547, 24181997, 24960053, 25765735, 26489544, 27290434, 28202968, 29122814, 30077392, 31192422, 32229034, 33194098, 34254857, 35372234, 36567843, 38020383, 39286021, 40634434, 42120881, 43808299, 45544468, 47473986, 49515102, 51581581]
18635E1581581K096332K118321K276125K292182K242294K264611K598130K595046
18627G0064622K725683L018393L131851L022840L000756L087067K923963K934679
18619I3909854K848108K936159K807108K654841K713219K637922K600149K511430
18611A15618790K202710J905960J642165J264600R81163P73616N10627J41470
18603A25041101l86880p87489j143552j314948j447596j580744j534103j507145
18595A15338644j495446j232181p29497O4623J122224K777496N295207Q723015
18587A29864085J2468848J5763826J7912391K0236666K3551983K8161395K9289849
18580B77249043J8441719l043116k9011061m5506170m6923374l7964122k5970943
$$ y = [51581581, 53677913, 55796234, 58072359, 60364541, 62606835, 64871446, 67469576, 70064622, 72790305, 75808698, 78940549, 81963389, 84964145, 88051212, 90975175, 93909854, 96757962, 99694121, 102501229, 105156070, 107869289, 110507211, 113107360, 115618790, 117821500, 119727460, 121369625, 122634225, 123615388, 124389004, 124899631, 125041101, 124654221, 123866732, 122723180, 121408232, 119960636, 118379892, 116845789, 115338644, 113843198, 112611017, 111881520, 111946143, 113068367, 115845863, 121141070, 129864085, 142332933, 158096759, 176009150, 196245816, 219797799, 247959194, 277249043, 295690762, 292647646, 263636585, 218130415, 171207041, 133242919, 107271976]
18573A07271976j7007924j1439077q135104o189275m854612l932612l305763k588083
18565D9819526k393547k210066k043817j810074j608086j394253j179618r23112
18557C6256953p34962q48885o11435o03004n81581n56510m41537l07098l66727
18548C1205214k71566k57953k56510k23047k66825L4928M01491O32427J089650
18539C2087809J776386K374223L412741M911664O976704J0056726J3939227J8671675
18531I4207155K3503110K8092173L3485919L9894673M6182695M7039240L7605480
18524C50010445K1869723L849864j2709978l0031202m6539142n8178008n7212350
18517A71059352m7093326l2786564k1234004j3818339r551208o710004m879847
$$ y = [107271976, 90264052, 78824975, 70689871, 64500596, 59645984, 55713372, 52407609, 49819526, 47425979, 45215913, 43172096, 41362022, 39753936, 38359683, 37180065, 36256953, 35521991, 34673106, 34061671, 33458667, 32877086, 32320576, 31879039, 31571941, 31205214, 30933648, 30675695, 30419185, 30196138, 29929313, 29964241, 30365732, 30998159, 32087809, 33864195, 36238418, 39651159, 44562823, 51539527, 61596253, 75535480, 94207155, 117710265, 145802438, 179288357, 219183030, 265365725, 312404965, 350010445, 371880168, 375730032, 363020054, 332988852, 286449710, 228271702, 171059352, 123966026, 91179462, 69945458, 56127119, 46575911, 39865907, 34986060]
18510C4986060l594541k843387k275692j693101j227388j144541j065924p68522
18502B0372964o77339m89361m60341l87672m13686n44233n51101m01858m58733
18493A5988640n07512m72845l83077l28082j33782k47261k54296j25245K15973
18484A3752513M38603N60601Q50769J214625J635411K321235L248212M834745
18476B8856714O910276R684176J2708680J5459164J7211034J8904799K1598790
18469A31333633K5319059K6504602J7861137j91287k2331557l6996440l8583832
18462A02915315l1140388k0726242j2898974q330941n585775l938301k850922
18455A7443772k161130j498518j175620r65777n52311m09941m60167m95796n25894
$$ y = [34986060, 31391519, 28548132, 26272440, 24579339, 23351951, 22207410, 21141486, 20372964, 19695625, 19206264, 18745923, 18358251, 17944565, 17400332, 16849231, 16447373, 15988640, 15481128, 15008283, 14625206, 14297124, 14163342, 13916081, 13661785, 13536540, 13752513, 14191116, 14751717, 15602486, 16817111, 18452522, 20773757, 24021969, 28856714, 35766990, 45451166, 58159846, 73619010, 90830044, 109734843, 131333633, 156652692, 183157294, 201018431, 200827144, 178495587, 141499147, 102915315, 71774927, 51048685, 38149711, 29818770, 24232995, 20294694, 17443772, 15282642, 13784124, 12608504, 11642727, 11090416, 10680475, 10220308, 9724512, 9198618]
18446I198618m16658k39355k73018l36708k92498k70764k18641l40596m80789
18437F329591m82199l88572k47761k60864j58964j18927j67298j35611j55428
18428D213967j36738j13099Q833r4168l5503j38867m2090o930k944l7254l6202
18417C579005r0539k08183q6170j8520Q064n3241p0168m2634O909M960k6858L1701
18405C034326J34464r5942j38758j44922j89693l2031j82191j30394l9344l6425
18395B179090n7763p9692m7416O3618J5919m0198R42j51848j0983j4824N6958
18384A913803K5170m6216m8495K0647m373J00296L8777J1407N151L5617K8233
18373B080017j63394j38465M9614k5221m225o9326M5185P1537J7090O6251J20937
$$ y = [9198618, 8781960, 8542605, 8269587, 7932879, 7640381, 7369617, 7150976, 6810380, 6329591, 5847392, 5458820, 5211059, 4950195, 4791231, 4672304, 4505006, 4369395, 4213967, 4077229, 3964130, 3972963, 3878795, 3843292, 3704425, 3662335, 3655405, 3652461, 3615207, 3579005, 3488466, 3280283, 3194113, 3175593, 3183657, 3130416, 3060248, 3017614, 3024523, 3029483, 3002625, 3034326, 3168790, 3072848, 2934090, 2789168, 2599475, 2567444, 2385253, 2254859, 2215515, 2179090, 2121327, 2041635, 1994219, 2057837, 2073756, 2033558, 2034500, 1882652, 1871669, 1856845, 1913803, 1938973, 1892757, 1844262, 1864909, 1860536, 1960832, 1999609, 2011016, 2016167, 2051784, 2080017, 1916623, 1778158, 1827772, 1802551, 1798326, 1729000, 1774185, 1845722, 1862812, 1929063, 2050000]
18362B050000O4208l4740Q14j09898r0228p9350r8959O6681R7892N535N6783k8246
18350A900492K1037M9446Q9138k9405q0415m196L1982k2506M695L2595O7588n0191
18338B010260J4522J1612o4388j00282o2443l5295R190k4314k1295L9860O2312
18327A839739j1694P1057l3727q0793J8912j05832j43368q7521O3460r0293j08626
18316A331314j37217L0378J03839j6602j29085K9768k8687n8147N7352J57972
18306A340885L2743l1474j96840m4164l226O4345j2294J52580J11372r9910m0439
18295A273578R0857N6125m4292n9092K5384L783l1758O5503J36054j6853K2938
18284A522227N7559p8754k998p4164j45563m7059J02195J05842M1285Q6981P5257
$$ y = [2050000, 2114208, 2079468, 2080282, 1970384, 1880156, 1800806, 1701847, 1768528, 1866420, 1871955, 1928738, 1900492, 1921529, 1970975, 2060113, 2030708, 1950293, 1946097, 1978079, 1955573, 1960268, 1992863, 2060451, 2010260, 2024782, 2036394, 1972006, 1871724, 1809281, 1773986, 1783176, 1758862, 1737567, 1777427, 1839739, 1828045, 1899102, 1865375, 1784582, 1803494, 1697662, 1554294, 1466773, 1530233, 1439940, 1331314, 1194097, 1224475, 1328314, 1311712, 1182627, 1212395, 1183708, 1125561, 1182913, 1340885, 1373628, 1342154, 1145314, 1101150, 1097924, 1162269, 1149975, 1302555, 1413927, 1314017, 1273578, 1364435, 1420560, 1376268, 1317176, 1342560, 1346343, 1314585, 1380088, 1516142, 1499289, 1522227, 1579786, 1501032, 1498034, 1423870, 1278307, 1231248, 1333443, 1439285, 1480570, 1567551, 1642808]
18273A642808j53513j77868k48807j53847K9661J32401m8968r5191j83187J4631
18263G58120J77053M9888k9697r4875j80562N4403N2019M0452J04047K0616j9523
18252I31941m8450m271O7541K4151l7085J9883L1376n1777l2274p0386r2137K9035
18240G67547M186j3696j16549L3129J16668O0116K3572J09593N0741k8965j01208
18229I05134j06926R1585J61134k8695r6614J48852J27533P8966O7853J00734
18219A449556j6131j12911J1515j01313k98540k00030r9993J03194J47973o0091
18209H23229r2466q2855O9038o0886N0392K6351j52829K5984J11391R782k09J3091
18197G40013p8429j1121N6744N601o784L315m0516m586n2126Q094l8288o6002
$$ y = [1642808, 1489295, 1311427, 1062620, 908773, 938434, 1070835, 1021867, 926676, 743489, 758120, 935173, 985061, 955364, 860489, 679927, 734330, 786349, 826801, 930848, 951464, 931941, 883491, 879220, 946761, 970912, 933827, 953710, 985086, 933309, 901035, 830649, 738512, 767547, 771733, 758037, 641488, 674617, 791285, 851401, 874973, 984566, 1035307, 1006342, 905134, 798208, 889793, 1050927, 1022232, 925618, 1074470, 1202003, 1280969, 1348822, 1449556, 1433425, 1320514, 1332029, 1230716, 932176, 732146, 632153, 735347, 883320, 823229, 730763, 647908, 716946, 656060, 706452, 732803, 579974, 605958, 717349, 727131, 726922, 740013, 661584, 650463, 707207, 712808, 706024, 709339, 668823, 664237, 612111, 620205, 581917, 515915]
18185E15915m1443L4983j4709N9669n040k3225L572J25531L4236j8652k3994J1302
18173F58145P169n79J1082R484M2832j13141r1465Q9123L0352m4882M3443p5207
18161E66356O0048j3803r1647n860Q1417j668j31945q0496l4073R649J44876N8247
18149E61101J23357j8498p4497j13246l0531N3137O3729K4605M5006l9347n0257
18138E44559m0719K3400q5977j49680N4194Q1219P7744k0899n2587R9275J65351
18127F95880r9843J1458K3932p8721l5047p2063k9808P7301L0862O4040k6413
18116E61578m6922J5784j0918L7107R563o1614J3405K4600P6642n8704j70734
18105C89787o9867J44908m1371j58297j36606J31651J72672O2789L9254J5700
$$ y = [515915, 474472, 509455, 494746, 554415, 549375, 526150, 529722, 655253, 689489, 670837, 646843, 658145, 665314, 664735, 675817, 685301, 728133, 614992, 523527, 612650, 643002, 598120, 641563, 566356, 626404, 612601, 520954, 515094, 596511, 594843, 462898, 382402, 348329, 357978, 502854, 561101, 684458, 665960, 591463, 478217, 447686, 500823, 564552, 589157, 634163, 594816, 544559, 503840, 527240, 441263, 291583, 345777, 426996, 504740, 483841, 431254, 530529, 695880, 596037, 607495, 631427, 552706, 517659, 445596, 415788, 493089, 523951, 587991, 561578, 514656, 530440, 519522, 556629, 566192, 504578, 517983, 542583, 619225, 560521, 389787, 319920, 464828, 423457, 265160, 128554, 260205, 432877, 495666, 534920, 550620]
18095E50620n1158n8740j37603P1671N2924P566k6294p1770j03719k555M1464
18084B72406J05964J85918L034k0744m4190r9642m4713K9759P54R0884J2901o4641
18072D27690m1962m9314J27312R0394l3545P408m0883m1647r1217N5309J05433
18061E14978J3714K7836P7834J6557l8593K0766M7456R7331J31380N0960p8617
18050H81602M8302J04868K95084R1496K5501J12829j45391k78121j66152j81848
18040G88170j06441r1665k0770l8973L5141J02772l1787p8237k2787j6859m3548
18029D75016n6137j4851L5003k2841j22064J738J0875R0883L1788m9006n8016
18018C22388J21674O0841J1054J05626q1015j2281o6289j28054k0869O3692n3228
$$ y = [550620, 499462, 440722, 303119, 374790, 427714, 435280, 408986, 337216, 233497, 230942, 272406, 378370, 564288, 567322, 546578, 502388, 402746, 358033, 387792, 388546, 479430, 492331, 427690, 385728, 336414, 463726, 554120, 520575, 527983, 487100, 445453, 354236, 409545, 514978, 528692, 556528, 634362, 650919, 612326, 633092, 680548, 777879, 909259, 960219, 881602, 929904, 1034772, 1329856, 1421352, 1446853, 1559682, 1414291, 1136170, 970018, 788170, 681729, 590064, 569294, 530321, 565462, 668234, 636447, 558210, 535423, 518564, 475016, 418879, 404028, 439031, 416190, 294126, 295864, 306739, 397622, 429410, 380404, 322388, 444062, 504903, 515957, 621583, 540568, 528287, 461998, 333944, 313075, 376767, 323539]
18007C23539k2160J34790N2171p4374l8585L3253J71964J74215P8746N2398K7573
17996I13530K25935J91338J63035K24666J84346M3855M0840o053j85507j81939
17986A614046j53285j93939k28828j28800j13843j861p5556j40936j26251p4483
17976C76264n82K3930J8378K328j4993n1974K6898j971q109J3406R8859M6137
17964E28571J22686k7880m6009p2747j34494M2784K143l0065j27555l5741O7598
17953B89291J50569N2151q2075j25417J01521L9273r4636J07436J6735q9000K7870
17942C93718J15745J42299J2470n4415J10464M4161J45777K65139K42422k4881
17932A392899j04679k38923j72660K7673l1363j96563j78163J2807J3824o2200
$$ y = [323539, 301379, 436169, 488340, 413966, 375381, 408634, 580598, 754813, 833559, 885957, 913530, 1139465, 1330803, 1493838, 1718504, 1902850, 1946705, 1987545, 1981492, 1795985, 1614046, 1460761, 1266822, 1037994, 909194, 795351, 793490, 717934, 576998, 450747, 376264, 375682, 399612, 417990, 420318, 405325, 353351, 380249, 378278, 370169, 383575, 482434, 528571, 651257, 623377, 577368, 504621, 370127, 412911, 415054, 384989, 257434, 221693, 289291, 439860, 492011, 409936, 284519, 386040, 425313, 330677, 438113, 454848, 365848, 393718, 509463, 651762, 664232, 609817, 720281, 764442, 910219, 1175358, 1417780, 1392899, 1288220, 1049297, 876637, 904310, 872947, 676384, 498221, 511028, 524852, 462652]
17922D62652K8473l3860N315o5837m3888K1276K8634j39351j1619j04297l5390
17911A12108J54683L2336J9821J5481K0122n4422q1465J7982L5091k0843L7599
17900B88493M275r646l4216L2795N898J2545k9807Q9756K1872p6056l7331K20584
17888D89162R1517j06888l9706q4193o1980M1777q3499o6472q1215M9111J69152
17877C16766M8082m6263o3315o0800M6157J04462J5953O9554M3896n0536l8325
17866C85631J2511K7148J7848l8653O7122r7252q8972K8619k7191N1072O0700
17855C98583o1023p3114j00014r899j10758K4187O8267L2479M6126J5672J2270
17844B42776M6832M0273m0683j1195o711M1753l0920O873p9524j42161P0017J40784
$$ y = [462652, 491125, 457265, 462580, 396743, 352855, 374131, 402765, 263414, 251795, 147498, 112108, 266791, 299127, 318948, 334429, 354551, 300129, 218664, 236646, 271737, 250894, 288493, 292768, 283122, 248906, 281701, 287599, 300144, 270337, 360093, 381965, 305909, 268578, 489162, 580679, 473791, 434085, 349892, 287912, 329689, 246190, 179718, 98503, 147614, 316766, 364848, 318585, 255270, 194470, 240627, 345089, 361042, 430596, 474492, 423956, 385631, 398142, 425290, 443138, 404485, 471607, 374355, 285383, 314002, 286811, 337883, 398583, 337560, 264446, 164432, 154533, 43775, 67962, 136229, 168708, 214834, 230506, 242776, 289608, 329881, 289198, 278003, 271292, 313045, 282125, 288998, 209474, 67313, 137330, 278114]
17832B78114K0136k586L7211J24002m9460o2124j06610q3359J0411J18208N3576
17821C37519O8370L6372j73032j9701N3310N3634q662m124J4810n0275j93077
17810A15144n3177L5478p841M0127O6455N9338m7421j8097K6854j24152o3146
17799B9562O5005R5835j10953m7426m987J41978J09874q5154M8468l6786O6857
17788B72273P0277n327r6850r5700q7626j29274M4798M1815k4828m6365N9257
17777B450M0569k9812P7213M8763m8894J2808J35852P1653L6064m7288J57282
17766D56660l259j65340p3365n3726k4130m5049L6251K6889j7238K2482P0549
17755B30724M4011P7683P3426q441p5052j81392j27298k0428M851M4033K8491
$$ y = [278114, 298250, 295664, 332875, 456877, 407417, 345293, 238683, 155324, 165735, 283943, 337519, 405889, 442261, 269229, 249528, 302838, 356472, 347810, 343686, 358496, 308221, 115144, 61967, 97445, 89604, 129731, 196186, 255524, 208103, 190006, 216860, 92708, 29562, 94567, 190402, 79449, 32023, 27036, 169014, 278888, 193734, 242202, 205416, 272273, 342550, 337223, 240373, 144673, 57047, -72227, -27429, 14386, -10442, -56807, 2450, 43019, 13207, 90420, 139183, 90289, 103097, 238949, 310602, 346666, 299378, 456660, 453401, 288061, 214696, 160970, 136840, 91791, 128042, 154931, 137693, 160175, 230724, 274735, 352418, 425844, 417403, 342351, 160959, 33661, 13233, 18084, 62117, 90608]
17744I0608Q8915J01577J9283q9730R1486n7623r1809k936K4369N805m5300J37340
17732B71985M2826j14679Q4034K4438r3514r5320J35484o5721o2024O4389K6202
17721B18100M0050k2162j26482q9810K6672R4232M135J1679N7667J4105q2153
17710A46033o4377O3301M2141o7319m6987O4567J31311m2861j17800O6809J56950
17699C31768M5701P8042m5382j76715r5724n9946l3620J1287l1209J37665J66465
17688C28332N2625q3655q4471m2143o4990n934N9466P9916j13105k0226P2668
17677A78483K0703m9306p9212j14807N3415j3252J72245J07252J5882l8479m8981
17666B03943P4067J0076k515L1632J68682r712j34186o1260m9139n3666o7676
$$ y = [90608, 179523, 281100, 300383, 210653, 302139, 244516, 152707, 149771, 174140, 179945, 134645, 271985, 314811, 200132, 284166, 308604, 215090, 119770, 255254, 189533, 127509, 191898, 218100, 258150, 235988, 109506, 19696, 46368, 140600, 144735, 156414, 214081, 228186, 146033, 81656, 144957, 187098, 119779, 72792, 137359, 268670, 225809, 108009, 174818, 331768, 377469, 455511, 410129, 233414, 137690, 77744, 44124, 55411, 24202, 161867, 328332, 380957, 297302, 212831, 170688, 105698, 99764, 159230, 239146, 126041, 105815, 178483, 199186, 149880, 70668, -44139, 9276, -3976, 168269, 275521, 291403, 252924, 203943, 278010, 288086, 285571, 317203, 485885, 476173, 341987, 280727, 231588, 177922, 110246]
17655A10246q5021O4836R6274p0715r2069N431R4429J1272m8519P2808r500R439
17643A58911J5607o1645o4145R598n8518m0792N8153J32679J04083r5437m1420
17632A17074m5277N3308q3853K7786j2848m9673P019J74532J73091j5380m689
17621C41090n5570m0659p7253n2869m9329O3054R922J4954J26227j5905m6070
17610B17592m6762J8508L4898L5852k6726J7530K2726j33701k1150J13297n9742
17599A72322n9900N5099q827p3318M1194j9428P1791j0499M6890J6434m2961q7107
17587A01690M8846Q6569o6643j47114l0686M5759l5587k5083k8637J08722J11575
17576A69411R7079K6006k1409n8489o3899N4968Q9648j29334j6943p3011j3915
$$ y = [110246, 25225, 90061, 186335, 115620, 23551, 28982, 123411, 134683, 86164, 158972, 149472, 158911, 174518, 112873, 48728, 58326, -192, -40984, 17169, 149848, 253931, 158494, 117074, 71797, 125105, 41252, 69038, 56190, 6517, 13536, 188068, 361159, 345779, 341090, 285520, 244861, 167608, 114739, 65410, 128464, 138386, 153340, 279567, 263662, 217592, 170830, 189338, 224236, 260088, 233362, 250892, 273618, 139917, 118767, 232064, 172322, 112422, 167521, 158694, 85376, 126570, 107142, 178933, 168434, 215324, 231758, 188797, 101690, 150536, 237105, 170462, 23348, -7338, 38421, 2834, -22249, -50886, 57836, 169411, 266490, 292496, 271087, 212598, 148699, 203667, 293315, 163981, 147038, 74027, 60112]
17565F0112j12329j39954L6498K08741J17840n2767o3827O776M5292Q4593J6106
17554B07081M617K1628q790o3699L2623n0151n5737r7903R2996l3875R93J29483
17542A79266M9385R3882L8057l4247r3250M3788P5295l0446k51907k0572J42801
17531A92052q9352p621O8728r4802p0163R2918J29346q9302j04990o7689O1635
17520B0760L057N2307K2790L8731L1521P2477j9886M3347o1035j22140m9525L4087
17508F6491J08075L0845N950O69j24710j23094o0683P2835P0256L3574K5607N32
17496A06347N3591l7598O866n8566K2910J1838r371l9863M1732R9120m0273j34902
17484B1831L6034J4796n418k9722j1007J02655r371j543L8374J3914n7302o6994
$$ y = [60112, -52217, -192171, -155673, 53068, 170908, 118141, 54314, 61090, 106382, 190975, 207081, 211698, 233326, 224536, 160837, 193460, 143309, 87572, -10331, 82665, 48790, 49783, 179266, 228651, 322533, 360590, 326343, 233093, 276881, 352176, 321730, 69823, 49251, 192052, 102700, 95079, 163807, 69005, -1158, 91760, 221106, 131804, 26814, -40875, 20760, 23817, 76124, 98914, 137645, 169166, 241643, 221757, 265104, 204069, 81929, 32404, 66491, 174566, 205411, 211361, 212030, 87320, -35774, -96457, -23622, 46634, 80208, 105815, 106347, 159938, 122340, 129206, 70640, 93550, 105388, 96017, 56154, 97886, 197006, 156733, 21831, 57865, 72661, 67243, 37521, 26514, 129169, 119798, 118255, 156629, 170543, 113241, 46247]
17472D6247p1622O434J1908Q7245K5932l4520o3976j3232n4716O7927K2620K0950
17460E1197m8747j07953O5170J20215M358r9784r079K734L5602J02932J9031J2364
17448A48040M8797r5574m2436j9878R2854J55784J22572j09849j86145k7890M0140
17437A26415o2358N151j19923O5994J65678L9101j10722j46812O1690L5282j9954
17426C9542n676M7774m7693p7205J90390j14505K3261K1405P8449q4368j24009
17415e2635N5429K31024N7077n1836p9247k30888m8354N7112P462p0629R707R7996
17403a7782K8087n8416l7655P767P3598O9493J5407N2361L6620r7674N059n2723
17391B4142p369R3763r3733N148M7499o20J25326J9724j78726k6875K689N0894
$$ y = [46247, -25375, -18941, -7033, 80212, 106144, 71624, 7648, -5584, -60300, 7627, 30247, 51197, 2450, -105503, -40333, 79882, 84240, -15544, -24623, -21889, 13713, 116645, 135676, 148040, 196837, 101263, 58827, 38949, 131803, 287587, 410159, 300310, 114165, 86275, 126415, 64057, 69208, -50715, 15279, 180957, 220058, 109336, -37476, 24214, 59496, 39542, 33866, 81640, 33947, -43258, 147132, 32627, 55888, 77293, 155742, 71374, -52635, 2794, 233818, 290895, 239059, 159812, -71076, -119430, -62318, -54856, -125485, -115778, -17782, 10305, -48111, -85766, -77999, -4401, 65092, 80499, 132860, 169480, 71806, 76865, 24142, 16773, 110536, 16803, 21951, 69450, 68830, 194156, 213880, 35154, 8279, 10968, 61862]
17379F1862l9233O0184P405O1815J6899j22902j19703n412J0399m3848L0283k0474
17367a02725r1202o264N1830M965N0295J53186r9367j05812Q8387l382K91N159
17355e4639j244m1948J6010M9999P8867N0766l2048L2733q8424M5258K1866r8243
17343b1047R9255Q5907J5592M271j46817l8285j2575p7589N4655L1233j53741
17332a59141L6379J50384N6239M776K7063q0601N8835o314K3818O2251j8700n3044
17320A01945o8745p6584J6719Q2096N3372K388k8401j35862P4136J71550k9754
17309A62860r4995j15242p5283K7053J04356m0979l9367N7053M594K3749j6754
17298b955J10520M9856l9456o1289k0303Q507o1321M3590M3210Q7105p1296j47069
$$ y = [61862, 22629, 82813, 90218, 152033, 168932, 46030, -73673, -79085, -68686, -112534, -82251, -102725, -193927, -200191, -148361, -143396, -93101, 60085, -39282, -145094, -56707, -60089, -59798, -54639, -55883, -97831, -81821, -31822, 47045, 97811, 65763, 98496, 10072, 55330, 77196, -21047, 78208, 164115, 179707, 183978, 37161, -1124, -13699, -91288, -36633, -5400, -159141, -122762, 27622, 83861, 88637, 115700, 35099, 93934, 87620, 111438, 173689, 154989, 101945, 33200, -43384, -26665, 55431, 108803, 111191, 82790, -53072, 21064, 192614, 162860, 67865, -47377, -122660, -95607, 8749, -32230, -71597, -14544, -9950, 13799, -2955, 107565, 157421, 117965, 56676, 36373, 44880, -16441, 27149, 70359, 157464, 86168, -60901]
17286f0901M5393p1380R6127M7428Q7827o6247j01103R299m6623J17932J48421
17275B06173o405j0284k3555m5879j07144M2906n4129O3479P2631J89578p9825
17264B47546j00831P9192Q069j05957o6218K2825L8307R5262k9938q5354L4099
17253A37002l7055J4763j32401j2808J54560j0544r9896j2320k4033J8461J5504
17242A1233k179m5260l4779P289k7545M7455R4927m9606k0037j9825n8645L1823
17230f5149J03165M508M446m7536j00497p6775K561J03551J61103n7939m4863
17219a3425K0872O5222J06658o5028n2527m7182j5413j10772j06538K2746R2308
17208a03079R1096K2021M4743O0248O157Q172m432j4077o6878l7831J14651P9314
$$ y = [-60901, -15508, -86888, 9239, 56667, 144494, 78247, -22856, -13557, -60180, 57752, 206173, 199768, 189484, 165929, 120050, 12906, 55812, 1683, 65162, 137793, 327371, 247546, 146715, 225907, 233976, 128019, 61801, 84626, 122933, 218195, 188257, 102903, 137002, 99947, 114710, -17691, -30499, 124061, 113517, 13621, 1301, -22732, -4271, 11233, 9054, -36206, -70985, -63696, -91241, -43786, 51141, 1535, -18502, -38327, -96972, -65149, 38016, 42524, 46970, -566, -101063, -177838, -175277, -71726, 89377, 31438, -13425, 7447, 72669, 179327, 114299, 61772, 14590, -823, -111595, -218133, -195387, -103079, -11983, 10038, 54781, 115029, 121186, 129358, 124926, 110849, 43971, 6140, 120791, 200105]
17196B00105r4337j68029M8008K8094j47910m3159M5397o2002r331O3254r5164
17185b35074k195J47965R964O825K4204M2436l6171p5018J0813L388j3669Q8165
17173b8367k2549K0931n6391N2147L5811k6025N8617p0069k1890J596L8928m1515
17161e8776O9715M1758M3745L6626l7937q541K1819j17177k1735J16298J02671
17150A88466o3581j44416j17887n4134P4873Q3864m9248J0731M8764k7495M5933
17139d130Q7027L6954j1753n3854q5608j692l508m1185o8703l2251P4785Q9295
17127a4623m8923M3017J01649p9100L4839R1802J6361O1155l4629j02534j68338
17116i9324n1276P2886L1746M3779J33412n2940j66529J8055R5315R305Q7327
$$ y = [200105, 105768, -62261, -14253, 13841, -134069, -177228, -131831, -193833, -203164, -139910, -235074, -237269, -89304, -79340, -72515, -48311, -5875, -42046, -117064, -106251, -102863, -116532, -28367, -50916, -29985, -86376, -34229, 1582, -24443, 34174, -35895, -57785, -56189, -17261, -58776, 10939, 52697, 96442, 133068, 95131, 86590, 108409, -8768, -30503, 85795, 188466, 124885, -19531, -137418, -191552, -116679, -32815, -82063, -71332, -22568, -50063, -4130, 82897, 119851, 108098, 54244, -31364, -33056, -36564, -77749, -146452, -178703, -103918, -14623, -63546, -20529, 81120, 2020, 36859, 128661, 145022, 206177, 171548, 69014, -99324, -150600, -77714, -45968, -2189, 131223, 78283, -88246, -70191, 25124, 34429, 121756]
17105A21756O1823n2690n9421L3770l6058p6691R086p7056n0105P4662Q1842l085
17093B7833L7409o6526m5011N2367P5778J32781k1300j21389l3433r5822J02078
17082D4765O8651p4777n5019k4237m5225K5145J8663L4178k5734p836N5791K5012
17070C9377j6347J7143J45218k570p6981q0829l563o7342J09359m3368m4123Q3666
17058E9640N6565n6657j58802p7789Q8644P3974P4744J3742O8204n3211n1710
17047C7344R0009K299J5297N7337N1154j89053p9385J03177M413J10502O2938
17036B66032k7884o512O116r9020o5954M1030L2147l0967m8585j25021l4733J17737
17024B4386m7254o6365K029J51403P4044j00291k5181N775P338O7242j2457l2261
$$ y = [121756, 183579, 130889, 71468, 105238, 69180, -7511, 1575, -75481, -125586, -50924, 30918, 27833, 65242, -1284, -46295, 6072, 81850, 214631, 193331, 71942, 38509, -57313, 44765, 113416, 38639, -16380, -40617, -85842, -60697, -42034, -7856, -33590, -41426, 14365, 39377, 23030, 40173, 185391, 182821, 105840, 25011, 21448, -45894, 63465, 20097, -24026, 59640, 116205, 59548, -99254, -177043, -88399, -14425, 60319, 74061, 142265, 89054, 37344, 127353, 129652, 144949, 202286, 253440, 64387, -14998, 88179, 92592, 203094, 266032, 238148, 231636, 237752, 138732, 72778, 113808, 145955, 114988, 66403, -58618, -93351, 24386, -22868, -89233, -87204, 64199, 138243, 37952, 12771, 18546, 25884, 93126, 80669, 48408]
17012D8408j00823l5145n2705J5617J30553J1688M7179N0665n6018j26914r6534
17001a64029j29725j2526J01773K24960O6517r1850r216J51686p042m3831l7224
16990D9493L7175j02791o1151O3353Q1010l6337M8684l6708l8273l9291j64578
16979a99414k1764Q0699J09197N3517k2610O1924o6914p8536j201J867o6189J9925
16967a29499j2438R9874J36931J28267K9555p671p3565j75157k8556O740O7942
16956D2423P6793j1442q7159m3765J6611j842N9309L7275J946l3509k8667O1391
16944H9364l5985l9852M0235j7017l4116n2522P1615N5144q0822m1283M74M6442
16932A677L9186O900M3189k499L0561L1139L016n1591j870k2227o307N0577M5393
$$ y = [48408, -52415, -87560, -140265, -124648, 5905, 17593, 64772, 115437, 59419, -67495, -164029, -293754, -306280, -204507, 20453, 86970, -4880, -14096, 137590, 130548, 86717, 49493, 86668, -16123, -77274, -13921, 67089, 30752, 79436, 42728, 4455, -34836, -199414, -221178, -140479, -31282, 22235, -375, 61549, -5365, -83901, -85102, -83235, -149424, -129499, -141937, -42063, 94868, 223135, 252690, 245019, 171454, -3703, -32259, -25519, 42423, 119216, 107774, 20615, -23150, -6539, -8381, 50928, 88203, 90149, 56640, 27973, 89364, 53379, 13527, 53762, 36745, 2629, -49893, 21722, 76866, -3956, -45239, -44765, 1677, 40863, 47763, 90952, 88453, 119014, 150153, 153169, 101578, 99708, 77481, 71174, 121751, 167144]
16919A67144q3064j04278k4439m5585o525L0324J3265M4006n7041N04K3148q223
16907e0764R8697O7423o1466r669m1099k6442j4840J6903j6580N1587J03775J9613
16895A37138p8959j51264L1416J20620j14519j0265M4676n4151n332l2292O3246
16884d9686J32855M6771j7660n2264q490N6111j0144j19198j05797o1353L3592
16873a55263L4524J27770L8745o2458N6590L7532o6368p774J78475J83527q0417
16862B84883p4625J9067p0381J7508j52241j46870L0918L1895n0926j711o2525
16851a75008m9108m9104R9570J0024J16945J08004j05118p876j5512J1366Q4351
16840B8534M01j5841O8335n8680J6878L5133Q5268o5952l2442o9319k6748M0480
$$ y = [167144, 84080, -20198, -44637, -90222, -96747, -66423, -53158, -9152, -66193, -65689, -42541, -50764, 47933, 115356, 53890, 44221, 3122, -23320, -38160, -21257, -37837, 13750, 117525, 137138, 58179, -93085, -61669, 58951, -55568, -65833, -21157, -75308, -80640, -112932, -49686, 83169, 129940, 112280, 60016, 51526, 107637, 97493, -21705, -127502, -188855, -155263, -120739, 7031, 45776, -16682, 39908, 77440, 11072, 3298, 181773, 365300, 284883, 210258, 229325, 158944, 176452, 24211, -122659, -91741, -59846, -110772, -112483, -175008, -224116, -273220, -173650, -163626, -46681, 61323, -43795, -51671, -67183, -55817, 28534, 28935, 13094, 81429, 22749, 39627, 74760, 160028, 94076, 61634, -7685, -34433, 6047]
16828F047Q7139L924q2813Q9967K4625K7182l6251J0597K1308j2075N8910o7742
16816A30818r9121j19349J4411J1318j4066O5178R8615Q1263R0541j07856k8168
16805A23584m8726m6521n7632L8241q177Q497k3565l4986j7612J25486J8068j52051
16793g5394m8418L9059Q4264J19514j0556N827N124k5838j9996P9529K1322L2371
16781B06808j90142M3804J10027m0856q3662k8599J5567L8145r2082l9321N306
16770e5005K1834J31309M4822q6926l4464p196L7039m9573P504l2058J9285N8479
16758E5050n454n1417O9799K4516j29666P969q198K1018J6283L004l9224l7014
16746g3334K1497K3208m6677p4573m7346J29445O8534q2029J2733R8043j20419
$$ y = [6047, 93186, 97110, 14297, 104264, 128889, 156071, 119820, 130417, 151725, 139650, 198560, 130818, 31697, -87652, -73241, -61923, -75989, -10811, 87804, 169067, 259608, 151752, 123584, 74858, 28337, -29295, 8946, 769, 9266, -14299, -49285, -66897, 58589, 76657, -75394, -123812, -84753, -489, 119025, 108469, 114296, 119420, 93582, 73586, 153115, 174437, 206808, 16666, 60470, 170497, 129641, 45979, 17380, 32947, 71092, -20990, -60311, -55005, -33171, 98138, 142960, 56034, 21570, 14374, 51413, 1840, 9344, -22714, -3429, 55050, 49596, -1821, 67978, 92494, -37172, -29203, -37401, -16383, -100, 2904, -36320, -73334, -51837, -28629, -75306, -149879, -197225, -67780, 754, -81275, -68542, 29501, -90918]
16735i0918o452o9197K0393Q8553R4286k380l1093l4873O731N9995O7889o889
16723I6045j6673M1910p9701K1064m3578p5298l9663R2020L7993j01352n2019
16712a19252L8774J04554N0836m8618O2634O434j7939j4895J35907N2445j1244
16701B39636n4980j30804L5220O4214O413l2800j26375M7343P0069j96424o6919
16690a45407Q0163J9339j01378N7845j2484m8777M991J0653J7411o387j7707N2712
16678h9026j7872m3523J9633P1680L5162n296O3378m8372p4368j16926L7899L5512
16666a32119R6404J34902j9282q9101j9345J6667p0262O2114P1034P9170j1463
16655A18719K5027k8818o2179q6937q255o1855M8718J34462R5145p111K4677r6320
$$ y = [-90918, -97370, -166567, -146174, -57621, 36665, 34285, 3192, -31681, -24950, 35045, 102934, 96045, 79372, 121282, 41581, 62645, 19067, -56231, -95894, -3874, 34119, -67233, -119252, -80478, 24076, 74912, 26294, 88928, 95362, 77423, 62528, 198435, 250880, 239636, 184656, 53852, 89072, 153286, 159699, 126899, 524, 47867, 117936, -78488, -145407, -65244, -45905, -147283, -89438, -101922, -150699, -145708, -135055, -117644, -124031, -141738, -89026, -106898, -150421, -130788, -59108, -23946, -29242, 34136, -14236, -88604, -205530, -167631, -132119, -35715, 99187, 79905, -9196, -28541, -11874, -82136, -20022, 51012, 130182, 118719, 143746, 114928, 52749, -34188, -42443, -104298, -55580, 78882, 174027, 166916, 191593, 95273]
16643I5273p6920m7506m1088p4740m2892k3729J0041L6078M5649m5170K5639J15663
16631b3702R7378Q899n2350j2218k1336k5658P8927J3906j08479n9322R2048J18033
16619A06126N5798N9912j09279m5123k3117l3092m3133j15P051P34l6770K8094
16607c2914R7446N5317K409r0240p8718o062O550N085p3796k4126N3699l3656
16595a19006j11696l5478l1999L8802K6377K0651Q8484q2931l2324J85260M3680
16584a0180j15728r1018j21609j1445N3739J35116K6903q172P950M2051J41867
16573D9474M3950O0129l2209p8116k9113j6276m3829K5593O8898l1909l6691l3466
16561e3565P700M2898M2351j5957J30440m4163j27956O8045O7487L6930p1942
$$ y = [95273, 18353, -29153, -70241, -144981, -187873, -211602, -201561, -165483, -119834, -165004, -139365, -23702, 73676, 82575, 30225, 18007, -3329, -28987, 49940, 63846, -44633, -103955, -11907, 106126, 161924, 221836, 112557, 67434, 44317, 11225, -31908, -32023, -24972, -24238, -61008, -32914, 64532, 119849, 122258, 32018, -46700, -52762, -46212, -41127, -114923, -139049, -85350, -119006, -230702, -266180, -298179, -259377, -233000, -212349, -123865, -206796, -239120, -53860, -10180, -125908, -216926, -338535, -349980, -296241, -161125, -134222, -142394, -134444, -92393, 49474, 93424, 153553, 121344, 43228, 14115, -2161, -45990, -20397, 48501, 16592, -20099, -53565, -45865, -2967, 39384, 23427, 153867, 109704, -18252, 49793, 117280, 154210, 82268]
16550H2268n9846q2824m0946o4976J472L8909N4405j5554N2503R084N8765K9439
16538F2699j66921q4821r645L7767L5877q551M4020l8776p6482R1270J11399j23220
16526a25384q5763o2555J17175J57040P4974k6458q3601j01672l6753l770l3712
16515b10479l205L3023J15641P5636j27050J04010L8393j27900j51994o6561Q0882
16504b39604R6529J15874K2749j13338J06538J12681j07738k08970o448R4034
16494a27693P2845J37369l0563q7977n8501Q5180M0698J835m8738l7523P2575
16483A9507M0173l2820j78815k07487L054O9119J51756J10397L8358N0688O503
16472G0433K5083k8992j324n5297m2290n1551o5368R5558K5812j6026P2686M5126
$$ y = [82268, 22422, -60402, -101348, -166324, -164852, -125943, -71538, -87092, -34589, -25505, 33260, 62699, -104222, -189043, -198688, -160921, -125044, -133595, -89575, -128351, -204833, -113563, -2164, -125384, -211147, -273702, -156527, 513, 75487, 49029, -34572, -136244, -172997, -176767, -210479, -213684, -180661, -65020, 10616, -116434, -12424, 25969, -101931, -253925, -320486, -239604, -143075, -27201, -4452, -117790, -11252, 101429, -6309, -215279, -221727, -127693, -54848, 82521, 51958, -36019, -94520, -9340, 31358, 33193, -15545, -53068, 19507, 59680, 26860, -151955, -359442, -356388, -287269, -135513, -25116, 13242, 63930, 70433, 95516, 66524, 65200, 9903, -32387, -83938, -149306, -53748, -27936, -43962, 28724, 73850]
16460G3850j62869p0140L0411N5214m5735Q1607O5337p8227o5050K5646N1548
16449c8408L2630N6753J00754l9553j01485M0641M6021m7805j00058l2918j00646
16438a84074P014M4329J5020k9902k2755R3189J46823J54450P2826j61361n2698
16427H2861n7690q5282p5683l4829J07641L033M0367j3162J721J14073Q4880n0510
16415A17420q5424p7807p9021o5909J67931P9110J2496J7867k3769M5045l6308
16404G1631Q726N7656j11209p87q5485N5303M7209N8551J01057n8391l0667p3587
16392D0007p6028K9598l2047m2194L3106k2960k9740o8459o433P1082p427j11745
16380b23240J6014M6293K1008k9498M7502J35967o6028j5440j6675n9178p456
$$ y = [73850, -89019, -159159, -128748, -73534, -119269, -37662, 27675, -50552, -115602, -89956, -38408, -5778, 50975, 151729, 112176, 10691, 51332, 97353, 49548, -50510, -83428, -184074, -177060, -132731, -117711, -147613, -170368, -77179, 69644, 224094, 296920, 135559, 82861, 25171, -60111, -135794, -170623, -62982, -59949, -19582, -32744, -31023, 83050, 167930, 117420, 31996, -45811, -124832, -190741, -22810, 56300, 68796, 86663, 62894, 107939, 71631, 80357, 138013, 26804, 26017, -59468, -4165, 43044, 101595, 202652, 144261, 113594, 40007, -36021, -6423, -38470, -80664, -47558, -70518, -100258, -168717, -175150, -104068, -111495, -223240, -207226, -160933, -139925, -169423, -121921, 14046, -51982, -67422, -84097, -143275, -150731]
16369a50731K7918J22054K3790m5862q3301O9689R2182k38O9090L6398j13892
16358D7097j97643j0669J04092O3080o8921k231m6602n0259J45488J32765j5346
16347A00851j52084j58945O7011Q6070q988L9233K076N430j1805Q6037l2563j21137
16335i8814J47084P1256j47652m6628p1088l2966J59410P5837o1250n9355l8273
16324a02439j8195M5389j3748J30632J09352j3723n2343l4948j18874Q0329l842
16313G590k1915n6297j04721j9142m8442N3971M1267J51390j3816n5128P8720
16302A3477m7892j52952j02129N9407J03738P5600L851M8730O2823J7749L7975
16291A20377j8100J6638j67578L8289Q4633N4585l1670n0215l3706R2486j5716
$$ y = [-150731, -122813, -759, 23031, -22831, -106132, -36443, 55739, 55501, 124591, 160989, 47097, -150546, -161215, -57123, 5957, -62964, -65195, -111797, -162056, -16568, 116197, 100851, -51233, -210178, -143167, -57097, -66085, -26852, -24776, -19346, -31151, 54886, 22323, -98814, 48270, 119526, -28126, -74754, -145842, -178808, -19398, 56439, -4811, -64166, -102439, -120634, -75245, -88993, 41639, 150991, 137268, 84925, 49977, -68897, 11432, 7590, -14325, -70622, -175343, -194485, -242927, -188956, -147689, 3701, -10115, -65243, 13477, -34415, -187367, -289496, -230089, -126351, -50751, -46900, 1830, 64653, 82402, 120377, 102277, 118915, -48663, -10374, 74259, 128844, 97174, 46959, 13253, 105739, 90023]
16280I0023r7054j22611O5889M9992k7484L2885J06779K313j5419K1126o9159
16269C7280r3307N0391J13618j09414j05775r4360O3799J26694j5753k0367o3879
16258a11073l4914M4241j25487j5960J68944Q5227K2116k629j65761l4868J17781
16247e2383R0793Q2861k7933k2402k9553o8763q6059j28212k9891l263j8506Q6304
16235b07007N9344J28875Q7966K0625p9272m1104K8875l2544m9153n6442o7797
16224b07634p2022j7221O8920M3852Q8482J15563J04893p0904j55379l2188O1909
16213g1729M4805P6569l5853J4707j20485j19984q971o5307L405M1453j9697J08891
16201a52196J28663j5450o1883Q9516l889j07590r286M748J49390q5905p4097
$$ y = [90023, -7031, -129642, -63753, -13761, -41245, -8360, 98419, 100732, 85313, 106439, 37280, -56027, -5636, 107982, -1432, -107207, -201567, -137768, -11074, -26827, -47194, -111073, -145987, -101746, -227233, -243193, -74249, 10978, 33094, 30465, -135296, -170164, -52383, 38410, 121271, 93338, 70936, 41383, -27380, -113439, -241651, -271542, -274805, -293311, -207007, -147663, -18788, 69178, 89803, 10531, -30573, -1698, -34242, -83395, -139837, -207634, -279656, -296877, -227957, -184105, -95623, 19940, 124833, 53929, -101450, -133638, -71729, -26924, 49645, 13792, 28499, -91986, -211970, -220941, -286248, -282843, -241390, -261087, -152196, -23533, -38983, -100866, -11350, -15239, -122829, -132115, -127367, 22023, -63882, -137979]
16190a37979M4121p0071k4355r9675Q9646J82456J28962L0526J3411j87089j3712
16179d3759L7193M8705J034L2885j9224n6770k422J6406j4360K7944K8064O086
16167F1782j3489k9878L8224k2552n9072o1389K0320J85932J8202k06112m9182
16156a17214L2023L3232p4961k0708L6266l4895J10002N7573N813l0837N8442
16145E4736n1631n0328K03735J44453j13365p5406M154J8353M6748j676q6043
16134I3730M618M5777r3308j12335K9467j03404r907K7879O0801M1844J7855p5157
16122g2140O2956K0881K9797p4389j45693n3946J41094l8132r1408o7427L0805
16111b57602M5300o140P6233P2867q7477m8523J04513J14569M4919L644n491j2221
$$ y = [-137979, -93858, -163929, -188284, -287959, -198313, -15857, 113105, 143631, 157042, -30047, -43759, -6566, 42139, 43173, 76058, 56834, 64, -2358, 14048, -312, 27632, 55696, 61782, 48293, 18415, 56639, 34087, -24985, -86374, -66054, 119878, 138080, -68032, -117214, -85191, -51959, -126920, -147628, -111362, -146257, -36255, 21318, 27131, -3706, 54736, 3105, -47223, 156512, 300965, 187600, 112194, 116348, 134701, 181449, 179773, 93730, 98348, 144125, 50817, -61518, -32051, -135455, -145362, -117483, -56682, -14838, 3017, -72140, -9184, 11697, 41494, -32895, -178588, -232534, -91440, -129572, -220980, -288407, -257602, -212302, -218442, -142209, -69342, -156819, -205342, -100829, 13740, 58659, 62303, 56812, 44591]
16099D4591l7767l8182r145J53687k7765j05551j53792Q9428N0036m0665J15736
16088D0611O894p1371j47064k9872M8645O2505J30519Q5347k1763r9413J05093
16077A10131O3406K1338r4509j12793J9397R9761m9047q6127l9742J1209J83463
16066A26487m2887q9153M0080M4942m4853j66601r3826M8349J5039l946O1873
16055a04496K3428L7952K7689R8417j2843o4428J02424O9270J5837m0528j05931
16044D6791r8322O435L1067j6834O8130Q8110p4504p2926r3126O073K7886j4427
16032i5647o3036Q0375m4619q1652r7270l2336J67907N8736j2422K3767k2636
16021a18833L9678K8952J42722J35296n2243m3834l4124M6515r401K7131l5063
$$ y = [44591, 6824, -31358, -40503, 113184, 85419, -20132, -173924, -84496, -34460, -75125, 40611, 47505, -23866, -170930, -200802, -152157, -89652, 40867, 126214, 104451, 5038, 110131, 173537, 194875, 100366, -12427, 6970, 106731, 57684, -28443, -68185, -56976, 126487, 83600, -5553, 34527, 79469, 34616, -131985, -225811, -177462, -162423, -166369, -104496, -81068, -43116, -15427, 82990, 70147, 5719, 108143, 177413, 193250, 152722, 46791, -51531, -45096, -14029, -30863, 37267, 125377, 50873, -22053, -115179, -109106, -81220, -95647, -158683, -78308, -122927, -204579, -301849, -334185, -166278, -107542, -119964, -96197, -118833, -79155, -50203, 92519, 227815, 175572, 131738, 97614, 144129, 134728, 161859, 126796]
16010A26796L7997K6255p430q5740n119p6091j8484M6607L0066O2918J51205Q178
15998B97158j05340n6474o1597n3328N7238J2499O7450j02519r3053M378L170
15987c0418k8449L0950Q8673l6665r1494K0337R2882m7773L5617n5040l0705k6042
15975g8127N1399j1041L5788J24464M5371n3299q7610L2843N1470N4241L7272
15964B02771m6786n3890k5417r3973o5508N4179j281p4436o9813M5655l1384O6853
15952i3030J23056J00514K4373j58313p4990j3539j66992P5203O7542J9782R0501
15941e893l0539K2072q5632l6656O991M6581O8656M7510j3386j27526j15179J9682
15929b03319J29131J46261R4857j07285n3532J30701m7324O3682N4202j59317
$$ y = [126796, 164793, 191048, 183618, 97878, 92759, 16668, -1816, 44791, 74857, 137775, 288980, 297158, 191818, 135344, 73747, 20419, 77657, 90156, 157606, 55087, -37966, -33588, -30418, -58867, -27917, 60756, 24091, -67403, -47066, 45816, -1957, 33660, -21380, -52085, -78127, -26728, -37769, -1981, 122483, 167854, 114555, 26945, 59788, 111258, 165499, 202771, 155985, 102095, 76678, -17295, -82803, -28624, -29905, -104341, -174154, -128499, -159883, -93030, 30026, 130540, 154913, -3400, -78390, -91929, -258921, -183718, -116176, -96394, -5893, -36432, -14360, -99992, -136648, -129657, -83076, -14420, 33090, 19704, -107822, -223001, -203319, -74188, 72073, 166930, 59645, 6113, 136814, 89490, 153172, 207374, 48057]
15919D8057J0613R6887N7984o0459n5531N5060J2048J7135M6118r7605p9127J4106
15907F5286K4605j1988n2791N8751M0573K106l2965o0378L4674K6697K0972k4611
15895I0931n6542L3586N3756N9817m2554j64710k946O9016K080Q1716o1742n4562
15883G846j71899q2713J2265Q1846J0726R5685N8056m7006J1170N0358J27762
15872A54096j405p66K0782r8600j11103j18591k9560k8964O6700N2796L0563q2953
15860a47005J230J4559K5509j00631R0648J23246J8312j52012M4784O6109N9649
15849D4398O4963j2681j24898n1370K8188R1082j15282K3670P6400q1017j05495
15838a62042l7404N68P11k5240R6832N9248j03162r1186P8406K2159R3981l321
$$ y = [48057, 58670, 155557, 213541, 153082, 97551, 152611, 164659, 181794, 227912, 130307, 51180, 65286, 89891, 77903, 25112, 83863, 124436, 126542, 93577, 33199, 67873, 94570, 115542, 90931, 34389, 67975, 121731, 181548, 138994, -25716, -28662, 40354, 42434, 124150, 62408, 7846, -164053, -246766, -234501, -152655, -141929, -46244, 11812, -35194, -24024, 26334, 154096, 152691, 151925, 172707, 74107, -36996, -155587, -185147, -214111, -147411, -94615, -64052, -147005, -145775, -131216, -105707, -206338, -115690, 7556, 25868, -126144, -81360, -15251, 44398, 109361, 96680, -28218, -79588, -51400, 39682, -75600, -51930, 24470, -56547, -162042, -199446, -198878, -198167, -223407, -126575, -67327, -170489, -261675, -183269, -161110, -67129, -70450]
15826g0450J0550j1210l1867j3629l7001O7936R8279k943j13276n4332Q0043K06545
15814A28645m4986j87814r5659m2012J56426J52166j03970k3306K3793l8816o4597
15803a40130J2371L1320L5844n474n593m8017L5090R2614J9338n9530M409J25231
15791I7473N0806r7568J04903P0775n5841J8665L5217N9095j85954k76726o8659
15780b47814L9771P9723K2210O1182k41j38367P921J89587J68124l4390j23252
15769B4454p2787L6497K7177k9143J2757K9132p7722p0811r2553P8913J35800
15758A714M8220l4842k2165m9105m4081N3605N9825m1301l5322n2148Q4763l7973
15746f8810n6399J9473K2521J3215q8475K8120L1780M2157N6627p297j6019M8221
$$ y = [-70450, -59900, -71110, -102977, -116606, -153607, -85671, 12608, 9665, -103611, -157943, -77900, 128645, 83659, -104155, -199814, -241826, -85400, 66766, -37204, -60510, -36717, -75533, -140130, -127759, -96439, -60595, -66069, -71662, -119679, -84589, 8025, 27363, -32167, -27758, 97473, 148279, 50711, 155614, 226389, 170548, 189213, 224430, 283525, 97571, -179155, -247814, -208043, -128320, -106110, -44928, -45169, -183536, -175615, 13972, 182096, 147706, 24454, -48333, -11836, 15341, -13802, -1045, 28087, -49635, -120446, -212999, -134086, 1714, 49934, 15092, -7073, -56178, -100259, -46654, 13171, -28130, -63452, -115600, -30837, -68810, -125209, -105736, -83215, -70000, -158475, -130355, -98575, -56418, 209, -7088, -23107, 25114]
15734B5114L3453O3359j73029j33669L738P4550l9811k2261O423k0409l2563L5290
15722a79815K1586L6937l3391j0044m2980L2600k2579K3914R1937N1087P697n3457
15710g6508l9960l9815l3585J19417J32131m4522l6251k4752M9752J3130l6394
15699a7357K2364M4742m8745r0279o5244L6557J21514j8802P0069j0940k4448
15688A9431m3533m8745P4724J7736n0939K5843k9272q9631N4270J19986k4120
15677B5750j2084n4264r931N6417J2148j58521l3771L4321k4141L7854N7434P3990
15665E202m4602q3671p8014m8690N5455Q9088j13725k5548j1901j438o8070R9218
15653b26696J76255N0717K1060m233j4178M446J46748k5150j07128j16112r2631
$$ y = [25114, 58567, 121926, -51103, -184772, -181034, -106484, -146295, -168556, -162133, -182542, -215105, -179815, -158229, -121292, -154683, -164727, -207707, -175107, -197686, -173772, -81835, -30748, -23051, -76508, -116468, -156283, -189868, -70451, 61680, 17158, -19093, -43845, 5907, 19037, -17357, 5007, 49749, 1004, -89275, -154519, -117962, 3552, -15250, 54819, 43879, 19431, -24102, -72847, 1877, 19613, -31326, -5483, -34755, -124386, -70116, 49870, 25750, 13666, -40598, -50529, 5888, 18036, -140485, -174256, -139935, -164076, -126222, -68788, 5202, -39400, -123071, -201085, -249775, -194320, -105232, -218957, -244505, -256406, -257844, -325914, -226696, -50441, 276, 21336, 17103, 2925, 7371, 154119, 128969, 21841, -94271, -186902]
15642a86902L7884R92P1695P2985j06701p6533M214l493J21294J18438M4172J1418
15630A09463j3888q9957j07791j02547Q102K2901o0082p4324Q0840L0933J72728
15619b3622J11932j50848j79389O8237N5585P6922K7004J7480J09398l2687l3036
15608D6976j20924p6483J17083J9308j11751J64463M2841n0788J01455n651q9352
15597C7177m3603M5177q1131n4447j26078J18030J0020j14106K5745N1550M5902
15586h5764K00547K8638o7128j7224q6453q7180P6058J8060K4167Q8617m8585
15575D3753k9159q9913l023J8571k9608k6071o6437R7869q787r7919l4566k1054
15563b46344J0282K5109j0818j0398J60943M1205O6552J24096K5859r215j25733
$$ y = [-186902, -149018, -148026, -76331, -3346, -110047, -186580, -182366, -185859, -64565, 53873, 98045, 109463, 95575, 5618, -102173, -204720, -196618, -173717, -233799, -308123, -227283, -196350, -23622, 88310, -62538, -241927, -173690, -118105, -41183, -14179, 3301, 112699, 80012, 46976, -73948, -150431, -33348, -14040, -125791, 38672, 81513, 30725, 132180, 126529, 37177, -6426, 38751, -42380, -96827, -222905, -104875, -94855, -208961, -183216, -131666, -85764, 114783, 143421, 76293, 59069, -27384, -114564, -38506, -20446, 3721, 92338, 43753, 14594, -75319, -78342, -59771, -89379, -115450, -181887, -84018, -92805, -190724, -225290, -246344, -236062, -210953, -221771, -232169, -71226, -30021, 36531, 160627, 186486, 177271, 51538]
15552E1538k8436p4856j3527J777j8539J9792j91154j26821J5152O8610J03322
15541a93142M9226O1149L0254J17746J4262p5519k2606L1345j52535j27582k8541
15530b95943O3504J04798Q1522J8221r3368n9590K9353M7315l7004k7515N9456
15519a09251O7067O6382N5415O4264p4420r7490M0409M3424N0248m6642J4769
15508G4175r813p4622k6617j8971J6830L3470J4910O7455P7857j6317o8164r1191
15496b0998P8021L8968l3918p6124M1623K7789L214m206K503l0585p9134j0596
15484f3443j4561j26284q1131P9061O1667m971J4314L0606r231m1770j630k0088
15472a77461J21263L7577n4474N5759L4084m0433K5466k3780n4942L0592K5563
$$ y = [51538, 23102, -51754, -65281, -63504, -82043, -62251, -253405, -380226, -365074, -296464, -193142, -143916, -82767, -52513, 65233, 79495, 3976, -18630, 12715, -139820, -267402, -295943, -232439, -127641, -46119, -27898, -121266, -180856, -151503, -104188, -141192, -168707, -109251, -42184, 24198, 79613, 143877, 69457, -28033, 12376, 55800, 106048, 59406, 74175, 64362, -10260, -36877, -55848, -39018, -5548, 9362, 76817, 154674, 138357, 70193, -20998, 57023, 95991, 62073, -14051, 27572, 55361, 58575, 54369, 56872, 26287, -52847, -63443, -78004, -204288, -285419, -206358, -144691, -149662, -135348, -104742, -113973, -155743, -157373, -177461, -56198, -18621, -73095, -17336, 16748, -23685, 1781, -21999, -76941, -46349, -20786]
15461b0786n8830M5581n0044N6871J32550N1387K8617k5976M8293k5310r0961
15450I1392m3688k4209k26K2605o4109m5317j958p1634o9482O9806M9297j29022
15438b16545P3617L0168J04132M7224k5739o943q5172O876J00260m5553J21320
15427A03645n0761j16888j32379k0239R767P6064J41973N4971p8607j16125j21782
15416b50361M9873J21565q7541k2251P7214k1749Q1194L2623P7m8467m6297k5606
15404a39726J35476J24830m0033k0355n9859p6666m0018N6972J51292j82533m4349
15393a34969N678K8482L306M885P816K5195P156K2099q921J2409J4797L9766p1352
15380d3653k8164R9572R220n0000j2902Q9277k9556j06830J3518O3732l0264j5511
$$ y = [-20786, -79616, -34035, -84079, -27208, 105342, 156729, 185346, 159370, 207663, 182353, 91392, 47704, 23495, 23269, 45874, -18235, -63552, -65510, -137144, -206626, -136820, -87523, -216545, -142928, -112760, -8628, 38596, 12857, 5914, -79258, -72382, 27878, -17675, 103645, 52884, -64004, -196383, -216622, -206855, -130791, 11182, 66153, -12454, -128579, -250361, -200488, -78923, -166464, -188715, -111501, -133250, -52056, -19433, -19356, -67823, -114120, -139726, -4250, 120580, 80547, 60192, 333, -76333, -116351, -59379, 91913, -90620, -134969, -129291, -100809, -97503, -92618, -84802, -59607, -52451, -30352, -39273, -26864, -12067, 27699, -43653, -71817, 27755, 36975, -13025, -25927, 63350, 33794, -73036, -59518, 4214, -26050, -41561]
15368d1561o4378q3268O5701J36423J50011m4698j47070o511k3124k4295M9305
15357c3465q900M6161n0755j3499p6043l7767k3268R9327N0064m6071m2539j8487
15345a55242J13967L8476k6693n3811Q8398R006l7733j2032k1026o5554o7404
15334a89648K5700R3575J5926l5912K7326J2050O0569P610N1479m6889J6691k815
15322C5662n8061n514P4013O8626k7840j40869N1966o0465P2676l2201j71326
15311a93333J3499J4135j7577j6807R1941J23085J09959q6763Q511J2662j38730
15300g9418m3652J44318k21n2967K4537j8250p4514m8138L1714K6195R0778j06799
15288a06417m8686J82649L0717J32253o5026o8956R5490k7456p7040L2976k6252
$$ y = [-41561, -105939, -189207, -123506, 12917, 162928, 118230, -28840, -35351, -58475, -82770, -33465, -42365, 3796, -46959, -60458, -136501, -174268, -197536, -98209, -48145, -94216, -136755, -155242, -41275, -2799, -29492, -83303, 5095, 14101, -23632, -35664, -56690, -122244, -189648, -163948, -70373, -54447, -90359, -63033, -50983, 9586, 17196, 68675, 21786, 38477, 35662, -22399, -27913, 46100, 114726, 86886, -53983, -2017, -62482, 10194, -22007, -193333, -179834, -165699, -183276, -200083, -108142, 14943, 124902, 38139, 46650, 59312, -79418, -123070, 21248, 21027, -31940, -7403, -25653, -100167, -148305, -116591, -90396, 382, -106417, -155103, 27546, 58263, 190516, 125490, 56534, 152024, 124568, 47528, 80504, 54252]
15277E4252O3859K3898o7386j10103l535N9634l0221J7575k1043j11262R3234
15266c1098K7002l205o7948m4262k5182j7298m3816L8179j4302Q7868O7028o3812
15254i0846n4472J7316J0617k1394L9107J59742J09377K2234p2639q3805m1712
15243f475K625k4323p4793O049q8030n0372L3494N905N8761M0497P4881M7792
15231B6011r6919L459J03053K2321l8500p0718J7904o3824o6738J6760J45513
15220a678r584j20323K16428R8880M8463j93419o0812J8605j26862Q699K4947
15209i6656r7531j2081R5652J13953O0729n6393p9434L8051L9021o5469m4690
15198a04848k4071J497L3924j4978k2484J14595J6109m1539J13602l0671j06325
$$ y = [54252, 118111, 142009, 74623, -35480, -39015, 20619, -9602, 7973, -13070, -124332, -31098, -4096, -7301, -75249, -119511, -144693, -161991, -205807, -167628, -181930, -94062, -27034, -90846, -145318, -128002, -117385, -138779, -99672, 60070, 169447, 191681, 119042, 35237, -6475, -3850, -28173, -102966, -96917, -184947, -235319, -201825, -195920, -137159, -96662, -21781, 26011, -70908, -67449, 35604, 57925, 19425, -51293, -33389, -97213, -163951, -147191, -1678, -11262, -131585, 84843, 183723, 232186, 38767, -22045, -3440, -130302, -121603, -96656, -194187, -206268, -110616, 3337, 64066, 7673, -71761, -33710, 5311, -60158, -104848, -128919, -127422, -93498, -108476, -130960, -16365, -256, -41795, 71807, 41136, -65189]
15187f5189k5511o7890P4360P0011m834m8588Q0839P9304j88458m6347l6368j743
15175a80414l2925o4997J01709J64505n142k0640q9196m1263J12951R8952j41827
15164i8287n9865J47990J74060J7070r5862r3843L1609l3850O7215n745k6229
15153B4263l2696N2393K725l1646j5770Q7685J17560n1350j50779j20888p499
15142a26002k1964L843r390M5397p132n1408Q826o5361M6468L0201K361M5508
15130i8653n9875j11668J11086k1947p3480j8107N373J11100K3831n2581p265
15119a92186L3304K0766J9171J1898K4341M4458m64q2728L6384M110j6392j06467
15107b03805j35770R8594K40291N7095R770q5708j04593K2358J7173J27008K5224
$$ y = [-65189, -90700, -158590, -84230, -14219, -19053, -67641, 13198, 92502, -95956, -142303, -178671, -180414, -213339, -278336, -176627, -12122, -17264, -37904, -127100, -168363, -55412, 43540, -98287, -158152, -10162, 163898, 180968, 85106, -8737, 22872, -10978, 56237, 50492, 24263, -8433, 43960, 46685, 15039, -731, 86954, 204514, 153164, 2385, -118503, -126002, -147966, -144123, -153513, -108116, -115248, -166656, -157830, -223191, -176723, -146522, -144161, -98653, -158528, -270196, -159110, -181057, -254537, -272644, -267271, -156171, -132340, -184921, -192186, -158882, -138116, -118945, -107047, -82706, -38248, -38712, -121440, -85056, -80946, -97338, -203805, -339575, -240981, -690, 56405, 66175, -19533, -124126, -101768, -84595, 42413, 67637]
15096F7637o8165j29220O3526R4834m3987q9707l8473J8738j6298L539J18119
15085a9457L045n3138J3515j03243J0795J7297L3811j2122R4969N9405P2263n3306
15073F3834j47283m5707N4709P7963R4436R873P308r2286o5699k4980L6172q5368
15061a17028J7589J82269M5478M6555p8986j51000j0150L9011J1563J7405p704
15050d998K6568O3876K1983L2745n4335j30226k0581N0725j1866J1122l6347L9814
15038a1520j9456m4480K6522J7715q1684N8117M9570r3774j87767p3155J89651
15027a70261N8631j21227o6067R1158P3491n376R8679M2076k8026n3158n574M3002
15015d2652J4457p2471n8024Q4348R2093l3056O2056k0940M2795J223j00178q8203
$$ y = [67637, -528, -129748, -66222, 28612, -15375, -105082, -143555, -124817, -141115, -137576, -19457, -16412, -69550, -56035, -159278, -148483, -131186, -97375, -109497, -14528, 44877, 117140, 63834, -83449, -129156, -74447, 3516, 97952, 107825, 115133, 22847, -42852, -67832, -31660, -117028, -99439, 82830, 128308, 174863, 95877, -55123, -65273, -26262, -14699, 2706, -4998, 21570, 85446, 107429, 140174, 85839, -44387, -64968, -14243, -26109, -14987, -51334, -11520, -30976, -75456, -48934, -31219, -112903, -54786, -5216, -98990, -286757, -359912, -170261, -111630, -232857, -298924, -207766, -134275, -139651, -40972, 1104, -26922, -80080, -85654, -42652, -28195, -100666, -158690, -74342, 17751, -15305, 46751, 25811, 68606, 69829, -30349, -118552]
15003a18552K3745R5067j1265j94564m9030J16743J3565r3624M6453N1611N9646
14992f0205M081J15331j02827l4626Q2876l346l1615R9162L2279j8224Q253M5265
14980A36404l0513j43621j05881j48806L2004L0685p6431K6102K7044J38115Q5996
14969b8902m4288o9240m4945j8428O8948j7026j08321O3876J36234j0253k6461
14958i8806L1199k1098l5034L4791j4859l4551J32293l0347J51254Q4352o4328
14947A34866o4906o7035q3187L3859M0887O1065j03814q7285K0578K5857L7494
14936e1621o161M3583M1452j4718m2221o6057j38187k2686k9650J7314M227j7525
14924b82250L7030K0316O5333k8096M7653L4320L5230M4479J33174j19568j19810
$$ y = [-118552, -94807, 260, -11005, -205569, -254599, -137856, -124291, -217915, -171462, -119851, -60205, -56124, 59207, -43620, -78246, 4630, 1284, -30331, 68831, 101110, 82886, 91139, 136404, 105891, -37730, -143611, -292417, -260413, -229728, -306159, -280057, -253013, -114898, -28902, -73190, -142430, -187375, -205803, -136855, -153881, -262202, -198326, -62092, -72345, -98806, -67607, -88705, -123739, -88948, -103807, -138358, -6065, -36412, 114842, 199194, 134866, 69960, 2925, -80262, -46403, -5516, 55549, -48265, -135550, -114972, -89115, -51621, -57782, -14199, 27253, 12535, -29686, -95743, -233930, -256616, -286266, -268952, -264725, -282250, -245220, -224904, -159571, -187667, -140014, -105694, -70464, -25985, 107189, -12379, -132189]
14913a32189O6820N1884j9457o845j5738J5306M5595O8061M7239n0384l7973K0341
14901E2660r0577k1093l1409m3208P791J91109R9653m4267p4140j77816m7402
14890a78699K3460j6212N2428J2525o8150l1447K3349P5350K9372P966J15428
14879D5370J17993K2861j3218r9441o5976l0202p9498j08394j9442j2271K10185
14868c2033J35022k4456r7038j4904L4382l2033n5617N1329J00760j17529j5014
14857f7131J00064L4123K5261j882j80062r6140k4202n8386P3626K5681p3041
14846b42089O2855q609J2464J48417R0777r8489r7185M4288L7980Q5416j31603
14835i5778n7683j72081l6797J52854J36624M5738O8005n3737N8239N5622O455
$$ y = [-132189, -65369, -13485, -32942, -39787, -55525, -40219, 5376, 73437, 120676, 70292, 32319, 52660, -37917, -59010, -90419, -133627, -125836, 65273, 164926, 120659, 46519, -131297, -178699, -155239, -171451, -119023, -106498, -174648, -206095, -182746, -107396, -78024, -70058, 45370, 163363, 186224, 173006, 73565, 7589, -22613, -102111, -210505, -229947, -242218, -32033, 102989, 78533, -18505, -33409, 973, -31060, -86677, -35348, 65412, -52117, -67131, 32933, 67056, 92317, 90435, -89627, -185767, -209969, -268355, -194729, -169048, -242089, -179234, -187843, -175379, -26962, 63815, -34674, -131859, -87571, -49591, 35825, -95778, -153461, -325542, -362339, -209485, -72861, -27123, 40882, -12855, 45384, 101006, 107461]
14824A07461j34876j7896n3407N988q0679M1233O9979l2398o5960P6626J70143
14813H6214J03583p1304l403k6845n0277P9990j31231j32575J0372M6433p727
14802i6770N1523o62o3441k7914l8181L3844j2713Q7207N7145o0718n3875R8002
14790b6553j9381r1055M2286L7379J22856o6881J25321Q2350n568L3800r4732
14779A39822j19577p2056R7192J05859j1179j34947r1213n5118N6589M1411l5445
14768g8662j6020J56391O6355o7593n6093p6700M3451L8332j14038K33565M0141
14757A69129j01523p913j05161K5990K6558p3725P363j2290j4990L5729j08721
14746a59554r6329m5227n0704m0170J27639J71301J20512q927q3178n2560J28031
$$ y = [107461, -27415, -45311, -98718, -92730, -173409, -132176, -62197, -94595, -160555, -83929, 86214, 189797, 118493, 115090, 88245, 37968, 117958, -13273, -145848, -135476, -89043, -96770, -45247, -45909, -109350, -137264, -175445, -141601, -154314, -67107, -9962, -70680, -124555, -26553, -45934, -136989, -94703, -57324, 65532, -1349, 123972, 206322, 200754, 234554, 139822, 20245, -51811, 45381, 151240, 140061, 5114, -86099, -141217, -84628, -43217, -78662, -94682, 61709, 128064, 60471, 4378, -72322, -28871, 9461, -104577, 128988, 169129, 67606, 59693, -45468, -19478, 7080, -66645, -59282, -71572, -86562, -50833, -159554, -255883, -301110, -351814, -391984, -264345, -93044, 27468, 18541, -64637, -117197, 10834]
14735A0834L6797j33277q7605J2310P2380K2022j11250j012m8619j5701R9883
14724a43238N2993J28963j19133j79438k2616Q0219M6250R1236J8499J6333k7520
14713e7452L3869N8117l2970J5519k4666j14634m999P702j46030J4968L1854j8853
14701b37575P0393N2131J04947p1896j18589m4161M3780J19349O4479k1658n7368
14690i6168m7501O4367j6831O3966m6644j22783M6552O3499k9260l1060J12303
14679c9560M323m386n8468Q5963r323j8797J1792J7993M2197K4536n0466m4115
14667c8311j7154L1470J72476k908r7269n3967K9786k2480j0845R2277O5507l2708
14655A15874q8668r744L2142l4210j62754p1185j3823Q8448L9649K0879O9285
$$ y = [10834, 47631, -85646, -173251, -160941, -88561, -66539, -177789, -178801, -227420, -243121, -143238, -90245, 38718, -80415, -259853, -282469, -202250, -156000, -64764, -46265, -29932, -57452, -23583, 34534, 1564, 17083, -7583, -122217, -127216, -119514, -265544, -250576, -218722, -237575, -167182, -115051, -10104, -82000, -200589, -244750, -200970, -81621, -17142, -38800, -96168, -143669, -79302, -96133, -32167, -78811, -201594, -155042, -91543, -120803, -151863, -39560, -35237, -39623, -98091, -12128, -21451, -40248, -28456, -10463, 31734, 56270, 5804, -38311, -55465, -23995, 148481, 145573, 48304, -5663, 24123, 1643, -9202, 83075, 148582, 115874, 27206, 17462, 49604, 15394, -147360, -218545, -232368, -143920, -104271, -83392, -14107]
14644a4107l9132L5877O154K6414N3900q2699j17412m8030O2674N6443k3233o2796
14632a45947o8416J8529Q3377j456K3867L0008o8142j32063R4887N145r4897J3072
14620b42036J88561J2623j22439O6869J34166j9933k4538J2142L4760q1077P3441
14609C2539j4747o8352o6006o9173l2896m8763m701L5526Q7962O1946L3398P2979
14597A9712p7267j29268p6027L4623q058Q8896K225J72730N0748n2883m5088j31727
14585a51384j46562N9467L7131P4091L5881M5786Q1905j36999l1475L0221Q8736
14574a3202L1337q9265l1421k2346Q578K0805J1689O3967k3643Q6784K9530j18228
14562d5415q5123N558k6577P1046Lm6887K1251P2773J47029m51j70227j50037
$$ y = [-14107, -53239, -17362, -11208, 15206, 69106, -13593, -131005, -179035, -116361, -59918, -83151, -145947, -214363, -195834, -112457, -113913, -90046, -60038, -128180, -260243, -165356, -160211, -255108, -242036, -53475, -40852, -163291, -96422, 37744, 17811, -6727, 5415, 40175, -40902, 32539, 17792, -50560, -116566, -185739, -218635, -267398, -272099, -236573, -148611, -86665, -53267, 19712, -57555, -186823, -262850, -228227, -236285, -147389, -145164, 27566, 78314, 25431, -19657, -151384, -297946, -238479, -201348, -127257, -91376, -45590, 36315, -100684, -132159, -101938, -13202, 18135, -71130, -102551, -124897, -116319, -95514, -83825, -19858, -43501, 43283, 72813, -45415, -130538, -124980, -151557, -80511, -80508, -127395, -106144, -33371, 113658, 113207, -57020, -207057]
14550b07057J9601J04118O4875R0855j7749q4047Q32O2475o9862P4607K7759J9577
14538H5984j20049j54137K9934J60145J65962q683k0221n7827L3029n9373j13125
14527e8361N9918N7397k4632k1855O9280J3831j51318k2444n310l3120j9920M0008
14515i6526L1780N267J28336k649r8459p262o6483m1328m3814o4235M5946J09565
14503i9862P9046p4046k2520J28775n2712o6013k5096O6777J9394r3356P4461
14492f5152J2901o7136r7825R8524O5184o908j1612J11417J26139q3058l5433
14481D7041n6008l2313n3418l2454N1216N2942J42971M5979j37806J9501j2018
14470C5633J594k01k5875l6653J60326O3418J01869O7518m988j60002j73118N0362
$$ y = [-207057, -187456, -83338, -18463, 72392, 54643, -29404, -28572, 33903, -35959, 38648, 66407, 85984, -34065, -188202, -158268, 1877, 167839, 159156, 138935, 81108, 114137, 54764, -58361, 1557, 58954, 34322, 12467, 81747, 95578, -55740, -78184, -83494, -116614, -136534, -96526, -64746, -59479, 68857, 66208, -32251, -39513, -105996, -147324, -191138, -255373, -209427, -99862, -20816, -94862, -117382, 11393, -41319, -107332, -132428, -65651, -46257, -139613, -65152, -52251, -119387, -217212, -118688, -53504, -60412, -72024, 39393, 165532, 82474, 47041, -8967, -41280, -94698, -127152, -75936, -22994, 119977, 165956, 28150, 47651, 35633, 37227, 37026, 11151, -25502, 134824, 198242, 300111, 367629, 362641, 202639, 29521, 79883]
14458G9883J31324o4858K4365q1978j40327l9195L655n502n3063Q3097J57872
14447I5273P8173n8440j4771l062m6060r9913k528M6022k338q9342j27711p9939
14435c04636P5932J09486J6749j04177j5891J06485l7470p5916m1538O8022J2183
14424a90771O076J10974J13070r740o2901l4121k9695Q8891L9972j20023m3963
14413a32231K1049J4282N2723P2186O2589R4976p4006j36035m5253o941O5106
14402a1555J9434K6934r1000n2074O2980J71901L6900j73981j7004R6884j78306
14391a08887j05430J11338l2544Q4502M6423o9955j8288Q6826M2224J7722m4230
14380I701O1447O3126m8553p7875p0612K5570P7424l7013j06331j4888J2246k047
$$ y = [79883, 211207, 146349, 170714, 88736, -51591, -90786, -87131, -92633, -145696, -62599, 95273, 173446, 115006, 100235, 97173, 51113, -48800, -51328, -5306, -7644, -96986, -224697, -304636, -228704, -119218, -102469, -206646, -222537, -116052, -153522, -229438, -270976, -202954, -190771, -184695, -73721, 39349, 29609, -33292, -67413, -97108, -8217, 31755, -88268, -132231, -111182, -96900, -44177, 28009, 90598, 185574, 111568, -24467, -69720, -76661, -11555, 7879, 34813, -56187, -108261, -45281, 126620, 163520, -10461, -27465, 69419, -108887, -214317, -102979, -135523, -51021, -4598, -74553, -92841, -6015, 36209, 53931, 9701, 71148, 134274, 85721, 7846, -62766, -37196, 40228, 3215, -103116, -118004, -105758, -107805]
14368a07805K9175J945k9871J14955k4567j39179K8070J2081Q2660J97444n5958
14357A08950p8474m5604r0703p7258j816p424P9523K324j13662J48117J95245
14346A19218O0094Q2636Q0018j12745l4172j69760M4776O9366j0872L0519J5539
14335A74617j01476j05743N3493p7396o9461R2202J10409p573l2535R5022Q9501
14324B21060O3511m7965k02379l8861l7695P6270P5157p8918M9847J7933j50641
14313e2681n6178p8180P0010j117N6047J21886M1686n1139o4718L1922j6193r510
14301h165N2094O250N4522l9299j66084j60605l9470J44452J32158k3913K9600
14290a8460M4782K1729N1351J3450N3650j07860j42495q4897m3003j5152j8478
$$ y = [-107805, -78630, -76685, -106556, 8399, -16168, -155347, -127277, -115196, -32536, 164908, 108950, 30476, -15128, -105831, -183089, -184905, -192329, -112806, -110482, -224144, -76027, 119218, 179312, 261948, 341966, 229221, 195049, 25289, 70065, 139431, 128559, 159078, 174617, 73141, -32602, 20891, -56505, -125966, -33764, 76645, 69072, 36537, 131559, 221060, 284571, 236606, 34227, -4634, -42329, 33941, 109098, 30180, 80027, 97960, -52681, -108859, -187039, -117029, -118146, -62099, 59787, 101473, 50334, -14384, 17538, 1345, -8165, 43929, 50179, 104701, 65402, -100682, -261287, -300757, -156305, -24147, -48060, -18460, 26322, 48051, 99402, 112852, 166502, 58642, -83853, -168750, -211753, -226905, -245383]
14279b45383O6564L7703K7710N5530l5927j2516M1712O1315j3438l6136j50716
14268b03582M9257L0725P9197K1398L7723r2932L4326Q8907L0025j8643j31006
14257g4605o1152K204J20941Q0921K8466q902m1596M5463p4995N4346J37416L4500
14245B43007p0290j23058q5886Q1763P0576L4212k5933j30513j07113j53416n0417
14234c17068K4261K2950R125J01295Q76M3796R3761N1057n0803Q593N8064m6530
14222f23k6439J07509q1598q2043J1737p2983M2348J62878J28560R6534J7346
14211C03226j22367o2310K8303N9302q3156N6795J70760J9901q9061j90833n1665
14200C8895Q514k0015J14183j7984m5398R2654M5512l1333m4842q8609l4749K9694
$$ y = [-245383, -178819, -141116, -113406, -57876, -93803, -106319, -64607, -3292, -16730, -52866, -203582, -154325, -123600, -44403, -23005, 14718, -78214, -43888, 45019, 75044, 56401, -74605, -135757, -133553, -12612, 68309, 96775, 87873, 46277, 91740, 16745, 71091, 208507, 243007, 172717, 49659, -36227, 45536, 116112, 150324, 124391, -6122, -113235, -266651, -317068, -292807, -269857, -260732, -159437, -158561, -114765, -21004, 30053, -20750, -12157, 45907, -623, -27062, 80447, -1151, -83194, -71457, -144440, -102092, 60786, 189346, 285880, 303226, 180859, 118549, 146852, 206154, 122998, 179793, 350553, 370454, 281393, 90560, 38895, 47409, 27394, 141577, 123593, 78195, 170849, 216361, 185028, 140186, 51577, 16828, 46522]
14188D6522q848J8237P2186m7257r4010n714M7659R0817r9768n7998p1388r8212
14176b07774j7373N1586M23J13276N2370p5136o6458Q8584J18842R2666l4791
14165A16215q6003j46670p1610L187k2426Q0262J77721l4117m2242K3225j4391
14154a6849j74767R2738P3340k9477L6929P2040q6140m9170N0344j1088L475j0628
14142d9253j20079K119R2646n935j14710m0652M4028J5547J19425K7236j7260
14131d6888l3318q8763m0959P2707L8512M5890M6658m7071J7192N4627K4081N9158
14119A01826j21833k04756P9585K02105M5297m9114j28882n6345K1664K1351r7312
14108a86414j6431R5270J87184n920J9804p4024J01409N3949l9167m3652r5698
$$ y = [46522, 37674, 55911, 128097, 80840, -13170, -18884, 28775, 119592, 19824, -38174, -109562, -207774, -225147, -173561, -173138, -59862, -7492, -82628, -149086, -60502, 58340, 151006, 116215, 30212, -116458, -188068, -184881, -207307, -127045, 50676, 16559, -25683, -2458, -16849, -191616, -98878, -25538, -55015, -18086, 53954, -32186, -81356, -31012, -42100, -38625, -49253, -169332, -167213, -74567, -80502, -195212, -235864, -191836, -176289, -56864, -29628, -46888, -80206, -168969, -209928, -137221, -98709, -52819, -6161, -53232, -36040, 18587, 42668, 101826, -20007, -224763, -145178, 56927, 102224, 53110, -75772, -132117, -110453, -89102, -186414, -202845, -107575, 79609, 73689, 93493, 19469, 120878, 174827, 135660, 92008, -3690]
14097c690J7414k1134j4267o5876r3697j1113P9027O9433J31962n3861j29197
14086i4999Q398j8903k0005p1189j12885K3302J29069P7110M8114j12831j24973
14075b69792Q5967o7018r3460J02880J03913M3228l3629J01836O0218m8904l3992
14064d8753o722q3526m4816j2983J63740M8288o8168k8836L3346l0027p978o3854
14052a50289M3517J29929j0881L2404j2903q5239j7534P647O1174J24175L6599
14041A58599J16859k9616K2430m5418j6788l6572j00011n6510j10518k7668O9394
14030e5819N6128L978K7627N2821p0194l1168M7502j8915P2032J2163K6846m3259
14018G9742j37962j0178J167Q288J0551M9481L7100O6322j2693o7714p1716M6299
$$ y = [-3690, 13724, -7410, -21677, -87553, -181250, -192363, -113336, -43903, 88059, 34198, -94999, -86601, -105504, -125509, -196698, -309583, -286281, -157212, -80102, -31988, -144819, -269792, -183825, -250843, -344303, -241423, -137510, -94282, -127911, -26075, 34143, -14761, -48753, -55475, -139001, -183817, -196800, -33060, 15228, -52940, -81776, -48430, -78457, -86435, -150289, -106772, 23157, 12276, 44680, 31777, -53462, -70996, -63349, -2175, 122000, 158599, 275458, 245842, 268272, 222854, 206066, 169494, 69483, 12973, -97545, -125213, -55819, 309, 4287, 31914, 84735, 14541, -16627, 30875, 11960, 83992, 96155, 123001, 79742, -58220, -68398, -67231, -58943, -48392, 1089, 38189, 104511, 91818, 24104, -47612, -1313]
14006a313L4092n8114M8019j5731R4436N128R6858J969o0007K2253O7362p4311
13994A60641k590k9884q0745j67902j01365o360q378j3340K21140J49169Q993
13983A29379j29127j45708M4759N645Q6406N1645m0678P99o2302Q760O1568O822
13971A7968k7727l6207n8235M8380j489O3442J62193J0208j66908k4954o85j6033
13959c0047n0336j59748m3102P2589n86l9942L7812P0624P4742J54976M7242n692
13947A28532k8404l9859p3994j915L7234o8726n5124L6383n1414N162K7549o0949
13935a45525m2159m7060M4242R4371N8222K0115q7708j21646O2759K7898J07360
13924b9131N6581n6335J5101m1735Q6934M7110O9988O197j42290R208Q3573m2144
$$ y = [-1313, 32779, -25335, 22684, 6953, 101389, 106517, 203375, 205344, 145337, 167590, 234952, 160641, 158051, 128167, 47422, -120480, -221845, -228205, -236583, -249923, -28783, 120386, 129379, 252, -145456, -100697, -95052, -8646, 42999, 2321, 3120, -59182, -50422, 11146, 17968, -9759, -45966, -104201, -55821, -57310, 6132, 168325, 178533, 11625, -13329, -14014, -30047, -80383, -240131, -283233, -210644, -211230, -251172, -213360, -142736, -67994, 86982, 134224, 128532, 100128, 60269, -13725, -15640, 21594, -47132, -102256, -65873, -117287, -112125, -84576, -145525, -187684, -234744, -190502, -96131, -37909, -17794, -105502, -227148, -164389, -136491, -29131, 27450, -28885, -13784, -55519, 31415, 78525, 148513, 154710, 12420, 21628, 105201, 63057]
13912F3057Q688J9459L7030J5703O3765K8281j00379j6281l7211Q453O151N8691
13900A55407j25165l6262p715J11526r5897o3674M5835J06766N4040p993m6769
13889I0099N5805q6927j89000M3210P1192L9695j3050m7282k3043j13761q1244
13878b54306Q9339K3043J27380J24451l4669j04134r0048q3954M1130o3323o970
13867b32061L7774N0303J06664J19098o7223l1514m9104m9797l8518P2928L8487
13856d2963j7642O3264M4581p1421n7907M7806R2839J6412m9499M9829l0359p0575
13844b5635K8777k2258r6095M3633p802J06989k0497m9550q8012l471J62570l1939
13832c290j59680L1663J17338N5010n5772l3616O0224N3645M3761K1066j10031
$$ y = [63057, 71745, 91204, 128234, 143937, 207702, 235983, 135604, 119323, 82112, 90565, 96716, 155407, 30242, -6020, -13735, 97791, 1894, -61780, -15945, 90821, 144861, 136868, 90099, 145904, 58977, -130023, -86813, -15621, 24074, 11024, -36258, -59301, -173062, -254306, -164967, -141924, -14544, 109907, 75238, -28896, -118944, -202898, -161768, -225091, -232061, -194287, -143984, -37320, 81778, 14555, -16959, -66063, -115860, -154378, -81450, -42963, -60605, 2659, 47240, -24181, -82088, -34282, 58557, 74969, 25470, 75299, 44940, -25635, 3142, -19116, -115211, -71578, -79380, 27609, 7112, -42438, -130450, -133921, 28649, -3290, -162970, -131307, -13969, 41041, -14731, -48347, 11877, 65522, 109283, 130349, 20318]
13821B0318j48769N6824k3528J6112J31534R2641J4116l225J1080L8185j8838
13810A86450m0607j7827n5443p8109M0934k9525q2800k4947N1282m7706l8450
13799a36748J50305L9015p3012N2299M5215k8902L8080j50391o9024M6086R1928
13788D851R6823J5811j9263j24195k1116N6475N485o9491M8744K5977J7284J7542
13776E4927l9330n2140K4749l013J08556R4387q3867j28027L3242Q4101k5638
13765F7947J4732l0284L4547J01730l5436q4050q066m5604j1949m4014j4197R82
13753e3662l6328r4142k4193L2749P5691J51132p88L684J29694r894p5752r2098
13741F093J01716J3045k2055o4236O3908M732k16866j10979J12691R679l5752
$$ y = [20318, -128451, -71627, -95155, -79043, 52491, 145132, 159248, 156023, 167103, 205288, 186450, 145843, 128016, 72573, -5536, 35398, 5873, -76927, -101874, -50592, -98298, -136748, 13557, 52572, -20440, 31859, 77074, 48172, 86252, -64139, -133163, -87077, 4851, 101674, 117485, 98222, -25973, -47089, 9386, 14871, -54620, -5876, 20101, 37385, 54927, 15597, -36543, -11794, -14807, 93749, 188136, 104269, -23758, 9484, 93585, 67947, 82679, 52395, 86942, 188672, 153236, 69186, 61120, 15516, 3567, -40447, -54644, -53662, -89990, -184132, -208325, -175576, -99885, 51247, 50459, 54143, 183837, 173943, 98191, 6093, 107809, 120854, 98799, 34563, 98471, 103203, -113663, -224642, -111951, -102272, -138024]
13730a38024P3521j8525J31100K3248J06263m5664j56383m0667Q1065J3349l3245
13719c962K2994j5713Q4000P278q8931K4785K5351k4503M2607p154p5183j01401
13707a09832N3991L923Q7630N9691m9661J22729k6245r0567j713M0883K5427J38174
13695B54430q7563r8286m6716J1004J22033j03162r2911N6075J9060R2527K0501
13684A46992k05560j30707L5644J26l552L2856q1367N4944M0421J06578P995o7984
13672f3614N6524J4991r776J7748j9904j25788n1996J4938M339l1853l71J16098
13660g8664p1149K6743N7283m483r970J11951J8007J9309M0111J6475j03444m2573
13648b0404j3010J9045J06975m4038j38932p5864J04784J25282R975k30380q3056
$$ y = [-138024, -64503, -83028, 48072, 71320, 177583, 131919, -24464, -65131, 15934, 29283, -3962, 19032, 3319, 87319, 94597, 5666, 30451, 55802, 31299, 73906, 66752, -8431, -109832, -55841, -51918, 35712, 95403, 45742, 168471, 142226, 51659, 49946, 90829, 116256, 254430, 166867, 68581, 21865, 32869, 154902, 51740, -41171, 14904, 33964, 126491, 146992, -58568, -189275, -153631, -153505, -157057, -124201, -205568, -150624, -110203, -3625, 4370, -63614, -7090, 7901, -1875, 15873, -4031, -129819, -181815, -166877, -162538, -194391, -194762, -78664, -149813, -123070, -65787, -70270, -80240, 31711, 49718, 69027, 109138, 125613, 22169, -20404, -33414, -14369, 92606, 48568, -90364, -166228, -61444, 63838, 73813, -156567, -239623]
13637b39623R3449m7602O2120K2211L2077M1949J29118o7678q7438J11207N7630
13626A07420l185M903j13740k9087n1130j9132P3264L3009K8137J13436n0577
13615I3318k43112j67335O045K50236K28435m5614n0709K1922q1560J3876n2025
13604b6523J03776r940p6237R0413L6898p4266Q4674l5449L1617n248j4170k3645
13592H1900q805o3987j9301j56251j32574o4887m8124Q7971J05479J34768J06194
13581B2383n6764l8494L2038p8049n8445N5575m949j1369J37496J96295O2281
13570B57998j71885q8540k6694J17222Q5396K481p7961p6056M8431o0636P2691
13559H2447Q5839m5564r6892j98109J4045J2366M9497J15639M1825L1985J3952
$$ y = [-239623, -146174, -193776, -131656, -109445, -77368, -35419, 93699, 26021, -61417, 49790, 107420, 104235, 109138, -4602, -33689, -84819, -103951, -30687, 2322, 30459, 143895, 93318, -149794, -317129, -311084, -60848, 167587, 121973, 71264, 93186, 11626, 25502, -26523, 77253, 67313, -8924, 81489, 118387, 44121, 128795, 93346, 124963, 119715, 105545, 81900, 73095, 9108, -10193, -166444, -299018, -363905, -412029, -324058, -218579, -83811, 22383, -34381, -72875, -40837, -118886, -177331, -121756, -126705, -138074, -578, 195717, 257998, 86113, -2427, -29121, 88101, 173497, 175978, 98017, 21961, 70392, 9756, 82447, 168286, 122722, 25830, -172279, -158234, -145868, -96371, 19268, 61093, 93078, 107030]
13548A07030L2191n1738l206k5186n0208J4953K4072q2544J76670M8818k8955
13537A61897n4880o8802q9665k9485P0058k471O868k0251j10463J5976J16980
13526d238L7366P4827M2252j17191J1529N6166N0113R055k01418p1397m9307J02659
13514e9584J02478N1018Q182j37980p5280M5889Q3899l7602o7147o7098L0158
13503a23067J46051K4445l2032n7993r743n0896N5478O5919q232l4041k4735N9049
13491A0203k680N8773n8826k0864q5969J21303R935k9838o3247j8748M5564P7500
13479D3106M6723o6290Q991k5163j31515L564P083Q4331J16520J1803p059l0215
13467F1879l7749m2815k2121k0109j18423L12P7555p0025K2577P7844N4617q2255
$$ y = [107030, 139221, 87483, 84277, 59091, 8883, 23836, 47908, -34636, 142034, 190852, 161897, 107017, 38215, -51450, -80935, -10877, -13348, -6480, -26731, -137194, -121218, -4238, 33128, 107955, 150207, 33016, 44545, 100711, 150824, 159879, -41539, -112936, -162243, -59584, 42894, 93912, 102094, -35886, -111166, -65277, 18622, -18980, -86127, -153225, -123067, 22984, 47429, 15397, -42596, -52339, -103235, -47757, 18162, 9930, -24111, -48846, 10203, 7523, 66296, 7470, -13394, -99363, 21940, 31875, 2037, -61210, -79958, -34394, 43106, 89829, 23539, 32530, 7367, -124148, -120584, -113501, -29170, 87350, 99153, 92094, 61879, 24130, -18685, -40806, -60915, -179338, -179026, -101471, -171496, -148919, -71075, -16458, -98713]
13455i8713n568l4869j5015N9124K6566j0330R1551J9194m7293N29Q456j03060
13443a09428n2173o1183l2354J8894R8030j4143r939k2587J22671N5390P464m9940
13431d9298M2358K2479n3570j05815J2031K7519O2172l9623O1919J24200k4873
13420G9499j2667L9844q9989m9608N915J07833M7538J6919j02492p021j24966
13409h9195p3086K4004l139J02770l6904j22652L0308O3887P2644P9794j6951
13398C1480J4496L3969j5524m3408R574n5613K1211M8507q4580j3838n2389L2406
13386g3709P8620P0677m4328j26586n0026L8693M0701M3364q6022L5170o0081
13375a33527M8588j3648R7855j1403j1726m5471J4678L2374p4136l5879M3184
$$ y = [-98713, -104281, -139150, -154165, -95041, -68475, -78805, 12746, 31940, -15353, -14824, -6368, -109428, -161601, -222784, -255138, -236244, -138214, -152357, -162296, -184883, -62212, -6822, 642, -49298, -6940, 15539, -38031, -143846, -131815, -104296, -42124, -81747, -19828, 104372, 79499, 66832, 106676, 16687, -32921, -27006, 80827, 128365, 145284, 42792, 35771, -89195, -162281, -138277, -141416, -38646, -75550, -198202, -167894, -104007, -31363, 48431, 31480, 45976, 79945, 64421, 21013, 30587, -25026, -3815, 44692, -39888, -53726, -106115, -73709, 4911, 75588, 31260, -95326, -145352, -106659, -65958, -22594, -108616, -73446, -133527, -84939, -98587, -732, -12135, -23861, -69332, -54654, -22280, -96416, -132295, -89111]
13364h9111K0282J09939O2946l34n5394p5085J07553p9802r4177k2708O2893Q4887
13352C1889K1912q3482r660l8892N8490j7285m6061j2648j2843j8453K2097m2698
13340a47634m0186j45332P8149L1221j11300P7203J36191j1713m3668P6821N4157
13329d6091m1725n521m186m3288p7614K9738J0106j44613K4697K2766J55450L9154
13317h1127r6290K9834O0217P1048k0310L2111L5625m5453r2071K043R9627j635
13305f381k7203r0169r6399M4752P0276M1864o3910j09078L5713N5120k1309O9328
13293i7396J53694J32982M9686R608R626n5756o9086N405q0473l9462k8587k9349
13281c9108m037n4047L8427M506q630k3746M3346Q7642j3095j44625L1427k7818
$$ y = [-89111, -68829, 41110, 104056, 103722, 48328, -26757, 80796, 994, -93183, -115891, -52998, 31889, 53801, -29681, -39341, -78233, -19743, -37028, -83089, -95737, -108580, -127033, -104936, -147634, -187820, -333152, -255003, -223782, -335082, -257879, -121688, -133401, -177069, -100248, -46091, -87816, -93337, -97523, -140811, -218425, -188687, -178581, -323194, -298497, -275731, -120281, -81127, -177417, -147583, -87366, -16318, -36628, -4517, 31108, -14345, -106416, -104373, -4746, -6381, -33584, -123753, -220152, -175400, -105124, -63260, -127170, -236248, -200535, -145415, -166724, -97396, 56298, 189280, 238966, 248574, 258200, 202444, 133358, 138763, 58290, 18828, -9759, -39108, -43145, -97192, -58765, -54259, -62889, -86635, -43289, 44353, 31258, -113367, -81940, -109758]
13269a09758J5540n492R68j6494k1436m9378J6073L6070j01254j1046J07745P7183
13257f1279K3170n8111q566n0050P6J8496l0958N31O0659k9180J1760R8340J3532
13244a1580m5565Q4189O0549N24L2655m8968j25046K6593M299O2693p4294j29779
13232a63730J07369O1697J5473p3851J3566J17880o1192o1396M1059M2312K2055
13221F1242m6631P1211J43282j5403p2446j26865p5836l7046R8456O0834j29660
13210f8862m3723J39208K2849j01614p5522J6206n1718M4736m944J5664m2480
13199a50200k4779J3351O9848J21930K7735M2141j4735K7839K1393j8420k1388
13188I4715j00251r0597L2654P1266m1160q7279N2790M2065k2244J39791O3052
$$ y = [-109758, -94218, -99710, -98742, -115236, -136672, -186050, -169977, -133907, -235161, -246207, -138462, -61279, -38109, -96220, -104786, -154836, -154760, -136264, -167222, -166691, -106032, -135212, -123452, -25112, -11580, -57145, 27044, 87593, 88117, 120772, 71804, -53242, -26649, -22350, 40343, -33951, -163730, -56361, 5336, 20809, -53042, -39476, 78404, 17212, -44184, -3125, 39187, 61242, 14611, 85822, 229104, 213701, 141255, 14390, -61446, -98492, -36, 60798, -68862, -112585, 26623, 49472, -52142, -127664, -111458, -163176, -118440, -123384, -107720, -150200, -174979, -161628, -91780, 30150, 57885, 100026, 85291, 113130, 134523, 116103, 94715, -5536, -96133, -63479, 7787, -33373, -120652, -67862, -25797, -48041, 91750, 154802]
13177A54802R6836q8790k48390j44225J3033J15032L0108L0610J04356J07294
13167A70666K4153q6367o7205o0451l3775N0521q688l5080P167L969l3947n0654
13155a19691Q1758R0761Q0174p2664j15476K4436L3011J68267K71820P3367j33747
13144C82016r8558l314p0634j23494j22250K0537M9662j83631P5064J70365j15175
13133a9412j01595o338L37Q3324k8468J6136R2162M0864J538L427J11702R4981
13121B88658o2636j6204n5907N760K9499k8483J18938J38455R1957M7608j32252
$$ y = [154802, 251638, 162848, -85542, -229767, -216734, -101702, -71594, -40984, 63372, 170666, 194819, 108452, 41247, -19204, -52979, -2458, -11146, -46226, -39059, -35090, -69037, -119691, -37933, 52828, 133002, 60338, -55138, -30702, 2309, 170576, 442396, 515763, 382016, 283458, 280144, 209510, 86016, -36234, -15697, 33965, -149666, -74602, 95763, -19412, -121007, -127345, -127008, -43684, -72152, -56016, 36146, 77010, 78548, 81975, 193677, 288658, 226022, 209818, 153911, 159671, 189170, 160687, 279625, 418080, 510037, 557645, 425393]
$$ [...]
##END NTUPLES=NMR SPECTRUM
##END=
