##TITLE=Analysis number 327618
Compound Code btb 03828
Book Reference 12666
Project Code adrs flro3
Chemist Name jom
##JCAMPDX= 6.0         $$ Bruker NMR JCAMP-DX V2.0
##DATA TYPE= NMR SPECTRUM
##DATA CLASS= NTUPLES
##ORIGIN= Bruker BioSpin GmbH
##OWNER= nmr
$$ XWIN-NMR		Version 3.5
$$ Wed Mar 28 10:00:15 2007 GMT Daylight Time (UT+1h)  MAYBRIDGE\nmr@NMR_250MHZ
##.OBSERVE FREQUENCY= 250.131544655141
##.OBSERVE NUCLEUS= ^1H
##.ACQUISITION MODE= SIMULTANEOUS (DQD)
##.ACQUISITION SCHEME= undefined
##.AVERAGES= 16
##.DIGITISER RES= 18
##SPECTROMETER/DATA SYSTEM= dpx250
##.PULSE SEQUENCE= zg30
##.SOLVENT NAME= CDCl3
##.SHIFT REFERENCE= (INTERNAL, CDCl3, 0, 16.522)
##AUDIT TRAIL= $$ (NUMBER, WHEN, WHO, WHERE, WHAT)
$$ ##TITLE= Audit trail, XWIN-NMR		Version 3.5
$$ ##JCAMPDX= 5.01
$$ ##ORIGIN= Bruker BioSpin GmbH
$$ ##OWNER= nmr
$$ C:\u/data/dgb/nmr/ADRS/2390/pdata/1/auditp.txt
$$ ##AUDIT TRAIL=  $$ (NUMBER, WHEN, WHO, WHERE, WHAT)
(   1,<2007-03-28 09:59:53.45 +100>,<MAYBRIDGE\nmr>,<NMR_250MHZ>,
      <created by zg, POWCHK disabled, PULCHK disabled
       configuration hash MD5:
       49 4B E0 1D 92 C2 6B 37 9F E6 65 BC 52 41 86 1D
       data hash MD5: 64K
       4E D4 24 A2 BB 78 E6 7C 7A 15 94 E9 70 A1 C0 F3>)
(   2,<2007-03-28 10:00:05.73 +100>,<MAYBRIDGE\nmr>,<NMR_250MHZ>,
      <Start of raw data processing
       ef LB = 0.3 FT_mod = 6 PKNL = 1 SI = 32K 
       data hash MD5: 32K
       FE B9 BF 9D B0 E5 BC 14 BA 14 C9 64 94 8B E6 85>)
(   3,<2007-03-28 10:00:07.36 +100>,<MAYBRIDGE\nmr>,<NMR_250MHZ>,
      <apk 
       data hash MD5: 32K
       42 71 F7 25 C4 FA BE 02 E1 DD EC A7 A2 76 DA D9>)
(   4,<2007-03-28 10:00:08.09 +100>,<MAYBRIDGE\nmr>,<NMR_250MHZ>,
      <abs ABSG = 5 
       data hash MD5: 32K
       C4 29 5A A0 42 AF CA 14 D3 C7 2A 84 94 46 1C 27>)
$$ ##END=
$$ 
$$ hash MD5
$$ 8E FB 1D 14 4B A6 64 EA A5 AF 37 25 70 59 A4 20
##$RELAX= 
##$RELAX= 
##$RELAX= 
##$RELAX= 
##$RELAX= 
##$RELAX= 
##$RELAX= 
$$ Bruker specific parameters
$$ --------------------------
##$DU= <C:\u>
##$EXPNO= 2390
##$NAME= <ADRS>
##$PROCNO= 1
##$TYPE= <nmr>
##$USER= <dgb>
##$AMP= (0..31)
100 100 100 100 100 100 100 100 100 100 100 100 100 100 100 100 100 100 
100 100 100 100 100 100 100 100 100 100 100 100 100 100 
##$AQSEQ= 0
##$AQ_mod= 3
##$AUNM= <au_zg>
##$AUTOPOS= <5 >
##$BF1= 250.13
##$BF2= 250.13
##$BF3= 250.13
##$BF4= 250.13
##$BF5= 500.13
##$BF6= 500.13
##$BF7= 500.13
##$BF8= 500.13
##$BYTORDA= 1
##$CFDGTYP= 0
##$CFRGTYP= 5
##$CHEMSTR= <none>
##$CNST= (0..31)
1 1 145 1 1 1 1 1 1 1 1 1 1 1 1 1 1 1 1 1 1 1 1 1 1 1 1 1 1 1 1 1 
##$CPDPRG= <>
##$CPDPRG1= <>
##$CPDPRG2= <>
##$CPDPRG3= <>
##$CPDPRG4= <mlev>
##$CPDPRG5= <mlev>
##$CPDPRG6= <mlev>
##$CPDPRG7= <mlev>
##$CPDPRG8= <mlev>
##$CPDPRGB= <>
##$CPDPRGT= <>
##$D= (0..31)
0 1 0 0 0 0 0 0 0 0.06 0 0 0 0 0 0 0.0002 0 0 0 0 0 0 0 0 0 0 0 0 0 0 
0 
##$DATE= 1175072392
##$DBL= (0..7)
120 120 120 120 120 120 120 120 
##$DBP= (0..7)
150 150 150 150 150 150 150 150 
##$DBP07= 0
##$DBPNAM0= <>
##$DBPNAM1= <>
$$ [...]
##$SUBNAM7= <"">
##$SUBNAM8= <"">
##$SUBNAM9= <"">
##$SW= 20.6930455092707
##$SWIBOX= (0..15)
0 0 3 0 0 0 0 0 0 0 0 0 0 0 0 0 
##$SW_h= 5175.983436853
##$TD= 65536
##$TD0= 1
##$TE= 683.16
##$TE2= 300
##$TE3= 300
##$TEG= 300
##$TL= (0..7)
0 120 120 120 120 120 120 120 
##$TP= (0..7)
150 150 150 150 150 150 150 150 
##$TP07= 0
##$TPNAME0= <>
##$TPNAME1= <>
##$TPNAME2= <>
##$TPNAME3= <>
##$TPNAME4= <>
##$TPNAME5= <>
##$TPNAME6= <>
##$TPNAME7= <>
##$TPOAL= (0..7)
0.5 0.5 0.5 0.5 0.5 0.5 0.5 0.5 
##$TPOFFS= (0..7)
0 0 0 0 0 0 0 0 
##$TUNHIN= 0
##$TUNHOUT= 0
##$TUNXOUT= 0
##$USERA1= <user>
##$USERA2= <user>
##$USERA3= <user>
##$USERA4= <user>
##$USERA5= <user>
##$V9= 5
##$VALIST= <valist>
##$VCLIST= <CCCCCCCCCCCCCCC>
##$VD= 0
##$VDLIST= <DDDDDDDDDDDDDDD>
##$VPLIST= <PPPPPPPPPPPPPPP>
##$VTLIST= <TTTTTTTTTTTTTTT>
##$WBST= 1024
##$WBSW= 4
##$XGAIN= (0..3)
0 0 0 0 
##$XL= 0
##$YL= 0
##$YMAX_a= 237409
##$YMIN_a= -297638
##$ZGOPTNS= <>
##$ZL1= 120
##$ZL2= 120
##$ZL3= 120
##$ZL4= 120
##$ABSF1= 16.522
##$ABSF2= -4.171173
##$ABSG= 5
##$ABSL= 3
##$ALPHA= 0
##$AQORDER= 0
##$ASSFAC= 0
##$ASSFACI= 0
##$ASSFACX= 0
##$ASSWID= 0
##$AUNMP= <proc_1d>
##$AZFE= 0.1
##$AZFW= 0.1
##$BCFW= 0
##$BC_mod= 0
##$BYTORDP= 0
##$COROFFS= 0
##$CY= 12.5
##$DATMOD= 1
##$DC= 0
##$DFILT= <>
##$DTYPP= 0
##$F1P= 14.0000005364418
##$F2P= -0.99999901652339
##$FCOR= 0.5
##$FTSIZE= 32768
##$FT_mod= 6
##$GAMMA= 0
##$GB= 0
##$INTBC= 1
##$INTSCL= 1
##$ISEN= 128
##$LB= 0.3
##$LEV0= 0
##$LPBIN= 0
##$MAXI= 10000
##$MC2= 0
##$MEAN= 0
##$ME_mod= 0
##$MI= 0
##$NCOEF= 0
##$NC_proc= -5
##$NLEV= 6
##$NOISF1= 0
##$NOISF2= 0
##$NSP= 0
##$NTH_PI= 0
##$NZP= 0
##$OFFSET= 16.522
##$PC= 1
##$PHC0= 229.7042
##$PHC1= 16.74694
##$PH_mod= 1
##$PKNL= yes
##$PPARMOD= 0
##$PSCAL= 4
##$PSIGN= 0
##$REVERSE= no
##$SF= 250.13
##$SI= 32768
##$SIGF1= 0
##$SIGF2= 0
##$SINO= 400
##$SIOLD= 32768
##$SREGLST= <1H.CDCl3>
##$SSB= 0
##$STSI= 32768
##$STSR= 0
##$SW_p= 5175.98343685301
##$SYMM= 0
##$S_DEV= 0
##$TDeff= 65536
##$TDoff= 0
##$TI= <Analysis number 999999
Compound Code 99
Book Reference 9
Project Code 9>
##$TILT= no
##$TM1= 0
##$TM2= 0
##$TOPLEV= 0
##$USERP1= <user>
##$USERP2= <user>
##$USERP3= <user>
##$USERP4= <user>
##$USERP5= <user>
##$WDW= 1
##$XDIM= 32768
##$YMAX_p= 437657913
##$YMIN_p= -611855
$$ End of Bruker specific parameters
$$ ---------------------------------
##NTUPLES= NMR SPECTRUM
##VAR_NAME=  FREQUENCY,     SPECTRUM/REAL,   SPECTRUM/IMAG
##SYMBOL=    X,             R,               I
##VAR_TYPE=  INDEPENDENT,   DEPENDENT,       DEPENDENT
##VAR_FORM=  AFFN,          ASDF,            ASDF
##VAR_DIM=   32768,         32768,           32768
##UNITS=     HZ,            ARBITRARY UNITS, ARBITRARY UNITS
##FACTOR=    0.157963299565203, 1,           1
##FIRST=     4132.6476996994, 0,             0
##LAST=      -1043.33573715361, 0,           0
##MIN=       -1043.33573715361, -611855,     0
##MAX=       4132.6476996994, 437657913,     0
$$ Real data points
##PAGE= N=1
##DATA TABLE= (X++(R..R)), XYDATA
$$ [...]
27567 -4324 78902 100152 47859 102913 -8934 24789 -74699 -133016 -80584 62379 298116
27556 298116 384170 208952 132922 104478 151212 57383 -78494 -157549 -31092 -63352 -111354
27545 -111354 -166744 -294276 -108837 5324 -200699 -348746 -235126 52922 241233 189340
27535 189340 219698 272274 212922 20973 -93265 -212678 -111781 17349 99733 116043
27525 116043 111285 119720 152754 183106 110619 -36733 -178267 -122764 -16809 43637 124753
27514 124753 181788 -97238 -240239 -240137 -186227 -110717 -111381 -65745 -309 130211 123902 33161
27502 33161 -36684 -118632 -296931 -72794 73292 -63858 -198245 -188416 -19731 -27916 -60878
27491 -60878 -49104 -21337 -50225 -98345 -117541 -247418 -230289 -145215 54653 85662 -13692
27480 -13692 -95886 -142047 -196599 -304251 -256431 -243986 -211710 -166472 15691 50731 -44990
27469 -44990 49652 198312 125546 29872 -225902 -195308 -55669 -2990 143795 162117 35820
27458 35820 -7009 -10774 -36259 -74180 -83199 -150044 -130290 -35449 8797 80858 -8897 -100927
27446 -100927 -37922 -233237 -116810 32942 46113 -39283 -76210 13868 33319 -124673 -133316
27435 -133316 -187059 -209917 -164799 -106701 -156896 -138687 -165788 -290189 -111622 94235 125415
27424 125415 288249 517336 559304 438347 236370 238517 105960 -16810 -27147 -67145
27414 -67145 -7358 -15463 64661 -6684 -96149 -110668 112827 230405 387333 358666 325889
27403 325889 378057 244719 138373 150368 87263 135196 20754 -116738 -16838 29894 138333
27392 138333 163591 -59222 -186995 -89415 48905 -93207 -71559 -162796 -181618 -248918 -133053
27381 -133053 -145997 -217095 -260887 -204214 -152283 -74631 -26219 -58845 -36076 -67097 -160973
27370 -160973 -146347 -80599 -3017 83248 143225 436283 403192 158940 18331 -75623 -67514
27359 -67514 -53873 28232 155742 170778 185784 208768 492587 431340 215210 160983 28692
27348 28692 -230984 -219425 -196409 -106076 -72546 -90066 17568 -39783 -109192 -74419 164101
27337 164101 257977 296070 273787 207710 56099 26699 26101 -47863 2789 127357 66978
27326 66978 -162978 -285769 -129546 -81582 -240163 -213789 -75758 -56829 45464 97751
27316 97751 163214 152175 -1913 -16415 86847 164360 215940 148026 141232 17844 -49675
27305 -49675 -42196 -82187 53996 -32790 -88253 -102824 -7998 -85155 -110472 -82118 -80642 53256
27293 53256 160251 192945 163483 -63040 -8380 105577 161358 139621 -96099 -161893 -334908
27282 -334908 -359709 -130719 -108648 26471 113309 164997 44932 12790 99070 56069 -109570
27271 -109570 -54182 -1645 45556 122001 209464 301141 178009 70867 -11861 -143743 -122931
27260 -122931 -45858 65303 49742 7568 53648 175667 145196 -22082 15639 139823 94494
27249 94494 72656 103451 178110 275999 173917 -32873 -56457 88906 8849 -99319 -185056
27238 -185056 -74512 -99004 15567 127253 88208 20891 -84730 42001 -29580 -159248
27228 -159248 -213549 -119110 -185096 -141341 -47007 -132237 -30601 129189 182143 92971 34503
27217 34503 106358 9176 97773 71353 -59457 -84986 -212185 -133977 -46215 -87830 -149712
27206 -149712 -120205 -127856 -225048 -245964 -170255 -3572 7071 -27928 133786 111573 31952
27195 31952 -82648 -322254 -271598 -179365 -196251 -251520 -170740 -198527 -96229 36235 113503
27184 113503 -101055 -22255 254583 240546 136467 80491 127542 189147 100929 2747 33303
27173 33303 122596 89005 56502 2937 4399 -91346 -62849 -107610 -172290 -120457 -138604 -58990
27161 -58990 96290 151418 -104014 -69432 32278 61175 90191 199551 157227 89849 155851
27150 155851 259303 252443 60926 48466 59706 -71445 -26084 -17334 -76157 -47646 -114040
27139 -114040 -53829 192699 211061 -33612 -88140 20870 -99034 10021 40316 74160
27129 74160 -13680 21280 119846 50602 -25685 -134542 -226196 -225458 -152237 -219184 -281752 -301612
27117 -301612 -242277 -184601 -95655 40048 93634 139620 84562 88332 66254 98692 96687 146308
27105 146308 43437 21628 104361 69209 166755 185868 -4297 -52295 -100067 31585 141322
27094 141322 193938 133409 86363 191982 299184 231179 127765 -30121 -88465 90887
27084 90887 131149 251534 144466 173170 201825 72857 104847 7822 -123174 -22590 77907
27073 77907 136896 50010 110159 184308 296731 262517 130178 -3685 34455 -59305 -189796
27062 -189796 -137504 67561 144890 172331 250766 285666 165488 1526 -57575 4312 139341
27051 139341 190919 255149 224873 78674 122479 29900 -73589 -237825 -232933 -285148 -294617
27040 -294617 -171364 118058 133870 39249 28170 -156712 -278609 -194699 -66061 -37055
27030 -37055 -101759 -199138 -135842 12632 182825 24708 -81169 73549 69740 124264 122180
27019 122180 20152 -29915 100393 -6964 -18625 29605 40826 -98134 -3990 19730 90020
27008 90020 48047 -402 98563 111540 134125 142999 195298 188031 129358 122704 211289 221458
26996 221458 193504 252918 157163 140436 267015 239433 242147 202302 98761 74753 -36404
26985 -36404 -37731 -62923 -42625 100926 200684 110288 68482 6299 -105222 -82537 -36722
26974 -36722 -129875 -86772 -22746 130452 171911 149479 63167 -75032 -218739 -303140 -414687
26963 -414687 -184371 -169997 20614 235643 128184 -33214 -59307 72385 42602 43880
26953 43880 -180866 -376081 -260927 -179065 57631 116171 46553 128791 115712 -77511 -34166
26942 -34166 -23437 18221 104315 171916 188111 182222 63018 62328 101743 98890 58978 87257
26930 87257 270706 213575 175516 32224 3005 47022 717 -93289 -59773 113635 5703
26919 5703 -156739 -73722 71157 254873 117575 -32212 -64508 -48956 53643 117633 40072
26908 40072 -52418 8266 133461 106079 90973 8606 -84543 -122550 -251317 -242866 -30411
26897 -30411 2294 -56910 -202824 -266865 -279289 -164689 -171838 -189154 -123166 -54425 77127
26886 77127 41234 46192 -55554 -42973 -23959 -109850 -90336 65269 9503 -40935 -110559
26875 -110559 -200904 -87730 -102462 -195386 -282808 -243868 -213480 -151756 -206673 -1225 -34926
26864 -34926 205838 556552 479331 266644 124401 60524 -21503 -20839 -47388 114511 232324
26853 232324 250011 247106 273848 81832 -118512 -155915 25662 121160 198750 174396 306345
26842 306345 233316 84192 57388 312804 392491 279948 185910 82657 45184 47976 -15200
26831 -15200 -91203 -185086 -216142 7554 39898 -29311 38487 75468 102068 -55747 -164669
26820 -164669 -89890 -121127 -210619 -266743 -133896 88079 224705 199130 156171 51965 103176
26809 103176 284792 228574 -101276 -290404 -321243 -211701 -157483 -32802 61286 -110087
26799 -110087 -47474 -35848 -5149 82834 170319 224697 179556 169509 142813 101206 40368
26788 40368 50615 25543 67657 81301 -27383 -73821 68148 134260 5613 34544 -42693
26777 -42693 -72543 -1355 38666 179691 84874 -31764 -54099 -190986 -96482 76750 123812
26766 123812 92414 44341 107243 143989 141541 118363 39671 -27209 -77979 -29705 -89601 -67912
26754 -67912 60237 -22042 -149041 -121317 -100226 -181161 -91671 18141 147311 182954 84274
26743 84274 -14988 22589 138634 179696 60133 -54543 -85483 -68662 99520 218742 222212
26732 222212 214988 160083 221399 260419 154351 82138 -75698 108260 282403 269240 225235
26721 225235 243624 105057 -123359 -279077 -331257 -300873 -186168 -92465 -226620 -191133
26711 -191133 -142191 -39532 -30484 80586 98377 14971 38127 68043 148012 179945 93281
26700 93281 91202 71035 69086 60989 -10045 -101399 -251316 -125323 82034 242070 155121
26689 155121 91122 367469 396908 341723 222555 257534 47527 -59114 -66064 43963 90707
26678 90707 50530 6379 -3871 13591 -28131 68098 156094 213978 272965 306213 286154 367997
26666 367997 251007 82934 61951 18234 61162 174606 145869 30670 -7978 13913 -6554
26655 -6554 65340 182431 330374 301107 168816 136404 44984 -165757 -100883 32445 195522
26644 195522 293326 193971 187627 59870 16071 25072 2866 62972 214899 231259 287920
26633 287920 189805 5837 -109499 41773 45288 -68810 -52099 -31259 -5210 209431 330488
26622 330488 301612 203618 166210 74337 -119232 -114158 -65271 58122 212629 235817 114809
26611 114809 -45248 -229338 -9197 178811 242527 86185 24066 89852 328751 313313
26601 313313 319848 387685 263629 276495 151750 74463 232644 389885 394698 475614 426687
26590 426687 214740 169390 241738 152218 180391 46743 -45654 -68691 15211 104726 164591
26579 164591 132414 -124140 21604 296172 185737 -25827 -103139 -110656 -74476 -54632 109312
26568 109312 109827 186059 134621 -52907 15877 98544 78421 -55100 -77649 31817 461
26557 461 -76781 -133788 -99577 -106132 -23107 -57121 -134856 -324406 -221424 -14945 33274 25348
26545 25348 112408 93896 67961 19517 40474 78577 115758 113959 146229 77287 60372 58087
26533 58087 78525 67341 -41681 -218452 -218114 -96127 -19432 -158841 -146696 61097 91279
26522 91279 -30477 -205198 -4799 13426 71749 135682 166602 129541 99662 -16631 -53119
26511 -53119 -139068 -117608 -246697 -176667 -114237 52293 184773 188243 24515 -27873 85240
26500 85240 12987 -185955 -197235 -226579 -280625 -117439 -54181 -197471 -114073 -144121 -80229
26489 -80229 -117679 -79418 -178570 -79751 -50187 -69617 4437 69592 -55444 -179040 -119012
26478 -119012 -44613 -56677 -7050 22910 97032 86073 57670 102922 225301 333473 202740
26467 202740 -34383 -92639 46987 63322 159326 110752 168314 211312 -6907 -73358 145746
26456 145746 221722 136677 142502 255424 125245 132172 168588 126245 -14239 -78443 -213593
26445 -213593 -258871 -238399 -148586 -10562 67519 23992 -96424 -239589 -260932 -283809 -91132
26434 -91132 59421 33668 227441 122109 71537 162001 166851 225301 158443 178927 211366
26423 211366 118422 -94653 -40909 -112611 -171127 -251276 -230288 -213476 -100793 -42367 -85207
26412 -85207 -155898 -76456 -135862 -172725 100006 75402 -64869 -114347 -227037 -207184 41872
26401 41872 175010 185006 21282 -11843 68640 200454 334472 352509 204705 87908 -7868
26390 -7868 -139607 -182652 -80109 -21795 56207 171146 184320 35353 -105310 -120867 -59141
26379 -59141 -48902 -102149 -149703 -148254 -5809 -40404 52658 66522 122137 180078 129104 -22393
26367 -22393 -177762 -2398 108329 15725 16918 -189741 -172647 -9054 105905 74603 32448
26356 32448 48568 201721 425846 436535 383990 208423 159607 95268 -136200 -201866 -138900
26345 -138900 25557 168786 183323 260854 213787 203654 162995 -3693 21139 236572 237604
26334 237604 194155 227770 191352 192426 351633 497683 492541 314032 28707 -49613 92561
26323 92561 264166 198199 75924 91174 107234 21206 105276 249992 375545 371854 244386
26312 244386 136406 100954 95047 47377 -48344 -72214 -32235 9230 124201 -130771 -206979
26301 -206979 -101494 21379 -57257 -148927 -167690 -202647 -268575 -187604 -170220 -119027 -126150
26290 -126150 -244708 -194354 -70135 16087 16922 16574 -31323 65835 127671 96968 15937 -51555
26278 -51555 -128384 -139496 -98090 -5308 84958 213198 313732 313879 121895 -38524 60598
26267 60598 191372 282396 172085 209322 272562 29430 -52368 85597 19359 -87063 -219269
26256 -219269 -181115 -169147 -96844 -109689 -77904 -44914 -35720 71104 176157 -52308 73617
26245 73617 51289 56328 85297 -3245 104756 147983 229335 261416 430471 330193 276279
26234 276279 186966 261300 365739 254037 235122 269925 8304 -284724 -222125 44069
26224 44069 84375 -15536 3323 -37337 87584 116660 77020 -14226 -126745 -228537 -273042
26213 -273042 -344136 -313173 -250531 -186268 -103543 -265978 -274303 -328227 -57311 -24439 -11039
26202 -11039 93535 171852 245225 304906 380413 348464 258779 267034 131813 54242 219340
26191 219340 172811 104966 -55566 -113802 -152785 -347222 -262017 -225844 -112881 48358 76042
26180 76042 -152592 -250037 -180667 -102128 116183 125522 98049 109524 40949 -87403 24424
26169 24424 98272 220316 194526 150052 67180 -64737 -210944 -148995 4250 -52061 -108786
26158 -108786 -42412 -17723 18257 151378 250551 246650 93092 -99139 -135669 -44761 39206
26147 39206 50104 -180162 -123994 72233 14115 -58114 -59065 -30144 -40118 -208549 -234310 -255811
26135 -255811 -318467 -386682 -257535 -129264 58641 73716 -49955 -166769 -235901 -221791
26125 -221791 -299282 -446900 -249385 1181 136745 244327 97692 69424 242861 138574
26115 138574 16748 -126840 -217428 -233561 -134876 2608 22655 -149722 -208531 -143148 -53041
26104 -53041 -123633 -81235 67075 117449 56166 -44236 -20264 -64934 -203750 -146201 -70436
26093 -70436 -62133 -90750 -89351 -105133 -202117 -111183 -35229 65423 121297 59049 -35347 -88862
26081 -88862 -126064 -114708 -13609 165418 137991 5455 11852 -47140 -108722 -105616 -146187
26070 -146187 20139 153259 47728 -70263 -121501 -108197 79971 289236 314486 170642
26060 170642 129160 52289 481 42146 80686 122106 150522 169164 77356 48466 115990
26049 115990 163187 133644 177985 308095 200689 78422 109349 154401 75783 -7072 -109813
26038 -109813 -150312 -68932 -35543 23318 -60579 -104180 -77149 -13307 -125950 -29903 143011
26027 143011 168221 23850 33669 -22110 -203468 -339496 -427911 -518739 -502844 -185200 -145442
26016 -145442 -110960 -111812 40575 308206 333927 421578 327309 381762 179184 225720 441127
26005 441127 267745 80712 -19236 42311 -27125 -117014 -58268 32982 -35878 -129199 -328334
25994 -328334 -193269 -90713 25511 -128313 -199627 -249570 -252201 -176434 -100142 -125412 -174077
25983 -174077 -179594 13017 116404 218168 195137 113757 16765 88309 26888 53815 92661
25972 92661 60236 43398 -54055 31627 5786 -232557 -341650 -221074 -202211 -148673 -121600
25961 -121600 -24723 -50078 -13026 28970 -33978 -19812 48547 -88708 -151292 -210309 -284643
25950 -284643 -191780 -283266 -330016 -121232 102457 117946 -7860 -131604 -111135 -327817
25940 -327817 -365884 -181004 -182075 -219932 -194400 -32335 224478 158469 -54194 29837 100588
25929 100588 52630 -14996 34729 65622 225528 244345 135010 228254 248609 48006 -43995
25918 -43995 -90868 -77727 12573 77942 187056 298759 196550 165436 147708 187456 -31185
25907 -31185 -47155 -21170 121265 200299 145110 102993 106961 159069 268146 275552 71375
25896 71375 -7860 -196363 -186130 -110680 -175900 -148788 -219136 -118686 31909 90644 90663 -154263
25884 -154263 -273409 -240311 -126318 -106124 -83771 -160158 -245336 -62957 25228 33460 -103906
25873 -103906 -17304 46677 20958 74558 121490 -40681 -76251 -163217 -189764 -62263 -85183
25862 -85183 -193294 -118212 6443 -190234 -278259 -93706 63357 -70459 -201522 -68937
25852 -68937 -205618 -218856 -90445 -91350 10786 27411 135142 128087 107930 66581 -30395
25841 -30395 -91392 -182127 -103029 -194471 -243928 -67683 -90741 -67570 -48550 -13015 47108
25830 47108 -8104 -1209 71611 50797 117214 134636 83757 -5312 -44234 10832 -22889 -37096
25818 -37096 -48529 -36990 -107946 -105153 -25012 28357 70363 59672 -27427 7283 -6608 33496
25806 33496 54614 58740 136461 100988 118797 113073 30054 -131911 -96462 -106820 -114414 -93530
25794 -93530 33705 83294 62995 88490 -36585 -165989 -112303 87128 121982 44216 114619
25783 114619 205179 202776 170723 120560 133945 144474 166083 104595 169684 328698 232073
25772 232073 134936 68997 59969 -48417 -14961 114360 155832 357217 233268 57078 258497
25761 258497 356725 93704 -142123 -220922 -42045 -97118 -110729 47702 123108 60426 1395
25750 1395 -70995 -63126 -24184 -46467 -33107 36667 158226 173986 227187 282087 50740 -57243
25738 -57243 -26469 112767 323883 124796 107184 126114 118347 69534 147343 22759 10980
25727 10980 151804 189928 -78862 -314122 -72007 85198 93194 -4994 -202338 -279958 -242902
25716 -242902 95591 266645 164120 74212 83989 143984 158211 77821 -76837 -138975 -95586
25705 -95586 -7787 -118292 -112146 -295558 -284865 -309643 -343725 -80068 -60752 -239857 -304689
25694 -304689 -218869 -258589 -241774 -265088 -119528 -162638 -138139 -29186 152418 114917 -19872
25683 -19872 -177497 -303706 -324277 -374094 -288725 -50576 139331 18600 -182477 -124836
25673 -124836 -20221 130314 38587 74691 194610 120540 56307 -86951 -148247 -195516 -224349
25662 -224349 -167667 -286457 -201847 -105075 -30708 56743 17171 18030 113936 -100757 -190325
25651 -190325 -121356 -99322 -144888 -206129 -193259 -163002 -104987 -186485 -248446 -167922 -16239
25640 -16239 1798 -16071 37497 34396 44918 114896 115992 69334 146585 99626 -59664 -165575
25628 -165575 -46942 50084 -33150 -7714 46584 108862 64355 52330 310054 241332 136758
25617 136758 12723 104401 110791 218986 -14726 -103390 -40881 147434 290009 331022 244944
25606 244944 9610 -69216 62905 204174 176597 90151 211831 466268 293182 -9350
25596 -9350 5537 92172 128996 114483 101901 36650 -112726 -62017 51140 57087 191542
25585 191542 190675 110221 5460 -71429 -156042 -291787 -213735 -135017 -123684 -287837 -223699
25574 -223699 -119519 11616 -30167 -119774 -70145 68764 163581 102080 38534 54467 39395
25563 39395 36954 76652 10448 31538 -100797 -127366 -52422 -257384 -159520 94444 89429
25552 89429 62819 13658 55415 8157 126246 35348 -16098 -2316 38142 66889 -22574
25541 -22574 -129856 -86045 -43450 100486 30802 -137657 -182762 -96537 55355 143092 97154
25530 97154 34543 110924 71666 23709 -57303 -77770 -11708 177985 176257 292752 350585
25519 350585 392982 279084 164626 57617 28639 -25488 21770 200437 215544 164276 275816
25508 275816 193794 126849 49702 29549 70272 34922 11282 177799 309674 324429 238808
25497 238808 8670 -110099 -141881 -20040 117112 143365 -108929 -200957 -1763 -122896
25487 -122896 -265317 -273282 -212034 -191725 -206898 -59917 20280 170915 211606 250999 182151
25476 182151 110681 141624 106666 18534 -70066 47797 205858 242213 121115 7340 -73686
25465 -73686 -113031 117186 104016 2772 139257 -36649 -367527 -489391 -443663 -196201
25455 -196201 62702 137420 117174 170051 39813 65419 -29120 26770 208241 299457 202742
25444 202742 201808 349956 105006 39807 31802 117271 229115 171886 214007 126295 -24909
25433 -24909 -18370 12555 -87446 -100473 -66167 -81641 32334 131929 240664 -4057 -112053
25422 -112053 157210 208637 55391 -69543 114097 289243 256368 301441 299281 134041
25412 134041 153831 72446 -11284 -87399 -284335 -320347 -128384 -206540 -286123 -100004 -3093
25401 -3093 -34071 108979 123974 31760 -96973 -117605 -172336 -193321 -171295 -192858 -88803
25390 -88803 45746 129821 104096 -24193 25383 44815 89830 67660 14735 44767 -26253
25379 -26253 -40847 133352 166789 101715 163889 269582 343451 261650 186061 126004 62750
25368 62750 -52308 -92792 -52660 -110644 -288847 -218822 -216767 -80990 91716 172878 300850
25357 300850 123826 -3721 -115808 195222 234380 153486 -72942 -48534 -9689 -236115
25347 -236115 -342267 -309860 -129103 -72144 -30690 6715 967 -59474 -3817 -71195 87668
25336 87668 266481 356017 195146 128661 211575 325441 245954 305 -112894 -7062
25326 -7062 -54176 -159433 -233931 -103880 110849 221151 250124 185419 34394 -108392 -273558
25315 -273558 -276256 -249581 -48394 45889 13333 173873 188456 122428 224500 220217 220205 166198
25303 166198 -38179 -55151 66434 197076 202123 5084 -11477 56442 169266 180786 2532
25292 2532 -87433 -199527 -215882 -162401 -119240 -142936 -203699 -191710 36896 307592 360006
25281 360006 314233 276425 125028 -31651 11395 192996 280392 352324 453753 396642 261914
25270 261914 221092 235805 334789 259219 146937 -7849 46092 188633 102159 14874 1733
25259 1733 76807 53688 29067 -23587 18238 -21040 34290 214985 194766 29970 -121448
25248 -121448 -301994 -245055 7657 285776 301301 115324 15415 -66848 -208099 -98447
25238 -98447 -69921 -94603 -64229 -132933 -190891 -86467 80727 -59782 -230915 -206161 -38475
25227 -38475 -106356 -256044 -418694 -317685 -77424 46271 -38685 -84621 -18050 17097 2800
25216 2800 -62107 -49596 -40297 98641 5553 -38729 249518 204919 3511 32899 -20553
25205 -20553 98854 68420 13230 -4018 23158 -66774 -55737 -7669 43268 117297 207553
25194 207553 90359 -22323 65568 91085 179392 165577 112197 118675 74620 170033 155037
25183 155037 119394 86552 49924 124288 188814 94415 -50946 77788 267913 124166 -15045
25172 -15045 -49489 -53759 73579 185933 173539 182620 162348 227332 49947 -8253 -67679
25161 -67679 -163217 -59948 -46 9103 -621 11382 74347 166388 106275 137979 197212 80998
25149 80998 -65157 33415 59382 -6273 -63236 -110535 -378579 -482846 -316532 -129155 -76819
25138 -76819 -203698 -177187 -194736 -85554 -33228 91248 145069 -71010 -143647 -184687 -90574
25127 -90574 45620 169129 73495 225392 361001 451809 333424 294107 201441 90746
25117 90746 74559 14107 133795 107178 -15892 54314 95340 -8861 -19995 -39229 104512
25106 104512 38888 24584 -13723 158598 295869 252929 308156 229774 -82974 -252951 -140197
25095 -140197 131907 47107 -156104 -220118 -115384 -51841 -41638 -14136 185403 91258 -47364
25084 -47364 25100 188234 147344 2060 -113989 -106076 -102759 -83847 3185 166002 267622
25073 267622 367962 346928 308620 305760 235363 194675 198842 -147 -100253 -131658 -103303
25062 -103303 -52472 -275333 -360016 -178607 -105236 -13212 13087 -39203 -77953 -5487 95411
25051 95411 140733 13452 -93157 54461 -87219 -108925 -122184 83159 133585 183522 146487
25040 146487 72946 35238 23982 -198610 -167385 -48731 68923 85632 169855 26464 107035
25029 107035 92120 16373 -173334 -91513 -167033 -191576 -175255 -35770 239304 309557 195290
25018 195290 -1055 151287 153739 52202 -29 -89285 -116657 -44974 -83714 -86304 -2102
25007 -2102 122114 158745 187517 -2480 -26309 140907 124555 257452 97916 82546 70886
24996 70886 -25693 -127612 -30828 162103 114018 82427 63114 24538 -103118 1524 -54349
24985 -54349 -5151 -22820 -42319 -140272 -230173 -117066 -182076 -139106 -50965 -1123 160492
24974 160492 137474 6226 -217632 -197967 -83865 -175884 -280647 -268389 -273568 -296124 -53213
24963 -53213 -123567 -10522 119228 164060 -42501 -256663 -109462 -53519 -175978 -75747
24953 -75747 81384 117662 197936 205344 92087 -43179 12373 -83988 -57592 -116876 -56066
24942 -56066 -21406 -17239 3765 156226 89142 30944 -36779 -8419 -38138 108749 267986
24931 267986 343976 376750 378711 317776 347215 325619 252263 115137 37873 103324 156926
24920 156926 134268 111329 162763 28823 10721 148452 93605 -40136 136084 148725 169116
24909 169116 90158 52381 142775 196434 195450 145861 62481 63347 148306 160669 100883 53107
24897 53107 93561 123870 109780 65653 -52435 -170335 -98579 32877 150927 98246 47202
24886 47202 71098 83610 -4898 -147125 -155790 -177019 -189708 -247039 -126127 88256 200638
24875 200638 -17651 -317656 -375874 -89327 -19233 28494 -51316 96167 76833 73857 -36933
24864 -36933 11239 148906 161695 96608 -122317 -175488 -193597 -38586 3541 -161313 -45960
24853 -45960 69794 75320 -22074 -123031 -93999 81825 96766 77742 -12706 -9120 127743
24842 127743 36035 -178978 -148934 -70449 -29675 185568 192981 -76206 -162300 -210183 -166944
24831 -166944 38456 20645 -55362 -186909 -161997 -90592 19250 -74090 -121177 -187441 -98072
24820 -98072 -90186 -4311 68527 33670 -30305 -6247 41230 109128 215059 188913 242776 261847
24808 261847 272891 43145 -96789 34177 -165572 -256648 -181538 -97448 66774 86578
24798 86578 91412 -38715 6877 -63071 -147617 -136212 -38885 18702 22370 -133776 -142109 -188060
24786 -188060 -104376 -90690 -161909 35794 6038 -174454 -93799 109085 164723 116820 9776
24775 9776 52486 158378 143523 85642 86060 152284 207215 206079 151045 51991 74161 241838
24763 241838 268180 127645 -60570 -40311 85505 53228 -182933 -158197 34253 152735
24753 152735 117858 95015 39769 109255 138874 138007 133270 -18908 -152150 -27098 4013
24742 4013 -100511 -104723 -136215 -163003 -135309 5216 259334 263337 131376 109389 186676
24731 186676 262604 207195 153838 148844 277207 256334 104122 240627 251734 145438 142801
24720 142801 147388 28701 -71227 -164810 -58811 76866 60666 -34303 44145 107893 161085
24709 161085 52001 -27553 -89282 -110020 -67384 -23877 -144120 -192749 -115218 -68761 -17373
24698 -17373 63659 78719 17741 136633 155038 94343 67350 36249 -134884 -102309 -97916
24687 -97916 -170010 -138179 -147874 -220448 -140126 -63668 3034 48527 96808 86808 16718 -41482
24675 -41482 -85784 -83807 12814 62124 38081 19748 41035 50121 -6318 9108 74768 178046
24663 178046 86321 -46257 -207641 -311974 -394693 -321993 -258589 -189815 -137101 -101884 22018
24652 22018 2257 187313 239166 242069 122647 -21142 -150073 -29423 121961 111653 85651
24641 85651 73507 72026 43190 20938 -31665 194910 219551 184027 181313 74612 39297 67114
24629 67114 31887 -58410 -68213 -64403 -94309 -74140 9701 4051 -13805 712 -24170 -10661
24617 -10661 -83668 15321 48473 51313 -29002 -12135 130744 143249 25990 -219960 -152399
24606 -152399 -13804 105906 89088 110448 43496 -17230 -57464 -94991 -123303 -57094 -7164
24595 -7164 -136601 5700 -93509 -253882 -123310 -195774 -221320 36618 99318 -97568 -206977
24584 -206977 -318883 -306585 -193127 -22592 53123 -10289 -192894 -336318 -300317 -168763
24574 -168763 -188162 -48999 174153 182113 93689 36243 202608 255234 211443 117010 -62595
24563 -62595 22552 101830 -8731 -74319 27694 139087 -24943 -245268 -265560 -222070 -119309
24552 -119309 -65824 -4617 3170 32597 -52504 -286555 -188069 -82690 -178939 -174104 -103680
24541 -103680 38737 141054 110861 -88279 14451 84258 199204 224766 234582 138124 75910
24530 75910 98624 149268 116913 110969 172927 164972 150172 74594 160471 16183 42957 25059
24518 25059 -243167 -227459 -169015 -244091 -337560 -287763 -212239 -23172 111967 259395 253875
24507 253875 -49323 -165928 -150809 -52049 -96038 -256775 -84708 -47193 -32822 -132343 -211812
24496 -211812 -285301 -182812 -135770 -85228 -31918 89195 -27573 55010 74525 52074 161743
24485 161743 187616 215791 175827 98781 -31460 -84243 21092 125672 44942 -67669 16964
24474 16964 -41990 -63420 -61526 -85873 28483 15092 -111031 -76884 -15316 69864 178574
24463 178574 327622 155211 163073 139844 151910 211872 204045 239004 247056 184679 47181
24452 47181 -89892 -109113 -68290 17441 17789 44332 60667 21244 -60052 -55736 43406 -1274
24440 -1274 65724 117088 185754 53565 -4401 -22355 50529 80774 -29750 9423 -8999
24429 -8999 -27609 -200 -21176 47608 38271 -108342 -172904 -176689 -209306 -37846 -123843 -306018
24417 -306018 -205444 -68189 -41571 151263 227174 77869 -25866 52974 -71073 -119873
24407 -119873 -206714 -80516 148692 290706 314283 189057 153173 232266 332356 199826
24397 199826 160158 98780 -123895 -91286 -92433 -129643 -79607 -173016 -209124 -267817 -185718
24386 -185718 -92526 -42716 177281 231900 135422 156664 183626 245980 388656 311772 273681
24375 273681 285606 42595 63875 218085 159276 51386 120660 72258 43652 11916 -37745
24364 -37745 -108750 -139967 -150296 -145586 -151686 -42500 55426 99588 115871 145629 113603 26024
24352 26024 -77173 -55054 82022 144847 82077 -4963 59136 74455 188249 179122 64665
24341 64665 8651 87602 93856 58018 -225623 -317943 -237549 75792 224145 98249 -34676
24330 -34676 -32402 -218 78898 128160 187133 162912 8942 8492 50986 -52672 -135932 -166875
24318 -166875 31949 237347 173528 59410 -74963 -30258 244072 239257 99026 -137444
24308 -137444 -121783 18479 -6334 -18064 31921 51981 40226 33157 -124487 -150347 -270826
24297 -270826 -361947 -278952 -168765 -116218 -66651 -111465 -97375 -12941 37834 103866 160299
24286 160299 171891 47504 175517 322555 293169 18557 -42596 53382 -25353 -232525
24276 -232525 -198715 -8530 102463 -174559 -222752 -114090 -70111 -168353 -235428 -174039 -114599
24265 -114599 -21785 -114268 -81919 -8459 -64830 -109995 11905 111873 151049 47378 74667
24254 74667 65583 96132 162631 154040 249399 157095 -64485 -38145 -54439 -32056 -260090 -250496
24242 -250496 -47413 -51352 -47454 -78409 -207682 -277007 -173261 -152950 -224763 -19906 68877
24231 68877 -34166 5567 28347 2496 -51534 -111604 -49286 12991 86893 51094 101456
24220 101456 129900 140122 72233 90368 -28229 -33418 -62395 -159917 -63935 51900 81254
24209 81254 -21090 47385 304 -92075 -141912 -211032 -179109 -92799 42879 -26477 -140730
24198 -140730 -214352 -219213 -178745 -229134 -249577 -114715 -44317 -183815 -102500 -72708 -1238
24187 -1238 225310 104936 382 80064 104511 163495 9105 17303 197748 332894 372046
24176 372046 398677 382781 184889 -21225 -42834 -141586 -112487 -149287 -376434 -445775 -281268
24165 -281268 -280305 -168939 -60744 39387 188537 350772 299426 113747 -141701 -99944
24155 -99944 44440 44236 78826 270968 296606 206345 89498 -38696 -120129 -158760 -145090
24144 -145090 -130534 -67407 143586 226280 155251 140965 38273 15769 -26245 -81875 21724
24133 21724 -2782 -16421 -136796 -122097 -33165 61243 230633 104003 70971 71482 97625
24122 97625 162703 192625 208960 117505 164145 325767 317830 268392 184343 54227 147665
24111 147665 184517 102253 -2689 30485 -60846 -201598 -181716 -107496 6206 -181773 -325547
24100 -325547 -155961 -142705 27714 232663 265299 302096 183059 61506 73926 -8526
24090 -8526 91631 215858 309864 245802 196375 234237 345466 334800 196839 76217 240432
24079 240432 249495 146906 159850 240668 257412 231922 346939 243985 193444 78163 91900
24068 91900 199666 65031 -156701 -213856 -79149 -110015 -134993 -129867 29536 69760 -63333
24057 -63333 -175412 -107073 18287 -8945 -83848 53576 275449 256520 148517 128716 121469
24046 121469 155426 205756 137676 49627 25522 -66404 -233679 -216960 -14689 51169 -14581
24035 -14581 -9491 -62657 -3432 86483 157768 185180 309758 117031 102517 95996 -11942
24024 -11942 -168348 -326534 -217911 -54891 -54504 -174921 -256085 -257881 -329794 -265569 -217515
24013 -217515 -285608 -177200 -44540 43585 119730 38042 70434 83886 -51447 -74566 58727
24002 58727 19044 -95563 -55879 -146858 -270310 -206968 -236441 -181580 -246145 -421291 -397104
23991 -397104 -346666 -132052 -100775 -149538 -243307 -332253 -195977 -55001 33612 7443 -129594
23980 -129594 -177603 -121094 70814 -54339 -276555 -174388 53520 -25060 -83608 -202626
23970 -202626 -301327 -156299 -70669 -37418 -123714 -13080 39839 83065 136816 124904 101733
23959 101733 -63489 77523 7743 -174115 97459 265815 378421 333187 244061 79447
23949 79447 133658 31176 -75146 93908 195155 -65156 -125943 -231255 -136846 -3071
23939 -3071 49109 -32552 -28631 19313 186926 281948 176918 144666 199783 293916 152226
23928 152226 -153473 -283915 -401146 -353899 -357249 -407456 -526226 -243861 -71482 -127149
23918 -127149 -135492 -102170 -174983 -238976 -120133 -137248 -224003 -121823 -32666 126560 130861
23907 130861 79077 212379 157437 172758 146951 123423 37673 -110694 -108517 38089 184090
23896 184090 75822 -62728 -181489 -256899 -59856 -152794 -228343 -152158 2879 72716
23886 72716 54235 84488 33633 49609 80277 115783 182937 260553 220641 100458 50841
23875 50841 19761 159880 191116 57825 -131044 -111519 89729 82721 -3529 6596 1213
23864 1213 -178657 -239396 -175080 -75050 -212182 -96489 15380 110077 178735 203900 17421
23853 17421 -13288 -26087 -178073 -172663 -86042 -114054 72729 235641 152332 8978 -125851
23842 -125851 -30567 74900 29139 31661 47506 61756 -65551 -149083 -8828 32564 22240
23831 22240 48965 120474 34285 -87297 -174707 -237425 -181565 -113184 -92989 -65478 16024
23820 16024 129939 74878 8774 -243515 -265447 -178261 -135367 -75772 -96638 79542 247042
23809 247042 -7511 -99783 -227776 -279320 -125822 -130232 -166217 -316929 -248973 -106531 -280577
23798 -280577 -190840 -142433 -157176 -232830 -192414 -202589 -179199 -194297 -224853 -80746 88034
23787 88034 155870 112143 102431 57893 -158428 -151828 -131094 -135713 -143017 -161992 -312469 -334338
23775 -334338 -283946 -274549 -12094 199069 -88784 -200633 -122606 -64829 -159983 -277543 -235433
23764 -235433 -239678 -189735 -165789 -65297 64558 177700 292722 311934 215198 57910 -20835
23753 -20835 -10164 -87607 -126003 -125220 -172028 -163876 -54302 -39166 50809 84793 19129 -113251
23741 -113251 -135462 -61656 141441 72048 51211 20116 -33158 -143605 -193172 -209504 -245590
23730 -245590 -176493 -152147 -150262 -89118 -35930 117255 98831 42511 136740 149199 95887
23719 95887 69534 -66839 -61682 45631 62903 23526 -95459 -227559 -103011 25200 37474
23708 37474 105001 38637 -231673 -153792 -48866 -76261 24489 1021 -29817 -30796 -98883
23697 -98883 -172419 -195709 7858 244445 181418 121662 146181 154512 184543 129754 75846
23686 75846 203515 245853 202373 273727 138422 62290 -57991 -153485 -180941 -173260 -90268
23675 -90268 -74756 59315 304272 153233 -92863 53683 208349 113091 90953 85318 167236
23664 167236 96964 -52402 -94611 -108579 138076 344960 203619 -240248 -246548 -236846 -226610
23653 -226610 -58985 270392 218318 124503 71133 34322 56452 -104405 -71460 39990 98457
23642 98457 194886 -954 101842 245868 49960 -44737 -23788 -71633 -166355 -73882 2817
23631 2817 -12121 -261184 -451896 -513256 -371611 -105030 95947 71215 -16326 64049 124807
23620 124807 109871 106923 219830 210661 196307 232367 256231 210247 214457 87980 -141395
23609 -141395 -340356 -332787 -124278 -66267 -49670 95881 48057 129258 115433 137099 155845
23598 155845 69177 -53248 -166391 -252875 -242206 -136961 -48173 89870 189584 125424 98164
23587 98164 86112 142488 178355 -78531 -51327 12395 46063 34512 -38096 -25197 250361
23576 250361 353682 281581 128801 62986 146598 155094 144884 27747 -66668 -255914 -328181
23565 -328181 -235049 -108932 42414 -14017 -75245 33139 125167 65937 -46400 16022 -16584
23554 -16584 -14509 -71036 -100171 83902 246076 67445 -64792 -102717 11702 -14798 70537
23543 70537 236823 154136 974 -42953 -61406 -37193 5905 40850 101969 -67529 -134199
23532 -134199 -252418 -271223 -109762 -139346 -222202 -254007 -240468 -266709 -216438 -161401 -78594
23521 -78594 754 -19037 -84685 -42095 141115 -5180 59193 205011 248358 250654 216558
23510 216558 74506 -74316 37349 150461 161012 86540 -21046 -74974 -246622 -372590
23500 -372590 -305882 -302162 -292531 -276071 -178033 -44215 -136424 -61415 78585 44341 2330
23489 2330 -17920 -7540 47023 28030 -979 31732 -112673 -94067 -43659 -97257 -50108 -46139
23477 -46139 -261249 -122878 145819 238500 83520 -135785 -332547 -164522 31627 -5875
23467 -5875 -52266 -166929 -223835 -216106 -113977 -10385 -44311 29446 -14124 -40093 -149954
23456 -149954 -235531 19639 28499 -32693 -123810 -22643 -4511 -159149 -63065 126263 192389
23445 192389 258600 231375 125729 -401 44692 89308 -37969 -163492 -49585 -17981
23435 -17981 -171997 -95982 -164178 -208840 -246942 -129705 47870 121758 118730 290851 431938
23424 431938 372443 277502 200341 114400 121929 226759 213848 240856 275017 394355 457129
23413 457129 345753 214530 157653 13196 -82205 -184223 -17742 111725 85178 8515
23403 8515 -132201 -270520 -245834 -246717 -164221 -153534 -130564 4217 43939 -29581 -127350 -216530
23391 -216530 -73482 46105 84877 135985 36421 -11176 -145830 -109359 11812 97604 70240
23380 70240 31633 -158763 -238361 -128904 -169862 -179953 -189004 -115297 -112778 -49366 -10953 -29367
23368 -29367 55221 -15992 -63793 -41268 22170 25072 -2895 37726 185354 235635 163609 84280
23356 84280 -23993 -32006 -37443 150377 167533 146542 129050 65196 -122632 -206342 -161844
23345 -161844 -16681 93841 140304 92325 7317 -24080 19994 215529 219914 43033 -3236
23334 -3236 114852 37436 -48418 49208 40915 38169 44692 23796 -29115 53212 160827 119271
23322 119271 -61636 -74531 -99707 -174705 -170183 -82378 84693 209877 286911 273210 254973
23311 254973 25290 -133165 -146172 -97559 -135084 46760 32779 32796 162903 144456 -54114
23300 -54114 -172996 -36868 -73182 -202358 -164086 -222110 -300222 -279276 -241598 -128562 -18258
23289 -18258 114287 86641 183476 168191 -4740 -58279 3576 -172179 -300756 -236160 -270056
23278 -270056 -293504 -225308 -65379 149563 143145 37884 65569 91408 50890 108385 104386
23267 104386 -19671 79223 121888 29815 3785 52910 21933 -5481 -28239 -195778 9496
23256 9496 187829 347830 351546 166113 -90717 -151089 -200713 -173225 -278880 -69302 104400
23245 104400 122171 144081 3654 -130866 -110816 -158516 -153275 -75864 27525 10440 -58074
23234 -58074 72475 192337 202847 211824 302391 277061 55589 74180 92907 123752 107394
23223 107394 141530 10889 61375 111340 100876 19925 100507 115491 42795 137083 206480
23212 206480 175295 -6952 31766 39287 90711 -8793 -24346 87230 226654 169434 24611
23201 24611 -93318 -143971 -127414 -64504 60504 171134 1374 -119040 30947 -59202
23191 -59202 -113556 -189789 -177442 -185020 -192044 -227624 -156376 -197795 -273108 -139932 -151663 -336150
23179 -336150 -350305 -352918 -502694 -512058 -297061 -252642 -227734 -381992 -273703 -197631 -83223
23168 -83223 34840 198705 200685 163325 209748 259980 348954 161786 153189 62591 175363
23157 175363 78512 -9147 3439 133092 139668 37034 54077 201229 220649 49262 -123488
23146 -123488 -125971 -319689 -352690 -215454 -163530 -80861 -145925 36110 50050 -135845 -274932
23135 -274932 -373301 -288470 -280743 -219668 -159084 -17951 -21664 142445 129543 26217 156088
23124 156088 60395 50856 197742 364948 273278 162047 172744 123262 30976 31545 25822 56921
23112 56921 -54671 -8687 -115793 -147861 145040 243437 304119 121515 27750 -97183 -49291
23101 -49291 -3994 30406 -124498 -406762 -516185 -250953 -69914 13672 71929 100345 89418
23090 89418 -20028 -98994 -41793 -31869 234562 136338 -63173 -185636 -244357 -209572 -133047
23079 -133047 -261935 -337834 -207298 -114438 56559 35415 -84001 -66956 -51481 -83247 -171732
23068 -171732 -265016 -154311 -164108 -236870 -101883 -123459 -238581 -193553 -166825 -782 172515
23057 172515 163034 57501 5667 -203680 -364520 -355555 -179472 -152251 -163626 98545 156382
23046 156382 109685 197163 80167 37467 152865 100097 -50697 -75665 36789 5115 -66026
23035 -66026 -74663 -1670 56280 198161 200104 284580 386294 416472 455085 352644 187306
23024 187306 45552 101332 66216 -21660 126631 195187 60815 -38246 -24562 -104990 -121310
23013 -121310 -103362 -9857 13800 110594 247912 320988 217039 94611 132036 81573 -29789
23002 -29789 -148786 -82566 18767 -71418 49574 93960 8929 -99440 -187377 -135377 36255
22991 36255 150732 115846 61749 121792 15330 119181 298858 259357 279094 187763 103698
22980 103698 262355 355361 206391 28561 -85651 -122700 -34729 16145 -364 -136144
22970 -136144 -167911 -65076 15376 -18278 59931 164443 140256 220820 45209 61060 45040
22959 45040 159640 83657 66780 46759 71194 57029 -4044 -32712 77359 -51369 -280854
22948 -280854 -275815 -156230 -86436 -55259 -46282 -247412 -356018 -259597 -154008 -229189 -202107
22937 -202107 -142995 -117958 -190569 -90948 -128153 -131422 -55690 -72806 -105064 -91407 -40667 -83087
22925 -83087 -103224 -141883 -202246 -253283 -191660 -198079 -204249 -175597 -187929 -99162 -166298 -204849
22913 -204849 -199278 -307684 -270602 -173154 -88292 27047 -95965 -325938 -315898 -193132 -140972
22902 -140972 -16503 -57156 -129629 -188091 -109242 -53569 -69449 20841 97713 77457 39450
22891 39450 43646 33745 210919 218349 177430 173758 160105 185818 254254 391732 416136 187108
22879 187108 -45835 8609 -744 -108172 40881 197787 471954 632495 449402 206850
22869 206850 148013 51161 -128596 -14087 -150697 -265170 -276919 -129553 -286555 -307150
22859 -307150 -191502 -138159 -21971 72052 98223 -30351 -143043 -258139 -242994 -103268
22849 -103268 -31280 -20088 -151887 -179424 -49152 -76563 -131832 -111306 -181997 -49824 7693
22838 7693 -25518 -96598 -154425 -83648 -105793 27937 4054 -66067 -61434 -81011 -47 50158
22826 50158 -111192 -93926 -130457 21230 35149 -16209 -16530 -145105 -322313 -194259 -27187
22815 -27187 -45916 -141780 -118139 6365 128561 105631 -65283 -101653 -63247 13249 -31662
22804 -31662 -87368 -87722 -188703 -178837 -126588 -31920 -90714 -225240 -352794 -398445 -378123 -242446
22792 -242446 -4649 -55307 -115597 -139916 -94381 64574 68104 11201 -146990 -349627 -286099
22781 -286099 -350853 -240849 -37235 -31298 -62141 111664 144650 114904 150708 -1116 -38536
22770 -38536 -164544 -182383 -95789 -20259 -24183 -36523 -109532 -219925 -18432 -142140 -356417
22759 -356417 -179980 60964 153093 -33076 -50486 105341 83438 77560 33997 -53958 -518
22748 -518 64782 -48626 -38162 30944 -4809 53239 132766 202173 162007 272916 172215
22737 172215 -72654 -152957 -223603 -311172 -362944 -219566 -66831 -134170 -182420 19748 136454
22726 136454 -8676 -43472 -95607 -103685 77732 112036 44251 18105 45922 -115130 -221647
22715 -221647 -245517 -227010 -158631 -25941 184992 349908 176739 -124298 -199481 -13590
22705 -13590 -163800 -126736 -8971 90205 177602 225049 26117 -20608 19012 28954 -58474
22694 -58474 -47469 32032 -87460 -176670 -190494 13483 82320 41410 51963 181042 79134
22683 79134 141685 100367 136060 119931 236918 320598 265635 68190 -84096 -41137 9045
22672 9045 -39300 -115705 -161898 -115779 -68966 136332 174271 180569 68333 -37159 -61162
22661 -61162 -21606 20828 13921 -17133 111481 120805 -15415 -127318 -197722 -191146 -49708
22650 -49708 -77490 -117651 -236281 -191548 113213 255536 245314 152764 173867 89100 29374
22639 29374 729 62182 -7498 8263 -22960 -199401 -264004 -211901 4515 169318 203005
22628 203005 227869 104628 58904 64711 82048 107118 95953 -127801 -179925 -88582 92550
22617 92550 104221 -133286 -52910 4018 -162369 -101961 -123046 -167598 -76057 23220 8731
22606 8731 46422 54612 42797 -85606 -112351 -78639 -117124 -152232 -255800 -269529 -111799
22595 -111799 30767 59179 82116 15826 58584 98328 20707 29016 96616 -93770 -173420
22584 -173420 -152153 -172189 -117398 -134636 -96247 -51624 -210266 -308678 -122050 32917 55560
22573 55560 282250 410157 394657 280936 212632 208988 123649 145716 151558 125145 56799
22562 56799 -77560 42835 66511 -59147 -116071 -288968 -191425 -44711 39586 34503 73560
22551 73560 87304 -89176 -227010 -95305 -102877 -120868 -99545 -56102 24255 68765 67145
22540 67145 114166 165271 45832 -42212 -101859 -216386 -267508 -276295 -234032 -164747 -845
22529 -845 91126 -64643 -37801 -42572 -50713 -9543 59298 118307 19396 -123274 -197295 -76514
22517 -76514 -30772 13132 1544 56893 102124 236756 231287 68400 220481 149925 -25688
22506 -25688 46128 75196 7884 -122274 -275364 -178165 -96123 -55326 47653 15232 70439
22495 70439 138702 223414 138652 29502 -181258 -330512 -195871 -180436 -186016 -115028 169280
22484 169280 266445 126210 78467 85284 69379 -29841 -71625 -157061 -119237 -13221 24337
22473 24337 -54273 -4096 94919 2075 -113682 -180538 -223889 -172823 -56266 -111127 -299062
22462 -299062 -208854 -72235 -19998 -110510 -132463 -211736 -174238 -114069 -32950 74328 181669
22451 181669 203559 -12689 -55863 -5039 -49906 -226556 -388346 -471362 -376504 -227967 -84721
22440 -84721 -12120 65568 -17909 -73421 -78781 -139911 -243793 -52616 154323 -52107 -22666
22429 -22666 70471 50607 -218624 -188529 69669 19347 -86131 -56409 68416 16184 -120478
22418 -120478 -21255 11797 -121421 -96755 33347 206765 190373 117916 -33825 -119243 -172039
22407 -172039 -28070 -80040 -155445 -257644 -61328 -18242 -169510 -167835 79726 102918 -32474
22396 -32474 -293211 -247757 -259626 -207808 -393768 -380466 -267391 -163124 -58661 -66331 -61138
22385 -61138 -134230 -177728 -245368 -365273 -265606 -214749 -127591 105901 332605 405632 346377
22374 346377 134740 50241 -121878 -137117 -200518 -230894 -79622 7981 -191271 -192091 -164116
22363 -164116 -90982 -79916 -147066 -166221 -68005 62326 109053 72343 61577 27930 -24596
22352 -24596 -55786 -74723 -65266 -83515 52227 78348 152605 27469 -29946 52568 104699
22341 104699 127825 -73492 -280155 -249702 -126781 -12975 73686 218590 162901 17435
22331 17435 101865 34380 -95691 -92108 -88384 -87201 16441 -77360 3529 -23577 -135331 -178087
22319 -178087 -122231 -187603 -271714 -196068 -120019 -14832 -12727 -161868 -264993 -225469 -207120
22308 -207120 -141979 -121193 -68102 156573 297404 197787 -27142 77609 46498 -186785
22298 -186785 -213399 -75335 -118099 -76181 26315 144299 22884 63967 -40363 18315
22288 18315 108036 135393 201313 162560 22113 -138044 -184481 -124255 146274 253845 251452
22277 251452 205819 116560 -17036 111 19812 47004 7387 22034 251840 417887 357996
22266 357996 145380 123088 99531 109663 43179 -20831 -50103 1021 20118 74086 63328
22255 63328 -56805 -59681 -51915 68935 102126 231898 179664 44726 -101452 -86430 108267
22244 108267 34065 -32277 49211 130403 164082 205219 156184 24581 -34940 -156873 -143494
22233 -143494 -54967 -3771 27514 -103637 -84609 -109627 -258166 -196738 -85607 57449 229719
22222 229719 234725 181876 -25558 -104774 -13669 -147296 -71861 -10428 130946 10308 -82783
22211 -82783 129981 157044 -33132 -53563 57123 -175 -76055 -178370 -265836 -361718 -327179
22200 -327179 -164651 -52249 8763 40334 27713 31848 -37116 -169241 34591 79293 56120
22189 56120 -24298 2489 10698 63899 294822 448779 227342 44082 34033 -8563 -42871
22178 -42871 -96 41299 26602 78190 27667 -7275 64751 57653 148764 69586 11747 -169999
22166 -169999 -192674 -35035 72509 236024 187247 100781 93413 251722 342674 172689 -140931
22155 -140931 -165678 -70081 10452 37306 2754 163664 260722 156768 -68327 -143814 -5710
22144 -5710 -6366 -144683 -124545 -45575 -59973 -28597 -7509 33285 59699 153411 69684 101314
22132 101314 90798 79172 2282 83004 74541 -62961 -84102 -189927 -76439 74669 22491
22121 22491 -79640 -222625 -356700 -264889 -267371 -257113 -182620 -167184 -295093 -219043 -178734
22110 -178734 -116152 87851 187119 130866 52020 54800 55773 101150 57839 114931 13151 -136331
22098 -136331 -279850 -76240 5972 -83831 -188786 -44628 33986 130557 118610 180331 237499
22087 237499 134398 62229 96189 98319 131996 55754 -99415 -171933 -281631 -289016 -178757
22076 -178757 -8059 -134624 -170942 -141778 -137848 -116739 -469 -53108 -74306 -16264 -73554
22065 -73554 -53348 -196394 -318297 -219425 -301089 -315017 -63818 152542 100494 2317 89922
22054 89922 106944 140585 -73694 -336536 -226112 -110149 -28627 190223 26290 -104069
22044 -104069 -139868 -17854 -58861 -115574 -278398 -553972 -382450 -147356 -77280 86858
22034 86858 136723 225828 183720 135029 97241 51046 149742 138396 166323 93850 -98508
22023 -98508 -193344 -122743 105210 49417 -131986 -113057 -139582 -41335 -84633 -21061 4353
22012 4353 -198570 -267164 -173815 -76989 -9492 -41221 -10010 -21092 -88936 -68209 -104254 -86589
22000 -86589 -175887 -98134 -50479 -52683 -152653 -168753 -95715 -53233 -66455 -92594 -64329 -159593
21988 -159593 -134278 -80599 -90306 -47167 -109956 -86081 -126340 -177904 -66230 97778 31786
21977 31786 -53475 -54468 -68076 22136 -75013 -131903 -249131 -326645 -289808 -329562 -321790 -280553
21965 -280553 -97583 57184 -39851 -99311 25908 -24411 -104011 -73170 -28721 -62395 -159708
21954 -159708 -103172 -9669 -68106 -207767 458 43232 111368 238835 175550 239088 -96128
21943 -96128 -257370 -140261 -215822 -196982 -55735 50292 138535 93026 169907 175553 95108
21932 95108 240035 109578 130908 189776 180769 196986 279309 315172 218658 202399 220693
21921 220693 207284 270399 363544 291148 178293 42450 -72338 -196995 -58205 30265
21911 30265 -24709 -190986 -96054 -975 -62404 -125993 -148886 -39426 63881 47589 90205
21900 90205 57810 113420 55351 -44876 -172580 -103044 -133325 -248155 -50142 30418 -85469
21889 -85469 30617 86049 -27283 36772 -12910 -128949 99042 127398 -821 49493 12209
21878 12209 -22219 -60488 109148 215924 102877 132482 118152 62133 8293 -189643 -187596
21867 -187596 -183731 -130728 75594 141732 126101 86544 109162 27091 123615 226766 185236
21856 185236 139254 101262 -183053 -181596 15721 120354 161711 146943 118399 120194 47089
21845 47089 77421 40094 -28454 -82200 -175240 93288 174842 63301 -2987 -46189 -118670
21834 -118670 -237295 -113812 3627 -75630 -99450 -222138 -309495 -354587 -443729 -434431 -142743
21823 -142743 -73690 -116026 -170556 -45387 -25110 58275 -112435 -265521 -111227 -32161 52081
21812 52081 131814 116209 7268 -199594 -217808 -67121 -73759 -126225 -201281 -318729 -179128
21801 -179128 -116391 -81790 -121490 42995 123183 30649 -112672 -154135 -101792 -36047 -6843
21790 -6843 -5875 207288 287364 351328 312373 203629 205584 3959 -120599 -227570 -278686
21779 -278686 -76398 -59331 -38581 29814 -34878 10380 133070 107905 130697 201325 85232
21768 85232 69431 62043 145067 -8259 46946 135311 -58981 -96383 -124731 51021 101317
21757 101317 18907 -75443 42663 203626 272542 310300 152764 246364 205775 115439 184816
21746 184816 322413 415044 343447 266673 165258 -94596 20545 -2475 -76128 90229
21736 90229 147511 46858 -61339 -196823 -134965 16578 -33955 32151 -20018 -59428 80578
21725 80578 57009 55404 10743 -34887 -65710 118550 145264 224778 261779 165498 87961 74457
21713 74457 142573 117740 -12448 -62730 -73846 -81562 -50676 153597 100896 68878 123992
21702 123992 155396 159355 173347 -52127 -64788 -11385 -31591 -139093 15156 13976 -123072
21691 -123072 -246139 -295032 -254288 -149081 -38274 125015 35636 -86593 -230991 -273038
21681 -273038 -358980 -163223 -34171 -48637 -255254 -285714 -143366 27531 45068 156811
21671 156811 96166 -35767 -58947 -139316 -25999 -60054 29893 182529 237082 157516 72981
21660 72981 30667 16686 -52061 -189095 -143238 -220260 -429190 -429459 -396232 -88335 -67659
21649 -67659 -137779 -123856 -52152 6710 79698 -20011 59098 204322 176507 98080 74716
21638 74716 36704 -25996 -64298 -40011 80041 267269 167379 62660 54327 -27336 -62807
21627 -62807 -89041 -135576 -10713 189678 88061 -142024 -118815 -133149 -145049 -182524 -209883
21616 -209883 -251869 -249546 -116778 -85228 -81751 -75969 -182201 -180858 -198856 -113971 -178917 -165170
21604 -165170 -140407 -315943 -186709 2789 33280 66942 15227 79253 203830 197860 155433
21593 155433 165476 100161 -29787 -81736 -144238 -145527 -171443 -63649 -83783 -159111 -35905
21582 -35905 215758 217474 251965 253377 115959 45484 175185 223646 190664 63831 3285
21571 3285 90262 104718 -44925 -13098 126279 98549 21099 -31157 -33638 -60363 -33701 -57220
21559 -57220 16814 45759 59041 61077 115237 116466 167266 73386 119147 138235 204109 110146
21547 110146 -13308 107324 228901 189290 309653 195609 156745 208065 188834 149724
21537 149724 68050 -28508 -24878 82742 57404 -870 -15201 -82208 -80620 -70731 -57571 -241797
21525 -241797 -224990 -153314 -105635 -77288 -106749 -89997 2751 38195 -52661 78469 -3073
21514 -3073 -33070 -94937 -93784 35473 198605 149572 192123 116911 17487 52651 87895 66442
21502 66442 133133 264217 240803 219024 238566 159058 161344 266349 283240 281606 94896
21491 94896 -132311 -187532 -144126 -209507 -38213 62281 180335 350732 346339 227083 21297
21480 21297 -21988 17714 122794 104306 91043 127139 58156 -96325 -195983 -146721 -6868
21469 -6868 163770 72700 28402 -92627 101010 211515 191730 17870 -74436 -118907 15323
21458 15323 51900 -43295 85205 119548 289727 232457 34234 -31096 -53823 -137554 -127800
21447 -127800 -115558 -3380 16340 79037 209893 141020 12967 127038 27638 160242
21437 160242 111252 135296 127564 1082 161281 38373 -249625 -78950 -147947 -125711 20266
21426 20266 83162 21716 64882 222314 240403 98452 -111088 -74720 -77620 -40864 129707
21415 129707 207693 64634 40364 212584 133337 128221 177541 111089 71833 254749 100429
21404 100429 -16839 -198983 -254843 -257772 -256633 -287426 -340953 -449033 -346981 -356374 -302809
21393 -302809 -143941 -55754 59230 76571 93730 -30071 -209352 -434095 -460039 -350048
21383 -350048 -293467 -166311 -174427 -161764 -52048 -94710 68 -86299 -116218 -63940 10258
21372 10258 153294 134447 130163 100890 103137 88933 193297 130097 149493 142616 109325 32782
21360 32782 -96430 -213002 -79887 72174 -16263 -142868 -293447 -283094 -147872 37880
21350 37880 102003 26850 -150481 3584 222518 219600 250299 237212 262739 329155 206462
21339 206462 43449 -111108 -147646 -115855 94593 30616 139896 207516 268855 33597
21329 33597 -157516 -36174 -175925 -172039 -14913 16135 -55459 -158641 -191203 -314725 -350724
21318 -350724 -287860 -336216 -281120 -176580 -121897 177088 160780 -16757 -110239 -54906 -28112
21307 -28112 154209 283401 222038 -73796 -179627 -235094 -226385 -120340 68898 93728 -9401
21296 -9401 -53543 -175893 -191077 41860 34953 -87928 3657 -53779 76927 51189 48183
21285 48183 141038 75909 108965 179231 167074 109281 147450 73966 -104451 -136985 -17176
21274 -17176 -21103 18352 -63507 74929 99928 98497 52445 -37468 -81117 -75712 -122486 -128673
21262 -128673 -82733 357 -77772 -50348 15989 18861 -122717 -93033 52878 60387 -147472
21251 -147472 -247182 -113106 96372 58040 112633 134192 63580 32810 -182562 -295003 -231404
21240 -231404 -72150 -109999 -257873 -205365 -93352 -70623 -15251 -81900 -41642 90225 65034
21229 65034 100175 -60808 -202521 -217438 -198599 -137215 -305069 -352502 -452153 -360596 -597
21218 -597 -2650 -223680 -358906 -221996 -287682 -300111 -255104 -230986 -266291 -134826 -58778
21207 -58778 -805 121638 165985 116834 162102 136396 151898 66902 39814 139922 126469
21196 126469 -48542 -31446 -98630 -146701 -161817 -64236 -175126 -40091 -120559 -131032 -128180
21185 -128180 -76531 -62913 19234 -16671 -58735 -86864 -147340 -12524 191976 187538 116144
21174 116144 -29345 -197809 -219026 -192051 -261555 -254132 -236148 -274241 -52527 208881 342035
21163 342035 187164 14752 75251 79035 -41977 -58439 100836 147105 197959 99986 40722
21152 40722 -15078 37457 23077 -55400 17349 224050 224820 95047 39303 227138 240930
21141 240930 101877 56532 29859 27170 -50615 -109145 -57160 -70317 -140453 -121028 -70425
21130 -70425 -1875 87378 99451 71954 107168 253477 364238 258118 87310 -169831 -220826
21119 -220826 -188508 -169131 -260839 -253389 -316259 -144276 114327 49998 78238 53846 -144569
21108 -144569 -150371 13254 76147 98270 189558 269142 233219 193264 122672 11826 -30771
21097 -30771 136425 143993 330 -219525 -395395 -382239 -349698 -247455 -92446 -145648 -319820
21086 -319820 -159960 -55448 32563 194634 210649 -98654 -111438 -248037 -242478 -149225 -92619
21075 -92619 68400 -26245 -287145 -286465 -266699 -267032 -35805 186108 132242 66081 -115820
21064 -115820 -67515 -71750 -56847 25702 14491 206930 151751 216581 280056 228739 -62028
21053 -62028 -170032 -172669 -81406 -44179 -86453 -181493 -221533 -311690 -396149 -362135 -179480
21042 -179480 -6595 9458 83194 5466 -171532 26615 178734 149326 85243 50756 92442
21031 92442 208107 253096 178420 126893 17457 -38755 -189153 -175141 -112150 92263 62430
21020 62430 -73978 -2016 65344 -54375 -55291 -20646 -212433 -94963 55876 182068 41184
21009 41184 -105979 -157976 -155049 -121374 -19111 103881 127507 227448 230742 357481 326697
20998 326697 164923 26859 -198437 -379527 -393603 -276428 -170839 30276 212666 255542
20988 255542 76545 -57786 -37508 185143 151595 213828 169288 60972 56690 -36 29889
20977 29889 67980 81747 13708 -24742 -46984 -23298 39560 182176 279351 303253 298381 372028
20965 372028 385116 272897 79531 -23241 28634 -90258 -161677 -108639 -73424 -46853 -23087
20954 -23087 -34069 -94266 -246588 -420338 -433363 -236269 -275525 -62575 -73795 -215306 -147873
20943 -147873 -136463 -137439 -124725 -47919 -112719 -113170 23180 127269 195812 146505 166402 106411
20931 106411 164345 279195 166252 171701 146059 134089 -18312 -79754 -18106 85765 126415
20920 126415 115871 169212 106791 -164174 -122059 89208 31989 -106172 -161758 -265337 -297915
20909 -297915 -166671 -75527 -165660 -99705 -36401 -214822 -193493 -139830 73008 11647 -12427
20898 -12427 160803 300297 91311 -35770 -133571 -262330 -159158 -141551 -28872 -55214
20888 -55214 -23356 152876 106368 55561 43634 17942 -52180 -116779 -260186 -295080 -280080
20877 -280080 -147207 -63337 17078 207739 143502 72237 110389 25172 23043 -36047 -114785
20866 -114785 -107315 -26861 114888 74957 -80255 -192617 -183308 53920 230427 195664 -47338
20855 -47338 -165968 -81596 -31803 -8513 67690 169917 267309 251725 220179 -27617 3090
20844 3090 -84887 -148742 -133148 -73927 -112435 -85442 -50033 -116575 -156729 -98786 -18579 -4440
20832 -4440 149739 160994 94507 121154 -98307 -97708 -36589 344 53304 -120945 -49725 177166
20820 177166 1321 -180394 -297375 -141076 31945 -16168 -48409 39411 63669 163932
20810 163932 244908 -7901 -156993 -297730 -246583 -212568 -130949 -19466 -186072 -293438
20800 -293438 -284122 -202531 -192686 -115105 -65051 -107676 -178984 -192758 -113614 -38134 -119426 -199680
20788 -199680 -120947 -187086 -209809 -163208 -111556 -84336 -178826 -273207 -273536 -350539 -407865 -286035
20776 -286035 -171176 -226334 -251697 -81180 -54975 40326 73382 78415 99648 127836 67528
20765 67528 83927 140733 258177 238814 128958 57695 -27342 34875 11201 37853 244004
20754 244004 200220 103424 10855 87249 20948 -142596 -36718 -63783 -212267 -43576 281525
20743 281525 87847 -121725 -23212 26313 -4719 -86174 -118906 -224682 -215088 -166444 -225150
20732 -225150 -54575 -21942 -85249 -106419 -82774 -3699 24731 -149253 -253295 -288521 -222571
20721 -222571 -87016 -137256 -31408 56894 69790 106787 63922 4970 65706 -18192 -87985
20710 -87985 -9942 -35793 -57965 -141863 -288429 -249582 -173453 -87514 -35836 -57189 -125274
20699 -125274 -237961 -112353 -79418 -104511 -126838 -50336 8171 -78548 -143436 -157664 -249743
20688 -249743 -243676 -374044 -415960 -527633 -513058 -504404 -295039 -183219 -357208 -276938 -195029
20677 -195029 -9306 230760 118087 -53738 -66228 -70943 -42032 -115933 -264194 -251393 -141410
20666 -141410 -21626 -51609 -137159 -188547 -269450 -104136 38910 14419 -32915 -152113 -57149
20655 -57149 -16416 -17044 -3573 -100307 -247435 -396232 -363053 -402763 -354353 -261388 -181754 -73645
20643 -73645 38863 84284 26031 -4511 41918 -109102 -146348 -134206 20553 261495 146249
20632 146249 103883 185539 196686 81478 50878 -97229 -164750 -97597 -23029 -90367 -234433
20621 -234433 -254944 -126446 -126973 -160602 -173016 -127653 -89621 -58287 -90090 -79284 -174782 -280339
20609 -280339 -199117 -134253 -173366 -50399 131521 137031 70480 -49776 -116818 -132719 -33878
20598 -33878 -13890 -165838 -104502 -58201 20146 172197 246585 268535 213802 -11232 -3608
20587 -3608 5539 -111565 -182007 -111892 -203150 -383965 -342374 -284903 -378142 -160619 -111620
20576 -111620 93519 289160 356757 386856 244836 212041 279798 84123 47202 -96051
20566 -96051 -62053 634 -49360 -63414 -121803 -236663 -357800 -234353 -315609 -322530 -229788
20555 -229788 -258285 5335 37496 -56240 -14199 7325 -100979 -87248 -66792 -144518 -98045
20544 -98045 -34907 14296 34667 40308 -50359 123513 42866 -117421 -105300 -192947 -160337
20533 -160337 -285226 -163764 -80374 -106149 -159674 -97043 -99939 -142869 -242900 -148210 -81199
20522 -81199 -156736 -73116 -173934 -154599 -197010 -159548 112511 331607 442158 364077 260153
20511 260153 148070 153449 69435 -58333 42853 127022 224441 186014 145990 290922 359249
20500 359249 348495 203552 180916 82610 -37836 -130499 -103116 -19752 47227 150132 54111
20489 54111 35805 -69661 -296790 -271409 -226027 -132173 -5315 -84 -43640 25426 136150
20478 136150 148587 114464 27014 49634 -8640 43438 -108841 -227582 -235379 -137126 -48687
20467 -48687 -65484 13909 84645 8921 144533 234319 129523 -25396 90285 58625 108638
20456 108638 111325 -42716 -86615 68301 103161 17907 -135517 -188154 -68831 -12426 50820
20445 50820 23006 -21958 -84269 -175700 -152195 -284856 -295138 -339339 -77591 -26227 -5182
20434 -5182 66075 121001 -41485 -258583 -367657 -224306 -124668 321 253200 447526
20424 447526 548886 337258 136282 97685 137563 -18408 76294 56650 -60387 -25252
20414 -25252 -108892 -104745 -139933 -75579 -59228 -42653 -66321 -94106 -25225 4082 86373 -83904
20402 -83904 88513 256717 208662 47343 1072 -11729 -57481 -43921 -58055 -7929 -101673
20391 -101673 -310821 -401626 -351421 -277537 -108536 -21263 -107737 -191551 -126829 -122230 -159953
20380 -159953 -53417 -30463 -97351 -9967 124102 119740 -32883 97132 132406 13792 -79081
20369 -79081 -138282 15936 145672 128888 110279 213528 171331 32793 -80134 30563
20359 30563 67074 110388 175407 135929 173896 64096 -176774 -305672 -178220 -118661 -38497
20348 -38497 112857 137742 51564 -58701 112027 294023 319613 293672 287285 203891 72815
20337 72815 141796 -16872 -6268 93019 72055 -7770 -136224 -72907 57238 -87107 -95572
20326 -95572 -25503 -143733 -159043 61730 110883 38270 101461 100705 -75131 -75955 141664 382978
20314 382978 514509 430626 176775 80267 -125296 6602 159564 126338 74196 243855
20304 243855 178768 76808 -28432 -74904 -213479 -251574 -251288 -354765 -143314 8898 -25871
20293 -25871 -111027 -202248 -201238 -191779 -50081 43464 51647 -14512 -157611 -272570 -66156
20282 -66156 105273 22406 -128865 -21385 -31442 -65063 -199081 -143512 -15991 99746
20272 99746 41538 -9806 25984 -5568 -24461 54705 102665 -36100 -122169 6212 222868
20261 222868 364315 278617 271942 307755 396433 294893 52181 -72406 -141115 -128989 -33769
20250 -33769 97932 308655 182144 68117 -75748 -68162 -52280 -80090 -113880 -153283 -189603
20239 -189603 -200665 -158455 -107130 -166545 -68530 -64534 -85188 -171685 -360646 -253609 -234528
20228 -234528 -159249 -21250 51392 84927 10991 183296 370778 268423 161712 144294
20218 144294 97091 -11840 -21502 -85802 -215839 -303643 -316713 -159979 -23839 -38513 -14471
20207 -14471 100670 250734 145337 224427 147807 128679 175284 247349 272527 178083 147846
20196 147846 105697 75197 113225 84143 22890 123578 248136 279769 296153 203672 156023
20185 156023 176984 95014 10026 -69794 -108633 -205700 -92991 -66911 -199555 -344985 -218859
20174 -218859 -165592 5653 -21321 8233 12203 -80922 -74614 22852 20463 -56953 -159954 -253718
20162 -253718 -47352 147703 273427 242729 129185 62355 -62180 -82401 -85780 -129255 -246158
20151 -246158 -123538 -7960 -169944 -283409 -289285 -191008 -15630 -41221 33949 -37930 -72971
20140 -72971 -94950 -26742 5794 -45755 -169181 -110497 -69998 -151177 -282387 -145099 171492
20129 171492 183647 70804 62808 114190 66311 -138165 -161357 -209443 -109689 -8987 -65367
20118 -65367 -213116 -178717 -35337 69762 137590 132054 162164 227042 242264 224359 298311
20107 298311 267851 228213 43491 -157233 -330316 -263479 -164638 -119255 53110 209004
20097 209004 75492 -4121 36679 -43803 -175770 -110159 -81521 -89303 -120293 -41778 -99612
20086 -99612 36111 -16689 -48479 136291 104478 95092 87652 56692 -10415 -51566 61240
20075 61240 84554 124585 188142 67336 -86633 -185491 -230255 -133412 21571 70655 48386
20064 48386 -61943 45489 -56373 -164147 -68883 -2697 21659 -3439 45448 46333 -3207
20053 -3207 210712 209867 158734 42992 -78513 -103198 119265 135543 40838 -81980 -25634
20042 -25634 -103675 -206453 -135364 124748 205397 184265 103264 70349 3643 -56498 -121825
20031 -121825 -39932 120802 238917 249849 235930 184086 201530 158925 71431 -78069 -107067
20020 -107067 -42839 57934 3524 -82597 53869 54117 -2646 -124278 -147389 -297599 -347106
20009 -347106 -298388 -294458 -198046 -181620 -118517 -69212 -186512 -243007 -144043 -50572 -39255
19998 -39255 -44315 -41187 101216 92654 33622 -125114 -151438 -23128 91445 101271 -163611
19987 -163611 -90266 66060 6550 -78744 -155007 17433 65572 68676 69068 54997 61354 82833
19975 82833 65968 -45423 -151788 68241 198359 41294 11620 -64489 -96862 -71967 -41414
19964 -41414 13038 30581 -40746 -235432 -204105 -3575 -144927 -66906 137454 251935 236585
19953 236585 211600 145907 77196 -14846 -112400 96584 142803 147021 96793 -96176 -259737
19942 -259737 -230436 -154203 -122365 28531 -43264 -104746 -27565 73894 197909 357791 267007
19931 267007 75037 -25317 8198 105482 195512 145901 -41888 -69970 -88825 -272645 -138211
19920 -138211 -81255 -113937 -158998 -99080 -110904 -143600 -232341 -54845 -14733 93443 99244
19909 99244 -135239 -142922 -102665 -193981 -293204 -284898 -253605 -218302 -22486 66981 92744 96513
19897 96513 -50007 -106091 50123 187836 141071 74568 45566 63872 301587 292576 165459
19886 165459 165918 218869 113473 35741 168922 176745 232649 167505 162780 69834 -12413 -35161
19874 -35161 -69315 -184105 -7867 -42753 -126762 -200036 -271554 -203353 -94466 -132522 -125404
19863 -125404 94335 39595 -27708 36204 -98405 -91867 -104957 -152574 -136157 -138293 -146672 -212734
19851 -212734 -216261 -153777 -249210 -275738 -296260 -278030 -89601 -180003 -146941 -239127 -344971
19840 -344971 -172448 -99263 -51751 -46658 -163784 -377125 -485216 -295329 18091 -69245
19830 -69245 -230838 -182480 -173861 24792 55627 -43803 -112604 -72398 -82293 -78813 56117 20424
19818 20424 126247 137857 202316 178108 134821 57875 -28747 -121478 -167490 -68981 38383
19807 38383 94233 9001 -131274 -157555 -86884 -111540 -91448 -114206 -173860 -16840 65474
19796 65474 79068 -27127 48546 64796 35194 65027 -143 -113827 -71321 -71557 -38407 25691
19784 25691 -118695 -192878 -115727 -123594 -9667 101666 135829 192771 129582 168074 285030
19773 285030 280312 308034 208746 197359 9324 -93303 -128040 -109574 -149012 -220932 -79958
19762 -79958 140770 140047 -18449 117715 89120 212590 137786 188901 205436 170392 64017
19751 64017 79233 6977 212306 117966 44018 44939 29063 -51258 1239 67322 -73207 -71260
19739 -71260 -37951 -14470 -6806 -33391 68680 32057 -178275 -322777 -247705 -15627 73185
19728 73185 -98376 -99772 68761 23021 137852 45821 60017 195845 121153 85655 -35046
19717 -35046 7179 35299 210620 137325 44863 -72253 -223753 -98723 -220463 -209115 -82329
19706 -82329 10188 48276 -7820 -130146 -183644 -103053 -40264 -25145 -34638 -97160 -168791 -117300
19694 -117300 -58273 100200 74686 56922 -4941 -209 121087 47731 11337 -121712 -117462
19683 -117462 -141785 -103274 -38357 8166 112818 133551 98409 222767 375149 350144 188106
19672 188106 261833 229631 242047 280953 254773 278707 190742 170605 74375 -104081 -118195
19661 -118195 -170821 -361258 -328874 -254391 -212356 -238168 -144337 -1597 -10805 -39094 -8701
19650 -8701 108410 219033 83735 -49250 -27187 20547 -68226 -249693 -158004 7873 49323
19639 49323 15238 29788 -29826 -49861 48536 199948 294874 214182 122528 14646 112669
19628 112669 383045 408091 162536 218773 417942 218569 214704 267018 238224 208203 104210
19617 104210 28757 -119306 -116368 -84202 5453 -27484 -323048 -393953 -289817 -129248 -42715
19606 -42715 61086 130202 -61831 26393 95232 -94077 -156523 -13476 30365 -22137 -1354
19595 -1354 86758 65100 101339 171159 55500 -38124 -85249 -78319 -77509 -142185 -144012 -103091
19583 -103091 -30779 -13133 47883 113539 71774 15064 10502 32453 101999 184248 113025 18290
19571 18290 -35045 10493 232388 182079 205286 312794 257364 147489 -115868 -167368 -134365
19560 -134365 -212218 -292440 -113035 14275 170451 110016 70681 -100853 -219328 -179182
19550 -179182 -201341 -210711 -77164 4094 134599 129632 48605 -19814 2093 -11622 49423
19539 49423 93988 131044 84133 89386 153186 166707 207024 52444 64852 195456 233458
19528 233458 256736 47975 115464 128145 73984 -149265 -164198 -114380 -132194 -72657 89525
19517 89525 189410 111563 -147444 -116496 -110633 -137124 -178623 -87888 116688 232629 299165
19506 299165 211751 -56354 -131361 -129083 -89525 -30763 -80999 -165176 -248376 -302257 -151568
19495 -151568 36660 -7038 -41930 -69287 68446 68187 4682 -190822 -338480 -94534 87477
19484 87477 -18425 -147126 -170185 -38426 -144408 -133996 -22006 4370 -65824 -130824 -107398
19473 -107398 -73658 23612 72674 36671 -27808 28656 41686 -3979 119950 167061 65694
19462 65694 121497 518058 620381 457146 357378 354013 382835 385426 181094 -21562 53404
19451 53404 17548 -25149 -158622 -237716 -31979 -52418 -138724 53276 225412 52008 26802
19440 26802 -5820 23274 -91521 -175306 -83703 174316 174108 8444 -91144 42277 134449
19429 134449 190863 30368 -43985 -105686 68974 54900 -39681 -81536 -123705 -48311 147894
19418 147894 417784 494193 466264 317484 158898 149334 265255 218200 134542 160185 208803
19407 208803 258227 156141 120007 -37988 90805 -41698 -229963 -183313 -9635 85960
19397 85960 -29654 48553 267274 401365 313944 351956 436816 520612 481105 430853 286248
19386 286248 206475 150596 43682 28308 35976 -70634 -6902 -47983 -656 2122 6578 71103
19374 71103 51609 -4250 108576 80600 -5311 -155841 -200624 90358 197197 97646 17998
19363 17998 -173835 -415859 -403219 -222527 -163587 -218301 -306487 -239229 -311809 -308857 -293992
19352 -293992 -405962 -304348 -92082 77212 10254 8387 -25242 -100292 58804 77387 36839
19341 36839 70439 31614 38024 188468 144088 -3333 -103343 -121469 17270 230980 335529
19330 335529 287910 331145 240949 226919 233131 155552 69215 -87715 -102572 16281 98291
19319 98291 14023 -21937 52415 117695 -18186 -69036 6318 60459 272256 400498 298869
19308 298869 182659 25927 -47559 -20698 -190712 -141695 -43701 61483 130293 272287
19298 272287 314766 52440 -5876 214831 386224 305247 134381 160472 292239 324265
19288 324265 238874 150913 135041 281574 278541 167819 115563 187444 377226 467841 295909
19277 295909 220180 280378 338794 150290 -7886 -104606 -125531 41254 275733 360289 347827
19266 347827 228852 217070 277505 202650 97415 35791 -52296 -155546 -69250 57826 152725
19255 152725 138928 154014 131673 59394 -61496 63318 -1168 -221902 -84239 43861
19245 43861 -114337 -11949 7003 -118902 -26000 84556 141523 227786 316211 343827 336519
19234 336519 242934 184237 101785 80352 105784 29422 82698 67053 28941 13825 -67048
19223 -67048 -157344 -160588 -25793 37348 7590 72094 206949 233725 333524 403375 382322
19212 382322 295450 249315 325601 246618 201602 66524 -13938 -991 28016 37764 96566
19201 96566 59072 152992 137989 203948 238321 136025 73393 145081 190655 231219 222244 264756
19189 264756 -12278 -325050 -307945 -236481 75043 130357 78397 91484 110166 197821 163059
19178 163059 155501 227128 7711 34039 98447 53249 130300 214576 315952 366760 183180
19167 183180 -37034 -5453 243965 191681 84426 168205 230082 300507 383038 514765 726267
19156 726267 909783 1076848 964625 850033 831291 790370 853801 630533 424178 435643
19146 435643 506390 561963 484182 425241 473372 562116 778177 859510 724787 642832 859185
19135 859185 809953 766656 832244 721737 593371 526771 424424 154338 52557 69088
19125 69088 145550 153882 241790 205717 201986 163297 81144 89674 43717 -12362 160524 280302
19113 280302 278721 240078 382537 288944 257709 209590 226520 287898 380271 369030 465919
19102 465919 605832 511265 162176 39328 -54702 15296 47171 -134004 -104332 -6181 -13356
19091 -13356 -44534 26449 -27705 529 44941 149418 89445 78843 203763 258786 447027
19080 447027 470423 244638 184600 187940 96545 72645 165108 70124 32266 63285 302861
19069 302861 257630 19364 17913 70867 163004 55218 36929 -4591 150 76100 102854
19058 102854 186064 201634 190163 105927 143331 99494 29393 1824 76812 171243 336986
19047 336986 366140 407827 490528 354691 162685 230079 455775 579194 546671 316626
19037 316626 220083 227538 232419 145154 76270 100612 187881 101024 317160 413560 239102
19026 239102 78611 29600 123052 272858 178857 69408 135569 159361 14602 27276 78268
19015 78268 171116 333429 189710 -42676 -163218 -157766 -125667 40437 -15721 -54498 152506
19004 152506 284261 207164 191597 434 -94364 94183 204912 108537 113326 175479 47832
18993 47832 21166 177443 343454 323623 393137 362126 260427 290027 266766 207582 191577
18982 191577 51020 76835 119473 248928 515735 371426 161777 -799 51013 152871
18972 152871 114162 29189 176087 351399 424242 226504 137512 191848 145319 22257 182901
18961 182901 451227 522314 322760 215354 14379 56693 83228 129393 215157 52728
18951 52728 -199761 -200990 -78693 157744 229120 275301 198892 -41945 -72868 50934 107048
18940 107048 127980 92485 41816 167959 201231 157398 187498 164089 125846 51698 -24797
18929 -24797 -53885 -98434 164930 260626 247877 280849 99920 172693 475279 360716 227055
18918 227055 185273 340973 497818 447973 300599 215720 163512 149751 268378 324848 334402
18907 334402 446243 424124 222324 153581 66718 131340 173940 252062 315672 499563 526146
18896 526146 480496 457753 512230 474837 367322 351763 343817 470247 596865 456703 339413
18885 339413 364244 405048 325367 224509 18948 -12965 37108 111741 330614 537334 534693
18874 534693 376281 529481 618849 446095 440031 550720 408100 450593 396650 169225
18864 169225 230248 439506 637369 892940 808080 706487 690901 770470 775524 761954 496169
18853 496169 310975 228944 373809 431083 324924 446120 547389 807309 912060 944357
18843 944357 1121552 1452110 1886211 2011503 1880485 1687562 1551090 1481200 1293246 1094456
18833 1094456 1099849 1314630 1664142 1983380 1734885 1233943 958369 787039 879945 683564
18823 683564 476223 669870 581234 461491 475020 509951 559451 625985 653541 548860 617216
18812 617216 733045 651464 461973 278334 249387 508133 455113 298116 285476 386659
18802 386659 366132 417875 613326 755492 899247 820346 613133 510859 483141 636570
18792 636570 802314 1177940 1614080 1805011 1783477 1639025 1466583 1377907 1227534 1069619
18782 1069619 1075317 1246277 1660314 1879963 1739561 1638727 1540906 1199986 935173 952773
18772 952773 1072014 1221123 1242749 1313024 1629701 2272409 2867717 2666022 2201509 1614743
18762 1614743 1245074 1225470 1255661 1217333 1236163 1366085 1366771 1376226 1626648 2093498 2493395
18751 2493395 3086076 3915146 5090042 6053337 6306986 6237548 6269037 6392564 6131229 5448021
18741 5448021 4277731 3247299 2778190 2555071 2277404 2114651 2175339 2491137 2915075
18732 2915075 3447083 4124808 5241974 6155258 6460211 6537195 6624609 6663709 6134319 5040685
18722 5040685 3835758 2808142 2166362 1676393 1400210 1177769 1061169 946766 847968
18713 847968 868725 919093 883934 765299 760589 679929 569763 571458 525460 567208 651463
18702 651463 717150 800510 892740 891421 803521 748771 781325 735021 770954 805112 705659 497832
18690 497832 479868 661152 603840 483683 527291 665662 808569 756369 554728 551181 548487
18679 548487 385440 304531 323262 284070 432039 636738 629858 523992 497195 548331 626327
18668 626327 671686 750106 854546 915807 881546 931507 978137 879944 983007 1223085 1086502
18657 1086502 990346 1165681 1307011 1217647 1149495 1067146 986275 1164810 1228313 1252234 1311769
18646 1311769 1252717 1268131 1232736 1229173 1321460 1458696 1410529 1451982 1746030 2024646 1943102
18635 1943102 1861770 2163677 2467762 2706018 2769723 2944423 3037195 2929748 2719914 2730991
18625 2730991 2848475 3024670 3194044 3223881 3332952 3709579 4305168 4835095 5378787 5997878
18615 5997878 6787440 7372038 7910162 8643156 9511690 10468142 11502750 12687160 14158035
18606 14158035 16190604 19020462 22852901 28165518 35590972 46248622 61939871 84436642
18598 84436642 112023876 132078031 136568433 134990822 137248437 140154475 130033400 107723108
18590 107723108 83324387 64086514 51869435 45098419 42202055 42388848 45662838 52000328
18582 52000328 62621620 79570107 104529939 131914164 146379082 145166169 141546766
18575 141546766 142987901 141180880 123979659 97243190 71075512 51249667 37954269
18568 37954269 29184668 23228831 19043291 16169909 13934567 12399293 11196320 10397964
18560 10397964 9994813 9339604 8558634 7727872 6977790 6245441 5592869 4991790 4498171
18551 4498171 3902817 3495880 3238265 3130446 3039686 2970186 2870634 2858414 2851381 2854863 2808411
18540 2808411 2729629 2617018 2385454 2265339 1878509 1414491 1318956 1314774 1114349 1201503
18530 1201503 1202604 1139562 1040800 1037121 1157422 1208376 1271174 1252482 1035802 1045332 1001364
18519 1001364 1016047 1056288 1013024 865252 886914 1070839 1058201 1027240 1198560 1356510
18509 1356510 1484642 1340293 1038455 1050081 1019237 1037405 1053898 986043 735615 545249
18499 545249 504452 524863 526080 592718 593067 672309 744568 832948 808260 671014 599334 576240
18487 576240 577011 608015 493921 432820 261784 137212 112486 211988 198811 334163 323019
18476 323019 308779 442769 606593 508667 404452 387718 544971 517539 450186 409711 432004
18465 432004 522955 539547 623452 748208 932829 991316 1039173 1005676 878014 732584 772996
18454 772996 695192 876777 996445 960103 766532 664951 651616 773096 867424 720322
18444 720322 651007 833699 897790 934979 1049420 1145641 1307463 1363116 1473934 1740142
18434 1740142 1999373 2411750 3150817 3805068 4004464 4198894 4241858 3687667 2961259 2271925
18424 2271925 2070130 2205572 2353212 2637831 3068807 3829204 4764903 5520239 5803772
18415 5803772 5474971 4769290 4199521 3690489 3264976 2928510 2522893 2259337 1958216
18406 1958216 1658786 1378050 1225062 1172561 1275423 1298441 1394492 1365130 1372904 1492158
18396 1492158 1470020 1667908 2032316 2401850 2630421 2844310 2831758 2537528 2232984 2032550
18386 2032550 2048407 2209512 2155669 2258150 2510001 2783691 3001912 3162948 3800301 4778004
18376 4778004 5647931 5857679 5608278 5375317 5095254 4793311 4771849 5252583 6266289
18367 6266289 7058717 7204728 6685158 5752551 4707299 3777588 3408630 3447889 3498680 3472394
18357 3472394 3647000 3986254 4045124 4053671 4001088 3574019 3338540 3210334 3324332 3422286
18347 3422286 3536356 3694850 3881720 4101248 4457962 4663513 4756147 4900074 5082115 5321326
18337 5321326 5900901 6624588 7090926 7710395 8175771 8195246 7985670 7882112 7988688 8438163
18327 8438163 9045868 9935981 11048005 12381644 14053602 16351664 19721813 24406206
18319 24406206 30307434 37913755 47554410 59935215 77562310 106207643 154387888
18312 154387888 223198895 270963512 274441525 275709921 288893889 272223914 214950066
18305 214950066 151690326 100714693 70486881 53240841 42641585 35494693 29946447
18298 29946447 25435470 21703508 18914311 16800609 15252111 14320932 13794055 13461975
18290 13461975 12884206 12465321 12608838 12979533 13435444 13794680 13949115 14142138 14358770
18281 14358770 14061154 13419182 12796589 12762871 13103696 13723630 14424220 15274650 16575952
18272 16575952 18271457 20684565 24341173 29467801 36137835 44592418 55436071 69694816
18264 69694816 88551808 116189153 160422151 234198577 335291677 407733514 437657913
18257 437657913 431630840 357435616 260543159 174895752 116418626 82487291 61732910
18250 61732910 47994621 38819158 32637522 27942926 23834016 20318656 17560337 15611879
18242 15611879 13992859 12568665 11521824 10772379 10196959 10005213 9905082 9633240 9099215
18233 9099215 8581258 8134100 7350642 6404449 5536107 4996420 4928943 4976639 4768141 4376680
18223 4376680 3776359 3237427 2959347 2699640 2377631 2285176 2216997 2154763 2092246 2186231
18213 2186231 2255181 2154620 2082758 2096643 2173684 1861251 1666870 1652950 1621630 1531112 1361661
18202 1361661 1379764 1321918 1354485 1201064 1189536 1338815 1458271 1632798 1850783 1963151
18192 1963151 2144409 2051654 1876512 1603304 1590153 1591140 1386846 1136502 1329737 1480804
18182 1480804 1303026 1297559 1072685 1013309 1007373 1008714 1147500 1156182 1111632 1201960 1150874
18171 1150874 1286957 1574131 1496364 1520011 1668031 2088934 2481219 3051703 3017482 2768798
18161 2768798 2449650 2166416 1950924 1975926 1985766 2147811 2624895 3082136 3143390 2842607
18151 2842607 2450057 2216745 2119713 2050579 1990694 1968974 1899246 1862753 1849586 1984822 2096231
18140 2096231 2083874 2288961 2470603 2498658 2497090 2632556 2715148 3071294 3508151 3805036
18130 3805036 4263036 4641447 4965211 5454967 5876288 6350215 6973545 7886104 9114559
18121 9114559 10682321 12522021 14981023 18208417 22814734 28725893 36423439 46393532
18113 46393532 59208990 77097986 106318296 158762413 250519807 341335012 328378242
18106 328378242 249928022 163797931 101861648 67983591 49257923 37825333 29737350
18099 29737350 23644803 19109852 15928599 13393490 11292856 9689990 8462686 7401475
18091 7401475 6568248 6003477 5539344 4840262 4275349 3887749 3671295 3552538 3373550
18082 3373550 3075218 3159563 3215570 3059768 2981713 2797467 2647144 2552295 2387788 2396360
18072 2396360 2642488 2913416 3031944 3487667 4484925 5713763 6182887 5900202 5197865
18063 5197865 4555165 4196619 4027815 4082750 4199556 4786003 5538303 6040620 5926720 5126940
18053 5126940 4178727 3459700 2945725 2476149 2018149 1658567 1597853 1558169 1532394 1511104
18043 1511104 1518515 1555238 1505988 1504144 1337472 1240435 1365414 1363651 1721805 1984394 1977289
18032 1977289 1834594 1717084 1668764 1791672 1873554 1762873 1691580 1614170 1435682 1303910
18022 1303910 1316489 1246694 1259153 1438729 1641115 1888440 1923686 1988897 2013792 2038243 2058524
18011 2058524 2183683 2393444 2515578 2518126 2520555 2636722 2734038 2875469 3053062 3201211
18001 3201211 3165063 3203217 3228791 3562907 3865977 3633843 3469839 3422616 3460034 3378654
17991 3378654 3360604 3183731 3013247 2915072 2651625 2306145 2132068 2044365 2010202 1965137
17981 1965137 2030764 1887406 1795176 1727117 1638393 1769588 1795174 1795831 1778439 1969635 2128195
17970 2128195 2320733 2533479 2411222 2488877 2542890 2813902 3115597 3342237 3777811 4384795
17960 4384795 4963584 5043830 4735216 4287055 4082681 4116150 4257010 4422772 4428905 4484505
17950 4484505 4571647 4997507 5381244 5854598 6288533 6762836 7301968 7923403 8540249 9139540
17940 9139540 10149083 11763623 13662493 16050829 19482317 24165885 30448038 39602115
17932 39602115 54132476 77305915 106447412 120326665 110713389 93119631 78454843
17925 78454843 73487098 79341101 98122427 133442647 169932130 169112650 139600224 104634978
17917 104634978 78650359 65584831 61341517 64076297 74902510 94627158 114369114
17910 114369114 113379868 93332739 69372068 50638718 39501917 32709384 27431514
17903 27431514 23112637 19673795 17226935 15499974 14386579 13636337 13401270 13732435
17895 13732435 14548724 15526227 15371790 14817233 14263596 13739930 13826118 14556648 15548902
17886 15548902 16998054 19115823 22116623 26505217 32422443 39913444 49413574 61917291
17878 61917291 79843987 107904892 151965350 206527051 245986211 256738127 228216350
17871 228216350 182412088 144940848 126504073 130104646 147434499 152507599 133441402
17864 133441402 106437827 82792859 68623488 62509357 63177145 71215898 89057121
17857 89057121 118024919 141971035 135694825 108878931 78874000 55304853 40166124
17850 40166124 30647320 24440468 20034132 17074209 15200813 13926598 13225963 12694505
17842 12694505 12516174 12946567 13805868 13781131 12808892 11346710 9990563 9318362 9177064
17833 9177064 9021278 9144800 9696660 10736571 12180621 13449792 14652435 16200789 18506916
17824 18506916 22000128 27360057 35415438 48078056 67729144 92945370 101862560 85293146
17816 85293146 61183192 39894033 26912195 19480785 14975917 12177721 10283661 8516474
17808 8516474 7108639 6060212 5291094 4735720 4376933 4060035 3762331 3430545 2983379
17799 2983379 2719943 2486686 2286600 1939891 1868493 2025884 2054996 2085114 2076159 2157607
17789 2157607 2069249 1825568 1519668 1301735 1253429 1322975 1414376 1439720 1723984 2235151
17779 2235151 2482270 2338018 2244818 2380478 2541173 2507217 2043528 1736915 1672283 1518614
17769 1518614 1419789 1672553 1799582 2071698 2367338 2680002 2565577 2353219 1873512 1439184
17759 1439184 1229220 1136675 1222546 1456304 1560855 1403748 1393299 1213710 974400 817835
17749 817835 783734 925672 1023313 970993 960281 964605 854578 716010 547877 451017 390317
17738 390317 413052 602911 740615 621768 483982 480163 348767 366700 416866 332719 417676
17727 417676 656276 800478 1083093 1312271 1047364 903377 723104 764898 780853 625262
17717 625262 597741 624703 682842 885722 1095033 936213 659397 367981 197242 201581
17707 201581 282846 346272 338896 213120 516 8030 240092 419468 520733 382091 272503
17696 272503 337311 292528 260324 111490 107958 161919 86571 276037 370306 405184 311076
17685 311076 306824 533520 474870 434248 432410 559068 617379 634459 564498 402257 256659
17674 256659 347343 223525 168514 151104 243124 121020 182671 133401 206302 155382 -58411
17663 -58411 -12445 39818 83149 232005 281763 206067 151729 399890 629740 673658 598083
17652 598083 383045 174925 186908 251533 367025 430721 469797 498013 499440 638632 675558
17641 675558 633230 394233 299341 429096 465139 335016 303487 285367 333397 345755 351134
17630 351134 279762 272231 318996 514278 510013 573770 386825 284743 71371 256027 492951
17619 492951 639523 508914 489398 460939 245241 234275 318435 372976 411576 458294 419275
17608 419275 462814 582564 505907 176142 111542 208786 204416 248823 356407 451573 548035
17597 548035 426996 326919 404770 574875 575622 408889 366092 500700 648567 741897 696207
17586 696207 719122 634473 598132 734140 775690 657021 427503 415603 551378 590845 493800
17575 493800 535615 544975 683660 763891 676083 721626 882998 780018 707857 816701 822817
17564 822817 975389 1054440 1213120 1503999 1509291 1404565 1583097 1551513 1535886 1707136
17554 1707136 1974834 2288842 2719129 3088118 3605052 3837883 3784654 4015523 4340793 4525655
17544 4525655 4837142 5245765 5536415 5846820 6243300 7087444 8341140 10015370 12371326
17535 12371326 15182165 18891380 24107017 30829578 39691601 52540933 72307480 102681622
17527 102681622 141030171 165587371 165684813 159967693 162870671 167204250 150091406 117226955
17519 117226955 83401533 57485953 41022574 30509821 23730652 19175327 15871895
17512 15871895 13364948 11206825 9523585 8541114 7870240 7202371 6561134 6183646 5931015
17503 5931015 5702118 5503203 5147512 4899881 4847211 4796084 4729639 4582747 4540450 4510210
17493 4510210 4508792 4549756 4579160 4705828 4760602 4906741 5102475 5317635 5933293 6733642
17483 6733642 7816979 9260480 11156663 13571540 16794559 20875303 26134058 33301405
17475 33301405 43962812 60698386 85906227 114711858 128153961 124842296 120920773
17468 120920773 124898014 125630293 108120189 81792905 56879463 39234639 28208633
17461 28208633 21102986 16589467 13455221 10989633 9056557 7610485 6455851 5915430
17453 5915430 5352775 4720946 4250568 4137255 4117402 3930517 3683708 3601718 3558571 3519749
17443 3519749 3845853 4371176 4268052 3772773 3320528 2863945 2866343 2936644 3488929 4311930
17433 4311930 5193616 6650533 7672949 7702601 7428430 7578299 7747488 6930047 5398782
17424 5398782 4002242 2932644 2228536 1859492 1652517 1594655 1268069 1063739 1071910 1205831
17414 1205831 1492853 1588413 1367616 1033509 857912 723923 712618 781144 933205 1002960
17404 1002960 1019738 987550 1045658 1022824 1048619 1294210 1473543 1607546 1554788 1532630 1433489
17393 1433489 1309062 1278009 1181979 961718 888887 732170 686815 693492 647549 678169 876591
17382 876591 1287528 1759763 2048293 2846679 3934761 5110093 5669105 5413605 5188984
17373 5188984 5492188 5634272 4853380 3661030 2709829 1961114 1494287 1315385 1117204
17364 1117204 707551 561764 576714 466689 450392 329683 548822 742057 966643 1330377
17354 1330377 1309842 1241916 1195346 1147879 1473796 1641971 1708428 1667198 1574708 1442536 1254928
17343 1254928 1026654 851451 661422 537852 414428 428806 455495 277888 190176 124218
17333 124218 123501 133690 169352 70241 181897 301388 324860 278430 187303 221770 46138
17322 46138 -89068 -24481 58483 109259 29432 -37879 -171321 -130294 -150118 -94415 83650
17311 83650 159370 81116 80904 145173 158517 197020 79848 176121 464148 602584 651835
17300 651835 840416 1027890 1094660 1103658 1191130 1277863 1118528 901732 490872 409505 429953
17289 429953 375893 559494 415796 143889 -64944 -132024 -100547 48951 103266 91247
17279 91247 -2820 29537 138603 109618 -1899 -36172 28706 59465 216640 130710 174895
17268 174895 378420 422185 328080 125058 -118543 -109277 -4525 10373 -33566 2723 74428
17257 74428 -60119 -131540 -106855 -11803 -74754 -242034 -131639 -42964 23814 27997 -100448
17246 -100448 -86952 45386 -56172 -119030 -41869 172869 248174 278125 154513 58315 121295
17235 121295 187920 128083 46662 178756 150902 42340 63957 200546 272396 111488 103877
17224 103877 158214 144152 180718 75982 147372 271514 278123 149505 50012 -3300 -165450
17213 -165450 -266796 -261152 -133069 31053 110601 -104171 -77964 16007 -182222 -177358 -222614
17202 -222614 -255777 -165606 -35103 -116400 -245108 -198075 -182295 -122704 -81317 -66785 -153905
17191 -153905 -92362 -16629 -8711 47317 99300 95367 -66986 59648 292047 245752 187132
17180 187132 91218 16071 107098 94538 199900 112443 -13939 -49648 -71509 -72666 65543
17169 65543 106303 252715 293360 175169 -88205 -306291 -196045 -80012 -38614 207478
17159 207478 233568 167786 18215 -66011 -177075 -68370 -46772 -35606 -81333 -109188 -121803
17148 -121803 36182 25569 122116 80508 -104107 -163336 -81220 -110486 -63746 -12695 -20377
17137 -20377 4483 73761 225779 77551 -12224 -29971 2439 -33718 172341 193753 -57086
17126 -57086 -190582 -297337 -313033 -295842 -131239 -36984 145740 -22588 -197096 -187283 -95431
17115 -95431 -62077 166025 138979 138246 134035 -12341 -97835 -153585 -280550 -276139 -390500 -270923
17103 -270923 -29363 92063 54193 36177 -1713 -173250 -90456 34229 12267 -97468
17093 -97468 -123508 -145708 81312 197412 361757 276975 31876 -194966 -191205 -26170 -24510
17082 -24510 -218696 -249360 -273364 -182264 -251064 -310489 -272010 -271988 -97992 5203 73834 30032
17070 30032 -65457 -125355 6238 -83500 -134643 -149270 -66620 49076 28850 34239 12510
17059 12510 -88439 -167717 -181019 -289962 -80162 3725 -89342 85696 21230 -26495 115255
17048 115255 82652 25466 40752 128458 225233 174181 99445 159759 164304 139861 60064 5028
17036 5028 28288 51318 93077 99263 124818 303652 382593 85867 -153423 -151886 44687
17025 44687 234569 278355 275428 27682 42273 158202 289200 254692 94560 53444 84207
17014 84207 -250741 -428208 -203923 -105166 13695 -88952 -234409 -133381 -101627 -15194
17004 -15194 179389 217592 148826 195372 439144 727893 791723 922184 855552 850203 864910
16993 864910 795648 489042 294656 91015 115614 75560 -58588 111114 29366 -117264
16983 -117264 -121518 -55952 -117378 -59306 113550 93563 -289 -5857 -90748 -150427 -205394 -182381
16971 -182381 20209 167193 69069 -37160 -5922 -28865 -179283 -346030 -442605 -433495 -484398
16960 -484398 -432776 -293022 -39176 126388 13042 -243988 -283227 -200531 -80155 25275
16950 25275 64270 -13926 13937 184229 405085 573313 563257 599884 596947 609067 639946
16939 639946 577537 351375 343117 377496 437285 418475 302329 223894 175737 129050 25757
16928 25757 111199 165038 152766 180625 226264 217735 178434 119357 16960 -5969 135790
16917 135790 182835 8875 -162370 -46942 38497 25183 -160107 -284898 -225880 -96789
16907 -96789 -128403 -127601 63953 220784 216600 75027 -102617 -24277 -195773 -207444 -205895
16896 -205895 -245595 -269488 -232798 -149169 -129763 -50145 182980 164991 180317 115377 123847
16885 123847 113054 46152 -133117 -225614 -224832 -187948 -246454 -376122 -359466 -200709 -149833
16874 -149833 -61447 -59 -68143 -257686 -229327 -141021 -95806 -253795 -159091 -78529 -147403
16863 -147403 -153425 -218489 -190614 -77487 -134232 -106947 -96229 -125115 -108533 65835 304492
16852 304492 307567 320501 429677 192171 -185458 -322963 -335119 -175581 -253501 -163949 -244908
16841 -244908 -17494 32623 -38448 -144092 -329012 -425893 -248075 -83004 -198591 -172794
16831 -172794 -180889 34221 120081 -48060 -20493 -35092 -148864 -75070 -50598 -154055 -217350
16820 -217350 -141911 -145849 -164812 -285793 -84573 -79508 -104234 -55289 -67987 -201353 -202466
16809 -202466 -101072 -67987 12272 -16671 41194 65845 -16763 131664 120461 45053 67235
16798 67235 236485 262300 159144 -40411 -164320 -104350 14495 12178 -137810 -184095 50568
16787 50568 129071 206633 166339 119698 75587 -44332 -150370 -37766 36065 56517 59520
16776 59520 -108820 -63194 -25707 27809 95118 51185 -107246 -79541 -8086 131053 273324
16765 273324 324170 131603 144466 100384 69548 97829 108451 135657 113622 120362 77140
16754 77140 92251 85569 -81798 -102622 -188286 -138082 13735 103295 -1775 -22223 -101210
16743 -101210 -158599 -208917 -238495 -60466 -40676 -117555 -176268 -83911 25447 -41330 -163871
16732 -163871 -77521 51093 -69996 14759 -79010 -249719 -317618 -271331 -237391 -262971 -155092
16721 -155092 -55844 -143767 -269461 -148720 -228471 -70108 -50673 -140634 -86770 -10151 -18878
16710 -18878 -56508 -122216 -225993 -163328 -43788 -38709 20074 -58294 -188257 -112545 -96585
16699 -96585 -149629 -199867 -73671 22180 121443 190521 154122 66628 105379 3748 -6651
16688 -6651 100311 91855 76610 58283 85190 39573 -24023 -112017 -249703 -302367 -326447 -290024
16676 -290024 -216213 8341 45760 -50181 -143754 -168234 -245948 -274565 -156979 120776 126334
16665 126334 -11612 1965 100143 42221 -36942 105834 371373 257591 -29039 -60714
16655 -60714 33765 115762 105145 95463 86858 13649 28063 -40712 -54684 81449 95359 146953
16643 146953 243606 215536 101276 -49742 -168916 -213890 -151667 -183261 -221737 -192589 -86623
16632 -86623 -101514 -166278 -86696 -38841 -79003 -91033 -24776 -76813 -82479 -26992 10007 212159
16620 212159 160883 -126988 -132280 -135069 -154190 -109936 -95182 -84964 -77331 -47692 -224773 -259099
16608 -259099 -214053 -278255 -300625 -304611 -132745 40326 131347 -35695 -269412 -270166 6075
16597 6075 119651 65829 -199789 -356396 -343535 -99842 -77482 -199804 -124102 -133235 -225457
16586 -225457 -170255 -73904 3899 276 19205 -111897 -190485 -199334 34877 156903 157047 141323
16574 141323 187585 73630 -130269 1010 90476 73589 -177 -26283 51294 162114 208233
16563 208233 128414 148703 122284 88967 28429 63592 -18003 -37198 132227 156098 125141
16552 125141 22474 -57202 19383 108036 71399 -76731 -307003 -214277 39368 57383 237
16541 237 103576 36387 -6150 116861 319213 226324 113114 96716 105419 -2157 -2670 -46679
16529 -46679 -52334 183181 162300 148845 153677 106653 -130666 -141390 -56976 82515 -79630
16518 -79630 -210057 -220997 -117146 79500 52908 -67090 -104672 -46545 42982 28916 61182
16507 61182 149354 -68237 -187931 -114009 -61668 205655 264016 159401 -2966 -115446
16497 -115446 -64549 84972 -62005 -229221 -126812 58487 64468 -96497 -143208 26521
16487 26521 144669 45244 -25035 -30721 43782 -60870 -187671 -134929 80070 74662 24770
16476 24770 127472 50956 127381 12016 -15745 74376 41376 -23014 126547 120388 191674
16465 191674 229120 185091 213850 222763 294184 315087 246119 167690 255214 190695 143407 101298
16453 101298 155048 237094 142926 40728 50197 195711 234008 28588 -101161 -112097 -52239
16442 -52239 -42997 -75275 -81211 -36032 28374 -80570 -166790 -89809 -176535 -254822 -185135 -224345
16430 -224345 -200785 -67618 34815 -2098 -8393 116820 225895 212589 150464 67244 119195
16419 119195 202788 238072 216948 -345 -22430 -16725 -19515 -6307 -94119 -144117 -310229
16408 -310229 -271330 -69096 -36712 -161990 -42351 123049 40475 33475 62777 18426 -102890
16397 -102890 -238317 -26089 4730 30213 95043 40414 -214426 -316439 -238927 -126122
16387 -126122 8465 102339 26629 -3838 -208718 -243160 -194238 -43377 -144125 -203306 -92827
16376 -92827 163973 136124 102430 -33297 -22644 -110814 -115187 37332 62221 26458 -2938
16365 -2938 23695 163703 217138 91638 -172988 -60702 36728 -16804 -102084 -4448 18878
16354 18878 172340 115375 -99439 121089 183347 159736 108209 50784 33100 112707 187267
16343 187267 136133 -134030 -231220 -232269 -207393 -219085 -268418 -152451 -203751 -304440 -114060
16332 -114060 9695 -49573 -88170 -109548 -207383 -118289 -181413 -177168 -181344 -176265 -193419 -119919
16320 -119919 -90747 -100847 -155605 -154540 -183985 -137669 28967 244785 360186 254128 245193
16309 245193 168176 3696 -3752 -51879 32877 181790 223456 47435 92193 -47251 -297447
16298 -297447 -301532 -117147 17702 -62271 -185917 -128790 -167892 -360447 -371657 -152153 167182
16287 167182 206743 18740 4981 -38600 -228235 -223183 -182340 -91860 -84890 -33386 -69079
16276 -69079 -119090 -37721 -30889 -5844 135572 181470 56072 -25150 -53602 -72937 -253332
16265 -253332 -235826 -206898 -174910 -131075 -227422 -127362 80155 179991 240036 334935 311138
16254 311138 133827 74446 28545 5715 -10155 20724 -37933 -6400 -93696 16817 62361
16243 62361 -93761 -201913 -29546 125030 39739 -214846 -259434 -265418 -243496 -153940 -19144
16232 -19144 17425 140333 141513 14213 -40067 5384 -99234 -124585 -117795 -57874 -159652
16221 -159652 -200523 -49032 -35714 -37709 53892 157773 -63010 -190041 -194824 -208616 -61034
16210 -61034 12127 -119967 -56365 -84537 -172576 -177627 -229759 -135336 -204878 -119814 -121680 -54130
16198 -54130 -67865 -29366 40026 50326 -68128 -185169 -345530 -274882 -66209 -240188 -165903
16187 -165903 -111093 -39118 53605 133703 45265 144473 253658 344540 318076 237890 67052
16176 67052 9396 -60681 -183288 -130724 -118727 -155594 -105980 -186007 -31568 -108087 -116796
16165 -116796 -70771 -61573 -119076 -125674 43115 33184 222283 202757 -103021 -141551 -75403
16154 -75403 -102488 -175371 -291645 -58747 -13358 -20689 84558 12490 -108411 128183 292387
16143 292387 218891 111325 39308 -17732 -94182 -61266 -247102 -282811 -192510 -208976 -286029
16132 -286029 -120050 26100 145163 112601 13046 -184157 -211891 -218159 -173610 -156884 -151524
16121 -151524 63776 118452 -12790 -106043 95854 349147 369827 267202 175686 44507
16111 44507 -138722 -290423 -172231 -214 -36732 -71852 119946 319912 260957 102420
16101 102420 48420 150800 68081 33814 -51471 -116089 -73970 -65428 17104 53201 21915
16090 21915 -70886 -138493 -238451 -104043 59106 119995 64696 188679 185726 133001 95140
16079 95140 -2210 -87477 -88634 -20433 -18394 -61987 -100532 -36094 69368 55091 48751 137347
16067 137347 -56766 -219071 -282288 -347620 -299130 -98017 10987 41635 -120112 -294765
16057 -294765 -210155 -61594 62200 57611 48970 60740 62886 -47518 -53677 -148075 -262734
16046 -262734 -371383 -175894 -8097 45952 -20579 -134532 -70867 -123665 -88798 50022
16036 50022 230758 122753 -85976 -58940 81382 -56407 -56131 40497 68502 -49196 -38288
16025 -38288 11215 27028 -87376 -244334 -155620 -79392 -33658 -37340 -58931 53715 285437
16014 285437 276677 195746 145275 112088 99369 198072 110110 -124853 -121516 -56017 -91016 -69685
16002 -69685 4598 142111 153378 -70742 -254654 -266494 -116121 110495 30462 -96947
15992 -96947 14962 233564 192607 92981 -10179 -14661 20481 -66543 -152385 -111524 67279
15981 67279 -86197 -132036 -193435 -251860 -65024 45094 -71699 -11684 -68104 48917 319614
15970 319614 305240 99194 63410 -46045 76126 26083 67215 51190 -64775 -210255
15960 -210255 -299560 -327777 -173136 -84685 402 72895 116863 -6545 -171677 -282296 -103682
15949 -103682 -21235 -12948 -102720 -41155 -58787 -158718 -185387 -57006 -71459 -65018 13437 81880
15937 81880 63740 26088 73824 132471 204514 172156 227352 250416 31545 -166617 -16402
15926 -16402 141209 7938 -106386 -98350 -100645 -78998 -87618 -132203 -79760 -104382 -30207 70290
15914 70290 74162 186705 241366 102286 62003 6606 -60104 -43847 218810 115208 16700
15903 16700 -56936 -140937 -142634 -2542 224978 348501 165780 -17081 -14373 92261 181447
15892 181447 82015 -58164 28106 112868 -6737 -132152 -76775 89699 65185 -19469 -22416
15881 -22416 19017 104923 216584 29124 13291 75584 152367 259426 315852 173800 12396
15870 12396 -31151 -68922 -104923 -104796 -62174 -80766 -123330 -10298 59578 178988 224928 180627
15858 180627 130994 143700 14322 -205678 -187887 -83000 87153 104807 115999 39441 -36237
15847 -36237 -197528 -274841 -223140 -173598 -153093 -56454 64781 16919 -189266 -187081 -152971
15836 -152971 -138173 -63380 -18533 -125805 -271604 -220297 -220720 -235102 -101145 49528 -82000
15825 -82000 -75866 -61053 -163835 -21331 109457 -10716 54543 124629 245724 263850 114035
15814 114035 -78114 -91997 -233020 -135803 37487 69089 40866 -35021 -96603 23426 -7995
15803 -7995 3910 21030 -120249 -241891 -169394 649 220523 219210 87357 -53090 -72858
15792 -72858 -40914 -5624 -10510 -216224 -264313 -141280 -202961 7775 16537 -83779 -182132
15781 -182132 -123292 -75943 -29287 17981 -91840 -212806 -427689 -349668 -106913 -15084 -40541
15770 -40541 -126546 -176537 -264608 -278019 -64264 -8453 -45614 8491 -87811 -174086 -207243
15759 -207243 -251562 -282244 -167462 -87264 -50712 -82681 -2810 89378 120018 -28226 -63451
15748 -63451 -200228 -143138 -9354 -29773 -70957 -48287 -39004 -167389 -18774 -88295 -280237
15737 -280237 -268217 19048 124415 28705 144844 99601 102023 -118567 -323002 -538318
15727 -538318 -326477 -228449 -180604 -244560 -259022 -281522 -201596 -66605 -78610 -116903 -128
15716 -128 -58466 -33747 -52213 40957 15299 2697 26595 -47809 -85972 -161722 -376558 -209866
15704 -209866 -55371 -48475 46279 37083 141741 80730 -52475 -117265 -179079 -234001 -216161
15693 -216161 -87909 -37262 -90870 -62289 -1440 119974 108476 102783 214953 164931 65214
15682 65214 -35413 -220671 -87684 -27410 43449 90520 49199 -13881 90320 -2415 -87235
15671 -87235 52475 215562 361538 326782 432894 354747 -18020 -44885 -5434 72024 90595
15660 90595 -8262 -144926 -30451 -53844 30412 27666 -106572 -72534 -15382 135614 308386
15649 308386 283450 236023 -33584 77272 325850 270574 133406 -90002 -72728 50565
15639 50565 55696 42808 89096 33369 -50323 -28351 -26672 -4368 28883 117542 255279 249458
15627 249458 171908 140112 149363 400407 292594 166475 135500 58524 -24906 -31966 -94060
15616 -94060 33577 45403 -46314 -114006 -41994 9829 -60669 -80035 -33574 49795 38788
15605 38788 -112904 -171648 -255423 -261254 -294028 -191787 -61693 -15762 -129370 -191368 -125150
15594 -125150 -37102 -74076 -29768 107916 89085 11078 -48532 1806 36728 -5622 66968
15583 66968 104114 59657 77416 40734 24262 -127047 -146629 -51625 -51316 -82811 -5358 -51329
15571 -51329 -30219 15855 -24181 4603 33996 60184 -83723 -128186 -23104 -150613 -211454
15560 -211454 -69256 75150 78811 90826 27645 -57488 32675 91781 86314 96059 166690 267349
15548 267349 128430 133696 86036 -4834 84364 106958 197260 203539 197814 257331 291265 409317
15536 409317 347367 192678 133290 -102595 -34853 143561 28408 -121942 -53707 77251
15526 77251 -239 -63434 -59142 -20485 44612 186609 128694 6657 -5195 -46992 -10847
15515 -10847 203215 100159 -69643 -31250 -59962 -177736 -174449 -125129 -32730 -132823 -258142
15504 -258142 -269265 -191310 -99468 -21563 -136374 -234029 -259038 -117940 -135546 -104256 -5466
15493 -5466 -7045 -22602 -67400 14684 173076 109786 128779 172074 131546 87370 71747 107396
15481 107396 89766 73987 102446 139751 134968 20624 31431 64083 187535 256471 331931
15470 331931 275342 125315 -36892 -169738 -314747 -218412 -193690 -319260 -363846 -353478
15460 -353478 -300760 -118058 18304 134422 209460 176896 36127 -49626 107893 217417
15450 217417 221760 137771 86618 38107 27342 141750 198152 -10800 -2837 -25102 17084
15439 17084 166861 73520 -107056 -210397 -126717 -23258 32911 175175 162746 138954 169942
15428 169942 37479 -145121 -257200 -293445 -319894 49785 152123 157493 100074 78799 176808
15417 176808 89881 78535 136141 153690 48546 -127030 -185618 -164641 -125927 -96809 -141025
15406 -141025 -136500 -11633 86443 156449 -25572 -85006 -80524 -196461 -324140 -172414 -216510
15395 -216510 -174542 -91413 -110558 -73073 -29685 52394 88219 180095 172994 218999 183880 56688
15383 56688 -4395 -74260 -132300 -48027 -75401 -188369 -114670 -67184 -73423 -52282 -4164 6907
15371 6907 34253 116372 137152 122936 126431 131232 123343 187773 128969 91953 -2910 -89242
15359 -89242 -38615 6420 -128981 -22066 84304 53424 -7610 35101 9027 3869 88527
15348 88527 103409 192754 252284 343428 281640 101118 130842 146621 50971 -88461 -9551
15337 -9551 38743 153862 169992 -32709 -173357 -232740 -218638 -94214 -14242 36984 35819
15326 35819 208150 215511 191513 139292 28446 -40495 -58280 -39212 43982 34187 -135442
15315 -135442 -280367 -365533 -368280 -267920 -141577 36893 212003 199420 2996 -123725
15305 -123725 24892 9031 -21974 7144 -91713 -27439 84793 150607 162277 -34547 -127321
15294 -127321 -232473 -61832 38655 21261 -76900 -111054 -197771 -211271 -148296 -157223 -163153
15283 -163153 -181412 -190581 -321559 -182225 473 -103446 -203061 -208372 9291 137123 53139
15272 53139 90235 -51534 -165055 8841 156839 58453 5628 195043 259449 316684 252124
15261 252124 222377 189544 85470 -112596 -125745 -43061 -242811 -312323 -43323 -46275 -48696
15250 -48696 -75705 -46787 -59678 96510 121727 -30484 -70264 -26527 -81077 -170758 -98322
15239 -98322 21663 -20216 -107929 -45993 -101861 -210802 -280075 -170837 -102403 -93930 -151011
15228 -151011 -238237 -329246 -299103 -195133 -39304 -23471 11038 118849 49087 33802 17526
15217 17526 20432 23188 -126645 -130750 49518 56026 13551 -61664 -65439 128102 239684 275507
15205 275507 343254 275157 254184 217162 43103 66794 189999 206749 388376 316065 110147
15194 110147 -23016 60198 95155 194690 45549 -48616 -60336 -179413 -97477 41756 -64109
15183 -64109 -196577 -72901 -112803 -219660 -295475 -296090 -166225 -206376 -177258 -169677 -191208
15172 -191208 -85611 -22301 -45709 -55376 -94533 -45193 -56042 -42757 -80195 -47494 -30341
15161 -30341 -100471 -140458 -30494 -81458 -71794 -95860 -53109 -24192 224135 251636 80922
15150 80922 20860 18997 -67652 -152364 -69968 18582 -182203 -310397 -185491 -60872 -8797
15139 -8797 86609 51540 45583 -24506 -2740 43848 -150904 -226572 -284627 -208845 -204129 -216565
15127 -216565 -23047 7469 19182 111425 31252 -72919 51501 -48957 -179319 -122173
15117 -122173 -60437 -116394 -165772 -113057 -121387 -159341 -365954 -204526 -191371 -288409 -108288
15106 -108288 -12018 73880 2123 -79823 -206337 -212546 -60970 160572 165625 133582 89490
15095 89490 52982 -31021 88193 116572 152335 84924 24548 -97198 -105663 12832 -14272
15084 -14272 -151590 -171908 -264021 -170277 -74419 46368 131213 291439 210756 51878 41657
15073 41657 54671 8780 -167519 -274402 -188817 -170735 -140680 -108077 -31853 19922 -128449
15062 -128449 -230114 -62986 -50044 -37434 -161090 -233976 -310709 -210698 5023 131420
15052 131420 339834 286709 189264 126249 -123770 -48232 92749 29254 -85071 -26612 -52379
15041 -52379 -147615 -154842 -193930 -169492 -207094 -302959 -269231 -157383 -17599 51100 -50492
15030 -50492 -311175 -235677 -52945 -74959 -6966 -114532 -206101 -281986 -249605 -103728 -12959
15019 -12959 -88376 -208528 -307294 -473430 -396116 -117549 63390 190970 157855 114888 60243
15008 60243 -50913 -163485 -66429 72470 158084 350007 275651 116672 -12467 91373
14998 91373 192049 233443 162172 13821 -105853 -142361 -105017 116102 107706 -68309 -56013
14987 -56013 101123 109227 -22407 -65087 -163091 -123480 3270 -89682 -64117 17688 -45190
14976 -45190 -121476 -57822 -65964 -113048 -112063 -154250 -243130 -209422 -142072 6292 65979 -125462
14964 -125462 -197679 -120734 -39131 217951 348745 254805 272072 267866 75572 48420 -160521
14953 -160521 -232514 -171470 -191060 -180943 -38806 35172 75661 38112 -24689 -97304 -70013
14942 -70013 -60095 34696 80205 71992 92974 127288 233726 166018 30364 48683 118626 134336
14930 134336 152292 85129 -26350 -79478 -743 13739 61395 121601 179163 154446 212186
14919 212186 65903 46226 60118 -4945 157870 211008 69035 -92872 -114323 -45821 110686
14908 110686 -41474 -1206 -88191 -134454 -98733 -47464 -130444 16994 80724 7643 -108172
14897 -108172 -154405 -163572 -43201 89381 110748 119456 97829 -159270 -260536 -148987 28627
14886 28627 141959 84918 31044 87030 106937 45982 123684 443876 520979 444058 274550
14875 274550 247092 55943 -124725 12553 64708 -53332 -187395 -54078 62819 127015
14865 127015 157152 181302 74759 -3660 -70530 4308 288768 382345 281963 122120 102540
14854 102540 -47103 -16312 105221 295588 202033 136617 121892 226383 244145 162778 154675
14843 154675 123085 87855 97793 156262 218195 108363 77109 105972 17927 -116589 -125451
14832 -125451 154101 263453 150945 141526 178679 140332 196112 164162 120115 101185 236942
14821 236942 244690 259736 145122 -68657 -179831 -44371 -11982 -38638 -223532 -78581
14811 -78581 6215 -172326 -200679 -175897 -242403 -102365 10209 112772 212211 189578 416561
14800 416561 321404 -56209 -339438 -344907 -303726 -270793 -305416 -220369 -200198 -273051 -259293
14789 -259293 -102062 -44676 -30905 -47154 50766 189903 107556 582 23358 -145302 -233891
14778 -233891 -346604 -304775 -219556 -128029 27945 152773 152670 -13059 -172230 -6228 203771
14767 203771 210629 129556 229307 312287 173030 56614 23590 140033 76136 65698 -2307
14756 -2307 -6409 58769 236617 416484 336255 247046 193978 183696 228111 125650 -29881
14745 -29881 -195067 -273126 -229835 -127601 -37840 -3476 -71780 -159465 -118056 -29785 5349
14734 5349 -12538 -68905 -147639 25862 131501 53440 46029 19441 137948 216253 84947
14723 84947 119867 70151 110215 -2118 -59484 -5096 50240 -33428 -68040 -146731 -266227
14712 -266227 -231236 -57755 -146634 -155282 -40236 37430 48940 110549 78112 27431 12845
14701 12845 -73895 -193262 -181412 -143206 -49062 -127855 -128205 -149963 -123955 6219 65917 139855
14689 139855 -8242 -108748 -179790 -191554 -107034 30019 121072 186628 60596 -64603
14679 -64603 -36755 74130 107554 -7573 -72066 35243 -40482 -74763 17690 76853 -25624
14668 -25624 -89019 76626 254943 224021 109520 101969 -61900 -128140 -53925 -60908 -190048
14657 -190048 -166537 -80051 -15849 72914 28698 50941 194604 227113 132565 195627 316338
14646 316338 335589 233607 148082 142229 82290 216185 133217 9703 189618 441335 341355
14635 341355 328112 198832 122674 49849 166574 88265 -77917 86852 103851 56372 -55938
14624 -55938 -126636 -45349 45828 79346 -15958 -8752 -184301 -248703 -208828 -233708 -222860 -322827
14612 -322827 -287956 -278827 -103345 -273341 -435497 -469843 -224577 -200149 -229889 -245781 -185788
14601 -185788 -177907 -239819 -91125 167129 142722 -101007 -130578 -12055 2591 -12596 21131
14590 21131 -36644 -37409 -24038 103744 100661 45270 85378 207281 226928 116972 59949 14198
14578 14198 -56555 -111803 -173216 -134189 -95800 -28056 106835 220666 78852 125268 223112
14567 223112 31299 -302737 -303000 -55882 39542 -127703 -43323 -99015 -77616 -5447 28156
14556 28156 142068 133298 -320 -137512 -182075 -56951 -119053 45813 25695 104475 36210
14545 36210 -46844 -22692 36914 -49130 -197919 -218724 -94917 -51496 -6074 -13943 -100594
14534 -100594 -64194 -21437 32507 -55256 -106522 -7406 57667 102707 185301 153285 267523
14523 267523 461125 465781 302588 312046 388399 415945 297674 162687 99473 259645 390333
14512 390333 276997 136736 290351 342248 260899 164392 82425 106902 -4383 122634
14502 122634 226826 222590 333778 242267 8839 -119715 -27549 79868 14493 -160689
14492 -160689 -220232 -340433 -422846 -419424 -423774 -212293 -218686 -318228 -237556 -241785 -117472 -231630
14480 -231630 -168526 -41811 44845 198181 229589 264307 309454 268937 50872 -34828 -81238
14469 -81238 -107407 -58609 13795 -91580 -144189 -143094 -214513 -193282 -15836 5712 -3097 66565
14457 66565 120475 251522 142204 34450 108913 -61376 -230196 -204412 -210010 -137386 -264989
14446 -264989 -209069 -291348 -346856 -239914 -193819 -62457 76344 -69332 -252300 -129948
14436 -129948 -24055 -77083 -75216 -67922 -126045 -178472 -115286 32013 120207 189302 172976
14425 172976 153465 239799 214991 182044 165645 135471 72079 -47621 -256324 -197237 -124256
14414 -124256 -181003 -194510 -178335 -242356 -205929 -49146 -30454 -25574 39959 153131 162734
14403 162734 -76090 -169001 -58872 -13312 -55415 -108671 -301466 -266957 -42763 106407
14393 106407 164711 260407 347683 376566 339973 161921 -25740 -45911 -88352 -100038 -120897
14382 -120897 -151161 -250709 -253109 -238173 -118485 48572 105861 57778 -70739 -138341 -87975
14371 -87975 -82994 -113452 -136523 -11353 24781 -923 134960 260940 98729 -149539 -249715
14360 -249715 -213019 -107179 -81110 -6340 144742 221619 -70328 -108369 108876 78591 -53383
14349 -53383 -6391 238684 358247 231803 66336 58402 120646 52742 -48383 -95754 -109598
14338 -109598 -188530 -217041 -132534 -8221 -74783 -138716 63438 108438 40240 34072 73365
14327 73365 -79270 -96192 73227 -39132 -195081 -219034 -90593 -95311 -115055 -164954 -255566
14316 -255566 -286963 -94042 50190 56031 -34640 -65347 20281 92344 40348 123421 93763
14305 93763 121849 121330 106564 174151 201458 -12548 -189209 -143766 -97260 -59283 -12530 76299
14293 76299 -96569 -52490 247241 476006 478134 256623 179366 -29909 -165135 -138916 -146451
14282 -146451 -136089 -166949 -2881 58385 92674 338442 423273 430208 321986 235964 33910
14271 33910 -70876 -188478 -230853 -154568 -174303 -327644 -169946 -47294 133113 178615
14261 178615 167084 68083 86834 225869 25823 -229819 -157421 -69771 16370 160190 167274
14250 167274 100850 -15956 -57659 25388 49868 54042 49276 77015 193283 240744 247041 54208
14238 54208 -36254 45560 16162 156121 89821 -1315 -83054 -94754 100059 318398 156871
14227 156871 -39777 -29194 86316 34739 -81183 165313 184264 -85755 -228959 -72319
14217 -72319 110081 -119158 -216297 -182268 -77946 -12994 -84755 -56842 -6741 -103378 80901
14206 80901 251695 121818 -76897 -86112 -57568 -22945 42034 49291 66474 -63469 -77743
14195 -77743 15719 144612 129563 -5134 -101102 -564 -10679 -149706 -149887 -13131 28655
14184 28655 12710 -53499 -79823 9651 82231 -16276 -36634 -109628 -125670 -1319 -163347
14173 -163347 -233522 -354817 -306623 -135399 -93750 -87765 46860 234057 80956 -246733
14163 -246733 -298562 -229688 -271347 -262497 -114377 68493 325298 156464 33178 288395
14153 288395 233282 92817 -4178 22455 67259 54687 -76155 -164589 -48404 -34828 -128367
14142 -128367 -176659 -293766 -364377 -193721 -106568 -151159 -125489 -76355 -56755 -88889 98443
14131 98443 210929 77077 -104412 -69409 -66438 92230 200322 167587 42814 106796 324839
14120 324839 180610 20598 131184 206988 281438 121413 112479 187178 136145 -165129 -179438
14109 -179438 -160940 -103185 -195335 -340963 -248968 -266927 -191260 -153993 -48982 111724 -16761
14098 -16761 -72732 -81553 -106236 5512 153923 222301 245115 221442 170277 185324 142901
14087 142901 115433 98582 77028 -44560 -191645 -146678 -145165 -176678 -167576 -162118 -165983 111537
14075 111537 320082 348932 237315 24578 -260753 -153845 71063 186976 290126 198653
14065 198653 18585 -35824 138819 138891 65803 31130 33002 97763 29553 -50224 3493 -41075
14053 -41075 -240885 -135910 -131753 -277013 -278411 -159606 -64811 -107594 -217628 -212124 -155506
14042 -155506 -200554 -121491 15575 81962 -10360 -192989 -229878 -137107 22618 -17398 62091
14031 62091 -11207 -94942 -18147 -11646 -106731 -285283 -302567 -118408 -98311 -66793 -68287 -10880
14019 -10880 169674 258498 264493 188347 183030 202169 -951 -195390 -201318 -89638 -121052
14008 -121052 -99182 -62993 -2446 -109296 44409 59520 93270 68816 56528 -13413 40731
13997 40731 25694 -99402 -136327 -105740 -117496 -11227 -81356 -107816 -58940 6185 5154
13986 5154 -33679 -89460 -109591 -211913 -251528 -208848 -119518 -85497 -123115 -243032 -66918
13975 -66918 211958 250443 119871 166840 95641 -15245 102260 60762 -82577 -5215 65175
13964 65175 -56708 -57185 73057 162586 239978 157924 -6850 -198556 -337331 -243268 -99490
13953 -99490 -96682 -54775 35690 -31965 -63968 13236 163519 49212 23570 -115562 -30701
13942 -30701 17157 44755 55930 16793 -1429 23045 193142 172907 201340 34294 266442
13931 266442 529268 601186 608474 261865 -61120 -146226 -202362 -106475 153425 119288 -117707
13920 -117707 -88827 37841 -77305 -151155 -293115 -270559 -98706 65689 133580 60036
13910 60036 54241 65077 172650 238247 194207 136269 235264 368038 193087 130315 194143
13899 194143 55828 -5663 21635 20989 -7716 9673 135557 27053 66565 29307 33743
13888 33743 24812 10025 -66620 -142048 -303036 -232226 -58350 78195 53568 -83914 -19611
13877 -19611 111105 76399 -50189 88859 239942 197879 -19170 -109778 -126950 -139223 13270
13866 13270 23501 -10829 -77374 -21454 90511 77925 48606 84275 -37367 -73036 -263
13855 -263 -68349 -289997 -359733 -452250 -580335 -492405 -270416 -55966 172721 260333 175547
13844 175547 131254 169915 224222 220082 138590 -7233 -36569 -48788 -164714 -46121 71450
13833 71450 63452 101164 99321 -32446 -164835 -90601 -9486 20030 -9344 -59933 -34751 -72613
13821 -72613 25500 12747 10520 198531 180494 146177 229956 195385 251164 80625 57493
13810 57493 68063 132147 120380 -119258 -161792 -141722 -137011 -136509 -16327 -3787 -17485 122740
13798 122740 205260 119492 173595 156385 148056 162433 181584 28620 -12586 -12723 -103361 -134399
13786 -134399 4895 -179355 -324856 -292731 -243537 -302579 -340915 -86297 -153125 -119104 -58349
13775 -58349 -86443 -20608 -33934 5421 -70715 -43948 25845 22568 7021 119520 166220 178139
13763 178139 309418 345118 177753 10511 81614 186892 138784 121381 155179 188475 213354
13752 213354 266406 221165 187184 76441 -8442 -71867 -11273 101600 76422 -133611 -209215
13741 -209215 -102274 -49035 46001 60513 -110530 -148114 -113580 -208040 -188060 -46125 -22681
13730 -22681 -36190 -19467 77604 114162 155217 31833 183008 154447 243615 183472 73163
13719 73163 141939 167755 -57909 -159784 -58332 10537 -26790 -45098 107442 32758 -71169
13708 -71169 -78063 -61977 -285021 -273481 -112034 -63793 55538 65281 -70831 58828 4580
13697 4580 -7815 -94690 -212504 -458070 -451497 -283234 -89694 -123222 -45410 -194350 -26791
13686 -26791 -7508 74295 225573 182697 140955 188328 46088 -130014 -364069 -421402 -407338
13675 -407338 -191007 117725 45214 -45451 -35795 -4730 19639 5201 136512 120734 -4607
13664 -4607 22917 113601 63164 54152 121254 73994 74061 21513 -71248 -42710 -49558 -130414 -89560
13651 -89560 -91406 126314 194407 66290 -49002 -6547 -80814 -270034 -206586 -40119 -19276
13640 -19276 -75823 -220585 -313429 -100388 49416 -122308 -142535 -207704 -257098 -204813 -219287
13629 -219287 -266223 -310765 -295608 -36115 128365 -36014 -190197 -223789 -127179 -237155
13619 -237155 -257277 -281095 -170919 107199 123554 84185 13437 -11985 -154193 -130822 -51528
13608 -51528 -127401 -286 152570 63187 96448 193556 82105 51430 114543 142042 -42841
13597 -42841 -195132 -283741 -209126 -216603 -125014 -119874 -30759 -150602 -306961 -236616 -189890
13586 -189890 -112113 -105149 -58821 -104101 -235874 -251751 -377822 -390309 -277042 -213829 -208404
13575 -208404 -103661 54021 135427 34677 4491 173741 304597 190828 46277 28650
13565 28650 -85380 4560 27493 -90428 -167174 -188196 -408662 -255702 -200715 -269695 -73781
13554 -73781 -50696 -43933 107565 136873 171840 164604 230322 221497 149816 56152 -14951 -231063
13542 -231063 -225988 -255343 -318072 -314609 -329069 -313758 -190114 120791 177508 -54189 -120085
13531 -120085 -103308 89583 168527 136846 95902 60588 105737 246997 309071 56427 -37991
13520 -37991 -105745 -194772 -124035 -132225 -193524 -28479 -25456 -152623 -33085 -52183 -122214
13509 -122214 -54123 12793 -25031 -54260 -100641 -248482 -258378 -299321 -200007 -115963 -24912
13498 -24912 -74834 -132759 -147213 -250616 -335963 -254965 -132212 -119215 -58902 -149874 -95582
13487 -95582 -148862 -280124 -122074 -54279 -156431 -296890 -442830 -388812 -251604 -104707
13477 -104707 -97064 -131569 -91413 -172105 -132013 -35025 -45459 -201083 -60758 152848 94853
13466 94853 -161124 -267392 -288489 -380892 -280052 57974 66197 -54443 -249978 -165994 -34160
13455 -34160 2310 -42872 96820 154449 113629 132086 183554 122574 -13018 61854 167567
13444 167567 -19141 -116062 -157916 -57159 102072 93627 -67750 -20959 54139 22419 85121
13433 85121 166767 159949 168888 248803 252628 206475 180136 145404 49068 -38562 -106657 73888
13421 73888 178506 251950 171607 262477 248735 271072 165783 -159945 -195525 -100736 -206888
13410 -206888 -108316 -109433 10390 35927 -10819 18242 101961 67476 -74520 -32509 -54522
13399 -54522 -159771 -40407 123164 53091 45841 26379 -19459 -61355 -37734 -36115 -188475
13388 -188475 -222122 -110605 -114796 -207191 -212206 -339230 -348475 -294028 -177144 -125712 -114831
13377 -114831 -105310 -121825 -275131 -273688 -223922 -354000 -419467 -279882 -257450 -231905 -145709
13366 -145709 -296329 -356525 -427848 -369917 -267839 -243802 -204504 -193064 -269281 -91367 15672
13355 15672 -20140 -23044 168342 171938 201055 96032 -123598 -29369 -71075 -127159 -121497 -132779
13343 -132779 -142386 -232445 -193993 -100276 -172281 -162781 -3509 26762 22456 -61047 -96437 -229180
13331 -229180 -215796 -55673 11653 -37219 -209319 -339061 -169912 -179723 -188654 -162771 -300969
13320 -300969 -357984 -194879 38147 -6053 -114475 -170889 -269463 -300272 -140178 -150962 -103552
13309 -103552 -175724 -348945 -194906 -106132 -121627 -25842 52289 25582 -1118 -2240 -109433
13298 -109433 -176995 -202216 -93071 25775 -51661 -266732 -285647 -162503 -74149 -63408 -38744
13287 -38744 84355 123068 163153 178530 159498 83309 -298 -97543 -115366 -156954 -56788
13276 -56788 -140587 -173987 -233103 -176121 -32465 -146576 -276776 -294920 -179437 36604 -92305
13265 -92305 -148700 7074 146781 194778 83421 107748 118266 91596 164484 265134 370656
13254 370656 386198 279521 171123 76687 -20366 -230777 -222290 -107762 -127191 -266527 -300346
13243 -300346 -93345 186931 137832 53718 59129 27436 -65762 -67515 -173935 -234657 -117976
13232 -117976 -6000 -38015 -56770 -93672 -84062 -44352 -107076 -108610 -110372 -9199 243542
13221 243542 370531 387457 350024 245569 81148 2276 122785 239764 23248 -99861
13211 -99861 -98298 -40625 -20287 -62701 107768 195109 169410 82115 116550 59735 -23958 8727
13199 8727 22967 -84907 -255130 -267142 -202292 -317916 -245020 -143298 43073 113220 -75600
13188 -75600 -58992 -27506 10620 48453 -37025 4530 50830 39126 -25507 -158495 -160204 -54987
13176 -54987 5735 83493 33526 33547 111360 279425 197024 175250 214087 130547 25474 -162878
13164 -162878 -161036 -175968 -146384 -90829 -80097 -92408 24466 40552 16890 -102650 -292956
13153 -292956 -261357 -296073 -215649 -73730 84763 126571 -13599 -49917 -31381 -93692 -59559
13142 -59559 -111226 -166320 -124238 -50946 -38478 -92419 -145129 -137075 -117853 -133389 -1073 86078
13130 86078 154943 -46957 -149667 23383 20001 45750 -62428 11964 208484 118100 104619
13119 104619 137317 71226 -93269 -53140 146190 136936 -36831 -317282 -329642 -64279 -29707
13108 -29707 -160871 -80804 3646 37603 141954 126813 -98039 -86655 8631 94520 -28934
13097 -28934 -71837 -142238 -145676 -267853 -194805 -58282 186225 272909 246059 225639 223098
13086 223098 157314 85262 58816 131804 -17280 -110162 -84274 -189276 -147641 -78547 -128011
13075 -128011 -96817 -27379 31123 -6455 -43667 203125 325013 385886 291629 144998 111230
13064 111230 88235 80646 49712 192590 182702 193302 230825 63733 -79872 -4292 92579
13053 92579 40609 -39721 -41190 86793 65108 14850 -108261 -181705 -179090 -89206 -97122 -150766
13041 -150766 -217461 -333173 -387169 -262698 -85359 -102198 -78590 -5959 25952 282623 324003
13030 324003 157465 77000 98588 15451 -164715 -1910 217995 126959 27494 46290 25487
13019 25487 91863 -7069 12236 111752 -35879 -152298 -161199 -150987 -319907 -303195 -123529
13008 -123529 66393 299715 391173 392650 121690 -104449 -188692 -27076 21616 30330 4503
12997 4503 -561 17559 -48121 -89263 -74090 148824 228739 168910 -142201 -230218 -231899 -142274
12985 -142274 -147670 -129789 -213834 -259788 -108244 28835 -46634 -142306 -265150 -357592 -313707
12974 -313707 -297200 -298823 -448266 -450146 -317481 -155576 -97236 23751 121387 -2000 -106214
12963 -106214 -113729 -11289 68045 89003 86424 116662 90836 123742 121814 70878 34664 -5660
12951 -5660 -116022 -174911 -133283 -130418 -176793 -111298 -200151 -226974 -189775 -37819 -51158 -17424
12939 -17424 -60776 -33575 83755 165722 235558 315179 288746 360530 311466 246594 207837
12928 207837 219790 95953 -120177 23542 250655 126051 55302 108965 89643 165385
12918 165385 151554 245528 186940 67672 48588 -14342 -63158 -156910 -110847 -91671 -38850
12907 -38850 -197884 -146772 -93554 72465 51282 -151658 -115785 92362 292979 393826
12897 393826 317312 128895 72976 48423 28313 214552 269601 183324 184929 247241 290404
12886 290404 342938 257499 236030 78107 -123796 -146775 -4019 109659 229637 274407
12876 274407 250959 215602 183395 31695 22974 158369 7711 97911 194385 38145 50642
12865 50642 179360 295480 222657 149896 -74901 -121434 -6137 -44876 -70783 5476 107072
12854 107072 215430 96770 157906 274525 245633 57870 -68665 -83709 -61757 -104154
12844 -104154 -92286 -49431 -29007 -65648 -130015 -61532 -201625 -203061 -267211 -162832 -2980
12833 -2980 22032 -26458 -96457 -289090 -298184 -95919 11694 207246 235294 206464 120151
12822 120151 93165 -29837 -116507 153183 397679 445100 526031 424385 426396 268285 225030
12811 225030 143266 3008 -135616 -126665 48443 31880 4927 -13849 23320 35452 -26582
12800 -26582 -12697 -91606 -28972 100876 139945 218205 135040 -84291 -186660 -104491 -104354
12789 -104354 -28727 -92103 -91052 -92305 -200319 -220964 -66696 -96479 -62522 59609 30099
12778 30099 -53426 -95948 -168598 -160430 -179992 -189110 -70312 15334 -51975 -18223 -107050 -157146
12766 -157146 -54874 70749 194424 72654 15527 -3978 24494 94647 -14541 -108699
12756 -108699 -91568 -13255 237053 365799 323273 292587 231448 262210 278271 228319 191048
12745 191048 186047 101915 -59182 -41214 -31839 23017 186162 134264 -46082 -82277 -56824
12734 -56824 54671 -48353 -88156 -117005 -89465 -18784 96392 429334 552567 539630 214091
12723 214091 37345 215674 226882 129517 136586 60210 75064 331610 261268 54423 -78883
12712 -78883 -62386 -99002 -71684 -68687 -32588 -14969 26597 43963 -23609 12334 210360 149583
12700 149583 -95034 -194322 -84736 -81006 -67702 29530 229325 212222 127565 267334 355414
12689 355414 338059 229636 40158 32288 -25073 -24845 73464 190492 177366 148165 156827 244167
12677 244167 219635 205642 248623 244429 75771 238258 295167 98229 244147 273761 342597
12666 342597 439969 488654 451163 495352 373810 178196 182256 139487 73011 126234 168406
12655 168406 13366 166451 246164 134877 -133487 21751 241056 105773 192556 382835
12645 382835 447409 103759 -3507 32278 18172 125801 196886 297555 181476 108915
12635 108915 163759 63974 -70608 -115714 -57844 -4928 222022 334466 358928 414425 291612
12624 291612 346067 449321 431387 371774 385198 428897 435693 229188 43839 10116 -17802
12613 -17802 101550 71728 47724 132074 193362 358663 278678 149625 82513 50846 223480
12602 223480 354710 285163 -39969 -114725 -69596 2626 -58136 -27326 -108875 -95218 8298
12591 8298 -41109 -56456 56831 257331 381715 340179 269497 128608 -46723 -29138 -5128
12580 -5128 -145922 6085 86123 -66459 -132304 -114841 -171873 -77700 74465 247017 317459
12569 317459 226844 271040 321040 276929 218870 181433 65928 25247 -27268 -59865 49281
12558 49281 130990 60139 130324 60871 106129 27854 71765 951 -177832 -95997 -15782
12547 -15782 64091 23139 -49408 78137 126256 99450 206426 311684 346484 441557 426096
12536 426096 345194 332690 221302 123986 192987 353013 362010 326277 209667 158633 170973
12525 170973 197744 268640 349898 339625 339657 322573 241000 150361 136466 156985 163205 252613
12513 252613 179963 163389 199258 236653 118323 -27027 99738 222962 244338 196020 229788
12502 229788 215613 184589 272729 156998 141749 250721 327477 370944 253844 305363 350786
12491 350786 247534 106614 -16977 -137541 -54918 85599 245205 340319 435766 489162
12481 489162 212634 168736 248635 102318 44488 -824 179377 250413 151529 364656 577571
12470 577571 484569 345976 49074 34651 320637 129268 140683 230877 350377 328249
12460 328249 423721 419647 322503 333273 473756 437037 412119 433460 376642 384793 196494
12449 196494 383815 568410 546745 330176 367778 521014 450558 301067 187332 257193
12439 257193 220515 234299 282655 283700 343120 332707 437211 365106 235518 489880 641017
12428 641017 692525 665497 519239 449793 512784 596312 791296 912142 810435 746798 645540
12417 645540 563734 494028 406038 460861 539748 653023 592830 400910 382890 424531 470485
12406 470485 393709 340274 522850 528082 639411 770647 720514 507927 491005 411597 459375
12395 459375 486048 469282 490472 445356 323035 360300 534515 591362 562170 423425 433684
12384 433684 440238 528559 601545 638529 742276 745474 767347 838737 633670 527629 558705
12373 558705 644581 529934 642660 777827 823940 849014 771284 812888 760044 473281 381921
12362 381921 562928 724566 869186 981635 951720 1013231 879141 806506 878718 1078582
12352 1078582 1184163 1234497 1264934 1076513 1057374 1174230 1040979 996553 1160840 1219700
12342 1219700 1237580 1116878 1021658 1099996 1221490 1178656 1230102 1501597 1598309 1500666 1396821
12331 1396821 1157300 1131187 1148028 1146694 1141923 1192951 1084461 1051804 1055185 1061779 979867 941929
12319 941929 1045426 1111908 1092755 1071029 1079716 1160782 1197907 1084554 1163805 1351118 1268294
12308 1268294 1229995 1351848 1329494 1351228 1516456 1617495 1600436 1382347 1420402 1476624
12298 1476624 1387702 1175777 1200481 1363095 1554955 1586416 1487652 1421238 1466991 1633497
12288 1633497 1762502 1615306 1545394 1400816 1297149 1350093 1526789 1551216 1641538 1904334
12278 1904334 1795239 1724265 1687687 1672718 1641417 1649856 1634983 1377623 1308735 1578662 1814271
12267 1814271 1986729 2163736 2100190 2088766 1919410 1911172 1887899 2047846 2303655 2440738
12257 2440738 2467052 2402380 2225327 2129916 2185478 2332077 2413081 2504213 2631287 2651176 2662338
12246 2662338 2902238 2932422 2769163 2708323 2660372 2941138 3187175 3234915 3277750 3045671
12236 3045671 3054237 3217376 3439686 3405203 3290701 3322338 3337148 3454279 3464346 3437570 3517727
12225 3517727 3501895 3479241 3462782 3633020 3770107 3915339 4052571 3910609 4016591 4081465
12215 4081465 4148985 4309081 4347447 4508670 4737913 4841420 4859048 4933490 5184958 5427970
12205 5427970 5566070 5483214 5467400 5573839 5733920 5780430 5936000 6087567 6181707 6356698
12195 6356698 6586933 6816217 6921681 6955733 7178306 7306685 7449396 7425362 7491428 7776970
12185 7776970 7962103 8226358 8521708 8754013 8971709 9227993 9458884 9771000 9941185
12176 9941185 10284412 10612673 10951867 11253672 11502596 11712675 11996018 12382082 12602849
12167 12602849 12892925 13199622 13323570 13804599 14202429 14620691 14908926 15243939 15701564
12158 15701564 16240633 16824599 17277541 17628862 18017702 18643273 19315236 19867923 20526335
12149 20526335 21060282 21595731 22035290 22630857 23344434 24102004 25021512 25841876 26556789
12140 26556789 27492102 28293192 29351384 30285828 31277170 32535581 33744444 34985401 36228605
12131 36228605 37832711 39272443 40618483 42094467 43818021 45550130 47306177 49268921
12123 49268921 51123031 53183173 55330795 57294776 59633298 62062327 64718547 67238785
12115 67238785 69721981 72483999 75084182 77620682 80396583 82947511 85530554 88111599
12107 88111599 90528098 92815403 94813632 96748645 98614793 100220849 101398319 102332148
12099 102332148 102836491 102921143 102799933 102328229 101563867 100594428 99314582 97642008 95762446
12090 95762446 93934259 92104960 89812268 87342855 84678622 81947159 79309823 76651385
12082 76651385 73945762 71330104 68728564 66024116 63445509 61038383 58828430 56615879
12074 56615879 54324290 52227278 50243270 48242274 46409177 44707416 42959242 41062444
12066 41062444 39438578 37878497 36367903 34951826 33712340 32535666 31377663 30333240
12058 30333240 29332884 28432075 27489774 26502004 25591568 24892938 23959772 23129350 22445341
12049 22445341 21801880 21061522 20490765 19875680 19296297 18844303 18345917 17694898 17123766
12040 17123766 16788442 16479579 16011547 15482468 14880206 14333836 14041517 13835805 13387858
12031 13387858 13032311 12685559 12451796 12112058 11945933 11798332 11662567 11269731 10937265
12022 10937265 10720497 10469454 10016291 9642826 9446405 9396528 9319591 9241318 8961056 8626565
12012 8626565 8467954 8395285 8052872 7890384 7843921 7692020 7413517 7113824 6989020 6925518
12002 6925518 6943328 6867051 6785962 6627705 6405538 6203465 6058471 6042297 6087126 6111341
11992 6111341 5944510 5741220 5726896 5670178 5508025 5329533 5287354 5278675 5276632 5241556 4968518
11981 4968518 4895794 4990364 4836875 4798311 4698847 4645455 4628914 4498080 4197834 4195064 4229947
11970 4229947 4205162 4047096 4077937 4272088 4159055 4086171 4033922 3862074 3781788 3747371
11960 3747371 3814624 3775081 3612588 3541050 3345007 3306945 3342679 3301313 3382048 3392167 3180006
11949 3180006 3030619 2914001 2781579 2714693 2750496 2851266 2851123 2925762 2839076 2928946 2973730
11938 2973730 2838840 2757126 2757693 2596684 2572288 2442592 2351069 2386935 2459269 2407571 2391280
11927 2391280 2315206 2211074 2232864 2306310 2378065 2512558 2459570 2271362 2230978 2349555
11917 2349555 2288381 2325404 2304441 2287175 2296102 2293265 2377342 2246065 2222557 2125390 1868084
11906 1868084 1655333 1706095 1882644 2147636 2318515 2156357 1982517 1790071 1670582 1640550
11896 1640550 1686288 1709068 1688190 1933987 1912597 1699504 1652314 1550188 1503912 1489308 1515781
11885 1515781 1597747 1861524 1939947 1975134 1893005 1931024 1943386 1770614 1685412 1588186 1737342
11874 1737342 1706672 1682388 1605721 1418541 1315602 1324240 1427678 1471443 1472382 1538845 1561079
11863 1561079 1403120 1271386 1318770 1562250 1753660 1760823 1710115 1648638 1551811 1508504 1502505
11852 1502505 1578506 1448199 1365119 1476910 1576690 1371986 1374378 1303325 1418684 1358804 1374890
11841 1374890 1414185 1401420 1495790 1409515 1201091 1138899 917983 919543 997723 1001638 1145657
11830 1145657 1373032 1352097 1182912 1097223 1128142 1050103 846335 832757 861568 876380 934134
11819 934134 1022119 959956 925274 1084442 1156321 1143012 1104620 1135222 949637 944776 976384
11808 976384 819305 889274 929191 996958 950625 721160 575620 549194 652559 753698
11798 753698 857881 878555 892505 1141801 1236615 1193318 1057607 1107721 1123522 938080 805959
11787 805959 813409 918329 900112 960044 952821 925718 903606 1027815 976650 941347 1026298
11776 1026298 1021044 938319 732472 554906 623637 772306 913043 934038 882603 1013923
11766 1013923 890704 656212 575151 720640 811125 859040 791501 804522 910455 984031
11756 984031 998494 884665 871511 656558 674399 740754 903748 956615 957242 954534 899644
11745 899644 783791 701322 687364 612533 641783 574042 688012 712120 630183 825229 905112
11734 905112 859301 777843 655911 623474 675603 751194 783889 777852 660444 457650 311479
11723 311479 318500 359206 478106 549027 442221 492434 551548 608615 682080 639301 586906
11712 586906 584048 595459 568885 635485 714567 632643 657568 607397 658576 722537 673781 594674
11700 594674 509479 430675 465285 475917 514279 693361 677856 615573 592827 642175 769193
11689 769193 817301 759588 763690 777089 627353 513989 282518 325262 410584 382349 514506
11678 514506 585505 541576 481519 448590 356230 395004 345977 306287 370374 322671 401600
11667 401600 241796 173588 362207 428401 544802 496215 551241 403729 449454 435806 368034
11656 368034 394770 359025 312210 307553 252722 406030 304435 118467 216871 245296 341001
11645 341001 387179 439676 545945 452355 342629 394117 447206 374300 540861 667506 492863
11634 492863 441179 511627 450907 363379 417485 658529 746774 721065 652533 524159 379337
11623 379337 434839 425623 481703 347408 235131 327686 320895 318636 407700 457504 339927
11612 339927 282204 472513 426272 250968 363060 397946 317603 377818 493764 452172 400046
11601 400046 294963 361811 510439 483412 330050 204001 314860 490272 346631 302564
11591 302564 304254 477561 552638 490801 412688 220445 188644 344733 340069 238384 222438
11580 222438 156939 276177 462918 482740 241005 150291 44820 162533 176037 124148
11570 124148 96890 166008 456313 342770 173313 174139 161340 94121 207260 263956 125938
11559 125938 222388 297780 311135 412553 492112 457489 420982 457700 314257 334968 246753
11548 246753 288788 411570 441898 432483 408097 523289 494468 562567 533530 351058 373132
11537 373132 395997 368447 423663 504217 269519 232961 328624 181540 97830 69142 104656
11526 104656 185362 190174 331027 344715 376812 373733 244154 110180 192553 378583 426468
11515 426468 501491 755383 736978 706798 538185 552912 564395 471589 335733 386852 416077
11504 416077 422163 431303 370818 302256 358114 396878 153300 118512 289431 245851 273226
11493 273226 241615 171798 274945 413480 411656 303854 335986 404897 467372 565410 605698
11482 605698 552810 507129 488321 384734 446052 511089 412082 336699 334175 432095 428786 338618
11470 338618 251409 312697 282515 367816 435451 312076 383834 515124 510362 439040 252565
11459 252565 50308 56893 6250 145770 417487 394762 375375 418816 309373 297663 198067
11448 198067 214987 31679 -76826 95819 134735 82306 117010 100513 158027 136459 173585
11437 173585 232799 297025 389459 315001 234811 186995 213714 344647 402800 200048 119868
11426 119868 15918 188908 267900 289347 369361 415342 274768 93495 210018 319022
11416 319022 402643 489616 553748 431301 335487 315318 107697 153584 170967 248183 255128
11405 255128 218356 238680 427463 463925 384277 201333 168525 13923 24019 39543 242422
11394 242422 334481 267551 280412 145474 162716 261268 183289 76964 177090 98057 29608
11383 29608 56740 111909 92684 160208 368631 461360 296490 125836 174631 320097 390074
11372 390074 309992 234893 204703 107031 137793 105666 189973 242140 320612 420202 368864
11361 368864 361082 284738 213702 120197 73143 49390 268858 177096 38497 39670 101474
11350 101474 112926 78724 -82448 -152189 -225365 1322 201842 261195 215619 97224 -42
11339 -42 -38160 -78407 -68778 94521 126004 143467 76270 144178 161527 137266 133517 75178
11327 75178 54180 68727 338169 367143 107367 86391 123711 188739 253594 186284 -77756
11316 -77756 -19115 79978 189576 38313 -18680 -86033 40528 78784 130400 119710 -5461
11305 -5461 -2864 -32086 24366 51967 102735 22308 -158134 -219528 -240580 -223700 -313401 -242824
11293 -242824 -175687 -114181 -115601 25807 20737 -53225 -40195 332 201962 313104 215217
11282 215217 38214 27508 89507 195874 295940 189339 -33 -20199 -44772 -32307
11272 -32307 95688 204171 256655 331717 331152 252703 364519 446959 361470 215228 255009
11261 255009 274713 193983 175119 151052 131149 -4735 9065 121463 125311 180863 153691
11250 153691 42405 45921 143795 296744 265306 208171 175190 81552 161912 280636 274402
11239 274402 259051 407242 413741 197880 -43975 -47072 83126 152779 126711 145991 211352
11228 211352 155189 -58626 73419 151545 153567 138785 85990 233226 130880 46489 172347
11217 172347 233420 171980 61777 -21916 -24013 44105 122111 146946 161845 10296 -113145
11206 -113145 -246670 -166043 68140 231910 350094 322979 127339 183603 317370 193072
11196 193072 69562 43972 89006 222407 224475 116621 68694 153985 330245 284605 100118
11185 100118 -70416 -54043 1634 -45347 -126783 -89199 -35737 143201 56123 -156296 -170719
11174 -170719 -104891 -199413 -84724 38959 114664 59077 -7721 106822 265505 446926
11164 446926 329599 351581 328160 114611 -55833 -180600 -45736 24431 -29073 -20123 -80308
11153 -80308 12531 148880 262248 83553 -78449 -129375 -122711 94580 260521 234362 182893
11142 182893 66905 -46832 -53341 -45173 43362 -20798 -184110 -38489 6160 44232 130281
11131 130281 202480 409566 343176 287918 108085 -78893 -261515 -141335 40251 196688
11121 196688 208535 244383 103084 16467 109930 212589 291399 337622 170912 -1560 -89201
11110 -89201 -136308 -146277 -82469 -196080 -134391 20041 161427 100282 72010 58832 69760
11099 69760 93869 98323 41751 25684 -162810 -163764 -233390 -297638 -192901 -96482 89591 133546
11087 133546 70875 -54519 -82763 -170476 -177486 -9737 123718 130870 213930 219330 122565
11076 122565 24110 -37517 69182 118023 83047 167117 110864 46708 55437 -94308 -225552
11065 -225552 -185135 112196 161150 214946 351323 318321 148844 -1010 -54372 88142
11055 88142 124148 153833 224794 114717 -115987 -230557 -319293 -201909 -100174 34968
11045 34968 51697 68606 -94420 -239041 -318629 -241256 -240712 -224009 -195257 -16686 186259
11034 186259 333974 266347 230589 178212 224439 72727 20776 -20805 78353 -56428 -31274
11023 -31274 94530 165104 223041 201095 112540 146130 164342 109215 86101 238604 229377
11012 229377 105444 -111021 -145321 50582 145262 158125 -24270 -2992 -84275 -298913
11002 -298913 -345070 -238030 -107269 -81787 -28699 -92861 -90773 -140433 -140211 -150423 -125554 -134393
10990 -134393 -209814 -29978 185556 188870 163030 109638 49999 -101385 -65574 -52751 -227947
10979 -227947 -287827 -166055 41442 23460 45546 -96137 -294016 -304793 -218984 -167038 -32542
10968 -32542 40808 74434 -31567 -158932 -150445 -46726 141000 -27076 -53542 -149372 -195615
10957 -195615 -99169 156213 273335 199227 69384 -69925 -184543 -200110 -80186 72507
10947 72507 42992 -108053 -190291 -70557 84643 48626 31356 -1686 -113405 -205941 -96408
10936 -96408 23597 95755 161957 -10729 -140031 -116584 33302 16972 -39701 207525 279425
10925 279425 191793 18700 -63229 22691 115923 264449 232073 -8000 -68104 -35438 71020
10914 71020 -27897 19916 62344 -66888 -79856 -71954 -113460 -80064 -128383 -126221 -84296 74753
10902 74753 198795 194904 337058 330917 258567 78319 -124096 -276463 -173882 23663 32522
10891 32522 -87468 56887 60344 -121415 -42732 191300 11003 -15084 21232 22569 40316
10880 40316 158067 -58921 -309030 -283666 -307439 -234604 -135776 -96575 51079 24474 -61355
10869 -61355 -13517 9488 21282 -88525 -15237 108054 165663 60364 134199 94150 -56355
10858 -56355 -145984 -200204 -259663 -174350 -23530 34806 -35499 -11779 83209 82861 51143 59013
10846 59013 56903 123663 57260 132895 183902 266812 66969 71824 99111 92758 182060 113492
10834 113492 275437 249690 216736 94804 -13476 -67496 -89906 -111694 -119273 -35541 -46196
10823 -46196 15338 -153680 8412 64712 120858 36645 -1928 155377 355859 109333 -111807
10812 -111807 -111294 134404 191512 261210 249071 32301 -53514 -91885 -137727 -203809 -293183
10801 -293183 -322620 -242767 -78325 83197 154711 163151 70427 40999 118722 199681 202695
10790 202695 182461 166384 85360 -225287 -318957 -204888 -62874 -15172 -45062 -182352 -435671
10779 -435671 -315105 -217851 -166944 -17165 64137 -38581 -253463 -224729 -23620 160302
10769 160302 17313 94886 -26009 -141568 -76159 -1546 26375 26610 79467 209407 219931
10758 219931 245481 150358 31580 -6653 39988 177747 128594 66575 -87508 -89465 -112148
10747 -112148 86746 203611 61430 -69433 -66275 -89282 -191826 -125356 121080 389531
10737 389531 519348 310861 271931 349146 193345 112697 57571 54735 77436 157775 216453
10726 216453 181619 120981 157227 274478 243204 302633 111694 -35693 -273830 -351022 -55461
10715 -55461 131322 137705 46997 -4797 38892 176760 184710 -14814 -146410 -214625 -263895
10704 -263895 -131150 -76247 13517 43703 -20813 -1218 114071 46922 -68653 17560 107853
10693 107853 236964 163202 246780 197575 64311 181238 130919 -32493 -85462 -100066 -4659
10682 -4659 27324 -21186 -184057 -172480 -253673 -228216 -31904 95651 -408 -106440 -95788
10671 -95788 -306051 -458420 -365000 -328620 -469854 -391152 -106720 -95018 -10727 71989 71632
10660 71632 -44509 -11796 -30916 4981 61938 40370 47594 83695 105042 -31534 -192001
10649 -192001 -306717 -296105 -299104 -337800 -211071 -5697 207358 282994 198889 212413 193454
10638 193454 79089 119964 93042 115163 64262 -220478 -267760 -247276 -45067 -81591 -224223
10627 -224223 -318331 -237573 -49780 167295 162942 75985 4848 62174 -29606 188923 283653
10616 283653 87409 -72713 254 25873 76134 162117 77293 46524 234678 211126 6709
10605 6709 -53064 59584 116380 88718 -33364 -158126 -274953 -126471 31964 180834
10595 180834 154428 93132 36239 34649 92310 68665 8178 -35016 -99794 142613 344786
10584 344786 262628 145997 171898 52798 -46424 117712 350213 388094 136003 65011
10574 65011 103745 -11373 37308 56729 -132925 -147609 -100185 -119442 -111296 -75485 147826
10563 147826 206410 222567 202125 140829 143508 211480 49003 -52289 -40887 -40154 -35955 -19742
10551 -19742 151695 298874 300180 210724 104962 57329 36841 -166826 -309700 -154918 -20413
10540 -20413 51197 64410 135756 257254 330175 512038 426728 388529 194276 63678 131971
10529 131971 91152 130036 202756 352947 370937 345268 81253 7236 115591 63133 -17860
10518 -17860 -33077 -50359 139253 278090 239570 364055 248619 334067 366663 214583 150300
10507 150300 259898 197473 158919 141372 60822 117731 176639 -7751 -144735 -165827 -162541
10496 -162541 -108573 -62985 -63936 -71546 -159970 -49382 -40578 -36193 94088 197646 31255 70821
10484 70821 190997 266297 469908 507752 459615 350520 258928 284420 358051 283420 54180
10473 54180 50173 249280 114058 -42811 -141193 -41634 23413 88949 100625 -2988 -64790
10462 -64790 -81815 -45518 21378 115299 83131 93773 -11701 -143127 -145648 -202448 -192482 3243
10450 3243 248968 142295 -133877 -128960 -115338 -223292 -192497 -128574 27471 -35314 -67467
10439 -67467 -135172 -1953 157973 147561 -5562 11724 -108623 -216030 -233261 -96687
10429 -96687 -68606 34150 141286 -72333 -169210 -27937 -28755 -31814 -75061 -36336 101185
10418 101185 142447 47364 -61473 -95066 -62345 -80233 -162850 14305 103750 164262 33947
10407 33947 -89145 -34762 75537 -47057 -64494 -206967 -256595 -172600 -248219 -238225 -267676
10396 -267676 -214534 -130581 43020 84574 -82588 -21200 -143497 -134728 -6117 52452 33437
10385 33437 -49161 -26999 -46158 -45693 15860 21312 -16796 -90784 -82730 6763 -9600 61189
10373 61189 48305 93485 105523 80576 -49591 -93428 14418 -147638 -215510 -185261 -81838
10362 -81838 3196 106444 61689 30537 125100 121431 82137 206881 397091 516388 528681
10351 528681 786209 1213774 1738732 2248482 2603962 3210059 3914552 4395260 4592462 4743936
10341 4743936 4818173 4530326 4142228 3684417 3232833 2629493 2075772 1667837 1273839 1150714
10331 1150714 922547 830281 767044 718582 685132 571441 552933 483097 459976 369891 351431
10320 351431 341358 303507 230376 250044 300753 549617 411510 247519 288170 166079 256788
10309 256788 144406 -10846 57058 -27301 -43197 -6622 172422 172356 70273 -148109 -132807
10298 -132807 -119031 -79281 -132438 -180734 -71278 40995 -23201 21229 -34181 88076 57419
10287 57419 -4466 -35703 -175463 -275712 -336190 -260312 -1656 329049 455777 317754
10277 317754 304976 218780 106217 112595 205485 175707 62013 148903 77624 67095 286491
10266 286491 389583 272956 67947 77845 140721 196440 133097 200207 239806 178655 206533
10255 206533 111752 55883 87163 93166 134913 172481 31737 24851 90920 132036 105987 89793
10243 89793 124350 87951 -126999 -279710 -74565 -93051 -69026 141554 231865 281166 252183
10232 252183 70366 -97518 -126322 -82855 -116592 -67976 -51655 90288 207825 252220 159261
10221 159261 183539 200046 15836 -232306 -370400 -327681 -283989 -156306 38327 11854
10211 11854 99934 160928 63948 -14594 -81847 -134784 -93768 -39298 145617 281182 333870
10200 333870 136025 -1907 151300 123312 38771 -44168 -92689 -3159 96873 154050 141157
10189 141157 239055 323583 236865 100220 -1709 108017 204444 187808 134857 119372 100854
10178 100854 54977 35408 -31361 -62417 -5347 199965 200902 175952 206327 307839 216760
10167 216760 241762 219477 10941 41904 -38205 -162435 -98966 -106946 -108557 -117835 -217343 -159896
10155 -159896 9098 96841 6603 -75302 -35729 -247072 -402120 -298297 -246087 -328845 -404038
10144 -404038 -249553 -12821 -49116 -77689 -104711 -57415 -53506 73116 68241 115669 61565
10133 61565 66510 224074 266797 154055 162063 143476 -68293 -43502 57644 95073 38281
10122 38281 -88738 -34200 -37661 -183316 -282826 -254573 -243873 -115909 19067 191922 138547
10111 138547 115655 148074 209293 215473 10145 -24309 124369 158532 203476 294006 261943
10100 261943 98954 101977 13541 -145077 -80874 -161735 -167086 -138659 -68916 -26305 -147647
10089 -147647 62371 48028 40489 42286 -121840 -86496 -23350 -90897 60219 153732 211613
10078 211613 336569 291375 126544 1984 82054 68531 -24775 52826 74509 -36491 -14476
10067 -14476 -54489 -160154 -165828 -238203 -222756 -163473 -155816 -103589 -122348 -112245 82903 116097
10055 116097 109583 179463 124306 65672 152522 236134 173847 91970 85083 21139 -74354 -10594
10043 -10594 -54142 -93314 110021 144375 -61184 102283 112438 -17338 -89252 79220 238071
10032 238071 25234 -69584 5577 -31525 -197927 -145053 -47680 97062 -42569 -127524 -236373
10021 -236373 -85365 -93506 -57336 -16741 -24504 -54835 -117354 -212146 -123333 116642 107509 -11426
10009 -11426 65557 444 -7432 3619 109595 294076 383440 293474 120718 37887 30616
9998 30616 -150838 -64327 -56976 -98320 -182702 -286609 -209496 -320325 -295089 -175703 -252833
9987 -252833 -318831 -207721 100254 55663 76454 126106 107187 50146 56626 27122 -62188
9976 -62188 285 23743 72338 122811 92813 9860 -129689 -20808 -65184 -219008 -69595
9965 -69595 92873 -68187 2336 94258 127094 109498 232915 354354 444947 297019 260360
9954 260360 215768 77747 -132288 -173972 -53197 -154851 -136978 -167289 -191809 -115213 -202895
9943 -202895 -281840 -202869 -131448 -78027 188465 423867 385433 194564 155513 213996 271541
9932 271541 148627 -25191 -92522 -804 206534 132028 82641 152483 192317 277046 234820
9921 234820 211856 157493 27572 -48660 -22596 -75807 -47925 -96855 -92736 66487 130464
9910 130464 76703 -39480 -140837 -186404 -184287 -235275 -86890 -117165 27370 129894 193099
9899 193099 337893 463582 449714 321747 262551 201165 101510 69458 9520 72357 105872
9888 105872 72677 -20789 -11846 -21896 -136368 -268743 -182870 -103298 65740 111158 138710
9877 138710 106915 272865 136660 175541 84358 121304 72188 163837 89766 -202056 -433047
9866 -433047 -454216 -294669 -86198 37516 -88179 -95878 -14217 250399 336907 289332 114943
9855 114943 -23783 -87117 -46279 70509 -31209 -58867 -137384 -116300 -125870 -241393 -145788
9844 -145788 -33214 14618 133047 224521 208821 235194 167666 -162161 -401068 -265706 -255324
9833 -255324 -516525 -435555 -138219 -79059 -75804 -10050 -2077 -38931 -164180 -186735 -223842
9822 -223842 -323015 -275006 -229226 4237 -84272 -144374 -171900 -115535 -125063 -123708 -112893 -82244
9810 -82244 -32297 -103003 -53335 -53748 -11796 74224 6921 19887 -54058 -201428 -298601 -269745
9798 -269745 -57088 -137774 -301514 -197000 -169907 -170945 -144199 -132168 -65299 -58026 -85904
9787 -85904 -71452 -205835 -316238 -367321 -250151 -95427 -146365 -162884 -32902 -82196 -124307
9776 -124307 -322938 -184940 11272 104937 174808 74146 54404 187274 176873 145288 -15409
9765 -15409 -186124 -207523 -226036 -177641 -149687 -129277 -93764 -56322 27306 -91506 -210323
9754 -210323 -213132 -321964 -406584 -199645 -155844 -230609 -144251 -40543 -44937 -67172 -204042
9743 -204042 -156408 -64101 -154450 -146411 -45333 61911 183909 146771 32055 -96310 -192881
9732 -192881 -316498 -242233 -82976 62186 249326 125583 -191344 -158781 -62051 7535
9722 7535 -33734 141039 316564 256955 175311 156175 199497 90009 61593 12152 168211
9711 168211 195266 -42489 -201930 -174606 -28932 -42511 -3929 -77153 -227581 -306099 -424606
9700 -424606 -420349 -138014 -51565 -233534 -410643 -349201 -141465 -26928 76887 105288 -42102
9689 -42102 -119255 -70112 -140133 -143765 -31845 230492 472011 414896 247300 260110 178411
9678 178411 110017 -51652 -152746 -178934 -41792 12125 143658 157141 20081 291644
9668 291644 116298 -37957 -102613 -258526 -78880 141534 196028 131978 184386 92780 -47848
9657 -47848 36947 -1358 -49126 97639 76419 -45619 -20023 160979 71895 44032 42879
9646 42879 -26198 -115775 -144845 -131133 -171659 -264133 -214037 28363 34135 30833 136979 194126
9634 194126 20920 -32656 -13439 225203 409695 412843 455583 401684 349034 247645 177867
9623 177867 159093 26328 120384 144255 56833 81788 151069 23014 -92113 -64070 57512
9612 57512 220883 313181 232823 143802 109000 124175 191265 54870 -97496 -95673 837
9601 837 -38859 -33036 -7666 2542 -27446 -43412 -202658 -229341 -144760 -80293 -26967 -152667
9589 -152667 -130091 30823 -16227 -212074 -254034 -234087 -195908 9794 82771 28997 49246
9578 49246 -67952 -94912 -76917 -3555 -37537 -52016 -104009 -80273 -174650 -216426 -74480
9567 -74480 44873 -48235 -157078 31711 266904 213587 116431 -4434 -40745 140044 204913
9556 204913 128735 78208 147980 164151 232047 289271 158982 65016 -16142 -58274 -25278
9545 -25278 37496 57763 -62417 95461 250363 116616 -70770 -115144 -77525 -51009 22583
9534 22583 123025 98521 -16132 -165012 -307632 -388296 -243590 -158335 -13779 168710
9524 168710 209950 105434 538 -100437 -188079 -219496 -81727 -1508 -70262 -146551 -23983
9513 -23983 60632 -197723 -216300 154 141959 80529 106643 29301 10106 81506 149086
9502 149086 106637 95042 49702 -3962 -20233 -56259 33071 90463 133219 177424 175121 228122
9490 228122 17204 33981 21641 -20394 -26198 -47848 7043 43335 -132072 -164085 -66694
9479 -66694 -25288 -129945 -113863 -194190 -56087 -17328 23173 74527 -12547 -120948 34103
9468 34103 -5640 41234 69244 -41488 91945 163698 143475 48474 -113732 -192780 -184483
9457 -184483 -139714 83710 84142 16882 117907 -158034 -376275 -359623 -104079 -19913 28813
9446 28813 -88762 -21510 51568 -10242 -166152 -303937 -200977 -146698 -95910 83418 27231
9435 27231 -84344 -159213 42917 135582 348532 294526 220307 87171 54764 -77188 -41681
9424 -41681 -126085 -287910 -86555 176551 244019 115368 -25358 -33680 -34677 159840 393665
9413 393665 398313 110729 111816 220787 342460 228598 -15312 -55958 31368 26732 -33271
9402 -33271 -96959 -120172 -119414 -117819 -83695 63086 -54822 -226205 -194192 -126514 -159269 -151922
9390 -151922 -112336 -136106 -84796 -9191 -29322 -80353 -137670 -304759 -62569 98472 34248
9379 34248 -211672 -178947 -29244 -98217 -193370 -145799 -142155 -151484 -214120 -313401 -382654 -315292
9367 -315292 -317546 -355984 -481782 -421344 -273607 -215495 -255430 -220562 -153173 -189212 -49083
9356 -49083 14639 106500 115720 -37625 -7119 154010 177657 -32983 -155888 -42363 55465
9345 55465 45113 146287 110520 189332 378976 369557 162593 81099 -80276 29228 -102148
9334 -102148 -86611 72841 42737 -129691 -147217 -73628 -116630 -197894 -132395 -162339 -186391
9323 -186391 -223706 -265759 -87806 -161833 -239966 -190338 -194140 -47039 -82756 -162175 -169274 -59168
9311 -59168 -81952 -140723 -123020 -91485 10959 38734 -5016 -65125 -160260 -181039 -220122 -258663
9299 -258663 -228975 -159626 67198 -37313 -216576 -223574 -176459 -195491 -268319 -188673 -56129
9288 -56129 -94862 -293457 -320169 -221541 -74587 33050 34817 -1717 163206 161412 128741
9277 128741 14882 -71977 -27968 -165953 -30877 92345 221612 182469 -37772 -269910
9267 -269910 -259523 -233430 -192939 -72731 5204 -67902 -179754 11129 -85559 -158928 -129033
9256 -129033 -162543 -100466 -102635 -122591 -198807 -249097 -485331 -517876 -354667 -210527 -285645
9245 -285645 -189294 -82755 -237545 -340602 -374605 -343884 -278031 -259170 -176618 -65967 -66357
9234 -66357 -28266 -136139 -211676 -68952 97313 74138 38731 95972 -35692 -89587 -72428
9223 -72428 -9546 29123 -12296 -5324 9332 142471 58265 -77648 -124605 198062 163241
9212 163241 156251 242433 261920 391641 620707 513866 398667 274285 204483 57596 -84488
9201 -84488 -18695 -75541 -136025 -68938 165576 236602 183217 260079 289620 204192 6321
9190 6321 -144038 -20515 -22773 83920 -83749 7892 69971 76689 225275 241231 244152 172559
9178 172559 148672 118927 140777 220124 284015 327650 327038 287105 177336 251184 313294 323814
9166 323814 500988 471681 274592 135011 126025 96098 20394 66837 163404 203570 173728
9155 173728 85539 90475 109453 149277 230803 386267 523147 445265 348829 389400 103608
9144 103608 193402 264494 292659 368212 385421 300929 321581 531222 788728 992532 1200781
9133 1200781 1229414 1251041 1463748 1554101 1585243 1718413 1716224 1741203 1875905 1999485 2207251
9122 2207251 2397986 2711638 3075872 3583884 4072007 4567034 5251045 5969659 6973164
9113 6973164 8185612 9658337 11513173 13831865 16664424 19992134 24140606 29386033
9105 29386033 35538378 42407176 48969069 53817317 55595424 53500979 48389403 41735752
9097 41735752 35273809 29408035 24471902 20511143 17194581 14614692 12579393 10893137
9089 10893137 9602775 8419369 7414144 6508768 5809085 5480736 5218741 4954168 4461885
9080 4461885 3993198 3691570 3396219 3063690 2876661 2842424 2735325 2606181 2392633 2157159
$$ [...]
##END NTUPLES=NMR SPECTRUM
##END=
