##TITLE=Analysis number 327751
Compound Code btb 06790
Book Reference 225951 b
Project Code adrs flro3
Chemist Name jom
##JCAMPDX= 6.0         $$ Bruker NMR JCAMP-DX V2.0
##DATA TYPE= NMR SPECTRUM
##DATA CLASS= NTUPLES
##ORIGIN= Bruker BioSpin GmbH
##OWNER= nmr
$$ XWIN-NMR		Version 3.5
$$ Wed Apr  4 09:52:50 2007 GMT Daylight Time (UT+1h)  MAYBRIDGE\nmr@NMR_250MHZ
##.OBSERVE FREQUENCY= 250.131544655141
##.OBSERVE NUCLEUS= ^1H
##.ACQUISITION MODE= SIMULTANEOUS (DQD)
##.ACQUISITION SCHEME= undefined
##.AVERAGES= 16
##.DIGITISER RES= 18
##SPECTROMETER/DATA SYSTEM= dpx250
##.PULSE SEQUENCE= zg30
##.SOLVENT NAME= DMSO
##.SHIFT REFERENCE= (INTERNAL, DMSO, 0, 16.522)
##AUDIT TRAIL= $$ (NUMBER, WHEN, WHO, WHERE, WHAT)
$$ ##TITLE= Audit trail, XWIN-NMR		Version 3.5
$$ ##JCAMPDX= 5.01
$$ ##ORIGIN= Bruker BioSpin GmbH
$$ ##OWNER= nmr
$$ C:\u/data/dgb/nmr/ADRS/440/pdata/1/auditp.txt
$$ ##AUDIT TRAIL=  $$ (NUMBER, WHEN, WHO, WHERE, WHAT)
(   1,<2007-04-04 09:52:29.60 +100>,<MAYBRIDGE\nmr>,<NMR_250MHZ>,
      <created by zg, POWCHK disabled, PULCHK disabled
       configuration hash MD5:
       49 4B E0 1D 92 C2 6B 37 9F E6 65 BC 52 41 86 1D
       data hash MD5: 64K
       8D DD 77 25 97 6B 0E 3C BA C7 84 DD 34 41 9E 04>)
(   2,<2007-04-04 09:52:41.96 +100>,<MAYBRIDGE\nmr>,<NMR_250MHZ>,
      <Start of raw data processing
       ef LB = 0.3 FT_mod = 6 PKNL = 1 SI = 32K 
       data hash MD5: 32K
       45 EB 40 75 56 6F A2 3F C4 F5 28 6F 49 67 F4 BA>)
(   3,<2007-04-04 09:52:43.58 +100>,<MAYBRIDGE\nmr>,<NMR_250MHZ>,
      <apk 
       data hash MD5: 32K
       0C 84 D7 B8 9B CE 2C 41 9A B9 6A 78 CE 9E 04 1B>)
(   4,<2007-04-04 09:52:44.36 +100>,<MAYBRIDGE\nmr>,<NMR_250MHZ>,
      <abs ABSG = 5 
       data hash MD5: 32K
       F4 2C AD 46 4C A1 7F 67 56 C1 21 FC 4D BF 58 F7>)
$$ ##END=
$$ 
$$ hash MD5
$$ E8 A3 BA A3 A7 B6 04 18 35 BF 22 BE 3A D6 63 8D
##$RELAX= 
##$RELAX= 
##$RELAX= 
##$RELAX= 
##$RELAX= 
##$RELAX= 
##$RELAX= 
$$ Bruker specific parameters
$$ --------------------------
##$DU= <C:\u>
##$EXPNO= 440
##$NAME= <ADRS>
##$PROCNO= 1
##$TYPE= <nmr>
##$USER= <dgb>
##$AMP= (0..31)
100 100 100 100 100 100 100 100 100 100 100 100 100 100 100 100 100 100 
100 100 100 100 100 100 100 100 100 100 100 100 100 100 
##$AQSEQ= 0
##$AQ_mod= 3
##$AUNM= <au_zg>
##$AUTOPOS= <4 >
##$BF1= 250.13
##$BF2= 250.13
##$BF3= 250.13
##$BF4= 250.13
##$BF5= 500.13
##$BF6= 500.13
##$BF7= 500.13
##$BF8= 500.13
##$BYTORDA= 1
##$CFDGTYP= 0
##$CFRGTYP= 5
##$CHEMSTR= <none>
##$CNST= (0..31)
1 1 145 1 1 1 1 1 1 1 1 1 1 1 1 1 1 1 1 1 1 1 1 1 1 1 1 1 1 1 1 1 
##$CPDPRG= <>
##$CPDPRG1= <>
##$CPDPRG2= <>
##$CPDPRG3= <>
##$CPDPRG4= <mlev>
##$CPDPRG5= <mlev>
##$CPDPRG6= <mlev>
##$CPDPRG7= <mlev>
##$CPDPRG8= <mlev>
##$CPDPRGB= <>
##$CPDPRGT= <>
##$D= (0..31)
0 1 0 0 0 0 0 0 0 0.06 0 0 0 0 0 0 0.0002 0 0 0 0 0 0 0 0 0 0 0 0 0 0 
0 
##$DATE= 1175676748
##$DBL= (0..7)
120 120 120 120 120 120 120 120 
##$DBP= (0..7)
150 150 150 150 150 150 150 150 
##$DBP07= 0
##$DBPNAM0= <>
##$DBPNAM1= <>
$$ [...]
##$SUBNAM6= <"">
##$SUBNAM7= <"">
##$SUBNAM8= <"">
##$SUBNAM9= <"">
##$SW= 20.6930455092707
##$SWIBOX= (0..15)
0 0 3 0 0 0 0 0 0 0 0 0 0 0 0 0 
##$SW_h= 5175.983436853
##$TD= 65536
##$TD0= 1
##$TE= 683.16
##$TE2= 300
##$TE3= 300
##$TEG= 300
##$TL= (0..7)
0 120 120 120 120 120 120 120 
##$TP= (0..7)
150 150 150 150 150 150 150 150 
##$TP07= 0
##$TPNAME0= <>
##$TPNAME1= <>
##$TPNAME2= <>
##$TPNAME3= <>
##$TPNAME4= <>
##$TPNAME5= <>
##$TPNAME6= <>
##$TPNAME7= <>
##$TPOAL= (0..7)
0.5 0.5 0.5 0.5 0.5 0.5 0.5 0.5 
##$TPOFFS= (0..7)
0 0 0 0 0 0 0 0 
##$TUNHIN= 0
##$TUNHOUT= 0
##$TUNXOUT= 0
##$USERA1= <user>
##$USERA2= <user>
##$USERA3= <user>
##$USERA4= <user>
##$USERA5= <user>
##$V9= 5
##$VALIST= <valist>
##$VCLIST= <CCCCCCCCCCCCCCC>
##$VD= 0
##$VDLIST= <DDDDDDDDDDDDDDD>
##$VPLIST= <PPPPPPPPPPPPPPP>
##$VTLIST= <TTTTTTTTTTTTTTT>
##$WBST= 1024
##$WBSW= 4
##$XGAIN= (0..3)
0 0 0 0 
##$XL= 0
##$YL= 0
##$YMAX_a= 427337
##$YMIN_a= -472221
##$ZGOPTNS= <>
##$ZL1= 120
##$ZL2= 120
##$ZL3= 120
##$ZL4= 120
##$ABSF1= 16.522
##$ABSF2= -4.171173
##$ABSG= 5
##$ABSL= 3
##$ALPHA= 0
##$AQORDER= 0
##$ASSFAC= 0
##$ASSFACI= 0
##$ASSFACX= 0
##$ASSWID= 0
##$AUNMP= <proc_1d>
##$AZFE= 0.1
##$AZFW= 0.1
##$BCFW= 0
##$BC_mod= 0
##$BYTORDP= 0
##$COROFFS= 0
##$CY= 12.5
##$DATMOD= 1
##$DC= 0
##$DFILT= <>
##$DTYPP= 0
##$F1P= 14.0000005364418
##$F2P= -0.99999901652339
##$FCOR= 0.5
##$FTSIZE= 32768
##$FT_mod= 6
##$GAMMA= 0
##$GB= 0
##$INTBC= 1
##$INTSCL= 1
##$ISEN= 128
##$LB= 0.3
##$LEV0= 0
##$LPBIN= 0
##$MAXI= 10000
##$MC2= 0
##$MEAN= 0
##$ME_mod= 0
##$MI= 0
##$NCOEF= 0
##$NC_proc= -3
##$NLEV= 6
##$NOISF1= 0
##$NOISF2= 0
##$NSP= 0
##$NTH_PI= 0
##$NZP= 0
##$OFFSET= 16.522
##$PC= 1
##$PHC0= 222.1302
##$PHC1= 5.594057
##$PH_mod= 1
##$PKNL= yes
##$PPARMOD= 0
##$PSCAL= 4
##$PSIGN= 0
##$REVERSE= no
##$SF= 250.13
##$SI= 32768
##$SIGF1= 0
##$SIGF2= 0
##$SINO= 400
##$SIOLD= 32768
##$SREGLST= <1H.DMSO>
##$SSB= 0
##$STSI= 32768
##$STSR= 0
##$SW_p= 5175.98343685301
##$SYMM= 0
##$S_DEV= 0
##$TDeff= 65536
##$TDoff= 0
##$TI= <Analysis number 999999
Compound Code 99
Book Reference 9
Project Code 9>
##$TILT= no
##$TM1= 0
##$TM2= 0
##$TOPLEV= 0
##$USERP1= <user>
##$USERP2= <user>
##$USERP3= <user>
##$USERP4= <user>
##$USERP5= <user>
##$WDW= 1
##$XDIM= 32768
##$YMAX_p= 499651644
##$YMIN_p= -99946
$$ End of Bruker specific parameters
$$ ---------------------------------
##NTUPLES= NMR SPECTRUM
##VAR_NAME=  FREQUENCY,     SPECTRUM/REAL,   SPECTRUM/IMAG
##SYMBOL=    X,             R,               I
##VAR_TYPE=  INDEPENDENT,   DEPENDENT,       DEPENDENT
##VAR_FORM=  AFFN,          ASDF,            ASDF
##VAR_DIM=   32768,         32768,           32768
##UNITS=     HZ,            ARBITRARY UNITS, ARBITRARY UNITS
##FACTOR=    0.157963299565203, 1,           1
##FIRST=     4132.6476996994, 0,             0
##LAST=      -1043.33573715361, 0,           0
##MIN=       -1043.33573715361, -99946,      0
##MAX=       4132.6476996994, 499651644,     0
$$ Real data points
##PAGE= N=1
##DATA TABLE= (X++(R..R)), XYDATA
$$ [...]
18376D5175r517j2572r784K962k6406m284J2704P515l487k6554n583J6375j809
$$ 45175 35658 23086 13302 16264 -10142 -14426 -1722 5793 2306 -24248 -29831 -13456 -15265
18363a5265L873j297q487N365J6813O02Lj731j2608j6573k881J1968P640j0121
$$ -15265 -11392 -12689 -21176 -15811 1002 1604 1607 -124 -12732 -29305 -32186 -20218 -12578 -22699
18349b2699K756p475j2551n288j472O265R202Q362J9146K169j0760j9556K505
$$ -22699 -19943 -27418 -39969 -45257 -46729 -40464 -31262 -22900 -3754 -1585 -12345 -31901 -29396
18336b9396L245K569O257K263P471J6514j5230j126r866p874P441j2602K8818
$$ -29396 -26151 -23582 -17325 -15062 -7591 8923 -6307 -7433 -17299 -25173 -17732 -30334 -1516
18323a516J7274j7680j3616j2780j0809J3431J9329N377l291n004j9693q942j3849
$$ -1516 15758 -1922 -15538 -28318 -39127 -25696 -6367 -990 -4281 -9285 -28978 -37920 -51769
18310e1769o151O045q308K1920K8883k0983p965K4289l578P494r870J8695J7704
$$ -51769 -57920 -51875 -60183 -38263 -9380 -30363 -38328 -14039 -17617 -10123 -19993 -1298 16406
18297A6406K699j5123O192j481j1938O878j2931j9881l176Q252K870P39M268K4004
$$ 16406 19105 3982 10174 8693 -3245 3633 -9298 -29179 -32355 -24103 -21233 -20494 -16226 7778
18283G778J4150j3803l108l68O883L646l1875j8392K435J8047O322R661o353N194
$$ 7778 21928 8125 5017 4649 11532 15178 -16697 -35089 -32654 -14607 -8285 1376 -4977 217
18269B17n181N13J598j3166L12k670n549q416n341j068J175J70J5832K3260K5912
$$ 217 -4964 -4451 -2853 -16019 -15707 -18377 -23926 -32342 -37683 -38751 -37576 -37406 -21574 1686 27598
18254B7598k5999k2607j4054J2221K128k2407o230J0904p059J638K43K835J020
$$ 27598 1599 -21008 -35062 -22841 -20713 -43120 -49350 -38446 -45505 -43867 -43624 -40789 -39769
18241c9769J1762M178K3816K818j5667k1295o839J7522J8720J875K6008q400P152
$$ -39769 -28007 -23829 -13 2805 -12862 -34157 -40996 -23474 -4754 -2879 23129 14729 21881
18228B1881k519n229P550j3985j6199J3038p094l0229O20L856o424J5900M6550
$$ 21881 19362 14133 21683 7698 -8501 4537 -2557 -32786 -32166 -28310 -34734 -18834 27716
18215B7716M781j2644K5791J4787k9966j0367k1838k2330j2586L524l111p547
$$ 27716 32497 19853 45644 60431 30465 20098 -1740 -24070 -36656 -33132 -36243 -43790
18203d3790J6806J0715J0064n683l967N610L505J5994Q15j4679o91R368n072q166
$$ -43790 -26984 -16269 -6205 -11888 -15855 -10245 -6740 9254 10069 -4610 -5301 4067 -1005 -9171
18189i171k3130j5096l75L2746P072k4305q962o798r582K4061J3665J5159J263
$$ -9171 -32301 -47397 -47772 -15026 -7954 -32259 -41221 -48019 -57601 -33540 -19875 -4716 -3453
18176c453N974R157j3265K948K819J2349O914j5091j7136O616N178p715L888j063
$$ -3453 2521 11678 -1587 1361 4180 16529 23443 8352 -8784 -2168 3010 -4705 -817 -1880
18162a880K4316O442l162j5919k7500j4368J6516j109P131m00J228n771J8152
$$ -1880 22436 28878 25716 9797 -17703 -32071 -15555 -16664 -9533 -9933 -8705 -14476 3676
18149C676O922L853L299J4968J538j831r889K950Q729j1086k5644j1738M214J4055
$$ 3676 10598 14451 17750 32718 34256 32425 22536 25486 34215 23129 -2515 -14253 -10039 4016
18135D016J6488j1862j5596J1433K1586Q085J3955m571n560q797r747ll341R479
$$ 4016 20504 8642 -6954 4479 26065 34150 48105 43534 37974 29177 19430 19427 16086 25565
18121B5565n188p359j0980j7020o857K0578J9308r454k587m458R043J1359m720
$$ 25565 20377 13018 2038 -14982 -21839 -1261 18047 8593 6006 1548 10591 21950 17230
18108A7230J8850J7384r831k9703J175k3810J560r547J452J1111L030k9244p926
$$ 17230 36080 53464 43633 13930 15105 -8705 -7145 -16692 -15240 -4129 -1099 -30343 -38269
18095c8269J2402m152j9265L376K7560J5364j2728j6968L263J1346J2987K080
$$ -38269 -25867 -30019 -49284 -45908 -18348 -2984 -15712 -32680 -29417 -18071 -5084 -3004
18083c004J2913J661l687j8676j8343J3268J108n852J0871q469M081J4533K8237
$$ -3004 9909 11570 7883 -10793 -29136 -15868 -14760 -20612 -9741 -18210 -14129 404 28641
18070B8641J6956j3067l2997m715j2477o897m38J166R048K1631m378R385j1456
$$ 28641 45597 32530 -467 -5182 -17659 -24556 -24994 -23828 -14780 6851 2473 11858 402
18057D02k43Q026L0416J3797k6221r432K2338k9682j1377k482K7556R667k2127
$$ 402 159 8185 38601 52398 26177 16745 39083 9401 -1976 -4458 23098 32765 10638
18044A0638j2039J5967O679j0990k8862K491R094k567Q287k5765L799K2038j058
$$ 10638 -1401 14566 21245 10255 -18607 -16116 -7022 -9589 -1302 -27067 -23268 -1230 -2288
18031b288j5850k0646n167N290J0006J1351q247J2322J6388Q005N575j3257l2596
$$ -2288 -18138 -38784 -43951 -38661 -28655 -17304 -25551 -13229 3159 11164 16739 3482 -29114
18018b9114k443K983J8822K466l914J2555j4470n365J2695L571o561m06j2987
$$ -29114 -31557 -28574 -9752 -7286 -11200 1355 -13115 -18480 -5785 -2214 -8775 -9181 -22168
18005b2168j212m421j841K1439J3779J9945J591l797j1146k8765O12L578j4547
$$ -22168 -23380 -27801 -29642 -8203 5576 25521 27112 23315 12169 -16596 -15984 -12406 -26953
17992b6953j9832N264K270J5757j536p229J3781J0960J4866K102j7319J6853K0335
$$ -26953 -46785 -41521 -39251 -23494 -25030 -32259 -18478 -7518 7348 9450 -7869 8984 29319
17979B9319k8221k3291M686l790k573J018K316p666j1000J2582K2059r420k2477
$$ 29319 1098 -22193 -17507 -21297 -23870 -22852 -20536 -28202 -39202 -26620 -4561 -13981 -36458
17966c6458p384J570J129J6055p030k932p518j2421K015L0487J546L229J2948
$$ -36458 -43842 -42272 -41143 -25088 -32118 -35050 -42568 -54989 -52974 -22487 -20941 -17712 -4764
17953d764j1858K3201p722l0856n83M593J953K0665P583L545L0936K10k7987J4798
$$ -4764 -16622 6579 -1143 -31999 -32582 -27989 -26036 -5371 2212 5757 36693 36903 8916 23714
17939B3714k2501q568l453j0141J7779q779J9531J5451j6527J9938K2697M027
$$ 23714 1213 -7355 -10808 -20949 -3170 -11949 7582 23033 6506 26444 49141 53168
17927E3168j3259k9642l1882K63K9997L951k33r904j2897O437L377o085j8215
$$ 53168 39909 10267 -21615 -21352 8645 12596 12363 2459 -10438 -4001 -624 -6709 -24924
17914b4924r952J630N898N307P47j3179N81m033J5611J295r666K339J9326J5959
$$ -24924 -34876 -33246 -27348 -22041 -21294 -34473 -33892 -37925 -22314 -21019 -30685 -28346 -9020 6939
17900F939K018m130m617J5100j409l566M236j229k2891j560j684j0401J7688N394
$$ 6939 8957 4827 210 15310 13901 10335 14571 13342 -9549 -11109 -12793 -23194 -5506 -112
17886a12q311o453K524l212J011J73J2006r288R961J8286K410k8071o432J6546
$$ -112 -8423 -14876 -12352 -15564 -14553 -14380 -2374 -11662 -1701 16585 18995 -9076 -15508 1038
17872A038j9994n605K1785J2613j7410L0781N957p815j2370k4118r898L3546q46
$$ 1038 -18956 -24561 -2776 9837 -7573 23208 29165 21350 8980 -15138 -25036 8510 7664
17859G664j9146l1870K314J0758J228R571J9289o180J6234P256R267J577m293
$$ 7664 -11482 -43352 -41038 -30280 -29052 -19481 -192 -6372 9862 17118 26385 27962 23669
17846B3669l4239k7572Q488R913O274K0425L9656j0317l8417p317L72q48Q293
$$ 23669 -10570 -38142 -29654 -19741 -13467 6958 46614 36297 -2120 -9437 -9065 -9913 -1620
17833a620m366p930J358k832j4187j7633K6863K9387n597p518j1852j6761n343
$$ -1620 -5986 -13916 -12558 -15390 -29577 -47210 -20347 9040 3443 -4075 -15927 -32688 -38031
17820c8031O910L985J1940N029j1547J193J2906l866l2927j1392M480K9790J3910
$$ -38031 -31121 -27136 -15196 -10167 -21714 -20521 -7615 -11481 -44408 -55800 -51320 -21530 -7620
17807g620J5797J8163j802j7422j6145n129m32o250l058j857R706K5716r107j9172
$$ -7620 8177 26340 24538 7116 -9029 -14158 -14590 -20840 -23898 -25755 -16049 9667 560 -18612
17793a8612R494P489j2217J9263K1887l985l4220k2268O678K3614J0456n452k3489
$$ -18612 -9118 -1629 -13846 5417 27304 23319 -10901 -33169 -26491 -2877 7579 2127 -21362
17780b1362o611L1381l143l1133N218K4379J394j1505r137J5866l23p248O504
$$ -21362 -27973 3408 265 -30868 -25650 -1271 123 -11382 -20519 -4653 -4976 -12224 -5720
17767e720K8265n948j6881L360o481K0847J881p849k5767j4629p885O118J6938
$$ -5720 22545 16597 -284 3076 -3405 17442 19323 11474 -14293 -28922 -36807 -30689 -13751
17754a3751J3428k5467j8482j5626M132l38j5666K3811J5843j5941J4979J0202
$$ -13751 -323 -25790 -44272 -59898 -55766 -56104 -71770 -47959 -32116 -48057 -33078 -22876
17742b2876J1637O608J4067M524n755k261j1774O601J4778n178l6642N24K7751
$$ -22876 -11239 -4631 9436 13960 8205 5944 -5830 771 15549 10371 -26271 -25747 2004
17729B004J4794j8734k8485j2921Q046K5334R185M266J222Q604j0286q151r519
$$ 2004 16798 -1936 -30421 -43342 -35296 -9962 -777 3489 4711 13315 3029 -5122 -14641
17716a4641J6703j7523K225L259k485j0487Q319j615J2636O782j8176o976K8461
$$ -14641 2062 -15461 -13236 -9977 -12462 -22949 -14630 -16245 -3609 3173 -15003 -21979 6482
17703F482P222j5951k5405k4006J3847K2522j7491j5786J9739J0913L010j3130
$$ 6482 13704 -2247 -27652 -51658 -37811 -15289 -32780 -48566 -28827 -17914 -14904 -28034
17691b8034o942M465J7193J992q044P777m788m59O4J2497J1207j8769J4161o0
$$ -28034 -34976 -30511 -13318 -11326 -19370 -11593 -16381 -16840 -16776 -4279 6928 -11841 2320 2260
17677B260o99K168k0783P740q419r903P225N424L533J2049l011L0311J3606l82
$$ 2260 1561 3729 -17054 -9314 -17733 -27636 -20411 -14987 -11454 595 -2416 27895 41501 41119
17663D1119r032m8M965j5119l3532j1966j9530J1369J4138m043j696o092J3969
$$ 41119 32087 32039 37004 21885 -11647 -23613 -43143 -31774 -17636 -21679 -23375 -29467 -15498
17650a5498L2674K4174l7595j8457O37P283P245J5626J2937J3397j5846p842j6799
$$ -15498 17176 41350 3755 -14702 -14065 -6782 463 16089 29026 42423 26577 18735 1936
17637A936Q036o870k4804K346L550P144L601J306K2528J1678q729k3523j978p383
$$ 1936 9972 3102 -21702 -19356 -15806 -8662 -5061 -3755 18773 30451 21722 -1801 -3779 -11162
17623a1162k4449J9106L1097O918j7979j7905m712N196m300n316J8716K0532j3782
$$ -11162 -35611 -16505 14592 21510 3531 -14374 -19086 -13890 -18190 -23506 -4790 15742 1960
17610A960l5745J1083O042N41L430p12N355R792q823j2609r677j6429j4080J6465
$$ 1960 -33785 -22702 -16660 -16119 -12689 -13401 -8046 1746 -7077 -19686 -29363 -45792 -59872 -43407
17596d3407K2738L1132j5212J326K0492Q465k3722n391n534j5449P610J3153K2771
$$ -43407 -20669 10463 -4749 -3423 17069 25534 1812 -3579 -9113 -24562 -16952 -3799 18972
17583A8972P538j4624j5286j332J9500o127j0431o278J6950J0992J666N165L302
$$ 18972 26510 11886 -3400 -4732 14768 8641 -1790 -8068 8882 19874 21540 26705 30007
17570C0007r913j9369j7516K2768j76k7975k0470O257J3757K085p667m477n106
$$ 30007 20094 725 -16791 5977 5801 -22174 -42644 -36387 -22630 -20545 -28212 -32689 -37795
17557c7795l588r404R157j0130J8293J8741Q741Q125p434n496j0342l446M4460
$$ -37795 -41383 -50787 -41630 -51760 -33467 -14726 -5985 2140 -5294 -10790 -21132 -24578 19882
17544A9882K2320k9726j5517j2275J0573j2334o981J2280l064k86K8498j3296
$$ 19882 42202 12476 -3041 -15316 -4743 -17077 -24058 -11778 -14842 -15128 13370 74
17532G4k2587N506J0886j8163k7605J5488K6769J5273k837j1116n364j6752j3074
$$ 74 -22513 -17007 -6121 -24284 -51889 -36401 -9632 5641 2804 -8312 -13676 -30428 -43502
17519d3502P655O223k106o653k365l601J6762L8893J8409j285j4183m6090N367
$$ -43502 -35847 -29624 -31730 -38383 -40748 -44349 -27587 11306 29715 28430 14247 -31843 -26476
17506b6476n509j7394j4003j32K4656K2423J3893R819j0287o125J609j7859J9780
$$ -26476 -31985 -49379 -63382 -63514 -38858 -16435 -2542 7277 -3010 -9135 -7526 -25385 -5605
17493e605O476k0268o549J160J8806r080o678K0829N009j9936l0039Q550J7316
$$ -5605 871 -19397 -25946 -24786 -5980 -15060 -21738 -909 4100 -15836 -45875 -37325 -20009
17480b0009J0806J8697P134R444j415k1243j5957p766J9766J6474j1944r036j4245
$$ -20009 -9203 9494 16628 26072 24657 3414 -12543 -20309 -543 15931 3987 -5049 -19294
17467a9294q584J3218k35j2917r120K3896P894q033p64K4627L379O551q292n926
$$ -19294 -27878 -14660 -14895 -27812 -36932 -13036 -5142 -13175 -13939 10688 14067 20618 12326 6400
17453F400k0595j3885j9728j8951K6317J8066J3500N163k0795j6075P515J8147
$$ 6400 -14195 -28080 -47808 -66759 -40442 -22376 -8876 -3713 -24508 -40583 -33068 -14921
17441a4921J332j4672o243K1602O17K2978j3913l0617J0996M980k6708k708K5554
$$ -14921 -13589 -28261 -34504 -12902 -12285 10693 -3220 -33837 -22841 -17861 -44569 -47277 -21723
17428b1723K4234J2380j0243j1385m540P77K4729P849k0513j2406M27J7484r359
$$ -21723 2511 14891 4648 -6737 -11277 -10500 14229 22078 1565 -10841 -10414 7070 -2289
17415b289m998o594j4466k6341R287L2304J620J8148p58L2579r573j6981l0348
$$ -2289 -7287 -13881 -28347 -54688 -45401 -13097 -11477 6671 5913 38492 28919 11938 -18410
17402a8410j1161J025o82N798k7682K2873J4569R56j4241j1907J2491K8376m194
$$ -18410 -29571 -28546 -29228 -23430 -51112 -28239 -13670 -12714 -26955 -38862 -26371 2005 -2189
17389b189j7297k1546l1J1829J2002K4857o08o290Q758o501k9503Q20K4491J3340
$$ -2189 -19486 -41032 -41063 -29234 -17232 7625 7017 727 9485 2984 -26519 -25699 -1208 12132
17375A2132J6572O048k648j2081j9820J0725r362m801o530j5359j802P59J254
$$ 12132 28704 34752 32104 20023 203 10928 1566 -3235 -9765 -25124 -26926 -26167 -24913
17362b4913j936K2770J2216J3708J3996J926j4987j8279r170J4935K006q650J424
$$ -24913 -26849 -4079 8137 21845 35841 37767 22780 4501 -4669 10266 12272 3622 5046
17349E046j0980k111k3536j2513K0750J3983R672j6927M60j31M937J2735R531
$$ 5046 -5934 -8045 -31581 -44094 -23344 -9361 311 -16616 -16156 -16287 -11350 1385 10916
17336A0916L298L916L561k6626l1373o367O586L9691M5946N653N057o102R46j8796
$$ 10916 14214 18130 21691 -4935 -36308 -42675 -36089 3602 49548 55201 60258 54156 55102 36306
17322C6306j0072K2393k2339j3208j2942q370m901k254J2671K4728N619k4550
$$ 36306 26234 48627 26288 13080 138 -8232 -13133 -15387 -2716 22012 27631 3081
17310C081j4643J0129j9655j022K4521L0078K0296j4713l2126J847o934j3469
$$ 3081 -11562 -1433 -21088 -22110 2411 32489 52785 38072 5946 7793 859 -12610
17298a2610J4429K350N91J0066j268J352N080m19k3315k700O269k803N662Q876
$$ -12610 1819 4169 4760 14826 13558 14910 19990 19571 -3744 -6444 -175 -2978 2684 11560
17284A1560l7042n511K6223J4408l53j7552L6k459p134J5202J6546O591k3753
$$ 11560 -25482 -30993 -4770 9638 9285 -8267 -8231 -10690 -17824 -2622 13924 20515 -3238
17271c238L482k9703j9505J6079j2318p927J8832K3272P78j365n085P867M263
$$ -3238 244 -29459 -48964 -32885 -45203 -53130 -34298 -11026 -10248 -11613 -16698 -8831 -4568
17258d568j4909k1523L0890j0910j7288N465k642J841n90N323P894J4004O723
$$ -4568 -19477 -41000 -10110 -21020 -38308 -32843 -35485 -33644 -34234 -28911 -21017 -7013 -290
17245b90k948M617l34j2979M814m58j9274j9110J6121J7824J1760O674p433j6491
$$ -290 -3238 1379 1045 -11934 -7120 -7578 -26852 -45962 -29841 -12017 -257 6417 -1016 -17507
17231a7507j2225J8787K3958K687j3443J2376j1841M804j6141k4076Q730L0664
$$ -17507 -29732 -10945 13013 15700 2257 14633 2792 7596 -8545 -32621 -23891 6773
17219F773O944k9242k1532n0Q663Q737K4721j7910l0730q290J1387j3944N952
$$ 6773 13717 -15525 -37057 -37107 -28444 -19707 5014 -12896 -43626 -51916 -40529 -54473 -48521
17206d8521N488J867R825K6223J3570q479j6228o982K767r827K5467O270j1965
$$ -48521 -43033 -41166 -31341 -5118 8452 -27 -16255 -23237 -20470 -30297 -4830 1440 -10525
17193a0525q927K1072K228j0938J3509P185J1597o381m6115j1564J8314o215j152
$$ -10525 -19452 1620 3848 -7090 6419 13604 25201 18820 -27295 -38859 -20545 -26760 -27912
17180b7912O131J0539j3543J0028j2489K90K1636P371m148j1957L3419K6792j3507
$$ -27912 -21781 -11242 -24785 -14757 -27246 -26956 -5320 2051 -2097 -14054 19365 46157 32650
17167C2650l2074j5910j2322K163M121R146O444J5721j7682m5783L461O369N688
$$ 32650 576 -15334 -27656 -25493 -21372 -12226 -5782 9939 -7743 -53526 -50065 -43696 -38008
17154c8008K0566L54L481M190O168R763j3511l0842K562m860L088Q811P862Q684
$$ -38008 -17442 -17088 -13607 -9417 -3249 6514 -6997 -37839 -35277 -40137 -37049 -28238 -20376 -11692
17140a1692Q583N163J2256k2955j1608o747r923n629j663J8807J170N490p440
$$ -11692 -3109 2054 14310 -8645 -20253 -27000 -36923 -42552 -44215 -25408 -24238 -18748 -26188
17127b6188k1704J2786J2212j9862k811J4187L0923J2401k392j6053J2257J4381
$$ -26188 -47892 -35106 -22894 -42756 -45567 -31380 -457 11944 9552 -6501 5756 20137
17115B0137j9203k150j035j4951j763Q053J3705Q365Q787P674j0016k1932j4691
$$ 20137 934 -1216 -2251 -17202 -18965 -10912 2793 11158 19945 27619 17603 -4329 -19020
17102a9020o112M07J0442O383j515r859K055P923Q139J1960K1380J0915N086n237
$$ -19020 -25132 -24725 -14283 -7900 -9415 -19274 -17219 -9296 -1157 10803 32183 43098 48184 42947
17088D2947j9972j1693j4861j5939K214k146j2447k185p085N591J846j2876l817
$$ 42947 22975 11282 -3579 -19518 -17304 -19450 -31897 -34082 -41167 -35576 -33730 -46606 -50423
17075e0423R023K9047K1551k0584K02J6164K6159j5540j4360k3523j9104R465
$$ -50423 -41400 -12353 9198 -11386 -11184 4980 31139 15599 1239 -22284 -41388 -31923
17063c1923K6484K2607J089O149n473J1652j2365k8390M130m541j0602R037K684
$$ -31923 -5439 17168 18257 24406 18933 30585 18220 -10170 -6040 -10581 -21183 -12146 -9462
17050i462K7053K3301p918j1325M04K1231J3210Q572j8609j9444j0755k81p53
$$ -9462 17591 40892 32974 21649 22053 43284 56494 65066 46457 27013 16258 15977 15224
17037A5224O441O839J90K0541o910j1986j0839o052j1144k1440j2137j1230M680
$$ 15224 21665 28504 28694 49235 42325 30339 19500 13448 2304 -19136 -31273 -42503 -37823
17024c7823J1853K3387j590j1703J2852O389O688m040k0215r425k1220L015O733
$$ -37823 -25970 -2583 -4173 -15876 -3024 3365 10053 6013 -14202 -23627 -44847 -41832 -35099
17011c5099k107J9216K7337O183k0355k087l82Q060J852J533L482J0610k0145
$$ -35099 -37206 -17990 9347 15530 -4825 -6912 -7294 766 2618 4151 7633 18243 -1902
16998a902m719J7952Q741Q581P61K6306q372j7044k2980j1327K3572J8282p320
$$ -1902 -6621 11331 20072 28653 29414 55720 47348 30304 7324 -4003 19569 37851 30531
16985C0531J6122o584l0236o175O018j4126m98M931q091k3637q343Q465k751J4137
$$ 30531 46653 40069 9833 3658 9676 -4450 -4948 -17 -8108 -31745 -40088 -31623 -34374 -20237
16971b0237J5646j8405k0119J8533K5186J5628o937k0585r703K706P615J6734
$$ -20237 -4591 -22996 -43115 -24582 604 16232 9295 -11290 -20993 -18287 -10672 6062
16959F062J1356q3j3397j5864K518L956o65L816k525k462P063m728J7922J127
$$ 6062 17418 17335 3938 -11926 -9408 -5452 -6117 -2301 -4826 -7288 -225 -4953 12969 14096
16945A4096k4018j9420r956m76Q266K1452j1990n210K543J9176L1664j0023k3118
$$ 14096 -9922 -29342 -39298 -39774 -31508 -10056 -22046 -27256 -24713 -5537 26127 16104 -7014
16932g014j3043J1535J52q092j5245j0899J4910P85l1504k172Q357K1579J5639
$$ -7014 -20057 -8522 -8370 -16462 -31707 -42606 -27696 -26911 -58415 -60587 -52230 -30651 -15012
16919a5012r577J1626L772j0574Q56M847J2462J6520J4686p827n630j4416L877
$$ -15012 -24589 -12963 -9191 -19765 -18909 -14062 -1600 14920 29606 21779 16149 1733 5610
16906E610j754k7449l7249J9275P784p006n596R469L7624O225P731j438m492N153
$$ 5610 3856 -23593 -60842 -41567 -33783 -40789 -46385 -36916 708 6933 14664 13226 8734 13887
16892A3887o236k0536l946K921K0950Q117k5519j3597p236K7898l10j7960J9536
$$ 13887 7651 -12885 -16831 -13910 7040 15157 -10362 -23959 -31195 -3297 -3607 -21567 -2031
16879b031K3767M654m1568j772N649J2644J9470J2542Q703l126p727j325j4528
$$ -2031 21736 26390 -15178 -16950 -11301 1343 20813 33355 42058 38932 31205 29880 15352
16866A5352p874l0358k810J1422M281j4413J8031K7532j3108j2100Q36K051O182
$$ 15352 7478 -22880 -25690 -14268 -9987 -24400 -6369 21163 8055 -4045 -3209 -1158 5024
16853E024L792J3931M863l1986j8386o064R347J134j2634j527q24K7485K480K2715
$$ 5024 8816 22747 27610 -4376 -22762 -28826 -19479 -18345 -30979 -32506 -33330 -5845 -3365 19350
16839A9350K0612j6162k6373j2708k357J0968L129P793j1618j2323J1285N285
$$ 19350 39962 23800 -2573 -15281 -17638 -6670 -3541 4252 -7366 -19689 -8404 -3119
16827c119L121j0024J0478Q177r802j041K696J3521o620k0642n159Q469J5646
$$ -3119 2 -10022 456 8633 -1169 -2210 486 14007 7387 -13255 -18414 -9945 5701
16814E701L946R759l396N553K458J225K057j0046q397k2815l1433N787L6460L8643
$$ 5701 9647 19406 16010 21563 24021 25246 27303 17257 8860 -13955 -45388 -39601 -3141 35502
16800C5502J2742j0438k0137j8429r499J1996J1659l4366j0435k300J073k861
$$ 35502 48244 37806 17669 -760 -10259 1737 13396 -20970 -31405 -33705 -32632 -35493
16788c5493m543K0498L4991P68j7507P425J9558M017P78j4107l4552j3637j2738
$$ -35493 -40036 -19538 15453 16221 -1286 6139 25697 29714 30492 16385 -18167 -31804 -44542
16775d4542J0739J1216J0252o02J7572J3338k841K006n049O707Q179j8234L46
$$ -44542 -33803 -22587 -12335 -12937 4635 17973 15132 17138 12089 18796 26975 8741 9087
16762I087O693j6131j2115M227o736O234m88j2414m816o656N309N124j6827n488
$$ 9087 15780 -351 -12466 -8239 -14975 -8741 -9229 -21643 -26459 -33115 -27806 -22682 -39509 -44997
16748d4997J0845J281J287j3255K2538K6622K201Q865K5114j9320j4153N724p225
$$ -44997 -34152 -32871 -31584 -44839 -22301 4321 6522 15387 40501 21181 7028 12752 5527
16735E527k1356j9122r683J6771J6736R893N880n231J8466K9095j5162k0319P846
$$ 5527 -15829 -34951 -44634 -27863 -11127 -1234 4646 -585 17881 46976 31814 11495 19341
16722A9341Q0k6400j4049K3691k428j2236N212J793j4575N7K432j0174R707Q185
$$ 19341 19421 -6979 -21028 2663 235 -12001 -6789 -4996 -19571 -19514 -17082 -27256 -17549 -9364
16708i364L498J4881j8606j1000P27J4916k973N638j0146j8357j1081J58L37K1517
$$ -9364 -5866 9015 -9591 -20591 -19864 -4948 -7921 -2283 -12429 -30786 -41867 -41709 -41372 -19855
16694a9855R968j204l497K2986J0578P442J7268K1453l1990M452J608j5583L945
$$ -19855 -9887 -11091 -14588 8398 18976 26418 43686 65139 33149 37601 39209 23626 27571
16681B7571j5320j2089P098J4387K9881o902l8367k6415l007R712j1666J7443
$$ 27571 12251 162 7260 21647 51528 44626 6259 -20156 -23163 -13451 -25117 -7674
16669g674L229j8980J1175L4831N484n102N974K889o639j1176J1571j9679J4780
$$ -7674 -4445 -23425 -12250 22581 28065 22963 28937 31826 25187 14011 25582 5903 20683
16656B0683M1903l2858j8131J9596L776L243r348O30J323M795O205J4161k3501
$$ 20683 62586 29728 11597 31193 34969 38212 28864 29494 30817 35612 41817 55978 32477
16643C2477l518N034n374p367k9855j3067m450J5424n642J3057J6755j4163J693
$$ 32477 28959 33993 28619 21252 -8603 -21670 -26120 -10696 -16338 -3281 13474 -689 1004
16630A004J2552q680L583R655k675j618l995r935j0149l0792k3180K1123K5845
$$ 1004 13556 4876 8459 18114 15439 13821 9826 -109 -10258 -41050 -64230 -43107 -17262
16617a7262K871j8049j8590J4939J4452J6413J3590K625N116k109j0858m963j500
$$ -17262 -14391 -32440 -51030 -36091 -21639 -5226 8364 10989 16105 13996 3138 -1825 -3325
16604c325l282n93j1004j6648J1141J5394J4178L000j7879J1122J394j3594k3604
$$ -3325 -6607 -7200 -18204 -34852 -23711 -8317 5861 8861 -9018 2104 3498 -10096 -33700
16591c3700O309K2074J3256j7668m796j0375J0233k0629J4562O970j2071j287
$$ -33700 -27391 -5317 7939 -9729 -14525 -24900 -14667 -35296 -20734 -13764 -25835 -27122
16579b7122j5857O83L2661M813j8250n35K8316J8752m740K709K3155p405j6833
$$ -27122 -42979 -42296 -9635 -4822 -23072 -23607 4709 23461 18721 21430 44585 37180 20347
16566B0347j4751j5914P969j341j9866l685N935J342K0157j0949O792J6343j8913
$$ 20347 5596 -10318 -2349 -3690 -23556 -27241 -21306 -19964 193 -10756 -3964 12379 -6534
16553f534j1959n918L0002j857j0650N286l168M770J849J787P189o859o789J201
$$ -6534 -18493 -24411 5591 3734 -6916 -1630 -4798 -28 1821 3608 10797 3938 -2851 -1650
16539a650o010R454k4512j3543K170P768K0582p582k2848k453J9600L776m238
$$ -1650 -7660 1794 -22718 -36261 -34091 -26323 -5741 -13323 -36171 -38624 -19024 -15248 -19486
16526a9486N339j1780J0309L3158N658k410m071r337j5053j765O65L858J7631
$$ -19486 -14147 -25927 -15618 17540 23198 20788 16717 7380 -7673 -9438 -8773 -4915 12716
16513A2716J4160j6892L5m336j3476J98K0634J0787K334q309j3136j0906L986
$$ 12716 26876 9984 10019 5683 -7793 -7595 13039 23826 26160 17851 4715 -6191 -2205
16500b205Q800j7262J3243K2048k0300l0908q51n115j5705J6727R568J7819J149
$$ -2205 6595 -10667 2576 24624 4324 -26584 -27435 -32550 -48255 -31528 -21960 -4141 -2992
16487b992K5385J776j3177p966j715P617K9126J1235O693P884r169j5102K938
$$ -2992 22393 24169 10992 3026 1311 8928 38054 49289 55982 63866 54697 39595 42533
16474D2533m394l6634P632O309k605q253L241m534M700P451j1345j7298j1438
$$ 42533 38139 1505 9137 15446 12841 4588 7829 3295 7995 15446 4101 -13197 -24635
16461b4635K7861J9250J5101Q822m214l9079k0709l759j064R380k081j071n880
$$ -24635 3226 22476 37577 46399 42185 3106 -17603 -21362 -22426 -13046 -15127 -16198 -22078
16448b2078L865P145k8566K3223K9871j1528k4530J4563K2975r12j7277k3538
$$ -22078 -18213 -11068 -39634 -16411 13460 1932 -22598 -8035 14940 14028 -3249 -26787
16436b6787m388K0695J3182k2989r278P846L1910j2506K1015K6688j2151j6604
$$ -26787 -31175 -10480 2702 -20287 -29565 -21719 10191 -2315 18700 45388 33237 16633
16424A6633j1613L278J9637j2618j9365p743J1650m208k0781j2348J1043J0350
$$ 16633 5020 8298 27935 15317 -4048 -11791 -141 -4349 -25130 -37478 -26435 -16085
16412a6085L998K9838J4619P207J5964k3105j9865J97J0484r64K0861J1183O966
$$ -16085 -12087 17751 32370 39577 55541 32436 12571 12768 23252 22288 43149 54332 61298
16399F1298j3458j0543R2j3816k1903L121J501J0543J6906j3622p156r433j9561
$$ 61298 47840 37297 37389 23573 1670 4791 6292 16835 33741 20119 12963 3530 -16031
16386a6031j4702R97L909n417o967M034J9229n692r311J1231J1934j080l56l539
$$ -16031 -30733 -29736 -25827 -31244 -38211 -34177 -14948 -20640 -29951 -18720 -6786 -7866 -8222 -11761
16372a1761M654m112R108J1454O884P833l074p912p882L784P616j2357J6913l534
$$ -11761 -7107 -11219 -2111 9343 16227 24060 20986 13074 5192 8976 16592 4235 21148 17614
16358A7614k3376r925N768l315J9370L1426j7275o316K888K1194k3050q337K5116
$$ 17614 -5762 -15687 -9919 -13234 6136 37562 20287 13971 16859 38053 15003 6666 31782
16345C1782J0188j4223n83n357j7043p363p955O366n90J0024L936l5136k9278
$$ 31782 41970 27747 27164 21807 4764 -2599 -10554 -4188 -4778 5246 9182 -25954 -55232
16332e5232q717L0198K7056L6721P531l6476k4375K5698J2297k507j6157M398
$$ -55232 -63949 -33751 -6695 30026 37557 1081 -23294 2404 14701 12194 -3963 435
16320D35M773M324j801J5789p172J6648r183k28K0293j6832j4828J4035J0964
$$ 435 5208 9532 7731 23520 16348 32996 23813 23585 43878 27046 12218 26253 37217
16307C7217j3477l7259K647K0287l983l592L567R750J2348K740m723N643M902
$$ 37217 23740 -13519 -10872 9415 5432 1840 5407 15157 27505 30245 25522 31165 36067
16294C6067k4271j8915J2490J9453j9664p48J9572j4090J4769R36j4510p649L027
$$ 36067 11796 -7119 5371 24824 5160 4412 23984 9894 24663 25599 11089 3440 6467
16281F467l955L0701J8117k2358k7532q349J2000K6628p741j0925J6390L2867
$$ 6467 2512 33213 51330 28972 1440 -6909 5091 31719 23978 13053 29443 62310
16269F2310J1546J4007P935K303J2991q395K3153M5113N7665O1168O7767R0194
$$ 62310 73856 87863 95798 98101 111092 102697 125850 170963 228628 289796 357563 447757
16257D47757J05476J16197J22391J09491M4660J8685Q408n4667q6050j00367r7043
$$ 447757 553233 669430 791821 901312 945972 964657 973065 918398 832348 731981 634938
16246F34938r2580r9829m0690r815m5449n2579l7760l4968o024J2704K906j7558
$$ 634938 542358 442529 401839 392024 346575 293996 256236 221268 215244 227948 230854 213296
16234B13296l8974k1866j0017r833k4829j5346m1006j0519K6125N200n381k4542
$$ 213296 174322 152456 142439 132606 107777 92431 51425 40906 67031 72231 66850 42308
16222D2308n993j03r582j448K624l380k350k862j6494J6621J8006j3344n435J218
$$ 42308 36315 36212 26630 25182 27806 24426 22076 19214 2720 19341 37347 24003 18568 19786
16208A9786j990j2897l481M108j0785K0546L634j5620K263N173j2727m010J4217
$$ 19786 17796 4899 1418 5526 -5259 15287 18921 3301 5564 10737 -1990 -6000 8217
16195H217P061o249J4872J5526j949M260q715j831j1590K8464n051J2991R450
$$ 8217 15278 9029 23901 39427 37478 41738 33023 31192 19602 48066 43015 56006 65456
16182F5456k3457r888j4775K6033K2890j1593j6140p380j5808L197L452q234J025
$$ 65456 41999 32111 17336 43369 66259 54666 38526 31146 15338 18535 21987 13753 14778
16169A4778j7901K2331J2135j0598M627L738j9775k1874j1443L2452J1108k189
$$ 14778 -3123 19208 31343 20745 25372 29110 9335 -12539 -23982 8470 19578 17389
16157A7389j2219m452o42J0053K9013P788R5k7422j8199Q537M190l111N924O683
$$ 17389 5170 718 76 10129 39142 46930 47025 19603 1404 9941 14131 11020 16944 23627
16143B3627O726K953K083k4615J6930M275k4065P593Q510k1939n734O169l619
$$ 23627 30353 33306 35389 10774 27704 31979 7914 15507 24017 2078 -3656 2513 -1106
16130a106R541j9351J1544K5529k916O61J1435j2842J0647j1152j2014q978j6739
$$ -1106 8435 -10916 628 26157 23241 23902 35337 22495 33142 21990 9976 998 -15741
16117a5741K4959R956R79p2J7901m577O468n957m56R117L30J011M370k228O989
$$ -15741 9218 19174 20153 20081 37982 33405 39873 33916 33460 42577 42907 43918 48288 46060 53049
16102E3049Q551R562N877j3048k8802j3130J0675J0203R06N551P474j5022l049
$$ 53049 61600 71162 77039 63991 35189 22059 32734 42937 43843 49394 56868 41846 38797
16089C8797Q34K134k5618k4096l438J3967L871k954p40K845M517j487N647L0583
$$ 38797 39631 41765 16147 -7949 -11387 2580 6451 3497 2757 5602 10119 8632 14279 44862
16075D4862M720j086k233j0728J7459L490Q076j1254l046r384m489k2130J6292
$$ 44862 49582 48496 46263 35535 52994 56484 64560 53306 50260 40876 36387 14257 30549
16062C0549K7848R11p266j4110J9579n928R308N698k3877k5948L484K0545l288
$$ 30549 58397 59308 52042 37932 57511 51583 60891 66589 42712 16764 20248 40793 37505
16049C7505R014J2251N129k7502j5821r118j1030L0827L0232j4160J1822J2794
$$ 37505 46519 58770 63899 36397 20576 11458 428 31255 61487 47327 59149 71943
16037G1943j4125J2040k0097l0975j4628J0504M251J482N794J7795Q314r503j4766
$$ 71943 57818 69858 49761 18786 4158 14662 18913 20395 26189 43984 52298 42795 28029
16024B8029Q69j4906j247l573q171J912K173J0339M493N295J410L502K3859N584
$$ 28029 28898 13992 12745 9172 1001 2913 5086 15425 19918 25213 26623 30125 53984 59568
16010E9568j5545j9987N275L1662N761k0744j8941N262L868j1490m919m737j1915
$$ 59568 44023 24036 29311 60973 66734 45990 27049 32311 36179 24689 19770 15033 3118
15997C118k502K0418R858p933j0595k5195m529J0232R933J2247j2656j4310J831
$$ 3118 616 21034 30892 22959 12364 -12831 -17360 -7128 2805 15052 2396 -11914 -10083
15984a0083K7060L964J7190k2124o362k3297r762J1708K8113R024m517J1924Q216
$$ -10083 16977 20941 38131 16007 9645 -13652 -23414 -11706 16407 25431 20914 32838 41054
15971D1054K73j4152j8319K942m386j052Q274Q389n253m329k970K7888L5747J1860
$$ 41054 41327 27175 8856 11798 7412 6360 14634 23023 17770 13441 10471 38359 74106 85966
15957H5966l569r221j1212k638k930n981R649l416k2413K103J3187K214o027J5811
$$ 85966 82397 73176 61964 59326 56396 50415 60064 56648 34235 36338 49525 51739 45712 61523
15943F1523J0936K6826K7454J4316O443J1641J5266M638j6851k5828j2470j1341
$$ 61523 72459 99285 126739 141055 147498 159139 174405 179043 162192 136364 123894 112553
15931A12553P9m774p344k1594q498n472k1474j450l239J4260m918j337k250Q031
$$ 112553 112632 107858 100514 78920 70422 64950 43476 42026 38787 53047 48129 46792 44542 52573
15917E2573J4696O069r164m547J187j2004J8275J2536N14J90k2917l1882l806
$$ 52573 67269 73338 64174 59627 60814 48810 67085 79621 80135 80325 57408 25526 21720
15904B1720J2077L4224J2851k156k0059k5777M070J2228L303j2864P999o592Q185
$$ 21720 33797 68021 80872 78716 58657 32880 36950 49178 52481 39617 47616 41024 49209
15891D9209J3894M176r080N951P725r065K4382Q787p570J0079j0830O077K1715
$$ 49209 63103 67279 58199 64150 71875 62810 87192 95979 88409 98488 87658 93735 115450
15878A15450n177l7090l845K2611n651N421K1562Q921J9M605m312k4753j4152
$$ 115450 110273 73183 69338 91949 86298 91719 113281 122202 122221 126826 122514 97761 83609
15865H3609j4531L974J5477j1762J003J6678N887j4679o902J46k0891L111J1224
$$ 83609 69078 73052 88529 76767 77770 94448 100335 85656 78754 78900 58009 61120 72344
15852G2344k1153n906o519J3021K4111j7103k0259N410K5467q16k4428L582J0924
$$ 72344 51191 45285 38766 51787 75898 58795 38536 43946 69413 68597 44169 47751 58675
15839E8675J7636N824j4180J3942K1198r809k5325m20K3269p472r255J052J0172
$$ 58675 76311 82135 67955 81897 103095 93286 67961 67541 90810 83338 74083 75135 85307
15826H5307K4315K8213P944j4226K456J9438J6582R742J7268M2180K0153K0472
$$ 85307 109622 137835 145779 131553 134009 153447 170029 179771 197039 239219 259372 279844
15814B79844Q401k4431k5058q853l6751m2966l9955k4666j2005M192L929K203
$$ 279844 288245 263814 238756 229903 193152 150186 110231 85565 73560 77752 81681 83884
15802H3884K4978L259L3660R341j8467J5169J5779m675J5127L8282K5006n909
$$ 83884 108862 112121 145781 155122 136655 151824 167603 162928 178055 216337 241343 235434
15790B35434j8354J701j7461L2013J1457J7631L6546p352j2325O867J6251K5634
$$ 235434 217080 218781 201320 233333 244790 262421 298967 291615 279290 286157 302408 328042
15778C28042K0507l757L0746Q394L373j5875l285J9761n640q447j0248o733m606
$$ 328042 348549 344792 375538 383932 387305 371430 368145 387906 382266 373819 363571 356838 352232
15765C52232j964J1239o126j0888O204j1561k0825l383J3898J8273J5529l769
$$ 352232 350268 361507 355381 344493 350697 339136 318311 314928 328826 347099 362628 358859
15753C58859N010J4121J4737J1852k3926j4664J8497L031J0947m599J2604L8109
$$ 358859 363869 377990 392727 404579 380653 365989 384486 387517 398464 393865 406469 444578
15741D44578M3051K2679L536J1957J4488L6402J3464N712l5909j4231L0586N7148
$$ 444578 487629 510308 513844 525801 540289 576691 590155 595867 559958 545727 576313 633461
15729F33461L7961J6927L7497M5001L7588M8392N0944M6626O2543N5946M7255
$$ 633461 671422 688349 725846 770847 808435 856827 907771 954397 1016940 1072886 1120141
15718A120141N1219Q0436Q1962Q0132J25469R1934R0500J43051J66050J75977
$$ 1120141 1171360 1251796 1333758 1413890 1539359 1631293 1721793 1864844 2030894 2206871
15708B206871J79024K34976L01900L92495M46370M88285O23111P32130Q38897
$$ 2206871 2385895 2620871 2922771 3315266 3761636 4249921 4873032 5605162 6444059
15699F444059R57582J084098J258299J527415J953645K616844L699420N487551
$$ 6444059 7401641 8485739 9744038 11271453 13225098 15841942 19541362 25028913
15691B5028913Q173189J1953597J6218218J9850113K2717571K5303721K5694661
$$ 25028913 33202102 45155699 61373917 81224030 103941601 129245322 154939983
15684A54939983K0887108J2596662N251867j607187j0371841j8652556k2439797
$$ 154939983 175827091 188423753 193675620 192068433 181696592 163044036 140604239
15677A40604239k2176358k0222553j7302957j3633605j0022703p156945n186597
$$ 140604239 118427881 98205328 80902371 67268766 57246063 50089118 44902521
15670D4902521l957385l278575k870552k673030k626530k602115k545624k489301
$$ 44902521 40945136 37666561 34796009 32122979 29496449 26894334 24348710 21859409
15662B1859409k337030k150559j913454j658903j476378j287210j093846r42443
$$ 21859409 19522379 17371820 15458366 13799463 12323085 11035875 9942029 8999586
15654H999586q28761p49224o50072n62409m99365m59942m34773l82605l42001
$$ 8999586 8170825 7421601 6771529 6209120 5709755 5249813 4815040 4432435 4090434
15645D090434l11843k69457k56799k29231j94828k06811j66235j50347j54773
$$ 4090434 3778591 3509134 3252335 3023104 2828276 2621465 2455230 2304883 2150110
15636B150110j47191j41953j40541j14374j41188j04180q8558r8100r4617q1204
$$ 2150110 2002919 1860966 1720425 1606051 1464863 1360683 1272125 1174025 1079408 998204
15626I98204o9728p0632o1131m9057l7715k4328l255j7337m6599n9076k3452k0241
$$ 998204 928476 857844 796713 747656 709941 685613 682358 665021 618422 559346 535894 515653
15614E15653j5731j9980j1606o847m072k109P456Q506k3732k1196k8447l0597
$$ 515653 499922 479942 468336 461489 457417 455308 462764 471270 447538 426342 397895 367298
15602C67298j3065K1362O617j0740j571L025k3910j5624j5730j4478k392J4651
$$ 367298 354233 375595 382212 371472 369901 372926 349016 333392 317662 303184 300792 315443
15590C15443l880j6608j1460J187L609O552k1466k8998l4610j0799R997N95J6855
$$ 315443 311563 294955 283495 284682 288291 294843 273377 244379 209769 198970 208967 209562 226417
15577B26417K3076L029j8201p269j9027k938L029R528p737n434R692J4338J6799
$$ 226417 249493 252522 234321 227052 208025 205087 208116 217644 209907 204473 214165 228503 245302
15564B45302k751K5171M5639K3517K1701K1104K8893K5078K609K784l4515m7391
$$ 245302 242551 267722 313361 336878 358579 379683 408576 433654 436263 439047 404532 357141
15552C57141j4305m8378m9608l4569q463j6251j1244N35N078J7986J0135m101
$$ 357141 342836 294458 244850 210281 201818 185567 174323 174858 179936 197922 208057 203956
15540B03956k4027N853J1229J0343J4572J9161j819j3334R203o999M039K967j1388
$$ 203956 179929 185782 197011 207354 221926 241087 239268 225934 235137 228138 232177 235144 223756
15527B23756J2956O666k9515j8604j1412L600J3488k5046J2743K188m310j80n102
$$ 223756 236712 243378 213863 195259 183847 187447 200935 175889 188632 190820 186510 186330 181228
15514A81228j5533k6301j3344l708j2964j999j0983j472j1342k505k5107O017
$$ 181228 165695 139394 126050 122342 109378 107379 96396 94924 83582 81077 55970 61987
15502F1987K6168K5666k6843m2563j9822P76m678k2139j0833J3969j0121m280
$$ 61987 88155 113821 86978 44415 24593 25369 20691 -1448 -12281 1688 -8433 -12713
15490a2713r25K4251K0827o330m951Q652L230o940j704j277J9588n569j6523J8694
$$ -12713 -13638 10613 31440 25110 20159 28811 32041 25101 23397 22120 41708 36139 19616 38310
15476C8310K6831J452J3164P406j6094l4228j5525J1756q089J2410l704J9775
$$ 38310 65141 66593 79757 87163 71069 36841 21316 33072 24983 37393 33689 53464
15464E3464M1697O466l0449k1056R61K487j3253r499n01J698k4433j4306R256
$$ 53464 95161 101627 71178 50122 51083 53570 40317 30818 30317 32015 7582 -6724 2532
15451B532J4124J5982k067J5447K3885j7386l615j3145l3150k3906J1780J7242
$$ 2532 16656 32638 30571 46018 69903 52517 48902 35757 2607 -21299 -9519 7723
15439G723K5201J9542j5073r913n022O411R27m445K0022J0091k431l103J1364
$$ 7723 32924 52466 37393 27480 22458 28869 29796 25351 45373 55464 53033 49930 61294
15426F1294q42K969j1432j1915n046j6010l600m806J0379J9311J3407K5000Q897
$$ 61294 60452 63421 51989 40074 35028 19018 15418 10612 20991 40302 53709 78709 87606
15413H7606j0924O35R314j8325j4948o075o010Q301O091m553n129M038q588k472
$$ 87606 76682 77317 86631 68306 53358 47283 41273 49574 55665 51112 45983 50021 41433 38961
15399C8961N80J0812j2781P730K956k4557r003K4315J2731m891k0831n360L0430
$$ 38961 39541 50353 37572 45302 48258 23701 14698 39013 51744 46853 26022 20662 51092
15386E1092Q965j902j3769m671j2294j0889j8274q137j0693m776k014J2861p275
$$ 51092 60057 58155 44386 39715 27421 16532 -1742 -9879 -20572 -25348 -27362 -14501 -21776
15373b1776j3852R117J1710K07q082J4433J7537k7345R88K2749K1049L904J048
$$ -21776 -35628 -26511 -14801 -14594 -22676 -8243 9294 -18051 -17063 5686 26735 30639 31687
15360C1687k8126m9052n599K8493Q519j5797R605O623j8618K6237K7510k3091
$$ 31687 3561 -45491 -51090 -22597 -14078 -29875 -20270 -13647 -32265 -6028 21482 -1609
15348a609j6934p790K9278n234O27J3350r635N424l901l869J2130J2182R0K077
$$ -1609 -18543 -26333 2945 -2289 -1662 11688 2053 7477 3576 -293 11837 24019 24109 26186
15334B6186j0190J55j8105m0082m395Q480L6559K9833L672j7211m451j6438J1158
$$ 26186 15996 16151 -1954 -42036 -46431 -37951 -1392 28441 32113 14902 10451 -5987 5171
15321E171J5933J116K833l717k1489L006J0828J6152k5015k8067n755O264Q334
$$ 5171 21104 22220 25053 21336 -153 2853 13681 29833 4818 -23249 -29004 -22740 -14406
15308a4406L315L593J4992J3488P938j9904P88N227K427j5999J3752J4345J6984
$$ -14406 -11091 -7498 7494 20982 28920 9016 9804 15031 17458 1459 15211 29556 46540
15295D6540N028k7234j2833k419J7691J1124j889J3431m488K003j5848M487j8331
$$ 46540 51568 24334 11501 9082 26773 37897 36008 49439 44951 46954 31106 35593 17262
15282A7262j2477j0573m612j2179N249J9188J2124j3952M055L644R016l765k0111
$$ 17262 4785 -5788 -10400 -22579 -17330 1858 13982 30 4085 7729 16745 12980 -7131
15269g131j0344J4279O989j9333k285m318m824K1203J8221j5104m578J8136l413
$$ -7131 -17475 -3196 3793 -15540 -17825 -22143 -26967 -5764 12457 -2647 -7225 10911 7498
15256G498l6530l457L103M004P160K0021Q833o722k5359o618O098p999J8312j992
$$ 7498 -29032 -32489 -29386 -25382 -18222 1799 10632 3910 -21449 -28067 -21969 -29968 -11656 -13648
15242a3648Q701j4328j3738J7146O988j0886j1954J492L8172K8485N083k2290
$$ -13648 -4947 -19275 -33013 -15867 -8879 -19765 -31719 -30227 7945 36430 41513 19223
15230A9223j8965k361J5098j3985J4367J9137L260j9938j3975o336k8213K4200
$$ 19223 258 -2103 12995 -990 13377 32514 35774 15836 1861 -4475 -32688 -8488
15218h488K5242O678Q65O3Q798k0784J392L2370J4714k3852k2959J2409J7842
$$ -8488 16754 23432 24297 24360 33158 12374 13766 46136 60850 36998 14039 26448 44290
15205D4290r925m237N411j3526m044O769j4662o313l236P544p916O669m780k9621
$$ 44290 34365 30128 35539 22013 17969 24738 10076 3763 527 8071 155 6824 2044 -27577
15191b7577j1824J3678N117J0096l253m037j6038M214K357O724Q039M2118M289
$$ -27577 -39401 -25723 -20606 -10510 -13763 -17800 -33838 -29624 -27267 -20543 -12504 29614 33903
15178C3903j6116j981j8334o996J1278o383R986O207j2815P146L0049n24o927
$$ 33903 17787 15806 -2528 -9524 1754 -4629 5357 11564 -1251 5895 35944 35420 28493
15165B8493N935Q746o471k8062j8038J3097j424q890j4954k652K2648L6289J6923
$$ 28493 34428 43174 36703 8641 -9397 3700 2276 -6614 -21568 -24220 -1572 34717 51640
15152E1640p745l6639m8954J801L3455K5284J0026K073R71o660J743l300j6274
$$ 51640 43895 7256 -41698 -39897 -6442 18842 28868 30941 31912 25252 26995 23695 7421
15139G421J7660n364k7152n658L7947O641N444J1465J5170J2326j809j3962k4986
$$ 7421 25081 19717 -7435 -13093 24854 31495 36939 48404 63574 75900 74091 60129 35143
15126C5143m878J5465N271r615j6937J9238K5611J6458K231M6987L7218J9767
$$ 35143 30265 45730 51001 41386 24449 43687 69298 85756 87987 134974 172192 191959
15114A91959O2660J09209Q5849R9557J05551J03707O9953R1435O0529l769o5211
$$ 191959 254619 363828 449677 549234 654785 758492 828445 919880 980409 976640 911429
15103I11429j04015j13872j01714p2327q6799n3734n7462m6594l5480j6712M09
$$ 911429 807414 693542 591828 519501 432702 378968 321506 274912 239432 222720 223129
15092B23129L7889j6862l1774k5186l1687l4j1644l3602j0007N263k7614m3920
$$ 223129 261018 244156 212382 187196 155509 155475 143831 110229 100222 105485 77871 33951
15080C3951j083j031j8958K2752K998j1880P50l772l492n204M894p864l502N436
$$ 33951 32868 31837 12879 35631 38629 26749 27499 23727 20235 15031 19925 12061 8559 13995
15066A3995J7113o339j3943P876j3237J0380R681j8012j768j3696K199J0975O550
$$ 13995 31108 24769 10826 18702 5465 15845 25526 7514 5746 -7950 -5751 5224 11774
15053A1774q576o762k3416P299J3588j34O46j3804j2475J1727q256j9207l823
$$ 11774 3198 -3564 -26980 -19681 -6093 -6227 -5581 -19385 -31860 -20133 -28389 -47596 -51419
15040e1419P630L1037K6543J6844K636l552q815m517Q758l254j5748j9387N141
$$ -51419 -43789 -12752 13791 30635 33271 29719 20904 16387 25145 21891 6143 -13244 -8103
15027h103N696r547K7678j173p514O349j9230j3463J2178m380j8570P41J0807
$$ -8103 -2407 -11954 15724 14551 7037 13386 -5844 -19307 -7129 -11509 -30079 -29338 -18531
15014a8531J1859K2392j8272j5095J1466M9l337K3052J0156K332j1048p713m547
$$ -18531 -6672 15720 -2552 -17647 -6181 -6132 -9469 13583 23739 26071 15023 7310 2763
15001B763j1091nJ0118J07k4449J1005m652J0790l396k0251n677P212K9052K1218
$$ 2763 -8328 -8333 1785 1892 -22557 -11552 -16204 -5414 -8810 -29061 -34738 -27526 1526 22744
14987B2744l170k2965j1306j61j710k367j048q291J4100K9379Q590p550J5756
$$ 22744 19574 -3391 -14697 -14858 -16568 -18935 -19983 -28274 -14174 15205 23795 16245 32001
14974C2001K2370K810k2684l818J0206j9956k7190J13K4946K3537p571l441k0337
$$ 32001 54371 57181 34497 30679 40885 20929 -6261 -6148 18798 42335 34764 31323 10986
14961A0986l0418l196L5844M1295M738l2103k8528k317P009L699o606j1622j1737
$$ 10986 -19432 -22628 13216 54511 59249 27146 -1382 -3699 3310 7009 403 -11219 -22956
14948b2956R367P610m207j418J0340J8717R812j6569J982p48N523j4062J300j5710
$$ -22956 -13589 -5979 -10186 -11604 -1264 17453 27265 10696 12678 11930 17453 3391 4691 -11019
14934a1019p679Q796J0523J1886r567q015k0527K951Q961N759m5m415O704K8718
$$ -11019 -18698 -9902 621 12507 2940 -5075 -25602 -22651 -13690 -7931 -7976 -12391 -5687 23031
14920B3031J2241m688k4939j7620J15q947J9117J0708O076r074j622L0150n074
$$ 23031 35272 30584 5645 -11975 -11860 -20807 -1690 9018 15094 6020 4398 34548 29474
14907B9474m457J1561k1322j8554m162l001O892J3616p724J83j001L953n330l2
$$ 29474 25017 36578 15256 -3298 -7460 -10461 -3569 10047 2323 2506 1505 5458 128 96
14893I6k398k517j215l239j0743J3470M367n352K149J2934J7181j0379r940K4516
$$ 96 -2302 -4819 -6034 -9273 -20016 -6546 -2179 -7531 -5382 7552 24733 14354 4414 28930
14879B8930p121n063M778P830l8719j4569J5013J2130M006M566N028j577j1633
$$ 28930 21809 16746 21524 29354 -9365 -23934 -8921 3209 7215 11781 16809 15232 3599
14866C599J4386L4293J3566k1828J231M903k0973j8047N811J8208j2910k3762
$$ 3599 17985 52278 65844 44016 45247 50150 29177 11130 16941 35149 22239 -1523
14854a523K460K352j1836o560J9111n577l1525j1258J5358K6551N425R853q458
$$ -1523 937 3289 -8547 -15107 4004 -1573 -33098 -44356 -28998 -2447 2978 12831 4373
14841D373M299O733J4950j0359j1257n577j4730j2625j4676p068J2009K6169K2657
$$ 4373 8672 15405 30355 19996 8739 3162 -11568 -24193 -38869 -45937 -33928 -7759 14898
14828A4898j961j3138K659l428j9610j2772R890K9209k765j2795j5660K203O338
$$ 14898 12937 -201 2458 -970 -20580 -33352 -23462 5747 2982 -9813 -25473 -23270 -16932
14815a6932J6636J0575j0685j6441p933J5294L2181J0230k7480P708R312j6315
$$ -16932 -296 10279 -406 -16847 -24780 -9486 22695 32925 5445 13153 22465 6150
14803F150l239r796r903l0O075R828J7599J509j7726K7975j0711j5756q498m203
$$ 6150 2911 -6885 -16788 -16818 -10743 -915 16684 18193 467 28442 17731 1975 -6523 -10726
14789a0726m368o615L3291J5336j4377l761l370o97K0953q494k0709m763K3889
$$ -10726 -15094 -21709 11582 26918 12541 8780 5410 4713 25666 17172 -3537 -8300 15589
14776A5589M19m660r052j375L1377J519M347k7596q288Q401N742M565O844o294
$$ 15589 16008 11348 2296 921 32298 33817 38164 10568 2280 10681 16423 20988 27832 21538
14762B1538k540l523o34j1672j3792M487Q688j3368j4500K1860n03J2602o161
$$ 21538 18998 15475 14841 3169 -10623 -6136 2552 -10816 -25316 -3456 -3959 8643 2482
14749B482J773o425j1619k5369J8545J2428K0650J943l990M70j8781k5288N356
$$ 2482 4255 -2170 -13789 -39158 -20613 -8185 12465 14408 10418 10888 -7893 -33181 -27825
14736b7825o308R612J874M004j0088K0565K0641l628j8779j0316O287J2294o284
$$ -27825 -34133 -24521 -22647 -18643 -28731 -8166 12475 8847 -9932 -20248 -13961 -1667 -7951
14723g951j6031J5117P606L060j8380M764j0473o016j535J0108J0300j1841k7194
$$ -7951 -23982 -8865 -1259 1801 -16579 -11815 -22288 -28304 -29839 -19731 -9431 -21272 -48466
14710d8466K2403K7187j2446q589J6308Q542j4759q187m058K690K9522J4118j9405
$$ -48466 -26063 1124 -11322 -19911 -3603 4939 -9820 -18007 -22065 -19375 10147 24265 4860
14697D860J5235P674j4462K0549J0138m317j2736j693J0811J0342o045j3937j2745
$$ 4860 20095 27769 13307 33856 43994 39677 26941 25248 36059 46401 40356 26419 13674
14684A3674O53R507J0394J7807q259j9266q331j3759p867k1904K935J1374j5491
$$ 13674 14327 23834 34228 52035 43776 24510 16179 2420 -5447 -27351 -24416 -13042 -28533
14671b8533j6346J3537p827l198J8444L455K0726J0831J3001p055j8848j0230
$$ -28533 -44879 -31342 -39169 -42367 -23923 -20468 258 11089 24090 17035 -1813 -12043
14659a2043J4115J3344j4029m918M392P667n867K633R325j4967k8797j1089N114
$$ -12043 2072 15416 1387 -3531 861 8528 2661 5294 14619 -348 -29145 -40234 -35120
14646c5120J8460m299j0311M678L6425L8977r422k9927k1390o506j5214m156K9456
$$ -35120 -16660 -20959 -31270 -26592 9833 48810 39388 9461 -11929 -18435 -33649 -37805 -8349
14633h349J7448J1304j703j2368o834j5567p899P396L522q569r57J5869j0541
$$ -8349 9099 20403 18700 6332 -502 -16069 -23968 -16572 -13050 -21619 -22576 -6707 -17248
14620a7248k9783J3265R516j154Q817j14j0186m079J3779l1420l314N2639K2492
$$ -17248 -47031 -33766 -24250 -25404 -16587 -16701 -26887 -30966 -17187 -48607 -51921 718 23210
14607B3210R12j5939j2967J0861N743q535j5299K1083K0379l38j2113K51K119
$$ 23210 24122 8183 -4784 6077 11820 3285 -12014 9069 29448 29110 16997 17248 19367
14594A9367j3697K5523P709k8770J0218L1971k1472k6877J9595J1147j8624k7657
$$ 19367 5670 31193 38902 10132 20350 52321 30849 3972 23567 34714 16090 -11567
14582a1567j0819K8622J0874K303l723o447l5079j3279O40J4227L1679R839L921
$$ -11567 -22386 6236 17110 19413 15690 9243 -25836 -39115 -38475 -24248 7431 17270 21191
14569B1191r493k4156m964P190J4867J3633J1124j1459j9582J0512J7807l482
$$ 21191 11698 -12458 -17422 -10232 4635 18268 29392 17933 -1649 8863 26670 23188
14557B3188q678k4349j3983j0476j781K6601L2331J454j6107k2541p465j4475
$$ 23188 14510 -9839 -23822 -34298 -36079 -9478 22853 24307 8200 -14341 -21806 -36281
14545c6281m786J4301K1528K8017K1893k1657l940k1633j6239J3529M772l893
$$ -36281 -41067 -26766 -5238 22779 44672 23015 19075 -2558 -18797 -5268 -496 -4389
14533d389J0441K8616P726k0245p099n254j5707K5680J9642r659j8314r039J475
$$ -4389 6052 34668 42394 22149 15050 9796 -5911 19769 39411 29752 11438 2399 3874
14520C874K791k2841J503K6699K5393L998p679j1795k0450J2841J0411Q057J147
$$ 3874 6665 -16176 -14673 12026 37419 41417 33738 21943 1493 14334 24745 32802 33949
14507C3949j1021k0695k1417J5700L327j4207j815j541j7151l386k461J0350O010
$$ 33949 22928 2233 -19184 -3484 -157 -14364 -16179 -17720 -34871 -38257 -40718 -30368 -24358
14494b4358K1668N183p679N790J2085j0105M62K854J0329M0449J0693l0975k930
$$ -24358 -2690 2493 -5186 604 12689 2584 3046 5900 16229 56678 67371 36396 33466
14481C3466l859o400J2095k1140k6578j3122p754m515J1659J1369j968J4123n275
$$ 33466 29607 23207 35302 14162 -12416 -25538 -33292 -37807 -26148 -14779 -16747 -2624 -7899
14468g899j3362J2649j9187r078q369L874j639L691J8522J5861j085j2645J2282
$$ -7899 -21261 -8612 -27799 -36877 -45246 -41372 -43011 -39320 -20798 -4937 -6022 -18667 -6385
14455f385K3488N677j1913k814k932k0002k8519J8539j5761m259J2666K2621j3711
$$ -6385 17103 22780 10867 8053 5121 -14881 -43400 -24861 -40622 -44881 -32215 -9594 -23305
14442b3305P661J9820N343q867j3950j4421M962j1424J0278J6749p516J529M344
$$ -23305 -15644 4176 9519 652 -13298 -27719 -22757 -34181 -23903 -7154 -14670 -13141 -8797
14429h797N848J3359J1698n809k3907j9l681J2488K554J8687k4431k0640l6661
$$ -8797 -2949 10410 22108 16299 -7608 -7627 -11308 1180 3734 22421 -2010 -22650 -59311
14416e9311l117K3116K7267L7961j0003o174N556j0521N878J4238n129j8977L385
$$ -59311 -62428 -39312 -12045 25916 15913 9739 15295 4774 10652 24890 19761 784 4169
14403D169P945j202j5662q874n976o328J6902M831N122K4675K6777o31j9696j2524
$$ 4169 12114 10912 -4750 -13624 -19600 -25928 -9026 -4195 927 25602 52379 51748 32052 19528
14389A9528j5964j4949L540K8339L1277q768k4138j3720J0193j4670m627m22m177
$$ 19528 3564 -11385 -7845 20494 51771 43003 18865 5145 15338 668 -3959 -4381 -8558
14376h558K9831L851N055k40L360O27p185j9337J2363K7279q292j5197K00o791
$$ -8558 21273 25124 30179 29939 33299 33926 26741 7404 19767 47046 38754 23557 23757 16966
14362A6966l1586l860J5971j3391J5187K3006j1069l0626J9094K4544J3905k629
$$ 16966 -14620 -18480 -2509 -15900 -713 22293 11224 -19402 -308 24236 38141 35512
14350C5512j494j5408k0987k0339j8591q850J0078N417M167J9728R340J4833J8393
$$ 35512 34018 18610 -2377 -22716 -41307 -50157 -40079 -34662 -30495 -10767 -1427 13406 31799
14337C1799m530q571k2399j2120J2304o265l8350J6374K6449J1643o866k7761
$$ 31799 27269 18698 -3701 -15821 -3517 -9782 -48132 -31758 -5309 6334 -532 -28293
14325b8293M57J0101L9445J8582j9954p692j57k1438o428J759J9445L5938J11
$$ -28293 -27836 -17735 21710 40292 20338 12646 12489 -8949 -15377 -13618 5827 41765 41876
14312D1876m889j5786l786M321m26k61J226k727j2289j3625K2475J1241J6561
$$ 41876 36987 21201 17415 21736 21310 21049 22275 19548 7259 -6366 16109 27350 43911
14299D3911p143p209j1964n593j8858M105K2717o828k3202K3052L3330j0888k0947
$$ 43911 36768 29559 17595 12002 -6856 -2751 19966 13138 -10064 12988 46318 35430 14483
14286A4483J985m732J3573k9956k9687j5982J8025K9081K085J8637L0248J322
$$ 14483 16468 11736 25309 -4647 -34334 -50316 -32291 -3210 -1125 17512 47760 49082
14274D9082m2028j5989j4416L074J4487R987n80J3095O794o633j0452J0299J0711
$$ 49082 7054 -8935 -23351 -20277 -5790 4197 3617 16712 23506 16873 6421 16720 27431
14261B7431o101j4015L112k090k345n717Q633J6987j1622m5778j2277N483j3616
$$ 27431 21330 7315 10427 8337 5992 275 8908 25895 14273 -31505 -43782 -38299 -51915
14248e1915J6440M856P579L24K6250J5759n80q576j3829M047L171K244j4626k1966
$$ -51915 -35475 -30619 -23040 -22716 3534 19293 18713 10137 -3692 355 3526 5770 -8856 -30822
14234c0822M672R048j1687k7827R918L5316Q374J8845L552n283P398j8154j0575
$$ -30822 -26150 -17102 -28789 -56616 -46698 -11382 -3008 15837 19389 14106 21504 3350 -7225
14221g225L220m099K8J0936m679k1657l053K2515J5693J0011Q749k0960Q675n318
$$ -7225 -4005 -8104 -8076 2860 -1819 -23476 -26529 -4014 11679 21690 30439 9479 18154 12836
14207A2836j5744l723J5791J8369l714R606q082j0939R81N074J1474M4670r489
$$ 12836 -2908 -6631 9160 27529 23815 33421 25339 14400 15381 20455 31929 76599 67110
14194F7110m5271k1778L0135L478Q955l034k0142j9903k2847N917O649q651q808
$$ 67110 21839 61 30196 33674 42629 39595 19453 -450 -23297 -17380 -10731 -19382 -28190
14181b8190K1687l945k1430J4126J9348M943o797j0615j44J1718Q865N564O085
$$ -28190 -6503 -10448 -31878 -17752 1596 6539 -258 -10873 -11017 701 9566 15130 21215
14168B1215l365l0021L158J1332J9901J5705l3752r638L6865J0049m17J2527m075
$$ 21215 17850 -12171 -9013 2319 22220 37925 4173 -5465 31400 41449 41032 53559 49484
14155D9484j4668m112j2274q431o894K4775K0760P34k5237j5436m316N983k8507
$$ 49484 34816 30704 18430 9999 3105 27880 48640 49374 24137 8701 4385 10368 -18139
14142a8139l156M445M0065O183j7741J0028p615q48j2377j6294J2987j6198j6407
$$ -18139 -21295 -16850 23215 29398 11657 21685 14070 13222 845 -15449 -2462 -18660 -35067
14129c5067j3930M694J8321J7891J0221N644l033O146L4119k381n188j7325j5399
$$ -35067 -48997 -44303 -25982 -8091 2130 7774 4741 10887 45006 42625 37437 20112 4713
14116D713J913K5982p439k2652k099j2459J73K1303J620r43J2078k832r608K6658
$$ 4713 6626 32608 25169 2517 418 -12041 -11868 9435 11055 10112 22190 19358 9750 36408
14102C6408n378j9167j549J525m727n319P478p213L4873K5856j8173L982J575
$$ 36408 31030 11863 10314 11839 7112 1793 9271 2058 36931 62787 44614 48596 50171
14089E0171l2285j505J1023J57j9810r587J231R823J0105J7896J4311N368j8978
$$ 50171 17886 16381 27404 27561 7751 -1836 -605 9218 19323 37219 51530 56898 37920
14076C7920j4768K6772M041k3199j9308j9163P33j3806q863O423l207J9874K0674
$$ 37920 23152 49924 53965 30766 11458 -7705 -6972 -20778 -29641 -23218 -26425 -6551 14123
14063A4123J4236J2545n55k0780J3470K0123n332j229l948j0006L884j7704L986
$$ 14123 28359 40904 40349 19569 33039 53162 47830 46601 42653 32647 36531 18827 22813
14050B2813J9649n436m079j0590M424j4059k2843j8418q808n45K360J3331J9160
$$ 22813 42462 37026 32947 22357 26781 12722 -10121 -28539 -37347 -37892 -35532 -22201 -3041
14037c041q63N938O351O980l231K3453J2678q671r162p619j2048r046J204m03
$$ -3041 -3904 2034 8385 15365 12134 35587 48265 39594 30432 22813 10765 1719 2923 2520
14023B520j178R225l506K31K4599R780k4022j2484N213K4300J0989k6148j5465
$$ 2520 1342 10567 7061 7292 31891 41671 17649 5165 10378 34678 45667 19519 4054
14010D054J5315K3742L0724j1766J6538j220m3599l3402j3350j829M950L345j250
$$ 4054 19369 43111 73835 62069 78607 77387 33788 386 -12964 -14793 -9843 -6498 -7748
13997g748J3424J8211o667j882M115Q330Q411n328m982j7025n472p167K360j1565
$$ -7748 5676 23887 17220 15338 19453 27783 36194 30866 25884 8859 3387 -3780 -1420 -12985
13983a2985J06p708k42L307j9257J7253R980M058j3673N938P88P920J1791j2140
$$ -12985 -12879 -20587 -20829 -17522 -36779 -19526 -9546 -5488 -19161 -13223 -12435 -4515 7276 -4864
13969d864J650Q234J1657m822J2182j9543R901Q475r072k93J7943k704k5380J877
$$ -4864 -3214 5020 16677 11855 24037 4494 14395 22870 13798 13505 31448 28744 3364 5241
13955E241J0720M580J1275m367n499k1851m2526k901K1102J3395J8384K7824J5533
$$ 5241 15961 20541 31816 27449 21950 99 -42427 -45328 -24226 -10831 7553 35377 50910
13942E0910O552k6159l1482j3460j3656Q420J2822N990J4649J0007K0833O492
$$ 50910 57462 31303 -179 -13639 -27295 -18875 -6053 -63 14586 24593 45426 51918
13930E1918j2381r132j6827j531M039J5515j8799J2988k5755j9707m15M606R374
$$ 51918 39537 30405 13578 12047 16086 31601 12802 25790 35 -19672 -20087 -15481 -6107
13917f107P261N190O68j868j2678k7533j694K2461N885M504J2908r373k7149J5121
$$ -6107 1154 6344 7012 5144 -7534 -35067 -36761 -14300 -8415 -3911 8997 -376 -27525 -12404
13903a2404q194m712J7455p6J2048K808j0340L925q428k644N889J8874K0454j6802
$$ -12404 -20598 -25310 -7855 -7931 4117 6925 -3415 510 -7918 -10562 -4673 14201 34655 17853
13889A7853J2493J0837j8221j4839L760k2964k3460q873K7613K6021o419j2441
$$ 17853 30346 41183 22962 8123 11883 -11081 -34541 -43414 -15801 10220 3801 -8640
13877h640R977k244Q958O643j0951N01j1539q910J1089J3571J3499n752K822J5232
$$ -8640 1337 -907 8051 14694 3743 4244 -7295 -16205 -5116 8455 21954 16202 19024 34256
13863C4256j3372l088K2059j2751j5327j1320M710p918K189J2448j7430j5078
$$ 34256 20884 17796 39855 27104 11777 457 5167 -2751 -562 11886 -5544 -20622
13851b0622K278J2545m509k631k251J7777J0500N261l2885O945J5735j3188O293
$$ -20622 -18344 -5799 -10308 -12939 -15190 2587 13087 18348 -14537 -7592 8143 -5045 1248
13838A248j0791L166m449O451o57j1548j9494R37J131Q516L1581K2911K2267j871
$$ 1248 -9543 -6377 -10826 -4375 -5032 -16580 -36074 -35137 -34006 -25490 6091 29002 51269 49398
13824D9398k8326j6110J3353L452J4404k170J569k0164j4312K1179J0287l550
$$ 49398 21072 4962 18315 21767 36171 34001 35570 15406 1094 22273 32560 29010
13812B9010j251L69J0339k3565N79J583r3Q523r968o889N151L552N629k036Q409
$$ 29010 27759 28128 38467 14902 15481 17064 16971 25494 15526 8637 13788 17340 22969 20933 29342
13797B9342J4751J8062r593l507j0902j7448N921P617k9998l5107P871P85J486
$$ 29342 44093 62155 52562 49055 38153 20705 26626 34243 4245 -30862 -22991 -22206 -20720
13784b0720J6365J0172m350j0431p296j817N849J8304J9518j169k2574q087j3859
$$ -20720 -4355 5817 1467 -8964 -16260 -18077 -12228 6076 25594 24425 1851 -6236 -20095
13771b0095k365o544J6388K5649k3945l584J8870j2424j4394J7668M3867O483
$$ -20095 -22460 -29004 -12616 13033 -10912 -14496 4374 -8050 -22444 -4776 39091 45574
13759D5574L388L322j4487k1674j1169K0802j6171j3622q052J3810J6755N249
$$ 45574 48962 52284 37797 16123 4954 25756 9585 -4037 -12089 1721 18476 23725
13747B3725N334k2419J601L57J073J2915p921L472K2693N977r846Q003o250j036
$$ 23725 29059 6640 8241 8598 9671 22586 14665 18137 40830 46807 36961 44964 38714 37678
13733C7678O040J0942l80j7290j922J665j0584j6663N607M389Q13L5645R942j7651
$$ 37678 43718 54660 54280 36990 35068 36733 26149 9486 15093 19482 20295 55940 65882 48231
13719D8231k0261o074J8031k6333Q415K857j1406K546J5959M95j2039L811p060
$$ 48231 27970 21896 39927 13594 22009 24866 13460 16006 31965 32460 20421 24232 17172
13706A7172p698O906k117o272l2517J5766M2466l582J4239n163m326p230O29Q111
$$ 17172 9474 16380 14263 7991 -24526 -8760 33706 30124 44363 39200 34874 27644 28273 36384
13692C6384M673j1977l700j1071J0542j8080j3734J2670R664L907j6070j5586
$$ 36384 41057 29080 25380 14309 24851 6771 -6963 5707 15371 19278 3208 -12378
13680a2378L607J3988R601k6391j8611K9649J5947r783Q926L915r675K4791R059
$$ -12378 -8771 5217 14818 -11573 -30184 -535 15412 5629 14555 18470 8795 33586 42645
13667D2645j7784J402M12j0929J4416J922M861j1137k4352n170R256J2070J2631
$$ 42645 24861 26263 26675 15746 30162 32084 36945 25808 1456 -3714 5542 17612 30243
13654C0243n255l064K2072p98J7252J541q917l6454k4594R132K1445K5604j4965
$$ 30243 24988 21924 43996 43198 60450 61991 53074 16620 -7974 1158 22603 48207 33242
13641C3242l0828j3350j624l549J2242J3660O126p095j2071j1202J5826R55r175
$$ 33242 2414 -10936 -12560 -16109 -3867 9793 15919 8824 -3247 -14449 1377 2332 -6843
13628f843J823K7333J6915j1370N954j5949K628J3464N569J709q471j1670n214
$$ -6843 -5020 22313 39228 27858 33812 17863 20491 33955 39524 41233 32762 21092 15878
13615A5878J2912K0317K297k5641k1026N235O848J9333l696q339R656P383K861
$$ 15878 28790 49107 51404 25763 4737 9972 16820 36153 32457 24118 33774 41157 44018
13602D4018p367j6601j3139l4941j6184L5755K5660J8432p629k2585p995K5129
$$ 44018 36651 20050 6911 -28030 -44214 -8459 17201 35633 28004 5419 -2576 22553
13590B2553K4992r083j2227j4448l5440J3737J2289K3654q329k5048J8254N376
$$ 22553 47545 38462 26235 11787 -23653 -9916 2373 26027 17698 -7350 10904 16280
13578A6280m463J4736J3111l06J3244j716L660k092o918l310q201j4624J1322
$$ 16280 11817 26553 39664 39358 52602 50886 54546 52454 45536 42226 34025 19401 30723
13565C0723R659o474R33j0536M104J6545O378l2410j1080J46L980n998j1957l915
$$ 30723 40382 33908 34841 24305 28409 44954 51332 18922 7842 7988 11968 5970 -5987 -9902
13551i902q540L2347J5720N09K177k3631l984m485K1158j1361j51Q657J108O052
$$ -9902 -18442 13905 29625 30134 32311 8680 4696 211 21369 10008 9857 18514 19622 25674
13537B5674O474n395l3254k3888K7066L9972J387J1945K574k8785j1015k326K590
$$ 25674 32148 26753 -6501 -30389 -3323 36649 38036 49981 52555 23770 12755 10429 13019
13524A3019j0521J933J2263O091J039o730m177l3O43Q279K2937j56k680q497q265
$$ 13019 2498 4431 16694 22785 23824 17094 12917 12884 13527 21806 44743 44587 41907 33410 25145
13509B5145J7217j5601q244m001J322J8001n564j2521j0477j7455K0990l390N178
$$ 25145 42362 26761 18517 14516 15838 33839 28275 15754 5277 -12178 8812 5422 10600
13496A0600J6043r357k0545m138k348L727J2509R0m388j4465P636o287j413q14
$$ 10600 26643 17286 -3259 -7397 -9745 -6018 6491 6581 2193 -12272 -4636 -10923 -12336 -13150
13482a3150K7129M2817j1561m4296K032J7276L1363j6503m316J2667K5669J4983
$$ -13150 13979 56796 45235 939 2971 20247 51610 35107 30791 43458 69127 84110
13470H4110j2930l846j3458j5226k3905O26K2574j6350r838K3595j4707P515m339
$$ 84110 71180 67334 53876 38650 14745 15371 37945 21595 11757 35352 20645 28160 23821
13457B3821j1552o275J2675K4581J2468O341j0007k0002J189j693J5333J1128
$$ 23821 12269 5994 18669 43250 55718 62059 52052 32050 33239 31546 46879 58007
13445E8007j1113r186j2524M89p066J5368j3876Q952J4028o759J941J0591P935
$$ 58007 46894 37708 25184 25673 18607 33975 20099 29051 43079 36320 38261 48852 56787
13432E6787l345J1361r869k444O25j8688j5542J174J5310R031j7679l365J3256
$$ 56787 53442 64803 54934 52490 53115 34427 18885 20059 35369 44400 26721 23356 36612
13419C6612k5159N452L3902O873l2294l0704N705K095J2436J4647M237l863n376
$$ 36612 11453 16905 50807 57680 25386 -5318 387 2482 14918 29565 33802 29939 24563
13406B4563l3484J4191L1751k084N763K4215j4584n445o80r13Q802K6965n161
$$ 24563 -8921 5270 37021 34937 40700 64915 50331 44886 44206 43293 52095 79060 73899
13393G3899k2688j3912k0095K0355q461j7751m553n028k7713L724K5021L8979
$$ 73899 51211 37299 17204 37559 29098 11347 6794 1766 -25947 -22223 2798 41777
13381D1777J0760k4297l8680J25J2280o386o606N654K5377L3283p702j8564N776
$$ 41777 52537 28240 -10440 -10315 1965 -4421 -11027 -5373 20004 53287 45585 27021 32797
13368C2797N925J600j6484O0J052K3718J3715j2727j5646j0671J9047k822j920
$$ 32797 38722 40322 23838 23898 24950 48668 62383 49656 34010 23339 42386 39564 37644
13355C7644R989K8535J4170l2450Q030j1742j812l849p603j060K7680K906O851
$$ 37644 47633 76168 90338 57888 65918 54176 52364 48515 40912 39852 67532 70438 77289
13342G7289O156j3744j6559r151k490k848l429o253q115n212K849L0064J1390
$$ 77289 83445 69701 53142 43991 41501 38653 35224 28971 20856 15644 18493 48557 59947
13329E9947m575Q8o706k2323p224J7904K2103j657j7378l4625n685K5463n262
$$ 59947 55372 55460 48754 26431 19207 37111 59214 57557 40179 5554 -131 25332 20070
13316B0070k96P86J70O054q817k456L129p578O704J6751k9199j1458K9246J3174
$$ 20070 19774 20560 20730 26784 17967 15511 18640 11062 17766 34517 5318 -6140 23106 36280
13302C6280l02J2691j1359K235j4916k1488p111K6810L2395j906k8466r395k419
$$ 36280 35978 48669 37310 39545 24629 3141 -3970 22840 55235 53329 24863 15468 13049
13289A3049p977M870J5505J3945q688j5061K1219j9002q426L2667k512p667J6980
$$ 13049 5072 9942 25447 39392 30704 15643 36862 17860 9434 42101 39589 31922 48902
13276D8902j4878n639m360k4196j377R911J102J1284j7291k5693P597K2018K968
$$ 48902 34024 28385 24025 -171 -1548 8363 9465 20749 3458 -22235 -14638 7380 10348
13263A0348O395K2543j74m539j197j9385K562L6045R021l16j5626o707M427k1001
$$ 10348 16743 39286 39112 34573 33376 13991 16553 52598 61619 61303 45677 38970 43397 22396
13249B2396K6368K4327l093j9149l882J47n648J418L658Q633P17j0251N167Q799
$$ 22396 48764 73091 69998 50849 46967 47114 41466 42884 46542 55175 55892 45641 50808 59607
13235E9607J0236N271k0598j6911O336j829j194k021K71M661L31l491j8812K976
$$ 59607 69843 75114 54516 37605 43941 42112 40918 38897 39168 43829 44160 40669 21857 24833
13221B4833J995j1290M109j3709n53O208J8736j9374j0755Q255j4060j5704K777
$$ 24833 26828 15538 19647 5938 5385 11593 30329 10955 200 8455 -5605 -21309 -18532
13208a8532K3556J3603J6096j642j2796K0407J4641k7553m629J4326L030J430
$$ -18532 5024 18627 34723 33081 20285 40692 55333 27780 23151 37477 40507 41937
13196D1937k2976r14m177m862K3683J1945j4390p461j6747J0020K5962K2758J005
$$ 41937 18961 18047 13870 9008 32691 44636 30246 22785 6038 16058 42020 64778 65783
13183F5783j925j7890k6432j7423M259J3723K9176l435Q679q940p04n373O979
$$ 65783 63858 45968 19536 2113 6372 20095 49271 45836 54515 45575 44871 39498 46477
13170D6477J1379p53l0732o327J4818j344j1290J1057J5776M806L172j4934p45
$$ 46477 57856 57103 26371 20044 34862 33518 22228 33285 49061 53867 57039 42105 41360
13157D1360p365r366R558L851M499j9465j2590Q709l598K0437J4989J0200j0027
$$ 41360 33995 24629 34187 38038 42537 23072 10482 19191 15593 36030 51019 61219 51192
13144E1192J3711O896j2012N516J0397l0725j9601J1123J2743j472k244p951J333
$$ 51192 64903 71799 59787 65303 75700 44975 25374 36497 49240 47768 45524 37573 38906
13131C8906K6296J7518J1220r167q694P504L648q182m0540j3008O247R733Q762
$$ 38906 65202 82720 93940 84773 76079 83583 87231 79049 38509 25501 31748 41481 50243
13118E0243m696j3323l349j161Q869j412j7532N00J282L593J4072J8432k176j0982
$$ 50243 45547 32224 28875 27714 36583 35171 17639 18139 19421 23014 37086 55518 53342 42360
13104D2360r152l446Q592j4917J9161j09j7012J0102J4729J655j9571k1577R459
$$ 42360 33208 29762 38354 23437 42598 42489 25477 35579 50308 51963 32392 10815 20274
13091B0274K9826J4715q388m6677l0831R226J9016J449k652J1954K879K534N172
$$ 20274 50100 64815 56427 9750 -21081 -11855 7161 8610 5958 17912 20791 23325 28497
13078B8497J832j3364l4342J4868L0998J2146K8013J6810J5414J9218j7503j449
$$ 28497 30329 16965 -17377 -2509 28489 40635 68648 85458 100872 120090 102587 101138
13066A01138j9679l3215p287R39O156O441J1665j108n109Q681k457k1765M116
$$ 101138 81459 48244 40957 41896 48052 54493 66158 65050 59941 68622 66165 44400 48516
13053D8516J4936J400K124P576l27k3029q470J8017j9816l5343M88K6306K0242
$$ 48516 63452 64852 66976 74552 74225 51196 42726 60743 40927 5584 6072 32378 52620
13040E2620J8191j2324j3293K9607K4275o936r976l578R448r528J611j0150J3464
$$ 52620 70811 58487 45194 74801 99076 92140 82164 78586 88034 78506 80117 69967 83431
13027H3431L3406M6714M2171J7857l0189l4538k5065l0141k1618j0216m725L178
$$ 83431 116837 163551 205722 223579 193390 158852 133787 103646 82028 71812 67087 70265
13015G0265l908j0272J1584j8012M575q432l1046N628J5165L818l20K301J2897
$$ 70265 66357 56085 67669 49657 54232 45800 14754 20382 35547 39365 39045 41346 54243
13002E4243J1211j953P933m532l1961m576J5606J354n256N265J6264J6821N038
$$ 54243 65454 63501 71434 66902 34941 30365 45971 47325 42069 47334 63598 80419 85457
12989H5457j8789j3027M063m96P80Q558L7531N8011R215J6100J5576J9621n1024
$$ 85457 66668 53641 57704 57208 57988 66546 104077 162088 171303 187403 202979 222600 171576
12976A71576l7410j2015j6151j5597k5626l4968l142L6789L5270j2080l582j1465
$$ 171576 134166 122151 106000 90403 64777 29809 26667 63456 98726 86646 83064 71599
12964G1599n63k627j0337R590N865J0822J2945p541L39j6461K090O359K3344j4280
$$ 71599 71036 68409 58072 67662 73527 84349 97294 89753 90092 73631 75721 82080 105424 91144
12950I1144k0076O37k2139l372J5260O724K660n453j1098J4816K0480R795J6058
$$ 91144 71068 71705 49566 46194 61454 68178 70838 65385 54287 69103 89583 99378 115436
12937A15436N571j0179j425p533r987j1133j3730q144O347k38L66m463J477k1216
$$ 115436 121007 110828 109403 101870 91883 80750 67020 58876 65223 64985 65351 60888 62365 41149
12923D1149k698j0194J1259L503L374R011R752j1992p510o049J1107r391O492
$$ 41149 38451 28257 39516 43019 46393 55404 65156 53164 45654 39605 50712 41321 47813
12910D7813m517l9038P219J6138N018N832J475q73j8480J6095K1274m518m17p28
$$ 47813 43296 4258 11477 27615 32633 38465 39940 39067 20587 36682 57956 53438 53021 52293
12896E2293M789J623R985J7061k2344k0480n544J4378q25Q504k378K7583N22j5016
$$ 52293 57082 58705 68690 85751 63407 42927 37383 51761 50936 59440 57062 84645 85167 70151
12882G0151p375J273K2675n941j3969p357J697m323j5546J5287q593k5485j0585
$$ 70151 62776 64049 86724 80783 66814 59457 61154 56831 41285 56572 47979 22494 11909
12869A1909R437J4851K2481J8321J5453k793j2161P741O807o472J7339l533j1329
$$ 11909 21346 36197 58678 76999 92452 89659 77498 85239 92046 85574 102913 99380 88051
12856H8051o730K587j5423j0239j1927r311l415J0368j1638O84J0247Q627J9133
$$ 88051 81321 83908 68485 58246 46319 37008 33593 43961 32323 33007 43254 51881 71014
12843G1014l601p960j0041l8920j8178J9519O719J0332M3137J8326N005j3443
$$ 71014 67413 59453 49412 10492 -7686 11833 18552 28884 72021 90347 95352 81909
12831H1909L251L6578j5474m172R075M790k7796q244L455j5892l488J7916L465
$$ 81909 85160 121738 106264 102092 111167 115957 88161 79917 83372 67480 63992 81908 85373
12818H5373Q492j2168j6631K656j173M506L942J7437o623k966K798L64R290j40
$$ 85373 93865 81697 65066 67722 66549 71055 74997 92434 85811 82845 85643 86007 95297 95157
12804I5157J4654J472m69L890J265K0628k3698n1124o904J0339J0723K965p952
$$ 95157 109811 111283 110814 114704 115969 136597 112899 61775 54871 65210 75933 78898 70946
12791G0946O697J2640K7744P752j7229l4231m566j0804L0469K9994k2433j9440
$$ 70946 77643 90283 118027 125779 108550 74319 69753 58949 89418 119412 96979 77539
12779G7539p274J4473K3753J2472J1259J14p073j5190k3258J0836M2482O919N726
$$ 77539 70265 84738 108491 120963 132222 132336 125263 110073 86815 97651 140133 147052 152778
12766A52778O080J1988J4017K0620J3827J8034J0583K3528N7556R4301R9445J19629
$$ 152778 158858 170846 184863 205483 219310 237344 247927 271455 329011 423312 522757 642386
12754F42386J69201K25827K40193K69107L18366L22184K77750J59461N6026K2752
$$ 642386 811587 1037414 1277607 1546714 1865080 2187264 2465014 2624475 2680501 2703253
12744B703253M3286n8198j86285k55839k71914k36848j85822j63728j69875j56109
$$ 2703253 2746539 2688341 2502056 2246217 1974303 1737455 1551633 1387905 1218030 1061921
12734A061921j09469j21370j02198n3096n6977n2837m4463l4160l5666l6790l1732
$$ 1061921 952452 831082 728884 675788 618811 565974 521511 487351 451685 414895 383163
12723C83163m1507k9952j1606j9080o206k5991k2481m091R948J1359k5311j0708
$$ 383163 341656 311704 300098 281018 274812 248821 226340 222249 232197 243556 218245 207537
12711B07537n953l9079o184m998P929m700j9063M309k51j1947j0861P485O402
$$ 207537 201584 162505 156321 151323 159252 154552 135489 139798 139547 127600 116739 124224 130626
12698A30626O429J675k0770o514M849j0192l6446k289J4053L0393k73K549j251
$$ 130626 137055 138730 117960 111446 116295 106103 69657 67368 81421 111814 111541 114090 112839
12685A12839J6768K1408o244o850N253j709j2342m271L485Q718l788m143r684
$$ 112839 129607 151015 144771 137921 143174 141465 129123 124852 128337 137055 133267 129124 119440
12672A19440J2552R375j2970n624r572p300k175O314K0942k2757k3765p440M5150
$$ 119440 131992 141367 128397 122773 113201 105901 103726 110040 130982 108225 84460 77020 122170
12659A22170J7085k6635k4551K1356K0080k1404r658O654L368K348J7132j35J2666
$$ 122170 139255 112620 88069 109425 129505 108101 98443 105097 108465 110813 127945 127810 140476
12646A40476j0898j0648K331R390O101m157K499k9049o109J5657J7665o751J9293
$$ 140476 129578 118930 121261 130651 136752 132595 135094 106045 99936 115593 133258 126507 145800
12633A45800N693R824j8544k345l206l378J8338J5539K302P584o399m605J2906
$$ 145800 151493 161317 142773 140428 137222 133844 152182 167721 170023 177607 171208 166603 179509
12620A79509k3931j5802J0704J1628J6118J4104O985J5095j1925k1035j6319k2590
$$ 179509 155578 139776 150480 162108 178226 192330 199315 214410 202485 181450 165131 142541
12608A42541k0588J3280K4421K2563R04l976k9454l1368J9555m948O096P620O089
$$ 142541 121953 135233 159654 182217 183121 179145 149691 118323 137878 132930 139026 146646 152735
12595A52735j1278P266j673Q173Q857K1922p023l247j5576L146J785p14k226q161
$$ 152735 141457 148723 147050 155223 164080 186002 178979 175732 160156 163302 165087 164373 162147 153986
12581A53986J1130J9172O242n199j2859j4851l977j610K7734K1496J8782K390
$$ 153986 165116 184288 190530 185331 172472 157621 153644 152034 179768 201264 220046 222436
12569B22436j5127L462M6787M8655J6482K1582L3997L3096M8762K8418L8439L0033
$$ 222436 207309 210771 257558 306213 322695 344277 378274 411370 460132 488550 526989 557022
12557E57022P171k6318j2304j7220j8864m6654m5107o1853l4871k5007n495J7397
$$ 557022 564193 537875 525571 508351 489487 442833 397726 335873 301002 275995 270500 287897
12545B87897R153j8169Q361r619J334j8547Q498j48L403R607R623P97M290j7067
$$ 287897 297050 278881 287242 277623 278957 260410 268908 268760 272163 281770 291393 292190 296480 279413
12531B79413j0291j3885n151n851N689j18K3539J1346o497m819J1558J4208n405
$$ 279413 269122 255237 250086 244235 249924 249806 273345 284691 278194 273375 284933 299141 293736
12518B93736l666Q297q110m172J0071k2969r646K0751J4613J6949J3723K1794
$$ 293736 290070 298367 290257 286085 296156 273187 263541 284292 298905 315854 329577 351371
12506C51371r617Q255M079K5733j525l331o019k3647p656K5479L241j0761P80
$$ 351371 341754 350009 354088 379821 378296 374965 368946 345299 337643 363122 366363 355602 356382
12493C56382J7839J153K1103j7264k1506j2121J266O974J2773L792J0723j840
$$ 356382 374221 375374 396477 379213 357707 345586 346852 353826 366599 370391 381114 379274
12481C79274m2902m1171P760L6023J4900j0364n07j5888Q549R478M501O367J4094
$$ 379274 336372 295201 302961 338984 353884 343520 343013 327125 335674 345152 349653 356020 370114
12468C70114m618j0391J7391J5375J0881J324n906j719p276Q0K2372J2587L614
$$ 370114 365496 355105 372496 387871 398752 400076 394170 392451 385175 385255 407627 420214 423828
12455D23828L037K5046K1223J8243J7041n894J1908K686L092L9716J5602K5482
$$ 423828 426865 451911 473134 491377 508418 502524 514432 517118 520210 559926 575528 601010
12443F01010K0916J4362N1185M8710L7831J2179J8397L7316J0022p492p1240p5964
$$ 601010 621926 636288 687473 736183 774014 786193 804590 841906 851928 844436 773196 697232
12431F97232l5700p286n6145j01104o4814r419J3968L5391j1208K1636L8512N8290
$$ 697232 661532 654246 598101 496997 432183 422764 436732 472123 460915 482551 521063 579353
12419E79353N0052N2839M3241L0362L9982L9419L9569L9838J6861M5399M0959
$$ 579353 629405 682244 725485 755847 795829 835248 874817 914655 931516 976915 1017874
12408A017874P103K1318K9264K4527L6230J0323K0547L165J2844J8121K9945k28
$$ 1017874 1024977 1046295 1075559 1100086 1136316 1146639 1167186 1170351 1183195 1201316 1231261 1231033
12396A231033R26L6241O608k265Q893J2530M3323J6622p925l478k437Lm256j4242
$$ 1231033 1231959 1268200 1274808 1272543 1281436 1293966 1337289 1353911 1345986 1342508 1340071 1340074 1335818 1321576
12382A321576N059K423O788M5777K6446Q607J3023J1447L427J8013K8291J4477
$$ 1321576 1326635 1329058 1335846 1381623 1408069 1416676 1429699 1441146 1444573 1462586 1490877 1505354
12370A505354K8325L1126K8238M1228M1927L5685L1697L1393M2641N5919P7922
$$ 1505354 1533679 1564805 1593043 1634271 1676198 1711883 1743580 1774973 1817614 1873533 1951455
12359A951455N3695P2488P7874M9646N7263O5960P8477P8829P3084R5686J15811
$$ 1951455 2005150 2077638 2155512 2205158 2262421 2328381 2406858 2485687 2558771 2654457 2770268
12348B770268J06329J55333J66957J90255J77592K00027K02837K15241K34826
$$ 2770268 2876597 3031930 3198887 3389142 3566734 3766761 3969598 4184839 4419665
12339D419665K36184K80309L10073L55540L65315L85997M29840M85744N55097
$$ 4419665 4655849 4936158 5246231 5601771 5967086 6353083 6782923 7268667 7823764
12330G823764O29609P52867Q21225R57201J095059J284102J521042J742256K103318
$$ 7823764 8453373 9206240 10027465 10984666 12079725 13363827 14884869 16627125 18730443
12321A8730443K573231L193824M039374N207470O856873R224918J2738041J7941905
$$ 18730443 21303674 24497498 28536872 33744342 40601215 49826133 62564174 80506079
12313H0506079K5178206L3768324M1411992M5869694M9019287N5310646O1222018
$$ 80506079 105684285 139452609 180864601 226734295 275753582 331064228 392286246
12306C92286246N3339951K9639128R819619P466108P100592j0906295l7542059
$$ 392286246 445626197 475265325 485084944 492551052 499651644 488745349 451203290
12299D51203290n0129345m5982253l9917041l9594610l9967466l5913449k8744847
$$ 451203290 401073945 355091692 315174651 275580041 235612575 199699126 170954279
12292A70954279k1929916j6987134j3694797j1387003r755682q780815q215210
$$ 170954279 149024363 132037229 118342432 106955429 97199747 88418932 80203722
12285H0203722p649442o970703o343226n810098n306849m807842m290651l787325
$$ 80203722 72554280 65583577 59240351 53430253 48123404 43315562 39024911 35237586
12277C5237586l340062k956930k616281k298773k024854j824661j615899j444048
$$ 35237586 31897524 28940594 26324313 24025540 22000686 20176025 18560126 17116078
12269A7116078j309467j190093j055393r76341q90551q12427p39148o67864o00323
$$ 17116078 15806611 14616518 13561125 12584784 11694233 10881806 10142658 9474794 8874471
12260H874471n77187n15018m89110m50983m35192m30373l96663l63808l52082
$$ 8874471 8297284 7782266 7293156 6842173 6406981 5976608 5579945 5216137 4864055
12251D864055l24471k80168k59717k33653k11079k16896j96790j71704j40054
$$ 4864055 4539584 4259416 3999699 3766046 3554967 3338071 3141281 2969577 2829523
12242B829523j40968j32719j27513j08295q8855p9114n5734p4408o1023n7682
$$ 2829523 2688555 2555836 2428323 2320028 2231173 2152059 2096325 2021917 1960894 1903212
12232A903212n8685m3566k5753k6957l6320j4788l7179l2242l3065o7461o5977
$$ 1903212 1844527 1800961 1775208 1748251 1711931 1697143 1659964 1627722 1594657 1527196 1461219
12221A461219l3852n1586m4308j8837m0451k5807j5510k4122l1431K463Q572l1845
$$ 1461219 1427367 1375781 1331473 1312636 1272185 1246378 1230868 1206746 1175315 1177778 1186350 1154505
12209A154505m0823k4232k6248k39R533Q669j978j0335l6714j8652o48j6337K169
$$ 1154505 1113682 1089450 1063202 1062963 1072496 1081165 1079187 1068852 1032138 1013486 1012838 996501 998670
12196I98670P118o826N801q099l68R086J2494R110N0590N1610M1465M6265N5791
$$ 998670 1005788 998962 1004763 996664 996296 1005382 1017876 1026986 1077576 1129186 1170651 1216916 1272707
12183A272707N3700Q2923N8683K8426K2278J6743O063m0319o7380o4544o9311
$$ 1272707 1326407 1409330 1468013 1496439 1518717 1535460 1541523 1501204 1433824 1369280 1299969
12172A299969q9596q8291o5876m0212m9678m9580j1798O474L6898K3165k079K4929
$$ 1299969 1210373 1122082 1056206 1015994 966316 916736 904938 911412 948310 971475 969396 994325
12160I94325K694j582L3645J4579J5784J9781R225j5139j924m115P945L022k1378
$$ 994325 997019 995437 1029082 1043661 1059445 1079226 1088451 1073312 1071388 1067273 1075218 1078240 1056862
12147A056862l6665J0468K8536L635J1233N087k3185k0009j9566k870p067k5023
$$ 1056862 1020197 1030665 1059201 1062836 1074069 1079156 1055971 1035962 1016396 1013526 1006459 981436
12135I81436k7468q889k852q172k1634r498p898o791j1765j5135l4746J327O63
$$ 981436 953968 945079 942227 934055 912421 902923 895025 888234 876469 861334 826588 827915 828578
12122H28578j2896p677P753J3140K223q056k5139j6249o855m939j3676r739L59
$$ 828578 815682 808005 815758 828898 831121 823065 797926 781677 774822 769883 756207 746468 746827
12109G46827L7128R293J3164n905P29K5621L9676J5452K3930Q992J6096M0662
$$ 746827 783955 793248 806412 800507 801236 826857 866533 881985 905915 914907 931003 971665
12097I71665L7992N400Q605M4943M3894p41j4303K5340K4484K6225K1542K9911
$$ 971665 1009657 1015057 1023662 1068605 1112499 1111758 1097455 1122795 1147279 1173504 1195046 1224957
12085A224957K6485K8764K4027M3699M4412K5556Q301J4995K8917J7073M4932
$$ 1224957 1251442 1280206 1304233 1347932 1392344 1417900 1426201 1441196 1470113 1487186 1532118
12074A532118M4892K6074J4076L7954O7958P3074M5127N4428P6094N7889N5203
$$ 1532118 1577010 1603084 1617160 1655114 1723072 1796146 1841273 1895701 1971795 2029684 2084887
12063B084887P8927P9838Q0059Q8124Q6845R3089J04434Q2915Q8319J24881J18142
$$ 2084887 2163814 2243652 2323711 2411835 2498680 2591769 2696203 2779118 2867437 2992318 3110460
12052C110460J36212J09539R7363J09882J42036J56729J55340J57591J81860J85900
$$ 3110460 3246672 3356211 3453574 3563456 3705492 3862221 4017561 4175152 4357012 4542912
12042D542912J91483K04239K28147K78719K60981K74399L13822L38120L93712
$$ 4542912 4734395 4938634 5166781 5445500 5706481 5980880 6294702 6632822 7026534
12033G026534L97675L96272M30240M69539N05287N26863N71278N69653N98431
$$ 7026534 7424209 7820481 8250721 8720260 9225547 9752410 10323688 10893341 11491772
12024A1491772O24877O79819O69002P02389P55372P59032P21723P16723P01043
$$ 11491772 12116649 12796468 13465470 14167859 14923231 15682263 16403986 17120709 17821752
12015A7821752O19723N61016N08185M19792K77628K03700Q7601n1518j66180k12952
$$ 17821752 18441475 19002491 19510676 19930468 20208096 20411796 20499397 20447879 20281699 20068747
12005B0068747l23205m11535n09105n58124n69393o19248o01724o16167o56252
$$ 20068747 19745542 19334007 18824902 18266778 17697385 17078137 16476413 15860246 15203994
11996A5203994o37908o28110o31909n98110n73279n70640n48468n35355m79822
$$ 15203994 14566086 13937976 13306067 12707957 12134678 11564038 11015570 10480215 10000393
11987A0000393m30992m52437m56406m09895l81969l62341l46202l38201l16812
$$ 10000393 9569401 9116964 8660558 8250663 7868694 7506353 7160151 6821950 6505138
11978F505138k99896k69451k39339k32217k31777k30347k28726k09926j64172
$$ 6505138 6205242 5935791 5696452 5464235 5232458 5002111 4773385 4563459 4399287
11969D399287k05003j93008j70419j55520j31007j34962j39469j15781j02411
$$ 4399287 4194284 4001276 3830857 3675337 3544330 3409368 3269899 3154118 3051707
11960C051707j06287r3829r3334r8212j02087p5829r4760r2388p2657p4485j02840
$$ 3051707 2945420 2851591 2758257 2660045 2557958 2482129 2387369 2294981 2222324 2147839 2044999
11949B044999o4545l5044m8679q0851n2560n0112n2771n9131o3277m0288l3275
$$ 2044999 1980454 1945410 1896731 1815880 1763320 1713208 1660437 1601306 1538029 1497741 1464466
11938A464466m5267m7928l6119l2420n539m1153k9424l7643n4557l3085k5686
$$ 1464466 1419199 1371271 1335152 1302732 1297193 1256040 1226616 1188973 1134416 1101331 1075645
11927A075645k2781l0911j3390M376j3133k8839j8088j3016k1016q895o509k3127
$$ 1075645 1052864 1021953 1008563 1012939 999806 970967 952879 939863 918847 909952 903443 880316
11915H80316k3453p9r01k9825k1996n220k0841l3501j7290N006J267o655j6225
$$ 880316 856863 856784 855883 826058 804062 798842 778001 744500 727210 732216 733483 726828 710603
11902G10603j8364q912j6002J6296k0491n504j8413J1945k274k5565j4426k9697
$$ 710603 692239 683327 667325 683621 663130 657626 639213 651158 648884 623319 608893 579196
11890E79196K636J508L302N577R974J0914k7990n559j0842j5957J4092J3821j3049
$$ 579196 581832 583340 586642 592219 602193 613107 585117 579558 568716 552759 566851 580672 567623
11877E67623j8161O646M815J8997J7815J0391o584J497k358j995L1624Q2093J06798
$$ 567623 549462 556108 560923 579920 597735 608126 601542 603039 600681 598686 630310 712403 819201
11864H19201J26092J71805K11822K52206K45058K73466L18487K64696J51355O4417
$$ 819201 945293 1117098 1328920 1581126 1826184 2099650 2418137 2682833 2834188 2898605
11854B898605L5966K4018p4116j89911k33693k26936k36850k11268k06793j78725
$$ 2898605 2934571 2958589 2884473 2694562 2460869 2233933 1997083 1785815 1579022 1400297
11844A400297j49379j25094r4918r1818r5201p7090m0274k7996l4399l8491j3423
$$ 1400297 1250918 1125824 1030906 939088 843887 766797 726523 698527 664128 625637 612214
11833F12214k7043n9010o4718m4018l789M258p413k4063k6184j1807O121j6767
$$ 612214 585171 526161 461443 417425 413636 417894 410481 386418 360234 348427 354548 337781
11821C37781m9100k1376j8815j036L2247J6201j3365k5963J821N671j9140k3096
$$ 337781 288681 267305 248490 247454 279701 295902 282537 256574 258395 264066 244926 221830
11809B21830j6619n223K270j0891J8286J1191l578P94J087q05m861R845K2030
$$ 221830 205211 199988 202258 191367 209653 220844 217266 218060 219147 218342 213481 223326 245356
11796B45356k1698k5021M03j5191r932q484k586j9794j2920P808J5229K0170j3553
$$ 245356 223658 198637 199040 183849 173917 165433 162847 143053 130133 137941 153170 173340 159787
11783A59787m932k520j9925M997M1730R133p321r114j6254j0980j3326M632j479
$$ 159787 154855 152335 132410 137407 179137 188270 180949 171835 155581 144601 131275 135907 134428
11770A34428j3551L2962J5401q090p199N988O512q157k0784j4063Q025n631P410
$$ 134428 120877 153839 169240 161150 153951 159939 166451 158294 137510 123447 131472 125841 133251
11757A33251N02J9899k0175l5795K334K1194m924P841J1986o355p909j4762J4528
$$ 133251 133753 153652 133477 97682 100016 121210 116286 124127 136113 129758 121849 107087 121615
11744A21615J0662j5202m188M994p645J0066J6022j2042n797Q275J0944l6329
$$ 121615 132277 117075 112887 117881 110236 120302 136324 124282 118485 126760 137704 101375
11732A01375k7171j09O912K7763O636K0089J5007M751k5522j8942j4634o64N170
$$ 101375 74204 74095 81007 108770 115406 135495 150502 155253 129731 110789 96155 95491 100661
11719A00661R014J2936P766j3880m310K084p934j704p044j7678L266K3543k996
$$ 100661 109675 122611 130377 116497 112187 114271 106337 104633 97589 79911 83177 106720 103724
11706A03724l3316k476J5176K6006l112n353k0691l4117O254L0059K1660k2805
$$ 103724 70408 67932 83108 109114 106002 100649 79958 45841 52095 82154 103814 81009
11694H1009j235j1518p040K3293q73j297P115J0172j1633Q370n711n540m980J232
$$ 81009 79774 68256 61216 84509 83636 82339 89454 99626 87993 96363 90652 85112 80132 81364
11680H1364p072J1677k412p615q106j8949j4096J2386J7522j0483j196R931J2756
$$ 81364 74292 85969 83557 75942 67836 48887 34791 47177 64699 54216 53020 62951 75707
11667G5707l334J2139J5439k5092l492j580Q47l63J7057l655j0746p363k0341
$$ 75707 72373 84512 99951 74859 71367 69787 70634 70271 87328 83673 72927 65564 45223
11654D5223p909J4511N383n795K066R200J4440J8108N520k6195M957O495J2009
$$ 45223 37314 51825 57208 51413 53479 62679 77119 95227 100747 74552 79509 86004 98013
11641I8013K237k1509j2492P374N736q563j8093j9118j8368J3859L954N437J8141
$$ 98013 100250 78741 66249 73623 79359 70796 52703 33585 15217 29076 33030 38467 56608
11628E6608J5593p432L406J3460P69j1597l517L632o328o594q994K6066m025j5017
$$ 56608 72201 64769 68175 81635 82404 70807 67290 70922 64594 58000 49006 75072 71047 56030
11614E6030O614q918r743L619N515p23M761j8087m564J3471n136N343Q098j3181
$$ 56030 62644 53726 43983 47602 53117 52394 57155 39068 34504 47975 42839 48182 56280 43099
11600D3099o535K2180O378j5686m412J5209O630j3413j5519j5297J0187k036J0111
$$ 43099 36564 58744 65122 49436 45024 60233 66863 53450 37931 22634 32821 30785 40896
11587D0896K3936j1278k5433j9777J3433J1359J7146j8057j3158P347n051Q067
$$ 40896 64832 53554 28121 8344 21777 33136 50282 32225 19067 26414 21363 29430
11575B9430J9586J0514j6986J491J0964J7455k4942O33j7656j6553o73R371R693
$$ 29430 49016 59530 42544 44035 54999 72454 47512 48145 30489 13936 13263 22634 32327
11562C2327J8344m437q239l988k425j0095l238J4765J685j1664J578j805m462
$$ 32327 50671 46234 37995 34007 31582 21487 18249 33014 34699 23035 24613 22808 18346
11549A8346p60j2615L335K1524K1166J3487j1528j8002o393J4113J4695j506j0553
$$ 18346 17586 4971 8306 29830 50996 64483 52955 34953 28560 42673 57368 55862 45309
11536D5309j5486P8j615r188K1046R604j610k729j3535p618j244J2052K7096l182
$$ 45309 29823 29901 28286 19098 40144 49748 48138 45409 31874 24256 23012 35064 62160 58978
11522E8978k1225j588L88j064q608j2148J238O449K2099K0218j10j124k6811l642
$$ 58978 37753 36165 36553 35489 26881 14733 15971 22420 44519 64737 64627 63503 36692 33050
11508C3050N739N175J0805J7241k5998K876K046j2192L318J435p813m744j0023
$$ 33050 38789 43964 54769 72010 46012 48888 50934 38742 42060 43495 35682 30938 20915
11495B0915R569p02j2915l372J9883j6250j3828J4952Q830o935j6341n688j3865
$$ 20915 30484 29782 16867 13495 33378 17128 3300 18252 27082 20147 3806 -1882 -15747
11482a5747J8359q171j8812j1648O791K1897J0033J1053r923j1225L6867L3136
$$ -15747 2612 -5559 -24371 -36019 -29228 -7331 2702 13755 3832 -7393 29474 62610
11470F2610k150k3741j4606J795N625o732k3943P29J190P620Q942K4932j3615
$$ 62610 60460 36719 22113 23908 29533 22801 -1142 -413 777 8397 17339 42271 28656
11457B8656P116Q018K3327p653j8024j6176j1159J9791Q188m41M821J035k4258
$$ 28656 35772 43790 67117 59464 41440 25264 14105 33896 42084 41643 46464 47499 23241
11444B3241l2201M480J8644K5311O123L300P059k7708m9090j706J3408J0165J3352
$$ 23241 -8960 -4480 14164 39475 45598 48898 55957 28249 -20841 -22547 -9139 1026 14378
11431A4378J2512o615J3061J0673K995k0025M272J5205J311J035r547J2721O366
$$ 14378 26890 20275 33336 44009 47004 26979 31251 46456 47767 48802 39255 51976 58342
11418E8342k3327j1047J0340M407J968J0671J0799p632J3528q207k5367k3037
$$ 58342 35015 23968 34308 38715 40683 51354 62153 54521 68049 59842 34475 11438
11406A1438Q988m992p49J0697J454p860J1766j5208n881N609R813M362o515J6433
$$ 11438 20426 15434 14685 25382 26836 18976 30742 15534 9653 15262 25075 29437 22922 39355
11392C9355n867l1409J3717P479p512j5146n164J1912j364j0385m378K1321n76
$$ 39355 33488 2079 15796 23275 15763 617 -4547 7365 6001 -4384 -8762 12559 11983
11379A1983p866j1935J6751o728O973k572j2507J4300J3651l047R96P084o119
$$ 11983 4117 -7818 8933 2205 9178 6606 -5901 8399 22050 19003 19999 27083 20964
11366B0964Q387P820j4160l6125k7038J3314N071p91J9215K9342j4418o458m799
$$ 20964 29351 37171 23011 -13114 -40152 -26838 -21767 -22558 -3343 25999 11581 5123 324
11353C24J0674J7692j2365m383j5362k2631j7117r298M374J9587J2860P741n684
$$ 324 10998 28690 16325 11942 -3420 -26051 -43168 -52466 -48092 -28505 -15645 -7904 -13588
11340a3588k243J2960J2755O03o192j5324J4848J9795J4582r348k9494j7788R626
$$ -13588 -15831 -2871 9884 10487 4295 -11029 3819 23614 38196 28848 -646 -18434 -8808
11327h808K9004R923J3699N648j7477k3374K332l648L674R276j1175O154j474
$$ -8808 20196 30119 43818 49466 31989 8615 10947 7299 10973 20249 9074 15228 13754
11314A3754R619Q76J7919j0773j6586J1571J433j2249j7869n95J0147K9839J0823
$$ 13754 23373 24249 42168 31395 14809 26380 27813 15564 -2305 -2900 7247 37086 47909
11301D7909k800m112k2916l0021P763p137j696N200J0981K0737j5781k7541Q135
$$ 47909 45109 40997 18081 -11940 -4177 -11314 -13010 -7810 3171 23908 8127 -19414 -11279
11288a1279j2264j2110K0313J5337r269J2099j0574P58j2451N080K7093J2516
$$ -11279 -23543 -35653 -15340 -3 -9272 2827 -7747 -6989 -19440 -14360 12733 25249
11276B5249j7895p66j106m689J8463K1501J0002l9121q892O812q198m977p373
$$ 25249 7354 6588 5482 793 19256 40757 50759 11638 2746 9558 1360 -3617 -10990
11263a0990N097N453J0739J0136m053K559L5003o952k3230J6673k8761l0761J7003
$$ -10990 -5893 -440 10299 20435 16382 18941 53944 46992 23762 40435 11674 -19087 -2084
11250b084K5283j841j6148j5074J5362l067J002j1030j4721J0891P590k1773P39
$$ -2084 23199 21358 5210 -9864 5498 2431 3433 -7597 -22318 -11427 -3837 -25610 -24871
11237b4871L1641K1739K3546L065j3350j4904l001j540p893k698J6506j7760p279
$$ -24871 6770 28509 52055 55120 41770 26866 23865 22325 14432 11734 28240 10480 3201
11224C201N156P810j1215j3624p669K199K2029K6798J7746J1106j8561l1495K917
$$ 3201 8357 16167 4952 -8672 -16341 -14142 7887 34685 52431 63537 44976 13481 16398
11211A6398J774q431K6109M288k02J1890r396k4612k6300j1552k3170l054K2104
$$ 16398 18172 9741 35850 40138 39936 51826 42430 17818 -8482 -20034 -43204 -46258 -24154
11198b4154K8327K9588m429k7714M051M3793M302l5699j4365M51P803l374q551
$$ -24154 4173 33761 29332 1618 5669 49462 53764 18065 3700 4151 11954 8580 29
11185B9l336J2949M950j6302k256L098j59l944k1376n259L2763J8894R45L123
$$ 29 -3307 9642 14592 -1710 -3966 -868 -1027 -4971 -26347 -31606 1157 20051 20996 24119
11171B4119K2128Q26k7772j2100j380J8068J880N747p599k2119j0783O49p591
$$ 24119 46247 47073 19301 7201 5821 23889 25769 31516 23917 1798 -8985 -8336 -15927
11158a5927J4858J8024J6001j7902L842P098j1625O844Q06l506j7944l49K0413
$$ -15927 -1069 16955 32956 15054 18896 25994 14369 21213 22019 18513 569 220 20633
11145B0633J5343p125J99j686j8143q071r790p999j8772l108O318l392J6269K6262
$$ 20633 35976 28851 29050 27364 9221 1150 -8640 -16639 -35411 -38519 -32201 -35593 -19324 6938
11131F938m27m103O955q083P586j7338M258n363p915o070J840L2320J1845J7508
$$ 6938 6511 2408 9363 1280 8866 -8472 -4214 -9577 -17492 -23562 -21722 10598 22443 39951
11117C9951j9824l2000M709r80J2630K697Q730k4636p562q658p216K0492J9651
$$ 39951 20127 -11873 -7164 -8144 4486 7183 15913 -8723 -16285 -24943 -32159 -11667 7984
11104G984J7333J804K1529q536k802j0362j8368K0015K2629K315k3593l9008o141
$$ 7984 25317 27121 48650 40114 37312 26950 8582 28597 51226 53541 29948 -9060 -15201
11091a5201J9895k7746j2077K5881Q25q810r20Q1j1685L464L8656J0290j5807
$$ -15201 4694 -23052 -35129 -9248 -8423 -17233 -18153 -18072 -29757 -26293 12363 22653 6846
11078F846m463l041O096P284N944l506j9928J4153J7039p994o185k336n342J581
$$ 6846 2383 -658 5438 12722 18666 15160 -4768 9385 26424 18430 12245 9909 4567 6148
11064F148K5850K787o911j0904J2560O656q716m738q65j6202r067k1612M187q286
$$ 6148 31998 34785 27874 16970 29530 36186 27470 22732 21867 5665 -3402 -25014 -20827 -29113
11050b9113o980J5262M5396K1346L010n503m14J4334Q401l39J5303k392J1353
$$ -29113 -36093 -20831 24565 45911 48921 43418 43004 57338 65739 65400 80703 78311 89664
11037H9664K1992j710n49K9859M667l085j6993Q10P109J46K1983r623j2569L6907
$$ 89664 111656 109946 109397 139256 143923 140838 123845 124655 131764 131910 153893 144270 131701 168608
11023A68608J7272M7650L7033p391l3338n2339n9436j7302K4994K1604n069J3467
$$ 168608 185880 233530 270563 263172 229834 177495 118059 100757 125751 147355 142286 155753
11011A55753J8221Q14j3418M866N68l3925k2568r410q268J3396J3178M738J4149
$$ 155753 173974 174788 161370 166236 166804 132879 110311 100901 92633 106029 119207 123945 138094
10998A38094Q731j9099k5835O187l033k1898j7464p976O094r757k2061J3575K0272
$$ 138094 146825 127726 101891 108078 105045 83147 65683 57707 63801 54044 31983 45558 65830
10985F5830K117K096j469j5564j6695k1005k5387j5317K6751R699P71O749j0412
$$ 65830 67947 70043 68574 53010 36315 15310 -10077 -25394 1357 11056 11827 18576 8164
10972H164j3636K2036R143l520j5105j0071M579J1405N19L983o468J4686m127
$$ 8164 -5472 16564 25707 22187 7082 -2989 1590 12995 13514 17497 11029 25715 21588
10959B1588k7158N516O336n898J0189K8292l570j9064j1118N057J713k2297j6690
$$ 21588 -5570 -54 6282 384 10573 38865 35295 16231 5113 10170 11883 -10414 -27104
10946b7104J0986P540J0382j923j713Q198j7240k8853L594R840J1986l719J8610
$$ -27104 -16118 -8578 1804 -119 -1832 6366 -10874 -39727 -36133 -26293 -14307 -18026 584
10933E84J7172o069j2682J3852p249M225J2492R688Q374k2378r282J4349J0636
$$ 584 17756 11687 -995 12857 5608 9833 22325 32013 40387 18009 8727 23076 33712
10920C3712R533j2884M984J2032K302k5982k3012Q956J406k7521J3110K0161N151
$$ 33712 43245 30361 35345 47377 49679 23697 685 9641 11047 -16474 -3364 16797 21948
10907B1948j7297J2812m942J6828j9133k202R8K8447j170j091o996l8702O470
$$ 21948 4651 17463 12521 29349 10216 8014 8112 36559 35389 34298 27302 -11400 -4930
10894d930K3263M912k980j3928r689J9389K2758J9303n565l446j8509K433j004
$$ -4930 18333 23245 20265 6337 -3352 16037 38795 58098 52533 49087 30578 33011 32007
10881C2007l226J9803k92p90J2289J4650o003K908k8041j6389r904Q861J2682
$$ 32007 28781 48584 48292 47502 59791 74441 68438 71346 43305 26916 17012 25873 38555
10868C8555m943K558q283L851J1348p765l1452J8455j594J733Q196J542N588r335
$$ 38555 33612 36170 27887 31738 43086 35321 3869 22324 20730 22463 30659 32201 37789 28454
10854B8454R086R358J977J90R919J4774L770k4237j8209k737m492J1965J4175
$$ 28454 37540 46898 48875 49065 58984 73758 77528 53291 35082 32345 27853 39818 53993
10841E3993k65j2769q719N520N89J4168M400k6385J666j8792q949K5674J0481
$$ 53993 53728 40959 32240 37760 38349 52517 56917 30532 32198 13406 4457 30131 40612
10828D0612m391n453P675J1209j0069m447P936J865R146l213Q842M654l484M799
$$ 40612 36221 30768 38443 49652 39583 35136 43072 44937 54083 50870 59712 64366 60882 65681
10814F5681j3699j652K837p726j4819j5951r027R953M852O959q716J3092p346
$$ 65681 51982 50330 53167 45441 30622 14671 5644 15597 20449 27408 18692 31784 24438
10801B4438Q823K0125P191r960k7423j2963j5592J2205K2465J5096j0622j9417
$$ 24438 33261 53386 60577 50617 23194 10231 -5361 6844 29309 44405 33783 14366
10789A4366K0004j0177k0945N772o515l978O829L0428P549k9800o681K0908L944
$$ 14366 34370 24193 3248 9020 2505 -1473 5356 35784 43333 13533 6852 27760 31704
10776C1704R843J3941M317m038q986J5913p771J744k5158l8288q404J9036M1099
$$ 31704 41547 55488 59805 55767 46781 62694 54923 56667 31509 -6779 -15183 3853 44952
10763D4952J0423k0992p66R13j6975j9931J6239K4346K1108j2688O923q909j8178
$$ 44952 55375 34383 33617 34530 17555 -2376 13863 38209 59317 46629 53552 44643 26465
10750B6465n130p44p435J0101l294J0775R278K603j5035k594J6688J2684K7030
$$ 26465 21335 20591 13156 23257 19963 30738 40016 42619 27584 24990 41678 54362 81392
10737H1392J4160M272R62j9269m972N723j2332k8435j2747q249R813m640J0558
$$ 81392 95552 99824 100786 81517 76545 82268 69936 41501 28754 20505 30318 25678 36236
10724C6236R738n507J068N4032J9259k2408l2399j0741j1453o829K1631L2610
$$ 36236 45974 40467 41535 95567 114826 92418 60019 49278 37825 30996 52627 85237
10712H5237l532p280Q783l07Q604J8820m709k778r035J7403L765j1016J7282q026
$$ 85237 81705 74425 83208 82901 91505 110325 105616 102838 93803 111206 114971 103955 121237 113211
10698A13211K082j6354k5475o438K7123K2589m739k2994m905J4464J2232j1061
$$ 113211 115293 98939 73464 67026 94149 116738 111999 89005 84100 98564 110796 99735
10686I9735j1268K8505N521l076K1814O896J2518K6550J0074l2632l7152j3603
$$ 99735 88467 116972 122493 119417 141231 148127 160645 187195 197269 164637 127485 113882
10674A13882R568J6618Q415n112j3032J3011J9463L7715J1739k0607P72j5532
$$ 113882 123450 140068 148483 143371 130339 143350 162813 200528 212267 191660 192432 176900
10662A76900l5392j1355j2653K0300K6029O340J7657K2830J1739J7532K9479K2905
$$ 176900 141508 130153 117500 137800 163829 170169 187826 210656 222395 239927 269406 292311
10650B92311J9340J9255K0031j4086r458Q5o487j2901J9192K9473M6446K4626
$$ 292311 311651 330906 350937 336851 327393 327478 320991 308090 327282 356755 403201 427827
10638D27827L6988J9939L9593N5607Q0134J08443J04319P0227L6403O1900R9377
$$ 427827 464815 484754 524347 579954 660088 768531 872850 943077 979480 1041380 1140757
10627A140757J21996J47071K11626K86351L62363M91729O83763R20162J147322
$$ 1140757 1262753 1409824 1621450 1907801 2270164 2761893 3445656 4365818 5513140
10618E513140J444679J642252J598023J139018M42214j03047k98472j53067J92510
$$ 5513140 6957819 8600071 10198094 11337112 11779326 11676279 11377807 11224740 11417250
10609A1417250O58332J296954K024014K788851L313347L103468J827526l437j339271
$$ 11417250 12075582 13372536 15396550 18185401 21498748 24602216 26429742 26426305 25087034
10600B5087034j697844j327433n88049L47686J398385K513233L560200M128726
$$ 25087034 23389190 22061757 21473708 21821394 23219779 25733012 29293212 33421938
10592C3421938L508711J406481j310629l170978l599380l020740k083563j091422
$$ 33421938 36930649 38337130 37026501 33855523 30256143 27235403 25151840 24060418
10584B4060418n7626Q99475J681605J997262J435921p1021j860390k936282l053370
$$ 24060418 24002792 24902267 26583872 28581134 30017055 29946034 28085644 25149362 22095992
10575B2095992k555182j898335j256272o66544j73119J65377K65962k0205o30268
$$ 22095992 19540810 17642475 16386203 15719659 15546540 15711917 15977879 15957674 15327406
10566A5327406j285541j691483j739103j543333j266138j036781q14072o64165
$$ 15327406 14041865 12350382 10611279 9067946 7801808 6765027 5950955 5286790
10558E286790n42160m54182l84311l38651k78593k76871k79415k76825k36602
$$ 5286790 4744630 4290448 3906137 3567486 3288893 3012022 2732607 2455782 2219180
10549B219180k10602j79414j64858j42441j44415q7041p8060j01157j01004q8871
$$ 2219180 2008578 1829164 1664306 1521865 1377450 1290409 1212349 1111192 1010188 921317
10539I21317o8862p6905q2331n2537l2171l7953l6932k7344l4425k6652k0845
$$ 921317 852455 775550 693219 640682 608511 570558 533626 506282 471857 445205 424360
10528D24360k2343k2129k1941j5610k3641k2274o835n614k8440k8779j979k2225
$$ 424360 402017 379888 357947 342337 318696 296422 289587 283973 255533 226754 224775 202550
10516B02550n738J0499l0734l775J816k843J0552L0151o512l0881j2511k1235
$$ 202550 196812 207311 176577 172802 174618 171775 182327 212478 205966 175085 162574 141339
10504A41339m022J90n037J1213k1730r017M76j6547j6976L119p45q193N212K496
$$ 141339 137317 137507 132470 143683 121953 112936 113412 96865 79889 83008 82263 74070 79282 81778
10490H1778p7K5000q699j0276R031J8522J9635J0937o746k9346j7380n587J8663
$$ 81778 81701 106701 98002 87726 96757 115279 134914 145851 139105 109759 92379 86792 105455
10477A05455P376k0104R117M674j1906J6122j430J9144O170O66M53J0089O92l0664
$$ 105455 112831 92727 101844 106518 94612 110734 109304 128448 134618 135284 135737 145826 146518 115854
10463A15854k0224m567P982J6027k455p418n024Q975R636l029r295o557Q554L4870
$$ 115854 95630 91063 99045 115072 112617 105199 100175 109150 118786 115757 106462 99905 108459 143329
10449A43329N720m6583k9638K2422P623m3170k703K1466q22j648k010J8495O485
$$ 143329 149049 102466 72828 95250 102873 59703 57000 78466 77644 75996 73986 92481 98966
10436I8966j9368n10J2926o850j7706J055k035l663k823p117n851q161j8829n38
$$ 98966 79598 79088 92014 85164 67458 68513 66478 62815 59992 52875 47024 38863 20034 19496
10422A9496J785O687K817p521J4172j849l81j0431J2695J626J2228p921j6648
$$ 19496 21281 27968 30785 23264 37436 35587 35206 24775 37470 39096 51324 43403 26755
10409B6755j1734J0986k161j1006k208l379j077m175J0511P614K692j3161j003
$$ 26755 15021 26007 23846 12840 10632 7253 6176 2001 12512 20126 22818 9657 8654
10396H654j6687j1500Q060n405L297k860p059K042J3406J6382M997l144J5693
$$ 8654 -8033 -19533 -11473 -16878 -13581 -16441 -23500 -21458 -8052 8330 13327 10183 25876
10383B5876J0558p520j6116Q74K364o062k756J0140l065k051Q229n100j745J0804
$$ 25876 36434 28914 12798 13672 16036 9974 7218 17358 14293 12242 20471 15371 13626 24430
10369B4430M563j4108o058J2960l2462R094L6716J7832j2993k2533j0534M682
$$ 24430 28993 14885 8827 21787 -10675 -1581 35135 52967 39974 17441 6907 11589
10357A1589Q884k482m570O84j625J055O979Q059L1406K160k7974l3766J1460l605
$$ 11589 20473 17991 13421 14105 12480 13535 20514 28573 59979 62139 34165 399 11859 8254
10343H254J7527J5686j6531j8194K0181m443r62L282k838k6001k5972K6712M3459
$$ 8254 25781 41467 24936 6742 26923 22480 21518 24800 21962 -4039 -30011 -3299 40160
10330D0160J3046M138j8502K488J7305l1763k0188k342O6l285j4664k6937K110
$$ 40160 53206 57344 38842 41330 58635 26872 6684 4342 4408 1123 -13541 -40478 -38368
10317c8368J8629K0448p202J3781N581j8751J1546Q637J0276O594K267J8757R251
$$ -38368 -19739 709 -6493 7288 12869 -5882 5664 14301 24577 31171 33438 52195 61446
10304F1446j5781j2010j9872m967m283j082l238k286J2556J8806l5649r499r053
$$ 61446 45665 33655 13783 8816 4533 3451 213 -2073 10483 29289 -6360 -15859 -24912
10291b4912K2660L7464J566k4557j1659J3621K1595k6219o542R750J0432M075
$$ -24912 -2252 35212 36778 12221 562 14183 35778 9559 3017 12767 23199 27274
10279B7274Q549n868j6162M91Q161K928J3158N915o148J079M223J5525p972l5119
$$ 27274 35823 29955 13793 14284 22445 25373 38531 44446 38298 39377 43600 59125 51153 16034
10265A6034j6057J303j930l395Q70Q772r883j8682j1303P905K8126P901k6679
$$ 16034 -23 1280 -650 -4045 -3175 5597 -4286 -22968 -34271 -26366 1760 9661 -17018
10252a7018P289J4356p91J1886j0120j0302m884J5298J0003K843m485k6342M265
$$ -17018 -9729 4627 3836 15722 5602 -4700 -9584 5714 15717 18560 14075 -12267 -8002
10239h002K6677P13n401p9o690J3359r879L144O206r546l701J0595K2511j296
$$ -8002 18675 19388 13987 13908 7218 20577 10698 13842 20048 10502 6801 17396 39907 38611
10225C8611l3241l4335K660K5077j3152k2570m527M619N637J2842J8334j99K352
$$ 38611 5370 -28965 -26305 -1228 -14380 -36950 -41477 -36858 -31221 -18379 -45 -244 2108
10212B108J2661O26Q033L096j3593M387J6199j1669m0534L842J4777j7966j7300
$$ 2108 14769 15395 23428 26524 12931 17318 33517 21848 -18686 -14844 -67 -18033 -35333
10199c5333q197J3433K4490K8588J1727K310L89K176J1493r302l990j5297k4694
$$ -35333 -43530 -30097 -5607 22981 34708 37018 37407 39583 51076 41774 37784 22487 -2207
10186b207N978N623J8364J6013J732J2293J8593K1571n532j091M602o928j0475
$$ -2207 3771 9394 27758 43771 45503 57796 76389 97960 92428 91337 95939 89011 78536
10173G8536k531j3734K7942L0750L9429L2695l850j7996k4914m810O856j307m1737
$$ 78536 76005 62271 90213 120963 160392 193087 189237 171241 146327 141517 148373 147066 105329
10160A05329J0206L5677M2672K2930O095Q191P80K790k5862k7180l1167K404o253
$$ 105329 115535 151212 193884 216814 222909 231100 231880 234670 208808 181628 150461 152865 146612
10147A46612j2887m496l19K4611M2339K881m1037n0856n976j4269j2645R392O483
$$ 146612 133725 129229 128910 153521 195860 198741 157704 106848 100872 86603 73958 83350 89833
10134H9833j5016R98L4152O654k4735k1112j5635p548M900j0306R633j3454N341
$$ 89833 74817 75815 109967 116621 91886 70774 55139 47591 52491 42185 51818 38364 43705
10121D3705O794J2324m232j1323j964k2843l8281j1959J2091L0876J5629J6520
$$ 43705 50499 62823 58591 47268 45304 22461 -15820 -27779 -15688 15188 30817 47337
10109D7337j1011k020o44k328J4502J1615j6969k5283r029j1634J341K4232L3363
$$ 47337 36326 34306 33662 31334 45836 57451 40482 15199 6170 -5464 -4123 20109 53472
10096E3472J2021m7310k2093K7195p602j9858k6847O276L392K294k1812L027N711
$$ 53472 65493 18183 -3910 23285 15683 -4175 -31022 -24746 -21354 -19060 -40872 -37845 -32134
10083c2134O906K4051o756K685K437J7672l749k9670l6579J6805K5865L750m966
$$ -32134 -25228 -1177 -7933 -5248 -2811 14861 11112 -18558 -55137 -38332 -12467 -8717 -13683
10070a3683J336j1198P027J7032N167O747J50M689j6252r428K9809K902j3910
$$ -13683 -12347 -23545 -16518 514 5681 12428 12578 17267 1015 -8413 21396 24298 10388
10057A0388J6905J0716l830k5659k1015Q58J6263J75k7096j0984L0494n314j4892
$$ 10388 27293 38009 34179 8520 -12495 -11637 4626 4801 -22295 -33279 -2785 -8099 -22991
10044b2991J158j847J8435O673M664l319j5978J334j3956J7864K2457j2107M244
$$ -22991 -21833 -23680 -5245 1428 6092 2773 -13205 -11871 -25827 -7963 14494 2387 6631
10031F631J2622M874l671l071m802m626j5586j4481j7936K186K1612M004r334
$$ 6631 19253 24127 20456 17385 12583 7957 -7629 -22110 -40046 -37860 -16248 -12244 -21578
10018b1578j036J2203J658M165J4975p588j4240J4579j4100j9279k024J7269J6396
$$ -21578 -22614 -10411 -8753 -4588 10387 2799 -11441 3138 -10962 -30241 -32265 -14996 1400
10005A400J8503j1534J2482k3280O722J9145j4479n034j1029P45R81K344O020
$$ 1400 19903 8369 20851 -2429 4293 23438 8959 3925 -7104 -6359 -5378 -3034 2986
9992B986N248k71k0592J3469J6634K789m3934l5499L2782K0033r622Q434R808
$$ 2986 8234 7963 -12629 840 17474 20263 -23671 -59170 -26388 -6355 -15977 -7543 2265
9979B265j0943N908j1784j2233K0685J0508K0686o999l616P884k361p521o378
$$ 2265 -8678 -2770 -14554 -26787 -6102 4406 25092 18093 14477 22361 20000 12479 6101
9966F101m50P094J943Q252k4264k3861P154j181J7594k5190k603k378K1940K5135
$$ 6101 5651 12745 14688 22940 -1324 -25185 -18031 -19212 -1618 -26808 -29411 -31789 -9849 15286
9952A5286m028q057j4404Q149K3574J618k8042j8684n787K2447J6592k369L950
$$ 15286 11258 3201 -11203 -3054 20520 22138 -5904 -24588 -30375 -7928 8664 6295 10245
9939A0245j8928k0477K1671N960j4120J6458R696N327Q807k0891L557r192L0501
$$ 10245 -8683 -29160 -7489 -1529 -15649 809 10505 15832 24639 3748 7305 -1887 28614
9926B8614K2220m94p352J7916r895k7232k9547k0634K0J3386L7151K4606j339
$$ 28614 50834 50340 42988 60904 51009 23777 -5770 -26404 -26384 -12998 24153 48759 47420
9913D7420l553Q963j3333j352n979n526m954J8545p257m092k6047j5990k233P793
$$ 47420 43867 52830 39497 38145 32166 26640 21686 40231 32974 28882 2835 -13155 -15388 -7595
9899g595M639j4683m643r288P044J1333L625J2333J4731J4658J1090l653j4596
$$ -7595 -2956 -17639 -22282 -31570 -24526 -13193 -9568 2765 17496 32154 43244 39591 24995
9886B4995k0114L364k38Q436j0350j019J0780L189o581m223j3520j2948K5388
$$ 24995 4881 8245 8007 16443 6093 5074 15854 19043 12462 8239 -5281 -18229 7159
9873G159O223j4516j8746Q65j09L003m774J0371J7146q462Q22Q169K175n125j163
$$ 7159 13382 -1134 -19880 -19015 -19124 -16121 -20895 -10524 6622 -1840 -1018 7151 9326 4201 3038
9858C038j3314J9957J0636k4963j5049K2938j7673j8676k785j8561K1955K8568
$$ 3038 -10276 9681 20317 -4646 -19695 3243 -14430 -33106 -35891 -54452 -32497 -3929
9846c929R012O607j4761o734R369J6313j6016O869J78Q92j1496K043J1023n858
$$ -3929 5083 11690 -3071 -9805 -436 15877 -139 6730 6908 7800 -3696 -1653 9370 3512
9832C512L142K0190p808L968k2332j6533l02j9258J0008J8725K281n572k5505
$$ 3512 6654 26844 19036 23004 672 -15861 -16163 -35421 -25413 -6688 -4407 -9979 -35484
9819c5484j3624J9093J4472J4100J3207J849j624j7649k075J0416l419J9192J7789
$$ -35484 -49108 -30015 -15543 -1443 11764 13613 11989 -5660 -7735 2681 -738 18454 36243
9806C6243J3828k4099k4182n406M021R957k0157R3R354o922j6649q327J698N224
$$ 36243 50071 25972 1790 -3616 405 10362 -9795 -9702 -348 -7270 -23919 -32246 -30548 -25324
9792b5324R185k542m381L6090J0818j1280J4811J1344k517k053J3986N312J2912
$$ -25324 -16139 -18681 -23062 13028 23846 12566 27377 38721 36204 34151 48137 53449 66361
9779F6361J3420K2264J6886L6591N9817R7480J79345J95527J06521q2180j74727
$$ 66361 79781 102045 118931 155522 215339 312819 492164 687691 794212 712032 537305
9768E37305j61331j10287q5018n2245j8081P747Q530j9857q935m368M498J0826
$$ 537305 375974 265687 180669 128424 110343 118090 126620 106763 97828 93460 97958 108784
9756A08784l3444p312J0212j6211J2233R773K215J2782k7036m4301k349J7550
$$ 108784 75340 68028 78240 62029 74262 84035 86250 99032 71996 27695 25346 42896
9744D2896p636m878m107k924n557j2301q89J3410R509j6496K9412J9536j9949
$$ 42896 35260 30382 26275 23351 17794 5493 4604 18014 27523 11027 40439 59975 40026
9731D0026j0557j5112j28R750J7390J3160l4469k2085J3270k946k0648J6457K6324
$$ 40026 29469 14357 14229 23979 41369 54529 20060 -2025 11245 8299 -12349 4108 30432
9718C0432M322J3450N735j6824k1080j0231j5547K795q959j0385K248N543J0840
$$ 30432 34754 48204 53939 37115 16035 5804 -9743 -6948 -15907 -26292 -24044 -18501 -7661
9705g661O7K0842J1178J4366l321j7235j6109j207L449L188r822j2456l644K1504
$$ -7661 -7594 13248 24426 38792 35471 18236 2127 920 4369 7557 -2265 -14721 -18365 3139
9691C139K375j3697P092J2984L543j3837j6298L377k096n407R347m359j2061k1421
$$ 3139 5514 -8183 -1091 11893 15436 1599 -14699 -11322 -13418 -18825 -9478 -13837 -25898 -47319
9677d7319M508L3431M181n15M484J3380K5715m483K220J5501r322k707l90k3562
$$ -47319 -42811 -9380 -5199 -5714 -1230 12150 37865 33382 35602 51103 41781 39074 38684 15122
9663A5122p715J0308L179J3949M868J2169k688l3568j7636J9604K6394J6040M8186
$$ 15122 7407 17715 20894 34843 39711 51880 49192 15624 -2012 17592 43986 60026 108212
9650A08212Q3399P3838o932n2140m3512n4343o7402l541q55P905j9926j8403r87
$$ 108212 191611 265449 258517 206377 162865 108522 41120 37579 36724 44629 24703 6300 5313
9637E313j66M1840R469N077J0377K324k6796k6770k2326J0496q402r685R951l113
$$ 5313 5147 46987 56456 61533 71910 74234 47438 20668 -1658 8838 436 -9249 702 -2411
9623b411k1344r725q822n867L0305K9321K121o274o466n951O905p576n239O862
$$ -2411 -23755 -33480 -42302 -48169 -17864 11457 13578 7304 838 -5113 1792 -5784 -11023 -4161
9609d161m646j8535o479J2170l808j7377N705J5847L8581l564l1255R927J2191
$$ -4161 -8807 -27342 -33821 -21651 -25459 -42836 -37131 -21284 17297 13733 -17522 -7595 4596
9596D596j027j5898L919J0497Q540m932J024R14m552j4721P508J5613N929M54
$$ 4596 3569 -12329 -8410 2087 10627 5695 6719 7633 3081 -11640 -4132 11481 17410 17864
9582A7864k4259j6172Q384K3677k855j733j8695j9413j3516J3924R517Q191J3756
$$ 17864 -6395 -22567 -14183 9494 6639 4906 -13789 -33202 -46718 -32794 -23277 -15086 -1330
9569a330J7725m762j271M692k912q236j1666j3836J8696N913j0303L276N421Q360
$$ -1330 16395 11633 10362 15054 12142 3906 -7760 -21596 -2900 3013 -7290 -4014 1407 9767
9555I767j0991k2385q206J3302M814J4384o58L885J77J1745p746j9391q22p586
$$ 9767 -1224 -23609 -31815 -18513 -13699 685 27 3912 4089 15834 8088 -11303 -12125 -19711
9541a9711L04P313M785j3897o537L1216R817j8402p686L170j5044J5133M380J0152
$$ -19711 -19407 -12094 -7309 -21206 -27743 3473 13290 -5112 -12798 -9628 -24672 -9539 -5159 4993
9527D993n44Q987q755K3330o220k4645k0708K6770j4900j8453L365k2334P623
$$ 4993 4449 13436 4681 28011 21791 -2854 -23562 3208 -11692 -30145 -26780 -49114 -41491
9514d1491J5865K0950L2249J4368J3427j4710j103j2054j585j7243j9628j5136
$$ -41491 -25626 -4676 27573 41941 55368 40658 39555 27501 25916 8673 -10955 -26091
9502b6091K9671R063o291Q641k201k8308k8311J3643K3471J9299k2350l0394R143
$$ -26091 3580 12643 6352 14993 12792 -15516 -43827 -30184 -6713 12586 -9764 -40158 -31015
9489c1015K7174q816k6341J4118O46p948O142j2944j8466K378L663J2278J2173
$$ -31015 -3841 -12657 -38998 -24880 -24234 -32182 -26040 -38984 -57450 -55072 -51409 -39131 -26958
9476b6958K4656J5032k6958l8998K135L833L287O293J4341L7859n790j8327J023
$$ -26958 -2302 12730 -14228 -53226 -51091 -47258 -43971 -37678 -23337 14522 8732 -9595 -8572
9463h572p883Q7j2594o659j6769J1172R497R24J0219K2423K536j0026n49m976
$$ -8572 -16455 -16368 -28962 -35621 -52390 -41218 -31721 -30797 -20578 1845 4381 -5645 -6194 -11170
9449a1170j677k1655k3213J0438J1753j1194P313J2598K9789J9443r807k1266
$$ -11170 -12847 -34502 -57715 -47277 -35524 -46718 -39405 -26807 2982 22425 12618 -8648
9437h648k705q671j0405Q737J6170M247L806r021r825Q008J8792K077k8044J0833
$$ -8648 -11353 -20024 -30429 -21692 -5522 -1275 2531 -6490 -16315 -8307 10485 12562 -15482 -4649
9423d649Q768l204N782k6022j6252k5946j9174J1655J9120M6479O90j815P834
$$ -4649 4119 915 6697 -19325 -35577 -61523 -80697 -69042 -49922 -3443 -2753 -4568 3266
9410C266j9022Q530L2228L3899q401j4047j3517J7144K327k8468l650j2874K65
$$ 3266 -15756 -7226 25002 58901 50500 36453 22936 40080 42407 13939 10289 -2585 -2320
9397b320r567Q301j0856R996K911j1792k6996Q521K5623k6035j7009J1548J6079
$$ -2320 -11887 -3586 -14442 -4446 -1535 -13327 -40323 -31802 -6179 -32214 -49223 -37675 -21596
9384b1596j6391o505J2316L4514L1905O211o637l8667j3634J1788K2706K8200
$$ -21596 -37987 -44492 -32176 2338 34243 40454 33817 -4850 -18484 -6696 16010 44210
9372D4210Q926r503k5066k2956J873J137j7391P760Q263p270p867k527j0880O755
$$ 44210 53136 43633 18567 -4389 -2516 -1379 -18770 -11010 -2747 -10017 -17884 -20411 -31291 -24536
9358b4536K4912j4574j071j5797R64J1571K7974Q966J1658n263J5857j7324l5929
$$ -24536 376 -14198 -15269 -31066 -30102 -18531 9443 18409 30067 24804 40661 23337 -12592
9345a2592J1471J5439k7682q457J7220J408q636P896m78Q0j0786l4O089k0355
$$ -12592 -1121 14318 -13364 -21821 -4601 -3193 -11829 -3933 -4411 -4331 -15117 -15151 -9062 -29417
9331b9417P616P160j4396j7066P179K7179j3302j2675J8011k1622r386J2342L4338
$$ -29417 -21801 -14641 -29037 -46103 -38924 -11745 -25047 -37722 -19711 -41333 -50719 -38377 -4039
9318d039L0632L45j6026l9762o012Q686P37q433J1037K1407M495J7895J7400J1902
$$ -4039 26593 26938 10912 -28850 -34862 -26176 -25439 -33872 -22835 -1428 3067 20962 38362 50264
9304E0264j0750j1368m794j5911m205l336J1145k4500k0682o804m38M41j4145
$$ 50264 39514 28146 23352 7441 3236 -100 11045 -13455 -34137 -40941 -41379 -40938 -55083
9291e5083q806J7852L9495L851k2354l0157N144L3539J0915M188O9p362j281R695
$$ -55083 -63889 -46037 -6542 -2691 -25045 -55202 -50058 -16519 -5604 -1416 -1347 -8709 -9990 -295
9277b95J4960o692Q211j8594k4023R088J675j0712J0071K1102J5273O957j8558
$$ -295 14665 7973 16184 -2410 -26433 -17345 -15670 -26382 -16311 4791 20064 27021 8463
9264H463k8495l8790l196J7735Q865K2628J5703Q325j730k7498o340j487J1351
$$ 8463 -20032 -58822 -62018 -44283 -35418 -12790 2913 11238 9508 -17990 -24330 -25817 -14466
9251a4466M777j8131Q26K7211K9172P002j5062k2802P720J4944L080j744k1153
$$ -14466 -9689 -27820 -26994 217 29389 36391 21329 -1473 6247 21191 24271 22527 1374
9238A374j871J9598j6442j7925M639j0656k0860K0477L4597r080l3171k2012r36
$$ 1374 -497 19101 2659 -15266 -10627 -21283 -42143 -21666 12931 3851 -29320 -51332 -52268
9225e2268J1255j2262j0733o57J9607J9817m81K5759J3252j4267p851L270l3324
$$ -52268 -41013 -53275 -64008 -64665 -45058 -25241 -25722 37 13289 -978 -8829 -5559 -38883
9212c8883j2693r954j3307j8499M2J6279J4415K2510J7988K803l939k024J0662
$$ -38883 -51576 -61530 -74837 -93336 -93294 -77015 -62600 -40090 -22102 -19299 -23238 -25262 -14600
9199a4600J0388P271q043j8509j7523J5587K0599P598k868K167J0122M119j1854
$$ -14600 -4212 3059 -4984 -23493 -41016 -25429 -4830 2768 -100 2067 12189 16308 4454
9186D454p978r648l512M490J4158Q357p883J004Q861n798o662r062m1419k0361
$$ 4454 -3524 -13172 -16684 -12194 1964 10321 2438 3442 12303 6505 -157 -9219 -50638 -70999
9172g0999R155K5747L9367q589k4593p031k837L223j1671p445J9664J711P437
$$ -70999 -61844 -36097 3270 -5319 -29912 -36943 -39780 -36557 -48228 -55673 -36009 -34298 -26861
9159b6861J5890J334j8821Q366R148q276j3683N450M619J8312j1151M911K2633
$$ -26861 -10971 -9637 -28458 -20092 -10944 -19220 -32903 -27453 -22834 -4522 -15673 -10762 11871
9146A1871q537k2891j1247j680K2164J4626L052N139q278k3528k845N084j8816
$$ 11871 3334 -19557 -30804 -32484 -10320 4306 7358 12497 4219 -19309 -22154 -17070 -35886
9133c5886m478J1220J2267J6500R109k1879n648j002J6624P534o157R859M888
$$ -35886 -40364 -29144 -16877 -377 8732 -13147 -18795 -19797 -3173 4361 -1796 8063 12951
9120A2951j233j5664j1235j2084j337R845J1347P468K1407m910k5032J646K91
$$ 12951 11718 -3946 -15181 -27265 -28602 -18757 -7410 58 21465 16555 -8477 -6831 -6540
9107f540p918K793L214J1600J2796J4465l939q613M007O217k3823j4579j1964
$$ -6540 -14458 -11665 -8451 3149 15945 30410 26471 17858 21865 28082 4259 -10320 -22284
9094b2284k078K5736K5268L781l713j5016n471J562L378K2426J328k1651j263
$$ -22284 -24362 1374 26642 30423 26710 11694 6223 7785 11163 33589 34917 13266 12003
9081A2003j9877m785M664K4316J8585j64j567n756j9215N304j4717l099k260O332
$$ 12003 -7874 -12659 -7995 16321 34906 34742 33175 27419 8204 13508 -1209 -4308 -6568 -236
9067b36m028j5305p529l915l648J3210K4065m03Q713R329o586j338j1052p455
$$ -236 -4264 -19569 -27098 -31013 -34661 -21451 2614 2211 10924 20253 13667 12329 1277 -6178
9053f178R65K168r580n341N679M567K4671q734r210j6200J0979P41j5000j2913
$$ -6178 -5213 -3045 -12625 -17966 -12287 -7720 16951 8217 -993 -17193 -6214 -5473 -20473 -33386
9039c3386J3339K0473j1411l280M615j366J2999J6200m303j1279l2835j2972K0977
$$ -33386 -20047 426 -10985 -14265 -9650 -11016 1983 18183 13880 2601 -30234 -43206 -22229
9026b2229K0051m075m632R968k06j6760p503L259P786L300q93J0361J2410j8476
$$ -22229 -2178 -6253 -10885 -917 -1123 -17883 -25386 -22127 -14341 -11041 -11934 -1573 10837 -7639
9012g639k0290j300N098j3706R935J253j0748Q981m87J220n094J4191j0970K752
$$ -7639 -27929 -29229 -24131 -37837 -27902 -26649 -37397 -28416 -28903 -27683 -32777 -18586 -29556 -26804
8998b6804J9254p307O49J5769K1024n676O191k625Ro617J504J2297o979J2373
$$ -26804 -7550 -14857 -14208 1561 22585 16909 23100 20475 20484 13867 15371 27668 20689 33062
8984C3062R020j9738n01j4822j3186J3019N238n455k540O797j268j799J213J3231
$$ 33062 42082 22344 21843 7021 -6165 6854 12092 6637 4097 10894 9626 7827 9040 22271
8970B2271P235p444j7771k0216J1583j0544P24J5177M63k6526m382J2630L065
$$ 22271 29506 22062 4291 -15925 -4342 -14886 -14162 1015 1478 -25048 -29430 -16800 -13735
8957a3735o152l042j4372n348J9358j4132p595Q017j2514l130L0315Q297J5906
$$ -13735 -19887 -22929 -37301 -42649 -23291 -37423 -45018 -37001 -49515 -52645 -22330 -14033 1873
8944A873J8139j0306r098L804N642m261k7989j0423J39k223l620j100J0044J4501
$$ 1873 20012 9706 608 4412 10054 5793 -22196 -32619 -32480 -34703 -38323 -39423 -29379 -14878
8930a4878L3208J4334J9304K957K1352J9375J702n3245n0062j5781J8631L115
$$ -14878 18330 32664 51968 54925 76277 95652 97354 44109 -5953 -21734 -3103 12
8918A2l815K1595J307J1290k155l8863p199M103j490J9368J5338j9216l6771p854
$$ 12 -3803 17792 19099 30389 28234 -10629 -17828 -13725 -15215 4153 19491 275 -36496 -44350
8904d4350K6413j428j1832J5660J2251M455R648l507m043j0953m944J8352L0780
$$ -44350 -17937 -19365 -31197 -15537 -3286 1169 10817 7310 3267 -7686 -12630 5722 36502
8891C6502j5222j9325j2576n728L347j1711O044k399n392J4474r548q057J6901
$$ 36502 21280 1955 -10621 -16349 -13002 -24713 -18669 -21068 -26460 -11986 -21534 -29591 -12690
8878a2690L188J4192J4578m86j4163l296J7277k2605K190j2896N645K7508l022
$$ -12690 -9502 4690 19268 18782 4619 1323 18600 -4005 -1815 -14711 -9066 18442 15420
8865A5420j8037k112J1100N325n007j2759k3541r21m579J0078j8042J7206O971
$$ 15420 -2617 -4729 6371 11696 6689 -6070 -29611 -30532 -35111 -25033 -43075 -25869 -18898
8852a8898J8619N909j792k1648J6958L9726j8324r298Q780k479j2654o045j0050
$$ -18898 -279 5630 3838 -17810 -852 38874 20550 11252 20032 17553 4899 -1146 -11196
8839a1196J7504R230j0701n702K1850J3108J9380J8220p603J7298j9652k4413
$$ -11196 6308 15538 4837 -865 20985 34093 53473 71693 64090 81388 61736 37323
8827C7323o706j6465j3493j5864R03K6416J0000j5485l84l291J1909K185r880
$$ 37323 30617 14152 659 -15205 -14302 12114 22114 6629 6245 2954 14863 17048 7168
8814G168K358l096j7681J0805J0869r90k252J9952j1129j8965j6110O737J6029
$$ 7168 9526 6430 -11251 -446 10423 9433 7181 27133 16004 -2961 -19071 -12334 3695
8801C695J4151N46j7508j9295L0705J1834n057P40k3545j0353K2040k2547k0875
$$ 3695 17846 18392 884 -18411 12294 24128 19071 19811 -3734 -14087 7953 -14594 -35469
8788c5469j591J3239J9988o024p149K379K8775J2581j5780k5465j1801J8078Q733
$$ -35469 -37060 -23821 -3833 -9857 -17006 -14627 14148 26729 10949 -14516 -26317 -8239 494
8775D94K286R017j2148j7599o043J2507J4026j1262K59o341j8655L099R523R295
$$ 494 2780 11797 -351 -17950 -23993 -11486 2540 -8722 -8463 -14804 -33459 -30360 -20837 -11542
8761a1542Q842Q297J7871K2067p819j0994j1131j4157j4064j2842k022L389j0135
$$ -11542 -2700 5597 23468 45535 37716 26722 15591 1434 -12630 -25472 -27494 -24105 -34240
8748c4240L748K0380k8915k6976K9046J3849J7978l118m702L529j3677K4551j935
$$ -34240 -30492 -10112 -39027 -66003 -36957 -23108 -5130 -8248 -12950 -9421 -23098 1453 -482
8735d82J0395K3137j489J967k3616J0631n263j3536j4299J8098K617l902K6711
$$ -482 9913 33050 31561 33528 9912 20543 15280 1744 -12555 5543 8160 4258 30969
8722C0969K7705O463k8839J2932J0825j6544j1866j0j6680p775j8665j3996j6854
$$ 30969 58674 65137 36298 49230 60055 43511 31645 31635 14955 7180 -11485 -25481 -42335
8709d2335J1465L0276K7036j543j0995j4254p460R606J6401J203K0501q777j8604
$$ -42335 -30870 -594 26442 24899 13904 -350 -7810 1796 18197 19400 39901 31124 12520
8696A2520J4269J6502J447j7602k9791M508J3871J808j4306P266R041N614j208
$$ 12520 26789 43291 44738 27136 -2655 1853 15724 17532 3226 10492 19533 25147 23939
8683B3939J1091l402p984l2805j236N852n176K9885N627K545j418j5170k4486
$$ 23939 35030 31628 23644 -9161 -10397 -4545 -9721 20164 25791 28336 26918 11748 -12738
8670a2738L122R561J7541J4560K916n847k8744R829K0870j3704j2816K6260J1455
$$ -12738 -9616 -55 17486 32046 34962 29115 371 10200 31070 17366 4550 30810 42265
8657D2265P975j8740p706R8j525j9128j6577J9360L9804J8403l0777q173j8858
$$ 42265 50240 31500 23794 23892 22367 3239 -13338 6022 45826 64229 33452 25279 6421
8644F421M052J3206k2943j8244j3668N359J7016J582R027P579J090k3662m557
$$ 6421 10473 23679 736 -17508 -31176 -25817 -8801 -7219 1808 9387 10477 -13185 -17742
8631a7742L4806M047K4216K2959l5048n6777j5262J2886K1785J0210r666k6738
$$ -17742 17064 21111 45327 68286 33238 -23539 -38801 -25915 -4130 6080 -3586 -30324
8619c0324k9965l679M0137K6233l885J0728Q701M865j6307J208R347L395r36N074
$$ -30324 -60289 -63968 -23831 2402 -1483 9245 17946 22811 6504 7712 17059 20454 19518 24592
8605B4592L4250j6411j2929J3708J0480N031K2477M480J3324j1931q711K691o842
$$ 24592 58842 42431 29502 43210 53690 58721 81198 85678 99002 87071 78360 81051 74209
8592G4209j4395K6757K0617P168O137K831Q301j3826l5405j225j3n09k151l734
$$ 74209 59814 86571 107188 114356 120493 123324 131625 117799 82394 81169 81156 80647 78496 74762
8578G4762p523P240J4659m965r902J4869M192o106n068j6930l8358j543Q738j0154
$$ 74762 67239 74479 89138 84173 74271 89140 93332 87226 82158 65228 26870 25327 34065 23911
8564B3911J0104r992j2398L2102j0456r219m108k37J6455L501p099J9972j6349
$$ 23911 34015 24023 11625 43727 33271 24052 19944 19707 36162 39663 32564 52536 36187
8551C6187k3753j2960N417K8860J4382J5730k4564q083q239K2146Q193k5309j8668
$$ 36187 12434 -526 4891 33751 48133 63863 39299 31216 22977 45123 53316 28007 9339
8538I339L657k2402K715J7715r208J1768q313l605J7302J7121M3880N8085M0596
$$ 9339 12996 -9406 -6691 11024 1816 13584 5271 1666 18968 36089 79969 138054 178650
8525A78650J2405j8988k8701m7811k1212j3622j7390k7328m227J52Q165K0620
$$ 178650 191055 172067 143366 95555 74343 60721 43331 16003 11776 11928 20093 40713
8513D0713j2984k4433j46l182j2473o184K5358K2786J5958n891O079j8802j2705
$$ 40713 27729 3296 3150 -32 -12505 -18689 6669 29455 45413 39522 45601 26799 14094
8500A4094q829o831J6990J9431J5303J035n816k6655j9382j2730K3855L5678J7183
$$ 14094 5265 -1566 15424 34855 50158 51193 45377 18722 -660 -13390 10465 46143 63326
8487F3326j8825K0525M6510L8962Q7307J16312R1209j0247r2846j02076n2481
$$ 63326 44501 65026 111536 150498 237805 354117 445326 435079 342233 240157 187676
8476A87676l2295l0357k7173l1504n195m495l065M366O451K6809J6992j7252l9095
$$ 187676 155381 125024 97851 66347 61152 56657 53592 57958 64409 91218 108210 90958 51863
8463E1863k1700r652J115R992k2278K791n881O936J8321J9994K2619j2055l0441
$$ 51863 30163 20511 21626 31618 9340 12131 6250 13186 31507 51501 74120 62065 31624
8450C1624k567R436K587L109k267k3629O072k53J3602L2082L3403J6077K7007
$$ 31624 29057 38493 41080 44189 41922 18293 24365 24112 37714 69796 103199 119276 146283
8437A46283L6993K0118L383k1874n0956k9896k8124l4201j0590l306j6938j0863
$$ 146283 183276 203394 206777 184903 133947 104051 75927 41726 31136 27830 10892 29
8425B9Q21O834j565R791K8463p058Q394p268q382J7384K164J32O124J0251j0303
$$ 29 850 7684 6119 15910 44373 37315 45709 38441 30059 47443 49607 49739 55863 66114 55811
8410E5811o622j9476N508q267q489j1837q405L0105J0180K603q328k3238j0150
$$ 55811 49189 29713 35221 26954 18465 6628 -1777 28328 38508 41111 32783 9545 -605
8397f05J953O179j4298K012Q779n484J430k286m232k826J5678J575J186J857j8002
$$ -605 1348 7527 -6771 -4759 4020 -1464 -34 -2320 -6552 -9378 6300 7875 9061 10918 -7084
8382g084k107K289r285n768j332J9662j7105j0903L0237P784j6919J1020o906
$$ -7084 -9191 -6902 -16187 -21955 -23287 -3625 -20730 -31633 -1396 6388 -10531 489 -6417
8369f417R491K159q557j4495j9511N221J4112O098P512L51n484M567K0898J2322
$$ -6417 3074 5233 -3324 -17819 -37330 -32109 -17997 -11899 -4387 -4036 -9520 -4953 15945 28267
8355B8267j9253n045k1399J7813K3383j1710j3046l0316J2480K5894J3685J1078
$$ 28267 9014 3969 -17430 383 23766 12056 -990 -31306 -18826 7068 20753 31831
8343C1831j1309k784k0720j7725k3307M774Q959Q895J635r302M058J1478j0454
$$ 31831 20522 17738 -2982 -20707 -44014 -39240 -30281 -21386 -19751 -29053 -24995 -13517 -23971
8330b3971M638J5607K673J2015R305k1387q547n847Q554j61J3429p991O402O009
$$ -23971 -19333 -3726 -1053 10962 20267 -1120 -9667 -15514 -6960 -7121 6308 -1683 4719 10728
8316A0728L79J0879K4293j3394l7102k5968J319P593J5438K5021J0396j0555l6893
$$ 10728 11107 21986 46279 32885 -4217 -30185 -28866 -21273 -5835 19186 29582 19027 -17866
8303a7866k9496J9786K019L1211K7360J9869q366k7882j1347L536P649j9099R393
$$ -17866 -47362 -27576 -25557 5654 33014 52883 44517 16635 5288 8824 16473 -2626 6767
8290F767j4146j7271k1136J3319R463J7965n431N116o831l332N031k060p795o744
$$ 6767 -7379 -24650 -45786 -32467 -23004 -5039 -10470 -5354 -12185 -15517 -10486 -12546 -20341 -27085
8276b7085J4448P030m912L08O297k431n389N18j36N25K4007Q959j6769k3930k6164
$$ -27085 -12637 -5607 -10519 -10211 -3914 -6345 -11734 -11216 -11352 -10827 13180 22139 5370 -18560 -44724
8261d4724K3324J8666j2682l134M533O731n676J9436J7129R271j9559j145j7673
$$ -44724 -21400 -2734 -15416 -18550 -14017 -7286 -12962 6474 23603 32874 13315 12170 -5503
8248e503Q612J702L915L197J627j0902J7849J0865j7361o670J4800n497k7820
$$ -5503 3109 4811 8726 11923 13550 2648 20497 31362 14001 7331 22131 16634 -11186
8235a1186l0632k830j8524q502R339J0780L6000P978j4512m038J9950J4392j3210
$$ -11186 -41818 -44648 -63172 -71674 -62335 -51555 -15555 -7577 -22089 -26127 -6177 8215 -4995
8222d995Q521P347k892j2837j302p368R365o020j2258J0880K813J7211J9351J5610
$$ -4995 3526 10873 7981 -4856 -6158 -13526 -4161 -10181 -22439 -11559 -8746 8465 27816 43426
8208D3426j4212j0532O364M458o448n128k9610K195J1118j230k086m49P625k812
$$ 43426 29214 18682 25046 29504 23056 17928 -11682 -9487 1631 401 -1685 -2134 5491 2679
8194B679M021j5858j5741J7287O810P10K1694j0177n34o001p426j3327r009m729
$$ 2679 6700 -9158 -24899 -7612 -802 -92 21602 11425 10891 4890 -2536 -15863 -24872 -29601
8180b9601N480J0958k414J3395k1530R251J1588J0291p050j1859p279k674k0312
$$ -29601 -24121 -13163 -15577 -2182 -23712 -14461 -2873 7418 368 -11491 -18770 -21444 -41756
8167d1756l860J2176J5557n575o605l603K3523M725k334q404J9387J2333j5796
$$ -41756 -45616 -33440 -17883 -23458 -30063 -33666 -10143 -5418 -7752 -16156 3231 15564 -232
8154b32r310J1789o099j852k5145l756J1699K3551j5300j6921J0769K5264J9290
$$ -232 -9542 2247 -3852 -5704 -30849 -34605 -22906 645 -14655 -31576 -20807 4457 23747
8141B3747k0541k9892O586rj6107L7827K4634k4508o661m0448n261O808M385j0257
$$ 23747 3206 -26686 -20100 -20109 -36216 1611 26245 1737 -4924 -45372 -50633 -43825 -39440 -49697
8127d9697N710J3396Q087j4455j1709J08M285k4318J1599K0967p216p62M863j9844
$$ -49697 -43987 -30591 -22504 -36959 -48668 -48560 -44275 -68593 -56994 -36027 -43243 -44005 -39142 -58986
8113e8986J6239J3386J7574M3262J2842j3439k1617L911J3734J6653l464j9522
$$ -58986 -42747 -29361 -11787 31475 44317 30878 9261 13172 26906 43559 40095 20573
8101B0573M657p203J336o232P290K4473P049j3049k870j2712J6463J2831j256
$$ 20573 25230 18027 19363 13131 20421 44894 51943 38894 36024 23312 39775 52606 51350
8088E1350m262j6836j2947q538j1827k0603k2310J0281J1617k2214k8988K8066
$$ 51350 47088 30252 17305 8767 -3060 -23663 -45973 -35692 -24075 -46289 -75277 -47211
8076d7211K9721K867k8716m806K3867M519M320P04j4455J5859P619M542K5082
$$ -47211 -17490 -14623 -43339 -48145 -24278 -19759 -15439 -14735 -29190 -13331 -5712 -1170 23912
8063B3912J5073j7123K5075K808J1255j8067j6306k8044K822r666K276n921J04
$$ 23912 38985 21862 46937 49745 61000 42933 26627 -1417 1405 -8261 -5985 -11906 -11802
8050a1802n393K0361O164j8197o595J696k740j5818o179J7821K7216J6308j182
$$ -11802 -17195 3166 9330 -8867 -15462 -13766 -16506 -32324 -38503 -20682 6534 22842 21660
8037B1660j0442j7994k483P674P966m63P784j0249j4237J2237J2141p6r77j0352
$$ 21660 11218 -6776 -9259 -1585 6381 5918 13702 3453 -10784 1453 13594 13518 12541 2189
8023B189N195J8103J7133J1108O71J4547q919j3453k793J2081R731j434j1825
$$ 2189 7384 25487 42620 53728 54399 68946 60027 46574 43781 55862 65593 64159 52334
8010E2334l308j0757j4085J8460P896J6805Q994j8054n809j2632r079p70N304
$$ 52334 49026 38269 24184 42644 50540 67345 76339 58285 52476 39844 30765 29995 35299
7997C5299j3409r111k6904N849K6552J6811M057L715k3204r70J6985o732j1394
$$ 35299 21890 12779 -14125 -8276 18276 35087 39144 42859 19655 18685 35670 28938 17544
7984A7544J2889M3366K1711m194M2046K2258M099Q273j999j2618l0137K991j2689
$$ 17544 30433 73799 95510 91316 133362 155620 159719 167992 165993 153375 123238 126229 113540
7971A13540m4835k6646Q322J5366j0617j5685J3300J3682o14J3382j3393J371
$$ 113540 68705 42059 50381 65747 55130 39445 52745 66427 65813 79195 65802 67173
7959F7173r330M39J1226r393r081J0764O23j4931q436n132j7166J5300J8811J6449
$$ 67173 57843 58282 69508 60115 51034 61798 62421 47490 39054 33922 16756 32056 50867 67316
7945F7316K213J0429M156Q147j7717K0483K7290M914L968K3156k0040N892k7318
$$ 67316 69529 79958 84114 92261 74544 95027 122317 127231 131199 154355 134315 140207 112889
7932A12889l1763o313j4644k1843q055J77L057j7339o359J4926L7797N228O320
$$ 112889 81126 74813 60169 38326 30271 30448 33505 16166 9807 24733 62530 67758 74078
7919G4078J5809j5298j7936n637k303J3225P958j3807j6783l575O352j724k4385
$$ 74078 89887 74589 56653 51016 48713 61938 69896 56089 39306 35731 42083 40359 15974
7906A5974m341k95J076L4191j15n274Q482R051k2758j3210q818l127L510j3901
$$ 15974 11633 11338 12414 46605 46490 41216 49698 58749 35991 22781 13963 10836 14346 445
7892D45j9800j318M081J8562K2029R00j835j2333L120K7939j0747j4167r1n478
$$ 445 -19355 -20673 -16592 1970 23999 24899 23064 10731 13851 41790 31043 16876 16785 11307
7878A1307P161q654O385K0055k603j1418r760k7147j8580J2562Q559J59K3320
$$ 11307 18468 9814 16199 36254 33651 22233 12473 -14674 -33254 -20692 -12133 -11974 11346
7865A1346k26k1688Q91l512j9612j0097j010P34P744K8359O42P778j5687j0431
$$ 11346 11120 -10568 -9677 -13189 -32801 -42898 -43908 -43174 -35430 -7071 -6429 1349 -14338 -24769
7851b4769R928o270J2966j311k172l690j015L311J7813j4437m693j3940j0193
$$ -24769 -14841 -21111 -8145 -9456 -11628 -15318 -16333 -13022 4791 -9646 -14339 -28279 -38472
7838c8472K7282L9561P259k8604r427J3718j1308n367n961N469j0280N699J8994
$$ -38472 -11190 28371 35630 7026 -2401 11317 9 -5358 -11319 -5850 -16130 -10431 8563
7825H563j9843j3371j535O126j615K5801L2987j0672j0480j1775q073l829J3276
$$ 8563 -11280 -24651 -26186 -20060 -21675 4126 37113 26441 15961 4186 -3887 -7716 5560
7812E560J3236k0915k5472J87J0799O708O665j6629L928K5527J4889k2817j0667
$$ 5560 18796 -2119 -27591 -27404 -16605 -9897 -3232 -19861 -15933 9594 24483 1666 -9001
7799i001l0414k763K0229J5361K9379l100q010o710j3622k220j616l535j6154
$$ -9001 -39415 -42178 -21949 -6588 22791 19691 11681 4971 -8651 -10871 -12487 -16022 -32176
7786c2176R014O143O521p066j6579q058J4729K1257J3484K0382j3829m026o56
$$ -32176 -23162 -17019 -10498 -17564 -34143 -42201 -27472 -6215 7269 27651 13822 9796 9140
7773I140J3372J7949r615j6181M147J3995j7187j6166K778j0323r23J9342k336
$$ 9140 22512 40461 30846 14665 18812 32807 15620 -546 2232 -8091 -9014 10328 7992
7760G992Q236p550j0735O420J9807j0263j6801R757p708j6381p928J806j1374
$$ 7992 16228 8678 -2057 4363 24170 13907 -2894 6863 -845 -17226 -25154 -23348 -34722
7747c4722o362J743Q289J8149J8214N718L983p911j7716o336k4421j1458k34J5270
$$ -34722 -41084 -39341 -31052 -12903 5311 11029 15012 7101 -10615 -16951 -41372 -52830 -53064 -37794
7733c7794L0772K1663K7429j452j2693k0002q958l818Q580R166q72L640j47o733
$$ -37794 -7022 14641 42070 40618 27925 7923 -1035 -4853 3727 12893 12021 15661 15514 8781
7719H781k6055M627L2601j2581l6605J7336J7444P768l1906j1394m467L319R496
$$ 8781 -17274 -12647 19954 7373 -29232 -11896 5548 13316 -18590 -29984 -34451 -31132 -21636
7706b1636K828k202n259l075J1535L0898O188l9493n356P41j316K845K5819M3
$$ -21636 -18808 -21010 -26269 -29344 -17809 13089 19277 -20216 -25572 -24831 -26147 -23302 2517 2560
7692B560j5052k1367l4532J1267J5786N4J1815P694N003O422j6102Q507K0723
$$ 2560 -12492 -33859 -68391 -57124 -41338 -41284 -29469 -21775 -16772 -10350 -26452 -17945 2778
7679B778M236K992J5222r309k152j6969J4548P808q296j5510r329l932j1175J1949
$$ 2778 7014 10006 25228 15919 13767 -3202 11346 19154 10858 -4652 -13981 -17913 -29088 -17139
7665a7139L3838j359O02j3279l7953l893l827J7599m974Q300J7697q888K4528
$$ -17139 16699 15340 15942 2663 -35290 -39183 -43010 -25411 -30385 -22085 -4388 -13276 11252
7652A1252J2436M93j6177n458k4851J7196J0019L229K953N463k3786j1183K125
$$ 11252 23688 24181 8004 2546 -22305 -5109 4910 8139 11092 16555 -7231 -18414 -16289
7639a6289k520l435J9018N492o948j6479L140O131R614K3437r232j4284j8141
$$ -16289 -18809 -22244 -3226 2266 -4682 -21161 -18021 -11890 -2276 21161 11929 -2355 -20496
7626b0496l89K8595Q813R390J087j2697k1909j9691k4525m39J9775N492J506j0095
$$ -20496 -20885 7710 16523 25913 27000 14303 -7606 -27297 -51822 -52261 -32486 -26994 -25488 -35583
7612c5583l4965J4409R358M948K1971L892O000j592K706k2174j2442N331l495
$$ -35583 -70548 -56139 -46781 -41833 -19862 -15970 -9970 -11562 -8856 -31030 -43472 -38141 -41636
7599d1636K9018K9303O201j9878O681J6775J6898R85l177k4615j0846o114j0140
$$ -41636 -12618 16685 22886 3008 9689 26464 43362 44347 41170 16555 5709 -405 -10545
7586a0545J0137M325J1039k0422j4161J2045N197J1032j6479l7720k0704P829
$$ -10545 -408 3917 14956 -5466 -19627 -7582 -2385 8647 -7832 -45552 -66256 -58427
7574e8427J1509K6519Q141P345J4095K480J1542J2642p841l378J0825k9334p730
$$ -58427 -46918 -20399 -12258 -4913 9182 11662 23204 35846 28005 24627 35452 6118 -1612
7561a612K2074r813l1023l5615l0324J2030L7080K0254J9867Q338k4227j8859
$$ -1612 20462 10649 -20374 -55989 -86313 -74283 -37203 -16949 2918 11256 -12971 -31830
7549c1830k864M620P338Q807j0979K9991R901J1731R0M496j3601k1400Q301j9924
$$ -31830 -34694 -30074 -22736 -13929 -24908 5083 14984 26715 26805 31301 17700 -3700 4601 -15323
7535a5323k3089J0118J5706N916J3364j8798l0043k1510J2592M046j0420K3015
$$ -15323 -38412 -28294 -12588 -6672 6692 -12106 -42149 -63659 -51067 -47021 -57441 -34426
7523c4426M6264J9019k147k5705q998L282k0042l533j228j7280L951J3158J1723
$$ -34426 11838 30857 28710 3005 -5993 -2711 -22753 -26286 -27514 -44794 -40843 -27685 -15962
7510a5962l891m565N962j5244J8567R653q376K5672M061l0863l0513j7350O241
$$ -15962 -19853 -24418 -18456 -33700 -15133 -5480 -13856 11816 15877 -14986 -45499 -62849 -56608
7497e6608J2829l759q373J171J6732J1365J0016q573K2209M555j3173r809M004
$$ -56608 -43779 -47538 -55911 -54740 -38008 -26643 -16627 -25200 -2991 1564 -11609 -21418 -17414
7484a7414k21Q880J5390n624j2761k16j2093J6285J4162k2942n0272K5218L3862
$$ -17414 -17635 -8755 6635 1011 -11750 -11966 -24059 -7774 6388 -16554 -66826 -41608 -7746
7471g746K900L172l967p822j1693N154l456R208R557L529M065K930K0997Q863
$$ -7746 -4846 -1674 -5641 -13463 -25156 -20002 -23458 -14250 -4693 -1164 2901 5831 26828 35691
7457C5691j5827L9n416j9056P225p040J2515M23m293q811J7473N230l879j0435
$$ 35691 19864 19903 14487 -4569 2656 -4384 8131 8554 4261 -4550 12923 18153 14274 3839
7443C839j8532j5253N416J4545J6013L724m690K7286j111j454j1152J5302o396
$$ 3839 -14693 -29946 -24530 -9985 6028 9752 5062 32348 31237 29783 18631 33933 27537
7430B7537j0908q654K6340p642k2969j4725m480J4188Q782j6681N199j0191K413
$$ 27537 16629 7975 34315 26673 3704 -11021 -15501 -1313 7469 -9212 -4013 -14204 -11791
7417a1791K0586j8096j1988M006j2254J232O398J3959j610M317K5966k1668j3594
$$ -11791 8795 -9301 -21289 -17283 -29537 -28305 -21907 -7948 -9558 -5241 20725 -943 -14537
7404a4537o888r613Q95m465J4185J7502L46n220j905L094k2607L2632L5216O615
$$ -14537 -21425 -31038 -30143 -34608 -20423 -2921 -2575 -7795 -9700 -6606 -29213 3419 38635 45250
7390D5250p859j5590j3997J412O699m732j1837r834K6659P065q284r422l8775
$$ 45250 37391 21801 7804 9216 15915 11183 -654 -10488 16171 23236 14952 5530 -33245
7377c3245Q740J0221k8754K990k720o577J0313J1278l790n328P813M5959r678
$$ -33245 -24505 -14284 -43038 -40048 -42768 -49345 -39032 -27754 -31544 -36872 -29059 16900 7222
7364G222j5947M043J4525l3173l416K838K0509o18K262p305J692p501j0852p725
$$ 7222 -8725 -4682 9843 -23330 -26746 -23908 -3399 -4017 -1755 -9060 -7368 -14869 -25721 -33446
7350c3446J0208N753J9095M822p897J193Q442K0070l273J782O119l350j4616j1761
$$ -33446 -23238 -17485 1610 6432 -1465 -272 8170 28240 24967 26749 32868 29518 14902 3141
7336C141p296J0356J1689L839k1508j4089k3835r787L921R590P756J6955N399
$$ 3141 -4155 6201 17890 21729 221 -13868 -37703 -47490 -43569 -33979 -26223 -9268 -3869
7323c869M672k774P495K607q639j5001L534j2761k4854J1361M948M596j0848J012
$$ -3869 803 -1971 5524 8131 -508 -15509 -11975 -24736 -49590 -38229 -33281 -28685 -39533 -38521
7309c8521J6291R57J5441J9976r846r807O051O229k321j6232J94J4017k2150K1711
$$ -38521 -22230 -21273 -5832 14144 4298 -5509 542 6771 4450 -11782 -11588 2429 -19721 1990
7295A990j1660l0544N947J4816J2390L359k607j3035q575L407K700J707r841q707
$$ 1990 -9670 -40214 -34267 -19451 -7061 -3702 -6309 -19344 -27919 -24512 -21812 -20105 -29946 -38653
7281c8653L780K1457J5638k3461n03J6243K7066l984J4748k809j8260j5044O801
$$ -38653 -34873 -13416 2222 -21239 -21742 -5499 21567 17583 32331 29522 11262 -3782 3019
7268C019O760j4070J0783o526k0888L3857J9325M93k60k2780j0276j0556K4341
$$ 3019 9779 -4291 6492 -34 -20922 12935 32260 32753 32493 9713 -563 -11119 13222
7255A3222J7873j000k5845J0671J0433k0429p591L89j3749N135J0482J6678P422
$$ 13222 31095 30095 4250 14921 25354 4925 -2666 -2277 -16026 -10891 -409 16269 23691
7242B3691j2241j0665N365L2586J2095m1005j9294L713J0560J0346n149r342j5061
$$ 23691 11450 785 6150 38736 50831 9826 -9468 -5755 4805 15151 10002 660 -14401
7229a4401r137K0144L726K962o826k2084L987J1164K4933p150l6918J398J8357
$$ -14401 -23538 -3394 332 3294 -3532 -25616 -21629 -10465 14468 7318 -29600 -28202 -9845
7216i845M665J6631K94jN601P42m605j0621j0867Q962j4288K4116K819K5361K5029
$$ -9845 -5180 11451 11745 11744 17345 18087 13482 2861 -8006 956 -13332 10784 13603 38964 63993
7201F3993j1996m443j517r182p841J484j7730k4951o677Q82J7011N75j5940r345
$$ 63993 51997 47554 46037 36855 29014 30498 12768 -12183 -18860 -17978 -967 -392 -16332 -25677
7187b5677N54R761J9116k39m392r7q066N322K310J49J5970r015M587M2j3839j5538
$$ -25677 -25123 -15362 3754 3515 -877 -974 -9040 -3718 -1408 -1259 14711 5696 10283 10325 -3514 -19052
7171a9052r430J5959K5174j0747q985J2303p385n498o745j7614o445J736L2190
$$ -19052 -28482 -12523 12651 1904 -7081 5222 -2163 -7661 -14406 -32020 -38465 -36729 -4539
7158d539p142j9990p229K1046P252k410q103J4225n269Q212j5612j3289j4352
$$ -4539 -11681 -31671 -38900 -17854 -10602 -13012 -21115 -6890 -12159 -3947 -19559 -32848 -47200
7145d7200p558J1070R701j0009J61J5763j7445j4670J057J2855k354j709O014
$$ -47200 -54758 -43688 -33987 -43996 -43835 -28072 -45517 -60187 -59130 -46275 -48629 -50338 -44324
7132d4324M012J0329O929j1825J7084p129k1356J8248m613L898j186p308Q558
$$ -44324 -40312 -29983 -23054 -34879 -17795 -24924 -46280 -28032 -32645 -28747 -29933 -37241 -28683
7119b8683o828P980K7861R312l02k3456p456j4478Q140N664M787J1553J1141m497
$$ -28683 -35511 -27531 330 9642 9340 -14116 -21572 -36050 -27910 -22246 -17459 -5906 5235 738
7105G38j5431j3787P817J9930J3203N531K57j5727J6196m53N371j4744m579k0228
$$ 738 -14693 -28480 -20663 -733 12470 18001 18258 2531 18727 18274 23645 8901 4322 -15906
7091a5906J3516K6224J2243k0530k9311m440q260j2021q625j9672K633K789K6877
$$ -15906 -2390 23834 36077 15547 -13764 -18204 -26464 -38485 -47110 -66782 -64149 -61360 -34483
7078c4483P082j8324R061K6476J3800K0931q055k3012R781K148q757L647q196
$$ -34483 -27401 -45725 -36664 -10188 3612 24543 16488 -6524 3257 5405 -3352 295 -7901
7065g901j7230J1060j158J6514P338n582o346J8291L53k9748j4283j600n234J8820
$$ -7901 -25131 -14071 -15229 1285 8623 3041 -3305 14986 15339 -14409 -28692 -30292 -35526 -16706
7051a6706J4384p062k3273q961o634N490K2372q810j0563J1893K7143K275j9047
$$ -16706 -2322 -9384 -32657 -41618 -48252 -42762 -20390 -29200 -39763 -27870 -727 1548 -17499
7038a7499j5525L851J1332K6046K1743k955k1783j3787L4557q816j5757j6368
$$ -17499 -33024 -29173 -17841 8205 29948 26993 5210 -8577 25980 17164 1407 -14961
7026a4961m934M832r281R317J4871j2873j2735J8056k450J586j4159L288O522
$$ -14961 -19895 -15063 -24344 -15027 -156 -13029 -25764 -7708 -10158 -8572 -22731 -19443 -12921
7013a2921K0413L0305j4886o206J5951M170j1194j4763J3885j7146j5507j4328
$$ -12921 7492 37797 22911 16705 32656 36826 25632 10869 24754 7608 -7899 -22227
7001b2227J7538O967J0705k619j0936l318K0282J911k4898K1231P462r038m955
$$ -22227 -4689 2278 12983 10364 -572 -3890 16392 18303 -6595 14636 22098 13060 8105
6988H105J10j5120k0569o472K2120K0058j0325p322O905K0140m613k7889L98L2988
$$ 8105 8215 -6905 -27474 -33946 -11826 8232 -2093 -9415 -2510 17630 13017 -14872 -14474 18514
6974A8514o09j1441J425r753j1475L877O644R238k6541M898R176J3644L0523n628
$$ 18514 17905 6464 7889 -1864 -13339 -9462 -2818 6420 -20121 -15223 -6047 7597 38120 32492
6960C2492m427k2598j8769j7104K951r083k1075J6909L101J7001J3729j7140j3114
$$ 32492 28065 5467 -13302 -30406 -27455 -36538 -57613 -40704 -37603 -20602 -6873 -24013 -37127
6947c7127K907p950N216Q199J319r602K7226L2217O416j3722k2468J2786q127
$$ -37127 -34220 -42170 -36954 -28755 -27436 -37038 -9812 22405 28821 15099 -7369 5417 -2710
6934b710Q192O526J2744Q351j1040J5137k064K52l093j8845j2324l142n980J9094
$$ -2710 5482 12008 24752 33103 22063 37200 35136 35388 32295 13450 1126 -2016 -7996 11098
6920A1098R523j9436k3964j796N593K0341n097p63k1393j0224j777q593J2686
$$ 11098 20621 1185 -22779 -24575 -18982 1359 -3738 -4501 -25894 -36118 -37895 -46488 -33802
6907c3802J0553N807P678j85M431J788l82k3059k3522j693o690J6553K6608J7894
$$ -33802 -23249 -17442 -9764 -9949 -5518 -3730 -4112 -27171 -50693 -52386 -59076 -42523 -15915 1979
6893A979K4175J5464k6588k6420K432J74J5998J006l0712j965P814n845K2211
$$ 1979 26154 41618 15030 -11390 -8958 -8784 7214 8220 -22492 -24457 -16643 -22488 -277
6880b77K2035J5264M529k7279j0443j341M441K3170j5511l2479N683Mp375R414
$$ -277 21758 37022 41551 14272 3829 2488 6929 30099 14588 -17891 -12208 -12204 -19579 -10165
6866a0165J2063p51R916Q506j0150j7465P160K664O66L2074J5997j115k9750k5028
$$ -10165 1898 1147 11063 19569 9419 -8046 -886 1778 2444 34518 50515 49400 19650 -5378
6852e378O589l299k3612O112J2123O531J2221r035j4170j0358J1507J5384o674
$$ -5378 1211 -2088 -25700 -19588 -7465 -934 11287 2252 -11918 -22276 -10769 4615 -2059
6839b059Q469o042r132j1134M429R532K641R906j5043J0951P905p541Q969j9758
$$ -2059 6410 368 -8764 -19898 -15469 -5937 -3296 6610 -8433 2518 10423 2882 11851 -7907
6825g907j5587J8090J0835j2764l997j1749j7221O13L238J8765J151Q477j4389
$$ -7907 -23494 -5404 5431 -7333 -11330 -23079 -40300 -39687 -36449 -17684 -16533 -8056 -22445
6812b2445k0647Q027K175r844J0009L0787N375r172Q195k526j3754L308J0195
$$ -22445 -43092 -35065 -32890 -42734 -32725 -1938 3437 -5735 2460 -66 -13820 -10512 -317
6799c17L1147o799J77m253j9411k1389Q944L23j5296j6076k878N83K4926K8577
$$ -317 30830 24031 24208 19955 544 -20845 -11901 -11578 -26874 -42950 -45828 -45245 -20319 8258
6785H258Q597o538j7760R917k365J3300J8967P929k8308J4109m920k1291L227
$$ 8258 16855 10317 -7443 2474 109 13409 32376 40305 11997 26106 21186 -105 3122
6772C122q544l682R390p962O450J3199J1067M206K144j6725j6620n346J5579K7631
$$ 3122 -5422 -9104 286 -7676 -1226 11973 23040 27246 29390 12665 -3955 -9301 6278 33909
6758C3909Q571q604L329K338k0221k0599o126K441R815j9359J4981K54j5338k0932
$$ 33909 42480 33876 37205 39543 19322 -1277 -7403 -4962 4853 -14506 475 729 -14609 -35541
6744c5541n571P199N890M27K597K3981J3801r505J287L072N932Q036L736q132
$$ -35541 -41112 -33913 -28023 -27596 -24999 -1018 12783 3278 4565 7637 13569 21605 25341 17209
6730A7209j2247k946J0425Q026j7582j6367K213j7321J1566j454N588k5278J5220
$$ 17209 4962 2016 12441 20467 2885 -13482 -11269 -28590 -17024 -18478 -12890 -38168 -22948
6717b2948K6285P974n100j0044j6677k611O369l271l0800J8363L2639j920k6427
$$ -22948 3337 11311 6211 -3833 -20510 -23121 -16752 -20023 -50823 -32460 179 -1741 -28168
6704b8168j6447j1639K664K2632J1747Q904Q970j4879P58N573K8962j0420j5737
$$ -28168 -44615 -56254 -53590 -30958 -19211 -10307 -1337 -16216 -15458 -9885 19077 8657 -7080
6691g080j523j852k0446k1546Q57k079j0237J0060K6722J2249j3676j8576J641
$$ -7080 -8603 -10455 -30901 -52447 -51590 -53669 -63906 -53846 -27124 -14875 -28551 -47127 -45486
6678d5486J7952K9077K849r711l615j1096J791j2881n454J3037K4929K213L043
$$ -45486 -27534 1543 4392 -5319 -8934 -20030 -18239 -31120 -36574 -23537 1392 3605 6648
6665F648j5031M490o508J956Q758K4587o391j743j5271K568n010m822R4J4454
$$ 6648 -8383 -3893 -10401 -8445 313 24900 18509 16766 1495 4063 -947 -5769 -5675 8779
6651H779K0088O37k5002j6829J0174J7499k2463j7448j1822J9703K6202K8711
$$ 8779 28867 29504 4502 -12327 -2153 15346 -7117 -24565 -36387 -16684 9518 38229
6639C8229p553j4321j5067j0837n325j7343Q714M215j9629j9576N849L072p183
$$ 38229 30676 16355 1288 -9549 -14874 -32217 -23503 -19288 -38917 -58493 -52644 -49572 -56755
6626e6755K2667J1985K3491P777m412r291j1681j3428M40m040j3685J7897Q303
$$ -56755 -34088 -22103 1388 9165 4753 -4538 -16219 -29647 -29207 -33247 -46932 -29035 -20732
6613b0732K746J2420k4521J6462K2429J4269J3889j0788k8888l6320j5595P792
$$ -20732 -17986 -5566 -30087 -13625 8804 23073 36962 26174 -2714 -39034 -54629 -46837
6601d6837m822M674J1450N839J1769J0288J07k768J5558J1545j884r930r499K7589
$$ -46837 -51659 -46985 -35535 -29696 -17927 -7639 -7532 -10300 5258 16803 14919 4989 -4510 23079
6587B3079K8095q814j5886Q099P454j3213o36j7580k8715J3606N840K539j1231
$$ 23079 51174 42360 26474 34573 42027 28814 28178 10598 -18117 -4511 1329 3868 -7363
6574g363p196J9122n988p577J6411J2829k5662l6601j2578J0589K9244R622r674
$$ -7363 -14559 4563 -1425 -9002 7409 20238 -5424 -42025 -54603 -44014 -14770 -5148 -14822
6561a4822q3L742l516o314L73K6317J3652J1801k529J6594j0699k2903j1877j6749
$$ -14822 -14905 -11163 -14679 -20993 -20620 5697 19349 31150 28621 45215 34516 11613 -264 -17013
6547a7013m172j475J3633K868K4577J4480j1104k4005j2572L874q621j0988Q165
$$ -17013 -21185 -22660 -9027 -6159 18418 32898 21794 -2211 -14783 -10909 -19530 -30518 -22353
6534b2353J8007o792j2149l660J581Q210K2647P692L257J336j3452j5812j4155
$$ -22353 -4346 -11138 -23287 -26947 -25366 -17156 5491 13183 16440 17776 4324 -11488 -25643
6521b5643K0878K1201o972O917L438o846l87K414K422J8807n576j7409K3539k4660
$$ -25643 -4765 16436 9464 16381 19819 12973 12586 15000 17422 36229 30653 13244 36783 12123
6507A2123P070J6940j3070k5453m311q406K1951n573K40o987J2344j143j591N134
$$ 12123 19193 36133 23063 -2390 -6701 -15107 6844 1271 1511 -5476 6868 5725 4134 9268
6493I268N612j4118k1791J5519L0874K6701j9380l0600O224N065j6496n650j0715
$$ 9268 14880 762 -21029 -5510 25364 52065 32685 2085 8309 13374 -3122 -8772 -19487
6480a9487K047J0976J792K1170m211j9761p652J8158M681j3321J96j1473K886
$$ -19487 -17440 -6464 -4672 16498 12287 -7474 -15126 3032 7713 -5608 -5412 -16885 -13999
6467a3999Q452j3089q351J8064R446J1298J6902N442j7525K406l124K110j3844
$$ -13999 -5547 -18636 -26987 -8923 523 11821 28723 34165 16640 19046 15922 18032 4188
6454D188k2148J2128o534n553P175R383K690j889l39N03p24J3863m617r883j9570
$$ 4188 -17960 -5832 -12366 -17919 -10744 -1361 1329 -560 -899 -396 -1120 12743 8126 -1757 -21327
6439b1327N423J1919J7568j3311j531m933j227J1255K7897j810l3981l304r105
$$ -21327 -15904 -3985 13583 272 -1259 -6192 -7419 3836 31733 29923 -4058 -7362 -16467
6426a6467n737J6995O437j2931j5303o897R856N926P424K197L746O496P198q366
$$ -16467 -22204 -5209 1228 -11703 -27006 -33903 -24047 -18121 -10697 -8500 -4754 1742 8940 574
6412E74k0005K107J5733N884J0544k5146l1205l763j9322J8877J8709K0973J1707
$$ 574 -19431 -17324 -1591 4293 14837 -10309 -41514 -45277 -64599 -45722 -27013 -6040 5667
6399E667o086J0643J8089q908j3024J947J2956K4688J1437n117J454r946j4089
$$ 5667 -419 10224 28313 19405 6381 8328 21284 45972 57409 52292 53746 43800 29711
6386B9711l2826j1047l83O889K725o916J4268J0004j2222k0515P417Q385K583
$$ 29711 -3115 -14162 -14545 -7656 -4931 -11847 2421 12425 203 -20312 -12895 -4510 -1927
6373a927J2341M590j572m391p246k671O264L363L164k1598j1869J1870n928J4819
$$ -1927 10414 15004 13432 9041 1795 -876 5388 8751 11915 -9683 -21552 -9682 -15610 -791
6359g91R597K977l76l8136O602n520M004K3430M628k891k272N399k1361r949j551
$$ -791 8806 11783 11407 -26729 -20127 -25647 -21643 1787 6415 3524 1252 6651 -14710 -24659 -26210
6344b6210j945j2505r09J2484J5236J5561J2802r058n755Q044j5760j529p13j0933
$$ -26210 -28155 -40660 -41569 -29085 -13849 1712 14514 5456 -299 7745 -8015 -9544 -10257 -21190
6330b1190l858k3398K3550J2644r843K77J3040J8951J0610L57R555j8483l3245
$$ -21190 -25048 -48446 -24896 -12252 -22095 -21818 -8778 10173 20783 21140 30695 12212 -21033
6317b1033o086Q078N091p16l2220r234L418J5794K1024M1046Q356N687k9914j5669
$$ -21033 -27119 -19041 -13950 -14666 -46886 -56120 -52702 -36908 -15884 25162 33518 39205 9291 -6378
6303f378q750p61J320L725K1856J4430n230r957k1599j2866J2380L7816J481j5254
$$ -6378 -15128 -15889 -14569 -10844 11012 25442 20212 10255 -11344 -24210 -11830 25986 27467 12213
6289A2213k1089p814j5393j2012j357L7612L2252k1321j5875J6768K913R317m237
$$ 12213 -8876 -16690 -32083 -44095 -45452 -7840 24412 3091 -12784 3984 6897 16214 11977
6276A1977k8707o572J3375M752J3351J332l820j5461j2841j5532K2631K0921n729
$$ 11977 -16730 -23302 -9927 -5175 8176 9508 5688 -9773 -22614 -38146 -15515 5406 -323
6263c23o336o952M932L056k82q161r908j494N261N745j5496N963K8737J2818K739
$$ -323 -6659 -13611 -8679 -5623 -5905 -14066 -23974 -25468 -20207 -14462 -29958 -23995 4742 17560 20299
6248B0299j8488j6831j272P120q054P25j902J6472J023L223Q195q250m626J4290
$$ 20299 1811 -15020 -16292 -9172 -17226 -16501 -18403 -1931 -908 2315 10510 2260 -2366 11924
6234A1924J4732J1624j0161m273R977k728j7117l0888J112p485J0845N355K551
$$ 11924 26656 38280 28119 23846 33823 31095 13978 -16910 -15798 -23283 -12438 -7083 -4532
6221d532o142j9255j0861K1475K4533j3939m0403Q95Q313K1262M495r72K367P970
$$ -4532 -10674 -29929 -40790 -19315 5218 -8721 -49124 -48229 -39916 -18654 -14159 -15131 -12764 -4794
6207d794L418L852j7053j0446j1978K6370J2738j3695J666j4690k2719j2573K8526
$$ -4794 -1376 2476 -14577 -25023 -37001 -10631 2107 -11588 -9922 -24612 -47331 -59904 -31378
6194c1378K6535L0668n846k9414j3450K9649P581j1705r213j530m670j146p71
$$ -31378 -4843 25825 19979 -9435 -22885 6764 14345 2640 -6573 -8103 -12773 -13919 -14690
$$ [...]
##END NTUPLES=NMR SPECTRUM
##END=
