##TITLE=Analysis number 322678
Compound Code cc 50346
Book Reference 508/6/2
Project Code adrs
Chemist Name antons
##JCAMPDX= 6.0         $$ Bruker NMR JCAMP-DX V2.0
##DATA TYPE= NMR SPECTRUM
##DATA CLASS= NTUPLES
##ORIGIN= Bruker BioSpin GmbH
##OWNER= nmr
$$ XWIN-NMR		Version 3.5
$$ Fri Oct 13 10:36:17 2006 GMT Daylight Time (UT+1h)  MAYBRIDGE\nmr@NMR_250MHZ
##.OBSERVE FREQUENCY= 250.131544655141
##.OBSERVE NUCLEUS= ^1H
##.ACQUISITION MODE= SIMULTANEOUS (DQD)
##.ACQUISITION SCHEME= undefined
##.AVERAGES= 16
##.DIGITISER RES= 18
##SPECTROMETER/DATA SYSTEM= dpx250
##.PULSE SEQUENCE= zg30
##.SOLVENT NAME= CDCl3
##.SHIFT REFERENCE= (INTERNAL, CDCl3, 0, 16.522)
##AUDIT TRAIL= $$ (NUMBER, WHEN, WHO, WHERE, WHAT)
$$ ##TITLE= Audit trail, XWIN-NMR		Version 3.5
$$ ##JCAMPDX= 5.01
$$ ##ORIGIN= Bruker BioSpin GmbH
$$ ##OWNER= nmr
$$ C:\u/data/dgb/nmr/ADRS/180/pdata/1/auditp.txt
$$ ##AUDIT TRAIL=  $$ (NUMBER, WHEN, WHO, WHERE, WHAT)
(   1,<2006-10-13 10:35:54.54 +100>,<MAYBRIDGE\nmr>,<NMR_250MHZ>,
      <created by zg, POWCHK disabled, PULCHK disabled
       configuration hash MD5:
       49 4B E0 1D 92 C2 6B 37 9F E6 65 BC 52 41 86 1D
       data hash MD5: 64K
       03 EF 4A 66 35 59 AF 24 51 9D 08 B4 08 9E AE 2E>)
(   2,<2006-10-13 10:36:08.15 +100>,<MAYBRIDGE\nmr>,<NMR_250MHZ>,
      <Start of raw data processing
       ef LB = 0.3 FT_mod = 6 PKNL = 1 SI = 32K 
       data hash MD5: 32K
       1A 42 81 6F 7A F9 D6 B2 AC F6 8C D3 24 18 ED 87>)
(   3,<2006-10-13 10:36:09.84 +100>,<MAYBRIDGE\nmr>,<NMR_250MHZ>,
      <apk 
       data hash MD5: 32K
       A0 8D AC 93 12 C7 12 9F C2 3A 4E D4 5D DB B4 F4>)
(   4,<2006-10-13 10:36:10.70 +100>,<MAYBRIDGE\nmr>,<NMR_250MHZ>,
      <abs ABSG = 5 
       data hash MD5: 32K
       63 9E CF 8C CE EA 57 86 E0 4B 9D 19 35 DA C3 30>)
$$ ##END=
$$ 
$$ hash MD5
$$ 27 F9 92 14 D8 6F BB 1E 53 DA 0D 2A CF AA D5 C5
##$RELAX= 
##$RELAX= 
##$RELAX= 
##$RELAX= 
##$RELAX= 
##$RELAX= 
##$RELAX= 
$$ Bruker specific parameters
$$ --------------------------
##$DU= <C:\u>
##$EXPNO= 180
##$NAME= <ADRS>
##$PROCNO= 1
##$TYPE= <nmr>
##$USER= <dgb>
##$AMP= (0..31)
100 100 100 100 100 100 100 100 100 100 100 100 100 100 100 100 100 100 
100 100 100 100 100 100 100 100 100 100 100 100 100 100 
##$AQSEQ= 0
##$AQ_mod= 3
##$AUNM= <au_zg>
##$AUTOPOS= <18 >
##$BF1= 250.13
##$BF2= 250.13
##$BF3= 250.13
##$BF4= 250.13
##$BF5= 500.13
##$BF6= 500.13
##$BF7= 500.13
##$BF8= 500.13
##$BYTORDA= 1
##$CFDGTYP= 0
##$CFRGTYP= 5
##$CHEMSTR= <none>
##$CNST= (0..31)
1 1 145 1 1 1 1 1 1 1 1 1 1 1 1 1 1 1 1 1 1 1 1 1 1 1 1 1 1 1 1 1 
##$CPDPRG= <>
##$CPDPRG1= <>
##$CPDPRG2= <>
##$CPDPRG3= <>
##$CPDPRG4= <mlev>
##$CPDPRG5= <mlev>
##$CPDPRG6= <mlev>
##$CPDPRG7= <mlev>
##$CPDPRG8= <mlev>
##$CPDPRGB= <>
##$CPDPRGT= <>
##$D= (0..31)
0 1 0 0 0 0 0 0 0 0.06 0 0 0 0 0 0 0.0002 0 0 0 0 0 0 0 0 0 0 0 0 0 0 
0 
##$DATE= 1160732153
##$DBL= (0..7)
120 120 120 120 120 120 120 120 
##$DBP= (0..7)
150 150 150 150 150 150 150 150 
##$DBP07= 0
##$DBPNAM0= <>
##$DBPNAM1= <>
$$ [...]
##$SUBNAM7= <"">
##$SUBNAM8= <"">
##$SUBNAM9= <"">
##$SW= 20.6930455092707
##$SWIBOX= (0..15)
0 0 3 0 0 0 0 0 0 0 0 0 0 0 0 0 
##$SW_h= 5175.983436853
##$TD= 65536
##$TD0= 1
##$TE= 683.16
##$TE2= 300
##$TE3= 300
##$TEG= 300
##$TL= (0..7)
0 120 120 120 120 120 120 120 
##$TP= (0..7)
150 150 150 150 150 150 150 150 
##$TP07= 0
##$TPNAME0= <>
##$TPNAME1= <>
##$TPNAME2= <>
##$TPNAME3= <>
##$TPNAME4= <>
##$TPNAME5= <>
##$TPNAME6= <>
##$TPNAME7= <>
##$TPOAL= (0..7)
0.5 0.5 0.5 0.5 0.5 0.5 0.5 0.5 
##$TPOFFS= (0..7)
0 0 0 0 0 0 0 0 
##$TUNHIN= 0
##$TUNHOUT= 0
##$TUNXOUT= 0
##$USERA1= <user>
##$USERA2= <user>
##$USERA3= <user>
##$USERA4= <user>
##$USERA5= <user>
##$V9= 5
##$VALIST= <valist>
##$VCLIST= <CCCCCCCCCCCCCCC>
##$VD= 0
##$VDLIST= <DDDDDDDDDDDDDDD>
##$VPLIST= <PPPPPPPPPPPPPPP>
##$VTLIST= <TTTTTTTTTTTTTTT>
##$WBST= 1024
##$WBSW= 4
##$XGAIN= (0..3)
0 0 0 0 
##$XL= 0
##$YL= 0
##$YMAX_a= 394591
##$YMIN_a= -453107
##$ZGOPTNS= <>
##$ZL1= 120
##$ZL2= 120
##$ZL3= 120
##$ZL4= 120
##$ABSF1= 16.522
##$ABSF2= -4.171173
##$ABSG= 5
##$ABSL= 3
##$ALPHA= 0
##$AQORDER= 0
##$ASSFAC= 0
##$ASSFACI= 0
##$ASSFACX= 0
##$ASSWID= 0
##$AUNMP= <proc_1d>
##$AZFE= 0.1
##$AZFW= 0.1
##$BCFW= 0
##$BC_mod= 0
##$BYTORDP= 0
##$COROFFS= 0
##$CY= 12.5
##$DATMOD= 1
##$DC= 0
##$DFILT= <>
##$DTYPP= 0
##$F1P= 14.0000005364418
##$F2P= -0.99999901652339
##$FCOR= 0.5
##$FTSIZE= 32768
##$FT_mod= 6
##$GAMMA= 0
##$GB= 0
##$INTBC= 1
##$INTSCL= 1
##$ISEN= 128
##$LB= 0.3
##$LEV0= 0
##$LPBIN= 0
##$MAXI= 10000
##$MC2= 0
##$MEAN= 0
##$ME_mod= 0
##$MI= 0
##$NCOEF= 0
##$NC_proc= -4
##$NLEV= 6
##$NOISF1= 0
##$NOISF2= 0
##$NSP= 0
##$NTH_PI= 0
##$NZP= 0
##$OFFSET= 16.522
##$PC= 1
##$PHC0= -50.1229
##$PHC1= 5.734566
##$PH_mod= 1
##$PKNL= yes
##$PPARMOD= 0
##$PSCAL= 4
##$PSIGN= 0
##$REVERSE= no
##$SF= 250.13
##$SI= 32768
##$SIGF1= 0
##$SIGF2= 0
##$SINO= 400
##$SIOLD= 32768
##$SREGLST= <1H.CDCl3>
##$SSB= 0
##$STSI= 32768
##$STSR= 0
##$SW_p= 5175.98343685301
##$SYMM= 0
##$S_DEV= 0
##$TDeff= 65536
##$TDoff= 0
##$TI= <Analysis number 999999
Compound Code 99
Book Reference 9
Project Code 9>
##$TILT= no
##$TM1= 0
##$TM2= 0
##$TOPLEV= 0
##$USERP1= <user>
##$USERP2= <user>
##$USERP3= <user>
##$USERP4= <user>
##$USERP5= <user>
##$WDW= 1
##$XDIM= 32768
##$YMAX_p= 313592605
##$YMIN_p= -170771
$$ End of Bruker specific parameters
$$ ---------------------------------
##NTUPLES= NMR SPECTRUM
##VAR_NAME=  FREQUENCY,     SPECTRUM/REAL,   SPECTRUM/IMAG
##SYMBOL=    X,             R,               I
##VAR_TYPE=  INDEPENDENT,   DEPENDENT,       DEPENDENT
##VAR_FORM=  AFFN,          ASDF,            ASDF
##VAR_DIM=   32768,         32768,           32768
##UNITS=     HZ,            ARBITRARY UNITS, ARBITRARY UNITS
##FACTOR=    0.157963299565203, 1,           1
##FIRST=     4132.6476996994, 0,             0
##LAST=      -1043.33573715361, 0,           0
##MIN=       -1043.33573715361, -170771,     0
##MAX=       4132.6476996994, 313592605,     0
$$ Real data points
##PAGE= N=1
##DATA TABLE= (X++(R..R)), XYDATA
$$ [...]
16178a9048J5809k6103l6064M3063J0941o772j6450K2084J1011M376j871l3419
16166c2443J5991K7728N519k486l8212j9359n735J6511m3072k2033L2174J8179
16154d7238K5k4033J2584Q45m046L8325L8777J1572k9731P234K0552K1974k3650
16141B3190o212j8310l7707j1887M660k1124j6888k6169j0620J8083n895j7222
16129a26101M6302L0491q09l874l0294N652N7372L7078o316K0598K0071l1034
16117A9136o627m9906n6002J1865M7244k6961l0986J6715K8098p087M904j2419
16105f2026L8921J3459j2352j3943K415k4090o0820J7171J1229K6082L9649o398
16093c0703m7503j448K5249J1647l344R480j3996j2999l3604N792k404N21N4613
$$ plain form
16178 -19048 -3239 -29342 -65406 -22343 -11402 -18174 -34624 -12540 -1529 2847 976 -32443
16166 -32443 -16452 11276 16795 14309 -23903 -43262 -48997 -32486 -75558 -97591 -65417 -47238
16154 -47238 -47213 -71246 -58662 -57817 -61863 -23538 15239 26811 -2920 4314 24866 46840 23190
16141 23190 16978 -1332 -39039 -50926 -46266 -67390 -84278 -110447 -121067 -102984 -108879 -126101
16129 -126101 -79799 -49308 -50117 -53991 -84285 -78633 -21261 15817 9501 30099 50170 19136
16117 19136 12509 -37397 -93399 -81534 -34290 -61251 -92237 -75522 -47424 -54511 -49607 -62026
16105 -62026 -23105 -9646 -21998 -35941 -33526 -57616 -118436 -101265 -90036 -63954 -24305 -30703
16093 -30703 -78206 -79654 -54405 -42758 -46102 -36622 -50618 -63617 -97221 -91429 -93833 -93312 -38699
16080c8699N3983k8480K990j5514r866P411K62j3965j8828k0629M891J3217J2829
16067e0398J1783l7k2488M5098L0205q839M9512n504m0347j2776M659k6937J386
16054b4683k6937j1648j4572j1358r21O447K1492J5657j2349L607J4310k4601
16042f5556K1040L8494R427O49J7409m5265k6819J1243q764K0192n548n199k630
16029d1327Q582j9177K1849J7o163k9826k606Q747J4442J374l741k7185J2187
16016f2827j9791M760L8733N8488l312o811J0093j7949m9442m2294k1066J3708
16004i7710N003L5815N1397R670l6959n992P833K7117J4329j2851k1427j4206
15992c7981J538J940m4001r666L1486L613r8L490J5877k0225j2063j1497O0139
$$ plain form
16080 -38699 15284 -13196 -10206 -25720 -35586 -28175 -27913 -41878 -60706 -81335 -76444 -63227 -50398
16067 -50398 -38615 -38652 -61140 -16042 14163 5324 54836 49332 8985 -3791 868 -26069 -24683
16054 -24683 -51620 -63268 -77840 -89198 -90119 -83672 -62180 -46523 -58872 -55265 -40955 -65556
16042 -65556 -44516 -6022 3405 4054 21463 -23802 -50621 -39378 -48142 -27950 -33498 -38697 -41327
16029 -41327 -32745 -51922 -30073 -30056 -36219 -66045 -68651 -59904 -45462 -44088 -47829 -75014 -62827
16016 -62827 -82618 -77858 -39125 19363 16051 9240 19333 1384 -48058 -90352 -111418 -97710
16004 -97710 -92707 -56892 -5495 4175 -32784 -38776 -30943 -3826 10503 -2348 -23775 -37981
15992 -37981 -36443 -34503 -78504 -88170 -56684 -53071 -53169 -49679 -33802 -54027 -66090 -77587 -17448
15979a7448M1141l3654k7594k8024L877J2005J0327j7437J9821J5953K4556J0341
15967A3864o840n004N225N273p255k0722j913j3571j9697J570J6110O897j7492
15954d3555k6168L3065K3009m5464J0425L1639k937l0638m9171o770L5159L5422
15942c5984L8542J0458k4511m756j5862l8Q287l5661k4300K2356m5M2655m508
15929b3367J122j3592j6726m0497j4350K3884N2409k3051l1327N263N0967M2521
15917A3256P868j4030k3640k2123N675K7370K8980J7356M866j8952o8151m1543
15905h3068m579J8237N0857K550k2195j5067p549o571k4569K6810K7613J9929
15893a7602K1630K284k8942p217J4194M3248J3253l3445m464j64J721J390k6858
$$ plain form
15979 -17448 23693 -9961 -37555 -65579 -61702 -49697 -39370 -56807 -36986 -21033 3523 13864
15967 13864 7024 2020 7245 12518 5263 -15459 -17372 -30943 -50640 -49070 -32960 -26063 -43555
15954 -43555 -69723 -36658 -13649 -59113 -48688 -17049 -19986 -50624 -99795 -106565 -71406 -35984
15942 -35984 2558 13016 -11495 -16251 -32113 -32151 -23864 -59525 -83825 -61469 -61514 -18859 -23367
15929 -23367 -22245 -35837 -52563 -93060 -107410 -83526 -31117 -54168 -85495 -80232 -29265 13256
15917 13256 21124 7094 -16546 -38669 -32994 -5624 23356 40712 45578 26626 -41525 -83068
15905 -83068 -87647 -69410 -18553 -16003 -38198 -53265 -60814 -67385 -91954 -65144 -37531 -17602
15893 -17602 4028 6312 -22630 -29847 -15653 27595 40848 7403 2939 2775 4496 5886 -20972
15880b0972O908j1816l897k5210p272L9238j9835k9276O519M324M8594M797m040
15867a1938j7913j0855Q873j369j3538K1690L0264k1918Q305M290m638j1203l142
15854b3092Q328j0973j2610J7411r431n1728m8178m093M5064M4901J3457k6162
15842e7106o839M7376L6824j6041l6703n0577k4519J7751J6022K5833P72P962
15830c9245M149o821j1456O510o109J2198J1933k60p958K7169R961O099n080J9573
15816B0663n024J9811j93l4433p352K4349M0421L5638K4350l8047k5021j8296
15804C6866Q92L1497K8361Q02l6834l4863j2229M4897k746l6168l308q710J6095
15791B4552K5272m3803j2342Q243q882q379o718l5251n2962J1140N6449M0979
$$ plain form
15880 -20972 -14064 -25880 -29777 -54987 -62259 -23021 -42856 -72132 -65613 -61289 -12695 -7898 -11938
15867 -11938 -29851 -40706 -31833 -33202 -46740 -25050 5214 -16704 -8399 -4109 -8747 -19950 -23092
15854 -23092 -14764 -25737 -38347 -20936 -30367 -82095 -130273 -134366 -89302 -44401 -30944 -57106
15842 -57106 -63945 -16569 20255 4214 -32489 -83066 -107585 -89834 -73812 -47979 -47207 -39245
15830 -39245 -35096 -41917 -53373 -46863 -52972 -40774 -28841 -29101 -37059 -9890 71 6170 1090 20663
15816 20663 15639 35450 35257 824 -6528 17821 58242 93880 118230 80183 55162 36866
15804 36866 37758 69255 97616 98418 61584 26721 14492 59389 56643 20475 17167 8457 24552
15791 24552 49824 6021 -6321 1922 -6960 -15339 -22057 -57308 -110270 -99130 -42681 -1702
15779a702M749M516J5381L989o161k9813n387q644k7708j3639m107j8703j4993
15766a02222k9013K6872J0275Q382K4977L9274J5058J1641K4578n4495j9533Q175
15754c6031k1956L4836L6912k7190j3573J8611j9402j8501j8970L00m037J2305
15742e6696J6485j8865K8778K0908M931k3544l438j5990l1606k728L3072L4929
15730a3764j3877N083Q993j0513L64n0782j7422L8998K1654J5426k9907j4242
15718e9989q686J6128K4660K8144M7999K7840j8221l5474n2133p537M274j4508
15706d7503J01k2753J1644K438J712k226O366j4874J9372K7741p335j7846M5131
15693A968j7864J5258j5361L585J2772K1656P346J0445j0624k8494M2789J4784
$$ plain form
15779 -1702 3047 7563 22944 26933 20772 -9041 -14428 -23072 -50780 -64419 -68526 -87229 -102222
15766 -102222 -131235 -104363 -94088 -85706 -60729 -21455 -6397 5244 29822 -24673 -44206 -36031
15754 -36031 -57987 -23151 13761 -13429 -27002 -8391 -27793 -46294 -65264 -64964 -69001 -56696
15742 -56696 -40211 -59076 -30298 -9390 -4459 -28003 -31441 -47431 -79037 -81765 -48693 -13764
15730 -13764 -27641 -22558 -13565 -24078 -23714 -74496 -91918 -52920 -31266 -15840 -45747 -59989
15718 -59989 -68675 -52547 -27887 257 48256 76096 57875 22401 -29732 -37269 -32995 -47503
15706 -47503 -47402 -70155 -58511 -56073 -54361 -56587 -50221 -65095 -45723 -17982 -25317 -43163 1968
15693 1968 -15896 -638 -15999 -12414 358 22014 29360 39805 29181 687 43476 58260
15681E8260k5551m7192l8492l920M7834P601k6057k4382l2516K4631M757K4982
15669c0045j3800k2754q595N5721L5684n881N770j0487j7047m0428R864j5473
15657e7471k980K0221k4925Q049M536M4011q709k3890j1894M7548N5766m8468
15645A794n9781k0880L0251L8970j9340k2590M7954K2704N401n1829l9462o245
15633g3053o20O1522N2773P983l6843k8504L539K1701J1399k2642l1897k3140
15621e7782K9777Q831o406O37L3014l4045k3225K3115k137j9951m3803K1196P498
15608f3281K2259j2353q291j755N299p642J2611J8335K2481L0684k5074l1701
15596c8428m856l0064L223m2392j0034M5943J5495P743K2865k5221K6772K3490
$$ plain form
15681 58260 32709 -14483 -52975 -56895 -9061 -1460 -27517 -51899 -84415 -59784 -55027 -30045
15669 -30045 -43845 -66599 -75194 -19473 16211 10330 16100 5613 -11434 -51862 -41998 -57471
15657 -57471 -60451 -40230 -65155 -57106 -52570 -8559 -17268 -41158 -53052 -5504 50262 1794
15645 1794 -57987 -78867 -48616 -9646 -28986 -51576 -3622 19082 24483 -27346 -66808 -73053
15633 -73053 -73673 -12151 40622 48605 11762 -16742 -13203 8498 19897 -2745 -34642 -57782
15621 -57782 -28005 -19174 -25580 -24943 8071 -25974 -49199 -26084 -28221 -48172 -91975 -70779 -63281
15608 -63281 -41022 -53375 -61666 -63421 -58122 -65764 -53153 -34818 -12337 18347 -6727 -38428
15596 -38428 -43284 -73348 -70125 -112517 -122551 -76608 -61113 -53370 -30505 -55726 -28954 -5464
15584e464n803K8669j0077l2908J3469K4653k0199p987q40l0838m115j1903j8093
15571h1436k912J2654R149J5189q338j2569J0191K8133l7958o0230m0143k501
15559a70771N2986M965o417J8561K0170N1479L8360L5446k7527o7751p668M0957
15547a7210J5608k5207Q414j5934n0854J4418K4457J1685r690l9978K4911J6197
15535d3183J8553l522n823o514L001K063J8951k492n0029K2857J2559L6457K1370
15522B4248j3853k0178l0512J3028K0653j376l6494O391M3251P354l435J5923
15510B5000p298k8056k8939N169J1954k6371K7723J5469J0027J8804l2659Q4N616
15497c477k5107J4142m763K2237j7339r256l0076J8707n902k0552J2096M516Q167
$$ plain form
15584 -5464 -11267 17402 7325 -25583 -12114 12539 -7660 -15647 -16487 -47325 -51440 -63343 -81436
15571 -81436 -84348 -71694 -62545 -47356 -55694 -68263 -58072 -29939 -67897 -128127 -168270 -170771
15559 -170771 -117785 -112820 -119237 -100676 -80506 -29027 9333 44779 17252 -50499 -58167 -17210
15547 -17210 -1602 -26809 -18395 -34329 -85183 -70765 -46308 -34623 -44313 -84291 -59380 -43183
15535 -43183 -24630 -28152 -33975 -40489 -37488 -35425 -16474 -18966 -68995 -46138 -33579 2878 24248
15522 24248 10395 -9783 -40295 -27267 -6614 -7990 -44484 -38093 5158 12512 9077 25000
15510 25000 17702 -10354 -39293 -34124 -22170 -48541 -20818 -5349 4678 23482 -9177 -9093 -3477
15497 -3477 -28584 -14442 -19205 3032 -14307 -23563 -53639 -34932 -40834 -61386 -49290 -44774 -36607
15484c6607N490o753J5041K9022L4904K2020j4217m5307k6187k5191M143o762
15472e0404k9339j3397J3477R957j4004J8302k048l9005K1635K7175m470J6204
15460d5917J3386j533K4795m926j1792k0544K6558L7192j2392m4413J3287N4740
15448B8441j6970r388K283j2475J6712m7039n6142J2351Q122j6247q500J8227
15436h0625O8132K9745m2328l9203J7601L0802n140L2463l877k0302M1361K4029
15424E2658J76l8867j0050k0366m5138j0418k6952K3071J0643K4350K6123n882
15412b0652M1001N974k3955J5172r469l4369k0861J7312k2063L947m031j0895
15400f2889K2967O740j0142j0143J7614J1851j0942n632l862n791J2926q038P037
$$ plain form
15484 -36607 -31117 -37870 -22829 6193 41097 63117 48900 3593 -22594 -47785 -43642 -50404
15472 -50404 -79743 -93140 -79663 -69706 -83710 -65408 -67456 -106461 -84826 -57651 -62121 -45917
15460 -45917 -32531 -34064 -9269 -14195 -25987 -46531 -19973 17219 4827 -39586 -26299 28441
15448 28441 11471 2083 4366 -8109 8603 -38436 -94578 -82227 -74105 -90352 -98852 -80625
15436 -80625 -12493 17252 -25076 -64279 -46678 -15876 -21016 11447 7570 -12732 28629 52658
15424 52658 52834 13967 3917 -16449 -61587 -72005 -98957 -75886 -65243 -40893 -14770 -20652
15412 -20652 20349 26323 2368 17540 8071 -26298 -47159 -29847 -51910 -47963 -51994 -62889
15400 -62889 -39922 -33182 -43324 -53467 -35853 -24002 -34944 -40576 -44438 -50229 -37303 -45341 -38304
15387c8304J0469k6355o536k410Q206J651L6979P034K9949j1831M764K3580m8594
15374a1398m4786L221J7532k0451j1108J8974j870j4766j2302l3322q518K558
15362a16236J0016L6553L1284L8783J438k1494j1132q70J7726M2286k0870m1607
15350c4123j4245M184L0656j3082j6036J4538p48k5502k8459K1447K0296j5392
15338e6466O707p034j9097K792J9225k2154L832J9955M038K01k2872K7154J3214
15325c0505o53K207k2025o677L1872m485o764l888J1617O109m6161l1077J1917
15312h8513L4493p947M416K2674j2363j4335O0382L0379n8493l5018K4047L3075
15300g203j6649k6120L676j5538L2394L7355j7556l2008K3057j4789k5811J7290
$$ plain form
15387 -38304 -27835 -54190 -60726 -63136 -54930 -53279 -16300 -9266 20683 8852 13616 37196 -11398
15374 -11398 -56184 -52963 -35431 -55882 -66990 -48016 -49886 -64652 -76954 -110276 -118794 -116236
15362 -116236 -106220 -69667 -38383 400 1838 -19656 -30788 -31658 -13932 28354 7484 -34123
15350 -34123 -48368 -44184 -13528 -26610 -42646 -28108 -28856 -54358 -82817 -61370 -41074 -56466
15338 -56466 -49759 -56793 -75890 -73098 -53873 -76027 -72195 -52240 -48202 -48001 -70873 -43719 -30505
15325 -30505 -31158 -28951 -50976 -57653 -25781 -30266 -37030 -40918 -29301 -23192 -69353 -100430 -88513
15312 -88513 -54020 -61967 -57551 -34877 -47240 -61575 -1193 29186 -29307 -64325 -40278 -7203
15300 -7203 -23852 -49972 -46296 -61834 -29440 7915 -9641 -41649 -18592 -33381 -59192 -41902
15288d1902J1373K06J1302L3235p151J8015m0890m3128m307L5269M5000R602l0712
15275d088j2282K2096n945j048K3726k3227o921j5946R091j7910k9412Q285K8447
15262b5134j3346j2637O01O450K4744k8602o048K0862m391q781K9768K539Q492
15249e483p021q675K501J3511q796j0184p168l2797o344M5301J3078j9516m979
15236c6572J444j7103J127K5515L9466p014p078j5860J0856p296n7819j2962j3189
15223i6485O738L4703L1826L232l168J8114k5829j9048j6947J3219p535K7882
15211c3298J3194j0343j2854j3046J2898L2072k7882m782N1281L9155p542j024
15199C7829j0151l833k0807P871l7094l2093K6439K3532m550k3185J0310M1727
$$ plain form
15288 -41902 -30529 -30323 -19021 14214 7063 25078 -15812 -58940 -63247 -27978 17022 26624 -4088
15275 -4088 -16370 5726 -219 -1267 22459 -768 -7689 -23635 -14544 -32454 -61866 -53581 -25134
15262 -25134 -38480 -51117 -50516 -44066 -19322 -47924 -53972 -33110 -37501 -46282 -16514 -13975 -5483
15249 -5483 -12504 -21179 -18678 -5167 -13963 -24147 -31315 -64112 -70456 -25155 -12077 -31593 -36572
15236 -36572 -35128 -52231 -51104 -25589 13877 6863 -215 -16075 -5219 -12515 -70334 -83296 -96485
15223 -96485 -89747 -55044 -23218 -19986 -23154 -5040 -30869 -49917 -66864 -53645 -61180 -33298
15211 -33298 -20104 -30447 -43301 -56347 -43449 -11377 -39259 -44041 7240 46395 38853 37829
15199 37829 27678 23845 3038 10909 -26185 -58278 -31839 -8307 -12857 -36042 -25732 15995
15187A5995J4863l1918l5993k9514Q786K0623J1682j7475J8540p078o551K0973
15175a7067k490k0126j6380J4819k9925Q010J486K503N3044K0644O352q702j9067
15162f899p719l0551m022L5361J6527k6950j8174J028K7102K118k5467J2203J7688
15149g755j113K9065n204j9222j9373m5631j2571Q000M783J8402J6637l258L2020
15136e220k2282k9673j0021l5452p111J6910Q2668N7799j3174k2300k608k5780
15124a6244m189J7882K0249J5130m5103k0613l4233k3862k005J1549J1412K1445
15112d8582K3383O550j5050k3901J1351L5895o325q326j255k2591K6639R780k2511
15099c4943J2033j9053j7172j8469K6433l229O080J8720j5475J6636P039j5843
$$ plain form
15187 15995 30858 -1060 -37053 -66567 -57781 -37158 -25476 -42951 -24411 -31489 -38040 -17067
15175 -17067 -19557 -39683 -56063 -41244 -71169 -63159 -61673 -59170 -6126 14518 20870 12168 -6899
15162 -6899 -14618 -45169 -49191 -13830 2697 -24253 -42427 -41399 -14297 -12179 -37646 -25443 -7755
15149 -7755 -8868 20197 14993 -4229 -23602 -69233 -81804 -73804 -69021 -50619 -33982 -37240 -5220
15136 -5220 -27502 -57175 -67196 -102648 -109759 -92849 -10181 47618 34444 12144 9536 -16244
15124 -16244 -20433 -2551 17698 32828 -12275 -32888 -67121 -90983 -92988 -81439 -70027 -48582
15112 -48582 -25199 -18649 -33699 -57600 -46249 -10354 -16679 -25005 -26260 -48851 -22212 -12432 -34943
15099 -34943 -22910 -41963 -59135 -77604 -51171 -54400 -48320 -29600 -45075 -28439 -21400 -37243
15087c7243m461L123L1957M6117l907m8742q263l518k871m554m176k4879O419
15074e4998Q472M039J2119k8044k1606L3785P259l363o350K866J2025J8792k053
15061a7057m0107L036J9335j3619k2138j6663J1463K8874j0196K8220K6223k0433
15049b3062R027J6904k929j7742k8715m834j1046K9529J9626Q493J0915K3761
15037B9927P32q775k1484j4874k6409J6062K5612k221p759L2099K4622j3568j9218
15024A4746p688k9881j7087P026k1029l2988l52K4207L0329l0j5040P219M4652
15011D084j582j4209p496J0576M162k8366j9251N990J0795j0179P52J9064k8340
14998e4000j4215K8405L1340j6886k0975k5223K7058K51j1498n555k531m71J0182
$$ plain form
15087 -37243 -41704 -38581 -6624 39493 35586 -13156 -21419 -24937 -27808 -32362 -36538 -61417 -54998
15074 -54998 -46526 -42487 -30368 -58412 -80018 -46233 -38974 -42337 -48687 -45821 -33796 -15004 -17057
15061 -17057 -57164 -54128 -34793 -48412 -70550 -87213 -75750 -46876 -57072 -28852 -2629 -23062
15049 -23062 -14035 2869 -60 -17802 -46517 -51351 -62397 -32868 -13242 -4749 6166 29927
15037 29927 30659 21884 400 -14474 -40883 -24821 791 -1430 -9189 22910 47532 33964 14746
15024 14746 7058 -22823 -39910 -32884 -53913 -86901 -87253 -63046 -32717 -32747 -47787 -40568 4084
15011 4084 2502 -11707 -19203 -8627 -4465 -32831 -52082 -46092 -35297 -45476 -44724 -25660 -54000
14998 -54000 -68215 -39810 -8470 -25356 -46331 -71554 -44496 -44245 -55743 -61298 -63829 -64300 -54118
14985e4118j123J0416m105l38j2809k7833K2405O7696r610k431j7672Q817J3354
14972g351K1105N4124q437j2549q804k541j3741l6380k9937l075K3105n376J3146
14959a6711p886k640P371J1892L861m9183l0309L4309J3054P437J4251J2573l9676
14946d1657k6138q775M912P766O23R848J6870j5407N31R391K018L3238o18l456
14932a0854P360r523n1565k296L7939j60k1334K858j473M959L7254q596j8174
14919c3605j3999j2665j4537K0530J7326k883j1431P023J3727J5777J0462k424
14907f699k4523m2588J5144J6532K598K0169K4835k3695r495j8356N612J2919
14895b7547j8721l383P152J8934o087k7634n610k2762k179J9608L0675L6536J0624
$$ plain form
14985 -54118 -55241 -44825 -48930 -49268 -62077 -89910 -67505 191 -9419 -11850 -29522 -20705 -7351
14972 -7351 13754 67878 59441 46892 38088 35547 21806 -14574 -44511 -47586 -24481 -29857 -16711
14959 -16711 -24597 -27237 -19866 -7974 -4113 -53296 -83605 -49296 -36242 -28805 -14554 -1981 -41657
14946 -41657 -67795 -76570 -71658 -63892 -63269 -53421 -36551 -51958 -51427 -42036 -40018 -6780 -7398 -10854
14932 -10854 -3494 -13017 -64582 -66878 -28939 -29099 -50433 -47575 -49048 -44089 -6835 -15431 -33605
14919 -33605 -47604 -60269 -74806 -54276 -36950 -39833 -51264 -44241 -30514 -14737 -4275 -6699
14907 -6699 -31222 -73810 -58666 -42134 -39536 -19367 5468 -18227 -27722 -46078 -40466 -27547
14895 -27547 -46268 -49651 -42499 -23565 -29652 -57286 -62896 -85658 -87837 -68229 -37554 -1018 9606
14882I606m7670j6743N610Q552n8471K080M1068l365j1688k877J3481M2307L8495
14869B0385N058m3851Q008J7077k165J0057m338L3570K3550k8404J304J2319k6960
14856B5610j0787M442n271r188j9131j574Q650l1324j7787K3907K1127K988q6
14843h424j4041Q379j3181k606K0754J1552j1169J6156O098m0526l1401k182o975
14830f7566K7763J5863p231L02k656J5309k6420K4137M1533m623j3983l7721k3683
14817e8976J0176L7180L1400J5425M547k3254k2506j4286j5962R730l5186J7131
14805d4581K6135J0796r892K7537l89j3779J3502j0552o186O001p9J728l4402
14792c4161Q186J8057K1466J1591r142k4167J2479j6861j6761m3910q719m729
$$ plain form
14882 9606 -38064 -54807 -49197 -40645 -99116 -97036 -55968 -59333 -71021 -73898 -60417 -18110 20385
14869 20385 25443 -18408 -10400 6677 4512 14569 10231 43801 67351 38947 40251 52570 25610
14856 25610 14823 19265 13994 4806 -14325 -15899 -7249 -38573 -56360 -32453 -11326 -8338 -8424
14843 -8424 -22465 -14086 -27267 -29873 -9119 2433 -8736 7420 13518 -27008 -58409 -60591 -67566
14830 -67566 -39803 -23940 -31171 -30869 -33525 -18216 -44636 -20499 21034 16411 2428 -35293 -58976
14817 -58976 -48800 -11620 19780 35205 39752 16498 -6008 -20294 -36256 -26526 -61712 -44581
14805 -44581 -18446 -7650 -17542 9995 9606 -4173 9329 -1223 -7409 -1408 -1487 241 -34161
14792 -34161 -25975 -7918 13548 25139 15997 -8170 4309 -12552 -29313 -73223 -81942 -86671
14780h6671J9133K4398O42j2385L5236P249J9138K5821l9268k9755l2970J1032
14768e8400K1641J5439J9948K384k509l926O737j964r096K8005J9070J0774p887
14755D0216M594L3655k8497m6393j7178q557k2278J7556M0015l0489O235J3791
14743B670J7507M538k7280o30j9099k5857m037J5545J5797J8419K0641K3200K0648
14730F2062q842j8977l7161M429K5894q370k0083L5383j076k5529j3546j0209
14718a6025m3047O252j058K0759L8180l4964J0774l19q995L021L1354L6243J6993
14705E9168j703k7833l0341k1930L459m896k658K9658J0412N022K026O636k5711
14692A309l3712M289L1067R75j4173J2913k1527j0258K5544M292n328k2006K6
$$ plain form
14780 -86671 -67538 -43140 -42498 -54883 -19647 -12398 6740 32561 -6707 -36462 -69432 -58400
14768 -58400 -36759 -21320 -1372 1012 -1497 -5423 1314 -650 -9746 18259 37329 48103 40216
14755 40216 44810 78465 49968 3575 -13603 -22160 -44438 -26882 13133 -17356 -11121 2670
14743 2670 20177 24715 -2565 -3195 -22294 -48151 -52188 -36643 -20846 -2427 18214 41414 62062
14730 62062 53220 34243 -2918 1511 27405 19035 -1048 34335 33259 7730 -5816 -16025
14718 -16025 -59072 -52820 -53878 -33119 5061 -29903 -19129 -19448 -28443 -25422 5932 42175 59168
14705 59168 57465 29632 -709 -22639 -19180 -24076 -26734 2924 13336 18358 20384 27020 1309
14692 1309 -32403 -28114 2953 3928 -10245 2668 -18859 -29117 -3573 719 -4609 -26615 -26589
14679b6589K3373J3373M2860n165l2685n7916q390j301J4876M3188j0604R375
14667D395l2968m196k4024k5945N829M1833K4736L408j0922L327k8224j9277j0356
14654g2384j5012J8690K538M168J178L2430P06k4701K2276J8589j2899q847L3927
14641F59K6482L204j4635l0454l3506N581K7292l3802j9778l2487J4230L2203
14629e5011M0586O0268k0909o0580r335j1312K2619J0677j0882j2025O290k744
14617d2358j6077J0098J9960M4954j0880k4392k8141J940J6990j2581O36M5M5717
14604E911J7153j0661j4961k7125m4357O359J0602M6699J595j6775K4290o279
14592g549k0276J850o641l9673m435K7023N631n861J0748m670k2539J0620K2989
$$ plain form
14679 -26589 -3216 10157 53017 47852 15167 -42749 -51139 -52440 -37564 5624 -4980 4395
14667 4395 -28573 -32769 -56793 -82738 -76909 -35076 -10340 -6932 -17854 -14527 -42751 -62028 -72384
14654 -72384 -87396 -68706 -66168 -62000 -60822 -28392 -27686 -52387 -30111 -11522 -24421 -33268 659
14641 659 27141 30345 15710 -14744 -48250 -42669 -15377 -49179 -68957 -101444 -87214 -55011
14629 -55011 -14425 45843 24934 -35646 -44981 -56293 -33674 -22997 -33879 -45904 -39614 -42358
14617 -42358 -58435 -48337 -28377 16577 5697 -18695 -46836 -44896 -27906 -40487 -39851 -39806 5911
14604 5911 23064 12403 -2558 -29683 -74040 -67681 -57079 -10380 -8785 -25560 -1270 -7549
14592 -7549 -27825 -25975 -32616 -72289 -76724 -49701 -44070 -49931 -39183 -43853 -66392 -55772 -32783
14579c2783l23J9625N2452P583k4163n522k9197M31K2529O912r634n566r431l157
14565a0244j7109Q963M217K9022l380L893j4801l127j382l1754K0620M8896j4080
14552A9734m0675n9666j5170L4378K0910J1649k0709l1399M4652J9780J6138p649
14540h027k4180Q990L4634k6652k8798K660M989L9811N0928J1864l3528l0358
14528B333j816J7143k900o483k9702o14J3888n785p036k0623l3211R15J2815J2932
14514d8144J0274j4967j6186k8787p921L0881M1454M5980k1205l3913j7832j2635
14502g3001l21J2772J2560K2055j0052l5769K6041L0263j1116K2336j3507l7562
14490e5301j906N986J5027j9565k0363K1503K973M4906L3784P814q814m1506l1405
$$ plain form
14579 -32783 -33106 -13481 38971 46554 22391 16869 -12328 -11897 10632 17544 7910 2344 -7087 -10244
14565 -10244 -27353 -18390 -14173 14849 11469 15362 561 -2566 -3948 -35702 -15082 33814 19734
14552 19734 -20941 -80607 -95777 -61399 -40489 -28840 -49549 -80948 -36296 -16516 -378 -8027
14540 -8027 -32207 -23217 11417 -15235 -44033 -41373 -36384 3427 54355 66219 32691 2333
14528 2333 517 17660 14760 8277 -21425 -22039 -8151 -13936 -20972 -41595 -74806 -73891 -61076 -48144
14514 -48144 -37870 -52837 -69023 -97810 -105731 -74850 -33396 12584 -8621 -42534 -60366 -73001
14502 -73001 -73322 -60550 -47990 -25935 -35987 -71756 -45715 -15452 -26568 -4232 -17739 -55301
14490 -55301 -57207 -51221 -36194 -55759 -76122 -54619 -51646 -6740 27044 34858 26044 -15462 -46867
14477d6867j3474K1779J6234J804J6565l5220k4128J2796K265R372L2362J5123
14465H611j6722k0773o027j1312p846P217L031M644j3096q116K4756M4256k4949
14452a6326L0745J2100l3796l6381J4194O198j9783J1288l176k568K3637K1659
14440G791M337k3562J131q653l5713j3519M1186K0125j5698R580k2502p738o844
14427e0079j5642J1250P030J0979Q50m99J4497K6823l2928r668J9511R721m375
14414a2530r48k4622K1926J213L438O743k3655j2746J9801M4163L0239k2957m513
14401B5552k0986k3438n4419p379J7394L955k155L4714N5962Q672p346O098j9455
14388A7169J3202J5225k7163k364k9039j6038k569j0844j2475k7576n03M2738
$$ plain form
14477 -46867 -60341 -38562 -22328 -20524 -3959 -39179 -63307 -50511 -48246 -38874 -6512 8611
14465 8611 -8111 -28884 -34911 -46223 -54069 -46852 -43821 -39177 -52273 -60389 -35633 8623 -16326
14452 -16326 14419 26519 -7277 -43658 -29464 -23266 -43049 -31761 -34937 -37505 -13868 7791
14440 7791 12128 -11434 -10303 -18956 -54669 -68188 -27002 -6877 -22575 -12995 -35497 -43235 -50079
14427 -50079 -65721 -54471 -47441 -36462 -35612 -36111 -21614 5209 -27719 -37387 -17876 -8155 -12530
14414 -12530 -13478 -38100 -16174 -14961 -11523 -4780 -28435 -41181 -21380 22783 53022 30065 25552
14401 25552 4566 -18872 -73291 -80670 -63276 -59321 -61476 -26762 29200 37872 30526 36624 17169
14388 17169 30371 45596 18433 16069 -12970 -29008 -31577 -42421 -54896 -82472 -82975 -40237
14376d0237K2978K2066J5591J3405j5006n0816l464k0855K792j2554O7283j3921
14364a2738j6108J654o585K705J3666L205j507j4474p155J6299N2375J1350j2440
14351C0247j4075k8608l046j6354L439K1590j977K518J2385l6588j9583Q488R072
14338c2492L0836J1632j4532k1247n464N500L3518j1409j3561N465j1970k8280
14326e2004J7221O00M620o751L3087r793L996J6301L6244K4158k187l7023l925
14313B4544J9937Q653j3928l7629m276K3125j4558J7146J8736M074l2380n2967
14301c9523k6237r451k873M6079K1770K1080K8444j1273k7080o943r862K0767
14289D898j6809k2184k2600J137j6697L035J0304J2934P768J1216K4924j0875
$$ plain form
14376 -40237 -17259 4807 20398 33803 18797 -32019 -35483 -56338 -53546 -66100 1183 -12738
14364 -12738 -28846 -27192 -33777 -31072 -17406 -14201 -15708 -30182 -37337 -21038 31337 42687 30247
14351 30247 16172 -12436 -15482 -31836 -28397 -6807 -8784 -6266 6119 -30469 -50052 -41564 -32492
14338 -32492 -1656 9976 -4556 -25803 -31267 -25767 7751 -3658 -17219 -11754 -23724 -52004
14326 -52004 -34783 -34183 -29563 -36314 -3227 -13020 -9024 7277 43521 67679 65492 28469 24544
14313 24544 44481 53134 39206 1577 -2699 20426 5868 23014 41750 45824 13444 -39523
14301 -39523 -65760 -75211 -78084 -32005 -10235 10845 39289 28016 936 -6007 -15869 4898
14289 4898 -11911 -34095 -56695 -55558 -72255 -69220 -58916 -45982 -38214 -26998 -2074 -12949
14277a2949k1327J2017P80J9019L5930J719n9329j1322m82J3610j8200k9753L7276
14264c3011J7265L5510P940k6288j6987L4596j3134j696J3941j3582j720L0J6512
14251A9376k257J1538n5126j3829p976N541J2246J559k0p369L1909J355K1174
14238A8121J2373L5330k6547j7095K4334K838j5329k4145L425J8781k7305j3789
14226i008P207j053J0564J544k0289l4451k3124Q264K6864L8810L345J8401R261
14213C6335k6166l646O555m248k6557j848k8260J4370J9653Q11L3508J2685J722
14200C4914k0247Q628K2227k3105K7911k2687n7636m380J9471p840k8365k8006
14188g9115P923J4132Q565K6878L9898K1286k1884k6463k027n193l0899k0208
$$ plain form
14277 -12949 -34276 -22259 -21479 -2460 33470 35189 -24140 -35462 -35944 -22334 -40534 -70287 -33011
14264 -33011 -15746 19764 27704 1416 -15571 19025 5891 4195 18136 4554 2834 2864 19376
14251 19376 17119 28657 -26469 -40298 -48274 -42733 -30487 -28928 -28948 -36317 -4408 -3053 18121
14238 18121 30494 65824 39277 22182 46516 49354 34025 9880 13305 32086 4781 -9008
14226 -9008 -1801 -2854 7710 9254 -11035 -45486 -68610 -60346 -33482 5328 8673 27074 36335
14213 36335 10169 6523 13078 8830 -17727 -19575 -47835 -33465 -13812 -13001 20507 33192 34914
14200 34914 14667 23295 45522 22417 50328 27641 -29995 -34375 -14904 -22744 -51109 -79115
14188 -79115 -71192 -57060 -48495 -21617 18281 39567 17683 -8780 -10807 -16000 -46899 -67107
14176f7107M1911L8089J3963l293m2735k2588k1937K1050M3333K722l8070q527
14164d3189J1736P139k856j3600j888R104q784J1673L0994L6177K5371k98L895
14151F5474k7800o699j658j1583j0443R69j4264l0831r877J744K3397K4739M719
14138G887j8482j7459L528n951m8906k8202K8556N1537L7324P105O272K5240k7191
14125B1258k5112K6795K593k6745l5236j3664K4355K6469r188K149P427L0875
14113C1976k2787l8495JO354k6325K6230K9951K7719j8930n61K4161m395o049
14100B8850l3551r87k0730m0101k9815K2120k940L0554L9601m380J2475q034j2043
14087a8981n51l0222O049K9684K9730R767N1362J895l4834m4938j7451l355J4751
$$ plain form
14176 -67107 -25196 12893 26856 23563 -19172 -41760 -63697 -42647 686 3408 -34662 -43189
14164 -43189 -31453 -24314 -27170 -40770 -42658 -33554 -42338 -30665 329 36506 61877 61579 65474
14151 65474 37674 30975 29317 17734 7291 8260 -6004 -36835 -46712 -44968 -21571 3168 7887
14138 7887 -10595 -28054 -24526 -30477 -79383 -107585 -79029 -27492 9832 16937 23209 48449 21258
14125 21258 -3854 22941 25534 -1211 -36447 -50111 -25756 713 -8475 -6326 1101 31976
14113 31976 9189 -29306 -29305 -22951 -49276 -23046 6905 34624 15694 15133 39294 34899 28850
14100 28850 -4701 -5688 -26418 -66519 -96334 -74214 -77154 -46600 -6999 -11379 1096 -6938 -18981
14087 -18981 -19532 -49754 -43705 -14021 15709 25476 76838 78733 43899 -1039 -18490 -21845 -7094
14074g094K1733J85j653L5928Q341l4166o353R521j5912m3927J2026M4561J247
14061B4437Q086l1196n621O326m621J0086j3142J9281P831j3331r293k5098K28
14048b6027J3945l1918P592K9394k1820j7906j3298k5793R080K0468L1458l613
14036b8438L281J3472Q356r10k4475J2358J1051J7106l8648l0336P534K5588N5220
14023C1159L3022M026l2444k1162J459L9156k1451l6081l757q223Q639l4785j5631
14010e6073j2638K0614k2098l973N2996M1928J7110o596j6225j6233K5333L8601
13998F2746j8319j8946J653k141m2747k941j3762q834J0203J4628K3760J1971
13986A7271j1204m225J2150L7191O19m1773k5022o462m794j549K3925k685j6100
$$ plain form
14074 -7094 14639 14824 13171 49099 57440 23274 16921 26442 10530 -33397 -21371 23190 24437
14061 24437 32523 1327 -4294 2032 -2589 7497 -5645 13636 21467 8136 -1157 -26255 -26027
14048 -26027 -12082 -44000 -36408 -7014 -28834 -46740 -60038 -85831 -76751 -56283 -24825 -28438
14036 -28438 -25157 -11685 -3329 -4239 -28714 -16356 -5305 11801 -26847 -57183 -49649 -24061 31159
14023 31159 64181 68207 35763 14601 16060 55216 33765 -2316 -6073 -14296 -5657 -40442 -56073
14010 -56073 -68711 -48097 -70195 -74168 -21172 20756 37866 31270 15045 -1188 24145 62746
13998 62746 44427 25481 27134 24993 -17754 -20695 -34457 -43291 -33088 -18460 5300 17271
13986 17271 6067 1842 13992 51183 51802 10029 -14993 -21455 -26249 -27798 -3873 -6558 -22658
13973b2658j4552j6838K5324L9687L4595k1995j5718Q791P955j1128m3808r367
13961c9712J4099J6942P928k5571j757O257K6482k5811p335K5541l1388j1443
13949d5768K3140o183j618j150m0499l069K2280O2434J3861m7512m4352J2609
13937e5827J4723J731o608J4399k6502l1350K9527L4325J5413J0504k8984J4348
13925a4301J0904L1639k0732m2259k2458N2419k7105L8388J1809L803J4757k9217
13913G647K004j8876J3471M7265n023j021K726j4526n0635j9618R178j2523j3885
13900e3816L0857L3395N295j6651j7170L075L2112M3368P252m1044m1044m3752
13888e8123k844l4472O64J9794K3340J1751L6253Q995p858l3180O278J5190K480
$$ plain form
13973 -22658 -37210 -54048 -28724 10963 45558 23563 7845 16636 24591 13463 -30345 -39712
13961 -39712 -25613 -8671 -743 -26314 -28071 -21814 4668 -21143 -28478 -2937 -34325 -45768
13949 -45768 -22628 -28811 -30429 -31579 -72078 -75147 -52867 9567 23428 -24084 -68436 -55827
13937 -55827 -41104 -39373 -45981 -31582 -58084 -89434 -59907 -25582 -10169 335 -28649 -14301
13925 -14301 -3397 28242 7510 -34749 -57207 -4788 -31893 6495 18304 22107 36864 7647
13913 7647 9651 -9225 4246 51511 46488 45467 48193 33667 -16968 -36586 -27408 -39931 -53816
13900 -53816 -22959 10436 15731 -920 -18090 -15015 17097 60465 67717 26673 -14371 -58123
13888 -58123 -60967 -95439 -94775 -74981 -51641 -39890 -3637 5358 -2500 -35680 -29402 -14212 -11732
13875a1732l1500P844K1077K8360l0888k9463k4759K3430N1562J1134O010k8228
13863g153m140j4535k316N979m306r360J4998L1045J8407k0346R156r373J604
13850I660K3486j6798l4250N822j3515j5885m531K379j4368k8839m509N8242M2780
13837I674j9240k6777K7444Q327k4893J1221K7051N339j6266l4421K771Q790J0781
13824a0199j8712k0647J6842L7235P268n153K7668K715l5957j1927m453k0093
13812c5413j08j5488M3645K0258j5864k4587R05k9532L134J0089P320N848L4506
13799D713L866O147J6362Q343k4902n183M007J233p908k4617j2509j621K5314
13786f755L3037r873q787j2637k7450L4557K7962N601J0886k3236k3623P625l0071
$$ plain form
13875 -11732 -43232 -35388 -14311 14049 -16839 -46302 -71061 -47631 3931 15065 21075 -7153
13863 -7153 -11293 -25828 -28144 -22165 -26471 -35831 -20833 10212 28619 8273 17429 8056 9660
13850 9660 33146 16348 -17902 -12080 -25595 -41480 -46011 -43632 -58000 -86839 -91348 -33106 9674
13837 9674 -9566 -36343 -8899 -572 -25465 -14244 12807 18146 1880 -32541 -29770 -20980 -10199
13824 -10199 -28911 -49558 -32716 4519 11787 6634 34302 37017 1060 -10867 -15320 -35413
13812 -35413 -35521 -51009 -7364 12894 -2970 -27557 -26652 -56184 -53050 -42961 -35641 -29793 4713
13799 4713 8579 14726 31088 39431 14529 9346 13353 14586 6678 -17939 -30448 -32069 -6755
13786 -6755 26282 16409 7622 -5015 -32465 2092 30054 35655 46541 23305 -318 7307 -22764
13773b2764m5660P963o023K1931K2013r761j3678P812Q448L3036m645m2520J7215
13760b6633j928L40M7872p389k1535J0421K5999L329J4336L001l8112O3K2946
13747C2710K9887k7304M621k5355J9069p162n0386N417K4953o222l0791j4227
13735d4790n553J5404O476J7018l3724k6277J2790L3416K5128K6058M954j6343
13723A4557k8052J2616J6268k2361j6159L2394O410j4212M646j98N82q314Q180
13710F357j1836k6290l3369k8254L7935J5409J3812J472j7316K3430M9091L1435
13698F1876J4283J238J1098m0461j6091j9114L2K591n721p625k3804j0703L5133
13685B732J3883l3531L5939K6628k6280m7542l977L2633K165k815K2670j0919
$$ plain form
13773 -22764 -68424 -60461 -66484 -44553 -22540 -32301 -45979 -38167 -29719 3317 -1328 -43848 -26633
13760 -26633 -28561 -28221 19651 12262 -9273 1148 27147 30476 44812 47813 9701 9764 32710
13747 32710 62597 35293 39914 14559 33628 26466 -23920 -18503 6450 228 -30563 -44790
13735 -44790 -50343 -34939 -28463 -11445 -45169 -71446 -58656 -25240 -112 25946 30900 14557
13723 14557 -13495 -879 15389 -6972 -23131 9263 15673 1461 6107 5909 6491 -1823 6357
13710 6357 -5479 -31769 -65138 -93392 -55457 -40048 -26236 -24764 -42080 -18650 30441 61876
13698 61876 76159 77397 88495 48034 31943 12829 12861 15452 9731 2106 -21698 -32401 2732
13685 2732 16615 -16916 19023 45651 19371 -28171 -32148 485 2650 -165 22505 11586
13673A1586J9981J3939k0547m1912K33p456m2411J6362L701N058L271K0085J2926
13660e184L1616n880j7240M0016L5122l5596n4797J455j2874J4273J4225k7055
13648b1919r201k1798K4200J0318P228k7005N296K9831L1614j6675o876J0865
13636A5878m4331k391k847p782M0926J5817L062J3230m944q311P935k61M04j679
13622B4706j5657k4143L354r531K2684J7554J7049j5090l1484q059J1670K3260
13610A6313J7944j6332j0236J21j7241l2732M630L112K808J6786l539j979M2415
13597B2070O91J2092Q722m7090J0365J2700J6797O655j6897J8498P857j9777m8045
13584a5362K6993l6541l7752K2O8905K3710J8024j1846k4034j6432l3687K9433
$$ plain form
13673 11586 31567 45506 24959 -16953 -16720 -24176 -66587 -50225 -46524 -41466 -38195 -18110 -5184
13660 -5184 26432 20552 3312 43328 78450 42854 -11943 -10488 -23362 -9089 5136 -21919
13648 -21919 -31120 -52918 -28718 -18400 -11172 -38177 -32881 -3050 28564 11889 5013 15878
13636 15878 -28453 -30844 -33691 -41473 -547 15270 18332 31562 26618 18307 26242 25981 26385 24706
13622 24706 9049 -15094 -11740 -21271 1413 18967 36016 20926 -10558 -18617 -6947 16313
13610 16313 34257 17925 7689 7810 -9431 -42163 -37533 -34421 -31613 -14827 -18366 -20345 22070
13597 22070 22761 34853 43575 -3515 6850 19550 36347 43002 26105 44603 52460 32683 -15362
13584 -15362 11631 -24910 -62662 -62640 6265 29975 47999 36153 12119 -4313 -38000 -8567
13572h567J1756l5267l672M7367J0908r18J7787j7774L577k7953L5479L2198j4697
13559E0224n0765l4312o158M7656J7479K4387J9974j3561k7637n7709l6783K6334
13547d0871L8307L0639K0425N405k5546m7628k0751N3659J9677j6317j8382m673
13535f056k910k0107j0887j984Q876J6180M7604j6157l3284K0042n1617j9669
13523f9969N0667L06K5633J8070r029n2861k6826K801K1773M6167K8302l3201
13511A833o0842K6803M8477k0757O074q882o431j9206K3961k0876P736O0625M5707
13498H4222j9352j7591j9394l1335K2046j1843n607N8218L0639j8839q230k7998
13486C4936l0904j0000k4163N330J9657l891k800k637K6507m2798o583j804K6759
$$ plain form
13572 -8567 3189 -32078 -35750 11617 22525 21607 39394 21620 25197 -2756 32723 64921 50224
13559 50224 -541 -34853 -41011 6645 24124 48511 68485 54924 27287 -30422 -67205 -40871
13547 -40871 -2564 28075 48500 53905 28359 -19269 -40020 13639 33316 16999 -1383 -6056
13535 -6056 -8966 -29073 -39960 -41944 -33068 -16888 30716 14559 -18725 1317 -50300 -69969
13523 -69969 -19302 -18996 6637 24707 15678 -37183 -64009 -61208 -39435 6732 35034 1833
13511 1833 -59009 -32206 16271 -4486 1588 -7294 -13725 -32931 -8970 -29846 -22110 38515 84222
13498 84222 64870 47279 27885 -3450 18596 6753 1146 59364 90003 71164 62934 34936
13486 34936 4032 -5968 -30131 -24801 -5144 -9035 -11835 -14472 12035 -30763 -37346 -39150 -12391
13473a2391J66O8131j8787l5180k8142J4803L318Q556k0675J92K2331j418k0382
13460a9478J1815R389L375M6837L6621J1374l8302p2270m2372J8442J5819k5430
13448d4180k0380K6886j4894J7477M9218r423j3126L8175J7830m060j572l9382
13436B569m638J2340J5334j4160m160k596P442M1777K9529k6203m8133O341K1810
13423C7252m3061k5928R455K8284j3690j0930l850J121L031k5910o797K4288j9696
13410d6431K2412M4313L1620P083l9070m8848O820J1911J8211J6360O417L0180
13398F0978P774j2545m3734k8958j5796k9243M8401J7419K8411k7157k7198m6987
13386f8635l277M0129N8335k442j4938J0946j6003k7391N79J4425M8991M1600
$$ plain form
13473 -12391 -12225 55906 37119 1939 -26203 -11400 -8082 474 -20201 -20009 2322 904 -19478
13460 -19478 -7663 1726 5101 51938 88559 99933 61631 -10639 -53011 -34569 -18750 -44180
13448 -44180 -64560 -37674 -52568 -35091 14127 4704 -8422 29753 47583 43523 41951 2569
13436 2569 -2069 10271 25605 11445 7285 4689 12131 53908 83437 57234 9101 15442 37252
13423 37252 -5809 -31737 -22282 6002 -7688 -18618 -22468 -21347 -18316 -44226 -51023 -26735 -46431
13410 -46431 -24019 20294 51914 58997 19927 -28921 -22101 -10190 8021 24381 30798 60978
13398 60978 68752 56207 12473 -16485 -32281 -61524 -13123 4296 32707 5550 -21648 -68635
13386 -68635 -71912 -31783 26552 24110 9172 20118 4115 -23276 -22697 -8272 40719 82319
13374H2319m1180j7200o120O766N077q089j6197k9942j0846J7323L0918J8503
13362C1332j4549L890n637K5635O423R97j3640j7727j5151k207j1335J062J0197
13349g10Q270O23N39J7006P723l2720l9244n862J0604J2848o857J4407p272O071
13335a4574p451o264K0003K6070K1321P685q420N631M4613k6965o3613l0035R796
13322b2203K3973K8617n666P599J0997k5470j0124q902L9820J780l4658p941J1573
13309I395j4227r924J5925J0251k2955q126L7183j4533k6247N352p417j5697j0142
13296e1162j0934L8868M5195P95L270j9291N25Q070q935P492O993k67J2400j7235
13282A5784Q274p360J7266K0619r87k1686j0591j6373J5502n171l1017l1225J292
$$ plain form
13374 82319 41139 23939 17819 24585 29662 21573 5376 -24566 -35412 -18089 12829 31332
13362 31332 16783 20673 15036 40671 47094 48091 34451 16724 1573 -634 -11969 -10907 -710
13349 -710 7560 8183 8722 25728 33451 731 -38513 -44375 -33771 -20923 -27780 -13373 -20645 -14574
13335 -14574 -22025 -28289 -8286 17784 39105 46790 38370 44001 88614 61649 -1964 -31999 -22203
13322 -22203 1770 30387 24721 32320 43317 17847 7723 -1179 38641 40421 5763 -2178 9395
13309 9395 -4832 -14756 1169 11420 -11535 -19661 17522 2989 -23258 -17906 -25323 -41020 -51162
13296 -51162 -62096 -23228 21967 22762 26032 6741 7266 15336 6401 13893 20886 20619 33019 15784
13282 15784 24058 16698 33964 54583 53596 31910 21319 4946 20448 15277 -15740 -46965 -45673
13269d5673L1053N748j1353l7822J6488O0443J8802q146k9766q169j4121P351
13257a5165K7265P757j7046k2778l0555K543M2123M256k5157j2856Q386Q867k5005
13244d7365j1501K5725J0024q329j1053O7294J2430k2293j822J5353J2838l1633
13232I668o1K9226J9563n1588l2045J0850L0471L916O463M2643k0752n47J4756
13219F2563J1447j6416o327k8099p917l02K141L238J7610J1082n6883l4151O375
13206c5639K4653L8321N3882M529n1249n8381K6681L3020p125L7105k2475m0465
13194B857O356J551j0634J7675q071j4854M887J8494k8482K3593R114j5862q38
13181E786k1142p339K5586o702J8489j6841L5875l1787k0065n792j3954j1306
$$ plain form
13269 -45673 -14620 -8872 -20225 -58047 -41559 18884 37686 29540 -226 -8395 -22516 -15165
13257 -15165 12100 19857 2811 -19967 -50522 -47979 -5856 -1600 -26757 -39613 -31227 -22360 -47365
13244 -47365 -58866 -33141 -23117 -31446 -42499 24795 37225 14932 13110 28463 41301 9668
13232 9668 9607 38833 58396 6808 -25237 -14387 16084 20000 26463 69106 48354 47807 62563
13219 62563 74010 57594 51267 23168 15251 14949 17090 20328 37938 49020 -7863 -42014 -35639
13206 -35639 -10986 27335 81217 85746 34497 -23884 2797 35817 28692 65797 43322 2857
13194 2857 9213 10764 130 17805 9734 -5120 -233 18261 -10221 13372 22486 6624 5786
13181 5786 -15356 -22695 2891 -3811 14678 -2163 33712 1925 -18140 -23932 -37886 -49192
13169d9192J3370L4478J9443K8355R483Q129J564K0622n282k6817q521K3385n6968
13156A2049o014J1032R863J3082L0332p095l0845l6547P633K1378m135k1434r818
13143a0519J2550L683j9712J8324L6590K6488J4316j7675o828J943j856j4087
13131D3217k418k933R215O911n7857j109L8830N627K5555J6227j1418l1009j9397
13118A9441l1506J7414K2572r618L2416M5997j8926j1622l580j1633J8784M509
13106G4248n862j6686p734j7492q523k0076L87J2274J3141K4669J1966J254O909
13093F8475j7855p063J5619p224N496j7548j0404J0654N619k0923K1485Q250j6246
13080C8335q834j0803J8663M9058l9292j6103J087n103R918M4113l2256l7386
$$ plain form
13169 -49192 -35822 -1344 18099 46454 55937 64066 65630 86252 80970 54153 45632 69017 12049
13156 12049 6035 17067 26930 40012 70344 63249 32404 -4143 3490 24868 20733 -701 -10519
13143 -10519 2031 5714 -13998 4326 40916 67404 81720 64045 57217 59160 57304 43217
13131 43217 40799 37866 47081 53992 -3865 -4974 33856 39483 65038 81265 69847 38838 19441
13118 19441 -12065 5349 27921 18303 50719 96716 77790 66168 62588 50955 69739 74248
13106 74248 68386 51700 43966 26474 17951 -2125 -1738 10536 23677 48346 60312 61566 68475
13093 68475 50620 43557 59176 51952 57448 39900 29496 40150 45769 24846 46331 54581 38335
13080 38335 29501 18698 37361 86419 47127 31024 32111 27008 36926 81039 48783 11397
13068A1397j7958j6919Q6340L7746n4410l3634J7824K2597j5529k5429N6211q837
13056E9399j5543K2484q222n64o6406l4M4667Q753r859M69K9477J622L6421k1379
13042H1285K141K1720l2473K2018J2542j1670m814j1588m7172k646L6836J413
13030F7592l4478R682K6708K6353k316n7345l531k6559j4916K2560J3131K7232
13018E4113L3596j5649k8790l0769q717j9015J8470L1519j5958j8932R178R752
13006A8798L6377K0730j926K0747q209m0291j1541K6292j7444K7551j3578N824
12994F3330K1818Q228J2297m468o935j4114q93m6695l3309L3708K5508q301j4668
12981C5506m4325m183J8478O427L4457Q331r728o595M472M431J91j1994J3809
$$ plain form
13068 11397 -6561 -23480 62860 100606 46196 12562 30386 52983 37454 12025 68236 59399
13056 59399 43856 66340 58118 57554 -8852 -8886 35781 44534 34675 35144 64621 66243 102664 81285
13042 81285 83426 105146 72673 94691 107233 95563 90749 79161 31989 29343 66179 67592
13030 67592 33114 42796 69504 95857 93541 36196 32665 6106 -8810 13750 26881 54113
13018 54113 87709 72060 43270 12501 3784 -15231 3239 34758 18800 -132 9046 18798
13006 18798 55175 75905 73979 94726 86517 46226 34685 60977 43533 71084 57506 63330
12994 63330 85148 93376 105673 101205 94270 80156 79263 32568 -741 32967 58475 50174 35506
12981 35506 -8819 -13002 5476 11903 46360 54691 44963 38368 42840 47271 47462 35468 49277
12968D9277R361k6436k2002J2940N075j3007l818k1850k0333L2660K0562l8965
12956a6536k9338N578K8837l1625J9299L1707Q505L844K7605O803P244o152r572
12943D6199M571Q37j4192R717J8574j6441j8533k2682J8706J1441J345j738K0949
12930E8753K6286P271k6397j8667M644J5394p656j4129L685K689J4629k6103k9404
12917A0995M100L3222j962l1629j7020K0373K1047j3943J9257L0591j1589k0979
12905D2463Q275K6468j557k0175o594L271O712K4537O485m449l8515j7113K5091
12892E4899K2457J3516j3301j0766j5088r698O687J4092j0269R331L584M5723
12880A11167J0835j9570k4474j3392J8033j0715p649J5232p711L5214j3135l5281
$$ plain form
12968 49277 58638 32202 10200 23140 28215 15208 11390 -10460 -30793 1867 22429 -16536
12956 -16536 -45874 -40296 -11459 -43084 -23785 7922 16427 20271 47876 54679 61923 55771 46199
12943 46199 50770 51607 37415 47132 65706 49265 30732 8050 26756 38197 39542 37804 58753
12930 58753 85039 92310 65913 47246 51890 67284 59628 45499 49184 51873 66502 40399 10995
12917 10995 15095 48317 46355 14726 -2294 18079 39126 25183 44440 75031 63442 42463
12905 42463 50738 77206 75649 55474 48880 52151 58863 83400 89885 85436 46921 29808 54899
12892 54899 77356 90872 77571 66805 51717 42019 48706 62798 52529 61860 65444 111167
12880 111167 122002 102432 77958 64566 82599 71884 64235 79467 71756 106970 93835 58554
12868E8554r647M8561O0841J9305l5407m2304K3336L9188k6517j9771o764o2769
12856D6606j963K4683K5121J6979J8749Q847l1889k3298O258l270N123K3595L3876
12843A49417K1003Q60J1482K7895J7896J4624R37l861L9224L5333N8552L2629
12831D05991O355J7167P2523R7061M1444O8405P8296M4360O2933L8323K8490K0975
12819I82323k3617p000k1428p9419j04535q2697o0880p4842p8546j18490r3057
12808B37812n2299J2153M7873n7133o256q135k126m772Q491j7691m9439k1117
12796H7361m636L3992p401L4196K3108l8126j7359J156J5829j436l1492j2128
12784H3064j3185M9876M1970K0394k66m933k5514n2517j284j5267j3949K9711
$$ plain form
12868 58554 48907 97468 158309 177614 142207 99903 123239 162427 135910 116139 109375 46606
12856 46606 44643 69326 94447 111426 130175 139022 107133 83835 90093 86823 91946 115541 149417
12843 149417 170420 171280 182762 210657 228553 243177 244114 240253 279477 314810 373362 405991
12831 405991 412346 429513 502036 599097 640541 708946 787242 831602 894535 932858 961348 982323
12819 982323 958706 951706 930278 850859 746324 663627 602747 527905 449359 330869 237812
12808 237812 185513 197666 245539 188406 182150 174015 171889 167117 175608 157917 108478 87361
12796 87361 82725 116717 109316 143512 166620 128494 111135 112291 128120 126684 95192 83064
12784 83064 69879 119755 161725 182119 181853 176920 151406 98889 97605 82338 68389 98100
12772I8100L2496L322L895j5634m0315j0573l464K178K7651J3384K2472r996K9745
12759A53261r075l2731j0009k0088j8114M1469L8149J6004J0242k0244k5176j2613
12747A11075l17k1742J8811J1365P36M4959L0010l2944l2052k4559k2481K574
12735H5435L6672K9598l2319J0716L0183k3470j1444k466j6941k5468J4077M4391
12723A38964J751k5303N609M872k5291o601L5979K096j8728j416q371K1676J4137
12710A39374J1621j1167j2832L172J207N88K1693L373l4653J4810K1274K9630
12698A88090O854J5004q826l3799l0389K5897J7216J6274R478m7738N316m779
12686A58598m285j1571N4167K6128k3516L1198K4626k5299k3273j2600L7042K7949
$$ plain form
12772 98100 130596 133918 137813 122179 81864 71291 67827 70005 97656 111040 133512 123516 153261
12759 153261 144186 111455 101446 81358 63244 104713 142862 158866 169108 148864 123688 111075
12747 111075 110758 89016 107827 119192 119928 164887 194897 161953 129901 105342 82861 85435
12735 85435 122107 151705 119386 130102 160285 136815 125371 122905 105964 80496 94573 138964
12723 138964 140715 115412 121021 125893 100602 94001 129980 132076 113348 111932 103561 125237 139374
12710 139374 150995 139828 126996 130168 131375 131963 153656 157029 122376 137186 158460 188090
12698 188090 194944 209948 201122 167323 136934 162831 180047 196321 205799 158061 163377 158598
12686 158598 154313 142742 196909 223037 199521 230719 255345 230046 206773 194173 231215 259164
12674B59164K5344K00m4873K0632l272P324J2075L0411N5387L1908K7414J9785
12662D41499J8950J8646J8564K611m217M5484K7668N3442P9575M2085L3833K74
12650G78414k3251k3605l0057M1935K6084l0756l3277l7776m8164j9222J6974
12639F17299O553j7429k3869Q349N3608L9567P246l633l376n181l713r176k482
12626F63763J083L5961K5168m502K29J5284M3774L4721J4711m5033j1414J9290
12614G93035J5947j3364j602j7991k5800L207J2219j4778m8521m3939j3177L6062
12602F81298K8284J5263j6530J0563J9334k9851k5639J1709l9382j1956M8574
12591F91667J9471J0491j6722l9079l1840o385k1908j9629p659k6161l4546L566
$$ plain form
12674 259164 284508 284708 239835 260467 257195 264519 276594 307005 362392 394300 421714 441499
12662 441499 460449 479095 497659 500270 496053 541537 569205 622647 702222 744307 778140 778414
12650 778414 755163 731558 701501 743436 769520 738764 705487 667711 619547 600325 617299
12639 617299 623852 606423 582554 590903 644511 684078 691324 687691 684315 679134 675421 666245 663763
12626 663763 664846 700807 725975 721473 721702 736986 780760 815481 830192 785159 773745 793035
12614 793035 808982 795618 794016 776025 750225 753432 765651 750873 702352 658413 645236 681298
12602 681298 709582 724845 708315 718878 738212 708361 682722 694431 655049 643093 691667
12591 691667 711138 721629 704907 665828 633988 627603 605695 586066 578407 552246 517700 521266
12579E21266k054l3180j0741l2147o6109N74n518J1102J8385q71k3483r864P913
12566C75273k2225m970J9490M1777K2408J4637q614j8862k0916M248L4520L0954
12554D67720K3715j2903j7337j4997j0608M8137J9801q241m863k314J5262l771
12542D99601m07J1564M0950L9806r461j819j3746k1952j4507L6811L0552l0492
12530E66900j5337O433n49j1792l6140j9233q452J3021j1832k2231J9510k3588
12518D56710J4115M1641M3545P564J3356p276q451R765q777j535K4997m4797K2339
12505E63196K014J5920L3782K5887L7268M2808j7979J4956J5473L2760K6391K0894
12493H13370J3149K9536j8759L4221K0051J3790k234L9072K1482J2318J6204l805
$$ plain form
12579 521266 519212 486032 475291 443144 377035 377609 372091 383193 401578 400707 377224 367360 375273
12566 375273 353048 348078 367568 409345 431753 446390 437776 418914 397998 402246 436766 467720
12554 467720 491435 478532 461195 446198 435590 483727 503528 495287 490424 488110 503372 499601
12542 499601 499194 510758 551708 591514 582053 580234 566488 544536 530029 566840 597392 566900
12530 566900 551563 557996 557447 545655 509515 490282 481830 494851 483019 460788 480298 456710
12518 456710 470825 512466 556011 563575 576931 569655 561204 570969 562192 560657 585654 540857 563196
12505 563196 565210 581130 614912 640799 678067 720875 702896 717852 733325 766085 792476 813370
12493 813370 826519 856055 837296 871517 891568 905358 903124 942196 963678 975996 992200 988395
12481I88395L0314M3188N5445K0491K0548J1104K6343K5854N3193O3495R9053
12470A437423M9879J4963M0355J7482L0995L3505Q2938Q0774O1596N8380N8814
12459A967104Q4434N9055N0695P9501Q3702P7708N8599P9684J05833J60294J26247
12448B932856J46787J27090J56845J36758J46809K01882K28702J77252K14385
12439D469366K02836K70741K85602L23849L88224M02672M15204M65150N86483
12430G810127O63237O82597P69360Q88970J028995J167258J329407J532797J731985
12421A7604733J957111K253373K669767L089792L592182M089773M634124N080051
12413D4970906N512723O147591O988100Q133660R415265J0441622J1103284J1472616
$$ plain form
12481 988395 1018709 1061897 1117342 1137833 1158381 1169485 1195828 1221682 1274875 1338370 1437423
12470 1437423 1487302 1502265 1542620 1560102 1591097 1624602 1707540 1788314 1849910 1908290 1967104
12459 1967104 2051538 2110593 2161288 2240789 2324491 2402199 2460798 2540482 2646315 2806609 2932856
12448 2932856 3079643 3206733 3363578 3500336 3647145 3849027 4077729 4254981 4469366
12439 4469366 4672202 4942943 5228545 5552394 5940618 6343290 6758494 7223644 7810127
12430 7810127 8473364 9155961 9925321 10814291 11843286 13010544 14339951 15872748 17604733
12421 17604733 19561844 21815217 24484984 27574776 31166958 35256731 39890855 44970906
12413 44970906 50483629 56631220 63619320 71752980 81168245 91609867 102713151 114185767
12405A14185767J1896221J2256769J2115959J0855220Q305369M698057P38876
12398A75052238k887639o328568j0306129j4528494j7164589j7294759j6233024
12391I0309036j5536098j4775345j2761141r661454o734531m622712l303726k474815
12383B0439214k009915j709211j533481j356418j224104j117393j000453q50924
12375I637315p68172p28015n82090n06459l97104l53399k87445k83347k50331
12366E480953k16576j88358k25986k27378j74632j29798j39191j14344j28428
12357C936262j22527j53956j23442j27191j17553j02428n7740o3463q6667o8721
12347B912574q1822r0534r8330j07367q3335k1050m711j4289q7080k3885J4565
$$ plain form
12405 114185767 126081988 138338757 150454716 161309936 169615305 174313362 175052238
12398 175052238 172164599 165836031 155529902 141001408 123836819 106542060 90309036
12391 90309036 74772938 59997593 47236452 37574998 30840467 26217755 22914029 20439214
12383 20439214 18429299 16720088 15186607 13830189 12606085 11488692 10488239 9637315
12375 9637315 8869143 8141128 7559038 7052579 6655475 6302076 6014631 5731284 5480953
12366 5480953 5264377 5076019 4850033 4622655 4448023 4318225 4179034 4064690 3936262
12357 3936262 3813735 3659779 3536337 3409146 3291593 3189165 3131425 3067962 2981295 2912574
12347 2912574 2830752 2740218 2641888 2534521 2451186 2430136 2425425 2411136 2324056 2300171 2314736
12336B314736j8100j8835o775k6545j425k2088p0377n8095m2559q340j3082j2342
12324B016173l2091l8426l6268l4403q669J4006k189j0975N716J6420O074j7341
12312A878027l3523J3331L2638O1771J0845J8029j0516J4013J4071k1897J0597
12301A987386K8762K9003J4096L2179P5117P213L0234N6239P9833N8671Q1259
12290B479992M1226L8199P9923R6076J18754R9426M7950N2653N7189P1208J20768
12279C303364Q9356J30409J49947R9397P3888J27572J33731J55121R8087J42881
12269D503753J91677J97735K14967K82016K33647J96580K29467L25714L37356
12260F712912L61380L69435L97123L80896L88494M43838N18565N76055N92821
$$ plain form
12336 2314736 2296636 2277801 2271026 2244481 2243056 2220968 2150591 2092496 2049937 2041597 2028515 2016173
12324 2016173 1984082 1945656 1909388 1874985 1866316 1880322 1878133 1867158 1872874 1889294 1895368 1878027
12312 1878027 1844504 1857835 1890473 1952244 1963089 1981118 1970602 1984615 1998686 1976789 1987386
12301 1987386 2016148 2045151 2059247 2091426 2166543 2173756 2203990 2260229 2340062 2398733 2479992
12290 2479992 2521218 2559417 2639340 2735416 2854170 2953596 3001546 3054199 3111388 3182596 3303364
12279 3303364 3392720 3523129 3673076 3772473 3846361 3973933 4107664 4262785 4360872 4503753
12269 4503753 4695430 4893165 5108132 5390148 5623795 5820375 6049842 6375556 6712912
12260 6712912 7074292 7443727 7840850 8221746 8610240 9054078 9572643 10148698 10741519
12251A0741519O14009O94694P97442Q53128R30128R96793J066017J099321J218762
12242A9011813J272647J343192J383008J455351J541781J648399J719896J856961
12234C1233048K094281K337574K571735K750031K826120K850838K866533K992395
12226E2522555L103409L025530K685031K236534J765057J500711J385889J303560
12218F9528276J230637J063178Q33280P83822R14252J125307J323811J505497
12210G8308060J659720J734824J858501K002882K123636K237705K380483K480116
12202I4785927K449566K318848K145086J895247J712971J492948J308844J077587
12194A09187024P47096M75220K77231L1568j76253l95553o35629r05754j201473
$$ plain form
12251 10741519 11355528 12050222 12847664 13700792 14630920 15627713 16693730 17793051 19011813
12242 19011813 20284460 21627652 23010660 24466011 26007792 27656191 29376087 31233048
12234 31233048 33327329 35664903 38236638 40986669 43812789 46663627 49530160 52522555
12226 52522555 55625964 58651494 61336525 63573059 65338116 66838827 68224716 69528276
12218 69528276 70758913 71822091 72655371 73439193 74353445 75478752 76802563 78308060
12210 78308060 79967780 81702604 83561105 85563987 87687623 89925328 92305811 94785927
12202 94785927 97235493 99554341 101699427 103594674 105307645 106800593 108109437 109187024
12194 109187024 109934120 110409340 110686571 110718139 110541886 110146333 109510704 108604950 107403477
12185A07403477j516172j699169j904984k074986k231896k462169k663060k709933
12177I0141108k630741k465353k269746k124887j997389j886891j670978j515578
12169G3579545j333843j179025j065101j083482j262672j414702j501478j552705
12161F3186537j595150j691404j917584k317212k648379k901108k920786k835947
12153D4358967k798278k792925k923047k968319k805533k466075k064098j668346
12145B3872346j406979j285159j186976j049132r84818j013895r63797r33427
12137A5048163q88586q51516q33773p86929p21636o21590n64495n58471n25202
12128H695965m41250m45482l79215l02640k74283k98808k61048k36825k79478
$$ plain form
12185 107403477 105887305 104188136 102283152 100208166 97976270 95514101 92851041 90141108
12177 90141108 87510367 85045014 82775268 80650381 78652992 76766101 75095123 73579545
12169 73579545 72245702 71066677 70001576 68918094 67655422 66240720 64739242 63186537
12161 63186537 61591387 59899983 57982399 55665187 53016808 50115700 47194914 44358967
12153 44358967 41560689 38767764 35844717 32876398 30070865 27604790 25540692 23872346
12145 23872346 22465367 21180208 19993232 18944100 17959282 16945387 15981590 15048163
12137 15048163 14159577 13308061 12474288 11687359 10965723 10344133 9779638 9221167 8695965
12128 8695965 8254715 7809233 7430018 7127378 6853095 6554287 6293239 6056414 5776936
12119E776936k53818k52801k53104k02904j78632j80481j90027j51771j21216
12110C992182j22498j10895j56894j26400r1164j17936r2208q6647j06737q7593
12100B893210j10742j07057r7760j06253p2453l0717l3012r5371r1069q5612l2001
12089B031163o3260n8166q0303p8276o0242k1425m0939o3764m0687m3824l9665
12078A440612k8868j3070j3087p5526n1326l5436l2179n5588k4612r713k3422
12067A077785k1315l9504p2315j0025j7873m0702j0343j0237j3785l3904j0226
12056G97556m222k4821j7367o5958k4365K731k5650m4304j7578J1698L99M375
12044E92494k396k1278k0201j0712o7097j8550N6596J3347l9787q24r301n539
$$ plain form
12119 5776936 5523118 5270317 5017213 4814309 4635677 4455196 4265169 4113398 3992182
12110 3992182 3869684 3758789 3601895 3475495 3384331 3266395 3174187 3087540 2980803 2893210
12100 2893210 2782468 2675411 2577651 2471398 2398945 2368228 2335216 2239845 2148776 2063164 2031163
12089 2031163 1967903 1909737 1829434 1751158 1690916 1669491 1628552 1564788 1524101 1480277 1440612
12078 1440612 1411744 1398674 1385587 1310061 1258735 1223299 1191120 1135532 1110920 1101207 1077785
12067 1077785 1056470 1016966 944651 934626 916753 876051 865708 855471 841686 807782 797556
12056 797556 793334 768513 751146 685188 660823 663554 637904 593600 576022 587720 588119 592494
12044 592494 590098 568820 548619 537907 470810 452260 508856 522203 482416 481592 472291 466752
12032D66752r074p3378J0317L1264j4554k9813Q612k585J862J3496J434m6740
12020C57593j3412J2869K262l7515k5377J2312L7909o605q687l7195k3742n81
12008B69831j7849p702M760Q133Q168k082O0734j7536k3512j7416J385l153J3359
11995B77120K3798K221k1208N311K0191J773l1100L6156N6783K6910L3632M4593
11983D76180R8780P1237L3821K4363J6713P9961M7271O1070N9401K5955O180K9946
11971A030878J7052p0286p7779p4163q8540j10104j08973j08161o9323l5364k3127
11960B82110k3785k4881k8803j3578j977k9083j8102L265k5183n4104j219K0022
11948H4682J5820l2625m211K6751K3803J951k8937q582j0663j7110k783N716p29
$$ plain form
12032 466752 457678 384300 394617 425881 411327 381514 390126 387541 389403 402899 404333 357593
12020 357593 344181 357050 359312 321797 296420 308732 346641 340036 331349 294154 270412 269831
12008 269831 251982 244280 249040 257173 265341 263259 323993 306457 282945 265529 266914 263761 277120
11995 277120 300918 303139 281931 287242 307433 309206 278106 314262 371045 397955 431587 476180
11983 476180 574960 646197 680018 704381 721094 801055 848326 909396 968797 994752 1000932 1030878
11971 1030878 1047930 977644 899865 825702 737162 627058 518085 409924 340601 305237 282110
11960 282110 258325 233444 204641 191063 189086 160003 141901 145166 119983 65879 64660 84682
11948 84682 100502 67877 63666 90417 114220 116171 87234 78652 67989 50879 48096 53812 53083
11935E3083O914j479m3273J0015K5202J6663p644m207o4911k1833O887J2017N4119
11922D1553K7778J7613L0086m661k8302m2728n0137j0855L5689k9903k5217L1737
11910g347j5754o990j9285L033K9806L6552J6766p063m1098m3664o703L9465J4150
11897h132K0021K5805m119m2924J7852J8714K3312r642j6932p354J7115j9931
11885A3785M6040K7042k6080p997J5101M595J1045K2457j4804k3515j8505k0573
11873B8591j8858K000M2411K3473M0830K5654L778m2287j0370J1490J2102K0246
11861A39060K0731Q490J6199K3994N0202J8053K5593K8013K7129q582J230K3319
11849C73431k151O58N505l5560l9625j7853l9291j867l2554l0768j6091j065k8968
$$ plain form
11935 53083 59997 58518 15245 25260 50462 67125 59481 55274 -9637 -31470 -24583 -12566 41553
11922 41553 69331 86944 117030 112369 84067 41339 -8798 -19653 16036 -13867 -39084 -7347
11910 -7347 -23101 -30091 -49376 -46343 -16537 20015 36781 29718 -11380 -55044 -61747 -22282 -8132
11897 -8132 11889 37694 33575 -9349 8503 27217 50529 40887 23955 16601 33716 13785
11885 13785 59825 86867 60787 52790 67891 72486 83531 105988 91184 67669 49164 28591
11873 28591 9733 11733 54144 77617 118447 144101 147879 105592 95222 106712 118814 139060
11861 139060 159791 168281 184480 208474 258676 276729 302322 330335 357464 348882 350112 373431
11849 373431 371280 371938 377443 341883 302258 284405 245114 243247 210693 179925 163834 162769 133801
11836A33801k5376q619q964k1564J3508o466j163R293l122j6622n706l4691m1683
11823a7374O4K7043M331l551J2424P742j864L8764J0557n477R827P856K4137Q220
11809A22699J7774Q696J2843N87R261j8947R235L0025L4968L5580M961L5395j553
11796C01524k3898k3872K0692J9148K2748r948k4475N9794Q923j2419K3720M4352
11784D06289K5926O457m0586k3278R55Q251K4692N4906L3189J4206l9978l4758
11772D36271P711N9527L0646p86k3666P928J1953L0757o562k86L3901J1238j1030
11759E87602J7482n891j7413J869o158l5905l2870k5126k2674j0483m0716o8731
11747C40986q18L8957L0975M4770j1468k4248q398l8370m881O931J337j929k3839
$$ plain form
11836 133801 108425 99806 90842 69278 82786 76320 75157 84450 81328 64706 59000 24309 -17374
11823 -17374 -17310 9733 14064 10513 22937 30679 28815 67579 78136 72659 82486 90342 114479 122699
11809 122699 140473 149169 162012 162599 171860 152913 162148 192173 227141 262721 267682 303077 301524
11796 301524 277626 253754 274446 293594 316342 306394 281919 341713 350636 338217 361937 406289
11784 406289 432215 438672 398086 374808 375763 384014 408706 463612 496801 511007 471029 436271
11772 436271 443982 503509 534155 533369 509703 517631 529584 560341 553779 553493 587394 598632 587602
11759 587602 605084 599193 581780 583649 577491 541586 508716 483590 460916 450433 409717 340986
11747 340986 340168 379125 410100 454870 443402 419154 410756 372386 367505 374436 375773 373844 350005
11734C50005j1271L88j0868P691J1114J7332J0529m4749k9455r619J1470J5118
11722C17685j6616j7751K160k9138m7941k2252l9669j4969J0259j127j2014J293
11710A29920j0212Q422j010r104l9805n72L4800k6223k6898j3281m86K8699J8078
11697I2328q421p340q334o6903j0234M5133N1081k6589l6025n098J034M558k3744
11684A446m537k7613j7803M1845m909j6974R475K0053K6456O034j1891N315O590
11671C3487R434m6224l692J6196J1609l320j8641o057J5657l4523m790L5223L1760
11658C6119K8295m881m197k8472k5302J2990R336M384k2914N362k6075l883K6279
11645G041j4199J2435L758L691j3674m894k5226M2902l180j5484k5592k449K3714
$$ plain form
11734 350005 338734 339122 328254 335945 347059 364391 374920 330171 300716 291097 302567 317685
11722 317685 301069 283318 285478 256340 208399 186147 146478 131509 141768 140641 128627 129920
11710 129920 119708 128130 127120 118016 78211 77639 112439 86216 59318 46037 45551 74250 92328
11697 92328 83907 76567 68233 1330 -8904 36229 87310 60721 24696 19598 20632 25190 1446
11684 1446 -3091 -30704 -48507 -6662 -11571 -28545 -19070 983 27439 33473 21582 26897 33487
11671 33487 42921 -3303 -6995 9201 20810 17490 -1151 -7208 8449 -26074 -30864 4359 36119
11658 36119 64414 59533 55336 26864 1562 14552 23888 28272 5358 10720 -15355 -19238 7041
11645 7041 -7158 5277 9035 12726 -948 -5842 -31068 11834 8654 -6830 -32422 -34871 -11157
11632a1157N462k0059m8331k3213m433J8278Q85O057p138J6426K5976K4335O835
11619a0077j4607j8446K5834k6616j6301L2812J5793J9846P195j7100n091l4031
11607d0789j4416K293p960j5397K8293K4299k055j0016J9648K4652k2030J9295
11595E817J0898k4291M7958K7573k4165k7184l8469k9603N185J3571l841n857
11583d2408L2173J4469j8941l717M358k5723k436K2646M3655J427k6014j5733
11571a6244k5261j7883m1980J40M4827L4018j1962L1194q644k055k3393M0786
11559C543J1799J4006j1783q797p349K008J6013r05K503J7149j4802J050p365
11546A7070k2559m3526J822o185L687J2681M644p47J2305M4773J5983k5761m52
$$ plain form
11632 -11157 -5695 -25754 -74085 -97298 -101731 -83453 -82568 -76511 -83649 -67223 -41247 -16912 -10077
11619 -10077 -24684 -43130 -17296 -43912 -60213 -27401 -11608 8238 15433 -1667 -6758 -40789
11607 -40789 -55205 -52912 -60872 -76269 -47976 -23677 -25732 -35748 -16100 8552 -13478 5817
11595 5817 16715 -7576 40382 67955 43790 16606 -21863 -51466 -46281 -32710 -36551 -42408
11583 -42408 -10235 4234 -14707 -18424 -14066 -39789 -42225 -19579 24076 25503 -511 -16244
11571 -16244 -41505 -59388 -101368 -101228 -56401 -22383 -34345 -3151 -11795 -13850 -37243 3543
11559 3543 15342 29348 17565 8768 1419 3427 19440 18535 21038 38187 23385 24435 17070
11546 17070 -5489 -49015 -47193 -53378 -49691 -37010 -32366 -33113 -20808 23965 39948 14187 13735
11533A3735K1374J954K8517o907J2342k1901m4785n0635l5318J9585K1928M511
11521c5600M7049J002m3363P204k806r250O509K1433J2248r487K0033q714J1997
11508A8255j0544m0143J1479K0892m894J6854k7155K756J7401J5814L2235j2000
11496D0950l3147j5539K631J8869J858j7119N238J6821m343K0829J515j1264k4741
11483B558k3478j0116L1738M4028m3671l2482J5160L9808L7812r862m9250K09
11471B454R929j9431M6171l416o3903k2032J7151j6006K1557K1768J9126J3277
11459B6645m186j6551m5424O722K1617r566K9090K3050q235j6455Q459p341k4101
11446a6276L7071j5454m0490q996Q677L5719o744k964j4252J3460J2192k4731
$$ plain form
11533 13735 35109 37063 65580 58673 71015 49114 4329 -46306 -81624 -62039 -40111 -35600
11521 -35600 11449 12451 -30912 -23708 -26514 -35764 -29255 -7822 4426 -5061 14972 6258 18255
11508 18255 7711 -32432 -20953 -61 -4955 11899 -15256 -12500 4901 20715 52950 40950
11496 40950 7803 -7736 -5105 13764 15622 -1497 3741 20562 16219 37048 38563 27299 2558
11483 2558 -20920 -31036 702 44730 1059 -31423 -16263 23545 61357 51495 2245 2454
11471 2454 12383 -7048 39123 35707 -28196 -50228 -33077 -49083 -27526 -5758 13368 26645
11459 26645 22459 5908 -39516 -32794 -11177 -20743 8347 31397 23162 6707 15166 7825 -16276
11446 -16276 20795 5341 -35149 -44145 -35468 251 -6493 -9457 -23709 -10249 1943 -22788
11434b2788m910N5458M2666j1453n285R357L560n048j3905j9264K6887l1614k2361
11421A300j0932l6306r962j6801K489O6915j0173J1922P889l1306p573k316N674
11408b9180m210J3852J8424J6269K1661q560l4956l0271L8947L8392j8544L390
11396B5214K5869l8296l6364N686K7122J264j3189O354j50n1794k7572P973Q972
11383e8911J6493N326M1333L8082l1576m2090j0299k0408L3604q17j5354k779
11371d7396L0669j0261l413K7481j1685J6390L251N36n7138o406k689Q344N2924
11358F07K071K9862l605l7264l2668k0343K2982k5344N989K6006L0459J1720j300
11345I172j2974J172M875L9683k330k1228m6163k1390K0404L8373k4257j6079
$$ plain form
11434 -22788 -27698 27760 70426 58973 53688 63045 66605 61557 47652 28388 55275 23661 1300
11421 1300 -9632 -45938 -55900 -72701 -70212 -3297 -13470 -1548 6341 -24965 -32538 -34854 -29180
11408 -29180 -33390 -19538 -1114 15155 36816 28256 -6700 -36971 1976 40368 21824 25214
11396 25214 51083 12787 -23577 -17891 9231 10495 -2694 3660 3510 -48284 -75856 -67883 -58911
11383 -58911 -42418 -37092 4241 42323 10747 -31343 -41642 -62050 -28446 -29263 -44617 -47396
11371 -47396 -16727 -26988 -30401 -2920 -14605 1785 5036 5572 -51566 -57972 -60661 -52317 607
11358 607 2678 32540 28935 -8329 -40997 -61340 -38358 -63702 -57713 -31707 -1248 10472 9172
11345 9172 -3802 -2630 2245 41928 39598 18370 -27793 -49183 -28779 9594 -14663 -30742
11333c0742K2702m2481p421l2662o4456L9438P4181K2970k143j5549K7936L6752
11321B8525J378m803L573L0362M44m8816O482J5884N1491M612m0635m6505N663
11308G655P040j8278l2312n969L6486L4608L2224j2541l2742l2407j6718J0187
11296b2767K5259K343K544K1471p790L2030J1666n2882k7095q243K5041L0249
11284C1826l1012l8407N963M0617J6160j9691J2666J1124j1902K0022L4865j587
11272G0644k3292j068m4718q342P885L3482J7952l0900M870o861k3064k204R391
11259C775J458K655L317j6474j8626L358K4744K1847J8N70j3064j1543Q66R363
11245A2264K6024j2972r213L3970k5554l6114j2792J26J458J7110J9335l724j7848
$$ plain form
11333 -30742 -8040 -50521 -57942 -90604 -155060 -115622 -41441 -18471 -20614 -36163 -8227 28525
11321 28525 29903 25100 28673 59035 59479 10663 17145 33029 84520 89132 48497 1992 7655
11308 7655 14695 -3583 -35895 -41864 -5378 29230 61454 48913 16171 -16236 -32954 -22767
11296 -22767 2492 4835 7379 28850 21060 53090 64756 11874 -15221 -23464 1577 31826
11284 31826 814 -37593 -31630 8987 25147 5456 18122 29246 17344 37366 72231 70644
11272 70644 47352 46284 1566 -6776 1109 34591 52543 21643 26513 19652 -3412 -5616 3775
11259 3775 5233 7888 11205 -5269 -23895 -20537 4207 26054 26072 26642 13578 2035 2901 12264
11245 12264 38288 25316 16103 50073 24519 -11595 -24387 -24261 -22803 -5693 13642 9918 -7930
11232g930J1488J3259M93m946j0312j5328j2146j064j9240M1571L2976K7131j1551
11219D4401k0461K9280J0073k3255l7572n923J2896O940N087L305n9269k592N1525
11206A4435J8768J1103n1153q773K7946K5046L222m5515J7745K2659j8667J2884
11194B9700J4183p406k5469j1574J0666J8055L6135L4569m2836j4486J3671k3593
11182C1615k2906P148J9544j3236j2972J0822K4662J3711n3682o346K8974k441
11170B4893j3707l740J31j1288r124j1112k2710K6146M9651q032k0723P157K5256
11157C2798K9187r435k955k0430K5064M5002R871J4236k7253m0218l9807J670
11145A7730J0371M4908K451k8831p608j4889k9002j5956L714L3683K0701J8409
$$ plain form
11232 -7930 3558 16817 17310 12364 2052 -13276 -25422 -26486 -45726 -4155 28821 55952 44401
11219 44401 23940 53220 63293 40038 2466 -3457 9439 16379 21466 24771 -34498 -37090 14435
11206 14435 33203 44306 -6847 -15620 12326 37372 40594 -4921 12824 35483 16816 29700
11194 29700 43883 36477 11008 -566 10100 28155 64290 98859 56023 41537 55208 31615
11182 31615 8709 15857 35401 22165 9193 20015 44677 58388 4706 -1640 27334 24893
11170 24893 11186 7446 7577 -3711 -12835 -23947 -46657 -20511 29140 21108 385 7542 32798
11157 32798 61985 52550 49595 29165 54229 99231 109102 123338 96085 55867 16060 17730
11145 17730 28101 73009 75460 46629 39021 24132 -4870 -20826 -17112 16571 37272 55681
11133E5681j720P963L46j3519J6542L832j7266m3058R500O438q59q489j0390l512
11119A489J5787L9092Q611j8470p793l007M692M8295k7542j0190K6820k4566j4569
11106C8649J7605J2150j1062l977j777o8J6395K6527j919l1657K7551j3556j7839
11093E7022O89m576j1383j3187j5951L6851J5891J7953j9143q869k3237J4795
11081D6855K5983j361o251L120m549m0067k5071J9856k3604l596L2356J7963P184
11068D8818j8181N114J7064r268k4953K2616j3065o339l118M894N7898k5792l6342
11055A9346P536L657L8190J3380k7453j6880j3897l0448o429J5802K3189l6761
11043a0768K3554P986k195K3260K6151K2008j6651k2140l2202r726J4884K518
$$ plain form
11133 55681 53961 61924 62270 48751 65293 69125 51859 8801 18301 24739 23880 15391 5001 1489
11119 1489 17276 56368 64979 46509 38716 35709 40401 88696 61154 50964 77784 53218 38649
11106 38649 56254 68404 57342 53365 51588 51520 67915 94442 92523 60866 88417 74861 57022
11093 57022 57711 53135 41752 28565 12614 49465 65356 83309 64166 55297 32060 46855
11081 46855 72838 71477 65226 68346 63797 23730 -1341 18515 -5089 -8685 23671 41634 48818
11068 48818 30637 35751 52815 43547 18594 41210 28145 21806 18688 23582 81480 55688 19346
11055 19346 26882 30539 68729 82109 54656 37776 23879 -6569 -12998 2804 25993 -10768
11043 -10768 12786 20772 18577 41837 67988 89996 73345 51205 19003 9277 24161 26679
11031B6679L2690J6351L8503K6515k2227Q314j0302l177j1508k3416j5131K3360
11019H6651O04M758j923N469m661k3426q985l125j0420J8644j5403J2170q839
11006E1514L2725j3697q454m084L261o454j727R038j5173O177N5419K1581m4895
10993H5231p363J1446k029O280J2041J870m2770m362M283j5120K5281M2280K2353
10980A39421P101o213m4386m2472k3173k8806M84K873o805K3479L1357K1142l8905
10967C5097m2143K1542J1697j8780L1646m690J5277J4300k4436j6028M848K6800
10955E5130j0182K878j1689j505J0652K2035J9570R757J2472J1300j3554j6712
10943I0152j3858K3143M4482J9836q809j5414J1218R632P763l1843k6183P03J3560
$$ plain form
11031 26679 59369 75720 114223 140738 118511 126825 116523 113346 101838 78422 63291 86651
11019 86651 87255 92013 90090 95559 90898 67472 58487 55362 44942 63586 48183 60353 51514
11006 51514 84239 70542 62088 58004 61265 54811 53084 62122 46949 53126 108545 130126 85231
10993 85231 77868 89314 87285 93565 105606 107476 64706 60344 64627 49507 74788 117068 139421
10980 139421 146522 140309 95923 53451 30278 1472 1956 4829 -1976 21503 52860 74002 35097
10967 35097 -7046 14496 26193 7413 39059 34369 49646 63946 39510 23482 28330 55130
10955 55130 44948 47826 36137 34632 45284 67319 86889 96646 109118 120418 106864 90152
10943 90152 76294 99437 143919 163755 154946 139532 150750 160382 168145 136302 110119 110822 124382
10930A24382L7589M8056L4894L0685Q38J0247J6543K3746N6944M7723L1812M5316
10918E08775O3672M4835M6280N2072J03472J54345J47220K01946J64458M3083
10908A530158K1612L1914L0203M0032J1633j04577k72194l24376k81771j67014
10898E15620j18718m9307o6349o4518q418m77j6604R246M4295k5105m7751l8815
10886A33099J2896J7329j6843o2189j1676J0510R118J3885J1655R087j0218K9009
10874A45662p43j6834j0948L9072k4610k8N786k1503j0721o713l1165n313o747
10861E5195K1734k338m3324k1888o072K9159J2367J0454j3879k017Q015K1973
10849F9379N2697J9005l0333m776q908o386L7749m682J1772k3563L11J9663J1857
$$ plain form
10930 124382 161971 210027 244921 275606 276444 286691 303234 326980 383924 431647 463459 508775
10918 508775 572447 617282 663562 715634 819106 973451 1120671 1322617 1487075 1530158
10908 1530158 1551770 1583684 1613887 1653919 1665552 1560975 1288781 964405 682634 515620
10898 515620 396902 347595 281246 216728 208310 207833 191229 200475 244770 219665 171914 133099
10886 133099 145995 163324 146481 84292 72616 83126 92244 106129 117784 126871 116653 145662
10874 145662 144919 128085 117137 156209 131599 131571 137357 115854 105133 98420 67255 61942 55195
10861 55195 76929 74591 31267 9379 3307 32466 44833 55287 41408 39391 47406 69379
10849 69379 122076 141081 110748 105972 97064 90678 128427 123745 135517 111954 112265 131928 143785
10836A43785Q332j2305k1811l7591K2016M1271r306p829j6757k0482J1303N187
10824A05813k4574J7397N8493j930n4433n493L5363k994L4043N446K6108m834
10812A88405m0097l6934o3696k9571Q242L5251K2150Q505M5472p284l1266j8821
10800H0356j4158j1774l2010P988P05N193N836J3824J0353K9074P4825q105j7695
10787A44412K3775N3946k485l6306K017R314J8140J9628j0330o0528j0114L2902
10775A84371J8692k2193j830K1063N4l7792l2314J0340O0697k1465j9927k3492
10763A36204j6503K7795L8627k278j8162K6002N0853J9249J3703J2871j5734M67
10751B73094N1699L0887K5547L4287m993l862J8982J5518L1079m593J2243k8934
$$ plain form
10836 143785 152117 139812 118001 80410 102426 143697 134391 126562 109805 89323 100626 105813
10824 105813 81239 98636 157129 155199 100766 95273 130636 127642 161685 167131 193239 188405
10812 188405 148308 111374 47678 18107 26349 61600 83750 92255 137727 130443 99177 80356
10800 80356 66198 54424 22414 30402 31107 36300 42136 55960 66313 95387 170212 162107 144412
10787 144412 168187 222133 219648 183342 185359 194673 212813 232441 222111 161583 151469 184371
10775 184371 203063 180870 179040 200103 200157 162365 130051 140391 201088 179623 159696 136204
10763 136204 119701 147496 186123 183845 165683 191685 242538 261787 275490 288361 272627 273094
10751 273094 324793 355680 381227 415514 410521 406659 425641 441159 472238 467645 479888 450954
10739D50954l9345l6389o098j9190M411m5154n5506n2268k9454k6356j27r63J9023
10726A63538J0093J6836K3949l850L120j0580J6053R040Q031j4684k0271n084
10714A96191j1433Q262m359l6556J4043J7431L1538l735J2731L536p709J1646
10702B31586k578j8137j2498K4074J3081L4170L0437J1700k929j8320m7139j4881
10690B28566Q410K526J4402J9316K4743k6559l6265Q881M3386K1290L809R015
10678C21520R305K5001N239j2875M7920l193j3985n5305k1870k436n0760k8142
10666B20419J2550n153J5450J8040P25N30L2062J4179K5285o423k1996p990l6843
10653B60835J3466J5155k5724M673j0541K4125P4406J9567K4864k6258k8989R634
$$ plain form
10739 450954 411609 375220 369122 349932 354343 309189 253683 201415 171961 145605 145478 144515 163538
10726 163538 173631 190467 214416 210566 213686 203106 219159 228199 236230 221546 201275 196191
10714 196191 184758 193020 188661 152105 166148 183579 215117 211382 224113 227649 219940 231586
10702 231586 229008 210871 198373 222447 235528 269698 300135 311835 308906 290586 243447 228566
10690 228566 236976 239502 253904 273220 297963 271404 235139 244020 287406 308696 312505 321520
10678 321520 330825 355826 361065 348190 396110 392917 378932 323627 301757 299321 248561 220419
10666 220419 232969 227816 243266 261306 262031 262561 294623 308802 334087 327664 305668 297678 260835
10653 260835 274301 289456 263732 268405 257864 281989 356395 375962 400826 374568 345579 355213
10641C55213L5281M7970L4605J3699L9424J9611k265O2501M6058m712k6849j4421
10629F06115J1388k2369K4245M6550J188Q735n1430o0646J2603r529O09j868j9318
10616E46273L630j0611r408K3444j7030l7291j1830N5217L9438K2802L7668k1833
10604F20469k2616j1900K1201K0233l150M5891K0758q160Q291j3011O566N7511
10592G42083K5548J185J3823L8373J8429j836J9228O1375J7425Q881J3103L5741
10580I93358M5246N1899j2446k6566p201J2386P7872L7072J5506M1421J0123L7768
10568A276438J229K5500N5850P447L3093L786L6230K8817M3926Q6935J19022P9026
10556A797299N5085O0643O2522P1079N8420J21224R2042P3634Q1679R6174J29253
$$ plain form
10641 355213 390494 438464 473069 486768 526192 545803 543538 606039 652097 647385 620536 606115
10629 606115 617503 595134 619379 665929 667117 675852 624422 563776 576379 566850 567459 565591 546273
10616 546273 549903 539292 529884 553328 536298 499007 487177 542394 581832 604634 642302 620469
10604 620469 597853 585953 607154 627387 624237 670128 690886 682726 691017 678006 684572 742083
10592 742083 767631 768816 782639 821012 839441 837605 856833 918208 935633 944514 957617 993358
10580 993358 1038604 1090503 1078057 1051491 1044290 1056676 1134548 1171620 1187126 1228547 1238670 1276438
10568 1276438 1277667 1303167 1359017 1366464 1399557 1403343 1439573 1468390 1512316 1599251 1718273 1797299
10556 1797299 1852384 1913027 1975549 2046628 2105048 2226272 2318314 2391948 2473627 2569801 2699054
10545B699054J47841J11503O4801J13209J22458J78623J61475J71338J52844J30804
10535D053950J56380K41967K80100K43322K42475K87757K82629L11174L51279
10526F451033M16526M26522M80413M96556N42613O13900O90204P87604Q91344
10517A1796715R57307J086772J222380J428185J692224J936092K161104K470569
10509B4751348K758676L028397L366882L835561M604713N642579O890118Q315416
10501F3193690R810453J1185270J1730488J1027374J0006707J0928403J5629846
10494A43512231K3953330L3083820L6853646K8662111J2329311K139410L188157
10487B83722016R591803J4142417O136369k4012835n9545080o6930082m9876978
$$ plain form
10545 2699054 2846895 2958398 3023199 3136408 3258866 3437489 3598964 3770302 3923146 4053950
10535 4053950 4210330 4452297 4732397 4975719 5218194 5505951 5788580 6099754 6451033
10526 6451033 6867559 7294081 7774494 8271050 8813663 9427563 10117767 10905371 11796715
10517 11796715 12754022 13840794 15063174 16491359 18183583 20119675 22280779 24751348
10509 24751348 27510024 30538421 33905303 37740864 42345577 47988156 54878274 63193690
10501 63193690 73004143 84189413 95919901 106947275 116953982 127882385 143512231
10494 143512231 167465561 200549381 237403027 266065138 278394449 280533859 283722016
10487 283722016 293313819 307456236 313592605 289579770 230034690 163104608 113227630
10480A13227630l1254906j9222432j2364982q320221n926350m419093l407945
10473B8311701k762541k359673j975405j636118j396342j206804j144758j166006
10465A4664054j217054j156884r46415p56109o34622n55751n02991m67550m28577
10456G998101l82907l68042l49041l32468l25172k40791j99745k28016k44994
10447E326925k37522k01091j65741j59041j96661j23538j45817j73352j55398
10438C768764j35572j09752j10248j18539q9685q2745j27054j01506j28144j06216
10428B659303o4105o5317m4528l9933j00885p4015m9667m0966j7546l4711m9034
10417B078596j01589o0262n2741o4578n0286p1345o6766o0648n0490q0712l6675
$$ plain form
10480 113227630 81972724 62750292 50385310 42065089 36138739 31719646 28311701
10473 28311701 25549160 23189487 21214082 19577964 18181622 16974818 15830060 14664054
10465 14664054 13447000 12290116 11343701 10587592 9952970 9397219 8894228 8426678 7998101
10456 7998101 7615194 7247152 6898111 6565643 6240471 5999680 5799935 5571919 5326925
10447 5326925 5089403 4888312 4722571 4563530 4366869 4243331 4097514 3924162 3768764
10438 3768764 3633192 3523440 3413192 3294653 3204968 3122223 2995169 2893663 2765519 2659303
10428 2659303 2595198 2529881 2485353 2445420 2344535 2270520 2220853 2179887 2162341 2127630 2078596
10417 2078596 1977007 1916745 1864004 1799426 1749140 1677795 1611029 1550381 1499891 1419179 1382504
10406A382504j9951l7414k1081n6138n2618l9209K456m4242l2042r219k7405j8637
10394A027004k050j7353m8725k4564n385j9666Q710J0560k5355n8299j0077j8691
10382H16109l8971k1407q523m27j475O726M6711Q380p69k3439m2474l0879k0378
10369F89184K4878k1374k8970n0183m6239m7720k0437p154k3395r483J3001J7039
10357D89147j5320l7870j6438m2590k6419k2069p644k87P213Q610o586J4104J4457
10344C58308J2995j9887q75j315j8074k6482l5935R837M5500L8663K2581l4050
10332C51266k3148o789l1636k4544J8680M366J6934J689j9597l0192l8841J2330
10320B30518K5298l6581Q914j8633k4495J6495L8736Q971j5956j7664k607q286
$$ plain form
10406 1382504 1362553 1325139 1304058 1247920 1195302 1156093 1158549 1114307 1082265 1073046 1045641 1027004
10394 1027004 1024954 1007601 958876 934312 928927 909261 917971 928531 903176 844877 834800 816109
10382 816109 777138 755731 747208 746781 745306 752032 798743 807123 806354 782915 740441 709562 689184
10369 689184 714062 692688 663718 613535 567296 519576 499139 491985 468590 459107 472108 489147
10357 489147 473827 435957 419519 376929 350510 328441 320797 320510 327723 336333 329747 343851 358308
10344 358308 371303 351416 350541 349226 331152 304670 268735 278572 324072 362735 385316 351266
10332 351266 328118 321329 289693 265149 283829 288195 305129 306818 287221 257029 218188 230518
10320 230518 255816 219235 228149 209516 185021 201516 240252 249223 233267 215603 212996 204710
10308B04710m1960j3042J312L1236M128j8249m0086j5616p467q062l6028n6551
10296D325m509O5203N8028K9062J1356L685j8500j7810j8101L082j4066L6990
10284A38745J9074J5655J1950j6755n4089K0785p838j5215K904l3280m651J5212
10272I2497J6756j4677j4149J2163k7584l9086k581K1597r966K0609M0089j3225
10260H2443k0752l917j1692j283k423M3510K2372l25L8600j6107l91l692P793
10247A34136J70j3331j0962m8034m0979O2327K0769o1128K4174J0499r635J265
10235F9271J3431j4411k4155k191l4647n884K8459J1582j1110l3125j4944J7128
10223e96K0257j493m175O300J1458P723O572J6022J9622J2750k0849l4992R389
$$ plain form
10308 204710 162750 149708 151020 182256 186384 168135 128049 112433 104966 96904 60876 4325
10296 4325 -184 65019 123047 152109 163465 167150 148650 130840 112739 115821 101755 138745
10284 138745 157819 173474 185424 168669 114580 135365 127527 112312 115216 81936 77285 92497
10272 92497 109253 94576 80427 92590 65006 25920 23339 44936 34970 55579 95668 82443
10260 82443 61691 57774 46082 44799 42376 85886 108258 107933 146533 130426 130035 126343 134136
10247 134136 134306 120975 110013 61979 21000 83327 104096 42968 67142 77641 68006 69271
10235 69271 82702 68291 44136 41945 7298 1414 29873 41455 30345 -2780 -17724 -596
10223 -596 19661 18168 13993 20293 31751 39474 46046 62068 81690 94440 73591 38599 47988
10210D7988J71K4275L1914J7876j1917j9529r912j3611L706l36j971J8572J4057
10197A01283j7839r399L1380m504m379M7k0715j7163J4145J6866q001q214O294
10184G9801J9973K5025N0139K4155k5120L061J1524k2796n963J8716K6132j548
10172B03099m756q103l845n762L0178O2226N219L0274L9078L9082M1002L7522
10160D65214L8100L5352L0718O2244R9066P5790P2203N2423R3591J38913J32726
10149A296340M9376j7880K827K675J0797j7127j61667k80693k52801j48315n2239
10138D31293q1360o4505m9899n8395o488J624p683n517k0608m566n880P088N480
10125A40584l438J1977q847L0427l0465m5033J5212r297n871J4092K0375N561
$$ plain form
10210 47988 48159 72434 104348 122224 110307 90778 80866 67255 70961 70625 68654 87226 101283
10197 101283 83444 74045 105425 100921 96542 96589 75874 58711 72856 89722 81721 73507 79801
10184 79801 99774 124799 174938 199093 173973 177034 188558 165762 159799 178515 204647 203099
10172 203099 198343 190240 186395 180633 210811 273037 278256 308530 347608 386690 427692 465214
10160 465214 503314 538666 569384 631628 730694 806484 878687 931110 1024701 1163614 1296340
10149 1296340 1345716 1327836 1330663 1333338 1344135 1327008 1165341 884648 631847 483532 431293
10138 431293 349933 285428 235529 177134 170646 172270 164587 159070 138462 133896 128016 135104 140584
10125 140584 137146 149123 140276 170703 140238 95205 110417 101120 95249 109341 129716 135277
10113A35277k6734j589k1125Q822J7256j5477n454j0473K537L4626r51N722K3946
10100A46383K272n3353m3334K459K4867R209K5898J2588k2670N703J2387L1688
10088A54097K3429J5625J6844o075o444N4781K8571n027M1620M6811L3753M4772
10076D42757K823M3363O3382O0701K6263M1877J05947J50434J50142J84898J45763
10065A418350O5963K7134K0157L1338N9264O3220q0305k53880l14745k68977k07053
10054E60466j43088o0564l3842l9680n596j1684m2335m3159n7700m7331j8726
10043E6761R994Q890r90M1210L5098L844m2308j7343J3379q950k6972J190K7227
10030A01030J905J1144k2727j1886k017L8670K7436j7963j7328k3316N502L3167
$$ plain form
10113 135277 108543 106954 85829 94651 111907 96430 90976 80503 83040 117666 116715 122437 146383
10100 146383 148655 95302 51968 54427 79294 88503 114401 126989 104319 110022 122409 154097
10088 154097 177526 193151 209995 203920 197476 252257 280828 275801 317421 364232 397985 442757
10076 442757 445580 488943 552325 613026 639289 681166 787113 937547 1087689 1272587 1418350
10065 1418350 1484313 1511447 1531604 1562942 1622206 1685426 1605121 1351241 1036496 767519 560466
10054 560466 417378 356814 322972 283292 277696 266012 223677 180518 122818 75487 56761
10043 56761 66755 75645 74655 115865 150963 154807 112499 95156 108535 99585 72613 73803 101030
10030 101030 102935 114079 91352 79466 77449 116119 143555 125592 108264 84948 90450 123617
10018A23617K8446J4538J3824k6798l4666n1345J472M357J893J8416J9195K0205
10006A33154P419m3786k9857j4542K0570j9777J868J0328P0507p290l3705k5208
9994F9681M095K799k164j30K3049R470J3639j8950p909j7848q479K729J2726K6762
9980A09470L2318M0030l6500l2801j0617Q925j9756j0893J7879j4630k3342K6161
9968H6244J2842J7330J9251k150l0251l6764M9312J4703J241j6573o920J6744
9956A25009L277j5884k879J4650J4237J0828k3005j5473k0155l610J2187l7990
9944F1192k2269M3258M7137L977k6737o28M349j3365n35k6019l1959j8391M987
9931B4997L3383M764j8344J2803p325k0263M6891K9640r368k9279K188J5106R472
$$ plain form
10018 123617 152063 166601 180425 153627 118961 67616 69088 73445 75338 93754 112949 133154
10006 133154 140573 96787 66930 52388 72958 53181 55049 65377 135884 128594 94889 69681
9994 69681 73776 76575 74411 74281 97330 106800 120439 101489 93580 75732 67253 69982 82708 109470
9980 109470 141788 181818 145318 112517 101900 110825 91069 80176 98055 83425 60083 86244
9968 86244 99086 116416 135667 133517 103266 66502 115814 130517 131758 115185 108265 125009
9956 125009 128286 112402 109523 124173 138410 149238 126233 110760 90605 86995 99182 61192
9944 61192 38923 82181 129318 133295 106558 105930 110279 96914 96379 70360 38401 20010 24997
9931 24997 58380 63144 44800 57603 50278 30015 76906 106546 97178 67899 70087 85193 94665
9918I4665j3865j3147j2755K233j5100l704o261M7568M9450P797k2487k1649m297
9905H8448m1011M737K9726K0080n50Q041l258p720j3104k2188j3356K1744j71
9892G1418L0593J5069j2922j3865k3590L6454L7379k6695m1175j3665n871N880
9880E9010J5097r261m716k76L5419R611j3653j5348M5545J9315q940k326q620
9867A20857j4001K256L3362p01j6649L1713j8331j036j8518j1928L1540K3408
9855A61972k9947m3820m196K0772j714J6908K5172J987k4120k4780N090K3537
9843A26861J1826j6441L625j205k2190p477j6435j5468r302j5511m898N57j3195
9830B0747L2767P8045L249o0609j3054O538J1697j1991j5654N965J1926M267L5915
$$ plain form
9918 94665 80800 67653 54898 57131 42031 38327 32066 79634 129084 136881 114394 92745 88448
9905 88448 47437 52174 81900 101980 101430 109471 106213 98493 85389 63201 49845 71589 71418
9892 71418 102011 117080 104158 90293 66703 103157 140536 113841 72666 59001 53130 59010
9880 59010 74107 64846 60130 59854 95273 104884 91231 75883 121428 140743 131803 129477 120857
9867 120857 106856 109112 142474 141773 125124 156837 138506 137470 118952 107024 138564 161972
9855 161972 132025 88205 84009 104781 103067 119975 145147 147134 123014 98234 103324 126861
9843 126861 138687 122246 125871 124666 102476 94999 78564 63096 53794 38283 33385 33942 20747
9830 20747 53514 131559 134808 74199 61145 67683 79380 67389 51735 57700 69626 73893 109808
9817A09808j4559J1252M1284L0319p551m0648k887M81j6315J235J6062p459J4543
9804A35565j280M0792J1930k5034K2186J0699l1078m9028k211o437R293O668J8700
9791A40765J4047J2892R167k9199o421k2965m2171L5736M6768K2850K5473j9697
9779A87245k9191Q855O076k9206O237o52m632J5933J6732p38q505n451m9429k334
9765A10940M193L0804K3194j147n282m793K0402k466k9012J1711K1629j3617k7303
9752A39253J3732k1756r953K0235j547P537K7232m0351j1117J2647K591L3819
9740A72322J8864m1831r495J1497K8305K1820k2737l8118M8273M9208n446m5974
9728A86688m5307m097r10j6975L1683L8997m7346l4557L2737n324j5190N526j522
$$ plain form
9817 109808 95249 106501 147785 178104 170553 129905 127018 127499 111184 112419 128481 121022 135565
9804 135565 134285 175077 187007 161973 184159 194858 163780 114752 112541 106104 115397 122065 140765
9791 140765 154812 167704 176871 147672 141251 118286 76115 111851 158619 181469 206942 187245
9779 187245 158054 166909 172985 143779 150016 149364 144732 160665 177397 176659 168154 162703 113274 110940
9765 110940 115133 145937 169131 167984 162702 157909 178311 175845 146833 158544 180173 166556 139253
9752 139253 152985 131229 121276 141511 139964 147501 174733 134382 123265 135912 138503 172322
9740 172322 191186 149355 139860 151357 179662 201482 178745 140627 188900 238108 232662 186688
9728 186688 141381 137284 136374 119399 151082 190079 142733 108176 140913 135589 120399 125925 124403
9715A24403m6321J4850O7262K5164J8994J5955l0831l9291j7610K424J1018k255
9703A43762J1122J899l4584j045L188j916J0939l343k5886K5769O231J2732L2431
9690A81299r515k0953N627K3334M3300j8948L838L1033M951k1931J5631r393o842
9677B21431m638k5782O901L8198J0449M683M9821j1179R090j7967l1418N1486
9665C01075K6511L6179K484k7281l4598j3896k5557J7687L2485K6632o928J0403
9653C45196N280K4748M5531M4496N681j4399M1304J3787q029j8357j0499K8766
9641E03505J5110K1949N5789L543q080J2142k7236J6435L2872j2889r994M1400
9629F44546K7939j3658j0482k0889L2313K7941l4176j2979J2640J0487m245L2187
$$ plain form
9715 124403 78082 92932 160194 185358 204352 220307 189476 150185 132575 134999 146017 143762
9703 143762 154884 156783 122199 121154 124342 122426 133365 130022 104136 129905 136136 148868 181299
9690 181299 171784 150831 156458 179792 223092 204144 207982 239015 243966 222035 237666 228273 221431
9677 221431 216793 191011 197912 236110 246559 251242 301063 289884 298974 281007 249589 301075
9665 301075 327586 363765 366249 338968 304370 290474 264917 282604 315089 341721 334793 345196
9653 345196 350476 375224 420755 465251 470932 456533 497837 511624 503595 485238 474739 503505
9641 503505 518615 540564 596353 599896 591816 603958 576722 593157 626029 613140 603146 644546
9629 644546 672485 658827 648345 627456 659769 687710 653534 640555 653195 663682 659437 691624
9617F91624L3503j9563k9869l7150q743j268j993j4971J1145K7437M7643K3604
9605G21399J8390K4304J0681J4233L7048P019M7941K8478l6853j0671m084j6847
9593H41038j968j8480L0732n0218l7381L4125m6687k1004n560o792J7709m848
9581G30666l2617n667o331L3719J3735k6313k1911L180M9204Q809j1365j2905
9569G22204L6974o006j0287J0386Q034j0038k7220k575J0975K3641j4076l0966
9557G11046k2413l3318j5308L2338P512l2300k7264m459j0561l031q674J249k4602
9544E70215m0507j8342L5094N151j8579n095j2741j0939j9539M677j7884N425
9532D76936j7262J505K5768k2893M0723K5709j8879k8464k0103j7608j0123R442
$$ plain form
9617 691624 725127 705564 675695 638545 629802 628534 626541 611570 622715 650152 697795 721399
9605 721399 739789 764093 774774 789007 826055 833074 881015 909493 872640 861969 857885 841038
9593 841038 839070 820590 851322 801104 763723 797848 751161 730157 724597 717805 735514 730666
9581 730666 698049 692382 686051 719770 733505 707192 685281 688461 737665 746474 735109 722204
9569 722204 759178 753172 742885 753271 761305 751267 724047 721472 732447 756088 742012 711046
9557 711046 688633 655315 640007 672345 679857 647557 620293 615834 605273 602242 593568 594817 570215
9544 570215 529708 511366 546460 551611 533032 527937 515196 504257 484718 489395 471511 476936
9532 476936 459674 461179 486947 464054 504777 530486 511607 483143 463040 445432 435309 444751
9520D44751K3226j3316l2352j8989j3180k7894k0837M6290L9699j0544k6354r595
9508C80905l7180J3521k3422l2658p888J9444L3033o955j7648q727J8979Q617
9496C40021J9221J0333L8784J4656l1140K928K0970K0405M0591j2523J585j9536
9484D46295p4802k159K6697J8528L5841L3178l1564j1160K3298J7832L1120J9527
9472E32631O343K3025K5866O282L350L2673l0838m8128K0932J7016L4065o70J8258
9459F40805K3890n525L4482p471k5229k5540L3220L3246l4761k2J5410K3481M1942
9446G47928q796k3678J1254j226Q910M491J9038k565m8415l354k878k5631l5131
9433F39947L442j2884j7109J5969k0368k025k375R036J2164n964k4744L375J4309
$$ plain form
9520 444751 467977 454661 422309 403320 390140 362246 341409 387699 427398 416854 390500 380905
9508 380905 343725 357246 333824 301166 293278 312722 345755 338800 321152 312425 331404 340021
9496 340021 359242 369575 408359 423015 391875 394803 415773 436178 476769 464246 465831 446295
9484 446295 371493 369334 396031 414559 450400 483578 452014 440854 464152 481984 513104 532631
9472 532631 538974 561999 587865 594147 597497 630170 599332 551204 572136 589152 623217 622547 640805
9459 640805 664695 659170 693652 686181 660952 635412 668632 701878 667117 667095 682505 705986 747928
9446 747928 739132 715454 726708 725482 734392 738883 757921 755356 706941 703587 700709 675078 639947
9433 639947 643389 630505 613396 629365 608997 606972 604597 613633 625797 619833 595089 598464 612773
9420F12773L7637l2102k1643j4108K0987M452J646L214L0341K4168k9308Q620
9408F46677K8288l0587j3201k6713j0055J7179N6078K3968m5272k0316k5536J0871
9396F11381n152J8916K1518J1459R024K8077J573l9866J8535j1106m8O514K4859
9383F95684j0395J7059L1320k1526o401K0809J9773j6914m0757L1463L5686L081
9371G58882j786p575M0897K6675J0968M111R802M8738M935k9544p886M2137L4049
9358I34403L0279K8788n181k7180m182K2893O1387L6334j266N52N229K5722L5326
9345A143104L2251N429J7589N0567J9384L968j6K1935K4668J2896K4345J3132
9333A369252L7811J7437K0060L7439J6492k4854q268L3570O2521K8369J2441L5828
$$ plain form
9420 612773 650410 618308 596665 582557 603544 607996 609642 612856 643197 667365 638057 646677
9408 646677 674965 644378 631177 604464 594409 611588 667666 691634 646362 626046 600510 611381
9396 611381 606229 625145 646663 658122 667146 695223 696796 656930 675465 664359 664311 670825 695684
9383 695684 685289 702348 733668 712142 705741 726550 746323 729409 688652 720115 755801 758882
9371 758882 757096 749521 790418 817093 828061 832172 841974 890712 895647 866103 858217 900354 934403
9358 934403 964682 993470 988289 961109 956927 979820 1041207 1077541 1076275 1076827 1082056 1107778 1143104
9345 1143104 1175355 1180784 1198373 1248940 1268324 1272292 1272276 1294211 1318879 1331775 1356120 1369252
9333 1369252 1407063 1424500 1444560 1481999 1498491 1473637 1465369 1498939 1561460 1589829 1602270 1638098
9321A638098L7589L6692k277k4151J0539J7986O3550L2371J4565N224L7589L790
9309A871565M1965J9778M3101P8028N0859P041N6926Q2423M2630O3410J06150
9298B463876M2975K9893P1731P7274L3923M6200P4048J01095Q8088R7846M7020
9287C173969R0846J21278J08812J27399J17055J53941J15326J52083J75545J46297
9277D482551J55643K12676K04531K09633K00354K12618K15278K32171K59088K46628
9267F631171L07503L44782L52104L73785L69591L68277L78846M42180N25362N33216
9257A0626817N47989N95522O09918O79985O91408P65952P93281Q42198R43629
9248A7096699R27663R38265R86185J077161J106220J166824J244308J301548J383292
$$ plain form
9321 1638098 1675687 1712379 1710102 1685951 1696490 1714476 1778026 1810397 1824962 1830186 1867775 1871565
9309 1871565 1913530 1933308 1976409 2054437 2105296 2112337 2169263 2251686 2294316 2357726 2463876
9298 2463876 2506851 2536744 2608475 2685749 2719672 2765872 2839920 2941015 3029103 3126949 3173969
9287 3173969 3264815 3386093 3494905 3622304 3739359 3893300 4008626 4160709 4336254 4482551
9277 4482551 4638194 4850870 5055401 5265034 5465388 5678006 5893284 6125455 6384543 6631171
9267 6631171 6938674 7283456 7635560 8009345 8378936 8747213 9126059 9568239 10093601 10626817
9257 10626817 11174806 11770328 12380246 13060231 13751639 14517591 15310872 16153070 17096699
9248 17096699 18024362 18962627 19948812 21025973 22132193 23299017 24543325 25844873 27228165
9239B7228165J496756J591505J679824J835888K083024K270425K514169K764119
9231D3463875K965694L202966L457389L635083L850761M052736M248107M279999
9223G3156610M259042M311392M413524M520555M644560M790176M932679N202612
9215A10231150N424697N633014N711162N564059N432832N418091N707131O251718
9207A55373854O697144O833169O761505O509976O378138O459611O660647O832199
9199B08506243O782076O374543N706012M572498L063518J693961O50708l98499
9191B36951060j968042m277411p254399r962510j1311150j1221494j0479351r366569
9183A71110134q250566p336101o721664o574931o734922o690615o341742n735812
$$ plain form
9239 27228165 28724921 30316426 31996250 33832138 35915162 38185587 40699756 43463875
9231 43463875 46429569 49632535 53089924 56725007 60575768 64628504 68876611 73156610
9223 73156610 77415652 81727044 86140568 90661123 95305683 100095859 105028538 110231150
9215 110231150 115655847 121288861 127000023 132564082 137996914 143415005 149122136 155373854
9207 155373854 162070998 168904167 175665672 182175648 188553786 195013397 201674044 208506243
9199 208506243 215288319 221662862 227368874 231941372 235004890 236698851 237349559 236951060
9191 236951060 234983018 230705607 223451208 213488698 202177548 190956054 180476703 171110134
9183 171110134 162859568 155523467 148801803 142226872 135491950 128801335 122459593 116723781
9175A16723781n209166m818576m536974m431486m356445m265274m157971m193750
9167H0754139m306069m270406m119884l882143l623788l325073k995208k735894
9159E1495674k503392k437058k356371k351235k421594k490470k507653k453232
9151C1974669k331962k019775j641265j364858j203242j040966r79322r72369
9143B0420910r19422q62675p93425p75235p05943o79244o95123o66006o21452
9134A3702385o14160o79553o59382o27357m78411m22958m04501m17574l63752
9125I034737l48979l32073l14787l24397l41015k98391k79371k61750k46761k18125
9115F069088k20379k19286k15305j93362j44803j01823j32391j50653j72401j12217
$$ plain form
9175 116723781 111514615 106696039 102159065 97727579 93371134 89105860 84947889 80754139
9167 80754139 76448070 72177664 68057780 64175637 60551849 57226776 54231568 51495674
9159 51495674 48992282 46555224 44198853 41847618 39426024 36935554 34427901 31974669
9151 31974669 29642707 27622932 25981667 24616809 23413567 22372601 21393279 20420910
9143 20420910 19501488 18638813 17845388 17070153 16364210 15684966 14989843 14323837 13702385
9134 13702385 13088225 12408672 11749290 11121933 10643522 10220564 9816063 9398489 9034737
9125 9034737 8685758 8353685 8038898 7714501 7373486 7075095 6795724 6533974 6287213 6069088
9115 6069088 5848709 5629423 5414118 5220756 5075953 4974130 4841739 4691086 4518685 4406468
9105D406468r1809j03024j21510j47753j35619j07516j25437p5197j08189j06407
9095C284007n4288m9994q3126p0420p9546n8471o0979m0076m1723p5503r3842
9084B576039p5857n9627n0112q825k4027q8371n8708k9289l6523l4513j6913l2999
9072B060275n1671n4469j1131l4855m6913M579l5723o1894o3378O578m2212l4526
9060A634660l8847m8209k0825m5414m0998j1157L119j8686k9775k0795M817J8292
9048A386182k0181k9546j5366k9471J5966j8381j1558j5525Q75j3215n5837n5726
9036A138217L8966K1054J636k4644k3072k0207j0686k2645K7178k0886l0478o270
9024A068163m603m4566j3272k9250l1617l2981q673N2200j4565k430J2959j3802
$$ plain form
9105 4406468 4314659 4211635 4090125 3942372 3806753 3699237 3573800 3498603 3390414 3284007
9095 3284007 3229719 3179725 3096599 3026179 2946633 2888162 2827183 2787107 2745384 2669881 2576039
9084 2576039 2500182 2440555 2390443 2381618 2357591 2269220 2210512 2181223 2144700 2110187 2093274 2060275
9072 2060275 2008604 1954135 1943004 1908149 1861236 1865815 1830092 1768198 1704820 1711398 1669186 1634660
9060 1634660 1595813 1547604 1526779 1481365 1440367 1429210 1432329 1413643 1383868 1363073 1367890 1386182
9048 1386182 1366001 1336455 1321089 1291618 1307584 1289203 1277645 1262120 1262995 1249780 1193943 1138217
9036 1138217 1177183 1198237 1199873 1175229 1152157 1131950 1121264 1098619 1125797 1104911 1074433 1068163
9024 1068163 1063560 1018994 1005722 976472 944855 911874 903201 955401 940836 938406 951365 937563
9012I37563M053j914m044j0303j6606o522k0748k8089j9376J7662Q244K84j1220
8999H48984K4944P0334l35o2418M2247J225r452l4499q699J177J8567l3711j2495
8986H45869o316j7351k3852r551J6227n521j4968l6909J1802N3766L2759J4585
8974H60540j3999M620p291j5897N125N104j1684L541K2475J1799K7799K0846J8916
8961I31894j5902m1364j5284P778L3488N569k4272j5376K3145K3285L5760J7075
8949I65796r92n0551n017k0588Q993j183K2630Q853o41p665J413l1706j4120J7044
8935H92266R561M742j1715j3237K1581M7418L4237j709L356J6842K7502q60n4889
8922I75095j0498j3313L3565K9794M1795M83j7963J428K4879L4947M066r371K6736
$$ plain form
9012 937563 941616 939702 935658 925355 908749 902227 881479 853390 834014 851676 859920 860204 848984
8999 848984 873928 944262 943927 881509 923756 924981 915529 881030 872331 873508 892075 858364 845869
8986 845869 839553 822202 798350 788799 805026 799505 784537 747628 759430 813196 845955 860540
8974 860540 846541 851161 843870 827973 833098 838202 826518 830059 852534 864333 892132 912978 931894
8961 931894 915992 874628 859344 867122 900610 906179 881907 866531 889676 912961 948721 965796
8949 965796 964804 914253 909236 888648 897641 896458 919088 927941 927300 919635 921048 889342 875222 892266
8935 892266 901827 906569 894854 881617 903198 950616 984853 983144 986500 1003342 1030844 1029984 975095
8922 975095 964597 951284 984849 1014643 1056438 1056921 1038958 1040386 1065265 1100212 1104278 1094907 1121643
8909A121643R333k0293k2991k4359M1635K0764O278M325n6r845n2641L8758O3107
8896A175658P999K4941L678R251J7498L7213J0397j3783M8631L8651l209k7595
8884A329330J2029j1695J5146M5008J4254J2486L5970K8331J1136j9165K3274
8873A496104K5687p878K5467K8335N0053J0948k5790J4090O059q48K1387N6237
8861A699851M1963L7983J0639L1415P0407N151P26O544J685N3262R033j8820k7193
8848A922646J6714m556O538L3565M0379N5684J7883P560O3773J5931L3389M8183
8836B257689K4855M3059M2624j59N128k593J4460K6389M5088M4484P0737N9880
8824B631641R971P8411N4630P326K9497J513j5967q601l80L7556K9662K7627M9898
$$ plain form
8909 1121643 1130976 1110683 1087692 1063333 1104968 1125732 1132010 1136335 1136279 1126434 1073793 1112551 1175658
8896 1175658 1183657 1208598 1212276 1221527 1239025 1276238 1286635 1272852 1321483 1360134 1356925 1329330
8884 1329330 1341359 1329664 1344810 1389818 1404072 1416558 1452528 1480859 1491995 1472830 1496104
8873 1496104 1521791 1513913 1539380 1567715 1617768 1628716 1602926 1617016 1623075 1622227 1643614 1699851
8861 1699851 1741814 1779797 1790436 1821851 1892258 1897409 1898135 1904679 1906364 1959626 1968659 1949839 1922646
8848 1922646 1939360 1934804 1941342 1974907 2015286 2070970 2088853 2096413 2160186 2176117 2209506 2257689
8836 2257689 2282544 2325603 2368227 2368068 2373196 2370603 2385063 2411452 2456540 2501024 2571761 2631641
8824 2631641 2641612 2720023 2774653 2781979 2811476 2812989 2797022 2788421 2788041 2825597 2855259 2882886 2932784
8811B932784K3686J3639O929L9214K8175K1219L5817J0839M7776L2058J214q656
8799C184694O9223P3763J8122K6128Q9311N0245L9312J9078K4971L8316L4850
8788C668013L0761N0243O0006N2682L2546L1231k2348j3187J9478L2058R407J8948
8776C969838N7228M4549J1834n628L4560J3431J6667P6499P7387J7070L593N3157
8764D370185N9482K1527L7852O7903N7601M0196M540J5634N4328O9450L0884L2138
8752D861720N5150L7444K2214O4105M7409K3458N1102Q6197L2533j2423M6656
8741E315565N7872L6380N4058N9095J8020j962R1840O0659K7967N0232L7887O4053
8729E871666O8280P3323N7128L7603L0747M0439Q0300N8676M7545J00595N5561
$$ plain form
8811 2932784 2956470 2970109 2977038 3016252 3044427 3065646 3101463 3112302 3160078 3192136 3193350 3184694
8799 3184694 3253917 3327680 3345802 3371930 3461241 3511486 3550798 3569876 3594847 3633163 3668013
8788 3668013 3698774 3749017 3809023 3861705 3894251 3925482 3903134 3889947 3909425 3941483 3950890 3969838
8776 3969838 4027066 4071615 4083449 4077821 4112381 4125812 4142479 4218978 4296365 4313435 4317028 4370185
8764 4370185 4429667 4451194 4489046 4556949 4614550 4654746 4659286 4674920 4729248 4798698 4829582 4861720
8752 4861720 4916870 4954314 4976528 5040633 5088042 5111500 5162602 5248799 5281332 5268909 5315565
8741 5315565 5373437 5409817 5463875 5522970 5540990 5539028 5630868 5691527 5719494 5769726 5807613 5871666
8729 5871666 5939946 6013269 6070397 6108000 6138747 6179186 6259486 6318162 6365707 6466302 6521863
8718F521863J6242O3995M2879N8324O8594O3676O9932M8110K4553J7199M0191
8707G035558N8603M9022N6763L3816M3720N8769P9552O0559L3873N5422K7833
8696G593490K0776N4264N5290O0813M8053L8789L5956N7387J2494K1524M2354
8685H041190K0548J2928J9639K4595J8798j2867K0117J8491N5549M3823l7349
8674H225462J2367K6379J7716M6242J0142r312l7305J8066L2295j4041j0775m442
8662H312794o867k8841l7159k9487m181j1478j9922l8940m0834o8463n2163j1998
8650G962461L091m5604m3783m0355l6442k5971n5871n8006o6439p3512l2790k2259
8638G464520l6122o4406m7888o4856m8732m7027j8718m9694j07720m3735l9055
$$ plain form
8718 6521863 6538105 6602100 6644979 6703303 6771897 6835573 6905505 6953615 6978168 6995367 7035558
8707 7035558 7094161 7143183 7199946 7233762 7277482 7336251 7415803 7476362 7510235 7565657 7593490
8696 7593490 7614266 7668530 7723820 7784633 7832686 7871475 7907431 7964818 7977312 7998836 8041190
8685 8041190 8061738 8074666 8094305 8118900 8137698 8124831 8144948 8163439 8218988 8262811 8225462
8674 8225462 8237829 8264208 8281924 8328166 8338308 8328996 8291691 8309757 8342052 8328011 8317236 8312794
8662 8312794 8305927 8277086 8239927 8210440 8206259 8194781 8174859 8135919 8095085 8026622 7974459 7962461
8650 7962461 7965552 7919948 7876165 7835810 7799368 7773397 7717526 7659520 7593081 7519569 7486779 7464520
8638 7464520 7428398 7363992 7316104 7251248 7202516 7155489 7136771 7087077 6979357 6935622 6896567
8627F896567q9245p5979l6680l5880l7099l6410p3914o0490m3915j2482j4108
8616F380365p8694j08246p9254p9288p7689n6967n2329o2177p5946l1323k2033
8605E656419p0763n2492r3261j17857j5977m4544m6122l8046j5392n9523q0059
8594E022383q0248r5125n4782l4127l6177m5975q6146o3839j6240k3856n3852
8583D432016p0369J9167j5874o0192m0839n3654p0264m3367l9993o8075r1198
8572C897358m9260m1157l5273l9670p0340o5341n7452l6016l0094l6738j8594
8561C417423k0246o2124j4093J8744k0697k0058m8130q2455n3230k1425q3014
8550C010695n1389r684k1753n0478o4543k9121m3440k8142q952k6321k2705l7767
$$ plain form
8627 6896567 6807322 6731343 6694663 6658783 6621684 6585274 6511360 6450870 6406955 6394473 6380365
8616 6380365 6301671 6193425 6114171 6034883 5957194 5900227 5847898 5785721 5709775 5678452 5656419
8605 5656419 5585656 5533164 5439903 5322046 5306069 5261525 5215403 5177357 5161965 5102442 5022383
8594 5022383 4942135 4847010 4792228 4758101 4721924 4675949 4589803 4525964 4509724 4485868 4432016
8583 4432016 4361647 4380814 4364940 4304748 4263909 4210255 4139991 4096624 4056631 3988556 3897358
8572 3897358 3848098 3806941 3771668 3731998 3661658 3596317 3538865 3502849 3472755 3436017 3417423
8561 3417423 3397177 3335053 3320960 3339704 3319007 3298949 3250819 3168364 3115134 3093709 3010695
8550 3010695 2959306 2949622 2927869 2877391 2812848 2783727 2740287 2712145 2703193 2676872 2654167 2616400
8538B616400l5073m0453k0756j9006o549j0298p9996l2526j8882k5526j1858k7029
8526B288448j163j1590j9847j3084j4724k8519j2468l3639O420k1098k9922m4160
8514B064654m5445p3594K0644J0260j1252j4223O183j6953l9684l919j9850k2180
8502A854641m9988o5769l871m0306m5574p736J922P736k2273m0147n2928o023
8490A529684o597J93r437l2045Q744n343J4728j9305q466n62k061k1678O489k0436
8476A433908n6242l8175j2846J8541q339k449l1527k6464M472K837l4483j1921
8464A237312J9190q92j2683j6677r374l9291j399n815m6876k8141k4715L028k30
8451A073437o066Q172M7178R589r818K514j2904j2866k5963m2588m6212j8785
$$ plain form
8538 2616400 2581327 2540874 2520118 2501112 2494563 2484265 2404269 2371743 2352861 2327335 2315477 2288448
8526 2288448 2287285 2275695 2255848 2242764 2228040 2199521 2187053 2153414 2159834 2138736 2108814 2064654
8514 2064654 2019209 1945615 1966259 1976519 1965267 1951044 1957227 1940274 1900590 1896671 1876821 1854641
8502 1854641 1804653 1738884 1735013 1694707 1649133 1641397 1643319 1651055 1628782 1588635 1535707 1529684
8490 1529684 1523087 1523280 1513843 1481798 1490542 1485199 1499927 1480622 1472156 1471594 1469533 1447855 1454344 1433908
8476 1433908 1377666 1339491 1326645 1345186 1336847 1334398 1302871 1276407 1280879 1283716 1249233 1237312
8464 1237312 1256502 1255610 1242927 1226250 1216876 1177585 1176186 1170371 1123495 1095354 1070639 1073667 1073437
8451 1073437 1067371 1075543 1122721 1132310 1122492 1125006 1112102 1099236 1073273 1030685 984473 965688
8439I65688j568k7342k0245Q931M5317M9370q256m4367J6795j7082o9833j1440
8427H85968L856J1820K4066j2879k2316l4610n400K7637K4498P830j4747k2305
8415H73418l7557j4334j6130j6704l1673J879k1397L996K4818L1052J3690j1863
8403G99195l5342L809K5436J7477J1227r448o6m18m9202j5141k1066m4995m8953
8390F32513J7955M9469Q860k6214j1274l0510k1995j4795L0354K3722J7514q505
8378F67094k4303l5960J3032J8699O859k9036l2832j3206J1627R141J3148j4847
8366E89416l9361j8400J1985j2275K45o962N7250K3383j1246k366j2645o238n2078
8353E20708K3407M0281J8575j8215l5461k6412j3364j9728j4784R472N672r126
$$ plain form
8439 965688 964120 936778 916533 925464 970781 1020151 1011895 967528 984323 967241 897408 885968
8427 885968 889824 901644 925710 912831 890515 855905 850505 878142 902640 910470 895723 873418
8415 873418 835861 821527 805397 788693 757020 758899 737502 741498 766316 797368 811058 799195
8403 799195 763853 767662 793098 810575 821802 812354 812288 811870 762668 747527 726461 681466 632513
8390 632513 650468 699937 708797 682583 671309 640799 618804 604009 634363 658085 675599 667094
8378 667094 642791 606831 619863 638562 645421 616385 583553 570347 581974 591115 604263 589416
8366 589416 550055 531655 543640 531365 531610 524648 581898 605281 594035 591669 579024 572786 520708
8353 520708 544115 584396 602971 584756 549295 522883 509519 489791 475007 484479 490151 481025
8341D81025J4189l030P333L8321Q133K0m0484J855K6978l0773l9368J2287J8136
8328D94622o601r845M0346J2369l1881k4148m396j9994l0536k6327j535J0077
8316D02151o871m150N424n188k3464N577j6950j0645O619J671K6109J1843j6775
8303C75351P74K0847J2194k8108P264K456m4017m308K8059p520o70K236k1529
8290C43029j0184L717j0353j0015K4188K0316J2245k8450O599J650K035j9493
8278C35284l4846K840j1366R588K5565K5594J6824k8651l0997p291j2539K4196
8266C14201j988j6175j9169q920N991Q474J5180L8784k7745l7056m4935L4589
8254B61231J7439K9944j6336j7193r534n337K2061Q483l656m980n442J1927P443
$$ plain form
8341 481025 495214 492184 499517 537838 545971 545991 505507 507362 534340 503567 464199 476486 494622
8328 494622 488021 478176 518522 530891 499010 474862 470466 450472 419936 393609 392074 402151
8316 402151 395280 391130 396554 391366 367902 373479 356529 345884 352503 354174 380283 392126 375351
8303 375351 376125 396972 409166 381058 388322 390778 346761 342453 370512 362992 362322 364558 343029
8290 343029 332845 336562 326209 316194 340382 360698 372943 344493 351092 352742 354777 335284
8278 335284 300438 303278 291912 301500 327065 352659 369483 340832 309835 302544 290005 314201
8266 314201 312213 296038 276869 267949 273940 282414 297594 336378 308633 271577 226642 261231
8254 261231 278670 308614 292278 275085 265551 260214 282275 290758 287102 282122 276680 288607 296050
8241B96050r300L0850P627j8583J7407r192k9771j491K448J3882m296j8246j863
8228B75522L480k8476Q298j5242k4180j7018j4544K6243j999R949M078r261j0800
8215B06050J3279L4827n518j2761j4508L9651K8085l0886R064N493l9714o1467
8203A71595m747j1239K6376M4082k5662J2491q607Q461L4461K8721J2064p1264
8191B16732l693K0306m695M056j9355l908M0346J665k3243l2823K8794K6027k4126
8178B26083l3640m4873k0476M96Q224L0629L5818M94j1677K9634k5540l6612n109
8165A53451L918J8936n104r236k121k2827Q748J1314m2340N853K7676J6722P246
8152A72236l8247m3635j0568K5265O668K8227J296K3981K5851M8305K5971k7480
$$ plain form
8241 296050 286750 317600 325227 306644 324051 314859 285088 283597 286045 299927 295631 277385 275522
8228 275522 279002 250526 258824 243582 219402 202384 187840 214083 212084 222033 226111 216850 206050
8215 206050 219329 254156 248638 235877 221369 261020 289105 258219 267283 272776 233062 171595
8203 171595 166848 155609 181985 226067 200405 212896 204289 212750 247211 275932 287996 216732
8191 216732 213039 233345 228650 232706 213351 209443 249789 251454 228211 195388 224182 250209 226083
8178 226083 192443 147570 127094 127590 135814 166443 202261 202755 191078 220712 195172 158560 153451
8165 153451 157369 176305 171201 161965 159844 137017 145765 157079 114739 120592 148268 164990 172236
8152 172236 133989 90354 79786 105051 111719 139946 141242 165223 191074 239379 265350 237870
8140B37870m8220k2873m552J8464k2148l8460L5172j71N478j7083m379n038J7271
8127A51331j1358k5935k5221K3164P329k1564q339j4366l4415j6026K1595L7517
8115H3712L0582k783N650J5294r96p031j8558J9822k1649K567J2363L0528K2638
8102A72139k5537k6433M684k1327l5870j2476K5613M2304o438j2181k2762J4417
8090I6133K0558J5917q087N288N588j627J6632j7442p851M937K496Q962M5683
8077A87187m6327l8817K0124k8429k4693k2510L1570O4821j3064l2499j0181J9466
8065A06648J7320K3247J6382P195n1933l4646J0962O130m308k2419r905Q065J9582
8052I2320K5352J9192J3762m484n417K6995m6063k129N133J2708j1720q994K3526
$$ plain form
8140 237870 189650 166777 162225 180689 158541 120081 155253 155082 160560 143477 139098 134060 151331
8127 151331 139973 114038 88817 111981 119310 97746 89407 75041 40626 24600 46195 83712
8115 83712 114294 111511 117161 132455 131459 124428 105870 125692 104043 106610 118973 149501 172139
8102 172139 146602 120169 124853 103526 67656 55180 80793 123097 116659 104478 81716 96133
8090 96133 116691 132608 124521 129809 135397 133770 150402 132960 125109 130046 132542 141504 187187
8077 187187 140860 102043 122167 93738 69045 46535 78105 142926 129862 97363 87182 106648
8065 106648 123968 147215 163597 170792 118859 84213 95175 101305 96997 74578 64673 72738 92320
8052 92320 117672 136864 150626 146142 140725 167720 121657 119528 124661 137369 125649 116655 140181
8039A40181p53q706j2171Q064L6269l2705k8432K1719J8871k9962n215J8540J0375
8026A36075L360J365Q115P038l0872k5539l2512K3646L7901k2053j144j4559l1938
8013E8883r904R806K8355J0550m4391n044N5950L6239n105j8086p27M800J5170
8000A36496l458q110O984J0682j1318k9007L0162J3081l0027J1l9139k2755J7482
7987G1084K5231L2697J3625l6432L807J1167j6361j4940K0838J856k4600K869
7975I0841j6044j7306K17K155J8641J0491N521j2543j5709L317N9009n766p771
7962A15053m651J2655J584Q455j0653l5170m999J5064J2974J7250l5905k7338
7950F4319J3870J5253O055J575j2645k3053J6010p26r129k9880l791K3747M461
$$ plain form
8039 140181 139428 130722 118551 126615 162884 130179 101747 123466 142337 112375 107160 125700 136075
8026 136075 139435 140800 148915 155953 125081 99542 67030 90676 128577 106524 105380 90821 58883
8013 58883 48979 58785 87140 97690 53299 48255 104205 140444 135339 117253 116526 121326 136496
8000 136496 133038 124928 131912 142594 131276 102269 132431 145512 115485 115496 76357 53602 71084
7987 71084 96315 129012 142637 106205 110012 121179 104818 89878 110716 112572 87972 90841
7975 90841 74797 57491 57708 59863 78504 88995 94516 81973 66264 69581 128590 122824 115053
7962 115053 110402 123057 124641 133096 122443 87273 82274 97338 110312 127562 91657 64319
7950 64319 78189 93442 99497 101072 88427 65374 81384 80658 71529 41649 37858 61605 66066
7937F6066J6700O354o610l5719L701N7221K7219J7434k051m4381o1886O923L608
7924E4579J2767N5870K6673k3951l8540Q979L0354j2930k1892k3027K0657n48
7912H8991J0117M802k6947j3362J1783R858j1387L332J411k2610j1138J7019J9937
7899H1806j3556Q819J1341j544J7204O782l9497o347K5463l054l5179m133k2806
7886B5299l7513K9632L0917j108J5219K817j1413m091r867j702K4887k1044l6253
7873E780K3386P377K5821J366j2526j4683j2254L1180O808j4639n381K6899m278
7860F4856j8465k2194j7892J525J7136J3056O400J4908N532J5235k8527l0557
7848B1013L2921J7572Q871K1777k0354k5737o023K3776K3608m274l5528j3234
$$ plain form
7937 66066 82766 89120 82510 46791 50492 107713 134932 152366 150315 105934 44048 50971 54579
7924 54579 67346 123216 149889 125938 87398 96377 126731 113801 91909 68882 89539 88991
7912 88991 99108 103910 76963 63601 75384 85242 73855 77187 78598 55988 44850 61869 81806
7899 81806 68250 77069 88410 86866 104070 110852 71355 65008 90471 87417 52238 48105 25299
7886 25299 -12214 17418 48335 47227 62446 65263 53850 49759 39892 38190 63077 42033 5780
7873 5780 29166 36543 62364 63730 51204 36521 24267 55447 62255 47616 42235 69134 64856
7860 64856 46391 24197 6305 7830 24966 38022 44422 59330 64862 80097 51570 21013
7848 21013 53934 71506 80377 102154 81800 56063 50040 73816 97424 93150 57622 44388
7836D4388J74k2762j1807M1145J3552k2929J6317m073P014J5207k1941k2325m4516
7823a2556K5561K8231k937j0858k1499Q471k1752J8476N824K5264L1147K703l2598
7810D3477k5174j4269l5967l1445J4221K857P594n058J127K7364J9816o378L3324
7797C1489M2218l655J3327k9719m1228m361k4255j2734K0006J6486N1054M6800
7785A05428J9665k5968p9482J534L513L399k6600K9195M0406k6200l8166Q866
7773A5590N763m4340o833L5347J4654q499j4627j8862N396j742K619L182j571
7760a3923N233l499j3727J7080k998N269j4760J4436K0982m0918N879M3048P960
7747C0062r915q699m1921K7898q359j689m639r002j5446J5768M1872j1297J784
$$ plain form
7836 44388 44562 21800 9993 51138 64690 41761 58078 54005 61019 76226 54285 31960 -12556
7823 -12556 13005 41236 38299 27441 5942 14413 -7339 11137 16961 42225 73372 76075 43477
7810 43477 18303 4034 -31933 -63378 -49157 -46300 -38706 -43764 -42637 -15273 4543 -1835 31489
7797 31489 73707 70052 83379 53660 12432 8071 -16184 -28918 -8912 7574 58628 105428
7785 105428 125093 99125 19643 21177 24690 28089 1489 30684 71090 44890 6724 15590
7773 15590 21353 -22987 -29820 5527 20181 11682 -2945 -21807 -16411 -18153 -15534 -12352 -13923
7760 -13923 -8690 -12189 -25916 -8836 -11834 -6565 -21325 -6889 14093 -26825 -20946 22102 30062
7747 30062 20147 11448 -30473 -2575 -10934 -12623 -17262 -26264 -41710 -25942 15930 4633 6417
7734F417M930j556r34l517o657Q631m4426P309L3458k9844O429L7981J7003k8879
7720F345L404j7402o423J0869k4512k955o644j3550Q314K0578p898J3795Q045
7707h034l1352l0192k6525j5517K7719L9033K0342j4322J5663j424N132J0994
7695h483p294j52J5078J4921q341j8280j0389K858m047j5106o304Q019M116n381
7681c8785k4752J3927L2339K6779K3770M78k1393j4693q95J2457J2378P003j3952
7668A4661j7078k6739J982K4507K5964l914m6345K1370J9081j7095k760J4940
7656H574j599q323J8222J126j997j9317k5092R717L9754m755o10j414J8462k13
7642C2535j9944l7371q251p253j9858P285N5533J5385j3435J6203J8402J177j9638
$$ plain form
7734 6417 11347 9791 8857 5340 -1317 7314 -37112 -29803 3655 -26189 -19760 18221 35224 6345
7720 6345 9749 -7653 -14076 -3207 -27719 -30674 -37318 -50868 -42554 -21976 -29874 -16079 -8034
7707 -8034 -39386 -69578 -96103 -111620 -83901 -44868 -24526 -38848 -23185 -24609 -19477 -8483
7695 -8483 -15777 -15929 -851 14070 5729 -12551 -22940 -20082 -24129 -39235 -45539 -37520 -33404 -38785
7681 -38785 -63537 -49610 -17271 9508 33278 33756 12363 -2330 -3225 9232 21610 28613 14661
7668 14661 -2417 -29156 -27174 -2667 23297 19383 -26962 -5592 13489 -3606 -6366 8574
7656 8574 6975 -1348 16874 18000 16003 -3314 -28406 -18689 21065 16310 15700 14286 32748 32535
7642 32535 12591 -24780 -33031 -40284 -60142 -52857 2676 18061 4626 20829 39231 40408 20770
7629B0770j6933j0890P250N825M511j727K5888J4615l1293l6341K6658M0648M968
7616E3949J8918M0729p757m6733q871o081j5227l8374r46K9920L839m059l0571
7603a1264J0623L9347R104m3677l3973J6300J2314P679k682m720J5409J7296J5299
7590D7055k7289n593K4747j724l6154J5572L2988j0817l1198j3283k1626k6599
7578e3921J8115j7947J4022K8513M7659J4781J987j4873n9846p189M189k2390
7566d6900O525O8625J7910m5853j7903J6428m537j4416r180j1343L8867L1391
7554B9614j8902Q735J2378L761J733k8984j0678J1190J7785J4653L499k2521j4592
7541G671j7271J913K7555J9966k5437L2141L5263j5485n5299p606K2585k2208
$$ plain form
7629 20770 3837 -7053 197 6022 10533 8806 34694 49309 18016 -18325 8333 48981 53949
7616 53949 72867 113596 105839 59106 50235 44154 28927 -9447 -10393 19527 23366 19307 -11264
7603 -11264 -641 38706 47810 4133 -29840 -13540 -1226 6453 3771 -949 14460 31756 47055
7590 47055 19766 14173 38920 37196 1042 16614 49602 38785 7587 -5696 -27322 -53921
7578 -53921 -35806 -53753 -39731 -11218 36441 51222 53209 38336 -21510 -28699 -24510 -46900
7566 -46900 -40375 28250 46160 307 -17596 -1168 -5705 -20121 -29301 -40644 -1777 29614
7554 29614 10712 19447 31825 35586 37319 8335 -2343 8847 26632 41285 44784 22263 7671
7541 7671 -9600 -7687 19868 39834 14397 46538 81801 66316 11017 3411 25996 3788
7529C788k7618k1466J6046M9563j9854n7000N848N2064K8438k8346r322K6539
7517A8680J2170k1632m675M818K1670L430j6778k1479j0623K3293K5332O372o486
7504C4092j0418j301K7298K0804j2026l175J3263K862l6628k6253j6069L908J4632
7491A0989J3481L1074J8567j2965k4646m1066o004K6578L7764J8581k8247j6103
7479B8003j3617k2810L9539M0737l0087n883l4873j2695J2805J6170J2270n8778
7467b9219k5433N3545M7731o793p564l8121j7660J2819k151K5244J8247k1618
7455I027L512j2987j9330j1197L3099m596L2437L9331K5351m7741k6839j5396
7443D671j4766l899m322L504L4302L1786k1580j4661J0548j6364J2425M9752K1240
$$ plain form
7529 3788 -23830 -45296 -29250 20313 459 -56541 -50693 1371 29809 1463 -7859 18680
7517 18680 30850 9218 4543 9361 31031 34461 17683 -3796 -14419 8874 34206 40578 34092
7504 34092 23674 22373 49671 70475 58449 55274 68537 71399 34771 8518 -7551 -3643 10989
7491 10989 24470 55544 74111 61146 36500 -4566 -10570 16008 53772 72353 44106 28003
7479 28003 14386 -8424 31115 71852 41765 35882 1009 -11686 1119 17289 29559 -29219
7467 -29219 -54652 -1107 46624 39831 32267 -5854 -23514 -10695 -12846 12398 30645 9027
7455 9027 12539 -448 -19778 -30975 2124 -2472 29965 69296 94647 46906 20067 4671
7443 4671 -10095 -13994 -18316 -14812 19490 51276 29696 15035 25583 9219 21644 71396 92636
7430I2636k4729n1399J8949L6285j998l3189k7886j7790j3850l176k1694l8349
7418h6190J3455L4530m9825j2144N6176L2088l3115j9411L486K9741L6161l8673
7406c3721R999j7465n025M708J3113m8K6687P76M8270J9409j9089l9565K853M22
7392A1324k6017j958j2761Q031N1557j3689K6194J0038K5185L689m1948k6178
7380A3467N584j4841k6576K2463N5283k264k0427k2555n090k3860m971k3076P076
7367c9787o166K5176Q067j5453l0832l9061K3758M1058K461j6550R968L88K7475
7354i498O066K2807M6919j4701M79m1519j3980l282n327J0178j441j9225k6155
7341d8679k3616L6691J5528j1547J8104K2604k5336J1728J6552m5791M631N4841
$$ plain form
7430 92636 67907 16508 35457 71742 69744 36555 8669 -9121 -22971 -26147 -47841 -86190
7418 -86190 -72735 -38205 -88030 -100174 -43998 -11910 -45025 -64436 -60950 -31209 4952 -33721
7406 -33721 -23722 -41187 -46212 -41504 -28391 -28439 -1752 -976 47294 66703 47614 8049 10902 11324
7392 11324 -14693 -16651 -29412 -21381 30176 16487 42681 52719 77904 81593 39645 13467
7380 13467 19051 4210 -22366 97 55380 53116 32689 10134 5044 -18816 -23787 -46863 -39787
7367 -39787 -45953 -20777 -12710 -28163 -58995 -98056 -74298 -33240 -30779 -47329 -37361 -36973 -9498
7354 -9498 -3432 19375 66294 51593 52072 10553 -3427 -6709 -12036 -1858 -3299 -22524 -48679
7341 -48679 -72295 -35604 -20076 -31623 -13519 9085 -16251 -4523 12029 -33762 -29131 25710
7329B5710p935l3992j8748M673J0345q14P39j497j3468k1111K3303L045n545P773
7315b7522j9649J0878J6361J1252k0393m3135K5798O0378J8799K0804m026N778
7303E5323j0603R695m0933m1916J2197J6487j0716q547j7963L219K0041J2214
7291a502L0222j6315L100J4605M201J1776m8692j4644L806J0527j634m5183k9293
7278g9026P362K6446Q322k1276K1822R420K321L7921j5009l6353J4714P325Q315
7265g696m8186l1880j9273k1047L2028K7169K8402O7582K6834m2574n6214m0360
7253h5215q155J9628K4602L5757J546N958M1103K669j2741j2083J708m959k4933
7240a5115l186P348L4086J5086o3518L2299L9827l1692k4659m3768l742Q394K4734
$$ plain form
7329 25710 17775 -16217 -34965 -30292 -19947 -20761 -20022 -21519 -34987 -56098 -32795 -29750 -35295 -27522
7315 -27522 -47171 -36293 -19932 -8680 -29073 -72208 -46410 13968 32767 53571 49545 55323
7303 55323 44720 54415 13482 -28434 -16237 250 -10466 -19013 -36976 -33757 -13716 -1502
7291 -1502 28720 12405 15505 30110 34311 46087 -2605 -17249 -13443 -2916 -4550 -49733 -79026
7278 -79026 -71664 -45218 -36896 -58172 -36350 -26930 -24609 13312 -1697 -38050 -23336 -16011 -7696
7265 -7696 -55882 -87762 -107035 -128082 -96054 -68885 -40483 27099 53933 11359 -44855 -85215
7253 -85215 -93370 -73742 -49140 -13383 -11837 -5879 35224 37893 25152 13069 14777 9818 -15115
7240 -15115 -18301 -10953 23133 38219 -25299 7000 46827 15135 -9524 -53292 -57034 -48640 -23906
7227b3906j2866K2702Q266n925K7843J7671Q359k0509o5051j8185k250M4302N1755
7214C2206Q618j2497l8590m9823j2654K3276P791J2977L2292j3645k5059J9318
7202a5790p533J3610q973l174o923J7134K7032N100k8703n4333k5384M4373O0589
7189A7025J1027k9275J245j2741M38n309K435K0769k3534k6692n267R287J2559
7176b8033j0095n693K968K0499K6177J5523Q665K2625J7388k3875j8398J5984
7164D3735l2638j4948k5194j6710k7835L5882L8175m3294j1001L1265J1287q923
7152b0199O048M9492J62j5816j9236j0182r651j8408l04O597K9505m3356L317
7139d2031L6714k132p831M0655J1290l4622j7876j1498K4403R047K1873J9347
$$ plain form
7227 -23906 -36772 -14070 -5804 -11729 16114 33785 42144 21635 -43416 -61601 -63851 -19549 32206
7214 32206 40824 28327 -10263 -60086 -72740 -49464 -41673 -28696 3596 -10049 -35108 -15790
7202 -15790 -23323 -9713 -18686 -21860 -28783 -11649 15383 20483 -8220 -62553 -87937 -43564 17025
7189 17025 28052 -1223 22 -12719 -12281 -17590 -15155 5614 -17920 -44612 -49879 -40592 -28033
7176 -28033 -38128 -43821 -40853 -20354 5823 21346 30011 52636 70024 46149 27751 43735
7164 43735 11097 -3851 -29045 -45755 -73590 -37708 467 -42827 -53828 -22563 -11276 -20199
7152 -20199 -14151 35341 35503 19687 451 -9731 -19382 -37790 -38094 -31497 -1992 -45348 -42031
7139 -42031 -5317 -7449 -15280 25375 36665 2043 -15833 -27331 -2928 6119 27992 47339
7127D7339j6617k7746k1571L9214j3027j2499j8412J1374j1920j1602K037L9892
7115F462K549j6121L4327m803k8682p651k65j5699M122k601J075l219q801j5663
7101e4970J849L3122L9179J8434k3935l3800k0651j4135o489M39j8170r78J4502
7088f5603L3090L6036J0939O054r888j4673N592J555J2915O325l726j9516k5919
7075b6819k566k4209k8020l152L6574L2164J6185j8639l7199l4683M4180N8969
7063A2785q987j9701o867r092M4407L9984N90j3267l3917l1524j5242J3161J617
7050b6053J2737L8830J7352j4060j3281j4496P343m945m686j1597j0881R369k475
7037a6843o0461Q23M7470L424j4889m2109K0545J5525j3517J916J9715K8135j0819
$$ plain form
7127 47339 30722 2976 -18595 20619 7592 -4907 -23319 -11945 -23865 -35467 -33430 6462
7115 6462 9011 -7110 27217 22414 -6268 -13919 -14184 -29883 -25761 -28362 -27287 -30506 -39307 -54970
7101 -54970 -53121 -19999 19180 37614 13679 -20121 -40772 -54907 -61396 -60957 -79127 -80105 -65603
7088 -65603 -32513 3523 14462 20516 10628 -4045 1547 3102 16017 22342 18616 -900 -26819
7075 -26819 -29385 -53594 -81614 -84766 -48192 -16028 157 -18482 -55681 -90364 -46184 12785
7063 12785 3798 -15903 -22770 -31862 12545 52529 53119 39852 5935 -25589 -40831 -27670 -26053
7050 -26053 -13316 25514 42866 28806 15525 1029 8372 3427 -1259 -12856 -23737 -14368 -16843
7037 -16843 -77304 -76481 -29011 -25587 -40476 -82585 -62040 -46515 -60032 -58116 -38401 -10266 -21085
7024b1085l0533L5549K7807k6911j755J7496K5l3990K9771N596k1630n050J4118
7011a0592J0561k1027j2381P730Q487j7569k0942J4802L2467Q200L280l0719l6321
6998f4024J743J5837m556J0784J1142J0486K870K1469K5676K1467r860j5689l5206
6985g861k9765P097L871m450K8689j139K54M430Q762O105l1825j464J238l614
6971a9672m517p399O1000K9858P458k7085l2113Q146k3617l0680M0859M3188r490
6958C5936j9318O737k3375K0003j9196N014K2373k7603J1988R41K92l097N50L5765
6944D7010K87j4943m2025j8459N874j4100K9703L6001n084k8688m400k7624j6309
6931e2757k0080K7555J4752O45R005j0741J6238j2891l3701k7648M6478N5658
$$ plain form
7024 -21085 -51618 -16069 11738 -15173 -16928 568 593 -33397 -3626 1970 -19660 -24710 -10592
7011 -10592 -31 -21058 -33439 -25709 -17222 -34791 -55733 -40931 -8464 -264 3016 -27703 -64024
6998 -64024 -62281 -46444 -51000 -40216 -29074 -18588 -15718 5751 31427 52894 43034 27345 -7861
6985 -7861 -37626 -30529 -26658 -31108 -2419 -3558 -3304 1126 9888 15993 -15832 -17296 -16058 -19672
6971 -19672 -24189 -31588 29412 59270 66728 39643 7530 15676 -7941 -38621 2238 45426 35936
6958 35936 16618 23355 -20 19983 787 5801 28174 571 12559 13500 13792 10695 11245 47010
6944 47010 47297 32354 -9671 -28130 -22256 -36356 -6653 29348 24264 -4424 -8824 -36448 -52757
6931 -52757 -72837 -45282 -30530 -29885 -20880 -31621 -15383 -28274 -61975 -89623 -43145 12513
6919A2513j14l1500N317L2717o40m5880n306J2776p031N3431J1257R987k4688
6906B2839n3463l5993r045P316J2813N815L3416l829k3819O114p109p903L3103
6893a9745L4974q490k7055J736J0971l6154m3215K5840M1257J0461k1658l5989
6881f7067N44K6437l239O9977j8410k3878J6088J0280K8459J0959j7687J210k0132
6868A3541j5522O501j5556o353j656l5113K0646L3091r26J065O526k3444k2027
6855c9227N884j2982L247K6367K7725J1988k2024L1947k3248K5965k4j8010l4461
6842a6853k5004j2029L3265q334r961n035p106M0204J793l0180J7782K1492k2776
6829b2742q918K3083K4367l9330J263J7119k2260l1978n599K0428O5999K1180
$$ plain form
6919 12513 12399 -19101 -13784 18933 18293 -27587 -32893 -20117 -27148 26283 37540 47527 22839
6906 22839 -30624 -66617 -75662 -68346 -55533 -49718 -16302 -20131 -43950 -37836 -44945 -52848 -19745
6893 -19745 15229 6739 -20316 -18580 -7609 -43763 -86978 -61138 -19881 -9420 -31078 -67067
6881 -67067 -66523 -40086 -43325 26652 8242 -15636 452 10732 39191 50150 32463 33673 13541
6868 13541 -1981 4520 -11036 -17389 -19045 -54158 -33512 -421 -1347 -282 6244 -17200 -39227
6855 -39227 -33343 -46325 -43078 -16711 11014 23002 978 32925 9677 35642 35618 17608 -16853
6842 -16853 -41857 -53886 -20621 -28955 -38916 -43951 -51057 -10853 -9060 -39240 -21458 34 -22742
6829 -22742 -31660 -8577 15790 -23540 -22277 -5158 -27418 -59396 -64995 -44567 21432 42612
6817D2612L124l941N692k2989O280K2395Q10N889j509l8872m8790L282L6859M4158
6803E5000j530m7563n21K4777J2078p086q360m247n080j2384k666k1408n9754
6790g8744k6852K5451L2575K7300J4861o177k1433l038J7207J6486M0646j970
6778C6312k0949k5532l2204k1060J1127P066K0600J1185j4580j8126j1355K4410
6766c3106m691k1436j1351k7907L662J3905L1385r257m772J9211J6917K7436R975
6753I971J6040M267L347J5960o646k444Q82k3633k7307L2026K3284J0813j9277
6740C7283j0692l2292N141L848j993J2959Q528K644J5160l803l3130q840k4470
6727b9657n550q579p852M0945N7266K3589k437R496j6224k0709m838o785l3014
$$ plain form
6817 42612 45736 41795 47487 24498 30778 53173 53983 59872 58363 19491 -29299 -26017 10842 55000
6803 55000 53470 5907 5386 30163 42241 35155 26795 22548 17468 5084 2418 -18990 -78744
6790 -78744 -105596 -80145 -47570 -20270 -5409 -11586 -33019 -36057 -18850 -2364 38282 36312
6778 36312 15363 -10169 -42373 -63433 -52306 -45240 -24640 -13455 -28035 -46161 -57516 -33106
6766 -33106 -37797 -59233 -70584 -98491 -94829 -80924 -49539 -58796 -63568 -44357 -27440 -4 9971
6753 9971 26011 30278 33625 49585 42939 40495 41377 17744 -9563 22463 45747 56560 37283
6740 37283 26591 -5701 -560 3288 1295 14254 22782 25426 40586 36783 3653 -5187 -29657
6727 -29657 -35207 -43786 -51638 -10693 46573 70162 67725 77221 60997 40288 35450 28665 -4349
6714d349M107M417J7602J9734L758k635r023k9300J7532J8886o676k3532J587
6701A2108l902k0431J2327n149k4543K9310J7391O178R059O986M1755k6292j2199
6688D2598J4974j8180m9961j858L8335J3737l6691K6313K3849J4105j9530M725
6676E2416P246k4700j370J3327q6209o0715p070J0707L0008K4505K3427J1211
6664g217n5636J000j9580k3566J2004q522l885J4547M664j3833R577M4139J69
6651d6139j4993r979n912q744O2688K1264k6559J8025L2817J0215l7655J5919
6639A0947L1376j796M965K0232r785k4071k200l2965n3317j4028P848L2804J9184
6626a0806L9778N881k9126O288j8804l1050J2812r316o700j8072J7517q453J2947
$$ plain form
6714 -4349 -242 4175 21777 41511 45269 42634 33611 4311 21843 40729 34053 10521 12108
6701 12108 8206 -12225 102 -5047 -29590 -280 17111 23289 32348 39334 81089 54797 42598
6688 42598 57572 39392 -10569 -12427 25908 39645 2954 29267 53116 67221 47691 52416
6676 52416 59662 34962 33592 46919 -39290 -100005 -107075 -96368 -66360 -41855 -18428 -7217
6664 -7217 -62853 -61853 -81433 -104999 -92995 -101517 -105402 -90855 -86191 -100024 -90447 -46308 -46139
6651 -46139 -61132 -71111 -77023 -85767 -23079 -1815 -28374 -10349 22468 32683 -4972 10947
6639 10947 42323 40527 45492 65724 55939 31868 29668 -3297 -56614 -70642 -62794 -29990 -10806
6626 -10806 28972 34853 5727 12015 -6789 -37839 -25027 -34343 -41043 -59115 -41598 -50051 -37104
6613c7104J6178o337l5081k6173L2198L394K2755J4009k6551m678R362J8935N3745
6600C4652p831k4114l2200j0405O736J1917p574j6390j0485K6716K5084k8825
6588c2719K2710K8912l0770J1205N129p376k2148j2660J3329N0661j9304m1642
6576c4673j1461J8739k9982l627L3652J377r676M6279J6783J8475j216l8862j7479
6563a1671m5007J7587K6379j0463m3489Q919L3016L405k913K6492N699R844L3105
6550E0903m809n7361L220M5900J9691l2030l9814R51m3600J3173j6066J1670M7368
6537h04L1979l3742l9811j1434L1811K4872N152k2107M810J6841J8970j6511m0585
6524c0559k0456j6877m0112K8707L7313q116N969J2735K2393L9603R248n6002
$$ plain form
6613 -37104 -20926 -27263 -62344 -88517 -56319 -52925 -30170 -16161 -42712 -47390 -38028 -19093 34652
6600 34652 26821 2707 -29493 -39898 -33162 -21245 -28819 -45209 -55694 -28978 -3894 -32719
6588 -32719 -10009 18903 -11867 -662 4467 -2909 -25057 -37717 -24388 26273 6969 -34673
6576 -34673 -46134 -27395 -57377 -61004 -27352 -25975 -35651 10628 27411 45886 44670 5808 -11671
6563 -11671 -56678 -39091 -12712 -23175 -66664 -57745 -24729 -21324 -24237 2255 7954 17798 50903
6550 50903 46094 -11267 -8047 37853 57544 25514 -14300 -13349 -56949 -43776 -59842 -48172 -804
6537 -804 31175 -2567 -42378 -53812 -22001 2871 8023 -14084 -9274 7567 26537 10026 -30559
6524 -30559 -51015 -67892 -108004 -79297 -41984 -50100 -44131 -31396 -9003 30600 39848 -16154
6512a6154J1709j2837n527N69J3536P346L4771r515j0606o082o809k2966j4815
6499c7380J2139O260L35o092J9218k6590N667O2674J4226j0832k1711o4968k9861
6486g6915O551K5379L017j6095M3435K6450r757l2032j2436J0098L1975M3733
6474D3403l1136j2784j0587k2861J7670R400l0303J275K9780K8715K6845q28l6518
6461A2071Q434J2994O478j758m5805J1372n771l1270k3284O112j0578j1128j663
6448g3796l245J4883j6501j6552P502k150J6639M5615r774j1093k1722L4535j1256
6435d6915J1809R822k493R866M71j7590n171O164N578j1384K6928K0473k3726
6422a6168k4933J4828o45n624j2920k791r615K6081J1732k5551K6433L3370l1530
$$ plain form
6512 -16154 -4445 -17282 -22809 -22240 -8704 -1358 33413 23898 13292 7210 401 -22565 -37380
6499 -37380 -25241 -18981 -18646 -24738 -5520 -32110 -26443 36231 50457 39625 17914 -47054 -76915
6486 -76915 -70364 -44985 -41968 -58063 -14628 11822 2065 -29967 -42403 -32305 -330 43403
6474 43403 12267 -517 -11104 -33965 -16295 -6895 -37198 -35923 -6143 22572 49417 48589 12071
6461 12071 20505 33499 39977 38219 -7586 3786 -1985 -33255 -56539 -50427 -61005 -72133 -73796
6448 -73796 -77041 -62158 -78659 -95211 -87709 -89859 -73220 -27605 -37379 -48472 -70194 -35659 -46915
6435 -46915 -35106 -25284 -27777 -17911 -17440 -35030 -40201 -34037 -28459 -39843 -12915 7558 -16168
6422 -16168 -41101 -26273 -26918 -32542 -45462 -48253 -57868 -31787 -20055 -45606 -19173 14197 -17333
6409a7333j0899r709k1963p430K6547J5680j0635l9560K8629Q560N506n166j0221
6396d7994O147M0350M2017L1363j5232k4168k5996J602q502J2468J067N648N598
6383B4368m2694j511J4160j3752K0465J40j7719j2908j7631k9749J6534J3837
6371d6460J793L4434K0594O801l7167j1451J9065M564j9433Q704j1059J2255k0335
6358c7695m2740j1657M454J5373j805M2510j502k7793j4863j6698N6715k0102
6346e5803l9314j7070P764J6596J8049L5026P906L2250J9987O261M600m9621K074
6333a1295J3992m0942j1592R159M5558R66l2441m4469Q243M357K0914n920k2357
6320f5827J4229Q268J4627j0536J4406K8799p355m1103L1J9562L2179K6785j6809
$$ plain form
6409 -17333 -28232 -37941 -59904 -67334 -40787 -25107 -35742 -75302 -46673 -38113 -32607 -37773 -47994
6396 -47994 -41847 -1497 40520 71883 56651 32483 6487 8089 -413 12055 13122 18770 24368
6383 24368 -18326 -19837 -5677 -19429 1036 1176 -16543 -29451 -47082 -76831 -60297 -46460
6371 -46460 -44667 -10233 10361 17162 -20005 -31456 -12391 -7827 -27260 -18556 -29615 -17360 -37695
6358 -37695 -80435 -92092 -87638 -72265 -74070 -31560 -33062 -60855 -75718 -92416 -35701 -55803
6346 -55803 -95117 -112187 -104423 -87827 -69778 -34752 -26846 5404 25391 31652 36252 -13369 -11295
6333 -11295 2697 -38245 -49837 -40678 4880 5846 -26595 -71064 -62821 -58464 -37550 -43470 -65827
6320 -65827 -51598 -43330 -28703 -39239 -24833 3966 -3389 -44492 -44461 -24899 7280 34065 17256
6307A7256m0607j9258M906J5573q748l2414J3390J5634J967N777K0842r139M9426
6294C4605l461o98l0103n8618j4862K2985M0426k2230k6904K1183L6019k54k4781
6281b6693L915J4482J8431L1545o146j6758l9852n212k7171j2386j1279N3469
6269b3655N854r292N227l368P76l7053l392L5388K592L0841K898j6121l654J3137
6255A78j9023k8122k9339K1843N8029N0565m153L3689k1798l5934j9969P166O6
6242A3198k4970M654K566J949j0088M3624N464o215K2896l546m3302l3392J2390
6229a4772Q990J4549j6987j1549L0015P808l8328Q241j4527M1186j9751n1661
6217e6786K1516L9025k2997k0492J2872j6126j610j1886o70L3282J8410J8322
$$ plain form
6307 17256 -23351 -42609 -37703 -22130 -30878 -63292 -49902 -34268 -32301 -26524 -5682 -14821 34605
6294 34605 31144 30446 343 -58275 -73137 -50152 -9726 -31956 -58860 -37677 -1658 -1912 -26693
6281 -26693 -22778 -8296 10135 41680 35534 18776 -21076 -26288 -53459 -65845 -77124 -23655
6269 -23655 -17801 -27093 -21866 -25234 -24458 -61511 -64903 -29515 -26923 3918 6816 -9305 -12959 178
6255 178 -18845 -46967 -76306 -54463 3566 54131 49978 83667 61869 25935 5966 13132 13198
6242 13198 -11772 -7118 -4552 -2603 -12691 30933 36397 30182 53078 49532 6230 -27162 -14772
6229 -14772 -5782 8767 -8220 -19769 10246 18054 -20274 -12033 -26560 14626 -5125 -56786
6217 -56786 -35270 3755 -19242 -39734 -26862 -42988 -44598 -56484 -57154 -23872 -5462 12860
6205A2860M423M019j3610k5541L400L1909j1209m4071j4779K3043J6717j8930
6193c1769n578J9203J0250J0369J6537J721l1894j6745M1066R512o20l6095J0279
6180c764K4911k5304m0580p510n1j7445M0406k9341N013J1892q004k8204L7400
6167d0581J0432N3443j2795l0348k1576R339K2243k0572o80M527k7694j9861j1210
6154h5333r124K6771R303L626j7199q389j227K4747J4368Q243J629l6689O6266
6141c008q54k2456M937M603L3786j5818l2558J9341q561l5026l536J3457k9261
6128g4954j1531n170J3020L2853j1691J0628L4973J345J2014k999m1951l4629
6116g8092R2N970m170N170r013l1097N5983J9306L8425L6462l5203k8376r543
$$ plain form
6205 12860 17283 21302 7692 -17849 -14449 17460 6251 -37820 -52599 -29556 -12839 -31769
6193 -31769 -37347 -18144 -7894 2475 19012 20733 -11161 -27906 13160 22672 22052 -14043 -3764
6180 -3764 21147 -4157 -44737 -52247 -52298 -69743 -29337 -58678 -53665 -41773 -49777 -77981 -40581
6167 -40581 -30149 23294 10499 -19849 -41425 -32086 -9843 -30415 -31095 -26568 -54262 -74123 -85333
6154 -85333 -94457 -67686 -58383 -54757 -71956 -80345 -81572 -56825 -42457 -34214 -32585 -69274 -3008
6141 -3008 -3862 -26318 -21381 -16778 17008 1190 -31368 -12027 -20588 -55614 -59150 -45693 -74954
6128 -74954 -86485 -91655 -78635 -45782 -57473 -46845 -11872 -10527 1487 -1512 -43463 -78092
6116 -78092 -78000 -72030 -76200 -71030 -80043 -111140 -55157 -35851 2574 39036 3833 -24543 -34086
6103c4086j6033L1528J1517J4909j2771j83j4458P411j1214l6354j9205j4677
6091i3616K9106N9812M201k9154O400Q176j4943K801J484n477J1580J9546j7440
6078a7524M547K5683J4575m2763p902K4744p11l5320k3428L1597M5800n529l5188
6065b1419Q74L1907j7101l5498J7088M5629R573k572k6872j6169K0020l3818j3079
6052d1437J9138J9710k4766O821J7644r285j7726j2226j5128j910r48J7255p342
6039e0200p103K033K7754M7905m392k4713J9216K852j0300j18j6543j0502K793
6026b1318k0835m4604J0658L8020L3665L5525o178k1270k5408l0130M3057k2267
6014c1085N389J9430j0747k7591J8016j4247k6564N5180K9207J194j7695j3999
$$ plain form
6103 -34086 -50119 -18591 -7074 7835 -4936 -5119 -19577 -12166 -23380 -59734 -78939 -93616
6091 -93616 -64510 -4698 -497 -29651 -23251 -15075 -30018 -27217 -25733 -31210 -19630 -84 -17524
6078 -17524 -12977 12706 27281 -15482 -23384 1360 649 -34671 -58099 -26502 19298 13769 -21419
6065 -21419 -20545 11362 -5739 -41237 -24149 21480 31053 28481 1609 -14560 5460 -28358 -41437
6052 -41437 -22299 -2589 -27355 -20534 -2890 -12175 -29901 -42127 -57255 -59165 -60113 -42858 -50200
6039 -50200 -57303 -55270 -27516 20389 15997 -8716 10500 13352 3052 2934 -13609 -24111 -21318
6026 -21318 -42153 -86757 -76099 -38079 -4414 31111 24933 3663 -21745 -51875 -8818 -31085
6014 -31085 -25696 -6266 -17013 -44604 -26588 -40835 -67399 -12219 16988 18182 487 -13512
6002a3512J0878P209L15k1930l2460K2671O2171J1657l6667k5418j9749k791J2832
5989b4794J7919n090K0047L2343j8749j8333j7528J3704m334p86P400j4792k5313
5976c8306o460J405k2567L2384L0845j1041J9207P930P890k6209l9448k0354K4843
5963c9881K089l7022K4428M3075K7919p917K9282M192j9765n698j5879k0660P829
5950h008K1957L32Q758o931n6892K2910j1406j8077J7388J3814l0787j8865j9447
5937h5254J766K9630K2812j1794M77J8802M250m939J2434O0247K4575j9030l3605
5924B0371k1716K6852N360k1644l7570q408J489P32K2387K9826j8137j9207J1697
5911g968L3097k6518l5625J7140J6333J635j8356l0277M446k923M9513Q178l7342
$$ plain form
6002 -13512 -2634 4575 4890 -17040 -49500 -26829 35342 46999 10332 -15086 -34835 -37626 -24794
5989 -24794 -6875 -11965 8082 40425 21676 3343 -14185 -481 -4815 -5601 1799 -12993 -38306
5976 -38306 -44766 -43361 -65928 -33544 -2699 -13740 5467 13397 21287 -4922 -44370 -64724 -39881
5963 -39881 -37792 -74814 -50386 -7311 20608 12691 41973 46165 26400 20702 4823 -15837 -8008
5950 -8008 13949 14281 23039 16108 -40784 -17874 -29280 -47357 -29969 -16155 -46942 -65807 -85254
5937 -85254 -83488 -53858 -31046 -42840 -42363 -23561 -19311 -24250 -11816 48431 73006 53976 20371
5924 20371 -1345 25507 30867 9223 -28347 -36755 -35266 -34534 -12147 17679 -458 -19665 -7968
5911 -7968 25129 -1389 -37014 -19874 -3541 -1906 -20262 -50539 -46093 -49016 497 8675 -28667
5898b8667j8280K1979n889o506J1152M029K1534j7959K207k795l4729J6642L3893
5885c389J7896L966J9014J3390m5103k4243J603j5179L665J1469n985m5649j7185
5872h5730K8882P149K8727L6N262J1047N655k2063j5593j9381m4607l88J1536
5859h9468J6003L0044J0021N6606J5633j4717j1141n382j6067k4162Q778J3304
5847a0548l1409j2201j8867K6896p149M126O072o878o126K5904L3776J9420j4612
5834H404j1609j5465r637j4090N650j6544l898M1154q417j4990j3213N918M2J9274
5820b7421L7086K718p779K1076k8151J4073J6248k3556j7945j8585l272k72p466
5807d3246J7809L1231L4243J4124k1952p219J8047N745j1542L611O555j5178j0376
$$ plain form
5898 -28667 -46947 -24968 -30857 -37363 -26211 -22182 -648 -18607 -16400 -19195 -53924 -37282 -3389
5885 -3389 14507 18473 37487 50877 5774 -18469 -16866 -32045 -28380 -16911 -22896 -68545 -85730
5872 -85730 -56848 -49699 -20972 -20936 -15674 -4627 1028 -21035 -36628 -56009 -100616 -101004 -89468
5859 -89468 -73465 -43421 -33400 23206 38839 24122 12981 7599 -8468 -32630 -23852 -10548
5847 -10548 -41957 -54158 -73025 -46129 -53278 -49152 -43080 -49958 -56084 -30180 3596 23016 8404
5834 8404 -3205 -18670 -28307 -42397 -36747 -53291 -57189 -16035 -24452 -39442 -52655 -46737 -46695 -27421
5820 -27421 9665 12383 4604 25680 -2471 11602 27850 4294 -13651 -32236 -35508 -35780 -43246
5807 -43246 -25437 5794 40037 54161 32209 24990 43037 48782 37240 40851 47406 32228 21852
5794B1852m689M495R22j524k9122n7234n0104K9751J7519j1455o574L0658K0247
5781c5258J4689O625m51j7738J4593R212k0410N768J1703o994p244m340J5660
5768a4185L2653m17j6028J9406p148l6067j3024J7305J4390N300k3782J5708K3287
5755A7398K0769k6923k1780J1427K232k725q405j7642K073L057K7566K0943J6761
5742D4751K0103j5556k0790k2544j2197N516J7319k540j5413j3872L3287j0256
5730G808j8679j7821Q832k2604j8375J8986K3439K0957R334J9716R004k6747k3685
5717i835j8140L243P464N009K0694j5774j3150P349K7629P446K045m8154l7643
5704f1817j02J2575j0753P021J0757N324J6494J7423K3395j8692m7539J508O278
$$ plain form
5794 21852 17163 21658 22580 21056 -8066 -65300 -115404 -85653 -68134 -79589 -86163 -55505 -35258
5781 -35258 -20569 -13944 -14395 -32133 -17540 -8328 -28738 -22970 -11267 -18261 -25505 -29845 -14185
5768 -14185 18468 18051 2023 21429 14281 -21786 -34810 -17505 -3115 2185 -21597 -5889 17398
5755 17398 38167 11244 -10536 891 3123 398 -8007 -25649 -23576 -20519 7047 27990 44751
5742 44751 64854 49298 28508 5964 -6233 -717 16602 14062 -1351 -15223 18064 7808
5730 7808 -10871 -28692 -19860 -42464 -60839 -41853 -18414 2543 11877 31593 40597 13850 -9835
5717 -9835 -27975 -24732 -17268 -12259 8435 -7339 -20489 -13140 14489 21935 23980 -24174 -61817
5704 -61817 -61919 -49344 -60097 -53076 -42319 -36995 -20501 -3078 20317 1625 -45914 -44406 -38128
5691c8128M3852r760J917l0371j6312k840L2453P142l840l053K6988K5817r665
5678B4200l509M934l3975k7967R546k069K3750J3264R008m944j9539j2191k085
5665b1577K9475k3078o0850L843K9088j4440K766K5378J1554m893j671M920K4672
5652E187J577J2608N420l7967l790K7099J7794j6149r286k3508j6815j60P576
5639c0414o56K5877K1994J9338j0605m263j1396o674K0200L4135j6449k4011l2675
5626a5599J2042k1084Q697J3362o516M285J4003m9737n2333K9350J1264j6482
5614f8748j6981K4587K4070Q555p865K7495K4564j8788J9087K1455K6337k0192
5602D3576m4769J1702J3411j6475Q55k6523k4024O681K7449l0857Q174J618j1271
$$ plain form
5691 -38128 5724 -4036 -2119 -32490 -48802 -51642 -19189 -12047 -15887 -18940 8048 33865 24200
5678 24200 20691 25625 -8350 -36317 -26771 -28840 -5090 8174 17182 12238 -7301 -19492 -21577
5665 -21577 7898 -15180 -76030 -72187 -43099 -57539 -54773 -29395 -17841 -22734 -24405 -19485 5187
5652 5187 6764 19372 24792 -13175 -16965 10134 27928 11779 2493 -21015 -37830 -37990 -30414
5639 -30414 -31070 -5193 16801 36139 25534 21271 9875 3201 23401 57536 41087 17076 -15599
5626 -15599 -3557 -24641 -15944 -2582 -9098 -4813 9190 -40547 -92880 -63530 -52266 -68748
5614 -68748 -85729 -61142 -37072 -28517 -36382 -8887 15677 -3111 15976 37431 63768 43576
5602 43576 -1193 10509 23920 7445 8300 -18223 -42247 -35566 -8117 -38974 -30800 -29182 -40453
5589d0453j3566Q006L42j2631K476O442J0093J1046n032k0747p32O531K2514K9578
5575C867J8397R305L940j3106j8051J3764N146j9708j7955j3712N141K0215J7701
5562A4944k4895k2428J9704l2276J2850M3325J0676l0967j3952J7203J5708Q969
5550A8861L0281J4973N382l0932o61j6515j5492l562K3724k658N821l1631j9888
5537b2297J1697N07M8J2209r010k6200k2613J5079J7099M5241n812m1886k4906
5524e0844L594K6895K7118k8338N386j322M0156K2985j2539l4994P578k584k2226
5511a9135l1716J8036R168R708K1789j3982j7927l6150j9451J5374O9233j1884
5499f937J2263O617O476k0776j6742p99L3721J7571r333j1851j4602n8155j3231
$$ plain form
5589 -40453 -54019 -46013 -45671 -58302 -55826 -49384 -39291 -28245 -33277 -54024 -54756 -48225 -25711 3867
5575 3867 22264 31569 35509 22403 4352 18116 23262 3554 -14401 -28113 -22972 -2757 14944
5562 14944 -9951 -32379 -12675 -44951 -32101 11224 21900 -9067 -23019 -5816 9892 18861
5550 18861 49142 64115 69497 38565 37904 21389 5897 2335 26059 23401 29222 -2409 -22297
5537 -22297 -10600 -10093 -10045 2164 -6846 -33046 -55659 -40580 -23481 21760 15948 -25938 -50844
5524 -50844 -47250 -20355 6763 -21575 -16189 -17511 22645 45630 33091 -1903 5675 3091 -19135
5511 -19135 -50851 -32815 -23647 -13939 7850 -6132 -24059 -60209 -79660 -64286 4947 -6937
5499 -6937 5326 11943 18419 -2357 -19099 -19898 13823 31394 22061 10210 -4392 -62547 -75778
5486g5778M2460q825O411M3059K3488L5879L8761R069l3249l5017k2718K9863
5474E3403K3229J6466l8934o6376j1859m786j0192p711L5418M4449M827k1184
5462A6750m3473l3314J8316J1977L808J9070M628j9004K0032k2807K1760J2691
5450A0434J5912J9219q338l5309K961J2890j175N658q266J64J423k7978r404P296
5436a4513L3504J9031j8567j0648J4192M4834J191J043J7157l0851k7238k9021
5424A14j0328R714k7207r43n562J2797J5779K3965j3964j1307K560K923P484j2237
5410f212k3628P62J7938L0050j0471K319p259l516J8301k907k8647k3310J2317
5397b4263K2564k7675k1751J7558M9822N243l6515m1023k7917M65L470K135j3258
$$ plain form
5486 -75778 -33318 -42143 -35732 7327 30815 66694 105455 114524 81275 46258 23540 53403
5474 53403 76632 93098 54164 -12212 -24071 -28857 -39049 -46760 -11342 33107 37934 16750
5462 16750 -26723 -60037 -41721 -29744 -25936 -6866 -2238 -21242 -1210 -24017 -2257 10434
5450 10434 26346 45565 37227 1918 4879 17769 16594 22252 13986 14150 15573 -12405 -21809 -14513
5436 -14513 18991 38022 19455 8807 22999 67833 69024 70067 87224 56373 29135 114
5424 114 -10214 -500 -27707 -28650 -34212 -21415 -5636 18329 4365 -6942 -4382 -1459 6025 -6212
5410 -6212 -29840 -29078 -11140 18910 8439 10758 3499 -17 18284 15377 -13270 -36580 -24263
5397 -24263 -1699 -29374 -51125 -33567 16255 21498 -15017 -56040 -83957 -83492 -80022 -77887 -91145
5384i1145k899j3185l95k5206O5041L2948j4808n803J9073K6159l7671l1702J0503
5371f9090J0343O98j525K6651L0792k2703j6880p678m390K2097j2247q36J4706
5358c0062p644l484J7270n968j9730P539J4386J7153P633J3215K5045l2352J0449
5345A3450j482l1382J7033l0206j0932J082J1978M7726J4404l1402J0086N630
5333A5985l317m1785j3126J7682k1073n263O128k6894m998J3611n53O0376M1435
5320C8208L177j6143m679j8754k2192j9435k6321J2112K839j6003J6429J3855
5308c6907J8051n380q836k8408l281M0797J3391K3706R330j4680K493j492m7582
5295c8798J034M0935K8905l0564J87O864m193p799j619K0012j4619k3511J1152
$$ plain form
5384 -91145 -94044 -107229 -107624 -132830 -67789 -34841 -49649 -55452 -36379 -10220 -47891 -79593 -69090
5371 -69090 -58747 -58049 -59574 -32923 -2131 -24834 -41714 -49392 -53782 -31685 -43932 -44768 -30062
5358 -30062 -37706 -41190 -23920 -29888 -49618 -42079 -27693 -10540 -2907 10308 35353 3001 13450
5345 13450 11968 -19414 -2381 -32587 -43519 -42437 -30459 17267 31671 269 10355 15985
5333 15985 12668 -29117 -42243 -24561 -45634 -50897 -44769 -71663 -76661 -63050 -63603 -3227 38208
5320 38208 41385 25242 20563 1809 -20383 -39818 -66139 -54027 -51188 -67191 -50762 -36907
5308 -36907 -18856 -24236 -33072 -61480 -64761 -23964 -10573 13133 22463 7783 10276 8784 -38798
5295 -38798 -37764 3171 32076 1512 1699 8563 4370 -3429 -5048 14964 345 -23166 -12014
5282a2014L6731P279l0824k6511L6061m546n954k4974k329J7798Q714K0537m340
5269A5628o429k16l4575M501k616K9924l2177j0817K5956p43j3443j4990p840
5256d7837K3420n897m664n086m404K6791J7461k3917l170K982N250K9179L139
5243A3247m96k5093J1411j0270k1033O202j7364k0122M0394K1089K0211K6507
5231D4683k1718m0958K4254K4146J2986l2269l6028o795j2811P082n311J5492
5219b7247R738L542o178m0474o231K2285K6977J2723K2850K8014J8187j4927l5370
5206A3889l9526k0405k8484n66P623P800N3890n124J04K2377R881P799n117M000
5192B8141L3997j0317j7850l243L94j2137k8615j977K5550j4797K001L397L402
$$ plain form
5282 -12014 24717 31996 1172 -25339 10722 6176 222 -24752 -27081 -9283 -569 19968 15628
5269 15628 9199 8983 -25592 -21091 -23707 6217 -25960 -36777 -10821 -11564 -25007 -39997 -47837
5256 -47837 -24417 -30314 -34978 -40064 -44468 -17677 -216 -24133 -27303 -24321 -19071 10108 13247
5243 13247 12751 -12342 -931 -11201 -32234 -26032 -43396 -63518 -23124 -2035 18176 44683
5231 44683 22965 -17993 6261 30407 43393 11124 -24904 -31699 -44510 -37428 -42739 -27247
5219 -27247 -17509 -13967 -20145 -60619 -66850 -44565 -17588 -4865 17985 45999 64186 49259 13889
5206 13889 -25637 -46042 -74526 -75092 -67469 -59669 -5779 -10903 -10799 11578 21459 29258 24141 28141
5192 28141 62138 51821 33971 30728 31122 18985 -9630 -11607 13943 -854 1147 4544 7946
5179G946J1808k6678j3513J51O316L1935k3788l7702r937J7876L1315J1168M958
5166A1855k50P262K4303k116l3089l0721K828J81k8197j3143K8555K3647J7200
5153H315K6665j6895l4472j9262j2843P361L8480N631k2950j052P561j9879j0317
5140d3657K1646j6696P415J2993J3874N510R113O69k2850q58J1232o846K1844
5127A3389M0644o023p255j2359m3251m790j9991k7761K1624K5697n721J4059N548
5114f190J4636l5714m2721j1086J2574M5605K3009J6396q301J2218m2109o8198
5102h9881M649J1977j590l193J5296K541j2866j3724j8717J7481L4284J6055o192
5089d3880k0292J8412L2635K2350k0060j1228Q478j7955l1957J1978K7293j2898
$$ plain form
5179 7946 19754 -6924 -20437 -20286 -13970 17965 -5823 -43525 -53462 -35586 -4271 6897 11855
5166 11855 11605 18867 43170 41054 7965 -22756 -19928 -19747 -47944 -61087 -32532 -8885 8315
5153 8315 34980 18085 -16387 -35649 -48492 -41131 -2651 2980 -19970 -21022 -13461 -33340 -43657
5140 -43657 -22011 -38707 -31292 -18299 -4425 1085 10198 10867 -11983 -12841 -1609 -8455 13389
5127 13389 54033 48010 40755 28396 -14855 -19645 -39636 -67397 -45773 -20076 -25797 -11738 -6190
5114 -6190 8446 -27268 -69989 -81075 -68501 -22896 113 16509 8208 20426 -21683 -89881
5102 -89881 -85232 -73255 -74845 -78038 -62742 -60201 -73067 -86791 -105508 -88027 -53743 -37688 -43880
5089 -43880 -64172 -45760 -13125 9225 -10835 -22063 -13585 -31540 -63497 -51519 -24226 -37124
5077c7124n010J5952P89l1364o0790N4540M4341J0573L0659r156j568J6065j1903
5064A6004L259k581l9913o0537j0318K9428O0661k453l3187n989n927J1501o982
5051d7034j469j889K1469K8418K3075q463l2523k0649L2268J5668k5209j5419
5039c1757L306K4058K9627k785J9390J5810j0911k4060m6111r230l4850L8748
5027b8765J9729m2928m442K4554K7571J9392j9161L5324n93m32K0647M230j3698
5014D1428k0979j7649k6901p256j8924n2153K1246L1857n224J6423K7779m0493
5002e0846l4701q375M4579Q793l0905n509L6560L5147K5145j1536k8645m99K4967
4989D175K9867O444o475L5475M846l807j2031l8114j8m4328l7493M2926L3217
$$ plain form
5077 -37124 -42134 -26182 -25393 -56757 -117547 -63007 -18666 -8093 22566 13410 11842 27907 16004
5064 16004 19263 16682 -23231 -83768 -94086 -64658 -3997 -6450 -39637 -45626 -51553 -40052 -47034
5051 -47034 -48503 -50392 -28923 -505 22570 14107 -18416 -39065 -6797 8871 -16338 -31757
5039 -31757 -28451 -4393 25234 22449 41839 57649 46738 22678 -23433 -32663 -67513 -28765
5027 -28765 -9036 -51964 -56406 -31852 -4281 15111 -4050 31274 30681 30249 50896 55126 41428
5014 41428 20449 2800 -24101 -31357 -50281 -102434 -81188 -49331 -54555 -38132 -10353 -50846
5002 -50846 -85547 -93922 -49343 -40550 -71455 -76964 -40404 -5257 19888 8352 -20293 -20792 4175
4989 4175 34042 40486 34011 69486 74332 70525 58494 20380 20362 -23966 -61459 -18533 14684
4976A4684J1647k647j5108j041j0206N329o219o919j1943j3998J2683K7943N81
4963D786r734m124N570Q229N988K2316k2722J8894K526j1240j2791k395L6132
4950D1435j5186k3679K91N340Q796r244j2730Q994l2643M963k5152m6476j2459
4937a07750M9386K5906l199N593J087L7625J780n003k9626r296j5729K0416J7220
4924a1590J1031m307j8287j8486j4587M876j459j2034K6585J0594o610J1039K3316
4911H1k291l0818j1566J3649L5494j1151n2316j7204J9532J9864N1986J2127m643
4898B2744Q127l5604r842L865j4163j9435M394q114k0035K0126P8928r295k7690
4885e994J8799K6583k4936j3284l893K1532J3922l1399K574J8712k731K2978q437
$$ plain form
4976 14684 26331 23684 8576 7535 -2671 2658 -3561 -10480 -22423 -36421 -23738 4205 4786
4963 4786 -4948 -9072 -3502 4727 10715 33031 10309 29203 31729 20489 7698 5303 41435
4950 41435 26249 2570 2861 8201 16997 7753 -4977 4017 -28626 -23663 -48815 -95291 -107750
4937 -107750 -58364 -32458 -35657 -30064 -28977 8648 10428 5425 -24201 -33497 -49226 -28810 -11590
4924 -11590 -559 -4866 -23153 -41639 -56226 -51350 -52809 -64843 -38258 -27664 -34274 -23235 81
4911 81 -2210 -33028 -44594 -30945 4549 -6602 -58918 -76122 -56590 -36726 15260 27387 22744
4898 22744 30871 -4733 -14575 -10710 -24873 -44308 -39914 -48028 -68063 -47937 30991 21696 -5994
4885 -5994 12805 39388 14452 1168 -2725 18807 32729 1330 3904 22616 19885 42863 34426
4872C4426l2416n394r182l0548l608J0080K7047K0672p26J2802k5912J1888k3663
4859a4534l8311k1088J5156K2514J1711K777j4167j3911M051J7557p198K5859
4847i584J5084j8028l9551N118J22K2504M1362j4010Q629j3988j0659P796K109
4834c096J3890o401M0074j077k6623m017J750j5174K8493O566p9999m0591M4533
4821d1672J370J369K9181k1310j4835L7600M3523p486l3432l170K6457j3465l3095
4808b8965j7751L9712j1478k5815K5753p63o021l3798j1910M52M8742L7824k6581
4795a0599K12q341j5251J7591L447j0453Q161j5955j3103M0625N6223J1919j0917
4782E3559q133r434l7564o20P589L712k2119K4876K3257l1588r422k3624l622
$$ plain form
4872 34426 2010 -3384 -12566 -43114 -46722 -36642 -9595 11077 10351 23153 -2759 9129 -14534
4859 -14534 -52845 -73933 -58777 -36263 -24552 -21775 -35942 -49853 -45802 -28245 -35443 -9584
4847 -9584 5500 -12528 -52079 -46961 -46839 -24335 17027 3017 11646 -2342 -13001 -5205 -3096
4834 -3096 10794 4393 44467 43390 16767 12750 14500 -674 27819 34385 -45614 -86205 -41672
4821 -41672 -40302 -38933 -9752 -31062 -45897 -8297 35226 27740 -5692 -8862 17595 4130 -28965
4808 -28965 -46716 -7004 -18482 -44297 -18544 -19307 -25328 -59126 -71036 -70584 -21842 15982 -10599
4795 -10599 -10387 -18728 -33979 -16388 -12941 -23394 -15233 -31188 -44291 -3666 52557 64476 53559
4782 53559 45426 35992 -1572 -2192 5397 9109 -13010 11866 35123 3535 -5887 -29511 -33133
4769c3133r860O8072K7575Q209k68m2020l3216O203j4248J8330M2501L3462m6091
4756B5516p4829k2869K0497J2169J6888j2075j9134M4731J5318j4365k0882J0712
4744a8323K3226J4321k7818o425J0105R533J0025K5909j4868l8166k0155K5621
4732g015J9715Q41n233k5340j1575J6565j1758k3016L457L2764P898k3926j5567
4719d2190L998Q824j5655J1241J2113M9804r923n6079L099P874K8885N096l4559
4706b7472K2047K1978P335O634n2404k0090j2030j1797R296K4892J7267l2410
4694d6754k4069N4963J0234j2397N569J0941j2306j9013Jj9350k8186m430J4192
$$ plain form
4769 -33133 -42993 25079 52654 60863 60595 18575 -14641 -8438 -22686 -4356 38145 71607 25516
4756 25516 -49313 -72182 -51685 -39516 -22628 -34703 -53837 -9106 6212 -8153 -29035 -18323
4744 -18323 4903 19224 -8594 -15019 -4914 4619 14644 40553 25685 -12481 -32636 -7015
4732 -7015 12700 13541 8308 -17032 -28607 -12042 -23800 -46816 -43359 -10595 -2697 -26623 -42190
4719 -42190 -38192 -29368 -45023 -33782 -21669 28135 18212 -37867 -34768 -26894 1991 7087 -27472
4706 -27472 -5425 16553 23888 30522 -21882 -41972 -54002 -65799 -56503 -31611 -14344 -46754
4694 -46754 -70823 -15860 -5626 -18023 -12454 -1513 -13819 -32832 -32831 -52181 -80367 -84797 -70605
$$ [...]
##END NTUPLES=NMR SPECTRUM
##END=
